EK111H116ru Toyota_Camry Black 1700 1450000
EK222H116ru Toyota_Prado White 1900 4245000
EK333H116ru Toyota_Tundra Gray 4700 3345000
EK444H116ru Toyota_Venza Red 9700 2225000
EK555H116ru Toyota_Venza Red 0 2225000
EK666H116ru Toyota_Awensis Yellow 0 710000
EK777H116ru Toyota_Corolla Yellow 0 800000
EK888H116ru Toyota_Corolla Yellow 0 800000
EK666H116ru Toyota_Auris Yellow 0 710000
EK999H116ru Toyota_200 Green 0 610000
EK987H116ru Toyota_Camry White 0 2450000
EK987H116ru Toyota_Camry Blue 0 3450000