<?xml version="1.0" encoding="UTF-8"?>
<svg width="30px" height="30px" viewBox="0 0 30 30" version="1.1" xmlns="http://www.w3.org/2000/svg"
     xmlns:xlink="http://www.w3.org/1999/xlink">
    <title>settings</title>
    <defs>
        <polygon id="path-1" points="0 0 30 0 30 29.9953125 0 29.9953125"></polygon>
    </defs>
    <g id="Page-1" stroke="none" stroke-width="1" fill="none" fill-rule="evenodd" opacity="0.5">
        <g id="1" transform="translate(-45.000000, -934.000000)">
            <g id="settings" transform="translate(45.000000, 934.000000)">
                <g id="Group-3">
                    <mask id="mask-2" fill="white">
                        <use xlink:href="#path-1"></use>
                    </mask>
                    <g id="Clip-2"></g>
                    <path d="M15.9414844,30 L14.0585156,30 C12.5357031,30 11.2967188,28.7610156 11.2967188,27.238125 L11.2967188,26.60125 C10.649375,26.394375 10.0204687,26.1334375 9.41617187,25.820625 L8.96484375,26.2719531 C7.87140625,27.3666406 6.12,27.3346094 5.05859375,26.2716406 L3.72773438,24.9410937 C2.66445313,23.87875 2.63398438,22.1279688 3.72835937,21.0348438 L4.179375,20.5838281 C3.8665625,19.9795312 3.605625,19.350625 3.39875,18.7029688 L2.761875,18.7029688 C1.23898438,18.7029688 0,17.4642969 0,15.9414844 L0,14.0585156 C0,12.5357031 1.23898438,11.2970313 2.761875,11.2970313 L3.39875,11.2970313 C3.605625,10.649375 3.8665625,10.0204687 4.179375,9.41617187 L3.72804688,8.96484375 C2.63429687,7.87234375 2.66445313,6.12148438 3.72835937,5.05859375 L5.05921875,3.72804687 C6.12304688,2.66234375 7.87414062,2.63578125 8.96515625,3.72835938 L9.41617187,4.179375 C10.0204687,3.8665625 10.649375,3.605625 11.2970313,3.39875 L11.2970313,2.761875 C11.2970313,1.23898437 12.5357031,0 14.0585156,0 L15.9414844,0 C17.4642969,0 18.7029688,1.23898437 18.7029688,2.761875 L18.7029688,3.39875 C19.350625,3.605625 19.9795312,3.8665625 20.5838281,4.179375 L21.0351562,3.72804687 C22.1285937,2.63335937 23.8796875,2.66539063 24.9414062,3.72835938 L26.2719531,5.05890625 C27.3355469,6.12125 27.3660156,7.87203125 26.2716406,8.96515625 L25.820625,9.41617187 C26.1334375,10.0204687 26.394375,10.649375 26.60125,11.2970313 L27.238125,11.2970313 C28.7610156,11.2970313 30,12.5357031 30,14.0585156 L30,15.9414844 C30,17.4642969 28.7610156,18.7029688 27.238125,18.7029688 L26.60125,18.7029688 C26.394375,19.350625 26.1334375,19.9795312 25.820625,20.5838281 L26.2719531,21.0351562 C27.3657031,22.1276563 27.3355469,23.87875 26.2716406,24.9414062 L24.9407813,26.2722656 C23.8769531,27.3376563 22.1258594,27.3642188 21.0348438,26.2716406 L20.5838281,25.8209375 C19.9795312,26.1334375 19.350625,26.3946875 18.7029688,26.6015625 L18.7029688,27.2384375 C18.7029688,28.7610156 17.4642969,30 15.9414844,30 Z M9.71007812,23.9749219 C10.5492969,24.4710938 11.4529688,24.8461719 12.3953125,25.0894531 C12.7835156,25.1898437 13.0548437,25.5398437 13.0548437,25.9405469 L13.0548437,27.238125 C13.0548437,27.7917188 13.5052344,28.2421875 14.0585156,28.2421875 L15.9414844,28.2421875 C16.4950781,28.2421875 16.9454688,27.7917188 16.9454688,27.238125 L16.9454688,25.9405469 C16.9454688,25.5398437 17.2164844,25.1898437 17.6046875,25.0894531 C18.5470313,24.8461719 19.4507031,24.4710938 20.2902344,23.9749219 C20.6353906,23.7704687 21.0751562,23.8260156 21.3589844,24.1097656 L22.278125,25.0289844 C22.6745313,25.4260156 23.3108594,25.416875 23.6975,25.0296094 L25.0292969,23.6978125 C25.415,23.3126562 25.4278906,22.6760937 25.0296094,22.2784375 L24.1100781,21.3589844 C23.8263281,21.0751562 23.7707813,20.6353906 23.9749219,20.2899219 C24.4714062,19.4507031 24.8464844,18.5470312 25.0896875,17.6046875 C25.1898437,17.2164844 25.5398438,16.9454687 25.9405469,16.9454687 L27.238125,16.9454687 C27.7917188,16.9454687 28.2421875,16.4950781 28.2421875,15.9414844 L28.2421875,14.0585156 C28.2421875,13.5052344 27.7917188,13.0548437 27.238125,13.0548437 L25.9405469,13.0548437 C25.5398438,13.0548437 25.1898437,12.7835156 25.0896875,12.395625 C24.8464844,11.4529687 24.4714062,10.5496094 23.9749219,9.71007812 C23.7707813,9.36460938 23.8263281,8.92484375 24.1100781,8.64132812 L25.0292969,7.721875 C25.4266406,7.32515625 25.41625,6.68882813 25.0296094,6.3025 L23.698125,4.97101563 C23.3121094,4.584375 22.6754688,4.57304687 22.27875,4.97070312 L21.3589844,5.89023437 C21.0754687,6.17398437 20.6353906,6.22953125 20.2902344,6.02539062 C19.4507031,5.52890625 18.5470313,5.15382813 17.6046875,4.91054688 C17.2164844,4.81046875 16.9454688,4.46046875 16.9454688,4.05945313 L16.9454688,2.761875 C16.9454688,2.20828125 16.4950781,1.7578125 15.9414844,1.7578125 L14.0588281,1.7578125 C13.5052344,1.7578125 13.0548437,2.20828125 13.0548437,2.761875 L13.0548437,4.05945313 C13.0548437,4.46015625 12.7835156,4.81015625 12.3953125,4.91054688 C11.4529688,5.15382813 10.5496094,5.52890625 9.71007812,6.02507812 C9.36460938,6.22921875 8.92484375,6.17367187 8.64101563,5.89023437 L7.721875,4.97101563 C7.32546875,4.57398437 6.68914062,4.583125 6.3025,4.97039062 L4.97101562,6.3021875 C4.58523438,6.68734375 4.57242187,7.32359375 4.97039063,7.7215625 L5.89023437,8.64101563 C6.17367188,8.92484375 6.22921875,9.36460938 6.02507812,9.71007812 C5.52890625,10.5492969 5.15382813,11.4529687 4.91054688,12.3953125 C4.81015625,12.7835156 4.46015625,13.0545312 4.05945313,13.0545312 L2.761875,13.0545312 C2.20828125,13.0548437 1.7578125,13.5049219 1.7578125,14.0585156 L1.7578125,15.9414844 C1.7578125,16.4950781 2.20828125,16.9451562 2.761875,16.9451562 L4.05945313,16.9451562 C4.46015625,16.9451562 4.81015625,17.2164844 4.91054688,17.6046875 C5.15382813,18.5470312 5.52890625,19.4507031 6.02507812,20.2899219 C6.22921875,20.6353906 6.17367188,21.0751562 5.89023437,21.3589844 L4.97070312,22.278125 C4.57335938,22.6751563 4.58375,23.3114844 4.97039063,23.6975 L6.301875,25.0289844 C6.68789063,25.415625 7.32453125,25.4269531 7.7215625,25.0292969 L8.64101563,24.1097656 C8.85007812,23.9007813 9.285,23.7234375 9.71007812,23.9749219 Z"
                          id="Fill-1" fill="#8F9BB3" mask="url(#mask-2)"></path>
                </g>
                <path d="M15,21.5274219 C11.4007813,21.5274219 8.47257813,18.5992188 8.47257813,15 C8.47257813,11.4007813 11.4007813,8.47257813 15,8.47257813 C18.5992187,8.47257813 21.5274219,11.4007813 21.5274219,15 C21.5274219,18.5992188 18.5992187,21.5274219 15,21.5274219 Z M15,10.2303906 C12.37,10.2303906 10.2303906,12.37 10.2303906,15 C10.2303906,17.63 12.37,19.7696094 15,19.7696094 C17.63,19.7696094 19.7696094,17.63 19.7696094,15 C19.7696094,12.37 17.63,10.2303906 15,10.2303906 Z"
                      id="Fill-4" fill="#8F9BB3"></path>
            </g>
        </g>
    </g>
</svg>
