<?xml version="1.0" encoding="UTF-8"?>
<svg width="30px" height="30px" viewBox="0 0 30 30" version="1.1" xmlns="http://www.w3.org/2000/svg"
     xmlns:xlink="http://www.w3.org/1999/xlink">
    <title>Clip 2</title>
    <defs>
        <polygon id="path-1" points="0.003515625 0 29.996902 0 29.996902 30 0.003515625 30"></polygon>
    </defs>
    <g id="Page-1" stroke="none" stroke-width="1" fill="none" fill-rule="evenodd">
        <g id="1" transform="translate(-46.000000, -574.000000)">
            <g id="Group" transform="translate(43.000000, 574.000000)">
                <g id="home-4" transform="translate(3.000000, 0.000000)">
                    <mask id="mask-2" fill="white">
                        <use xlink:href="#path-1"></use>
                    </mask>
                    <g id="Clip-2"></g>
                    <path d="M29.1911133,13.0485352 C29.1904688,13.0478906 29.1897656,13.0471875 29.1890625,13.0464844 L16.9514648,0.809296875 C16.4298047,0.287460938 15.7362891,0 14.9986523,0 C14.260957,0 13.5674414,0.287226562 13.0456055,0.809121094 L0.814335937,13.0400977 C0.810234375,13.0441992 0.806132813,13.0485352 0.80203125,13.0526953 C-0.269179688,14.13 -0.267304688,15.8779688 0.807246094,16.9525781 C1.29820313,17.4437695 1.94666016,17.7282422 2.63994141,17.7580078 C2.66806641,17.7607617 2.69648438,17.762168 2.72507813,17.762168 L3.2128125,17.762168 L3.2128125,26.7679687 C3.2128125,28.5500391 4.66277344,30 6.4453125,30 L11.2330664,30 C11.7182813,30 12.1119727,29.606543 12.1119727,29.1210938 L12.1119727,22.0605469 C12.1119727,21.2473242 12.7734375,20.5858594 13.5866602,20.5858594 L16.4105859,20.5858594 C17.2238086,20.5858594 17.8852734,21.2473242 17.8852734,22.0605469 L17.8852734,29.1210938 C17.8852734,29.606543 18.2787305,30 18.7641797,30 L23.5519336,30 C25.3344727,30 26.7844336,28.5500391 26.7844336,26.7679687 L26.7844336,17.762168 L27.2367188,17.762168 C27.9741797,17.762168 28.6676953,17.4748828 29.1897656,16.9530469 C30.2654883,15.8766211 30.265957,14.1256641 29.1911133,13.0485352 Z"
                          id="Fill-1" fill="#FFFFFF" mask="url(#mask-2)"></path>
                </g>
            </g>
        </g>
    </g>
</svg>
