<?xml version="1.0" encoding="iso-8859-1"?>
<!-- Generator: Adobe Illustrator 19.0.0, SVG Export Plug-In . SVG Version: 6.00 Build 0)  -->
<svg xmlns="http://www.w3.org/2000/svg" xmlns:xlink="http://www.w3.org/1999/xlink" version="1.1" id="Capa_1" x="0px" y="0px" viewBox="0 0 512 512" style="enable-background:new 0 0 512 512;" xml:space="preserve" width="512" height="512">
<g>
	<path d="M441,0H190.66c-5.52,0-10,4.48-10,10v38.09c-5.78-3.25-12.45-5.1-19.54-5.1c-22.08,0-40.04,17.98-40.04,40.07v73.61   c-5.9-3.43-12.74-5.39-20.04-5.39c-22.08,0-40.04,17.97-40.04,40.06v193.41c0,22.09,17.96,40.07,40.04,40.07h0.34V502   c0,5.52,4.48,10,10,10h220.3c5.52,0,10-4.48,10-10v-77.18h0.34c22.08,0,40.04-17.98,40.04-40.07v-3.99H441c5.52,0,10-4.47,10-10V10   C451,4.48,446.52,0,441,0z M321.68,492h-200.3v-27.1h200.3V492z M362.06,384.75c0,11.07-8.99,20.07-20.04,20.07h-10.34   c-5.52,0-10,4.47-10,10v30.08h-200.3v-30.08c0-5.53-4.47-10-10-10h-10.34c-11.05,0-20.04-9-20.04-20.07V191.34   c0-11.06,8.99-20.06,20.04-20.06c11.05,0,20.04,9,20.04,20.06v106.93c0,5.52,4.48,10,10,10s10-4.48,10-10V83.06   c0-11.07,8.99-20.07,20.04-20.07c9.53,0,17.52,6.69,19.54,15.63c0.33,1.42,0.5,2.91,0.5,4.44v287.61c0,5.52,4.48,10,10,10h120.82   c5.53,0,10-4.48,10-10v-83.15c0-11.06,8.99-20.06,20.04-20.06s20.04,9,20.04,20.06V384.75z M431,360.76h-48.94v-73.24   c0-22.09-17.96-40.06-40.04-40.06c-22.08,0-40.04,17.97-40.04,40.06v73.15H201.16V83.06c0-2.15-0.17-4.26-0.5-6.32V20H431V360.76z"/>
	<path d="M382.99,213.38c3.9,3.9,3.9,10.24-0.01,14.14c-1.95,1.95-4.51,2.93-7.07,2.93s-5.12-0.98-7.07-2.94l-53.01-53.05   l-53.01,53.05c-1.95,1.96-4.51,2.94-7.07,2.94s-5.12-0.98-7.07-2.93c-3.91-3.9-3.91-10.24,0-14.14l53.02-53.06l-53.02-53.06   c-3.91-3.91-3.91-10.24,0-14.14c3.91-3.91,10.24-3.9,14.14,0l53.01,53.05l53.01-53.05c3.9-3.9,10.23-3.91,14.14,0   c3.91,3.9,3.91,10.23,0.01,14.14l-53.02,53.06L382.99,213.38z"/>
	<path d="M131.115,347.871c-5.523,0-10.005-4.478-10.005-10s4.472-10,9.995-10h0.01c5.523,0,10,4.478,10,10   S136.638,347.871,131.115,347.871z"/>
</g>















</svg>
