FSUB,7fffffff,7f800000,ff800000,00000000,80000000,00800001,80800001
7fffffff,7fc00000,7fc00000,7fc00000,7fc00000,7fc00000,7fc00000,7fc00000
7f800000,7fc00000,7fc00000,ff800000,ff800000,ff800000,ff800000,ff800000
ff800000,7fc00000,7f800000,7fc00000,7f800000,7f800000,7f800000,7f800000
00000000,7fc00000,7f800000,ff800000,00000000,80000000,00800001,80800001
80000000,7fc00000,7f800000,ff800000,00000000,00000000,00800001,80800001
00800001,7fc00000,7f800000,ff800000,80800001,80800001,00000000,a4aa2c39
80800001,7fc00000,7f800000,ff800000,00800001,00800001,24aa2c39,00000000
