%!PS-Adobe-3.0 EPSF-3.0
%%Creator: cairo 1.14.2 (http://cairographics.org)
%%CreationDate: Tue Sep 15 12:53:31 2015
%%Pages: 1
%%DocumentData: Clean7Bit
%%LanguageLevel: 2
%%BoundingBox: 0 -1 145 48
%%EndComments
%%BeginProlog
save
50 dict begin
/q { gsave } bind def
/Q { grestore } bind def
/cm { 6 array astore concat } bind def
/w { setlinewidth } bind def
/J { setlinecap } bind def
/j { setlinejoin } bind def
/M { setmiterlimit } bind def
/d { setdash } bind def
/m { moveto } bind def
/l { lineto } bind def
/c { curveto } bind def
/h { closepath } bind def
/re { exch dup neg 3 1 roll 5 3 roll moveto 0 rlineto
      0 exch rlineto 0 rlineto closepath } bind def
/S { stroke } bind def
/f { fill } bind def
/f* { eofill } bind def
/n { newpath } bind def
/W { clip } bind def
/W* { eoclip } bind def
/BT { } bind def
/ET { } bind def
/pdfmark where { pop globaldict /?pdfmark /exec load put }
    { globaldict begin /?pdfmark /pop load def /pdfmark
    /cleartomark load def end } ifelse
/BDC { mark 3 1 roll /BDC pdfmark } bind def
/EMC { mark /EMC pdfmark } bind def
/cairo_store_point { /cairo_point_y exch def /cairo_point_x exch def } def
/Tj { show currentpoint cairo_store_point } bind def
/TJ {
  {
    dup
    type /stringtype eq
    { show } { -0.001 mul 0 cairo_font_matrix dtransform rmoveto } ifelse
  } forall
  currentpoint cairo_store_point
} bind def
/cairo_selectfont { cairo_font_matrix aload pop pop pop 0 0 6 array astore
    cairo_font exch selectfont cairo_point_x cairo_point_y moveto } bind def
/Tf { pop /cairo_font exch def /cairo_font_matrix where
      { pop cairo_selectfont } if } bind def
/Td { matrix translate cairo_font_matrix matrix concatmatrix dup
      /cairo_font_matrix exch def dup 4 get exch 5 get cairo_store_point
      /cairo_font where { pop cairo_selectfont } if } bind def
/Tm { 2 copy 8 2 roll 6 array astore /cairo_font_matrix exch def
      cairo_store_point /cairo_font where { pop cairo_selectfont } if } bind def
/g { setgray } bind def
/rg { setrgbcolor } bind def
/d1 { setcachedevice } bind def
%%EndProlog
%%BeginSetup
%%EndSetup
%%Page: 1 1
%%BeginPageSetup
%%PageBoundingBox: 0 -1 145 48
%%EndPageSetup
q 0 -1 145 49 rectclip q
0 g
0.8 w
1 J
0 j
[] 0.0 d
4 M q 1 0 0 -1 0 47.764862 cm
54 7.566 32 32 re S Q
0 J
q 1 0 0 -1 0 47.764862 cm
54 39.566 m 86 7.566 l S Q
66.121 24.632 m 66.184 24.484 66.219 24.37 66.23 24.288 c 66.238 24.214
 66.219 24.155 66.168 24.116 c 66.125 24.073 66.035 24.05 65.902 24.038 
c 65.777 24.03 65.605 24.023 65.387 24.023 c 65.145 24.023 64.965 24.03 
64.84 24.038 c 64.715 24.038 64.613 24.046 64.543 24.054 c 64.469 24.073
 64.418 24.101 64.387 24.132 c 64.363 24.163 64.344 24.202 64.324 24.257
 c 63.73 25.788 l 60.418 25.788 l 59.855 24.304 l 59.832 24.249 59.809 24.202
 59.777 24.163 c 59.746 24.12 59.699 24.089 59.637 24.07 c 59.574 24.05 
59.48 24.038 59.355 24.038 c 59.238 24.03 59.082 24.023 58.887 24.023 c 
58.676 24.023 58.512 24.03 58.387 24.038 c 58.27 24.05 58.188 24.073 58.137
 24.116 c 58.094 24.167 58.078 24.23 58.09 24.304 c 58.109 24.386 58.145
 24.499 58.199 24.648 c 60.934 31.366 l 60.953 31.429 60.98 31.48 61.012
 31.523 c 61.051 31.562 61.109 31.593 61.184 31.616 c 61.266 31.636 61.379
 31.652 61.527 31.663 c 61.672 31.671 61.859 31.679 62.09 31.679 c 62.359
 31.679 62.574 31.671 62.73 31.663 c 62.887 31.652 63.004 31.636 63.09 31.616
 c 63.184 31.593 63.25 31.562 63.293 31.523 c 63.332 31.48 63.363 31.421
 63.387 31.351 c h
62.074 30.195 m 62.059 30.195 l 60.809 26.96 l 63.324 26.96 l h
62.074 30.195 m f
81.336 20.433 m 81.336 19.671 81.227 19.019 81.008 18.48 c 80.797 17.948
 80.496 17.511 80.102 17.167 c 79.703 16.831 79.219 16.589 78.648 16.433
 c 78.086 16.277 77.414 16.198 76.633 16.198 c 74.523 16.198 l 74.367 16.198
 74.234 16.238 74.133 16.323 c 74.039 16.405 73.992 16.542 73.992 16.73 
c 73.992 23.886 l 73.992 24.073 74.039 24.206 74.133 24.292 c 74.234 24.374
 74.367 24.417 74.523 24.417 c 76.789 24.417 l 77.578 24.417 78.246 24.327
 78.789 24.152 c 79.34 23.984 79.805 23.73 80.18 23.386 c 80.555 23.05 80.84
 22.636 81.039 22.136 c 81.234 21.644 81.336 21.077 81.336 20.433 c h
79.477 20.37 m 79.477 20.753 79.422 21.113 79.32 21.448 c 79.227 21.78 
79.07 22.073 78.852 22.323 c 78.641 22.573 78.367 22.765 78.023 22.902 c
 77.68 23.034 77.234 23.105 76.695 23.105 c 75.773 23.105 l 75.773 17.527
 l 76.711 17.527 l 77.211 17.527 77.625 17.581 77.961 17.698 c 78.293 17.812
 78.574 17.988 78.805 18.23 c 79.031 18.468 79.199 18.765 79.305 19.12 c
 79.418 19.472 79.477 19.89 79.477 20.37 c h
79.477 20.37 m f
q 1 0 0 -1 0 47.764862 cm
54 23.566 m 38 23.566 l S Q
q 1 0 0 -1 0 47.764862 cm
86 15.566 m 106 15.566 l S Q
q 1 0 0 -1 0 47.764862 cm
85.602 31.566 m 105.602 31.566 l S Q
1 J
1 j
q 1 0 0 -1 0 47.764862 cm
2.383 23.715 m 3.891 19.488 l 4.477 17.652 l 5.43 15.711 l 6.086 14.402
 l 7.094 12.828 l 8.348 12.125 l 10.133 11.66 l S Q
q 1 0 0 -1 0 47.764862 cm
18.098 23.738 m 16.586 19.512 l 16.004 17.676 l 15.047 15.734 l 14.391 
14.426 l 13.387 12.848 l 12.129 12.148 l 10.344 11.684 l S Q
q 1 0 0 1 0 47.764862 cm
18.164 -23.961 m 19.676 -28.191 l 20.258 -30.027 l 21.215 -31.969 l 21.871
 -33.273 l 22.875 -34.852 l 24.129 -35.551 l 25.918 -36.02 l S Q
q 1 0 0 1 0 47.764862 cm
33.879 -23.938 m 32.367 -28.168 l 31.785 -30.004 l 30.828 -31.945 l 30.172
 -33.25 l 29.168 -34.828 l 27.914 -35.527 l 26.125 -35.996 l S Q
0 J
0 j
q 1 0 0 -1 0 47.764862 cm
4 11.566 m 16 11.566 l S Q
q 1 0 0 -1 0 47.764862 cm
20 36.363 m 32 36.363 l S Q
4.078 40.507 m 5.859 40.507 l 5.859 46.632 l 3.922 46.241 l 3.922 47.226
 l 5.844 47.616 l 6.938 47.616 l 6.938 40.507 l 8.703 40.507 l 8.703 39.601
 l 4.078 39.601 l h
4.078 40.507 m f
10.18 45.616 m 11.227 45.616 l 13.102 40.57 l 14.992 45.616 l 16.039 45.616
 l 13.773 39.601 l 12.43 39.601 l h
10.18 45.616 m f
15.312 3.452 2.906 -0.875 re f
20.188 0.905 m 21.969 0.905 l 21.969 7.03 l 20.031 6.64 l 20.031 7.624 
l 21.953 8.015 l 23.047 8.015 l 23.047 0.905 l 24.812 0.905 l 24.812 -0.001
 l 20.188 -0.001 l h
20.188 0.905 m f
29.102 -0.001 m 26.055 8.015 l 27.18 8.015 l 29.727 1.265 l 32.273 8.015
 l 33.398 8.015 l 30.336 -0.001 l h
29.102 -0.001 m f
q 1 0 0 -1 0 47.764862 cm
109.887 31.777 m 112.531 31.859 l 112.551 28.062 l 123.695 28.09 l 123.719
 31.738 l 128.934 31.75 l 128.934 27.957 l 139.531 27.957 l 139.559 31.836
 l 142.125 31.777 l S Q
[ 0.8 0.8] 0 d
q 1 0 0 -1 0 47.764862 cm
0 19.566 m 36 19.566 l S Q
[ 0.8 0.8] 0 d
q 1 0 0 -1 0 47.764862 cm
0 27.566 m 36 27.566 l S Q
[] 0.0 d
q 1 0 0 -1 0 47.764862 cm
109.98 15.555 m 110.801 15.566 128.398 15.613 128.879 15.652 c 128.93 11.508
 l 139.527 11.656 l 139.555 15.535 l 141.973 15.578 l S Q
111.648 45.312 m 111.293 45.312 111.027 45.081 110.852 44.624 c 110.672
 44.175 110.586 43.503 110.586 42.609 c 110.586 41.702 110.672 41.023 110.852
 40.577 c 111.027 40.128 111.293 39.905 111.648 39.905 c 112.012 39.905 
112.281 40.128 112.461 40.577 c 112.637 41.023 112.727 41.702 112.727 42.609
 c 112.727 43.503 112.637 44.175 112.461 44.624 c 112.281 45.081 112.012
 45.312 111.648 45.312 c h
111.648 46.015 m 112.219 46.015 112.656 45.722 112.961 45.14 c 113.262 
44.554 113.414 43.71 113.414 42.609 c 113.414 41.503 113.262 40.659 112.961
 40.077 c 112.656 39.491 112.219 39.202 111.648 39.202 c 111.086 39.202 
110.652 39.491 110.352 40.077 c 110.047 40.659 109.898 41.503 109.898 42.609
 c 109.898 43.71 110.047 44.554 110.352 45.14 c 110.652 45.722 111.086 46.015
 111.648 46.015 c h
111.648 46.015 m f
114.945 40.437 m 115.664 40.437 l 115.664 39.687 l 115.102 38.28 l 114.664
 38.28 l 114.945 39.687 l h
114.945 40.437 m f
117.336 40.077 m 118.461 40.077 l 118.461 45.077 l 117.227 44.765 l 117.227
 45.577 l 118.445 45.89 l 119.148 45.89 l 119.148 40.077 l 120.273 40.077
 l 120.273 39.327 l 117.336 39.327 l h
117.336 40.077 m f
121.977 40.437 m 122.695 40.437 l 122.695 39.687 l 122.133 38.28 l 121.695
 38.28 l 121.977 39.687 l h
121.977 40.437 m f
125.711 45.312 m 125.355 45.312 125.09 45.081 124.914 44.624 c 124.734 
44.175 124.648 43.503 124.648 42.609 c 124.648 41.702 124.734 41.023 124.914
 40.577 c 125.09 40.128 125.355 39.905 125.711 39.905 c 126.074 39.905 126.344
 40.128 126.523 40.577 c 126.699 41.023 126.789 41.702 126.789 42.609 c 
126.789 43.503 126.699 44.175 126.523 44.624 c 126.344 45.081 126.074 45.312
 125.711 45.312 c h
125.711 46.015 m 126.281 46.015 126.719 45.722 127.023 45.14 c 127.324 
44.554 127.477 43.71 127.477 42.609 c 127.477 41.503 127.324 40.659 127.023
 40.077 c 126.719 39.491 126.281 39.202 125.711 39.202 c 125.148 39.202 
124.715 39.491 124.414 40.077 c 124.109 40.659 123.961 41.503 123.961 42.609
 c 123.961 43.71 124.109 44.554 124.414 45.14 c 124.715 45.722 125.148 46.015
 125.711 46.015 c h
125.711 46.015 m f
129.008 40.437 m 129.727 40.437 l 129.727 39.687 l 129.164 38.28 l 128.727
 38.28 l 129.008 39.687 l h
129.008 40.437 m f
130.867 42.155 1.844 -0.719 re f
134.059 40.077 m 135.184 40.077 l 135.184 45.077 l 133.949 44.765 l 133.949
 45.577 l 135.168 45.89 l 135.871 45.89 l 135.871 40.077 l 136.996 40.077
 l 136.996 39.327 l 134.059 39.327 l h
134.059 40.077 m f
138.699 40.437 m 139.418 40.437 l 139.418 39.687 l 138.855 38.28 l 138.418
 38.28 l 138.699 39.687 l h
138.699 40.437 m f
142.434 45.312 m 142.078 45.312 141.812 45.081 141.637 44.624 c 141.457
 44.175 141.371 43.503 141.371 42.609 c 141.371 41.702 141.457 41.023 141.637
 40.577 c 141.812 40.128 142.078 39.905 142.434 39.905 c 142.797 39.905 
143.066 40.128 143.246 40.577 c 143.422 41.023 143.512 41.702 143.512 42.609
 c 143.512 43.503 143.422 44.175 143.246 44.624 c 143.066 45.081 142.797
 45.312 142.434 45.312 c h
142.434 46.015 m 143.004 46.015 143.441 45.722 143.746 45.14 c 144.047 
44.554 144.199 43.71 144.199 42.609 c 144.199 41.503 144.047 40.659 143.746
 40.077 c 143.441 39.491 143.004 39.202 142.434 39.202 c 141.871 39.202 
141.438 39.491 141.137 40.077 c 140.832 40.659 140.684 41.503 140.684 42.609
 c 140.684 43.71 140.832 44.554 141.137 45.14 c 141.438 45.722 141.871 46.015
 142.434 46.015 c h
142.434 46.015 m f
Q Q
showpage
%%Trailer
end restore
%%EOF
