{
  "project_info": {
    "project_number": "942281300691",
    "firebase_url": "https://simpedes-c44de.firebaseio.com",
    "project_id": "simpedes-c44de",
    "storage_bucket": "simpedes-c44de.appspot.com"
  },
  "client": [
    {
      "client_info": {
        "mobilesdk_app_id": "1:942281300691:android:c954e007ac1f2c10",
        "android_client_info": {
          "package_name": "com.userundie.simpedes"
        }
      },
      "oauth_client": [
        {
          "client_id": "942281300691-5r8c0cpgbq3e735enosbje4333ceigd0.apps.googleusercontent.com",
          "client_type": 1,
          "android_info": {
            "package_name": "com.userundie.simpedes",
            "certificate_hash": "1a991521497787b7e1293f7da4be11df0d381457"
          }
        },
        {
          "client_id": "942281300691-emcnj1erm8f3t2je5faqndivoc6jho52.apps.googleusercontent.com",
          "client_type": 1,
          "android_info": {
            "package_name": "com.userundie.simpedes",
            "certificate_hash": "391cfe5ba754cc6925c171097d4de3556fd22f0f"
          }
        },
        {
          "client_id": "942281300691-f5imu84sg4ar7i01qjenb20t2q1uj0m5.apps.googleusercontent.com",
          "client_type": 1,
          "android_info": {
            "package_name": "com.userundie.simpedes",
            "certificate_hash": "eff84cfc73d70560c589a69f013aeaedcda15d68"
          }
        },
        {
          "client_id": "942281300691-r97i4v2ocg4asknmtbtsl0s4nhc2hbpl.apps.googleusercontent.com",
          "client_type": 3
        }
      ],
      "api_key": [
        {
          "current_key": "AIzaSyCkGnw86YNkYj_QaNX0noMgLDXe457EpC8"
        }
      ],
      "services": {
        "appinvite_service": {
          "other_platform_oauth_client": [
            {
              "client_id": "942281300691-r97i4v2ocg4asknmtbtsl0s4nhc2hbpl.apps.googleusercontent.com",
              "client_type": 3
            }
          ]
        }
      }
    }
  ],
  "configuration_version": "1"
}