{
  "type": "service_account",
  "project_id": "um-covid19",
  "private_key_id": "8f95c2034a164fcf2d9f9240430107f847cb6a70",
  "private_key": "-----BEGIN PRIVATE KEY-----\nMIIEvAIBADANBgkqhkiG9w0BAQEFAASCBKYwggSiAgEAAoIBAQCaaVok3vIFNTaO\nk48PSV3RtijQ6QlUTwy4q0miu4mciPkjTeIw45cpfINBtUf4oSvzqBR3OfL4aTAu\nqYgLf+b6XGwmnZ1xHzhS/4hFMtM7B64WUT+RGU+TBSEtviC4AOxjzWCyo8BKW2kx\nojAYSJqmXD27XAeeywFiVuZ/OvgfAarcooE3otOsHg9lCyJPj+rnIPaHOkNwsKCN\nHKO9XIG4sfcehuEd6BMGmVpOdtIuwlHjte7SXGdis2gvSh6NfbJWz53YOtU8FKhT\nYf0f2EbO4ah6YSz6HtnCmirWZqawfGlc7Ger/58X1F+3DV7eWcL6RQujDDNhgbxn\norIAOW8jAgMBAAECggEAN73he176WpPvqn+tTNTs5/hM+sGtiwBwdLftALCXyGkQ\nG0UR6xk16BWZYp6ZKTGxpqeeH75NLoz2hlnQEWquTOIRbs1GWWBuWlQB8w0agPxQ\nRaE2A+Dxv37CD/vLXvGCZLLu/f4sPAuMyYyltRZ8saKp7FmYLKRXTxNU6Ug16ycE\nv2HIm+7gC4dVDPprtzWnzzcTBb5tj2BGkw3SmtQdBajyCzgmZixcfzANIiFVXyQM\njegZRzsWXvQ84GgzxtbOLQSuS41gS8Lo+tbx3P0UCtwuTUvbfsW7HQqFrkk8Vb1k\nYQ0Bo2g3G45avlvtYXZ4pcGEZnLSoBcEyQYkOpnHIQKBgQDQF7H2vRETTPkOtHYj\n0VVQpsfwRxRiGOUDVNt358FrGteZaQysnigAd2ij+9TZIeYtv28xz25N4RPH0eDQ\nn5YTiAwrePI2vXPwoQVmg2Wcrz3CGKSZW3IwMGC3QvGu1VJ011qs796b3Y90Cl+V\nU5LBGZg+vbrCAXW2GryZB6J2oQKBgQC99d7EpIxUnu2YQwokQXTKUWnES5zrkK5k\nv6pFNQfXvupxfLta1qR/6uUHeb/p3R7BnWljsF69yOc+oD0dybFPuLfM5SY40ozo\nZG1G5tGaviNzqsTO2Fy7SXsx+79BhfRPgfeb7I7sTRj4J2Cqf7cCAUlfjxz2RQ8K\nHTwWHgCDQwKBgHE5Y1i4mPDigeVxZZKplP00MjfXxQx3NSyx4FSGomQvj73mPcIy\nr9tJHYOUQ8T9P+wGbG8yyXbQj926odOB8bug29ZPkaMdRFdalcCooAI4C6dvlyfm\nbOQxfn5Yi34wjhQLFUhhn8M5M5PVDRsIBSLSVVdWDqb++lhihdnSIKDhAoGANyW0\nAH6MxtxEudlsjk36a+nqvLP+4FxmZJVIB0N3/WhNg5jkg2Cg7QnyZ5Mu5ePt0+Ow\n/uHq/0nd6E54r7coJK7JnVBBImntwmG1X8oOu8/LVv8Sl8I0WaLhgwdE5O7QmGxw\nx/GLJIrVXuV/qL/fD1P0SyuvCsfNr/AAy6L2HyUCgYBY4Jq2jg845fCIUrk/GWgz\nuuhXCMIpM+YjcctY8BB2UhFfY+EES/M9YuCHoMbaKvYmK0v6L0ZahQkfnxKOdYtl\nBHuoVpl+m6kV8Rc2RDCUmADyeMWjxmqqpRKv54doiwRLyNcVHsvTKVBVBHO460N2\n3CwhsO008cNzpAuEDw+nqA==\n-----END PRIVATE KEY-----\n",
  "client_email": "dialogflow-service-account@um-covid19.iam.gserviceaccount.com",
  "client_id": "107302565438408321916",
  "auth_uri": "https://accounts.google.com/o/oauth2/auth",
  "token_uri": "https://oauth2.googleapis.com/token",
  "auth_provider_x509_cert_url": "https://www.googleapis.com/oauth2/v1/certs",
  "client_x509_cert_url": "https://www.googleapis.com/robot/v1/metadata/x509/dialogflow-service-account%40um-covid19.iam.gserviceaccount.com"
}
