{
  "openapi": "3.0.0",
  "info": {
    "title": "reden.jetzt API",
    "description": "A simple backend",
    "version": "0.0.1",
    "contact": {}
  },
  "tags": [],
  "servers": [],
  "components": {
    "schemas": {
      "TopicDto": {
        "type": "object",
        "properties": {
          "id": {
            "type": "string"
          },
          "name": {
            "type": "string"
          },
          "peopleInQueue": {
            "type": "number"
          },
          "peopleInTotal": {
            "type": "number"
          },
          "tags": {
            "type": "array",
            "items": {
              "type": "string"
            }
          }
        },
        "required": [
          "id",
          "name",
          "peopleInQueue",
          "peopleInTotal",
          "tags"
        ]
      }
    }
  },
  "paths": {
    "/topics": {
      "get": {
        "operationId": "TopicsController_findAll",
        "parameters": [],
        "responses": {
          "200": {
            "description": "",
            "content": {
              "application/json": {
                "schema": {
                  "type": "array",
                  "items": {
                    "$ref": "#/components/schemas/TopicDto"
                  }
                }
              }
            }
          }
        }
      }
    }
  }
}
