<?xml version="1.0" encoding="utf-8"?>
<COLLADA xmlns="http://www.collada.org/2005/11/COLLADASchema" version="1.4.1">
<asset>
	<contributor>
		<author>Anonymous</author>
		<authoring_tool>Collada Exporter for Blender 2.6+, by Juan Linietsky (juan@codenix.com)</authoring_tool>
	</contributor>
	<created>2019-06-04T23:10:20Z</created>
	<modified>2019-06-04T23:10:20Z</modified>
	<unit meter="1.0" name="meter"/>
	<up_axis>Z_UP</up_axis>
</asset>
<library_effects>
	<effect id="id-fx-2" name="base-fx">
		<profile_COMMON>
			<technique sid="common">
				<blinn>
					<emission>
						<color>  0.0 0.0 0.0 1.0 </color>
					</emission>
					<ambient>
						<color>  0.0 0.0 0.0 1.0 </color>
					</ambient>
					<diffuse>
						<color>  0.43908115087570465 0.21190505343534127 0.03720381613379442 1.0 </color>
					</diffuse>
					<specular>
						<color>  0.5 0.5 0.5 1.0 </color>
					</specular>
					<shininess>
						<float>50</float>
					</shininess>
					<reflective>
						<color>  1.0 1.0 1.0 1.0 </color>
					</reflective>
					<index_of_refraction>
						<float>4.0</float>
					</index_of_refraction>
				</blinn>
				<extra>
					<technique profile="FCOLLADA">
					</technique>
					<technique profile="GOOGLEEARTH">
						<double_sided>0</double_sided>
					</technique>
				</extra>
			</technique>
		</profile_COMMON>
	</effect>
	<effect id="id-fx-6" name="alavanca-fx">
		<profile_COMMON>
			<technique sid="common">
				<blinn>
					<emission>
						<color>  0.0 0.0 0.0 1.0 </color>
					</emission>
					<ambient>
						<color>  0.0 0.0 0.0 1.0 </color>
					</ambient>
					<diffuse>
						<color>  0.11784657415519018 0.053103686170334896 0.024526083834857992 1.0 </color>
					</diffuse>
					<specular>
						<color>  0.5 0.5 0.5 1.0 </color>
					</specular>
					<shininess>
						<float>50</float>
					</shininess>
					<reflective>
						<color>  1.0 1.0 1.0 1.0 </color>
					</reflective>
					<index_of_refraction>
						<float>4.0</float>
					</index_of_refraction>
				</blinn>
				<extra>
					<technique profile="FCOLLADA">
					</technique>
					<technique profile="GOOGLEEARTH">
						<double_sided>0</double_sided>
					</technique>
				</extra>
			</technique>
		</profile_COMMON>
	</effect>
</library_effects>
<library_materials>
	<material id="id-material-3" name="base">
		<instance_effect url="#id-fx-2"/>
	</material>
	<material id="id-material-7" name="alavanca">
		<instance_effect url="#id-fx-6"/>
	</material>
</library_materials>
<library_geometries>
	<geometry id="id-mesh-4" name="Cube">
		<mesh>
			<source id="id-mesh-4-positions">
				<float_array id="id-mesh-4-positions-array" count="552"> 0.7706417441368103 -0.29626330733299255 -1.0 0.7706417441368103 -0.7890884280204773 -1.0 -0.7706418633460999 -0.7890883684158325 -1.0 -0.7706418633460999 -0.296263188123703 -1.0 0.770641565322876 -0.29626360535621643 1.0 -0.7706420421600342 -0.2962631583213806 1.0 -0.7706420421600342 -0.7890881896018982 1.0 0.7706412672996521 -0.7890889644622803 1.0 0.7706417441368103 0.2962632477283478 -1.0 0.7706417441368103 0.7890883684158325 -1.0 1.8371213674545288 0.7890883684158325 -1.0140109062194824 1.8371213674545288 0.2962632477283478 -1.0140109062194824 0.7706412672996521 -0.7890889644622803 1.0 -0.7706420421600342 -0.7890881896018982 1.0 -0.48392051458358765 -0.946487307548523 0.6279446482658386 0.4839200973510742 -0.9464882016181946 0.6279446482658386 -0.7706420421600342 -0.2962631583213806 1.0 -0.7706418633460999 9.168321923880285e-08 0.051492512226104736 -1.8371214866638184 9.168321923880285e-08 -0.48292800784111023 -1.837121844291687 -0.2962631583213806 -0.003860294818878174 0.7706417441368103 0.7890883684158325 -1.0 -0.7706415057182312 0.7890887260437012 -1.0 -0.483920156955719 0.9464879631996155 -0.6279446482658386 0.4839203953742981 0.946487545967102 -0.6279446482658386 0.7706417441368103 -0.7890884280204773 -1.0 0.7706417441368103 -0.29626330733299255 -1.0 1.8371213674545288 -0.29626330733299255 -1.0140109062194824 1.8371213674545288 -0.7890884280204773 -1.0140109062194824 -0.7706418633460999 -0.296263188123703 -1.0 -0.7706418633460999 -0.7890883684158325 -1.0 -1.8371214866638184 -0.7890883684158325 -1.0140109062194824 -1.8371214866638184 -0.296263188123703 -1.0140109062194824 0.7706419229507446 0.2962629795074463 1.0 -0.7706418633460999 0.2962633967399597 1.0 -0.7706418633460999 9.168321923880285e-08 0.051492512226104736 0.7706417441368103 -3.321248698284762e-07 0.051492512226104736 0.7706417441368103 0.2962632477283478 -1.0 0.7706417441368103 -4.9586130757006686e-08 -0.9957326650619507 -0.7706416845321655 1.623179031184918e-07 -0.9957326650619507 -0.7706416845321655 0.2962634861469269 -1.0 -0.7706417441368103 0.7890883684158325 1.0 -0.7706415057182312 0.7890887260437012 -1.0 -1.837120532989502 0.7890887260437012 -1.0140109062194824 -1.8371210098266602 0.7890883684158325 -0.003860294818878174 -0.7706418633460999 9.168321923880285e-08 0.051492512226104736 -0.7706418633460999 0.2962633967399597 1.0 -1.8371214866638184 0.2962633967399597 -0.003860294818878174 -1.8371214866638184 9.168321923880285e-08 -0.48292800784111023 0.7706417441368103 -3.321248698284762e-07 0.051492512226104736 -0.7706418633460999 9.168321923880285e-08 0.051492512226104736 -0.7706420421600342 -0.2962631583213806 1.0 0.770641565322876 -0.29626360535621643 1.0 0.7706417441368103 -4.9586130757006686e-08 -0.9957326650619507 0.7706417441368103 -0.29626330733299255 -1.0 -0.7706418633460999 -0.296263188123703 -1.0 -0.7706416845321655 1.623179031184918e-07 -0.9957326650619507 0.7706417441368103 0.7890883684158325 -1.0 0.7706417441368103 0.2962632477283478 -1.0 -0.7706416845321655 0.2962634861469269 -1.0 -0.7706415057182312 0.7890887260437012 -1.0 0.770642101764679 0.7890880107879639 1.0 -0.7706417441368103 0.7890883684158325 1.0 -0.7706418633460999 0.2962633967399597 1.0 0.7706419229507446 0.2962629795074463 1.0 0.7706419229507446 0.2962629795074463 1.0 0.7706417441368103 -3.321248698284762e-07 0.051492512226104736 1.8371213674545288 -3.321248698284762e-07 -0.48292800784111023 1.837121844291687 0.2962629795074463 -0.003860294818878174 0.7706417441368103 -3.321248698284762e-07 0.051492512226104736 0.770641565322876 -0.29626360535621643 1.0 1.8371208906173706 -0.29626360535621643 -0.003860294818878174 1.8371213674545288 -3.321248698284762e-07 -0.48292800784111023 1.8371213674545288 -0.29626330733299255 -1.0140109062194824 1.8371208906173706 -0.29626360535621643 -0.003860294818878174 1.8371201753616333 -0.7890889644622803 -0.003860294818878174 1.8371213674545288 -0.7890884280204773 -1.0140109062194824 -1.8371208906173706 0.2962634861469269 -1.0140109062194824 -1.8371214866638184 0.2962633967399597 -0.003860294818878174 -1.8371210098266602 0.7890883684158325 -0.003860294818878174 -1.837120532989502 0.7890887260437012 -1.0140109062194824 -1.8371214866638184 -0.296263188123703 -1.0140109062194824 -1.837121844291687 -0.2962631583213806 -0.003860294818878174 -1.8371214866638184 9.168321923880285e-08 -0.48292800784111023 -1.8371208906173706 1.623179031184918e-07 -1.0118556022644043 1.8371213674545288 0.2962632477283478 -1.0140109062194824 1.837121844291687 0.2962629795074463 -0.003860294818878174 1.8371213674545288 -3.321248698284762e-07 -0.48292800784111023 1.8371213674545288 -4.9586130757006686e-08 -1.0118556022644043 -1.8371214866638184 -0.7890883684158325 -1.0140109062194824 -1.837121844291687 -0.7890881896018982 -0.003860294818878174 -1.837121844291687 -0.2962631583213806 -0.003860294818878174 -1.8371214866638184 -0.296263188123703 -1.0140109062194824 1.8371213674545288 -4.9586130757006686e-08 -1.0118556022644043 1.8371213674545288 -3.321248698284762e-07 -0.48292800784111023 1.8371208906173706 -0.29626360535621643 -0.003860294818878174 1.8371213674545288 -0.29626330733299255 -1.0140109062194824 1.8371213674545288 0.7890883684158325 -1.0140109062194824 1.8371222019195557 0.7890880107879639 -0.003860294818878174 1.837121844291687 0.2962629795074463 -0.003860294818878174 1.8371213674545288 0.2962632477283478 -1.0140109062194824 -1.8371208906173706 1.623179031184918e-07 -1.0118556022644043 -1.8371214866638184 9.168321923880285e-08 -0.48292800784111023 -1.8371214866638184 0.2962633967399597 -0.003860294818878174 -1.8371208906173706 0.2962634861469269 -1.0140109062194824 0.770641565322876 -0.29626360535621643 1.0 0.7706412672996521 -0.7890889644622803 1.0 1.8371201753616333 -0.7890889644622803 -0.003860294818878174 1.8371208906173706 -0.29626360535621643 -0.003860294818878174 -0.7706420421600342 -0.7890881896018982 1.0 -0.7706420421600342 -0.2962631583213806 1.0 -1.837121844291687 -0.2962631583213806 -0.003860294818878174 -1.837121844291687 -0.7890881896018982 -0.003860294818878174 0.770642101764679 0.7890880107879639 1.0 0.7706419229507446 0.2962629795074463 1.0 1.837121844291687 0.2962629795074463 -0.003860294818878174 1.8371222019195557 0.7890880107879639 -0.003860294818878174 0.7706417441368103 0.7890883684158325 -1.0 0.770642101764679 0.7890880107879639 1.0 1.8371222019195557 0.7890880107879639 -0.003860294818878174 1.8371213674545288 0.7890883684158325 -1.0140109062194824 -0.7706418633460999 0.2962633967399597 1.0 -0.7706417441368103 0.7890883684158325 1.0 -1.8371210098266602 0.7890883684158325 -0.003860294818878174 -1.8371214866638184 0.2962633967399597 -0.003860294818878174 0.7706412672996521 -0.7890889644622803 1.0 0.7706417441368103 -0.7890884280204773 -1.0 1.8371213674545288 -0.7890884280204773 -1.0140109062194824 1.8371201753616333 -0.7890889644622803 -0.003860294818878174 0.7706417441368103 -4.9586130757006686e-08 -0.9957326650619507 0.7706417441368103 0.2962632477283478 -1.0 1.8371213674545288 0.2962632477283478 -1.0140109062194824 1.8371213674545288 -4.9586130757006686e-08 -1.0118556022644043 -0.7706415057182312 0.7890887260437012 -1.0 -0.7706416845321655 0.2962634861469269 -1.0 -1.8371208906173706 0.2962634861469269 -1.0140109062194824 -1.837120532989502 0.7890887260437012 -1.0140109062194824 0.7706417441368103 -0.29626330733299255 -1.0 0.7706417441368103 -4.9586130757006686e-08 -0.9957326650619507 1.8371213674545288 -4.9586130757006686e-08 -1.0118556022644043 1.8371213674545288 -0.29626330733299255 -1.0140109062194824 -0.7706416845321655 1.623179031184918e-07 -0.9957326650619507 -0.7706418633460999 -0.296263188123703 -1.0 -1.8371214866638184 -0.296263188123703 -1.0140109062194824 -1.8371208906173706 1.623179031184918e-07 -1.0118556022644043 -0.7706416845321655 0.2962634861469269 -1.0 -0.7706416845321655 1.623179031184918e-07 -0.9957326650619507 -1.8371208906173706 1.623179031184918e-07 -1.0118556022644043 -1.8371208906173706 0.2962634861469269 -1.0140109062194824 -0.7706418633460999 -0.7890883684158325 -1.0 -0.7706420421600342 -0.7890881896018982 1.0 -1.837121844291687 -0.7890881896018982 -0.003860294818878174 -1.8371214866638184 -0.7890883684158325 -1.0140109062194824 0.4839203953742981 -0.9464876055717468 -0.6279446482658386 0.4839200973510742 -0.9464882016181946 0.6279446482658386 -0.48392051458358765 -0.946487307548523 0.6279446482658386 -0.4839203953742981 -0.946487545967102 -0.6279446482658386 0.4839206337928772 0.9464871287345886 0.6279446482658386 0.4839203953742981 0.946487545967102 -0.6279446482658386 -0.483920156955719 0.9464879631996155 -0.6279446482658386 -0.4839203357696533 0.946487545967102 0.6279446482658386 -0.7706420421600342 -0.7890881896018982 1.0 -0.7706418633460999 -0.7890883684158325 -1.0 -0.4839203953742981 -0.946487545967102 -0.6279446482658386 -0.48392051458358765 -0.946487307548523 0.6279446482658386 0.7706417441368103 -0.7890884280204773 -1.0 0.7706412672996521 -0.7890889644622803 1.0 0.4839200973510742 -0.9464882016181946 0.6279446482658386 0.4839203953742981 -0.9464876055717468 -0.6279446482658386 0.770642101764679 0.7890880107879639 1.0 0.7706417441368103 0.7890883684158325 -1.0 0.4839203953742981 0.946487545967102 -0.6279446482658386 0.4839206337928772 0.9464871287345886 0.6279446482658386 -0.7706417441368103 0.7890883684158325 1.0 0.770642101764679 0.7890880107879639 1.0 0.4839206337928772 0.9464871287345886 0.6279446482658386 -0.4839203357696533 0.946487545967102 0.6279446482658386 -0.7706415057182312 0.7890887260437012 -1.0 -0.7706417441368103 0.7890883684158325 1.0 -0.4839203357696533 0.946487545967102 0.6279446482658386 -0.483920156955719 0.9464879631996155 -0.6279446482658386 -0.7706418633460999 -0.7890883684158325 -1.0 0.7706417441368103 -0.7890884280204773 -1.0 0.4839203953742981 -0.9464876055717468 -0.6279446482658386 -0.4839203953742981 -0.946487545967102 -0.6279446482658386</float_array>
				<technique_common>
				<accessor source="#id-mesh-4-positions-array" count="184" stride="3">
					<param name="X" type="float"/>
					<param name="Y" type="float"/>
					<param name="Z" type="float"/>
				</accessor>
				</technique_common>
			</source>
			<source id="id-mesh-4-normals">
				<float_array id="id-mesh-4-normals-array" count="552"> 0.0 0.0 -1.0 0.0 0.0 -1.0 0.0 0.0 -1.0 0.0 0.0 -1.0 0.0 0.0 1.0 0.0 0.0 1.0 0.0 0.0 1.0 0.0 0.0 1.0 -0.01313640084117651 0.0 -0.99991375207901 -0.01313640084117651 0.0 -0.99991375207901 -0.01313640084117651 0.0 -0.99991375207901 -0.01313640084117651 0.0 -0.99991375207901 -6.269360142141522e-07 -0.9209752082824707 0.38962116837501526 -6.269360142141522e-07 -0.9209752082824707 0.38962116837501526 -6.269360142141522e-07 -0.9209752082824707 0.38962116837501526 -6.269360142141522e-07 -0.9209752082824707 0.38962116837501526 -0.26647308468818665 0.8902082443237305 0.36948803067207336 -0.26647308468818665 0.8902082443237305 0.36948803067207336 -0.26647308468818665 0.8902082443237305 0.36948803067207336 -0.26647308468818665 0.8902082443237305 0.36948803067207336 3.062907580897445e-07 0.9209750890731812 -0.3896215260028839 3.062907580897445e-07 0.9209750890731812 -0.3896215260028839 3.062907580897445e-07 0.9209750890731812 -0.3896215260028839 3.062907580897445e-07 0.9209750890731812 -0.3896215260028839 -0.01313640084117651 0.0 -0.99991375207901 -0.01313640084117651 0.0 -0.99991375207901 -0.01313640084117651 0.0 -0.99991375207901 -0.01313640084117651 0.0 -0.99991375207901 0.01313639897853136 0.0 -0.9999136924743652 0.01313639897853136 0.0 -0.9999136924743652 0.01313639897853136 0.0 -0.9999136924743652 0.01313639897853136 0.0 -0.9999136924743652 -2.581722640115913e-07 -0.9545215964317322 0.29814180731773376 -2.581722640115913e-07 -0.9545215964317322 0.29814180731773376 -2.581722640115913e-07 -0.9545215964317322 0.29814180731773376 -2.581722640115913e-07 -0.9545215964317322 0.29814180731773376 0.0 -0.014402366243302822 -0.9998963475227356 0.0 -0.014402366243302822 -0.9998963475227356 0.0 -0.014402366243302822 -0.9998963475227356 0.0 -0.014402366243302822 -0.9998963475227356 -1.1339228933593404e-07 1.0 2.3441488394837506e-07 -1.1339228933593404e-07 1.0 2.3441488394837506e-07 -1.1339228933593404e-07 1.0 2.3441488394837506e-07 -1.1339228933593404e-07 1.0 2.3441488394837506e-07 -0.2664732038974762 -0.8902081251144409 0.3694881200790405 -0.2664732038974762 -0.8902081251144409 0.3694881200790405 -0.2664732038974762 -0.8902081251144409 0.3694881200790405 -0.2664732038974762 -0.8902081251144409 0.3694881200790405 2.7242100486546406e-07 0.9545215964317322 0.298141747713089 2.7242100486546406e-07 0.9545215964317322 0.298141747713089 2.7242100486546406e-07 0.9545215964317322 0.298141747713089 2.7242100486546406e-07 0.9545215964317322 0.298141747713089 0.0 0.014402364380657673 -0.999896228313446 0.0 0.014402364380657673 -0.999896228313446 0.0 0.014402364380657673 -0.999896228313446 0.0 0.014402364380657673 -0.999896228313446 0.0 0.0 -1.0 0.0 0.0 -1.0 0.0 0.0 -1.0 0.0 0.0 -1.0 0.0 0.0 1.0 0.0 0.0 1.0 0.0 0.0 1.0 0.0 0.0 1.0 0.26647308468818665 -0.8902081847190857 0.36948803067207336 0.26647308468818665 -0.8902081847190857 0.36948803067207336 0.26647308468818665 -0.8902081847190857 0.36948803067207336 0.26647308468818665 -0.8902081847190857 0.36948803067207336 0.26647329330444336 0.8902081251144409 0.3694881796836853 0.26647329330444336 0.8902081251144409 0.3694881796836853 0.26647329330444336 0.8902081251144409 0.3694881796836853 0.26647329330444336 0.8902081251144409 0.3694881796836853 1.0 -7.18376782060659e-07 8.260795993919601e-07 1.0 -7.18376782060659e-07 8.260795993919601e-07 1.0 -7.18376782060659e-07 8.260795993919601e-07 1.0 -7.18376782060659e-07 8.260795993919601e-07 -1.0 9.578359367878875e-07 -5.310511141942698e-07 -1.0 9.578359367878875e-07 -5.310511141942698e-07 -1.0 9.578359367878875e-07 -5.310511141942698e-07 -1.0 9.578359367878875e-07 -5.310511141942698e-07 -1.0 2.0915181266900618e-06 -6.196399340296921e-07 -1.0 2.0915181266900618e-06 -6.196399340296921e-07 -1.0 2.0915181266900618e-06 -6.196399340296921e-07 -1.0 2.0915181266900618e-06 -6.196399340296921e-07 1.0 -1.3071980902168434e-06 -3.098201091233932e-07 1.0 -1.3071980902168434e-06 -3.098201091233932e-07 1.0 -1.3071980902168434e-06 -3.098201091233932e-07 1.0 -1.3071980902168434e-06 -3.098201091233932e-07 -1.0 0.0 -3.5403419929025404e-07 -1.0 0.0 -3.5403419929025404e-07 -1.0 0.0 -3.5403419929025404e-07 -1.0 0.0 -3.5403419929025404e-07 1.0 0.0 3.0981976806288003e-07 1.0 0.0 3.0981976806288003e-07 1.0 0.0 3.0981976806288003e-07 1.0 0.0 3.0981976806288003e-07 1.0 -2.394590126186813e-07 -6.490628265964915e-07 1.0 -2.394590126186813e-07 -6.490628265964915e-07 1.0 -2.394590126186813e-07 -6.490628265964915e-07 1.0 -2.394590126186813e-07 -6.490628265964915e-07 -0.9999999403953552 -5.228792474554211e-07 -7.745497327960038e-07 -0.9999999403953552 -5.228792474554211e-07 -7.745497327960038e-07 -0.9999999403953552 -5.228792474554211e-07 -7.745497327960038e-07 -0.9999999403953552 -5.228792474554211e-07 -7.745497327960038e-07 0.6854063868522644 -6.606202873626899e-07 0.7281607985496521 0.6854063868522644 -6.606202873626899e-07 0.7281607985496521 0.6854063868522644 -6.606202873626899e-07 0.7281607985496521 0.6854063868522644 -6.606202873626899e-07 0.7281607985496521 -0.6854062080383301 0.0 0.7281609177589417 -0.6854062080383301 0.0 0.7281609177589417 -0.6854062080383301 0.0 0.7281609177589417 -0.6854062080383301 0.0 0.7281609177589417 0.6854060888290405 -3.303102289464732e-07 0.7281610369682312 0.6854060888290405 -3.303102289464732e-07 0.7281610369682312 0.6854060888290405 -3.303102289464732e-07 0.7281610369682312 0.6854060888290405 -3.303102289464732e-07 0.7281610369682312 1.133922111762331e-07 1.0 2.24556686134747e-07 1.133922111762331e-07 1.0 2.24556686134747e-07 1.133922111762331e-07 1.0 2.24556686134747e-07 1.133922111762331e-07 1.0 2.24556686134747e-07 -0.6854063868522644 3.303103994767298e-07 0.7281608581542969 -0.6854063868522644 3.303103994767298e-07 0.7281608581542969 -0.6854063868522644 3.303103994767298e-07 0.7281608581542969 -0.6854063868522644 3.303103994767298e-07 0.7281608581542969 -1.7008846953103784e-07 -1.0 -3.6323461927167955e-07 -1.7008846953103784e-07 -1.0 -3.6323461927167955e-07 -1.7008846953103784e-07 -1.0 -3.6323461927167955e-07 -1.7008846953103784e-07 -1.0 -3.6323461927167955e-07 -0.014125525951385498 -0.010837695561349392 -0.9998414516448975 -0.014125525951385498 -0.010837695561349392 -0.9998414516448975 -0.014125525951385498 -0.010837695561349392 -0.9998414516448975 -0.014125525951385498 -0.010837695561349392 -0.9998414516448975 0.013136406429111958 -7.087244568992901e-09 -0.9999136924743652 0.013136406429111958 -7.087244568992901e-09 -0.9999136924743652 0.013136406429111958 -7.087244568992901e-09 -0.9999136924743652 0.013136406429111958 -7.087244568992901e-09 -0.9999136924743652 -0.014125528745353222 0.010837698355317116 -0.9998415112495422 -0.014125528745353222 0.010837698355317116 -0.9998415112495422 -0.014125528745353222 0.010837698355317116 -0.9998415112495422 -0.014125528745353222 0.010837698355317116 -0.9998415112495422 0.014125525951385498 0.010837670415639877 -0.9998414516448975 0.014125525951385498 0.010837670415639877 -0.9998414516448975 0.014125525951385498 0.010837670415639877 -0.9998414516448975 0.014125525951385498 0.010837670415639877 -0.9998414516448975 0.014125530607998371 -0.010837689973413944 -0.9998414516448975 0.014125530607998371 -0.010837689973413944 -0.9998414516448975 0.014125530607998371 -0.010837689973413944 -0.9998414516448975 0.014125530607998371 -0.010837689973413944 -0.9998414516448975 -5.669610914083023e-08 -0.9999999403953552 1.758109959837384e-07 -5.669610914083023e-08 -0.9999999403953552 1.758109959837384e-07 -5.669610914083023e-08 -0.9999999403953552 1.758109959837384e-07 -5.669610914083023e-08 -0.9999999403953552 1.758109959837384e-07 -4.926814654027112e-07 -1.0 -2.0139664513862954e-07 -4.926814654027112e-07 -1.0 -2.0139664513862954e-07 -4.926814654027112e-07 -1.0 -2.0139664513862954e-07 -4.926814654027112e-07 -1.0 -2.0139664513862954e-07 4.310962822273723e-07 1.0 3.8442462368948327e-07 4.310962822273723e-07 1.0 3.8442462368948327e-07 4.310962822273723e-07 1.0 3.8442462368948327e-07 4.310962822273723e-07 1.0 3.8442462368948327e-07 -0.48121997714042664 -0.876599907875061 6.794984130920056e-08 -0.48121997714042664 -0.876599907875061 6.794984130920056e-08 -0.48121997714042664 -0.876599907875061 6.794984130920056e-08 -0.48121997714042664 -0.876599907875061 6.794984130920056e-08 0.4812203645706177 -0.8765996098518372 -1.6987438300475333e-07 0.4812203645706177 -0.8765996098518372 -1.6987438300475333e-07 0.4812203645706177 -0.8765996098518372 -1.6987438300475333e-07 0.4812203645706177 -0.8765996098518372 -1.6987438300475333e-07 0.48121997714042664 0.8765997886657715 1.0791496407591694e-07 0.48121997714042664 0.8765997886657715 1.0791496407591694e-07 0.48121997714042664 0.8765997886657715 1.0791496407591694e-07 0.48121997714042664 0.8765997886657715 1.0791496407591694e-07 2.7688926707014616e-07 0.9209752082824707 0.38962119817733765 2.7688926707014616e-07 0.9209752082824707 0.38962119817733765 2.7688926707014616e-07 0.9209752082824707 0.38962119817733765 2.7688926707014616e-07 0.9209752082824707 0.38962119817733765 -0.48122021555900574 0.8765997886657715 1.2990942366286617e-07 -0.48122021555900574 0.8765997886657715 1.2990942366286617e-07 -0.48122021555900574 0.8765997886657715 1.2990942366286617e-07 -0.48122021555900574 0.8765997886657715 1.2990942366286617e-07 -4.375581497129133e-08 -0.9209750890731812 -0.38962143659591675 -4.375581497129133e-08 -0.9209750890731812 -0.38962143659591675 -4.375581497129133e-08 -0.9209750890731812 -0.38962143659591675 -4.375581497129133e-08 -0.9209750890731812 -0.38962143659591675</float_array>
				<technique_common>
				<accessor source="#id-mesh-4-normals-array" count="184" stride="3">
					<param name="X" type="float"/>
					<param name="Y" type="float"/>
					<param name="Z" type="float"/>
				</accessor>
				</technique_common>
			</source>
			<vertices id="id-mesh-4-vertices">
				<input semantic="POSITION" source="#id-mesh-4-positions"/>
			</vertices>
			<polygons count="46" material="id-trimat-5">
				<input semantic="VERTEX" source="#id-mesh-4-vertices" offset="0"/>
				<input semantic="NORMAL" source="#id-mesh-4-normals" offset="0"/>
				<p> 0 1 2 3 </p>
				<p> 4 5 6 7 </p>
				<p> 8 9 10 11 </p>
				<p> 12 13 14 15 </p>
				<p> 16 17 18 19 </p>
				<p> 20 21 22 23 </p>
				<p> 24 25 26 27 </p>
				<p> 28 29 30 31 </p>
				<p> 32 33 34 35 </p>
				<p> 36 37 38 39 </p>
				<p> 40 41 42 43 </p>
				<p> 44 45 46 47 </p>
				<p> 48 49 50 51 </p>
				<p> 52 53 54 55 </p>
				<p> 56 57 58 59 </p>
				<p> 60 61 62 63 </p>
				<p> 64 65 66 67 </p>
				<p> 68 69 70 71 </p>
				<p> 72 73 74 75 </p>
				<p> 76 77 78 79 </p>
				<p> 80 81 82 83 </p>
				<p> 84 85 86 87 </p>
				<p> 88 89 90 91 </p>
				<p> 92 93 94 95 </p>
				<p> 96 97 98 99 </p>
				<p> 100 101 102 103 </p>
				<p> 104 105 106 107 </p>
				<p> 108 109 110 111 </p>
				<p> 112 113 114 115 </p>
				<p> 116 117 118 119 </p>
				<p> 120 121 122 123 </p>
				<p> 124 125 126 127 </p>
				<p> 128 129 130 131 </p>
				<p> 132 133 134 135 </p>
				<p> 136 137 138 139 </p>
				<p> 140 141 142 143 </p>
				<p> 144 145 146 147 </p>
				<p> 148 149 150 151 </p>
				<p> 152 153 154 155 </p>
				<p> 156 157 158 159 </p>
				<p> 160 161 162 163 </p>
				<p> 164 165 166 167 </p>
				<p> 168 169 170 171 </p>
				<p> 172 173 174 175 </p>
				<p> 176 177 178 179 </p>
				<p> 180 181 182 183 </p>
			</polygons>
		</mesh>
	</geometry>
	<geometry id="id-mesh-8" name="Cylinder">
		<mesh>
			<source id="id-mesh-8-positions">
				<float_array id="id-mesh-8-positions-array" count="432"> 0.0 0.0 -5.960464477539063e-08 0.0 0.0 1.5613718032836914 0.7071065902709961 -0.2928932309150696 1.5613718032836914 0.7071065902709961 -0.2928932309150696 -5.960464477539063e-08 0.7071065902709961 -0.2928932309150696 -5.960464477539063e-08 0.7071065902709961 -0.2928932309150696 1.5613718032836914 0.9999998807907104 -1.0 1.5613718032836914 0.9999998807907104 -1.0 -5.960464477539063e-08 0.9999998807907104 -1.0 -5.960464477539063e-08 0.9999998807907104 -1.0 1.5613718032836914 0.7071065902709961 -1.707106590270996 1.5613718032836914 0.7071065902709961 -1.707106590270996 -5.960464477539063e-08 0.7071065902709961 -1.707106590270996 -5.960464477539063e-08 0.7071065902709961 -1.707106590270996 1.5613718032836914 -8.940696716308594e-08 -1.9999998807907104 1.5613718032836914 -8.940696716308594e-08 -1.9999998807907104 -5.960464477539063e-08 -8.940696716308594e-08 -1.9999998807907104 -5.960464477539063e-08 -8.940696716308594e-08 -1.9999998807907104 1.5613718032836914 -0.7071068286895752 -1.707106590270996 1.5613718032836914 -0.7071068286895752 -1.707106590270996 -5.960464477539063e-08 -0.7071068286895752 -1.707106590270996 -5.960464477539063e-08 -0.7071068286895752 -1.707106590270996 1.5613718032836914 -1.0 -0.9999999403953552 1.5613718032836914 -1.0 -0.9999999403953552 -5.960464477539063e-08 -0.7071068286895752 -0.29289335012435913 1.5613718032836914 -1.0 -0.9999999403953552 1.5613718032836914 -1.6995306015014648 -0.9999999403953552 1.5990138053894043 -1.201749563217163 0.20174938440322876 1.5990138053894043 -1.0 -0.9999999403953552 -5.960464477539063e-08 -1.0 -0.9999999403953552 1.5613718032836914 -0.7071068286895752 -0.29289335012435913 1.5613718032836914 -0.7071068286895752 -0.29289335012435913 -5.960464477539063e-08 -0.7071068286895752 -0.29289335012435913 -5.960464477539063e-08 -0.7071068286895752 -0.29289335012435913 1.5613718032836914 0.0 0.0 1.5613718032836914 0.0 0.0 -5.960464477539063e-08 0.0 0.0 -5.960464477539063e-08 0.7071065902709961 -0.2928932309150696 -5.960464477539063e-08 0.9999998807907104 -1.0 -5.960464477539063e-08 0.7071065902709961 -1.707106590270996 -5.960464477539063e-08 -8.940696716308594e-08 -1.9999998807907104 -5.960464477539063e-08 -0.7071068286895752 -1.707106590270996 -5.960464477539063e-08 -1.0 -0.9999999403953552 -5.960464477539063e-08 -0.7071068286895752 -0.29289335012435913 -5.960464477539063e-08 2.9802322387695312e-08 0.6995305418968201 1.5990138053894043 -1.201749563217163 0.20174938440322876 1.5990138053894043 -1.201749563217163 0.20174938440322876 2.0969440937042236 2.9802322387695312e-08 0.6995305418968201 2.0969440937042236 0.9999998807907104 -1.0 1.5613718032836914 0.7071065902709961 -0.2928932309150696 1.5613718032836914 1.201749324798584 0.2017495036125183 1.5990138053894043 1.6995302438735962 -1.0 1.5990138053894043 -0.7071068286895752 -1.707106590270996 1.5613718032836914 -8.940696716308594e-08 -1.9999998807907104 1.5613718032836914 -1.1920928955078125e-07 -2.6995303630828857 1.5990138053894043 -1.201749563217163 -2.201749324798584 1.5990138053894043 0.0 0.0 1.5613718032836914 -0.7071068286895752 -0.29289335012435913 1.5613718032836914 -1.201749563217163 0.20174938440322876 1.5990138053894043 2.9802322387695312e-08 0.6995305418968201 1.5990138053894043 0.7071065902709961 -0.2928932309150696 1.5613718032836914 0.0 0.0 1.5613718032836914 2.9802322387695312e-08 0.6995305418968201 1.5990138053894043 1.201749324798584 0.2017495036125183 1.5990138053894043 0.7071065902709961 -1.707106590270996 1.5613718032836914 0.9999998807907104 -1.0 1.5613718032836914 1.6995302438735962 -1.0 1.5990138053894043 1.201749324798584 -2.201749324798584 1.5990138053894043 -1.0 -0.9999999403953552 1.5613718032836914 -0.7071068286895752 -1.707106590270996 1.5613718032836914 -1.201749563217163 -2.201749324798584 1.5990138053894043 -1.6995306015014648 -0.9999999403953552 1.5990138053894043 -8.940696716308594e-08 -1.9999998807907104 1.5613718032836914 0.7071065902709961 -1.707106590270996 1.5613718032836914 1.201749324798584 -2.201749324798584 1.5990138053894043 -1.1920928955078125e-07 -2.6995303630828857 1.5990138053894043 1.201749324798584 -2.201749324798584 2.0969440937042236 1.6995302438735962 -1.0 2.0969440937042236 0.9841001033782959 -1.0 2.124863624572754 0.6958638429641724 -1.695863962173462 2.124863624572754 -1.6995306015014648 -0.9999999403953552 1.5990138053894043 -1.201749563217163 -2.201749324798584 1.5990138053894043 -1.201749563217163 -2.201749324798584 2.0969440937042236 -1.6995306015014648 -0.9999999403953552 2.0969440937042236 -1.1920928955078125e-07 -2.6995303630828857 1.5990138053894043 1.201749324798584 -2.201749324798584 1.5990138053894043 1.201749324798584 -2.201749324798584 2.0969440937042236 -1.1920928955078125e-07 -2.6995303630828857 2.0969440937042236 1.6995302438735962 -1.0 1.5990138053894043 1.201749324798584 0.2017495036125183 1.5990138053894043 1.201749324798584 0.2017495036125183 2.0969440937042236 1.6995302438735962 -1.0 2.0969440937042236 -1.201749563217163 0.20174938440322876 1.5990138053894043 -1.6995306015014648 -0.9999999403953552 1.5990138053894043 -1.6995306015014648 -0.9999999403953552 2.0969440937042236 -1.201749563217163 0.20174938440322876 2.0969440937042236 -1.201749563217163 -2.201749324798584 1.5990138053894043 -1.1920928955078125e-07 -2.6995303630828857 1.5990138053894043 -1.1920928955078125e-07 -2.6995303630828857 2.0969440937042236 -1.201749563217163 -2.201749324798584 2.0969440937042236 1.201749324798584 -2.201749324798584 1.5990138053894043 1.6995302438735962 -1.0 1.5990138053894043 1.6995302438735962 -1.0 2.0969440937042236 1.201749324798584 -2.201749324798584 2.0969440937042236 1.201749324798584 0.2017495036125183 1.5990138053894043 2.9802322387695312e-08 0.6995305418968201 1.5990138053894043 2.9802322387695312e-08 0.6995305418968201 2.0969440937042236 1.201749324798584 0.2017495036125183 2.0969440937042236 0.6958638429641724 -0.3041359782218933 2.124863624572754 -5.960464477539063e-08 -0.015899717807769775 2.124863624572754 -0.6958640813827515 -0.30413609743118286 2.124863624572754 -0.984100341796875 -0.9999999403953552 2.124863624572754 -0.6958640813827515 -1.6958637237548828 2.124863624572754 -1.1920928955078125e-07 -1.984100103378296 2.124863624572754 0.6958638429641724 -1.695863962173462 2.124863624572754 0.9841001033782959 -1.0 2.124863624572754 1.201749324798584 0.2017495036125183 2.0969440937042236 2.9802322387695312e-08 0.6995305418968201 2.0969440937042236 -5.960464477539063e-08 -0.015899717807769775 2.124863624572754 0.6958638429641724 -0.3041359782218933 2.124863624572754 2.9802322387695312e-08 0.6995305418968201 2.0969440937042236 -1.201749563217163 0.20174938440322876 2.0969440937042236 -0.6958640813827515 -0.30413609743118286 2.124863624572754 -5.960464477539063e-08 -0.015899717807769775 2.124863624572754 -1.6995306015014648 -0.9999999403953552 2.0969440937042236 -1.201749563217163 -2.201749324798584 2.0969440937042236 -0.6958640813827515 -1.6958637237548828 2.124863624572754 -0.984100341796875 -0.9999999403953552 2.124863624572754 -1.1920928955078125e-07 -2.6995303630828857 2.0969440937042236 1.201749324798584 -2.201749324798584 2.0969440937042236 0.6958638429641724 -1.695863962173462 2.124863624572754 -1.1920928955078125e-07 -1.984100103378296 2.124863624572754 1.6995302438735962 -1.0 2.0969440937042236 1.201749324798584 0.2017495036125183 2.0969440937042236 0.6958638429641724 -0.3041359782218933 2.124863624572754 0.9841001033782959 -1.0 2.124863624572754 -1.201749563217163 0.20174938440322876 2.0969440937042236 -1.6995306015014648 -0.9999999403953552 2.0969440937042236 -0.984100341796875 -0.9999999403953552 2.124863624572754 -0.6958640813827515 -0.30413609743118286 2.124863624572754 -1.201749563217163 -2.201749324798584 2.0969440937042236 -1.1920928955078125e-07 -2.6995303630828857 2.0969440937042236 -1.1920928955078125e-07 -1.984100103378296 2.124863624572754 -0.6958640813827515 -1.6958637237548828 2.124863624572754</float_array>
				<technique_common>
				<accessor source="#id-mesh-8-positions-array" count="144" stride="3">
					<param name="X" type="float"/>
					<param name="Y" type="float"/>
					<param name="Z" type="float"/>
				</accessor>
				</technique_common>
			</source>
			<source id="id-mesh-8-normals">
				<float_array id="id-mesh-8-normals-array" count="432"> 0.38268357515335083 0.9238795042037964 0.0 0.38268357515335083 0.9238795042037964 0.0 0.38268357515335083 0.9238795042037964 0.0 0.38268357515335083 0.9238795042037964 0.0 0.9238794445991516 0.38268348574638367 0.0 0.9238794445991516 0.38268348574638367 0.0 0.9238794445991516 0.38268348574638367 0.0 0.9238794445991516 0.38268348574638367 0.0 0.9238794445991516 -0.3826836049556732 0.0 0.9238794445991516 -0.3826836049556732 0.0 0.9238794445991516 -0.3826836049556732 0.0 0.9238794445991516 -0.3826836049556732 0.0 0.3826836049556732 -0.9238794445991516 0.0 0.3826836049556732 -0.9238794445991516 0.0 0.3826836049556732 -0.9238794445991516 0.0 0.3826836049556732 -0.9238794445991516 0.0 -0.38268351554870605 -0.9238794445991516 0.0 -0.38268351554870605 -0.9238794445991516 0.0 -0.38268351554870605 -0.9238794445991516 0.0 -0.38268351554870605 -0.9238794445991516 0.0 -0.9238795638084412 -0.3826833963394165 0.0 -0.9238795638084412 -0.3826833963394165 0.0 -0.9238795638084412 -0.3826833963394165 0.0 -0.9238795638084412 -0.3826833963394165 0.0 -0.053719520568847656 0.02225128374993801 -0.9983081817626953 -0.053719520568847656 0.02225128374993801 -0.9983081817626953 -0.053719520568847656 0.02225128374993801 -0.9983081817626953 -0.053719520568847656 0.02225128374993801 -0.9983081817626953 -0.9238795042037964 0.3826834261417389 0.0 -0.9238795042037964 0.3826834261417389 0.0 -0.9238795042037964 0.3826834261417389 0.0 -0.9238795042037964 0.3826834261417389 0.0 -0.38268354535102844 0.9238794445991516 0.0 -0.38268354535102844 0.9238794445991516 0.0 -0.38268354535102844 0.9238794445991516 0.0 -0.38268354535102844 0.9238794445991516 0.0 1.2560741572084665e-15 0.0 -0.9999999403953552 1.2560741572084665e-15 0.0 -0.9999999403953552 1.2560741572084665e-15 0.0 -0.9999999403953552 1.2560741572084665e-15 0.0 -0.9999999403953552 1.2560741572084665e-15 0.0 -0.9999999403953552 1.2560741572084665e-15 0.0 -0.9999999403953552 1.2560741572084665e-15 0.0 -0.9999999403953552 1.2560741572084665e-15 0.0 -0.9999999403953552 -0.382683664560318 0.9238794445991516 0.0 -0.382683664560318 0.9238794445991516 0.0 -0.382683664560318 0.9238794445991516 0.0 -0.382683664560318 0.9238794445991516 0.0 0.05371951684355736 0.022251281887292862 -0.9983081817626953 0.05371951684355736 0.022251281887292862 -0.9983081817626953 0.05371951684355736 0.022251281887292862 -0.9983081817626953 0.05371951684355736 0.022251281887292862 -0.9983081817626953 -0.022251246497035027 -0.053719352930784225 -0.9983081817626953 -0.022251246497035027 -0.053719352930784225 -0.9983081817626953 -0.022251246497035027 -0.053719352930784225 -0.9983081817626953 -0.022251246497035027 -0.053719352930784225 -0.9983081817626953 -0.022251151502132416 0.05371934175491333 -0.9983081817626953 -0.022251151502132416 0.05371934175491333 -0.9983081817626953 -0.022251151502132416 0.05371934175491333 -0.9983081817626953 -0.022251151502132416 0.05371934175491333 -0.9983081817626953 0.022251242771744728 0.05371933802962303 -0.9983081817626953 0.022251242771744728 0.05371933802962303 -0.9983081817626953 0.022251242771744728 0.05371933802962303 -0.9983081817626953 0.022251242771744728 0.05371933802962303 -0.9983081817626953 0.05371953174471855 -0.02225128747522831 -0.9983081221580505 0.05371953174471855 -0.02225128747522831 -0.9983081221580505 0.05371953174471855 -0.02225128747522831 -0.9983081221580505 0.05371953174471855 -0.02225128747522831 -0.9983081221580505 -0.05371933430433273 -0.022251280024647713 -0.9983081817626953 -0.05371933430433273 -0.022251280024647713 -0.9983081817626953 -0.05371933430433273 -0.022251280024647713 -0.9983081817626953 -0.05371933430433273 -0.022251280024647713 -0.9983081817626953 0.022251253947615623 -0.05371937155723572 -0.9983081221580505 0.022251253947615623 -0.05371937155723572 -0.9983081221580505 0.022251253947615623 -0.05371937155723572 -0.9983081221580505 0.022251253947615623 -0.05371937155723572 -0.9983081221580505 0.0389898456633091 -0.0161502156406641 0.9991090893745422 0.0389898456633091 -0.0161502156406641 0.9991090893745422 0.0389898456633091 -0.0161502156406641 0.9991090893745422 0.0389898456633091 -0.0161502156406641 0.9991090893745422 -0.9238795042037964 -0.38268357515335083 0.0 -0.9238795042037964 -0.38268357515335083 0.0 -0.9238795042037964 -0.38268357515335083 0.0 -0.9238795042037964 -0.38268357515335083 0.0 0.3826834261417389 -0.9238795042037964 0.0 0.3826834261417389 -0.9238795042037964 0.0 0.3826834261417389 -0.9238795042037964 0.0 0.3826834261417389 -0.9238795042037964 0.0 0.9238795638084412 0.38268351554870605 0.0 0.9238795638084412 0.38268351554870605 0.0 0.9238795638084412 0.38268351554870605 0.0 0.9238795638084412 0.38268351554870605 0.0 -0.9238795042037964 0.38268357515335083 0.0 -0.9238795042037964 0.38268357515335083 0.0 -0.9238795042037964 0.38268357515335083 0.0 -0.9238795042037964 0.38268357515335083 0.0 -0.3826834261417389 -0.9238795042037964 0.0 -0.3826834261417389 -0.9238795042037964 0.0 -0.3826834261417389 -0.9238795042037964 0.0 -0.3826834261417389 -0.9238795042037964 0.0 0.9238795042037964 -0.38268357515335083 0.0 0.9238795042037964 -0.38268357515335083 0.0 0.9238795042037964 -0.38268357515335083 0.0 0.9238795042037964 -0.38268357515335083 0.0 0.3826834559440613 0.9238795042037964 0.0 0.3826834559440613 0.9238795042037964 0.0 0.3826834559440613 0.9238795042037964 0.0 0.3826834559440613 0.9238795042037964 0.0 8.703950982180686e-08 0.0 1.0 8.703950982180686e-08 0.0 1.0 8.703950982180686e-08 0.0 1.0 8.703950982180686e-08 0.0 1.0 8.703950982180686e-08 0.0 1.0 8.703950982180686e-08 0.0 1.0 8.703950982180686e-08 0.0 1.0 8.703950982180686e-08 0.0 1.0 0.016150562092661858 0.03899003937840462 0.9991090893745422 0.016150562092661858 0.03899003937840462 0.9991090893745422 0.016150562092661858 0.03899003937840462 0.9991090893745422 0.016150562092661858 0.03899003937840462 0.9991090893745422 -0.016150210052728653 0.03899005055427551 0.9991090893745422 -0.016150210052728653 0.03899005055427551 0.9991090893745422 -0.016150210052728653 0.03899005055427551 0.9991090893745422 -0.016150210052728653 0.03899005055427551 0.9991090893745422 -0.038990188390016556 -0.016150208190083504 0.9991090893745422 -0.038990188390016556 -0.016150208190083504 0.9991090893745422 -0.038990188390016556 -0.016150208190083504 0.9991090893745422 -0.038990188390016556 -0.016150208190083504 0.9991090893745422 0.01615038886666298 -0.03899005055427551 0.9991090893745422 0.01615038886666298 -0.03899005055427551 0.9991090893745422 0.01615038886666298 -0.03899005055427551 0.9991090893745422 0.01615038886666298 -0.03899005055427551 0.9991090893745422 0.038989659398794174 0.016150211915373802 0.9991090893745422 0.038989659398794174 0.016150211915373802 0.9991090893745422 0.038989659398794174 0.016150211915373802 0.9991090893745422 0.038989659398794174 0.016150211915373802 0.9991090893745422 -0.0389898382127285 0.016150208190083504 0.9991090893745422 -0.0389898382127285 0.016150208190083504 0.9991090893745422 -0.0389898382127285 0.016150208190083504 0.9991090893745422 -0.0389898382127285 0.016150208190083504 0.9991090893745422 -0.01615021377801895 -0.03899005055427551 0.9991090893745422 -0.01615021377801895 -0.03899005055427551 0.9991090893745422 -0.01615021377801895 -0.03899005055427551 0.9991090893745422 -0.01615021377801895 -0.03899005055427551 0.9991090893745422</float_array>
				<technique_common>
				<accessor source="#id-mesh-8-normals-array" count="144" stride="3">
					<param name="X" type="float"/>
					<param name="Y" type="float"/>
					<param name="Z" type="float"/>
				</accessor>
				</technique_common>
			</source>
			<vertices id="id-mesh-8-vertices">
				<input semantic="POSITION" source="#id-mesh-8-positions"/>
			</vertices>
			<polygons count="34" material="id-trimat-9">
				<input semantic="VERTEX" source="#id-mesh-8-vertices" offset="0"/>
				<input semantic="NORMAL" source="#id-mesh-8-normals" offset="0"/>
				<p> 0 1 2 3 </p>
				<p> 4 5 6 7 </p>
				<p> 8 9 10 11 </p>
				<p> 12 13 14 15 </p>
				<p> 16 17 18 19 </p>
				<p> 20 21 22 23 </p>
				<p> 24 25 26 27 </p>
				<p> 28 29 30 31 </p>
				<p> 32 33 34 35 </p>
				<p> 36 37 38 39 40 41 42 43 </p>
				<p> 44 45 46 47 </p>
				<p> 48 49 50 51 </p>
				<p> 52 53 54 55 </p>
				<p> 56 57 58 59 </p>
				<p> 60 61 62 63 </p>
				<p> 64 65 66 67 </p>
				<p> 68 69 70 71 </p>
				<p> 72 73 74 75 </p>
				<p> 76 77 78 79 </p>
				<p> 80 81 82 83 </p>
				<p> 84 85 86 87 </p>
				<p> 88 89 90 91 </p>
				<p> 92 93 94 95 </p>
				<p> 96 97 98 99 </p>
				<p> 100 101 102 103 </p>
				<p> 104 105 106 107 </p>
				<p> 108 109 110 111 112 113 114 115 </p>
				<p> 116 117 118 119 </p>
				<p> 120 121 122 123 </p>
				<p> 124 125 126 127 </p>
				<p> 128 129 130 131 </p>
				<p> 132 133 134 135 </p>
				<p> 136 137 138 139 </p>
				<p> 140 141 142 143 </p>
			</polygons>
		</mesh>
	</geometry>
</library_geometries>
<library_visual_scenes>
	<visual_scene id="id-scene-1" name="scene">
		<node id="Cube" name="Cube" type="NODE">
			<matrix sid="transform"> 1.0 0.0 0.0 0.0 0.0 1.0 0.0 0.0 0.0 0.0 1.0 0.0 0.0 0.0 0.0 1.0  </matrix>
			<instance_geometry url="#id-mesh-4">
				<bind_material>
					<technique_common>
						<instance_material symbol="id-trimat-5" target="#id-material-3"/>
					</technique_common>
				</bind_material>
			</instance_geometry>
		</node>
		<node id="Cylinder" name="Cylinder" type="NODE">
			<matrix sid="transform"> 0.23517633974552155 0.0 -2.4000747203826904 0.014164984226226807 0.0 0.2736506164073944 0.0 0.2512969672679901 0.13991691172122955 0.0 4.034113883972168 -0.8057740926742554 0.0 0.0 0.0 1.0  </matrix>
			<instance_geometry url="#id-mesh-8">
				<bind_material>
					<technique_common>
						<instance_material symbol="id-trimat-9" target="#id-material-7"/>
					</technique_common>
				</bind_material>
			</instance_geometry>
		</node>
	</visual_scene>
</library_visual_scenes>
<library_animations>
	<animation id="id-anim-10">
		<source id="id-anim-10-input">
			<float_array id="id-anim-10-input-array" count="50"> 0.0 0.041666666666666664 0.08333333333333334 0.125 0.16666666666666666 0.20833333333333334 0.24999999999999997 0.29166666666666663 0.3333333333333333 0.37499999999999994 0.41666666666666663 0.4583333333333333 0.49999999999999994 0.5416666666666666 0.5833333333333334 0.625 0.6666666666666666 0.7083333333333334 0.75 0.7916666666666666 0.8333333333333334 0.875 0.9166666666666666 0.9583333333333334 0.9999999999999999 1.0416666666666665 1.0833333333333333 1.1249999999999998 1.1666666666666665 1.2083333333333333 1.2499999999999998 1.2916666666666665 1.3333333333333333 1.3749999999999998 1.4166666666666665 1.4583333333333333 1.4999999999999998 1.5416666666666665 1.5833333333333333 1.6249999999999998 1.6666666666666665 1.7083333333333333 1.7499999999999998 1.7916666666666665 1.8333333333333333 1.8749999999999998 1.9166666666666665 1.9583333333333333 1.9999999999999998 2.0416666666666665</float_array>
			<technique_common>
				<accessor source="#id-anim-10-input-array" count="50" stride="1">
					<param name="TIME" type="float"/>
				</accessor>
			</technique_common>
		</source>
		<source id="id-anim-10-transform-output">
			<float_array id="id-anim-10-transform-output-array" count="800">  0.23417970538139343 0.0 -2.428579807281494 0.014164984226226807 0.0 0.2736506164073944 0.0 0.2512969672679901 0.14157867431640625 0.0 4.017017841339111 -0.8057740926742554 0.0 0.0 0.0 1.0    0.23455390334129333 0.0 -2.417930841445923 0.014164984226226807 0.0 0.2736506164073944 0.0 0.2512969672679901 0.14095787703990936 0.0 4.023437023162842 -0.8057740926742554 0.0 0.0 0.0 1.0    0.23517633974552155 0.0 -2.4000747203826904 0.014164984226226807 0.0 0.2736506164073944 0.0 0.2512969672679901 0.13991691172122955 0.0 4.034113883972168 -0.8057740926742554 0.0 0.0 0.0 1.0    0.23604273796081543 0.0 -2.3749167919158936 0.014164984226226807 0.0 0.2736506164073944 0.0 0.2512969672679901 0.13845029473304749 0.0 4.048975944519043 -0.8057740926742554 0.0 0.0 0.0 1.0    0.23714584112167358 0.0 -2.342358112335205 0.014164984226226807 0.0 0.2736506164073944 0.0 0.2512969672679901 0.13655221462249756 0.0 4.067897796630859 -0.8057740926742554 0.0 0.0 0.0 1.0    0.2384752780199051 0.0 -2.3023006916046143 0.014164984226226807 0.0 0.2736506164073944 0.0 0.2512969672679901 0.13421699404716492 0.0 4.090702533721924 -0.8057740926742554 0.0 0.0 0.0 1.0    0.24001745879650116 0.0 -2.254652738571167 0.014164984226226807 0.0 0.2736506164073944 0.0 0.2512969672679901 0.13143926858901978 0.0 4.117156505584717 -0.8057740926742554 0.0 0.0 0.0 1.0    0.24175556004047394 0.0 -2.1993331909179688 0.014164984226226807 0.0 0.2736506164073944 0.0 0.2512969672679901 0.1282142996788025 0.0 4.146970748901367 -0.8057740926742554 0.0 0.0 0.0 1.0    0.2436695396900177 0.0 -2.1362783908843994 0.014164984226226807 0.0 0.2736506164073944 0.0 0.2512969672679901 0.12453841418027878 0.0 4.179802417755127 -0.8057740926742554 0.0 0.0 0.0 1.0    0.24573615193367004 0.0 -2.0654497146606445 0.014164984226226807 0.0 0.2736506164073944 0.0 0.2512969672679901 0.12040930986404419 0.0 4.21525239944458 -0.8057740926742554 0.0 0.0 0.0 1.0    0.24792911112308502 0.0 -1.9868409633636475 0.014164984226226807 0.0 0.2736506164073944 0.0 0.2512969672679901 0.11582667380571365 0.0 4.252869606018066 -0.8057740926742554 0.0 0.0 0.0 1.0    0.2502192556858063 0.0 -1.9004875421524048 0.014164984226226807 0.0 0.2736506164073944 0.0 0.2512969672679901 0.11079253256320953 0.0 4.292153358459473 -0.8057740926742554 0.0 0.0 0.0 1.0    0.2525749206542969 0.0 -1.806472897529602 0.014164984226226807 0.0 0.2736506164073944 0.0 0.2512969672679901 0.10531177371740341 0.0 4.332561492919922 -0.8057740926742554 0.0 0.0 0.0 1.0    0.254962295293808 0.0 -1.704938530921936 0.014164984226226807 0.0 0.2736506164073944 0.0 0.2512969672679901 0.09939263015985489 0.0 4.373513698577881 -0.8057740926742554 0.0 0.0 0.0 1.0    0.25734585523605347 0.0 -1.5960907936096191 0.014164984226226807 0.0 0.2736506164073944 0.0 0.2512969672679901 0.09304714947938919 0.0 4.414400100708008 -0.8057740926742554 0.0 0.0 0.0 1.0    0.2596890926361084 0.0 -1.4802086353302002 0.014164984226226807 0.0 0.2736506164073944 0.0 0.2512969672679901 0.08629158139228821 0.0 4.45459508895874 -0.8057740926742554 0.0 0.0 0.0 1.0    0.2619551122188568 0.0 -1.3576469421386719 0.014164984226226807 0.0 0.2736506164073944 0.0 0.2512969672679901 0.079146608710289 0.0 4.493465423583984 -0.8057740926742554 0.0 0.0 0.0 1.0    0.2641073763370514 0.0 -1.2288421392440796 0.014164984226226807 0.0 0.2736506164073944 0.0 0.2512969672679901 0.07163769006729126 0.0 4.530384540557861 -0.8057740926742554 0.0 0.0 0.0 1.0    0.2661105990409851 0.0 -1.0943129062652588 0.014164984226226807 0.0 0.2736506164073944 0.0 0.2512969672679901 0.0637950524687767 0.0 4.564746856689453 -0.8057740926742554 0.0 0.0 0.0 1.0    0.26793158054351807 0.0 -0.9546585083007812 0.014164984226226807 0.0 0.2736506164073944 0.0 0.2512969672679901 0.05565363168716431 0.0 4.595983028411865 -0.8057740926742554 0.0 0.0 0.0 1.0    0.269540011882782 0.0 -0.8105558753013611 0.014164984226226807 0.0 0.2736506164073944 0.0 0.2512969672679901 0.047252897173166275 0.0 4.6235737800598145 -0.8057740926742554 0.0 0.0 0.0 1.0    0.2709093689918518 0.0 -0.6627530455589294 0.014164984226226807 0.0 0.2736506164073944 0.0 0.2512969672679901 0.03863644599914551 0.0 4.6470627784729 -0.8057740926742554 0.0 0.0 0.0 1.0    0.27201756834983826 0.0 -0.5120588541030884 0.014164984226226807 0.0 0.2736506164073944 0.0 0.2512969672679901 0.029851442202925682 0.0 4.666072368621826 -0.8057740926742554 0.0 0.0 0.0 1.0    0.27284765243530273 0.0 -0.359332412481308 0.014164984226226807 0.0 0.2736506164073944 0.0 0.2512969672679901 0.02094796672463417 0.0 4.68031120300293 -0.8057740926742554 0.0 0.0 0.0 1.0    0.2733883261680603 0.0 -0.20546893775463104 0.014164984226226807 0.0 0.2736506164073944 0.0 0.2512969672679901 0.011978202499449253 0.0 4.689586162567139 -0.8057740926742554 0.0 0.0 0.0 1.0    0.2736342251300812 0.0 -0.051383811980485916 0.014164984226226807 0.0 0.2736506164073944 0.0 0.2512969672679901 0.0029955171048641205 0.0 4.693803787231445 -0.8057740926742554 0.0 0.0 0.0 1.0    0.2735860049724579 0.0 0.10200314223766327 0.014164984226226807 0.0 0.2736506164073944 0.0 0.2512969672679901 -0.005946467164903879 0.0 4.692976474761963 -0.8057740926742554 0.0 0.0 0.0 1.0    0.27325040102005005 0.0 0.25378233194351196 0.014164984226226807 0.0 0.2736506164073944 0.0 0.2512969672679901 -0.014794723130762577 0.0 4.687220096588135 -0.8057740926742554 0.0 0.0 0.0 1.0    0.2726398706436157 0.0 0.4030730426311493 0.014164984226226807 0.0 0.2736506164073944 0.0 0.2512969672679901 -0.02349790930747986 0.0 4.6767473220825195 -0.8057740926742554 0.0 0.0 0.0 1.0    0.2717723548412323 0.0 0.5490363836288452 0.014164984226226807 0.0 0.2736506164073944 0.0 0.2512969672679901 -0.0320071205496788 0.0 4.661866188049316 -0.8057740926742554 0.0 0.0 0.0 1.0    0.2706703841686249 0.0 0.690887451171875 0.014164984226226807 0.0 0.2736506164073944 0.0 0.2512969672679901 -0.04027659818530083 0.0 4.642963409423828 -0.8057740926742554 0.0 0.0 0.0 1.0    0.2693607211112976 0.0 0.8279070854187012 0.014164984226226807 0.0 0.2736506164073944 0.0 0.2512969672679901 -0.04826441779732704 0.0 4.620498180389404 -0.8057740926742554 0.0 0.0 0.0 1.0    0.2678734362125397 0.0 0.95944744348526 0.014164984226226807 0.0 0.2736506164073944 0.0 0.2512969672679901 -0.05593281239271164 0.0 4.5949859619140625 -0.8057740926742554 0.0 0.0 0.0 1.0    0.26624101400375366 0.0 1.0849382877349854 0.014164984226226807 0.0 0.2736506164073944 0.0 0.2512969672679901 -0.06324854493141174 0.0 4.566984176635742 -0.8057740926742554 0.0 0.0 0.0 1.0    0.2644975781440735 0.0 1.2038923501968384 0.014164984226226807 0.0 0.2736506164073944 0.0 0.2512969672679901 -0.07018319517374039 0.0 4.537077903747559 -0.8057740926742554 0.0 0.0 0.0 1.0    0.2626781165599823 0.0 1.3158988952636719 0.014164984226226807 0.0 0.2736506164073944 0.0 0.2512969672679901 -0.07671283185482025 0.0 4.505867958068848 -0.8057740926742554 0.0 0.0 0.0 1.0    0.26081761717796326 0.0 1.4206255674362183 0.014164984226226807 0.0 0.2736506164073944 0.0 0.2512969672679901 -0.08281806856393814 0.0 4.4739532470703125 -0.8057740926742554 0.0 0.0 0.0 1.0    0.2589503228664398 0.0 1.5178142786026 0.014164984226226807 0.0 0.2736506164073944 0.0 0.2512969672679901 -0.08848387002944946 0.0 4.441922664642334 -0.8057740926742554 0.0 0.0 0.0 1.0    0.25710922479629517 0.0 1.6072732210159302 0.014164984226226807 0.0 0.2736506164073944 0.0 0.2512969672679901 -0.09369905292987823 0.0 4.410340785980225 -0.8057740926742554 0.0 0.0 0.0 1.0    0.25532546639442444 0.0 1.6888697147369385 0.014164984226226807 0.0 0.2736506164073944 0.0 0.2512969672679901 -0.09845587611198425 0.0 4.379743576049805 -0.8057740926742554 0.0 0.0 0.0 1.0    0.2536278963088989 0.0 1.7625279426574707 0.014164984226226807 0.0 0.2736506164073944 0.0 0.2512969672679901 -0.10274991393089294 0.0 4.350624084472656 -0.8057740926742554 0.0 0.0 0.0 1.0    0.2520427703857422 0.0 1.8282126188278198 0.014164984226226807 0.0 0.2736506164073944 0.0 0.2512969672679901 -0.10657913237810135 0.0 4.323432922363281 -0.8057740926742554 0.0 0.0 0.0 1.0    0.250593364238739 0.0 1.8859279155731201 0.014164984226226807 0.0 0.2736506164073944 0.0 0.2512969672679901 -0.10994374752044678 0.0 4.29857063293457 -0.8057740926742554 0.0 0.0 0.0 1.0    0.2493000328540802 0.0 1.9357067346572876 0.014164984226226807 0.0 0.2736506164073944 0.0 0.2512969672679901 -0.11284570395946503 0.0 4.27638578414917 -0.8057740926742554 0.0 0.0 0.0 1.0    0.24817992746829987 0.0 1.9776051044464111 0.014164984226226807 0.0 0.2736506164073944 0.0 0.2512969672679901 -0.11528825014829636 0.0 4.257171630859375 -0.8057740926742554 0.0 0.0 0.0 1.0    0.24724705517292023 0.0 2.0116941928863525 0.014164984226226807 0.0 0.2736506164073944 0.0 0.2512969672679901 -0.11727553606033325 0.0 4.2411699295043945 -0.8057740926742554 0.0 0.0 0.0 1.0    0.2465122640132904 0.0 2.038055181503296 0.014164984226226807 0.0 0.2736506164073944 0.0 0.2512969672679901 -0.11881230026483536 0.0 4.228565692901611 -0.8057740926742554 0.0 0.0 0.0 1.0    0.24598325788974762 0.0 2.056776523590088 0.014164984226226807 0.0 0.2736506164073944 0.0 0.2512969672679901 -0.11990369111299515 0.0 4.219491004943848 -0.8057740926742554 0.0 0.0 0.0 1.0    0.2456647753715515 0.0 2.067946434020996 0.014164984226226807 0.0 0.2736506164073944 0.0 0.2512969672679901 -0.12055487185716629 0.0 4.2140278816223145 -0.8057740926742554 0.0 0.0 0.0 1.0    0.2455587089061737 0.0 2.071650266647339 0.014164984226226807 0.0 0.2736506164073944 0.0 0.2512969672679901 -0.12077079713344574 0.0 4.2122087478637695 -0.8057740926742554 0.0 0.0 0.0 1.0  </float_array>
			<technique_common>
				<accessor source="#id-anim-10-transform-output-array" count="50" stride="16">
					<param name="TRANSFORM" type="float4x4"/>
				</accessor>
			</technique_common>
		</source>
		<source id="id-anim-10-interpolation-output">
			<Name_array id="id-anim-10-interpolation-output-array" count="50"> LINEAR LINEAR LINEAR LINEAR LINEAR LINEAR LINEAR LINEAR LINEAR LINEAR LINEAR LINEAR LINEAR LINEAR LINEAR LINEAR LINEAR LINEAR LINEAR LINEAR LINEAR LINEAR LINEAR LINEAR LINEAR LINEAR LINEAR LINEAR LINEAR LINEAR LINEAR LINEAR LINEAR LINEAR LINEAR LINEAR LINEAR LINEAR LINEAR LINEAR LINEAR LINEAR LINEAR LINEAR LINEAR LINEAR LINEAR LINEAR LINEAR LINEAR</Name_array>
			<technique_common>
				<accessor source="#id-anim-10-interpolation-output-array" count="50" stride="1">
					<param name="INTERPOLATION" type="Name"/>
				</accessor>
			</technique_common>
		</source>
		<sampler id="id-anim-10-sampler">
			<input semantic="INPUT" source="#id-anim-10-input"/>
			<input semantic="OUTPUT" source="#id-anim-10-transform-output"/>
			<input semantic="INTERPOLATION" source="#id-anim-10-interpolation-output"/>
		</sampler>
		<channel source="#id-anim-10-sampler" target="Cylinder/transform"/>
	</animation>
</library_animations>
<scene>
	<instance_visual_scene url="#id-scene-1" />
</scene>
</COLLADA>
