<?xml version="1.0" encoding="utf-8"?>
<COLLADA xmlns="http://www.collada.org/2005/11/COLLADASchema" version="1.4.1">
<asset>
	<contributor>
		<author>Anonymous</author>
		<authoring_tool>Collada Exporter for Blender 2.6+, by Juan Linietsky (juan@codenix.com)</authoring_tool>
	</contributor>
	<created>2019-05-05T17:04:30Z</created>
	<modified>2019-05-05T17:04:30Z</modified>
	<unit meter="1.0" name="meter"/>
	<up_axis>Z_UP</up_axis>
</asset>
<library_images>
	<image id="id-image-3" name="color atlas.png">
		<init_from>../../concepts/3D/PolyDesertFree_v 1.1_by_RunemarkStudio/Update 1.1/FBX/rock04.fbm/color atlas.png</init_from>
	</image>
</library_images>
<library_effects>
	<effect id="id-fx-2" name="polydesert_atlas.009-fx">
		<profile_COMMON>
			<newparam sid="id-fx_surf-4">
				<surface type="2D">
					<init_from>id-image-3</init_from>
					<format>A8R8G8B8</format>
				</surface>
			</newparam>
			<newparam sid="id-fx_sampler-5">
				<sampler2D>
					<source>id-fx_surf-4</source>
				</sampler2D>
			</newparam>
			<technique sid="common">
				<blinn>
					<emission>
						<color>  0.0 0.0 0.0 1.0 </color>
					</emission>
					<ambient>
						<color>  0.0 0.0 0.0 1.0 </color>
					</ambient>
					<diffuse>
						<texture texture="id-fx_sampler-5" texcoord="CHANNEL1"/>
					</diffuse>
					<specular>
						<color>  0.0 0.0 0.0 1.0 </color>
					</specular>
					<shininess>
						<float>50</float>
					</shininess>
					<reflective>
						<color>  1.0 1.0 1.0 1.0 </color>
					</reflective>
					<index_of_refraction>
						<float>4.0</float>
					</index_of_refraction>
				</blinn>
				<extra>
					<technique profile="FCOLLADA">
					</technique>
					<technique profile="GOOGLEEARTH">
						<double_sided>0</double_sided>
					</technique>
				</extra>
			</technique>
		</profile_COMMON>
	</effect>
</library_effects>
<library_materials>
	<material id="id-material-6" name="polydesert_atlas.009">
		<instance_effect url="#id-fx-2"/>
	</material>
</library_materials>
<library_geometries>
	<geometry id="id-mesh-7" name="rock04">
		<mesh>
			<source id="id-mesh-7-positions">
				<float_array id="id-mesh-7-positions-array" count="1344"> -0.6007957458496094 1.2836244106292725 -0.24094638228416443 -0.5087902545928955 0.21020802855491638 -0.2666530907154083 -0.37769341468811035 0.4885011911392212 0.07824080437421799 -0.4597402513027191 1.2836244106292725 0.18222014605998993 -0.36031922698020935 2.5610544681549072 0.11803531646728516 -0.485711008310318 2.520251750946045 -0.21133100986480713 -0.36031919717788696 2.5610544681549072 -0.5387430191040039 -0.4597402513027191 1.2836244106292725 -0.66411292552948 -0.37769338488578796 0.4885011911392212 -0.5982176065444946 -0.03657372668385506 1.2836244106292725 -0.8051684498786926 -0.04047580808401108 0.21020802855491638 -0.7349674701690674 -0.03207835182547569 2.520251750946045 -0.6649636626243591 -0.03657372668385506 1.2836244106292725 -0.8051684498786926 -0.03207835182547569 2.520251750946045 -0.6649636626243591 0.2964591085910797 2.5610544681549072 -0.5387430191040039 0.3865927457809448 1.2836244106292725 -0.66411292552948 0.29876503348350525 0.4885011911392212 -0.5982176065444946 -0.04047580808401108 0.21020802855491638 -0.7349674701690674 0.5276482105255127 1.2836244106292725 -0.24094638228416443 0.4278385639190674 0.21020802855491638 -0.2666530907154083 0.4215542674064636 2.520251750946045 -0.21133100986480713 0.2964590787887573 2.5610544681549072 0.11803531646728516 0.3865927457809448 1.2836244106292725 0.18222014605998993 0.29876500368118286 0.4885011911392212 0.07824080437421799 -0.036573782563209534 1.2836244106292725 0.3232756555080414 -0.04047585278749466 0.21020802855491638 0.20166131854057312 0.29876500368118286 0.4885011911392212 0.07824080437421799 0.3865927457809448 1.2836244106292725 0.18222014605998993 0.2964590787887573 2.5610544681549072 0.11803531646728516 -0.032078392803668976 2.520251750946045 0.24230162799358368 -0.36031922698020935 2.5610544681549072 0.11803531646728516 -0.4597402513027191 1.2836244106292725 0.18222014605998993 -0.37769341468811035 0.4885011911392212 0.07824080437421799 -0.04177652299404144 -0.14759743213653564 -0.2752220034599304 -0.5087902545928955 0.21020802855491638 -0.2666530907154083 -0.37769338488578796 0.4885011911392212 -0.5982176065444946 -0.04047580808401108 0.21020802855491638 -0.7349674701690674 0.29876503348350525 0.4885011911392212 -0.5982176065444946 0.4278385639190674 0.21020802855491638 -0.2666530907154083 0.29876500368118286 0.4885011911392212 0.07824080437421799 -0.04047585278749466 0.21020802855491638 0.20166131854057312 -0.37769341468811035 0.4885011911392212 0.07824080437421799 0.8745825290679932 0.8126437067985535 -0.9326440691947937 0.9884482622146606 0.9758548736572266 -0.8417397737503052 1.1316297054290771 0.32611337304115295 -0.9757277965545654 0.9183725118637085 0.2853105664253235 -1.0608839988708496 0.8745825290679932 0.8126437067985535 -0.9326440691947937 0.9183725118637085 0.2853105664253235 -1.0608839988708496 0.6983388066291809 0.32611337304115295 -0.9757277965545654 0.7336105108261108 0.9758548736572266 -0.8417397737503052 0.7336105108261108 0.9758548736572266 -0.8417397737503052 0.8339231014251709 1.3022770881652832 -0.6918332576751709 0.6069967746734619 0.009000599384307861 -0.780928909778595 0.697467029094696 -0.10409823060035706 -0.788720428943634 0.7611678838729858 -0.0747763141989708 -0.5995940566062927 0.69057697057724 0.009000599384307861 -0.5301884412765503 0.6069967746734619 0.009000599384307861 -0.780928909778595 0.69057697057724 0.009000599384307861 -0.5301884412765503 0.6983388066291809 0.32611337304115295 -0.5424371957778931 0.6193819642066956 0.2853105962276459 -0.7618935108184814 0.69057697057724 0.009000599384307861 -1.03166925907135 0.7611678838729858 -0.0747763141989708 -0.9738067388534546 0.697467029094696 -0.10409823060035706 -0.788720428943634 0.9413173794746399 0.009000599384307861 -1.115249514579773 0.9507091641426086 -0.10409823060035706 -1.0419625043869019 0.7611678838729858 -0.0747763141989708 -0.9738067388534546 0.69057697057724 0.009000599384307861 -1.03166925907135 0.9413173794746399 0.009000599384307861 -1.115249514579773 0.9413173794746399 0.009000599384307861 -1.115249514579773 1.1920578479766846 0.009000599384307861 -1.03166925907135 1.1920578479766846 0.009000599384307861 -1.03166925907135 1.1353808641433716 -0.0747763141989708 -0.9738066792488098 1.2756379842758179 0.009000599384307861 -0.7809288501739502 1.203951358795166 -0.10409823060035706 -0.788720428943634 1.1353808641433716 -0.0747763141989708 -0.9738066792488098 1.2173631191253662 0.2853105962276459 -0.7618935108184814 1.1316297054290771 0.32611337304115295 -0.5424371957778931 1.1920578479766846 0.009000599384307861 -0.5301884412765503 1.1353808641433716 -0.0747763141989708 -0.5995940566062927 0.9413173198699951 0.009000599384307861 -0.446608304977417 0.9507091045379639 -0.10409823060035706 -0.5354783535003662 1.1353808641433716 -0.0747763141989708 -0.5995940566062927 1.1920578479766846 0.009000599384307861 -0.5301884412765503 1.1316297054290771 0.32611337304115295 -0.5424371957778931 0.9183724522590637 0.2853105962276459 -0.46290305256843567 0.6983388066291809 0.32611337304115295 -0.5424371957778931 0.69057697057724 0.009000599384307861 -0.5301884412765503 0.9413173198699951 0.009000599384307861 -0.446608304977417 0.9507091045379639 -0.10409823060035706 -0.5354783535003662 0.9538397192955017 -0.14179784059524536 -0.7913176417350769 1.203951358795166 -0.10409823060035706 -0.788720428943634 1.1353808641433716 -0.0747763141989708 -0.5995940566062927 -0.8081808686256409 2.178553581237793 -0.4059438109397888 -0.6831567883491516 2.3417646884918213 -0.3323354125022888 -0.6729866862297058 1.521284580230713 -0.4350526034832001 -0.8697302341461182 1.480481743812561 -0.5095902681350708 -0.8081808686256409 2.178553581237793 -0.4059438109397888 -0.8697302341461182 1.480481743812561 -0.5095902681350708 -1.0592787265777588 1.521284580230713 -0.43505263328552246 -0.9044240713119507 2.3417646884918213 -0.3323354423046112 -0.9044240713119507 2.3417646884918213 -0.3323354423046112 -0.7650094032287598 2.668187141418457 -0.21366339921951294 -1.2534334659576416 0.69195556640625 -0.26232942938804626 -1.2438551187515259 0.06664051115512848 -0.27772822976112366 -1.1622285842895508 0.2287592589855194 -0.09160301089286804 -1.1748889684677124 0.69195556640625 -0.026695722714066505 -1.0592787265777588 1.521284580230713 -0.04876066371798515 -1.1364091634750366 1.480481743812561 -0.2429114729166031 -1.1748889684677124 0.69195556640625 -0.4979631304740906 -1.1622285842895508 0.2287592589855194 -0.4558688700199127 -0.9392551183700562 0.69195556640625 -0.5765076875686646 -0.9943895936012268 0.06664051115512848 -0.5271936058998108 -0.9392551183700562 0.69195556640625 -0.5765076875686646 -0.703621506690979 0.69195556640625 -0.4979630708694458 -0.7979626655578613 0.2287592589855194 -0.4558688700199127 -0.9943895936012268 0.06664051115512848 -0.5271936058998108 -0.6250770092010498 0.69195556640625 -0.2623293697834015 -0.7449242472648621 0.06664051115512848 -0.2777281701564789 -0.6030515432357788 1.480481743812561 -0.2429114133119583 -0.6729866862297058 1.521284580230713 -0.04876063019037247 -0.7036215662956238 0.69195556640625 -0.026695681735873222 -0.7979626655578613 0.2287592589855194 -0.09160297363996506 -0.9392552375793457 0.69195556640625 0.051848866045475006 -0.9943895936012268 0.06664051115512848 -0.02826273813843727 -0.7979626655578613 0.2287592589855194 -0.09160297363996506 -0.7036215662956238 0.69195556640625 -0.026695681735873222 -0.6729866862297058 1.521284580230713 -0.04876063019037247 -0.8697303533554077 1.480481743812561 0.023767415434122086 -1.0592787265777588 1.521284580230713 -0.04876066371798515 -1.1748889684677124 0.69195556640625 -0.026695722714066505 -1.1622285842895508 0.2287592589855194 -0.09160301089286804 -1.0127677917480469 -0.14179784059524536 -0.2828611135482788 -1.0127677917480469 -0.14179784059524536 -0.2828611135482788 -0.9943895936012268 0.06664051115512848 -0.5271936058998108 -0.7979626655578613 0.2287592589855194 -0.4558688700199127 -0.7449242472648621 0.06664051115512848 -0.2777281701564789 -0.7979626655578613 0.2287592589855194 -0.09160297363996506 -0.9943895936012268 0.06664051115512848 -0.02826273813843727 -1.0127677917480469 -0.14179784059524536 -0.2828611135482788 -1.2438551187515259 0.06664051115512848 -0.27772822976112366 -0.4633762240409851 2.5997238159179688 -1.1047790050506592 -0.30690401792526245 2.762934923171997 -0.9954655170440674 -0.2404678761959076 1.8875670433044434 -1.1947484016418457 -0.5032740235328674 1.8467642068862915 -1.29806649684906 -0.4633762240409851 2.5997238159179688 -1.1047790050506592 -0.5032740235328674 1.8467642068862915 -1.29806649684906 -0.7617560625076294 1.8875670433044434 -1.1947484016418457 -0.6025519371032715 2.762934923171997 -0.9954656958580017 -0.6025519371032715 2.762934923171997 -0.9954656958580017 -0.4374315142631531 3.0893571376800537 -0.8153998851776123 -0.9858407378196716 0.8935742378234863 -1.0322840213775635 -0.944179356098175 0.10359528660774231 -1.110312581062317 -0.8382612466812134 0.3084046542644501 -0.8366105556488037 -0.8778259754180908 0.8935742378234863 -0.7082397937774658 -0.761756181716919 1.8875670433044434 -0.6734602451324463 -0.8632060289382935 1.846764326095581 -0.9381346106529236 -0.877825915813446 0.8935742378234863 -1.3563282489776611 -0.8382612466812134 0.3084046542644501 -1.3435553312301636 -0.5537816882133484 0.8935742378234863 -1.4643428325653076 -0.5956411361694336 0.10359528660774231 -1.4588507413864136 -0.5537816882133484 0.8935742378234863 -1.4643428325653076 -0.22973750531673431 0.8935742378234863 -1.3563281297683716 -0.331316202878952 0.3084046542644501 -1.3435553312301636 -0.5956411361694336 0.10359528660774231 -1.4588507413864136 -0.12172278761863708 0.8935742378234863 -1.0322840213775635 -0.2471030056476593 0.10359528660774231 -1.110312581062317 -0.14334213733673096 1.846764326095581 -0.9381346106529236 -0.24046790599822998 1.8875670433044434 -0.6734602451324463 -0.2297375351190567 0.8935742378234863 -0.7082397937774658 -0.331316202878952 0.3084046542644501 -0.8366104960441589 -0.5537817478179932 0.8935742378234863 -0.6002250909805298 -0.5956411957740784 0.10359528660774231 -0.7617745399475098 -0.331316202878952 0.3084046542644501 -0.8366104960441589 -0.2297375351190567 0.8935742378234863 -0.7082397937774658 -0.24046790599822998 1.8875670433044434 -0.6734602451324463 -0.5032740831375122 1.846764326095581 -0.5782026648521423 -0.761756181716919 1.8875670433044434 -0.6734602451324463 -0.8778259754180908 0.8935742378234863 -0.7082397937774658 -0.8382612466812134 0.3084046542644501 -0.8366105556488037 -0.6095943450927734 -0.15973103046417236 -1.1363221406936646 -0.6095943450927734 -0.15973103046417236 -1.1363221406936646 -0.5956411361694336 0.10359528660774231 -1.4588507413864136 -0.331316202878952 0.3084046542644501 -1.3435553312301636 -0.2471030056476593 0.10359528660774231 -1.110312581062317 -0.331316202878952 0.3084046542644501 -0.8366104960441589 -0.5956411957740784 0.10359528660774231 -0.7617745399475098 -0.8382612466812134 0.3084046542644501 -0.8366105556488037 -0.944179356098175 0.10359528660774231 -1.110312581062317 0.16008293628692627 1.7566255331039429 -1.3761687278747559 0.30706730484962463 1.9198366403579712 -1.2629175186157227 0.4292260706424713 1.1520373821258545 -1.4629452228546143 0.1708584725856781 1.1112345457077026 -1.5663340091705322 0.16008293628692627 1.7566255331039429 -1.3761687278747559 0.1708584725856781 1.1112345457077026 -1.5663340091705322 -0.08887162059545517 1.1520373821258545 -1.4629452228546143 0.0076485974714159966 1.9198366403579712 -1.2629175186157227 0.0076485974714159966 1.9198366403579712 -1.2629175186157227 0.15190795063972473 2.2462589740753174 -1.0746527910232544 -0.2327796369791031 0.4807509481906891 -1.2831852436065674 -0.13479721546173096 0.013478465378284454 -1.3383768796920776 -0.050258245319128036 0.134623184800148 -1.0866457223892212 -0.12923847138881683 0.4807509183883667 -0.9725616574287415 -0.08887165039777756 1.1520373821258545 -0.944847583770752 -0.1867596060037613 1.1112345457077026 -1.2087159156799316 -0.12923845648765564 0.4807509183883667 -1.5938087701797485 -0.050258226692676544 0.134623184800148 -1.5614904165267944 0.1813851147890091 0.4807509481906891 -1.697350025177002 0.18918675184249878 0.013478465378284454 -1.6623609066009521 0.1813851147890091 0.4807509481906891 -1.697350025177002 0.49200868606567383 0.4807509183883667 -1.593808889389038 0.4245864748954773 0.134623184800148 -1.5614904165267944 0.18918675184249878 0.013478465378284454 -1.6623609066009521 0.5955498218536377 0.4807509481906891 -1.2831852436065674 0.5131707191467285 0.013478465378284454 -1.3383768796920776 0.5284764766693115 1.1112345457077026 -1.2087159156799316 0.4292260408401489 1.1520373821258545 -0.944847583770752 0.49200862646102905 0.4807509183883667 -0.9725615382194519 0.4245864152908325 0.134623184800148 -1.0866457223892212 0.18138505518436432 0.4807509481906891 -0.869020402431488 0.1891867220401764 0.013478465378284454 -1.0143928527832031 0.4245864152908325 0.134623184800148 -1.0866457223892212 0.49200862646102905 0.4807509183883667 -0.9725615382194519 0.4292260408401489 1.1520373821258545 -0.944847583770752 0.1708584427833557 1.1112345457077026 -0.8510977029800415 -0.08887165039777756 1.1520373821258545 -0.944847583770752 -0.12923847138881683 0.4807509183883667 -0.9725616574287415 -0.050258245319128036 0.134623184800148 -1.0866457223892212 0.19178728759288788 -0.1422790288925171 -1.3567742109298706 -0.13479721546173096 0.013478465378284454 -1.3383768796920776 -0.050258226692676544 0.134623184800148 -1.5614904165267944 0.18918675184249878 0.013478465378284454 -1.6623609066009521 0.4245864748954773 0.134623184800148 -1.5614904165267944 0.5131707191467285 0.013478465378284454 -1.3383768796920776 0.4245864152908325 0.134623184800148 -1.0866457223892212 0.1891867220401764 0.013478465378284454 -1.0143928527832031 -0.050258245319128036 0.134623184800148 -1.0866457223892212 -0.18968737125396729 1.155255913734436 -2.1016743183135986 -0.06344039738178253 1.3184670209884644 -1.9940848350524902 0.011209016665816307 0.625899076461792 -2.210860013961792 -0.20030155777931213 0.5850962996482849 -2.2986083030700684 -0.18968737125396729 1.155255913734436 -2.1016743183135986 -0.20030155777931213 0.5850962996482849 -2.2986083030700684 -0.41029295325279236 0.625899076461792 -2.210859775543213 -0.3098576068878174 1.3184670209884644 -1.9940848350524902 -0.3098576068878174 1.3184670209884644 -1.9940848350524902 -0.1805722862482071 1.6448893547058105 -1.8099662065505981 -0.5371054410934448 0.18030670285224915 -2.0832557678222656 -0.46462926268577576 -0.061271704733371735 -2.1283342838287354 -0.3970273435115814 0.0013597359647974372 -1.9307886362075806 -0.4547883868217468 0.18030670285224915 -1.836304783821106 -0.41029295325279236 0.625899076461792 -1.7893577814102173 -0.49118727445602417 0.5850962400436401 -2.0077223777770996 -0.4547883868217468 0.18030670285224915 -2.330207109451294 -0.3970273435115814 0.0013597359647974372 -2.3025062084198 -0.20783717930316925 0.18030670285224915 -2.4125242233276367 -0.21233443915843964 -0.061271704733371735 -2.380629062652588 -0.20783717930316925 0.18030670285224915 -2.4125242233276367 0.03911401331424713 0.18030670285224915 -2.330207109451294 -0.025309646502137184 0.0013597359647974372 -2.3025062084198 -0.21233443915843964 -0.061271704733371735 -2.380629062652588 0.12143106758594513 0.18030670285224915 -2.0832560062408447 0.03996036574244499 -0.061271704733371735 -2.1283345222473145 0.09058413654565811 0.5850962400436401 -2.0077226161956787 0.011208999902009964 0.625899076461792 -1.7893577814102173 0.03911399841308594 0.18030670285224915 -1.836304783821106 -0.02530965767800808 0.0013597359647974372 -1.9307886362075806 -0.20783719420433044 0.18030670285224915 -1.7539876699447632 -0.21233445405960083 -0.061271704733371735 -1.8760395050048828 -0.02530965767800808 0.0013597359647974372 -1.9307886362075806 0.03911399841308594 0.18030670285224915 -1.836304783821106 0.011208999902009964 0.625899076461792 -1.7893577814102173 -0.20030157268047333 0.5850962400436401 -1.7168368101119995 -0.41029295325279236 0.625899076461792 -1.7893577814102173 -0.4547883868217468 0.18030670285224915 -1.836304783821106 -0.3970273435115814 0.0013597359647974372 -1.9307886362075806 -0.2138335257768631 -0.14179784059524536 -2.1433606147766113 -0.46462926268577576 -0.061271704733371735 -2.1283342838287354 -0.3970273435115814 0.0013597359647974372 -2.3025062084198 -0.21233443915843964 -0.061271704733371735 -2.380629062652588 -0.025309646502137184 0.0013597359647974372 -2.3025062084198 0.03996036574244499 -0.061271704733371735 -2.1283345222473145 -0.02530965767800808 0.0013597359647974372 -1.9307886362075806 -0.21233445405960083 -0.061271704733371735 -1.8760395050048828 -0.3970273435115814 0.0013597359647974372 -1.9307886362075806 0.4019392132759094 2.178553581237793 -0.4188934564590454 0.5054159164428711 2.3417646884918213 -0.3450544476509094 0.6239068508148193 1.521284580230713 -0.4489307999610901 0.4325501024723053 1.480481743812561 -0.523526132106781 0.4019392132759094 2.178553581237793 -0.4188934564590454 0.4325501024723053 1.480481743812561 -0.523526132106781 0.23761491477489471 1.521284580230713 -0.44893085956573486 0.2841486930847168 2.3417646884918213 -0.3450545072555542 0.2841486930847168 2.3417646884918213 -0.3450545072555542 0.380468487739563 2.668187141418457 -0.22592130303382874 0.152949258685112 0.69195556640625 -0.2773793041706085 0.2450825423002243 0.06664051115512848 -0.29366153478622437 0.3053060472011566 0.2287592589855194 -0.10730727761983871 0.23149381577968597 0.69195556640625 -0.04174559563398361 0.23761488497257233 1.521284580230713 -0.06263887882232666 0.1658712923526764 1.480481743812561 -0.2568473219871521 0.23149383068084717 0.69195556640625 -0.5130130052566528 0.305306077003479 0.2287592589855194 -0.471573144197464 0.4671275019645691 0.69195556640625 -0.591557502746582 0.494547963142395 0.06664051115512848 -0.5431268811225891 0.4671275019645691 0.69195556640625 -0.591557502746582 0.7027611136436462 0.69195556640625 -0.5130129456520081 0.6695719361305237 0.2287592589855194 -0.471573144197464 0.494547963142395 0.06664051115512848 -0.5431268811225891 0.7813056707382202 0.69195556640625 -0.27737924456596375 0.7440133094787598 0.06664051115512848 -0.2936614751815796 0.6992288827896118 1.480481743812561 -0.2568472623825073 0.6239067912101746 1.521284580230713 -0.06263884156942368 0.7027611136436462 0.69195556640625 -0.04174555093050003 0.6695719361305237 0.2287592589855194 -0.10730724036693573 0.4671274721622467 0.69195556640625 0.03679899498820305 0.49454790353775024 0.06664051115512848 -0.04419603943824768 0.6695719361305237 0.2287592589855194 -0.10730724036693573 0.7027611136436462 0.69195556640625 -0.04174555093050003 0.6239067912101746 1.521284580230713 -0.06263884156942368 0.4325500428676605 1.480481743812561 0.009831555187702179 0.23761488497257233 1.521284580230713 -0.06263887882232666 0.23149381577968597 0.69195556640625 -0.04174559563398361 0.3053060472011566 0.2287592589855194 -0.10730727761983871 0.5036881566047668 -0.14179784059524536 -0.29908886551856995 0.2450825423002243 0.06664051115512848 -0.29366153478622437 0.305306077003479 0.2287592589855194 -0.471573144197464 0.494547963142395 0.06664051115512848 -0.5431268811225891 0.5036881566047668 -0.14179784059524536 -0.29908886551856995 0.7440133094787598 0.06664051115512848 -0.2936614751815796 0.6695719361305237 0.2287592589855194 -0.10730724036693573 0.49454790353775024 0.06664051115512848 -0.04419603943824768 0.3053060472011566 0.2287592589855194 -0.10730727761983871 -1.0890833139419556 -0.014709234237670898 0.35352739691734314 -1.0153378248214722 -0.12780806422233582 0.35704725980758667 -0.9471196532249451 -0.09848614782094955 0.5436295866966248 -1.0053282976150513 -0.014709234237670898 0.6047922968864441 -0.9332516193389893 0.06906767934560776 0.5356696248054504 -0.9953188300132751 0.09838959574699402 0.3500075042247772 -0.9332516193389893 0.06906767934560776 0.16617058217525482 -1.0053282976150513 -0.014709234237670898 0.1022624671459198 -0.9471196532249451 -0.09848614782094955 0.1686398684978485 -0.7540634274482727 -0.014709234237670898 0.018507514148950577 -0.7615712285041809 -0.12780806422233582 0.10328065603971481 -0.9471196532249451 -0.09848614782094955 0.1686398684978485 -1.0053282976150513 -0.014709234237670898 0.1022624671459198 -0.7540634274482727 -0.014709234237670898 0.018507514148950577 -0.7465556263923645 0.09838959574699402 0.10124430805444717 -0.7540634274482727 -0.014709234237670898 0.018507514148950577 -0.7465556263923645 0.09838959574699402 0.10124430805444717 -0.5637527108192444 0.06906767934560776 0.1661706268787384 -0.5027984976768494 -0.014709234237670898 0.10226250439882278 -0.5027984976768494 -0.014709234237670898 0.10226250439882278 -0.5721299648284912 -0.09848614782094955 0.1686399132013321 -0.41904357075691223 -0.014709234237670898 0.3535274267196655 -0.5078046321868896 -0.12780806422233582 0.35704725980758667 -0.5721299648284912 -0.09848614782094955 0.1686399132013321 -0.49779248237609863 0.09838959574699402 0.3500075042247772 -0.5637527108192444 0.06906767934560776 0.5356696844100952 -0.5027985572814941 -0.014709234237670898 0.6047922968864441 -0.5721299648284912 -0.09848614782094955 0.5436296463012695 -0.7540634870529175 -0.014709234237670898 0.6885473132133484 -0.7615712881088257 -0.12780806422233582 0.6108138561248779 -0.5721299648284912 -0.09848614782094955 0.5436296463012695 -0.5027985572814941 -0.014709234237670898 0.6047922968864441 -0.5637527108192444 0.06906767934560776 0.5356696844100952 -0.7465556859970093 0.09838959574699402 0.5987707376480103 -0.9332516193389893 0.06906767934560776 0.5356696248054504 -1.0053282976150513 -0.014709234237670898 0.6047922968864441 -0.9471196532249451 -0.09848614782094955 0.5436295866966248 -0.7640738487243652 -0.16550767421722412 0.35822054743766785 -1.0153378248214722 -0.12780806422233582 0.35704725980758667 -0.5078046321868896 -0.12780806422233582 0.35704725980758667 -0.5721299648284912 -0.09848614782094955 0.5436296463012695 -0.7615712881088257 -0.12780806422233582 0.6108138561248779 -0.9471196532249451 -0.09848614782094955 0.5436295866966248 -0.7440530061721802 0.13608920574188232 0.34883421659469604 -0.7440530061721802 0.13608920574188232 0.34883421659469604 -0.7465556859970093 0.09838959574699402 0.5987707376480103 -0.7465556859970093 0.09838959574699402 0.5987707376480103 -0.028997749090194702 3.3676905632019043 -0.48926788568496704 0.15417669713497162 3.5309014320373535 -0.3697085976600647 -0.028997749090194702 3.3676905632019043 -0.48926788568496704 -0.21098560094833374 3.5309014320373535 -0.3697085976600647 -0.21098560094833374 3.5309014320373535 -0.3697085976600647 -0.027217846363782883 3.85732364654541 -0.179310142993927 -0.3272295296192169 3.3676905632019043 -0.19103612005710602 -0.21098560094833374 3.5309014320373535 -0.00454632006585598 -0.027217846363782883 3.85732364654541 -0.179310142993927 -0.02899777516722679 3.3676905632019043 0.10719562321901321 -0.21098560094833374 3.5309014320373535 -0.00454632006585598 0.15417668223381042 3.5309014320373535 -0.00454632006585598 -0.027217846363782883 3.85732364654541 -0.179310142993927 0.26923397183418274 3.3676905632019043 -0.19103612005710602 0.15417668223381042 3.5309014320373535 -0.00454632006585598 0.6675032377243042 0.8126437067985535 -0.7255647778511047 0.7336105108261108 0.9758548736572266 -0.5869020223617554 0.8339231014251709 1.3022770881652832 -0.6918332576751709 0.8745825290679932 0.8126437067985535 -0.5184855461120605 0.7336105108261108 0.9758548736572266 -0.5869020223617554 0.9884482622146606 0.9758548736572266 -0.5869020223617554 0.8339231014251709 1.3022770881652832 -0.6918332576751709 1.0816618204116821 0.8126437067985535 -0.7255647778511047 0.9884482622146606 0.9758548736572266 -0.5869020223617554 -0.9884036183357239 2.178553581237793 -0.22572098672389984 -0.9044240713119507 2.3417646884918213 -0.11106817424297333 -0.7650094032287598 2.668187141418457 -0.21366339921951294 -0.8081808686256409 2.178553581237793 -0.04549812525510788 -0.9044240713119507 2.3417646884918213 -0.11106817424297333 -0.6831569075584412 2.3417646884918213 -0.11106814444065094 -0.7650094032287598 2.668187141418457 -0.21366339921951294 -0.6279580593109131 2.178553581237793 -0.22572094202041626 -0.6831569075584412 2.3417646884918213 -0.11106814444065094 -0.7043927907943726 2.5997238159179688 -0.8637624979019165 -0.6025519371032715 2.762934923171997 -0.6998176574707031 -0.4374315142631531 3.0893571376800537 -0.8153998851776123 -0.4633762240409851 2.5997238159179688 -0.622745931148529 -0.6025519371032715 2.762934923171997 -0.6998176574707031 -0.3069040775299072 2.762934923171997 -0.6998176574707031 -0.4374315142631531 3.0893571376800537 -0.8153998851776123 -0.22235970199108124 2.5997238159179688 -0.8637624979019165 -0.3069040775299072 2.762934923171997 -0.6998176574707031 -0.08360008895397186 1.7566255331039429 -1.1324857473373413 0.00764858815819025 1.9198366403579712 -0.9634987115859985 0.15190795063972473 2.2462589740753174 -1.0746527910232544 0.16008292138576508 1.7566255331039429 -0.8888026475906372 0.00764858815819025 1.9198366403579712 -0.9634987115859985 0.30706727504730225 1.9198366403579712 -0.9634988307952881 0.15190795063972473 2.2462589740753174 -1.0746527910232544 0.4037659764289856 1.7566255331039429 -1.1324857473373413 0.30706727504730225 1.9198366403579712 -0.9634988307952881 -0.3900302052497864 1.155255913734436 -1.9013314247131348 -0.3098576068878174 1.3184670209884644 -1.7476675510406494 -0.1805722862482071 1.6448893547058105 -1.8099662065505981 -0.18968738615512848 1.155255913734436 -1.7009884119033813 -0.3098576068878174 1.3184670209884644 -1.7476675510406494 -0.06344041228294373 1.3184670209884644 -1.7476675510406494 -0.1805722862482071 1.6448893547058105 -1.8099662065505981 0.010655434802174568 1.155255913734436 -1.9013314247131348 -0.06344041228294373 1.3184670209884644 -1.7476675510406494 0.22171641886234283 2.178553581237793 -0.23867063224315643 0.2841486930847168 2.3417646884918213 -0.12378723174333572 0.380468487739563 2.668187141418457 -0.22592130303382874 0.40193918347358704 2.178553581237793 -0.058447763323783875 0.2841486930847168 2.3417646884918213 -0.12378723174333572 0.5054159164428711 2.3417646884918213 -0.12378720939159393 0.380468487739563 2.668187141418457 -0.22592130303382874 0.5821620225906372 2.178553581237793 -0.23867058753967285 0.5054159164428711 2.3417646884918213 -0.12378720939159393</float_array>
				<technique_common>
				<accessor source="#id-mesh-7-positions-array" count="448" stride="3">
					<param name="X" type="float"/>
					<param name="Y" type="float"/>
					<param name="Z" type="float"/>
				</accessor>
				</technique_common>
			</source>
			<source id="id-mesh-7-normals">
				<float_array id="id-mesh-7-normals-array" count="1344"> -0.9999844431877136 -0.005569695960730314 0.0002629020600579679 -0.8540298938751221 -0.5202105045318604 -0.0037270551547408104 -0.6821593046188354 -0.2698323726654053 0.6795948147773743 -0.7071524262428284 -0.022406719624996185 0.7067060470581055 -0.7000157833099365 0.13618241250514984 0.7010223269462585 -0.9898457527160645 0.14214599132537842 0.000208950528758578 -0.6974388957023621 0.16839949786663055 -0.6965777277946472 -0.7069790363311768 0.010074733756482601 -0.7071627378463745 -0.6851897239685059 -0.2418881207704544 -0.68702632188797 5.129905912326649e-05 0.014121987856924534 -0.9999002814292908 -0.0005581302102655172 -0.5084763765335083 -0.861075758934021 4.095756958122365e-05 0.16150687634944916 -0.9868714809417725 5.129905912326649e-05 0.014121987856924534 -0.9999002814292908 4.095756958122365e-05 0.16150687634944916 -0.9868714809417725 0.6981597542762756 0.1635342389345169 -0.6970146894454956 0.7069578170776367 0.005144970025867224 -0.7072370052337646 0.6840965151786804 -0.24615074694156647 -0.686601459980011 -0.0005581302102655172 -0.5084763765335083 -0.861075758934021 0.9999204277992249 -0.012614641338586807 0.00023607384355273098 0.8514760732650757 -0.5243801474571228 -0.0037440492305904627 0.9908212423324585 0.13517843186855316 0.00018680142238736153 0.7006275057792664 0.13125963509082794 0.7013501524925232 0.7070178985595703 -0.027336718514561653 0.7066671848297119 0.6809840202331543 -0.274044394493103 0.6790879368782043 2.4442324502160773e-05 -0.03228262811899185 0.999478816986084 -0.000575147510971874 -0.5359442234039307 0.8442531824111938 0.6809840202331543 -0.274044394493103 0.6790879368782043 0.7070178985595703 -0.027336718514561653 0.7066671848297119 0.7006275057792664 0.13125963509082794 0.7013501524925232 1.879968294815626e-05 0.11561242491006851 0.9932944178581238 -0.7000157833099365 0.13618241250514984 0.7010223269462585 -0.7071524262428284 -0.022406719624996185 0.7067060470581055 -0.6821593046188354 -0.2698323726654053 0.6795948147773743 -0.0020999442785978317 -0.9999020099639893 -0.013833333738148212 -0.8540298938751221 -0.5202105045318604 -0.0037270551547408104 -0.6851897239685059 -0.2418881207704544 -0.68702632188797 -0.0005581302102655172 -0.5084763765335083 -0.861075758934021 0.6840965151786804 -0.24615074694156647 -0.686601459980011 0.8514760732650757 -0.5243801474571228 -0.0037440492305904627 0.6809840202331543 -0.274044394493103 0.6790879368782043 -0.000575147510971874 -0.5359442234039307 0.8442531824111938 -0.6821593046188354 -0.2698323726654053 0.6795948147773743 -0.00523380609229207 0.2836391031742096 -0.9589167237281799 0.6140581965446472 0.4930366277694702 -0.6163175702095032 0.6815258264541626 0.26460620760917664 -0.6822800636291504 -0.0016492974245920777 0.2186703234910965 -0.9757974743843079 -0.00523380609229207 0.2836391031742096 -0.9589167237281799 -0.0016492974245920777 0.2186703234910965 -0.9757974743843079 -0.701144278049469 0.15528874099254608 -0.6959037780761719 -0.6552896499633789 0.4096016585826874 -0.6346826553344727 -0.6552896499633789 0.4096016585826874 -0.6346826553344727 -0.06568051874637604 0.9963523745536804 0.054479558020830154 -0.9466204047203064 -0.32232242822647095 -0.00425378093495965 -0.5080379247665405 -0.8613013625144958 -0.00757621368393302 -0.39684489369392395 -0.8270025849342346 0.3982219994068146 -0.667697012424469 -0.3258376717567444 0.6693359017372131 -0.9466204047203064 -0.32232242822647095 -0.00425378093495965 -0.667697012424469 -0.3258376717567444 0.6693359017372131 -0.7059230208396912 0.06064969301223755 0.7056871056556702 -0.997340977191925 0.07287553697824478 0.00024148060765583068 -0.6754889488220215 -0.2586668133735657 -0.6905115842819214 -0.40879276394844055 -0.8077514171600342 -0.4247659742832184 -0.5080379247665405 -0.8613013625144958 -0.00757621368393302 0.0033220259938389063 -0.21617908775806427 -0.9763480424880981 0.010356133803725243 -0.8344765305519104 -0.5509461760520935 -0.40879276394844055 -0.8077514171600342 -0.4247659742832184 -0.6754889488220215 -0.2586668133735657 -0.6905115842819214 0.0033220259938389063 -0.21617908775806427 -0.9763480424880981 0.0033220259938389063 -0.21617908775806427 -0.9763480424880981 0.696395754814148 -0.177654430270195 -0.6953214406967163 0.696395754814148 -0.177654430270195 -0.6953214406967163 0.4413250684738159 -0.7822401523590088 -0.43969595432281494 0.9785112142562866 -0.2061769664287567 -0.002599891275167465 0.5549918413162231 -0.8318104147911072 -0.008691851980984211 0.4413250684738159 -0.7822401523590088 -0.43969595432281494 0.9727800488471985 0.231725811958313 0.0014612332452088594 0.6933902502059937 0.17433536052703857 0.6991544961929321 0.6927686929702759 -0.24487578868865967 0.6783122420310974 0.42890360951423645 -0.8035784959793091 0.4126783311367035 0.004976618569344282 -0.3125362992286682 0.9498927593231201 0.009240459650754929 -0.85895174741745 0.511972963809967 0.42890360951423645 -0.8035784959793091 0.4126783311367035 0.6927686929702759 -0.24487578868865967 0.6783122420310974 0.6933902502059937 0.17433536052703857 0.6991544961929321 -0.00042701209895312786 0.08679710328578949 0.9962259531021118 -0.7059230208396912 0.06064969301223755 0.7056871056556702 -0.667697012424469 -0.3258376717567444 0.6693359017372131 0.004976618569344282 -0.3125362992286682 0.9498927593231201 0.009240459650754929 -0.85895174741745 0.511972963809967 0.0038739449810236692 -0.9999873042106628 -0.0032144784927368164 0.5549918413162231 -0.8318104147911072 -0.008691851980984211 0.42890360951423645 -0.8035784959793091 0.4126783311367035 0.004833180923014879 0.19490499794483185 -0.980810284614563 0.6718598008155823 0.3384562134742737 -0.6588259935379028 0.7069216966629028 0.06014499440789223 -0.7047300934791565 0.0005871981848031282 0.11680871993303299 -0.9931542277336121 0.004833180923014879 0.19490499794483185 -0.980810284614563 0.0005871981848031282 0.11680871993303299 -0.9931542277336121 -0.6941306591033936 0.1808110624551773 -0.6967712044715881 -0.6320090293884277 0.43483152985572815 -0.6414717435836792 -0.6320090293884277 0.43483152985572815 -0.6414717435836792 0.0727909579873085 0.997140109539032 0.0203224066644907 -0.9984647631645203 0.055389154702425 0.0005158169660717249 -0.8881633281707764 -0.4595142900943756 -0.0035563104320317507 -0.6956455111503601 -0.21235966682434082 0.686280369758606 -0.7075445652008057 0.013054728507995605 0.7065480947494507 -0.6973554491996765 0.14754588901996613 0.7013741731643677 -0.9840643405914307 0.17781247198581696 0.00034784837043844163 -0.7063931822776794 0.046513110399246216 -0.7062898278236389 -0.6977754831314087 -0.182460218667984 -0.6926887035369873 0.0009956543799489737 -0.006383137311786413 -0.9999790787696838 -0.013493526726961136 -0.49834880232810974 -0.8668715953826904 0.0009956543799489737 -0.006383137311786413 -0.9999790787696838 0.7036622166633606 -0.07321149855852127 -0.7067528367042542 0.672075092792511 -0.2879139482975006 -0.682217538356781 -0.013493526726961136 -0.49834880232810974 -0.8668715953826904 0.9933381676673889 -0.11523657292127609 -0.0001366056822007522 0.8258539438247681 -0.5638696551322937 -0.004042609594762325 0.9999832510948181 0.00580019224435091 -0.00018680760695133358 0.7072808146476746 0.02585010603070259 0.7064599394798279 0.7019914984703064 -0.10647488385438919 0.7041811347007751 0.6678348779678345 -0.3164348006248474 0.6736955046653748 0.0003378348774276674 -0.05413399636745453 0.9985336065292358 -0.013978022150695324 -0.5275031924247742 0.8494380116462708 0.6678348779678345 -0.3164348006248474 0.6736955046653748 0.7019914984703064 -0.10647488385438919 0.7041811347007751 0.7072808146476746 0.02585010603070259 0.7064599394798279 4.7817055019550025e-05 0.06865265220403671 0.9976405501365662 -0.6973554491996765 0.14754588901996613 0.7013741731643677 -0.7075445652008057 0.013054728507995605 0.7065480947494507 -0.6956455111503601 -0.21235966682434082 0.686280369758606 -0.054601870477199554 -0.9983915090560913 -0.015263555571436882 -0.054601870477199554 -0.9983915090560913 -0.015263555571436882 -0.013493526726961136 -0.49834880232810974 -0.8668715953826904 0.672075092792511 -0.2879139482975006 -0.682217538356781 0.8258539438247681 -0.5638696551322937 -0.004042609594762325 0.6678348779678345 -0.3164348006248474 0.6736955046653748 -0.013978022150695324 -0.5275031924247742 0.8494380116462708 -0.054601870477199554 -0.9983915090560913 -0.015263555571436882 -0.8881633281707764 -0.4595142900943756 -0.0035563104320317507 0.004051777999848127 0.3158406615257263 -0.9488036632537842 0.6356950998306274 0.46847525238990784 -0.6135328412055969 0.700901985168457 0.1607026755809784 -0.6949180364608765 0.0009638200281187892 0.2120092362165451 -0.9772671461105347 0.004051777999848127 0.3158406615257263 -0.9488036632537842 0.0009638200281187892 0.2120092362165451 -0.9772671461105347 -0.6891873478889465 0.23086398839950562 -0.6868206262588501 -0.6084379553794861 0.5180267095565796 -0.6012084484100342 -0.6084379553794861 0.5180267095565796 -0.6012084484100342 0.03945071995258331 0.9965071678161621 0.07360108196735382 -0.9996389746665955 0.026819555088877678 0.0016092410078272223 -0.8662355542182922 -0.49941328167915344 -0.014911807142198086 -0.6822275519371033 -0.297710657119751 0.6677828431129456 -0.7078213691711426 -0.05480921268463135 0.7042618989944458 -0.7015443444252014 0.09854315966367722 0.7057795524597168 -0.985598087310791 0.16909942030906677 0.0012776338262483478 -0.7050567269325256 0.07851110398769379 -0.7047915458679199 -0.6932951211929321 -0.18246273696422577 -0.6971723437309265 0.0012365799630060792 0.07108424603939056 -0.9974694848060608 -0.007709390949457884 -0.4724894165992737 -0.8813027143478394 0.0012365799630060792 0.07108424603939056 -0.9974694848060608 0.7063408493995667 0.007013220805674791 -0.7078372240066528 0.6786519885063171 -0.24494695663452148 -0.6924105882644653 -0.007709390949457884 -0.4724894165992737 -0.8813027143478394 0.9971510767936707 -0.07542906701564789 4.976742502549314e-07 0.8287910223007202 -0.5593334436416626 -0.015856731683015823 0.9977687001228333 0.06676530838012695 -3.656296757981181e-05 0.7065614461898804 0.025364283472299576 0.7071971297264099 0.7023612260818481 -0.12598666548728943 0.7005826830863953 0.6628003120422363 -0.35694366693496704 0.6582452654838562 -0.0003608321421779692 -0.11915644258260727 0.9928753972053528 -0.008658676408231258 -0.584130585193634 0.8116135001182556 0.6628003120422363 -0.35694366693496704 0.6582452654838562 0.7023612260818481 -0.12598666548728943 0.7005826830863953 0.7065614461898804 0.025364283472299576 0.7071971297264099 -0.0003413357480894774 0.021659379824995995 0.9997654557228088 -0.7015443444252014 0.09854315966367722 0.7057795524597168 -0.7078213691711426 -0.05480921268463135 0.7042618989944458 -0.6822275519371033 -0.297710657119751 0.6677828431129456 -0.030186237767338753 -0.9979626536369324 -0.05620899796485901 -0.030186237767338753 -0.9979626536369324 -0.05620899796485901 -0.007709390949457884 -0.4724894165992737 -0.8813027143478394 0.6786519885063171 -0.24494695663452148 -0.6924105882644653 0.8287910223007202 -0.5593334436416626 -0.015856731683015823 0.6628003120422363 -0.35694366693496704 0.6582452654838562 -0.008658676408231258 -0.584130585193634 0.8116135001182556 -0.6822275519371033 -0.297710657119751 0.6677828431129456 -0.8662355542182922 -0.49941328167915344 -0.014911807142198086 -0.001269969972781837 0.3450922667980194 -0.9385678768157959 0.6132827401161194 0.5168420076370239 -0.5972927808761597 0.6896941661834717 0.23629377782344818 -0.684461236000061 -0.0003910564410034567 0.24507549405097961 -0.9695038795471191 -0.001269969972781837 0.3450922667980194 -0.9385678768157959 -0.0003910564410034567 0.24507549405097961 -0.9695038795471191 -0.6938566565513611 0.21456056833267212 -0.6874058246612549 -0.6220454573631287 0.5015539526939392 -0.6012513637542725 -0.6220454573631287 0.5015539526939392 -0.6012513637542725 -0.012366602197289467 0.9960758090019226 0.08763596415519714 -0.9967440962791443 -0.08062983304262161 -0.0002787518023978919 -0.7761116623878479 -0.6303192973136902 -0.018660642206668854 -0.6234347820281982 -0.48772451281547546 0.6111086010932922 -0.7014291286468506 -0.15097486972808838 0.6965656280517578 -0.7051233649253845 0.05508795753121376 0.7069416046142578 -0.9929510951042175 0.11852139979600906 0.0009625091915950179 -0.7063568234443665 0.002301021246239543 -0.7078521847724915 -0.6458560228347778 -0.3803856372833252 -0.6619492173194885 -0.00033749802969396114 0.04608016461133957 -0.9989376664161682 0.002614453202113509 -0.5687759518623352 -0.8224883675575256 -0.00033749802969396114 0.04608016461133957 -0.9989376664161682 0.7066094279289246 0.02413896657526493 -0.7071920037269592 0.6523984670639038 -0.36455827951431274 -0.6644346117973328 0.002614453202113509 -0.5687759518623352 -0.8224883675575256 0.9987779259681702 -0.04942254349589348 0.0003715927596203983 0.7880150675773621 -0.6153730750083923 -0.018663417547941208 0.9885972738265991 0.15057651698589325 0.0014409600989893079 0.7034327983856201 0.07811170071363449 0.7064564824104309 0.7040410041809082 -0.1294996291399002 0.6982521414756775 0.6310986876487732 -0.4731181561946869 0.6147142648696899 0.00030496620456688106 -0.17408663034439087 0.9847303032875061 0.0026133384089916945 -0.6741945743560791 0.7385491132736206 0.6310986876487732 -0.4731181561946869 0.6147142648696899 0.7040410041809082 -0.1294996291399002 0.6982521414756775 0.7034327983856201 0.07811170071363449 0.7064564824104309 8.099953265627846e-05 0.019237905740737915 0.9998149275779724 -0.7051233649253845 0.05508795753121376 0.7069416046142578 -0.7014291286468506 -0.15097486972808838 0.6965656280517578 -0.6234347820281982 -0.48772451281547546 0.6111086010932922 0.005683163646608591 -0.9991809129714966 -0.04006441310048103 -0.7761116623878479 -0.6303192973136902 -0.018660642206668854 -0.6458560228347778 -0.3803856372833252 -0.6619492173194885 0.002614453202113509 -0.5687759518623352 -0.8224883675575256 0.6523984670639038 -0.36455827951431274 -0.6644346117973328 0.7880150675773621 -0.6153730750083923 -0.018663417547941208 0.6310986876487732 -0.4731181561946869 0.6147142648696899 0.0026133384089916945 -0.6741945743560791 0.7385491132736206 -0.6234347820281982 -0.48772451281547546 0.6111086010932922 0.0012523237382993102 0.36818090081214905 -0.9297533631324768 0.6332302689552307 0.4884492754936218 -0.6003638505935669 0.689834713935852 0.25071391463279724 -0.6791689991950989 0.0005350631545297801 0.3003561794757843 -0.9538270235061646 0.0012523237382993102 0.36818090081214905 -0.9297533631324768 0.0005350631545297801 0.3003561794757843 -0.9538270235061646 -0.684623658657074 0.2744655907154083 -0.6752475500106812 -0.623437762260437 0.5063138604164124 -0.5957949161529541 -0.623437762260437 0.5063138604164124 -0.5957949161529541 0.01478494331240654 0.988792359828949 0.14856334030628204 -0.9939707517623901 -0.10963111370801926 -0.0017669453518465161 -0.7176167368888855 -0.6958379745483398 -0.028909912332892418 -0.5622249245643616 -0.6295607686042786 0.5362429022789001 -0.6964752674102783 -0.22322678565979004 0.6819764971733093 -0.7058383226394653 0.024436920881271362 0.7079513072967529 -0.9892619848251343 0.14613595604896545 0.002262411406263709 -0.7061314582824707 0.003767705289646983 -0.708070695400238 -0.6000860929489136 -0.5018595457077026 -0.6229234337806702 0.00038024046807549894 0.0408100001513958 -0.9991669058799744 -0.0030231988057494164 -0.633517324924469 -0.7737225890159607 0.00038024046807549894 0.0408100001513958 -0.9991669058799744 0.7051428556442261 -0.0192718505859375 -0.7088034152984619 0.5919137597084045 -0.5153677463531494 -0.6197049021720886 -0.0030231988057494164 -0.633517324924469 -0.7737225890159607 0.9898178577423096 -0.14230896532535553 -0.002926857443526387 0.7045159935951233 -0.7091149687767029 -0.028516165912151337 0.9939018487930298 0.1102585643529892 0.0014625567710027099 0.7066669464111328 -0.0014927821466699243 0.7075448632240295 0.6918362975120544 -0.24533231556415558 0.6790984869003296 0.5530589818954468 -0.6411535739898682 0.5320225358009338 -0.0007533047464676201 -0.2854328155517578 0.9583984017372131 -0.002637156518176198 -0.7652856707572937 0.6436852812767029 0.5530589818954468 -0.6411535739898682 0.5320225358009338 0.6918362975120544 -0.24533231556415558 0.6790984869003296 0.7066669464111328 -0.0014927821466699243 0.7075448632240295 -0.0002367823472013697 -0.055374134331941605 0.9984657168388367 -0.7058383226394653 0.024436920881271362 0.7079513072967529 -0.6964752674102783 -0.22322678565979004 0.6819764971733093 -0.5622249245643616 -0.6295607686042786 0.5362429022789001 -0.003446242306381464 -0.9994062781333923 -0.034279752522706985 -0.7176167368888855 -0.6958379745483398 -0.028909912332892418 -0.6000860929489136 -0.5018595457077026 -0.6229234337806702 -0.0030231988057494164 -0.633517324924469 -0.7737225890159607 0.5919137597084045 -0.5153677463531494 -0.6197049021720886 0.7045159935951233 -0.7091149687767029 -0.028516165912151337 0.5530589818954468 -0.6411535739898682 0.5320225358009338 -0.002637156518176198 -0.7652856707572937 0.6436852812767029 -0.5622249245643616 -0.6295607686042786 0.5362429022789001 -0.0024191613774746656 0.19662325084209442 -0.9804761409759521 0.642829418182373 0.4126606285572052 -0.6453537940979004 0.6985592842102051 0.15206019580364227 -0.6992086172103882 -0.0002991108049172908 0.11822613328695297 -0.9929866790771484 -0.0024191613774746656 0.19662325084209442 -0.9804761409759521 -0.0002991108049172908 0.11822613328695297 -0.9929866790771484 -0.7049990296363831 0.0919552892446518 -0.7032216191291809 -0.6627637147903442 0.3647019565105438 -0.6540158987045288 -0.6627637147903442 0.3647019565105438 -0.6540158987045288 -0.03625178709626198 0.9991108775138855 0.02152508683502674 -0.9973537921905518 -0.07270106673240662 2.5152114176307805e-05 -0.8422117829322815 -0.5391308069229126 -0.004180236719548702 -0.6754306554794312 -0.29224395751953125 0.6770429015159607 -0.7047181129455566 -0.07766779512166977 0.7052234411239624 -0.7061694860458374 0.05584225058555603 0.7058373093605042 -0.9987643361091614 0.04969748109579086 -4.9898819270310923e-05 -0.7057451009750366 -0.0423332154750824 -0.7071998715400696 -0.6793938875198364 -0.26165419816970825 -0.6855370998382568 -0.0005057997768744826 -0.004949069116264582 -0.9999876022338867 0.006709190551191568 -0.49795350432395935 -0.8671777844429016 -0.0005057997768744826 -0.004949069116264582 -0.9999876022338867 0.7070713043212891 0.01732730120420456 -0.7069299221038818 0.6922073364257812 -0.2091456949710846 -0.6907293796539307 0.006709190551191568 -0.49795350432395935 -0.8671777844429016 0.9999232888221741 0.01238079834729433 0.00037113865255378187 0.8732869625091553 -0.4871903955936432 -0.003925178200006485 0.9907807111740112 0.1354755014181137 0.00023361055355053395 0.7012438178062439 0.1164928749203682 0.7033395767211914 0.7075353264808655 -0.018110662698745728 0.7064458727836609 0.6893563270568848 -0.24046380817890167 0.6833482980728149 -0.00015965907368808985 -0.055488221347332 0.9984593391418457 0.006963626015931368 -0.5287972092628479 0.8487196564674377 0.6893563270568848 -0.24046380817890167 0.6833482980728149 0.7075353264808655 -0.018110662698745728 0.7064458727836609 0.7012438178062439 0.1164928749203682 0.7033395767211914 -1.5564020941383205e-05 0.06727026402950287 0.9977348446846008 -0.7061694860458374 0.05584225058555603 0.7058373093605042 -0.7047181129455566 -0.07766779512166977 0.7052234411239624 -0.6754306554794312 -0.29224395751953125 0.6770429015159607 0.027148958295583725 -0.9995014071464539 -0.0161233302205801 -0.8422117829322815 -0.5391308069229126 -0.004180236719548702 -0.6793938875198364 -0.26165419816970825 -0.6855370998382568 0.006709190551191568 -0.49795350432395935 -0.8671777844429016 0.027148958295583725 -0.9995014071464539 -0.0161233302205801 0.8732869625091553 -0.4871903955936432 -0.003925178200006485 0.6893563270568848 -0.24046380817890167 0.6833482980728149 0.006963626015931368 -0.5287972092628479 0.8487196564674377 -0.6754306554794312 -0.29224395751953125 0.6770429015159607 -0.9990578293800354 0.0433964766561985 -0.00048438296653330326 -0.5492273569107056 -0.8356640338897705 0.0038715042173862457 -0.433891236782074 -0.7917567491531372 0.42995309829711914 -0.7061188817024231 0.04489166662096977 0.7066687941551208 -0.39553380012512207 0.8272895216941833 0.3989298939704895 -0.5009964108467102 0.8654428720474243 -0.0033406454604119062 -0.40083715319633484 0.8190025091171265 -0.410566121339798 -0.7065190672874451 0.023270249366760254 -0.7073113918304443 -0.42830678820610046 -0.8012563586235046 -0.4177817106246948 -0.00010509226558497176 -0.004173812922090292 -0.9999911785125732 -0.007617497351020575 -0.8531465530395508 -0.5216155648231506 -0.42830678820610046 -0.8012563586235046 -0.4177817106246948 -0.7065190672874451 0.023270249366760254 -0.7073113918304443 -0.00010509226558497176 -0.004173812922090292 -0.9999911785125732 0.0077354274690151215 0.8494145274162292 -0.5276695489883423 -0.00010509226558497176 -0.004173812922090292 -0.9999911785125732 0.0077354274690151215 0.8494145274162292 -0.5276695489883423 0.4259745180606842 0.8001914620399475 -0.42218416929244995 0.7067875266075134 -0.02270999550819397 -0.7070612907409668 0.7067875266075134 -0.02270999550819397 -0.7070612907409668 0.40259864926338196 -0.820347249507904 -0.4061337113380432 0.9997716546058655 -0.021368199959397316 0.00024270088761113584 0.5117612481117249 -0.8591206669807434 0.003467867849394679 0.40259864926338196 -0.820347249507904 -0.4061337113380432 0.5374449491500854 0.8432905673980713 -0.003735573496669531 0.420479416847229 0.8091999292373657 0.4103565216064453 0.7070910930633545 -0.0011420828523114324 0.7071215510368347 0.4080100655555725 -0.8115992546081543 0.4181321859359741 0.0006211792933754623 0.02614828385412693 0.999657928943634 -0.008021308109164238 -0.8421427011489868 0.5391951203346252 0.4080100655555725 -0.8115992546081543 0.4181321859359741 0.7070910930633545 -0.0011420828523114324 0.7071215510368347 0.420479416847229 0.8091999292373657 0.4103565216064453 0.007340456824749708 0.8598058819770813 0.5105683207511902 -0.39553380012512207 0.8272895216941833 0.3989298939704895 -0.7061188817024231 0.04489166662096977 0.7066687941551208 -0.433891236782074 -0.7917567491531372 0.42995309829711914 -0.0030832416377961636 -0.9999942183494568 0.001445902744308114 -0.5492273569107056 -0.8356640338897705 0.0038715042173862457 0.5117612481117249 -0.8591206669807434 0.003467867849394679 0.4080100655555725 -0.8115992546081543 0.4181321859359741 -0.008021308109164238 -0.8421427011489868 0.5391951203346252 -0.433891236782074 -0.7917567491531372 0.42995309829711914 0.0031763813458383083 0.9999938011169434 -0.001489630900323391 0.0031763813458383083 0.9999938011169434 -0.001489630900323391 0.007340456824749708 0.8598058819770813 0.5105683207511902 0.007340456824749708 0.8598058819770813 0.5105683207511902 0.00031344930175691843 0.30030009150505066 -0.9538447260856628 0.6109099984169006 0.5084816217422485 -0.6068241000175476 0.00031344930175691843 0.30030009150505066 -0.9538447260856628 -0.6090437769889832 0.5116676688194275 -0.6060214042663574 -0.6090437769889832 0.5116676688194275 -0.6060214042663574 0.002429177053272724 0.9998689889907837 0.01600467786192894 -0.9589938521385193 0.28341951966285706 0.0020417356863617897 -0.6142216920852661 0.49047067761421204 0.6181990504264832 0.002429177053272724 0.9998689889907837 0.01600467786192894 0.0003046364290639758 0.26022106409072876 0.9655489921569824 -0.6142216920852661 0.49047067761421204 0.6181990504264832 0.6160469651222229 0.48721030354499817 0.6189606785774231 0.002429177053272724 0.9998689889907837 0.01600467786192894 0.9607711434364319 0.27733492851257324 0.002032902790233493 0.6160469651222229 0.48721030354499817 0.6189606785774231 -0.9892845153808594 0.1459539532661438 0.0036766824778169394 -0.6670383214950562 0.33493539690971375 0.665490984916687 -0.06568051874637604 0.9963523745536804 0.054479558020830154 -0.004516237881034613 0.15914951264858246 0.9872441291809082 -0.6670383214950562 0.33493539690971375 0.665490984916687 0.6295480728149414 0.4243147075176239 0.6508657336235046 -0.06568051874637604 0.9963523745536804 0.054479558020830154 0.9552046656608582 0.2959137260913849 0.004392361734062433 0.6295480728149414 0.4243147075176239 0.6508657336235046 -0.9674732685089111 0.25296884775161743 0.001474748132750392 -0.6373738646507263 0.40871307253837585 0.6532291769981384 0.0727909579873085 0.997140109539032 0.0203224066644907 0.004451810382306576 0.14882789552211761 0.9888530373573303 -0.6373738646507263 0.40871307253837585 0.6532291769981384 0.6755644679069519 0.31008416414260864 0.668924868106842 0.0727909579873085 0.997140109539032 0.0203224066644907 0.996086597442627 0.08837521821260452 0.001097276690416038 0.6755644679069519 0.31008416414260864 0.668924868106842 -0.960896372795105 0.2768121063709259 0.007304155733436346 -0.6303703188896179 0.4235096573829651 0.6505942344665527 0.03945071995258331 0.9965071678161621 0.07360108196735382 0.0033591892570257187 0.14117750525474548 0.9899786114692688 -0.6303703188896179 0.4235096573829651 0.6505942344665527 0.65458083152771 0.36891794204711914 0.6598662734031677 0.03945071995258331 0.9965071678161621 0.07360108196735382 0.9831044673919678 0.18292587995529175 0.006605884060263634 0.65458083152771 0.36891794204711914 0.6598662734031677 -0.9731804132461548 0.2298980951309204 0.00817198771983385 -0.6462031006813049 0.3857429623603821 0.6585012674331665 -0.012366602197289467 0.9960758090019226 0.08763596415519714 -0.0010409395908936858 0.1382584422826767 0.9903956055641174 -0.6462031006813049 0.3857429623603821 0.6585012674331665 0.6385517716407776 0.40294355154037476 0.6556585431098938 -0.012366602197289467 0.9960758090019226 0.08763596415519714 0.9657742977142334 0.25924769043922424 0.00840470939874649 0.6385517716407776 0.40294355154037476 0.6556585431098938 -0.9746819734573364 0.22333292663097382 0.010835891589522362 -0.6613366007804871 0.31168147921562195 0.6822671890258789 0.01478494331240654 0.988792359828949 0.14856334030628204 0.0007797154830768704 0.031016452237963676 0.9995185732841492 -0.6613366007804871 0.31168147921562195 0.6822671890258789 0.6687688231468201 0.29027101397514343 0.6844640374183655 0.01478494331240654 0.988792359828949 0.14856334030628204 0.9818575382232666 0.18933779001235962 0.010343273170292377 0.6687688231468201 0.29027101397514343 0.6844640374183655 -0.9913778901100159 0.13102823495864868 0.0012752774637192488 -0.66719651222229 0.33527278900146484 0.6651623845100403 -0.03625178709626198 0.9991108775138855 0.02152508683502674 -0.0022194075863808393 0.14788931608200073 0.989001452922821 -0.66719651222229 0.33527278900146484 0.6651623845100403 0.6481353044509888 0.3844221532344818 0.6573737859725952 -0.03625178709626198 0.9991108775138855 0.02152508683502674 0.9770365953445435 0.21306653320789337 0.001475042663514614 0.6481353044509888 0.3844221532344818 0.6573737859725952</float_array>
				<technique_common>
				<accessor source="#id-mesh-7-normals-array" count="448" stride="3">
					<param name="X" type="float"/>
					<param name="Y" type="float"/>
					<param name="Z" type="float"/>
				</accessor>
				</technique_common>
			</source>
			<source id="id-mesh-7-texcoord-0">
				<float_array id="id-mesh-7-texcoord-0-array" count="896"> 0.29553842544555664 0.8053617477416992 0.29486507177352905 0.7963498830795288 0.29790276288986206 0.7986202239990234 0.29912030696868896 0.8052526116371155 0.29912030696868896 0.8161218762397766 0.2963153123855591 0.8158546090126038 0.29356205463409424 0.8164006471633911 0.29195767641067505 0.805611789226532 0.29217779636383057 0.7989072203636169 0.29076552391052246 0.80588299036026 0.2909032106399536 0.7967824339866638 0.2924776077270508 0.8162735104560852 0.2906911373138428 0.8492666482925415 0.2924270033836365 0.8388835191726685 0.2936006784439087 0.838768720626831 0.29199743270874023 0.8495529294013977 0.2921783924102783 0.856249988079071 0.29080742597579956 0.8583609461784363 0.29561448097229004 0.8498086333274841 0.29489392042160034 0.8588108420372009 0.29638540744781494 0.8393195271492004 0.2991558313369751 0.8390486836433411 0.2991558313369751 0.8499136567115784 0.2978999614715576 0.8565382957458496 0.165357768535614 0.9578766226768494 0.1647159457206726 0.9668972492218018 0.16205251216888428 0.9642821550369263 0.16180795431137085 0.9575493931770325 0.1634092926979065 0.9468028545379639 0.16613620519638062 0.9474063515663147 0.1689571738243103 0.9472334980964661 0.1689571738243103 0.9581040740013123 0.16776669025421143 0.9647254943847656 0.2842273712158203 0.8623685836791992 0.27940213680267334 0.864424467086792 0.27945107221603394 0.8605837821960449 0.2824246883392334 0.8577383160591125 0.286466121673584 0.857937216758728 0.2891152501106262 0.8607600331306458 0.2891152501106262 0.8649482727050781 0.2860926389694214 0.8674459457397461 0.28210020065307617 0.867594838142395 0.07222622632980347 0.9820073246955872 0.07152193784713745 0.9839051365852356 0.07154399156570435 0.9764772653579712 0.07249283790588379 0.9759801030158997 0.04625171422958374 0.9781914353370667 0.04651767015457153 0.984165608882904 0.045645713806152344 0.9836782217025757 0.04559260606765747 0.9763138890266418 0.07165151834487915 0.9840570092201233 0.0706549882888794 0.9878623485565186 0.23017358779907227 0.9767577052116394 0.22924262285232544 0.9772000312805176 0.22791165113449097 0.9754238724708557 0.22841531038284302 0.9744152426719666 0.04283064603805542 0.9867578744888306 0.04011744260787964 0.9861629605293274 0.04093432426452637 0.982742965221405 0.04322052001953125 0.9837096929550171 0.04557007551193237 0.9872463345527649 0.04477161169052124 0.9879850745201111 0.0426861047744751 0.9879439473152161 0.22783005237579346 0.9814414381980896 0.22746777534484863 0.9807488322257996 0.22922396659851074 0.9793578386306763 0.23017358779907227 0.9796848893165588 0.04651767015457153 0.9872666001319885 0.07249283790588379 0.9728487730026245 0.0714564323425293 0.9728766083717346 0.22490012645721436 0.9814417958259583 0.22528862953186035 0.9806675314903259 0.06868791580200195 0.9733608365058899 0.06857198476791382 0.9721571207046509 0.07068067789077759 0.9721236824989319 0.06908959150314331 0.9764360785484314 0.06683284044265747 0.9773973226547241 0.06600403785705566 0.973941445350647 0.066611647605896 0.972918689250946 0.07566553354263306 0.9733603596687317 0.07552367448806763 0.972155749797821 0.07758885622024536 0.9721236824989319 0.07838702201843262 0.9728836417198181 0.07838702201843262 0.9764637351036072 0.0759882926940918 0.9764214158058167 0.07366931438446045 0.9773626327514648 0.07292681932449341 0.9739220142364502 0.2254856824874878 0.9744143486022949 0.22569167613983154 0.9754248857498169 0.22655397653579712 0.9781408905982971 0.2239166498184204 0.9789751172065735 0.22397631406784058 0.9767351150512695 0.3010268211364746 0.940771222114563 0.3019341826438904 0.9390713572502136 0.30056947469711304 0.9481266736984253 0.29965972900390625 0.948423445224762 0.3009234666824341 0.9086629748344421 0.3014140725135803 0.9164968132972717 0.3006129264831543 0.9160999655723572 0.300254225730896 0.9068570137023926 0.30185234546661377 0.9389188289642334 0.30330991744995117 0.9354352355003357 0.2979176640510559 0.925209641456604 0.29750704765319824 0.9321131706237793 0.2956086993217468 0.9300990700721741 0.2953214645385742 0.9249388575553894 0.2963460683822632 0.9157404899597168 0.29844629764556885 0.9164210557937622 0.3005269765853882 0.9253788590431213 0.29963254928588867 0.9304388165473938 0.3014140725135803 0.9252989292144775 0.3002833127975464 0.932184100151062 0.2986714839935303 0.9570797681808472 0.2996283769607544 0.9572626352310181 0.29992973804473877 0.9623316526412964 0.29902154207229614 0.963970959186554 0.3022671937942505 0.9573774337768555 0.30187666416168213 0.9642072319984436 0.30271196365356445 0.9486761093139648 0.3048478960990906 0.9482265114784241 0.3048478960990906 0.9573836922645569 0.3039640188217163 0.9624255299568176 0.30325645208358765 0.7861679792404175 0.3029300570487976 0.793076753616333 0.301037073135376 0.7909687161445618 0.30069029331207275 0.7857719659805298 0.3016231060028076 0.7766178250312805 0.30370181798934937 0.7773993015289307 0.3058633804321289 0.7772096991539001 0.3058633804321289 0.7864941358566284 0.3050355911254883 0.7915269732475281 0.29738903045654297 0.9342663288116455 0.07866275310516357 0.9308000802993774 0.07834547758102417 0.9334205985069275 0.07624948024749756 0.9324507117271423 0.07574373483657837 0.9305018186569214 0.07648080587387085 0.9284214973449707 0.07866275310516357 0.9279017448425293 0.30287981033325195 0.79527747631073 0.3057326674461365 0.7933472394943237 0.14035379886627197 0.965991199016571 0.14128029346466064 0.9646567106246948 0.1398707628250122 0.9721521139144897 0.1389259696006775 0.972395658493042 0.30541956424713135 0.8323147892951965 0.30593645572662354 0.8388903737068176 0.30510562658309937 0.8385260701179504 0.30472874641418457 0.830863356590271 0.1411876678466797 0.9645064473152161 0.14266782999038696 0.9617749452590942 0.30228352546691895 0.8466832041740417 0.3017933964729309 0.8533598184585571 0.29981690645217896 0.8512032628059387 0.2995898723602295 0.8461589217185974 0.3007538318634033 0.8377681374549866 0.3028934597969055 0.8385422229766846 0.305000364780426 0.8471015691757202 0.30404895544052124 0.8519408702850342 0.30593645572662354 0.8471007943153381 0.30474036931991577 0.8536965847015381 0.13778191804885864 0.9804785847663879 0.1387975811958313 0.9806100130081177 0.13904500007629395 0.9855007529258728 0.13804656267166138 0.9871330261230469 0.14157384634017944 0.9805641770362854 0.14110541343688965 0.9872023463249207 0.1420847773551941 0.9724669456481934 0.14428246021270752 0.9719899296760559 0.14428246021270752 0.9804083108901978 0.1433355212211609 0.9853430986404419 0.22658014297485352 0.9534725546836853 0.22605878114700317 0.9621433615684509 0.22343307733535767 0.9595122337341309 0.2230404019355774 0.9530013203620911 0.22443610429763794 0.9420982599258423 0.22725218534469604 0.9429327845573425 0.23017358779907227 0.9427775740623474 0.23017358779907227 0.9538460969924927 0.2290128469467163 0.960172712802887 0.3016643524169922 0.8554290533065796 0.2895491123199463 0.8986541628837585 0.28825056552886963 0.9018858671188354 0.28599870204925537 0.8996224999427795 0.28595227003097534 0.8969292044639587 0.2879306674003601 0.8943484425544739 0.2909073233604431 0.8946337699890137 0.29320573806762695 0.8962841629981995 0.29320573806762695 0.8995904922485352 0.29585957527160645 0.7387881278991699 0.297105610370636 0.7370314598083496 0.2952626943588257 0.7456899285316467 0.2940291166305542 0.7460155487060547 0.18574917316436768 0.9797411561012268 0.18393546342849731 0.972525954246521 0.18507611751556396 0.972854495048523 0.1869378685951233 0.981498658657074 0.29698216915130615 0.7368322610855103 0.2989889979362488 0.7332360148429871 0.1873798370361328 0.9654213786125183 0.1869755983352661 0.9602935314178467 0.18970412015914917 0.9618033170700073 0.19081473350524902 0.9656298160552979 0.19081473350524902 0.9730919003486633 0.187916100025177 0.9724565148353577 0.18393421173095703 0.9653470516204834 0.18444448709487915 0.9615858197212219 0.1827700138092041 0.9655019044876099 0.18336951732635498 0.9603562951087952 0.2928469181060791 0.7530507445335388 0.2941210865974426 0.753211498260498 0.2945958375930786 0.75697922706604 0.2934330105781555 0.7582070231437683 0.2976020574569702 0.7531431317329407 0.2971528172492981 0.7582792043685913 0.2981352210044861 0.7460947036743164 0.3009979724884033 0.7454606294631958 0.3009979724884033 0.7529363632202148 0.29985225200653076 0.7567691206932068 0.12361937761306763 0.9664741158485413 0.12320423126220703 0.9613849520683289 0.12591606378555298 0.9625164270401001 0.12703204154968262 0.9662086963653564 0.12703204154968262 0.973661482334137 0.1241530179977417 0.9734286069869995 0.1213144063949585 0.9741892218589783 0.12017583847045898 0.9668421745300293 0.12067538499832153 0.9630005359649658 0.03057241439819336 0.9764735698699951 0.02722024917602539 0.9779340624809265 0.0272713303565979 0.9753386378288269 0.029406070709228516 0.9733526110649109 0.03223276138305664 0.973582923412323 0.03399050235748291 0.9755380749702454 0.03399050235748291 0.9785415530204773 0.031804561614990234 0.9801191687583923 0.02902907133102417 0.9802975654602051 0.2852799892425537 0.9767007827758789 0.2845538854598999 0.9786948561668396 0.28473901748657227 0.9706223011016846 0.28566884994506836 0.9700383543968201 0.16761678457260132 0.9734298586845398 0.16800624132156372 0.9801015853881836 0.16714930534362793 0.9795332551002502 0.16693377494812012 0.9714421033859253 0.2846912741661072 0.9788303375244141 0.2836396098136902 0.9827940464019775 0.16442590951919556 0.9839755892753601 0.16419750452041626 0.9866394996643066 0.16229116916656494 0.9853364825248718 0.16180795431137085 0.9831814169883728 0.16265231370925903 0.9782670736312866 0.16484302282333374 0.979407548904419 0.16707760095596313 0.9846660494804382 0.1662575602531433 0.986452579498291 0.16800624132156372 0.9847603440284729 0.1669408679008484 0.9872404336929321 0.28566884994506836 0.965386688709259 0.2846539616584778 0.9655003547668457 0.28385651111602783 0.963714063167572 0.28460460901260376 0.9629130959510803 0.2819772958755493 0.9662049412727356 0.2817761301994324 0.9635404348373413 0.28240758180618286 0.9707602858543396 0.28024768829345703 0.9719017148017883 0.27939170598983765 0.9669994115829468 0.27989596128463745 0.9648424983024597 0.30455082654953003 0.9192481637001038 0.304357647895813 0.9218600988388062 0.302379310131073 0.9209320545196533 0.3018481731414795 0.9189308285713196 0.3026465177536011 0.9140746593475342 0.3049148917198181 0.914797306060791 0.3072932958602905 0.9145539402961731 0.3072932958602905 0.9194920063018799 0.3064778447151184 0.9213545918464661 0.25279319286346436 0.9803381562232971 0.25550490617752075 0.9810395240783691 0.25420111417770386 0.9826152324676514 0.2519679665565491 0.9828042387962341 0.2502936124801636 0.9813089370727539 0.25020092725753784 0.9792662858963013 0.25159752368927 0.9774020314216614 0.2537379264831543 0.9775012135505676 0.25550490617752075 0.9787083864212036 0.30033791065216064 0.8938498497009277 0.29962921142578125 0.8956538438796997 0.29995810985565186 0.8864318132400513 0.3008279800415039 0.8860337138175964 0.3018837571144104 0.8198500275611877 0.30052900314331055 0.8121768832206726 0.30136919021606445 0.8124800324440002 0.30274873971939087 0.8215585947036743 0.2997271418571472 0.8957961797714233 0.29867398738861084 0.8994469046592712 0.30303966999053955 0.8032025098800659 0.30268359184265137 0.7963498830795288 0.30479347705841064 0.7981317043304443 0.305649995803833 0.8031890392303467 0.305649995803833 0.8123728632926941 0.30348730087280273 0.8119284510612488 0.3004276752471924 0.8033199906349182 0.3007567524909973 0.7982328534126282 0.29955434799194336 0.8034955263137817 0.29991614818573 0.7965827584266663 0.3008279800415039 0.8772529363632202 0.299856960773468 0.8771764636039734 0.2989821434020996 0.8721307516098022 0.2996981739997864 0.870387852191925 0.29722148180007935 0.8773514032363892 0.2968345880508423 0.8704656362533569 0.29776686429977417 0.8861170411109924 0.29569464921951294 0.8868014216423035 0.29465556144714355 0.877627432346344 0.2949618101119995 0.8724799752235413 0.3038736581802368 0.8751992583274841 0.3035060167312622 0.8683174848556519 0.3055983781814575 0.8699524402618408 0.3064621686935425 0.8749918937683105 0.3064621686935425 0.884227991104126 0.3043184280395508 0.8839426040649414 0.30219966173171997 0.8846315741539001 0.30126214027404785 0.8754844665527344 0.30157923698425293 0.8703329563140869 0.03696250915527344 0.9757997393608093 0.0361630916595459 0.9785941243171692 0.03455173969268799 0.9773796796798706 0.03442448377609253 0.9750936627388 0.2968063950538635 0.8683174848556519 0.03792619705200195 0.9733526110649109 0.0396648645401001 0.9748374819755554 0.0396648645401001 0.9768531322479248 0.038378119468688965 0.9786639213562012 0.07692819833755493 0.9237539768218994 0.07574373483657837 0.9235365986824036 0.07641720771789551 0.9215494394302368 0.07739853858947754 0.921010434627533 0.07824641466140747 0.9219157695770264 0.07822024822235107 0.9239910244941711 0.07763439416885376 0.9259655475616455 0.07656550407409668 0.926518976688385 0.07579630613327026 0.9256603121757507 0.2346455454826355 0.9839231371879578 0.23467940092086792 0.9830219149589539 0.2367161512374878 0.9822220206260681 0.23739886283874512 0.9829067587852478 0.07658791542053223 0.9274677038192749 0.07796728610992432 0.9267489314079285 0.07660377025604248 0.9140319228172302 0.07797324657440186 0.9147594571113586 0.07764661312103271 0.9156060218811035 0.07658672332763672 0.9150705933570862 0.23183166980743408 0.9830847382545471 0.2325618863105774 0.9823560118675232 0.07694852352142334 0.9178640842437744 0.07577109336853027 0.9180429577827454 0.0758218765258789 0.9159004092216492 0.07822936773300171 0.9176046252250671 0.07825428247451782 0.9196534156799316 0.07741367816925049 0.9205763936042786 0.07643884420394897 0.92000812292099 0.07738935947418213 0.9366022944450378 0.07619988918304443 0.9368695616722107 0.07626056671142578 0.9347537159919739 0.0770409107208252 0.9338545799255371 0.07808858156204224 0.9344014525413513 0.07866275310516357 0.9363542795181274 0.07866275310516357 0.9384565949440002 0.07782143354415894 0.9393701553344727 0.07684320211410522 0.9388698935508728 0.23460876941680908 0.9802104830741882 0.23739886283874512 0.9801220893859863 0.23177635669708252 0.9803021550178528 0.23242658376693726 0.9782025218009949 0.23449599742889404 0.9774020314216614 0.23658066987991333 0.9780696630477905 0.07879167795181274 0.9174115657806396 0.07879167795181274 0.9240979552268982 0.07879167795181274 0.921296238899231 0.07879167795181274 0.9202094674110413 0.2942899465560913 0.8318026065826416 0.29542267322540283 0.8305728435516357 0.29432475566864014 0.8233601450920105 0.2954053282737732 0.8245972394943237 0.29532498121261597 0.8303776383399963 0.2971292734146118 0.8278000950813293 0.29684776067733765 0.8230845332145691 0.298495888710022 0.8244423866271973 0.29715609550476074 0.8273661136627197 0.16668349504470825 0.9402033090591431 0.16834640502929688 0.9389055967330933 0.16526174545288086 0.9386662840843201 0.16703641414642334 0.9359681010246277 0.2968924045562744 0.8320891857147217 0.298511266708374 0.8307284712791443 0.0439678430557251 0.9778774380683899 0.04282176494598389 0.9757630825042725 0.04468083381652832 0.9723839163780212 0.07660210132598877 0.9822774529457092 0.07539933919906616 0.9843786358833313 0.07817405462265015 0.9838510155677795 0.07715976238250732 0.9877748489379883 0.0698695182800293 0.9823229312896729 0.06875145435333252 0.9844455122947693 0.2989179491996765 0.9086116552352905 0.2978101968765259 0.9066504836082458 0.2992587089538574 0.9030565619468689 0.30410730838775635 0.7696167826652527 0.3054293990135193 0.7679445147514343 0.3030005097389221 0.7676049470901489 0.3044227361679077 0.7641040086746216 0.3030892610549927 0.9409420490264893 0.304384708404541 0.9391285181045532 0.3033817410469055 0.8320818543434143 0.30226069688796997 0.8304333090782166 0.303716778755188 0.8278000950813293 0.22779852151870728 0.9345786571502686 0.22956043481826782 0.9329299926757812 0.2263064980506897 0.9325450658798218 0.22819435596466064 0.9290717244148254 0.14246916770935059 0.9660387635231018 0.143782377243042 0.9645649790763855 0.18846160173416138 0.9796947836875916 0.19025403261184692 0.9816352128982544 0.18886685371398926 0.9852875471115112 0.1246909499168396 0.9805747270584106 0.12316453456878662 0.9825662970542908 0.12646913528442383 0.9822616577148438 0.12507528066635132 0.986073911190033 0.29865747690200806 0.7388427257537842 0.30042004585266113 0.7368984222412109 0.16543811559677124 0.9729520082473755 0.16430461406707764 0.9707016944885254 0.16597461700439453 0.9673312306404114 0.3054361343383789 0.9085103869438171 0.3069564700126648 0.9068282246589661 0.30423951148986816 0.9065476655960083 0.30591410398483276 0.9030565619468689 0.28303366899490356 0.9771979451179504 0.2819286584854126 0.9794430136680603 0.30388301610946655 0.8196824789047241 0.3052007555961609 0.8214969038963318 0.30415916442871094 0.8251992464065552 0.30470550060272217 0.8917038440704346 0.30356788635253906 0.8936586380004883 0.30600935220718384 0.8934272527694702 0.3049592971801758 0.8972072601318359 0.29826873540878296 0.8939065337181091 0.29718726873397827 0.895865261554718</float_array>
				<technique_common>
				<accessor source="#id-mesh-7-texcoord-0-array" count="448" stride="2">
					<param name="S" type="float"/>
					<param name="T" type="float"/>
				</accessor>
				</technique_common>
			</source>
			<vertices id="id-mesh-7-vertices">
				<input semantic="POSITION" source="#id-mesh-7-positions"/>
			</vertices>
			<polygons count="248" material="id-trimat-8">
				<input semantic="VERTEX" source="#id-mesh-7-vertices" offset="0"/>
				<input semantic="NORMAL" source="#id-mesh-7-normals" offset="0"/>
				<input semantic="TEXCOORD" source="#id-mesh-7-texcoord-0" offset="0" set="0"/>
				<p> 0 1 2 3 </p>
				<p> 0 3 4 5 </p>
				<p> 0 5 6 7 </p>
				<p> 0 7 8 1 </p>
				<p> 9 10 8 7 </p>
				<p> 9 7 6 11 </p>
				<p> 12 13 14 15 </p>
				<p> 12 15 16 17 </p>
				<p> 18 19 16 15 </p>
				<p> 18 15 14 20 </p>
				<p> 18 20 21 22 </p>
				<p> 18 22 23 19 </p>
				<p> 24 25 26 27 </p>
				<p> 24 27 28 29 </p>
				<p> 24 29 30 31 </p>
				<p> 24 31 32 25 </p>
				<p> 33 34 35 36 </p>
				<p> 33 36 37 38 </p>
				<p> 33 38 39 40 </p>
				<p> 33 40 41 34 </p>
				<p> 42 43 44 45 </p>
				<p> 46 47 48 49 </p>
				<p> 42 50 51 43 </p>
				<p> 52 53 54 55 </p>
				<p> 56 57 58 59 </p>
				<p> 56 59 48 60 </p>
				<p> 56 60 61 62 </p>
				<p> 63 64 65 66 </p>
				<p> 67 60 48 47 </p>
				<p> 68 45 44 69 </p>
				<p> 63 70 71 64 </p>
				<p> 72 73 74 69 </p>
				<p> 72 69 44 75 </p>
				<p> 72 75 76 77 </p>
				<p> 72 77 78 73 </p>
				<p> 79 80 81 82 </p>
				<p> 79 82 83 84 </p>
				<p> 79 84 85 86 </p>
				<p> 87 55 54 88 </p>
				<p> 89 53 65 64 </p>
				<p> 89 64 71 90 </p>
				<p> 89 90 91 88 </p>
				<p> 89 88 54 53 </p>
				<p> 92 93 94 95 </p>
				<p> 96 97 98 99 </p>
				<p> 92 100 101 93 </p>
				<p> 102 103 104 105 </p>
				<p> 102 105 106 107 </p>
				<p> 102 107 98 108 </p>
				<p> 102 108 109 103 </p>
				<p> 110 111 109 108 </p>
				<p> 110 108 98 97 </p>
				<p> 112 95 94 113 </p>
				<p> 112 113 114 115 </p>
				<p> 116 117 114 113 </p>
				<p> 116 113 94 118 </p>
				<p> 116 118 119 120 </p>
				<p> 116 120 121 117 </p>
				<p> 122 123 124 125 </p>
				<p> 122 125 126 127 </p>
				<p> 122 127 128 129 </p>
				<p> 122 129 130 123 </p>
				<p> 131 103 109 111 </p>
				<p> 132 133 134 135 </p>
				<p> 132 135 136 137 </p>
				<p> 138 123 130 139 </p>
				<p> 140 141 142 143 </p>
				<p> 144 145 146 147 </p>
				<p> 140 148 149 141 </p>
				<p> 150 151 152 153 </p>
				<p> 150 153 154 155 </p>
				<p> 150 155 146 156 </p>
				<p> 150 156 157 151 </p>
				<p> 158 159 157 156 </p>
				<p> 158 156 146 145 </p>
				<p> 160 143 142 161 </p>
				<p> 160 161 162 163 </p>
				<p> 164 165 162 161 </p>
				<p> 164 161 142 166 </p>
				<p> 164 166 167 168 </p>
				<p> 164 168 169 165 </p>
				<p> 170 171 172 173 </p>
				<p> 170 173 174 175 </p>
				<p> 170 175 176 177 </p>
				<p> 170 177 178 171 </p>
				<p> 179 151 157 159 </p>
				<p> 180 181 182 183 </p>
				<p> 180 183 184 185 </p>
				<p> 180 185 186 187 </p>
				<p> 188 189 190 191 </p>
				<p> 192 193 194 195 </p>
				<p> 188 196 197 189 </p>
				<p> 198 199 200 201 </p>
				<p> 198 201 202 203 </p>
				<p> 198 203 194 204 </p>
				<p> 198 204 205 199 </p>
				<p> 206 207 205 204 </p>
				<p> 206 204 194 193 </p>
				<p> 208 191 190 209 </p>
				<p> 208 209 210 211 </p>
				<p> 212 213 210 209 </p>
				<p> 212 209 190 214 </p>
				<p> 212 214 215 216 </p>
				<p> 212 216 217 213 </p>
				<p> 218 219 220 221 </p>
				<p> 218 221 222 223 </p>
				<p> 218 223 224 225 </p>
				<p> 218 225 226 219 </p>
				<p> 227 228 229 230 </p>
				<p> 227 230 231 232 </p>
				<p> 227 232 233 234 </p>
				<p> 227 234 235 228 </p>
				<p> 236 237 238 239 </p>
				<p> 240 241 242 243 </p>
				<p> 236 244 245 237 </p>
				<p> 246 247 248 249 </p>
				<p> 246 249 250 251 </p>
				<p> 246 251 242 252 </p>
				<p> 246 252 253 247 </p>
				<p> 254 255 253 252 </p>
				<p> 254 252 242 241 </p>
				<p> 256 239 238 257 </p>
				<p> 256 257 258 259 </p>
				<p> 260 261 258 257 </p>
				<p> 260 257 238 262 </p>
				<p> 260 262 263 264 </p>
				<p> 260 264 265 261 </p>
				<p> 266 267 268 269 </p>
				<p> 266 269 270 271 </p>
				<p> 266 271 272 273 </p>
				<p> 266 273 274 267 </p>
				<p> 275 276 277 278 </p>
				<p> 275 278 279 280 </p>
				<p> 275 280 281 282 </p>
				<p> 275 282 283 276 </p>
				<p> 284 285 286 287 </p>
				<p> 288 289 290 291 </p>
				<p> 284 292 293 285 </p>
				<p> 294 295 296 297 </p>
				<p> 294 297 298 299 </p>
				<p> 294 299 290 300 </p>
				<p> 294 300 301 295 </p>
				<p> 302 303 301 300 </p>
				<p> 302 300 290 289 </p>
				<p> 304 287 286 305 </p>
				<p> 304 305 306 307 </p>
				<p> 308 309 306 305 </p>
				<p> 308 305 286 310 </p>
				<p> 308 310 311 312 </p>
				<p> 308 312 313 309 </p>
				<p> 314 315 316 317 </p>
				<p> 314 317 318 319 </p>
				<p> 314 319 320 321 </p>
				<p> 314 321 322 315 </p>
				<p> 323 324 325 326 </p>
				<p> 327 307 306 309 </p>
				<p> 323 328 329 330 </p>
				<p> 323 330 331 324 </p>
				<p> 332 333 334 335 </p>
				<p> 332 335 336 337 </p>
				<p> 332 337 338 339 </p>
				<p> 332 339 340 333 </p>
				<p> 341 342 343 344 </p>
				<p> 345 339 338 346 </p>
				<p> 347 348 349 350 </p>
				<p> 341 351 352 342 </p>
				<p> 353 354 355 350 </p>
				<p> 353 350 349 356 </p>
				<p> 353 356 357 358 </p>
				<p> 353 358 359 354 </p>
				<p> 360 361 362 363 </p>
				<p> 360 363 364 365 </p>
				<p> 360 365 366 367 </p>
				<p> 360 367 368 361 </p>
				<p> 369 370 343 342 </p>
				<p> 369 342 352 371 </p>
				<p> 369 371 372 373 </p>
				<p> 369 373 374 370 </p>
				<p> 375 356 349 348 </p>
				<p> 376 346 338 337 </p>
				<p> 376 337 336 377 </p>
				<p> 375 378 357 356 </p>
				<p> 379 380 14 13 </p>
				<p> 381 11 6 382 </p>
				<p> 379 383 384 380 </p>
				<p> 385 382 6 5 </p>
				<p> 385 5 4 386 </p>
				<p> 385 386 387 382 </p>
				<p> 388 389 30 29 </p>
				<p> 388 29 28 390 </p>
				<p> 388 390 391 389 </p>
				<p> 392 393 21 20 </p>
				<p> 392 20 14 380 </p>
				<p> 392 380 384 393 </p>
				<p> 394 49 48 59 </p>
				<p> 394 59 58 395 </p>
				<p> 394 395 396 49 </p>
				<p> 397 398 85 84 </p>
				<p> 397 84 83 399 </p>
				<p> 397 399 400 398 </p>
				<p> 401 402 76 75 </p>
				<p> 401 75 44 43 </p>
				<p> 401 43 51 402 </p>
				<p> 403 99 98 107 </p>
				<p> 403 107 106 404 </p>
				<p> 403 404 405 99 </p>
				<p> 406 407 128 127 </p>
				<p> 406 127 126 408 </p>
				<p> 406 408 409 407 </p>
				<p> 410 411 119 118 </p>
				<p> 410 118 94 93 </p>
				<p> 410 93 101 411 </p>
				<p> 412 147 146 155 </p>
				<p> 412 155 154 413 </p>
				<p> 412 413 414 147 </p>
				<p> 415 416 176 175 </p>
				<p> 415 175 174 417 </p>
				<p> 415 417 418 416 </p>
				<p> 419 420 167 166 </p>
				<p> 419 166 142 141 </p>
				<p> 419 141 149 420 </p>
				<p> 421 195 194 203 </p>
				<p> 421 203 202 422 </p>
				<p> 421 422 423 195 </p>
				<p> 424 425 224 223 </p>
				<p> 424 223 222 426 </p>
				<p> 424 426 427 425 </p>
				<p> 428 429 215 214 </p>
				<p> 428 214 190 189 </p>
				<p> 428 189 197 429 </p>
				<p> 430 243 242 251 </p>
				<p> 430 251 250 431 </p>
				<p> 430 431 432 243 </p>
				<p> 433 434 272 271 </p>
				<p> 433 271 270 435 </p>
				<p> 433 435 436 434 </p>
				<p> 437 438 263 262 </p>
				<p> 437 262 238 237 </p>
				<p> 437 237 245 438 </p>
				<p> 439 291 290 299 </p>
				<p> 439 299 298 440 </p>
				<p> 439 440 441 291 </p>
				<p> 442 443 320 319 </p>
				<p> 442 319 318 444 </p>
				<p> 442 444 445 443 </p>
				<p> 446 447 311 310 </p>
				<p> 446 310 286 285 </p>
				<p> 446 285 293 447 </p>
			</polygons>
		</mesh>
	</geometry>
</library_geometries>
<library_visual_scenes>
	<visual_scene id="id-scene-1" name="scene">
		<node id="rock_04" name="rock_04" type="NODE">
			<matrix sid="transform"> -0.7071077823638916 3.090857703114125e-08 0.7071057558059692 0.0 0.7071057558059692 3.090866584898322e-08 0.7071077823638916 0.0 0.0 1.0 -4.371138828673793e-08 0.0 0.0 0.0 0.0 1.0  </matrix>
			<instance_geometry url="#id-mesh-7">
				<bind_material>
					<technique_common>
						<instance_material symbol="id-trimat-8" target="#id-material-6"/>
					</technique_common>
				</bind_material>
			</instance_geometry>
		</node>
	</visual_scene>
</library_visual_scenes>
<scene>
	<instance_visual_scene url="#id-scene-1" />
</scene>
</COLLADA>
