<?xml version="1.0" encoding="utf-8"?>
<COLLADA xmlns="http://www.collada.org/2005/11/COLLADASchema" version="1.4.1">
<asset>
	<contributor>
		<author>Anonymous</author>
		<authoring_tool>Collada Exporter for Blender 2.6+, by Juan Linietsky (juan@codenix.com)</authoring_tool>
	</contributor>
	<created>2019-05-05T17:03:40Z</created>
	<modified>2019-05-05T17:03:40Z</modified>
	<unit meter="1.0" name="meter"/>
	<up_axis>Z_UP</up_axis>
</asset>
<library_images>
	<image id="id-image-3" name="color atlas.png">
		<init_from>../../concepts/3D/PolyDesertFree_v 1.1_by_RunemarkStudio/Update 1.1/FBX/rock02.fbm/color atlas.png</init_from>
	</image>
</library_images>
<library_effects>
	<effect id="id-fx-2" name="polydesert_atlas.007-fx">
		<profile_COMMON>
			<newparam sid="id-fx_surf-4">
				<surface type="2D">
					<init_from>id-image-3</init_from>
					<format>A8R8G8B8</format>
				</surface>
			</newparam>
			<newparam sid="id-fx_sampler-5">
				<sampler2D>
					<source>id-fx_surf-4</source>
				</sampler2D>
			</newparam>
			<technique sid="common">
				<blinn>
					<emission>
						<color>  0.0 0.0 0.0 1.0 </color>
					</emission>
					<ambient>
						<color>  0.0 0.0 0.0 1.0 </color>
					</ambient>
					<diffuse>
						<texture texture="id-fx_sampler-5" texcoord="CHANNEL1"/>
					</diffuse>
					<specular>
						<color>  0.0 0.0 0.0 1.0 </color>
					</specular>
					<shininess>
						<float>50</float>
					</shininess>
					<reflective>
						<color>  1.0 1.0 1.0 1.0 </color>
					</reflective>
					<index_of_refraction>
						<float>4.0</float>
					</index_of_refraction>
				</blinn>
				<extra>
					<technique profile="FCOLLADA">
					</technique>
					<technique profile="GOOGLEEARTH">
						<double_sided>0</double_sided>
					</technique>
				</extra>
			</technique>
		</profile_COMMON>
	</effect>
</library_effects>
<library_materials>
	<material id="id-material-6" name="polydesert_atlas.007">
		<instance_effect url="#id-fx-2"/>
	</material>
</library_materials>
<library_geometries>
	<geometry id="id-mesh-7" name="rock02">
		<mesh>
			<source id="id-mesh-7-positions">
				<float_array id="id-mesh-7-positions-array" count="1206"> -0.39218300580978394 3.143137216567993 0.39218300580978394 -0.7467848062515259 0.01988089084625244 -0.7467848062515259 -0.7467848062515259 0.01988089084625244 0.7467848062515259 0.03993929550051689 2.7083096504211426 -0.4406457543373108 0.39218300580978394 3.143137216567993 -0.39218300580978394 0.7467848062515259 0.01988089084625244 -0.7467848062515259 0.6167249083518982 1.8557578325271606 0.4626179337501526 0.7467848062515259 1.2198697328567505 0.7467848062515259 0.7467848062515259 0.01988089084625244 -0.7467848062515259 -0.7467848062515259 0.01988089084625244 0.7467848062515259 0.35801130533218384 1.7210140228271484 0.6445544958114624 -0.10283352434635162 2.4579062461853027 0.49236226081848145 0.7467848062515259 0.01988089084625244 -0.7467848062515259 -0.7467848062515259 0.01988089084625244 0.7467848062515259 -0.7467848062515259 0.01988089084625244 -0.7467848062515259 0.3092341721057892 3.143136978149414 0.005861000157892704 0.050661444664001465 3.143137216567993 -0.31213822960853577 -0.01881481148302555 3.143136739730835 0.29544368386268616 0.7614703178405762 0.35528600215911865 -0.2057397961616516 0.7614703178405762 0.026208877563476562 -0.9912183880805969 0.7614703178405762 0.026208877563476562 -0.2057397961616516 1.5469489097595215 0.026208877563476562 -0.9912183880805969 0.7614703178405762 0.026208877563476562 -0.9912183880805969 1.0434569120407104 0.17615652084350586 -0.9912182092666626 1.5469489097595215 0.35528600215911865 -0.9912183880805969 1.5469489097595215 0.026208877563476562 -0.2057397961616516 1.5469489097595215 0.026208877563476562 -0.9912183880805969 1.5469489097595215 0.35528600215911865 -0.2057397961616516 0.7614703178405762 0.026208877563476562 -0.2057397961616516 1.5469489097595215 0.026208877563476562 -0.2057397961616516 1.5469489097595215 0.026208877563476562 -0.9912183880805969 0.7614703178405762 0.026208877563476562 -0.2057397961616516 0.7614703178405762 0.026208877563476562 -0.9912183880805969 0.7614703178405762 0.35528600215911865 -0.2057397961616516 1.5469489097595215 0.35528600215911865 -0.2057397961616516 0.9980595111846924 0.3552861213684082 -0.7734556198120117 -1.5184497833251953 0.9177641272544861 0.383722186088562 -1.2582422494888306 1.845651388168335 -0.33290988206863403 -1.5184497833251953 0.026208877563476562 -0.4017564058303833 -1.2582422494888306 1.845651388168335 -0.33290988206863403 -0.7329712510108948 0.026208877563476562 -0.4017564058303833 -1.5184497833251953 0.026208877563476562 -0.4017564058303833 -0.6073664426803589 1.845651388168335 -0.33290988206863403 -0.7329712510108948 0.026208877563476562 0.383722186088562 -0.7329712510108948 0.026208877563476562 -0.4017564058303833 -1.0652821063995361 1.2929010391235352 0.3766256272792816 -1.5184497833251953 0.9177641272544861 0.383722186088562 -0.7329712510108948 0.026208877563476562 0.383722186088562 -0.7329712510108948 0.026208877563476562 -0.4017564058303833 -1.5184497833251953 0.026208877563476562 0.383722186088562 -1.5184497833251953 0.026208877563476562 -0.4017564058303833 -0.6073664426803589 1.845651388168335 -0.33290988206863403 -1.0721898078918457 1.8456515073776245 -0.17066267132759094 -0.9007378220558167 1.8456515073776245 0.017536185681819916 -0.8472667932510376 2.30519700050354 -0.3128034472465515 -0.8472667932510376 2.30519700050354 -0.8062517046928406 -1.0430943965911865 1.7189037799835205 -1.3360505104064941 -1.0430943965911865 1.7189037799835205 -1.3360505104064941 -0.07484593987464905 2.30519700050354 -1.0852242708206177 -0.10668759793043137 0.006641745567321777 -1.5469105243682861 -0.07484593987464905 2.30519700050354 -1.0852242708206177 -0.10668759793043137 0.006641745567321777 -0.4458792209625244 -0.10668759793043137 0.006641745567321777 -1.5469105243682861 -0.10668759793043137 0.006641745567321777 -0.4458792209625244 -0.8472667932510376 2.30519700050354 -0.3128034472465515 -1.207718849182129 0.006641745567321777 -0.4458792209625244 -0.10668759793043137 0.006641745567321777 -1.5469105243682861 -1.207718849182129 0.006641745567321777 -0.4458792209625244 -1.207718849182129 0.006641745567321777 -1.5469105243682861 -0.8472667932510376 2.30519700050354 -0.8062517046928406 -0.8472667932510376 2.30519700050354 -0.3128034472465515 -0.07484593987464905 2.30519700050354 -0.3128034472465515 -0.236922025680542 0.025683879852294922 -0.7462935447692871 -0.2264874428510666 1.3852791786193848 -1.684032917022705 -0.236922025680542 0.025683879852294922 -1.7616186141967773 -0.2264874428510666 1.3852791786193848 -1.684032917022705 0.4028720259666443 1.2479333877563477 -1.7509472370147705 0.5823708772659302 0.5545112490653992 -1.7616195678710938 0.7441203594207764 1.3852791786193848 -0.7134250998497009 0.7784029841423035 0.025683879852294922 -0.7462935447692871 0.7784031629562378 0.6176714897155762 -1.4697611331939697 0.7441203594207764 1.3852791786193848 -0.7134250998497009 -0.236922025680542 0.025683879852294922 -0.7462935447692871 0.7784029841423035 0.025683879852294922 -0.7462935447692871 0.7784029841423035 0.025683879852294922 -1.7616186141967773 -0.236922025680542 0.025683879852294922 -0.7462935447692871 -0.236922025680542 0.025683879852294922 -1.7616186141967773 -0.2264874428510666 1.3852791786193848 -0.7134250998497009 0.7441203594207764 1.3852791786193848 -0.7134250998497009 0.46095943450927734 1.3852790594100952 -1.498254656791687 -0.5922324061393738 0.72911536693573 -1.7731847763061523 -0.5922324061393738 0.5778652429580688 -2.5586633682250977 -0.5922324061393738 0.026208877563476562 -2.2837069034576416 0.19324621558189392 0.72911536693573 -2.5586633682250977 0.19324621558189392 0.026208877563476562 -1.7731847763061523 0.19324621558189392 0.026208877563476562 -2.5586633682250977 0.19324621558189392 0.72911536693573 -1.7731847763061523 -0.5922324061393738 0.026208877563476562 -1.7731847763061523 0.19324621558189392 0.026208877563476562 -1.7731847763061523 -0.5922324061393738 0.026208877563476562 -2.2837069034576416 -0.5922324061393738 0.5778652429580688 -2.5586633682250977 -0.4417163133621216 0.026208877563476562 -2.5586633682250977 -0.5922324061393738 0.72911536693573 -1.7731847763061523 0.19324621558189392 0.72911536693573 -1.7731847763061523 -0.09480348229408264 0.7291160225868225 -2.3566691875457764 0.23960226774215698 0.026208877563476562 0.36490899324417114 0.19854307174682617 1.845651388168335 -0.3484991490840912 0.23960226774215698 0.026208877563476562 -0.42056959867477417 0.19854307174682617 1.845651388168335 -0.3484991490840912 0.6780602335929871 1.845651388168335 -0.3484991490840912 1.0250808000564575 1.0600061416625977 -0.42056959867477417 1.0250808000564575 1.0600061416625977 -0.42056959867477417 0.8494188785552979 1.845651388168335 0.30237674713134766 1.0250808000564575 0.026208877563476562 0.36490899324417114 0.8494188785552979 1.845651388168335 0.30237674713134766 0.23960226774215698 0.026208877563476562 0.36490899324417114 1.0250808000564575 0.026208877563476562 0.36490899324417114 1.0250808000564575 0.026208877563476562 -0.42056959867477417 0.23960226774215698 0.026208877563476562 0.36490899324417114 0.23960226774215698 0.026208877563476562 -0.42056959867477417 -1.0409770011901855 0.32941579818725586 1.1260830163955688 -0.44283145666122437 0.32941579818725586 0.34060442447662354 -1.228309988975525 0.32941579818725586 0.9387500286102295 -1.228309988975525 0.32941579818725586 0.34060442447662354 -0.44283145666122437 0.0003387928009033203 0.34060442447662354 -1.228309988975525 0.0003387928009033203 0.34060442447662354 -0.44283145666122437 0.32941579818725586 0.34060442447662354 -0.44283145666122437 0.0003387928009033203 1.1260830163955688 -0.44283145666122437 0.0003387928009033203 0.34060442447662354 -1.228309988975525 0.32941579818725586 0.9387500286102295 -1.228309988975525 0.0003387928009033203 0.34060442447662354 -1.228309988975525 0.0003387928009033203 1.1260830163955688 -0.44283145666122437 0.0003387928009033203 0.34060442447662354 -1.228309988975525 0.0003387928009033203 1.1260830163955688 -1.228309988975525 0.0003387928009033203 0.34060442447662354 0.406804621219635 2.8721635341644287 0.038369715213775635 0.39218300580978394 3.143137216567993 -0.15675796568393707 0.3092341721057892 3.143136978149414 0.005861000157892704 0.46095943450927734 1.3852790594100952 -1.498254656791687 0.5682699680328369 1.3852791786193848 -1.684032917022705 0.4028720259666443 1.2479333877563477 -1.7509472370147705 -1.0430943965911865 1.7189037799835205 -1.3360505104064941 -0.8472667932510376 2.30519700050354 -0.8062517046928406 -0.5653112530708313 2.30519700050354 -1.0852242708206177 -0.09480348229408264 0.7291160225868225 -2.3566691875457764 -0.0058194780722260475 0.72911536693573 -2.5586633682250977 -0.11309817433357239 0.5759658217430115 -2.5586624145507812 0.9980595111846924 0.3552861213684082 -0.7734556198120117 1.3169572353363037 0.35528600215911865 -0.9912183880805969 1.0434569120407104 0.17615652084350586 -0.9912182092666626 -0.11309817433357239 0.5759658217430115 -2.5586624145507812 0.19324621558189392 0.72911536693573 -2.5586633682250977 0.19324621558189392 0.026208877563476562 -2.5586633682250977 0.19324621558189392 0.026208877563476562 -1.7731847763061523 -0.5922324061393738 0.026208877563476562 -2.2837069034576416 0.19324621558189392 0.026208877563476562 -2.5586633682250977 0.6780602335929871 1.845651388168335 -0.3484991490840912 0.19854307174682617 1.845651388168335 -0.3484991490840912 0.19854307174682617 1.845651388168335 0.30237674713134766 1.0250808000564575 1.0600061416625977 -0.42056959867477417 0.6780602335929871 1.845651388168335 -0.3484991490840912 0.8494188785552979 1.845651388168335 -0.09075795114040375 0.7784031629562378 0.6176714897155762 -1.4697611331939697 0.7784029841423035 0.43451619148254395 -1.7616186141967773 0.5823708772659302 0.5545112490653992 -1.7616195678710938 0.050661444664001465 3.143137216567993 -0.31213822960853577 0.22729268670082092 3.143137216567993 -0.39218300580978394 0.03993929550051689 2.7083096504211426 -0.4406457543373108 -0.10283352434635162 2.4579062461853027 0.49236226081848145 0.11374497413635254 3.143137216567993 0.39218300580978394 -0.01881481148302555 3.143136739730835 0.29544368386268616 0.35801130533218384 1.7210140228271484 0.6445544958114624 0.7467848062515259 1.2198697328567505 0.7467848062515259 0.6167249083518982 1.8557578325271606 0.4626179337501526 -1.0409770011901855 0.32941579818725586 1.1260830163955688 -1.228309988975525 0.32941579818725586 0.9387500286102295 -1.228309988975525 0.0003387928009033203 1.1260830163955688 -0.44283145666122437 0.0003387928009033203 1.1260830163955688 -1.0409770011901855 0.32941579818725586 1.1260830163955688 -1.228309988975525 0.0003387928009033203 1.1260830163955688 -0.09270012378692627 3.143137216567993 -0.39218300580978394 0.050661444664001465 3.143137216567993 -0.31213822960853577 0.03993929550051689 2.7083096504211426 -0.4406457543373108 0.39218300580978394 3.143137216567993 0.20335209369659424 0.406804621219635 2.8721635341644287 0.038369715213775635 0.3092341721057892 3.143136978149414 0.005861000157892704 0.2354017198085785 1.3852791786193848 -1.684032917022705 0.46095943450927734 1.3852790594100952 -1.498254656791687 0.4028720259666443 1.2479333877563477 -1.7509472370147705 -0.2057487815618515 0.72911536693573 -2.5586633682250977 -0.09480348229408264 0.7291160225868225 -2.3566691875457764 -0.11309817433357239 0.5759658217430115 -2.5586624145507812 0.7784029841423035 0.7335863709449768 -1.7616186141967773 0.7784031629562378 0.6176714897155762 -1.4697611331939697 0.5823708772659302 0.5545112490653992 -1.7616195678710938 0.9523043632507324 0.35528600215911865 -0.9912183880805969 0.9980595111846924 0.3552861213684082 -0.7734556198120117 1.0434569120407104 0.17615652084350586 -0.9912182092666626 0.5137269496917725 2.354461431503296 0.5137269496917725 0.35801130533218384 1.7210140228271484 0.6445544958114624 0.6167249083518982 1.8557578325271606 0.4626179337501526 -0.12075677514076233 3.143137216567993 0.39218300580978394 -0.10283352434635162 2.4579062461853027 0.49236226081848145 -0.01881481148302555 3.143136739730835 0.29544368386268616 -1.2582422494888306 1.845651388168335 -0.17325636744499207 -1.5184497833251953 0.9177641272544861 0.383722186088562 -1.197072982788086 1.4824506044387817 0.01966198906302452 -1.5184497833251953 0.9177641272544861 0.383722186088562 -1.0652821063995361 1.2929010391235352 0.3766256272792816 -1.197072982788086 1.4824506044387817 0.01966198906302452 -1.0652821063995361 1.2929010391235352 0.3766256272792816 -0.9045052528381348 1.845651388168335 0.3179660439491272 -1.197072982788086 1.4824506044387817 0.01966198906302452 -0.9045052528381348 1.845651388168335 0.3179660439491272 -0.9007378220558167 1.8456515073776245 0.017536185681819916 -1.197072982788086 1.4824506044387817 0.01966198906302452 -0.9007378220558167 1.8456515073776245 0.017536185681819916 -1.0721898078918457 1.8456515073776245 -0.17066267132759094 -1.197072982788086 1.4824506044387817 0.01966198906302452 -1.0721898078918457 1.8456515073776245 -0.17066267132759094 -1.2582422494888306 1.845651388168335 -0.17325636744499207 -1.197072982788086 1.4824506044387817 0.01966198906302452 -0.39218300580978394 3.143137216567993 -0.39218300580978394 -0.7467848062515259 0.01988089084625244 -0.7467848062515259 -0.39218300580978394 3.143137216567993 -0.39218300580978394 -0.09270012378692627 3.143137216567993 -0.39218300580978394 0.22729268670082092 3.143137216567993 -0.39218300580978394 0.7467848062515259 0.01988089084625244 0.7467848062515259 0.7467848062515259 0.01988089084625244 -0.7467848062515259 0.7467848062515259 1.2198697328567505 0.7467848062515259 0.7467848062515259 0.01988089084625244 -0.7467848062515259 0.39218300580978394 3.143137216567993 -0.39218300580978394 0.6167249083518982 1.8557578325271606 0.4626179337501526 0.6167249083518982 1.8557578325271606 0.4626179337501526 0.39218300580978394 3.143137216567993 -0.39218300580978394 0.406804621219635 2.8721635341644287 0.038369715213775635 0.39218300580978394 3.143137216567993 -0.39218300580978394 0.39218300580978394 3.143137216567993 -0.15675796568393707 0.406804621219635 2.8721635341644287 0.038369715213775635 0.406804621219635 2.8721635341644287 0.038369715213775635 0.39218300580978394 3.143137216567993 0.20335209369659424 0.39218300580978394 3.143137216567993 0.39218300580978394 0.39218300580978394 3.143137216567993 0.39218300580978394 0.5137269496917725 2.354461431503296 0.5137269496917725 0.406804621219635 2.8721635341644287 0.038369715213775635 0.5137269496917725 2.354461431503296 0.5137269496917725 0.6167249083518982 1.8557578325271606 0.4626179337501526 0.406804621219635 2.8721635341644287 0.038369715213775635 -0.7467848062515259 0.01988089084625244 0.7467848062515259 0.7467848062515259 0.01988089084625244 0.7467848062515259 0.7467848062515259 1.2198697328567505 0.7467848062515259 0.35801130533218384 1.7210140228271484 0.6445544958114624 0.5137269496917725 2.354461431503296 0.5137269496917725 -0.10283352434635162 2.4579062461853027 0.49236226081848145 0.5137269496917725 2.354461431503296 0.5137269496917725 0.39218300580978394 3.143137216567993 0.39218300580978394 -0.10283352434635162 2.4579062461853027 0.49236226081848145 -0.7467848062515259 0.01988089084625244 0.7467848062515259 0.7467848062515259 1.2198697328567505 0.7467848062515259 0.35801130533218384 1.7210140228271484 0.6445544958114624 -0.12075677514076233 3.143137216567993 0.39218300580978394 -0.39218300580978394 3.143137216567993 0.39218300580978394 -0.10283352434635162 2.4579062461853027 0.49236226081848145 -0.39218300580978394 3.143137216567993 0.39218300580978394 -0.7467848062515259 0.01988089084625244 0.7467848062515259 -0.10283352434635162 2.4579062461853027 0.49236226081848145 0.11374497413635254 3.143137216567993 0.39218300580978394 0.7467848062515259 0.01988089084625244 0.7467848062515259 0.39218300580978394 3.143137216567993 -0.15675796568393707 0.39218300580978394 3.143137216567993 -0.39218300580978394 0.22729268670082092 3.143137216567993 -0.39218300580978394 -0.09270012378692627 3.143137216567993 -0.39218300580978394 -0.39218300580978394 3.143137216567993 -0.39218300580978394 0.39218300580978394 3.143137216567993 0.39218300580978394 0.39218300580978394 3.143137216567993 0.20335209369659424 0.11374497413635254 3.143137216567993 0.39218300580978394 -0.39218300580978394 3.143137216567993 0.39218300580978394 -0.12075677514076233 3.143137216567993 0.39218300580978394 -1.5184497833251953 0.026208877563476562 -0.4017564058303833 -1.5184497833251953 0.026208877563476562 0.383722186088562 -1.5184497833251953 0.9177641272544861 0.383722186088562 -1.5184497833251953 0.9177641272544861 0.383722186088562 -1.2582422494888306 1.845651388168335 -0.17325636744499207 -1.2582422494888306 1.845651388168335 -0.33290988206863403 -0.6073664426803589 1.845651388168335 -0.33290988206863403 -0.6073664426803589 1.845651388168335 0.3179660439491272 -1.5184497833251953 0.026208877563476562 0.383722186088562 -0.7329712510108948 0.026208877563476562 0.383722186088562 -0.6073664426803589 1.845651388168335 0.3179660439491272 -1.0652821063995361 1.2929010391235352 0.3766256272792816 -0.6073664426803589 1.845651388168335 0.3179660439491272 -0.9045052528381348 1.845651388168335 0.3179660439491272 -1.0652821063995361 1.2929010391235352 0.3766256272792816 -0.7329712510108948 0.026208877563476562 0.383722186088562 -1.2582422494888306 1.845651388168335 -0.33290988206863403 -1.2582422494888306 1.845651388168335 -0.17325636744499207 -0.9045052528381348 1.845651388168335 0.3179660439491272 -0.6073664426803589 1.845651388168335 0.3179660439491272 -0.44283145666122437 0.32941579818725586 1.1260830163955688 -1.228309988975525 0.32941579818725586 0.34060442447662354 -0.44283145666122437 0.32941579818725586 0.34060442447662354 -0.44283145666122437 0.32941579818725586 1.1260830163955688 -1.228309988975525 0.32941579818725586 0.34060442447662354 -0.44283145666122437 0.0003387928009033203 1.1260830163955688 -0.44283145666122437 0.32941579818725586 1.1260830163955688 0.19854307174682617 1.845651388168335 0.30237674713134766 1.0250808000564575 0.026208877563476562 -0.42056959867477417 0.23960226774215698 0.026208877563476562 -0.42056959867477417 1.0250808000564575 1.0600061416625977 -0.42056959867477417 0.23960226774215698 0.026208877563476562 -0.42056959867477417 0.19854307174682617 1.845651388168335 -0.3484991490840912 1.0250808000564575 1.0600061416625977 -0.42056959867477417 1.0250808000564575 0.026208877563476562 0.36490899324417114 1.0250808000564575 0.026208877563476562 -0.42056959867477417 1.0250808000564575 1.0600061416625977 -0.42056959867477417 1.0250808000564575 1.0600061416625977 -0.42056959867477417 0.8494188785552979 1.845651388168335 -0.09075795114040375 0.8494188785552979 1.845651388168335 0.30237674713134766 0.19854307174682617 1.845651388168335 0.30237674713134766 1.0250808000564575 0.026208877563476562 0.36490899324417114 0.8494188785552979 1.845651388168335 0.30237674713134766 0.8494188785552979 1.845651388168335 -0.09075795114040375 0.7614703178405762 0.35528600215911865 -0.9912183880805969 0.7614703178405762 0.35528600215911865 -0.9912183880805969 0.9523043632507324 0.35528600215911865 -0.9912183880805969 1.3169572353363037 0.35528600215911865 -0.9912183880805969 1.5469489097595215 0.35528600215911865 -0.9912183880805969 1.5469489097595215 0.35528600215911865 -0.2057397961616516 0.7614703178405762 0.35528600215911865 -0.2057397961616516 1.5469489097595215 0.026208877563476562 -0.2057397961616516 1.5469489097595215 0.35528600215911865 -0.9912183880805969 1.3169572353363037 0.35528600215911865 -0.9912183880805969 0.9523043632507324 0.35528600215911865 -0.9912183880805969 0.7614703178405762 0.35528600215911865 -0.9912183880805969 -0.2264874428510666 1.3852791786193848 -0.7134250998497009 0.7784029841423035 0.025683879852294922 -1.7616186141967773 -0.236922025680542 0.025683879852294922 -1.7616186141967773 0.5823708772659302 0.5545112490653992 -1.7616195678710938 -0.236922025680542 0.025683879852294922 -1.7616186141967773 -0.2264874428510666 1.3852791786193848 -1.684032917022705 0.5823708772659302 0.5545112490653992 -1.7616195678710938 -0.2264874428510666 1.3852791786193848 -1.684032917022705 0.2354017198085785 1.3852791786193848 -1.684032917022705 0.4028720259666443 1.2479333877563477 -1.7509472370147705 0.4028720259666443 1.2479333877563477 -1.7509472370147705 0.5682699680328369 1.3852791786193848 -1.684032917022705 0.7441203594207764 1.3852791786193848 -1.684032917022705 0.7441203594207764 1.3852791786193848 -1.684032917022705 0.7784029841423035 0.7335863709449768 -1.7616186141967773 0.4028720259666443 1.2479333877563477 -1.7509472370147705 0.7784029841423035 0.7335863709449768 -1.7616186141967773 0.5823708772659302 0.5545112490653992 -1.7616195678710938 0.4028720259666443 1.2479333877563477 -1.7509472370147705 0.7784029841423035 0.43451619148254395 -1.7616186141967773 0.7784029841423035 0.025683879852294922 -0.7462935447692871 0.7784029841423035 0.025683879852294922 -1.7616186141967773 0.7784031629562378 0.6176714897155762 -1.4697611331939697 0.7784029841423035 0.43451619148254395 -1.7616186141967773 0.7784031629562378 0.6176714897155762 -1.4697611331939697 0.7784029841423035 0.7335863709449768 -1.7616186141967773 0.7441203594207764 1.3852791786193848 -1.684032917022705 0.7441203594207764 1.3852791786193848 -1.684032917022705 0.7441203594207764 1.3852791786193848 -0.7134250998497009 0.7784031629562378 0.6176714897155762 -1.4697611331939697 -0.2264874428510666 1.3852791786193848 -0.7134250998497009 0.7784029841423035 0.025683879852294922 -0.7462935447692871 0.7441203594207764 1.3852791786193848 -1.684032917022705 0.5682699680328369 1.3852791786193848 -1.684032917022705 0.2354017198085785 1.3852791786193848 -1.684032917022705 -0.2264874428510666 1.3852791786193848 -1.684032917022705 -0.5922324061393738 0.026208877563476562 -1.7731847763061523 -0.5922324061393738 0.72911536693573 -2.5586633682250977 0.19324621558189392 0.72911536693573 -1.7731847763061523 -0.5922324061393738 0.72911536693573 -1.7731847763061523 0.19324621558189392 0.72911536693573 -2.5586633682250977 -0.0058194780722260475 0.72911536693573 -2.5586633682250977 -0.2057487815618515 0.72911536693573 -2.5586633682250977 -0.5922324061393738 0.72911536693573 -2.5586633682250977 -0.4417163133621216 0.026208877563476562 -2.5586633682250977 -0.5922324061393738 0.5778652429580688 -2.5586633682250977 -0.5922324061393738 0.72911536693573 -2.5586633682250977 -0.2057487815618515 0.72911536693573 -2.5586633682250977 -0.0058194780722260475 0.72911536693573 -2.5586633682250977 -0.5922324061393738 0.026208877563476562 -1.7731847763061523 -0.4417163133621216 0.026208877563476562 -2.5586633682250977 -1.207718849182129 0.006641745567321777 -1.5469105243682861 -1.207718849182129 0.006641745567321777 -0.4458792209625244 -1.0430943965911865 1.7189037799835205 -1.3360505104064941 -1.207718849182129 0.006641745567321777 -0.4458792209625244 -0.8472667932510376 2.30519700050354 -0.3128034472465515 -1.0430943965911865 1.7189037799835205 -1.3360505104064941 -0.10668759793043137 0.006641745567321777 -1.5469105243682861 -1.207718849182129 0.006641745567321777 -1.5469105243682861 -1.0430943965911865 1.7189037799835205 -1.3360505104064941 -1.0430943965911865 1.7189037799835205 -1.3360505104064941 -0.5653112530708313 2.30519700050354 -1.0852242708206177 -0.07484593987464905 2.30519700050354 -1.0852242708206177 -0.07484593987464905 2.30519700050354 -0.3128034472465515 -0.07484593987464905 2.30519700050354 -0.3128034472465515 -0.10668759793043137 0.006641745567321777 -0.4458792209625244 -0.07484593987464905 2.30519700050354 -1.0852242708206177 -0.5653112530708313 2.30519700050354 -1.0852242708206177</float_array>
				<technique_common>
				<accessor source="#id-mesh-7-positions-array" count="402" stride="3">
					<param name="X" type="float"/>
					<param name="Y" type="float"/>
					<param name="Z" type="float"/>
				</accessor>
				</technique_common>
			</source>
			<source id="id-mesh-7-normals">
				<float_array id="id-mesh-7-normals-array" count="1206"> -0.99361652135849 0.1128111407160759 0.0 -0.99361652135849 0.11281118541955948 0.0 -0.9936164617538452 0.11281118541955948 0.0 0.0002520655980333686 0.11078105121850967 -0.993844747543335 -0.0010519433999434114 0.1116088405251503 -0.9937516450881958 -0.0016576861962676048 0.11271129548549652 -0.9936263561248779 0.981870174407959 0.14776921272277832 -0.11872326582670212 0.981870174407959 0.14776921272277832 -0.11872326582670212 0.981870174407959 0.14776921272277832 -0.11872326582670212 -0.11310871690511703 0.13263355195522308 0.9846901893615723 -0.11310871690511703 0.13263355195522308 0.9846901893615723 -0.11310871690511703 0.13263355195522308 0.9846901893615723 0.0 -1.0 0.0 0.0 -1.0 0.0 0.0 -1.0 0.0 -5.258362989479792e-07 1.0 5.048466960033693e-07 -2.6730614877124026e-07 1.0 7.94543211668497e-07 -3.387416711575497e-07 1.0 -2.601615847197536e-07 -1.0 0.0 0.0 -1.0 0.0 0.0 -1.0 0.0 0.0 0.0 8.577295318445977e-08 -1.0 0.0 3.71029614143481e-07 -1.0 0.0 4.174394803158066e-07 -1.0 1.0 0.0 0.0 1.0 0.0 0.0 1.0 0.0 0.0 0.0 0.0 1.0 0.0 0.0 1.0 0.0 0.0 1.0 0.0 -1.0 0.0 0.0 -1.0 0.0 0.0 -1.0 0.0 -1.2665734061556577e-07 1.0 1.500972359735897e-07 9.592918104317505e-08 1.0 7.186785211388269e-08 -1.0399151761930625e-07 0.9999999403953552 -2.5058222163920618e-08 -0.9753897786140442 0.14575552940368652 -0.16543933749198914 -0.9753897786140442 0.14575552940368652 -0.16543933749198914 -0.9753897786140442 0.14575552940368652 -0.16543933749198914 0.0 0.03781228885054588 -0.9992848038673401 0.0 0.037812281399965286 -0.9992848038673401 0.0 0.03781227394938469 -0.9992848038673401 0.9976255297660828 -0.06887086480855942 0.0 0.9976255297660828 -0.06887086480855942 0.0 0.9976255893707275 -0.06887085735797882 0.0 0.009054873138666153 0.007977531291544437 0.9999271631240845 0.001370966900140047 0.0012076501734554768 0.9999983906745911 0.007926836609840393 0.006984366104006767 0.9999441504478455 0.0 -1.0 0.0 0.0 -1.0 0.0 0.0 -1.0 0.0 2.4694278977221984e-07 1.0 6.428432897109815e-08 -5.6405863091413266e-08 0.9999999403953552 4.4298170109868806e-07 2.461943324760796e-07 1.0 -1.9067184098275902e-07 -0.9484909176826477 0.3168044090270996 0.0 -0.9484909176826477 0.3168044090270996 0.0 -0.9484909176826477 0.3168044090270996 0.0 0.13468734920024872 0.19333799183368683 -0.9718434810638428 0.13468734920024872 0.19333799183368683 -0.9718434810638428 0.13468734920024872 0.19333799183368683 -0.9718434810638428 0.9999041557312012 -0.013851571828126907 0.0 0.9999039769172668 -0.01385156437754631 0.0 0.9999040365219116 -0.013851562514901161 0.0 0.0 -0.057798612862825394 0.9983283281326294 0.0 -0.057798612862825394 0.9983282685279846 0.0 -0.057798612862825394 0.9983282685279846 0.0 -1.0 0.0 0.0 -1.0 0.0 0.0 -1.0 0.0 0.0 1.0 -3.856786179312621e-07 0.0 1.0 0.0 0.0 1.0 -1.8686189662275865e-07 -0.9999704957008362 0.007674544118344784 0.0 -0.999970555305481 0.007674548774957657 0.0 -0.999970555305481 0.007674536667764187 0.0 -0.10847431421279907 -0.012780883349478245 -0.9940171241760254 -0.10847431421279907 -0.012780883349478245 -0.9940171241760254 -0.10847431421279907 -0.012780883349478245 -0.9940171241760254 0.9994900822639465 0.024713540449738503 0.020222481340169907 0.9994900822639465 0.024713540449738503 0.020222481340169907 0.9994900822639465 0.024713540449738503 0.020222481340169907 0.0 -0.0241681095212698 0.9997079372406006 0.0 -0.02416810765862465 0.9997078776359558 0.0 -0.0241681095212698 0.9997079372406006 0.0 -1.0 0.0 0.0 -1.0 0.0 0.0 -1.0 0.0 6.651761452758365e-08 1.0 -2.6118955887000084e-08 -9.280169166459018e-08 1.0 6.099774196854924e-08 -3.589584807173196e-08 1.0 -1.9367081449672696e-07 -1.0 0.0 0.0 -1.0 0.0 0.0 -1.0 0.0 0.0 0.9999999403953552 0.0 0.0 0.9999999403953552 0.0 0.0 1.0 0.0 0.0 0.0 0.0 0.9999999403953552 0.0 0.0 0.9999999403953552 0.0 0.0 1.0 -0.8530791401863098 -0.23275725543498993 -0.46699026226997375 -0.8530791401863098 -0.23275725543498993 -0.46699026226997375 -0.8530791401863098 -0.23275725543498993 -0.46699026226997375 -5.923753860770375e-07 1.0 7.518372058257228e-07 6.644969516855781e-07 1.0 9.668925713413046e-07 4.2401961763971485e-07 1.0 -4.6814966481179e-07 -0.9997453689575195 -0.022561170160770416 0.0 -0.9997454285621643 -0.02256115898489952 0.0 -0.9997454881668091 -0.022561179473996162 0.0 0.0 0.09135051816701889 -0.9958187341690063 0.0 0.09135051816701889 -0.9958187341690063 0.0 0.09135051816701889 -0.9958187341690063 0.9863169193267822 0.09973752498626709 0.13126833736896515 0.9863169193267822 0.09973752498626709 0.13126833736896515 0.9863169193267822 0.09973752498626709 0.13126833736896515 0.0 0.03434862568974495 0.9994099140167236 0.0 0.03434862196445465 0.9994099140167236 0.0 0.03434862196445465 0.9994099140167236 0.0 -1.0 0.0 0.0 -1.0 0.0 0.0 -1.0 0.0 0.0 1.0 0.0 0.0 1.0 0.0 0.0 1.0 0.0 0.0 0.0 -1.0 0.0 0.0 -1.0 0.0 0.0 -1.0 1.0 0.0 0.0 1.0 0.0 0.0 1.0 0.0 0.0 -1.0 0.0 0.0 -1.0 0.0 0.0 -1.0 0.0 0.0 0.0 -1.0 0.0 0.0 -1.0 0.0 0.0 -1.0 0.0 0.8340146541595459 0.35134389996528625 0.425414115190506 0.8340146541595459 0.35134389996528625 0.425414115190506 0.8340146541595459 0.35134389996528625 0.425414115190506 -0.5314308404922485 0.7895261645317078 -0.3069685101509094 -0.5314308404922485 0.7895261645317078 -0.3069685101509094 -0.5314308404922485 0.7895261645317078 -0.3069685101509094 -0.5287160873413086 0.6594752669334412 -0.5343703031539917 -0.5287160873413086 0.6594752669334412 -0.5343703031539917 -0.5287160873413086 0.6594752669334412 -0.5343703031539917 -0.770430326461792 0.5396720170974731 -0.33939826488494873 -0.770430326461792 0.5396720170974731 -0.33939826488494873 -0.770430326461792 0.5396720170974731 -0.33939826488494873 -0.42734435200691223 0.6524819135665894 -0.6258147358894348 -0.42734435200691223 0.6524819135665894 -0.6258147358894348 -0.42734435200691223 0.6524819135665894 -0.6258147358894348 -1.9975587406406703e-07 -1.142638552664721e-06 -1.0 -2.34133312915219e-06 -1.837795139181253e-06 -1.0 -1.0750384262792068e-06 1.1732847724488238e-06 -0.9999999403953552 0.0 -1.0 0.0 0.0 -1.0 -5.924571944149193e-09 0.0 -1.0 -4.573996292833726e-09 0.0 1.0 -2.8708851118608436e-07 0.0 1.0 0.0 0.0 0.9999999403953552 -1.2668144222516275e-07 0.7681589126586914 0.38614585995674133 -0.5107086896896362 0.7681589126586914 0.38614585995674133 -0.5107086896896362 0.7681589126586914 0.38614585995674133 -0.5107086896896362 0.4602925479412079 0.7519617676734924 -0.47189435362815857 0.4602925479412079 0.7519617676734924 -0.47189435362815857 0.4602925479412079 0.7519617676734924 -0.47189435362815857 -0.39754584431648254 0.2690616250038147 -0.8772475123405457 -0.39754584431648254 0.2690616250038147 -0.8772475123405457 -0.39754584431648254 0.2690616250038147 -0.8772475123405457 -0.5639447569847107 0.2912198603153229 0.7727594971656799 -0.5639447569847107 0.2912198603153229 0.7727594971656799 -0.5639447569847107 0.2912198603153229 0.7727594971656799 0.35119885206222534 0.44094324111938477 0.825971245765686 0.35119885206222534 0.44094324111938477 0.825971245765686 0.35119885206222534 0.44094324111938477 0.825971245765686 -0.6559573411941528 0.37341558933258057 0.655957818031311 -0.6559573411941528 0.37341558933258057 0.655957818031311 -0.6559573411941528 0.37341558933258057 0.655957818031311 0.0 0.0 1.0 0.0 0.0 1.0 0.0 0.0 1.0 0.4733854830265045 0.23889553546905518 -0.8478413820266724 0.4733854830265045 0.23889553546905518 -0.8478413820266724 0.4733854830265045 0.23889553546905518 -0.8478413820266724 0.8865491151809692 0.2745506167411804 -0.37236082553863525 0.8865491151809692 0.2745506167411804 -0.37236082553863525 0.8865491151809692 0.2745506167411804 -0.37236082553863525 0.4169106185436249 0.7549617290496826 -0.5061801075935364 0.4169106185436249 0.7549617290496826 -0.5061801075935364 0.4169106185436249 0.7549617290496826 -0.5061801075935364 0.7743656635284424 0.4684642553329468 -0.42532235383987427 0.7743656635284424 0.4684642553329468 -0.42532235383987427 0.7743656635284424 0.4684642553329468 -0.42532235383987427 0.64720219373703 -0.7084858417510986 -0.2813844680786133 0.64720219373703 -0.7084858417510986 -0.2813844680786133 0.64720219373703 -0.7084858417510986 -0.2813844680786133 0.876017689704895 0.4457728862762451 -0.18406428396701813 0.876017689704895 0.4457728862762451 -0.18406428396701813 0.876017689704895 0.4457728862762451 -0.18406428396701813 0.5637895464897156 0.031859926879405975 0.825303852558136 0.5637895464897156 0.031859926879405975 0.825303852558136 0.5637895464897156 0.031859926879405975 0.825303852558136 0.6831185221672058 0.12310947477817535 0.719856321811676 0.6831185221672058 0.12310947477817535 0.719856321811676 0.6831185221672058 0.12310947477817535 0.719856321811676 0.13329537212848663 0.4823247194290161 0.8657916784286499 0.13329537212848663 0.4823247194290161 0.8657916784286499 0.13329537212848663 0.4823247194290161 0.8657916784286499 -0.5308514833450317 0.651524007320404 0.5419529676437378 -0.5308514833450317 0.651524007320404 0.5419529676437378 -0.5308514833450317 0.651524007320404 0.5419529676437378 -0.836163341999054 0.29245415329933167 0.46400585770606995 -0.836163341999054 0.29245415329933167 0.46400585770606995 -0.836163341999054 0.29245415329933167 0.46400585770606995 -0.7748146057128906 0.6321138739585876 -0.00971634779125452 -0.7748146057128906 0.6321138739585876 -0.00971634779125452 -0.7748146057128906 0.6321138739585876 -0.00971634779125452 -0.6319035291671753 0.5189388990402222 0.5756738185882568 -0.6319035291671753 0.5189388990402222 0.5756738185882568 -0.6319035291671753 0.5189388990402222 0.5756738185882568 -0.012323004193603992 0.467439204454422 0.883939266204834 -0.012323004193603992 0.467439204454422 0.883939266204834 -0.012323004193603992 0.467439204454422 0.883939266204834 -0.9936164617538452 0.1128111183643341 0.0 0.0012772898189723492 0.11277267336845398 -0.9936200976371765 0.0009899477008730173 0.11173870414495468 -0.9937372207641602 0.0 0.11076687276363373 -0.9938462972640991 0.0 0.11076724529266357 -0.9938464164733887 1.0 0.0 0.0 1.0 0.0 0.0 1.0 0.0 0.0 0.9896047711372375 0.12115343660116196 -0.07748857140541077 0.9896047711372375 0.12115343660116196 -0.07748857140541077 0.9896047711372375 0.12115343660116196 -0.07748857140541077 0.9600191116333008 0.25046178698539734 0.1250288337469101 0.9600191116333008 0.25046178698539734 0.1250288337469101 0.9600191116333008 0.25046178698539734 0.1250288337469101 0.998547375202179 0.053881045430898666 0.0 0.998547375202179 0.053881045430898666 0.0 0.998547375202179 0.053881045430898666 0.0 0.998547375202179 0.05388103052973747 0.0 0.998547375202179 0.05388103052973747 0.0 0.998547375202179 0.05388103052973747 0.0 0.9875802993774414 0.1417558193206787 -0.06775364279747009 0.9875802993774414 0.1417558193206787 -0.06775364279747009 0.9875802993774414 0.1417558193206787 -0.06775364279747009 0.9793311953544617 0.20226271450519562 -8.860402544996759e-07 0.9793311953544617 0.20226271450519562 -8.860402544996759e-07 0.9793311953544617 0.20226271450519562 -8.860402544996759e-07 0.0 0.0 1.0 0.0 0.0 1.0 0.0 0.0 1.0 1.7942438645945913e-08 0.2022639513015747 0.9793310165405273 1.7942438645945913e-08 0.2022639513015747 0.9793310165405273 1.7942438645945913e-08 0.2022639513015747 0.9793310165405273 -0.008924683555960655 0.15096347033977509 0.9884989857673645 -0.008477149531245232 0.15064767003059387 0.9885512590408325 -0.0018496463308110833 0.14596745371818542 0.9892877340316772 -0.09967885911464691 0.12406569719314575 0.9872546792030334 -0.09967885911464691 0.12406569719314575 0.9872546792030334 -0.09967885911464691 0.12406569719314575 0.9872546792030334 0.0 0.14466020464897156 0.9894813299179077 0.0 0.14466020464897156 0.9894813299179077 0.0 0.14466020464897156 0.9894813299179077 -0.06041114032268524 0.11937399208545685 0.9910098314285278 -0.06041114032268524 0.11937399208545685 0.9910098314285278 -0.06041114032268524 0.11937399208545685 0.9910098314285278 0.0 0.1446601152420044 0.9894813895225525 0.0 -1.0 0.0 -3.0945324169806554e-07 1.0 1.991586714211735e-06 0.0 1.0 0.0 0.0 1.0 0.0 -1.4935881154087838e-07 1.0 3.498639102872403e-07 4.0443822513225314e-07 0.9999999403953552 0.0 0.0 1.0 0.0 -4.108271980385325e-07 1.0 -1.0878177363338182e-06 -1.4177941238813219e-06 1.0 -3.4025944728455215e-07 1.070997768692905e-06 1.0 -3.663738254999771e-07 0.0 1.0 -2.2699969122186303e-06 -1.0 0.0 0.0 -1.0 0.0 0.0 -1.0 0.0 0.0 -0.9628565311431885 0.2700137197971344 0.0 -0.9628565311431885 0.2700137197971344 0.0 -0.9628565311431885 0.2700137197971344 0.0 0.0 0.03781229257583618 -0.9992849230766296 0.9976255297660828 -0.06887087970972061 0.0 0.0 0.0 1.0 0.09172597527503967 0.029640233144164085 0.9953429698944092 0.09172597527503967 0.029640233144164085 0.9953429698944092 0.09172597527503967 0.029640233144164085 0.9953429698944092 0.0 0.1055305078625679 0.9944160580635071 0.0 0.1055305078625679 0.9944160580635071 0.0 0.1055305078625679 0.9944160580635071 0.0 -1.0 0.0 -3.4820038763427874e-07 1.0 5.153821120984503e-07 -6.40729581391497e-07 1.0 0.0 0.0 1.0 0.0 2.0009643719731685e-07 0.9999999403953552 0.0 0.0 1.0 0.0 0.0 1.0 0.0 0.0 0.0 -1.0 1.0 0.0 0.0 -1.0 0.0 0.0 0.0 -1.0 0.0 0.0 0.0 1.0 -0.9997454881668091 -0.022561155259609222 0.0 0.0 0.0 -1.0 0.0 0.0 -1.0 0.0 0.0 -1.0 -0.050528038293123245 0.038391176611185074 -0.9979844689369202 -0.050528038293123245 0.038391176611185074 -0.9979844689369202 -0.050528038293123245 0.038391176611185074 -0.9979844689369202 1.0 0.0 0.0 1.0 0.0 0.0 1.0 0.0 0.0 0.9759036898612976 0.21820199489593506 0.0 0.9759036898612976 0.21820199489593506 0.0 0.9759036898612976 0.21820199489593506 0.0 0.0 0.03434862568974495 0.9994099736213684 0.0 -1.0 0.0 0.0 1.0 0.0 0.0 0.9999999403953552 -3.03112528854399e-07 -1.0 0.0 0.0 0.0 -3.5964751532446826e-07 -1.0 0.0 -9.98238533611584e-07 -1.0 0.0 -1.9589106159401126e-07 -0.9999999403953552 0.0 0.0 -1.0 1.0 0.0 0.0 0.0 0.0 1.0 0.0 -1.0 0.0 0.0 1.0 0.0 1.5396008734569477e-07 1.0 -4.90020113375067e-08 0.0 1.0 -3.5857561897501e-07 -2.652169257544301e-07 0.9999999403953552 -1.6983442208129418e-07 -0.9999704957008362 0.0076745557598769665 0.0 1.344596626040584e-06 -1.3958258477941854e-06 -1.0 0.0 -1.8033754258794943e-06 -1.0 1.9640394839370856e-06 -1.2080715805495856e-06 -1.0 -0.036932770162820816 0.057216253131628036 -0.9976785182952881 -0.036932770162820816 0.057216253131628036 -0.9976785182952881 -0.036932770162820816 0.057216253131628036 -0.9976785182952881 0.0 0.4379817545413971 -0.8989839553833008 0.0 0.4379817545413971 -0.8989839553833008 0.0 0.4379817545413971 -0.8989839553833008 0.0 0.4379814863204956 -0.8989839553833008 0.0 0.4379814863204956 -0.8989839553833008 0.0 0.4379814863204956 -0.8989839553833008 0.14247964322566986 0.12439878284931183 -0.9819493889808655 0.14247964322566986 0.12439878284931183 -0.9819493889808655 0.14247964322566986 0.12439878284931183 -0.9819493889808655 -0.011364907957613468 0.012446651235222816 -0.9998579025268555 -0.011364907957613468 0.012446651235222816 -0.9998579025268555 -0.011364907957613468 0.012446651235222816 -0.9998579025268555 5.949735168542247e-06 0.0 -1.0 1.0 -1.9833179010220192e-07 0.0 1.0 -1.4049848573449708e-07 -1.7865544066353323e-07 0.9999999403953552 -1.405370255724847e-07 -1.7853635370101983e-07 0.9999999403953552 0.0 -6.126755920377036e-07 0.9985426068305969 0.05015707388520241 0.019919954240322113 0.9985426068305969 0.05015707388520241 0.019919954240322113 0.9985426068305969 0.05015707388520241 0.019919954240322113 0.9990041851997375 0.044617533683776855 0.0 0.9990041851997375 0.044617533683776855 0.0 0.9990041851997375 0.044617533683776855 0.0 0.0 -0.0241681057959795 0.9997078776359558 0.0 -1.0 0.0 -2.653747799286066e-07 1.0 -3.3721042314027727e-07 0.0 1.0 -9.122460369326291e-07 2.052745315950233e-07 0.9999999403953552 -2.1149065787540167e-07 0.0 0.9999999403953552 0.0 -1.0 0.0 0.0 -0.9999999403953552 0.0 0.0 1.0 0.0 0.0 0.0 0.0 1.0 1.389983708577347e-06 1.0 -1.4427997712118668e-06 0.0 1.0 -3.705824383359868e-06 0.0 1.0 -3.0540074931195704e-06 -9.944044450094225e-07 1.0 -7.499596108573314e-07 1.006335082820442e-06 1.2127434274589177e-06 -0.9999999403953552 1.2521315966296243e-06 -4.142770819726138e-07 -1.0 0.0 0.0 -1.0 1.3412349062491558e-06 -4.146923402004177e-06 -1.0 0.0 -6.2270783018902875e-06 -0.9999999403953552 0.0 -1.0 0.0 0.0 -0.9999999403953552 -2.1337724476211406e-08 -0.9954099059104919 0.09570303559303284 0.0 -0.9954099059104919 0.09570303559303284 0.0 -0.9954099059104919 0.09570303559303284 0.0 -0.9835410714149475 0.14825627207756042 0.1032819077372551 -0.9835410714149475 0.14825627207756042 0.1032819077372551 -0.9835410714149475 0.14825627207756042 0.1032819077372551 0.0 0.12222377210855484 -0.9925025701522827 0.0 0.12222377210855484 -0.9925025701522827 0.0 0.12222377210855484 -0.9925025701522827 0.0 0.3933332860469818 -0.919395923614502 0.0 0.3933332860469818 -0.919395923614502 0.0 0.3933332860469818 -0.919395923614502 0.9999040365219116 -0.013851572759449482 0.0 0.0 -0.0577986054122448 0.9983282685279846 0.0 -1.0 0.0 0.0 1.0 0.0 0.0 1.0 -3.861874802169041e-07</float_array>
				<technique_common>
				<accessor source="#id-mesh-7-normals-array" count="402" stride="3">
					<param name="X" type="float"/>
					<param name="Y" type="float"/>
					<param name="Z" type="float"/>
				</accessor>
				</technique_common>
			</source>
			<source id="id-mesh-7-texcoord-0">
				<float_array id="id-mesh-7-texcoord-0-array" count="804"> 0.17940270900726318 0.8810248970985413 0.2145100235939026 0.8683174848556519 0.21444159746170044 0.8850657343864441 0.1759711503982544 0.9044402837753296 0.17447322607040405 0.8985413908958435 0.2041611671447754 0.9155829548835754 0.19120925664901733 0.8957628607749939 0.1982487440109253 0.8967381715774536 0.2041611671447754 0.9155829548835754 0.21444159746170044 0.8850657343864441 0.19356834888458252 0.8924721479415894 0.18633347749710083 0.8859313726425171 0.23134231567382812 0.8683174848556519 0.21444159746170044 0.8850657343864441 0.2145100235939026 0.8683174848556519 0.17128366231918335 0.8765754103660583 0.1743382215499878 0.8729719519615173 0.1751035451889038 0.8799687623977661 0.23276686668395996 0.8526009321212769 0.2291724681854248 0.8608164191246033 0.2292541265487671 0.8525289297103882 0.2408275604248047 0.8645501732826233 0.23291921615600586 0.8639087677001953 0.23570328950881958 0.8622367978096008 0.24134182929992676 0.861187219619751 0.24506032466888428 0.8524858951568604 0.24502944946289062 0.8612797856330872 0.24137920141220093 0.8525289297103882 0.2327367663383484 0.8489924669265747 0.24134927988052368 0.8489212393760681 0.24502944946289062 0.8612797856330872 0.2539210319519043 0.8524858951568604 0.2539210319519043 0.8613457679748535 0.23276686668395996 0.8526009321212769 0.24137920141220093 0.8525289297103882 0.23535573482513428 0.8588864207267761 0.05459249019622803 0.9328980445861816 0.04556906223297119 0.9428326487541199 0.046640872955322266 0.9220989346504211 0.04556906223297119 0.9428326487541199 0.03779482841491699 0.9228943586349487 0.046640872955322266 0.9220989346504211 0.03823864459991455 0.9434981346130371 0.028931379318237305 0.923488974571228 0.03779482841491699 0.9228943586349487 0.025555729866027832 0.9378350973129272 0.02031862735748291 0.933732271194458 0.028931379318237305 0.923488974571228 0.03779482841491699 0.9228943586349487 0.028337478637695312 0.91462641954422 0.03719985485076904 0.9140319228172302 0.03823864459991455 0.9434981346130371 0.04347354173660278 0.9431928396224976 0.041542768478393555 0.9435616135597229 0.25051307678222656 0.7457382082939148 0.2513558864593506 0.752988874912262 0.24343907833099365 0.7618003487586975 0.24167358875274658 0.707796573638916 0.2492460012435913 0.7229301929473877 0.2149670124053955 0.7191584706306458 0.2492460012435913 0.7229301929473877 0.21635419130325317 0.7353701591491699 0.2149670124053955 0.7191584706306458 0.21635419130325317 0.7353701591491699 0.25051307678222656 0.7457382082939148 0.21664512157440186 0.75165855884552 0.2149670124053955 0.7191584706306458 0.20012688636779785 0.736767053604126 0.19873833656311035 0.7205389142036438 0.2507006525993347 0.7116250991821289 0.2513558864593506 0.7117477059364319 0.2502714991569519 0.7231219410896301 0.1047828197479248 0.8788673281669617 0.10319006443023682 0.8648302555084229 0.11136794090270996 0.8731797933578491 0.10319006443023682 0.8648302555084229 0.10051685571670532 0.8601972460746765 0.10372591018676758 0.8553127646446228 0.09167134761810303 0.8638880848884583 0.08463752269744873 0.8549059629440308 0.09247666597366333 0.8548823595046997 0.09167134761810303 0.8638880848884583 0.08812510967254639 0.8777098655700684 0.08259421586990356 0.87107253074646 0.09121090173721313 0.8494941592216492 0.07922577857971191 0.848332405090332 0.0857992172241211 0.8429206013679504 0.09695863723754883 0.8702329993247986 0.09167134761810303 0.8638880848884583 0.09833943843841553 0.8614721894264221 0.09462487697601318 0.9369483590126038 0.08491778373718262 0.9437121748924255 0.08193320035934448 0.9351223707199097 0.11084669828414917 0.9203084111213684 0.09530395269393921 0.9213855266571045 0.10340684652328491 0.9130597710609436 0.10274606943130493 0.9286366701126099 0.08720457553863525 0.9297145009040833 0.09530395269393921 0.9213855266571045 0.08193320035934448 0.9351223707199097 0.08491778373718262 0.9437121748924255 0.07922577857971191 0.9381622076034546 0.09462487697601318 0.9369483590126038 0.10274606943130493 0.9286366701126099 0.10044741630554199 0.9326008558273315 0.2193695306777954 0.7813947796821594 0.20426243543624878 0.7751915454864502 0.2194746732711792 0.7748333811759949 0.20426243543624878 0.7751915454864502 0.20425337553024292 0.7711851596832275 0.2108379602432251 0.7682709097862244 0.20965653657913208 0.7931347489356995 0.20402401685714722 0.7860643267631531 0.2191869616508484 0.7879543304443359 0.20402401685714722 0.7860643267631531 0.2193695306777954 0.7813947796821594 0.2191869616508484 0.7879543304443359 0.21947485208511353 0.7682710289955139 0.22603720426559448 0.7748333215713501 0.2194746732711792 0.7748333811759949 0.23177635669708252 0.9690267443656921 0.23283272981643677 0.960273802280426 0.23202848434448242 0.9718204140663147 0.23283350467681885 0.9718928933143616 0.23768126964569092 0.9602700471878052 0.2376806139945984 0.9718893766403198 0.237684428691864 0.9554071426391602 0.24930012226104736 0.9602698683738708 0.23768126964569092 0.9602700471878052 0.24652838706970215 0.9767410159111023 0.2376806139945984 0.9718893766403198 0.24930089712142944 0.971889078617096 0.23768126964569092 0.9602700471878052 0.24930089712142944 0.971889078617096 0.2376806139945984 0.9718893766403198 0.17891937494277954 0.8952698111534119 0.17539161443710327 0.8962156772613525 0.1758614182472229 0.8943288922309875 0.09833943843841553 0.8614721894264221 0.09877932071685791 0.8597680926322937 0.10051685571670532 0.8601972460746765 0.24167358875274658 0.707796573638916 0.2507006525993347 0.7116250991821289 0.2499346137046814 0.7157078385353088 0.10044741630554199 0.9326008558273315 0.10136497020721436 0.9317032694816589 0.10225886106491089 0.9363902807235718 0.23535573482513428 0.8588864207267761 0.23895078897476196 0.8610115051269531 0.23570328950881958 0.8622367978096008 0.10225886106491089 0.9363902807235718 0.10343486070632935 0.9294437170028687 0.11084669828414917 0.9366750717163086 0.09530395269393921 0.9213855266571045 0.08178949356079102 0.924450159072876 0.08697402477264404 0.913284182548523 0.20025700330734253 0.7751268744468689 0.20426243543624878 0.7751915454864502 0.20417529344558716 0.7806284427642822 0.20965653657913208 0.7931347489356995 0.20259368419647217 0.7917322516441345 0.20348000526428223 0.7893033027648926 0.10184711217880249 0.8535463213920593 0.10389870405197144 0.8536311388015747 0.10372591018676758 0.8553127646446228 0.17208999395370483 0.9014295339584351 0.1734619140625 0.899936854839325 0.1759711503982544 0.9044402837753296 0.18633347749710083 0.8859313726425171 0.17827188968658447 0.8872944116592407 0.17824673652648926 0.885471522808075 0.19356834888458252 0.8924721479415894 0.1982487440109253 0.8967381715774536 0.19120925664901733 0.8957628607749939 0.24930179119110107 0.9769680500030518 0.24652838706970215 0.9767410159111023 0.24930089712142944 0.971889078617096 0.24930012226104736 0.9602698683738708 0.25416475534439087 0.9691169261932373 0.24930089712142944 0.971889078617096 0.17125874757766724 0.9029191136360168 0.17208999395370483 0.9014295339584351 0.1759711503982544 0.9044402837753296 0.17699861526489258 0.8922939300537109 0.17891937494277954 0.8952698111534119 0.1758614182472229 0.8943288922309875 0.10068190097808838 0.862007200717926 0.09833943843841553 0.8614721894264221 0.10051685571670532 0.8601972460746765 0.09931010007858276 0.93366539478302 0.10044741630554199 0.9326008558273315 0.10225886106491089 0.9363902807235718 0.10175091028213501 0.8554472327232361 0.10184711217880249 0.8535463213920593 0.10372591018676758 0.8553127646446228 0.23429429531097412 0.8608676791191101 0.23535573482513428 0.8588864207267761 0.23570328950881958 0.8622367978096008 0.18634742498397827 0.8929346799850464 0.19356834888458252 0.8924721479415894 0.19120925664901733 0.8957628607749939 0.17874926328659058 0.8839974999427795 0.18633347749710083 0.8859313726425171 0.17824673652648926 0.885471522808075 0.04736727476119995 0.9429934620857239 0.05459249019622803 0.9328980445861816 0.05143427848815918 0.9403606057167053 0.05459249019622803 0.9328980445861816 0.05517077445983887 0.9376294612884521 0.05143427848815918 0.9403606057167053 0.05517077445983887 0.9376294612884521 0.05548793077468872 0.94403475522995 0.05143427848815918 0.9403606057167053 0.05548793077468872 0.94403475522995 0.05213075876235962 0.9445558786392212 0.05143427848815918 0.9403606057167053 0.05213075876235962 0.9445558786392212 0.05000197887420654 0.9447229504585266 0.05143427848815918 0.9403606057167053 0.049078404903411865 0.9440920352935791 0.04736727476119995 0.9429934620857239 0.05143427848815918 0.9403606057167053 0.17939519882202148 0.8721873760223389 0.19460737705230713 0.928637683391571 0.16939115524291992 0.9054879546165466 0.17125874757766724 0.9029191136360168 0.1734619140625 0.899936854839325 0.21003472805023193 0.9006548523902893 0.2041611671447754 0.9155829548835754 0.1982487440109253 0.8967381715774536 0.2041611671447754 0.9155829548835754 0.17447322607040405 0.8985413908958435 0.19120925664901733 0.8957628607749939 0.19120925664901733 0.8957628607749939 0.17447322607040405 0.8985413908958435 0.17891937494277954 0.8952698111534119 0.17447322607040405 0.8985413908958435 0.17539161443710327 0.8962156772613525 0.17891937494277954 0.8952698111534119 0.17891937494277954 0.8952698111534119 0.17699861526489258 0.8922939300537109 0.1778438687324524 0.8903700113296509 0.1778438687324524 0.8903700113296509 0.18634742498397827 0.8929346799850464 0.17891937494277954 0.8952698111534119 0.18634742498397827 0.8929346799850464 0.19120925664901733 0.8957628607749939 0.17891937494277954 0.8952698111534119 0.21444159746170044 0.8850657343864441 0.21003472805023193 0.9006548523902893 0.1982487440109253 0.8967381715774536 0.19356834888458252 0.8924721479415894 0.18634742498397827 0.8929346799850464 0.18633347749710083 0.8859313726425171 0.18634742498397827 0.8929346799850464 0.1778438687324524 0.8903700113296509 0.18633347749710083 0.8859313726425171 0.21444159746170044 0.8850657343864441 0.1982487440109253 0.8967381715774536 0.19356834888458252 0.8924721479415894 0.17874926328659058 0.8839974999427795 0.17940270900726318 0.8810248970985413 0.18633347749710083 0.8859313726425171 0.17940270900726318 0.8810248970985413 0.21444159746170044 0.8850657343864441 0.18633347749710083 0.8859313726425171 0.17827188968658447 0.8872944116592407 0.23134231567382812 0.8851497769355774 0.170366108417511 0.8746819496154785 0.1704215407371521 0.8719690442085266 0.17232167720794678 0.8720078468322754 0.1759934425354004 0.8721184134483337 0.17939519882202148 0.8721873760223389 0.170210599899292 0.8811163902282715 0.17021286487579346 0.8788687586784363 0.17352473735809326 0.881119966506958 0.17940270900726318 0.8810248970985413 0.17628753185272217 0.8810643553733826 0.046640872955322266 0.9220989346504211 0.05548793077468872 0.9228900074958801 0.05459249019622803 0.9328980445861816 0.05459249019622803 0.9328980445861816 0.04736727476119995 0.9429934620857239 0.04556906223297119 0.9428326487541199 0.03823864459991455 0.9434981346130371 0.030892133712768555 0.9438976645469666 0.020045876502990723 0.9236609935760498 0.028931379318237305 0.923488974571228 0.030892133712768555 0.9438976645469666 0.025555729866027832 0.9378350973129272 0.030892133712768555 0.9438976645469666 0.027539610862731934 0.9440549612045288 0.025555729866027832 0.9378350973129272 0.028931379318237305 0.923488974571228 0.04556906223297119 0.9428326487541199 0.04556906223297119 0.9430010318756104 0.04158520698547363 0.9438679814338684 0.03823888301849365 0.9441701769828796 0.23177635669708252 0.9601786732673645 0.23283350467681885 0.9718928933143616 0.23283272981643677 0.960273802280426 0.24930202960968018 0.955406665802002 0.23768126964569092 0.9767406582832336 0.24930012226104736 0.9602698683738708 0.25416475534439087 0.9602688550949097 0.20417529344558716 0.7806284427642822 0.21947485208511353 0.7682710289955139 0.2194746732711792 0.7748333811759949 0.2108379602432251 0.7682709097862244 0.2194746732711792 0.7748333811759949 0.20426243543624878 0.7751915454864502 0.2108379602432251 0.7682709097862244 0.2191869616508484 0.7879543304443359 0.21819406747817993 0.7944413423538208 0.20965653657913208 0.7931347489356995 0.20965653657913208 0.7931347489356995 0.20348000526428223 0.7893033027648926 0.20402401685714722 0.7860643267631531 0.20417529344558716 0.7806284427642822 0.22603720426559448 0.7682708501815796 0.19873833656311035 0.7805411219596863 0.19879084825515747 0.7772570848464966 0.23264533281326294 0.8608502149581909 0.23264533281326294 0.8608502149581909 0.23429429531097412 0.8608676791191101 0.23895078897476196 0.8610115051269531 0.24134182929992676 0.861187219619751 0.24137920141220093 0.8525289297103882 0.23276686668395996 0.8526009321212769 0.24506032466888428 0.8524858951568604 0.24134182929992676 0.861187219619751 0.23895078897476196 0.8610115051269531 0.23429429531097412 0.8608676791191101 0.23264533281326294 0.8608502149581909 0.09695863723754883 0.8702329993247986 0.10599160194396973 0.8514262437820435 0.11136794090270996 0.8574334383010864 0.10372591018676758 0.8553127646446228 0.11136794090270996 0.8574334383010864 0.10319006443023682 0.8648302555084229 0.10372591018676758 0.8553127646446228 0.10319006443023682 0.8648302555084229 0.10068190097808838 0.862007200717926 0.10051685571670532 0.8601972460746765 0.10051685571670532 0.8601972460746765 0.09877932071685791 0.8597680926322937 0.09795767068862915 0.8587176203727722 0.09795767068862915 0.8587176203727722 0.10175091028213501 0.8554472327232361 0.10051685571670532 0.8601972460746765 0.10175091028213501 0.8554472327232361 0.10372591018676758 0.8553127646446228 0.10051685571670532 0.8601972460746765 0.10389870405197144 0.8536311388015747 0.08463752269744873 0.8549059629440308 0.09121090173721313 0.8494941592216492 0.09247666597366333 0.8548823595046997 0.09339004755020142 0.8521411418914795 0.09247666597366333 0.8548823595046997 0.09498411417007446 0.8540774583816528 0.09795767068862915 0.8587176203727722 0.09795767068862915 0.8587176203727722 0.09167134761810303 0.8638880848884583 0.09247666597366333 0.8548823595046997 0.09695863723754883 0.8702329993247986 0.08463752269744873 0.8549059629440308 0.09795767068862915 0.8587176203727722 0.09877932071685791 0.8597680926322937 0.10068190097808838 0.862007200717926 0.10319006443023682 0.8648302555084229 0.08720457553863525 0.9297145009040833 0.08651447296142578 0.9452691078186035 0.10274606943130493 0.9286366701126099 0.09462487697601318 0.9369483590126038 0.10343486070632935 0.9294437170028687 0.10136497020721436 0.9317032694816589 0.09931010007858276 0.93366539478302 0.095314621925354 0.9377544522285461 0.10428261756896973 0.9433930516242981 0.09690976142883301 0.9393102526664734 0.095314621925354 0.9377544522285461 0.09931010007858276 0.93366539478302 0.10136497020721436 0.9317032694816589 0.08720457553863525 0.9297145009040833 0.08042585849761963 0.9200183749198914 0.21852582693099976 0.76783686876297 0.21664512157440186 0.75165855884552 0.24343907833099365 0.7618003487586975 0.21664512157440186 0.75165855884552 0.25051307678222656 0.7457382082939148 0.24343907833099365 0.7618003487586975 0.2149670124053955 0.7191584706306458 0.21651262044906616 0.702945351600647 0.24167358875274658 0.707796573638916 0.24167358875274658 0.707796573638916 0.2499346137046814 0.7157078385353088 0.2492460012435913 0.7229301929473877 0.2503436207771301 0.7343170642852783 0.2503436207771301 0.7343170642852783 0.21635419130325317 0.7353701591491699 0.2492460012435913 0.7229301929473877 0.2499346137046814 0.7157078385353088</float_array>
				<technique_common>
				<accessor source="#id-mesh-7-texcoord-0-array" count="402" stride="2">
					<param name="S" type="float"/>
					<param name="T" type="float"/>
				</accessor>
				</technique_common>
			</source>
			<vertices id="id-mesh-7-vertices">
				<input semantic="POSITION" source="#id-mesh-7-positions"/>
			</vertices>
			<polygons count="186" material="id-trimat-8">
				<input semantic="VERTEX" source="#id-mesh-7-vertices" offset="0"/>
				<input semantic="NORMAL" source="#id-mesh-7-normals" offset="0"/>
				<input semantic="TEXCOORD" source="#id-mesh-7-texcoord-0" offset="0" set="0"/>
				<p> 0 1 2 </p>
				<p> 3 4 5 </p>
				<p> 6 7 8 </p>
				<p> 9 10 11 </p>
				<p> 12 13 14 </p>
				<p> 15 16 17 </p>
				<p> 18 19 20 </p>
				<p> 21 22 23 </p>
				<p> 24 25 26 </p>
				<p> 27 28 29 </p>
				<p> 30 31 32 </p>
				<p> 33 34 35 </p>
				<p> 36 37 38 </p>
				<p> 39 40 41 </p>
				<p> 42 43 44 </p>
				<p> 45 46 47 </p>
				<p> 48 49 50 </p>
				<p> 51 52 53 </p>
				<p> 54 55 56 </p>
				<p> 57 58 59 </p>
				<p> 60 61 62 </p>
				<p> 63 64 65 </p>
				<p> 66 67 68 </p>
				<p> 69 70 71 </p>
				<p> 72 73 74 </p>
				<p> 75 76 77 </p>
				<p> 78 79 80 </p>
				<p> 81 82 83 </p>
				<p> 84 85 86 </p>
				<p> 87 88 89 </p>
				<p> 90 91 92 </p>
				<p> 93 94 95 </p>
				<p> 96 97 98 </p>
				<p> 99 100 101 </p>
				<p> 102 103 104 </p>
				<p> 105 106 107 </p>
				<p> 108 109 110 </p>
				<p> 111 112 113 </p>
				<p> 114 115 116 </p>
				<p> 117 118 119 </p>
				<p> 120 121 122 </p>
				<p> 123 124 125 </p>
				<p> 126 127 128 </p>
				<p> 129 130 131 </p>
				<p> 132 133 134 </p>
				<p> 135 136 137 </p>
				<p> 138 139 140 </p>
				<p> 141 142 143 </p>
				<p> 144 145 146 </p>
				<p> 147 148 149 </p>
				<p> 150 151 152 </p>
				<p> 153 154 155 </p>
				<p> 156 157 158 </p>
				<p> 159 160 161 </p>
				<p> 162 163 164 </p>
				<p> 165 166 167 </p>
				<p> 168 169 170 </p>
				<p> 171 172 173 </p>
				<p> 174 175 176 </p>
				<p> 177 178 179 </p>
				<p> 180 181 182 </p>
				<p> 183 184 185 </p>
				<p> 186 187 188 </p>
				<p> 189 190 191 </p>
				<p> 192 193 194 </p>
				<p> 195 196 197 </p>
				<p> 198 199 200 </p>
				<p> 201 202 203 </p>
				<p> 204 205 206 </p>
				<p> 207 208 209 </p>
				<p> 210 211 212 </p>
				<p> 213 214 215 </p>
				<p> 216 217 218 </p>
				<p> 219 220 221 </p>
				<p> 0 222 1 </p>
				<p> 5 223 3 </p>
				<p> 223 224 3 </p>
				<p> 224 225 3 </p>
				<p> 3 226 4 </p>
				<p> 227 228 229 </p>
				<p> 230 231 232 </p>
				<p> 233 234 235 </p>
				<p> 236 237 238 </p>
				<p> 239 240 241 </p>
				<p> 242 243 244 </p>
				<p> 245 246 247 </p>
				<p> 248 249 250 </p>
				<p> 251 252 253 </p>
				<p> 254 255 256 </p>
				<p> 257 258 259 </p>
				<p> 260 261 262 </p>
				<p> 263 264 265 </p>
				<p> 255 266 256 </p>
				<p> 12 267 13 </p>
				<p> 268 269 270 </p>
				<p> 16 271 17 </p>
				<p> 271 272 17 </p>
				<p> 268 270 16 </p>
				<p> 273 274 275 </p>
				<p> 274 15 275 </p>
				<p> 275 15 17 </p>
				<p> 15 268 16 </p>
				<p> 272 276 17 </p>
				<p> 276 277 17 </p>
				<p> 278 279 280 </p>
				<p> 281 282 283 </p>
				<p> 39 284 40 </p>
				<p> 42 285 43 </p>
				<p> 286 47 46 </p>
				<p> 287 288 289 </p>
				<p> 290 291 292 </p>
				<p> 48 293 49 </p>
				<p> 51 294 52 </p>
				<p> 294 295 52 </p>
				<p> 296 297 53 </p>
				<p> 297 51 53 </p>
				<p> 298 121 120 </p>
				<p> 121 299 122 </p>
				<p> 123 300 124 </p>
				<p> 126 301 127 </p>
				<p> 129 302 130 </p>
				<p> 132 303 133 </p>
				<p> 177 304 178 </p>
				<p> 105 305 106 </p>
				<p> 306 307 308 </p>
				<p> 309 310 311 </p>
				<p> 312 313 314 </p>
				<p> 315 316 317 </p>
				<p> 114 318 115 </p>
				<p> 117 319 118 </p>
				<p> 320 321 158 </p>
				<p> 321 156 158 </p>
				<p> 18 322 19 </p>
				<p> 22 323 23 </p>
				<p> 323 324 23 </p>
				<p> 23 325 21 </p>
				<p> 325 326 21 </p>
				<p> 24 327 25 </p>
				<p> 27 328 28 </p>
				<p> 30 329 31 </p>
				<p> 34 330 331 </p>
				<p> 35 332 333 </p>
				<p> 34 331 35 </p>
				<p> 333 33 35 </p>
				<p> 72 334 73 </p>
				<p> 335 336 337 </p>
				<p> 338 339 340 </p>
				<p> 341 342 343 </p>
				<p> 344 345 346 </p>
				<p> 347 348 349 </p>
				<p> 350 351 352 </p>
				<p> 337 353 335 </p>
				<p> 354 355 356 </p>
				<p> 355 357 356 </p>
				<p> 358 359 360 </p>
				<p> 361 362 363 </p>
				<p> 81 364 82 </p>
				<p> 84 365 85 </p>
				<p> 88 366 89 </p>
				<p> 366 367 89 </p>
				<p> 89 368 87 </p>
				<p> 368 369 87 </p>
				<p> 92 370 90 </p>
				<p> 90 371 91 </p>
				<p> 93 372 94 </p>
				<p> 96 373 97 </p>
				<p> 103 374 104 </p>
				<p> 374 375 104 </p>
				<p> 104 376 377 </p>
				<p> 377 102 104 </p>
				<p> 152 378 150 </p>
				<p> 378 379 150 </p>
				<p> 379 380 381 </p>
				<p> 150 382 151 </p>
				<p> 379 381 150 </p>
				<p> 383 154 153 </p>
				<p> 154 384 155 </p>
				<p> 385 386 387 </p>
				<p> 388 389 390 </p>
				<p> 391 392 393 </p>
				<p> 394 395 396 </p>
				<p> 60 397 61 </p>
				<p> 63 398 64 </p>
				<p> 66 399 67 </p>
				<p> 71 400 401 </p>
				<p> 401 69 71 </p>
			</polygons>
		</mesh>
	</geometry>
</library_geometries>
<library_visual_scenes>
	<visual_scene id="id-scene-1" name="scene">
		<node id="rock_02" name="rock_02" type="NODE">
			<matrix sid="transform"> -0.7071077823638916 3.090857703114125e-08 0.7071057558059692 0.0 0.7071057558059692 3.090866584898322e-08 0.7071077823638916 0.0 0.0 1.0 -4.371138828673793e-08 0.0 0.0 0.0 0.0 1.0  </matrix>
			<instance_geometry url="#id-mesh-7">
				<bind_material>
					<technique_common>
						<instance_material symbol="id-trimat-8" target="#id-material-6"/>
					</technique_common>
				</bind_material>
			</instance_geometry>
		</node>
	</visual_scene>
</library_visual_scenes>
<scene>
	<instance_visual_scene url="#id-scene-1" />
</scene>
</COLLADA>
