<?xml version="1.0" encoding="utf-8"?>
<COLLADA xmlns="http://www.collada.org/2005/11/COLLADASchema" version="1.4.1">
<asset>
	<contributor>
		<author>Anonymous</author>
		<authoring_tool>Collada Exporter for Blender 2.6+, by Juan Linietsky (juan@codenix.com)</authoring_tool>
	</contributor>
	<created>2019-05-05T16:39:16Z</created>
	<modified>2019-05-05T16:39:16Z</modified>
	<unit meter="1.0" name="meter"/>
	<up_axis>Z_UP</up_axis>
</asset>
<library_images>
	<image id="id-image-3" name="Palette.png">
		<init_from>../../concepts/3D/LowPolyPack/Palette.png</init_from>
	</image>
</library_images>
<library_effects>
	<effect id="id-fx-2" name="Material.001-fx">
		<profile_COMMON>
			<newparam sid="id-fx_surf-4">
				<surface type="2D">
					<init_from>id-image-3</init_from>
					<format>A8R8G8B8</format>
				</surface>
			</newparam>
			<newparam sid="id-fx_sampler-5">
				<sampler2D>
					<source>id-fx_surf-4</source>
				</sampler2D>
			</newparam>
			<technique sid="common">
				<blinn>
					<emission>
						<color>  0.0 0.0 0.0 1.0 </color>
					</emission>
					<ambient>
						<color>  0.0 0.0 0.0 1.0 </color>
					</ambient>
					<diffuse>
						<texture texture="id-fx_sampler-5" texcoord="CHANNEL1"/>
					</diffuse>
					<specular>
						<color>  0.5 0.5 0.5 1.0 </color>
					</specular>
					<shininess>
						<float>50</float>
					</shininess>
					<reflective>
						<color>  1.0 1.0 1.0 1.0 </color>
					</reflective>
					<index_of_refraction>
						<float>4.0</float>
					</index_of_refraction>
				</blinn>
				<extra>
					<technique profile="FCOLLADA">
					</technique>
					<technique profile="GOOGLEEARTH">
						<double_sided>0</double_sided>
					</technique>
				</extra>
			</technique>
		</profile_COMMON>
	</effect>
</library_effects>
<library_materials>
	<material id="id-material-6" name="Material.001">
		<instance_effect url="#id-fx-2"/>
	</material>
</library_materials>
<library_geometries>
	<geometry id="id-mesh-7" name="Sphere.011">
		<mesh>
			<source id="id-mesh-7-positions">
				<float_array id="id-mesh-7-positions-array" count="192"> 1.4569376707077026 -0.29064369201660156 0.1479194164276123 -0.08284719288349152 -1.2350356578826904 -0.09051641821861267 1.159299373626709 -0.3808291256427765 -1.0521535873413086 2.14831280708313 0.25633251667022705 -1.1897341012954712 2.267530679702759 0.263662725687027 -0.3570963144302368 -0.5857328176498413 -0.7139683365821838 -0.4728810489177704 -1.0877100229263306 0.32007673382759094 -0.258443683385849 -0.49320197105407715 0.7208251953125 -0.8612703680992126 -0.21560251712799072 -0.32643821835517883 -0.8778161406517029 0.7538216710090637 1.6456998586654663 -0.501909613609314 0.11337757110595703 1.2847521305084229 0.23699845373630524 0.48347777128219604 1.117347002029419 0.4087958335876465 1.7097325325012207 1.3093996047973633 -0.21120129525661469 1.4730385541915894 1.6204333305358887 -0.6459158062934875 -0.21560251712799072 -0.32643821835517883 -0.8778161406517029 -0.49320197105407715 0.7208251953125 -0.8612703680992126 0.3526732325553894 1.3034617900848389 -0.9796174168586731 1.5687294006347656 1.3170487880706787 -1.1349238157272339 2.14831280708313 0.25633251667022705 -1.1897341012954712 1.159299373626709 -0.3808291256427765 -1.0521535873413086 -0.21560251712799072 -0.32643821835517883 -0.8778161406517029 1.159299373626709 -0.3808291256427765 -1.0521535873413086 -0.08284719288349152 -1.2350356578826904 -0.09051641821861267 -0.5857328176498413 -0.7139683365821838 -0.4728810489177704 1.6266026496887207 0.19206538796424866 0.3344746232032776 1.4569376707077026 -0.29064369201660156 0.1479194164276123 2.267530679702759 0.263662725687027 -0.3570963144302368 2.174794912338257 0.5131139755249023 -0.0499567985534668 1.4569376707077026 -0.29064369201660156 0.1479194164276123 1.6266026496887207 0.19206538796424866 0.3344746232032776 0.6178547143936157 0.4919530749320984 0.6356765031814575 -0.403147429227829 -0.19961369037628174 0.49778538942337036 -0.08284719288349152 -1.2350356578826904 -0.09051641821861267 0.6178547143936157 0.4919530749320984 0.6356765031814575 0.48347777128219604 1.117347002029419 0.4087958335876465 0.11337757110595703 1.2847521305084229 0.23699845373630524 -1.002375602722168 0.4800952076911926 0.10056126117706299 -0.403147429227829 -0.19961369037628174 0.49778538942337036 0.3526732325553894 1.3034617900848389 -0.9796174168586731 0.7538216710090637 1.6456998586654663 -0.501909613609314 1.4730385541915894 1.6204333305358887 -0.6459158062934875 1.5687294006347656 1.3170487880706787 -1.1349238157272339 0.6178547143936157 0.4919530749320984 0.6356765031814575 1.6266026496887207 0.19206538796424866 0.3344746232032776 2.174794912338257 0.5131139755249023 -0.0499567985534668 1.7097325325012207 1.3093996047973633 -0.21120129525661469 0.48347777128219604 1.117347002029419 0.4087958335876465 1.5687294006347656 1.3170487880706787 -1.1349238157272339 1.4730385541915894 1.6204333305358887 -0.6459158062934875 1.7097325325012207 1.3093996047973633 -0.21120129525661469 2.174794912338257 0.5131139755249023 -0.0499567985534668 2.267530679702759 0.263662725687027 -0.3570963144302368 2.14831280708313 0.25633251667022705 -1.1897341012954712 0.11337757110595703 1.2847521305084229 0.23699845373630524 0.7538216710090637 1.6456998586654663 -0.501909613609314 0.3526732325553894 1.3034617900848389 -0.9796174168586731 -0.49320197105407715 0.7208251953125 -0.8612703680992126 -1.0877100229263306 0.32007673382759094 -0.258443683385849 -1.002375602722168 0.4800952076911926 0.10056126117706299 -0.08284719288349152 -1.2350356578826904 -0.09051641821861267 -0.403147429227829 -0.19961369037628174 0.49778538942337036 -1.002375602722168 0.4800952076911926 0.10056126117706299 -1.0877100229263306 0.32007673382759094 -0.258443683385849 -0.5857328176498413 -0.7139683365821838 -0.4728810489177704</float_array>
				<technique_common>
				<accessor source="#id-mesh-7-positions-array" count="64" stride="3">
					<param name="X" type="float"/>
					<param name="Y" type="float"/>
					<param name="Z" type="float"/>
				</accessor>
				</technique_common>
			</source>
			<source id="id-mesh-7-normals">
				<float_array id="id-mesh-7-normals-array" count="192"> 0.53146892786026 -0.844314694404602 -0.06836307048797607 0.53146892786026 -0.844314694404602 -0.06836307048797607 0.53146892786026 -0.844314694404602 -0.06836307048797607 0.53146892786026 -0.844314694404602 -0.06836307048797607 0.53146892786026 -0.844314694404602 -0.06836307048797607 -0.6476290822029114 -0.1598978042602539 -0.7449893951416016 -0.6476290822029114 -0.1598978042602539 -0.7449893951416016 -0.6476290822029114 -0.1598978042602539 -0.7449893951416016 -0.6476290822029114 -0.1598978042602539 -0.7449893951416016 0.13497914373874664 0.8391394019126892 0.5269020199775696 0.13497914373874664 0.8391394019126892 0.5269020199775696 0.13497914373874664 0.8391394019126892 0.5269020199775696 0.13497914373874664 0.8391394019126892 0.5269020199775696 0.13497914373874664 0.8391394019126892 0.5269020199775696 -0.12646770477294922 -0.017853254452347755 -0.9918100833892822 -0.12646770477294922 -0.017853254452347755 -0.9918100833892822 -0.12646770477294922 -0.017853254452347755 -0.9918100833892822 -0.12646770477294922 -0.017853254452347755 -0.9918100833892822 -0.12646770477294922 -0.017853254452347755 -0.9918100833892822 -0.12646770477294922 -0.017853254452347755 -0.9918100833892822 -0.12013792246580124 -0.6600833535194397 -0.7415233850479126 -0.12013792246580124 -0.6600833535194397 -0.7415233850479126 -0.12013792246580124 -0.6600833535194397 -0.7415233850479126 -0.12013792246580124 -0.6600833535194397 -0.7415233850479126 0.6744195818901062 -0.46019524335861206 0.5773893594741821 0.6744195818901062 -0.46019524335861206 0.5773893594741821 0.6744195818901062 -0.46019524335861206 0.5773893594741821 0.6744195818901062 -0.46019524335861206 0.5773893594741821 0.14666686952114105 -0.42891180515289307 0.8913604617118835 0.14666686952114105 -0.42891180515289307 0.8913604617118835 0.14666686952114105 -0.42891180515289307 0.8913604617118835 0.14666686952114105 -0.42891180515289307 0.8913604617118835 0.14666686952114105 -0.42891180515289307 0.8913604617118835 -0.30402708053588867 0.26648539304733276 0.9146327376365662 -0.30402708053588867 0.26648539304733276 0.9146327376365662 -0.30402708053588867 0.26648539304733276 0.9146327376365662 -0.30402708053588867 0.26648539304733276 0.9146327376365662 -0.30402708053588867 0.26648539304733276 0.9146327376365662 -0.07791299372911453 0.8402625918388367 -0.5365521907806396 -0.07791299372911453 0.8402625918388367 -0.5365521907806396 -0.07791299372911453 0.8402625918388367 -0.5365521907806396 -0.07791299372911453 0.8402625918388367 -0.5365521907806396 0.3674023747444153 0.3859316110610962 0.8462104797363281 0.3674023747444153 0.3859316110610962 0.8462104797363281 0.3674023747444153 0.3859316110610962 0.8462104797363281 0.3674023747444153 0.3859316110610962 0.8462104797363281 0.3674023747444153 0.3859316110610962 0.8462104797363281 0.8674682378768921 0.4806278645992279 -0.12843620777130127 0.8674682378768921 0.4806278645992279 -0.12843620777130127 0.8674682378768921 0.4806278645992279 -0.12843620777130127 0.8674682378768921 0.4806278645992279 -0.12843620777130127 0.8674682378768921 0.4806278645992279 -0.12843620777130127 0.8674682378768921 0.4806278645992279 -0.12843620777130127 -0.5829547047615051 0.8054257035255432 -0.10701988637447357 -0.5829547047615051 0.8054257035255432 -0.10701988637447357 -0.5829547047615051 0.8054257035255432 -0.10701988637447357 -0.5829547047615051 0.8054257035255432 -0.10701988637447357 -0.5829547047615051 0.8054257035255432 -0.10701988637447357 -0.5829547047615051 0.8054257035255432 -0.10701988637447357 -0.7902066111564636 -0.46743327379226685 0.3963325023651123 -0.7902066111564636 -0.46743327379226685 0.3963325023651123 -0.7902066111564636 -0.46743327379226685 0.3963325023651123 -0.7902066111564636 -0.46743327379226685 0.3963325023651123 -0.7902066111564636 -0.46743327379226685 0.3963325023651123</float_array>
				<technique_common>
				<accessor source="#id-mesh-7-normals-array" count="64" stride="3">
					<param name="X" type="float"/>
					<param name="Y" type="float"/>
					<param name="Z" type="float"/>
				</accessor>
				</technique_common>
			</source>
			<source id="id-mesh-7-texcoord-0">
				<float_array id="id-mesh-7-texcoord-0-array" count="128"> 0.7517410516738892 0.483152836561203 0.7565931081771851 0.4654005467891693 0.7650507688522339 0.48156818747520447 0.7650507688522339 0.49347516894340515 0.7559463977813721 0.4935433566570282 0.744290828704834 0.46640393137931824 0.7318260073661804 0.465261310338974 0.7319740056991577 0.45740076899528503 0.7431419491767883 0.46072766184806824 0.7601140141487122 0.44250962138175964 0.7535327672958374 0.4510199725627899 0.7517410516738892 0.4492507874965668 0.7569160461425781 0.4371355473995209 0.7610970735549927 0.4365588128566742 0.7431419491767883 0.46072766184806824 0.7319740056991577 0.45740076899528503 0.7316449284553528 0.44701191782951355 0.7386743426322937 0.4365588128566742 0.7517410516738892 0.4373813569545746 0.7517246603965759 0.44928833842277527 0.7431419491767883 0.46072766184806824 0.7517246603965759 0.44928833842277527 0.7517410516738892 0.4654558598995209 0.744290828704834 0.46640393137931824 0.7258192896842957 0.4610397517681122 0.7299621105194092 0.45714840292930603 0.7316449284553528 0.4665322005748749 0.7276171445846558 0.467102974653244 0.4076729416847229 0.8308151960372925 0.40353018045425415 0.8347065448760986 0.39470070600509644 0.8273694515228271 0.3962680697441101 0.8149834871292114 0.4093558192253113 0.8125697374343872 0.39470070600509644 0.8273694515228271 0.38989531993865967 0.828903079032898 0.38753873109817505 0.8262596130371094 0.38959378004074097 0.812508225440979 0.3962680697441101 0.8149834871292114 0.7661982774734497 0.4468935430049896 0.7601140141487122 0.44250962138175964 0.7610970735549927 0.4365588128566742 0.7668124437332153 0.43666359782218933 0.39470070600509644 0.8273694515228271 0.40353018045425415 0.8347065448760986 0.4053279757499695 0.8407697677612305 0.3971782326698303 0.8402096033096313 0.38989531993865967 0.828903079032898 0.7439671754837036 0.47869738936424255 0.7387896776199341 0.48205432295799255 0.7338588237762451 0.47837159037590027 0.7316449284553528 0.46918854117393494 0.7348635792732239 0.46640393137931824 0.7439671754837036 0.46653422713279724 0.7535327672958374 0.4510199725627899 0.7601140141487122 0.44250962138175964 0.7661982774734497 0.4468935430049896 0.7668124437332153 0.4572705924510956 0.7617161273956299 0.4654005467891693 0.7575174570083618 0.4644133746623993 0.7316449284553528 0.43890294432640076 0.7185572385787964 0.441316694021225 0.7118829488754272 0.43884143233299255 0.7145532965660095 0.4370637834072113 0.7266955375671387 0.4365588128566742</float_array>
				<technique_common>
				<accessor source="#id-mesh-7-texcoord-0-array" count="64" stride="2">
					<param name="S" type="float"/>
					<param name="T" type="float"/>
				</accessor>
				</technique_common>
			</source>
			<vertices id="id-mesh-7-vertices">
				<input semantic="POSITION" source="#id-mesh-7-positions"/>
			</vertices>
			<polygons count="13" material="id-trimat-8">
				<input semantic="VERTEX" source="#id-mesh-7-vertices" offset="0"/>
				<input semantic="NORMAL" source="#id-mesh-7-normals" offset="0"/>
				<input semantic="TEXCOORD" source="#id-mesh-7-texcoord-0" offset="0" set="0"/>
				<p> 0 1 2 3 4 </p>
				<p> 5 6 7 8 </p>
				<p> 9 10 11 12 13 </p>
				<p> 14 15 16 17 18 19 </p>
				<p> 20 21 22 23 </p>
				<p> 24 25 26 27 </p>
				<p> 28 29 30 31 32 </p>
				<p> 33 34 35 36 37 </p>
				<p> 38 39 40 41 </p>
				<p> 42 43 44 45 46 </p>
				<p> 47 48 49 50 51 52 </p>
				<p> 53 54 55 56 57 58 </p>
				<p> 59 60 61 62 63 </p>
			</polygons>
		</mesh>
	</geometry>
</library_geometries>
<library_visual_scenes>
	<visual_scene id="id-scene-1" name="scene">
		<node id="Rock_04" name="Rock_04" type="NODE">
			<matrix sid="transform"> 0.3997628688812256 0.0 0.0 -0.29256993532180786 0.0 0.3997628688812256 6.512964034754987e-08 -0.4288816452026367 0.0 -6.512964034754987e-08 0.3997628688812256 0.3443015217781067 0.0 0.0 0.0 1.0  </matrix>
			<instance_geometry url="#id-mesh-7">
				<bind_material>
					<technique_common>
						<instance_material symbol="id-trimat-8" target="#id-material-6"/>
					</technique_common>
				</bind_material>
			</instance_geometry>
		</node>
	</visual_scene>
</library_visual_scenes>
<scene>
	<instance_visual_scene url="#id-scene-1" />
</scene>
</COLLADA>
