<?xml version="1.0" encoding="utf-8"?>
<COLLADA xmlns="http://www.collada.org/2005/11/COLLADASchema" version="1.4.1">
<asset>
	<contributor>
		<author>Anonymous</author>
		<authoring_tool>Collada Exporter for Blender 2.6+, by Juan Linietsky (juan@codenix.com)</authoring_tool>
	</contributor>
	<created>2019-05-05T16:47:50Z</created>
	<modified>2019-05-05T16:47:50Z</modified>
	<unit meter="1.0" name="meter"/>
	<up_axis>Z_UP</up_axis>
</asset>
<library_images>
	<image id="id-image-3" name="Palette.png">
		<init_from>../../concepts/3D/LowPolyPack/Palette.png</init_from>
	</image>
</library_images>
<library_effects>
	<effect id="id-fx-2" name="Material.001-fx">
		<profile_COMMON>
			<newparam sid="id-fx_surf-4">
				<surface type="2D">
					<init_from>id-image-3</init_from>
					<format>A8R8G8B8</format>
				</surface>
			</newparam>
			<newparam sid="id-fx_sampler-5">
				<sampler2D>
					<source>id-fx_surf-4</source>
				</sampler2D>
			</newparam>
			<technique sid="common">
				<blinn>
					<emission>
						<color>  0.0 0.0 0.0 1.0 </color>
					</emission>
					<ambient>
						<color>  0.0 0.0 0.0 1.0 </color>
					</ambient>
					<diffuse>
						<texture texture="id-fx_sampler-5" texcoord="CHANNEL1"/>
					</diffuse>
					<specular>
						<color>  0.5 0.5 0.5 1.0 </color>
					</specular>
					<shininess>
						<float>50</float>
					</shininess>
					<reflective>
						<color>  1.0 1.0 1.0 1.0 </color>
					</reflective>
					<index_of_refraction>
						<float>4.0</float>
					</index_of_refraction>
				</blinn>
				<extra>
					<technique profile="FCOLLADA">
					</technique>
					<technique profile="GOOGLEEARTH">
						<double_sided>0</double_sided>
					</technique>
				</extra>
			</technique>
		</profile_COMMON>
	</effect>
</library_effects>
<library_materials>
	<material id="id-material-6" name="Material.001">
		<instance_effect url="#id-fx-2"/>
	</material>
</library_materials>
<library_geometries>
	<geometry id="id-mesh-7" name="Cone.005">
		<mesh>
			<source id="id-mesh-7-positions">
				<float_array id="id-mesh-7-positions-array" count="180"> 0.5436644554138184 0.7483040690422058 0.028804367408156395 0.6719548106193542 -0.15217208862304688 -0.08228294551372528 0.2525336742401123 -0.8313940763473511 -0.11016491055488586 -0.5153343081474304 -0.47457218170166016 0.01151871308684349 -1.0068089962005615 0.34959715604782104 0.15370772778987885 -0.1971079558134079 0.7138427495956421 0.105320505797863 -0.24977773427963257 -0.39090198278427124 2.675063371658325 0.19554482400417328 -0.5272653102874756 2.3901095390319824 0.5071567296981812 -0.16209954023361206 2.415738105773926 0.4056070148944855 0.26678940653800964 2.6750636100769043 -0.023635953664779663 0.36683180928230286 2.934389114379883 -0.351328045129776 0.03798632323741913 2.9343888759613037 -0.5388843417167664 0.12527132034301758 1.4860960245132446 -0.351328045129776 0.03798632323741913 2.9343888759613037 -0.023635953664779663 0.36683180928230286 2.934389114379883 -0.10061681270599365 0.4806171655654907 1.4160865545272827 -0.10061681270599365 0.4806171655654907 1.4160865545272827 -0.023635953664779663 0.36683180928230286 2.934389114379883 0.4056070148944855 0.26678940653800964 2.6750636100769043 0.3991128206253052 0.3485099971294403 1.347701907157898 0.5329747200012207 -0.1507522612810135 1.2793151140213013 0.5071567296981812 -0.16209954023361206 2.415738105773926 0.19554482400417328 -0.5272653102874756 2.3901095390319824 0.24589376151561737 -0.5639397501945496 1.3219194412231445 0.24589376151561737 -0.5639397501945496 1.3219194412231445 0.19554482400417328 -0.5272653102874756 2.3901095390319824 -0.24977773427963257 -0.39090198278427124 2.675063371658325 -0.28520703315734863 -0.33329468965530396 1.3236916065216064 -0.28520703315734863 -0.33329468965530396 1.3236916065216064 -0.24977773427963257 -0.39090198278427124 2.675063371658325 -0.351328045129776 0.03798632323741913 2.9343888759613037 -0.5388843417167664 0.12527132034301758 1.4860960245132446 0.3991128206253052 0.3485099971294403 1.347701907157898 0.4056070148944855 0.26678940653800964 2.6750636100769043 0.5071567296981812 -0.16209954023361206 2.415738105773926 0.5329747200012207 -0.1507522612810135 1.2793151140213013 0.5436644554138184 0.7483040690422058 0.028804367408156395 0.3991128206253052 0.3485099971294403 1.347701907157898 0.5329747200012207 -0.1507522612810135 1.2793151140213013 0.6719548106193542 -0.15217208862304688 -0.08228294551372528 -0.5153343081474304 -0.47457218170166016 0.01151871308684349 -0.28520703315734863 -0.33329468965530396 1.3236916065216064 -0.5388843417167664 0.12527132034301758 1.4860960245132446 -1.0068089962005615 0.34959715604782104 0.15370772778987885 0.2525336742401123 -0.8313940763473511 -0.11016491055488586 0.24589376151561737 -0.5639397501945496 1.3219194412231445 -0.28520703315734863 -0.33329468965530396 1.3236916065216064 -0.5153343081474304 -0.47457218170166016 0.01151871308684349 0.6719548106193542 -0.15217208862304688 -0.08228294551372528 0.5329747200012207 -0.1507522612810135 1.2793151140213013 0.24589376151561737 -0.5639397501945496 1.3219194412231445 0.2525336742401123 -0.8313940763473511 -0.11016491055488586 -0.1971079558134079 0.7138427495956421 0.105320505797863 -0.10061681270599365 0.4806171655654907 1.4160865545272827 0.3991128206253052 0.3485099971294403 1.347701907157898 0.5436644554138184 0.7483040690422058 0.028804367408156395 -1.0068089962005615 0.34959715604782104 0.15370772778987885 -0.5388843417167664 0.12527132034301758 1.4860960245132446 -0.10061681270599365 0.4806171655654907 1.4160865545272827 -0.1971079558134079 0.7138427495956421 0.105320505797863</float_array>
				<technique_common>
				<accessor source="#id-mesh-7-positions-array" count="60" stride="3">
					<param name="X" type="float"/>
					<param name="Y" type="float"/>
					<param name="Z" type="float"/>
				</accessor>
				</technique_common>
			</source>
			<source id="id-mesh-7-normals">
				<float_array id="id-mesh-7-normals-array" count="180"> -0.10706906765699387 0.10669358819723129 -0.9885103106498718 -0.10706906765699387 0.10669358819723129 -0.9885103106498718 -0.10706906765699387 0.10669358819723129 -0.9885103106498718 -0.10706906765699387 0.10669358819723129 -0.9885103106498718 -0.10706906765699387 0.10669358819723129 -0.9885103106498718 -0.10706906765699387 0.10669358819723129 -0.9885103106498718 0.40313437581062317 -0.4017206132411957 0.8222548961639404 0.40313437581062317 -0.4017206132411957 0.8222548961639404 0.40313437581062317 -0.4017206132411957 0.8222548961639404 0.40313437581062317 -0.4017206132411957 0.8222548961639404 0.40313437581062317 -0.4017206132411957 0.8222548961639404 0.40313437581062317 -0.4017206132411957 0.8222548961639404 -0.6566320061683655 0.7462735176086426 0.10913419723510742 -0.6566320061683655 0.7462735176086426 0.10913419723510742 -0.6566320061683655 0.7462735176086426 0.10913419723510742 -0.6566320061683655 0.7462735176086426 0.10913419723510742 0.2614111602306366 0.963451623916626 0.058523859828710556 0.2614111602306366 0.963451623916626 0.058523859828710556 0.2614111602306366 0.963451623916626 0.058523859828710556 0.2614111602306366 0.963451623916626 0.058523859828710556 0.7925376296043396 -0.6088533401489258 0.03437593951821327 0.7925376296043396 -0.6088533401489258 0.03437593951821327 0.7925376296043396 -0.6088533401489258 0.03437593951821327 0.7925376296043396 -0.6088533401489258 0.03437593951821327 -0.3544612228870392 -0.9350143074989319 -0.01027498859912157 -0.3544612228870392 -0.9350143074989319 -0.01027498859912157 -0.3544612228870392 -0.9350143074989319 -0.01027498859912157 -0.3544612228870392 -0.9350143074989319 -0.01027498859912157 -0.9181817770004272 -0.3926236033439636 0.05281103029847145 -0.9181817770004272 -0.3926236033439636 0.05281103029847145 -0.9181817770004272 -0.3926236033439636 0.05281103029847145 -0.9181817770004272 -0.3926236033439636 0.05281103029847145 0.9705612063407898 0.24027590453624725 0.0166885107755661 0.9705612063407898 0.24027590453624725 0.0166885107755661 0.9705612063407898 0.24027590453624725 0.0166885107755661 0.9705612063407898 0.24027590453624725 0.0166885107755661 0.9776464104652405 0.16666477918624878 0.12818102538585663 0.9776464104652405 0.16666477918624878 0.12818102538585663 0.9776464104652405 0.16666477918624878 0.12818102538585663 0.9776464104652405 0.16666477918624878 0.12818102538585663 -0.8254656791687012 -0.5273267030715942 0.20132802426815033 -0.8254656791687012 -0.5273267030715942 0.20132802426815033 -0.8254656791687012 -0.5273267030715942 0.20132802426815033 -0.8254656791687012 -0.5273267030715942 0.20132802426815033 -0.393111914396286 -0.9042543172836304 0.16669467091560364 -0.393111914396286 -0.9042543172836304 0.16669467091560364 -0.393111914396286 -0.9042543172836304 0.16669467091560364 -0.393111914396286 -0.9042543172836304 0.16669467091560364 0.8364388346672058 -0.5396687984466553 0.09553886204957962 0.8364388346672058 -0.5396687984466553 0.09553886204957962 0.8364388346672058 -0.5396687984466553 0.09553886204957962 0.8364388346672058 -0.5396687984466553 0.09553886204957962 0.10348327457904816 0.9665759801864624 0.23456799983978271 0.10348327457904816 0.9665759801864624 0.23456799983978271 0.10348327457904816 0.9665759801864624 0.23456799983978271 0.10348327457904816 0.9665759801864624 0.23456799983978271 -0.46641892194747925 0.8494803309440613 0.24665041267871857 -0.46641892194747925 0.8494803309440613 0.24665041267871857 -0.46641892194747925 0.8494803309440613 0.24665041267871857 -0.46641892194747925 0.8494803309440613 0.24665041267871857</float_array>
				<technique_common>
				<accessor source="#id-mesh-7-normals-array" count="60" stride="3">
					<param name="X" type="float"/>
					<param name="Y" type="float"/>
					<param name="Z" type="float"/>
				</accessor>
				</technique_common>
			</source>
			<source id="id-mesh-7-texcoord-0">
				<float_array id="id-mesh-7-texcoord-0-array" count="120"> 0.5821537971496582 0.9022966623306274 0.5858908891677856 0.8756071329116821 0.5958966612815857 0.8619434237480164 0.6043989658355713 0.8815039396286011 0.6061864495277405 0.910618782043457 0.5926789045333862 0.910618782043457 0.7488132119178772 0.8264410495758057 0.745657742023468 0.8417085409164429 0.7383747696876526 0.8406357765197754 0.7347112894058228 0.8270007967948914 0.7380987405776978 0.8130859136581421 0.7451497316360474 0.8128060698509216 0.5862833261489868 0.8195423483848572 0.5856457948684692 0.7756013870239258 0.5896971821784973 0.7759779691696167 0.5920808911323547 0.8216663599014282 0.5920808911323547 0.8216663599014282 0.5896971821784973 0.7759779691696167 0.596934974193573 0.7813271880149841 0.59996098279953 0.8209254741668701 0.6141586303710938 0.823254406452179 0.6143590807914734 0.8034310936927795 0.6216420531272888 0.804503858089447 0.6216962933540344 0.8244177103042603 0.5652679204940796 0.8170560598373413 0.5693466663360596 0.786131739616394 0.5749714374542236 0.7810233235359192 0.5718526244163513 0.8211399912834167 0.5718526244163513 0.8211399912834167 0.5749714374542236 0.7810233235359192 0.5821537971496582 0.7756013870239258 0.5801385045051575 0.8196164965629578 0.59996098279953 0.8209254741668701 0.596934974193573 0.7813271880149841 0.6001214385032654 0.7862997651100159 0.6033177375793457 0.8197641372680664 0.6044309735298157 0.8295711874961853 0.6100992560386658 0.8111170530319214 0.6141586303710938 0.823254406452179 0.6129434108734131 0.8492109775543213 0.5674839019775391 0.8605883121490479 0.5718526244163513 0.8211399912834167 0.5801385045051575 0.8196164965629578 0.5821537971496582 0.8624668121337891 0.5572888255119324 0.8580968379974365 0.5652679204940796 0.8170560598373413 0.5718526244163513 0.8211399912834167 0.5674839019775391 0.8605883121490479 0.6129434108734131 0.8492109775543213 0.6141586303710938 0.823254406452179 0.6216962933540344 0.8244177103042603 0.624797523021698 0.8537546992301941 0.5933684706687927 0.8619434237480164 0.5920808911323547 0.8216663599014282 0.59996098279953 0.8209254741668701 0.6044309735298157 0.8613232970237732 0.5821537971496582 0.8619434237480164 0.5862833261489868 0.8195423483848572 0.5920808911323547 0.8216663599014282 0.5933684706687927 0.8619434237480164</float_array>
				<technique_common>
				<accessor source="#id-mesh-7-texcoord-0-array" count="60" stride="2">
					<param name="S" type="float"/>
					<param name="T" type="float"/>
				</accessor>
				</technique_common>
			</source>
			<vertices id="id-mesh-7-vertices">
				<input semantic="POSITION" source="#id-mesh-7-positions"/>
			</vertices>
			<polygons count="14" material="id-trimat-8">
				<input semantic="VERTEX" source="#id-mesh-7-vertices" offset="0"/>
				<input semantic="NORMAL" source="#id-mesh-7-normals" offset="0"/>
				<input semantic="TEXCOORD" source="#id-mesh-7-texcoord-0" offset="0" set="0"/>
				<p> 0 1 2 3 4 5 </p>
				<p> 6 7 8 9 10 11 </p>
				<p> 12 13 14 15 </p>
				<p> 16 17 18 19 </p>
				<p> 20 21 22 23 </p>
				<p> 24 25 26 27 </p>
				<p> 28 29 30 31 </p>
				<p> 32 33 34 35 </p>
				<p> 36 37 38 39 </p>
				<p> 40 41 42 43 </p>
				<p> 44 45 46 47 </p>
				<p> 48 49 50 51 </p>
				<p> 52 53 54 55 </p>
				<p> 56 57 58 59 </p>
			</polygons>
		</mesh>
	</geometry>
</library_geometries>
<library_visual_scenes>
	<visual_scene id="id-scene-1" name="scene">
		<node id="Trunk_02" name="Trunk_02" type="NODE">
			<matrix sid="transform"> 0.3853241205215454 -0.38397297263145447 -0.026300568133592606 -0.26942920684814453 0.3853897154331207 0.3867458403110504 1.888270872996145e-09 -0.006504058837890625 0.0331311896443367 -0.033015020191669464 0.3058822453022003 -0.17041343450546265 0.0 0.0 0.0 1.0  </matrix>
			<instance_geometry url="#id-mesh-7">
				<bind_material>
					<technique_common>
						<instance_material symbol="id-trimat-8" target="#id-material-6"/>
					</technique_common>
				</bind_material>
			</instance_geometry>
		</node>
	</visual_scene>
</library_visual_scenes>
<scene>
	<instance_visual_scene url="#id-scene-1" />
</scene>
</COLLADA>
