<?xml version="1.0" encoding="utf-8"?>
<COLLADA xmlns="http://www.collada.org/2005/11/COLLADASchema" version="1.4.1">
<asset>
	<contributor>
		<author>Anonymous</author>
		<authoring_tool>Collada Exporter for Blender 2.6+, by Juan Linietsky (juan@codenix.com)</authoring_tool>
	</contributor>
	<created>2019-05-05T15:52:55Z</created>
	<modified>2019-05-05T15:52:55Z</modified>
	<unit meter="1.0" name="meter"/>
	<up_axis>Z_UP</up_axis>
</asset>
<library_images>
	<image id="id-image-3" name="Palette.png">
		<init_from>../../concepts/3D/LowPolyPack/Palette.png</init_from>
	</image>
</library_images>
<library_effects>
	<effect id="id-fx-2" name="Material.001-fx">
		<profile_COMMON>
			<newparam sid="id-fx_surf-4">
				<surface type="2D">
					<init_from>id-image-3</init_from>
					<format>A8R8G8B8</format>
				</surface>
			</newparam>
			<newparam sid="id-fx_sampler-5">
				<sampler2D>
					<source>id-fx_surf-4</source>
				</sampler2D>
			</newparam>
			<technique sid="common">
				<blinn>
					<emission>
						<color>  0.0 0.0 0.0 1.0 </color>
					</emission>
					<ambient>
						<color>  0.0 0.0 0.0 1.0 </color>
					</ambient>
					<diffuse>
						<texture texture="id-fx_sampler-5" texcoord="CHANNEL1"/>
					</diffuse>
					<specular>
						<color>  0.5 0.5 0.5 1.0 </color>
					</specular>
					<shininess>
						<float>50</float>
					</shininess>
					<reflective>
						<color>  1.0 1.0 1.0 1.0 </color>
					</reflective>
					<index_of_refraction>
						<float>4.0</float>
					</index_of_refraction>
				</blinn>
				<extra>
					<technique profile="FCOLLADA">
					</technique>
					<technique profile="GOOGLEEARTH">
						<double_sided>0</double_sided>
					</technique>
				</extra>
			</technique>
		</profile_COMMON>
	</effect>
</library_effects>
<library_materials>
	<material id="id-material-6" name="Material.001">
		<instance_effect url="#id-fx-2"/>
	</material>
</library_materials>
<library_geometries>
	<geometry id="id-mesh-7" name="Icosphere.002">
		<mesh>
			<source id="id-mesh-7-positions">
				<float_array id="id-mesh-7-positions-array" count="486"> -0.24099966883659363 0.29721587896347046 1.442824363708496 0.5555219650268555 -0.3081754446029663 1.847985029220581 -0.25776004791259766 -0.6405988931655884 1.9267191886901855 0.5934613347053528 -0.6713870763778687 2.5842978954315186 0.5555219650268555 -0.3081754446029663 1.847985029220581 0.8203115463256836 -0.05856585502624512 2.5476126670837402 -0.24099966883659363 0.29721587896347046 1.442824363708496 -0.25776004791259766 -0.6405988931655884 1.9267191886901855 -0.8019734025001526 -0.15481974184513092 1.8752838373184204 -0.25776004791259766 -0.6405988931655884 1.9267191886901855 0.5934613347053528 -0.6713870763778687 2.5842978954315186 0.011351160705089569 -0.8221104741096497 3.4094531536102295 -0.25776004791259766 -0.6405988931655884 1.9267191886901855 0.011351160705089569 -0.8221104741096497 3.4094531536102295 -0.6484191417694092 -0.6282162070274353 3.4214823246002197 -0.6484191417694092 -0.6282162070274353 3.4214823246002197 0.011351160705089569 -0.8221104741096497 3.4094531536102295 -0.5650336146354675 -0.1806158870458603 4.085492134094238 -0.8543971180915833 0.4750008285045624 3.622891426086426 -0.5650336146354675 -0.1806158870458603 4.085492134094238 -0.3011763393878937 0.33733147382736206 4.2682600021362305 0.2031552493572235 0.04075808450579643 4.162576675415039 0.5325653553009033 0.42671117186546326 3.6280298233032227 0.25084033608436584 0.7429484128952026 3.9125924110412598 0.25084033608436584 0.7429484128952026 3.9125924110412598 -0.3011763393878937 0.33733147382736206 4.2682600021362305 0.2031552493572235 0.04075808450579643 4.162576675415039 0.25084033608436584 0.7429484128952026 3.9125924110412598 -0.09624822437763214 1.0021717548370361 3.600247621536255 -0.3011763393878937 0.33733147382736206 4.2682600021362305 -0.09624822437763214 1.0021717548370361 3.600247621536255 -0.8543971180915833 0.4750008285045624 3.622891426086426 -0.3011763393878937 0.33733147382736206 4.2682600021362305 -0.3011763393878937 0.33733147382736206 4.2682600021362305 -0.5650336146354675 -0.1806158870458603 4.085492134094238 0.2031552493572235 0.04075808450579643 4.162576675415039 -0.5650336146354675 -0.1806158870458603 4.085492134094238 0.4194842576980591 -0.618036687374115 3.606189489364624 0.2031552493572235 0.04075808450579643 4.162576675415039 -0.5650336146354675 -0.1806158870458603 4.085492134094238 0.011351160705089569 -0.8221104741096497 3.4094531536102295 0.4194842576980591 -0.618036687374115 3.606189489364624 0.4194842576980591 -0.618036687374115 3.606189489364624 0.5325653553009033 0.42671117186546326 3.6280298233032227 0.2031552493572235 0.04075808450579643 4.162576675415039 0.8203115463256836 -0.05856585502624512 2.5476126670837402 0.5908482074737549 0.7461511492729187 2.7406840324401855 0.5325653553009033 0.42671117186546326 3.6280298233032227 0.5908482074737549 0.7461511492729187 2.7406840324401855 0.25084033608436584 0.7429484128952026 3.9125924110412598 0.5325653553009033 0.42671117186546326 3.6280298233032227 -0.6551037430763245 0.917606770992279 2.6126155853271484 -0.8543971180915833 0.4750008285045624 3.622891426086426 -0.09624822437763214 1.0021717548370361 3.600247621536255 -0.8543971180915833 0.4750008285045624 3.622891426086426 -0.9895020723342896 -0.1266080141067505 2.811159610748291 -0.5650336146354675 -0.1806158870458603 4.085492134094238 -0.9895020723342896 -0.1266080141067505 2.811159610748291 -0.6484191417694092 -0.6282162070274353 3.4214823246002197 -0.5650336146354675 -0.1806158870458603 4.085492134094238 0.5934613347053528 -0.6713870763778687 2.5842978954315186 0.8203115463256836 -0.05856585502624512 2.5476126670837402 0.4194842576980591 -0.618036687374115 3.606189489364624 0.8203115463256836 -0.05856585502624512 2.5476126670837402 0.5325653553009033 0.42671117186546326 3.6280298233032227 0.4194842576980591 -0.618036687374115 3.606189489364624 0.5908482074737549 0.7461511492729187 2.7406840324401855 -0.09624822437763214 1.0021717548370361 3.600247621536255 0.25084033608436584 0.7429484128952026 3.9125924110412598 0.5908482074737549 0.7461511492729187 2.7406840324401855 0.4698944389820099 0.6052230000495911 1.931500792503357 -0.09624822437763214 1.0021717548370361 3.600247621536255 0.4698944389820099 0.6052230000495911 1.931500792503357 -0.6551037430763245 0.917606770992279 2.6126155853271484 -0.09624822437763214 1.0021717548370361 3.600247621536255 -0.6551037430763245 0.917606770992279 2.6126155853271484 -0.8801278471946716 0.5133572220802307 2.2363154888153076 -0.8543971180915833 0.4750008285045624 3.622891426086426 -0.8801278471946716 0.5133572220802307 2.2363154888153076 -0.9895020723342896 -0.1266080141067505 2.811159610748291 -0.8543971180915833 0.4750008285045624 3.622891426086426 -0.9895020723342896 -0.1266080141067505 2.811159610748291 -0.8019734025001526 -0.15481974184513092 1.8752838373184204 -0.6484191417694092 -0.6282162070274353 3.4214823246002197 -0.8019734025001526 -0.15481974184513092 1.8752838373184204 -0.25776004791259766 -0.6405988931655884 1.9267191886901855 -0.6484191417694092 -0.6282162070274353 3.4214823246002197 0.011351160705089569 -0.8221104741096497 3.4094531536102295 0.5934613347053528 -0.6713870763778687 2.5842978954315186 0.4194842576980591 -0.618036687374115 3.606189489364624 -0.24099966883659363 0.29721587896347046 1.442824363708496 -0.6551037430763245 0.917606770992279 2.6126155853271484 0.4698944389820099 0.6052230000495911 1.931500792503357 -0.24099966883659363 0.29721587896347046 1.442824363708496 -0.8801278471946716 0.5133572220802307 2.2363154888153076 -0.6551037430763245 0.917606770992279 2.6126155853271484 -0.24099966883659363 0.29721587896347046 1.442824363708496 -0.8019734025001526 -0.15481974184513092 1.8752838373184204 -0.8801278471946716 0.5133572220802307 2.2363154888153076 -0.8019734025001526 -0.15481974184513092 1.8752838373184204 -0.9895020723342896 -0.1266080141067505 2.811159610748291 -0.8801278471946716 0.5133572220802307 2.2363154888153076 0.8203115463256836 -0.05856585502624512 2.5476126670837402 0.4698944389820099 0.6052230000495911 1.931500792503357 0.5908482074737549 0.7461511492729187 2.7406840324401855 0.8203115463256836 -0.05856585502624512 2.5476126670837402 0.5555219650268555 -0.3081754446029663 1.847985029220581 0.4698944389820099 0.6052230000495911 1.931500792503357 0.5555219650268555 -0.3081754446029663 1.847985029220581 -0.24099966883659363 0.29721587896347046 1.442824363708496 0.4698944389820099 0.6052230000495911 1.931500792503357 -0.25776004791259766 -0.6405988931655884 1.9267191886901855 0.5555219650268555 -0.3081754446029663 1.847985029220581 0.5934613347053528 -0.6713870763778687 2.5842978954315186 0.02020501345396042 -0.03338981792330742 2.02585506439209 0.0 0.060633912682533264 2.7011404037475586 0.07001372426748276 -0.06063343584537506 2.7011404037475586 0.09021873772144318 -0.15465717017650604 2.02585506439209 0.09021873772144318 -0.15465717017650604 2.02585506439209 0.07001372426748276 -0.06063343584537506 2.7011404037475586 -0.07001373171806335 -0.06063342094421387 2.7011404037475586 -0.04980872571468353 -0.15465715527534485 2.02585506439209 -0.04980872571468353 -0.15465715527534485 2.02585506439209 -0.07001373171806335 -0.06063342094421387 2.7011404037475586 0.0 0.060633912682533264 2.7011404037475586 0.02020501345396042 -0.03338981792330742 2.02585506439209 -0.07001373171806335 -0.06063342094421387 -2.384185791015625e-07 -0.07001373171806335 -0.024203293025493622 0.6752851009368896 0.0 0.0970640480518341 0.6752851009368896 0.0 0.060633912682533264 -2.384185791015625e-07 -0.07001373171806335 -0.024203293025493622 0.6752851009368896 -0.13573238253593445 0.024719804525375366 1.3505700826644897 -0.0657186508178711 0.1459871381521225 1.3505700826644897 0.0 0.0970640480518341 0.6752851009368896 -0.13573238253593445 0.024719804525375366 1.3505700826644897 -0.04980872571468353 -0.15465715527534485 2.02585506439209 0.02020501345396042 -0.03338981792330742 2.02585506439209 -0.0657186508178711 0.1459871381521225 1.3505700826644897 0.07001372426748276 -0.06063343584537506 -2.384185791015625e-07 0.07001372426748276 -0.024203311651945114 0.6752851009368896 -0.07001373171806335 -0.024203293025493622 0.6752851009368896 -0.07001373171806335 -0.06063342094421387 -2.384185791015625e-07 0.07001372426748276 -0.024203311651945114 0.6752851009368896 0.004295065999031067 0.024719789624214172 1.3505700826644897 -0.13573238253593445 0.024719804525375366 1.3505700826644897 -0.07001373171806335 -0.024203293025493622 0.6752851009368896 0.004295065999031067 0.024719789624214172 1.3505700826644897 0.09021873772144318 -0.15465717017650604 2.02585506439209 -0.04980872571468353 -0.15465715527534485 2.02585506439209 -0.13573238253593445 0.024719804525375366 1.3505700826644897 0.0 0.060633912682533264 -2.384185791015625e-07 0.0 0.0970640480518341 0.6752851009368896 0.07001372426748276 -0.024203311651945114 0.6752851009368896 0.07001372426748276 -0.06063343584537506 -2.384185791015625e-07 0.0 0.0970640480518341 0.6752851009368896 -0.0657186508178711 0.1459871381521225 1.3505700826644897 0.004295065999031067 0.024719789624214172 1.3505700826644897 0.07001372426748276 -0.024203311651945114 0.6752851009368896 -0.0657186508178711 0.1459871381521225 1.3505700826644897 0.02020501345396042 -0.03338981792330742 2.02585506439209 0.09021873772144318 -0.15465717017650604 2.02585506439209 0.004295065999031067 0.024719789624214172 1.3505700826644897</float_array>
				<technique_common>
				<accessor source="#id-mesh-7-positions-array" count="162" stride="3">
					<param name="X" type="float"/>
					<param name="Y" type="float"/>
					<param name="Z" type="float"/>
				</accessor>
				</technique_common>
			</source>
			<source id="id-mesh-7-normals">
				<float_array id="id-mesh-7-normals-array" count="486"> 0.10152509063482285 -0.45760223269462585 -0.8833418488502502 0.10152509063482285 -0.45760223269462585 -0.8833418488502502 0.10152509063482285 -0.45760223269462585 -0.8833418488502502 0.91054767370224 -0.35021087527275085 -0.2196705937385559 0.91054767370224 -0.35021087527275085 -0.2196705937385559 0.91054767370224 -0.35021087527275085 -0.2196705937385559 -0.305676132440567 -0.43227148056030273 -0.848353385925293 -0.305676132440567 -0.43227148056030273 -0.848353385925293 -0.305676132440567 -0.43227148056030273 -0.848353385925293 0.06716202944517136 -0.9888059496879578 -0.13323615491390228 0.06716202944517136 -0.9888059496879578 -0.13323615491390228 0.06716202944517136 -0.9888059496879578 -0.13323615491390228 -0.28245073556900024 -0.9570160508155823 -0.06589101999998093 -0.28245073556900024 -0.9570160508155823 -0.06589101999998093 -0.28245073556900024 -0.9570160508155823 -0.06589101999998093 -0.22335948050022125 -0.7950204610824585 0.563961923122406 -0.22335948050022125 -0.7950204610824585 0.563961923122406 -0.22335948050022125 -0.7950204610824585 0.563961923122406 -0.7364242672920227 0.14172911643981934 0.6615074872970581 -0.7364242672920227 0.14172911643981934 0.6615074872970581 -0.7364242672920227 0.14172911643981934 0.6615074872970581 0.7846028208732605 0.15996839106082916 0.5990063548088074 0.7846028208732605 0.15996839106082916 0.5990063548088074 0.7846028208732605 0.15996839106082916 0.5990063548088074 0.3574044406414032 0.29159969091415405 0.8872607946395874 0.3574044406414032 0.29159969091415405 0.8872607946395874 0.3574044406414032 0.29159969091415405 0.8872607946395874 -0.08383237570524216 0.7190327644348145 0.6899013519287109 -0.08383237570524216 0.7190327644348145 0.6899013519287109 -0.08383237570524216 0.7190327644348145 0.6899013519287109 -0.4664543867111206 0.6943665742874146 0.5479738712310791 -0.4664543867111206 0.6943665742874146 0.5479738712310791 -0.4664543867111206 0.6943665742874146 0.5479738712310791 0.0014841720694676042 -0.33343183994293213 0.9427729249000549 0.0014841720694676042 -0.33343183994293213 0.9427729249000549 0.0014841720694676042 -0.33343183994293213 0.9427729249000549 0.10142803192138672 -0.6222517490386963 0.7762184739112854 0.10142803192138672 -0.6222517490386963 0.7762184739112854 0.10142803192138672 -0.6222517490386963 0.7762184739112854 0.021620599552989006 -0.7159585356712341 0.697808027267456 0.021620599552989006 -0.7159585356712341 0.697808027267456 0.021620599552989006 -0.7159585356712341 0.697808027267456 0.878670334815979 -0.10484221577644348 0.4657753109931946 0.878670334815979 -0.10484221577644348 0.4657753109931946 0.878670334815979 -0.10484221577644348 0.4657753109931946 0.9598097801208496 0.23800548911094666 0.14872314035892487 0.9598097801208496 0.23800548911094666 0.14872314035892487 0.9598097801208496 0.23800548911094666 0.14872314035892487 0.822030246257782 0.5164398550987244 0.23990851640701294 0.822030246257782 0.5164398550987244 0.23990851640701294 0.822030246257782 0.5164398550987244 0.23990851640701294 -0.5490129590034485 0.7999630570411682 0.242165207862854 -0.5490129590034485 0.7999630570411682 0.242165207862854 -0.5490129590034485 0.7999630570411682 0.242165207862854 -0.9323976039886475 -0.19831521809101105 0.3021683990955353 -0.9323976039886475 -0.19831521809101105 0.3021683990955353 -0.9323976039886475 -0.19831521809101105 0.3021683990955353 -0.9179298281669617 -0.2658618092536926 0.2944866418838501 -0.9179298281669617 -0.2658618092536926 0.2944866418838501 -0.9179298281669617 -0.2658618092536926 0.2944866418838501 0.9266825318336487 -0.33254942297935486 0.1751292645931244 0.9266825318336487 -0.33254942297935486 0.1751292645931244 0.9266825318336487 -0.33254942297935486 0.1751292645931244 0.9473342895507812 -0.10883361101150513 0.3011857271194458 0.9473342895507812 -0.10883361101150513 0.3011857271194458 0.9473342895507812 -0.10883361101150513 0.3011857271194458 0.502713680267334 0.851658046245575 0.14818063378334045 0.502713680267334 0.851658046245575 0.14818063378334045 0.502713680267334 0.851658046245575 0.14818063378334045 0.1269463747739792 0.9738190174102783 -0.1885766237974167 0.1269463747739792 0.9738190174102783 -0.1885766237974167 0.1269463747739792 0.9738190174102783 -0.1885766237974167 0.16330282390117645 0.9708350300788879 -0.17553232610225677 0.16330282390117645 0.9708350300788879 -0.17553232610225677 0.16330282390117645 0.9708350300788879 -0.17553232610225677 -0.8847148418426514 0.4652116298675537 0.029286695644259453 -0.8847148418426514 0.4652116298675537 0.029286695644259453 -0.8847148418426514 0.4652116298675537 0.029286695644259453 -0.9817280173301697 0.1888401359319687 0.02344176359474659 -0.9817280173301697 0.1888401359319687 0.02344176359474659 -0.9817280173301697 0.1888401359319687 0.02344176359474659 -0.7404018044471741 -0.6597728729248047 -0.12847135961055756 -0.7404018044471741 -0.6597728729248047 -0.12847135961055756 -0.7404018044471741 -0.6597728729248047 -0.12847135961055756 -0.6483486890792847 -0.7436271905899048 -0.16328683495521545 -0.6483486890792847 -0.7436271905899048 -0.16328683495521545 -0.6483486890792847 -0.7436271905899048 -0.16328683495521545 0.39915990829467773 -0.9095845818519592 0.11544410139322281 0.39915990829467773 -0.9095845818519592 0.11544410139322281 0.39915990829467773 -0.9095845818519592 0.11544410139322281 -0.04836246371269226 0.8752260208129883 -0.48129042983055115 -0.04836246371269226 0.8752260208129883 -0.48129042983055115 -0.04836246371269226 0.8752260208129883 -0.48129042983055115 -0.4185873866081238 0.7326126098632812 -0.5367154479026794 -0.4185873866081238 0.7326126098632812 -0.5367154479026794 -0.4185873866081238 0.7326126098632812 -0.5367154479026794 -0.7139027118682861 0.26640480756759644 -0.6475890278816223 -0.7139027118682861 0.26640480756759644 -0.6475890278816223 -0.7139027118682861 0.26640480756759644 -0.6475890278816223 -0.9805228114128113 -0.008669673465192318 -0.1962137073278427 -0.9805228114128113 -0.008669673465192318 -0.1962137073278427 -0.9805228114128113 -0.008669673465192318 -0.1962137073278427 0.9303145408630371 0.31166428327560425 -0.19333980977535248 0.9303145408630371 0.31166428327560425 -0.19333980977535248 0.9303145408630371 0.31166428327560425 -0.19333980977535248 0.913283109664917 0.12117400765419006 -0.3888840973377228 0.913283109664917 0.12117400765419006 -0.3888840973377228 0.913283109664917 0.12117400765419006 -0.3888840973377228 0.5242565870285034 0.12614957988262177 -0.8421646356582642 0.5242565870285034 0.12614957988262177 -0.8421646356582642 0.5242565870285034 0.12614957988262177 -0.8421646356582642 0.304561972618103 -0.8478981852531433 -0.4339478611946106 0.304561972618103 -0.8478981852531433 -0.4339478611946106 0.304561972618103 -0.8478981852531433 -0.4339478611946106 0.8651994466781616 0.4995230436325073 -0.04366399720311165 0.8651994466781616 0.4995230436325073 -0.04366399720311165 0.8651994466781616 0.4995230436325073 -0.04366399720311165 0.8651994466781616 0.4995230436325073 -0.04366399720311165 -1.5608102899022924e-07 -0.9904454350471497 0.13790519535541534 -1.5608102899022924e-07 -0.9904454350471497 0.13790519535541534 -1.5608102899022924e-07 -0.9904454350471497 0.13790519535541534 -1.5608102899022924e-07 -0.9904454350471497 0.13790519535541534 -0.8621006011962891 0.497734010219574 -0.09509692341089249 -0.8621006011962891 0.497734010219574 -0.09509692341089249 -0.8621006011962891 0.497734010219574 -0.09509692341089249 -0.8621006011962891 0.497734010219574 -0.09509692341089249 -0.8657105565071106 0.49981817603111267 -0.02696407027542591 -0.8657105565071106 0.49981817603111267 -0.02696407027542591 -0.8657105565071106 0.49981817603111267 -0.02696407027542591 -0.8657105565071106 0.49981817603111267 -0.02696407027542591 -0.8598050475120544 0.4964086711406708 -0.11963997036218643 -0.8598050475120544 0.4964086711406708 -0.11963997036218643 -0.8598050475120544 0.4964086711406708 -0.11963997036218643 -0.8598050475120544 0.4964086711406708 -0.11963997036218643 -0.8415340185165405 0.4858599603176117 0.2361370176076889 -0.8415340185165405 0.4858599603176117 0.2361370176076889 -0.8415340185165405 0.4858599603176117 0.2361370176076889 -0.8415340185165405 0.4858599603176117 0.2361370176076889 -1.1801841992564732e-07 -0.9985479712486267 0.053869422525167465 -1.1801841992564732e-07 -0.9985479712486267 0.053869422525167465 -1.1801841992564732e-07 -0.9985479712486267 0.053869422525167465 -1.1801841992564732e-07 -0.9985479712486267 0.053869422525167465 -1.1788114306909847e-07 -0.9973859786987305 0.07225868105888367 -1.1788114306909847e-07 -0.9973859786987305 0.07225868105888367 -1.1788114306909847e-07 -0.9973859786987305 0.07225868105888367 -1.1788114306909847e-07 -0.9973859786987305 0.07225868105888367 0.0 -0.9664835929870605 -0.25672847032546997 0.0 -0.9664835929870605 -0.25672847032546997 0.0 -0.9664835929870605 -0.25672847032546997 0.0 -0.9664835929870605 -0.25672847032546997 0.8657106161117554 0.4998180866241455 -0.026964062824845314 0.8657106161117554 0.4998180866241455 -0.026964062824845314 0.8657106161117554 0.4998180866241455 -0.026964062824845314 0.8657106161117554 0.4998180866241455 -0.026964062824845314 0.865027129650116 0.4994235634803772 0.04800206422805786 0.865027129650116 0.4994235634803772 0.04800206422805786 0.865027129650116 0.4994235634803772 0.04800206422805786 0.865027129650116 0.4994235634803772 0.04800206422805786 0.8658039569854736 0.49987202882766724 0.02261633798480034 0.8658039569854736 0.49987202882766724 0.02261633798480034 0.8658039569854736 0.49987202882766724 0.02261633798480034 0.8658039569854736 0.49987202882766724 0.02261633798480034</float_array>
				<technique_common>
				<accessor source="#id-mesh-7-normals-array" count="162" stride="3">
					<param name="X" type="float"/>
					<param name="Y" type="float"/>
					<param name="Z" type="float"/>
				</accessor>
				</technique_common>
			</source>
			<source id="id-mesh-7-texcoord-0">
				<float_array id="id-mesh-7-texcoord-0-array" count="324"> 0.280429482460022 0.8994513154029846 0.29833680391311646 0.877845823764801 0.29833680391311646 0.9034985303878784 0.2184247374534607 0.7798712253570557 0.22543863952159882 0.7551564574241638 0.23068971931934357 0.7756927609443665 0.280429482460022 0.8994513154029846 0.29833680391311646 0.9034985303878784 0.2852461338043213 0.9129012227058411 0.2578539252281189 0.8383753895759583 0.2766716778278351 0.8567401170730591 0.26801854372024536 0.8896323442459106 0.2578539252281189 0.8383753895759583 0.26801854372024536 0.8896323442459106 0.2551850974559784 0.8945600986480713 0.23914700746536255 0.8966119885444641 0.22590893507003784 0.9003968238830566 0.23914700746536255 0.8692204356193542 0.26031655073165894 0.8019267320632935 0.2683923542499542 0.8286871910095215 0.2564990520477295 0.8313385844230652 0.23266056180000305 0.8388985991477966 0.24037909507751465 0.8163646459579468 0.2465473711490631 0.829723596572876 0.2465473711490631 0.829723596572876 0.23827283084392548 0.848998486995697 0.23266056180000305 0.8388985991477966 0.30509692430496216 0.7688878774642944 0.29612481594085693 0.7744629979133606 0.29776254296302795 0.7551564574241638 0.2465473711490631 0.8043661713600159 0.26031655073165894 0.8019267320632935 0.2564990520477295 0.8313385844230652 0.23481875658035278 0.848998486995697 0.23914700746536255 0.8692204356193542 0.2243715077638626 0.8583309054374695 0.23914700746536255 0.8692204356193542 0.2184247374534607 0.8888095617294312 0.2243715077638626 0.8583309054374695 0.23914700746536255 0.8692204356193542 0.22590893507003784 0.9003968238830566 0.2184247374534607 0.8888095617294312 0.2196071743965149 0.8170809745788574 0.24037909507751465 0.8163646459579468 0.23266056180000305 0.8388985991477966 0.23068971931934357 0.7756927609443665 0.24654735624790192 0.7852439880371094 0.24037909507751465 0.8163646459579468 0.24654735624790192 0.7852439880371094 0.2465473711490631 0.829723596572876 0.24037909507751465 0.8163646459579468 0.2562062740325928 0.766843318939209 0.26031655073165894 0.8019267320632935 0.2465473711490631 0.8043661713600159 0.26031655073165894 0.8019267320632935 0.2762144207954407 0.7820547819137573 0.2683923542499542 0.8286871910095215 0.2762144207954407 0.7820547819137573 0.280429482460022 0.8122189044952393 0.2683923542499542 0.8286871910095215 0.2184247374534607 0.7798712253570557 0.23068971931934357 0.7756927609443665 0.2196071743965149 0.8170809745788574 0.23068971931934357 0.7756927609443665 0.24037909507751465 0.8163646459579468 0.2196071743965149 0.8170809745788574 0.30509692430496216 0.8122754096984863 0.29612481594085693 0.7744629979133606 0.30509692430496216 0.7688878774642944 0.30509692430496216 0.8122754096984863 0.29878923296928406 0.8403079509735107 0.29612481594085693 0.7744629979133606 0.29878923296928406 0.8403079509735107 0.280429482460022 0.804344654083252 0.29612481594085693 0.7744629979133606 0.2562062740325928 0.766843318939209 0.26677823066711426 0.7571126818656921 0.26031655073165894 0.8019267320632935 0.26677823066711426 0.7571126818656921 0.2762144207954407 0.7820547819137573 0.26031655073165894 0.8019267320632935 0.2465473711490631 0.8758708834648132 0.24710074067115784 0.8409951329231262 0.2551850974559784 0.8945600986480713 0.24710074067115784 0.8409951329231262 0.2578539252281189 0.8383753895759583 0.2551850974559784 0.8945600986480713 0.26801854372024536 0.8896323442459106 0.2766716778278351 0.8567401170730591 0.2766716480255127 0.8946853280067444 0.28357547521591187 0.8535028696060181 0.280429482460022 0.804344654083252 0.29878923296928406 0.8403079509735107 0.3146461248397827 0.9001227617263794 0.30009058117866516 0.8731129169464111 0.3042522072792053 0.8535028696060181 0.3146461248397827 0.9001227617263794 0.29833680391311646 0.9001227617263794 0.30009058117866516 0.8731129169464111 0.280429482460022 0.7551564574241638 0.2762144207954407 0.7820547819137573 0.26677823066711426 0.7571126818656921 0.23068971931934357 0.7756927609443665 0.24350792169570923 0.7591075301170349 0.24654735624790192 0.7852439880371094 0.29723456501960754 0.8535028696060181 0.29833680391311646 0.877845823764801 0.2812415361404419 0.8659960031509399 0.29833680391311646 0.877845823764801 0.280429482460022 0.8994513154029846 0.2812415361404419 0.8659960031509399 0.2578539252281189 0.8383753895759583 0.27352485060691833 0.8313385844230652 0.2766716778278351 0.8567401170730591 0.7730627059936523 0.7577020525932312 0.7705885171890259 0.7344871759414673 0.7729682922363281 0.7352222800254822 0.775442361831665 0.7584371566772461 0.7085687518119812 0.9020813703536987 0.7080201506614685 0.9269299507141113 0.705244243144989 0.926875650882721 0.7057928442955017 0.9020270705223083 0.744405210018158 0.8359255790710449 0.744405210018158 0.8572006225585938 0.7417305111885071 0.8583157062530518 0.7417305111885071 0.8370406627655029 0.7111437320709229 0.8283292055130005 0.7111437320709229 0.8506064414978027 0.7085687518119812 0.8516449332237244 0.7085687518119812 0.8293676972389221 0.7112936973571777 0.8516449332237244 0.7112936973571777 0.8729154467582703 0.7085687518119812 0.8734822273254395 0.7085687518119812 0.8522116541862488 0.7417305111885071 0.8355134725570679 0.7417305111885071 0.8106693029403687 0.7443568706512451 0.8110814094543457 0.7443568706512451 0.8359255790710449 0.7085687518119812 0.8283835053443909 0.708427369594574 0.8531052470207214 0.7056514620780945 0.8530510067939758 0.7057928442955017 0.8283292055130005 0.708427369594574 0.8531052470207214 0.7069817185401917 0.8778307437896729 0.7042058706283569 0.8777765035629272 0.7056514620780945 0.8530510067939758 0.7069817185401917 0.8778307437896729 0.7085687518119812 0.9020813703536987 0.7057928442955017 0.9020270705223083 0.7042058706283569 0.8777765035629272 0.7730627059936523 0.8268239498138428 0.7717227935791016 0.8037900328636169 0.7741024494171143 0.8045251369476318 0.775442361831665 0.8275591135025024 0.7717227935791016 0.8037900328636169 0.7701557874679565 0.7799261808395386 0.7725354433059692 0.7806613445281982 0.7741024494171143 0.8045251369476318 0.7701557874679565 0.7799261808395386 0.7730627059936523 0.7577020525932312 0.775442361831665 0.7584371566772461 0.7725354433059692 0.7806613445281982</float_array>
				<technique_common>
				<accessor source="#id-mesh-7-texcoord-0-array" count="162" stride="2">
					<param name="S" type="float"/>
					<param name="T" type="float"/>
				</accessor>
				</technique_common>
			</source>
			<vertices id="id-mesh-7-vertices">
				<input semantic="POSITION" source="#id-mesh-7-positions"/>
			</vertices>
			<polygons count="50" material="id-trimat-8">
				<input semantic="VERTEX" source="#id-mesh-7-vertices" offset="0"/>
				<input semantic="NORMAL" source="#id-mesh-7-normals" offset="0"/>
				<input semantic="TEXCOORD" source="#id-mesh-7-texcoord-0" offset="0" set="0"/>
				<p> 0 1 2 </p>
				<p> 3 4 5 </p>
				<p> 6 7 8 </p>
				<p> 9 10 11 </p>
				<p> 12 13 14 </p>
				<p> 15 16 17 </p>
				<p> 18 19 20 </p>
				<p> 21 22 23 </p>
				<p> 24 25 26 </p>
				<p> 27 28 29 </p>
				<p> 30 31 32 </p>
				<p> 33 34 35 </p>
				<p> 36 37 38 </p>
				<p> 39 40 41 </p>
				<p> 42 43 44 </p>
				<p> 45 46 47 </p>
				<p> 48 49 50 </p>
				<p> 51 52 53 </p>
				<p> 54 55 56 </p>
				<p> 57 58 59 </p>
				<p> 60 61 62 </p>
				<p> 63 64 65 </p>
				<p> 66 67 68 </p>
				<p> 69 70 71 </p>
				<p> 72 73 74 </p>
				<p> 75 76 77 </p>
				<p> 78 79 80 </p>
				<p> 81 82 83 </p>
				<p> 84 85 86 </p>
				<p> 87 88 89 </p>
				<p> 90 91 92 </p>
				<p> 93 94 95 </p>
				<p> 96 97 98 </p>
				<p> 99 100 101 </p>
				<p> 102 103 104 </p>
				<p> 105 106 107 </p>
				<p> 108 109 110 </p>
				<p> 111 112 113 </p>
				<p> 114 115 116 117 </p>
				<p> 118 119 120 121 </p>
				<p> 122 123 124 125 </p>
				<p> 126 127 128 129 </p>
				<p> 130 131 132 133 </p>
				<p> 134 135 136 137 </p>
				<p> 138 139 140 141 </p>
				<p> 142 143 144 145 </p>
				<p> 146 147 148 149 </p>
				<p> 150 151 152 153 </p>
				<p> 154 155 156 157 </p>
				<p> 158 159 160 161 </p>
			</polygons>
		</mesh>
	</geometry>
</library_geometries>
<library_visual_scenes>
	<visual_scene id="id-scene-1" name="scene">
		<node id="Bush_01" name="Bush_01" type="NODE">
			<matrix sid="transform"> 0.25124794244766235 0.0 0.0 0.8419294357299805 0.0 0.25124794244766235 4.093348593414703e-08 -0.31929174065589905 0.0 -4.093348593414703e-08 0.25124794244766235 -0.03912907838821411 0.0 0.0 0.0 1.0  </matrix>
			<instance_geometry url="#id-mesh-7">
				<bind_material>
					<technique_common>
						<instance_material symbol="id-trimat-8" target="#id-material-6"/>
					</technique_common>
				</bind_material>
			</instance_geometry>
		</node>
	</visual_scene>
</library_visual_scenes>
<scene>
	<instance_visual_scene url="#id-scene-1" />
</scene>
</COLLADA>
