<?xml version="1.0" encoding="utf-8"?>
<COLLADA xmlns="http://www.collada.org/2005/11/COLLADASchema" version="1.4.1">
<asset>
	<contributor>
		<author>Anonymous</author>
		<authoring_tool>Collada Exporter for Blender 2.6+, by Juan Linietsky (juan@codenix.com)</authoring_tool>
	</contributor>
	<created>2019-05-05T15:56:45Z</created>
	<modified>2019-05-05T15:56:45Z</modified>
	<unit meter="1.0" name="meter"/>
	<up_axis>Z_UP</up_axis>
</asset>
<library_images>
	<image id="id-image-3" name="Palette.png">
		<init_from>../../concepts/3D/LowPolyPack/Palette.png</init_from>
	</image>
</library_images>
<library_effects>
	<effect id="id-fx-2" name="Material.001-fx">
		<profile_COMMON>
			<newparam sid="id-fx_surf-4">
				<surface type="2D">
					<init_from>id-image-3</init_from>
					<format>A8R8G8B8</format>
				</surface>
			</newparam>
			<newparam sid="id-fx_sampler-5">
				<sampler2D>
					<source>id-fx_surf-4</source>
				</sampler2D>
			</newparam>
			<technique sid="common">
				<blinn>
					<emission>
						<color>  0.0 0.0 0.0 1.0 </color>
					</emission>
					<ambient>
						<color>  0.0 0.0 0.0 1.0 </color>
					</ambient>
					<diffuse>
						<texture texture="id-fx_sampler-5" texcoord="CHANNEL1"/>
					</diffuse>
					<specular>
						<color>  0.5 0.5 0.5 1.0 </color>
					</specular>
					<shininess>
						<float>50</float>
					</shininess>
					<reflective>
						<color>  1.0 1.0 1.0 1.0 </color>
					</reflective>
					<index_of_refraction>
						<float>4.0</float>
					</index_of_refraction>
				</blinn>
				<extra>
					<technique profile="FCOLLADA">
					</technique>
					<technique profile="GOOGLEEARTH">
						<double_sided>0</double_sided>
					</technique>
				</extra>
			</technique>
		</profile_COMMON>
	</effect>
</library_effects>
<library_materials>
	<material id="id-material-6" name="Material.001">
		<instance_effect url="#id-fx-2"/>
	</material>
</library_materials>
<library_geometries>
	<geometry id="id-mesh-7" name="Sphere.009">
		<mesh>
			<source id="id-mesh-7-positions">
				<float_array id="id-mesh-7-positions-array" count="252"> 0.6339614987373352 -0.17694997787475586 -0.6750622987747192 0.43877536058425903 0.5376489758491516 -0.5688883662223816 0.7647671103477478 0.5776286721229553 0.09783130884170532 0.8655455708503723 -0.21077728271484375 -0.24658486247062683 0.5823878645896912 0.6587921977043152 0.3462042808532715 0.45121726393699646 0.7108002305030823 0.48662903904914856 0.6421149969100952 0.11902002990245819 0.4839416742324829 -0.3606700003147125 0.25052934885025024 0.8933212161064148 0.20703306794166565 0.7798522114753723 0.5813992023468018 -0.12727753818035126 0.8125831484794617 0.34018823504447937 -0.7555684447288513 0.2876517176628113 0.5768318772315979 -0.7218905091285706 -0.3164036273956299 -0.4893827438354492 -0.10474736243486404 -0.8925385475158691 -0.31168121099472046 -0.09563510119915009 -0.9216000437736511 -0.2067296952009201 -0.4454755485057831 -0.7401279807090759 0.41499748826026917 -0.7315584421157837 -0.4641093611717224 0.28808867931365967 -0.3606700003147125 0.25052934885025024 0.8933212161064148 -0.7555684447288513 0.2876517176628113 0.5768318772315979 -0.9006907343864441 0.1480216234922409 0.3975418210029602 -0.7315584421157837 -0.4641093611717224 0.28808867931365967 -0.4454755485057831 -0.7401279807090759 0.41499748826026917 -0.06788472086191177 -0.43108710646629333 0.8591923713684082 -0.09563510119915009 -0.9216000437736511 -0.2067296952009201 0.7557538151741028 -0.5389196276664734 0.10095983743667603 0.6148872375488281 -0.3710918128490448 0.560602068901062 -0.06788472086191177 -0.43108710646629333 0.8591923713684082 -0.4454755485057831 -0.7401279807090759 0.41499748826026917 0.7647671103477478 0.5776286721229553 0.09783130884170532 0.5823878645896912 0.6587921977043152 0.3462042808532715 0.6421149969100952 0.11902002990245819 0.4839416742324829 0.6148872375488281 -0.3710918128490448 0.560602068901062 0.7557538151741028 -0.5389196276664734 0.10095983743667603 0.8655455708503723 -0.21077728271484375 -0.24658486247062683 0.26439476013183594 -0.5314096212387085 -0.7767715454101562 0.6339614987373352 -0.17694997787475586 -0.6750622987747192 0.8655455708503723 -0.21077728271484375 -0.24658486247062683 0.7557538151741028 -0.5389196276664734 0.10095983743667603 0.26439476013183594 -0.5314096212387085 -0.7767715454101562 -0.2494543194770813 -0.159827321767807 -0.8371926546096802 0.43877536058425903 0.5376489758491516 -0.5688883662223816 0.6339614987373352 -0.17694997787475586 -0.6750622987747192 -0.7315584421157837 -0.4641093611717224 0.28808867931365967 -0.9006907343864441 0.1480216234922409 0.3975418210029602 -0.8855864405632019 0.14364159107208252 0.1754949390888214 -0.7465429306030273 -0.2047117054462433 -0.5682764053344727 -0.7218905091285706 -0.3164036273956299 -0.4893827438354492 -0.7465429306030273 -0.2047117054462433 -0.5682764053344727 -0.8855864405632019 0.14364159107208252 0.1754949390888214 -0.2734844386577606 0.626316487789154 -0.42071694135665894 -0.5754741430282593 -0.08039852231740952 -0.7489620447158813 -0.7555684447288513 0.2876517176628113 0.5768318772315979 -0.12727753818035126 0.8125831484794617 0.34018823504447937 -0.18683309853076935 0.7034922242164612 -0.39252641797065735 -0.2734844386577606 0.626316487789154 -0.42071694135665894 -0.8855864405632019 0.14364159107208252 0.1754949390888214 -0.9006907343864441 0.1480216234922409 0.3975418210029602 0.20703306794166565 0.7798522114753723 0.5813992023468018 0.45121726393699646 0.7108002305030823 0.48662903904914856 0.5823878645896912 0.6587921977043152 0.3462042808532715 0.7647671103477478 0.5776286721229553 0.09783130884170532 0.43877536058425903 0.5376489758491516 -0.5688883662223816 -0.18683309853076935 0.7034922242164612 -0.39252641797065735 -0.12727753818035126 0.8125831484794617 0.34018823504447937 0.43877536058425903 0.5376489758491516 -0.5688883662223816 -0.2494543194770813 -0.159827321767807 -0.8371926546096802 -0.5754741430282593 -0.08039852231740952 -0.7489620447158813 -0.2734844386577606 0.626316487789154 -0.42071694135665894 -0.18683309853076935 0.7034922242164612 -0.39252641797065735 -0.5754741430282593 -0.08039852231740952 -0.7489620447158813 -0.2494543194770813 -0.159827321767807 -0.8371926546096802 0.26439476013183594 -0.5314096212387085 -0.7767715454101562 -0.10474736243486404 -0.8925385475158691 -0.31168121099472046 -0.7218905091285706 -0.3164036273956299 -0.4893827438354492 -0.7465429306030273 -0.2047117054462433 -0.5682764053344727 0.7557538151741028 -0.5389196276664734 0.10095983743667603 -0.09563510119915009 -0.9216000437736511 -0.2067296952009201 -0.10474736243486404 -0.8925385475158691 -0.31168121099472046 0.26439476013183594 -0.5314096212387085 -0.7767715454101562 0.45121726393699646 0.7108002305030823 0.48662903904914856 0.20703306794166565 0.7798522114753723 0.5813992023468018 -0.3606700003147125 0.25052934885025024 0.8933212161064148 -0.06788472086191177 -0.43108710646629333 0.8591923713684082 0.6148872375488281 -0.3710918128490448 0.560602068901062 0.6421149969100952 0.11902002990245819 0.4839416742324829</float_array>
				<technique_common>
				<accessor source="#id-mesh-7-positions-array" count="84" stride="3">
					<param name="X" type="float"/>
					<param name="Y" type="float"/>
					<param name="Z" type="float"/>
				</accessor>
				</technique_common>
			</source>
			<source id="id-mesh-7-normals">
				<float_array id="id-mesh-7-normals-array" count="252"> 0.8500892519950867 0.29764384031295776 -0.4344610273838043 0.8500892519950867 0.29764384031295776 -0.4344610273838043 0.8500892519950867 0.29764384031295776 -0.4344610273838043 0.8500892519950867 0.29764384031295776 -0.4344610273838043 0.7521695494651794 0.23984922468662262 0.6137697696685791 0.7521695494651794 0.23984922468662262 0.6137697696685791 0.7521695494651794 0.23984922468662262 0.6137697696685791 -0.37336981296539307 0.7248303890228271 0.5789782404899597 -0.37336981296539307 0.7248303890228271 0.5789782404899597 -0.37336981296539307 0.7248303890228271 0.5789782404899597 -0.37336981296539307 0.7248303890228271 0.5789782404899597 -0.6514118313789368 -0.7438653707504272 -0.14942152798175812 -0.6514118313789368 -0.7438653707504272 -0.14942152798175812 -0.6514118313789368 -0.7438653707504272 -0.14942152798175812 -0.6514118313789368 -0.7438653707504272 -0.14942152798175812 -0.6514118313789368 -0.7438653707504272 -0.14942152798175812 -0.6135715842247009 -0.30012717843055725 0.730379045009613 -0.6135715842247009 -0.30012717843055725 0.730379045009613 -0.6135715842247009 -0.30012717843055725 0.730379045009613 -0.6135715842247009 -0.30012717843055725 0.730379045009613 -0.6135715842247009 -0.30012717843055725 0.730379045009613 -0.6135715842247009 -0.30012717843055725 0.730379045009613 0.2520102262496948 -0.8815842270851135 0.3991240859031677 0.2520102262496948 -0.8815842270851135 0.3991240859031677 0.2520102262496948 -0.8815842270851135 0.3991240859031677 0.2520102262496948 -0.8815842270851135 0.3991240859031677 0.2520102262496948 -0.8815842270851135 0.3991240859031677 0.9436461925506592 0.025440076366066933 0.3299766480922699 0.9436461925506592 0.025440076366066933 0.3299766480922699 0.9436461925506592 0.025440076366066933 0.3299766480922699 0.9436461925506592 0.025440076366066933 0.3299766480922699 0.9436461925506592 0.025440076366066933 0.3299766480922699 0.9436461925506592 0.025440076366066933 0.3299766480922699 0.6787188053131104 -0.618973970413208 -0.3952368199825287 0.6787188053131104 -0.618973970413208 -0.3952368199825287 0.6787188053131104 -0.618973970413208 -0.3952368199825287 0.6787188053131104 -0.618973970413208 -0.3952368199825287 0.18119430541992188 0.15915898978710175 -0.9704828262329102 0.18119430541992188 0.15915898978710175 -0.9704828262329102 0.18119430541992188 0.15915898978710175 -0.9704828262329102 0.18119430541992188 0.15915898978710175 -0.9704828262329102 -0.9648416638374329 -0.25575336813926697 -0.06058647111058235 -0.9648416638374329 -0.25575336813926697 -0.06058647111058235 -0.9648416638374329 -0.25575336813926697 -0.06058647111058235 -0.9648416638374329 -0.25575336813926697 -0.06058647111058235 -0.9648416638374329 -0.25575336813926697 -0.06058647111058235 -0.7723252177238464 0.5074829459190369 -0.382066547870636 -0.7723252177238464 0.5074829459190369 -0.382066547870636 -0.7723252177238464 0.5074829459190369 -0.382066547870636 -0.7723252177238464 0.5074829459190369 -0.382066547870636 -0.6530949473381042 0.7549492120742798 -0.05931729078292847 -0.6530949473381042 0.7549492120742798 -0.05931729078292847 -0.6530949473381042 0.7549492120742798 -0.05931729078292847 -0.6530949473381042 0.7549492120742798 -0.05931729078292847 -0.6530949473381042 0.7549492120742798 -0.05931729078292847 -0.6530949473381042 0.7549492120742798 -0.05931729078292847 0.21034207940101624 0.9643343091011047 -0.1606726199388504 0.21034207940101624 0.9643343091011047 -0.1606726199388504 0.21034207940101624 0.9643343091011047 -0.1606726199388504 0.21034207940101624 0.9643343091011047 -0.1606726199388504 0.21034207940101624 0.9643343091011047 -0.1606726199388504 0.21034207940101624 0.9643343091011047 -0.1606726199388504 0.21034207940101624 0.9643343091011047 -0.1606726199388504 -0.12526215612888336 0.4614555537700653 -0.8782756924629211 -0.12526215612888336 0.4614555537700653 -0.8782756924629211 -0.12526215612888336 0.4614555537700653 -0.8782756924629211 -0.12526215612888336 0.4614555537700653 -0.8782756924629211 -0.12526215612888336 0.4614555537700653 -0.8782756924629211 -0.34174543619155884 -0.5913577079772949 -0.7304150462150574 -0.34174543619155884 -0.5913577079772949 -0.7304150462150574 -0.34174543619155884 -0.5913577079772949 -0.7304150462150574 -0.34174543619155884 -0.5913577079772949 -0.7304150462150574 -0.34174543619155884 -0.5913577079772949 -0.7304150462150574 -0.34174543619155884 -0.5913577079772949 -0.7304150462150574 0.47473087906837463 -0.836747944355011 -0.27291661500930786 0.47473087906837463 -0.836747944355011 -0.27291661500930786 0.47473087906837463 -0.836747944355011 -0.27291661500930786 0.47473087906837463 -0.836747944355011 -0.27291661500930786 0.38876044750213623 0.1212596520781517 0.9133244156837463 0.38876044750213623 0.1212596520781517 0.9133244156837463 0.38876044750213623 0.1212596520781517 0.9133244156837463 0.38876044750213623 0.1212596520781517 0.9133244156837463 0.38876044750213623 0.1212596520781517 0.9133244156837463 0.38876044750213623 0.1212596520781517 0.9133244156837463</float_array>
				<technique_common>
				<accessor source="#id-mesh-7-normals-array" count="84" stride="3">
					<param name="X" type="float"/>
					<param name="Y" type="float"/>
					<param name="Z" type="float"/>
				</accessor>
				</technique_common>
			</source>
			<source id="id-mesh-7-texcoord-0">
				<float_array id="id-mesh-7-texcoord-0-array" count="168"> 0.7299472093582153 0.4760003685951233 0.7279105186462402 0.4592873454093933 0.7415447235107422 0.45579177141189575 0.7390751838684082 0.47511738538742065 0.7409647703170776 0.5092886090278625 0.7379660606384277 0.5117830634117126 0.7365560531616211 0.49785035848617554 0.7045373320579529 0.44543689489364624 0.7191646099090576 0.45226794481277466 0.7155430912971497 0.4562874436378479 0.7002513408660889 0.4508846402168274 0.7474416494369507 0.49520939588546753 0.763428270816803 0.4982300400733948 0.7640882730484009 0.500089704990387 0.758019208908081 0.5111916661262512 0.7504239678382874 0.5090014338493347 0.7498595714569092 0.47744327783584595 0.744564414024353 0.4679257273674011 0.7448708415031433 0.46185070276260376 0.7559006214141846 0.4559008479118347 0.7633976936340332 0.45860642194747925 0.7633976936340332 0.4735005497932434 0.7052876949310303 0.4878445267677307 0.7166048288345337 0.5053568482398987 0.7101813554763794 0.5138625502586365 0.6962445974349976 0.5119989514350891 0.6939685344696045 0.49735885858535767 0.7456845045089722 0.5055428147315979 0.7409647703170776 0.5092886090278625 0.7365560531616211 0.49785035848617554 0.7320300340652466 0.4881048798561096 0.7380434274673462 0.4825630784034729 0.7456845045089722 0.4877437949180603 0.7258788347244263 0.4825630784034729 0.7299472093582153 0.4760003685951233 0.7390751838684082 0.47511738538742065 0.7445643544197083 0.4795122742652893 0.7258788347244263 0.4825630784034729 0.7191646099090576 0.4727852940559387 0.7279105186462402 0.4592873454093933 0.7299472093582153 0.4760003685951233 0.7559006214141846 0.4559008479118347 0.7448708415031433 0.46185070276260376 0.7446117401123047 0.4586253762245178 0.7498473525047302 0.44543689489364624 0.7520109415054321 0.44577330350875854 0.6939685344696045 0.4779450297355652 0.6967827677726746 0.4597991108894348 0.7114335894584656 0.4732096791267395 0.6979211568832397 0.4820418953895569 0.7002513408660889 0.4508846402168274 0.7155430912971497 0.4562874436378479 0.7135836482048035 0.4725995659828186 0.7114335894584656 0.4732096791267395 0.6967827677726746 0.4597991108894348 0.6965612173080444 0.4548489451408386 0.7436579465866089 0.44611722230911255 0.744564414024353 0.4492257237434387 0.7436492443084717 0.45175832509994507 0.7415447235107422 0.45579177141189575 0.7279105186462402 0.4592873454093933 0.7245476245880127 0.4519636034965515 0.7366068363189697 0.44543689489364624 0.7191646099090576 0.4792718291282654 0.7009257078170776 0.4854118227958679 0.6979211568832397 0.4820418953895569 0.7114335894584656 0.4732096791267395 0.7135836482048035 0.4725995659828186 0.7465332746505737 0.48669832944869995 0.7521412968635559 0.48272496461868286 0.7640882730484009 0.4825630784034729 0.763428270816803 0.4982300400733948 0.7474416494369507 0.49520939588546753 0.7456845045089722 0.4928930401802063 0.7166048288345337 0.5053568482398987 0.7052876949310303 0.4878445267677307 0.7061148881912231 0.4862286448478699 0.7166048288345337 0.4854118227958679 0.7379660606384277 0.5117830634117126 0.7341095209121704 0.5155566334724426 0.7194675207138062 0.5102414488792419 0.7191646099090576 0.4934878945350647 0.7320300340652466 0.4881048798561096 0.7365560531616211 0.49785035848617554</float_array>
				<technique_common>
				<accessor source="#id-mesh-7-texcoord-0-array" count="84" stride="2">
					<param name="S" type="float"/>
					<param name="T" type="float"/>
				</accessor>
				</technique_common>
			</source>
			<vertices id="id-mesh-7-vertices">
				<input semantic="POSITION" source="#id-mesh-7-positions"/>
			</vertices>
			<polygons count="17" material="id-trimat-8">
				<input semantic="VERTEX" source="#id-mesh-7-vertices" offset="0"/>
				<input semantic="NORMAL" source="#id-mesh-7-normals" offset="0"/>
				<input semantic="TEXCOORD" source="#id-mesh-7-texcoord-0" offset="0" set="0"/>
				<p> 0 1 2 3 </p>
				<p> 4 5 6 </p>
				<p> 7 8 9 10 </p>
				<p> 11 12 13 14 15 </p>
				<p> 16 17 18 19 20 21 </p>
				<p> 22 23 24 25 26 </p>
				<p> 27 28 29 30 31 32 </p>
				<p> 33 34 35 36 </p>
				<p> 37 38 39 40 </p>
				<p> 41 42 43 44 45 </p>
				<p> 46 47 48 49 </p>
				<p> 50 51 52 53 54 55 </p>
				<p> 56 57 58 59 60 61 62 </p>
				<p> 63 64 65 66 67 </p>
				<p> 68 69 70 71 72 73 </p>
				<p> 74 75 76 77 </p>
				<p> 78 79 80 81 82 83 </p>
			</polygons>
		</mesh>
	</geometry>
</library_geometries>
<library_visual_scenes>
	<visual_scene id="id-scene-1" name="scene">
		<node id="Rock_01" name="Rock_01" type="NODE">
			<matrix sid="transform"> 0.58277827501297 0.0 0.0 -0.10017460584640503 0.0 0.58277827501297 9.494663544273862e-08 -0.21266579627990723 0.0 -9.494663544273862e-08 0.58277827501297 -0.0871434211730957 0.0 0.0 0.0 1.0  </matrix>
			<instance_geometry url="#id-mesh-7">
				<bind_material>
					<technique_common>
						<instance_material symbol="id-trimat-8" target="#id-material-6"/>
					</technique_common>
				</bind_material>
			</instance_geometry>
		</node>
	</visual_scene>
</library_visual_scenes>
<scene>
	<instance_visual_scene url="#id-scene-1" />
</scene>
</COLLADA>
