<?xml version="1.0" encoding="utf-8"?>
<COLLADA xmlns="http://www.collada.org/2005/11/COLLADASchema" version="1.4.1">
<asset>
	<contributor>
		<author>Anonymous</author>
		<authoring_tool>Collada Exporter for Blender 2.6+, by Juan Linietsky (juan@codenix.com)</authoring_tool>
	</contributor>
	<created>2019-05-25T18:33:19Z</created>
	<modified>2019-05-25T18:33:19Z</modified>
	<unit meter="1.0" name="meter"/>
	<up_axis>Z_UP</up_axis>
</asset>
<library_effects>
	<effect id="id-fx-2" name="Material-fx">
		<profile_COMMON>
			<technique sid="common">
				<blinn>
					<emission>
						<color>  0.0 0.0 0.0 1.0 </color>
					</emission>
					<ambient>
						<color>  0.0 0.0 0.0 1.0 </color>
					</ambient>
					<diffuse>
						<color>  0.6400000190734865 0.6400000190734865 0.6400000190734865 1.0 </color>
					</diffuse>
					<specular>
						<color>  0.5 0.5 0.5 1.0 </color>
					</specular>
					<shininess>
						<float>50</float>
					</shininess>
					<reflective>
						<color>  1.0 1.0 1.0 1.0 </color>
					</reflective>
					<index_of_refraction>
						<float>4.0</float>
					</index_of_refraction>
				</blinn>
				<extra>
					<technique profile="FCOLLADA">
					</technique>
					<technique profile="GOOGLEEARTH">
						<double_sided>0</double_sided>
					</technique>
				</extra>
			</technique>
		</profile_COMMON>
	</effect>
</library_effects>
<library_materials>
	<material id="id-material-3" name="Material">
		<instance_effect url="#id-fx-2"/>
	</material>
</library_materials>
<library_geometries>
	<geometry id="id-mesh-4" name="Cube">
		<mesh>
			<source id="id-mesh-4-positions">
				<float_array id="id-mesh-4-positions-array" count="120"> 1.0 -5.960464477539063e-08 -1.1643731594085693 0.9999999403953552 -0.4501447081565857 -1.1643731594085693 -0.11783158779144287 -0.45014458894729614 -1.1643731594085693 -0.11783146858215332 2.980232238769531e-07 -1.1643731594085693 0.9999998807907104 -5.364418029785156e-07 1.3138885498046875 -0.11783170700073242 1.7881393432617188e-07 1.3138885498046875 -0.11783194541931152 -0.9999996423721313 0.8356268405914307 0.9999993443489075 -1.0000005960464478 0.8356268405914307 1.0 -5.960464477539063e-08 -1.1643731594085693 0.9999998807907104 -5.364418029785156e-07 1.3138885498046875 0.9999993443489075 -1.0000005960464478 0.8356268405914307 0.9999999403953552 -0.4501447081565857 -1.1643731594085693 0.9999999403953552 -0.4501447081565857 -1.1643731594085693 0.9999993443489075 -1.0000005960464478 0.8356268405914307 -0.11783194541931152 -0.9999996423721313 0.8356268405914307 -0.11783158779144287 -0.45014458894729614 -1.1643731594085693 -0.11783146858215332 2.980232238769531e-07 -1.1643731594085693 -0.11783170700073242 1.7881393432617188e-07 1.3138885498046875 -0.1178315281867981 1.0 0.8356268405914307 -0.11783117055892944 0.45014500617980957 -1.1643731594085693 1.0000004768371582 0.999999463558197 0.8356268405914307 0.9999999403953552 0.45014482736587524 -1.1643731594085693 -0.11783117055892944 0.45014500617980957 -1.1643731594085693 -0.1178315281867981 1.0 0.8356268405914307 -0.11783158779144287 -0.45014458894729614 -1.1643731594085693 -0.11783194541931152 -0.9999996423721313 0.8356268405914307 -0.11783170700073242 1.7881393432617188e-07 1.3138885498046875 -0.11783146858215332 2.980232238769531e-07 -1.1643731594085693 0.9999999403953552 0.45014482736587524 -1.1643731594085693 1.0000004768371582 0.999999463558197 0.8356268405914307 0.9999998807907104 -5.364418029785156e-07 1.3138885498046875 1.0 -5.960464477539063e-08 -1.1643731594085693 1.0000004768371582 0.999999463558197 0.8356268405914307 -0.1178315281867981 1.0 0.8356268405914307 -0.11783170700073242 1.7881393432617188e-07 1.3138885498046875 0.9999998807907104 -5.364418029785156e-07 1.3138885498046875 0.9999999403953552 0.45014482736587524 -1.1643731594085693 1.0 -5.960464477539063e-08 -1.1643731594085693 -0.11783146858215332 2.980232238769531e-07 -1.1643731594085693 -0.11783117055892944 0.45014500617980957 -1.1643731594085693</float_array>
				<technique_common>
				<accessor source="#id-mesh-4-positions-array" count="40" stride="3">
					<param name="X" type="float"/>
					<param name="Y" type="float"/>
					<param name="Z" type="float"/>
				</accessor>
				</technique_common>
			</source>
			<source id="id-mesh-4-normals">
				<float_array id="id-mesh-4-normals-array" count="120"> -1.1845450131886537e-07 0.0 -1.0 -1.1845450131886537e-07 0.0 -1.0 -1.1845450131886537e-07 0.0 -1.0 -1.1845450131886537e-07 0.0 -1.0 -3.1892344054540445e-07 -0.43145614862442017 0.9021339416503906 -3.1892344054540445e-07 -0.43145614862442017 0.9021339416503906 -3.1892344054540445e-07 -0.43145614862442017 0.9021339416503906 -3.1892344054540445e-07 -0.43145614862442017 0.9021339416503906 1.0 -4.2340974459875724e-07 1.0499830693788681e-07 1.0 -4.2340974459875724e-07 1.0499830693788681e-07 1.0 -4.2340974459875724e-07 1.0499830693788681e-07 1.0 -4.2340974459875724e-07 1.0499830693788681e-07 -4.6272592157947656e-07 -0.9642231464385986 -0.2650916576385498 -4.6272592157947656e-07 -0.9642231464385986 -0.2650916576385498 -4.6272592157947656e-07 -0.9642231464385986 -0.2650916576385498 -4.6272592157947656e-07 -0.9642231464385986 -0.2650916576385498 -1.0 2.82273219909257e-07 -1.667201416921671e-07 -1.0 2.82273219909257e-07 -1.667201416921671e-07 -1.0 2.82273219909257e-07 -1.667201416921671e-07 -1.0 2.82273219909257e-07 -1.667201416921671e-07 3.0848394771965104e-07 0.9642232656478882 -0.2650914192199707 3.0848394771965104e-07 0.9642232656478882 -0.2650914192199707 3.0848394771965104e-07 0.9642232656478882 -0.2650914192199707 3.0848394771965104e-07 0.9642232656478882 -0.2650914192199707 -0.9999999403953552 2.8227316306583816e-07 -9.88160380188674e-08 -0.9999999403953552 2.8227316306583816e-07 -9.88160380188674e-08 -0.9999999403953552 2.8227316306583816e-07 -9.88160380188674e-08 -0.9999999403953552 2.8227316306583816e-07 -9.88160380188674e-08 1.0 -5.645463261316763e-07 -4.588990165643736e-08 1.0 -5.645463261316763e-07 -4.588990165643736e-08 1.0 -5.645463261316763e-07 -4.588990165643736e-08 1.0 -5.645463261316763e-07 -4.588990165643736e-08 1.811888097336123e-07 0.4314561188220978 0.9021338820457458 1.811888097336123e-07 0.4314561188220978 0.9021338820457458 1.811888097336123e-07 0.4314561188220978 0.9021338820457458 1.811888097336123e-07 0.4314561188220978 0.9021338820457458 1.1845451552972008e-07 0.0 -1.0 1.1845451552972008e-07 0.0 -1.0 1.1845451552972008e-07 0.0 -1.0 1.1845451552972008e-07 0.0 -1.0</float_array>
				<technique_common>
				<accessor source="#id-mesh-4-normals-array" count="40" stride="3">
					<param name="X" type="float"/>
					<param name="Y" type="float"/>
					<param name="Z" type="float"/>
				</accessor>
				</technique_common>
			</source>
			<vertices id="id-mesh-4-vertices">
				<input semantic="POSITION" source="#id-mesh-4-positions"/>
			</vertices>
			<polygons count="10" material="id-trimat-5">
				<input semantic="VERTEX" source="#id-mesh-4-vertices" offset="0"/>
				<input semantic="NORMAL" source="#id-mesh-4-normals" offset="0"/>
				<p> 0 1 2 3 </p>
				<p> 4 5 6 7 </p>
				<p> 8 9 10 11 </p>
				<p> 12 13 14 15 </p>
				<p> 16 17 18 19 </p>
				<p> 20 21 22 23 </p>
				<p> 24 25 26 27 </p>
				<p> 28 29 30 31 </p>
				<p> 32 33 34 35 </p>
				<p> 36 37 38 39 </p>
			</polygons>
		</mesh>
	</geometry>
</library_geometries>
<library_visual_scenes>
	<visual_scene id="id-scene-1" name="scene">
		<node id="Cube" name="Cube" type="NODE">
			<matrix sid="transform"> -0.16585290431976318 0.0 0.0 0.0 0.0 1.0 0.0 0.0 0.0 0.0 1.0 0.0 0.0 0.0 0.0 1.0  </matrix>
			<instance_geometry url="#id-mesh-4">
				<bind_material>
					<technique_common>
						<instance_material symbol="id-trimat-5" target="#id-material-3"/>
					</technique_common>
				</bind_material>
			</instance_geometry>
		</node>
	</visual_scene>
</library_visual_scenes>
<scene>
	<instance_visual_scene url="#id-scene-1" />
</scene>
</COLLADA>
