<?xml version="1.0" encoding="utf-8"?>
<COLLADA xmlns="http://www.collada.org/2005/11/COLLADASchema" version="1.4.1">
<asset>
	<contributor>
		<author>Anonymous</author>
		<authoring_tool>Collada Exporter for Blender 2.6+, by Juan Linietsky (juan@codenix.com)</authoring_tool>
	</contributor>
	<created>2019-05-05T16:52:59Z</created>
	<modified>2019-05-05T16:52:59Z</modified>
	<unit meter="1.0" name="meter"/>
	<up_axis>Z_UP</up_axis>
</asset>
<library_images>
	<image id="id-image-3" name="Palette.png">
		<init_from>../../concepts/3D/LowPolyPack/Palette.png</init_from>
	</image>
</library_images>
<library_effects>
	<effect id="id-fx-2" name="Material.001-fx">
		<profile_COMMON>
			<newparam sid="id-fx_surf-4">
				<surface type="2D">
					<init_from>id-image-3</init_from>
					<format>A8R8G8B8</format>
				</surface>
			</newparam>
			<newparam sid="id-fx_sampler-5">
				<sampler2D>
					<source>id-fx_surf-4</source>
				</sampler2D>
			</newparam>
			<technique sid="common">
				<blinn>
					<emission>
						<color>  0.0 0.0 0.0 1.0 </color>
					</emission>
					<ambient>
						<color>  0.0 0.0 0.0 1.0 </color>
					</ambient>
					<diffuse>
						<texture texture="id-fx_sampler-5" texcoord="CHANNEL1"/>
					</diffuse>
					<specular>
						<color>  0.5 0.5 0.5 1.0 </color>
					</specular>
					<shininess>
						<float>50</float>
					</shininess>
					<reflective>
						<color>  1.0 1.0 1.0 1.0 </color>
					</reflective>
					<index_of_refraction>
						<float>4.0</float>
					</index_of_refraction>
				</blinn>
				<extra>
					<technique profile="FCOLLADA">
					</technique>
					<technique profile="GOOGLEEARTH">
						<double_sided>0</double_sided>
					</technique>
				</extra>
			</technique>
		</profile_COMMON>
	</effect>
</library_effects>
<library_materials>
	<material id="id-material-6" name="Material.001">
		<instance_effect url="#id-fx-2"/>
	</material>
</library_materials>
<library_geometries>
	<geometry id="id-mesh-7" name="Cone.001">
		<mesh>
			<source id="id-mesh-7-positions">
				<float_array id="id-mesh-7-positions-array" count="981"> 0.19851350784301758 0.19920861721038818 -9.5367431640625e-07 0.27114439010620117 -0.07168138027191162 -0.03710651397705078 0.0726323127746582 -0.2708923816680908 -0.03710651397705078 -0.19851112365722656 -0.19921326637268066 -9.5367431640625e-07 -0.27114248275756836 0.07167685031890869 0.037102699279785156 -0.07263040542602539 0.2708876132965088 0.037102699279785156 0.9562408328056335 -0.8232370615005493 16.648418426513672 0.8725041747093201 -0.8046199083328247 16.706750869750977 0.8076788783073425 -0.8696733713150024 16.706750869750977 0.8265902400016785 -0.9533442258834839 16.648418426513672 0.9103266596794128 -0.9719613790512085 16.590085983276367 0.9751521944999695 -0.9069079160690308 16.590085983276367 0.6299653649330139 -0.5730060338973999 12.520782470703125 0.9103266596794128 -0.9719613790512085 16.590085983276367 0.8265902400016785 -0.9533442258834839 16.648418426513672 0.47159916162490845 -0.5349475145339966 12.593158721923828 0.7111025452613831 -0.29460111260414124 12.593158721923828 0.9562408328056335 -0.8232370615005493 16.648418426513672 0.9751521944999695 -0.9069079160690308 16.590085983276367 0.7497172951698303 -0.4528328478336334 12.520782470703125 0.5527358651161194 -0.2565425932407379 12.665534973144531 0.8725041747093201 -0.8046199083328247 16.706750869750977 0.9562408328056335 -0.8232370615005493 16.648418426513672 0.7111025452613831 -0.29460111260414124 12.593158721923828 0.47159916162490845 -0.5349475145339966 12.593158721923828 0.8265902400016785 -0.9533442258834839 16.648418426513672 0.8076788783073425 -0.8696733713150024 16.706750869750977 0.4329844117164612 -0.3767155706882477 12.665534973144531 0.7497172951698303 -0.4528328478336334 12.520782470703125 0.9751521944999695 -0.9069079160690308 16.590085983276367 0.9103266596794128 -0.9719613790512085 16.590085983276367 0.6299653649330139 -0.5730060338973999 12.520782470703125 0.4329844117164612 -0.3767155706882477 12.665534973144531 0.8076788783073425 -0.8696733713150024 16.706750869750977 0.8725041747093201 -0.8046199083328247 16.706750869750977 0.5527358651161194 -0.2565425932407379 12.665534973144531 -0.009785175323486328 -0.16251039505004883 3.9238457679748535 0.1004033088684082 -0.24605846405029297 8.501640319824219 0.24640798568725586 -0.09953951835632324 8.501639366149902 0.1624736785888672 0.01035451889038086 3.9238457679748535 0.4573173522949219 -0.28345489501953125 3.826122760772705 0.4923210144042969 -0.3445894718170166 8.380402565002441 0.3463153839111328 -0.49110841751098633 8.380401611328125 0.28505849838256836 -0.4563199281692505 3.826122283935547 0.05150747299194336 -0.3958476781845093 3.8749852180480957 0.15035676956176758 -0.44184303283691406 8.441021919250488 0.1004033088684082 -0.24605846405029297 8.501640319824219 -0.009785175323486328 -0.16251039505004883 3.9238457679748535 0.1624736785888672 0.01035451889038086 3.9238457679748535 0.24640798568725586 -0.09953951835632324 8.501639366149902 0.4423670768737793 -0.1488049030303955 8.441020965576172 0.3960247039794922 -0.05011773109436035 3.8749847412109375 0.3960247039794922 -0.05011773109436035 3.8749847412109375 0.4423670768737793 -0.1488049030303955 8.441020965576172 0.4923210144042969 -0.3445894718170166 8.380402565002441 0.4573173522949219 -0.28345489501953125 3.826122760772705 0.28505849838256836 -0.4563199281692505 3.826122283935547 0.3463153839111328 -0.49110841751098633 8.380401611328125 0.15035676956176758 -0.44184303283691406 8.441021919250488 0.05150747299194336 -0.3958476781845093 3.8749852180480957 0.1004033088684082 -0.24605846405029297 8.501640319824219 0.4329844117164612 -0.3767155706882477 12.665534973144531 0.5527358651161194 -0.2565425932407379 12.665534973144531 0.24640798568725586 -0.09953951835632324 8.501639366149902 0.4923210144042969 -0.3445894718170166 8.380402565002441 0.7497172951698303 -0.4528328478336334 12.520782470703125 0.6299653649330139 -0.5730060338973999 12.520782470703125 0.3463153839111328 -0.49110841751098633 8.380401611328125 0.15035676956176758 -0.44184303283691406 8.441021919250488 0.1004033088684082 -0.24605846405029297 8.501640319824219 0.5527358651161194 -0.2565425932407379 12.665534973144531 0.7111025452613831 -0.29460111260414124 12.593158721923828 0.4423670768737793 -0.1488049030303955 8.441020965576172 0.7111025452613831 -0.29460111260414124 12.593158721923828 0.7497172951698303 -0.4528328478336334 12.520782470703125 0.4923210144042969 -0.3445894718170166 8.380402565002441 0.6299653649330139 -0.5730060338973999 12.520782470703125 0.47159916162490845 -0.5349475145339966 12.593158721923828 0.0726323127746582 -0.2708923816680908 -0.03710651397705078 0.28505849838256836 -0.4563199281692505 3.826122283935547 0.05150747299194336 -0.3958476781845093 3.8749852180480957 -0.19851112365722656 -0.19921326637268066 -9.5367431640625e-07 0.19851350784301758 0.19920861721038818 -9.5367431640625e-07 0.3960247039794922 -0.05011773109436035 3.8749847412109375 0.4573173522949219 -0.28345489501953125 3.826122760772705 0.27114439010620117 -0.07168138027191162 -0.03710651397705078 -0.07263040542602539 0.2708876132965088 0.037102699279785156 0.1624736785888672 0.01035451889038086 3.9238457679748535 0.3960247039794922 -0.05011773109436035 3.8749847412109375 0.19851350784301758 0.19920861721038818 -9.5367431640625e-07 -0.19851112365722656 -0.19921326637268066 -9.5367431640625e-07 0.05150747299194336 -0.3958476781845093 3.8749852180480957 -0.009785175323486328 -0.16251039505004883 3.9238457679748535 -0.27114248275756836 0.07167685031890869 0.037102699279785156 0.27114439010620117 -0.07168138027191162 -0.03710651397705078 0.4573173522949219 -0.28345489501953125 3.826122760772705 0.28505849838256836 -0.4563199281692505 3.826122283935547 0.0726323127746582 -0.2708923816680908 -0.03710651397705078 -0.27114248275756836 0.07167685031890869 0.037102699279785156 -0.009785175323486328 -0.16251039505004883 3.9238457679748535 0.1624736785888672 0.01035451889038086 3.9238457679748535 -0.07263040542602539 0.2708876132965088 0.037102699279785156 -0.644210696220398 -0.16465425491333008 7.943621635437012 -1.0230923891067505 -0.10344672203063965 7.486904144287109 -1.0126893520355225 -0.08027660846710205 7.467710971832275 -0.6285717487335205 -0.1298365294933319 7.918485641479492 -0.6285717487335205 -0.1298365294933319 7.918485641479492 -1.0126893520355225 -0.08027660846710205 7.467710971832275 -1.0286427736282349 -0.07993486523628235 7.510558128356934 -0.6522098779678345 -0.12909673154354095 7.974339485168457 -1.0126893520355225 -0.08027660846710205 7.467710971832275 -1.0230923891067505 -0.10344672203063965 7.486904144287109 -1.0286427736282349 -0.07993486523628235 7.510558128356934 -0.6522098779678345 -0.12909673154354095 7.974339485168457 -1.0286427736282349 -0.07993486523628235 7.510558128356934 -1.0230923891067505 -0.10344672203063965 7.486904144287109 -0.644210696220398 -0.16465425491333008 7.943621635437012 0.44612666964530945 -0.2722966969013214 9.330389022827148 0.040285587310791016 -0.22495171427726746 9.025602340698242 0.05639570951461792 -0.2845979630947113 8.969793319702148 0.4634353518486023 -0.34366270899772644 9.261092185974121 0.040285587310791016 -0.22495171427726746 9.025602340698242 -0.2897569537162781 -0.17713302373886108 8.448653221130371 -0.2779105305671692 -0.22478750348091125 8.407814979553223 0.05639570951461792 -0.2845979630947113 8.969793319702148 -0.2897569537162781 -0.17713302373886108 8.448653221130371 -0.6522098779678345 -0.12909673154354095 7.974339485168457 -0.644210696220398 -0.16465425491333008 7.943621635437012 -0.2779105305671692 -0.22478750348091125 8.407814979553223 0.49539944529533386 -0.27357834577560425 9.205449104309082 0.08473184704780579 -0.22648116946220398 8.92510986328125 0.040285587310791016 -0.22495171427726746 9.025602340698242 0.44612666964530945 -0.2722966969013214 9.330389022827148 -0.2564566135406494 -0.17837579548358917 8.376529693603516 -0.2897569537162781 -0.17713302373886108 8.448653221130371 0.4634353518486023 -0.34366270899772644 9.261092185974121 0.05639570951461792 -0.2845979630947113 8.969793319702148 0.08473184704780579 -0.22648116946220398 8.92510986328125 0.49539944529533386 -0.27357834577560425 9.205449104309082 0.05639570951461792 -0.2845979630947113 8.969793319702148 -0.2779105305671692 -0.22478750348091125 8.407814979553223 -0.2564566135406494 -0.17837579548358917 8.376529693603516 0.08473184704780579 -0.22648116946220398 8.92510986328125 -0.2779105305671692 -0.22478750348091125 8.407814979553223 -0.644210696220398 -0.16465425491333008 7.943621635437012 -0.6285717487335205 -0.1298365294933319 7.918485641479492 -0.2564566135406494 -0.17837579548358917 8.376529693603516 -0.30929434299468994 0.12584227323532104 11.491347312927246 -0.5981686115264893 0.31584876775741577 11.093287467956543 -0.5812264680862427 0.33031296730041504 11.074668884277344 -0.2837710380554199 0.14761292934417725 11.466672897338867 -0.2837710380554199 0.14761292934417725 11.466672897338867 -0.5812264680862427 0.33031296730041504 11.074668884277344 -0.5932499170303345 0.3371455669403076 11.113351821899414 -0.3016192317008972 0.15784698724746704 11.517172813415527 -0.5812264680862427 0.33031296730041504 11.074668884277344 -0.5981686115264893 0.31584876775741577 11.093287467956543 -0.5932499170303345 0.3371455669403076 11.113351821899414 -0.3016192317008972 0.15784698724746704 11.517172813415527 -0.5932499170303345 0.3371455669403076 11.113351821899414 -0.5981686115264893 0.31584876775741577 11.093287467956543 -0.30929434299468994 0.12584227323532104 11.491347312927246 0.549424409866333 -0.36507734656333923 12.697952270507812 0.2359769642353058 -0.1743393987417221 12.436875343322754 0.22520044445991516 -0.2291024923324585 12.389652252197266 0.5349066853523254 -0.4298716187477112 12.639266014099121 0.2359769642353058 -0.1743393987417221 12.436875343322754 -0.020641803741455078 -0.015074044466018677 11.93077278137207 -0.030016422271728516 -0.05839574337005615 11.896418571472168 0.22520044445991516 -0.2291024923324585 12.389652252197266 -0.020641803741455078 -0.015074044466018677 11.93077278137207 -0.3016192317008972 0.15784698724746704 11.517172813415527 -0.30929434299468994 0.12584227323532104 11.491347312927246 -0.030016422271728516 -0.05839574337005615 11.896418571472168 0.5865913033485413 -0.38628682494163513 12.5850830078125 0.26955610513687134 -0.19364765286445618 12.345962524414062 0.2359769642353058 -0.1743393987417221 12.436875343322754 0.549424409866333 -0.36507734656333923 12.697952270507812 0.00453031063079834 -0.029586046934127808 11.865486145019531 -0.020641803741455078 -0.015074044466018677 11.93077278137207 0.5349066853523254 -0.4298716187477112 12.639266014099121 0.22520044445991516 -0.2291024923324585 12.389652252197266 0.26955610513687134 -0.19364765286445618 12.345962524414062 0.5865913033485413 -0.38628682494163513 12.5850830078125 0.22520044445991516 -0.2291024923324585 12.389652252197266 -0.030016422271728516 -0.05839574337005615 11.896418571472168 0.00453031063079834 -0.029586046934127808 11.865486145019531 0.26955610513687134 -0.19364765286445618 12.345962524414062 -0.030016422271728516 -0.05839574337005615 11.896418571472168 -0.30929434299468994 0.12584227323532104 11.491347312927246 -0.2837710380554199 0.14761292934417725 11.466672897338867 0.00453031063079834 -0.029586046934127808 11.865486145019531 1.0670884847640991 -1.0104517936706543 12.419660568237305 1.218003749847412 -1.1680476665496826 12.062344551086426 1.2029345035552979 -1.1743407249450684 12.050086975097656 1.0445334911346436 -1.0201003551483154 12.40359115600586 1.0445334911346436 -1.0201003551483154 12.40359115600586 1.2029345035552979 -1.1743407249450684 12.050086975097656 1.211753249168396 -1.1831285953521729 12.07457160949707 1.057314157485962 -1.0328361988067627 12.435012817382812 1.2029345035552979 -1.1743407249450684 12.050086975097656 1.218003749847412 -1.1680476665496826 12.062344551086426 1.211753249168396 -1.1831285953521729 12.07457160949707 1.057314157485962 -1.0328361988067627 12.435012817382812 1.211753249168396 -1.1831285953521729 12.07457160949707 1.218003749847412 -1.1680476665496826 12.062344551086426 1.0670884847640991 -1.0104517936706543 12.419660568237305 0.6066722273826599 -0.5945897698402405 13.488476753234863 0.7803666591644287 -0.7640699744224548 13.224084854125977 0.7953250408172607 -0.7252214550971985 13.196065902709961 0.625478982925415 -0.5487611889839172 13.453027725219727 0.7803666591644287 -0.7640699744224548 13.224084854125977 0.9095903635025024 -0.8892354965209961 12.799717903137207 0.9221417903900146 -0.858803391456604 12.779540061950684 0.7953250408172607 -0.7252214550971985 13.196065902709961 0.9095903635025024 -0.8892354965209961 12.799717903137207 1.057314157485962 -1.0328361988067627 12.435012817382812 1.0670884847640991 -1.0104517936706543 12.419660568237305 0.9221417903900146 -0.858803391456604 12.779540061950684 0.5797123312950134 -0.5677244663238525 13.417562484741211 0.7565051913261414 -0.7402922511100769 13.167885780334473 0.7803666591644287 -0.7640699744224548 13.224084854125977 0.6066722273826599 -0.5945897698402405 13.488476753234863 0.8918313980102539 -0.8715388774871826 12.759628295898438 0.9095903635025024 -0.8892354965209961 12.799717903137207 0.625478982925415 -0.5487611889839172 13.453027725219727 0.7953250408172607 -0.7252214550971985 13.196065902709961 0.7565051913261414 -0.7402922511100769 13.167885780334473 0.5797123312950134 -0.5677244663238525 13.417562484741211 0.7953250408172607 -0.7252214550971985 13.196065902709961 0.9221417903900146 -0.858803391456604 12.779540061950684 0.8918313980102539 -0.8715388774871826 12.759628295898438 0.7565051913261414 -0.7402922511100769 13.167885780334473 0.9221417903900146 -0.858803391456604 12.779540061950684 1.0670884847640991 -1.0104517936706543 12.419660568237305 1.0445334911346436 -1.0201003551483154 12.40359115600586 0.8918313980102539 -0.8715388774871826 12.759628295898438 0.48196491599082947 0.8639246225357056 3.7305023670196533 0.5636272430419922 1.261687159538269 3.222273349761963 0.5851966142654419 1.2474830150604248 3.196289539337158 0.5146640539169312 0.842555046081543 3.6954073905944824 0.5146640539169312 0.842555046081543 3.6954073905944824 0.5851966142654419 1.2474830150604248 3.196289539337158 0.5910916328430176 1.2642364501953125 3.241633176803589 0.5230528116226196 0.8673839569091797 3.754396438598633 0.5851966142654419 1.2474830150604248 3.196289539337158 0.5636272430419922 1.261687159538269 3.222273349761963 0.5910916328430176 1.2642364501953125 3.241633176803589 0.5230528116226196 0.8673839569091797 3.754396438598633 0.5910916328430176 1.2642364501953125 3.241633176803589 0.5636272430419922 1.261687159538269 3.222273349761963 0.48196491599082947 0.8639246225357056 3.7305023670196533 0.3250100910663605 -0.2905798554420471 5.253493785858154 0.40754109621047974 0.1371023952960968 4.910233497619629 0.33791297674179077 0.12845030426979065 4.865630149841309 0.241777241230011 -0.29882240295410156 5.197405815124512 0.40754109621047974 0.1371023952960968 4.910233497619629 0.4589557647705078 0.4852305054664612 4.277886390686035 0.403759241104126 0.4793921113014221 4.246232986450195 0.33791297674179077 0.12845030426979065 4.865630149841309 0.4589557647705078 0.4852305054664612 4.277886390686035 0.5230528116226196 0.8673839569091797 3.754396438598633 0.48196491599082947 0.8639246225357056 3.7305023670196533 0.403759241104126 0.4793921113014221 4.246232986450195 0.30713826417922974 -0.3423287868499756 5.121389389038086 0.3919731080532074 0.09041434526443481 4.804179668426514 0.40754109621047974 0.1371023952960968 4.910233497619629 0.3250100910663605 -0.2905798554420471 5.253493785858154 0.44743531942367554 0.4502484202384949 4.201828956604004 0.4589557647705078 0.4852305054664612 4.277886390686035 0.241777241230011 -0.29882240295410156 5.197405815124512 0.33791297674179077 0.12845030426979065 4.865630149841309 0.3919731080532074 0.09041434526443481 4.804179668426514 0.30713826417922974 -0.3423287868499756 5.121389389038086 0.33791297674179077 0.12845030426979065 4.865630149841309 0.403759241104126 0.4793921113014221 4.246232986450195 0.44743531942367554 0.4502484202384949 4.201828956604004 0.3919731080532074 0.09041434526443481 4.804179668426514 0.403759241104126 0.4793921113014221 4.246232986450195 0.48196491599082947 0.8639246225357056 3.7305023670196533 0.5146640539169312 0.842555046081543 3.6954073905944824 0.44743531942367554 0.4502484202384949 4.201828956604004 0.8368694186210632 -0.779091477394104 6.548099994659424 1.0015125274658203 -0.9510228633880615 6.158281326293945 0.9850723743438721 -0.9578884243965149 6.144908905029297 0.8122626543045044 -0.789617657661438 6.530569076538086 0.8122626543045044 -0.789617657661438 6.530569076538086 0.9850723743438721 -0.9578884243965149 6.144908905029297 0.9946933388710022 -0.9674757122993469 6.1716203689575195 0.8262059092521667 -0.8035119771957397 6.564847946166992 0.9850723743438721 -0.9578884243965149 6.144908905029297 1.0015125274658203 -0.9510228633880615 6.158281326293945 0.9946933388710022 -0.9674757122993469 6.1716203689575195 0.8262059092521667 -0.8035119771957397 6.564847946166992 0.9946933388710022 -0.9674757122993469 6.1716203689575195 1.0015125274658203 -0.9510228633880615 6.158281326293945 0.8368694186210632 -0.779091477394104 6.548099994659424 0.3345719873905182 -0.3254011273384094 7.714139461517334 0.5240662693977356 -0.5102978944778442 7.425697326660156 0.5403853058815002 -0.4679155945777893 7.395129680633545 0.3550894856452942 -0.27540379762649536 7.6754655838012695 0.5240662693977356 -0.5102978944778442 7.425697326660156 0.6650446057319641 -0.6468489170074463 6.962728977203369 0.6787377595901489 -0.613648533821106 6.9407148361206055 0.5403853058815002 -0.4679155945777893 7.395129680633545 0.6650446057319641 -0.6468489170074463 6.962728977203369 0.8262059092521667 -0.8035119771957397 6.564847946166992 0.8368694186210632 -0.779091477394104 6.548099994659424 0.6787377595901489 -0.613648533821106 6.9407148361206055 0.3051597774028778 -0.29609206318855286 7.63677453994751 0.4980343282222748 -0.48435723781585693 7.364386558532715 0.5240662693977356 -0.5102978944778442 7.425697326660156 0.3345719873905182 -0.3254011273384094 7.714139461517334 0.6456702947616577 -0.6275424957275391 6.918992042541504 0.6650446057319641 -0.6468489170074463 6.962728977203369 0.3550894856452942 -0.27540379762649536 7.6754655838012695 0.5403853058815002 -0.4679155945777893 7.395129680633545 0.4980343282222748 -0.48435723781585693 7.364386558532715 0.3051597774028778 -0.29609206318855286 7.63677453994751 0.5403853058815002 -0.4679155945777893 7.395129680633545 0.6787377595901489 -0.613648533821106 6.9407148361206055 0.6456702947616577 -0.6275424957275391 6.918992042541504 0.4980343282222748 -0.48435723781585693 7.364386558532715 0.6787377595901489 -0.613648533821106 6.9407148361206055 0.8368694186210632 -0.779091477394104 6.548099994659424 0.8122626543045044 -0.789617657661438 6.530569076538086 0.6456702947616577 -0.6275424957275391 6.918992042541504</float_array>
				<technique_common>
				<accessor source="#id-mesh-7-positions-array" count="327" stride="3">
					<param name="X" type="float"/>
					<param name="Y" type="float"/>
					<param name="Z" type="float"/>
				</accessor>
				</technique_common>
			</source>
			<source id="id-mesh-7-normals">
				<float_array id="id-mesh-7-normals-array" count="981"> -0.10706765204668045 0.10669213533401489 -0.9885106086730957 -0.10706765204668045 0.10669213533401489 -0.9885106086730957 -0.10706765204668045 0.10669213533401489 -0.9885106086730957 -0.10706765204668045 0.10669213533401489 -0.9885106086730957 -0.10706765204668045 0.10669213533401489 -0.9885106086730957 -0.10706765204668045 0.10669213533401489 -0.9885106086730957 0.444212406873703 -0.4426473081111908 0.7789342999458313 0.444212406873703 -0.4426473081111908 0.7789342999458313 0.444212406873703 -0.4426473081111908 0.7789342999458313 0.444212406873703 -0.4426473081111908 0.7789342999458313 0.444212406873703 -0.4426473081111908 0.7789342999458313 0.444212406873703 -0.4426473081111908 0.7789342999458313 -0.2659362256526947 -0.9609993100166321 -0.0758824273943901 -0.2659362256526947 -0.9609993100166321 -0.0758824273943901 -0.2659362256526947 -0.9609993100166321 -0.0758824273943901 -0.2659362256526947 -0.9609993100166321 -0.0758824273943901 0.9692065715789795 0.2448161393404007 -0.02652435377240181 0.9692065715789795 0.2448161393404007 -0.02652435377240181 0.9692065715789795 0.2448161393404007 -0.02652435377240181 0.9692065715789795 0.2448161393404007 -0.02652435377240181 0.2811293303966522 0.9536628127098083 0.1072082668542862 0.2811293303966522 0.9536628127098083 0.1072082668542862 0.2811293303966522 0.9536628127098083 0.1072082668542862 0.2811293303966522 0.9536628127098083 0.1072082668542862 -0.9635910987854004 -0.2608778476715088 0.05860932916402817 -0.9638094902038574 -0.260303258895874 0.057561978697776794 -0.9638094902038574 -0.260303258895874 0.057561978697776794 -0.9616974592208862 -0.26569437980651855 0.06741192191839218 0.7034657001495361 -0.7010006904602051 -0.11719270050525665 0.7034657001495361 -0.7010006904602051 -0.11719270050525665 0.7034657001495361 -0.7010006904602051 -0.11719270050525665 0.7034657001495361 -0.7010006904602051 -0.11719270050525665 -0.7003275752067566 0.6978703141212463 0.15006107091903687 -0.7003275752067566 0.6978703141212463 0.15006107091903687 -0.7003275752067566 0.6978703141212463 0.15006107091903687 -0.7003275752067566 0.6978703141212463 0.15006107091903687 -0.7080309987068176 0.7055473327636719 0.029919158667325974 -0.7080309987068176 0.7055473327636719 0.029919158667325974 -0.7080309987068176 0.7055473327636719 0.029919158667325974 -0.7080309987068176 0.7055473327636719 0.029919158667325974 0.708268404006958 -0.7057856917381287 -0.014917775988578796 0.708268404006958 -0.7057856917381287 -0.014917775988578796 0.708268404006958 -0.7057856917381287 -0.014917775988578796 0.708268404006958 -0.7057856917381287 -0.014917775988578796 -0.9666803479194641 -0.25531870126724243 0.01848217099905014 -0.9666803479194641 -0.25531870126724243 0.01848217099905014 -0.9666803479194641 -0.25531870126724243 0.01848217099905014 -0.9666803479194641 -0.25531870126724243 0.01848217099905014 0.25192058086395264 0.9675714373588562 0.01848217472434044 0.2514488101005554 0.9676944017410278 0.01846815086901188 0.24614682793617249 0.9690595269203186 0.01830977201461792 0.25192058086395264 0.9675714373588562 0.01848217472434044 0.9677304029464722 0.25195246934890747 -0.00421625142917037 0.9677304029464722 0.25195246934890747 -0.00421625142917037 0.9677304029464722 0.25195246934890747 -0.00421625142917037 0.9677304029464722 0.25195246934890747 -0.00421625142917037 -0.24854984879493713 -0.9686099290847778 -0.004216264467686415 -0.2409428358078003 -0.9705345630645752 -0.0030472269281744957 -0.24794316291809082 -0.968765914440155 -0.004122766200453043 -0.24854984879493713 -0.9686099290847778 -0.004216264467686415 -0.7061632871627808 0.7036858201026917 0.07848378270864487 -0.7061632871627808 0.7036858201026917 0.07848378270864487 -0.7061632871627808 0.7036858201026917 0.07848378270864487 -0.7061632871627808 0.7036858201026917 0.07848378270864487 0.7069678902626038 -0.7044903039932251 -0.062368057668209076 0.7069678902626038 -0.7044903039932251 -0.062368057668209076 0.7069678902626038 -0.7044903039932251 -0.062368057668209076 0.7069678902626038 -0.7044903039932251 -0.062368057668209076 -0.9614722728729248 -0.2662489712238312 0.0684288889169693 -0.9614722728729248 -0.2662489712238312 0.0684288889169693 0.24572019279003143 0.9691680073738098 0.018297046422958374 0.24572019279003143 0.9691680073738098 0.018297046422958374 0.9638456106185913 0.261106014251709 -0.05315374955534935 0.9638456106185913 0.261106014251709 -0.05315374955534935 0.9638456106185913 0.261106014251709 -0.05315374955534935 0.9638456106185913 0.261106014251709 -0.05315374955534935 -0.24033552408218384 -0.9706854224205017 -0.0029538420494645834 -0.24033552408218384 -0.9706854224205017 -0.0029538420494645834 -0.25830787420272827 -0.9655246734619141 -0.03223445639014244 -0.25830787420272827 -0.9655246734619141 -0.03223445639014244 -0.25830787420272827 -0.9655246734619141 -0.03223445639014244 -0.25830787420272827 -0.9655246734619141 -0.03223445639014244 0.9646113514900208 0.26169806718826294 -0.03223445266485214 0.9646113514900208 0.26169806718826294 -0.03223445266485214 0.9646113514900208 0.26169806718826294 -0.03223445266485214 0.9646113514900208 0.26169806718826294 -0.03223445266485214 0.2607730031013489 0.964165985584259 0.04880029708147049 0.2607730031013489 0.964165985584259 0.04880029708147049 0.2607730031013489 0.964165985584259 0.04880029708147049 0.2607730031013489 0.964165985584259 0.04880029708147049 -0.9632436037063599 -0.264159619808197 0.04880019649863243 -0.9632436037063599 -0.264159619808197 0.04880019649863243 -0.9632436037063599 -0.264159619808197 0.04880019649863243 -0.9632436037063599 -0.264159619808197 0.04880019649863243 0.7064768671989441 -0.7039986848831177 -0.07263743132352829 0.7064768671989441 -0.7039986848831177 -0.07263743132352829 0.7064768671989441 -0.7039986848831177 -0.07263743132352829 0.7064768671989441 -0.7039986848831177 -0.07263743132352829 -0.7054858803749084 0.7030120491981506 0.08979766070842743 -0.7054858803749084 0.7030120491981506 0.08979766070842743 -0.7054858803749084 0.7030120491981506 0.08979766070842743 -0.7054858803749084 0.7030120491981506 0.08979766070842743 0.5402843952178955 -0.6506055593490601 -0.5336713790893555 0.5402843952178955 -0.6506055593490601 -0.5336713790893555 0.5402843952178955 -0.6506055593490601 -0.5336713790893555 0.5402843952178955 -0.6506055593490601 -0.5336713790893555 0.0960194319486618 0.9949992895126343 0.027507400140166283 0.09597314149141312 0.9950013160705566 0.027594171464443207 0.09597314149141312 0.9950013160705566 0.027594171464443207 0.09606059640645981 0.9949973821640015 0.027430223301053047 -0.9288923740386963 0.12970960140228271 -0.34689241647720337 -0.9288923740386963 0.12970960140228271 -0.34689241647720337 -0.9288923740386963 0.12970960140228271 -0.34689241647720337 -0.6598785519599915 -0.5851828455924988 0.4712975323200226 -0.6598785519599915 -0.5851828455924988 0.4712975323200226 -0.6598785519599915 -0.5851828455924988 0.4712975323200226 -0.6598785519599915 -0.5851828455924988 0.4712975323200226 -0.49760860204696655 -0.6620689630508423 0.5604020357131958 -0.49760860204696655 -0.6620689630508423 0.5604020357131958 -0.49760860204696655 -0.6620689630508423 0.5604020357131958 -0.49760860204696655 -0.6620689630508423 0.5604020357131958 -0.7475008368492126 -0.541408360004425 0.38486286997795105 -0.7475008368492126 -0.541408360004425 0.38486286997795105 -0.7475008368492126 -0.541408360004425 0.38486286997795105 -0.7475008368492126 -0.541408360004425 0.38486286997795105 -0.6829133629798889 -0.5630680918693542 0.46538567543029785 -0.6829133629798889 -0.5630680918693542 0.46538567543029785 -0.6829133629798889 -0.5630680918693542 0.46538567543029785 -0.6829133629798889 -0.5630680918693542 0.46538567543029785 0.09552667289972305 0.9950523376464844 0.027305128052830696 0.09598159044981003 0.9950072169303894 0.027352293953299522 0.09611529856920242 0.9949939250946045 0.027366166934370995 0.09552667289972305 0.9950523376464844 0.027305128052830696 0.09616122394800186 0.9949897527694702 0.02735731191933155 0.09621798247098923 0.994983971118927 0.027370067313313484 0.36240455508232117 -0.6741225123405457 -0.6436007022857666 0.36240455508232117 -0.6741225123405457 -0.6436007022857666 0.36240455508232117 -0.6741225123405457 -0.6436007022857666 0.36240455508232117 -0.6741225123405457 -0.6436007022857666 0.6359640955924988 -0.6284449100494385 -0.4478911757469177 0.6359640955924988 -0.6284449100494385 -0.4478911757469177 0.6359640955924988 -0.6284449100494385 -0.4478911757469177 0.6359640955924988 -0.6284449100494385 -0.4478911757469177 0.5695347785949707 -0.6282384395599365 -0.5300438404083252 0.5695347785949707 -0.6282384395599365 -0.5300438404083252 0.5695347785949707 -0.6282384395599365 -0.5300438404083252 0.5695347785949707 -0.6282384395599365 -0.5300438404083252 0.1766005903482437 -0.8331499099731445 -0.524092972278595 0.1766005903482437 -0.8331499099731445 -0.524092972278595 0.1766005903482437 -0.8331499099731445 -0.524092972278595 0.1766005903482437 -0.8331499099731445 -0.524092972278595 0.515181303024292 0.8570395708084106 0.008445799350738525 0.5151425004005432 0.8570621013641357 0.008533446118235588 0.5151425004005432 0.8570621013641357 0.008533446118235588 0.5152153372764587 0.8570199012756348 0.008368968032300472 -0.7973760962486267 0.5010571479797363 -0.33635249733924866 -0.7973760962486267 0.5010571479797363 -0.33635249733924866 -0.7973760962486267 0.5010571479797363 -0.33635249733924866 -0.8355441689491272 -0.2315453737974167 0.4982495605945587 -0.8355441689491272 -0.2315453737974167 0.4982495605945587 -0.8355441689491272 -0.2315453737974167 0.4982495605945587 -0.8355441689491272 -0.2315453737974167 0.4982495605945587 -0.7168710827827454 -0.3711602985858917 0.590199887752533 -0.7168710827827454 -0.3711602985858917 0.590199887752533 -0.7168710827827454 -0.3711602985858917 0.590199887752533 -0.7168710827827454 -0.3711602985858917 0.590199887752533 -0.8991139531135559 -0.15556199848651886 0.40913867950439453 -0.8991139531135559 -0.15556199848651886 0.40913867950439453 -0.8991139531135559 -0.15556199848651886 0.40913867950439453 -0.8991139531135559 -0.15556199848651886 0.40913867950439453 -0.8470733165740967 -0.2012539803981781 0.49189797043800354 -0.8470733165740967 -0.2012539803981781 0.49189797043800354 -0.8470733165740967 -0.2012539803981781 0.49189797043800354 -0.8470733165740967 -0.2012539803981781 0.49189797043800354 0.5147539377212524 0.8572982549667358 0.008248682133853436 0.5151455998420715 0.8570626378059387 0.008291272446513176 0.5152626633644104 0.8569920659065247 0.008304019458591938 0.5147539377212524 0.8572982549667358 0.008248682133853436 0.515301525592804 0.8569688200950623 0.008294721134006977 0.5153505802154541 0.8569391369819641 0.008306851610541344 0.0008981307037174702 -0.7784177660942078 -0.627746045589447 0.0008981307037174702 -0.7784177660942078 -0.627746045589447 0.0008981307037174702 -0.7784177660942078 -0.627746045589447 0.0008981307037174702 -0.7784177660942078 -0.627746045589447 0.2773697078227997 -0.8532813787460327 -0.4415617287158966 0.2773697078227997 -0.8532813787460327 -0.4415617287158966 0.2773697078227997 -0.8532813787460327 -0.4415617287158966 0.2773697078227997 -0.8532813787460327 -0.4415617287158966 0.21275027096271515 -0.8261892795562744 -0.5216785669326782 0.21275027096271515 -0.8261892795562744 -0.5216785669326782 0.21275027096271515 -0.8261892795562744 -0.5216785669326782 0.21275027096271515 -0.8261892795562744 -0.5216785669326782 -0.0635516345500946 0.9034329652786255 -0.4239930212497711 -0.0635516345500946 0.9034329652786255 -0.4239930212497711 -0.0635516345500946 0.9034329652786255 -0.4239930212497711 -0.0635516345500946 0.9034329652786255 -0.4239930212497711 -0.7015141248703003 -0.7126472592353821 -0.003452892182394862 -0.7014668583869934 -0.712693989276886 -0.003374075051397085 -0.7014668583869934 -0.712693989276886 -0.003374075051397085 -0.7015594244003296 -0.7126023173332214 -0.003528420813381672 0.6313979029655457 -0.6292010545730591 -0.4532579183578491 0.6313979029655457 -0.6292010545730591 -0.4532579183578491 0.6313979029655457 -0.6292010545730591 -0.4532579183578491 0.9047112464904785 -0.07876993715763092 0.418679803609848 0.9047112464904785 -0.07876993715763092 0.418679803609848 0.9047112464904785 -0.07876993715763092 0.418679803609848 0.9047112464904785 -0.07876993715763092 0.418679803609848 0.8498907089233398 0.054002512246370316 0.5241847038269043 0.8498907089233398 0.054002512246370316 0.5241847038269043 0.8498907089233398 0.054002512246370316 0.5241847038269043 0.8498907089233398 0.054002512246370316 0.5241847038269043 0.9338082075119019 -0.14248965680599213 0.32817521691322327 0.9338082075119019 -0.14248965680599213 0.32817521691322327 0.9338082075119019 -0.14248965680599213 0.32817521691322327 0.9338082075119019 -0.14248965680599213 0.32817521691322327 0.9059023261070251 -0.10735426098108292 0.40965354442596436 0.9059023261070251 -0.10735426098108292 0.40965354442596436 0.9059023261070251 -0.10735426098108292 0.40965354442596436 0.9059023261070251 -0.10735426098108292 0.40965354442596436 -0.7012069225311279 -0.712948203086853 -0.0036956099793314934 -0.7015295624732971 -0.7126311659812927 -0.0036081294529139996 -0.7013813257217407 -0.7127768397331238 -0.0036483202129602432 -0.7012069225311279 -0.712948203086853 -0.0036956099793314934 -0.7016451954841614 -0.7125175595283508 -0.003589375177398324 -0.7016862630844116 -0.7124770283699036 -0.0035717736463993788 0.0644710436463356 0.8418477177619934 -0.5358506441116333 0.0644710436463356 0.8418477177619934 -0.5358506441116333 0.0644710436463356 0.8418477177619934 -0.5358506441116333 0.0644710436463356 0.8418477177619934 -0.5358506441116333 -0.1361960470676422 0.9298340082168579 -0.34184694290161133 -0.1361960470676422 0.9298340082168579 -0.34184694290161133 -0.1361960470676422 0.9298340082168579 -0.34184694290161133 -0.1361960470676422 0.9298340082168579 -0.34184694290161133 -0.09712306410074234 0.9027990102767944 -0.4189523756504059 -0.09712306410074234 0.9027990102767944 -0.4189523756504059 -0.09712306410074234 0.9027990102767944 -0.4189523756504059 -0.09712306410074234 0.9027990102767944 -0.4189523756504059 -0.7859417796134949 -0.4201986491680145 -0.4535731375217438 -0.7859417796134949 -0.4201986491680145 -0.4535731375217438 -0.7859417796134949 -0.4201986491680145 -0.4535731375217438 -0.7859417796134949 -0.4201986491680145 -0.4535731375217438 0.9736049175262451 -0.22392892837524414 -0.04415082931518555 0.9736198782920837 -0.22388072311878204 -0.044064778834581375 0.9736198782920837 -0.22388072311878204 -0.044064778834581375 0.9735913872718811 -0.22397246956825256 -0.04422847926616669 0.16924411058425903 0.9171327352523804 -0.36086562275886536 0.16924411058425903 0.9171327352523804 -0.36086562275886536 0.16924411058425903 0.9171327352523804 -0.36086562275886536 -0.39799442887306213 0.7513382434844971 0.5263946652412415 -0.39799442887306213 0.7513382434844971 0.5263946652412415 -0.39799442887306213 0.7513382434844971 0.5263946652412415 -0.39799442887306213 0.7513382434844971 0.5263946652412415 -0.4845050275325775 0.6022217869758606 0.634494960308075 -0.4845050275325775 0.6022217869758606 0.634494960308075 -0.4845050275325775 0.6022217869758606 0.634494960308075 -0.4845050275325775 0.6022217869758606 0.634494960308075 -0.35852110385894775 0.8289273977279663 0.42935076355934143 -0.35852110385894775 0.8289273977279663 0.42935076355934143 -0.35852110385894775 0.8289273977279663 0.42935076355934143 -0.35852110385894775 0.8289273977279663 0.42935076355934143 -0.3728141486644745 0.7703477740287781 0.5172755122184753 -0.3728141486644745 0.7703477740287781 0.5172755122184753 -0.3728141486644745 0.7703477740287781 0.5172755122184753 -0.3728141486644745 0.7703477740287781 0.5172755122184753 0.9737049341201782 -0.2234526127576828 -0.04435993358492851 0.973604679107666 -0.22389884293079376 -0.04430690407752991 0.9735234975814819 -0.22425971925258636 -0.044264014810323715 0.9737049341201782 -0.2234526127576828 -0.04435993358492851 0.9735649228096008 -0.2240733653306961 -0.04429998993873596 0.9735528230667114 -0.22412876784801483 -0.04428640753030777 -0.7992063164710999 -0.24574995040893555 -0.548521876335144 -0.7992063164710999 -0.24574995040893555 -0.548521876335144 -0.7992063164710999 -0.24574995040893555 -0.548521876335144 -0.7992063164710999 -0.24574995040893555 -0.548521876335144 -0.7664412260055542 -0.519198477268219 -0.3781543970108032 -0.7664412260055542 -0.519198477268219 -0.3781543970108032 -0.7664412260055542 -0.519198477268219 -0.3781543970108032 -0.7664412260055542 -0.519198477268219 -0.3781543970108032 -0.7692782878875732 -0.45119473338127136 -0.4523650109767914 -0.7692782878875732 -0.45119473338127136 -0.4523650109767914 -0.7692782878875732 -0.45119473338127136 -0.4523650109767914 -0.7692782878875732 -0.45119473338127136 -0.4523650109767914 -0.06356921046972275 0.9034300446510315 -0.4239965081214905 -0.06356921046972275 0.9034300446510315 -0.4239965081214905 -0.06356921046972275 0.9034300446510315 -0.4239965081214905 -0.06356921046972275 0.9034300446510315 -0.4239965081214905 -0.7015118598937988 -0.712649405002594 -0.003451809985563159 -0.7014636993408203 -0.7126971483230591 -0.003371754428371787 -0.7014636993408203 -0.7126971483230591 -0.003371754428371787 -0.701557993888855 -0.7126036286354065 -0.0035285232588648796 0.6314309239387512 -0.6291700005531311 -0.4532549977302551 0.6314309239387512 -0.6291700005531311 -0.4532549977302551 0.6314309239387512 -0.6291700005531311 -0.4532549977302551 0.9047097563743591 -0.07877986878156662 0.41868117451667786 0.9047097563743591 -0.07877986878156662 0.41868117451667786 0.9047097563743591 -0.07877986878156662 0.41868117451667786 0.9047097563743591 -0.07877986878156662 0.41868117451667786 0.8498883843421936 0.054003991186618805 0.5241881608963013 0.8498883843421936 0.054003991186618805 0.5241881608963013 0.8498883843421936 0.054003991186618805 0.5241881608963013 0.8498883843421936 0.054003991186618805 0.5241881608963013 0.9338082671165466 -0.14248640835285187 0.32817623019218445 0.9338082671165466 -0.14248640835285187 0.32817623019218445 0.9338082671165466 -0.14248640835285187 0.32817623019218445 0.9338082671165466 -0.14248640835285187 0.32817623019218445 0.9059016704559326 -0.10735373198986053 0.4096551537513733 0.9059016704559326 -0.10735373198986053 0.4096551537513733 0.9059016704559326 -0.10735373198986053 0.4096551537513733 0.9059016704559326 -0.10735373198986053 0.4096551537513733 -0.7012046575546265 -0.7129504680633545 -0.003696352243423462 -0.7015236616134644 -0.7126370072364807 -0.0036092123482376337 -0.7013770937919617 -0.7127810716629028 -0.0036492468789219856 -0.7012046575546265 -0.7129504680633545 -0.003696352243423462 -0.7016421556472778 -0.7125204801559448 -0.003590688342228532 -0.7016807198524475 -0.7124825119972229 -0.0035730749368667603 0.06446072459220886 0.8418477177619934 -0.5358518362045288 0.06446072459220886 0.8418477177619934 -0.5358518362045288 0.06446072459220886 0.8418477177619934 -0.5358518362045288 0.06446072459220886 0.8418477177619934 -0.5358518362045288 -0.13619698584079742 0.9298340678215027 -0.3418464958667755 -0.13619698584079742 0.9298340678215027 -0.3418464958667755 -0.13619698584079742 0.9298340678215027 -0.3418464958667755 -0.13619698584079742 0.9298340678215027 -0.3418464958667755 -0.09711111336946487 0.9027992486953735 -0.41895461082458496 -0.09711111336946487 0.9027992486953735 -0.41895461082458496 -0.09711111336946487 0.9027992486953735 -0.41895461082458496 -0.09711111336946487 0.9027992486953735 -0.41895461082458496</float_array>
				<technique_common>
				<accessor source="#id-mesh-7-normals-array" count="327" stride="3">
					<param name="X" type="float"/>
					<param name="Y" type="float"/>
					<param name="Z" type="float"/>
				</accessor>
				</technique_common>
			</source>
			<source id="id-mesh-7-texcoord-0">
				<float_array id="id-mesh-7-texcoord-0-array" count="654"> 0.594016969203949 0.7982260584831238 0.597629189491272 0.7978047728538513 0.6012414693832397 0.7982162237167358 0.6012414693832397 0.799048900604248 0.597629189491272 0.7994701862335205 0.594016969203949 0.799058735370636 0.5744929909706116 0.790737509727478 0.5749791264533997 0.7906242609024048 0.576319694519043 0.7906328439712524 0.5771741271018982 0.7907546758651733 0.5766879916191101 0.7908679246902466 0.5753474235534668 0.7908594012260437 0.5668947696685791 0.8232093453407288 0.5704457759857178 0.833622395992279 0.5694814920425415 0.8336722254753113 0.5650700330734253 0.8232093453407288 0.5706507563591003 0.8026970624923706 0.5744929909706116 0.790737509727478 0.5753474235534668 0.7908594012260437 0.5722380876541138 0.8028173446655273 0.5785504579544067 0.8025766611099243 0.5818564295768738 0.7906242609024048 0.5831718444824219 0.7907806634902954 0.5810168981552124 0.802760899066925 0.5650700330734253 0.8232093453407288 0.5694814920425415 0.8336722254753113 0.5682438611984253 0.8338529467582703 0.5627403855323792 0.8234511613845825 0.5722380876541138 0.8028173446655273 0.5753474235534668 0.7908594012260437 0.5766879916191101 0.7908679246902466 0.5747144818305969 0.8028331995010376 0.5849640965461731 0.8026226162910461 0.583501398563385 0.7906256318092346 0.5848605036735535 0.7906242609024048 0.5874747037887573 0.8026200532913208 0.5833107233047485 0.8283840417861938 0.5831718444824219 0.8149185180664062 0.5862328410148621 0.8149154186248779 0.5869221687316895 0.8283804059028625 0.5736408829689026 0.8279311060905457 0.5735850930213928 0.8148527145385742 0.576604425907135 0.8148720264434814 0.5772031545639038 0.8279538750648499 0.5677531957626343 0.8006443977355957 0.5650293827056885 0.8123205304145813 0.5621550679206848 0.8125434517860413 0.5643342137336731 0.8008484840393066 0.5795667171478271 0.8283393979072571 0.5772031545639038 0.81486976146698 0.580238938331604 0.8150125741958618 0.5831718444824219 0.82844078540802 0.5713436603546143 0.8279216885566711 0.5716428160667419 0.8147879242897034 0.5735850930213928 0.8148527145385742 0.5736408829689026 0.8279311060905457 0.5704457759857178 0.800788164138794 0.5672880411148071 0.8123924136161804 0.5650293827056885 0.8123205304145813 0.5677531957626343 0.8006443977355957 0.5831718444824219 0.8149185180664062 0.5849640965461731 0.8026226162910461 0.5874747037887573 0.8026200532913208 0.5862328410148621 0.8149154186248779 0.5735850930213928 0.8148527145385742 0.5722380876541138 0.8028173446655273 0.5747144818305969 0.8028331995010376 0.576604425907135 0.8148720264434814 0.5650293827056885 0.8123205304145813 0.5621550679206848 0.8125434517860413 0.5785504579544067 0.8025766611099243 0.5810168981552124 0.802760899066925 0.5716428160667419 0.8147879242897034 0.5706507563591003 0.8026970624923706 0.5722380876541138 0.8028173446655273 0.5735850930213928 0.8148527145385742 0.5668947696685791 0.8232093453407288 0.5650700330734253 0.8232093453407288 0.5698950886726379 0.7908399105072021 0.5704457759857178 0.800788164138794 0.5677531957626343 0.8006443977355957 0.5667685270309448 0.7906242609024048 0.5704457759857178 0.8392232656478882 0.5713436603546143 0.8279216885566711 0.5736408829689026 0.8279311060905457 0.5730979442596436 0.8391771912574768 0.5785444974899292 0.8398107886314392 0.5795667171478271 0.8283393979072571 0.5831718444824219 0.82844078540802 0.5827189087867737 0.839870810508728 0.5667685270309448 0.7906242609024048 0.5677531957626343 0.8006443977355957 0.5643342137336731 0.8008484840393066 0.5628048777580261 0.7908095121383667 0.5730979442596436 0.8391771912574768 0.5736408829689026 0.8279311060905457 0.5772031545639038 0.8279538750648499 0.5772031545639038 0.8392034769058228 0.5833128690719604 0.8398698568344116 0.5833107233047485 0.8283840417861938 0.5869221687316895 0.8283804059028625 0.5874747037887573 0.8398656249046326 0.6057938933372498 0.7922758460044861 0.6060434579849243 0.7906545996665955 0.6064893007278442 0.7906242609024048 0.6064460277557373 0.7922402620315552 0.5939390659332275 0.7958294749259949 0.594016969203949 0.7975691556930542 0.5934302806854248 0.7975032925605774 0.5931428670883179 0.7957490086555481 0.5971047878265381 0.7970481514930725 0.5968446135520935 0.7969736456871033 0.5971047878265381 0.7969205975532532 0.6013256311416626 0.7924233078956604 0.6015582084655762 0.7906599044799805 0.6020216345787048 0.7906242609024048 0.6019951105117798 0.792380154132843 0.6006273031234741 0.7975748777389526 0.599814236164093 0.79611736536026 0.6009753942489624 0.7960401773452759 0.6020216345787048 0.7974731922149658 0.599814236164093 0.79611736536026 0.6009491086006165 0.7941843271255493 0.6018499732017517 0.7941291928291321 0.6009753942489624 0.7960401773452759 0.6009491086006165 0.7941843271255493 0.6013256311416626 0.7924233078956604 0.6019951105117798 0.792380154132843 0.6018499732017517 0.7941291928291321 0.594016969203949 0.7908111214637756 0.5921697616577148 0.7922186255455017 0.5907160639762878 0.7920774817466736 0.5922759175300598 0.7906242609024048 0.5936588048934937 0.7940962910652161 0.5925999879837036 0.7939976453781128 0.6051488518714905 0.7969677448272705 0.6043746471405029 0.7957606315612793 0.6054922342300415 0.7956963777542114 0.6064893007278442 0.7968830466270447 0.6043746471405029 0.7957606315612793 0.6054317951202393 0.7939039468765259 0.6062947511672974 0.7938631772994995 0.6054922342300415 0.7956963777542114 0.6054317951202393 0.7939039468765259 0.6057938933372498 0.7922758460044861 0.6064460277557373 0.7922402620315552 0.6062947511672974 0.7938631772994995 0.6109854578971863 0.7946045398712158 0.6108450293540955 0.7959815263748169 0.6105145215988159 0.7960280776023865 0.6104900240898132 0.7946650981903076 0.5997437238693237 0.7951825261116028 0.599814236164093 0.7967044711112976 0.5992866158485413 0.7966450452804565 0.599027693271637 0.7951096892356873 0.5971434712409973 0.7969205975532532 0.5968446135520935 0.7968596816062927 0.5971434712409973 0.7968094348907471 0.60377037525177 0.7921922206878662 0.6039707660675049 0.7906564474105835 0.6043746471405029 0.7906242609024048 0.604341983795166 0.7921518683433533 0.6031633019447327 0.7966783046722412 0.6020216345787048 0.7953725457191467 0.6030308604240417 0.7953022122383118 0.6043746471405029 0.7965859174728394 0.6020216345787048 0.7953725457191467 0.6033836007118225 0.7937207221984863 0.6041554808616638 0.7936693429946899 0.6030308604240417 0.7953022122383118 0.6033836007118225 0.7937207221984863 0.60377037525177 0.7921922206878662 0.604341983795166 0.7921518683433533 0.6041554808616638 0.7936693429946899 0.599814236164093 0.7907931208610535 0.5981518626213074 0.7920186519622803 0.5968446135520935 0.7918906807899475 0.5982483625411987 0.7906242609024048 0.5994914770126343 0.7936656475067139 0.5985393524169922 0.7935760617256165 0.6113912463188171 0.7906242609024048 0.6113912463188171 0.7915931940078735 0.6105586290359497 0.7917000651359558 0.6103913187980652 0.7907587885856628 0.6113912463188171 0.7915931940078735 0.6111409068107605 0.793215274810791 0.6104799509048462 0.7932900190353394 0.6105586290359497 0.7917000651359558 0.6111409068107605 0.793215274810791 0.6109854578971863 0.7946045398712158 0.6104900240898132 0.7946650981903076 0.6104799509048462 0.7932900190353394 0.6098397970199585 0.7969110012054443 0.6099905371665955 0.7957199215888977 0.6102426052093506 0.7957066893577576 0.6101996302604675 0.7968969345092773 0.6083844304084778 0.7983303666114807 0.6084306240081787 0.7993866801261902 0.6080856323242188 0.7993572354316711 0.6079164147377014 0.7982958555221558 0.6051268577575684 0.7969677448272705 0.6053006649017334 0.7970141172409058 0.6050409078598022 0.797044575214386 0.60490882396698 0.7979349493980408 0.6050409078598022 0.797044575214386 0.6053006649017334 0.7970141172409058 0.6052927374839783 0.7978979349136353 0.6045161485671997 0.8005377054214478 0.6043746471405029 0.7999359369277954 0.6050276756286621 0.799866259098053 0.6053006649017334 0.8004496097564697 0.6043746471405029 0.7999359369277954 0.6047402620315552 0.7988430261611938 0.6052548885345459 0.798794150352478 0.6050276756286621 0.799866259098053 0.6047402620315552 0.7988430261611938 0.60490882396698 0.7979349493980408 0.6052927374839783 0.7978979349136353 0.6052548885345459 0.798794150352478 0.6084306240081787 0.7952781915664673 0.6073439121246338 0.7961671352386475 0.6064893007278442 0.7961076498031616 0.6074069738388062 0.7951960563659668 0.6082195043563843 0.7972817420959473 0.6075971722602844 0.7972409725189209 0.6094893217086792 0.8003653287887573 0.6086071729660034 0.7993974685668945 0.6092360019683838 0.7993725538253784 0.6102425456047058 0.8003297448158264 0.6086071729660034 0.7993974685668945 0.6095746755599976 0.7980979681015015 0.6100468635559082 0.798083484172821 0.6092360019683838 0.7993725538253784 0.6095746755599976 0.7980979681015015 0.6098397970199585 0.7969110012054443 0.6101996302604675 0.7968969345092773 0.6100468635559082 0.798083484172821 0.603185772895813 0.7992649078369141 0.603724479675293 0.8004366159439087 0.6032819151878357 0.800433337688446 0.6025510430335999 0.7992514967918396 0.5906398296356201 0.7963017821311951 0.5907160639762878 0.7981980443000793 0.5901399850845337 0.7981246709823608 0.5898578763008118 0.7962118983268738 0.5972601175308228 0.7967044711112976 0.5973196029663086 0.7968094348907471 0.5968446135520935 0.7968094348907471 0.5961973071098328 0.7924677133560181 0.5964108109474182 0.7906408905982971 0.5968446135520935 0.7906242609024048 0.596802830696106 0.7924548983573914 0.5955464243888855 0.7978047728538513 0.594016969203949 0.7963431477546692 0.5950987339019775 0.7963147759437561 0.5968446135520935 0.7977613806724548 0.594016969203949 0.7963431477546692 0.5957408547401428 0.7942987084388733 0.5965604782104492 0.7942840456962585 0.5950987339019775 0.7963147759437561 0.5957408547401428 0.7942987084388733 0.5961973071098328 0.7924677133560181 0.596802830696106 0.7924548983573914 0.5965604782104492 0.7942840456962585 0.5907160639762878 0.7908326983451843 0.5889024138450623 0.7923615574836731 0.5874747037887573 0.7922037243843079 0.5890061855316162 0.7906242609024048 0.5903646349906921 0.7944120764732361 0.5893247127532959 0.7943016886711121 0.5907160639762878 0.7987817525863647 0.5909267067909241 0.7975691556930542 0.5919678211212158 0.7976417541503906 0.5919678211212158 0.798862874507904 0.603724479675293 0.7966958284378052 0.6028571128845215 0.798082172870636 0.6020216345787048 0.7980588674545288 0.6026149392127991 0.7966783046722412 0.6028571128845215 0.798082172870636 0.603185772895813 0.7992649078369141 0.6025510430335999 0.7992514967918396 0.6020216345787048 0.7980588674545288 0.6099518537521362 0.7919381260871887 0.6101163625717163 0.7906386852264404 0.6103913187980652 0.7906242609024048 0.6103444695472717 0.7919228076934814 0.6085568070411682 0.7940436601638794 0.6086071729660034 0.7951960563659668 0.6082308292388916 0.7951639294624329 0.6080461740493774 0.7940060496330261 0.611211895942688 0.7960280776023865 0.6114015579223633 0.7960786819458008 0.6111181974411011 0.7961120009422302 0.6109740734100342 0.7970832586288452 0.6111181974411011 0.7961120009422302 0.6114015579223633 0.7960786819458008 0.6113929152488708 0.7970429062843323 0.6105456948280334 0.7999228239059448 0.6103913187980652 0.7992662787437439 0.6111037135124207 0.7991902828216553 0.6114015579223633 0.7998267412185669 0.6103913187980652 0.7992662787437439 0.6107901334762573 0.7980740070343018 0.6113516092300415 0.798020601272583 0.6111037135124207 0.7991902828216553 0.6107901334762573 0.7980740070343018 0.6109740734100342 0.7970832586288452 0.6113929152488708 0.7970429062843323 0.6113516092300415 0.798020601272583 0.6086071729660034 0.7907138466835022 0.6074215769767761 0.7916836142539978 0.6064893007278442 0.7916187644004822 0.6074904203414917 0.7906242609024048 0.6083769202232361 0.7928996682167053 0.6076979637145996 0.7928552031517029 0.6095695495605469 0.7957066893577576 0.6086071729660034 0.7946507334709167 0.6092932224273682 0.794623613357544 0.6103913187980652 0.795667827129364 0.6086071729660034 0.7946507334709167 0.609662652015686 0.7932330369949341 0.6101778745651245 0.7932172417640686 0.6092932224273682 0.794623613357544 0.609662652015686 0.7932330369949341 0.6099518537521362 0.7919381260871887 0.6103444695472717 0.7919228076934814 0.6101778745651245 0.7932172417640686</float_array>
				<technique_common>
				<accessor source="#id-mesh-7-texcoord-0-array" count="327" stride="2">
					<param name="S" type="float"/>
					<param name="T" type="float"/>
				</accessor>
				</technique_common>
			</source>
			<vertices id="id-mesh-7-vertices">
				<input semantic="POSITION" source="#id-mesh-7-positions"/>
			</vertices>
			<polygons count="91" material="id-trimat-8">
				<input semantic="VERTEX" source="#id-mesh-7-vertices" offset="0"/>
				<input semantic="NORMAL" source="#id-mesh-7-normals" offset="0"/>
				<input semantic="TEXCOORD" source="#id-mesh-7-texcoord-0" offset="0" set="0"/>
				<p> 0 1 2 3 4 5 </p>
				<p> 6 7 8 9 10 11 </p>
				<p> 12 13 14 15 </p>
				<p> 16 17 18 19 </p>
				<p> 20 21 22 23 </p>
				<p> 24 25 26 27 </p>
				<p> 28 29 30 31 </p>
				<p> 32 33 34 35 </p>
				<p> 36 37 38 39 </p>
				<p> 40 41 42 43 </p>
				<p> 44 45 46 47 </p>
				<p> 48 49 50 51 </p>
				<p> 52 53 54 55 </p>
				<p> 56 57 58 59 </p>
				<p> 60 61 62 63 </p>
				<p> 64 65 66 67 </p>
				<p> 68 24 27 69 </p>
				<p> 49 70 71 50 </p>
				<p> 72 73 74 75 </p>
				<p> 57 76 77 58 </p>
				<p> 78 79 80 81 </p>
				<p> 82 83 84 85 </p>
				<p> 86 87 88 89 </p>
				<p> 90 91 92 93 </p>
				<p> 94 95 96 97 </p>
				<p> 98 99 100 101 </p>
				<p> 102 103 104 105 </p>
				<p> 106 107 108 109 </p>
				<p> 110 111 112 </p>
				<p> 113 114 115 116 </p>
				<p> 117 118 119 120 </p>
				<p> 121 122 123 124 </p>
				<p> 125 126 127 128 </p>
				<p> 129 130 131 132 </p>
				<p> 130 133 134 131 </p>
				<p> 133 106 109 134 </p>
				<p> 135 136 137 138 </p>
				<p> 139 140 141 142 </p>
				<p> 143 144 145 146 </p>
				<p> 147 148 149 150 </p>
				<p> 151 152 153 154 </p>
				<p> 155 156 157 </p>
				<p> 158 159 160 161 </p>
				<p> 162 163 164 165 </p>
				<p> 166 167 168 169 </p>
				<p> 170 171 172 173 </p>
				<p> 174 175 176 177 </p>
				<p> 175 178 179 176 </p>
				<p> 178 151 154 179 </p>
				<p> 180 181 182 183 </p>
				<p> 184 185 186 187 </p>
				<p> 188 189 190 191 </p>
				<p> 192 193 194 195 </p>
				<p> 196 197 198 199 </p>
				<p> 200 201 202 </p>
				<p> 203 204 205 206 </p>
				<p> 207 208 209 210 </p>
				<p> 211 212 213 214 </p>
				<p> 215 216 217 218 </p>
				<p> 219 220 221 222 </p>
				<p> 220 223 224 221 </p>
				<p> 223 196 199 224 </p>
				<p> 225 226 227 228 </p>
				<p> 229 230 231 232 </p>
				<p> 233 234 235 236 </p>
				<p> 237 238 239 240 </p>
				<p> 241 242 243 244 </p>
				<p> 245 246 247 </p>
				<p> 248 249 250 251 </p>
				<p> 252 253 254 255 </p>
				<p> 256 257 258 259 </p>
				<p> 260 261 262 263 </p>
				<p> 264 265 266 267 </p>
				<p> 265 268 269 266 </p>
				<p> 268 241 244 269 </p>
				<p> 270 271 272 273 </p>
				<p> 274 275 276 277 </p>
				<p> 278 279 280 281 </p>
				<p> 282 283 284 285 </p>
				<p> 286 287 288 289 </p>
				<p> 290 291 292 </p>
				<p> 293 294 295 296 </p>
				<p> 297 298 299 300 </p>
				<p> 301 302 303 304 </p>
				<p> 305 306 307 308 </p>
				<p> 309 310 311 312 </p>
				<p> 310 313 314 311 </p>
				<p> 313 286 289 314 </p>
				<p> 315 316 317 318 </p>
				<p> 319 320 321 322 </p>
				<p> 323 324 325 326 </p>
			</polygons>
		</mesh>
	</geometry>
</library_geometries>
<library_visual_scenes>
	<visual_scene id="id-scene-1" name="scene">
		<node id="Dead_Tree_02" name="Dead_Tree_02" type="NODE">
			<matrix sid="transform"> 0.3853241205215454 -0.38397297263145447 -0.026300568133592606 -0.12640666961669922 0.3853897154331207 0.3867458403110504 1.888270872996145e-09 0.06906986236572266 0.0331311896443367 -0.033015020191669464 0.3058822453022003 -0.16141986846923828 0.0 0.0 0.0 1.0  </matrix>
			<instance_geometry url="#id-mesh-7">
				<bind_material>
					<technique_common>
						<instance_material symbol="id-trimat-8" target="#id-material-6"/>
					</technique_common>
				</bind_material>
			</instance_geometry>
		</node>
	</visual_scene>
</library_visual_scenes>
<scene>
	<instance_visual_scene url="#id-scene-1" />
</scene>
</COLLADA>
