[gd_scene load_steps=4 format=2]

[ext_resource path="res://src/scripts/Blade.gd" type="Script" id=1]
[ext_resource path="res://concepts/blade_2.png" type="Texture" id=2]


[sub_resource type="CylinderShape" id=1]
radius = 1.05687

[node name="Spatial" type="RigidBody"]
gravity_scale = 0.0
script = ExtResource( 1 )

[node name="CollisionShape" type="CollisionShape" parent="."]
transform = Transform( 1, 0, 0, 0, 0.1, 0, 0, 0, 1, 0, 0.156141, 0 )
shape = SubResource( 1 )

[node name="Position3D" type="Position3D" parent="."]
transform = Transform( 1, 0, 0, 0, -4.37114e-08, -1, 0, 1, -4.37114e-08, 0, 0.105006, 0 )

[node name="Sprite3D" type="Sprite3D" parent="Position3D"]
transform = Transform( 0.5, 0, 0, 0, 0.5, 0, 0, 0, 1, 0, 0.00852644, 1.49012e-08 )
texture = ExtResource( 2 )

[node name="change_dir" type="Timer" parent="."]
autostart = true
[connection signal="timeout" from="change_dir" to="." method="_on_change_dir_timeout"]
