[gd_scene load_steps=2 format=2]

[ext_resource path="res://assets/3D/grass.dae" type="PackedScene" id=1]

[node name="Scene Root" instance=ExtResource( 1 )]

[node name="Camera" parent="." index="0"]
visible = false

[node name="Lamp" parent="." index="2"]
visible = false

