<?xml version="1.0" encoding="utf-8"?>
<COLLADA xmlns="http://www.collada.org/2005/11/COLLADASchema" version="1.4.1">
<asset>
	<contributor>
		<author>Anonymous</author>
		<authoring_tool>Collada Exporter for Blender 2.6+, by Juan Linietsky (juan@codenix.com)</authoring_tool>
	</contributor>
	<created>2019-05-25T15:22:39Z</created>
	<modified>2019-05-25T15:22:39Z</modified>
	<unit meter="1.0" name="meter"/>
	<up_axis>Z_UP</up_axis>
</asset>
<library_effects>
	<effect id="id-fx-2" name="Material-fx">
		<profile_COMMON>
			<technique sid="common">
				<blinn>
					<emission>
						<color>  0.0 0.0 0.0 1.0 </color>
					</emission>
					<ambient>
						<color>  0.0 0.0 0.0 1.0 </color>
					</ambient>
					<diffuse>
						<color>  0.11785098489896928 0.041890943674608216 0.002678169163736241 1.0 </color>
					</diffuse>
					<specular>
						<color>  0.5 0.5 0.5 1.0 </color>
					</specular>
					<shininess>
						<float>50</float>
					</shininess>
					<reflective>
						<color>  1.0 1.0 1.0 1.0 </color>
					</reflective>
					<index_of_refraction>
						<float>4.0</float>
					</index_of_refraction>
				</blinn>
				<extra>
					<technique profile="FCOLLADA">
					</technique>
					<technique profile="GOOGLEEARTH">
						<double_sided>0</double_sided>
					</technique>
				</extra>
			</technique>
		</profile_COMMON>
	</effect>
</library_effects>
<library_materials>
	<material id="id-material-3" name="Material">
		<instance_effect url="#id-fx-2"/>
	</material>
</library_materials>
<library_geometries>
	<geometry id="id-mesh-4" name="Cube.001">
		<mesh>
			<source id="id-mesh-4-positions">
				<float_array id="id-mesh-4-positions-array" count="1242"> -10.952733993530273 4.80814266204834 -3.6568822860717773 -11.907167434692383 5.627098083496094 1.0 -11.907167434692383 7.3061652183532715 1.0 -10.952733993530273 6.231085300445557 -3.6568822860717773 -3.339831829071045 7.861003875732422 -3.6568820476531982 -2.7177608013153076 8.936083793640137 1.0 -0.3390772342681885 7.3061652183532715 1.0 -1.369227409362793 6.231085300445557 -3.6568820476531982 -0.4009065628051758 -3.981025218963623 -2.7013604640960693 0.3134479522705078 -4.7440900802612305 1.0 2.0264201164245605 -7.3061652183532715 1.0 0.5189304351806641 -6.152281761169434 -3.6568820476531982 -7.543210029602051 -5.785223960876465 -3.6568822860717773 -7.765928745269775 -6.9391069412231445 1.0 -11.907167434692383 -7.3061652183532715 1.0 -10.952733993530273 -6.152281761169434 -3.6568822860717773 -2.3742382526397705 -4.542841911315918 -7.627556800842285 -0.2538749575614929 -3.482579469680786 -7.627556800842285 -0.40488201379776 -5.398547172546387 -7.627556800842285 -2.494194984436035 -6.591665267944336 -7.627556800842285 -8.275046348571777 -4.377032279968262 1.0 -11.907167434692383 -4.7440900802612305 1.0 -11.907167434692383 -7.3061652183532715 1.0 -7.765928745269775 -6.9391069412231445 1.0 -7.892340660095215 -2.904597759246826 1.0 -11.907167434692383 -3.271655559539795 1.0 -2.995133638381958 -3.365375518798828 -7.627556800842285 -1.0354890823364258 -2.3814656734466553 -7.627556800842285 -0.2538749575614929 -3.482579469680786 -7.627556800842285 -2.3742382526397705 -4.542841911315918 -7.627556800842285 0.04240846633911133 -2.7331957817077637 -3.6568820476531982 1.6010956764221191 -3.271655559539795 1.0 0.3134479522705078 -4.7440900802612305 1.0 -0.4009065628051758 -3.981025218963623 -2.7013604640960693 -10.952733993530273 -6.152281761169434 -3.6568822860717773 -11.907167434692383 -7.3061652183532715 1.0 -11.907167434692383 -4.7440900802612305 1.0 -10.952733993530273 -3.981025218963623 -3.6568822860717773 1.1426626443862915 0.49615269899368286 -3.219001293182373 1.1710518598556519 0.5389646291732788 1.0 -0.0007753372192382812 -1.4695985317230225 1.0 -1.1083173751831055 -1.2060246467590332 -2.6620168685913086 -2.8539316654205322 -0.31812405586242676 -7.627556800842285 -0.3366210460662842 0.46818727254867554 -7.627556800842285 -1.6765906810760498 -1.0338537693023682 -7.627556800842285 -3.504409074783325 -1.924318552017212 -7.627556800842285 -8.175037384033203 0.9060223698616028 1.0 -11.907167434692383 0.538964569568634 1.0 -11.907167434692383 -1.4695987701416016 1.0 -8.368436813354492 -1.1025409698486328 1.0 -10.952733993530273 -2.7331957817077637 -3.6568822860717773 -11.907167434692383 -3.271655559539795 1.0 -11.907167434692383 -1.4695987701416016 1.0 -10.952733993530273 -1.2060246467590332 -3.6568822860717773 -8.280708312988281 3.951408863067627 1.0 -11.907167434692383 3.584351062774658 1.0 -11.907167434692383 2.3403286933898926 1.0 -8.001588821411133 2.7073864936828613 1.0 -2.4503815174102783 2.11719012260437 -7.627556800842285 -0.34972822666168213 2.745584011077881 -7.627556800842285 -0.12335425615310669 1.8152809143066406 -7.627556800842285 -2.2705564498901367 1.1223787069320679 -7.627556800842285 -0.4473590552806854 3.076996088027954 -2.6620168685913086 0.29439783096313477 3.584351062774658 1.0 1.2335214614868164 2.3403286933898926 1.0 0.17175579071044922 2.0227370262145996 -3.6568820476531982 -10.952733993530273 0.49615269899368286 -3.6568822860717773 -11.907167434692383 0.538964569568634 1.0 -11.907167434692383 2.3403286933898926 1.0 -10.952733993530273 2.0227370262145996 -3.6568822860717773 -0.18895816802978516 4.80814266204834 -3.1067914962768555 1.6715583801269531 5.627098083496094 1.0 0.29439783096313477 3.584351062774658 1.0 -0.4473590552806854 3.076996088027954 -2.6620168685913086 -3.575866460800171 3.750720739364624 -7.627556800842285 -1.7665454149246216 4.273188591003418 -7.627556800842285 -0.34972822666168213 2.745584011077881 -7.627556800842285 -2.4503815174102783 2.11719012260437 -7.627556800842285 -7.871398448944092 5.9941558837890625 1.0 -11.907167434692383 5.627098083496094 1.0 -10.952733993530273 2.0227370262145996 -3.6568822860717773 -11.907167434692383 2.3403286933898926 1.0 -11.907167434692383 3.584351062774658 1.0 -10.952733993530273 3.076996088027954 -3.6568822860717773 -8.468984603881836 7.673223495483398 1.0 -11.907167434692383 7.3061652183532715 1.0 -3.6502206325531006 7.524209022521973 -7.627556800842285 -1.8601460456848145 5.5288262367248535 -7.627556800842285 -1.7665454149246216 4.273188591003418 -7.627556800842285 -3.575866460800171 3.750720739364624 -7.627556800842285 -1.369227409362793 6.231085300445557 -3.6568820476531982 -0.3390772342681885 7.3061652183532715 1.0 1.6715583801269531 5.627098083496094 1.0 -0.18895816802978516 4.80814266204834 -3.1067914962768555 -10.952733993530273 3.076996088027954 -3.6568822860717773 -11.907167434692383 3.584351062774658 1.0 -11.907167434692383 5.627098083496094 1.0 -10.952733993530273 4.80814266204834 -3.6568822860717773 -10.952733993530273 -3.981025218963623 -3.6568822860717773 -11.907167434692383 -4.7440900802612305 1.0 -1.1083173751831055 -1.2060246467590332 -2.6620168685913086 -0.0007753372192382812 -1.4695985317230225 1.0 1.6010956764221191 -3.271655559539795 1.0 0.04240846633911133 -2.7331957817077637 -3.6568820476531982 -3.504409074783325 -1.924318552017212 -7.627556800842285 -1.6765906810760498 -1.0338537693023682 -7.627556800842285 -1.0354890823364258 -2.3814656734466553 -7.627556800842285 -2.995133638381958 -3.365375518798828 -7.627556800842285 -8.368436813354492 -1.1025409698486328 1.0 -11.907167434692383 -1.4695987701416016 1.0 -11.907167434692383 -3.271655559539795 1.0 -7.892340660095215 -2.904597759246826 1.0 -1.529050350189209 -1.2004090547561646 -6.5490498542785645 -1.1083173751831055 -1.2060246467590332 -2.6620168685913086 0.04240846633911133 -2.7331957817077637 -3.6568820476531982 -0.7038373947143555 -2.7217235565185547 -6.549050331115723 -10.95408821105957 -3.9647674560546875 -6.5490498542785645 -10.952733993530273 -3.981025218963623 -3.6568822860717773 -10.952733993530273 -2.7331957817077637 -3.6568822860717773 -10.95408821105957 -2.7217235565185547 -6.549050331115723 -10.95408821105957 3.0661866664886475 -6.549050331115723 -10.952733993530273 3.076996088027954 -3.6568822860717773 -10.952733993530273 4.80814266204834 -3.6568822860717773 -10.95408821105957 4.790694236755371 -6.5490498542785645 -1.7489194869995117 6.208179950714111 -6.5490498542785645 -1.369227409362793 6.231085300445557 -3.6568820476531982 -0.18895816802978516 4.80814266204834 -3.1067914962768555 -1.3862910270690918 4.790694236755371 -6.549050331115723 -10.95408821105957 2.015970468521118 -6.549050331115723 -10.952733993530273 2.0227370262145996 -3.6568822860717773 -10.952733993530273 3.076996088027954 -3.6568822860717773 -10.95408821105957 3.0661866664886475 -6.549050331115723 -1.3862910270690918 4.790694236755371 -6.549050331115723 -0.18895816802978516 4.80814266204834 -3.1067914962768555 -0.4473590552806854 3.076996088027954 -2.6620168685913086 -0.23274469375610352 3.0661866664886475 -6.5490498542785645 -10.95408821105957 0.49524056911468506 -6.549050331115723 -10.952733993530273 0.49615269899368286 -3.6568822860717773 -10.952733993530273 2.0227370262145996 -3.6568822860717773 -10.95408821105957 2.015970468521118 -6.549050331115723 -0.23274469375610352 3.0661866664886475 -6.5490498542785645 -0.4473590552806854 3.076996088027954 -2.6620168685913086 0.17175579071044922 2.0227370262145996 -3.6568820476531982 0.1095418930053711 2.015970468521118 -6.549050331115723 -10.95408821105957 -2.7217235565185547 -6.549050331115723 -10.952733993530273 -2.7331957817077637 -3.6568822860717773 -10.952733993530273 -1.2060246467590332 -3.6568822860717773 -10.95408821105957 -1.200408935546875 -6.5490498542785645 -0.14408183097839355 0.4952404797077179 -6.549050331115723 1.1426626443862915 0.49615269899368286 -3.219001293182373 -1.1083173751831055 -1.2060246467590332 -2.6620168685913086 -1.529050350189209 -1.2004090547561646 -6.5490498542785645 -10.95408821105957 -6.127697467803955 -6.5490498542785645 -10.952733993530273 -6.152281761169434 -3.6568822860717773 -10.952733993530273 -3.981025218963623 -3.6568822860717773 -10.95408821105957 -3.9647674560546875 -6.5490498542785645 -0.7038373947143555 -2.7217235565185547 -6.549050331115723 0.04240846633911133 -2.7331957817077637 -3.6568820476531982 -0.4009065628051758 -3.981025218963623 -2.7013604640960693 -0.13940906524658203 -3.9647674560546875 -6.5490498542785645 -7.712930202484131 -5.760639190673828 -6.5490498542785645 -7.543210029602051 -5.785223960876465 -3.6568822860717773 -10.952733993530273 -6.152281761169434 -3.6568822860717773 -10.95408821105957 -6.127697467803955 -6.5490498542785645 -0.13940906524658203 -3.9647674560546875 -6.5490498542785645 -0.4009065628051758 -3.981025218963623 -2.7013604640960693 0.5189304351806641 -6.152281761169434 -3.6568820476531982 -0.04890632629394531 -6.127697467803955 -6.5490498542785645 -3.641728401184082 7.838098526000977 -6.5490498542785645 -3.339831829071045 7.861003875732422 -3.6568820476531982 -1.369227409362793 6.231085300445557 -3.6568820476531982 -1.7489194869995117 6.208179950714111 -6.5490498542785645 -10.95408821105957 4.790694236755371 -6.5490498542785645 -10.952733993530273 4.80814266204834 -3.6568822860717773 -10.952733993530273 6.231085300445557 -3.6568822860717773 -10.95408821105957 6.208179950714111 -6.5490498542785645 -10.565694808959961 4.525838375091553 -7.627556800842285 -10.95408821105957 4.790694236755371 -6.5490498542785645 -10.95408821105957 6.208179950714111 -6.5490498542785645 -10.565694808959961 6.117129325866699 -7.627556800842285 -3.6502206325531006 7.524209022521973 -7.627556800842285 -3.641728401184082 7.838098526000977 -6.5490498542785645 -1.7489194869995117 6.208179950714111 -6.5490498542785645 -1.8601460456848145 5.5288262367248535 -7.627556800842285 -0.2538749575614929 -3.482579469680786 -7.627556800842285 -0.13940906524658203 -3.9647674560546875 -6.5490498542785645 -0.04890632629394531 -6.127697467803955 -6.5490498542785645 -0.40488201379776 -5.398547172546387 -7.627556800842285 -7.545772552490234 -6.3721394538879395 -7.627556800842285 -7.712930202484131 -5.760639190673828 -6.5490498542785645 -10.95408821105957 -6.127697467803955 -6.5490498542785645 -10.565694808959961 -6.303335189819336 -7.627556800842285 -1.0354890823364258 -2.3814656734466553 -7.627556800842285 -0.7038373947143555 -2.7217235565185547 -6.549050331115723 -0.13940906524658203 -3.9647674560546875 -6.5490498542785645 -0.2538749575614929 -3.482579469680786 -7.627556800842285 -10.565694808959961 -6.303335189819336 -7.627556800842285 -10.95408821105957 -6.127697467803955 -6.5490498542785645 -10.95408821105957 -3.9647674560546875 -6.5490498542785645 -10.565694808959961 -4.7440900802612305 -7.627556800842285 -0.3366210460662842 0.46818727254867554 -7.627556800842285 -0.14408183097839355 0.4952404797077179 -6.549050331115723 -1.529050350189209 -1.2004090547561646 -6.5490498542785645 -1.6765906810760498 -1.0338537693023682 -7.627556800842285 -10.565694808959961 -3.271655559539795 -7.627556800842285 -10.95408821105957 -2.7217235565185547 -6.549050331115723 -10.95408821105957 -1.200408935546875 -6.5490498542785645 -10.565694808959961 -1.4695985317230225 -7.627556800842285 -0.34972822666168213 2.745584011077881 -7.627556800842285 -0.23274469375610352 3.0661866664886475 -6.5490498542785645 0.1095418930053711 2.015970468521118 -6.549050331115723 -0.12335425615310669 1.8152809143066406 -7.627556800842285 -10.565694808959961 0.5389646291732788 -7.627556800842285 -10.95408821105957 0.49524056911468506 -6.549050331115723 -10.95408821105957 2.015970468521118 -6.549050331115723 -10.565694808959961 2.3403286933898926 -7.627556800842285 -1.7665454149246216 4.273188591003418 -7.627556800842285 -1.3862910270690918 4.790694236755371 -6.549050331115723 -0.23274469375610352 3.0661866664886475 -6.5490498542785645 -0.34972822666168213 2.745584011077881 -7.627556800842285 -10.565694808959961 2.3403286933898926 -7.627556800842285 -10.95408821105957 2.015970468521118 -6.549050331115723 -10.95408821105957 3.0661866664886475 -6.549050331115723 -10.565694808959961 3.584351062774658 -7.627556800842285 -1.8601460456848145 5.5288262367248535 -7.627556800842285 -1.7489194869995117 6.208179950714111 -6.5490498542785645 -1.3862910270690918 4.790694236755371 -6.549050331115723 -1.7665454149246216 4.273188591003418 -7.627556800842285 -10.565694808959961 3.584351062774658 -7.627556800842285 -10.95408821105957 3.0661866664886475 -6.549050331115723 -10.95408821105957 4.790694236755371 -6.5490498542785645 -10.565694808959961 4.525838375091553 -7.627556800842285 -10.565694808959961 -4.7440900802612305 -7.627556800842285 -10.95408821105957 -3.9647674560546875 -6.5490498542785645 -10.95408821105957 -2.7217235565185547 -6.549050331115723 -10.565694808959961 -3.271655559539795 -7.627556800842285 -1.6765906810760498 -1.0338537693023682 -7.627556800842285 -1.529050350189209 -1.2004090547561646 -6.5490498542785645 -0.7038373947143555 -2.7217235565185547 -6.549050331115723 -1.0354890823364258 -2.3814656734466553 -7.627556800842285 -0.40488201379776 -5.398547172546387 -7.627556800842285 -0.04890632629394531 -6.127697467803955 -6.5490498542785645 -2.2912797927856445 -6.928562164306641 -6.5490498542785645 -2.494194984436035 -6.591665267944336 -7.627556800842285 -7.97829532623291 7.144975662231445 -7.627556800842285 -8.218195915222168 6.575238227844238 -6.5490498542785645 -3.641728401184082 7.838098526000977 -6.5490498542785645 -3.6502206325531006 7.524209022521973 -7.627556800842285 -8.218195915222168 6.575238227844238 -6.5490498542785645 -8.104394912719727 6.598143577575684 -3.6568822860717773 -3.339831829071045 7.861003875732422 -3.6568820476531982 -3.641728401184082 7.838098526000977 -6.5490498542785645 -0.04890632629394531 -6.127697467803955 -6.5490498542785645 0.5189304351806641 -6.152281761169434 -3.6568820476531982 -1.839925765991211 -6.953146934509277 -3.6568820476531982 -2.2912797927856445 -6.928562164306641 -6.5490498542785645 -0.0007753372192382812 -1.4695985317230225 1.0 -2.4490222930908203 -2.270463466644287 1.0 -1.1765353679656982 -4.0725202560424805 1.0 1.6010956764221191 -3.271655559539795 1.0 -7.923740863800049 -0.9730319380760193 -7.627556800842285 -3.504409074783325 -1.924318552017212 -7.627556800842285 -2.995133638381958 -3.365375518798828 -7.627556800842285 -7.733197212219238 -2.640022039413452 -7.627556800842285 -7.97829532623291 7.144975662231445 -7.627556800842285 -3.6502206325531006 7.524209022521973 -7.627556800842285 -3.575866460800171 3.750720739364624 -7.627556800842285 -7.950476169586182 5.591756820678711 -7.627556800842285 -0.3390772342681885 7.3061652183532715 1.0 -2.7177608013153076 8.936083793640137 1.0 -1.1205613613128662 4.82623291015625 1.0 1.6715583801269531 5.627098083496094 1.0 -2.2145440578460693 2.7834861278533936 1.0 0.29439783096313477 3.584351062774658 1.0 -7.950476169586182 5.591756820678711 -7.627556800842285 -3.575866460800171 3.750720739364624 -7.627556800842285 -2.4503815174102783 2.11719012260437 -7.627556800842285 -7.5293803215026855 3.7021164894104004 -7.627556800842285 -7.5293803215026855 3.7021164894104004 -7.627556800842285 -2.4503815174102783 2.11719012260437 -7.627556800842285 -2.2705564498901367 1.1223787069320679 -7.627556800842285 -7.462099075317383 2.551335573196411 -7.627556800842285 -1.46852707862854 1.539463758468628 1.0 1.2335214614868164 2.3403286933898926 1.0 1.1710518598556519 0.5389646291732788 1.0 -1.9321130514144897 -0.26190027594566345 1.0 -2.4490222930908203 -2.270463466644287 1.0 -0.0007753372192382812 -1.4695985317230225 1.0 -7.6803669929504395 0.884986400604248 -7.627556800842285 -2.8539316654205322 -0.31812405586242676 -7.627556800842285 -3.504409074783325 -1.924318552017212 -7.627556800842285 -7.923740863800049 -0.9730319380760193 -7.627556800842285 -7.733197212219238 -2.640022039413452 -7.627556800842285 -2.995133638381958 -3.365375518798828 -7.627556800842285 -2.3742382526397705 -4.542841911315918 -7.627556800842285 -7.50089168548584 -4.0020952224731445 -7.627556800842285 1.6010956764221191 -3.271655559539795 1.0 -1.1765353679656982 -4.0725202560424805 1.0 -2.199410915374756 -5.544955253601074 1.0 0.3134479522705078 -4.7440900802612305 1.0 -0.8386678695678711 -8.107029914855957 1.0 2.0264201164245605 -7.3061652183532715 1.0 -7.50089168548584 -4.0020952224731445 -7.627556800842285 -2.3742382526397705 -4.542841911315918 -7.627556800842285 -2.494194984436035 -6.591665267944336 -7.627556800842285 -7.545772552490234 -6.3721394538879395 -7.627556800842285 0.5189304351806641 -6.152281761169434 -3.6568820476531982 2.0264201164245605 -7.3061652183532715 1.0 -0.8386678695678711 -8.107029914855957 1.0 -1.839925765991211 -6.953146934509277 -3.6568820476531982 -8.104394912719727 6.598143577575684 -3.6568822860717773 -8.468984603881836 7.673223495483398 1.0 -2.7177608013153076 8.936083793640137 1.0 -3.339831829071045 7.861003875732422 -3.6568820476531982 -10.952733993530273 6.231085300445557 -3.6568822860717773 -11.907167434692383 7.3061652183532715 1.0 -8.468984603881836 7.673223495483398 1.0 -8.104394912719727 6.598143577575684 -3.6568822860717773 -10.565694808959961 -4.7440900802612305 -7.627556800842285 -7.50089168548584 -4.0020952224731445 -7.627556800842285 -7.545772552490234 -6.3721394538879395 -7.627556800842285 -10.565694808959961 -6.303335189819336 -7.627556800842285 -10.565694808959961 -3.271655559539795 -7.627556800842285 -7.733197212219238 -2.640022039413452 -7.627556800842285 -7.50089168548584 -4.0020952224731445 -7.627556800842285 -10.565694808959961 -4.7440900802612305 -7.627556800842285 -10.565694808959961 0.5389646291732788 -7.627556800842285 -7.6803669929504395 0.884986400604248 -7.627556800842285 -7.923740863800049 -0.9730319380760193 -7.627556800842285 -10.565694808959961 -1.4695985317230225 -7.627556800842285 -10.565694808959961 3.584351062774658 -7.627556800842285 -7.5293803215026855 3.7021164894104004 -7.627556800842285 -7.462099075317383 2.551335573196411 -7.627556800842285 -10.565694808959961 2.3403286933898926 -7.627556800842285 -10.565694808959961 4.525838375091553 -7.627556800842285 -7.950476169586182 5.591756820678711 -7.627556800842285 -7.5293803215026855 3.7021164894104004 -7.627556800842285 -10.565694808959961 3.584351062774658 -7.627556800842285 -10.565694808959961 6.117129325866699 -7.627556800842285 -7.97829532623291 7.144975662231445 -7.627556800842285 -10.565694808959961 4.525838375091553 -7.627556800842285 -10.565694808959961 -1.4695985317230225 -7.627556800842285 -7.923740863800049 -0.9730319380760193 -7.627556800842285 -7.733197212219238 -2.640022039413452 -7.627556800842285 -10.565694808959961 -3.271655559539795 -7.627556800842285 -10.95408821105957 6.208179950714111 -6.5490498542785645 -10.952733993530273 6.231085300445557 -3.6568822860717773 -8.104394912719727 6.598143577575684 -3.6568822860717773 -8.218195915222168 6.575238227844238 -6.5490498542785645 -10.565694808959961 6.117129325866699 -7.627556800842285 -10.95408821105957 6.208179950714111 -6.5490498542785645 -8.218195915222168 6.575238227844238 -6.5490498542785645 -7.97829532623291 7.144975662231445 -7.627556800842285 -2.494194984436035 -6.591665267944336 -7.627556800842285 -2.2912797927856445 -6.928562164306641 -6.5490498542785645 -7.712930202484131 -5.760639190673828 -6.5490498542785645 -7.545772552490234 -6.3721394538879395 -7.627556800842285 -2.2912797927856445 -6.928562164306641 -6.5490498542785645 -1.839925765991211 -6.953146934509277 -3.6568820476531982 -7.543210029602051 -5.785223960876465 -3.6568822860717773 -7.712930202484131 -5.760639190673828 -6.5490498542785645 -2.4490222930908203 -2.270463466644287 1.0 -1.9321130514144897 -0.26190027594566345 1.0 -8.175037384033203 0.9060223698616028 1.0 -8.368436813354492 -1.1025409698486328 1.0 -2.4490222930908203 -2.270463466644287 1.0 -8.275046348571777 -4.377032279968262 1.0 -2.199410915374756 -5.544955253601074 1.0 -1.839925765991211 -6.953146934509277 -3.6568820476531982 -0.8386678695678711 -8.107029914855957 1.0 -7.765928745269775 -6.9391069412231445 1.0 -7.543210029602051 -5.785223960876465 -3.6568822860717773 -1.46852707862854 1.539463758468628 1.0 -8.001588821411133 2.7073864936828613 1.0 -8.175037384033203 0.9060223698616028 1.0 -1.9321130514144897 -0.26190027594566345 1.0 -10.565694808959961 2.3403286933898926 -7.627556800842285 -7.462099075317383 2.551335573196411 -7.627556800842285 -7.6803669929504395 0.884986400604248 -7.627556800842285 -10.565694808959961 0.5389646291732788 -7.627556800842285 -7.462099075317383 2.551335573196411 -7.627556800842285 -2.2705564498901367 1.1223787069320679 -7.627556800842285 -2.8539316654205322 -0.31812405586242676 -7.627556800842285 -7.6803669929504395 0.884986400604248 -7.627556800842285 -1.9321130514144897 -0.26190027594566345 1.0 1.1710518598556519 0.5389646291732788 1.0 -10.565694808959961 -1.4695985317230225 -7.627556800842285 -10.95408821105957 -1.200408935546875 -6.5490498542785645 -10.95408821105957 0.49524056911468506 -6.549050331115723 -10.565694808959961 0.5389646291732788 -7.627556800842285 -0.12335425615310669 1.8152809143066406 -7.627556800842285 0.1095418930053711 2.015970468521118 -6.549050331115723 -0.14408183097839355 0.4952404797077179 -6.549050331115723 -0.3366210460662842 0.46818727254867554 -7.627556800842285 0.1095418930053711 2.015970468521118 -6.549050331115723 0.17175579071044922 2.0227370262145996 -3.6568820476531982 1.1426626443862915 0.49615269899368286 -3.219001293182373 -0.14408183097839355 0.4952404797077179 -6.549050331115723 -10.95408821105957 -1.200408935546875 -6.5490498542785645 -10.952733993530273 -1.2060246467590332 -3.6568822860717773 -10.952733993530273 0.49615269899368286 -3.6568822860717773 -10.95408821105957 0.49524056911468506 -6.549050331115723 -10.952733993530273 -1.2060246467590332 -3.6568822860717773 -11.907167434692383 -1.4695987701416016 1.0 -11.907167434692383 0.538964569568634 1.0 -10.952733993530273 0.49615269899368286 -3.6568822860717773 -2.2705564498901367 1.1223787069320679 -7.627556800842285 -0.12335425615310669 1.8152809143066406 -7.627556800842285 -0.3366210460662842 0.46818727254867554 -7.627556800842285 -2.8539316654205322 -0.31812405586242676 -7.627556800842285 0.17175579071044922 2.0227370262145996 -3.6568820476531982 1.2335214614868164 2.3403286933898926 1.0 1.1710518598556519 0.5389646291732788 1.0 1.1426626443862915 0.49615269899368286 -3.219001293182373</float_array>
				<technique_common>
				<accessor source="#id-mesh-4-positions-array" count="414" stride="3">
					<param name="X" type="float"/>
					<param name="Y" type="float"/>
					<param name="Z" type="float"/>
				</accessor>
				</technique_common>
			</source>
			<source id="id-mesh-4-normals">
				<float_array id="id-mesh-4-normals-array" count="1242"> -0.9796368479728699 0.0 -0.20077772438526154 -0.9796368479728699 0.0 -0.20077772438526154 -0.9796368479728699 0.0 -0.20077772438526154 -0.9796368479728699 0.0 -0.20077772438526154 0.5758433938026428 0.7682926654815674 -0.27951890230178833 0.5758433938026428 0.7682926654815674 -0.27951890230178833 0.5758433938026428 0.7682926654815674 -0.27951890230178833 0.5758433938026428 0.7682926654815674 -0.27951890230178833 0.8583655953407288 0.5003434419631958 -0.11342364549636841 0.8583655953407288 0.5003434419631958 -0.11342364549636841 0.8583655953407288 0.5003434419631958 -0.11342364549636841 0.8583655953407288 0.5003434419631958 -0.11342364549636841 0.09421447664499283 -0.9690444469451904 -0.22820238769054413 0.09421447664499283 -0.9690444469451904 -0.22820238769054413 0.09421447664499283 -0.9690444469451904 -0.22820238769054413 0.09421447664499283 -0.9690444469451904 -0.22820238769054413 0.0 0.0 -1.0 0.0 0.0 -1.0 0.0 0.0 -1.0 0.0 0.0 -1.0 0.0 0.0 1.0 0.0 0.0 1.0 0.0 0.0 1.0 0.0 0.0 1.0 0.0 0.0 1.0 0.0 0.0 1.0 -3.136159705263708e-07 0.0 -0.9999999403953552 -3.136159705263708e-07 0.0 -0.9999999403953552 -3.136159705263708e-07 0.0 -0.9999999403953552 -3.136159705263708e-07 0.0 -0.9999999403953552 0.7551873922348022 -0.584661602973938 -0.2964167892932892 0.7551873922348022 -0.584661602973938 -0.2964167892932892 0.7551873922348022 -0.584661602973938 -0.2964167892932892 0.7551873922348022 -0.584661602973938 -0.2964167892932892 -0.9796367883682251 0.0 -0.20077767968177795 -0.9796367883682251 0.0 -0.20077767968177795 -0.9796367883682251 0.0 -0.20077767968177795 -0.9796367883682251 0.0 -0.20077767968177795 0.7202096581459045 -0.6827777624130249 -0.12293336540460587 0.7202096581459045 -0.6827777624130249 -0.12293336540460587 0.7202096581459045 -0.6827777624130249 -0.12293336540460587 0.7202096581459045 -0.6827777624130249 -0.12293336540460587 -1.8758068165425357e-07 0.0 -1.0 -1.8758068165425357e-07 0.0 -1.0 -1.8758068165425357e-07 0.0 -1.0 -1.8758068165425357e-07 0.0 -1.0 0.0 0.0 1.0 0.0 0.0 1.0 0.0 0.0 1.0 0.0 0.0 1.0 -0.9796368479728699 0.0 -0.20077769458293915 -0.9796368479728699 0.0 -0.20077769458293915 -0.9796368479728699 0.0 -0.20077769458293915 -0.9796368479728699 0.0 -0.20077769458293915 0.0 0.0 1.0 0.0 0.0 1.0 0.0 0.0 1.0 0.0 0.0 1.0 -2.1887537116072053e-07 0.0 -1.0 -2.1887537116072053e-07 0.0 -1.0 -2.1887537116072053e-07 0.0 -1.0 -2.1887537116072053e-07 0.0 -1.0 0.7584335207939148 0.6116510033607483 -0.2250816375017166 0.7584335207939148 0.6116510033607483 -0.2250816375017166 0.7584335207939148 0.6116510033607483 -0.2250816375017166 0.7584335207939148 0.6116510033607483 -0.2250816375017166 -0.9796369075775146 0.0 -0.20077767968177795 -0.9796369075775146 0.0 -0.20077767968177795 -0.9796369075775146 0.0 -0.20077767968177795 -0.9796369075775146 0.0 -0.20077767968177795 0.8837742209434509 -0.4096638858318329 -0.22609396278858185 0.8837742209434509 -0.4096638858318329 -0.22609396278858185 0.8837742209434509 -0.4096638858318329 -0.22609396278858185 0.8837742209434509 -0.4096638858318329 -0.22609396278858185 -2.495582407391339e-07 0.0 -0.9999999403953552 -2.495582407391339e-07 0.0 -0.9999999403953552 -2.495582407391339e-07 0.0 -0.9999999403953552 -2.495582407391339e-07 0.0 -0.9999999403953552 0.0 0.0 1.0 0.0 0.0 1.0 -0.9796368479728699 0.0 -0.20077776908874512 -0.9796368479728699 0.0 -0.20077776908874512 -0.9796368479728699 0.0 -0.20077776908874512 -0.9796368479728699 0.0 -0.20077776908874512 0.0 0.0 1.0 0.0 0.0 1.0 -2.136554968501514e-07 0.0 -1.0 -2.136554968501514e-07 0.0 -1.0 -2.136554968501514e-07 0.0 -1.0 -2.136554968501514e-07 0.0 -1.0 0.6810746788978577 0.6363651156425476 -0.36218348145484924 0.6810746788978577 0.6363651156425476 -0.36218348145484924 0.6810746788978577 0.6363651156425476 -0.36218348145484924 0.6810746788978577 0.6363651156425476 -0.36218348145484924 -0.9796368479728699 0.0 -0.20077769458293915 -0.9796368479728699 0.0 -0.20077769458293915 -0.9796368479728699 0.0 -0.20077769458293915 -0.9796368479728699 0.0 -0.20077769458293915 -0.9796368479728699 0.0 -0.20077769458293915 -0.9796368479728699 0.0 -0.20077769458293915 0.7334493398666382 0.6577112674713135 -0.1716618686914444 0.7334493398666382 0.6577112674713135 -0.1716618686914444 0.7334493398666382 0.6577112674713135 -0.1716618686914444 0.7334493398666382 0.6577112674713135 -0.1716618686914444 2.99939614478717e-07 0.0 -1.0 2.99939614478717e-07 0.0 -1.0 2.99939614478717e-07 0.0 -1.0 2.99939614478717e-07 0.0 -1.0 0.0 0.0 0.9999999403953552 0.0 0.0 0.9999999403953552 0.0 0.0 0.9999999403953552 0.0 0.0 0.9999999403953552 0.8099578619003296 0.5700236558914185 -0.13799017667770386 0.8099578619003296 0.5700236558914185 -0.13799017667770386 0.8099578619003296 0.5700236558914185 -0.13799017667770386 0.8099578619003296 0.5700236558914185 -0.13799017667770386 -0.9999998211860657 0.0 0.0004682360449805856 -0.9999998211860657 0.0 0.0004682360449805856 -0.9999998211860657 0.0 0.0004682360449805856 -0.9999998211860657 0.0 0.0004682360449805856 -0.9999999403953552 0.0 0.00046823613229207695 -0.9999999403953552 0.0 0.00046823613229207695 -0.9999999403953552 0.0 0.00046823613229207695 -0.9999999403953552 0.0 0.00046823613229207695 0.8743856549263 0.43226754665374756 -0.22044171392917633 0.8743856549263 0.43226754665374756 -0.22044171392917633 0.8743856549263 0.43226754665374756 -0.22044171392917633 0.8743856549263 0.43226754665374756 -0.22044171392917633 -0.9999999403953552 0.0 0.00046823607408441603 -0.9999999403953552 0.0 0.00046823607408441603 -0.9999999403953552 0.0 0.00046823607408441603 -0.9999999403953552 0.0 0.00046823607408441603 0.9637560844421387 0.2329017072916031 -0.13011926412582397 0.9637560844421387 0.2329017072916031 -0.13011926412582397 0.9637560844421387 0.2329017072916031 -0.13011926412582397 0.9637560844421387 0.2329017072916031 -0.13011926412582397 -0.9999998807907104 0.0 0.00046823619049973786 -0.9999998807907104 0.0 0.00046823619049973786 -0.9999998807907104 0.0 0.00046823619049973786 -0.9999998807907104 0.0 0.00046823619049973786 0.9128533601760864 0.4078234136104584 0.019464127719402313 0.9128533601760864 0.4078234136104584 0.019464127719402313 0.9128533601760864 0.4078234136104584 0.019464127719402313 0.9128533601760864 0.4078234136104584 0.019464127719402313 -0.9999998807907104 0.0 0.0004682360449805856 -0.9999998807907104 0.0 0.0004682360449805856 -0.9999998807907104 0.0 0.0004682360449805856 -0.9999998807907104 0.0 0.0004682360449805856 0.6613738536834717 -0.7334513664245605 -0.15695132315158844 0.6613738536834717 -0.7334513664245605 -0.15695132315158844 0.6613738536834717 -0.7334513664245605 -0.15695132315158844 0.6613738536834717 -0.7334513664245605 -0.15695132315158844 -0.9999998807907104 0.0 0.0004682361613959074 -0.9999998807907104 0.0 0.0004682361613959074 -0.9999998807907104 0.0 0.0004682361613959074 -0.9999998807907104 0.0 0.0004682361613959074 0.9972096681594849 0.021007115021348 -0.07163551449775696 0.9972096681594849 0.021007115021348 -0.07163551449775696 0.9972096681594849 0.021007115021348 -0.07163551449775696 0.9972096681594849 0.021007115021348 -0.07163551449775696 0.10970819741487503 -0.9938951134681702 -0.011693296954035759 0.10970819741487503 -0.9938951134681702 -0.011693296954035759 0.10970819741487503 -0.9938951134681702 -0.011693296954035759 0.10970819741487503 -0.9938951134681702 -0.011693296954035759 0.9708788990974426 0.23573467135429382 -0.042699795216321945 0.9708788990974426 0.23573467135429382 -0.042699795216321945 0.9708788990974426 0.23573467135429382 -0.042699795216321945 0.9708788990974426 0.23573467135429382 -0.042699795216321945 0.6427210569381714 0.7617241740226746 -0.08176679164171219 0.6427210569381714 0.7617241740226746 -0.08176679164171219 0.6427210569381714 0.7617241740226746 -0.08176679164171219 0.6427210569381714 0.7617241740226746 -0.08176679164171219 -0.9999998807907104 0.0 0.00046823598677292466 -0.9999998807907104 0.0 0.00046823598677292466 -0.9999998807907104 0.0 0.00046823598677292466 -0.9999998807907104 0.0 0.00046823598677292466 -0.9408509731292725 0.0 -0.3388206660747528 -0.9408509731292725 0.0 -0.3388206660747528 -0.9408509731292725 0.0 -0.3388206660747528 -0.9408509731292725 0.0 -0.3388206660747528 0.6585435271263123 0.6690037846565247 -0.3446073532104492 0.6585435271263123 0.6690037846565247 -0.3446073532104492 0.6585435271263123 0.6690037846565247 -0.3446073532104492 0.6585435271263123 0.6690037846565247 -0.3446073532104492 0.9752083420753479 -0.01446574553847313 -0.22081521153450012 0.9752083420753479 -0.01446574553847313 -0.22081521153450012 0.9752083420753479 -0.01446574553847313 -0.22081521153450012 0.9752083420753479 -0.01446574553847313 -0.22081521153450012 0.04452676698565483 -0.9347260594367981 0.35256847739219666 0.04452676698565483 -0.9347260594367981 0.35256847739219666 0.04452676698565483 -0.9347260594367981 0.35256847739219666 0.04452676698565483 -0.9347260594367981 0.35256847739219666 0.8671538829803467 0.4979293942451477 0.010509002953767776 0.8671538829803467 0.4979293942451477 0.010509002953767776 0.8671538829803467 0.4979293942451477 0.010509002953767776 0.8671538829803467 0.4979293942451477 0.010509002953767776 -0.9408510327339172 0.0 -0.3388203978538513 -0.9408510327339172 0.0 -0.3388203978538513 -0.9408510327339172 0.0 -0.3388203978538513 -0.9408510327339172 0.0 -0.3388203978538513 0.7513390183448792 -0.6402598023414612 -0.15986578166484833 0.7513390183448792 -0.6402598023414612 -0.15986578166484833 0.7513390183448792 -0.6402598023414612 -0.15986578166484833 0.7513390183448792 -0.6402598023414612 -0.15986578166484833 -0.9408510327339172 -5.006672267882095e-07 -0.33882060647010803 -0.9408510327339172 -5.006672267882095e-07 -0.33882060647010803 -0.9408510327339172 -5.006672267882095e-07 -0.33882060647010803 -0.9408510327339172 -5.006672267882095e-07 -0.33882060647010803 0.9382006525993347 0.26938289403915405 -0.21728411316871643 0.9382006525993347 0.26938289403915405 -0.21728411316871643 0.9382006525993347 0.26938289403915405 -0.21728411316871643 0.9382006525993347 0.26938289403915405 -0.21728411316871643 -0.9408509135246277 0.0 -0.33882060647010803 -0.9408509135246277 0.0 -0.33882060647010803 -0.9408509135246277 0.0 -0.33882060647010803 -0.9408509135246277 0.0 -0.33882060647010803 0.7228718400001526 0.5713346004486084 -0.3886297643184662 0.7228718400001526 0.5713346004486084 -0.3886297643184662 0.7228718400001526 0.5713346004486084 -0.3886297643184662 0.7228718400001526 0.5713346004486084 -0.3886297643184662 -0.9408509731292725 0.0 -0.3388206362724304 -0.9408509731292725 0.0 -0.3388206362724304 -0.9408509731292725 0.0 -0.3388206362724304 -0.9408509731292725 0.0 -0.3388206362724304 0.9394041895866394 0.16033059358596802 -0.30300790071487427 0.9394041895866394 0.16033059358596802 -0.30300790071487427 0.9394041895866394 0.16033059358596802 -0.30300790071487427 0.9394041895866394 0.16033059358596802 -0.30300790071487427 -0.9408509731292725 -6.241211849555839e-07 -0.3388207256793976 -0.9408509731292725 -6.241211849555839e-07 -0.3388207256793976 -0.9408509731292725 -6.241211849555839e-07 -0.3388207256793976 -0.9408509731292725 -6.241211849555839e-07 -0.3388207256793976 -0.9408509731292725 6.12747726336238e-07 -0.33882060647010803 -0.9408509731292725 6.12747726336238e-07 -0.33882060647010803 -0.9408509731292725 6.12747726336238e-07 -0.33882060647010803 -0.9408509731292725 6.12747726336238e-07 -0.33882060647010803 0.8867828845977783 0.45323696732521057 -0.09051091223955154 0.8867828845977783 0.45323696732521057 -0.09051091223955154 0.8867828845977783 0.45323696732521057 -0.09051091223955154 0.8867828845977783 0.45323696732521057 -0.09051091223955154 0.36525970697402954 -0.7934820652008057 -0.48679736256599426 0.36525970697402954 -0.7934820652008057 -0.48679736256599426 0.36525970697402954 -0.7934820652008057 -0.48679736256599426 0.36525970697402954 -0.7934820652008057 -0.48679736256599426 -0.18050232529640198 0.97880619764328 0.09673307836055756 -0.18050232529640198 0.97880619764328 0.09673307836055756 -0.18050232529640198 0.97880619764328 0.09673307836055756 -0.18050232529640198 0.97880619764328 0.09673307836055756 -0.2610005736351013 0.9652746319770813 0.011112306267023087 -0.2610005736351013 0.9652746319770813 0.011112306267023087 -0.2610005736351013 0.9652746319770813 0.011112306267023087 -0.2610005736351013 0.9652746319770813 0.011112306267023087 0.3280462622642517 -0.9423664212226868 -0.06581171602010727 0.3280462622642517 -0.9423664212226868 -0.06581171602010727 0.3280462622642517 -0.9423664212226868 -0.06581171602010727 0.3280462622642517 -0.9423664212226868 -0.06581171602010727 0.0 0.0 0.9999999403953552 0.0 0.0 0.9999999403953552 0.0 0.0 0.9999999403953552 0.0 0.0 0.9999999403953552 -1.3979253310481e-07 0.0 -1.0 -1.3979253310481e-07 0.0 -1.0 -1.3979253310481e-07 0.0 -1.0 -1.3979253310481e-07 0.0 -1.0 8.255620542740871e-08 0.0 -1.0 8.255620542740871e-08 0.0 -1.0 8.255620542740871e-08 0.0 -1.0 8.255620542740871e-08 0.0 -1.0 0.0 0.0 1.0 0.0 0.0 1.0 0.0 0.0 1.0 0.0 0.0 1.0 0.0 0.0 1.0 0.0 0.0 1.0 0.0 0.0 -1.0 0.0 0.0 -1.0 0.0 0.0 -1.0 0.0 0.0 -1.0 -1.791640471537903e-07 0.0 -1.0 -1.791640471537903e-07 0.0 -1.0 -1.791640471537903e-07 0.0 -1.0 -1.791640471537903e-07 0.0 -1.0 0.0 0.0 1.0 0.0 0.0 1.0 4.8667224916698615e-08 0.0 1.0 4.8667224916698615e-08 0.0 1.0 4.8667224916698615e-08 0.0 1.0 4.8667224916698615e-08 0.0 1.0 1.1234561725359526e-07 0.0 -1.0 1.1234561725359526e-07 0.0 -1.0 1.1234561725359526e-07 0.0 -1.0 1.1234561725359526e-07 0.0 -1.0 7.956700187605747e-08 0.0 -1.0 7.956700187605747e-08 0.0 -1.0 7.956700187605747e-08 0.0 -1.0 7.956700187605747e-08 0.0 -1.0 0.0 0.0 1.0 0.0 0.0 1.0 0.0 0.0 1.0 0.0 0.0 1.0 0.0 0.0 1.0 0.0 0.0 1.0 -1.268702192191995e-07 0.0 -1.0 -1.268702192191995e-07 0.0 -1.0 -1.268702192191995e-07 0.0 -1.0 -1.268702192191995e-07 0.0 -1.0 0.27953091263771057 -0.9116730690002441 -0.3011886477470398 0.27953091263771057 -0.9116730690002441 -0.3011886477470398 0.27953091263771057 -0.9116730690002441 -0.3011886477470398 0.27953091263771057 -0.9116730690002441 -0.3011886477470398 -0.228181853890419 0.950030505657196 -0.2130141407251358 -0.228181853890419 0.950030505657196 -0.2130141407251358 -0.228181853890419 0.950030505657196 -0.2130141407251358 -0.228181853890419 0.950030505657196 -0.2130141407251358 -0.11263731867074966 0.9645566940307617 -0.23862753808498383 -0.11263731867074966 0.9645566940307617 -0.23862753808498383 -0.11263731867074966 0.9645566940307617 -0.23862753808498383 -0.11263731867074966 0.9645566940307617 -0.23862753808498383 -7.987747352444785e-08 0.0 -1.0 -7.987747352444785e-08 0.0 -1.0 -7.987747352444785e-08 0.0 -1.0 -7.987747352444785e-08 0.0 -1.0 0.0 0.0 -1.0 0.0 0.0 -1.0 0.0 0.0 -1.0 0.0 0.0 -1.0 -1.3516672936475516e-07 0.0 -1.0 -1.3516672936475516e-07 0.0 -1.0 -1.3516672936475516e-07 0.0 -1.0 -1.3516672936475516e-07 0.0 -1.0 -9.714193538457039e-08 0.0 -1.0 -9.714193538457039e-08 0.0 -1.0 -9.714193538457039e-08 0.0 -1.0 -9.714193538457039e-08 0.0 -1.0 1.1560629786799836e-07 0.0 -1.0 1.1560629786799836e-07 0.0 -1.0 1.1560629786799836e-07 0.0 -1.0 1.1560629786799836e-07 0.0 -1.0 0.0 0.0 -1.0 0.0 0.0 -1.0 0.0 0.0 -1.0 1.9861904831941501e-07 0.0 -1.0 1.9861904831941501e-07 0.0 -1.0 1.9861904831941501e-07 0.0 -1.0 1.9861904831941501e-07 0.0 -1.0 -0.130339115858078 0.9914555549621582 -0.005257387645542622 -0.130339115858078 0.9914555549621582 -0.005257387645542622 -0.130339115858078 0.9914555549621582 -0.005257387645542622 -0.130339115858078 0.9914555549621582 -0.005257387645542622 -0.25100281834602356 0.9578870534896851 0.13946324586868286 -0.25100281834602356 0.9578870534896851 0.13946324586868286 -0.25100281834602356 0.9578870534896851 0.13946324586868286 -0.25100281834602356 0.9578870534896851 0.13946324586868286 -0.13025937974452972 -0.9832690358161926 0.12733624875545502 -0.13025937974452972 -0.9832690358161926 0.12733624875545502 -0.13025937974452972 -0.9832690358161926 0.12733624875545502 -0.13025937974452972 -0.9832690358161926 0.12733624875545502 -0.2054649293422699 -0.9785679578781128 0.013742896728217602 -0.2054649293422699 -0.9785679578781128 0.013742896728217602 -0.2054649293422699 -0.9785679578781128 0.013742896728217602 -0.2054649293422699 -0.9785679578781128 0.013742896728217602 0.0 0.0 1.0 -1.88783513266344e-08 0.0 1.0 -1.88783513266344e-08 0.0 1.0 -1.88783513266344e-08 0.0 1.0 -1.88783513266344e-08 0.0 1.0 0.0 0.0 0.9999999403953552 0.0 0.0 0.9999999403953552 -0.1772853285074234 -0.958629310131073 -0.22270993888378143 -0.1772853285074234 -0.958629310131073 -0.22270993888378143 -0.1772853285074234 -0.958629310131073 -0.22270993888378143 -0.1772853285074234 -0.958629310131073 -0.22270993888378143 -1.0035208219960623e-08 0.0 1.0 -1.0035208219960623e-08 0.0 1.0 -1.0035208219960623e-08 0.0 1.0 -1.0035208219960623e-08 0.0 1.0 -9.238215170626063e-08 0.0 -1.0 -9.238215170626063e-08 0.0 -1.0 -9.238215170626063e-08 0.0 -1.0 -9.238215170626063e-08 0.0 -1.0 0.0 0.0 -1.0 0.0 0.0 -1.0 0.0 0.0 -1.0 0.0 0.0 -1.0 0.0 0.0 1.0 0.0 0.0 1.0 -0.9408509731292725 4.491922709348728e-07 -0.3388206958770752 -0.9408509731292725 4.491922709348728e-07 -0.3388206958770752 -0.9408509731292725 4.491922709348728e-07 -0.3388206958770752 -0.9408509731292725 4.491922709348728e-07 -0.3388206958770752 0.9717806577682495 -0.1582089066505432 -0.17496372759342194 0.9717806577682495 -0.1582089066505432 -0.17496372759342194 0.9717806577682495 -0.1582089066505432 -0.17496372759342194 0.9717806577682495 -0.1582089066505432 -0.17496372759342194 0.9583516716957092 0.19568908214569092 -0.20800930261611938 0.9583516716957092 0.19568908214569092 -0.20800930261611938 0.9583516716957092 0.19568908214569092 -0.20800930261611938 0.9583516716957092 0.19568908214569092 -0.20800930261611938 -0.9999999403953552 0.0 0.00046823607408441603 -0.9999999403953552 0.0 0.00046823607408441603 -0.9999999403953552 0.0 0.00046823607408441603 -0.9999999403953552 0.0 0.00046823607408441603 -0.9796368479728699 0.0 -0.20077772438526154 -0.9796368479728699 0.0 -0.20077772438526154 -0.9796368479728699 0.0 -0.20077772438526154 -0.9796368479728699 0.0 -0.20077772438526154 -1.6130648816670146e-07 0.0 -1.0 -1.6130648816670146e-07 0.0 -1.0 -1.6130648816670146e-07 0.0 -1.0 -1.6130648816670146e-07 0.0 -1.0 0.9609194993972778 0.24546383321285248 -0.12798921763896942 0.9609194993972778 0.24546383321285248 -0.12798921763896942 0.9609194993972778 0.24546383321285248 -0.12798921763896942 0.9609194993972778 0.24546383321285248 -0.12798921763896942</float_array>
				<technique_common>
				<accessor source="#id-mesh-4-normals-array" count="414" stride="3">
					<param name="X" type="float"/>
					<param name="Y" type="float"/>
					<param name="Z" type="float"/>
				</accessor>
				</technique_common>
			</source>
			<vertices id="id-mesh-4-vertices">
				<input semantic="POSITION" source="#id-mesh-4-positions"/>
			</vertices>
			<polygons count="114" material="id-trimat-5">
				<input semantic="VERTEX" source="#id-mesh-4-vertices" offset="0"/>
				<input semantic="NORMAL" source="#id-mesh-4-normals" offset="0"/>
				<p> 0 1 2 3 </p>
				<p> 4 5 6 7 </p>
				<p> 8 9 10 11 </p>
				<p> 12 13 14 15 </p>
				<p> 16 17 18 19 </p>
				<p> 20 21 22 23 </p>
				<p> 24 25 21 20 </p>
				<p> 26 27 28 29 </p>
				<p> 30 31 32 33 </p>
				<p> 34 35 36 37 </p>
				<p> 38 39 40 41 </p>
				<p> 42 43 44 45 </p>
				<p> 46 47 48 49 </p>
				<p> 50 51 52 53 </p>
				<p> 54 55 56 57 </p>
				<p> 58 59 60 61 </p>
				<p> 62 63 64 65 </p>
				<p> 66 67 68 69 </p>
				<p> 70 71 72 73 </p>
				<p> 74 75 76 77 </p>
				<p> 78 79 55 54 </p>
				<p> 80 81 82 83 </p>
				<p> 84 85 79 78 </p>
				<p> 86 87 88 89 </p>
				<p> 90 91 92 93 </p>
				<p> 94 95 96 97 </p>
				<p> 98 99 51 50 </p>
				<p> 100 101 102 103 </p>
				<p> 104 105 106 107 </p>
				<p> 108 109 110 111 </p>
				<p> 112 113 114 115 </p>
				<p> 116 117 118 119 </p>
				<p> 120 121 122 123 </p>
				<p> 124 125 126 127 </p>
				<p> 128 129 130 131 </p>
				<p> 132 133 134 135 </p>
				<p> 136 137 138 139 </p>
				<p> 140 141 142 143 </p>
				<p> 144 145 146 147 </p>
				<p> 148 149 150 151 </p>
				<p> 152 153 154 155 </p>
				<p> 156 157 158 159 </p>
				<p> 160 161 162 163 </p>
				<p> 164 165 166 167 </p>
				<p> 168 169 170 171 </p>
				<p> 172 173 174 175 </p>
				<p> 176 177 178 179 </p>
				<p> 180 181 182 183 </p>
				<p> 184 185 186 187 </p>
				<p> 188 189 190 191 </p>
				<p> 192 193 194 195 </p>
				<p> 196 197 198 199 </p>
				<p> 200 201 202 203 </p>
				<p> 204 205 206 207 </p>
				<p> 208 209 210 211 </p>
				<p> 212 213 214 215 </p>
				<p> 216 217 218 219 </p>
				<p> 220 221 222 223 </p>
				<p> 224 225 226 227 </p>
				<p> 228 229 230 231 </p>
				<p> 232 233 234 235 </p>
				<p> 236 237 238 239 </p>
				<p> 240 241 242 243 </p>
				<p> 244 245 246 247 </p>
				<p> 248 249 250 251 </p>
				<p> 252 253 254 255 </p>
				<p> 256 257 258 259 </p>
				<p> 260 261 262 263 </p>
				<p> 264 265 266 267 </p>
				<p> 268 269 270 271 </p>
				<p> 271 270 272 273 </p>
				<p> 274 275 276 277 </p>
				<p> 278 279 280 281 </p>
				<p> 273 272 282 283 </p>
				<p> 284 285 286 287 </p>
				<p> 288 289 290 291 </p>
				<p> 292 293 294 295 </p>
				<p> 296 297 298 299 </p>
				<p> 299 298 300 301 </p>
				<p> 302 303 304 305 </p>
				<p> 306 307 308 309 </p>
				<p> 310 311 312 313 </p>
				<p> 314 315 316 317 </p>
				<p> 318 319 320 321 </p>
				<p> 322 323 324 325 </p>
				<p> 326 327 328 329 </p>
				<p> 330 331 332 333 </p>
				<p> 334 335 336 337 </p>
				<p> 338 339 274 340 </p>
				<p> 341 342 343 344 </p>
				<p> 345 346 347 348 </p>
				<p> 349 350 351 352 </p>
				<p> 353 354 355 356 </p>
				<p> 357 358 359 360 </p>
				<p> 361 49 24 297 </p>
				<p> 269 84 78 270 </p>
				<p> 270 78 54 272 </p>
				<p> 272 54 57 282 </p>
				<p> 362 363 364 365 </p>
				<p> 258 111 366 367 </p>
				<p> 298 20 23 300 </p>
				<p> 368 369 370 371 </p>
				<p> 372 373 374 375 </p>
				<p> 376 377 378 379 </p>
				<p> 380 381 382 383 </p>
				<p> 283 282 384 385 </p>
				<p> 386 387 388 389 </p>
				<p> 390 391 392 393 </p>
				<p> 394 395 396 397 </p>
				<p> 398 399 400 401 </p>
				<p> 402 403 404 405 </p>
				<p> 57 56 47 46 </p>
				<p> 406 407 408 409 </p>
				<p> 410 411 412 413 </p>
			</polygons>
		</mesh>
	</geometry>
</library_geometries>
<library_visual_scenes>
	<visual_scene id="id-scene-1" name="scene">
		<node id="Cube" name="Cube" type="NODE">
			<matrix sid="transform"> 1.0 0.0 0.0 3.9696898460388184 0.0 1.0 0.0 -1.3606092929840088 0.0 0.0 1.0 1.5660336017608643 0.0 0.0 0.0 1.0  </matrix>
			<instance_geometry url="#id-mesh-4">
				<bind_material>
					<technique_common>
						<instance_material symbol="id-trimat-5" target="#id-material-3"/>
					</technique_common>
				</bind_material>
			</instance_geometry>
		</node>
	</visual_scene>
</library_visual_scenes>
<scene>
	<instance_visual_scene url="#id-scene-1" />
</scene>
</COLLADA>
