<?xml version="1.0" encoding="utf-8"?>
<COLLADA xmlns="http://www.collada.org/2005/11/COLLADASchema" version="1.4.1">
<asset>
	<contributor>
		<author>Anonymous</author>
		<authoring_tool>Collada Exporter for Blender 2.6+, by Juan Linietsky (juan@codenix.com)</authoring_tool>
	</contributor>
	<created>2019-05-05T16:47:13Z</created>
	<modified>2019-05-05T16:47:13Z</modified>
	<unit meter="1.0" name="meter"/>
	<up_axis>Z_UP</up_axis>
</asset>
<library_images>
	<image id="id-image-3" name="Palette.png">
		<init_from>../../concepts/3D/LowPolyPack/Palette.png</init_from>
	</image>
</library_images>
<library_effects>
	<effect id="id-fx-2" name="Material.001-fx">
		<profile_COMMON>
			<newparam sid="id-fx_surf-4">
				<surface type="2D">
					<init_from>id-image-3</init_from>
					<format>A8R8G8B8</format>
				</surface>
			</newparam>
			<newparam sid="id-fx_sampler-5">
				<sampler2D>
					<source>id-fx_surf-4</source>
				</sampler2D>
			</newparam>
			<technique sid="common">
				<blinn>
					<emission>
						<color>  0.0 0.0 0.0 1.0 </color>
					</emission>
					<ambient>
						<color>  0.0 0.0 0.0 1.0 </color>
					</ambient>
					<diffuse>
						<texture texture="id-fx_sampler-5" texcoord="CHANNEL1"/>
					</diffuse>
					<specular>
						<color>  0.5 0.5 0.5 1.0 </color>
					</specular>
					<shininess>
						<float>50</float>
					</shininess>
					<reflective>
						<color>  1.0 1.0 1.0 1.0 </color>
					</reflective>
					<index_of_refraction>
						<float>4.0</float>
					</index_of_refraction>
				</blinn>
				<extra>
					<technique profile="FCOLLADA">
					</technique>
					<technique profile="GOOGLEEARTH">
						<double_sided>0</double_sided>
					</technique>
				</extra>
			</technique>
		</profile_COMMON>
	</effect>
</library_effects>
<library_materials>
	<material id="id-material-6" name="Material.001">
		<instance_effect url="#id-fx-2"/>
	</material>
</library_materials>
<library_geometries>
	<geometry id="id-mesh-7" name="Cylinder.008">
		<mesh>
			<source id="id-mesh-7-positions">
				<float_array id="id-mesh-7-positions-array" count="687"> 0.0 0.7235617637634277 0.3333333134651184 0.0 0.765678882598877 1.0 0.866025447845459 0.26567888259887695 1.0 0.866025447845459 0.22356174886226654 0.3333333134651184 0.866025447845459 0.22356174886226654 0.3333333134651184 0.866025447845459 0.26567888259887695 1.0 0.8660253882408142 -0.7343211770057678 1.0 0.8660253882408142 -0.7764383554458618 0.3333333134651184 0.8660253882408142 -0.7764383554458618 0.3333333134651184 0.8660253882408142 -0.7343211770057678 1.0 -8.742277657347586e-08 -1.2343209981918335 1.0 -8.742277657347586e-08 -1.2764382362365723 0.3333333134651184 -8.742277657347586e-08 -1.2764382362365723 0.3333333134651184 -8.742277657347586e-08 -1.2343209981918335 1.0 -0.866025447845459 -0.7343210577964783 1.0 -0.866025447845459 -0.7764381766319275 0.3333333134651184 -0.7057358026504517 0.5923447012901306 -1.0 0.0 0.9998015761375427 -1.0 0.0 0.9998015761375427 -0.9564264416694641 -0.7057358026504517 0.5923447012901306 -0.9564264416694641 -0.866025447845459 -0.7764381766319275 0.3333333134651184 -0.866025447845459 -0.7343210577964783 1.0 -0.866025447845459 0.2656788229942322 1.0 -0.866025447845459 0.223561629652977 0.3333333134651184 -0.866025447845459 0.223561629652977 0.3333333134651184 -0.866025447845459 0.2656788229942322 1.0 0.0 0.765678882598877 1.0 0.0 0.7235617637634277 0.3333333134651184 0.7057356834411621 -0.6417778730392456 1.0 0.7057358026504517 0.17313560843467712 1.0 0.7057358026504517 0.17313560843467712 0.9564264416694641 0.7057356834411621 -0.6417778730392456 0.9564264416694641 -0.866025447845459 0.6848880052566528 -1.0 -0.866025447845459 1.0275439023971558 -0.3333333134651184 0.0 1.5275440216064453 -0.3333333134651184 0.0 1.1848881244659424 -1.0 -0.866025447845459 1.0275439023971558 -0.3333333134651184 -0.866025447845459 0.223561629652977 0.3333333134651184 0.0 0.7235617637634277 0.3333333134651184 0.0 1.5275440216064453 -0.3333333134651184 -0.866025447845459 -0.31511181592941284 -1.0 -0.866025447845459 0.027544140815734863 -0.3333333134651184 -0.866025447845459 1.0275439023971558 -0.3333333134651184 -0.866025447845459 0.6848880052566528 -1.0 -8.742277657347586e-08 -0.8151119351387024 -1.0 -8.742277657347586e-08 -0.4724559485912323 -0.3333333134651184 -0.866025447845459 0.027544140815734863 -0.3333333134651184 -0.866025447845459 -0.31511181592941284 -1.0 -8.742277657347586e-08 -0.4724559485912323 -0.3333333134651184 -8.742277657347586e-08 -1.2764382362365723 0.3333333134651184 -0.866025447845459 -0.7764381766319275 0.3333333134651184 -0.866025447845459 0.027544140815734863 -0.3333333134651184 0.8660253882408142 -0.31511199474334717 -1.0 0.8660253882408142 0.027543991804122925 -0.3333333134651184 -8.742277657347586e-08 -0.4724559485912323 -0.3333333134651184 -8.742277657347586e-08 -0.8151119351387024 -1.0 0.8660253882408142 0.027543991804122925 -0.3333333134651184 0.8660253882408142 -0.7764383554458618 0.3333333134651184 -8.742277657347586e-08 -1.2764382362365723 0.3333333134651184 -8.742277657347586e-08 -0.4724559485912323 -0.3333333134651184 0.866025447845459 0.6848880648612976 -1.0 0.866025447845459 1.0275440216064453 -0.3333333134651184 0.8660253882408142 0.027543991804122925 -0.3333333134651184 0.8660253882408142 -0.31511199474334717 -1.0 0.0 1.1848881244659424 -1.0 0.0 1.5275440216064453 -0.3333333134651184 0.866025447845459 1.0275440216064453 -0.3333333134651184 0.866025447845459 0.6848880648612976 -1.0 0.0 1.5275440216064453 -0.3333333134651184 0.0 0.7235617637634277 0.3333333134651184 0.866025447845459 0.22356174886226654 0.3333333134651184 0.866025447845459 1.0275440216064453 -0.3333333134651184 0.7057358026504517 0.5923447608947754 -1.0 0.0 0.9998015761375427 -1.0 0.0 1.1848881244659424 -1.0 0.866025447845459 0.6848880648612976 -1.0 6.369339722311906e-09 0.5805922746658325 1.0 0.7057358026504517 0.17313560843467712 1.0 0.866025447845459 0.26567888259887695 1.0 0.0 0.765678882598877 1.0 0.7057356834411621 -0.22256869077682495 -1.0 0.8660253882408142 -0.31511199474334717 -1.0 0.7057356834411621 -0.6417778730392456 1.0 0.8660253882408142 -0.7343211770057678 1.0 -6.831476184743224e-08 -0.630025327205658 -1.0 -8.742277657347586e-08 -0.8151119351387024 -1.0 -7.468410245792256e-08 -1.049234390258789 1.0 -8.742277657347586e-08 -1.2343209981918335 1.0 -0.7057357430458069 -0.222568541765213 -1.0 -0.866025447845459 -0.31511181592941284 -1.0 -0.7057358026504517 -0.641777753829956 1.0 -0.866025447845459 -0.7343210577964783 1.0 -0.7057358026504517 0.5923447012901306 -1.0 -0.866025447845459 0.6848880052566528 -1.0 -0.7057358026504517 0.17313551902770996 1.0 -0.866025447845459 0.2656788229942322 1.0 0.7057358026504517 0.17313560843467712 0.9564264416694641 6.369339722311906e-09 0.5805922746658325 0.9564264416694641 -0.7057358026504517 0.17313551902770996 0.9564264416694641 -0.7057358026504517 -0.641777753829956 0.9564264416694641 -7.468410245792256e-08 -1.049234390258789 0.9564264416694641 0.7057356834411621 -0.6417778730392456 0.9564264416694641 0.0 0.9998015761375427 -0.9564264416694641 0.7057358026504517 0.5923447608947754 -0.9564264416694641 0.7057356834411621 -0.22256869077682495 -0.9564264416694641 -6.831476184743224e-08 -0.630025327205658 -0.9564264416694641 -0.7057357430458069 -0.222568541765213 -0.9564264416694641 -0.7057358026504517 0.5923447012901306 -0.9564264416694641 0.0 0.9998015761375427 -1.0 0.7057358026504517 0.5923447608947754 -1.0 0.7057358026504517 0.5923447608947754 -0.9564264416694641 0.0 0.9998015761375427 -0.9564264416694641 -0.7057358026504517 -0.641777753829956 1.0 -7.468410245792256e-08 -1.049234390258789 1.0 -7.468410245792256e-08 -1.049234390258789 0.9564264416694641 -0.7057358026504517 -0.641777753829956 0.9564264416694641 0.7057356834411621 -0.22256869077682495 -1.0 -6.831476184743224e-08 -0.630025327205658 -1.0 -6.831476184743224e-08 -0.630025327205658 -0.9564264416694641 0.7057356834411621 -0.22256869077682495 -0.9564264416694641 6.369339722311906e-09 0.5805922746658325 1.0 -0.7057358026504517 0.17313551902770996 1.0 -0.7057358026504517 0.17313551902770996 0.9564264416694641 6.369339722311906e-09 0.5805922746658325 0.9564264416694641 0.7057358026504517 0.17313560843467712 1.0 6.369339722311906e-09 0.5805922746658325 1.0 6.369339722311906e-09 0.5805922746658325 0.9564264416694641 0.7057358026504517 0.17313560843467712 0.9564264416694641 -0.7057357430458069 -0.222568541765213 -1.0 -0.7057358026504517 0.5923447012901306 -1.0 -0.7057358026504517 0.5923447012901306 -0.9564264416694641 -0.7057357430458069 -0.222568541765213 -0.9564264416694641 -7.468410245792256e-08 -1.049234390258789 1.0 0.7057356834411621 -0.6417778730392456 1.0 0.7057356834411621 -0.6417778730392456 0.9564264416694641 -7.468410245792256e-08 -1.049234390258789 0.9564264416694641 0.7057358026504517 0.5923447608947754 -1.0 0.7057356834411621 -0.22256869077682495 -1.0 0.7057356834411621 -0.22256869077682495 -0.9564264416694641 0.7057358026504517 0.5923447608947754 -0.9564264416694641 -0.7057358026504517 0.17313551902770996 1.0 -0.7057358026504517 -0.641777753829956 1.0 -0.7057358026504517 -0.641777753829956 0.9564264416694641 -0.7057358026504517 0.17313551902770996 0.9564264416694641 -6.831476184743224e-08 -0.630025327205658 -1.0 -0.7057357430458069 -0.222568541765213 -1.0 -0.7057357430458069 -0.222568541765213 -0.9564264416694641 -6.831476184743224e-08 -0.630025327205658 -0.9564264416694641 0.062308937311172485 -1.7509945631027222 0.610741913318634 0.06166087090969086 -2.4833908081054688 0.6538363099098206 0.21863844990730286 -2.4406840801239014 0.6717928647994995 0.3087270259857178 -1.6839599609375 0.6389299035072327 0.3087270259857178 -1.6839599609375 0.6389299035072327 0.21863844990730286 -2.4406840801239014 0.6717928647994995 0.21350297331809998 -2.485043525695801 0.6313600540161133 0.3006650507450104 -1.753592610359192 0.5754612684249878 0.21863844990730286 -2.4406840801239014 0.6717928647994995 0.06166087090969086 -2.4833908081054688 0.6538363099098206 0.21350297331809998 -2.485043525695801 0.6313600540161133 0.3006650507450104 -1.753592610359192 0.5754612684249878 0.21350297331809998 -2.485043525695801 0.6313600540161133 0.06166087090969086 -2.4833908081054688 0.6538363099098206 0.062308937311172485 -1.7509945631027222 0.610741913318634 0.05566396564245224 -1.0662899017333984 0.5244202613830566 0.3006650507450104 -1.753592610359192 0.5754612684249878 0.062308937311172485 -1.7509945631027222 0.610741913318634 -0.2692074179649353 -1.0627532005310059 0.5725079774856567 0.06665118038654327 -0.9713869094848633 0.6109278202056885 0.3087270259857178 -1.6839599609375 0.6389299035072327 0.3006650507450104 -1.753592610359192 0.5754612684249878 0.05566396564245224 -1.0662899017333984 0.5244202613830566 -0.2692074179649353 -1.0627532005310059 0.5725079774856567 0.062308937311172485 -1.7509945631027222 0.610741913318634 0.3087270259857178 -1.6839599609375 0.6389299035072327 0.06665118038654327 -0.9713869094848633 0.6109278202056885 -1.1587413549423218 0.011687874794006348 -0.6556246280670166 -1.7386386394500732 -0.2811250686645508 -0.5662307739257812 -1.824304461479187 -0.13513588905334473 -0.5805566310882568 -1.2932206392288208 0.24085474014282227 -0.678112268447876 -1.2932206392288208 0.24085474014282227 -0.678112268447876 -1.824304461479187 -0.13513588905334473 -0.5805566310882568 -1.7280027866363525 -0.12544262409210205 -0.5453518629074097 -1.1420530080795288 0.25606977939605713 -0.6228502988815308 -1.824304461479187 -0.13513588905334473 -0.5805566310882568 -1.7386386394500732 -0.2811250686645508 -0.5662307739257812 -1.7280027866363525 -0.12544262409210205 -0.5453518629074097 -1.1420530080795288 0.25606977939605713 -0.6228502988815308 -1.7280027866363525 -0.12544262409210205 -0.5453518629074097 -1.7386386394500732 -0.2811250686645508 -0.5662307739257812 -1.1587413549423218 0.011687874794006348 -0.6556246280670166 -0.4753854274749756 0.3131132125854492 -0.7073962688446045 -1.1420530080795288 0.25606977939605713 -0.6228502988815308 -1.1587413549423218 0.011687874794006348 -0.6556246280670166 -0.4981379508972168 -0.01997363567352295 -0.7520668506622314 -0.6814302206039429 0.2923717498779297 -0.7827171087265015 -1.2932206392288208 0.24085474014282227 -0.678112268447876 -1.1420530080795288 0.25606977939605713 -0.6228502988815308 -0.4753854274749756 0.3131132125854492 -0.7073962688446045 -0.4981379508972168 -0.01997363567352295 -0.7520668506622314 -1.1587413549423218 0.011687874794006348 -0.6556246280670166 -1.2932206392288208 0.24085474014282227 -0.678112268447876 -0.6814302206039429 0.2923717498779297 -0.7827171087265015 -0.15275466442108154 1.5799009799957275 -0.40872204303741455 -0.20555728673934937 2.2273824214935303 -0.3193281888961792 -0.038052380084991455 2.2517457008361816 -0.33365398645401 0.1101885437965393 1.618149995803833 -0.4312095642089844 0.1101885437965393 1.618149995803833 -0.4312095642089844 -0.038052380084991455 2.2517457008361816 -0.33365398645401 -0.06534892320632935 2.158886432647705 -0.2984492778778076 0.06733959913253784 1.4723856449127197 -0.3759477138519287 -0.038052380084991455 2.2517457008361816 -0.33365398645401 -0.20555728673934937 2.2273824214935303 -0.3193281888961792 -0.06534892320632935 2.158886432647705 -0.2984492778778076 0.06733959913253784 1.4723856449127197 -0.3759477138519287 -0.06534892320632935 2.158886432647705 -0.2984492778778076 -0.20555728673934937 2.2273824214935303 -0.3193281888961792 -0.15275466442108154 1.5799009799957275 -0.40872204303741455 -0.13094574213027954 0.8333375453948975 -0.4604935646057129 0.06733959913253784 1.4723856449127197 -0.3759477138519287 -0.15275466442108154 1.5799009799957275 -0.40872204303741455 -0.4309265613555908 0.9798843860626221 -0.5051642656326294 -0.07254445552825928 1.0320179462432861 -0.5358145236968994 0.1101885437965393 1.618149995803833 -0.4312095642089844 0.06733959913253784 1.4723856449127197 -0.3759477138519287 -0.13094574213027954 0.8333375453948975 -0.4604935646057129 -0.4309265613555908 0.9798843860626221 -0.5051642656326294 -0.15275466442108154 1.5799009799957275 -0.40872204303741455 0.1101885437965393 1.618149995803833 -0.4312095642089844 -0.07254445552825928 1.0320179462432861 -0.5358145236968994</float_array>
				<technique_common>
				<accessor source="#id-mesh-7-positions-array" count="229" stride="3">
					<param name="X" type="float"/>
					<param name="Y" type="float"/>
					<param name="Z" type="float"/>
				</accessor>
				</technique_common>
			</source>
			<source id="id-mesh-7-normals">
				<float_array id="id-mesh-7-normals-array" count="687"> 0.4992533326148987 0.8647322058677673 -0.054630037397146225 0.4992533326148987 0.8647322058677673 -0.054630037397146225 0.4992533326148987 0.8647322058677673 -0.054630037397146225 0.4992533326148987 0.8647322058677673 -0.054630037397146225 1.0 -8.94069742685133e-08 -4.161136146763056e-08 1.0 -8.940696716308594e-08 3.765566525260056e-09 1.0 -8.940696716308594e-08 3.765566525260056e-09 1.0 -8.940696716308594e-08 -2.0039120585124692e-08 0.49925318360328674 -0.8647322058677673 0.05462999269366264 0.49925318360328674 -0.8647322058677673 0.05462999269366264 0.49925318360328674 -0.8647322058677673 0.05462999269366264 0.49925318360328674 -0.8647322058677673 0.05462999269366264 -0.49925336241722107 -0.8647321462631226 0.054630178958177567 -0.49925336241722107 -0.8647321462631226 0.054630178958177567 -0.49925336241722107 -0.8647321462631226 0.054630178958177567 -0.49925336241722107 -0.8647321462631226 0.054630178958177567 0.5000001192092896 -0.8660253286361694 0.0 0.5000001192092896 -0.8660253286361694 0.0 0.5000001192092896 -0.8660253286361694 0.0 0.5000001192092896 -0.8660253286361694 0.0 -1.0 0.0 0.0 -1.0 0.0 0.0 -1.0 0.0 0.0 -1.0 0.0 0.0 -0.49925336241722107 0.8647320866584778 -0.05463012307882309 -0.49925336241722107 0.8647320866584778 -0.05463012307882309 -0.49925336241722107 0.8647320866584778 -0.05463012307882309 -0.49925336241722107 0.8647320866584778 -0.05463012307882309 -1.0 1.573681061017851e-07 0.0 -1.0 1.573681061017851e-07 0.0 -1.0 1.573681061017851e-07 0.0 -1.0 1.573681061017851e-07 0.0 -0.4567907154560089 0.7911845445632935 -0.40665608644485474 -0.4567907154560089 0.7911845445632935 -0.40665608644485474 -0.4567907154560089 0.7911845445632935 -0.40665608644485474 -0.4567907154560089 0.7911845445632935 -0.40665608644485474 -0.34579288959503174 0.5989307165145874 0.7222945690155029 -0.34579288959503174 0.5989307165145874 0.7222945690155029 -0.34579288959503174 0.5989307165145874 0.7222945690155029 -0.34579288959503174 0.5989307165145874 0.7222945690155029 -1.0 0.0 0.0 -1.0 0.0 0.0 -1.0 0.0 0.0 -1.0 0.0 0.0 -0.4567907154560089 -0.7911845445632935 0.4066561460494995 -0.4567907154560089 -0.7911845445632935 0.4066561460494995 -0.4567907154560089 -0.7911845445632935 0.4066561460494995 -0.4567907154560089 -0.7911845445632935 0.4066561460494995 -0.34579285979270935 -0.5989306569099426 -0.7222945690155029 -0.34579285979270935 -0.5989306569099426 -0.7222945690155029 -0.34579285979270935 -0.5989306569099426 -0.7222945690155029 -0.34579285979270935 -0.5989306569099426 -0.7222945690155029 0.4567905366420746 -0.7911845445632935 0.4066561758518219 0.4567905366420746 -0.7911845445632935 0.4066561758518219 0.4567905366420746 -0.7911845445632935 0.4066561758518219 0.4567905366420746 -0.7911845445632935 0.4066561758518219 0.3457927405834198 -0.5989307165145874 -0.7222945690155029 0.3457927405834198 -0.5989307165145874 -0.7222945690155029 0.3457927405834198 -0.5989307165145874 -0.7222945690155029 0.3457927405834198 -0.5989307165145874 -0.7222945690155029 1.0 -8.940696716308594e-08 3.0635831649306056e-08 1.0 -8.940696716308594e-08 -9.050859617332208e-09 1.0 -8.940698137394065e-08 -2.5226938760170015e-08 1.0 -8.940696716308594e-08 3.0635831649306056e-08 0.45679065585136414 0.7911846041679382 -0.40665605664253235 0.45679065585136414 0.7911846041679382 -0.40665605664253235 0.45679065585136414 0.7911846041679382 -0.40665605664253235 0.45679065585136414 0.7911846041679382 -0.40665605664253235 0.3457928001880646 0.5989307165145874 0.7222944498062134 0.3457928001880646 0.5989307165145874 0.7222944498062134 0.3457928001880646 0.5989307165145874 0.7222944498062134 0.3457928001880646 0.5989307165145874 0.7222944498062134 0.0 0.0 -1.0 0.0 0.0 -1.0 0.0 0.0 -1.0 0.0 0.0 -1.0 -1.0244448844787257e-07 0.0 1.0 -1.0244448844787257e-07 0.0 1.0 -1.0244448844787257e-07 0.0 1.0 -1.0244448844787257e-07 0.0 1.0 0.0 0.0 -1.0 0.0 0.0 -1.0 0.0 0.0 1.0 0.0 0.0 1.0 0.0 0.0 -1.0 0.0 0.0 -1.0 0.0 0.0 1.0 0.0 0.0 1.0 -2.04889033739164e-07 0.0 -1.0 -2.0488907637172815e-07 0.0 -1.0 0.0 0.0 1.0 0.0 0.0 1.0 -2.0488907637172815e-07 0.0 -1.0 -2.0488900531745458e-07 0.0 -1.0 0.0 0.0 1.0 0.0 0.0 1.0 -5.181989592983882e-08 0.0 1.0 -5.181989592983882e-08 0.0 1.0 -5.181989592983882e-08 0.0 1.0 -5.181989592983882e-08 0.0 1.0 -5.181989592983882e-08 0.0 1.0 -5.181989592983882e-08 0.0 1.0 3.454659491808343e-08 0.0 -0.9999999403953552 3.454659491808343e-08 0.0 -0.9999999403953552 3.454659491808343e-08 0.0 -0.9999999403953552 3.454659491808343e-08 0.0 -0.9999999403953552 3.454659491808343e-08 0.0 -0.9999999403953552 3.454659491808343e-08 0.0 -0.9999999403953552 -0.5000001192092896 -0.8660253286361694 0.0 -0.5000001192092896 -0.8660253286361694 0.0 -0.5000001192092896 -0.8660253286361694 0.0 -0.5000001192092896 -0.8660253286361694 0.0 0.5000001192092896 0.8660252690315247 0.0 0.5000001192092896 0.8660252690315247 0.0 0.5000001192092896 0.8660252690315247 0.0 0.5000001192092896 0.8660252690315247 0.0 -0.5000001192092896 0.8660253286361694 0.0 -0.5000001192092896 0.8660253286361694 0.0 -0.5000001192092896 0.8660253286361694 0.0 -0.5000001192092896 0.8660253286361694 0.0 0.5000001192092896 -0.8660253286361694 0.0 0.5000001192092896 -0.8660253286361694 0.0 0.5000001192092896 -0.8660253286361694 0.0 0.5000001192092896 -0.8660253286361694 0.0 -0.5000001192092896 -0.8660253286361694 0.0 -0.5000001192092896 -0.8660253286361694 0.0 -0.5000001192092896 -0.8660253286361694 0.0 -0.5000001192092896 -0.8660253286361694 0.0 1.0 5.24560341830238e-08 0.0 1.0 5.24560341830238e-08 0.0 1.0 5.24560341830238e-08 0.0 1.0 5.24560341830238e-08 0.0 -0.4999995529651642 0.8660257458686829 0.0 -0.4999995529651642 0.8660257458686829 0.0 -0.4999995529651642 0.8660257458686829 0.0 -0.4999995529651642 0.8660257458686829 0.0 -1.0 1.573681061017851e-07 0.0 -1.0 1.573681061017851e-07 0.0 -1.0 1.573681061017851e-07 0.0 -1.0 1.573681061017851e-07 0.0 1.0 0.0 0.0 1.0 0.0 0.0 1.0 0.0 0.0 1.0 0.0 0.0 0.5000002384185791 0.8660253286361694 0.0 0.5000002384185791 0.8660253286361694 0.0 0.5000002384185791 0.8660253286361694 0.0 0.5000002384185791 0.8660253286361694 0.0 -0.12911289930343628 0.05836081877350807 0.9899110198020935 -0.12911289930343628 0.05836081877350807 0.9899110198020935 -0.12911289930343628 0.05836081877350807 0.9899110198020935 -0.12911289930343628 0.05836081877350807 0.9899110198020935 0.9929995536804199 -0.11806900799274445 0.0034055558498948812 0.9929995536804199 -0.11806900799274445 0.0034055558498948812 0.9929995536804199 -0.11806900799274445 0.0034055558498948812 0.9929995536804199 -0.11806900799274445 0.0034055558498948812 0.10061720758676529 -0.6765568256378174 0.7294840216636658 0.10061720758676529 -0.6765568256378174 0.7294840216636658 0.10061720758676529 -0.6765568256378174 0.7294840216636658 -0.14679574966430664 -0.05797210708260536 -0.9874665141105652 -0.14679574966430664 -0.05797210708260536 -0.9874665141105652 -0.14679574966430664 -0.05797210708260536 -0.9874665141105652 -0.14679574966430664 -0.05797210708260536 -0.9874665141105652 -0.1466064155101776 -0.12513011693954468 -0.9812487363815308 -0.1466064155101776 -0.12513011693954468 -0.9812487363815308 -0.1466064155101776 -0.12513011693954468 -0.9812487363815308 -0.1466064155101776 -0.12513011693954468 -0.9812487363815308 0.8663057088851929 0.27799174189567566 -0.4150121212005615 0.8663057088851929 0.27799174189567566 -0.4150121212005615 0.8663057088851929 0.27799174189567566 -0.4150121212005615 0.8663057088851929 0.27799174189567566 -0.4150121212005615 -0.11375699192285538 0.00039668777026236057 0.993508517742157 -0.11375699192285538 0.00039668777026236057 0.993508517742157 -0.11375699192285538 0.00039668777026236057 0.993508517742157 -0.11375699192285538 0.00039668777026236057 0.993508517742157 -0.07960136234760284 -0.14350880682468414 -0.9864426255226135 -0.07960136234760284 -0.14350880682468414 -0.9864426255226135 -0.07960136234760284 -0.14350880682468414 -0.9864426255226135 -0.07960136234760284 -0.14350880682468414 -0.9864426255226135 -0.320750892162323 0.6353265047073364 0.7024807333946228 -0.320750892162323 0.6353265047073364 0.7024807333946228 -0.320750892162323 0.6353265047073364 0.7024807333946228 -0.320750892162323 0.6353265047073364 0.7024807333946228 -0.33235353231430054 -0.10302530974149704 0.9375110864639282 -0.33235353231430054 -0.10302530974149704 0.9375110864639282 -0.33235353231430054 -0.10302530974149704 0.9375110864639282 0.2216121107339859 -0.14446976780891418 0.9643737077713013 0.2216121107339859 -0.14446976780891418 0.9643737077713013 0.2216121107339859 -0.14446976780891418 0.9643737077713013 0.2216121107339859 -0.14446976780891418 0.9643737077713013 0.136407732963562 -0.1408248394727707 0.9805923104286194 0.136407732963562 -0.1408248394727707 0.9805923104286194 0.136407732963562 -0.1408248394727707 0.9805923104286194 0.136407732963562 -0.1408248394727707 0.9805923104286194 -0.08905387669801712 0.99555903673172 -0.03052198700606823 -0.08905387669801712 0.99555903673172 -0.03052198700606823 -0.08905387669801712 0.99555903673172 -0.03052198700606823 -0.08905387669801712 0.99555903673172 -0.03052198700606823 -0.15061712265014648 -0.18370512127876282 -0.9713737368583679 -0.15061712265014648 -0.18370512127876282 -0.9713737368583679 -0.15061712265014648 -0.18370512127876282 -0.9713737368583679 -0.15061712265014648 -0.18370512127876282 -0.9713737368583679 -0.10295281559228897 0.12779629230499268 -0.9864425659179688 -0.10295281559228897 0.12779629230499268 -0.9864425659179688 -0.10295281559228897 0.12779629230499268 -0.9864425659179688 -0.10295281559228897 0.12779629230499268 -0.9864425659179688 0.7093517780303955 0.057803139090538025 0.7024804949760437 0.7093517780303955 0.057803139090538025 0.7024804949760437 0.7093517780303955 0.057803139090538025 0.7024804949760437 0.7093517780303955 0.057803139090538025 0.7024804949760437 0.029756024479866028 0.3466809391975403 0.9375109672546387 0.029756024479866028 0.3466809391975403 0.9375109672546387 0.029756024479866028 0.3466809391975403 0.9375109672546387 -0.21730682253837585 -0.15086786448955536 0.9643737077713013 -0.21730682253837585 -0.15086786448955536 0.9643737077713013 -0.21730682253837585 -0.15086786448955536 0.9643737077713013 -0.21730682253837585 -0.15086786448955536 0.9643737077713013 -0.1818351149559021 -0.0733124390244484 0.9805922508239746 -0.1818351149559021 -0.0733124390244484 0.9805922508239746 -0.1818351149559021 -0.0733124390244484 0.9805922508239746 -0.1818351149559021 -0.0733124390244484 0.9805922508239746 0.9557713866233826 -0.2925225794315338 -0.030523234978318214 0.9557713866233826 -0.2925225794315338 -0.030523234978318214 0.9557713866233826 -0.2925225794315338 -0.030523234978318214 0.9557713866233826 -0.2925225794315338 -0.030523234978318214 -0.11343740671873093 0.20872242748737335 -0.9713737368583679 -0.11343740671873093 0.20872242748737335 -0.9713737368583679 -0.11343740671873093 0.20872242748737335 -0.9713737368583679 -0.11343740671873093 0.20872242748737335 -0.9713737368583679</float_array>
				<technique_common>
				<accessor source="#id-mesh-7-normals-array" count="229" stride="3">
					<param name="X" type="float"/>
					<param name="Y" type="float"/>
					<param name="Z" type="float"/>
				</accessor>
				</technique_common>
			</source>
			<source id="id-mesh-7-texcoord-0">
				<float_array id="id-mesh-7-texcoord-0-array" count="458"> 0.614692211151123 0.7972562313079834 0.608505368232727 0.7975077629089355 0.6090222597122192 0.7868873476982117 0.61520916223526 0.7866358160972595 0.5730602741241455 0.8121412992477417 0.5764631628990173 0.8223962187767029 0.5684193968772888 0.8315531015396118 0.5650164484977722 0.8212981820106506 0.5650164484977722 0.8212981820106506 0.5684193968772888 0.8315531015396118 0.5640540719032288 0.8354840874671936 0.5606511831283569 0.8252291679382324 0.5835825204849243 0.8216633200645447 0.5774035453796387 0.8212754726409912 0.5774035453796387 0.8028592467308044 0.5835825204849243 0.8032470345497131 0.590363621711731 0.8712093830108643 0.5906075239181519 0.8634671568870544 0.5910106897354126 0.863442063331604 0.5907667875289917 0.8711842894554138 0.5835825204849243 0.8032470345497131 0.5774035453796387 0.8028592467308044 0.5764631628990173 0.7936511635780334 0.582642138004303 0.7940389513969421 0.61520916223526 0.8155746459960938 0.6090222597122192 0.8158262372016907 0.608505368232727 0.7975077629089355 0.614692211151123 0.7972562313079834 0.5752370953559875 0.8580468893051147 0.5747273564338684 0.8504575490951538 0.5751277208328247 0.8505113124847412 0.5756374001502991 0.8581006526947021 0.611534059047699 0.8944533467292786 0.6050364375114441 0.8923913836479187 0.6045195460319519 0.8740729689598083 0.611017107963562 0.876134991645813 0.5971518754959106 0.8634525537490845 0.6045195460319519 0.86394864320755 0.5998835563659668 0.8798798322677612 0.5925158858299255 0.8793837428092957 0.5954273343086243 0.7989991307258606 0.5889658331871033 0.7958438992500305 0.5880253911018372 0.7866358160972595 0.5944869518280029 0.7897909879684448 0.5954273343086243 0.8174153566360474 0.5889658331871033 0.8142601251602173 0.5889658331871033 0.7958438992500305 0.5954273343086243 0.7989991307258606 0.5681890845298767 0.8521063327789307 0.5606511831283569 0.851413905620575 0.565287172794342 0.8354840874671936 0.5728250741958618 0.8361765146255493 0.5944869518280029 0.8266234397888184 0.5880253911018372 0.8234682679176331 0.5889658331871033 0.8142601251602173 0.5954273343086243 0.8174153566360474 0.5728250741958618 0.8680218458175659 0.565287172794342 0.867329478263855 0.5606511831283569 0.851413905620575 0.5681890845298767 0.8521063327789307 0.5706427693367004 0.7866358160972595 0.5764631628990173 0.7941387295722961 0.5684193968772888 0.8032956123352051 0.5625990033149719 0.7957926988601685 0.611017107963562 0.876134991645813 0.6045195460319519 0.8740729689598083 0.6050364375114441 0.8634525537490845 0.611534059047699 0.8655145764350891 0.5925158858299255 0.8793837428092957 0.5998835563659668 0.8798798322677612 0.6045195460319519 0.8958212733268738 0.5971518754959106 0.8953251838684082 0.6070665717124939 0.8375449180603027 0.6005331873893738 0.8300317525863647 0.6005331873893738 0.8266234397888184 0.608550488948822 0.835843026638031 0.5910303592681885 0.8525451421737671 0.5910303592681885 0.8375431895256042 0.5925158858299255 0.8358420729637146 0.5925158858299255 0.8542514443397522 0.6070665717124939 0.8525511622428894 0.608550488948822 0.8542575836181641 0.5844895243644714 0.8300307989120483 0.5844895243644714 0.8266234397888184 0.6005331873893738 0.8600442409515381 0.6005331873893738 0.8634525537490845 0.5779487490653992 0.8375203609466553 0.5764631628990173 0.8358141183853149 0.5939998030662537 0.8525310754776001 0.5925158858299255 0.8542329668998718 0.5779487490653992 0.8525223731994629 0.5764631628990173 0.8542234301567078 0.5939998030662537 0.8375248312950134 0.5925158858299255 0.8358184099197388 0.5844895243644714 0.8600347638130188 0.5844895243644714 0.863442063331604 0.7315906286239624 0.8007082343101501 0.738129734992981 0.7931979298591614 0.74466872215271 0.8006937503814697 0.74466872215271 0.8156998753547668 0.738129734992981 0.8232102394104004 0.7315906286239624 0.8157143592834473 0.7257040739059448 0.8774785399436951 0.7257040739059448 0.8924723863601685 0.7191653251647949 0.8999917507171631 0.7126264572143555 0.8925173878669739 0.7126264572143555 0.8775236010551453 0.7191653251647949 0.8700041770935059 0.5743262767791748 0.835509717464447 0.5740830302238464 0.8505095839500427 0.5736819505691528 0.8504839539527893 0.5739251971244812 0.8354840874671936 0.5764601826667786 0.8354840874671936 0.5760389566421509 0.8441388010978699 0.5756374001502991 0.8441764712333679 0.5760586857795715 0.8355216979980469 0.5899620652198792 0.8870623111724854 0.5895407795906067 0.8721344470977783 0.5899423360824585 0.8720967769622803 0.590363621711731 0.8870247006416321 0.591657817363739 0.863442063331604 0.5914139151573181 0.871184229850769 0.5910106897354126 0.8712093830108643 0.5912546515464783 0.8634671568870544 0.5747273564338684 0.8504575490951538 0.5752370953559875 0.8354840874671936 0.5756374001502991 0.835537850856781 0.5751277208328247 0.8505113124847412 0.5906075239181519 0.8862069845199585 0.590363621711731 0.8712093830108643 0.5907667875289917 0.8711842894554138 0.5910106897354126 0.8861818909645081 0.5760389566421509 0.8441388010978699 0.5764601826667786 0.8590667247772217 0.5760586857795715 0.859104335308075 0.5756374001502991 0.8441764712333679 0.5740830302238464 0.8505095839500427 0.5747273564338684 0.858058512210846 0.5743262767791748 0.8580328226089478 0.5736819505691528 0.8504839539527893 0.5914139151573181 0.871184229850769 0.591657817363739 0.8861818909645081 0.5912546515464783 0.8862069845199585 0.5910106897354126 0.8712093830108643 0.5895407795906067 0.8721344470977783 0.5899620652198792 0.863479733467102 0.590363621711731 0.863442063331604 0.5899423360824585 0.8720967769622803 0.6109259724617004 0.8405799269676208 0.6124696135520935 0.8537020683288574 0.6109563708305359 0.85359787940979 0.608550488948822 0.8404164910316467 0.5736819505691528 0.8485527038574219 0.57352614402771 0.862521231174469 0.5731256008148193 0.8632935881614685 0.573053240776062 0.8497651219367981 0.6109563708305359 0.85359787940979 0.6124696135520935 0.8537020683288574 0.6111125349998474 0.8543747663497925 0.611534059047699 0.8762232661247253 0.613865077495575 0.8634525537490845 0.6152439117431641 0.8641074895858765 0.6136984825134277 0.877251386642456 0.6122938990592957 0.8895695209503174 0.611534059047699 0.8762232661247253 0.6136984825134277 0.877251386642456 0.6152439117431641 0.890970766544342 0.5736819505691528 0.8354840874671936 0.5736819505691528 0.8485527038574219 0.573053240776062 0.8497651219367981 0.5728250741958618 0.8371365070343018 0.6124696135520935 0.8268462419509888 0.6109259724617004 0.8405799269676208 0.608550488948822 0.8404164910316467 0.6092319488525391 0.8266234397888184 0.57074373960495 0.8798903822898865 0.5722929239273071 0.8915289640426636 0.5708042979240417 0.8925012946128845 0.5684069991111755 0.8814167976379395 0.5645231604576111 0.8789294362068176 0.5669198036193848 0.8680218458175659 0.5670132637023926 0.8698198795318604 0.5646699070930481 0.8817517757415771 0.5669198036193848 0.8680218458175659 0.5684069395065308 0.8690250515937805 0.5670132637023926 0.8698198795318604 0.5646699070930481 0.8817517757415771 0.5670132637023926 0.8698198795318604 0.5684069395065308 0.8690250515937805 0.566857635974884 0.880504310131073 0.5654250979423523 0.8939082026481628 0.5646699070930481 0.8817517757415771 0.566857635974884 0.880504310131073 0.5684069991111755 0.8922078013420105 0.6124696135520935 0.851956307888031 0.612716555595398 0.8411071300506592 0.6133968234062195 0.8435558676719666 0.6133968234062195 0.8552939891815186 0.5722929239273071 0.8680218458175659 0.57074373960495 0.8798903822898865 0.5684069991111755 0.8814167976379395 0.5691080093383789 0.8701023459434509 0.5746432542800903 0.8797338604927063 0.5761888027191162 0.8912821412086487 0.5746915340423584 0.892250657081604 0.5722929239273071 0.881254255771637 0.5606511831283569 0.8790324926376343 0.5630433559417725 0.8680218458175659 0.5631226301193237 0.869780957698822 0.5607755780220032 0.8817937970161438 0.5630433559417725 0.8680218458175659 0.5645231604576111 0.8690195679664612 0.5631226301193237 0.869780957698822 0.5607755780220032 0.8817937970161438 0.5631226301193237 0.869780957698822 0.5645231604576111 0.8690195679664612 0.5629740953445435 0.880598783493042 0.5615266561508179 0.8940612077713013 0.5607755780220032 0.8817937970161438 0.5629740953445435 0.880598783493042 0.5645231604576111 0.8924323320388794 0.6124696135520935 0.8376642465591431 0.612717866897583 0.8266234397888184 0.6134018301963806 0.8291493654251099 0.6134018301963806 0.8411071300506592 0.5761888027191162 0.8680218458175659 0.5746432542800903 0.8797338604927063 0.5722929239273071 0.881254255771637 0.5729853510856628 0.8700941205024719</float_array>
				<technique_common>
				<accessor source="#id-mesh-7-texcoord-0-array" count="229" stride="2">
					<param name="S" type="float"/>
					<param name="T" type="float"/>
				</accessor>
				</technique_common>
			</source>
			<vertices id="id-mesh-7-vertices">
				<input semantic="POSITION" source="#id-mesh-7-positions"/>
			</vertices>
			<polygons count="65" material="id-trimat-8">
				<input semantic="VERTEX" source="#id-mesh-7-vertices" offset="0"/>
				<input semantic="NORMAL" source="#id-mesh-7-normals" offset="0"/>
				<input semantic="TEXCOORD" source="#id-mesh-7-texcoord-0" offset="0" set="0"/>
				<p> 0 1 2 3 </p>
				<p> 4 5 6 7 </p>
				<p> 8 9 10 11 </p>
				<p> 12 13 14 15 </p>
				<p> 16 17 18 19 </p>
				<p> 20 21 22 23 </p>
				<p> 24 25 26 27 </p>
				<p> 28 29 30 31 </p>
				<p> 32 33 34 35 </p>
				<p> 36 37 38 39 </p>
				<p> 40 41 42 43 </p>
				<p> 41 20 23 42 </p>
				<p> 44 45 46 47 </p>
				<p> 48 49 50 51 </p>
				<p> 52 53 54 55 </p>
				<p> 56 57 58 59 </p>
				<p> 60 61 62 63 </p>
				<p> 61 4 7 62 </p>
				<p> 64 65 66 67 </p>
				<p> 68 69 70 71 </p>
				<p> 72 73 74 75 </p>
				<p> 76 77 78 79 </p>
				<p> 80 72 75 81 </p>
				<p> 77 82 83 78 </p>
				<p> 84 80 81 85 </p>
				<p> 82 86 87 83 </p>
				<p> 88 84 85 89 </p>
				<p> 86 90 91 87 </p>
				<p> 92 88 89 93 </p>
				<p> 90 94 95 91 </p>
				<p> 73 92 93 74 </p>
				<p> 94 76 79 95 </p>
				<p> 96 97 98 99 100 101 </p>
				<p> 102 103 104 105 106 107 </p>
				<p> 108 109 110 111 </p>
				<p> 112 113 114 115 </p>
				<p> 116 117 118 119 </p>
				<p> 120 121 122 123 </p>
				<p> 124 125 126 127 </p>
				<p> 128 129 130 131 </p>
				<p> 132 133 134 135 </p>
				<p> 136 137 138 139 </p>
				<p> 140 141 142 143 </p>
				<p> 144 145 146 147 </p>
				<p> 148 149 150 151 </p>
				<p> 152 153 154 155 </p>
				<p> 156 157 158 </p>
				<p> 159 160 161 162 </p>
				<p> 163 164 165 166 </p>
				<p> 167 168 169 170 </p>
				<p> 171 172 173 174 </p>
				<p> 175 176 177 178 </p>
				<p> 179 180 181 182 </p>
				<p> 183 184 185 </p>
				<p> 186 187 188 189 </p>
				<p> 190 191 192 193 </p>
				<p> 194 195 196 197 </p>
				<p> 198 199 200 201 </p>
				<p> 202 203 204 205 </p>
				<p> 206 207 208 209 </p>
				<p> 210 211 212 </p>
				<p> 213 214 215 216 </p>
				<p> 217 218 219 220 </p>
				<p> 221 222 223 224 </p>
				<p> 225 226 227 228 </p>
			</polygons>
		</mesh>
	</geometry>
</library_geometries>
<library_visual_scenes>
	<visual_scene id="id-scene-1" name="scene">
		<node id="Trunk_03" name="Trunk_03" type="NODE">
			<matrix sid="transform"> 1.4640225920459216e-08 1.4640229473172894e-08 0.8373733162879944 -0.12386512756347656 0.0 0.19391566514968872 -6.321994305835688e-08 -0.10374695062637329 -0.19391566514968872 1.1053066336410558e-15 6.321992884750216e-08 0.006012976169586182 0.0 0.0 0.0 1.0  </matrix>
			<instance_geometry url="#id-mesh-7">
				<bind_material>
					<technique_common>
						<instance_material symbol="id-trimat-8" target="#id-material-6"/>
					</technique_common>
				</bind_material>
			</instance_geometry>
		</node>
	</visual_scene>
</library_visual_scenes>
<scene>
	<instance_visual_scene url="#id-scene-1" />
</scene>
</COLLADA>
