<?xml version="1.0" encoding="utf-8"?>
<COLLADA xmlns="http://www.collada.org/2005/11/COLLADASchema" version="1.4.1">
<asset>
	<contributor>
		<author>Anonymous</author>
		<authoring_tool>Collada Exporter for Blender 2.6+, by Juan Linietsky (juan@codenix.com)</authoring_tool>
	</contributor>
	<created>2019-05-05T15:41:10Z</created>
	<modified>2019-05-05T15:41:10Z</modified>
	<unit meter="1.0" name="meter"/>
	<up_axis>Z_UP</up_axis>
</asset>
<library_images>
	<image id="id-image-3" name="Palette.png">
		<init_from>../../concepts/3D/LowPolyPack/Palette.png</init_from>
	</image>
</library_images>
<library_effects>
	<effect id="id-fx-2" name="Material.001-fx">
		<profile_COMMON>
			<newparam sid="id-fx_surf-4">
				<surface type="2D">
					<init_from>id-image-3</init_from>
					<format>A8R8G8B8</format>
				</surface>
			</newparam>
			<newparam sid="id-fx_sampler-5">
				<sampler2D>
					<source>id-fx_surf-4</source>
				</sampler2D>
			</newparam>
			<technique sid="common">
				<blinn>
					<emission>
						<color>  0.0 0.0 0.0 1.0 </color>
					</emission>
					<ambient>
						<color>  0.0 0.0 0.0 1.0 </color>
					</ambient>
					<diffuse>
						<texture texture="id-fx_sampler-5" texcoord="CHANNEL1"/>
					</diffuse>
					<specular>
						<color>  0.5 0.5 0.5 1.0 </color>
					</specular>
					<shininess>
						<float>50</float>
					</shininess>
					<reflective>
						<color>  1.0 1.0 1.0 1.0 </color>
					</reflective>
					<index_of_refraction>
						<float>4.0</float>
					</index_of_refraction>
				</blinn>
				<extra>
					<technique profile="FCOLLADA">
					</technique>
					<technique profile="GOOGLEEARTH">
						<double_sided>0</double_sided>
					</technique>
				</extra>
			</technique>
		</profile_COMMON>
	</effect>
</library_effects>
<library_materials>
	<material id="id-material-6" name="Material.001">
		<instance_effect url="#id-fx-2"/>
	</material>
</library_materials>
<library_geometries>
	<geometry id="id-mesh-7" name="Icosphere">
		<mesh>
			<source id="id-mesh-7-positions">
				<float_array id="id-mesh-7-positions-array" count="498"> 1.0415095090866089 -0.569831907749176 2.2265405654907227 -0.12517306208610535 -0.8118021488189697 2.3724281787872314 -0.9746671915054321 0.2942226231098175 2.2543087005615234 1.0415095090866089 -0.569831907749176 2.2265405654907227 -0.9746671915054321 0.2942226231098175 2.2543087005615234 -0.28179842233657837 0.8184005618095398 2.316667079925537 1.0415095090866089 -0.569831907749176 2.2265405654907227 -0.28179842233657837 0.8184005618095398 2.316667079925537 1.3623342514038086 0.2754985988140106 2.338076591491699 1.0415095090866089 -0.569831907749176 2.2265405654907227 1.3623342514038086 0.2754985988140106 2.338076591491699 1.7273262739181519 -0.03515663743019104 2.868044853210449 -0.12517306208610535 -0.8118021488189697 2.3724281787872314 1.0415095090866089 -0.569831907749176 2.2265405654907227 0.2796849310398102 -1.1328452825546265 3.2548670768737793 -0.28179842233657837 0.8184005618095398 2.316667079925537 -0.9746671915054321 0.2942226231098175 2.2543087005615234 -1.0752557516098022 0.6152681112289429 2.961073637008667 1.0415095090866089 -0.569831907749176 2.2265405654907227 1.7273262739181519 -0.03515663743019104 2.868044853210449 1.0458486080169678 -0.9118896722793579 3.371791124343872 -0.12517306208610535 -0.8118021488189697 2.3724281787872314 0.2796849310398102 -1.1328452825546265 3.2548670768737793 -0.9742724895477295 -0.5824383497238159 3.029498338699341 -1.1517786979675293 -0.1726759970188141 2.447442054748535 -0.9742724895477295 -0.5824383497238159 3.029498338699341 -1.0752557516098022 0.6152681112289429 2.961073637008667 -0.28179842233657837 0.8184005618095398 2.316667079925537 -1.0752557516098022 0.6152681112289429 2.961073637008667 0.12730997800827026 1.1887385845184326 3.255648136138916 1.3623342514038086 0.2754985988140106 2.338076591491699 0.9566912055015564 0.9659974575042725 2.7004194259643555 1.7273262739181519 -0.03515663743019104 2.868044853210449 0.8706090450286865 0.9305607080459595 3.419417381286621 0.12730997800827026 1.1887385845184326 3.255648136138916 0.4251575469970703 0.4323783218860626 3.831437826156616 1.4023401737213135 0.05366943031549454 3.424093246459961 0.8706090450286865 0.9305607080459595 3.419417381286621 0.4251575469970703 0.4323783218860626 3.831437826156616 0.4251575469970703 0.4323783218860626 3.831437826156616 0.12730997800827026 1.1887385845184326 3.255648136138916 -0.5269609093666077 0.5712987184524536 3.601314067840576 -0.5269609093666077 0.5712987184524536 3.601314067840576 -0.6795338988304138 -0.29053589701652527 3.6084728240966797 0.4251575469970703 0.4323783218860626 3.831437826156616 -0.6795338988304138 -0.29053589701652527 3.6084728240966797 1.0458486080169678 -0.9118896722793579 3.371791124343872 0.4251575469970703 0.4323783218860626 3.831437826156616 -0.6795338988304138 -0.29053589701652527 3.6084728240966797 0.2796849310398102 -1.1328452825546265 3.2548670768737793 1.0458486080169678 -0.9118896722793579 3.371791124343872 1.0458486080169678 -0.9118896722793579 3.371791124343872 1.4023401737213135 0.05366943031549454 3.424093246459961 0.4251575469970703 0.4323783218860626 3.831437826156616 1.7273262739181519 -0.03515663743019104 2.868044853210449 0.8706090450286865 0.9305607080459595 3.419417381286621 1.4023401737213135 0.05366943031549454 3.424093246459961 1.7273262739181519 -0.03515663743019104 2.868044853210449 0.9566912055015564 0.9659974575042725 2.7004194259643555 0.8706090450286865 0.9305607080459595 3.419417381286621 -1.0752557516098022 0.6152681112289429 2.961073637008667 -0.5269609093666077 0.5712987184524536 3.601314067840576 0.12730997800827026 1.1887385845184326 3.255648136138916 -1.0752557516098022 0.6152681112289429 2.961073637008667 -0.6795338988304138 -0.29053589701652527 3.6084728240966797 -0.5269609093666077 0.5712987184524536 3.601314067840576 -1.0752557516098022 0.6152681112289429 2.961073637008667 -0.9742724895477295 -0.5824383497238159 3.029498338699341 -0.6795338988304138 -0.29053589701652527 3.6084728240966797 -0.9742724895477295 -0.5824383497238159 3.029498338699341 0.2796849310398102 -1.1328452825546265 3.2548670768737793 -0.6795338988304138 -0.29053589701652527 3.6084728240966797 1.7273262739181519 -0.03515663743019104 2.868044853210449 1.4023401737213135 0.05366943031549454 3.424093246459961 1.0458486080169678 -0.9118896722793579 3.371791124343872 0.9566912055015564 0.9659974575042725 2.7004194259643555 0.12730997800827026 1.1887385845184326 3.255648136138916 0.8706090450286865 0.9305607080459595 3.419417381286621 0.9566912055015564 0.9659974575042725 2.7004194259643555 -0.28179842233657837 0.8184005618095398 2.316667079925537 0.12730997800827026 1.1887385845184326 3.255648136138916 -0.9746671915054321 0.2942226231098175 2.2543087005615234 -1.1517786979675293 -0.1726759970188141 2.447442054748535 -1.0752557516098022 0.6152681112289429 2.961073637008667 -1.1517786979675293 -0.1726759970188141 2.447442054748535 -0.12517306208610535 -0.8118021488189697 2.3724281787872314 -0.9742724895477295 -0.5824383497238159 3.029498338699341 0.2796849310398102 -1.1328452825546265 3.2548670768737793 1.0415095090866089 -0.569831907749176 2.2265405654907227 1.0458486080169678 -0.9118896722793579 3.371791124343872 1.3623342514038086 0.2754985988140106 2.338076591491699 -0.28179842233657837 0.8184005618095398 2.316667079925537 0.9566912055015564 0.9659974575042725 2.7004194259643555 -0.9746671915054321 0.2942226231098175 2.2543087005615234 -0.12517306208610535 -0.8118021488189697 2.3724281787872314 -1.1517786979675293 -0.1726759970188141 2.447442054748535 0.019085973501205444 0.10044439136981964 1.978877305984497 -4.76837158203125e-07 0.06063367426395416 2.7011404037475586 0.07001325488090515 -0.06063367426395416 2.7011404037475586 0.0890997052192688 -0.020822957158088684 1.978877305984497 0.0890997052192688 -0.020822957158088684 1.978877305984497 0.07001325488090515 -0.06063367426395416 2.7011404037475586 -0.07001420855522156 -0.06063365936279297 2.7011404037475586 -0.05092775821685791 -0.02082294598221779 1.978877305984497 -0.05092775821685791 -0.02082294598221779 1.978877305984497 -0.07001420855522156 -0.06063365936279297 2.7011404037475586 -4.76837158203125e-07 0.06063367426395416 2.7011404037475586 0.019085973501205444 0.10044439136981964 1.978877305984497 0.001563696889206767 0.02553631365299225 1.488599181175232 0.5195505023002625 0.024857640266418457 1.9426597356796265 0.5435490012168884 -0.04274556785821915 1.9118787050247192 0.030541352927684784 -0.03293107450008392 1.4619553089141846 0.030541352927684784 -0.03293107450008392 1.4619553089141846 0.5435490012168884 -0.04274556785821915 1.9118787050247192 0.4955519735813141 -0.04274556413292885 1.9734407663345337 -0.022714681923389435 -0.03293108195066452 1.5125154256820679 -0.022714681923389435 -0.03293108195066452 1.5125154256820679 0.4955519735813141 -0.04274556413292885 1.9734407663345337 0.5195505023002625 0.024857640266418457 1.9426597356796265 0.001563696889206767 0.02553631365299225 1.488599181175232 0.5195505023002625 0.024857640266418457 1.9426597356796265 0.4955519735813141 -0.04274556413292885 1.9734407663345337 0.947517454624176 -0.04274562746286392 2.501918077468872 0.9776248335838318 0.024857573211193085 2.4770798683166504 0.4955519735813141 -0.04274556413292885 1.9734407663345337 0.5435490012168884 -0.04274556785821915 1.9118787050247192 1.0077322721481323 -0.04274563491344452 2.4522414207458496 0.947517454624176 -0.04274562746286392 2.501918077468872 0.5435490012168884 -0.04274556785821915 1.9118787050247192 0.5195505023002625 0.024857640266418457 1.9426597356796265 0.9776248335838318 0.024857573211193085 2.4770798683166504 1.0077322721481323 -0.04274563491344452 2.4522414207458496 -0.07001420855522156 -0.06063365936279297 0.0 -0.12091141939163208 -0.11320948600769043 0.7708442211151123 -0.050897687673568726 0.008057856932282448 0.7708442211151123 -4.76837158203125e-07 0.06063367426395416 0.0 0.07001325488090515 -0.06063367426395416 0.0 0.01911604404449463 -0.11320948600769043 0.7708442211151123 -0.12091141939163208 -0.11320948600769043 0.7708442211151123 -0.07001420855522156 -0.06063365936279297 0.0 -4.76837158203125e-07 0.06063367426395416 0.0 -0.050897687673568726 0.008057856932282448 0.7708442211151123 0.01911604404449463 -0.11320948600769043 0.7708442211151123 0.07001325488090515 -0.06063367426395416 0.0 -0.07001420855522156 -0.06063365936279297 1.3748606443405151 -4.76837158203125e-07 0.06063367426395416 1.3748606443405151 0.07047217339277267 -0.0596320740878582 1.3745942115783691 0.0890997052192688 -0.020822957158088684 1.978877305984497 -0.05092775821685791 -0.02082294598221779 1.978877305984497 -0.07001420855522156 -0.06063365936279297 1.3748606443405151 -4.76837158203125e-07 0.06063367426395416 1.3748606443405151 0.019085973501205444 0.10044439136981964 1.978877305984497 0.0890997052192688 -0.020822957158088684 1.978877305984497 0.07047217339277267 -0.0596320740878582 1.3745942115783691 -0.050897687673568726 0.008057856932282448 0.7708442211151123 -4.76837158203125e-07 0.06063367426395416 1.3748606443405151 0.07047217339277267 -0.0596320740878582 1.3745942115783691 0.01911604404449463 -0.11320948600769043 0.7708442211151123 0.01911604404449463 -0.11320948600769043 0.7708442211151123 0.07047217339277267 -0.0596320740878582 1.3745942115783691 -0.07001420855522156 -0.06063365936279297 1.3748606443405151 -0.12091141939163208 -0.11320948600769043 0.7708442211151123 -0.12091141939163208 -0.11320948600769043 0.7708442211151123 -0.07001420855522156 -0.06063365936279297 1.3748606443405151 -4.76837158203125e-07 0.06063367426395416 1.3748606443405151 -0.050897687673568726 0.008057856932282448 0.7708442211151123</float_array>
				<technique_common>
				<accessor source="#id-mesh-7-positions-array" count="166" stride="3">
					<param name="X" type="float"/>
					<param name="Y" type="float"/>
					<param name="Z" type="float"/>
				</accessor>
				</technique_common>
			</source>
			<source id="id-mesh-7-normals">
				<float_array id="id-mesh-7-normals-array" count="498"> -0.08709622919559479 -0.17169375717639923 -0.9812927842140198 -0.08709622919559479 -0.17169375717639923 -0.9812927842140198 -0.08709622919559479 -0.17169375717639923 -0.9812927842140198 0.023657243698835373 0.08720697462558746 -0.9959092736244202 0.023657243698835373 0.08720697462558746 -0.9959092736244202 0.023657243698835373 0.08720697462558746 -0.9959092736244202 0.049908604472875595 0.11200636625289917 -0.992453396320343 0.049908604472875595 0.11200636625289917 -0.992453396320343 0.049908604472875595 0.11200636625289917 -0.992453396320343 0.7480412125587463 -0.20042480528354645 -0.6326644420623779 0.7480412125587463 -0.20042480528354645 -0.6326644420623779 0.7480412125587463 -0.20042480528354645 -0.6326644420623779 0.13909555971622467 -0.9083932042121887 -0.3943020701408386 0.13909555971622467 -0.9083932042121887 -0.3943020701408386 0.13909555971622467 -0.9083932042121887 -0.3943020701408386 -0.5256330966949463 0.7438903450965881 -0.41271889209747314 -0.5256330966949463 0.7438903450965881 -0.41271889209747314 -0.5256330966949463 0.7438903450965881 -0.41271889209747314 0.713103711605072 -0.6709914803504944 -0.20311014354228973 0.713103711605072 -0.6709914803504944 -0.20311014354228973 0.713103711605072 -0.6709914803504944 -0.20311014354228973 -0.3720994293689728 -0.913981556892395 -0.16180162131786346 -0.3720994293689728 -0.913981556892395 -0.16180162131786346 -0.3720994293689728 -0.913981556892395 -0.16180162131786346 -0.9665821194648743 -0.06736526638269424 0.24734801054000854 -0.9665821194648743 -0.06736526638269424 0.24734801054000854 -0.9665821194648743 -0.06736526638269424 0.24734801054000854 -0.3846381604671478 0.9035568237304688 -0.18878190219402313 -0.3846381604671478 0.9035568237304688 -0.18878190219402313 -0.3846381604671478 0.9035568237304688 -0.18878190219402313 0.7915781736373901 0.5744125247001648 -0.20845700800418854 0.7915781736373901 0.5744125247001648 -0.20845700800418854 0.7915781736373901 0.5744125247001648 -0.20845700800418854 0.04021413251757622 0.6152081489562988 0.7873384952545166 0.04021413251757622 0.6152081489562988 0.7873384952545166 0.04021413251757622 0.6152081489562988 0.7873384952545166 0.46056821942329407 0.2837647497653961 0.8410437703132629 0.46056821942329407 0.2837647497653961 0.8410437703132629 0.46056821942329407 0.2837647497653961 0.8410437703132629 -0.11245915293693542 0.5734622478485107 0.8114763498306274 -0.11245915293693542 0.5734622478485107 0.8114763498306274 -0.11245915293693542 0.5734622478485107 0.8114763498306274 -0.22797366976737976 0.04843645170331001 0.9724617600440979 -0.22797366976737976 0.04843645170331001 0.9724617600440979 -0.22797366976737976 0.04843645170331001 0.9724617600440979 0.01596822962164879 -0.31688952445983887 0.9483279585838318 0.01596822962164879 -0.31688952445983887 0.9483279585838318 0.01596822962164879 -0.31688952445983887 0.9483279585838318 -0.02167251519858837 -0.40787115693092346 0.9127821922302246 -0.02167251519858837 -0.40787115693092346 0.9127821922302246 -0.02167251519858837 -0.40787115693092346 0.9127821922302246 0.32250669598579407 -0.1695164442062378 0.9312644600868225 0.32250669598579407 -0.1695164442062378 0.9312644600868225 0.32250669598579407 -0.1695164442062378 0.9312644600868225 0.788552463054657 0.4802123010158539 0.38416293263435364 0.788552463054657 0.4802123010158539 0.38416293263435364 0.788552463054657 0.4802123010158539 0.38416293263435364 0.7762747406959534 0.6181973218917847 0.12340826541185379 0.7762747406959534 0.6181973218917847 0.12340826541185379 0.7762747406959534 0.6181973218917847 0.12340826541185379 -0.4716258943080902 0.7548983693122864 0.45573848485946655 -0.4716258943080902 0.7548983693122864 0.45573848485946655 -0.4716258943080902 0.7548983693122864 0.45573848485946655 -0.747605562210083 0.1377473622560501 0.6497012972831726 -0.747605562210083 0.1377473622560501 0.6497012972831726 -0.747605562210083 0.1377473622560501 0.6497012972831726 -0.8803403377532959 -0.04726063087582588 0.4719823896884918 -0.8803403377532959 -0.04726063087582588 0.4719823896884918 -0.8803403377532959 -0.04726063087582588 0.4719823896884918 -0.4141095280647278 -0.7104569673538208 0.5690027475357056 -0.4141095280647278 -0.7104569673538208 0.5690027475357056 -0.4141095280647278 -0.7104569673538208 0.5690027475357056 0.7943567633628845 -0.3212100565433502 0.5155786275863647 0.7943567633628845 -0.3212100565433502 0.5155786275863647 0.7943567633628845 -0.3212100565433502 0.5155786275863647 0.31042373180389404 0.9468944072723389 0.08383415639400482 0.31042373180389404 0.9468944072723389 0.08383415639400482 0.31042373180389404 0.9468944072723389 0.08383415639400482 0.0032605871092528105 0.9297703504562378 -0.36812564730644226 0.0032605871092528105 0.9297703504562378 -0.36812564730644226 0.0032605871092528105 0.9297703504562378 -0.36812564730644226 -0.9353837370872498 0.2523418664932251 -0.24775166809558868 -0.9353837370872498 0.2523418664932251 -0.24775166809558868 -0.9353837370872498 0.2523418664932251 -0.24775166809558868 -0.5075191259384155 -0.7697720527648926 -0.38713744282722473 -0.5075191259384155 -0.7697720527648926 -0.38713744282722473 -0.5075191259384155 -0.7697720527648926 -0.38713744282722473 0.30484336614608765 -0.9122509360313416 -0.2736215591430664 0.30484336614608765 -0.9122509360313416 -0.2736215591430664 0.30484336614608765 -0.9122509360313416 -0.2736215591430664 0.18937017023563385 0.5411825180053711 -0.8193048238754272 0.18937017023563385 0.5411825180053711 -0.8193048238754272 0.18937017023563385 0.5411825180053711 -0.8193048238754272 -0.24735170602798462 -0.288756400346756 -0.9248982667922974 -0.24735170602798462 -0.288756400346756 -0.9248982667922974 -0.24735170602798462 -0.288756400346756 -0.9248982667922974 0.8649256229400635 0.49936506152153015 0.05038115009665489 0.8649256229400635 0.49936506152153015 0.05038115009665489 0.8649256229400635 0.49936506152153015 0.05038115009665489 0.8649256229400635 0.49936506152153015 0.05038115009665489 -7.355678377507502e-08 -0.9984843730926514 -0.055035874247550964 -7.355678377507502e-08 -0.9984843730926514 -0.055035874247550964 -7.355678377507502e-08 -0.9984843730926514 -0.055035874247550964 -7.355678377507502e-08 -0.9984843730926514 -0.055035874247550964 -0.8660252690315247 0.49999988079071045 -0.000476124812848866 -0.8660159707069397 0.49999454617500305 0.004674158524721861 -0.8660159707069397 0.49999454617500305 0.004674158524721861 -0.8660253882408142 0.4999999701976776 -0.0004372501280158758 0.5634456872940063 0.5266887545585632 -0.6364964842796326 0.5634456872940063 0.5266887545585632 -0.6364964842796326 0.5634456872940063 0.5266887545585632 -0.6364964842796326 0.5634456872940063 0.5266887545585632 -0.6364964842796326 -0.010587241500616074 -0.9998983144760132 -0.009561029262840748 -0.010587241500616074 -0.9998983144760132 -0.009561029262840748 -0.010587241500616074 -0.9998983144760132 -0.009561029262840748 -0.010587241500616074 -0.9998983144760132 -0.009561029262840748 -0.5700225234031677 0.5008625388145447 0.6513147354125977 -0.5700225234031677 0.5008625388145447 0.6513147354125977 -0.5700225234031677 0.5008625388145447 0.6513147354125977 -0.5700225234031677 0.5008625388145447 0.6513147354125977 -0.6595051288604736 0.4961976110935211 0.5646599531173706 -0.6595051288604736 0.4961976110935211 0.5646599531173706 -0.6595051288604736 0.4961976110935211 0.5646599531173706 -0.6595051288604736 0.4961976110935211 0.5646599531173706 -1.2156459661127883e-07 -0.9999999403953552 0.0 -1.2156459661127883e-07 -0.9999999403953552 0.0 -1.2156459661127883e-07 -0.9999999403953552 0.0 -1.2156459661127883e-07 -0.9999999403953552 0.0 0.6588700413703918 0.49623507261276245 -0.5653679966926575 0.6588700413703918 0.49623507261276245 -0.5653679966926575 0.6588700413703918 0.49623507261276245 -0.5653679966926575 0.6588700413703918 0.49623507261276245 -0.5653679966926575 -0.8657948970794678 0.49986690282821655 -0.023072928190231323 -0.8657948970794678 0.49986690282821655 -0.023072928190231323 -0.8657948970794678 0.49986690282821655 -0.023072928190231323 -0.8657948970794678 0.49986690282821655 -0.023072928190231323 -5.164921290656821e-08 -0.9976820945739746 -0.0680474042892456 -5.164921290656821e-08 -0.9976820945739746 -0.0680474042892456 -5.164921290656821e-08 -0.9976820945739746 -0.0680474042892456 -5.164921290656821e-08 -0.9976820945739746 -0.0680474042892456 0.8624395132064819 0.4979296624660492 0.09090659767389297 0.8624395132064819 0.4979296624660492 0.09090659767389297 0.8624395132064819 0.4979296624660492 0.09090659767389297 0.8624395132064819 0.4979296624660492 0.09090659767389297 -0.8660118579864502 0.49999216198921204 -0.005589175038039684 -0.8660118579864502 0.49999216198921204 -0.005589175038039684 0.0036245733499526978 -0.9978906512260437 0.06481611728668213 0.0036245733499526978 -0.9978906512260437 0.06481611728668213 0.0036245733499526978 -0.9978906512260437 0.06481611728668213 0.0036245733499526978 -0.9978906512260437 0.06481611728668213 0.8628488779067993 0.5019370317459106 -0.0595909021794796 0.8628488779067993 0.5019370317459106 -0.0595909021794796 0.8628488779067993 0.5019370317459106 -0.0595909021794796 0.8628488779067993 0.5019370317459106 -0.0595909021794796 0.8584637641906738 0.4994492828845978 -0.11657796055078506 0.8584637641906738 0.4994492828845978 -0.11657796055078506 0.8584637641906738 0.4994492828845978 -0.11657796055078506 0.8584637641906738 0.4994492828845978 -0.11657796055078506 0.003639751812443137 -0.9961799383163452 0.08724826574325562 0.003639751812443137 -0.9961799383163452 0.08724826574325562 0.003639751812443137 -0.9961799383163452 0.08724826574325562 0.003639751812443137 -0.9961799383163452 0.08724826574325562 -0.865649938583374 0.49978333711624146 0.029440686106681824 -0.865649938583374 0.49978333711624146 0.029440686106681824 -0.865649938583374 0.49978333711624146 0.029440686106681824 -0.865649938583374 0.49978333711624146 0.029440686106681824</float_array>
				<technique_common>
				<accessor source="#id-mesh-7-normals-array" count="166" stride="3">
					<param name="X" type="float"/>
					<param name="Y" type="float"/>
					<param name="Z" type="float"/>
				</accessor>
				</technique_common>
			</source>
			<source id="id-mesh-7-texcoord-0">
				<float_array id="id-mesh-7-texcoord-0-array" count="332"> 0.4075421094894409 0.8258984684944153 0.41599664092063904 0.7933578491210938 0.43801137804985046 0.7934526801109314 0.4075421094894409 0.8258984684944153 0.43801137804985046 0.7934526801109314 0.43788841366767883 0.8199971318244934 0.4075421094894409 0.8258984684944153 0.43788841366767883 0.8199971318244934 0.4151062071323395 0.8495096564292908 0.4075421094894409 0.8258984684944153 0.4151062071323395 0.8495096564292908 0.4081355333328247 0.8528997302055359 0.4249194860458374 0.8857027292251587 0.4261830449104309 0.9208821654319763 0.4099474549293518 0.8963460922241211 0.37956464290618896 0.9057401418685913 0.37406671047210693 0.8842918872833252 0.3860478103160858 0.8824740052223206 0.4261830449104309 0.9208821654319763 0.41619083285331726 0.9386878609657288 0.4075421094894409 0.9187310934066772 0.4249194860458374 0.8857027292251587 0.4099474549293518 0.8963460922241211 0.41606324911117554 0.8576696515083313 0.3737661838531494 0.8680855631828308 0.3802577555179596 0.8533824682235718 0.3860478103160858 0.8824740052223206 0.37956464290618896 0.9057401418685913 0.3860478103160858 0.8824740052223206 0.3963431417942047 0.9091632962226868 0.4261830747127533 0.8964381814002991 0.43198615312576294 0.8720760941505432 0.43447062373161316 0.9104854464530945 0.3737661838531494 0.8170126676559448 0.3748447895050049 0.7936394214630127 0.3822675049304962 0.8084267973899841 0.3833559453487396 0.8414903283119202 0.3737661838531494 0.8170126676559448 0.3822675049304962 0.8084267973899841 0.3822675049304962 0.8084267973899841 0.3748447895050049 0.7936394214630127 0.38648632168769836 0.7806032299995422 0.38648632168769836 0.7806032299995422 0.39981192350387573 0.7854750752449036 0.3822675049304962 0.8084267973899841 0.39981192350387573 0.7854750752449036 0.399547278881073 0.8418635129928589 0.3822675049304962 0.8084267973899841 0.39981192350387573 0.7854750752449036 0.4075421094894409 0.8228267431259155 0.399547278881073 0.8418635129928589 0.399547278881073 0.8418635129928589 0.3833559453487396 0.8414903283119202 0.3822675049304962 0.8084267973899841 0.43447062373161316 0.9104854464530945 0.4434571862220764 0.8717023134231567 0.4434571862220764 0.9029859900474548 0.43447062373161316 0.9104854464530945 0.43198615312576294 0.8720760941505432 0.4434571862220764 0.8717023134231567 0.3860478103160858 0.8824740052223206 0.3963431417942047 0.8810624480247498 0.3963431417942047 0.9091632962226868 0.3860478103160858 0.8824740052223206 0.3910684883594513 0.857630729675293 0.3963431417942047 0.8810624480247498 0.3860478103160858 0.8824740052223206 0.3802577555179596 0.8533824682235718 0.3910684883594513 0.857630729675293 0.4075421094894409 0.7820094227790833 0.4075421094894409 0.8228267431259155 0.39981192350387573 0.7854750752449036 0.3844901919364929 0.8533824682235718 0.3833559453487396 0.8414903283119202 0.399547278881073 0.8418635129928589 0.43198615312576294 0.8720760941505432 0.44120845198631287 0.8528997302055359 0.4434571862220764 0.8717023134231567 0.43198615312576294 0.8720760941505432 0.4266267716884613 0.8556293845176697 0.44120845198631287 0.8528997302055359 0.37406671047210693 0.8842918872833252 0.3737661838531494 0.8680855631828308 0.3860478103160858 0.8824740052223206 0.4261830747127533 0.8528997302055359 0.4249194860458374 0.8857027292251587 0.41606324911117554 0.8576696515083313 0.4099474549293518 0.8963460922241211 0.4261830449104309 0.9208821654319763 0.4075421094894409 0.9187310934066772 0.4151062071323395 0.8495096564292908 0.43788841366767883 0.8199971318244934 0.4280252158641815 0.8528997302055359 0.43801137804985046 0.7934526801109314 0.41599664092063904 0.7933578491210938 0.434059739112854 0.7806032299995422 0.7560160160064697 0.8584211468696594 0.7564911842346191 0.8363643288612366 0.7587138414382935 0.8363958597183228 0.758238673210144 0.8584527373313904 0.7560160160064697 0.8962638974189758 0.7556774616241455 0.9183047413825989 0.7534611225128174 0.918310284614563 0.7537996768951416 0.8962695002555847 0.7507476806640625 0.8584218621253967 0.7497909069061279 0.8364490270614624 0.7520121335983276 0.8363643288612366 0.7529689073562622 0.8583371043205261 0.7059735655784607 0.8368470668792725 0.7054331302642822 0.8526039719581604 0.7042281627655029 0.852820098400116 0.704867959022522 0.8370905518531799 0.7030618190765381 0.8789395689964294 0.7022485136985779 0.8583295941352844 0.7034775614738464 0.8580208420753479 0.7042281627655029 0.8789793848991394 0.7075896263122559 0.8368470668792725 0.7072010040283203 0.8518744707107544 0.7059735655784607 0.8519384860992432 0.70652174949646 0.8369935154914856 0.7059735655784607 0.8519384860992432 0.7072010040283203 0.8518744707107544 0.7075896263122559 0.868586540222168 0.7063595056533813 0.868843138217926 0.7034775614738464 0.8580208420753479 0.7022485136985779 0.8583295941352844 0.7029926776885986 0.8368470668792725 0.7042281627655029 0.8370534777641296 0.7042281627655029 0.852820098400116 0.7054331302642822 0.8526039719581604 0.7059735655784607 0.8700857162475586 0.7047667503356934 0.8705033659934998 0.7507476806640625 0.9187424778938293 0.749362587928772 0.8952735662460327 0.7515838146209717 0.8951888680458069 0.7529689073562622 0.9186577796936035 0.7560160160064697 0.8363643288612366 0.7551852464675903 0.8599218130111694 0.7529689073562622 0.8599273562431335 0.7537996768951416 0.8363698720932007 0.7561076879501343 0.9187129735946655 0.7564911842346191 0.8951337933540344 0.7587138414382935 0.8951653242111206 0.7583303451538086 0.9187445044517517 0.7502606511116028 0.876855731010437 0.7524819374084473 0.8767709732055664 0.7558495998382568 0.8780600428581238 0.7560160160064697 0.8962638974189758 0.7537996768951416 0.8962695002555847 0.7536274194717407 0.87807697057724 0.7563028931617737 0.8767980933189392 0.7560160160064697 0.8584211468696594 0.758238673210144 0.8584527373313904 0.7585159540176392 0.8768386840820312 0.7564911842346191 0.8951337933540344 0.7563028931617737 0.8767980933189392 0.7585159540176392 0.8768386840820312 0.7587138414382935 0.8951653242111206 0.7551852464675903 0.8599218130111694 0.7558495998382568 0.8780600428581238 0.7536274194717407 0.87807697057724 0.7529689073562622 0.8599273562431335 0.749362587928772 0.8952735662460327 0.7502606511116028 0.876855731010437 0.7524819374084473 0.8767709732055664 0.7515838146209717 0.8951888680458069</float_array>
				<technique_common>
				<accessor source="#id-mesh-7-texcoord-0-array" count="166" stride="2">
					<param name="S" type="float"/>
					<param name="T" type="float"/>
				</accessor>
				</technique_common>
			</source>
			<vertices id="id-mesh-7-vertices">
				<input semantic="POSITION" source="#id-mesh-7-positions"/>
			</vertices>
			<polygons count="50" material="id-trimat-8">
				<input semantic="VERTEX" source="#id-mesh-7-vertices" offset="0"/>
				<input semantic="NORMAL" source="#id-mesh-7-normals" offset="0"/>
				<input semantic="TEXCOORD" source="#id-mesh-7-texcoord-0" offset="0" set="0"/>
				<p> 0 1 2 </p>
				<p> 3 4 5 </p>
				<p> 6 7 8 </p>
				<p> 9 10 11 </p>
				<p> 12 13 14 </p>
				<p> 15 16 17 </p>
				<p> 18 19 20 </p>
				<p> 21 22 23 </p>
				<p> 24 25 26 </p>
				<p> 27 28 29 </p>
				<p> 30 31 32 </p>
				<p> 33 34 35 </p>
				<p> 36 37 38 </p>
				<p> 39 40 41 </p>
				<p> 42 43 44 </p>
				<p> 45 46 47 </p>
				<p> 48 49 50 </p>
				<p> 51 52 53 </p>
				<p> 54 55 56 </p>
				<p> 57 58 59 </p>
				<p> 60 61 62 </p>
				<p> 63 64 65 </p>
				<p> 66 67 68 </p>
				<p> 69 70 71 </p>
				<p> 72 73 74 </p>
				<p> 75 76 77 </p>
				<p> 78 79 80 </p>
				<p> 81 82 83 </p>
				<p> 84 85 86 </p>
				<p> 87 88 89 </p>
				<p> 90 91 92 </p>
				<p> 93 94 95 </p>
				<p> 96 97 98 99 </p>
				<p> 100 101 102 103 </p>
				<p> 104 105 106 107 </p>
				<p> 108 109 110 111 </p>
				<p> 112 113 114 115 </p>
				<p> 116 117 118 119 </p>
				<p> 120 121 122 123 </p>
				<p> 124 125 126 127 </p>
				<p> 128 129 130 131 </p>
				<p> 132 133 134 135 </p>
				<p> 136 137 138 139 </p>
				<p> 140 141 142 143 </p>
				<p> 144 104 107 145 </p>
				<p> 146 147 148 149 </p>
				<p> 150 151 152 153 </p>
				<p> 154 155 156 157 </p>
				<p> 158 159 160 161 </p>
				<p> 162 163 164 165 </p>
			</polygons>
		</mesh>
	</geometry>
</library_geometries>
<library_visual_scenes>
	<visual_scene id="id-scene-1" name="scene">
		<node id="Bush_02" name="Bush_02" type="NODE">
			<matrix sid="transform"> 0.25124794244766235 0.0 0.0 -0.0036582909524440765 0.0 0.25124794244766235 4.093348593414703e-08 -0.018293067812919617 0.0 -4.093348593414703e-08 0.25124794244766235 -0.03912913799285889 0.0 0.0 0.0 1.0  </matrix>
			<instance_geometry url="#id-mesh-7">
				<bind_material>
					<technique_common>
						<instance_material symbol="id-trimat-8" target="#id-material-6"/>
					</technique_common>
				</bind_material>
			</instance_geometry>
		</node>
	</visual_scene>
</library_visual_scenes>
<scene>
	<instance_visual_scene url="#id-scene-1" />
</scene>
</COLLADA>
