<?xml version="1.0" encoding="utf-8"?>
<COLLADA xmlns="http://www.collada.org/2005/11/COLLADASchema" version="1.4.1">
<asset>
	<contributor>
		<author>Anonymous</author>
		<authoring_tool>Collada Exporter for Blender 2.6+, by Juan Linietsky (juan@codenix.com)</authoring_tool>
	</contributor>
	<created>2019-05-05T16:01:14Z</created>
	<modified>2019-05-05T16:01:14Z</modified>
	<unit meter="1.0" name="meter"/>
	<up_axis>Z_UP</up_axis>
</asset>
<library_images>
	<image id="id-image-3" name="Palette.png">
		<init_from>../../concepts/3D/LowPolyPack/Palette.png</init_from>
	</image>
</library_images>
<library_effects>
	<effect id="id-fx-2" name="Material.001-fx">
		<profile_COMMON>
			<newparam sid="id-fx_surf-4">
				<surface type="2D">
					<init_from>id-image-3</init_from>
					<format>A8R8G8B8</format>
				</surface>
			</newparam>
			<newparam sid="id-fx_sampler-5">
				<sampler2D>
					<source>id-fx_surf-4</source>
				</sampler2D>
			</newparam>
			<technique sid="common">
				<blinn>
					<emission>
						<color>  0.0 0.0 0.0 1.0 </color>
					</emission>
					<ambient>
						<color>  0.0 0.0 0.0 1.0 </color>
					</ambient>
					<diffuse>
						<texture texture="id-fx_sampler-5" texcoord="CHANNEL1"/>
					</diffuse>
					<specular>
						<color>  0.5 0.5 0.5 1.0 </color>
					</specular>
					<shininess>
						<float>50</float>
					</shininess>
					<reflective>
						<color>  1.0 1.0 1.0 1.0 </color>
					</reflective>
					<index_of_refraction>
						<float>4.0</float>
					</index_of_refraction>
				</blinn>
				<extra>
					<technique profile="FCOLLADA">
					</technique>
					<technique profile="GOOGLEEARTH">
						<double_sided>0</double_sided>
					</technique>
				</extra>
			</technique>
		</profile_COMMON>
	</effect>
</library_effects>
<library_materials>
	<material id="id-material-6" name="Material.001">
		<instance_effect url="#id-fx-2"/>
	</material>
</library_materials>
<library_geometries>
	<geometry id="id-mesh-7" name="Sphere.010">
		<mesh>
			<source id="id-mesh-7-positions">
				<float_array id="id-mesh-7-positions-array" count="252"> 0.6339614987373352 -0.17694997787475586 -0.6750622987747192 0.43877536058425903 0.5376489758491516 -0.5688883662223816 0.7647671103477478 0.5776286721229553 0.09783130884170532 0.8655455708503723 -0.21077728271484375 -0.24658486247062683 0.5823878645896912 0.6587921977043152 0.3462042808532715 0.45121726393699646 0.7108002305030823 0.48662903904914856 0.6421149969100952 0.11902002990245819 0.4839416742324829 -0.3606700003147125 0.25052934885025024 0.8933212161064148 0.20703306794166565 0.7798522114753723 0.5813992023468018 -0.12727753818035126 0.8125831484794617 0.34018823504447937 -0.7555684447288513 0.2876517176628113 0.5768318772315979 -0.7218905091285706 -0.3164036273956299 -0.4893827438354492 -0.10474736243486404 -0.8925385475158691 -0.31168121099472046 -0.09563510119915009 -0.9216000437736511 -0.2067296952009201 -0.4454755485057831 -0.7401279807090759 0.41499748826026917 -0.7315584421157837 -0.4641093611717224 0.28808867931365967 -0.3606700003147125 0.25052934885025024 0.8933212161064148 -0.7555684447288513 0.2876517176628113 0.5768318772315979 -0.9006907343864441 0.1480216234922409 0.3975418210029602 -0.7315584421157837 -0.4641093611717224 0.28808867931365967 -0.4454755485057831 -0.7401279807090759 0.41499748826026917 -0.06788472086191177 -0.43108710646629333 0.8591923713684082 -0.09563510119915009 -0.9216000437736511 -0.2067296952009201 0.7557538151741028 -0.5389196276664734 0.10095983743667603 0.6148872375488281 -0.3710918128490448 0.560602068901062 -0.06788472086191177 -0.43108710646629333 0.8591923713684082 -0.4454755485057831 -0.7401279807090759 0.41499748826026917 0.7647671103477478 0.5776286721229553 0.09783130884170532 0.5823878645896912 0.6587921977043152 0.3462042808532715 0.6421149969100952 0.11902002990245819 0.4839416742324829 0.6148872375488281 -0.3710918128490448 0.560602068901062 0.7557538151741028 -0.5389196276664734 0.10095983743667603 0.8655455708503723 -0.21077728271484375 -0.24658486247062683 0.26439476013183594 -0.5314096212387085 -0.7767715454101562 0.6339614987373352 -0.17694997787475586 -0.6750622987747192 0.8655455708503723 -0.21077728271484375 -0.24658486247062683 0.7557538151741028 -0.5389196276664734 0.10095983743667603 0.26439476013183594 -0.5314096212387085 -0.7767715454101562 -0.2494543194770813 -0.159827321767807 -0.8371926546096802 0.43877536058425903 0.5376489758491516 -0.5688883662223816 0.6339614987373352 -0.17694997787475586 -0.6750622987747192 -0.7315584421157837 -0.4641093611717224 0.28808867931365967 -0.9006907343864441 0.1480216234922409 0.3975418210029602 -0.8855864405632019 0.14364159107208252 0.1754949390888214 -0.7465429306030273 -0.2047117054462433 -0.5682764053344727 -0.7218905091285706 -0.3164036273956299 -0.4893827438354492 -0.7465429306030273 -0.2047117054462433 -0.5682764053344727 -0.8855864405632019 0.14364159107208252 0.1754949390888214 -0.2734844386577606 0.626316487789154 -0.42071694135665894 -0.5754741430282593 -0.08039852231740952 -0.7489620447158813 -0.7555684447288513 0.2876517176628113 0.5768318772315979 -0.12727753818035126 0.8125831484794617 0.34018823504447937 -0.18683309853076935 0.7034922242164612 -0.39252641797065735 -0.2734844386577606 0.626316487789154 -0.42071694135665894 -0.8855864405632019 0.14364159107208252 0.1754949390888214 -0.9006907343864441 0.1480216234922409 0.3975418210029602 0.20703306794166565 0.7798522114753723 0.5813992023468018 0.45121726393699646 0.7108002305030823 0.48662903904914856 0.5823878645896912 0.6587921977043152 0.3462042808532715 0.7647671103477478 0.5776286721229553 0.09783130884170532 0.43877536058425903 0.5376489758491516 -0.5688883662223816 -0.18683309853076935 0.7034922242164612 -0.39252641797065735 -0.12727753818035126 0.8125831484794617 0.34018823504447937 0.43877536058425903 0.5376489758491516 -0.5688883662223816 -0.2494543194770813 -0.159827321767807 -0.8371926546096802 -0.5754741430282593 -0.08039852231740952 -0.7489620447158813 -0.2734844386577606 0.626316487789154 -0.42071694135665894 -0.18683309853076935 0.7034922242164612 -0.39252641797065735 -0.5754741430282593 -0.08039852231740952 -0.7489620447158813 -0.2494543194770813 -0.159827321767807 -0.8371926546096802 0.26439476013183594 -0.5314096212387085 -0.7767715454101562 -0.10474736243486404 -0.8925385475158691 -0.31168121099472046 -0.7218905091285706 -0.3164036273956299 -0.4893827438354492 -0.7465429306030273 -0.2047117054462433 -0.5682764053344727 0.7557538151741028 -0.5389196276664734 0.10095983743667603 -0.09563510119915009 -0.9216000437736511 -0.2067296952009201 -0.10474736243486404 -0.8925385475158691 -0.31168121099472046 0.26439476013183594 -0.5314096212387085 -0.7767715454101562 0.45121726393699646 0.7108002305030823 0.48662903904914856 0.20703306794166565 0.7798522114753723 0.5813992023468018 -0.3606700003147125 0.25052934885025024 0.8933212161064148 -0.06788472086191177 -0.43108710646629333 0.8591923713684082 0.6148872375488281 -0.3710918128490448 0.560602068901062 0.6421149969100952 0.11902002990245819 0.4839416742324829</float_array>
				<technique_common>
				<accessor source="#id-mesh-7-positions-array" count="84" stride="3">
					<param name="X" type="float"/>
					<param name="Y" type="float"/>
					<param name="Z" type="float"/>
				</accessor>
				</technique_common>
			</source>
			<source id="id-mesh-7-normals">
				<float_array id="id-mesh-7-normals-array" count="252"> 0.8500892519950867 0.29764384031295776 -0.4344610273838043 0.8500892519950867 0.29764384031295776 -0.4344610273838043 0.8500892519950867 0.29764384031295776 -0.4344610273838043 0.8500892519950867 0.29764384031295776 -0.4344610273838043 0.7521695494651794 0.23984922468662262 0.6137697696685791 0.7521695494651794 0.23984922468662262 0.6137697696685791 0.7521695494651794 0.23984922468662262 0.6137697696685791 -0.37336981296539307 0.7248303890228271 0.5789782404899597 -0.37336981296539307 0.7248303890228271 0.5789782404899597 -0.37336981296539307 0.7248303890228271 0.5789782404899597 -0.37336981296539307 0.7248303890228271 0.5789782404899597 -0.6514118313789368 -0.7438653707504272 -0.14942152798175812 -0.6514118313789368 -0.7438653707504272 -0.14942152798175812 -0.6514118313789368 -0.7438653707504272 -0.14942152798175812 -0.6514118313789368 -0.7438653707504272 -0.14942152798175812 -0.6514118313789368 -0.7438653707504272 -0.14942152798175812 -0.6135715842247009 -0.30012717843055725 0.730379045009613 -0.6135715842247009 -0.30012717843055725 0.730379045009613 -0.6135715842247009 -0.30012717843055725 0.730379045009613 -0.6135715842247009 -0.30012717843055725 0.730379045009613 -0.6135715842247009 -0.30012717843055725 0.730379045009613 -0.6135715842247009 -0.30012717843055725 0.730379045009613 0.2520102262496948 -0.8815842270851135 0.3991240859031677 0.2520102262496948 -0.8815842270851135 0.3991240859031677 0.2520102262496948 -0.8815842270851135 0.3991240859031677 0.2520102262496948 -0.8815842270851135 0.3991240859031677 0.2520102262496948 -0.8815842270851135 0.3991240859031677 0.9436461925506592 0.025440076366066933 0.3299766480922699 0.9436461925506592 0.025440076366066933 0.3299766480922699 0.9436461925506592 0.025440076366066933 0.3299766480922699 0.9436461925506592 0.025440076366066933 0.3299766480922699 0.9436461925506592 0.025440076366066933 0.3299766480922699 0.9436461925506592 0.025440076366066933 0.3299766480922699 0.6787188053131104 -0.618973970413208 -0.3952368199825287 0.6787188053131104 -0.618973970413208 -0.3952368199825287 0.6787188053131104 -0.618973970413208 -0.3952368199825287 0.6787188053131104 -0.618973970413208 -0.3952368199825287 0.18119430541992188 0.15915898978710175 -0.9704828262329102 0.18119430541992188 0.15915898978710175 -0.9704828262329102 0.18119430541992188 0.15915898978710175 -0.9704828262329102 0.18119430541992188 0.15915898978710175 -0.9704828262329102 -0.9648416638374329 -0.25575336813926697 -0.06058647111058235 -0.9648416638374329 -0.25575336813926697 -0.06058647111058235 -0.9648416638374329 -0.25575336813926697 -0.06058647111058235 -0.9648416638374329 -0.25575336813926697 -0.06058647111058235 -0.9648416638374329 -0.25575336813926697 -0.06058647111058235 -0.7723252177238464 0.5074829459190369 -0.382066547870636 -0.7723252177238464 0.5074829459190369 -0.382066547870636 -0.7723252177238464 0.5074829459190369 -0.382066547870636 -0.7723252177238464 0.5074829459190369 -0.382066547870636 -0.6530949473381042 0.7549492120742798 -0.05931729078292847 -0.6530949473381042 0.7549492120742798 -0.05931729078292847 -0.6530949473381042 0.7549492120742798 -0.05931729078292847 -0.6530949473381042 0.7549492120742798 -0.05931729078292847 -0.6530949473381042 0.7549492120742798 -0.05931729078292847 -0.6530949473381042 0.7549492120742798 -0.05931729078292847 0.21034207940101624 0.9643343091011047 -0.1606726199388504 0.21034207940101624 0.9643343091011047 -0.1606726199388504 0.21034207940101624 0.9643343091011047 -0.1606726199388504 0.21034207940101624 0.9643343091011047 -0.1606726199388504 0.21034207940101624 0.9643343091011047 -0.1606726199388504 0.21034207940101624 0.9643343091011047 -0.1606726199388504 0.21034207940101624 0.9643343091011047 -0.1606726199388504 -0.12526215612888336 0.4614555537700653 -0.8782756924629211 -0.12526215612888336 0.4614555537700653 -0.8782756924629211 -0.12526215612888336 0.4614555537700653 -0.8782756924629211 -0.12526215612888336 0.4614555537700653 -0.8782756924629211 -0.12526215612888336 0.4614555537700653 -0.8782756924629211 -0.34174543619155884 -0.5913577079772949 -0.7304150462150574 -0.34174543619155884 -0.5913577079772949 -0.7304150462150574 -0.34174543619155884 -0.5913577079772949 -0.7304150462150574 -0.34174543619155884 -0.5913577079772949 -0.7304150462150574 -0.34174543619155884 -0.5913577079772949 -0.7304150462150574 -0.34174543619155884 -0.5913577079772949 -0.7304150462150574 0.47473087906837463 -0.836747944355011 -0.27291661500930786 0.47473087906837463 -0.836747944355011 -0.27291661500930786 0.47473087906837463 -0.836747944355011 -0.27291661500930786 0.47473087906837463 -0.836747944355011 -0.27291661500930786 0.38876044750213623 0.1212596520781517 0.9133244156837463 0.38876044750213623 0.1212596520781517 0.9133244156837463 0.38876044750213623 0.1212596520781517 0.9133244156837463 0.38876044750213623 0.1212596520781517 0.9133244156837463 0.38876044750213623 0.1212596520781517 0.9133244156837463 0.38876044750213623 0.1212596520781517 0.9133244156837463</float_array>
				<technique_common>
				<accessor source="#id-mesh-7-normals-array" count="84" stride="3">
					<param name="X" type="float"/>
					<param name="Y" type="float"/>
					<param name="Z" type="float"/>
				</accessor>
				</technique_common>
			</source>
			<source id="id-mesh-7-texcoord-0">
				<float_array id="id-mesh-7-texcoord-0-array" count="168"> 0.7393965125083923 0.499918133020401 0.7373598217964172 0.483205109834671 0.7509940266609192 0.47970953583717346 0.7485244274139404 0.49903520941734314 0.7504140734672546 0.5332063436508179 0.74741530418396 0.5357009172439575 0.7460052967071533 0.5217680931091309 0.7139866352081299 0.46935465931892395 0.7286138534545898 0.47618570923805237 0.7249923944473267 0.4802052676677704 0.7097005844116211 0.4748024046421051 0.7568909525871277 0.5191271305084229 0.77287757396698 0.5221478939056396 0.7735375165939331 0.5240074396133423 0.7674684524536133 0.5351094007492065 0.7598732709884644 0.5329192876815796 0.41935601830482483 0.7988163232803345 0.4140608608722687 0.7892987728118896 0.41436734795570374 0.7832237482070923 0.4253970682621002 0.7772738933563232 0.43289414048194885 0.7799795866012573 0.43289414048194885 0.7948737144470215 0.3747842013835907 0.8092175722122192 0.38610127568244934 0.8267298936843872 0.3796778619289398 0.8352357149124146 0.365741103887558 0.8333719968795776 0.3634650409221649 0.8187320232391357 0.7551337480545044 0.5294605493545532 0.7504140734672546 0.5332063436508179 0.7460052967071533 0.5217680931091309 0.7414793372154236 0.5120227336883545 0.7474927306175232 0.5064809322357178 0.7551337480545044 0.5116615295410156 0.7353280782699585 0.5064809322357178 0.7393965125083923 0.499918133020401 0.7485244274139404 0.49903520941734314 0.7540136575698853 0.5034300088882446 0.7353280782699585 0.5064809322357178 0.7286138534545898 0.4967031180858612 0.7373598217964172 0.483205109834671 0.7393965125083923 0.499918133020401 0.7653498649597168 0.4798186123371124 0.7543201446533203 0.48576846718788147 0.7540609836578369 0.4825432002544403 0.7592966556549072 0.46935465931892395 0.7614601850509644 0.46969112753868103 0.7034177780151367 0.5018628835678101 0.7062320709228516 0.4837169349193573 0.7208828926086426 0.4971274435520172 0.7073704600334167 0.5059597492218018 0.7097005844116211 0.4748024046421051 0.7249923944473267 0.4802052676677704 0.7230329513549805 0.4965173900127411 0.7208828926086426 0.4971274435520172 0.7062320709228516 0.4837169349193573 0.7060105204582214 0.47876670956611633 0.7531071901321411 0.47003504633903503 0.7540136575698853 0.4731435477733612 0.7530984878540039 0.47567614912986755 0.7509940266609192 0.47970953583717346 0.7373598217964172 0.483205109834671 0.7339968681335449 0.475881427526474 0.746056079864502 0.46935465931892395 0.7286138534545898 0.5031895637512207 0.7103750109672546 0.5093296766281128 0.7073704600334167 0.5059597492218018 0.7208828926086426 0.4971274435520172 0.7230329513549805 0.4965173900127411 0.7559825778007507 0.5106161832809448 0.7615906000137329 0.5066428184509277 0.7735375165939331 0.5064809322357178 0.77287757396698 0.5221478939056396 0.7568909525871277 0.5191271305084229 0.7551337480545044 0.5168108940124512 0.7260540723800659 0.529274582862854 0.7147369384765625 0.511762261390686 0.7155641317367554 0.5101463794708252 0.7260540723800659 0.5093296766281128 0.4074625074863434 0.8331562280654907 0.40360602736473083 0.8369296789169312 0.3889640271663666 0.83161461353302 0.38866105675697327 0.8148610591888428 0.401526540517807 0.8094780445098877 0.40605250000953674 0.8192234039306641</float_array>
				<technique_common>
				<accessor source="#id-mesh-7-texcoord-0-array" count="84" stride="2">
					<param name="S" type="float"/>
					<param name="T" type="float"/>
				</accessor>
				</technique_common>
			</source>
			<vertices id="id-mesh-7-vertices">
				<input semantic="POSITION" source="#id-mesh-7-positions"/>
			</vertices>
			<polygons count="17" material="id-trimat-8">
				<input semantic="VERTEX" source="#id-mesh-7-vertices" offset="0"/>
				<input semantic="NORMAL" source="#id-mesh-7-normals" offset="0"/>
				<input semantic="TEXCOORD" source="#id-mesh-7-texcoord-0" offset="0" set="0"/>
				<p> 0 1 2 3 </p>
				<p> 4 5 6 </p>
				<p> 7 8 9 10 </p>
				<p> 11 12 13 14 15 </p>
				<p> 16 17 18 19 20 21 </p>
				<p> 22 23 24 25 26 </p>
				<p> 27 28 29 30 31 32 </p>
				<p> 33 34 35 36 </p>
				<p> 37 38 39 40 </p>
				<p> 41 42 43 44 45 </p>
				<p> 46 47 48 49 </p>
				<p> 50 51 52 53 54 55 </p>
				<p> 56 57 58 59 60 61 62 </p>
				<p> 63 64 65 66 67 </p>
				<p> 68 69 70 71 72 73 </p>
				<p> 74 75 76 77 </p>
				<p> 78 79 80 81 82 83 </p>
			</polygons>
		</mesh>
	</geometry>
</library_geometries>
<library_visual_scenes>
	<visual_scene id="id-scene-1" name="scene">
		<node id="Rock_03" name="Rock_03" type="NODE">
			<matrix sid="transform"> 0.58277827501297 0.0 0.0 0.022915959358215332 0.0 0.58277827501297 9.494663544273862e-08 0.04326242208480835 0.0 -9.494663544273862e-08 0.58277827501297 0.3443015217781067 0.0 0.0 0.0 1.0  </matrix>
			<instance_geometry url="#id-mesh-7">
				<bind_material>
					<technique_common>
						<instance_material symbol="id-trimat-8" target="#id-material-6"/>
					</technique_common>
				</bind_material>
			</instance_geometry>
		</node>
	</visual_scene>
</library_visual_scenes>
<scene>
	<instance_visual_scene url="#id-scene-1" />
</scene>
</COLLADA>
