[gd_scene load_steps=9 format=2]

[ext_resource path="res://src/scripts/Player.gd" type="Script" id=1]
[ext_resource path="res://assets/char_sprite_sheet.png" type="Texture" id=2]
[ext_resource path="res://assets/target.png" type="Texture" id=3]
[ext_resource path="res://assets/3D/shield.dae" type="PackedScene" id=4]
[ext_resource path="res://src/scenes/Sword.tscn" type="PackedScene" id=5]
[ext_resource path="res://src/scenes/GUI.tscn" type="PackedScene" id=6]

[sub_resource type="CapsuleShape" id=1]
radius = 0.559998
height = 0.622615

[sub_resource type="SpatialMaterial" id=2]
render_priority = 20
flags_transparent = true

[node name="Player" type="KinematicBody"]
pause_mode = 2
transform = Transform( 0.707107, 0, -0.707107, 0, 1, 0, 0.707107, 0, 0.707107, 0, 0, 0 )
script = ExtResource( 1 )

[node name="CollisionShape" type="CollisionShape" parent="."]
transform = Transform( 1, 0, 0, 0, -4.37114e-08, -1, 0, 1, -4.37114e-08, 0.011, 0.669371, 2.93367e-08 )
shape = SubResource( 1 )

[node name="RotationOffset" type="Position3D" parent="."]
transform = Transform( 1, 0, 0, 0, 0.866025, 0.5, 0, -0.499999, 0.866025, 0, 0, 0 )

[node name="Sprite3D" type="Sprite3D" parent="RotationOffset"]
transform = Transform( 0.6, 0, 0, 0, 0.6, 0, 0, 0, 0.6, -0.00580862, 0.804995, -1.67638e-08 )
material_override = SubResource( 2 )
alpha_cut = 2
texture = ExtResource( 2 )
vframes = 4
hframes = 4

[node name="Camera" type="Camera" parent="RotationOffset/Sprite3D"]
transform = Transform( 1.66667, 0, 0, 0, 1.57166, 0.554673, 0, -0.554672, 1.57166, 0.00999957, 1.56036, 14.6953 )
current = true
size = 10.0
near = 1.31

[node name="Target" type="Sprite3D" parent="RotationOffset"]
transform = Transform( 0.707107, 0.707107, 4.21468e-08, -0.353554, 0.353554, 0.866025, 0.612373, -0.612373, 0.5, 0.0492235, 0.0246118, -0.0426287 )
axis = 1
texture = ExtResource( 3 )

[node name="shield" parent="RotationOffset/Target" instance=ExtResource( 4 )]
transform = Transform( 0.226105, 0, 0.329964, -1.33227e-15, 0.3, -8.88178e-16, -0.329964, -7.94093e-24, 0.226106, 0.394255, 0.48983, -0.457452 )
visible = false

[node name="sword" parent="RotationOffset/Target" instance=ExtResource( 5 )]
transform = Transform( 0.940419, 1.39005e-07, -2.10512e-07, 1.39741e-07, -1.10165, 0.251671, -1.16774e-07, -0.198868, -1.39416, -0.676476, 0.524167, -0.221332 )

[node name="SpotLight" type="SpotLight" parent="RotationOffset/Target"]
transform = Transform( 0.717686, -0.696363, 0.00186557, 0.675042, 0.696364, 0.24371, -0.17101, -0.173648, 0.969847, -0.00995871, 0.550063, -0.789637 )
light_energy = 5.42
light_indirect_energy = 3.33

[node name="Animation" type="Timer" parent="."]
wait_time = 0.1
one_shot = true

[node name="GUI" parent="." instance=ExtResource( 6 )]
margin_bottom = 300.0

[node name="print_timer" type="Timer" parent="."]
wait_time = 0.15
one_shot = true
autostart = true

[node name="RayCast" type="RayCast" parent="."]
enabled = true
cast_to = Vector3( 0, -0.4, 0 )
