{
    "contracts": {
        "/Users/ryangreen/Downloads/Contracts/CryptoBreeding.sol": {
            "CryptoBreeding": {
                "abi": [],
                "devdoc": {
                    "methods": {}
                },
                "evm": {
                    "bytecode": {
                        "linkReferences": {},
                        "object": "6080604052348015600f57600080fd5b50603e80601d6000396000f3fe6080604052600080fdfea265627a7a72305820e7e87af7e3cda85fa49f2755846e6a41066fdc00162865f996c9c24c0f7eb1cb64736f6c634300050a0032",
                        "opcodes": "PUSH1 0x80 PUSH1 0x40 MSTORE CALLVALUE DUP1 ISZERO PUSH1 0xF JUMPI PUSH1 0x0 DUP1 REVERT JUMPDEST POP PUSH1 0x3E DUP1 PUSH1 0x1D PUSH1 0x0 CODECOPY PUSH1 0x0 RETURN INVALID PUSH1 0x80 PUSH1 0x40 MSTORE PUSH1 0x0 DUP1 REVERT INVALID LOG2 PUSH6 0x627A7A723058 KECCAK256 0xe7 0xe8 PUSH27 0xF7E3CDA85FA49F2755846E6A41066FDC00162865F996C9C24C0F7E 0xb1 0xcb PUSH5 0x736F6C6343 STOP SDIV EXP STOP ORIGIN ",
                        "sourceMap": "28:273:0:-;;;;8:9:-1;5:2;;;30:1;27;20:12;5:2;28:273:0;;;;;;;"
                    },
                    "deployedBytecode": {
                        "linkReferences": {},
                        "object": "6080604052600080fdfea265627a7a72305820e7e87af7e3cda85fa49f2755846e6a41066fdc00162865f996c9c24c0f7eb1cb64736f6c634300050a0032",
                        "opcodes": "PUSH1 0x80 PUSH1 0x40 MSTORE PUSH1 0x0 DUP1 REVERT INVALID LOG2 PUSH6 0x627A7A723058 KECCAK256 0xe7 0xe8 PUSH27 0xF7E3CDA85FA49F2755846E6A41066FDC00162865F996C9C24C0F7E 0xb1 0xcb PUSH5 0x736F6C6343 STOP SDIV EXP STOP ORIGIN ",
                        "sourceMap": "28:273:0:-;;;;;"
                    },
                    "gasEstimates": {
                        "creation": {
                            "codeDepositCost": "12400",
                            "executionCost": "66",
                            "totalCost": "12466"
                        },
                        "internal": {
                            "breedable()": "infinite"
                        }
                    },
                    "methodIdentifiers": {}
                },
                "metadata": "{\"compiler\":{\"version\":\"0.5.10+commit.5a6ea5b1\"},\"language\":\"Solidity\",\"output\":{\"abi\":[],\"devdoc\":{\"methods\":{}},\"userdoc\":{\"methods\":{}}},\"settings\":{\"compilationTarget\":{\"/Users/ryangreen/Downloads/Contracts/CryptoBreeding.sol\":\"CryptoBreeding\"},\"evmVersion\":\"petersburg\",\"libraries\":{},\"optimizer\":{\"enabled\":true,\"runs\":200},\"remappings\":[]},\"sources\":{\"/Users/ryangreen/Downloads/Contracts/CryptoBreeding.sol\":{\"keccak256\":\"0x045a1fe40fb8e4a1323d308964c14afcc1e0cfe5b95cb7daee82d2759e9c61e4\",\"urls\":[\"bzzr://cd0e440040025d90ff463840ca893755912970d7752171b37c270bf83bac5d7e\",\"dweb:/ipfs/QmRdyzNDB1gUkKvL4DsBR5LZM8TBp8zWsvamfkGkJyWqGL\"]}},\"version\":1}",
                "userdoc": {
                    "methods": {}
                }
            }
        }
    },
    "errors": [
        {
            "component": "general",
            "formattedMessage": "/Users/ryangreen/Downloads/Contracts/CryptoBreeding.sol:5:5: Warning: Function state mutability can be restricted to pure\n    function breedable() internal view returns (bool) {\r\n    ^ (Relevant source part starts here and spans across multiple lines).\n",
            "message": "Function state mutability can be restricted to pure",
            "severity": "warning",
            "sourceLocation": {
                "end": 298,
                "file": "/Users/ryangreen/Downloads/Contracts/CryptoBreeding.sol",
                "start": 61
            },
            "type": "Warning"
        }
    ],
    "sources": {
        "/Users/ryangreen/Downloads/Contracts/CryptoBreeding.sol": {
            "ast": {
                "absolutePath": "/Users/ryangreen/Downloads/Contracts/CryptoBreeding.sol",
                "exportedSymbols": {
                    "CryptoBreeding": [
                        10
                    ]
                },
                "id": 11,
                "nodeType": "SourceUnit",
                "nodes": [
                    {
                        "id": 1,
                        "literals": [
                            "solidity",
                            "^",
                            "0.5",
                            ".10"
                        ],
                        "nodeType": "PragmaDirective",
                        "src": "0:24:0"
                    },
                    {
                        "baseContracts": [],
                        "contractDependencies": [],
                        "contractKind": "contract",
                        "documentation": null,
                        "fullyImplemented": true,
                        "id": 10,
                        "linearizedBaseContracts": [
                            10
                        ],
                        "name": "CryptoBreeding",
                        "nodeType": "ContractDefinition",
                        "nodes": [
                            {
                                "body": {
                                    "id": 8,
                                    "nodeType": "Block",
                                    "src": "111:187:0",
                                    "statements": [
                                        {
                                            "expression": {
                                                "argumentTypes": null,
                                                "hexValue": "74727565",
                                                "id": 6,
                                                "isConstant": false,
                                                "isLValue": false,
                                                "isPure": true,
                                                "kind": "bool",
                                                "lValueRequested": false,
                                                "nodeType": "Literal",
                                                "src": "286:4:0",
                                                "subdenomination": null,
                                                "typeDescriptions": {
                                                    "typeIdentifier": "t_bool",
                                                    "typeString": "bool"
                                                },
                                                "value": "true"
                                            },
                                            "functionReturnParameters": 5,
                                            "id": 7,
                                            "nodeType": "Return",
                                            "src": "279:11:0"
                                        }
                                    ]
                                },
                                "documentation": null,
                                "id": 9,
                                "implemented": true,
                                "kind": "function",
                                "modifiers": [],
                                "name": "breedable",
                                "nodeType": "FunctionDefinition",
                                "parameters": {
                                    "id": 2,
                                    "nodeType": "ParameterList",
                                    "parameters": [],
                                    "src": "79:2:0"
                                },
                                "returnParameters": {
                                    "id": 5,
                                    "nodeType": "ParameterList",
                                    "parameters": [
                                        {
                                            "constant": false,
                                            "id": 4,
                                            "name": "",
                                            "nodeType": "VariableDeclaration",
                                            "scope": 9,
                                            "src": "105:4:0",
                                            "stateVariable": false,
                                            "storageLocation": "default",
                                            "typeDescriptions": {
                                                "typeIdentifier": "t_bool",
                                                "typeString": "bool"
                                            },
                                            "typeName": {
                                                "id": 3,
                                                "name": "bool",
                                                "nodeType": "ElementaryTypeName",
                                                "src": "105:4:0",
                                                "typeDescriptions": {
                                                    "typeIdentifier": "t_bool",
                                                    "typeString": "bool"
                                                }
                                            },
                                            "value": null,
                                            "visibility": "internal"
                                        }
                                    ],
                                    "src": "104:6:0"
                                },
                                "scope": 10,
                                "src": "61:237:0",
                                "stateMutability": "view",
                                "superFunction": null,
                                "visibility": "internal"
                            }
                        ],
                        "scope": 11,
                        "src": "28:273:0"
                    }
                ],
                "src": "0:301:0"
            },
            "id": 0
        }
    }
}