\relax 
\citation{MLT}
\@writefile{toc}{\contentsline {section}{\numberline {1}Introduction}{2}}
\@writefile{toc}{\contentsline {section}{\numberline {2}A Topic Modeling Based Similarity Measure}{2}}
\citation{LDAP}
\@writefile{lof}{\contentsline {figure}{\numberline {1}{\ignorespaces Plate Notation of LDA Topic Model, figure taken from \cite {LDAP}}}{3}}
\newlabel{fig:lda_plate_notation}{{1}{3}}
\@writefile{toc}{\contentsline {subsection}{\numberline {2.1}Latent Dirichlet Allocation}{3}}
\@writefile{toc}{\contentsline {subsection}{\numberline {2.2}Kullback-Leibler Divergence}{3}}
\newlabel{sec:kld}{{2.2}{3}}
\@writefile{toc}{\contentsline {section}{\numberline {3}Implementation}{4}}
\citation{WEX}
\citation{SKL}
\@writefile{lof}{\contentsline {figure}{\numberline {2}{\ignorespaces Topic Distributions of 2 Documents}}{5}}
\newlabel{fig:kl_divergence_example}{{2}{5}}
\@writefile{toc}{\contentsline {subsection}{\numberline {3.1}Training the Topic Model}{5}}
\newlabel{sec:topictraining}{{3.1}{5}}
\newlabel{tab:topics}{{3.1}{6}}
\@writefile{lot}{\contentsline {table}{\numberline {1}{\ignorespaces The 10 most likely words for 5 selected topics, found by LDA in the Wikipedia corpus}}{6}}
\@writefile{toc}{\contentsline {subsection}{\numberline {3.2}Indexing the Documents}{6}}
\newlabel{sec:index}{{3.2}{6}}
\citation{ESMAP}
\newlabel{list:mapping}{{3.2}{7}}
\citation{FSSS}
\@writefile{toc}{\contentsline {subsection}{\numberline {3.3}A Function Score Query with a Custom Similarity Score}{8}}
\newlabel{sec:modified}{{3.3}{8}}
\newlabel{list:modified}{{1}{8}}
\@writefile{lol}{\contentsline {lstlisting}{\numberline {1}A scripted query for a document with a topic distribution over only two topics}{8}}
\@writefile{lof}{\contentsline {figure}{\numberline {3}{\ignorespaces Number of documents having a most significant topic with a specified weight}}{9}}
\newlabel{fig:mostsig}{{3}{9}}
\@writefile{toc}{\contentsline {subsection}{\numberline {3.4}Speed Up Using Prefiltering}{9}}
\newlabel{sec:speedy}{{3.4}{9}}
\newlabel{list:speedy}{{2}{10}}
\@writefile{lol}{\contentsline {lstlisting}{\numberline {2}Function score using range query to filter out dissimilar documents before calculating the script score}{10}}
\@writefile{toc}{\contentsline {section}{\numberline {4}Dependencies}{11}}
\@writefile{toc}{\contentsline {section}{\numberline {5}Build Instructions}{11}}
\@writefile{toc}{\contentsline {section}{\numberline {6}Usage Instructions}{12}}
\@writefile{toc}{\contentsline {subsection}{\numberline {6.1}Retrieve Documents According to Traditional MLT}{12}}
\@writefile{toc}{\contentsline {subsection}{\numberline {6.2}Retrieve Documents with Similar Topic Distributions}{12}}
\@writefile{toc}{\contentsline {subsection}{\numberline {6.3}View Comparing Results of Classic and Modified More Like This}{12}}
\@writefile{toc}{\contentsline {subsection}{\numberline {6.4}Retrieving Documents using the Speedy Query}{13}}
\@writefile{toc}{\contentsline {subsection}{\numberline {6.5}Indexing a new Document}{13}}
\newlabel{sec:indexusage}{{6.5}{13}}
\@writefile{toc}{\contentsline {subsection}{\numberline {6.6}Running the tests}{13}}
\@writefile{toc}{\contentsline {section}{\numberline {7}Documentation}{13}}
\bibcite{MLT}{MLT}
\bibcite{LDAP}{LDAP}
\bibcite{WEX}{WEX}
\bibcite{ESMAP}{ESMAP}
\bibcite{FSSS}{FSSS}
\bibcite{SKL}{SKL}
\@writefile{toc}{\contentsline {section}{\numberline {8}Conclusion}{14}}
\@writefile{toc}{\contentsline {section}{\numberline {A}Appendix}{15}}
\newlabel{appendix}{{A}{15}}
