v -11.000000 -9.000000 0.000000
v -11.000000 -7.000000 0.000000
v -11.000000 -5.000000 0.000000
v -11.000000 -3.000000 0.000000
v -11.000000 -1.000000 0.000000
v -11.000000 1.000000 0.000000
v -11.000000 3.000000 0.000000
v -11.000000 5.000000 0.000000
v -11.000000 7.000000 0.000000
v -10.000000 -8.000000 0.000000
v -10.000000 -2.000000 0.000000
v -10.000000 0.000000 0.000000
v -10.000000 6.000000 0.000000
v -9.000000 -9.000000 0.000000
v -9.000000 -5.000000 0.000000
v -9.000000 -1.000000 0.000000
v -9.000000 3.000000 0.000000
v -9.000000 7.000000 0.000000
v -8.000000 -6.000000 0.000000
v -8.000000 -4.000000 0.000000
v -8.000000 2.000000 0.000000
v -8.000000 4.000000 0.000000
v -7.000000 -9.000000 0.000000
v -7.000000 -5.000000 0.000000
v -7.000000 3.000000 0.000000
v -7.000000 7.000000 0.000000
v -6.000000 -8.000000 0.000000
v -6.000000 -2.000000 0.000000
v -6.000000 0.000000 0.000000
v -6.000000 6.000000 0.000000
v -5.000000 -9.000000 0.000000
v -5.000000 -7.000000 0.000000
v -5.000000 -1.000000 0.000000
v -5.000000 5.000000 0.000000
v -5.000000 7.000000 0.000000
v -4.000000 -8.000000 0.000000
v -4.000000 -6.000000 0.000000
v -4.000000 4.000000 0.000000
v -3.000000 -9.000000 0.000000
v -3.000000 -7.000000 0.000000
v -3.000000 -5.000000 0.000000
v -3.000000 -3.000000 0.000000
v -3.000000 -1.000000 0.000000
v -3.000000 1.000000 0.000000
v -3.000000 3.000000 0.000000
v -3.000000 7.000000 0.000000
v -2.000000 -8.000000 0.000000
v -2.000000 -6.000000 0.000000
v -2.000000 -4.000000 0.000000
v -2.000000 -2.000000 0.000000
v -1.000000 -9.000000 0.000000
v -1.000000 -7.000000 0.000000
v -1.000000 -5.000000 0.000000
v -1.000000 -3.000000 0.000000
v -1.000000 -1.000000 0.000000
v -1.000000 7.000000 0.000000
v 0.000000 -8.000000 0.000000
v 0.000000 -6.000000 0.000000
v 0.000000 -4.000000 0.000000
v 0.000000 -2.000000 0.000000
v 1.000000 -7.000000 0.000000
v 1.000000 -5.000000 0.000000
v 1.000000 -3.000000 0.000000
v 1.000000 -1.000000 0.000000
v 1.000000 7.000000 0.000000
v 2.000000 -6.000000 0.000000
v 2.000000 -4.000000 0.000000
v 2.000000 -2.000000 0.000000
v 2.000000 0.000000 0.000000
v 3.000000 -5.000000 0.000000
v 3.000000 -3.000000 0.000000
v 3.000000 -1.000000 0.000000
v 3.000000 1.000000 0.000000
v 3.000000 7.000000 0.000000
v 4.000000 -4.000000 0.000000
v 4.000000 -2.000000 0.000000
v 4.000000 0.000000 0.000000
v 4.000000 2.000000 0.000000
v 5.000000 -3.000000 0.000000
v 5.000000 -1.000000 0.000000
v 5.000000 1.000000 0.000000
v 5.000000 3.000000 0.000000
v 5.000000 7.000000 0.000000
v 6.000000 -2.000000 0.000000
v 6.000000 2.000000 0.000000
v 6.000000 4.000000 0.000000
v 7.000000 -3.000000 0.000000
v 7.000000 1.000000 0.000000
v 7.000000 5.000000 0.000000
v 7.000000 7.000000 0.000000
v 8.000000 -8.000000 0.000000
v 8.000000 -6.000000 0.000000
v 8.000000 -4.000000 0.000000
v 8.000000 -2.000000 0.000000
v 8.000000 0.000000 0.000000
v 8.000000 2.000000 0.000000
v 8.000000 6.000000 0.000000
v 9.000000 7.000000 0.000000
