# Blender 4.0.2
# www.blender.org
o Curve
v -0.043758 0.012639 0.000000
v -0.015817 0.013204 0.000000
v -0.014901 0.015235 0.000000
v -0.013881 0.017147 0.000000
v -0.012761 0.018929 0.000000
v -0.011543 0.020571 0.000000
v -0.010231 0.022061 0.000000
v -0.008830 0.023388 0.000000
v -0.007343 0.024541 0.000000
v -0.005773 0.025509 0.000000
v -0.004125 0.026281 0.000000
v -0.002401 0.026847 -0.000000
v -0.000605 0.027194 -0.000000
v 0.001258 0.027312 -0.000000
v 0.003996 0.027063 -0.000000
v 0.006622 0.026339 -0.000000
v 0.009113 0.025172 -0.000000
v 0.011443 0.023595 -0.000000
v 0.013589 0.021639 -0.000000
v 0.015527 0.019337 -0.000000
v 0.017233 0.016722 -0.000000
v 0.018682 0.013826 -0.000000
v 0.019851 0.010682 -0.000000
v 0.020716 0.007322 -0.000000
v 0.021253 0.003778 -0.000000
v 0.021437 0.000083 -0.000000
v 0.021253 -0.003612 -0.000000
v 0.020716 -0.007156 -0.000000
v 0.019852 -0.010517 -0.000000
v 0.018683 -0.013661 -0.000000
v 0.017233 -0.016557 -0.000000
v 0.015528 -0.019172 -0.000000
v 0.013590 -0.021473 -0.000000
v 0.011444 -0.023429 -0.000000
v 0.009114 -0.025007 -0.000000
v 0.006623 -0.026174 -0.000000
v 0.003997 -0.026898 -0.000000
v 0.001258 -0.027146 0.000000
v -0.000680 -0.027044 0.000000
v -0.002541 -0.026740 0.000000
v -0.004321 -0.026238 0.000000
v -0.006017 -0.025540 0.000000
v -0.007624 -0.024649 0.000000
v -0.009140 -0.023571 0.000000
v -0.010560 -0.022306 0.000000
v -0.011880 -0.020860 0.000000
v -0.013098 -0.019235 0.000000
v -0.014210 -0.017435 0.000000
v -0.015211 -0.015462 0.000000
v -0.016099 -0.013320 0.000000
v -0.016382 -0.012474 0.000000
v -0.043803 -0.013055 0.000000
v -0.043475 -0.015013 0.000000
v -0.041781 -0.020251 0.000000
v -0.039661 -0.025119 0.000000
v -0.037130 -0.029600 0.000000
v -0.034202 -0.033679 0.000000
v -0.030891 -0.037339 0.000000
v -0.027212 -0.040564 0.000000
v -0.023177 -0.043337 0.000000
v -0.018802 -0.045642 0.000000
v -0.014101 -0.047463 0.000000
v -0.009087 -0.048785 0.000000
v -0.003775 -0.049589 0.000000
v 0.001822 -0.049861 0.000000
v 0.008600 -0.049404 -0.000000
v 0.015102 -0.048072 -0.000000
v 0.021266 -0.045925 -0.000000
v 0.027035 -0.043023 -0.000000
v 0.032347 -0.039425 -0.000000
v 0.037145 -0.035191 -0.000000
v 0.041368 -0.030381 -0.000000
v 0.044956 -0.025055 -0.000000
v 0.047851 -0.019271 -0.000000
v 0.049992 -0.013091 -0.000000
v 0.051320 -0.006572 -0.000000
v 0.051777 0.000224 -0.000000
v 0.051320 0.007020 -0.000000
v 0.049992 0.013538 -0.000000
v 0.047851 0.019719 -0.000000
v 0.044956 0.025503 -0.000000
v 0.041368 0.030829 -0.000000
v 0.037145 0.035639 -0.000000
v 0.032347 0.039873 -0.000000
v 0.027035 0.043471 -0.000000
v 0.021266 0.046373 -0.000000
v 0.015102 0.048520 -0.000000
v 0.008600 0.049852 -0.000000
v 0.001822 0.050309 -0.000000
v -0.003908 0.050037 -0.000000
v -0.009331 0.049230 0.000000
v -0.014431 0.047906 0.000000
v -0.019194 0.046077 0.000000
v -0.023607 0.043761 0.000000
v -0.027655 0.040973 0.000000
v -0.031324 0.037727 0.000000
v -0.034598 0.034040 0.000000
v -0.037465 0.029926 0.000000
v -0.039910 0.025401 0.000000
v -0.041918 0.020480 0.000000
v -0.043475 0.015179 0.000000
v -0.030092 -0.012764 0.000000
v -0.029787 0.012921 0.000000
v -0.036947 -0.012910 0.000000
v -0.036773 0.012780 0.000000
v -0.023237 -0.012619 0.000000
v -0.022802 0.013063 0.000000
v -0.043758 0.012639 -0.005000
v -0.015817 0.013204 -0.005000
v -0.014901 0.015235 -0.005000
v -0.013881 0.017147 -0.005000
v -0.012761 0.018929 -0.005000
v -0.011543 0.020571 -0.005000
v -0.010231 0.022061 -0.005000
v -0.008830 0.023388 -0.005000
v -0.007343 0.024541 -0.005000
v -0.005773 0.025509 -0.005000
v -0.004125 0.026281 -0.005000
v -0.002401 0.026847 -0.005000
v -0.000605 0.027194 -0.005000
v 0.001258 0.027312 -0.005000
v 0.003996 0.027063 -0.005000
v 0.006622 0.026339 -0.005000
v 0.009113 0.025172 -0.005000
v 0.011443 0.023595 -0.005000
v 0.013589 0.021639 -0.005000
v 0.015527 0.019337 -0.005000
v 0.017233 0.016722 -0.005000
v 0.018682 0.013826 -0.005000
v 0.019851 0.010682 -0.005000
v 0.020716 0.007322 -0.005000
v 0.021253 0.003778 -0.005000
v 0.021437 0.000083 -0.005000
v 0.021253 -0.003612 -0.005000
v 0.020716 -0.007156 -0.005000
v 0.019852 -0.010517 -0.005000
v 0.018683 -0.013661 -0.005000
v 0.017233 -0.016557 -0.005000
v 0.015528 -0.019172 -0.005000
v 0.013590 -0.021473 -0.005000
v 0.011444 -0.023429 -0.005000
v 0.009114 -0.025007 -0.005000
v 0.006623 -0.026174 -0.005000
v 0.003997 -0.026898 -0.005000
v 0.001258 -0.027146 -0.005000
v -0.000680 -0.027044 -0.005000
v -0.002541 -0.026740 -0.005000
v -0.004321 -0.026238 -0.005000
v -0.006017 -0.025540 -0.005000
v -0.007624 -0.024649 -0.005000
v -0.009140 -0.023571 -0.005000
v -0.010560 -0.022306 -0.005000
v -0.011880 -0.020860 -0.005000
v -0.013098 -0.019235 -0.005000
v -0.014210 -0.017435 -0.005000
v -0.015212 -0.015462 -0.005000
v -0.016099 -0.013320 -0.005000
v -0.016382 -0.012474 -0.005000
v -0.043803 -0.013055 -0.005000
v -0.043475 -0.015013 -0.005000
v -0.041781 -0.020251 -0.005000
v -0.039661 -0.025119 -0.005000
v -0.037130 -0.029600 -0.005000
v -0.034202 -0.033679 -0.005000
v -0.030891 -0.037339 -0.005000
v -0.027212 -0.040564 -0.005000
v -0.023177 -0.043337 -0.005000
v -0.018802 -0.045642 -0.005000
v -0.014101 -0.047463 -0.005000
v -0.009087 -0.048785 -0.005000
v -0.003775 -0.049589 -0.005000
v 0.001822 -0.049861 -0.005000
v 0.008600 -0.049404 -0.005000
v 0.015102 -0.048072 -0.005000
v 0.021266 -0.045925 -0.005000
v 0.027035 -0.043023 -0.005000
v 0.032347 -0.039425 -0.005000
v 0.037145 -0.035191 -0.005000
v 0.041368 -0.030381 -0.005000
v 0.044956 -0.025055 -0.005000
v 0.047851 -0.019271 -0.005000
v 0.049992 -0.013091 -0.005000
v 0.051320 -0.006572 -0.005000
v 0.051777 0.000224 -0.005000
v 0.051320 0.007020 -0.005000
v 0.049992 0.013538 -0.005000
v 0.047851 0.019719 -0.005000
v 0.044956 0.025503 -0.005000
v 0.041368 0.030829 -0.005000
v 0.037145 0.035639 -0.005000
v 0.032347 0.039873 -0.005000
v 0.027035 0.043471 -0.005000
v 0.021266 0.046373 -0.005000
v 0.015102 0.048520 -0.005000
v 0.008600 0.049852 -0.005000
v 0.001822 0.050309 -0.005000
v -0.003908 0.050037 -0.005000
v -0.009331 0.049230 -0.005000
v -0.014431 0.047906 -0.005000
v -0.019194 0.046077 -0.005000
v -0.023607 0.043761 -0.005000
v -0.027655 0.040973 -0.005000
v -0.031324 0.037727 -0.005000
v -0.034598 0.034040 -0.005000
v -0.037465 0.029926 -0.005000
v -0.039910 0.025401 -0.005000
v -0.041918 0.020480 -0.005000
v -0.043475 0.015179 -0.005000
v -0.030092 -0.012764 -0.005000
v -0.029787 0.012921 -0.005000
v -0.036947 -0.012910 -0.005000
v -0.036773 0.012780 -0.005000
v -0.023237 -0.012619 -0.005000
v -0.022802 0.013063 -0.005000
v -0.043758 0.012639 -0.010000
v -0.015817 0.013204 -0.010000
v -0.014901 0.015235 -0.010000
v -0.013881 0.017147 -0.010000
v -0.012761 0.018929 -0.010000
v -0.011543 0.020571 -0.010000
v -0.010231 0.022061 -0.010000
v -0.008830 0.023388 -0.010000
v -0.007343 0.024541 -0.010000
v -0.005773 0.025509 -0.010000
v -0.004125 0.026281 -0.010000
v -0.002401 0.026847 -0.010000
v -0.000605 0.027194 -0.010000
v 0.001258 0.027312 -0.010000
v 0.003996 0.027063 -0.010000
v 0.006622 0.026339 -0.010000
v 0.009113 0.025172 -0.010000
v 0.011443 0.023595 -0.010000
v 0.013589 0.021639 -0.010000
v 0.015527 0.019337 -0.010000
v 0.017233 0.016722 -0.010000
v 0.018682 0.013826 -0.010000
v 0.019851 0.010682 -0.010000
v 0.020716 0.007322 -0.010000
v 0.021253 0.003778 -0.010000
v 0.021437 0.000083 -0.010000
v 0.021253 -0.003612 -0.010000
v 0.020716 -0.007156 -0.010000
v 0.019852 -0.010517 -0.010000
v 0.018683 -0.013661 -0.010000
v 0.017233 -0.016557 -0.010000
v 0.015528 -0.019172 -0.010000
v 0.013590 -0.021473 -0.010000
v 0.011444 -0.023429 -0.010000
v 0.009114 -0.025007 -0.010000
v 0.006623 -0.026174 -0.010000
v 0.003997 -0.026898 -0.010000
v 0.001258 -0.027146 -0.010000
v -0.000680 -0.027044 -0.010000
v -0.002541 -0.026740 -0.010000
v -0.004321 -0.026238 -0.010000
v -0.006017 -0.025540 -0.010000
v -0.007624 -0.024649 -0.010000
v -0.009140 -0.023571 -0.010000
v -0.010560 -0.022306 -0.010000
v -0.011880 -0.020860 -0.010000
v -0.013098 -0.019235 -0.010000
v -0.014210 -0.017435 -0.010000
v -0.015212 -0.015462 -0.010000
v -0.016099 -0.013320 -0.010000
v -0.016382 -0.012474 -0.010000
v -0.043803 -0.013055 -0.010000
v -0.043475 -0.015013 -0.010000
v -0.041781 -0.020251 -0.010000
v -0.039661 -0.025119 -0.010000
v -0.037130 -0.029600 -0.010000
v -0.034202 -0.033679 -0.010000
v -0.030891 -0.037339 -0.010000
v -0.027212 -0.040564 -0.010000
v -0.023177 -0.043337 -0.010000
v -0.018802 -0.045642 -0.010000
v -0.014101 -0.047463 -0.010000
v -0.009087 -0.048785 -0.010000
v -0.003775 -0.049589 -0.010000
v 0.001822 -0.049861 -0.010000
v 0.008600 -0.049404 -0.010000
v 0.015102 -0.048072 -0.010000
v 0.021266 -0.045925 -0.010000
v 0.027035 -0.043023 -0.010000
v 0.032347 -0.039425 -0.010000
v 0.037145 -0.035191 -0.010000
v 0.041368 -0.030381 -0.010000
v 0.044956 -0.025055 -0.010000
v 0.047851 -0.019271 -0.010000
v 0.049992 -0.013091 -0.010000
v 0.051320 -0.006572 -0.010000
v 0.051777 0.000224 -0.010000
v 0.051320 0.007020 -0.010000
v 0.049992 0.013538 -0.010000
v 0.047851 0.019719 -0.010000
v 0.044956 0.025503 -0.010000
v 0.041368 0.030829 -0.010000
v 0.037145 0.035639 -0.010000
v 0.032347 0.039873 -0.010000
v 0.027035 0.043471 -0.010000
v 0.021266 0.046373 -0.010000
v 0.015102 0.048520 -0.010000
v 0.008600 0.049852 -0.010000
v 0.001822 0.050309 -0.010000
v -0.003908 0.050037 -0.010000
v -0.009331 0.049230 -0.010000
v -0.014431 0.047906 -0.010000
v -0.019194 0.046077 -0.010000
v -0.023607 0.043761 -0.010000
v -0.027655 0.040973 -0.010000
v -0.031324 0.037727 -0.010000
v -0.034598 0.034040 -0.010000
v -0.037465 0.029926 -0.010000
v -0.039910 0.025401 -0.010000
v -0.041918 0.020480 -0.010000
v -0.043475 0.015179 -0.010000
v -0.030092 -0.012764 -0.010000
v -0.029787 0.012921 -0.010000
v -0.036948 -0.012910 -0.010000
v -0.036773 0.012780 -0.010000
v -0.023237 -0.012619 -0.010000
v -0.022802 0.013063 -0.010000
