# Blender 4.0.2
# www.blender.org
o Cylinder.001
v -0.001305 0.457544 0.038988
v -0.001305 0.486084 0.038988
v -0.028839 0.457544 0.027583
v -0.028839 0.486084 0.027583
v -0.040244 0.457544 0.000049
v -0.040244 0.486084 0.000049
v -0.028839 0.457544 -0.027485
v -0.028839 0.486084 -0.027485
v -0.001305 0.457544 -0.038890
v -0.001305 0.486084 -0.038890
v 0.026230 0.457544 -0.027485
v 0.026230 0.486084 -0.027485
v 0.037635 0.457544 0.000049
v 0.037635 0.486084 0.000049
v 0.026230 0.457544 0.027583
v 0.026230 0.486084 0.027583
v -0.001305 0.507324 0.038988
v -0.028839 0.507324 0.027583
v -0.040244 0.507324 0.000049
v -0.081897 -0.751596 0.034100
v -0.028839 0.507324 -0.027485
v -0.134982 -0.719647 0.090455
v -0.001305 0.507324 -0.038890
v -0.321195 0.076520 0.321513
v 0.026230 0.507324 -0.027485
v -0.302543 0.163474 0.302862
v -0.272255 0.243611 0.272573
v -0.231494 0.313852 0.231812
v -0.181826 0.371497 0.182144
v 0.037635 0.507324 0.000049
v -0.125160 0.414332 0.125478
v -0.063674 0.440709 0.063992
v 0.026230 0.507324 0.027583
v -0.001305 0.534271 0.038988
v -0.028839 0.534271 0.027583
v -0.040244 0.534271 0.000049
v -0.062612 -0.751596 0.062952
v -0.028839 0.534271 -0.027485
v -0.090090 -0.719647 0.135331
v -0.001305 0.534271 -0.038890
v 0.026230 0.534271 -0.027485
v -0.173706 0.076520 0.420062
v -0.163612 0.163474 0.395693
v -0.147220 0.243611 0.356119
v 0.037635 0.534271 0.000049
v -0.125160 0.313852 0.302861
v -0.098280 0.371497 0.237967
v -0.067613 0.414332 0.163930
v -0.034337 0.440709 0.083595
v 0.026230 0.534271 0.027583
v -0.033754 -0.751596 0.082227
v 0.000269 0.076520 0.454668
v 0.000269 0.163474 0.428291
v 0.000269 0.313852 0.327811
v 0.000269 0.371497 0.257570
v 0.000269 0.414332 0.177432
v 0.000269 0.440709 0.090478
v -0.395375 0.163474 0.163930
v -0.419744 0.076520 0.174024
v -0.159283 -0.719647 0.031815
v -0.355801 0.243611 0.147538
v -0.302543 0.313852 0.125478
v -0.237649 0.371497 0.098598
v -0.163612 0.414332 0.067931
v -0.083277 0.440709 0.034655
v -0.088673 -0.751596 0.000065
v -0.427973 0.163474 0.000049
v -0.454350 0.076520 0.000049
v -0.159294 -0.719647 -0.031661
v -0.385138 0.243611 0.000049
v -0.327493 0.313852 0.000049
v -0.257252 0.371497 0.000049
v -0.177114 0.414332 0.000049
v -0.090160 0.440709 0.000049
v -0.081909 -0.751596 -0.033973
v -0.395375 0.163473 -0.163832
v -0.419744 0.076519 -0.173926
v -0.135013 -0.719647 -0.090309
v -0.355801 0.243611 -0.147440
v -0.302543 0.313852 -0.125380
v -0.237649 0.371497 -0.098500
v -0.163612 0.414332 -0.067833
v -0.083277 0.440709 -0.034557
v -0.062633 -0.751596 -0.062831
v -0.302543 0.163473 -0.302763
v -0.321195 0.076519 -0.321415
v -0.090136 -0.719647 -0.135201
v -0.272255 0.243611 -0.272475
v -0.231494 0.313852 -0.231713
v -0.181826 0.371497 -0.182046
v -0.125160 0.414332 -0.125380
v -0.063674 0.440709 -0.063894
v -0.033782 -0.751596 -0.082116
v -0.034703 0.440709 -0.083056
v -0.163612 0.163473 -0.395594
v -0.173706 0.076519 -0.419963
v -0.031497 -0.719647 -0.159502
v -0.147220 0.243611 -0.356020
v -0.125160 0.313852 -0.302763
v -0.098280 0.371497 -0.237869
v -0.067613 0.414332 -0.163832
v 0.000253 -0.751596 -0.088892
v -0.000125 0.440709 -0.090079
v 0.000269 0.163473 -0.428192
v 0.000269 0.076519 -0.454569
v 0.031979 -0.719647 -0.159513
v 0.000269 0.243611 -0.385358
v 0.000269 0.313852 -0.327712
v 0.000269 0.371497 -0.257471
v 0.000269 0.414332 -0.177334
v 0.034291 -0.751596 -0.082127
v 0.034508 0.440709 -0.083335
v 0.164149 0.163473 -0.395594
v 0.174244 0.076519 -0.419963
v 0.090627 -0.719647 -0.135231
v 0.147758 0.243611 -0.356020
v 0.125698 0.313852 -0.302763
v 0.098818 0.371497 -0.237869
v 0.068150 0.414332 -0.163832
v 0.063149 -0.751596 -0.062852
v 0.063924 0.440709 -0.063851
v 0.303081 0.163473 -0.302763
v 0.321732 0.076519 -0.321415
v 0.135519 -0.719647 -0.090355
v 0.272792 0.243611 -0.272475
v 0.232031 0.313852 -0.231713
v 0.182363 0.371497 -0.182045
v 0.125698 0.414332 -0.125380
v 0.082434 -0.751596 -0.034001
v 0.395912 0.163473 -0.163832
v 0.420281 0.076519 -0.173926
v 0.159820 -0.719647 -0.031715
v 0.356338 0.243611 -0.147440
v 0.303081 0.313852 -0.125380
v 0.238187 0.371497 -0.098500
v 0.164150 0.414332 -0.067833
v 0.083814 0.440709 -0.034557
v 0.089210 -0.751596 0.000035
v 0.428510 0.163473 0.000049
v 0.454887 0.076519 0.000049
v 0.159831 -0.719647 0.031760
v 0.385675 0.243611 0.000049
v 0.328030 0.313852 0.000049
v 0.257789 0.371497 0.000049
v 0.177652 0.414332 0.000049
v 0.090698 0.440709 0.000049
v 0.082445 -0.751596 0.034072
v 0.395912 0.163473 0.163930
v 0.420281 0.076519 0.174024
v 0.135550 -0.719647 0.090408
v 0.356338 0.243611 0.147538
v 0.303081 0.313852 0.125478
v 0.238187 0.371497 0.098598
v 0.164150 0.414332 0.067931
v 0.083814 0.440709 0.034655
v 0.063170 -0.751596 0.062930
v 0.303081 0.163474 0.302862
v 0.321732 0.076520 0.321513
v 0.090673 -0.719647 0.135300
v 0.272792 0.243611 0.272573
v 0.232031 0.313852 0.231812
v 0.182363 0.371497 0.182144
v 0.125698 0.414332 0.125478
v 0.064212 0.440709 0.063992
v 0.034319 -0.751596 0.082215
v 0.164149 0.163474 0.395692
v 0.174243 0.076520 0.420062
v 0.032033 -0.719647 0.159601
v 0.147757 0.243611 0.356119
v 0.125698 0.313852 0.302861
v 0.098817 0.371497 0.237967
v 0.068150 0.414332 0.163930
v 0.034875 0.440709 0.083595
v 0.000284 -0.751596 0.088991
v -0.031442 -0.719647 0.159612
v 0.000269 0.243611 0.385456
v -0.209489 -0.669544 0.041810
v -0.177541 -0.669544 0.118902
v -0.118524 -0.669544 0.177900
v -0.209504 -0.669544 -0.041639
v -0.177582 -0.669544 -0.118742
v -0.118584 -0.669544 -0.177760
v -0.041492 -0.669544 -0.209708
v 0.041958 -0.669544 -0.209722
v 0.119060 -0.669544 -0.177801
v 0.178078 -0.669544 -0.118803
v 0.210026 -0.669544 -0.041711
v 0.210040 -0.669544 0.041739
v 0.178119 -0.669544 0.118842
v 0.119121 -0.669544 0.177859
v 0.042029 -0.669544 0.209807
v -0.041421 -0.669544 0.209822
v -0.379452 -0.046879 0.253864
v -0.253417 -0.046879 0.379857
v -0.447678 -0.046879 0.089231
v -0.447708 -0.046879 -0.088980
v -0.379538 -0.046879 -0.253636
v -0.253546 -0.046879 -0.379671
v -0.088913 -0.046879 -0.447898
v 0.089298 -0.046879 -0.447928
v 0.253954 -0.046879 -0.379757
v 0.379989 -0.046879 -0.253765
v 0.448215 -0.046879 -0.089132
v 0.448245 -0.046879 0.089078
v 0.380075 -0.046879 0.253735
v 0.254083 -0.046879 0.379770
v 0.089450 -0.046879 0.447996
v -0.088760 -0.046879 0.448026
v -0.365829 -0.122088 0.244758
v -0.244316 -0.122088 0.366231
v -0.085566 -0.122088 0.431955
v -0.431608 -0.122088 0.086031
v -0.431637 -0.122088 -0.085785
v -0.365913 -0.122088 -0.244535
v -0.244440 -0.122088 -0.366048
v -0.085713 -0.122088 -0.431827
v 0.086104 -0.122088 -0.431856
v 0.244853 -0.122088 -0.366132
v 0.366366 -0.122088 -0.244660
v 0.432145 -0.122088 -0.085933
v 0.432174 -0.122088 0.085884
v 0.366450 -0.122088 0.244634
v 0.244977 -0.122088 0.366147
v 0.086251 -0.122088 0.431925
v -0.355557 -0.198824 0.237892
v -0.237453 -0.198823 0.355956
v -0.419489 -0.198824 0.083619
v -0.419518 -0.198824 -0.083377
v -0.355638 -0.198824 -0.237672
v -0.237574 -0.198824 -0.355776
v -0.083301 -0.198824 -0.419708
v 0.083695 -0.198824 -0.419737
v 0.237990 -0.198824 -0.355857
v 0.356094 -0.198824 -0.237793
v 0.420026 -0.198824 -0.083520
v 0.420055 -0.198824 0.083476
v 0.356175 -0.198824 0.237771
v 0.238111 -0.198824 0.355875
v 0.083838 -0.198824 0.419807
v -0.083158 -0.198824 0.419836
v -0.339404 -0.277391 0.227095
v -0.226661 -0.277390 0.339800
v -0.400434 -0.277391 0.079825
v -0.400462 -0.277391 -0.079590
v -0.339481 -0.277391 -0.226880
v -0.226777 -0.277391 -0.339623
v -0.079507 -0.277391 -0.400654
v 0.079908 -0.277391 -0.400681
v 0.227198 -0.277391 -0.339700
v 0.339941 -0.277391 -0.226996
v 0.400971 -0.277391 -0.079726
v 0.400999 -0.277391 0.079689
v 0.340018 -0.277391 0.226979
v 0.227314 -0.277391 0.339722
v 0.080044 -0.277391 0.400752
v -0.079370 -0.277391 0.400779
v -0.320757 -0.353318 0.214631
v -0.378438 -0.353318 0.075446
v -0.214204 -0.353318 0.321149
v -0.378464 -0.353318 -0.075218
v -0.320831 -0.353318 -0.214423
v -0.214313 -0.353318 -0.320976
v -0.075128 -0.353318 -0.378657
v 0.075536 -0.353319 -0.378682
v 0.214741 -0.353319 -0.321049
v 0.321294 -0.353319 -0.214532
v 0.378975 -0.353318 -0.075347
v 0.379000 -0.353318 0.075317
v 0.321367 -0.353318 0.214522
v 0.214850 -0.353318 0.321075
v 0.075665 -0.353318 0.378756
v -0.074999 -0.353318 0.378781
v -0.299535 -0.421919 0.200446
v -0.200025 -0.421919 0.299921
v -0.353402 -0.421919 0.070462
v -0.353426 -0.421919 -0.070242
v -0.299603 -0.421919 -0.200244
v -0.200127 -0.421919 -0.299754
v -0.070144 -0.421919 -0.353621
v 0.070560 -0.421919 -0.353645
v 0.200562 -0.421919 -0.299822
v 0.300072 -0.421919 -0.200346
v 0.353939 -0.421919 -0.070363
v 0.353963 -0.421919 0.070341
v 0.300140 -0.421919 0.200343
v 0.200664 -0.421919 0.299853
v 0.070680 -0.421919 0.353720
v -0.070023 -0.421919 0.353744
v -0.278862 -0.486865 0.186628
v -0.329015 -0.486865 0.065607
v -0.186214 -0.486864 0.279244
v -0.329037 -0.486865 -0.065395
v -0.278926 -0.486865 -0.186433
v -0.186310 -0.486865 -0.279081
v -0.065288 -0.486865 -0.329234
v 0.065713 -0.486865 -0.329256
v 0.186751 -0.486865 -0.279145
v 0.279399 -0.486865 -0.186529
v 0.329552 -0.486865 -0.065507
v 0.329574 -0.486865 0.065494
v 0.279463 -0.486865 0.186532
v 0.186846 -0.486865 0.279180
v 0.065825 -0.486865 0.329333
v -0.065176 -0.486865 0.329356
v -0.253259 -0.546315 0.169514
v -0.169109 -0.546315 0.253635
v -0.298811 -0.546315 0.059593
v -0.298832 -0.546315 -0.059392
v -0.253317 -0.546315 -0.169328
v -0.169196 -0.546315 -0.253478
v -0.059275 -0.546315 -0.299031
v 0.059710 -0.546315 -0.299051
v 0.169646 -0.546315 -0.253536
v 0.253796 -0.546315 -0.169415
v 0.299348 -0.546315 -0.059494
v 0.299369 -0.546315 0.059491
v 0.253854 -0.546315 0.169427
v 0.169733 -0.546315 0.253577
v 0.059812 -0.546315 0.299130
v -0.059173 -0.546315 0.299150
v -0.223341 -0.605447 0.149516
v -0.149121 -0.605447 0.223710
v -0.263518 -0.605447 0.052567
v -0.263535 -0.605447 -0.052377
v -0.223392 -0.605447 -0.149340
v -0.149198 -0.605447 -0.223560
v -0.052249 -0.605447 -0.263736
v 0.052696 -0.605447 -0.263754
v 0.149658 -0.605447 -0.223610
v 0.223878 -0.605447 -0.149416
v 0.264054 -0.605447 -0.052467
v 0.264072 -0.605447 0.052477
v 0.223928 -0.605447 0.149439
v 0.149734 -0.605447 0.223659
v 0.052785 -0.605447 0.263836
v -0.052159 -0.605447 0.263854
v 0.081276 0.608237 0.036278
v -0.115668 0.645993 0.033087
v 0.072838 0.573944 0.023111
v -0.123724 0.612969 0.014019
v 0.070896 0.559728 -0.008466
v -0.123888 0.605206 -0.019481
v 0.076587 0.573913 -0.039955
v -0.116065 0.627252 -0.047789
v 0.086579 0.608194 -0.052910
v -0.104837 0.666193 -0.054323
v 0.095017 0.642483 -0.039743
v -0.096782 0.699216 -0.035256
v 0.096959 0.656701 -0.008167
v -0.096618 0.706979 -0.001756
v 0.091267 0.642514 0.023322
v -0.104441 0.684933 0.026552
v 0.235554 0.546357 0.030589
v 0.232161 0.526839 0.002152
v 0.235935 0.533671 -0.031303
v 0.244667 0.562855 -0.050178
v 0.253241 0.597290 -0.043416
v 0.256635 0.616809 -0.014980
v 0.252860 0.609975 0.018475
v 0.244129 0.580795 0.037350
v 0.399343 0.539258 0.040048
v -0.426747 0.741371 0.030254
v 0.392384 0.508530 0.026898
v -0.437963 0.700314 0.017055
v 0.391055 0.495794 -0.004671
v -0.441056 0.683294 -0.014535
v 0.396133 0.508499 -0.036167
v -0.434214 0.700283 -0.046011
v 0.404645 0.539214 -0.049140
v -0.421444 0.741327 -0.058934
v 0.411603 0.569935 -0.035990
v -0.410227 0.782385 -0.045735
v 0.412933 0.582678 -0.004421
v -0.407134 0.799404 -0.014145
v 0.407853 0.569966 0.027075
v -0.413977 0.782415 0.017331
v 0.552793 0.510957 0.041866
v -0.544818 0.784934 0.040464
v 0.546502 0.481820 0.028724
v -0.580800 0.741397 0.023572
v 0.545451 0.469746 -0.002842
v -0.592171 0.722483 -0.016327
v 0.550251 0.481790 -0.034341
v -0.576075 0.741358 -0.055904
v 0.558096 0.510913 -0.047322
v -0.538136 0.784879 -0.071930
v 0.564385 0.540042 -0.034180
v -0.502155 0.828417 -0.055037
v 0.565438 0.552126 -0.002614
v -0.489208 0.846467 -0.015120
v 0.560635 0.540072 0.028886
v -0.506880 0.828456 0.024438
v -0.486131 0.764803 0.033846
v -0.507902 0.724293 0.019584
v -0.515287 0.707123 -0.014551
v -0.503961 0.723351 -0.048561
v -0.480558 0.763471 -0.062526
v -0.458787 0.803982 -0.048263
v -0.451402 0.821152 -0.014129
v -0.462728 0.804924 0.019882
v -0.271901 0.698159 0.032091
v -0.282201 0.659344 0.018902
v -0.284913 0.643254 -0.012684
v -0.278451 0.659314 -0.044164
v -0.266599 0.698116 -0.057098
v -0.256299 0.736930 -0.043909
v -0.253587 0.753020 -0.012324
v -0.260049 0.736961 0.019156
v -0.361713 0.672959 -0.037428
v -0.360520 0.688098 0.024475
v -0.366335 0.664942 -0.003980
v -0.349362 0.707452 -0.056276
v -0.336517 0.748215 -0.049482
v -0.330702 0.771371 -0.021027
v -0.335324 0.763354 0.012421
v -0.347675 0.728862 0.031269
v -0.189118 0.716529 0.017432
v -0.200324 0.679842 0.029661
v -0.210062 0.643142 0.017191
v -0.212627 0.627928 -0.012674
v -0.206517 0.643113 -0.042439
v -0.195310 0.679801 -0.054668
v -0.185572 0.716500 -0.042198
v -0.183007 0.731714 -0.012333
v -0.019328 0.634135 0.031208
v -0.028170 0.599720 0.018848
v -0.030375 0.585454 -0.010774
v -0.024653 0.599691 -0.040304
v -0.014354 0.634094 -0.052445
v -0.005512 0.668506 -0.040084
v -0.003307 0.682773 -0.010463
v -0.009029 0.668535 0.019068
v 0.149469 0.566505 0.030589
v 0.146075 0.546987 0.002152
v 0.149849 0.553819 -0.031303
v 0.158582 0.583003 -0.050178
v 0.167155 0.617437 -0.043416
v 0.170549 0.636957 -0.014980
v 0.166775 0.630123 0.018475
v 0.158043 0.600943 0.037350
v 0.317004 0.557577 0.038647
v 0.310215 0.527826 0.025910
v 0.308909 0.515492 -0.004667
v 0.313847 0.527790 -0.035174
v 0.322140 0.557527 -0.047739
v 0.328927 0.587272 -0.035002
v 0.330235 0.599612 -0.004425
v 0.325295 0.587308 0.026082
v 0.468927 0.504550 0.034287
v 0.466366 0.487024 0.005860
v 0.469848 0.493155 -0.027598
v 0.477336 0.519362 -0.046487
v 0.484441 0.550282 -0.039743
v 0.487004 0.567813 -0.011316
v 0.483521 0.561676 0.022142
v 0.476034 0.535476 0.041032
