[
    {
        "type": "OPENING",
        "answers": ["danganronpa", "dangan ronpa the animation", "dangan ronpa"],
        "season": 0,
        "anime_link": "https://anilist.co/anime/16592/Danganronpa-Kibou-no-Gakuen-to-Zetsubou-no-Koukousei--The-Animation/",
        "song_link": "https://youtu.be/Avr-Iu5vWsM"
    },

    {
        "type": "ENDING",
        "answers": ["danganronpa", "dangan ronpa the animation", "dangan ronpa"],
        "season": 0,
        "anime_link": "https://anilist.co/anime/16592/Danganronpa-Kibou-no-Gakuen-to-Zetsubou-no-Koukousei--The-Animation/",
        "song_link": "https://youtu.be/z3x5sedptNY"
    },

    {
        "type": "OPENING",
        "answers": ["bakemonogatari", "monogatari series"],
        "season": 0,
        "anime_link": "https://anilist.co/anime/5081/Bakemonogatari/",
        "song_link": "https://youtu.be/TRpCeX4x6ks"
    },

    {
        "type": "ENDING",
        "answers": ["bakemonogatari", "monogatari series"],
        "season": 0,
        "anime_link": "https://anilist.co/anime/5081/Bakemonogatari/",
        "song_link": "https://youtu.be/TRpCeX4x6ks"
    },

    {
        "type": "OPENING",
        "answers": ["soul eater", "souleater"],
        "season": 0,
        "anime_link": "https://anilist.co/anime/3588/Soul-Eater/",
        "song_link": "https://youtu.be/NCqqluVhxFk"
    },

    {
        "type": "ENDING",
        "answers": ["soul eater", "souleater"],
        "season": 0,
        "anime_link": "https://anilist.co/anime/3588/Soul-Eater/",
        "song_link": "https://youtu.be/C_y09j8KPA8"
    },

    {
        "type": "OPENING",
        "answers": ["kill la kill"],
        "season": 0,
        "anime_link": "https://anilist.co/anime/18679/Kill-la-Kill/",
        "song_link": "https://youtu.be/qaLeO-2Fytg"
    },

    {
        "type": "ENDING",
        "answers": ["kill la kill"],
        "season": 0,
        "anime_link": "https://anilist.co/anime/18679/Kill-la-Kill/",
        "song_link": "https://youtu.be/2HACXCqZGJ8"
    },

    {
        "type": "OPENING",
        "answers": ["shin seiki evangelion", "neon genesis evangelion", "evangelion"],
        "season": 0,
        "anime_link": "https://anilist.co/anime/30/Shin-Seiki-Evangelion/",
        "song_link": "https://youtu.be/t-QSmNReDyI"
    },

    {
        "type": "ENDING",
        "answers": ["shin seiki evangelion", "neon genesis evangelion", "evangelion"],
        "season": 0,
        "anime_link": "https://anilist.co/anime/30/Shin-Seiki-Evangelion/",
        "song_link": "https://youtu.be/jmKRgqWGrWc"
    },

    {
        "type": "OPENING",
        "answers": ["trigun"],
        "season": 0,
        "anime_link": "https://anilist.co/anime/6/Trigun/",
        "song_link": "https://youtu.be/4OxFSy8G5wk"
    },

    {
        "type": "ENDING",
        "answers": ["trigun"],
        "season": 0,
        "anime_link": "https://anilist.co/anime/6/Trigun/",
        "song_link": "https://youtu.be/rO0H80_JiOI"
    },

    {
        "type": "OPENING",
        "answers": ["fma", "hagane no renkinjutsushi: fullmetal alchemist", "fullmetal alchemist: brotherhood", "fullmetal alchemist brotherhood", "fmab"],
        "season": 0,
        "anime_link": "https://anilist.co/anime/5114/Hagane-no-Renkinjutsushi-Fullmetal-Alchemist/",
        "song_link": "https://youtu.be/2uq34TeWEdQ"
    },

    {
        "type": "ENDING",
        "answers": ["fma", "hagane no renkinjutsushi: fullmetal alchemist", "fullmetal alchemist: brotherhood", "fullmetal alchemist brotherhood", "fmab"],
        "season": 0,
        "anime_link": "https://anilist.co/anime/5114/Hagane-no-Renkinjutsushi-Fullmetal-Alchemist/",
        "song_link": "https://youtu.be/9mUcDMZviJY"
    },

    {
        "type": "OPENING",
        "answers": ["ngnl", "no game no life"],
        "season": 0,
        "anime_link": "https://anilist.co/anime/19815/No-Game-No-Life/",
        "song_link": "https://youtu.be/NQCax11Q0Bs"
    },

    {
        "type": "ENDING",
        "answers": ["ngnl", "no game no life"],
        "season": 0,
        "anime_link": "https://anilist.co/anime/19815/No-Game-No-Life/",
        "song_link": "https://youtu.be/pVcoWgTHt0U"
    },

    {
        "type": "OPENING",
        "answers": ["tokyo ghoul"],
        "season": 0,
        "anime_link": "https://anilist.co/anime/20605/Tokyo-Ghoul/",
        "song_link": "https://youtu.be/uMeR2W19wT0"
    },

    {
        "type": "ENDING",
        "answers": ["tokyo ghoul"],
        "season": 0,
        "anime_link": "https://anilist.co/anime/20605/Tokyo-Ghoul/",
        "song_link": "https://youtu.be/lfQUGSe5ozA"
    },

    {
        "type": "OPENING",
        "answers": ["fire force", "enen no shouboutai"],
        "season": 0,
        "anime_link": "https://anilist.co/anime/105310/Enen-no-Shouboutai/",
        "song_link": "https://youtu.be/KLvm8-VMRDk"
    },

    {
        "type": "ENDING",
        "answers": ["fire force", "enen no shouboutai"],
        "season": 0,
        "anime_link": "https://anilist.co/anime/105310/Enen-no-Shouboutai/",
        "song_link": "https://youtu.be/H55jDJAW_Ic"
    },

    {
        "type": "OPENING",
        "answers": ["dr stone", "dr. stone"],
        "season": 0,
        "anime_link": "https://anilist.co/anime/105333/Dr-STONE/",
        "song_link": "https://youtu.be/tF4faMbs5oQ"
    },

    {
        "type": "ENDING",
        "answers": ["dr stone", "dr. stone"],
        "season": 0,
        "anime_link": "https://anilist.co/anime/105333/Dr-STONE/",
        "song_link": "https://www.youtube.com/watch?v=aATPWZ-FpJ8"
    },

    {
        "type": "OPENING",
        "answers": ["serial experiments lain"],
        "season": 0,
        "anime_link": "https://anilist.co/anime/339/Serial-Experiments-Lain/",
        "song_link": "https://youtu.be/4-PkAQcuZOw"
    },

    {
        "type": "ENDING",
        "answers": ["serial experiments lain"],
        "season": 0,
        "anime_link": "https://anilist.co/anime/339/Serial-Experiments-Lain/",
        "song_link": "https://www.youtube.com/watch?v=JaMc76542v8"
    },

    {
        "type": "OPENING",
        "answers": ["bleach"],
        "season": 0,
        "anime_link": "https://anilist.co/anime/269/Bleach/",
        "song_link": "https://youtu.be/_ty-Nqm4Pdc"
    },

    {
        "type": "ENDING",
        "answers": ["bleach"],
        "season": 0,
        "anime_link": "https://anilist.co/anime/269/Bleach/",
        "song_link": "https://youtu.be/y93jQHagcM0"
    },

    {
        "type": "OPENING",
        "answers": ["gintama", "gin tama"],
        "season": 0,
        "anime_link": "https://anilist.co/anime/918/Gintama/",
        "song_link": "https://youtu.be/REHaJZgWwxY"
    },

    {
        "type": "ENDING",
        "answers": ["gintama", "gin tama"],
        "season": 0,
        "anime_link": "https://anilist.co/anime/918/Gintama/",
        "song_link": "https://youtu.be/bLXqZ6KL9IQ"
    },

    {
        "type": "OPENING",
        "answers": ["kokkoku"],
        "season": 0,
        "anime_link": "https://anilist.co/anime/100332/Kokkoku/",
        "song_link": "https://youtu.be/fhBA6ynorvc"
    },

    {
        "type": "ENDING",
        "answers": ["kokkoku"],
        "season": 0,
        "anime_link": "https://anilist.co/anime/100332/Kokkoku/",
        "song_link": "https://youtu.be/kwb_GRm6NtU"
    },

    {
        "type": "OPENING",
        "answers": ["youjo senki", "saga of tanya the evil"],
        "season": 0,
        "anime_link": "https://anilist.co/anime/21613/Youjo-Senki/",
        "song_link": "https://youtu.be/4S6e542qEm0"
    },

    {
        "type": "ENDING",
        "answers": ["youjo senki", "saga of tanya the evil"],
        "season": 0,
        "anime_link": "https://anilist.co/anime/21613/Youjo-Senki/",
        "song_link": "https://youtu.be/OgXZn_H_QAI"
    },

    {
        "type": "OPENING",
        "answers": ["isekai quartet", "Isekai Quartet"],
        "season": 0,
        "anime_link": "https://anilist.co/anime/104454/Isekai-Quartet/",
        "song_link": "https://youtu.be/RNjMiwoOu68"
    },

    {
        "type": "ENDING",
        "answers": ["isekai quartet", "Isekai Quartet"],
        "season": 0,
        "anime_link": "https://anilist.co/anime/104454/Isekai-Quartet/",
        "song_link": "https://youtu.be/yYa7vu4jpGo"
    },

    {
        "type": "OPENING",
        "answers": ["kono suba", "konosuba", "KONOSUBA -God's blessing on this wonderful world!", "Kono Subarashii Sekai ni Shukufuku wo!"],
        "season": 0,
        "anime_link": "https://anilist.co/anime/21202/Kono-Subarashii-Sekai-ni-Shukufuku-wo/",
        "song_link": "https://youtu.be/VtfUrDwpo2E"
    },

    {
        "type": "ENDING",
        "answers": ["kono suba", "konosuba", "KONOSUBA -God's blessing on this wonderful world!", "Kono Subarashii Sekai ni Shukufuku wo!"],
        "season": 0,
        "anime_link": "https://anilist.co/anime/21202/Kono-Subarashii-Sekai-ni-Shukufuku-wo/",
        "song_link": "https://youtu.be/cR3E9nwcthM"
    },

    {
        "type": "OPENING",
        "answers": ["overlord", "over lord"],
        "season": 0,
        "anime_link": "https://anilist.co/anime/20832/Overlord/",
        "song_link": "https://youtu.be/vci9YwpFFcA"
    },

    {
        "type": "ENDING",
        "answers": ["overlord", "over lord"],
        "season": 0,
        "anime_link": "https://anilist.co/anime/20832/Overlord/",
        "song_link": "https://youtu.be/UptDZeIeVOI"
    },

    {
        "type": "OPENING",
        "answers": ["wotakoi", "Wotaku ni Koi wa Muzukashii", "Wotakoi: Love is Hard for Otaku", "love is hard for an otaku"],
        "season": 0,
        "anime_link": "https://anilist.co/anime/99578/Wotaku-ni-Koi-wa-Muzukashii/",
        "song_link": "https://www.youtube.com/watch?v=ObQd7Co7Q_I"
    },

    {
        "type": "ENDING",
        "answers": ["wotakoi", "Wotaku ni Koi wa Muzukashii", "Wotakoi: Love is Hard for Otaku", "love is hard for an otaku"],
        "season": 0,
        "anime_link": "https://anilist.co/anime/99578/Wotaku-ni-Koi-wa-Muzukashii/",
        "song_link": "https://youtu.be/trCmrxRUlBE"
    },

    {
        "type": "OPENING",
        "answers": ["AoButa", "bunny girl senpai", "Rascal Does Not Dream of Bunny Girl Senpai", "Seishun Buta Yarou wa Bunny Girl-senpai no Yume wo Minai"],
        "season": 0,
        "anime_link": "https://anilist.co/anime/101291/Seishun-Buta-Yarou-wa-Bunny-Girlsenpai-no-Yume-wo-Minai/",
        "song_link": "https://youtu.be/z1PWA11Ec3E"
    },

    {
        "type": "ENDING",
        "answers": ["AoButa", "bunny girl senpai", "Rascal Does Not Dream of Bunny Girl Senpai", "Seishun Buta Yarou wa Bunny Girl-senpai no Yume wo Minai"],
        "season": 0,
        "anime_link": "https://anilist.co/anime/101291/Seishun-Buta-Yarou-wa-Bunny-Girlsenpai-no-Yume-wo-Minai/",
        "song_link": "https://www.youtube.com/watch?v=1vAafUBCHKU"
    },

    {
        "type": "OPENING",
        "answers": ["steins gate", "steins;gate", "steinsgate", "s;g"],
        "season": 0,
        "anime_link": "https://anilist.co/anime/9253/SteinsGate/",
        "song_link": "https://youtu.be/dd7BILZcYAY"
    },

    {
        "type": "ENDING",
        "answers": ["steins gate", "steins;gate", "steinsgate", "s;g"],
        "season": 0,
        "anime_link": "https://anilist.co/anime/9253/SteinsGate/",
        "song_link": "https://youtu.be/DZhoUy6VU24"
    },

    {
        "type": "OPENING",
        "answers": ["Yakusoku no Neverland", "The Promised Neverland", "promised neverland", "YakuNeba"],
        "season": 0,
        "anime_link": "https://anilist.co/anime/101759/Yakusoku-no-Neverland/",
        "song_link": "https://youtu.be/lm0cTOQpOf8"
    },

    {
        "type": "ENDING",
        "answers": ["Yakusoku no Neverland", "The Promised Neverland", "promised neverland", "Yakuneba"],
        "season": 0,
        "anime_link": "https://anilist.co/anime/101759/Yakusoku-no-Neverland/",
        "song_link": "https://youtu.be/sZ9qdr5WcPY"
    },

    {
        "type": "OPENING",
        "answers": ["Boku no Hero Academia", "my hero academia", "mha", "bnha"],
        "season": 0,
        "anime_link": "https://anilist.co/anime/21459/Boku-no-Hero-Academia/",
        "song_link": "https://youtu.be/-77UEct0cZM"
    },

    {
        "type": "ENDING",
        "answers": ["Boku no Hero Academia", "my hero academia", "mha", "bnha"],
        "season": 0,
        "anime_link": "https://anilist.co/anime/21459/Boku-no-Hero-Academia/",
        "song_link": "https://youtu.be/AXzOt6bDmjs"
    },

    {
        "type": "OPENING",
        "answers": ["darling in the franxx", "darlifra"],
        "season": 0,
        "anime_link": "https://anilist.co/anime/99423/Darling-in-the-Franxx/",
        "song_link": "https://youtu.be/hCzkkHwR2gg"
    },

    {
        "type": "ENDING",
        "answers": ["darling in the franxx", "darlifra"],
        "season": 0,
        "anime_link": "https://anilist.co/anime/99423/Darling-in-the-Franxx/",
        "song_link": "https://youtu.be/b18GVaTNMNA"
    }
    
]