0 0 0 0 0 0 0 0
0.1428571428571428 0 0 0 0 0 0 0
0.2385045312379338 0.0472097544763519 0 0 0 0 0 0
0.349639403536688 0 0.07893202503474057 0 0 0 0 0
0.4520857730719386 0 0 0.1193427983566329 0 0 0 0
0.5411224567404274 0 0 0 0.1731632575452869 0 0 0
0.6077082551337684 0 0 0 0 0.2494346020090888 0 0
0.6319192504880835 0 0 0 0 0 0.3680807495119165 0
