0 0 0 0 0 0 0 0 0 0
0.1111111111111111 0 0 0 0 0 0 0 0 0
0.192077912288834 0.03014430993338824 0 0 0 0 0 0 0 0
0.2840628756610301 0 0.04927045767230326 0 0 0 0 0 0 0
0.3721077408221805 0 0 0.07233670362226398 0 0 0 0 0 0
0.4546677092814924 0 0 0 0.1008878462740632 0 0 0 0 0
0.5292415840370277 0 0 0 0 0.137425082629639 0 0 0 0
0.5914776690646804 0 0 0 0 0 0.1863001087130974 0 0 0
0.6330230239451125 0 0 0 0 0 0 0.2558658649437764 0 0
0.6353735978624059 0 0 0 0 0 0 0 0.3646264021375942 0
