0 0 0 0 0 0 0 0 0
0.125 0 0 0 0 0 0 0 0
0.2127410785438436 0.03725892145615636 0 0 0 0 0 0 0
0.3134896367384515 0 0.06151036326154845 0 0 0 0 0 0
0.4085349954342695 0 0 0.09146500456573047 0 0 0 0 0
0.4952784070448939 0 0 0 0.1297215929551061 0 0 0 0
0.5692017823100884 0 0 0 0 0.1807982176899116 0 0 0
0.6216435988411942 0 0 0 0 0 0.2533564011588058 0 0
0.6334676062129524 0 0 0 0 0 0 0.3665323937870476 0
