     #Rep       r/D      r/D        <U_z>           <p>   <U_r(rms)>  <U_phi(rms)>  <U_z(rms)>     <UW(res)>     <UW(vsc)>     <UW(tot)>     <UUU(res)>     <UVV(res)>     <UWW(res)>   <TKE(res)>    <Dissip>
       1   0.0026   0.00521  19.310192    -0.12571138   0.6569696      0.65668121  0.87701815  0.0057374738  5.715242E-05  0.0057946262  -0.0016223351  -5.416218E-04  -0.0051893605  0.81179969   80.358088
       2   0.00781  0.01042  19.309978    -0.12718419   0.65674967     0.65645994  0.87756261  0.015165486   6.003293E-04  0.015765815   -0.0046387216  -0.001498799   -0.016211889   0.81248031    6.2810414
       3   0.01302  0.01562  19.307941    -0.12768962   0.65675163     0.6561529   0.87816642  0.024474245   0.0016524673  0.026126713   -0.0077438861  -0.0023935855  -0.027071521   0.81276643    2.9639402
       4   0.01823  0.02083  19.303781    -0.1283377    0.65693845     0.65595676  0.8790018   0.0338425     0.0027779033  0.036620403   -0.011014565   -0.0034158183  -0.037457712   0.81344477    2.8670501
       5   0.02344  0.02604  19.297524    -0.12917339   0.65728511     0.65593446  0.88034581  0.043300085   0.0038816728  0.047181757   -0.01445322    -0.0044850904  -0.047266478   0.81478766    2.8594465
       6   0.02865  0.03125  19.289225    -0.13018017   0.65777279     0.65611233  0.88253969  0.052881914   0.0049436892  0.057825603   -0.018027598   -0.0055346215  -0.056651886   0.81710291    2.8711095
       7   0.03385  0.03646  19.278985    -0.13133183   0.65839019     0.65653741  0.88584657  0.062609023   0.005939879   0.068548902   -0.021690998   -0.0065110783  -0.065844287   0.82065158    2.8894667
       8   0.03906  0.04167  19.26695     -0.13260046   0.65913375     0.65729258  0.89037783  0.072477674   0.0068513969  0.079329071   -0.025392933   -0.0073990455  -0.075030762   0.82559555    2.9095149
       9   0.04427  0.04687  19.253292    -0.13395759   0.66000301     0.65845997  0.89609783  0.082458071   0.007671748   0.090129819   -0.029089      -0.0082293068  -0.084326068   0.83197477    2.9297381
      10   0.04948  0.05208  19.238181    -0.13537373   0.66099427     0.66008038  0.90287597  0.092507472   0.0084070002  0.10091447    -0.032740792   -0.0090396196  -0.093805554   0.83971937    2.9509151
      11   0.05469  0.05729  19.221766    -0.13681825   0.66209854     0.66215499  0.91052699  0.10258116    0.0090747672  0.11165593    -0.036302632   -0.0098264574  -0.10353769    0.84867994    2.9750004
      12   0.0599   0.0625   19.204151    -0.13826059   0.66330512     0.66468555  0.91882578  0.11263735    0.0097055558  0.1223429     -0.039709391   -0.010556497   -0.11359953    0.85866544    3.0044574
      13   0.0651   0.06771  19.18537     -0.13967326   0.66460812     0.66770729  0.92753165  0.12264234    0.010339462   0.13298181    -0.042882896   -0.011222672   -0.12406388    0.86948928    3.041744
      14   0.07031  0.07292  19.165378    -0.14103625   0.66601089     0.67127676  0.93644584  0.13257948    0.011013787   0.14359327    -0.045756992   -0.011871685   -0.13496774    0.88101831    3.0881155
      15   0.07552  0.07812  19.144068    -0.14234085   0.66752558     0.67542967  0.94546166  0.1424525     0.011748531   0.15420103    -0.048304581   -0.012569713   -0.14628584    0.89319498    3.142463
      16   0.08073  0.08333  19.121321    -0.14359093   0.66916843     0.68014011  0.95455252  0.15227476    0.012540713   0.16481547    -0.050550174   -0.013353861   -0.15790246    0.90599904    3.201498
      17   0.08594  0.08854  19.097041    -0.14480078   0.67095279     0.6852964   0.96370129  0.16205148    0.013372852   0.17542433    -0.05256196    -0.014212801   -0.16957066    0.91935929    3.2624577
      18   0.09115  0.09375  19.071173    -0.14599044   0.67288363     0.690727    0.97285384  0.17177391    0.014228949   0.18600285    -0.054427855   -0.015099664   -0.18090095    0.9331195     3.3263325
      19   0.09635  0.09896  19.043682    -0.14718013   0.67495745     0.69627985  0.98197185  0.1814378     0.015101388   0.19653919    -0.05622961    -0.015975522   -0.19150551    0.94714034    3.3965143
      20   0.10156  0.10417  19.014543    -0.1483869    0.67716775     0.70189328  0.99110495  0.19106538    0.015983049   0.20704843    -0.058029808   -0.016848809   -0.2012285     0.96142395    3.4739348
      21   0.10677  0.10937  18.983746    -0.14962572   0.67951205     0.70759976  1.0003617   0.20069733    0.016859813   0.21755714    -0.059875974   -0.017784974   -0.21015374    0.97609968    3.5556361
      22   0.11198  0.11458  18.951318    -0.15091261   0.68199397     0.71346049  1.0098275   0.2103667     0.017714981   0.22808168    -0.061810284   -0.018879703   -0.21839498    0.99130361    3.6393632
      23   0.11719  0.11979  18.917315    -0.15226543   0.68461971     0.71949636  1.0195556   0.22009087    0.018536975   0.23862785    -0.063870565   -0.020201517   -0.22599864    1.0071186     3.7264914
      24   0.1224   0.125    18.881805    -0.15370267   0.68739421     0.72567145  1.0296293   0.22988179    0.019319544   0.24920134    -0.066086258   -0.021744202   -0.23306516    1.0236197     3.8184129
      25   0.1276   0.13021  18.844866    -0.15524321   0.69032067     0.73191628  1.0401754   0.23974714    0.020058108   0.25980525    -0.068479339   -0.023417214   -0.23983854    1.0409044     3.913764
      26   0.13281  0.13542  18.806587    -0.15690772   0.69340196     0.73815741  1.0513046   0.24967586    0.020750873   0.27042674    -0.071067176   -0.025068986   -0.24661779    1.0590544     4.0102676
      27   0.13802  0.14062  18.767051    -0.15871961   0.69664159     0.74433904  1.0630548   0.25963154    0.021403456   0.28103499    -0.073860428   -0.026529895   -0.25358868    1.0780914     4.1077916
      28   0.14323  0.14583  18.726324    -0.1607044    0.70004441     0.75044364  1.0753979   0.26957269    0.022027718   0.2916004     -0.076856758   -0.02766301    -0.26075915    1.0979974     4.2085047
      29   0.14844  0.15104  18.684447    -0.16288825   0.70361704     0.75651071  1.0882868   0.27948234    0.022632458   0.3021148     -0.080036282   -0.028412863   -0.26807679    1.1187778     4.3132103
      30   0.15365  0.15625  18.641452    -0.16529557   0.70736715     0.76262839  1.1016608   0.2893689     0.023216888   0.31258578    -0.083361041   -0.028830039   -0.27555608    1.1404615     4.41956
      31   0.15885  0.16146  18.597383    -0.1679451    0.71130004     0.76889644  1.1153986   0.29923904    0.023775377   0.32301441    -0.086776743   -0.029065616   -0.28319477    1.163019      4.5253492
      32   0.16406  0.16667  18.552294    -0.17084523   0.71541449     0.77538103  1.1293218   0.30908889    0.024305116   0.333394      -0.090210779   -0.029328164   -0.29089236    1.1863234     4.6308853
      33   0.16927  0.17187  18.506239    -0.17399132   0.71970036     0.78207978  1.143262    0.31891998    0.02480619    0.34372617    -0.09356904    -0.029793196   -0.2985757     1.2101907     4.7381394
      34   0.17448  0.17708  18.459271    -0.17736643   0.72413861     0.78892916  1.1571068   0.32873894    0.025278935   0.35401787    -0.096749857   -0.030537288   -0.30627878    1.2344357     4.8486378
      35   0.17969  0.18229  18.411443    -0.18094293   0.72870205     0.79584833  1.1708003   0.33854361    0.025726533   0.36427014    -0.099675691   -0.031548983   -0.31406578    1.2589113     4.9620674
      36   0.1849   0.1875   18.362797    -0.18468284   0.7333557      0.80276293  1.1843238   0.3483245     0.026159402   0.3744839     -0.10230862    -0.032727567   -0.32198045    1.2835085     5.0789718
      37   0.1901   0.19271  18.313345    -0.18853965   0.73806116     0.80962327  1.1976764   0.3580722     0.026594798   0.384667      -0.10463036    -0.033870002   -0.33007381    1.3081508     5.2024399
      38   0.19531  0.19792  18.263066    -0.19246765   0.74278777     0.81643929  1.2108619   0.36777458    0.027051317   0.39482589    -0.10661598    -0.034766758   -0.33839165    1.3328128     5.3343846
      39   0.20052  0.20312  18.211903    -0.19643733   0.74752333     0.82325216  1.223884    0.37741081    0.027543115   0.40495393    -0.10823443    -0.035332222   -0.34690475    1.3575057     5.473914
      40   0.20573  0.20833  18.159779    -0.20044471   0.7522723      0.83004265  1.2367582   0.38695559    0.028077928   0.41503352    -0.10947304    -0.035586111   -0.35551912    1.3822237     5.6209941
      41   0.21094  0.21354  18.106611    -0.20450325   0.75704165     0.83672098  1.2495322   0.3963974     0.028657735   0.42505513    -0.11035207    -0.035534801   -0.36414836    1.4069534     5.7781208
      42   0.21615  0.21875  18.052313    -0.20862368   0.76182762     0.84321953  1.2622998   0.40575637    0.029280483   0.43503685    -0.11090593    -0.035124086   -0.37277722    1.4317544     5.9466126
      43   0.22135  0.22396  17.996809    -0.21279712   0.76661135     0.84956832  1.2751838   0.41508352    0.029942157   0.44502568    -0.11115374    -0.034284707   -0.38148383    1.4567967     6.1243999
      44   0.22656  0.22917  17.94003     -0.21698942   0.77136231     0.85588679  1.2883096   0.42444751    0.030635704   0.45508322    -0.11108735    -0.033011738   -0.39041171    1.4823243     6.3080797
      45   0.23177  0.23437  17.881925    -0.22114789   0.77604766     0.86231535  1.3017831   0.43391584    0.031349984   0.46526582    -0.11067984    -0.031413202   -0.3997449     1.5085776     6.4959251
      46   0.23698  0.23958  17.822467    -0.22521683   0.78064186     0.86895012  1.3156668   0.4435343     0.032076704   0.47561101    -0.10992635    -0.029689382   -0.4097121     1.5357144     6.6891429
      47   0.24219  0.24479  17.761637    -0.22914891   0.78512734     0.87582232  1.3299725   0.45332204    0.032818975   0.48614102    -0.10889825    -0.028059009   -0.42060193    1.5637811     6.8911838
      48   0.2474   0.25     17.699396    -0.23290383   0.78948921     0.88291925  1.3446841   0.46327803    0.033588086   0.49686612    -0.10773423    -0.026670956   -0.43259741    1.5927526     7.1064757
      49   0.2526   0.25521  17.635682    -0.23644558   0.79371532     0.89020632  1.3598114   0.47339412    0.034388939   0.50778306    -0.10658388    -0.025577072   -0.44557265    1.6226184     7.3365118
      50   0.25781  0.26042  17.570438    -0.23974531   0.79779713     0.89762401  1.3754119   0.48366419    0.035207708   0.5188719     -0.10557704    -0.02477156    -0.45928482    1.653416      7.5782331
      51   0.26302  0.26562  17.503653    -0.24278086   0.80172753     0.90510857  1.3915395   0.49406605    0.036013718   0.53007977    -0.10478851    -0.024195719   -0.4736244     1.6851806     7.8291809
      52   0.26823  0.27083  17.435386    -0.24553526   0.8055029      0.91264367  1.4081934   0.50453415    0.03677385    0.541308      -0.10423016    -0.023753496   -0.48866841    1.7179171     8.085268
      53   0.27344  0.27604  17.365751    -0.24799434   0.80911893     0.9202529   1.4252671   0.51493819    0.037471163   0.55240936    -0.10389634    -0.023316343   -0.50415957    1.7515199     8.3416547
      54   0.27865  0.28125  17.294869    -0.25013716   0.81256503     0.9279623   1.4425999   0.52512853    0.038114363   0.56324289    -0.10373351    -0.022719895   -0.51947346    1.7857949     8.5978708
      55   0.28385  0.28646  17.222822    -0.25193399   0.81582734     0.93578134  1.4600546   0.53502282    0.038729022   0.57375184    -0.10361201    -0.021821977   -0.53435503    1.8205528     8.8590956
      56   0.28906  0.29167  17.149636    -0.25334826   0.81888626     0.94369468  1.4775316   0.54460657    0.039352808   0.58395938    -0.10334186    -0.020659467   -0.5488987     1.855627      9.1334774
      57   0.29427  0.29687  17.075249    -0.2543308    0.82171319     0.95165194  1.4950336   0.55391005    0.040035542   0.59394559    -0.10266691    -0.019444333   -0.56337407    1.8909526     9.4289532
      58   0.29948  0.30208  16.999502    -0.25482098   0.82427348     0.95955054  1.5127206   0.56302943    0.040811287   0.60384072    -0.10132606    -0.018338641   -0.57832324    1.9266441     9.7497666
      59   0.30469  0.30729  16.922207    -0.25475176   0.82652723     0.96722769  1.5308556   0.57207246    0.041675438   0.6137479     -0.099163304   -0.01741459    -0.59435161    1.9629217    10.093699
      60   0.3099   0.3125   16.843219    -0.25405657   0.82843507     0.97447724  1.5497002   0.58108546    0.042603588   0.62368904    -0.096130678   -0.016649748   -0.61178337    1.9999774    10.453259
      61   0.3151   0.31771  16.762444    -0.25268163   0.82996616     0.98112822  1.5694251   0.59005879    0.043579758   0.63363855    -0.092252736   -0.015950843   -0.63068126    2.0379183    10.81801
      62   0.32031  0.32292  16.679795    -0.25058635   0.8310907      0.98709025  1.5899982   0.59892619    0.044618642   0.64354483    -0.087626487   -0.015218403   -0.65077032    2.0766275    11.191799
      63   0.32552  0.32812  16.595124    -0.24771237   0.83175542     0.99236317  1.6113755   0.60762132    0.045761031   0.65338235    -0.082356254   -0.014331383   -0.67145897    2.1160393    11.592354
      64   0.33073  0.33333  16.508191    -0.24395886   0.83188503     0.99703524  1.6338113   0.61617283    0.047034781   0.66320761    -0.076472478   -0.013222314   -0.69291893    2.1566282    12.022837
      65   0.33594  0.33854  16.418743    -0.23920325   0.8314062      1.0012742   1.6576508   0.62461001    0.048451147   0.67306116    -0.069986484   -0.011980716   -0.71584764    2.1991231    12.475347
      66   0.34115  0.34375  16.3265      -0.23333042   0.83025851     1.0053388   1.6830232   0.63291253    0.050031725   0.68294425    -0.062932735   -0.010843311   -0.7405786     2.2440391    12.949316
      67   0.34635  0.34896  16.231124    -0.22623266   0.82838332     1.0094472   1.7098825   0.64108136    0.051800496   0.69288186    -0.05533902    -0.010125046   -0.76686521    2.2915891    13.45151
      68   0.35156  0.35417  16.132248    -0.21779008   0.82570473     1.013513    1.7382589   0.64915066    0.053761325   0.70291198    -0.047206718   -0.0099804087  -0.79440066    2.3418103    13.987917
      69   0.35677  0.35937  16.029519    -0.20785253   0.82211615     1.0172245   1.7682967   0.65711584    0.055906231   0.71302207    -0.038554985   -0.01018059    -0.82300684    2.3947109    14.562797
      70   0.36198  0.36458  15.922599    -0.19624044   0.81749413     1.0204203   1.8001645   0.66483729    0.058242126   0.72307942    -0.029425597   -0.010317488   -0.8522802     2.4504952    15.177364
      71   0.36719  0.36979  15.811111    -0.18277773   0.81172285     1.0229987   1.8340476   0.67220176    0.060792945   0.73299471    -0.019868677   -0.010291116   -0.88186715    2.5094844    15.831942
      72   0.3724   0.375    15.694626    -0.16730451   0.8046765      1.0247201   1.8701001   0.6791966     0.063599618   0.74279622    -0.010054824   -0.010000757   -0.91188186    2.5718581    16.529664
      73   0.3776   0.38021  15.572613    -0.14963677   0.79618746     1.025405    1.9084262   0.68574764    0.06673323    0.75248087    -2.499266E-04  -0.0092922728  -0.94153139    2.6377854    17.281422
      74   0.38281  0.38542  15.444376    -0.12956344   0.78607583     1.0250498   1.9491487   0.69178135    0.070286361   0.76206771     0.0093679534  -0.0083239669  -0.96982004    2.7076507    18.094724
      75   0.38802  0.39062  15.309039    -0.10691033   0.77418924     1.0237076   1.9923856   0.69727074    0.074386999   0.77165774     0.018660099   -0.0074627256  -0.99622546    2.7819545    18.974389
      76   0.39323  0.39583  15.165425    -0.081563825  0.76038846     1.0214116   2.0383802   0.7020626     0.079236254   0.78129885     0.02742923    -0.006952606   -1.0199409     2.8615145    19.91937
      77   0.39844  0.40104  15.011903    -0.053439661  0.74451876     1.0182076   2.0875652   0.70590476    0.085088305   0.79099307     0.035495974   -0.0067634898  -1.0395797     2.9476313    20.917221
      78   0.40365  0.40625  14.846344    -0.022470602  0.72641461     1.0142013   2.1401369   0.7085257     0.092241443   0.80076714     0.04276161    -0.0067590255  -1.0538643     3.0412766    21.976752
      79   0.40885  0.41146  14.665997     0.011387666  0.70588999     1.0095292   2.1959627   0.70954016    0.10106205    0.81060222     0.049060216   -0.0069192818  -1.0596212     3.1428345    23.134508
      80   0.41406  0.41667  14.467361     0.048166293  0.68272167     1.004349    2.2550538   0.70864046    0.11193314    0.8205736      0.054086818   -0.0073589898  -1.0523236     3.2530375    24.396758
      81   0.41927  0.42187  14.246248     0.087844801  0.65669821     0.99880103  2.3173724   0.70555156    0.12525364    0.8308052      0.057582919   -0.0082222796  -1.0283826     3.3725475    25.750161
      82   0.42448  0.42708  13.99766      0.13025553   0.62769164     0.9928533   2.3824796   0.69970073    0.14156513    0.84126585     0.059410822   -0.0094335874  -0.98391678    3.5010133    27.199805
      83   0.42969  0.43229  13.715379     0.17504304   0.59563307     0.98613298  2.4496004   0.69025633    0.16159644    0.85185277     0.059357504   -0.01066653    -0.91465774    3.6369532    28.738635
      84   0.4349   0.4375   13.391673     0.22171829   0.56046402     0.97803683  2.5174581   0.67633518    0.18622231    0.86255749     0.057197517   -0.011526678   -0.817555      3.7772547    30.334226
      85   0.4401   0.44271  13.017045     0.26966627   0.52217067     0.96767019  2.5838529   0.6569137     0.21651649    0.87343019     0.05298178    -0.011978713   -0.69044154    3.9158838    31.940022
      86   0.44531  0.44792  12.579737     0.31811866   0.48079913     0.95374091  2.6451829   0.63064514    0.25386475    0.88450989     0.047044596   -0.012338886   -0.53225465    4.0422741    33.512659
      87   0.45052  0.45312  12.065053     0.36618399   0.43641015     0.93469845  2.6959678   0.59578549    0.29998547    0.89577097     0.039838559   -0.012775752   -0.3448201     4.1399044    34.995884
      88   0.45573  0.45833  11.454791     0.41292074   0.38902032     0.90903603  2.7283731   0.55032123    0.35681338    0.90713461     0.031835024   -0.013233736   -0.1351901     4.1851902    36.277825
      89   0.46094  0.46354  10.727002     0.4573273    0.33870813     0.87532843  2.7313651   0.49231776    0.426194      0.91851176     0.023643619   -0.013510842    0.080725965   4.1459049    37.187896
      90   0.46615  0.46875   9.8565635    0.49826974   0.28575067     0.83200554  2.6895206   0.42057139    0.50924523    0.92981662     0.016005899   -0.013212598    0.27517191    3.980303     37.559568
      91   0.47135  0.47396   8.8173328    0.53453039   0.23063827     0.77726332  2.5818897   0.3356292     0.60521494    0.94084415     0.009576354   -0.011851498    0.40783393    3.6401952    37.408993
      92   0.47656  0.47917   7.5870075    0.5649159    0.1742091      0.70884429  2.3818383   0.24134941    0.70984233    0.95119174     0.0048148283  -0.0092641916   0.43492995    3.0838886    37.238322
      93   0.48177  0.48437   6.155424     0.58836712   0.11803593     0.62319722  2.0599874   0.1467069     0.81358875    0.96029565     0.0018500568  -0.0058424818   0.33706995    2.3069292    38.327625
      94   0.48698  0.48958   4.5360497    0.6041536    0.065292377    0.5129413   1.5956533   0.066797389   0.90171362    0.96851101     4.460383E-04  -0.0026344947   0.16493709    1.3946056    42.069641
      95   0.49219  0.49479   2.7739979    0.61236103   0.022213584    0.36382153  1.0011787   0.017508665   0.96044467    0.97795333     4.455106E-05  -6.209877E-04   0.034846698   0.56047401   47.429143
      96   0.4974   0.5       0.93438217   0.61474663   0              0.15418553  0.33778823  0.0011822667  0.98890136    0.99008363     6.585366E-07  -1.239871E-05   9.01436E-04   0.067358606  52.144313
