0 0 0 0 0 0 0 0
0.1428571428571428 0 0 0 0 0 0 0
0.2349455902592313 0.05076869545505447 0 0 0 0 0 0
0.3445422217439511 0 0.08402920682747746 0 0 0 0 0
0.4457911582690632 0 0 0.1256374131595082 0 0 0 0
0.5342554470884786 0 0 0 0.1800302671972357 0 0 0
0.601453615041786 0 0 0 0 0.2556892421010712 0 0
0.6286755291756486 0 0 0 0 0 0.3713244708243514 0
