0 0 0 0 0 0 0 0 0
0.125 0 0 0 0 0 0 0 0
0.2108087372770512 0.03919126272294875 0 0 0 0 0 0 0
0.3106612105009452 0 0.0643387894990548 0 0 0 0 0 0
0.4049221843589703 0 0 0.09507781564102967 0 0 0 0 0
0.4910927400706148 0 0 0 0.1339072599293852 0 0 0 0
0.5648415012042287 0 0 0 0 0.1851584987957713 0 0 0
0.6178756179057788 0 0 0 0 0 0.2571243820942212 0 0
0.6318671186638011 0 0 0 0 0 0 0.3681328813361989 0
