0 0 0 0 0 0 0
0.1666666666666667 0 0 0 0 0 0
0.2669187088125632 0.06641462452077013 0 0 0 0 0
0.3884537099940533 0 0.1115462900059467 0 0 0 0
0.496434047519377 0 0 0.1702326191472897 0 0 0
0.5819275359084889 0 0 0 0.2514057974248445 0 0
0.6252832407946255 0 0 0 0 0.3747167592053745 0
