0 0 0 0 0 0 0 0
0.1428571428571428 0 0 0 0 0 0 0
0.2330291001146357 0.05268518559964998 0 0 0 0 0 0
0.3423800535663731 0 0.0861913750050555 0 0 0 0 0
0.4439448287623525 0 0 0.127483742666219 0 0 0 0
0.5333672969868362 0 0 0 0.1809184172988781 0 0 0
0.6022304272405967 0 0 0 0 0.2549124299022604 0 0
0.6316368271450472 0 0 0 0 0 0.3683631728549528 0
