0 0 0 0 0 0 0 0 0
0.125 0 0 0 0 0 0 0 0
0.2121784677177144 0.03782153228228564 0 0 0 0 0 0 0
0.3126469787044632 0 0.06235302129553681 0 0 0 0 0 0
0.4074269255490905 0 0 0.09257307445090951 0 0 0 0 0
0.4939443318253109 0 0 0 0.1310556681746891 0 0 0 0
0.5677326304179504 0 0 0 0 0.1822673695820496 0 0 0
0.620246513033372 0 0 0 0 0 0.2547534869666281 0 0
0.6326391329641418 0 0 0 0 0 0 0.3673608670358582 0
