0 0 0 0 0 0 0
0.1666666666666667 0 0 0 0 0 0
0.2695630317458118 0.06377030158752153 0 0 0 0 0
0.3920715321942557 0 0.1079284678057443 0 0 0 0
0.5005800947722092 0 0 0.1660865718944574 0 0 0
0.5857986533313045 0 0 0 0.2475346800020288 0 0
0.6273930747220717 0 0 0 0 0.3726069252779283 0
