0 0 0 0 0 0 0 0 0 0
0.1111111111111111 0 0 0 0 0 0 0 0 0
0.189159945104954 0.03306227711726822 0 0 0 0 0 0 0 0
0.2799217234290147 0 0.05341160990431859 0 0 0 0 0 0 0
0.3669894123109078 0 0 0.07745503213353667 0 0 0 0 0 0
0.4489292799214416 0 0 0 0.1066262756341139 0 0 0 0 0
0.5234135462210632 0 0 0 0 0.1432531204456035 0 0 0 0
0.5863639906291881 0 0 0 0 0 0.1914137871485897 0 0 0
0.6298487735163594 0 0 0 0 0 0 0.2590401153725295 0 0
0.6359312856716187 0 0 0 0 0 0 0 0.3640687143283812 0
