0 0 0 0 0 0 0 0
0.1428571428571428 0 0 0 0 0 0 0
0.2377890282497816 0.04792525746450414 0 0 0 0 0 0
0.3485690944888043 0 0.08000233408262429 0 0 0 0 0
0.4506857370832066 0 0 0.1207428343453648 0 0 0 0
0.5394649196508416 0 0 0 0.1748207946348726 0 0 0
0.6059801196218109 0 0 0 0 0.2511627375210462 0 0
0.6306074585912534 0 0 0 0 0 0.3693925414087465 0
