0 0 0 0 0 0 0
0.1666666666666667 0 0 0 0 0 0
0.2645159463609985 0.0688173869723348 0 0 0 0 0
0.385923883205406 0 0.1140761167945939 0 0 0 0
0.4946795826830643 0 0 0.1719870839836024 0 0 0
0.5820306657595936 0 0 0 0.2513026675737397 0 0
0.6284520049692561 0 0 0 0 0.3715479950307439 0
