{
  "kind": "collectionType",
  "collectionName": "empty_errors",
  "info": {
    "singularName": "empty-error",
    "pluralName": "empty-errors",
    "displayName": "EmptyError",
    "description": ""
  },
  "options": {
    "draftAndPublish": true
  },
  "pluginOptions": {},
  "attributes": {
    "img_empty_error": {
      "type": "media",
      "multiple": false,
      "required": true,
      "allowedTypes": [
        "images"
      ]
    },
    "title": {
      "type": "string"
    },
    "description": {
      "type": "string"
    }
  }
}
