{
  "kind": "collectionType",
  "collectionName": "footers",
  "info": {
    "singularName": "footer",
    "pluralName": "footers",
    "displayName": "Footer"
  },
  "options": {
    "draftAndPublish": true
  },
  "pluginOptions": {},
  "attributes": {
    "logo_name": {
      "type": "string"
    },
    "logo_link": {
      "type": "string"
    },
    "img_store_apple": {
      "allowedTypes": [
        "images"
      ],
      "type": "media",
      "multiple": false,
      "required": true
    },
    "img_store_google": {
      "allowedTypes": [
        "images"
      ],
      "type": "media",
      "multiple": false,
      "required": true
    },
    "menu_op1": {
      "type": "string"
    },
    "menu_op2": {
      "type": "string"
    },
    "menu_op3": {
      "type": "string"
    },
    "menu_op4": {
      "type": "string"
    },
    "menu_op5": {
      "type": "string"
    }
  }
}
