C:\Users\Saurabh Sawant\git\school-management-console-common\src\main\java\principal\PrincipalController.java
C:\Users\Saurabh Sawant\git\school-management-console-common\src\main\java\parent\WelcomeParent.java
C:\Users\Saurabh Sawant\git\school-management-console-common\src\main\java\student\WelcomeStudent.java
C:\Users\Saurabh Sawant\git\school-management-console-common\src\main\java\welcome\Welcome.java
C:\Users\Saurabh Sawant\git\school-management-console-common\src\main\java\welcome\WelcomeController.java
C:\Users\Saurabh Sawant\git\school-management-console-common\src\main\java\stage\StageMaster.java
C:\Users\Saurabh Sawant\git\school-management-console-common\src\main\java\admission\AcademicInfo.java
C:\Users\Saurabh Sawant\git\school-management-console-common\src\main\java\selectProfile\SelectProfileController.java
C:\Users\Saurabh Sawant\git\school-management-console-common\src\main\java\login\Login.java
C:\Users\Saurabh Sawant\git\school-management-console-common\src\main\java\admission\AcademicInfoController.java
C:\Users\Saurabh Sawant\git\school-management-console-common\src\main\java\registration\RegistrationInfo.java
C:\Users\Saurabh Sawant\git\school-management-console-common\src\main\java\login\LoginController.java
C:\Users\Saurabh Sawant\git\school-management-console-common\src\main\java\registration\RegistrationInfoController.java
C:\Users\Saurabh Sawant\git\school-management-console-common\src\main\java\registration\RegistrationPassword.java
C:\Users\Saurabh Sawant\git\school-management-console-common\src\main\java\admission\GeneralInfo.java
C:\Users\Saurabh Sawant\git\school-management-console-common\src\main\java\tempData\AdmissionData.java
C:\Users\Saurabh Sawant\git\school-management-console-common\src\main\java\principal\Principal.java
C:\Users\Saurabh Sawant\git\school-management-console-common\src\main\java\parent\WelcomeParentController.java
C:\Users\Saurabh Sawant\git\school-management-console-common\src\main\java\student\WelcomeStudentController.java
C:\Users\Saurabh Sawant\git\school-management-console-common\src\main\java\tempData\RegistrationData.java
C:\Users\Saurabh Sawant\git\school-management-console-common\src\main\java\registration\RegistrationPasswordController.java
C:\Users\Saurabh Sawant\git\school-management-console-common\src\main\java\selectProfile\SelectProfile.java
C:\Users\Saurabh Sawant\git\school-management-console-common\src\main\java\common\ScreenCommon.java
C:\Users\Saurabh Sawant\git\school-management-console-common\src\main\java\application\ApplicationMain.java
C:\Users\Saurabh Sawant\git\school-management-console-common\src\main\java\admission\GeneralInfoController.java
