{
  'Yuvraj Singh': { '2009': 2, '2011': 1, '2014': 1, '2017': 1 },
  'SPD Smith': { '2012': 1, '2013': 1, '2015': 1, '2017': 1 },
  'CA Lynn': { '2014': 1, '2017': 1 },
  'GJ Maxwell': { '2014': 4, '2017': 1 },
  'KM Jadhav': { '2010': 1, '2017': 1 },
  'Rashid Khan': { '2017': 2 },
  'N Rana': { '2017': 2 },
  'AR Patel': { '2014': 1, '2015': 1, '2016': 1, '2017': 1 },
  'SV Samson': { '2013': 1, '2016': 1, '2017': 1 },
  'JJ Bumrah': { '2017': 1 },
  'SP Narine': { '2012': 3, '2013': 1, '2017': 2 },
  'KA Pollard': { '2010': 2, '2011': 1, '2012': 1, '2013': 3, '2015': 1, '2017': 1 },
  'AJ Tye': { '2017': 2 },
  'RV Uthappa': { '2010': 1, '2014': 3, '2016': 1, '2017': 2 },
  'CJ Anderson': { '2014': 2, '2017': 1 },
  'BA Stokes': { '2017': 3 },
  'NM Coulter-Nile': { '2015': 1, '2017': 3 },
  'B Kumar': { '2014': 2, '2016': 2, '2017': 1 },
  'CH Gayle': { '2009': 1, '2011': 6, '2012': 5, '2013': 3, '2015': 2, '2017': 1 },
  'KS Williamson': { '2017': 1 },
  'JC Buttler': { '2017': 1 },
  'SK Raina': {
    '2008': 1,
    '2009': 1,
    '2010': 2,
    '2011': 1,
    '2012': 1,
    '2013': 2,
    '2014': 2,
    '2015': 2,
    '2016': 1,
    '2017': 1
  },
  'MJ McClenaghan': { '2015': 1, '2017': 1 },
  'MS Dhoni': {
    '2008': 2,
    '2009': 1,
    '2010': 2,
    '2011': 1,
    '2012': 1,
    '2013': 3,
    '2014': 1,
    '2016': 1,
    '2017': 1
  },
  'HM Amla': { '2016': 1, '2017': 1 },
  'G Gambhir': {
    '2009': 1,
    '2010': 2,
    '2011': 1,
    '2012': 3,
    '2013': 2,
    '2014': 2,
    '2016': 1,
    '2017': 1
  },
  'LH Ferguson': { '2017': 1 },
  'KH Pandya': { '2016': 2, '2017': 2 },
  'Sandeep Sharma': { '2014': 3, '2017': 2 },
  'DA Warner': {
    '2010': 1,
    '2011': 1,
    '2012': 1,
    '2013': 2,
    '2014': 2,
    '2015': 4,
    '2016': 3,
    '2017': 1
  },
  'RG Sharma': {
    '2009': 2,
    '2010': 1,
    '2012': 2,
    '2013': 2,
    '2014': 1,
    '2015': 1,
    '2016': 4,
    '2017': 1
  },
  'Mohammed Shami': { '2017': 1 },
  'RA Tripathi': { '2017': 1 },
  'RR Pant': { '2016': 1, '2017': 1 },
  'JD Unadkat': { '2010': 1, '2013': 1, '2017': 2 },
  'LMP Simmons': { '2014': 1, '2015': 1, '2017': 1 },
  'DR Smith': { '2009': 1, '2012': 2, '2013': 2, '2014': 3, '2016': 2, '2017': 1 },
  'S Dhawan': { '2011': 1, '2017': 1 },
  'MM Sharma': { '2014': 1, '2017': 1 },
  'SS Iyer': { '2015': 1, '2017': 1 },
  'WP Saha': { '2011': 1, '2014': 1, '2017': 1 },
  'KK Nair': { '2014': 1, '2016': 1, '2017': 1 },
  'Mohammed Siraj': { '2017': 1 },
  'AT Rayudu': { '2010': 1, '2011': 1, '2012': 2, '2014': 1, '2015': 1, '2017': 1 },
  'HV Patel': { '2017': 1 },
  'Washington Sundar': { '2017': 1 },
  'KV Sharma': { '2017': 1 },
  'BB McCullum': { '2008': 1, '2011': 2, '2015': 2 },
  'MEK Hussey': { '2008': 1, '2011': 3, '2012': 1, '2013': 5, '2014': 2 },
  'MF Maharoof': { '2008': 1 },
  'MV Boucher': { '2008': 1, '2009': 1 },
  'DJ Hussey': { '2008': 1, '2012': 1 },
  'SR Watson': { '2008': 4, '2011': 1, '2012': 2, '2013': 1, '2015': 1, '2016': 1 },
  'V Sehwag': {
    '2008': 2,
    '2009': 1,
    '2010': 1,
    '2011': 2,
    '2012': 3,
    '2013': 1,
    '2014': 1
  },
  'ML Hayden': { '2008': 1, '2009': 2, '2010': 1 },
  'YK Pathan': {
    '2008': 4,
    '2009': 3,
    '2010': 2,
    '2011': 2,
    '2012': 1,
    '2013': 1,
    '2014': 1,
    '2016': 2
  },
  'KC Sangakkara': { '2008': 1, '2009': 2, '2010': 1, '2012': 1 },
  'JDP Oram': { '2008': 1 },
  'AC Gilchrist': { '2008': 2, '2009': 2, '2011': 1, '2012': 1, '2013': 1 },
  'SM Katich': { '2008': 1 },
  'ST Jayasuriya': { '2008': 2 },
  'GD McGrath': { '2008': 1 },
  'SE Marsh': { '2008': 5, '2011': 1, '2012': 1, '2014': 1, '2015': 1 },
  'SA Asnodkar': { '2008': 1 },
  'R Vinay Kumar': { '2008': 1, '2010': 1, '2013': 1 },
  'IK Pathan': { '2008': 1, '2012': 1 },
  'SM Pollock': { '2008': 2 },
  'Sohail Tanvir': { '2008': 2 },
  'S Sreesanth': { '2008': 1 },
  'A Nehra': { '2008': 1, '2009': 1, '2015': 3, '2016': 1 },
  'SC Ganguly': { '2008': 2, '2010': 2, '2012': 1 },
  'CRD Fernando': { '2008': 1 },
  'L Balaji': { '2008': 1, '2011': 1, '2012': 1 },
  'Shoaib Akhtar': { '2008': 1 },
  'A Mishra': { '2008': 1, '2009': 1, '2011': 2, '2013': 4, '2016': 1 },
  'DPMD Jayawardene': { '2008': 1, '2009': 2, '2010': 1, '2011': 1 },
  'GC Smith': { '2008': 1, '2009': 1 },
  'DJ Bravo': { '2008': 1, '2015': 1 },
  'M Ntini': { '2008': 2 },
  'SP Goswami': { '2008': 1 },
  'A Kumble': { '2008': 1, '2009': 1, '2010': 1 },
  'KD Karthik': { '2008': 1, '2010': 1, '2011': 1, '2013': 1 },
  'JA Morkel': { '2008': 1, '2011': 1 },
  'P Kumar': { '2008': 1, '2016': 1 },
  'Umar Gul': { '2008': 1 },
  'SR Tendulkar': { '2009': 2, '2010': 4, '2011': 1, '2013': 1 },
  'R Dravid': { '2009': 1, '2013': 1 },
  'DL Vettori': { '2009': 1 },
  'RP Singh': { '2009': 1 },
  'M Muralitharan': { '2009': 2 },
  'AB de Villiers': {
    '2009': 2,
    '2011': 1,
    '2012': 3,
    '2013': 1,
    '2014': 2,
    '2015': 2,
    '2016': 4
  },
  'RS Bopara': { '2009': 1 },
  'PP Ojha': { '2009': 1 },
  'TM Dilshan': { '2009': 1 },
  'HH Gibbs': { '2009': 1 },
  'DP Nannes': { '2009': 1 },
  'JP Duminy': { '2009': 2, '2014': 1, '2015': 1 },
  'SB Jakati': { '2009': 1 },
  'JH Kallis': { '2009': 2, '2010': 3, '2011': 1, '2012': 1, '2013': 2, '2014': 1 },
  'A Singh': { '2009': 1 },
  'S Badrinath': { '2009': 1 },
  'LRPL Taylor': { '2009': 2, '2011': 1 },
  'Harbhajan Singh': { '2009': 1, '2010': 1, '2011': 1, '2013': 1, '2015': 2 },
  'R Bhatia': { '2009': 1 },
  'SK Warne': { '2009': 1, '2010': 1, '2011': 2 },
  'B Lee': { '2009': 1, '2012': 1 },
  'BJ Hodge': { '2009': 1, '2011': 2, '2012': 2, '2013': 1 },
  'LR Shukla': { '2009': 1 },
  'MK Pandey': { '2009': 2, '2013': 1, '2014': 1 },
  'AD Mathews': { '2010': 1 },
  'MK Tiwary': { '2010': 2, '2011': 1 },
  'WPUJC Vaas': { '2010': 1 },
  'A Symonds': { '2010': 3 },
  'AA Jhunjhunwala': { '2010': 1 },
  'J Theron': { '2010': 1 },
  'AC Voges': { '2010': 1 },
  'NV Ojha': { '2010': 1 },
  'SL Malinga': { '2010': 1, '2011': 2, '2012': 1, '2015': 1 },
  'M Vijay': { '2010': 2, '2011': 2, '2012': 1, '2014': 1 },
  'KP Pietersen': { '2010': 2, '2012': 1 },
  'PD Collingwood': { '2010': 1 },
  'MJ Lumb': { '2010': 1 },
  'TL Suman': { '2010': 1 },
  'RJ Harris': { '2010': 1 },
  'PP Chawla': { '2010': 1, '2011': 1, '2015': 1 },
  'Harmeet Singh': { '2010': 1, '2013': 1 },
  'R Ashwin': { '2010': 1 },
  'R McLaren': { '2010': 1 },
  'M Kartik': { '2010': 1 },
  'DE Bollinger': { '2010': 1, '2011': 1 },
  'S Anirudha': { '2011': 1 },
  'SK Trivedi': { '2011': 1, '2013': 1 },
  'SB Wagh': { '2011': 1 },
  'PC Valthaty': { '2011': 2 },
  'MD Mishra': { '2011': 1 },
  'DW Steyn': { '2011': 1, '2012': 3, '2014': 1 },
  'S Sohal': { '2011': 1 },
  'MM Patel': { '2011': 2 },
  'V Kohli': { '2011': 2, '2013': 3, '2015': 1, '2016': 5 },
  'I Sharma': { '2011': 1, '2013': 1 },
  'J Botha': { '2011': 1 },
  'Iqbal Abdulla': { '2011': 2 },
  'P Parameswaran': { '2011': 1 },
  'R Sharma': { '2011': 2 },
  'MR Marsh': { '2011': 1 },
  'BA Bhatt': { '2011': 1 },
  'S Aravind': { '2011': 1 },
  '': { '2011': 1, '2015': 2 },
  'JEC Franklin': { '2011': 1 },
  'RE Levi': { '2012': 1 },
  'AM Rahane': { '2012': 2, '2013': 3, '2014': 2, '2015': 3, '2016': 2 },
  'RA Jadeja': { '2012': 1, '2013': 2, '2014': 3, '2015': 1 },
  'MN Samuels': { '2012': 1 },
  'M Morkel': { '2012': 1, '2015': 1 },
  'F du Plessis': { '2012': 2 },
  'AD Mascarenhas': { '2012': 1 },
  'Shakib Al Hasan': { '2012': 2 },
  'JD Ryder': { '2012': 1 },
  'S Nadeem': { '2012': 1 },
  'KMDN Kulasekara': { '2012': 1 },
  'CL White': { '2012': 1 },
  'Mandeep Singh': { '2012': 2, '2015': 1 },
  'P Negi': { '2012': 1, '2015': 1 },
  'Azhar Mahmood': { '2012': 1, '2013': 1 },
  'BW Hilfenhaus': { '2012': 2 },
  'A Chandila': { '2012': 1 },
  'UT Yadav': { '2012': 2, '2014': 2, '2015': 2 },
  'MS Bisla': { '2012': 1 },
  'M Vohra': { '2013': 1, '2014': 1, '2016': 1 },
  'GH Vihari': { '2013': 2 },
  'AJ Finch': { '2013': 1, '2014': 1, '2016': 3 },
  'JP Faulkner': { '2013': 2, '2014': 2, '2015': 1 },
  'MS Gony': { '2013': 1 },
  'DA Miller': { '2013': 3 },
  'DJG Sammy': { '2013': 1 },
  'MG Johnson': { '2013': 2 },
  'KK Cooper': { '2013': 1 },
  'PA Patel': { '2013': 2, '2014': 1, '2016': 1 },
  'AP Tare': { '2013': 1 },
  'LJ Wright': { '2013': 1 },
  'YS Chahal': { '2014': 1 },
  'PV Tambe': { '2014': 2 },
  'DJ Hooda': { '2015': 1 },
  'GJ Bailey': { '2015': 1 },
  'AD Russell': { '2015': 3, '2016': 3 },
  'MA Agarwal': { '2015': 1 },
  'MA Starc': { '2015': 1 },
  'VR Aaron': { '2015': 1 },
  'TA Boult': { '2015': 1 },
  'EJG Morgan': { '2015': 1 },
  'HH Pandya': { '2015': 2 },
  'MC Henriques': { '2015': 1, '2016': 1 },
  'Z Khan': { '2015': 1 },
  'Q de Kock': { '2016': 1 },
  'Mustafizur Rahman': { '2016': 1 },
  'SA Yadav': { '2016': 1 },
  'AB Dinda': { '2016': 2 },
  'CH Morris': { '2016': 2 },
  'CR Brathwaite': { '2016': 1 },
  'MP Stoinis': { '2016': 2 },
  'A Zampa': { '2016': 1 },
  'BCJ Cutting': { '2016': 1 }
}
