[
    {
        "bowler": "Sandeep Sharma",
        "economy": 97.82200000000003
    },
    {
        "bowler": "B Kumar",
        "economy": 95.76900000000003
    },
    {
        "bowler": "A Nehra",
        "economy": 91.88200000000008
    },
    {
        "bowler": "MM Sharma",
        "economy": 86.68300000000009
    },
    {
        "bowler": "MJ McClenaghan",
        "economy": 85.39300000000004
    },
    {
        "bowler": "UT Yadav",
        "economy": 81.68500000000003
    },
    {
        "bowler": "MA Starc",
        "economy": 78.73400000000004
    },
    {
        "bowler": "SL Malinga",
        "economy": 71.79500000000003
    },
    {
        "bowler": "CH Morris",
        "economy": 64.68900000000004
    },
    {
        "bowler": "TA Boult",
        "economy": 63.436000000000014
    }
]