digraph G{
graph[overlap=true, fontsize = 0.5];
edge[color = black];
subgraph clusterPU{
node [shape=plaintext];
struct [label=<<TABLE ALIGN="CENTER" BORDER="2" CELLBORDER="1" CELLSPACING="0" FIXEDSIZE="TRUE"> 
<TR>
<TD>#Nodo</TD>
<TD>Primeros</TD>
<TD>Ultimos</TD>
</TR>
<TR>
<TD>1</TD><TD>1</TD><TD>1</TD></TR>
<TR>
<TD>2</TD><TD>2</TD><TD>2</TD></TR>
<TR>
<TD>|</TD><TD>1,2</TD><TD>1,2</TD></TR>
<TR>
<TD>*</TD><TD>1,2</TD><TD>1,2</TD></TR>
<TR>
<TD>3</TD><TD>3</TD><TD>3</TD></TR>
<TR>
<TD>+</TD><TD>3</TD><TD>3</TD></TR>
<TR>
<TD>.</TD><TD>1,2,3</TD><TD>3</TD></TR>
<TR>
<TD>4</TD><TD>4</TD><TD>4</TD></TR>
<TR>
<TD>.</TD><TD>1,2,3</TD><TD>4</TD></TR>
<TR>
<TD>5</TD><TD>5</TD><TD>5</TD></TR>
<TR>
<TD>+</TD><TD>5</TD><TD>5</TD></TR>
<TR>
<TD>.</TD><TD>1,2,3</TD><TD>5</TD></TR>
<TR>
<TD>6</TD><TD>6</TD><TD>6</TD></TR>
<TR>
<TD>.</TD><TD>1,2,3</TD><TD>6</TD></TR>
<TR>
<TD>7</TD><TD>7</TD><TD>7</TD></TR>
<TR>
<TD>8</TD><TD>8</TD><TD>8</TD></TR>
<TR>
<TD>|</TD><TD>7,8</TD><TD>7,8</TD></TR>
<TR>
<TD>.</TD><TD>1,2,3</TD><TD>7,8</TD></TR>
<TR>
<TD>9</TD><TD>9</TD><TD>9</TD></TR>
<TR>
<TD>.</TD><TD>1,2,3</TD><TD>9</TD></TR>
<TR>
<TD>10</TD><TD>10</TD><TD>10</TD></TR>
<TR>
<TD>.</TD><TD>1,2,3</TD><TD>10</TD></TR>
</TABLE>>];

}subgraph clusterArbol{
node[shape=ellipse, fontname=Helvetica, fixedsize=true, width=3, height=0.7];
nodo1466300045[label=".\nAnulable: false"];
nodo418573138[label=".\nAnulable: false"];
nodo1466300045->nodo418573138[label="Hijo0"];
nodo418573138[label=".\nAnulable: false"];
nodo1627319689[label=".\nAnulable: false"];
nodo418573138->nodo1627319689[label="Hijo0"];
nodo1627319689[label=".\nAnulable: false"];
nodo705143392[label=".\nAnulable: false"];
nodo1627319689->nodo705143392[label="Hijo0"];
nodo705143392[label=".\nAnulable: false"];
nodo1378809907[label=".\nAnulable: false"];
nodo705143392->nodo1378809907[label="Hijo0"];
nodo1378809907[label=".\nAnulable: false"];
nodo1569268063[label=".\nAnulable: false"];
nodo1378809907->nodo1569268063[label="Hijo0"];
nodo1569268063[label=".\nAnulable: false"];
nodo1242308034[label=".\nAnulable: false"];
nodo1569268063->nodo1242308034[label="Hijo0"];
nodo1242308034[label=".\nAnulable: false"];
nodo1569694273[label="*\nAnulable: true"];
nodo1242308034->nodo1569694273[label="Hijo0"];
nodo1569694273[label="*\nAnulable: true"];
nodo2017801891[label="|\nAnulable: false"];
nodo1569694273->nodo2017801891[label="Hijo0"];
nodo2017801891[label="|\nAnulable: false"];
nodo1825731373[label="abecedario\nAnulable: false\n#Nodo: 1"];
nodo2017801891->nodo1825731373[label="Hijo0"];
nodo1176142200[label="_\nAnulable: false\n#Nodo: 2"];
nodo2017801891->nodo1176142200[label="Hijo1"];
nodo1713876560[label="+\nAnulable: false"];
nodo1242308034->nodo1713876560[label="Hijo1"];
nodo1713876560[label="+\nAnulable: false"];
nodo923171865[label="conjnum\nAnulable: false\n#Nodo: 3"];
nodo1713876560->nodo923171865[label="Hijo0"];
nodo1211251407[label=">\nAnulable: false\n#Nodo: 4"];
nodo1569268063->nodo1211251407[label="Hijo1"];
nodo1513190384[label="+\nAnulable: false"];
nodo1378809907->nodo1513190384[label="Hijo1"];
nodo1513190384[label="+\nAnulable: false"];
nodo20911048[label="conjnum\nAnulable: false\n#Nodo: 5"];
nodo1513190384->nodo20911048[label="Hijo0"];
nodo90001730[label="es \nAnulable: false\n#Nodo: 6"];
nodo705143392->nodo90001730[label="Hijo1"];
nodo1558247268[label="|\nAnulable: false"];
nodo1627319689->nodo1558247268[label="Hijo1"];
nodo1558247268[label="|\nAnulable: false"];
nodo220176891[label="TRUE\nAnulable: false\n#Nodo: 7"];
nodo1558247268->nodo220176891[label="Hijo0"];
nodo1959219907[label="FALSE\nAnulable: false\n#Nodo: 8"];
nodo1558247268->nodo1959219907[label="Hijo1"];
nodo469748312[label=".\nAnulable: false\n#Nodo: 9"];
nodo418573138->nodo469748312[label="Hijo1"];
nodo1090475412[label="#\nAnulable: false\n#Nodo: 10"];
nodo1466300045->nodo1090475412[label="Hijo1"];
label="expresion3"

}}