digraph G{
graph[overlap=true, fontsize = 0.5];
edge[color = black];
subgraph clusterPU{
node [shape=plaintext];
struct [label=<<TABLE ALIGN="CENTER" BORDER="2" CELLBORDER="1" CELLSPACING="0" FIXEDSIZE="TRUE"> 
<TR>
<TD>#Nodo</TD>
<TD>Primeros</TD>
<TD>Ultimos</TD>
</TR>
<TR>
<TD>1</TD><TD>1</TD><TD>1</TD></TR>
<TR>
<TD>2</TD><TD>2</TD><TD>2</TD></TR>
<TR>
<TD>|</TD><TD>1,2</TD><TD>1,2</TD></TR>
<TR>
<TD>3</TD><TD>3</TD><TD>3</TD></TR>
<TR>
<TD>4</TD><TD>4</TD><TD>4</TD></TR>
<TR>
<TD>|</TD><TD>3,4</TD><TD>3,4</TD></TR>
<TR>
<TD>+</TD><TD>3,4</TD><TD>3,4</TD></TR>
<TR>
<TD>5</TD><TD>5</TD><TD>5</TD></TR>
<TR>
<TD>6</TD><TD>6</TD><TD>6</TD></TR>
<TR>
<TD>|</TD><TD>5,6</TD><TD>5,6</TD></TR>
<TR>
<TD>*</TD><TD>5,6</TD><TD>5,6</TD></TR>
<TR>
<TD>.</TD><TD>3,4</TD><TD>3,4,5,6</TD></TR>
<TR>
<TD>.</TD><TD>1,2</TD><TD>3,4,5,6</TD></TR>
<TR>
<TD>7</TD><TD>7</TD><TD>7</TD></TR>
<TR>
<TD>.</TD><TD>1,2</TD><TD>7</TD></TR>
</TABLE>>];

}subgraph clusterArbol{
node[shape=ellipse, fontname=Helvetica, fixedsize=true, width=3, height=0.7];
nodo1353538660[label=".\nAnulable: false"];
nodo1216481323[label=".\nAnulable: false"];
nodo1353538660->nodo1216481323[label="Hijo0"];
nodo1216481323[label=".\nAnulable: false"];
nodo1499341770[label="|\nAnulable: false"];
nodo1216481323->nodo1499341770[label="Hijo0"];
nodo1499341770[label="|\nAnulable: false"];
nodo489086887[label="Los \nAnulable: false\n#Nodo: 1"];
nodo1499341770->nodo489086887[label="Hijo0"];
nodo668134939[label="El \nAnulable: false\n#Nodo: 2"];
nodo1499341770->nodo668134939[label="Hijo1"];
nodo2135517594[label=".\nAnulable: false"];
nodo1216481323->nodo2135517594[label="Hijo1"];
nodo2135517594[label=".\nAnulable: false"];
nodo1461798346[label="+\nAnulable: false"];
nodo2135517594->nodo1461798346[label="Hijo0"];
nodo1461798346[label="+\nAnulable: false"];
nodo2094097262[label="|\nAnulable: false"];
nodo1461798346->nodo2094097262[label="Hijo0"];
nodo2094097262[label="|\nAnulable: false"];
nodo1279518937[label="vocales\nAnulable: false\n#Nodo: 3"];
nodo2094097262->nodo1279518937[label="Hijo0"];
nodo2029145458[label="otrasletras\nAnulable: false\n#Nodo: 4"];
nodo2094097262->nodo2029145458[label="Hijo1"];
nodo622876851[label="*\nAnulable: true"];
nodo2135517594->nodo622876851[label="Hijo1"];
nodo622876851[label="*\nAnulable: true"];
nodo1386059114[label="|\nAnulable: false"];
nodo622876851->nodo1386059114[label="Hijo0"];
nodo1386059114[label="|\nAnulable: false"];
nodo21736128[label="abecedario\nAnulable: false\n#Nodo: 5"];
nodo1386059114->nodo21736128[label="Hijo0"];
nodo1798893126[label="_\nAnulable: false\n#Nodo: 6"];
nodo1386059114->nodo1798893126[label="Hijo1"];
nodo1283118674[label="#\nAnulable: false\n#Nodo: 7"];
nodo1353538660->nodo1283118674[label="Hijo1"];
label="expresion1"

}}