*Vertices 54
*Matrix 
0.03 0 0 0 0 0 0 0 0 0 2420.5 0 0 2105.55 0 0 0 -952.254 0 0 407.193 -417.264 0 0 0 -2210.84 1506.32 0 0 0 0 1986.83 -78.6615 -1940.75 0 0 571.078 0 -2227.93 719.245 2252.65 0 0 2241.05 0 0 0 0 -602.817 0 1291.77 0 0 0 
0 0.01 0 0 0 0 0 2203.67 0 -605.716 0 0 0 0 0 -1472.9 0 0 1456.72 -161.977 0 0 0 0 0 0 0 0 0 0 0 0 -128.864 0 -543.001 0 1922.74 -2236.01 0 0 130.696 -145.192 0 1835.61 0 0 0 0 0 0 0 787.149 0 0 
0 0 0.07 0 -313.807 -1221.58 0 0 0 0 0 0 0 -2365.26 0 -52.4155 0 0 0 0 0 1807.84 0 0 735.267 -2079 0 -2124.93 0 0 0 0 2140.34 1665.17 0 2327.57 0 0 2138.2 0 0 0 0 0 778.451 0 0 2210.53 0 0 0 0 0 0 
0 0 0 0 0 0 0 0 0 0 0 0 0 0 0 0 1266.75 0 0 0 0 0 0 0 -2452.24 0 0 0 0 0 0 0 1838.97 0 0 0 0 0 0 2355.65 0 0 0 0 0 -341.884 0 2469.18 0 628.605 -1722.39 684.454 0 391.629 
0 0 1094.78 0 0.02 0 -690.71 -1165.12 0 414.823 0 0 927.686 0 0 0 0 0 -1610.23 0 0 0 99.5666 0 558.87 371.944 0 0 1825.69 0 -1827.83 1574.22 0 0 0 0 0 0 0 0 472.35 0 1928.69 0 0 1992.32 -2218.62 255.669 0 0 0 0 0 2054.58 
0 0 -421.995 0 0 0.04 0 0 0 2494.2 0 0 0 0 1306.88 1350.52 0 -1618.63 0 0 447.783 0 0 0 2122.49 0 0 -279.931 0 -1973.25 0 0 0 0 0 2168.72 0 0 -817.057 2387.54 -310.297 2362.21 0 0 0 279.015 0 0 0 0 0 0 -709.784 0 
0 0 0 0 247.276 0 0.04 0 763.649 0 0 1484.04 110.858 0 0 777.841 -640.965 0 -1022.9 0 0 400.937 0 0 0 0 0 -1791.67 997.116 -1342.89 0 0 0 0 0 0 0 0 0 0 1440.09 -274.743 0 591.678 0 0 2056.41 0 0 2065.87 2115.92 -1714.45 551.851 0 
0 -1721.02 0 0 -958.052 0 0 0.08 0 0 0 122.303 0 0 0 0 2025.74 0 0 0 0 1047.17 0 0 0 0 0 0 0 2170.86 -2005.91 0 0 0 0 0 -1014.66 0 0 0 0 0 -1149.25 0 -1296.2 0 0 1002.46 2357.78 0 0 0 0 0 
0 0 0 0 0 0 962.63 0 0.05 0 -1075.09 0 0 0 0 0 1928.24 0 757.241 372.25 0 0 0 0 0 0 0 0 2098.38 0 605.106 0 368.74 0 0 2316.43 -1726.66 0 1526.76 868.48 0 0 1807.54 0 0 2176.35 0 0 0 0 0 0 0 -2178.95 
0 -1015.43 0 0 706.732 -2091.81 0 0 0 0.02 0 0 0 0 0 0 -218.894 0 0 537.049 0 0 -582.217 0 0 1941.97 0 0 0 0 0 2390.29 0 2243.19 0 1451.08 -1919.08 2372.74 0 0 0 0 0 397.122 0 0 0 0 609.226 -550.783 0 0 2388.3 0 
2102.8 0 0 0 0 0 0 0 1983.63 0 0 1118.27 0 0 0 0 0 0 -308.771 0 0 2489.32 1513.34 0 0 0 0 0 0 2183.22 0 0 -1893.9 0 0 0 0 804.849 0 0 0 0 -2018.42 1396.76 -603.732 0 0 0 -154.653 0 0 1638.46 0 0 
0 0 0 0 0 0 2138.05 2262.41 0 0 -389.035 0 0 0 0 0 0 0 1547.98 -2277.52 0 -2130.57 0 -2051.99 0 0 -1022.75 2002.24 1875.44 0 1175.95 405.515 0 0 0 0 0 0 0 0 0 0 0 0 0 0 -380.795 -125.202 0 0 0 580.081 1889.02 -2226.86 
0 0 0 0 1672.49 0 -1410.18 0 0 0 0 0 0.09 -1636.94 0 0 0 15.9459 0 1840.34 0 0 0 0 0 0 0 1780.68 -1821.73 -330.592 -755.257 768.99 0 1248.28 2052.45 0 940.809 0 0 0 0 0 0 0 -1413.24 0 2188.71 0 0 -2294.31 -1033.13 0 0 0 
2142.78 0 -1779.15 0 0 0 0 0 0 0 0 0 30.2896 0.08 0 0 1748.48 466.247 0 726.569 0 219.962 0 0 0 0 0 0 1573.46 0 2154.53 0 -794.168 228.355 0 1463.44 -2218.16 0 1163.9 -1849.35 0 -1245.69 1224.02 1749.4 0 0 0 0 0 0 0 0 0 0 
0 0 0 0 0 1154.13 0 0 0 0 0 0 0 0 0.06 0 0 0 -403.684 0 0 -1074.18 0 0 2250.05 0 0 0 0 0 0 0 0 0 0 0 0 624.79 0 0 0 2040.7 0 0 0 0 0 0 0 0 0 0 0 0 
0 438.322 741.981 0 0 947.523 1884.44 0 0 0 0 0 0 0 0 0.02 0 0 2438.96 0 0 0 0 0 -2493.9 0 0 0 0 0 0 0 0 0 0 2115.16 0 0 0 0 0 0 0 0 0 0 -1889.63 0 1834.24 0 449.156 0 0 0 
0 0 0 305.109 0 0 833.232 -1724.37 1412.78 -793.405 0 0 0 445.952 0 0 0.08 0 0 0 307.855 0 -723.823 -1020.62 0 0 397.275 0 -1582.31 0 0 0 0 0 0 0 0 659.886 0 1322.75 0 1254.84 0 0 0 0 0 -391.018 0 -1312.98 2343.13 0 0 0 
-1467.1 0 0 0 0 2381.74 0 0 0 0 0 0 -1621.83 1376.46 0 0 0 0.08 -1815.47 0 656.682 -575.503 0 0 0 2407.68 357.448 0 0 0 0 0 0 -1946.85 0 0 0 -82.4763 2348.02 -530.946 0 0 0 530.793 0 -137.104 0 0 0 -1088.52 0 0 0 0 
0 -2010.79 0 0 398.648 0 371.944 0 170.827 0 2429.96 -600.07 0 0 -145.955 -1402.1 0 716.956 0.08 -1846.14 0 0 0 0 -110.858 0 0 0 0 478.149 0 0 -196.768 -352.718 0 0 0 0 2489.62 1993.39 0 -491.729 -1195.49 1463.9 0 0 0 1856.52 0 -407.346 0 2330.01 0 0 
0 964.461 0 0 0 0 0 0 -1882.46 720.313 0 1357.39 2499.24 -309.076 0 0 0 0 -2430.11 0.04 -10.7578 0 2132.1 0 0 0 0 0 0 2125.39 -2147.97 0 0 274.895 -2015.52 2285.91 0 -2351.37 0 0 0 -2465.51 2482.76 0 1560.34 0 -1027.63 1687.14 0 2047.72 0 237.663 0 0 
-2194.2 0 0 0 0 2043.14 0 0 0 0 0 0 0 0 0 0 1620.61 -1622.44 0 -1998.58 0.04 0 0 0 0 0 0 0 0 0 0 0 -1165.27 0 0 0 0 0 0 126.118 0 2074.57 859.783 1687.6 1378.44 0 0 0 2320.86 -374.996 0 -1956.31 0 0 
-41.7341 0 -1481.6 0 0 0 1132.31 164.724 0 0 769.295 2378.54 0 1429.26 1406.52 0 0 -1471.22 0 0 0 0.07 0 -1886.12 87.9696 -1535 0 0 0 -514.161 1179.16 0 35.4778 0 1484.65 0 1481.14 0 -1396.3 0 0 0 19.6081 0 -691.015 0 0 1599.86 -1139.94 756.02 0 0 0 0 
0 0 0 0 1664.71 0 0 0 0 915.479 -356.533 0 0 0 0 0 -2082.81 0 0 1216.09 0 0 0.05 0 0 0 0 -1351.89 0 0 1318.32 0 0 0 0 0 0 0 0 698.645 0 0 76.8303 0 0 0 0 0 0 0 0 2070.6 0 0 
0 0 0 0 0 0 0 0 0 0 0 2388.91 0 0 0 0 1177.33 0 0 0 0 -949.965 0 0 0 5.87481 0 0 0 0 0 1945.48 0 1067.16 0 -236.29 0 0 1048.54 0 0 0 0 -1370.05 0 0 0 0 0 0 916.089 0 0 0 
0 0 -1263.24 1914.2 -1703.31 -2019.18 0 0 0 0 0 0 0 0 1805.4 2437.74 0 0 -2132.86 0 0 1054.49 0 0 0.06 2451.63 0 2400.51 0 0 0 0 -19.1504 0 0 -254.753 0 -573.824 0 0 0 0 0 0 0 0 0 0 0 2152.85 0 0 0 1785.26 
1711.86 0 -2211.45 0 2196.8 0 0 0 0 225.303 0 0 0 0 0 0 0 2286.98 0 0 0 -2222.28 0 1108.2 2386.32 0.05 0 0 658.971 0 0 0 1501.89 0 0 0 0 0 0 2231.74 0 0 1551.48 0 0 0 0 0 -1836.83 0 0 0 0 0 
925.092 0 0 0 0 0 0 0 0 0 0 772.805 0 0 0 0 445.799 -978.805 0 0 0 0 0 0 0 0 0.02 0 29.5267 0 0 0 2413.63 0 -884.35 0 0 0 0 0 0 0 0 0 1198.08 1511.66 0 -754.646 0 554.292 0 0 0 0 
0 0 -1164.05 0 0 -1325.19 -2122.79 0 0 0 0 -963.851 769.906 0 0 0 0 0 0 0 0 0 1788.61 0 2269.43 0 0 0.09 0 0 0 0 0 1371.88 0 0 0 264.672 0 0 0 0 0 0 0 2011.09 0 0 0 34.7148 0 0 0 0 
0 0 0 0 68.8955 0 1624.12 0 2108.29 0 0 2168.87 365.383 -732.673 0 0 543.916 0 0 0 0 0 0 0 0 255.974 1137.65 0 0.04 0 0 1546.45 0 0 0 -209.586 0 0 -138.783 0 0 0 0 -1301.54 -436.644 -1648.08 -858.715 0 0 1720.71 2035.36 0 0 0 
0 0 0 0 0 2107.38 -1373.71 -927.076 0 0 1565.68 0 -2356.87 0 0 0 0 0 1686.07 584.658 0 -321.741 0 0 0 0 0 0 0 0.01 -1062.43 1662.11 0 0 0 0 0 0 0 0 1826.91 0 -371.181 0 0 1516.39 0 -651.494 247.734 0 0 2355.19 0 -2235.86 
0 0 0 0 476.775 0 0 1583.53 1400.57 0 0 1302.45 715.888 -1616.18 0 0 0 0 0 -629.826 0 874.584 1185.57 0 0 0 0 0 0 1796.4 0.08 0 -1393.86 0 0 -2064.2 0 0 0 0 1993.39 0 -898.999 0 0 0 0 0 -847.575 1089.13 0 0 -934.858 0 
-22.2022 0 0 0 -1931.14 0 0 0 0 571.23 0 393.307 1723.3 0 0 0 0 0 0 0 0 0 0 2230.22 0 0 0 0 -529.725 -1021.99 0 0.01 0 1600.92 0 1383.18 0 580.081 0 0 1325.65 1963.94 1385.01 0 -57.7563 1546.3 0 -352.107 0 0 -1821.73 0 0 0 
1096.61 -398.801 -142.75 2362.21 0 0 0 0 1616.49 0 2261.04 0 0 -203.33 0 0 0 0 -214.469 0 -1903.97 -245.598 0 0 2126.3 -1406.22 -1665.17 0 0 0 589.541 0 0.04 0 0 0 734.199 1451.69 -1150.32 0 1546.14 -2112.42 0 0 1905.65 0 0 -1005.05 0 0 0 2414.85 0 0 
128.864 0 2373.04 0 0 0 0 0 0 1542.48 0 0 -1055.1 -1208.61 0 0 0 745.338 1596.04 2444.91 0 0 0 -736.946 0 0 0 386.898 0 0 0 1536.99 0 0.04 0 -38.9874 0 0 1453.06 -1000.17 0 1849.8 0 0 0 0 0 0 0 0 -1792.89 0 0 -2444 
0 1889.63 0 0 0 0 0 0 0 0 0 0 1905.65 0 0 0 0 0 0 -844.829 0 1896.65 0 0 0 0 -1912.98 0 0 0 0 0 0 0 0.09 1549.65 0 0 0 1497.16 1854.53 0 0 85.2229 0 0 0 -1096.76 0 0 0 -2298.88 0 0 
0 0 -982.925 0 0 1976 0 0 -1110.64 -1404.69 0 0 0 2460.78 0 602.512 0 0 0 1987.59 0 0 0 1628.85 1687.75 0 0 0 1004.44 0 75.9148 -740.76 0 1809.98 -105.518 0.07 0 1573.76 -378.201 0 0 297.632 0 0 0 0 0 0 1814.71 0 0 0 0 -1086.38 
-643.254 -174.49 0 0 0 0 0 646.763 -504.242 1513.64 0 0 254.295 1143.91 0 0 0 0 0 0 0 -1679.2 0 0 0 0 0 0 0 0 0 0 2021.77 0 0 0 0.08 0 0 -512.787 0 0 0 0 0 2366.18 0 0 0 0 0 2326.65 0 0 
0 2279.96 0 0 0 0 0 0 0 963.851 698.798 0 0 0 631.504 0 2032.46 -970.412 0 -233.695 0 0 0 0 -1808.3 0 0 563.295 0 0 0 -1323.82 178.152 0 0 146.413 0 0.01 0 -1853.47 0 0 0 0 2371.97 1577.88 0 0 -591.678 0 0 0 0 0 
22.3548 0 1291.47 0 0 -305.261 0 0 -2008.65 0 0 0 0 -99.2615 0 0 0 362.636 1121.94 0 0 -1692.18 0 1669.59 0 0 0 0 -2376.55 0 0 0 2040.54 -849.406 0 282.678 0 0 0.03 0 0 2226.25 0 0 1683.63 0 0 0 0 0 0 0 0 0 
691.626 0 0 300.836 0 166.402 0 0 147.786 0 0 0 0 -103.992 0 0 2293.69 1829.36 -2244.1 0 1629.46 0 1323.97 0 0 371.334 0 0 0 0 0 0 0 -614.414 -2181.54 0 1757.79 1639.68 0 0.07 0 0 0 0 0 0 0 0 0 0 0 1652.35 -2383.72 0 
-1996.75 1323.05 0 0 -1604.89 2290.19 -723.212 0 0 0 0 0 0 0 0 0 0 0 0 0 0 0 0 0 0 0 0 0 0 199.515 -849.406 786.233 1832.71 0 775.246 0 0 0 0 0 0 0 0 0 0 0 0 0 -1511.35 0 0 2398.98 0 0 
0 1823.25 0 0 0 1661.5 2110.13 0 0 0 0 0 0 449.004 -1667.3 0 -1581.85 0 1108.97 1515.93 -1999.65 0 0 0 0 0 0 0 0 0 0 2022.69 278.558 -2293.85 0 -214.011 0 0 1336.02 0 0 0.06 1202.51 556.886 0 0 0 0 0 0 0 0 -852.306 0 
0 0 0 0 -1936.17 0 0 -1266.44 1587.5 0 -1556.98 0 0 1469.08 0 0 0 0 1609.62 1703.01 -1187.25 2294.31 1571.47 0 0 1592.07 0 0 0 857.799 -1707.28 -37.4615 0 0 0 0 0 0 0 0 0 1941.51 0.03 -1890.55 0 0 -1989.58 0 2474.06 -988.571 532.929 0 0 0 
46.3118 1918.32 0 0 0 0 2471.01 0 0 -485.015 2012.77 0 0 1152.46 0 0 0 -820.719 581.607 0 -1863.54 0 0 -174.184 0 0 0 0 164.266 0 0 0 0 0 2363.73 0 0 0 0 0 0 1582.92 -2276.15 0.04 0 710.395 0 0 0 0 0 0 0 0 
0 0 1791.06 0 0 0 0 2081.9 0 0 -1904.28 0 424.894 0 0 0 0 0 0 854.595 -1398.43 -1106.22 0 0 0 0 560.854 0 -265.587 0 0 -1088.06 1596.35 0 0 0 0 2464.29 -1802.04 0 0 0 0 0 0.07 0 0 -1864.91 0 0 0 0 0 0 
0 0 0 1838.21 -304.498 81.2555 0 0 -1054.64 0 0 0 0 0 0 0 0 1832.71 0 0 0 0 0 0 0 0 -1580.94 537.355 -343.715 2148.27 0 2434.84 0 0 0 0 -2175.59 -1711.4 0 0 0 0 0 468.078 0 0.08 0 899.609 0 1068.83 0 0 0 0 
0 0 0 0 1920.91 0 -117.878 0 0 0 0 634.404 -158.01 0 0 -2431.94 0 0 0 -609.836 0 0 0 0 0 0 0 0 -248.497 0 0 0 0 0 0 0 0 0 0 0 0 0 -1954.18 0 0 0 0.07 0 896.71 1489.68 0 0 2423.7 0 
0 0 -1421.63 -742.439 2344.36 0 0 572.604 0 0 0 -681.555 0 0 0 0 617.618 0 -1049.61 -621.433 0 2401.88 0 0 0 0 -931.654 0 0 1198.08 0 624.638 -398.038 0 -1894.67 0 0 0 0 0 0 0 0 0 -1152.76 1648.53 0 0.09 0 0 0 0 0 0 
1654.33 0 0 0 0 0 0 186.544 0 483.642 2357.02 0 0 0 0 122.608 0 0 0 0 2029.86 637.303 0 0 0 1016.19 0 0 0 225.303 -680.181 0 0 0 0 -1694.01 0 2085.86 0 0 1145.74 0 2102.5 0 0 0 649.968 0 0.09 0 497.833 0 0 0 
0 0 0 295.343 0 0 1595.28 0 0 1993.7 0 0 2006.67 0 0 0 141.072 2011.7 -2033.37 -2409.36 1774.27 494.171 0 0 382.321 0 -2260.89 2154.68 695.746 0 692.083 0 0 0 0 0 0 0 0 0 0 0 -391.018 0 0 -1938 -296.869 0 0 0.03 0 0 -301.599 0 
1677.07 0 0 -154.653 0 0 -1383.94 0 0 0 0 0 1767.1 0 0 1836.68 2229.91 0 0 0 0 0 0 -1195.79 0 0 0 0 1948.23 0 0 -960.189 0 505.768 0 0 0 0 0 0 0 0 2299.19 0 0 0 0 0 -8.01111 0 0.09 0 0 362.636 
0 1506.78 0 1929.91 0 0 2389.22 0 0 0 2203.82 312.433 0 0 0 0 0 0 906.781 574.129 -2472.23 0 1758.4 0 0 0 0 0 0 135.121 0 0 -746.559 0 2029.25 0 -2285.76 0 0 933.79 1813.94 0 0 0 0 0 0 0 0 0 0 0 0 0 
0 0 0 0 0 1264.31 1365.32 0 0 885.876 0 -1911.15 0 0 0 0 0 0 0 0 0 0 0 0 0 0 0 0 0 0 2017.5 0 0 0 0 0 0 0 0 -746.864 0 -261.01 0 0 0 0 1431.09 0 0 939.131 0 0 0.06 1157.8 
0 0 0 980.331 920.667 0 0 0 -43.26 0 0 2429.04 0 0 0 0 0 0 0 0 0 0 0 0 -400.479 0 0 0 0 1566.59 0 0 0 -1624.12 0 2191.61 0 0 0 0 0 0 0 0 0 0 0 0 0 0 2169.79 0 -586.947 0.08 
