*Vertices 58
*Matrix 
0 0 -1125.75 0 -2366.02 876.263 1105.46 0 0 0 0 0 0 0 0 1261.86 -2442.17 0 0 0 1217.31 0 0 0 0 0 0 0 0 2142.17 0 0 0 0 0 0 0 0 0 806.07 0 0 0 0 0 0 0 1892.07 0 0 0 0 -1539.43 -1597.26 0 0 529.572 0 
0 0.09 0 0 0 0 2126.3 0 0 0 2275.38 0 0 0 0 1384.24 754.494 0 0 973.006 0 0 -1659.37 0 0 0 0 0 0 2211.29 0 1714.76 0 0 416.501 -2067.09 0 0 975.143 0 0 0 0 0 0 2165.21 1307.79 0 0 0 0 0 -1538.82 0 0 0 -810.648 0 
-144.429 0 0.04 -1256.98 0 0 0 0 0 -832.469 0 0 0 0 1847.82 0 2154.07 0 138.173 263.451 0 0 0 0 0 784.555 0 0 1905.04 0 -1685.46 0 0 -1954.33 0 1906.26 0 -321.894 0 0 0 0 1806.16 -80.0348 0 1917.86 0 0 0 0 434.507 0 -1595.58 0 0 -1132.01 0 0 
0 0 -2182.3 0 0 1329.77 0 2208.55 0 0 1858.04 0 0 0 0 700.171 0 0 0 0 -832.163 0 0 0 0 0 -1230.28 0 0 0 0 0 0 0 -995.59 2238.76 0 0 0 0 0 0 0 0 0 0 0 0 0 0 -1576.05 0 0 -965.987 0 0 1583.68 0 
1373.41 0 0 0 0.01 154.042 -250.786 -761.361 0 1400.42 281.762 0 0 0 0 0 0 0 0 0 -1314.97 0 0 0 0 -1025.5 0 1584.9 0 -662.938 733.894 0 2360.99 2228.08 0 0 -1156.42 1887.34 0 0 0 0 0 0 0 0 0 1300.47 0 -2401.12 -66.9118 0 0 1037.25 0 0 0 0 
-1309.02 0 0 1798.23 1012.68 0.05 0 0 0 0 0 0 0 0 0 0 847.118 0 1018.33 0 0 -1477.32 0 0 0 0 0 0 0 2015.98 0 2018.57 -268.792 0 0 770.363 0 1901.07 0 0 0 1937.85 0 0 0 0 0 0 0 0 -952.406 0 0 0 735.725 1772.44 0 0 
270.013 2403.56 0 0 -188.681 0 0.02 0 0 -950.423 258.873 0 0 0 0 0 0 0 0 0 0 0 0 0 -870.006 0 0 0 1428.19 0 -1410.34 0 0 -132.221 0 0 0 0 2346.34 -1810.89 0 0 2319.03 -1188.92 0 0 1221.88 0 0 0 0 0 0 0 -1103.32 -1054.19 0 0 
0 0 0 1044.11 -2004.53 0 0 0.03 1116.29 0 0 0 0 0 1670.35 0 -2156.67 208.365 0 0 98.8037 0 0 1118.73 0 892.285 0 0 0 2036.73 0 0 0 0 0 814.158 1042.28 573.977 0 -136.799 0 1793.65 0 -1575.29 324.793 0 0 0 697.119 0 2370.75 1380.73 0 1691.11 0 -152.058 2378.23 0 
0 0 0 0 0 0 0 1963.48 0.01 -2213.89 0 0 -1060.9 1716.9 0 1221.27 511.414 0 0 0 0 0 0 -1687.6 0 0 0 0 -127.949 152.516 2149.04 0 0 2461.39 0 0 0 0 0 -936.842 0 -983.535 203.94 0 0 679.418 0 0 1568.27 406.583 0 0 0 -1073.87 0 0 -1302 1451.84 
0 0 2479.55 0 200.888 0 215.079 0 406.278 0.05 221.641 0 0 0 2142.93 0 1847.67 0 0 0 341.731 0 -1417.36 0 0 0 0 0 0 0 0 0 1994.77 0 0 0 0 0 0 0 0 0 -37.0037 0 0 1725.59 0 0 0 0 561.922 0 -2341.76 0 0 -1215.93 0 0 
0 1342.28 0 260.857 1572.39 0 1108.36 0 0 -1369.59 0.09 0 -1316.49 0 0 0 1287.04 0 0 -149.007 2181.08 0 1417.81 0 0 0 0 766.701 0 -40.2081 0 0 0 745.643 -2114.09 0 0 0 0 0 0 -1810.28 0 0 -1264.61 0 0 0 0 -1696.91 725.654 882.214 -526.215 0 0 0 0 0 
0 0 0 0 0 0 0 0 0 0 0 0.09 0 0 0 0 1515.17 0 0 1029.62 0 0 0 0 0 1267.36 0 0 -693.457 1565.22 0 0 0 0 0 0 0 238.273 -46.617 0 0 1383.33 0 0 949.812 0 0 879.772 0 -98.1933 0 -1187.09 0 0 0 0 0 0 
0 0 0 0 0 0 0 0 1510.28 0 2064.81 0 0.02 0 353.786 -1079.21 0 2407.53 0 0 0 0 0 -86.7489 0 0 0 1905.8 -1076.16 0 0 2245.17 2436.22 0 0 0 -2191.76 -2177.57 0 0 1142.23 1393.25 -1531.5 0 0 0 0 -111.469 0 0 -135.121 0 0 47.6852 0 0 0 0 
0 0 0 0 0 0 0 0 1574.83 0 0 0 0 0.05 0 0 0 0 0 0 0 0 0 969.802 0 0 0 0 0 0 787.301 0 -927.686 299.921 0 0 1110.34 0 0 -544.679 0 0 0 0 0 -561.464 0 0 1101.79 0 0 0 0 1985.92 821.94 0 0 1872.23 
0 0 -2045.43 0 0 0 0 2387.23 0 952.864 0 0 581.454 0 0.01 0 0 0 0 0 0 0 0 0 712.836 631.809 -1561.71 0 0 433.134 0 0 1198.08 486.847 0 836.589 0 0 0 0 0 0 0 0 0 0 -964.309 0 0 0 0 0 1847.97 0 0 0 0 311.518 
299.615 -380.337 0 1286.43 0 0 0 0 2211.29 0 0 0 977.126 0 0 0.01 0 0 0 -1276.06 0 0 0 0 1158.1 -1680.88 0 0 0 0 0 0 0 0 0 0 0 122.456 0 0 -2236.78 0 0 -277.49 0 0 0 0 0 0 0 2122.79 0 0 -1556.22 0 0 0 
620.67 -2364.65 2229.3 0 0 -624.943 0 422.3 -1972.64 1835.31 373.47 1450.01 0 0 0 0 0.01 0 -2344.51 0 0 0 0 0 0 0 0 0 0 2124.77 2002.24 -17.777 0 0 0 0 0 2481.84 0 -1274.68 0 0 0 0 0 0 0 -1318.48 1708.96 0 0 0 0 0 0 0 0 0 
0 0 0 0 0 0 0 2191.31 0 0 0 0 -2398.07 0 0 0 0 0.04 0 0 0 0 0 0 0 0 0 0 0 0 0 0 0 0 867.718 -1162.37 934.248 0 2334.89 1074.02 0 0 0 0 0 0 0 0 -872.753 0 0 677.74 0 0 0 0 0 0 
0 0 -309.992 0 0 -501.495 0 0 0 0 0 0 0 0 0 0 -761.513 0 0.06 2080.22 0 0 0 0 0 0 0 0 0 0 0 0 0 0 -947.066 0 0 0 2370.3 0 0 1382.87 0 0 0 -857.799 -1062.73 1347.01 -324.946 0 0 0 0 0 0 0 0 0 
0 -914.106 -1011 0 0 0 0 0 0 0 48.1429 393.918 0 0 0 2491.91 0 0 1672.03 0.05 0 0 0 0 0 0 0 572.146 0 0 0 690.405 1292.69 0 -1934.8 0 -786.843 0 0 0 0 0 -2483.98 1238.52 0 -1560.95 0 0 0 0 0 167.165 636.082 1883.98 0 0 0 -945.997 
2287.74 0 0 -2405.39 1106.22 0 0 1024.12 0 1292.69 1566.44 0 0 0 0 0 0 0 0 0 0.06 -411.466 0 1350.98 0 705.512 0 0 0 0 0 0 0 0 0 0 1516.39 0 2301.48 0 0 -629.215 0 0 0 0 0 0 -666.448 0 0 0 2402.65 1398.89 0 0 0 0 
0 0 0 0 0 2215.26 0 0 0 0 0 0 0 0 0 0 0 0 0 0 1845.07 0.01 0 -581.607 0 0 0 0 0 0 0 1643.19 0 245.598 0 0 0 -573.214 0 1137.04 734.504 -992.08 0 0 0 0 0 0 0 0 0 -631.809 -414.365 0 -238.578 0 0 0 
0 -1430.17 0 0 0 0 0 0 0 1016.5 2447.97 0 0 0 0 0 0 0 0 0 0 0 0.01 0 0 0 0 2325.74 0 0 648.595 0 0 0 0 0 2232.66 1534.55 0 0 -1378.14 0 0 0 609.226 0 0 1767.25 0 0 0 0 0 0 0 163.808 0 0 
0 0 0 0 0 0 0 2208.09 -302.667 0 0 0 1683.48 -1048.23 0 0 0 0 0 0 518.281 1862.93 0 0 0 0 36.5459 0 0 0 0 0 -309.687 0 0 0 0 0 0 0 0 0 0 0 0 0 0 -263.604 0 2160.33 0 702.307 0 0 0 0 0 0 
0 0 0 0 0 0 1906.26 0 0 0 0 0 0 0 -1221.27 1478.55 0 0 0 0 0 0 0 0 0.01 0 0 -2387.69 0 0 0 0 0 0 2484.89 0 0 0 0 0 0 0 0 0 882.977 0 0 0 0 0 -754.189 0 -535.829 0 0 0 0 0 
0 0 1983.63 0 1762.52 0 0 258.263 0 0 0 -1881.69 0 0 1035.72 676.214 0 0 0 0 -2315.97 0 0 0 0 0.07 0 -2131.34 0 764.107 0 0 0 0 -1337.7 1755.5 0 0 0 0 0 1767.25 0 0 0 0 0 0 0 0 36.6985 714.667 0 0 2331.23 2049.7 2355.49 0 
0 0 0 1266.44 0 0 0 0 0 0 0 0 0 0 -1140.1 0 0 0 0 0 0 0 0 -641.423 0 0 0.05 0 0 0 887.555 0 0 0 0 -512.635 1530.12 0 0 0 0 1386.38 0 0 1527.83 0 0 0 -22.9652 2099.44 -147.633 0 0 0 0 0 2188.25 0 
0 0 0 0 139.851 0 0 0 0 0 717.261 0 1698.74 0 0 0 0 0 0 -1823.25 0 0 591.067 0 1949.6 -334.559 0 0.04 0 179.373 0 0 0 1059.53 0 0 676.977 0 2106.01 0 0 0 0 0 0 689.642 0 0 0 0 -1248.74 0 0 0 0 0 0 -663.549 
0 0 67.98 0 0 0 1283.99 0 1396.45 0 0 254.295 2091.81 0 0 0 0 0 0 0 0 0 0 0 0 0 0 0 0.05 0 2171.77 0 0 0 0 0 -1249.2 0 0 0 1525.7 0 0 0 0 99.1089 0 0 961.104 0 0 0 0 0 0 -2262.41 1786.32 0 
2303.92 1981.64 0 0 2031.54 -732.215 0 -870.159 797.22 0 1499.15 -253.533 0 0 1803.57 0 728.706 0 0 0 0 0 0 0 0 -927.381 0 -64.1652 0 0.07 2353.21 0 0 0 980.636 0 0 2281.79 -2417.45 -1314.81 0 0 0 0 0 0 -1134.6 118.946 0 0 0 0 0 0 0 0 -104.602 0 
0 0 360.805 0 -699.713 0 1398.89 0 1510.9 0 0 0 0 1946.55 0 0 2230.83 0 0 0 0 0 2128.59 0 0 0 304.193 0 364.925 2459.56 0.05 -561.159 0 0 0 0 0 0 0 0 -441.069 -844.523 0 0 0 -632.267 0 2404.78 235.527 0 -274.133 0 0 0 0 0 -55.7726 0 
0 -1370.51 0 0 0 904.187 0 0 0 0 0 0 1495.33 0 0 0 -658.208 0 0 -1280.94 0 2054.28 0 0 0 0 0 0 0 0 1340.14 0.04 -1556.67 269.402 0 0 0 1056.02 0 0 527.284 0 0 2464.9 991.47 0 0 -284.814 0 0 0 -2301.93 0 -1970.5 0 368.282 0 0 
0 0 0 0 -231.254 1364.1 0 0 0 -2368.16 0 0 671.178 926.16 -324.793 0 0 0 0 -2012.92 0 0 0 374.081 0 0 0 0 0 0 0 115.741 0.04 0 0 1838.66 0 0 0 0 0 -249.26 0 0 1926.56 -645.39 -394.528 0 660.649 -1792.43 988.418 0 0 0 0 0 -261.467 0 
0 0 1887.19 0 876.873 0 160.909 0 -1249.81 0 559.938 0 0 -1651.74 -68.5903 0 0 0 0 0 0 -2012.92 0 0 0 0 0 -698.035 0 0 0 -10.9104 0 0.06 0 0 2192.53 2024.98 -678.808 0 -2425.23 0 1457.79 -1092.18 0 -1660.74 0 0 1763.74 0 0 0 -852.153 0 2241.2 0 0 0 
0 1978.74 0 1486.48 0 0 0 0 0 0 -1779.15 0 0 0 0 0 0 -2001.94 5.26444 -1008.26 0 0 0 0 1441.47 1236.08 0 0 0 -575.655 0 0 0 0 0.07 -1513.95 1788.46 0 0 2312.62 0 -2179.71 0 -311.67 2223.65 0 0 0 0 0 235.679 2135.3 0 0 0 0 0 0 
0 1119.65 -693.609 -1425.75 0 -1350.06 0 -2261.35 0 0 0 0 0 0 -248.039 0 0 -1360.44 0 0 0 0 0 0 0 1153.37 472.045 0 0 0 0 0 -313.654 0 -253.075 0.06 2197.87 0 -257.042 1452.3 0 0 -54.857 1420.71 302.82 -856.12 136.647 0 0 0 0 1554.54 349.055 0 1197.01 0 222.098 0 
0 0 0 0 2368.92 0 0 1750.92 0 0 0 0 -62.0289 40.9711 0 0 0 1089.74 0 344.935 -2016.59 0 331.507 0 0 0 1998.89 250.786 -1167.56 0 0 0 0 -1531.34 1697.36 784.707 0.05 0 -1095.08 228.05 0 0 0 0 0 0 0 0 0 0 963.698 0 0 0 0 0 -1252.56 0 
0 0 -1694.62 0 202.567 -1062.12 0 123.981 0 0 0 1484.19 -972.701 0 0 -204.855 2432.1 0 0 0 0 2341.61 -2365.26 0 0 0 0 0 0 -296.869 0 672.246 0 1030.08 0 0 0 0.07 0 969.344 0 1668.07 0 0 -1856.52 0 0 0 0 0 0 0 0 0 0 0 0 0 
0 -1470.31 0 0 0 0 2225.49 0 0 0 0 -2027.42 0 0 0 0 0 1011 -1718.27 0 1992.48 0 0 0 0 0 0 -809.122 0 513.703 0 0 0 -2053.21 0 1764.05 -525.605 0 0.09 0 1074.63 774.331 0 1118.43 1459.47 0 0 434.812 -511.567 0 1219.29 0 2489.32 0 0 0 0 0 
1822.18 0 0 0 0 0 1826.46 350.429 2396.08 0 0 0 0 -534.761 0 0 1280.33 1836.53 0 0 0 -1139.48 0 0 0 0 0 0 0 -675.298 0 0 0 0 -162.13 1912.52 527.894 1468.78 0 0.05 -1561.4 0 0 0 -745.186 0 0 0 0 0 0 0 2198.48 -63.097 0 0 0 0 
0 0 0 0 0 0 0 0 0 0 0 0 -1126.67 0 0 -564.974 0 0 0 0 0 -2220.3 -1068.07 0 0 0 0 0 1957.23 0 850.627 2151.17 0 -141.377 0 0 0 0 1745.12 1350.37 0.09 -1083.18 -1714.45 0 0 135.578 1257.44 0 0 0 0 2474.36 -919.599 0 1363.8 926.618 983.535 -1098.59 
0 0 0 0 0 -2254.94 0 -2427.67 -520.875 0 -1759.01 -619.755 920.362 0 0 0 0 0 1671.27 0 -695.593 137.715 0 0 0 -117.42 2327.57 0 0 0 2259.67 0 221.03 0 770.669 0 0 501.495 1134.3 0 1413.08 0.05 0 0 1090.35 0 111.774 1900.62 2050.31 1393.55 0 0 1031.45 1460.69 0 0 0 0 
0 0 2269.13 0 0 0 201.041 0 -89.0378 47.0748 0 0 1256.83 0 0 0 0 0 0 974.532 0 0 0 0 0 0 0 0 0 0 0 0 0 -1380.58 0 -1637.7 0 0 0 0 -393.46 0 0.04 0 0 0 1047.17 0 0 0 2351.07 -189.901 1289.94 0 813.089 0 0 1116.9 
0 0 -560.701 0 0 0 -2119.43 2242.73 0 0 0 0 0 0 0 1737.04 0 0 0 2153 0 0 0 0 0 0 0 0 0 0 0 1765.57 0 1330.84 -869.091 1210.9 0 0 91.4792 0 0 0 0 0.04 0 0 0 0 0 0 -384.762 0 0 0 0 0 0 741.829 
0 0 0 0 0 0 0 737.098 0 0 -1455.35 -806.528 0 0 0 0 0 0 0 0 0 0 1220.82 0 585.269 0 1406.52 0 0 0 0 -1302.61 1327.33 0 -1410.79 1999.5 0 -978.347 230.033 2462.16 0 2459.26 0 0 0.02 1069.14 0 0 0 0 0 0 1353.57 0 1688.06 1656.01 0 0 
0 82.1711 477.691 0 0 0 0 0 2178.79 -1890.55 0 0 0 417.112 0 0 0 0 -1249.66 2201.22 0 0 0 0 0 0 0 1302.45 1020 0 1244.47 0 -1520.97 519.044 0 540.864 0 0 0 0 -1315.42 0 0 0 1881.85 0.07 0 -2332.15 763.802 1164.82 0 0 0 0 -841.929 948.439 0 0 
0 -1117.21 0 0 0 0 -1680.58 0 0 0 0 0 0 0 1897.87 0 0 0 -665.227 0 0 0 0 0 0 0 0 0 0 -1457.79 0 0 244.987 0 0 2080.83 0 0 0 0 -1475.19 2037.64 2362.67 0 0 0 0 0 0 0 0 1827.22 0 0 1143.45 -2133.93 0 0 
1425.9 0 0 0 -560.396 0 0 0 0 0 0 -265.587 -1235.77 0 0 0 -1250.57 0 1585.06 0 0 0 -808.512 1190.15 0 0 0 0 0 1276.67 2476.5 -52.4155 0 0 0 0 0 0 2040.85 0 0 -940.352 0 0 0 1220.05 0 0.04 0 0 0 -1963.79 0 0 0 0 0 0 
0 0 0 0 0 0 0 696.509 -1577.43 0 0 0 0 38.0718 0 0 -804.697 2113.18 946.303 0 2408.9 0 0 0 0 0 234.916 0 -1124.23 0 -1466.95 0 586.947 -2109.82 0 0 0 0 1046.86 0 0 -1969.13 0 0 0 1853.92 0 0 0.08 0 47.2274 0 0 0 1500.52 0 0 0 
0 0 0 0 1548.59 0 0 0 32.5785 0 1261.56 -463.347 0 0 0 0 0 0 0 0 0 0 0 -876.72 0 0 -421.69 0 0 0 0 0 452.055 0 0 0 0 0 0 0 0 213.095 0 0 0 -120.014 0 0 0 0.07 137.867 0 0 0 0 0 0 0 
0 0 -1386.84 -1055.86 -611.057 1223.41 0 -145.497 0 1146.2 353.938 0 189.138 0 0 0 0 0 0 0 0 0 0 0 1929.91 1278.8 -1362.27 122.303 0 0 -1710.33 0 -1526.31 0 1057.08 0 2221.82 0 -1305.81 0 0 0 1606.88 1931.9 0 0 0 0 -1263.24 1062.88 0.04 0 0 0 0 0 0 0 
0 0 0 0 0 0 0 -2270.65 0 0 -125.965 -819.498 0 0 0 1032.52 0 231.254 0 -294.885 0 -2454.07 0 -2354.58 0 2024.98 0 0 0 0 0 1562.32 0 0 2293.54 -1259.73 0 0 0 0 1276.51 0 1141.32 0 0 0 -1951.89 -377.743 0 0 0 0.09 1153.98 0 0 -297.479 639.286 0 
-488.83 1822.79 229.728 0 0 0 0 0 0 2209.31 1047.62 0 0 0 519.349 0 0 0 0 1776.41 1605.66 -1265.07 0 0 -703.375 0 0 0 0 0 0 0 0 2023 0 469.756 0 0 2400.51 -1635.72 1990.49 -1164.05 -953.627 0 1545.99 0 0 0 0 0 0 -317.164 0.07 -648.289 0 1808.91 -1812.88 -1026.72 
130.848 0 0 -1132.62 -2469.33 0 0 1571.93 387.204 0 0 0 2330.62 -1115.83 0 0 0 0 0 638.218 762.429 0 0 0 0 0 0 0 0 0 0 1453.67 0 0 0 0 0 0 0 -1398.13 0 2415.01 0 0 0 0 0 0 0 0 0 0 2462 0.06 1821.88 0 0 0 
0 0 0 0 0 7.40074 1923.51 0 0 0 0 0 0 -91.0215 0 -822.092 0 0 0 0 0 1458.25 0 0 0 2444.91 0 0 0 0 0 0 0 1847.36 0 -1347.77 0 0 0 0 -2075.49 0 -1212.73 0 1540.35 -136.647 539.186 0 1746.65 0 0 0 0 2296.75 0.07 0 -1820.35 0 
0 0 114.063 0 0 2040.54 -695.593 617.313 0 1880.93 0 0 0 0 0 0 0 0 0 0 0 0 -304.651 0 0 -1906.26 0 0 545.9 0 0 2400.81 0 0 0 0 0 0 0 0 2077.47 0 0 0 2119.43 -2397.61 -95.4466 0 0 0 0 -1521.73 -1952.5 0 0 0.07 0 0 
260.552 2038.41 0 1584.6 0 0 0 -363.094 -685.217 0 0 0 0 0 0 0 0 0 0 0 0 0 0 0 0 -371.639 -1609.93 0 329.218 1426.97 1656.01 0 235.679 0 0 1381.04 2478.79 0 0 0 1190.15 0 0 0 0 0 0 0 0 0 0 746.254 -1019.24 0 -2472.23 0 0.08 0 
0 0 0 0 0 0 0 0 391.781 0 0 0 0 160.451 398.801 0 0 0 0 1589.18 0 0 0 0 0 0 0 1658.3 0 0 0 0 0 0 0 0 0 0 0 0 -1528.9 0 -2223.35 1767.4 0 0 0 0 0 0 0 0 1607.79 0 0 0 0 0 
