*Vertices 54
*Matrix 
0.06 0 0 0 0 0 0 0 0 0 0 0 0 0 0 433.439 0 562.075 1540.19 0 0 0 0 0 0 0 0 0 0 1572.85 0 0 2149.65 0 1435.51 0 0 0 0 0 0 0 0 0 0 -1445.43 314.417 0 0 0 329.371 0 0 0 
0 0.08 2175.28 0 812.937 0 0 0 0 0 0 0 -168.233 0 -550.63 0 -2390.74 0 0 0 0 0 -843.15 0 0 0 -2122.79 0 0 0 0 0 0 0 0 87.817 0 1067.61 0 -67.217 781.808 0 0 0 0 0 0 0 0 0 0 0 0 1821.57 
0 1073.11 0.01 0 -1290.4 0 0 0 0 0 1715.98 0 -1790.14 0 0 0 0 0 2074.57 0 0 0 -2349.54 0 0 0 0 0 0 0 0 0 0 723.975 962.325 0 0 0 0 760.445 0 0 2252.19 608.158 -820.719 0 0 0 0 0 0 0 0 0 
0 0 0 0.01 0 0 0 0 0 0 0 0 0 817.362 0 0 0 0 0 0 0 0 0 0 0 0 0 0 0 0 0 0 0 0 0 0 0 1864.91 0 0 0 0 0 0 0 0 0 -718.177 0 -2454.68 1568.88 0 -544.221 0 
0 614.261 392.087 0 0.02 0 0 0 0 0 2240.44 0 0 0 0 0 -160.909 0 776.467 0 0 0 0 0 0 0 0 0 0 -1523.87 0 478.607 0 0 0 0 1723.15 0 0 -1752.6 0 0 0 0 0 0 0 0 0 0 0 0 0 0 
0 0 0 0 0 0.06 0 0 0 0 0 0 0 -830.79 0 0 0 0 0 0 0 0 0 0 0 0 -589.084 0 0 1566.74 0 0 0 0 0 0 1458.56 0 0 0 0 0 1560.95 0 0 0 0 0 0 0 4.34889 0 0 0 
0 0 0 0 0 0 0.07 0 0 0 0 0 0 0 -1802.5 0 0 0 0 0 0 0 0 0 0 2132.25 0 -1353.42 0 0 0 2091.2 0 0 0 0 0 0 0 1597.72 -22.0496 0 0 0 0 0 0 0 0 459.99 0 0 0 0 
0 0 0 0 0 0 0 0.03 0 0 0 0 0 0 0 0 0 0 0 835.063 0 0 0 0 -685.217 0 0 0 0 0 0 0 0 0 0 0 0 2222.13 0 0 0 0 0 0 2412.56 0 477.081 0 0 876.568 0 0 0 0 
0 0 0 0 0 0 0 0 0.06 0 -1381.5 0 0 0 0 0 0 -1235.47 0 0 2145.53 2422.33 0 0 0 0 0 0 0 0 0 0 0 0 -1675.24 0 0 0 0 0 1136.13 0 0 1451.23 0 0 0 0 0 0 0 533.235 0 0 
0 0 0 0 0 0 0 0 0 0.04 0 0 1157.95 0 0 0 0 0 0 -939.283 0 0 0 0 0 0 0 0 0 0 0 0 0 0 0 0 0 0 0 0 0 0 0 0 0 0 0 0 630.131 0 1900.46 0 0 -224.235 
0 0 2025.89 0 163.656 0 0 0 -722.755 0 0.04 0 0 1243.86 0 0 0 0 0 0 0 -1009.63 -164.266 0 0 0 0 0 0 0 0 0 -2492.52 0 0 0 0 0 -112.995 0 0 0 0 0 0 0 2174.06 0 0 0 0 0 0 0 
0 0 0 0 0 0 0 0 0 0 0 0.06 1670.2 0 2034.29 0 506.989 0 0 0 0 0 0 -1195.94 0 0 0 0 0 2008.8 0 0 1795.33 0 0 0 0 0 0 0 0 0 382.168 0 0 -1331.75 0 0 0 0 0 2485.81 0 0 
0 -284.356 -526.521 0 0 0 0 0 0 1869.49 0 2038.71 0.09 0 0 0 0 2270.81 0 0 0 0 0 0 0 0 -2137.29 0 -634.098 0 0 0 0 0 1914.35 62.6392 0 0 531.251 0 0 0 1905.04 0 0 0 0 0 0 0 0 0 0 0 
0 0 0 -336.238 0 -1998.28 0 0 0 0 863.14 0 0 0.09 0 0 0 0 1610.08 0 0 0 0 0 0 971.48 0 0 0 0 0 0 0 0 0 0 0 0 2308.04 0 0 0 0 0 0 0 0 0 0 0 0 -706.122 693.915 0 
0 -36.6985 0 0 0 0 1056.02 0 0 0 0 612.888 0 0 0.04 0 0 0 0 0 0 0 0 0 0 0 0 0 0 0 0 0 0 0 0 0 0 0 0 0 0 0 0 0 0 2238.76 0 0 0 1336.33 1170.46 0 0 0 
-1944.41 0 0 0 0 0 0 0 0 0 0 0 0 0 0 0.09 0 0 0 0 0 1197.16 941.267 0 0 0 0 0 0 0 1939.38 0 0 0 0 0 0 0 0 0 -787.149 0 0 675.146 0 0 204.093 0 2205.8 0 0 0 0 2075.33 
0 210.501 0 0 -1534.39 0 0 0 0 0 0 1245.54 0 0 0 0 0 0 0 0 1868.57 0 0 0 1998.89 0 0 0 0 0 0 0 0 0 0 0 0 0 0 0 -1825.24 -1056.17 1872.69 0 0 0 0 0 -2221.52 0 0 0 1954.18 2322.84 
2245.17 0 0 0 0 0 0 0 -1131.4 0 0 0 -1209.83 0 0 0 0 0.07 0 0 0 0 0 0 0 0 0 0 0 0 0 0 -466.704 0 0 0 0 1849.65 0 0 0 0 0 -1058 0 0 0 0 0 0 0 0 0 0 
2120.66 0 2410.89 0 1923.2 0 0 0 0 0 0 0 0 -2369.38 0 0 0 0 0.09 0 0 0 0 0 992.691 0 1580.32 0 0 0 0 0 0 -1860.79 0 0 0 0 0 0 0 0 0 0 0 0 0 0 0 0 0 0 0 0 
0 0 0 0 0 0 0 1008.26 0 1612.98 0 0 0 0 0 0 0 0 0 0.02 0 0 2208.55 0 0 0 270.165 0 858.257 0 0 -1283.07 0 0 0 1558.66 -171.743 0 0 0 0 1842.33 0 0 0 0 0 0 0 -555.208 767.312 0 0 0 
0 0 0 0 0 0 0 0 217.063 0 0 0 0 0 0 0 -1957.08 0 0 0 0.05 0 0 0 0 0 0 60.6555 -481.964 0 0 0 -1328.39 2407.99 0 0 0 1068.38 1276.82 0 0 0 -612.125 -758.766 0 0 0 0 1208 0 0 0 0 0 
0 0 0 0 0 0 0 0 573.824 0 -1530.27 0 0 0 0 -1259.12 0 0 0 0 0 0.06 0 0 0 0 0 1388.06 0 2068.47 0 0 0 0 0 2001.02 0 -593.204 0 -1150.01 0 0 0 0 0 0 0 0 0 0 0 0 0 0 
0 1580.63 2367.7 0 0 0 0 0 0 0 2448.58 0 0 0 0 2163.23 0 0 0 219.962 0 0 0.03 0 0 0 0 0 0 0 -1472.14 0 0 0 0 0 0 -291.375 -2274.47 0 0 0 0 0 0 0 0 0 0 0 0 0 0 0 
0 0 0 0 0 0 0 0 0 0 0 1434.9 0 0 0 0 0 0 0 0 0 0 0 0.07 0 2216.48 0 0 0 0 0 0 0 -2019.94 0 0 0 0 0 174.795 -248.955 0 0 0 0 0 0 0 0 0 0 0 0 0 
0 0 0 0 0 0 0 1462.37 0 0 0 0 0 0 0 0 -462.737 0 -1416.44 0 0 0 0 0 0.06 0 -2102.65 0 0 0 0 0 1539.74 0 0 0 0 0 0 0 0 0 0 0 0 0 0 0 0 0 0 1704.99 243.461 0 
0 0 0 0 0 0 1410.79 0 0 0 0 0 0 464.873 0 0 0 0 0 0 0 0 0 -434.812 0 0.08 0 0 0 0 0 0 0 689.032 0 0 0 0 0 0 -417.417 0 0 0 0 0 0 0 0 0 0 0 0 1293.76 
0 -1405.61 0 0 0 1261.56 0 0 0 0 0 0 923.719 0 0 0 0 0 1076.62 38.8348 0 0 0 0 -200.278 0 0.08 0 0 0 413.144 0 0 0 0 1924.12 1294.37 0 0 0 0 0 0 0 0 0 0 0 0 2416.84 0 0 2035.05 0 
0 0 0 0 0 0 419.553 0 0 0 0 0 0 0 0 0 0 0 0 0 35.783 -1996.6 0 0 0 0 0 0.03 0 893.201 0 0 0 0 0 0 0 0 0 0 0 0 0 0 0 0 0 0 0 1733.07 0 0 0 0 
0 0 0 0 0 0 0 0 0 0 0 0 1807.84 0 0 0 0 0 0 1226.92 1912.37 0 0 0 0 0 0 0 0.01 0 0 0 0 0 0 0 0 0 0 0 0 829.569 0 0 0 0 0 0 0 0 0 0 0 0 
595.645 0 0 0 384.915 1480.83 0 0 0 0 0 -1555.45 0 0 0 0 0 0 0 0 0 1836.53 0 0 0 0 0 2396.54 0 0.02 0 0 0 0 0 0 0 0 0 0 0 0 0 0 0 0 0 2305.29 0 0 0 0 0 0 
0 0 0 0 0 0 0 0 0 0 0 0 0 0 0 1486.79 0 0 0 0 0 0 916.395 0 0 0 2118.21 0 0 0 0.02 0 0 0 0 0 -2182 0 722.144 0 0 2243.34 0 0 0 457.854 101.856 0 0 0 0 0 0 0 
0 0 0 0 -810.495 0 473.724 0 0 0 0 0 0 0 0 0 0 0 0 1612.22 0 0 0 0 0 0 0 0 0 0 0 0.01 0 0 0 0 0 0 0 0 0 0 0 759.377 0 0 0 0 -214.011 0 0 0 -1383.48 0 
-37.0037 0 0 0 0 0 0 0 0 0 2469.18 281.304 0 0 0 0 0 155.873 0 0 1428.19 0 0 0 2115.62 0 0 0 0 0 0 0 0.01 0 0 0 0 622.044 0 0 0 0 0 0 0 -973.159 0 0 0 0 958.357 -1866.28 0 0 
0 0 1581.24 0 0 0 0 0 0 0 0 0 0 0 0 0 0 0 -58.5192 0 -1839.88 0 0 -773.263 0 1484.8 0 0 0 0 0 0 0 0.03 0 324.488 0 0 641.118 -518.433 0 1390.19 0 0 1660.44 0 0 0 0 0 0 1658.6 0 0 
1632.36 0 367.519 0 0 0 0 0 1042.59 0 0 0 -2277.83 0 0 0 0 0 0 0 0 0 0 0 0 0 0 0 0 0 0 0 0 0 0 0 0 0 0 869.701 0 0 0 0 0 0 0 0 2332.91 0 0 0 0 0 
0 2021.16 0 0 0 0 0 0 0 0 0 0 226.981 0 0 0 0 0 0 -31.2052 0 1873.45 0 0 0 0 -1802.04 0 0 0 0 0 0 -676.672 0 0.07 0 0 1549.5 0 0 0 -346.004 0 0 0 1925.03 0 0 0 -1085.47 0 0 0 
0 0 0 0 1043.96 -777.535 0 0 0 0 0 0 0 0 0 0 0 0 0 -1845.99 0 0 0 0 0 0 72.5578 0 0 0 778.756 0 0 0 0 0 0.04 0 0 0 0 0 0 0 0 0 0 0 0 1817.45 0 -53.1785 0 0 
0 674.23 0 -1482.67 0 0 0 1944.56 0 0 0 0 0 0 0 0 0 3.58592 0 0 1108.36 1459.01 708.869 0 0 0 0 0 0 0 0 0 -830.79 0 0 0 0 0.05 0 0 0 0 -984.909 861.461 0 0 0 0 0 2265.47 0 0 0 0 
0 0 0 0 0 0 0 0 0 0 -2161.09 0 1633.12 210.654 0 0 0 0 0 0 102.466 0 2173.15 0 0 0 0 0 0 0 835.826 0 0 -1494.57 0 2080.37 0 0 0.09 0 0 -1219.9 0 0 0 0 0 -2226.4 0 0 2388.15 0 0 0 
0 -990.707 1507.39 0 1704.38 0 2464.14 0 0 0 0 0 0 0 0 0 0 0 0 0 0 -177.084 0 405.972 0 0 0 0 0 0 0 0 0 2330.47 -2314.45 0 0 0 0 0.01 0 399.258 0 0 1155.66 0 0 -441.832 0 -676.214 0 0 0 0 
0 1798.23 0 0 0 0 -1546.6 0 206.076 0 0 0 0 0 0 1503.72 2374.11 0 0 0 0 0 0 2188.71 0 869.854 0 0 0 0 0 0 0 0 0 0 0 0 0 0 0 0 0 0 0 0 0 0 0 0 0 0 0 0 
0 0 0 0 0 0 0 0 0 0 0 0 0 0 0 0 -189.444 0 0 -350.581 0 0 0 0 0 0 0 0 1045.18 0 968.123 0 0 331.507 0 0 0 0 836.131 318.842 0 0.09 0 0 0 0 0 0 0 0 -365.383 0 0 0 
0 0 675.909 0 0 832.469 0 0 0 0 0 -2174.83 2427.21 0 0 0 1460.69 0 0 0 1697.21 0 0 0 0 0 0 0 0 0 0 0 0 0 0 -1150.32 0 -870.464 0 0 0 0 0.09 0 0 -498.138 0 0 0 0 0 0 0 0 
0 0 -1931.75 0 0 0 0 0 2393.49 0 0 0 0 0 0 -2495.27 0 1303.22 0 0 1635.87 0 0 0 0 0 0 0 0 0 0 1843.85 0 0 0 0 0 -317.774 0 0 0 0 0 0.04 0 -671.026 0 0 0 0 0 0 0 0 
0 0 2151.48 0 0 0 0 890.912 0 0 0 0 0 0 0 0 0 0 0 0 0 0 0 0 0 0 0 0 0 0 0 0 0 -1532.87 0 0 0 0 0 1730.93 0 0 0 0 0.07 0 0 221.641 0 0 0 0 0 1495.79 
1501.13 0 0 0 0 0 0 0 0 0 0 -1090.2 0 0 -185.934 0 0 0 0 0 0 0 0 0 0 0 0 0 0 0 634.709 0 922.193 0 0 0 0 0 0 0 0 0 -1838.97 -372.86 0 0.01 0 -830.485 2402.19 0 0 0 0 0 
1384.4 0 0 0 0 0 0 -929.823 0 0 -24.6437 0 0 0 0 388.272 0 0 0 0 0 0 0 0 0 0 0 0 0 0 1060.29 0 0 0 0 -355.159 0 0 0 0 0 0 0 0 0 0 0.01 0 0 0 0 0 0 0 
0 0 0 -1310.69 0 0 0 0 0 0 0 0 0 0 0 0 0 0 0 0 0 0 0 0 0 0 0 0 0 -2169.64 0 0 0 0 0 0 0 0 763.192 2143.85 0 0 0 0 2265.47 -1570.86 0 0.01 0 0 0 0 0 0 
0 0 0 0 0 0 0 0 0 934.095 0 0 0 0 0 -1468.17 1621.37 0 0 0 -1694.46 0 0 0 0 0 0 0 0 0 0 2069.69 0 0 52.5681 0 0 0 0 0 0 0 0 0 0 298.547 0 0 0.06 0 0 0 -440.764 2360.53 
0 0 0 422.147 0 0 2135 -1028.24 0 0 0 0 0 0 -532.472 0 0 0 0 955.611 0 0 0 0 0 0 -491.729 2341.15 0 0 0 0 0 0 0 0 1812.42 -1654.33 0 1206.02 0 0 0 0 0 0 0 0 0 0.04 0 0 0 0 
-228.66 0 0 2030.78 0 -216.453 0 0 0 1312.07 0 0 0 0 -643.864 0 0 0 0 1824.93 0 0 0 0 0 0 0 0 0 0 0 0 -796.609 0 0 2270.81 0 0 287.561 0 0 -1238.36 0 0 0 0 0 0 0 0 0 0 0 0 
0 0 0 0 0 0 0 0 61.1133 0 0 1996.44 0 1783.58 0 0 0 0 0 0 0 0 0 0 -1046.25 0 0 0 0 0 0 0 -182.424 2477.87 0 0 70.5741 0 0 0 0 0 0 0 0 0 0 0 0 0 0 0.06 0 0 
0 0 0 1132.31 0 0 0 0 0 0 0 0 0 1815.93 0 0 1797.01 0 0 0 0 0 0 0 495.544 0 1264.76 0 0 0 0 -760.292 0 0 0 0 0 0 0 0 0 0 0 0 0 0 0 0 -2147.21 0 0 0 0.03 0 
0 1286.74 0 0 0 0 0 0 0 1000.93 0 0 0 0 0 2447.05 1864.76 0 0 0 0 0 0 0 0 655.461 0 0 0 0 0 0 0 0 0 0 0 0 0 0 0 0 0 0 1527.83 0 0 0 1704.84 0 0 0 0 0 
