*Vertices 58
*Matrix 
0.04 0 0 2099.6 0 0 1544.47 2043.9 -179.983 159.841 0 0 0 0 0 0 0 0 0 0 0 0 0 0 0 0 0 1274.53 0 0 0 0 553.377 0 0 0 0 0 0 0 -33.0363 622.044 0 0 0 0 0 0 0 0 0 0 0 0 0 0 0 0 
0 0.09 0 -2.67037 0 0 0 0 0 0 -1106.98 0 -248.344 0 0 930.891 0 0 0 0 -732.215 2492.22 -1182.97 2468.57 0 449.461 0 0 0 0 0 -212.18 0 -1066.09 0 0 0 0 0 0 0 0 0 0 2295.53 0 0 0 0 0 0 0 0 0 0 -2170.25 1522.95 0 
0 0 0.08 0 0 0 0 0 1242.48 0 0 0 0 0 0 1934.49 0 0 0 0 0 0 0 0 0 -141.987 2399.9 0 -2213.13 0 21.5918 0 0 0 0 0 113.147 0 0 0 -223.93 0 0 849.101 0 -2400.2 0 0 0 0 0 0 0 0 0 0 0 0 
-1052.51 2106.16 0 0 0 78.0511 -151.448 0 2404.17 0 0 -924.635 0 0 0 0 0 0 891.675 -1840.19 0 0 1023.51 0 0 2225.64 0 0 0 0 1540.65 0 0 0 0 0 83.8496 0 0 0 0 0 0 0 0 0 0 0 0 0 0 0 0 0 0 0 0 0 
0 0 0 0 0.02 -397.885 -559.023 0 0 0 0 2354.88 1371.58 0 2091.05 1233.79 0 0 1455.35 -202.567 0 0 0 0 0 0 0 0 0 0 0 0 0 0 0 0 0 0 0 0 0 0 0 873.211 0 -1361.96 0 0 0 0 0 0 0 0 0 0 2431.33 0 
0 0 0 2450.56 1190.76 0 0 0 624.485 0 -2405.24 585.269 421.69 0 2223.81 0 -864.36 0 0 0 0 0 230.186 0 0 0 0 210.349 0 0 0 0 0 0 0 0 0 0 0 0 0 0 1845.53 1349.3 0 0 0 0 -279.321 0 0 -2148.88 0 0 0 0 0 -2483.06 
1352.81 0 0 74.9992 301.599 0 0.06 0 0 919.599 1694.92 1574.53 0 1883.07 0 0 0 0 -2144 0 0 942.03 0 0 -121.54 0 0 0 1787.39 -1522.03 2447.97 0 0 0 -2181.84 -680.639 0 0 -1058.76 0 0 0 0 0 0 0 0 -1521.58 0 -906.171 0 -352.412 0 -1469.85 0 0 0 0 
-2398.07 0 0 0 0 0 0 0.08 0 0 0 0 0 -201.651 0 0 0 -1205.86 2472.53 0 2235.25 0 0 0 0 0 0 0 0 414.06 1646.86 0 0 0 1846.75 0 0 0 0 0 0 0 0 0 0 0 2009.72 0 0 0 0 0 0 0 0 -530.03 0 2308.95 
-509.125 0 1900.92 2323.6 0 865.734 0 0 0.01 -959.12 0 0 0 0 0 -474.029 -2271.42 0 1902.91 768.38 0 -1081.8 0 0 -1799.91 0 0 1155.66 0 0 0 1981.8 0 0 0 0 0 0 0 0 0 0 0 0 0 0 0 0 0 0 0 0 0 0 0 0 0 410.55 
441.221 0 0 0 0 0 1902.14 0 -799.661 0.05 1834.85 0 0 0 0 1991.26 0 0 0 -1591.31 0 1072.34 0 0 0 456.023 -1609.93 0 0 0 -1574.53 575.198 0 0 0 0 0 0 0 0 0 0 0 2084.03 0 0 0 0 0 -1641.67 0 0 0 536.897 -15.183 0 0 0 
0 -654.546 0 0 0 354.091 1112.78 0 0 -227.439 0.01 0 0 0 0 0 0 -984.756 0 0 0 0 0 0 0 0 0 0 0 2239.68 0 0 2425.53 0 0 0 0 0 0 -703.986 2453.15 0 0 0 0 0 -587.1 0 0 0 0 0 0 1770.15 0 0 0 0 
0 0 0 -1752.6 2313.23 -602.054 1251.49 0 0 0 0 0.08 0 0 -709.479 0 2287.44 0 2253.11 1408.81 0 0 0 -544.679 0 1506.93 0 0 0 513.092 0 -1945.17 0 0 0 2149.19 0 0 0 0 0 0 0 1073.87 0 0 0 0 0 0 0 0 0 -1614.05 940.199 0 0 1831.34 
0 1915.27 0 0 -2414.4 1387.91 0 0 0 0 0 0 0.08 0 0 2258.9 2366.33 0 0 0 0 1524.93 0 -177.236 -1505.4 0 0 0 0 0 0 0 0 0 -1854.53 0 0 0 0 0 0 0 -1339.23 0 2097.31 0 0 0 0 0 0 0 1147.72 0 0 -509.735 0 -299.005 
0 0 0 0 0 0 347.53 2085.86 0 0 0 0 0 0.05 0 0 0 0 0 0 1875.44 661.87 0 -70.8792 0 0 0 0 0 483.947 0 0 0 0 0 0 0 0 0 0 0 0 0 0 0 0 0 0 0 0 1502.2 0 -1975.54 0 0 2009.11 0 0 
0 0 0 0 -2447.36 -738.472 0 0 0 0 0 2180.17 0 0 0.09 0 0 -955.611 -297.479 0 0 0 0 1975.08 0 0 842.845 0 0 -709.326 0 2070.6 0 0 974.075 0 0 0 0 442.137 0 0 0 0 0 0 0 0 0 0 0 0 0 0 0 0 0 0 
0 1739.48 1577.43 0 2488.86 0 0 0 588.473 -991.165 0 0 1083.33 0 0 0.04 0 316.706 0 459.38 0 0 2188.56 2178.64 0 0 0 0 -2008.35 0 2283.17 0 0 0 0 0 0 0 -615.787 0 0 0 0 0 0 0 0 0 0 0 0 0 0 0 0 0 -710.852 0 
0 0 0 0 0 -2216.79 0 0 1354.18 0 0 308.313 -229.728 0 0 0 0.07 0 0 0 0 0 1929.61 0 2057.94 0 0 0 -1551.48 -19.7607 228.66 0 0 -127.491 0 -1873 0 0 0 0 0 301.447 2223.65 0 1632.21 0 0 0 0 0 -88.4274 0 0 0 0 0 0 0 
0 0 0 0 0 0 0 609.073 0 0 1639.84 0 0 0 1666.23 1806.31 0 0.03 1522.95 0 0 0 0 0 0 0 -1375.24 0 793.405 0 0 -333.491 0 0 0 0 0 0 0 0 0 0 0 0 0 0 0 0 0 0 0 0 0 0 0 0 2242.88 0 
0 0 0 1737.49 -1939.83 0 -777.383 2247 -1448.18 0 0 -1271.63 0 0 36.6985 0 0 1103.02 0.01 2070.76 2313.23 0 0 0 -324.183 0 2284.84 0 0 2003.31 0 0 0 0 0 0 0 -656.529 0 0 0 0 0 0 0 0 0 0 -985.214 0 0 0 0 0 0 0 0 0 
0 0 0 2268.06 -1829.36 0 0 0 -64.3178 -1496.86 0 2002.09 0 0 0 928.297 0 0 1901.84 0 0 0 0 0 0 0 0 0 0 1515.02 0 0 866.955 1056.17 0 0 0 0 0 -1275.44 0 0 0 0 0 0 0 0 599.155 0 2097.16 0 0 0 0 0 0 0 
0 1458.25 0 0 0 0 0 1849.19 0 0 0 0 0 1661.2 0 0 0 0 43.4126 0 0.01 0 158.467 0 1717.05 0 0 0 0 0 0 0 -1798.53 0 0 0 0 527.894 0 0 975.906 0 -1906.57 0 0 0 0 0 0 0 0 0 0 0 0 0 -2053.21 0 
0 2326.5 0 0 0 0 1274.68 0 90.2585 -852.153 0 0 2075.49 884.655 0 0 0 0 0 0 0 0.02 0 -1992.78 -1672.95 0 0 0 24.4911 746.101 0 0 0 0 0 0 0 0 0 0 0 0 0 0 -2196.8 2364.35 0 0 0 0 0 0 0 0 0 0 0 0 
0 2463.99 0 32.7311 0 514.466 0 0 0 0 0 0 0 0 0 -1210.75 2445.98 0 0 0 -1768.32 0 0.07 1913.13 0 780.282 0 0 0 0 -2361.6 0 0 0 0 0 0 0 -1172.75 0 346.156 0 0 0 0 0 0 0 0 0 0 0 0 0 0 0 0 0 
0 1274.07 0 0 0 0 0 0 0 0 0 2456.05 -401.7 1104.24 2285.61 -1611.61 0 0 0 0 0 56.6881 339.9 0.06 0 1400.72 1299.25 0 0 0 0 0 0 0 0 0 0 0 0 0 0 0 0 0 0 0 0 -1176.56 0 0 0 0 0 0 529.878 0 0 0 
0 0 0 0 0 0 2264.4 0 890.912 0 0 0 958.815 0 0 0 -73.4733 0 49.6689 0 1524.63 1496.09 0 0 0.05 0 0 0 0 0 0 0 12.7415 0 0 0 0 0 0 531.556 0 0 0 0 -1879.41 0 0 0 0 0 0 0 0 0 0 0 0 0 
0 -271.386 2483.83 -809.732 0 0 0 0 0 1396.91 0 1607.03 0 0 0 0 0 0 0 0 0 0 1628.39 524.384 0 0.02 0 0 0 780.129 0 1300.47 0 0 0 0 0 0 -439.085 0 0 0 0 -1058.61 0 -557.039 -2211.45 0 0 0 0 0 0 0 0 0 -1330.68 0 
0 0 2402.04 0 0 0 0 0 0 738.166 0 0 0 0 -514.161 0 0 1190.76 -1330.68 0 0 0 0 1879.25 0 0 0.04 -1394.31 0 0 1835.31 -916.852 0 0 0 0 0 0 0 0 0 0 0 -214.011 0 0 2341.3 0 1033.43 0 1998.28 0 0 0 0 0 0 0 
1459.47 0 0 0 0 482.727 0 0 2277.67 0 0 0 0 0 0 0 0 0 0 0 0 0 0 0 0 0 327.387 0.08 0 419.858 258.721 0 0 0 0 0 0 805.46 1049 0 0 0 0 0 0 0 0 0 0 0 0 0 0 0 0 0 0 0 
0 0 -1815.16 0 0 0 1602.3 0 0 0 0 0 0 0 0 -24.3385 840.709 1549.65 0 0 0 2008.65 0 0 0 0 0 0 0.08 1981.8 0 0 0 0 0 0 0 -1892.53 0 0 0 0 0 -723.518 -2469.02 0 0 0 0 0 0 0 0 0 0 0 0 0 
0 0 0 0 0 0 -650.426 -1060.9 0 0 1735.82 423.215 0 2324.67 2151.94 0 1001.39 0 -310.907 -597.018 0 1409.42 0 0 0 -1391.72 0 -1082.26 1037.1 0 0 0 0 0 0 -987.045 964.614 0 0 2198.02 0 0 0 0 0 0 0 0 0 0 0 0 0 0 0 0 0 0 
0 0 -1301.08 1292.99 0 0 -541.627 969.955 0 2385.56 0 0 0 0 0 -370.113 -506.378 0 0 0 0 0 2172.54 0 0 0 1408.66 1686.38 0 0 0 0 2360.23 0 0 0 0 0 0 -917.463 0 0 0 0 0 0 0 1139.03 0 0 0 2407.83 1915.57 368.892 0 0 0 0 
0 1555.45 0 0 0 0 0 0 273.827 1835.31 0 -168.844 0 0 1191.82 0 0 186.392 0 0 0 0 0 0 0 2065.72 1409.12 0 0 0 0 0.02 0 -1892.53 0 0 0 0 957.442 0 0 0 0 0 0 0 0 0 0 0 0 0 0 0 0 0 0 0 
2427.52 0 0 0 0 0 0 0 0 0 -76.6778 0 0 0 0 0 0 0 0 -1553.16 2426.3 0 0 0 591.372 0 0 0 0 0 562.38 0 0.03 0 1224.48 0 0 0 0 0 0 59.74 0 0 0 0 0 0 0 0 0 633.488 0 0 0 0 0 0 
0 2447.05 0 0 0 0 0 0 0 0 0 0 0 0 0 0 -2066.03 0 0 2184.44 0 0 0 0 0 0 0 0 0 0 0 2053.36 0 0 0 -1009.32 0 0 0 0 0 0 0 0 0 0 0 0 0 0 0 0 0 0 1773.51 0 0 0 
0 0 0 0 0 0 1748.63 575.045 0 0 0 0 313.196 0 -1396.45 0 0 0 0 0 0 0 0 0 0 0 0 0 0 0 0 0 2016.59 0 0.03 0 0 0 0 -223.014 0 1692.48 0 0 0 0 0 0 0 -732.521 0 0 0 0 0 -858.867 0 -1749.4 
0 0 0 0 0 0 -302.362 0 0 0 0 2023.61 0 0 0 0 -96.6674 0 0 0 0 0 0 0 0 0 0 0 0 -581.149 0 0 0 2377.16 0 0.05 0 0 0 0 0 0 0 0 0 0 0 0 0 0 0 0 0 0 0 0 0 0 
0 0 1354.49 -1306.12 0 0 0 0 0 0 0 0 0 0 0 0 0 0 0 0 0 0 0 0 0 0 0 0 0 1558.96 0 0 0 0 0 0 0.05 0 0 0 0 0 0 0 0 0 0 0 0 0 0 0 0 0 0 0 0 0 
0 0 0 0 0 0 0 0 0 0 0 0 0 0 0 0 0 0 1393.86 0 -598.392 0 0 0 0 0 0 -929.518 710.852 0 0 0 0 0 0 0 0 0.01 0 0 0 0 0 -617.008 0 0 0 0 0 0 0 0 0 0 0 0 0 0 
0 0 0 0 0 0 -1293.91 0 0 0 0 0 0 0 0 2168.26 0 0 0 0 0 0 1339.38 0 0 -816.904 0 -1071.43 0 0 0 261.62 0 0 0 0 0 0 0.09 0 0 0 0 0 0 0 0 0 0 0 0 0 0 0 0 0 0 0 
0 0 0 0 0 0 0 0 0 0 2013.08 0 0 0 1550.42 0 0 0 0 -1287.04 0 0 0 0 1500.52 0 0 0 0 759.835 -2138.36 0 0 0 1528.44 0 0 0 0 0.04 0 0 0 0 0 0 0 313.654 0 0 2462.46 0 0 0 -1205.56 0 0 0 
-942.946 0 2452.54 0 0 0 0 0 0 0 648.442 0 0 0 0 0 0 0 0 0 1320.46 0 -67.98 0 0 0 0 0 0 0 0 0 0 0 0 0 0 0 0 0 0.03 0 0 0 0 0 0 0 0 0 0 0 1082.87 0 0 0 0 0 
670.415 0 0 0 0 0 0 0 0 0 0 0 0 0 0 0 597.781 0 0 0 0 0 0 0 0 0 0 0 0 0 0 0 1495.94 0 -1249.96 0 0 0 0 0 0 0.09 0 0 169.912 0 0 0 0 742.439 0 0 0 1019.24 0 0 0 879.62 
0 0 0 0 0 1788.61 0 0 0 0 0 0 1577.73 0 0 0 2298.27 0 0 0 1147.57 0 0 0 0 0 0 0 0 0 0 0 0 0 0 0 0 0 0 0 0 0 0 0 0 0 1515.63 0 0 0 0 0 0 0 0 0 0 0 
0 0 -795.999 0 -1665.93 255.821 0 0 0 1365.47 0 -2047.11 0 0 0 0 0 0 0 0 0 0 0 0 0 1561.25 474.334 0 2072.74 0 0 0 0 0 0 0 0 1996.44 0 0 0 0 0 0.04 0 1704.99 0 0 780.282 264.824 0 0 0 0 0 0 0 0 
0 1321.83 0 0 0 0 0 0 0 0 0 0 771.279 0 0 0 2277.67 0 0 0 0 -112.995 0 0 -560.091 0 0 0 -2480.01 0 0 0 0 0 0 0 0 0 0 0 0 1618.32 0 0 0 0 0 0 0 0 0 0 -2035.66 0 0 0 0 0 
0 0 1986.37 0 1562.17 0 0 0 0 0 0 0 0 0 0 0 0 0 0 0 0 -2394.71 0 0 0 2295.07 0 0 0 0 0 0 0 0 0 0 0 0 0 0 0 0 0 1796.09 0 0.07 0 -1188.16 0 0 0 0 0 -211.57 0 0 0 0 
0 0 0 0 0 0 0 1862.47 0 0 -1286.58 0 0 0 0 0 0 0 0 0 0 0 0 0 0 -700.781 1792.58 0 0 0 0 0 0 0 0 0 0 0 0 0 0 0 2058.85 0 0 0 0 0 0 0 -1261.56 0 0 0 0 0 0 0 
0 0 0 0 0 0 -1380.28 0 0 0 0 0 0 0 0 0 0 0 0 0 0 0 0 2112.57 0 0 0 0 0 0 -796.457 0 0 0 0 0 0 0 0 1960.13 0 0 0 0 0 1796.24 0 0.03 0 0 0 0 0 0 0 0 0 -1692.02 
0 0 0 0 0 1587.34 0 0 0 0 0 0 0 0 0 0 0 0 1495.94 -522.858 0 0 0 0 0 0 2144.92 0 0 0 0 0 0 0 0 0 0 0 0 0 0 0 0 2287.59 0 0 0 0 0.07 0 0 0 0 0 0 0 0 0 
0 0 0 0 0 0 1197.47 0 0 -2265.62 0 0 0 0 0 0 0 0 0 0 0 0 0 0 0 0 0 0 0 0 0 0 0 0 1189.38 0 0 0 0 0 0 1071.89 0 382.321 0 0 0 0 0 0.06 0 0 0 0 0 0 0 0 
0 0 0 0 0 0 0 0 0 0 0 0 0 747.78 0 0 -1959.67 0 0 1953.87 0 0 0 0 0 0 1529.97 0 0 0 0 0 0 0 0 0 0 0 0 2300.71 0 0 0 0 0 0 430.845 0 0 0 0.02 -872.753 0 0 -1226 0 0 0 
0 0 0 0 0 1938.15 1236.23 0 0 0 0 0 0 0 0 0 0 0 0 0 0 0 0 0 0 0 0 0 0 0 1339.23 0 288.324 0 0 0 0 0 0 0 0 0 0 0 0 0 0 0 0 0 1077.99 0.06 261.315 -1698.74 0 0 0 0 
0 0 0 0 0 0 0 0 0 0 0 0 1844.16 621.433 0 0 0 0 0 0 0 0 0 0 0 0 0 0 0 0 -80.9503 0 0 0 0 0 0 0 0 0 1589.94 0 0 0 -1634.19 0 0 0 0 0 0 1763.28 0.03 1521.73 0 0 0 0 
0 0 0 0 0 0 416.044 0 0 24.1859 1277.58 30.4422 0 0 0 0 0 0 0 0 0 0 0 0 0 0 0 0 0 0 -2021.47 0 0 0 0 0 0 0 0 0 0 1465.42 0 0 0 -723.975 0 0 0 0 0 1753.67 177.236 0.02 0 0 0 0 
0 0 0 0 0 0 0 0 0 2314.91 0 -1550.72 0 0 0 0 0 0 0 0 0 0 0 2355.19 0 0 0 0 0 0 0 0 0 -1469.39 0 0 0 0 0 -435.118 0 0 0 0 0 0 0 0 0 0 411.618 0 0 0 0.01 0 0 0 
0 -1824.78 0 0 0 0 0 -1784.19 0 0 0 0 2159.41 947.676 0 0 0 0 0 0 0 0 0 0 0 0 0 0 0 0 0 0 0 0 933.943 0 0 0 0 0 0 0 0 0 0 0 0 0 0 0 0 0 0 0 0 0.02 0 0 
0 1781.75 0 0 -829.569 0 0 0 0 0 0 0 0 0 0 -539.033 0 1554.84 0 0 -2178.03 0 0 0 0 1653.57 0 0 0 0 0 0 0 0 0 0 0 0 0 0 0 0 0 0 0 0 0 0 0 0 0 0 0 0 0 0 0.06 0 
0 0 0 0 0 860.698 0 667.516 2465.21 0 0 2217.4 -560.091 0 0 0 0 0 0 0 0 0 0 0 0 0 0 0 0 0 0 0 0 0 -833.537 0 0 0 0 0 0 1243.1 0 0 0 0 0 -886.639 0 0 0 0 0 0 0 0 0 0.02 
