*Vertices 41
*Matrix 
0.06 0 0 0 537.965 0 0 0 0 0 0 0 534.15 -1957.08 0 0 0 0 -1769.08 0 1150.93 0 0 0 223.014 0 0 0 1057.39 1359.37 1986.83 0 0 0 1849.96 0 0 0 0 0 0 
0 0.06 0 0 0 2241.81 0 0 -600.986 0 0 1737.65 0 0 0 0 0 0 0 0 0 0 1367.46 -936.079 0 0 0 0 0 0 0 0 0 0 0 0 0 0 0 0 0 
0 0 0.08 0 2388.3 0 0 0 0 0 0 2071.37 0 0 0 0 0 0 0 0 0 0 0 0 0 0 1531.19 0 0 0 0 0 0 0 0 0 0 0 0 0 0 
0 0 0 0 0 -586.184 0 0 0 0 0 0 0 0 0 0 0 0 1862.16 0 -702.155 0 0 0 0 0 0 0 -234.306 0 0 0 0 0 0 0 0 0 0 0 0 
949.66 0 -653.935 0 0.07 1253.17 1765.88 0 0 0 0 0 0 0 0 0 0 0 0 0 907.239 0 0 0 0 0 0 0 0 0 0 0 0 0 0 0 0 0 0 0 0 
0 835.673 0 1243.25 1244.47 0.04 0 0 0 0 0 0 0 0 0 -42.0392 0 0 -2359.61 0 0 0 0 0 0 0 0 0 0 1967.45 0 0 0 0 0 0 0 -496.918 0 0 0 
0 0 0 0 1230.12 0 0.01 0 0 0 0 0 0 0 0 0 0 2359.77 907.239 0 0 0 0 0 0 0 0 -1868.57 0 0 0 0 0 0 0 0 0 0 0 0 0 
0 0 0 0 0 0 0 0.08 0 864.208 0 0 0 0 1254.69 0 0 0 0 0 0 0 0 0 -637.455 0 0 0 0 0 0 0 0 0 0 0 0 0 0 0 0 
0 -165.792 0 0 0 0 0 0 0.09 0 0 0 0 0 0 0 0 0 0 0 0 0 1871.17 0 0 0 0 0 0 0 0 0 0 0 0 0 0 0 0 0 0 
0 0 0 0 0 0 0 1309.17 0 0.02 1338.47 0 0 0 0 0 0 0 2398.37 -1673.86 0 0 0 0 0 -1324.12 0 0 0 0 0 0 0 0 0 0 0 0 0 0 0 
0 0 0 0 0 0 0 0 0 107.807 0 0 0 2123.1 0 0 0 0 0 0 0 0 0 0 0 534.761 0 0 0 0 0 0 0 0 0 -1373.41 0 0 0 0 0 
0 1460.23 2150.11 0 0 0 0 0 0 0 0 0.06 0 0 0 0 0 0 0 0 0 0 0 0 0 0 399.411 0 0 0 0 0 0 0 0 0 0 0 0 0 0 
-1359.52 0 0 0 0 0 0 0 0 0 0 0 0.01 833.384 -1844.77 0 25.7118 0 0 0 0 0 0 0 0 1079.06 1988.51 1934.34 0 0 0 0 0 0 0 0 0 0 0 0 0 
-1221.58 0 0 0 0 0 0 0 0 0 2056.57 0 1489.68 0.08 0 0 0 0 0 0 0 0 0 1022.29 2313.53 0 0 0 0 0 0 1213.19 0 0 0 0 0 0 0 0 0 
0 0 0 0 0 0 0 1337.86 0 0 0 0 -2196.04 0 0.06 687.811 -457.701 0 0 0 0 0 0 2489.93 0 0 0 0 0 0 0 0 0 0 0 0 0 0 0 0 0 
0 0 0 0 0 -2199.55 0 0 0 0 0 0 0 0 -436.796 0.08 1704.54 1627.93 0 1777.93 -551.546 0 0 0 0 0 691.321 0 0 0 0 0 -712.226 0 0 0 0 0 0 0 0 
0 0 0 0 0 0 0 0 0 0 0 0 197.836 0 -272.607 -543.153 0.04 0 0 0 0 0 0 1130.79 0 0 0 0 -510.804 1861.4 0 0 0 0 0 0 0 0 0 0 0 
0 0 0 0 0 0 2180.62 0 0 0 0 0 0 0 0 668.889 0 0.04 0 0 -1722.24 0 385.372 0 0 0 0 0 0 0 0 0 0 0 0 0 0 0 0 0 -474.181 
692.083 0 0 -1692.33 0 1916.79 -464.873 0 0 -241.02 0 0 0 0 0 0 0 0 0.09 0 0 0 0 0 0 0 2197.87 0 0 0 0 0 0 0 0 0 1797.16 0 0 0 0 
0 0 0 0 0 0 0 0 0 224.387 0 0 0 0 0 1759.93 0 0 0 0.01 0 0 0 0 0 0 0 0 0 0 0 0 0 0 0 0 0 0 0 0 0 
-2345.12 0 0 1251.49 1547.98 0 0 0 0 0 0 0 0 0 0 1986.98 0 1897.56 0 0 0.01 0 0 0 0 -1753.97 1343.35 0 0 0 0 0 0 0 0 0 0 0 0 1480.99 0 
0 0 0 0 0 0 0 0 0 0 0 0 0 0 0 0 0 0 0 0 0 0.04 2468.87 0 0 0 0 0 0 0 0 0 0 0 0 0 0 0 0 0 0 
0 655.614 0 0 0 0 0 0 1671.73 0 0 0 0 0 0 0 0 -133.442 0 0 0 -1187.55 0.07 0 -1670.2 0 0 1836.07 0 0 0 0 0 0 0 0 0 0 0 0 0 
0 1885.97 0 0 0 0 0 0 0 0 0 0 0 -705.969 1257.9 0 391.781 0 0 0 0 0 0 0.04 0 0 0 0 0 0 0 0 0 0 0 0 0 0 0 0 0 
2326.81 0 0 0 0 0 0 -407.651 0 0 0 0 0 -2083.27 0 0 0 0 0 0 0 0 575.35 0 0.08 0 1903.82 0 0 268.029 0 0 0 851.848 0 0 0 0 -2385.25 0 0 
0 0 0 0 0 0 0 0 0 168.538 1965.01 0 1983.78 0 0 0 0 0 0 0 -1870.1 0 0 0 0 0.02 0 0 0 0 0 0 0 0 0 0 0 0 0 0 0 
0 0 2006.97 0 0 0 0 0 0 0 0 1450.77 334.407 0 0 154.5 0 0 1279.11 0 -795.999 0 0 0 2081.74 0 0.04 0 0 0 0 0 0 0 0 0 0 0 0 0 0 
0 0 0 0 0 0 1648.53 0 0 0 0 0 2015.21 0 0 0 0 0 0 0 0 0 2194.81 0 0 0 0 0 0 2377.32 0 0 0 0 0 0 0 0 0 0 0 
1409.42 0 0 -404.752 0 0 0 0 0 0 0 0 0 0 0 0 283.593 0 0 0 0 0 0 0 0 0 0 0 0.04 0 0 0 0 0 0 0 0 0 0 0 0 
1536.53 0 0 0 0 2029.1 0 0 0 0 0 0 0 0 0 0 830.79 0 0 0 0 0 0 0 -578.707 0 0 880.84 0 0.08 0 0 0 0 0 0 0 0 0 0 0 
774.941 0 0 0 0 0 0 0 0 0 0 0 0 0 0 0 0 0 0 0 0 0 0 0 0 0 0 0 0 0 0.01 0 0 0 0 0 0 0 0 0 0 
0 0 0 0 0 0 0 0 0 0 0 0 0 946.455 0 0 0 0 0 0 0 0 0 0 0 0 0 0 0 0 0 0.09 0 0 0 0 0 0 0 0 0 
0 0 0 0 0 0 0 0 0 0 0 0 0 0 0 1763.28 0 0 0 0 0 0 0 0 0 0 0 0 0 0 0 0 0.01 0 0 0 0 0 0 0 0 
0 0 0 0 0 0 0 0 0 0 0 0 0 0 0 0 0 0 0 0 0 0 0 0 1106.98 0 0 0 0 0 0 0 0 0.05 0 0 0 0 0 0 0 
2338.86 0 0 0 0 0 0 0 0 0 0 0 0 0 0 0 0 0 0 0 0 0 0 0 0 0 0 0 0 0 0 0 0 0 0.06 0 0 0 0 0 0 
0 0 0 0 0 0 0 0 0 0 489.898 0 0 0 0 0 0 0 0 0 0 0 0 0 0 0 0 0 0 0 0 0 0 0 0 0.06 0 0 0 0 0 
0 0 0 0 0 0 0 0 0 0 0 0 0 0 0 0 0 0 1326.72 0 0 0 0 0 0 0 0 0 0 0 0 0 0 0 0 0 0.08 0 0 0 0 
0 0 0 0 0 627.995 0 0 0 0 0 0 0 0 0 0 0 0 0 0 0 0 0 0 0 0 0 0 0 0 0 0 0 0 0 0 0 0.09 0 0 0 
0 0 0 0 0 0 0 0 0 0 0 0 0 0 0 0 0 0 0 0 0 0 0 0 1632.82 0 0 0 0 0 0 0 0 0 0 0 0 0 0.02 0 0 
0 0 0 0 0 0 0 0 0 0 0 0 0 0 0 0 0 0 0 0 2125.39 0 0 0 0 0 0 0 0 0 0 0 0 0 0 0 0 0 0 0.04 0 
0 0 0 0 0 0 0 0 0 0 0 0 0 0 0 0 0 877.941 0 0 0 0 0 0 0 0 0 0 0 0 0 0 0 0 0 0 0 0 0 0 0.07 
