*Vertices 46
*Matrix 
0.02 0 0 1393.09 -1743.45 0 -546.052 2112.26 -1497.77 0 0 0 0 0 0 0 0 -1749.09 0 0 0 0 0 0 1210.14 0 0 981.704 0 0 488.372 2128.59 0 0 994.522 252.007 2453.31 0 0 0 0 269.555 0 0 -1550.72 0 
0 0.07 0 -329.066 2000.26 0 224.693 0 -1400.27 0 0 0 0 -1025.8 0 0 0 0 1580.32 0 0 0 0 0 0 0 0 0 0 0 0 0 0 0 0 115.894 0 1580.94 0 0 1368.83 0 0 0 0 0 
0 0 0.05 0 0 0 0 0 0 2160.63 2084.49 0 0 0 0 0 1083.79 -1540.96 0 0 0 0 1916.79 789.132 0 0 0 0 0 0 -280.236 0 0 2426.76 0 -2109.82 -2109.52 -1646.4 -1985.31 0 0 -1754.89 0 773.263 0 0 
-1146.81 477.844 0 0.02 -787.149 0 0 0 0 0 0 -430.54 0 -993.759 -749.153 0 2227.93 0 0 0 0 2093.19 0 0 0 0 0 0 0 0 0 2268.67 0 2323.91 0 0 0 -792.489 0 0 0 0 0 60.6555 0 0 
292.291 1272.39 0 -1383.48 0.04 0 0 1679.51 1487.4 -325.556 676.977 0 0 0 1375.39 0 0 0 0 0 0 0 2173.15 0 0 0 0 798.746 0 -770.211 0 0 0 1382.41 0 -84.7652 2416.38 -964.156 0 1342.28 0 198.447 -2042.38 -1964.86 0 0 
0 0 0 0 0 0.07 0 0 0 0 813.852 1973.25 0 0 0 0 2289.73 0 -435.27 0 0 0 0 0 0 0 0 -212.027 2057.18 0 0 0 0 0 0 0 0 -2499.54 0 0 0 0 0 0 0 0 
392.85 806.986 0 0 0 0 0.05 0 0 0 0 0 0 0 0 0 2189.63 633.488 0 1175.34 -774.483 -38.377 -1781.44 0 -2124.16 0 -1782.82 0 0 0 0 -2144.31 1400.11 2295.83 1716.9 0 0 1263.7 0 -2303 0 0 0 0 0 0 
-1283.68 0 0 0 -131.458 0 0 0.08 0 0 0 -20.6763 -619.449 0 0 295.648 0 0 0 0 2180.62 -548.494 0 1237.75 0 -354.091 0 0 -1717.2 0 0 0 0 0 0 0 1171.22 348.75 0 1562.78 884.96 2175.13 0 0 2464.9 0 
1906.57 1122.24 0 0 1014.21 0 0 0 0.08 0 -373.775 -955.306 0 0 0 -676.519 0 0 -2228.54 0 0 0 -497.223 0 0 0 0 0 0 0 1039.23 2390.74 823.161 -341.731 0 640.202 0 0 0 0 0 0 397.122 498.291 1449.71 0 
0 0 -83.3918 0 1277.43 0 0 0 0 0.05 0 0 -2337.79 0 0 0 0 1512.88 0 0 0 0 0 -612.735 0 0 0 0 0 0 -430.387 0 1868.72 0 0 0 0 0 0 0 0 -1129.11 0 0 -124.134 0 
0 0 595.34 0 -1249.66 1604.74 0 0 2153 0 0.02 0 40.0555 0 0 0 0 0 -1063.8 1015.73 0 0 0 0 0 0 -1253.32 1919.39 0 -1977.83 0 0 1708.35 0 0 1396.91 -2000.87 0 0 -1795.48 0 0 0 0 0 0 
0 0 0 2342.98 0 1578.04 0 -2125.39 1651.13 0 0 0.04 2423.4 0 -946.608 0 0 1944.87 0 0 0 0 0 0 -1361.81 -1248.28 -570.62 0 0 1117.36 599.155 0 -1734.44 0 0 0 0 0 0 0 0 -158.315 1001.24 0 -2461.7 0 
0 0 0 0 0 0 0 261.773 0 1523.1 -2040.85 -844.218 0.02 0 0 0 0 0 0 0 0 0 0 0 2396.39 0 0 0 1852.09 0 0 0 0 -424.894 0 0 0 0 0 0 -1854.84 0 2343.29 0 0 0 
0 -11.3681 0 1457.64 0 0 0 0 0 0 0 0 0 0.09 0 0 0 0 0 1980.73 0 0 -1259.42 0 0 -2204.89 2070.6 0 0 -1825.54 0 0 0 0 0 0 1922.9 0 0 0 0 0 0 -1400.57 0 0 
0 0 0 1258.96 -610.904 0 0 0 0 0 0 2288.05 0 0 0 0 0 0 0 -916.7 0 0 0 -1071.89 838.267 0 0 -1035.57 0 0 0 0 0 0 242.241 2375.48 0 738.777 0 0 0 2480.62 0 0 1238.67 0 
0 0 0 0 0 0 0 -1051.59 255.364 0 0 0 0 0 0 0.07 0 0 1944.41 0 0 406.888 -1518.52 2362.36 -1168.94 1826.91 0 0 0 0 0 0 260.094 0 0 -162.74 0 -1688.97 0 0 0 0 0 511.414 0 0 
0 0 -2469.33 2226.4 0 1508.15 -1043.2 0 0 0 0 0 0 0 0 0 0.05 735.572 2321.62 0 0 0 0 0 0 0 0 0 1929.91 0 580.386 -1893.9 -163.198 0 0 0 0 0 0 0 0 -253.838 0 0 0 0 
37.1563 0 -1789.22 0 0 0 1446.2 0 0 500.58 0 -1780.37 0 0 0 0 1936.63 0.02 0 0 0 0 0 -1376 0 0 1668.22 0 0 0 -123.829 0 0 0 0 0 -166.402 0 0 0 0 0 0 0 2076.1 0 
0 459.838 0 0 0 1863.99 0 0 -1832.41 0 -933.79 0 0 0 0 -436.644 2448.27 0 0.02 0 0 1778.08 0 0 433.287 0 0 1598.03 0 0 0 0 -353.023 0 -2347.25 0 0 865.886 0 0 -1301.54 0 1859.11 0 0 0 
0 0 0 0 0 0 1779.15 0 0 0 -960.952 0 0 59.2822 -189.291 0 0 0 0 0.08 0 0 0 0 2366.63 0 0 2069.38 0 287.255 2084.8 0 -1383.48 0 178.762 0 1544.62 0 0 0 0 0 194.784 0 0 0 
0 0 0 0 0 0 -919.752 -2300.1 0 0 0 0 0 0 0 0 0 0 0 0 0.01 0 0 1815.62 0 2187.8 0 0 1715.67 0 0 0 0 0 0 1051.44 0 0 1380.43 0 -2281.03 0 0 0 0 0 
0 0 0 1160.39 0 0 750.069 -1071.43 0 0 0 0 0 0 0 1575.59 0 0 339.9 0 0 0.07 0 1416.44 0 0 1401.64 0 -771.279 0 -2064.65 -2483.06 0 0 0 0 0 0 1599.86 -500.275 0 2274.47 207.602 0 1325.34 0 
0 0 -1401.79 0 -1854.38 0 1632.36 0 -1732.61 0 0 0 0 -1955.24 0 114.673 0 0 0 0 0 0 0.04 1935.26 0 0 0 0 111.011 999.863 2416.99 0 0 0 0 200.888 0 0 2217.4 909.528 0 0 0 -1287.65 0 0 
0 0 29.2215 0 0 0 0 749.458 0 1511.66 0 0 0 0 2496.49 1793.34 0 -1753.67 0 0 -2056.57 1524.63 2300.1 0.01 -1396.3 0 0 0 0 0 0 -2045.73 0 0 0 2324.06 0 0 825.144 0 0 0 0 -917.005 0 0 
2199.55 0 0 0 0 0 259.941 0 0 0 0 -1952.96 2351.99 0 -1578.8 1313.29 0 0 1291.47 150.685 0 0 0 93.9207 0.07 477.233 1310.85 0 0 0 0 0 0 0 0 0 1166.34 0 0 0 0 0 0 0 0 0 
0 0 0 0 0 0 0 1855.6 0 0 0 1699.65 0 1419.19 0 1696.45 0 0 0 0 -1464.35 0 0 0 -114.978 0.02 0 0 0 1843.55 0 0 -635.624 0 0 -2370.14 0 0 -1632.05 0 0 2002.85 0 0 0 0 
0 0 0 0 0 0 1929 0 0 0 1227.53 520.264 0 871.38 0 0 0 -244.377 0 0 0 -2306.82 0 0 1213.49 0 0 1303.06 0 0 0 0 0 0 748.695 -884.655 839.183 797.983 -398.495 0 -1523.87 -923.719 0 0 0 0 
47.5326 0 0 0 -1657.84 -703.986 0 0 0 0 963.546 0 0 0 -893.048 0 0 0 -1833.02 2351.83 0 0 0 0 0 0 1656.16 0.05 -1662.88 1694.62 1066.7 -64.3178 0 0 0 0 0 1503.57 0 -978.042 0 -450.072 2498.17 -1159.32 0 0 
0 0 0 0 0 -194.174 0 1749.4 0 0 0 0 506.684 0 0 0 -351.65 0 0 0 1121.48 -613.498 1475.49 0 0 0 0 1461.46 0 0 0 0 0 0 0 0 0 -1756.87 -2021.47 1557.59 0 0 0 0 0 0 
0 0 0 0 -2341.91 0 0 0 0 0 97.2777 2268.82 0 2402.65 0 0 0 0 0 1368.37 0 0 1589.79 0 0 2003.46 0 -639.286 0 0.04 0 0 0 0 0 0 0 0 0 0 0 1916.49 0 0 0 0 
38.2244 0 2456.05 0 0 0 0 0 723.212 1668.07 0 2030.32 0 0 0 0 303.888 -685.827 0 -1304.59 0 -1917.55 -1425.14 0 0 0 0 2170.25 0 0 0.09 89.1903 0 0 0 0 0 0 0 -620.06 0 0 0 0 0 2419.43 
521.485 0 0 2170.71 0 0 2415.16 0 848.186 0 0 0 0 0 0 0 292.444 0 0 0 0 1877.73 0 -1528.44 0 0 0 1947.92 0 0 -1307.49 0.09 -771.432 0 725.959 1568.73 0 0 0 0 0 0 0 0 0 0 
0 0 0 0 0 0 -1814.55 0 -748.695 1648.38 2189.63 2292.02 0 0 0 2306.67 251.396 0 199.973 852.763 0 0 0 0 0 -1590.55 0 0 0 0 0 -1717.35 0.05 0 0 -1358.3 -2110.28 0 1417.51 0 0 0 0 -2295.07 0 -105.67 
0 0 -308.618 -435.118 2390.29 0 266.961 0 408.261 0 0 0 -53.0259 0 0 0 0 0 0 0 0 0 0 0 0 0 0 0 0 0 0 0 0 0.01 746.101 -1859.57 1631.6 1942.27 0 0 0 353.786 0 0 0 2356.41 
2355.49 0 0 0 0 0 -2235.1 0 0 0 0 0 0 0 -1432.77 0 0 0 2192.83 1003.83 0 0 0 0 0 0 757.393 0 0 0 0 63.2496 0 2259.21 0.08 -447.02 517.67 0 0 0 0 0 0 0 0 0 
-2446.13 973.312 1901.23 0 -1508.45 0 0 0 585.879 0 -2189.47 0 0 0 2211.91 -1342.59 0 0 0 0 -1275.14 0 1913.59 876.263 0 545.289 2363.73 0 0 0 0 -541.017 -974.99 454.192 -306.787 0.01 2413.02 346.767 0 0 -1432.16 0 0 0 0 0 
43.5652 0 -1288.72 0 346.767 0 0 568.636 0 0 -593.661 0 0 1384.85 0 0 0 1863.99 0 1136.89 0 0 0 0 2379.76 0 -1807.23 0 0 0 0 0 548.799 -2066.64 2216.33 325.861 0.06 -1224.33 0 767.159 -2279.2 0 0 0 0 0 
0 603.275 -1583.83 1267.05 1575.14 1422.09 1477.78 1240.96 0 0 0 0 0 0 2324.82 2458.65 0 0 1396.76 0 0 0 0 0 0 0 1342.28 1368.07 -362.331 0 0 0 0 2253.72 0 -2050.92 339.747 0.01 0 0 0 0 0 0 2430.27 0 
0 0 930.28 0 0 0 0 0 0 0 0 0 0 0 0 0 0 0 0 0 212.485 -2343.59 894.269 2304.99 0 1246.3 702.612 0 1159.78 0 0 0 1205.71 0 0 0 0 0 0.04 0 0 -2052.75 0 0 0 823.771 
0 0 0 0 1096.3 0 299.31 1585.82 0 0 1979.96 0 0 0 0 0 0 0 0 0 0 -261.467 -29.8318 0 0 0 0 2201.38 -248.65 0 1414.76 0 0 0 0 0 1164.05 0 0 0.02 0 0 0 0 0 0 
0 437.864 0 0 0 0 0 1477.63 0 0 0 0 -1397.52 0 0 0 0 0 -833.079 0 957.137 0 0 0 0 0 -1686.68 0 0 0 0 0 0 0 0 -340.815 706.427 0 0 0 0.02 2475.13 0 -760.75 0 0 
2366.02 0 1610.84 0 1723.46 0 0 -56.6881 0 -2164.14 0 2415.31 0 0 -1905.8 0 2259.97 0 0 0 0 -1675.54 0 0 0 132.832 1101.18 -1051.44 0 1973.25 0 0 0 1149.4 0 0 0 0 106.128 0 602.664 0.01 0 0 0 0 
0 0 0 0 -139.393 0 0 0 334.864 0 0 369.961 1586.89 0 0 0 0 0 1718.12 2007.89 0 1848.58 0 0 0 0 0 -1256.07 0 0 0 0 0 0 0 0 0 0 0 0 0 0 0.08 0 0 0 
0 0 1109.88 669.042 -940.046 0 0 0 2016.59 0 0 0 0 1841.87 0 -259.789 0 0 0 0 0 0 -1039.99 1373.1 0 0 0 -460.753 0 0 0 0 1436.58 0 0 0 0 0 0 0 -114.368 0 0 0.04 0 0 
-292.901 0 0 0 0 0 0 2225.03 1169.7 -1541.11 0 1573.46 0 0 1037.25 0 0 -1335.11 0 0 0 1075.55 0 0 0 0 0 0 0 0 0 0 0 0 0 0 0 2486.88 0 0 0 0 0 0 0.01 0 
0 0 0 0 0 0 0 0 0 0 0 0 0 0 0 0 0 0 0 0 0 0 0 0 0 0 0 0 0 0 -1178.55 0 1994.61 -704.749 0 0 0 0 150.838 0 0 0 0 0 0 0.02 
