*Vertices 65
*Matrix 
0.03 0 0 0 0 537.66 0 0 0 0 0 0 1863.08 0 0 0 0 681.249 0 0 0 0 0 0 -1925.18 0 0 0 0 0 0 0 0 0 0 0 0 0 0 0 0 -659.734 0 0 0 -496.918 0 0 0 0 0 0 132.069 0 1207.24 168.844 0 0 0 0 0 0 0 0 0 
0 0.06 0 1029.92 1397.52 1081.19 0 0 0 2184.9 2088.61 0 0 0 0 -1228.14 0 1976.3 0 0 0 0 -864.971 -1657.38 1416.75 0 0 0 0 0 0 0 0 0 0 0 -136.952 0 -1276.06 0 0 0 1658.45 0 0 0 0 0 0 -1008.71 0 0 0 0 -88.8852 0 0 494.629 0 -1073.72 1844.31 0 0 0 -2383.57 
0 0 0.08 -1319.09 0 0 -413.755 -992.233 0 0 0 301.294 -33.0363 -882.672 0 1537.6 0 0 2278.59 0 0 0 1865.21 0 0 2100.05 0 0 0 0 0 0 622.501 452.971 0 0 0 0 0 0 2144.76 2125.84 0 880.84 0 0 607.852 0 0 0 -1003.83 1471.07 0 0 1205.86 0 0 0 0 0 0 0 0 0 -1114.46 
0 1466.03 1106.07 0.07 0 0 0 0 -1141.62 0 0 0 -216.147 0 0 963.546 0 0 0 0 0 2481.54 680.639 0 542.085 0 2156.21 0 -2476.35 0 0 1381.34 0 0 0 0 0 -80.34 0 0 1970.81 0 0 0 0 0 0 557.192 -1791.82 0 2080.68 0 0 -2266.23 548.036 1049.91 0 0 0 459.838 0 0 0 1106.68 0 
0 -659.276 0 0 0.04 0 0 0 0 -1869.64 -497.07 0 1697.36 0 0 0 1297.11 1138.26 0 0 1847.36 -980.941 0 1868.27 0 1582.61 2256.61 -1997.67 0 -1175.19 0 2210.38 0 0 1856.06 0 1858.2 0 0 0 0 0 0 -2384.33 0 0 0 0 0 0 0 0 0 0 -1001.08 -843.455 0 0 0 0 0 0 0 0 0 
248.802 48.2955 0 0 0 0.06 0 0 0 0 0 1921.83 0 -583.59 -1030.53 822.245 0 0 0 0 0 -107.196 0 0 0 0 -2205.04 0 0 1489.99 113.91 716.651 62.1815 0 0 0 0 0 0 -1599.7 0 0 0 0 0 0 -795.846 -1217 10.9104 -104.45 1961.35 0 0 0 0 0 0 0 0 0 0 0 0 -1169.85 0 
0 0 -1421.48 0 0 0 0.01 -1695.68 2033.52 0 0 1428.5 0 1918.93 -128.101 -568.026 632.267 0 -1751.99 0 0 2096.85 1033.59 0 270.775 0 0 0 492.035 0 0 0 0 0 -464.568 0 -335.017 0 0 0 0 0 0 -829.722 0 0 0 1605.81 0 0 0 0 0 0 0 -1859.26 0 0 0 0 0 0 0 0 0 
0 0 993.759 0 0 0 1906.26 0.01 0 0 0 0 2283.17 -1490.75 0 2036.73 0 0 0 -2330.77 1089.13 -2411.04 0 0 0 0 0 0 0 0 0 0 0 0 0 0 0 2468.11 0 0 0 0 -1125.75 2375.94 -777.993 0 1209.68 2048.63 0 0 0 0 0 0 0 0 0 0 0 0 0 0 0 0 0 
0 0 0 2186.42 0 0 -296.564 0 0.04 0 533.692 -333.186 0 0 0 0 0 0 0 0 -1695.23 0 -877.331 1757.33 0 0 0 0 0 151.448 0 852 0 206.229 0 1042.89 0 0 0 670.415 388.73 0 0 0 0 2415.92 0 0 0 0 0 0 -435.27 -1896.19 -764.26 0 -966.445 742.592 156.484 0 0 0 0 0 0 
0 1602.91 0 0 2267.3 0 0 0 0 0.02 674.841 0 0 0 0 2230.37 0 0 -309.534 0 0 0 0 0 0 0 0 0 0 2148.27 0 0 0 -1758.55 0 0 0 0 0 0 -531.556 0 0 0 0 0 0 -1715.67 -1713.23 0 0 0 2227.62 -1178.55 1530.58 0 0 0 0 0 1321.22 0 0 -2031.24 0 
0 -918.836 0 0 2160.48 0 0 0 561.617 -1738.87 0.01 0 1706.52 0 0 0 0 0 1471.83 0 570.009 0 0 0 0 0 0 0 0 0 614.719 0 0 0 0 0 0 0 -1221.58 0 0 0 0 -611.515 0 0 0 -916.852 0 0 0 1838.51 0 975.753 0 0 -2221.98 -2474.36 2050 0 0 1663.64 0 0 0 
0 0 1456.42 0 0 2160.63 676.366 0 637.761 0 0 0.02 717.872 0 0 0 0 0 0 -968.276 0 0 0 0 0 0 0 2158.35 1324.27 0 0 0 0 0 0 0 0 276.727 0 0 0 0 977.737 0 0 -2400.81 -2261.65 0 1934.03 0 -376.522 0 0 876.263 -851.543 0 -1291.31 0 0 0 0 0 0 0 0 
-24.3385 0 -2425.53 682.775 610.446 0 0 1876.96 0 0 1249.5 -950.575 0.05 645.543 0 1241.42 0 0 0 0 0 0 0 0 0 -1339.23 11.9785 -237.358 2301.93 -1581.7 0 0 0 1413.85 1577.27 0 0 0 0 0 0 0 746.864 -1868.72 0 0 0 -707.343 0 0 0 132.832 0 0 656.377 1802.96 0 -2037.19 982.162 0 0 0 0 0 0 
0 0 1137.2 0 0 -1104.24 1635.87 -1743.14 0 0 0 0 1898.18 0.05 0 0 0 0 0 0 0 0 0 0 0 0 0 0 0 0 0 -2264.09 0 0 0 0 2496.49 539.491 0 -2454.22 0 0 830.332 0 0 0 1253.93 0 0 0 -1981.19 0 2084.49 2028.34 0 0 0 0 0 0 0 0 0 0 0 
0 0 0 0 0 1720.71 1856.52 0 0 0 0 0 0 0 0.05 0 0 0 -1973.4 0 1125.29 0 0 -963.851 0 0 0 0 0 0 0 0 0 0 0 0 -674.23 0 0 0 0 0 -213.858 2441.1 2218.31 0 2222.43 1857.13 0 0 0 -1280.79 -1993.85 0 0 0 0 0 0 0 0 1827.37 0 0 0 
0 969.497 -1864.3 2057.63 0 2200 758.766 815.073 0 -1358.61 0 0 1322.6 0 0 0.07 0 1374.02 -1258.66 -619.449 0 -658.971 0 0 771.432 856.578 0 0 1999.95 0 2378.69 0 0 0 -1323.05 0 0 0 0 0 1901.07 -2124.32 -1258.35 0 0 0 0 1598.33 0 2493.9 -2039.78 1820.51 0 0 -2290.49 0 1127.74 0 0 0 0 0 0 0 0 
0 0 0 0 2431.64 0 1516.08 0 0 0 0 0 0 0 0 0 0.05 -666.143 0 1931.59 0 0 0 -2478.03 0 0 0 364.925 0 0 0 0 -244.682 1245.84 0 0 1682.87 0 0 0 0 -989.334 0 -954.543 0 1880.63 0 294.275 0 0 455.565 0 0 0 0 0 0 0 0 0 0 0 0 0 0 
916.852 1810.43 0 0 -1298.79 0 0 0 0 0 0 0 0 0 0 -1670.35 437.864 0.04 0 0 0 0 0 187.002 0 0 0 1910.23 1147.88 0 0 0 0 69.5059 0 0 0 -1238.67 -568.026 2205.04 0 0 0 0 0 1744.51 0 0 0 0 0 0 0 0 0 0 0 0 0 0 0 0 0 0 0 
0 0 1104.85 0 0 0 282.372 0 0 2303.16 1880.02 0 0 0 -1536.23 2017.81 0 0 0.09 0 0 0 2214.35 0 0 1902.3 0 0 1249.05 0 0 0 0 0 -1586.73 0 0 0 0 0 0 0 0 0 0 0 0 0 -965.072 1077.99 0 0 0 0 0 0 0 0 0 0 0 0 0 0 0 
0 0 0 0 0 0 0 -1583.68 0 0 0 1709.11 0 0 0 1322.14 78.2037 0 0 0.07 0 0 0 -415.586 0 0 0 1475.34 0 2283.32 0 0 1946.55 0 0 0 0 0 0 0 0 0 0 0 0 -1609.93 -873.211 0 0 0 -1784.04 0 0 1700.72 0 0 0 0 0 0 0 0 0 0 -360.958 
0 0 0 0 854.442 0 0 2028.49 1223.26 0 1812.72 0 0 0 747.475 0 0 0 0 0 0.06 1665.93 0 0 629.978 0 822.398 -518.281 0 0 0 -1268.73 -1572.54 0 0 0 0 959.731 0 1612.67 0 0 0 -424.131 1259.12 0 0 0 0 0 0 0 0 2287.59 0 2135.15 0 0 0 0 0 0 2353.05 -138.325 0 
0 0 0 2234.34 1538.51 517.365 715.583 -141.53 0 0 0 0 0 0 0 -778.909 0 0 0 0 -893.963 0.05 0 0 0 0 0 0 1467.71 0 0 0 0 0 0 0 0 2005.45 -526.368 0 0 -1108.05 0 -2363.12 0 -2445.98 0 0 0 1668.52 0 0 -2237.08 2462.16 0 770.821 0 0 0 0 -807.443 0 0 0 0 
0 -2214.8 1758.86 1176.72 0 0 2433.62 0 1699.35 0 0 0 0 0 0 0 0 0 538.575 0 0 0 0.02 0 0 0 2309.41 -543.764 -269.402 -765.175 0 0 645.695 0 0 0 0 0 1690.5 -1562.93 0 0 0 -173.574 0 999.1 -1173.97 0 0 579.928 0 0 0 0 0 1171.68 0 0 0 0 0 0 0 333.338 0 
0 1149.71 0 0 2010.64 0 0 0 2154.23 0 0 0 0 0 -987.808 0 -2218.16 1513.49 0 985.214 0 0 0 0.07 -989.334 1992.63 0 -271.996 -627.232 0 0 0 0 0 972.701 0 0 0 0 0 0 0 0 0 0 0 0 0 1963.03 1716.13 -1833.32 -2175.44 1911.45 0 0 0 0 0 0 2319.94 0 0 0 1640.14 0 
2083.88 640.66 0 -1675.54 0 0 -923.719 0 0 0 0 0 0 0 0 -824.229 0 0 0 0 -25.8644 0 0 1780.07 0.06 0 1504.64 0 0 0 0 0 0 0 2075.03 0 0 0 -2334.13 1578.49 427.793 -2393.34 0 0 0 1410.64 0 0 0 0 2244.25 0 -757.393 1056.93 0 0 0 -1811.35 0 0 -1086.99 0 0 0 0 
0 0 -1088.06 0 1789.53 0 0 0 0 0 0 0 1556.67 0 0 -659.276 0 0 -69.6585 0 0 0 0 228.813 0 0.05 2080.07 0 0 0 -1574.22 0 0 0 1133.53 0 0 1384.55 0 0 0 0 0 0 1940.44 0 2476.81 0 0 0 0 0 0 0 0 0 1417.36 0 0 2238.91 -1281.4 -1761.6 0 0 0 
0 0 0 -2030.47 -2059.16 -564.821 0 0 0 0 0 0 590.915 0 0 0 0 0 0 0 1508.91 0 997.726 0 774.331 323.725 0 0 -2001.79 0 948.134 0 2160.33 -1424.07 0 0 0 0 0 817.362 0 0 0 2383.72 -1234.4 -1551.94 0 995.895 0 0 -852 789.285 0 30.5948 237.815 0 1840.65 0 0 0 0 0 0 0 0 
0 0 0 0 2277.98 0 0 0 0 0 0 768.38 -1786.94 0 0 0 -692.389 1465.42 0 -870.159 922.803 0 1208.61 -671.484 0 0 0 0.07 0 -2254.48 0 0 0 -691.321 0 0 1127.28 0 0 -981.857 2415.77 0 0 0 -286.34 -731.452 0 -1103.47 0 -354.549 0 0 0 0 0 0 0 0 0 0 0 0 0 0 0 
0 0 0 -1517.46 0 0 488.067 0 0 0 0 551.698 1832.26 0 0 -47.6852 0 1918.78 -2468.26 0 0 -1038.01 689.642 -615.024 0 0 2361.14 0 0 238.578 0 0 0 0 0 0 270.47 0 1507.08 0 0 0 0 1331.29 0 0 0 0 0 1841.87 0 0 0 -961.715 0 0 0 0 0 0 0 0 0 0 0 
0 0 0 0 -2454.07 -2142.17 0 0 1223.56 931.806 0 0 -1734.14 0 0 0 0 0 0 441.527 0 0 2272.48 0 0 0 0 -2364.35 -1225.24 0.03 0 2177.42 0 0 2337.18 -1071.28 0 0 0 0 0 30.5948 2043.9 0 0 -288.324 0 0 0 -717.566 2362.21 0 0 0 0 1766.64 -1391.72 0 2221.37 0 0 0 0 2315.52 0 
0 0 0 0 0 1635.26 0 0 0 0 1923.96 0 0 0 0 -2020.86 0 0 0 0 0 0 0 0 0 -862.072 -1761.91 0 0 0 0.06 0 2434.69 0 1025.8 0 369.503 2159.26 1448.79 0 0 1392.79 0 -2265.77 -645.543 0 2229.15 0 -295.19 1203.73 0 0 0 0 0 2330.01 0 1463.74 0 0 0 0 0 0 0 
0 0 0 364.467 101.856 193.716 0 0 -2277.21 0 0 0 0 1473.36 0 0 0 0 0 0 836.436 0 0 0 0 0 0 0 0 -61.5711 0 0.06 -865.276 2133.17 0 0 0 0 0 0 0 0 1259.12 0 0 0 1144.06 -1342.28 0 0 0 0 0 0 1448.33 0 0 0 0 0 -460.601 -2124.77 1160.39 0 0 
0 0 -211.112 0 0 -1288.26 0 0 0 0 0 0 0 0 0 0 757.393 0 0 1628.7 -229.881 0 -1185.11 0 0 0 -683.844 0 0 0 2144.76 2355.19 0.08 0 0 2232.35 1097.98 0 0 0 0 0 0 583.743 0 0 0 1204.79 0 348.445 0 0 0 0 0 -1857.43 -786.538 0 0 0 0 0 0 0 0 
0 0 224.845 0 0 0 0 0 1818.98 -2234.64 0 0 1596.96 0 0 0 -575.045 -269.707 0 0 0 0 0 0 0 0 1295.74 -425.352 0 0 0 2447.81 0 0.09 0 -1966.23 0 0 0 0 0 0 881.146 0 0 0 0 0 0 -327.54 0 0 0 0 0 0 817.362 0 0 0 0 0 0 0 0 
0 0 0 0 982.315 0 1944.41 0 0 0 0 0 2220.45 0 0 1362.27 0 0 1074.79 0 0 0 0 -181.356 -1908.09 1922.74 0 0 0 -293.207 1678.59 0 0 0 0.09 0 -835.521 2285.45 21.5918 -2306.36 0 -1679.51 0 619.144 0 502.411 2139.12 -538.575 0 -1652.2 0 0 0 0 1391.42 0 -2404.17 0 0 0 0 0 0 0 0 
0 0 0 0 0 0 0 0 2003.62 0 0 0 0 0 0 0 0 0 0 0 0 0 0 0 0 0 0 0 0 93.4629 0 0 1722.24 2022.39 0 0.07 0 0 0 0 1345.48 0 0 -450.682 0 0 0 0 0 0 0 -304.346 0 0 0 308.313 888.165 0 0 0 0 -927.686 0 2156.82 0 
0 1792.43 0 0 1237.14 0 1517 0 0 0 0 0 0 2351.37 -87.9696 0 -1270.26 0 0 0 0 0 0 0 0 0 0 1426.66 2403.41 0 1027.48 0 -490.051 0 1007.64 0 0.07 0 0 2034.59 1374.78 0 -375.759 0 -2098.53 0 -1211.2 0 0 0 0 0 0 -1981.34 -142.903 0 2111.8 0 0 -1831.34 0 0 -2302.55 0 0 
0 0 0 232.627 0 0 0 1976.3 0 0 0 2109.06 0 -1432.46 0 0 0 1067 0 0 125.355 161.672 0 0 0 1826 0 0 0 0 8.62148 0 0 0 -1379.36 0 0 0.09 0 0 0 0 1876.35 0 0 0 861.309 0 0 -1654.03 0 0 1431.24 0 0 1185.87 0 1110.03 0 0 0 0 1418.27 0 0 
0 -16.4037 0 0 0 0 0 0 0 0 1838.51 0 0 0 0 0 0 1234.4 0 0 0 920.057 2440.03 0 1560.34 0 0 0 1135.36 0 1512.27 0 0 0 -2397.92 0 0 0 0.03 -182.119 0 0 0 0 0 0 0 -514.313 0 0 0 0 0 0 0 2184.29 0 0 0 0 0 1942.27 0 0 0 
0 0 0 0 0 1839.58 0 0 -743.812 0 0 0 0 -1652.35 0 0 0 1265.68 0 0 2324.67 0 1021.07 0 1849.04 0 -862.224 -1123.46 0 0 0 0 0 0 834.452 0 -282.067 0 1305.96 0.05 0 0 -672.704 2470.24 0 1990.34 0 0 0 0 1916.18 0 -218.894 0 0 337.001 0 0 0 0 0 0 0 0 0 
0 0 478.149 2031.54 0 0 0 0 -1979.96 1955.09 0 0 0 0 0 -776.009 0 0 0 0 0 0 0 0 1501.13 0 0 1016.95 0 0 0 0 0 0 0 -1167.87 1874.83 0 0 0 0.09 0 0 0 0 0 0 0 0 -1960.89 1205.71 0 0 0 0 0 0 0 0 0 0 0 1081.5 0 0 
1243.55 0 1961.81 0 0 0 0 0 0 0 0 0 0 0 0 -1665.17 1107.9 0 0 0 0 2313.38 0 0 1880.32 0 0 0 0 -1453.98 -2235.1 0 0 0 1986.98 0 0 0 0 0 0 0.04 0 344.02 0 0 -39.4452 0 0 1104.24 0 0 0 325.709 0 0 1528.6 0 0 0 0 0 0 0 -1153.68 
0 897.015 0 0 0 0 0 2222.13 0 0 0 -879.62 572.298 -885.418 2220.91 1236.23 0 0 0 0 0 0 0 0 0 0 0 0 0 166.402 0 -1752.3 0 343.715 0 0 2372.28 1497.31 0 -2033.52 0 0 0.06 0 0 246.361 1349.6 0 0 -258.568 0 -1496.7 0 692.389 0 0 0 0 0 0 0 0 0 0 0 
0 0 -2388.61 0 -427.335 0 994.827 91.937 0 0 2052.9 0 -1416.9 0 1714 0 1170.92 0 0 0 248.039 2413.48 -223.472 0 0 0 -1263.54 0 -1393.86 0 1817.61 0 -243.309 0 -2139.12 2130.88 0 0 0 -1912.21 0 954.237 0 0.08 0 0 0 0 2483.06 573.061 0 0 0 0 0 0 0 0 2086.47 0 -1507.54 0 0 1858.81 0 
0 0 0 0 0 0 0 1243.4 0 0 0 0 0 0 -354.549 0 0 0 0 0 59.4348 0 0 0 0 -307.55 -32.5785 1894.82 0 0 289.239 0 0 0 0 0 2284.08 0 0 0 0 0 0 0 0.02 0 0 -1552.25 1230.28 0 0 0 1578.04 0 0 0 -1143.15 0 0 0 -1508.76 0 -2393.19 0 0 
58.0615 0 0 0 0 0 0 0 2377.47 0 0 975.6 0 0 0 0 -1674.02 824.381 0 -1304.13 0 -1178.55 -2103.87 0 2191.76 0 -1361.51 1863.38 0 -1829.2 0 0 0 0 1326.41 0 0 0 0 2463.38 0 0 -235.069 0 0 0.04 0 535.524 0 0 0 940.352 0 2464.29 0 0 0 1114.92 1013.6 0 0 0 0 0 0 
0 0 -564.211 0 0 -338.679 0 180.746 0 0 0 -13.8096 0 1905.04 -726.112 0 0 0 0 1750.62 0 0 411.771 0 0 1080.89 0 0 0 0 -2275.99 415.433 0 0 -2189.32 0 2425.08 1743.6 0 0 0 1066.39 -1621.98 0 0 0 0.06 0 0 2093.04 0 0 0 0 0 1059.68 0 0 0 0 0 -373.012 1506.78 0 0 
0 0 0 -1553.01 0 2111.5 -700.781 -1179.31 0 875.652 1324.27 0 1076.62 0 690.1 -309.229 2480.77 0 0 0 0 0 0 0 0 0 -1636.17 2140.49 0 0 0 1499.45 1273 0 -1540.65 0 0 0 27.0852 0 0 0 0 0 1207.54 857.952 0 0.05 -2000.56 0 0 0 733.436 0 0 0 0 0 -1294.06 0 0 0 0 0 0 
0 0 0 225.455 0 1768.32 0 0 0 1153.68 0 260.094 0 0 0 0 0 0 -483.489 0 0 0 0 441.984 0 0 0 0 0 0 2359 0 0 0 0 0 0 0 0 0 0 0 0 -1543.86 -1202.2 0 0 -1593.6 0.04 0 0 0 0 1355.25 0 -514.466 0 0 0 0 0 0 0 0 0 
0 1174.43 0 0 0 -149.312 0 0 0 0 0 0 0 0 0 1056.17 0 0 -1230.89 0 0 -543.153 1864.6 535.371 0 0 0 1433.68 -2158.96 1366.54 -2003.01 0 -1263.24 -217.368 388.577 0 0 -1879.1 0 0 574.129 -756.783 -981.399 398.343 0 0 718.177 0 0 0.08 0 1030.69 0 0 1303.83 1207.24 0 0 0 0 0 0 0 0 0 
0 0 -1920.45 907.086 0 1321.68 0 0 0 0 0 -745.186 0 1383.48 0 797.678 702.155 0 0 -606.479 0 0 0 -125.355 -368.892 0 1381.5 0 0 -507.447 0 0 0 0 0 0 0 0 0 -1667 1577.12 0 0 0 0 0 0 0 0 0 0.03 0 0 0 -143.818 1664.1 0 0 0 0 2234.34 1818.98 0 0 0 
0 0 113.453 0 0 0 0 0 0 0 -35.6304 0 -982.009 0 116.504 2002.7 0 0 0 0 0 0 0 1162.22 0 0 1732.92 0 0 0 0 0 0 0 0 626.926 0 0 0 0 0 0 -746.712 0 0 2226.1 0 0 0 -1189.23 0 0.05 0 0 0 0 -214.316 0 0 0 0 0 0 0 0 
1888.26 0 0 0 0 0 0 0 -2009.41 1864.15 0 0 0 2314.6 -2091.51 0 0 0 0 0 0 -1083.18 0 1887.04 1419.95 0 0 0 0 0 0 0 0 0 0 0 0 -1609.01 0 319.758 0 0 0 0 1543.24 0 0 138.478 0 0 0 0 0.08 0 -279.626 1676.76 -2416.38 2492.83 0 0 0 0 0 0 0 
0 0 0 1269.34 0 0 0 0 2463.99 -1853.16 889.843 -342.036 0 2298.12 0 0 0 0 0 1516.69 1801.43 1955.09 0 0 -665.075 0 1468.47 0 2278.59 0 0 0 0 0 0 0 -826.06 0 0 0 0 -371.334 -1372.19 0 0 2250.82 0 0 -898.389 0 0 0 0 0.03 2138.66 0 0 0 0 1810.74 0 0 0 0 0 
1299.55 -1103.17 -563.143 536.134 -2188.71 0 0 0 -1436.89 2049.55 0 1285.06 -94.6837 0 0 1348.08 0 0 0 0 0 0 0 0 0 0 2155.45 0 0 0 0 721.076 0 0 1996.6 0 -1638.92 0 0 0 0 0 0 0 0 0 0 0 0 1896.8 2191.46 0 -1118.12 1252.25 0.04 -2135.15 0 0 0 0 0 0 0 0 0 
585.421 0 0 2238.3 2306.21 0 -1492.89 0 0 0 0 0 1983.17 0 0 0 0 0 0 0 121.998 1661.96 -523.011 0 0 0 0 0 0 1785.41 691.931 0 -1884.29 0 0 924.024 0 2467.04 -417.57 1034.2 0 0 0 0 0 0 -1341.52 0 1637.24 659.429 -1287.19 0 -1815.01 0 -60.3504 0.05 0 0 0 0 0 0 0 0 0 
0 0 0 0 0 0 0 0 128.864 0 1760.69 1581.24 0 0 0 2079.45 0 0 0 0 0 0 0 0 0 1351.74 760.445 0 0 67.217 0 0 -1570.56 -864.513 -1933.58 2001.17 -1326.26 0 0 0 0 -1102.25 0 0 -1014.21 0 0 0 0 0 0 1210.9 -625.553 0 0 0 0.07 0 0 0 0 0 0 0 0 
0 -1261.71 0 0 0 0 0 0 -1456.88 0 2104.48 0 -527.131 0 0 0 0 0 0 0 0 0 0 0 1435.06 0 0 0 0 0 -18.9978 0 0 0 0 0 0 2103.26 0 0 0 0 0 0 0 -2419.43 0 0 0 0 0 0 1086.38 0 0 0 0 0.05 0 0 0 0 0 0 0 
0 0 0 0 0 0 0 0 1966.23 0 1694.16 0 -595.187 0 0 0 0 0 0 0 0 0 0 0 0 0 0 0 0 2314.91 0 0 0 0 0 0 0 0 0 0 0 0 0 665.99 0 -281.457 0 454.65 0 0 0 0 0 0 0 0 0 0 0.04 0 0 0 0 -498.444 372.097 
0 -349.818 0 2124.62 0 0 0 0 0 0 0 0 0 0 0 0 0 0 0 0 0 0 0 1517.15 0 -908.307 0 0 0 0 0 0 0 0 0 0 878.857 0 0 0 0 0 0 0 0 0 0 0 0 0 0 0 0 -605.716 0 0 0 0 0 0 0 0 0 0 402.005 
0 1722.39 0 0 0 0 0 0 0 381.863 0 0 0 0 0 0 0 0 0 0 0 -1150.32 0 0 1579.71 -1687.6 0 0 0 0 0 -15.3356 0 0 0 0 0 0 0 0 0 0 0 358.974 -1120.26 0 0 0 0 0 253.075 0 0 0 0 0 0 0 0 0 0.02 0 0 500.427 0 
0 0 0 0 0 0 0 0 0 0 -268.944 0 0 0 1262.02 0 0 0 0 0 0 0 0 0 0 2024.83 0 0 0 0 0 143.056 0 0 0 1551.33 0 0 -1365.93 0 0 0 0 0 0 0 486.389 0 0 0 754.952 0 0 0 0 0 0 0 0 0 0 0.03 0 0 0 
0 0 0 0 0 0 0 0 0 0 0 0 0 0 0 0 0 0 0 0 300.378 0 0 0 0 0 0 0 0 0 0 1936.02 0 0 0 0 1699.04 -1011.46 0 0 802.408 0 0 0 1605.96 0 -423.063 0 0 0 0 0 0 0 0 0 0 0 0 0 0 0 0.06 0 0 
0 0 0 -629.215 0 1438.11 0 0 0 -2164.14 0 0 0 0 0 0 0 0 0 0 2238.46 0 1306.57 1112.48 0 0 0 0 0 -664.006 0 0 0 0 0 -1470 0 0 0 0 0 0 0 1277.12 0 0 0 0 0 0 0 0 0 0 0 0 0 0 1233.18 0 -2459.26 0 0 0.07 0 
0 -214.316 615.329 0 0 0 0 0 0 0 0 0 0 0 0 0 0 0 0 632.115 0 0 0 0 0 0 0 0 0 0 0 0 0 0 0 0 0 0 0 0 0 1717.66 0 0 0 0 0 0 0 0 0 0 0 0 0 0 0 0 445.647 -785.623 0 0 0 0 0.03 
