*Vertices 51
*Matrix 
0.09 0 0 0 0 0 0 0 0 0 0 0 0 0 0 0 0 0 0 0 0 0 0 0 0 0 0 0 0 328.455 2499.08 0 0 0 0 0 0 0 0 0 0 0 0 0 0 0 0 0 0 0 0 
0 0.06 0 0 0 0 0 0 0 2210.68 0 0 0 0 0 2235.25 0 0 0 0 0 0 0 0 0 0 1445.74 0 0 0 0 0 0 0 0 0 0 0 0 1682.41 0 0 1543.4 0 0 0 0 0 0 0 0 
0 0 0.08 0 2306.05 1808.76 1497.16 0 0 -2067.25 0 0 0 0 0 0 0 0 0 0 -595.95 0 -1298.94 0 -2385.71 0 0 0 0 0 0 0 0 0 0 0 1350.83 1322.44 0 0 2490.39 0 0 0 0 0 909.223 0 568.331 0 0 
0 0 0 0.07 0 0 0 0 0 0 0 0 0 1583.83 1327.02 0 0 -277.184 0 0 0 0 2489.47 0 0 518.586 606.326 0 0 0 0 0 0 0 0 0 0 0 0 0 0 0 0 0 0 0 0 0 0 0 0 
0 0 1582.92 0 0.09 2252.19 0 -1756.11 0 0 2265.62 0 0 0 0 -1936.17 0 0 0 0 0 0 0 0 0 0 0 0 0 0 0 0 0 0 0 -1655.86 -1024.74 0 0 0 2209.62 0 0 0 0 0 0 0 0 0 0 
0 0 1545.53 0 -12.8941 0.06 0 0 0 0 0 0 0 0 0 0 0 0 262.688 0 -739.845 271.386 0 0 0 0 0 0 0 0 0 0 0 0 0 0 0 0 0 0 0 0 0 0 0 0 0 0 0 0 0 
0 0 -655.461 0 0 0 0.02 0 922.498 0 0 0 1321.22 0 0 0 0 0 0 0 0 0 0 0 0 0 0 0 0 0 0 -120.319 0 0 0 0 0 0 0 1473.82 0 0 0 0 0 0 0 0 0 0 0 
0 0 0 0 918.683 0 0 0.09 0 0 0 0 0 0 0 1436.89 2375.33 -396.207 548.952 0 1365.32 0 0 0 0 0 0 0 0 0 0 0 0 0 0 0 0 0 0 0 0 0 0 0 0 2447.81 0 0 0 0 0 
0 0 0 0 0 0 2281.79 0 0.05 0 0 0 0 0 0 0 0 0 0 0 0 0 0 0 0 0 0 0 0 0 0 0 0 0 0 0 0 0 0 0 0 0 0 0 0 0 0 -425.81 0 0 0 
0 1432.92 8.92666 0 0 0 0 0 0 0.05 0 0 1507.69 2413.02 0 0 0 0 0 0 0 0 0 0 0 0 711.31 2001.48 0 0 0 0 921.735 0 0 0 0 0 -2231.89 0 0 0 0 0 0 0 0 0 0 0 0 
0 0 0 0 2214.8 0 0 0 0 0 0 -368.892 0 0 1162.53 0 0 0 0 0 0 1730.93 0 0 0 0 0 0 0 0 0 0 458.007 0 0 0 0 0 0 0 0 -1720.86 0 0 0 2002.55 0 0 0 -407.804 0 
0 0 0 0 0 0 0 0 0 0 394.375 0.08 0 1444.52 0 2433.47 0 0 0 0 0 1269.65 0 0 0 0 0 1650.21 0 1560.49 0 1833.63 0 0 0 0 0 0 0 0 0 0 0 0 0 0 0 988.266 1813.94 0 0 
0 0 0 0 0 0 1569.64 0 0 2015.82 0 0 0 0 0 0 0 1186.03 0 0 2049.24 0 0 0 0 0 0 0 85.8333 37.0037 0 0 0 0 0 0 -1008.56 0 0 0 0 0 -1270.71 0 2203.51 0 0 0 0 0 0 
0 0 0 -1340.14 0 0 0 0 0 -215.842 0 1513.03 0 0.04 920.82 0 0 0 0 0 0 0 0 0 0 2363.12 0 0 0 1644.72 0 0 0 743.507 0 0 -352.87 0 0 0 0 0 2028.79 -825.297 -61.5711 0 0 0 0 0 0 
0 0 0 1410.64 0 0 0 0 0 0 1523.1 0 0 -1028.24 0.02 0 0 0 0 0 0 0 0 0 89.0378 0 0 0 0 0 0 0 2108.14 0 0 1719.49 0 0 0 0 0 0 0 0 0 0 0 0 0 793.863 0 
0 450.987 0 0 1837.6 0 0 1045.95 0 0 0 2140.95 0 0 0 0.09 0 0 1812.42 0 -1561.25 0 -596.103 2419.43 0 0 0 0 0 0 0 0 0 0 0 0 -215.384 0 0 -2491.3 0 0 0 0 0 2424.31 0 0 0 0 0 
0 0 0 0 0 0 0 1065.63 0 0 0 0 0 0 0 0 0 0 0 0 0 -128.864 0 0 0 0 0 0 0 0 0 0 0 0 1465.42 0 0 -2294 0 0 0 0 595.645 0 0 0 0 0 0 0 0 
0 0 0 2085.25 0 0 0 560.854 0 0 0 0 211.417 0 0 0 0 0.08 0 0 0 0 0 0 0 0 897.32 0 0 0 0 0 0 0 0 -488.983 0 813.547 0 1513.34 0 0 0 0 0 0 0 0 0 867.26 0 
0 0 0 0 0 1471.22 0 -477.386 0 0 0 0 0 0 0 -104.907 0 0 0.07 0 0 0 0 0 0 2005.29 0 0 0 0 0 -622.959 0 -693.304 0 0 0 0 389.798 -356.838 0 0 0 0 0 1725.14 -339.9 1949.29 0 0 0 
0 0 0 0 0 0 0 0 0 0 0 0 0 0 0 0 0 0 0 0.04 0 0 0 0 0 0 0 0 0 0 1305.05 0 0 1272.39 0 -899.304 0 0 0 812.784 0 0 0 0 0 0 0 0 0 0 0 
0 0 -974.837 0 0 2172.38 0 -765.328 0 0 0 0 530.03 0 0 1782.36 0 0 0 0 0.01 1724.07 0 0 0 577.944 0 0 0 0 0 -2183.83 0 0 0 0 0 0 0 0 0 0 0 982.772 0 0 0 0 0 -168.386 0 
0 0 0 0 0 -226.218 0 0 0 0 530.793 1980.12 0 0 0 0 -2447.2 0 0 0 2300.41 0.01 0 0 0 -28.3059 0 0 0 0 0 0 0 0 0 0 0 2488.25 0 0 0 -936.689 1296.5 0 0 0 0 0 0 2254.17 0 
0 0 109.333 -1805.55 0 0 0 0 0 0 0 0 0 0 0 700.323 0 0 0 0 0 0 0.03 0 0 0 0 0 0 0 0 0 0 0 0 0 0 0 906.323 0 0 0 802.255 2398.37 -2485.81 0 0 -1676.46 -638.829 0 2303.92 
0 0 0 0 0 0 0 0 0 0 0 0 0 0 0 1887.34 0 0 0 0 0 0 0 0.05 0 0 0 0 0 0 0 0 -666.295 0 0 0 0 0 2480.01 0 0 0 0 0 0 0 0 2496.95 0 0 0 
0 0 1077.38 0 0 0 0 0 0 0 0 0 0 0 77.7459 0 0 0 0 0 0 0 0 0 0.06 0 0 0 0 0 0 0 0 1509.52 0 0 0 0 0 0 0 0 1077.53 0 0 0 0 0 0 0 0 
0 0 0 1969.74 0 0 0 0 0 0 0 0 0 -1863.08 0 0 0 0 1072.8 0 689.795 381.558 0 0 0 0.03 0 0 0 0 0 353.328 0 0 0 0 0 0 1417.66 0 0 0 0 0 0 0 0 0 0 0 0 
0 -473.571 0 1074.02 0 0 0 0 0 -101.856 0 0 0 0 0 0 0 -1042.59 0 0 0 0 0 0 0 0 0.04 0 0 0 0 0 0 0 0 1888.26 0 0 0 0 0 0 0 0 0 0 593.356 0 1122.85 0 0 
0 0 0 0 0 0 0 0 0 1832.41 0 592.135 0 0 0 0 0 0 0 0 0 0 0 0 0 0 0 0.02 0 0 0 0 0 0 0 0 0 0 0 0 0 0 0 0 0 0 0 0 0 0 0 
0 0 0 0 0 0 0 0 0 0 0 0 1918.01 0 0 0 0 0 0 0 0 0 0 0 0 0 0 0 0 0 0 0 0 0 0 2295.98 864.055 0 0 0 0 2388.91 0 1679.36 0 0 0 0 0 0 0 
1541.57 0 0 0 0 0 0 0 0 0 0 776.315 -1115.68 1961.81 0 0 0 0 0 0 0 0 0 0 0 0 0 0 0 0.09 0 0 0 -473.113 0 0 -552.309 0 0 0 0 0 0 0 0 2398.22 399.716 0 0 0 0 
-1280.33 0 0 0 0 0 0 0 0 0 0 0 0 0 0 0 0 0 0 1396.76 0 0 0 0 0 0 0 0 0 0 0.05 0 0 0 0 0 2136.83 0 0 0 0 0 0 0 0 386.746 0 0 0 0 0 
0 0 0 0 0 0 1508.76 0 0 0 0 -1542.79 0 0 0 0 0 0 1575.14 0 -1544.31 0 0 0 0 1679.05 0 0 0 0 0 0.05 0 0 0 0 0 0 1733.99 0 0 0 0 333.949 0 0 0 1969.74 0 0 0 
0 0 0 0 0 0 0 0 0 1168.78 -1512.88 0 0 0 1055.86 0 0 0 0 0 0 0 0 -2351.22 0 0 0 0 0 0 0 0 0.05 0 1145.89 0 0 0 0 0 0 0 0 1017.11 0 794.32 0 0 0 0 0 
0 0 0 0 0 0 0 0 0 0 0 0 0 2125.54 0 0 0 0 2217.86 -523.469 0 0 0 0 -1592.07 0 0 0 0 2139.73 0 0 0 0.06 0 0 0 0 0 0 0 0 0 0 0 0 0 0 0 0 0 
0 0 0 0 0 0 0 0 0 0 0 0 0 0 0 0 594.424 0 0 0 0 0 0 0 0 0 0 0 0 0 0 0 1039.38 0 0.06 0 0 0 0 0 0 0 0 1506.16 0 0 920.362 -1668.07 0 0 0 
0 0 0 0 1162.07 0 0 0 0 0 0 0 0 0 593.814 0 0 2456.66 0 1341.98 0 0 0 0 0 0 -998.947 0 485.321 0 0 0 0 0 0 0.03 0 0 0 0 0 0 0 0 -170.98 0 0 0 0 0 0 
0 0 2124.32 0 439.695 0 0 0 0 0 0 0 1051.44 1571.78 0 787.912 0 0 0 0 0 0 0 0 0 0 0 0 -1707.59 -2352.9 -74.9992 0 0 0 0 0 0 538.575 0 0 0 0 0 0 0 0 0 0 0 0 0 
0 0 -170.675 0 0 0 0 0 0 0 0 0 0 0 0 0 2131.18 -300.989 0 0 0 1947 0 0 0 0 0 0 0 0 0 0 0 0 0 0 695.898 0.07 0 0 0 2237.54 0 0 0 0 0 0 0 0 0 
0 0 0 0 0 0 0 0 0 1447.26 0 0 0 0 0 0 0 0 2067.55 0 0 0 1124.07 1962.87 0 -1519.9 0 0 0 0 0 2411.34 0 0 0 0 0 0 0.08 0 0 0 0 0 -2381.13 0 0 0 0 0 2076.1 
0 -1235.77 0 0 0 0 2200.61 0 0 0 0 0 0 0 0 581.301 0 -128.559 875.958 149.922 0 0 0 0 0 0 0 0 0 0 0 0 0 0 0 0 0 0 0 0.08 0 0 0 0 -2181.69 0 0 0 1512.88 0 0 
0 0 -2196.49 0 1767.25 0 0 0 0 0 0 0 0 0 0 0 0 0 0 0 0 0 0 0 0 0 0 0 0 0 0 0 0 0 0 0 0 0 0 0 0.09 0 0 795.083 0 0 0 1999.5 0 0 0 
0 0 0 0 0 0 0 0 0 0 656.377 0 0 0 0 0 0 0 0 0 0 -1134.75 0 0 0 0 0 0 2135.15 0 0 0 0 0 0 0 0 2018.11 0 0 0 0.03 -2223.5 0 0 0 0 0 0 0 0 
0 2486.88 0 0 0 0 0 0 0 0 0 0 615.94 -1717.05 0 0 1011.61 0 0 0 0 2126.3 -1153.68 0 -518.128 0 0 0 0 0 0 0 0 0 0 0 0 0 0 0 0 -320.521 0 2361.9 0 0 0 0 0 0 0 
0 0 0 0 0 0 0 0 0 0 0 0 0 -0.839259 0 0 0 0 0 0 2464.75 0 1191.21 0 0 0 0 0 -458.464 0 0 -83.3918 -553.072 0 2403.26 0 0 0 0 0 -2223.04 0 -1096.61 0.03 0 0 0 0 0 0 0 
0 0 0 0 0 0 0 0 0 0 0 0 -1245.23 2055.8 0 0 0 0 0 0 0 0 2194.66 0 0 0 0 0 0 0 0 0 0 0 0 2262.72 0 0 -1379.82 1056.63 0 0 0 0 0.07 0 2320.86 0 0 -2352.44 43.1074 
0 0 0 0 0 0 0 -613.193 0 0 -1564.61 0 0 0 0 1531.5 0 0 79.1192 0 0 0 0 0 0 0 0 0 0 2176.66 2054.58 0 -345.393 0 0 0 0 0 0 0 0 0 0 0 0 0.04 0 0 0 873.516 0 
0 0 1989.58 0 0 0 0 0 0 0 0 0 0 0 0 0 0 0 1390.65 0 0 0 0 0 0 0 -302.973 0 0 2065.72 0 0 0 0 -2441.4 0 0 0 0 0 0 0 0 0 284.204 0 0.05 1416.29 2345.12 0 0 
0 0 0 0 0 0 0 0 1119.95 0 0 -1500.98 0 0 0 0 0 0 -799.203 0 0 0 -1733.99 -1133.38 0 0 0 0 0 0 0 1544.62 0 0 2086.02 0 0 0 0 0 922.04 0 0 0 0 0 343.41 0.06 0 0 0 
0 0 1929 0 0 0 0 0 0 0 0 2281.03 0 0 0 0 0 0 0 0 0 0 1170.31 0 0 0 -663.549 0 0 0 0 0 0 0 0 0 0 0 0 1168.02 0 0 0 0 0 0 588.626 0 0.08 0 0 
0 0 0 0 0 0 0 0 0 0 238.273 0 0 0 -1951.28 0 0 -724.128 0 0 -78.0511 2311.7 0 0 0 0 0 0 0 0 0 0 0 0 0 0 0 0 0 0 0 0 0 0 1521.27 2241.51 0 0 0 0.01 0 
0 0 0 0 0 0 0 0 0 0 0 0 0 0 0 0 0 0 0 0 0 0 -2036.73 0 0 0 0 0 0 0 0 0 0 0 0 0 0 0 1634.04 0 0 0 0 0 2319.33 0 0 0 0 0 0.02 
