*Vertices 45
*Matrix 
0.01 2209.01 0 0 0 0 0 0 0 0 0 0 0 0 0 0 0 0 0 0 0 0 0 0 0 0 0 0 1422.24 0 0 2355.8 0 -1580.48 0 -1556.83 0 0 0 2159.11 0 0 0 0 0 
918.989 0.02 0 0 0 0 0 0 0 0 0 0 0 0 0 0 125.813 0 0 -14.42 0 0 0 0 0 282.83 2069.99 0 0 0 0 0 0 0 0 0 0 0 0 0 0 0 0 0 0 
0 0 0.06 0 0 0 0 0 0 0 0 0 0 0 0 0 0 0 0 0 0 0 0 0 0 0 0 0 0 0 0 0 0 0 0 0 0 0 0 1988.97 0 0 0 0 0 
0 0 0 0.02 0 0 0 0 0 0 0 1643.19 0 0 0 -628.452 0 0 0 0 0 -952.559 0 0 0 1397.21 0 0 0 0 0 0 0 0 0 0 1204.95 0 0 0 -1576.97 0 0 0 0 
0 0 0 0 0.02 0 0 0 0 0 0 0 0 0 0 -1469.7 0 0 0 0 0 0 0 0 1959.36 0 0 0 0 1770.46 0 0 0 0 0 0 0 0 0 0 0 0 0 0 0 
0 0 0 0 0 0.02 0 401.09 -1853.31 0 1955.24 2362.21 0 0 0 0 665.532 0 0 0 0 -1898.94 0 -1526.46 0 0 0 0 0 1271.32 0 0 0 0 0 0 0 0 0 351.65 0 0 -1686.38 0 0 
0 0 0 0 0 0 0.08 0 0 0 0 0 0 0 0 0 0 0 0 0 0 0 0 0 0 -162.435 278.253 0 0 0 0 1819.13 0 0 0 0 0 0 0 0 0 0 1102.86 0 0 
0 0 0 0 0 1152.15 0 0 0 0 0 0 0 0 -182.577 0 0 1161.92 0 0 0 0 0 -1215.17 0 0 0 0 0 0 0 0 889.996 0 0 0 0 -577.029 0 0 0 1279.72 0 0 0 
0 0 0 0 0 1381.04 0 0 0.02 0 0 0 0 0 0 0 0 0 0 0 0 0 0 0 0 1837.29 0 0 0 846.507 0 0 0 0 0 -1157.03 0 -449.309 0 914.563 0 0 0 0 0 
0 0 0 0 0 0 0 0 0 0.05 0 0 0 0 1140.25 0 0 0 0 0 0 0 0 0 0 0 1515.32 0 0 0 0 0 0 0 0 0 0 0 0 0 0 0 0 0 0 
0 0 0 0 0 552.156 0 0 0 0 0.08 0 0 0 0 0 2244.1 0 0 0 0 0 0 0 -2097.92 2115.92 0 223.319 0 0 0 0 0 0 0 0 0 1944.26 0 0 -330.592 0 0 -68.2852 0 
0 0 0 521.79 0 1144.98 0 0 0 0 0 0.04 0 0 0 0 0 0 0 0 0 0 0 0 0 0 0 0 0 -2112.11 418.027 0 0 0 1272.85 0 0 -850.627 1925.49 0 1397.52 0 0 0 0 
0 0 0 0 0 0 0 0 0 0 0 0 0.04 0 0 1293.45 0 0 0 0 0 0 0 0 0 0 0 0 0 0 0 0 1455.96 0 0 0 0 0 0 0 0 0 0 0 0 
0 0 0 0 0 0 0 0 0 0 0 0 0 0.04 -201.804 1490.45 575.503 0 0 0 0 0 0 0 0 0 0 0 0 0 0 0 0 -1978.44 0 613.804 0 0 0 0 0 0 0 0 0 
0 0 0 0 0 0 0 1917.55 0 150.38 0 0 0 2142.78 0.06 0 -203.635 0 0 0 0 0 0 0 0 0 720.466 0 0 0 0 0 0 0 0 -840.251 0 0 0 0 0 0 -478.912 0 0 
0 0 0 1934.49 -2435.45 0 0 0 0 0 0 0 -1637.24 -237.053 0 0.06 0 2418.82 0 0 0 0 0 0 0 0 0 0 0 -1997.97 -433.287 0 0 0 1991.41 410.855 0 0 0 0 0 0 2006.82 0 0 
0 1079.97 0 0 0 1006.58 0 0 0 0 -535.981 0 0 -1322.44 516.755 0 0.02 647.069 0 0 0 0 1184.8 0 0 662.481 0 0 0 0 0 0 0 0 0 887.555 0 0 0 0 0 0 368.282 0 0 
0 0 0 0 0 0 0 -2492.68 0 0 0 0 0 0 0 1101.34 1831.8 0.06 0 0 0 0 0 0 0 0 0 0 0 0 0 0 0 0 1588.87 0 0 0 0 0 0 0 0 0 0 
0 0 0 0 0 0 0 0 0 0 0 0 0 0 0 0 0 0 0.08 0 0 0 0 0 0 0 0 2076.86 0 0 0 0 0 0 0 0 0 0 0 0 0 0 0 0 0 
0 2481.84 0 0 0 0 0 0 0 0 0 0 0 0 0 0 0 0 0 0.06 241.63 0 0 -2337.03 0 0 0 0 0 0 0 0 -2034.59 567.415 0 0 0 0 1239.59 0 0 1886.88 0 574.892 0 
0 0 0 0 0 0 0 0 0 0 0 0 0 0 0 0 0 0 0 -603.732 0 0 0 0 0 0 0 2389.52 0 0 0 0 0 0 0 0 0 0 0 0 0 0 0 0 0 
0 0 0 1676.92 0 477.081 0 0 0 0 0 0 0 0 0 0 0 0 0 0 0 0.01 0 0 0 0 0 0 813.242 0 1862.93 0 1185.72 0 0 0 0 0 0 1190.45 0 0 0 0 0 
0 0 0 0 0 0 0 0 0 0 0 0 0 0 0 0 1628.09 0 0 0 0 0 0.07 436.491 0 0 741.371 0 0 0 0 0 0 0 0 0 0 0 891.675 0 0 2290.64 0 0 0 
0 0 0 0 0 2078.39 0 2375.94 0 0 0 0 0 0 0 0 0 0 0 -1802.65 0 0 1038.93 0.07 0 241.478 0 0 0 0 1006.73 0 0 0 0 0 0 0 0 0 0 0 0 0 0 
0 0 0 0 618.686 0 0 0 0 0 2185.05 0 0 0 0 0 0 0 0 0 0 0 0 0 0.04 0 0 0 0 0 0 0 -109.638 0 0 0 0 0 0 0 0 0 0 0 0 
0 1660.13 0 2380.52 0 0 -2243.64 0 1509.52 0 2229.15 0 0 0 0 0 2286.83 0 0 0 0 0 0 -2016.59 0 0.04 0 0 2186.12 0 0 0 0 0 0 0 0 0 0 0 0 0 0 0 327.998 
0 -1530.12 0 0 0 0 -1962.42 0 0 2449.19 0 0 0 0 634.556 0 0 0 0 0 0 0 891.064 0 0 0 0.06 0 0 0 -1155.96 0 365.688 0 0 0 0 0 1079.06 0 0 0 0 0 0 
0 0 0 0 0 0 0 0 0 0 828.806 0 0 0 0 0 0 0 1008.41 0 -384.762 0 0 0 0 0 0 0.09 -68.4378 0 0 0 446.104 0 0 0 0 -1137.65 1034.81 0 -320.673 0 0 0 0 
2027.42 0 0 0 0 0 0 0 0 0 0 0 0 0 0 0 0 0 0 0 0 407.956 0 0 0 733.589 0 1967.6 0.04 0 0 1942.73 0 0 0 0 0 0 0 0 0 2062.67 0 -1498.84 0 
0 0 0 0 1291.16 1342.28 0 0 397.885 0 0 -1385.77 0 0 0 889.691 0 0 0 0 0 0 0 0 0 0 0 0 0 0.05 0 -2388.61 0 0 0 650.121 0 0 0 0 0 0 0 0 0 
0 0 0 0 0 0 0 0 0 0 0 1084.86 0 0 0 1396.15 0 0 0 0 0 -289.239 0 1943.8 0 0 -656.987 0 0 0 0.01 0 15.6407 -1943.65 0 0 0 0 0 0 0 1477.32 0 0 0 
755.409 0 0 0 0 0 1978.59 0 0 0 0 0 0 0 0 0 0 0 0 0 0 0 0 0 0 0 0 0 173.269 174.642 0 0.07 209.433 0 0 0 0 0 0 0 0 0 0 0 0 
0 0 0 0 0 0 0 1203.57 0 0 0 0 2124.47 0 0 0 0 0 0 1589.79 0 -1118.73 0 0 -1340.91 0 -1406.06 -493.713 0 0 1498.84 2116.38 0.08 0 0 0 0 0 0 0 0 0 0 0 0 
-2467.04 0 0 0 0 0 0 0 0 0 0 0 0 -1546.6 0 0 0 0 0 211.722 0 0 0 0 0 0 0 0 0 0 1908.7 0 0 0.03 0 2417.14 -499.512 0 0 0 1438.72 0 0 0 0 
0 0 0 0 0 0 0 0 0 0 0 -1618.93 0 0 0 439.848 0 2201.07 0 0 0 0 0 0 0 0 0 0 0 0 0 0 0 0 0.03 0 0 0 0 0 0 0 0 0 0 
702.46 0 0 0 0 0 0 0 -1723.46 0 0 0 0 -1667 2152.7 665.685 1637.55 0 0 0 0 0 0 0 0 0 0 0 0 2080.83 0 0 0 -601.444 0 0.05 0 0 0 0 -1732.46 0 0 0 100.787 
0 0 0 1229.82 0 0 0 0 0 0 0 0 0 0 0 0 0 0 0 0 0 0 0 0 0 0 0 0 0 0 0 0 0 1330.23 0 0 0.01 0 0 0 1080.43 0 2374.11 0 0 
0 0 0 0 0 0 0 556.124 2314.75 0 1573.31 -139.698 0 0 0 0 0 0 0 0 0 0 0 0 0 0 0 -2299.49 0 0 0 0 0 0 0 0 0 0 0 0 0 0 0 0 0 
0 0 0 0 0 0 0 0 0 0 0 1554.54 0 0 0 0 0 0 0 1974.62 0 0 -1872.23 0 0 0 694.067 -117.42 0 0 0 0 0 0 0 0 0 0 0.03 0 0 0 0 0 0 
419.706 0 1757.94 0 0 979.263 0 0 1347.47 0 0 0 0 0 0 0 0 0 0 0 0 1412.02 0 0 0 0 0 0 0 0 0 0 0 0 0 0 0 0 0 0.09 0 1075.85 0 2028.49 -850.017 
0 0 0 1897.26 0 0 0 0 0 0 920.972 -2451.78 0 0 0 0 0 0 0 0 0 0 0 0 0 0 0 1924.88 0 0 0 0 0 1485.87 0 1321.53 -977.737 0 0 0 0.03 -1154.29 0 0 0 
0 0 0 0 0 0 0 1010.7 0 0 0 0 0 0 0 0 0 0 0 545.595 0 0 -1775.64 0 0 0 0 0 -932.875 0 1124.68 0 0 0 0 0 0 0 0 889.386 1899.4 0.03 0 0 0 
0 0 0 0 0 -238.273 1297.27 0 0 0 0 0 0 0 96.82 1330.84 1018.33 0 0 0 0 0 0 0 0 0 0 0 0 0 0 0 0 0 0 0 1498.54 0 0 0 0 0 0.05 0 0 
0 0 0 0 0 0 0 0 0 0 361.11 0 0 0 0 0 0 0 0 -1986.98 0 0 0 0 0 0 0 0 1927.32 0 0 0 0 0 0 0 0 0 0 1871.47 0 0 0 0.03 0 
0 0 0 0 0 0 0 0 0 0 0 0 0 0 0 0 0 0 0 0 0 0 0 0 0 194.784 0 0 0 0 0 0 0 0 0 -351.192 0 0 0 2400.05 0 0 0 0 0.07 
