*Vertices 82
*Matrix 
0.07 1836.07 -697.119 0 0 0 1744.82 -883.74 0 0 0 0 0 0 0 0 0 0 0 0 1045.49 0 0 0 -532.472 1689.12 0 0 0 0 1262.93 0 0 0 1851.79 0 0 0 741.218 0 0 0 0 0 0 0 2423.25 1621.52 0 0 0 0 0 0 0 1093.71 0 0 0 0 0 0 0 -30.2896 263.604 0 0 0 0 0 0 0 0 589.694 0 0 0 -152.364 0 0 0 0 
-1656.16 0.04 668.737 0 0 0 0 1457.64 0 0 0 0 0 0 0 2429.96 0 -1574.83 0 2138.81 1630.68 0 0 1675.39 0 0 0 0 0 0 0 0 0 -1046.56 0 0 0 0 0 0 0 0 -2321.92 0 0 0 0 0 0 1377.99 0 0 0 0 0 0 0 0 401.7 0 0 0 0 0 0 1293.15 0 0 0 0 0 0 0 0 0 758.309 0 0 0 520.417 -1001.85 0 
1551.03 1797.46 0 0 0 0 1266.44 0 -801.798 0 0 -871.227 0 1353.27 220.573 0 0 0 0 0 502.411 -173.574 0 1199.15 0 0 145.802 0 0 0 0 -2371.36 0 1645.79 0 0 -454.955 0 0 0 1979.51 0 0 0 0 878.704 0 0 0 0 0 -1526.31 1883.22 0 0 0 28.7637 0 0 0 -2354.27 0 0 0 0 0 0 -2165.06 52.5681 2317.5 0 0 0 0 0 0 -86.5963 0 0 1321.07 0 0 
0 0 0 0.02 0 949.355 -2083.12 0 0 0 -944.166 0 1035.72 0 832.469 0 0 2275.38 0 0 2082.05 1281.85 0 0 0 -479.217 -911.817 0 0 0 2497.71 -1387.6 0 0 0 2493.13 0 0 -601.291 0 0 -62.1815 0 0 0 0 0 -1440.4 0 0 0 0 0 0 0 0 0 1323.66 0 0 0 0 0 0 0 0 0 0 0 0 0 0 -1917.1 0 0 401.09 0 0 0 0 0 -2297.97 
0 0 0 0 0.09 0 0 0 0 0 0 0 0 0 0 0 0 0 2292.02 0 0 0 0 885.571 0 0 1959.67 0 0 0 0 0 0 0 0 2412.11 -917.615 75.6096 0 0 1683.94 0 0 0 0 0 0 0 0 0 0 0 0 0 0 0 0 0 0 0 0 0 0 0 0 0 0 0 0 0 0 0 0 0 0 0 0 0 0 0 0 -1685.61 
0 0 0 401.242 0 0.04 0 -876.72 0 1498.08 0 0 0 0 -1198.23 -1367.76 0 1668.22 0 0 0 0 0 0 0 0 2497.1 649.815 0 109.333 -123.829 0 -1050.37 0 0 0 0 0 2248.83 0 1258.66 -527.741 0 0 398.495 0 0 -1382.87 0 0 -159.993 0 0 0 2101.89 0 0 0 0 0 -908.765 0 0 694.678 0 0 0 0 0 -810.19 0 1240.65 0 0 0 0 0 0 0 0 0 0 
1980.27 0 -1732.46 -1955.55 0 0 0.01 0 0 1005.36 0 0 -2274.32 0 0 -1028.7 0 0 0 0 1678.9 0 0 0 0 0 0 0 0 0 0 934.4 0 0 0 0 -199.667 0 1460.69 0 768.685 518.433 0 0 0 0 0 0 759.987 0 0 0 0 0 0 0 0 0 0 0 0 0 0 0 0 0 1948.53 0 0 0 0 -718.024 -225.303 0 0 0 0 0 0 0 0 0 
-1258.35 2314.91 0 0 0 -211.57 0 0.06 0 -761.971 0 0 0 0 0 0 0 1846.6 870.159 0 1640.14 0 0 0 2183.83 1710.03 0 0 0 0 -2417.6 0 0 0 -672.094 0 -1498.69 0 0 1078.14 0 -347.682 0 0 0 0 0 0 0 0 0 0 0 0 0 0 0 0 0 0 0 0 0 1428.65 0 0 0 0 0 0 0 0 0 0 0 0 0 0 0 0 0 0 
0 0 2333.98 0 0 0 0 0 0.04 0 2077.01 0 0 0 0 1348.23 1106.83 0 0 0 1750.92 320.978 -2437.13 -1728.19 0 0 -1677.22 0 0 0 0 0 0 0 0 0 0 0 0 0 278.71 -2142.17 2198.17 0 0 0 0 0 0 0 0 0 0 0 0 0 0 0 352.565 -666.906 1587.19 0 0 0 0 0 0 0 0 0 0 0 0 0 0 0 0 -2041.92 0 0 1564.91 0 
0 0 0 0 0 1137.35 1951.89 2144.15 0 0.02 0 0 0 0 0 0 0 0 0 0 0 0 0 962.63 0 0 0 0 0 0 0 0 0 0 0 0 0 -768.99 0 0 0 -1827.52 1108.05 -542.695 0 0 0 -1802.8 0 2025.59 0 0 0 0 0 -480.743 0 0 0 0 0 0 -1209.83 0 0 0 1986.68 0 0 1765.27 0 0 0 1413.69 0 0 0 0 0 0 0 0 
0 0 0 922.956 0 0 0 0 -1642.43 0 0.05 0 0 0 0 0 0 0 1080.13 0 0 1707.89 0 0 530.946 1534.55 1265.83 0 0 -1291.92 0 276.269 0 0 0 0 0 1456.88 205.618 0 -1826 0 -1549.2 0 2376.09 0 -797.525 0 1471.53 0 0 0 0 0 0 0 0 -314.722 0 0 0 0 0 0 0 0 0 0 0 1483.43 0 0 0 0 171.438 0 0 0 0 0 0 0 
0 0 -260.704 0 0 0 0 0 0 0 0 0.05 0 0 0 -8.31629 0 2141.25 -143.666 1778.39 0 1412.32 0 0 0 0 0 0 2451.02 0 0 0 0 1724.37 0 1308.1 0 1887.34 0 -143.666 0 0 0 0 0 0 -811.411 0 0 0 0 0 0 0 0 222.404 0 0 0 1098.74 0 0 0 0 0 -1628.24 0 0 0 0 0 0 0 0 0 0 0 479.98 0 0 0 0 
0 0 0 -809.427 0 0 137.867 0 0 0 0 0 0.05 0 0 2457.73 -53.3311 0 0 0 1614.05 0 0 422.452 0 0 0 0 1432.31 -689.032 0 0 0 1431.09 -1086.54 1465.27 -1226.92 572.909 0 1422.85 -521.18 0 0 0 0 0 0 0 0 0 0 -1140.1 0 0 0 0 0 0 0 0 0 0 0 0 0 0 0 0 534.303 0 0 0 0 0 1246.3 0 0 0 0 0 0 0 
0 0 29.6793 0 0 0 0 0 0 0 0 0 0 0.09 0 0 0 0 0 -79.1192 0 0 970.26 0 0 0 0 -101.245 1737.34 0 0 -1356.17 0 -646.611 0 0 126.118 0 0 2387.54 0 0 0 0 0 0 0 0 0 -1443.91 0 0 0 0 -326.624 0 0 0 479.369 0 0 0 0 2229 0 -1396.15 0 0 0 0 0 1078.14 0 0 0 0 0 0 1176.72 0 0 0 
0 0 2287.29 2067.25 0 924.329 0 0 0 0 0 0 0 0 0.07 0 0 0 0 0 0 0 0 0 361.568 0 -1554.54 0 1053.73 -303.583 0 -1032.36 0 0 0 0 0 0 0 0 0 0 0 0 0 0 0 -1856.67 2308.34 2263.18 0 1758.71 0 0 537.202 0 0 0 0 0 0 0 0 0 0 1532.26 0 0 0 0 0 0 0 0 0 0 0 0 0 0 0 -1325.8 
0 -432.829 0 0 0 -2161.85 778.298 0 -663.701 0 0 -1903.06 -388.272 0 0 0.04 0 0 0 0 0 117.115 2027.27 0 0 580.538 0 0 24.9489 2225.49 484.1 0 2450.25 0 0 0 -428.404 -732.521 0 0 0 0 0 0 0 1030.08 142.14 0 0 0 0 0 0 0 0 0 0 0 0 0 0 0 2101.73 0 0 0 0 0 0 0 0 0 0 -1708.5 0 -405.972 0 0 0 0 0 0 
0 0 0 0 0 0 0 0 -1888.71 0 0 0 908.155 0 0 0 0.08 0 0 0 0 360.5 1500.37 0 0 209.738 219.504 0 1521.27 394.528 0 0 0 0 -63.5548 0 0 0 0 2432.25 0 0 0 0 0 0 0 0 0 129.17 0 0 0 0 0 0 1995.99 0 2299.49 0 0 0 0 0 0 0 0 0 0 0 0 0 -2420.04 0 0 71.0318 936.842 0 0 0 0 0 
0 1003.83 0 -1293.15 0 851.848 0 1101.64 0 0 0 2391.96 0 0 0 0 0 0.08 0 0 164.113 0 1175.5 0 1597.11 -1227.23 0 0 0 -1527.07 0 0 0 0 0 0 497.833 0 2387.69 0 2162.31 0 0 0 0 105.518 0 0 0 0 0 0 486.084 0 0 0 0 0 0 0 0 1306.27 0 0 0 0 1380.58 0 0 0 0 1810.28 0 657.903 0 0 0 0 0 0 0 0 
0 0 0 0 1140.71 0 0 -1766.64 0 0 -1606.27 44.3281 0 0 0 0 0 0 0 867.412 1719.49 0 0 -2338.4 1639.68 0 2189.47 1834.09 0 0 1606.57 0 0 0 -863.903 0 -204.855 2239.83 0 0 0 0 0 0 -951.491 0 0 0 0 0 0 1553.47 0 0 0 0 0 -40.0555 -1879.71 0 0 0 0 0 0 0 0 0 0 0 0 0 0 0 0 0 0 0 0 0 0 0 
0 93.6155 0 0 0 0 0 0 0 0 0 1123.46 0 -1751.38 0 0 0 0 -50.737 0.07 0 -1321.38 0 -809.427 1279.11 460.601 0 0 0 0 0 1613.44 0 0 0 0 0 1774.12 0 0 1333.89 0 0 508.972 930.128 0 0 0 1057.85 0 0 0 0 0 0 -833.384 0 0 0 0 0 0 0 0 0 0 -519.959 0 0 0 0 0 0 0 0 -354.091 0 0 0 0 0 0 
-93.3103 -1845.68 2108.6 738.472 0 0 929.975 2250.82 -154.653 0 0 0 -2085.1 0 0 0 0 2390.59 1699.04 0 0.09 0 1176.11 0 0 1112.48 1224.63 0 0 0 0 0 0 546.51 0 0 0 0 0 0 0 0 0 0 0 0 0 0 0 0 0 0 0 0 0 0 0 0 0 -2474.36 0 0 0 0 560.854 0 0 0 0 0 0 0 0 1404.39 0 0 0 0 0 0 0 -706.885 
0 0 -897.32 2183.22 0 0 0 0 -920.362 0 2308.34 887.097 0 0 0 655.919 -171.438 0 0 -469.298 0 0.03 0 0 0 0 -391.018 -593.051 -570.772 0 86.7489 0 0 0 0 0 0 2234.49 -1227.99 2399.14 0 0 0 0 0 0 -2042.53 0 0 0 0 0 0 0 0 0 -709.479 0 0 0 0 0 0 0 0 0 0 0 0 0 1113.54 0 0 0 0 0 0 0 0 1280.48 0 0 
0 0 0 0 0 0 0 0 459.075 0 0 0 0 1125.6 0 -1287.04 1638.92 107.349 0 0 1483.28 0 0.01 0 0 1088.21 1858.2 0 0 0 1661.96 0 0 0 0 0 0 0 411.313 0 938.673 0 0 0 2169.03 0 0 0 0 0 0 0 0 0 -0.839259 0 0 0 0 0 0 0 0 0 0 1504.79 0 0 1981.19 0 1966.08 0 0 0 0 -292.444 0 0 0 0 0 0 
0 -848.949 1199.61 0 1224.63 0 0 0 1938 -2153.16 0 0 1893.14 0 0 0 0 0 682.165 801.492 0 0 0 0.07 0 106.891 -609.684 0 0 0 -1432.77 2151.17 0 0 0 0 0 0 0 0 0 0 0 1667.3 0 0 0 1163.59 0 0 0 -2196.04 0 0 0 0 0 1045.18 0 0 0 -291.223 0 0 0 0 0 2410.43 0 0 0 0 1793.19 377.438 0 -2321.62 2330.77 0 0 0 0 0 
-73.9311 0 0 0 0 0 0 1293.91 0 0 1086.54 0 0 0 -247.581 0 0 -536.439 -2137.9 991.47 0 0 0 0 0.08 0 0 0 -552.614 -915.784 0 0 0 1395.38 2170.4 -2230.52 0 873.516 0 0 0 0 -544.069 0 0 0 0 0 1041.98 0 1308.1 0 0 0 0 0 0 0 0 0 0 2040.24 0 0 0 0 0 0 2276.15 0 0 0 0 0 -2056.87 0 711.615 0 0 0 0 0 
87.3592 0 0 -1325.8 0 0 0 2224.27 0 0 1876.51 0 0 0 0 1075.09 1083.03 650.883 0 1385.31 1665.01 0 2299.19 2472.23 0 0.04 0 -2358.55 1402.4 0 0 0 0 0 -208.365 0 0 0 0 2288.81 0 0 -2406.92 0 0 0 91.174 0 0 0 0 0 0 0 0 533.082 -2362.97 0 0 -511.109 0 0 0 -2318.72 0 0 2203.67 0 0 0 0 0 1616.49 0 0 0 -1917.55 0 0 0 0 0 
0 0 -938.063 1443.3 868.023 -2146.29 0 0 1577.88 0 -2064.04 0 0 0 -2447.51 0 2008.04 0 1624.73 0 2328.79 1299.25 1989.58 2378.99 0 0 0.03 0 1331.9 -1053.73 0 0 0 0 0 0 0 0 0 0 1136.89 -13.5044 0 0 0 0 0 0 2055.8 0 0 0 0 920.82 0 0 0 0 0 0 -1709.11 1762.67 1471.68 0 0 0 0 0 0 0 0 0 0 0 0 0 0 -935.621 -830.485 0 0 0 
0 0 0 0 0 2449.95 0 0 0 0 0 0 0 2380.06 0 0 0 0 2029.56 0 0 -74.9992 0 0 0 -917.615 0 0.06 0 0 0 0 745.033 0 0 0 0 0 -1242.94 0 0 0 0 0 0 0 0 0 1338.16 0 1137.2 0 0 0 0 0 0 0 0 0 0 0 0 0 0 265.74 1498.54 628.452 0 0 0 0 0 0 0 0 0 0 0 0 -903.119 0 
0 0 0 0 0 0 0 0 0 0 0 2082.35 -1317.71 862.224 -273.98 -1779.46 1467.1 0 0 0 0 -1500.82 0 0 1344.11 266.808 -1985.76 0 0.04 0 0 0 2085.56 1516.39 0 0 0 0 0 0 0 0 0 0 -392.239 1998.89 0 0 0 0 0 0 0 -1274.53 0 0 0 0 0 0 0 0 0 0 0 0 0 0 0 0 0 0 0 0 0 0 0 0 0 -305.261 354.854 0 
0 0 0 0 0 -1454.28 0 0 0 0 -634.709 0 1992.78 0 1034.5 -1067.92 1313.59 1732.61 0 0 0 0 0 0 2141.71 0 -1576.97 0 0 0 0 0 0 1158.71 0 910.749 -2040.09 0 0 0 0 0 0 0 0 0 0 0 0 0 0 2045.88 0 -737.556 0 0 0 0 0 0 0 0 0 0 0 0 0 0 -2393.34 0 0 234.764 0 775.246 0 0 0 0 1408.66 0 0 0 
-683.081 0 0 -46.1592 0 -4.95926 0 -913.8 0 0 0 0 0 0 0 2150.26 0 0 2244.41 0 0 -38.5296 -2080.37 1328.24 0 0 0 0 0 0 0.01 1528.75 0 1395.69 0 0 0 0 0 0 0 0 0 0 0 0 0 0 0 -1475.95 0 -1440.4 0 0 0 0 0 0 0 0 0 0 -1828.75 0 0 0 0 0 0 0 0 0 0 0 0 0 0 -548.036 0 0 0 1335.41 
0 0 2022.39 2145.07 0 0 -47.2274 0 0 0 -569.399 0 0 1296.96 1207.24 0 0 0 0 725.806 0 0 0 -2081.59 0 0 0 0 0 0 296.869 0.02 0 0 0 0 0 0 0 0 1536.23 -1441.16 0 -251.701 0 0 0 0 0 0 -1835.46 -560.091 0 0 0 0 0 0 0 0 0 966.75 0 0 0 0 0 0 0 0 -1245.84 0 0 0 0 0 1973.56 0 0 0 0 0 
0 0 0 0 0 -1015.73 0 0 0 0 0 0 0 0 0 2179.25 0 0 0 0 0 0 0 0 0 0 0 652.715 2257.53 0 0 0 0.09 0 0 567.415 0 0 0 0 0 0 0 1191.21 0 121.082 0 -2298.43 0 0 0 0 0 0 0 0 0 1219.75 0 0 0 -1273 0 1502.81 0 0 0 0 0 2072.89 0 0 0 0 0 0 0 0 0 0 0 0 
0 -1352.35 -882.977 0 0 0 0 0 0 0 0 1772.29 1281.4 2011.7 0 0 0 0 0 0 2379.45 0 0 0 1314.66 0 0 0 674.993 1566.29 -419.706 0 0 0.01 0 0 0 0 0 1242.18 0 426.878 1213.34 0 0 1656.77 0 2485.05 0 0 0 0 0 0 494.934 0 0 0 0 -1658.76 0 0 -1929 0 0 0 0 1988.81 0 0 0 0 -1129.87 0 0 0 0 0 619.297 0 0 -2022.39 
792.795 0 0 0 0 0 0 1588.87 0 0 0 0 -1519.44 0 0 0 122.456 0 1546.91 0 0 0 0 0 2030.78 -149.159 0 0 0 0 0 0 0 0 0.03 0 0 0 0 0 0 0 0 0 0 0 0 0 -130.848 0 0 0 1719.03 0 0 0 0 0 1260.95 0 0 0 0 0 0 0 0 0 1777.47 0 0 0 0 0 0 0 0 0 0 0 2370.6 0 
0 0 0 -2293.85 -523.621 0 0 0 0 0 0 -1140.4 -50.2792 0 0 0 0 0 0 0 0 0 0 0 2437.13 0 0 0 0 2461.55 0 0 1247.06 0 0 0.06 0 0 0 1783.12 0 -2233.73 -18.8452 0 -2005.14 0 0 0 0 0 0 0 -956.832 0 1945.33 488.83 1634.8 -188.681 0 1476.71 0 0 0 0 0 0 0 0 0 0 0 0 0 0 0 0 0 0 0 0 0 0 
0 0 -989.639 0 -2188.86 0 -183.187 2099.9 0 0 0 0 573.519 1166.04 0 -1064.56 0 -93.9207 -1232.57 0 0 0 0 0 0 0 0 0 0 1342.74 0 0 0 0 0 0 0.07 0 850.627 0 0 0 0 -282.067 0 0 0 0 2362.67 0 0 0 0 2351.37 0 0 0 0 0 0 0 0 0 249.107 0 0 0 0 0 -42.0392 0 0 0 0 0 0 0 0 784.707 -1977.68 0 0 
0 0 0 0 -980.941 0 0 0 0 -915.479 -994.217 1501.89 1003.83 0 0 -1399.66 0 0 2368.31 1504.03 0 -850.78 0 0 1197.32 0 0 0 0 0 0 0 0 0 0 0 0 0.08 0 0 0 0 905.866 0 -149.159 0 0 0 0 0 0 0 0 -2012.92 0 431.913 1298.49 0 0 0 427.03 0 0 0 0 0 -2186.88 0 0 0 0 0 0 0 241.325 0 0 0 0 0 0 0 
306.33 0 0 2174.98 0 -1231.04 -563.906 0 0 0 -1026.57 0 0 0 0 0 0 2326.65 0 0 0 -813.089 2318.57 0 0 0 0 2252.8 0 0 0 0 0 0 0 0 789.132 0 0.01 2301.93 0 0 0 0 0 0 0 0 0 0 0 0 0 0 0 0 0 0 -2456.82 1616.18 0 0 0 -1325.04 0 0 0 -171.59 0 0 0 -1555.45 0 0 0 0 0 -549.257 -2430.88 0 0 0 
0 0 0 0 0 0 0 -1376.77 0 0 0 -866.192 1933.42 1278.95 0 0 1890.7 0 0 0 0 1186.64 0 0 0 32.4259 0 0 0 0 0 0 0 1914.35 0 1566.74 0 0 1980.57 0.03 0 0 0 0 0 0 0 0 0 0 0 0 0 0 658.208 0 1219.14 0 0 0 0 -196.31 0 0 0 0 2176.05 0 0 0 0 0 0 0 0 0 0 0 0 0 0 0 
0 0 -1532.41 0 -1109.27 1010.24 -617.313 0 1798.99 0 2081.59 0 1693.09 0 0 0 0 1428.5 0 1549.96 0 0 1963.33 0 0 0 -1076.31 0 0 0 0 956.374 0 0 0 0 0 0 0 0 0.06 1057.08 -101.245 0 0 0 0 0 0 0 0 0 0 0 0 0 0 0 0 0 0 1167.87 0 0 0 0 0 0 0 0 1446.5 0 0 0 -460.601 0 0 1417.97 0 0 -1385.92 0 
0 0 0 -1257.29 0 1764.35 -1050.37 -2246.24 -331.355 2218.62 0 0 0 0 0 0 0 0 0 0 0 0 0 0 0 0 -2167.65 0 0 0 0 1161 0 1294.52 0 2442.78 0 0 0 0 2442.78 0.03 0 0 0 0 596.866 0 0 717.261 0 1477.78 0 -509.43 0 0 0 0 -1980.57 0 0 0 0 0 0 0 0 0 0 0 0 0 0 0 0 2196.49 0 0 0 -83.2392 0 0 
0 2127.67 0 0 0 0 0 0 -1240.96 -2077.78 1333.74 0 0 0 0 0 0 0 0 0 0 0 0 0 537.355 -1925.64 0 0 0 0 0 0 0 2393.8 0 2308.34 0 -1167.71 0 0 1932.66 0 0 0 0 0 0 0 0 0 1576.2 0 0 0 0 0 0 0 0 0 0 0 1825.24 0 0 0 0 0 0 0 0 0 270.775 0 0 -2018.11 0 -1292.23 0 1346.4 0 0 
0 0 0 0 0 0 0 0 0 755.409 0 0 0 0 0 0 0 0 0 -2424.16 0 0 0 2462.46 0 0 0 0 0 0 0 692.694 1940.14 0 0 0 921.43 0 0 0 0 0 0 0.05 0 0 0 0 0 0 0 0 0 0 0 -2047.87 0 0 1584.6 676.519 0 0 0 0 0 -884.35 0 0 1458.1 0 0 0 0 0 0 0 0 0 0 0 0 0 
0 0 0 0 0 -1781.59 0 0 0 0 2367.24 0 0 0 0 0 0 0 -751.442 -1517.15 0 0 -887.86 0 0 0 0 0 -1828.59 0 0 0 0 0 0 2375.48 0 1051.13 0 0 0 0 0 0 0 0 1426.66 0 0 0 0 0 0 0 0 0 0 0 0 0 0 0 1916.03 0 0 0 0 0 0 0 -234.458 0 -158.925 0 0 0 0 0 0 1740.39 0 0 
0 0 -1363.64 0 0 0 0 0 0 0 0 0 0 0 0 1259.27 0 1899.7 0 0 0 0 0 0 0 0 0 0 -767.159 0 0 0 -956.221 910.443 0 0 0 0 0 0 0 0 0 0 0 0.07 0 0 0 0 0 0 0 0 0 0 991.165 0 0 0 0 0 0 0 0 0 0 0 0 0 0 0 0 0 0 0 0 -205.771 0 0 0 0 
2179.56 0 0 0 0 0 0 0 0 0 -2152.24 -1175.19 0 0 0 411.924 0 0 0 0 0 474.181 0 0 0 -964.614 0 0 0 0 0 0 0 0 0 0 0 0 0 0 0 2007.13 0 0 2353.21 0 0.07 0 0 1361.35 0 0 0 -1876.35 0 0 0 0 0 0 0 0 0 0 126.118 0 0 0 0 0 0 0 0 0 0 0 0 0 0 0 0 0 
1118.88 0 0 1520.2 0 969.192 0 0 0 -268.792 0 0 0 0 1370.2 0 0 0 0 0 0 0 0 1577.43 0 0 0 0 0 0 0 0 420.316 394.375 0 0 0 0 0 0 0 0 0 0 0 0 0 0.03 0 0 0 0 2489.32 0 0 0 0 0 0 0 0 0 0 0 0 0 0 0 0 0 2277.83 -901.288 0 0 0 0 0 0 0 615.024 0 0 
0 0 0 0 0 0 -1048.39 0 0 0 2410.73 0 0 0 1710.18 0 0 0 0 -2204.89 0 0 0 0 -903.729 0 2173.3 -800.577 0 0 0 0 0 0 526.826 0 1590.85 0 0 0 0 0 0 0 0 0 0 0 0.04 0 0 0 0 -1027.79 0 0 0 1851.33 0 -1738.11 0 0 0 0 0 0 0 0 0 0 0 0 0 0 -1329.31 0 0 0 0 0 0 0 
0 -519.654 0 0 0 0 0 0 0 2461.09 0 0 0 -55.7726 62.7918 0 686.132 0 0 0 0 0 0 0 0 0 0 0 0 0 -358.974 0 0 0 0 0 0 0 0 0 0 1273.46 0 0 0 0 -725.501 0 0 0.04 0 0 0 0 0 0 0 0 0 0 0 0 0 0 0 0 0 0 0 0 0 0 0 0 1453.06 0 0 0 0 0 0 0 
0 0 0 0 0 2200.16 0 0 0 0 0 0 0 0 0 0 0 0 0 0 0 0 0 0 -2039.63 0 0 778.603 0 0 0 2350.92 0 0 0 0 0 0 0 0 0 0 1390.96 0 0 0 0 0 0 0 0 0 0 0 0 0 0 0 0 0 0 0 0 -739.692 0 0 0 1784.8 0 0 0 0 0 0 0 0 0 0 0 0 782.876 358.516 
0 0 -1487.85 0 0 0 0 0 0 0 0 0 2117.6 0 1420.87 0 0 0 -70.4215 0 0 0 0 1942.73 0 0 0 0 0 -1405.45 -412.687 1844 0 0 0 0 0 0 0 0 0 -533.54 0 0 0 0 0 0 0 0 0 0.02 0 0 0 0 0 0 0 0 0 0 1363.19 0 0 0 0 0 0 0 0 0 0 0 0 0 0 0 0 0 0 0 
0 0 1571.47 0 0 0 0 0 0 0 0 0 0 0 0 0 0 -1353.72 0 0 0 0 0 0 0 0 0 0 0 0 0 0 0 0 728.248 -664.159 0 0 0 0 0 0 0 0 0 0 0 1841.87 0 0 0 0 0.03 0 2363.73 0 0 0 0 0 373.928 0 1064.71 0 0 0 0 0 0 0 0 0 0 0 0 0 0 0 0 -662.175 -1652.5 0 
0 0 0 0 0 0 0 0 0 0 0 0 0 0 0 0 0 0 0 0 0 0 0 0 0 0 267.876 0 2112.57 2099.29 0 0 0 0 0 0 125.813 -547.426 0 0 0 384.152 0 0 0 0 589.236 0 -1252.71 0 0 0 0 0 0 0 0 0 0 0 0 0 0 0 -427.488 0 -818.278 0 0 0 0 0 0 0 0 0 0 0 0 0 0 0 
0 0 0 0 0 -1128.8 0 0 0 0 0 0 0 2274.32 996.2 0 0 0 0 0 0 0 1529.21 0 0 0 0 0 0 0 0 0 0 705.817 0 -978.042 0 0 0 983.84 0 0 0 0 0 0 0 0 0 0 0 0 -1473.66 0 0.07 0 0 0 0 0 0 0 0 0 0 -1201.9 0 -595.035 0 0 1116.14 2203.05 0 0 0 0 0 0 0 0 0 0 
-2279.81 0 0 0 0 0 0 0 0 1841.41 0 1430.94 0 0 0 0 0 0 0 -1079.36 0 0 0 0 0 -527.436 0 0 0 0 0 0 0 0 0 1401.33 0 488.22 0 0 0 0 0 1906.87 0 0 0 0 0 0 0 0 0 0 0 0 0 0 0 0 0 0 0 0 0 -1895.73 0 0 -264.214 0 0 0 0 1581.7 0 0 0 0 0 0 0 0 
0 0 1595.74 0 0 0 0 0 0 0 0 0 0 0 0 0 -2415.01 0 0 0 0 -1341.82 0 0 0 897.473 0 0 0 0 0 0 0 0 0 -429.014 0 -45.2437 0 2453.46 0 0 0 0 0 2385.56 0 0 0 0 0 0 0 0 0 0 0.02 0 0 0 0 0 0 0 2009.26 0 0 0 0 0 0 0 0 0 0 47.2274 0 -755.104 1177.02 0 0 0 
0 0 0 2440.34 0 0 0 0 0 0 -389.34 0 0 0 0 0 0 0 -248.65 0 0 0 0 838.572 0 0 0 0 0 0 0 0 1829.66 0 0 -1874.68 0 0 0 0 0 0 0 0 0 0 0 0 -535.676 0 0 0 0 0 0 0 0 0.08 240.41 125.202 0 0 0 0 724.586 0 -529.572 0 0 0 0 0 0 0 0 0 0 0 0 0 0 2347.1 
0 -160.298 0 0 0 0 0 0 1443.75 0 0 0 0 -565.127 0 0 1874.68 0 -1036.79 0 0 0 0 0 0 0 0 0 0 0 0 0 0 0 -964.766 0 0 0 494.629 0 0 -88.1222 0 1647.92 0 0 0 0 0 0 0 0 0 0 0 0 0 728.401 0.09 -573.214 0 0 0 0 0 0 0 0 0 0 0 0 0 -1029.47 0 0 0 0 0 0 0 0 
0 0 0 0 0 0 0 0 480.895 0 0 1595.43 0 0 0 0 0 0 0 0 1127.43 0 0 0 0 -2048.48 0 0 0 0 0 0 0 681.097 0 1096.15 0 0 727.18 0 0 0 0 348.903 0 0 0 0 658.055 0 0 0 0 0 0 0 0 -1030.69 -1065.78 0.03 0 0 0 0 0 0 0 0 0 0 0 0 0 0 0 0 0 0 0 0 0 0 
0 0 150.99 0 0 83.697 0 0 994.064 0 0 0 0 0 0 0 0 0 0 0 0 0 0 0 0 0 1485.72 0 0 0 0 0 0 0 0 0 0 2351.99 0 0 0 0 0 0 0 0 0 0 0 0 0 0 -384.457 0 0 0 0 0 0 0 0 0 0 0 0 0 0 0 0 0 0 0 0 0 0 0 0 0 1686.22 0 0 0 
0 0 0 0 0 0 0 0 0 0 0 0 0 0 0 0 0 16.5563 0 0 0 0 0 -1572.54 2328.79 0 -1730.93 0 0 0 0 2252.04 2225.49 0 0 0 0 0 0 718.329 -478.912 0 0 0 0 0 0 0 0 0 0 0 0 0 0 0 0 0 0 0 0 0.04 0 0 0 0 0 2074.57 1986.07 0 0 0 0 -570.009 0 0 0 0 -108.57 0 0 -2263.18 
0 0 0 0 0 0 0 0 0 -506.531 0 0 0 0 0 -2451.17 0 0 0 0 0 0 0 0 0 0 1765.27 0 0 0 2296.59 0 0 1321.68 0 0 0 0 0 0 0 0 2210.38 0 1642.58 0 0 0 0 0 0 1962.57 1396.3 0 0 0 0 0 0 0 0 0 0.08 0 0 0 0 0 -1495.94 0 0 303.125 0 0 0 693.152 0 0 -1952.19 0 0 0 
2.21259 0 0 0 0 793.405 0 145.955 0 0 0 0 0 2441.1 0 0 0 0 0 0 0 0 0 0 0 816.904 0 0 0 0 0 0 794.778 0 0 0 -2073.81 0 2394.25 0 0 0 0 0 0 0 0 0 0 0 -2373.5 0 0 0 0 0 0 0 0 0 0 0 0 0.02 0 0 0 0 0 0 0 0 0 0 0 0 1213.03 0 0 0 0 0 
-658.208 0 0 0 0 0 0 0 0 0 0 0 0 0 0 0 0 0 0 0 931.806 0 0 0 0 0 0 0 0 0 0 0 0 0 0 0 0 0 0 0 0 0 0 0 0 0 -1618.02 0 0 0 0 0 0 2221.06 0 0 2208.09 -647.832 0 0 0 0 0 0 0.07 0 0 0 1428.19 0 0 -775.399 2181.08 -420.621 0 0 224.082 0 0 0 0 0 
0 -629.673 0 0 0 0 0 0 0 0 0 -171.59 0 -1025.5 678.808 0 0 0 0 0 0 0 2039.02 0 0 0 0 107.196 0 0 0 0 0 0 0 0 0 0 0 0 0 0 0 -1343.81 0 0 0 0 0 0 0 0 0 0 -210.959 2427.21 0 0 0 0 0 0 0 0 0 0.07 -749.458 0 0 0 0 0 0 0 0 2466.73 0 -2342.07 1539.12 0 0 0 
0 0 0 0 0 0 1983.17 0 0 -559.481 0 0 0 0 0 0 0 1493.96 0 1259.58 0 0 0 0 0 -957.9 0 1991.26 0 0 0 0 0 0 0 0 0 -1128.04 0 1587.04 0 0 0 0 0 0 0 0 0 0 0 0 0 1811.5 0 0 0 -1571.32 0 0 0 0 0 0 0 1108.81 0.01 0 0 0 0 0 0 0 0 0 0 0 0 0 0 0 
0 0 777.841 0 0 0 0 0 0 0 0 0 0 0 0 0 0 0 0 0 0 0 0 -1505.71 0 0 0 2494.96 0 0 0 0 0 -105.06 0 0 0 0 -2393.64 0 0 0 0 0 0 0 0 0 0 0 2200.31 0 0 0 -2313.38 0 0 0 0 0 0 938.063 0 0 0 0 0 0.08 1582.16 0 0 0 0 0 0 0 0 -2261.5 0 0 0 0 
0 0 -331.507 0 0 0 0 0 0 0 0 0 -1575.59 0 0 0 0 0 0 0 0 0 1969.13 0 2438.96 0 0 0 0 568.178 0 0 0 0 191.885 0 0 0 0 0 0 0 0 -1917.4 0 0 0 0 0 0 0 0 0 0 0 -1409.27 0 0 0 0 0 434.202 2038.1 0 900.983 0 0 -593.814 0.06 0 0 0 0 0 0 0 0 0 0 -191.885 0 0 
0 0 1873.45 0 0 -2366.33 0 0 0 2030.47 2483.83 0 0 0 0 0 0 0 0 0 0 0 0 0 0 0 0 0 0 0 0 0 2001.63 0 0 0 885.418 0 0 0 0 0 0 0 0 0 0 0 0 0 0 0 0 0 0 0 0 0 0 0 0 0 0 0 0 0 0 0 0 0.02 0 0 0 0 0 0 0 0 -973.617 0 0 1071.28 
0 0 0 0 0 0 0 0 0 0 0 0 0 0 0 0 0 0 0 0 0 1772.44 -2217.09 0 0 0 0 0 0 0 0 2463.38 0 0 0 0 0 0 0 0 1124.23 0 0 0 -231.864 0 0 -915.174 0 0 0 0 0 0 1157.64 0 0 0 0 0 0 0 0 0 0 0 0 0 0 0 0.07 0 0 1021.38 0 0 0 0 0 1683.63 0 0 
0 0 0 0 0 -1455.2 2011.25 0 0 0 0 0 0 1726.05 0 0 0 -2117.15 0 0 0 0 0 0 0 0 0 0 0 -268.487 0 0 0 0 0 0 0 0 2383.57 0 0 0 0 0 0 0 0 -1744.97 0 0 0 0 0 0 -1782.2 0 0 0 0 0 0 0 2366.02 0 -632.115 0 0 0 0 0 0 0.06 0 0 0 0 0 2236.47 0 0 360.958 0 
0 0 0 1613.74 0 0 1851.02 0 0 0 0 0 0 0 0 0 -1462.68 0 0 0 0 0 0 2376.4 0 1679.36 0 0 0 0 0 0 0 -587.863 0 0 0 0 0 0 0 0 -1595.43 0 -1656.47 0 0 0 0 0 0 0 0 0 0 0 0 0 0 0 0 0 0 0 1770.76 0 0 0 0 0 0 0 0.09 0 -488.678 -1465.88 0 0 0 0 0 0 
2059.77 0 0 0 0 0 0 0 0 2001.94 0 0 0 0 0 1434.45 0 -220.573 0 0 2056.41 0 0 -747.475 0 0 0 0 0 -1266.9 0 0 0 0 0 0 0 0 0 0 0 0 0 0 0 0 0 0 0 0 0 0 0 0 0 -1369.75 0 0 1222.65 0 0 2121.88 0 0 2396.39 0 0 0 0 0 2427.98 0 0 0.06 0 -290.918 0 0 0 1587.5 0 -1147.88 
0 0 0 0 0 0 0 0 0 0 -1680.88 0 1059.68 0 0 0 0 0 0 0 0 0 0 0 1589.63 0 0 0 0 0 0 0 0 0 0 0 0 2312.62 0 0 441.069 0 0 0 0 0 0 0 1492.89 364.467 0 0 0 0 0 0 0 0 0 0 0 0 0 0 0 0 0 0 0 0 0 0 888.623 0 0 2106.92 0 0 0 0 0 -441.374 
0 1077.68 0 -1855.14 0 0 0 0 0 0 0 0 0 0 0 21.2867 73.3207 0 0 2288.35 0 0 824.686 -1991.1 0 0 0 0 0 0 0 0 0 0 0 0 0 0 0 0 0 1777.32 -874.889 0 0 0 0 0 0 0 0 0 0 0 0 0 78.0511 0 0 0 0 0 -605.716 0 0 -1138.11 0 0 0 0 0 0 1793.8 1863.38 -1062.27 0.07 0 0 0 0 0 0 
0 0 -1175.8 0 0 0 0 0 0 0 0 0 0 0 0 0 -8.62148 0 0 0 0 0 0 381.1 2311.85 -346.919 0 0 0 0 0 1542.48 0 0 0 0 0 0 0 0 0 0 0 0 0 0 0 0 0 0 0 0 0 0 0 0 0 0 0 0 0 0 0 -1972.03 1657.84 0 0 0 0 0 0 0 0 0 0 0 0 0 0 0 0 0 
152.516 0 0 0 0 0 0 0 1174.43 0 0 486.999 0 0 0 0 0 0 0 0 0 0 0 0 0 0 -1226.31 0 0 0 865.734 0 0 0 0 0 0 0 695.593 0 2156.82 0 1052.96 0 0 231.559 0 0 0 0 0 0 0 0 0 0 -2373.35 0 0 0 0 0 0 0 0 2185.05 0 2275.69 0 0 0 -1228.45 0 0 0 0 0 0.09 0 -2105.4 0 0 
0 0 0 0 0 0 0 0 0 0 0 0 0 -1398.13 0 0 0 0 0 0 0 0 0 0 0 0 2472.84 0 0 -1103.02 0 0 0 720.313 0 0 -1583.38 0 857.494 0 0 0 0 0 0 0 0 0 0 0 0 0 0 0 0 0 948.134 0 0 0 2326.65 145.039 96.057 0 0 -641.575 0 0 0 -608.463 0 0 0 0 0 0 0 0 0.05 0 0 0 
0 1767.4 751.747 0 0 0 0 0 0 0 0 0 0 0 0 0 0 0 0 0 0 -846.355 0 0 0 0 0 0 2433.32 0 0 0 0 0 0 0 -636.845 0 0 0 0 977.737 1569.03 0 830.943 0 0 1581.39 0 0 0 0 581.301 0 0 0 0 0 0 0 0 0 0 0 0 0 0 0 1831.19 0 -1351.28 0 0 1562.93 0 0 0 -180.288 0 0.05 0 0 
0 -1784.34 0 0 0 0 0 0 1029.01 0 0 0 0 0 0 0 0 0 0 0 0 0 0 0 0 0 0 2131.03 1853.62 0 0 0 0 0 849.712 0 0 0 0 0 1210.9 0 0 0 0 0 0 0 0 0 2169.18 0 -1461.61 0 0 0 0 0 0 0 0 0 0 0 0 0 0 0 0 0 0 -2338.4 0 0 0 0 0 0 0 0 0.05 0 
0 0 0 1776.41 777.078 0 0 0 0 0 0 0 0 0 2459.72 0 0 0 0 0 514.313 0 0 0 0 0 0 0 0 0 -293.97 0 0 971.633 0 0 0 0 0 0 0 0 0 0 0 0 0 0 0 0 1908.4 0 0 0 0 0 0 -153.584 0 0 0 842.54 0 0 0 0 0 0 0 -1179.46 0 0 0 1815.62 2457.88 0 0 0 0 0 0 0 
