*Vertices 51
*Matrix 
0.02 0 0 0 0 0 0 0 0 0 0 0 0 0 0 -508.972 -43.1074 -1155.35 0 0 0 0 0 0 0 311.518 0 0 0 0 2417.29 0 1853.16 0 0 0 -1336.18 0 0 0 728.706 0 0 56.5355 0 0 0 0 0 0 0 
0 0.07 0 0 0 0 0 0 0 1202.35 0 0 455.565 1760.23 0 0 1011 0 0 0 0 0 0 0 0 0 0 0 0 0 -807.291 0 0 0 0 0 0 0 0 0 0 0 0 0 69.9637 1864.91 0 0 51.0422 0 0 
0 0 0.09 0 0 1943.8 0 0 -1831.95 0 0 0 549.409 -532.472 0 0 0 0 0 0 0 0 0 0 1075.24 0 0 0 0 0 0 0 0 0 0 0 1880.32 0 -851.848 0 0 0 0 0 0 0 0 0 2116.53 0 0 
0 0 0 0.09 0 0 0 0 0 0 0 0 0 0 0 0 0 0 0 0 0 0 0 0 0 0 0 2226.55 0 0 0 0 1108.2 -2348.32 0 0 0 0 0 0 760.445 0 0 0 0 0 0 2261.8 1112.17 0 0 
0 0 0 0 0.07 0 0 0 0 0 0 0 0 0 0 0 0 0 0 0 0 0 -697.272 0 1099.51 0 0 1219.75 862.835 0 0 0 0 0 0 0 0 0 0 0 917.92 0 0 0 0 0 0 0 1089.59 0 0 
0 0 2037.95 0 0 0.04 0 0 0 0 0 0 0 0 0 1230.28 0 0 0 0 0 0 0 0 0 0 0 0 0 0 0 334.254 0 0 -855.205 0 0 0 0 0 0 -234.916 0 0 1818.52 0 0 0 0 0 0 
0 0 0 0 0 0 0.04 379.269 0 0 0 0 0 0 0 0 0 0 0 0 0 0 0 0 0 0 0 0 0 0 0 0 0 0 6.02741 0 0 0 0 0 608.921 0 0 0 0 768.38 0 76.5252 0 1338.31 0 
0 0 0 0 0 0 -1906.87 0 2014.45 0 0 -817.057 0 -2116.23 0 -1657.69 0 0 0 0 0 0 0 2157.89 0 0 0 0 0 1580.78 0 0 0 0 -540.406 0 0 0 0 0 0 2194.81 0 0 0 0 1283.38 0 0 0 0 
0 0 733.589 0 0 0 0 -1114.61 0.05 0 0 0 0 0 0 0 0 -323.42 0 0 0 0 0 0 0 0 0 0 0 -651.036 0 2257.53 0 0 0 0 0 0 0 0 0 0 0 0 -76.8303 1070.21 0 0 0 0 1122.24 
0 157.857 0 0 0 0 0 0 0 0.06 0 0 0 1590.7 0 1567.05 0 0 2318.72 0 0 0 0 0 0 0 361.263 0 0 0 0 -2236.47 0 1364.41 0 0 0 0 0 -603.732 0 0 0 0 -1677.53 0 0 0 0 0 0 
0 0 0 0 0 0 0 0 0 0 0.02 0 0 0 0 0 0 0 0 0 0 0 0 -2292.93 0 2415.16 0 0 0 1295.59 0 0 0 0 0 0 0 0 0 0 0 0 0 -1707.89 0 0 0 0 0 0 0 
0 0 0 0 0 0 0 -1150.32 0 0 0 0.08 0 0 0 0 0 0 0 0 939.436 0 0 0 0 0 0 0 0 0 0 0 -1485.87 0 0 0 0 0 0 0 0 0 0 1920.3 0 -124.439 1058.31 0 0 0 0 
0 -2283.93 -1305.35 0 0 0 0 0 0 0 0 0 0 0 0 0 0 0 0 0 0 0 0 0 0 0 639.744 0 0 0 0 0 814.768 2490.23 0 0 0 0 0 0 0 0 0 0 0 0 0 0 0 0 0 
0 -1315.73 -238.731 0 0 0 0 2366.02 0 1164.82 0 0 0 0.05 0 0 0 0 0 0 0 0 1405.61 0 0 0 0 0 0 0 0 0 1857.59 0 0 0 2091.66 0 -1100.27 0 0 0 0 0 0 0 0 0 0 0 0 
0 0 0 0 0 0 0 0 0 0 0 0 0 0 0.03 0 0 0 -1418.12 0 0 2353.21 0 0 0 2161.7 0 -106.433 1993.24 0 0 0 0 0 0 0 0 0 0 0 0 1829.81 1203.27 0 0 0 0 0 0 0 0 
2241.2 0 0 0 0 2495.57 0 2122.79 0 -389.035 0 0 0 0 0 0.05 -1955.09 0 0 2318.26 0 0 0 748.848 -1313.44 0 0 0 2230.52 0 0 2051.07 0 0 -1628.39 0 0 0 0 0 0 0 1853.01 2091.51 0 0 0 0 0 0 0 
747.475 -993.149 0 0 0 0 0 0 0 0 0 0 0 0 0 438.475 0 0 0 529.878 0 0 0 0 0 1895.12 0 0 0 0 380.184 0 0 0 0 0 0 0 0 0 0 0 0 0 0 0 0 0 0 -100.787 0 
-1467.41 0 0 0 0 0 0 0 1123.31 0 0 0 0 0 0 0 0 0.05 0 0 0 0 0 -2265.92 0 0 0 0 0 0 0 0 0 0 -817.209 0 0 0 0 1123.46 0 0 0 0 0 2006.06 0 0 708.869 -565.584 0 
0 0 0 0 0 0 0 0 0 74.2363 0 0 0 0 -761.513 0 0 0 0 0 0 0 0 0 0 0 0 0 -378.506 0 0 0 2402.95 -527.589 0 0 0 0 0 0 0 0 0 0 0 0 0 0 0 0 0 
0 0 0 0 0 0 0 0 0 0 0 0 0 0 0 -22.3548 -1162.22 0 0 0.02 0 1607.18 0 0 0 0 0 -932.112 0 0 0 0 0 -291.681 0 0 0 0 920.209 0 0 -165.487 0 0 0 0 0 0 1444.67 0 0 
0 0 0 0 0 0 0 0 0 0 0 1566.74 0 0 0 0 0 0 0 0 0.03 0 0 0 0 -834.758 0 0 0 0 2385.86 0 0 0 0 0 0 0 0 754.799 0 0 0 0 0 0 0 0 0 0 0 
0 0 0 0 0 0 0 0 0 0 0 0 0 0 2191.31 0 0 0 0 2415.16 0 0.07 0 0 0 0 457.701 0 0 0 0 0 471.74 141.072 664.617 0 0 0 -460.448 -2175.28 0 0 0 0 0 0 0 0 0 1694.62 0 
0 0 0 0 -252.312 0 0 0 0 0 0 0 0 1315.27 0 0 0 0 0 0 0 0 0.03 0 0 0 0 2202.14 0 0 0 0 0 0 0 689.947 0 0 0 0 1796.85 0 0 0 0 0 0 0 0 0 0 
0 0 0 0 0 0 0 1395.38 0 0 -324.488 0 0 0 0 -2366.48 0 2356.41 0 0 0 0 0 0.09 0 -966.14 0 0 0 0 0 0 0 0 0 0 0 0 0 0 0 0 0 0 0 265.13 0 0 1610.23 0 0 
0 0 1711.25 0 1736.12 0 0 0 0 0 0 0 0 0 0 328.761 0 0 0 0 0 0 0 0 0.03 0 -1111.56 -262.23 0 0 1121.02 0 0 0 0 0 0 0 -1920.3 0 0 0 -77.7459 0 0 0 0 0 0 0 736.335 
-1166.19 0 0 0 0 0 0 0 0 0 662.938 0 0 0 2079.76 0 -596.866 0 0 0 1347.16 0 0 1295.28 0 0.03 0 0 0 0 0 288.781 0 0 0 0 0 0 0 0 0 0 0 -1082.42 0 0 1009.48 0 0 0 0 
0 0 0 0 0 0 0 0 0 74.0837 0 0 -1365.17 0 0 0 0 0 0 0 0 688.116 0 0 2459.72 0 0.07 0 0 0 0 0 0 0 0 -406.278 381.558 0 1297.27 0 0 1696.14 0 0 0 0 0 -423.063 0 0 0 
0 0 0 893.048 -956.526 0 0 0 0 0 0 0 0 0 1078.14 0 0 0 0 -844.829 0 0 1161.76 0 -1678.9 0 0 0.01 0 0 0 -1144.83 0 0 0 0 0 0 0 0 0 0 365.23 0 0 1566.9 0 0 0 1490.6 0 
0 0 0 0 -1448.79 0 0 0 0 0 0 0 0 0 1054.8 233.543 0 0 1325.34 0 0 0 0 0 0 0 0 0 0.07 0 0 0 0 0 0 0 0 0 0 0 0 0 0 0 0 1330.53 0 0 -165.334 500.58 1530.43 
0 0 0 0 0 0 0 -55.62 -2422.94 0 1868.57 0 0 0 0 0 0 0 0 0 0 0 0 0 0 0 0 0 0 0.05 0 0 0 0 0 0 606.479 0 0 0 0 0 0 0 608.31 0 1492.13 -1940.44 0 0 0 
2170.55 2409.97 0 0 0 0 0 0 0 0 0 0 0 0 0 0 909.68 0 0 0 5.87481 0 0 0 1424.83 0 0 0 0 0 0.02 0 0 0 0 0 -1299.25 0 0 0 0 0 0 0 0 2278.59 0 0 0 562.075 2416.84 
0 0 0 0 0 2334.44 0 0 1444.06 1170.61 0 0 0 0 0 2351.68 0 0 0 0 0 0 0 0 0 -1828.29 0 -1205.25 0 0 0 0.02 0 0 -1990.49 0 0 0 951.949 0 331.965 0 2195.88 0 0 0 0 -112.995 0 0 0 
2203.67 0 0 1410.49 0 0 0 0 0 0 0 677.129 -1904.28 238.273 0 0 0 0 414.365 0 0 95.9044 0 0 0 0 0 0 0 0 0 0 0.02 0 0 0 0 0 0 0 0 0 0 0 -1090.35 0 0 0 0 0 0 
0 0 0 -1275.75 0 0 0 0 0 401.242 0 0 2232.66 0 0 0 0 0 -1810.43 2322.99 0 -1744.36 0 0 0 0 0 0 0 0 0 0 0 0 0 0 0 0 0 0 0 0 799.051 0 1873.45 0 0 0 1048.54 0 0 
0 0 0 0 0 1808.91 2233.88 212.18 0 0 0 0 0 0 0 1046.25 0 258.568 0 0 0 1139.64 0 0 0 0 0 0 0 0 0 -307.245 0 0 0.01 -1991.26 0 0 0 0 1958.14 1470.15 0 0 0 2384.95 0 0 -1437.35 -1071.73 -1581.39 
0 0 0 0 0 0 0 0 0 0 0 0 0 0 0 0 0 0 0 0 0 0 992.843 0 0 0 877.483 0 0 0 0 0 0 0 2356.56 0.04 0 0 0 0 0 0 0 0 0 1429.26 0 0 0 0 0 
-2220.15 0 654.546 0 0 0 0 0 0 0 0 0 0 1846.29 0 0 0 0 0 0 0 0 0 0 0 0 -793.863 0 0 974.532 1928.39 0 0 0 0 0 0.05 0 0 0 0 0 0 0 0 0 0 0 0 0 0 
0 0 0 0 0 0 0 0 0 0 0 0 0 0 0 0 0 0 0 0 0 0 0 0 0 0 0 0 0 0 0 0 0 0 0 0 0 0.02 0 0 -527.436 -821.787 0 0 0 0 0 2444.61 0 0 0 
0 0 -518.586 0 0 0 0 0 0 0 0 0 0 974.99 0 0 0 0 0 954.543 0 966.445 0 0 -151.601 0 1699.96 0 0 0 0 -135.731 0 0 0 0 0 0 0.06 0 0 0 0 0 0 0 0 0 0 0 0 
0 0 0 0 0 0 0 0 0 2382.05 0 0 0 0 0 0 0 1315.12 0 0 2121.42 149.922 0 0 0 0 0 0 0 0 0 0 0 0 0 0 0 0 0 0.01 0 0 0 1845.38 0 0 0 0 0 1496.09 0 
-2337.49 0 0 1728.49 1393.4 0 -717.261 0 0 0 0 0 0 0 0 0 0 0 0 0 0 0 1994.46 0 0 0 0 0 0 0 0 418.332 0 0 1027.63 0 0 -1760.38 0 0 0.01 0 1165.12 0 0 0 0 0 0 0 0 
0 0 0 0 0 -992.386 0 2359.31 0 0 0 0 0 0 1085.31 0 0 0 0 719.245 0 0 0 0 0 0 1436.12 0 0 0 0 0 0 0 2247.76 0 0 1081.8 0 0 0 0.07 0 0 0 0 0 0 0 0 1452.45 
0 0 0 0 0 0 0 0 0 0 0 0 0 0 1504.64 2199.09 0 0 0 0 0 0 0 0 -1159.02 0 0 -356.075 0 0 0 1096.91 0 621.586 0 0 0 0 0 0 -2206.72 0 0.06 0 0 0 0 0 0 0 0 
397.275 0 0 0 0 0 0 0 0 0 -1844.77 579.775 0 0 0 781.198 0 0 0 0 0 0 0 0 0 707.801 0 0 0 0 0 0 0 0 0 0 0 0 0 1214.87 0 0 0 0.06 1613.44 0 0 0 0 0 0 
0 -15.7933 0 0 0 1961.2 0 0 -94.5311 2459.41 0 0 0 0 0 0 0 0 0 0 0 0 0 0 0 0 0 0 0 37.4615 0 0 -764.26 2324.82 0 0 0 0 0 0 0 0 0 -1182.82 0.03 0 0 0 0 0 0 
0 1733.99 0 0 0 0 -916.089 0 1208.15 0 0 1475.49 0 0 0 0 0 1703.47 0 0 0 0 0 -44.3281 0 0 0 1680.73 2438.2 0 1143.15 0 0 0 54.5518 -932.722 0 0 0 0 0 0 0 0 0 0 -1128.19 0 0 0 0 
0 0 0 0 0 0 0 2303.16 0 0 0 -887.707 0 0 0 0 0 0 0 0 0 0 0 0 0 1906.57 0 0 0 1651.59 0 0 0 0 0 0 0 0 0 0 0 0 0 0 0 -2427.37 0.01 0 0 0 0 
0 0 0 2014.45 0 0 1732 0 0 0 0 0 0 0 0 0 0 0 0 0 0 0 0 0 0 0 569.857 0 0 -511.109 0 999.405 0 0 0 0 0 2454.99 0 0 0 0 0 0 0 0 0 0.01 0 0 0 
0 2117.15 1058.31 -591.983 381.1 0 0 0 0 0 0 0 0 0 0 0 0 1968.98 0 -2239.68 0 0 0 -602.359 0 0 0 0 -1823.4 0 0 0 0 -123.371 901.135 0 0 0 0 0 0 0 0 0 0 0 0 0 0.01 0 0 
0 0 0 0 0 0 -471.282 0 0 0 0 0 0 0 0 0 1563.69 793.71 0 0 0 -65.8437 0 0 0 0 0 1813.64 894.116 0 1638.92 0 0 0 1751.69 0 0 0 0 -1342.43 0 0 0 0 0 0 0 0 0 0.06 0 
0 0 0 0 0 0 0 0 151.601 0 0 0 0 0 0 0 0 0 0 0 0 0 0 0 1536.38 0 0 0 2225.33 0 -839.183 0 0 0 -1981.19 0 0 0 0 0 0 1753.52 0 0 0 0 0 0 0 0 0.09 
