*Vertices 63
*Matrix 
0.07 0 1843.39 0 0 0 -1354.95 0 0 0 0 -817.057 1088.67 0 0 909.375 0 195.547 591.678 0 0 0 999.405 0 0 0 0 0 0 2454.07 0 0 0 0 0 0 0 0 0 0 0 -217.063 0 0 0 -916.547 0 0 0 2387.54 0 0 0 0 0 0 -3.73852 0 0 1881.54 0 0 0 
0 0.04 0 0 879.62 0 0 0 0 -1044.42 0 0 0 0 0 -281.915 0 1007.8 0 0 0 0 1590.55 0 788.064 0 0 0 0 574.587 0 0 0 0 0 0 0 -520.417 0 0 0 1968.98 0 0 0 -503.632 0 0 0 0 0 0 322.504 0 -643.559 0 0 0 0 0 0 0 0 
2379.15 0 0.02 0 1150.47 0 -418.18 0 0 1868.57 0 0 0 0 -945.387 -2238 0 0 0 2286.52 2060.38 0 0 0 0 -1382.87 0 0 0 0 -1800.67 0 0 0 1641.67 -152.364 0 1026.57 43.5652 0 -901.135 0 0 0 1654.18 0 532.167 0 2291.71 1565.98 0 0 0 -2069.84 -1072.34 0 -1442.23 0 0 0 0 -1773.05 0 
0 0 0 0.08 -173.574 -1457.64 0 0 0 0 1977.22 0 0 -1524.78 0 0 0 0 0 0.839259 0 1155.51 -1352.66 0 1898.63 0 0 0 0 0 0 0 1006.58 409.94 0 0 0 1127.12 1013.29 0 0 -1439.02 1969.28 0 -1841.26 0 0 0 0 0 -114.673 0 0 0 1710.33 0 0 0 0 0 0 0 0 
0 1735.51 1413.24 -2171.16 0.06 0 0 0 0 0 1359.98 0 0 0 0 0 605.869 0 0 2490.23 0 0 0 1416.29 0 0 1010.24 0 0 0 0 0 -1761.45 0 0 -2381.28 0 0 0 1891.92 0 -1898.63 1855.6 0 0 0 0 0 -1335.41 0 0 -1457.64 0 0 0 0 0 0 0 0 0 -582.369 0 
0 0 0 -763.955 0 0.07 0 0 0 0 0 0 0 0 0 1310.85 -449.309 0 0 -1441.47 -149.922 0 0 0 0 0 0 -177.694 0 376.675 0 0 0 0 0 0 395.749 0 0 0 0 0 0 0 0 0 0 0 0 0 234.001 0 0 0 0 0 2437.28 0 0 0 0 0 0 
34.7148 0 1511.51 0 0 0 0.05 0 0 0 0 0 0 -1255.91 741.676 0 0 0 0 0 0 0 0 0 0 0 0 0 0 -2128.74 0 0 0 0 2097.92 0 0 0 0 0 0 0 2497.25 0 0 -829.264 0 0 893.201 0 0 0 0 0 0 0 0 0 0 0 0 0 0 
0 0 0 0 0 0 0 0.09 0 0 0 0 0 -54.857 0 0 2326.04 0 0 0 0 0 0 0 1343.2 0 0 -1988.97 2071.83 0 -45.2437 1561.1 0 0 1409.12 0 0 0 -2015.82 0 0 0 -868.328 763.344 0 0 0 0 0 0 0 0 0 1499.45 2402.34 0 0 1694.31 0 0 0 0 0 
0 0 0 0 0 0 0 0 0.08 0 6.94296 1392.94 -1601.84 0 1299.55 0 0 -797.067 0 0 0 0 0 1737.65 0 0 0 0 -2102.04 0 0 0 201.804 0 0 -190.512 0 0 1095.84 0 0 0 0 -453.734 0 0 0 0 1559.57 0 0 0 0 0 0 0 0 0 1419.49 0 0 0 -1793.19 
0 1634.65 -2291.86 0 0 0 0 0 0 0.09 0 0 0 0 0 -706.885 0 2265.31 0 -1414.46 2142.48 0 900.83 0 0 0 2321.16 0 1281.09 -2442.78 0 0 0 0 0 -492.34 0 1481.29 -1409.12 0 0 631.962 0 0 0 0 0 2395.47 0 1713.54 2484.28 0 0 0 0 0 0 0 0 0 -503.021 0 1256.98 
0 0 0 -1686.83 -316.401 0 0 0 -784.86 0 0.09 0 0 0 1591.01 0 -717.872 0 1988.81 0 0 0 0 0 -248.039 484.71 0 0 0 0 0 0 0 0 0 914.258 0 0 0 0 0 0 0 0 0 0 0 732.368 0 0 0 0 1908.09 0 0 0 54.857 0 0 0 0 0 0 
2211.91 0 0 0 0 0 0 0 2100.97 0 0 0.06 1130.33 0 1634.04 0 0 0 0 -487.304 -1407.44 0 0 0 0 1811.5 0 0 0 0 -625.858 0 0 -1961.81 0 0 0 0 0 0 0 2088.92 0 0 0 0 0 0 0 0 0 0 1930.83 0 0 1640.29 951.338 0 -892.438 0 0 0 0 
1417.36 0 0 0 0 0 0 0 -558.718 0 0 205.008 0.06 -193.869 0 0 0 0 0 0 -109.027 0 783.944 0 0 0 811.258 0 0 0 0 0 0 158.01 0 0 56.0778 0 0 1112.32 0 0 0 0 0 0 0 1844.16 1125.75 0 1317.87 1653.26 0 0 0 0 0 0 0 0 0 0 -1679.97 
0 0 0 -1411.25 0 0 1683.02 -582.217 0 0 0 0 320.826 0 0 0 657.14 0 0 0 0 0 -1292.84 0 1170.61 0 0 0 -262.688 0 0 -547.731 0 0 0 0 0 -1321.38 1739.02 0 0 0 0 0 833.842 1930.52 0 268.181 0 0 -92.3948 0 0 -785.165 0 0 539.796 0 0 2476.65 0 0 0 
0 0 -109.027 0 0 0 -754.036 0 1927.32 0 -1983.78 1370.66 0 0 0.08 -730.384 329.829 0 0 1966.69 0 -1783.58 0 -2339.47 1466.49 0 0 0 1213.8 0 0 0 2409.82 -112.079 -1908.25 0 0 -1828.9 0 492.34 0 0 1979.51 0 0 0 0 0 0 1762.98 0 -521.027 0 1834.39 0 0 0 0 497.375 0 0 2259.36 0 
1765.42 267.113 468.688 0 0 -1761.91 0 0 0 2166.43 0 0 0 0 -437.254 0.02 0 0 0 -2197.56 0 697.577 1353.57 1580.32 0 0 -320.521 1183.13 0 0 0 383.694 -247.429 2118.67 0 -68.2852 0 0 0 0 0 0 -2071.98 0 0 -734.046 0 0 0 0 0 1709.42 0 0 0 0 261.773 0 -547.731 0 0 -124.287 235.984 
0 0 0 0 -1071.12 1199.15 0 1614.66 0 0 -2121.11 0 0 993.149 1056.02 0 0.03 0 0 0 0 0 0 2060.84 -790.658 0 0 0 1031.6 0 1522.19 0 0 0 0 0 500.275 -642.643 0 753.731 0 1604.74 43.8704 0 212.79 0 0 0 0 0 250.786 1947.46 0 -335.017 -1552.1 0 0 0 0 0 0 0 0 
1246.15 2034.29 0 0 0 0 0 0 -155.11 -143.971 0 0 0 0 0 0 0 0.08 0 1890.39 -1311.76 0 0 0 0 0 -1325.8 0 -1930.22 0 0 0 -457.701 0 1543.7 1652.2 0 -1139.48 0 0 1078.6 0 0 0 0 -163.808 0 -253.227 2401.58 2297.66 0 0 0 0 0 0 0 2005.6 0 -1289.94 0 0 0 
23.423 0 0 0 0 0 0 0 0 0 1667.46 0 0 0 0 0 0 0 0.04 0 1278.5 -531.709 0 -24.6437 0 0 0 0 0 0 0 0 0 2455.75 -1012.38 0 0 -243.614 0 428.098 -1325.34 0 0 821.787 0 0 0 0 0 0 0 2368.31 0 0 0 0 0 0 1898.18 0 0 239.952 0 
0 0 1061.82 1829.05 -143.361 1328.85 0 0 0 1766.18 0 2249.9 0 0 -2393.34 212.027 0 761.513 0 0.01 0 0 -977.737 -1437.65 1092.94 -939.131 0 0 0 0 0 0 548.036 1540.35 -1055.1 0 863.292 -1311.91 0 -443.358 -1981.03 -226.218 2214.19 1911.15 0 0 0 0 -243.767 0 0 0 0 0 0 0 0 -1974.62 0 0 0 0 0 
0 0 1319.39 0 0 -2207.02 0 0 0 2467.35 0 1313.9 1750.92 0 0 0 0 1038.47 1537.9 0 0.09 -2430.27 0 0 25.7118 0 2330.93 1901.07 0 0 0 0 1782.97 0 0 0 0 0 0 0 0 0 0 0 -785.318 0 0 0 0 0 0 0 0 0 0 0 0 0 -637.303 0 -746.559 -914.869 0 
0 0 0 -323.42 0 0 0 0 0 0 0 0 0 0 -1313.75 -1214.26 0 0 -1064.87 0 -1123.16 0.08 0 -1439.48 2395.93 0 0 0 0 0 0 0 2439.57 0 0 690.558 0 635.624 0 1987.75 0 -1777.47 0 0 -1240.35 1204.34 0 0 -1402.4 1052.35 0 -112.69 1115.68 0 0 0 1929.61 0 1487.55 0 0 0 -2341.46 
-435.575 799.814 0 -1917.25 0 0 0 0 0 -2415.62 0 0 2415.01 903.119 0 1182.36 0 0 0 694.83 0 0 0.05 0 0 0 0 0 0 0 0 0 -1299.4 -967.208 0 2280.42 0 0 0 0 1700.11 0 763.192 0 0 0 0 -1215.17 0 0 0 -1909.47 0 0 0 0 -925.092 1470.61 2124.01 0 0 0 0 
0 0 0 0 1052.35 0 0 0 595.34 0 0 0 0 0 285.882 2222.13 1787.09 0 1731.39 -373.775 0 1162.98 0 0 0 0 0 0 0 0 0 0 1220.36 0 450.682 0 0 -86.5963 0 0 0 0 2243.49 1409.73 0 -673.467 0 0 0 673.925 641.575 0 0 0 0 0 0 -1215.02 0 0 0 0 0 
0 1924.12 0 383.694 0 0 0 -834.758 0 0 2354.58 0 0 447.478 -2454.53 0 -1621.83 0 0 1934.03 1493.35 677.892 0 0 0.05 0 0 -1094.78 -1270.26 0 356.99 983.993 0 0 2258.29 0 0 526.826 0 773.873 638.066 0 0 -1437.19 0 0 172.353 -1757.79 0 0 0 0 0 0 -1147.11 -1456.57 0 0 614.261 1174.12 0 0 0 
0 0 341.273 0 0 0 0 0 0 0 586.642 -2438.35 0 0 0 0 0 0 0 275.964 0 0 0 0 0 0.04 2013.84 0 0 2054.89 -2198.63 -2040.09 0 1367.15 0 0 0 0 -1148.18 0 0 0 601.444 0 1402.1 0 0 0 0 -2.97555 1174.12 0 0 0 0 2067.71 0 0 0 0 -510.498 0 0 
0 0 0 0 1084.55 0 0 0 0 1283.07 0 0 1453.67 0 0 497.223 0 -980.178 0 0 -505.158 0 0 0 0 2047.56 0.09 0 0 0 0 -66.4541 0 -2163.84 0 0 0 2397.76 0 0 0 0 0 523.469 0 -1582.46 0 1892.07 2412.56 2401.43 0 0 0 0 1490.14 0 0 589.541 0 0 0 0 0 
0 0 0 0 0 427.335 0 -1941.05 0 0 0 0 0 0 0 -2450.1 0 0 0 0 -751.747 0 0 0 2112.42 0 0 0.05 0 0 0 1616.18 -1929 0 2113.64 0 0 0 0 0 0 2109.82 0 0 -408.414 0 170.064 0 0 2071.83 0 0 0 0 -542.848 0 0 114.216 0 -39.5978 0 0 0 
0 0 0 0 0 0 0 346.156 2461.55 -101.856 0 0 0 1619.85 -156.026 0 967.666 1204.03 0 0 0 0 0 0 -39.903 0 0 0 0.03 0 -1349.45 0 1363.8 0 1009.32 0 0 0 0 0 0 0 340.205 0 0 0 910.291 0 935.316 0 0 418.485 0 0 -1929.3 1434.45 -2110.89 0 0 0 0 0 0 
-1646.09 2433.47 0 0 0 939.131 1647.77 0 0 1450.93 0 0 0 0 0 0 0 0 0 0 0 0 0 0 0 -738.014 0 0 0 0.01 0 0 -827.433 0 2417.45 0 2341.3 0 -2350.76 0 0 0 0 0 0 0 0 0 2271.26 2319.03 0 -2285.45 -217.978 0 0 0 0 621.128 0 0 0 0 0 
0 0 104.907 0 0 0 0 1249.35 0 0 0 197.073 0 0 0 0 -1666.39 0 0 0 0 0 0 0 1542.02 704.443 0 0 -368.13 0 0.02 1821.88 0 0 0 1482.36 0 0 0 0 0 -1128.96 -1996.14 0 0 0 0 0 -936.689 0 1281.85 0 0 0 0 0 0 0 1418.88 0 0 -1953.41 0 
0 0 0 0 0 0 0 -1071.43 0 0 0 0 0 1409.57 0 -804.544 0 0 0 0 0 0 0 0 1441.01 1010.7 -1741.16 1095.08 0 0 -1871.47 0.03 0 0 1026.26 0 0 0 1173.51 0 1491.97 973.159 1005.05 1723.46 0 0 0 0 590.152 0 0 0 0 0 0 0 0 0 0 825.907 0 0 0 
0 0 0 82.0185 1144.98 0 0 0 1707.28 0 0 0 0 0 -1052.66 207.45 0 -1809.21 0 1782.05 769.906 134.205 876.873 1766.95 0 0 0 942.03 -80.34 -1356.93 0 0 0.06 0 0 0 0 0 0 0 0 0 0 0 0 -270.623 0 0 0 1728.34 0 0 0 0 0 0 0 -348.903 0 0 0 -1951.73 0 
0 0 0 -684.759 0 0 0 0 0 0 0 -1442.84 2453 0 2034.44 -368.587 0 0 1796.4 1372.8 0 0 -550.935 0 0 -472.198 -2260.58 0 0 0 0 0 0 0.02 680.944 0 0 0 0 291.07 0 0 -1326.87 72.2526 0 0 0 1608.55 -163.198 0 651.494 0 0 0 1512.12 0 0 393.918 2140.64 0 0 0 0 
0 0 -893.658 0 0 0 15.183 -550.935 0 0 0 0 0 0 2251.27 0 0 -1256.07 1538.36 745.186 0 0 0 155.11 -2294.46 0 0 2247.46 2410.58 -301.752 0 845.897 0 -1771.83 0.07 0 0 0 1742.84 0 0 0 0 0 -1518.83 0 549.257 0 0 0 0 0 0 169.149 0 0 0 0 0 0 0 0 0 
0 0 2277.37 0 2227.62 0 0 0 -535.676 -1216.85 1634.04 0 0 0 0 -619.144 0 2166.74 0 0 0 1086.99 -268.181 0 0 0 0 0 0 0 188.223 0 0 0 0 0.06 0 0 0 0 0 -1243.55 0 0 0 0 0 0 0 -890.301 0 1547.52 0 0 0 0 -1489.99 -2016.28 0 0 0 0 0 
0 0 0 0 0 1734.6 0 0 0 0 0 0 1079.36 0 0 0 -1045.49 0 0 209.128 0 0 0 0 0 0 0 0 0 1297.72 0 0 0 0 0 0 0.08 -402.921 0 1724.98 0 0 1860.48 0 0 2340.24 -463.5 1014.51 0 1003.07 0 0 0 0 -1738.87 -1788.16 0 1944.72 0 0 0 0 -1970.2 
0 1954.94 1742.23 431.913 0 0 0 0 0 1379.36 0 0 0 -2302.85 1713.23 0 -248.039 2400.66 -441.832 1128.04 0 -1662.88 0 1631.44 -637.15 0 2058.24 0 0 0 0 0 0 0 0 0 2485.66 0.03 894.574 821.94 0 0 0 0 0 0 0 -1386.84 991.318 0 0 1605.96 0 0 0 0 0 0 0 0 0 1491.06 0 
0 0 1479.16 1563.23 0 0 0 2459.26 1045.64 -1789.99 0 0 0 2078.23 0 0 0 0 0 0 0 0 0 0 0 1372.49 0 0 0 -633.183 0 517.975 0 0 141.377 0 0 -969.649 0.07 0 1584.75 0 0 -808.206 -2184.74 0 0 0 0 0 0 -2192.98 0 0 0 0 0 0 0 0 0 0 0 
0 0 0 0 2411.19 0 0 0 0 0 0 0 -1381.65 0 -120.624 0 2213.13 0 692.846 1975.84 0 755.257 0 0 -1546.75 0 0 0 0 0 0 0 0 534.608 0 0 -1773.2 -865.734 0 0.05 -1293.6 241.63 0 0 0 0 0 0 0 0 0 0 0 0 0 0 0 0 0 1081.5 0 0 0 
0 0 174.947 0 0 0 0 0 0 0 0 0 0 0 0 0 0 -2148.88 1980.27 1619.39 0 0 -2319.48 0 1896.8 0 0 0 0 0 0 -969.649 0 0 0 0 0 0 1357.23 265.13 0.03 0 0 0 1402.25 930.891 0 0 0 0 0 868.175 0 0 0 0 0 0 -2376.09 0 0 0 0 
771.584 1068.07 0 964.003 70.1163 0 0 0 0 434.812 0 1029.62 0 0 0 0 663.549 0 0 2227.62 0 -1105.46 0 0 0 0 0 486.084 0 0 1500.82 -1574.37 0 0 0 1228.75 0 0 0 1871.01 0 0 0 -459.838 0 0 0 0 0 0 0 0 0 0 0 0 0 2380.21 0 0 0 0 0 
0 0 0 502.564 -765.023 0 -1623.81 -1339.84 0 0 0 0 0 0 2195.58 1175.19 69.6585 0 0 40.9711 0 0 1345.33 -2075.79 0 -425.504 0 0 -528.962 0 2161.7 1746.04 0 14.5726 0 0 1462.83 0 0 0 0 0 0.08 0 0 1117.82 0 0 886.486 0 0 1424.07 0 2451.78 1028.4 0 0 0 0 -298.242 0 0 0 
0 0 0 0 0 0 0 661.87 -874.126 0 0 0 0 0 0 0 0 0 962.63 133.747 0 0 0 1638.92 -1363.34 0 -498.901 0 0 0 0 933.027 0 805.307 0 0 0 0 531.556 0 0 428.556 0 0.09 0 0 0 -2100.97 0 1556.52 0 0 0 0 0 0 2273.09 0 0 0 0 0 0 
0 0 988.876 1878.34 0 0 0 0 0 0 0 0 0 -864.666 0 0 -547.731 0 0 0 1937.09 -1344.72 0 0 0 1507.39 0 477.538 0 0 0 0 0 0 -2229.76 0 0 0 1683.78 0 2486.88 0 0 0 0.03 -2226.55 235.221 0 0 0 0 0 0 0 0 0 0 357.448 0 0 1745.28 0 0 
871.227 2492.07 0 0 0 0 1280.94 0 0 0 0 0 0 -668.584 0 -2175.13 0 25.5593 0 0 0 1508.3 0 -221.03 0 0 -1398.28 0 0 0 0 0 53.0259 0 0 0 2120.96 0 0 0 -705.054 0 1273.31 0 120.167 0.05 0 0 1687.14 0 0 2370.45 0 0 0 0 -1131.09 2263.33 763.344 0 402.158 0 0 
0 0 2434.69 0 0 0 0 0 0 0 0 0 0 0 0 0 0 0 0 0 0 0 0 0 1121.63 0 0 -2068.62 -145.039 0 0 0 0 0 -78.0511 0 219.199 0 0 0 0 0 0 0 2174.21 0 0.04 0 0 0 -494.171 0 1643.8 0 0 0 0 564.516 0 0 0 0 73.1681 
0 0 0 0 0 0 0 0 0 1342.43 -524.537 0 33.9518 2431.49 0 0 0 -1974.47 0 0 0 0 2418.67 0 1812.11 0 554.14 0 0 0 0 0 0 2039.48 0 0 1699.5 1039.69 0 0 0 0 0 -1514.4 0 0 0 0.02 0 0 0 1682.1 -703.528 0 0 0 2219.69 0 1209.83 0 0 -1807.38 0 
0 0 419.248 0 -2037.49 0 401.395 0 -325.556 0 0 0 46.0067 0 0 0 0 -537.507 0 -141.224 0 2283.62 0 0 0 0 1390.04 0 1100.88 2229.76 -554.445 1870.25 0 1057.08 0 0 0 -571.688 0 0 0 0 -1247.37 0 0 -965.987 0 0 0 86.5963 0 29.2215 508.667 0 0 0 0 0 0 0 0 0 0 
1490.6 0 2328.64 0 0 0 0 0 0 358.669 0 0 0 0 -1327.48 0 0 2216.94 0 0 0 -844.829 0 -447.63 0 580.081 -1846.45 709.021 0 -2495.27 0 0 2246.39 0 0 1777.63 -1589.18 0 0 0 0 0 0 2165.97 0 0 0 0 2125.39 0.01 0 0 917.463 -438.322 0 0 0 0 -205.771 -2194.66 0 0 0 
0 0 0 -1986.37 0 85.5281 0 0 0 -2194.2 0 0 2425.23 955.306 0 0 -102.771 0 0 0 0 0 0 -1774.58 0 -2218.62 0 0 0 0 -1102.4 0 0 245.598 0 0 0 0 0 0 0 0 0 0 0 0 873.516 0 0 0 0.04 0 0 1437.65 0 0 2208.55 2481.54 182.119 -1924.73 0 0 2046.65 
0 0 0 0 1157.19 0 0 0 0 0 0 0 1781.14 0 -2452.09 -1664.71 -1314.05 0 122.15 0 0 1209.83 -771.889 0 0 0 0 0 574.587 1818.52 0 0 0 0 0 -280.084 0 -158.162 -1543.55 0 1586.89 0 2139.73 0 0 2360.07 0 1996.29 -1245.38 0 0 0 0 1110.49 1268.58 -1385.92 0 0 0 0 0 0 0 
0 -1828.9 0 0 0 0 0 0 0 0 -911.512 -2301.48 0 0 0 0 0 0 0 0 0 1065.32 0 0 0 0 0 0 0 2126.15 0 0 0 0 0 0 0 0 0 0 0 0 0 0 0 0 1769.84 1443.3 212.485 -186.392 0 0 0.07 -2222.74 1971.27 0 0 0 2304.53 0 0 0 0 
0 0 2467.5 0 0 0 0 2412.87 0 0 0 0 0 1608.71 -152.821 0 61.5711 0 0 0 0 0 0 0 0 0 0 0 0 0 0 0 0 0 -1218.68 0 0 0 0 0 0 0 -684.301 0 0 0 0 0 0 233.085 1780.22 1573.76 284.814 0.03 0 0 0 0 0 0 0 0 0 
0 381.71 1572.85 883.129 0 0 0 -1368.68 0 0 0 0 0 0 0 0 2224.11 0 0 0 0 0 0 0 2312.31 0 1334.96 1050.98 -678.961 0 0 0 0 -26.6274 0 0 916.242 0 0 0 0 0 -412.381 0 0 0 0 0 0 0 0 570.315 15.3356 0 0.03 0 0 0 0 0 0 0 -1778.39 
0 0 0 0 0 0 0 0 0 0 0 2.51778 0 0 0 0 0 0 0 0 0 0 0 0 1837.29 -1310.85 0 0 1808.91 0 0 0 0 0 0 0 2346.34 0 0 0 0 0 0 0 0 0 0 0 0 0 0 -1684.24 0 0 0 0.03 0 1796.24 0 -171.896 0 0 0 
-904.187 0 1525.39 0 0 543.306 0 0 0 0 -1296.04 -1144.37 0 1827.37 0 452.666 0 0 0 0 0 -150.227 -1619.69 0 0 0 0 0 2100.82 0 0 0 0 0 0 1089.74 0 0 0 0 0 0 0 -0.228889 0 105.213 0 -2050 0 0 -1449.86 0 0 0 0 0 0.04 2244.87 2438.66 0 0 0 0 
0 0 0 0 0 0 0 -2155.14 0 0 0 0 0 0 0 0 0 -1097.83 0 -307.55 0 0 -293.359 -358.364 0 0 -643.101 -1002.76 0 1931.44 0 0 -1105.46 27.3904 0 1740.85 1558.2 0 0 0 0 1390.19 0 0 2106.92 -318.079 -2435.3 0 0 0 927.534 0 0 0 0 1240.65 1698.58 0.09 0 0 0 0 0 
0 0 0 0 0 0 0 0 1946.55 0 0 -205.008 0 0 -1222.95 547.426 0 0 2051.07 0 302.362 2422.48 -974.38 0 1186.64 0 0 0 0 0 -680.944 0 0 1673.71 0 0 0 0 0 0 -848.949 0 0 0 0 -52.2629 0 -1178.09 0 1374.63 -2038.41 0 1175.34 0 0 0 811.716 0 0.04 0 0 0 0 
-98.3459 0 0 0 0 0 0 0 0 0 0 0 0 1037.1 0 0 0 -246.818 0 0 0 0 0 0 808.512 0 0 621.281 0 0 0 427.183 0 0 0 0 0 0 0 1175.65 0 0 125.66 0 0 0 0 0 0 1793.95 -825.755 0 0 0 0 -1663.79 0 0 0 0.09 0 0 0 
0 0 0 0 0 0 0 0 0 451.903 0 0 0 0 0 0 0 0 0 0 780.282 0 0 0 0 -2017.04 0 0 0 0 0 0 0 0 0 0 0 0 0 0 0 0 0 0 2450.25 1400.72 0 0 0 0 0 0 0 0 0 0 0 0 0 0 0.08 0 0 
0 0 602.817 0 -1115.83 0 0 0 0 0 0 0 0 0 -1168.63 -216.605 0 0 139.393 0 1431.85 0 0 0 0 0 0 0 0 0 -746.254 0 1587.95 0 0 0 0 1722.24 0 0 0 0 0 0 0 0 0 924.94 0 0 0 0 0 0 0 0 0 0 0 0 0 0.01 809.885 
0 0 0 0 0 0 0 0 -1755.65 2122.49 0 0 1773.66 0 0 1750.01 0 0 0 0 0 -1052.35 0 0 0 0 0 0 0 0 0 0 0 0 0 0 1081.8 0 0 0 0 0 0 0 0 0 -1475.19 0 0 0 -2433.77 0 0 0 776.315 0 0 0 0 0 0 -253.838 0.05 
