*Vertices 52
*Matrix 
0 0 0 0 1513.49 -1074.48 0 0 0 0 -1081.65 -185.018 0 0 0 0 0 0 0 0 -172.201 0 0 -2044.51 0 0 0 483.337 0 0 0 2300.71 0 171.285 0 0 0 0 0 0 929.518 0 0 0 0 0 1311.76 0 0 0 0 0 
0 0.03 0 -41.7341 -737.556 2197.41 0 -1012.83 0 0 0 1965.32 0 1175.5 0 0 0 2012.77 0 1017.41 0 0 1433.84 949.049 591.983 0 873.363 0 0 0 1209.22 0 0 1828.44 0 0 0 0 0 0 -896.405 0 -390.255 0 0 0 0 0 -1838.66 0 0 0 
0 0 0.07 -187.765 677.129 -906.629 0 0 449.461 0 0 -263.756 0 553.835 0 0 0 0 0 0 0 791.574 0 0 0 1819.28 0 2233.57 0 0 0 0 1087.76 0 0 0 0 0 0 0 0 0 -193.716 0 -910.596 0 0 0 0 0 0 0 
0 -6.02741 2083.12 0.05 0 1189.23 2417.6 0 0 0 0 0 0 -687.811 0 0 2041.15 0 0 0 0 0 0 2320.86 0 -1485.11 0 0 0 0 0 0 -1691.26 0 0 312.738 0 521.027 0 0 0 0 0 -1622.75 0 0 0 0 0 0 0 -30.4422 
360.652 1331.6 -708.869 0 0.04 0 0 0 0 1674.78 0 1670.05 0 0 0 0 0 -1655.1 0 0 0 0 0 435.423 0 -1280.33 0 2371.97 -2162.16 0 0 0 0 0 0 -514.771 0 1843.24 -127.644 0 0 0 -1012.68 0 2456.97 0 2223.65 0 -2335.81 0 2380.52 0 
-1174.43 -799.051 1293.15 1747.72 0 0.09 0 0 0 0 2260.12 0 -1465.12 1701.94 0 0 0 0 0 0 1010.54 0 -344.325 -2481.38 0 0 0 -1512.57 0 1069.29 0 0 0 0 810.648 0 0 0 502.869 194.174 0 0 0 0 763.649 0 0 1804.94 0 -1270.26 0 0 
0 0 0 520.722 0 0 0.04 0 0 1417.66 0 1889.17 1080.28 0 0 2276.15 -1217.92 0 -54.857 -1109.12 -378.964 2052.9 0 0 0 0 -1457.64 0 0 0 0 0 0 637.913 183.34 0 0 0 0 215.69 0 0 -1414.3 0 1481.14 0 0 0 1901.99 904.492 1245.69 0 
0 2305.9 0 0 0 0 0 0.06 -450.53 0 0 0 0 -165.181 0 0 1913.74 1986.07 0 0 0 1647.62 0 0 769.295 0 0 0 2493.59 -1094.47 0 -1538.67 0 599.307 0 0 1446.81 0 0 0 1347.01 0 0 2229.91 0 640.202 0 0 0 -1226.46 0 0 
0 0 1200.06 0 0 0 0 -1166.04 0.01 -571.688 544.679 1343.81 2121.72 0 0 0 2469.33 0 0 0 0 0 0 -436.491 0 0 0 1514.56 0 0 0 0 0 -463.5 0 0 0 0 0 -807.749 0 0 0 0 0 0 0 0 0 0 0 0 
0 0 0 0 2387.84 0 -2342.52 0 528.657 0 0 0 0 0 0 -1341.06 2266.84 0 0 0 0 1491.67 2362.21 0 0 0 0 0 2130.73 0 0 0 906.018 0 0 0 1596.04 0 0 296.716 0 0 0 0 0 0 0 0 0 0 0 0 
-336.39 0 0 0 0 2148.73 0 0 2234.18 0 0.07 0 0 0 0 0 0 0 -1666.84 0 0 0 0 0 588.626 0 0 254.295 0 -1691.41 0 0 2050 0 0 0 301.141 0 2259.06 0 0 2053.82 0 0 0 0 0 0 0 0 0 0 
1405.91 2215.41 -1062.43 0 771.432 0 1074.63 0 -676.214 0 0 0.05 0 0 -724.128 2053.51 0 0 -1885.2 0 0 1757.48 0 1115.83 0 0 0 0 0 -1494.11 0 0 0 0 1693.85 0 0 0 0 0 0 0 0 0 0 0 0 0 0 0 0 0 
0 0 0 0 0 -144.887 2106.77 0 -2073.35 0 0 0 0 2477.72 0 0 0 -489.135 0 0 0 0 -366.909 0 613.804 1268.88 0 -588.321 2006.21 0 -1818.52 0 0 0 0 0 0 0 0 558.565 0 0 0 0 0 0 0 0 0 0 0 0 
0 147.176 -169.301 1714.45 0 -2023 0 21.1341 0 0 0 0 2454.22 0.04 -1185.11 0 745.033 0 0 0 -428.709 0 0 0 142.293 -1877.27 0 0 0 0 2357.17 0 0 -2310.79 2395.32 1800.82 0 -2090.14 -1141.77 0 0 0 0 0 0 0 0 0 0 0 0 0 
0 0 0 0 0 0 0 0 0 0 0 1635.87 0 481.964 0 0 -1752.3 313.501 0 0 0 0 1131.4 0 457.701 -1608.1 0 2167.65 0 0 0 0 828.501 0 2061.45 0 0 0 0 0 0 0 0 0 1327.78 0 0 0 0 0 0 0 
0 0 0 0 0 0 899.915 0 0 2205.65 0 2112.11 0 0 0 0.07 -841.472 0 0 0 1645.79 0 0 0 0 1151.84 0 0 0 0 760.14 0 -905.713 -2131.34 0 0 -2441.1 2378.84 0 -99.5666 0 0 -1244.77 0 -1036.79 0 0 0 0 0 0 0 
0 0 0 1782.97 0 0 -1105.3 -553.987 -1556.83 -252.617 0 0 0 -2480.01 2161.09 1872.39 0.05 0 0 0 0 0 0 0 -424.589 0 0 0 0 0 0 0 0 -478.454 0 0 0 0 0 0 -769.906 0 2354.88 0 1147.88 0 0 0 0 0 0 0 
0 -1841.72 0 0 -31.663 0 0 -761.971 0 0 0 0 2194.81 0 -368.435 0 0 0.03 0 0 0 0 0 1278.34 1945.94 0 2118.67 1525.54 0 -946.455 0 928.907 927.381 0 2003.46 0 0 -1862.47 0 -804.239 -1190.15 1448.18 0 0 -56.0778 0 0 0 0 0 202.261 0 
0 0 0 0 0 0 914.869 0 0 0 2037.8 1273 0 0 0 0 0 0 0 0 1418.27 0 0 -1114.31 831.401 562.075 0 0 0 0 2256.61 0 2278.59 0 0 0 0 -1568.88 0 535.676 -72.1 0 365.078 0 0 0 0 0 0 0 0 0 
0 243.614 0 0 0 0 631.352 0 0 0 0 0 0 0 0 0 0 0 0 0 0 0 0 0 -169.912 0 -1742.38 0 0 0 0 2367.09 1087.6 0 2035.05 0 0 -936.842 1459.78 -1665.93 0 0 1486.94 0 0 0 0 0 0 402.768 0 0 
-1385.31 0 0 0 0 -298.853 -1774.58 0 0 0 0 0 0 -1032.36 0 2394.71 0 0 1332.06 0 0.09 0 0 438.322 -112.69 0 0 790.201 0 0 0 2135.91 0 0 0 0 0 2446.59 0 0 0 0 -1579.26 0 0 0 0 0 0 0 0 0 
0 0 762.581 0 0 0 -397.275 -370.724 0 -697.577 0 2268.52 0 0 0 0 0 0 0 0 0 0.03 0 2436.98 0 2048.48 0 0 0 0 0 -1289.18 0 0 0 0 0 0 0 0 0 0 0 0 0 0 0 0 0 0 0 0 
0 1447.11 0 0 0 -195.242 0 0 0 -2348.78 0 0 1290.4 0 -332.575 0 0 0 0 0 0 0 0.02 2101.12 -1082.42 1089.43 2126.45 0 0 0 0 2006.21 1243.25 2458.04 1273.92 110.096 0 0 0 0 0 0 0 0 0 0 0 0 0 0 0 0 
2485.96 -2473.14 0 2144.15 400.937 94.2259 0 0 174.642 0 0 1693.09 0 0 0 0 0 -2326.5 1858.81 0 -294.427 -1191.98 1399.96 0.05 0 0 0 0 0 -1591.92 1147.72 0 0 -1484.19 179.22 0 831.248 1894.06 1773.05 0 -116.047 -215.079 1833.78 0 2314.14 0 0 0 0 0 0 -2303.77 
0 -340.968 0 0 0 0 0 2006.67 0 0 101.703 0 -1158.71 -195.7 762.886 0 -2418.21 43.4126 2044.05 1672.95 1571.02 0 1473.36 0 0.05 0 0 0 -1238.98 0 0 2112.42 0 -1938.76 0 1610.08 0 0 -878.399 0 0 0 0 739.54 0 0 0 0 0 0 2259.67 0 
0 0 -677.435 1995.68 1228.75 0 0 0 0 0 0 0 2362.21 -1286.58 2138.2 -1937.24 0 0 -297.479 0 0 1715.83 -1105.61 0 0 0.02 0 841.929 -715.735 0 0 0 630.436 0 0 0 0 0 0 0 -1826.15 0 0 0 0 581.301 1932.51 -386.288 0 -1719.49 0 0 
0 -1816.84 0 0 0 0 1578.04 0 0 0 0 0 0 0 0 0 0 488.22 0 422.91 0 0 -1651.89 0 0 0 0.05 0 0 1918.47 0 0 136.799 0 -874.432 0 0 0 822.245 1249.96 0 0 941.115 351.955 0 0 889.996 0 0 0 0 0 
2084.49 0 1539.74 0 -689.642 439.39 0 0 -1708.96 0 817.82 0 -171.133 0 983.688 0 0 548.799 0 0 1592.38 0 0 0 0 -644.322 0 0.06 0 0 0 0 0 0 728.095 0 -668.432 0 0 0 0 0 0 0 0 0 0 0 0 0 0 0 
0 0 0 0 2049.55 0 0 1573.46 0 -1343.96 0 0 1078.91 0 0 0 0 0 0 0 0 0 0 0 -2107.07 1949.45 0 0 0.08 0 0 -1644.57 0 2032.15 0 0 0 0 0 0 0 2044.82 0 0 0 0 0 0 1516.08 1860.33 0 0 
0 0 0 0 0 -1931.75 0 1253.78 0 0 -1105.3 2425.08 0 0 0 0 0 2267.14 0 0 0 0 0 872.448 0 0 -85.0703 0 0 0 0 478.149 0 586.947 0 0 0 2321.92 0 1842.02 0 0 280.541 0 0 0 0 0 0 0 -121.54 0 
0 1000.78 0 0 0 0 0 0 0 0 0 0 2412.26 2429.04 0 -2387.39 0 0 2245.93 0 0 0 0 2302.7 0 0 0 0 0 0 0 0 0 0 754.952 0 0 0 0 0 1386.38 0 0 0 0 561.769 0 0 0 -1291.62 0 -1364.1 
839.488 0 0 0 0 0 0 437.864 0 0 0 0 0 0 0 0 0 2059.16 0 1367 -1680.43 472.961 -830.485 0 289.544 0 0 0 -2258.75 234.001 0 0.02 0 0 0 -962.477 1490.45 0 0 0 0 0 0 0 0 2453.31 0 0 0 0 0 0 
0 0 523.164 746.559 0 0 0 0 0 -483.947 1116.29 0 0 0 -1541.11 21.7444 0 1923.2 1900.62 2340.85 0 0 -166.25 0 0 1894.51 584.506 0 0 0 0 0 0.05 0 0 0 0 0 1723.46 0 0 0 0 235.527 0 0 933.638 0 0 0 0 -383.389 
1941.51 -11.5207 0 0 0 0 -453.429 -1082.42 -1565.52 0 0 0 0 -2387.23 0 1671.42 -953.322 0 0 0 0 0 -544.679 690.558 202.719 0 0 0 1773.96 -438.78 0 0 0 0.04 1271.78 -456.938 0 0 2194.2 0 1335.87 0 0 510.651 0 0 0 0 0 0 0 0 
0 0 0 0 0 -1332.06 676.366 0 0 0 0 223.472 0 -860.24 714.82 0 0 832.316 0 1573.61 0 0 1364.1 -1588.72 0 0 1254.84 1784.19 0 0 1384.24 0 0 1155.35 0.06 766.854 2203.21 1913.74 0 0 0 0 -153.432 0 765.786 0 0 0 0 0 0 0 
0 0 0 2311.7 1078.6 0 0 0 0 0 0 0 0 1718.73 0 0 0 0 0 0 0 0 -2065.11 0 -2333.52 0 0 0 0 0 0 -39.2926 0 1885.66 777.688 0.02 0 0 0 0 0 0 0 0 0 0 0 0 0 0 0 0 
0 0 0 0 0 0 0 -1423.92 0 -135.884 1832.1 0 0 0 0 2434.84 0 0 0 0 0 0 0 2212.97 0 0 0 1874.98 0 0 0 -1757.48 0 0 -2253.26 0 0 0 0 0 2390.9 0 2267.6 0 0 0 0 0 -989.029 930.586 0 0 
0 0 0 2211.6 -1032.52 0 0 0 0 0 0 0 0 -1028.86 0 1468.93 0 186.85 385.22 -835.673 1305.05 0 0 1865.98 0 0 0 0 0 779.824 0 0 0 0 1728.03 0 0 0 0 -1807.99 1772.59 0 0 720.161 0 0 0 0 0 670.263 0 -1783.43 
0 0 0 0 1909.01 1934.19 0 0 0 0 -882.366 0 0 -430.998 0 0 0 0 0 -1842.78 0 0 0 -344.478 1336.94 0 2185.66 0 0 0 0 0 1487.09 -159.841 0 0 0 0 0.02 0 -43.8704 0 0 392.087 1153.37 0 0 0 0 0 0 -2283.17 
0 0 0 0 0 1390.04 -710.7 0 619.602 -2291.25 0 0 -865.123 0 0 -2472.08 0 -1248.28 2419.43 743.049 0 0 0 0 0 0 304.956 0 0 2288.51 0 0 0 0 0 0 0 1499.6 0 0.05 1752.3 2371.52 -29.3741 0 0 0 0 0 0 0 0 0 
-211.112 604.19 0 0 0 0 0 -483.032 0 0 0 0 0 0 0 0 2369.84 385.678 1631.29 0 0 0 0 2410.12 0 1949.75 0 0 0 0 2095.93 0 0 -1829.66 0 0 -882.672 -2029.86 -1765.11 -34.1044 0.04 0 1209.98 2131.95 0 0 0 303.583 0 0 0 0 
0 0 0 0 0 0 0 0 0 0 1903.06 0 0 0 0 0 0 304.498 0 0 0 0 0 2062.52 0 0 0 0 2061.3 0 0 0 0 0 0 0 0 0 0 1905.19 0 0 0 0 0 0 0 0 0 0 0 0 
0 1857.89 -113.3 0 1781.59 0 -792.032 0 0 0 0 0 0 0 0 1536.99 142.903 0 -783.181 2147.05 2120.2 0 0 -2263.63 0 0 2473.91 0 0 1901.99 0 0 0 0 1362.58 0 -116.047 0 0 592.288 1548.74 0 0 0 0 -1990.34 0 0 -1020.92 0 0 0 
0 0 0 2349.24 0 0 0 -1620.76 0 0 0 0 0 0 0 0 0 0 0 0 0 0 0 0 1218.53 0 -803.323 0 0 0 0 0 -1679.05 1281.4 0 0 0 492.035 -1085.77 0 1711.4 0 0 0 0 0 0 0 0 0 0 0 
0 0 -2258.75 0 1444.36 2420.19 1121.02 0 0 0 0 0 0 0 627.842 777.688 2476.04 -2020.1 0 0 0 0 0 336.848 0 0 0 0 0 0 0 0 0 0 -2334.13 0 0 0 1760.08 0 0 0 0 0 0.09 0 0 845.744 0 0 0 0 
0 0 0 0 0 0 0 -680.029 0 0 0 0 0 0 0 0 0 0 0 0 0 0 0 0 0 2364.96 0 0 0 0 -257.5 2032 0 0 0 0 0 0 0 0 0 0 2165.36 0 0 0.01 0 0 0 0 0 0 
208.06 0 0 0 2492.22 0 0 0 0 0 0 0 0 0 0 0 0 0 0 0 0 0 0 0 0 443.968 -721.381 0 0 0 0 0 1748.79 0 0 0 0 0 0 0 0 0 0 0 0 0 0.04 0 0 0 0 0 
0 0 0 0 0 2498.78 0 0 0 0 0 0 0 0 0 0 0 0 0 0 0 0 0 0 0 1458.86 0 0 0 0 0 0 0 0 0 0 0 0 0 0 2460.17 0 0 0 1418.42 0 0 0.05 0 0 0 0 
0 -1078.14 0 0 332.881 0 510.804 0 0 0 0 0 0 0 0 0 0 0 0 0 0 0 0 0 0 0 0 0 1176.87 0 0 0 0 0 0 0 -613.804 0 0 0 0 0 -181.661 0 0 0 0 0 0.07 0 0 0 
0 0 0 0 0 2105.55 190.817 1951.73 0 0 0 0 0 0 0 0 0 0 0 1751.84 0 0 0 0 0 2288.66 0 0 -900.525 0 -1761.76 0 0 0 0 0 -1485.87 620.06 0 0 0 0 0 0 0 0 0 0 0 0.03 0 0 
0 0 0 0 1364.25 0 1217.15 0 0 0 0 0 0 0 0 0 0 1526.15 0 0 0 0 0 0 111.774 0 0 0 0 -1587.5 0 0 0 0 0 0 0 0 0 0 0 0 0 0 0 0 0 0 0 0 0.04 0 
0 0 0 1303.83 0 0 0 0 0 0 0 0 0 0 0 0 0 0 0 0 0 0 0 774.026 0 0 0 0 0 0 -907.392 0 -1303.83 0 0 0 0 -326.014 958.052 0 0 0 0 0 0 0 0 0 0 0 0 0.01 
