*Vertices 57
*Matrix 
0.05 0 0 0 0 0 0 0 0 0 0 0 2190.24 1706.06 0 0 0 0 1437.35 0 0 0 0 0 1103.78 0 0 0 0 0 1795.48 0 0 0 -1439.18 0 0 0 0 0 0 0 0 0 0 0 842.387 0 0 -2357.94 0 0 0 0 0 0 0 
0 0.06 0 0 0 0 0 0 0 0 1657.38 0 0 0 0 0 0 0 0 0 0 0 0 0 0 0 454.039 0 0 0 1369.59 0 2316.13 2029.25 0 0 -763.649 0 -759.987 1053.27 0 0 0 0 0 0 0 0 0 0 0 0 0 0 -1461.46 0 0 
0 0 0.05 0 0 0 0 912.275 520.417 0 0 0 0 0 0 0 0 0 0 0 0 0 0 0 0 0 0 0 731.147 0 0 0 0 0 0 0 0 2364.8 0 -469.604 0 0 0 0 0 0 0 0 0 0 1663.34 0 0 0 0 0 0 
0 0 0 0.05 0 0 0 0 0 0 0 0 0 0 0 0 0 0 0 1924.57 0 0 0 0 0 0 0 0 0 -239.189 0 -257.653 0 0 0 0 242.393 0 2059.77 0 0 -1723.3 1619.54 0 0 0 0 0 0 0 0 458.77 0 0 0 341.121 0 
0 0 0 0 0 -1076.01 0 0 0 0 0 0 0 0 0 0 1460.08 0 0 0 0 0 1377.83 0 0 0 0 0 0 0 0 0 0 0 0 0 0 0 0 0 0 0 0 0 0 542.543 0 0 0 0 0 0 732.521 0 0 1286.74 0 
0 0 0 0 1915.72 0 0 -941.115 0 0 0 0 0 0 0 0 0 0 0 0 0 0 0 -410.245 0 977.889 0 0 0 0 0 -1852.55 -198.599 0 0 0 -1984.24 0 2116.38 0 0 0 0 1653.72 0 -666.295 0 0 0 0 0 0 0 0 0 -847.728 0 
0 0 0 0 0 0 0.05 0 1395.38 0 0 0 -1521.27 0 0 0 0 0 0 0 0 0 0 1859.42 0 0 1548.13 0 0 0 0 0 0 0 0 0 0 2252.34 0 0 0 0 0 0 0 0 0 0 -2281.03 0 0 0 0 0 0 0 0 
0 0 2078.39 0 0 -17.777 0 0.01 0 0 0 0 0 2215.26 0 969.344 0 0 0 0 0 0 2125.08 0 0 482.269 0 0 0 0 0 1126.67 0 0 0 -1645.33 0 0 0 0 0 0 0 0 0 0 0 0 0 0 0 0 0 0 0 1713.39 -1343.65 
0 0 -251.549 0 0 0 1805.4 0 0 0 0 0 984.756 0 0 0 0 0 0 0 0 0 0 0 0 0 777.078 0 0 0 0 1552.55 0 0 0 1868.88 0 0 0 0 0 0 -2412.41 0 0 -1589.18 0 0 0 0 484.71 0 0 0 0 0 0 
0 0 0 0 0 0 0 0 0 0.01 0 -408.109 41.4289 0 0 0 0 0 0 0 0 0 0 0 0 0 0 0 0 0 0 0 -804.544 0 0 0 -1077.07 0 0 2007.43 1185.26 0 0 0 0 0 0 0 0 0 -1186.48 0 0 1738.72 0 0 0 
0 1247.22 0 0 0 0 0 0 0 0 0.08 0 980.178 0 0 0 0 0 0 -1749.09 0 0 0 0 0 0 0 0 0 0 1844.16 0 0 321.284 0 0 0 0 0 0 0 0 0 0 1916.49 -436.491 1368.68 0 0 0 0 0 0 0 0 334.101 0 
0 0 0 0 0 0 0 0 0 767.464 0 0.07 0 0 0 0 0 0 0 0 0 0 0 0 0 0 0 0 90.7163 0 0 0 0 0 0 0 -899.304 0 1918.78 0 410.092 0 0 0 0 0 -2212.21 0 0 0 -782.723 0 0 2109.97 1476.1 0 0 
1576.66 0 0 0 0 0 869.243 0 1015.58 149.922 -1449.25 0 0.01 0 -2131.49 0 0 0 0 -645.085 0 0 0 0 0 0 0 0 1485.56 0 -1551.18 0 0 0 0 0 0 0 0 0 0 0 0 0 -452.055 1467.56 0 0 0 0 0 0 0 0 0 0 2083.73 
520.569 0 0 0 0 0 0 2152.24 0 0 0 0 0 0 0 0 0 0 379.879 0 0 0 0 0 0 0 0 0 0 0 0 0 0 0 0 0 0 0 0 0 0 0 0 0 0 0 0 0 0 0 0 0 0 0 0 0 0 
0 0 0 0 0 0 0 0 0 0 0 0 -539.186 0 0.08 0 0 0 0 0 2037.49 0 1840.04 0 0 0 0 0 0 0 0 0 0 0 0 0 0 0 0 0 0 0 0 0 0 0 0 0 0 0 0 0 0 0 0 0 0 
0 0 0 0 0 0 0 1741 0 0 0 0 0 0 0 0.09 1908.55 0 0 -58.6718 0 0 921.125 0 0 0 0 0 0 0 0 0 818.888 0 797.22 0 0 0 0 0 -2032.15 0 976.363 0 0 -452.208 0 0 -1064.87 0 0 0 0 0 0 0 0 
0 0 0 0 -592.288 0 0 0 0 0 0 0 0 0 0 634.098 0.09 0 0 0 0 0 0 0 0 0 0 0 0 0 -1312.68 0 0 2338.71 -1480.07 0 929.365 0 0 0 0 0 0 0 0 1667.46 0 2221.98 0 0 0 0 0 0 0 -870.006 0 
0 0 0 0 0 0 0 0 0 0 0 0 0 0 0 0 0 0.03 0 0 0 0 0 2036.58 0 0 0 0 0 2218.77 0 0 0 0 0 0 -1426.36 -2250.51 0 0 -204.855 -537.202 0 1444.52 0 0 -597.018 0 0 0 0 0 0 0 0 0 0 
867.26 0 0 0 0 0 0 0 0 0 0 0 0 909.833 0 0 0 0 0.03 0 687.964 0 0 1545.38 1997.36 0 0 0 0 1509.67 0 0 0 0 0 2324.37 -2237.08 0 0 0 0 0 0 0 0 0 0 0 0 0 0 0 0 0 0 0 1009.32 
0 0 0 586.184 0 0 0 0 0 0 879.62 0 1146.96 0 0 -1119.8 0 0 0 0.08 0 0 109.333 0 0 0 0 0 0 0 0 0 0 0 0 1185.87 0 0 0 0 0 0 2312.16 0 -2104.18 0 0 0 0 0 0 0 0 0 0 0 0 
0 0 0 0 0 0 0 0 0 0 0 0 0 0 1122.24 0 0 0 1929.61 0 0.08 0 0 1950.97 0 0 0 0 0 0 0 0 0 0 2480.01 0 0 0 0 298.7 0 907.849 0 0 0 -63.4022 0 -1693.09 0 416.196 0 0 0 2042.07 0 0 0 
0 0 0 0 0 0 0 0 0 0 0 0 0 0 0 0 0 0 0 0 0 0.09 0 0 0 0 0 2130.88 0 0 0 0 0 1182.21 -2103.11 0 0 2488.86 0 0 0 -1256.37 0 0 0 0 0 0 0 0 0 0 0 0 0 0 0 
0 0 0 0 -1289.03 0 0 -1838.36 0 0 0 0 0 0 1034.81 737.861 0 0 0 1292.69 0 0 0.05 0 0 1725.59 0 0 0 0 0 0 0 0 0 0 0 0 0 0 0 0 -741.218 0 464.568 2469.18 0 0 0 0 -292.138 0 0 0 0 0 -645.085 
0 0 0 0 0 1856.36 403.836 0 0 0 0 0 0 0 0 0 0 -311.212 -689.642 0 2375.64 0 0 0.06 0 -2195.43 0 0 0 0 0 0 194.632 0 608.921 0 0 0 0 0 -1374.63 0 0 0 0 0 429.93 0 0 2131.03 -613.498 0 0 0 0 0 0 
2148.58 0 0 0 0 0 0 0 0 0 0 0 0 0 0 0 0 0 960.189 0 0 0 0 0 0 0 0 0 0 1519.59 0 0 0 0 0 0 0 0 0 759.224 1380.28 0 0 0 341.731 0 1768.78 -2305.29 317.927 0 0 478.149 0 0 0 0 0 
0 0 0 0 0 1861.4 0 1768.62 0 0 0 0 0 0 0 0 0 0 0 0 0 0 -1540.35 -1492.89 0 0.04 0 0 -229.27 0 0 0 0 0 0 -924.482 0 0 0 0 0 0 0 2059.31 0 1548.59 1714.45 0 0 0 0 0 0 0 0 0 0 
0 612.278 0 0 0 0 327.845 0 2077.93 0 0 0 0 0 0 0 0 0 0 0 0 0 0 0 0 0 0.05 0 0 0 0 0 197.073 0 0 0 0 0 0 0 -1397.52 0 -1264.61 0 0 0 0 0 0 0 1880.32 0 0 0 0 0 0 
0 0 0 0 0 0 0 0 0 0 0 0 0 0 0 0 0 0 0 0 0 -1301.23 0 0 0 0 0 0.08 0 979.568 0 0 0 0 0 0 0 0 0 0 0 0 1501.28 0 0 0 0 0 0 0 1982.71 0 -784.707 0 230.186 1900.01 -1955.7 
0 0 1531.95 0 0 0 0 0 0 0 0 2427.52 2258.29 0 0 0 0 0 0 0 0 0 0 0 0 1619.08 0 0 0.05 0 0 0 0 0 0 0 0 0 0 474.487 0 0 0 0 0 0 0 0 1652.35 0 -439.085 0 0 0 0 0 0 
0 0 0 -774.331 0 0 0 0 0 0 0 0 0 0 0 0 0 -1014.66 1301.84 0 0 0 0 0 1133.08 0 0 -2370.6 0 0.03 0 0 0 0 0 0 0 0 0 0 0 1943.49 0 2368.47 0 0 0 369.655 0 0 0 0 0 0 0 0 0 
1096.15 1367.61 0 0 0 0 0 0 0 0 -1935.71 0 -697.424 0 0 0 1463.59 0 0 0 0 0 0 0 0 0 0 0 0 0 0.05 0 0 0 0 0 0 0 0 0 0 0 0 2232.2 750.374 0 0 0 0 0 0 0 0 0 0 0 0 
0 0 0 -1213.95 0 2312.77 0 757.698 1761.6 0 0 0 0 0 0 0 0 0 0 0 0 0 0 0 0 0 0 0 0 0 0 0 0 0 0 0 0 0 -120.167 0 0 0 1155.66 394.681 0 0 0 0 0 0 0 0 2435.15 0 0 0 0 
0 2472.69 0 0 0 512.177 0 0 0 88.8852 0 0 0 0 0 2167.81 0 0 0 0 0 0 0 1092.94 0 0 1757.64 0 0 0 0 0 0.02 0 0 0 0 26.4748 0 0 0 0 0 707.648 0 0 518.281 0 1121.48 0 0 0 0 0 0 0 0 
0 1850.11 0 0 0 0 0 0 0 0 -628.605 0 0 0 0 0 -1009.17 0 0 0 0 1124.84 0 0 0 0 0 0 0 0 0 0 0 0 524.384 0 0 0 0 0 0 0 0 0 0 0 0 0 0 0 0 0 0 0 0 0 0 
-156.178 0 0 0 0 0 0 0 0 0 0 0 0 0 0 2124.93 -1965.01 0 0 0 -1190.15 301.294 0 443.968 0 0 0 0 0 0 0 0 0 1715.37 0.08 0 0 0 0 1144.22 2078.84 0 -785.623 0 0 0 0 0 0 969.649 0 0 0 0 0 0 0 
0 0 0 0 0 0 0 1979.35 2138.81 0 0 0 0 0 0 0 0 0 1479.92 -562.075 0 0 0 0 0 2300.56 0 0 0 0 0 0 0 0 0 0.04 0 0 0 0 -939.436 0 0 0 -2285.15 0 0 0 0 0 -2403.71 0 0 0 0 0 0 
0 1138.26 0 2460.48 0 -2385.1 0 0 0 2120.66 0 -1283.38 0 0 0 0 277.642 -28.4585 1435.97 0 0 0 0 0 0 0 0 0 0 0 0 0 0 0 0 0 0.07 0 0 0 0 0 0 0 0 0 0 0 -863.445 0 0 0 0 0 -630.589 0 0 
0 0 2164.3 0 0 0 -80.7978 0 0 0 0 0 0 0 0 0 0 -377.285 0 0 0 1594.06 0 0 0 0 0 0 0 0 0 0 845.592 0 0 0 0 0.06 0 0 0 -1593.3 -1883.22 -1774.88 2075.64 2484.59 -991.623 0 0 -701.544 0 0 0 0 0 0 0 
0 692.541 0 -1417.97 0 467.772 0 0 0 0 0 1119.04 0 0 0 0 0 0 0 0 0 0 0 0 0 0 0 0 0 0 0 1847.36 0 0 0 0 0 0 0 0 1058 0 0 0 0 1435.67 -155.721 0 0 0 0 0 0 0 0 0 0 
0 -249.565 2338.1 0 0 0 0 0 0 840.098 0 0 0 0 0 0 0 0 0 0 24.1859 0 0 0 -808.817 0 0 0 2461.24 0 0 0 0 0 2313.84 0 0 0 0 0.09 0 0 0 0 0 0 0 0 -1606.11 0 0 0 0 0 0 0 199.667 
0 0 0 0 0 0 0 0 0 -776.162 0 600.07 0 0 0 522.706 0 816.752 0 0 0 0 0 270.013 1110.19 0 -1830.27 0 0 0 0 0 0 0 957.289 2039.93 0 0 1185.26 0 0.06 0 -1780.37 0 0 0 0 0 0 0 1363.8 0 0 0 0 0 0 
0 0 0 1079.97 0 0 0 0 0 0 0 0 0 0 0 0 0 1871.78 0 0 -1659.22 2478.03 0 0 0 0 0 0 0 1480.22 0 0 0 0 0 0 0 1822.64 0 0 0 0.04 0 -1904.13 0 0 0 0 0 0 0 0 0 0 0 0 0 
0 0 0 2447.2 0 0 0 0 1623.05 0 0 0 0 0 0 166.555 0 0 0 -1247.37 0 0 -2291.71 0 0 0 -549.715 -163.503 0 0 0 2116.69 0 0 1652.04 0 0 2365.57 0 0 -1321.68 0 0.07 0 0 0 0 0 0 0 0 -783.029 0 0 0 0 0 
0 0 0 0 0 2385.56 0 0 0 0 0 0 0 0 0 0 0 2042.83 0 0 0 0 0 0 0 1699.96 0 0 0 -938.215 1920.15 -1341.21 2392.57 0 0 0 0 -1344.26 0 0 0 -556.429 0 0.07 0 0 0 0 0 0 0 0 0 0 0 0 0 
0 0 0 0 0 0 0 0 0 0 912.58 0 2253.26 0 0 0 0 0 0 -1567.2 0 0 -1010.24 0 1950.67 0 0 0 0 0 936.537 0 0 0 0 906.629 0 -1286.74 0 0 0 0 0 0 0.07 475.86 0 0 0 0 0 0 0 0 0 0 0 
0 0 0 0 -953.627 -1016.65 0 0 568.636 0 2441.56 0 1113.24 0 0 -483.642 -2126.61 0 0 0 1844.61 0 1729.1 0 0 673.009 0 0 0 0 0 0 0 0 0 0 0 1282.62 583.285 0 0 0 0 0 -304.804 0.05 0 0 0 0 0 0 0 0 0 0 0 
2440.79 0 0 0 0 0 0 0 0 0 1803.72 1884.14 0 0 0 0 0 1336.18 0 0 0 0 0 -2203.67 1110.95 161.519 0 0 0 0 0 0 -2282.25 0 0 0 0 -1549.65 2163.08 0 0 0 0 0 0 0 0 0 0 0 0 0 0 0 0 0 0 
0 0 0 0 0 0 0 0 0 0 0 0 0 0 0 0 2287.13 0 0 0 -1498.08 0 0 0 1975.69 0 0 0 0 -1749.24 0 0 0 0 0 0 0 0 0 0 0 0 0 0 0 0 0 0.01 0 0 0 0 0 0 308.161 0 0 
0 0 0 0 0 0 1955.24 0 0 0 0 0 0 0 0 590.762 0 0 0 0 0 0 0 0 -730.995 0 0 0 1553.62 0 0 0 828.959 0 0 0 -117.267 0 0 -74.5415 0 0 0 0 0 0 0 0 0.02 0 0 0 0 0 0 0 1861.25 
-1374.48 0 0 0 0 0 0 0 0 0 0 0 0 0 0 0 0 0 0 0 -1071.28 0 0 2352.14 0 0 0 0 0 0 0 0 0 0 1202.35 0 0 1816.69 0 0 0 0 0 0 0 0 0 0 0 0 0 0 0 0 0 0 0 
0 0 -750.526 0 0 0 0 0 1194.27 -424.589 0 -1088.52 0 0 0 0 0 0 0 0 0 0 2205.5 -132.221 0 0 -910.291 -1826.76 85.2229 0 0 0 0 0 0 518.891 0 0 0 0 815.683 0 0 0 0 0 0 0 0 0 0.04 0 0 0 0 0 0 
0 0 0 482.421 0 0 0 0 0 0 0 0 0 0 0 0 0 0 0 0 0 0 0 0 1235.47 0 0 0 0 0 0 0 0 0 0 0 0 0 0 0 0 0 -1954.94 0 0 0 0 0 0 0 0 0.01 0 0 205.313 1064.1 0 
0 0 0 0 1094.32 0 0 0 0 0 0 0 0 0 0 0 0 0 0 0 0 0 0 0 0 0 0 2461.39 0 0 0 1065.48 0 0 0 0 0 0 0 0 0 0 0 0 0 0 0 0 0 0 0 0 0.06 0 0 455.718 0 
0 0 0 0 0 0 0 0 0 -1658.6 0 1275.14 0 0 0 0 0 0 0 0 1093.55 0 0 0 0 0 0 0 0 0 0 0 0 0 0 0 0 0 0 0 0 0 0 0 0 0 0 0 0 0 0 0 0 0.08 2182.61 0 0 
0 -289.697 0 0 0 0 0 0 0 0 0 -1826.76 0 0 0 0 0 0 0 0 0 0 0 0 0 0 0 -709.632 0 0 0 0 0 0 0 0 1798.84 0 0 0 0 0 0 0 0 0 0 1020.31 0 0 0 -1528.44 0 205.618 0.05 0 952.559 
0 0 0 -1971.72 1811.35 -583.59 0 -1081.8 0 0 971.328 0 0 0 0 0 825.144 0 0 0 0 0 0 0 0 0 0 382.015 0 0 0 0 0 0 0 0 0 0 0 0 0 0 0 0 0 0 0 0 0 0 0 1082.26 1939.07 0 0 0.06 0 
0 0 0 0 0 0 0 -1923.35 0 0 0 0 1640.75 0 0 0 0 0 2218.47 0 0 0 -625.858 0 0 0 0 793.405 0 0 0 0 0 0 0 0 0 0 0 1466.03 0 0 0 0 0 0 0 0 1032.36 0 0 0 0 0 71.4896 0 0.03 
