*Vertices 65
*Matrix 
0.09 -2093.49 0 0 -2405.24 0 0 0 0 0 0 0 0 0 0 0 0 0 599.918 0 0 1351.13 0 0 0 2363.89 1880.93 -1183.74 565.584 0 0 0 0 671.484 0 0 0 -423.673 0 0 1802.65 0 0 198.904 0 0 0 0 0 0 0 0 0 0 0 -1088.82 0 0 0 0 0 0 0 0 0 
60.8081 0.06 0 0 -2305.44 2094.26 0 0 0 0 0 0 1965.32 0 0 0 0 0 0 193.716 2410.28 1866.89 0 0 2456.51 0 0 -1039.38 152.211 0 0 -280.236 -125.355 0 1928.08 0 0 0 1542.02 0 0 0 1595.74 714.667 0 0 0 0 0 0 0 0 0 0 0 0 0 2364.35 0 0 0 0 0 0 0 
0 0 0.02 0 0 0 0 0 0 1785.71 0 0 0 0 0 956.984 0 0 1820.05 0 -345.851 0 0 0 0 0 -233.848 0 2319.18 0 -336.543 0 2051.99 1655.1 0 -1561.56 0 0 0 -1615.73 0 0 0 2385.56 0 0 0 -635.624 0 0 -1162.37 427.946 0 0 0 0 0 0 0 0 0 -602.664 -472.961 0 -606.479 
0 0 0 0.01 0 0 0 387.509 0 332.118 0 0 0 0 0 0 0 0 2232.35 0 0 0 0 0 0 0 0 0 2495.88 0 0 -840.403 0 1182.21 0 0 0 0 370.876 0 0 0 0 0 755.409 -1739.33 0 1424.38 0 0 0 -547.121 0 0 0 0 0 0 0 1923.05 0 0 0 0 0 
1518.07 2241.51 0 0 0.05 0 0 0 0 0 0 -1182.21 0 0 0 0 -397.275 1726.36 0 0 0 0 -535.371 0 520.112 0 -1244.01 898.389 0 0 -2346.03 0 1372.19 0 0 0 0 -1427.43 0 1635.41 0 1529.97 0 0 0 -1833.02 -2062.52 0 760.14 0 0 0 0 0 0 0 0 0 0 0 0 0 0 0 0 
0 -1222.34 0 0 0 0.02 -940.504 1363.95 0 0 0 0 0 0 0 0 0 0 2055.96 0 -159.688 0 0 0 0 0 0 1908.09 0 0 -2358.24 2155.9 0 0 0 -2068.32 0 2359.92 0 0 0 0 0 0 -1415.98 945.845 -70.4215 0 0 0 0 0 0 -895.032 270.318 0 -2315.21 0 0 0 0 2178.95 1161.15 -826.212 0 
0 0 0 0 0 2219.99 0.09 0 0 0 0 0 0 0 0 0 0 0 0 -1490.45 0 0 0 0 0 0 0 1654.18 1689.73 0 942.64 0 0 -1223.26 937.91 0 0 0 0 0 0 0 0 0 0 -635.929 0 0 0 0 0 0 0 0 0 0 0 0 0 -1650.82 0 0 0 0 0 
0 0 0 1403.32 0 1941.66 0 0.09 0 786.538 0 -378.201 -1014.82 0 0 0 1970.05 0 0 0 1617.71 0 0 0 0 0 2214.5 -2349.85 1263.85 -2057.33 387.356 0 0 0 2027.88 1923.05 867.565 -198.752 0 0 0 -1506.47 0 4.0437 -1055.86 0 -945.235 0 0 0 0 0 0 0 624.485 0 0 2023.91 0 0 0 795.236 -1449.86 0 0 
0 0 0 0 0 0 0 0 0.09 0 0 0 0 714.209 0 1099.35 0 54.2467 0 0 0 0 0 0 0 0 0 0 0 0 0 0 0 0 0 0 0 0 0 0 2070.45 0 0 0 2410.12 0 0 0 0 1051.13 0 0 0 0 0 0 844.829 0 0 0 0 0 0 0 0 
0 0 2445.07 -2424.47 0 0 0 1152.46 0 0.04 0 -915.479 -925.703 0 0 -1169.7 0 0 2487.18 0 0 0 0 0 2392.42 0 0 0 0 0 0 0 -601.596 0 0 0 0 0 0 0 0 -2233.73 2420.8 0 0 2123.1 0 0 0 0 0 0 0 0 0 0 0 802.103 0 0 0 -1964.4 0 0 0 
0 0 0 0 0 0 0 0 0 0 0.03 0 216.758 -10.6052 0 0 0 0 0 0 0 0 852 2318.41 0 0 0 0 0 0 0 0 0 0 0 0 -798.593 1056.78 0 0 0 0 0 0 0 0 0 0 0 0 0 0 0 0 0 0 0 0 0 0 0 0 0 -2436.22 0 
0 0 0 0 -601.138 0 0 1350.83 0 -10.9104 0 0 -376.522 0 0 626.316 599.612 0 0 0 -2194.97 0 -1786.17 0 0 -604.495 1169.85 0 0 0 -10.3 0 0 0 0 0 -1588.11 0 0 0 1315.42 0 0 0 -349.818 43.26 0 516.755 0 0 0 0 0 2189.02 0 0 0 0 0 0 0 0 0 0 0 
0 799.509 0 0 0 0 0 2306.05 0 -838.42 1058.31 2190.24 0.07 0 2191.31 0 0 0 0 0 0 0 -1037.55 0 0 -405.667 750.832 2194.97 1126.36 0 0 505.158 1973.1 0 0 -2459.11 -112.995 0 0 439.543 0 -712.226 0 0 98.6511 0 -979.568 0 0 0 630.284 0 0 0 0 0 990.097 0 0 0 1357.08 0 0 0 0 
0 0 0 0 0 0 0 0 -1934.49 0 1022.29 0 0 0.07 1862.01 -787.912 0 0 0 0 -730.232 0 786.843 0 -189.444 0 0 0 2090.29 0 0 0 0 0 0 275.658 -1433.99 0 0 0 0 0 0 0 0 0 0 0 0 0 0 0 0 1722.85 0 2109.82 0 0 0 0 0 0 580.691 0 0 
0 0 0 0 0 0 0 0 0 0 0 0 -2413.94 -13.657 0.04 0 0 0 0 -494.629 0 0 0 0 0 0 0 0 2389.83 0 0 1229.06 293.207 806.528 0 317.316 0 -985.672 643.712 745.491 2392.88 0 -690.863 0 0 0 0 0 0 0 54.0941 0 0 0 0 0 0 0 0 0 0 0 0 288.629 -2069.99 
0 0 -2288.66 0 0 0 0 0 1122.39 954.237 0 144.581 0 1675.54 0 0.08 0 0 0 -734.352 0 0 -1030.08 0 1728.64 0 0 -2184.59 49.5163 1877.12 0 0 6.02741 1415.98 0 0 0 0 0 0 0 990.86 0 626.774 0 0 0 860.24 0 0 0 0 0 0 0 685.675 0 0 0 0 0 830.18 0 0 0 
0 0 0 0 -771.279 0 0 454.192 0 0 0 2261.96 0 0 0 0 0.06 0 0 0 0 0 0 0 0 -5.26444 0 278.863 0 0 1811.04 0 -1965.62 0 0 37.7667 0 0 641.118 0 0 0 0 -497.528 0 -62.7918 0 0 0 0 0 0 0 0 0 0 0 0 0 0 0 1463.29 0 0 1594.06 
0 0 0 0 126.118 0 0 0 1108.81 0 0 0 0 0 0 0 0 0.09 0 0 0 0 0 0 1961.04 0 0 0 0 -895.184 0 0 1673.41 0 0 0 0 0 0 0 0 0 1015.88 0 2164.75 0 1285.82 1956.47 0 0 1587.5 0 163.198 0 0 0 0 0 0 0 0 0 0 0 0 
-234.611 0 302.667 2175.44 0 -1041.98 0 0 0 2293.54 0 0 0 0 0 0 0 0 0.08 750.374 0 0 0 0 0 0 0 0 0 -1791.97 -2283.93 0 2221.21 1701.64 -365.993 0 0 0 0 0 2292.47 0 2052.29 0 0 0 0 2446.13 0 0 0 0 0 0 0 0 0 0 0 0 -1436.28 0 0 0 0 
0 2015.67 0 0 0 0 -595.187 0 0 0 0 0 0 0 1497.92 1312.68 0 0 -504.242 0.04 0 0 0 0 -917.158 0 0 0 0 0 0 134.968 0 0 0 -297.937 0 0 1694.31 0 0 0 0 0 0 607.089 0 0 0 0 0 0 -2102.04 0 0 0 0 318.69 0 0 0 0 0 0 0 
0 -427.03 2284.23 0 0 -2465.51 0 -283.288 0 0 0 293.512 0 746.712 0 0 0 0 0 0 0.09 0 0 0 0 0 0 0 0 -40.3607 0 0 0 0 0 0 0 0 0 -697.729 0 0 -1100.42 0 0 0 0 0 0 411.618 0 0 0 0 0 0 0 0 0 0 0 0 0 2387.08 1170.31 
1941.82 -1642.12 0 0 0 0 0 0 0 0 0 0 0 0 0 0 0 0 0 0 0 0.02 2118.82 0 0 0 0 0 756.63 0 927.076 0 -1033.89 2008.19 0 0 -759.682 1755.65 -2482.45 0 0 0 0 0 0 0 0 1390.96 0 0 0 -352.412 0 0 0 0 0 0 0 0 0 0 0 -654.393 0 
0 0 0 0 1503.72 0 0 0 0 0 -755.257 2273.86 -1940.14 217.826 0 2020.1 0 0 0 0 0 419.248 0.05 -593.509 0 1998.28 226.981 0 0 0 0 0 2319.18 2308.8 0 0 -2267.6 0 0 0 0 0 0 0 0 0 0 0 0 0 0 -1283.38 0 0 0 0 0 0 0 0 0 0 -248.497 0 0 
0 0 0 0 0 0 0 0 0 0 114.978 0 0 0 0 0 0 0 0 0 0 0 1685.61 0.09 0 -716.651 0 0 0 0 0 2427.21 1587.65 0 0 0 0 0 0 0 1304.13 0 0 -1336.33 0 -1712.78 0 1949.45 -2335.66 2109.52 0 0 0 0 0 0 0 0 0 0 0 0 0 0 1795.18 
0 -1873.15 0 0 -333.796 0 0 0 0 -2399.44 0 0 0 2464.75 0 -1524.78 0 2062.67 0 1477.32 0 0 0 0 0.08 0 0 0 2061.45 991.775 0 0 1071.89 0 0 0 0 0 0 1217.46 0 1634.04 0 1908.09 0 0 0 0 0 0 2005.6 0 0 0 0 0 0 0 0 0 0 1659.06 0 0 0 
-1548.13 0 0 0 0 0 0 0 0 0 0 -704.443 1700.72 0 0 0 -891.522 0 0 0 0 0 2224.72 1274.07 0 0.01 0 0 1574.83 0 0 -169.301 0 0 0 0 -1431.24 0 0 0 2210.07 0 0 514.313 0 0 0 2195.58 0 0 0 0 0 0 0 0 0 0 0 559.175 0 0 0 1891.92 0 
-891.064 0 -171.285 0 -783.639 0 0 1338.62 0 0 0 602.054 1717.05 0 0 0 0 0 0 0 0 0 2355.19 0 0 0 0.07 0 0 0 0 -2015.52 0 0 1562.01 0 0 -267.571 0 0 0 0 -513.092 0 0 1483.73 0 0 0 0 0 0 0 -1832.56 0 0 0 0 1911.45 0 0 0 -1435.82 0 0 
1537.45 -1809.52 0 0 595.95 659.581 -1968.21 612.735 0 0 0 0 322.199 0 0 2072.44 1995.83 0 0 0 0 0 0 0 0 0 0 0 0 0 0 -304.804 0 0.686666 0 0 0 0 0 0 0 0 0 2380.52 0 0 0 0 0 0 0 0 -1035.87 0 0 0 0 -2443.54 0 0 0 0 0 0 0 
918.989 505.768 127.491 2430.27 0 0 1727.58 1239.74 0 0 0 0 -425.199 -167.928 -454.497 1524.48 0 0 0 0 0 -388.577 0 0 -2216.64 2080.07 0 0 0.06 0 0 0 0 2444.91 0 0 0 0 -2453 0 -2.97555 0 0 0 0 0 0 0 0 -2255.85 0 1310.39 0 0 0 0 0 0 0 1213.64 0 0 0 0 0 
0 0 0 0 0 0 0 2178.33 0 0 0 0 0 0 0 2359.92 0 -1253.01 -874.584 0 1928.08 0 0 0 1307.64 0 0 0 0 0.03 0 0 0 0 0 0 0 -839.335 -343.104 0 0 245.598 0 2107.23 0 0 0 -1301.84 0 0 0 0 0 0 1655.55 0 0 0 -995.438 0 0 1414.46 0 0 0 
0 0 -372.402 0 -292.291 -1434.45 2353.66 -1181.75 0 0 0 2024.06 0 0 0 0 -293.054 0 -2227.01 0 0 -721.839 0 0 0 0 0 0 0 0 0.08 1951.12 976.363 0 0 2492.22 0 0 0 500.58 0 0 0 0 0 -582.064 0 -1448.03 0 0 0 0 0 0 0 0 0 0 0 0 -1674.47 0 0 0 0 
0 2334.74 0 2413.33 0 -90.5637 0 0 0 0 0 0 1011.76 0 540.406 0 0 0 0 -1795.18 0 0 0 -581.607 0 -1873 -1689.89 952.712 0 0 -380.642 0.09 1150.17 0 0 0 0 0 0 0 0 0 0 0 0 0 0 0 0 0 0 0 -1932.81 0 0 2444.46 0 0 0 0 0 0 559.023 0 0 
0 2454.99 -1448.79 0 1971.42 0 0 0 0 -1125.45 0 0 2171.93 0 -1025.19 -1731.24 -853.374 204.398 2455.9 0 0 -1170.61 -1689.89 577.944 -1847.36 0 0 0 0 0 -20.5237 976.974 0 0 0 0 0 0 1063.65 2389.37 0 0 0 1626.1 0 0 0 0 0 691.778 0 0 0 0 -72.7104 -878.552 0 0 0 0 0 0 0 0 0 
-515.992 0 -266.655 -2077.93 0 0 610.752 0 0 0 0 0 0 0 2262.11 968.734 0 0 2462.31 0 0 286.34 -525.758 0 0 0 0 -627.995 -2048.94 0 0 0 0 0.06 -1892.22 2015.37 0 0 0 0 0 0 0 1869.03 0 0 144.429 0 0 0 0 0 0 0 0 1359.83 0 0 0 0 0 0 0 -1127.58 0 
0 -186.087 0 0 0 0 -873.974 1090.5 0 0 0 0 0 0 0 0 0 0 2438.05 0 0 0 0 0 0 0 1632.97 0 0 0 0 0 0 863.598 0.03 0 0 0 0 0 -750.679 0 0 0 0 0 0 0 0 1920.3 0 0 0 0 0 0 0 0 0 0 0 0 0 0 782.876 
0 0 -2370.6 0 0 1139.79 0 29.9844 0 0 0 0 2204.12 -2394.41 -2112.26 0 2435.61 0 0 2146.29 0 0 0 0 0 0 0 0 0 0 2353.36 0 0 1366.85 0 0.01 0 0 0 0 0 0 0 0 0 0 -1750.92 1368.22 0 0 0 0 0 0 0 -1937.39 0 0 972.091 422.91 0 0 0 0 0 
0 0 0 0 0 0 0 2408.75 0 0 -656.224 -1068.83 528.504 1548.13 0 0 0 0 0 0 0 -1043.05 -1491.21 0 0 -498.138 0 0 0 0 0 0 0 0 0 0 0.04 0 0 0 0 1702.4 2254.78 0 2053.36 2490.84 0 0 0 0 0 0 0 0 0 0 0 0 0 0 0 0 0 0 0 
2387.23 0 0 0 2465.97 275.353 0 -262.993 0 0 -1351.13 0 0 0 2011.86 0 0 0 0 0 0 -2.51778 0 0 0 0 1310.08 0 0 -72.5578 0 0 0 0 0 0 0 0.06 0 0 0 0 0 -1801.58 0 0 0 0 0 0 0 0 -911.664 0 0 0 0 0 0 0 0 0 -553.835 0 2202.14 
0 -2344.2 0 1500.52 0 0 0 0 0 0 0 0 0 0 -639.134 0 359.127 0 0 1625.19 0 1678.9 0 0 0 0 0 0 969.955 -131.306 0 0 2021.32 0 0 0 0 0 0.03 -1464.66 0 0 1409.27 0 0 0 0 371.792 0 0 0 0 0 0 0 0 2142.63 0 0 0 0 985.061 0 0 0 
0 0 1606.57 0 1336.48 0 0 0 0 0 0 0 -1174.89 0 594.272 0 0 0 0 0 427.946 0 0 0 1757.18 0 0 0 0 0 -1196.25 0 257.347 0 0 0 0 0 -2095.63 0.08 0 0 0 0 -417.417 0 0 0 0 0 1557.59 0 0 0 0 0 0 933.332 0 0 0 0 0 0 0 
531.556 0 0 0 0 0 0 0 389.035 0 0 -1241.72 0 0 -364.62 0 0 0 588.473 0 0 0 0 1566.13 0 -1028.4 0 0 848.186 0 0 0 0 0 2328.49 0 0 0 0 0 0.08 0 0 0 1938.61 0 1608.4 0 0 0 -642.949 0 0 0 0 0 0 0 0 0 0 0 0 0 0 
0 0 0 0 1854.99 0 0 861.766 0 2355.8 0 0 366.756 0 0 -1996.29 0 0 0 0 0 0 0 0 853.221 0 0 0 0 -1856.06 0 0 0 0 0 0 1385.77 0 0 0 0 0.06 0 0 -2309.87 0 0 1527.68 0 1278.65 0 0 0 0 0 -594.729 0 0 0 0 0 0 0 0 0 
0 1139.03 0 0 0 0 0 0 0 2315.06 0 0 0 0 1461.76 0 0 2352.6 1786.63 0 1175.04 0 0 0 0 0 -1193.66 0 0 0 0 0 0 0 0 0 1353.27 0 -150.99 0 0 0 0.09 0 89.0378 0 0 0 0 0 0 0 0 0 0 0 0 0 -7.55333 0 0 0 0 0 0 
1282.16 1471.37 946.76 0 0 0 0 -215.079 0 0 0 0 0 0 0 243.614 -2417.29 0 0 0 0 0 0 1046.86 728.858 -2489.01 0 -118.03 0 1423.76 0 0 1231.8 1545.08 0 0 0 1479.31 0 0 0 0 0 0.04 2145.53 0 0 0 0 0 0 0 0 0 0 0 0 0 0 0 0 0 0 0 2004.53 
0 0 0 -1648.38 0 1267.66 0 1464.2 891.522 0 0 -898.846 -847.423 0 0 0 0 2221.21 0 0 0 0 0 0 0 0 0 0 0 0 0 0 0 0 0 0 1352.05 0 0 -2453.15 -1777.02 1857.43 235.527 1639.99 0.01 1666.23 0 0 -1010.39 2161.4 0 0 0 0 0 0 0 0 0 -1086.84 0 0 0 0 0 
0 0 0 533.082 1895.28 -1722.24 1429.11 0 0 968.276 0 1730.93 0 0 0 0 1834.39 0 0 1070.36 0 0 0 -422.91 0 0 702.002 0 0 0 -720.161 0 0 0 0 0 1816.69 0 0 0 0 0 0 0 2061.45 0.07 1139.94 0 0 0 0 0 0 -1601.84 0 0 0 0 0 0 1670.51 0 0 0 0 
0 0 0 0 1401.18 2311.7 0 -311.975 0 0 0 0 1039.54 0 0 0 0 -119.251 0 0 0 0 0 0 0 0 0 0 0 0 0 0 0 -306.482 0 -1761.76 0 0 0 0 1943.95 0 0 0 0 1706.98 0.08 1408.81 0 0 0 0 0 0 0 0 0 649.968 0 0 0 0 0 0 0 
0 0 -1925.64 1685.16 0 0 0 0 0 0 0 1170.46 0 0 0 -240.562 0 -2204.89 -1095.84 0 0 2261.65 0 1586.43 0 -672.704 0 0 0 -1407.74 2041.92 0 0 0 0 2400.36 0 0 1721.63 0 0 -1536.84 0 0 0 0 -265.893 0.07 -233.238 -2392.42 0 0 0 0 0 0 0 0 0 0 0 0 0 0 2090.59 
0 0 0 0 1474.88 0 0 0 0 0 0 0 0 0 0 0 0 0 0 0 0 0 0 509.125 0 0 0 0 0 0 0 0 0 0 0 0 0 0 0 0 0 0 0 0 1171.22 0 0 1470.61 0.09 0 0 0 0 0 0 0 1697.97 0 0 0 0 0 0 0 0 
0 0 0 0 0 0 0 0 98.0407 0 0 0 0 0 0 0 0 0 0 0 -1791.21 0 0 1485.41 0 0 0 0 115.741 0 0 0 -644.322 0 2257.23 0 0 0 0 0 0 1653.57 0 0 -494.018 0 0 2409.36 0 0.05 0 0 0 0 0 0 0 0 0 0 -1683.17 0 0 0 0 
0 0 201.651 0 0 0 0 0 0 0 0 0 -2130.73 0 -565.127 0 0 -1421.93 0 0 0 0 0 0 1605.66 0 0 0 0 0 0 0 0 0 0 0 0 0 0 -100.94 949.507 0 0 0 0 0 0 0 0 0 0.04 0 0 0 0 2014.15 0 0 0 0 0 0 0 1940.29 0 
0 0 -2334.89 2267.3 0 0 0 0 0 0 0 0 0 0 0 0 0 0 0 0 0 -173.421 2319.33 0 0 0 0 0 1195.64 0 0 0 0 0 0 0 0 0 0 0 0 0 0 0 0 0 0 0 0 0 0 0.09 0 0 0 0 0 0 0 0 0 0 0 476.012 2379.3 
0 0 0 0 0 0 0 0 0 0 0 0 0 0 0 0 0 988.876 0 1719.49 0 0 0 0 0 0 0 1644.57 0 0 0 -2333.83 0 0 0 0 0 1281.4 0 0 0 0 0 0 0 0 0 0 0 0 0 0 0.01 0 0 0 0 0 648.289 1121.94 0 0 0 -484.1 0 
0 0 0 0 0 -1123.31 0 0 0 0 0 -1167.41 0 1857.43 0 0 0 0 0 0 0 0 0 0 0 0 2195.58 0 0 0 0 0 0 0 0 0 0 0 0 0 0 0 0 0 0 1597.11 0 0 0 0 0 0 0 0.03 0 0 0 0 0 0 0 0 0 0 0 
0 0 0 0 0 939.894 0 2378.99 0 0 0 0 0 0 0 0 0 0 0 0 0 0 0 0 0 0 0 0 0 528.962 0 0 -1304.59 0 0 0 0 0 0 0 0 0 0 0 0 0 0 0 0 0 0 0 0 0 0.06 0 0 0 0 0 0 0 0 0 0 
1730.17 0 0 0 0 0 0 0 0 0 0 0 0 2071.06 0 2009.57 0 0 0 0 0 0 0 0 0 0 0 0 0 0 0 -936.995 -546.815 235.221 0 517.823 0 0 0 0 0 -2072.28 0 0 0 0 0 0 0 0 -870.617 0 0 0 0 0.06 0 0 0 0 0 0 0 0 0 
0 0 0 0 0 1225.39 0 0 -1852.85 0 0 0 482.421 0 0 0 0 0 0 0 0 0 0 0 0 0 0 0 0 0 0 0 0 0 0 0 0 0 734.962 0 0 0 0 0 0 0 0 0 1723.3 0 0 0 0 0 0 0 0.07 0 0 0 0 0 1789.22 0 0 
0 -1560.49 0 0 0 0 0 2290.49 0 681.707 0 0 0 0 0 0 0 0 0 -230.949 0 0 0 0 0 0 0 1745.58 0 0 0 0 0 0 0 0 0 0 0 -1354.49 0 0 0 0 0 0 2276.6 0 0 0 0 0 0 0 0 0 0 0.08 0 -311.212 0 201.498 0 0 0 
0 0 0 0 0 0 0 0 0 0 0 0 0 0 0 0 0 0 0 0 0 0 0 0 0 0 2202.75 0 0 1188.31 0 0 0 0 0 -2328.18 0 0 0 0 0 0 1479.77 0 0 0 0 0 0 0 0 0 2216.64 0 0 0 0 0 0.09 0 0 0 0 0 0 
0 0 0 95.5992 0 0 1185.72 0 0 0 0 0 0 0 0 0 0 0 0 0 0 0 0 0 0 2122.18 0 0 811.716 0 0 0 0 0 0 -1606.88 0 0 0 0 0 0 0 0 -1221.73 0 0 0 0 0 0 0 -711.005 0 0 0 0 1118.58 0 0.05 0 0 0 0 0 
0 0 0 0 0 0 0 0 0 0 0 0 -2254.17 0 0 0 0 0 2233.27 0 0 0 0 0 0 0 0 0 0 0 -1878.03 0 0 0 0 0 0 0 0 0 0 0 0 0 0 2254.63 0 0 0 559.786 0 0 0 0 0 0 0 0 0 0 0.06 0 0 0 0 
0 0 -1540.96 0 0 -1515.63 0 2265.92 0 -1177.18 0 0 0 0 0 2260.28 1454.13 0 0 0 0 0 0 0 1836.53 0 0 0 0 1070.82 0 0 0 0 0 0 0 0 -2448.12 0 0 0 0 0 0 0 0 0 0 0 0 0 0 0 0 0 0 2034.29 0 0 0 0.08 0 0 0 
0 0 2348.78 0 0 -2081.29 0 1033.74 0 0 0 0 0 79.577 0 0 0 0 0 0 0 0 2242.42 0 0 0 2441.86 0 0 0 0 -1376.31 0 0 0 0 0 2210.84 0 0 0 0 0 0 0 0 0 0 0 0 0 0 0 0 0 0 -309.229 0 0 0 0 0 0.01 0 0 
0 0 0 0 0 398.801 0 0 0 0 -1730.93 0 0 0 -1822.34 0 0 0 0 0 814.31 2486.57 0 0 0 2328.49 0 0 0 0 0 0 0 -1021.68 0 0 0 0 0 0 0 0 0 0 0 0 0 0 0 0 432.066 -36.2407 -1874.07 0 0 0 0 0 0 0 0 0 0 0.08 0 
0 0 -1443.14 0 0 0 0 0 0 0 0 0 0 0 -966.292 0 1377.22 0 0 0 547.273 0 0 -1360.74 0 0 0 0 0 0 0 0 0 0 -1460.69 0 0 2435.45 0 0 0 0 0 50.2792 0 0 0 2263.63 0 0 0 180.898 0 0 0 0 0 0 0 0 0 0 0 0 0.06 
