*Vertices 64
*Matrix 
0.04 0 -2017.81 0 0 2352.6 -2124.93 0 0 1411.1 43.7178 207.755 0 0 0 0 0 0 0 0 0 1893.29 0 0 0 0 0 0 0 0 -961.562 2407.99 0 0 0 0 -1375.09 0 0 0 1985.92 0 0 0 1358.91 0 2041.61 82.1711 0 0 0 0 1684.09 0 0 0 0 -1245.08 0 0 0 0 0 0 
0 0.06 0 0 0 0 516.144 -826.06 182.424 1435.36 -868.175 0 0 0 0 0 0 0 0 0 0 0 0 0 -270.013 1339.69 1921.06 -20.9815 0 718.94 0 0 0 0 0 0 2305.14 0 0 0 0 0 0 0 0 794.168 196.921 466.857 -1714.3 -15.4881 0 0 0 -1754.13 0 0 0 0 0 0 0 0 0 2489.47 
1792.73 0 0.05 0 -377.895 0 1956.92 -146.718 180.746 0 0 0 0 0 772.347 0 2253.87 0 0 0 556.429 0 0 -1976.61 -1345.33 0 0 0 2319.94 0 0 0 0 0 0 0 0 2200.61 420.164 0 0 0 382.015 0 0 1562.47 -574.74 0 0 0 -1297.42 0 0 0 0 0 0 0 0 0 0 0 0 0 
0 0 0 0.04 0 -1696.3 0 -1408.05 0 0 0 0 0 0 0 0 920.057 0 659.276 0 0 131.001 0 0 0 537.812 0 0 0 0 -1609.47 0 1476.71 361.263 551.241 0 0 1789.22 178.304 0 0 1782.66 0 0 0 0 0 0 0 1994.92 220.573 0 0 0 0 0 0 0 0 0 0 0 0 0 
0 0 -843.303 0 0.07 1296.04 555.971 0 1301.69 -310.907 0 0 0 0 0 0 0 0 -446.104 0 0 1812.42 2148.88 0 0 -790.353 -1015.43 0 0 0 0 0 0 0 651.952 0 0 2421.72 0 1473.51 0 0 0 0 0 0 0 0 0 -1729.41 0 0 -1515.32 0 0 2373.81 0 2115.01 0 0 0 0 0 0 
1663.49 0 0 -1973.25 2483.67 0.01 0 0 2390.44 715.278 0 0 0 0 0 107.501 0 -587.71 0 0 0 0 0 -1886.88 0 1413.69 0 0 241.478 0 0 0 0 0 0 0 -2397.61 2374.57 814.31 0 0 -1431.09 0 99.7192 0 1758.1 0 0 0 -2472.99 0 0 0 0 0 0 -1929.76 0 0 2107.23 0 0 -581.149 947.829 
-451.75 -1902.3 -11.9785 0 1429.11 0 0.07 0 -2392.73 0 1023.06 0 0 0 0 0 0 0 0 0 0 0 0 0 0 281.762 0 0 551.088 0 0 0 0 0 2412.56 0 0 0 0 0 1545.08 0 0 0 0 2394.41 0 0 0 0 0 0 268.029 0 0 0 -1274.22 -2347.56 0 0 0 0 0 0 
0 -1701.33 2374.57 603.427 0 0 0 0.08 0 -1240.65 0 0 0 1741.46 0 0 1661.96 0 1337.7 1258.66 -846.355 747.932 0 0 1645.33 0 0 0 0 0 0 0 0 0 0 0 0 917.005 -694.983 626.926 0 0 0 0 0 0 0 -31.3578 -1901.99 0 1354.49 1351.74 0 0 0 0 0 0 0 0 0 0 0 0 
0 2194.2 104.297 0 -1471.98 2016.43 944.624 0 0.01 0 0 0 0 0 0 0 0 0 0 0 -64.6229 0 0 0 1471.37 0 0 -1782.97 508.515 0 -1759.62 0 0 0 0 0 0 0 0 -1051.44 1108.36 0 0 0 982.009 0 -1660.59 0 2109.97 184.256 0 0 0 0 0 0 -1504.64 0 0 0 0 0 0 0 
672.704 -920.82 0 0 442.747 2312.62 0 1650.52 0 0.02 2212.21 0 0 0 0 0 -1822.18 0 0 0 -1734.75 0 0 0 1197.78 -803.629 0 0 0 0 0 0 0 0 1910.08 0 2086.32 0 0 0 82.1711 0 0 -638.371 0 0 0 0 -1641.36 0 0 -605.106 1644.11 0 0 693.152 0 0 0 -1553.01 0 0 0 0 
1749.55 1268.27 0 0 0 0 13.5044 0 0 -743.507 0.05 0 2312.31 0 0 0 0 0 0 0 0 0 0 0 0 0 0 0 0 0 0 1728.34 0 0 0 0 0 302.973 1150.93 0 0 0 0 0 0 0 0 0 -1186.18 0 -710.547 1652.35 0 0 0 0 0 -1360.59 0 0 0 0 0 0 
288.476 0 0 0 0 0 0 0 0 0 0 0.05 2403.1 709.632 0 0 501.343 0 0 71.1844 0 2087.85 0 1913.89 0 0 0 -2159.72 0 -1447.42 0 0 0 2407.22 0 0 -1568.27 0 0 0 2272.33 -2131.34 0 0 0 -71.1844 0 0 1466.49 0 -120.624 0 0 0 -381.1 1791.82 -1441.77 0 855.815 0 142.445 0 1984.39 0 
0 0 0 0 0 0 0 0 0 0 -990.707 -630.284 0.09 1125.75 0 0 0 -537.812 0 1044.88 1554.84 0 0 0 0 0 0 0 0 1760.69 -2209.92 0 0 0 0 0 0 0 1287.5 0 0 0 0 0 0 2450.71 0 0 1096.3 652.715 0 0 -1676.15 1176.26 -1764.81 0 -562.38 819.956 -16.8615 0 0 0 0 0 
0 0 0 0 0 0 0 -1881.24 0 0 0 -238.273 1577.88 0.07 0 0 -2436.83 0 0 0 1178.7 0 -1456.72 2243.03 0 0 -0.991852 0 0 0 0 0 0 -805.155 -1986.98 2258.75 -1524.17 0 0 0 0 0 0 0 0 0 1712.47 -1339.99 162.893 -90.1059 0 0 1854.23 1169.55 -1386.99 0 0 0 0 0 0 0 0 0 
0 0 -2313.68 0 0 0 0 0 0 0 0 0 0 0 0.02 0 0 0 0 0 0 2301.32 0 831.095 0 0 0 0 0 0 -1214.56 1505.1 782.876 0 0 695.135 0 0 0 0 0 0 0 0 0 -888.775 0 0 0 1430.78 0 0 0 -1400.88 0 0 0 0 0 0 0 0 0 0 
0 0 0 0 0 1269.49 0 0 0 0 0 0 0 0 0 0.03 0 0 -1451.84 0 0 1770.3 0 624.027 1591.01 0 0 0 0 0 537.202 0 0 0 0 0 1136.89 0 0 0 0 0 0 -197.684 0 2087.54 0 0 0 0 271.538 978.347 0 0 0 -348.292 0 0 193.869 0 0 -882.519 0 0 
0 0 -1171.68 480.438 0 0 0 313.501 0 1364.86 0 -846.965 0 -464.11 0 0 0.03 0 0 0 0 0 0 0 0 1312.52 0 1067.77 -1616.95 -136.189 0 1400.11 0 0 0 0 0 0 0 0 0 181.814 873.974 588.473 0 -366.756 0 1308.4 1064.71 -1328.39 0 0 0 0 0 0 0 0 0 568.789 0 0 0 0 
0 0 0 0 0 591.525 0 0 0 0 0 0 1675.54 0 0 0 0 0.01 0 0 0 0 0 -2486.42 0 0 0 0 0 0 331.507 0 0 0 2090.14 0 0 0 0 0 0 2084.64 0 0 0 575.35 0 0 448.698 738.319 0 0 0 0 0 0 0 0 -2248.07 0 0 0 0 0 
0 0 0 -939.741 893.048 0 0 -1723.3 0 0 0 0 0 0 0 2477.87 0 0 0.09 0 1952.35 0 55.7726 0 0 -20.8289 0 0 0 0 0 0 2107.99 0 -86.4437 0 0 0 0 1897.56 -268.029 0 0 0 0 0 -737.556 0 0 -311.212 0 0 0 0 2245.48 1292.69 0 0 636.387 0 0 0 0 0 
0 0 0 0 0 0 0 -498.444 0 0 0 398.953 642.796 0 0 0 0 0 0 0.09 0 0 0 0 0 0 -426.115 0 791.879 0 0 0 0 414.06 0 101.398 2252.8 0 0 0 0 0 1148.95 0 0 0 0 1421.32 0 -1213.34 -1483.73 0 0 0 0 2012.92 216.3 0 -1329.77 1648.38 0 0 -2100.82 0 
0 0 1821.12 0 0 0 0 -942.335 -582.064 -2303.77 0 0 -1871.32 -1219.44 0 0 0 0 -970.87 0 0 0 0 0 0 0 0 0 1326.26 0 0 0 0 0 622.959 2113.64 0 2236.63 0 678.655 0 0 0 787.759 0 0 1176.56 0 0 0 -1706.06 0 0 0 -140.614 0 0 0 0 0 0 0 0 1482.67 
2473.14 0 0 2298.27 -14.8778 0 0 -519.044 0 0 0 1043.2 0 0 -1461.61 290.918 0 0 0 0 0 0.04 -50.4318 -1129.87 0 -1136.59 1358 0 0 0 0 0 2097.46 0 1495.18 0 0 0 0 -736.641 0 0 1707.28 -2202.29 0 0 -134.358 0 -1362.27 0 0 0 0 0 0 0 -2026.51 0 0 0 0 0 0 0 
0 0 0 0 1041.06 0 0 0 0 0 0 0 0 1622.9 0 0 0 0 -2034.59 0 0 1418.12 0.09 0 0 0 0 0 0 0 0 1458.4 0 0 0 0 0 2408.44 0 0 0 0 0 0 0 0 0 0 0 -1697.97 0 0 0 0 0 0 0 -828.806 0 0 0 0 0 0 
0 0 -1472.9 0 0 476.623 0 0 0 0 0 -1723.46 0 -2021.93 2469.94 1162.83 0 1615.12 0 0 0 -1237.91 0 0.09 0 -735.572 0 -601.749 2315.97 1212.88 0 -1148.18 0 0 0 0 0 0 0 281.762 0 0 0 0 0 0 0 0 0 0 1848.58 0 0 264.061 0 0 0 -199.667 -859.935 0 -47.2274 1972.03 0 0 
0 1991.1 1781.44 0 0 0 0 198.599 -2017.96 1228.6 0 0 0 0 0 1713.08 0 0 0 0 0 0 0 0 0.08 0 1203.12 0 34.5622 0 0 0 0 0 963.24 0 0 599.918 2321.77 1014.51 0 0 0 0 573.672 0 -579.47 0 0 0 0 0 0 0 985.977 520.264 0 0 0 0 0 0 0 0 
0 224.387 0 2376.55 2358.39 -837.504 331.812 0 0 1062.58 0 0 0 0 0 0 -1057.85 0 1440.24 0 0 -1307.95 0 -817.972 0 0.07 0 0 0 0 736.488 -1091.57 0 0 1670.35 0 0 1456.72 0 1518.68 1183.58 0 0 -1296.96 -2047.87 0 0 0 0 0 -1981.49 -541.169 0 0 -1354.64 0 0 0 0 0 0 0 0 0 
0 -1627.32 0 0 2358.85 0 0 0 0 0 0 0 0 923.414 0 0 0 0 0 335.017 0 -484.1 0 0 1730.93 0 0.04 0 0 0 0 0 -850.322 0 0 0 0 0 0 0 -1055.86 0 0 0 0 -204.398 0 -388.73 0 0 0 0 0 1896.65 0 -1014.66 0 0 0 0 0 0 0 0 
0 -235.221 0 0 0 0 0 0 -2422.64 0 0 1526.76 0 0 0 0 -33.1889 0 0 0 0 0 0 2469.48 0 0 0 0.03 0 0 -0.839259 0 0 0 0 0 0 0 0 0 -885.418 2011.25 0 0 -227.439 0 0 0 0 0 0 0 0 1728.34 0 2211.29 0 0 0 0 0 1434.29 0 0 
0 0 333.338 0 0 1773.05 -209.586 0 1044.88 0 0 0 0 0 0 0 509.43 0 0 73.7785 -786.843 0 0 793.863 -522.553 0 0 0 0.07 594.882 0 0 0 0 0 0 0 0 0 1585.36 0 0 0 1370.36 1181.45 0 477.844 0 -1250.11 0 2128.44 0 0 0 0 2487.79 0 0 0 0 0 0 0 922.346 
0 1080.13 0 0 0 0 0 0 0 0 0 -676.061 -2258.14 0 0 0 1885.36 0 0 0 0 0 0 626.469 0 0 0 0 -1054.95 0.06 0 0 0 0 0 0 0 0 0 0 0 140.919 -1375.7 0 0 0 0 0 1542.02 2129.35 1778.54 0 -1962.72 0 0 196.921 986.587 0 0 0 0 0 1546.45 0 
-107.501 0 0 -1365.32 0 0 0 0 -1136.74 0 0 0 1779.15 0 1696.75 -1405.15 0 2067.09 0 0 0 0 0 0 0 -602.359 0 -837.809 0 0 0.09 0 0 0 1978.59 0 0 0 0 1937.39 0 0 533.54 0 0 222.098 0 534.913 0 0 -609.226 0 0 223.624 -2260.58 2266.69 0 0 0 0 0 0 0 0 
-1943.49 0 0 0 0 0 0 0 0 0 1163.75 0 0 0 779.214 0 -668.279 0 0 0 0 0 -362.636 358.974 0 -1599.09 0 0 0 0 0 0.02 0 0 0 0 0 0 0 0 0 1260.64 -250.328 0 771.126 0 0 2328.64 0 1038.01 0 0 0 0 0 0 0 0 0 0 0 -1736.73 0 0 
0 0 0 -889.233 0 0 0 0 0 0 0 0 0 0 -1462.37 0 0 0 2082.81 0 0 -530.183 0 0 0 0 1234.4 0 0 0 0 0 0 211.722 0 0 2200 0 0 0 0 0 0 0 -492.95 0 0 1454.59 -2470.4 -111.774 1361.2 0 0 0 -2320.09 0 1735.66 0 0 0 0 0 0 0 
0 0 0 1653.57 0 0 0 0 0 0 0 -1475.95 0 -1208.3 0 0 0 0 0 733.284 0 0 0 0 0 0 0 0 0 0 0 0 1934.34 0.08 0 0 -166.86 0 0 0 0 -870.006 0 0 0 0 2297.05 0 0 -1624.27 0 0 0 969.497 0 0 0 0 0 -1676.31 0 0 0 0 
0 0 0 -442.595 1643.96 0 698.035 0 0 1706.06 0 0 0 -545.9 0 0 0 1437.5 799.509 0 632.878 -1870.4 0 0 1348.38 -1367.31 0 0 0 0 -741.066 0 0 0 0.04 0 0 0 0 0 2105.85 0 0 -165.944 0 -1784.19 0 -635.014 888.165 0 1959.67 0 0 475.402 0 0 -59.8926 0 0 0 0 0 0 0 
0 0 0 0 0 0 0 0 0 0 0 0 0 1682.71 1070.51 0 0 0 0 2375.48 2171.01 0 0 0 0 0 0 0 0 0 0 0 0 0 0 0.08 -1580.48 0 0 0 661.718 428.556 0 0 0 0 0 0 0 0 2184.44 0 0 0 0 0 -1665.01 -2094.71 0 0 0 0 0 0 
1470.31 -754.494 0 0 0 1379.51 0 0 0 852.611 0 614.261 0 1241.11 0 1173.82 0 0 0 -100.024 0 0 0 0 0 0 0 0 0 0 0 0 -833.232 1274.68 0 1421.48 0.04 2377.77 0 0 0 -350.734 1129.87 1425.75 -2190.85 -2351.99 0 0 0 0 1368.68 0 0 0 0 0 0 0 0 2419.43 0 0 2495.73 0 
0 0 -1195.03 -153.584 1365.47 258.721 0 1165.43 0 0 1441.31 0 0 0 0 0 0 0 0 0 649.815 0 1815.16 0 1321.38 2293.39 0 0 0 0 0 0 0 0 0 0 1864.6 0.01 0 0 23.8807 0 0 0 0 21.5918 0 0 0 0 0 0 0 -636.845 0 320.673 0 0 -2489.62 0 0 -2189.02 0 0 
0 0 848.186 1983.32 0 838.267 0 2129.51 0 0 1445.74 0 306.635 0 0 0 0 0 0 0 0 0 0 0 -714.972 0 0 0 0 0 0 0 0 0 0 0 0 0 0.08 -1849.5 2211.45 0 1144.67 -802.408 -1309.02 0 0 0 0 0 0 0 -2037.03 0 0 0 0 1647.31 0 0 -1234.09 0 0 0 
0 0 0 0 1408.81 0 0 1399.81 -986.74 0 0 0 0 0 0 0 0 0 244.377 0 964.309 -17.6244 0 644.627 465.941 2479.4 0 0 -1563.84 0 85.3755 0 0 0 0 0 0 0 1826.3 0.05 1721.47 0 0 0 753.731 0 -2480.47 0 1995.38 0 0 0 0 0 0 0 0 -380.032 0 0 0 0 0 0 
1961.96 0 0 0 0 0 -2100.21 0 -1474.43 1522.49 0 370.113 0 0 0 0 0 0 435.27 0 0 0 0 0 0 1884.29 127.491 2283.93 0 0 0 0 0 0 -243.767 1288.72 0 2452.09 -1345.33 1099.96 0.03 2166.59 0 1655.4 0 0 0 0 0 0 0 0 0 -1346.71 0 0 0 0 890.149 0 0 0 0 0 
0 0 0 1058.46 0 2051.84 0 0 0 0 0 1616.34 0 0 0 0 -58.5192 -477.691 0 0 0 0 0 0 0 0 0 669.805 0 330.744 0 1809.52 0 -822.245 0 -2110.13 929.67 0 0 0 -1575.9 0.08 0 0 0 0 2391.96 0 614.566 0 -329.371 0 -782.571 0 -644.017 -876.873 -1432.77 0 0 0 0 0 0 0 
0 0 -332.881 0 0 0 0 0 0 0 0 0 0 0 0 0 -664.312 0 0 -1104.24 0 1951.12 0 0 0 0 0 0 0 1538.67 1195.79 -1602.76 0 0 0 0 -864.055 0 507.599 0 0 0 0 -331.355 0 0 0 0 2397 0 0 0 0 0 0 1283.99 0 0 0 0 0 0 1135.67 0 
0 0 0 0 0 22.8126 0 0 0 -1131.86 0 0 0 0 0 754.341 262.993 0 0 0 1677.98 -468.993 0 0 0 -2193.59 0 0 15.6407 0 0 0 0 0 1826.46 0 1986.98 0 1190.3 0 -2119.28 0 -1227.99 0.08 0 145.955 170.064 0 0 2235.4 0 0 1356.47 0 0 0 0 0 0 0 1002 0 1888.56 -491.424 
-907.239 0 0 0 0 0 0 0 -747.932 0 0 0 0 0 0 0 0 0 0 0 0 0 0 0 1366.39 2331.69 0 -1999.8 -318.232 0 0 -119.098 -420.316 0 0 0 1820.81 0 136.036 2248.22 0 0 0 0 0.08 0 0 0 0 0 0 0 0 0 0 0 0 1091.42 0 1481.6 0 0 0 0 
0 952.101 -1614.05 0 0 1828.14 2337.34 0 0 0 0 2009.26 976.363 0 -1058.46 246.361 -1737.95 -1343.81 0 0 0 0 0 0 0 0 -479.827 0 0 0 1362.27 0 0 0 -1619.69 0 321.894 1439.02 0 0 0 0 0 1318.78 0 0.02 0 0 1637.39 0 0 0 0 0 812.632 0 0 0 0 0 0 0 437.712 0 
2191.76 -1776.25 1113.85 0 0 0 0 0 2339.01 0 0 0 0 195.395 0 0 0 0 -27.0852 0 850.932 444.578 0 0 -215.69 0 0 0 1776.86 0 0 0 0 -775.246 0 0 0 0 0 846.965 0 1711.4 0 1497.77 0 0 0.06 0 0 0 0 0 0 0 0 0 0 0 0 0 0 0 0 0 
-1461.3 -740.15 0 0 0 0 0 2493.13 0 0 0 0 0 149.464 0 0 1609.62 0 0 1013.29 0 0 0 0 0 0 1660.74 0 0 0 1469.24 292.901 466.704 0 2034.29 0 0 0 0 0 0 0 0 0 0 0 0 0.07 0 -1432.77 -440.611 0 0 -1628.85 2195.27 0 0 0 0 -1115.53 0 0 0 0 
0 408.414 0 0 0 0 0 702.612 89.3429 21.7444 86.2911 164.266 -783.792 -164.724 0 0 2255.7 436.796 0 0 0 2369.38 0 0 0 0 0 0 2053.36 -2095.93 0 0 -2222.74 0 -740.15 0 0 0 0 -1944.87 0 171.59 652.409 0 0 -465.484 0 0 0.04 0 1830.73 1341.98 0 0 0 0 1564.76 0 0 0 1214.56 1965.93 0 0 
0 332.27 0 -916.852 -87.3592 861.003 0 0 2246.54 0 0 0 205.161 1446.2 2392.88 0 -517.365 -2389.98 2453.92 434.507 0 0 -98.9563 0 0 0 0 0 0 1015.27 0 1557.44 2357.48 2034.29 0 0 0 0 0 0 0 0 0 -2037.64 0 0 0 1932.51 0 0.08 -83.3918 0 0 0 0 1406.37 0 0 0 0 0 0 0 0 
0 0 370.876 2342.68 0 0 0 -2266.08 0 0 1245.69 -873.821 0 0 0 -1646.86 0 0 0 -1317.41 1522.64 0 0 -158.315 0 1561.56 0 0 232.17 663.549 1282.46 0 1180.38 0 -78.0511 -1055.71 1351.28 0 0 0 0 -1844.77 0 0 0 0 0 186.85 2230.83 677.892 0.06 0 0 0 0 688.726 0 0 0 0 0 0 0 0 
0 0 0 0 0 0 0 1318.02 0 1432.46 -320.673 0 0 0 0 -555.208 0 0 0 0 0 0 0 0 0 384.61 0 0 0 0 0 0 0 0 0 0 0 0 0 0 0 0 0 0 0 0 0 0 -1903.97 0 0 0.09 0 2361.75 0 1322.9 0 0 -1920.15 0 0 -344.63 0 1600.47 
1165.88 0 0 0 2210.07 0 965.224 0 0 -1192.59 0 0 -2042.53 1443.45 0 0 0 0 0 0 0 0 0 0 0 0 0 0 0 972.396 0 0 0 0 0 0 0 0 16.8615 0 0 353.938 0 1629.46 0 0 0 0 0 0 0 0 0.09 1122.7 0 0 0 0 0 0 0 0 0 0 
0 2445.68 0 0 0 0 0 0 0 0 0 0 155.721 1593.14 -1659.06 0 0 0 0 0 0 0 0 -1168.63 0 0 -798.746 1706.82 0 0 2355.49 0 0 -1018.94 301.599 0 0 -486.084 0 0 699.866 0 0 0 0 0 0 434.355 0 0 0 -2272.94 1234.09 0.07 0 0 1279.72 0 0 0 0 0 0 0 
0 0 0 0 0 0 0 0 0 0 0 -2433.16 1951.58 1637.7 0 0 0 0 323.115 0 -621.891 0 0 0 1259.12 -1388.67 0 0 0 0 -1697.36 0 424.131 0 0 0 0 0 0 0 0 1160.54 0 0 0 2287.13 0 183.187 0 0 0 0 0 0 0.05 0 0 0 0 0 0 0 0 2316.43 
0 0 0 0 -604.495 0 0 0 0 2402.34 0 -1226.62 0 0 0 208.518 0 0 -1317.41 -1420.87 0 0 0 0 2287.59 0 570.315 1051.59 -31.3578 446.562 830.332 0 0 0 0 0 0 1751.08 0 0 0 1354.03 -284.967 0 0 0 0 0 0 -85.3755 1325.19 1384.85 0 0 0 0.04 0 0 0 0 0 0 0 0 
0 0 0 0 0 -1867.81 35.6304 0 1760.69 0 0 713.599 -217.368 0 0 0 0 0 0 859.63 0 2424.16 0 0 0 0 0 0 0 -739.998 0 0 -6.94296 0 144.581 954.543 0 0 0 0 0 2039.02 0 0 0 0 0 0 -572.604 0 0 0 0 1938.61 0 0 0.06 0 0 0 614.261 0 0 0 
1434.29 0 0 0 1769.84 0 -729.469 0 0 0 -1860.48 0 -1424.99 0 0 0 0 0 0 0 0 0 1044.11 -1061.51 0 0 0 0 0 0 0 0 0 0 0 -1591.62 0 0 615.177 2449.34 0 0 0 0 -407.346 0 0 0 0 0 0 0 0 0 0 0 0 0.07 0 0 0 0 0 0 
0 0 0 0 0 0 0 0 0 0 0 -1047.17 1678.9 0 0 662.938 0 489.288 -2150.41 -0.686666 0 0 0 1575.75 0 0 0 0 0 0 0 0 0 0 0 0 0 -1067.46 0 0 1957.38 0 0 0 0 0 0 0 0 0 0 1101.79 0 0 0 0 0 0 0.05 0 0 1068.83 0 0 
0 0 0 0 0 1493.65 0 0 0 -149.617 0 0 0 0 0 0 2421.57 0 0 1172.44 0 0 0 0 0 0 0 0 0 0 0 0 0 25.8644 0 0 308.161 0 0 0 0 0 0 0 339.442 0 0 1350.98 0 0 0 0 0 0 0 0 0 0 0 0.03 0 0 0 0 
0 0 0 0 0 0 0 0 0 0 0 788.98 0 0 0 0 0 0 0 0 0 0 0 -1669.9 0 0 0 0 0 0 0 0 0 0 0 0 0 0 1321.22 0 0 0 0 410.55 0 0 0 0 677.129 0 0 0 0 0 0 0 773.11 0 0 0 0.03 957.137 -958.815 0 
0 0 0 0 0 0 0 0 0 0 0 0 0 0 0 2433.77 0 0 0 0 0 0 0 369.503 0 0 0 -867.565 0 0 0 561.922 0 0 0 0 0 192.801 0 0 0 0 0 0 0 0 0 0 1694.46 0 0 -293.359 0 0 0 0 0 0 934.4 0 993.301 0.06 0 0 
0 0 0 0 0 2446.29 0 0 0 0 0 1030.23 0 0 0 0 0 0 0 -2133.17 0 0 0 0 0 0 0 0 0 -896.1 0 0 0 0 0 0 -703.223 0 0 0 0 0 -638.523 -2315.97 0 1665.01 0 0 0 0 0 0 0 0 0 0 0 0 0 0 2474.67 0 0.05 0 
0 -385.678 0 0 0 1228.29 0 0 0 0 0 0 0 0 0 0 0 0 0 0 403.684 0 0 0 0 0 0 0 1126.67 0 0 0 0 0 0 0 0 0 0 0 0 0 0 -2325.59 0 0 0 0 0 0 0 1333.12 0 0 293.054 0 0 0 0 0 0 0 0 0.03 
