*Vertices 75
*Matrix 
0.07 0 -674.688 0 0 0 0 0 0 1136.59 0 0 610.446 0 0 0 0 0 0 0 227.287 0 0 -83.2392 623.264 0 0 0 739.235 0 0 2050.77 0 0 0 2497.86 0 2324.06 0 1746.5 2484.13 0 1727.73 -221.793 0 0 0 0 0 0 -1757.03 0 0 0 0 0 0 533.845 0 0 0 0 0 0 0 0 0 0 0 0 0 0 0 0 0 
0 0.03 26.9326 0 0 -9.99481 0 0 0 2495.57 0 0 0 1175.5 0 1758.55 0 0 0 1697.82 429.624 -1123.16 0 0 0 0 -2438.05 0 0 0 -2260.28 2475.59 0 -656.682 0 0 0 0 0 0 0 0 0 336.848 1599.09 0 0 0 0 282.525 0 0 0 -533.54 0 0 0 0 0 2191.76 0 0 0 0 0 0 0 -2250.97 0 0 0 0 0 0 0 
2262.57 2249.75 0.07 0 0 0 -1149.1 -1671.42 0 0 0 0 0 0 0 2169.64 0 1298.03 0 0 0 0 0 -1192.13 0 0 0 0 0 0 0 -130.543 -2365.72 0 0 0 1227.84 701.544 0 0 0 0 0 1739.17 -393.46 -576.724 0 -984.451 -2134.24 -1416.9 959.426 0 0 0 0 2187.19 0 0 0 0 0 0 0 0 1072.34 0 1937.24 0 0 0 1156.73 0 0 0 0 
0 0 0 0.01 0 0 0 0 0 -2269.74 0 0 561.159 -2112.42 1039.54 0 1131.4 0 236.747 1247.67 0 0 1958.3 0 0 0 1792.12 0 0 841.166 -633.488 0 0 0 582.98 -1252.56 0 0 0 0 0 0 0 0 0 0 0 1771.07 0 0 -1691.26 1703.92 0 0 0 -506.684 0 0 0 0 -941.267 0 0 0 0 0 0 0 0 0 0 1178.55 0 0 0 
0 0 0 0 0 0 0 0 0 0 2453.31 -1096.91 -1301.39 1617.71 1506.93 0 1944.11 0 1173.51 1124.99 -2203.51 0 0 0 0 0 718.787 0 1689.28 0 0 0 2443.08 -1017.72 0 0 0 -388.424 -56.5355 0 0 722.449 -778.603 0 0 0 0 0 0 0 0 0 0 0 0 -1491.67 0 0 0 0 0 0 0 0 0 0 0 0 0 0 -1675.7 0 0 0 452.818 
0 364.315 0 0 0 0.05 -1843.09 1421.32 0 0 0 0 0 0 0 0 0 0 0 1032.21 820.566 0 1285.67 0 2381.13 0 0 0 0 0 562.075 0 0 2451.63 0 2142.48 0 0 0 0 0 0 0 2222.89 1650.36 0 0 0 960.341 0 21.5918 1748.02 0 142.293 0 0 0 0 0 0 -731.605 0 -2323.45 0 0 -2472.53 0 0 0 0 2394.56 0 0 0 0 
0 0 841.777 0 0 1836.07 0.02 -745.338 516.602 0 -2035.51 181.967 0 2026.96 1632.82 -2267.14 0 0 0 0 0 0 654.851 0 0 1299.1 0 0 0 0 0 0 0 0 1417.66 0 0 -2082.35 0 0 0 2065.87 0 1277.73 -2119.13 0 0 0 0 0 0 -1156.58 0 1087.76 0 0 0 0 1766.95 0 0 0 0 0 0 0 -660.649 0 0 0 -1540.5 0 0 0 0 
0 0 -1003.83 0 0 1407.59 -1008.87 0.04 0 0 0 0 -299.768 0 0 0 0 1583.07 0 0 0 2483.21 0 1002.3 0 0 0 0 0 2482.6 1881.39 -1725.59 0 -1538.82 0 0 0 0 0 0 1711.25 0 0 1305.05 787.301 2393.49 0 0 -2255.7 0 2145.53 0 -2002.4 -1665.17 0 0 147.786 0 0 0 2353.05 0 0 1796.24 0 0 0 0 0 0 -2101.28 0 0 0 0 
0 0 0 0 0 0 -806.07 0 0.02 1711.4 0 0 2073.5 0 0 -149.922 0 0 0 -2448.42 0 2030.78 0 0 2467.5 0 0 0 0 455.87 0 0 -1798.68 2088.15 0 0 -1459.93 0 0 0 0 0 0 0 0 0 0 1779.46 0 0 0 0 -2254.17 0 0 0 0 0 -157.247 0 0 0 0 0 0 0 0 0 0 0 0 0 0 0 0 
-2367.24 96.82 0 1657.38 0 0 0 0 -151.296 0.03 0 0 0 606.784 0 0 0 0 0 0 2397.92 0 0 -2189.32 0 0 -556.581 340.358 0 0 1778.39 0 2154.38 1511.35 0 0 0 0 0 0 -2480.16 0 -710.7 923.719 0 0 0 1789.99 0 509.125 0 0 0 0 0 2456.82 0 0 0 0 -587.405 0 0 0 0 1759.47 0 443.968 2432.71 0 0 2059.77 0 0 0 
0 0 0 0 -740.15 0 -606.021 0 0 0 0.09 0 0 1271.02 0 -875.958 -1627.63 0 0 1696.75 0 2486.88 -1577.73 0 0 0 2211.14 0 0 -39.903 47.6852 0 0 -1875.74 1978.44 0 2329.1 0 2022.08 0 0 0 2104.94 -536.592 0 0 0 2419.89 0 0 0 0 0 1807.99 116.962 0 0 0 -2161.24 55.7726 0 0 0 0 0 0 0 0 0 0 0 343.104 0 0 0 
0 0 0 0 0.534074 0 1096.61 0 0 0 0 0 2032.61 236.29 2477.72 0 2250.05 1994.31 0 0 0 0 0 677.74 0 0 0 0 0 0 0 0 0 1853.77 307.245 0 -1551.48 -2396.69 0 0 -1423.46 557.497 0 0 -2205.34 1176.56 0 0 0 0 0 342.189 0 0 0 0 75.9148 0 0 0 0 1873.3 0 2402.19 250.175 0 0 0 1700.11 0 0 0 -1700.72 0 0 
236.9 0 0 -1739.78 1637.24 0 0 2160.18 1188.16 0 0 1410.18 0 1798.68 0 0 0 0 0 0 729.469 187.613 0 1400.42 0 0 0 0 0 1232.26 0 0 0 -1166.49 0 0 -151.143 0 0 0 -1303.37 -2028.79 0 0 138.325 0 -180.898 1652.65 0 0 1179.31 0 0 0 -66.9118 0 1065.48 -1829.2 638.981 0 0 0 0 0 0 10.3 0 0 0 0 0 0 240.41 0 0 
0 1808.15 0 181.814 729.774 0 1300.32 0 0 -283.135 -1380.73 -1630.99 83.2392 0.08 1770.91 0 0 0 0 -1377.83 411.924 143.361 0 0 -698.645 524.689 2179.1 0 -1954.02 0 0 2284.39 -1233.02 0 0 0 1827.98 -811.411 0 0 1159.02 0 0 0 0 0 0 0 -1138.42 1984.24 1158.41 -788.522 0 663.396 0 0 0 0 0 0 0 0 0 0 0 0 0 1896.04 0 0 0 0 0 0 0 
0 0 0 498.291 2413.48 0 1323.21 0 0 0 0 1755.81 0 -1311.91 0.02 0 0 -2121.88 0 -1079.52 0 0 2430.42 0 0 -512.787 0 0 0 0 0 0 0 2167.81 0 203.787 45.5489 1444.36 0 0 -974.075 0 0 0 0 0 -1494.87 0 810.343 0 -298.09 0 1596.96 1209.68 0 0 0 0 0 0 0 0 0 1034.96 1221.88 -1199.45 0 0 0 0 0 -1156.27 0 0 0 
0 -1128.19 2040.85 0 0 0 2322.69 0 1030.99 0 -291.375 0 0 0 0 0.01 0 0 0 0 0 0 0 0 0 0 0 0 0 0 0 0 0 0 0 0 0 27.0852 0 0 0 0 0 0 0 0 0 2052.29 0 0 0 544.984 0 0 0 0 0 0 0 -2497.1 0 0 0 0 0 0 0 0 0 0 443.968 0 0 0 0 
0 0 0 556.734 1573.61 0 0 0 0 0 899.457 1499.6 0 0 0 0 0.05 0 0 0 1981.03 0 0 0 1948.23 0 0 199.667 131.916 -407.498 0 -901.746 0 825.144 86.9015 0 0 0 0 0 0 -2318.41 0 881.146 0 0 -1785.56 0 0 0 0 0 -365.23 0 0 2050 0 0 0 0 0 0 1348.99 0 0 0 0 0 0 0 0 0 0 0 -2106.31 
0 0 -1709.11 0 0 0 0 699.561 0 0 0 2353.21 0 0 -157.552 0 0 0.09 0 0 2310.02 0 0 -1559.11 0 0 0 2148.27 0 0 1467.25 0 -1118.73 0 -1093.86 0 0 0 0 1435.36 0 236.9 0 24.6437 0 0 0 0 0 0 0 0 0 970.87 0 0 0 0 0 0 546.815 0 0 659.734 0 0 -1866.74 0 0 0 0 0 0 439.848 0 
0 0 0 -2117.15 452.361 0 0 0 0 0 0 0 0 0 0 0 0 0 0.05 0 0 -1513.49 0 0 0 0 0 0 0 0 1289.48 -1839.73 0 0 -101.398 0 -611.972 483.184 0 859.63 684.606 0 2290.34 0 0 -846.049 0 0 0 -1019.39 0 0 0 0 0 0 0 1173.67 0 0 2445.07 0 0 0 0 0 0 0 0 0 619.449 0 1660.28 0 0 
0 830.943 0 -466.552 1604.43 1361.35 0 0 2468.72 0 911.664 0 0 974.075 89.4955 0 0 0 0 0.07 0 0 -671.178 0 -1851.02 -1286.13 0 0 -133.137 0 0 1020.92 0 0 0 0 -2266.08 0 626.011 0 0 0 -1363.03 0 0 0 0 2196.04 907.392 0 -756.172 0 0 1978.59 0 -1564.15 0 0 0 0 0 0 0 0 0 0 0 0 0 0 0 0 0 0 0 
2342.52 -1415.83 0 0 2435.3 2242.73 0 0 0 2466.12 0 0 560.396 404.141 0 0 537.049 599.918 0 0 0 0 0 0 0 0 1719.95 0 0 0 0 0 2333.98 0 0 -1946.39 0 -1326.87 0 0 0 0 0 0 0 0 0 0 0 -1312.07 0 0 0 0 0 0 0 0 0 1688.97 1453.52 0 0 0 0 0 881.298 0 -739.387 0 0 0 0 0 0 
0 1828.44 0 0 0 0 0 1781.29 2357.17 0 -2264.7 0 -1684.55 -1211.81 0 0 0 0 -1855.6 0 0 0.02 0 0 0 0 0 0 0 0 0 0 0 0 0 0 2389.98 0 2169.18 0 0 1150.47 0 0 0 2374.11 -1901.23 0 0 0 0 2078.69 0 0 0 0 0 0 0 0 0 0 0 0 0 0 0 269.097 0 0 0 0 0 0 0 
0 0 0 2075.79 0 977.279 -213.095 0 0 0 1720.1 0 0 0 337.458 0 0 0 0 2050.92 0 0 0.09 0 0 0 0 -681.555 0 0 0 0 245.293 -1085.31 0 0 0 0 0 1359.98 0 -2184.59 0 0 2259.82 629.673 0 241.63 -2045.27 0 0 0 0 0 0 0 -1624.27 0 0 0 0 0 0 0 1967.91 0 0 0 -746.406 0 0 0 0 914.716 0 
-230.796 0 -407.956 0 0 0 0 2207.33 0 -1589.33 0 1265.07 -1378.29 0 0 0 0 -692.389 0 0 0 0 0 0 0 0 0 0 0 0 0 0 -1137.35 -95.4466 -1733.68 0 0 379.116 0 0 0 0 0 1911.45 0 0 2373.65 0 0 1059.83 0 271.996 0 0 2033.37 0 0 0 0 0 0 -440.153 0 0 0 1370.05 0 0 0 0 0 0 0 0 0 
-1251.03 0 0 0 0 1232.87 0 0 -654.851 0 0 0 0 1868.57 0 0 1120.87 0 0 -694.525 0 0 0 0 0.05 0 0 1198.84 1846.9 986.587 -1581.7 0 0 0 0 0 0 -1095.84 0 0 0 0 0 0 0 135.273 0 -1691.87 0 416.501 -1459.01 0 1350.98 0 0 0 0 0 0 0 0 0 0 0 0 0 0 0 1714 0 0 0 0 0 0 
0 0 0 0 0 0 629.521 0 0 0 0 0 0 856.12 839.793 0 0 0 0 2305.44 0 0 0 0 0 0.09 0 2118.67 0 0 0 0 0 0 0 0 0 0 0 0 0 0 2106.16 0 -456.481 -2384.33 0 0 0 -1266.59 0 0 -1034.35 0 0 0 0 2375.94 0 0 0 0 0 0 0 0 0 -175.558 0 0 0 -1602.3 0 0 0 
0 2328.18 0 1608.1 2063.43 0 0 0 0 1693.09 -1703.47 0 0 -2227.62 0 0 0 0 0 0 302.057 0 0 0 0 0 0.05 0 0 0 0 0 2229.61 0 0 0 0 0 0 0 0 0 1506.16 0 0 0 0 1840.49 0 -535.371 -579.928 -678.045 0 0 0 0 886.334 0 0 0 0 0 0 0 0 -2268.67 0 0 0 0 0 0 0 1408.35 0 
0 0 0 0 0 0 0 0 0 2096.39 0 0 0 0 0 0 1146.2 341.426 0 0 0 0 919.141 0 -316.401 -67.98 0 0 0 0 -1438.57 0 427.183 0 -2049.55 0 0 0 0 0 0 0 0 1267.51 0 190.817 0 -28.7637 0 -1739.94 0 1154.74 -637.303 0 0 0 0 0 0 0 0 0 0 1870.4 0 0 -992.996 0 0 0 0 0 0 0 0 
2139.58 0 0 0 1826.15 0 0 0 0 0 0 0 0 269.707 0 0 2202.6 0 0 -2215.26 0 0 0 0 -1769.54 0 0 0 0.09 0 0 0 1531.8 2468.57 0 -410.55 0 1738.41 0 -1250.72 0 0 0 1063.34 0 0 1244.47 0 2236.32 0 0 0 0 0 0 -980.636 0 0 0 0 0 -1002.61 0 0 0 0 0 0 -1099.35 0 0 0 -1114.61 307.855 0 
0 0 0 476.318 0 0 0 1320.61 -1301.54 0 -50.5844 0 1486.18 0 0 0 2182.3 0 0 0 0 0 0 0 1037.1 0 0 0 0 0.07 0 0 0 0 0 0 636.54 0 0 0 0 0 0 2213.43 0 0 0 1384.4 -1231.35 0 1634.04 2186.42 0 0 780.435 0 0 0 0 0 0 0 0 0 0 0 0 0 0 0 0 0 0 0 -814.768 
0 168.538 0 -465.178 0 1531.5 0 -71.337 0 -1889.02 2204.73 0 0 0 0 0 0 -1128.8 46.7696 0 0 0 0 0 1372.65 0 0 -1878.03 0 0 0.04 0 0 0 0 -1326.56 0 0 0 0 0 -2075.95 -101.245 0 0 0 -965.377 1433.99 0 2210.53 1099.35 0 0 0 2345.12 0 0 0 0 0 0 0 0 0 2056.72 0 -1272.7 0 0 0 0 0 0 0 0 
1353.27 951.033 1319.39 0 0 0 0 2172.38 0 0 0 0 0 -1623.81 0 0 -2024.83 0 2488.4 2304.83 0 0 0 0 0 0 0 0 0 0 0 0.03 0 -2010.94 -309.534 594.577 0 0 0 0 2367.55 0 0 397.275 0 0 0 -1108.2 0 0 0 0 530.335 -2096.7 0 0 0 119.709 0 0 0 -1295.28 0 0 0 0 0 0 0 0 0 0 0 0 0 
0 0 1414.15 0 1935.87 0 0 0 -1175.5 395.444 0 0 0 1443.14 0 0 0 -929.823 0 0 1654.94 0 1140.4 -985.977 0 0 1211.05 -2173.91 -2257.38 0 0 0 0.09 0 0 883.74 1395.23 0 0 0 0 -234.764 2134.85 0 0 0 0 0 0 0 1106.52 -433.134 0 0 0 0 -1881.08 0 0 0 0 0 0 0 0 0 0 0 0 0 0 0 0 -188.681 0 
0 -531.861 0 0 1109.42 2273.86 0 1273.61 -1255 1286.13 1043.05 -365.078 380.337 0 -992.691 0 -411.313 0 0 0 0 0 -2415.92 -710.547 0 0 0 0 1477.94 0 0 2241.36 0 0.08 -2357.17 0 0 224.998 0 0 0 -2383.57 559.633 0 0 0 0 0 2039.32 0 0 2272.18 0 0 0 0 0 0 0 0 0 0 0 0 0 0 0 0 0 0 0 0 0 0 0 
0 0 0 -357.448 0 0 1538.21 0 0 0 992.996 1273.31 0 0 0 0 251.854 -1634.19 1956.47 0 0 0 0 -774.483 0 0 0 -1292.54 0 0 0 482.269 0 -1711.55 0.03 -723.06 0 0 0 0 -738.929 2306.21 1070.67 0 -330.439 811.563 0 0 -1519.44 0 1514.86 971.023 0 0 0 0 0 1981.49 0 0 0 -1858.81 0 0 0 0 2395.93 0 1903.97 0 2407.38 0 0 0 0 
187.307 0 0 1319.85 0 1086.23 0 0 0 0 0 0 0 0 239.036 0 0 0 0 0 1801.58 0 0 0 0 0 0 0 -357.601 0 2327.42 -1311 -2314.75 0 1878.19 0.04 0 0 -922.193 0 0 0 0 1980.27 0 0 -70.2689 0 0 0 0 0 0 0 -1262.93 928.907 0 0 0 0 0 0 0 0 0 0 -943.251 0 0 0 0 0 0 0 0 
0 0 -2285.76 0 0 0 0 0 2350.46 0 2407.07 -958.815 830.485 1880.32 1090.04 0 0 0 1732.61 1027.02 0 -259.331 0 0 0 0 0 0 0 2387.23 0 0 -0.686666 0 0 0 0.09 137.715 0 0 -123.981 0 31.8155 0 0 0 0 -1283.38 0 0 0 0 931.806 0 1277.43 895.947 0 0 0 0 0 0 0 0 0 0 0 0 0 2279.96 2268.67 -542.543 0 -119.556 0 
-432.524 0 430.845 0 -734.809 0 2109.52 0 0 0 0 2488.4 0 -2249.29 431.455 1812.88 0 0 -1251.64 0 1193.5 0 0 1567.81 1869.95 0 0 0 -277.337 0 0 0 0 -492.798 0 0 -2051.99 0.08 0 0 1771.37 0 0 -1113.54 0 0 0 0 0 0 -1350.22 0 0 0 0 0 0 0 0 0 930.586 0 0 0 -1492.28 0 0 0 0 0 0 0 0 0 0 
0 0 0 0 1552.1 0 0 0 0 0 465.636 0 0 0 0 0 0 0 0 2321.16 0 780.282 0 0 0 0 0 0 0 0 0 0 0 0 0 1519.14 0 0 0.06 1324.27 0 0 0 0 0 0 0 -1137.65 1538.82 20.5237 0 0 0 0 0 0 0 1678.29 0 0 0 1202.66 0 0 0 0 -234.001 0 0 -1925.34 -2300.26 0 0 0 0 
-442.595 0 0 0 0 0 0 0 0 0 0 0 0 0 0 0 0 304.804 630.894 0 0 0 1956.31 0 0 0 0 0 -2082.66 0 0 0 0 0 0 0 0 0 -1655.86 0.07 0 1814.1 0 0 -1824.63 0 0 0 0 1855.6 0 0 0 0 121.998 2188.1 0 0 0 0 0 0 0 2021.62 0 0 1983.17 0 -1628.85 0 0 0 0 0 0 
-1729.87 0 0 0 0 0 0 -1230.12 0 -618.381 0 2496.34 -426.115 1080.43 -884.808 0 0 0 1444.52 0 0 0 0 0 0 0 0 0 0 0 0 2354.27 0 0 -2166.59 0 31.8155 1780.37 0 0 0.09 0 -1225.85 0 0 1694.31 0 2354.27 0 0 0 0 0 0 0 0 0 0 0 0 0 0 -1182.21 0 0 0 0 0 942.64 0 0 0 0 0 0 
0 0 0 0 -1094.93 0 -1869.64 0 0 0 0 1241.72 978.042 0 0 0 2346.34 -1146.35 0 0 0 -902.966 -942.946 0 0 0 0 0 0 0 762.886 0 978.195 1753.06 263.756 0 0 0 0 1343.04 0 0.01 497.223 0 0 0 0 0 2495.42 -612.278 0 0 1804.03 399.106 0 -2221.37 0 0 0 0 0 1904.74 0 1788.46 0 0 0 0 0 0 0 0 0 0 0 
-384.152 0 0 0 -2442.78 0 0 0 0 -131.611 426.115 0 0 0 0 0 0 0 447.63 1196.1 0 0 0 0 0 851.543 862.529 0 0 0 -50.5844 0 -2354.73 1103.93 1617.86 0 1014.66 0 0 0 874.889 2192.53 0.02 0 0 2245.02 0 0 768.075 0 1885.81 0 622.196 0 2337.95 0 0 0 1805.09 0 0 0 0 0 0 0 0 0 0 1418.58 1976.91 0 2460.33 0 0 
-761.208 -1925.03 1752.45 0 0 2490.08 785.318 803.171 0 2229.61 902.814 0 0 0 0 0 2404.78 -176.931 0 0 0 0 0 2070.91 0 0 0 -477.081 2292.78 870.464 0 -823.466 0 0 0 -178.152 0 -485.321 0 0 0 0 0 0.05 0 0 -551.393 -1981.8 0 0 0 0 0 -867.87 0 0 0 -636.54 -551.393 0 0 0 0 0 0 0 0 -766.243 -1188.16 0 0 0 0 0 0 
0 2210.38 -1857.74 0 0 -339.9 -1887.49 886.486 0 0 0 1502.81 -357.448 0 0 0 0 0 0 0 0 0 1867.35 0 0 1009.93 0 0 0 0 0 0 0 0 1224.78 0 0 0 0 -278.253 0 0 0 0 0.01 0 704.291 -145.497 0 0 0 0 1011.61 0 0 0 0 0 0 0 0 0 0 0 0 -1702.86 0 0 38.5296 0 0 1666.08 0 0 0 
0 0 -1402.55 0 0 0 0 2460.33 0 0 0 -2438.51 0 0 0 0 0 0 -165.181 0 0 -1876.51 -407.651 0 1602.45 808.054 0 1283.84 0 0 0 0 0 0 -1808.3 0 0 0 0 0 2417.91 0 1229.51 0 0 0.07 0 478.607 0 0 0 0 0 0 0 0 0 0 0 0 0 1920.61 0 0 0 0 0 0 0 0 -417.57 0 0 0 0 
0 0 0 0 0 0 0 0 0 0 0 0 -923.719 0 544.526 0 1173.97 0 0 0 0 2392.73 0 -1001.08 0 0 0 0 -646.001 0 1712.32 0 0 0 0 -605.716 0 0 0 0 0 0 0 -367.367 -583.59 0 0.03 0 0 2434.54 0 0 0 0 0 0 -402.463 0 0 0 0 0 0 0 0 0 0 0 0 0 0 -1803.11 0 0 0 
0 0 -1155.35 -1718.27 0 0 0 0 489.593 -1804.94 1520.36 0 2145.53 0 0 1601.54 0 0 0 2326.5 0 0 1285.36 0 -144.124 0 671.331 -544.679 0 1737.04 585.421 -1325.04 0 0 0 0 -1551.48 0 348.292 0 -1333.74 0 0 579.623 -310.297 1297.27 0 0.02 0 0 0 0 0 411.771 0 0 0 0 0 0 0 0 0 0 0 0 0 0 0 0 0 2442.32 0 0 0 
0 0 1187.86 0 0 -618.686 0 778.298 0 0 0 0 0 1050.37 -1313.9 0 0 0 0 1071.58 0 0 -1299.55 0 0 0 0 0 258.873 1493.35 0 0 0 1221.27 1814.1 0 0 0 356.533 0 0 479.522 79.1192 0 0 0 0 0 0.09 0 0 0 1756.11 -86.7489 0 0 0 0 0 0 0 0 0 0 0 0 2420.96 320.063 0 -454.955 0 0 0 0 1451.99 
0 -989.029 2093.34 0 0 0 0 0 0 2130.42 0 0 0 425.962 0 0 0 0 -522.401 0 -931.501 0 0 1189.38 1550.87 -832.011 294.733 -1088.06 0 0 -962.477 0 0 0 0 0 0 0 1851.48 121.845 0 1830.88 0 0 0 0 -465.026 0 0 0.08 0 0 0 0 0 0 0 0 0 0 0 0 0 0 0 0 0 0 0 0 0 494.018 0 0 2283.01 
-1356.93 0 -80.0348 -1540.65 0 1564.61 0 -2434.54 0 0 0 0 1087.3 2487.95 1195.94 0 0 0 0 948.592 0 0 0 0 2133.63 0 325.098 0 0 2236.93 -949.202 0 -1358.46 0 1850.11 0 0 -1899.85 0 0 0 0 -1856.36 0 0 0 0 0 0 0 0.02 0 0 -2063.74 0 1735.36 0 0 0 0 0 0 0 0 0 0 0 0 0 2068.01 0 0 2265.01 0 0 
0 0 0 726.112 0 -1881.08 -308.313 0 0 0 0 2089.68 0 1446.81 0 325.861 0 0 0 0 0 -859.783 0 1274.83 0 0 -1957.53 499.359 0 11.3681 0 0 -1682.87 1297.42 999.863 0 0 0 0 0 0 0 0 0 0 0 0 0 0 0 0 0.03 0 2480.62 0 0 0 -664.159 0 0 0 0 0 0 0 0 0 0 0 0 0 0 0 0 0 
0 0 0 0 0 0 0 680.486 1691.26 0 0 0 0 0 1413.69 0 -1424.68 0 0 0 0 0 0 0 -873.974 -1688.97 0 392.392 0 0 0 209.738 0 0 0 0 420.927 0 0 0 0 2341.61 1903.97 0 2338.86 0 0 0 -1267.97 0 0 0 0.09 -349.208 0 0 0 0 0 0 0 0 0 -350.276 0 0 -2078.08 -331.355 0 0 0 0 0 -261.162 0 
0 -1833.93 0 0 0 571.383 2333.22 -1877.57 0 0 -2307.58 0 0 1252.25 -2144.46 0 0 207.45 0 2226.1 0 0 0 0 0 0 0 0 0 0 0 345.393 0 0 0 0 0 0 0 0 0 -92.2422 0 1227.68 0 0 0 -1114 2353.82 0 1794.26 2346.64 -2276.76 0.09 0 1482.36 -862.682 0 0 0 0 0 917.463 0 0 0 0 0 187.307 0 1241.87 0 485.626 0 0 
0 0 0 0 0 0 0 0 0 0 -969.955 0 -1192.43 0 0 0 0 0 0 0 0 0 0 2284.08 0 0 0 0 0 2101.73 2119.59 0 0 0 0 -181.661 -124.134 0 0 2262.57 0 0 -1967.45 0 0 0 0 0 0 0 0 0 0 0 0.02 0 0 -1055.86 0 0 0 0 0 0 0 0 0 0 0 -482.116 0 0 0 0 0 
0 0 949.66 -2180.47 -43.26 0 0 0 0 1705.76 0 0 0 0 0 0 2384.33 0 0 1422.39 0 0 0 0 0 0 0 0 -508.057 0 0 0 0 0 0 -1630.99 -1817.61 0 0 -1511.96 0 993.149 0 0 0 0 0 0 0 0 1018.48 0 0 532.929 0 0.01 0 0 0 0 0 0 0 0 0 0 0 0 0 0 0 0 0 0 0 
0 0 0 0 0 0 0 505.615 0 0 0 -618.686 -1670.96 0 0 0 0 0 0 0 0 0 1684.39 0 0 0 -1533.17 0 0 0 0 0 1643.5 0 0 0 0 0 0 0 0 0 0 0 0 0 1834.54 0 0 0 0 0 0 2346.49 0 0 0.03 0 0 0 0 0 0 0 0 0 0 0 0 0 0 0 0 0 0 
2484.44 0 0 0 0 0 0 0 0 0 0 0 -373.012 0 0 0 0 0 772.5 0 0 0 0 0 0 -140.614 0 0 0 0 0 740.455 0 0 -244.53 0 0 0 -1710.94 0 0 0 0 301.447 0 0 0 0 0 0 0 1199.76 0 0 -375.759 0 0 0.09 0 0 0 0 -2446.59 0 0 0 1211.66 0 0 0 0 0 0 0 85.0703 
0 0 0 0 0 0 -1923.51 0 663.854 0 1251.64 0 -254.753 0 0 0 0 0 0 0 0 0 0 0 0 0 0 0 0 0 0 0 0 0 0 0 0 0 0 0 0 0 2202.29 1485.41 0 0 0 0 0 0 0 0 0 0 0 0 0 0 0.05 0 0 0 0 0 0 0 0 0 0 0 0 0 0 0 0 
0 1256.37 0 0 0 0 0 0 0 0 -1207.24 0 0 0 0 -1313.59 0 0 0 0 1258.05 0 0 0 0 0 0 0 0 0 0 0 0 0 0 0 0 0 0 0 0 0 0 0 0 0 0 0 0 0 0 0 0 0 0 0 0 0 0 0.03 0 0 0 0 0 0 0 0 0 0 0 1271.78 0 0 0 
0 0 0 500.275 0 -1702.86 0 189.291 0 -1252.1 0 0 0 0 0 0 0 1279.26 1957.23 0 1865.06 0 0 0 0 0 0 0 0 0 0 0 0 0 0 0 0 1737.19 0 0 0 0 0 0 0 0 0 0 0 0 0 0 0 0 0 0 0 0 0 0 0.02 0 0 0 -337.764 0 0 0 0 0 0 0 -1882.76 0 0 
0 0 0 0 0 0 0 0 0 0 0 163.198 0 0 0 0 0 0 0 0 0 0 0 619.602 0 0 0 0 -317.469 0 0 -675.756 0 0 -818.278 0 0 0 602.359 0 0 1994.16 0 0 0 665.227 0 0 0 0 0 0 0 0 0 0 0 0 0 0 0 0.05 0 0 0 -950.27 0 0 0 0 0 0 0 0 0 
0 0 0 0 0 1537.6 0 0 0 0 0 0 0 0 0 0 779.672 0 0 0 0 0 0 0 0 0 0 0 0 0 0 0 0 0 0 0 0 0 0 0 1945.63 0 0 0 0 0 0 0 0 0 0 0 0 -389.798 0 0 0 -757.546 0 0 0 0 0.01 0 0 0 0 -2007.74 0 0 0 0 0 0 0 
0 0 0 0 0 0 0 2147.97 0 0 0 -1200.37 0 0 2405.24 0 0 1053.73 0 0 0 0 0 0 0 0 0 1349.3 0 0 0 0 0 0 0 0 0 0 0 2242.88 0 -2000.56 0 0 0 0 0 0 0 0 0 0 2396.39 0 0 0 0 0 0 0 0 0 0 0.08 0 -2335.35 0 0 852.458 0 0 0 0 0 0 
0 0 758.461 0 0 0 0 0 0 0 0 1579.71 0 0 -1032.98 0 0 0 0 0 0 0 -1236.23 0 0 0 0 0 0 0 -874.432 0 0 0 0 0 0 1242.33 0 0 0 0 0 0 0 0 0 0 0 0 0 0 0 0 0 0 0 0 0 0 -570.772 0 0 0 0 0 0 0 0 0 0 0 0 0 0 
0 0 0 0 0 1679.05 0 0 0 323.267 0 0 1779.15 0 -2118.82 0 0 0 0 0 0 0 0 290.307 0 0 -956.984 0 0 0 0 0 0 0 0 0 0 0 0 0 0 0 0 0 1031.45 0 0 0 0 0 0 0 0 0 0 0 0 0 0 0 0 1324.43 0 -366.604 0 0.01 0 0 0 -1292.38 0 -1771.83 0 0 2412.41 
0 0 1614.51 0 0 0 1639.53 0 0 0 0 0 0 0 0 0 0 -1702.55 0 0 993.454 0 0 0 0 0 0 -1369.14 0 0 2010.33 0 0 0 36.6985 582.98 0 0 1309.32 -351.039 0 0 0 0 0 0 0 0 -2377.93 0 0 0 -1323.05 0 0 0 0 650.578 0 0 0 0 0 0 0 0 0.06 0 0 0 0 0 0 0 0 
0 -2159.87 0 0 0 0 0 0 0 592.593 0 0 0 1862.16 0 0 0 0 0 0 0 -2346.03 0 0 0 1108.36 0 0 0 0 0 0 0 0 0 0 0 0 0 0 0 0 0 778.756 0 0 0 0 1280.18 0 0 0 1695.07 0 0 0 0 0 0 0 0 0 2453.76 0 0 0 0 0.08 0 0 0 0 0 0 0 
0 0 0 0 0 0 0 0 0 662.328 0 1478.55 0 0 0 0 0 0 0 0 1133.84 0 41.2763 0 -1252.86 0 0 0 -48.1429 0 0 0 0 0 -1451.84 0 0 0 0 -139.698 713.446 0 0 -83.0866 21.4393 0 0 0 0 0 0 0 0 488.678 0 0 0 0 0 0 0 0 0 -770.516 0 0 0 0 0.06 0 0 0 0 0 0 
0 0 0 0 0 0 0 0 0 0 0 0 0 0 0 0 0 0 0 0 0 0 0 0 0 0 0 0 0 0 0 0 0 0 0 0 -1221.58 0 -686.132 0 0 0 2042.07 0 0 0 0 0 267.724 0 -1111.41 0 0 0 -501.953 0 0 0 0 0 0 0 0 0 0 2151.33 0 0 0 0.08 0 0 0 0 0 
0 0 2207.33 0 -1361.05 1829.05 -47.6852 758.156 0 0 0 0 0 0 0 862.835 0 0 1138.42 0 0 0 0 0 0 0 0 0 0 0 0 0 0 0 -1744.82 0 -1280.48 0 -655.309 0 0 0 1706.06 0 0 1450.01 0 0 0 0 0 0 0 2197.87 0 0 0 0 0 0 0 0 0 0 0 0 0 0 0 0 0.03 0 0 0 0 
0 0 0 -566.652 0 0 0 0 0 -1580.78 2300.56 0 0 0 -1875.74 0 0 0 0 0 0 0 0 0 0 -673.009 0 0 0 0 0 0 0 0 0 0 1530.27 0 0 0 0 0 0 0 -1864.3 0 746.406 -2330.32 0 1190.15 0 0 0 0 0 0 0 0 0 1414.91 0 0 0 0 0 1501.89 0 0 0 0 0 0.06 0 0 0 
0 0 0 0 0 0 0 0 0 0 0 -241.63 -683.233 0 0 0 0 0 -1587.19 0 0 0 0 0 0 0 0 0 2368.31 0 0 0 0 0 0 0 0 0 0 0 0 0 -557.192 0 0 0 0 0 0 0 -526.521 0 0 1955.4 0 0 0 0 0 0 1839.88 0 0 0 0 0 0 0 0 0 0 0 0.01 0 0 
0 0 0 0 0 0 0 0 0 0 0 0 0 0 0 0 0 2440.64 0 0 0 0 -1072.5 0 0 0 -190.817 0 1692.63 0 0 0 -1099.35 0 0 0 214.469 0 0 0 0 0 0 0 0 0 0 0 0 0 0 0 112.232 0 0 0 0 0 0 0 0 0 0 0 0 0 0 0 0 0 0 0 0 0.01 0 
0 0 0 0 -520.112 0 0 0 0 0 0 0 0 0 0 0 1639.07 0 0 0 0 0 0 0 0 0 0 0 0 -2061.75 0 0 0 0 0 0 0 0 0 0 0 0 0 0 0 0 0 0 1541.11 1776.41 0 0 0 0 0 0 0 726.569 0 0 0 0 0 0 0 -2314.14 0 0 0 0 0 0 0 0 0.02 
