*Vertices 68
*Matrix 
0.01 0 0 1091.72 0 0 0 -1091.72 0 0 -685.064 0 0 0 0 0 0 0 0 0 0 2284.54 0 0 0 0 0 0 0 0 0 0 0 0 0 0 0 0 2252.8 -1533.02 0 0 1033.43 0 0 -889.843 1871.17 0 0 0 0 472.808 0 487.457 1112.63 0 0 0 0 0 0 0 0 0 0 0 0 0 
0 0.07 0 0 0 0 0 0 0 0 0 0 1372.65 0 0 0 1655.71 0 0 0 0 0 0 0 0 0 0 0 0 0 0 0 0 -534.913 0 0 0 0 0 0 0 0 0 0 0 0 0 0 0 0 0 0 534.15 0 0 0 0 0 0 0 0 0 0 0 0 0 0 0 
0 0 0.08 0 -196.463 0 0 0 0 0 2242.88 0 0 0 0 453.581 0 0 1266.59 0 0 1652.2 0 1846.9 0 0 0 0 -1122.85 0 -563.448 0 0 0 0 0 0 0 0 0 0 0 0 -4.80667 0 0 0 0 0 1868.57 -2483.21 0 0 -2241.97 0 0 0 0 0 0 0 0 0 0 0 0 0 0 
167.776 0 0 0 0 0 0 2209.46 1102.25 0 -1339.38 2313.84 0 0 0 0 0 0 0 0 -670.568 0 0 0 0 0 0 0 0 0 0 0 0 0 0 0 0 0 0 0 0 -1240.96 0 0 0 0 2146.75 0 0 -2130.27 0 0 0 0 0 0 0 0 0 0 0 0 0 0 0 808.817 0 0 
0 0 -770.211 0 0.07 2127.52 0 0 0 0 0 0 0 0 0 0 0 0 0 0 0 0 0 -648.289 0 0 0 -1616.64 262.383 0 0 0 0 0 0 0 0 0 0 0 0 0 0 0 0 0 2444.61 0 0 0 0 0 0 0 1992.32 0 0 0 0 0 0 0 0 0 0 0 0 0 
0 0 0 0 135.884 0.06 1521.58 -871.838 0 0 0 0 763.497 0 0 0 1696.91 0 0 -1766.03 0 0 0 0 0 0 0 -822.703 0 0 0 0 0 -1427.12 0 0 0 0 0 0 0 0 0 0 0 0 1270.87 0 0 0 1926.71 0 0 0 -1014.66 0 0 0 0 0 0 0 0 0 0 0 0 0 
0 0 0 0 0 70.8792 0.06 0 0 0 0 0 0 0 0 0 0 0 0 189.749 0 0 0 0 0 -1149.56 0 0 0 0 0 0 0 0 0 0 0 0 0 0 0 0 -937.3 1265.53 0 1417.2 0 0 0 965.224 0 0 0 0 0 -47.0748 -420.774 0 0 0 0 0 0 0 0 0 0 0 
58.2141 0 0 -1214.87 0 -546.205 0 0.01 0 -517.365 0 0 1864.6 473.266 0 0 0 0 0 -171.133 0 0 0 0 0 1325.95 0 0 0 0 0 -1938.92 0 0 0 0 -1141.47 0 0 -1449.86 0 0 1777.47 0 0 976.669 0 0 0 0 0 -552.309 0 -985.977 1988.97 0 0 0 0 0 0 0 0 0 0 0 0 0 
0 0 0 1555.15 0 0 0 0 0 0 0 0 0 0 0 0 0 0 0 0 0 0 0 0 0 0 2454.68 0 -1629.76 0 0 0 0 0 0 0 0 0 0 0 0 0 0 -1601.08 0 1359.98 0 0 0 0 0 2444.91 0 0 0 0 0 0 0 0 0 0 0 0 0 1803.26 0 0 
0 0 0 0 0 0 0 -681.707 0 0.08 671.484 0 0 0 0 0 0 0 0 0 0 0 0 0 0 0 0 0 0 0 0 0 0 -1289.79 0 0 1452.91 0 0 1392.03 0 1467.86 0 -12.4363 0 0 0 0 1398.28 0 0 0 0 1917.1 0 0 0 0 0 0 0 0 0 0 0 0 0 0 
1467.25 0 1317.71 1484.8 0 0 0 0 0 1501.43 0.07 0 0 137.867 0 0 0 -648.595 0 0 0 -158.162 -2161.55 0 0 0 0 0 0 0 0 0 0 0 0 0 0 0 0 -1785.56 1860.79 0 0 0 0 0 0 0 0 0 0 355.007 0 0 0 0 0 0 712.531 0 0 0 0 0 0 0 0 0 
0 0 0 -1026.11 0 0 0 0 0 0 0 0.04 666.906 0 0 0 0 499.512 0 0 0 1968.98 0 0 -442.747 0 0 0 1399.2 0 0 618.839 0 0 0 1998.28 1231.65 0 0 0 0 0 0 0 0 0 0 0 0 0 0 762.276 0 0 0 0 0 0 0 0 0 0 0 0 0 0 0 0 
0 763.497 0 0 0 243.309 0 2095.93 0 0 0 2046.19 0.06 0 0 0 0 0 0 -1608.25 0 0 0 0 586.489 0 0 0 0 0 0 0 0 0 0 0 0 0 0 0 0 0 0 0 0 0 0 -2306.36 1325.8 0 0 0 0 0 0 0 0 0 0 0 0 0 0 0 0 0 0 0 
0 0 0 0 0 0 0 2105.85 0 0 122.15 0 0 0.09 0 0 0 0 2284.39 0 2389.52 0 0 0 0 0 0 0 0 0 0 0 0 0 0 0 0 -1172.6 0 0 0 401.395 0 -800.119 0 0 0 0 0 0 0 0 0 0 0 0 0 0 0 0 0 0 0 0 0 0 1941.21 0 
0 0 0 0 0 0 0 0 0 0 0 0 0 0 0.03 0 0 0 0 0 0 0 0 1224.94 0 0 0 0 0 0 0 0 0 -531.861 0 0 0 0 0 0 0 0 0 0 0 0 0 0 0 0 0 0 0 0 0 0 0 0 0 0 0 0 0 0 0 0 1848.58 0 
0 0 1417.2 0 0 0 0 0 0 0 0 0 0 0 0 0.06 0 0 0 0 0 0 0 1614.81 0 0 0 0 0 0 0 -1370.36 0 1435.51 0 0 -961.867 0 0 0 0 0 0 0 0 0 0 0 -1420.87 0 0 0 0 0 0 0 0 0 0 0 0 0 0 0 0 0 2438.51 0 
0 -531.251 0 0 0 2398.07 0 0 0 0 0 0 0 0 0 0 0 0 0 0 0 0 0 0 0 0 0 0 0 0 0 0 0 0 -181.204 0 0 0 0 0 0 0 288.171 0 0 0 0 0 0 0 0 0 0 328.15 -2140.49 0 0 0 0 0 0 0 0 0 0 0 0 0 
0 0 0 0 0 0 0 0 0 0 -1544.62 686.895 0 0 0 0 0 0.09 0 0 0 0 864.971 0 0 0 0 0 0 0 0 0 0 0 0 0 0 0 0 0 0 0 0 0 0 0 0 0 0 0 0 0 1321.99 0 0 2138.2 0 0 0 0 0 1271.17 0 0 0 0 0 0 
0 0 1070.82 0 0 0 0 0 0 0 0 0 0 274.743 0 0 0 0 0.05 1164.97 0 0 0 0 0 0 0 0 201.193 0 0 0 0 0 -2108.45 0 0 2261.04 -933.638 0 0 477.538 0 0 0 0 0 0 0 0 0 0 0 0 0 0 0 0 0 0 0 0 0 0 0 0 0 0 
0 0 0 0 0 -2114.09 1256.52 -1004.14 0 0 0 0 740.15 0 0 0 0 0 -2.06 0.05 0 0 0 0 0 0 0 0 0 0 0 0 0 0 2241.66 0 1507.69 0 0 0 0 0 0 0 -398.648 0 0 0 0 0 0 0 1717.66 0 0 0 0 0 0 0 0 0 0 0 0 0 0 0 
0 0 0 600.528 0 0 0 0 0 0 0 0 0 1341.36 0 0 0 0 0 0 0.06 0 0 0 1813.79 942.793 0 0 0 0 0 0 0 0 0 0 0 1935.1 0 0 0 157.399 766.854 0 0 0 0 0 0 0 0 0 0 0 0 0 0 0 0 0 0 0 0 0 0 0 0 0 
-1304.9 0 86.1385 0 0 0 0 0 0 0 2323.15 484.558 0 0 0 0 0 0 0 0 0 0.07 0 0 0 0 0 0 0 0 1214.56 0 0 0 0 0 0 0 0 0 0 0 0 0 0 0 0 -371.639 0 0 0 0 0 0 0 0 0 0 0 0 0 0 0 0 0 0 0 0 
0 0 0 0 0 0 0 0 0 0 1630.99 0 0 0 0 0 0 2402.49 0 0 0 0 0.05 0 0 0 0 0 0 0 1950.82 0 0 0 0 0 0 0 0 0 0 0 0 0 0 0 0 0 0 468.23 0 -8.01111 779.824 0 0 0 0 0 0 0 0 0 0 0 0 0 0 0 
0 0 1433.23 0 1687.75 0 0 0 0 0 0 0 0 0 2019.33 -1116.6 0 0 0 0 0 0 0 0.02 0 0 0 0 1778.39 0 0 0 0 0 0 -586.795 0 0 0 0 1166.65 0 0 8.77407 0 0 0 0 0 0 1207.69 0 0 0 0 0 0 0 0 0 0 0 0 0 0 0 0 0 
0 0 0 0 0 0 0 0 0 0 0 -491.272 1915.27 0 0 0 0 0 0 0 -865.429 0 0 0 0.06 0 0 0 0 0 0 0 0 629.826 0 0 0 0 0 0 0 0 0 0 2061.14 2065.57 0 0 0 0 0 0 0 0 0 0 0 0 0 0 0 0 0 0 0 0 0 0 
0 0 0 0 0 0 1640.14 -2170.71 0 0 0 0 0 0 0 0 0 0 0 0 1513.79 0 0 0 0 0.04 0 858.867 0 0 0 0 0 0 0 0 0 0 -2382.5 0 0 0 0 -1740.09 0 0 1160.85 1861.25 0 0 0 0 0 2413.17 0 0 0 0 0 0 0 0 0 0 0 0 0 0 
0 0 0 0 0 0 0 0 2384.18 0 0 0 0 0 0 0 0 0 0 0 0 0 0 0 0 0 0.05 0 0 0 0 0 0 -574.892 0 0 0 0 0 0 2428.89 0 0 0 0 0 1554.23 0 -2412.56 0 0 0 -465.941 0 0 0 0 0 0 2068.01 0 0 0 0 0 0 0 0 
0 0 0 0 1023.21 2022.69 0 0 0 0 0 0 0 0 0 0 0 0 0 0 0 0 0 0 0 2226.25 0 0.07 0 0 0 0 0 0 1874.98 0 0 0 0 0 0 1554.84 0 0 0 0 0 0 1765.88 946.913 0 0 812.174 0 0 0 0 0 0 0 0 0 0 0 0 0 0 0 
0 0 -1250.42 0 -2172.54 0 0 0 678.503 0 0 705.664 0 0 0 0 0 0 2001.02 0 0 0 0 -1739.94 0 0 0 0 0.02 0 0 0 0 0 0 0 0 0 0 0 0 0 2061.6 639.134 0 0 0 0 0 0 0 0 0 0 0 0 0 0 0 0 0 0 0 0 0 0 0 0 
0 0 0 0 0 0 0 0 0 0 0 0 0 0 0 0 0 0 0 0 0 0 0 0 0 0 0 0 0 0 0 0 0 2132.25 0 0 0 0 0 0 0 1739.02 0 1078.45 0 0 0 0 0 0 0 -2123.86 0 0 0 0 0 0 0 0 0 0 0 0 0 0 0 0 
0 0 1394.16 0 0 0 0 0 0 0 0 0 0 0 0 0 0 0 0 0 0 -1583.68 2095.17 0 0 0 0 0 0 0 0.02 0 0 0 816.294 0 0 0 -613.193 0 0 0 0 0 2003.16 445.647 0 0 0 0 1664.1 0 0 0 0 0 0 0 0 0 0 0 0 0 0 0 0 0 
0 0 0 0 0 0 0 -93.1578 0 0 0 -1879.1 0 0 0 1298.03 0 0 0 0 0 0 0 0 0 0 0 0 0 0 0 0.01 0 0 0 0 0 0 0 0 2340.54 0 876.11 0 0 -1214.87 0 0 0 0 0 0 0 0 0 0 0 0 0 0 0 0 0 0 0 0 0 0 
0 0 0 0 0 0 0 0 0 0 0 0 0 0 0 0 0 0 0 0 0 0 0 0 0 0 0 0 0 0 0 0 0.02 0 753.121 0 0 0 0 0 0 0 0 0 0 1321.38 0 899.152 0 0 0 1931.9 0 0 0 0 0 0 0 0 0 0 0 0 0 0 0 0 
0 2275.23 0 0 0 2308.04 0 0 0 1995.22 0 0 0 0 -2089.37 -709.632 0 0 0 0 0 0 0 0 -1586.43 0 1617.86 0 0 555.818 0 0 0 0.07 -2262.26 0 0 0 1799.75 0 0 0 0 0 0 67.5222 0 0 0 0 0 1210.14 0 0 0 0 0 0 0 0 0 0 0 0 0 0 0 -1690.34 
0 0 0 0 0 0 0 0 0 0 0 0 0 0 0 0 2306.05 0 80.9503 -1967.45 0 0 0 0 0 0 0 1641.06 0 0 -2256.61 0 1577.58 919.141 0.03 0 0 0 0 0 0 0 0 0 0 0 0 465.026 0 0 0 0 0 0 0 0 0 0 0 0 0 0 67.6748 0 0 0 0 0 
0 0 0 0 0 0 0 0 0 0 0 2118.37 0 0 0 0 0 0 0 0 0 0 0 1305.35 0 0 0 0 0 0 0 0 0 0 0 0.04 0 0 0 0 0 0 0 0 0 0 0 0 -1371.58 0 0 0 0 0 -328.761 0 0 0 0 0 0 0 0 0 0 0 0 0 
0 0 0 0 0 0 0 -1655.71 0 -422.452 0 2498.02 0 0 0 -2093.04 0 0 0 996.2 0 0 0 0 0 0 0 0 0 0 0 0 0 0 0 0 0.01 0 878.246 -2390.29 0 -634.251 0 0 0 0 2480.62 0 0 0 0 0 0 2489.62 0 0 0 0 0 0 0 0 0 0 0 0 0 0 
0 0 0 0 0 0 0 0 0 0 0 0 0 925.092 0 0 0 0 181.356 0 128.254 0 0 0 0 0 0 0 0 0 0 0 0 0 0 0 0 0.01 0 0 1590.55 0 0 1069.14 0 -1617.1 0 1959.67 0 0 0 0 0 0 0 0 0 0 0 0 0 0 0 0 0 0 0 1613.28 
-901.898 0 0 0 0 0 0 0 0 0 0 0 0 0 0 0 0 0 -829.875 0 0 0 0 0 0 -1629.31 0 0 0 0 2128.59 0 0 2327.42 0 0 2172.99 0 0 0 0 0 0 0 0 0 0 684.759 0 0 0 0 0 0 0 0 0 0 0 0 0 0 0 0 0 0 0 0 
-2093.49 0 0 0 0 0 0 1870.71 0 570.925 1738.56 0 0 0 0 0 0 0 0 0 0 0 0 0 0 0 0 0 0 0 0 0 0 0 0 0 -5.41704 0 0 0.06 0 0 1656.47 0 0 0 0 0 0 0 0 0 0 0 0 0 0 0 0 0 0 0 0 0 0 0 0 0 
0 0 0 0 0 0 0 0 0 0 -2408.6 0 0 0 0 0 0 0 0 0 0 0 0 -271.996 0 0 2392.42 0 0 0 0 -1542.48 0 0 0 0 0 2187.95 0 0 0.06 -1706.37 0 0 0 0 0 0 0 1522.19 0 0 0 0 0 0 0 0 0 0 0 0 0 0 0 0 0 0 
0 0 0 1422.54 0 0 0 0 0 -1225.09 0 0 0 -979.11 0 0 0 0 1494.72 0 1031.6 0 0 0 0 0 0 2109.82 0 -671.484 0 0 0 0 0 0 1321.68 0 0 0 337.001 0.08 0 0 0 0 0 0 0 0 0 0 0 0 0 0 0 0 0 0 0 0 0 0 0 0 0 0 
-1625.03 0 0 0 0 0 514.771 -1263.24 0 0 0 0 0 0 0 0 1691.56 0 0 0 2333.67 0 0 0 0 0 0 0 1264.76 0 0 -125.507 0 0 0 0 0 0 0 2207.94 0 0 0 -1927.78 0 0 0 0 0 0 0 0 0 0 0 0 0 0 0 0 0 0 0 0 0 0 0 0 
0 0 1426.21 0 0 0 -10.6052 0 2357.48 -224.693 0 0 0 -1540.04 0 0 0 0 0 0 0 0 0 -528.352 0 623.569 0 0 2216.64 675.298 0 0 0 0 0 0 0 -187.918 0 0 0 0 -1642.74 0.07 0 0 0 0 0 0 0 0 0 0 0 0 0 0 0 0 0 0 0 0 0 0 0 0 
0 0 0 0 0 0 0 0 0 0 0 0 0 0 0 0 0 0 0 2470.85 0 0 0 0 -551.851 0 0 0 0 0 -168.691 0 0 0 0 0 0 0 0 0 0 0 0 0 0.06 0 0 0 1684.55 0 -731.3 0 0 1575.29 0 0 0 0 0 0 0 0 0 0 1292.08 0 0 0 
-1119.34 0 0 0 0 0 -1163.29 -1535.62 -85.2229 0 0 0 0 0 0 0 0 0 0 0 0 0 0 0 1048.08 0 0 0 0 0 1717.66 1977.68 1506.32 820.109 0 0 0 1175.8 0 0 0 0 0 0 0 0.04 0 0 0 0 0 2282.56 0 0 -1783.43 0 0 0 0 0 0 0 0 0 0 0 0 0 
-2354.27 0 0 337.306 1745.28 1775.64 0 0 0 0 0 0 0 0 0 0 0 0 0 0 0 0 0 0 0 1573.61 1814.55 0 0 0 0 0 0 0 0 0 1228.75 0 0 0 0 0 0 0 0 0 0.09 0 0 0 0 0 0 0 0 0 0 0 0 0 0 0 0 0 0 0 0 0 
0 0 0 0 0 0 0 0 0 0 0 0 82.9341 0 0 0 0 0 0 0 0 488.22 0 0 0 -340.968 0 0 0 0 0 0 1414.15 0 -2450.25 0 0 254.448 2072.74 0 0 0 0 0 0 0 0 0.09 0 0 0 0 0 0 0 0 0 0 0 0 0 0 0 0 0 0 0 0 
0 0 0 0 0 0 0 0 0 911.817 0 0 2469.18 0 0 547.731 0 0 0 0 0 0 0 0 0 0 1759.47 2144 0 0 0 0 0 0 0 -1054.19 0 0 0 0 0 0 0 0 -2468.41 0 0 0 0.01 0 0 0 0 0 0 0 0 0 0 0 0 0 0 0 0 0 0 0 
0 0 -1331.75 -713.141 0 0 401.09 0 0 0 0 0 0 0 0 0 0 0 0 0 0 0 1051.59 0 0 0 0 1969.89 0 0 0 0 0 0 0 0 0 0 0 0 -1235.92 0 0 0 0 0 0 0 0 0.08 0 2444.76 0 0 0 0 0 0 0 0 0 0 0 0 0 0 0 0 
0 0 2222.43 0 0 1036.79 0 0 0 0 0 0 0 0 0 0 0 0 0 0 0 0 0 -1889.63 0 0 0 0 0 0 376.675 0 0 0 0 0 0 0 0 0 0 0 0 0 2356.87 0 0 0 0 0 0.08 0 0 0 0 0 0 922.803 0 0 0 0 0 0 0 0 0 0 
-479.064 0 0 0 0 0 0 -601.749 554.903 0 0.686666 -758.309 0 0 0 0 0 0 0 0 0 0 457.701 0 0 0 0 0 0 -1150.78 0 0 1265.98 -1298.18 0 0 0 0 0 0 0 0 0 0 0 2345.58 0 0 0 837.962 0 0.09 0 0 0 0 0 0 0 0 0 0 0 0 0 0 0 0 
0 -1071.12 0 0 0 0 0 0 0 0 0 0 0 0 0 0 0 2050.31 0 1457.95 0 0 1122.09 0 0 0 703.681 -344.325 0 0 0 0 0 0 0 0 0 0 0 0 0 0 0 0 0 0 0 0 0 0 0 0 0.08 -1284.45 0 0 0 0 0 0 0 0 0 0 0 0 0 0 
-2045.12 0 -521.027 0 0 0 0 1262.63 0 131.458 0 0 0 0 0 0 2214.19 0 0 0 0 0 0 0 0 208.67 0 0 0 0 0 0 0 0 0 0 -1735.51 0 0 0 0 0 0 0 1272.7 0 0 0 0 0 0 0 1518.98 0.09 0 0 0 0 0 0 0 0 0 0 0 0 0 0 
1094.78 0 0 0 650.121 348.292 0 374.386 0 0 0 0 0 0 0 0 -836.436 0 0 0 0 0 0 0 0 0 0 0 0 0 0 0 0 0 0 112.842 0 0 0 0 0 0 0 0 0 840.403 0 0 0 0 0 0 0 0 0.09 0 0 0 0 0 0 0 0 0 0 0 0 0 
0 0 0 0 0 0 478.607 0 0 0 0 0 0 0 0 0 0 2263.94 0 0 0 0 0 0 0 0 0 0 0 0 0 0 0 0 0 0 0 0 0 0 0 0 0 0 0 0 0 0 0 0 0 0 0 0 0 0.05 0 0 0 0 0 0 0 -2184.59 0 0 0 0 
0 0 0 0 0 0 173.269 0 0 0 0 0 0 0 0 0 0 0 0 0 0 0 0 0 0 0 0 0 0 0 0 0 0 0 0 0 0 0 0 0 0 0 0 0 0 0 0 0 0 0 0 0 0 0 0 0 0.05 0 0 0 208.67 0 0 0 0 0 0 0 
0 0 0 0 0 0 0 0 0 0 0 0 0 0 0 0 0 0 0 0 0 0 0 0 0 0 0 0 0 0 0 0 0 0 0 0 0 0 0 0 0 0 0 0 0 0 0 0 0 0 1806.01 0 0 0 0 0 0 0.02 0 0 0 0 0 0 0 0 0 0 
0 0 0 0 0 0 0 0 0 0 2473.14 0 0 0 0 0 0 0 0 0 0 0 0 0 0 0 0 0 0 0 0 0 0 0 0 0 0 0 0 0 0 0 0 0 0 0 0 0 0 0 0 0 0 0 0 0 0 0 0.04 0 0 0 0 0 0 0 0 0 
0 0 0 0 0 0 0 0 0 0 0 0 0 0 0 0 0 0 0 0 0 0 0 0 0 0 1141.16 0 0 0 0 0 0 0 0 0 0 0 0 0 0 0 0 0 0 0 0 0 0 0 0 0 0 0 0 0 0 0 0 0.08 0 0 0 0 0 0 0 0 
0 0 0 0 0 0 0 0 0 0 0 0 0 0 0 0 0 0 0 0 0 0 0 0 0 0 0 0 0 0 0 0 0 0 0 0 0 0 0 0 0 0 0 0 0 0 0 0 0 0 0 0 0 0 0 0 1246.3 0 0 0 0.07 0 0 0 0 0 0 0 
0 0 0 0 0 0 0 0 0 0 0 0 0 0 0 0 0 1641.97 0 0 0 0 0 0 0 0 0 0 0 0 0 0 0 0 0 0 0 0 0 0 0 0 0 0 0 0 0 0 0 0 0 0 0 0 0 0 0 0 0 0 0 0.06 0 0 0 0 0 0 
0 0 0 0 0 0 0 0 0 0 0 0 0 0 0 0 0 0 0 0 0 0 0 0 0 0 0 0 0 0 0 0 0 0 597.476 0 0 0 0 0 0 0 0 0 0 0 0 0 0 0 0 0 0 0 0 0 0 0 0 0 0 0 0.03 0 0 1080.58 0 0 
0 0 0 0 0 0 0 0 0 0 0 0 0 0 0 0 0 0 0 0 0 0 0 0 0 0 0 0 0 0 0 0 0 0 0 0 0 0 0 0 0 0 0 0 0 0 0 0 0 0 0 0 0 0 0 1906.11 0 0 0 0 0 0 0 0.03 0 0 0 0 
0 0 0 0 0 0 0 0 0 0 0 0 0 0 0 0 0 0 0 0 0 0 0 0 0 0 0 0 0 0 0 0 0 0 0 0 0 0 0 0 0 0 0 0 646.458 0 0 0 0 0 0 0 0 0 0 0 0 0 0 0 0 0 0 0 0.08 0 0 0 
0 0 0 -1229.36 0 0 0 0 1723.76 0 0 0 0 0 0 0 0 0 0 0 0 0 0 0 0 0 0 0 0 0 0 0 0 0 0 0 0 0 0 0 0 0 0 0 0 0 0 0 0 0 0 0 0 0 0 0 0 0 0 0 0 0 1735.66 0 0 0 0 0 
0 0 0 0 0 0 0 0 0 0 0 0 0 2255.09 -294.427 1588.87 0 0 0 0 0 0 0 0 0 0 0 0 0 0 0 0 0 0 0 0 0 0 0 0 0 0 0 0 0 0 0 0 0 0 0 0 0 0 0 0 0 0 0 0 0 0 0 0 0 0 0.07 0 
0 0 0 0 0 0 0 0 0 0 0 0 0 0 0 0 0 0 0 0 0 0 0 0 0 0 0 0 0 0 0 0 0 -479.217 0 0 0 2133.01 0 0 0 0 0 0 0 0 0 0 0 0 0 0 0 0 0 0 0 0 0 0 0 0 0 0 0 0 0 0.09 
