*Vertices 61
*Matrix 
0.02 0 -1694.77 0 -141.53 1780.98 0 0 -1856.52 2172.08 0 0 1850.87 0 0 -522.401 2265.31 0 0 0 -188.681 0 -925.398 1816.69 0 0 0 0 0 633.03 0 -479.675 0 1899.85 0 0 0 0 0 1012.22 -1569.19 0 0 0 1200.37 0 -123.676 0 0 0 50.2792 0 0 0 0 0 2405.24 0 0 0 2367.09 
0 0.03 0 0 0 0 1976 0 0 0 0 1147.11 0 0 0 0 0 1278.5 0 0 0 1258.96 0 0 0 2055.35 0 0 800.272 0 596.713 0 -1798.07 0 0 0 0 0 1121.48 0 0 -89.9533 0 -976.363 0 0 0 0 0 1231.65 1773.81 -1694.77 0 0 83.0866 0 0 0 0 0 0 
590.152 0 0.09 307.855 0 0 1564.3 1919.08 0 -2435.15 0 0 1613.44 0 0 0 0 0 0 0 -957.442 -614.109 0 0 0 -333.491 -1846.9 0 0 0 431.303 -1657.84 0 0 0 1386.53 1928.39 0 0 2077.47 0 -96.057 0 1155.81 0 0 0 0 657.75 0 0 0 0 1109.42 0 0 0 0 0 0 0 
0 0 -1805.25 0.03 1996.44 343.104 2030.63 0 0 0 0 1570.1 0 0 930.128 685.827 0 0 0 0 2498.93 0 0 0 0 0 0 0 0 0 0 0 0 0 0 0 0 1983.93 0 -1070.06 0 1710.18 -866.039 0 0 0 0 0 0 0 0 0 0 0 0 0 -1320.92 0 0 0 0 
164.571 0 0 -268.487 0.05 0 2232.2 2130.27 0 0 0 -1057.7 0 0 0 0 0 0 0 -584.964 -1710.03 0 0 0 0 0 1965.62 0 0 0 0 -492.645 0 0 1041.52 0 0 138.936 0 0 0 0 0 2008.96 0 0 -8.01111 0 0 0 704.901 0 0 -1329 0 0 0 -105.213 0 0 0 
1220.97 0 0 931.654 0 0.09 0 0 0 0 -1931.75 0 0 0 2219.53 0 0 -133.595 0 0 0 2187.34 0 0 0 -891.675 0 0 0 0 0 942.488 0 -1199.91 0 0 795.694 0 0 0 0 0 0 0 0 0 0 0 0 0 0 0 0 0 0 0 0 0 0 -1342.43 0 
0 187.613 -688.726 2463.68 -492.95 0 0.04 0 0 0 0 2441.86 1108.2 0 0 0 0 -2330.62 0 1936.63 -927.534 0 2251.73 0 0 0 0 0 0 0 0 0 0 0 0 0 0 0 10.6052 0 0 0 0 315.485 99.5666 0 1256.52 0 0 -1399.04 0 0 0 843.913 0 0 0 0 0 0 0 
0 0 1619.08 0 -376.522 0 0 0.08 367.672 0 0 0 0 0 -1655.71 849.101 14.42 -1092.49 -1644.87 0 0 0 0 0 0 0 0 2372.28 0 -484.71 0 0 0 0 0 0 0 2475.43 0 0 0 0 -448.393 373.623 0 0 0 0 0 2203.21 0 0 0 0 0 -1895.89 0 0 0 0 0 
-992.08 0 0 0 0 0 0 1755.35 0.03 0 0 0 -198.141 0 2224.57 0 0 0 0 0 0 1617.1 0 0 1920.91 0 0 0 0 0 0 0 0 2277.83 710.547 0 0 0 0 0 0 0 0 0 1553.32 0 2327.88 0 0 0 0 0 0 0 0 0 0 0 0 0 0 
203.33 0 2081.13 0 0 0 0 0 0 0.09 1511.81 0 0 0 0 2191.46 -357.295 0 694.067 0 0 1065.02 0 0 1855.6 2134.85 0 0 0 0 0 1854.23 0 1749.85 0 0 -210.807 0 0 0 0 0 0 0 0 0 0 0 0 0 0 0 0 0 0 0 0 0 0 638.523 2117.45 
0 0 0 0 0 -2261.19 0 0 0 -818.278 0 1072.19 0 0 546.052 0 0 -194.174 0 0 0 0 0 1932.51 0 0 0 0 540.406 0 0 1098.74 1806.47 0 0 0 955.153 0 0 0 0 0 472.808 0 0 0 0 0 0 0 0 0 0 0 0 1201.59 0 0 0 0 0 
0 1022.9 0 -691.015 -376.827 0 1399.81 0 0 0 270.47 0.06 1492.58 0 1157.49 0 0 1233.02 0 0 1565.22 2466.28 0 0 0 0 0 2366.18 -2388.76 0 0 2253.26 0 0 0 0 -118.03 0 0 0 -1974.32 -63.5548 1549.04 0 -1587.65 0 1254.69 481.658 0 0 -1686.68 0 0 0 0 0 0 -1292.84 0 0 0 
-284.814 0 2307.28 0 0 0 2353.66 0 -1342.59 0 0 -1343.2 0.04 0 0 0 0 2400.05 1583.22 0 0 624.18 0 2454.99 0 0 0 0 0 0 0 0 0 0 0 2141.87 0 524.079 0 0 0 0 0 0 0 0 0 -453.887 0 0 0 0 0 0 -979.72 0 0 -703.375 0 0 0 
0 0 0 0 0 0 0 0 0 0 0 0 0 0.06 0 0 2334.44 0 0 333.796 0 0 -994.369 591.83 0 0 0 0 1665.93 0 0 0 0 -2468.72 0 0 2421.41 0 0 1831.64 0 1219.29 0 0 0 1256.22 0 0 0 0 0 0 0 0 0 0 0 0 207.602 0 0 
0 0 0 1871.17 0 -764.718 0 37.7667 1900.46 0 -2282.4 -1869.79 0 0 0.07 0 0 336.238 666.448 548.799 -828.043 2240.44 930.28 0 0 -457.091 0 2484.44 0 0 0 -1398.74 0 0 -82.9341 0 -1766.95 0 934.553 303.125 0 2391.35 0 -744.118 0 0 0 1732.76 0 0 514.161 0 0 0 942.793 1194.88 0 0 0 0 0 
-2399.29 0 0 -789.132 0 0 0 1961.04 0 298.547 0 0 0 0 0 0.05 0 0 0 0 0 -426.115 0 0 2075.95 0 0 0 0 0 0 0 0 0 0 0 900.83 0 0 0 0 0 0 240.104 657.14 0 0 0 0 0 0 0 0 0 0 47.38 0 0 0 0 0 
-743.355 0 0 0 0 0 0 -1232.26 0 1692.02 0 0 0 427.946 0 0 0.02 1862.62 2071.83 0 0 0 -823.771 0 0 0 0 0 0 0 -824.381 1580.17 0 0 0 0 0 0 0 1816.08 0 0 0 0 0 0 0 0 0 0 0 0 0 0 0 0 0 0 0 0 0 
0 1138.42 0 0 0 -2150.56 -790.963 1996.75 0 0 2277.21 -2053.36 460.601 0 -1201.44 0 36.2407 0.07 0 0 0 0 0 0 0 130.696 -847.423 0 0 0 2160.94 0 0 0 0 646.763 0 0 0 0 0 0 0 495.239 0 0 0 0 0 0 0 0 0 0 0 0 0 0 0 0 0 
0 0 0 0 0 0 0 133.9 0 866.344 0 0 2038.71 0 2451.78 0 -356.838 0 0.08 0 189.291 0 -1364.25 2099.29 1126.06 1125.45 0 0 -1361.96 0 0 0 0 0 -637.455 0 0 0 -2321.92 189.444 0 0 0 0 249.26 0 0 -1366.24 0 0 -1560.79 0 0 0 0 0 0 0 -290.46 0 1816.54 
0 0 0 0 2306.82 0 831.858 0 0 0 0 0 0 2082.96 219.657 0 0 0 0 0.08 -147.023 0 0 0 0 0 -644.627 0 -1315.73 0 0 0 0 0 2162.16 0 -1647.92 256.432 -816.141 0 0 96.2096 0 0 0 -1766.34 0 0 0 100.635 0 0 0 -1185.42 -664.006 0 0 0 0 0 0 
2349.24 0 -963.393 -1436.43 868.786 0 1597.72 0 0 0 0 1506.16 0 0 1726.97 0 0 0 1239.74 643.101 0.01 0 0 0 169.759 0 0 0 0 0 1304.59 -1656.77 346.461 1513.49 0 -34.7148 0 0 0 0 0 2396.85 2259.51 0 459.075 0 0 0 -1141.01 0 0 0 0 0 0 -1958.14 0 0 -1175.19 0 0 
0 2125.23 2412.72 0 0 1789.83 0 0 210.349 -1959.06 0 1175.95 1402.86 0 -620.365 2156.82 0 0 0 0 0 0.06 230.338 0 0 0 101.55 2349.09 0 1308.86 0 0 0 0 -222.404 0 0 404.904 0 -1894.21 0 0 0 0 0 0 0 0 0 0 0 0 635.472 0 0 0 0 0 0 0 0 
-133.137 0 0 0 0 0 411.771 0 0 0 0 0 0 934.706 703.375 0 -299.158 0 785.928 0 0 2246.85 0.04 1270.26 0 0 0 1039.69 2085.25 0 0 0 0 -897.626 0 0 0 -678.961 0 0 649.205 0 0 0 0 524.079 0 0 0 0 0 0 -1002.91 0 0 -575.35 0 0 0 0 -73.7785 
-1669.29 0 0 0 0 0 0 0 0 0 532.929 0 514.466 10.6052 0 0 0 0 -1070.67 0 0 0 2174.21 0.01 -2245.17 771.279 -2002.55 1653.26 0 0 1850.11 2086.17 0 0 -2464.14 0 2295.83 0 0 0 0 0 0 0 0 -2010.48 0 0 0 0 0 0 0 0 0 0 0 513.245 0 1804.03 0 
0 0 0 0 0 0 0 0 382.473 2232.05 0 0 0 0 0 -1010.09 0 0 -131.916 0 1685.61 0 0 1925.34 0 0 0 0 1436.43 -1984.69 0 1397.82 0 0 0 0 -1719.34 619.602 2038.26 0 0 0 0 0 0 0 1679.51 0 -1639.07 0 0 0 0 0 0 0 0 0 0 0 0 
0 -1650.36 -290.155 0 0 -1882 0 0 0 -888.623 0 0 0 0 184.866 0 0 2422.33 2319.33 0 0 0 0 -1030.38 0 0 0 0 0 0 0 0 1607.18 -140.461 0 -944.929 0 0 0 305.414 0 595.492 2334.59 1678.75 0 570.772 0 0 0 0 0 0 0 -2233.27 0 0 0 0 0 0 0 
0 0 1386.84 0 2232.66 0 0 0 0 0 0 0 0 0 0 0 0 -713.141 0 -2062.52 0 1278.65 0 2234.49 0 0 0.01 -955.916 -617.924 0 0 0 -1544.92 0 -794.931 2450.1 0 711.921 0 0 0 -1342.74 1258.51 0 -1109.42 0 0 0 0 0 0 0 0 1872.69 519.654 0 0 0 0 0 0 
0 0 0 0 0 0 0 173.116 0 0 0 -738.777 0 0 1733.22 0 0 0 0 0 0 -297.327 202.414 -44.3281 0 0 802.103 0.04 0 -1617.1 0 0 0 0 2299.95 -2348.02 239.494 0 2080.37 0 -1168.02 0 0 1018.17 0 0 2289.27 1008.26 0 0 0 0 0 0 0 0 0 0 0 0 0 
0 -376.827 0 0 0 0 0 0 0 0 1560.34 2081.13 0 1064.41 0 0 0 0 1914.96 987.503 0 0 -1114.15 0 -113.758 0 -1616.64 0 0.04 0 -1324.58 0 0 0 0 0 1439.48 1291.16 0 96.6674 0 0 1397.67 0 1683.48 0 0 0 0 0 0 0 0 0 0 0 0 0 -1884.29 0 0 
459.685 0 0 0 0 0 0 -1177.94 0 0 0 0 0 0 0 0 0 0 0 0 0 1976.15 0 0 -594.882 0 0 -991.775 0 0.02 0 0 0 0 2158.8 0 -204.093 0 2266.84 0 0 0 0 1930.83 539.644 0 409.177 0 0 0 0 0 0 0 0 0 1045.34 0 0 0 0 
0 1270.41 -91.174 0 0 0 0 0 0 0 0 0 0 0 0 0 1920.91 -2021.47 0 0 -383.694 0 0 198.599 0 0 0 0 -166.707 0 0.09 0 0 192.801 0 0 1351.74 0 -326.167 -494.934 0 0 0 0 0 0 0 0 0 -603.732 0 0 0 0 0 0 0 0 0 0 0 
1190.6 0 1758.1 0 -1405 2257.99 0 0 0 -79.7296 1044.27 1237.14 0 0 1952.5 0 1049.76 0 0 0 -863.598 0 0 -2279.66 1492.28 0 0 0 0 0 0 0.01 0 658.208 0 -2049.39 0 1607.33 0 0 0 -1232.72 0 -1364.41 0 0 517.975 1173.36 2044.51 0 0 0 0 0 0 0 0 0 -1926.25 0 0 
0 -1431.7 0 0 0 0 0 0 0 0 1106.07 0 0 0 0 0 0 0 0 0 -1176.72 0 0 0 0 977.737 1499.15 0 0 0 0 0 0.06 0 0 0 2152.09 0 1288.72 0 1951.43 0 0 -2160.94 0 0 0 1806.16 0 0 0 0 -1938 0 0 0 0 1874.68 0 0 0 
-803.476 0 0 0 0 1601.54 0 0 -910.291 -6.18 0 0 0 284.814 0 0 0 0 0 0 1451.99 0 -1508.15 0 0 2325.59 0 0 0 0 -1853.31 -1442.23 0 0.07 1754.89 0 0 0 623.112 0 0 0 0 0 0 0 -1367 1001.54 0 -515.229 0 0 0 0 0 0 0 0 0 0 0 
0 0 0 0 -110.553 0 0 0 817.209 0 0 0 0 0 1776.25 0 0 0 184.713 264.061 0 -1079.21 0 237.205 0 0 -1771.07 -2259.97 0 1305.81 0 0 0 1813.49 0.06 0 0 0 1696.45 0 0 0 0 -913.648 0 1645.63 0 0 0 0 622.959 0 0 0 0 0 0 0 1615.88 1474.27 0 
0 0 1138.72 0 0 0 0 0 0 0 0 0 1287.04 0 0 0 0 876.568 0 0 1155.51 0 0 0 0 -1426.21 876.11 1011.92 0 0 0 833.537 0 0 0 0.06 0 -688.116 0 0 1770.76 2084.95 0 -232.475 0 0 762.734 541.627 0 0 0 0 0 0 0 0 0 0 0 0 0 
0 0 2431.33 0 0 -2321.16 0 0 0 -686.285 2485.35 -824.839 0 1375.24 -780.282 -1673.56 0 0 0 1251.49 0 0 0 935.316 1583.38 0 0 -160.146 2033.52 775.857 1313.75 0 1064.41 0 0 0 0.01 0 0 0 0 1267.66 -1505.25 0 0 0 -713.446 0 0 0 0 0 -450.682 0 0 0 0 0 -1989.27 0 343.715 
0 0 0 -1410.49 -1845.99 0 0 -2292.02 0 0 0 0 -2010.03 0 0 0 0 0 0 -870.464 0 991.165 1898.79 0 1347.93 0 68.8955 0 2094.41 0 0 1264.46 0 0 0 -1466.34 0 0.01 -74.6941 0 2342.83 2495.42 0 0 0 0 0 0 0 0 0 -729.316 0 0 0 0 0 0 0 0 0 
0 -2101.73 0 0 0 0 1807.99 0 0 0 0 0 0 0 2239.68 0 0 0 2158.96 -1014.36 0 0 0 0 324.641 0 0 1214.71 0 676.672 1054.95 0 -2326.65 309.992 2030.47 0 0 1290.7 0.04 0 0 0 0 0 0 0 0 0 0 0 0 0 0 0 -2411.04 0 0 0 0 0 0 
1083.33 0 1433.38 1680.88 0 0 0 0 0 0 0 0 0 2446.59 1935.56 0 580.081 0 2392.42 0 0 452.361 0 0 0 -2310.94 0 0 -399.411 0 1144.06 0 0 0 0 0 0 0 0 0.03 0 0 0 0 0 0 0 0 0 0 0 0 0 0 0 0 0 0 0 0 0 
221.641 0 0 0 0 0 0 0 0 0 0 2244.41 0 0 0 0 0 0 0 0 0 0 1792.73 0 0 0 0 -1088.37 0 0 0 0 -705.512 0 0 595.187 0 1101.18 0 0 0.09 1479 972.854 0 0 0 0 0 0 0 0 0 0 0 0 0 0 0 0 0 0 
0 684.606 2307.89 755.257 0 0 0 0 0 0 0 -2142.93 0 -1082.87 -235.221 0 0 0 0 876.568 181.051 0 0 0 0 1785.87 2406.61 0 0 0 0 1637.39 0 0 0 -2184.29 2117.91 -1112.93 0 0 -1097.37 0.02 0 1983.17 -1932.97 0 0 0 0 0 0 0 0 0 0 744.27 0 0 0 0 0 
0 0 0 -1933.58 0 0 0 1408.35 0 0 442.747 2058.09 0 0 0 0 0 0 0 0 -134.51 0 0 0 0 2228.54 625.553 0 -1261.86 0 0 0 0 0 0 0 1119.34 0 0 0 369.961 0 0.01 -2117.15 0 1927.32 0 0 0 0 0 0 0 0 0 0 0 0 -1622.29 0 0 
0 2090.44 1897.87 0 1205.4 0 1626.56 1105.15 0 0 0 0 0 0 1895.28 3.43333 0 -674.23 0 0 0 0 0 0 0 1123.31 0 598.849 0 1882 0 -1315.42 -1337.09 0 -1634.19 197.989 0 0 0 0 0 -531.709 -0.991852 0 -1870.25 0 0 0 0 -2133.32 0 0 0 0 0 0 0 0 0 0 0 
1666.84 0 0 0 0 0 2218.16 0 -2028.64 0 0 1950.67 0 0 0 1530.12 0 0 1082.87 0 342.952 0 0 0 0 0 1899.55 0 944.929 328.913 0 0 0 0 0 0 0 0 0 0 0 -188.07 0 234.611 0.02 -2397.15 0 0 -564.058 0 0 0 0 0 0 0 0 -1552.55 0 0 0 
0 0 0 0 0 0 0 0 0 0 0 0 0 803.781 0 0 0 0 0 359.432 0 0 -2257.99 -251.091 0 1943.95 0 0 0 0 0 0 0 0 2328.64 0 0 0 0 0 0 0 1562.93 0 2006.67 0.01 0 0 0 0 0 -1912.67 0 0 0 955 0 0 0 0 0 
1293.3 0 0 0 1947.77 0 1424.22 0 2208.24 0 0 -765.481 0 0 0 0 0 0 0 0 0 0 0 0 -1468.02 0 0 1843.85 0 2194.51 0 917.31 0 1866.13 0 483.032 -1823.86 0 0 0 0 0 0 0 0 0 0.08 1221.27 -7.24815 0 0 688.116 0 0 0 0 0 0 0 0 688.421 
0 0 0 0 0 0 0 0 0 0 0 1535.31 -1028.7 0 1045.18 0 0 0 353.786 0 0 0 0 0 0 0 0 -2160.79 0 0 0 2424.77 1797.16 1440.7 0 1070.97 0 0 0 0 0 0 0 0 0 0 -529.878 0.01 0 0 0 0 0 0 0 0 0 0 0 0 0 
0 0 808.512 0 0 0 0 0 0 0 0 0 0 0 0 0 0 0 0 0 -1056.47 0 0 0 2118.21 0 0 0 0 0 0 1725.29 0 0 0 0 0 0 0 0 0 0 0 0 1314.36 0 -672.552 0 0.01 0 0 0 0 0 0 0 0 0 0 0 0 
0 2261.8 0 0 0 0 901.746 769.601 0 0 0 0 0 0 0 0 0 0 0 -2184.74 0 0 0 0 0 0 0 0 0 0 2468.26 0 0 1767.1 0 0 0 0 0 0 0 0 0 -1071.12 0 0 0 0 0 0.08 0 -2283.93 0 0 0 0 0 0 -2463.53 0 0 
857.189 1079.36 0 0 131.916 0 0 0 0 0 0 -1768.32 0 0 175.71 0 0 0 1189.54 0 0 0 0 0 0 0 0 0 0 0 0 0 0 0 1836.53 0 0 0 0 0 0 0 0 0 0 0 0 0 0 0 0.09 1106.52 0 -280.999 0 0 0 0 0 0 0 
0 -2132.25 0 0 0 0 0 0 0 0 0 0 0 0 0 0 0 0 0 0 0 0 0 0 0 0 0 0 0 0 0 0 0 0 0 0 0 1000.63 0 0 0 0 0 0 0 -987.198 2273.86 0 0 575.503 -46.1592 0.06 0 0 0 0 0 0 2334.59 0 0 
0 0 0 0 0 0 0 0 0 0 0 0 0 0 0 0 0 0 0 0 0 2185.35 -2099.75 0 0 0 0 0 0 0 0 0 1776.56 0 0 0 1046.25 0 0 0 0 0 0 0 0 0 0 0 0 0 0 0 0.05 0 0 0 0 0 0 2462.77 0 
0 0 -1423.15 0 1744.36 0 1265.53 0 0 0 0 0 0 0 0 0 0 0 0 1853.01 0 0 0 0 0 1432.46 749.916 0 0 0 0 0 0 0 0 0 0 0 0 0 0 0 0 0 0 0 0 0 0 0 976.669 0 0 0.05 0 0 0 0 0 -2196.65 0 
0 -1862.77 0 0 0 0 0 0 0 0 0 0 1436.74 0 2004.07 0 0 0 0 -111.316 0 0 0 0 0 0 1788.77 0 0 0 0 0 0 0 0 0 0 0 24.6437 0 0 0 0 0 0 0 0 0 0 0 0 0 0 0 0.07 0 0 0 0 0 0 
0 0 0 0 0 0 0 -374.386 0 0 -1406.06 0 0 0 1549.5 529.572 0 0 0 0 1839.58 0 832.469 0 0 0 0 0 0 0 0 0 0 0 0 0 0 0 0 0 0 -867.565 0 0 0 549.104 0 0 0 0 0 0 0 0 0 0 0 0 0 0 0 
-1943.19 0 0 2473.45 0 0 0 0 0 0 0 0 0 0 0 0 0 0 0 0 0 0 0 0 0 0 0 0 0 1451.54 0 0 0 0 0 0 0 0 0 0 0 0 0 0 0 0 0 0 0 0 0 0 0 0 0 0 0.05 0 0 0 0 
0 0 0 0 316.858 0 0 0 0 0 0 1796.4 1508 0 0 0 0 0 0 0 0 0 0 2174.52 0 0 0 0 0 0 0 0 -1114.31 0 0 0 0 0 0 0 0 0 0 0 2174.52 0 0 0 0 0 0 0 0 0 0 0 0 0.06 0 0 0 
0 0 0 0 0 0 0 0 0 0 0 0 0 -399.411 0 0 0 0 -1529.05 0 1876.81 0 0 0 0 0 0 0 822.245 0 0 -793.1 0 0 854.595 0 -775.552 0 0 0 0 0 477.081 0 0 0 0 0 0 1237.91 0 -891.98 0 0 0 0 0 0 0.07 0 0 
0 0 0 0 0 2195.27 0 0 0 1612.06 0 0 0 0 0 0 0 0 0 0 0 0 0 2125.08 0 0 0 0 0 0 0 0 0 0 632.115 0 0 0 0 0 0 0 0 0 0 0 0 0 0 0 0 0 -646.001 -629.063 0 0 0 0 0 0.02 0 
-1366.54 0 0 0 0 0 0 0 0 2419.58 0 0 0 0 0 0 0 0 -1798.84 0 0 0 480.438 0 0 0 0 0 0 0 0 0 0 0 0 0 -1753.67 0 0 0 0 0 0 0 0 0 1865.98 0 0 0 0 0 0 0 0 0 0 0 0 0 0.06 
