*Vertices 62
*Matrix 
0.09 -1704.84 0 391.781 0 0 -2178.03 0 -464.873 589.389 0 0 0 0 1130.63 0 0 0 0 -2075.49 -12.4363 0 2206.87 0 1596.5 0 0 0 0 0 0 0 0 0 0 136.647 0 0 0 0 904.34 0 0 0 0 0 0 0 0 0 0 0 0 0 0 2386.47 0 0 0 0 0 0 
2116.84 0.06 0 1913.89 0 1386.07 0 0 0 0 0 0 0 0 0 0 0 0 0 -1964.55 0 0 2107.99 1294.52 1419.49 -2019.49 0 0 0 0 0 0 -289.087 0 0 1466.03 0 0 0 0 363.857 0 -2348.78 0 1983.47 118.946 0 1879.56 0 0 0 0 0 0 0 0 0 0 0 0 0 0 
0 0 0.06 1435.36 0 0 -998.794 0 589.694 0 0 0 0 0 0 0 0 0 -111.011 0 1991.71 0 0 0 0 0 1823.56 0 0 -2371.52 1756.57 2471.62 0 2398.98 0 0 0 0 0 0 0 0 0 0 0 0 1948.07 0 0 0 0 0 0 0 0 1466.64 0 0 0 0 0 2290.03 
1989.58 845.897 1265.98 0 0 0 0 0 0 0 1520.36 0 0 982.162 658.971 0 0 0 0 -660.192 -1493.96 0 0 0 0 0 1886.27 0 1271.94 1556.67 0 0 0 -918.989 0 0 0 0 1730.93 0 -2458.95 1898.18 0 0 0 1138.87 1677.83 0 0 0 0 0 0 0 0 0 -1205.25 0 0 0 0 1782.82 
0 0 0 0 0.05 0 2219.53 0 -2438.05 0 0 0 0 0 -479.217 0 0 0 0 2406.77 0 0 -171.133 -1094.16 0 -2181.54 0 1961.65 849.406 0 0 0 0 2185.2 0 0 0 0 828.959 0 588.778 0 2079.45 112.079 3.58592 0 -1076.46 0 0 0 0 0 0 0 0 1175.5 0 0 0 0 0 0 
0 620.518 0 0 0 0.09 0 0 0 -204.855 0 0 0 2483.37 0 0 -1782.97 0 0 -1568.58 0 0 0 0 -763.039 0 472.503 1835.46 1095.23 0 0 2442.78 0 0 -2358.39 0 0 863.292 592.898 0 904.95 0 2151.63 0 0 0 0 0 0 0 0 0 0 0 0 0 0 0 0 0 0 0 
622.806 0 -1643.5 0 37.9192 0 0.04 0 0 0 0 0 1042.74 798.44 0 0 -1671.58 0 0 0 0 0 -2312.62 1301.39 0 714.057 -1477.94 -602.664 16.2511 0 0 1213.19 730.384 0 523.164 1323.51 2477.87 -437.254 0 0 -1983.02 0 1080.58 0 0 0 0 0 0 0 0 0 0 0 0 0 0 0 0 0 0 0 
0 0 0 0 0 0 0 0.02 0 0 0 0 0 0 0 0 0 633.793 0 0 0 0 2274.62 0 0 0 0 1546.6 0 0 0 0 2406.77 0 -138.783 0 0 -438.627 0 0 0 0 0 0 0 -1591.62 0 0 0 0 0 0 -2389.07 0 0 0 0 0 0 0 0 0 
-2412.26 0 1716.9 0 1204.79 0 0 0 0.08 0 0 0 0 0 904.492 0 0 1242.64 0 0 0 0 0 -1094.78 0 0 1286.28 1116.29 0 0 0 0 -340.968 0 0 -383.084 -1796.09 -454.802 0 0 0 0 1705.6 0 0 0 0 0 0 -241.63 0 0 1766.79 0 0 -960.952 1270.1 0 0 0 0 0 
2439.27 0 0 0 0 2254.94 0 0 0 0.02 0 1451.54 0 0 0 0 2338.71 0 0 1043.66 1495.94 2488.86 0 0 0 141.682 0 0 0 0 0 0 -1801.74 0 -1910.08 0 0 0 1279.87 0 -2455.44 0 0 -2255.85 0 0 -1282.46 0 0 0 0 0 0 0 0 0 0 0 0 -339.29 0 0 
0 0 0 51.3474 0 0 0 0 0 0 0 0 0 848.338 -924.482 0 0 0 0 0 605.716 2295.68 1100.12 0 0 -2278.59 -2427.52 0 0 1622.14 1791.06 -482.727 2228.39 0 1766.64 -1095.54 0 0 0 0 0 84.0022 0 -2201.99 0 833.689 0 0 0 2219.08 0 0 0 0 0 0 0 115.589 0 0 0 0 
0 0 0 0 0 0 0 0 0 1829.66 0 0.05 0 0 547.273 0 0 1524.93 0 -2375.33 2064.65 0 0 1446.65 0 1290.86 -1838.36 0 0 0 0 0 273.064 0 852.611 0 1187.4 0 0 1344.87 0 0 1615.57 0 0 0 0 0 0 0 157.094 0 0 0 0 0 0 0 0 0 0 0 
0 0 0 0 0 0 -556.734 0 0 0 0 0 0.02 0 0 -2217.09 0 413.449 -1000.78 0 1810.28 0 0 1096.76 0 1528.6 1790.75 0 2243.8 -877.941 -1580.78 0 0 0 -1046.25 0 0 1824.78 0 0 0 2141.87 0 0 0 0 -995.285 0 0 0 0 1537.6 0 0 0 2174.37 0 900.372 0 -1453.37 0 0 
0 0 0 -649.205 0 1317.1 -2050.61 0 0 0 242.851 0 0 0 0 2467.04 0 0 0 0 0 0 40.9711 2204.73 -913.038 0 2326.5 0 729.469 0 0 -664.922 724.738 0 0 70.5741 0 0 736.03 0 2398.53 0 0 0 2268.52 0 -4.0437 0 0 0 0 0 785.012 0 0 0 0 -835.673 0 0 0 -616.245 
-428.098 0 0 -1910.69 1392.79 0 0 0 -922.803 0 -205.161 1226.92 0 0 0.05 -1085.01 -745.338 0 0 0 0 0 0 0 0 -193.258 0 1962.72 2406.16 1190.15 2101.43 0 0 924.329 2387.39 0 0 0 0 541.169 0 -972.701 555.361 0 0 0 0 -1717.51 0 0 2338.71 0 0 0 1373.1 0 0 0 1713.23 0 0 0 
0 0 0 0 0 0 0 0 0 0 0 0 1091.72 -2202.29 -2393.64 0.01 0 0 0 0 -1123.62 0 0 0 0 2395.78 0 0 0 0 0 1244.47 0 1529.36 0 1850.41 0 0 1403.32 0 -695.441 -2105.4 0 0 0 2317.04 0 0 0 0 0 0 0 0 0 0 0 0 0 0 0 0 
0 0 0 0 0 2246.09 1586.58 0 0 2225.18 0 0 0 0 1652.35 0 0.02 0 0 0 0 0 0 0 -397.885 0 0 0 0 0 0 0 786.233 0 0 2277.37 0 0 0 -639.592 0 0 0 1772.9 0 -1183.28 0 0 0 -585.727 0 0 0 0 0 0 0 0 0 0 0 0 
0 0 0 0 0 0 0 266.503 1999.8 0 0 -1324.58 -254.906 0 0 0 0 0.03 0 0 0 0 0 0 0 -203.787 0 0 0 0 0 0 -1371.43 0 0 0 0 0 569.399 0 0 0 -919.141 0 1856.67 0 2460.94 0 2110.43 0 0 0 0 0 0 0 0 0 0 0 0 0 
0 0 1911.15 0 0 0 0 0 0 0 0 0 1968.06 0 0 0 0 0 0.05 0 0 0 0 0 0 2026.2 1660.44 0 0 0 0 0 0 0 -1317.71 1705.6 -2233.73 0 0 0 -1687.14 0 0 1579.56 0 0 0 0 -2353.97 0 0 0 0 1342.13 1518.07 0 0 0 0 0 0 0 
1120.41 -678.503 0 1337.09 11.2156 -1914.35 0 0 0 1605.35 0 1618.93 0 0 0 0 0 0 0 0.05 0 0 1327.17 0 0 0 -447.172 0 0 0 0 2079 0 90.7163 30.7474 1823.4 584.964 0 -530.793 1732.61 0 -1007.49 2004.07 0 0 -1145.89 0 0 67.5222 0 0 0 0 -671.331 0 0 0 0 0 0 1111.41 0 
1954.33 0 -1856.67 -107.501 0 0 0 0 0 1991.87 1305.05 1035.72 -984.298 0 0 907.392 0 0 0 0 0 0 0 0 1328.85 0 0 0 0 0 0 1019.7 0 0 0 0 0 310.144 0 0 0 0 -1189.38 0 9.99481 0 0 0 0 0 0 0 0 0 -1050.22 0 -936.384 0 0 0 0 0 
0 0 0 0 0 0 0 0 0 -78.0511 452.208 0 0 0 0 0 0 0 0 0 0 0.09 0 0 0 -1062.58 0 1924.73 1876.96 0 0 1843.24 -1126.51 0 0 0 0 -89.3429 1112.48 1549.81 0 0 0 0 1386.99 0 0 0 0 0 0 0 0 -147.633 0 0 0 0 0 0 292.749 0 
1452.91 1093.25 0 0 2235.4 0 658.971 245.903 0 0 -125.202 0 0 -1008.26 0 0 0 0 0 984.756 0 0 0.09 1329.31 962.935 0 0 0 1901.99 0 0 0 0 0 0 1759.16 0 2292.63 -1421.48 0 0 541.322 993.606 0 0 0 0 0 0 0 0 0 0 0 -624.18 0 0 0 0 0 0 0 
0 1610.69 0 0 613.041 0 1594.06 0 1916.64 0 0 -1129.57 2030.02 1703.31 0 0 0 0 0 0 0 0 1638.77 0.02 410.855 0 1054.64 2336.42 2217.4 0 461.516 0 -1942.27 0 0 0 -1039.84 0 0 0 0 1685.61 0 0 0 0 0 0 0 840.709 0 0 0 0 0 0 0 0 2453.61 -2382.2 0 0 
-49.6689 -1546.6 0 0 0 202.719 0 0 0 0 0 0 0 1890.7 0 0 1832.87 0 0 0 -1433.68 0 -1235.01 1713.08 0 679.571 2245.17 0 -751.9 0 0 0 0 0 0 1510.28 -1761.45 788.064 -906.018 1336.48 -2338.4 1884.14 0 0 -314.722 0 0 0 0 0 0 0 0 0 0 474.334 0 0 0 0 0 0 
0 515.381 0 0 1623.2 0 1904.28 0 0 -1053.27 1947.77 -1668.52 1179.31 0 238.273 2037.19 0 -1567.05 -1983.47 0 0 1348.69 0 0 -1425.9 0.05 0 0 0 0 0 0 0 0 0 0 0 0 821.177 0 0 0 0 0 0 0 0 0 0 0 0 -681.402 732.521 0 0 0 0 0 0 0 -1934.49 418.18 
0 0 1202.05 2197.71 0 244.224 924.94 0 1491.36 0 2172.23 -2054.73 1300.32 1319.85 0 0 0 0 -91.4792 837.809 0 0 0 -1793.8 -182.119 0 0.02 0 0 310.297 0 0 684.912 0 596.713 0 0 0 2222.28 0 -1099.66 0 0 0 0 0 0 0 0 0 0 2291.25 0 0 0 -1811.04 0 0 0 0 0 0 
0 0 0 0 2387.08 1207.69 -1887.34 1450.01 1874.52 0 0 0 0 0 677.435 0 0 0 0 0 0 353.481 0 -1992.93 0 0 0 0.08 0 0 2443.69 0 0 2003.31 0 0 -2003.92 0 0 -2204.73 0 0 0 2371.36 -647.526 0 1901.84 0 0 0 0 0 0 0 1950.06 0 0 0 0 0 0 0 
0 0 0 1793.95 -1117.36 199.82 -71.7948 0 0 0 0 0 -1130.02 1956.01 -1833.78 0 0 0 0 0 0 -36.3933 -616.245 956.984 2274.01 0 0 0 0.07 0 794.626 0 2224.88 0 0 0 0 0 2363.73 0 1386.99 0 0 0 0 0 1664.1 0 1581.7 0 0 0 0 0 0 0 0 0 -2147.82 0 275.658 1133.53 
0 0 1106.37 -156.178 0 0 0 0 0 0 879.467 0 -2249.9 0 2166.28 0 0 0 0 0 0 0 0 0 0 0 1838.66 0 0 0.07 0 0 0 0 0 0 0 0 0 -1871.47 0 0 47.9904 20.8289 0 0 0 0 0 2230.06 -2317.04 0 0 0 0 0 0 0 0 0 0 1245.38 
0 0 -813.089 0 0 0 0 0 0 0 -582.98 0 -915.937 0 1656.16 0 0 0 0 0 0 0 0 2181.39 0 0 0 1944.11 192.495 0 0.08 0 0 1871.01 1206.32 0 -2468.41 -748.848 0 -1271.02 809.427 0 0 0 0 2156.51 0 0 0 662.328 0 0 0 1556.22 0 0 0 0 0 0 0 0 
0 0 136.952 0 0 -1945.17 397.427 0 0 0 2495.12 0 0 2428.59 0 550.783 0 0 0 2321.92 1687.9 -98.3459 0 0 0 0 0 0 0 0 0 0.03 -1017.56 -2102.65 1993.39 0 0 1180.68 0 2136.98 0 0 0 0 -859.478 2270.04 0 0 0 0 0 0 -1455.66 0 0 2393.19 0 0 -2082.2 0 0 0 
0 1878.8 0 0 0 0 1755.96 533.998 1236.08 1404.69 869.396 -156.636 0 -129.322 0 0 1527.99 2089.07 0 0 0 -962.935 0 -202.109 0 0 -2335.96 0 -1532.72 0 0 1506.01 0.04 0 0 0 0 -155.873 1728.64 0 0 0 678.961 0 0 -2229.91 0 1850.72 0 0 0 -2180.32 -346.614 0 0 0 0 1559.72 0 -868.48 0 -1926.86 
0 0 573.061 -1127.12 -2250.51 0 0 0 0 0 0 0 0 0 1393.4 2007.43 0 0 0 2431.18 0 0 0 0 0 0 0 -1364.71 0 0 824.534 -452.971 0 0.04 0 817.209 0 0 0 0 421.079 0 0 0 958.815 0 0 645.543 2446.59 0 0 0 0 0 0 2366.48 0 0 0 0 0 0 
0 0 0 0 0 -724.128 265.282 1693.7 0 1015.73 2129.96 473.571 969.802 0 1708.66 0 0 0 2002.7 615.329 0 0 0 0 0 0 -863.75 0 0 0 -974.685 -1568.42 0 0 0.04 0 0 1420.26 401.09 0 0 0 514.771 0 0 0 0 0 0 0 0 0 0 0 0 0 0 0 0 0 0 0 
2478.79 -75.457 0 0 0 0 2408.14 0 2053.51 0 -87.817 0 0 -447.02 0 -992.386 482.421 0 281.152 2340.08 0 0 973.312 0 -1513.03 0 0 0 0 0 0 0 0 1118.58 0 0.05 0 1394.16 0 0 1366.85 0 0 0 0 -1926.1 -137.562 0 284.509 0 0 2240.59 0 0 0 0 357.448 0 2284.08 0 0 0 
0 0 0 0 0 0 -618.839 0 1574.98 0 0 -619.907 0 0 0 0 0 0 2327.27 739.845 0 0 0 127.949 2026.96 0 0 1790.9 0 0 648.595 0 0 0 0 0 0.06 0 0 2299.04 0 0 0 0 0 2280.27 0 0 0 0 0 0 0 -1866.59 -548.952 0 0 0 0 -2074.88 0 0 
0 0 0 0 0 328.455 -601.138 -1745.43 -2096.85 0 0 0 483.032 0 0 0 0 0 0 0 -210.196 1525.39 1379.97 0 729.621 0 0 0 0 0 -276.269 -80.6452 1923.66 0 2303.16 797.525 0 0.06 0 0 0 0 0 0 0 -1343.5 2061.91 0 0 0 0 1527.99 0 0 0 0 0 0 0 896.71 0 0 
0 0 0 -2264.24 -1098.13 -699.255 0 0 0 804.544 0 0 0 912.427 0 -989.029 0 1239.59 0 2244.87 0 -1894.97 -676.366 0 1603.37 2454.68 2079.3 0 1645.02 0 0 0 -1439.94 0 -854.9 0 0 0 0.03 0 0 0 0 0 0 0 710.852 0 0 0 0 0 0 0 0 0 0 0 0 0 2262.57 0 
0 0 0 0 0 0 0 0 0 0 0 1638.62 0 0 1478.39 0 734.199 0 0 2319.64 0 1742.07 0 0 1053.88 0 0 -1228.75 0 -2369.53 1784.65 -2283.17 0 0 0 0 -79.4244 0 0 0.07 0 0 0 0 0 0 0 0 0 0 0 0 2428.74 0 0 0 0 0 0 -15.9459 0 0 
-325.098 1639.84 0 -1065.78 1633.43 -2277.21 471.587 0 0 967.055 0 0 0 2101.43 0 -1467.41 0 0 1067.92 0 0 0 0 0 1741.31 0 964.919 0 -1228.75 0 510.041 0 0 -447.172 0 679.571 0 0 0 0 0.07 0 0 0 -1374.17 0 0 0 0 0 0 0 -609.226 0 0 0 0 0 0 0 0 0 
0 0 0 1064.71 0 0 0 0 0 0 665.38 0 -857.341 0 -1279.87 1333.43 0 0 0 -284.051 0 0 -1826.61 770.058 938.063 0 0 0 0 0 0 0 0 0 0 0 0 0 0 0 0 0.08 0 0 0 950.117 2407.38 0 0 0 0 0 0 -524.689 0 0 0 0 0 0 0 0 
0 12.2837 0 0 -1979.66 738.929 1956.62 0 -1158.1 0 0 2008.04 0 0 2028.95 0 0 2461.09 0 634.709 1416.14 0 1263.24 0 0 0 0 0 0 -539.186 0 0 214.927 0 1147.72 0 0 0 0 0 0 0 0.04 0 2088.15 0 0 0 -1021.23 0 0 0 0 0 0 0 0 0 0 0 0 0 
0 0 0 0 478.759 0 0 0 0 -958.51 2075.49 0 0 0 0 0 2107.38 0 265.282 0 0 0 0 0 0 0 0 109.638 0 822.855 0 0 0 0 0 0 0 0 0 0 0 0 0 0.01 0 -1586.58 0 0 0 0 0 191.275 -74.8466 -1276.97 0 0 0 0 2447.51 0 -2138.36 0 
0 2245.32 0 0 1973.71 0 0 0 0 0 0 0 0 2467.65 0 0 0 -1578.49 0 0 -951.949 -2101.43 0 0 1905.5 0 0 -1789.07 0 0 0 613.498 0 2279.35 0 0 0 0 0 0 2199.55 0 2166.28 0 0.01 -481.048 104.45 0 0 0 0 -732.063 0 0 0 0 0 0 0 0 2131.03 0 
0 -1446.2 0 1253.93 0 0 0 -136.799 0 0 2105.85 0 0 0 0 1673.41 606.174 0 0 2173.6 0 0 0 0 0 0 0 0 0 0 -601.901 18.0822 -216.147 0 0 2495.73 60.6555 -1487.7 0 0 0 -510.041 0 1956.92 -2489.32 0 0 0 0 0 0 0 0 0 0 0 0 0 0 0 0 0 
0 0 -1456.27 1528.44 -2388.15 0 0 0 0 2346.64 0 0 -732.978 2351.99 0 0 0 1341.98 0 0 0 0 0 0 0 0 0 2186.88 136.494 0 0 0 0 0 0 -1729.41 0 223.624 1412.32 0 0 944.319 0 0 -474.944 0 0 407.498 0 0 0 0 0 0 0 0 0 0 0 0 113.453 0 
0 2087.69 0 0 0 0 0 0 0 0 0 0 0 0 1091.72 0 0 0 0 0 0 0 0 0 0 0 0 0 0 0 0 0 2221.98 746.559 0 0 0 0 0 0 0 0 0 0 0 0 1611.3 0 0 0 -1483.12 810.343 0 0 0 0 0 0 0 0 0 0 
0 0 0 0 0 0 0 0 0 0 0 0 0 0 0 0 0 -458.922 1177.79 176.778 0 0 0 0 0 0 0 0 985.366 0 0 0 0 -791.574 0 -1302.45 0 0 0 0 0 0 383.389 0 0 0 0 0 0.01 0 0 0 0 0 0 0 0 0 0 152.516 0 0 
0 0 0 0 0 0 0 0 -675.756 0 423.063 0 0 0 0 0 969.192 0 0 0 0 0 0 -1519.75 0 0 0 0 0 965.224 1240.04 0 0 0 0 0 0 0 0 0 0 0 0 0 0 0 0 0 0 0.02 0 0 0 1407.9 0 0 0 0 0 0 0 2493.29 
0 0 0 0 0 0 0 0 0 0 0 -255.516 0 0 -1203.73 0 0 0 0 0 0 0 0 0 0 0 0 0 0 2151.17 0 0 0 0 0 0 0 0 0 0 0 0 0 0 0 0 0 796.304 0 0 0 0 0 0 1194.72 0 0 0 0 0 0 0 
0 0 0 0 0 0 0 0 0 0 0 0 -1717.51 0 0 0 0 0 0 0 0 0 0 0 0 -1753.67 -2276.91 0 0 0 0 0 541.627 0 0 -639.286 0 2356.56 0 0 0 0 0 849.406 2406.77 0 0 1516.24 0 0 0 0.09 0 0 0 0 0 0 0 0 0 0 
0 0 0 0 0 0 0 1614.05 -2317.04 0 0 0 0 -1222.5 0 0 0 0 0 0 0 0 0 0 0 652.257 0 0 0 0 0 -1943.95 1095.23 0 0 0 0 0 0 2465.67 1827.83 0 0 587.1 0 0 0 0 0 0 0 0 0.05 0 0 0 0 0 0 0 0 0 
0 0 0 0 0 0 0 0 0 0 0 0 0 0 0 0 0 0 1807.38 -1310.85 0 -44.4807 0 0 0 0 0 0 0 0 -48.7533 0 0 0 0 0 1488.77 0 0 0 0 -862.987 0 699.255 0 0 0 0 0 1158.56 0 0 0 0.03 0 0 0 262.383 0 0 -1014.82 0 
0 0 0 0 0 0 0 0 0 0 0 0 0 0 -128.407 0 0 0 1696.75 0 488.525 0 644.932 0 0 0 0 -651.799 0 0 0 0 0 0 0 0 -2073.81 0 0 0 0 0 0 0 0 0 0 0 0 0 451.75 0 0 0 0.05 0 0 0 0 0 0 0 
884.35 0 1654.33 0 395.444 0 0 0 2480.77 0 0 0 1378.75 0 0 0 0 0 0 0 0 0 0 0 -1372.8 0 2206.72 0 0 0 0 1267.97 0 1974.78 0 0 0 0 0 0 0 0 0 0 0 0 0 0 0 0 0 0 0 0 0 0.08 0 0 -1114.76 0 0 83.3918 
0 0 0 -414.365 0 0 0 0 -526.978 0 0 0 0 0 0 0 0 0 0 0 1964.25 0 0 0 0 0 0 0 0 0 0 0 0 0 0 2068.01 0 0 0 0 0 0 0 0 0 0 0 0 0 0 0 0 0 0 0 0 0.06 0 0 0 0 0 
0 0 0 0 0 0 0 0 0 0 -1395.54 0 -1365.93 1393.7 0 0 0 0 0 0 0 0 0 0 0 0 0 0 0 0 0 0 -483.642 0 0 0 0 0 0 0 0 0 0 0 0 0 0 0 0 0 0 0 0 2037.03 0 0 0 0.09 0 0 0 0 
0 0 0 0 0 0 0 0 0 0 0 0 0 0 -1627.78 0 0 0 0 0 0 0 0 -1300.47 0 0 0 0 1466.03 0 0 1556.67 0 0 0 1107.14 0 0 0 0 0 0 0 -1576.97 0 0 0 0 0 0 0 0 0 0 0 2378.38 0 0 0.09 0 965.377 0 
0 0 0 0 0 0 0 0 0 1637.09 0 0 -1165.73 0 0 0 0 0 0 0 0 0 0 -559.786 0 0 0 0 0 0 0 0 410.092 0 0 0 1161.76 1047.62 0 2299.49 0 0 0 0 0 0 0 0 944.777 0 0 0 0 0 0 0 0 0 0 0.01 0 0 
0 0 0 0 0 0 0 0 0 0 0 0 0 0 0 0 0 0 0 -471.74 0 -1587.19 0 0 0 163.503 0 0 427.946 0 0 0 0 0 0 0 0 0 388.73 0 0 0 0 1481.9 661.87 0 -321.284 0 0 0 0 0 0 -821.635 0 0 0 0 2030.63 0 0.02 0 
0 0 1616.79 388.119 0 0 0 0 0 0 0 0 0 880.535 0 0 0 0 0 0 0 0 0 0 0 -1784.95 0 0 -629.673 159.536 0 0 1813.64 0 0 0 0 0 0 0 0 0 0 0 0 0 0 0 0 -2491.76 0 0 0 0 0 2036.58 0 0 0 0 0 0.07 
