*Vertices 57
*Matrix 
0.05 0 0 0 0 0 0 0 952.254 0 0 -956.526 0 0 0 0 0 0 0 0 0 0 0 2007.13 0 -655.614 0 2450.41 0 0 -2351.22 479.217 0 0 0 0 0 0 1503.57 0 1663.64 0 0 0 0 0 0 0 0 0 0 0 -1743.6 0 0 0 0 
0 0.03 0 -730.689 -476.47 -250.786 0 0 0 0 0 0 0 0 0 2026.51 0 2142.48 930.433 1198.54 -2450.71 0 0 0 0 0 0 539.644 0 0 0 0 0 -421.384 0 0 0 950.88 0 0 -1907.18 0 0 0 0 0 0 0 0 0 0 0 0 0 0 0 0 
0 0 0.06 0 1927.32 0 0 0 0 0 0 0 0 0 0 0 0 0 0 0 0 -549.257 0 0 0 2204.43 0 0 -731.758 0 0 0 0 0 0 0 0 0 0 0 0 0 0 0 0 0 0 0 0 0 0 0 -268.792 0 0 0 0 
0 1410.49 0 0.06 2048.17 2076.86 0 798.44 0 0 0 2295.98 0 0 0 0 0 2464.9 -1126.67 0 0 0 0 2357.63 0 0 882.977 0 1085.92 0 0 0 0 0 0 0 -1826.46 0 0 0 0 2050.61 0 0 0 0 0 0 0 0 0 0 -1376.61 0 -1658.91 0 1541.72 
0 -1327.48 1867.05 1648.53 0 159.23 -992.08 0 2382.96 1420.41 760.75 0 0 0 0 0 1112.17 0 -288.629 1146.05 1598.18 0 0 0 0 0 0 0 -1279.87 0 0 -2455.14 -1974.17 0 0 0 0 0 0 0 0 0 0 0 0 0 0 0 0 0 0 0 0 0 0 0 0 
0 -1485.56 0 -1114.31 2268.97 0.06 -702.612 0 0 0 0 0 2429.81 0 0 0 0 2241.81 1191.82 0 0 0 -682.47 0 0 0 1421.63 0 0 0 0 0 0 0 0 0 0 0 0 0 0 -829.569 0 0 -621.738 0 0 0 -2462.31 0 0 0 0 16.2511 -512.482 0 -1036.94 
0 0 0 0 1663.79 2174.37 0.01 -65.9963 0 0 1047.17 -792.489 871.685 0 0 0 2182.91 192.19 0 0 0 0 167.318 0 0 0 1224.17 -1050.37 0 0 0 0 0 0 0 0 0 0 0 0 0 0 0 0 0 0 0 0 0 0 0 0 0 93.4629 0 0 0 
0 0 0 -2362.67 0 0 -1759.62 0.06 0 0 0 0 0 0 0 2468.11 2237.69 861.003 604.343 1175.5 0 1596.8 0 0 0 0 0 0 0 0 0 0 0 0 0 0 0 0 0 0 0 0 0 0 0 0 0 0 0 0 0 0 0 0 0 -2409.82 0 
1212.12 0 0 0 1578.95 0 0 0 0 0 892.59 0 0 0 0 0 0 0 26.017 0 0 0 0 -2082.51 0 0 -1512.57 676.977 306.33 0 1343.81 0 0 0 0 254.906 0 0 0 0 0 0 0 0 0 0 0 0 0 -408.109 0 0 -2175.74 -759.682 0 1678.14 0 
0 0 0 0 2128.13 0 0 0 0 0.04 2402.34 0 1724.68 0 -551.851 0 0 2138.05 0 0 0 0 0 0 0 0 0 0 0 0 0 0 0 0 0 0 0 0 0 0 0 0 0 0 0 0 831.248 0 0 0 0 0 0 0 0 0 0 
0 0 0 0 176.626 0 1858.35 0 -675.756 247.734 0.03 1819.74 0 0 0 1625.49 0 0 0 0 0 0 0 2293.08 0 0 0 -671.941 348.445 0 2478.18 0 -776.467 0 0 0 0 0 0 0 0 0 0 0 0 0 0 0 0 0 0 -244.377 0 0 0 0 0 
-855.358 0 0 2424.62 0 0 893.201 0 0 0 1669.44 0.09 862.682 0 637.15 0 0 0 357.906 0 1018.48 -1725.59 0 -247.429 -939.741 0 0 0 1202.2 -632.115 0 0 0 0 0 0 0 0 0 0 0 0 0 0 0 -1272.39 0 0 0 0 0 0 0 0 0 0 0 
0 0 0 0 0 1156.73 2328.94 0 0 1724.98 0 1060.75 0 0 0 -985.977 0 0 -1986.37 226.676 497.986 0 0 0 0 1067.16 0 0 0 0 0 0 0 0 353.786 0 0 0 0 0 0 0 0 0 0 0 0 0 0 0 0 0 0 0 0 0 0 
0 0 0 0 0 0 0 0 0 0 0 0 0 0.09 0 0 1188.47 997.726 0 0 0 0 0 0 0 0 0 0 1325.95 0 0 0 0 0 0 0 0 0 0 0 0 0 0 0 0 0 -1087.3 0 -1282.92 0 0 2238.91 0 1836.38 0 0 0 
0 0 0 0 0 0 0 0 0 -660.802 0 -963.546 0 0 0.06 0 0 781.35 1077.53 0 0 0 0 0 0 0 0 0 0 450.072 0 0 0 0 0 0 0 0 2088.76 -1200.98 0 0 0 0 0 0 1367.92 0 0 -857.494 0 0 0 2315.21 0 0 -1744.06 
0 1424.53 0 0 0 0 0 163.35 0 0 66.1489 0 1748.33 0 0 0.09 1646.7 740.608 711.005 1688.36 0 0 0 0 0 0 0 0 0 0 0 0 0 1013.29 0 0 0 0 0 0 0 0 0 0 0 0 0 0 0 0 -1113.39 0 0 0 0 0 0 
0 0 0 0 -645.238 0 -288.018 1133.38 0 0 0 0 0 2099.75 0 -730.232 0.02 0 -472.198 0 -1707.59 0 0 1703.47 0 0 0 0 0 0 0 0 0 0 0 0 0 0 0 0 0 1433.38 0 0 0 0 0 0 0 0 0 0 0 0 0 0 0 
0 1048.08 0 -429.167 0 712.836 1556.98 1639.38 0 -520.112 0 0 0 84.3074 -2117.3 -1301.39 0 0.04 0 0 72.5578 0 905.713 0 1334.35 0 2431.94 0 0 0 0 0 0 0 0 0 -189.291 0 0 0 0 0 0 0 0 0 0 0 0 0 0 0 0 0 0 0 0 
0 307.855 0 1644.41 -619.449 2110.58 0 -1956.92 2351.68 0 0 1552.4 609.836 0 -267.266 -773.568 -149.922 0 0.04 0 0 0 -2253.87 0 0 1190.76 0 0 0 -796.304 601.444 0 0 0 0 958.815 0 0 0 -1565.83 0 0 0 0 0 0 0 0 -1922.13 0 0 0 0 0 0 0 0 
0 1425.9 0 0 975.753 0 0 285.119 0 0 0 0 586.032 0 0 1828.14 0 0 0 0.01 0 -1053.88 0 0 0 2176.96 0 0 -2304.53 0 0 0 0 0 0 0 0 0 0 0 0 0 0 0 0 0 0 0 0 0 0 0 0 0 0 801.187 0 
0 -149.159 0 0 -1254.08 0 0 0 0 0 0 1849.04 2226.25 0 0 0 1959.36 -1254.84 0 0 0.02 0 0 0 0 0 0 0 0 0 0 0 0 0 -2049.85 0 0 0 0 0 996.658 0 0 0 0 889.386 0 0 0 0 -486.999 0 0 0 0 0 -777.993 
0 0 -860.393 0 0 0 0 527.741 0 0 0 1324.12 0 0 0 0 0 0 0 -153.737 0 0.01 0 0 0 1168.48 2489.32 0 0 0 0 -1525.85 0 0 -1994.46 0 0 0 0 1377.53 0 0 0 0 0 0 0 0 0 0 1332.51 0 0 0 0 0 138.783 
0 0 0 0 0 2157.73 683.844 0 0 0 0 0 0 0 0 0 0 1818.06 2122.03 0 0 0 0.04 0 0 0 0 0 0 0 0 0 0 0 0 0 57.7563 0 0 0 0 0 0 0 0 0 0 328.303 0 0 0 0 0 -1502.2 0 0 0 
2123.4 0 0 -380.795 0 0 0 0 275.353 0 2478.64 1869.03 0 0 0 0 -741.066 0 0 0 0 0 0 0.09 0 0 1031.3 0 0 0 0 162.74 0 0 -1369.14 0 0 546.205 -2466.28 0 0 0 0 0 0 0 0 0 0 0 0 0 0 0 0 0 0 
0 0 0 0 0 0 0 0 0 0 0 1596.5 0 0 0 0 0 84.6126 0 0 0 0 0 0 0.08 0 0 0 0 0 0 0 0 0 0 0 0 0 0 0 0 0 0 0 0 0 0 0 0 0 0 0 0 0 0 0 752.052 
1166.95 0 -1370.36 0 0 0 0 0 0 0 0 0 716.803 0 0 0 0 0 1916.79 945.387 0 -509.43 0 0 0 0.07 0 0 0 0 0 2177.27 0 0 0 0 0 0 -38.2244 0 2302.85 0 -1056.63 0 -1584.75 0 0 0 0 0 0 0 0 0 0 0 0 
0 0 0 866.192 0 -656.987 -300.684 0 -882.824 0 0 0 0 0 0 0 0 1080.13 0 0 0 539.796 0 2163.53 0 0 0.01 0 0 0 0 0 0 0 0 0 0 0 0 531.251 0 0 0 0 0 0 0 0 0 0 0 0 0 0 0 0 0 
2095.48 1132.62 0 0 0 0 -1720.4 0 2004.23 0 786.081 0 0 0 0 0 0 0 0 0 0 0 0 0 0 0 0 0.03 0 0 0 0 0 0 0 0 0 -2495.73 0 0 1668.52 0 0 -1780.68 0 0 0 0 0 0 0 0 0 0 0 0 0 
0 0 -1872.69 1783.12 2462.61 0 0 0 -218.589 0 1915.88 1493.04 0 -819.346 0 0 0 0 0 290.613 0 0 0 0 0 0 0 0 0.01 0 1333.43 0 0 0 0 716.651 0 235.069 0 0 0 0 500.275 0 0 0 0 0 0 0 0 0 0 0 0 0 0 
0 0 0 0 0 0 0 0 0 0 0 1870.86 0 0 -1169.55 0 0 0 1646.24 0 0 0 0 0 0 0 0 0 0 0.09 0 -308.618 1592.38 -1476.41 0 0 0 -18.0822 0 0 0 1985.92 0 0 0 0 -381.71 0 0 0 0 0 0 0 0 0 145.497 
2044.05 0 0 0 0 0 0 0 -540.559 0 1686.38 0 0 0 0 0 0 0 1921.37 0 0 0 0 0 0 0 0 0 -2177.57 0 0.01 0 0 0 0 0 0 0 0 0 0 0 1770.91 0 0 80.1874 0 0 0 -2271.26 2140.49 0 -2386.93 1330.99 -2004.99 -1360.44 0 
1859.57 0 0 0 2242.42 0 0 0 0 0 0 0 0 0 0 0 0 0 0 0 0 -2342.22 0 -1268.73 0 1703.01 0 0 0 -188.681 0 0.05 -12.7415 2059.47 0 0 0 0 0 0 0 0 0 0 0 0 0 0 0 0 0 0 0 0 0 0 1602.76 
0 0 0 0 -1462.98 0 0 0 0 0 -148.549 0 0 0 0 0 0 0 0 0 0 0 0 0 0 0 0 0 0 2207.02 0 734.962 0.02 0 0 0 1776.56 0 0 0 0 0 0 0 0 0 0 0 -305.719 0 0 -1221.12 0 0 0 0 0 
0 -386.746 0 0 0 0 0 0 0 0 0 0 0 0 0 2401.12 0 0 0 0 0 0 0 0 0 0 0 0 0 1189.23 0 1130.33 0 0.02 1072.95 0 0 -2107.99 949.812 0 0 0 0 0 -2495.12 832.163 0 -142.14 0 -462.584 0 0 0 0 0 0 0 
0 0 0 0 0 0 0 0 0 0 0 0 2224.57 0 0 0 0 0 0 0 1892.68 -983.535 0 -1640.14 0 0 0 0 0 0 0 0 0 1504.49 0.02 0 0 0 1902.45 -607.852 0 0 0 0 0 0 0 0 0 0 0 0 -1545.99 0 -2317.19 460.143 0 
0 0 0 0 0 0 0 0 1816.39 0 0 0 0 0 0 0 0 0 -315.485 0 0 0 0 0 0 0 0 0 1666.23 0 0 0 0 0 0 0.01 0 0 0 0 0 1327.48 0 0 0 0 0 0 0 0 0 0 1941.51 0 0 0 0 
0 0 0 2372.28 0 0 0 0 0 0 0 0 0 0 0 0 0 439.695 0 0 0 0 1180.38 0 0 0 0 0 0 0 0 0 1073.87 0 0 0 0.01 0 0 0 0 0 0 -2182.76 0 0 0 0 0 0 0 0 0 0 0 0 0 
0 1158.1 0 0 0 0 0 0 0 0 0 0 0 0 0 0 0 0 0 0 0 0 0 1811.04 0 0 0 357.906 2150.87 951.338 0 0 0 830.027 0 0 0 0.01 0 0 0 0 0 0 0 0 0 380.032 0 0 0 0 0 0 0 0 0 
83.697 0 0 0 0 0 0 0 0 0 0 0 0 0 -2435.3 0 0 0 0 0 0 0 0 -100.177 0 -291.986 0 0 0 0 0 0 0 2138.66 1354.34 0 0 0 0 0 0 0 0 -237.51 0 0 0 1649.14 0 0 0 0 0 0 0 0 0 
0 0 0 0 0 0 0 0 0 0 0 0 0 0 -2465.51 0 0 0 1555.3 0 0 -553.987 0 0 0 0 2402.34 0 0 0 0 0 0 0 -577.944 0 0 0 0 0.05 0 0 0 0 0 0 1744.21 0 0 0 0 0 0 0 0 0 0 
1945.48 1689.28 0 0 0 0 0 0 0 0 0 0 0 0 0 0 0 0 0 0 2095.78 0 0 0 0 -65.0807 0 -1637.09 0 0 0 0 0 0 0 0 0 0 0 0 0.08 1673.86 -1520.05 0 0 1784.95 0 0 616.092 0 0 2144.92 0 0 0 0 0 
0 0 0 1608.55 0 2000.11 0 0 0 0 0 0 0 0 0 0 888.318 0 0 0 0 0 0 0 0 0 0 0 0 1144.98 0 0 0 0 0 -185.324 0 0 0 0 -366.298 0.06 0 -952.101 0 0 0 0 0 0 0 -676.366 0 0 0 0 0 
0 0 0 0 0 0 0 0 0 0 0 0 0 0 0 0 0 0 0 0 0 0 0 0 0 1525.39 0 0 1749.24 0 1904.13 0 0 0 0 0 0 0 0 0 996.048 0 0.09 0 0 310.602 -2104.18 0 0 0 0 0 0 0 0 0 0 
0 0 0 0 0 0 0 0 0 0 0 0 0 0 0 0 0 0 0 0 0 0 0 0 0 0 0 771.126 0 0 0 0 0 0 0 0 1748.79 0 1840.34 0 0 -552.766 0 0.04 0 0 0 0 0 0 614.414 0 0 0 0 0 0 
0 0 0 0 0 1866.74 0 0 0 0 0 0 0 0 0 0 0 0 0 0 0 0 0 0 0 -325.556 0 0 0 0 0 0 0 2366.63 0 0 0 0 0 0 0 0 0 0 0.02 -1814.86 0 0 0 0 0 0 0 0 0 0 0 
0 0 0 0 0 0 0 0 0 0 0 -976.211 0 0 0 0 0 0 0 0 971.48 0 0 0 0 0 0 0 0 0 1856.21 0 0 1231.8 0 0 0 0 0 0 2066.03 0 -1018.63 0 -106.433 0 0 -167.776 0 0 0 0 0 0 0 0 0 
0 0 0 0 0 0 0 0 0 703.223 0 0 0 -1314.2 2069.99 0 0 0 0 0 0 0 0 0 0 0 0 0 0 572.604 0 0 0 0 0 0 0 0 0 -1912.37 0 0 2241.66 0 0 0 0.06 0 0 0 992.691 0 0 0 0 0 0 
0 0 0 0 0 0 0 0 0 0 0 0 0 0 0 0 0 0 0 0 0 0 1209.22 0 0 0 0 0 0 0 0 0 0 598.239 0 0 0 1649.6 2272.03 0 0 0 0 0 0 -1382.56 0 0.07 0 0 0 0 -14.8778 0 0 0 0 
0 0 0 0 0 1351.89 0 0 0 0 0 0 0 -253.227 0 0 0 0 -351.955 0 0 0 0 0 0 0 0 0 0 0 0 0 1669.44 0 0 0 0 0 0 0 158.773 0 0 0 0 0 0 0 0.04 0 1094.47 0 0 0 0 0 0 
0 0 0 0 0 0 0 0 1930.98 0 0 0 0 0 915.632 0 0 0 0 0 0 0 0 0 0 0 0 0 0 0 2106.62 0 0 1553.77 0 0 0 0 0 0 0 0 0 0 0 0 0 0 0 0.07 0 0 0 0 0 0 0 
0 0 0 0 0 0 0 0 0 0 0 0 0 0 0 -171.896 0 0 0 0 1367.76 1508 0 0 0 0 0 0 0 0 -1114.61 0 0 0 0 0 0 0 0 0 0 0 0 -1170.61 0 0 1509.67 0 -352.412 0 0.03 0 0 0 -602.969 0 0 
0 0 0 0 0 0 0 0 0 0 -337.306 0 0 893.048 0 0 0 0 0 0 0 0 0 0 0 0 0 0 0 0 0 0 2297.66 0 0 0 0 0 0 0 1251.64 1229.97 0 0 0 0 0 0 0 0 0 0.03 0 0 0 0 0 
851.238 0 1595.28 928.907 0 0 0 0 622.654 0 0 0 0 0 0 0 0 0 0 0 0 0 0 0 0 0 0 0 0 0 2471.92 0 0 0 1401.18 -1018.17 0 0 0 0 0 0 0 0 0 0 0 -1855.91 0 0 0 0 0.04 0 0 0 0 
0 0 0 0 0 -1770.91 818.43 0 266.198 0 0 0 0 533.387 1109.58 0 0 0 0 0 0 0 572.451 0 0 0 0 0 0 0 -263.756 0 0 0 0 0 0 0 0 0 0 0 0 0 0 0 0 0 0 0 0 0 0 0.04 0 0 -949.507 
0 0 0 -601.291 0 1691.87 0 0 0 0 0 0 0 0 0 0 0 0 0 0 0 0 0 0 0 0 0 0 0 0 2203.05 0 0 0 -428.861 0 0 0 0 0 0 0 0 0 0 0 0 0 0 0 -88.8852 0 0 0 0 0 0 
0 0 0 0 0 0 0 2026.2 -1731.85 0 0 0 0 0 0 0 0 0 0 1216.39 0 0 0 0 0 0 0 0 0 0 1033.43 0 0 0 -327.387 0 0 0 0 0 0 0 0 0 0 0 0 0 0 0 0 0 0 0 0 0.07 0 
0 0 0 1760.08 0 2160.94 0 0 0 0 0 0 0 0 -1695.07 0 0 0 0 0 2299.95 -803.323 0 0 -474.639 0 0 0 0 -919.141 0 -2178.03 0 0 0 0 0 0 0 0 0 0 0 0 0 0 0 0 0 0 0 0 0 788.522 0 0 0.05 
