*Vertices 48
*Matrix 
0.02 0 1971.11 0 -126.118 1058.15 269.86 2193.59 0 0 0 1912.67 0 0 0 464.721 0 0 0 0 1091.42 2359.77 -1140.4 0 0 0 0 -564.669 0 0 0 1943.19 0 0 0 0 0 0 0 0 0 0 0 0 0 0 0 0 
0 0.05 0 -1519.29 0 0 0 0 785.318 0 0 0 2170.55 -433.439 0 0 941.42 0 0 1685.61 0 0 0 0 0 0 0 -142.14 0 0 0 0 0 0 0 0 0 0 0 -286.645 0 0 0 0 2194.05 0 0 0 
-1134.6 0 0.08 0 0 0 0 0 0 0 0 0 0 -2072.44 12.7415 376.37 0 2183.22 2391.2 0 0 0 0 0 0 0 0 2256.61 0 0 0 0 0 0 0 0 0 0 0 598.086 819.346 0 673.315 0 0 -1629.46 0 0 
0 -2158.96 0 0.01 0 0 653.172 -28.7637 0 0 0 0 0 0 0 0 -521.485 0 0 0 2273.4 0 0 0 2256.77 0 0 0 950.423 0 0 0 1138.42 0 523.927 0 0 0 0 0 0 -1350.06 0 0 0 0 2303.61 0 
1442.38 0 0 0 0.07 1286.58 0 0 0 1855.91 0 0 130.543 0 0 2474.36 -396.664 0 0 1803.11 0 0 0 0 0 -337.611 0 951.338 0 0 0 0 182.119 137.104 -1447.26 0 0 0 0 0 -1862.32 0 0 326.014 0 -439.695 0 0 
225.455 0 0 0 1786.32 0.02 0 0 -1241.11 0 0 0 0 0 0 0 0 0 0 0 2442.63 0 0 1561.25 0 -192.648 0 0 0 0 184.866 -227.744 407.346 0 0 0 0 0 0 0 0 0 0 0 0 0 0 0 
2176.66 0 0 -1551.03 0 0 0.09 0 0 0 0 0 0 2200.31 0 0 0 0 1244.93 233.238 0 -586.947 1378.75 0 0 0 0 591.372 0 0 0 0 0 0 0 0 0 0 0 0 0 0 0 0 1650.21 0 0 0 
2191.46 0 0 1564.61 0 0 0 0.06 0 0 0 0 -2199.24 0 0 0 0 0 0 0 0 0 0 0 982.62 606.784 991.623 0 0 0 0 0 0 0 0 0 0 0 1822.95 0 0 0 0 0 0 2383.11 0 0 
0 2285.15 0 0 0 654.393 0 0 0.06 0 0 0 -1062.12 0 0 0 1460.23 1709.11 -919.446 1488.62 0 0 2191.31 0 0 -1986.98 2113.18 -349.055 0 0 0 0 0 2412.41 0 -912.732 0 0 0 0 0 0 0 0 0 -2119.28 0 0 
0 0 0 0 1677.07 0 0 0 0 0.05 0 0 1619.08 0 0 0 0 0 0 0 0 277.337 0 1735.97 0 0 0 0 560.244 0 0 0 0 0 0 0 -822.855 0 0 0 831.706 0 -1225.24 -9.38444 0 0 0 0 
0 0 0 0 0 0 0 0 0 0 0.07 0 -1359.98 858.562 0 0 0 1728.49 1862.16 0 0 1514.25 0 -1324.27 0 0 0 0 0 -2227.32 -776.009 1869.03 0 2035.36 541.169 0 0 0 0 0 0 0 103.076 0 0 0 0 0 
527.894 0 0 0 0 0 0 0 0 0 0 0.07 0 0 0 0 759.835 0 0 0 0 0 -306.024 1475.49 1492.28 0 0 0 0 0 0 0 0 0 0 0 0 0 0 0 0 0 0 1144.06 592.441 0 0 0 
0 -798.288 0 0 -850.169 0 0 1820.81 992.386 -291.528 -2104.94 0 0.04 0 0 0 0 0 0 0 0 -1397.98 0 0 1244.47 1842.78 0 1444.21 0 0 0 0 0 0 0 0 691.931 -766.243 0 0 0 0 0 0 0 0 0 313.959 
0 1959.06 2233.88 0 0 0 -268.487 0 0 0 1758.25 0 0 0.08 0 -1837.6 0 1276.06 0 0 0 0 0 0 0 0 0 1696.91 0 0 0 0 0 0 0 0 38.9874 0 0 0 0 -1767.1 0 0 0 0 0 0 
0 0 -1457.64 0 0 0 0 0 0 0 0 0 0 0 0.08 0 0 0 0 0 321.131 0 754.494 0 0 0 0 2056.87 0 0 0 0 0 1351.44 0 0 0 0 0 0 0 0 0 0 0 0 0 0 
1147.72 0 -1090.04 0 1852.85 0 0 0 0 0 0 0 0 -978.805 0 0.03 0 0 0 0 0 -1605.5 0 0 0 -2103.11 0 1450.62 2252.49 0 0 0 0 0 0 0 0 0 0 0 0 0 117.573 0 0 0 0 0 
0 484.405 0 977.737 -822.55 0 0 0 2170.09 0 0 772.042 0 0 0 0 0.08 -494.324 0 0 0 0 2312.01 0 -1323.97 -953.627 0 0 0 0 0 0 0 0 0 0 0 0 0 0 0 0 0 0 0 0 0 0 
0 0 1232.87 0 0 0 0 0 -1653.72 0 1537.29 0 0 -929.06 0 0 1387.75 0 -1325.5 1756.11 0 -146.718 0 0 0 0 0 1678.59 0 0 0 0 0 0 0 0 0 0 0 0 0 0 0 0 0 0 1417.66 0 
0 0 2060.53 0 0 0 748.543 0 1004.75 0 1888.26 0 0 0 0 0 0 -1434.6 0.03 0 0 1250.72 0 0 0 0 0 0 0 0 0 0 0 0 0 0 0 0 0 0 0 0 0 0 -1855.91 0 0 0 
0 2104.94 0 0 1911.45 0 1124.53 0 1599.55 0 0 0 0 0 0 0 0 -2400.66 0 0.09 -1297.57 0 0 -169.454 -1619.39 364.162 0 0 0 -656.072 0 0 926.466 0 -411.466 -932.875 0 0 0 0 0 0 0 0 0 0 0 0 
840.556 0 0 -1917.4 0 1836.68 0 0 0 0 0 0 0 0 2337.49 0 0 0 0 2418.52 0.02 2013.69 0 1664.56 0 -1018.94 0 0 0 0 1643.5 0 0 0 0 0 0 0 0 0 0 0 0 0 0 0 0 0 
-1137.5 0 0 0 0 0 1991.26 0 0 -421.995 90.4111 0 909.223 0 0 1898.02 0 -1663.64 2302.24 0 -1417.81 0 0 713.446 0 2442.47 0 0 0 0 0 0 0 0 0 0 0 0 0 0 0 1618.78 1401.49 0 0 0 0 0 
-744.423 0 0 0 0 0 1489.84 0 -1579.26 0 0 -672.857 0 0 1670.35 0 -428.556 0 0 0 0 0 0 0 0 0 1309.47 0 0 0 0 0 0 0 0 0 0 2227.32 0 0 0 0 0 0 0 0 0 0 
0 0 0 0 0 2079.76 0 0 0 489.135 -2429.35 314.875 0 0 0 0 0 0 0 1176.56 2016.74 2267.91 0 0 -380.184 1111.87 0 0 1791.21 0 0 0 0 0 0 0 0 0 0 0 0 0 0 0 0 0 0 0 
0 0 0 -1083.79 0 0 0 522.858 0 0 0 1077.99 -102.161 0 0 0 2251.73 0 0 1809.82 0 0 0 -1502.96 0.04 0 0 0 0 0 0 0 0 0 0 0 0 -2092.73 0 0 0 0 0 0 0 0 0 -467.467 
0 0 0 0 47.6852 -675.604 0 2336.57 1213.64 0 0 0 1607.64 0 0 -195.7 -2450.41 0 0 1250.11 -24.0333 -1270.56 0 1133.99 0 0.04 743.812 2409.36 0 0 0 -1445.89 0 0 0 0 0 0 0 0 0 0 0 0 0 0 0 0 
0 0 0 0 0 0 0 886.639 1920.91 0 0 0 0 0 0 0 0 0 0 0 0 0 2480.93 0 0 -1209.22 0.08 0 -469.909 0 0 0 0 0 0 0 0 0 0 0 0 0 0 0 0 0 0 -1759.32 
1086.84 573.672 2279.2 0 -1002.3 0 1762.83 0 -2344.36 0 0 0 2335.51 -1696.6 -1305.05 -67.8274 0 2493.29 0 0 0 0 0 0 0 -2074.42 0 0 0 0 0 0 0 0 0 1695.68 0 0 0 0 0 0 0 0 0 0 -1601.38 0 
0 0 0 2172.99 0 0 0 0 0 1813.03 0 0 0 0 0 2091.36 0 0 0 0 0 0 0 -2486.72 0 0 1398.43 0 0.05 0 0 0 0 0 0 0 0 197.989 0 0 -498.444 0 0 0 0 0 0 0 
0 0 0 0 0 0 0 0 0 0 1507.08 0 0 0 0 0 0 0 0 2087.54 0 0 0 0 0 0 0 0 0 0.01 2433.01 0 0 0 0 0 0 0 0 0 -191.275 295.495 0 0 0 0 0 0 
0 0 0 0 0 1708.2 0 0 0 0 794.168 0 0 0 0 0 0 0 0 0 700.629 0 0 0 0 0 0 0 0 2093.34 0.03 0 0 0 0 0 0 0 0 0 0 0 0 0 0 0 0 0 
2112.57 0 0 0 0 1675.7 0 0 0 0 1842.02 0 0 0 0 0 0 0 0 0 0 0 0 0 0 1889.63 0 0 0 0 0 0.03 0 0 0 0 1295.74 0 0 0 0 0 0 0 0 0 453.734 0 
0 0 0 2381.89 556.276 1498.23 0 0 0 0 0 0 0 0 0 0 0 0 0 319.91 0 0 0 0 0 0 0 0 0 0 0 0 0.08 0 0 1321.38 0 0 -299.768 0 0 0 0 0 1981.8 -335.932 0 0 
0 0 0 0 -852.153 0 0 0 2232.05 0 141.53 0 0 0 700.018 0 0 0 0 0 0 0 0 0 0 0 0 0 0 0 0 0 0 0.08 0 0 0 0 0 0 0 0 -636.235 0 0 0 0 0 
0 0 0 444.884 1711.1 0 0 0 0 0 1405.61 0 0 0 0 0 0 0 0 -2440.79 0 0 0 0 0 0 0 0 0 0 0 0 0 0 0.09 0 0 0 1600.62 0 0 0 0 0 -721.229 0 466.552 0 
0 0 0 0 0 0 0 0 -1110.64 0 0 0 0 0 0 0 0 0 0 2082.05 0 0 0 0 0 0 0 1425.9 0 0 0 0 -668.737 0 0 0.05 0 0 0 0 0 0 0 0 0 0 0 0 
0 0 0 0 0 0 0 0 0 793.558 0 0 -1332.36 1124.68 0 0 0 0 0 0 0 0 0 0 0 0 0 0 0 0 0 1864.6 0 0 0 0 0.01 0 0 0 0 0 0 0 0 0 0 -700.629 
0 0 0 0 0 0 0 0 0 0 0 0 1648.38 0 0 0 0 0 0 0 0 0 2434.23 0 -1045.18 0 0 0 357.295 0 0 0 0 0 0 0 0 0.03 0 1743.14 0 0 0 0 0 0 0 0 
0 0 0 0 0 0 0 1423.92 0 0 0 0 0 0 0 0 0 0 0 0 0 0 0 0 0 0 0 0 0 0 0 0 2000.72 0 1111.56 0 0 0 0 0 0 0 0 0 0 1605.81 0 0 
0 1934.95 -506.989 0 0 0 0 0 0 0 0 0 0 0 0 0 0 0 0 0 0 0 0 0 0 0 0 0 0 0 0 0 0 0 0 0 0 -1000.93 0 0.09 0 0 0 0 0 0 0 0 
0 0 1973.25 0 785.318 0 0 0 0 -883.435 0 0 0 0 0 0 0 0 0 0 0 0 0 0 0 0 0 0 1147.57 1586.43 0 0 0 0 0 0 0 0 0 0 0.04 0 0 0 0 0 0 0 
0 0 0 -1240.81 0 0 0 0 0 0 0 0 0 149.77 0 0 0 0 0 0 0 765.481 0 0 0 0 0 0 0 132.832 0 0 0 0 0 0 0 0 0 0 0 0.07 0 0 0 0 0 0 
0 0 -1609.78 0 0 0 0 0 0 1948.38 505.615 0 0 0 0 671.941 0 0 0 0 0 791.574 0 0 0 0 0 0 0 0 0 0 0 1654.48 0 0 0 0 0 0 0 0 0.02 -1143.6 0 0 0 0 
0 0 0 0 2459.72 0 0 0 0 -1344.57 0 1695.07 0 0 0 0 0 0 0 0 0 0 0 0 0 0 0 0 0 0 0 0 0 0 0 0 0 0 0 0 0 0 -318.842 0.02 2010.03 0 0 0 
0 1873.3 0 0 0 0 -187.307 0 0 0 0 1275.6 0 0 0 0 0 0 2414.55 0 0 0 0 0 0 0 0 0 0 0 0 0 2120.2 0 -1394.16 0 0 0 0 0 0 0 0 -1199.15 0.02 0 0 0 
0 0 253.533 0 359.737 0 0 1624.27 2427.98 0 0 0 0 0 0 0 0 0 0 0 0 0 0 0 0 0 0 0 0 0 0 0 -422.605 0 0 0 0 0 1739.78 0 0 0 0 0 0 0.09 0 0 
0 0 0 -52.4155 0 0 0 0 0 0 0 0 0 0 0 0 0 2205.04 0 0 0 0 0 0 0 0 0 2024.22 0 0 0 821.482 0 0 697.729 0 0 0 0 0 0 0 0 0 0 0 0.07 2040.39 
0 0 0 0 0 0 0 0 0 0 0 0 1890.55 0 0 0 0 0 0 0 0 0 0 0 -715.888 0 2447.05 0 0 0 0 0 0 0 0 0 -2453.61 0 0 0 0 0 0 0 0 0 -963.24 0.05 
