*Vertices 81
*Matrix 
0.01 -394.528 0 1405.45 370.724 0 0 0 0 -479.522 0 0 2470.4 1859.26 0 360.195 -411.466 0 0 0 0 0 0 0 0 0 429.014 363.247 0 -84.3074 0 0 0 0 0 1419.19 474.487 0 0 0 0 -1327.94 0 144.276 0 0 0 -245.14 0 464.873 0 -639.134 0 0 0 0 0 0 0 0 0 0 0 0 0 0 0 0 0 0 0 0 0 0 45.5489 1610.23 0 0 0 0 0 
263.909 0.09 2107.68 0 0 0 0 0 0 568.331 1333.28 -212.79 0 0 0 0 0 0 -1325.5 2274.77 0 0 0 996.506 0 1951.58 0 0 2206.11 0 0 2360.07 0 -539.796 0 0 -122.608 -85.5281 990.097 0 1117.21 2251.73 0 0 -1647.16 0 0 -2434.69 0 0 0 0 -1568.12 0 -87.9696 0 0 0 0 0 0 0 -2138.51 0 0 0 0 0 0 0 0 0 0 0 0 0 0 662.481 0 0 865.123 
0 330.897 0.01 1881.85 0 0 0 -1491.82 1862.77 0 0 2389.07 0 0 0 0 0 0 0 -546.052 0 -698.34 1488.92 141.682 2359.31 0 0 0 0 0 0 -254.753 1870.86 -423.826 0 0 0 -1650.52 2361.9 0 0 0 1514.86 0 0 0 0 0 0 1374.48 666.448 541.322 1240.81 0 0 0 0 0 0 0 0 0 1317.1 0 1373.87 0 0 0 -1029.62 0 0 0 0 0 2229.15 0 0 0 0 0 0 
385.678 0 -885.723 0.08 0 0 0 -2166.59 0 0 0 -1495.48 0 1916.18 0 0 0 0 -1296.35 2116.84 0 0 0 0 0 -371.029 0 1819.59 0 0 -2053.06 0 0 -141.072 0 0 0 0 0 0 368.13 364.467 -1775.49 0 286.95 0 0 1850.11 2281.33 0 0 -1079.21 0 0 0 0 457.091 -2149.65 0 0 0 0 0 0 0 0 185.476 0 472.808 0 1088.98 0 0 0 0 0 0 1636.63 0 0 0 
-2327.88 0 0 0 0.01 0 2467.96 0 0 0 0 0 0 0 0 931.959 0 0 0 2085.71 0 0 0 0 -95.7518 0 0 0 0 -2433.93 0 0 -727.18 0 0 0 0 0 2484.13 0 -411.924 0 1358.91 1006.73 2131.79 0 0 0 0 0 -2122.94 0 0 0 0 0 684.606 0 560.244 0 0 -1115.99 0 0 0 0 0 0 0 0 0 315.027 0 0 0 0 0 0 0 0 0 
0 0 0 0 0 0.02 -295.343 0 0 0 0 0 0 -1713.39 0 0 1267.97 -967.36 0 2223.35 0 0 0 0 0 0 0 0 0 0 844.066 0 0 -277.184 0 0 551.393 0 1672.34 0 1266.14 0 0 0 729.774 0 -26.3222 0 0 0 0 0 0 0 0 0 0 0 0 0 0 0 0 0 0 0 0 0 0 0 1873.91 0 0 0 0 0 -72.2526 0 0 0 0 
0 0 0 0 1090.96 1749.4 0.07 0 0 0 0 1140.71 0 0 0 0 0 0 0 2433.77 -701.392 0 0 0 0 0 1647.77 0 250.023 0 0 0 0 0 0 0 0 0 -634.251 -599.918 0 1001.08 0 0 0 0 -561.769 0 0 0 0 0 0 0 1037.4 459.99 0 -1213.95 0 0 0 -809.275 0 1508.15 0 0 0 1236.23 0 -1949.6 0 0 0 0 0 0 1007.34 -1407.59 0 0 2428.89 
0 0 773.11 1910.08 0 0 0 0.02 903.729 0 0 -1937.09 0 0 205.466 0 0 -1055.71 0 0 0 0 0 0 0 0 0 -2339.78 0 0 -179.83 0 1798.23 0 0 0 0 1512.57 0 0 -191.885 0 0 0 0 879.62 0 0 0 -534.15 0 0 0 0 0 0 0 0 0 0 0 0 0 0 0 0 0 0 436.491 2189.78 0 0 0 0 0 0 0 600.07 0 0 0 
0 0 -651.646 0 0 0 0 1737.04 0.03 0 1314.05 1589.02 0 -596.561 0 0 0 1420.1 617.771 0 -115.436 0 931.196 0 2362.67 0 0 0 0 0 0 -663.701 0 0 0 0 0 0 0 0 0 -355.159 0 0 0 -927.076 -1132.62 0 0 0 0 0 0 0 0 -2255.85 0 -1766.79 0 0 0 0 0 0 -33.7992 0 0 0 0 0 0 0 0 0 0 0 0 0 0 0 -915.784 
1089.59 -1682.87 0 0 0 0 0 0 0 0.08 0 0 0 2439.27 0 0 1402.1 -1255.61 0 0 0 -276.116 0 0 0 0 0 813.7 0 1294.98 0 0 0 0 2098.38 0 0 0 0 0 0 0 2435.3 0 0 0 0 0 235.984 1328.85 0 0 1876.81 0 0 0 0 0 0 0 0 0 0 0 0 0 0 0 0 0 0 0 0 0 0 0 0 0 0 0 0 
0 68.4378 0 0 0 0 0 0 1018.78 0 0.05 0 0 0 0 0 -1208.46 0 0 495.239 0 -358.974 0 0 -883.282 0 0 0 0 0 0 1280.63 0 0 0 0 0 -2362.51 0 0 -522.858 0 0 0 1963.03 0 0 0 1933.27 0 0 0 0 0 0 0 0 0 0 294.733 0 0 0 0 0 0 0 0 0 0 576.571 0 131.001 0 0 0 0 0 0 0 0 
0 965.987 -65.8437 1174.89 0 0 -625.706 2458.8 -33.6467 0 0 0 -2091.2 0 -255.211 825.602 0 0 0 0 0 0 -219.81 0 1843.85 0 0 1086.23 0 1555.76 313.349 -860.546 0 1843.85 0 0 0 0 0 0 -1252.25 0 0 0 0 0 0 0 0 301.294 0 -455.412 0 0 0 0 -98.6511 0 0 0 0 2470.7 0 0 0 0 0 0 0 0 0 0 0 0 0 0 0 0 0 0 0 
1084.86 0 0 0 0 0 0 0 0 0 0 1686.38 0.03 0 0 0 0 0 0 0 0 1474.58 0 0 547.578 -902.661 -402.005 0 0 0 1526 0 0 0 0 -1113.24 -264.519 1502.66 0 0 0 0 0 0 0 348.903 0 -1778.85 0 177.694 0 0 0 0 0 0 0 0 0 0 0 0 0 0 2391.2 2461.39 -557.802 0 0 0 0 0 0 0 0 0 0 0 0 0 0 
-1994 0 0 1819.28 0 -177.847 0 0 1874.98 -2092.88 0 0 0 0 0 0 1022.9 -1481.44 -676.519 0 1643.8 2139.88 0 0 0 0 0 0 0 735.572 -2358.39 0 2262.11 2302.09 0 0 0 -1269.34 0 0 0 0 0 1471.22 0 0 0 0 0 0 0 0 0 0 0 0 0 0 0 -1400.88 0 0 0 0 0 0 0 0 2469.79 0 0 0 -2064.04 0 0 0 0 0 0 0 -1369.75 
0 0 0 0 0 0 0 1055.25 0 0 0 1525.85 0 0 0.06 0 0 1060.9 0 0 2074.57 0 0 0 0 569.857 0 0 0 -571.23 0 -1357.84 0 0 0 -2317.19 0 0 0 0 1895.12 0 2415.46 0 -1230.28 0 -89.3429 0 0 -50.8896 399.258 0 0 0 0 0 -2199.39 0 0 0 0 0 0 0 0 0 0 0 0 0 0 0 339.595 0 0 0 0 0 0 0 0 
1277.43 0 0 0 2428.13 0 0 0 0 0 0 500.275 0 0 0 0.05 0 0 0 0 0 0 0 0 0 0 0 -2281.03 -811.258 0 0 0 0 264.519 0 0 0 1109.58 0 0 0 644.932 0 -2079.3 2436.37 0 1677.07 0 1284.75 0 0 0 0 0 0 0 0 0 0 0 0 0 0 0 0 -344.783 0 0 0 169.301 0 1347.93 0 1423.46 0 0 0 754.189 -1152.15 0 0 
-1624.58 0 0 0 0 -1415.07 0 0 0 -1728.03 1793.5 0 0 943.861 0 0 0.04 0 0 -1695.53 0 0 0 0 -744.575 0 1473.36 -62.0289 0 0 0 2050.46 0 0 2292.17 0 0 0 1626.71 0 0 -407.956 0 0 0 1059.53 -457.396 -248.65 0 0 0 -2115.47 0 0 0 0 0 0 0 0 0 0 0 0 -701.849 0 0 0 -2243.8 0 1995.99 1877.88 0 -89.0378 0 0 0 0 0 0 0 
0 0 0 0 0 658.666 0 1370.51 -1085.92 1051.9 0 0 0 -1589.63 559.175 0 0 0.02 2099.44 0 0 2410.28 -79.8822 0 0 0 0 0 0 0 0 0 -267.571 0 0 0 348.292 0 1582.92 0 0 1403.78 0 689.642 1285.52 0 -271.844 0 -1288.26 0 0 0 -21.5918 0 0 0 0 0 0 0 1739.33 0 0 0 0 0 0 0 231.864 0 0 0 -1253.93 0 0 0 0 0 0 0 0 
0 1314.36 0 -82.9341 0 0 0 0 -1243.1 0 0 0 0 2101.73 0 0 0 -1140.4 0.01 0 0 2265.77 0 0 0 0 0 0 0 0 0 0 0 0 2335.35 0 0 0 162.13 0 1855.75 0 0 -2150.72 0 0 0 0 1966.08 -430.54 0 -1340.14 0 0 0 0 0 0 0 0 -1567.66 0 0 2465.06 259.484 0 0 0 0 0 0 0 -738.929 0 0 0 0 0 0 0 0 
0 -2318.72 879.467 2204.58 686.59 1521.88 -1117.05 0 0 0 1018.63 0 0 0 0 0 -1226.31 0 0 0.04 1907.33 0 0 0 1816.23 1147.57 -1100.27 -917.158 0 0 -1468.02 0 0 0 0 0 0 372.555 0 0 0 0 -1960.89 1908.4 0 990.097 0 0 0 0 0 0 0 0 0 -1493.96 0 0 0 0 0 0 0 0 0 898.083 0 2003.92 0 0 0 0 0 0 0 0 0 0 -398.19 0 0 
0 0 0 0 0 0 1652.04 0 -1484.95 0 0 0 0 1512.27 -566.958 0 0 0 0 -221.793 0 0 -1134.45 0 0 0 0 0 0 -250.023 1104.69 -1292.38 986.129 1728.49 0 0 0 0 0 -1177.63 0 2045.12 2237.39 445.494 0 0 0 0 713.904 -384.61 2340.08 998.489 1073.72 0 0 0 0 0 856.578 1924.57 -2181.69 0 0 0 0 0 0 0 0 0 0 0 0 0 814.31 0 0 0 0 -2275.69 1835.15 
0 0 1714.76 0 0 0 0 0 0 -1153.83 2287.29 0 -1150.32 301.294 0 0 0 171.896 -1545.23 0 0 0.08 0 0 0 0 0 0 1168.63 0 499.817 2432.1 0 0 0 -1318.63 -964.309 2370.45 0 0 -1136.43 -507.599 0 0 1357.39 0 0 0 0 -1432.16 0 0 980.178 0 0 0 0 0 2045.12 0 0 -1095.08 0 0 0 0 0 0 0 0 0 0 0 0 0 0 0 -564.821 0 0 0 
0 0 1476.87 0 0 0 0 0 91.0215 0 0 2090.44 0 0 0 0 0 -1110.03 0 0 108.57 0 0.05 0 0 1870.86 0 0 0 0 0 -837.962 0 -6.18 0 0 0 0 0 0 2316.13 0 0 0 -1669.44 2369.99 0 0 0 0 0 1468.32 1471.53 0 0 0 0 0 0 0 0 0 0 0 0 0 0 0 -285.882 0 0 0 0 0 0 -2432.71 -243.767 0 0 0 0 
0 2136.68 -317.927 0 0 0 0 0 0 0 0 0 0 0 0 0 0 0 0 0 0 0 0 0.08 0 0 0 -607.089 0 1380.28 0 0 0 0 0 0 0 0 0 1434.9 0 0 -1204.18 0 0 0 0 0 0 0 0 0 2057.63 0 0 0 0 0 0 0 0 0 0 -1397.52 0 -993.454 0 0 0 0 0 0 604.648 0 0 0 0 -1675.7 2430.88 0 0 
0 0 1226.46 0 -1318.32 0 0 0 -1050.22 0 539.796 -1332.51 179.678 0 0 0 -230.338 0 0 -611.972 0 0 0 0 0 0 0 0 0 0 0 0 2135.91 0 0 0 456.175 0 0 0 -1819.13 0 0 0 0 -573.367 0 0 0 0 0 0 0 1559.11 0 0 0 0 0 0 0 2451.93 0 -285.424 0 0 0 1728.34 0 0 0 -1445.13 0 0 0 0 0 0 125.813 0 0 
0 1049.3 0 2455.44 0 0 0 0 0 0 0 0 -1036.03 0 -2355.8 0 0 0 0 1731.39 0 0 1227.84 0 0 0.08 0 0 0 0 0 0 0 850.475 751.747 0 0 0 0 0 0 0 0 -2462 0 0 0 541.78 0 0 0 0 0 0 0 0 0 0 0 0 0 2426.91 0 0 0 0 0 0 0 0 0 0 0 0 0 0 0 0 0 2469.94 0 
172.811 0 0 0 0 0 1802.8 0 0 0 0 0 153.584 0 0 0 1990.04 0 0 -2114.86 0 0 0 0 0 0 0.04 0 122.15 0 0 0 0 2281.18 0 -1932.51 0 0 1305.96 0 0 412.534 -17.4718 -698.187 0 0 0 0 73.3207 0 2380.37 0 0 -2123.86 0 0 0 0 0 1977.52 0 0 0 0 0 0 0 0 0 0 0 0 0 0 0 0 0 0 0 0 0 
1821.27 0 0 1228.9 0 0 0 662.481 0 2223.5 0 1443.6 0 0 0 -1229.51 1945.33 0 0 -1135.82 0 0 0 1462.98 0 0 0 0.02 0 0 0 0 0 0 0 0 -723.518 0 0 0 0 -559.938 1715.67 0 0 1372.04 0 15.7933 0 0 0 171.133 0 0 0 0 0 0 927.076 0 0 -155.568 425.962 -165.029 0 0 1760.23 0 0 0 0 0 0 0 0 0 0 0 0 0 -1777.78 
0 -415.891 0 0 0 0 1182.97 0 0 0 0 0 0 0 0 782.876 0 0 0 0 0 -1396.3 0 0 0 0 2323.45 0 0.03 0 0 0 0 1382.26 0 0 0 0 0 0 0 1514.86 694.678 -1209.52 0 2155.29 0 0 -122.761 0 0 0 0 0 797.372 0 0 0 0 0 0 1690.04 0 0 0 0 0 0 0 0 0 0 2210.99 -1257.29 0 0 -204.55 0 0 0 0 
1.29704 0 0 0 -1002.91 0 0 0 0 281.915 0 1525.85 0 -472.808 1603.67 0 0 0 0 0 587.558 0 0 1194.11 0 0 0 0 0 0.09 0 0 -839.946 0 1178.09 0 0 0 0 -1173.67 0 2305.75 0 0 0 0 1914.96 0 0 382.626 -458.77 391.324 77.4407 0 0 0 0 0 0 0 0 0 0 0 0 -2044.66 0 0 2303.77 0 1090.04 0 0 0 0 1023.21 0 0 0 -1588.87 0 
0 0 0 2486.42 0 -11.3681 0 967.055 0 0 0 949.202 -732.978 92.2422 0 0 0 0 0 -1562.32 -175.253 739.845 0 0 0 0 0 0 0 0 0.02 1488.01 0 0 480.59 0 926.618 0 0 0 2469.18 0 0 -2215.11 0 0 0 0 -322.199 393.002 0 753.273 -1515.63 1042.89 0 0 703.833 0 0 0 -568.331 0 0 0 2145.38 -1856.82 0 0 1330.99 0 0 0 0 0 701.239 0 0 0 0 0 0 
0 -1784.34 2414.09 0 0 0 0 0 2151.02 0 977.889 -1228.14 0 0 -213.401 0 2275.08 0 0 0 2161.7 -1044.57 1751.23 0 0 0 0 0 0 0 120.319 0 0 0 0 0 0 0 0 0 -1012.22 0 0 0 0 0 0 0 -1552.1 0 30.7474 0 0 0 0 0 954.848 0 0 0 0 0 0 0 0 1802.96 0 0 -2039.78 0 0 0 0 0 0 0 0 0 -1777.47 850.627 0 
0 0 -286.187 0 -2220.76 0 0 -2226.1 0 0 0 0 0 -793.252 0 0 0 2356.72 0 0 2041.46 0 0 0 -41.1237 0 0 0 0 2008.65 0 0 0.03 0 0 0 0 0 0 0 1737.65 0 0 0 1212.58 0 0 0 0 0 482.879 0 0 0 0 194.632 0 0 0 1793.95 0 0 0 0 0 0 0 -668.126 0 0 0 0 0 0 0 0 0 0 0 0 0 
0 1577.27 1281.85 330.897 0 -2476.04 0 0 0 0 0 2165.36 0 1698.89 0 830.332 0 0 0 0 -2012.77 0 2392.73 0 0 -1505.86 -891.98 0 2083.57 0 0 0 0 0.01 0 0 0 0 -460.601 0 0 -90.4111 0 2399.14 0 0 0 0 0 0 0 0 0 0 0 0 0 0 0 0 0 0 0 0 0 0 0 0 0 0 0 0 -1866.59 -773.415 0 0 0 0 0 0 0 
0 0 0 0 0 0 0 0 0 1850.26 0 0 0 0 0 0 2384.18 0 2344.05 0 0 0 0 0 0 -1822.03 0 0 0 -584.048 1488.62 0 0 0 0.06 0 0 0 0 -343.867 -828.501 0 0 0 0 0 1497.92 0 0 0 0 0 0 0 0 0 0 0 0 0 0 0 0 0 0 0 0 0 0 0 0 0 1164.05 0 0 0 0 -2470.24 0 0 -2492.52 
-769.906 0 0 0 0 0 0 0 0 0 0 0 -2048.78 0 2228.08 0 0 0 0 0 0 -1177.18 0 0 0 0 1456.72 0 0 0 0 0 0 0 0 0.01 999.405 0 0 0 0 0 -2329.4 0 0 -421.384 904.187 2197.87 0 586.489 403.226 0 0 0 0 0 0 0 0 0 0 0 0 0 0 0 0 0 0 0 0 0 0 0 2043.9 0 0 0 0 0 0 
265.13 1014.51 0 0 0 -1890.55 0 0 0 0 0 0 2019.49 0 0 0 0 1436.58 0 0 0 1921.67 0 0 2228.39 0 0 -1054.19 0 0 -1239.13 0 0 0 0 947.523 0.01 0 0 0 1258.66 0 0 0 2474.36 -825.297 0 0 0 0 0 1480.99 0 0 0 0 0 458.77 0 0 0 0 0 0 0 0 0 0 0 0 0 0 0 0 0 0 0 0 1437.04 0 0 
0 -899.304 274.895 0 0 0 0 -1146.35 0 0 551.241 0 2042.83 1430.17 0 1792.43 0 0 0 1921.98 0 -658.971 0 0 0 0 0 0 0 0 0 0 0 0 0 0 0 0.03 0 -928.144 -1292.23 2320.4 0 0 0 0 0 1071.89 0 1143.91 0 -677.587 1754.28 0 0 0 1432.62 0 0 0 0 0 -1682.56 0 0 0 0 0 1995.53 0 0 0 0 -596.103 0 0 0 -1513.03 0 0 0 
0 -1516.24 -1701.33 0 1820.35 284.661 423.673 0 0 0 0 0 0 0 0 0 -1323.05 475.86 -1236.08 0 0 0 0 0 0 0 2273.71 0 0 0 0 0 0 2488.4 0 0 0 0 0 0 2147.82 0 0 0 0 0 936.384 0 0 0 0 0 0 0 0 0 -235.221 0 0 0 0 0 0 0 0 0 0 0 0 0 0 0 0 0 0 0 0 0 0 0 -2234.95 
0 0 0 0 0 0 -825.755 0 0 0 0 0 0 0 0 0 0 0 0 0 -187.765 0 0 1650.36 0 0 0 0 0 1866.59 0 0 0 0 -800.119 0 0 1426.66 0 0.02 0 0 0 445.189 0 0 -457.701 0 0 -2248.38 0 2445.68 0 0 0 0 0 0 0 0 -131.306 0 0 0 0 0 0 1843.55 0 0 0 0 0 0 -1352.96 0 0 0 0 633.03 0 
0 2390.44 0 -1928.69 -932.264 1028.55 0 929.67 0 0 1698.43 803.629 0 0 -576.113 0 0 0 -2007.89 0 0 1254.84 2103.41 0 309.534 0 0 0 0 0 -1934.19 965.987 -58.8244 0 -243.461 0 2495.57 -47.5326 -2341 0 0.06 0 1515.63 327.387 0 2255.09 0 -1287.96 2064.5 -1996.75 0 0 768.227 0 0 0 0 0 0 0 0 0 0 0 0 0 0 0 0 0 0 0 0 0 0 0 0 0 0 0 0 
1196.25 13.5044 0 -1038.16 0 0 -90.4111 0 -760.14 0 0 0 0 0 0 1506.93 37.4615 1662.57 0 0 800.882 -1289.18 0 0 0 0 -1393.25 1577.12 550.63 777.993 0 0 0 -374.691 0 0 0 1923.2 0 0 0 0.04 0 0 0 0 0 1143.76 1539.28 -1092.33 0 438.475 0 0 0 0 0 -958.205 0 0 0 0 0 0 0 0 0 0 0 0 -2206.26 0 -1787.39 0 2008.19 0 0 0 0 0 0 
0 0 1630.68 1838.36 996.506 0 0 0 0 -1762.37 0 0 0 0 1769.23 0 0 0 0 -562.838 225.303 0 0 888.47 0 0 1201.28 1068.22 111.469 0 0 0 0 0 0 -424.284 0 0 0 0 -2444.46 0 0.08 1086.23 0 -2086.78 0 0 0 0 -717.109 0 0 0 0 0 0 0 0 0 0 0 0 0 0 0 0 0 0 0 -1929.76 565.432 2289.73 -1172.14 0 0 0 0 0 0 0 
2329.4 0 0 0 2039.63 0 0 0 0 0 0 0 0 1803.72 0 -1731.39 0 -314.875 -710.395 -371.792 1612.52 0 0 0 0 -255.974 1702.09 0 1186.03 0 2276.3 0 0 2208.85 0 0 0 0 0 1770.3 1071.58 0 -663.701 0.07 0 0 0 -471.129 0 0 0 0 0 0 0 0 0 0 948.592 0 0 0 0 0 0 0 0 0 0 0 0 0 0 0 -995.132 0 0 0 -2491.15 0 0 
0 1563.84 0 -1627.02 1616.79 1142.08 0 0 0 0 2156.36 0 0 0 -628.605 -366.298 0 1957.23 0 0 0 1750.01 -1508 0 0 0 0 0 0 0 0 0 -1631.44 0 0 0 -1687.44 0 0 0 0 0 0 0 0.01 0 0 0 0 2388 0 0 0 0 0 0 -1124.99 -2500 0 0 0 0 0 0 -779.824 0 0 0 0 0 0 0 0 0 231.864 0 0 0 0 0 0 
0 0 0 0 0 0 0 -539.033 -1394.92 0 0 0 333.338 0 0 0 1936.93 0 0 -2374.26 0 0 -1558.96 0 -13.0467 0 0 562.532 2222.13 0 0 0 0 0 0 44.6333 1163.14 0 0 0 -1408.51 0 1296.2 0 0 0.02 0 0 0 0 1982.86 0 0 0 827.586 0 -2200.16 0 651.952 0 0 0 0 0 0 0 0 0 0 0 0 0 0 0 0 0 0 -10.3 0 0 0 
0 0 0 0 0 568.484 2118.21 0 -1356.62 0 0 0 0 0 2428.43 2307.89 -1567.2 -144.581 0 0 0 0 0 0 0 0 0 0 0 2111.04 0 0 0 0 2354.88 2153.77 0 0 -2188.86 1166.8 0 0 0 0 0 0 0.05 0 -2017.5 0 0 374.386 0 0 0 0 0 -2121.11 0 0 0 0 0 0 0 0 0 0 0 0 0 0 0 0 0 0 0 0 0 477.844 0 
2150.72 -1081.65 0 664.922 0 0 0 0 0 0 0 0 1433.84 0 0 0 -2017.35 0 0 0 0 0 0 0 0 982.467 0 2193.59 0 0 0 0 0 0 0 -2107.99 0 -774.178 0 0 2443.54 -2061.6 0 -2472.84 0 0 0 0 0 0 1982.41 0 0 0 0 0 0 -486.694 0 -1011.92 2444.61 0 0 0 -1296.96 0 0 0 0 0 0 0 0 0 0 0 0 0 0 0 0 
0 0 0 1124.53 0 0 0 0 0 2292.93 1813.18 0 0 0 0 -762.123 0 -929.365 -1609.93 0 702.918 0 0 0 0 0 1197.62 0 1893.44 0 2044.21 1455.35 0 0 0 0 0 0 0 0 2043.6 -448.241 0 0 0 0 1387.45 0 0.03 -649.663 0 -762.886 -2155.9 0 0 1484.5 0 0 0 0 -558.565 0 0 0 0 0 0 0 -1903.06 0 0 2202.75 0 0 0 0 0 0 0 290.918 0 
1420.71 0 -2196.65 0 0 0 0 -542.543 0 -1584.44 0 -1139.18 -281.304 0 2429.35 0 0 0 966.903 0 803.629 2358.7 0 0 0 0 0 0 0 -502.258 1001.24 0 0 0 0 1496.4 0 -249.565 0 -1613.13 2016.43 2126.45 0 0 -2475.74 0 0 0 -148.701 0.09 0 316.706 0 0 0 0 1330.53 0 0 0 0 0 0 0 0 0 0 0 0 0 0 0 0 0 0 0 0 1416.14 0 0 0 
0 0 2220.15 0 1310.39 0 0 0 0 0 0 0 0 0 1329.46 0 0 0 0 0 360.347 0 0 0 0 0 -497.986 0 0 2461.7 0 1706.98 -1370.2 0 0 -1580.94 0 0 0 0 0 0 565.737 0 0 -1128.19 0 -448.546 0 0 0.05 0 0 0 1966.69 0 0 0 0 0 0 0 0 0 0 0 759.987 0 0 0 0 0 0 0 0 0 0 -1875.44 -1928.85 0 0 
2408.9 0 2074.88 1845.99 0 0 0 0 0 0 0 -694.983 0 0 0 0 1012.22 0 -1125.45 0 -2025.89 0 1646.86 0 0 0 0 -164.418 0 -2122.33 1998.28 0 0 0 0 0 1318.02 352.87 0 -275.811 0 1645.33 0 0 0 0 -363.857 0 201.804 260.094 0 0.06 0 0 0 0 0 0 0 0 0 0 0 0 0 0 0 0 0 0 0 0 0 0 0 0 0 0 0 0 0 
0 1673.56 1333.12 0 0 0 0 0 0 -805.002 0 0 0 0 0 0 0 -1559.72 0 0 1675.24 1565.52 -1456.11 1635.41 0 0 0 0 0 2328.49 -514.466 0 0 0 0 0 0 -657.14 0 0 -284.204 0 0 0 0 0 0 0 -336.543 0 0 0 0.07 0 0 0 0 0 0 1130.63 0 0 0 0 0 0 -451.14 0 0 0 1065.02 0 0 0 735.267 0 0 0 0 0 763.192 
0 0 0 0 0 0 0 0 0 0 0 0 0 0 0 0 0 0 0 0 0 0 0 0 324.335 0 2092.88 0 0 0 911.054 0 0 0 0 0 0 0 0 0 0 0 0 0 0 0 0 0 0 0 0 0 0 0.02 1921.98 0 0 0 0 0 0 0 0 0 0 0 0 0 -2228.69 0 -466.552 0 0 0 0 0 -1334.8 0 -1342.43 0 0 
0 1248.44 0 0 0 0 1691.56 0 0 0 0 0 0 0 0 0 0 0 0 0 0 0 0 0 0 0 0 0 -1378.6 0 0 0 0 0 0 0 0 0 0 0 0 0 0 0 0 1676.76 0 0 0 0 -240.867 0 0 1347.16 0 0 0 0 0 0 0 0 0 0 0 0 0 0 0 0 0 0 0 0 0 0 0 -2078.54 -1159.78 0 0 
0 0 0 0 0 0 -1707.59 0 2214.35 0 0 0 0 0 0 0 0 0 0 -785.318 0 0 0 0 0 0 0 0 0 0 0 0 664.617 0 0 0 0 0 0 0 0 0 0 0 0 0 0 0 1907.79 0 0 0 0 0 0 0.06 0 0 0 0 0 0 0 0 0 0 0 0 0 0 0 0 0 0 0 0 0 0 0 0 0 
0 0 0 2123.86 -2097.77 0 0 0 0 0 0 2395.47 0 0 2237.54 0 0 0 0 0 0 0 0 0 0 0 0 0 0 0 170.675 106.433 0 0 0 0 0 -742.439 239.799 0 0 0 0 0 967.666 588.931 0 0 0 -1630.53 0 0 0 0 0 0 0.06 0 0 0 0 0 125.507 -1474.73 0 -1334.04 0 0 0 0 0 0 0 0 0 394.528 0 0 0 0 0 
0 0 0 1726.05 0 0 -868.786 0 1964.4 0 0 0 0 0 0 0 0 0 0 0 0 0 0 0 0 0 0 0 0 0 0 0 0 0 0 0 1781.59 0 0 0 0 158.162 0 0 1252.56 0 1346.86 -656.835 0 0 0 0 0 0 0 0 0 0.09 0 0 0 0 -871.99 0 -1821.27 0 0 0 0 -109.638 0 0 0 0 0 0 0 0 0 0 0 
0 0 0 0 615.787 0 0 0 0 0 0 0 0 0 0 0 0 0 0 0 -56.0778 -1225.24 0 0 0 0 0 433.897 0 0 0 0 0 0 0 0 0 0 0 0 0 0 0 1886.58 0 1945.33 0 0 0 0 0 0 0 0 0 0 0 0 0.09 0 0 0 0 0 0 0 0 0 0 0 0 0 0 0 0 1548.13 1145.89 0 0 -1945.94 0 
0 0 0 0 0 0 0 0 0 0 1558.5 0 0 2474.36 0 0 0 0 0 0 -1528.14 0 0 0 0 0 952.712 0 0 0 0 0 -25.2541 0 0 0 0 0 0 0 0 0 0 0 0 0 0 775.704 0 0 0 0 2198.78 0 0 0 0 0 0 0.06 0 0 0 0 0 0 0 532.014 0 -1324.27 0 0 0 0 0 0 0 0 0 0 0 
0 0 0 0 0 0 0 0 0 0 0 0 0 0 0 0 0 -1229.51 -1033.28 0 2476.81 0 0 0 0 0 0 0 0 0 1303.22 0 0 0 0 0 0 0 0 -1606.88 0 0 0 0 0 0 0 -602.817 2302.7 0 0 0 0 0 0 0 0 0 0 0 0.08 0 0 0 0 0 0 0 0 0 0 0 0 0 0 0 0 0 0 0 0 
0 0 0 0 1433.23 0 1089.74 0 0 0 0 -992.996 0 0 0 0 0 0 0 0 0 1903.36 0 0 -2024.37 350.734 0 1625.64 -808.054 0 0 0 0 0 0 0 0 0 0 0 0 0 0 0 0 0 0 0 0 0 0 0 0 0 0 0 0 0 0 0 0 0.03 0 -2048.33 1352.96 0 0 0 0 0 0 0 0 0 -1254.08 0 0 0 0 0 0 
0 370.571 1118.12 0 0 0 0 0 0 0 0 0 0 0 0 0 0 0 0 0 0 0 0 0 0 0 0 340.663 0 0 0 0 0 0 0 0 0 -1942.43 0 0 0 0 0 0 0 0 0 0 0 0 0 0 0 0 0 0 1954.02 1735.97 0 0 0 0 0.04 0 0 0 0 0 0 0 0 0 0 0 -512.482 0 0 -378.658 0 0 0 
0 0 0 0 0 0 680.639 0 0 0 0 0 0 0 0 0 0 0 882.366 0 0 0 0 -1929.46 2096.85 0 0 -719.703 0 0 0 0 0 0 0 0 0 0 0 0 0 0 0 0 0 0 0 0 0 0 0 0 0 0 0 0 1490.45 0 0 0 0 1828.9 0 0.03 0 0 -397.427 0 0 0 0 0 1447.72 0 0 0 0 0 0 0 0 
0 0 968.734 0 0 0 0 0 1954.02 0 0 0 1655.25 0 0 0 1524.78 0 1237.3 0 0 0 0 0 0 0 0 0 0 0 1012.07 0 0 0 0 0 0 0 0 0 0 0 0 0 1121.33 0 0 1670.35 0 0 0 0 0 0 0 0 0 1988.05 0 0 0 566.5 0 0 0.03 425.352 0 0 0 0 1256.98 0 0 -777.535 0 0 0 0 0 0 -1745.12 
0 0 0 0 0 0 0 0 0 0 0 0 -839.03 0 0 1056.93 0 0 0 -1936.02 0 0 0 1448.64 0 0 0 0 0 2205.04 -826.06 781.503 0 0 0 0 0 0 0 0 0 0 0 0 0 0 0 0 0 0 0 0 0 0 0 0 1913.28 0 0 0 0 0 0 0 -1829.51 0.03 0 0 0 0 0 0 358.669 0 0 147.328 0 0 0 0 0 
0 0 0 2156.67 0 0 0 0 0 0 0 0 791.421 0 0 0 0 0 0 0 0 0 0 0 0 0 0 930.128 0 0 0 0 0 0 0 0 0 0 0 0 0 0 0 0 0 0 0 0 0 0 2268.97 0 1014.82 0 0 0 0 0 0 0 0 0 0 880.688 0 0 0.06 0 0 -2030.32 0 -99.7192 0 0 0 -1116.29 0 0 0 0 0 
0 0 0 0 0 0 1869.79 0 0 0 0 0 0 0 0 0 0 0 0 2025.28 0 0 0 0 980.789 0 0 0 0 0 0 0 -197.073 0 0 0 0 0 0 1902.6 0 0 0 0 0 0 0 0 0 0 0 0 0 0 0 0 0 0 0 1122.7 0 0 0 0 0 0 0 0 0 0 0 0 -1455.5 0 0 0 0 0 0 0 0 
0 0 -929.212 -755.715 0 0 0 989.639 0 0 0 0 0 364.62 0 0 1081.5 2166.74 0 0 0 0 446.104 0 0 0 0 0 0 868.48 383.847 975.906 0 0 0 0 0 911.206 0 0 0 0 0 0 0 0 0 0 -2288.51 0 0 0 0 1237.3 0 0 0 0 0 0 0 0 0 0 0 0 0 0 0.09 0 0 0 0 0 -1178.4 1692.79 0 0 0 0 0 
0 0 0 0 0 0 1175.19 1757.64 0 0 0 0 0 0 0 -828.959 0 0 0 0 0 0 0 0 0 0 0 0 0 0 0 0 0 0 0 0 0 0 0 0 0 0 0 0 0 0 0 0 0 0 0 0 0 0 0 0 0 98.8037 0 2150.56 0 0 0 0 0 0 2254.78 0 0 0.02 0 0 0 0 0 0 0 0 0 0 0 
0 0 0 1232.72 0 2135.15 0 0 0 0 -447.172 0 0 0 0 0 -2227.77 0 0 0 0 0 0 0 0 0 0 0 0 -1363.8 0 0 0 0 0 0 0 0 0 0 0 723.365 -1653.87 0 0 0 0 0 0 0 0 0 -275.658 2378.54 0 0 0 0 0 0 0 0 0 0 2116.53 0 0 0 0 0 0.01 0 0 0 0 0 0 0 0 0 0 
0 0 0 0 -1568.27 0 0 0 0 0 0 0 0 0 0 521.943 297.174 0 0 0 0 0 0 0 776.925 0 0 0 0 0 0 0 0 0 0 0 0 0 0 0 0 0 -67.5222 0 0 0 0 0 2059.77 0 0 0 0 0 0 0 0 0 0 0 0 0 0 0 0 0 1679.66 0 0 0 0 0.08 0 0 0 0 -1603.37 0 0 0 0 
0 0 0 0 0 0 0 0 0 0 228.355 0 0 1328.09 544.374 0 0 477.081 -1532.56 0 0 0 0 1637.24 0 0 0 0 711.31 0 0 0 0 1939.53 2151.33 0 0 0 0 0 0 -457.701 2220.3 0 0 0 0 0 0 0 0 0 0 0 0 0 0 0 0 0 0 0 0 2392.73 0 -2225.49 0 1891 0 0 0 0 0.09 2104.33 0 -1586.58 0 0 0 -52.7207 0 
0 0 0 0 0 0 0 0 0 0 0 0 0 0 0 345.393 -2299.34 0 0 0 0 0 0 0 0 0 0 0 2492.52 0 0 0 0 -1577.27 0 0 0 1456.57 0 0 0 0 -1728.95 0 0 0 0 0 0 0 0 0 0 0 0 0 0 0 0 0 0 0 0 0 1990.04 0 0 0 0 0 0 0 530.793 0.04 0 0 0 0 0 0 0 
-2012.62 0 -1949.9 0 0 0 0 0 0 0 0 0 0 0 0 0 0 0 0 0 2247.76 0 0 0 0 0 0 0 0 0 1374.32 0 0 0 0 -589.084 0 0 0 -838.572 0 -2214.04 0 1375.39 -781.35 0 0 0 0 0 0 0 237.205 0 0 0 0 0 0 0 0 -55.9252 2112.87 0 0 0 0 0 1230.58 0 0 0 0 0 0.06 0 0 0 0 0 0 
2215.26 0 0 0 0 0 0 0 0 0 0 0 0 0 0 0 0 0 0 0 0 0 990.707 0 0 0 0 0 0 2065.87 0 0 0 0 0 0 0 0 0 0 0 0 0 0 0 0 0 0 0 0 0 0 0 0 0 0 1947.16 0 1391.11 0 0 0 0 0 0 -2396.24 -1730.93 0 1222.04 0 0 0 -190.207 0 0 0.01 0 0 0 0 0 
0 0 0 0 0 1667.3 868.328 0 0 0 0 0 0 0 0 0 0 0 0 0 0 0 1022.9 0 0 0 0 0 1827.68 0 0 0 0 0 0 0 0 0 0 0 0 0 0 0 0 0 0 0 0 0 0 0 0 -738.929 0 0 0 0 -67.6748 0 0 0 0 0 0 0 0 0 0 0 0 1207.69 0 0 0 0 0 0 0 0 0 
0 551.851 0 2104.79 0 0 1273.16 -364.772 0 0 0 0 0 0 0 787.149 0 0 0 0 0 2029.86 0 1505.4 0 0 0 0 0 0 0 0 0 0 -694.372 0 0 684.759 0 0 0 0 0 0 0 991.623 0 0 0 -1091.11 602.969 0 0 0 1722.08 0 0 0 0 0 0 0 -2442.32 0 0 0 0 0 0 0 0 0 0 0 0 0 0 0.03 0 0 0 
0 0 0 0 0 0 0 0 0 0 0 0 0 0 0 175.863 0 0 0 2469.33 0 0 0 -1675.24 1657.84 0 0 0 0 0 0 541.475 0 0 0 0 219.81 0 0 0 0 0 0 2397.61 0 0 0 0 0 0 821.635 0 0 -747.322 -2211.29 0 0 0 0 0 0 0 0 0 0 0 0 0 0 0 0 0 0 0 0 0 0 0 0.08 0 0 
0 0 0 0 0 0 0 0 0 0 0 0 0 0 0 0 0 0 0 0 -878.094 0 0 0 0 -209.738 0 0 0 -138.783 0 2230.98 0 0 0 0 0 0 0 -857.341 0 0 0 0 0 0 -759.224 0 2292.78 0 0 0 0 0 0 0 0 0 2137.9 0 0 0 0 0 0 0 0 0 0 0 0 0 -190.664 0 0 0 0 0 0 0.04 0 
0 -398.19 0 0 0 0 -1479.61 0 -706.122 0 0 0 0 1536.99 0 0 0 0 0 0 1188.31 0 0 0 0 0 0 2098.53 0 0 0 0 0 0 302.362 0 0 0 -325.556 0 0 0 0 0 0 0 0 0 0 0 0 0 -122.15 0 0 0 0 0 0 0 0 0 0 0 1531.65 0 0 0 0 0 0 0 0 0 0 0 0 0 0 0 0.05 
