*Vertices 36
*Matrix 
0.09 0 -1070.51 2274.47 0 0 0 0 0 0 0 0 0 0 0 0 1596.8 971.786 0 2051.68 1832.41 0 -966.445 0 1233.48 1733.53 0 0 0 0 0 2097.31 0 0 0 0 
0 0.06 0 0 0 0 0 0 0 1158.1 0 0 0 0 451.75 0 0 1047.62 0 0 0 0 0 0 0 1497.01 2188.1 0 0 0 -724.281 0 0 0 0 -1462.52 
1090.81 0 0.08 355.007 0 0 0 2196.65 -453.581 0 0 2096.55 1749.7 1505.55 0 0 0 0 0 0 0 0 0 1529.97 -65.5385 -289.087 0 0 0 0 2410.58 2365.41 0 0 0 0 
1136.13 0 -892.132 0.02 0 0 0 1345.03 0 0 0 0 0 0 0 286.035 0 0 0 0 0 0 0 550.325 0 0 0 0 0 0 0 0 0 0 0 0 
0 0 0 0 0.04 0 0 0 201.498 0 0 0 0 0 0 0 0 0 1496.4 0 336.695 0 0 0 0 0 0 0 -1211.36 0 0 2491.15 0 0 0 -1064.56 
0 0 0 0 0 0.04 0 0 0 0 0 0 1567.66 -2071.37 0 0 2321.31 0 2060.69 0 755.562 0 0 1636.17 -565.127 -611.667 0 104.144 483.337 0 0 0 0 0 0 0 
0 0 0 0 0 0 0.03 2084.34 0 0 0 172.964 2052.9 1215.32 0 0 0 0 0 0 0 957.9 0 0 0 0 0 0 0 0 0 0 0 0 0 0 
0 0 2349.7 -1574.98 0 0 1257.74 0.09 0 0 0 0 0 0 0 -1956.77 0 0 255.364 -237.663 0 1090.04 0 0 0 0 2125.54 0 0 159.841 0 1503.11 0 0 0 0 
0 0 -426.267 0 2476.2 0 0 0 0.07 0 0 0 -1917.4 0 0 0 0 0 0 0 0 0 1883.22 0 0 1235.01 0 0 0 0 0 100.024 0 0 0 0 
0 1431.24 0 0 0 0 0 0 0 0.05 0 0 0 1229.67 1874.68 0 593.814 492.798 0 0 971.633 2213.58 -145.955 0 0 75.6096 0 0 0 0 -1960.13 0 0 0 0 0 
0 0 0 0 0 0 0 0 0 0 0.09 0 0 1710.49 2331.23 0 0 0 0 0 0 1678.75 0 -215.69 -1369.44 0 0 0 0 1242.48 -1160.24 0 0 0 0 0 
0 0 1432.31 0 0 0 -272.912 0 0 0 0 0.09 0 0 0 870.922 -562.227 0 0 0 2123.55 1037.4 0 235.069 1826.61 0 0 0 0 0 0 -899.152 0 0 0 0 
0 0 -1339.84 0 0 1520.05 -500.122 0 168.233 0 0 0 0.09 0 374.538 2048.63 0 0 0 0 1700.11 2391.05 0 0 0 0 1334.8 -1189.99 0 -1201.9 0 -816.752 0 0 0 0 
0 0 709.632 0 0 2244.71 2485.5 0 0 580.844 199.515 0 0 0.06 678.808 0 2273.4 0 -500.122 0 0 0 0 0 234.458 -1819.44 0 -2465.36 0 0 0 0 0 0 1356.01 0 
0 1367.76 0 0 0 0 0 0 0 -881.451 -1298.33 0 778.756 2275.23 0.04 0 0 0 0 0 0 0 -1547.21 2283.47 585.727 496.765 0 0 -770.516 0 0 -2025.44 0 0 0 0 
0 0 0 1211.05 0 0 0 1230.28 0 0 0 2014.91 -2434.08 0 0 0.03 824.534 0 127.796 0 0 0 0 0 0 0 1241.11 332.728 0 314.112 0 0 0 0 0 0 
-875.5 0 0 0 0 1930.07 0 0 0 1460.23 0 1235.77 0 -1459.32 0 504.395 0.06 0 0 0 0 0 0 0 0 0 0 0 0 0 0 2458.65 0 0 0 0 
273.064 -1370.05 0 0 0 0 0 0 0 1298.18 0 0 0 0 0 0 0 0.03 0 0 0 0 0 0 0 0 1183.58 0 0 -1105.3 0 0 0 0 0 0 
0 0 0 0 2397.15 809.732 0 298.09 0 0 0 0 0 -1217.31 0 1337.86 0 0 0.05 -2148.43 0 0 0 0 0 0 0 0 2462.61 0 0 -994.522 -1662.11 0 0 0 
2241.97 0 0 0 0 0 0 -1118.43 0 0 0 0 0 0 0 0 0 0 2358.24 0.01 0 0 2002.4 -1436.58 0 0 0 1085.01 0 -1457.95 0 0 0 0 -2442.47 0 
-2002.55 0 0 0 1863.99 2045.27 0 0 0 -2342.83 0 -1322.6 -1162.07 0 0 0 0 0 0 0 0.02 1381.34 0 0 0 0 0 2427.67 -1325.95 1716.74 -779.824 0 0 0 0 0 
0 0 0 0 0 0 -1176.11 1894.36 0 2143.54 236.442 -810.495 -2480.93 0 0 0 0 0 0 0 848.643 0 0 0 2359 0 0 145.65 0 -1005.05 1265.22 0 0 0 0 0 
-1305.81 0 0 0 0 0 0 0 432.524 899.762 0 0 0 0 1742.23 0 0 0 0 -90.5637 0 0 0.08 0 0 0 0 -103.229 0 616.092 2112.11 -671.941 0 0 0 0 
0 0 -674.535 -597.171 0 1536.53 0 0 0 0 760.14 1745.43 0 0 1889.02 0 0 0 0 1524.93 0 0 0 0.06 0 0 0 0 -2202.29 0 0 0 0 -960.799 0 0 
1384.4 0 -1232.11 0 0 1984.08 0 0 0 0 661.26 661.26 0 659.581 1567.51 0 0 0 0 0 0 2341.91 0 0 0.07 0 0 -1081.35 0 0 206.381 0 0 0 0 0 
267.113 1353.27 -989.639 0 0 -1081.19 0 0 2035.51 -419.401 0 0 0 -880.078 2239.98 0 0 0 0 0 0 0 0 0 0 0.07 0 -801.035 0 0 0 0 0 -2213.58 0 0 
0 -512.024 0 0 0 0 0 -988.266 0 0 0 0 1600.77 0 0 2283.32 0 -275.048 0 0 0 0 0 0 0 0 0.04 0 0 0 0 2008.65 0 0 0 587.558 
0 0 0 0 0 1900.77 0 0 0 0 0 0 517.365 1227.53 0 -157.399 0 0 0 1288.42 2343.75 -1303.06 -1624.73 0 -1756.72 -1226.62 0 0.04 0 0 0 0 0 0 0 0 
0 0 0 0 1342.89 821.329 0 0 0 0 0 0 0 0 27.0852 0 0 0 -131.916 0 -510.804 0 0 -1587.8 0 0 0 0 0.02 2339.93 0 0 0 0 0 0 
0 0 0 0 0 0 0 -1878.95 0 0 -1355.56 0 2468.72 0 0 1242.79 0 1905.8 0 105.823 1340.6 833.384 -284.967 0 0 0 0 0 -2071.83 0.09 0 1302.45 0 -530.946 0 0 
0 1166.49 -1804.03 0 0 0 0 0 0 1896.8 2040.09 0 0 0 0 0 0 0 0 0 -2273.86 1842.48 -2322.38 0 1852.85 0 0 0 0 0 0.09 0 0 0 0 0 
2207.94 0 1892.07 0 -670.873 0 0 2284.54 -1880.93 0 0 2358.39 1124.23 0 384.762 0 1850.26 0 2048.94 0 0 0 -297.327 0 0 0 1356.78 0 0 -2453.31 0 0.09 0 0 500.58 0 
0 0 0 0 0 0 0 0 0 0 0 0 0 0 0 0 0 0 2172.23 0 0 0 0 0 0 0 0 0 0 0 0 0 0.03 0 0 0 
0 0 0 0 0 0 0 0 0 0 0 0 0 0 0 0 0 0 0 0 0 0 0 -1672.95 0 1554.69 0 0 0 238.121 0 0 0 0.09 0 0 
0 0 0 0 0 0 0 0 0 0 0 0 0 -610.599 0 0 0 0 0 950.27 0 0 0 0 0 0 0 0 0 0 0 940.352 0 0 0.09 0 
0 1781.29 0 0 977.432 0 0 0 0 0 0 0 0 0 0 0 0 0 0 0 0 0 0 0 0 0 932.722 0 0 0 0 0 0 0 0 0.09 
