*Vertices 59
*Matrix 
0.07 3.89111 0 0 0 0 0 -80.9503 1161.76 0 0 0 0 0 0 0 0 0 0 0 -1571.47 0 0 0 0 1245.23 0 0 0 0 0 1952.19 0 0 1253.62 -246.055 0 0 715.43 0 0 0 0 -2094.71 1631.75 1199.45 0 1610.23 0 0 0 0 -1114 0 0 0 0 117.267 0 
-1049.76 0.08 0 0 0 186.239 0 0 0 0 0 0 0 0 0 0 0 0 0 0 0 0 0 0 0 0 1371.88 0 0 0 0 1224.48 0 0 0 0 0 0 0 0 0 -1491.36 0 0 0 0 0 0 0 1435.82 0 0 0 0 -1486.33 1934.03 0 0 0 
0 0 0.07 0 0 0 0 0 0 2412.87 0 0 0 0 0 0 0 0 0 0 0 1035.72 0 0 0 0 0 0 1984.08 0 0 0 0 0 0 0 0 0 0 0 0 0 0 0 0 -285.119 0 0 -575.655 1491.06 0 2179.71 0 0 -586.337 1911.91 0 0 0 
0 0 0 0.03 0 0 0 0 0 913.648 0 0 0 0 -27.8481 0 1109.42 0 0 0 0 1098.13 0 0 0 0 0 0 0 -539.033 0 0 0 0 153.127 0 0 0 0 -254.601 0 0 0 0 0 0 0 0 1442.38 0 0 800.882 0 0 0 0 0 0 0 
0 0 0 0 0.08 0 0 0 0 0 0 0 0 1532.87 0 0 0 0 0 0 0 0 0 0 0 -1011.61 0 0 0 0 0 1870.25 0 0 0 0 0 -832.469 0 0 0 891.064 0 0 0 0 0 0 0 0 0 0 0 0 0 0 0 0 -839.946 
0 1756.26 0 0 0 0.04 0 -331.66 0 0 0 -1479.46 0 0 734.809 1070.67 0 0 0 524.689 0 0 0 0 0 0 0 0 0 0 0 0 0 0 0 0 0 0 -584.201 0 0 0 0 0 0 0 0 0 0 0 0 0 -1701.64 0 0 0 1322.44 0 0 
0 0 0 0 0 0 0.07 0 0 0 0 0 311.823 0 0 0 0 0 0 0 0 0 0 0 -1545.08 0 0 -1469.08 0 0 0 0 0 518.738 0 1034.2 0 0 0 0 -241.02 0 1795.48 926.008 0 0 0 0 0 0 0 0 -865.123 0 0 0 0 0 0 
2342.22 0 0 0 0 1054.34 0 0.07 0 0 0 0 0 0 0 0 0 -1679.2 0 1106.07 0 0 -131.916 0 0 0 0 0 0 0 0 0 0 0 0 0 0 0 0 0 0 0 0 0 0 0 0 0 0 0 0 0 0 -33.1889 0 0 0 0 0 
-613.804 0 0 0 0 0 0 0 0.02 0 0 0 0 0 0 0 1661.66 0 0 0 0 -817.362 0 0 0 0 0 0 0 -1279.11 0 0 0 0 0 -39.5978 0 0 2238.76 582.827 0 0 0 0 0 0 0 0 0 0 0 0 0 0 0 0 0 0 0 
0 0 -1317.87 2292.32 0 0 0 0 0 0.05 0 0 0 0 0 0 0 0 0 0 0 0 0 0 0 0 0 0 0 0 0 0 0 0 0 -836.894 0 0 -2137.44 0 0 0 0 0 0 0 2136.52 0 0 0 0 0 0 0 0 0 0 0 0 
0 0 0 0 0 0 0 0 0 0 0 0 0 0 0 0 0 0 0 0 0 0 0 0 0 0 0 0 0 0 0 -92.7 0 886.486 1901.53 0 1616.79 0 0 0 0 0 0 0 0 0 0 0 0 0 0 0 0 0 -2461.24 0 0 0 0 
0 0 0 0 0 2041 0 0 0 0 0 0.04 0 -319.452 0 -561.464 0 0 0 0 0 0 0 0 2452.39 0 0 0 0 0 0 0 0 0 0 0 0 0 0 0 0 0 0 0 0 0 0 1086.54 0 0 0 0 0 0 0 0 0 0 0 
0 0 0 0 0 0 170.37 0 0 0 0 0 0.07 0 0 0 0 0 0 0 107.044 1246.45 0 0 0 0 0 0 0 0 0 0 0 0 0 0 2224.11 0 0 0 0 0 0 0 617.313 1836.38 0 0 0 0 0 0 0 98.9563 0 0 0 0 0 
0 0 0 0 91.4792 0 0 0 0 0 0 449.156 0 0.03 1504.03 -864.208 0 0 0 0 0 0 0 0 0 193.564 0 0 148.549 0 0 0 0 0 0 0 0 -889.996 522.858 0 0 0 0 0 0 0 0 984.756 0 0 0 0 2401.58 0 0 0 0 0 0 
0 0 0 1951.28 0 1214.56 0 0 0 0 0 0 0 2003.92 0.09 0 0 0 0 0 0 0 0 0 0 0 0 0 0 0 0 1458.1 0 0 0 0 0 0 0 1737.19 0 0 0 0 0 0 0 1437.96 0 0 0 0 0 0 -885.571 0 0 0 0 
0 0 0 0 0 -1262.93 0 0 0 0 0 -940.046 0 45.8541 0 0.09 0 0 0 1587.04 0 0 0 0 -1322.9 2348.17 0 0 1721.47 0 0 0 429.014 0 1411.71 0 0 0 0 0 0 0 0 0 0 0 -453.276 0 0 0 0 0 0 0 0 0 0 0 0 
0 0 0 0.381481 0 0 0 0 586.184 0 0 0 0 0 0 0 0.08 0 0 0 0 0 0 378.964 0 0 1978.29 0 0 0 -14.1148 0 0 2444.3 0 0 0 2146.6 0 0 0 0 0 0 0 0 0 0 0 0 0 0 0 0 0 0 0 0 0 
0 0 0 0 0 0 0 -1862.01 0 0 0 0 0 0 0 0 0 0.09 0 0 0 -360.347 0 0 0 2347.25 0 0 0 0 0 0 0 1278.65 2327.27 2175.28 0 0 0 0 0 0 0 0 -75.6096 -2435.15 -1077.99 0 0 0 0 547.426 0 0 0 0 0 0 0 
0 0 0 0 0 0 0 0 0 0 0 0 0 0 0 0 0 0 0.02 0 0 0 1891.16 0 0 0 0 2030.78 0 0 0 0 0 0 0 0 -1275.14 0 0 0 0 0 0 0 0 0 0 0 0 2067.86 0 -201.346 0 0 0 0 0 0 0 
0 0 0 0 0 1729.71 0 2474.52 0 0 0 0 0 0 0 2346.95 0 0 0 0.06 0 -2313.99 0 -1506.16 -1755.65 0 407.956 0 0 0 0 0 0 0 0 0 -1131.4 2008.65 746.406 0 0 0 0 -1133.84 0 0 0 0 0 0 0 0 0 0 0 86.4437 0 0 0 
-184.561 0 0 0 0 0 0 0 0 0 0 0 1594.52 0 0 0 0 0 0 0 0.05 0 0 0 0 0 0 0 0 0 0 0 0 0 0 0 0 0 0 0 0 0 0 0 1487.7 0 0 0 -385.525 0 0 2311.55 1349.15 0 0 0 0 0 0 
0 0 -577.639 1701.64 0 0 0 0 89.0378 0 0 0 1526.46 0 0 0 0 -1135.21 0 1151.39 0 0.07 0 0 0 0 0 0 0 -392.697 0 0 -2185.2 0 0 0 1280.33 0 0 0 963.851 0 0 0 0 0 0 0 0 0 0 0 0 0 0 1104.69 0 0 0 
0 0 0 0 0 0 0 -764.565 0 0 0 0 0 0 0 0 0 0 1755.65 0 0 0 0.03 0 267.418 0 801.95 0 0 0 0 0 1353.27 -2216.94 0 0 2089.98 0 0 0 0 0 0 0 0 0 -1998.28 0 0 0 0 0 0 0 0 0 0 0 0 
0 0 0 0 0 0 0 0 0 0 0 0 0 0 0 0 -787.912 0 0 -2346.19 0 0 0 0.06 0 0 0 -1172.75 2291.25 0 0 0 0 0 0 0 0 0 0 0 -644.475 1336.02 0 2056.57 0 0 1498.54 0 0 0 0 0 -1486.48 0 0 0 0 0 0 
0 0 0 0 0 0 2330.47 0 0 0 0 2076.1 0 0 0 969.802 0 0 0 -487.915 0 0 257.042 0 0.09 0 0 0 0 0 0 0 0 0 0 0 0 0 0 0 0 0 0 933.943 2335.96 0 0 0 0 -400.174 0 0 0 0 0 0 0 0 0 
2438.66 0 0 0 -1622.44 0 0 0 0 0 0 0 0 -1245.84 0 1950.21 0 1149.86 0 0 0 0 0 0 0 0.07 0 0 0 0 0 0 1653.42 0 2192.83 0 0 0 0 0 0 2275.23 0 0 0 0 0 0 0 2449.8 0 0 0 1847.51 0 0 0 0 0 
0 -1590.7 0 0 0 0 0 0 0 0 0 0 0 0 0 0 1433.53 0 0 1245.69 0 0 272.301 0 0 0 0.06 0 0 0 0 0 0 1843.55 0 0 0 0 0 0 0 0 0 -1931.29 1541.11 -1364.71 0 0 0 0 0 -1308.71 0 1359.98 0 0 0 0 0 
0 0 0 0 0 0 -1836.83 0 0 0 0 0 0 0 0 0 0 0 -520.722 0 0 0 0 -583.285 0 0 0 0.01 0 0 0 0 0 0 0 0 2084.8 0 0 0 0 0 0 0 0 0 0 0 0 0 1901.07 0 0 0 0 2184.74 0 0 0 
0 0 -2472.53 0 0 0 0 0 0 0 0 0 0 -1237.45 0 1662.27 0 0 0 0 0 0 0 1568.12 0 0 0 0 0.08 0 0 0 0 0 0 0 0 2263.02 0 0 0 0 -252.007 0 0 0 -1442.84 -1005.97 681.402 0 0 1931.44 0 0 0 660.039 0 0 0 
0 0 0 1363.34 0 0 0 0 -1622.29 0 0 0 0 0 0 0 0 0 0 0 0 1790.29 0 0 0 0 0 0 0 0 0 0 0 0 0 0 2016.59 0 -2409.67 0 0 -330.287 0 0 1250.11 0 0 0 0 0 0 0 0 0 0 0 0 0 0 
0 0 0 0 0 0 0 0 0 0 0 0 0 0 0 0 858.104 0 0 0 0 0 0 0 0 0 0 0 0 0 0.05 0 0 0 0 0 0 0 0 0 0 1652.65 627.995 0 0 0 0 0 0 0 0 0 0 -2320.55 664.922 0 0 0 0 
-2179.86 -1167.87 0 0 1442.38 0 0 0 0 0 720.618 0 0 0 2487.95 0 0 0 0 0 0 0 0 0 0 0 0 0 0 0 0 0.04 0 0 0 0 0 0 0 0 0 0 0 0 0 0 0 0 0 0 0 0 0 2389.07 -826.365 0 0 0 0 
0 0 0 0 0 0 0 0 0 0 0 0 0 0 0 895.337 0 0 0 0 0 -1041.37 1178.09 0 0 -2095.17 0 0 0 0 0 0 0.04 0 0 0 0 0 0 1924.27 0 -1761.45 0 0 0 0 -39.903 0 0 0 1785.56 0 0 0 0 0 0 0 0 
0 0 0 0 0 0 2440.03 0 0 0 -305.567 0 0 0 0 0 469.909 -1156.58 0 0 0 0 361.263 0 0 0 2204.28 0 0 0 0 0 0 0.04 0 0 0 0 0 0 0 0 0 0 -1044.72 0 0 0 0 0 0 889.233 0 0 0 0 0 0 0 
-2065.11 0 0 -1115.99 0 0 0 0 0 0 -1471.53 0 0 0 0 741.066 0 1869.03 0 0 0 0 0 0 0 2454.68 0 0 0 0 0 0 0 0 0.06 0 0 0 0 0 0 0 0 0 0 0 0 0 0 0 0 0 1992.48 0 0 0 0 0 0 
2322.38 0 0 0 0 0 805.918 0 458.617 630.131 0 0 0 0 0 0 0 639.744 0 0 0 0 0 0 0 0 0 0 0 0 0 0 0 0 0 0 0 0 948.439 0 0 0 0 0 1192.43 0 0 0 0 0 0 0 0 0 0 0 0 0 0 
0 0 0 0 0 0 0 0 0 0 2485.05 0 1323.05 0 0 0 0 0 1870.1 1440.86 0 -951.796 2069.08 0 0 0 0 -1369.29 0 -630.741 0 0 0 0 0 0 0.05 0 0 0 0 1496.55 0 0 0 0 0 757.851 0 0 0 0 873.058 0 0 1395.69 0 0 0 
0 0 0 0 -754.341 0 0 0 0 0 0 0 0 1856.82 0 0 894.421 0 0 1005.36 0 0 0 0 0 0 0 0 -464.263 0 0 0 0 0 0 0 0 0.08 0 0 0 0 0 0 0 0 0 0 0 0 0 0 0 0 0 0 0 0 0 
1125.6 0 0 0 0 2459.87 0 0 87.5118 1710.64 0 0 0 -1564.46 0 0 0 0 0 156.331 0 0 0 0 0 0 0 0 0 577.792 0 0 0 0 0 -2145.68 0 0 0.03 0 0 0 -2330.93 0 0 0 0 0 1495.48 0 0 0 0 0 0 0 0 0 0 
0 0 0 2086.02 0 0 0 0 1254.54 0 0 0 0 0 -321.436 0 0 0 0 0 0 0 0 0 0 0 0 0 0 0 0 0 1019.55 0 0 0 0 0 0 0.06 0 0 0 0 2043.14 0 0 90.4111 0 0 0 0 0 0 0 -334.712 0 0 0 
0 0 0 0 0 0 2257.38 0 0 0 0 0 0 0 0 0 0 0 0 0 0 1747.11 0 1882 0 0 0 0 0 0 0 0 0 0 0 0 0 0 0 0 0.06 745.186 0 0 0 0 0 0 0 0 0 0 0 0 0 0 0 0 0 
0 1661.2 0 0 2291.56 0 0 0 0 0 0 0 0 0 0 0 0 0 0 0 0 0 0 938.673 0 -1184.65 0 0 0 -912.122 -425.199 0 103.381 0 0 0 2406 0 0 0 917.005 0.04 0 -992.996 0 0 0 0 0 0 0 0 -1717.51 0 0 0 0 0 0 
0 0 0 0 0 0 1134.3 0 0 0 0 0 0 0 0 0 0 0 0 0 0 0 0 0 0 0 0 0 -237.053 0 669.958 0 0 0 0 0 0 0 361.721 0 0 0 0.03 0 0 0 1856.67 0 0 0 0 0 0 0 0 0 0 0 0 
2371.21 0 0 0 0 0 -882.061 0 0 0 0 0 0 0 0 0 0 0 0 1983.47 0 0 0 -1376.92 582.827 0 -1990.65 0 0 0 0 0 0 0 0 0 0 0 0 0 0 798.898 0 0.05 0 493.866 0 0 0 0 0 0 0 0 0 0 0 0 0 
836.283 0 0 0 0 0 0 0 0 0 0 0 -1792.43 0 0 0 0 2449.64 0 0 691.168 0 0 0 -1328.39 0 -836.894 0 0 1446.2 0 0 0 1749.55 0 2484.13 0 0 0 1918.62 0 0 0 0 0.05 0 0 0 0 0 0 0 0 1264.92 0 0 0 0 0 
2170.86 0 -1306.88 0 0 0 0 0 0 0 0 0 282.067 0 0 0 0 1781.75 0 0 0 0 0 0 0 0 -1957.53 0 0 0 0 0 0 0 0 0 0 0 0 0 0 0 0 2037.95 0 0.05 -1901.07 0 0 0 0 0 1980.27 0 0 0 0 0 0 
0 0 0 0 0 0 0 0 0 880.993 0 0 0 0 0 1287.65 0 689.795 0 0 0 0 485.473 555.208 0 0 0 0 710.242 0 0 0 -1025.19 0 0 0 0 0 0 0 0 0 551.241 0 0 545.595 0.07 0 1897.11 0 0 1668.22 0 0 0 0 0 0 0 
127.338 0 0 0 0 0 0 0 0 0 0 -291.07 0 1881.24 -599.307 0 0 0 0 0 0 0 0 0 0 0 0 0 1920.76 0 0 0 0 0 0 0 2104.02 0 0 -766.701 0 0 0 0 0 0 0 0.06 2184.9 0 0 0 -42.1918 0 0 0 0 0 0 
0 0 -49.3637 2409.36 0 0 0 0 0 0 0 0 0 0 0 0 0 0 0 0 632.725 0 0 0 0 0 0 0 1755.04 0 0 0 0 0 0 0 0 0 384.152 0 0 0 0 0 0 0 1219.44 1157.19 0.03 -2422.33 0 0 0 0 0 0 0 0 0 
0 203.94 -1036.18 0 0 0 0 0 0 0 0 0 0 0 0 0 0 0 -131.458 0 0 0 0 0 1686.53 2256 0 0 0 0 0 0 0 0 0 0 0 0 0 0 0 0 0 0 0 0 0 0 149.159 0.02 0 0 0 0 -682.775 0 0 0 0 
0 0 0 0 0 0 0 0 0 0 0 0 0 0 0 0 0 0 0 0 0 0 0 0 0 0 0 667.211 0 0 0 0 1265.53 0 0 0 0 0 0 0 0 0 0 0 0 0 0 0 0 0 0.05 0 0 0 0 0 0 0 0 
0 0 -1380.58 2477.26 0 0 0 0 0 0 0 0 0 0 0 0 0 -499.664 -202.261 0 513.398 0 0 0 0 0 1966.38 0 1084.86 0 0 0 0 368.587 0 0 0 0 0 0 0 0 0 0 0 0 1784.49 0 0 0 0 0.02 0 0 0 -1300.32 0 0 0 
843.15 0 0 0 0 1155.51 839.335 0 0 0 0 0 0 -924.482 0 0 0 0 0 0 269.25 0 0 526.215 0 0 0 0 0 0 0 0 0 0 1281.4 0 931.349 0 0 0 0 501.495 0 0 0 -1281.85 0 -1089.89 0 0 0 0 0 0 0 0 0 0 0 
0 0 0 0 0 0 0 -820.109 0 0 0 0 -748.543 0 0 0 0 0 0 0 0 0 0 0 0 -2169.48 1784.95 0 0 0 2328.49 1187.7 0 0 0 0 0 0 0 0 0 0 0 0 2428.59 0 0 0 0 0 0 0 0 0.05 0 1386.38 0 0 0 
0 1590.24 -2455.14 0 0 0 0 0 0 0 2403.71 0 0 0 -2292.32 0 0 0 0 0 0 0 0 0 0 0 0 0 0 0 -800.882 1803.57 0 0 0 0 0 0 0 0 0 0 0 0 0 0 0 0 0 1337.09 0 0 0 0 0.09 -418.943 0 0 0 
0 47.38 -1252.25 0 0 0 0 0 0 0 0 0 0 0 0 0 0 0 0 648.747 0 -394.681 0 0 0 0 0 910.138 589.236 0 0 0 0 0 0 0 2093.04 0 0 -2426.6 0 0 0 0 0 0 0 0 0 0 0 220.267 0 -700.323 1767.25 0.06 0 0 0 
0 0 0 0 0 1580.48 0 0 0 0 0 0 0 0 0 0 0 0 0 0 0 0 0 0 0 0 0 0 0 0 0 0 0 0 0 0 0 0 0 0 0 0 0 0 0 0 0 0 0 0 0 0 0 0 0 0 0.01 0 0 
716.346 0 0 0 0 0 0 0 0 0 0 0 0 0 0 0 0 0 0 0 0 0 0 0 0 0 0 0 0 0 0 0 0 0 0 0 0 0 0 0 0 0 0 0 0 0 0 0 0 0 0 0 0 0 0 0 0 0.05 0 
0 0 0 0 1034.2 0 0 0 0 0 0 0 0 0 0 0 0 0 0 0 0 0 0 0 0 0 0 0 0 0 0 0 0 0 0 0 0 0 0 0 0 0 0 0 0 0 0 0 0 0 0 0 0 0 0 0 0 0 0.01 
