*Vertices 39
*Matrix 
0.01 0 841.014 0 0 0 1663.79 0 0 0 1336.33 -2128.28 0 1576.66 0 0 0 0 0 0 650.273 0 1633.43 2154.99 0 0 0 0 0 0 0 0 0 0 0 0 0 -1488.46 0 
0 0.01 0 1370.51 1182.06 0 0 0 0 0 0 -1676.61 0 0 0 0 0 0 0 0 0 0 0 0 0 0 0 0 0 0 0 0 2098.99 0 0 1691.26 0 0 0 
1356.01 0 0.01 1122.39 0 0 254.143 0 1610.23 0 0 0 0 0 0 0 0 0 -1319.39 0 1241.26 0 0 -1933.12 0 0 0 0 0 0 1401.33 0 0 0 0 0 0 0 0 
0 471.587 477.386 0.06 0 0 1580.48 0 0 0 0 0 0 0 0 0 0 -697.119 329.524 0 0 0 0 0 0 0 0 -1226.92 0 0 0 0 0 0 0 0 0 0 0 
0 2035.51 0 0 0.04 0 0 0 1116.6 0 0 0 1795.18 0 341.731 0 0 0 -1446.96 0 0 0 0 0 0 0 0 0 0 0 1592.23 0 0 0 0 0 0 0 0 
0 0 0 0 0 0.06 0 0 0 0 0 0 0 0 0 0 0 -560.549 0 0 0 0 0 0 0 0 0 -604.19 0 0 0 0 -122.456 -717.719 0 2420.8 0 0 -147.633 
829.875 0 -338.527 1709.72 0 0 0.04 0 0 0 717.414 745.033 0 0 -1191.52 0 0 0 0 0 0 0 0 0 0 0 0 0 0 -1916.94 1511.2 0 0 0 0 0 286.34 0 0 
0 0 0 0 0 0 0 0.02 0 2430.11 1414.46 0 1511.66 0 0 0 0 0 0 0 0 0 0 0 0 0 0 0 0 0 0 0 0 0 0 0 1755.2 0 0 
0 0 454.039 0 1095.84 0 0 0 0.02 1751.38 0 0 0 0 0 0 0 0 0 0 0 0 0 0 0 0 0 0 0 0 0 0 0 0 0 0 0 0 0 
0 0 0 0 0 0 0 361.568 1778.24 0.06 1598.79 2087.54 0 0 0 0 -1028.7 0 0 0 0 0 0 0 0 0 0 0 0 0 0 0 0 0 0 0 0 0 0 
-1206.02 0 0 0 0 0 439.695 953.932 0 423.215 0.02 2243.34 1009.48 0 0 0 0 0 0 2297.81 2179.86 0 0 0 0 0 1113.39 0 0 0 0 0 0 0 0 0 0 0 0 
1967.6 -1399.66 0 0 0 0 2095.78 0 0 -283.288 -1151.69 0.08 0 -348.14 0 0 0 0 488.525 0 0 1435.97 0 0 0 0 0 0 0 -250.328 0 0 0 0 0 0 0 0 0 
0 0 0 0 -595.34 0 0 1999.34 0 0 1632.21 0 0.08 1743.9 0 0 0 0 0 0 0 0 0 2301.17 0 0 1675.08 0 -1005.36 0 0 287.866 0 0 0 0 0 0 0 
1473.82 0 0 0 0 0 0 0 0 0 0 2172.69 1873.61 0.07 0 -1373.41 1736.73 0 0 0 0 0 0 0 0 0 0 0 0 0 0 0 0 0 0 0 0 490.509 0 
0 0 0 0 267.724 0 2395.02 0 0 0 0 0 0 0 0.04 0 0 0 0 2276.76 0 0 0 0 1063.49 0 0 0 0 0 0 1418.12 0 0 0 -1944.26 462.737 -1206.47 0 
0 0 0 0 0 0 0 0 0 0 0 0 0 -266.045 0 0.06 0 0 0 0 0 0 0 0 0 259.636 0 0 0 0 0 0 0 0 0 0 1505.4 910.749 0 
0 0 0 0 0 0 0 0 0 -50.8896 0 0 0 1347.77 0 0 0.02 0 0 0 0 0 0 0 1636.02 0 0 0 0 0 0 -1480.53 0 0 0 0 0 0 0 
0 0 0 1916.79 0 1248.89 0 0 0 0 0 0 0 0 0 0 0 0.08 0 1366.39 0 1480.22 0 0 -1736.58 0 0 -295.953 0 0 0 0 0 0 0 0 0 0 0 
0 0 1772.29 1782.82 745.643 0 0 0 0 0 0 2388.15 0 0 0 0 0 0 0.07 0 0 1258.2 0 0 0 0 -1852.7 0 1593.6 912.58 0 0 0 0 0 0 0 735.725 1067.16 
0 0 0 0 0 0 0 0 0 0 2041.92 0 0 0 334.712 0 0 1625.49 0 0.06 0 0 353.633 0 0 0 0 0 0 0 0 0 0 0 0 0 0 0 0 
2104.94 0 -1021.53 0 0 0 0 0 0 0 1034.65 0 0 0 0 0 0 0 0 0 0.08 0 0 0 0 2128.44 0 0 1044.27 0 1825.85 0 0 0 0 0 0 0 0 
0 0 0 0 0 0 0 0 0 0 0 -1754.13 0 0 0 0 0 2098.38 -1051.29 0 0 0.01 0 0 0 0 0 0 0 0 0 2020.4 0 0 0 0 0 0 0 
2423.7 0 0 0 0 0 0 0 0 0 0 0 0 0 0 0 0 0 0 2220.45 0 0 0.02 0 0 0 0 0 0 0 0 0 0 0 0 0 0 0 0 
1517 0 -1234.86 0 0 0 0 0 0 0 0 0 332.118 0 0 0 0 0 0 0 0 0 0 0.03 0 0 0 0 0 0 0 0 0 0 0 0 0 0 0 
0 0 0 0 0 0 0 0 0 0 0 0 0 0 1977.83 0 -628.91 1477.17 0 0 0 0 0 0 0.04 0 0 0 0 169.301 0 0 0 -2269.74 0 0 0 0 0 
0 0 0 0 0 0 0 0 0 0 0 0 0 0 0 1575.14 0 0 0 0 645.695 0 0 0 0 0.09 0 0 0 0 0 0 0 0 0 -960.494 1312.07 0 0 
0 0 0 0 0 0 0 0 0 0 832.316 0 893.201 0 0 0 0 0 2223.96 0 0 0 0 0 0 0 0.06 0 1715.22 0 0 0 0 0 811.411 0 0 0 0 
0 0 0 2083.27 0 -2030.78 0 0 0 0 0 0 0 0 0 0 0 380.795 0 0 0 0 0 0 0 0 0 0.06 0 0 0 0 0 0 0 0 0 0 0 
0 0 0 0 0 0 0 0 0 0 0 0 1109.12 0 0 0 0 0 374.996 0 -419.553 0 0 0 0 0 -1067.46 0 0 0 0 0 0 0 1610.08 0 0 0 0 
0 0 0 0 0 0 2030.63 0 0 0 0 928.602 0 0 0 0 0 0 759.835 0 0 0 0 0 514.008 0 0 0 0 0.02 0 0 0 0 0 0 0 0 0 
0 0 -85.8333 0 2103.87 0 1050.22 0 0 0 0 0 0 0 0 0 0 0 0 0 1064.56 0 0 0 0 0 0 0 0 0 0.01 0 2434.39 0 0 0 493.103 0 0 
0 0 0 0 0 0 0 0 0 0 0 0 -120.319 0 1524.63 0 1128.96 0 0 0 0 2329.55 0 0 0 0 0 0 0 0 0 0.02 0 0 -1103.47 0 0 0 0 
0 1754.74 0 0 0 411.161 0 0 0 0 0 0 0 0 0 0 0 0 0 0 0 0 0 0 0 0 0 0 0 0 -207.602 0 0.03 0 0 0 0 750.984 654.393 
0 0 0 0 0 2452.85 0 0 0 0 0 0 0 0 0 0 0 0 0 0 0 0 0 0 1115.99 0 0 0 0 0 0 0 0 0.07 0 0 0 0 0 
0 0 0 0 0 0 0 0 0 0 0 0 0 0 0 0 0 0 0 0 0 0 0 0 0 0 1364.56 0 587.252 0 0 1854.69 0 0 0.05 0 0 0 0 
0 1575.9 0 0 0 1758.86 0 0 0 0 0 0 0 0 2151.02 0 0 0 0 0 0 0 0 0 0 784.097 0 0 0 0 0 0 0 0 0 0.08 -848.643 0 -2413.17 
0 0 0 0 0 0 1112.63 1011 0 0 0 0 0 0 1999.8 -839.03 0 0 0 0 0 0 0 0 0 1995.22 0 0 0 0 -1735.21 0 0 0 0 1168.02 0.07 0 0 
-121.082 0 0 0 0 0 0 0 0 0 0 0 0 1583.53 1880.47 -190.512 0 0 1430.33 0 0 0 0 0 0 0 0 0 0 0 0 0 -250.328 0 0 0 0 0 0 
0 0 0 0 0 1726.2 0 0 0 0 0 0 0 0 0 0 0 0 1273.16 0 0 0 0 0 0 0 0 0 0 0 0 0 -1804.03 0 0 2291.86 0 0 0.04 
