*Vertices 42
*Matrix 
0.04 0 0 0 -869.091 0 0 741.829 0 0 -552.461 0 0 0 972.243 0 868.023 0 0 0 0 0 0 0 0 0 0 0 -351.802 0 0 -55.1622 0 0 0 0 0 0 2025.74 0 0 0 
0 0 0 0 0 2456.51 0 0 0 0 610.904 0 1202.81 0 2470.55 259.331 0 0 0 -2457.12 0 0 0 0 1403.32 0 0 0 0 0 0 0 0 0 0 0 0 0 0 0 0 0 
0 0 0.06 0 0 0 -109.485 0 0 0 -1943.49 0 2457.73 0 0 2262.72 0 1211.05 0 0 0 0 0 0 0 0 0 0 0 0 0 0 0 0 0 0 0 0 0 0 0 0 
0 0 0 0.02 -542.848 0 0 1035.42 0 0 0 0 0 0 0 0 0 987.96 -600.528 0 1127.74 0 0 0 0 0 0 0 0 0 0 0 0 0 0 0 0 0 0 0 0 0 
1294.21 0 0 -820.872 0.08 0 0 0 0 0 1018.02 1412.63 0 0 0 0 0 0 887.707 0 0 0 0 0 0 -36.6985 0 0 0 0 0 0 -664.922 0 0 0 0 0 0 0 0 0 
0 1065.17 0 0 0 0.07 0 0 0 0 0 0 0 0 2196.95 0 0 0 0 0 0 0 0 0 310.755 0 -1176.72 0 0 0 0 2006.21 0 -246.513 0 0 0 0 -1402.4 0 0 2471.62 
0 0 1712.93 0 0 0 0.02 0 0 0 1802.65 1886.43 0 0 0 0 0 0 -2034.14 0 0 0 0 0 -26.1696 0 0 0 0 0 0 0 0 0 0 0 0 0 -1729.41 0 0 2169.64 
53.4837 0 0 2015.98 0 0 0 0.06 0 0 0 0 0 0 0 2334.59 0 0 0 0 0 0 0 0 0 0 0 0 0 0 0 0 0 0 0 0 -883.892 0 0 -1642.89 0 0 
0 0 0 0 0 0 0 0 0.09 0 0 2446.29 1436.74 -723.67 949.355 1028.24 1229.67 0 -64.6229 0 0 0 0 0 0 0 0 0 0 0 0 0 0 0 0 0 0 0 0 0 0 0 
0 0 0 0 0 0 0 0 0 0.01 0 0 2395.63 0 0 1963.03 0 1202.96 2299.8 0 0 0 0 0 0 0 0 0 0 1682.26 0 0 0 0 0 0 2024.06 -1026.11 0 -1519.59 0 0 
1499.6 -1786.17 -1215.48 0 1871.93 0 1954.18 0 0 0 0.01 0 0 0 1320.76 924.635 0 0 -582.522 -265.282 0 0 0 0 0 0 0 0 0 0 0 0 0 0 0 0 0 0 0 0 0 0 
0 0 0 0 974.075 0 -2030.47 0 1252.86 0 0 0.09 2362.51 2125.54 0 -255.974 2118.82 0 -967.055 0 0 0 0 0 0 0 0 0 0 0 0 0 0 0 0 0 0 0 0 0 0 0 
0 1095.84 -1910.08 0 0 0 0 0 418.943 2285.15 0 2301.78 0.01 0 0 0 0 2167.65 0 0 -1939.53 0 0 0 0 0 0 0 0 0 0 0 -832.469 0 -117.115 0 0 0 0 0 0 0 
0 0 0 0 0 0 0 0 792.795 0 0 889.843 0 0.09 600.07 -146.87 0 0 -361.415 0 0 0 0 0 0 0 0 0 0 0 0 0 0 0 0 0 0 820.872 0 0 0 0 
2329.1 2411.5 0 0 0 1203.42 0 0 510.498 0 979.11 0 0 -413.449 0.06 0 0 0 0 0 0 0 0 0 0 0 0 0 0 0 0 0 0 0 0 0 0 0 0 0 -401.7 0 
0 -1629.76 2122.18 0 0 0 0 694.067 -1233.02 2192.68 -1640.6 211.417 0 1138.72 0 0.07 2123.1 0 -491.577 0 0 0 0 0 0 0 0 0 0 0 0 0 0 0 0 0 0 0 0 0 0 0 
-591.678 0 0 0 0 0 0 0 2374.26 0 0 1329.31 0 0 0 1075.85 0.02 0 1582.16 0 0 0 0 0 0 -1811.5 795.236 0 0 1538.51 -983.993 0 0 0 0 1099.81 0 0 0 0 0 0 
0 0 475.86 1482.51 0 0 0 0 0 -696.356 0 0 1259.12 0 0 0 0 0.07 0 -705.969 0 0 0 0 0 0 0 0 0 0 0 634.556 1795.18 291.528 0 0 0 0 0 0 0 0 
0 0 0 288.629 -1837.75 0 2454.07 0 1826.15 284.356 2332.3 1331.29 0 -2053.06 0 1385.46 -179.678 0 0.02 0 -1512.88 0 0 0 0 0 0 0 1971.72 0 0 0 0 0 0 0 -2308.65 0 0 0 0 0 
0 2419.58 0 0 0 0 0 0 0 0 -322.81 0 0 0 0 0 0 1167.56 0 0 0 0 0 0 0 0 0 -1000.47 0 -149.464 0 0 0 0 0 0 1843.55 215.232 0 0 40.3607 0 
0 0 0 1252.25 0 0 0 0 0 0 0 0 375.759 0 0 0 0 0 -2009.57 0 0.03 0 0 0 1370.66 0 0 0 0 0 0 -1197.62 0 0 2360.68 0 0 0 -471.74 0 0 325.098 
0 0 0 0 0 0 0 0 0 0 0 0 0 0 0 0 0 0 0 0 0 0.09 0 1283.38 0 0 0 0 0 0 0 -1353.88 0 2205.04 0 0 0 0 0 0 0 0 
0 0 0 0 0 0 0 0 0 0 0 0 0 0 0 0 0 0 0 0 0 0 0.04 977.737 0 -1412.17 -706.275 889.691 0 0 0 0 0 0 0 2339.01 0 -1904.58 0 -138.325 -469.604 -543.306 
0 0 0 0 0 0 0 0 0 0 0 0 0 0 0 0 0 0 0 0 0 1915.11 2166.43 0.06 0 0 0 0 0 0 0 0 -1142.69 0 0 0 0 0 0 0 0 0 
0 697.424 0 0 0 724.738 636.692 0 0 0 0 0 0 0 0 0 0 0 0 0 65.2333 0 0 0 0.08 0 0 0 0 0 0 0 0 0 1933.73 0 0 0 1194.88 0 0 0 
0 0 0 0 1853.77 0 0 0 0 0 0 0 0 0 0 0 2362.51 0 0 0 0 0 1514.4 0 0 0.01 0 0 0 0 0 0 0 -2207.94 0 0 0 0 0 0 0 0 
0 0 0 0 0 1132.92 0 0 0 0 0 0 0 0 0 0 2135.91 0 0 0 0 0 -1476.41 0 0 0 0 0 0 0 0 0 0 0 0 0 230.491 0 0 0 0 0 
0 0 0 0 0 0 0 0 0 0 0 0 0 0 0 0 0 0 0 2279.2 0 0 -967.208 0 0 0 0 0 0 0 0 0 0 0 0 0 0 0 0 0 0 0 
1879.1 0 0 0 0 0 0 0 0 0 0 0 0 0 0 0 0 0 1582.16 0 0 0 0 0 0 0 0 0 0.09 0 0 0 0 0 0 0 0 0 0 0 0 0 
0 0 0 0 0 0 0 0 0 1423 0 0 0 0 0 0 1679.97 0 0 -200.125 0 0 0 0 0 0 0 0 0 0.01 0 0 0 0 0 1528.6 0 0 0 0 0 1326.11 
0 0 0 0 0 0 0 0 0 0 0 0 0 0 0 0 1180.99 0 0 0 0 0 0 0 0 0 0 0 0 0 0.03 0 0 0 0 0 0 0 0 0 0 0 
2094.1 0 0 0 0 1258.81 0 0 0 0 0 0 0 0 0 0 0 -1807.23 0 0 1221.12 -22.66 0 0 0 0 0 0 0 0 0 0.05 0 0 0 0 0 0 0 0 0 0 
0 0 0 0 1764.5 0 0 0 0 0 0 0 -2087.08 0 0 0 0 2452.54 0 0 0 0 0 1939.99 0 0 0 0 0 0 0 0 0.07 0 0 0 0 0 0 0 0 0 
0 0 0 0 0 655.461 0 0 0 0 0 0 0 0 0 0 0 -492.187 0 0 0 2194.97 0 0 0 1013.14 0 0 0 0 0 0 0 0 0 0 0 0 0 0 0 0 
0 0 0 0 0 0 0 0 0 0 0 0 1013.75 0 0 0 0 0 0 0 1321.07 0 0 0 2006.21 0 0 0 0 0 0 0 0 0 0.02 2187.34 0 1769.08 1533.33 0 0 -557.955 
0 0 0 0 0 0 0 0 0 0 0 0 0 0 0 0 2046.65 0 0 0 0 0 -1079.21 0 0 0 0 0 0 1699.04 0 0 0 0 2077.32 0.05 0 0 0 0 0 0 
0 0 0 0 0 0 0 1655.86 0 1965.01 0 0 0 0 0 0 0 0 237.205 1852.7 0 0 0 0 0 0 -2013.99 0 0 0 0 0 0 0 0 0 0.08 0 0 0 0 0 
0 0 0 0 0 0 0 0 0 2259.06 0 0 0 -445.189 0 0 0 0 0 425.199 0 0 1425.9 0 0 0 0 0 0 0 0 0 0 0 -2438.35 0 0 0.09 0 0 1924.57 0 
-118.336 0 0 0 0 -403.226 -900.983 0 0 0 0 0 0 0 0 0 0 0 0 0 1096.91 0 0 0 2310.63 0 0 0 0 0 0 0 0 0 -521.485 0 0 0 0.09 0 0 0 
0 0 0 0 0 0 0 734.199 0 826.212 0 0 0 0 0 0 0 0 0 0 0 0 749.763 0 0 0 0 0 0 0 0 0 0 0 0 0 0 0 0 0.08 2316.58 0 
0 0 0 0 0 0 0 0 0 0 0 0 0 0 669.805 0 0 0 0 1135.06 0 0 1638.46 0 0 0 0 0 0 0 0 0 0 0 0 0 0 2229.91 0 -805.307 0.05 1610.08 
0 0 0 0 0 -1497.01 -556.581 0 0 0 0 0 0 0 0 0 0 0 0 0 2305.9 0 1037.1 0 0 0 0 0 0 550.325 0 0 0 0 1669.9 0 0 0 0 0 2494.51 0.08 
