*Vertices 68
*Matrix 
0.09 1817.91 0 1759.62 1270.1 0 2312.62 0 1761.45 0 0 0 0 0 0 0 0 0 0 0 0 -839.946 0 0 -1289.18 0 0 0 0 0 0 0 0 0 0 0 0 0 0 583.438 0 0 0 0 0 718.635 2219.08 0 1658.76 0 0 0 0 0 0 0 0 0 1647.92 0 0 0 0 0 0 0 0 0 
-398.801 0.07 0 0 -1864.76 0 0 1570.71 -207.45 0 0 0 485.473 0 0 0 0 0 0 0 748.695 0 0 0 1450.93 0 0 0 0 0 -613.041 0 0 0 1519.44 0 1936.17 266.35 1366.39 0 443.51 0 0 0 0 0 0 665.075 0 -1679.82 0 0 0 0 0 0 0 0 0 549.867 0 0 0 0 0 -1318.63 0 0 
0 0 0.08 593.509 -2184.13 0 0 1461.46 642.186 0 -1708.5 0 0 0 1505.86 0 356.075 1218.22 0 1518.68 0 1486.33 0 0 0 165.487 0 0 0 0 -2185.2 0 0 0 0 0 0 0 0 0 0 0 0 -53.7889 0 0 0 0 0 -520.112 0 -1532.41 0 0 0 0 0 0 0 0 293.664 2082.66 -2387.39 0 0 0 0 0 
-2319.48 0 1685.77 0.05 0 0 119.709 0 -1824.02 0 0 0 0 0 -425.657 0 0 0 0 0 1076.31 2142.32 971.633 138.63 741.981 0 0 0 0 0 466.552 0 2084.95 0 0 0 0 0 0 0 -940.657 0 0 0 0 0 0 0 0 0 0 0 0 -1641.21 0 0 0 0 0 0 0 0 -115.894 2222.43 0 -1486.48 0 0 
-26.78 -416.807 2363.89 0 0.02 -708.411 0 0 0 0 0 0 0 0 1238.06 0 0 0 2487.64 0 2183.68 0 0 1395.23 0 0 -1112.48 0 0 0 0 0 875.805 0 0 0 -874.279 0 1840.34 0 0 -2218.31 0 0 0 0 0 0 0 0 0 0 0 0 868.786 0 -696.814 0 -753.578 253.075 0 0 0 0 0 0 931.806 0 
0 0 0 0 1690.5 0.06 1809.67 0 2048.33 0 -775.704 0 -385.067 0 2039.17 0 -1939.07 -368.587 0 2134.08 -1360.44 0 0 0 1066.55 0 0 0 0 0 0 2357.63 0 0 157.247 16.8615 0 0 1273.31 0 0 -1128.8 0 0 0 0 0 0 0 0 0 0 0 0 0 0 0 0 0 0 0 0 0 0 0 0 0 0 
-953.627 0 0 -784.555 0 -1538.51 0.08 0 0 2259.36 0 0 0 0 138.478 0 0 2065.26 -2077.93 0 0 0 0 1205.1 0 0 -389.798 0 0 0 0 0 0 1773.2 0 2057.79 0 0 0 0 0 0 922.651 0 0 0 0 0 0 0 2313.23 0 1686.83 0 0 0 0 1829.2 0 0 0 0 0 0 0 978.805 -1785.26 0 
0 698.798 976.363 0 0 0 0 0.02 0 0 0 0 0 1870.86 0 0 0 0 0 0 745.186 -993.606 0 1647.16 0 0 0 2330.93 0 0 0 0 0 -1088.52 0 0 0 0 0 0 0 0 1849.96 0 0 0 0 0 0 0 0 0 -1743.6 0 -669.042 0 -1599.25 0 0 0 0 0 0 0 2488.25 0 0 0 
1360.59 922.803 2365.26 1645.79 0 -1834.09 0 0 0.01 0 0 0 0 0 -345.851 252.464 0 -211.417 0 334.712 1651.74 0 0 0 0 0 -588.321 0 -604.495 -1123.92 -19.303 0 0 0 0 -1689.12 0 0 0 0 0 0 0 0 1961.04 0 0 0 1772.44 1006.58 0 0 0 0 -1260.03 0 0 0 0 0 0 0 0 0 0 0 0 0 
0 0 0 0 0 0 -2442.78 0 0 0.08 0 0 0 0 0 0 0 0 0 0 0 0 1573.15 0 0 0 0 0 0 710.242 1644.11 0 1241.11 0 0 0 1019.55 0 204.703 0 0 0 0 -1648.99 0 0 0 0 0 0 0 0 0 0 0 -2471.92 0 428.251 0 2084.49 -810.038 0 0 0 0 0 0 0 
0 0 1717.81 0 0 1618.32 0 0 0 0 0.09 0 -852.763 -1004.29 0 0 0 0 2407.07 0 0 0 0 0 0 -1230.43 -1349.15 0 0 0 -166.86 0 0 702.765 0 0 0 0 0 0 0 0 0 0 0 0 0 0 0 0 0 0 -2091.05 0 0 0 0 2135.3 0 0 0 0 0 0 0 0 0 0 
0 0 0 0 0 0 0 0 0 0 0 0.03 0 0 0 0 2394.25 0 0 1503.57 0 0 0 711.921 0 0 1605.2 0 346.767 0 -337.306 0 0 0 1059.07 0 2434.54 0 0 0 2432.86 0 0 0 -1546.3 0 0 0 0 0 1192.28 0 0 0 0 1519.75 -889.081 0 0 0 0 0 0 0 0 0 0 0 
0 -1258.51 0 0 0 1294.06 0 0 0 0 870.769 0 0.09 616.855 0 0 0 0 0 1903.52 0 0 0 0 2375.33 1705.6 -404.141 0 0 0 0 1214.87 0 0 413.602 0 2373.65 0 0 2212.82 0 0 436.186 0 0 0 171.133 0 0 323.42 0 0 0 0 0 0 0 0 0 1391.72 0 0 0 0 0 0 0 0 
0 0 0 0 0 0 0 1757.64 0 0 -1332.36 0 1914.35 0.08 0 0 0 0 0 1440.24 -367.824 0 0 1931.44 0 0 0 0 1731.24 0 0 788.369 0 0 0 -836.131 579.318 1746.96 2376.4 0 0 0 0 942.335 0 0 0 0 0 0 0 0 0 0 0 0 -646.001 0 0 -1538.06 0 0 0 -1689.28 0 0 0 0 
0 0 -510.651 689.337 437.864 2463.53 -1082.26 0 2008.19 0 0 0 0 0 0 0 0 0 0 2228.23 0 0 0 0 0 2485.05 0 2451.63 0 0 0 -1898.02 -1090.5 966.597 0 -1072.8 0 0 0 -391.018 0 0 0 0 0 0 -1913.59 0 0 0 0 0 0 0 0 0 0 0 0 0 0 0 0 0 -610.599 0 0 0 
0 0 0 0 0 0 0 0 1814.86 0 0 0 0 0 0 0.03 0 0 0 0 0 0 2415.46 0 0 -1656.32 0 0 0 0 0 2252.34 0 0 0 0 0 0 0 0 0 0 0 0 0 0 0 0 0 0 0 0 0 0 0 -1412.63 0 0 0 0 0 -629.673 0 0 -1867.35 0 1859.11 0 
0 0 2091.97 0 0 -224.235 0 0 0 0 0 -210.654 0 0 0 0 0.08 0 0 0 0 0 2175.74 0 0 0 0 0 683.386 1653.42 0 0 -1213.19 0 0 -1396.6 0 0 2245.78 0 2487.95 0 0 0 0 0 0 0 0 0 0 0 0 0 0 0 0 0 0 0 0 0 0 0 0 0 -1901.84 0 
0 0 2079.91 0 0 2193.59 -323.573 0 -327.693 0 0 0 0 0 0 0 0 0 0 0 -1577.73 0 0 0 1533.63 0 0 0 0 0 422.91 -1276.97 0 -1540.5 2484.44 0 -1473.36 0 -1793.5 1006.12 0 2076.86 0 0 0 1382.41 0 0 -2061.14 0 0 0 934.248 0 0 0 0 0 0 0 -606.937 546.51 0 -2186.57 0 0 0 0 
0 0 0 0 -154.347 0 1566.74 0 0 0 1400.11 0 0 0 0 0 0 0 0.03 0 0 0 0 480.59 0 0 751.289 0 0 0 0 0 0 0 0 0 0 0 0 0 0 0 0 -2077.78 0 0 0 0 0 0 0 147.633 0 0 0 0 0 0 0 0 0 0 0 0 0 0 0 1685.16 
0 0 2461.24 0 0 -2247.46 0 0 1234.86 0 0 1778.08 -54.857 -600.223 1435.97 0 0 0 0 0.03 -488.372 0 1835.92 0 0 -47.6852 0 0 0 0 0 0 799.661 0 -306.635 0 776.315 0 0 0 0 0 0 0 0 0 0 0 0 0 0 0 0 0 0 0 0 0 0 0 0 2197.26 -685.369 0 0 0 0 0 
0 -1903.67 0 429.472 724.738 1113.85 0 1480.83 -517.823 0 0 0 0 -2063.89 0 0 0 -148.854 0 2257.23 0.04 1380.12 0 0 0 0 99.414 0 0 0 293.207 0 371.792 0 229.423 0 0 0 0 0 0 0 0 0 0 0 0 0 0 0 0 0 0 0 0 0 0 0 0 0 -243.767 0 0 0 0 0 0 0 
2175.59 0 2389.07 -2223.2 0 0 0 -284.661 0 0 0 0 0 0 0 0 0 0 0 0 -1195.03 0.04 0 -1836.38 -523.316 0 0 1836.83 0 0 0 -12.8941 0 0 -2491.45 0 1225.24 1849.04 0 0 0 0 0 0 0 0 0 0 -1242.64 0 0 0 0 0 0 2288.2 0 0 0 0 0 0 0 0 0 0 0 526.673 
0 0 0 2355.49 0 0 0 0 0 2415.92 0 0 0 0 0 -1084.25 1425.9 0 0 2293.69 0 0 0.02 0 0 0 1551.18 0 0 0 65.2333 0 -1265.98 -1085.92 0 0 -482.421 -1992.32 2302.39 0 2313.68 0 0 0 0 0 0 0 711.768 0 0 0 2153.61 0 216.605 0 0 0 0 889.386 0 0 0 1475.04 0 0 0 0 
0 0 0 -982.315 572.146 0 2351.22 -216.605 0 0 0 1493.19 0 1458.86 0 0 0 0 -1393.09 0 0 1036.03 0 0.03 1610.08 0 0 0 0 1316.49 -613.498 1360.44 0 1054.95 0 0 0 0 -971.786 378.353 0 -106.586 0 0 0 0 0 0 0 0 0 0 -911.512 0 0 0 0 0 0 0 0 0 0 0 0 0 0 0 
122.456 -1955.55 0 -1478.55 0 -1515.47 0 0 0 0 0 0 -586.489 0 0 0 0 -32.1207 0 0 0 1996.9 0 -224.845 0.03 0 0 421.995 0 0 0 0 0 -1186.18 0 0 0 -497.833 0 1158.56 0 0 0 0 0 0 0 0 0 0 0 2438.96 0 0 0 0 0 0 0 0 1085.31 2197.56 0 0 0 0 0 0 
0 0 1805.09 0 0 0 0 0 0 0 -15.9459 0 -307.855 0 -760.292 2355.34 0 0 0 1855.75 0 0 0 0 0 0.05 0 -1119.19 0 1459.32 1589.79 0 -871.227 2306.05 0 0 0 0 0 -312.281 0 0 0 0 0 0 0 0 0 0 0 0 0 0 0 0 0 0 0 0 0 0 0 0 0 0 -124.287 0 
0 0 0 0 -295.495 0 -689.795 0 -1347.01 0 1394.01 1430.94 2170.4 0 0 0 0 0 -630.894 0 588.321 0 -1586.73 0 0 0 0 0 0 0 0 0 0 521.027 0 0 0 0 0 526.063 0 0 0 0 1606.57 0 0 0 0 0 0 0 -1584.6 0 0 0 -2451.63 0 1568.73 0 0 0 0 0 0 0 0 0 
0 0 0 0 0 0 0 1015.73 0 0 0 0 0 0 -1026.26 0 0 0 0 0 0 966.903 0 0 -1139.64 535.371 0 0.01 0 0 0 0 0 1463.9 0 0 0 0 0 0 0 0 0 0 0 1997.67 0 0 0 0 0 0 0 0 0 0 0 0 0 0 0 0 0 0 0 0 0 0 
0 0 0 0 0 0 0 0 2019.33 0 0 2256.92 0 335.475 0 0 1978.9 0 0 0 0 0 0 0 0 0 0 0 0.02 0 -2428.43 0 0 0 530.03 2275.08 0 0 -1803.72 0 0 0 -1692.63 0 0 0 1038.32 2181.39 0 1159.78 0 1385.16 0 0 0 0 122.456 0 0 0 0 0 -1000.78 0 0 0 0 0 
0 0 0 0 0 0 0 0 -458.617 -2425.69 0 0 0 0 0 0 720.771 0 0 0 0 0 0 -1509.52 0 2476.35 0 0 0 0.04 0 0 0 0 1956.77 0 0 0 0 2364.65 0 0 0 0 0 1240.2 0 0 0 0 0 0 0 2240.59 0 1465.42 0 1344.11 0 0 0 0 0 0 0 0 -1184.8 0 
0 165.639 1167.26 2279.96 0 0 0 0 245.903 -1707.28 -27.3904 -264.519 0 0 0 0 0 967.513 0 0 -927.076 0 965.377 1301.39 0 -96.82 0 0 769.143 0 0.09 0 872.753 0 0 0 0 0 0 -154.958 0 0 0 0 0 0 0 0 0 10.1474 0 0 -463.958 0 0 -2433.32 0 0 0 0 0 0 0 0 0 0 0 0 
0 0 0 0 0 1943.34 0 0 0 0 0 0 1381.5 -1857.59 2263.48 -150.685 0 -383.389 0 0 0 1755.5 0 -750.221 0 0 0 0 0 0 0 0.06 0 0 0 0 0 0 0 0 0 0 0 0 0 0 0 0 0 752.663 0 0 0 0 0 0 0 0 -594.272 0 0 0 0 0 -748.085 0 0 0 
0 0 0 1623.2 657.14 0 0 0 0 2152.09 0 0 0 0 63.4022 0 1792.73 0 0 -1901.84 -1863.84 0 -297.021 0 0 1252.56 0 0 0 0 -1435.36 0 0.02 0 0 1460.39 0 1997.82 0 0 0 0 0 0 -82.1711 0 0 0 0 0 -94.5311 0 0 0 0 28.6111 0 0 0 0 0 0 0 0 1314.05 0 0 0 
0 0 0 0 0 0 -42.6496 -154.653 0 0 1424.53 0 0 0 -2035.81 0 0 2277.52 0 0 0 0 2219.53 489.593 702.307 -197.073 1608.1 1280.02 0 0 0 0 0 0.07 0 0 0 0 0 -1282.92 0 -1702.55 0 0 0 0 1242.33 0 0 0 1883.98 0 0 0 2225.33 0 0 0 0 0 0 0 0 0 0 0 0 0 
0 2295.22 0 0 0 615.177 0 0 0 0 0 600.528 1389.13 0 0 0 0 -519.044 0 1292.38 -647.374 2387.84 0 0 0 0 0 0 1418.73 2148.58 0 0 0 0 0.07 -505.31 -159.078 -137.715 0 637.913 0 0 0 0 0 0 0 0 0 0 0 0 0 0 0 0 0 -1768.93 0 0 0 0 0 0 0 0 0 0 
0 0 0 0 0 1001.85 132.527 0 1604.89 0 0 0 0 1512.27 188.986 0 2073.5 0 0 0 0 0 0 0 0 0 0 0 -223.624 0 0 0 -594.119 0 728.706 0.06 0 0 0 -638.066 0 0 0 0 0 0 0 0 0 0 0 0 0 -331.965 0 0 0 0 -654.698 0 0 0 0 0 0 0 0 0 
0 1865.83 0 0 -2275.69 0 0 0 0 598.392 0 1761.91 -265.282 1180.84 0 0 0 1621.98 0 -1135.36 0 -319.452 -587.71 0 0 0 0 0 0 0 0 0 0 0 1210.29 0 0.08 0 0 2298.12 0 -685.064 0 0 0 0 0 0 279.931 0 0 0 1377.83 -591.525 0 0 0 0 2423.09 0 700.171 0 0 0 0 0 0 0 
0 -591.372 0 0 0 0 0 0 0 0 0 0 0 -1777.17 0 0 0 0 0 0 0 209.128 105.213 0 1893.29 0 0 0 0 0 0 0 2052.9 0 -573.367 0 0 0.07 0 2439.12 0 0 0 0 0 0 0 0 0 0 0 0 0 234.153 0 -1498.23 0 0 0 0 0 0 0 0 0 0 0 0 
0 1052.2 0 0 2395.93 1778.85 0 0 0 -1683.17 0 0 0 1021.99 0 0 -1137.65 1059.98 0 0 0 0 -15.0304 -1227.53 0 0 0 0 -2473.91 0 0 0 0 0 0 0 0 0 0.05 666.601 0 0 0 0 0 0 0 0 0 0 0 0 0 0 0 0 0 0 0 0 0 2069.38 0 0 0 0 0 0 
1098.44 0 0 0 0 0 0 0 0 0 0 0 -255.058 0 1880.17 0 0 1669.13 0 0 0 0 0 998.489 2022.84 1179.31 1179.16 0 0 2027.12 1240.81 0 0 2042.83 -415.586 1101.64 560.244 249.565 -755.867 0.05 354.701 0 0 0 0 0 0 1446.35 0 0 0 0 2337.95 -1535.16 -2212.06 0 0 0 0 0 0 0 0 0 0 0 0 0 
0 1017.41 0 -823.313 0 0 0 0 0 0 0 1521.73 0 0 0 0 1137.81 0 0 0 0 0 2063.43 0 0 0 0 0 0 0 0 0 0 0 0 0 0 0 0 1674.93 0.05 0 0 0 0 0 0 366.909 0 0 0 0 0 0 1268.27 0 0 507.599 0 0 0 0 0 -1728.49 0 0 0 -1104.39 
0 0 0 0 1988.97 -2470.09 0 0 0 0 0 0 0 0 0 0 0 2261.04 0 0 0 0 0 -852.153 0 0 0 0 0 0 0 0 0 1993.85 0 0 1026.41 0 0 0 0 0.05 0 0 0 0 0 0 0 0 0 0 0 0 0 0 0 0 0 -899.457 0 0 0 0 0 -1078.75 0 -1671.42 
0 0 0 0 0 0 1009.78 460.448 0 0 0 0 -121.54 0 0 0 0 0 0 0 0 0 0 0 0 0 0 0 -15.6407 0 0 0 0 0 0 0 0 0 0 0 0 0 0.06 0 0 0 0 0 0 0 0 0 0 0 0 0 0 0 0 0 0 0 0 0 0 0 0 451.903 
0 0 -1062.73 0 0 0 0 0 0 2287.59 0 0 0 -904.95 0 0 0 0 2136.07 0 0 0 0 0 0 0 0 0 0 0 0 0 0 0 0 0 0 0 0 0 0 0 0 0.07 0 0 1888.87 0 0 0 0 0 0 0 0 0 -990.249 0 0 0 0 0 0 0 0 -2428.59 0 0 
0 0 0 0 0 0 0 0 865.276 0 0 2086.17 0 0 0 0 0 0 0 0 0 0 0 0 0 0 -1939.68 0 0 0 0 0 874.432 0 0 0 0 0 0 0 0 0 0 0 0.02 0 0 0 0 0 0 2042.38 0 -2364.96 0 0 0 0 0 0 0 0 0 351.955 0 0 0 0 
1419.49 0 0 0 0 0 0 0 0 0 0 0 0 0 0 0 0 1223.56 0 0 0 0 0 0 0 0 0 1611.61 0 334.864 0 0 0 0 0 0 0 0 0 0 0 0 0 0 0 0.06 0 0 0 0 0 0 0 0 0 0 0 535.218 0 0 0 0 0 0 0 0 0 0 
740.303 0 0 0 0 0 0 0 0 0 0 0 1826.3 0 -1605.5 0 0 0 0 0 0 0 0 0 0 0 0 0 2209.01 0 0 0 0 2207.33 0 0 0 0 0 0 0 0 0 578.86 0 0 0.04 -155.263 0 0 0 0 0 0 0 0 0 0 0 589.999 -16.8615 0 1790.44 0 604.038 0 0 0 
0 2332.15 0 0 0 0 0 0 0 0 0 0 0 0 0 0 0 0 0 0 0 0 0 0 0 0 0 0 -2444.61 0 0 0 0 0 0 0 0 0 0 471.74 -1009.93 0 0 0 0 0 961.562 0.08 0 0 0 0 0 0 0 0 0 0 0 0 0 0 0 0 0 0 0 0 
1012.22 0 0 0 0 0 0 0 371.029 0 0 0 0 0 0 0 0 2108.75 0 0 0 1088.82 152.516 0 0 0 0 0 0 0 0 0 0 0 0 0 2247.15 0 0 0 0 0 0 0 0 0 0 0 0.02 0 0 0 0 0 369.35 0 0 0 0 0 2406.92 0 315.485 0 1199.76 0 0 0 
0 -547.884 2022.08 0 0 0 0 0 940.504 0 0 0 15.0304 0 0 0 0 0 0 0 0 0 0 0 0 0 0 0 673.162 0 -1139.94 1993.55 0 0 0 0 0 0 0 0 0 0 0 0 0 0 0 0 0 0.06 0 0 0 0 604.495 0 0 0 0 0 0 -56.6881 0 0 0 0 28.7637 0 
0 0 0 0 0 0 2395.63 0 0 0 0 1858.5 0 0 0 0 0 0 0 0 0 0 0 0 0 0 0 0 0 0 0 0 -1748.63 1927.32 0 0 0 0 0 0 0 0 0 0 0 0 0 0 0 0 0.02 0 0 0 0 0 0 0 0 0 0 0 0 0 0 0 0 0 
0 0 159.993 0 0 0 0 0 0 0 0 0 0 0 0 0 0 0 603.58 0 0 0 0 0 -1511.51 0 0 0 729.316 0 0 0 0 0 0 0 0 0 0 0 0 0 0 0 2110.89 0 0 0 0 0 0 0.06 0 0 -1435.67 0 0 0 0 0 0 0 0 0 0 0 0 0 
0 0 0 0 0 0 193.564 956.832 0 0 -275.658 0 0 0 0 0 0 358.669 0 0 0 0 257.347 960.646 0 0 2329.71 0 0 0 -1984.69 0 0 0 0 0 875.958 0 0 320.215 0 0 0 0 0 0 0 0 0 0 0 0 0.04 0 0 0 0 2418.67 0 407.956 338.984 0 0 0 0 0 0 0 
0 0 0 229.27 0 0 0 0 0 0 0 0 0 0 0 0 0 0 0 0 0 0 0 0 0 0 0 0 0 214.011 0 0 0 0 0 1421.63 686.895 -1202.66 0 -291.07 0 0 0 0 206.534 0 0 0 0 0 0 0 0 0.04 0 0 0 0 0 0 0 0 0 0 0 0 0 0 
0 0 0 0 2473.6 0 0 831.401 -624.943 0 0 0 0 0 0 0 0 0 0 0 0 0 1528.29 0 0 0 0 0 0 0 0 0 0 1549.65 0 0 0 0 0 86.7489 -1649.45 0 0 0 0 0 0 0 -878.246 -71.1844 0 -1082.26 0 0 0.01 848.033 0 0 0 -1399.96 0 0 0 0 0 0 0 0 
0 0 0 0 0 0 0 0 0 1117.36 0 1667.76 0 0 0 -1085.77 0 0 0 0 0 2025.59 0 0 0 0 0 0 0 -236.9 680.334 0 -1442.08 0 0 0 0 -2204.43 0 0 0 0 0 0 0 0 0 0 0 0 0 0 0 0 2059.16 0.01 0 0 0 0 0 0 0 0 0 0 0 0 
0 0 0 0 -1254.54 0 0 -2297.81 0 0 0 -1476.1 0 2111.65 0 0 0 0 0 0 0 0 0 0 0 0 1563.84 0 934.095 0 0 0 0 0 0 0 0 0 0 0 0 0 0 1107.44 0 0 0 0 0 0 0 0 0 0 0 0 0.09 0 0 0 0 0 0 0 0 1223.41 -104.907 0 
0 0 0 0 0 0 1543.4 0 0 1655.55 592.898 0 0 0 0 0 0 0 0 0 0 0 0 0 0 0 0 0 0 1272.24 0 0 0 0 2433.47 0 0 0 0 0 1309.32 0 0 0 0 933.18 0 0 0 0 0 0 1550.57 0 0 0 0 0.02 0 0 0 -807.596 0 0 0 0 0 -346.461 
-801.645 0 0 0 922.346 0 0 0 0 0 0 0 0 0 0 0 0 0 0 0 0 0 0 0 0 0 2167.65 0 0 0 0 1524.63 0 0 0 -2127.37 2459.72 0 0 0 0 0 0 0 0 0 0 0 0 0 0 0 0 0 0 0 0 0 0.09 0 0 0 0 0 0 0 0 0 
0 -1354.95 0 0 -1647.47 0 0 0 0 1090.35 0 0 351.039 -1503.88 0 0 0 0 0 0 0 0 1473.51 0 0 0 0 0 0 0 0 0 0 0 0 0 0 0 0 0 0 663.091 0 0 0 0 -1825.39 0 0 0 0 0 2371.67 0 1957.08 0 0 0 0 0.04 0 0 0 0 0 0 2338.56 0 
0 0 140.156 0 0 0 0 0 0 565.127 0 0 0 0 0 0 0 391.018 0 0 1990.8 0 0 0 -449.461 0 0 0 0 0 0 0 0 0 0 0 2115.31 0 0 0 0 0 0 0 0 0 2253.72 0 1037.55 0 0 0 -877.331 0 0 0 0 0 0 0 0.06 0 0 0 0 0 0 0 
0 0 -2319.94 0 0 0 0 0 0 0 0 0 0 0 0 833.079 0 -504.242 0 2219.23 0 0 0 0 1634.04 0 0 0 0 0 0 0 0 0 0 0 0 0 -1527.38 0 0 0 0 0 0 0 0 0 0 656.987 0 0 0 0 0 0 0 75.457 0 0 0 0.07 -498.138 0 0 0 0 189.596 
0 0 2481.08 955.458 0 0 0 0 0 0 0 0 0 0 0 0 0 0 0 40.3607 0 0 0 0 0 0 0 0 1105.46 0 0 0 0 0 0 0 0 0 0 0 0 0 0 0 0 0 -1131.24 0 1038.01 0 0 0 0 0 0 0 0 0 0 0 0 1042.28 0.08 1054.03 0 0 0 0 
0 0 0 -2429.65 0 0 0 0 0 0 0 0 0 -99.7192 0 0 0 -1448.18 0 0 0 0 2109.82 0 0 0 0 0 0 0 0 0 0 0 0 0 0 0 0 0 1987.9 0 0 0 2106.62 0 0 0 0 0 0 0 0 0 0 0 0 0 0 0 0 0 1496.7 0.09 -1769.08 0 645.695 0 
0 0 0 0 0 0 0 926.771 0 0 0 0 0 0 1404.69 -2041.46 0 0 0 0 0 0 0 0 0 0 0 0 0 0 0 1095.23 -1819.9 0 0 0 0 0 0 0 0 0 0 0 0 0 2453.15 0 2359.46 0 0 0 0 0 0 0 0 0 0 0 0 0 0 -717.109 0.06 0 0 0 
0 1595.74 0 1641.21 0 0 -1135.21 0 0 0 0 0 0 0 0 0 0 0 0 0 0 0 0 0 0 0 0 0 0 0 0 0 0 0 0 0 0 0 0 0 0 1374.32 0 -2100.05 0 0 0 0 0 0 0 0 0 0 0 0 219.657 0 0 0 0 0 0 0 0 0.01 0 0 
0 0 0 0 -1940.14 0 1822.34 0 0 0 0 0 0 0 0 916.852 -2066.33 0 0 0 0 0 0 0 0 759.224 0 0 0 -1150.17 0 0 0 0 0 0 0 0 0 0 0 0 0 0 0 0 0 0 0 1007.95 0 0 0 0 0 0 -455.718 0 0 2466.89 0 0 0 2490.39 0 0 0.08 0 
0 0 0 0 0 0 0 0 0 0 0 0 0 0 0 0 0 0 1097.83 0 0 2282.25 0 0 0 0 0 0 0 0 0 0 0 0 0 0 0 0 0 0 2337.79 -1101.34 1597.26 0 0 0 0 0 0 0 0 0 0 0 0 0 0 -1967.15 0 0 0 703.375 0 0 0 0 0 0.04 
