*Vertices 48
*Matrix 
0.08 0 -1294.06 0 0 0 0 2286.07 0 0 0 0 0 0 727.332 0 0 0 0 0 0 0 0 0 0 1306.42 0 0 0 0 -2383.88 0 0 0 0 0 0 0 0 -316.553 0 0 0 0 0 0 0 0 
0 0.05 0 2159.26 0 0 0 0 0 0 0 0 1119.65 0 0 0 0 0 0 0 0 0 0 0 0 0 0 0 0 2057.02 0 0 0 450.835 0 0 0 0 0 0 0 0 0 0 238.578 0 0 0 
-502.716 0 0.01 1575.9 0 0 0 0 0 0 0 0 -1133.23 787.606 0 0 0 0 0 892.895 1880.47 2256.46 0 0 0 0 0 0 0 0 86.2911 0 0 0 0 0 -1643.96 0 0 0 0 0 0 0 0 0 0 -1945.63 
0 1778.08 2003.77 0 0 0 0 -685.675 0 0 0 0 0 0 0 0 1762.06 0 722.297 2485.05 0 0 -1717.96 0 0 0 0 0 0 0 0 0 0 0 0 0 0 1574.22 0 0 0 0 0 -1605.2 0 0 0 0 
0 0 0 0 0.09 0 0 0 0 -2234.34 0 0 0 0 0 0 0 0 0 0 0 -2039.32 0 0 0 0 0 0 1748.02 0 0 0 0 0 0 0 0 0 0 0 0 0 2127.22 0 1507.54 0 0 0 
0 0 0 0 0 0.04 0 0 0 0 0 0 0 0 0 0 2128.59 0 -66.4541 1845.53 0 0 0 0 0 0 0 2153.16 0 -717.872 0 0 0 0 0 0 0 0 0 0 0 0 0 0 1386.07 0 0 0 
0 0 0 0 0 0 0.09 0 0 0 0 0 0 0 0 0 0 0 0 0 0 0 0 0 0 0 0 0 0 0 0 0 0 0 0 1225.7 0 70.4215 0 0 0 0 0 0 2304.22 0 0 0 
527.284 0 0 1812.27 0 0 0 0.04 0 0 270.165 0 0 0 0 0 -138.63 0 0 323.42 -959.426 0 0 0 0 0 0 0 0 0 0 1096.3 0 0 0 0 0 0 0 0 0 0 0 0 0 0 0 0 
0 0 0 0 0 0 0 0 0.02 0 0 0 1838.51 0 0 0 -65.6911 1751.53 0 0 0 0 0 0 0 -1687.14 -106.433 1628.54 0 0 1320.92 0 0 0 0 0 0 0 0 0 0 0 0 0 920.667 0 0 0 
0 0 0 0 98.4985 0 0 0 0 0.09 0 0 0 601.749 0 0 0 0 1523.41 0 0 780.282 0 0 0 0 1847.36 2100.51 0 0 0 0 0 0 2232.81 0 0 -367.367 0 1433.38 -111.164 0 0 0 0 0 0 0 
0 0 0 0 0 0 0 1058.92 0 0 0.09 0 0 0 0 0 0 729.469 0 0 0 0 0 0 2352.9 0 0 0 0 0 0 0 0 0 0 0 0 0 0 0 0 -2241.81 0 0 0 0 0 0 
0 0 0 0 0 0 0 0 0 0 0 0.05 0 0 0 0 0 0 0 -269.555 0 0 0 0 1449.4 0 0 0 0 0 0 0 0 0 290.613 0 0 0 0 0 0 0 1029.01 0 0 0 0 0 
0 1033.74 2462.77 0 0 0 0 0 -659.276 0 0 0 0.05 0 0 0 0 0 1809.98 0 0 0 0 0 0 0 2316.74 117.267 0 0 0 0 2092.73 0 0 0 0 -638.066 0 0 0 0 0 0 0 0 0 0 
0 0 1011.76 0 0 0 0 0 0 -1789.38 0 0 0 0.07 0 0 0 0 2263.94 0 0 0 0 0 0 773.873 1631.75 0 0 0 0 0 0 0 0 0 0 0 0 794.778 0 0 0 0 0 1953.57 0 0 
-2114.09 0 0 0 0 0 0 0 0 0 0 0 0 0 0.01 0 0 0 1773.2 0 0 0 0 0 0 0 0 0 -549.715 0 0 0 0 -793.1 0 0 0 330.897 1376.46 0 0 436.796 0 0 0 0 0 0 
0 0 0 0 0 0 0 0 0 0 0 0 0 0 0 0.05 0 0 0 870.312 0 0 0 0 0 0 0 0 0 0 1083.79 0 0 0 0 0 0 645.39 62.1815 0 0 0 0 0 0 0 0 0 
0 0 0 2209.92 0 -2186.12 0 1474.43 -1817.61 0 0 0 0 0 0 0 0.03 0 0 0 0 164.571 1083.03 0 0 0 0 0 0 0 -1101.95 0 0 0 -640.812 1951.58 789.895 0 0 2265.47 0 0 0 0 2132.25 0 0 0 
0 0 0 0 0 0 0 0 856.426 0 1339.38 0 0 0 0 0 0 0.02 0 0 0 0 0 0 0 0 0 -1128.04 0 1293.15 1960.89 0 0 0 0 0 0 2444.76 0 2074.57 0 0 0 0 0 0 0 0 
0 0 0 -1193.04 0 1173.06 0 0 0 -656.835 0 0 2344.97 -1272.24 -1589.02 0 0 0 0.07 0 0 0 0 0 0 0 0 0 0 846.202 449.614 0 0 0 0 592.288 0 -338.374 0 0 0 0 0 0 0 0 0 0 
0 0 -346.919 360.652 0 33.0363 0 -1674.63 0 0 0 1580.78 0 0 0 -1990.34 0 0 0 0.05 339.595 0 0 0 0 0 0 0 94.2259 0 0 0 0 0 0 0 0 0 2336.27 0 0 346.309 0 0 0 0 0 0 
0 0 465.636 0 0 0 0 -671.178 0 0 0 0 0 0 0 0 0 0 0 1636.17 0.05 0 0 1869.64 0 0 0 0 0 0 0 0 0 0 0 0 0 0 0 0 0 0 0 0 0 566.347 0 0 
0 0 1982.86 0 2290.34 0 0 0 0 1106.98 0 0 0 0 0 0 -1160.7 0 0 0 0 0.02 -372.402 0 0 2457.12 0 0 272.759 0 0 0 0 0 0 0 -1807.69 0 0 0 -2349.85 0 0 1869.49 0 0 0 0 
0 0 0 1188.31 0 0 0 0 0 0 0 0 0 0 0 0 979.263 0 0 0 0 2311.55 0.03 0 0 0 -673.009 0 743.507 0 0 0 0 0 0 0 0 0 0 0 0 0 1402.71 0 0 0 0 0 
0 0 0 0 0 0 0 0 0 0 0 0 0 0 0 0 0 0 0 0 623.417 0 0 0.06 0 0 0 0 0 1177.63 0 2011.4 0 -1322.6 0 0 0 0 0 0 0 0 0 0 0 0 0 0 
0 0 0 0 0 0 0 0 0 0 863.292 1630.99 0 0 0 0 0 0 0 0 0 0 0 0 0.09 0 0 0 0 673.315 0 0 2259.36 0 0 0 0 -430.998 1187.7 0 0 0 0 0 0 0 0 0 
1182.82 0 0 0 0 0 0 0 -464.263 0 0 0 0 -756.783 0 0 0 0 0 0 0 -1135.06 0 0 0 0.04 0 0 0 1922.59 0 0 0 0 -821.329 2269.28 0 0 0 0 0 0 1204.95 0 0 0 0 0 
0 0 0 0 0 0 0 0 316.706 743.049 0 0 1282.01 301.294 0 0 0 0 0 0 0 0 1977.22 0 0 0 0.01 0 0 0 0 1100.12 0 0 0 0 0 0 0 0 0 1500.06 0 -1562.78 0 -1763.74 0 0 
0 0 0 0 0 2456.82 0 0 1264.31 -1527.38 0 0 -1653.57 0 0 0 0 -316.248 0 0 0 0 0 0 0 0 0 0.06 0 0 0 0 0 0 0 0 0 0 0 0 0 0 0 0 0 0 0 0 
0 0 0 0 2389.52 0 0 0 0 0 0 0 0 0 -1135.82 0 0 0 0 2331.39 0 2473.91 -1706.82 0 0 0 0 0 0.03 0 0 0 0 0 0 1173.36 0 0 0 0 0 131.458 0 0 0 0 -1039.84 0 
0 2369.99 0 0 0 1303.98 0 0 0 0 0 0 0 0 0 0 0 -1703.92 -171.743 0 0 0 0 1023.82 -736.793 295.038 0 0 0 0.02 0 0 0 0 0 0 0 0 0 0 405.362 0 0 -1956.77 0 0 0 0 
-1514.71 0 -260.857 0 0 0 0 0 -156.789 0 0 0 0 0 0 1757.18 1434.75 -2265.16 1468.78 0 0 0 0 0 0 0 0 0 0 0 0.02 0 1034.35 0 0 0 0 -861.919 0 0 0 0 0 0 0 0 0 0 
0 0 0 0 0 0 0 1911.45 0 0 0 0 0 0 0 0 0 0 0 0 0 0 0 1100.88 0 0 -798.593 0 0 0 0 0.03 0 0 0 0 0 0 0 0 0 0 0 0 0 0 0 0 
0 0 0 0 0 0 0 0 0 0 0 0 125.965 0 0 0 0 0 0 0 0 0 0 0 1468.47 0 0 0 0 0 1808.76 0 0.08 0 0 0 0 0 0 0 0 -2476.35 0 0 0 0 0 0 
0 882.366 0 0 0 0 0 0 0 0 0 0 0 0 526.368 0 0 0 0 0 0 0 0 1938.31 0 0 0 0 0 0 0 0 0 0.01 0 0 0 0 0 0 0 0 0 0 0 0 0 0 
0 0 0 0 0 0 0 0 0 854.137 0 2316.58 0 0 0 0 836.283 0 0 0 0 0 0 0 0 -429.777 0 0 0 0 0 0 0 0 0.06 0 382.778 0 1160.39 0 0 0 0 0 0 0 0 0 
0 0 0 0 0 0 2188.56 0 0 0 0 0 0 0 0 0 311.518 0 -1160.85 0 0 0 0 0 0 -2310.17 0 0 -2186.12 0 0 0 0 0 0 0.01 0 0 0 0 0 0 1847.82 0 0 0 0 0 
0 0 -435.423 0 0 0 0 0 0 0 0 0 0 0 0 0 1800.82 0 0 0 0 -1732 0 0 0 0 0 0 0 0 0 0 0 0 1499.6 0 0.02 0 0 0 0 0 0 0 0 0 0 0 
0 0 0 -1314.51 0 0 1845.53 0 0 -1556.22 0 0 2247.31 0 -563.448 125.355 0 1349.45 760.75 0 0 0 0 0 -1355.25 0 0 0 0 0 1376.31 0 0 0 0 0 0 0.08 1546.45 0 0 0 0 1407.9 0 0 0 0 
0 0 0 0 0 0 0 0 0 0 0 0 0 0 2327.72 1130.94 0 0 0 2290.49 0 0 0 0 1580.78 0 0 0 0 0 0 0 0 0 -160.909 0 0 -270.013 0.08 0 0 0 -1773.05 0 0 0 0 0 
1068.68 0 0 0 0 0 0 0 0 699.255 0 0 0 1267.36 0 0 1555.6 -1576.66 0 0 0 0 0 0 0 0 0 0 0 0 0 0 0 0 0 0 0 0 0 0.09 0 0 0 0 0 0 0 0 
0 0 0 0 0 0 0 0 0 2310.63 0 0 0 0 0 0 0 0 0 0 0 499.207 0 0 0 0 0 0 0 1050.52 0 0 0 0 0 0 0 0 0 0 0.08 0 0 0 0 0 0 0 
0 0 0 0 0 0 0 0 0 0 -870.006 0 0 0 1568.73 0 0 0 0 1905.35 0 0 0 0 0 0 1573.76 0 1932.51 0 0 0 722.755 0 0 0 0 0 0 0 0 0.04 0 0 640.355 0 0 0 
0 0 0 0 316.401 0 0 0 0 0 0 -2376.55 0 0 0 0 0 0 0 0 0 0 1185.57 0 0 789.59 0 0 0 0 0 0 0 0 0 238.884 0 0 2208.7 0 0 0 0.08 0 0 0 0 0 
0 0 0 710.089 0 0 0 0 0 0 0 0 0 0 0 0 0 0 0 0 0 950.575 0 0 0 0 283.746 0 0 1572.7 0 0 0 0 0 0 0 1575.14 0 0 0 0 0 0.08 0 728.401 0 0 
0 1859.11 0 0 -458.77 15.9459 1469.54 0 1365.17 0 0 0 0 0 0 0 -44.3281 0 0 0 0 0 0 0 0 0 0 0 0 0 0 0 0 0 0 0 0 0 0 0 0 2259.67 0 0 0.08 -786.691 0 0 
0 0 0 0 0 0 0 0 0 0 0 0 0 -15.4881 0 0 0 0 0 0 -65.3859 0 0 0 0 0 1749.4 0 0 0 0 0 0 0 0 0 0 0 0 0 0 0 0 2388.76 1838.36 0.08 0 0 
0 0 0 0 0 0 0 0 0 0 0 0 0 0 0 0 0 0 0 0 0 0 0 0 0 0 0 0 2188.41 0 0 0 0 0 0 0 0 0 0 0 0 0 0 0 0 0 0.09 0 
0 0 975.295 0 0 0 0 0 0 0 0 0 0 0 0 0 0 0 0 0 0 0 0 0 0 0 0 0 0 0 0 0 0 0 0 0 0 0 0 0 0 0 0 0 0 0 0 0.01 
