*Vertices 58
*Matrix 
0.01 0 0 0 0 0 0 669.195 0 0 0 0 0 0 0 0 0 0 0 0 0 217.368 -2144.46 0 1428.65 0 0 -548.494 0 0 0 0 0 0 0 -908.765 0 0 0 0 0 -1300.62 0 0 0 0 0 0 0 0 0 1464.96 0 0 845.592 0 1096.45 0 
0 0.07 0 0 0 0 0 0 2048.02 0 0 0 0 0 2202.29 0 0 0 0 1920.76 -1565.52 1477.32 0 0 0 651.189 0 0 0 0 0 0 -590.609 0 0 137.104 1715.83 0 0 0 0 1595.89 0 -251.701 2177.72 1758.4 -2065.26 -524.537 0 0 2499.54 0 0 -278.1 729.164 0 0 0 
0 0 0.01 0 0 1382.72 0 0 0 1518.98 0 0 0 -1312.68 0 0 0 0 0 1614.96 -1289.33 -769.906 0 0 0 0 0 0 0 0 0 -543.153 0 0 0 -986.74 0 1080.89 0 0 0 0 91.0215 -789.895 0 -1755.96 1088.98 -779.519 0 0 -304.193 1667.3 0 0 -901.898 1775.64 0 0 
0 0 0 0.08 0 0 0 2414.7 0 0 0 0 0 0 0 0 -873.363 2219.38 0 734.962 2280.57 0 0 0 -826.975 0 0 0 1061.97 0 0 -1660.59 0 0 0 -1307.79 0 0 1518.07 -426.267 369.503 0 373.012 -8.62148 1642.43 0 1542.63 0 640.66 0 0 0 0 -1526.61 -843.15 2188.56 0 0 
0 0 0 0 0.06 0 0 0 0 0 0 2045.12 0 0 794.473 0 0 0 0 0 0 0 0 0 -1396.91 0 0 0 0 0 1707.59 0 0 0 0 0 -2326.04 0 0 1364.56 0 0 0 0 0 95.1415 0 2035.2 0 0 0 1654.94 0 -857.799 0 -214.164 0 0 
0 0 -231.712 0 0 0.02 0 0 0 0 0 0 0 2425.99 -62.0289 0 0 0 0 0 0 841.014 1519.59 -1903.21 705.359 1511.2 0 0 0 0 2170.55 0 0 0 0 0 -2182.76 0 0 1352.5 2470.55 0 0 1245.99 1963.33 0 1233.79 -1323.82 0 -1252.1 0 0 1397.52 -1613.9 0 1770.15 0 0 
0 0 0 0 0 0 0.06 -2265.62 0 0 -1807.54 0 0 0 0 0 0 0 0 1514.86 0 0 0 0 1051.13 0 0 0 0 0 351.497 1760.99 0 0 0 0 732.978 0 0 0 1515.32 0 0 -204.093 0 0 2153.16 0 0 2144 0 0 0 0 0 0 0 0 
1096.45 0 0 2004.38 0 0 -1899.24 0.05 0 0 0 0 825.907 -793.252 0 -878.704 0 0 0 0 1655.1 1841.26 0 1517.46 0 0 0 0 0 1192.43 0 0 0 0 2414.09 0 278.71 0 0 0 0 0 0 1281.85 0 0 0 0 0 0 0 0 0 0 201.193 0 0 1053.58 
0 -1874.07 0 0 0 0 0 0 0.06 0 0 2229 -361.873 0 0 0 2316.28 0 0 0 0 0 0 0 0 1235.47 -878.246 0 981.704 0 -1522.19 2395.32 0 0 -1357.08 0 0 0 0 0 -1842.02 957.137 0 0 0 -1485.26 0 0 0 2275.84 0 -472.503 2357.02 0 0 208.823 0 0 
0 0 1809.67 0 0 0 0 0 0 0.04 0 0 0 0 -519.044 0 0 1064.26 186.392 0 0 0 1106.98 0 2076.25 0 0 0 0 -1091.27 0 0 0 2015.82 0 0 0 0 0 861.919 -816.294 0 0 0 0 1120.87 0 2499.24 0 0 0 -1917.71 -2327.72 0 0 0 0 0 
0 0 0 0 0 0 1883.07 0 0 0 0.01 0 0 0 159.383 1180.53 0 0 0 0 0 0 0 0 0 0 194.479 0 0 0 0 0 1686.99 0 0 1066.39 331.965 0 0 0 0 259.789 0 0 0 0 0 0 0 0 1109.27 2193.29 0 0 0 0 0 0 
0 0 0 0 1692.02 0 0 0 1484.04 0 0 0.04 0 0 0 0 0 650.883 0 0 0 0 -1110.8 0 0 -1424.07 0 0 0 0 0 0 0 0 0 0 0 0 0 0 -2022.39 0 -372.555 0 -1108.81 -1656.93 0 0 0 0 0 0 0 2479.25 2217.7 0 0 0 
0 0 0 0 0 0 0 -1600.92 -1939.99 0 0 0 0.04 0 2394.71 0 0 -62.0289 0 0 0 0 0 0 0 0 0 1790.9 0 0 0 0 -715.735 0 0 0 0 0 0 0 0 0 0 0 0 0 0 0 0 0 0 0 0 0 1645.02 0 -28.9163 0 
0 0 2427.37 0 0 963.24 0 1299.1 0 0 0 0 0 0.08 0 0 0 0 0 0 -1387.6 0 0 0 0 0 0 0 -204.703 430.387 0 0 -534.455 0 0 0 -380.184 0 -887.555 928.297 0 0 0 0 0 0 1507.23 -690.405 0 0 2178.64 -1654.79 -878.552 0 1477.48 0 -900.067 0 
0 -1324.88 0 0 1472.29 1081.35 0 0 0 -1128.65 -1427.88 0 1506.16 0 0.01 682.775 0 -1090.35 0 0 0 0 0 0 102.008 144.276 0 0 0 0 0 0 0 0 0 0 1574.53 0 0 0 0 -776.009 0 0 0 0 2204.43 -648.442 0 0 983.535 0 0 0 841.166 0 0 0 
0 0 0 0 0 0 0 -569.399 0 0 289.087 0 0 0 2400.66 0.03 0 0 -1339.08 0 0 0 1959.06 2405.09 -1995.99 0 0 0 0 0 0 0 0 0 0 0 0 0 -489.746 993.301 1831.95 0 -1975.69 0 0 2395.78 0 0 0 228.66 0 1393.86 0 0 0 0 1835.92 0 
0 0 0 1148.18 0 0 0 0 122.761 0 0 0 0 0 0 0 0.01 0 0 0 0 0 0 0 -1500.98 0 0 1834.7 0 2088.92 865.581 0 0 0 0 1981.34 -1515.47 -1883.22 0 0 1004.14 -2118.82 0 0 0 0 -2446.29 0 0 1158.56 2415.77 0 0 1515.78 0 0 0 0 
0 0 0 157.704 0 0 0 0 0 2044.36 0 -1644.26 2318.41 0 1780.07 0 0 0.08 2127.67 2012.01 92.5474 0 0 1090.81 0 0 0 0 0 0 0 0 0 0 0 0 0 0 0 0 0 -2330.93 0 0 0 1702.25 0 0 -2139.27 0 0 959.273 0 598.849 608.921 -1038.01 151.296 0 
0 0 0 0 0 0 0 0 0 320.368 0 0 0 0 0 -750.069 0 2468.72 0.08 830.943 0 101.093 0 -1301.84 0 0 0 0 -606.632 0 0 292.138 0 0 0 0 0 0 -667.974 2362.36 0 0 0 0 -676.672 0 0 0 0 0 0 -734.657 0 0 0 1818.67 1836.83 0 
0 -1131.24 -253.838 1145.89 0 0 1699.35 0 0 0 0 0 0 0 0 0 0 -222.404 1284.91 0 1279.41 0 0 0 0 0 0 -2120.5 0 0 0 0 0 0 0 -287.103 -487.915 0 0 0 0 0 0 0 0 0 0 0 0 -1909.47 0 0 0 1955.09 0 0 0 0 
0 2031.54 -928.907 2050.46 0 0 0 594.729 0 0 0 0 0 1944.11 0 0 0 765.023 0 1050.22 0.05 0 0 0 0 0 0 0 0 0 0 0 0 -537.66 0 0 -2422.94 2356.26 0 0 0 0 -1888.87 0 0 722.755 0 -2113.48 1637.39 0 0 556.429 0 1505.86 0 0 0 2421.57 
2275.23 -726.264 210.807 0 0 43.8704 0 -1099.51 0 0 0 0 0 0 0 0 0 0 -902.814 0 0 0.03 0 0 0 0 0 0 367.977 0 0 0 0 2409.36 0 0 0 0 -386.135 0 0 -1248.13 0 0 0 666.295 0 0 0 0 0 0 0 1877.27 0 -1765.88 0 0 
741.371 0 0 0 0 662.175 0 0 0 2362.36 0 -1924.88 0 0 0 983.535 0 0 0 0 0 0 0.05 -146.413 2274.77 0 -2209.31 350.276 1582.46 0 0 0 0 0 0 0 0 0 0 -247.429 0 0 0 190.207 0 0 0 0 0 2406.92 0 0 0 1828.9 0 0 0 0 
0 0 0 0 0 -868.175 0 1591.77 0 0 0 0 0 0 0 -1748.33 0 2028.49 618.076 0 0 0 2087.08 0.02 0 0 0 0 0 0 0 0 0 1870.86 1467.56 0 0 0 2037.49 -814.31 0 0 0 0 0 -1099.35 1152.46 0 969.497 0 0 0 1780.98 0 0 0 0 0 
180.593 0 0 -1457.49 -509.278 2278.59 -1535 0 0 1385.01 0 0 0 0 -2145.99 694.067 568.331 0 0 0 0 0 2255.39 0 0.03 0 0 0 1563.08 1525.7 -784.555 0 0 0 0 0 1876.51 0 0 0 0 -785.928 0 -1993.39 0 0 2113.03 0 0 0 0 1594.52 0 0 0 0 0 0 
0 -659.276 0 0 0 1788 0 0 -1732.46 0 0 1014.05 0 0 -634.251 0 0 0 0 0 0 0 0 0 0 0.04 0 0 -1081.8 723.518 0 0 0 0 0 0 0 2224.27 0 0 -1407.74 -1953.87 0 0 0 0 1039.69 1251.64 0 0 0 0 0 0 0 715.43 0 -1647.31 
0 0 0 0 0 0 0 0 1354.95 0 -647.984 0 0 0 0 0 0 0 0 0 0 0 692.236 0 0 0 0.01 -894.574 0 1249.35 0 0 0 0 0 0 -2409.82 0 0 0 0 0 0 0 -51.9578 1727.42 0 0 -2320.09 1746.96 0 0 0 1156.73 0 0 1574.37 0 
624.332 0 0 0 0 0 0 0 0 0 0 0 -177.999 0 0 0 -1449.1 0 0 216.605 0 0 273.827 0 0 0 2220.45 0.07 -680.792 0 889.081 0 0 0 0 0 0 0 0 0 0 0 0 0 0 0 0 0 0 0 0 0 0 0 0 -933.485 0 0 
0 0 0 1341.06 0 0 0 0 2080.68 0 0 0 0 -2034.14 0 0 0 0 -467.772 0 0 1648.69 -773.11 0 -1774.73 -2134.69 0 -226.066 0 973.312 -2227.32 1494.57 0 0 0 -224.082 -1545.53 1540.04 0 0 0 -1860.79 0 2176.81 0 0 0 0 1729.26 1948.53 1263.7 806.68 0 0 0 0 -144.887 0 
0 0 0 0 0 0 0 2084.19 0 -306.024 0 0 0 1246.6 0 0 -2090.59 0 0 0 0 0 0 0 -469.146 2189.78 2049.85 0 2189.93 0.05 0 0 0 0 0 -2078.54 2011.55 0 0 1817.45 0 1596.8 0 0 0 0 0 -37.4615 0 0 -512.482 871.532 175.253 -1006.12 0 0 0 0 
0 0 0 0 -698.187 -545.595 -2171.16 0 243.156 0 0 0 0 0 0 0 1868.27 0 0 0 0 0 0 0 960.646 0 0 1954.63 1274.83 0 0.05 0 0 1672.49 0 0 0 0 0 0 0 0 0 -1032.36 0 0 0 0 0 0 0 0 0 0 -2394.25 1904.74 0 0 
0 0 1590.4 -580.844 0 0 1182.82 0 2334.44 0 0 0 0 0 0 0 0 0 -2149.8 0 0 0 0 0 0 0 0 0 -2168.57 0 0 0.02 0 0 0 2.67037 -539.033 2145.99 0 0 -1414.46 0 582.522 348.75 0 0 0 0 -944.624 0 0 0 2379.6 0 0 0 0 0 
0 -1618.32 0 0 0 0 0 0 0 0 1061.97 0 1207.24 -381.558 0 0 0 0 0 0 0 0 0 0 0 0 0 0 0 0 0 0 0 -724.433 0 0 2318.87 0 0 270.775 1983.02 0 0 1836.38 0 -2090.59 -1808.91 0 0 0 0 0 0 0 -420.316 0 0 0 
0 0 0 0 0 0 0 0 0 2489.32 0 0 0 0 0 0 0 0 0 0 -208.67 416.959 0 -1504.49 0 0 0 0 0 0 -760.292 0 -437.864 0.08 0 0 0 0 0 0 0 0 0 0 0 0 0 0 1452.6 0 2434.39 0 0 0 0 0 0 0 
0 0 0 0 0 0 0 -12.4363 -486.389 0 0 0 0 0 0 0 0 0 0 0 0 0 0 2447.36 0 0 0 0 0 0 0 0 0 0 0.09 -1133.23 1280.94 710.547 617.466 -7.40074 -2215.57 0 0 0 0 0 0 776.467 0 0 0 0 -589.236 1894.21 0 0 0 0 
44.6333 613.193 1196.71 -430.845 0 0 0 0 0 0 1310.08 0 0 0 0 0 -646.458 0 0 -829.112 0 0 0 0 0 0 0 0 2005.45 755.257 0 576.266 0 0 848.796 0.03 0 0 0 0 0 -101.856 0 0 0 0 0 0 -998.184 -1507.08 0 0 0 0 0 -1093.4 1617.1 0 
0 -1107.44 0 0 -282.22 -962.783 1908.7 1078.45 0 0 1702.09 0 0 215.995 -358.974 0 644.322 0 0 1679.66 -525.605 0 0 0 1388.52 0 -571.841 0 1082.72 -2082.66 0 -1018.48 816.599 0 -1518.83 0 0.05 2158.04 0 0 0 2268.52 0 941.725 0 0 0 0 0 0 -870.617 0 0 0 0 0 0 0 
0 0 983.383 0 0 0 0 0 0 0 0 0 0 0 0 0 2172.69 0 0 0 -440.153 0 0 0 0 1858.35 0 0 598.849 0 0 530.03 0 0 1847.06 0 -958.663 0.08 0 0 -1752.91 0 0 0 0 0 0 143.513 0 0 0 -1028.09 0 0 0 0 0 0 
0 0 0 2385.86 0 0 0 0 0 0 0 0 0 624.943 0 -1687.29 0 0 -11.8259 0 0 -278.558 0 676.672 0 0 0 0 0 0 0 0 0 0 1192.28 0 0 0 0.01 0 -860.24 2195.27 0 1668.07 0 0 0 0 1624.88 -2303.61 0 0 0 2004.38 0 0 0 0 
0 0 0 -617.008 -1339.53 2032.91 0 0 0 2316.13 0 0 0 -821.024 0 2028.95 0 0 -1327.48 0 0 0 1040.15 -1952.35 0 0 0 0 0 1830.12 0 0 573.824 0 -1562.47 0 0 0 0 0.01 0 0 111.927 0 0 0 0 0 761.055 0 0 0 411.161 147.633 0 0 0 -869.396 
0 0 0 -506.073 0 1267.51 602.206 0 327.998 1432.92 0 -32.7311 0 0 0 -705.359 1782.05 0 0 0 0 0 0 0 0 -378.506 0 0 0 0 0 2373.81 2058.55 0 364.467 0 0 357.143 1312.22 0 0.06 0 412.381 0 0 0 942.946 0 0 0 0 0 2283.78 0 2020.4 0 0 -2466.73 
2089.07 -741.523 0 0 0 0 0 0 -344.935 0 1742.84 0 0 0 -754.799 0 -1829.51 -947.676 0 0 0 -2291.25 0 0 -1660.59 1323.97 0 0 1699.04 51.0422 0 0 0 0 0 -238.426 -386.898 0 779.672 0 0 0.01 0 2214.96 0 0 284.661 0 0 0 0 0 0 178.152 0 561.617 0 807.138 
0 0 1168.02 518.586 0 0 0 0 0 0 0 1714.76 0 0 0 1748.48 0 0 0 0 600.223 0 0 0 0 0 0 0 0 0 0 2112.42 0 0 0 0 0 0 0 759.682 -1919.08 0 0.08 0 -2092.27 0 0 0 2059.31 0 0 0 0 0 0 0 0 0 
0 2015.98 -1171.83 678.808 0 2449.95 -929.975 1091.57 0 0 0 0 0 0 0 0 0 0 0 0 0 0 2162.47 0 814.768 0 0 0 -1403.01 0 -226.676 1412.17 1469.24 0 0 0 -2361.6 0 -88.1222 0 0 -1677.83 0 0.01 0 -869.854 0 635.319 0 0 0 -343.715 0 0 0 0 0 1335.26 
0 -371.639 0 -1956.77 0 -309.534 0 0 0 0 0 -2481.38 0 0 0 0 0 0 1721.02 0 0 0 0 0 0 0 -300.989 0 0 0 0 0 0 0 0 0 0 0 0 0 0 0 144.429 0 0.05 0 0 1050.68 0 0 0 0 0 0 0 2153.31 0 0 
0 -1837.75 -2295.07 0 1033.89 0 0 0 -779.977 1373.41 0 1542.18 0 0 0 862.987 0 1718.57 0 0 -415.128 2040.85 0 -2068.62 0 0 1880.02 0 0 0 0 0 359.89 0 0 0 0 0 0 0 0 0 0 -1121.48 0 0.04 0 0 -2113.03 0 0 122.913 -1700.11 2322.08 2056.26 -587.405 0 0 
0 -2393.64 -2420.19 2310.94 0 605.564 -911.054 0 0 0 0 0 0 146.87 -78.814 0 1938.46 0 0 0 0 0 0 1570.86 881.298 -407.651 0 0 0 0 0 0 2410.28 0 0 0 0 0 0 0 -2205.95 -404.447 0 0 0 0 0.02 0 0 0 0 0 0 0 2413.94 0 0 0 
0 -178.915 519.654 0 -532.014 -58.8244 0 0 0 2199.7 0 0 0 2171.01 1533.02 0 0 0 0 0 643.101 0 0 0 0 793.71 0 0 0 2436.22 0 0 0 0 786.386 0 0 111.011 0 0 0 0 0 -326.472 18.2348 0 0 0 0 0 433.134 0 1180.99 0 0 0 0 0 
0 0 0 971.023 0 0 0 0 0 0 0 0 0 0 0 0 0 2362.06 0 0 -2454.68 0 0 2458.95 0 0 2419.58 0 350.429 0 0 -1441.47 0 1035.11 0 -500.122 0 0 954.39 1298.03 0 0 2290.49 0 0 194.479 0 0 0.01 0 -1270.87 -1571.93 0 -750.984 -255.516 0 0 0 
0 0 0 0 0 -362.026 1270.26 0 -2034.59 0 0 0 0 0 0 2307.73 -1841.56 0 0 2300.56 0 0 2097.16 0 0 0 -1454.44 0 365.993 0 0 0 0 0 0 1259.12 0 0 -1459.32 0 0 0 0 0 0 0 0 0 0 0.06 -301.599 870.464 -1264.92 -1056.47 1578.8 0 0 0 
0 2015.21 1920.61 0 0 0 0 0 0 0 -14.5726 0 0 -2265.62 -1461.76 0 2243.03 0 0 0 0 0 0 0 0 0 0 0 344.172 -1.60222 0 0 0 -2498.63 0 0 -860.698 0 0 0 0 0 0 0 0 0 0 1366.54 1580.02 -461.058 0.04 0 0 0 0 613.651 0 0 
1177.94 0 -750.374 0 1721.47 0 0 0 1375.55 161.214 1583.99 0 0 -322.199 0 -1907.18 0 -1244.93 870.922 0 2156.06 0 0 0 -1532.26 0 0 0 1579.26 -1.29704 0 0 0 0 0 0 0 1987.29 0 0 0 0 0 -1459.78 0 2128.13 0 0 1320.46 -2382.96 0 0.03 0 0 -1324.58 0 0 255.821 
0 0 0 0 0 1824.63 0 0 -162.74 63.097 0 0 0 1937.09 0 0 0 0 0 0 0 0 0 -49.8215 0 0 0 0 0 1779.92 0 672.399 0 0 -756.478 0 0 0 0 867.87 1497.47 0 0 0 0 -2058.85 0 1621.52 0 -1531.19 0 0 0.01 135.578 470.061 1045.95 0 0 
0 1774.27 0 -27.8481 1183.89 -58.977 0 0 0 0 0 -1212.27 0 0 0 0 -948.286 850.78 0 -81.7133 2414.55 -2442.63 1723.91 0 0 0 140.004 0 0 2309.72 0 0 0 0 -2426.6 0 0 0 -1895.28 1584.6 0 2143.39 0 0 0 300.378 0 0 -568.941 2395.32 0 0 -167.928 0.05 0 1218.83 0 0 
92.3948 -989.029 701.086 1715.37 0 0 0 2311.24 0 0 0 -781.655 -1020.92 -850.78 679.571 0 0 -1923.51 0 0 0 0 0 0 0 0 0 0 0 0 -1644.87 0 -974.837 0 0 0 0 0 0 0 1651.43 0 0 0 0 506.836 245.598 0 -522.401 -57.4511 0 2133.32 1835.76 0 0.07 2237.69 -923.261 1747.11 
0 0 -1755.35 1881.85 1862.62 -231.559 0 0 1623.51 0 0 0 0 0 0 0 0 698.95 227.744 0 0 1101.34 0 0 0 -103.381 0 674.078 0 0 1515.02 0 0 0 0 -6.33259 0 0 0 0 0 -118.03 0 0 1176.87 -700.476 0 0 0 0 -2088.46 0 -1824.02 -617.313 -534.15 0.05 -1732.31 0 
1956.16 0 0 0 0 0 0 0 0 0 0 0 2197.56 1318.93 0 767.312 0 -2045.12 1316.8 0 0 0 0 0 0 0 1399.04 0 1848.12 0 0 0 0 0 0 -340.968 0 0 0 0 0 0 0 0 0 0 0 0 0 0 0 0 0 0 -2086.78 1694.16 0.03 0 
0 0 0 0 0 0 0 -1736.58 0 0 0 0 0 0 0 0 0 0 0 0 551.088 0 0 0 0 87.817 0 0 0 0 0 0 0 0 0 0 0 0 0 -2302.85 -44.6333 -1274.68 0 1778.39 0 0 0 0 0 0 0 2431.03 0 0 1358.61 0 0 0.02 
