*Vertices 72
*Matrix 
0.01 -1882.46 0 0 1123.31 241.325 0 -850.932 0 0 0 0 0 0 0 0 0 0 -9.38444 0 0 0 712.683 0 0 0 0 0 0 0 0 0 1301.08 0 0 0 0 0 0 2291.86 0 0 479.98 0 0 0 0 0 0 0 0 0 0 0 2033.83 0 0 0 0 0 0 0 0 0 0 0 0 0 0 0 0 0 
2129.35 0.03 1265.68 0 0 1031.14 0 -38.377 0 -816.904 0 0 0 0 0 0 0 -1088.06 0 0 0 135.426 0 0 0 1852.24 0 2466.43 0 0 0 0 0 -56.2304 0 -1071.28 0 0 0 0 0 0 0 0 0 0 0 0 0 0 0 0 0 0 0 0 0 0 0 0 0 0 0 0 0 0 0 0 0 0 0 0 
0 -1680.43 0.04 -631.657 0 0 150.99 0 0 0 0 0 0 0 1796.09 0 0 0 0 2360.38 0 0 0 0 0 0 0 0 0 0 0 0 0 0 1496.55 0 1103.63 0 -1279.26 0 0 0 0 -2206.72 0 0 0 0 -172.658 2134.08 0 0 0 0 0 0 0 1751.08 0 0 0 0 0 2390.13 0 0 0 0 0 0 0 0 
0 0 2491.45 0.06 0 0 0 0 0 0 0 0 0 0 0 0 0 0 0 0 0 0 0 0 0 0 0 0 0 0 0 0 -74.8466 0 0 0 571.23 0 0 0 0 0 0 0 295.038 2330.01 0 0 0 -1764.66 0 0 0 0 0 0 0 0 0 0 0 0 0 0 0 0 0 0 0 0 0 0 
2405.85 0 0 0 0.06 0 0 0 0 0 0 567.873 0 1380.89 0 0 -1768.17 0 0 0 0 0 0 0 329.829 0 0 0 0 0 1061.36 0 0 0 0 0 0 0 0 0 0 0 0 0 0 0 0 0 0 0 0 0 0 1281.4 0 0 0 0 0 0 0 0 0 0 0 0 0 2452.85 0 0 0 0 
2025.59 -64.0126 0 0 0 0.02 -1034.2 588.473 0 0 0 0 0 0 0 0 0 0 0 0 0 0 0 0 0 0 0 0 0 0 0 0 1852.4 0 0 0 0 0 0 588.626 0 0 0 0 -1362.58 1995.38 0 0 0 0 0 0 0 0 0 0 0 0 0 -2350.46 0 2189.47 0 0 0 0 0 0 0 0 0 0 
0 0 1723.46 0 0 -2284.54 0.01 0 0 -125.66 0 -944.777 0 0 0 0 0 -329.829 0 1543.09 0 0 0 0 0 0 0 0 0 0 0 0 0 0 0 0 0 0 0 0 0 0 1342.59 0 0 0 0 0 0 0 0 0 0 0 0 0 0 0 0 0 0 0 0 0 0 0 0 0 0 0 0 0 
1141.62 1786.94 0 0 0 42.6496 0 0.03 1720.4 0 0 0 -2325.43 0 0 0 0 0 0 0 0 0 -2077.93 -794.778 0 0 0 0 0 0 0 0 0 0 0 0 0 0 0 0 0 0 1988.2 0 2403.41 0 0 0 0 1557.13 0 0 1189.99 0 0 0 0 0 1635.87 0 0 0 0 0 0 0 0 0 0 0 0 0 
0 0 0 0 0 0 0 902.814 0.03 0 0 0 0 0 0 0 0 0 1372.95 0 0 0 0 0 2410.28 0 0 0 0 2266.99 0 0 0 0 0 0 0 0 0 0 0 817.82 0 0 0 0 0 0 0 -693.304 0 0 0 0 0 0 0 0 0 0 0 -1312.37 0 0 0 0 0 0 0 0 0 0 
0 686.132 0 0 0 0 -1840.65 0 0 0.01 0 0 0 0 909.528 0 0 0 0 0 0 0 0 0 0 0 0 0 0 0 0 0 0 -984.756 0 0 0 0 0 0 0 0 0 0 0 0 0 0 0 -555.513 0 0 0 0 0 0 0 264.214 0 0 1700.42 0 0 -271.691 0 609.531 0 0 0 0 0 0 
0 0 0 0 0 0 0 0 0 0 0.08 0 0 380.49 0 0 863.598 0 -13.657 0 0 0 0 0 0 0 0 0 0 0 0 2392.42 -1604.74 0 0 0 0 0 0 0 0 0 0 0 0 0 0 0 0 0 0 0 0 0 0 0 0 0 0 0 0 -848.796 0 0 0 0 2289.42 0 0 0 0 0 
0 0 0 0 -739.082 0 1003.37 0 0 0 0 0.04 0 0 0 -435.118 0 0 0 0 0 0 0 0 0 0 1545.53 0 -2265.47 0 0 0 0 0 1690.19 0 -1948.68 0 0 0 -911.359 0 0 0 0 0 0 0 0 0 0 0 0 0 1377.99 0 2196.34 0 0 0 0 0 -1315.27 0 0 0 0 0 0 0 0 0 
0 0 0 0 0 0 0 -2445.52 0 0 0 0 0.04 0 117.115 0 -1061.66 0 0 0 0 0 0 0 0 0 0 0 0 1318.63 0 0 2265.77 -1948.68 242.241 0 0 0 0 0 0 0 0 0 0 227.287 0 0 0 0 0 0 2044.82 0 0 0 0 0 0 0 0 0 0 0 0 0 0 0 0 0 0 0 
0 0 0 0 -2434.39 0 0 0 0 0 -937.3 0 0 0 0 0 -1206.17 0 0 0 0 0 0 0 0 0 0 0 0 0 0 0 0 1691.87 0 0 2181.23 584.658 1077.07 0 0 2338.56 0 0 0 1670.05 0 227.897 0 0 0 190.054 0 -1598.79 0 0 0 -2089.07 0 -415.738 0 0 -1950.21 0 0 1157.49 0 161.977 0 0 -742.592 0 
0 0 1712.32 0 0 0 0 0 0 639.897 0 0 -1190.3 0 0.05 0 0 0 0 0 0 2133.47 0 0 0 0 0 2435.61 -155.416 0 1179.01 0 0 0 0 0 0 0 0 0 0 0 0 0 0 0 0 -913.495 0 0 2008.5 -1456.11 -1300.47 0 0 0 0 0 0 0 0 610.752 0 0 0 0 0 0 0 0 0 0 
0 0 0 0 0 0 0 0 0 0 0 -1045.64 0 0 0 0.03 0 0 0 0 0 0 0 0 0 0 0 0 0 0 0 0 0 0 0 0 0 0 0 0 0 0 0 0 -542.39 0 0 0 -1520.97 1571.93 0 0 795.694 0 0 -616.855 0 0 0 1909.77 0 0 343.562 0 0 0 0 -167.928 0 0 0 0 
0 0 0 0 118.183 0 0 0 0 0 244.682 0 2216.64 -642.491 0 0 0.05 0 0 0 -2180.47 0 0 0 0 0 0 0 0 0 0 0 0 0 0 0 0 555.666 0 0 0 0 0 0 2293.54 0 0 0 0 0 0 0 0 0 0 0 0 0 0 -121.998 2220.45 0 0 0 0 -1023.51 0 0 0 0 0 0 
0 1906.42 0 0 0 0 1918.78 0 0 0 0 0 0 0 0 0 0 0.01 0 0 0 0 0 -146.107 0 0 0 0 0 0 0 0 0 0 0 0 0 -2031.08 0 1790.29 0 1455.05 0 0 0 613.804 0 0 0 0 0 0 0 -1413.54 0 0 0 0 2395.32 0 0 0 0 0 1891.16 0 0 -2209.62 0 0 0 0 
802.866 0 0 0 0 0 0 0 1532.87 0 2067.71 0 0 0 0 0 0 0 0.09 0 0 0 0 0 -1213.19 0 0 0 0 0 0 -541.627 0 0 0 0 0 0 0 0 0 0 0 0 0 0 0 0 1952.5 0 0 1868.27 0 0 713.752 0 0 0 0 0 0 2478.64 1751.99 0 0 0 0 0 0 0 0 0 
0 0 37.7667 0 0 0 -710.089 0 0 0 0 0 0 0 0 0 0 0 0 0.05 0 0 0 0 0 -368.892 1503.72 0 0 0 0 0 0 0 0 145.802 0 0 0 0 0 493.866 0 0 0 0 0 0 0 0 0 0 2454.22 0 0 0 1799.75 0 0 0 0 0 0 0 0 0 14.42 0 0 0 0 0 
0 0 0 0 0 0 0 0 0 0 0 0 0 0 0 0 1188.16 0 0 0 0.04 -808.512 0 -1197.47 0 0 0 0 1855.3 0 0 0 1552.1 0 0 0 0 0 0 -2380.06 0 2456.21 0 -1869.64 0 0 0 -2162.47 0 0 0 0 253.533 0 0 0 0 0 1420.1 0 0 62.3341 0 0 0 0 0 0 0 0 0 0 
0 -281.304 0 0 0 0 0 0 0 0 0 0 0 0 -1541.11 0 0 0 0 0 1638.31 0.08 0 0 0 0 0 0 0 0 0 0 0 0 0 0 0 0 1526.31 0 0 0 0 0 1397.21 0 0 0 0 1670.05 0 0 0 0 0 0 0 0 0 0 0 0 0 0 0 0 0 0 -921.583 0 0 0 
331.355 0 0 0 0 0 0 2189.93 0 0 0 0 0 0 0 0 0 0 0 0 0 0 0 0 0 0 0 -1904.74 0 0 2322.99 0 1706.98 0 0 0 0 0 1493.35 368.892 0 -1823.1 0 0 0 -2329.55 0 0 -75.1518 0 0 0 0 0 1326.26 678.045 0 0 0 0 0 0 -2003.01 0 0 0 0 0 0 -1865.52 2065.87 0 
0 0 0 0 0 0 0 1194.88 0 0 0 0 0 0 0 0 0 -689.489 0 0 1504.79 0 0 0.01 0 0 0 0 0 0 0 0 0 0 0 0 0 0 0 0 0 0 0 0 0 0 0 0 0 0 0 0 0 0 -1797.46 0 -952.864 1991.71 0 0 -2400.2 0 0 2074.57 0 0 -63.7074 1393.4 0 0 0 0 
0 0 0 0 -1374.63 0 0 0 -1027.48 0 0 0 0 0 0 0 0 0 2192.98 0 0 0 0 0 0 0 0 0 0 0 692.999 0 0 0 0 0 0 0 0 151.296 0 -383.694 886.181 2287.59 0 0 0 0 0 1821.42 0 0 0 0 0 0 0 0 0 -746.712 0 0 0 0 0 0 0 0 0 0 0 0 
0 -717.414 0 0 0 0 0 0 0 0 0 0 0 0 0 0 0 0 0 2343.13 0 0 0 0 0 0.03 0 -2475.89 -2407.99 0 0 0 0 0 0 0 692.541 0 0 0 0 0 2442.93 0 0 0 2325.89 0 701.697 0 0 -1045.95 0 0 0 1914.5 0 0 0 0 0 0 0 0 0 0 0 0 0 -1404.39 0 0 
0 0 0 0 0 0 0 0 0 0 0 -660.344 0 0 0 0 0 0 0 -382.626 0 0 0 0 0 0 0.01 0 0 0 0 0 0 0 0 0 0 0 0 0 0 0 0 0 0 -1658.6 2165.67 0 0 0 0 0 0 213.095 0 0 0 0 1998.43 -50.5844 0 0 0 0 0 0 0 0 0 0 0 0 
0 -2201.38 0 0 0 0 0 0 0 0 0 0 0 0 980.331 0 0 0 0 0 0 0 -1590.4 0 0 180.135 0 0.01 0 0 0 0 0 1713.54 0 0 0 1104.39 1715.83 0 0 0 0 0 0 0 0 0 0 0 0 0 204.398 0 0 0 0 0 0 0 0 778.909 0 0 1199.3 0 0 0 0 0 0 0 
0 0 0 0 0 0 0 0 0 0 0 385.678 0 0 -89.4955 0 0 0 0 0 1580.48 0 0 0 0 1689.73 0 0 0.01 -840.709 0 0 760.445 -1134.14 0 0 0 0 -1068.22 0 0 0 0 0 0 108.722 0 935.774 2020.25 0 0 0 0 0 0 0 0 0 0 0 0 0 0 0 -2409.67 0 0 0 0 0 0 0 
0 0 0 0 0 0 0 0 638.218 0 0 0 1201.13 0 0 0 0 0 0 0 0 0 0 0 0 0 0 0 977.126 0.01 0 0 0 0 0 0 0 0 0 0 0 0 0 0 0 2135.61 0 0 0 2022.23 0 0 0 0 0 0 0 0 0 0 0 0 2439.88 0 0 0 0 0 0 0 0 0 
0 0 0 0 105.518 0 0 0 0 0 0 0 0 0 1170.46 0 0 0 0 0 0 0 -860.851 0 419.095 0 0 0 0 0 0.09 0 0 0 0 0 0 1470.61 0 0 0 0 0 0 0 0 0 0 0 0 -150.685 0 0 0 0 0 0 0 0 0 0 0 0 0 -1281.85 0 0 0 0 0 0 0 
0 0 0 0 0 0 0 0 0 0 1389.89 0 0 0 0 0 0 0 615.787 0 0 0 0 0 0 0 0 0 0 0 0 0.05 0 0 0 0 0 0 0 0 0 0 -1717.51 -1419.34 0 0 0 0 0 0 504.7 0 1975.54 0 0 0 0 0 2072.74 0 0 0 0 0 0 -261.467 0 0 0 0 0 0 
-716.803 0 0 1358.61 0 -1117.66 0 0 0 0 558.412 0 -699.255 0 0 0 0 0 0 0 1847.06 0 -18.2348 0 0 0 0 0 1418.88 0 0 0 0.03 0 0 0 0 518.281 1781.75 0 0 0 0 0 0 0 0 0 0 0 0 0 0 0 0 0 0 0 86.2911 -642.491 0 0 0 -561.769 2144.31 0 0 837.199 0 0 0 0 
0 2438.81 0 0 0 0 0 0 0 899.304 0 0 2080.22 942.488 0 0 0 0 0 0 0 0 0 0 0 0 0 -664.006 118.03 0 0 0 0 0.04 0 0 0 788.217 0 0 0 0 0 -1572.85 0 0 0 -1450.16 0 0 0 0 0 0 0 0 0 0 0 0 0 0 0 0 0 0 0 -402.31 0 0 0 0 
0 0 2415.92 0 0 0 0 0 0 0 0 587.405 317.011 0 0 0 0 0 0 0 0 0 0 0 0 0 0 0 0 0 0 0 0 0 0.06 0 1915.11 0 0 0 0 0 -14.1148 159.078 0 0 0 0 0 0 0 0 698.798 2392.12 0 0 0 0 0 1269.95 277.032 0 1759.32 0 0 0 0 0 0 0 0 0 
0 -567.263 0 0 0 0 0 0 0 0 0 0 0 0 0 0 0 0 0 1312.52 0 0 0 0 0 0 0 0 0 0 0 0 0 0 0 0.03 0 0 0 0 0 0 0 0 0 0 -1879.86 0 0 1363.95 0 0 0 0 1031.91 -1336.18 0 0 1549.65 0 0 0 1994.92 0 0 0 0 0 0 0 0 0 
0 0 1967.91 -1232.72 0 0 0 0 0 0 0 -244.224 0 564.821 0 0 0 0 0 0 0 0 0 0 0 -1142.54 0 0 0 0 0 0 0 0 185.324 0 0.08 0 0 0 0 0 -2272.48 0 0 2120.96 -722.755 2027.88 356.38 1966.08 0 0 65.9963 -2427.21 0 0 0 0 0 0 0 253.838 944.929 416.959 0 0 0 0 0 0 0 0 
0 0 0 0 0 0 0 0 0 0 0 0 0 -21.2867 0 0 1941.66 689.337 0 0 0 0 0 0 0 0 0 1396.76 0 0 -2207.79 0 25.5593 2399.14 0 0 0 0.09 0 0 -976.516 0 0 0 0 0 0 0 0 0 0 0 0 0 0 0 0 0 1953.57 0 0 0 0 0 0 0 0 0 0 0 0 0 
0 0 -1900.62 0 0 0 0 0 0 0 0 0 0 2259.51 0 0 0 0 0 0 0 -1922.59 2495.73 0 0 0 0 -256.584 1992.78 0 0 0 2169.33 0 0 0 0 0 0.02 0 -2247.31 0 0 0 0 0 0 -1820.2 0 -1877.88 0 0 0 0 0 0 0 0 0 0 0 -1173.36 0 1620 0 0 0 0 0 0 0 0 
2424.31 0 0 0 0 119.709 0 0 0 0 0 0 0 0 0 0 0 -2186.57 0 0 448.546 0 2120.35 0 -2188.86 0 0 0 0 0 0 0 0 0 0 0 0 0 0 0.05 0 0 0 0 0 0 0 0 1043.81 0 0 0 0 0 0 1226.77 0 0 0 0 0 0 0 0 0 0 0 0 0 0 0 0 
0 0 0 0 0 0 0 0 0 0 0 -1750.01 0 0 0 0 0 0 0 0 0 0 0 0 0 0 0 0 0 0 0 0 0 0 0 0 0 2480.77 -675.909 0 0.03 1904.43 0 -1666.54 0 0 0 0 543.153 -1394.01 0 0 1711.25 0 0 0 0 -358.974 0 0 0 0 0 0 0 0 0 0 0 0 0 0 
0 0 0 0 0 0 0 0 259.789 0 0 0 0 1402.25 0 0 0 1779.46 0 -1150.01 -69.8111 0 -183.95 0 -108.57 0 0 0 0 0 0 0 0 0 0 0 0 0 0 0 2075.49 0.06 0 0 0 0 0 0 2295.07 0 0 0 0 0 0 0 0 0 0 0 0 0 0 0 -1400.88 0 0 0 0 0 0 0 
1346.55 0 0 0 0 0 1878.64 -1872.54 0 0 0 0 0 0 0 0 0 0 0 0 0 0 0 0 599.155 -285.577 0 0 0 0 0 1733.38 0 0 537.965 0 -2040.39 0 0 0 0 0 0.04 0 0 0 0 0 0 0 0 0 0 0 0 2222.28 0 0 0 0 0 -850.322 0 0 0 246.208 0 0 0 0 0 -1443.14 
0 0 328.608 0 0 0 0 0 0 0 0 0 0 0 0 0 0 0 0 0 1223.72 0 0 0 -1722.69 0 0 0 0 0 0 1868.27 0 -947.371 -16.5563 0 0 0 0 0 1283.07 0 0 0 0 0 0 0 0 241.63 0 0 0 0 0 0 1741 0 0 0 0 0 0 0 0 0 0 0 0 0 0 0 
0 0 0 1055.1 0 -1044.42 0 2145.99 0 0 0 0 0 0 0 1069.14 2325.13 0 0 0 0 -1142.84 0 0 0 0 0 0 0 0 0 0 0 0 0 0 0 0 0 0 0 0 0 0 0.09 0 0 0 0 0 0 0 0 -808.206 -203.787 0 0 0 0 0 0 0 0 0 0 -1677.68 0 0 0 0 0 0 
0 0 0 1001.08 0 1847.51 0 0 0 0 0 0 1766.79 1067 0 0 0 1749.24 0 0 0 0 1535.46 0 0 0 -2118.37 0 436.644 -1741.61 0 0 0 0 0 0 -643.712 0 0 0 0 0 0 0 0 0.02 0 0 0 0 0 0 0 0 0 0 0 0 0 -2185.81 0 0 0 0 0 0 284.814 0 0 0 0 0 
0 0 0 0 0 0 0 0 0 0 0 0 0 0 0 0 0 0 0 0 0 0 0 0 0 346.004 1168.48 0 0 0 0 0 0 0 0 942.946 2307.73 0 0 0 0 0 0 0 0 0 0.06 0 0 0 0 0 0 0 0 0 558.87 0 0 0 0 0 0 543.611 0 0 0 -1203.12 0 0 0 1069.44 
0 0 0 0 0 0 0 0 0 0 0 0 0 1987.29 2366.63 0 0 0 0 0 584.201 0 0 0 0 0 0 0 1031.3 0 0 0 0 1027.94 0 0 -2095.93 0 1339.23 0 0 0 0 0 0 0 0 0.09 0 0 0 0 0 0 0 0 0 0 0 0 0 180.441 0 0 0 2081.29 -192.648 0 0 0 0 0 
0 0 -989.792 0 0 0 0 0 0 0 0 0 0 0 0 429.167 0 0 526.978 0 0 0 -406.583 0 0 2335.2 0 0 -2034.29 0 0 0 0 0 0 0 2352.44 0 0 -469.756 -1701.33 1973.4 0 0 0 0 0 0 0.02 0 0 1028.55 0 0 0 0 0 0 0 0 0 0 0 0 0 0 647.526 0 0 0 0 0 
0 0 -1096.15 96.2096 0 0 0 103.839 -202.567 2363.28 0 0 0 0 0 2431.33 0 0 0 0 0 -1717.05 0 0 1180.23 0 0 0 0 -1689.73 0 0 0 0 0 490.661 -1103.78 0 -1020.16 0 1309.93 0 0 875.652 0 0 0 0 0 0.08 0 0 0 0 0 2383.57 450.377 0 0 0 588.778 0 0 0 0 0 0 0 0 0 0 0 
0 0 0 0 0 0 0 0 0 0 0 0 0 0 2031.85 0 0 0 0 0 0 0 0 0 0 0 0 0 0 0 922.346 2099.75 0 0 0 0 0 0 0 0 0 0 0 0 0 0 0 0 0 0 0.05 0 0 0 0 0 0 0 0 0 0 0 0 0 0 0 1672.8 0 0 0 0 0 
0 0 0 0 0 0 0 0 0 0 0 0 0 300.073 634.861 0 0 0 1576.82 0 0 0 0 0 0 1819.13 0 0 0 0 0 0 0 0 0 0 0 0 0 0 0 0 0 0 0 0 0 0 -663.549 0 0 0.05 0 0 0 0 0 0 0 0 0 0 0 0 0 0 0 0 0 0 0 0 
0 0 0 0 0 0 0 1386.23 0 0 0 0 -912.275 0 1704.84 -854.289 0 0 0 -492.492 2227.93 0 0 0 0 0 0 -2024.37 0 0 0 -558.107 0 0 1167.41 0 -449.919 0 0 0 -417.875 0 0 0 0 0 0 0 0 0 0 0 0.01 0 1101.64 0 0 0 -893.506 0 0 0 680.181 0 0 0 0 0 0 0 0 0 
0 0 0 0 1066.09 0 0 0 0 0 0 0 0 1878.49 0 0 0 532.472 0 0 0 0 0 0 0 0 -2380.52 0 0 0 0 0 0 0 132.984 0 310.907 0 0 0 0 0 0 0 2228.39 0 0 0 0 0 0 0 0 0.05 0 0 0 0 0 0 0 0 0 0 0 0 0 0 0 0 0 0 
-440.764 0 0 0 0 0 0 0 0 0 0 -825.755 0 0 0 0 0 0 -2267.75 0 0 0 944.166 2224.11 0 0 0 0 0 0 0 0 0 0 0 887.555 0 0 0 0 0 0 0 0 -773.263 0 0 0 0 0 0 0 1204.49 0 0.05 0 0 0 0 0 0 0 0 0 1799.75 0 0 0 0 0 0 0 
0 0 0 0 0 0 0 0 0 0 0 0 0 0 0 -483.032 0 0 0 0 0 0 1201.44 0 0 -808.512 0 0 0 0 0 0 0 0 0 1436.43 0 0 0 883.282 0 0 -412.229 0 0 0 0 0 0 395.291 0 0 0 0 0 0.05 0 0 0 0 0 0 0 0 0 0 0 1390.5 0 0 0 0 
0 0 0 0 0 0 0 0 0 0 0 1115.99 0 0 0 0 0 0 0 2356.41 0 0 0 2061.75 0 0 0 0 0 0 0 0 0 0 0 0 0 0 0 0 0 0 0 2491.61 0 0 2414.4 0 0 1630.68 0 0 0 0 0 0 0 0 -1842.02 0 0 0 0 0 0 0 0 0 2220.3 0 79.577 0 
0 0 497.375 0 0 0 0 0 0 399.869 0 0 0 1904.28 0 0 0 0 0 0 0 0 0 1426.05 0 0 0 0 0 0 0 0 0 0 0 0 0 0 0 0 -525.605 0 0 0 0 0 0 0 0 0 0 0 0 0 0 0 0 0.06 0 0 0 0 -1068.38 -199.21 0 0 0 0 0 0 0 0 
0 0 0 0 0 0 0 -1767.4 0 0 0 0 0 0 0 0 0 2091.81 0 0 -1305.35 0 0 0 0 0 -123.829 0 0 0 0 1547.21 -234.153 0 0 1098.9 0 50.5844 0 0 0 0 0 0 0 0 0 0 0 0 0 0 1666.69 0 0 0 1134.6 0 0.03 0 2017.65 1638.31 0 0 0 2051.38 0 0 0 0 0 0 
0 0 0 0 0 -17.6244 0 0 0 0 0 0 0 -1482.51 0 99.5666 -759.072 0 0 0 0 0 0 0 1197.16 0 2384.49 0 0 0 0 0 633.03 0 1645.79 0 0 0 0 0 0 0 0 0 0 -180.135 0 0 0 0 0 0 0 0 0 0 0 0 0 0.09 0 0 0 0 1179.62 0 0 0 0 0 0 0 
0 0 0 0 0 0 0 0 0 -1036.48 0 0 0 0 0 0 2485.2 0 0 0 0 0 0 1437.65 0 0 0 0 0 0 0 0 0 0 1937.85 0 0 0 0 0 0 0 0 0 0 0 0 0 0 2077.62 0 0 0 0 0 0 0 0 -1907.18 0 0.06 0 0 0 0 0 0 0 0 0 0 0 
0 0 0 0 0 -1159.32 0 0 1986.07 0 763.039 0 0 0 2482.45 0 0 0 -1947.16 0 -2398.98 0 0 0 0 0 0 -518.433 0 0 0 0 0 0 0 0 -850.78 0 1665.93 0 0 0 2257.99 0 0 0 0 906.934 0 0 0 0 0 0 0 0 0 0 1572.39 0 0 0.05 0 0 -803.781 0 0 0 0 0 0 0 
0 0 0 0 0 0 0 0 0 0 0 -232.78 0 -920.057 0 2465.21 0 0 401.547 0 0 0 128.101 0 0 0 0 0 0 2417.6 0 0 0 0 1217.61 1231.04 1527.83 0 0 0 0 0 0 0 0 0 0 0 0 0 0 0 1943.04 0 0 0 0 -514.466 0 0 0 0 0.02 0 0 0 0 0 0 0 0 0 
0 0 816.752 0 0 0 0 0 0 830.79 0 0 0 0 0 0 0 0 0 0 0 0 0 603.58 0 0 0 0 0 0 0 0 1818.52 0 0 0 -746.406 0 961.257 0 0 0 0 0 0 0 0.228889 0 0 0 0 0 0 0 0 0 0 453.887 0 0 0 0 0 0.05 0 0 0 0 0 0 0 0 
0 0 0 0 0 0 0 0 0 0 0 0 0 0 0 0 0 1025.19 0 0 0 0 0 0 0 0 0 -637.455 838.115 0 1007.03 0 -2134.85 0 0 0 0 0 0 0 0 486.694 0 0 0 0 0 0 0 0 0 0 0 0 504.547 0 0 0 0 658.513 0 1290.09 0 0 0.07 0 1169.7 0 0 0 0 0 
0 0 0 0 0 0 0 0 0 2392.42 0 0 0 -1653.72 0 0 2087.24 0 0 0 0 0 0 0 0 0 0 0 0 0 0 2499.54 0 0 0 0 0 0 0 0 0 0 -207.755 0 1942.43 0 0 -585.879 0 0 0 0 0 0 0 0 0 0 966.292 0 0 0 0 0 0 0.09 0 0 0 0 0 0 
0 0 0 0 0 0 0 0 0 0 968.276 0 0 0 0 0 0 0 0 843.455 0 0 0 43.1074 0 0 0 0 0 0 0 0 0 0 0 0 0 0 0 0 0 0 0 0 0 1965.16 0 -2373.65 2360.07 0 26.3222 0 0 0 0 0 0 0 0 0 0 0 0 0 1668.52 0 0.02 0 0 0 0 0 
0 0 0 0 -1224.63 0 0 0 0 0 0 0 0 887.249 0 782.418 0 -21.2867 0 0 0 0 0 369.961 0 0 0 0 0 0 0 0 2173.91 -1926.71 0 0 0 0 0 0 0 0 0 0 0 0 2307.43 0 0 0 0 0 0 0 0 -320.521 0 0 0 0 0 0 0 0 0 0 0 0.05 0 0 0 0 
0 0 0 0 0 0 0 0 0 0 0 0 0 0 0 0 0 0 0 0 0 1687.75 0 0 0 0 0 0 0 0 0 0 0 0 0 0 0 0 0 0 0 0 0 0 0 0 0 0 0 0 0 0 0 0 0 0 1536.84 0 0 0 0 0 0 0 0 0 0 0 0.09 0 0 0 
0 0 0 0 0 0 0 0 0 0 0 0 0 0 0 0 0 0 0 0 0 0 1077.53 0 0 2074.27 0 0 0 0 0 0 0 0 0 0 0 0 0 0 0 0 0 0 0 0 0 0 0 0 0 0 0 0 0 0 0 0 0 0 0 0 0 0 0 0 0 0 0 0.04 0 0 
0 0 0 0 0 0 0 0 0 0 0 0 0 615.787 0 0 0 0 0 0 0 0 -464.415 0 0 0 0 0 0 0 0 0 0 0 0 0 0 0 0 0 0 0 0 0 0 0 0 0 0 0 0 0 0 0 0 0 2226.86 0 0 0 0 0 0 0 0 0 0 0 0 0 0.05 0 
0 0 0 0 0 0 0 0 0 0 0 0 0 0 0 0 0 0 0 0 0 0 0 0 0 0 0 0 0 0 0 0 0 0 0 0 0 0 0 0 0 0 2244.1 0 0 0 305.872 0 0 0 0 0 0 0 0 0 0 0 0 0 0 0 0 0 0 0 0 0 0 0 0 0.02 
