*Vertices 61
*Matrix 
0.08 0 0 0 0 0 0 0 828.349 1346.86 0 0 0 0 0 -1637.85 683.844 0 0 0 0 0 -411.008 -1651.89 0 0 546.663 0 0 0 0 0 0 0 0 0 0 0 0 0 1219.75 1724.52 0 -2447.81 0 0 0 0 336.085 0 0 1195.79 0 1823.4 0 0 0 0 0 614.414 -1216.24 
0 0.07 2104.63 0 0 2364.96 0 0 0 0 -1572.08 0 1879.86 0 911.054 0 0 0 0 0 0 0 0 2032.61 0 0 1230.28 0 0 0 1612.06 0 1059.98 0 0 0 0 2012.92 0 0 0 0 -555.666 0 0 0 0 0 -1072.34 0 -529.42 0 0 0 2197.26 0 0 0 2073.5 0 0 
0 -490.204 0.03 0 -322.504 0 0 126.118 -709.174 0 0 0 0 0 1724.98 0 0 0 0 -1267.66 0 0 0 0 0 2380.37 0 0 0 0 253.838 0 0 0 0 355.464 0 0 0 0 0 0 0 0 0 0 0 0 0 2045.43 0 0 2345.27 0 0 0 396.664 0 0 -419.553 0 
0 0 0 0.02 2108.45 0 0 67.6748 0 0 0 700.171 2201.68 -133.137 0 0 1123.46 0 0 -1788.92 0 834.91 0 0 0 0 0 -1482.51 -2348.93 0 0 1809.21 -1721.17 0 0 0 0 2066.94 0 0 855.205 0 0 0 0 0 2331.08 0 0 0 0 0 0 0 0 0 0 0 0 -2484.28 0 
0 0 -813.852 -2172.69 0.04 0 0 0 -563.906 0 1027.79 0 0 0 -1150.47 0 0 0 934.858 0 0 0 0 733.131 0 -493.103 0 0 0 0 1702.4 0 0 0 0 0 0 1203.12 0 0 2453.31 0 0 0 0 0 2345.12 0 0 0 0 0 0 0 0 -1123.77 0 0 -2007.43 0 -477.233 
0 2428.28 0 0 0 0.02 -101.093 0 0 0 0 0 1926.56 0 0 0 0 0 1555.3 0 0 0 0 0 -483.337 0 0 0 0 0 0 0 0 -2097.61 0 0 0 0 0 2312.92 0 536.592 0 -1269.65 -1796.55 -1463.74 0 2375.33 0 0 629.368 0 0 0 0 -710.395 -239.952 0 0 0 0 
0 0 0 0 0 982.009 0.06 0 0 0 1697.67 0 0 0 0 0 1517 0 0 0 0 0 -500.58 0 0 1416.75 0 0 0 -1680.12 0 1681.8 0 2432.86 0 0 0 0 1984.54 0 0 0 0 0 0 0 0 0 0 0 0 0 0 0 0 -1518.22 0 -2031.85 138.325 0 0 
0 0 -803.476 756.02 0 0 0 0.07 -1170.16 0 -914.563 0 0 0 120.014 0 403.684 0 1797.46 0 0 -30.2896 0 -179.678 0 2208.4 0 0 0 -1419.03 0 0 -460.143 0 1110.64 0 1269.34 0 1924.57 0 0 0 0 1905.35 0 0 0 0 0 0 255.211 0 0 0 0 0 0 0 0 0 0 
-149.007 0 1355.1 0 332.575 0 0 -2293.39 0.06 0 0 0 0 0 0 0 0 0 0 1580.32 0 0 0 0 0 0 0 0 0 429.014 0 0 0 0 670.415 0 0 0 0 0 0 0 0 0 0 0 0 0 0 0 0 0 0 0 0 0 0 0 0 110.401 0 
1329.77 0 0 0 0 0 0 0 0 0 0 739.998 0 -997.116 0 0 0 0 0 0 0 79.8822 0 0 0 -1275.29 0 0 270.013 1785.87 0 0 0 0 -1515.93 0 0 2086.78 0 0 0 0 0 0 0 0 0 0 0 0 0 0 0 0 0 0 0 0 0 0 0 
0 1315.12 0 0 -1185.42 0 2257.23 2046.65 0 0 0.02 0 371.029 -455.107 0 2462.92 0 2097 -1728.03 0 0 0 0 0 0 0 0 0 0 0 0 0 0 0 0 0 868.175 -2318.87 1270.87 0 0 0 0 0 1935.26 0 0 1774.73 0 0 0 0 0 0 -1110.49 0 0 0 0 0 0 
0 0 0 -2420.8 0 0 0 0 0 1025.04 0 0.01 0 0 0 0 0 506.989 0 0 0 0 0 0 0 802.866 0 0 0 1396.15 0 0 0 0 0 624.18 0 943.861 -1097.83 0 1554.08 954.695 0 0 0 0 0 0 0 -1586.43 0 0 0 0 0 0 0 0 0 0 0 
0 1898.94 0 987.808 0 2335.35 0 0 0 0 881.756 0 0.05 0 -709.937 0 2253.26 0 0 0 0 1407.9 0 0 0 0 0 1049 0 1242.03 0 0 0 0 2257.68 0 0 0 0 0 0 0 0 0 0 -2140.64 0 0 -1028.86 0 0 0 0 0 828.959 0 -1374.63 -306.635 0 0 0 
0 0 0 2167.65 0 0 0 0 0 -1753.97 784.249 0 0 0.01 -265.893 0 2469.63 0 0 0 148.091 0 0 0 0 -1664.1 0 0 0 413.144 0 0 0 0 0 0 0 0 0 0 0 0 0 0 0 0 0 0 0 0 0 0 0 0 0 1929.3 0 0 0 0 0 
0 1740.39 -1669.74 0 -402.158 0 0 2266.69 0 0 0 0 818.583 -511.414 0.02 0 0 0 0 0 0 0 -849.406 0 0 0 2016.59 1415.22 0 0 0 0 0 -1827.83 955.153 0 0 0 0 0 0 0 0 0 0 -365.535 0 0 0 0 0 0 0 0 0 -1479.31 1261.1 0 0 0 0 
460.601 0 0 0 0 0 0 0 0 0 1169.39 0 0 0 0 0.06 0 2260.89 0 0 0 0 0 0 0 0 0 0 2490.69 0 435.881 0 1924.57 712.989 0 -2431.79 0 1777.93 0 -2.67037 0 0 -19.9133 0 0 0 0 0 -2164.3 8.1637 0 0 0 0 0 0 0 0 0 0 2195.58 
2384.79 0 0 550.478 0 0 1420.26 -93.3103 0 0 0 0 1635.87 1135.06 0 0 0.02 0 0 0 0 2321.16 0 75.3044 0 0 0 0 0 0 0 0 0 0 0 0 0 1234.24 0 645.085 0 -206.687 0 0 0 0 0 906.018 0 0 0 0 794.168 0 0 0 0 0 0 0 0 
0 0 0 0 0 0 0 0 0 0 -764.565 139.546 0 0 0 2224.27 0 0.09 0 0 0 0 0 0 0 2435 0 0 0 0 0 0 -297.479 2217.7 1948.68 0 0 0 0 2247.92 2243.8 -255.211 0 0 -1363.19 0 0 0 0 0 0 0 -1954.02 0 0 0 0 0 0 0 1963.64 
0 0 0 0 1847.67 767.922 0 207.602 0 0 78.9666 0 0 0 0 0 0 0 0.08 -58.6718 0 2425.08 0 2261.65 0 -430.082 341.578 0 0 0 0 -866.649 0 0 0 0 0 1290.86 0 1023.51 0 1626.41 669.805 0 0 0 0 0 0 0 0 0 0 0 0 643.254 0 0 0 0 0 
0 0 -2423.09 -95.7518 0 0 0 0 -927.534 0 0 0 0 0 0 0 0 0 1202.96 0.03 0 0 214.316 0 0 2422.18 311.67 0 0 -1013.44 0 0 0 0 0 1636.33 0 2238.15 0 -1592.68 0 0 0 0 0 -725.501 0 0 0 0 0 0 0 0 0 0 0 0 0 0 -1490.3 
0 0 0 0 0 0 0 0 0 0 0 0 0 517.67 0 0 0 0 0 0 0.05 0 0 0 2308.95 0 2126 0 -436.186 0 2310.48 0 2016.59 2387.54 0 0 0 0 0 0 0 0 0 0 0 0 0 -390.408 0 0 0 0 0 0 0 0 0 0 0 0 0 
0 0 0 438.932 0 0 0 203.94 0 2386.78 0 0 -192.343 0 0 0 -1325.34 0 2020.25 0 0 0 -1579.1 1359.98 0 -1444.52 0 0 0 0 0 0 552.614 0 0 805.765 0 0 0 1794.72 0 0 0 0 1784.49 0 724.128 0 -1912.98 0 0 0 0 0 0 0 1796.24 0 0 0 0 
2221.82 0 0 0 0 0 1669.44 0 0 0 0 0 0 0 2043.75 0 0 0 0 -1982.1 0 -763.344 0.09 0 0 0 0 0 0 0 0 0 139.546 -348.292 1860.79 2461.24 0 1523.87 0 -1221.58 0 0 -1755.2 -1113.24 0 0 -2367.85 0 0 0 0 0 0 0 0 0 0 0 0 0 0 
-988.418 1296.96 0 0 -534.455 0 0 2453.15 0 0 0 0 0 0 0 0 1449.71 0 2213.74 0 0 -1949.29 0 0.02 2050.46 0 0 0 0 0 0 0 0 -2248.83 0 1429.72 -1213.19 -359.584 0 0 0 0 0 726.569 0 0 0 0 0 0 0 0 0 0 0 0 0 0 0 0 0 
0 0 0 0 0 -845.286 0 0 0 0 0 0 0 0 0 0 0 0 0 0 2217.86 0 0 749.611 0.04 0 0 0 0 0 0 1379.21 0 -1038.93 0 0 0 0 0 0 0 0 635.014 0 0 0 0 0 0 1781.9 0 0 0 0 0 0 0 1834.09 503.021 0 0 
0 0 -1154.74 0 -25.8644 0 1174.12 644.932 0 2252.04 0 -2103.56 0 934.248 0 0 0 -1992.78 719.55 -1360.74 0 -1100.12 0 0 0 0.04 786.386 0 0 0 1390.96 0 -1734.44 0 0 57.1459 1046.4 2110.89 0 0 2467.5 0 0 0 0 0 0 0 0 0 0 0 0 0 0 0 0 0 0 0 0 
676.824 -67.98 0 0 0 0 0 0 0 0 0 0 0 0 -1225.24 0 0 0 -2201.68 1126.67 673.467 0 0 0 0 1067.16 0 1342.59 -2201.99 0 0 0 0 2187.03 2158.5 0 2147.82 0 0 0 0 -1153.07 0 0 0 0 0 0 0 0 0 0 -318.537 0 0 0 0 0 0 15.183 1560.49 
0 0 0 1611 0 0 0 0 0 0 0 0 -2025.74 0 1351.13 0 0 0 0 0 0 0 0 0 0 0 2170.55 0.09 0 0 759.529 1090.81 0 0 0 0 0 345.851 0 0 -2254.33 0 0 0 0 0 0 0 0 0 0 0 0 -329.676 0 0 0 0 2095.48 -1573.61 0 
0 0 0 1807.38 0 0 0 0 0 2377.62 0 0 0 0 0 652.409 0 0 0 0 1995.83 0 0 0 0 0 -2290.34 0 0.06 0 0 1290.09 -2392.73 0 0 0 0 0 2146.14 0 0 0 0 0 0 0 0 0 0 0 301.447 0 2295.07 0 -708.869 0 0 0 0 0 0 
0 0 0 0 0 0 -747.78 673.467 951.949 1078.75 0 -1061.66 1195.64 493.103 0 0 0 0 0 594.882 0 0 0 0 0 0 0 0 0 0.07 0 0 1480.68 1207.69 0 1833.32 0 0 0 0 0 0 0 2362.97 0 0 0 -1878.19 0 0 0 0 0 0 0 0 0 0 267.571 0 0 
0 775.399 647.069 0 158.62 0 0 0 0 0 0 0 0 0 0 30.137 0 0 0 0 108.417 0 0 0 0 1211.2 0 738.166 0 0 0.02 359.584 587.1 0 0 0 0 0 0 0 0 0 0 0 0 0 0 0 0 0 0 0 0 0 0 0 0 0 0 0 0 
0 0 0 -2030.02 0 0 -1448.48 0 0 0 0 0 0 0 0 0 0 0 2154.99 0 0 0 0 0 2106.92 0 0 -999.405 1663.18 0 2115.01 0.06 0 0 0 360.042 0 0 0 705.512 1116.29 -713.294 0 0 712.989 0 0 0 0 0 0 0 0 1603.21 0 0 0 0 0 0 0 
0 -820.566 0 2367.09 0 0 0 -1061.2 0 0 0 0 0 0 0 -1527.07 0 -1571.32 0 0 1206.78 564.821 -989.486 0 0 -2028.18 0 0 332.27 1651.28 24.3385 0 0.05 0 0 2394.25 0 0 0 0 784.249 0 0 0 0 0 0 0 0 368.435 0 0 0 0 0 0 0 0 0 533.998 0 
0 0 0 0 0 1048.69 1753.97 0 0 0 0 0 0 0 -300.226 385.83 0 2096.24 0 0 592.135 0 1846.75 -1243.71 1290.86 0 -2281.64 0 0 349.971 0 0 0 0.07 2259.36 -1071.28 1252.4 0 0 0 783.639 -1795.33 0 570.62 0 0 470.061 0 0 57.4511 0 -2357.94 -1532.11 0 -515.381 0 0 0 0 0 0 
0 0 0 0 0 0 0 2393.49 1025.35 395.138 0 0 1018.48 0 329.524 0 0 -1899.7 0 0 0 0 -2254.33 0 0 0 404.599 0 0 0 0 0 0 -773.11 0.07 0 0 0 0 0 0 0 0 0 0 0 0 -143.056 0 0 0 0 0 0 0 1167.87 0 0 -531.404 1740.09 0 
0 0 2124.32 0 0 0 0 0 0 0 0 2487.64 0 0 0 -2041 0 0 0 -1686.38 0 961.409 1890.7 1332.36 0 1430.17 0 0 0 -600.986 0 -2023 1881.08 1623.36 0 0.09 0 0 0 0 0 0 0 0 0 0 0 0 0 0 0 0 0 0 0 0 0 -510.193 0 0 0 
0 0 0 0 0 0 0 -1728.19 0 0 2011.4 0 0 0 0 0 0 0 0 0 0 0 0 1497.31 0 300.531 -2339.78 0 0 0 0 0 0 790.811 0 0 0.03 0 0 0 1557.44 0 0 0 0 0 0 0 -1746.8 0 0 1099.05 0 0 0 0 0 0 0 0 0 
0 1295.43 0 -927.839 1523.56 0 0 0 0 79.2718 -767.464 1977.98 0 0 0 967.818 55.1622 0 1833.17 -723.823 0 0 185.018 172.506 0 1528.9 0 778.451 0 0 0 0 0 0 0 0 0 0.01 1072.5 1774.73 0 1165.73 0 0 0 0 0 0 0 0 0 0 0 0 0 0 0 -1245.08 0 0 0 
0 0 0 0 0 0 1988.05 -1554.23 0 0 2153.61 1852.24 0 0 0 0 0 0 0 0 0 0 0 0 0 0 0 0 2075.79 0 0 0 0 0 0 0 0 58.977 0.01 48.4481 0 841.624 0 0 0 0 0 0 0 0 0 0 0 0 0 0 0 0 0 0 0 
0 0 0 0 0 -32.2733 0 0 0 0 0 0 0 0 0 -101.245 1547.36 2349.85 509.583 -2237.08 0 916.242 2066.94 0 0 0 0 0 0 0 0 1488.77 0 0 0 0 0 -1591.77 1700.11 0.06 0 0 0 0 0 -1649.45 1959.52 0 0 0 -1549.81 0 0 0 0 -1897.87 0 0 0 0 0 
493.713 0 0 542.848 2033.37 0 0 0 0 0 0 -2416.53 0 0 0 0 0 1771.37 0 0 0 0 0 0 0 1009.93 0 2346.03 0 0 0 604.953 230.491 2311.09 0 0 2298.73 0 0 0 0.02 -145.344 0 0 -859.478 0 0 0 0 0 0 0 0 0 0 1707.13 0 0 -1573.46 0 0 
1040.15 0 0 0 0 708.869 0 0 0 0 0 2329.4 0 0 0 0 1433.53 2415.92 637.455 0 0 0 0 0 0 0 -2398.53 0 0 0 0 -841.929 0 -17.6244 0 0 0 2429.5 812.479 0 1688.36 0.02 0 0 0 0 0 0 0 0 0 0 1788 0 0 0 0 0 0 0 0 
0 2155.14 0 0 0 0 0 0 0 0 0 0 0 0 0 2345.12 0 0 -71.0318 0 0 0 1364.56 0 -1819.28 0 0 0 0 0 0 0 0 0 0 0 0 0 0 0 0 0 0.09 0 0 0 727.18 0 0 0 0 0 0 0 0 0 0 0 0 0 0 
2003.46 0 0 0 0 1177.02 0 1351.44 0 0 0 0 0 0 0 0 0 0 0 0 0 0 804.849 2310.17 0 0 0 0 0 1959.36 0 0 0 -1619.69 0 0 0 0 0 0 0 0 0 0.09 -1835.61 0 0 0 0 -1372.95 0 -1739.78 0 0 0 0 0 0 0 -363.552 0 
0 0 0 0 0 -595.95 0 0 0 0 1308.25 0 0 0 0 0 0 2021.62 0 0 0 1741.77 0 0 0 0 0 0 0 0 0 -409.94 0 0 0 0 0 0 0 0 465.178 0 0 -532.624 0.06 0 0 0 0 0 0 0 0 770.363 0 0 0 0 -2351.53 0 0 
0 0 0 0 0 667.211 0 0 0 0 0 0 1939.83 0 -2268.06 0 0 0 0 64.1652 0 0 0 0 0 0 0 0 0 0 0 0 0 0 0 0 0 0 0 2026.81 0 0 0 0 0 0 0 0 0 0 0 0 1446.81 0 0 0 0 0 0 0 0 
0 0 0 942.64 2003.31 0 0 0 0 0 0 0 0 0 0 0 0 0 0 0 0 -1489.07 2039.02 0 0 0 0 0 0 0 0 0 0 -2289.88 0 0 0 0 0 -426.267 0 0 2112.42 0 0 0 0.01 0 0 0 0 0 0 0 0 0 0 0 437.101 0 0 
0 0 0 0 0 416.349 0 0 0 0 -2297.81 0 0 0 0 0 1931.59 0 0 0 2433.93 0 0 0 0 0 0 0 0 1239.74 0 0 0 0 -561.617 0 0 0 0 0 0 0 0 0 0 0 0 0.04 0 0 0 0 0 0 0 0 0 0 0 0 0 
-2390.9 1390.96 0 0 0 0 0 0 0 0 0 0 836.436 0 0 1074.18 0 0 0 0 0 1433.07 0 0 0 0 0 0 0 0 0 0 0 0 0 0 -51.6526 0 0 0 0 0 0 0 0 0 0 0 0.07 0 0 0 0 0 0 0 0 0 0 0 0 
0 0 2298.73 0 0 0 0 0 0 0 0 -1209.83 0 0 0 2237.24 0 0 0 0 0 0 0 0 1692.94 0 0 0 0 0 0 0 1574.68 -651.646 0 0 0 0 0 0 0 0 0 -1797.16 0 0 0 0 0 0.07 0 0 0 0 0 0 0 0 0 0 0 
0 1978.59 0 0 0 -828.959 0 1039.69 0 0 0 0 0 0 0 0 0 0 0 0 0 0 0 0 0 0 0 0 821.329 0 0 0 0 0 0 0 0 0 0 255.364 0 0 0 0 0 0 0 0 0 0 0 1241.57 0 1880.93 0 0 0 0 0 0 1711.1 
1137.2 0 0 0 0 0 0 0 0 0 0 0 0 0 0 0 0 0 0 0 0 0 0 0 0 0 0 0 0 0 0 0 0 -1658.6 0 0 2454.99 0 0 0 0 0 0 -346.461 0 0 0 0 0 0 1931.9 0.09 0 0 2025.59 0 -2221.98 319.3 0 0 0 
0 0 1757.33 0 0 0 0 0 0 0 0 0 0 0 0 0 1040.76 69.8111 0 0 0 0 0 0 0 0 631.657 0 389.645 0 0 0 0 -1107.75 0 0 0 0 0 0 0 -299.158 0 0 0 38.8348 0 0 0 0 0 0 0.06 0 0 0 0 0 0 0 0 
-1422.54 0 0 0 0 0 0 0 0 0 0 0 0 0 0 0 0 0 0 0 0 0 0 0 0 0 0 2138.51 0 0 0 654.546 0 0 0 0 0 0 0 0 0 0 0 0 -281.61 0 0 0 0 0 1807.84 0 0 0.04 0 837.046 0 0 0 0 0 
0 2303.92 0 0 0 0 0 0 0 0 1006.88 0 -889.843 0 0 0 0 0 0 0 0 0 0 0 0 0 0 0 601.444 0 0 0 0 -787.301 0 0 0 0 0 0 0 0 0 0 0 0 0 0 0 0 0 -1640.14 0 0 0.03 0 0 0 1832.87 792.337 0 
0 0 0 0 -162.74 728.858 1829.36 0 0 0 0 0 0 2293.24 -682.775 0 0 0 -1056.02 0 0 0 0 0 0 0 0 0 0 0 0 0 0 0 -165.334 0 0 0 0 -656.682 1187.86 0 0 0 0 0 0 0 0 0 0 0 0 1633.43 0 0.05 0 0 0 0 75.7622 
0 0 -2194.51 0 0 2102.34 0 0 0 0 0 0 -1054.19 0 2270.35 0 0 0 0 0 0 -1662.11 0 0 0 0 0 0 0 0 0 0 0 0 0 0 0 0 0 0 0 0 0 0 0 0 0 0 0 0 0 898.694 0 0 0 0 0.02 2472.69 0 0 0 
0 0 0 0 0 0 1536.38 0 0 0 0 0 -1942.27 0 0 0 0 0 0 0 0 0 0 0 1464.81 0 0 0 0 0 0 0 0 0 0 1281.85 0 1603.37 0 0 0 0 0 0 0 0 0 0 0 0 0 -1591.01 0 0 0 0 66.1489 0.08 0 0 1216.39 
0 -156.789 0 0 948.286 0 -1204.64 0 0 0 0 0 0 0 0 0 0 0 0 0 0 0 0 0 -451.75 0 0 383.236 0 -1097.06 0 0 0 0 -2133.93 0 0 0 0 0 1939.99 0 0 0 1853.31 0 2033.37 0 0 0 0 0 0 0 1854.53 0 0 0 0 0 0 
1085.47 0 1545.23 2154.38 0 0 0 0 2392.73 0 0 0 0 0 0 0 0 0 0 0 0 0 0 0 0 0 853.679 238.578 0 0 0 0 1077.38 0 641.881 0 0 0 0 0 0 0 0 -1728.49 0 0 0 0 0 0 0 0 0 0 1788.31 0 0 0 0 0 0 
1640.29 0 0 0 -1258.96 0 0 0 0 0 0 0 0 0 0 2415.92 0 -537.812 0 1415.22 0 0 0 0 0 0 279.931 0 0 0 0 0 0 0 0 0 0 0 0 0 0 0 0 0 0 0 0 0 0 0 638.676 0 0 0 0 227.287 0 -427.641 0 0 0.05 
