*Vertices 64
*Matrix 
0.02 0 0 0 0 0 0 0 0 0 0 0 0 0 0 0 1782.05 0 435.423 0 0 0 0 0 0 0 0 0 0 2416.53 -1049.15 0 0 0 0 0 0 0 69.5059 0 0 0 0 -108.57 1697.82 2051.84 0 0 0 0 0 -1643.8 1480.83 0 -1425.14 127.186 0 0 0 681.86 0 0 0 0 
0 0 1214.71 0 0 0 0 0 0 0 0 0 0 0 330.744 0 0 0 0 0 0 0 0 0 0 0 0 0 0 743.355 0 0 0 0 0 0 0 895.489 0 0 1889.78 0 0 0 0 0 0 0 0 0 0 0 0 0 0 0 0 0 0 0 0 0 0 0 
0 -80.7978 0 0 0 0 0 0 0 0 0 0 0 0 1787.24 0 0 0 1010.7 0 0 0 0 653.935 0 0 0 0 0 -1782.36 0 1694.92 0 0 0 0 0 0 0 0 0 0 0 0 -786.538 497.681 0 0 0 0 0 0 0 0 0 0 0 0 -2366.48 0 0 0 0 0 
0 0 0 0.06 0 0 807.138 0 1565.68 0 0 0 0 -2084.34 0 0 0 0 0 0 0 0 1245.99 0 0 0 0 0 0 0 -873.211 0 0 0 0 0 0 0 0 1066.55 0 0 0 0 0 0 2146.9 0 0 0 0 0 0 0 0 0 0 0 441.984 0 0 0 0 0 
0 0 0 0 0.05 0 0 0 0 0 0 0 0 0 2291.25 0 0 0 0 0 0 0 0 0 -236.747 0 961.257 0 0 -180.135 0 0 0 0 0 0 0 2104.18 0 0 0 0 0 786.386 0 0 0 0 0 -1142.38 0 0 0 0 0 -774.483 0 0 -1615.42 0 774.026 0 0 0 
0 0 0 0 0 0.03 2318.26 945.692 0 0 0 0 0 0 0 0 0 0 0 1232.87 0 2390.74 0 0 0 0 0 0 0 0 0 0 2151.94 0 -1367.46 0 0 0 0 0 1786.32 0 0 0 0 0 0 0 0 0 -1353.11 0 0 0 0 0 1755.2 0 0 0 0 0 0 0 
0 0 0 2317.65 0 2358.55 0 693.762 0 0 0 0 0 0 0 0 0 0 0 0 0 0 0 0 0 0 0 0 0 0 0 0 0 1392.48 728.248 0 0 0 -1076.01 2069.08 0 0 0 0 0 0 0 0 0 160.298 0 0 644.627 0 0 0 0 0 0 0 0 0 0 0 
0 0 0 0 0 -1166.8 1708.04 0.04 1490.6 0 0 -29.6793 0 0 0 0 0 0 0 0 0 0 0 -429.472 1790.44 0 -609.226 0 0 0 0 0 0 0 0 0 0 0 0 0 0 0 0 0 0 0 0 0 0 0 0 0 0 0 0 0 0 0 0 0 0 0 0 0 
0 0 0 -199.82 0 0 0 931.043 0 0 0 0 0 0 0 0 0 0 0 0 0 0 0 0 0 0 0 0 0 0 0 0 0 0 0 0 -127.491 141.987 0 0 0 -567.568 0 0 0 0 0 0 0 0 0 0 0 0 0 0 225.761 1120.87 0 0 0 0 0 0 
0 0 0 0 0 0 0 0 0 0.02 0 0 0 -1309.32 0 0 0 0 0 0 0 0 0 0 0 0 0 0 0 -38.377 0 0 0 0 0 554.292 0 0 0 0 -2222.89 0 0 0 0 0 0 0 0 0 0 0 0 0 2270.2 0 0 0 0 0 0 0 0 0 
0 0 0 0 0 0 0 0 0 0 0.05 0 0 0 0 0 -455.87 0 -830.943 0 0 0 0 0 0 0 -140.309 0 0 -2466.73 0 0 0 0 0 0 0 0 1690.19 0 0 0 0 0 0 0 0 0 0 0 0 0 0 0 0 0 1155.96 1945.94 0 0 0 0 0 0 
0 0 0 0 0 0 0 -376.37 0 0 0 0.03 -411.008 0 0 0 0 0 1867.96 2237.69 0 0 0 0 1750.77 0 0 0 0 -710.089 0 0 0 0 0 0 0 0 0 0 0 0 0 0 0 0 0 1758.86 0 0 0 0 0 591.22 -579.775 0 0 0 1056.78 0 0 0 0 0 
0 0 0 0 0 0 0 0 0 0 0 442.289 0.03 0 0 -1979.96 -37.6141 0 0 0 2084.95 0 0 0 0 2281.95 0 0 0 0 0 0 0 0 -676.977 0 0 0 0 0 0 0 0 -749.458 0 0 0 -210.501 -457.549 0 0 0 0 1447.26 0 0 0 0 0 0 0 0 0 0 
0 0 0 291.223 0 0 0 0 0 -423.978 0 0 0 0.03 0 0 0 0 0 0 0 0 2131.64 0 0 0 -705.054 0 0 0 0 0 0 0 0 0 0 0 0 0 0 0 829.417 0 0 537.812 0 0 1816.23 0 0 0 0 0 0 0 2296.14 0 -1883.37 0 0 0 0 0 
0 2303.77 -312.738 0 2369.53 0 0 0 0 0 0 0 0 0 0.06 0 2468.57 456.786 0 0 0 0 0 0 0 0 1685.92 0 0 -180.593 0 0 0 0 0 0 0 0 1079.82 0 0 0 0 -2202.75 0 0 0 1091.88 0 0 0 0 0 0 0 0 0 0 1165.58 0 0 0 0 0 
0 0 0 0 0 0 0 0 0 0 0 0 -383.236 0 0 0.04 0 0 0 1487.7 0 973.464 0 -20.9815 0 0 0 0 0 0 0 0 0 75.457 0 0 0 0 0 0 0 -536.286 0 0 0 0 0 0 0 0 0 0 0 0 645.543 0 0 0 0 0 0 0 0 0 
-566.5 0 0 0 0 0 0 0 0 0 -2116.69 0 -1346.4 0 1852.7 0 0.04 0 0 0 0 0 2024.22 0 0 0 0 0 1032.52 0 0 0 -1838.97 1372.95 0 -75.1518 0 -824.686 0 0 0 0 2316.58 0 0 -126.27 0 0 0 0 0 0 298.547 2050.61 0 0 0 0 0 0 0 0 0 0 
0 0 0 0 0 0 0 0 0 0 0 0 0 0 -68.1326 0 0 0.06 0 0 0 0 0 0 0 0 0 0 0 0 0 1725.9 0 0 0 0 0 0 0 0 0 0 0 0 0 0 0 0 -1997.36 0 0 0 0 0 0 0 0 2252.34 0 0 0 0 0 0 
101.398 0 44.9385 0 0 0 0 0 0 0 492.95 -942.488 0 0 0 0 0 0 0.04 1688.97 0 0 0 0 0 0 761.513 0 0 0 0 0 0 0 0 1592.07 789.285 0 0 0 0 0 0 1033.43 522.401 0 0 1247.06 0 0 0 1390.96 -1829.97 0 0 0 0 0 0 0 1728.19 0 0 0 
0 0 0 0 0 -435.728 0 0 0 0 0 1597.57 0 0 0 -2304.07 0 0 -2057.79 0.08 0 0 0 0 0 0 0 0 0 0 0 -1854.84 0 0 0 0 0 0 0 0 0 0 952.254 0 0 0 0 0 0 0 0 0 2278.44 0 0 0 0 2313.68 0 0 0 0 0 0 
0 0 0 0 0 0 0 0 0 0 0 0 2110.43 0 0 0 0 0 0 0 0.05 0 0 0 0 0 0 -344.02 -1498.38 0 0 0 0 0 0 0 0 0 0 0 0 0 0 0 0 0 1775.34 0 0 0 0 0 0 136.799 0 0 0 0 0 0 0 0 0 0 
0 0 0 0 0 -336.085 0 0 0 0 0 0 0 0 0 -294.122 0 0 0 0 0 0 0 0 0 0 0 82.7815 0 0 0 0 0 0 0 0 0 0 1437.5 2283.93 0 0 0 0 0 0 0 0 0 0 0 0 0 92.7 0 0 0 0 0 0 0 0 1863.84 0 
0 0 0 1714 0 0 0 0 0 0 0 0 0 1674.63 0 0 1595.28 0 0 0 0 0 0.09 0 0 -1222.34 1846.9 0 0 0 0 0 0 0 0 0 0 0 -531.709 0 0 0 0 0 0 0 0 0 0 0 0 0 -1225.55 -2284.84 0 -279.931 0 0 0 2156.36 0 0 0 0 
0 0 -1556.98 0 0 0 0 910.138 0 0 0 0 0 0 0 -1172.29 0 0 0 0 0 0 0 0.05 0 0 0 0 0 1780.22 2371.82 0 0 1719.79 0 0 0 1209.83 0 0 0 0 0 0 0 0 0 0 0 0 0 0 0 0 0 0 0 0 -153.89 2118.21 0 0 0 0 
0 0 0 0 -626.774 0 0 1181.75 0 0 0 -607.242 0 0 0 0 0 0 0 0 0 0 0 0 0.01 0 0 0 0 0 0 0 0 0 0 0 0 0 2357.33 -1627.02 561.464 0 0 0 0 0 0 0 0 0 0 0 0 0 0 0 0 0 930.891 0 0 0 0 0 
0 0 0 0 0 0 0 0 0 0 0 0 -332.575 0 0 0 0 0 0 0 0 0 1257.9 0 0 0.03 374.996 0 0 0 0 0 0 0 0 0 -2347.41 0 0 0 0 0 0 0 0 0 0 0 0 0 0 0 0 0 0 0 1799.14 0 0 986.435 0 0 0 0 
0 0 0 0 -995.438 0 0 -1040.91 0 0 2026.81 0 0 -1194.27 33.7992 0 0 0 986.282 0 0 0 2322.53 0 0 -420.164 0.08 0 0 0 0 0 0 0 0 0 0 0 0 0 0 0 0 0 0 0 0 0 0 1699.96 0 -688.269 0 0 0 0 0 34.7148 0 0 0 0 0 0 
0 0 0 0 0 0 0 0 0 0 0 0 0 0 0 0 0 0 0 0 2060.99 2193.44 0 0 0 0 0 0.05 0 0 0 1984.24 0 0 0 0 786.233 0 0 981.552 0 0 1154.44 -2183.37 0 0 0 0 0 0 0 0 0 0 0 0 0 0 0 -238.884 0 0 0 0 
0 0 0 0 0 0 0 0 0 0 0 0 0 0 0 0 -28.0007 0 0 0 2068.93 0 0 0 0 0 0 0 0 0 0 0 100.024 2156.51 862.224 0 0 0 0 0 0 0 0 -797.83 0 0 468.841 628.147 0 0 0 0 1909.31 0 0 0 0 0 0 0 0 0 0 0 
-1465.88 1195.94 -917.768 0 -1172.75 0 0 0 0 2346.64 -1323.51 1217.31 0 0 -1911.3 0 0 0 0 0 0 0 0 -2223.5 0 0 0 0 0 0.08 0 0 0 0 0 0 0 0 0 2453.46 0 0 0 0 0 0 0 0 0 0 0 0 0 0 0 0 275.506 0 0 2021.62 0 0 0 0 
2411.95 0 0 -634.709 0 0 0 0 0 0 0 0 0 0 0 0 0 0 0 0 0 0 0 -2048.02 0 0 0 0 0 0 0.05 0 0 0 0 0 0 0 0 2338.56 0 0 0 0 0 0 0 1271.63 0 981.399 0 0 0 0 0 2072.59 0 0 0 0 0 0 0 2211.75 
0 0 -703.833 0 0 0 0 0 0 0 0 0 0 0 0 0 0 -1617.56 0 385.372 0 0 0 0 0 0 0 -550.935 0 0 0 0.04 0 0 0 2349.54 0 2175.13 0 0 0 0 0 0 0 0 0 0 0 2438.05 0 353.023 0 0 0 0 0 0 0 0 0 0 0 0 
0 0 0 0 0 814.615 0 0 0 0 0 0 0 0 0 0 589.389 0 0 0 0 0 0 0 0 0 0 0 1219.44 0 0 0 0.07 0 0 0 0 0 336.543 0 0 1178.85 0 0 0 0 0 0 1128.65 -2415.92 0 0 0 0 0 0 0 0 0 0 0 0 0 0 
0 0 0 0 0 0 6.18 0 0 0 0 0 0 0 0 -2366.79 741.981 0 0 0 0 0 0 -2351.53 0 0 0 0 -1348.69 0 0 0 0 0.08 0 0 0 0 1642.89 0 0 2178.03 0 2101.43 0 0 0 0 0 0 0 0 0 0 0 0 0 0 0 0 0 0 0 0 
0 0 0 0 0 1098.74 1339.53 0 0 0 0 0 632.878 0 0 0 0 0 0 0 0 0 0 0 0 0 0 0 -778.298 0 0 0 0 0 0.09 -441.069 0 -1673.56 0 0 0 0 0 0 0 0 0 0 0 985.824 -1636.17 579.012 0 0 0 0 0 0 1350.98 0 0 0 0 0 
0 0 0 0 0 0 0 0 0 -2399.75 0 0 0 0 0 0 1766.49 0 2095.02 0 0 0 0 0 0 0 0 0 0 0 0 1773.2 0 0 933.79 0.02 0 0 0 -1659.06 0 0 0 0 0 0 0 0 0 0 0 0 0 0 0 0 0 0 0 0 0 0 0 0 
0 0 0 0 0 0 0 0 1199.3 0 0 0 0 0 0 0 0 0 699.713 0 0 0 0 0 0 -1724.22 0 1060.44 0 0 0 0 0 0 0 0 0.02 0 0 0 0 0 0 0 0 0 0 0 0 0 1928.69 0 0 0 0 0 0 0 0 2489.17 0 0 0 0 
0 2147.82 0 0 -1198.23 0 0 0 1735.66 0 0 0 0 0 0 0 1563.23 0 0 0 0 0 0 -433.897 0 0 0 0 0 0 0 -2050.92 0 0 1522.34 0 0 0.03 404.752 0 0 0 0 0 0 0 0 0 0 0 0 0 1602.45 0 0 0 0 0 0 0 0 0 0 0 
1551.94 0 0 0 0 0 -1453.06 0 0 0 459.075 0 0 0 -2309.11 0 0 0 0 0 0 2125.84 31.3578 0 -1099.81 0 0 0 0 0 0 0 144.429 1216.85 0 0 0 -989.639 0.05 -90.5637 0 0 0 0 805.307 0 0 0 0 0 0 0 0 0 0 0 0 0 0 0 0 0 0 0 
0 0 0 164.724 0 0 1612.22 0 0 0 0 0 0 0 0 0 0 0 0 0 0 -1543.4 0 0 -270.165 0 0 2150.87 0 1843.7 2444.61 0 0 0 0 1268.73 0 0 2318.26 0.09 0 0 2360.53 0 2156.36 0 0 1254.84 0 0 0 0 0 0 0 0 0 0 0 0 -346.614 0 0 0 
0 913.8 0 0 0 113.605 0 0 0 2040.24 0 0 0 0 0 0 0 0 0 0 0 0 0 0 1486.48 0 0 0 0 0 0 0 0 0 0 0 0 0 0 0 0.09 0 0 0 0 0 0 0 0 0 0 0 -1614.2 0 0 0 0 0 0 0 0 0 0 0 
0 0 0 0 0 0 0 0 -518.128 0 0 0 0 0 0 -2062.06 0 0 0 0 0 0 0 0 0 0 0 0 0 0 0 0 2105.09 -250.328 0 0 0 0 0 0 0 0.03 -1181.75 0 0 0 0 0 0 0 840.098 -1221.12 0 0 0 0 0 0 0 2311.09 0 0 0 0 
0 0 0 0 0 0 0 0 0 0 0 0 0 -301.599 0 0 746.254 0 0 929.518 0 0 0 0 0 0 0 -2330.01 0 0 0 0 0 0 0 0 0 0 0 2221.06 0 507.447 0.01 0 0 0 0 0 0 0 0 0 0 533.082 0 0 0 0 0 2310.63 0 0 0 0 
-1505.25 0 0 0 -2162.77 0 0 0 0 0 0 0 1327.17 0 -490.509 0 0 0 1215.63 0 0 0 0 0 0 0 0 -262.383 1202.05 0 0 0 0 2152.85 0 0 0 0 0 0 0 0 0 0.08 0 895.489 0 0 0 0 0 0 0 0 0 0 0 0 0 0 0 0 0 0 
1700.72 0 2494.51 0 0 0 0 0 0 0 0 0 0 0 0 0 0 0 -1031.3 0 0 0 0 0 0 0 0 0 0 0 0 0 0 0 0 0 0 0 -1371.43 1997.21 0 0 0 0 0.09 0 0 0 0 0 0 0 0 0 0 0 -52.2629 0 0 0 0 0 0 0 
-1087.45 0 2212.67 0 0 0 0 0 0 0 0 0 0 386.898 0 0 1924.27 0 0 0 0 0 0 0 0 0 0 0 0 0 0 0 0 0 0 0 0 0 0 0 0 0 0 1441.16 0 0.08 0 0 0 -690.71 0 2343.29 0 0 0 0 0 0 0 0 0 0 0 0 
0 0 0 -900.677 0 0 0 0 0 0 0 0 0 0 0 0 0 0 0 0 -1221.73 0 0 0 0 0 0 0 -563.143 0 0 0 0 0 0 0 0 0 0 0 0 0 0 0 0 0 0.04 0 0 2274.01 0 0 0 0 0 0 0 -18.9978 0 0 0 0 0 0 
0 0 0 0 0 0 0 0 0 0 0 1415.07 1476.56 0 -1238.21 0 0 0 -1707.28 0 0 0 0 0 0 0 0 0 -246.666 0 2238.61 0 0 0 0 0 0 0 0 -302.057 0 0 0 0 0 0 0 0.06 0 0 2308.5 0 0 0 0 0 0 0 0 0 0 0 0 0 
0 0 0 0 0 0 0 0 0 0 0 0 -1339.84 -503.632 0 0 0 1262.78 0 0 0 0 0 0 0 0 0 0 0 0 0 0 1159.78 0 0 0 0 0 0 0 0 0 0 0 0 0 0 0 0.06 0 0 0 0 0 0 0 0 0 0 0 0 989.639 0 0 
0 0 0 0 -9.99481 0 587.863 0 0 0 0 0 0 0 0 0 0 0 0 0 0 0 0 0 0 0 352.87 0 0 0 -1350.52 -45.7015 1174.43 0 -2147.36 0 0 0 0 0 0 0 0 0 0 1511.35 1997.21 0 0 0.08 1968.83 0 634.556 0 0 0 0 0 0 0 0 0 0 0 
0 0 0 0 0 -1561.71 0 0 0 0 0 0 0 0 0 0 0 0 0 0 0 0 0 0 0 0 0 0 0 0 0 0 0 0 2465.51 0 326.167 0 0 0 0 1875.44 0 0 0 0 0 1897.11 0 -369.045 0.01 0 0 0 0 0 0 0 0 0 0 0 0 0 
492.645 0 0 0 0 0 0 0 0 0 0 0 0 0 0 0 0 0 1768.62 0 0 0 0 0 0 0 -810.495 0 0 0 0 1921.52 0 0 -1380.43 0 0 0 0 0 0 2246.39 0 0 0 1107.14 0 0 0 0 0 0.09 0 0 0 0 0 0 0 1699.04 0 0 0 0 
-1331.6 0 0 0 0 0 435.575 0 0 0 0 0 0 0 0 0 51.6526 0 542.238 -484.71 0 0 135.731 0 0 0 0 0 1987.75 0 0 0 0 0 0 0 0 1796.85 0 0 715.278 0 0 0 0 0 0 0 0 55.4674 0 0 0.03 0 0 0 0 1363.19 0 0 0 0 0 0 
0 0 0 0 0 0 0 0 0 0 0 2463.68 61.2659 0 0 0 2298.88 0 0 0 -966.445 237.053 -1731.85 0 0 0 0 0 0 0 0 0 0 0 0 0 0 0 0 0 0 0 1815.93 0 0 0 0 0 0 0 0 0 0 0.02 0 0 0 -743.507 0 0 0 0 0 0 
1649.91 0 0 0 0 0 0 0 0 1901.99 0 2384.64 0 0 0 -921.888 0 0 0 0 0 0 0 0 0 0 0 0 0 0 0 0 0 0 0 0 0 0 0 0 0 0 0 0 0 0 0 0 0 0 0 0 0 0 0.01 -581.912 0 0 -1454.13 0 0 0 0 0 
2364.19 0 0 0 1645.48 0 0 0 0 0 0 0 0 0 0 0 0 0 0 0 0 0 1035.72 0 0 0 0 0 0 0 1880.32 0 0 0 0 0 0 0 0 0 0 0 0 0 0 0 0 0 0 0 0 0 0 0 1490.91 0.05 0 0 0 1690.95 0 0 0 0 
0 0 0 0 0 1524.93 0 0 -649.51 0 2056.57 0 0 2380.83 0 0 0 0 0 0 0 0 0 0 0 -95.1415 0 0 0 -172.353 0 0 0 0 0 0 0 0 0 0 0 0 0 0 1664.4 0 0 0 0 0 0 0 0 0 0 0 0.04 -982.772 0 0 0 0 0 0 
0 0 0 0 0 0 0 0 1535.77 0 221.03 0 0 0 0 0 0 134.968 0 -2084.64 0 0 0 0 0 0 208.06 0 0 0 0 0 0 0 0 0 0 0 0 0 0 0 0 0 0 0 633.793 0 0 0 0 0 93.1578 434.812 0 0 1385.16 0.01 0 0 0 0 0 0 
0 0 134.663 987.96 -378.048 0 0 0 0 0 0 1072.04 0 353.175 853.374 0 0 0 0 0 0 0 0 -1084.7 -1006.73 0 0 0 0 0 0 0 0 0 2332.45 0 0 0 0 0 0 0 0 0 0 0 0 0 0 0 0 0 0 0 186.85 0 0 0 0.01 0 0 0 0 0 
2137.9 0 0 0 0 0 0 0 0 0 0 0 0 0 0 0 0 0 0 0 0 0 257.653 668.737 0 -2040.85 0 2114.25 0 1968.67 0 0 0 0 0 0 -163.35 0 0 0 0 1582.46 -1363.64 0 0 0 0 0 0 0 0 128.254 0 0 0 -874.889 0 0 0 0.08 0 0 0 0 
0 0 0 0 2396.69 0 0 0 0 0 0 0 0 0 0 0 0 0 1448.64 0 0 0 0 0 0 0 0 0 0 0 0 0 0 0 0 0 0 0 0 -748.848 0 0 0 0 0 0 0 0 0 0 0 0 0 0 0 0 0 0 0 0 0.04 0 0 0 
0 0 0 0 0 0 0 0 0 0 0 0 0 0 0 0 0 0 0 0 0 0 0 0 0 0 0 0 0 0 0 0 0 0 0 0 0 0 0 0 0 0 0 0 0 0 0 0 344.478 0 0 0 0 0 0 0 0 0 0 0 0 0.09 0 0 
0 0 0 0 0 0 0 0 0 0 0 0 0 0 0 0 0 0 0 0 0 384.457 0 0 0 0 0 0 0 0 0 0 0 0 0 0 0 0 0 0 0 0 0 0 0 0 0 0 0 0 0 0 0 0 0 0 0 0 0 0 0 0 0 0 
0 0 0 0 0 0 0 0 0 0 0 0 0 0 0 0 0 0 0 0 0 0 0 0 0 0 0 0 0 0 1804.94 0 0 0 0 0 0 0 0 0 0 0 0 0 0 0 0 0 0 0 0 0 0 0 0 0 0 0 0 0 0 0 0 0.06 
