*Vertices 61
*Matrix 
0.08 0 0 0 0 0 0 0 0 0 0 0 0 0 0 0 0 0 0 0 0 0 0 0 896.71 0 -205.618 0 -1326.41 0 0 0 0 0 0 0 360.805 0 0 738.014 1279.26 0 0 0 0 0 0 1849.96 0 0 0 0 0 0 558.87 0 0 0 0 0 0 
0 0.04 -1549.96 0 0 0 0 1957.69 0 0 0 0 0 0 0 0 0 0 2421.57 0 0 0 0 0 0 0 0 1087.45 0 0 0 2090.14 0 1085.16 -2272.79 0 0 0 2125.69 0 0 0 0 0 0 0 0 0 0 0 0 0 0 716.193 0 0 0 0 0 -2016.89 0 
0 -1613.9 0.05 0 0 0 2144.15 0 0 0 0 0 2457.58 0 0 0 0 0 -1439.79 0 0 0 0 0 1146.05 0 0 -568.178 0 0 -2355.49 0 0 0 0 0 0 0 -1059.68 0 0 0 0 0 0 0 0 0 0 -1136.74 0 0 0 0 0 0 0 1446.5 0 1897.11 0 
0 0 0 0.04 0 0 0 0 0 0 0 -786.233 0 0 0 0 0 0 0 0 -920.82 1620.76 0 0 0 0 0 0 0 0 0 576.571 0 0 0 -1032.98 0 0 0 0 -1430.63 0 0 0 0 0 0 0 0 0 0 1710.03 0 0 0 0 0 0 1590.55 0 0 
0 0 0 0 0.01 0 0 0 0 0 0 0 0 0 1818.98 0 0 0 0 0 0 0 0 0 0 1720.71 0 0 0 0 0 0 349.818 0 1535 0 0 0 0 -159.536 0 0 0 0 0 0 1474.43 0 0 0 0 0 0 0 0 0 0 -1697.06 0 0 0 
0 0 0 0 0 0.05 0 0 0 0 0 0 1345.03 0 0 0 0 0 0 -816.599 0 0 0 0 0 0 0 0 0 0 0 0 0 360.805 0 0 446.715 0 0 0 0 0 0 0 0 0 0 0 0 1651.28 0 0 0 0 0 131.458 0 -1141.16 0 0 0 
0 0 1783.27 0 0 0 0.08 0 0 0 0 0 0 -1415.98 0 0 0 0 0 0 0 0 0 0 0 0 0 0 0 0 0 0 0 0 0 -112.842 0 0 0 0 0 0 0 1922.13 0 0 0 0 0 0 0 0 0 0 0 0 0 0 0 0 0 
0 -131.611 0 0 0 0 0 0.01 0 0 0 0 0 0 0 0 557.344 1780.68 0 0 0 0 0 0 0 0 0 0 1694.01 0 0 0 0 0 0 0 0 0 0 0 0 0 0 0 0 0 0 0 0 0 0 0 0 0 0 0 -787.149 0 1280.79 0 0 
0 0 0 0 0 0 0 0 0.05 0 0 0.991852 0 0 0 0 0 0 0 0 656.224 0 0 0 0 -1800.67 32.1207 0 0 0 0 0 0 -1691.26 0 0 0 0 0 0 0 0 0 1807.08 0 0 0 0 0 2064.5 0 0 0 0 0 0 1879.25 0 0 0 0 
0 0 0 0 0 0 0 0 0 0.06 0 0 0 0 0 0 0 0 0 0 0 0 0 0 2411.34 0 0 934.553 0 0 0 0 0 0 0 0 0 0 -1761.91 0 0 0 0 0 969.039 0 0 0 0 0 0 0 0 0 0 0 0 0 0 0 0 
0 0 0 0 0 0 0 0 0 0 0.03 0 0 0 1056.47 0 -1600.31 0 0 0 0 0 1224.48 745.643 0 0 0 0 0 0 0 0 1264.46 0 0 0 0 0 0 471.129 -1936.78 0 0 0 635.624 0 0 0 0 0 0 0 139.393 0 0 -2398.83 0 1626.71 0 0 0 
0 0 0 339.442 0 0 0 0 1071.73 0 0 0 0 0 0 0 0 422.605 0 0 0 0 0 0 0 0 0 9.23185 0 1956.31 0 0 0 0 101.093 0 0 0 0 0 0 400.784 0 -1172.14 0 0 0 0 0 1401.33 0 0 0 -2040.39 0 0 0 0 0 0 0 
0 0 1796.4 0 0 -1583.99 0 0 0 0 0 0 0.07 1851.02 0 0 0 0 0 0 0 2495.42 0 0 0 0 0 0 -1824.78 0 0 0 0 0 0 0 0 0 0 0 0 0 0 0 0 0 0 1956.47 0 0 0 0 0 0 0 0 0 0 0 0 0 
0 0 0 0 0 0 -1062.43 0 0 0 0 0 1703.47 0.07 0 0 0 0 0 0 0 0 0 0 0 457.091 0 -633.03 0 0 0 0 -1767.4 0 0 0 0 0 2372.13 0 2340.85 0 266.045 -619.755 -844.371 1860.03 0 249.87 1262.78 0 0 0 -110.858 0 0 0 0 0 0 0 0 
0 0 0 0 2199.85 0 0 0 0 0 -1815.01 0 0 0 0.06 0 0 0 0 0 0 0 0 0 0 1874.98 2082.96 -1952.19 0 0 -905.56 0 -1394.47 0 0 0 -1473.66 0 0 0 0 0 0 0 0 0 0 0 0 0 0 0 0 2315.21 0 0 0 0 0 1792.43 -619.144 
0 0 0 0 0 0 0 0 0 0 0 0 0 0 0 0.09 0 0 0 1840.34 0 -527.436 0 0 0 0 0 0 0 423.521 11.5207 0 -1270.56 -2023.76 0 0 0 0 1702.55 0 0 0 949.507 0 -188.833 1310.69 0 0 0 0 0 0 0 0 0 0 0 0 0 0 0 
0 0 0 0 0 0 0 1470.15 0 0 -2435.45 0 0 0 0 0 0.01 0 0 0 0 0 0 0 0 0 0 -757.088 0 0 0 0 0 0 0 0 0 0 0 0 0 0 0 0 -1348.08 0 0 0 0 0 0 1415.68 0 0 0 0 757.546 0 980.941 0 0 
0 0 0 0 0 0 0 1701.03 0 0 0 922.803 0 0 0 0 0 0.03 0 0 0 0 0 2310.33 0 0 0 0 0 -1161.15 0 0 0 0 0 0 0 1638.46 0 0 0 0 0 -1550.42 0 0 0 -1027.79 556.734 0 0 0 -1536.53 0 0 -171.285 0 0 1057.7 0 0 
0 -609.531 -1041.83 0 0 0 0 0 0 0 0 0 0 0 0 0 0 0 0.02 0 0 0 0 0 0 1873.45 0 0 0 0 0 0 2240.59 0 0 0 0 0 0 0 64.4704 0 0 0 0 0 0 0 830.18 0 0 0 0 -1953.11 0 0 0 0 0 0 0 
0 0 0 0 0 -795.236 0 0 0 0 0 0 0 0 0 973.464 0 0 0 0 -1824.17 7.55333 0 0 0 0 0 0 0 0 1709.11 895.032 0 0 0 0 0 0 0 -196.615 0 0 0 0 0 0 0 0 0 0 0 0 0 0 0 0 0 0 0 0 0 
0 0 0 178.152 0 0 0 0 -992.996 0 0 0 0 0 0 0 0 0 0 2412.87 0.08 -866.497 0 0 2464.6 0 0 0 0 0 0 0 604.801 0 0 0 0 0 0 0 0 0 0 0 0 0 270.775 0 1839.73 0 0 0 -619.449 0 0 0 0 0 0 0 0 
0 0 0 -928.449 0 0 0 0 0 0 0 0 2163.99 0 0 -308.466 0 0 0 280.389 748.543 0.08 0 0 0 0 0 0 0 0 0 0 1036.18 0 0 0 0 0 0 0 0 0 0 0 0 0 0 4.80667 0 0 -104.907 0 0 0 0 0 0 0 0 0 0 
0 0 0 0 0 0 0 0 0 0 2160.18 0 0 0 0 0 0 0 0 0 0 0 0.07 0 1865.98 0 0 0 0 0 0 0 0 0 0 0 0 0 0 0 0 0 0 1814.4 -1734.29 -2017.5 0 0 0 0 0 0 0 -329.676 0 0 0 0 0 0 0 
0 0 0 0 0 0 0 0 0 0 1104.24 0 0 0 0 0 0 -510.346 0 0 0 0 0 0 0 0 0 0 0 0 0 0 0 421.232 0 0 0 0 0 0 0 654.241 0 0 917.768 0 0 0 -1853.47 0 0 0 0 -705.664 0 0 1353.27 0 0 0 0 
962.477 0 -364.01 0 0 0 0 0 0 2374.57 0 0 0 0 0 0 0 0 0 0 2085.1 0 -805.46 0 0.06 0 0 0 805.002 0 2235.4 573.824 0 0 0 0 1898.33 0 0 0 0 0 0 0 0 0 0 0 0 0 0 0 -552.614 150.075 0 0 -58.2141 0 0 0 0 
0 0 0 0 -377.438 0 0 0 -1365.78 0 0 0 0 586.032 1871.62 0 0 0 2074.27 0 0 0 0 0 0 0.08 0 0 0 0 0 0 0 0 0 0 -765.481 0 0 1397.98 -328.761 0 0 0 0 0 0 0 0 0 0 2014.91 0 -1037.86 0 0 0 0 0 0 0 
-2052.6 0 0 0 0 0 0 0 -171.743 0 0 0 0 0 1767.1 0 0 0 0 0 0 0 0 0 0 0 0.08 0 0 0 2419.74 375.454 0 0 -400.327 0 0 -1459.32 0 -2089.83 1333.43 0 0 0 0 0 0 0 0 0 0 0 0 0 0 0 0 0 0 0 0 
0 1136.74 1559.88 0 0 0 0 0 0 1979.2 0 1714.45 0 2332.76 1991.26 0 -1093.86 0 0 0 0 0 0 0 0 0 0 0.06 591.22 0 0 0 0 0 0 0 0 0 0 1209.07 0 0 1490.3 0 0 0 620.06 0 0 0 0 0 0 0 0 2256.77 0 0 0 0 0 
1416.14 0 0 0 0 0 0 1898.94 0 0 0 0 1158.71 0 0 0 0 0 0 0 0 0 0 0 191.275 0 0 1963.94 0.03 -2316.13 0 1566.29 0 0 0 0 0 0 0 0 -713.904 1862.47 0 0 1284.91 0 1977.07 0 -1640.45 0 0 0 0 0 0 1838.51 -961.562 0 0 0 0 
0 0 0 0 0 0 0 0 0 0 0 1449.86 0 0 0 1534.24 0 -407.956 0 0 0 0 0 0 0 0 0 0 1910.69 0.06 0 592.593 0 -2442.01 0 0 0 -2052.9 0 0 0 0 0 0 0 0 0 0 0 -914.716 1601.69 0 593.051 0 0 0 0 0 0 560.854 0 
0 0 2237.08 0 0 0 0 0 0 0 0 0 0 0 -484.71 2453.46 0 0 0 -1561.86 0 0 0 0 -2047.87 0 -596.561 0 0 0 0.04 0 0 0 2247.92 0 0 0 0 0 0 0 0 0 0 0 0 0 0 0 0 0 0 -1381.65 0 0 0 -455.107 198.141 0 0 
0 1468.32 0 -59.8926 0 0 0 0 0 0 0 0 0 0 0 0 0 0 0 1396.3 0 0 0 0 -2329.86 0 1899.24 0 1104.39 1387.14 0 0.07 356.685 0 0 0 0 2010.94 0 0 0 0 0 -597.018 -2397.76 530.946 0 1419.8 0 0 0 0 0 0 0 0 0 0 0 0 0 
0 0 0 0 1450.77 0 0 0 0 0 2268.52 0 0 -227.287 2047.11 -730.232 0 0 -49.3637 0 332.423 -2252.19 0 0 0 0 0 0 0 0 0 1468.63 0.05 0 0 0 0 0 0 0 0 0 0 0 0 0 0 0 2443.24 0 0 0 0 0 -2024.37 0 0 0 0 0 0 
0 995.743 0 0 0 634.404 0 0 2193.14 0 0 0 0 0 0 -1340.91 0 0 0 0 0 0 0 2167.04 0 0 0 0 0 856.731 0 0 0 0.06 0 0 1211.81 0 0 0 0 0 0 -1853.01 0 0 0 0 0 2475.13 -349.666 0 0 0 15.183 0 0 -1495.33 0 0 0 
0 -257.347 0 0 2216.18 0 0 0 0 0 0 1437.96 0 0 0 0 0 0 0 0 0 0 0 0 0 0 410.245 0 0 0 -864.208 0 0 0 0.03 0 0 2209.01 0 0 1657.38 0 0 0 0 0 0 0 0 0 0 0 0 0 -976.669 579.012 0 0 0 0 0 
0 0 0 54.857 0 0 1916.94 0 0 0 0 0 0 0 0 0 0 0 0 0 0 0 0 0 0 0 0 0 0 0 0 0 0 0 0 0.05 0 0 0 0 0 0 -131.153 0 0 0 0 0 727.027 0 0 0 0 0 0 0 0 0 0 -49.2111 0 
167.165 0 0 0 0 1687.75 0 0 0 0 0 0 0 0 2051.07 0 0 0 0 0 0 0 0 0 -881.909 2332.76 0 0 0 0 0 0 0 2355.49 0 0 0.01 0 0 0 0 0 0 0 0 0 0 0 0 -2086.02 0 0 0 0 0 0 0 0 956.526 0 0 
0 0 0 0 0 0 0 0 0 0 0 0 0 0 0 0 0 2117.91 0 0 0 0 0 0 0 0 358.974 0 0 -528.962 0 626.164 0 0 -2352.29 0 0 0.03 0 0 0 0 0 0 0 0 0 0 0 0 0 0 2326.5 0 0 0 -196.768 0 0 -1130.18 0 
0 -1095.69 1440.4 0 0 0 0 0 0 1235.92 0 0 0 -1804.94 0 1428.8 0 0 0 0 0 0 0 0 0 0 0 0 0 0 0 0 0 0 0 0 0 0 0.08 0 -2377.32 0 0 0 0 0 0 0 0 0 0 0 0 0 0 0 0 0 2332.45 0 0 
-1450.16 0 0 0 1573.15 0 0 0 0 0 1768.78 0 0 0 0 0 0 0 0 -2116.38 0 0 0 0 0 161.824 1748.02 1953.41 0 0 0 0 0 0 0 0 0 0 0 0.03 0 0 0 0 -1106.98 0 0 0 0 0 0 0 0 0 0 0 0 0 0 0 0 
72.5578 0 0 874.279 0 0 0 0 0 0 2227.01 0 0 -1445.59 0 0 0 0 -2328.18 0 0 0 0 0 0 -1557.28 1334.35 0 -102.161 0 0 0 0 0 486.389 0 0 0 925.55 0 0.06 -1149.4 0 1141.47 -2260.28 0 0 0 0 0 0 0 0 0 0 0 0 0 2123.1 0 0 
0 0 0 0 0 0 0 0 0 0 0 -1271.78 0 0 0 0 0 0 0 0 0 0 0 -926.466 0 0 0 0 1949.6 0 0 0 0 0 0 0 0 0 0 0 816.446 0.06 0 0 0 0 0 0 0 0 1005.51 0 0 0 0 305.872 0 0 0 0 0 
0 0 0 0 0 0 0 0 0 0 0 0 0 -152.669 0 1491.52 0 0 0 0 0 0 0 0 0 0 0 -831.553 0 0 0 0 0 0 0 1702.4 0 0 0 0 0 0 0 0 0 0 0 0 1384.24 0 0 0 0 0 0 0 0 0 0 0 0 
0 0 0 0 0 0 -2434.39 0 -1094.01 0 0 -842.387 0 1313.59 0 0 0 1328.39 0 0 0 0 2338.25 0 0 0 0 0 0 0 0 2476.96 0 38.9874 0 0 0 0 0 0 -822.855 0 0 0.02 0 0 568.331 0 0 0 0 0 0 0 0 0 -1033.74 0 0 0 0 
0 0 0 0 0 0 0 0 0 586.947 -377.285 0 0 -510.498 0 -26.9326 630.589 0 0 0 0 0 -230.491 554.903 0 0 0 0 -2205.95 0 0 -203.33 0 0 0 0 0 0 0 2205.04 1949.14 0 0 0 0 0 0 0 2287.29 0 0 0 0 0 0 0 0 -1099.35 0 0 0 
0 0 0 0 0 0 0 0 0 0 0 0 0 1797.77 0 1370.51 0 0 0 0 0 0 149.922 0 0 0 0 0 0 0 0 2483.21 0 0 0 0 0 0 0 0 0 0 0 0 0 0.05 0 0 0 0 -258.11 0 0 1477.02 0 0 0 0 0 0 0 
0 0 0 0 2117.15 0 0 0 0 0 0 0 0 0 0 0 0 0 0 0 2373.96 0 0 0 0 0 0 2126.45 -336.543 0 0 0 0 0 0 0 0 0 0 0 0 0 0 888.928 0 0 0 0 0 0 0 0 -2190.24 0 0 0 0 0 0 0 0 
928.144 0 0 0 0 0 0 0 0 0 0 0 2375.33 1755.5 0 0 0 -1351.74 0 0 0 1784.8 0 0 0 0 0 0 0 0 0 -215.995 0 0 0 0 0 0 0 0 0 0 0 0 0 0 0 0.06 -85.0703 0 -722.449 -1829.51 -1490.45 0 0 0 0 0 -1838.97 1177.63 0 
0 0 0 0 0 0 0 0 0 0 0 0 0 1490.75 0 0 0 -1276.67 901.288 0 1607.49 0 0 -2021.01 0 0 0 0 -1880.63 0 0 0 -1652.35 0 0 -1116.29 0 0 0 0 0 0 1034.35 0 1553.93 0 0 2452.54 0.03 2360.68 0 0 0 0 0 249.565 0 -785.165 0 0 0 
0 0 -174.184 0 0 -725.196 0 0 1815.47 0 0 -1573.76 0 0 0 0 0 0 0 0 0 0 0 0 0 0 0 0 0 -265.13 0 0 0 339.747 0 0 -2430.88 0 0 0 0 0 0 0 0 0 0 0 1985.76 0.06 0 0 0 0 0 0 0 0 0 1341.82 0 
0 0 0 0 0 0 0 0 0 0 0 0 0 0 0 0 0 0 0 0 0 -1834.54 0 0 0 0 0 0 0 1332.21 0 0 0 -1137.04 0 0 0 0 0 0 0 -1250.27 0 0 0 -1582.77 0 1880.78 0 0 0.08 0 0 1923.35 0 2134.39 0 0 0 0 0 
0 0 0 786.996 0 0 0 0 0 0 0 0 0 0 0 0 1534.24 0 0 0 0 0 0 0 0 85.0703 0 0 0 0 0 0 0 0 0 0 0 0 0 0 0 0 0 0 0 0 0 2218.92 0 0 0 0.09 0 0 0 0 160.451 0 0 0 0 
0 0 0 0 0 0 0 0 0 0 2139.88 0 0 1619.24 0 0 0 1491.97 0 0 -369.655 0 0 0 1433.84 0 0 0 0 -2381.28 0 0 0 0 0 0 0 -1085.16 0 0 0 0 0 0 0 0 -2087.24 -1454.74 0 0 0 0 0.08 0 0 0 0 0 0 0 0 
0 -1849.19 0 0 0 0 0 0 0 0 0 729.926 0 0 2181.39 0 0 0 1372.19 0 0 0 1026.57 990.86 648.442 1303.52 0 0 0 0 -125.813 0 0 0 0 0 0 0 0 0 0 0 0 0 0 -804.697 0 0 0 0 -1442.99 0 0 0.02 0 0 0 241.935 0 0 0 
1470.61 0 0 0 0 0 0 0 0 0 0 0 0 0 0 0 0 0 0 0 0 0 0 0 0 0 0 0 0 0 0 0 1602.45 1681.65 1741.61 0 0 0 0 0 0 0 0 0 0 0 0 0 0 0 0 0 0 0 0.04 0 0 0 0 0 0 
0 0 0 0 0 1961.5 0 0 0 0 -1324.12 0 0 0 0 0 0 805.002 0 0 0 0 0 0 0 0 0 530.946 2031.24 0 0 0 0 0 -1782.05 0 0 0 0 0 0 1148.49 0 0 0 0 0 0 2373.96 0 -521.332 0 0 0 0 0.03 0 0 0 2136.68 0 
0 0 0 0 0 0 0 -1782.05 1172.6 0 0 0 0 0 0 0 1795.02 0 0 0 0 0 0 -1615.88 1035.11 0 0 0 870.159 0 0 0 0 0 0 0 0 1982.86 0 0 0 0 0 2148.58 0 0 0 0 0 0 0 900.983 0 0 0 0 0.07 0 0 0 0 
0 0 -580.081 0 -2107.38 1216.7 0 0 0 0 2302.7 0 0 0 0 0 0 0 0 0 0 0 0 0 0 0 0 0 0 0 -2179.25 0 0 2131.95 0 0 0 0 0 0 0 0 0 0 2317.8 0 0 0 -1729.1 0 0 0 0 1347.16 0 0 0 0.03 0 0 0 
0 0 0 93.9207 0 0 0 2443.69 0 0 0 0 0 0 0 0 -859.478 691.015 0 0 0 0 0 0 0 0 0 0 0 0 1373.71 0 0 0 0 0 990.097 0 452.971 0 -756.935 0 0 0 0 0 0 495.849 0 0 0 0 0 0 0 0 0 0 0.01 0 0 
0 1135.36 1930.37 0 0 0 0 0 0 0 0 0 0 0 -127.338 0 0 0 0 0 0 0 0 0 0 0 0 0 0 -1740.39 0 0 0 0 0 1886.58 0 143.361 0 0 0 0 0 0 0 0 0 1692.02 0 579.47 0 0 0 0 0 38.8348 0 0 0 0.05 0 
0 0 0 0 0 0 0 0 0 0 0 0 0 0 2301.02 0 0 0 0 0 0 0 0 0 0 0 0 0 0 0 0 0 0 0 0 0 0 0 0 0 0 0 0 0 0 0 0 0 0 0 0 0 0 0 0 0 0 0 0 0 0.05 
