*Vertices 59
*Matrix 
0.07 0 0 0 0 0 495.087 0 0 714.667 0 0 881.756 0 -2131.18 776.467 911.054 140.461 0 2051.23 1501.13 0 0 0 0 0 0 0 0 0 0 0 0 1735.66 0 -143.818 0 0 0 1755.96 0 0 0 0 0 0 1304.44 -367.061 2432.55 0 0 0 -883.892 0 0 43.7178 0 0 0 
0 0.07 0 1759.32 0 0 0 0 0 0 0 0 0 0 0 0 127.949 0 -842.845 0 0 0 1547.52 0 -767.006 0 0 2353.21 -836.589 0 0 0 0 0 -1643.35 0 0 0 0 1915.42 0 0 0 0 0 0 0 0 0 0 0 0 0 0 0 0 0 -2110.28 0 
0 0 0.03 2302.85 0 0 0 853.374 0 0 0 378.658 0 0 0 -78.2037 0 0 265.74 0 1790.9 0 0 0 0 0 2427.82 0 0 -824.992 0 0 1472.9 1909.47 0 1437.19 0 0 0 0 0 -1299.71 0 0 1235.92 0 0 0 -1914.66 0 0 0 0 0 0 0 0 0 0 
0 -1066.39 1770 0.06 0 -1265.68 0 0 -799.203 0 0 0 0 2274.32 0 0 0 0 0 1625.8 0 0 2322.84 1799.14 0 -82.7815 0 1964.55 0 -1612.52 0 0 0 0 0 0 0 927.992 0 0 0 0 0 0 0 0 0 0 0 0 0 0 0 0 0 0 0 0 0 
0 0 0 0 0.02 0 2077.32 0 -234.458 0 0 592.746 1678.14 0 0 0 1809.82 0 0 -1002.61 0 0 0 0 0 0 0 0 -930.433 758.003 0 0 0 0 0 0 0 674.078 1945.78 0 0 0 0 -551.088 0 0 0 -99.5666 0 0 0 -1675.85 0 0 0 0 0 0 0 
0 0 0 661.718 0 0.02 1050.83 0 0 -1192.59 1963.48 0 -765.481 0 1716.28 -311.212 0 -257.195 0 0 1987.59 0 -2274.47 0 285.577 0 0 0 0 0 0 0 0 1057.39 0 0 1636.94 0 0 0 0 1214.56 -1923.2 0 2338.56 0 0 0 0 0 0 0 -1532.26 0 0 0 -1933.42 1082.11 0 
-194.021 0 0 0 1427.88 2250.51 0.07 0 0 0 0 34.4096 0 0 0 0 709.174 0 -2196.34 0 -334.101 0 0 0 180.898 0 0 1352.5 1151.69 -436.491 0 0 0 0 1323.21 0 0 0 0 755.715 0 0 325.709 0 0 0 0 0 0 0 0 -1470.92 0 0 0 0 0 0 0 
0 0 881.298 0 0 0 0 0.08 0 0 2343.13 0 0 0 870.769 0 0 0 -951.338 0 2059.01 0 0 0 0 0 0 1461.61 0 0 1668.07 0 0 2159.26 0 0 -2010.18 -1552.4 0 0 0 0 0 -1388.97 0 0 0 1475.34 0 0 0 0 0 0 0 0 0 0 0 
0 0 0 2202.6 2135.61 0 0 0 0.02 914.258 0 -2363.58 0 0 0 0 0 0 0 0 0 -2357.17 0 0 1528.29 1710.03 0 0 0 0 0 0 0 -1523.26 -1322.29 1815.01 0 0 225.15 -2238.46 2135.61 1184.96 0 0 2350.76 0 0 0 0 0 0 0 0 0 0 0 0 0 0 
1872.69 0 0 0 0 2468.72 0 0 2218.77 0.02 0 1080.43 2375.94 0 1551.48 0 -379.727 0 0 0 0 1859.42 0 0 0 0 0 -969.192 -2067.25 -1332.21 0 0 -1132.16 0 496.612 0 0 0 0 0 -1382.11 -243.919 603.58 0 0 0 0 0 0 0 0 -1350.06 0 0 0 -47.38 0 223.93 0 
0 0 0 0 0 -851.695 0 2260.43 0 0 0.09 -369.655 0 0 1106.98 1744.97 0 0 0 0 0 0 -1562.62 0 0 0 0 2439.42 0 0 0 -1858.96 2400.2 0 0 0 0 0 -1335.87 0 0 0 0 0 0 0 0 826.975 0 0 0 0 0 0 0 0 0 0 0 
0 0 675.146 0 1463.13 0 -348.598 0 -408.567 2304.68 -975.906 0.07 -1049.76 108.875 0 0 776.162 1353.72 0 0 0 0 0 0 0 490.967 0 1710.49 1469.85 0 0 0 0 0 0 0 0 0 0 862.987 0 0 0 0 0 0 0 0 0 0 0 0 0 1829.97 0 0 0 0 0 
2288.96 0 0 0 2184.74 -399.869 0 0 0 -2038.41 0 -1561.25 0.05 -1497.77 0 140.309 0 466.857 0 0 0 0 2071.37 0 0 0 0 0 0 1992.63 231.254 0 0 0 0 0 0 -1085.47 0 1029.62 562.227 1833.93 1187.86 0 0 0 0 0 0 0 0 0 0 0 -2272.94 0 0 2495.27 0 
0 0 0 1631.44 0 0 0 0 0 0 0 -429.777 157.552 0.01 0 0 0 458.464 1067.77 0 1213.8 1616.95 0 0 0 0 0 0 0 0 0 0 0 2193.14 0 0 -164.724 0 0 0 0 0 0 0 0 0 0 1874.22 0 0 0 0 0 0 0 0 0 0 0 
1779.31 0 0 0 0 1593.3 0 658.055 0 845.286 -111.469 0 0 0 0 0 708.869 -891.064 0 0 0 0 0 0 1103.17 0 0 0 -1701.79 0 0 1570.71 0 0 0 0 0 0 -1216.24 758.766 0 0 0 0 0 0 0 0 -30.2896 0 0 0 0 0 -1421.48 0 0 0 0 
-154.042 0 -1610.23 0 0 1838.97 0 0 0 0 1199.15 0 -1725.75 0 0 0.04 0 0 -658.208 1171.07 0 2236.78 0 0 0 0 0 0 1756.11 0 0 0 0 1714.15 0 2060.53 0 0 0 0 -572.451 -1498.08 0 0 0 1265.83 -1709.42 0 0 0 0 0 0 0 0 0 0 0 0 
687.964 447.325 0 0 222.861 0 -2045.88 0 0 1448.33 0 1235.77 0 0 1973.56 0 0.08 1871.78 0 -353.633 0 0 0 2211.45 0 0 0 0 0 0 0 0 0 0 0 1797.62 0 0 0 65.2333 0 640.202 -2309.11 0 0 998.337 0 0 0 0 0 0 0 0 0 0 0 0 0 
2483.67 0 0 0 0 -919.141 0 0 0 0 0 1150.32 1675.85 -116.657 596.103 0 -49.5163 0.08 0 0 0 0 0 0 0 0 0 0 0 0 0 -2043.9 115.589 0 0 0 0 0 0 0 0 0 0 0 0 0 0 0 0 0 0 0 0 0 0 0 -716.498 0 0 
0 -810.648 1463.44 0 0 0 1643.04 -1076.46 0 0 0 0 0 -1448.18 0 2271.42 0 0 0.09 0 0 548.494 0 0 1794.56 0 0 0 0 -870.006 -385.525 0 0 0 0 0 -973.159 0 0 0 0 0 0 0 0 1831.95 0 0 0 0 0 0 0 0 0 0 0 0 0 
2216.33 0 0 1135.67 942.03 0 0 0 0 0 0 0 0 0 0 1304.44 -498.291 0 0 0.03 0 -1580.94 0 0 0 1844.16 870.312 0 0 0 0 -1329.77 0 0 0 0 0 0 0 0 0 815.683 0 0 0 0 -2061.14 0 0 0 0 0 0 0 0 0 0 0 0 
1264.15 0 -2432.1 0 0 656.072 -1963.94 1725.14 0 0 0 0 0 1473.51 0 0 0 0 0 0 0.05 0 0 0 0 1752.91 0 0 1479.61 0 0 0 0 0 1477.02 2142.32 0 0 0 0 0 -1095.08 0 0 0 0 0 0 0 0 1175.19 0 0 0 0 0 0 0 -1274.99 
0 0 0 0 0 0 0 0 -1107.59 1616.79 0 0 0 587.558 0 1424.38 0 0 -239.189 927.686 0 0.05 0 -812.937 0 0 0 0 1695.38 0 0 0 688.574 385.983 0 0 0 0 0 0 0 0 0 0 0 0 0 0 0 0 0 0 0 0 0 0 0 0 0 
0 1338.62 0 916.395 0 -1116.14 0 0 0 0 -845.897 0 664.769 0 0 0 0 0 0 0 0 0 0.06 0 0 -420.164 2112.42 0 0 0 0 0 0 0 0 0 0 0 0 1135.98 0 1665.78 409.635 0 0 0 0 0 0 0 0 0 0 0 0 0 0 0 0 
0 0 0 544.526 0 0 0 0 0 0 0 0 0 0 0 0 1420.71 0 0 0 0 1121.94 0 0.06 0 0 0 0 0 -411.161 0 -1245.99 0 20.3711 0 0 0 0 0 0 0 2413.02 0 0 0 0 0 0 0 0 0 0 0 0 0 678.961 0 0 0 
0 -1170.77 0 0 0 155.873 8.92666 0 -1564.15 0 0 0 0 0 1048.08 0 0 0 1312.52 0 0 0 0 0 0.03 0 0 -67.5222 139.393 0 0 0 0 0 0 0 484.71 0 0 2117.91 0 0 0 0 0 0 0 0 0 0 0 2433.47 0 0 0 0 0 0 0 
0 0 0 -775.246 0 0 0 0 1016.95 0 0 1571.93 0 0 0 0 0 0 0 1588.41 648.442 0 2224.42 0 0 0.03 0 1184.65 0 0 0 0 2051.07 0 0 0 0 -230.949 -2481.54 0 0 0 0 0 0 0 0 0 0 0 0 0 0 0 0 0 0 1965.16 0 
0 0 -408.719 0 0 0 0 0 0 0 0 0 0 0 0 0 0 0 0 676.214 0 0 2008.8 0 0 0 0.04 0 0 -2044.05 0 0 0 1610.69 0 0 0 0 0 0 0 0 2251.88 0 2150.56 0 0 0 0 0 0 0 0 0 0 0 0 0 0 
0 -1051.9 0 1250.11 0 0 839.488 -445.799 0 -603.122 1944.87 1467.71 0 0 0 0 0 0 0 0 0 0 0 0 -194.327 1147.11 0 0 0 0 0 0 0 -1197.01 0 602.817 2137.14 789.743 0 0 0 0 0 0 0 0 1972.18 0 0 0 617.161 0 0 0 618.839 0 0 0 0 
0 381.863 0 0 -1299.4 0 411.161 0 0 419.401 0 -499.969 0 0 1436.12 1176.41 0 0 0 0 -1782.82 532.472 0 0 1614.35 0 0 0 0.02 0 0 0 0 1164.2 0 0 0 0 0 0 0 0 0 0 0 0 0 0 0 0 0 0 0 0 0 1.60222 0 0 0 
0 0 1564.3 -2106.77 100.177 0 2403.1 0 0 2019.18 0 0 1568.27 0 0 0 0 0 -2023.61 0 0 0 0 2326.65 0 0 2389.07 0 0 0.05 0 -326.777 1793.8 0 0 0 0 -2301.48 0 0 0 981.399 -1744.06 0 0 0 0 0 99.8718 0 0 0 0 0 0 0 -1934.49 0 0 
0 0 0 0 0 0 0 264.367 0 0 0 0 233.39 0 0 0 0 0 928.755 0 0 0 0 0 0 0 0 0 0 0 0.09 1698.58 0 0 541.78 0 0 0 -915.021 0 0 0 0 -1322.9 0 0 0 0 0 0 0 0 0 0 0 0 0 0 0 
0 0 0 0 0 0 0 0 0 0 1589.18 0 0 0 -207.907 0 0 -163.198 0 373.47 0 0 0 -924.329 0 0 0 0 0 -1934.8 1909.47 0.02 -902.509 484.558 -2228.23 0 0 846.202 0 0 -568.636 2387.39 0 0 0 0 1010.09 0 0 0 0 0 0 -2082.96 0 0 0 0 0 
0 0 2005.45 0 0 0 0 0 0 1174.28 2382.66 0 0 0 0 0 0 -887.097 0 0 0 773.415 0 0 0 792.184 0 0 0 1870.25 0 -2110.28 0.07 0 1957.69 0 1834.54 0 0 0 0 2160.33 0 0 0 -1830.88 0 0 1857.74 0 0 0 0 0 0 0 0 0 0 
4.34889 0 -1272.09 0 0 -781.961 0 1274.53 -1332.06 0 0 0 0 2446.44 0 667.058 0 0 0 0 0 1358 0 1504.33 0 0 -214.164 -239.952 612.735 0 0 -1577.88 0 0.08 0 0 0 -533.998 0 0 0 0 2422.48 0 0 0 0 0 0 0 1996.9 -397.275 0 0 0 0 0 0 0 
0 2216.94 0 0 0 0 -764.26 0 -769.601 116.352 0 0 0 0 0 0 0 0 0 0 1813.94 0 0 0 0 0 0 0 0 0 1738.56 -534.303 705.054 0 0.04 0 0 298.547 0 0 0 0 396.664 0 0 0 0 1652.96 0 0 0 0 0 0 0 0 0 0 0 
1283.38 0 -1003.98 0 0 0 0 0 1440.86 0 0 0 0 0 0 1590.55 1768.47 0 0 0 40.6659 0 0 0 0 0 0 322.047 0 0 0 0 0 0 0 0.06 -358.211 1229.21 -420.011 0 -1188.31 0 0 0 0 0 0 0 0 0 0 0 2168.87 0 0 0 0 0 0 
0 0 0 0 0 2260.12 0 209.891 0 0 0 0 0 -1516.54 0 0 0 0 2150.72 0 0 0 0 0 335.78 0 0 635.319 0 0 0 0 2427.06 0 0 2299.8 0.08 0 0 0 0 0 0 0 0 0 0 0 0 0 0 0 423.368 391.476 0 0 0 0 0 
0 0 0 564.211 1968.52 0 0 -517.365 0 0 0 0 992.843 0 0 0 0 0 0 0 0 0 0 0 0 -210.959 0 496.612 0 460.906 0 -1085.77 0 269.402 -1943.95 -2261.96 0 0.04 0 0 0 0 0 0 0 0 0 0 0 0 0 0 0 0 0 1702.4 0 0 0 
0 0 0 0 1393.7 0 0 0 -750.679 0 -1673.56 0 0 0 2011.55 0 0 0 0 0 0 0 0 0 0 -750.221 0 0 0 0 -218.894 0 0 0 0 70.8792 0 0 0.07 0 1728.19 0 0 -1067.77 0 0 0 0 0 563.906 0 0 0 0 0 0 0 0 33.7992 
1378.29 1646.24 0 0 0 0 1300.32 0 1143.3 0 0 -2133.17 262.535 0 1513.18 0 1552.86 0 0 0 0 0 1245.84 0 -1074.02 0 0 0 0 0 0 0 0 0 0 0 0 0 0 0.02 0 1575.59 0 0 0 0 0 0 0 0 358.516 0 0 -59.4348 0 0 0 0 0 
0 0 0 0 0 0 0 0 1998.12 -1200.22 0 0 620.212 0 0 1020.77 0 0 0 0 0 0 0 0 0 0 0 0 0 0 0 -796.609 0 0 0 1683.94 0 0 -2018.11 0 0.05 0 0 0 0 0 0 0 0 0 0 0 0 0 0 0 0 0 0 
0 0 -122.303 0 0 -1171.99 0 0 -327.54 2040.09 0 0 2089.83 0 0 -2064.04 1492.89 0 0 2052.29 1576.51 0 -2441.86 1820.35 0 0 0 0 0 213.095 0 2045.43 36.6985 0 0 0 0 0 0 758.461 0 0.04 -2340.39 0 0 0 0 -1089.43 0 0 0 0 -548.646 0 0 0 2031.08 0 653.783 
0 0 0 0 0 2351.83 -508.972 0 0 -2428.89 0 0 -340.968 0 0 0 1124.68 0 0 0 0 0 823.466 0 0 0 821.635 0 0 1300.93 0 0 0 1021.68 643.406 0 0 0 0 0 0 -2465.36 0.02 0 0 0 0 0 0 -162.282 0 0 0 0 0 0 0 0 0 
0 0 0 0 2403.26 0 0 -222.709 0 0 0 0 0 0 0 0 0 0 0 0 0 0 0 0 0 0 0 0 0 0 2479.09 0 0 0 0 0 0 0 -2423.09 0 0 0 0 0.04 0 0 0 0 0 0 0 0 0 0 0 88.1222 0 0 0 
0 0 -832.011 0 0 2280.27 0 0 -125.813 0 0 0 0 0 0 0 0 0 0 0 0 0 0 0 0 0 2103.72 0 0 0 0 0 0 0 0 0 0 0 0 0 0 0 0 0 0.03 0 0 0 0 46.617 0 0 0 0 1372.34 0 0 0 -572.756 
0 0 0 0 0 0 0 0 0 0 0 0 0 0 0 1523.56 43.7178 0 -5.56963 0 0 0 0 0 0 0 0 0 0 0 0 0 1825.85 0 0 0 0 0 0 0 0 0 0 0 0 0.08 0 0 0 367.672 0 0 0 0 0 0 0 0 0 
-388.882 0 0 0 0 0 0 0 0 0 0 0 0 0 0 2059.01 0 0 0 1075.85 0 0 0 0 0 0 0 -1923.35 0 0 0 698.798 0 0 0 0 0 0 0 0 0 0 0 0 0 0 0.06 0 0 0 0 0 0 0 0 0 0 0 0 
1591.16 0 0 0 -2010.18 0 0 1180.84 0 0 1496.86 0 0 1895.89 0 0 0 0 0 0 0 0 0 0 0 0 0 0 0 0 0 0 0 0 -211.112 0 0 0 0 0 0 1328.24 0 0 0 0 0 0.07 -1669.13 0 0 0 0 0 1348.54 0 0 0 0 
2445.22 0 -1834.7 0 0 0 0 0 0 0 0 0 0 0 -1244.01 0 0 0 0 0 0 0 0 0 0 0 0 0 0 758.309 0 0 1941.66 0 0 0 0 0 0 0 0 0 0 0 0 0 0 929.518 0.06 0 0 0 0 0 0 0 -136.952 0 0 
0 0 0 0 0 0 0 0 0 0 0 0 0 0 0 0 0 0 0 0 0 0 0 0 0 0 0 0 0 0 0 0 0 0 0 0 0 0 980.026 0 0 0 1876.81 0 2272.64 -1270.56 0 0 0 0.08 0 0 0 0 0 0 0 0 0 
0 0 0 0 0 0 0 0 0 0 0 0 0 0 0 0 0 0 0 0 -137.867 0 0 0 0 0 0 1027.94 0 0 0 0 0 1680.27 0 0 0 0 0 -83.697 0 0 0 0 0 0 0 0 0 0 0.04 0 0 0 0 0 0 0 0 
0 0 0 0 109.18 0 1805.86 0 0 2367.55 0 0 0 0 0 0 0 0 0 0 0 0 0 0 1585.97 0 0 0 0 0 0 0 0 -2210.84 0 0 0 0 0 0 0 0 0 0 0 0 0 0 0 0 0 0.03 0 0 0 0 0 0 0 
-1087.76 0 0 0 0 -668.737 0 0 0 0 0 0 0 0 0 0 0 0 0 0 0 0 0 0 0 0 0 0 0 0 0 0 0 0 0 646.458 2206.11 0 0 0 0 1716.74 0 0 0 0 0 0 0 0 0 0 0.08 2228.08 0 2115.77 0 0 0 
0 0 0 0 0 0 0 0 0 0 0 -2467.35 0 0 0 0 0 0 0 0 0 0 0 0 0 0 0 0 0 0 0 2329.71 0 0 0 0 1126.67 0 0 1675.85 0 0 0 0 0 0 0 0 0 0 0 0 205.008 0 1086.84 0 -2422.18 0 0 
0 0 0 0 0 0 0 0 0 0 0 0 -1862.01 0 1590.4 0 0 0 0 0 0 0 0 0 0 0 0 -1733.53 0 0 0 0 0 0 0 0 0 0 0 0 0 0 0 0 760.75 0 0 -640.507 0 0 0 0 0 2344.97 0.05 0 0 0 1031.6 
-458.617 0 0 0 0 0 0 0 0 -39.903 0 0 0 0 0 0 0 0 0 0 0 0 0 -2043.9 0 0 0 0 1978.59 0 0 0 0 0 0 0 0 1358.15 0 0 0 0 0 1058.31 0 0 0 0 0 0 0 0 2142.63 0 0 0.05 0 0 0 
0 0 0 0 0 2179.1 0 0 0 0 0 0 0 0 0 0 0 -1450.01 0 0 0 0 0 0 0 0 0 0 0 2215.57 0 0 0 0 0 0 0 0 0 0 0 222.709 0 0 0 0 0 0 -441.221 0 0 0 0 670.11 0 0 0 0 0 
0 1807.08 0 0 0 1463.13 0 0 0 -2297.36 0 0 -1240.81 0 0 0 0 0 0 0 0 0 0 0 0 1657.38 0 0 0 0 0 0 0 0 0 0 0 0 0 0 0 0 0 0 0 0 0 0 0 0 0 0 0 0 0 0 0 0.09 1004.44 
0 0 0 0 0 0 0 0 0 0 0 0 0 0 0 0 0 0 0 0 -454.192 0 0 0 0 0 0 0 0 0 0 0 0 0 0 0 0 0 2430.57 0 0 -201.346 0 0 628.147 0 0 0 0 0 0 0 0 0 -2088.92 0 0 2142.17 0.02 
