*Vertices 51
*Matrix 
0.03 0 0 0 0 0 0 0 0 0 0 0 0 0 0 0 0 0 0 1917.1 0 0 0 0 0 0 0 0 0 -657.292 0 0 -316.095 0 0 0 2324.98 0 107.349 0 0 0 0 0 0 0 0 0 0 0 0 
0 0.08 0 -1771.07 0 0 0 2009.26 0 0 0 0 0 -1816.39 0 1538.67 -300.378 0 0 0 0 0 0 0 0 0 0 0 0 0 0 2334.74 0 0 0 0 0 0 0 0 0 0 0 0 0 0 0 0 0 0 0 
0 0 0.04 0 -1088.82 0 0 -112.079 -1092.33 0 0 2030.78 -733.284 0 0 0 0 -1425.44 0 0 0 0 0 0 0 0 0 0 0 0 0 0 0 2218.92 0 0 531.098 0 0 843.303 0 0 0 0 0 0 0 0 0 0 793.71 
0 -373.47 0 0.08 0 0 0 0 0 0 0 0 0 0 0 0 0 0 0 0 0 0 0 0 0 0 0 0 0 0 0 0 0 0 0 0 0 0 0 1702.7 0 0 0 0 0 0 0 0 0 0 0 
0 0 632.115 0 0.07 0 0 0 0 2431.64 0 0 0 0 0 0 0 0 0 0 838.115 0 1283.84 0 2453.31 262.383 2140.8 0 0 0 1481.29 0 0 0 0 0 0 0 0 1027.94 -995.59 0 0 0 456.023 0 0 0 0 0 0 
0 0 0 0 0 0.07 -1557.13 0 0 0 0 0 0 0 0 0 0 0 0 0 0 0 1911.45 0 383.694 0 0 719.092 0 0 0 0 176.931 0 0 0 -906.171 0 0 0 0 0 0 0 2473.14 0 0 0 0 0 0 
0 0 0 0 0 2323.91 0.07 -1054.03 0 -1679.2 1263.39 0 0 0 0 786.386 0 0 0 1095.54 0 0 443.052 0 0 0 0 0 0 0 0 0 -2218.16 0 0 0 2122.18 0 0 0 1241.11 0 0 0 0 0 0 0 0 0 0 
0 2040.54 1863.08 0 0 0 -291.833 0.01 0 0 0 0 0 0 0 0 0 1283.53 0 0 0 0 0 0 0 272.149 0 0 822.398 0 0 0 0 2193.29 0 0 0 0 0 0 0 -1247.67 0 0 0 0 0 0 0 0 0 
0 0 -1152.46 0 0 0 0 0 0.09 0 0 0 0 0 0 2217.25 0 0 2030.32 0 -929.67 0 0 0 0 0 0 0 0 0 0 0 0 0 0 0 0 0 0 0 0 0 44.0229 0 0 0 0 0 0 0 0 
0 0 0 0 1387.14 0 -674.078 0 0 0.08 261.62 0 401.09 421.232 0 0 0 0 0 0 0 0 0 0 0 0 0 0 0 0 -1367.46 0 1312.98 0 0 0 0 0 0 0 0 0 0 0 0 0 0 0 0 0 0 
0 0 0 0 0 0 1396.45 0 0 -1509.37 0.05 0 0 0 0 0 0 1492.28 0 0 0 0 0 0 0 0 0 0 0 0 0 0 -1195.94 0 0 0 0 1288.87 1441.01 0 0 367.214 0 0 0 0 0 0 0 0 0 
0 0 -1177.63 0 0 0 0 0 0 0 0 0.01 0 0 0 0 -1956.47 0 0 0 0 643.254 0 0 0 0 0 0 0 0 1644.72 0 0 0 0 0 0 0 0 -147.633 729.164 0 1312.07 0 0 0 0 0 0 0 0 
0 0 -759.377 0 0 0 0 0 0 2069.99 0 0 0 0 0 0 0 0 0 0 0 0 -2182.3 0 0 0 0 0 0 0 0 0 0 1906.72 0 0 0 0 0 0 0 0 0 0 0 0 0 0 0 0 0 
0 -1258.2 0 0 0 0 0 0 0 1664.4 0 0 0 0 0 0 0 1112.63 0 0 0 0 0 0 0 0 1731.54 157.552 0 0 0 -1371.88 0 0 0 0 0 0 0 0 0 0 0 0 0 0 0 0 0 0 0 
0 0 0 0 0 0 0 0 0 0 0 0 0 0 0.03 0 0 0 0 0 -2072.89 0 0 0 0 0 0 0 0 0 0 0 -1531.95 0 0 0 0 2257.07 0 0 2278.89 0 0 0 0 0 0 0 0 0 0 
0 485.931 0 0 0 0 -307.092 0 1089.43 0 0 0 0 0 0 0.07 0 0 0 0 0 0 0 0 0 0 0 0 0 0 0 0 0 0 0 0 1815.93 0 0 1282.46 0 0 1316.03 0 0 0 0 0 0 0 0 
0 207.755 0 0 0 0 0 0 0 0 0 957.289 0 0 0 0 0.09 0 0 0 0 0 0 0 0 0 2381.13 0 0 0 0 -1092.18 0 0 0 0 0 0 0 0 0 -57.2985 2283.62 0 0 0 0 0 0 0 0 
0 0 635.929 0 0 0 0 1701.18 0 0 -793.252 0 0 1652.81 0 0 0 0.08 366.298 0 0 0 0 -821.635 0 0 0 0 0 -970.107 0 0 0 0 0 0 0 0 0 0 0 0 0 0 0 0 0 0 0 0 0 
0 0 0 0 0 0 0 0 -658.361 0 0 0 0 0 0 0 0 885.876 0 429.777 0 0 0 1765.88 0 0 0 0 0 0 0 0 0 987.198 0 1086.99 -2238.76 262.688 0 0 0 0 0 0 -2427.67 0 0 0 0 0 0 
1967.45 0 0 0 0 0 775.094 0 0 0 0 0 0 0 0 0 0 0 -918.836 0.02 0 0 0 0 0 0 0 0 0 0 0 1577.58 0 0 0 0 0 0 0 0 0 0 0 0 0 0 0 0 0 0 0 
0 0 0 0 1132.16 0 0 0 994.064 0 0 0 0 0 2105.85 0 0 0 0 0 0.06 0 0 0 0 -81.4081 0 0 0 0 0 0 0 0 0 233.543 0 0 0 0 0 0 0 0 1983.32 0 0 0 0 0 0 
0 0 0 0 0 0 0 0 0 0 0 1196.55 0 0 0 0 0 0 0 0 0 0.09 0 0 1373.56 0 0 0 -1021.84 0 -1819.28 0 0 477.996 0 2002.09 0 0 0 0 0 0 0 0 0 0 0 0 0 0 0 
0 0 0 0 2300.56 -1371.43 1003.83 0 0 0 0 0 358.821 0 0 0 0 0 0 0 0 0 0.05 0 0 0 0 0 0 0 0 -179.373 270.318 0 0 0 1837.9 0 0 0 466.552 0 0 0 0 0 0 -891.827 0 0 0 
0 0 0 0 0 0 0 0 0 0 0 0 0 0 0 0 0 1185.57 717.261 0 0 0 0 0 0 0 0 458.312 0 -2.97555 483.795 0 0 1486.18 0 0 2467.19 271.538 0 0 0 0 0 0 0 0 0 0 0 0 0 
0 0 0 0 1238.36 1713.54 0 0 0 0 0 0 0 0 0 0 0 0 0 0 0 94.3785 0 0 0.04 1616.18 0 731.452 0 0 0 0 0 0 0 0 0 0 0 -405.21 1626.87 0 0 -2456.36 0 0 0 0 0 0 0 
0 0 0 0 -572.298 0 0 1547.67 0 0 0 0 0 0 0 0 0 0 0 0 -1635.56 0 0 0 775.246 0 0 0 0 -655.156 0 0 0 0 0 0 0 1053.73 1950.36 0 765.633 0 0 0 0 0 0 0 0 0 0 
0 0 0 0 974.227 0 0 0 0 0 0 0 0 -1544.77 0 0 881.756 0 0 0 0 0 0 0 0 0 0.05 0 0 0 0 0 0 1841.26 0 0 0 0 0 0 0 0 0 -1617.56 0 0 0 0 0 0 0 
0 0 0 0 0 -573.061 0 0 0 0 0 0 0 1747.11 0 0 0 0 0 0 0 0 0 1124.99 2337.18 0 0 0.03 -1104.08 0 0 0 0 0 0 -1977.83 0 0 0 0 0 0 0 1475.04 801.035 0 0 0 0 0 0 
0 0 0 0 0 0 0 2483.98 0 0 0 0 0 0 0 0 0 0 0 0 0 1048.39 0 0 0 0 0 -1025.19 0.01 0 0 0 0 0 0 0 0 0 0 0 0 0 0 0 0 0 0 0 0 0 0 
894.421 0 0 0 0 0 0 0 0 0 0 0 0 0 0 0 0 1237.75 0 0 0 0 0 1052.05 0 -207.907 0 0 0 0 0 0 0 0 0 0 0 0 690.558 -851.848 0 0 0 -2370.14 0 0 0 0 0 0 0 
0 0 0 0 264.977 0 0 0 0 602.512 0 689.642 0 0 0 0 0 0 0 0 0 2049.24 0 316.248 0 0 0 0 0 0 0.03 0 0 0 0 -661.718 0 0 0 0 0 0 0 0 0 0 0 0 0 0 0 
0 -145.65 0 0 0 0 0 0 0 0 0 0 0 1229.67 0 0 1119.8 0 0 1971.27 0 0 1633.58 0 0 0 0 0 0 0 0 0.06 0 0 0 0 0 0 0 0 0 0 0 0 1343.5 0 0 0 0 0 0 
-91.7844 0 0 0 0 -1953.57 2454.68 0 0 166.86 2147.21 0 0 0 908.002 0 0 0 0 0 0 0 -1897.72 0 0 0 0 0 0 0 0 0 0.05 0 0 0 2475.59 0 0 0 0 0 0 0 0 0 2082.66 0 0 0 0 
0 0 1474.73 0 0 0 0 -221.03 0 0 0 0 1880.32 0 0 0 0 0 1729.26 0 0 -1206.02 0 -1959.06 0 0 1795.48 0 0 0 0 0 0 0.08 0 0 0 0 0 0 0 0 0 0 0 -2074.72 0 0 0 0 0 
0 0 0 0 0 0 0 0 0 0 0 0 0 0 0 0 0 0 0 0 0 0 0 0 0 0 0 0 0 0 0 0 0 0 0.04 0 0 0 0 0 0 0 0 1862.62 0 0 0 0 0 0 0 
0 0 0 0 0 0 0 0 0 0 0 0 0 0 0 0 0 0 165.487 0 1932.81 1865.83 0 0 0 0 0 1274.53 0 0 -2123.71 0 0 0 0 0.03 0 0 0 -1661.66 0 0 0 0 0 0 0 0 0 0 0 
1298.64 0 1007.19 0 0 1720.56 2184.44 0 0 0 0 0 0 0 0 -548.036 0 0 -2146.44 0 0 0 1043.2 1323.05 0 0 0 0 0 0 0 0 -1553.16 0 0 0 0.09 -1289.94 0 0 0 179.067 -547.578 562.075 0 0 0 0 0 0 0 
0 0 0 0 0 0 0 0 0 0 -1238.06 0 0 0 1966.84 0 0 0 -1417.66 0 0 0 0 -1955.7 0 984.603 0 0 0 0 0 0 0 0 0 0 771.889 0.04 0 0 0 0 0 2032.3 0 0 0 0 1262.93 0 0 
2312.92 0 0 0 0 0 0 0 0 0 -677.435 0 0 0 0 0 0 0 0 0 0 0 0 0 0 926.771 0 0 0 2129.96 0 0 0 0 0 0 0 0 0.02 0 0 0 0 0 0 0 0 0 0 0 0 
0 0 1534.55 1858.2 1543.55 0 0 0 0 0 0 511.719 0 0 0 1362.88 0 0 0 0 0 0 0 0 -1273.46 0 0 0 0 2392.88 0 0 0 0 0 1926.86 0 0 0 0.09 0 0 0 0 0 0 0 0 0 0 0 
0 0 0 0 441.984 0 1182.52 0 0 0 0 -1920.15 0 0 1386.99 0 0 0 0 0 0 0 2102.19 0 1432 -1090.81 0 0 0 0 0 0 0 0 0 0 0 0 0 0 0.06 0 740.913 0 0 0 0 0 0 0 0 
0 0 0 0 0 0 0 1957.69 0 0 1762.06 0 0 0 0 0 169.607 0 0 0 0 0 0 0 0 0 0 0 0 0 0 0 0 0 0 0 32.8837 0 0 0 0 0.02 0 0 673.772 0 0 0 0 0 0 
0 0 0 0 0 0 0 0 953.169 0 0 897.32 0 0 0 -952.254 2467.5 0 0 0 0 0 0 0 0 0 0 0 0 0 0 0 0 0 0 0 -686.132 0 0 0 221.946 0 0.07 0 -1063.65 0 0 0 0 0 0 
0 0 0 0 0 0 0 0 0 0 0 0 0 0 0 0 0 0 0 0 0 0 0 0 1284.14 0 -2422.48 563.601 0 -1045.95 0 0 0 0 702.46 0 1681.95 -702.918 0 0 0 0 0 0.08 1818.83 0 0 0 0 0 0 
0 0 0 0 2001.02 1301.54 0 0 0 0 0 0 0 0 0 0 0 0 -869.091 0 -511.719 0 0 0 0 0 0 899.152 0 0 0 1767.71 0 0 0 0 0 0 0 0 0 -2216.03 1233.18 627.232 0.08 0 0 0 0 0 0 
0 0 0 0 0 0 0 0 0 0 0 0 0 0 0 0 0 0 0 0 0 0 0 0 0 0 0 0 0 0 0 0 0 1525.54 0 0 0 0 0 0 0 0 0 0 0 0.07 0 0 0 0 0 
0 0 0 0 0 0 0 0 0 0 0 0 0 0 0 0 0 0 0 0 0 0 0 0 0 0 0 0 0 0 0 0 1265.53 0 0 0 0 0 0 0 0 0 0 0 0 0 0.01 0 0 0 0 
0 0 0 0 0 0 0 0 0 0 0 0 0 0 0 0 0 0 0 0 0 0 1531.19 0 0 0 0 0 0 0 0 0 0 0 0 0 0 0 0 0 0 0 0 0 0 0 0 0.05 0 0 0 
0 0 0 0 0 0 0 0 0 0 0 0 0 0 0 0 0 0 0 0 0 0 0 0 0 0 0 0 0 0 0 0 0 0 0 0 0 1583.07 0 0 0 0 0 0 0 0 0 0 0 1785.26 0 
0 0 0 0 0 0 0 0 0 0 0 0 0 0 0 0 0 0 0 0 0 0 0 0 0 0 0 0 0 0 0 0 0 0 0 0 0 0 0 0 0 0 0 0 0 0 0 0 1302.15 0.06 0 
0 0 1951.28 0 0 0 0 0 0 0 0 0 0 0 0 0 0 0 0 0 0 0 0 0 0 0 0 0 0 0 0 0 0 0 0 0 0 0 0 0 0 0 0 0 0 0 0 0 0 0 0 
