*Vertices 59
*Matrix 
0.05 0 1830.12 -1949.29 0 0 0 -1344.57 127.338 0 0 0 0 1648.99 0 0 -199.21 0 -229.575 2366.48 2257.38 0 0 686.438 0 0 0 -2198.93 0 0 0 0 2081.59 0 2227.62 0 0 0 0 0 -207.297 0 0 1348.84 0 0 0 0 0 0 0 2122.03 0 0 0 -2192.68 0 0 0 
0 0 461.669 0 0 0 0 0 0 -727.18 0 -1838.36 0 0 0 0 0 0 0 293.817 0 354.244 0 0 0 0 0 0 0 0 0 1758.25 -542.695 0 -1114.15 0 0 0 0 0 0 226.066 0 1983.02 0 0 0 1679.97 0 0 0 0 0 650.883 862.987 0 0 0 0 
-1379.36 1341.36 0.07 0 0 0 -944.624 927.534 204.245 1576.05 0 -1329.46 0 0 0 0 0 524.537 152.516 0 0 0 0 0 -35.3252 -1226.16 0 -463.195 0 1082.72 0 0 0 0 0 0 0 1661.5 0 0 484.1 -121.693 0 0 292.444 0 0 2398.68 -6.18 0 0 0 0 0 0 0 0 0 0 
-1679.2 0 0 0.09 0 1366.7 0 0 0 0 0 1463.29 0 1235.77 1134.45 -2198.02 0 0 0 -1609.32 0 0 0 0 0 0 0 0 0 0 -908.917 -1579.26 86.4437 0 286.492 -861.461 0 829.112 0 0 0 0 0 0 0 0 0 -1394.77 0 0 2422.18 0 0 0 0 0 0 0 0 
0 0 0 0 0 484.252 0 0 0 0 0 1321.99 345.393 0 0 0 0 1519.29 0 0 0 0 0 0 -1456.11 0 0 0 0 0 0 0 0 0 0 0 2343.9 0 0 -13.1993 927.076 0 0 0 0 0 0 0 453.734 0 0 2198.48 0 0 -595.95 0 0 0 0 
0 0 0 349.361 327.693 0 2233.57 0 0 1146.96 0 0 0 0 0 0 0 0 0 0 0 0 -64.9281 0 -1959.52 0 -1896.65 0 2212.82 0 0 0 0 0 0 -717.261 602.512 0 0 -561.464 0 -31.3578 0 0 0 0 0 0 0 0 0 0 0 0 0 0 0 0 0 
0 0 -2352.6 0 0 -34.257 0.06 0 0 0 0 0 0 0 0 2473.14 0 0 -1417.97 0 2232.51 2188.86 -1820.35 0 37.0037 907.239 0 0 0 0 0 0 0 0 0 0 0 0 0 568.331 191.58 0 0 0 0 0 768.838 0 -411.313 0 0 121.387 0 0 654.241 0 0 0 0 
262.688 0 1366.54 0 0 0 0 0.03 0 0 0 0 0 2227.47 -2388.3 -190.359 0 0 0 0 0 -1523.87 0 0 936.232 0 0 0 0 0 0 1959.67 0 0 398.953 -2254.63 0 454.497 0 65.9963 0 2402.95 0 0 0 2265.62 0 1431.09 0 0 0 0 -1997.05 0 786.996 151.601 1953.11 0 0 
14.42 0 1410.79 0 0 0 0 0 0 0 0 0 0 0 1879.25 390.408 0 0 2172.84 0 0 0 0 0 0 0 0 0 522.401 0 0 0 0 0 976.058 0 -2457.27 0 1610.23 0 0 0 0 0 0 311.365 -549.409 0 0 0 0 0 0 0 0 0 0 0 0 
0 1227.23 -1839.12 0 0 1891.61 0 0 0 0.03 0 0 207.297 -319.3 0 0 0 0 0 -1179.92 0 712.989 0 1946.85 1520.36 0 0 0 0 0 0 501.953 0 -2446.59 0 0 0 0 0 539.949 0 0 0 0 2116.84 1981.49 -533.998 0 0 0 0 0 0 0 1709.42 2261.04 2298.43 0 0 
0 0 0 0 0 0 0 0 0 0 0.04 0 0 0 1217.15 0 0 0 524.842 0 1739.17 -1651.13 571.383 0 0 2054.58 0 -527.436 0 0 0 379.421 -1154.44 0 0 -1364.86 0 0 0 0 0 370.876 2469.79 0 0 0 289.697 304.956 912.58 0 0 0 0 0 0 278.253 0 0 0 
0 718.94 2358.09 1725.29 1457.18 0 0 0 0 0 0 0.08 0 0 -1811.96 -1527.83 2032.91 0 1755.96 0 0 0 0 0 0 0 0 0 0 0 0 0 0 0 0 -1561.25 0 0 0 0 -596.561 2087.39 -657.14 0 0 0 -28.0007 0 739.845 0 0 0 0 0 1730.17 0 0 1868.42 0 
0 0 0 0 662.175 0 0 0 0 -712.226 0 0 0 0 0 2207.02 0 0 833.079 0 0 0 0 2480.77 0 0 0 0 0 1395.84 0 918.378 0 0 -854.442 0 0 0 0 1589.94 0 0 0 0 673.315 0 -952.254 -1145.13 0 187.918 0 0 0 0 2074.88 0 0 0 0 
1441.92 0 0 2498.78 0 0 0 -1136.13 0 -32.7311 0 0 0 0 0 0 0 0 0 1015.12 0 0 0 0 0 0 1411.71 789.132 0 0 0 0 0 0 0 -54.7044 0 0 0 0 0 0 0 0 0 0 0 0 0 0 0 0 0 2136.22 0 0 0 0 1672.03 
0 0 0 -618.076 0 0 0 -505.31 -1251.79 0 2074.27 -1731.24 0 0 0.08 0 2118.98 1304.13 0 1457.34 0 0 0 933.18 0 0 0 0 0 0 0 0 0 0 0 0 0 0 0 0 0 0 0 1191.82 0 0 1663.03 1551.79 1699.8 0 1541.87 0 0 0 0 0 0 0 0 
0 0 0 -1014.21 0 0 1096 2192.22 487.762 0 0 -1860.64 1661.5 0 0 0.06 2349.39 659.429 2447.36 0 0 0 -1107.9 1048.08 -1196.25 0 0 0 -1074.48 0 0 0 0 907.849 309.381 0 0 0 0 0 0 0 1130.63 0 0 0 0 1491.82 0 -1491.67 2328.03 0 0 0 0 0 0 -2036.58 0 
2445.98 0 0 0 0 0 0 0 0 0 0 -1932.51 0 0 1847.36 2041.15 0.02 0 0 0 0 -2098.22 0 1253.62 0 1709.42 0 0 0 795.694 0 0 -1795.79 0 0 0 0 0 -599.765 0 -477.081 0 0 0 1846.29 0 0 0 0 2394.1 0 0 -509.125 0 0 0 0 0 0 
0 0 2476.81 0 -1704.69 0 0 0 0 0 0 0 0 0 1055.25 -371.639 0 0.09 0 0 0 0 463.652 2338.86 0 -1850.57 0 0 0 0 0 0 60.6555 0 0 77.7459 0 435.118 1027.63 0 0 0 -684.301 0 0 1822.34 0 930.28 0 0 -1079.21 0 0 0 0 0 0 0 0 
-1294.21 0 -1771.07 0 0 0 759.224 0 938.52 0 1182.21 2157.73 957.137 0 0 -49.3637 0 0 0.05 0 0 -722.144 0 1526.31 813.852 -729.774 0 0 241.783 0 0 0 0 0 0 0 2156.36 0 0 0 0 0 0 -2039.32 -966.445 0 0 1450.47 0 0 0 0 0 0 0 0 0 0 0 
-237.815 -644.78 0 -54.7044 0 0 0 0 0 430.082 0 0 0 -817.972 229.423 0 0 0 0 0 0 0 -572.909 0 1828.59 0 0 -123.066 0 0 0 46.9222 0 0 692.694 699.103 1299.25 2317.65 0 1364.25 0 0 0 0 0 0 0 0 0 -1265.22 0 0 0 215.384 0 0 0 0 0 
906.171 0 0 0 0 0 433.897 0 0 0 2124.93 0 0 0 0 0 0 0 0 0 0.08 0 0 0 547.578 0 0 0 -2321.62 939.131 0 -40.0555 0 0 0 0 0 0 0 -2122.03 0 0 0 0 0 2434.08 0 696.509 0 0 0 0 0 0 0 0 0 0 0 
0 1356.32 0 0 0 0 548.494 972.549 0 1104.69 1474.27 0 0 0 0 0 -2154.23 0 -279.626 0 0 0.05 1331.29 0 0 -752.358 0 0 0 0 0 0 0 0 0 0 0 0 0 0 0 0 0 0 0 1503.11 0 -1006.88 1600.92 0 87.5118 0 0 0 0 0 0 0 0 
0 0 0 0 0 -720.466 2187.64 0 0 0 2152.39 0 0 0 0 -627.079 0 2180.01 0 376.675 0 -875.195 0.04 0 -210.501 -1084.7 0 209.128 0 0 0 0 0 0 -1169.55 0 0 950.88 0 0 0 0 0 0 0 0 0 0 0 0 -1097.52 0 0 0 0 0 0 0 0 
-2447.36 0 0 0 0 0 0 0 0 402.31 0 0 580.691 0 1629.31 1882.15 705.817 -676.824 -1877.42 0 0 0 0 0.07 0 0 0 0 2395.32 0 0 0 0 0 0 0 0 0 0 0 0 0 0 1638 -2118.37 0 0 -2144 0 0 -183.95 0 0 2031.69 0 0 0 0 0 
0 0 931.501 0 2207.02 622.044 -2432.1 2471.01 0 2069.99 0 0 0 0 0 1198.39 0 0 745.186 265.587 1302.45 0 -661.718 0 0.01 0 -1958.14 0 0 0 0 0 296.869 0 0 0 0 0 0 601.444 0 0 0 0 0 0 0 1190.91 1431.55 0 0 0 0 0 -1086.54 0 -473.724 0 1414.15 
0 0 1071.12 0 0 0 -1392.94 0 0 0 2007.74 0 0 0 0 0 1831.03 -1656.93 -180.746 0 0 -936.995 -119.251 0 0 0.06 0 -1895.28 0 0 0 0 0 0 142.75 0 -804.392 2364.04 0 0 0 0 112.995 0 0 0 0 1618.17 0 0 0 0 0 0 0 0 0 0 2229.15 
0 0 0 0 0 1675.54 0 0 0 0 0 0 0 -1264 0 0 0 0 0 0 0 0 0 0 -1984.08 0 0.04 527.436 2374.72 0 0 0 0 1929.91 -1805.7 0 0 0 0 0 0 0 1938.46 0 0 0 0 451.75 0 1632.97 0 0 2487.18 0 2217.09 0 717.261 0 0 
-358.211 0 1565.37 0 0 0 0 0 0 0 2291.41 0 0 2476.35 0 0 0 0 0 -264.214 0 0 453.429 0 0 2033.98 1991.41 0.05 -49.0585 0 0 0 0 0 0 0 -837.046 0 0 0 2474.21 0 -432.524 789.743 0 0 0 -900.067 0 0 1426.51 -354.091 0 0 525.605 373.012 0 0 0 
0 0 0 0 0 -2362.51 0 0 1290.55 0 0 0 0 0 0 2439.73 0 0 306.94 0 786.386 0 0 -793.1 0 0 505.005 -783.486 0.03 0 0 0 0 1825.69 0 0 0 0 0 0 -199.667 0 0 926.923 0 2437.59 0 0 0 0 0 0 1653.11 317.927 2284.08 0 -2371.21 0 0 
0 0 -2414.85 0 0 0 0 0 0 0 0 0 -810.19 0 0 0 -27.0852 0 0 0 -1776.25 0 0 0 0 0 0 0 0 0.04 0 2494.2 -135.578 1729.87 0 0 -1136.59 0 0 0 0 0 0 0 0 0 0 1884.9 1613.9 0 0 0 0 0 2061.45 0 0 0 0 
0 0 0 2209.31 0 0 0 0 0 0 0 0 0 0 0 0 0 0 0 0 0 0 0 0 0 0 0 0 0 0 0.01 0 0 0 0 0 0 0 0 0 2232.66 2078.39 0 -1985.46 -2214.96 0 0 0 -373.623 0 -222.251 0 0 1599.86 0 0 0 0 351.039 
0 470.061 0 2495.12 0 0 0 -1925.49 0 1407.59 -681.707 0 -1802.8 0 0 0 0 0 0 1533.33 542.695 0 0 0 0 0 0 0 0 -578.555 0 0.07 -663.854 1406.22 0 -1467.25 0 0 0 54.2467 0 0 0 0 0 0 0 0 0 0 0 0 0 0 0 0 0 0 0 
-1764.81 745.643 0 1435.67 0 0 0 0 0 0 -551.698 0 0 0 0 0 51.1948 1747.41 0 0 0 0 0 0 1215.78 0 0 0 0 1209.22 0 -996.658 0.09 0 0 0 0 0 73.3207 0 0 0 0 0 0 0 0 0 0 0 0 1192.89 0 0 0 1601.69 0 -1442.53 0 
0 0 0 0 0 0 0 0 0 -1206.32 0 0 0 0 0 -941.725 0 0 0 0 0 0 0 0 0 0 1318.93 0 1090.96 1229.82 0 2387.84 0 0.01 0 0 2407.68 0 0 0 0 -1969.74 0 471.892 0 0 0 0 0 0 295.495 0 0 0 698.187 0 0 0 0 
1413.54 2218.47 0 1514.4 0 0 0 -977.889 658.361 0 0 0 1778.24 0 0 1597.42 0 0 0 -1059.68 0 0 443.358 0 0 1237.14 1470.15 0 0 0 0 0 0 0 0.01 0 0 0 854.137 0 0 0 0 0 -1268.58 1992.32 2414.4 0 0 1002.3 35.6304 0 0 0 0 0 0 0 0 
0 0 0 1998.43 0 -1636.33 0 2036.27 0 0 1347.47 73.3207 0 -732.826 0 0 0 -2028.03 0 2337.64 0 0 0 0 0 0 0 0 0 0 0 210.807 0 0 0 0.08 0 0 0 -1284.75 0 2218.01 1891.77 0 0 0 -239.189 -365.993 0 0 0 892.438 0 0 0 0 0 0 0 
0 0 0 0 1671.27 648.442 0 0 2051.07 0 0 0 0 0 0 0 0 0 1729.71 1564.46 0 0 0 0 0 130.085 0 1185.42 0 1832.87 0 0 0 -2064.96 0 0 0.07 0 0 0 0 0 0 -1968.52 0 0 0 0 0 0 0 0 0 0 0 0 0 38.8348 0 
0 0 1502.04 -2384.33 0 0 0 -1012.68 0 0 0 0 0 0 0 0 0 -1598.48 0 2389.37 0 0 221.641 0 0 461.821 0 0 0 0 0 0 0 0 0 0 0 0.07 0 -714.82 1112.48 0 0 0 0 0 56.3829 0 2463.99 0 1242.64 0 0 0 0 0 1605.35 0 0 
0 0 0 0 0 0 0 0 1510.13 0 0 0 0 0 0 0 66.6066 -579.775 0 0 0 0 0 0 0 0 0 0 0 0 0 0 -2025.59 0 461.516 0 0 0 0 0 0 887.555 0 0 0 2247.61 0 2021.16 0 397.275 0 0 0 0 0 0 0 0 -1941.05 
0 0 0 0 -78.6615 1872.84 830.027 -2440.03 0 -1333.74 0 0 -1534.7 0 0 0 0 0 0 457.549 2482.15 0 0 0 538.881 0 0 0 0 0 0 2489.93 0 0 0 1133.53 0 163.35 0 0.01 0 -120.777 0 0 0 0 0 0 0 0 0 0 0 0 0 0 0 0 0 
-1729.87 0 798.288 0 491.272 0 361.568 0 0 0 0 -2085.86 0 0 0 0 1192.59 0 0 0 0 0 0 0 0 0 0 1769.23 1734.29 0 -991.775 0 0 0 0 0 0 -1255 0 0 0.05 1616.79 447.783 0 -453.124 0 520.112 369.961 0 201.651 0 0 1542.79 0 0 0 0 0 0 
0 -1016.65 -201.193 0 0 2397.92 0 -742.897 0 0 -517.975 508.82 0 0 0 0 0 0 0 0 0 0 0 0 0 0 0 0 0 0 2115.31 0 0 663.244 0 -1102.4 0 0 763.955 2464.14 2234.18 0.06 0 0 0 0 0 -2418.52 0 -803.934 0 2258.45 0 0 82.1711 0 0 0 0 
0 0 0 0 0 0 0 0 0 0 -1457.03 2178.33 0 0 0 1969.28 0 574.587 0 0 0 0 0 0 0 -738.929 2374.87 2226.86 0 0 0 0 0 0 0 -1507.23 0 0 0 0 -1890.55 0 0.02 0 1048.84 0 1258.96 -945.692 0 -32.2733 0 -2215.57 0 0 0 0 0 0 0 
1394.31 -1077.53 0 0 0 0 0 0 0 0 0 0 0 0 -947.829 0 0 0 502.564 0 0 0 0 -821.329 0 0 0 -30.4422 2171.62 0 837.809 0 0 1856.21 0 0 164.113 0 0 0 0 0 0 0.02 0 0 1517.3 0 0 0 0 0 0 -2435.15 -120.472 0 0 0 0 
0 0 -243.919 0 0 0 0 0 0 -1304.13 0 0 89.1903 0 0 0 779.519 0 -613.041 0 0 0 0 409.94 0 0 0 0 0 0 1844.46 0 0 0 2417.91 0 0 0 0 0 1049.61 0 2483.52 0 0.05 2431.03 0 0 0 0 1668.83 0 40.2081 0 0 0 0 0 0 
0 0 0 0 0 0 0 2450.1 742.744 -187.765 0 0 0 0 0 0 0 -2132.56 0 0 2318.41 -1048.08 0 0 0 0 0 0 1738.87 0 0 0 0 0 314.264 0 0 0 373.318 0 0 0 0 0 -232.78 0.08 1549.04 0 0 0 0 -795.846 1933.12 0 0 0 0 0 0 
0 0 0 0 0 0 2075.18 0 1762.37 2182.91 488.372 2066.64 1408.81 0 -372.25 0 0 0 0 0 0 0 0 0 0 0 0 0 0 0 0 0 0 0 2348.63 -2192.07 0 646.763 0 0 -2173.6 0 1764.66 -1784.8 0 52.2629 0.03 0 0 -586.947 0 0 0 -2109.97 0 0 0 0 0 
0 1085.16 -1049.3 -1770.91 0 0 0 72.4052 0 0 -2475.28 0 918.989 0 752.815 2394.41 0 2345.58 1202.05 0 -1111.41 617.771 0 -1226.31 2313.38 336.543 1624.73 1847.82 0 123.524 0 0 0 0 0 270.623 0 0 -1937.85 0 -2064.96 1796.4 778.146 0 0 0 0 0.08 0 -2358.85 -871.99 0 304.041 0 0 0 0 0 0 
0 0 1869.95 0 1973.86 0 952.101 0 0 0 343.715 2211.29 0 0 836.131 0 0 0 0 0 0 -120.167 0 0 1628.39 0 0 0 0 583.132 2479.09 0 0 0 0 0 0 2452.85 0 0 0 0 0 0 0 0 0 0 0.09 -2078.08 -2198.02 0 0 0 2286.22 0 0 0 0 
0 0 0 0 0 0 0 0 0 0 0 0 664.922 0 0 -1483.12 67.5222 0 0 -815.226 0 0 0 0 0 0 -1255 0 0 0 0 0 0 0 283.746 0 0 0 -1461.3 0 -562.532 1233.63 1604.43 0 0 0 2095.02 1280.48 127.949 0.08 0 647.221 0 0 1331.75 0 76.0674 1784.65 0 
0 0 0 1410.49 0 0 0 0 0 0 0 0 0 0 2348.17 -2150.11 0 457.244 0 0 0 1818.52 2427.52 1732.46 0 0 0 170.217 0 0 165.944 0 0 259.178 426.878 0 0 2168.26 0 0 0 0 0 0 1629 0 0 -1186.18 1848.43 0 0.07 0 -642.033 0 0 0 0 0 2018.27 
1076.16 0 0 0 981.704 0 2456.97 0 0 0 0 0 0 0 0 0 0 0 0 0 0 0 0 0 0 0 0 1166.19 0 0 0 0 322.199 0 0 980.331 0 0 0 0 0 378.506 -2111.04 0 0 333.033 0 0 0 1279.56 0 0.06 0 351.65 0 0 0 0 0 
0 0 0 0 0 0 0 544.984 0 0 0 0 0 0 0 0 2408.44 0 0 0 0 0 0 0 0 0 2001.02 0 1330.38 0 0 0 0 0 0 0 0 0 0 0 1845.38 0 0 0 1360.44 -1212.88 0 2351.53 0 0 -2088.46 0 0.06 0 2363.43 0 0 0 0 
0 -864.666 0 0 0 0 0 0 0 0 0 0 0 1961.81 0 0 0 0 0 949.355 0 0 0 -385.22 0 0 0 0 -2160.63 0 2048.02 0 0 0 0 0 0 0 0 0 0 0 0 57.9089 0 0 650.273 0 0 0 0 2130.12 0 0.04 1763.89 0 -1068.99 -1142.54 0 
0 1437.5 0 0 -1077.53 0 -169.607 293.512 0 1267.66 0 2375.48 -904.492 0 0 0 0 0 0 0 0 0 0 0 731.605 0 2104.94 136.647 2247.15 -1038.32 0 0 0 -1244.47 0 0 0 0 0 0 0 -1185.57 0 -1618.93 0 0 0 0 922.651 -55.3148 0 0 1637.55 1231.04 0.06 -543.001 0 0 0 
1661.81 0 0 0 0 0 0 -1981.03 0 -836.741 323.725 0 0 0 0 0 0 0 0 0 0 0 0 0 0 0 0 896.405 0 0 0 0 683.538 0 0 0 0 0 0 0 0 0 0 0 0 0 0 0 0 0 0 0 0 0 1149.25 0.07 0 0 0 
0 0 0 0 0 0 0 1045.18 0 386.898 0 0 0 0 0 0 0 0 0 0 0 0 0 0 70.1163 0 -873.211 0 1160.85 0 0 0 0 0 0 0 0 704.138 0 0 0 0 0 0 0 0 0 0 0 2070.3 0 0 0 173.421 0 0 0.01 -1439.79 2182.45 
0 0 0 0 0 0 0 0 0 0 0 112.384 0 0 0 -1411.71 0 0 0 0 0 0 0 0 0 0 0 0 0 0 0 0 1989.88 0 0 0 603.732 0 0 0 0 0 0 0 0 0 0 0 0 -667.974 0 0 0 -349.513 0 0 270.47 0.02 1235.77 
0 0 0 0 0 0 0 0 0 0 0 0 0 1993.24 0 0 0 0 0 0 0 0 0 0 800.577 -15.183 0 0 0 0 3.58592 0 0 0 0 0 0 0 440.611 0 0 0 0 0 0 0 0 0 0 0 -615.787 0 0 0 0 0 1925.64 1666.69 0 
