*Vertices 64
*Matrix 
0.01 0 0 0 0 0 727.79 0 -2362.36 0 0 0 0 0 0 0 0 0 0 0 0 0 0 0 0 0 664.006 0 0 0 0 0 0 0 0 2055.65 1953.87 0 0 0 0 0 0 -2158.04 0 2322.23 0 -156.484 0 0 0 0 0 891.369 0 0 0 0 0 0 0 0 0 0 
0 0.03 -93.0052 -1360.59 0 0 0 0 -571.23 0 0 0 0 0 0 0 0 0 1318.32 0 0 1070.21 647.984 0 347.987 0 0 0 0 0 0 0 0 0 0 0 0 0 0 0 0 2040.09 0 0 0 0 0 0 -209.738 0 0 0 0 0 0 0 0 0 0 0 0 0 0 0 
0 119.251 0.02 0 0 -333.186 0 0 0 0 0 2394.71 0 0 0 0 0 0 0 0 0 0 0 0 0 0 0 0 0 1414 0 56.5355 -784.707 1469.54 0 0 164.113 1493.8 0 0 0 0 0 0 0 0 0 0 0 0 0 0 0 0 0 0 0 0 0 0 0 0 0 0 
0 -1405.45 0 0 0 0 1371.73 0 0 0 0 1258.81 0 0 0 0 0 0 0 0 0 0 0 0 2443.54 1139.48 0 0 0 0 0 0 0 0 0 0 0 0 0 0 0 0 0 0 0 0 0 0 0 0 0 0 0 0 0 0 0 0 0 0 0 0 0 0 
0 0 0 0 0.02 0 0 0 0 0 0 0 584.048 0 0 0 0 0 0 0 0 0 0 572.756 0 1377.22 0 0 0 0 0 1520.51 0 0 0 0 0 0 0 0 0 0 0 0 1314.66 0 0 0 0 0 0 2006.97 0 0 0 0 0 0 0 0 0 0 0 0 
0 0 -547.884 0 0 0.08 0 0 0 0 2123.1 0 0 1454.59 0 0 0 0 0 0 0 0 0 0 0 0 0 0 0 0 0 0 0 0 0 0 0 0 0 0 0 0 0 0 0 0 0 0 0 -2226.1 1244.47 0 0 0 0 0 0 0 0 0 0 0 0 0 
2156.82 0 0 -918.378 0 0 0.08 0 0 0 0 -320.673 0 0 0 0 0 0 0 0 0 0 0 0 0 0 0 0 2115.77 0 0 939.436 0 0 0 0 0 0 0 0 0 0 0 0 0 0 0 0 0 0 0 693.762 0 0 0 0 0 0 0 0 0 0 0 0 
0 0 0 0 0 0 0 0.09 0 0 0 1580.48 -884.198 0 0 -2349.7 0 1179.01 0 0 0 0 0 0 0 2282.86 0 0 0 0 0 611.972 0 -649.358 0 0 0 0 0 0 0 0 1845.99 0 0 0 0 0 0 1794.11 0 0 0 0 0 0 0 0 0 0 0 0 0 0 
1282.62 1819.44 0 0 0 0 0 0 0.06 1124.53 -2058.55 0 0 -475.249 0 0 0 0 0 0 0 2120.2 0 0 0 0 0 0 0 0 0 -637.15 0 0 0 0 2460.78 0 0 755.104 0 -1354.49 0 0 0 0 0 0 0 0 0 0 0 0 0 0 0 0 0 -721.076 0 0 0 0 
0 0 0 0 0 0 0 0 1342.13 0.06 0 -87.054 861.461 -1222.34 0 0 0 0 0 0 -2021.16 1475.04 0 0 0 0 0 0 1735.51 0 0 0 0 0 0 0 0 0 1753.52 0 0 0 0 1475.04 0 0 0 0 0 0 0 0 0 0 0 0 0 0 0 0 0 0 0 0 
0 0 0 0 0 16.7089 0 0 94.9889 0 0.07 0 0 1038.16 0 1153.98 0 0 0 0 0 0 0 0 0 0 0 0 -2358.39 0 0 0 0 0 0 0 0 0 0 0 0 0 0 0 -1036.48 0 0 0 0 0 0 0 707.19 0 0 2453.31 0 0 0 0 0 0 0 0 
0 0 2145.07 -755.562 0 0 1517.91 -798.898 0 118.946 0 0.08 0 0 0 0 2426.91 0 0 0 0 0 0 0 0 0 0 1748.18 0 0 0 0 1300.32 0 0 0 0 0 490.661 0 0 0 0 1317.41 -8.46889 0 0 0 0 0 0 0 -2426.6 0 0 0 0 0 0 0 0 0 0 0 
0 0 0 0 -119.709 0 0 -2155.75 0 615.177 0 0 0.03 0 0 -155.873 0 0 0 0 -2158.19 0 0 0 0 0 0 0 1573.46 0 0 0 0 0 0 1309.63 554.14 0 0 0 0 0 0 0 0 0 595.187 0 0 0 0 0 0 0 0 1870.25 0 0 0 0 0 0 0 0 
0 0 0 0 0 1969.59 0 0 -1834.7 1203.42 1672.19 0 0 0.02 868.023 0 0 0 0 0 0 0 0 0 0 0 0 0 0 0 0 0 0 0 0 0 1994.16 0 2332.61 0 0 0 0 0 0 0 0 0 0 0 0 0 0 0 0 0 0 0 0 0 0 0 0 0 
0 0 0 0 0 0 0 0 0 0 0 0 0 -979.263 0.04 0 0 0 0 0 0 0 1218.83 0 0 735.42 0 0 0 0 0 0 0 0 1446.96 0 0 -416.044 0 0 0 0 0 0 -300.226 0 0 0 -879.162 0 0 0 1198.69 0 0 0 0 0 0 0 0 0 0 0 
0 0 0 0 0 0 0 1990.8 0 0 1958.6 0 1919.84 0 0 0.03 0 1197.32 0 0 -2460.94 0 0 0 0 0 775.246 0 0 0 0 0 1212.73 1435.82 -523.927 0 -913.648 0 0 0 0 0 0 0 0 0 0 26.1696 0 0 0 0 0 0 235.984 0 0 0 0 0 0 0 0 0 
0 0 0 0 0 0 0 0 0 0 0 1703.31 0 0 0 0 0.05 0 0 0 0 0 0 0 0 1684.24 0 0 0 0 -1124.99 0 0 2150.41 0 1380.43 0 0 0 0 0 0 0 0 0 0 0 0 -2492.07 0 0 0 0 0 0 1082.87 0 0 0 0 0 0 0 0 
0 0 0 0 0 0 0 68.4378 0 0 0 0 0 0 0 -1172.14 0 0.09 0 0 0 0 0 2161.7 0 -205.313 0 818.583 0 0 0 0 0 0 0 0 0 0 0 0 0 0 0 0 0 0 0 0 0 0 0 0 0 0 0 0 0 0 0 0 0 0 0 0 
0 1039.08 0 0 0 0 0 0 0 0 0 0 0 0 0 0 0 0 0.04 61.2659 0 -1450.93 0 0 0 0 0 0 0 0 0 0 0 0 0 1198.23 0 0 0 0 0 0 0 0 0 0 0 0 0.381481 0 0 0 1497.16 0 0 0 0 0 0 0 0 0 0 0 
0 0 0 0 0 0 0 0 0 0 0 0 0 0 0 0 0 0 542.848 0 405.057 0 0 0 0 0 0 0 0 0 1586.43 -2474.36 0 0 0 0 0 0 0 0 0 0 0 0 0 0 0 0 0 0 0 1181.45 0 0 0 0 0 0 0 0 0 0 0 0 
0 0 0 0 0 0 0 0 0 680.334 0 0 -1412.47 0 0 745.338 0 0 0 918.531 0.07 1835 0 0 0 0 0 0 0 0 1342.13 0 0 0 0 0 1396.3 0 0 0 0 0 0 0 0 0 0 -2496.95 0 0 0 0 0 0 0 0 0 0 0 0 0 0 0 0 
0 1911.6 0 0 0 0 0 0 -1468.78 2162.77 0 0 0 0 0 0 0 0 1658.6 0 -2060.84 0.01 0 0 0 0 0 0 0 0 0 0 0 0 0 0 0 0 693.304 0 0 0 0 0 0 0 0 0 0 0 -167.928 0 0 0 0 0 0 0 0 0 0 0 0 0 
0 -1874.83 0 0 0 0 0 0 0 0 0 0 0 0 -1340.3 0 0 0 0 0 0 0 0.09 0 0 0 0 0 -678.503 0 0 0 0 0 0 0 820.719 0 805.765 0 0 2264.55 0 0 0 0 0 0 0 0 2425.99 0 -1756.42 0 0 0 0 0 0 0 0 0 0 0 
0 0 0 0 -1508.3 0 0 0 0 0 0 0 0 0 0 0 0 1081.5 0 0 0 0 0 0.02 0 0 0 0 0 0 0 0 0 0 292.444 -415.891 0 0 0 0 0 1217.76 0 0 0 0 0 0 0 0 0 0 0 0 1205.25 0 0 0 0 0 0 0 0 0 
0 1325.5 0 -2134.08 0 0 0 0 0 0 0 0 0 0 0 0 0 0 0 0 0 0 0 0 0.03 0 0 0 1132.01 0 0 0 0 0 0 1029.31 0 0 0 0 0 -1177.48 0 0 0 0 -103.992 1506.32 0 0 0 0 2341.15 0 0 0 0 0 0 0 0 0 0 0 
0 0 0 1638.16 1172.44 0 0 -1672.49 0 0 0 0 0 0 1989.27 0 -2013.53 114.826 0 0 0 0 0 0 0 0 28.9163 0 0 0 0 0 0 0 0 0 0 0 0 0 -169.149 0 0 0 0 0 0 0 1312.07 0 0 0 0 -261.01 0 0 0 0 0 0 0 0 0 0 
80.4926 0 0 0 0 0 0 0 0 0 0 0 0 0 0 1842.48 0 0 0 0 0 0 0 0 0 2269.59 0.05 0 0 0 1582.31 0 0 0 2427.67 0 2416.99 0 0 0 0 0 0 0 0 1329.92 0 1524.48 0 0 -1368.68 0 0 0 243.919 -595.035 0 0 0 0 0 0 0 0 
0 0 0 0 0 0 0 0 0 0 0 -258.263 0 0 0 0 0 -203.635 0 0 0 0 0 0 0 0 0 0.05 0 0 0 0 0 0 0 0 0 808.359 0 1958.6 -1433.23 0 0 0 0 0 0 0 0 0 2195.73 0 0 0 0 0 0 -1035.11 0 0 0 0 0 0 
0 0 0 0 0 0 -2005.29 0 0 862.072 652.715 0 2239.98 0 0 0 0 0 0 0 0 0 764.565 0 1810.13 0 0 0 0.03 0 1154.13 0 0 0 0 0 856.12 0 0 0 0 0 0 0 0 0 0 2032.76 -1671.42 0 0 0 0 0 0 0 0 0 0 0 0 0 0 0 
0 0 2400.51 0 0 0 0 0 0 0 0 0 0 0 0 0 0 0 0 0 0 0 0 0 0 0 0 0 0 0.09 0 2200.77 2463.84 0 0 1068.53 0 0 0 0 0 0 0 0 0 743.965 0 0 0 0 0 0 2356.56 0 0 0 0 0 0 0 0 0 0 0 
0 0 0 0 0 0 0 0 0 0 0 0 0 0 0 0 -248.802 0 0 1435.82 2402.19 0 0 0 0 0 77.5933 0 779.366 0 0.03 0 0 0 2387.54 0 0 0 0 0 0 0 0 0 0 0 0 0 0 1459.78 0 0 0 0 0 0 0 0 0 0 0 0 0 0 
0 0 -602.512 0 828.501 0 -298.09 2497.86 249.26 0 0 0 0 0 0 0 0 0 0 62.6392 0 0 0 0 0 0 0 0 0 904.34 0 0.08 0 0 0 0 0 0 2182.91 0 0 0 0 0 0 0 0 0 0 0 0 0 -883.282 0 307.245 0 1439.18 0 0 0 0 0 0 0 
0 0 -999.71 0 0 0 0 0 0 0 0 -278.253 0 0 0 -390.255 0 0 0 0 0 0 0 0 0 0 0 0 0 901.593 0 0 0.01 0 0 0 0 0 0 1842.78 0 -2493.9 0 0 0 0 0 0 0 0 1691.41 0 -2061.6 2245.17 0 0 0 0 0 0 0 0 0 0 
0 0 2190.69 0 0 0 0 1590.24 0 0 0 0 0 0 0 79.1192 1907.33 0 0 0 0 0 0 0 0 0 0 0 0 0 0 0 0 0.05 0 0 0 0 0 0 0 0 0 0 0 314.57 0 -2354.58 0 0 0 0 487.304 645.848 0 0 0 0 0 0 0 2432.55 0 1580.17 
0 0 0 0 0 0 0 0 0 0 0 0 0 0 -1513.34 2211.91 0 0 0 0 0 0 0 2245.02 0 0 1610.84 0 0 0 -1003.98 0 0 0 0.03 0 0 0 0 0 0 0 0 0 0 0 0 0 0 0 0 0 0 0 -1984.24 0 0 0 0 0 0 0 -80.6452 0 
-2176.66 0 0 0 0 0 0 0 0 0 0 0 1670.96 0 0 0 729.926 0 758.461 0 0 0 0 2054.89 2069.99 0 0 0 0 -2068.93 0 0 0 0 0 0.04 0 0 0 0 0 278.71 0 0 0 0 1011.92 0 0 539.491 0 0 0 0 -1087.76 0 0 0 0 0 0 0 0 0 
906.323 0 -186.239 0 0 0 0 0 -697.272 0 0 0 -1117.97 -2164.6 0 2255.85 0 0 0 0 -2324.06 0 -1046.56 0 0 0 2249.44 0 1832.41 0 0 0 0 0 0 0 0.02 0 0 969.497 2399.59 -461.211 0 0 0 0 302.82 0 0 0 0 0 0 0 0 0 0 0 0 0 0 0 0 0 
0 0 1870.86 0 0 0 0 0 0 0 0 0 0 0 1274.83 0 0 0 0 0 0 0 0 0 0 0 0 1453.06 0 0 0 0 0 0 0 0 0 0.09 0 0 0 0 0 0 0 0 2128.13 0 2373.65 0 0 0 1584.9 0 0 0 0 0 0 0 0 0 0 0 
0 0 0 0 0 0 0 0 0 -43.5652 0 1198.08 0 1889.32 0 0 0 0 0 0 0 -1455.35 1183.28 0 0 0 0 0 0 0 0 2153.31 0 0 0 0 0 0 0.09 0 0 0 1926.71 0 0 0 0 0 0 0 0 0 0 -85.9859 0 0 0 0 0 0 0 0 0 0 
0 0 0 0 0 0 0 0 210.501 0 0 0 0 0 0 0 0 0 0 0 0 0 0 0 0 0 0 1245.54 0 0 0 0 1467.41 0 0 0 -1336.94 0 0 0.09 542.543 0 0 0 0 0 0 0 0 0 0 0 0 595.798 0 0 0 0 0 0 0 0 0 0 
0 0 0 0 0 0 0 0 0 0 0 0 0 0 0 0 0 0 0 0 0 0 0 0 0 -983.993 0 1455.35 0 0 0 0 0 0 0 0 615.482 0 0 -324.183 0.04 0 0 0 -1282.62 0 0 0 0 1845.53 623.417 0 0 0 -1423.61 0 0 0 0 0 0 0 0 0 
0 2261.5 0 0 0 0 0 0 976.211 0 0 0 0 0 0 0 0 0 0 0 0 0 -1109.27 -1765.11 1373.71 0 0 0 0 0 0 0 736.793 0 0 1809.06 -296.106 0 0 0 0 0.06 0 0 0 0 0 0 0 0 0 0 0 0 -2050 0 0 0 0 0 0 0 0 0 
0 0 0 0 0 0 0 -53.1785 0 0 0 0 0 0 0 0 0 0 0 0 0 0 0 0 0 0 0 0 0 0 0 0 0 0 0 0 0 0 1712.78 0 0 0 0.09 0 0 1317.71 0 0 0 1364.86 0 -403.684 0 0 -218.131 0 0 0 0 0 0 0 0 0 
-389.035 0 0 0 0 0 0 0 0 -1376.92 0 2097.31 0 0 0 0 0 0 0 0 0 0 0 0 0 0 0 0 0 0 0 0 0 0 0 0 0 0 0 0 0 0 0 0.04 0 0 0 0 0 0 0 0 2022.08 0 -739.998 0 0 0 0 0 0 0 0 0 
0 0 0 0 -716.651 0 0 0 0 0 -963.546 -224.845 0 0 -90.2585 0 0 0 0 0 0 0 0 0 0 0 0 0 0 0 0 0 0 0 0 0 0 0 0 0 -1290.7 0 0 0 0.03 0 0 2262.41 -1393.86 0 0 0 0 1401.03 0 702.307 0 0 0 0 0 0 0 0 
1939.68 0 0 0 0 0 0 0 0 0 0 0 0 0 0 0 0 0 0 0 0 0 0 0 0 0 2074.72 0 0 -690.405 0 0 0 -612.888 0 0 0 0 0 0 0 0 452.971 0 0 0.06 0 0 0 0 0 0 0 0 0 0 0 0 0 0 0 0 0 0 
0 0 0 0 0 0 0 0 0 0 0 0 2270.96 0 0 0 0 0 0 0 0 0 0 0 483.795 0 0 0 0 0 0 0 0 0 0 2452.7 2324.52 2188.71 0 0 0 0 0 0 0 0 0.02 0 0 0 0 818.43 0 0 0 607.089 0 0 0 0 0 0 0 0 
-578.86 0 0 0 0 0 0 0 0 0 0 0 0 0 0 2313.07 0 0 0 0 952.254 0 0 0 1647.16 0 1414.3 0 -211.875 0 0 0 0 -1066.7 0 0 0 0 0 0 0 0 0 0 2268.97 0 0 0.01 0 144.734 0 0 0 0 0 0 0 0 -1922.28 0 0 0 0 0 
0 -104.45 0 0 0 0 0 0 0 0 0 0 0 0 1193.66 0 1621.22 0 -1270.56 0 0 0 0 0 0 -15.0304 0 0 985.824 0 0 0 0 0 0 0 0 1075.55 0 0 0 0 0 0 -1648.23 0 0 0 0.05 0 0 0 0 0 0 0 0 0 0 0 0 0 0 0 
0 0 0 0 0 708.258 0 775.704 0 0 0 0 0 0 0 0 0 0 0 0 0 0 0 0 0 0 0 0 0 0 456.786 0 0 0 0 2196.49 0 0 0 0 1126.82 0 2353.97 0 0 0 0 238.121 0 0.09 0 0 0 0 0 2076.1 0 0 0 0 0 0 0 0 
0 0 0 0 0 1516.54 0 0 0 0 0 0 0 0 0 0 0 0 0 0 0 1180.68 2271.57 0 0 0 2017.81 2146.44 0 0 0 0 509.583 0 0 0 0 0 0 0 1455.66 0 0 0 0 0 0 0 0 0 0 -2131.49 0 0 0 0 0 0 0 0 0 0 0 0 
0 0 0 0 1247.98 0 2128.13 0 0 0 0 0 0 0 0 0 0 0 0 2348.93 0 0 0 0 0 0 0 0 0 0 0 0 0 0 0 0 0 0 0 0 0 0 -1888.1 0 0 0 -227.287 0 0 0 -1422.39 0.01 0 138.325 0 0 0 0 0 0 0 0 0 0 
0 0 0 0 0 0 0 0 0 0 -1641.67 -641.423 0 0 -424.894 0 0 0 463.347 0 0 0 335.017 0 1394.01 0 0 0 0 1716.44 0 1585.36 -2289.73 517.518 0 0 0 2364.35 0 0 0 0 0 -1875.13 0 0 0 0 0 0 0 0 0.07 0 254.906 0 0 0 0 0 0 0 0 0 
1789.99 0 0 0 0 0 0 0 0 0 0 0 0 0 0 0 0 0 0 0 0 0 0 0 0 -2141.87 0 0 0 0 0 0 -400.937 1045.95 0 0 0 0 1241.11 2137.29 0 0 0 0 -1031.75 0 0 0 0 0 0 -505.768 0 0.07 915.174 0 0 0 0 0 0 0 0 0 
0 0 0 0 0 0 0 0 0 0 0 0 0 0 0 2403.41 0 0 0 0 0 0 0 126.576 0 0 -811.258 0 0 0 0 452.513 0 0 37.3089 -2312.92 0 0 0 0 1042.13 1776.71 -1447.26 1619.39 0 0 0 0 0 0 0 0 -218.894 1526 0.05 501.801 0 0 0 0 0 0 0 0 
0 0 0 0 0 0 0 0 0 0 955.611 0 -2444.46 0 0 0 1866.59 0 0 0 0 0 0 0 0 0 983.23 0 0 0 0 0 0 0 0 0 0 0 0 0 0 0 0 0 817.362 0 44.0229 0 0 -105.365 0 0 0 0 -1978.29 0.08 0 0 0 0 0 0 0 0 
0 0 0 0 0 0 0 0 0 0 0 0 0 0 0 0 0 0 0 0 0 0 0 0 0 0 0 0 0 0 0 535.981 0 0 0 0 0 0 0 0 0 0 0 0 0 0 0 0 0 0 0 0 0 0 0 0 0.04 0 0 0 0 0 0 0 
0 0 0 0 0 0 0 0 0 0 0 0 0 0 0 0 0 0 0 0 0 0 0 0 0 0 0 1715.83 0 0 0 0 0 0 0 0 0 0 0 0 0 0 0 0 0 0 0 0 0 0 0 0 0 0 0 0 0 0.07 0 0 0 0 0 0 
0 0 0 0 0 0 0 0 0 0 0 0 0 0 0 0 0 0 0 0 0 0 0 0 0 0 0 0 0 0 0 0 0 0 0 0 0 0 0 0 0 0 0 0 0 0 0 2246.39 0 0 0 0 0 0 0 0 0 0 0.05 0 0 0 0 0 
0 0 0 0 0 0 0 0 714.209 0 0 0 0 0 0 0 0 0 0 0 0 0 0 0 0 0 0 0 0 0 0 0 0 0 0 0 0 0 0 0 0 0 0 0 0 0 0 0 0 0 0 0 0 0 0 0 0 0 0 0 1917.55 0 0 0 
0 0 0 0 0 0 0 0 0 0 0 0 0 0 0 0 0 0 0 0 0 0 0 0 0 0 0 0 0 0 0 0 0 0 0 0 0 0 0 0 0 0 0 0 0 0 0 0 0 0 0 0 0 0 0 0 0 0 0 939.283 0.08 0 0 0 
0 0 0 0 0 0 0 0 0 0 0 0 0 0 0 0 0 0 0 0 0 0 0 0 0 0 0 0 0 0 0 0 0 2165.67 0 0 0 0 0 0 0 0 0 0 0 0 0 0 0 0 0 0 0 0 0 0 0 0 0 0 0 0.02 0 0 
0 0 0 0 0 0 0 0 0 0 0 0 0 0 0 0 0 0 0 0 0 0 0 0 0 0 0 0 0 0 0 0 0 0 407.498 0 0 0 0 0 0 0 0 0 0 0 0 0 0 0 0 0 0 0 0 0 0 0 0 0 0 0 0.02 0 
0 0 0 0 0 0 0 0 0 0 0 0 0 0 0 0 0 0 0 0 0 0 0 0 0 0 0 0 0 0 0 0 0 2127.67 0 0 0 0 0 0 0 0 0 0 0 0 0 0 0 0 0 0 0 0 0 0 0 0 0 0 0 0 0 0.04 
