*Vertices 50
*Matrix 
0.06 0 0 872.906 0 2269.59 1374.94 -2384.95 0 1889.78 -1567.2 0 0 1236.38 358.669 0 0 0 1550.42 -986.892 -241.478 0 0 0 0 0 0 0 0 0 0 0 0 0 0 -615.635 0 0 0 0 1651.13 1408.35 0 0 0 0 0 0 0 482.116 
0 0.09 0 518.586 0 0 0 0 0 0 0 1568.73 0 0 0 0 0 1498.08 0 0 0 2264.85 0 0 -155.416 0 -359.432 0 0 2491.91 0 0 1711.1 0 2105.4 2092.58 869.243 125.355 0 948.286 0 0 1948.07 0 0 0 -801.34 0 0 0 
0 0 0.03 0 2120.96 0 0 0 0 -1338.47 0 0 0 0 2279.66 0 0 0 0 1364.86 0 0 1133.08 0 0 0 0 1456.88 -173.879 0 0 898.846 0 -365.535 0 0 0 0 1600.92 362.026 0 0 0 0 0 897.473 0 0 0 0 
-1783.73 2450.25 0 0.05 2444 0 0 -2178.18 0 -34.5622 0 0 1184.8 0 0 0 0 0 0 0 0 0 799.814 -300.531 0 1194.88 0 0 1493.8 -852.306 0 0 0 0 0 0 0 845.134 0 0 0 0 0 1601.54 0 0 0 0 0 0 
0 0 1502.04 1625.34 0.01 1182.67 -635.929 -489.441 1766.64 1343.96 270.013 0 0 0 -1527.99 0 -2335.51 1393.7 2467.65 0 0 0 2482.45 0 0 0 0 0 -381.863 -1994.16 0 0 0 0 1434.75 0 -292.749 0 -180.746 0 0 0 0 0 0 0 0 0 0 0 
1370.82 0 0 0 987.655 0.01 0 0 48.1429 0 2257.53 0 -554.445 0 0 0 0 0 0 0 747.017 0 0 1093.86 0 0 0 -1509.52 -763.344 1612.52 0 0 0 2266.08 0 0 0 0 -791.574 0 0 0 0 0 0 -273.827 0 0 -1048.54 0 
998.337 0 0 0 2426.76 0 0.01 0 0 341.426 0 801.187 0 0 0 0 0 2166.59 0 0 0 0 -2322.69 2216.18 0 0 -367.061 0 756.478 0 1499.3 0 0 0 -223.014 0 0 0 2432.86 0 0 0 0 0 0 1407.74 0 0 0 0 
-1483.28 0 0 426.267 682.623 0 0 0.02 -817.667 0 0 0 477.233 2145.53 0 -2290.8 1157.95 0 0 1976.76 860.088 2248.53 0 0 -2075.64 0 0 0 0 0 1020.31 0 0 0 782.266 0 0 0 0 0 0 0 2373.2 0 0 0 1282.62 0 -2190.39 0 
0 0 0 0 -828.959 -2203.82 0 1220.21 0.03 0 0 0 0 0 0 0 0 -194.784 2043.44 0 0 0 0 0 0 -1273.77 0 0 0 -424.284 2201.07 0 0 0 0 0 0 0 0 0 0 0 0 0 0 0 0 0 0 0 
-269.707 0 -1740.39 911.512 851.848 0 -1702.86 0 0 0.03 0 0 1725.44 0 833.995 0 0 0 0 0 2208.4 0 0 0 0 0 1140.1 0 0 0 1937.39 0 464.568 2455.44 536.286 0 -655.614 2344.66 845.439 0 0 0 -1718.27 0 -504.242 0 0 0 0 0 
637.608 0 0 0 2419.58 1381.04 0 0 0 0 0 0 -232.17 0 2123.71 0 758.156 0 0 1952.8 -1333.12 635.014 0 0 -2333.83 0 0 -836.894 0 -771.279 0 0 0 1007.95 0 -13.9622 0 0 1257.9 -315.18 0 0 0 0 0 0 1134.14 0 0 0 
0 1709.88 0 0 0 0 -687.658 0 0 0 0 0.03 0 0 0 0 -143.361 0 400.632 0 0 0 0 0 0 0 -2089.53 0 0 2091.36 0 0 2441.86 770.211 0 0 2096.7 22.3548 0 518.128 0 0 0 0 0 28.0007 1198.39 0 0 0 
0 0 0 1743.9 0 -718.329 0 -1451.84 0 2443.08 -1508.15 0 0.01 0 2195.27 0 0 2295.83 0 0 0 0 1123.16 0 356.38 1116.75 0 0 0 0 0 0 -1622.14 0 0 0 0 0 469.146 1053.12 0 0 0 0 0 0 0 0 1233.63 0 
15.3356 0 0 0 0 0 0 1214.41 0 0 0 0 0 0.07 0 0 0 0 0 0 0 1146.81 -153.432 1363.19 1645.18 0 -1655.4 0 0 0 0 0 0 0 1712.32 0 0 0 0 0 0 0 0 -1606.88 0 -216.605 0 0 0 0 
104.755 0 1866.44 0 1396.3 0 0 0 0 1498.38 -1235.77 0 -323.725 0 0.05 521.943 0 -410.398 582.675 0 1229.06 0 0 1005.36 -1500.67 0 0 0 0 0 0 2481.69 0 0 0 0 0 0 0 -2456.66 0 0 0 0 0 0 0 0 0 0 
0 0 0 0 0 0 0 1699.96 0 0 0 0 0 0 196.31 0.02 0 0 0 0 1175.34 0 -156.636 942.64 1022.9 1470 1389.58 0 0 0 -1568.58 0 0 1319.54 0 0 1592.53 0 0 0 0 -2044.21 0 0 0 1557.28 0 -1205.1 0 -1484.8 
0 0 0 0 -675.451 0 0 -797.983 0 0 -1285.36 762.123 0 0 0 0 0.04 0 0 0 0 -1989.88 0 0 980.636 0 0 0 2408.14 0 0 1414.3 1170.92 0 0 0 1544.62 0 -143.971 2333.06 0 0 0 2492.52 0 1776.56 0 0 0 0 
0 521.18 0 0 1851.02 0 1724.83 0 574.892 0 0 0 2086.93 0 -482.574 0 0 0.02 0 -1726.51 0 0 0 0 0 0 -886.181 0 0 0 0 0 0 0 0 0 0 0 1886.43 0 0 -1778.39 0 0 1041.83 0 0 0 0 0 
-1630.38 0 0 0 2050.16 0 0 0 -1793.95 0 0 387.051 0 0 -1965.01 0 0 0 0.06 0 0 2006.36 0 0 0 0 0 0 214.774 385.372 0 627.842 125.813 0 0 1746.8 0 0 0 0 0 0 0 1143.6 0 0 0 0 -1192.89 0 
-1661.81 0 1655.86 0 0 0 0 803.323 0 0 -602.817 0 0 0 0 0 0 784.555 0 0.01 0 0 0 0 0 0 0 0 0 425.657 0 0 0 526.826 0 0 0 201.651 2153.46 0 -2183.07 0 0 264.977 -2219.08 2204.58 792.947 0 0 0 
1571.63 0 0 0 0 1482.06 0 810.038 0 2319.18 2476.35 0 0 0 1984.08 -668.889 0 0 0 0 0.03 0 -389.035 -2060.53 0 0 0 0 1027.48 1404.84 0 0 605.869 0 0 0 -2171.93 0 0 0 0 0 0 144.734 0 1989.88 0 0 0 -1145.74 
0 2252.49 0 0 0 0 0 1978.59 0 0 369.045 0 0 1830.73 0 0 -1002.91 0 -153.584 0 0 0 1534.7 818.278 0 1589.02 0 -2266.99 2433.93 0 0 1611.91 0 0 0 -471.587 0 0 0 0 0 -222.709 0 0 0 123.676 0 -1604.74 0 0 
0 0 -1730.02 177.389 -137.41 0 -1372.49 0 0 0 0 0 1401.18 2161.7 0 532.472 0 0 0 0 1363.34 309.992 0.03 0 0 0 -544.526 0 0 0 0 0 0 0 0 0 0 0 2133.32 -466.247 0 0 0 0 0 0 0 0 0 803.476 
0 0 0 -857.036 0 371.181 -1306.88 0 0 0 0 0 0 1827.22 825.907 1707.43 0 0 0 0 1209.07 2191.61 0 0.09 -1088.82 0 0 141.53 27.2378 -1202.05 1802.8 0 -544.526 0 0 0 0 0 1947.92 703.528 0 0 0 0 0 0 0 0 0 0 
0 193.564 0 0 0 0 0 -2156.82 0 0 2382.81 0 2464.75 1599.25 1131.86 2389.68 2107.68 0 0 0 0 0 0 -860.546 0.05 0 0 77.4407 0 0 -496.307 0 0 -1792.12 0 0 0 320.978 0 0 0 0 -415.738 -597.781 -1563.69 0 0 0 0 0 
0 0 0 245.445 0 0 0 0 607.547 0 0 0 1250.42 0 0 1016.8 0 0 0 0 0 -535.981 0 0 0 0.08 0 0 0 0 1123.16 0 846.812 -442.9 0 -933.79 826.518 494.324 0 0 0 0 0 -2224.88 0 0 0 0 0 0 
0 -1390.96 0 0 0 0 325.709 0 0 2030.78 0 856.426 0 -937.605 0 -1055.56 0 -1952.04 0 0 0 0 557.649 0 0 0 0.01 0 1989.73 -402.31 0 0 0 2264.85 0 0 0 671.026 0 1878.8 0 0 0 0 0 0 0 0 0 0 
0 0 1260.19 0 0 -157.094 0 0 0 0 -2433.01 0 0 0 0 0 0 0 0 0 0 -2140.34 0 1952.5 2057.18 0 0 0.02 0 0 -1120.41 0 0 1072.34 1576.05 0 0 0 0 582.827 0 0 2080.07 0 0 0 0 943.098 0 0 
0 0 1750.31 1068.68 -1565.37 2430.11 -338.832 0 0 0 0 0 0 0 0 0 2226.55 0 -723.212 0 2363.58 305.567 0 1469.85 0 0 -481.353 0 0.01 0 -1696.3 0 0 555.513 0 1851.48 0 0 2061.45 -744.423 -1025.5 0 0 0 0 0 0 0 0 0 
0 2091.2 0 814.463 -85.5281 -1205.25 0 0 1117.51 0 -14.2674 -1941.05 0 0 0 0 0 0 -1740.39 1404.54 1976.45 0 0 270.47 0 0 -2351.68 0 0 0.07 0 0 0 0 1858.5 0 -1887.95 2253.87 0 -1526.15 2451.32 0 1553.01 0 -966.75 0 1808.3 0 0 0 
0 0 0 0 0 0 -1701.33 589.694 -590.762 1934.64 0 0 0 0 0 -1051.29 0 0 0 0 0 0 0 961.715 1520.81 -1631.29 0 2111.19 900.22 0 0 0 0 -2090.75 2422.18 1765.11 0 0 0 0 -2029.86 0 -1693.24 0 0 0 0 0 0 0 
0 0 -1302.3 0 0 0 0 0 0 0 0 0 0 0 1419.19 0 1778.08 0 1817.91 0 0 -2111.8 0 0 0 0 0 0 0 0 0 0.07 -912.275 0 0 0 0 0 0 2107.68 0 0 0 0 0 487.304 0 0 0 0 
0 -1202.51 0 0 0 0 0 0 0 1942.43 0 -228.965 -1805.4 0 0 0 123.524 0 515.381 0 -347.987 0 0 716.803 0 2218.16 0 0 0 0 0 -2432.1 0.05 2196.34 2176.2 -458.007 0 0 0 0 0 0 0 0 0 0 0 0 0 0 
0 0 1656.62 0 0 -435.118 0 0 0 1842.17 1470 -538.728 0 0 0 2148.43 0 0 0 979.72 0 0 0 0 626.469 2206.41 -782.113 851.848 1810.28 0 -1530.73 0 2313.84 0.02 -1090.2 0 0 0 -404.904 951.186 0 0 0 0 0 0 0 0 0 0 
0 547.884 0 0 787.454 0 1976.15 -1040.15 0 1094.32 0 0 0 2130.73 0 0 0 0 0 0 0 0 0 0 0 0 0 834.605 0 1476.87 660.649 0 1061.2 -1971.27 0.02 0 0 0 0 0 0 0 0 0 0 0 0 0 1197.32 875.5 
-797.372 1526.31 0 0 0 0 0 0 0 0 1714.91 0 0 0 0 0 0 0 1743.6 0 0 -1654.48 0 0 0 834.3 0 0 2483.98 0 -1795.33 0 2030.32 0 0 0.07 27.543 0 0 0 0 0 0 -1333.89 0 0 0 0 0 0 
0 -960.799 0 0 604.648 0 0 0 0 -1370.66 0 1677.68 0 0 0 387.051 1743.9 0 0 0 -1095.54 0 0 0 0 -1138.57 0 0 0 1935.87 0 0 0 0 0 -1082.11 0.08 0 0 0 0 0 -48.6007 0 0 0 0 0 0 0 
0 -1125.9 0 1387.75 0 0 0 0 0 1729.56 0 -731.3 0 0 0 0 0 0 0 -577.487 0 0 0 0 318.384 -819.651 1153.37 0 0 1070.97 0 0 0 0 0 0 0 0.04 0 0 0 0 -220.878 0 0 0 0 -89.6481 1505.55 0 
0 0 2373.04 0 -1089.89 -213.401 2118.21 0 0 -1473.05 745.491 0 -1910.08 0 0 0 1500.37 -1602.91 0 1896.19 0 0 1545.69 927.229 0 0 0 0 -492.645 0 0 0 0 -1633.88 0 0 0 0 0.08 2171.32 0 0 0 0 1360.59 0 0 0 0 0 
0 2343.59 1912.98 0 0 0 0 0 0 0 -2082.66 -964.309 -747.627 0 790.201 0 -2379.76 0 0 0 0 0 1561.4 1597.11 0 0 -241.02 2219.99 -1631.29 -1056.78 0 2111.8 0 60.8081 0 0 0 0 2446.29 0.04 0 0 0 0 0 0 0 0 0 0 
1015.27 0 0 0 0 0 0 0 0 0 0 0 0 0 0 0 0 0 0 2135.3 0 0 0 0 0 0 0 0 490.509 -2156.21 -162.13 0 0 0 0 0 0 0 0 0 0.03 0 1747.11 0 1720.86 0 0 1554.54 0 0 
-1110.03 0 0 0 0 0 0 0 0 0 0 0 0 0 0 2182.76 0 -289.85 0 0 0 1855.91 0 0 0 0 0 0 0 0 0 0 0 0 0 0 0 0 0 0 0 0 1662.11 0 0 -123.066 0 0 0 -202.567 
0 1868.42 0 0 0 0 0 513.703 0 1639.84 0 0 0 0 0 0 0 0 0 0 0 0 0 0 -2383.72 0 0 856.731 0 2423.09 -755.562 0 0 0 0 0 1994.16 -975.753 0 0 985.519 556.581 0.05 0 0 1591.77 0 2451.78 0 0 
0 0 0 -1213.19 0 0 0 0 0 0 0 0 0 -1539.28 0 0 233.543 0 971.633 908.002 2032.61 0 0 0 381.558 787.454 0 0 0 0 0 0 0 0 0 -2153.16 0 0 0 0 0 0 0 0.06 0 0 0 0 0 0 
0 0 0 0 0 0 0 0 0 142.293 0 0 0 0 0 0 0 1354.03 0 2332.15 0 0 0 0 450.987 0 0 0 0 -381.1 0 0 0 0 0 0 0 0 311.06 0 -2334.44 0 0 0 0.06 0 0 0 0 0 
0 0 1259.12 0 0 159.078 183.645 0 0 0 0 -2030.17 0 -2101.12 0 -1092.18 763.192 0 0 1967.6 -1891.77 1479.92 0 0 0 0 0 0 0 0 0 2141.71 0 0 0 0 0 0 0 0 0 974.99 -63.4022 0 0 0.08 0 0 0 0 
0 -1079.82 0 0 0 0 0 -419.858 0 0 815.226 2257.84 0 0 0 0 0 0 0 1049 0 0 0 0 0 0 0 0 0 -2421.26 0 0 0 0 0 0 0 0 0 0 0 0 0 0 0 0 0.08 0 0 0 
0 0 0 0 0 0 0 0 0 0 0 0 0 0 0 1536.68 0 0 0 0 0 -121.387 0 0 0 0 0 2158.35 0 0 0 0 0 0 0 0 0 119.861 0 0 -1886.58 0 -1096.76 0 0 0 0 0.02 0 0 
0 0 0 0 0 -535.829 0 -1003.83 0 0 0 0 2279.35 0 0 0 0 0 2366.79 0 0 0 0 0 0 0 0 0 0 0 0 0 0 0 2212.82 0 0 274.285 0 0 0 0 0 0 0 0 0 0 0.09 0 
1790.6 0 0 0 0 0 0 0 0 0 0 0 0 0 0 -1580.63 0 0 0 0 1021.38 0 -872.295 0 0 0 0 0 0 0 0 0 0 0 224.845 0 0 0 0 0 0 1082.26 0 0 0 0 0 0 0 0.09 
