*Vertices 52
*Matrix 
0.09 0 0 0 0 1500.06 0 0 0 0 0 1910.08 0 -200.888 0 0 0 -606.326 0 0 0 0 0 -1448.33 415.128 0 1939.53 0 0 0 0 0 -1368.83 1665.32 0 -1798.53 0 0 0 2076.25 0 0 0 0 0 0 24.6437 0 0 1391.42 0 -1807.99 
0 0.09 1483.12 0 0 0 -1589.94 0 0 0 0 0 0 0 0 1815.93 0 0 -503.937 0 0 0 0 0 0 1648.23 0 1457.79 0 0 0 751.289 0 0 0 0 1686.99 0 0 0 0 0 688.879 0 -1540.96 1686.07 0 0 0 -1903.97 1570.71 0 
0 1615.57 0.06 0 0 -2355.95 0 0 0 0 349.666 0 0 0 -479.827 1751.08 0 -2204.58 0 0 0 0 0 0 0 -1651.59 0 0 1227.84 0 0 279.931 0 0 0 0 0 -1170.61 0 0 0 0 0 0 0 2381.28 0 0 0 0 0 0 
0 0 0 0.01 0 -854.289 1702.25 0 234.458 0 0 0 0 0 0 0 0 0 -782.266 637.761 0 0 0 0 0 0 1047.01 0 2488.1 0 0 2133.93 0 1929.46 0 0 -2214.04 -2076.86 -1613.44 0 -1415.22 0 0 0 0 1687.6 0 0 0 0 0 0 
0 0 0 0 0.08 0 0 0 0 0 0 0 0 0 0 2307.73 0 0 0 -1509.06 -78.0511 0 0 0 -947.981 0 2237.54 0 0 2419.58 0 0 0 -287.103 688.879 0 0 0 1432.31 -333.338 0 0 0 0 0 0 0 0 0 0 0 0 
76.9829 0 -2386.17 713.294 0 0.03 1895.43 2275.23 0 0 2374.42 0 0 0 0 0 0 482.421 0 0 0 0 0 -215.384 0 0 898.541 0 0 0 375.149 0 779.519 0 0 33.3415 0 -465.789 -466.399 -2159.41 0 0 400.479 0 0 0 1258.66 -519.044 0 0 513.703 0 
0 -360.652 0 368.435 0 428.251 0.04 0 0 0 0 0 0 0 0 0 -1564.3 0 0 0 0 1841.56 1377.22 0 0 0 0 689.337 0 0 450.835 0 -47.38 0 -2480.77 0 2142.78 0 2167.96 0 0 0 564.516 0 655.309 -1626.26 782.571 0 -1160.24 0 1529.82 0 
0 0 0 0 0 425.047 0 0 0 0 0 1259.88 0 0 -875.958 0 0 353.175 0 0 0 0 0 0 0 0 459.99 0 0 0 1637.7 2053.51 0 895.032 1224.63 -1469.39 0 0 1307.03 0 -29.2215 -1886.58 0 0 0 0 0 2456.97 0 0 0 0 
0 0 0 -835.215 0 0 0 0 0 -402.463 0 1632.66 -358.211 0 0 0 0 0 213.248 -1679.66 0 0 0 0 0 0 0 0 0 0 2340.54 0 0 5.87481 0 0 1914.96 568.026 2406 0 1342.74 0 1622.9 0 1681.49 0 0 0 1149.25 543.916 0 0 
0 0 0 0 0 0 0 0 1512.88 0.06 0 0 0 0 0 0 0 0 0 0 -1287.04 0 0 1952.65 0 1943.95 0 0 0 0 0 308.618 0 888.623 0 0 0 0 0 0 0 0 0 0 0 0 0 441.527 0 0 0 -147.328 
0 0 1093.25 0 0 119.861 0 0 0 0 0.08 454.344 0 0 0 0 0 0 0 0 0 0 2375.79 -218.131 0 0 0 0 0 0 0 0 -1883.98 0 -654.546 0 1727.27 -1887.95 0 0 0 0 2243.49 0 -1881.69 0 0 -1865.21 0 992.233 0 0 
1451.38 0 0 0 0 0 0 -30.4422 463.805 0 -199.362 0.03 0 1323.82 0 0 0 0 0 193.716 0 0 0 0 0 0 0 0 939.436 -1110.64 0 0 0 0 -2153.16 -784.097 1742.38 0 0 0 0 0 2129.66 0 0 0 0 0 0 0 668.889 0 
0 0 0 0 0 0 0 0 -1903.36 0 0 0 0.09 2450.71 0 0 0 964.309 0 0 0 1541.87 0 0 247.887 -2248.38 0 0 0 0 0 0 0 0 0 0 0 0 0 0 0 0 0 0 0 -1711.25 277.49 975.448 1815.47 0 0 0 
-1972.03 0 0 0 0 0 0 0 0 0 0 1266.14 -51.9578 0.04 0 -1314.05 1584.29 0 0 0 -2079.3 -1051.74 1862.62 2083.12 -1417.2 0 0 0 0 814.005 0 1481.14 -2326.04 0 1926.25 2049.85 0 0 343.867 0 0 0 0 0 0 -353.328 0 0 0 0 0 0 
0 0 -1791.67 0 0 0 0 448.851 0 0 0 0 0 0 0.08 0 0 0 1244.77 0 0 0 0 1897.87 0 0 0 0 0 1925.18 723.975 0 0 0 0 141.377 0 -896.557 1283.23 0 0 0 0 -2373.2 1527.38 0 0 0 -295.038 -1477.63 0 0 
0 -381.252 -924.329 0 555.971 0 0 0 0 0 0 0 0 -977.279 0 0.09 0 0 0 992.996 0 -1938.31 -469.756 -31.2052 1216.24 0 840.098 0 0 2096.7 0 0 1523.87 0 2407.99 0 0 1916.49 0 0 0 0 -1669.13 0 0 1225.39 0 0 0 0 0 1707.43 
0 0 0 0 0 0 1544.01 0 0 0 0 0 0 -666.143 0 0 0.06 1823.25 -501.648 0 0 2256.16 0 0 0 0 0 0 0 0 0 0 0 0 0 0 2019.18 2065.72 0 398.801 0 -2142.48 1169.7 0 0 0 0 0 0 0 -1003.98 0 
265.587 0 2106.46 0 0 1957.53 0 2152.09 0 0 0 0 -1985.46 0 0 0 447.783 0.09 0 0 -1807.23 0 1177.02 -1939.22 -682.623 1869.03 0 0 1056.78 0 0 0 1969.28 0 0 823.923 0 0 0 0 0 2026.05 -2257.68 1302.61 -589.541 0 0 -251.701 1590.09 0 0 0 
0 243.461 0 2077.93 0 0 0 0 1735.82 0 0 0 0 0 -768.075 0 -507.904 0 0.05 0 1115.68 2063.43 0 806.223 2296.14 -1292.08 1181.91 0 -1494.57 0 0 1236.38 0 0 0 0 0 0 0 -1575.29 -393.765 -1598.64 2435.61 0 0 0 738.472 0 -1994.31 0 1183.28 0 
0 0 0 -497.528 -2344.66 0 0 0 2341.15 0 0 887.86 0 0 0 459.532 0 0 0 0.07 0 0 2004.07 2252.34 0 458.312 0 -239.494 0 0 -18.9978 0 0 0 0 0 735.115 0 0 0 947.829 -351.802 0 2033.98 1687.14 0 0 0 1471.07 0 -348.75 0 
0 0 0 0 1803.57 0 0 0 0 935.469 0 0 0 2366.18 0 0 0 -260.857 -1220.97 0 0.06 -479.369 0 0 0 1123.62 0 0 0 -667.364 -824.076 0 0 877.331 0 0 0 0 0 0 0 0 0 0 0 0 0 -759.682 1977.07 -1583.38 -1821.12 0 
0 0 0 0 0 0 559.786 0 0 0 0 0 -10.9104 1596.35 0 948.286 1374.94 0 1555.6 0 2090.75 0 0 0 0 0 0 0 0 0 -701.697 0 0 0 0 0 0 1896.34 -1230.12 0 1228.29 -1409.42 0 1845.68 -1103.47 0 0 0 417.875 0 0 0 
0 0 0 0 0 0 1670.35 0 0 0 2417.6 0 0 -500.275 0 824.076 0 1774.58 0 -1687.9 0 0 0 0 0 421.232 0 2171.77 0 0 0 -1284.6 0 303.43 0 0 0 0 0 0 0 0 0 -2110.89 0 0 0 0 -766.854 0 0 0 
156.484 0 0 0 0 -1939.53 0 0 0 249.413 -754.646 0 0 242.546 1187.25 2071.98 0 -1737.95 934.858 -413.449 0 0 0 0.07 0 0 0 324.793 0 0 0 0 0 0 0 0 0 -270.775 -222.098 1671.12 0 -143.361 -1900.62 0 0 0 1407.13 0 0 458.922 0 0 
-2075.18 0 0 0 2360.68 0 0 0 0 0 0 0 -1776.25 -1480.22 0 1298.79 0 2362.06 1099.66 0 0 0 0 0 0.09 0 2010.48 2194.05 0 -496.765 0 0 0 0 0 0 -1186.33 0 1406.83 0 0 0 0 0 -2497.1 0 0 0 0 -1408.66 0 0 
0 1094.78 -163.045 0 0 0 0 0 0 547.731 0 0 -613.041 0 0 0 0 -2148.27 -2173.6 1940.9 -443.358 0 380.49 0 0 0.06 0 -163.808 0 0 0 0 0 0 0 527.589 2143.54 0 0 0 0 561.464 641.575 0 0 0 2357.33 0 0 0 0 0 
-1312.52 0 0 1335.57 1574.22 449.461 0 -2188.41 0 0 0 0 0 0 0 -267.266 0 0 2450.56 0 0 0 0 0 1765.27 0 0.03 0 1510.13 0 1292.08 0 -1247.83 -870.617 0 0 0 120.167 0 0 0 0 0 1238.98 0 2219.53 -118.641 0 0 0 0 0 
0 424.131 0 0 0 0 -1703.62 0 0 0 0 0 0 0 0 0 0 0 0 -976.821 0 0 2325.13 1109.58 863.75 1621.83 0 0.03 0 0 0 0 1067.16 0 0 0 0 0 0 -467.62 891.827 2420.19 0 0 0 0 0 0 1458.86 167.013 0 0 
0 0 -1123 1100.42 0 0 0 0 0 0 0 1050.07 0 0 0 0 0 -1869.95 1110.34 0 0 0 0 0 0 0 -1414.15 0 0.08 0 0 0 0 699.713 0 0 0 0 0 354.854 221.793 0 2009.41 0 0 -411.313 0 0 0 0 0 0 
0 0 0 0 1464.05 0 0 0 0 0 0 2012.92 0 1116.75 2295.07 1599.86 0 0 0 0 1551.48 0 0 0 -1915.57 0 0 0 0 0.03 0 0 -1188.01 -755.715 0 0 0 1728.8 -2279.81 639.592 -2220.45 0 0 0 0 0 0 0 0 112.842 0 0 
0 0 0 0 0 -2010.64 2497.56 689.489 466.094 0 0 0 0 0 -2149.49 0 0 0 0 352.565 2375.18 -2028.34 0 0 0 0 469.298 0 0 0 0.05 2249.29 -1334.5 -1590.55 0 1157.34 623.417 0 0 341.273 0 830.485 2034.75 0 -1195.64 0 0 -1311.3 -807.443 0 0 0 
0 -1982.1 -339.595 -1596.19 0 0 0 -445.952 0 527.436 0 0 0 -530.946 0 0 0 0 2353.36 0 0 0 -1656.16 0 0 0 0 0 0 0 -588.778 0.08 0 0 259.789 0 0 0 0 0 0 0 2274.01 1447.72 0 0 1552.4 1568.27 -1195.03 -1742.07 1151.69 0 
2345.73 0 0 0 0 -447.325 -2290.95 0 0 0 -429.777 0 0 2360.68 0 1543.24 0 -2135.76 0 0 0 0 0 0 0 0 -36.5459 2377.77 0 -1663.34 1556.06 0 0.02 -2430.88 0 0 0 0 464.263 0 717.109 0 0 1672.8 0 493.408 0 0 0 2215.72 1523.56 0 
1070.06 0 0 578.249 908.307 0 0 -711.005 2438.51 194.784 0 0 0 0 0 0 0 0 0 0 -2272.18 0 2336.57 0 0 0 -2040.09 0 1407.9 -305.719 550.478 0 -937.605 0.09 0 0 2003.01 2323.6 0 0 0 0 0 0 0 0 0 0 847.118 0 0 0 
0 0 0 0 2232.96 0 -1884.44 965.072 0 0 2373.65 1443.75 0 -638.066 0 -2361.9 0 0 0 0 0 0 0 0 0 0 0 0 0 0 0 1181.6 0 0 0.04 0 0 0 2434.39 0 0 0 0 0 0 0 0 -353.481 0 -242.546 0 -1170.61 
2435.45 0 0 0 0 -1818.83 0 2499.08 0 0 0 -688.726 0 1549.65 655.919 0 0 1966.84 0 0 0 0 0 0 0 1944.56 0 0 0 0 1516.54 0 0 0 0 0.08 0 0 0 0 0 0 833.689 0 0 0 0 0 354.244 0 169.607 0 
0 441.221 0 2210.68 0 0 -2420.5 0 1325.95 0 -74.2363 2118.06 0 0 0 0 -1028.09 0 0 1569.64 0 0 0 0 2491.91 2076.86 0 0 0 0 993.606 0 0 -1996.6 0 0 0.04 0 0 1544.16 0 -336.695 0 0 0 -1563.08 19.6081 0 0 0 0 0 
0 0 -2006.21 1430.48 0 -1395.84 0 0 898.236 0 2420.04 0 0 0 -1632.97 275.048 55.4674 0 0 0 0 1743.14 0 1249.35 0 0 -91.7844 0 0 1970.81 0 0 0 -617.618 0 0 0 0.06 0 0 1396.6 0 0 -2.67037 -2050.46 0 0 1120.26 0 0 0 0 
0 0 0 211.57 -838.572 2436.37 315.943 2005.29 2349.24 0 0 0 0 1884.9 1812.57 0 0 0 0 0 0 -1795.02 0 -1180.53 559.023 0 0 0 0 527.741 0 0 1405 0 1275.9 0 0 0 0 0 0 -355.007 0 0 0 0 -1232.87 0 0 0 383.236 0 
-978.195 0 0 0 2186.42 1988.81 0 0 0 0 0 0 0 0 0 0 1828.9 0 1001.08 0 0 0 0 1461.76 0 0 0 -1963.94 1376.16 2299.65 -2067.25 0 0 0 0 0 152.974 0 0 0.05 0 0 -2296.29 -1183.58 0 0 839.488 0 0 2305.75 0 0 
0 0 0 -2251.43 0 0 0 1801.89 1914.81 0 0 0 0 0 0 0 0 0 1509.06 1830.73 0 199.667 0 0 0 0 0 2089.68 2399.9 785.928 0 0 1063.49 0 0 0 0 1562.93 0 0 0.05 844.981 -1074.02 -1135.52 0 51.1948 649.815 0 1518.07 0 1841.72 0 
0 0 0 0 0 0 0 -231.101 0 0 0 0 0 0 0 0 2372.43 414.67 -434.507 -399.564 0 -1366.7 0 1945.78 0 -2313.53 0 1903.36 0 0 645.848 0 0 0 0 0 -1793.04 0 -2265.16 0 -919.446 0.08 2445.98 0 0 0 0 0 2385.71 1960.89 0 428.251 
0 2427.67 0 0 0 -521.18 -1623.05 0 2297.05 0 2.36518 -2001.02 0 0 0 875.195 -1189.69 1929.46 709.174 0 0 0 0 1753.67 0 565.737 0 0 841.166 0 -1254.23 1346.1 0 0 0 1794.11 0 0 0 258.721 1101.79 -2425.84 0.02 0 -1527.07 0 0 0 0 -440.611 0 0 
0 0 0 0 0 0 0 0 0 0 0 0 0 0 318.079 0 0 -988.113 0 200.278 0 1977.37 1153.07 0 0 0 759.987 0 0 0 0 2496.03 2100.67 0 0 0 0 -1847.67 0 1907.94 -1182.67 0 0 0.02 0 0 47.9904 -1869.95 0 750.526 0 0 
0 -1019.85 0 0 0 0 72.2526 0 2074.42 0 46.9222 0 0 0 -500.275 0 0 2444.76 0 674.078 0 1893.29 0 0 804.086 0 0 0 0 0 2313.23 0 0 0 0 0 0 525.605 0 0 0 0 -1887.8 0 0.04 0 0 -1970.81 0 0 -2231.74 0 
0 -122.303 -778.603 -1114.15 0 0 528.657 0 0 0 0 0 -2096.55 2484.13 0 1747.87 0 0 0 0 0 0 0 0 0 0 1670.96 0 -624.485 0 0 0 -1095.08 0 0 0 62.7918 0 0 0 1971.88 0 0 0 0 0.08 1728.49 0 0 0 1474.58 0 
-718.024 0 0 0 0 2435.15 -2300.56 0 0 0 0 0 842.692 0 0 0 0 0 1868.11 0 0 0 0 201.041 0 1284.6 2163.69 0 0 0 0 -1963.48 0 0 0 0 -665.532 0 -103.229 1312.07 2244.56 0 0 2158.96 0 453.734 0.03 0 0 0 0 0 
0 0 0 0 0 1118.43 0 -2460.63 0 -592.746 266.655 0 2064.65 0 0 0 0 -1919.08 0 0 1069.6 0 0 0 0 0 0 0 0 0 1107.29 -28.9163 0 0 2142.02 0 0 -1457.95 0 0 0 0 0 -1010.39 2301.48 0 0 0 0 0 -1519.9 0 
0 0 0 0 0 0 -267.724 0 -117.115 0 0 0 748.085 0 -1068.53 0 0 2316.58 1217.76 1856.82 503.632 1898.02 -2413.48 0 0 0 0 -1187.25 0 0 1632.05 1690.19 0 -1159.78 0 1457.34 0 0 0 0 899.609 308.313 0 0 0 0 0 0 0.03 -1546.14 0 -601.901 
1464.35 -210.959 0 0 0 0 0 0 1199.3 0 787.454 0 0 0 2223.65 0 0 0 0 0 513.398 0 0 -2103.26 -399.411 0 0 1933.88 0 -175.405 0 1255.46 2210.53 0 -916.242 0 0 0 0 2039.32 0 360.652 891.522 228.355 0 0 0 0 2217.25 0.09 0 0 
0 22.8126 0 0 0 708.716 1833.78 0 0 0 0 -1721.63 0 0 0 0 1002.15 0 -1810.13 518.738 -2468.11 0 0 0 0 0 0 0 0 0 0 2053.97 -378.048 0 0 -320.978 0 0 -2276.3 0 -9.23185 0 0 0 95.5992 1885.66 0 2452.24 0 0 0.04 0 
747.627 0 0 0 0 0 0 0 0 -278.405 0 0 0 0 0 382.473 0 0 0 0 0 0 0 0 0 0 0 0 0 0 0 0 0 0 134.968 0 0 0 0 0 0 -1333.28 0 0 0 0 0 0 469.909 0 0 0.06 
