*Vertices 61
*Matrix 
0.07 0 0 0 0 -1485.87 0 0 0 0 0 0 0 0 0 0 0 0 0 0 0 1203.73 0 0 0 0 0 0 0 0 0 0 0 -2425.99 2234.34 0 0 0 67.5222 0 0 0 910.291 0 0 428.709 0 0 0 0 0 0 0 0 0 0 0 0 0 0 0 
0 0.04 0 0 0 0 0 -1341.06 0 0 0 0 0 0 0 0 0 0 0 0 0 0 0 0 0 0 0 0 1497.62 2335.96 0 0 0 0 0 1076.46 -351.039 0 0 0 0 0 0 0 0 0 0 0 0 0 0 0 0 0 1851.48 0 0 0 0 0 0 
0 0 0 0 0 0 0 0 2143.39 0 0 0 0 0 0 0 0 0 0 1218.53 505.158 0 0 0 0 0 -1216.09 -265.587 0 0 0 101.703 0 781.503 0 0 433.134 0 -1338.62 0 1446.65 0 0 0 0 0 0 0 0 0 0 0 0 0 0 -516.297 -1594.36 0 0 0 0 
0 0 0 0.07 0 0 -288.018 0 0 0 0 0 0 0 0 0 0 0 0 0 0 0 0 0 0 0 0 0 0 0 0 0 0 0 0 0 0 0 0 0 0 0 0 0 2288.35 0 0 0 0 0 0 0 0 0 0 0 0 0 963.546 2197.26 0 
0 0 0 0 0.01 0 0 0 0 0 0 499.817 0 0 0 0 0 0 0 0 -281.152 0 1310.24 0 0 0 0 0 0 0 0 1928.69 0 0 0 0 0 1049.76 0 2168.42 0 0 0 0 0 0 0 0 0 -1287.5 354.701 0 0 0 0 0 0 0 0 0 0 
2244.56 0 0 0 0 0.01 0 0 1483.28 0 0 0 0 0 0 0 0 0 0 0 0 1356.47 0 0 503.784 0 0 0 0 0 0 0 -466.247 0 0 0 0 0 0 0 0 0 0 0 0 0 0 0 0 0 0 0 0 0 0 0 0 898.389 0 0 0 
0 0 0 2270.04 0 0 0.07 0 0 0 0 0 -553.224 0 0 0 0 0 0 0 0 0 0 0 0 0 0 0 0 -566.5 0 0 0 0 0 0 0 0 0 0 0 0 0 0 0 0 0 0 0 0 0 0 0 0 0 154.195 0 0 0 0 0 
0 -2313.99 0 0 0 0 0 0.06 0 0 0 0 0 0 0 0 0 0 94.8363 0 -1657.69 0 0 0 -1574.37 0 0 0 0 0 0 0 0 0 2264.24 0 0 1377.99 0 -887.707 0 0 0 0 1613.59 0 0 0 0 0 0 0 0 0 33.6467 0 2397 0 0 0 0 
0 0 2151.63 0 0 -2234.64 0 0 0.01 0 0 1360.59 444.273 0 0 0 0 0 0 160.146 0 0 0 0 0 0 0 0 0 0 0 0 0 0 0 0 0 0 1638.16 0 0 0 0 0 0 0 0 0 0 0 0 0 0 0 0 826.518 2439.12 0 -92.2422 0 0 
0 0 0 0 0 0 0 0 0 0.03 0 1757.33 0 0 0 0 0 -2444.76 0 0 0 0 0 0 0 0 0 0 1059.53 0 0 0 0 0 0 0 0 0 0 0 0 0 0 0 0 0 0 0 0 0 0 0 1053.58 0 1181.75 0 0 0 0 0 0 
0 0 0 0 0 0 0 0 0 0 0.03 0 0 0 0 0 0 0 0 0 0 0 0 2033.37 0 -1327.48 0 99.7192 39.903 0 0 0 0 0 0 0 0 0 0 0 0 0 0 1349.3 0 0 0 0 0 0 0 0 0 0 -997.726 0 0 0 0 0 742.897 
0 0 0 0 1550.87 0 0 0 420.621 2196.95 0 0.06 0 0 0 -939.283 0 0 0 0 93.9207 -2343.29 210.654 0 0 -1278.95 0 0 0 0 0 780.892 0 0 0 0 0 336.543 0 0 2416.38 0 0 0 0 2041.46 0 1837.9 0 0 0 0 0 0 0 0 0 0 0 538.575 0 
0 0 0 0 0 0 1633.58 0 717.566 0 0 0 0.07 0 0 0 0 0 0 0 1693.24 727.027 0 0 1407.59 0 0 0 0 0 0 -667.821 0 0 0 0 0 0 0 0 0 0 0 0 0 0 0 0 -681.707 761.513 859.325 0 0 0 0 0 0 0 0 0 0 
0 0 0 0 0 0 0 0 0 0 0 0 0 0.05 0 0 0 0 0 2416.99 0 -2082.2 0 0 0 0 0 0 1282.16 0 0 0 0 -982.315 0 0 0 0 0 0 0 0 0 0 0 0 0 0 0 1975.08 0 0 0 0 0 539.186 0 -624.79 0 0 0 
0 0 0 0 0 0 0 0 0 0 0 0 0 0 0.02 0 0 0 0 0 0 0 0 0 0 0 0 0 0 0 0 0 0 2190.85 0 -1324.88 0 0 0 0 0 0 0 0 0 0 0 0 0 0 0 0 0 0 0 0 0 0 0 0 0 
0 0 0 0 0 0 0 0 0 0 0 -2450.41 0 0 0 0 0 0 0 0 -545.747 0 0 0 0 0 -2091.51 0 0 0 0 0 0 868.023 0 0 0 0 0 0 0 0 1270.26 0 1344.87 0 0 0 1224.33 0 0 0 0 0 0 0 0 0 0 0 0 
0 0 0 0 0 0 0 0 0 0 0 0 0 0 0 0 0.04 0 0 1148.64 0 0 0 0 0 0 0 0 0 0 0 0 0 0 0 0 0 -767.769 0 0 0 0 1544.31 0 0 0 0 0 464.415 0 0 0 0 2356.87 0 0 0 0 2051.07 0 0 
0 0 0 0 0 0 0 0 0 1570.56 0 0 0 0 0 0 0 0.02 -503.632 0 0 0 0 0 0 0 0 0 1466.19 1934.34 0 0 -2471.01 0 0 0 0 0 0 0 0 0 0 0 360.195 0 0 0 0 0 0 0 0 0 0 0 0 0 0 0 0 
0 0 0 0 0 0 0 1843.24 0 0 0 0 0 0 0 0 0 -1420.87 0.09 -1080.28 0 0 0 0 1216.39 929.67 0 0 -1470.15 0 -301.141 0 0 0 0 0 0 0 0 1790.29 0 -1016.34 0 0 0 0 0 0 0 0 0 0 0 0 0 0 1105.46 0 0 0 0 
0 0 1515.17 0 0 0 0 0 -914.869 0 0 0 0 -63.097 0 0 -105.823 0 -586.489 0.05 0 0 0 0 0 1556.37 0 2292.32 0 0 555.513 0 0 0 0 0 0 0 0 0 0 0 0 0 0 0 0 126.576 -1581.85 0 0 0 0 0 0 0 0 0 0 0 0 
0 0 2304.83 0 2150.87 0 0 2225.64 0 0 0 -2472.08 89.0378 0 0 1879.41 0 0 0 0 0.01 1598.79 0 0 0 0 1721.78 0 0 0 0 0 2318.57 0 0 0 0 0 1938.76 0 0 449.156 0 0 0 0 0 0 0 0 0 0 0 1494.72 0 0 0 0 0 0 0 
877.941 0 0 0 0 2403.26 0 0 0 0 0 748.848 2377.93 414.823 0 0 0 0 0 0 -689.337 0.07 0 0 0 0 0 -335.627 0 0 0 0 0 0 0 913.19 1067.31 0 0 0 0 0 0 0 0 0 0 0 0 0 0 0 0 0 0 0 0 0 0 0 0 
0 0 0 0 148.854 0 0 0 0 0 0 614.109 0 0 0 0 0 0 0 0 0 0 0.09 0 0 0 0 0 0 357.295 0 0 0 -87.6644 0 0 0 0 0 0 1541.72 0 0 1753.21 0 0 0 0 -1507.08 0 0 0 0 0 0 2137.75 0 0 0 0 0 
0 0 0 0 0 0 0 0 0 0 -1120.72 0 0 0 0 0 0 0 0 0 0 0 0 0 0 0 0 0 -1509.67 0 0 1174.28 0 0 0 0 0 0 0 0 0 0 0 0 1475.65 0 0 0 0 1792.58 0 0 0 -1930.37 0 683.844 0 0 0 0 0 
0 0 0 0 0 -1780.07 0 394.681 0 0 0 0 -1573.76 0 0 0 0 0 -842.387 0 0 0 0 0 0.09 0 0 561.464 0 0 0 0 0 1306.42 0 -258.415 0 0 0 0 1485.11 0 0 1862.77 0 0 0 0 0 0 0 0 0 0 0 -737.098 1162.07 0 0 -300.989 0 
0 0 0 0 0 0 0 0 0 0 -173.574 -726.264 0 0 0 0 0 0 472.503 -1514.1 0 0 0 0 0 0.05 -2017.96 37.7667 0 0 0 0 0 0 0 2054.73 0 0 0 0 0 0 0 0 1723.61 0 0 0 1995.38 0 0 0 0 0 0 0 0 0 0 0 0 
0 0 1808.91 0 0 0 0 0 0 0 0 0 0 0 0 1161 0 0 0 0 1995.22 0 0 0 0 -263.146 0.01 0 0 0 0 788.064 0 551.851 0 0 0 0 0 -2190.24 0 0 246.666 0 2461.09 -1026.26 89.9533 0 0 0 0 0 0 0 0 1118.43 0 0 0 -1444.52 0 
0 0 -1383.94 0 0 0 0 0 0 0 622.654 0 0 0 0 0 0 0 0 2380.83 0 -522.095 0 0 -255.821 338.984 0 0.02 0 41.2763 0 0 0 0 0 0 0 0 0 0 0 0 0 0 0 0 0 0 0 0 0 0 212.027 0 0 0 0 0 0 0 0 
0 1370.82 0 0 0 0 0 0 0 -1048.23 -783.334 0 0 -2388.91 0 0 0 2488.1 1931.44 0 0 0 0 -548.646 0 0 0 0 0.07 0 0 0 0 0 0 0 0 0 0 0 0 0 0 0 2357.94 0 -1558.35 0 0 0 -64.9281 198.752 -157.399 0 0 1658.6 0 -1490.91 0 0 465.636 
0 -854.442 0 0 0 0 1285.82 0 0 0 0 0 0 0 0 0 0 615.329 0 0 0 0 1124.23 0 0 0 0 -1876.2 0 0.05 0 47.6852 2385.4 0 0 0 0 0 810.038 0 0 0 0 0 0 0 0 0 0 0 0 0 0 1369.44 0 0 0 0 0 0 0 
0 0 0 0 0 0 0 0 0 0 0 0 0 0 0 0 0 0 2175.13 1368.22 0 0 0 0 0 0 0 0 0 0 0.03 0 0 0 0 0 0 0 -1591.46 0 -902.814 0 0 0 0 0 0 976.974 0 0 -1367.46 0 0 0 0 0 0 0 0 0 0 
0 0 428.709 0 121.845 0 0 0 0 0 0 1691.26 175.558 0 0 0 0 0 0 0 0 0 0 593.509 0 0 1751.84 0 0 1133.53 0 0.09 0 0 0 0 0 454.192 0 0 0 2035.2 0 0 0 0 0 0 0 -318.384 0 954.39 0 0 0 0 0 0 -2188.25 1179.62 0 
0 0 0 0 0 -1130.94 0 0 0 0 0 0 0 0 0 0 0 2426.76 0 0 1576.66 0 0 0 0 0 0 0 0 1771.37 0 0 0.03 0 0 0 0 0 0 0 0 -2004.84 0 0 0 664.769 0 0 0 0 0 0 0 0 0 0 1419.8 0 0 0 0 
598.392 0 520.112 0 0 0 0 0 0 0 0 0 0 -697.882 848.338 -1173.06 0 0 0 0 0 0 -1289.79 0 2274.77 0 2045.27 0 0 0 0 0 0 0.04 0 0 0 0 0 0 0 0 0 0 0 0 0 0 0 0 0 0 0 0 0 0 0 0 0 -283.288 0 
311.212 0 0 0 0 0 0 1065.94 0 0 0 0 0 0 0 0 0 0 0 0 0 0 0 0 0 0 0 0 0 0 0 0 0 0 0.05 -1822.34 0 396.054 -449.461 -1041.22 0 0 0 0 0 2198.93 0 0 0 0 0 0 0 0 0 0 0 0 0 0 0 
0 2382.2 0 0 0 0 0 0 0 0 0 0 0 0 -2176.35 0 0 0 0 0 0 1925.95 0 0 -853.679 -58.8244 0 0 0 0 0 0 0 0 218.589 0.01 0 0 0 0 0 0 0 0 0 0 0 0 0 0 0 2114.4 0 0 0 0 0 0 0 0 0 
0 884.655 270.623 0 0 0 0 0 0 0 0 0 0 0 0 0 0 0 0 0 0 -210.807 0 0 0 0 0 0 0 0 0 0 0 0 0 0 0.03 0 0 0 0 0 0 0 0 0 0 0 0 0 1648.69 0 0 0 0 0 0 0 0 0 0 
0 0 0 0 -386.746 0 0 1456.88 0 0 0 -1892.07 0 0 0 0 1728.95 0 0 0 0 0 0 0 0 0 0 0 0 0 0 933.027 0 0 -188.833 0 0 0.01 0 0 0 0 0 0 0 1450.77 0 0 0 1043.96 0 0 0 0 0 0 0 0 2090.59 0 0 
1618.32 0 1854.23 0 0 0 0 0 -1273.31 0 0 0 0 0 0 0 0 0 0 0 -792.337 0 0 0 0 0 0 0 0 1064.26 579.775 0 0 0 -1012.53 0 0 0 0.05 0 0 0 0 0 0 0 0 0 0 0 0 2000.87 91.0215 0 0 0 0 0 0 0 0 
0 0 0 0 1248.59 0 0 -933.943 0 0 0 0 0 0 0 0 0 0 2111.65 0 0 0 0 0 0 0 173.727 0 0 0 0 0 0 0 -1343.5 0 0 0 0 0.02 -815.836 0 0 1622.75 0 126.576 0 0 0 -446.409 0 0 0 0 0 0 0 1981.03 0 0 0 
0 0 2254.48 0 0 0 0 0 0 0 0 2422.48 0 0 0 0 0 0 0 0 0 0 1099.51 0 1244.93 0 0 0 0 0 -2042.68 0 0 0 0 0 0 0 0 -1528.14 0 0 0 0 0 0 0 0 0 2462.16 0 -819.651 -1087.45 0 0 0 0 0 0 0 0 
0 0 0 0 0 0 0 0 0 0 0 0 0 0 0 0 0 0 1361.96 0 1045.18 0 0 0 0 0 0 0 0 0 0 2385.56 300.989 0 0 0 0 0 0 0 0 0.04 -1774.27 0 0 0 0 0 0 0 0 1804.94 0 2346.34 0 0 0 0 0 0 0 
2188.71 0 0 0 0 0 0 0 0 0 0 0 0 0 0 -2477.57 -1147.11 0 0 0 0 0 0 0 0 0 -73.9311 0 0 0 0 0 0 0 0 0 0 0 0 0 0 254.295 0.03 0 152.058 0 0 0 0 0 0 0 0 0 0 2158.19 0 2302.39 0 0 0 
0 0 0 0 0 0 0 0 0 0 373.775 0 0 0 0 0 0 0 0 0 0 0 1873.15 0 1836.99 0 0 0 0 0 0 0 0 0 0 0 0 0 0 1984.24 0 0 0 0.04 0 0 0 0 0 0 0 1559.72 0 0 0 0 -187.155 0 0 0 0 
0 0 0 -2438.35 0 0 0 2356.11 0 0 0 0 0 0 0 1298.03 0 1249.96 0 0 0 0 0 1077.53 0 164.418 -1929.15 0 786.691 0 0 0 0 0 0 0 0 0 0 0 0 0 261.773 0 0.08 0 0 0 0 0 0 0 0 252.159 889.996 0 0 0 0 0 0 
-439.085 0 0 0 0 0 0 0 0 0 0 1203.27 0 0 0 0 0 0 0 0 0 0 0 0 0 0 1502.04 0 0 0 0 0 2143.24 0 -1885.05 0 0 895.795 0 1450.77 0 0 0 0 0 0.06 0 -1592.53 0 1020.77 0 0 0 0 -796.609 0 0 0 0 294.58 0 
0 0 0 0 0 0 0 0 0 0 0 0 0 0 0 0 0 0 0 0 0 0 0 0 0 0 516.602 0 1033.59 0 0 0 0 0 0 0 0 0 0 0 0 0 0 0 0 0 0.06 0 0 1838.36 463.042 0 0 -383.694 0 0 0 0 1016.95 0 0 
0 0 0 0 0 0 0 0 0 0 0 904.035 0 0 0 0 0 0 0 -1376.77 0 0 0 0 0 0 0 0 0 0 942.488 0 0 0 0 0 0 0 0 0 0 0 0 0 0 2260.89 0 0.02 0 0 0 0 0 0 0 0 0 599.155 0 -309.534 0 
0 0 0 0 0 0 0 0 0 0 0 0 1459.01 0 0 462.127 2349.85 0 0 1597.57 0 0 2222.43 0 0 -900.983 0 0 0 0 0 0 0 0 0 0 0 0 0 0 0 0 0 0 0 0 0 0 0.04 0 0 0 0 924.94 0 0 0 0 0 -2017.96 0 
0 0 0 0 -1931.75 0 0 0 0 0 0 0 312.891 1966.23 0 0 0 0 0 0 0 0 0 2012.62 0 0 0 0 0 0 0 1499.6 0 0 0 0 0 -2328.94 0 1571.63 521.638 0 0 0 0 1333.58 -814.158 0 0 0.03 0 0 0 0 0 0 0 0 0 0 0 
0 0 0 0 1107.44 0 0 0 0 0 0 0 2423.4 0 0 0 0 0 0 0 0 0 0 0 0 0 0 0 215.842 0 995.132 0 0 0 0 0 -580.233 0 0 0 0 0 0 0 0 0 -1580.78 0 0 0 0.03 0 0 0 0 0 0 1480.99 0 0 0 
0 0 0 0 0 0 0 0 0 0 0 0 0 0 0 0 0 0 0 0 0 0 0 0 0 0 0 0 -1442.69 0 0 790.201 0 0 0 880.84 0 0 1217.15 0 1460.08 2197.71 0 1451.54 0 0 0 0 0 0 0 0.07 0 0 0 0 0 0 0 0 0 
0 0 0 0 0 0 0 0 0 1640.6 0 0 0 0 0 0 0 0 0 0 0 0 0 0 0 0 0 52.8733 -1089.43 0 0 0 0 0 0 0 0 0 -1272.39 0 2153.61 0 0 0 0 0 0 0 0 0 0 0 0.02 0 0 0 0 0 0 0 0 
0 0 0 0 0 0 0 0 0 0 0 0 0 0 0 0 1677.07 0 0 0 -211.722 0 0 33.0363 0 0 0 0 0 1632.36 0 0 0 0 0 0 0 0 0 0 0 397.427 0 0 -2233.73 0 214.164 0 1695.07 0 0 0 0 0.07 449.461 0 -1488.01 994.827 0 0 0 
0 741.523 0 0 0 0 0 -262.383 0 -1897.72 -1529.66 0 0 0 0 0 0 0 0 0 0 0 0 0 0 0 0 0 0 0 0 0 0 0 0 0 0 0 0 0 0 0 0 0 -517.365 1867.2 0 0 0 0 0 0 0 -1574.07 0.03 0 1877.57 0 0 1299.1 0 
0 0 2392.57 0 0 0 1769.84 0 965.224 0 0 0 0 544.526 0 0 0 0 0 0 0 0 -372.555 2321.62 1493.5 0 -2495.12 0 757.088 0 0 0 0 0 0 0 0 0 0 0 0 0 -1022.45 0 0 0 0 0 0 0 0 0 0 0 0 0.03 0 0 0 0 0 
0 0 1401.64 0 0 0 0 1722.08 719.55 0 0 0 0 0 0 0 0 0 -879.009 0 0 0 0 0 1172.9 0 0 0 0 0 0 0 928.449 0 0 0 0 0 0 0 0 0 0 -2102.5 0 0 0 0 0 0 0 0 0 950.728 -1726.81 0 0.06 1055.86 0 1575.59 0 
0 0 0 0 0 1109.27 0 0 0 0 0 0 0 2357.94 0 0 0 0 0 0 0 0 0 0 0 0 0 0 2151.78 0 0 0 0 0 0 0 0 0 0 1556.67 0 0 -1598.33 0 0 0 0 -477.844 0 0 2145.99 0 0 2423.09 0 0 301.141 0.03 990.707 0 0 
0 0 0 186.087 0 0 0 0 2446.13 0 0 0 0 0 0 0 227.287 0 0 0 0 0 0 0 0 0 0 0 0 0 0 806.223 0 0 0 0 0 -643.712 0 0 0 0 0 0 0 0 543.764 0 0 0 0 0 0 0 0 0 0 -725.196 0 0 0 
0 0 0 -14.2674 0 0 0 0 0 0 0 1088.21 0 0 0 0 0 0 0 0 0 0 0 0 -1242.79 0 1150.32 0 0 0 0 1845.38 0 -1530.73 0 0 0 0 0 0 0 0 0 0 0 -1127.74 0 453.734 -479.064 0 0 0 0 0 954.237 0 624.18 0 0 0.08 0 
0 0 0 0 0 0 0 0 0 0 1284.3 0 0 0 0 0 0 0 0 0 0 0 0 0 0 0 0 0 1281.7 0 0 0 0 0 0 0 0 0 0 0 0 0 0 0 0 0 0 0 0 0 0 0 0 0 0 0 0 0 0 0 0.07 
