*Vertices 48
*Matrix 
0.05 0 0 0 0 0 0 0 0 0 0 0 0 0 791.726 0 0 0 0 0 2191.76 0 0 0 0 0 0 0 0 0 0 0 0 0 0 0 0 0 0 0 0 0 0 0 0 1533.63 -237.053 -377.438 
0 0.07 -189.444 2192.37 0 0 0 0 0 0 0 0 0 0 0 0 0 0 0 0 0 0 0 0 0 0 0 0 0 0 0 0 0 0 2340.08 0 0 0 0 0 1281.55 0 0 0 0 -2151.94 0 0 
0 -2266.84 0.04 1201.59 0 0 0 0 0 0 0 0 0 0 0 0 0 0 0 0 0 0 0 0 1438.87 0 1748.18 0 0 0 0 0 -1147.11 0 0 0 0 0 0 0 0 1511.66 0 -585.116 0 0 0 0 
0 1866.74 2142.17 0.01 0 0 0 0 0 0 0 0 0 2096.7 0 -1482.36 0 0 0 0 0 30.2896 0 0 0 0 1587.34 0 0 0 0 0 0 0 0 0 2396.08 -76.9829 0 0 0 0 0 2140.49 0 0 0 0 
0 0 0 0 0.04 0 0 0 0 0 2028.95 0 -2426.15 -49.0585 0 0 0 0 0 0 0 0 0 0 0 0 0 0 -114.978 -278.1 0 0 0 0 934.248 0 0 0 0 0 0 1863.08 0 0 0 0 0 0 
0 0 0 0 0 0.08 0 0 0 0 0 0 0 0 2480.62 -26.017 0 0 0 0 -15.7933 0 0 0 0 0 0 0 0 0 0 0 0 0 0 0 0 0 2316.43 0 0 0 0 444.884 0 0 0 0 
0 0 0 0 0 0 0.05 0 0 692.694 0 0 0 0 0 0 0 0 0 0 0 0 2418.21 0 605.411 0 0 1586.73 0 0 0 0 0 0 0 0 0 0 0 0 0 0 0 0 0 0 0 0 
0 0 0 0 0 0 0 0.04 0 0 0 0 0 0 0 1653.42 0 -1668.83 797.22 -304.804 0 0 0 0 0 0 0 0 2178.64 0 0 0 0 0 0 0 0 0 0 0 0 0 -1603.37 0 0 0 0 0 
0 0 0 0 0 0 0 0 0.08 1421.78 1338.47 0 0 0 0 0 0 0 0 0 0 0 0 0 0 0 0 1023.97 0 0 0 0 0 0 0 0 0 0 0 0 0 0 0 0 0 0 0 0 
0 0 0 0 0 0 -425.199 0 1938.15 0.01 0 0 0 0 0 0 0 2482.6 0 0 0 0 0 0 0 0 0 0 0 0 0 0 0 0 0 0 964.156 0 0 0 0 0 0 0 -1389.89 0 0 0 
0 0 0 0 1538.36 0 0 0 2052.29 0 0.04 0 0 0 0 319.605 0 0 0 0 0 0 -1989.12 188.223 0 0 0 425.81 0 0 -1990.8 0 0 0 0 1027.79 0 0 0 0 0 -2267.75 0 0 0 0 1297.88 0 
0 0 0 0 0 0 0 0 0 0 0 0.04 0 0 0 0 1427.73 0 0 0 -1589.48 0 0 0 0 0 1885.97 0 755.104 2319.64 -635.472 0 0 0 982.162 1532.26 0 0 250.633 0 0 0 0 0 0 0 0 0 
0 0 0 0 2257.53 0 0 0 0 0 0 0 0.03 0 -2072.13 0 0 0 0 0 0 0 861.309 0 0 0 0 0 0 0 -1041.22 0 0 0 0 0 0 0 0 0 0 257.653 0 0 0 0 0 0 
0 0 0 251.549 -579.623 0 0 0 0 0 0 0 0 0.08 0 2413.17 0 0 0 0 -513.55 0 0 0 0 0 0 0 0 0 0 0 0 0 0 0 0 0 0 1963.94 0 1638.92 0 0 0 0 0 0 
-7.40074 0 0 0 0 1681.19 0 0 0 0 0 0 205.924 0 0.07 0 0 0 0 0 0 -899.152 0 0 0 0 913.038 0 1276.67 0 -2186.42 0 0 0 0 0 0 0 0 0 0 0 0 2255.7 0 0 959.578 0 
0 0 0 -1938.61 0 -2123.86 0 2050.77 0 0 404.599 0 0 468.993 0 0.07 0 0 0 1176.87 0 0 0 0 0 0 0 0 0 0 0 0 0 0 0 0 0 0 0 0 0 -668.279 0 1935.1 0 0 0 0 
0 0 0 0 0 0 0 0 0 0 0 -1088.21 0 0 0 0 0.03 1005.51 0 0 2356.11 0 0 0 0 0 0 0 0 0 0 0 0 0 328.761 -578.86 2162.92 0 0 0 0 0 0 0 0 0 0 0 
0 0 0 0 0 0 0 2240.44 0 1021.68 0 0 0 0 0 0 -928.144 0 0 0 -1049.76 0 0 0 0 0 0 0 0 0 0 0 0 0 0 0 0 0 0 0 0 0 0 0 0 0 0 0 
0 0 0 0 0 0 0 1242.48 0 0 0 0 0 0 0 0 0 0 0.01 0 0 0 1433.84 0 0 0 0 0 2481.38 0 0 0 0 0 0 0 0 0 0 0 0 0 0 0 0 0 0 0 
0 0 0 0 0 0 0 2109.97 0 0 0 0 0 0 0 2344.2 0 0 0 0.01 0 0 0 0 0 0 1954.79 -1041.06 0 -855.358 0 0 0 0 0 0 0 0 0 0 0 0 0 0 0 0 0 0 
1393.55 0 0 0 0 1299.86 0 0 0 0 0 -361.568 0 -1732 0 0 2399.75 -605.564 0 0 0.07 2012.31 0 -2487.18 0 0 0 0 0 0 0 0 0 0 0 0 0 0 -1639.84 1507.39 0 0 -948.897 0 0 0 0 0 
0 0 0 -20.6763 0 0 0 0 0 0 0 0 0 0 -1716.28 0 0 0 0 0 -202.719 0.03 0 0 0 0 0 0 0 0 0 0 0 0 0 0 1372.04 0 2014.91 0 2223.96 -2150.41 0 941.878 0 0 0 0 
0 0 0 0 0 0 2447.97 0 0 0 1297.11 0 2394.25 0 0 0 0 0 -821.482 0 0 0 0 0 1815.16 1833.02 0 0 0 0 0 0 0 0 0 0 0 0 0 0 0 0 0 -1672.8 0 0 0 0 
0 0 0 0 0 0 0 0 0 0 237.663 0 0 0 0 0 0 0 0 0 766.854 0 0 0.06 0 0 2276.6 0 0 0 0 0 0 0 0 -2282.71 0 0 0 0 0 0 0 0 437.559 0 2057.18 0 
0 0 1962.72 0 0 0 1489.38 0 0 0 0 0 0 0 0 0 0 0 0 0 0 0 -168.691 0 0.02 0 0 0 0 0 0 0 0 0 0 0 0 0 0 0 0 0 0 0 0 0 0 0 
0 0 0 0 0 0 0 0 0 0 0 0 0 0 0 0 0 0 0 0 0 0 2356.72 0 0 0.04 0 0 0 0 0 0 0 0 0 0 0 0 0 0 0 0 0 0 0 0 0 0 
0 0 176.016 2087.54 0 0 0 0 0 0 0 1577.58 0 0 737.556 0 0 0 0 -749.916 0 0 0 1741.46 0 0 0.08 0 2060.69 0 897.473 0 0 0 0 0 0 0 0 0 0 0 0 -2319.03 0 -969.192 1872.69 0 
0 0 0 0 0 0 827.586 0 1526.15 0 2086.93 0 0 0 0 0 0 0 0 -1396.91 0 0 0 0 0 0 0 0.09 0 0 0 0 0 1630.53 0 0 0 0 0 0 0 158.925 0 0 0 -771.126 0 0 
0 0 0 0 775.246 0 0 1871.32 0 0 0 828.501 0 0 -1795.02 0 0 0 1989.88 0 0 0 0 0 0 0 1295.28 0 0.09 0 0 0 1849.65 0 1024.58 0 0 0 0 0 0 0 0 0 0 0 0 0 
0 0 0 0 1719.95 0 0 0 0 0 0 -1090.81 0 0 0 0 0 0 0 -1197.16 0 0 0 0 0 0 0 0 0 0.08 0 0 -1470.15 0 0 2181.39 0 0 0 0 1700.42 -1253.32 0 0 841.319 0 0 0 
0 0 0 0 0 0 0 0 0 0 1401.03 -1425.9 1023.97 0 1077.23 0 0 0 0 0 0 0 0 0 0 0 1099.2 0 0 0 0.04 0 0 0 0 0 109.18 0 0 0 0 0 0 -1499.91 0 0 0 0 
0 0 0 0 0 0 0 0 0 0 0 0 0 0 0 0 0 0 0 0 0 0 0 0 0 0 0 0 0 0 0 0.03 0 0 0 0 2112.87 0 -1036.48 0 0 0 -453.734 0 -1632.51 0 1835.76 0 
0 0 1522.49 0 0 0 0 0 0 0 0 0 0 0 0 0 0 0 0 0 0 0 0 0 0 0 0 0 -1024.43 1139.64 0 0 0.09 0 -2057.63 0 0 0 0 2479.4 -440.916 0 0 0 0 1229.97 -508.362 0 
0 0 0 0 0 0 0 0 0 0 0 0 0 0 0 0 0 0 0 0 0 0 0 0 0 0 0 744.118 0 0 0 0 0 0 1910.99 0 -985.977 0 0 0 0 395.596 0 0 -2258.9 0 0 0 
0 955.763 0 0 713.752 0 0 0 0 0 0 307.55 0 0 0 0 2316.43 0 0 0 0 0 0 0 0 0 0 0 -1028.4 0 0 0 -1666.84 -132.679 0.05 1778.24 0 0 0 0 0 0 0 0 0 1316.49 0 0 
0 0 0 0 0 0 0 0 0 0 2461.55 325.861 0 0 0 0 -2257.38 0 0 0 0 0 0 1688.36 0 0 0 0 0 2271.87 0 0 0 0 -2067.09 0.06 0 0 0 0 0 0 0 0 0 0 0 0 
0 0 0 -1223.26 0 0 0 0 0 571.23 0 0 0 0 0 0 589.846 0 0 0 0 -236.747 0 0 0 0 0 0 0 0 1753.82 -1180.53 0 -2013.69 0 0 0.09 0 0 0 0 0 0 0 0 0 1832.87 2497.1 
0 0 0 1033.74 0 0 0 0 0 0 0 0 0 0 0 0 0 0 0 0 0 0 0 0 0 0 0 0 0 0 0 0 0 0 0 0 0 0.09 0 0 0 787.759 0 0 0 0 0 0 
0 0 0 0 0 942.183 0 0 0 0 0 -1044.27 0 0 0 0 0 0 0 0 269.402 2334.13 0 0 0 0 0 0 0 0 0 34.1044 0 0 0 0 0 0 0.09 0 0 0 0 0 0 0 0 0 
0 0 0 0 0 0 0 0 0 0 0 0 0 -386.288 0 0 0 0 0 0 335.017 0 0 0 0 0 0 0 0 0 0 0 1222.8 0 0 0 0 0 0 0.05 0 0 -698.34 0 0 0 0 0 
0 591.067 0 0 0 0 0 0 0 0 0 0 0 0 0 0 0 0 0 0 0 1519.14 0 0 0 0 0 0 0 1657.08 0 0 1844.46 0 0 0 0 0 0 0 0.04 0 0 0 0 0 0 0 
0 0 -2491.76 0 -794.32 0 0 0 0 0 504.7 0 1898.18 -325.251 0 2329.55 0 0 0 0 0 906.934 0 0 0 0 0 -1232.41 0 1512.88 0 0 0 639.744 0 0 0 1807.69 0 0 0 0.09 1212.88 -756.63 0 1418.42 0 0 
0 0 0 0 0 0 0 -1707.43 0 0 0 0 0 0 0 0 0 0 0 0 58.2141 0 0 0 0 0 0 0 0 0 0 2201.22 0 0 0 0 0 0 0 2254.63 0 1657.69 0.05 -556.886 0 0 0 0 
0 0 564.211 1078.45 0 1044.27 0 0 0 0 0 0 0 0 2442.63 2003.31 0 0 0 0 0 2373.04 2187.03 0 0 0 -2123.86 0 0 0 -445.952 0 0 0 0 0 0 0 0 0 0 -226.066 1796.55 0.05 0 0 -2309.41 0 
0 0 0 0 0 0 0 0 0 2146.9 0 0 0 0 0 0 0 0 0 0 0 0 0 1756.87 0 0 0 0 0 1940.44 0 -236.747 0 -1178.7 0 0 0 0 0 0 0 0 0 0 0.06 0 0 0 
859.02 1608.1 0 0 0 0 0 0 0 0 0 0 0 0 0 0 0 0 0 0 0 0 0 0 0 0 1694.77 869.243 0 0 0 0 2386.62 0 1977.98 0 0 0 0 0 0 930.433 0 0 0 0.05 820.414 0 
1923.66 0 0 0 0 0 0 0 0 0 1885.51 0 0 0 -179.678 0 0 0 0 0 0 0 0 1490.75 0 0 1440.24 0 0 0 0 594.882 -2454.22 0 0 0 112.079 0 0 0 0 0 0 -1920.15 0 -2286.22 0.03 0 
1444.36 0 0 0 0 0 0 0 0 0 0 0 0 0 0 0 0 0 0 0 0 0 0 0 0 0 0 0 0 0 0 0 0 0 0 0 1435.67 0 0 0 0 0 0 0 0 0 0 0.07 
