*Vertices 66
*Matrix 
0.01 0 0 0 0 269.707 -888.928 506.073 0 0 0 0 0 0 0 0 0 1439.63 -1724.98 655.004 0 2445.68 -235.984 0 0 -1680.58 0 0 0 0 0 0 0 2018.27 0 0 0 0 0 0 0 1452.15 0 0 0 0 -405.057 -764.565 0 0 0 0 -28.3059 0 0 0 -2050.61 -2012.31 0 0 951.033 0 2214.5 0 0 -1924.42 
0 0.03 0 -2271.11 0 0 0 0 0 0 0 0 0 0 1216.39 0 0 0 0 0 0 0 0 0 0 0 0 0 0 581.454 0 0 2281.49 0 0 -96.3622 -430.082 0 -494.934 -218.284 1075.4 0 1801.28 0 0 0 0 0 0 0 0 0 0 -1175.5 0 0 0 -105.365 0 0 0 922.651 0 206.381 0 0 
0 0 0.06 0 0 0 1306.88 0 -1190.76 0 0 0 -2059.16 0 2226.55 0 -997.726 -501.343 0 0 0 0 2086.78 0 795.694 -1268.88 0 0 0 0 0 1871.93 461.974 2021.77 2001.17 0 -867.26 0 -243.461 0 -2151.33 -124.744 0 -1655.86 0 -33.9518 0 -277.032 0 0 -922.193 -1889.02 0 0 2473.45 0 0 -952.101 0 1421.78 0 0 0 0 0 0 
0 1432.92 0 0.05 0 -668.126 0 0 0 0 1936.02 770.363 0 0 0 236.747 0 -2385.1 0 0 0 0 0 0 0 0 0 154.653 0 0 0 0 0 -452.666 0 1738.87 0 0 0 0 0 -501.495 0 1767.86 355.159 0 0 0 2149.04 0 0 -374.691 -564.974 376.675 -773.415 2241.51 90.1059 0 0 0 0 0 1068.83 0 0 0 
0 0 0 0 0.05 0 1984.24 -510.041 0 0 0 0 0 0 0 0 0 0 0 1288.72 2418.06 0 0 0 0 0 -2183.68 0 1419.8 0 0 0 0 105.365 0 0 -873.669 0 -722.297 0 0 -249.565 0 0 -1605.04 0 0 0 0 -1526.46 0 0 0 0 0 0 0 1129.41 0 0 0 0 0 1279.87 0 0 
2339.93 0 0 1614.66 0 0.05 -239.341 0 0 0 0 0 0 2307.28 0 0 675.909 1705.6 0 0 0 -547.578 0 0 0 725.044 763.497 0 0 0 -1685.77 0 2000.26 -2452.7 0 0 2005.29 0 0 0 0 0 0 0 0 0 0 -1879.56 0 0 0 0 0 481.048 1566.44 0 0 0 0 1424.83 0 0 0 -2418.36 0 1312.37 
-1337.86 0 -2156.82 0 1793.5 219.047 0.03 671.331 0 0 0 0 0 0 0 0 0 1286.74 0 0 0 0 0 0 0 0 0 0 44.6333 0 1142.84 2162.92 0 -1188.47 1511.2 0 0 0 0 0 219.047 0 957.747 0 0 0 0 0 0 0 -2492.83 0 2496.49 0 0 0 -198.599 -772.652 0 167.318 0 0 1838.21 0 0 0 
-1334.04 0 0 0 989.944 0 1447.11 0.05 2364.96 0 0 0 0 0 0 0 0 2462.61 0 687.506 0 0 -363.399 -2015.37 0 0 0 0 534.761 0 0 0 -1812.27 1107.9 0 0 -237.358 0 0 2489.01 0 0 0 -1694.46 -1393.09 0 0 2030.32 0 0 0 0 0 0 0 0 0 0 -1678.29 0 -1815.93 0 0 0 0 1337.7 
0 0 2363.58 0 0 0 0 1264.31 0.01 0 0 0 0 0 1333.43 0 0 0 0 -2304.07 0 0 0 345.851 0 -983.993 0 0 0 0 1636.02 0 0 0 354.854 0 0 0 0 0 -1261.56 0 -2149.95 0 0 0 0 0 0 0 1104.39 0 0 1767.25 -528.047 0 0 2326.04 0 0 1864.45 0 156.789 606.479 0 0 
0 0 0 0 0 0 0 0 0 0.05 0 0 0 1707.43 -1382.87 105.823 -2374.11 0 0 -2321.31 -99.8718 0 0 0 -2054.89 -277.337 0 2316.74 0 0 0 0 1571.02 0 0 0 -63.097 0 334.101 -235.984 0 0 0 0 -907.544 0 0 -1056.47 0 315.485 0 0 0 0 2473.3 0 433.134 0 0 0 0 0 0 0 2181.39 0 
0 0 0 -1522.49 0 0 0 0 0 0 0.04 0 0 0 0 0 2080.07 2397 0 506.226 0 0 0 -370.571 0 0 0 -1066.85 0 -71.337 0 0 0 0 0 0 0 2060.69 1668.68 0 0 0 0 0 0 0 0 -738.472 0 0 0 0 0 0 0 0 0 0 0 0 0 0 0 0 0 -1548.13 
0 0 0 -898.541 0 0 0 0 0 0 0 0.09 2033.52 0 0 329.066 0 0 0 0 0 1219.44 0 -1054.49 0 -2443.08 0 1164.05 0 0 -334.559 1075.24 0 0 0 0 0 479.064 0 0 0 2196.19 0 0 0 0 0 -2076.71 0 -27.6955 -787.149 0 0 0 0 0 -1879.1 -449.614 1800.97 2268.21 0 0 -1107.59 0 0 0 
0 0 1082.57 0 0 0 0 0 0 0 0 -2152.24 0.03 0 0 261.467 0 0 0 0 -1236.38 0 0 0 2114.25 632.42 -795.694 0 0 0 0 0 0 0 1136.74 0 0 0 1106.68 0 0 0 0 0 0 0 1847.06 354.854 0 -1601.08 0 0 0 0 0 1343.04 0 0 671.484 -2094.41 0 0 0 1869.03 454.65 0 
0 0 0 0 0 -2090.44 0 0 0 1848.43 0 0 0 0.09 0 0 0 0 0 0 -2240.75 0 0 0 0 228.66 0 0 1575.59 1242.03 981.094 125.507 0 1066.24 2393.34 0 0 86.5963 0 0 392.85 0 251.701 0 0 0 0 0 0 0 0 0 0 0 0 0 -2230.67 0 -1007.19 -809.58 0 0 0 0 0 0 
0 1926.4 -2182.15 0 0 0 0 0 1587.65 -16.7089 0 0 0 0 0.07 0 1020.62 0 0 0 0 844.523 0 0 0 -1121.94 0 0 0 1053.42 0 -441.679 0 -2109.21 0 0 0 0 0 0 0 0 1151.39 0 0 0 0 -1651.13 0 0 0 1144.67 0 0 0 0 1412.17 0 0 -1755.5 0 0 0 0 0 0 
0 0 0 -640.66 0 0 0 0 0 1927.93 0 196.463 1801.89 0 0 0.05 0 0 554.75 0 -61.4185 0 -103.687 0 0 783.334 0 0 0 1692.63 0 0 0 0 0 0 0 0 0 1454.59 0 0 1622.29 1629.31 0 0 0 0 0 0 0 0 -1696.75 0 0 0 -610.446 -2388.76 1444.82 0 0 1154.59 1157.49 0 0 0 
0 0 -396.664 0 0 -1777.02 0 0 0 -479.522 -126.118 0 0 0 -618.686 0 0.07 0 1129.87 0 0 0 0 2297.2 -211.57 0 0 976.211 1657.08 409.635 0 956.069 0 0 0 -796.915 1154.29 446.867 -721.992 2406.46 0 0 0 0 0 -1545.23 0 0 1657.69 529.572 0 -1320.61 0 0 -1881.54 0 -1462.52 2123.55 0 0 -1927.78 0 0 0 0 1463.74 
1132.77 0 -1229.97 1161.61 0 262.993 2440.03 979.72 0 0 1867.66 0 0 0 0 0 0 0.03 2443.08 0 -1162.37 -1476.41 561.464 0 0 1264.15 0 0 2039.93 0 0 738.319 0 0 -2136.07 0 0 -1422.7 0 0 -1959.97 0 0 0 0 0 0 0 0 143.513 0 0 0 0 -1118.43 0 0 0 0 0 0 0 0 -743.812 0 0 
2300.1 0 0 0 0 0 0 0 0 0 0 0 0 0 0 -533.845 2200 372.707 0.08 0 0 1300.93 0 -290.002 0 0 1757.79 -1968.37 0 0 0 0 0 1207.69 2349.7 2085.25 0 0 0 0 0 2488.71 0 0 -1757.48 0 0 0 -2086.93 0 2348.32 0 0 1019.55 0 0 2046.19 0 0 0 -1559.27 0 0 520.112 0 0 
-1240.96 0 0 0 1184.19 0 0 834.758 356.99 2041 -1222.65 0 0 0 0 0 0 0 0 0.05 0 0 1845.23 -2113.94 0 0 1971.42 615.177 0 -1313.44 0 0 0 -1052.66 0 0 0 1128.5 1682.56 195.853 537.812 0 0 0 0 0 0 0 0 0 0 -657.903 0 0 0 0 0 0 0 0 0 0 -1482.67 0 0 1100.88 
0 0 0 0 1895.73 0 0 0 0 1280.02 0 0 1490.91 1990.65 0 -1442.53 0 624.18 0 0 0.01 0 0 0 0 0 0 -293.207 0 -600.375 0 0 0 0 0 0 0 -1562.32 0 -216.147 -961.562 0 0 1439.48 0 0 0 739.387 0 0 0 -1595.43 0 0 1185.11 0 0 0 713.752 346.461 0 0 0 0 -2156.82 0 
-431.608 0 0 0 0 -2492.83 0 0 0 0 0 807.138 0 0 141.224 0 0 828.043 2072.59 0 0 0.06 0 0 0 0 1393.7 -1190.45 0 0 0 0 0 0 0 0 0 0 0 0 0 0 0 0 120.624 0 1675.08 -2343.44 1664.86 0 0 0 0 0 0 0 -1762.52 0 645.085 0 0 0 1751.08 0 0 0 
-1968.06 0 358.974 0 0 0 0 2189.02 0 0 0 0 0 0 0 -452.666 0 2354.88 0 1464.2 0 0 0.07 0 0 0 0 0 0 0 147.023 -1797.31 0 0 0 0 685.064 1519.59 0 -997.116 0 0 0 0 0 0 0 1234.7 0 -463.347 1936.32 0 1202.81 0 0 -216.453 0 -1327.33 0 0 -1464.2 0 0 0 0 0 
0 0 0 0 0 0 0 648.747 -814.158 0 2362.21 1304.59 0 0 0 0 -1286.43 0 -2482.3 236.442 0 0 0 0.05 0 -957.595 0 0 0 0 -41.1237 0 0 0 0 0 0 0 655.766 0 -2217.86 0 0 0 673.925 201.651 0 0 1633.27 0 0 -1126.97 1826.91 0 0 0 0 0 0 0 575.045 0 0 438.932 0 0 
0 0 2262.26 0 0 0 0 0 0 2135 0 0 -740.303 0 0 0 -1488.16 0 0 0 0 0 0 0 0.09 -2233.27 0 -964.309 0 0 1831.8 884.503 0 0 0 0 -1802.96 93.0052 -852.611 1687.29 0 0 258.415 0 0 0 0 0 2447.97 0 193.411 154.958 0 0 382.321 0 0 0 0 -2256.77 1226 0 0 0 0 0 
-430.387 0 -1908.25 0 0 850.017 0 0 -243.004 1449.71 0 -600.223 1283.68 1105.91 -2456.97 2114.4 0 1426.97 0 0 0 0 0 1404.39 -224.235 0.06 920.667 0 -184.256 0 0 0 1413.54 -620.518 0 0 0 -2495.57 -1277.89 0 0 0 0 0 1319.85 0 -1500.06 0 2328.33 -557.649 2276.6 0 2420.35 0 -197.989 0 0 0 0 0 1671.88 0 0 0 -528.199 0 
0 0 0 0 2271.87 364.925 0 0 0 0 0 0 -496.612 0 0 0 0 0 -2172.23 -743.202 0 -1806.62 0 0 0 1419.8 0.08 0 0 0 0 1691.87 0 0 0 0 -1279.72 0 0 820.566 1306.88 0 0 0 0 0 0 0 -2240.59 0 0 0 0 0 0 1626.87 2004.84 0 0 0 403.836 0 0 0 0 0 
0 0 0 -84.9178 0 0 0 0 0 1081.8 403.684 1578.8 0 0 0 0 -339.747 0 -1838.82 112.232 960.952 -1263.39 0 0 815.073 0 0 0.08 0 0 0 -1059.83 270.318 0 0 1868.72 0 -969.649 0 0 0 0 0 0 0 0 0 0 0 1813.94 0 0 0 0 0 1794.26 0 -1940.6 0 0 1189.84 0 0 0 0 0 
0 0 0 0 1375.55 0 879.009 1950.21 0 0 0 0 0 510.651 0 0 1148.95 783.181 0 0 0 0 0 0 0 1008.87 0 0 0.07 0 0 0 -754.494 0 0 0 0 0 0 0 0 -1242.94 0 -1292.99 0 -918.378 2072.74 0 0 0 0 -1407.28 0 0 0 901.898 -158.62 0 0 -144.734 799.356 0 332.728 0 0 0 
0 2386.47 0 0 0 0 0 0 0 0 33.1889 0 0 1282.62 -407.651 -554.14 1822.49 0 0 679.724 330.134 0 0 0 0 0 0 0 0 0.02 0 0 0 1791.06 0 0 1491.82 0 0 0 -546.052 0 0 0 0 0 0 0 0 -2442.17 0 0 0 0 1796.55 0 0 0 0 0 1639.84 1670.51 2024.83 435.27 -11.9785 0 
0 0 0 0 0 -1338.62 -61.2659 0 1475.95 0 0 220.878 0 -555.818 0 0 0 0 0 0 0 0 -1726.36 1177.18 1743.14 0 0 0 0 0 0.08 0 1433.99 0 0 0 0 -633.793 0 0 0 0 1539.89 -1451.23 -1521.58 0 0 0 0 1266.59 0 0 0 0 0 0 0 1596.19 0 0 0 0 0 -2218.01 0 0 
0 0 1027.94 0 0 0 151.448 0 0 0 0 2078.23 0 674.23 2007.74 0 -1071.58 1055.25 0 0 0 0 -2202.29 0 -1627.48 0 -1225.09 447.325 0 0 0 0.03 2356.72 1481.14 0 0 0 506.226 0 0 832.316 0 0 0 0 0 0 0 0 0 0 1568.27 -131.611 0 0 155.11 0 0 0 56.0778 0 0 0 477.538 0 0 
0 -315.943 1177.18 0 0 984.146 0 -1545.38 0 -911.512 0 0 0 0 0 0 0 0 0 0 0 0 0 0 0 -555.971 0 170.522 182.882 0 -880.383 1178.09 0.03 0 0 -1774.73 0 0 0 470.977 0 1800.67 -1556.22 0 0 759.529 0 -1448.94 0 1731.09 0 0 0 0 711.31 382.778 10.9104 0 502.564 -1509.83 0 0 0 0 -1163.44 1419.49 
-861.156 0 1031.3 273.675 -1974.78 -1302.3 -0.381481 1124.68 0 0 0 0 0 -924.177 1156.27 0 0 0 -521.332 -1561.86 0 0 0 0 0 2114.55 0 0 0 -2428.13 0 -1438.11 0 0.06 0 0 2418.21 0 0 0 0 0 0 0 0 2069.99 0 0 2062.52 0 0 0 0 0 2239.68 0 1368.37 0 0 -1872.84 -895.184 -133.9 0 1748.94 1032.36 0 
0 0 -2473.3 0 0 0 -141.53 0 1753.06 0 0 0 -1774.27 2261.04 0 0 0 512.482 -2492.83 0 0 0 0 0 0 0 0 0 0 0 0 0 0 0 0.03 0 0 0 0 0 -159.23 0 0 215.69 0 1699.8 0 0 0 0 557.649 0 0 0 0 1005.36 0 0 0 0 0 0 176.168 1302.3 0 0 
0 2135.76 0 1757.94 0 0 0 0 0 0 0 0 0 0 0 0 -960.952 0 -1307.64 0 0 0 0 0 0 0 0 -601.291 0 0 0 0 286.798 0 0 0.05 0 0 0 -253.685 0 0 0 0 0 0 0 2172.99 0 -1287.35 0 0 0 0 -183.187 0 -10.3 0 -578.249 2218.92 -141.377 0 0 2330.62 0 0 
0 1655.25 2165.21 0 2088.92 1255.76 0 681.249 0 -889.996 0 0 0 0 0 0 2123.25 0 0 0 0 0 2230.37 0 967.513 0 1312.83 0 0 2489.93 0 0 0 483.032 0 0 0.03 0 0 408.719 0 0 0 0 0 0 0 1726.05 0 -383.389 -74.0837 0 0 2201.99 0 0 1358.91 0 0 1807.99 -2413.79 0 0 0 0 0 
0 0 0 0 0 0 0 0 0 0 -1638.62 137.41 0 -1790.75 0 0 -646.306 2477.57 0 -2072.59 2004.07 0 838.725 0 682.928 1502.04 0 567.873 0 0 338.527 943.709 0 0 0 0 0 0.02 1112.17 -1777.78 0 0 0 2097 -1677.22 -898.083 0 -1130.33 0 0 0 0 0 2359.92 0 0 0 0 0 2149.19 0 0 522.706 0 0 0 
0 553.529 1253.17 0 828.501 0 0 0 0 -1276.36 -1364.1 0 1318.93 0 0 0 2097.46 0 0 -1258.96 0 0 0 694.983 1764.66 2315.21 0 0 0 0 0 0 0 0 0 0 0 1381.04 0.08 0 -1061.82 1424.83 0 0 -2378.99 0 0 0 1249.96 1878.34 0 1142.99 0 1647.77 0 0 1115.99 0 0 0 513.703 0 -191.58 0 0 102.008 
0 1242.48 0 0 0 0 0 2158.5 0 707.953 0 0 0 0 0 1666.23 1783.43 0 0 -939.131 2468.72 0 1730.02 0 321.894 0 1389.28 0 0 0 0 0 -2189.32 0 0 759.377 1251.49 -2217.4 0 0.05 -1863.84 -675.298 0 2038.26 0 -792.032 0 -1573.76 0 0 1441.16 0 0 0 0 -2333.83 0 0 0 0 0 0 0 0 2487.49 -1408.66 
0 254.295 597.324 0 0 0 -584.353 0 2438.05 0 0 0 0 -37.9192 0 0 0 828.043 0 -1402.4 1994.61 0 0 -1626.1 0 0 -1898.63 0 0 -1791.36 0 1445.89 0 0 2100.21 0 0 0 -1277.28 496.612 0.07 0 0 1104.08 0 0 -1305.96 0 0 0 0 0 0 -1931.59 0 -385.83 0 0 1562.78 0 1218.22 0 0 1335.26 0 0 
1778.54 0 -289.087 -2223.81 951.796 0 0 0 0 0 0 -1727.73 0 0 0 0 0 0 1568.27 0 0 0 0 0 0 0 0 0 1237.6 0 0 0 2408.29 0 0 0 0 0 -1476.26 -2423.86 0 0 1195.18 0 0 0 -1796.7 0 0 0 2205.65 0 0 -1382.26 0 1758.25 0 0 846.049 -1226.16 1373.56 0 2315.36 0 0 0 
0 1234.55 0 0 0 0 416.044 0 1133.99 0 0 0 0 662.023 -455.107 -552.309 0 0 0 0 0 0 0 0 -1143.45 0 0 0 0 0 -2251.58 0 -269.097 0 0 0 0 0 0 0 0 1954.33 0.01 2173.45 51.1948 1902.6 252.159 0 0 0 1513.18 0 0 -751.137 0 0 0 -2293.69 -1584.9 0 0 0 0 1824.32 0 0 
0 0 584.964 2136.98 0 0 0 -2480.93 0 0 0 0 0 0 0 389.798 0 0 0 0 1656.16 0 0 0 0 0 0 0 -499.969 0 1697.21 0 0 0 2003.77 0 0 2003.46 0 1503.42 2451.02 0 730.079 0.09 450.987 1336.48 0 -1011.61 0 0 0 -546.052 0 -50.2792 229.575 536.744 0 0 0 0 0 0 1037.25 0 0 0 
0 0 0 1687.44 -2483.83 0 0 -670.873 0 1898.63 0 0 0 0 0 0 0 0 2038.56 0 0 1091.42 0 -347.53 0 -2000.26 0 0 0 0 -832.316 0 0 0 0 0 0 527.589 -264.977 0 0 0 -2212.06 776.467 0.02 0 320.215 0 0 0 0 0 0 0 0 -1628.39 0 0 1139.18 0 0 252.617 2277.67 229.575 1059.37 0 
0 0 -1290.25 0 0 0 0 0 0 0 0 0 0 0 0 0 183.798 0 0 0 0 0 0 -2044.21 0 0 0 0 1447.87 0 0 0 1090.81 -1918.16 342.952 0 0 -436.186 0 -1337.09 0 0 1804.94 -1842.02 0 0.02 0 25.5593 0 1883.83 0 832.011 0 0 508.515 2417.45 0 0 0 -1483.58 -1970.96 0 1994 0 -1299.1 0 
1343.96 0 0 0 0 0 0 0 0 0 0 0 -871.685 0 0 0 0 0 0 0 0 -218.894 0 0 0 1706.21 0 0 2452.24 0 0 0 0 0 0 0 0 0 0 0 -2212.06 -306.94 1446.5 0 -537.812 0 0.02 0 -1849.96 1413.85 0 2022.54 0 0 0 0 0 0 2455.75 1709.57 478.454 0 0 11.6733 67.8274 0 
1201.13 0 -2407.83 0 0 2139.27 0 2142.78 0 2092.88 1740.24 1717.81 -1466.19 0 -1309.02 0 0 0 0 0 -167.013 2482.6 -805.46 0 0 0 0 0 0 0 0 0 -948.439 0 0 1439.63 -1582 2073.96 0 1081.8 0 0 0 833.842 0 -969.955 0 0.02 0 0 0 0 -140.919 -209.128 0 0 0 -837.657 0 2111.65 395.291 -1077.38 0 0 0 -1822.49 
0 0 0 22.2022 0 0 0 0 0 0 0 0 0 0 0 0 629.673 0 529.878 0 0 -273.522 0 505.005 2356.56 1605.5 2256.31 0 0 0 0 0 0 -562.075 0 0 0 0 1804.03 0 0 0 0 0 0 0 -1106.68 0 0.07 0 0 0 1139.94 0 0 0 0 1824.32 0 0 0 -2125.54 0 0 0 0 
0 0 0 0 681.86 0 0 0 0 -540.101 0 2196.19 -2236.63 0 0 0 1633.12 2070.91 0 0 0 0 2118.98 0 0 1588.26 0 -2124.93 0 173.269 376.37 0 1083.48 0 0 -1326.11 960.646 0 984.603 0 0 0 0 0 0 -200.583 -1182.67 0 0 0.09 0 0 0 1686.53 -1663.79 0 1606.11 -1755.35 -2049.39 0 0 0 0 1432 0 0 
0 0 1546.14 0 0 0 316.553 0 -799.203 0 0 -63.5548 0 0 0 0 0 0 490.814 0 0 0 1150.32 0 1332.67 -118.183 0 0 0 0 0 0 0 0 267.876 0 833.232 0 0 2283.93 0 490.661 727.79 0 0 0 0 0 0 0 0.04 0 0 1759.32 0 0 0 0 0 0 0 -1664.1 0 0 0 0 
0 0 -1013.44 1369.29 0 0 0 0 0 0 0 0 0 0 -2169.18 0 -2042.53 0 0 2478.48 1458.86 0 0 -2209.62 894.116 0 0 0 1377.83 0 0 1796.24 0 0 0 0 0 0 574.435 0 0 0 0 -491.577 0 2477.26 -1986.07 0 0 0 0 0.01 0 -1256.22 0 625.706 125.05 0 0 0 0 0 0 0 0 0 
2443.85 0 0 1355.71 0 0 856.273 0 0 0 0 0 0 0 0 641.423 0 0 0 0 0 0 883.129 2042.53 0 -584.811 0 0 0 0 0 981.246 0 0 0 0 0 0 0 0 0 0 0 0 0 0 0 24.0333 -212.18 0 0 0 0.01 0 0 1581.55 0 0 0 -1279.11 -1524.78 0 0 1528.75 -1212.42 0 
0 2352.44 0 181.204 0 1113.85 0 0 -2464.45 0 0 0 0 0 0 0 0 0 1381.8 0 0 0 0 0 0 0 0 0 0 0 0 0 0 0 0 0 944.166 -901.746 -1292.84 0 2434.84 -84.9178 -2369.84 1697.52 0 0 0 -2288.2 0 -1134.45 2429.65 1350.67 0 0.01 -2379.76 0 0 0 -857.952 0 0 0 0 0 153.279 0 
0 0 123.066 2268.21 0 -1741.31 0 0 1739.17 1886.73 0 0 0 0 0 0 -1467.71 -2090.59 0 0 887.707 0 0 0 -1691.41 1371.58 0 0 0 440.001 0 0 2256.46 -297.632 0 -1006.27 0 0 0 0 0 0 0 2422.94 0 2310.33 0 0 0 -1705.6 0 0 0 2142.32 0.04 0 0 0 0 0 0 0 0 0 0 0 
0 0 0 824.229 0 0 0 0 0 0 0 0 -619.907 0 0 0 0 0 0 0 0 0 1194.57 0 0 0 807.443 2013.84 1443.6 0 0 -89.8007 1955.09 0 2381.13 0 0 0 0 -2097.77 -489.898 1893.14 0 -167.165 1395.38 2014.3 0 0 0 0 0 1649.3 -1389.89 0 0 0.08 -1123.62 -1104.69 0 0 0 0 0 -1618.63 565.432 0 
-1984.24 0 0 -1036.33 0 0 1088.21 0 0 1494.42 0 -782.418 0 910.596 1987.59 -733.131 2062.82 0 1083.03 0 0 -1854.53 0 0 0 0 -2182.45 0 -944.319 0 0 0 1873.61 847.88 0 1379.06 2218.62 0 -280.694 0 0 0 0 0 0 0 0 0 0 1232.41 0 800.119 0 0 0 1927.02 0.09 944.472 0 0 0 0 0 0 0 0 
232.78 -806.528 1735.51 0 -1387.75 0 -2149.65 0 1142.38 0 0 -970.717 0 0 0 985.214 -805.002 0 0 0 0 0 914.411 0 0 0 0 -237.51 0 0 176.931 0 0 0 0 0 0 0 0 0 0 0 -1378.9 0 0 0 0 2028.95 645.695 -278.71 0 0 0 0 0 2420.04 -1844.31 0.05 997.574 0 0 2058.24 0 0 0 0 
0 0 0 0 0 0 0 1980.12 0 0 0 2188.1 1731.7 -356.075 0 673.315 0 0 0 0 1578.95 -101.245 0 0 0 0 0 0 0 0 0 0 1577.58 0 0 -1865.52 0 0 0 0 -964.309 -1602.76 320.368 0 1116.9 0 1989.27 0 0 2256.31 0 0 0 645.238 0 0 0 711.615 0.03 0 0 0 0 0 0 0 
0 0 -1085.16 0 0 -986.282 234.306 0 0 0 0 1497.01 1948.68 530.641 1502.35 0 0 0 0 0 -1629.31 0 0 0 2047.56 0 0 0 651.952 0 0 2359.61 -1980.12 -1112.02 0 1556.37 -951.796 737.709 0 0 0 -1578.95 0 0 0 -184.408 -1722.54 2085.25 0 0 0 0 -1037.71 0 0 0 0 0 0 0.08 0 0 0 0 -796.152 0 
-1133.08 0 0 0 0 0 0 -1109.58 823.923 0 0 0 0 0 0 0 1614.51 0 571.078 0 0 0 1967.45 1165.88 -2085.1 -2442.01 1672.03 748.543 -235.527 2309.26 0 0 0 -672.857 0 -2428.13 937.91 0 -1197.01 0 1833.78 -1066.39 0 0 0 2267.6 -867.718 799.509 0 0 0 0 330.592 0 0 0 0 0 0 0 0 953.627 0 0 -2033.68 0 
0 1833.17 0 0 0 0 0 0 0 0 0 0 0 0 0 -143.971 0 0 0 0 0 0 0 0 0 0 0 0 0 -697.272 0 0 0 489.593 0 0 0 0 0 0 0 0 0 0 -1587.5 0 0 776.772 1765.72 0 -417.417 0 0 0 0 0 0 -1236.23 0 0 -1087.76 0.01 0 0 0 0 
2078.69 0 0 1973.1 0 0 994.827 0 -409.177 0 0 1184.35 0 0 0 -1904.89 0 0 0 1760.99 0 1641.82 0 0 0 0 0 0 993.606 -2288.96 0 0 0 0 180.898 0 0 -133.137 2474.21 0 0 -1949.6 0 781.35 565.889 1322.44 0 0 0 0 0 0 0 0 0 0 0 0 0 0 0 0 0.02 0 0 0 
0 -1684.24 0 0 -1413.39 1370.66 0 0 -1323.97 0 0 0 130.39 0 0 0 0 -1036.48 -1372.65 0 0 0 0 -1945.63 0 0 0 0 0 -2104.18 715.888 -1531.19 0 2476.65 -37.4615 2468.72 0 0 0 0 1263.7 0 1527.22 0 1303.83 0 2335.05 0 0 1442.69 0 0 -225.608 0 0 847.118 0 0 0 0 0 0 0 0.02 1160.39 0 
0 0 0 0 0 0 0 0 0 -1498.38 0 0 2129.51 0 0 0 0 0 0 0 -1816.23 0 0 0 0 689.337 0 0 0 1981.34 0 0 -909.375 -2163.99 0 0 0 0 0 1758.4 0 0 0 0 595.645 1850.57 878.857 0 0 0 0 0 -406.735 -255.669 0 2308.8 0 0 0 2065.72 2111.19 0 0 -556.276 0.06 0 
2273.4 0 0 0 0 669.805 0 -796.457 0 0 -621.891 0 0 0 0 0 1804.64 0 0 -404.599 0 0 0 0 0 0 0 0 0 0 0 0 -363.399 0 0 0 0 0 -479.827 1258.05 0 0 0 0 0 0 0 -2154.68 0 0 0 0 0 0 0 0 0 0 0 0 0 0 0 0 0 0.06 
