*Vertices 49
*Matrix 
0.09 532.624 0 0 0 0 0 0 0 2091.66 0 0 0 0 0 0 0 1727.12 0 0 0 -1056.93 -734.199 0 0 0 0 0 0 0 0 0 0 0 0 2198.63 0 -1629.31 0 0 0 1851.33 0 0 0 0 0 0 0 
1620.15 0.06 0 0 0 0 1556.22 0 0 0 1654.03 0 0 0 0 0 0 0 0 0 1845.84 0 0 -1796.4 0 0 0 1211.97 226.981 0 -1452.3 0 0 0 0 0 160.298 0 0 0 0 0 0 0 2026.35 -1003.07 0 0 0 
0 0 0.03 0 0 0 0 0 -1662.88 0 0 0 0 0 0 0 0 1928.54 0 0 0 0 0 2235.25 0 1137.35 0 0 0 0 0 0 0 0 0 0 0 1050.68 0 0 0 0 0 0 0 1468.93 0 0 0 
0 0 0 0.03 0 0 805.46 0 0 -401.7 2147.21 0 0 0 -908.46 0 0 0 1979.96 0 0 0 0 0 300.684 0 0 0 0 0 0 0 0 0 0 0 0 0 0 0 0 0 0 1065.32 0 0 0 0 0 
0 0 0 0 0.06 0 0 0 0 0 -1843.39 0 154.195 1058.15 0 -2231.44 0 0 0 0 0 0 0 0 0 0 0 0 2286.52 0 0 0 2245.78 0 0 0 0 0 2010.03 0 0 0 0 0 0 0 -393.918 0 -1871.93 
0 0 0 0 0 0.05 0 0 0 1620.46 0 0 0 0 0 0 0 0 0 0 -0.686666 0 0 0 0 0 0 0 0 2166.13 0 0 0 0 0 0 0 0 0 0 0 0 0 0 0 1102.56 0 0 0 
0 1751.99 0 767.006 0 0 0.09 0 0 0 0 381.405 0 0 0 37.1563 0 0 0 0 0 0 0 0 0 0 0 -1607.03 0 0 0 0 0 0 0 0 0 0 0 0 0 -2395.47 0 1600.16 0 0 0 0 0 
0 0 0 0 0 0 0 0.02 0 0 0 0 0 2115.92 0 0 0 1464.2 0 0 0 0 0 0 0 0 0 0 0 0 0 0 0 0 1410.18 0 0 0 0 0 0 0 0 0 2064.81 0 0 0 0 
0 0 1560.18 0 0 0 0 0 0.01 0 0 0 0 0 0 0 0 0 0 0 0 0 0 0 0 0 0 0 0 1564.3 0 -2038.41 1590.24 0 0 0 0 0 0 0 0 0 0 0 2387.08 0 -665.99 2456.21 -654.546 
-1288.42 0 0 2344.2 0 259.484 0 0 0 0.01 2211.91 0 0 0 0 0 0 0 0 0 0 0 0 0 0 0 0 0 -65.5385 0 0 989.181 0 0 -2276.15 0 0 0 0 0 0 0 0 0 472.045 0 0 0 0 
0 870.922 0 688.574 811.411 0 0 0 0 2272.03 0.03 0 0 0 0 0 0 0 0 0 0 0 0 0 866.649 0 0 0 0 0 0 0 0 0 0 0 0 -1861.25 2216.94 0 0 0 0 0 0 0 0 0 2283.78 
0 0 0 0 0 0 2381.13 0 0 0 0 0.05 0 0 0 1996.6 0 0 0 0 0 0 0 58.977 0 0 0 0 0 1537.6 0 0 0 0 0 0 0 0 0 -195.242 0 0 0 0 0 0 0 -706.122 0 
0 0 0 0 -676.214 0 0 0 0 0 0 0 0.03 0 0 0 0 0 -513.092 0 0 1338.77 0 0 0 0 0 0 1934.64 0 0 0 0 0 0 606.937 0 0 0 0 0 0 0 0 0 0 0 0 0 
0 0 0 0 1829.81 0 0 -270.165 0 0 0 0 0 0.08 0 0 0 0 0 347.53 0 -2199.55 -405.057 0 0 0 0 0 0 0 0 0 0 0 0 0 2216.48 0 0 0 696.509 0 0 0 -261.315 0 0 0 0 
0 0 0 1962.42 0 0 0 0 0 0 0 0 0 0 0.01 0 0 0 0 0 0 0 0 0 0 0 0 0 0 0 0 0 0 0 0 0 0 0 0 0 0 0 1128.19 0 0 0 0 0 0 
0 0 0 0 2409.82 0 -608.921 0 0 0 0 661.565 0 0 0 0.03 -201.804 0 1992.63 -506.378 0 0 0 0 0 0 0 -782.418 0 0 0 0 0 0 0 0 0 0 0 0 0 0 0 0 0 0 0 0 0 
0 0 0 0 0 0 0 0 0 0 0 0 0 0 0 675.756 0.01 0 0 0 0 0 0 0 0 1271.32 267.266 0 -2394.71 0 0 1750.16 0 0 0 90.4111 0 0 0 0 0 0 0 0 0 0 0 0 0 
1356.32 0 1457.95 0 0 0 0 -44.4807 0 0 0 0 0 0 0 0 0 0.07 0 0 0 0 0 0 0 0 0 0 0 0 0 0 0 0 0 0 0 0 0 0 0 -776.009 0 0 0 0 0 1460.08 0 
0 0 0 -203.787 0 0 0 0 0 0 0 0 -189.749 0 0 1983.78 0 0 0.08 0 0 -1954.02 0 0 0 0 0 0 0 0 -817.057 -1177.63 0 -2315.97 0 0 0 0 1175.8 2094.41 0 2085.71 0 0 0 0 0 0 0 
0 0 0 0 0 0 0 0 0 0 0 0 0 1783.12 0 -655.919 0 0 0 0.01 -892.285 0 -262.841 0 0 0 0 0 0 0 0 0 1064.56 0 0 0 0 2367.4 0 628.3 0 0 0 0 1433.84 0 0 0 0 
0 615.177 0 0 0 2389.68 0 0 0 0 0 0 0 0 0 0 0 0 0 2114.55 0.05 0 0 0 0 0 0 0 0 0 0 0 0 0 0 0 0 0 0 0 0 0 0 820.719 0 0 0 0 0 
988.571 0 0 0 0 0 0 0 0 0 0 0 2420.19 2475.89 0 0 0 0 536.592 0 0 0.08 1749.09 0 0 0 0 0 0 0 0 0 0 0 0 0 0 0 0 0 0 0 0 0 0 0 0 0 0 
2029.86 0 0 0 0 0 0 0 0 0 0 0 0 -130.696 0 0 0 0 0 -2177.11 0 1844.92 0.05 0 0 0 -992.843 0 0 0 -346.614 0 0 0 0 1769.39 0 0 0 0 0 0 0 -2301.78 343.41 2117.15 0 0 0 
0 1527.38 1589.48 0 0 0 0 0 0 0 0 -2268.67 0 0 0 0 0 0 0 0 0 0 0 0.08 0 0 0 0 0 0 0 0 1274.68 2430.42 0 1711.25 0 62.4866 0 0 0 0 0 0 0 0 0 -741.066 0 
0 0 0 2366.63 0 0 0 0 0 0 302.973 0 0 0 0 0 0 0 0 0 0 0 0 0 0.09 0 0 0 0 0 0 0 -1928.24 0 0 1472.44 1851.79 0 1474.88 0 0 0 0 0 0 0 0 0 0 
0 0 1992.02 0 0 0 0 0 0 0 0 0 0 0 0 0 918.226 0 0 0 0 0 0 0 0 0.06 0 0 0 0 1613.28 0 0 0 0 0 1740.39 0 -631.352 0 0 1597.87 0 0 0 0 0 0 0 
0 0 0 0 0 0 0 0 0 0 0 0 0 0 0 0 -791.574 0 0 0 0 0 2096.39 0 0 0 0.02 0 0 0 0 0 495.697 0 0 0 0 0 0 2201.53 0 0 188.833 0 0 0 0 0 0 
0 2005.29 0 0 0 0 781.045 0 0 0 0 0 0 0 0 1963.18 0 0 0 0 0 0 0 0 0 0 0 0.06 200.583 0 912.885 0 0 0 0 0 0 0 0 0 0 0 0 0 0 0 2340.85 0 0 
0 -2244.71 0 0 285.119 0 0 0 0 1878.19 0 0 -150.99 0 0 0 -654.698 0 0 0 0 0 0 0 0 0 0 2200.31 0.07 0 0 1120.11 0 2485.96 0 0 485.015 0 1670.35 0 0 0 0 0 0 0 0 0 0 
0 0 0 0 0 785.928 0 0 2445.52 0 0 108.57 0 0 0 0 0 0 0 0 0 0 0 0 0 0 0 0 0 0.01 -172.353 0 1898.79 0 2416.84 0 0 0 2422.33 0 821.94 0 0 0 0 0 0 900.983 0 
0 1190.76 0 0 0 0 0 0 0 0 0 0 0 0 0 0 0 0 -263.756 0 0 0 -1132.92 0 0 -601.138 0 2215.72 0 73.3207 0.07 0 0 0 0 0 0 0 0 0 888.928 0 0 0 2493.44 0 0 0 0 
0 0 0 0 0 0 0 0 1156.27 -1314.2 0 0 0 0 0 0 2085.1 0 1802.96 0 0 0 0 0 0 0 0 0 -620.365 0 0 0 0 0 0 1383.63 0 0 0 0 0 0 0 0 0 0 0 0 0 
0 0 0 0 71.6422 0 0 0 940.962 0 0 0 0 0 0 0 0 0 0 2492.37 0 0 0 1925.34 7.70592 0 -2340.08 0 0 -2152.55 0 0 0.05 0 0 379.269 0 0 0 0 0 0 0 1101.34 0 0 0 0 0 
0 0 0 0 0 0 0 0 0 0 0 0 0 0 0 0 0 0 -219.962 0 0 0 0 -1664.25 0 0 0 0 1568.88 0 0 0 0 0.09 0 0 0 637.15 0 513.092 0 0 0 0 0 1229.97 2462.46 0 0 
0 0 0 0 0 0 0 -347.682 0 689.184 0 0 0 0 0 0 0 0 0 0 0 0 0 0 0 0 0 0 0 -743.66 0 0 0 0 0.01 0 0 2005.75 0 0 0 0 0 0 0 0 0 0 0 
-377.59 0 0 0 0 0 0 0 0 0 0 0 -723.365 0 0 0 -356.227 0 0 0 0 0 1231.5 160.451 -1418.58 0 0 0 0 0 0 2307.28 685.522 0 0 0.08 0 0 0 -1792.89 0 0 1548.13 0 -412.992 0 0 0 0 
0 2437.74 0 0 0 0 0 0 0 0 0 0 0 -770.058 0 0 0 0 0 0 0 0 0 0 553.987 -926.008 0 0 -1190.45 0 0 0 0 0 0 0 0.05 0 0 0 0 0 0 0 0 0 2398.07 0 0 
-559.938 0 930.128 0 0 0 0 0 0 0 -2070.6 0 0 0 0 0 0 0 0 2056.41 0 0 0 877.941 0 0 0 0 0 0 0 0 0 -581.454 1548.28 0 0 0.08 0 0 0 -392.697 0 0 0 969.344 0 0 0 
0 0 0 0 16.0985 0 0 0 0 0 542.085 0 0 0 0 0 0 0 -631.047 0 0 0 0 0 723.823 2059.62 0 0 -520.417 -32.4259 0 0 0 0 0 0 0 0 0.04 2016.59 0 0 -493.255 0 0 0 0 0 0 
0 0 0 0 0 0 0 0 0 0 0 1957.99 0 0 0 0 0 0 2232.2 2064.81 0 0 0 0 0 0 2474.97 0 0 0 0 0 0 1394.62 0 550.935 0 0 -2411.65 0.08 1491.21 0 0 0 0 0 0 0 -239.189 
0 0 0 0 0 0 0 0 0 0 0 0 0 1323.21 0 0 0 0 0 0 0 0 0 0 0 0 0 0 0 1023.06 -1316.64 0 0 0 0 0 0 0 0 -1134.91 0.05 0 1809.37 315.18 787.301 0 0 0 0 
2285.61 0 0 0 0 0 1234.55 0 0 0 0 0 0 0 0 0 0 -437.407 1951.12 0 0 0 0 0 0 1854.69 0 0 0 0 0 0 0 0 0 0 0 92.2422 0 0 0 0.03 0 0 0 0 0 0 0 
0 0 0 0 0 0 0 0 0 0 0 0 0 0 11.6733 0 0 0 0 0 0 0 0 0 0 0 -160.451 0 0 0 0 0 0 0 0 802.713 0 0 2141.87 0 2302.39 0 0.03 -800.882 0 0 0 0 0 
0 0 0 -1207.85 0 0 1690.8 0 0 0 0 0 0 0 0 0 0 0 0 0 -924.177 0 551.088 0 0 0 0 0 0 0 0 0 653.478 0 0 0 0 0 0 0 737.251 0 566.347 0.05 0 0 0 0 0 
0 2335.66 0 0 0 0 0 -902.509 -1748.33 534.455 0 0 0 -1910.99 0 0 0 0 0 2374.87 0 0 1311.61 0 0 0 0 0 0 0 -1931.9 0 0 0 0 2247.31 0 0 0 0 -436.796 0 0 0 0.05 0 0 0 1944.41 
0 1582.31 1824.47 0 0 2013.38 0 0 0 0 0 0 0 0 0 0 0 0 0 0 0 0 2498.63 0 0 0 0 0 0 0 0 0 0 491.882 0 0 0 -1042.44 0 0 0 0 0 0 0 0.05 0 0 0 
0 0 0 0 1627.48 0 0 0 2430.11 0 0 0 0 0 0 0 0 0 0 0 0 0 0 0 0 0 0 -430.54 0 0 0 0 0 974.837 0 0 1171.99 0 0 0 0 0 0 0 0 0 0.01 0 0 
0 0 0 0 0 0 0 0 -63.86 0 0 2323.91 0 0 0 0 0 1388.67 0 0 0 0 0 1237.75 0 0 0 0 0 -7.85852 0 0 0 0 0 0 0 0 0 0 0 0 0 0 0 0 0 0 0 
0 0 0 0 -30.4422 0 0 0 -2487.18 0 1593.14 0 0 0 0 0 0 0 0 0 0 0 0 0 0 0 0 0 0 0 0 0 0 0 0 0 0 0 0 1775.64 0 0 0 0 1057.39 0 0 0 0.01 
