*Vertices 54
*Matrix 
0.05 0 0 0 0 0 0 0 0 0 0 0 0 0 -1803.87 0 0 0 0 0 0 0 0 1958.3 0 -1790.9 0 0 0 0 0 0 0 0 1397.67 0 -822.703 0 0 180.898 0 0 0 0 0 2330.62 0 0 0 0 0 0 0 0 
0 0.04 0 0 0 0 0 0 0 0 0 1635.56 0 0 0 0 0 0 0 1914.66 0 466.094 2033.22 -1950.82 0 0 0 0 0 0 0 0 0 0 0 0 0 0 0 0 -1042.13 2029.4 762.123 0 0 0 0 0 0 0 0 0 -1362.27 0 
0 0 0 534.608 0 0 0 0 0 0 0 0 0 0 0 0 0 0 0 -1142.23 0 0 0 0 1486.02 0 0 0 0 0 823.008 0 1471.98 2100.05 0 0 -2053.21 0 0 0 0 0 1163.29 1868.57 0 2499.24 0 0 0 0 0 0 0 174.337 
0 0 1717.05 0.01 0 0 0 0 0 2308.65 0 0 0 0 0 0 0 0 0 0 0 0 0 0 0 0 0 0 0 0 0 0 0 0 0 0 0 0 0 0 0 0 0 0 -1604.13 0 0 0 0 0 0 0 1880.93 0 
0 0 0 0 0.05 0 0 0 0 0 0 0 0 0 0 0 0 0 1606.57 0 0 0 0 0 0 -2084.49 0 1448.18 0 0 0 0 0 0 0 2411.5 0 -728.553 0 0 0 1730.78 0 1780.53 0 0 0 0 0 -1755.5 0 0 0 0 
0 0 0 0 0 0.09 0 0 2133.63 0 0 0 0 0 0 0 0 0 0 0 0 0 0 0 0 0 0 0 0 1550.57 0 0 0 0 0 1574.07 0 0 737.404 0 0 0 0 0 0 0 0 0 -186.544 1209.52 0 0 1740.09 0 
0 0 0 0 0 0 0.03 0 0 0 0 0 0 0 0 0 0 0 0 0 0 0 0 0 1134.91 0 -701.544 585.879 0 0 0 0 0 0 0 0 0 0 0 0 0 0 0 -1417.81 0 0 2482.91 0 0 0 0 0 1782.05 0 
0 0 0 0 0 0 0 0.07 0 0 0 0 0 0 -679.876 0 0 0 0 0 0 0 0 0 0 0 0 0 0 0 0 0 0 0 0 0 0 0 0 0 0 1567.35 0 0 1218.83 0 0 0 2002.09 -2085.25 0 0 0 0 
0 0 0 0 0 552.766 0 0 0.08 0 0 0 0 0 0 0 0 0 1396.6 0 0 0 0 0 0 0 0 0 0 -388.424 0 0 0 0 0 0 0 0 0 850.017 0 0 0 0 0 0 0 -734.962 0 0 0 0 0 0 
0 0 0 -187.155 0 0 0 0 0 0.09 0 0 0 -1465.27 -1702.4 0 0 1279.11 0 0 0 0 0 0 0 0 0 0 1143.15 -25.7118 0 0 0 0 0 0 0 0 0 0 0 2047.72 0 0 0 0 0 0 0 -611.362 0 0 0 0 
0 0 0 0 0 0 0 0 0 0 0.07 0 0 1154.9 0 0 0 0 0 0 0 2407.22 -419.553 0 0 0 0 2147.97 0 -1339.84 0 0 0 0 0 0 0 0 0 0 0 1145.44 0 0 0 0 0 1858.65 0 0 -1760.99 0 0 0 
0 1609.47 0 0 0 0 0 0 0 0 0 0.06 0 0 0 0 1979.2 -339.442 0 0 0 0 0 -934.095 0 0 0 0 0 0 0 0 0 0 0 0 0 0 0 0 97.5829 0 0 0 588.321 0 1248.28 0 1020.46 0 0 0 0 -399.716 
0 0 0 0 0 0 0 0 0 0 0 0 0.09 0 0 0 0 1457.34 0 0 0 0 0 0 0 0 2483.21 -1010.39 0 0 0 0 0 1153.37 0 240.41 0 0 0 0 0 -1961.35 0 0 0 0 0 0 1687.75 0 0 0 1022.6 0 
0 0 0 0 0 0 0 0 0 -2291.41 1470.31 0 0 0.05 0 727.332 0 0 0 0 0 0 1983.78 0 0 0 0 0 0 0 0 0 0 -428.404 1400.72 0 0 0 0 0 0 1178.55 0 0 0 -487.609 0 0 0 1848.28 0 0 0 -2300.26 
2033.68 0 0 0 0 0 0 611.667 0 2338.4 0 0 0 0 0.01 0 0 0 0 -1724.07 0 0 0 0 0 0 2372.28 0 0 0 0 0 1290.4 0 0 -1624.73 0 0 0 0 1041.22 0 869.091 0 0 0 2494.66 0 0 0 0 0 0 0 
0 0 0 0 0 0 0 0 0 0 0 0 0 2386.47 0 0.01 -433.592 1328.24 -255.364 0 0 -565.127 0 0 0 0 2247.15 0 0 0 0 0 0 0 486.694 -969.192 0 0 0 0 0 0 0 0 0 0 0 0 0 0 0 0 -2458.19 0 
0 0 0 0 0 0 0 0 0 0 0 687.201 0 0 0 1178.24 0.04 0 0 0 0 0 0 0 0 0 0 0 0 0 0 0 0 1360.9 -1462.52 0 0 0 0 0 0 0 0 0 0 0 0 0 0 1162.22 0 2451.17 0 0 
0 0 0 0 0 0 0 0 0 -1056.02 0 2069.69 -1158.25 0 0 1040.91 0 0.02 0 0 0 133.29 0 0 0 1968.98 0 0 0 0 0 0 0 0 -557.649 0 0 0 0 0 0 0 0 0 0 0 0 -1340.14 0 0 0 0 0 129.17 
0 0 0 0 990.249 0 0 0 2047.26 0 0 0 0 0 0 549.257 0 0 0.02 0 0 1597.57 0 0 0 0 0 1328.24 0 0 0 0 0 0 0 0 0 0 0 0 0 0 0 0 0 0 0 0 0 0 0 0 0 0 
0 2165.67 -1341.36 0 0 0 0 0 0 0 0 0 0 0 2325.13 0 0 0 0 0.06 0 0 0 0 0 0 0 0 0 0 0 0 0 0 0 0 0 0 0 0 0 0 0 0 0 0 0 0 0 29.0689 1167.71 0 0 0 
0 0 0 0 0 0 0 0 0 0 0 0 0 0 0 0 0 0 0 0 0 0 0 0 0 0 0 0 -878.399 0 0 301.294 1290.4 -76.0674 0 793.405 0 1768.62 0 0 0 0 0 0 0 1147.88 0 0 0 0 0 0 0 0 
0 1238.98 0 0 0 0 0 0 0 0 961.867 0 0 0 0 -415.738 0 -1990.49 1869.49 0 0 0.09 0 0 0 0 0 0 0 0 0 0 0 0 -2180.78 0 0 0 0 0 0 352.26 0 1652.2 0 0 0 0 0 0 0 47.2274 0 0 
0 423.673 0 0 0 0 0 0 0 0 -1064.56 0 0 1879.41 0 0 0 0 0 0 0 0 0 -209.281 0 0 0 0 0 0 0 0 0 0 2142.32 0 -804.392 0 0 0 0 0 0 0 0 0 0 0 0 0 0 0 0 0 
-660.649 -1236.69 0 0 0 0 0 0 0 0 0 -250.481 0 0 0 0 0 0 0 0 0 0 1530.73 0.07 0 0 0 0 0 0 0 0 0 1261.56 0 149.007 0 0 0 0 0 0 0 0 0 0 0 0 0 0 0 0 440.001 0 
0 0 -2219.99 0 0 0 1727.27 0 0 0 0 0 0 0 0 0 0 0 0 0 0 0 0 0 0.05 0 0 0 0 -592.593 0 0 0 0 0 0 0 0 0 0 2238 0 0 1317.41 1286.13 0 0 0 0 0 0 0 0 0 
-2321.62 0 0 0 9.68963 0 0 0 0 0 0 0 0 0 0 0 0 1840.04 0 0 0 0 0 0 0 0.07 348.598 0 0 0 0 0 0 0 0 0 0 0 0 0 0 0 1797.62 0 0 0 0 0 0 0 0 2303.46 0 0 
0 0 0 0 0 0 1269.95 0 0 0 0 0 -1558.96 0 1154.44 1782.97 0 0 0 0 0 0 0 0 0 2367.24 0.03 0 0 -274.59 0 0 0 0 0 0 0 1070.82 0 0 -448.088 0 0 0 0 549.562 -275.658 0 0 0 0 0 0 0 
0 0 0 0 1106.22 0 1117.05 0 0 0 -736.183 0 -1171.22 0 0 0 0 0 909.375 0 0 0 0 0 0 0 0 0.08 0 0 0 0 0 911.054 0 0 0 0 0 0 0 0 0 0 0 1797.62 0 0 0 -652.409 0 0 -555.513 0 
0 0 0 0 0 0 0 0 0 1257.9 0 0 0 0 0 0 0 0 0 0 1730.17 0 0 0 0 0 0 0 0.09 0 0 0 1878.8 0 0 0 0 0 0 -2189.93 0 0 0 0 0 0 0 0 0 2305.29 0 0 0 0 
0 0 0 0 0 1853.62 0 0 1077.38 -544.374 -1675.85 0 0 0 0 0 0 0 0 0 0 0 0 0 306.94 0 1722.54 0 0 0.02 0 0 1377.99 0 0 1013.14 0 0 0 0 0 793.558 0 0 0 0 0 0 0 0 0 0 0 0 
0 0 149.159 0 0 0 0 0 0 0 0 0 0 0 0 0 0 0 0 0 0 0 0 0 0 0 0 0 0 0 0.04 0 0 0 1980.27 0 0 0 0 -1760.54 148.396 0 2339.17 0 0 0 0 2405.39 0 0 0 0 -1980.57 -747.627 
0 0 0 0 0 0 0 0 0 0 0 0 0 0 0 0 0 0 0 0 1626.71 0 0 0 0 0 0 0 0 0 0 0.01 0 0 0 0 0 0 0 0 0 0 0 0 0 0 0 0 1313.75 0 0 0 0 0 
0 0 2184.74 0 0 0 0 0 0 0 0 0 0 0 758.309 0 0 0 0 0 -967.055 0 0 0 0 0 0 0 1846.29 -1125.45 0 0 0.04 0 0 0 0 0 0 0 0 0 -2165.21 0 0 111.927 0 0 0 1526 0 0 0 0 
0 0 1158.86 0 0 0 0 0 0 0 0 0 835.215 1128.35 0 0 1898.94 0 0 0 1193.35 0 0 -180.441 0 0 0 674.993 0 0 0 0 0 0.08 0 0 0 0 0 0 0 0 1901.68 0 0 0 0 0 0 0 0 -2340.69 0 0 
-197.531 0 0 0 0 0 0 0 0 0 0 0 0 1069.6 0 -1174.58 -929.823 1848.43 0 0 0 -343.715 -616.703 0 0 0 0 0 0 0 -867.718 0 0 0 0.04 0 0 0 0 0 0 0 1049.91 0 0 0 0 0 0 0 0 0 0 0 
0 0 0 0 -516.144 2099.75 0 0 0 0 0 0 -2016.13 0 2257.07 -848.796 0 0 0 0 271.691 0 0 1728.34 0 0 0 0 0 710.7 0 0 0 0 0 0.08 0 -944.166 0 0 0 0 0 0 0 0 0 2369.69 0 0 0 0 0 0 
252.007 0 -115.589 0 0 0 0 0 0 0 0 0 0 0 0 0 0 0 0 0 0 0 558.565 0 0 0 0 0 0 0 0 0 0 0 0 0 0 0 0 0 0 0 0 0 0 486.236 0 0 0 0 0 0 0 0 
0 0 0 0 -1243.71 0 0 0 0 0 0 0 0 0 0 0 0 0 0 0 1187.09 0 0 0 0 0 -262.688 0 0 0 0 0 0 0 0 -923.719 0 0.05 0 0 0 2382.5 0 0 0 0 0 0 0 -923.719 739.998 0 0 0 
0 0 0 0 0 776.62 0 0 0 0 0 0 0 0 0 0 0 0 0 0 0 0 0 0 0 0 0 0 0 0 0 0 0 0 0 0 0 0 0.06 0 0 0 0 0 0 0 0 0 0 36.2407 0 0 0 0 
-1873.3 0 0 0 0 0 0 0 2094.26 0 0 0 0 0 0 0 0 0 0 0 0 0 0 0 0 0 0 0 452.361 0 274.438 0 0 0 0 0 0 0 0 0.04 2113.94 0 0 0 -1001.69 0 0 -1546.91 0 0 0 0 0 0 
0 1867.81 0 0 0 0 0 0 0 0 0 1479 0 0 745.491 0 0 0 0 0 0 0 0 0 701.544 0 -349.513 0 0 0 -1978.9 0 0 0 0 0 0 0 0 1605.2 0.09 0 0 0 0 0 0 0 0 0 0 0 0 0 
0 2269.43 0 0 1180.53 0 0 -1754.74 0 -1730.78 1771.07 0 -382.778 -1157.64 0 0 0 0 0 0 0 1986.07 0 0 0 0 0 0 0 -2144.15 0 0 0 0 0 0 0 1883.37 0 0 0 0.03 1120.72 0 1511.81 0 0 0 0 0 0 0 0 0 
0 -685.064 1062.58 0 0 0 0 0 0 0 0 0 0 0 1583.38 0 0 0 0 0 0 0 0 0 0 1704.84 0 0 0 0 -1571.17 0 999.1 -1729.1 2387.23 0 0 0 0 0 0 1041.06 0.09 0 -1206.78 0 0 0 1848.43 -916.7 0 0 0 0 
0 0 -140.156 0 1559.42 0 -1764.66 0 0 0 0 0 0 0 0 0 0 0 0 0 0 367.824 0 0 1021.84 0 0 0 0 0 0 0 0 0 0 0 0 0 0 0 0 0 0 0 0 0 0 0 -1422.54 2135 0 0 0 0 
0 0 0 256.584 0 0 0 -1788.77 0 0 0 1887.95 0 0 0 0 0 0 0 0 0 0 0 0 1269.49 0 0 0 0 0 0 0 0 0 0 0 0 0 0 2089.83 0 816.446 1573.92 0 0.04 -425.352 0 0 2243.34 0 1611.91 0 0 -2409.97 
105.67 0 -2114.09 0 0 0 0 0 0 0 0 0 0 277.184 0 0 0 0 0 0 -38.377 0 0 0 0 0 1607.64 1994.31 0 0 0 0 1025.8 0 0 0 2328.79 0 0 0 0 0 0 0 1324.12 0.05 0 0 0 0 0 0 0 0 
0 0 0 0 0 0 2370.45 0 0 0 0 -423.063 0 0 1962.26 0 0 0 0 0 0 0 0 0 0 0 -127.338 0 0 0 0 0 0 0 0 0 0 0 0 0 0 0 0 0 0 0 0.01 0 0 -1507.23 0 0 0 0 
0 0 0 0 0 0 0 0 2279.96 0 1321.53 0 0 0 0 0 0 652.715 0 0 0 0 0 0 0 0 0 0 0 0 2195.58 0 0 0 0 349.513 0 0 0 -688.421 0 0 0 0 0 0 0 0.02 0 0 0 0 2098.38 0 
0 0 0 0 0 516.449 0 2410.89 0 0 0 1140.4 733.436 0 0 0 0 0 0 0 0 0 0 0 0 0 0 0 0 0 0 2288.2 0 0 0 0 0 0 0 0 0 0 -976.058 1124.07 -2295.53 0 0 0 0.08 0 -1403.93 0 0 -81.5607 
0 0 0 0 1720.71 -241.173 0 1565.07 0 -2338.86 0 0 0 2439.27 0 0 -1334.5 0 0 1835.92 0 0 0 0 0 0 0 1999.8 2424.01 0 0 0 1630.99 0 0 0 0 2128.28 2310.48 0 0 0 -1305.35 565.889 0 0 924.94 0 0 0.07 0 0 1891 0 
0 0 0 0 0 0 0 0 0 0 1843.85 0 0 0 0 0 0 0 0 2092.88 0 0 0 0 0 0 0 0 0 0 0 0 0 0 0 0 0 562.38 0 0 0 0 0 0 2160.48 0 0 0 354.701 0 0.02 0 -2326.65 0 
0 0 0 0 0 0 0 0 0 0 0 0 0 0 0 0 664.922 0 0 0 0 1544.77 0 0 0 2326.5 0 0 0 0 0 0 0 522.858 0 0 0 0 0 0 0 0 0 0 0 0 0 0 0 0 0 0.02 0 0 
0 -1351.89 0 1898.79 0 1937.85 1115.53 0 0 0 0 0 -193.564 0 0 1493.8 0 0 0 0 0 0 0 -1713.23 0 0 0 1964.09 0 0 -877.026 0 0 0 0 0 0 0 0 0 0 0 0 0 0 0 0 576.266 0 1591.31 -527.741 0 0.08 -1895.43 
0 0 741.218 0 0 0 0 0 0 0 0 2113.79 0 -488.525 0 0 0 422.605 0 0 0 0 0 0 0 0 0 0 0 0 2168.42 0 0 0 0 0 0 0 0 0 0 0 0 0 -606.632 0 0 0 509.583 0 0 0 -2273.86 0 
