*Vertices 54
*Matrix 
0.06 0 0 2342.07 0 1569.03 0 320.978 0 0 0 0 756.325 0 -139.241 0 0 -2047.41 0 352.26 0 0 -1587.34 0 0 182.424 0 0 0 -2339.17 0 0 -1264.15 0 0 0 0 0 0 0 0 0 2342.07 0 0 0 1677.83 1334.8 0 0 0 0 0 0 
0 0.04 0 2309.26 0 1264.61 0 0 0 0 0 0 0 0 0 0 0 0 0 39.7504 0 0 0 0 0 1734.44 0 0 0 0 0 0 0 -1045.64 0 0 0 -263.909 0 0 0 0 0 0 0 0 0 0 -113.147 0 0 0 0 0 
0 0 0.09 0 0 0 0 0 0 612.735 1912.98 0 0 -2089.83 1626.26 0 -102.161 0 0 0 0 0 1978.59 0 0 0 -474.181 0 -1976.61 0 0 0 0 0 0 2241.05 0 0 0 0 0 2303 0 0 0 0 0 0 0 0 0 0 1808.76 0 
2423.7 -253.685 0 0.03 0 989.944 1625.49 0 0 0 -554.75 -972.701 0 -91.7844 0 0 0 0 -2129.05 733.741 0 0 0 0 0 0 1791.06 0 0 0 0 0 60.9607 559.481 0 -1407.44 0 -538.118 0 0 0 -2439.88 0 0 0 0 0 0 0 0 0 0 0 0 
0 0 0 0 0 0 953.932 0 0 0 0 -1683.32 995.132 0 0 403.684 724.891 1329.92 0 0 -1112.17 1197.32 0 0 0 0 0 1301.08 0 -1029.16 638.981 -193.869 0 0 0 0 0 0 0 513.092 2494.81 0 0 0 0 0 0 0 0 0 0 0 0 522.553 
754.799 739.845 0 -1531.95 0 0 368.74 0 0 0 0 0 -1570.1 0 0 0 0 -1362.73 -1627.78 0 1704.84 5.87481 0 0 2170.4 0 0 0 0 0 0 0 0 0 0 0 0 -1336.33 753.883 0 0 1567.96 975.295 1803.26 0 0 0 0 2327.27 0 0 0 0 2117.91 
0 0 0 -678.808 546.815 -1384.24 0.08 0 0 0 -310.907 1626.41 0 0 0 1419.49 -51.3474 0 223.624 1746.5 0 0 1817.15 0 804.392 0 0 0 0 -1164.66 0 0 0 -410.092 2239.98 0 0 0 0 -584.353 0 0 0 0 0 728.401 0 0 0 0 0 0 0 0 
23.423 0 0 0 0 0 0 0.04 0 0 313.501 0 0 0 2149.8 0 0 2122.03 -150.533 -437.407 0 0 0 1644.26 0 -779.061 0 -1813.03 0 0 1886.27 -1999.95 0 0 0 0 0 2356.72 478.607 0 0 0 0 0 0 -954.237 0 0 0 0 0 0 0 0 
0 0 0 0 0 0 0 0 0 1030.38 -1357.54 0 0 0 1751.99 66.4541 1683.48 1696.91 0 0 0 0 1096.45 0 0 0 328.15 -1892.22 0 0 0 0 0 0 0 1126.82 0 349.666 0 0 535.981 0 0 109.943 0 0 -597.476 0 0 0 0 0 0 0 
0 0 182.73 0 0 0 0 0 816.599 0.06 0 0 0 0 0 0 0 2256.92 0 0 0 0 954.237 0 -1337.24 -1091.88 0 982.467 1296.96 0 0 0 0 0 0 955.916 -2180.01 0 -1031.75 0 0 0 0 0 0 0 0 0 0 0 912.58 0 0 0 
0 0 -1293.76 1208.15 0 0 -439.695 2226.55 2252.95 0 0.07 767.464 0 1925.64 0 0 -1614.51 1511.96 0 0 0 0 -2018.27 0 0 552.309 0 947.829 0 0 -924.177 0 -1494.26 -418.638 0 -913.8 0 0 0 0 0 0 0 0 0 0 -2459.72 0 0 0 0 0 0 0 
0 0 0 -759.224 489.746 0 1917.71 0 0 0 1581.85 0.03 0 1634.5 -2315.06 0 0 -2377.47 0 0 0 -606.479 0 0 0 0 0 0 0 0 1227.84 0 167.318 0 0 -1445.74 0 0 674.993 -235.984 0 0 0 0 168.233 0 425.657 0 0 0 0 129.627 0 0 
-720.618 0 0 0 -684.606 2140.34 0 0 0 0 0 0 0.07 0 0 0 0 0 0 0 531.709 0 859.478 0 0 0 1298.49 0 0 1850.72 0 0 0 1664.4 0 0 0 0 0 0 -1077.68 0 0 0 0 0 0 0 0 0 0 2264.7 0 0 
0 0 544.832 -1571.17 0 0 0 0 0 0 2253.72 -1762.83 0 0.06 0 0 1826.91 -2164.3 0 1429.72 530.03 0 0 1742.84 1708.96 0 0 0 0 0 0 0 303.125 2002.7 2417.91 0 0 0 0 0 0 0 0 0 0 0 0 2302.7 0 0 0 0 209.281 0 
-1263.85 0 1657.54 0 0 0 0 2247.61 304.804 0 0 616.703 0 0 0.07 1293.3 0 0 0 0 0 0 -1032.06 0 0 0 0 0 2045.12 1502.04 0 0 0 0 2180.17 0 0 0 0 1866.28 2426.76 0 0 0 1394.92 0 0 0 0 0 0 0 0 0 
0 0 0 0 -79.4244 0 1296.04 0 -1257.13 0 0 0 0 0 -151.448 0.02 -1897.56 0 0 0 1773.05 0 0 0 799.509 0 0 0 0 1076.62 0 0 0 0 0 2348.93 2470.85 0 0 0 0 0 0 0 0 0 0 -1484.19 0 0 0 0 0 0 
0 0 2272.18 0 1120.11 0 1611.91 0 888.623 0 1622.29 0 0 745.491 0 1805.7 0.07 0 0 -172.658 -1197.93 0 0 0 289.85 0 0 0 0 0 -1489.38 1424.53 -215.537 0 0 30.137 -1781.44 0 0 0 0 0 1346.55 -2297.97 0 792.337 0 0 0 0 0 0 0 0 
457.244 0 0 0 1839.58 -2274.32 0 1859.11 -222.556 222.251 60.5029 -943.251 0 -989.639 0 0 0 0.09 0 0 0 0 0 0 0 0 0 0 0 0 0 -604.953 2111.96 -1723 1640.45 0 2168.11 0 0 0 -2128.28 47.2274 -1432.46 906.476 0 0 0 0 0 0 0 0 0 0 
0 0 0 -77.2881 0 -459.99 1626.56 -705.054 0 0 0 0 0 0 0 0 0 0 0.08 0 0 0 0 -1611.61 0 0 0 0 1935.87 0 0 0 0 168.538 517.365 0 0 0 0 0 877.483 0 0 0 0 0 0 0 0 -1812.72 224.235 0 0 0 
-618.992 513.703 0 2112.72 0 0 -1891.31 2278.13 0 0 0 0 0 -785.928 0 0 2180.47 0 0 0 1584.6 0 0 0 0 0 0 0 0 1977.98 0 1127.12 0 564.211 0 1215.78 0 0 0 -1266.9 0 1415.52 1588.26 0 0 0 -268.181 0 0 0 0 0 0 2452.7 
0 0 0 0 -1244.47 -2145.99 0 0 0 0 0 0 1285.06 978.042 0 -538.423 1046.71 0 0 1931.29 0.02 0 2303.16 0 0 2039.32 0 0 1277.73 1907.33 0 1056.78 -1836.83 0 0 2024.06 0 0 0 0 0 501.495 1007.19 678.961 0 0 0 0 0 0 0 0 -181.814 2068.77 
0 0 0 0 1469.85 1484.04 0 0 0 0 0 606.479 0 0 0 0 0 0 0 0 0 0 0 0 0 2161.7 0 0 0 0 0 0 0 0 0 0 0 0 0 0 1045.79 0 0 0 0 0 0 0 0 0 0 0 0 0 
1627.78 0 -1286.74 0 0 0 1724.68 0 1017.41 2365.26 1977.83 0 -816.294 0 -794.778 0 0 0 0 0 1717.81 0 0.08 0 0 0 1811.2 0 0 0 100.787 0 0 1818.67 0 0 0 1759.32 0 0 0 0 0 0 0 0 0 -678.35 0 0 0 0 0 0 
0 0 0 0 0 0 0 125.965 0 0 0 0 0 1610.08 0 0 0 0 1704.84 0 0 0 0 0.05 -1785.87 1186.18 1099.81 0 0 -2427.82 0 0 0 0 -2145.38 0 0 0 0 0 0 0 0 0 443.358 0 0 0 0 0 0 0 0 -809.275 
0 0 0 0 0 -123.829 530.793 0 0 -870.922 0 0 0 2245.32 0 2219.69 -350.276 0 0 0 0 0 0 974.227 0.05 0 0 0 -761.208 0 0 1847.06 0 0 0 0 0 0 0 0 0 0 0 0 0 0 0 0 0 0 -1064.56 0 0 0 
1244.77 245.445 0 0 0 0 0 2491.76 0 1224.94 1135.52 0 0 0 0 0 0 0 0 0 61.1133 2176.35 0 531.861 0 0 0 0 0 0 0 2397.46 0 563.295 0 -1041.67 0 -1531.34 0 -586.795 0 0 0 0 2384.64 383.236 0 1041.52 0 0 0 0 0 0 
0 0 -781.35 597.324 0 0 0 0 86.2911 0 0 0 -1132.92 0 0 0 0 0 0 0 0 0 1137.2 -1448.64 0 0 0.04 0 0 0 1724.98 0 0 0 0 0 271.844 663.854 2373.5 0 2349.24 -1866.59 -1836.07 0 0 0 1611.15 0 0 -834.91 0 0 0 0 
0 0 0 0 -390.103 0 0 1070.82 1109.42 -311.975 1702.25 0 0 0 0 0 0 0 0 0 0 0 0 0 0 0 0 0.03 0 0 0 0 0 0 1425.75 0 0 0 1245.99 0 0 0 358.211 0 -1592.99 2132.25 0 0 0 0 0 1402.25 0 0 
0 0 1147.72 0 0 0 0 0 0 -968.276 0 0 0 0 372.86 0 0 0 743.965 0 839.335 0 0 0 653.325 0 0 0 0.08 1231.96 0 0 0 0 0 0 0 0 0 0 0 0 1993.55 0 -2206.41 0 0 0 -907.544 0 0 0 0 252.77 
1730.48 0 0 0 -268.639 0 1323.36 0 0 0 0 0 -922.651 0 922.193 -311.365 0 0 0 528.962 407.193 0 0 -1406.98 0 0 0 0 1794.72 0.03 0 0 0 0 393.46 0 0 -1738.11 0 0 0 430.54 0 0 0 0 0 0 0 1302.61 0 0 0 0 
0 0 0 0 -2074.11 0 0 795.846 0 0 1348.38 1533.33 0 0 0 0 865.123 0 0 0 0 0 1262.02 0 0 0 1722.85 0 0 0 0.05 0 0 0 0 0 0 0 -741.829 -529.725 0 0 0 0 0 0 0 0 110.553 0 0 0 0 0 
0 0 0 0 10.9104 0 0 1480.68 0 0 0 0 0 0 0 0 -857.036 2394.86 0 399.716 2398.22 0 0 0 2180.17 2238 0 0 0 0 0 0 0 1728.64 0 0 0 263.909 1965.93 0 -1376.16 0 2312.01 0 0 0 0 0 0 0 0 0 985.214 0 
-921.125 0 0 1088.21 0 0 0 0 0 0 -1835 2292.78 0 1042.28 0 0 2362.67 2287.44 0 0 -1090.2 0 0 0 0 0 0 0 0 0 0 0 0.05 0 0 0 0 0 0 0 0 0 0 -1455.35 -1096.91 414.365 0 0 0 0 0 0 0 2441.4 
0 1157.34 0 -583.743 0 0 -1467.41 0 0 0 1868.88 0 -1151.69 29.3741 0 0 0 2073.5 1061.36 -2470.24 0 0 240.562 0 0 1326.56 0 0 0 0 0 776.315 0 0 0 0 0 0 0 0 0 0 0 0 1750.77 0 0 0 0 0 0 0 0 0 
0 0 0 0 0 0 -1425.14 0 0 0 0 0 0 2184.29 2475.13 0 0 -1901.38 285.577 0 0 0 0 2132.25 0 0 0 1172.14 0 2444.61 0 0 0 0 0.07 0 -750.374 0 1283.84 0 -1646.7 1239.74 0 1586.58 0 0 0 243.767 0 0 0 0 -576.418 0 
0 0 968.429 -2158.8 0 0 0 0 1600.92 -397.885 2197.71 2184.29 0 0 0 2498.47 -2403.41 0 0 1090.96 -2078.08 0 0 0 0 2467.5 0 0 0 0 0 0 0 0 0 0.01 -187.765 0 0 0 0 0 0 -2078.39 2220.15 0 0 0 0 0 0 0 0 0 
0 0 0 0 0 0 0 0 0 -948.439 0 0 0 0 0 -554.75 2012.01 1814.86 0 0 0 0 0 0 0 0 774.026 0 0 0 0 0 0 0 2158.35 959.578 0.09 2115.16 0 0 0 0 0 0 1266.59 0 0 0 0 0 0 0 0 0 
0 2372.74 0 -1935.71 0 -831.401 0 1006.58 494.171 0 0 0 0 0 0 0 0 0 0 0 0 0 1472.9 0 0 2294.46 1072.8 0 0 899.762 0 -594.424 0 0 0 0 2017.96 0.02 -675.146 0 54.857 0 -225.761 2145.83 0 0 0 0 336.238 0 0 0 0 0 
0 0 0 0 0 535.371 0 1868.27 0 356.685 0 2136.83 0 0 0 0 0 0 0 0 0 0 0 0 0 0 -129.78 2203.82 0 0 459.075 371.029 0 0 431.761 0 0 -1362.58 0.01 0 1139.03 -1253.32 0 0 0 0 0 0 0 0 0 0 0 0 
0 0 0 0 -662.481 0 -1405 0 0 0 0 1725.29 0 0 1634.95 0 0 0 0 -917.463 0 0 0 0 0 723.212 0 0 0 0 1553.62 0 0 0 0 0 0 0 0 0.08 0 0 0 0 0 0 0 0 0 -1752.6 0 0 0 0 
0 0 0 0 -2199.24 0 0 0 2378.99 0 0 0 -2157.28 0 850.169 0 0 683.386 884.96 0 0 -1476.41 0 0 0 0 548.646 0 0 0 0 -207.144 0 0 853.221 0 0 -251.091 -203.482 0 0.02 2106.31 0 0 0 0 0 0 0 0 0 0 0 0 
0 0 2261.96 1868.88 0 874.279 0 0 0 0 0 0 0 0 0 0 0 1207.85 0 -908.307 -1784.19 0 0 0 0 0 918.378 0 0 -551.393 0 0 0 0 -1763.13 0 0 0 1086.84 0 -639.439 0.08 0 0 -337.001 0 -1748.94 0 0 0 0 0 0 0 
-2045.27 0 0 0 0 -1398.28 0 0 0 0 0 0 0 0 0 0 207.755 2355.49 0 -2319.18 128.101 0 0 0 0 0 1587.5 2289.57 -2002.09 0 0 1880.93 0 0 0 0 0 657.903 0 0 0 0 0.06 0 1620.91 0 0 2061.3 0 0 0 0 1465.73 0 
0 0 0 0 0 518.128 0 0 1208 0 0 0 0 0 0 0 1726.51 578.249 0 0 254.601 0 0 0 0 0 0 0 0 0 0 0 -1597.57 0 -449.156 -2287.59 0 -221.641 0 0 0 0 0 0.06 0 0 0 0 0 0 0 0 0 0 
0 0 0 0 0 0 0 0 0 0 0 -1717.81 0 0 215.69 0 0 0 0 0 0 0 0 -783.944 0 871.38 0 1744.06 -959.883 0 0 0 1928.69 1422.39 0 -2150.72 2183.52 0 0 0 0 -2220.6 -159.841 0 0.02 0 0 950.575 0 0 -838.267 2487.33 0 0 
0 0 0 0 0 0 1689.28 1949.45 0 0 0 0 0 0 0 0 -1747.41 0 0 0 0 0 0 0 0 -1276.06 0 783.944 0 0 0 0 -792.032 0 0 0 0 0 0 0 0 0 0 0 0 0.03 0 1804.18 0 0 21.7444 0 0 0 
-1269.19 0 0 0 0 0 0 0 2350.61 0 1889.93 1123.77 0 0 0 0 0 0 0 -322.657 0 0 0 0 0 0 1003.83 0 0 0 0 0 0 0 0 0 0 0 0 0 0 1507.54 0 0 0 0 0.06 0 0 0 0 0 0 0 
-1109.12 0 0 0 0 0 0 0 0 0 0 0 0 212.79 0 -1200.83 0 0 0 0 0 0 2332 0 0 948.286 0 0 0 0 0 0 0 0 -448.698 0 0 0 0 0 0 0 -2421.41 0 1687.75 881.451 0 0.06 0 0 0 0 2454.53 0 
0 1573.46 0 0 0 574.435 0 0 0 0 0 0 0 0 0 0 0 0 0 0 0 0 0 0 0 0 0 0 1956.31 0 -2236.32 0 0 0 0 0 0 -230.186 0 0 0 0 0 0 0 0 0 0 0.09 0 0 0 0 0 
0 0 0 0 0 0 0 0 0 0 0 0 0 0 0 0 0 0 1824.17 0 0 0 0 0 0 0 1478.09 0 0 -592.898 0 0 0 0 0 0 0 0 0 903.424 0 0 0 0 0 0 0 0 0 0.06 0 -667.669 0 -1691.26 
0 0 0 0 0 0 0 0 0 383.999 0 0 0 0 0 0 0 0 1609.78 0 0 0 0 0 -859.02 0 0 0 0 0 0 0 0 0 0 0 0 0 0 0 0 0 0 0 2138.2 -1264.92 0 0 0 0 0.01 782.723 0 0 
0 0 0 0 0 0 0 0 0 0 0 1873.15 -2293.39 0 0 0 0 0 0 0 0 0 0 0 0 0 0 2050.92 0 0 0 0 0 0 0 0 0 0 0 0 0 0 0 0 1041.06 0 0 0 0 -1383.63 2058.55 0.01 0 0 
0 0 -1586.58 0 0 0 0 0 0 0 0 0 0 2487.64 0 0 0 0 0 0 -303.125 0 0 0 0 0 0 0 0 0 0 -1904.13 0 0 2341.15 0 0 0 0 0 0 0 -2134.24 0 0 0 0 1883.07 0 0 0 0 0.07 0 
0 0 0 0 435.575 2245.63 0 0 0 0 0 0 0 0 0 0 0 0 0 -283.441 -712.226 0 0 2301.02 0 0 0 0 1454.74 0 0 0 179.83 0 0 0 0 0 0 0 0 0 0 0 0 0 0 0 0 431.761 0 0 0 0.03 
