*Vertices 48
*Matrix 
0.05 87.3592 0 0 0 0 0 0 0 627.384 0 0 0 0 -1790.14 0 0 0 804.086 0 -307.092 0 -84.3074 0 0 2248.07 576.724 0 0 773.263 1356.01 0 0 0 0 0 0 0 0 0 504.395 439.238 0 0 0 0 0 0 
-1621.83 0.05 1630.22 0 0 0 0 0 0 0 0 0 0 0 0 0 0 0 0 0 0 0 0 0 -944.014 0 -1015.58 0 0 1238.52 1731.54 0 0 0 0 0 0 0 16.2511 0 0 1240.2 2167.2 0 0 0 -55.62 0 
0 -1331.14 0.09 0 0 0 0 0 0 0 1456.27 0 0 0 0 0 0 0 0 0 1420.56 0 0 0 1433.68 0 -57.9089 0 0 0 0 0 0 0 0 0 0 0 0 0 0 0 0 0 0 0 0 0 
0 0 0 0.08 0 0 1469.54 2155.45 -2298.43 0 2400.05 0 0 2359 0 -1481.29 0 0 0 -30.4422 0 0 0 0 1590.85 0 0 0 0 0 0 0 0 0 0 0 0 0 0 0 0 1816.84 0 1690.34 1868.88 0 0 0 
0 0 0 0 0.05 31.9681 0 0 70.1163 2005.6 2235.4 0 1093.71 -1842.33 2380.67 0 0 0 2064.5 -453.124 0 0 0 -503.327 0 0 1466.34 0 0 0 0 0 0 0 544.221 0 0 0 0 0 0 0 0 0 2365.26 0 0 0 
0 0 0 0 2254.48 0.06 0 0 0 0 657.292 1997.97 724.433 0 1652.81 0 0 0 0 -2375.94 1457.49 0 1916.94 -930.28 0 0 -1602.91 -1312.98 0 0 0 -1781.59 -1463.29 0 0 0 0 2459.41 -1189.08 0 0 0 0 0 0 0 0 -1747.72 
0 0 0 1702.25 0 0 0.07 0 1128.19 0 0 0 -1967.45 0 0 0 0 1432.62 0 0 1983.02 0 0 0 -1313.14 0 0 0 0 0 0 0 0 123.066 0 0 0 0 0 0 0 0 1412.32 -1001.54 0 0 0 0 
0 0 0 1329.77 0 0 0 0.07 0 463.347 0 0 586.184 0 1220.82 2068.01 0 0 0 0 -327.998 0 0 0 0 0 0 0 0 1333.89 0 2087.54 18.2348 0 -276.116 0 0 0 0 0 0 0 0 0 0 0 0 0 
0 0 0 957.442 2446.29 0 600.986 0 0 209.128 0 0 -674.078 0 0 0 1744.97 1572.24 900.525 -2004.07 0 0 0 0 0 0 0 0 1135.82 0 0 0 0 0 0 360.805 0 -1835 0 0 0 0 0 0 0 0 0 0 
2226.86 0 0 0 2234.03 0 0 403.073 -1498.38 0.07 1705.45 0 0 0 0 0 0 0 0 0 839.03 0 2458.95 0 0 0 0 0 0 0 0 788.369 0 0 0 0 0 0 2019.94 286.492 0 0 0 0 0 0 0 0 
0 0 -1176.11 -822.55 90.5637 -2018.88 0 0 0 2430.27 0 0 0 0 0 0 0 0 0 0 0 0 2430.27 0 0 0 0 0 -84.7652 0 -453.887 0 0 0 0 0 0 0 0 0 0 0 0 0 0 0 0 0 
0 0 0 0 0 955.611 0 0 0 0 0 0 0 0 0 -121.235 0 0 0 1661.2 0 -934.706 0 0 -2114.55 0 0 0 2442.17 0 0 0 0 0 0 0 0 0 0 0 0 0 0 -128.254 0 0 0 0 
0 0 0 0 582.217 -310.144 2475.28 785.623 -1152.61 0 0 0 0.06 0 0 0 0 0 0 0 -352.412 0 0 0 0 0 2063.59 1766.95 2318.11 0 0 0 -928.297 0 0 0 0 0 0 0 0 0 0 0 0 1669.29 0 0 
0 0 0 -751.9 -122.303 0 0 0 0 0 0 0 0 0.06 2302.39 0 0 0 762.429 0 0 1527.68 0 0 0 -2445.37 0 0 0 0 1667.15 0 0 0 0 0 0 0 0 0 1950.36 0 -700.781 0 0 0 0 0 
2080.37 0 0 0 -1419.95 -1948.68 0 -521.79 0 0 0 0 0 -667.974 0 474.639 0 1344.72 0 0 0 0 -138.173 0 0 0 0 0 -120.014 0 879.315 580.996 2174.37 0 0 0 0 0 0 0 0 -1608.1 0 0 0 0 0 0 
0 0 0 -1015.43 0 0 0 10.1474 0 0 0 2309.41 0 0 677.74 0.02 0 0 0 0 786.538 360.958 -493.103 0 0 579.165 -2188.56 0 0 1499.91 0 0 0 0 0 0 0 0 0 0 0 0 0 0 0 1176.72 0 0 
0 0 0 0 0 0 0 0 271.233 0 0 0 0 0 0 0 0.07 0 0 0 1081.8 118.03 0 0 0 0 0 -442.9 0 0 0 2472.99 0 0 0 0 0 0 0 0 0 0 0 0 0 0 0 0 
0 0 0 0 0 0 309.534 0 1150.93 0 0 0 0 0 1274.22 0 0 0.06 0 0 0 -1888.41 390.561 2487.03 -1176.26 0 0 0 0 -638.523 455.412 0 0 2310.94 0 0 0 0 0 0 1984.54 0 0 0 0 0 0 0 
-1816.08 0 0 0 1109.88 0 0 0 -242.088 0 0 0 0 486.999 0 0 0 0 0.08 0 -1293.45 0 0 0 0 0 -776.162 986.282 0 0 0 0 0 0 0 0 1542.94 2047.56 0 0 0 0 0 0 0 0 0 0 
0 0 0 -1410.64 2223.5 -1204.49 0 0 2108.91 0 0 800.729 0 0 0 0 0 0 0 0.08 0 0 0 0 0 0 0 1933.27 0 0 0 0 0 0 0 0 -670.415 0 0 0 0 0 0 -2431.33 0 0 0 0 
-170.827 0 1995.53 0 0 1262.63 -167.47 1245.69 0 464.11 0 0 1480.53 0 0 81.1029 1626.41 0 -2438.51 0 0.09 0 0 0 0 0 0 0 0 0 0 0 -803.934 0 0 0 1736.12 -1264.31 0 1325.8 0 0 0 0 0 0 0 0 
0 0 0 0 0 0 0 0 0 0 0 1911.91 0 -1610.23 0 1944.41 1732.15 564.821 0 0 0 0.08 0 0 0 0 0 0 0 0 1654.18 0 0 0 0 0 0 0 0 -959.426 0 0 0 0 170.217 0 0 0 
1924.27 0 0 0 0 1793.34 0 0 0 -164.876 -2249.75 0 0 0 2435.3 -1563.39 0 382.321 0 0 0 0 0.03 0 0 0 2222.43 0 0 0 0 0 0 0 0 0 0 0 -2080.37 0 0 0 0 0 0 0 -2314.91 0 
0 0 0 0 -1993.39 734.046 0 0 0 0 0 0 0 0 0 0 0 1029.62 0 0 0 0 0 0.08 0 0 0 2424.77 0 0 0 1578.49 2476.2 0 2373.65 0 -2118.52 0 0 0 0 0 0 0 0 0 0 0 
0 1953.26 182.272 2193.29 0 0 1827.68 0 0 0 0 2362.97 0 0 0 0 0 -1348.84 0 0 0 0 0 0 0.01 838.572 0 0 -390.561 0 0 0 506.989 0 0 0 0 0 0 -2467.5 0 490.204 0 0 0 0 0 0 
2316.13 0 0 0 0 0 0 0 0 0 0 0 0 602.512 0 -1042.74 0 0 0 0 0 0 0 0 -456.633 0.07 -441.069 30.5948 0 0 0 -783.181 0 0 0 0 0 0 0 0 0 0 0 0 0 0 0 0 
-567.873 2197.87 2001.63 0 653.935 1636.78 0 0 0 0 0 0 1427.58 0 0 1229.82 0 0 519.807 0 0 0 2120.5 0 0 320.521 0.04 0 0 0 -1704.54 0 0 0 0 0 0 0 0 0 0 0 0 0 0 0 0 -254.753 
0 0 0 0 0 54.857 0 0 0 0 0 0 467.925 0 0 0 653.478 0 24.9489 -2020.71 0 0 0 2396.69 0 2444.91 0 0.04 2346.8 1844 2187.34 0 0 -1342.74 0 0 0 0 0 0 -682.012 0 0 0 0 837.657 0 0 
0 0 0 0 0 0 0 0 1935.26 0 1171.68 1928.24 -334.559 0 -1122.55 0 0 0 0 0 0 0 0 0 -929.365 0 0 2096.85 0.03 0 0 0 0 0 0 0 0 0 0 763.344 0 0 0 0 0 0 1728.8 0 
-972.854 726.722 0 0 0 0 0 1484.8 0 0 0 0 0 0 0 209.281 0 916.7 0 0 0 0 0 0 0 0 0 1195.49 0 0.09 0 -1163.29 0 0 0 0 0 0 0 0 0 0 0 0 0 0 0 0 
1236.84 982.162 0 0 0 0 0 0 0 0 -2275.23 0 0 165.181 1779.31 0 0 612.888 0 0 0 2002.55 0 0 0 0 1868.72 403.989 0 0 0.04 -940.199 0 0 -1175.65 0 0 0 0 0 0 0 1505.71 0 0 0 0 0 
0 0 0 0 0 -1043.2 0 1345.33 0 -1712.16 0 0 0 0 1431.55 0 1888.71 0 0 0 0 0 0 1581.09 0 1629.92 0 0 0 32.8837 1149.25 0.02 -1344.72 0 0 0 0 0 0 0 0 0 0 0 0 0 0 0 
0 0 0 0 0 659.886 0 -1710.18 0 0 0 0 378.201 0 1951.12 0 0 0 0 0 -2491.91 0 0 2335.96 -1305.05 0 0 0 0 0 0 2242.73 0 0 0 0 0 1958.14 0 0 0 0 -2100.51 0 0 0 0 0 
0 0 0 0 0 0 865.276 0 0 0 0 0 0 0 0 0 0 -572.146 0 0 0 0 0 0 0 0 0 1769.39 0 0 0 0 0 0.02 0 0 168.996 0 0 0 0 0 0 0 0 0 -302.515 0 
0 0 0 0 -547.121 0 0 1976.3 0 0 0 0 0 0 0 0 0 0 0 0 0 0 0 -725.349 0 0 0 0 0 0 1805.55 0 0 0 0.08 0 0 0 0 2275.99 1125.9 0 -1506.93 0 322.199 0 -1436.28 0 
0 0 0 0 0 0 0 0 1146.35 0 0 0 0 0 0 0 0 0 0 0 0 0 0 0 0 0 0 0 0 0 0 0 0 0 0 0.07 0 0 0 0 0 0 0 0 0 0 0 232.475 
0 0 0 0 0 0 0 0 0 0 0 0 0 0 0 0 0 0 -2121.72 2451.02 -818.583 0 0 1894.36 0 0 0 0 0 0 0 0 0 131.153 0 0 0.07 0 0 0 0 0 0 0 0 0 0 0 
0 0 0 0 0 -708.716 0 0 1664.71 0 0 0 0 0 0 0 0 0 356.075 0 -2011.55 0 0 0 0 0 0 0 0 0 0 0 1888.56 0 0 0 0 0.05 0 0 0 0 0 0 0 0 0 0 
0 2334.59 0 0 0 109.485 0 0 0 499.664 0 0 0 0 0 0 0 0 0 0 0 0 1213.8 0 0 0 0 0 0 0 0 0 0 0 0 0 0 0 0.03 0 0 0 0 0 0 0 1511.81 0 
0 0 0 0 0 0 0 0 0 -1442.53 0 0 0 0 0 0 0 0 0 0 -924.482 1842.02 0 0 294.275 0 0 0 73.0155 0 0 0 0 0 1603.06 0 0 0 0 0.06 0 -673.467 0 0 0 0 0 0 
374.233 0 0 0 0 0 0 0 0 0 0 0 0 2089.07 0 0 0 2006.21 0 0 0 0 0 0 0 0 0 2121.27 0 0 0 0 0 0 -1120.41 0 0 0 0 0 0 0 0 0 0 2382.5 0 0 
2009.41 -1711.25 0 305.567 0 0 0 0 0 0 0 0 0 0 -125.507 0 0 0 0 0 0 0 0 0 2062.36 0 0 0 0 0 0 0 0 0 0 0 0 0 0 614.414 0 0.05 0 0 0 0 0 0 
0 302.82 0 0 0 0 1876.35 0 0 0 0 0 0 -2208.24 0 0 0 0 0 0 0 0 0 0 0 0 0 0 0 0 -470.824 0 -25.8644 0 2290.95 0 0 0 0 0 0 0 0.09 0 0 0 0 2235.86 
0 0 0 1372.95 0 0 1762.83 0 0 0 0 -279.626 0 0 0 0 0 0 0 1567.96 0 0 0 0 0 0 0 0 0 0 0 0 0 0 0 0 0 0 0 0 0 0 0 0.01 0 0 0 1065.78 
0 0 0 1161 -533.692 0 0 0 0 0 0 0 0 0 0 0 0 0 0 0 0 1547.36 0 0 0 0 0 0 0 0 0 0 0 0 -223.014 0 0 0 0 0 0 0 0 0 0.02 0 0 0 
0 0 0 0 0 0 0 0 0 0 0 0 984.451 0 0 837.352 0 0 0 0 0 0 0 0 0 0 0 588.626 0 0 0 0 0 0 0 0 0 0 0 0 1412.78 0 0 0 0 0.05 0 0 
0 -417.264 0 0 0 0 0 0 0 0 0 0 0 0 0 0 0 0 0 0 0 0 -1013.14 0 0 0 0 0 -2339.78 0 0 0 0 -576.113 2156.51 0 0 0 1971.42 0 0 0 0 0 0 0 0.05 0 
0 0 0 0 0 -182.73 0 0 0 0 0 0 0 0 0 0 0 0 0 0 0 0 0 0 0 0 -1294.52 0 0 0 0 0 0 0 0 -124.287 0 0 0 0 0 0 2492.98 2375.94 0 0 0 0.02 
