*Vertices 35
*Matrix 
0.03 0 0 0 0 1550.57 0 1791.06 0 0 1506.62 1284.3 0 766.243 0 0 0 -1794.26 0 0 2213.89 263.909 0 -1826.76 0 0 630.284 0 0 0 0 0 0 0 0 
0 0 2055.35 0 1234.09 0 0 0 0 0 0 0 920.515 -2361.29 0 0 0 0 0 0 0 -2323.6 235.374 0 0 0 0 0 0 0 0 0 0 0 545.747 
0 -1212.73 0.01 0 978.042 0 0 0 0 0 0 0 0 0 0 0 0 2411.19 -87.817 0 0 0 -2252.8 2076.25 0 0 0 0 595.645 0 0 -1594.06 0 0 -1347.93 
0 0 0 0.05 0 0 0 0 0 0 0 0 2451.02 0 -85.8333 1433.99 0 0 0 0 0 992.233 0 -291.528 0 0 0 0 0 0 0 0 0 2158.8 0 
0 1951.58 976.211 0 0.01 0 0 0 0 0 0 0 0 0 0 0 -291.681 0 -631.199 0 0 0 0 0 0 0 0 0 0 0 0 -781.808 0 0 1930.68 
769.143 0 0 0 0 0 0 0 0 248.497 0 0 0 0 2183.98 2194.36 -1541.72 0 0 0 0 0 0 0 0 0 0 0 0 0 0 1829.66 0 0 0 
0 0 0 0 0 0 0.08 746.864 0 0 0 0 1007.64 198.141 0 0 0 0 0 0 256.127 0 0 0 2490.69 0 0 0 0 0 0 0 0 0 0 
-219.047 0 0 0 0 0 -38.6822 0.09 0 0 -530.793 0 0 0 1140.86 0 0 2391.05 0 0 0 1863.38 1687.6 0 0 0 0 0 0 0 2409.67 0 0 2125.23 0 
0 0 0 0 0 0 0 0 0.04 0 1948.38 401.547 0 0 0 0 0 0 0 504.547 0 2321.62 0 1012.22 0 0 0 0 0 2278.74 -515.687 0 0 0 0 
0 0 0 0 0 -89.0378 0 0 0 0 0 0 -566.5 0 0 2340.85 0 0 0 0 0 0 0 0 0 0 0 0 0 -903.272 -1645.33 2006.06 0 0 0 
-1948.53 0 0 0 0 0 0 -1072.34 1982.71 0 0.03 0 -85.8333 0 0 0 760.445 0 0 -995.285 0 0 0 -510.041 1889.17 0 20.5237 -161.367 2492.68 0 0 0 1700.26 0 0 
1137.2 0 0 0 0 0 0 0 839.03 0 0 0.02 0 1418.27 0 0 0 0 0 0 62.7918 0 0 0 0 835.368 0 -893.506 -15.7933 0 -166.402 0 -1050.83 0 0 
0 2386.47 0 996.658 0 0 938.52 0 0 1482.51 -1136.89 0 0.09 0 0 0 -907.849 2161.24 0 0 0 2048.02 0 0 0 1985.15 0 1451.54 1261.1 0 0 0 0 0 0 
149.464 179.067 0 0 0 0 1979.81 0 0 0 0 1663.95 0 0.05 0 0 0 0 376.675 0 0 0 1337.09 0 2264.85 567.721 -988.113 -253.838 0 0 0 -1758.55 0 0 0 
0 0 0 116.199 0 195.395 0 2193.59 0 0 0 0 0 0 0.06 0 0 0 0 0 0 1859.26 0 -1424.38 0 -784.86 -1115.53 0 0 0 0 0 0 0 0 
0 0 0 2016.13 0 164.571 0 0 0 969.192 0 0 0 0 0 0.08 1919.84 0 0 0 0 0 0 0 -613.346 0 0 0 1200.67 0 0 1488.01 0 -958.052 -548.799 
0 0 0 0 2413.63 835.673 0 0 0 0 2267.3 0 1190.15 0 0 906.629 0.09 0 0 0 0 2473.14 0 0 0 0 -1760.99 0 0 0 0 1833.17 0 0 0 
82.6289 0 1866.74 0 0 0 0 -108.875 0 0 0 0 121.845 0 0 0 0 0.05 0 0 1144.52 -1639.84 0 0 -911.206 0 0 1581.24 2144 0 0 0 0 0 0 
0 0 806.833 0 960.952 0 0 0 0 0 0 0 0 -171.438 0 0 0 0 0.07 0 0 0 0 0 0 0 -734.352 1429.11 459.685 0 0 0 0 0 0 
0 0 0 0 0 0 0 0 -1733.99 0 1932.51 0 0 0 0 0 0 0 0 0.07 0 1040.76 0 694.525 0 2231.13 72.4052 0 0 45.0911 0 0 0 0 0 
-1484.34 0 0 0 0 0 55.7726 0 0 0 0 1342.28 0 0 0 0 0 1742.99 0 0 0.04 0 0 0 407.956 0 0 0 0 0 0 2254.17 477.233 0 0 
2104.18 -1119.95 0 2186.73 0 0 0 -821.024 611.82 0 0 0 -1742.38 0 2046.8 0 -643.101 1797.01 0 1290.55 0 0.06 0 902.661 0 0 0 0 -748.085 1577.73 -1878.8 -1930.07 0 0 -895.642 
0 623.264 445.952 0 0 0 0 1522.34 0 0 0 0 0 1453.83 0 0 0 0 0 0 0 0 0.05 1716.9 0 0 0 -1907.64 0 1013.14 0 0 0 0 0 
1810.89 0 -1712.47 514.618 0 0 0 0 1941.05 0 70.4215 0 0 0 305.109 0 0 0 0 -1761.6 0 -191.885 419.401 0.02 0 1911.76 858.104 0 1974.93 0 0 -459.685 0 0 0 
0 0 0 0 0 0 917.615 0 0 0 -2466.73 0 0 2124.32 0 -2017.2 0 1763.44 0 0 530.946 0 0 0 0.09 1579.71 0 1420.26 1749.09 767.922 0 0 0 0 0 
0 0 0 0 0 0 0 0 0 0 0 1002.15 -531.098 1979.81 -579.47 0 0 0 0 -664.617 0 0 0 1136.28 -361.415 0.03 0 0 0 -1282.77 0 0 0 -436.338 0 
-1388.97 0 0 0 0 0 0 0 0 0 1867.35 0 0 1041.22 1011.31 0 -2151.33 0 1899.4 -1912.37 0 0 0 1670.96 0 0 0.06 0 2216.79 0 1809.37 0 0 0 0 
0 0 0 0 0 0 0 0 0 0 401.09 -1370.82 2284.39 1579.56 0 0 0 -920.667 2023 0 0 0 -481.353 0 1844.31 0 0 0.09 0 0 0 0 0 0 0 
0 0 220.573 0 0 0 0 0 0 0 1862.47 134.358 -1305.96 0 0 1818.98 0 1397.37 1683.48 0 0 -1909.16 0 135.884 -2294.15 0 740.15 0 0.06 -1328.85 1187.7 0 317.469 0 0 
0 0 0 0 0 0 0 0 2184.13 1227.68 0 0 0 0 0 0 0 0 0 2330.01 0 2220.6 -717.261 0 -152.974 30.4422 0 0 -853.221 0 0 0 0 0 0 
0 0 0 0 0 0 0 -1348.08 428.251 -1205.86 0 989.029 0 0 0 0 0 0 0 0 0 -117.115 0 0 0 0 1083.48 0 605.258 0 0.06 260.247 0 0 0 
0 0 1675.85 0 -722.297 -2242.73 0 0 0 824.534 0 0 0 2240.75 0 1621.83 -152.669 0 0 0 -1449.71 -776.315 0 934.095 0 0 0 0 0 0 1097.06 0.02 0 0 0 
0 0 0 0 0 0 0 0 0 0 -1289.18 2000.87 0 0 0 0 0 0 0 0 919.141 0 0 0 0 0 0 0 954.695 0 0 0 0.06 0 0 
0 0 0 -981.094 0 0 0 24.7963 0 0 0 0 0 0 0 1685.77 0 0 0 0 0 0 0 0 0 1312.83 0 0 0 0 0 0 0 0.04 0 
0 -688.421 386.288 0 1610.39 0 0 0 0 0 0 0 0 0 0 1564.15 0 0 0 0 0 650.731 0 0 0 0 0 0 0 0 0 0 0 0 0.08 
