*Vertices 63
*Matrix 
0.07 0 0 0 0 0 0 0 0 486.541 0 0 -1007.34 0 0 2070.91 1369.29 68.2852 -413.297 0 0 0 0 0 24.7963 0 0 0 579.928 0 0 0 0 1215.93 0 -418.79 0 332.728 0 0 0 0 604.648 0 0 0 0 979.568 -2366.94 0 0 0 0 -1700.42 0 0 0 0 0 0 0 0 0 
0 0.01 0 950.423 0 -2359.31 0 0 -133.29 0 -2165.36 0 0 0 0 0 0 -52.1104 0 0 0 729.164 0 0 -1007.34 0 0 0 0 0 0 0 0 0 0 0 -820.261 0 1797.01 0 0 -1661.66 190.817 2067.25 516.297 0 0 0 1867.2 0 0 0 0 0 0 0 0 0 0 0 0 0 0 
0 0 0 0 0 0 0 0 0 0 0 0 1057.39 0 0 -44.4807 0 -753.883 0 0 0 0 374.386 0 0 0 -1446.65 0 1784.04 0 0 2295.68 0 0 0 -1610.39 0 -1323.05 0 0 0 0 0 0 0 0 241.02 0 1118.43 599.46 0 0 0 0 2310.79 0 0 0 0 0 0 0 0 
0 1767.56 0 0.09 0 0 0 -1726.51 2104.18 0 356.38 0 0 0 0 1738.11 0 0 0 0 0 1251.95 0 0 0 0 1737.65 0 0 0 -168.386 202.719 0 0 -2412.72 1531.95 0 0 0 0 0 1424.07 0 0 0 0 0 -1766.95 0 0 0 0 0 0 0 0 0 0 0 0 0 0 0 
0 0 0 0 0.06 0 0 0 0 -802.56 1978.59 0 0 202.414 0 0 0 1458.86 0 0 -792.184 0 0 0 0 0 0 953.932 0 0 0 0 -649.358 758.919 0 0 0 0 0 294.733 0 1028.24 1562.62 -1595.13 0 0 0 0 0 0 1845.68 0 0 0 0 0 -1981.03 0 -2100.67 1709.88 0 0 0 
0 1322.44 0 0 0 0.07 0 0 0 0 2080.83 1377.83 0 0 0 0 2046.8 -1518.98 0 0 392.85 -341.578 0 0 -136.036 0 0 0 0 0 0 0 0 0 1878.64 0 376.98 0 -1029.47 0 125.355 -1461.46 0 1936.93 1239.28 0 -1710.18 0 -1859.42 0 0 0 -907.086 0 0 0 0 0 0 0 0 0 0 
0 0 0 0 0 0 0.07 0 2414.85 0 0 0 2080.68 -1029.16 1333.58 849.559 0 0 0 -229.881 0 0 0 0 50.8896 170.827 0 0 0 1693.55 0 0 1791.21 1757.94 0 0 0 0 0 0 -2339.01 -927.534 0 0 0 0 0 312.586 0 0 0 -2449.49 0 0 -466.704 0 0 0 0 0 0 0 0 
0 0 0 1788.31 0 0 0 0 0 0 0 0 0 2189.47 0 0 0 0 0 -1753.36 0 0 0 0 0 -303.735 1846.14 1451.08 0 1161.46 0 0 1000.47 -530.183 0 -2108.6 0 0 0 0 1924.57 0 0 0 0 0 0 1394.92 1983.02 0 0 0 0 0 -1808.91 1819.74 0 0 0 -2198.32 0 2457.43 0 
0 1324.12 0 -738.166 0 0 1002.46 0 0.02 0 0 0 0 873.516 0 1312.83 0 0 0 0 0 0 0 0 0 0 970.565 0 0 832.011 0 0 1380.58 0 1557.59 0 -706.275 0 0 0 0 0 0 0 1514.25 0 0 1581.39 0 0 -1817.61 0 0 0 0 0 0 0 0 813.395 0 0 -1925.03 
2140.49 0 0 0 -1966.54 0 0 0 0 0.07 -2290.03 0 0 0 0 0 0 0 0 0 0 -824.229 956.984 0 1217.92 0 0 0 2109.06 0 0 0 1460.54 0 0 0 0 0 0 0 0 195.242 0 0 0 0 0 0 0 0 0 0 0 0 0 0 321.284 0 0 0 0 0 1285.52 
0 2178.33 0 -1209.52 -1830.27 113.91 0 0 0 902.814 0.09 0 0 0 710.242 1300.62 0 0 0 0 0 -2023.45 0 0 0 -26.017 -1345.94 0 0 0 0 2097.16 0 0 -90.2585 0 0 1044.11 0 1553.16 0 0 0 -38.8348 0 0 0 -695.135 1852.24 0 0 0 -1598.94 0 0 0 0 0 -1606.88 0 0 0 0 
0 0 0 0 0 2406.77 0 0 0 0 0 0.03 498.749 0 0 0 0 -814.31 0 0 1501.43 0 0 886.944 0 0 0 0 0 0 0 -1675.85 0 -62.6392 1630.99 1873.3 0 0 0 0 0 -1675.39 0 0 0 0 0 23.5755 0 0 0 0 0 -1517.3 0 0 0 0 0 0 751.747 0 0 
1186.79 0 750.679 0 0 0 2420.19 0 0 0 0 406.888 0.01 0 967.055 -2308.5 -865.886 0 -393.612 0 2437.44 0 -1874.07 0 0 -219.352 0 0 1011.46 0 -1616.49 0 0 0 0 0 0 0 1210.59 0 0 0 17.4718 1329.92 0 0 0 0 0 0 0 0 0 -57.2985 0 0 0 -2255.85 0 0 0 0 0 
0 0 0 0 1089.43 0 1589.63 -797.372 423.826 0 0 0 0 0.06 0 0 0 0 0 0 0 0 0 0 0 0 -256.89 0 0 0 0 0 0 2261.04 0 0 0 2456.66 0 0 313.044 0 0 0 0 548.341 0 0 0 0 0 0 0 0 0 0 0 0 0 0 0 0 -2052.14 
0 0 0 0 0 0 1351.89 0 0 0 -432.524 0 2296.29 0 0.02 2104.94 0 0 0 0 0 0 0 0 855.51 0 0 0 2250.82 0 0 0 0 -1662.72 2416.53 0 0 0 0 1934.95 0 0 1946.7 0 0 0 822.703 -2488.1 0 0 0 0 -2380.67 140.767 0 -1927.93 0 0 0 0 0 0 0 
147.938 0 1031.91 1938.92 0 0 2349.09 0 446.562 0 1146.66 0 2499.24 0 324.641 0.04 0 0 0 135.884 1556.83 0 1035.42 -1442.08 0 0 0 0 -1859.42 -1404.54 0 0 0 0 0 0 0 0 -1192.59 -1741 0 0 0 -2066.33 0 0 1485.72 2107.07 0 -669.652 0 0 0 0 0 0 0 0 0 0 0 0 0 
2344.97 0 0 0 0 1571.17 0 0 0 0 0 0 1542.94 0 0 0 0.06 0 2215.87 0 0 0 0 0 0 0 0 2355.8 0 1026.41 -526.368 2217.55 0 0 0 103.381 -1227.07 0 0 -600.833 -162.435 782.266 0 0 1969.74 0 0 0 0 0 0 0 0 -2276.91 0 0 0 29.3741 0 0 0 -715.583 0 
1325.5 -1877.27 -395.749 0 -313.959 -2128.44 0 0 0 0 0 -2183.37 0 0 0 0 0 0.09 0 0 0 2276.91 0 1542.33 0 0 2331.54 0 -1630.99 0 0 0 1820.66 0 0 0 0 0 0 0 0 0 927.839 1819.74 0 0 -91.4792 0 0 0 0 0 0 0 0 0 0 0 0 0 0 0 0 
-926.618 0 0 0 0 0 0 0 0 0 0 0 2073.35 0 0 0 2088 0 0.08 1325.8 0 0 0 0 0 0 -2051.68 0 0 0 -1736.88 0 193.411 0 0 -1412.93 0 -1461.46 2338.4 0 409.329 0 0 0 0 0 1643.96 0 0 0 0 0 1033.89 0 463.5 -2013.08 0 0 0 0 0 0 0 
0 0 0 0 0 0 1047.62 861.614 0 0 0 0 0 0 0 1774.73 0 0 2073.05 0.02 0 245.293 0 0 0 0 0 0 0 1730.48 2015.98 0 0 0 0 0 0 0 0 163.808 0 0 1376.77 3.73852 0 0 488.22 0 0 0 0 0 0 0 0 0 0 0 0 0 0 0 0 
0 0 0 0 343.867 1750.92 0 0 0 0 0 2438.35 -2043.6 0 0 -2350.31 0 0 0 0 0.09 0 0 877.789 0 0 0 0 0 0 0 0 -404.294 0 -968.581 0 693.152 0 0 0 -330.287 0 0 -1289.33 0 0 2441.71 0 789.59 0 0 0 0 0 0 0 0 0 0 0 0 0 0 
0 1433.07 0 2234.79 0 397.58 0 0 0 -341.578 2230.37 0 0 0 0 0 0 -81.4081 0 -2124.16 0 0.05 0 0 0 -14.8778 -2276.91 0 0 0 686.743 1699.04 0 0 0 0 1723.3 -518.891 0 0 0 0 0 0 0 2080.52 1316.19 0 2485.05 2453.76 0 0 0 0 1725.44 0 0 0 0 0 0 0 0 
0 0 2323.76 0 0 0 0 0 0 -270.47 0 0 -219.657 0 0 2398.07 0 0 0 0 0 0 0.04 0 0 0 0 0 0 1485.11 0 0 -255.974 0 0 0 -478.607 0 0 0 0 0 0 0 0 0 0 1902.45 0 0 0 0 0 0 0 0 697.272 0 0 0 0 1309.32 -64.7755 
0 0 0 0 0 0 0 0 0 0 0 2170.4 0 0 0 -1450.77 0 2395.02 0 0 2349.85 0 0 0.07 0 0 421.384 0 0 0 -1854.23 0 0 0 0 -692.999 0 -163.35 0 0 0 0 0 0 0 0 0 1481.14 0 1459.62 0 0 -968.123 0 272.301 0 0 0 0 0 0 0 0 
1763.28 -1025.96 0 0 0 -2032 -589.084 0 0 106.586 0 0 0 0 -2315.21 0 0 0 0 0 0 0 0 0 0 0 -306.635 0 0 -515.076 0 0 502.106 0 1368.53 0 0 0 0 -357.601 1295.13 1511.81 709.326 0 0 0 1447.42 0 0 0 0 0 0 0 0 0 0 0 0 0 1142.84 0 0 
0 0 0 0 0 0 97.4303 -56.9933 0 0 2274.32 0 -2077.78 0 0 0 0 0 0 0 0 -294.58 0 0 0 0.04 -9.23185 -685.827 0 -113.453 206.839 0 0 0 1643.65 453.887 0 0 0 0 0 1749.24 0 -534.15 2222.28 0 143.666 0 0 39.7504 -1285.82 -1326.41 0 0 0 0 0 0 0 -2044.97 0 0 0 
0 0 -64.1652 1111.71 0 0 0 1277.43 2317.5 0 -1638.77 0 0 144.276 0 0 0 -679.571 1128.04 0 0 576.418 0 293.207 -315.79 -2200.61 0.06 -1015.58 0 734.199 0 0 0 -1018.48 -1202.2 1341.52 -2478.33 0 0 0 1641.67 1707.43 0 0 0 0 597.476 44.9385 0 0 0 0 0 629.826 0 0 0 0 0 1429.87 0 0 0 
0 0 0 0 338.984 0 0 -1993.85 0 0 0 0 0 0 0 0 -1203.12 0 0 0 0 0 0 0 0 2032 1685.77 0.03 515.687 0 2208.09 0 0 0 0 0 -1135.21 0 -1412.02 0 -1313.9 0 0 0 0 1076.77 0 1247.37 0 2350.92 0 0 0 0 0 -351.192 0 0 1787.24 0 0 0 0 
-267.724 0 -644.017 0 0 0 0 0 0 1933.88 0 0 1970.35 0 -684.301 -48.1429 0 1948.68 0 0 0 0 0 0 0 0 0 2323.76 0.06 0 0 0 0 0 0 779.977 0 979.263 -249.26 0 0 0 0 0 0 0 0 0 0 0 0 0 0 0 0 0 0 442.747 -502.564 0 0 0 0 
0 0 0 0 0 0 1816.08 1511.96 -464.263 0 0 0 0 0 0 703.07 -2467.04 0 0 -41.5815 0 0 -2107.84 0 -945.235 -2315.97 2305.75 0 0 0.06 0 0 0 0 0 1098.74 0 0 0 0 0 2057.48 0 907.697 0 0 1950.06 717.719 0 0 904.797 0 0 0 0 0 0 0 0 0 0 0 0 
0 0 0 1080.28 0 0 0 0 0 0 0 0 704.443 0 0 0 899.609 0 -1417.36 -715.43 0 -1402.71 0 -685.217 0 -747.627 0 217.521 0 0 0.06 0 -194.784 0 789.285 0 0 0 0 0 0 0 0 0 0 2165.67 698.95 0 0 1268.43 0 0 0 0 0 0 0 0 0 0 2431.94 0 0 
0 0 -1329.16 359.737 0 0 0 0 0 0 1493.65 -2168.72 0 0 0 0 -1543.4 0 0 0 0 801.035 0 0 0 0 0 0 0 0 0 0.09 0 0 0 1784.34 0 1565.07 0 2435.15 -1071.28 0 -97.7355 714.82 0 0 0 0 0 0 0 0 0 0 0 0 -543.611 0 0 0 2075.33 -1833.63 0 
0 0 0 0 -1731.39 0 1218.68 2178.64 1898.48 4.65407 0 0 0 0 0 0 0 1228.9 -227.897 0 2126.91 0 -2302.7 0 -2249.75 0 0 0 0 0 1125.29 0 0 0 0 0 0 553.072 0 2312.46 0 1484.8 0 -1043.5 0 0 0 0 0 0 0 0 0 0 0 0 0 0 0 -304.956 0 0 0 
-547.273 0 0 0 2274.77 0 2421.26 237.968 0 0 0 -276.574 0 1253.78 471.587 0 0 0 0 0 0 0 0 0 0 0 -1587.65 0 0 0 0 0 0 0.08 0 0 0 0 0 549.409 0 -2429.35 1305.81 0 165.029 0 0 0 0 0 1386.84 0 0 0 0 0 0 -5.26444 0 0 -1441.31 0 0 
0 0 0 2055.5 0 351.65 0 0 -1666.54 0 49.0585 1168.48 0 0 2215.87 0 0 0 0 0 -1506.32 0 0 0 -1695.38 936.842 1633.12 0 0 0 719.55 0 0 0 0.04 599.765 0 0 2236.01 0 0 0 0 -1501.74 0 1840.34 0 0 0 0 0 0 0 0 0 0 2285.15 0 0 2036.88 0 0 0 
1900.01 0 993.454 -2036.58 0 0 0 -1477.02 0 0 0 1147.88 0 0 0 0 1691.11 0 234.764 0 0 0 0 -2040.54 0 -1030.38 -2135.3 0 1324.88 -365.993 0 134.663 0 0 -1238.98 0 215.69 0 0 0 0 0 0 0 2380.83 2407.07 0 0 1425.6 0 0 277.184 0 0 0 0 0 0 0 0 0 0 0 
0 2233.12 0 0 0 -725.044 0 0 -2032.3 0 0 0 0 0 0 0 -581.301 0 0 0 10.1474 -1069.14 1520.81 0 0 0 294.885 709.784 0 0 0 0 0 0 0 -751.595 0.02 0 0 0 936.384 0 -1014.51 1585.67 467.162 0 564.211 0 -2209.01 0 0 0 2168.57 0 0 0 0 0 0 0 0 2345.88 0 
-1913.89 0 1602.91 0 0 0 0 0 0 0 2103.41 0 0 1288.11 0 0 0 0 -1406.37 0 0 2452.09 0 -1710.18 0 0 0 0 -2075.95 0 0 1533.33 1452.6 0 0 0 0 0 2016.74 0 1467.86 0 394.375 -1118.73 0 1505.86 -634.404 0 0 0 0 0 0 0 0 0 0 0 0 0 0 0 0 
0 409.482 0 0 0 -924.635 0 0 0 0 0 0 1013.6 0 0 1607.33 0 0 -625.858 0 0 0 0 0 0 0 0 1874.68 2375.33 0 0 0 0 0 2379.15 0 0 183.798 0.05 0 0 0 0 1323.05 -1974.32 -672.399 0 0 0 -515.229 0 0 0 0 0 0 0 0 0 0 0 0 0 
0 0 0 0 2292.47 0 0 0 0 0 -512.635 0 0 0 2164.91 -199.973 -2307.58 0 0 -695.441 0 0 0 0 767.312 0 0 0 0 0 0 1497.47 1780.37 792.032 0 0 0 0 0 0.01 0 0 293.207 0 0 0 505.768 0 0 -1898.02 0 0 0 0 0 0 0 0 0 0 0 0 0 
0 0 0 0 0 -1615.73 1879.56 -1907.33 0 0 0 0 0 -443.51 0 0 1964.55 0 1023.36 0 1007.95 0 0 0 1414 0 1433.38 -375.454 0 0 0 2443.08 0 0 0 0 1440.4 932.264 0 0 0.06 0 0 0 1605.5 1533.17 -1834.24 0 0 0 0 0 0 0 0 0 0 0 0 0 0 0 0 
0 182.272 0 1347.93 1833.93 -51.5 -1655.86 0 0 -2043.75 0 1219.44 0 0 0 0 1853.16 0 0 0 0 0 0 0 2118.67 -2497.56 -138.783 0 0 767.159 0 0 660.955 -2264.24 0 0 0 0 0 0 0 0.06 402.921 2244.41 0 0 0 1109.27 0 -2210.84 -1755.65 0 0 0 0 1507.54 0 2285.15 0 0 0 0 1306.42 
2028.03 451.75 0 0 2323.91 0 0 0 0 0 0 0 -1696.75 0 -1831.34 0 0 1430.94 0 349.361 0 0 0 0 1035.11 0 0 0 0 0 0 -1954.94 0 2463.23 0 0 1758.25 1909.77 0 1982.71 0 1841.26 0.03 0 0 0 0 212.79 0 -2339.78 0 0 0 0 -2235.1 0 0 0 2236.47 0 0 1440.4 1310.08 
0 154.5 0 0 -1395.38 1230.74 0 0 0 0 -1315.73 0 -165.029 0 0 -412.381 0 1921.98 0 921.125 -630.284 0 0 0 0 1680.27 0 0 0 1378.14 0 564.821 -13.3518 0 1690.5 0 -154.195 1343.2 -171.285 0 0 1724.98 0 0.07 0 1794.11 -2130.73 -2042.83 0 0 0 0 0 0 0 0 0 0 0 0 0 0 0 
0 1711.1 0 0 0 1897.11 0 0 -17.1667 0 0 0 0 0 0 0 2053.06 0 0 0 0 0 0 0 0 -676.519 0 0 0 0 0 0 0 1065.63 0 -545.137 -2185.2 0 572.909 0 -783.944 0 0 0 0.07 0 2198.93 -1046.25 0 -2176.96 0 0 0 0 0 0 0 634.251 0 0 0 0 0 
0 0 0 0 0 0 0 0 0 0 0 0 0 -186.087 0 0 0 0 0 0 0 -131.001 0 0 0 0 0 -262.688 0 0 2471.31 0 0 0 -1977.07 -1772.44 0 -1563.54 2379.91 0 193.716 0 0 894.116 0 0.04 0 1970.5 0 0 0 737.709 0 0 0 0 0 0 0 0 0 0 0 
0 0 2470.85 0 0 -1200.83 0 0 0 0 0 0 0 0 2193.29 1242.03 0 -580.233 -794.626 1791.97 -2095.32 -2011.25 0 0 1884.29 -234.458 -308.924 0 0 326.319 -1325.5 0 0 0 0 0 1772.9 2495.73 0 2470.09 -58.8244 0 0 1473.05 2048.63 0 0.09 0 0 -1409.88 0 0 0 0 -1006.73 0 -2203.21 0 0 -206.534 0 0 0 
1631.9 0 0 -2273.4 0 0 2346.03 555.971 186.239 0 335.627 454.497 0 0 1603.98 -1255.15 0 0 0 0 0 0 1252.4 -218.589 0 0 -398.801 1139.94 0 579.012 0 0 0 0 0 0 0 0 0 0 0 -218.894 2413.48 1770.46 -2158.8 -228.355 0 0 0 0 0 0 0 0 0 0 0 0 0 0 0 0 0 
1122.39 1988.2 -792.947 0 0 310.755 0 681.555 0 0 2437.89 0 0 0 0 0 0 0 0 0 -502.716 -1382.41 0 0 0 0 0 0 0 0 0 0 0 0 0 1192.59 4.1963 0 0 0 0 0 0 0 0 0 0 0 0.09 181.204 0 0 -479.217 0 0 0 0 0 0 0 0 0 0 
0 0 -1394.47 0 0 0 0 0 0 0 0 0 0 0 0 -7.85852 0 0 0 0 0 -1739.02 0 256.584 0 -858.715 0 1848.12 0 0 1669.44 0 0 0 0 0 0 0 2118.21 -1647.77 0 1517.15 827.281 0 -1400.57 0 2368.31 0 -1507.08 0.02 1420.56 0 0 -944.929 0 0 0 -712.073 0 0 0 0 0 
0 0 0 0 -302.667 0 0 0 1186.33 0 0 0 0 0 0 0 0 0 0 0 0 0 0 0 0 -2281.18 0 0 0 1457.79 0 0 0 -1967.45 0 0 0 0 0 0 0 1950.82 0 0 0 0 0 0 0 1157.34 0.01 0 0 0 0 0 2191.61 0 0 0 0 0 0 
0 0 0 0 0 0 -368.892 0 0 0 0 0 0 0 0 0 0 0 0 0 0 0 0 0 0 1244.93 0 0 0 0 0 0 0 0 0 56.9933 0 0 0 0 0 0 0 0 0 269.25 0 0 0 0 0 0.07 0 0 0 0 0 0 0 0 0 0 0 
0 0 0 0 0 2461.09 0 0 0 0 2094.41 0 0 0 -2471.01 0 0 0 1113.09 0 0 0 0 972.243 0 0 0 0 0 0 0 0 0 0 0 0 -280.694 0 0 0 0 0 0 0 0 0 0 0 852.916 0 0 0 0.01 0 0 0 0 0 0 0 -244.835 0 0 
-1085.16 0 0 0 0 0 0 0 0 0 0 -193.411 1369.44 0 243.004 0 2161.09 0 0 0 0 0 0 0 0 0 -1454.59 0 0 0 0 0 0 0 0 0 0 0 0 0 0 0 0 0 0 0 0 0 0 1789.07 0 0 0 0.03 0 0 0 111.164 0 0 0 0 0 
0 0 -536.592 0 0 0 1046.1 -745.338 0 0 0 0 0 0 0 0 0 0 545.595 0 0 1679.97 0 1863.23 0 0 0 0 0 0 0 0 0 0 0 0 0 0 0 0 0 0 210.501 0 0 0 514.466 0 0 0 0 0 0 0 0.06 0 0 0 0 0 135.273 -951.186 0 
0 0 0 0 0 0 0 1486.48 0 0 0 0 0 0 2226.55 0 0 0 -2470.85 0 0 0 0 0 0 0 0 -2331.39 0 0 0 0 0 0 0 0 0 0 0 0 0 1302.76 0 0 0 0 0 0 0 0 0 0 0 0 0 0.01 1511.2 0 0 0 2451.02 0 0 
0 0 0 0 1781.14 0 0 0 0 -1329.92 0 0 0 0 0 0 0 0 0 0 0 0 -2067.55 0 0 0 0 0 0 0 0 1389.89 0 0 1233.33 0 0 0 0 0 0 0 0 0 0 0 -207.755 0 0 0 -509.735 0 0 0 0 1867.2 0.01 0 0 0 -1684.39 0 0 
0 0 0 0 0 0 0 0 0 0 0 0 -364.925 0 0 0 500.122 0 0 0 0 0 0 0 0 0 0 0 -621.891 0 0 0 0 265.74 0 0 0 0 0 0 0 1329.16 0 0 18.6926 0 0 0 0 1551.48 0 0 0 -764.26 0 0 0 0.07 -1008.41 1413.39 0 0 0 
0 0 0 0 397.427 0 0 0 0 0 405.972 0 0 0 0 0 0 0 0 0 0 0 0 0 0 0 0 244.835 406.43 0 0 0 0 0 0 0 0 0 0 0 0 0 2230.06 0 0 0 0 0 0 0 0 0 0 0 0 0 0 -1349.45 0.05 433.592 0 0 0 
0 0 0 0 256.279 0 0 -36.2407 -1899.7 0 0 0 0 0 0 0 0 0 0 0 0 0 0 0 0 915.784 -1101.79 0 0 0 0 0 -306.635 0 374.538 0 0 0 0 0 0 0 0 0 0 0 567.11 0 0 0 0 0 0 0 0 0 0 1772.74 685.675 0.08 692.389 0 0 
0 0 0 0 0 0 0 0 0 0 0 1524.78 0 0 0 0 0 0 0 0 0 0 0 0 1849.8 0 0 0 0 0 1860.33 -2489.78 0 1734.29 0 0 0 0 0 0 0 0 0 0 0 0 0 0 0 0 0 0 2234.18 0 1894.36 1722.54 -379.727 0 0 -221.335 0.06 0 0 
0 0 0 0 0 0 0 -186.392 0 0 0 0 0 0 0 0 -981.704 0 0 0 0 0 2403.41 0 0 0 0 0 0 0 0 -1383.94 0 0 0 0 792.337 0 0 0 0 0 276.116 0 0 0 0 0 0 0 0 0 0 0 -617.771 0 0 0 0 0 0 0.08 0 
0 0 0 0 0 0 0 0 2102.8 -2177.11 0 0 0 -1178.55 0 0 0 0 0 0 0 0 916.547 0 0 0 0 0 0 0 0 0 0 0 0 0 0 0 0 0 0 1489.53 -553.224 0 0 0 0 0 0 0 0 0 0 0 0 0 0 0 0 0 0 0 0 
