*Vertices 66
*Matrix 
0.07 0 0 2426.91 -1294.52 0 0 0 -2407.83 0 -1491.52 599.46 0 0 -1727.58 0 0 0 0 0 0 0 0 0 0 0 0 0 819.651 0 0 298.242 0 0 0 -1049.76 0 0 0 0 0 0 0 0 0 0 2036.88 -931.196 0 0 -1893.75 2256.61 0 0 0 2435.61 0 0 2135.61 -2064.81 0 0 0 0 0 0 
0 0.02 0 0 0 0 -1590.4 0 1451.08 0 0 -2334.28 1740.24 1131.7 0 1287.04 0 0 2486.11 2154.07 0 0 0 0 0 2342.07 0 0 0 0 0 -2475.28 0 212.485 0 2414.24 0 0 0 0 2489.93 1246.6 0 0 0 0 0 0 2009.87 0 526.673 0 0 0 0 -2261.5 0 0 2405.39 0 0 0 0 0 -2224.57 0 
0 0 0.03 0 0 0 0 -2362.36 0 0 0 1211.66 0 0 0 -1935.56 0 -31.8155 0 0 0 1618.93 0 0 0 0 0 0 0 0 2195.43 0 612.125 0 0 0 0 2358.39 0 0 1796.7 321.284 257.653 0 0 0 895.795 0 0 0 0 1626.56 0 0 523.774 0 2047.72 0 0 0 -555.513 0 0 -828.349 0 0 
-2340.85 0 0 0 0 0 0 0 0 0 0 0 0 2063.28 0 1376 0 0 259.789 -2031.85 0 2093.49 0 0 0 0 0 0 92.3948 0 0 0 0 0 0 0 0 -534.455 1924.42 0 953.932 0 0 0 0 0 0 0 -1638.77 -517.823 0 1642.89 0 0 -2028.49 0 1251.79 0 0 0 0 0 0 0 0 0 
1689.28 0 0 0 0.02 0 137.562 0 0 0 0 0 0 2426.76 0 967.513 0 0 0 0 0 990.249 736.488 0 0 0 -2363.89 0 0 -1052.05 0 -1003.52 1609.32 0 0 0 0 0 -998.184 0 0 0 0 0 0 0 0 0 0 1715.67 0 2476.96 -244.377 0 0 0 0 0 0 0 0 0 0 0 0 0 
0 0 0 0 0 0.01 -1868.11 -160.451 0 1105.76 0 0 0 0 0 1459.01 0 0 0 813.852 0 0 0 0 0 0 0 0 0 0 0 0 0 474.334 0 -1298.79 791.574 0 2237.24 0 0 0 1725.59 0 0 2358.09 0 0 0 0 0 0 0 0 0 -1132.47 0 -1040.91 0 1396.91 1352.2 -1442.99 0 806.375 0 0 
0 1575.29 0 0 251.396 -1055.1 0.09 0 0 -2112.11 0 355.922 0 0 0 -598.239 0 -1047.17 168.538 1435.36 824.534 -2350.31 0 0 0 0 2388.15 0 0 0 0 -2491.3 0 0 0 1396.6 0 0 0 0 0 -1620.61 0 0 0 0 0 0 0 0 815.836 0 0 -50.4318 2334.74 0 0 0 2069.08 0 0 0 0 1.44963 0 0 
0 0 1799.75 0 0 -212.027 0 0 0 996.658 -1242.03 0 -1672.34 0 -1737.19 0 0 2050.16 0 0 0 -2316.13 0 2393.95 0 0 0 0 0 0 0 0 0 -18.2348 0 0 0 0 0 1564 0 0 0 0 0 1669.9 -2317.5 0 118.183 0 -1052.05 1276.82 0 0 0 0 1437.35 2341.46 0 0 0 0 0 0 0 0 
-782.571 582.522 0 0 0 0 0 0 0.01 0 -129.78 0 0 1308.71 1706.98 0 311.823 -1739.33 0 0 0 0 -830.943 1159.93 0 -326.777 2151.17 0 2039.32 0 0 0 0 0 0 0 0 0 0 0 0 0 0 -303.125 0 680.639 98.0407 0 0 0 836.894 -579.318 0 -1758.71 0 1077.68 0 0 0 0 0 0 0 617.771 0 0 
0 0 0 0 0 -371.334 475.402 -47.0748 0 0.07 0 0 0 0 0 -306.177 0 2254.33 0 -2120.04 0 0 0 0 1593.6 0 0 1970.96 0 0 0 0 1581.85 0 0 0 0 -2444.61 0 0 0 -1218.68 0 0 1997.82 196.768 0 0 0 0 0 0 0 0 0 0 0 0 0 0 0 0 -357.906 -2457.88 0 0 
1976.15 0 0 0 0 0 0 2369.69 749.001 0 0.08 69.9637 -1397.98 0 0 0 0 0 0 0 0 389.492 0 -793.252 0 0 0 0 1721.63 0 0 0 -589.084 0 0 -1059.53 0 0 0 0 0 0 0 0 0 -2283.93 1283.99 0 -521.943 1279.87 0 2086.02 0 0 0 560.396 0 0 589.694 1508.76 0 0 1991.71 0 0 0 
-1856.21 1645.63 -42.0392 0 0 0 407.041 0 0 0 1059.83 0.02 0 0 0 0 0 0 0 -1530.27 -2305.9 0 0 0 0 0 -1036.48 0 0 0 0 -235.527 1113.7 2354.73 0 0 -1833.93 58.0615 0 0 0 -1114.76 2146.44 0 0 0 0 0 0 0 0 0 0 -721.076 -1477.94 1245.99 0 2100.97 0 0 0 2016.43 0 0 0 0 
0 1478.85 0 0 0 0 0 -1768.01 0 0 1553.77 0 0.08 1888.41 0 0 2398.22 0 1785.87 0 0 0 0 0 0 0 0 0 140.614 0 -937.452 1131.55 -2464.9 0 -1780.22 0 0 0 0 0 856.731 -163.35 0 0 763.649 0 -481.353 -367.061 0 -400.937 0 0 0 0 0 0 -143.818 0 0 0 0 0 0 0 0 0 
0 1765.72 0 -837.046 -1997.05 0 0 0 -490.204 0 0 0 1471.07 0.08 0 1686.38 0 0 941.42 0 0 49.8215 0 -1405.15 0 0 0 -418.18 0 2327.11 0 0 0 0 0 0 2071.83 0 -1326.26 2253.11 327.998 0 0 -568.636 0 0 0 0 0 -537.202 0 0 0 0 0 194.479 0 0 1536.23 0 -2002.4 0 0 1585.36 0 0 
-1811.2 0 0 0 0 0 0 556.886 -689.337 0 0 0 0 0 0.05 0 0 0 0 0 2328.64 0 -2303.77 0 0 0 0 0 0 2132.86 -371.792 0 0 0 0 0 2332.45 0 0 1432.62 0 0 0 -256.584 0 0 -1067.16 0 0 0 0 0 0 0 187.002 0 0 0 264.519 0 -2397 431.913 0 0 0 0 
0 728.706 -1452.45 193.106 318.079 2472.69 549.409 0 0 2345.27 0 0 0 2143.85 0 0.03 -2287.59 0 -1892.07 881.756 -756.325 0 0 0 0 0 0 0 839.488 0 -1458.4 0 -1718.73 0 -1504.79 0 0 0 356.685 0 0 503.937 0 -1163.14 2371.36 -1490.14 0 0 0 0 0 0 0 1975.84 468.841 0 0 0 519.654 0 0 -1832.56 1311.61 564.974 0 0 
0 0 0 0 0 0 0 0 -1726.36 0 0 0 1694.16 0 0 130.543 0.04 1825.85 -2147.82 0 0 0 -1588.26 0 0 0 0 0 0 0 0 -471.587 0 0 1745.28 0 0 0 0 -1168.48 0 1198.69 0 0 0 492.95 0 0 0 0 0 -21.2867 1782.05 0 0 1228.75 0 0 0 662.175 0 0 0 0 0 -1192.74 
0 0 1107.9 0 0 0 1991.56 6.94296 115.284 2186.27 0 0 0 0 0 0 -646.153 0.06 0 0 0 0 0 0 1156.27 0 0 0 0 0 0 1949.6 0 0 0 0 0 0 -1490.91 0 388.577 0 0 -365.688 0 -1372.8 -173.879 945.387 0 0 2314.91 -999.252 0 0 0 0 871.838 0 0 749.916 -669.958 803.629 0 0 0 0 
0 -1118.12 0 -104.144 0 0 -1953.87 0 0 0 0 0 127.491 2285.15 0 85.3755 -567.721 0 0.06 0 -33.4941 0 0 0 0 -2450.56 0 1647.77 0 -1147.88 1242.48 1102.25 1750.92 0 0 0 2335.05 0 1645.02 0 0 0 0 0 0 0 0 0 -1831.49 0 0 0 0 -449.767 0 0 1787.55 0 0 0 0 -621.586 0 2062.97 0 0 
0 2382.66 0 -1231.04 0 -503.632 -679.724 0 0 2310.94 0 702.155 0 0 0 -1216.39 0 0 0 0 0 -2284.84 0 0 1826.91 0 0 0 0 1355.25 0 0 0 0 0 904.035 0 0 0 0 0 2488.56 -2384.95 0 -1303.06 1567.96 0 2429.5 0 0 0 0 0 0 0 0 1110.64 0 0 0 -726.112 0 0 0 0 0 
0 0 0 0 0 0 948.134 0 0 0 0 -614.414 0 0 -2322.99 -1268.43 0 0 254.143 0 0.05 0 2373.5 -433.897 0 0 0 0 0 990.707 0 0 0 0 0 0 0 1440.09 -2447.81 2278.13 0 0 0 1299.1 0 126.728 0 2241.51 0 0 0 0 0 0 0 0 0 -1638.77 0 0 2294.92 0 0 0 0 0 
0 0 2180.47 1448.94 484.1 0 855.51 2366.48 0 0 -842.082 0 0 802.713 0 0 0 0 0 698.187 0 0.09 0 0 0 0 0 0 -1040.6 0 0 0 0 1265.83 0 1240.35 0 0 0 0 0 -333.033 0 -1577.12 0 0 0 1015.43 0 0 0 79.7296 0 0 0 -327.235 0 0 -370.571 0 0 -1653.87 0 0 0 0 
0 0 0 0 275.353 0 0 0 -1610.69 0 0 0 0 0 -919.446 0 678.961 0 0 0 1619.24 0 0.09 0 0 0 0 0 -202.567 0 1668.22 0 1215.78 0 -839.03 -1608.4 2335.81 691.473 0 1872.54 0 0 -522.401 -469.298 0 300.531 -643.559 0 0 0 0 0 0 0 0 0 -137.562 0 0 -669.042 0 0 0 1957.69 0 0 
0 0 0 0 0 0 0 2294.61 -1024.89 0 134.663 0 0 -887.86 0 0 0 0 0 0 760.903 0 0 0.05 0 -1139.94 0 2239.68 0 0 0 0 0 0 0 2114.7 0 0 -589.846 1569.64 0 658.361 1821.42 0 0 0 0 0 1310.54 0 0 0 -1853.77 -1878.8 0 0 0 -1401.33 0 0 0 2259.21 1399.5 1942.27 0 -1289.03 
0 0 0 0 0 0 0 0 0 -1750.62 0 0 0 0 0 0 0 922.651 0 1687.29 0 0 0 0 0.06 0 -447.935 0 0 0 0 0 0 0 0 0 0 644.78 -1102.25 0 0 0 0 0 0 0 0 -254.601 0 -995.743 -1266.44 0 0 0 0 -844.981 1136.28 0 0 1344.26 0 0 1065.94 0 0 0 
0 1986.07 0 0 0 0 0 0 2438.05 0 0 0 0 0 0 0 0 0 -902.356 0 0 0 0 -1963.03 0 0.01 0 0 640.965 0 0 0 2022.84 0 0 670.11 1820.51 0 0 0 0 0 -1077.68 0 0 0 0 0 62.4866 367.824 0 0 0 0 0 348.75 0 0 0 0 0 0 0 0 0 0 
0 0 0 0 981.246 0 2198.63 0 2010.03 0 0 2234.64 0 0 0 0 0 0 0 0 0 0 0 0 892.743 0 0.04 0 0 2078.84 0 0 0 0 0 0 0 0 0 -2449.34 0 2364.5 0 0 0 0 0 -615.177 0 0 0 521.638 0 940.199 0 0 0 0 0 -2480.32 0 -274.743 -1683.94 0 0 0 
0 0 0 0 0 0 0 0 0 173.574 0 0 0 2301.02 0 0 0 0 -803.323 0 0 0 0 835.063 0 0 0 0.09 0 0 0 0 0 0 582.217 0 0 0 1262.47 -136.952 0 0 0 1479.31 0 702.46 0 0 0 0 0 0 0 0 1706.67 0 0 0 0 0 0 0 0 0 0 0 
1358.3 0 0 824.534 0 0 0 0 1903.21 0 -158.62 0 1436.89 0 0 818.125 0 0 0 0 0 1635.26 1049 0 0 450.987 0 0 0.08 0 0 0 0 0 0 -1871.93 0 0 2315.36 1048.69 0 0 0 139.241 84.0022 46.1592 0 0 0 -1802.96 -1401.33 0 0 0 -2313.99 0 -2290.95 0 0 0 0 0 -1200.06 0 0 0 
0 0 0 0 1884.14 0 0 0 0 0 0 0 0 783.944 -684.454 0 0 0 763.344 2453.31 -187.765 0 0 0 0 0 2270.65 0 0 0.04 0 0 0 1088.98 -451.445 2459.26 -898.236 1538.06 0 0 0 0 374.233 0 0 1062.58 0 0 0 0 -2065.57 0 0 -1853.01 -1692.02 -2215.11 -1861.4 0 0 -1205.71 -562.99 0 0 0 0 0 
0 0 -193.106 0 0 0 0 0 0 0 0 0 181.051 0 1283.53 -378.506 0 0 -48.6007 0 0 0 1252.1 0 0 0 0 0 0 0 0.08 0 1080.58 0 186.85 0 0 0 -2294.61 0 0 -1580.32 0 0 1786.78 443.51 0 1277.58 -61.7237 0 -643.559 0 0 0 0 2299.49 1714.91 0 0 0 0 0 0 0 0 0 
2277.37 1801.74 0 0 844.829 0 1704.38 0 0 0 0 -1591.46 537.812 0 0 0 1373.56 -183.493 -1102.4 0 0 0 0 0 0 0 0 0 0 0 0 0.06 0 0 0 0 0 0 1978.44 0 0 0 0 0 -2256.31 0 0 506.073 0 0 2240.14 1264.76 842.235 1655.1 0 0 0 518.281 0 0 0 0 1980.57 0 0 0 
0 0 1574.98 0 -891.217 0 0 0 0 98.1933 -198.904 1348.84 870.312 0 0 2464.75 0 0 -892.59 0 0 0 1875.13 0 0 -77.4407 0 0 0 0 1896.5 0 0.07 0 337.153 0 0 0 0 0 0 -2089.83 0 -1239.43 0 -1378.14 0 0 0 0 0 -2443.08 171.59 0 2238.61 0 -336.848 0 0 0 0 0 0 1087.76 276.879 0 
0 -528.809 0 0 0 900.067 0 -527.131 0 0 0 1275.75 0 0 0 0 0 0 0 0 0 278.1 0 0 0 0 0 0 0 -439.39 0 0 0 0.02 1204.95 2099.6 0 2301.48 0 0 -721.534 0 0 0 1271.78 0 0 874.432 1885.66 0 0 0 0 93.1578 -2390.29 0 0 0 0 0 -120.472 0 0 -833.079 0 0 
0 0 0 0 0 0 0 0 0 0 0 0 378.201 0 0 -250.481 -1980.42 0 0 0 0 0 2176.5 0 0 0 0 474.029 0 1308.4 898.083 0 752.358 1957.53 0.03 0 438.932 1922.44 0 0 0 -14.7252 0 2096.09 0 -1187.09 0 1561.25 0 1267.51 -2004.23 0 1249.96 0 0 0 -757.088 0 0 0 0 0 0 0 0 0 
-114.521 -394.528 0 0 0 1522.49 -171.743 0 0 0 314.417 0 0 0 0 0 0 0 0 518.586 0 2286.83 1192.74 -770.516 0 -816.294 0 0 1273 -2064.81 0 0 0 -699.561 0 0.04 0 0 0 0 2390.13 0 1937.54 0 -1712.32 0 396.664 0 0 0 0 0 0 2082.35 0 0 0 0 0 -1443.6 0 1890.55 0 0 0 0 
0 0 0 0 0 1322.75 0 0 0 0 0 2054.73 0 1979.66 -209.738 0 0 0 1564.3 0 0 0 2497.25 0 0 517.823 0 0 0 1027.18 0 0 0 0 1108.81 0 0.01 0 0 0 0 0 0 -102.466 2228.54 0 0 0 0 0 0 2013.84 0 0 0 -694.067 -1897.11 -1654.48 0 0 0 0 0 0 0 0 
0 0 1362.27 -870.617 0 0 0 0 0 -1875.9 0 1748.48 0 0 0 0 0 0 0 0 1995.38 0 2211.29 0 1421.78 0 0 0 0 -894.116 0 0 0 -987.35 -448.698 0 0 0.07 0 0 575.961 0 0 -1571.02 0 0 0 0 -1050.22 0 652.562 -342.799 0 180.135 0 1545.99 1933.42 0 0 0 0 0 0 0 0 0 
0 0 0 409.482 1827.98 155.11 0 0 0 0 0 0 0 -404.599 0 -1861.09 0 2318.26 1894.51 0 1205.71 0 0 247.276 1311.91 0 0 841.319 1432.16 0 -1787.39 -1992.02 0 0 0 0 0 0 0.08 0 0 0 -2257.38 -2132.1 0 0 940.962 0 0 0 2138.97 0 1891.92 0 0 -1251.18 0 0 0 0 1322.44 0 0 367.672 -1485.11 0 
0 0 0 0 0 0 0 2248.22 0 0 0 0 0 -1585.06 -2276.6 0 -1357.54 0 0 0 1776.1 0 2161.85 -912.885 0 0 -25.2541 510.956 -833.689 0 0 0 0 0 0 0 0 0 0 0.03 0 0 1171.22 0 0 719.092 0 0 0 0 723.518 0 -1384.55 0 0 0 0 0 0 0 574.74 0 0 0 0 0 
0 650.883 -2438.66 2357.63 0 0 0 0 0 0 0 0 -520.569 -1350.37 0 0 0 564.821 0 0 0 0 0 0 0 0 0 0 0 0 0 0 0 -1079.97 0 1867.66 0 -649.968 0 0 0.03 0 539.644 0 0 0 0 0 0 0 0 0 0 0 1290.86 0 0 0 -1521.58 -795.236 1624.58 0 0 0 0 0 
0 2088.46 2089.37 0 0 0 -305.414 0 0 2166.59 0 376.217 2212.97 0 0 -199.515 -1045.34 0 0 -1481.6 0 218.284 0 2316.74 0 0 338.069 0 0 0 -1100.57 0 351.039 0 853.526 0 0 0 0 0 0 0.01 -439.238 0 0 0 0 697.272 -2192.98 0 -296.411 0 0 0 2319.48 2145.99 568.636 0 -1770.46 0 0 790.506 0 0 0 0 
0 0 397.732 0 0 -778.451 0 0 0 0 0 296.869 0 0 0 0 0 0 0 376.217 0 0 2163.84 -709.174 0 2197.56 0 0 0 89.0378 0 0 0 0 0 71.4896 0 0 490.509 -684.606 888.318 483.947 0.02 1593.3 0 0 0 0 0 0 0 -2371.21 0 0 0 0 0 0 0 0 0 0 0 0 0 -2215.41 
0 0 0 0 0 0 0 0 -1621.52 0 0 0 0 -213.706 -503.937 -472.655 0 -1921.37 0 0 1927.93 350.124 1760.23 0 0 0 0 -1383.02 1748.18 0 0 0 1759.62 0 -552.461 0 -155.263 -1012.53 906.476 0 0 0 1240.81 0.06 0 1551.48 0 710.395 0 0 0 -1734.6 2495.42 0 0 0 0 -1086.69 0 0 0 0 0 2125.69 0 0 
0 0 0 0 0 0 0 0 0 -592.441 0 0 1661.66 0 0 2267.91 0 0 0 1030.99 0 0 0 0 0 0 0 0 1350.83 0 -208.365 2226.86 0 2377.62 0 -1483.58 -1144.37 0 0 0 0 0 0 0 0.03 522.706 0 0 -803.934 0 0 0 0 -292.596 0 0 0 0 0 1874.83 0 0 0 0 0 0 
0 0 0 0 0 1234.86 0 -42.9548 -1558.35 275.506 917.768 0 0 0 0 1979.05 1618.32 1952.8 0 1193.35 -447.783 0 1819.59 0 0 0 0 1789.22 -2141.71 -521.638 -1523.26 0 1668.07 0 -1256.37 0 0 0 0 -1813.03 0 0 0 61.1133 307.245 0.09 0 0 0 0 0 0 794.778 0 1463.9 0 -1999.65 1797.16 0 0 0 1050.37 0 0 -535.676 -1102.56 
-1753.82 0 -1107.9 0 0 0 0 148.854 -467.925 0 -2410.58 0 315.485 0 2365.26 0 0 -593.204 0 0 0 0 1088.37 0 0 0 0 0 0 0 0 0 0 0 0 1526.31 0 0 1947.16 0 0 0 0 0 0 0 0.03 0 0 0 0 0 1707.13 0 -445.647 0 -1424.99 0 0 1542.94 0 2290.8 0 0 0 0 
74.5415 0 0 0 0 0 0 0 0 0 0 0 1531.19 0 0 0 0 -846.355 0 2414.4 2281.03 -959.883 0 0 1775.03 0 1308.1 0 0 0 -1400.88 2124.77 0 135.426 -2414.55 0 0 0 0 0 0 936.995 0 -2461.55 0 0 0 0.05 0 0 0 0 -15.4881 0 0 0 0 0 0 0 0 -671.331 0 0 0 0 
0 -284.661 0 1446.35 0 0 0 1721.78 0 0 521.332 0 0 0 0 0 0 0 -1666.84 0 0 0 0 -1806.01 0 -1788.61 0 0 0 0 -186.239 0 0 398.801 0 0 0 1161.92 0 0 0 -460.906 0 0 -12.1311 0 0 0 0.09 0 1392.94 1380.12 0 0 0 0 2269.43 0 0 0 0 0 -1359.07 0 0 0 
0 0 0 -471.587 -1790.6 0 0 0 0 0 2023.45 0 1895.89 -1566.44 0 0 0 0 0 0 0 0 0 0 2466.43 1811.04 0 0 717.414 0 0 0 0 0 1991.1 0 0 0 0 0 0 0 0 0 0 0 0 0 0 0.07 0 1339.84 0 0 2443.85 -1425.29 0 -2327.11 0 0 0 0 1176.56 0 0 1329.46 
-2405.09 1994.31 0 0 0 0 -1435.97 672.399 1208.15 0 0 0 0 0 0 0 0 -888.928 0 0 0 0 0 0 674.535 0 0 0 320.978 1922.44 -208.06 -556.429 0 0 752.51 0 0 2490.84 -1255.61 1569.19 0 643.254 0 0 0 0 0 0 -1741.61 0 0.01 1243.1 0 0 0 0 0 0 0 0 -858.867 1160.7 0 -1488.31 0 -893.658 
-1259.27 0 -2027.57 1647.77 -285.882 0 0 861.003 751.595 0 -20.6763 0 0 0 0 0 1352.5 -888.623 0 0 0 1568.12 0 0 0 0 -969.344 0 0 0 0 1277.12 1751.69 0 0 0 918.683 2253.41 0 0 0 0 1995.53 -450.53 0 0 0 0 -1844.77 -1405.3 -1421.02 0.04 0 0 2114.09 670.873 0 837.962 0 0 -789.132 -1901.53 -1371.58 0 0 0 
0 0 0 0 -650.731 0 0 0 0 0 0 0 0 0 0 0 1773.35 0 0 0 0 0 0 -273.675 0 0 0 0 0 0 0 -2028.03 -2135 0 -1805.55 0 0 0 364.467 1912.21 0 0 0 524.995 0 479.522 -285.882 114.826 0 0 0 0 0.03 0 0 0 2070.6 0 238.731 0 0 0 0 0 0 0 
0 0 0 0 0 0 2183.22 0 2368.01 0 0 -834.91 0 0 0 -810.038 0 0 676.672 0 0 0 0 -601.444 0 0 1856.97 0 0 468.078 0 1036.79 0 163.045 0 342.494 0 -1828.75 0 0 0 0 0 0 -216.453 0 0 0 0 0 0 0 0 0.05 2278.44 0 65.2333 0 0 0 0 0 0 0 0 0 
0 0 261.773 -2331.69 0 0 872.753 0 0 0 0 -1819.59 0 0 -821.329 252.312 0 0 0 0 0 0 0 0 0 0 0 2390.9 -30.2896 -2063.74 0 0 -1963.33 216.605 0 0 0 0 0 0 -1137.65 -830.18 0 0 0 1291.62 369.961 0 0 1614.35 0 1732.46 0 2487.18 0.03 2274.32 0 0 0 397.275 2061.45 0 278.253 0 0 0 
1529.66 -238.426 0 0 0 429.319 0 0 -1910.23 0 1451.38 1145.13 0 1289.33 0 0 -1149.56 0 0 0 0 -2476.96 0 0 -906.323 -1431.09 0 0 0 280.999 -1180.99 0 0 0 0 0 1454.13 1591.31 71.6422 0 0 979.415 0 0 0 0 0 0 0 -1807.69 0 -845.439 0 0 1696.6 0.08 0 -185.629 0 0 0 1148.64 0 0 0 0 
0 0 1984.69 -201.804 0 0 0 1988.97 0 0 0 0 -1399.81 0 0 0 0 1765.11 26.9326 -11.8259 0 0 -1664.1 0 208.67 0 0 0 -2472.38 1480.68 -1729.41 0 2228.84 0 1229.97 0 -285.272 174.49 0 0 0 -2458.04 0 0 0 1417.05 -138.63 0 2428.89 0 0 0 -74.5415 -1224.94 0 0 0.03 0 2410.28 0 0 1990.8 1093.1 0 1900.62 0 
0 0 0 0 0 1757.03 0 -129.78 0 0 0 857.799 0 0 0 0 0 0 0 0 1117.97 0 0 -1071.12 0 0 0 0 0 0 0 -531.556 0 0 0 0 1724.68 0 0 0 0 0 0 648.289 0 -2176.96 0 0 0 -1397.67 0 -891.675 0 0 0 2025.89 0 0.03 0 563.295 0 1317.41 -651.036 0 0 958.205 
160.451 1233.02 0 0 0 0 -327.998 0 0 0 -733.284 0 0 1600.47 1088.67 2297.66 0 0 0 0 0 2353.21 0 0 0 0 0 0 0 0 0 0 0 0 0 0 0 0 0 0 -1883.98 1234.55 0 0 0 0 0 0 0 0 0 0 -1349.3 0 0 0 528.504 0 0.09 0 0 0 0 0 0 0 
-840.861 0 0 0 0 1205.4 0 0 0 0 -1540.04 0 0 0 0 0 939.436 1086.69 0 0 0 0 1955.24 0 1334.8 0 852 0 0 -1968.37 0 0 0 0 0 2349.7 0 0 0 0 1762.98 0 0 0 -691.931 0 106.433 0 0 0 0 0 0 0 -1403.62 0 0 2498.63 0 0.03 0 0 0 1194.27 0 0 
0 0 -558.412 0 0 -339.442 0 0 0 0 0 0 0 1354.64 20.5237 0 0 -962.477 0 2173.6 1946.7 0 0 0 0 0 0 0 0 581.454 0 0 0 1461.3 0 0 0 0 283.288 2413.02 1419.03 0 0 0 0 0 0 0 0 0 2196.65 -843.303 0 0 579.318 0 0 0 0 0 0.03 0 0 1894.36 -1970.81 -2304.53 
0 0 0 0 0 2399.59 0 0 0 0 0 669.195 0 0 -1581.24 563.601 0 -212.485 286.95 0 0 -2248.83 0 344.02 0 0 2499.39 0 0 0 0 0 0 0 0 717.414 0 0 0 0 0 -1613.74 0 0 0 692.389 1826.91 460.601 0 0 -356.075 900.677 0 0 0 1977.98 -741.523 2152.39 0 0 0 0.03 0 0 0 0 
0 0 0 0 0 0 0 0 0 246.361 2075.95 0 0 0 0 622.654 0 0 0 0 0 0 0 2477.11 -455.26 0 -2192.22 0 346.461 0 0 2284.39 0 0 0 0 0 0 0 0 0 0 0 0 0 0 0 0 -476.012 1133.23 0 1309.02 0 0 1868.72 0 -150.227 2472.23 0 0 0 0 0.09 1592.68 0 0 
0 0 -1934.03 0 0 702.918 2391.96 0 1141.32 502.258 0 0 0 -1223.72 0 1124.68 0 0 -683.386 0 0 0 1499.6 -1454.74 0 0 0 0 0 0 0 0 2218.77 -419.248 0 0 0 0 -2223.96 0 0 0 0 2268.06 0 0 0 0 0 0 1360.74 0 0 0 0 0 0 0 0 -815.836 1940.44 0 2330.16 0.06 0 0 
0 1928.24 0 0 0 0 0 0 0 0 0 0 0 0 0 0 0 0 0 0 0 0 0 0 0 0 0 0 0 0 0 0 -2170.25 0 0 0 0 0 2044.51 0 0 0 0 0 0 -133.442 0 0 0 0 0 0 0 0 0 0 -332.575 0 0 0 -1244.77 0 0 0 0.09 0 
0 0 0 0 0 0 0 0 0 0 0 0 0 0 0 0 1247.83 0 0 0 0 0 0 351.344 0 0 0 0 0 0 0 0 0 0 0 0 0 0 0 0 0 0 752.51 0 0 2053.51 0 0 0 -2024.52 802.103 0 0 0 0 0 0 1701.18 0 0 1776.1 0 0 0 0 0.04 
