*Vertices 69
*Matrix 
0.08 0 0 0 0 0 0 0 0 0 0 0 0 0 573.214 0 0 0 0 0 0 0 0 0 0 0 0 0 0 0 0 0 0 0 0 0 0 0 0 0 0 0 0 2303.61 -542.695 0 939.894 0 0 0 0 2183.37 1515.78 0 0 0 0 1117.05 0 0 0 0 0 0 1636.78 158.01 -615.635 0 0 
0 0.09 0 0 0 2303.16 0 0 0 0 0 0 2109.97 0 0 0 0 0 0 0 0 450.987 0 0 0 0 0 0 0 0 0 0 0 0 0 350.429 0 0 0 0 0 1861.25 0 0 0 0 0 0 0 0 0 0 0 0 0 0 0 0 0 0 -2039.32 0 0 0 0 0 0 0 0 
0 0 0.03 2043.29 0 1705.91 0 0 0 0 0 0 0 0 0 0 0 0 0 0 0 0 0 0 0 238.426 0 0 0 0 0 0 0 0 0 0 551.698 0 0 0 0 0 0 0 0 0 0 0 0 0 2054.89 0 0 0 0 0 0 0 0 0 0 -129.017 0 0 0 0 0 0 0 
0 0 2482.6 0.05 0 2106.62 0 0 0 0 0 0 0 0 0 0 0 0 0 0 0 0 0 0 0 0 0 -418.18 0 0 884.045 0 0 457.701 0 0 0 0 0 0 0 1708.2 0 0 0 0 0 0 0 0 0 0 0 0 0 0 0 2287.13 0 0 0 0 0 -1978.44 0 0 0 0 0 
0 0 0 0 0.07 0 2369.53 0 0 0 0 0 0 0 0 0 0 0 0 0 0 0 0 -35.783 0 0 0 0 0 1256.22 0 0 0 0 1089.74 0 0 0 0 0 0 0 0 0 2450.71 1670.81 0 -2454.99 0 0 0 0 0 0 0 0 0 0 0 0 0 0 0 0 0 0 0 0 0 
0 1715.67 1836.68 1607.79 0 0.06 0 0 0 0 0 0 0 0 0 0 0 0 0 183.798 0 -603.122 0 -2229.45 0 0 0 391.781 0 0 0 0 0 0 0 0 0 0 0 0 0 0 0 0 0 0 0 0 0 0 0 0 0 0 0 0 -902.356 2092.73 0 0 0 0 0 0 0 0 0 0 0 
0 0 0 0 1588.87 0 0.04 0 0 0 -225.608 0 0 1871.32 0 -1438.26 0 0 0 0 0 0 0 0 1107.59 0 0 0 621.586 0 0 0 -1983.02 0 0 0 0 0 0 0 0 0 -326.319 0 0 0 0 71.4896 0 617.008 0 0 0 0 0 0 0 0 0 0 0 0 0 0 0 0 0 0 0 
0 0 0 0 0 0 0 0.08 1203.73 -2346.95 0 0 0 0 0 0 0 1926.25 0 0 0 0 0 0 0 0 0 0 0 0 0 0 0 0 0 0 0 0 0 0 0 2444.61 0 -1551.79 0 1254.54 0 0 0 0 0 897.931 0 -1114.92 0 0 0 0 0 0 0 0 0 0 0 0 0 0 0 
0 0 0 0 0 0 0 590.609 0.02 0 0 0 0 0 0 0 0 0 0 -1271.78 2306.21 0 1614.66 0 0 0 0 0 -301.752 0 1474.27 0 183.95 0 0 0 0 0 0 0 0 0 0 0 0 0 0 0 0 0 0 0 0 0 0 0 0 0 0 0 0 0 0 0 2293.69 0 0 0 0 
0 0 0 0 0 0 0 -855.663 0 0.07 0 0 -2196.34 0 0 0 890.454 0 0 0 -22.5074 0 0 0 0 0 0 2366.33 0 0 0 0 0 -2498.63 0 0 0 0 0 -302.667 0 -1067.77 0 0 1412.63 0 0 0 0 0 1787.39 0 1061.05 0 0 1719.64 2276.45 0 1629 0 0 0 2000.41 0 0 0 0 0 0 
0 0 0 0 0 0 1830.42 0 0 0 0.05 0 0 0 0 0 0 0 0 0 0 0 0 0 0 0 0 0 1286.58 0 0 0 -93.6155 0 0 0 0 0 0 0 -2426.76 0 0 0 0 0 0 0 0 0 0 0 0 0 0 0 0 0 0 0 0 0 1894.82 0 1605.2 0 0 0 0 
0 0 0 0 0 0 0 0 0 0 0 0.07 0 0 0 0 0 0 0 0 0 0 1393.09 -1860.33 0 0 0 2311.4 0 89.8007 1806.01 0 0 0 0 0 0 275.506 0 0 0 0 -1492.43 0 854.442 2279.35 0 0 0 0 1065.78 0 0 0 0 0 0 0 0 -2476.65 0 0 0 0 0 0 0 0 0 
0 -1635.26 0 0 0 0 0 0 0 2272.79 0 0 0.04 0 2069.38 0 0 0 0 0 -581.454 0 0 0 2273.25 0 0 0 0 -2437.59 0 0 0 0 -751.9 0 0 0 0 0 0 0 0 0 0 0 -819.041 0 0 0 0 0 0 0 0 0 0 0 0 -604.495 0 658.971 0 0 0 556.276 0 0 0 
0 0 0 0 0 0 850.475 0 0 0 0 0 0 0 0 0 0 0 0 0 0 0 0 -72.8629 0 0 0 0 0 0 967.36 0 0 -819.956 2277.83 0 0 0 0 0 0 0 0 0 0 0 0 0 0 0 -1008.56 0 0 0 0 0 0 0 0 0 0 -747.475 0 0 0 0 0 0 0 
2462.77 0 0 0 0 0 0 0 0 0 0 0 798.898 0 0.01 0 0 0 0 0 0 0 0 0 0 0 0 0 0 0 0 0 -88.7326 0 0 0 0 1307.34 0 0 128.864 0 0 0 -633.946 0 0 0 0 0 0 0 0 0 -351.955 0 0 2146.14 0 -1732.31 0 0 2467.35 0 0 0 0 1992.32 0 
0 0 0 0 0 0 1869.03 0 0 0 0 0 0 0 0 0.04 0 0 0 0 0 0 0 0 0 0 0 0 0 363.552 0 0 0 0 0 0 -577.487 250.633 -222.861 0 0 0 0 0 0 0 0 0 0 0 0 0 0 0 0 0 0 0 0 0 0 0 0 0 0 0 0 0 0 
0 0 0 0 0 0 0 0 0 491.729 0 0 0 0 0 0 0.09 -127.949 0 0 126.728 0 0 0 0 0 0 0 0 0 0 0 0 0 0 0 0 0 0 0 0 0 0 0 0 0 0 0 0 0 -592.288 0 0 0 0 0 0 0 0 0 0 0 1531.04 0 0 0 0 0 0 
0 0 0 0 0 0 0 1565.83 0 0 0 0 0 0 0 0 1923.66 0 0 0 0 0 0 0 0 0 871.38 0 0 0 0 0 -194.174 0 0 0 0 0 0 0 0 0 1280.94 0 0 0 0 0 0 0 0 0 0 0 0 0 0 0 0 -1462.68 0 0 0 0 0 0 0 0 0 
0 0 0 0 0 0 0 0 0 0 0 0 0 0 0 0 0 0 0 0 0 0 0 0 0 0 0 0 0 -5.11185 0 0 0 0 0 0 0 0 0 -1943.65 0 0 0 0 431.303 0 0 0 0 0 0 0 0 1285.06 -427.03 0 0 0 2493.9 0 0 -2319.03 0 0 878.399 0 0 0 0 
0 0 0 0 0 -1583.83 0 0 1970.2 0 0 0 0 0 0 0 0 0 0 0.06 0 0 993.606 0 0 0 0 0 0 0 0 0 0 0 0 0 0 0 0 0 0 0 0 0 0 2043.9 0 0 0 0 0 1806.01 0 0 0 0 0 0 -2287.9 0 0 829.264 0 0 1224.02 0 0 0 0 
0 0 0 0 0 0 0 0 1666.39 2390.74 0 0 -2201.99 0 0 0 -985.214 0 0 0 0 0 0 -2406.77 0 0 0 0 0 0 0 0 0 0 0 0 0 0 1692.02 0 0 0 0 0 0 0 0 0 0 0 0 0 0 2000.26 0 0 0 0 0 0 2061.91 0 0 0 0 0 0 -2234.34 0 
0 -197.836 0 0 0 1901.07 0 0 0 0 0 0 0 0 0 0 0 0 0 0 0 0.04 0 1665.93 0 0 0 0 0 0 0 0 0 0 0 0 0 0 0 0 0 0 0 -429.167 -283.288 0 1861.71 0 380.642 0 0 0 0 0 0 0 0 0 1253.93 0 0 0 0 1383.63 -1527.68 1602.3 0 0 0 
0 0 0 0 0 0 0 0 1976 0 0 -2484.89 0 0 0 0 0 0 0 1970.66 0 0 0.02 0 0 0 0 0 0 0 0 0 0 -633.03 0 0 0 0 0 0 0 0 0 0 680.334 0 0 1408.81 0 0 0 0 0 340.358 0 0 0 2303.31 0 0 0 0 0 0 0 0 0 0 0 
0 0 0 0 1545.08 1608.4 0 0 0 0 0 -304.651 0 -738.929 0 0 0 0 0 0 -55.1622 -267.418 0 0.07 0 0 0 0 0 646.763 0 0 0 0 0 0 0 0 0 0 0 0 0 0 0 0 0 0 0 0 0 0 0 0 0 0 0 0 0 0 0 0 0 0 426.572 779.672 0 0 0 
0 0 0 0 0 0 2282.71 0 0 0 0 0 1073.72 0 0 0 0 0 0 0 0 0 0 0 0.09 0 0 0 0 2254.78 -2222.43 0 0 0 1498.38 1026.41 0 548.036 0 0 1941.21 1557.28 0 0 0 0 0 629.063 0 0 0 0 0 0 0 0 0 0 0 0 0 0 0 44.7859 758.003 0 0 0 0 
0 0 -1079.06 0 0 0 0 0 0 0 0 0 0 0 0 0 0 0 0 0 0 0 0 0 0 0 -263.909 0 0 0 0 0 0 0 0 0 0 0 0 0 0 1400.72 0 0 0 0 0 0 0 814.158 1828.59 0 0 0 2222.74 1849.04 2106.77 0 0 0 0 -2305.44 0 0 0 0 0 0 0 
0 0 0 0 0 0 0 0 0 0 0 0 0 0 0 0 0 -1242.03 0 0 0 0 0 0 0 -81.4081 0.03 0 0 0 2009.57 0 0 0 0 0 0 0 1570.41 -866.497 0 0 0 0 0 0 0 -1631.9 0 0 0 0 0 0 0 0 0 0 0 0 815.378 0 0 0 2434.23 0 0 0 0 
0 0 0 1833.48 0 1127.12 0 0 0 -2292.78 0 2191.46 0 0 0 0 0 0 0 0 0 0 0 0 0 0 0 0.06 0 0 0 0 0 0 0 0 0 0 0 0 0 0 0 0 0 0 0 247.124 1221.12 0 0 0 0 0 0 419.095 2019.94 0 0 0 0 0 0 0 0 0 0 0 0 
0 0 0 0 0 0 1186.94 0 2206.72 0 1816.84 0 0 0 0 0 0 0 0 0 0 0 0 0 0 0 0 0 0.07 0 0 0 0 0 1413.39 0 0 0 0 950.423 0 0 0 0 0 0 0 0 0 0 -388.882 0 -839.03 0 0 0 0 0 0 0 0 0 0 0 0 0 0 0 -1686.53 
0 0 0 0 624.79 0 0 0 0 0 0 2171.32 1965.62 0 0 -1463.44 0 0 -2427.06 0 0 0 0 1744.97 -944.166 0 0 0 0 0 0 2177.88 0 387.814 0 0 967.666 0 0 0 0 0 0 0 0 0 0 0 2000.56 0 0 0 0 -703.528 -2169.48 0 0 0 0 665.38 0 0 -1566.44 0 0 0 0 0 0 
0 0 0 2407.38 0 0 0 0 -319.605 0 0 1336.94 0 -1832.26 0 0 0 0 0 0 0 0 0 0 -308.161 0 522.858 0 0 0 0.09 0 0 396.817 -662.023 0 0 578.249 0 0 0 0 0 0 0 0 0 0 0 1057.85 0 0 0 295.953 1577.12 0 0 0 0 0 0 0 0 0 0 0 0 0 0 
0 0 0 0 0 0 0 0 0 0 0 0 0 0 0 0 0 0 0 0 0 0 0 0 0 0 0 0 0 -453.581 0 0.01 0 0 0 0 0 0 0 0 0 0 0 0 0 0 0 0 0 0 0 0 1321.53 0 0 0 0 0 0 0 1488.62 0 0 0 0 0 0 0 0 
0 0 0 0 0 0 -1336.18 0 443.205 0 1899.7 0 0 0 980.636 0 0 1381.5 0 0 0 0 0 0 0 0 0 0 0 0 0 0 0 0 0 299.768 0 0 0 0 0 0 527.284 0 0 0 2478.18 0 0 0 2355.95 0 0 0 1312.83 0 0 0 -1647.16 0 0 0 -1945.02 0 1806.01 0 0 0 0 
0 0 0 -685.217 0 0 0 0 0 2045.43 0 0 0 -1388.82 0 0 0 0 0 0 0 0 2029.56 0 0 0 0 0 0 -1424.07 1178.85 0 0 0.01 1969.13 0 0 0 1569.49 0 0 0 0 0 0 0 0 0 822.398 0 0 0 0 2217.4 0 0 1528.29 0 0 0 0 0 0 0 0 0 0 0 2350.61 
0 0 0 0 1211.2 0 0 0 0 0 0 0 -499.512 922.803 0 0 0 0 0 0 0 0 0 0 387.051 0 0 0 351.192 0 -2148.12 0 0 1432.46 0.07 0 0 0 0 0 0 0 1710.18 0 0 0 0 0 0 0 0 -1762.37 0 0 1704.69 0 1306.73 0 0 0 0 -1835 0 0 0 0 0 0 0 
0 -1671.58 0 0 0 0 0 0 0 0 0 0 0 0 0 0 0 0 0 0 0 0 0 0 1982.86 0 0 0 0 0 0 0 -962.935 0 0 0 0 0 903.882 2436.37 0 0 1292.38 0 0 0 -285.577 0 0 0 -871.99 0 -1975.69 0 0 0 438.169 0 0 0 0 -870.312 0 0 0 0 0 0 0 
0 0 749.001 0 0 0 0 0 0 0 0 0 0 0 0 -28.0007 0 0 0 0 0 0 0 0 0 0 0 0 0 -2084.49 0 0 0 0 0 0 0.09 0 -494.781 0 0 0 0 2164.6 0 0 0 0 0 0 0 0 0 0 -531.251 0 0 0 775.857 0 0 0 0 0 0 0 0 0 0 
0 0 0 0 0 0 0 0 0 0 0 1598.79 0 0 -45.5489 -143.818 0 0 0 0 0 0 0 0 2132.86 0 0 0 0 0 -1382.87 0 0 0 0 0 0 0.01 0 2418.36 0 0 750.679 0 0 -1618.93 0 1869.64 0 871.532 0 0 0 0 0 0 0 0 0 0 0 0 0 0 0 0 0 0 0 
0 0 0 0 0 0 0 0 0 0 0 0 0 0 0 -964.766 0 0 0 0 1286.28 0 0 0 0 0 -2347.87 0 0 0 0 0 0 1035.72 0 2135 1381.5 0 0.01 0 0 0 0 -2367.55 0 0 0 0 0 0 0 0 2412.26 0 -278.558 0 567.568 21.4393 0 0 0 0 0 0 0 0 0 0 0 
0 0 0 0 0 0 0 0 0 1945.33 0 0 0 0 0 0 0 0 2432.25 0 0 0 0 0 0 0 699.255 0 934.095 0 0 0 0 0 0 872.6 0 -1327.02 0 0.01 0 0 0 -1771.22 0 0 0 0 0 0 1052.05 0 0 0 0 0 0 0 0 151.143 0 0 0 0 0 0 0 0 0 
0 0 0 0 0 0 0 0 0 0 -1582.61 0 0 0 836.894 0 0 0 0 0 0 0 0 0 -2431.03 0 0 0 0 0 0 0 0 0 0 0 0 0 0 0 0.04 0 0 0 0 0 1823.25 0 0 0 0 0 0 0 0 0 0 0 0 0 -761.666 0 0 0 0 0 886.486 0 0 
0 2161.55 0 -1889.93 0 0 0 -631.657 0 -503.937 0 0 0 0 0 0 0 0 0 0 0 0 0 0 347.072 1652.96 0 0 0 0 0 0 0 0 0 0 0 0 0 0 0 0.09 0 0 -1329.92 0 110.096 0 0 0 0 0 0 522.401 0 0 0 2352.6 0 0 0 0 0 0 0 815.073 0 0 0 
0 0 0 0 0 0 -1455.96 0 0 0 0 1627.32 0 0 0 0 0 -1369.29 0 0 0 0 0 0 0 0 0 0 0 0 0 0 118.03 0 2022.84 274.285 0 2200.46 0 0 0 0 0 1350.83 0 0 0 -44.6333 0 0 0 0 0 0 0 558.107 0 0 0 0 0 0 496.307 -18.8452 0 1216.09 0 0 0 
274.285 0 0 0 0 0 0 -1914.04 0 0 0 0 0 0 0 0 0 0 0 0 0 1940.6 0 0 0 0 0 0 0 0 0 0 0 0 0 0 885.723 0 60.0452 -359.737 0 0 1709.72 0.09 0 0 -780.282 0 0 0 0 2207.33 0 0 0 0 0 0 0 0 0 2420.8 0 0 0 243.461 -1619.54 0 0 
1982.56 0 0 0 2107.99 0 0 0 0 309.381 0 1562.01 0 0 -457.854 0 0 0 -847.27 0 0 1529.97 25.5593 0 0 0 0 0 0 0 0 0 0 0 0 0 0 0 0 0 0 -1680.12 0 0 0.04 0 0 0 0 0 0 0 0 0 0 0 0 0 0 0 0 0 0 0 2154.23 0 1852.4 0 0 
0 0 0 0 1011.76 0 0 -128.712 0 0 0 -232.78 0 0 0 0 0 0 0 1201.13 0 0 0 0 0 0 0 0 0 0 0 0 0 0 0 0 0 1084.4 0 0 0 0 0 0 0 0.09 0 0 0 0 0 0 74.5415 0 0 0 0 0 0 0 0 0 0 0 0 0 354.701 0 0 
710.7 0 0 0 0 0 0 0 0 0 0 0 -868.48 0 0 0 0 0 0 0 0 1120.56 0 0 0 0 0 0 0 0 0 0 1659.37 0 0 -1593.45 0 0 0 0 998.337 -656.682 0 2376.09 0 0 0.06 0 0 0 0 0 0 0 0 0 0 0 0 0 0 0 0 39.2926 0 0 0 0 0 
0 0 0 0 -247.429 0 971.023 0 0 0 0 0 0 0 0 0 0 0 0 0 0 0 -2169.94 0 2363.28 0 -985.366 1412.63 0 0 0 0 0 0 0 0 0 793.1 0 0 0 0 1593.6 0 0 0 0 0.06 0 0 972.549 0 0 2081.44 0 0 0 0 0 -1247.52 0 0 0 0 -960.952 0 0 0 0 
0 0 0 0 0 0 0 0 0 0 0 0 0 0 0 0 0 0 0 0 0 1888.26 0 0 0 0 0 -1906.57 0 -1390.04 0 0 0 -1215.78 0 0 0 0 0 0 0 0 0 0 0 0 0 0 0.07 701.239 0 0 2467.19 0 0 0 0 0 0 0 0 0 0 0 2017.81 0 0 0 0 
0 0 0 0 0 0 233.39 0 0 0 0 0 0 0 0 0 0 0 0 0 0 0 0 0 0 -709.174 0 0 0 0 309.687 0 0 0 0 0 0 1377.22 0 0 0 0 0 0 0 0 0 0 -551.088 0.06 0 0 0 0 0 0 0 0 0 0 1363.19 0 0 0 0 0 0 0 0 
0 0 2201.07 0 0 0 0 0 0 -638.371 0 2129.66 0 1761.91 0 0 739.998 0 0 0 0 0 0 0 0 2300.26 0 0 -1858.5 0 0 0 107.349 0 0 1735.66 0 0 0 2433.01 0 0 0 0 0 0 0 -1630.22 0 0 0.03 0 0 0 0 0 0 1853.31 0 857.036 0 0 0 0 0 1099.81 -1623.36 0 0 
-1656.62 0 0 0 0 0 0 941.267 0 0 0 0 0 0 0 0 0 0 0 1150.62 0 0 0 0 0 0 0 0 0 0 0 0 0 0 -2386.62 0 0 0 0 0 0 0 0 2043.6 0 0 0 0 0 0 0 0 0 0 0 0 0 0 0 1091.42 0 0 0 0 0 0 0 0 0 
-1859.87 0 0 0 0 0 0 0 0 1355.4 0 0 0 0 0 0 0 0 0 0 0 0 0 0 0 0 0 0 1739.63 0 0 1845.84 0 0 0 1821.42 0 0 -312.738 0 0 0 0 0 0 -2251.12 0 0 1920.76 0 0 0 0 0 0 0 0 0 0 0 0 0 0 0 0 0 0 0 0 
0 0 0 0 0 0 0 720.466 0 0 0 0 0 0 0 0 0 0 2272.33 0 -927.381 0 -2382.35 0 0 0 0 0 0 -1772.59 563.753 0 0 695.593 0 0 0 0 0 0 0 1939.53 0 0 0 0 0 2440.49 0 0 0 0 0 0.05 0 -1230.12 0 -1122.24 0 0 0 0 0 0 0 0 0 0 0 
0 0 0 0 0 0 0 0 0 0 0 0 0 0 1444.06 0 0 0 2342.22 0 0 0 0 0 0 1338.62 0 0 0 1938.31 2406.16 0 1954.02 0 -1672.03 0 839.641 0 -1963.64 0 0 0 0 0 0 0 0 0 0 0 0 0 0 0 0.07 0 1759.93 0 0 0 2365.57 1324.27 0 -2142.17 -1069.6 0 0 0 0 
0 0 0 0 0 0 0 0 0 1418.12 0 0 0 0 0 0 0 0 0 0 0 0 0 0 0 723.67 0 -615.024 0 0 0 0 0 0 0 0 0 0 0 0 0 0 2231.13 0 0 0 0 0 0 0 0 0 0 1552.1 0 0.02 0 1677.53 0 0 0 2449.19 845.744 -1959.36 0 0 0 0 0 
0 0 0 0 0 -1065.94 0 0 0 188.528 0 0 0 0 0 0 0 0 0 0 0 0 0 0 0 967.666 0 672.399 0 0 0 0 0 889.996 -990.555 -201.193 0 0 -35.3252 0 0 0 0 0 0 0 0 0 0 0 0 0 0 0 1675.08 0 0.01 0 0 0 2175.59 0 0 -1599.4 0 0 0 0 0 
2322.84 0 0 1613.28 0 2422.18 0 0 0 0 0 0 0 0 1292.23 0 0 0 0 0 0 0 -2451.17 0 0 0 0 0 0 0 0 0 0 0 0 0 0 0 608.005 0 0 1940.44 0 0 0 0 0 0 0 0 2296.75 0 0 4.80667 0 -2338.71 0 0.06 0 -646.611 0 0 -872.448 2446.75 -428.861 0 0 0 0 
0 0 0 0 0 0 0 0 0 258.721 0 0 0 0 0 0 0 0 -306.94 484.252 0 351.955 0 0 0 0 0 0 0 0 0 0 2339.17 0 0 0 2461.09 0 0 0 0 0 0 0 0 0 0 0 0 0 0 0 0 0 0 0 0 0 0.08 0 0 0 0 -1197.16 0 0 0 0 0 
0 0 0 0 0 0 0 0 0 0 0 2368.77 2120.81 0 318.232 0 0 2355.65 0 0 0 0 0 0 0 0 0 0 0 1221.73 0 0 0 0 0 0 0 0 0 570.62 0 0 0 0 0 0 0 -1343.65 0 0 -2175.74 519.807 0 0 0 0 0 -505.31 0 0.02 0 0 0 0 0 0 0 0 0 
0 -2175.74 0 0 0 0 0 0 0 0 0 0 0 0 0 0 0 0 0 0 180.135 0 0 0 0 0 643.712 0 0 0 0 -2237.24 0 0 0 0 0 0 0 0 2124.93 0 0 0 0 0 0 0 0 1165.43 0 0 0 0 2187.34 0 1572.54 0 0 0 0.08 0 0 0 0 0 0 0 0 
0 0 1537.6 0 0 0 0 0 0 0 0 0 1016.04 -1541.87 0 0 0 0 -2346.34 -2335.66 0 0 0 0 0 1042.74 0 0 0 0 0 0 0 0 1620.15 1670.81 0 0 0 0 0 0 0 -1009.32 0 0 0 0 0 0 0 0 0 0 1374.94 654.241 0 0 0 0 0 0.07 0 0 0 0 1711.86 0 0 
0 0 0 0 0 0 0 0 0 -484.1 1040.3 0 0 0 324.488 0 968.123 0 0 0 0 0 0 0 0 0 0 0 0 2026.05 0 0 746.101 0 0 0 0 0 0 0 0 0 -2014.15 0 0 0 0 0 0 0 0 0 0 0 0 2480.01 0 1446.96 0 0 0 0 0.03 453.581 0 0 0 0 0 
0 0 0 -464.11 0 0 0 0 0 0 0 0 0 0 0 0 0 0 0 0 0 1966.08 0 0 -565.889 0 0 0 0 0 0 0 0 0 0 0 0 0 0 0 0 0 539.491 0 0 0 357.295 0 0 0 0 0 0 0 356.685 -995.59 -2436.06 1592.53 -424.131 0 0 0 2185.81 0.07 0 0 0 0 0 
536.744 0 0 0 0 0 0 0 -438.627 0 -275.658 0 0 0 0 0 0 0 -2205.19 -1093.55 0 -2054.28 0 1777.17 77.8985 0 1855.45 0 0 0 0 0 1574.98 0 0 0 0 0 0 0 0 0 0 0 2209.16 0 0 -2369.23 2027.12 0 0 0 0 0 767.769 0 0 1678.29 0 0 0 0 0 0 0.05 117.115 -1865.67 0 0 
-2170.09 0 0 0 0 0 0 0 0 0 0 0 1012.53 0 0 0 0 0 0 0 0 1680.58 0 551.393 0 0 0 0 0 0 0 0 0 0 0 0 0 0 0 0 0 2479.71 -521.943 851.695 0 0 0 0 0 0 -690.1 0 0 0 0 0 0 0 0 0 0 0 0 0 -1625.34 0.03 0 0 0 
579.318 0 0 0 0 0 0 0 0 0 0 0 0 0 0 0 0 0 0 0 0 0 0 0 0 0 0 0 0 0 0 0 0 0 0 0 0 0 0 0 -1818.83 0 0 1183.28 -422.3 692.846 0 0 0 0 1796.24 0 0 0 0 0 0 0 0 0 0 -1021.99 0 0 482.727 0 0.08 0 0 
0 0 0 0 0 0 0 0 0 0 0 0 0 0 1942.88 0 0 0 0 0 1947.61 0 0 0 0 0 0 0 0 0 0 0 0 0 0 0 0 0 0 0 0 0 0 0 0 0 0 0 0 0 0 0 0 0 0 0 0 0 0 0 0 0 0 0 0 0 0 0.02 0 
0 0 0 0 0 0 0 0 0 0 0 0 0 0 0 0 0 0 0 0 0 0 0 0 0 0 0 0 2329.86 0 0 0 0 639.744 0 0 0 0 0 0 0 0 0 0 0 0 0 0 0 0 0 0 0 0 0 0 0 0 0 0 0 0 0 0 0 0 0 0 0 
