*Vertices 46
*Matrix 
0.06 0 0 0 0 0 869.854 0 0 887.707 0 0 0 0 0 0 212.18 0 0 0 0 0 0 0 0 0 -104.907 0 -537.507 2227.01 -115.894 -218.436 0 0 -1803.11 0 0 0 0 0 0 0 0 0 0 0 
0 0.04 0 0 0 1820.96 0 786.538 254.448 2489.78 0 0 -1824.78 0 0 0 375.301 0 0 -2451.93 0 0 2201.22 0 -83.8496 -1273.46 0 -1559.11 586.947 0 0 0 0 0 0 0 179.678 0 0 0 0 0 0 0 186.697 0 
0 0 0.04 0 0 0 0 0 0 0 1601.69 0 0 0 0 1303.37 0 0 0 0 0 1576.51 0 0 0 -2181.69 0 0 0 0 0 1402.4 0 0 -611.362 0 0 0 1031.6 0 0 0 0 0 -1269.95 0 
0 0 0 0.05 0 -2129.66 -739.082 2474.97 0 0 0 0 0 -981.704 -604.953 -2159.57 0 0 0 0 1613.74 1556.22 0 2136.22 274.743 0 0 0 0 0 0 0 2401.88 -2229.91 0 0 488.678 0 0 0 0 0 0 0 0 0 
0 0 0 0 0.06 0 0 0 0 1897.72 584.353 0 0 825.144 0 -1649.75 0 0 2386.47 0 0 0 0 0 0 0 0 0 0 0 0 0 2313.38 0 1604.89 332.27 0 0 0 0 -1374.32 0 0 0 0 0 
0 -252.77 0 1925.79 0 0.03 -170.217 0 0 0 0 0 2112.11 -925.245 0 0 0 -903.577 1741.31 1147.11 0 0 0 0 0 0 0 1606.42 -1377.83 0 -912.58 0 -1698.43 1686.53 0 0 0 -586.795 0 0 0 0 1352.81 0 0 0 
-2219.23 0 0 294.427 0 1936.93 0.06 484.863 0 0 0 810.038 0 0 0 868.328 0 0 0 0 1918.78 0 0 0 0 0 -339.747 1662.27 0 0 0 0 0 0 0 -661.718 -757.851 0 0 0 0 0 0 277.795 0 0 
0 -752.205 0 1668.52 0 0 -7.70592 0.06 0 0 1480.22 0 0 0 0 -630.131 0 0 0 0 1459.47 0 0 1389.28 0 157.552 0 2309.41 0 -2420.96 0 -709.632 0 0 0 1760.69 -1522.03 0 699.255 0 -1249.05 0 0 0 0 0 
0 230.186 0 0 0 0 0 0 0 0 982.467 0 0 2162.31 0 -2454.53 0 0 1209.07 -958.51 0 0 0 2056.11 0 0 0 -1713.69 0 -314.722 0 0 0 0 2072.74 0 885.876 0 0 1044.11 0 -10.3 0 0 0 0 
-1424.83 -1839.58 0 0 -532.014 0 0 0 0 0.07 -2227.32 1947.61 1834.85 2374.42 1309.47 0 0 0 0 0 0 0 0 0 703.07 0 1484.5 0 1493.65 -2432.4 0 0 0 0 1440.09 0 1599.55 0 0 0 0 0 0 0 0 0 
0 0 1137.5 0 1657.69 0 0 -2332.15 -539.186 1925.64 0.05 0 0 672.246 0 0 0 0 0 376.675 0 2007.89 0 0 0 1078.91 -784.555 0 0 0 0 2337.64 0 0 0 0 152.058 0 0 0 0 0 0 0 1146.96 0 
0 0 0 0 0 0 2112.26 0 0 -1884.9 0 0.01 1007.8 1622.9 0 583.743 0 1513.18 0 1734.14 49.5163 0 0 0 0 0 0 0 0 0 0 0 0 0 0 0 1692.94 0 0 0 0 0 0 0 0 0 
0 2167.2 0 0 0 -461.821 0 0 0 -680.944 0 974.837 0.05 -1016.19 0 0 787.606 0 -427.03 1516.24 0 -415.586 0 2271.72 0 0 214.774 -712.226 0 0 0 2446.9 -2404.93 0 0 1694.62 0 0 0 0 0 0 0 0 0 0 
0 0 0 997.879 -1054.34 -2159.11 0 0 973.312 1821.57 24.1859 1490.75 1621.52 0.05 0 0 0 0 0 0 0 0 18.6926 0 0 0 0 0 0 0 1134.14 0 0 0 0 0 0 0 0 0 0 1512.73 0 0 0 0 
0 0 0 1988.81 0 0 0 0 0 -1842.02 0 0 0 0 0.02 -587.252 0 0 1000.17 0 0 2228.39 -670.11 2160.79 0 1916.03 -2227.77 0 0 0 0 0 0 0 0 0 0 0 0 0 0 0 0 0 0 2420.35 
0 0 2230.52 1581.39 861.309 0 -1193.2 -805.612 729.316 0 0 -250.938 0 0 1800.52 0.04 0 0 2405.09 0 -1098.74 0 0 104.602 2327.11 0 714.057 0 1464.05 838.725 0 0 0 0 0 0 0 0 0 -1982.25 0 0 0 -1097.83 0 0 
2337.79 1907.18 0 0 0 0 0 0 0 0 0 0 -2277.67 0 0 0 0 0 707.648 0 0 0 0 -814.768 0 0 0 0 0 0 0 0 -35.9355 0 0 -1967.76 775.399 0 2074.27 0 0 0 0 0 0 0 
0 0 0 0 0 2276.15 0 0 0 0 0 -309.381 0 0 0 0 0 0.06 0 789.132 0 0 0 -328.15 0 2034.9 0 0 42.6496 2089.53 136.799 -1046.71 0 0 112.384 1197.62 0 0 0 0 0 0 0 0 0 0 
0 0 0 0 974.99 1450.01 0 0 -944.319 0 0 0 1023.21 0 -524.232 656.072 -781.045 0 0.06 0 0 -292.138 0 -1379.82 0 0 0 459.227 0 0 0 2184.13 0 0 0 0 0 0 0 0 0 0 -1565.37 -1552.55 0 0 
0 -1582.31 0 0 0 -403.684 0 0 -2394.86 0 2370.14 1476.26 513.703 0 0 0 0 -1627.17 0 0.07 0 1818.06 0 0 1741.16 0 0 0 0 1288.87 0 0 0 517.212 -1417.97 1115.07 0 0 0 0 0 0 0 0 0 0 
0 0 0 317.011 0 0 -993.301 142.75 0 0 0 1608.55 0 0 0 1828.29 0 0 0 0 0.08 0 0 0 0 0 0 0 0 0 0 877.483 0 0 0 0 -731.452 0 0 0 0 1737.04 0 0 0 0 
0 0 -1546.45 2374.57 0 0 0 0 0 0 249.718 0 1435.97 0 1581.39 0 0 0 1837.29 339.137 0 0.09 0 -1109.58 0 -1.90741 0 0 0 0 0 0 0 -1451.54 0 0 -985.061 0 0 0 0 0 0 0 0 0 
0 196.463 0 0 0 0 0 0 0 0 0 0 0 -1114.76 745.338 0 0 0 0 0 0 0 0 -345.546 0 0 546.51 0 0 0 0 1208.15 0 0 0 0 0 -1196.1 1437.19 0 0 0 0 0 0 0 
0 0 0 974.227 0 0 0 -1496.7 1277.73 0 0 0 2082.35 0 2131.95 -133.442 2496.34 2482.91 2036.12 0 0 1000.32 1762.22 0.08 0 0 0 0 0 -200.583 0 -1089.28 0 0 0 0 0 508.972 0 0 0 0 0 0 0 0 
0 -774.941 0 2218.47 0 0 0 0 0 -1440.24 0 0 0 0 0 -1173.06 0 0 0 986.282 0 0 0 0 0.09 0 0 1621.68 0 2414.55 2036.73 0 -933.332 -599.46 0 0 1210.75 0 0 0 0 0 0 0 0 0 
0 103.687 -236.442 0 0 0 0 1793.04 0 0 1628.85 0 0 0 631.199 0 0 837.504 0 0 0 758.309 0 0 0 0.02 0 0 0 0 578.707 0 -107.807 0 0 1054.95 0 0 0 0 -723.212 -2139.58 339.747 0 0 0 
63.097 0 0 0 0 0 1969.13 0 0 -184.103 1448.33 0 2137.59 0 -2267.14 1692.18 0 0 0 0 0 0 397.732 0 0 0 0.09 0 0 0 0 0 0 0 0 0 -840.098 0 0 0 0 0 -2360.07 0 0 0 
0 1527.68 0 0 0 -595.492 901.135 820.566 1574.22 0 0 0 1650.67 0 0 0 0 0 641.27 0 0 0 0 0 2038.87 0 0 0.09 2401.12 0 0 0 -2333.98 0 -66.7592 1364.1 0 0 0 0 0 0 0 0 0 0 
2113.48 -1003.22 0 0 0 1237.14 0 0 0 777.383 0 0 0 0 0 1769.39 0 1410.49 0 0 0 0 0 0 0 0 0 -416.501 0 0 0 851.085 0 0 0 1811.5 2238.15 0 0 0 0 0 0 0 0 0 
1641.82 0 0 0 0 0 0 -518.891 515.229 1233.63 0 0 0 0 0 331.507 0 1505.55 0 368.435 0 0 0 -2193.75 -47.9904 0 0 0 0 0.07 0 0 0 0 0 0 0 0 0 0 0 0 0 -1654.18 0 0 
-1180.38 0 0 0 0 2352.14 0 0 0 0 0 0 0 509.583 0 0 0 -1850.11 0 0 0 0 0 0 438.627 -2406.61 0 0 0 0 0.09 0 0 0 2278.89 0 2001.17 0 0 0 0 0 0 0 0 0 
694.678 0 276.574 0 0 0 0 480.895 0 0 808.206 0 2492.52 0 0 0 0 -2030.32 2397.76 0 2385.86 0 767.464 320.673 0 0 0 0 1954.79 0 0 0.03 2048.94 0 0 0 0 0 0 0 -419.553 0 0 0 0 0 
0 0 0 1360.74 -575.198 -1822.18 0 0 0 0 0 0 1335.41 0 0 0 2422.79 0 0 0 0 0 0 0 1923.2 -2320.09 0 -791.116 0 0 0 -2029.56 0.08 0 0 0 0 2136.52 0 0 2095.78 0 -421.232 0 0 -914.411 
0 0 0 -599.307 0 -4.95926 0 0 0 0 0 0 0 0 0 0 0 0 0 -625.553 0 535.676 0 0 2494.05 0 0 0 0 0 0 0 0 0.02 0 0 0 0 0 0 0 0 0 552.461 -9.84222 2377.47 
572.909 0 2312.46 0 -603.275 0 0 0 -1681.49 1632.36 0 0 0 0 0 0 0 1605.35 0 961.867 0 0 0 0 0 0 0 -1664.71 0 0 558.26 0 0 0 0.02 0 0 0 0 0 0 0 0 0 0 0 
0 0 0 0 269.555 0 1343.2 -112.537 0 0 0 0 1638.62 0 0 0 1588.87 -503.784 0 388.272 0 0 0 0 0 116.047 0 -2000.87 2239.22 0 0 0 0 0 0 0.04 0 0 0 0 0 0 0 0 0 -1294.21 
0 -622.654 0 352.412 0 0 2205.34 2113.94 1143.15 -2359.77 2158.04 2336.27 0 0 0 0 -729.011 0 0 0 1396.3 -880.535 0 0 224.998 0 1395.99 0 -2476.04 0 -592.746 0 0 0 0 0 0.04 -334.254 0 -1391.11 0 1432.77 0 0 0 0 
0 0 0 0 0 -577.792 0 0 0 0 0 0 0 0 0 0 0 0 0 0 0 0 -234.153 2137.9 0 0 0 0 0 0 0 0 525.147 0 0 0 973.312 0.02 0 0 0 -936.995 0 0 0 0 
0 0 -1962.72 0 0 0 0 969.039 0 0 0 0 0 0 0 0 -1055.56 0 0 0 0 0 2428.43 0 0 0 0 0 0 0 0 0 0 0 0 0 0 0 0.09 0 0 0 0 0 0 0 
0 0 0 0 0 0 0 0 -426.878 0 0 0 0 0 0 1381.95 0 0 0 0 0 0 0 0 0 0 0 0 0 0 0 0 0 0 0 0 130.238 0 0 0.08 0 0 0 0 0 0 
0 0 0 0 535.829 0 0 105.518 0 0 0 0 0 0 0 0 0 0 0 0 0 0 0 0 0 735.115 0 0 0 0 0 -894.574 -351.192 0 0 0 0 0 0 0 0 0 0 0 0 0 
0 0 0 0 0 0 0 0 1904.43 0 0 0 0 -2219.38 0 0 0 0 0 0 2445.68 0 0 0 0 -245.445 0 0 0 0 0 0 0 0 0 0 2115.62 2.82296 0 0 0 0.08 0 0 0 0 
0 0 0 0 0 -2463.53 0 0 0 0 0 0 0 0 0 0 0 0 675.604 0 0 0 0 0 0 725.044 931.196 0 0 0 0 0 2237.85 0 0 0 0 0 0 0 0 0 0.04 0 0 0 
0 0 0 0 0 0 1235.01 0 0 0 0 0 0 0 0 219.81 0 0 833.384 0 0 0 0 0 0 0 0 0 0 803.171 0 0 0 -1254.84 0 0 0 0 0 0 0 0 0 0.09 0 0 
0 -2308.04 151.143 0 0 0 0 0 0 0 554.445 0 0 0 0 0 0 0 0 0 0 0 0 0 0 0 0 0 0 0 0 0 0 2107.07 0 0 0 0 0 0 0 0 0 0 0.03 0 
0 0 0 0 0 0 0 0 0 0 0 0 0 0 2312.62 0 0 0 0 0 0 0 0 0 0 0 0 0 0 0 0 0 -47.2274 581.912 0 2299.65 0 0 0 0 0 0 0 0 0 0.09 
