*Vertices 63
*Matrix 
0.03 0 0 916.547 0 0 0 0 0 0 0 0 0 0 2072.28 0 0 0 0 0 0 0 0 0 0 0 0 0 0 0 0 0 0 0 1746.04 0 0 0 1975.54 0 0 0 0 0 0 0 0 2277.67 0 0 0 0 0 0 1104.85 0 0 0 0 0 0 0 0 
0 0.08 1957.84 0 0 0 0 0 0 0 0 0 0 0 0 0 0 0 0 0 1306.88 -613.956 0 0 904.187 0 0 0 -257.805 0 0 1502.35 0 0 0 0 0 0 0 0 0 0 0 0 0 0 -785.623 0 -735.878 0 0 0 0 0 0 0 0 0 0 0 0 0 0 
0 -2069.08 0.03 0 0 0 0 0 1625.95 0 0 0 0 0 0 0 0 0 0 0 0 0 0 0 0 1872.69 -1165.58 0 0 -910.138 0 0 0 0 0 0 0 0 0 0 0 0 0 0 0 0 0 -1180.07 -315.027 0 0 0 0 0 1902.91 0 0 0 1595.74 0 0 0 0 
1566.44 0 0 0 0 0 0 0 0 0 0 0 0 0 0 0 0 0 0 -16.0985 0 0 0 2394.56 0 0 0 1786.48 0 0 0 2143.24 -688.574 -968.886 0 2219.38 0 520.875 0 0 1515.93 0 0 0 1530.12 0 0 0 0 0 0 0 0 0 0 0 0 0 0 0 0 0 0 
0 0 0 0 0.05 0 0 0 0 0 0 0 1955.7 0 0 0 0 0 0 0 0 0 -777.078 0 0 0 0 0 1699.04 0 0 0 0 0 0 0 0 0 0 0 0 0 0 0 0 0 0 0 0 0 0 2329.55 0 0 768.685 0 0 0 0 0 0 -1338.31 0 
0 0 0 0 0 0 0 0 0 0 0 0 -1768.32 0 1931.14 0 0 -1764.66 0 1842.78 0 0 0 0 1697.82 0 0 206.381 0 0 0 0 0 0 0 0 0 0 0 0 0 0 0 0 0 0 0 0 0 0 0 0 0 0 0 0 1092.18 0 0 0 0 0 0 
0 0 0 0 0 0 0.07 0 0 1391.26 0 0 0 0 0 0 0 0 0 2385.4 1415.68 0 0 2093.19 0 0 0 898.236 0 1146.35 0 0 2080.83 0 0 0 0 0 0 0 0 0 0 98.8037 0 0 0 0 0 0 0 0 0 -933.638 0 0 47.38 0 0 0 0 0 0 
0 0 0 0 0 0 0 0.09 2082.81 0 0 0 0 0 0 0 0 0 0 0 0 0 0 0 0 0 0 0 0 0 0 0 0 0 1420.71 0 0 0 0 0 1694.31 0 0 0 0 0 0 0 0 0 0 664.922 0 0 0 0 0 0 0 0 0 0 0 
0 0 2008.65 0 0 0 0 -1736.73 0.04 0 0 0 891.217 0 0 0 0 0 0 1387.45 -1631.6 0 0 1697.97 0 1303.22 0 0 0 0 -1667.61 0 0 0 0 -747.322 0 0 0 0 0 0 0 0 0 609.684 931.196 0 0 0 0 0 0 0 0 0 0 0 0 0 0 0 0 
0 0 0 0 0 0 233.543 0 0 0.03 0 1861.25 0 917.005 0 2110.28 0 0 0 0 0 0 0 0 0 0 0 0 0 0 933.79 0 0 -144.887 2051.53 0 0 0 0 0 0 0 2106.77 1964.86 0 0 0 0 0 0 0 1252.86 0 0 0 0 0 0 0 0 0 0 0 
0 0 0 0 0 0 0 0 0 0 0.05 0 0 -1441.92 0 0 0 0 0 0 0 -127.949 0 0 1142.08 0 0 0 0 0 0 0 1334.8 0 0 0 0 0 0 0 0 0 2346.19 0 -2246.7 0 0 0 0 15.7933 0 0 0 341.121 0 0 0 0 0 0 0 0 0 
0 0 0 0 0 0 0 0 0 2122.18 0 0.01 2181.84 0 0 0 0 0 0 0 -2108.91 0 0 0 -1488.16 0 0 2113.48 0 -395.596 0 0 0 0 0 0 1781.59 0 -29.9844 0 0 0 2034.75 0 0 0 0 0 0 0 0 0 0 0 2100.36 -2313.99 0 0 0 0 0 0 0 
0 0 0 0 -1976.91 136.952 0 0 2009.57 0 0 1382.72 0.07 0 -501.801 0 0 0 0 0 0 -2002.24 0 0 0 0 0 -1527.99 2257.38 0 0 0 0 0 0 0 0 -1574.83 0 0 1974.62 0 776.772 0 0 -318.842 0 0 0 0 0 0 0 923.719 0 0 0 0 0 0 0 0 0 
0 0 0 0 0 0 0 0 0 2443.85 -622.501 0 0 0.04 0 0 0 0 0 1482.51 0 0 0 0 211.112 0 0 0 -549.715 0 0 0 0 0 0 0 0 0 -18.8452 0 0 0 0 1965.32 0 0 0 0 0 0 -457.549 0 0 0 0 0 1147.72 0 0 0 0 0 0 
-1116.29 0 0 0 0 -574.74 0 0 0 0 0 0 1214.71 0 0.08 0 -69.8111 0 0 0 0 0 0 0 1505.25 2340.24 0 0 0 1911.6 0 0 -2386.93 0 0 0 0 0 0 0 0 0 0 0 0 0 0 0 0 0 169.607 0 0 0 0 0 0 0 0 0 0 0 0 
0 0 0 0 0 0 0 0 0 1971.72 0 0 0 0 0 0.03 0 0 0 0 0 0 190.207 0 -2167.81 0 0 0 136.494 0 0 0 0 0 1442.23 0 0 0 0 2409.21 0 0 0 0 0 0 0 0 0 0 0 0 0 0 2247.31 0 2352.9 0 0 0 0 0 0 
0 0 0 0 0 0 0 0 0 0 0 0 0 0 1752.6 0 0.08 0 2487.95 0 0 0 0 0 -677.129 0 0 0 0 0 327.54 -1903.21 0 -1836.53 0 0 2186.73 0 74.0837 0 0 0 0 0 0 0 0 0 1112.93 0 0 -1492.43 909.986 0 0 0 0 0 0 0 0 0 0 
0 0 0 0 0 2014.45 0 0 0 0 0 0 0 0 0 0 0 0.08 0 0 0 0 0 0 0 0 0 0 0 0 0 0 0 -2235.25 0 0 0 0 0 0 -1704.23 2332.15 0 1956.47 0 0 0 0 0 0 0 0 0 0 0 0 0 0 0 0 0 0 0 
0 0 0 0 0 0 0 0 0 0 0 0 0 0 0 0 -1154.29 0 0 0 0 0 2387.39 0 0 0 0 0 0 0 -2345.88 2495.12 2495.88 0 -20.5237 0 0 0 0 954.39 0 2355.19 1683.17 0 0 0 0 662.786 0 234.458 0 0 0 0 0 0 0 0 0 0 0 0 0 
0 0 0 2305.14 0 558.412 540.406 0 794.931 0 0 0 0 2309.87 0 0 0 0 0 0.04 0 0 0 0 0 0 0 0 -2256 0 0 0 -1408.66 0 0 0 0 0 0 0 0 0 0 0 0 0 0 1623.66 0 0 0 0 0 0 0 0 0 0 0 0 0 0 0 
0 2189.32 0 0 0 0 -1908.86 0 1907.79 0 0 -450.224 0 0 0 0 0 0 0 0 0.03 0 0 0 -1373.1 0 0 2335.2 0 -1056.47 0 0 0 0 0 0 0 0 0 0 0 0 0 0 0 0 0 0 0 0 0 0 0 0 0 -763.802 0 0 0 0 0 0 0 
0 -2478.64 0 0 0 0 0 0 0 0 348.445 0 2360.38 0 0 0 0 0 0 0 0 0.06 0 0 0 0 0 0 0 0 0 0 0 0 0 0 2212.97 0 1265.68 0 0 0 0 0 0 0 0 0 0 0 0 0 0 0 0 0 0 0 0 0 0 0 0 
0 0 0 0 -817.209 0 0 0 0 0 0 0 0 0 0 616.398 0 0 495.239 0 0 0 0.02 0 0 0 0 0 0 -383.389 0 0 0 0 0 0 0 0 0 -2028.95 0 1491.21 2017.96 0 0 0 0 0 0 0 0 0 0 0 0 0 0 0 0 0 0 0 0 
0 0 0 956.526 0 0 281.152 0 162.587 0 0 0 0 0 0 0 0 0 0 0 0 0 0 0.09 0 0 0 0 -355.922 1116.44 0 213.706 0 0 0 0 0 0 0 0 0 0 0 0 0 0 0 0 0 0 0 0 639.897 0 0 0 0 0 0 0 0 0 0 
0 2416.07 0 0 0 1553.47 0 0 0 0 710.547 1595.74 0 -1082.11 2098.22 988.571 519.501 0 0 0 -219.657 0 0 0 0 0 0 -1992.02 0 1064.87 0 0 -574.282 0 0 0 0 0 0 0 0 0 0 0 0 0 0 0 0 0 0 0 0 0 2101.73 0 1847.67 0 0 0 0 0 0 
0 0 2457.58 0 0 0 0 0 601.291 0 0 0 0 0 -1242.33 0 0 0 0 0 0 0 0 0 0 0.01 0 0 0 0 0 0 0 -1589.48 0 0 0 0 0 0 0 1125.75 0 0 0 0 0 0 0 0 0 1192.43 0 0 0 0 0 0 0 0 0 0 0 
0 0 1697.82 0 0 0 0 0 0 0 0 0 0 0 0 0 0 0 0 0 0 0 0 0 0 0 0 0 0 0 0 2477.72 0 758.156 2052.75 0 -2498.02 0 0 0 0 0 0 0 0 0 0 0 0 0 0 0 0 0 -2431.33 0 0 1049.91 0 0 0 0 0 
0 0 0 646.763 0 1228.6 -368.587 0 0 0 0 685.369 1485.56 0 0 0 0 0 0 0 -1503.42 0 0 0 17.0141 0 0 0.03 0 0 0 0 0 0 0 0 750.832 0 0 0 0 0 0 0 0 0 0 1455.2 0 0 0 0 0 0 0 0 0 1257.9 0 -919.446 0 0 0 
0 220.267 0 0 -1438.87 0 0 0 0 0 0 0 1815.93 -928.602 0 600.681 0 0 0 868.633 0 0 0 -21.897 0 0 0 0 0.06 0 0 0 0 0 0 0 0 0 0 1512.42 0 0 0 0 0 0 0 0 0 -170.675 0 0 0 0 -2063.28 0 0 0 0 0 0 0 0 
0 0 -1026.87 0 0 0 -2080.22 0 0 0 0 2426.91 0 0 1102.56 0 0 0 0 0 -720.923 0 1972.64 772.652 -1259.88 0 0 0 0 0.08 261.773 0 2345.73 0 0 0 0 -1028.09 0 0 2159.87 0 -2002.55 0 0 1841.41 0 0 0 0 0 0 0 0 0 0 -1988.66 0 0 0 0 0 0 
0 0 0 0 0 0 0 0 1440.55 987.503 0 0 0 0 0 0 1078.3 0 -379.574 0 0 0 0 0 0 0 0 0 0 2015.37 0.01 0 0 0 0 -113.91 0 0 0 0 0 -34.8674 0 0 0 1852.85 0 0 0 0 0 172.506 0 0 0 0 0 0 0 0 0 0 0 
0 -1343.2 0 -1255.15 0 0 0 0 0 0 0 0 0 0 0 0 1844.46 0 -352.87 0 0 0 0 -166.097 0 0 2285.91 0 0 0 0 0.04 0 0 0 0 0 1308.56 0 0 1712.93 1009.17 0 2358.7 2116.38 0 -2149.34 0 0 0 0 0 0 0 0 0 0 0 0 0 0 0 0 
0 0 0 -584.964 0 0 2297.51 0 0 0 -1624.73 0 0 0 1293.15 0 0 0 2325.28 -163.198 0 0 0 0 -192.038 0 0 0 0 2259.67 0 0 0.06 0 0 0 1668.98 0 0 0 0 0 0 0 0 0 0 0 0 0 0 0 2284.54 0 0 1071.89 0 0 0 0 -1596.5 0 0 
0 0 0 1643.35 0 0 0 0 0 -1791.51 0 0 0 0 0 0 1595.58 1654.18 0 0 0 0 0 0 0 134.053 2236.63 0 0 0 0 0 0 0 0 0 0 0 0 0 0 0 0 0 0 0 0 0 0 0 0 0 0 0 0 0 0 1976.91 2235.71 0 0 0 0 
1271.63 0 0 0 0 0 0 -1274.22 0 1188.16 0 0 0 0 0 -632.725 0 0 1094.01 0 0 0 0 0 0 0 2107.84 0 0 0 0 0 0 0 0.02 0 0 0 110.706 0 0 0 0 0 -142.293 0 0 1968.21 -272.454 2055.8 0 0 0 0 0 0 0 0 0 0 0 0 0 
0 0 0 -401.547 0 0 0 0 1702.25 0 0 0 0 0 0 0 0 0 0 0 0 0 0 0 0 0 0 0 0 0 -2370.6 0 0 0 0 0.05 0 0 0 0 0 -201.651 -458.617 0 -70.7266 0 0 0 2478.48 0 0 0 0 0 0 0 0 0 2225.79 0 0 0 0 
0 0 0 0 0 0 0 0 0 0 0 -1319.09 0 0 0 0 906.629 0 0 0 0 -955.306 0 0 0 0 2075.95 -1742.38 0 0 0 0 2038.26 0 0 0 0.04 -1357.23 0 0 0 -615.024 440.306 0 -822.245 0 0 0 0 0 0 -20.6763 0 2200.77 0 0 0 0 0 0 0 0 0 
0 0 0 -1117.05 0 0 0 0 0 0 0 0 2397 0 0 0 0 0 0 0 0 0 0 0 0 0 0 0 0 1376.61 0 2483.98 0 0 0 0 -1338.31 0.02 0 0 0 0 0 0 0 0 0 779.672 0 0 0 0 2236.47 0 0 0 0 0 0 0 0 0 0 
1467.41 0 0 0 0 0 0 0 0 0 0 2176.35 0 -375.912 0 0 1452.45 0 0 0 0 -2216.79 0 0 0 0 0 0 0 0 0 0 0 0 1685.61 0 0 0 0.05 0 0 0 -179.373 1309.32 0 0 0 0 0 0 0 0 0 0 0 0 0 619.907 -874.737 0 0 0 0 
0 0 0 0 0 0 0 0 0 0 0 0 0 0 0 -839.335 0 0 1643.35 0 0 0 1113.24 0 0 0 0 0 88.7326 0 0 0 0 0 0 0 0 0 0 0.05 0 0 0 0 0 0 0 0 0 0 1744.21 0 0 0 0 0 0 0 0 0 0 0 0 
0 0 0 2332.61 0 0 0 703.833 0 0 0 0 2353.51 0 0 0 0 1926.1 0 0 0 0 0 0 0 0 0 0 0 2262.41 0 2030.02 0 0 0 0 0 0 0 0 0.02 0 0 0 -2366.18 0 0 0 0 1428.8 0 0 -2240.44 0 0 0 0 0 0 0 0 0 0 
0 0 0 0 0 0 0 0 0 0 0 0 0 0 0 0 0 2003.62 -2216.79 0 0 0 1605.66 0 0 -520.569 0 0 0 0 2464.6 -444.426 0 0 0 2434.39 2265.92 0 0 0 0 0.01 0 0 0 0 0 0 0 0 0 0 0 0 0 0 0 603.122 0 0 0 0 0 
0 0 0 0 0 0 0 0 0 1657.84 1289.94 366.756 -617.771 0 0 0 0 0 2443.54 0 0 0 231.864 0 0 0 0 0 0 -903.577 0 0 0 0 0 -422.147 -455.412 0 1424.99 0 0 0 0.07 -1174.28 247.124 0 0 0 0 0 0 0 0 0 0 0 -55.1622 0 0 0 0 0 0 
0 0 0 0 0 0 -2365.41 0 0 2036.12 0 0 0 406.583 0 0 0 236.9 0 0 0 0 0 0 0 0 0 0 0 0 0 1308.4 0 0 0 0 0 0 1720.71 0 0 0 1778.85 0.08 0 0 -131.153 0 0 0 0 0 0 0 1712.93 0 0 0 0 0 0 0 0 
0 0 0 1143.6 0 0 0 0 0 0 349.208 0 0 0 0 0 0 0 0 0 0 0 0 0 0 0 0 0 0 0 0 -2053.82 0 0 -17.6244 909.528 1222.04 0 0 0 621.586 0 1454.44 0 0.02 0 0 0 0 0 0 0 0 0 0 0 0 0 0 0 0 0 0 
0 0 0 0 0 0 0 0 2028.64 0 0 0 2120.96 0 0 0 0 0 0 0 0 0 0 0 0 0 0 0 0 1435.06 160.909 0 0 0 0 0 0 0 0 0 0 0 0 0 0 0.04 1617.86 0 0 1572.7 0 0 0 0 0 0 0 0 0 0 0 0 0 
0 2496.03 0 0 0 0 0 0 640.355 0 0 0 0 0 0 0 0 0 0 0 0 0 0 0 0 0 0 0 0 0 0 57.2985 0 0 0 0 0 0 0 0 0 0 0 659.581 0 -1151.54 0.07 0 0 2218.31 0 -1198.23 0 0 0 0 0 -1324.43 0 0 0 0 0 
1739.48 0 1735.36 0 0 0 0 0 0 0 0 0 0 0 0 0 0 0 -288.018 -1445.13 0 0 0 0 0 0 0 2278.59 0 0 0 0 0 0 -943.556 0 0 53.7889 0 0 0 0 0 0 0 0 0 0.07 287.103 0 0 0 0 0 0 -865.734 0 0 0 0 0 0 0 
0 1774.58 19.4555 0 0 0 0 0 0 0 0 0 0 0 0 0 1663.95 0 0 0 0 0 0 0 0 0 0 0 0 0 0 0 0 0 519.654 701.086 0 0 0 0 0 0 0 0 0 0 0 -397.275 0.08 0 0 -2014.15 0 1331.45 -1504.94 0 0 0 0 0 0 0 0 
0 0 0 0 0 0 0 0 0 0 190.207 0 0 0 0 0 0 0 -396.207 0 0 0 0 0 0 0 0 0 142.75 0 0 0 0 0 -1164.97 0 0 0 0 0 2112.11 0 0 0 0 726.875 1827.22 0 0 0.06 0 0 0 2181.69 0 377.59 0 572.451 0 0 0 0 0 
0 0 0 0 0 0 0 0 0 0 0 0 0 1505.25 1460.54 0 0 0 0 0 0 0 0 0 0 0 0 0 0 0 0 0 0 0 0 0 0 0 0 2145.68 0 0 0 0 0 0 0 0 0 0 0.09 -2041.61 189.749 0 0 0 0 0 0 0 0 0 0 
0 0 0 0 297.784 0 0 -158.467 0 111.011 0 0 0 0 0 0 -1103.63 0 0 0 0 0 0 0 0 806.223 0 0 0 0 -613.956 0 0 0 0 0 694.678 0 0 0 0 0 0 0 0 0 1401.03 0 575.655 0 267.724 0.04 0 0 0 0 0 0 1945.17 0 0 0 0 
0 0 0 0 0 0 0 0 0 0 0 0 0 0 0 0 -690.558 0 0 0 0 0 0 344.478 0 0 0 0 0 0 0 0 2379.15 0 0 0 0 2129.2 0 0 -2173.15 0 0 0 0 0 0 0 0 0 2452.7 0 0.03 0 0 0 667.669 0 0 0 0 0 0 
0 0 0 0 0 0 2494.66 0 0 0 -1938.31 0 -145.802 0 0 0 0 0 0 0 0 0 0 0 0 0 0 0 0 0 0 0 0 0 0 0 1511.66 0 0 0 0 0 0 0 0 0 0 0 1319.85 -1517.76 0 0 0 0.02 0 0 0 0 1296.5 0 0 0 0 
2125.23 0 1.29704 0 25.7118 0 0 0 0 0 0 1308.25 0 0 0 297.479 0 0 0 0 0 0 0 0 -1789.83 0 936.384 0 -487.304 0 0 0 0 0 0 0 0 0 0 0 0 0 0 1265.37 0 0 0 0 -1912.98 0 0 0 0 0 0.08 0 0 -411.313 0 0 0 0 0 
0 0 0 0 0 0 0 0 0 0 0 660.955 0 0 0 0 0 0 0 0 270.775 0 0 0 0 0 0 0 0 0 0 0 519.654 0 0 0 0 0 0 0 0 0 0 0 0 0 0 2183.37 0 1633.88 0 0 0 0 0 0.09 0 0 0 0 0 0 0 
0 0 0 0 0 -1782.82 235.527 0 0 0 0 0 0 2086.02 0 1347.16 0 0 0 0 0 0 0 0 1130.18 0 0 0 0 1350.37 0 0 0 0 0 0 0 0 0 0 0 0 826.212 0 0 0 0 0 0 0 0 0 -1758.25 0 0 0 0.04 0 -758.003 0 0 0 0 
0 0 0 0 0 0 0 0 0 0 0 0 0 0 0 0 0 0 0 0 0 0 0 0 0 0 -2039.32 -236.747 0 0 0 0 0 1402.4 0 0 0 0 1503.42 0 0 1203.57 0 0 0 0 761.208 0 0 628.147 0 0 0 0 1365.02 0 0 0.02 0 0 0 0 0 
0 0 84.1548 0 0 0 0 0 0 0 0 0 0 0 0 0 0 0 0 0 0 0 0 0 0 0 0 0 0 0 0 0 0 410.245 0 1482.06 0 0 721.229 0 0 0 0 0 0 0 0 0 0 0 0 -658.666 0 940.046 0 0 681.555 0 0.03 0 0 0 -2473.91 
0 0 0 0 0 0 0 0 0 0 0 0 0 0 0 0 0 0 0 0 0 0 0 0 0 0 0 1724.52 0 0 0 0 0 0 0 0 0 0 0 0 0 0 0 0 0 0 0 0 0 0 0 0 0 0 0 0 0 0 0 0.08 0 0 0 
0 0 0 0 0 0 0 0 0 0 0 0 0 0 0 0 0 0 0 0 0 0 0 0 0 0 0 0 0 0 0 0 591.067 0 0 0 0 0 0 0 0 0 0 0 0 0 0 0 0 0 0 0 0 0 0 0 0 0 0 0 0.04 0 0 
0 0 0 0 1707.59 0 0 0 0 0 0 0 0 0 0 0 0 0 0 0 0 0 0 0 0 0 0 0 0 0 0 0 0 0 0 0 0 0 0 0 0 0 0 0 0 0 0 0 0 0 0 0 0 0 0 0 0 0 0 0 0 0.04 0 
0 0 0 0 0 0 0 0 0 0 0 0 0 0 0 0 0 0 0 0 0 0 0 0 0 0 0 0 0 0 0 0 0 0 0 0 0 0 0 0 0 0 0 0 0 0 0 0 0 0 0 0 0 0 0 0 0 0 1648.23 0 0 0 0.03 
