*Vertices 81
*Matrix 
0.01 0 0 0 -1126.82 0 0 0 0 0 0 0 0 0 0 0 0 0 0 0 0 0 0 1711.25 0 0 0 0 0 0 0 0 0 0 0 0 0 0 337.916 0 0 0 0 0 0 1152.3 0 0 0 1334.04 0 -1620.3 0 0 0 0 1707.28 0 0 0 0 -244.53 0 0 0 0 -724.128 0 -1456.11 0 0 0 0 0 0 0 0 0 0 0 0 
0 0 0 0 0 0 0 0 0 0 0 2476.04 0 0 0 0 0 0 0 0 -1788.61 0 0 0 0 0 0 0 1585.06 0 1140.55 0 0 -2273.4 0 0 0 0 321.741 1047.32 0 2072.74 0 0 0 956.832 0 0 -1618.32 0 -512.787 0 0 0 0 0 0 0 0 0 0 1257.59 0 -144.734 0 0 0 0 0 0 0 0 -805.155 0 0 0 0 0 0 0 0 
0 0 0.06 2479.09 0 2425.53 0 0 0 0 0 1846.9 -1979.81 0 0 0 -1887.95 0 0 0 0 0 0 0 0 0 1879.86 0 0 0 0 0 0 0 0 -591.372 0 0 0 -292.444 0 0 0 0 0 0 0 0 0 0 0 0 0 0 0 0 -1124.23 0 0 0 686.285 0 943.709 0 0 0 0 1707.89 0 0 0 0 0 544.374 0 0 0 0 0 0 0 
0 0 -2071.52 0.06 0 0 0 903.729 0 0 -808.512 0 0 0 0 0 0 0 0 0 0 0 0 0 0 0 0 0 0 0 0 -600.681 0 -59.74 2333.06 1006.88 0 0 0 0 0 0 0 0 0 0 0 1208.76 0 0 0 0 0 0 0 0 0 2494.51 0 0 0 0 0 0 0 0 0 0 0 0 0 0 -1106.37 0 0 561.922 0 0 0 0 0 
249.26 0 0 0 0 1608.25 0 0 0 0 0 1360.74 0 0 0 0 0 0 0 0 0 0 0 0 0 0 0 0 0 0 0 0 0 0 0 0 0 0 0 0 0 0 0 0 0 1060.9 0 0 2085.56 0 1212.42 0 0 0 0 0 0 0 2007.74 0 -444.426 -185.934 0 0 0 0 0 1185.26 0 0 -1982.1 0 0 0 0 0 0 0 0 0 0 
0 0 2500 0 -1180.38 0.02 0 2321.92 0 2217.25 -756.935 2016.89 0 2091.51 0 0 0 0 0 0 0 0 0 0 0 0 0 0 0 0 0 0 -1404.23 0 0 0 0 0 0 0 0 0 0 0 0 -876.415 0 0 0 -1296.2 0 0 0 0 0 0 0 0 0 0 0 0 0 0 -692.999 0 0 0 0 0 1454.59 0 0 1897.11 0 0 0 0 0 0 0 
0 0 0 0 0 0 0.01 0 -1037.55 0 0 0 0 0 1728.95 0 0 0 0 0 0 0 0 0 0 0 0 0 0 0 1860.33 0 0 0 0 0 0 0 0 -1085.77 0 0 0 0 2399.75 0 0 0 0 -2084.49 0 0 0 0 836.894 -1899.7 0 0 0 0 0 0 0 0 0 0 0 0 0 0 0 0 0 0 0 1959.21 0 0 0 0 0 
0 0 0 1794.56 0 938.52 0 0 0 0 0 0 0 0 0 0 456.023 0 0 0 0 0 606.937 631.962 0 0 0 0 0 -358.516 1297.11 -1569.95 0 0 0 0 0 0 0 0 0 0 0 0 0 0 0 0 0 0 0 0 0 0 -816.141 0 0 0 0 1775.03 0 0 0 -1009.93 0 0 0 0 0 0 0 0 0 0 0 0 0 0 0 0 0 
0 0 0 0 0 0 -904.95 0 0.02 0 0 1117.05 0 0 361.415 0 0 0 0 0 0 0 0 0 0 0 0 1441.47 0 0 0 1295.74 0 0 0 0 -2464.6 0 0 0 0 0 0 0 0 0 0 0 0 0 1299.71 0 0 0 0 0 0 0 0 0 0 -52.5681 0 0 0 0 0 0 0 0 0 0 0 0 736.488 0 0 0 0 0 0 
0 0 0 0 0 -198.141 0 0 0 0.09 0 2438.2 0 0 0 0 0 0 1431.7 0 0 -2176.96 0 0 0 0 0 0 0 0 0 0 0 0 0 0 0 0 0 0 0 0 0 0 0 252.464 -1146.5 0 0 1533.78 0 0 0 0 0 970.87 0 0 0 0 0 0 0 0 0 0 907.086 0 0 0 -1602.91 2129.05 0 0 0 0 0 0 0 0 0 
0 0 0 -727.332 0 1342.28 0 0 0 0 0.04 0 0 0 0 0 0 0 0 0 0 0 0 0 2139.73 0 0 0 1061.66 0 0 0 0 0 0 177.694 -2486.72 0 0 -1988.36 0 0 0 0 0 0 0 0 0 0 0 0 0 0 1981.49 0 0 0 0 -273.217 0 0 0 0 0 0 712.073 0 2060.53 665.838 0 0 -846.812 1817.76 0 0 0 0 0 0 0 
0 539.491 -246.666 0 -1355.4 -1979.05 0 0 2433.47 495.087 0 0.09 0 0 0 -2400.81 0 0 2325.59 0 0 0 0 0 0 -351.497 0 -275.048 0 0 0 0 0 0 0 0 0 0 0 -1255.61 0 0 0 0 0 0 0 1845.84 0 0 0 0 0 0 0 0 0 0 0 0 1791.21 0 0 0 0 0 0 0 2194.97 0 0 0 0 0 0 0 -1771.68 0 0 0 0 
0 0 586.642 0 0 0 0 0 0 0 0 0 0.05 0 0 0 0 0 0 0 0 0 0 0 0 0 0 0 0 1017.56 0 0 357.601 0 1540.5 0 0 0 0 0 0 0 0 0 0 768.685 0 0 0 0 0 0 0 0 0 0 0 0 0 0 -559.633 0 0 0 0 0 0 0 0 0 0 0 0 0 -1182.52 0 0 0 0 0 0 
0 0 0 0 0 1552.4 0 0 0 0 0 0 0 0.07 1477.78 0 0 0 0 0 0 0 0 0 1819.9 -599.307 0 0 -2336.42 0 0 0 0 0 0 1520.05 0 0 0 0 0 0 0 0 0 0 1390.8 0 0 0 0 0 0 0 0 0 0 0 0 405.667 0 0 0 0 0 0 423.368 0 0 0 0 0 0 0 0 0 0 0 0 0 116.657 
0 0 0 0 0 0 1719.95 0 -1990.65 0 0 0 0 592.593 0.05 0 0 0 1233.63 0 0 0 0 0 0 0 0 0 0 0 0 0 0 0 0 0 0 0 0 0 0 579.012 0 0 0 0 8.1637 0 0 0 0 0 0 471.74 1486.48 0 0 0 0 552.766 0 -508.057 0 0 0 0 0 0 0 0 0 0 0 0 0 0 0 0 0 2098.38 0 
0 0 0 0 0 0 0 0 0 0 0 77.7459 0 0 0 0.01 0 0 0 0 0 0 0 -435.728 0 0 0 0 0 0 0 0 0 0 0 673.772 -1588.56 0 0 0 0 0 0 0 38.9874 2203.51 2434.54 0 0 0 0 0 -853.984 0 0 -1598.48 0 0 0 0 997.116 0 0 0 0 0 0 0 0 0 0 0 0 0 -931.959 2222.89 0 0 0 0 0 
0 0 2349.09 0 0 0 0 -134.816 0 0 0 0 0 0 0 0 0 0 -1839.43 0 0 0 582.675 0 1977.37 0 0 0 0 0 0 0 0 0 0 0 0 2083.12 0 0 0 0 0 0 0 0 0 917.005 0 0 0 0 -2233.12 0 0 0 0 0 0 0 0 0 0 0 0 1165.27 0 0 0 0 0 0 0 0 0 0 0 0 0 0 0 
0 0 0 0 0 0 0 0 0 0 0 0 0 0 0 0 0 0.05 0 0 0 0 0 0 0 0 0 0 0 0 0 0 -382.015 0 -769.448 0 0 0 0 0 0 0 1697.52 0 824.381 0 0 0 0 -980.483 0 0 0 1662.88 0 -353.175 0 0 0 0 0 0 1197.47 0 0 0 0 0 0 0 0 427.183 0 0 0 -634.098 13.9622 0 0 0 0 
0 0 0 0 0 0 0 0 0 -1439.63 0 1704.38 0 0 -1015.88 0 -62.3341 0 0.06 1474.88 0 0 0 0 0 0 0 0 0 0 0 543.306 0 0 0 0 0 0 0 0 2072.74 0 0 0 0 0 0 0 0 0 0 0 2306.51 0 0 0 0 0 884.045 0 0 0 0 0 0 0 0 0 -59.5874 0 -552.309 0 0 0 528.352 0 0 0 0 0 0 
0 0 0 0 0 0 0 0 0 0 0 0 0 0 0 0 0 0 1134.45 0.01 0 0 0 0 0 0 0 0 0 0 0 0 0 0 -1448.48 0 0 0 -18.54 0 0 0 -2175.59 0 0 1556.98 0 0 0 0 0 0 0 2453.31 0 0 0 0 0 -1023.36 0 644.627 0 0 0 0 0 0 371.792 0 0 0 0 0 0 0 0 0 0 1687.9 0 
0 279.321 0 0 0 0 0 0 0 0 0 0 0 0 0 0 0 0 0 0 0.04 481.964 0 0 0 0 0 -1856.06 0 2111.04 0 0 0 0 0 0 0 908.002 0 0 0 0 0 0 -917.158 0 -441.221 0 0 0 0 1529.21 0 0 0 0 0 0 0 0 0 0 0 0 0 0 0 0 0 0 0 0 0 0 0 0 0 -666.448 0 0 0 
0 0 0 0 0 0 0 0 0 -1443.45 0 0 0 0 0 0 0 0 0 0 757.088 0.06 0 0 0 0 0 0 0 0 0 0 0 0 0 1157.95 0 1677.83 698.187 0 0 0 0 0 0 0 0 0 0 0 0 0 0 0 0 0 -822.245 0 1345.64 0 0 0 0 0 0 0 0 0 0 0 0 0 0 0 0 351.65 0 0 0 0 0 
0 0 0 0 0 0 0 -1618.78 0 0 0 0 0 0 0 0 1027.94 0 0 0 0 0 0.03 0 763.039 0 0 0 0 0 0 0 0 0 0 0 2263.94 0 0 0 0 0 0 0 0 0 0 0 361.263 0 0 0 0 0 0 0 2234.79 0 0 0 0 0 0 0 0 0 963.24 0 0 -2381.89 0 0 1134.45 0 0 0 0 0 0 0 0 
1037.4 0 0 0 0 0 0 -1948.99 0 0 0 0 0 0 0 780.282 0 0 0 0 0 0 0 0.07 0 0 1202.05 -781.961 0 0 0 1820.81 0 0 0 0 0 -2282.86 0 0 0 0 0 0 0 0 0 0 0 0 0 0 0 0 0 0 0 0 0 0 0 0 0 0 0 1786.17 0 2109.21 0 -2175.28 0 0 0 0 0 0 0 0 0 0 0 
0 0 0 0 0 0 0 0 0 0 -901.44 0 0 -1890.85 0 0 -1957.38 0 0 0 0 0 2012.01 0 0.03 2437.44 0 -1112.02 0 0 0 0 1940.9 0 0 0 0 0 0 0 0 0 649.51 0 0 0 0 0 0 0 0 0 0 0 -395.444 0 1954.48 2368.62 0 0 0 0 0 -50.5844 0 0 0 0 -942.793 0 0 0 0 0 0 0 0 0 0 0 0 
0 0 0 0 0 0 0 0 0 0 0 -663.701 0 -99.2615 0 0 0 0 0 0 0 0 0 0 1169.24 0.06 0 0 0 0 2281.49 0 0 0 0 -177.084 0 0 0 0 0 0 65.8437 306.33 0 0 0 0 488.22 0 0 0 0 0 0 0 0 0 32.1207 0 0 0 0 0 0 0 0 0 0 0 0 0 0 0 0 0 0 0 0 0 0 
0 0 510.041 0 0 0 0 0 0 0 0 0 0 0 0 0 0 0 0 0 0 0 0 -1302.76 0 0 0.02 0 0 0 0 0 0 0 0 -2015.37 0 0 0 0 0 0 0 0 0 0 0 0 2039.02 0 0 0 0 0 0 0 0 0 0 0 0 0 1215.93 0 0 0 0 0 0 2302.09 0 1495.33 0 0 0 0 0 0 0 0 0 
0 0 0 0 0 0 0 0 1861.25 0 0 1985.31 0 0 0 0 0 0 0 0 1397.98 0 0 2458.19 2339.78 0 0 0.05 0 0 0 0 -1124.99 1126.82 0 0 -270.47 2247.46 0 0 0 0 0 0 0 0 -243.156 0 0 0 0 0 0 0 0 0 0 0 0 0 0 0 0 0 -1706.37 0 0 0 0 0 0 0 0 0 0 0 0 0 0 0 0 
0 2015.82 0 0 0 0 0 0 0 0 1851.94 0 0 2116.84 0 0 0 0 0 0 0 0 0 0 0 0 0 0 0.02 0 0 0 0 1799.75 0 0 -1822.95 0 0 0 -1274.53 0 0 0 0 1544.92 0 0 -1124.68 0 0 0 0 -380.947 0 0 0 0 0 0 523.927 2455.29 0 0 0 0 598.544 0 -1108.97 0 0 0 -2127.98 0 0 0 0 0 0 0 0 
0 0 0 0 0 0 0 -2206.56 0 0 0 0 1983.63 0 0 0 0 0 0 0 1746.5 0 0 0 0 0 0 0 0 0.08 0 0 0 0 0 0 0 0 0 0 0 0 0 0 0 0 0 0 0 0 0 0 0 0 -1827.68 0 0 0 0 0 0 0 0 0 0 2474.67 0 0 0 0 0 0 0 0 0 0 0 0 0 0 0 
0 -289.239 0 0 0 0 1332.51 871.838 0 0 0 0 0 0 0 0 0 0 0 0 0 0 0 0 0 -524.689 0 0 0 0 0.09 0 0 0 0 0 -404.294 0 0 -2330.16 0 0 2122.94 0 0 0 1258.81 0 0 0 173.421 0 0 0 0 0 0 0 0 0 0 0 -1264.31 0 0 0 0 0 0 0 0 0 0 0 0 1254.54 0 0 0 0 0 
0 0 0 712.226 0 0 0 220.878 -362.178 0 0 0 0 0 0 0 0 0 1953.26 0 0 0 0 2252.34 0 0 0 0 0 0 0 0.04 0 -307.398 0 0 0 0 0 0 0 0 0 0 0 0 0 0 0 0 0 1660.44 0 0 0 0 0 0 -585.574 0 0 0 0 0 0 0 0 0 -119.709 0 1898.63 0 0 0 0 0 0 0 0 0 0 
0 0 0 0 0 1187.25 0 0 0 0 0 0 1308.71 0 0 0 0 -435.118 0 0 0 0 0 0 -748.39 0 0 -2369.84 0 0 0 0 0.06 0 0 0 0 0 1258.66 0 0 0 0 0 238.884 0 0 1960.74 0 1465.42 0 0 0 0 0 0 0 0 0 -1733.99 0 -696.661 0 0 0 0 1622.9 1517.3 0 0 0 0 -1126.82 -118.641 0 0 0 0 0 0 1558.66 
0 1595.74 0 -462.127 0 0 0 0 0 0 0 0 0 0 0 0 0 0 0 0 0 0 0 0 0 0 0 -2251.73 192.343 0 0 1422.09 0 0.03 0 0 0 0 0 0 0 0 0 0 816.446 0 0 0 591.067 0 0 0 0 0 0 0 0 0 0 1154.74 0 0 0 0 0 0 0 0 0 0 0 0 0 0 0 0 0 0 0 0 0 
0 0 0 2308.65 0 0 0 0 0 0 0 0 425.504 0 0 0 0 -347.224 0 1926.25 0 0 0 0 0 0 0 0 0 0 0 0 0 0 0 0 0 0 0 -2434.23 0 0 0 0 0 0 0 0 0 0 0 0 0 0 0 0 0 0 0 0 0 0 2328.33 0 0 383.236 0 0 0 999.71 0 0 0 0 0 0 0 0 0 0 0 
0 0 1992.93 -1726.97 0 0 0 0 0 0 860.393 0 0 1274.07 0 601.749 0 0 0 0 0 -1960.28 0 0 0 505.158 2494.51 0 0 0 0 0 0 0 0 0 0 -645.238 0 0 -1241.87 -212.333 0 0 2338.71 0 0 0 0 0 0 0 0 0 0 0 0 381.863 0 0 0 0 2080.22 0 0 0 0 0 -813.852 0 0 0 -2021.32 0 0 0 0 0 0 0 0 
0 0 0 0 0 0 0 0 1164.2 0 1380.43 0 0 0 0 1183.74 0 0 0 0 0 0 265.893 0 0 0 0 2353.82 18.3874 0 -1281.55 0 0 0 0 0 0.03 0 0 0 0 -732.978 0 0 0 368.892 0 0 -1624.42 -850.017 0 0 0 0 0 0 0 0 0 0 0 0 0 0 2207.63 0 0 0 0 338.374 0 500.275 0 0 2034.75 0 1668.37 0 0 0 0 
0 0 0 0 0 0 0 0 0 0 0 0 0 0 0 0 1339.38 0 0 0 -72.2526 -1777.63 0 930.738 0 0 0 299.463 0 0 0 0 0 0 0 60.9607 0 0.03 0 0 0 0 0 0 0 0 0 0 0 0 0 0 0 0 0 0 0 0 0 0 0 0 0 0 0 0 0 0 0 0 1551.64 893.048 0 0 0 0 0 0 0 0 0 
2093.95 -512.177 0 0 0 0 0 0 0 0 0 0 0 0 0 0 0 0 0 -981.857 0 -64.7755 0 0 0 0 0 0 0 0 0 0 -1695.23 0 0 0 0 0 0.02 0 0 0 0 0 0 0 0 0 0 -239.341 0 2489.78 0 0 0 0 0 2451.17 0 1835.31 0 0 0 0 0 0 0 0 0 0 0 199.21 0 0 -1109.73 0 0 0 505.31 0 0 
0 -2146.44 969.649 0 0 0 706.122 0 0 0 1562.62 1827.37 0 0 0 0 0 0 0 0 0 0 0 0 0 0 0 0 0 0 700.018 0 0 0 2412.72 0 0 0 0 0.02 0 0 0 0 0 0 0 0 -54.3992 0 0 0 -551.851 0 0 0 452.513 -2258.9 0 0 0 0 0 0 0 0 0 0 878.704 650.731 2359 0 0 0 0 0 0 0 0 0 0 
0 0 0 0 0 0 0 0 0 0 0 0 0 0 0 0 0 0 1539.43 0 0 0 0 0 0 0 0 0 1680.58 0 0 0 0 0 0 -2482.6 0 0 0 0 0.09 0 0 0 0 376.37 0 -225.303 0 0 0 0 0 0 -991.012 0 0 0 0 0 0 0 0 0 2473.75 0 0 0 0 0 0 0 0 0 2065.11 0 0 0 0 0 0 
0 1646.86 0 0 0 0 0 0 0 0 0 0 0 0 370.266 0 0 0 0 0 0 0 0 0 0 0 0 0 0 0 0 0 0 0 0 -2242.88 2106.01 0 0 0 0 0 -1672.8 0 0 518.738 0 0 849.254 0 0 0 0 0 0 0 0 0 0 0 0 0 -875.5 0 0 0 0 -89.3429 21.897 2473.6 0 0 0 0 0 0 0 0 0 0 0 
0 0 0 0 0 0 0 0 0 0 0 0 0 0 0 0 0 1081.8 0 2460.17 0 0 0 0 68.1326 -1148.18 0 0 0 0 -172.048 0 0 0 0 0 0 0 0 0 0 -1281.4 0.06 0 0 2236.63 0 0 0 0 689.489 0 0 0 1451.08 0 0 0 0 0 0 0 0 0 0 0 0 0 0 0 0 0 0 0 0 0 0 0 0 0 0 
0 0 0 0 0 0 0 0 0 0 0 0 0 0 0 0 0 0 0 0 0 0 0 0 0 -151.601 0 0 0 0 0 0 0 0 0 0 0 0 0 0 0 0 0 0.03 1845.68 0 0 0 0 0 -912.885 0 0 0 0 0 0 -106.586 0 0 0 0 682.623 0 0 0 0 0 0 0 0 98.6511 0 0 208.518 0 0 0 0 0 0 
0 0 0 0 0 0 2335.05 0 0 0 0 0 0 0 0 2394.41 0 -2025.89 0 0 1757.48 0 0 0 0 0 0 0 0 0 0 0 -334.101 -2452.54 0 1817.45 0 0 0 0 0 0 0 -1191.98 0.06 0 0 0 0 0 1015.43 0 0 0 0 0 0 0 0 0 -988.876 0 1199.3 0 0 0 0 0 0 0 0 0 0 0 0 1234.4 0 0 0 0 0 
540.406 1002.46 0 0 -176.626 -1345.79 0 0 0 1205.4 0 0 2310.17 0 0 1682.56 0 0 0 987.96 0 0 0 0 0 0 0 0 -1173.82 0 0 0 0 0 0 0 2376.55 0 0 0 -1200.52 -268.334 -2351.83 0 0 0 0 0 0 0 0 0 0 0 0 0 0 0 0 0 0 -20.6763 0 0 0 0 0 0 0 0 5.87481 0 0 0 0 0 0 0 0 0 0 
0 0 0 0 0 0 0 0 0 58.2141 0 0 0 -476.623 2131.95 528.047 0 0 0 0 -1986.98 0 0 0 0 0 0 -1371.58 0 0 107.654 0 0 0 0 0 0 0 0 0 0 0 0 0 0 0 0.07 -4.95926 1161.46 0 0 0 0 0 0 0 0 0 0 0 -960.494 0 0 -214.011 0 0 0 0 0 1939.07 0 2077.32 0 0 0 0 0 0 0 0 0 
0 0 0 1800.52 0 0 0 0 0 0 0 1022.75 0 0 0 0 1702.7 0 0 0 0 0 0 0 0 0 0 0 0 0 0 0 579.623 0 0 0 0 0 0 0 -1011 0 0 0 0 0 785.775 0.04 0 0 0 -1687.75 0 0 0 0 0 0 0 2325.13 0 0 0 0 0 0 0 -193.411 0 0 0 0 0 0 0 0 0 800.882 0 0 0 
0 -1098.44 0 0 66.9118 0 0 0 0 0 0 0 0 0 0 0 0 0 0 0 0 0 2190.39 0 0 -1985.15 -407.956 0 1415.07 0 0 0 0 -297.021 0 0 -954.695 0 0 -1652.81 0 1700.42 0 0 0 0 2465.67 0 0.04 0 0 0 0 0 0 0 0 0 0 933.943 -188.986 0 0 0 0 0 0 0 0 0 0 0 0 0 2346.34 0 0 0 0 0 0 
-1586.12 0 0 0 0 1024.28 -1275.6 0 0 1809.21 0 0 0 0 0 0 0 2305.14 0 0 0 0 0 0 0 0 0 0 0 0 0 0 2357.48 0 0 0 -980.483 0 -2122.79 0 0 0 0 0 0 0 0 0 0 0.01 0 0 0 0 0 0 0 735.725 0 0 0 0 0 0 0 0 0 -299.158 0 0 0 0 0 0 514.313 0 0 0 0 0 0 
0 -979.11 0 0 477.081 0 0 0 974.685 0 0 0 0 0 0 0 0 0 0 0 0 0 0 0 0 0 0 0 0 0 1408.81 0 0 0 0 0 0 0 0 0 0 0 1986.07 1435.82 1080.74 0 0 0 0 0 0 0 0 0 0 0 0 2059.31 0 0 0 1.44963 0 0 0 0 0 0 653.935 0 0 0 0 0 0 0 0 0 0 0 0 
-1352.96 0 0 0 0 0 0 0 0 0 0 0 0 0 0 0 0 0 0 0 2298.27 0 0 0 0 0 0 0 0 0 0 1300.62 0 0 0 0 0 0 1788.92 0 0 0 0 0 0 0 0 1080.74 0 0 0 0.01 0 0 0 0 0 0 0 0 2337.95 0 0 0 0 0 599.918 0 0 0 0 0 0 0 0 0 0 0 0 0 0 
0 0 0 0 0 0 0 0 0 0 0 0 0 0 0 1277.28 1616.79 0 580.996 0 0 0 0 0 0 0 0 0 0 0 0 0 0 0 0 0 0 0 0 -560.854 0 0 0 0 0 0 0 0 0 0 0 0 0.09 0 0 0 0 -929.975 2266.84 0 0 0 0 0 0 2113.94 0 0 0 0 0 2339.47 0 0 0 0 -1285.21 0 0 0 0 
0 0 0 0 0 0 0 0 0 0 0 0 0 0 669.042 0 0 2192.53 0 2136.52 0 0 0 0 0 0 0 0 -2486.72 0 0 0 0 0 0 0 0 0 0 0 0 0 0 0 0 0 0 0 0 0 0 0 0 0.09 0 0 0 0 0 0 0 0 0 0 1501.89 1608.55 0 0 0 0 0 0 0 0 0 0 0 0 0 0 0 
0 0 0 0 0 0 -2094.41 -955.916 0 0 1344.72 0 0 0 -2074.57 0 0 0 0 0 0 0 0 0 2019.03 0 0 0 0 2375.64 0 0 0 0 0 0 0 0 0 0 2297.05 0 -1618.93 0 0 0 0 0 0 0 0 0 0 0 0.06 0 0 0 0 0 0 0 0 1932.97 976.516 0 0 0 -479.98 2484.59 0 0 0 0 0 0 0 0 0 0 0 
0 0 0 0 0 0 1350.83 0 0 1353.57 0 0 0 0 0 135.273 0 1491.06 0 0 0 0 0 0 0 0 0 0 0 0 0 0 0 0 0 0 0 0 0 0 0 0 0 0 0 0 0 0 0 0 0 0 0 0 0 0.04 0 -1739.02 0 0 0 0 2049.55 0 703.223 0 0 0 0 0 0 0 -352.107 0 0 -30.9 0 0 0 0 0 
-1343.2 0 -78.9666 0 0 0 0 0 0 0 0 0 0 0 0 0 0 0 0 0 0 2285.91 15.7933 0 1981.49 0 0 0 0 0 0 0 0 0 0 0 0 0 0 -53.7889 0 0 0 0 0 0 0 0 0 0 0 0 0 0 0 0 0.08 0 0 0 1569.49 0 0 0 0 0 -52.8733 392.544 0 0 0 0 -920.82 0 0 -1192.13 0 0 0 0 0 
0 0 0 -740.913 0 0 0 0 0 0 0 0 0 0 0 0 0 0 0 0 0 0 0 0 1111.1 0 0 0 0 0 0 0 0 0 0 428.861 0 0 1122.7 -491.577 0 0 0 94.2259 0 0 0 0 0 -996.658 2087.54 0 -155.11 0 0 259.941 0 0.02 -419.401 0 0 0 229.881 0 0 0 0 0 0 0 0 0 0 31.3578 0 0 0 0 0 0 0 
0 0 0 0 893.506 0 0 0 0 0 0 0 0 0 0 0 0 0 -907.392 0 0 -638.218 0 0 0 1887.49 0 0 0 0 0 648.9 0 0 0 0 0 0 0 0 0 0 0 0 0 0 0 0 0 0 0 0 1078.91 0 0 0 0 553.682 0.06 0 2075.95 0 0 0 0 0 0 0 -1584.75 0 0 -961.562 -1345.48 0 0 0 1133.38 0 0 0 0 
0 0 0 0 0 0 0 229.423 0 0 436.338 0 0 -1838.21 222.556 0 0 0 0 2081.44 0 0 0 0 0 0 0 0 0 0 0 0 778.909 1159.47 0 0 0 0 1863.54 0 0 0 0 0 0 0 0 2098.38 454.65 0 0 0 0 0 0 0 0 0 0 0.06 -2408.14 0 0 -1293.45 0 0 0 0 0 0 0 0 0 0 0 0 0 0 0 0 0 
0 0 -1456.27 0 -1306.57 0 0 0 0 0 0 -412.992 -1038.47 0 0 231.407 0 0 0 0 0 0 0 0 0 0 0 0 1031.14 0 0 0 0 0 0 0 0 0 0 0 0 0 0 0 -1738.11 0 1934.34 0 1632.97 0 0 -508.209 0 0 0 0 1931.59 0 1874.22 1818.06 0 0 0 0 -684.149 0 0 0 2183.68 2409.21 0 0 -612.888 0 0 0 0 0 0 0 0 
-1535.62 -1638.31 0 0 -47.8378 0 0 0 -587.252 0 0 0 0 0 409.635 0 0 0 0 2013.38 0 0 0 0 0 0 0 0 -677.129 0 0 0 194.479 0 0 0 0 0 0 0 0 0 0 0 0 2371.52 0 0 0 0 1133.99 0 0 0 0 0 0 0 0 0 0 0.01 -1338.77 0 0 0 0 0 0 -1516.69 0 0 0 0 0 1734.44 0 0 0 0 0 
0 0 2422.94 0 0 0 0 0 0 0 0 0 0 0 0 0 0 1798.23 0 0 0 0 0 0 0 0 1161.92 0 0 0 2252.49 0 0 0 -1146.35 1108.66 0 0 0 0 0 887.097 0 -1647.47 -1703.92 0 0 0 0 0 0 0 0 0 0 896.405 0 -1550.42 0 0 0 -1897.87 0.04 0 -175.405 0 0 0 0 0 0 0 0 0 1126.51 -39.14 0 0 0 0 0 
0 2320.7 0 0 0 0 0 -1453.83 0 0 0 0 0 0 0 0 0 0 0 0 0 0 0 0 -1364.25 0 0 0 0 0 0 0 0 0 0 0 0 0 0 0 0 0 0 0 0 0 2433.16 0 0 0 0 0 0 0 1515.17 0 0 0 0 764.107 0 0 0 0.02 0 0 0 0 0 0 0 0 0 0 0 0 0 0 0 0 -2293.85 
0 0 0 0 0 -1325.8 0 0 0 0 0 0 0 0 0 0 0 0 0 0 0 0 0 0 0 0 0 1604.43 0 0 0 0 0 0 0 0 1400.72 0 0 0 1937.7 0 0 0 0 0 0 0 0 0 0 0 0 -741.371 -806.375 -2474.21 0 0 0 0 1832.26 0 -971.328 0 0.06 0 0 0 0 0 0 0 0 1564.15 0 0 0 0 0 0 0 
0 0 0 0 0 0 0 0 0 0 0 0 0 0 0 0 2440.03 0 0 0 0 0 0 1123 0 0 0 0 0 -1082.42 0 0 0 0 -578.86 0 0 0 0 0 0 0 0 0 0 0 0 0 0 0 0 0 2325.43 1665.17 0 0 0 0 0 0 0 0 0 0 0 0.06 0 0 0 0 0 0 -243.919 0 1542.79 1721.47 0 0 0 0 0 
-714.667 0 0 0 0 0 0 0 0 -2104.33 2230.83 0 0 -2165.82 0 0 0 0 0 0 0 0 685.98 0 0 0 0 0 -871.075 0 0 0 -726.417 0 0 0 0 0 0 0 0 0 0 0 0 0 0 0 0 0 0 2114.09 0 0 0 0 -112.995 0 0 0 0 0 0 0 0 0 0.08 0 1554.69 0 33.3415 0 643.712 2208.7 0 0 0 0 0 0 0 
0 0 38.6822 0 -2426.76 0 0 0 0 0 0 0 0 0 0 0 0 0 0 0 0 0 0 -843.608 0 0 0 0 0 0 0 0 2097.16 0 0 0 0 0 0 0 0 1857.28 0 0 0 0 0 160.451 0 -575.198 0 0 0 0 0 0 -1821.88 0 0 0 0 0 0 0 0 0 0 0.03 0 0 0 637.913 0 0 0 1993.85 -939.589 0 0 0 0 
747.78 0 0 0 0 0 0 0 0 0 2091.97 552.309 0 0 0 0 0 0 -2108.91 -784.86 0 0 0 0 -73.7785 0 0 0 1039.54 0 0 1647.16 0 0 0 2093.65 0 0 0 1793.8 0 -1285.82 0 0 0 0 0 0 0 0 2192.83 0 0 0 -2361.45 0 0 0 597.324 0 -73.7785 0 0 0 0 0 2274.77 0 0.03 0 0 0 0 0 0 0 0 0 0 0 0 
0 0 0 0 0 0 0 0 0 0 1353.27 0 0 0 0 0 0 0 0 0 0 0 719.55 1017.56 0 0 -1465.42 0 0 0 0 0 0 0 -1716.13 0 -1481.44 0 0 669.652 0 266.808 0 0 0 0 -1367.46 0 0 0 0 0 0 0 1899.4 0 0 0 0 0 1355.4 512.177 0 0 0 0 0 0 0 0 0 0 0 2010.79 0 0 0 0 0 0 0 
0 0 0 0 -890.759 2079.61 0 0 0 -1378.9 0 0 0 0 0 0 0 0 1393.25 0 0 0 0 0 0 0 0 0 0 0 0 228.355 0 0 0 0 0 609.684 0 -680.486 0 0 0 0 0 508.82 0 0 0 0 0 0 0 0 0 0 0 0 0 0 0 0 0 0 0 0 1735.66 0 0 0 0.04 0 0 0 0 0 0 0 0 0 0 
0 0 0 0 0 0 0 0 0 1292.99 0 0 0 0 0 0 0 2239.37 0 0 0 0 0 0 0 0 -1948.07 0 0 0 0 0 0 0 0 0 -1884.59 1005.51 -1041.67 0 0 0 0 944.319 0 0 1088.06 0 0 0 0 0 -543.764 0 0 0 0 0 -1097.06 0 0 0 0 0 0 0 0 2368.31 0 0 0 0.07 0 0 1039.54 0 0 0 0 0 0 
0 -745.796 0 -1494.57 0 0 0 0 0 0 1465.58 0 0 0 0 0 0 0 0 0 0 0 237.663 0 0 0 0 0 773.873 0 0 0 1666.23 0 0 547.273 0 0 0 0 0 0 0 0 0 0 0 0 0 0 0 0 0 0 0 1306.27 -1879.71 0 -2173.91 0 2121.57 0 0 0 0 -2244.1 441.679 0 0 0 0 0 0.09 0 0 0 0 0 0 0 0 
0 0 906.934 0 0 -1773.05 0 0 0 0 331.05 0 0 0 0 0 0 0 0 0 0 0 0 0 0 0 0 0 0 0 0 0 851.39 0 0 0 0 0 0 0 0 0 0 0 0 0 0 0 0 0 0 0 0 0 0 0 0 -786.081 0 0 0 0 0 0 1676.31 0 2175.89 0 0 -980.026 0 0 0 0.06 0 0 0 0 0 0 0 
0 0 0 0 0 0 0 0 2266.08 0 0 0 -262.993 0 0 -1638.31 0 0 1268.58 0 0 0 0 0 0 0 0 0 0 0 0 0 0 0 0 0 1163.44 0 315.485 0 -147.481 0 0 1521.73 0 0 0 0 1180.99 768.227 0 0 0 0 0 0 0 0 0 0 0 0 281.61 0 0 -34.4096 0 0 0 0 0 -355.77 0 0 0.02 0 0 0 0 0 0 
0 0 0 2487.18 0 0 2495.27 0 0 0 0 0 0 0 0 1875.13 0 1645.02 0 0 0 -2456.97 0 0 0 0 0 0 0 0 -458.922 0 0 0 0 0 0 0 0 0 0 0 0 0 238.578 0 0 0 0 0 0 0 0 0 0 2474.97 -1927.78 0 0 0 0 2348.02 -2384.64 0 0 2408.44 0 -1020.92 0 0 0 0 0 0 0 0.04 0 0 15.183 0 0 
0 0 0 0 0 0 0 0 0 0 0 -397.275 0 0 0 0 0 778.756 0 0 0 0 0 0 0 0 0 0 0 0 0 0 0 0 0 0 2292.32 0 0 0 0 0 0 0 0 0 0 0 0 0 0 0 -615.024 0 0 0 0 0 -1667.3 0 0 0 0 0 0 0 0 2392.27 0 0 0 0 0 0 0 0 0.06 0 0 0 0 
0 0 0 0 0 0 0 0 0 0 0 0 0 0 0 0 0 0 0 0 2253.41 0 0 0 0 0 0 0 0 0 0 0 0 0 0 0 0 0 0 0 0 0 0 0 0 0 0 -1628.7 0 0 0 0 0 0 0 0 0 0 0 0 0 0 0 0 0 0 0 0 0 0 0 0 0 0 0 0 0 0.07 0 0 0 
0 0 0 0 0 0 0 0 0 0 0 0 0 0 0 0 0 0 0 0 0 0 0 0 0 0 0 0 0 0 0 0 0 0 0 0 0 0 629.826 0 0 0 0 0 0 0 0 0 0 0 0 0 0 0 0 0 0 0 0 0 0 0 0 0 0 0 0 0 0 0 0 0 0 0 0 1296.81 0 0 0.01 0 0 
0 0 0 0 0 0 0 0 0 0 0 0 0 0 470.519 0 0 0 0 -379.269 0 0 0 0 0 0 0 0 0 0 0 0 0 0 0 0 0 0 0 0 0 0 0 0 0 0 0 0 0 0 0 0 0 0 0 0 0 0 0 0 0 0 0 0 0 0 0 0 0 0 0 0 0 0 0 0 0 0 0 0.06 0 
0 0 0 0 0 0 0 0 0 0 0 0 0 804.086 0 0 0 0 0 0 0 0 0 0 0 0 0 0 0 0 0 0 2395.32 0 0 0 0 0 0 0 0 0 0 0 0 0 0 0 0 0 0 0 0 0 0 0 0 0 0 0 0 0 0 1662.42 0 0 0 0 0 0 0 0 0 0 0 0 0 0 0 0 0.05 
