*Vertices 69
*Matrix 
0.03 0 0 -2195.88 0 0 0 0 0 0 0 0 0 0 0 0 0 0 0 0 1913.28 0 0 0 0 -93.4629 0 0 0 0 720.771 0 0 0 0 0 0 0 0 0 0 0 0 0 721.381 0 -430.082 0 0 0 0 0 0 0 2354.58 0 -1972.79 0 0 0 0 0 0 0 0 0 0 0 0 
0 0 0 0 0 0 0 0 0 0 0 0 1574.83 0 0 0 0 0 0 1921.22 0 0 0 0 0 0 0 0 0 0 0 0 0 0 0 0 0 2188.56 0 2168.26 0 0 0 0 -2004.07 1897.87 0 0 0 0 2360.38 0 0 0 0 0 0 0 0 0 0 0 0 0 0 0 0 0 0 
0 0 0.01 0 0 0 0 0 0 0 0 0 0 1515.17 0 0 38.5296 -374.844 -1492.28 0 0 0 0 0 0 0 0 0 0 0 0 0 0 0 0 0 0 0 0 0 0 0 0 0 0 0 0 0 -1537.6 2368.77 0 0 0 0 0 0 0 0 0 0 0 0 0 0 0 0 0 0 0 
-949.355 0 0 0.06 0 0 0 0 0 1590.24 0 0 0 0 0 0 0 0 0 0 0 -118.793 0 0 613.346 0 0 0 0 856.12 8.1637 0 0 0 0 0 0 0 0 0 0 0 0 0 0 0 0 0 0 0 0 0 0 0 -1679.36 181.204 2423.25 0 0 -1732.31 0 0 0 0 0 0 0 0 0 
0 0 0 0 0.01 0 0 0 1745.58 0 0 0 0 0 0 0 0 0 0 -1902.14 0 0 0 0 0 0 0 0 1836.38 1854.23 0 0 0 -2153 0 0 0 1975.39 0 0 0 0 0 0 0 0 0 0 0 0 0 0 0 0 0 0 0 0 0 0 0 0 0 0 0 0 0 0 0 
0 0 0 0 0 0.04 0 0 -1887.95 0 0 0 0 0 0 -2215.57 0 0 0 0 0 1743.75 0 0 0 0 0 0 0 511.567 0 0 0 0 -287.561 0 0 0 1110.49 0 0 0 1307.79 0 0 0 1543.7 0 0 0 0 0 0 0 0 0 0 0 0 0 0 0 0 0 0 0 0 0 2339.63 
0 0 0 0 0 0 0.03 0 0 0 1090.66 0 0 -780.892 0 0 0 0 0 0 0 0 0 0 0 0 2120.66 0 0 0 0 -2315.36 0 0 0 0 0 0 0 0 0 -680.639 0 2054.58 2133.32 0 0 0 0 0 0 0 0 0 0 0 0 0 0 0 0 0 2189.32 0 0 0 0 0 0 
0 0 0 0 0 0 0 0.03 2018.11 0 -1519.9 0 0 0 1664.56 0 0 0 0 0 0 0 0 0 0 432.676 0 0 0 0 0 0 0 0 0 0 0 -853.069 0 0 0 0 328.455 2123.4 -1073.87 0 0 0 -1936.32 866.802 0 0 0 0 0 1581.24 0 0 0 0 0 0 0 0 0 0 0 0 0 
0 0 0 0 1810.43 -601.291 0 1967.76 0.05 0 0 0 0 0 1339.08 0 0 0 0 0 0 0 0 0 0 0 0 0 2081.74 0 0 0 0 0 0 0 0 0 0 0 0 0 0 0 0 0 0 2265.62 0 0 0 0 0 0 0 444.121 0 0 0 0 0 0 0 0 0 -718.177 0 -1705.15 0 
0 0 0 -1328.09 0 0 0 0 0 0.03 250.786 2211.14 0 0 0 0 0 0 0 0 1910.99 0 0 0 1609.32 0 0 0 0 0 0 0 0 0 0 1791.36 0 1737.65 0 0 1503.42 0 0 0 0 0 0 0 0 0 896.1 0 0 0 0 0 0 0 0 0 0 0 0 0 0 0 0 0 0 
0 0 0 0 0 0 2312.01 -1911.45 0 602.664 0.02 0 0 0 0 0 -732.978 0 0 -119.098 0 0 0 0 0 -1034.65 213.553 2364.5 0 0 0 0 776.925 0 0 0 0 0 48.1429 0 0 0 0 0 0 0 0 0 -1733.53 0 0 0 0 1367.92 0 0 0 0 0 0 0 0 0 0 0 0 0 0 0 
0 0 0 0 0 0 0 0 0 2464.9 0 0.04 2454.37 0 0 0 0 0 0 0 -256.89 0 -1964.86 0 0 0 0 0 0 0 0 0 -1392.79 0 0 0 0 0 0 0 0 0 0 0 0 2220.15 0 0 0 0 0 0 0 0 669.347 0 0 0 0 0 0 0 0 0 0 0 0 0 0 
0 -2265.77 0 0 0 0 0 0 0 0 0 -2290.03 0.02 0 0 0 0 0 0 2095.32 0 0 0 0 0 0 0 0 0 0 0 1306.73 0 0 0 0 0 2193.9 0 0 0 0 0 0 0 739.692 -682.47 0 0 0 0 0 0 0 0 950.575 0 0 0 0 0 0 0 0 0 0 0 0 0 
0 0 -1098.44 0 0 0 1953.72 0 0 0 0 0 0 0.09 0 0 0 0 0 -260.094 0 0 0 0 0 0 0 0 0 0 0 0 0 0 0 0 968.734 0 0 0 0 0 0 0 0 0 0 0 0 0 525.91 0 0 0 0 0 0 0 0 0 0 0 0 0 0 0 0 0 0 
0 0 0 0 0 0 0 -1296.35 1366.08 0 0 0 0 0 0.08 0 0 0 0 0 0 0 0 0 1540.04 2485.2 0 0 0 0 0 0 0 0 1238.06 810.038 0 0 208.975 0 0 0 0 170.37 0 0 0 0 0 0 0 637.913 0 2401.58 0 0 0 0 0 0 0 0 0 0 0 0 0 0 0 
0 0 0 0 0 -511.414 0 0 0 0 0 0 0 0 0 0.06 -173.727 0 0 0 0 0 0 0 0 0 263.756 0 0 0 0 0 0 0 881.298 0 0 0 0 901.135 1087.15 0 -1748.33 0 0 0 0 0 970.87 0 0 0 0 1475.95 0 0 0 0 0 0 0 0 0 0 0 0 0 0 0 
0 0 1754.13 0 0 0 0 0 0 0 1821.42 0 0 0 0 425.81 0.05 0 0 0 0 0 0 0 0 1691.72 0 0 304.956 0 0 0 0 0 0 0 0 0 0 0 0 0 0 0 0 -1787.39 0 0 0 0 0 0 0 -1174.89 0 0 0 0 0 0 0 0 0 0 0 0 0 0 0 
0 0 1773.51 0 0 0 0 0 0 0 0 0 0 0 0 0 0 0.09 0 2382.96 0 0 0 1945.17 0 1613.44 0 0 0 1262.17 0 0 0 0 0 0 0 -559.786 0 0 0 0 0 2296.9 0 0 0 0 0 1175.19 0 0 -1205.1 0 0 0 0 0 0 0 0 0 0 0 0 0 0 0 0 
0 0 517.365 0 0 0 0 0 0 0 0 0 0 0 0 0 0 0 0.04 0 0 0 0 0 0 1429.56 0 0 0 0 0 0 0 0 0 0 0 0 0 0 0 0 0 0 0 0 0 0 0 0 2285.61 0 0 0 0 0 0 0 0 0 0 0 0 0 0 0 0 0 0 
0 -1826.15 0 0 -2059.16 0 0 0 0 0 524.079 0 1109.73 820.719 0 0 0 1489.68 0 0.08 0 0 0 0 0 0 0 0 0 -1463.59 0 0 0 0 0 0 0 0 232.17 870.464 0 -356.227 0 0 0 0 0 -2262.57 0 0 0 0 -47.0748 0 0 0 1614.51 0 0 0 0 0 0 0 0 0 0 0 0 
1549.2 0 0 0 0 0 0 0 0 -794.168 0 2168.87 0 0 0 0 0 0 0 0 0 0 0 0 0 0 0 0 1076.31 0 0 0 0 0 0 0 0 0 0 0 2323.3 0 0 0 0 0 0 0 835.063 0 0 0 -2390.74 0 0 0 0 0 0 0 0 0 0 0 0 0 0 0 0 
0 0 0 -2397.92 0 608.158 0 0 0 0 0 0 0 0 0 0 0 0 0 0 0 0.05 0 1110.19 0 0 0 0 1996.29 1855.75 0 0 0 0 0 0 0 0 0 0 2417.29 0 0 -2378.84 0 0 0 0 0 0 0 0 801.798 0 0 0 0 0 0 0 0 0 0 0 0 0 0 0 0 
0 0 0 0 0 0 0 0 0 0 0 1221.43 0 0 0 0 0 0 0 0 0 0 0.03 0 0 0 0 0 0 0 0 0 0 0 0 0 0 0 0 0 0 0 0 0 0 0 -25.4067 0 0 0 0 0 0 0 0 1601.69 0 0 0 0 0 0 0 0 0 0 0 0 0 
0 0 0 0 0 0 0 0 0 0 0 0 0 0 0 0 0 396.359 0 0 0 2192.68 0 0.01 0 0 0 0 0 0 904.645 0 1267.05 0 0 0 0 0 0 0 0 0 0 0 0 0 0 0 0 197.531 2241.81 0 0 1373.87 0 0 0 0 0 0 0 0 0 0 0 0 0 0 0 
0 0 0 229.27 0 0 0 0 0 -1948.23 0 0 0 0 2413.02 0 0 0 0 0 0 0 0 0 0.07 0 0 0 0 2381.28 0 236.137 1424.99 0 0 0 0 0 0 0 0 0 0 0 0 0 0 0 0 0 0 -1799.91 0 0 0 0 0 0 0 0 0 0 0 0 0 0 0 0 0 
389.492 0 0 0 0 0 0 1095.23 0 0 2028.95 0 0 0 2211.14 0 40.8185 1316.64 -599.307 0 0 0 0 0 0 0.07 0 0 0 0 0 0 0 0 960.494 0 -2101.58 0 0 0 0 0 0 0 0 0 0 0 603.732 0 0 0 0 0 0 0 0 0 0 0 0 0 0 0 0 0 0 0 0 
0 0 0 0 0 0 686.743 0 0 0 273.827 0 0 0 0 2458.34 0 0 0 0 0 0 0 0 0 0 0 0 0 0 0 0 0 0 0 0 0 0 0 0 0 0 0 0 0 0 0 -1133.23 0 0 544.221 -1746.96 0 0 0 0 0 0 0 0 0 0 0 0 0 0 0 0 0 
0 0 0 0 0 0 0 0 0 0 1137.2 0 0 0 0 0 0 0 0 0 0 0 0 0 0 0 0 0.04 0 728.248 0 0 0 0 0 0 0 0 293.664 0 0 0 0 0 0 0 0 0 0 0 0 0 0 0 0 0 1530.43 0 0 0 0 0 0 0 0 0 0 0 0 
0 0 0 0 1359.98 0 0 0 -2186.73 0 0 0 0 0 0 0 -1680.27 0 0 0 1288.26 -1030.53 0 0 0 0 0 0 0.06 0 0 0 1862.93 0 0 0 0 0 134.816 0 0 1905.5 0 0 0 0 0 0 -689.947 2384.49 0 0 0 0 0 0 0 0 0 0 0 0 0 213.095 0 0 0 0 0 
0 0 0 280.999 -2477.57 -1569.34 0 0 0 0 0 0 0 0 0 0 0 518.891 0 133.442 0 -389.95 0 0 849.864 0 0 843.76 0 0.01 0 1809.21 0 0 0 0 -936.384 0 -1170.16 1652.81 0 0 1080.74 0 0 0 0 -659.581 0 0 0 0 2109.36 0 0 0 0 0 0 0 0 0 0 0 0 0 0 0 0 
60.3504 0 0 519.501 0 0 0 0 0 0 0 0 0 0 0 0 0 0 0 0 0 0 0 862.072 0 0 0 0 0 0 0.08 0 1859.87 0 0 0 0 0 0 0 0 0 0 0 0 0 0 876.873 0 0 0 0 0 0 0 0 -1101.34 0 0 0 0 0 0 0 0 0 1469.85 0 0 
0 0 0 0 0 0 -586.184 0 0 0 0 0 -1245.69 0 0 0 0 0 0 0 0 0 0 0 2413.33 0 0 0 0 1944.87 0 0.09 0 0 0 0 0 0 0 0 0 0 0 0 0 0 0 0 0 0 0 157.399 -509.583 0 1210.14 0 0 0 0 0 0 0 0 0 0 0 0 0 0 
0 0 0 0 0 0 0 0 0 0 -1517 1904.58 0 0 0 0 0 0 0 0 0 0 0 893.201 2230.98 0 0 0 0.0762963 0 -489.441 0 0.05 0 0 0 0 0 0 0 0 0 0 0 0 0 0 0 0 0 0 0 0 0 0 0 0 -86.7489 0 0 0 0 0 0 0 0 0 0 0 
0 0 0 0 1965.93 0 0 0 0 0 0 0 0 0 0 0 0 0 0 0 0 0 0 0 0 0 0 0 0 0 0 0 0 0.03 0 0 43.8704 0 0 1305.51 0 0 0 0 0 0 1497.77 0 0 0 0 2289.12 0 0 0 0 399.869 0 0 0 0 0 0 0 0 0 0 0 0 
0 0 0 0 0 -471.282 0 0 0 0 0 0 0 0 1150.01 2482.6 0 0 0 0 0 0 0 0 0 -1753.82 0 0 0 0 0 0 0 0 0.07 0 0 0 0 1995.38 0 0 0 0 0 0 0 0 0 0 0 0 0 0 0 391.324 0 0 0 0 0 0 0 0 0 0 0 0 0 
0 0 0 0 0 0 0 0 0 345.698 0 0 0 0 420.011 0 0 0 0 0 0 0 0 0 0 0 0 0 0 0 0 0 0 0 0 0.03 0 0 0 0 0 0 0 501.953 0 0 0 479.064 0 0 0 0 0 513.398 0 0 0 0 -2046.19 0 0 0 0 0 0 0 0 0 0 
0 0 0 0 0 0 0 0 0 0 0 0 0 -849.712 0 0 0 0 0 0 0 0 0 0 0 -2437.59 0 0 0 1891.46 0 0 0 2152.85 0 0 0.03 0 714.362 0 0 0 0 2150.87 0 0 1974.47 0 -1968.06 0 0 0 0 0 0 0 0 0 0 0 0 0 0 0 0 0 0 0 0 
0 -1036.79 0 0 1374.48 0 0 -1214.56 0 864.666 0 0 1827.37 0 0 0 0 2000.41 0 0 0 0 0 0 0 0 0 0 0 0 0 0 0 0 0 0 0 0.05 0 -1751.69 0 0 0 0 0 0 0 0 0 0 0 0 0 0 0 0 0 0 0 0 0 0 0 0 0 0 0 0 0 
0 0 0 0 0 -1419.95 0 0 0 0 1162.07 0 0 0 2168.26 0 0 0 0 483.184 0 0 0 0 0 0 0 194.021 -1331.45 1935.41 0 0 0 0 0 0 -1274.07 0 0.07 0 0 0 0 0 0 0 0 0 0 959.883 0 0 0 0 0 0 0 0 0 0 0 0 0 0 0 0 0 0 0 
0 1706.82 0 0 0 0 0 0 0 0 0 0 0 0 0 -2481.38 0 0 0 2349.7 0 0 0 0 0 0 0 0 0 156.941 0 0 0 2331.54 -1095.84 0 0 -752.968 0 0.05 0 0 0 0 0 0 0 0 0 0 0 0 0 1582.31 0 0 0 -797.983 0 0 0 -1131.86 0 0 605.411 0 0 0 0 
0 0 0 0 0 0 0 0 0 585.421 0 0 0 0 0 2131.34 0 0 0 0 -642.949 -1134.6 0 0 0 0 0 0 0 0 0 0 0 0 0 0 0 0 0 0 0.07 0 0 1331.29 0 0 0 0 0 0 0 0 0 0 -92.8526 0 0 0 0 0 0 0 0 0 0 0 0 0 0 
0 0 0 0 0 0 -1110.03 0 0 0 0 0 0 0 0 0 0 0 0 1688.51 0 0 0 0 0 0 0 0 -1512.88 0 0 0 0 0 0 0 0 0 0 0 0 0.06 0 0 0 0 0 0 0 1555.3 0 0 0 679.266 0 1872.54 -1023.51 0 0 0 0 0 0 0 0 0 0 0 0 
0 0 0 0 0 2169.48 0 -1136.28 0 0 0 0 0 0 0 -2258.45 0 0 0 0 0 0 0 0 0 0 0 0 0 687.353 0 0 0 0 0 0 0 0 0 0 0 0 0.02 0 0 -213.858 0 2402.04 0 1141.62 0 0 0 0 0 0 0 0 0 0 0 0 0 0 0 0 0 0 0 
0 0 0 0 0 0 -987.045 674.383 0 0 0 0 0 0 2198.17 0 0 889.843 0 0 0 -529.725 0 0 0 0 0 0 0 0 0 0 0 0 0 1256.22 -86.4437 0 0 0 -1851.48 0 0 0.05 0 0 2481.84 0 0 228.507 0 -300.378 0 0 0 0 0 0 0 0 0 0 0 0 0 0 0 0 0 
2091.66 -1342.13 0 0 0 0 1537.29 -1769.39 0 0 0 0 0 0 0 0 0 0 0 0 0 0 0 0 0 0 0 0 0 0 0 0 0 0 0 0 0 0 0 0 0 0 0 0 0.01 0 0 883.74 -133.595 0 0 0 0 0 2141.25 0 0 0 0 0 0 0 0 0 -2390.29 0 0 0 0 
0 548.189 0 0 0 0 0 0 0 0 0 -1073.56 2254.33 0 0 0 -240.715 0 0 0 0 0 0 0 0 0 0 0 0 0 0 0 0 0 0 0 0 0 0 0 0 0 2076.71 0 0 0.02 0 0 0 0 0 0 0 0 0 0 0 0 0 0 0 0 0 0 0 0 0 0 0 
181.967 0 0 0 0 1478.39 0 0 0 0 0 0 1793.65 0 0 0 0 0 0 0 0 0 1147.42 0 0 0 0 0 0 0 0 0 0 -1737.8 0 0 2195.73 0 0 0 0 0 0 908.46 0 0 0.05 1312.52 0 0 0 1349.15 0 0 -1893.75 0 0 0 0 0 -1122.09 0 0 0 0 0 0 0 -725.044 
0 0 0 0 0 0 0 0 -2265.92 0 0 0 0 0 0 0 0 0 0 1641.51 0 0 0 0 0 0 782.113 0 0 1014.36 1466.95 0 0 0 0 -305.109 0 0 0 0 0 0 -548.646 0 134.358 0 2241.51 0.05 0 0 0 0 0 0 0 998.032 0 0 0 0 0 0 0 0 0 0 0 0 0 
0 0 1565.22 0 0 0 0 -109.943 0 0 -519.501 0 0 0 0 1927.02 0 0 0 0 1280.63 0 0 0 0 1955.85 0 0 1263.54 0 0 0 0 0 0 0 1661.5 0 0 0 0 0 0 0 -597.324 0 0 0 0 0 0 0 0 0 0 0 0 231.407 0 0 0 0 0 0 0 0 0 0 0 
0 0 -795.541 0 0 0 0 -822.398 0 0 0 0 0 0 0 0 0 2013.08 0 0 0 0 0 868.175 0 0 0 0 343.257 0 0 0 0 0 0 0 0 0 464.263 0 0 -197.989 1540.8 651.036 0 0 0 0 0 0.05 -410.55 0 0 0 0 1836.07 0 0 0 0 0 0 0 0 0 0 0 0 0 
0 -792.489 0 0 0 0 0 0 0 -2499.54 0 0 0 1521.58 0 0 0 0 1292.84 0 0 0 0 -1342.74 0 0 512.329 0 0 0 0 0 0 0 0 0 0 0 0 0 0 0 0 0 0 0 0 0 0 -286.645 0.08 0 0 2268.36 0 0 0 0 0 0 0 0 0 0 0 0 0 0 0 
0 0 0 0 0 0 0 0 0 0 0 0 0 0 -497.223 0 0 0 0 0 0 0 0 0 873.669 0 1286.28 0 0 0 0 -1366.08 0 1326.11 0 0 0 0 0 0 0 0 0 1567.66 0 0 -972.396 0 0 0 0 0.03 0 0 -1063.49 2244.87 0 0 0 0 0 0 0 0 0 0 0 0 0 
0 0 0 0 0 0 0 0 0 0 0 0 0 0 0 0 0 1807.54 0 695.135 846.049 1858.35 0 0 0 0 0 0 0 -317.469 0 -969.802 0 0 0 0 0 0 0 0 0 0 0 0 0 0 0 0 0 0 0 0 0.07 0 0 0 0 0 0 0 0 0 0 0 0 0 0 0 0 
0 0 0 0 0 0 0 0 0 0 278.253 0 0 0 1196.71 -364.162 -1438.87 0 0 0 0 0 0 2145.22 0 0 0 0 0 0 0 0 0 0 0 204.093 0 0 0 1978.59 0 2060.53 0 0 0 0 0 0 0 0 -2230.06 0 0 0.03 1667.76 0 0 0 0 0 0 0 0 0 0 0 0 0 0 
496.155 0 0 1628.24 0 0 0 0 0 0 0 1971.57 0 0 0 0 0 0 0 0 0 0 0 0 0 0 0 0 0 0 0 -127.338 0 0 0 0 0 0 0 0 -1549.35 0 0 0 1026.11 0 -714.057 0 0 0 0 -338.527 0 1347.01 0.04 0 -107.044 0 0 0 0 0 0 0 0 0 0 0 0 
0 0 0 504.242 0 0 0 -2108.91 2111.96 0 0 0 188.528 0 0 0 0 0 0 0 0 0 831.706 0 0 0 0 0 0 0 0 0 0 0 2476.35 0 0 0 0 0 0 219.504 0 0 0 0 0 2495.57 0 1994.92 0 -525.452 0 0 0 0.06 0 0 0 0 0 0 0 0 0 0 0 1353.11 0 
1328.09 0 0 -1566.44 0 0 0 0 0 0 0 0 0 0 0 0 0 0 0 2260.28 0 0 0 0 0 0 0 -127.949 0 0 1933.27 0 0 -895.184 0 0 0 0 0 0 0 1446.5 0 0 0 0 0 0 0 0 0 0 0 0 -1378.6 0 0.07 0 0 0 0 0 0 0 0 0 0 0 0 
0 0 0 0 0 0 0 0 0 0 0 0 0 0 0 0 0 0 0 0 0 0 0 0 0 0 0 0 0 0 0 0 1524.93 0 0 0 0 0 0 2353.97 0 0 0 0 0 0 0 0 1975.23 0 0 0 0 0 0 0 0 0.06 0 0 0 0 0 0 0 -1120.87 0 0 0 
0 0 0 0 0 0 0 0 0 0 0 0 0 0 0 0 0 0 0 0 0 0 0 0 0 0 0 0 0 0 0 0 0 0 0 951.643 0 0 0 0 0 0 0 0 0 0 0 0 0 0 0 0 0 0 0 0 0 0 0.01 0 0 0 0 0 0 0 0 0 0 
0 0 0 1540.19 0 0 0 0 0 0 0 0 0 0 0 0 0 0 0 0 0 0 0 0 0 0 0 0 0 0 0 0 0 0 0 0 0 0 0 0 0 0 0 0 0 0 0 0 0 0 0 0 0 0 0 0 0 0 0 0.02 0 0 0 0 0 0 0 0 0 
0 0 0 0 0 0 0 0 0 0 0 0 0 0 0 0 0 0 0 0 0 0 0 0 0 0 0 0 0 0 0 0 0 0 0 0 0 0 0 0 0 0 0 0 0 0 1923.51 0 0 0 0 0 0 0 0 0 0 0 0 0 0.01 0 0 0 0 0 -1793.65 0 0 
0 0 0 0 0 0 0 0 0 0 0 0 0 0 0 0 0 0 0 0 0 0 0 0 0 0 0 0 0 0 0 0 0 0 0 0 0 0 0 514.313 0 0 0 0 0 0 0 0 0 0 0 0 0 0 0 0 0 0 0 0 0 0.06 0 0 0 0 0 0 0 
0 0 0 0 0 0 1518.22 0 0 0 0 0 0 0 0 0 0 0 0 0 0 0 0 0 0 0 0 0 0 0 0 0 0 0 0 0 0 0 0 0 0 0 0 0 0 0 0 0 0 0 0 0 0 0 0 0 0 0 0 0 0 0 0.02 0 0 0 0 0 0 
0 0 0 0 0 0 0 0 0 0 0 0 0 0 0 0 0 0 0 0 0 0 0 0 0 0 0 0 1288.11 0 0 0 0 0 0 0 0 0 0 0 0 0 0 0 0 0 0 0 0 0 0 0 0 0 0 0 0 0 0 0 0 0 0 0.03 0 0 0 0 0 
0 0 0 0 0 0 0 0 0 0 0 0 0 0 0 0 0 0 0 0 0 0 0 0 0 0 0 0 0 0 0 0 0 0 0 0 0 0 0 711.921 0 0 0 0 -459.227 0 0 0 0 0 0 0 0 0 0 0 0 0 0 0 0 0 0 0 0.03 0 0 0 0 
0 0 0 0 0 0 0 0 679.571 0 0 0 0 0 0 0 0 0 0 0 0 0 0 0 0 0 0 0 0 0 0 0 0 0 0 0 0 0 0 0 0 0 0 0 0 0 0 0 0 0 0 0 0 0 0 0 0 -316.248 0 0 0 0 0 0 0 0.04 0 0 0 
0 0 0 0 0 0 0 0 0 0 0 0 0 0 0 0 0 0 0 0 0 0 0 0 0 0 0 0 0 0 803.323 0 0 0 0 0 0 0 0 0 0 0 0 0 0 0 0 0 0 0 0 0 0 0 0 0 0 0 0 0 2452.54 0 0 0 0 0 0.07 0 0 
0 0 0 0 0 0 0 0 691.778 0 0 0 0 0 0 0 0 0 0 0 0 0 0 0 0 0 0 0 0 0 0 0 0 0 0 0 0 0 0 0 0 0 0 0 0 0 0 0 0 0 0 0 0 0 0 2018.27 0 0 0 0 0 0 0 0 0 0 0 0.04 0 
0 0 0 0 0 2.36518 0 0 0 0 0 0 0 0 0 0 0 0 0 0 0 0 0 0 0 0 0 0 0 0 0 0 0 0 0 0 0 0 0 0 0 0 0 0 0 0 1126.67 0 0 0 0 0 0 0 0 0 0 0 0 0 0 0 0 0 0 0 0 0 0.06 
