*Vertices 50
*Matrix 
0.04 0 0 0 0 0 0 0 0 0 0 0 0 0 0 0 0 0 2135.15 0 -2393.34 0 -94.8363 0 1741.61 0 0 0 0 1673.1 0 0 0 0 0 0 0 0 -1537.29 0 0 0 0 0 0 0 0 0 0 0 
0 0.01 0 0 0 0 1013.29 2332.45 0 0 0 0 0 0 718.787 0 0 0 0 0 0 0 0 0 0 0 0 2142.63 0 0 0 -1260.34 0 697.272 0 0 0 0 0 0 0 0 -2004.53 0 0 0 0 0 0 0 
0 0 0.05 -1670.81 0 -1614.96 0 613.498 0 884.503 0 0 0 0 0 2389.07 0 0 0 0 -1203.27 0 1394.92 0 1494.87 0 0 0 0 0 0 0 0 0 0 0 0 0 0 0 0 2317.19 0 0 1883.53 -539.033 1139.79 0 0 0 
0 0 1760.84 0.08 0 0 0 0 0 -1257.74 0 -926.771 0 0 0 0 1090.81 0 0 0 0 0 23.423 0 0 0 0 0 0 0 0 0 0 0 0 0 1322.44 0 0 0 0 1588.11 0 0 0 0 0 0 0 0 
0 0 0 0 0.09 0 0 0 0 0 0 377.895 0 0 0 0 -925.55 0 0 0 0 0 0 0 0 0 0 0 0 0 2290.95 0 0 0 2417.29 0 0 -394.986 0 0 0 703.986 0 0 0 0 0 0 0 0 
0 0 1715.67 0 0 0 0 0 0 0 0 0 0 0 0 1056.78 0 0 0 1115.22 0 0 2268.97 0 0 0 0 0 0 0 0 0 2390.74 0 0 2122.18 0 0 0 0 -1909.92 0 0 0 0 0 0 -1922.28 0 0 
0 158.467 0 0 0 0 0.09 0 1174.89 0 0 2483.52 0 0 785.165 0 0 0 0 0 0 0 0 0 0 -1270.1 0 0 2416.23 0 0 0 0 0 0 0 0 -321.589 488.067 0 0 -1729.87 0 0 0 0 -1923.96 0 829.722 0 
0 -151.296 932.722 0 0 0 0 0.01 -532.319 1636.78 0 0 2060.53 0 0 -745.796 0 0 0 1085.92 0 0 0 0 0 0 0 0 0 0 0 0 0 0 0 0 0 0 0 0 0 0 0 -1682.26 0 0 0 0 0 0 
0 0 0 0 0 0 1292.54 -1970.5 0.08 0 2436.98 0 0 0 0 0 0 0 0 0 0 0 0 0 0 0 0 0 0 0 1949.45 0 0 0 0 -1402.86 0 -256.432 0 2352.6 0 0 0 0 0 0 0 0 0 0 
0 0 1482.06 368.435 0 0 0 594.882 0 0.01 0 0 0 0 0 0 0 0 0 0 1634.19 0 2422.33 0 0 0 240.562 0 0 0 0 1706.52 0 0 0 0 0 0 0 0 0 0 0 2137.29 0 0 0 0 0 0 
0 0 0 0 0 0 0 0 1914.35 0 0.03 0 0 0 0 0 0 0 0 -32.2733 0 463.958 0 0 0 0 0 0 0 0 0 0 0 0 1431.85 0 0 0 0 0 0 0 0 0 0 247.581 0 0 0 2310.02 
0 0 0 2459.41 2465.67 0 -974.075 0 0 0 0 0.03 0 -243.461 0 0 0 0 0 1562.17 0 0 0 -1238.21 0 0 1248.13 0 0 0 0 0 0 0 0 0 0 0 0 2470.4 142.75 0 0 0 0 0 0 0 1925.18 0 
0 0 0 0 0 0 0 1834.24 0 0 0 0 0.09 0 0 0 1494.11 0 0 0 0 0 0 1568.42 0 0 0 0 -1238.21 0 0 0 0 0 406.43 0 0 1903.21 718.482 0 0 0 0 0 0 2009.72 0 0 0 0 
0 0 0 0 0 0 0 0 0 0 0 2456.05 0 0.03 0 0 0 246.971 0 0 0 0 0 0 0 0 0 -2098.68 0 0 0 0 0 0 0 0 0 -1036.03 0 272.301 0 0 0 0 0 0 0 0 0 1982.25 
0 -126.423 0 0 0 0 -599.612 0 0 0 0 0 0 0 0.09 0 0 0 0 0 0 0 1901.23 0 0 0 0 0 0 -328.608 -695.135 0 0 0 0 0 0 0 0 0 0 0 438.932 0 0 0 1083.48 0 0 0 
0 0 -1370.36 0 0 -320.063 0 -546.205 0 0 0 0 0 0 0 0 0 743.965 0 1744.21 0 0 0 0 0 0 0 0 0 0 0 -1090.04 0 0 0 0 0 0 0 0 0 0 0 0 1955.24 0 0 0 0 0 
0 0 0 1532.87 -55.62 0 0 0 0 0 0 0 -1957.99 0 0 0 0.01 0 0 0 0 2483.83 0 0 0 0 0 0 0 0 0 0 0 0 0 0 2467.96 0 0 0 0 1047.93 0 846.202 0 0 0 0 0 0 
0 0 0 0 0 0 0 0 0 0 0 0 0 1654.48 0 2447.97 0 0.02 0 617.466 0 0 0 0 0 0 0 0 0 0 0 0 0 431.303 0 0 0 0 0 0 1941.21 0 0 0 0 0 2266.84 0 0 -567.263 
849.406 0 0 0 0 0 0 0 0 0 0 0 0 0 0 0 0 0 0.03 -1373.1 0 0 0 0 648.595 1604.43 0 0 0 0 0 0 0 0 0 0 0 360.042 0 0 0 0 0 0 0 0 0 0 0 0 
0 0 0 0 0 2145.83 0 -355.159 0 0 37.7667 2201.53 0 0 0 803.018 0 1152.46 1823.71 0.02 0 0 -26.017 0 0 0 0 0 0 -901.746 1847.51 0 0 0 1889.17 2291.41 0 0 0 100.33 0 0 0 0 0 0 0 0 0 0 
2171.01 0 1607.18 0 0 0 0 0 0 -2192.07 0 0 0 0 0 0 0 0 0 0 0.05 376.827 0 0 0 0 0 0 0 0 0 1902.3 0 0 0 0 0 0 -510.956 0 0 0 0 1433.99 0 0 -1844 0 0 0 
0 0 0 0 0 0 0 0 0 0 169.454 0 0 0 0 0 119.861 0 0 0 -1392.94 0.01 0 0 0 0 0 0 0 0 -1241.11 0 0 0 0 0 2315.06 0 2084.34 0 0 -870.312 0 0 0 0 0 0 0 0 
-924.482 0 1197.62 1497.77 0 -2274.16 0 0 0 1242.79 0 0 0 0 1805.25 0 0 0 0 1768.93 0 0 0.08 -2436.37 0 0 0 0 0 0 0 -1294.52 0 0 2010.48 0 0 0 1478.39 0 927.076 0 0 0 0 0 0 0 0 0 
0 0 0 0 0 0 0 0 0 0 0 238.884 1433.38 0 0 0 0 0 0 0 0 0 454.497 0.02 -283.898 1138.11 0 0 0 2229.15 -2249.9 -1547.52 2319.64 0 0 0 1108.05 0 0 0 0 2219.84 0 0 1226.16 0 0 0 0 -2410.89 
-428.098 0 1230.12 0 0 0 0 0 0 0 0 0 0 0 0 0 0 0 149.464 0 0 0 0 -1363.19 0.09 0 0 0 -1319.09 1715.52 0 0 0 0 0 0 0 0 0 1887.95 -974.685 0 0 0 0 0 0 0 0 0 
0 0 0 0 0 0 -2036.88 0 0 0 0 0 0 0 0 0 0 0 2470.85 0 0 0 0 -549.715 0 0.02 0 609.836 1880.93 0 -567.873 0 1580.94 0 0 1629.31 0 0 0 -2240.44 0 0 0 0 0 2219.38 0 0 428.709 0 
0 0 0 0 0 0 0 0 0 612.278 0 1547.98 0 0 0 0 0 0 0 0 0 0 0 0 0 0 0.05 0 0 -2468.72 0 0 0 0 0 0 0 0 0 0 0 0 0 0 0 0 0 0 0 0 
0 -1237.14 0 0 0 0 0 0 0 0 0 0 0 1414.46 0 0 0 0 0 0 0 0 0 0 0 561.617 0 0.08 -848.491 0 0 0 0 0 0 0 0 0 0 0 0 2258.6 0 -2054.73 0 0 0 0 76.3726 0 
0 0 0 0 0 0 2409.21 0 0 0 0 0 1059.53 0 0 0 0 0 0 0 0 0 0 0 785.165 2047.72 0 -94.9889 0.09 0 0 0 0 0 0 0 0 0 0 0 0 0 0 0 0 0 0 0 0 0 
-208.213 0 0 0 0 0 0 0 0 0 0 0 0 0 635.167 0 0 0 0 646.001 0 0 0 -1975.39 1108.05 0 1133.53 0 0 0.01 2086.47 2326.96 -1007.49 1592.68 1653.11 0 0 0 0 0 0 2172.08 0 0 0 0 0 0 0 -742.439 
0 0 0 0 2308.8 0 0 0 61.2659 0 0 0 0 0 -2038.56 0 0 0 0 1678.59 0 1713.23 0 -1209.83 0 -519.959 0 0 0 -1558.66 0.03 0 0 0 0 0 0 0 1018.63 0 0 0 0 0 0 0 0 0 0 0 
0 451.14 0 0 0 0 0 0 0 -1496.86 0 0 0 0 0 580.996 0 0 0 0 733.741 0 -331.812 -615.024 0 0 0 0 0 1872.08 0 0.08 0 0 0 0 0 0 0 0 0 2304.53 0 0 1464.66 1699.19 0 0 0 0 
0 0 0 0 0 1321.99 0 0 0 0 0 0 0 0 0 0 0 0 0 0 0 0 0 1024.28 0 2348.02 0 0 0 187.918 0 0 0.01 0 0 0 0 0 0 2282.25 0 0 0 0 0 0 0 0 0 0 
0 427.488 0 0 0 0 0 0 0 0 0 0 0 0 0 0 0 -2437.74 0 0 0 0 0 0 0 0 0 0 0 1714.91 0 0 0 0.08 0 0 0 0 0 0 0 0 0 0 0 0 0 0 0 2235.1 
0 0 0 0 -1261.86 0 0 0 0 0 1556.98 0 1861.09 0 0 0 0 0 0 -113.3 0 0 -1068.83 0 0 0 0 0 0 2368.31 0 0 0 0 0 0 0 0 0 0 0 0 0 0 0 0 0 1563.39 0 0 
0 0 0 0 0 2115.31 0 0 1120.11 0 0 0 0 0 0 0 0 0 0 -966.445 0 0 0 0 0 -1368.83 0 0 0 0 0 0 0 0 0 0.04 0 -1901.38 0 0 2096.39 0 0 1181.91 -1013.75 1835.61 0 0 0 962.63 
0 0 0 235.374 0 0 0 0 0 0 0 0 0 0 0 0 2477.11 0 0 0 0 1272.24 0 837.046 0 0 0 0 0 0 0 0 0 0 0 0 0.05 0 0 0 0 0 0 0 0 0 1757.64 0 0 0 
0 0 0 0 1826.46 0 1270.26 0 -2033.37 0 0 0 -731.147 2274.32 0 0 0 0 1583.99 0 0 0 0 0 0 0 0 0 0 0 0 0 0 0 0 1359.07 0 0.03 0 0 373.928 0 0 -974.837 0 0 0 0 0 0 
2368.92 0 0 0 0 0 861.309 0 0 0 0 0 1974.17 0 0 0 0 0 0 0 125.202 1706.21 426.725 0 0 0 0 0 0 0 480.285 0 0 0 0 0 0 0 0.04 0 0 0 0 0 0 0 -1689.58 0 -390.713 0 
0 0 0 0 0 0 0 0 2341.3 0 0 1055.1 0 -2004.68 0 0 0 0 0 -1380.12 0 0 0 0 -1113.7 869.396 0 0 0 0 0 0 568.789 0 0 0 0 0 0 0.03 -1325.04 1051.59 0 0 0 0 0 0 0 0 
0 0 0 0 0 -1549.2 0 0 0 0 0 -1492.43 0 0 0 0 0 1980.88 0 0 0 0 1724.98 0 -522.095 0 0 0 0 0 0 0 0 0 0 -1253.32 0 -105.365 0 -1363.95 0.07 0 0 0 1033.28 2060.84 0 0 0 0 
0 0 1834.09 -212.79 -1512.73 0 1414.46 0 0 0 0 0 0 0 0 0 -631.352 0 0 0 0 277.184 0 1125.9 0 0 0 781.961 0 -28.6111 0 -355.007 0 0 0 0 0 0 0 1816.08 0 0.03 0 -1703.77 0 0 -1371.43 0 0 0 
0 286.645 0 0 0 0 0 0 0 0 0 0 0 0 1299.1 0 0 0 0 0 0 0 0 0 0 0 0 0 0 0 0 0 0 0 0 0 0 0 0 0 0 0 0.02 0 0 0 0 0 0 0 
0 0 0 0 0 0 0 2042.68 0 -2050 0 0 0 0 0 0 2067.71 0 0 0 -2082.66 0 0 0 0 0 0 712.683 0 0 0 0 0 0 0 -2221.52 0 871.685 0 0 0 1657.54 0 0.08 0 0 0 0 0 0 
0 0 410.245 0 0 0 0 0 0 0 0 0 0 0 0 2418.52 0 0 0 0 0 0 0 1642.12 0 0 0 0 0 0 0 -2136.68 0 0 0 1080.58 0 0 0 0 1973.1 0 0 0 0.07 0 0 0 0 0 
0 0 153.127 0 0 0 0 0 0 0 424.894 0 2066.18 0 0 0 0 0 0 0 0 0 0 0 0 1699.65 0 0 0 0 0 -2447.05 0 0 0 1792.89 0 0 0 0 2494.2 0 0 0 0 0.07 0 0 -1253.01 0 
0 0 -383.084 0 0 0 1594.67 0 0 0 0 0 0 0 581.607 0 0 -1151.08 0 0 2167.04 0 0 0 0 0 0 0 0 0 0 0 0 0 0 0 -1993.39 0 762.276 0 0 624.18 0 0 0 0 0.03 1348.99 0 0 
0 0 0 0 0 2152.7 0 0 0 0 0 0 0 0 0 0 0 0 0 0 0 0 0 0 0 0 0 0 0 0 0 0 0 0 318.842 0 0 0 0 0 0 0 0 0 0 0 1442.84 0.03 0 0 
0 0 0 0 0 0 524.232 0 0 0 0 1954.79 0 0 0 0 0 0 0 0 0 0 0 0 0 -613.956 0 2169.03 0 0 0 0 0 0 0 0 0 0 -795.389 0 0 0 0 0 0 -678.503 0 0 0.05 0 
0 0 0 0 0 0 0 0 0 0 1963.64 0 0 367.977 0 0 0 -638.218 0 0 0 0 0 -985.672 0 0 0 0 0 -517.06 0 0 0 993.301 0 1509.98 0 0 0 0 0 0 0 0 0 0 0 0 0 0.06 
