*Vertices 35
*Matrix 
0.03 0 0 -153.432 0 0 1433.38 0 0 0 0 -299.005 -785.012 0 0 1740.39 0 0 0 0 0 0 0 0 0 0 0 0 0 1762.83 0 1290.7 0 0 0 
0 0.05 0 0 0 0 -1101.49 0 1381.65 0 0 0 0 0 0 0 675.909 845.897 0 0 0 0 0 0 0 0 0 0 0 0 0 1764.35 0 0 0 
0 0 0.01 0 -774.026 0 2009.41 0 0 0 470.214 0 0 0 0 0 0 0 0 0 -1127.89 0 -702.155 -1964.71 0 0 0 696.203 0 0 0 0 0 1515.93 0 
2382.5 0 0 0.06 0 0 0 -1756.87 -587.863 533.235 0 -1698.58 0 0 0 -133.29 0 0 0 0 2330.47 0 0 2305.9 0 0 0 0 0 0 -1154.44 0 0 887.86 1881.39 
0 0 1383.94 0 0.04 2172.69 0 1341.82 0 0 77.4407 329.829 0 -2078.69 2474.36 1944.87 0 -659.124 0 0 422.147 0 0 0 0 0 0 1666.08 0 0 2080.37 2052.45 0 0 0 
0 0 0 0 -185.629 0.09 0 0 0 0 1596.96 0 0 0 -1780.07 373.318 0 0 -29.2215 0 0 0 0 1009.63 0 0 0 420.011 0 0 0 1007.95 0 0 0 
211.417 2143.39 623.722 0 0 0 0.09 0 -1902.45 0 0 0 0 0 163.198 0 -494.781 0 0 0 1157.95 -1176.87 0 0 0 1836.68 0 0 0 2095.02 -1914.96 0 0 0 1604.89 
0 0 0 1985.76 1076.62 0 0 0.03 551.546 -2310.02 1343.81 0 0 2216.03 0 -1955.09 0 0 0 0 2012.92 0 0 0 0 282.983 0 0 1620.46 0 0 0 0 0 0 
0 1605.2 0 1048.23 0 0 686.438 -1271.63 0.09 0 1512.12 0 -1794.11 0 938.826 0 0 0 0 0 0 0 0 0 2129.81 0 1782.66 0 0 0 -1635.41 0 1215.02 0 0 
0 0 0 -93.4629 0 0 0 -1113.39 0 0.03 0 -463.805 0 0 0 0 1609.62 0 1795.18 0 0 0 0 0 0 0 0 -1605.04 0 1418.27 0 0 0 0 0 
0 0 -682.318 0 1295.43 -977.584 0 1657.69 2495.73 0 0.05 2498.63 0 0 0 0 -792.795 -2086.63 -598.239 0 -131.916 0 0 0 0 0 588.015 0 0 0 0 0 0 0 0 
1735.66 0 0 1825.39 1968.21 0 0 0 0 -502.106 -1131.24 0 572.909 -1685.46 985.824 0 -1688.97 -816.752 -1947.92 0 0 0 -1170.77 0 1951.28 -458.312 0 0 0 0 0 944.929 0 0 0 
-2446.44 0 0 0 0 0 0 0 1437.19 0 0 414.06 0.09 0 1140.71 -2316.28 0 0 0 0 -1836.68 196.463 2275.38 2206.72 0 0 95.294 0 0 0 0 0 439.848 0 0 
0 0 0 0 997.116 0 0 1994.16 0 0 0 -18.54 0 0.05 2376.4 2145.07 0 0 0 0 0 0 -1899.09 0 0 0 0 0 214.316 1916.94 0 0 0 0 0 
0 0 0 0 1069.75 2105.4 1004.14 0 1016.04 0 0 -1891.92 -758.003 1625.8 0.04 0 0 0 0 0 0 0 -2382.66 -1516.24 -961.562 701.392 0 0 0 0 1190.76 0 0 0 0 
-632.725 0 0 -473.876 25.2541 1170.92 0 -1420.71 0 0 0 0 148.854 138.63 0 0.05 0 0 -1998.89 0 -323.42 397.885 0 0 0 0 0 0 0 0 0 2481.23 0 0 0 
0 -434.965 0 0 0 0 449.614 0 0 1873 -264.061 -1176.72 0 0 0 0 0.06 0 0 0 0 1884.29 0 0 0 0 0 0 0 0 0 0 0 0 0 
0 -2488.86 0 0 417.112 0 0 0 0 0 -37.4615 1870.71 0 0 0 0 0 0.04 0 1645.79 0 0 0 0 0 2363.28 699.255 0 0 0 -1524.63 0 0 736.335 0 
0 0 0 0 0 -302.82 0 0 0 895.489 -652.104 1400.72 0 0 0 1085.92 0 0 0.08 337.916 0 0 0 -297.479 0 -2493.59 0 0 0 0 0 277.947 0 2458.95 0 
0 0 0 0 0 0 0 0 0 0 0 0 0 0 0 0 0 352.565 2266.23 0.01 0 0 0 0 1107.59 1138.26 0 0 -893.506 0 0 0 0 0 0 
0 0 894.726 2023.45 381.252 0 937.91 2180.01 0 0 1351.59 0 -750.221 0 0 1575.59 0 0 0 0 0.08 0 0 0 0 0 0 0 0 0 0 0 0 0 0 
0 0 0 0 0 0 1825.39 0 0 0 0 0 20.0659 0 0 -856.731 1249.35 0 0 0 0 0.03 1340.3 0 0 0 0 0 482.879 -2041.61 0 0 624.79 532.777 0 
0 0 1089.59 0 0 0 0 0 0 0 0 1710.94 -2074.57 -220.725 1521.73 0 0 0 0 0 0 2368.62 0.02 0 0 0 0 0 0 0 0 0 -1785.71 0 0 
0 0 -1678.44 1372.8 0 1805.25 0 0 0 0 0 0 -221.946 0 2223.35 0 0 0 -2124.01 0 0 0 0 0.07 1406.83 0 0 1100.42 0 0 0 0 0 2216.94 0 
0 0 0 0 0 0 0 0 -1495.64 0 0 1659.22 0 0 -1379.06 0 0 0 0 1718.73 0 0 0 -64.9281 0.03 0 0 0 0 0 0 0 0 0 989.944 
0 0 0 0 0 0 814.158 2489.62 0 0 0 -1086.69 0 0 -1034.81 0 0 2022.84 658.818 829.569 0 0 0 0 0 0.09 0 -1791.67 0 0 0 314.417 0 0 0 
0 0 0 0 0 0 0 0 1163.44 0 1665.62 0 -163.198 0 0 0 0 2434.69 0 0 0 0 0 0 0 0 0.08 0 1038.32 0 0 0 0 0 0 
0 0 2329.86 0 -970.412 1942.73 0 0 0 -1705.6 0 0 0 0 0 0 0 0 0 0 0 0 0 766.243 0 2377.77 0 0.04 0 0 0 0 0 0 0 
0 0 0 0 0 0 0 -559.938 0 0 0 0 0 -1815.47 0 0 0 0 0 2381.44 0 107.959 0 0 0 0 1244.32 0 0.03 0 0 0 0 0 0 
1310.54 0 0 0 0 0 942.793 0 0 -312.281 0 0 0 -1020.62 0 0 0 0 0 0 0 -1645.94 0 0 0 0 0 0 0 0.08 0 0 2359.77 0 0 
0 0 0 413.449 -38.5296 0 233.39 0 42.6496 0 0 0 0 0 2481.23 0 0 2320.55 0 0 0 0 0 0 0 0 0 0 0 0 0.09 0 0 0 0 
2207.94 548.494 0 0 -194.937 1316.95 0 0 0 0 0 1798.84 0 0 0 788.522 0 0 -725.959 0 0 0 0 0 0 685.98 0 0 0 0 0 0.06 0 0 1309.93 
0 0 0 0 0 0 0 0 -462.889 0 0 0 1522.34 0 0 0 0 0 0 0 0 2377.47 2322.53 0 0 0 0 0 0 -1608.25 0 0 0.07 0 0 
0 0 1607.03 2161.09 0 0 0 0 0 0 0 0 0 0 0 0 0 296.258 -1851.63 0 0 -263.451 0 -6.94296 0 0 0 0 0 0 0 0 0 0.01 0 
0 0 0 968.734 0 0 1233.02 0 0 0 0 0 0 0 0 0 0 0 0 0 0 0 0 0 -1114.31 0 0 0 0 0 0 -1126.36 0 0 0.07 
