*Vertices 67
*Matrix 
0.06 0 0 0 1817.76 0 0 0 0 0 0 0 0 0 0 0 0 0 1657.23 0 1269.65 1935.56 960.646 0 1721.47 0 0 0 422.3 0 0 633.488 0 0 0 0 0 0 0 0 0 1346.25 0 0 113.147 2202.75 0 0 0 0 0 -1993.7 1032.06 -604.953 0 0 0 0 0 0 -2335.2 0 0 0 0 0 -1441.31 
0 0.02 0 0 0 0 0 0 0 0 0 0 0 0 0 0 781.198 0 0 0 -1542.79 0 0 0 0 -214.621 0 0 0 79.8822 1897.11 2494.96 0 0 0 0 0 0 0 0 0 0 1978.9 0 0 0 0 0 0 0 -821.482 0 0 0 0 0 -342.647 0 0 0 0 0 0 0 2209.01 0 0 
0 0 0 1359.22 0 0 0 0 0 -415.738 0 0 0 0 0 0 0 0 0 0 0 2481.84 0 0 0 0 1476.41 0 1066.09 0 0 0 0 0 0 0 9.68963 0 0 0 358.516 0 0 0 0 0 0 0 0 -2284.69 0 0 0 0 0 0 0 0 0 0 0 0 0 0 0 0 0 
0 0 579.318 0.05 446.715 0 -960.952 0 0 0 0 0 0 1567.35 0 0 0 -1006.42 0 0 0 1754.74 0 0 0 0 0 0 1215.32 0 0 0 2351.37 -690.252 227.744 0 0 0 1923.2 1157.19 209.281 0 0 0 0 -772.805 0 16.0985 0 0 0 0 0 0 0 0 0 0 0 0 -934.095 0 0 0 0 0 0 
-1812.42 0 0 1468.02 0.02 0 0 242.393 0 -1594.67 0 0 0 0 0 0 0 0 0 2466.43 0 0 0 0 985.824 386.135 1362.88 0 0 0 0 0 1924.88 1805.25 0 0 0 0 0 0 0 0 0 -707.038 0 0 0 0 0 0 0 0 0 0 0 0 0 491.882 0 1618.78 0 -664.464 0 0 0 0 2034.9 
0 0 0 0 0 0.01 0 0 0 0 0 -1003.83 904.492 0 0 0 1565.22 0 0 0 2494.51 0 0 0 0 0 0 0 0 0 0 161.977 1901.99 -1938 0 0 0 0 0 0 0 0 0 0 0 0 0 0 0 0 0 0 0 0 0 0 0 0 0 0 0 0 0 0 0 0 0 
0 0 0 1872.08 0 0 0.02 0 0 0 905.56 0 0 1217 0 -1596.8 -990.402 0 0 0 2002.24 0 2314.45 2377.16 0 0 0 0 -2345.88 854.595 215.232 0 0 0 0 0 0 0 0 0 0 0 0 0 0 0 974.685 0 0 0 0 0 555.361 0 1056.17 0 0 0 0 0 0 -115.436 0 0 0 0 1100.27 
0 0 0 0 2256.61 0 0 0.01 -1306.88 -1721.47 0 0 0 0 0 0 1514.4 1849.19 -942.335 0 0 0 1631.14 -1068.99 0 0 0 0 0 0 171.285 -2074.11 -1670.05 1360.74 0 0 0 1280.63 0 0 0 0 0 0 0 0 243.767 0 0 0 0 0 0 0 0 0 0 0 -719.703 0 0 0 2321.62 2122.49 -581.607 0 0 
0 0 0 0 0 0 0 1620.61 0.05 0 1576.05 0 0 434.049 0 -448.851 0 0 0 0 0 352.87 -8.92666 0 0 0 0 0 0 -2396.85 344.63 0 0 606.021 0 0 0 0 0 2320.25 0 0 1935.87 0 910.901 0 0 -1580.17 0 0 0 0 -1141.16 0 0 0 0 0 0 0 0 0 343.41 0 -734.657 -2362.21 0 
0 0 -886.792 0 1981.95 0 0 -702.918 0 0.02 0 0 0 0 0 0 1294.37 0 0 1115.38 0 0 0 0 0 0 0 2086.93 0 0 0 1733.53 0 0 2411.8 0 0 0 0 149.312 0 0 0 0 0 0 0 0 0 0 -813.547 0 0 0 0 0 0 0 -378.201 0 0 0 0 0 0 0 0 
0 0 0 0 0 0 2459.56 0 -1304.9 0 0.04 0 0 0 0 0 1766.79 0 0 0 0 0 0 1710.49 0 0 0 0 0 2408.14 0 0 0 0 0 0 0 0 0 0 -852.458 0 0 0 0 0 0 0 0 0 0 0 0 -1097.22 0 0 0 0 0 0 0 0 0 0 0 0 0 
0 0 0 0 0 -2256 0 0 0 0 0 0.09 0 0 0 826.365 0 0 0 0 836.589 -606.479 1664.56 -868.023 0 0 0 0 0 0 0 147.633 0 0 0 0 0 1695.38 0 0 0 0 0 0 0 0 2109.67 -129.933 0 0 0 0 0 0 0 2486.42 0 0 0 0 0 0 0 0 0 0 0 
0 0 0 0 0 -347.835 0 0 0 0 0 0 0.08 0 0 0 1085.47 0 0 0 0 0 0 0 0 0 2035.36 0 0 0 0 -2449.19 0 0 0 0 0 768.685 0 0 1565.68 0 216.91 0 0 0 0 0 0 0 0 0 0 0 0 0 0 0 0 0 226.371 0 0 0 175.1 0 0 
0 0 0 48.9059 0 0 2079.15 0 -213.095 0 0 0 0 0.02 0 -1219.14 0 0 0 790.963 0 0 2257.84 424.284 0 -1318.48 0 0 0 1281.09 0 0 0 2399.14 0 0 0 0 0 0 0 0 0 333.796 0 0 0 0 0 0 387.204 0 0 0 0 0 0 0 2173.15 -1400.11 0 0 0 0 0 0 0 
0 0 0 0 0 0 0 0 0 0 0 0 0 0 0.08 2015.37 0 0 0 0 0 0 2068.62 2241.81 0 1288.72 0 0 0 0 0 0 0 0 0 0 0 0 0 1843.55 0 -944.472 0 0 0 0 0 0 0 905.255 1160.24 0 0 0 0 0 0 0 0 0 0 0 0 0 0 0 0 
0 0 0 0 0 0 2475.28 0 2454.99 0 0 -2389.68 0 1703.01 -1456.72 0 0 2196.49 0 0 0 0 0 0 0 -1253.47 0 -921.583 0 0 1130.33 2279.2 0 0 -1741.16 0 0 0 0 0 0 0 0 0 0 0 1324.88 -2304.83 0 0 0 0 0 0 0 0 2160.18 0 0 0 0 0 0 1612.52 0 0 0 
0 -2175.28 0 0 0 2386.17 1673.25 1106.22 0 1250.11 -2186.27 0 1116.14 0 0 0 0.03 -2211.6 0 0 0 -1531.19 0 0 0 0 2236.63 0 0 0 0 0 0 0 2040.54 0 0 0 0 0 0 0 0 0 0 0 0 0 0 754.341 0 0 0 0 0 0 0 0 0 -1134.6 0 0 0 0 0 0 0 
0 0 0 355.617 0 0 0 -1512.42 0 0 0 0 0 0 0 654.698 -2435.61 0.06 0 694.525 0 -2214.8 0 0 0 916.395 0 0 1175.34 -593.051 0 0 1718.12 519.196 1057.39 1344.72 0 0 0 0 0 0 0 0 0 0 -501.495 0 0 0 143.971 0 0 0 0 0 0 0 0 0 0 0 0 0 0 0 0 
-313.501 0 0 0 0 0 0 -2246.39 0 0 0 0 0 0 0 0 0 0 0.06 0 872.753 0 0 0 0 1441.77 0 2404.02 0 0 0 0 0 1685.92 0 0 0 0 1218.99 0 0 0 0 0 0 0 0 0 0 -1662.72 0 0 0 0 0 0 0 0 0 0 0 0 0 0 0 0 0 
0 0 0 0 2149.8 0 0 0 0 2462.31 0 0 0 -1495.94 0 0 0 691.168 0 0.09 0 0 -2396.69 0 0 0 1523.26 485.626 0 0 2118.37 1089.59 0 0 0 0 0 1696.75 0 0 0 0 0 0 0 2179.25 0 0 1005.66 0 0 0 0 0 0 0 -1415.83 0 0 0 2041.15 0 0 0 0 -294.427 0 
409.482 1146.05 0 0 0 648.9 1354.18 0 0 0 0 -1320.15 0 0 0 0 0 0 2477.57 0 0.09 0 0 -1939.22 -379.421 0 0 0 0 0 0 0 0 1622.44 0 1112.17 1364.41 0 0 0 0 0 0 0 0 0 0 0 0 0 0 0 0 -1750.92 0 0 0 0 0 0 0 0 -503.479 1258.05 0 2148.58 0 
1593.45 0 -492.035 250.481 0 0 0 0 -1670.2 0 0 1954.33 0 0 0 0 228.66 -328.913 0 0 0 0 0 1580.94 0 -2200.61 0 0 659.886 0 0 -136.952 0 0 0 0 2083.88 0 0 0 0 -602.664 0 0 0 0 0 0 0 0 0 0 0 2046.34 0 0 0 0 0 0 0 0 0 0 0 0 0 
261.162 0 0 0 0 0 1766.95 2424.16 -904.95 0 0 1963.94 0 -97.7355 1851.63 0 0 0 0 1199.45 0 0 0.05 0 0 0 0 0 0 0 0 0 0 0 0 0 0 0 0 0 0 2171.47 0 0 0 0 0 0 0 1828.14 -423.978 0 0 0 0 0 0 -2410.89 0 0 0 0 0 0 -2138.05 0 0 
0 0 0 0 0 0 2071.52 714.515 0 0 643.254 1554.84 0 -734.199 1153.52 0 0 0 0 0 2386.62 543.764 0 0.07 0 0 2254.63 -1254.54 0 0 0 -1908.55 0 0 0 0 0 0 0 495.544 0 0 0 0 0 0 0 0 0 0 0 0 1614.66 0 0 0 0 0 0 0 0 0 -159.841 0 0 0 0 
2144.76 0 0 0 -1173.36 0 0 0 0 0 0 0 0 0 0 0 0 0 0 0 -294.733 0 0 0 0.09 0 0 0 0 0 0 0 408.261 0 1624.58 0 0 0 0 1466.8 0 0 0 0 0 0 0 0 0 0 0 243.614 0 0 0 0 0 0 0 0 0 0 0 0 0 0 0 
0 981.704 0 0 981.399 0 0 0 0 0 0 0 0 1891.31 623.112 1283.23 0 -591.372 -897.778 0 0 1588.72 0 0 0 0.01 0 -1976.76 0 0 0 0 0 0 0 0 0 0 0 0 0 0 0 0 0 -81.1029 0 0 0 2074.27 0 0 0 0 0 0 0 0 0 0 0 0 0 0 -1171.68 1629.76 0 
0 0 1631.44 0 -648.442 0 0 0 0 0 0 0 257.195 0 0 0 1648.08 0 0 -568.484 0 0 0 -1337.86 0 0 0.03 0 0 0 0 0 -189.901 0 0 0 1047.32 0 0 1019.85 0 0 0 0 -978.195 0 0 1485.87 0 0 0 0 0 0 0 -1690.65 0 0 0 0 0 0 0 0 0 -435.575 0 
0 0 0 0 0 0 0 0 0 828.196 0 0 0 0 0 767.464 0 0 2173.91 2248.68 0 0 0 -162.587 0 185.476 0 0.09 0 0 0 0 1227.38 0 896.71 829.875 0 0 0 0 0 0 0 0 0 0 0 0 0 0 0 0 0 0 0 0 0 0 0 0 0 1795.02 -1692.79 0 1253.17 0 0 
2213.13 0 2050.16 1542.79 0 0 -1832.56 0 0 0 0 0 0 0 0 0 0 564.058 0 0 0 -2008.19 0 0 0 0 0 0 0.03 0 2224.72 1196.71 -473.571 -134.51 0 0 -139.698 0 0 622.501 0 0 0 0 0 0 -997.879 0 0 0 0 0 0 1079.52 0 0 0 0 0 -927.534 0 0 0 0 0 0 0 
0 -1475.95 0 0 0 0 539.644 0 2012.77 0 -1701.79 0 0 428.404 0 0 0 2001.17 0 0 0 0 0 0 0 0 0 0 0 0.09 0 1144.06 0 0 0 0 0 0 0 0 0 0 0 0 0 0 1819.9 0 0 0 1763.89 0 0 0 0 0 -1215.17 -1224.33 0 0 0 0 0 0 0 0 0 
0 1716.13 0 0 0 0 193.564 270.928 113.91 0 0 0 0 0 0 145.039 0 0 0 268.487 0 0 0 0 0 0 0 0 39.5978 0 0.03 0 0 0 0 1768.62 -1878.64 0 0 0 0 1945.48 0 0 0 0 0 0 0 0 0 0 0 0 0 1312.68 0 0 0 61.1133 0 0 0 0 0 0 2206.87 
-2353.36 860.088 0 0 0 1718.88 0 -2087.54 0 2306.97 0 1397.37 -1440.7 0 0 42.497 0 0 0 1141.47 0 1696.91 0 2396.85 0 0 0 0 1425.14 1992.32 0 0.07 0 0 -289.087 0 0 0 0 0 0 0 0 0 -2493.59 0 0 0 0 0 0 0 -2444.61 0 2438.35 0 0 0 -542.39 0 0 0 0 0 939.741 0 0 
0 0 0 540.864 -708.106 -1431.85 0 1391.87 0 0 0 0 0 0 0 0 0 1238.21 0 0 0 0 0 0 2107.23 0 20.3711 -1867.66 -901.898 0 0 0 0 1586.73 0 0 0 2241.51 0 0 0 0 0 0 0 0 0 0 0 0 0 0 0 -1672.64 786.386 0 0 0 0 0 0 0 0 0 0 0 0 
0 0 0 -1.60222 -2400.97 633.03 0 1522.95 1483.73 0 0 0 0 -1301.54 0 0 0 1542.94 -656.377 0 -1662.42 0 0 0 0 0 0 0 1445.74 0 0 0 -1224.78 0.01 0 0 0 0 0 0 0 0 0 0 0 0 0 1896.5 2216.03 0 0 0 0 0 0 0 0 0 0 0 0 0 0 0 0 0 0 
0 0 0 -1712.16 0 0 0 0 0 -1521.42 0 0 0 0 0 2294.61 -913.495 1935.56 0 0 0 0 0 0 -445.341 0 0 1963.94 0 0 0 283.898 0 0 0.01 0 0 -323.573 0 0 2036.12 0 0 2365.87 0 0 0 0 0 0 0 0 0 0 -2065.26 0 0 0 101.245 0 0 0 0 0 0 -225.608 0 
0 0 0 0 0 0 0 0 0 0 0 0 0 0 0 0 0 -32.4259 0 0 808.512 0 0 0 0 0 0 2275.08 0 0 2212.21 0 0 0 0 0.02 0 0 0 0 -1124.23 -2453.31 0 0 0 0 0 0 0 0 0 2335.51 0 0 -1707.13 1738.41 0 0 0 -1613.13 0 0 0 0 0 0 0 
0 0 1570.71 0 0 0 0 0 0 0 0 0 0 0 0 0 0 0 0 0 328.303 2400.51 0 0 0 0 -1598.18 0 1189.84 0 -908.917 0 0 0 0 0 0.06 0 0 0 0 934.706 0 0 0 0 0 0 163.503 0 0 0 0 0 0 0 0 0 0 0 0 0 0 0 0 0 0 
0 0 0 0 0 0 0 2164.45 0 0 0 2448.12 -603.275 0 0 0 0 0 0 -1721.63 0 0 0 0 0 0 0 0 0 0 0 0 1572.39 0 2152.39 0 0 0.05 0 0 0 0 0 -1322.29 0 0 0 0 0 0 0 0 0 0 0 0 0 0 0 0 0 -1343.2 0 0 0 0 0 
0 0 0 -132.679 0 0 0 0 0 0 0 0 0 0 0 0 0 0 318.69 0 0 0 0 0 0 0 0 0 0 0 0 0 0 0 0 0 0 0 0.08 0 0 0 0 0 2050.31 0 0 0 0 -179.983 0 580.844 0 0 0 0 0 0 0 0 0 0 0 0 0 0 0 
0 0 0 1151.69 0 0 0 0 2450.56 178.61 0 0 0 0 -110.706 0 0 0 0 0 0 0 0 431.15 1735.82 0 2374.26 0 441.221 0 0 0 0 0 0 0 0 0 0 0.04 0 0 1950.97 0 0 0 -768.99 0 1290.86 0 0 875.652 0 277.795 0 1481.9 0 0 0 0 2079 0 0 509.735 0 900.372 0 
0 0 -1835.15 -1815.93 0 0 0 0 0 0 473.571 0 1442.38 0 0 0 0 0 0 0 0 0 0 0 0 0 0 0 0 0 0 0 0 0 127.796 153.432 0 0 0 0 0.01 0 1435.06 0 0 0 0 0 0 0 1406.06 0 0 0 0 0 0 0 0 0 0 0 1947.77 0 0 0 0 
-1159.78 0 0 0 0 0 0 0 0 0 0 0 0 0 -562.075 0 0 0 0 0 0 1485.72 1847.21 0 0 0 0 0 0 0 -1496.86 0 0 0 0 -2113.18 2231.13 0 0 0 0 0.04 0 0 -367.824 0 0 0 313.654 606.632 0 0 0 0 0 0 0 0 0 0 0 0 0 0 0 0 0 
0 305.719 0 0 0 0 0 0 -969.192 0 0 0 1606.57 0 0 0 0 0 0 0 0 0 0 0 0 0 0 0 0 0 0 0 0 0 0 0 0 0 0 -551.851 619.144 0 0.09 0 0 0 0 0 0 0 0 0 0 0 0 0 2360.99 0 0 0 0 0 0 0 0 0 0 
0 0 0 0 -134.358 0 0 0 0 0 0 0 0 -337.458 0 0 0 0 0 0 0 0 0 0 0 0 0 0 0 0 0 0 0 0 2358.85 0 0 -1415.07 0 0 0 0 0 0.08 0 0 2498.63 0 0 0 0 0 0 0 0 1897.56 0 0 0 0 0 1857.89 -1869.33 0 0 0 0 
2233.73 0 0 0 0 0 0 0 102.924 0 0 0 0 0 0 0 0 0 0 0 0 0 0 0 0 0 2225.79 0 0 0 0 1079.52 0 0 0 0 0 0 458.77 0 0 2108.75 0 0 0.02 0 0 0 0 0 0 0 -2062.36 0 0 0 0 0 0 -194.632 298.7 0 0 0 0 7.40074 0 
471.282 0 0 1981.19 0 0 0 0 0 0 0 0 0 0 0 0 0 0 0 -594.577 0 0 0 0 0 2221.21 0 0 0 0 0 0 0 0 0 0 0 0 0 0 0 0 0 0 0 0.02 1883.07 0 0 333.186 0 0 0 0 0 -363.247 -781.655 0 0 0 1932.36 0 0 0 0 0 0 
0 0 0 0 0 0 40.2081 733.589 0 0 0 -335.78 0 0 0 -1822.64 0 -528.047 0 0 0 0 0 0 0 0 0 0 733.436 792.184 0 0 0 0 0 0 0 0 0 269.402 0 0 0 -1022.9 0 866.497 0.08 0 1198.39 0 0 1650.67 0 0 0 -200.125 0 0 0 0 0 0 0 0 0 0 -2398.37 
0 0 0 433.897 0 0 0 0 884.655 0 0 -2035.36 0 0 0 2267.91 0 0 0 0 0 0 0 0 0 0 2390.13 0 0 0 0 0 0 -557.344 0 0 0 0 0 0 0 0 0 0 0 0 0 0.07 0 0 0 0 0 0 0 0 0 0 0 0 0 0 532.929 0 0 0 -1023.21 
0 0 0 0 0 0 0 0 0 0 0 0 0 0 0 0 0 0 0 -80.4926 0 0 0 0 0 0 0 0 0 0 0 0 0 499.359 0 0 -285.424 0 0 1065.02 0 2231.44 0 0 0 0 1400.88 0 0 0 0 1302.45 0 0 0 0 0 1597.87 2373.35 0 2297.81 -797.22 2455.14 0 0 0 0 
0 0 2450.1 0 0 0 0 0 0 0 0 0 0 0 892.895 0 12.7415 0 -269.555 0 0 0 -697.424 0 0 -415.891 0 0 0 0 0 0 0 0 0 0 0 0 -110.553 0 0 -1963.94 0 0 0 1069.9 0 0 0 0.04 0 0 0 0 0 0 1520.81 0 0 0 0 0 0 0 -450.987 0 0 
0 614.566 0 0 0 0 0 0 0 2300.41 0 0 0 -1396.45 955.306 0 0 2184.9 0 0 0 0 696.051 0 0 0 0 0 0 1162.98 0 0 0 0 0 0 0 0 0 0 473.113 0 0 0 0 0 0 0 0 0 0.09 0 1811.35 0 176.321 0 0 0 880.535 0 0 0 0 0 0 0 1036.03 
2089.53 0 0 0 0 0 0 0 0 0 0 0 0 0 0 0 0 0 0 0 0 0 0 0 974.532 0 0 0 0 0 0 0 0 0 0 2498.63 0 0 124.134 -1548.89 0 0 0 0 0 0 1650.52 0 1601.54 0 0 0 0 0 0 0 0 0 0 0 0 -1692.63 0 0 0 0 0 
1933.58 0 0 0 0 0 2084.34 0 1330.68 0 0 0 0 0 0 0 0 0 0 0 0 0 0 -991.165 0 0 0 0 0 0 0 1984.08 0 0 0 0 0 0 0 0 0 0 0 0 -1622.9 0 0 0 0 0 250.938 0 0.01 0 0 0 1877.73 154.195 -454.65 0 0 0 0 1773.2 0 0 0 
79.1192 0 0 0 0 0 0 0 0 0 904.492 0 0 0 0 0 0 0 0 0 1608.71 -1013.14 0 0 0 0 0 0 2361.75 0 0 0 -1788.31 0 0 0 0 0 0 1276.51 0 0 0 0 0 0 0 0 0 0 0 0 0 0.08 0 0 0 0 0 0 0 0 0 0 0 0 0 
0 0 0 0 0 0 -1415.22 0 0 0 0 0 0 0 0 0 0 0 0 0 0 0 0 0 0 0 0 0 0 0 0 -497.681 1703.31 0 485.931 2267.75 0 0 0 0 0 0 0 0 0 0 0 0 0 0 1624.42 0 0 0 0.01 0 0 0 0 0 0 0 0 0 0 0 0 
0 0 0 0 0 0 0 0 0 0 0 2020.4 0 0 0 0 0 0 0 0 0 0 0 0 0 0 2177.88 0 0 0 844.523 0 0 0 0 1456.88 0 0 0 2121.72 0 0 0 1981.8 0 -795.083 446.715 0 0 0 0 0 0 0 0 0.08 979.11 0 0 1607.94 0 0 0 -10.4526 -1923.51 0 0 
0 1528.9 0 0 0 0 0 0 0 0 0 0 0 0 0 -731.147 0 0 0 788.98 0 0 0 0 0 0 0 0 0 -1971.42 0 0 0 0 0 0 0 0 0 0 0 0 2426.15 0 0 -2092.88 0 0 0 -1789.68 0 0 1326.26 0 0 2202.6 0 0 960.952 0 0 0 0 0 0 0 0 
0 0 0 0 261.925 0 0 0 0 0 0 0 0 0 0 0 0 0 0 0 0 0 1938.46 0 0 0 0 0 0 -1241.72 0 0 0 0 0 0 0 0 0 0 0 0 0 0 0 0 0 0 -856.731 0 0 0 2020.25 0 0 0 0 0.07 0 0 173.574 0 0 0 0 0 0 
0 0 0 0 0 0 0 2441.4 0 627.995 0 0 0 87.3592 0 0 0 0 0 0 0 0 0 0 0 0 0 0 0 0 0 980.941 0 0 1641.21 0 0 0 0 0 0 0 0 0 0 0 0 0 2324.98 0 -498.138 0 992.538 0 0 0 1789.38 0 0.06 972.701 0 0 0 0 490.661 0 0 
0 0 0 0 -990.555 0 0 0 0 0 0 0 0 1827.52 0 0 1827.22 0 0 0 0 0 0 0 0 0 0 0 1635.56 0 -974.227 0 0 0 0 2044.51 0 0 0 0 0 0 0 0 1070.21 0 0 0 0 0 0 0 0 0 0 -1729.56 0 0 158.162 0 2178.95 0 0 -2201.53 0 0 0 
1633.58 0 0 535.829 0 0 0 0 0 0 0 0 -603.427 0 0 0 0 0 0 436.644 0 0 0 0 0 0 0 0 0 0 0 0 0 0 0 0 0 0 0 -981.246 0 0 0 0 -1284.3 152.516 0 0 1402.4 0 0 0 0 0 0 0 0 -15.7933 0 1665.17 0.07 0 0 0 0 0 0 
0 0 0 0 724.433 0 628.605 0 0 0 0 0 0 0 0 0 0 0 0 0 0 0 0 0 0 0 0 2496.8 0 0 0 0 0 0 0 0 0 606.937 0 0 0 0 0 2001.17 0 0 0 0 2496.8 0 0 600.986 0 0 0 0 0 0 0 0 0 0.08 -1454.44 0 0 0 0 
0 0 0 0 0 0 0 2397.61 -1065.32 0 0 0 0 0 0 0 0 0 0 0 1209.37 0 0 1306.73 0 0 0 1159.17 0 0 0 0 0 0 0 0 0 0 0 0 -827.128 0 0 990.097 0 0 0 654.088 1882 0 0 0 0 0 0 0 0 0 0 0 0 2118.21 0.01 0 -1487.55 0 1278.19 
0 0 0 0 0 0 0 2044.21 0 0 0 0 0 0 0 -459.075 0 0 0 0 -612.43 0 0 0 0 0 0 0 0 0 0 0 0 0 0 0 0 0 0 -447.935 0 0 0 0 0 0 0 0 0 0 0 0 -958.815 0 0 1013.29 0 0 0 533.845 0 0 0 0.07 -409.024 0 0 
0 -1510.28 0 0 0 0 0 2291.71 1575.29 0 0 0 703.833 0 0 0 0 0 0 0 0 0 2427.06 0 0 -145.955 0 1618.32 0 0 0 1453.22 0 0 0 0 0 0 0 0 0 0 0 0 0 0 0 0 0 -2182.61 0 0 0 0 0 1037.4 0 0 -1208 0 0 0 1359.68 2293.39 0.09 0 -1570.25 
0 0 0 0 0 0 0 0 784.555 0 0 0 0 0 0 0 0 0 0 2307.12 -1956.31 0 0 0 0 681.555 -2346.34 0 0 0 0 0 0 0 1506.47 0 0 0 0 1671.73 0 0 0 0 1282.92 0 0 0 0 0 0 0 0 0 0 0 0 0 0 0 0 0 0 0 0 0.07 0 
-437.407 0 0 0 1218.99 0 -1514.4 0 0 0 0 0 0 0 0 0 0 0 0 0 0 0 0 0 0 0 0 0 0 0 2341 0 0 0 0 0 0 0 0 0 0 0 0 0 0 0 -1655.1 -2123.55 0 0 1439.18 0 0 0 0 0 0 0 0 0 0 0 1964.86 0 782.266 0 0.02 
