*Vertices 57
*Matrix 
0.06 0 0 984.603 0 0 0 0 0 0 0 0 0 0 0 0 0 0 0 0 0 0 0 0 0 -1353.27 2273.09 -853.526 0 0 0 0 0 0 0 821.635 0 -819.651 1452.6 0 0 1096.3 -949.049 0 0 -649.51 0 0 0 0 0 -1031.45 0 0 0 0 0 
0 0.01 0 0 0 0 0 0 0 0 0 0 0 0 0 0 0 0 0 0 0 0 0 1657.84 904.492 0 0 0 0 0 0 0 0 0 0 0 0 0 0 0 0 0 0 0 0 0 0 0 0 1129.11 0 0 0 0 0 0 0 
0 0 0.04 0 0 0 0 0 0 0 0 0 0 0 932.722 0 0 0 0 0 0 0 1444.21 0 0 0 939.283 0 0 0 0 0 0 -844.523 0 0 0 0 0 0 0 0 0 0 141.377 0 0 0 0 0 0 0 0 0 0 0 0 
1574.68 0 0 0.02 822.398 0 0 0 0 0 0 0 1063.19 0 0 0 0 0 0 0 0 0 0 0 0 1486.33 0 0 0 0 0 0 0 0 0 1224.94 0 0 0 0 0 0 0 0 0 0 0 0 0 -914.869 0 0 0 0 0 -1023.51 0 
0 0 0 -1570.56 0.04 0 -1510.13 0 0 0 0 0 0 0 0 0 0 0 0 2338.71 0 0 -356.99 2078.23 0 0 0 0 0 0 0 0 0 0 0 0 0 0 0 0 0 1339.53 0 0 0 0 0 0 0 0 0 0 0 0 0 0 0 
0 0 0 0 0 0.05 0 0 974.99 -884.96 0 1363.95 0 0 0 -780.435 0 0 0 0 0 0 0 0 0 0 0 0 0 2165.82 0 0 0 0 0 1259.73 0 -1009.17 0 0 0 0 0 0 0 2219.84 0 1720.56 0 0 0 0 0 0 0 0 0 
0 0 0 0 -1804.79 0 0.07 0 0 0 -283.593 0 0 0 0 0 0 0 2328.18 0 2466.89 -710.852 0 0 0 0 -491.119 0 0 0 751.595 0 0 0 0 2468.87 0 0 0 0 0 -1928.85 0 0 0 0 0 0 0 0 0 0 0 0 0 0 0 
0 0 0 0 0 0 0 0.08 0 0 0 0 0 0 0 0 0 0 0 0 0 197.531 0 0 0 0 0 0 0 0 2149.65 -1013.6 0 0 0 0 0 0 0 0 0 0 0 573.977 0 0 0 -2184.44 0 1323.66 0 0 0 0 0 0 0 
0 0 0 0 0 2193.75 0 0 0.06 0 1513.34 0 -143.056 1430.02 0 0 0 1692.33 0 -147.633 0 0 1882.61 0 0 0 0 -1441.92 0 0 0 0 0 -724.586 666.906 0 0 0 0 0 0 0 0 0 0 -1137.35 0 0 0 0 0 0 -1315.27 0 0 0 0 
0 0 0 0 0 -1744.97 0 0 0 0.06 0 -1831.49 0 0 0 0 0 1688.67 0 0 0 0 0 0 1487.85 0 0 0 0 0 0 0 0 0 0 0 0 0 0 0 -1646.4 0 0 0 0 0 0 0 0 0 0 2049.09 0 0 2469.02 0 0 
0 0 0 0 0 0 658.208 0 809.122 0 0.07 0 0 0 0 0 0 0 0 0 0 0 1938.76 0 -131.916 0 0 0 0 0 0 0 582.98 0 0 0 910.138 0 1217.61 520.722 0 0 0 0 0 0 0 0 0 0 0 0 0 0 0 0 0 
0 0 0 0 0 -1252.4 0 0 0 1223.72 0 0.07 0 0 0 0 0 0 0 0 0 0 0 0 0 0 0 0 0 0 1444.82 0 454.65 0 0 0 0 0 0 0 0 0 0 0 -79.1192 0 0 0 0 0 0 0 0 0 0 0 0 
0 0 0 1450.93 0 0 0 0 -1331.75 0 0 0 0.05 0 0 0 0 1894.36 0 0 0 1832.1 0 0 0 0 0 0 0 0 0 0 0 0 0 0 0 0 0 0 0 0 0 1672.34 0 0 0 0 0 0 1991.41 0 0 0 0 0 0 
0 0 0 0 0 0 0 0 2302.39 0 0 0 0 0.08 -2280.11 0 495.697 0 0 0 0 0 0 0 0 0 0 0 0 0 0 2468.72 1426.97 0 0 0 0 0 0 0 0 0 330.287 0 0 0 0 0 0 0 0 0 0 0 0 0 0 
0 0 1565.22 0 0 0 0 0 0 0 0 0 0 2324.06 0.05 0 0 0 0 0 0 0 0 0 0 0 0 -1279.87 17.6244 0 1881.54 1822.95 0 0 0 0 0 0 0 0 0 1652.35 0 0 0 2466.12 0 0 0 0 0 0 0 0 0 0 0 
0 0 0 0 0 1798.68 0 0 0 0 0 0 0 0 0 0.09 0 0 0 1229.67 0 0 -1385.01 0 0 -976.363 0 -1392.33 0 0 1529.66 0 0 0 0 0 0 0 0 0 0 0 0 0 0 0 0 -141.224 0 -748.543 0 0 0 2367.7 0 1210.9 0 
0 0 0 0 0 0 0 0 0 0 0 0 0 720.466 0 0 0.06 0 0 0 0 0 0 0 0 0 0 0 713.752 -630.589 0 0 0 0 0 0 0 0 0 0 0 -1620.46 1136.43 0 0 0 0 0 0 0 0 0 0 0 0 0 0 
0 0 0 0 0 0 0 0 -134.663 -890.301 0 0 1463.59 0 0 0 0 0.02 2496.8 0 0 0 0 0 0 2305.75 0 0 0 0 0 0 0 0 0 0 2480.93 0 0 0 0 0 0 0 0 0 0 0 0 0 0 0 0 0 1902.14 0 0 
0 0 0 0 0 0 254.601 0 0 0 0 0 0 0 0 0 0 1743.75 0 0 1662.27 0 0 0 0 0 0 0 0 0 0 -895.337 0 0 0 0 0 0 0 0 0 0 0 0 0 0 0 2361.9 0 0 0 2297.36 0 0 0 0 2427.98 
0 0 0 0 1825.24 0 0 0 97.5829 0 0 0 0 0 0 -1172.14 0 0 0 0.09 0 0 0 0 0 -2309.56 0 0 556.276 0 0 -37.0037 2449.64 0 0 0 0 0 0 1752.75 0 0 0 0 0 0 1424.68 0 0 0 0 2097.92 0 0 0 0 0 
0 0 0 0 0 0 -386.441 0 0 0 0 0 0 0 0 0 0 0 1391.11 0 0.02 0 0 0 0 0 0 0 0 0 0 0 1876.51 0 0 0 0 1889.63 0 0 0 0 0 0 0 0 -1416.14 0 0 0 0 0 0 0 0 0 0 
0 0 0 0 0 0 210.501 1932.05 0 0 0 0 -1285.97 0 0 0 0 0 0 0 0 0.02 0 0 0 0 0 0 0 -107.959 0 0 1678.14 0 0 1421.93 0 0 0 0 0 -362.178 0 0 0 0 0 0 0 0 0 0 0 0 0 0 0 
0 0 -1141.93 0 728.248 0 0 0 2185.51 0 2131.34 0 0 0 0 626.011 0 0 0 0 0 0 0 0 0 0 0 0 0 0 1998.73 0 0 0 0 0 0 -399.258 0 0 0 0 0 0 0 0 -2326.5 0 314.875 -1298.94 0 0 0 0 0 612.43 0 
0 618.992 0 0 594.882 0 0 0 0 0 0 0 0 0 0 0 0 0 0 0 0 0 0 0.05 0 -1730.48 0 0 0 0 0 0 0 0 -871.075 539.644 0 0 0 0 0 0 0 0 0 1211.66 0 0 2016.59 0 0 0 2435.61 0 0 0 0 
0 2.67037 0 0 0 0 0 0 0 -1878.8 2261.8 0 0 0 0 0 0 0 0 0 0 0 0 0 0.07 0 0 0 0 0 0 0 0 0 2045.27 0 0 0 0 0 0 0 0 0 0 0 0 0 0 0 0 0 0 0 0 0 0 
1852.4 0 0 42.0392 0 0 0 0 0 0 0 0 0 0 0 -532.624 0 1032.67 0 2087.24 0 0 0 1543.09 0 0.08 0 0 0 1620.15 0 0 0 0 0 0 0 -122.15 0 -1599.86 0 0 0 0 0 0 0 0 0 176.016 0 -1272.09 0 0 0 0 0 
1205.86 0 1176.11 0 0 0 1009.32 0 0 0 0 0 0 0 0 0 0 0 0 0 0 0 0 0 0 0 0.09 907.392 0 0 0 0 0 0 0 518.891 0 0 0 0 0 0 0 0 0 0 0 0 0 2273.55 0 0 0 0 1490.45 0 0 
33.9518 0 0 0 0 0 0 0 -354.244 0 0 0 0 0 -472.961 844.371 0 0 0 0 0 0 0 0 0 0 2251.73 0.02 0 0 1944.87 0 0 0 -658.666 0 0 0 0 0 2228.84 0 0 0 0 0 0 0 1762.37 0 0 0 0 0 0 0 0 
0 0 0 0 0 0 0 0 0 0 0 0 0 0 -1185.87 0 1439.63 0 0 2490.84 0 0 0 0 0 0 0 0 0.06 0 0 0 916.395 2323.91 0 0 0 0 0 0 0 0 0 0 0 0 0 126.881 1744.67 0 0 0 0 0 0 0 0 
0 0 0 0 0 734.046 0 0 0 0 0 0 0 0 0 0 -1362.42 0 0 0 0 2292.63 0 0 0 713.599 0 0 0 0.04 734.504 0 0 0 0 0 0 0 0 0 0 0 0 0 0 0 0 0 0 1576.05 0 0 0 0 0 -1645.18 0 
0 0 0 0 0 0 -1686.53 1928.54 0 0 0 -1675.54 0 0 1597.26 1093.4 0 0 0 0 0 0 1952.19 0 0 0 0 1107.59 0 1620.3 0.09 0 0 0 0 0 0 0 0 0 402.31 0 1767.1 0 0 0 0 0 -1259.58 1353.88 0 0 0 0 0 0 0 
0 0 0 0 0 0 0 -1166.65 0 0 0 0 0 -1378.6 1587.04 0 0 0 1780.83 -1221.58 0 0 0 0 0 0 0 0 0 0 0 0.01 0 0 2377.77 0 0 0 0 0 0 0 0 0 0 0 0 0 0 0 0 929.67 -755.867 0 0 0 0 
0 0 0 0 0 0 0 0 0 0 1424.99 2248.53 0 524.384 0 0 0 0 0 840.403 -681.707 -1436.12 0 0 0 0 0 0 -2294.46 0 0 0 0.02 0 0 969.497 327.387 1975.69 2449.19 0 0 -1128.5 0 1381.65 0 0 0 0 0 0 0 0 0 1608.25 0 0 0 
0 0 1108.36 0 0 0 0 0 1386.07 0 0 0 0 0 0 0 0 0 0 0 0 0 0 0 0 0 0 0 82.9341 0 0 0 0 0.03 -557.344 0 261.62 2202.14 0 0 0 0 0 0 0 0 0 0 0 0 -2097.61 0 0 0 0 0 0 
0 0 0 0 0 0 0 0 1047.01 0 0 0 0 0 0 0 0 0 0 0 0 0 0 -133.747 394.528 0 0 1214.56 0 0 0 2362.51 0 2038.56 0.01 0 0 0 0 0 0 0 0 2253.41 0 0 0 0 0 0 0 0 0 0 0 0 0 
777.841 0 0 515.076 0 1724.37 -347.682 0 0 0 0 0 0 0 0 0 0 0 0 0 0 536.286 0 -1339.23 0 0 2277.98 0 0 0 0 0 -2297.81 0 0 0.01 0 0 -384.915 0 0 0 -907.697 0 0 0 2492.22 0 0 671.178 0 0 0 0 0 0 0 
0 0 0 0 0 0 0 0 0 0 -339.137 0 0 0 0 0 0 828.501 0 0 0 0 0 0 0 0 0 0 0 0 0 0 2335.05 -2460.48 0 0 0.04 0 0 0 0 0 0 1678.44 0 0 0 0 0 0 0 0 0 0 0 1581.85 0 
2219.53 0 0 0 0 2139.12 0 0 0 0 0 0 0 0 0 0 0 0 0 0 1863.38 0 -493.103 0 0 1194.57 0 0 0 0 0 0 -154.347 1708.96 0 0 0 0.05 0 0 0 0 0 0 0 0 0 0 0 0 0 0 0 0 1110.34 0 0 
646.763 0 0 0 0 0 0 0 0 0 2166.13 0 0 0 0 0 0 0 0 0 0 0 0 0 0 0 0 0 0 0 0 0 -157.704 0 0 119.251 0 0 0.08 0 0 0 0 0 0 0 358.516 0 0 0 0 0 0 0 0 0 0 
0 0 0 0 0 0 0 0 0 0 2384.64 0 0 0 0 0 0 0 0 2452.39 0 0 0 0 0 -937.147 0 0 0 0 0 0 0 0 0 0 0 0 0 0.02 0 0 0 0 0 0 0 0 0 0 0 0 0 2089.22 0 0 0 
0 0 0 0 0 0 0 0 0 -214.011 0 0 0 0 0 0 0 0 0 0 0 0 0 0 0 0 0 521.18 0 0 241.325 0 0 0 0 0 0 0 0 0 0.06 0 0 0 0 0 1394.01 0 0 0 0 0 0 413.144 0 0 0 
-603.275 0 0 0 1869.03 0 -758.309 0 0 0 0 0 0 0 2284.08 0 154.195 0 0 0 0 714.209 0 0 0 0 0 0 0 0 0 0 -2049.85 0 0 0 0 0 0 0 0 0.02 0 0 0 0 0 0 0 0 1278.65 0 0 0 0 0 0 
-260.857 0 0 0 0 0 0 0 0 0 0 0 0 685.064 0 0 727.485 0 0 0 0 0 0 0 0 0 0 0 0 0 2031.24 0 0 0 0 2039.93 0 0 0 0 0 0 0.02 0 0 1350.37 0 -1447.87 0 0 0 0 0 0 0 0 0 
0 0 0 0 0 0 0 1222.19 0 0 0 0 1761.91 0 0 0 0 0 0 0 0 0 0 0 0 0 0 0 0 0 0 0 1939.38 0 -1608.25 0 1552.86 0 0 0 0 0 0 0.06 0 0 0 0 0 1859.11 0 0 0 0 0 0 0 
0 0 1092.33 0 0 0 0 0 0 0 0 170.37 0 0 0 0 0 0 0 0 0 0 0 0 0 0 0 0 0 0 0 0 0 0 0 0 0 0 0 0 0 0 0 0 0.07 -444.731 0 0 0 0 0 0 0 0 0 0 0 
-462.889 0 0 0 0 1006.88 0 0 1479.77 0 0 0 0 0 -1150.93 0 0 0 0 0 0 0 0 634.404 0 0 0 0 0 0 0 0 0 0 0 0 0 0 0 0 0 0 300.226 0 585.574 0.04 0 0 0 0 0 0 -1287.35 0 0 0 0 
0 0 0 0 0 0 0 0 0 0 0 0 0 0 0 0 0 0 0 78.814 1765.88 0 230.644 0 0 0 0 0 0 0 0 0 0 0 0 658.055 0 0 1822.49 0 748.238 0 0 0 0 0 0.06 0 869.396 0 0 0 0 0 0 32.2733 0 
0 0 0 0 0 2424.92 0 2147.66 0 0 0 0 0 0 0 -82.6289 0 0 2151.02 0 0 0 0 0 0 0 0 0 -115.131 0 0 0 0 0 0 0 0 0 0 0 0 0 -563.143 0 0 0 0 0.07 0 0 0 0 0 0 0 0 0 
0 0 0 0 0 0 0 0 0 0 0 0 0 0 0 0 0 0 0 0 0 0 1291.31 585.727 0 0 0 1338.62 -72.5578 0 1520.81 0 0 0 0 0 0 0 0 0 0 0 0 0 0 0 -681.555 0 0 -1373.26 0 0 -1265.53 0 0 0 0 
0 -142.75 0 1721.78 0 0 0 755.562 0 0 0 0 0 0 0 1112.78 0 0 0 0 0 0 801.798 0 0 -21.1341 2421.26 0 0 -1593.45 2246.24 0 0 0 0 -1330.07 0 0 0 0 0 0 0 -603.122 0 0 0 0 1581.7 0.06 0 0 0 0 0 0 0 
0 0 0 0 0 0 0 0 0 0 0 0 -516.602 0 0 0 0 0 0 0 0 0 0 0 0 0 0 0 0 0 0 0 0 1851.63 0 0 0 0 0 0 0 937.147 0 0 0 0 0 0 0 0 0.09 376.675 0 0 0 0 0 
1523.41 0 0 0 0 0 0 0 0 1336.02 0 0 0 0 0 0 0 0 429.014 -1528.14 0 0 0 0 0 444.273 0 0 0 0 0 2488.86 0 0 0 0 0 0 0 0 0 0 0 0 0 0 0 0 0 0 -2171.77 0.08 0 0 -45.2437 0 1847.51 
0 0 0 0 0 0 0 0 376.37 0 0 0 0 0 0 0 0 0 0 0 0 0 0 -181.814 0 0 0 0 0 0 0 94.5311 0 0 0 0 0 0 0 0 0 0 0 0 0 350.124 0 0 1255.3 0 0 0 0.03 983.535 0 0 0 
0 0 0 0 0 0 0 0 0 0 0 0 0 0 0 1968.83 0 0 0 0 0 0 0 0 0 0 0 0 0 0 0 0 1479.77 0 0 0 0 0 0 2088 -759.072 0 0 0 0 0 0 0 0 0 0 0 -1001.69 0.01 0 -2429.2 0 
0 0 0 0 0 0 0 0 0 -188.07 0 0 0 0 0 0 0 2316.74 0 0 0 0 0 0 0 0 -866.955 0 0 0 0 0 0 0 0 0 0 2011.86 0 0 0 0 0 0 0 0 0 0 0 0 0 822.55 0 0 0.01 0 0 
0 0 0 2281.33 0 0 0 0 0 0 0 0 0 0 0 -1677.22 0 0 0 0 0 0 -806.07 0 0 0 0 0 0 -360.195 0 0 0 0 0 0 2136.83 0 0 0 0 0 0 0 0 0 -130.543 0 0 0 0 0 0 -1574.68 0 0 0 
0 0 0 0 0 0 0 0 0 0 0 0 0 0 0 0 0 0 1659.83 0 0 0 0 0 0 0 0 0 0 0 0 0 0 0 0 0 0 0 0 0 0 0 0 0 0 0 0 0 0 0 0 1778.39 0 0 0 0 0.04 
