*Vertices 50
*Matrix 
0.08 0 0 0 2031.54 936.232 0 2190.39 0 0 0 0 787.606 1257.29 0 0 0 0 0 0 0 0 0 0 0 0 -1096.45 0 -452.055 -220.42 0 183.493 0 0 0 0 0 0 0 0 1650.67 -1569.8 0 0 0 0 -536.592 0 0 0 
0 0.07 0 1556.06 0 0 -2285.3 0 0 1557.28 0 1562.01 0 0 -1195.49 0 747.322 156.484 2131.34 0 0 0 -2108.75 0 0 0 0 0 133.29 1099.51 0 1861.86 0 0 0 0 0 547.884 0 0 1591.92 0 0 0 0 -2456.51 0 0 0 0 
0 0 0.02 0 0 0 348.445 0 2184.74 10.6052 0 0 0 1012.83 0 522.248 0 251.091 0 1296.35 0 1109.58 0 -2401.43 -1098.74 2315.21 0 -428.709 0 -1938.76 0 0 215.232 1.29704 0 0 0 0 0 0 0 0 0 2198.17 1880.17 -940.809 0 0 0 0 
0 2250.05 0 0 54.7044 0 0 -1251.34 0 726.264 1931.59 0 0 0 -1518.52 -1455.2 0 0 0 0 0 0 0 0 0 -1287.35 0 677.435 0 2127.52 0 0 0 2042.53 0 0 216.3 0 0 0 0 1377.83 2453.76 -1625.49 0 0 500.58 0 0 -512.177 
-195.7 0 0 1963.48 0.06 0 0 0 -1656.32 0 0 0 0 1565.52 0 0 0 0 0 0 0 0 0 0 0 0 0 -2195.12 0 538.423 0 0 0 0 0 0 895.032 0 0 195.242 0 0 0 -273.98 1836.99 0 0 0 0 0 
-1760.99 0 0 0 0 0.08 2340.85 0 -237.053 -165.792 -685.064 0 0 0 0 0 0 0 0 0 945.997 0 0 0 0 0 -1098.9 0 0 0 250.175 0 0 0 0 0 0 0 0 0 0 -1532.72 2429.81 0 0 2129.96 0 2095.63 0 -2283.62 
0 792.947 -1880.47 0 0 -1451.23 0.04 1358.76 0 0 0 0 393.002 0 1701.79 0 -885.266 0 0 0 1247.98 0 0 0 0 0 0 0 0 0 0 0 0 716.651 0 -1405.61 -450.377 1663.64 0 0 0 0 0 1325.8 746.864 0 -482.879 -29.5267 0 0 
-278.558 0 0 1680.12 0 0 -186.087 0 200.735 0 0 662.938 0 0 443.968 2022.08 0 0 0 882.366 0 0 0 1405.76 0 2045.12 -866.497 0 0 0 0 0 -762.276 -1176.41 2361.6 0 0 0 0 0 0 0 0 0 0 0 -2408.14 2402.19 0 0 
0 0 1532.56 0 704.138 2280.11 0 546.968 0.03 0 0 14.7252 0 0 0 0 2278.59 0 0 2326.04 0 1080.89 1709.72 0 -921.125 -1604.59 -1934.34 0 0 0 0 1605.2 0 0 0 -503.021 0 2285.45 -1617.71 0 0 0 0 0 -1596.19 0 0 -2329.25 0 2494.35 
0 -642.491 -1293.15 705.512 0 -565.584 0 0 0 0.07 -195.547 0 0 0 -2115.62 0 0 0 2023.15 0 0 0 0 0 0 1962.72 0 0 0 0 0 1457.49 0 0 0 1677.37 2093.95 0 0 0 0 0 0 0 2232.51 -2480.77 0 0 0 0 
0 0 0 2183.52 0 -1237.75 0 0 0 821.94 0.06 0 766.243 0 0 0 -2402.19 0 1465.73 0 0 0 0 0 0 0 -1409.42 0 0 0 0 0 0 0 0 1385.62 0 0 0 0 0 0 2319.48 0 0 0 0 0 0 -1629.92 
0 375.301 0 0 0 0 0 1824.17 1956.01 0 0 0.02 -224.082 0 0 0 -742.744 0 762.734 0 0 0 -388.424 0 2003.92 0 32.7311 0 0 -1043.66 0 0 0 0 0 -1416.59 -264.214 0 -162.13 0 0 0 0 0 0 0 0 0 860.088 0 
1713.39 0 0 0 0 0 -895.642 0 0 0 1205.71 1158.86 0.03 1894.36 2095.63 0 -332.728 0 0 2424.47 -1151.08 -2442.63 0 0 -1486.02 428.861 2254.78 0 0 0 -53.1785 0 -1961.5 0 0 0 0 0 -1584.75 0 139.546 -1851.79 -156.331 2263.48 0 2325.89 0 -1639.84 0 0 
-1016.5 0 -2289.42 0 -916.395 0 0 0 0 0 0 0 867.718 0.06 0 0 0 1777.17 743.202 1650.06 0 0 0 0 0 0 0 0 0 1365.47 284.356 275.811 496.918 1578.65 0 0 -265.282 0 0 0 1578.49 0 0 2404.32 0 1290.7 0 0 0 0 
0 -2098.38 0 2058.4 0 0 2413.02 -2246.39 0 1183.89 0 0 2457.12 0 0.07 0 0 0 0 1397.82 0 0 -74.3889 0 0 0 151.906 0 1633.43 0 0 0 -2362.06 0 -2356.87 0 -1671.42 -497.528 441.527 1628.09 0 0 0 0 0 0 0 -517.975 0 0 
0 0 1347.16 1487.24 0 0 0 2210.99 0 0 0 0 0 0 0 0.08 0 0 -2120.2 -383.847 1480.68 0 0 0 0 0 411.924 0 0 0 0 0 0 0 0 0 1052.35 0 0 0.534074 0 -756.325 0 0 0 0 0 0 0 0 
0 931.196 0 0 0 0 -1885.51 0 -1432.77 0 1663.34 1339.69 -191.58 0 0 0 0 0 0 0 0 0 1084.4 0 0 2017.35 -2211.91 0 -1413.24 1069.44 0 0 0 260.552 0 -297.021 -1278.95 0 1645.63 0 1838.05 0 0 0 0 0 1157.19 0 0 0 
0 2129.2 112.232 0 0 0 0 0 0 0 0 0 0 -1599.55 0 0 0 0.08 0 -1539.12 0 936.842 0 982.009 0 2020.4 0 0 0 0 0 2361.45 0 0 -1524.78 0 609.531 0 0 -846.355 0 0 -2266.38 0 2432.86 0 0 0 0 0 
0 235.069 0 0 0 0 0 0 0 -315.485 -364.467 1311.76 0 1674.17 0 -945.845 0 0 0.07 0 0 0 2028.79 0 0 0 0 -1406.22 0 0 -844.981 -1838.05 0 0 0 0 2474.52 0 0 0 0 0 1148.95 0 0 0 0 0 0 0 
0 0 985.214 0 0 0 0 2374.87 1797.01 0 0 0 -716.346 -166.555 -159.23 980.178 0 1837.14 0 0.06 0 2077.78 0 0 722.297 -907.849 0 0 0 2270.2 -187.002 0 0 0 0 0 0 0 0 0 0 -1585.36 -936.995 0 0 0 0 0 0 0 
0 0 0 0 0 2434.84 -1636.02 0 0 0 0 0 1916.18 0 0 1551.33 0 0 0 0 0.05 0 -1778.08 0 0 1061.82 1111.26 0 0 0 994.217 0 0 2445.68 0 0 0 0 0 0 0 0 0 0 0 2077.17 0 0 0 0 
0 0 -1275.75 0 0 0 0 0 592.441 0 0 0 2360.23 0 0 0 0 -1092.64 0 2334.44 0 0.07 0 -190.817 0 0 0 0 0 0 0 -244.377 0 1123.92 0 1192.13 0 0 0 0 0 0 0 1122.24 -1600.62 0 0 1197.01 0 0 
0 302.973 0 0 0 0 0 0 -2296.29 0 0 -1844.77 0 0 -1359.22 0 1364.1 0 681.249 0 1298.64 0 0.07 -2386.32 0 2160.02 0 0 0 0 0 -466.552 -444.731 0 0 0 0 2243.49 0 0 0 0 0 2199.55 0 0 0 0 0 0 
0 0 2199.7 0 0 0 0 681.097 0 0 0 0 0 0 0 0 0 124.134 0 0 0 587.71 150.075 0.01 1948.38 0 781.045 0 0 1188.62 0 0 0 0 0 0 -593.661 0 0 0 0 0 0 0 0 0 0 1025.65 0 0 
0 0 1487.55 0 0 0 0 0 1000.63 0 0 654.698 -677.282 0 0 0 0 0 0 2221.82 0 0 0 1116.6 0.08 0 0 440.306 1873.76 0 0 0 0 0 961.715 -753.731 0 -1922.13 0 0 -599.002 -1839.12 0 0 -565.432 2446.9 0 0 0 0 
0 0 2304.68 -2327.27 0 0 0 -2261.35 602.817 1043.66 0 0 -379.116 0 0 0 1599.4 1144.37 0 2464.45 177.236 0 -861.766 0 0 0.09 2152.24 0 1801.28 2432.4 0 0 0 -973.922 0 0 0 0 0 0 0 -450.682 0 -355.617 878.552 0 0 -1088.21 0 0 
-1996.9 0 0 0 0 2232.2 0 -968.276 591.678 0 261.01 2490.08 -2238.76 0 -291.223 -348.75 1841.56 0 0 0 1916.79 0 0 -513.092 0 931.501 0.06 879.315 0 0 644.169 0 0 -1834.54 0 0 0 0 1413.54 0 0 0 0 0 0 0 -284.967 0 0 0 
0 0 -2188.56 -1807.23 2424.01 0 0 0 0 0 0 0 0 0 0 0 0 0 2446.9 0 0 0 0 0 -1636.48 0 -748.238 0.02 0 0 0 0 0 2452.7 0 0 846.049 0 0 0 1225.39 0 0 0 0 0 2304.53 0 0 -235.374 
1188.47 1107.59 0 0 0 0 0 0 0 0 0 0 0 0 -383.694 0 1584.6 0 0 0 0 0 0 0 -1725.14 1289.79 0 0 0.01 295.19 -325.251 0 0 1057.54 0 0 0 0 0 0 0 0 0 0 2302.55 0 -621.738 0 0 0 
2351.53 802.713 2467.04 1520.81 1306.57 0 0 0 0 0 0 -2363.73 0 -1038.47 0 0 1688.36 0 0 -525.605 0 0 0 -120.167 0 2408.75 0 0 -1656.77 0.01 0 0 0 0 0 0 0 0 0 0 0 -630.894 843.303 0 0 0 0 0 0 0 
0 0 0 0 0 -1432.46 0 0 0 0 0 0 -523.621 -1613.44 0 0 0 0 813.395 1513.18 297.632 0 0 0 0 0 -2126.45 0 2452.09 0 0.04 0 0 0 0 1477.32 1468.47 0 0 0 642.338 0 0 2028.79 0 0 0 0 0 0 
319.3 -2.97555 0 0 0 0 0 0 -1113.09 1783.73 0 0 0 976.821 0 0 0 1315.88 -795.389 0 0 2199.24 485.778 0 0 0 0 0 0 0 0 0.01 0 0 0 0 -2183.83 -483.184 1000.78 0 0 0 1200.52 0 1531.8 0 0 357.295 0 0 
0 0 1616.95 0 0 0 0 -779.061 0 0 0 0 -2028.18 2427.67 -1027.94 0 0 0 0 0 0 0 -322.962 0 0 0 0 0 0 0 0 0 0.08 0 0 0 0 0 0 0 482.727 0 0 0 0 0 0 -1004.14 0 0 
0 0 1078.45 -589.389 0 0 -1732 2217.86 0 0 0 0 0 -2108.14 0 0 2408.9 0 0 0 -175.863 1186.64 0 0 0 200.735 956.526 1929.91 2120.81 0 0 0 0 0.05 0 -974.075 0 1441.47 0 0 0 1941.97 1286.43 0 -1282.92 0 -2026.51 0 0 0 
0 0 0 0 0 0 0 750.526 0 0 0 0 0 0 -1667 0 0 905.255 0 0 0 0 0 0 1971.72 0 0 0 0 0 0 0 0 0 0.07 0 0 0 0 0 0 99.414 0 0 2470.09 0 0 0 0 0 
0 0 0 0 0 0 -249.26 0 705.054 795.541 222.404 -35.3252 0 0 0 0 1037.1 0 0 0 0 180.441 0 0 -1566.29 0 0 0 0 0 2466.43 0 0 2145.83 0 0.08 0 1426.21 0 378.353 0 0 0 0 0 0 0 0 0 530.335 
0 0 0 -52.7207 1455.2 0 1719.18 0 0 1290.86 0 2065.42 0 -367.977 756.783 2268.36 563.448 1705.3 917.31 0 0 0 0 -1783.58 0 0 0 1586.73 0 0 458.007 773.415 0 0 0 0 0.07 1580.94 0 0 0 0 0 0 0 0 0 0 1714.61 0 
0 2274.47 0 0 0 0 1629 0 -126.728 0 0 0 0 0 1980.42 0 0 0 0 0 0 0 386.746 0 -432.524 0 0 0 0 0 0 1979.96 0 545.747 0 -1489.68 -1717.51 0.08 0 709.937 0 0 -2478.03 0 298.395 313.654 -471.282 2122.18 0 0 
0 0 0 0 0 0 0 0 555.208 0 0 214.164 -870.922 0 -343.867 0 -1209.83 0 0 0 0 0 0 0 0 0 -2325.89 0 0 0 0 -728.248 0 0 0 0 0 0 0.03 0 576.418 652.562 0 2154.53 2364.96 0 1068.22 0 0 0 
0 0 0 0 1461 0 0 0 0 0 0 0 0 0 -977.737 1095.69 0 2289.42 0 0 0 0 0 0 0 0 0 0 0 0 0 0 0 0 0 -1225.55 0 -806.07 0 0.03 0 0 2148.43 0 0 786.386 -738.624 -594.424 0 0 
801.492 2016.74 0 0 0 0 0 0 0 0 0 0 1722.85 82.3237 0 0 -1914.35 0 0 0 0 0 0 0 -2462.31 0 0 1264 0 0 2124.47 0 -1024.12 0 0 0 0 0 -1058 0 0.06 0 0 0 0 371.487 0 0 0 1072.34 
755.715 0 0 -1475.8 0 -1769.54 0 0 0 0 0 0 2058.7 0 0 -2256.46 0 0 0 -1238.06 0 0 0 0 1449.25 529.572 0 0 0 2476.2 0 0 0 1431.24 -2115.77 0 0 0 1999.19 0 0 0.03 0 0 -334.407 0 0 0 0 0 
0 0 0 -2170.25 0 -961.257 0 0 0 0 -2253.87 0 -1394.31 0 0 0 0 1822.34 495.392 879.772 0 0 0 0 0 0 0 0 0 -434.202 0 2343.13 0 1291.62 0 0 0 -1995.83 0 1740.39 0 0 0.03 0 2002.55 0 0 0 0 0 
0 0 -348.903 709.632 2118.21 0 1460.69 0 0 0 0 0 1502.2 1983.02 0 0 0 0 0 0 0 802.408 1741.31 0 0 -1413.54 0 0 0 0 1697.21 0 0 0 0 0 0 0 2429.81 0 0 0 0 0 0 0 0 0 0 0 
0 0 -105.518 0 884.045 0 -1043.66 0 1186.79 2444.61 0 0 0 0 0 0 0 641.575 0 0 0 421.384 0 0 -2239.98 -1192.43 0 0 1026.11 0 0 1467.25 0 1882.31 2224.72 0 0 481.201 -1692.94 0 0 1165.12 -863.903 0 0.09 -1814.55 0 0 0 0 
0 1528.14 1907.79 0 0 2297.2 0 0 0 2066.64 0 0 1860.33 -1713.08 0 0 0 0 0 0 -1362.73 0 0 0 -2401.12 0 0 0 0 0 0 0 0 0 0 0 0 -707.038 0 1231.19 1129.26 0 0 0 -1429.41 0 -2351.37 0 1553.32 0 
1860.94 0 0 1247.06 0 0 1254.39 -1793.65 0 0 0 0 0 0 0 0 959.273 0 0 0 0 0 0 0 0 0 743.812 375.607 346.767 0 0 0 0 -2264.09 0 0 0 1757.64 -483.947 1242.33 0 0 0 0 0 1836.99 0.02 0 2075.79 0 
0 0 0 0 0 -1509.37 2137.75 761.055 -1755.96 0 0 0 -572.756 0 2371.06 0 0 0 0 0 0 2151.63 0 2209.31 0 -1822.03 0 0 0 0 0 -2453.15 343.41 0 0 0 0 -123.371 0 768.685 0 0 0 0 0 0 0 0.08 0 0 
0 0 0 0 0 0 0 0 0 0 0 1528.75 0 0 0 0 0 0 0 0 0 0 0 0 0 0 0 0 0 0 0 0 0 0 0 0 -325.098 0 0 0 0 0 0 0 0 1137.04 1400.57 0 0.06 -2311.55 
0 0 0 1815.16 0 -1756.42 0 0 228.507 0 1554.99 0 0 0 0 0 0 0 0 0 0 0 0 0 0 0 0 1063.19 0 0 0 0 0 0 0 1984.85 0 0 0 0 -1360.74 0 0 0 0 0 0 0 1870.1 0.01 
