*Vertices 65
*Matrix 
0.03 0 1949.29 0 0 0 0 0 0 -1395.99 0 0 0 0 0 0 1250.88 0 0 0 0 2375.79 -1102.56 0 0 0 0 0 -1950.36 0 0 0 0 -1446.5 0 0 0 0 0 -684.606 0 0 0 0 1130.48 1821.12 0 627.842 0 0 0 0 0 0 0 0 0 0 0 0 0 0 0 0 0 
0 0.01 0 0 0 0 0 0 0 0 0 0 0 766.701 0 1703.92 -1701.03 0 -170.064 0 0 691.321 0 0 0 0 220.42 0 0 931.043 0 0 2016.59 0 0 0 0 0 0 0 0 0 0 0 0 0 0 0 0 0 0 0 0 0 0 0 0 1021.38 0 0 0 0 -17.6244 0 0 
1181.3 0 0.03 0 0 0 1534.85 0 0 0 2259.51 0 0 0 -2133.93 1601.38 0 0 0 0 0 -1994.16 0 0 0 0 0 0 0 0 0 0 0 0 0 0 0 0 0 1732.76 0 0 0 0 0 0 0 0 685.827 0 0 637.15 0 0 0 0 0 0 0 0 0 0 0 0 0 
0 0 0 0.05 0 0 0 0 0 0 0 0 -103.381 0 0 0 0 0 0 0 0 1450.01 0 0 839.488 0 0 0 0 0 0 0 0 0 0 0 450.377 0 0 0 0 0 -982.62 0 0 0 0 2272.03 0 0 0 0 0 0 0 0 0 0 0 0 0 0 0 0 0 
0 0 0 0 0.09 0 0 636.692 0 0 0 0 0 0 0 0 0 0 0 0 0 0 0 -1434.6 0 0 0 0 0 0 0 0 2482.76 0 0 0 0 0 0 0 0 0 1357.08 0 0 0 0 0 0 0 0 0 0 0 0 0 0 0 0 0 0 0 0 0 0 
0 0 0 0 0 0.04 0 0 1316.64 0 0 0 835.215 0 0 0 0 0 2066.03 0 0 1877.57 0 0 0 0 -2151.02 0 0 0 0 -1754.13 0 0 0 2457.27 0 0 0 -867.107 987.045 0 0 0 0 0 0 0 0 0 0 0 1212.27 0 0 0 0 0 0 0 0 0 0 0 0 
0 0 -2429.81 0 0 0 0.06 0 0 0 0 0 0 0 0 -1513.49 0 0 2268.36 0 0 0 1387.75 0 0 0 0 0 0 2357.02 0 0 0 0 0 0 0 0 922.346 0 0 0 0 0 0 0 0 0 0 -1775.03 0 0 1980.88 0 0 0 0 0 0 0 0 0 0 0 0 
0 0 0 0 -813.395 0 0 0.05 0 0 0 1494.11 -132.374 0 0 0 0 0 0 0 0 0 0 0 0 0 0 0 0 0 2247.31 0 0 443.968 0 0 0 0 0 0 0 0 0 0 0 536.592 0 0 0 0 0 0 0 0 0 0 -294.58 0 0 0 0 0 0 0 0 
0 0 0 0 0 1718.42 0 0 0.01 0 0 0 0 0 0 0 0 0 0 2468.11 0 0 0 0 0 0 0 -2325.89 0 1004.59 0 0 0 0 -1359.83 0 1398.28 0 0 0 0 0 0 0 0 0 0 0 0 0 0 0 0 0 0 -1624.88 0 0 0 0 0 0 0 0 0 
1789.99 0 0 0 0 0 0 0 0 0.04 0 0 0 0 0 0 -1052.66 0 0 -1224.48 0 0 0 0 0 0 -1668.07 0 0 0 0 0 1649.14 0 0 2433.16 -527.741 0 0 767.922 0 -2111.65 1863.69 1299.25 0 -619.755 0 0 0 0 0 0 0 0 0 0 0 0 0 0 0 0 0 0 2187.03 
0 0 2217.25 0 0 0 0 0 0 0 0 836.283 1640.75 0 0 -1029.77 0 0 0 0 0 0 0 0 -2192.68 1166.65 0 -333.186 31.663 0 1481.14 0 0 0 0 0 0 748.238 0 0 0 0 0 1350.98 0 0 0 0 0 12.1311 0 0 0 0 0 0 0 0 0 0 0 0 0 0 0 
0 0 0 0 0 0 0 -1961.04 0 0 904.645 0.03 0 2216.18 -518.891 -1248.28 986.282 0 0 1736.43 0 0 0 0 0 56.8407 0 -1796.24 0 0 0 0 0 0 0 0 0 0 0 0 0 0 437.559 0 0 0 0 0 876.568 0 0 0 0 1909.31 0 0 0 0 0 0 0 0 0 0 0 
0 0 0 2084.03 0 2282.71 0 1252.86 0 0 2093.34 0 0.07 0 0 0 0 0 0 0 0 0 0 0 0 0 2344.05 0 0 0 0 0 0 0 2346.8 0 0 0 -1639.68 -1787.24 0 0 0 0 0 2482.91 0 0 0 -1938.31 0 0 0 0 0 0 0 0 0 0 0 0 0 0 0 
0 -998.489 0 0 0 0 0 0 0 0 0 403.073 0 0.04 1132.77 0 0 0 0 -740.76 -232.627 0 0 0 0 0 0 0 0 -1700.26 0 0 0 1339.69 0 -6.79037 0 0 1291.01 0 0 0 0 0 1837.44 0 0 0 1704.08 0 0 716.346 0 0 0 0 0 0 0 0 0 0 0 1409.88 0 
0 0 -11.6733 0 0 0 0 0 0 0 0 898.694 0 2095.78 0.07 0 0 0 0 0 0 0 0 0 0 0 0 0 0 0 0 0 0 0 249.107 2401.58 0 0 0 0 0 0 0 0 0 0 0 0 0 0 0 0 1546.14 0 0 0 0 0 0 0 0 0 0 0 0 
0 898.541 1678.59 0 0 0 -201.346 0 0 0 -2145.99 1053.88 0 0 0 0.01 0 975.295 0 2252.49 0 0 0 0 0 0 0 0 0 1328.7 0 0 0 0 2499.39 0 0 0 0 0 0 0 0 0 0 0 0 2239.22 0 0 0 0 0 0 0 0 0 0 0 0 0 0 0 0 0 
120.319 1791.97 0 0 0 0 0 0 0 -846.965 0 1277.73 0 0 0 0 0.02 0 0 0 0 0 0 2411.65 -297.174 -2256.77 0 0 0 0 0 0 -2239.07 0 0 0 0 0 0 0 0 0 0 0 0 0 0 0 0 0 0 0 0 0 0 0 0 0 0 0 0 0 0 0 0 
0 0 0 0 0 0 0 0 0 0 0 0 0 0 0 1616.34 0 0.03 0 1595.28 0 0 0 -1163.44 0 0 0 1906.42 0 0 1299.86 -2472.53 1146.2 0 0 0 0 0 0 0 0 0 0 0 0 0 0 0 0 685.064 0 0 0 1804.33 0 0 0 0 0 0 0 0 0 0 0 
0 -112.69 0 0 0 2180.32 2419.89 0 0 0 0 0 0 0 0 0 0 0 0.06 1370.36 0 0 -2319.48 0 0 0 0 0 0 0 0 0 0 0 2233.88 0 0 423.368 0 0 0 0 0 0 0 0 0 0 0 0 0 0 0 0 0 0 0 0 0 0 0 0 0 0 0 
0 0 0 0 0 0 0 0 1703.31 1943.8 0 707.495 0 672.094 0 278.71 0 -2080.83 1658.6 0.08 0 0 0 2206.26 0 875.805 27.543 0 0 0 0 0 685.98 0 0 0 0 0 0 0 0 0 0 0 0 0 0 0 0 0 0 814.768 0 0 0 0 0 0 0 0 0 0 0 0 0 
0 0 0 0 0 0 0 0 0 0 0 0 0 -1474.27 0 0 0 0 0 0 0.02 0 0 0 0 0 0 0 0 0 0 0 0 0 0 0 0 0 0 0 0 827.891 0 0 0 0 0 0 1103.93 0 0 0 0 0 0 0 0 0 0 0 0 0 0 0 0 
2050.46 -52.8733 2422.79 -1041.67 0 -2097.16 0 0 0 0 0 0 0 0 0 0 0 0 0 0 0 0.01 0 0 1386.53 0 0 0 0 0 518.891 0 0 0 0 0 0 0 0 0 862.529 0 0 2268.82 0 0 0 0 0 0 0 0 293.054 1855.14 0 0 0 0 0 0 0 0 0 0 0 
2388.15 0 0 0 0 0 1409.27 0 0 0 0 0 0 0 0 0 0 0 -509.43 0 0 0 0.07 0 0 0 0 -325.251 1959.52 0 0 0 1491.82 0 0 724.738 0 0 0 0 0 0 0 0 1393.7 0 2427.21 0 0 879.467 0 0 0 0 0 0 0 0 0 0 0 0 0 0 0 
0 0 0 0 1078.45 0 0 0 0 0 0 0 0 0 0 0 -1318.32 459.685 0 2063.28 0 0 0 0.05 0 0 0 0 -2485.5 0 -2230.06 1970.35 0 0 0 -517.212 1521.42 -1003.52 868.938 0 0 38.2244 0 0 0 0 0 0 0 0 0 0 -449.461 0 0 0 0 0 0 0 0 0 0 0 0 
0 0 0 -567.263 0 0 0 0 0 0 2342.37 0 0 0 0 0 2286.07 0 0 0 0 -1821.12 0 0 0.01 0 0 0 0 -65.5385 0 0 0 0 0 0 0 0 0 0 0 0 0 0 0 0 0 0 0 0 0 0 0 0 0 0 0 0 -1188.47 0 0 0 0 0 0 
0 0 0 0 0 0 0 0 0 0 235.069 2117.45 0 0 0 0 -18.0822 0 0 1956.31 0 0 0 0 0 0.02 2139.12 0 0 0 0 0 0 0 0 0 0 0 0 -689.032 -1225.85 0 -1051.9 0 0 0 0 0 -316.706 0 0 0 0 0 0 0 0 0 0 0 0 0 0 0 0 
0 -2004.68 0 0 0 1730.32 0 0 0 -585.269 0 0 224.235 0 0 0 0 0 0 1817.61 0 0 0 0 0 -1352.5 0.06 0 0 0 -599.46 1885.05 0 0 0 0 0 0 0 -747.017 0 0 0 0 0 0 0 0 0 410.55 0 0 0 0 0 0 0 0 0 0 0 0 0 0 0 
0 0 0 0 0 0 0 0 1060.44 0 936.232 315.18 0 0 0 0 0 773.415 0 0 0 0 1277.58 0 0 0 0 0 0 0 0 0 0 1065.32 0 0 2003.77 0 0 0 1729.41 0 0 0 0 0 0 0 0 0 0 0 0 0 0 0 0 0 0 0 0 0 0 0 0 
-2122.94 0 0 0 0 0 0 0 0 0 2019.94 0 0 0 0 0 0 0 0 0 0 0 74.2363 2236.01 0 0 0 0 0.03 0 0 2491.91 0 2037.19 0 0 0 0 0 0 0 2317.5 0 0 0 0 -977.584 0 0 0 0 1488.31 0 0 0 0 0 0 0 0 0 0 0 0 0 
0 -1910.99 0 0 0 0 -1631.75 0 -83.8496 0 0 0 0 -397.885 0 536.897 0 0 0 0 0 0 0 0 2278.28 0 0 0 0 0.03 0 0 0 0 0 0 0 0 477.996 0 0 0 0 0 0 0 0 0 0 2013.69 0 0 0 0 0 0 0 0 0 0 0 0 0 0 0 
0 0 0 0 0 0 0 1429.11 0 0 -2190.85 0 0 0 0 0 0 2110.28 0 0 0 752.358 0 371.334 0 0 2420.04 0 0 0 0.06 0 0 0 0 0 0 0 0 0 0 0 0 0 -1893.9 0 0 0 0 0 -1576.36 0 0 0 0 0 0 0 0 0 0 0 0 0 0 
0 0 0 0 0 2325.43 0 0 0 0 0 0 0 0 0 0 0 510.346 0 0 0 0 0 -2355.65 0 0 -640.202 0 2147.97 0 0 0.03 0 0 0 0 0 569.094 0 0 0 1619.39 0 0 0 0 0 0 0 0 0 0 0 0 0 0 0 0 0 0 0 0 0 0 0 
0 -790.353 0 0 2068.93 0 0 0 0 -2425.53 0 0 0 0 0 0 -1168.78 1372.34 0 987.045 0 0 -1957.38 0 0 0 0 0 0 0 0 0 0.01 0 -1383.79 0 1687.6 0 0 0 0 0 0 0 0 0 365.688 838.267 0 0 0 0 0 1455.35 0 0 0 0 0 0 0 0 0 0 0 
-1076.46 0 0 0 0 0 0 2225.49 0 0 0 0 0 1375.85 0 0 0 0 0 0 0 0 0 0 0 0 0 2110.58 1101.49 0 0 0 0 0.03 0 0 0 0 0 0 0 0 0 0 0 0 558.718 0 -443.358 0 0 0 0 0 0 0 0 0 0 0 0 0 0 0 0 
0 0 0 0 0 0 0 0 -536.439 0 0 0 -1035.57 0 1578.34 862.224 0 0 241.935 0 0 0 0 0 0 0 0 0 0 0 0 0 329.066 0 0.02 0 0 0 0 999.405 2415.62 0 0 0 0 0 0 150.38 0 0 0 0 0 0 0 0 0 0 0 -1929.46 0 0 0 0 0 
0 0 0 0 0 2309.11 0 0 0 1098.74 0 0 0 1476.26 783.486 0 0 0 0 0 0 0 1389.43 1172.14 0 0 0 0 0 0 0 0 0 0 0 0.08 293.207 0 0 0 0 742.439 0 942.183 0 0 0 0 0 0 -996.048 0 0 833.842 0 0 0 0 0 0 0 0 0 0 0 
0 0 0 245.598 0 0 0 0 -1348.08 -499.664 0 0 0 0 0 0 0 0 0 0 0 0 0 260.094 0 0 0 1922.13 0 0 0 0 388.73 0 0 530.488 0 0 0 0 0 0 0 171.59 0 820.109 2446.9 0 0 0 0 0 0 0 0 0 0 0 0 0 0 0 0 0 0 
0 0 0 0 0 0 0 0 0 0 261.62 0 0 0 0 0 0 0 1388.82 0 0 0 0 55.62 0 0 0 0 0 0 0 -276.879 0 0 0 0 0 0.08 0 2370.75 0 0 1134.6 -1984.54 0 -55.1622 0 0 0 0 0 0 0 0 0 0 0 0 0 0 0 0 0 0 0 
0 0 0 0 0 0 1769.54 0 0 0 0 0 -2487.03 418.943 0 0 0 0 0 0 0 0 0 754.952 0 0 0 0 0 2387.69 0 0 0 0 0 0 0 0 0.04 0 0 0 0 0 0 0 0 0 0 0 1252.4 0 0 0 0 0 0 0 0 0 0 0 0 0 0 
-1410.49 0 1993.09 0 0 -2438.35 0 0 0 -149.77 0 0 1417.51 0 0 0 0 0 0 0 0 0 0 0 0 711.921 -314.417 0 0 0 0 0 0 0 1030.53 0 0 1029.01 0 0.01 0 0 0 0 2270.65 0 0 0 0 0 0 0 0 0 -892.743 0 0 0 0 0 0 0 0 0 0 
0 0 0 0 0 -551.698 0 0 0 0 0 0 0 0 0 0 0 0 0 0 0 -2120.5 0 0 0 -751.289 0 1191.06 0 0 0 0 0 0 1868.42 0 0 0 0 0 0 0 0 0 -1499.6 0 139.546 0 0 0 0 0 0 2308.34 0 0 0 0 0 0 0 0 0 0 0 
0 0 0 0 0 0 0 0 0 -90.5637 0 0 0 0 0 0 0 0 0 0 1075.09 0 0 885.418 0 0 0 0 1567.96 0 0 -557.192 0 0 0 1133.23 0 0 0 0 0 0.05 0 0 0 0 0 0 0 -2332 0 0 0 0 0 0 0 0 0 0 0 0 0 0 0 
0 0 0 1584.6 -41.1237 0 0 0 0 750.374 0 -531.098 0 0 0 0 0 0 0 0 0 0 0 0 0 1034.04 0 0 0 0 0 0 0 0 0 0 0 284.967 0 0 0 0 0.01 0 0 0 0 0 0 0 0 0 0 0 0 0 0 0 0 0 0 0 0 0 0 
0 0 0 0 0 0 0 0 0 881.756 446.715 0 0 0 0 0 0 0 0 0 0 2098.38 0 0 0 0 0 0 0 0 0 0 0 0 0 -942.793 1677.68 540.559 0 0 0 0 0 0.05 -204.55 0 0 0 0 0 0 0 0 0 0 0 0 0 0 0 0 0 0 0 2388 
497.681 0 0 0 0 0 0 0 0 0 0 0 0 944.472 0 0 0 0 0 0 0 0 2024.22 0 0 0 0 0 0 0 -109.027 0 0 0 0 0 0 0 0 1551.33 2233.27 0 0 -142.293 0.09 0 0 0 0 0 0 -234.611 0 0 0 0 0 0 0 0 0 -613.498 0 0 0 
-1713.39 0 0 0 0 0 0 1274.83 0 2471.92 0 0 218.131 0 0 0 0 0 0 0 0 0 0 0 0 0 0 0 0 0 0 0 0 0 0 0 889.538 2116.69 0 0 0 0 0 0 0 0.03 0 0 0 0 1857.13 0 0 0 0 0 0 0 0 0 0 0 0 0 0 
0 0 0 0 0 0 0 0 0 0 0 0 0 0 0 0 0 0 0 0 0 0 1468.47 0 0 0 0 0 681.86 0 0 0 1910.23 -2102.34 0 0 2361.6 0 0 0 2467.8 0 0 0 0 0 0.01 2348.02 0 -139.698 0 0 0 0 0 0 0 0 0 0 0 0 0 0 0 
-1871.78 0 0 141.987 0 0 0 0 0 0 0 0 0 0 0 1947.31 0 0 0 0 0 0 0 0 0 0 0 0 0 0 0 0 2448.88 0 1366.85 0 0 0 0 0 0 0 0 0 0 0 994.98 0.04 0 0 0 0 983.688 0 0 0 0 0 0 0 0 0 0 0 0 
0 0 -524.537 0 0 0 0 0 0 0 0 2096.39 0 1458.86 0 0 0 0 0 0 1324.58 0 0 0 0 2027.12 0 0 0 0 0 0 0 135.121 0 0 0 0 0 0 0 0 0 0 0 0 0 0 0.05 0 0 0 0 0 0 0 0 0 0 0 0 0 0 0 0 
0 0 0 0 0 0 -1346.86 0 0 0 1458.4 0 1121.17 0 0 0 0 1207.39 0 0 0 0 1950.06 0 0 0 -1906.11 0 0 2334.59 0 0 0 0 0 0 0 0 0 0 0 1113.24 0 0 0 0 1783.43 0 0 0.08 0 0 0 2330.16 0 0 0 0 0 0 0 0 0 0 0 
0 0 0 0 0 0 0 0 0 0 0 0 0 0 0 0 0 0 0 0 0 0 0 0 0 0 0 0 0 0 67.8274 0 0 0 0 857.646 0 0 1996.75 0 0 0 0 0 0 1924.88 0 0 0 0 0.05 0 0 2128.28 0 0 0 0 0 0 624.485 0 0 0 0 
0 0 1864.3 0 0 0 0 0 0 0 0 0 0 -358.364 0 0 0 0 0 1487.09 0 0 0 0 0 0 0 0 1456.72 0 0 0 0 0 0 0 0 0 0 0 0 0 0 0 1317.56 0 0 0 0 0 0 0.08 0 0 0 0 0 0 0 0 0 0 0 0 0 
0 0 0 0 0 2315.67 -281.762 0 0 0 0 0 0 0 1246.15 0 0 0 0 0 0 1863.54 0 -143.971 0 0 0 0 0 0 0 0 0 0 0 0 0 0 0 0 0 0 0 0 0 0 0 -189.901 0 0 0 0 0.04 0 0 0 0 0 0 0 0 0 0 0 0 
0 0 0 0 0 0 0 0 0 0 0 -686.132 0 0 0 0 0 29.9844 0 0 0 1525.85 0 0 0 0 0 0 0 0 0 0 -1640.29 0 0 2254.78 0 0 0 0 1996.44 0 0 0 0 0 0 0 0 83.2392 1089.74 0 0 0.02 0 0 0 0 0 0 0 0 0 0 0 
0 0 0 0 0 0 0 0 0 0 0 0 0 0 0 0 0 0 0 0 0 0 0 0 0 0 0 0 0 0 0 0 0 0 0 0 0 0 0 1076.16 0 0 0 0 0 0 0 0 0 0 0 0 0 0 0.01 0 0 0 0 0 0 0 0 0 0 
0 0 0 0 0 0 0 0 426.115 0 0 0 0 0 0 0 0 0 0 0 0 0 0 0 0 0 0 0 0 0 0 0 0 0 0 0 0 0 0 0 0 0 0 0 0 0 0 0 0 0 0 0 0 0 0 0.06 0 0 0 0 0 0 0 0 0 
0 0 0 0 0 0 0 1329.46 0 0 0 0 0 0 0 0 0 0 0 0 0 0 0 0 0 0 0 0 0 0 0 0 0 0 0 0 0 0 0 0 0 0 0 0 0 0 0 0 0 0 0 0 0 0 0 0 0.01 0 0 0 0 0 0 0 0 
0 1122.24 0 0 0 0 0 0 0 0 0 0 0 0 0 0 0 0 0 0 0 0 0 0 0 0 0 0 0 0 0 0 0 0 0 0 0 0 0 0 0 0 0 0 0 0 0 0 0 0 0 0 0 0 0 0 0 0 0 0 0 0 0 0 0 
0 0 0 0 0 0 0 0 0 0 0 0 0 0 0 0 0 0 0 0 0 0 0 0 2244.71 0 0 0 0 0 0 0 0 0 0 0 0 0 0 0 0 0 0 0 0 0 0 0 0 0 0 0 0 0 0 0 0 0 0.05 0 0 0 0 0 0 
0 0 0 0 0 0 0 0 0 0 0 0 0 0 0 0 0 0 0 0 0 0 0 0 0 0 0 0 0 0 0 0 0 0 386.135 0 0 0 0 0 0 0 0 0 0 0 0 0 0 0 0 0 0 0 0 0 0 0 0 0 0 0 0 0 0 
0 0 0 0 0 0 0 0 0 0 0 0 0 0 0 0 0 0 0 0 0 0 0 0 0 0 0 0 0 0 0 0 0 0 0 0 0 0 0 0 0 0 0 0 0 0 0 0 0 0 2408.29 0 0 0 0 0 0 0 0 0 0.09 0 0 0 0 
0 0 0 0 0 0 0 0 0 0 0 0 0 0 0 0 0 0 0 0 0 0 0 0 0 0 0 0 0 0 0 0 0 0 0 0 0 0 0 0 0 0 0 0 1014.66 0 0 0 0 0 0 0 0 0 0 0 0 0 0 0 0 0.04 0 0 0 
0 1603.98 0 0 0 0 0 0 0 0 0 0 0 0 0 0 0 0 0 0 0 0 0 0 0 0 0 0 0 0 0 0 0 0 0 0 0 0 0 0 0 0 0 0 0 0 0 0 0 0 0 0 0 0 0 0 0 0 0 0 0 0 0.08 0 0 
0 0 0 0 0 0 0 0 0 0 0 0 0 921.888 0 0 0 0 0 0 0 0 0 0 0 0 0 0 0 0 0 0 0 0 0 0 0 0 0 0 0 0 0 0 0 0 0 0 0 0 0 0 0 0 0 0 0 0 0 0 0 0 0 0.07 0 
0 0 0 0 0 0 0 0 0 1805.09 0 0 0 0 0 0 0 0 0 0 0 0 0 0 0 0 0 0 0 0 0 0 0 0 0 0 0 0 0 0 0 0 0 1069.75 0 0 0 0 0 0 0 0 0 0 0 0 0 0 0 0 0 0 0 0 0.07 
