*Vertices 50
*Matrix 
0.05 0 0 0 1859.26 0 0 0 0 0 0 0 0 -390.713 0 0 0 0 610.752 0 0 0 0 0 0 0 0 0 0 0 0 0 0 0 738.472 -213.248 0 0 0 0 0 0 0 0 0 0 507.447 0 -1639.84 0 
0 0 0 0 0 0 0 0 0 0 0 0 0 2097 0 0 0 2452.24 2251.43 0 0 1994.61 0 0 0 0 0 0 0 0 915.632 0 0 0 0 0 0 -659.124 147.938 0 0 0 0 0 0 0 0 0 0 0 
0 0 0.05 0 1025.04 0 0 0 94.0733 0 0 0 -1259.42 0 0 0 0 0 0 0 0 0 0 0 0 0 0 0 0 0 1848.73 0 0 1159.02 -1341.98 0 0 0 0 0 0 0 0 0 0 0 0 0 0 0 
0 0 0 0.09 0 0 538.118 0 0 0 0 0 0 0 0 0 0 0 0 0 0 0 0 0 0 0 2403.26 0 -988.266 0 0 0 0 0 0 0 0 0 0 0 0 0 0 0 0 0 0 0 0 0 
-1711.55 0 2099.44 0 0.06 0 0 0 0 0 0 0 0 0 0 0 1858.96 1612.52 0 0 0 0 0 0 -1967.76 0 154.805 0 0 0 0 0 0 0 0 1030.99 0 0 0 0 0 0 0 0 0 0 0 0 0 0 
0 0 0 0 0 0.05 0 0 0 0 0 0 0 0 0 0 0 0 0 0 0 2186.12 2064.5 0 0 0 0 0 0 0 0 0 0 -2012.31 0 778.298 0 0 0 0 0 0 0 0 0 0 0 0 0 0 
0 0 0 267.571 0 0 0.02 2088.15 0 0 0 0 0 0 0 0 1214.87 0 0 0 0 0 0 0 0 0 0 0 649.663 0 0 0 0 0 0 0 0 1909.31 0 0 0 0 0 0 0 0 0 0 0 0 
0 0 0 0 0 0 -729.621 0 -1661.35 0 0 0 0 0 1439.63 -252.922 0 0 0 -908.612 1873.3 0 0 0 0 0 0 0 0 0 0 0 0 0 0 0 0 1476.26 0 0 0 0 0 0 0 0 0 0 0 0 
0 0 326.014 0 0 0 0 1825.85 0.03 0 0 996.658 0 0 0 0 1742.23 0 -6.63778 0 0 0 0 0 0 0 0 -162.893 -584.964 0 0 0 0 0 1338.47 0 0 0 0 0 0 0 0 0 0 0 0 0 0 0 
0 0 0 0 0 0 0 0 0 0.06 0 0 0 0 0 0 0 0 0 2077.32 0 232.78 0 0 0 0 0 0 107.044 0 0 653.02 0 0 0 0 0 0 685.217 0 0 0 0 0 0 0 0 0 0 0 
0 0 0 0 0 0 0 0 0 0 0.09 0 0 0 0 1606.57 0 0 0 0 -134.205 0 0 0 0 0 996.048 0 0 -921.125 0 0 0 0 0 0 0 0 2264.09 0 0 0 0 0 0 0 0 0 0 0 
0 0 0 0 0 0 0 0 -857.341 0 0 0.01 0 1821.12 0 0 0 0 0 0 0 2488.71 0 0 -1346.4 0 0 0 0 0 249.565 0 0 0 2040.7 0 0 0 0 0 0 0 0 0 0 0 0 0 0 0 
0 0 2285.91 0 0 0 0 0 0 0 0 0 0.01 730.537 0 0 0 930.433 0 202.567 0 0 0 0 0 0 0 0 0 0 0 0 0 0 0 0 0 0 901.593 0 0 0 0 0 0 0 0 0 0 0 
24.4911 1886.43 0 0 0 0 0 0 0 0 0 1904.74 1780.68 0.03 0 158.925 0 0 0 759.529 0 0 0 0 0 0 0 0 1320.46 0 1373.56 1433.68 0 -1492.28 0 0 0 0 2444 0 0 0 0 0 0 0 0 0 0 0 
0 0 0 0 0 0 0 -2123.25 0 0 0 0 0 0 0 0 0 896.557 0 0 0 0 0 0 0 0 0 0 0 0 2114.09 0 1857.13 0 0 0 0 0 0 0 0 0 0 0 0 0 0 0 0 0 
0 0 0 0 0 0 0 -325.251 0 0 1012.83 0 0 1469.39 0 0.09 0 0 0 0 0 2389.83 0 0 751.9 0 0 0 0 0 0 0 821.635 0 0 0 0 0 0 0 0 0 0 0 0 0 0 70.8792 0 0 
0 0 0 0 1892.68 0 2494.96 0 2401.58 0 0 0 0 0 0 0 0.02 0 2265.31 0 0 0 0 0 0 0 0 0 0 -1924.27 0 0 0 0 0 0 0 0 0 0 0 0 -2323.6 0 0 0 0 0 0 0 
0 289.087 0 0 1917.55 0 0 0 0 0 0 0 -545.442 0 1171.68 0 0 0.07 -1896.8 -1200.67 559.328 0 0 0 0 1648.23 0 0 0 0 0 -1512.42 0 0 0 0 2371.67 0 0 0 0 0 0 0 0 0 0 0 0 0 
-2254.48 405.21 0 0 0 0 0 0 -1227.99 0 0 0 0 0 0 0 -89.9533 1946.09 0.09 0 0 0 0 -164.266 1853.62 43.7178 0 0 0 0 0 0 0 0 0 0 0 0 0 781.198 0 0 0 0 0 0 0 0 0 0 
0 0 0 0 0 0 0 2319.64 0 1639.84 0 0 1451.84 1635.72 0 0 0 1273.31 0 0.01 0 -2206.11 0 0 117.725 0 0 1225.39 0 0 0 2435.76 0 -282.22 0 0 0 0 0 0 0 974.075 0 0 0 -1154.9 0 0 0 0 
0 0 0 0 0 0 0 2215.72 0 0 -698.645 0 0 0 0 0 0 161.672 0 0 0.08 0 0 0 0 -1951.58 0 0 168.538 0 0 0 0 -2176.81 0 0 0 1936.93 1470.92 0 0 0 0 0 0 0 0 0 0 0 
0 -1321.53 0 0 0 2034.59 0 0 0 1495.33 0 -1286.89 0 0 0 1222.5 0 0 0 909.833 0 0.08 0 1409.88 0 0 0 0 0 0 0 0 0 0 0 0 -46.617 0 0 0 0 0 0 0 0 0 0 0 0 0 
0 0 0 0 0 1576.97 0 0 0 0 0 0 0 0 0 0 0 0 0 0 0 0 0.04 2058.85 0 0 705.512 -340.51 1701.79 0 0 0 0 0 0 0 0 0 869.549 0 0 0 0 0 0 0 0 0 0 0 
0 0 0 0 0 0 0 0 0 0 0 0 0 0 0 0 0 0 1949.14 0 0 2026.51 2258.75 0.01 0 0 0 0 0 0 0 0 0 0 0 0 0 0 0 0 0 0 0 0 0 0 0 0 0 0 
0 0 0 0 1792.73 0 0 0 0 0 0 560.549 0 0 0 1166.95 0 0 2451.17 -315.027 0 0 0 0 0.03 0 0 0 0 0 0 0 0 0 0 0 0 0 0 0 0 0 0 0 0 0 0 0 0 0 
0 0 0 0 0 0 0 0 0 0 0 0 0 0 0 0 0 256.127 -445.494 0 1900.31 0 0 0 0 0 0 0 0 0 0 0 0 1633.27 2022.23 0 0 0 0 0 0 0 0 0 0 0 0 0 0 0 
0 0 0 727.485 -2291.1 0 0 0 0 0 865.123 0 0 0 0 0 0 0 0 0 0 0 2277.37 0 0 0 0.01 0 0 680.486 0 0 0 0 748.848 0 2096.7 0 0 0 1178.24 0 0 0 0 0 0 0 0 0 
0 0 0 0 0 0 0 0 -2215.87 0 0 0 0 0 0 0 0 0 0 2076.1 0 0 -1764.81 0 0 0 0 0.04 0 0 0 0 0 0 0 1611.3 0 1921.37 0 0 0 0 0 0 0 0 0 0 0 0 
0 0 0 1971.27 0 0 1038.16 0 2472.23 1241.57 0 0 0 -259.636 0 0 0 0 0 0 -469.909 0 -241.783 0 0 0 0 0 0.04 0 0 0 0 0 0 -188.681 0 0 0 0 0 0 0 0 0 0 0 0 0 0 
0 0 0 0 0 0 0 0 0 0 1782.36 0 0 0 0 0 2078.84 0 0 0 0 0 0 0 0 0 1552.71 0 0 0.05 0 0 0 0 0 0 0 0 0 0 0 0 0 0 1093.55 0 0 0 0 0 
0 234.306 1491.06 0 0 0 0 0 0 0 0 361.568 0 857.189 1897.87 0 0 0 0 0 0 0 0 0 0 0 0 0 0 0 0.09 0 0 0 0 0 0 0 0 0 0 0 0 0 0 0 0 0 0 0 
0 0 0 0 0 0 0 0 0 1379.51 0 0 0 -1184.35 0 0 0 1376.61 0 -1020.77 0 0 0 0 0 0 0 0 0 0 0 0 0 0 0 0 0 0 0 0 0 0 0 0 0 0 0 0 0 0 
0 0 0 0 0 0 0 0 0 0 0 0 0 0 1940.9 2260.58 0 0 0 0 0 0 0 0 0 0 0 0 0 0 0 0 0.05 0 0 0 583.59 0 0 0 0 0 0 0 0 0 0 0 0 0 
0 0 -575.045 0 0 693.762 0 0 0 0 0 0 0 333.491 0 0 0 0 0 690.405 2435 0 0 0 0 351.802 0 0 0 0 0 0 0 0.03 1779.46 0 0 0 0 0 0 0 0 0 0 0 0 0 0 0 
-260.857 0 1721.32 0 0 0 0 0 -357.295 0 0 51.1948 0 0 0 0 0 0 0 0 0 0 0 0 0 -243.461 1878.64 0 0 0 0 0 0 -1555.76 0.04 0 0 0 0 0 0 0 0 0 0 0 0 0 0 0 
1137.35 0 0 0 458.617 -421.842 0 0 0 0 0 0 0 0 0 0 0 0 0 0 0 0 0 0 0 0 0 -1139.94 1892.38 0 0 0 0 0 0 0.05 0 0 0 0 0 0 0 0 0 0 0 0 0 0 
0 0 0 0 0 0 0 0 0 0 0 0 0 0 0 0 0 2498.02 0 0 0 972.701 0 0 0 0 673.772 0 0 0 0 0 -61.4185 0 0 0 0.01 0 0 0 0 0 0 -1338.31 0 0 0 0 0 0 
0 99.2615 0 0 0 0 2083.12 636.845 0 0 0 0 0 0 0 0 0 0 0 0 1586.73 0 0 0 0 0 0 1290.4 0 0 0 0 0 0 0 0 0 0.09 0 0 0 0 0 0 0 0 0 0 0 0 
0 2410.12 0 0 0 0 0 0 0 -523.011 1735.36 0 826.365 2039.78 0 0 0 0 0 0 -547.121 0 217.215 0 0 0 0 0 0 0 0 0 0 0 0 0 0 0 0.08 0 0 0 0 0 0 0 0 0 0 0 
0 0 0 0 0 0 0 0 0 0 0 0 0 0 0 0 0 0 106.281 0 0 0 0 0 0 0 0 0 0 0 0 0 0 0 0 0 0 0 0 0.09 0 0 0 0 0 0 0 0 0 0 
0 0 0 0 0 0 0 0 0 0 0 0 0 0 0 0 0 0 0 0 0 0 0 0 0 0 2322.84 0 0 0 0 0 0 0 0 0 0 0 0 0 0.05 0 0 0 0 0 0 0 0 0 
0 0 0 0 0 0 0 0 0 0 0 0 0 0 0 0 0 0 0 426.725 0 0 0 0 0 0 0 0 0 0 0 0 0 0 0 0 0 0 0 0 0 0.07 0 0 0 0 0 0 0 0 
0 0 0 0 0 0 0 0 0 0 0 0 0 0 0 0 2436.67 0 0 0 0 0 0 0 0 0 0 0 0 0 0 0 0 0 0 0 0 0 0 0 0 0 0.02 0 0 0 0 0 0 0 
0 0 0 0 0 0 0 0 0 0 0 0 0 0 0 0 0 0 0 0 0 0 0 0 0 0 0 0 0 0 0 0 0 0 0 0 1406.22 0 0 0 0 0 0 0.04 0 0 0 0 0 0 
0 0 0 0 0 0 0 0 0 0 0 0 0 0 0 0 0 0 0 0 0 0 0 0 0 0 0 0 0 2324.37 0 0 0 0 0 0 0 0 0 0 0 0 0 0 0.03 0 0 0 0 2490.69 
0 0 0 0 0 0 0 0 0 0 0 0 0 0 0 0 0 0 0 553.835 0 0 0 0 0 0 0 0 0 0 0 0 0 0 0 0 0 0 0 0 0 0 0 0 0 0.06 0 0 0 0 
1936.63 0 0 0 0 0 0 0 0 0 0 0 0 0 0 0 0 0 0 0 0 0 0 0 0 0 0 0 0 0 0 0 0 0 0 0 0 0 0 0 0 0 0 0 0 0 0.02 0 0 0 
0 0 0 0 0 0 0 0 0 0 0 0 0 0 0 529.572 0 0 0 0 0 0 0 0 0 0 0 0 0 0 0 0 0 0 0 0 0 0 0 0 0 0 0 0 0 0 0 0.09 0 0 
1911.76 0 0 0 0 0 0 0 0 0 0 0 0 0 0 0 0 0 0 0 0 0 0 0 0 0 0 0 0 0 0 0 0 0 0 0 0 0 0 0 0 0 0 0 0 0 0 0 0.02 0 
0 0 0 0 0 0 0 0 0 0 0 0 0 0 0 0 0 0 0 0 0 0 0 0 0 0 0 0 0 0 0 0 0 0 0 0 0 0 0 0 0 0 0 0 391.781 0 0 0 0 0.01 
