*Vertices 35
*Matrix 
0.07 0 0 1960.43 0 0 0 0 2056.87 0 2413.17 0 64.6229 0 0 0 0 0 164.418 0 0 0 0 0 0 0 0 0 0 0 0 0 0 0 0 
0 0.05 0 1242.33 -793.252 0 0 0 0 0 0 2202.6 0 0 -1992.32 0 0 0 0 0 0 0 0 0 0 0 0 0 823.771 0 0 0 0 0 0 
0 0 0 0 0 0 0 0 -1048.23 0 1627.63 0 0 0 0 0 0 0 0 0 1199.76 0 0 0 0 0 0 0 0 0 0 0 0 0 0 
1495.03 2367.85 0 0.06 0 0 0 0 0 0 -224.54 0 -1131.55 0 991.165 0 0 1760.99 0 0 0 0 0 0 0 0 -1937.54 0 0 0 0 0 0 0 0 
0 -1130.48 0 0 0.04 0 0 0 0 0 0 0 0 0 512.635 0 510.651 0 0 0 1363.49 0 1267.36 0 0 0 0 0 0 2304.53 0 0 0 0 0 
0 0 0 0 0 0.02 0 0 0 0 0 2411.8 0 0 0 0 0 0 0 0 500.122 0 0 0 0 0 0 0 0 0 0 0 0 0 0 
0 0 0 0 0 0 0 0 0 0 0 0 0 0 0 0 0 0 0 0 0 0 0 0 0 0 0 0 0 0 2490.69 354.701 0 0 0 
0 0 0 0 0 0 0 0.03 0 0 0 0 0 0 1308.1 0 0 0 0 0 0 0 0 0 0 0 0 0 0 0 0 0 0 -839.793 0 
1913.43 0 833.384 0 0 0 0 0 0.05 0 0 0 0 0 0 0 0 803.323 0 0 0 0 0 0 0 2239.37 0 223.014 0 0 0 0 0 0 0 
0 0 0 0 0 0 0 0 0 0.08 0 0 0 0 385.83 0 0 0 0 0 0 0 0 2326.5 0 0 0 0 0 0 2361.9 0 0 0 0 
902.356 0 -2278.59 -797.678 0 0 0 0 0 0 0.06 0 0 0 0 62.9444 0 1885.05 0 0 0 0 0 0 0 0 0 0 0 0 0 0 0 0 0 
0 2002.85 0 0 0 306.787 0 0 0 0 0 0.02 0 0 0 0 0 0 0 0 0 0 0 -1869.49 0 0 0 0 0 0 0 -380.337 0 0 0 
2398.68 0 0 2185.81 0 0 0 0 0 0 0 0 0.06 0 0 0 0 0 0 0 0 -1859.26 0 0 0 0 0 0 0 0 0 0 0 0 0 
0 0 0 0 0 0 0 0 0 0 0 0 0 0 0 0 0 0 0 0 0 0 0 0 0 1953.26 0 0 0 0 0 0 0 0 0 
0 1173.21 0 -785.623 1011.92 0 0 -1065.94 0 1842.33 0 0 0 0 0.01 0 0 0 0 0 0 0 831.553 0 0 0 0 0 0 335.17 509.278 0 0 0 0 
0 0 0 0 0 0 0 0 0 0 1795.48 0 0 0 0 0.09 0 0 0 0 0 0 0 0 0 -124.287 0 0 58.5192 0 95.5992 0 0 0 0 
0 0 0 0 -147.481 0 0 0 0 0 0 0 0 0 0 0 0.02 0 2336.42 0 0 0 0 0 0 0 0 0 0 0 0 0 0 0 0 
0 0 0 1798.99 0 0 0 0 830.79 0 2414.4 0 0 0 0 0 0 0.03 0 206.534 0 0 2277.98 0 0 0 0 -337.001 0 0 0 0 0 0 0 
440.764 0 0 0 0 0 0 0 0 0 0 0 0 0 0 0 1048.08 0 0.09 0 0 0 534.303 0 0 0 0 0 0 -2102.8 0 0 0 0 0 
0 0 0 0 0 0 0 0 0 0 0 0 0 0 0 0 0 120.167 0 0.02 0 -984.451 0 0 0 0 0 0 0 0 0 1851.33 0 0 0 
0 0 2035.66 0 -2398.37 244.072 0 0 0 0 0 0 0 0 0 0 0 0 0 0 0 0 0 0 0 0 0 0 0 0 0 0 0 0 0 
0 0 0 0 0 0 0 0 0 0 0 0 -1004.29 0 0 0 0 0 0 1097.98 0 0.02 -364.467 0 -874.737 0 0 -1690.8 1683.48 0 0 0 1504.33 0 0 
0 0 0 0 -1484.65 0 0 0 0 0 0 0 0 0 2495.12 0 0 -209.433 2470.09 0 0 864.971 0.01 1629.76 0 -1892.68 0 0 0 0 0 0 0 0 0 
0 0 0 0 0 0 0 0 0 2025.74 0 -1737.34 0 0 0 0 0 0 0 0 0 0 846.049 0.02 0 0 0 0 0 0 0 0 0 0 0 
0 0 0 0 0 0 0 0 0 0 0 0 0 0 0 0 0 0 0 0 0 1753.97 0 0 0.08 0 0 -1069.9 881.146 0 0 1148.34 0 0 0 
0 0 0 0 0 0 0 0 2046.8 0 0 0 0 2469.48 0 613.651 0 0 0 0 0 0 -1103.17 0 0 0.03 0 0 0 0 0 0 0 0 0 
0 0 0 2049.85 0 0 0 0 0 0 0 0 0 0 0 0 0 0 0 0 0 0 0 0 0 0 0.04 0 0 0 0 0 0 0 0 
0 0 0 0 0 0 0 0 1613.9 0 0 0 0 0 0 0 0 -438.169 0 0 0 1693.85 0 0 -844.371 0 0 0.05 0 0 0 0 0 0 0 
0 1534.85 0 0 0 0 0 0 0 0 0 0 0 0 0 168.996 0 0 0 0 0 921.125 0 0 -1208.76 0 0 0 0.05 0 0 0 0 0 0 
0 0 0 0 397.122 0 0 0 0 0 0 0 0 0 2035.2 0 0 0 859.783 0 0 0 0 0 0 0 0 0 0 0.05 2007.28 0 277.947 0 0 
0 0 0 0 0 0 1145.89 0 0 793.863 0 0 0 0 285.73 646.763 0 0 0 0 0 0 0 0 0 0 0 0 0 511.261 0.05 0 -1891.46 0 -603.275 
0 0 0 0 0 0 2216.18 0 0 0 0 829.722 0 0 0 0 0 0 0 1050.83 0 0 0 0 509.583 0 0 0 0 0 0 0.04 0 0 0 
0 0 0 0 0 0 0 0 0 0 0 0 0 0 0 0 0 0 0 0 0 1554.08 0 0 0 0 0 0 0 -138.173 2005.45 0 0.07 0 0 
0 0 0 0 0 0 0 2255.09 0 0 0 0 0 0 0 0 0 0 0 0 0 0 0 0 0 0 0 0 0 0 0 0 0 0.07 0 
0 0 0 0 0 0 0 0 0 0 0 0 0 0 0 0 0 0 0 0 0 0 0 0 0 0 0 0 0 0 937.147 0 0 0 0.07 
