*Vertices 47
*Matrix 
0.04 0 0 0 0 0 0 0 0 0 0 0 -49.6689 1875.59 0 0 0 1975.39 0 0 0 0 0 2231.89 0 2137.14 0 0 908.612 0 0 0 0 0 0 0 0 0 0 0 0 0 0 0 1339.38 1611 0 
0 0.05 0 0 0 0 0 0 2064.81 0 0 0 470.214 2221.37 0 -146.26 0 0 978.652 0 0 0 1811.2 0 2253.87 0 0 1154.13 0 252.312 0 0 0 0 0 0 0 0 0 0 0 0 0 0 0 0 0 
0 0 0.01 0 0 0 -2293.69 1894.36 2346.8 -2297.2 0 0 1882 0 2494.05 0 0 1269.04 0 0 -1524.63 0 0 2400.51 0 0 0 0 0 2378.23 0 0 0 0 0 0 0 0 0 0 0 0 0 0 0 0 -796.304 
0 0 0 0 0 0 -2032.15 0 0 -561.312 0 0 -174.337 0 0 665.38 2310.94 0 2495.57 674.535 0 0 0 0 -1819.74 0 0 0 343.104 -189.291 0 0 0 -1691.56 0 0 0 0 0 0 0 0 976.211 0 0 0 0 
0 0 0 0 0.09 496.46 1457.95 0 0 0 60.6555 0 -657.903 0 0 0 -1401.03 0 0 -2406.31 0 0 0 328.303 0 0 1519.14 0 0 1202.96 0 0 0 0 2424.01 -1282.31 0 0 0 0 0 0 0 0 0 0 0 
0 0 0 0 -356.685 0.01 0 -1203.42 2104.18 0 0 -933.18 0 0 0 0 0 0 1633.43 0 -808.359 2396.54 0 0 0 0 0 0 0 0 0 0 0 0 0 0 0 1478.09 0 0 0 0 0 2408.44 2277.98 0 0 
0 0 2107.99 -1572.39 -56.3829 0 0.06 0 1428.34 0 0 0 -2416.23 -334.254 0 0 0 1667.46 0 0 0 0 0 0 0 0 0 0 0 2413.33 -2489.62 0 0 0 0 0 0 0 0 0 0 0 0 0 422.91 0 0 
0 0 -938.063 0 0 1906.72 0 0.08 0 0 0 0 0 -2046.65 0 0 0 0 739.692 1849.5 0 2466.43 0 0 -2265.77 0 483.184 0 0 822.092 -2000.41 0 0 0 0 0 0 0 0 0 -229.423 0 0 0 0 0 0 
0 671.789 2320.25 0 0 -6.79037 -889.843 0 0.04 0 0 0 0 -2245.93 0 0 0 0 0 928.602 -2320.4 968.734 299.768 0 227.439 1802.65 2364.8 0 0 0 0 0 0 0 0 0 1692.94 0 0 0 0 0 0 0 0 0 0 
0 0 -1047.78 844.676 0 0 0 0 0 0.06 577.487 0 0 1025.5 0 0 -2026.96 0 0 0 2034.75 -755.257 0 0 653.172 0 1093.86 0 0 0 0 -1289.94 185.018 0 0 0 -217.215 720.008 0 0 0 0 628.452 0 0 0 0 
0 0 0 0 -476.318 0 0 0 0 1210.75 0.03 0 0 2124.32 0 -1354.18 0 0 0 0 0 0 0 0 0 0 0 0 1812.42 0 0 0 0 0 0 0 0 0 0 0 0 0 0 0 0 0 0 
0 0 0 0 0 1623.81 0 0 0 0 0 0.06 0 0 0 0 0 2360.99 1616.79 2242.73 0 0 0 0 -1575.59 0 1866.89 0 0 -1855.14 0 0 -1781.75 0 0 0 1225.55 0 0 0 0 0 1090.35 0 0 0 0 
-1291.92 2395.02 -1038.47 -67.0644 -419.858 0 -1032.67 0 0 0 0 0 0.02 0 0 0 0 2116.84 0 0 -194.632 0 0 0 1862.77 1046.71 -428.098 -1848.28 0 1853.62 0 0 0 0 0 0 0 0 0 0 0 0 0 0 1436.74 993.912 1072.65 
2079.3 -1893.75 0 0 0 0 44.6333 2385.25 -1711.86 -638.981 -255.821 0 0 0.07 1344.42 0 0 0 806.833 0 0 0 0 0 0 -612.278 0 0 0 0 0 0 0 0 0 -983.84 0 0 0 2389.98 0 -575.045 0 0 0 0 0 
0 0 775.399 0 0 0 0 0 0 0 0 0 0 1023.36 0.04 342.036 -1610.23 0 0 0 0 0 353.328 0 1905.8 0 0 206.992 0 0 0 0 -1347.01 0 0 0 0 0 0 0 0 0 0 0 0 0 0 
0 2319.48 0 -1417.36 0 0 0 0 0 0 2322.99 0 0 0 1805.25 0.01 0 2328.03 0 0 -251.091 2264.4 2343.9 0 997.421 0 0 0 0 0 0 0 330.287 -1511.35 1575.29 -888.623 589.236 0 0 0 0 0 0 0 0 0 0 
0 0 0 -2235.4 2419.58 0 0 0 0 2414.24 0 0 0 0 2451.78 0 0.02 0 0 0 0 0 0 0 0 0 0 0 0 1982.86 0 -1118.58 0 1359.68 0 0 0 0 0 0 2375.33 -2067.55 0 0 0 0 0 
-1499.45 0 -80.4926 0 0 0 1642.28 0 0 0 0 293.207 1747.26 0 0 2319.33 0 0.09 0 0 309.229 0 108.875 0 0 0 -882.977 0 1433.07 0 0 0 0 -1561.56 0 0 0 0 0 0 0 0 0 0 0 0 0 
0 -834.758 0 -518.281 0 2243.19 0 1405.45 0 0 0 1442.23 0 -2417.91 0 0 0 0 0.09 975.753 0 1994 0 0 0 0 0 0 0 -1564.91 0 0 0 0 0 0 0 0 0 0 0 0 -490.661 1237.45 0 0 0 
0 0 0 457.244 273.522 0 0 -897.931 -1782.36 0 0 2007.89 0 0 0 0 0 0 2419.89 0.08 0 0 2484.44 0 1155.51 -10.1474 520.875 0 0 0 0 0 0 0 1975.08 0 0 0 0 0 -1543.09 0 0 0 0 0 0 
0 0 -36.6985 0 0 1085.47 0 0 -1024.28 2142.48 0 0 1462.22 0 0 2123.25 0 -179.22 0 0 0.03 0 0 0 0 0 0 0 0 0 0 0 0 0 0 0 0 0 0 0 0 0 0 0 0 0 0 
0 0 0 0 0 -660.497 0 1904.74 1091.88 822.55 0 0 0 0 0 2040.7 0 0 1904.74 0 0 0.04 0 -69.9637 -1123 0 0 0 0 0 0 0 0 0 0 1990.04 0 1654.79 0 0 0 0 0 0 0 0 0 
0 2321.92 0 0 0 0 0 0 1817.15 0 0 0 0 0 -29.9844 -958.205 0 1896.5 0 2054.12 0 0 0 0 1142.84 0 0 0 0 1143.45 2438.96 0 0 0 0 0 -1348.54 0 0 0 -1526.46 0 0 0 0 0 0 
2366.18 0 1780.53 0 2349.39 0 0 0 0 0 0 0 0 0 0 0 0 0 0 0 0 2251.12 0 0.08 0 -1.14444 0 -1802.19 0 -297.021 2183.98 -947.218 0 0 0 0 0 0 0 2443.54 0 1281.85 -1589.63 0 0 0 0 
0 1585.21 0 -2011.7 0 0 0 -1531.8 2376.86 1300.78 0 23.2704 -232.78 0 -503.784 1849.5 0 0 0 -598.849 0 1323.82 -544.832 0 0.04 0 0 0 0 0 1986.53 0 -1120.87 0 0 0 0 0 0 0 -13.8096 0 0 0 413.144 0 0 
278.863 0 0 0 0 0 0 0 28.7637 0 0 0 2473.45 2147.36 0 0 0 0 0 1259.27 0 0 0 2276.3 0 0.09 0 0 0 0 0 0 0 0 -270.623 0 0 -2048.48 0 0 -2489.32 0 0 0 0 0 0 
0 0 0 0 1614.35 0 0 2330.93 2091.81 -802.408 0 -1084.7 -1000.17 0 0 0 0 946.608 0 -1345.18 0 0 0 0 0 0 0.01 -1688.21 -103.992 0 0 0 1069.44 0 -552.919 0 0 0 0 0 0 0 0 0 0 0 0 
0 -403.684 0 0 0 0 0 0 0 0 0 0 1855.14 0 1330.84 0 0 0 0 0 0 0 0 2196.19 0 0 755.562 0.04 1019.7 -346.461 0 0 830.79 0 0 0 0 0 -451.598 0 0 0 0 0 0 0 0 
2476.2 0 0 1924.73 0 0 0 0 0 0 1725.44 0 0 0 0 0 0 111.774 0 0 0 0 0 0 0 0 915.021 -2209.77 0.09 0 0 0 0 0 0 0 0 0 0 0 0 0 0 0 0 0 0 
0 -2159.11 1140.25 855.968 2276.76 0 -389.645 -2076.86 0 0 0 2051.84 49.6689 0 0 0 691.168 0 1497.47 0 0 0 2140.49 1080.89 0 0 0 1373.71 0 0.05 0 0 0 0 0 0 0 0 -1228.45 0 0 0 0 0 0 0 0 
0 0 0 0 0 0 1257.9 2148.43 0 0 0 0 0 0 0 0 0 0 0 0 0 0 -322.81 1628.24 2055.19 0 0 0 0 0 0 0 0 0 0 1598.79 0 0 0 0 0 -1635.11 0 0 0 0 2162.92 
0 0 0 0 0 0 0 0 0 1384.4 0 0 0 0 0 0 -2260.73 0 0 0 0 0 0 2452.7 0 0 0 0 0 0 0 0 0 0 0 0 0 0 0 0 0 0 0 0 0 0 0 
0 0 0 0 0 0 0 0 0 -1295.59 0 49.5163 0 0 -1059.53 712.989 0 0 0 0 0 0 0 0 2203.05 0 813.395 2286.37 0 0 0 0 0 0 0 0 0 0 0 0 0 0 0 0 0 0 0 
0 0 0 2351.53 0 0 0 0 0 0 0 0 0 0 0 1670.66 1248.44 1103.47 0 0 0 0 0 0 0 0 0 0 0 0 0 0 0 0.03 0 0 0 0 0 0 0 0 0 0 0 0 0 
0 0 0 0 -1634.8 0 0 0 0 0 0 0 0 0 0 2360.84 0 0 0 -1031.3 0 0 0 0 0 1570.25 2463.23 0 0 0 0 0 0 0 0.03 0 0 0 0 0 0 0 0 0 0 0 0 
0 0 0 0 -932.264 0 0 0 0 0 0 0 0 1142.23 0 917.92 0 0 0 0 0 2282.1 0 0 0 0 0 0 0 0 59.8926 0 0 0 0 0.05 0 0 0 0 0 0 0 0 0 -655.156 0 
0 0 0 0 0 0 0 0 -740.303 2492.22 0 1453.83 0 0 0 1307.79 0 0 0 0 0 0 -450.682 0 0 0 0 0 0 0 0 0 0 0 0 0 0.05 0 0 0 0 -1208.91 -32.2733 0 0 0 0 
0 0 0 0 0 1739.02 0 0 0 -571.23 0 0 0 0 0 0 0 0 0 0 0 2433.16 0 0 0 -2131.34 0 0 0 0 0 0 0 0 0 0 0 0.05 0 0 0 0 0 0 0 -563.601 0 
0 0 0 0 0 0 0 0 0 0 0 0 0 0 0 0 0 0 0 0 0 0 0 0 0 0 0 127.338 0 2124.16 0 0 0 0 0 0 0 0 0.08 0 0 0 0 0 0 0 881.603 
0 0 0 0 0 0 0 0 0 0 0 0 0 1071.28 0 0 0 0 0 0 0 0 0 1496.25 0 0 0 0 0 0 0 0 0 0 0 0 0 0 0 0.07 0 0 0 0 0 0 0 
0 0 0 0 0 0 0 -1096 0 0 0 0 0 0 0 0 1494.72 0 0 2260.89 0 0 59.5874 0 1151.39 -1527.68 0 0 0 0 0 0 0 0 0 0 0 0 0 0 0.01 0 0 0 0 0 0 
0 0 0 0 0 0 0 0 0 0 0 0 0 1824.78 0 0 1621.37 0 0 0 0 0 0 -349.971 0 0 0 0 0 0 388.272 0 0 0 0 0 326.93 0 0 0 0 0 0 0 0 -2473.6 0 
0 0 0 -1747.72 0 0 0 0 0 1383.48 0 80.1874 0 0 0 0 0 0 -173.879 0 0 0 0 582.064 0 0 0 0 0 0 0 0 0 0 0 0 1779.76 0 0 0 0 0 0.05 0 0 0 0 
0 0 0 0 0 2089.07 0 0 0 0 0 0 0 0 0 0 0 0 -2239.22 0 0 0 0 0 0 0 0 0 0 0 0 0 0 0 0 0 0 0 0 0 0 0 0 0.08 0 0 0 
44.3281 0 0 0 0 2326.04 731.758 0 0 0 0 0 2144.61 0 0 0 0 0 0 0 0 0 0 0 2500 0 0 0 0 0 0 0 0 0 0 0 0 0 0 0 0 0 0 0 0.07 0 0 
-982.162 0 0 0 0 0 0 0 0 0 0 0 1694.16 0 0 0 0 0 0 0 0 0 0 0 0 0 0 0 0 0 0 0 0 0 0 1007.49 0 607.7 0 0 0 126.27 0 0 0 0.07 0 
0 0 -189.596 0 0 0 0 0 0 0 0 0 844.676 0 0 0 0 0 0 0 0 0 0 0 0 0 0 0 0 0 -221.641 0 0 0 0 0 0 0 1616.95 0 0 0 0 0 0 0 0.02 
