*Vertices 48
*Matrix 
0.04 0 0 -1782.66 0 0 0 0 2068.93 0 0 0 0 0 0 0 -2373.35 0 0 1908.7 0 0 0 0 18.54 0 -218.284 1712.78 0 1571.47 0 0 0 0 0 0 0 0 0 1364.86 0 0 0 0 0 0 0 1346.71 
0 0.08 0 0 0 0 0 0 0 0 0 0 2321.31 0 0 0 0 0 0 0 0 0 0 -2115.31 0 0 0 0 0 0 0 0 0 1972.95 0 0 0 0 1580.32 0 -351.802 0 0 0 0 0 0 0 
0 0 0 0 0 0 0 1032.52 0 1474.88 0 0 534.455 0 283.898 0 0 1533.17 0 0 0 974.837 0 0 0 0 0 1595.74 0 0 0 0 0 0 -1339.23 0 763.955 0 0 -2177.57 0 0 0 0 0 0 0 -232.933 
1353.27 0 0 0.05 0 0 0 0 0 0 0 702.46 0 0 0 -1971.72 0 0 0 0 0 0 0 713.294 -2362.06 0 0 1748.63 1770.3 0 0 0 -2311.85 0 0 -344.935 0 0 1416.75 0 1728.49 0 0 0 0 0 0 0 
0 0 0 0 0.09 0 -1075.55 0 0 0 0 0 0 0 0 0 0 0 0 0 0 0 213.858 0 291.528 -534.913 0 0 0 0 0 0 749.763 538.575 0 0 1848.89 0 0 0 0 0 0 -207.297 0 -1284.91 0 0 
0 0 0 0 0 0.05 1698.89 0 0 0 0 0 1032.98 262.383 2007.13 0 0 0 0 0 0 0 -1607.94 0 0 -1551.33 398.495 0 0 0 0 0 790.658 0 0 0 0 0 0 0 0 0 0 0 0 0 0 0 
0 0 0 0 978.957 -1731.7 0 -214.927 0 651.646 0 0 0 0 -129.322 1537.6 0 1881.08 0 0 -1848.43 0 536.744 1272.55 -2468.11 0 0 2308.65 1192.13 1218.22 0 0 0 0 0 0 0 0 0 0 406.888 0 0 0 0 0 632.878 0 
0 0 -88.4274 0 0 0 2328.79 0.07 0 810.648 0 0 0 0 0 0 0 -623.112 0 0 0 -734.657 0 0 0 1843.39 1883.68 -1330.07 0 0 0 0 0 0 0 1780.83 0 0 0 0 0 0 0 0 0 0 0 -58.3666 
1170.16 0 0 0 0 0 0 0 0.05 0 0 0 0 0 0 0 0 0 1454.28 468.688 0 0 0 0 -256.737 0 0 0 0 0 0 0 0 0 0 0 0 0 1201.44 78.9666 0 0 0 0 0 0 0 0 
0 0 -1950.51 0 0 0 390.103 1826 0 0.08 1178.4 0 0 0 0 0 -842.845 -807.443 0 0 0 0 0 0 0 2395.17 146.413 0 353.175 0 0 0 0 -885.571 0 0 0 0 0 0 0 0 0 0 0 0 0 0 
0 0 0 0 0 0 0 0 0 2281.49 0 0 2179.86 0 0 -699.255 -570.62 0 1529.97 0 0 0 0 1883.98 0 0 0 0 0 0 0 0 508.515 0 0 0 0 0 0 0 0 0 0 0 0 0 910.749 0 
0 0 0 444.121 0 0 0 0 0 0 0 0.09 90.8689 0 0 0 0 0 0 0 2158.65 -1737.95 0 1903.82 828.806 0 -1467.1 0 0 0 0 0 0 0 2225.18 0 0 1547.82 1068.99 0 0 0 0 0 0 -1629.92 0 0 
0 1752.45 1945.78 0 0 -1431.24 0 0 0 0 2170.25 2101.89 0.08 0 0 -1576.05 0 0 -983.23 0 300.226 0 520.875 0 1428.8 0 0 -1849.65 2244.41 0 1726.2 0 0 0 0 -599.307 0 0 0 0 209.586 -326.014 0 0 0 0 0 0 
0 0 0 0 0 1870.56 0 0 0 0 0 0 0 0.06 0 -2486.42 0 957.442 840.403 0 0 1643.5 0 -1226.16 0 -172.658 0 0 0 1710.03 0 0 0 0 0 0 0 0 0 0 0 713.599 0 -311.518 0 -2215.41 0 0 
0 0 1239.13 0 0 -412.992 1756.57 0 0 0 0 0 0 0 0.04 1518.37 0 0 -1019.39 0 2385.71 0 0 0 0 1488.92 0 0 0 0 0 808.969 0 0 -1125.75 -640.049 641.27 859.783 0 0 0 0 0 0 0 0 0 0 
0 0 0 -1858.5 0 0 -795.541 0 0 0 1970.5 0 2441.4 2094.56 501.038 0.03 0 0 -95.4466 0 116.352 0 0 2042.22 1913.43 0 0 0 0 0 222.251 0 -2280.42 -86.2911 0 0 0 0 0 0 0 0 0 0 0 0 0 0 
2042.68 0 0 0 0 0 0 0 0 -1001.85 -190.664 0 0 0 0 0 0 0 0 0 0 0 0 0 0 0 0 1660.89 0 1253.01 0 0 0 0 0 0 0 0 -653.63 1293.45 0 0 0 0 0 0 0 0 
0 0 2013.38 0 0 0 -2216.03 2373.96 0 572.298 0 0 0 -228.965 0 0 0 0.06 0 0 0 740.303 0 228.507 0 0 0 418.027 1703.92 -351.955 -358.364 0 0 0 0 0 249.718 -225.303 0 0 -2075.18 0 -2486.57 0 0 0 0 0 
0 0 0 0 0 0 0 0 1228.29 0 1501.13 0 -770.669 1165.88 -2059.47 982.162 0 0 0 0 0 0 1706.98 0 0 -1179.46 1012.83 144.734 0 0 0 0 1594.52 2052.9 0 -577.487 1115.53 1586.58 0 -1517.76 -2281.18 0 0 0 278.405 -150.075 0 0 
1258.81 0 0 0 0 0 0 0 2230.83 0 0 0 0 0 0 0 0 0 0 0.04 0 0 0 0 0 0 0 0 0 0 0 0 0 0 0 -1747.11 -107.807 0 0 615.024 1795.33 0 0 0 0 0 -1680.43 0 
0 0 0 0 0 0 -330.897 0 0 0 0 155.721 1443.91 0 467.467 1114.46 0 0 0 0 0.09 0 -1305.2 0 0 0 0 1756.57 2446.29 0 0 0 0 0 2106.46 0 0 0 1291.31 0 0 0 0 0 0 0 2335.2 0 
0 0 -2193.75 0 0 0 0 2400.51 0 0 0 2168.11 0 1969.13 0 0 0 -939.741 0 0 0 0.03 0 0 1190.76 0 0 0 0 0 -256.584 0 -314.417 0 1969.74 0 0 0 0 806.07 0 0 0 0 0 0 0 0 
0 0 0 0 -1328.7 1454.74 -410.092 0 0 0 0 0 1947.61 0 0 0 0 0 1797.16 0 70.4215 0 0.04 0 0 0 0 148.549 0 0 349.055 0 -1654.18 0 -1374.32 0 0 0 0 0 0 1508.3 0 0 0 0 0 0 
0 1280.33 0 1176.72 0 0 717.414 0 0 0 -1928.69 1914.96 0 571.841 0 1244.16 0 876.11 0 0 0 0 0 0.02 252.159 0 0 2285.3 0 0 -2124.16 0 0 0 0 0 0 0 0 1939.38 0 0 0 0 0 0 0 0 
266.35 0 0 1788.92 1612.37 0 -112.842 0 1221.73 0 0 810.8 106.738 0 0 -2373.5 0 0 0 0 0 1846.75 0 2254.02 0.01 0 0 297.021 0 0 -1159.32 0 0 0 -209.281 0 0 0 -852.916 0 0 0 0 0 31.5104 -1180.68 0 -37.4615 
0 0 0 0 -702.765 -1626.26 0 1460.54 0 1662.42 0 0 0 1498.38 -114.063 0 0 0 1893.75 0 0 0 0 0 0 0.04 0 0 0 2448.73 1067 0 0 0 802.408 0 0 -2298.73 0 505.615 0 0 0 0 0 -1315.73 0 0 
-25.1015 0 0 0 0 -681.555 0 1965.32 0 -1512.42 0 -574.74 0 0 0 0 0 0 1894.06 0 0 0 0 0 0 0 0.09 0 1339.08 1529.82 0 0 0 2085.86 0 -601.444 2414.85 0 0 0 1397.82 0 0 2285.45 0 0 0 0 
-1779.15 0 1944.72 -90.4111 0 0 220.725 159.841 0 0 0 0 2194.51 0 0 0 -2442.01 323.878 2008.5 0 -1463.29 0 2112.57 1004.29 2128.13 0 0 0.06 0 0 0 1119.34 1653.26 0 0 0 0 0 0 0 0 0 0 0 0 0 0 0 
0 0 0 2037.19 0 0 317.927 0 0 2155.14 0 0 1840.8 0 0 0 0 2241.2 0 0 -1893.44 0 0 0 0 0 -329.371 0 0.02 0 0 0 0 0 273.064 0 0 0 0 -1468.93 0 0 0 0 0 0 0 0 
-78.5089 0 0 0 0 0 -1275.75 0 0 0 0 0 0 2107.99 0 0 1160.08 246.208 0 0 0 0 0 0 0 378.353 1632.97 0 0 0.03 0 0 0 0 0 0 0 1357.54 0 -1330.84 0 0 0 0 0 0 0 0 
0 0 0 0 0 0 0 0 0 0 0 0 44.3281 0 0 -2155.14 0 1058.46 0 0 0 1894.06 -545.9 -2247.31 1592.99 1868.42 0 0 0 0 0.02 0 2122.49 0 0 0 0 0 0 -1260.64 0 0 0 0 335.78 0 1135.06 0 
0 0 0 0 0 0 0 0 0 0 0 0 0 0 -584.658 0 0 0 0 0 0 0 0 0 0 0 0 2138.36 0 0 0 0 0 0 0 0 0 0 0 1763.13 1366.24 0 0 0 0 0 0 0 
0 0 0 -2214.5 -1100.27 -521.332 0 0 0 0 917.463 0 0 0 0 1764.2 0 0 1028.09 0 0 1294.82 1913.89 0 0 0 0 1708.96 0 0 2459.56 0 0.09 0 0 0 564.516 0 0 -623.417 -674.993 -2096.39 0 0 0 0 0 0 
0 1760.08 0 0 -1875.29 0 0 0 0 1065.02 0 0 0 0 0 -222.861 0 0 1953.41 0 0 0 0 0 0 0 1756.26 0 0 0 0 0 0 0.09 -168.233 -1187.09 497.528 0 0 501.953 0 0 0 0 0 -1745.89 0 0 
0 0 -76.5252 0 0 0 0 0 0 0 0 -1108.66 0 0 693.152 0 0 0 0 0 -1377.07 -44.7859 -1253.78 0 1229.06 2493.9 0 0 -1414.91 0 0 0 0 893.811 0.02 0 0 390.255 0 0 2114.25 0 0 0 0 0 0 0 
0 0 0 952.864 0 0 0 -1426.97 0 0 0 0 751.9 0 11.2156 0 0 0 -2418.36 1992.02 0 0 0 0 0 0 2496.03 0 0 0 0 0 0 272.607 0 0.07 0 -316.858 0 0 0 -62.6392 0 0 0 0 0 0 
0 0 669.958 0 -1913.89 0 0 0 0 0 0 0 0 0 2086.17 0 0 2372.59 1242.33 2008.96 0 0 0 0 0 0 2286.68 0 0 0 0 0 -1263.85 -2009.87 0 0 0.06 1945.78 0 0 -183.187 0 0 0 0 0 0 0 
0 0 0 0 0 0 0 0 0 0 0 2051.84 0 0 -263.298 0 0 -2290.95 1066.39 0 0 0 0 0 0 -562.075 0 0 0 2410.28 0 0 0 0 1743.9 901.44 1247.83 0.07 0 0 -558.718 0 676.977 0 0 0 0 0 
0 548.189 0 952.864 0 0 0 0 1112.93 0 0 -1052.2 0 0 0 0 -1954.33 0 0 0 1623.36 0 0 0 2197.26 0 0 0 0 0 0 0 0 0 0 0 0 0 0.02 0 0 0 0 0 0 0 0 0 
2326.81 0 277.49 0 0 0 0 0 -1141.01 0 0 0 0 0 0 0 -2071.67 0 1506.93 -910.596 0 2251.73 0 -414.212 0 -1466.49 0 0 -982.925 450.53 -1684.39 1261.71 -412.381 995.285 0 0 0 0 0 0.07 0 0 -326.472 0 0 0 0 199.973 
0 -268.639 0 33.4941 0 0 2204.89 0 0 0 0 0 -852.763 0 0 0 0 622.501 1668.37 -1514.56 0 0 0 0 0 0 2489.93 0 0 0 0 -1238.21 2322.69 0 -474.029 0 1259.42 1003.07 0 0 0.02 0 0 0 736.03 0 0 0 
0 0 0 0 0 0 0 0 0 0 0 0 1612.06 -1374.32 0 0 0 0 0 0 0 0 601.749 0 0 0 0 0 0 0 0 0 -1152.15 0 0 1901.23 0 0 0 0 0 0.02 0 0 0 0 0 0 
0 0 0 0 0 0 0 0 0 0 0 0 0 0 0 0 0 -1874.22 0 0 0 0 0 0 0 0 0 0 0 0 0 0 0 0 0 0 0 1484.19 0 1099.05 0 0 0.07 0 0 0 0 1378.29 
0 0 0 0 -562.532 0 0 0 0 0 0 0 0 1341.98 0 0 0 0 0 0 0 0 0 0 0 0 1515.17 0 0 0 0 0 0 0 0 0 0 0 0 0 0 0 0 0.02 0 0 0 0 
0 0 0 0 0 0 0 0 0 0 0 0 0 0 0 0 0 0 828.349 0 0 0 0 0 1647.47 0 0 0 0 0 -434.355 0 0 0 0 0 0 0 0 0 -547.273 0 0 0 0.04 0 0 0 
0 0 0 0 -1325.34 0 0 0 0 0 0 -1860.79 0 831.248 0 0 0 0 -1276.36 0 0 0 0 0 958.815 2359.61 0 0 0 0 0 0 0 24.4911 0 0 0 0 0 0 0 0 0 0 0 0.04 0 0 
0 0 0 0 0 0 1690.5 0 0 0 1687.75 0 0 0 0 0 0 0 0 -489.746 1730.63 0 0 0 0 0 0 0 0 0 743.812 0 0 0 0 0 0 0 0 0 0 0 0 0 0 0 0.06 0 
-742.592 0 -6.18 0 0 0 0 1091.27 0 0 0 0 0 0 0 0 0 0 0 0 0 0 0 0 -543.458 0 0 0 0 0 0 0 0 0 0 0 0 0 0 1869.18 0 0 345.393 0 0 0 0 0.01 
