*Vertices 51
*Matrix 
0.05 0 0 1156.27 -1431.85 0 1568.58 1739.63 0 0 0 0 0 0 0 0 0 0 0 0 0 0 0 0 0 0 0 1071.43 0 0 0 0 0 0 0 0 0 0 0 0 -2055.5 -1631.14 -59.74 0 424.131 0 0 0 0 0 0 
0 0.06 0 0 0 0 0 0 0 0 0 0 0 0 0 0 0 0 0 0 0 0 0 1838.66 -844.829 0 0 0 0 0 0 0 799.509 0 0 0 0 0 0 0 0 0 0 0 0 -848.796 2040.39 0 0 0 0 
0 0 0.02 0 0 0 0 2045.58 2171.47 0 0 0 0 -1514.1 0 0 0 0 0 0 0 0 0 0 0 0 0 0 0 0 0 0 0 0 0 0 0 0 390.408 0 -2058.09 0 993.606 0 0 0 0 0 0 0 0 
-1451.69 0 0 0 0 0 0 0 0 0 -350.124 -1507.23 0 0 0 0 0 0 0 0 0 0 0 0 0 0 0 0 0 0 0 0 -196.615 0 0 2469.63 0 1518.83 1563.69 2088.76 -810.953 0 0 0 0 0 0 650.121 0 0 0 
-35.4778 0 0 0 0.01 0 0 0 0 0 0 740.913 0 0 2161.55 0 0 0 0 0 0 0 0 0 0 0 0 0 0 0 0 0 0 991.012 0 0 0 0 0 -811.411 -1875.44 0 0 1477.17 0 0 0 0 -326.014 0 0 
0 0 0 0 0 0.06 0 0 0 0 0 0 1696.14 0 0 0 0 2446.75 0 -1123.62 0 0 0 0 0 0 0 0 0 2407.99 0 -84.7652 0 0 0 0 0 0 0 0 0 0 0 0 0 0 0 0 622.196 0 0 
502.258 0 0 0 0 0 0.06 0 0 0 0 0 -1387.91 0 630.436 0 0 1343.04 1692.63 -1730.63 0 0 0 0 1954.33 1951.58 0 0 0 0 0 0 0 0 0 -1343.96 0 440.611 0 0 0 0 0 0 0 0 0 0 0 0 0 
1713.23 0 -2121.72 0 0 0 0 0.03 0 0 0 0 0 0 0 -815.378 2264.55 0 0 0 0 0 0 0 0 0 0 311.212 0 0 0 1710.03 2400.2 0 0 0 0 0 1737.04 0 0 0 0 0 0 -1655.86 0 0 904.645 1686.99 0 
0 0 1650.67 0 0 0 0 0 0.08 0 0 0 0 0 -515.229 0 402.768 0 -1935.87 0 0 0 0 0 -854.747 0 0 0 0 0 0 0 -677.74 775.246 0 2270.96 0 0 0 0 0 0 0 0 0 405.21 0 0 0 0 0 
0 0 0 0 0 0 0 0 0 0.05 0 0 0 0 0 0 0 0 2271.26 0 0 0 0 0 0 0 0 0 0 0 0 0 0 0 0 0 0 0 0 0 0 0 0 0 0 0 0 0 0 0 0 
0 0 0 1707.89 0 0 0 0 0 0 0.02 0 0 0 0 0 0 0 0 0 0 0 0 0 1588.11 0 0 -509.43 0 0 0 0 0 0 0 0 0 0 692.083 2263.94 0 0 0 2066.79 0 1060.75 0 0 1369.44 0 0 
0 0 0 -1208.76 -140.919 0 0 0 0 0 0 0 0 0 0 0 0 0 0 0 0 0 -683.233 0 955.763 -842.845 0 0 0 0 0 0 0 0 0 0 0 0 2076.25 0 0 0 0 0 0 0 0 1765.88 0 0 0 
0 0 0 0 0 2335.51 1919.84 0 0 0 0 0 0.08 0 -420.621 0 0 0 0 1657.23 0 0 0 0 0 0 0 0 1046.71 0 0 0 0 -842.54 0 0 0 0 0 0 0 0 0 0 0 0 246.666 0 0 0 0 
0 0 -782.113 0 0 0 0 0 0 0 0 0 0 0.07 0 0 0 0 0 0 1311.61 0 0 1318.02 0 224.082 0 0 0 0 0 0 0 0 0 -1622.9 0 0 0 0 0 0 0 0 2105.55 1800.82 0 0 0 0 0 
0 0 0 0 682.623 0 1679.36 0 1965.62 0 0 0 277.795 0 0 0 0 0 0 0 0 0 0 0 1059.68 0 0 0 0 0 0 0 0 24.1859 0 0 0 0 0 0 0 0 0 0 0 0 0 0 0 0 0 
0 0 0 0 0 0 0 -345.851 0 0 0 0 0 0 0 0.03 1284.14 335.322 0 0 0 0 0 0 0 0 0 0 0 0 0 1450.16 0 0 2238.3 0 0 0 0 -792.947 1016.19 -82.1711 -103.534 0 0 0 0 0 0 0 0 
0 0 0 0 0 0 0 -1095.39 2320.4 0 0 0 0 0 0 294.427 0 0 0 0 0 0 -1660.89 0 536.592 0 0 0 0 0 0 745.949 -103.992 0 0 0 0 1264.15 0 0 0 0 0 0 0 0 0 -377.895 0 0 0 
0 0 0 0 0 -1737.34 2225.79 0 0 0 0 0 0 0 0 306.177 0 0 0 0 -521.332 0 0 0 0 0 0 0 2146.29 0 0 0 0 0 0 0 0 0 0 0 0 0 0 0 0 0 0 0 0 0 0 
0 0 0 0 0 0 699.103 0 -2305.9 1371.27 0 0 0 0 0 0 0 0 0.07 0 0 0 0 0 0 0 0 0 0 0 0 0 0 0 0 0 0 0 0 0 0 0 0 1145.44 0 0 -397.427 0 0 0 0 
0 0 0 0 0 1810.43 499.969 0 0 0 0 0 -1766.64 0 0 0 0 0 0 0.08 0 1483.43 0 0 0 0 -1315.27 0 0 0 0 0 0 0 0 0 0 0 0 291.375 0 0 0 0 0 0 1091.11 0 0 0 0 
0 0 0 0 0 0 0 0 0 0 0 0 0 429.167 0 0 0 2350 0 0 0 0 0 0 0 0 0 0 -468.535 0 0 0 0 0 0 0 0 2473.91 0 0 0 0 0 0 1518.07 0 2154.07 2397.61 0 0 0 
0 0 0 0 0 0 0 0 0 0 0 0 0 0 0 0 0 0 0 734.352 0 0.06 0 0 0 0 0 0 -104.755 0 0 0 0 0 0 0 0 0 2409.82 0 0 0 0 0 0 0 -2166.43 0 0 -692.999 0 
0 0 0 0 0 0 0 0 0 0 0 550.325 0 0 0 0 -834.452 0 0 0 0 0 0.06 0 0 1235.47 0 0 0 0 0 0 174.337 0 0 0 0 0 0 0 0 537.965 0 0 0 0 0 0 0 0 0 
0 -1695.68 0 0 0 0 0 0 0 0 0 0 0 539.338 0 0 0 0 0 0 0 0 0 0.09 0 0 0 1614.35 0 -139.088 648.137 -587.863 0 0 0 0 0 0 0 0 0 0 333.491 0 0 0 0 0 0 0 0 
0 1135.98 0 0 0 0 -1368.98 0 166.25 0 1258.96 953.322 0 0 -1795.48 0 -1503.88 0 0 0 0 0 0 0 0.07 0 0 0 0 0 0 0 0 0 0 0 0 0 0 0 0 0 0 0 0 0 0 2279.2 0 0 0 
0 0 0 0 0 0 2320.86 0 0 0 0 1062.73 0 -418.943 0 0 0 0 0 0 0 0 1942.27 0 0 0.09 0 0 556.124 232.017 0 -1753.67 0 0 0 0 0 0 0 0 0 0 0 -2359.92 0 0 0 0 806.68 0 0 
0 0 0 0 0 0 0 0 0 0 0 0 0 0 0 0 0 0 0 153.737 0 0 0 0 0 0 0.02 -698.035 2277.98 0 0 1816.39 0 0 1289.18 1488.46 0 0 0 0 0 2421.87 0 0 0 0 0 2015.06 837.199 0 0 
873.058 0 0 0 0 0 0 1227.53 0 0 -961.867 0 0 0 0 0 0 0 0 0 0 0 0 -320.215 0 0 2291.41 0.04 0 0 0 0 0 0 0 0 0 1860.18 -858.715 0 0 479.064 0 0 0 0 0 0 0 -900.677 0 
0 0 0 0 0 0 0 0 0 0 0 0 -2006.36 0 0 0 0 -2034.9 0 0 1296.96 -775.094 0 0 0 1351.44 2290.49 0 0.09 1175.19 0 0 -1577.73 0 0 1162.53 0 0 0 0 0 331.66 0 0 0 535.371 0 0 0 0 0 
0 0 0 0 0 2366.48 0 0 0 0 0 0 0 0 0 0 0 0 0 0 0 0 0 -1195.03 0 1185.42 0 0 256.89 0.09 0 0 0 0 -1735.36 0 0 0 0 0 0 0 0 0 0 0 2141.41 0 465.484 0 0 
0 0 0 0 0 0 0 0 0 0 0 0 0 0 0 0 0 0 0 0 0 0 0 391.629 0 0 0 0 0 0 0.03 0 0 0 0 0 0 0 0 -790.963 0 0 873.516 0 0 0 0 0 0 0 726.875 
0 0 0 0 0 -2368.16 0 1700.11 0 0 0 0 0 0 0 -1246.91 -35.4778 0 0 0 0 0 0 -810.953 0 2476.5 1924.88 0 0 0 0 0.06 -1776.1 0 0 0 0 0 0 0 0 0 0 0 971.023 0 0 0 0 0 0 
0 766.396 0 2166.28 0 0 0 -455.565 2225.18 0 0 0 0 0 0 0 1547.82 0 0 0 0 0 -1594.06 0 0 0 0 0 -491.424 0 0 -71.4896 0.06 0 389.798 0 0 0 0 0 0 0 0 0 0 0 0 0 0 0 0 
0 0 0 0 1453.06 0 0 0 -2131.95 0 0 0 109.333 0 1581.39 0 0 0 0 0 0 0 0 0 0 0 0 0 0 0 0 0 0 0.05 0 0 0 1169.39 0 0 0 0 0 0 0 0 0 0 0 0 0 
0 0 0 0 0 0 0 0 0 0 0 0 0 0 0 2122.94 0 0 0 0 0 0 0 0 0 0 -2353.66 0 0 1243.4 0 0 -322.352 0 0 0 0 0 0 0 0 0 0 2166.28 0 0 0 1786.78 0 0 0 
0 0 0 -2060.53 0 0 1636.78 0 1236.84 0 0 0 0 -2468.72 0 0 0 0 0 0 0 0 0 0 0 0 -112.842 0 2426.45 0 0 0 0 0 0 0 -476.623 0 0 0 0 0 0 0 0 0 0 2031.08 0 0 0 
0 0 0 0 0 0 0 0 0 0 0 0 0 0 0 0 0 0 0 0 0 0 0 0 0 0 0 0 0 0 0 0 0 0 0 162.74 0 0 0 0 0 0 0 1837.9 0 0 0 0 0 0 0 
0 0 0 2433.32 0 0 2084.64 0 0 0 0 0 0 0 0 0 99.8718 0 0 0 -579.928 0 0 0 0 0 0 524.232 0 0 0 0 0 -2027.88 0 0 0 0 0 0 1634.5 -573.367 0 0 0 0 0 0 0 0 779.061 
0 0 1702.4 483.947 0 0 0 267.724 0 0 1970.5 381.863 0 0 0 0 0 0 0 0 0 -2338.56 0 0 0 0 0 1148.95 0 0 0 0 0 0 0 0 0 0 0.07 0 123.066 0 0 -1914.5 0 0 0 0 0 0 0 
0 0 0 1967.3 2059.01 0 0 0 0 0 386.441 0 0 0 0 925.855 0 0 0 -486.541 0 0 0 0 0 0 0 0 0 0 1293.3 0 0 0 0 0 0 0 0 0.06 0 0 0 0 0 0 0 0 -683.996 0 458.007 
250.786 0 -277.642 1867.96 -1844.16 0 0 0 0 0 0 0 0 0 0 1862.62 0 0 0 0 0 0 0 0 0 0 0 0 0 0 0 0 0 0 0 0 0 2471.16 20.0659 0 0.08 0 0 0 0 0 0 0 -1550.11 0 0 
-762.123 0 0 0 0 0 0 0 0 0 0 0 0 0 0 1628.7 0 0 0 0 0 0 -2127.67 0 0 0 2082.35 1709.11 2000.87 0 0 0 0 0 0 0 0 960.494 0 0 0 0.04 0 0 0 0 0 -1176.56 0 0 0 
-939.589 0 2483.98 0 0 0 0 0 0 0 0 0 0 0 0 57.2985 0 0 0 0 0 0 0 2471.47 0 0 0 0 0 0 -2208.4 0 0 0 0 0 0 0 0 0 0 0 0.05 0 0 0 2002.4 0 0 0 0 
0 0 0 0 1313.14 0 0 0 0 0 -1849.19 0 0 0 0 0 0 0 -446.409 0 0 0 0 0 0 -1537.75 0 0 0 0 0 0 0 0 990.707 0 181.204 0 1975.39 0 0 0 0 0.04 0 0 0 0 0 0 0 
2218.01 0 0 0 0 0 0 0 0 0 0 0 0 -1101.34 0 0 0 0 0 0 -1425.29 0 0 0 0 0 0 0 0 0 0 439.695 0 0 0 0 0 0 0 0 0 0 0 0 0.07 0 0 1262.02 0 0 0 
0 2433.47 0 0 0 0 0 1371.12 -1940.75 0 2131.95 0 0 1740.85 0 0 0 0 0 0 0 0 0 0 0 0 0 0 1959.52 0 0 0 0 0 0 0 0 0 0 0 0 0 0 0 0 0.08 0 1760.54 -1372.04 0 0 
0 -2360.68 0 0 0 0 0 0 0 0 0 0 1780.53 0 0 0 0 0 -2097.16 1.29704 2145.22 2407.99 0 0 0 0 0 0 0 914.869 0 0 0 0 0 0 0 0 0 0 0 0 2085.25 0 0 0 0.09 0 2063.43 0 422.147 
0 0 0 1588.87 0 0 0 0 0 0 0 1316.49 0 0 0 0 -446.867 0 0 0 -2390.59 0 0 0 -1921.52 0 1474.43 0 0 0 0 0 0 0 785.775 -878.857 0 0 0 0 0 1750.47 0 0 695.898 -1102.56 0 0.01 0 0 -720.161 
0 0 0 0 -1204.34 2292.78 0 408.414 0 0 2232.51 0 0 0 0 0 0 0 0 0 0 0 0 0 0 656.072 -1033.28 0 0 1303.98 0 0 0 0 0 0 0 0 0 2154.07 -41.4289 0 0 0 0 968.123 727.79 0 0.08 0 0 
0 0 0 0 0 0 0 861.919 0 0 0 0 0 0 0 0 0 0 0 0 0 1461 0 0 0 0 0 233.085 0 0 0 0 0 0 0 0 0 0 0 0 0 0 0 0 0 0 0 0 0 0.01 0 
0 0 0 0 0 0 0 0 0 0 0 0 0 0 0 0 0 0 0 0 0 0 0 0 0 0 0 0 0 0 -2288.66 0 0 0 0 0 0 -629.673 0 1019.09 0 0 0 0 0 0 2196.34 627.232 0 0 0.03 
