*Vertices 53
*Matrix 
0.08 717.261 0 -1022.29 1951.73 0 0 0 0 696.203 0 1236.53 0 767.312 0 0 0 0 2389.52 0 0 0 0 -88.8852 0 0 0 0 0 0 0 0 0 0 0 0 0 0 0 0 -596.103 0 0 0 0 0 0 0 0 0 0 1742.23 0 
1516.39 0.04 0 0 0 0 0 -325.251 633.641 0 0 1807.84 0 -22.2022 0 0 1173.97 -2272.48 0 1594.36 0 0 0 1393.25 0 0 0 0 0 0 0 0 0 0 -2293.54 0 0 0 0 0 0 0 0 0 -1005.97 0 0 0 0 0 0 0 0 
0 0 0.07 1423.92 0 -2262.87 0 0 0 2158.65 0 0 0 0 0 0 -1197.78 0 1600.92 2419.13 0 0 0 0 0 0 0 0 0 0 0 0 0 0 0 0 0 0 0 0 0 0 0 0 0 0 0 0 0 -1339.84 0 0 0 
2405.24 0 -686.743 0.01 0 1217 0 0 0 -1104.85 0 1738.11 1107.14 0 0 0 0 0 2156.36 -312.433 1213.34 0 0 0 0 0 0 0 0 171.438 2375.94 1282.62 0 0 0 0 0 0 0 0 0 0 -2100.36 0 -1158.25 0 0 905.103 175.71 0 0 0 0 
1403.47 0 0 0 0.03 -458.77 232.627 0 462.127 589.084 0 0 0 1001.39 0 1093.55 2032.15 0 -1770.3 -78.0511 0 0 800.729 0 0 0 0 -1375.09 0 0 0 2001.02 1630.07 0 0 0 0 0 0 0 0 0 0 0 0 0 0 0 0 790.811 -1609.78 1254.84 0 
0 0 -1434.14 2239.98 1338.31 0.07 506.531 0 1548.89 -720.161 0 0 0 111.774 0 2048.02 -205.924 1260.49 1276.51 0 0 0 2274.47 2153.92 0 0 0 0 0 0 0 0 0 0 0 0 0 0 0 0 0 0 0 0 0 0 0 0 0 0 0 0 0 
0 0 0 0 299.463 44.3281 0.05 2201.83 2368.16 2302.55 0 0 0 0 0 0 0 2450.87 2024.98 0 -2396.08 0 481.964 1312.37 0 0 0 0 -183.493 0 0 0 0 0 0 0 0 0 0 -1990.49 0 0 0 0 0 0 0 0 0 0 0 0 -2391.51 
0 1295.74 0 0 0 0 1253.78 0.04 0 0 2281.95 0 -739.235 0 -299.768 1928.24 -109.485 0 1842.94 -930.738 -2352.6 0 -828.349 0 0 0 0 0 0 0 0 0 0 0 0 0 0 0 0 0 0 0 -227.134 0 0 0 0 0 0 0 0 0 0 
0 262.688 0 0 1730.63 -98.1933 92.8526 0 0.01 -1071.28 0 834.758 1972.64 0 716.041 196.463 0 804.697 0 -576.724 0 0 1630.53 0 0 -33.3415 1357.39 0 0 0 0 0 0 0 0 0 44.9385 0 0 0 0 0 0 0 0 -1605.5 0 2371.82 0 0 0 0 0 
-939.741 0 1795.33 1804.33 -795.541 743.355 2007.74 0 955.306 0.05 0 0 0 0 0 -1527.22 0 0 0 0 0 0 0 0 0 0 0 0 0 0 0 0 593.966 0 0 0 0 0 0 0 0 0 0 0 0 0 0 0 0 0 0 0 0 
0 0 0 0 0 0 0 158.315 0 0 0.04 0 519.654 0 0 2139.27 1459.01 -473.876 0 1573.31 0 0 0 0 0 0 0 0 0 2029.71 0 21.1341 0 0 0 0 0 0 0 0 -407.651 0 0 0 0 0 1173.36 -1560.49 0 0 0 529.878 1394.92 
1124.07 1289.33 0 -268.181 0 0 0 0 998.642 0 0 0.05 -1674.02 0 0 0 2094.56 0 0 0 0 -975.753 0 0 0 0 120.014 0 0 0 0 0 0 0 1766.64 -1271.32 0 286.645 917.92 1952.96 0 0 0 -454.344 0 0 -170.217 0 0 0 0 0 0 
0 0 0 -585.116 0 0 0 1960.74 -1228.9 0 1970.5 -1127.58 0.06 0 1820.81 0 0 0 0 0 0 0 0 0 0 0 0 0 0 0 0 1859.42 0 0 980.178 0 0 0 -1516.24 0 0 0 0 0 0 1938.92 0 0 0 874.584 -1168.32 0 0 
-994.064 843.76 0 0 941.115 1135.36 0 0 0 0 0 0 0 0.01 0 0 0 0 0 0 0 0 0 0 -357.753 0 0 0 0 0 0 0 0 0 0 0 1547.82 0 0 0 101.245 0 0 0 0 0 0 0 0 0 0 0 0 
0 0 0 0 0 0 0 -1031.6 2284.69 0 0 0 1110.19 0 0.09 0 806.833 0 0 -1221.58 -49.0585 0 0 0 0 0 0 0 0 0 0 0 0 0 1385.31 1380.43 0 0 0 0 0 0 0 0 0 0 0 0 199.973 0 0 0 0 
0 0 0 0 1901.99 -1720.1 0 2416.84 2164.3 2354.43 357.601 0 0 0 0 0 2424.77 419.095 0 0 -336.695 -1289.64 2237.08 1.44963 -1191.37 0 0 0 0 0 -540.559 0 -1123.31 0 0 0 0 0 0 0 0 -1646.24 0 0 0 0 0 0 0 0 0 0 0 
0 -879.315 -247.734 0 175.405 -378.048 0 1320 0 0 -655.919 2032 0 0 -905.866 2195.12 0.07 1048.54 0 0 0 0 0 203.94 0 0 1612.37 0 0 0 0 0 0 1484.04 -71.337 0 0 0 0 0 0 0 0 0 1974.32 751.289 0 0 0 0 689.795 0 0 
0 405.972 0 0 0 -2195.88 -1456.88 0 197.531 0 1350.83 0 0 0 0 -77.7459 -524.689 0.08 0 2186.12 109.943 0 0 0 197.378 0 0 0 1710.94 -1098.28 0 0 0 0 0 0 0 1382.56 0 0 0 0 0 0 0 417.112 0 0 0 0 0 0 0 
-571.383 0 2227.47 1159.63 1769.08 836.741 861.156 -2157.73 0 0 0 0 0 0 0 0 0 0 0.03 2055.65 0 0 0 0 0 -2260.89 0 0 0 0 900.983 0 0 0 0 0 0 0 0 0 0 0 0 0 0 0 0 0 0 0 0 0 0 
0 681.402 -975.448 -1727.88 1953.57 0 0 -1139.33 1793.04 0 2289.57 0 0 0 -517.67 0 0 1952.19 1244.47 0.05 2261.96 1954.79 0 0 0 0 0 0 0 0 -476.928 0 -1416.9 0 0 0 2115.31 0 0 0 0 0 -1670.81 -2044.82 0 0 0 0 0 0 0 0 0 
0 0 0 345.241 0 0 237.358 1120.26 0 0 0 0 0 0 -1144.52 1031.14 0 -486.236 0 -105.976 0.05 0 0 0 0 0 0 0 0 0 0 0 0 0 0 1290.7 0 0 0 0 0 0 0 0 611.209 0 0 0 233.238 0 0 2270.5 0 
0 0 0 0 0 0 0 0 0 0 0 1452.45 0 0 0 -887.555 0 0 0 -688.726 0 0.09 1114.46 0 0 0 0 0 0 0 0 0 0 0 0 0 717.109 0 0 0 0 454.955 0 0 0 0 0 0 0 0 0 0 0 
0 0 0 0 -332.118 1842.48 -2234.64 2171.47 2119.43 0 0 0 0 0 0 887.707 0 0 0 0 0 1729.87 0.07 0 0 0 0 0 0 0 0 0 0 0 0 0 0 -35.6304 0 0 0 0 0 0 0 0 0 0 0 0 0 1836.83 0 
2421.11 -2410.43 0 0 0 1705.91 1330.23 0 0 0 0 0 0 0 0 -761.055 1654.79 0 0 0 0 0 0 0 0 -390.255 0 0 0 0 0 0 1630.22 0 0 0 0 0 -135.121 0 279.778 0 0 0 0 0 0 0 0 0 0 0 0 
0 0 0 0 0 0 0 0 0 0 0 0 0 956.221 0 1545.84 0 2141.71 0 0 0 0 0 0 0 0 0 0 0 0 0 353.328 0 0 0 0 0 0 0 0 0 0 0 0 -1635.26 0 0 0 0 0 0 0 0 
0 0 0 0 0 0 0 0 -895.184 0 0 0 0 0 0 0 0 0 2496.03 0 0 0 0 2353.36 0 0.02 0 0 0 0 0 0 0 0 0 0 0 -240.715 0 0 0 0 1902.91 0 -1831.95 0 0 0 0 0 0 0 0 
0 0 0 0 0 0 0 0 -306.482 0 0 474.029 0 0 0 0 2413.33 0 0 0 0 0 0 0 0 0 0.05 0 -133.29 0 0 0 0 0 0 0 0 0 0 0 0 868.633 0 1083.03 0 0 0 0 0 0 0 1503.72 0 
0 0 0 0 1739.94 0 0 0 0 0 0 0 0 0 0 0 0 0 0 0 0 0 0 0 0 0 0 0.07 0 0 1931.75 0 0 0 0 0 0 0 0 0 0 0 0 0 0 1497.16 0 0 0 0 0 0 0 
0 0 0 0 0 0 1682.56 0 0 0 0 0 0 0 0 0 0 983.383 0 0 0 0 0 0 0 0 1110.8 0 0.05 0 0 0 0 0 0 0 0 0 0 1443.6 0 -1657.54 0 0 0 0 0 0 0 0 0 0 2098.07 
0 0 0 2440.18 0 0 0 0 0 0 1922.44 0 0 0 0 0 0 416.501 0 0 0 0 0 0 0 0 0 0 0 0 0 0 0 0 0 0 0 0 0 0 0 0 0 2010.79 0 0 -449.309 0 -2121.57 0 0 0 0 
0 0 0 1904.58 0 0 0 0 0 0 0 0 0 0 0 1192.13 0 0 2450.25 1257.44 0 0 0 0 0 0 0 -844.981 0 0 0.01 0 -568.178 0 -625.706 0 0 0 0 0 0 0 0 0 0 0 1115.83 0 0 0 338.374 0 436.186 
0 0 0 -822.092 1697.21 0 0 0 0 0 -474.792 0 -1974.17 0 0 0 0 0 0 0 0 0 0 0 2441.71 0 0 0 0 0 0 0.02 0 0 0 0 2250.82 0 0 0 0 0 0 0 0 0 -647.679 0 33.0363 -385.983 0 0 0 
0 0 0 0 -759.529 0 0 0 0 720.466 0 0 0 0 0 1187.25 0 0 0 1057.39 0 0 0 1167.26 0 0 0 0 0 0 2050.61 0 0.02 2050.77 0 0 0 -500.122 0 0 0 -2360.23 0 -371.029 0 0 0 0 0 0 0 0 0 
0 0 0 0 0 0 0 0 0 0 0 0 0 0 0 0 -593.509 0 0 0 0 0 0 0 0 0 0 0 0 0 0 0 -82.1711 0 0 0 2253.72 0 0 0 0 0 0 0 0 1131.7 0 0 -666.753 -1888.26 0 0 0 
0 -1655.55 0 0 0 0 0 0 0 0 0 1630.53 2411.8 0 928.602 0 -754.036 0 0 0 0 0 0 0 0 0 0 0 0 0 -559.328 0 0 0 0 0 0 0 0 0 0 0 0 -1166.19 0 0 0 0 0 0 0 0 2210.68 
0 0 0 0 0 0 0 0 0 0 0 846.66 0 0 2172.99 0 0 0 0 0 -328.913 0 0 0 0 0 0 0 0 0 0 0 0 0 0 0 0 0 0 0 0 0 0 0 0 324.03 0 0 0 0 0 0 2230.22 
0 0 0 0 0 0 0 0 2153.92 0 0 0 0 -1156.88 0 0 0 0 0 2480.16 0 723.67 0 0 0 0 0 0 0 0 0 147.328 0 2355.65 0 0 0.07 0 0 0 0 0 0 0 0 0 0 0 0 0 0 -55.3148 0 
0 0 0 0 0 0 0 0 0 0 0 -329.676 0 0 0 0 0 421.69 0 0 0 0 1537.45 0 0 -1082.26 0 0 0 0 0 0 2486.72 0 0 0 0 0.03 1308.86 0 0 0 0 0 0 0 0 0 0 0 0 0 2120.81 
0 0 0 0 0 0 0 0 0 0 0 2027.73 1172.29 0 0 0 0 0 0 0 0 0 0 -276.116 0 0 0 0 0 0 0 0 0 0 0 0 0 212.027 0.04 0 0 0 0 0 0 0 0 -1694.62 0 0 -987.198 0 0 
0 0 0 0 0 0 -360.195 0 0 0 0 -2448.73 0 0 0 0 0 0 0 0 0 0 0 0 0 0 0 0 2405.09 0 0 0 0 0 0 0 0 0 0 0.08 1174.28 0 0 0 0 0 0 0 0 0 0 -842.54 0 
-375.759 0 0 0 0 0 0 0 0 0 1510.28 0 0 -1497.77 0 0 0 0 0 0 0 0 0 2422.79 0 0 0 0 0 0 0 0 0 0 0 0 0 0 0 -1022.9 0.06 0 0 0 0 0 0 0 0 0 0 0 0 
0 0 0 0 0 0 0 0 0 0 0 0 0 0 0 756.935 0 0 0 0 0 2105.4 0 0 0 0 1453.67 0 593.814 0 0 0 1800.52 0 0 0 0 0 0 0 0 0.06 0 0 0 0 0 0 0 0 0 0 0 
0 0 0 128.101 0 0 0 281.915 0 0 0 0 0 0 0 0 0 0 0 1041.83 0 0 0 0 0 2194.36 0 0 0 0 0 0 0 0 0 0 0 0 0 0 0 0 0.09 0 0 0 0 0 0 -432.829 0 0 0 
0 0 0 0 0 0 0 0 0 0 0 1744.51 0 0 0 0 0 0 0 -161.977 0 0 0 0 0 0 1695.99 0 0 -610.599 0 0 -2277.21 0 763.192 0 0 0 0 0 0 0 0 0.08 0 0 1966.54 0 0 1856.52 169.912 0 0 
0 1884.59 0 2387.08 0 0 0 0 0 0 0 0 0 0 0 0 -1949.9 0 0 0 -1276.82 0 0 0 1786.94 -2069.54 0 0 0 0 0 0 0 0 0 0 0 0 0 0 0 0 0 0 0.02 0 0 0 0 0 2374.42 0 0 
0 0 0 0 0 0 0 0 -793.558 0 0 0 1034.65 0 0 0 917.31 19.9133 0 0 0 0 0 0 0 0 0 34.5622 0 0 0 0 0 -295.19 0 -388.424 0 0 0 0 0 0 0 0 0 0.09 0 0 0 0 0 0 0 
0 0 0 0 0 0 0 0 0 0 -2498.32 1838.05 0 0 0 0 0 0 0 0 0 0 0 0 0 0 0 0 0 1604.89 1292.54 -687.048 0 0 0 0 0 0 0 0 0 0 0 -244.835 0 0 0.07 0 0 0 0 0 0 
0 0 0 -818.278 0 0 0 0 -75.9148 0 82.4763 0 0 0 0 0 0 0 0 0 0 0 0 0 0 0 0 0 0 0 0 0 0 0 0 0 0 0 2187.19 0 0 0 0 0 0 0 0 0.01 0 1862.93 0 -1305.51 0 
0 0 0 -1091.27 0 0 0 0 0 0 0 0 0 0 -302.362 0 0 0 0 0 2126.61 0 0 0 0 0 0 0 0 2450.1 0 1509.22 0 -2290.19 0 0 0 0 0 0 0 0 0 0 0 0 0 0 0.04 0 240.867 0 0 
0 0 680.792 0 1916.94 0 0 0 0 0 0 0 -1787.7 0 0 0 0 0 0 0 0 0 0 0 0 0 0 0 0 0 0 1408.51 0 -338.069 0 0 0 0 0 0 0 0 1944.26 843.455 0 0 0 -543.306 0 0.04 0 0 0 
0 0 0 0 2105.55 0 0 0 0 0 0 0 -112.842 0 0 0 -1402.1 0 0 0 0 0 0 0 0 0 0 0 0 0 -359.584 0 0 0 0 0 0 0 1567.51 0 0 0 0 -1176.11 2077.93 0 0 0 568.331 0 0.03 0 0 
1883.37 0 0 0 -507.752 0 0 0 0 0 99.5666 0 0 0 0 0 0 0 0 0 -1199.61 0 1349.91 0 0 0 -1303.98 0 0 0 0 0 0 0 0 0 2179.56 0 0 2212.52 0 0 0 0 0 0 0 412.687 0 0 0 0.06 0 
0 0 0 0 0 0 1845.38 0 0 0 -1742.53 0 0 0 0 0 0 0 0 0 0 0 0 0 0 0 0 0 1357.08 0 1565.83 0 0 0 2186.12 -753.578 0 -2206.11 0 0 0 0 0 0 0 0 0 0 0 0 0 0 0.08 
