*Vertices 63
*Matrix 
0.01 0 0 0 -1144.83 -2186.42 230.338 0 384.457 0 0 0 0 0 0 0 0 0 0 0 0 0 0 2381.28 0 0 -647.221 0 0 0 0 0 -2229.3 0 0 0 0 0 0 982.467 0 2456.21 200.43 0 0 0 1632.97 312.433 0 0 0 0 1636.33 0 0 0 0 0 0 0 0 0 0 
0 0.02 0 -284.204 0 0 0 -2384.95 0 0 0 0 0 0 771.889 0 0 0 0 1522.03 0 1756.42 0 0 0 0 0 0 -1290.09 0 542.39 0 0 -876.873 -422.452 0 0 0 -959.578 0 0 2461.24 0 0 0 626.621 0 0 0 0 0 0 0 0 1606.42 0 0 0 0 0 0 0 0 
0 0 0.01 -97.2777 0 27.543 0 0 0 -2060.53 0 0 0 0 0 585.879 0 0 1341.21 0 -6.02741 0 0 1635.41 111.469 1103.02 0 493.866 0 0 0 0 2266.23 1215.17 0 679.113 0 0 0 0 0 0 0 0 0 1114.76 0 0 0 1745.73 0 0 0 0 -2224.88 0 0 0 0 0 0 375.454 0 
0 1181.6 1671.58 0.09 0 594.272 752.968 -1849.8 -468.078 1175.19 0 0 0 0 2004.23 0 0 -2287.29 -1183.28 0 0 0 1569.34 0 -1324.12 0 268.944 -1715.52 -1627.48 0 1962.26 0 0 0 0 0 0 0 0 1386.84 0 1632.21 0 0 0 1788.61 0 0 1035.87 0 0 0 -395.596 -73.9311 0 0 0 0 0 0 0 0 0 
-588.626 0 0 0 0.08 0 1419.8 0 0 0 0 0 1569.49 0 0 1829.51 0 0 0 695.135 1616.18 0 -317.316 0 0 0 0 0 -860.088 0 0 0 0 0 0 0 0 0 2351.68 0 -1509.52 0 0 0 0 0 0 0 0 0 0 0 0 0 0 0 0 0 0 0 0 1907.48 0 
1428.65 0 346.461 649.663 0 0.04 0 0 2242.58 772.195 2347.87 0 403.989 0 0 0 0 2217.25 0 0 1159.32 0 2454.99 0 0 0 0 -212.638 0 0 0 242.088 0 0 0 -202.567 0 0 0 0 659.734 0 0 0 0 0 0 0 0 0 0 0 0 0 0 0 0 0 0 0 0 0 0 
1019.85 0 0 1253.32 -862.529 0 0.06 -1087.76 0 0 0 0 0 609.531 2411.5 0 0 0 0 0 0 0 0 0 0 0 0 0 0 0 0 2350.61 0 0 0 642.491 -591.525 1651.74 0 0 0 0 1168.63 1545.84 323.267 0 0 0 0 0 0 0 0 0 0 0 -749.153 0 1924.57 0 843.15 -867.412 1970.96 
0 2447.81 0 -602.817 0 0 -2176.2 0.03 0 0 0 1660.13 -1195.64 0 0 0 0 0 1764.35 0 0 0 0 0 0 -908.155 0 0 1984.54 0 0 0 0 0 0 0 0 0 -1085.62 0 -1578.95 0 2348.32 0 0 0 0 0 0 0 0 394.375 0 0 -980.789 0 0 0 0 0 0 0 0 
2438.05 0 0 1073.87 0 1925.18 0 0 0.05 2010.03 0 0 0 0 1266.29 1896.5 0 0 -1912.37 0 0 735.878 365.841 0 0 0 1300.62 0 0 0 2272.79 0 0 -176.778 2047.41 0 0 829.264 0 0 -857.341 0 0 -1463.29 0 2111.96 0 0 0 0 0 0 0 0 108.264 0 0 0 0 0 0 0 0 
0 0 1517 -210.807 0 2186.88 0 0 230.644 0.04 0 0 -826.365 2189.02 0 0 0 0 0 0 0 320.368 -45.2437 0 0 0 0 0 0 0 -1146.96 0 -800.882 0 0 -1155.35 0 -1405.61 0 0 -328.761 0 0 0 0 0 0 0 2398.68 0 0 0 0 0 0 0 0 940.504 0 0 2082.35 0 0 
0 0 0 0 0 2082.51 0 0 0 0 0.04 0 0 0 0 0 0 0 0 0 2006.36 0 0 0 -2007.89 0 0 -2246.7 0 0 0 0 2122.18 1932.2 0 1444.82 0 0 0 0 0 0 0 0 488.067 0 0 0 0 0 0 0 0 0 0 0 0 0 2313.07 533.845 0 -179.525 0 
0 0 0 0 0 0 0 -1811.81 0 0 0 0.09 1723.15 0 201.651 0 1586.12 0 0 0 0 0 854.9 0 0 0 0 552.309 1571.02 0 0 0 0 0 -873.974 1004.44 0 2066.79 0 0 0 0 0 0 0 398.343 0 0 0 -1304.13 0 0 0 0 0 -1937.24 0 0 0 0 0 0 0 
0 0 0 0 -554.14 320.063 0 1301.39 0 -380.184 0 514.771 0.06 0 0 344.935 1224.17 0 0 1106.37 0 -2489.47 0 0 0 0 0 172.964 0 0 0 0 0 1993.55 0 0 0 0 0 0 0 0 2449.03 0 0 0 0 2234.49 -2023 0 0 0 0 -1347.01 0 -1703.62 0 0 0 0 0 0 0 
0 0 0 0 0 0 2135.46 0 0 -606.479 0 0 0 0.04 0 0 0 0 0 0 0 880.84 0 0 0 0 1761.3 0 0 0 0 0 0 0 0 0 1671.73 150.075 0 -1195.64 -634.098 0 0 0 0 0 0 0 0 0 0 0 0 0 0 0 0 0 -1945.94 0 0 0 2213.28 
0 594.577 0 2314.91 0 0 1620.61 0 782.571 0 0 16.5563 0 0 0.01 -837.504 1832.1 0 0 -596.866 0 0 0 0 0 0 0 -2233.42 2286.07 0 0 0 -1321.53 0 0 0 0 0 0 0 0 0 0 0 0 0 0 0 0 0 0 1053.27 0 0 0 0 0 0 0 0 -1535.92 0 0 
0 0 224.54 0 2182 0 0 0 1782.51 0 0 0 -809.732 0 1213.19 0.02 0 0 390.408 0 0 1806.62 0 0 98.9563 0 1928.54 892.285 0 0 0 -536.897 1681.04 0 2182.76 0 0 0 0 1464.51 0 0 0 0 0 0 0 0 0 0 0 0 74.8466 0 0 0 0 0 0 -2116.99 0 0 0 
0 0 0 0 0 0 0 0 0 0 0 -61.4185 2119.89 0 -1431.24 0 0.05 0 0 0 0 0 0 0 0 1242.64 0 0 0 0 0 0 0 847.423 0 -1793.19 0 -68.5903 0 0 0 2116.69 0 0 763.802 1989.73 0 0 0 1797.46 0 0 0 0 0 0 -1255.61 0 0 0 0 0 0 
0 0 0 2059.47 0 1948.68 0 0 0 0 0 0 0 0 0 0 0 0.09 0 0 0 0 0 0 -1536.99 398.038 0 0 0 21.2867 0 0 -324.793 0 0 0 454.344 0 2433.32 0 0 -1965.62 0 0 -868.633 0 0 0 0 0 0 0 0 0 0 0 0 0 0 0 0 0 0 
0 0 -245.598 1719.34 0 0 0 1992.93 2127.06 0 0 0 0 0 0 -1457.03 0 0 0.05 0 0 0 0 0 0 1833.32 0 0 0 0 0 0 -1212.88 0 1808.3 0 0 0 0 0 0 0 0 0 1644.26 0 0 0 0 0 -1264.92 0 0 0 0 0 0 0 0 0 0 0 0 
0 -1992.93 0 0 807.138 0 0 0 0 0 0 0 2458.95 0 948.897 0 0 0 0 0.07 0 870.006 0 0 2069.54 -2247.46 0 0 0 1901.99 0 -1042.89 0 2055.04 0 0 0 0 0 0 0 1213.49 -40.0555 0 0 0 0 0 0 0 0 0 0 0 0 0 363.857 0 0 0 0 0 155.11 
0 0 2295.68 0 468.078 -359.737 0 0 0 0 364.315 0 0 0 0 0 0 0 0 0 0.05 561.617 196.158 -2056.57 0 0 2341 0 -1259.73 0 0 0 -894.116 0 0 0 0 0 0 0 -279.321 0 0 0 0 0 0 0 0 0 0 0 0 977.889 0 0 0 0 0 0 0 -433.897 0 
0 1879.71 0 0 0 0 0 0 2030.32 2411.34 0 0 493.866 -2044.51 0 1787.7 0 0 0 2278.13 1847.67 0.04 190.359 0 0 0 0 0 0 0 0 0 0 0 224.998 0 0 -1080.28 -697.577 0 0 0 32.8837 0 0 0 0 0 0 0 0 0 0 0 0 -172.353 0 0 0 -106.128 923.109 0 0 
0 0 0 2066.79 -1923.66 -679.876 0 0 -2051.23 1994 0 1597.87 0 0 0 0 0 0 0 0 907.544 961.715 0.08 0 2450.71 0 0 0 0 0 365.688 0 0 0 0 0 0 259.484 0 0 0 1436.28 0 -2025.89 0 0 0 0 0 0 1091.42 0 0 0 0 0 0 0 0 0 0 0 0 
-158.315 0 1586.58 0 0 0 0 0 0 0 0 0 0 0 0 0 0 0 0 0 2433.16 0 0 0.04 0 1533.17 0 0 1162.37 0 0 0 0 0 0 0 2264.24 0 0 0 1522.34 0 0 0 0 0 0 -1891.61 0 528.809 0 881.146 0 0 -2433.01 0 0 1838.21 0 0 0 0 890.606 
0 0 1647.62 -2400.36 0 0 0 0 0 0 1992.48 0 0 0 0 1187.55 0 -1826.15 0 -2184.9 0 0 1528.9 0 0.07 0 0 1144.83 2380.67 2227.16 -1918.16 0 -466.247 265.435 0 0 0 0 0 -589.694 1916.33 0 0 0 0 0 0 0 0 0 0 0 0 0 0 0 0 0 0 0 0 0 0 
0 0 2393.34 0 0 0 0 343.41 0 0 0 0 0 0 0 0 -2081.59 -657.75 1135.98 1758.25 0 0 0 -2236.32 0 0.03 0 0 0 0 0 1712.32 0 -301.752 0 0 -1621.68 346.767 0 0 0 0 1964.09 0 0 0 0 0 0 0 0 0 0 0 2181.84 0 -506.226 0 0 0 0 0 0 
2183.98 0 0 1791.82 0 0 0 0 134.358 0 0 0 0 -574.129 0 2236.01 0 0 0 0 896.863 0 0 0 0 0 0.03 860.088 -59.5874 2157.89 -777.23 0 0 0 0 0 0 0 0 -1057.7 0 760.75 0 0 0 0 447.478 2363.43 0 0 0 0 0 0 0 -369.961 0 0 0 0 0 0 0 
0 0 1424.38 345.698 0 -2333.22 0 0 0 0 938.52 164.418 2082.05 0 1466.64 2386.47 0 0 0 0 0 0 0 0 -514.618 0 -1254.84 0 2111.65 0 0 0 0 406.278 1058.46 0 0 0 0 0 2084.34 -161.519 0 0 0 0 0 -265.587 0 0 0 0 0 0 0 0 0 0 0 0 0 0 0 
0 887.707 0 -2022.84 2357.94 0 0 -1409.88 0 0 0 1668.52 0 0 2045.58 0 0 0 0 0 -1620.91 0 0 -2500 1131.09 0 1284.75 1917.1 0.09 0 0 0 0 -1512.42 0 0 915.937 0 0 0 153.279 0 2243.19 0 0 0 0 -1924.73 -1578.95 0 918.073 0 0 0 -808.969 1906.72 0 0 23.2704 0 0 0 0 
0 0 0 0 0 0 0 0 0 0 0 0 0 0 0 0 0 -672.094 0 -1148.64 0 0 0 0 -1584.75 0 676.824 0 0 0.03 0 0 1182.82 0 0 0 1173.21 0 0 0 2109.21 0 1473.2 0 0 -1413.85 0 0 0 0 0 0 0 0 0 0 0 0 0 0 0 0 0 
0 -975.6 0 1485.41 0 0 0 0 215.537 -35.4778 0 0 0 0 0 0 0 0 0 0 0 0 782.876 0 460.448 0 1064.56 0 0 0 0.08 2246.24 0 0 0 0 0 0 0 0 0 0 0 1368.98 0 0 0 0 0 -151.296 0 0 0 0 0 0 0 0 1268.27 0 0 0 0 
0 0 0 0 0 1356.47 -217.673 0 0 0 0 0 0 0 0 2016.43 0 0 0 385.678 0 0 0 0 0 -95.1415 0 0 0 0 1743.9 0.08 0 0 -682.47 -14.1148 435.423 0 -221.946 715.43 0 1450.93 0 0 2398.83 0 0 0 0 2038.1 0 0 0 0 0 0 0 0 0 0 0 0 -1266.14 
-1239.59 0 219.047 0 0 0 0 0 0 -1688.67 2242.12 0 0 0 -224.998 2006.52 0 766.854 629.215 0 148.396 0 0 0 781.808 0 0 0 0 -617.771 0 0 0.01 0 2416.53 0 0 0 0 0 0 -157.247 0 0 0 0 0 0 0 0 0 0 0 0 0 0 0 0 0 0 0 0 0 
0 321.436 -1854.99 0 0 0 0 0 1998.73 0 519.196 0 2390.13 0 0 0 -2366.79 0 0 1342.74 0 0 0 0 1319.85 674.078 0 1631.75 1771.68 0 0 0 0 0.05 0 1912.82 2284.84 0 0 0 0 0 0 0 -1441.62 0 0 0 0 0 0 0 -50.2792 0 0 0 0 0 0 0 0 0 0 
0 2152.39 0 0 0 0 0 0 580.538 0 0 424.436 0 0 0 1716.44 0 0 1238.06 0 0 1862.93 0 0 0 0 0 2121.27 0 0 0 -1877.73 -1310.54 0 0.09 1019.85 0 682.165 0 0 0 0 0 0 0 922.803 1401.33 -1308.56 0 0 0 0 0 120.93 1273.16 -1421.32 -331.812 0 936.232 0 0 0 0 
0 0 404.599 0 0 845.897 -547.121 0 0 1658.15 -345.851 -1849.8 0 0 0 0 492.798 0 0 0 0 0 0 0 0 0 0 0 0 0 0 2385.4 0 679.571 -659.581 0.04 871.38 416.807 316.095 -386.288 1191.37 0 0 0 2310.17 0 0 0 0 0 2296.14 -1483.58 0 0 0 0 0 0 0 0 -2236.47 0 0 
0 0 0 0 0 0 2323.45 0 0 0 0 0 0 -154.195 0 0 0 -1974.17 0 0 0 0 0 1902.14 0 -97.2777 0 0 1911.3 1212.88 0 -1112.32 0 -344.935 0 909.375 0.02 0 45.5489 0 205.924 0 0 0 0 0 0 0 0 0 0 0 0 0 0 0 0 0 0 0 0 253.533 0 
0 0 0 0 0 0 -470.061 0 1357.08 -757.851 0 1620.15 0 399.258 0 0 2444.91 0 0 0 0 122.608 1179.16 0 0 -1195.49 0 0 0 0 0 0 0 0 2360.23 1941.66 0 0.01 0 0 0 0 0 0 0 0 0 0 0 -1502.35 0 0 0 0 0 0 983.383 0 0 0 0 0 -1085.92 
0 -1424.68 0 0 2016.28 0 0 1463.59 0 0 0 0 0 0 0 0 0 1287.5 0 0 0 169.454 0 0 0 0 0 0 0 0 0 -540.559 0 0 0 2041.76 -1350.37 0 0.03 1950.21 0 0 0 0 0 0 -2200.92 0 0 0 0 0 0 0 0 0 0 0 0 0 0 0 0 
535.371 0 0 1693.7 0 0 0 0 0 0 0 0 0 557.192 0 -1829.05 0 0 0 0 0 0 0 0 -1256.68 0 2115.77 0 0 0 0 -1214.87 0 0 0 2430.27 0 0 1687.44 0.02 -646.763 723.823 0 0 0 0 0 -91.937 0 0 0 0 0 0 0 2235.1 0 0 0 0 0 0 1962.42 
0 0 0 0 1664.25 -1643.65 0 -1799.75 2244.87 78.2037 0 0 0 -1666.54 0 0 0 0 0 0 2284.23 0 0 1822.34 2115.47 0 0 -1289.79 -140.614 -64.7755 0 0 0 0 0 -740.15 1948.23 0 0 -683.081 0 0 792.795 0 0 0 0 0 1794.41 0 0 0 0 0 0 0 0 0 0 0 0 0 0 
977.889 1267.05 0 -100.94 0 0 0 0 0 0 0 0 0 0 0 0 1546.3 1923.35 0 2332 0 0 -325.404 0 0 0 -820.566 162.74 0 0 0 -1882.92 -2043.44 0 0 0 0 0 0 1933.73 0 0.08 0 0 1498.99 0 -294.275 0 1126.06 0 0 0 -1643.5 0 0 0 0 0 0 0 0 0 0 
-1975.54 0 0 0 0 0 256.127 634.556 0 0 0 0 -192.343 0 0 0 0 0 0 740.455 0 -2063.59 0 0 0 1964.25 0 0 -2090.59 2328.49 0 0 0 0 0 0 0 0 0 0 2310.94 0 0 0 0 0 0 0 0 1798.84 -294.58 0 0 0 0 0 0 0 0 0 0 0 0 
0 0 0 0 0 0 1876.96 0 399.106 0 0 0 0 0 0 0 0 0 0 0 0 0 -848.643 0 0 0 0 0 0 0 833.537 0 0 0 0 0 0 0 0 0 0 0 0 0.03 0 0 0 0 0 0 0 0 0 0 0 0 0 0 0 0 0 0 0 
0 0 0 0 0 0 2474.36 0 0 0 -1352.35 0 0 0 0 0 2483.98 31.8155 2103.11 0 0 0 0 0 0 0 0 0 0 0 0 756.63 0 -1970.96 0 2333.67 0 0 0 0 0 -1310.08 0 0 0.06 0 1682.26 0 0 0 0 0 0 0 0 0 0 0 0 0 -1551.64 1372.65 0 
0 1069.75 -2241.51 623.264 0 0 0 0 625.248 0 0 1617.71 0 0 0 0 -1992.78 0 0 0 0 0 0 0 0 0 0 0 0 99.414 0 0 0 0 2478.79 0 0 0 0 0 0 0 0 0 0 0.09 0 0 0 0 0 0 0 0 0 0 0 0 0 0 0 -2391.35 0 
-1242.48 0 0 0 0 0 0 0 0 0 0 0 0 0 0 0 0 0 0 0 0 0 0 0 0 0 468.078 0 0 0 0 0 0 0 757.393 0 0 0 -203.33 0 0 2055.19 0 0 1398.43 0 0.02 0 0 0 65.0807 0 0 0 0 0 61.2659 0 -1834.09 0 0 0 0 
1216.85 0 0 0 0 0 0 0 0 0 0 0 -278.253 0 0 0 0 0 0 0 0 0 0 2076.71 0 0 -300.378 -1390.35 380.49 0 0 0 0 0 1873.3 0 0 0 0 750.984 0 0 0 0 0 0 0 0.06 -1647.31 0 0 0 0 0 0 0 0 0 0 -1995.22 0 0 0 
0 0 0 2343.44 0 0 0 0 0 1487.85 0 0 1278.04 0 0 0 0 0 0 0 0 0 0 0 0 0 0 0 -41.1237 0 0 0 0 0 0 0 0 0 0 0 -1492.13 1568.42 0 0 0 0 0 -430.845 0.01 0 0 0 0 0 0 0 0 0 0 0 0 0 0 
0 0 1172.9 0 0 0 0 0 0 0 0 675.451 0 0 0 0 1551.94 0 0 0 0 0 0 -2431.49 0 0 0 0 0 0 1149.86 -2212.67 0 0 0 0 0 304.956 0 0 0 0 910.596 0 0 0 0 0 0 0.03 0 0 0 1990.04 0 0 0 0 0 -1728.95 0 0 0 
0 0 0 0 0 0 0 0 0 0 0 0 0 0 0 0 0 0 2217.86 0 0 0 -708.106 0 0 0 0 0 -1330.68 0 0 0 0 0 0 1463.59 0 0 0 0 0 0 -1478.55 0 0 0 678.045 0 0 0 0.09 0 0 0 0 0 0 0 0 0 0 0 0 
0 0 0 0 0 0 0 1761.3 0 0 0 0 0 0 -2099.75 0 0 0 0 0 0 0 0 1776.41 0 0 0 0 0 0 0 0 0 0 0 2131.34 0 0 0 0 0 0 0 0 0 0 0 0 0 0 0 0.03 -284.814 0 0 0 0 2319.48 0 0 0 0 0 
1658.6 0 0 1663.03 0 0 0 0 0 0 0 0 0 0 0 2111.8 0 0 0 0 0 0 0 0 0 0 0 0 0 0 0 0 0 -1360.59 0 0 0 0 0 0 0 687.658 0 0 0 0 0 0 0 0 0 -1251.49 0.05 0 0 -1053.73 0 0 0 0 0 2449.95 0 
0 0 0 1421.17 0 0 0 0 0 0 0 0 2152.24 0 0 0 0 0 0 0 18.54 0 0 0 0 0 0 0 0 0 0 0 0 0 -2418.06 0 0 0 0 0 0 0 0 0 0 0 0 0 0 301.752 0 0 0 0 0 0 0 0 0 0 0 0 0 
0 1435.06 85.8333 0 0 0 0 -597.476 -1273.16 0 0 0 0 0 0 0 0 0 0 0 0 0 0 310.755 0 -825.755 0 0 2223.04 0 0 0 0 0 1673.1 0 0 0 0 0 0 0 0 0 0 0 0 0 0 0 0 0 0 0 0.02 0 -1020.92 0 0 0 0 -978.5 0 
0 0 0 0 0 0 0 0 0 0 0 1067.46 1583.53 0 0 0 0 0 0 0 0 1657.69 0 0 0 0 286.492 0 991.928 0 0 0 0 0 -2344.36 0 0 0 0 1748.33 0 0 0 0 0 0 0 0 0 0 0 0 -2195.43 0 0 0.04 0 0 0 0 0 0 0 
0 0 0 0 0 0 1130.02 0 0 0 0 0 0 0 0 0 2213.13 0 0 -1631.29 0 0 0 0 0 -446.104 0 0 0 0 0 0 0 0 857.494 0 0 2496.49 0 0 0 0 0 0 0 0 2271.87 0 0 0 0 0 0 0 328.303 0 0.09 0 0 0 0 0 2327.11 
0 0 0 0 0 0 0 0 0 2384.79 0 0 0 0 0 0 0 0 0 0 0 0 0 209.128 0 0 0 0 0 0 0 0 0 0 0 0 0 0 0 0 0 0 0 0 0 0 0 0 0 0 0 1179.16 0 0 0 0 0 0.04 0 0 0 0 0 
0 0 0 0 0 0 1028.55 0 0 0 1013.44 0 0 -1524.93 0 0 0 0 0 0 0 0 0 0 0 0 0 0 1952.65 0 -60.6555 0 0 0 -950.117 0 0 0 0 0 0 0 0 0 0 0 552.766 0 0 0 0 0 0 0 0 0 0 0 0.06 0 0 0 0 
0 0 0 0 0 0 0 0 0 0 781.045 0 0 0 0 1191.82 0 0 0 0 0 1412.17 0 0 0 0 0 0 0 0 0 0 0 0 0 0 0 0 0 0 0 0 0 0 0 0 0 -1047.01 0 -219.352 0 0 0 0 0 0 0 0 0 0.05 0 0 0 
0 0 0 0 0 0 -1687.29 0 0 2145.53 0 0 0 0 -404.294 0 0 0 0 0 0 821.482 0 0 0 0 0 0 0 0 0 0 0 0 0 2164.75 0 0 0 0 0 0 0 0 -428.098 0 0 0 0 0 0 0 0 0 0 0 0 0 0 0 0.02 0 0 
0 0 -1369.59 0 -925.245 0 2358.09 0 0 0 2215.26 0 0 0 0 0 0 0 0 0 435.728 0 0 0 0 0 0 0 0 0 0 0 0 0 0 0 -2115.62 0 0 0 0 0 0 0 2142.48 1579.1 0 0 0 0 0 0 1868.27 0 1301.54 0 0 0 0 0 0 0.08 0 
0 0 0 0 0 0 91.937 0 0 0 0 0 0 157.857 0 0 0 0 0 -559.938 0 0 0 84.46 0 0 0 0 0 0 0 1782.82 0 0 0 0 0 2409.67 0 -987.655 0 0 0 0 0 0 0 0 0 0 0 0 0 0 0 0 -2123.4 0 0 0 0 0 0.06 
