*Vertices 61
*Matrix 
0.01 1418.58 1725.14 2011.86 0 0 0 -294.275 547.273 0 0 0 0 0 0 736.03 904.797 0 0 -174.947 -166.707 0 0 0 0 0 -1395.08 0 0 0 1251.79 1792.43 0 0 0 0 0 0 -1491.97 0 471.587 661.412 0 0 -575.961 0 0 0 0 0 0 0 312.128 0 0 0 0 0 0 0 0 
268.792 0.07 673.009 786.996 0 0 0 0 2251.73 0 1243.55 0 2306.82 0 -1014.51 0 -2018.11 0 0 0 -943.709 0 0 0 0 0 0 61.1133 0 0 0 2099.14 -801.187 0 0 0 0 -1103.17 0 -1966.38 811.411 0 0 0 0 0 -1771.22 0 0 0 0 2445.52 0 0 0 0 0 0 0 0 0 
1422.24 -393.612 0.01 0 0 0 0 911.512 0 0 0 0 1536.99 -49.0585 0 1036.03 0 689.337 -539.033 0 0 -1259.27 0 0 0 0 0 -858.257 0 0 0 -825.144 0 0 -1502.96 0 2416.07 1009.48 0 1085.16 -46.3118 2136.98 0 724.128 0 1560.34 0 0 1512.57 0 0 -1755.2 0 0 0 1733.22 0 0 0 0 0 
2478.64 807.138 0 0.03 859.478 0 -1702.55 0 2283.78 0 1672.19 -18.6926 0 0 2055.96 0 1867.2 608.31 0 0 0 0 -995.438 -719.245 0 0 0 0 1271.63 0 0 1359.98 0 -764.107 0 0 0 0 400.784 0 0 0 0 0 0 0 0 978.347 0 0 -50.4318 0 0 0 0 0 0 0 0 0 0 
0 0 0 -432.218 0.06 0 2328.33 0 0 0 -834.147 195.09 0 0 0 0 -1101.95 0 0 0 -1433.38 0 0 2020.4 -926.771 1413.85 81.2555 0 0 0 0 0 1314.51 0 0 0 0 267.571 0 0 1738.72 0 -808.817 0 -1253.78 0 -662.328 0 0 0 0 0 0 0 0 -290.765 0 0 0 2465.36 -120.624 
0 0 0 0 0 0.07 0 0 0 0 1204.79 1877.12 0 0 1294.37 0 0 0 1681.95 1736.27 369.961 0 0 466.704 0 0 0 0 0 -515.534 -1197.78 0 0 0 0 0 0 0 0 764.412 0 -2454.37 -883.587 0 0 0 0 0 0 2217.25 0 0 0 0 0 0 0 0 0 0 0 
0 0 0 213.706 -1941.05 0 0.05 0 2097.46 -1366.54 0 0 2275.69 0 0 0 0 -970.565 502.258 -2217.25 0 0 0 0 0 1550.57 0 -1293.91 0 1711.86 0 0 0 0 0 0 0 0 0 0 0 0 1082.26 0 0 0 0 0 0 0 0 0 0 510.956 0 0 0 -1746.35 -688.116 0 1913.74 
-1970.5 0 2122.49 0 0 0 0 0.06 0 0 0 0 0 0 0 0 159.993 0 0 2216.64 0 0 0 0 0 0 -454.192 2131.18 0 0 0 0 0 0 -977.584 -198.599 0 0 0 0 0 0 0 1970.66 2146.29 2004.07 0 0 -1075.4 2355.04 1002.91 0 -1560.18 0 0 0 0 0 -121.387 0 0 
975.448 -950.27 0 2040.7 0 0 -2235.25 0 0.08 0 0 -833.079 945.235 0 0 0 0 0 0 0 0 0 0 0 0 0 0 0 0 0 489.746 0 0 0 0 1933.12 0 0 0 0 582.369 0 0 -1817.45 -276.421 1826.46 0 0 692.389 0 349.818 0 2120.2 452.666 0 0 0 0 0 -1273.77 0 
0 0 0 0 0 0 869.549 0 0 0.03 0 852.763 0 0 0 0 0 0 0 0 0 1676 0 0 0 0 0 0 0 0 0 0 0 0 0 0 0 0 0 0 0 0 -94.2259 0 0 188.223 0 1358.91 0 0 0 889.691 0 0 837.962 0 0 0 0 -984.451 0 
0 -2276.76 0 1122.85 2168.26 -1557.13 0 0 0 0 0.05 0 0 1625.49 0 0 0 0 0 0 0 0 0 1070.51 1769.23 0 0 0 0 0 0 926.16 0 0 0 1177.02 0 -1764.96 0 0 0 22.9652 0 0 0 -62.6392 0 0 604.343 -268.792 0 -2025.89 0 0 0 0 0 0 0 0 0 
0 0 0 577.334 -5.41704 1328.24 0 0 1275.29 176.626 0 0.06 0 0 0 -1295.13 0 0 1762.83 0 0 0 0 0 0 0 0 0 0 1605.35 0 0 0 0 0 1857.74 -2208.55 1118.43 0 0 0 0 0 358.821 0 0 1815.93 1794.72 0 0 0 0 0 -1891.61 0 0 0 0 0 -1282.01 0 
0 2174.52 -1784.65 0 0 0 1092.03 0 1911.15 0 0 0 0.04 0 0 0 0 0 0 444.884 0 2380.67 -2463.84 0 0 1834.54 0 0 0 531.861 0 0 1129.57 727.485 0 0 -1102.4 0 0 0 0 0 0 0 0 0 0 0 0 0 0 0 0 1289.94 -1190.91 0 0 0 0 -1721.32 0 
0 0 419.401 0 0 0 0 0 0 0 744.728 0 0 0.01 0 35.783 0 0 0 0 -983.383 -274.285 0 0 0 0 0 0 0 0 0 673.62 0 380.947 0 0 0 0 0 0 0 0 0 446.104 0 0 1975.54 1787.55 0 0 0 0 0 2067.4 0 -2260.58 0 0 -285.119 0 0 
0 -151.753 0 2121.42 0 -569.704 0 0 0 0 0 0 0 0 0.02 0 777.993 -2288.35 0 0 587.252 0 0 0 -1476.87 -369.655 0 1193.2 0 0 0 1950.51 0 0 -2126.76 0 0 1916.18 0 709.021 0 0 0 1197.32 0 -1049.61 0 0 0 0 0 0 -846.66 0 0 0 0 0 0 0 0 
-438.322 0 -1169.55 0 0 0 0 0 0 0 0 1440.4 0 -960.494 0 0.06 0 0 0 1543.4 1157.19 0 1232.87 0 0 0 0 441.984 221.183 0 0 0 0 0 0 -635.777 0 0 0 2163.99 0 0 0 0 452.513 0 0 2028.64 1623.2 0 0 0 0 0 0 0 0 0 0 0 0 
1684.7 -588.473 0 1481.44 154.5 0 0 2368.01 0 0 0 0 0 0 324.641 0 0.07 0 822.245 0 0 0 0 0 0 0 -33.6467 0 0 0 0 0 0 1821.73 0 0 0 0 0 0 0 0 0 0 0 0 0 -1472.59 0 0 0 447.478 0 -1802.19 0 0 0 747.475 0 0 -1791.82 
0 0 -1384.85 -979.72 0 0 -2252.49 0 0 0 0 0 0 0 1693.85 0 0 0.05 2375.94 0 0 0 0 0 0 -328.761 0 0 0 0 2272.03 0 0 0 0 717.719 985.672 0 0 0 0 0 0 0 0 0 0 -1702.25 0 0 1261.56 0 0 0 0 0 0 0 0 0 0 
0 0 2054.73 0 0 1387.91 1685.16 0 0 0 0 2464.75 0 0 0 0 2389.52 979.415 0.05 0 -1210.29 0 660.344 0 0 -2264.85 2416.23 -1398.89 0 0 0 0 0 -2272.94 0 0 2112.72 0 0 0 -492.492 425.047 0 0 0 0 0 0 -1852.24 0 0 0 0 0 0 0 0 425.657 0 0 0 
215.537 0 0 0 0 -726.264 -120.319 -2499.85 0 0 0 0 2094.87 0 0 -761.666 0 0 0 0.09 0 0 0 -74.5415 0 0 1693.24 0 0 0 0 0 0 926.313 96.2096 0 0 702.612 0 1693.7 0 0 0 0 0 0 0 0 0 0 0 0 0 0 0 0 -528.809 0 0 0 0 
-911.817 -202.567 0 0 -18.0822 -2049.09 0 0 0 0 0 0 0 1793.34 -1330.07 1849.8 0 0 946.608 0 0 0 0 1008.1 1463.74 302.667 0 1599.55 0 0 0 667.516 -443.205 -719.398 361.263 -1384.24 0 0 -1875.9 0 0 1785.26 0 0 1887.34 -761.513 0 0 -2115.31 0 0 0 -840.251 0 1905.04 0 0 0 0 0 0 
0 0 546.663 0 0 0 0 0 0 -2308.19 0 0 1741.92 1548.43 0 0 0 0 0 0 0 0.07 0 0 0 0 1190.76 0 0 0 0 0 0 0 0 2150.41 0 0 0 914.106 0 0 0 0 0 631.504 0 0 0 0 0 0 0 1417.2 0 1044.88 0 0 0 0 0 
0 0 0 1387.6 0 0 0 0 0 0 0 0 1478.39 0 0 1266.44 0 0 1070.97 0 0 0 0.04 0 0 2257.07 -1082.87 0 0 0 0 0 0 -1929.76 0 -328.303 1498.69 0 0 0 0 0 2429.04 0 0 0 0 0 0 1354.95 0 -389.645 0 0 0 0 -2218.77 0 -202.872 0 0 
0 0 0 -2145.07 1790.29 -711.615 0 0 0 0 -50.2792 0 0 0 0 0 0 0 0 -38.9874 1134.3 0 0 0.02 0 0 205.313 0 -1491.06 971.938 0 2181.39 1327.78 0 0 1938.76 1449.55 711.158 0 2252.04 -2106.31 2019.18 487.152 0 0 633.793 0 0 0 0 2053.51 1904.13 0 -1957.69 -1081.19 0 0 0 0 1417.2 0 
0 0 0 0 1829.51 0 0 0 0 0 901.746 0 0 0 -2466.89 0 0 0 0 0 -458.617 0 0 0 0.05 2093.49 26.9326 0 0 0 0 994.369 0 0 0 1867.2 0 0 0 1697.06 0 0 0 0 -1564.3 0 0 1075.7 0 1854.38 0 -94.0733 0 381.405 0 0 0 0 0 0 2047.26 
0 0 0 0 1720.4 0 -1726.36 0 0 0 0 0 -2486.57 0 1472.14 0 0 -626.316 1523.41 0 2389.22 0 1589.33 0 1896.04 0.09 0 0 265.893 1365.32 2191.31 55.4674 0 -1653.11 0 0 0 -1298.03 0 0 1243.1 -69.8111 -1475.19 0 0 0 0 0 1082.26 0 1847.06 -2368.47 0 0 0 0 0 0 0 0 0 
618.229 0 0 0 -1803.72 0 0 1044.57 0 0 0 0 0 0 0 0 1904.89 0 -1581.55 2290.8 0 1859.26 1717.51 -356.38 204.703 0 0.03 337.611 0 1147.42 0 0 0 2105.24 0 0 0 0 2238.3 0 0 0 0 0 0 0 -2147.05 1786.02 -1059.37 0 0 1920 0 -1868.88 0 0 0 0 0 0 0 
0 1748.79 696.814 0 0 0 1493.65 813.852 0 0 0 0 0 0 1318.93 2488.86 0 0 1656.62 0 -643.101 0 0 0 0 0 -2230.37 0.04 0 0 0 0 -370.724 0 0 0 0 1514.71 531.709 0 0 0 1854.99 0 0 1608.1 2339.01 0 0 0 1023.67 0 0 0 0 -1729.71 0 -623.112 0 -1350.37 0 
0 0 0 -2051.07 0 0 0 0 0 0 0 0 0 0 0 -1639.99 0 0 0 0 0 0 0 -28.4585 0 114.978 0 0 0.02 1402.86 0 0 0 0 0 0 0 0 0 0 0 0 0 0 2451.32 0 0 0 0 0 0 2233.57 0 509.888 0 0 0 0 0 0 0 
0 0 0 0 0 -2260.12 1592.23 0 0 0 0 452.513 -512.787 0 0 0 0 0 0 0 0 0 0 -960.341 0 1027.79 508.82 0 1569.49 0.02 0 0 723.67 0 -1966.84 -1673.1 0 0 0 0 0 0 998.184 0 0 0 1669.44 0 0 0 0 0 0 0 0 0 0 924.787 0 1938.61 0 
1213.34 0 0 0 0 -626.164 0 0 614.719 0 0 0 0 0 0 0 0 1880.93 0 0 0 0 0 0 0 68.7429 0 0 0 0 0.09 0 0 0 0 1314.51 0 -2474.21 0 2196.95 1624.27 0 0 0 0 0 0 0 0 0 -1653.57 0 0 0 0 0 0 -423.063 0 0 0 
-2455.6 -2020.86 -101.245 -78.2037 0 0 0 0 0 0 978.195 0 0 -196.615 -707.038 0 0 0 0 0 -41.4289 0 0 1255.15 1680.27 -1495.94 0 0 0 0 0 0.01 0 876.568 0 0 1992.48 0 0 0 0 0 0 0 498.444 0 0 0 0 2405.55 0 0 0 1213.8 0 0 0 0 1896.65 0 0 
0 2087.08 0 0 -222.404 0 0 0 0 0 0 0 -430.998 0 0 0 0 0 0 0 1484.34 0 0 1088.98 0 0 0 -1399.96 0 -868.938 0 0 0.05 0 2389.68 0 1983.02 309.839 2161.4 0 1226.16 0 0 0 0 1097.22 -1055.41 0 0 0 0 0 0 0 2048.02 0 0 718.787 0 0 0 
0 0 0 -2336.12 0 0 0 0 0 0 0 0 22.3548 -53.4837 0 0 2193.59 0 -715.278 943.098 952.406 0 2454.37 0 0 1574.98 -845.286 0 0 0 0 1459.17 0 0.05 -1920.45 2280.27 0 0 0 1643.04 0 0 0 0 0 0 0 0 2017.96 2438.05 0 0 -69.5059 0 -231.559 0 0 0 0 0 0 
0 0 42.1918 0 0 0 0 -968.276 0 0 0 0 0 0 -552.156 0 0 0 0 -714.057 728.706 0 0 0 0 0 0 0 0 833.689 0 0 2311.4 1472.14 0.08 0 0 0 0 2346.95 0 2320.09 0 0 -1635.56 0 0 0 0 0 0 -673.772 0 0 0 0 2426.3 0 0 0 -1382.41 
0 0 0 0 0 0 0 2023 -579.165 0 -1633.88 16.8615 0 0 0 1154.44 0 -1429.41 0 0 126.118 -1465.12 868.48 1621.37 2307.58 0 0 0 0 -1306.12 -410.092 0 0 -385.83 0 0.06 0 2222.13 1165.88 0 0 0 0 0 0 0 0 0 0 0 0 0 0 -799.509 0 0 0 0 0 0 0 
0 0 1661.05 0 0 0 0 0 0 0 0 -1404.39 2064.81 0 0 0 0 2500 -1506.01 0 0 0 -759.682 366.756 0 0 0 0 0 0 0 159.536 1124.07 0 0 0 0.07 0 0 0 0 0 -717.261 1252.56 0 0 0 0 0 0 0 0 0 -47.6852 0 0 -2369.99 0 0 0 0 
0 -2081.29 1555.15 0 -287.866 0 0 0 0 0 1802.8 -1760.84 0 0 1286.74 0 0 0 0 719.245 0 0 0 239.341 0 -392.544 0 1314.51 0 0 1426.21 0 1998.12 0 0 -804.849 0 0.01 79.2718 0 0 0 520.875 0 0 2091.51 -677.892 0 -466.247 0 -1809.67 0 0 0 0 0 0 0 0 0 0 
1463.74 0 0 -1292.38 0 0 0 0 0 0 0 0 0 0 0 0 0 0 0 0 1504.64 0 0 0 0 0 1709.11 2120.35 0 0 0 0 78.5089 0 0 -2062.06 0 -566.5 0.08 0 -478.454 -1926.4 0 0 0 -533.998 0 0 0 -890.301 0 2196.65 0 0 0 0 0 0 1303.83 -774.789 0 
0 186.697 -202.109 0 0 2029.1 0 0 0 0 0 0 0 0 2060.08 4.34889 0 0 0 1729.71 0 486.694 0 544.526 2389.22 0 0 0 0 0 -1488.46 0 0 2410.73 -1884.44 0 0 0 0 0.05 0 0 0 0 0 0 -883.282 0 -1007.64 0 0 0 0 0 0 0 0 -299.005 0 0 0 
2425.99 -2230.98 -887.097 0 935.926 0 0 0 918.683 0 0 0 0 0 0 0 0 0 -317.469 0 0 0 0 1240.04 0 -139.241 0 0 0 0 -122.15 0 -132.069 0 0 0 0 0 1691.87 0 0.06 0 0 703.986 0 984.909 0 0 -725.806 804.239 0 0 0 -649.358 0 0 0 0 536.897 0 0 
1499.45 0 -1783.12 0 0 1277.58 0 0 0 0 -398.648 0 0 0 0 0 0 0 1384.4 0 1941.05 0 0 -92.5474 0 -73.4733 0 0 0 0 0 0 0 0 583.59 0 0 0 -1901.38 0 0 0 0 0 0 -800.424 0 0 0 0 2023.76 0 2282.1 0 0 0 0 0 0 0 0 
0 0 0 0 -197.836 948.134 653.172 0 0 306.482 0 0 0 0 0 0 0 0 0 0 0 0 501.953 259.636 0 1382.11 0 -877.636 0 1619.54 0 0 0 0 0 0 2091.66 -1059.22 0 0 0 0 0 -925.092 0 0 0 0 0 -2330.47 0 0 0 0 0 0 0 0 0 0 0 
0 0 1293.15 0 0 0 0 1182.36 2270.35 0 0 -380.184 0 -436.033 -551.698 0 0 0 0 0 0 0 0 0 0 0 0 0 0 0 0 0 0 0 0 0 -2301.02 0 0 0 2178.79 0 -106.128 0.09 0 0 0 0 612.43 0 1600.77 0 359.89 0 0 0 0 0 0 0 0 
-584.964 0 0 0 2413.02 0 0 1234.09 -1872.23 0 0 0 0 0 0 1732.76 0 0 0 0 -564.669 0 0 0 -1649.45 0 0 0 2476.04 0 0 1118.27 0 0 -620.365 0 0 0 0 0 0 0 0 0 0.05 0 0 0 1826 0 60.3504 0 0 0 0 0 0 0 0 0 0 
0 0 1994.46 0 0 0 0 1451.69 2466.58 169.454 -2047.11 0 0 0 -855.815 0 0 0 0 0 1441.16 519.196 0 2023 0 0 0 2426.3 0 0 0 0 296.564 0 0 0 0 207.45 -1528.75 0 -910.291 1915.72 0 0 0 0.06 0 0 -297.632 0 0 1117.51 0 0 0 0 0 0 0 0 0 
0 306.177 0 0 -294.733 0 0 0 0 0 0 1481.75 0 556.734 0 0 0 0 0 0 0 0 0 0 0 0 1342.28 2112.42 0 -240.104 0 0 -404.904 0 0 0 0 1826.46 0 361.11 0 0 0 0 0 0 0.06 2450.1 0 0 0 0 0 0 0 0 0 0 0 0 0 
0 0 0 -437.864 0 0 0 0 0 -515.992 0 -944.472 0 2187.95 0 1556.83 -2294.61 2297.05 0 0 0 0 0 0 2296.59 0 2189.32 0 0 0 0 0 0 0 0 0 0 0 0 0 0 0 0 0 0 0 1069.44 0.08 0 0 -1244.01 0 0 351.344 0 0 0 0 0 0 1587.8 
0 0 1560.64 0 0 0 0 -508.515 1732.61 0 1336.33 0 0 0 0 1341.21 0 0 299.31 0 -315.638 0 0 0 0 2380.98 -993.759 0 0 0 0 0 0 614.872 0 0 0 -2354.43 0 -252.007 -1817.15 0 0 -1148.18 1668.83 -855.968 0 0 0.08 0 0 0 0 0 0 1639.07 0 -2094.56 -922.651 0 0 
0 0 0 0 0 -405.515 0 -1260.64 0 0 503.632 0 0 0 0 0 0 0 0 0 0 0 1250.57 0 -1251.79 0 0 0 0 0 0 -2249.29 0 1733.68 0 0 0 0 1442.84 0 1060.9 0 1278.19 0 0 0 0 0 0 0.01 1429.11 0 0 0 0 0 0 0 0 0 0 
0 0 0 1487.55 0 0 0 -1905.04 1283.84 0 0 0 0 0 0 0 0 1357.39 0 0 0 0 0 1206.93 0 710.089 0 -237.053 0 0 941.115 0 0 0 0 0 0 1211.36 0 0 0 763.802 0 2286.07 -1951.89 0 0 878.399 0 -451.14 0.04 2031.69 0 0 0 816.904 1635.87 0 0 0 0 
0 -877.331 -1530.43 0 0 0 0 0 0 -592.288 -142.903 0 0 0 0 0 2449.8 0 0 0 0 0 -525.147 1440.09 -544.221 -984.756 1121.94 0 2245.93 0 0 0 0 0 688.574 0 0 0 886.029 0 0 0 0 0 0 -14.5726 0 0 0 0 1135.52 0.02 665.99 0 0 0 0 0 0 0 0 
2042.83 0 0 0 0 0 0 1665.17 1551.48 0 0 0 0 0 -1258.2 0 0 0 0 0 -474.639 0 0 0 0 0 0 0 0 0 0 0 0 537.66 0 0 0 0 0 0 0 2100.67 0 -889.843 0 0 0 0 0 0 0 569.704 0.01 0 0 -2118.67 0 0 0 0 -758.309 
0 0 0 0 0 0 218.284 0 -1344.57 0 0 1175.65 1685.61 1568.73 0 0 -2244.56 0 0 0 0 2293.08 0 -1593.91 -2063.59 0 1872.54 0 1781.14 0 0 -1644.72 0 0 0 2015.52 954.848 0 0 0 -2419.43 0 0 0 0 0 0 2317.65 0 0 0 0 0 0.08 0 0 1796.24 0 0 0 2003.16 
0 0 0 0 0 0 0 0 0 -404.599 0 0 2492.07 0 0 0 0 0 0 0 -2477.72 0 0 2127.06 0 0 0 0 0 0 0 0 -603.275 -1425.29 0 0 0 0 0 0 0 0 0 0 0 0 0 0 0 0 0 0 0 0 0 700.018 0 0 0 0 0 
0 0 745.949 0 2247 0 0 0 0 0 0 0 0 1524.78 0 0 0 0 0 0 0 1267.36 0 0 0 0 0 -1790.14 0 0 0 0 0 0 0 0 0 0 0 0 0 0 0 0 0 0 0 0 1576.05 0 1760.54 0 509.735 0 -1671.88 0.03 0 0 0 0 0 
0 0 0 0 0 0 0 0 0 0 0 0 0 0 0 0 0 0 0 -436.491 0 0 -96.2096 0 0 0 0 0 0 0 0 0 0 0 -1754.59 0 2160.18 0 0 0 0 0 0 0 0 0 0 0 0 0 2476.2 0 0 265.587 0 0 0.09 0 0 0 0 
0 0 0 0 0 0 1960.59 0 0 0 0 0 0 0 0 0 -1330.53 0 1944.41 0 0 0 0 0 0 0 0 -717.109 0 -992.233 749.306 0 2067.4 0 0 0 0 0 0 -949.507 0 0 0 0 0 0 0 0 -1189.84 0 0 0 0 0 0 0 0 0.02 0 -228.965 0 
0 0 0 0 0 0 1406.98 -920.362 0 0 0 0 0 2127.37 0 0 0 0 0 0 0 0 71.7948 0 0 0 0 0 0 0 0 1083.33 0 0 0 0 0 0 0.228889 0 -102.008 0 0 0 0 0 0 0 96.3622 0 0 0 0 0 0 0 0 0 0.07 0 0 
0 0 0 0 -1055.71 0 0 0 1637.7 1186.33 0 566.195 1681.04 0 0 0 0 0 0 0 0 0 0 -1850.41 0 0 0 -1980.88 0 -131.306 0 0 0 0 0 0 0 0 1368.07 0 0 0 0 0 0 0 0 0 0 0 0 0 0 0 0 0 0 489.288 0 0.01 1566.44 
0 0 0 0 1432.31 0 801.34 0 0 0 0 0 0 0 0 0 1145.89 0 0 0 0 0 0 0 2243.03 0 0 0 0 0 0 0 0 0 1484.5 0 0 0 0 0 0 0 0 0 0 0 0 947.981 0 0 0 0 -371.334 1164.82 0 0 0 0 0 1499.15 0.07 
