*Vertices 74
*Matrix 
0.09 0 0 0 0 -2011.55 0 2352.44 0 0 0 0 -721.534 0 0 0 0 0 0 0 2225.64 0 245.14 0 0 0 1536.99 0 0 0 0 1349.15 0 0 0 0 591.372 0 0 0 0 0 363.857 1703.62 0 0 -373.775 -1784.34 0 0 0 0 0 0 0 0 0 0 0 0 0 0 0 0 -201.498 0 0 0 0 0 0 0 0 0 
0 0.07 1734.9 0 0 407.651 0 0 0 -975.143 0 0 0 0 0 0 0 0 0 0 0 0 60.0452 0 0 0 0 0 1198.08 0 0 0 0 -141.224 0 0 2328.18 0 0 0 0 0 0 0 0 0 0 0 0 0 0 0 0 0 0 0 -1116.29 0 0 0 0 0 0 0 1135.21 0 0 0 0 0 0 0 0 0 
0 211.264 0 0 0 0 0 0 0 1694.16 2105.09 0 0 -34.1044 0 0 0 0 0 0 0 1339.23 0 0 0 0 0 227.897 -2163.99 0 0 0 0 0 0 0 0 0 0 0 0 0 0 0 0 0 0 0 0 0 0 -2136.37 0 0 0 0 -361.721 0 1918.62 0 0 -1358.76 0 0 323.42 0 0 0 0 0 0 0 0 0 
0 0 0 0.04 0 -1729.87 0 0 0 0 0 0 2161.09 0 0 0 0 0 0 0 0 1905.04 0 777.078 0 0 0 0 0 0 0 0 0 0 0 0 1697.36 2014.6 1033.59 0 0 0 -2486.11 0 1630.83 0 0 0 0 0 846.507 0 -1813.33 0 0 0 0 0 0 0 0 0 0 0 0 0 0 0 0 0 0 0 0 0 
0 0 0 0 0.07 0 0 0 0 0 0 0 0 0 0 0 2020.86 0 0 963.698 0 0 0 0 0 0 120.014 0 1407.59 0 0 0 0 950.117 0 1181.6 1985.31 0 0 0 0 0 0 0 0 0 0 0 1958.45 872.6 0 0 0 0 0 0 0 1987.29 0 0 0 0 2476.35 0 0 0 0 0 0 0 0 0 0 0 
243.004 -1185.72 0 -965.987 0 0.01 0 1448.03 0 0 0 0 0 1729.1 0 0 0 2401.88 0 0 0 0 0 0 0 2061.14 -1847.97 0 0 0 -440.764 0 1136.74 -762.429 0 0 0 -1130.79 0 0 0 0 0 0 0 0 0 0 0 0 0 0 0 0 732.978 0 0 0 0 0 -1681.34 0 0 0 0 0 0 0 0 0 0 0 0 0 
0 0 0 0 0 0 0.08 0 0 0 0 0 0 0 0 0 0 0 0 0 887.555 0 0 0 0 0 0 0 0 0 0 0 0 0 0 0 0 0 0 0 -125.965 1363.8 0 0 -994.369 0 0 0 0 914.106 0 0 0 0 0 0 0 -402.005 0 0 0 0 0 -2024.06 0 0 0 0 0 0 0 0 0 0 
1233.33 0 0 0 0 1779.61 0 0.05 -1617.25 0 0 0 0 2086.93 0 649.815 0 0 0 0 0 0 0 0 0 0 0 0 0 0 0 0 0 0 0 0 0 -2100.21 0 2064.35 0 0 0 0 0 0 0 2307.89 0 1353.72 0 0 0 0 0 0 0 0 0 0 0 0 0 0 -1721.47 0 0 0 0 0 0 0 0 0 
0 0 0 0 0 0 0 2251.27 0.04 0 0 0 0 0 0 -1784.8 0 0 0 0 0 0 0 0 0 0 0 0 0 0 0 0 0 0 0 0 0 0 0 0 0 0 0 0 0 0 1896.34 -516.907 0 0 0 0 1680.27 0 0 0 0 0 0 0 0 0 0 0 0 0 0 0 0 0 0 0 0 893.506 
0 475.249 1309.32 0 0 0 0 0 0 0.07 0 0 0 1266.59 1871.93 0 0 0 0 0 -465.636 0 0 0 0 0 0 0 0 -2214.04 0 0 0 0 0 0 2122.18 0 0 0 0 0 0 0 0 0 0 0 923.414 0 0 0 320.063 0 0 0 0 0 0 0 0 0 0 0 0 0 0 0 0 0 0 0 0 0 
0 0 465.789 0 0 0 0 0 0 0 0.08 0 0 0 0 0 0 0 0 0 0 0 0 0 0 0 0 1512.12 0 0 0 0 0 0 0 0 0 0 0 1553.01 0 -316.401 0 0 0 0 0 0 0 0 0 0 0 0 0 0 0 0 0 0 0 0 0 0 1257.13 0 0 0 0 -1310.08 0 0 0 0 
0 0 0 0 0 0 0 0 0 0 0 0 0 0 0 0 0 0 0 891.064 0 0 0 0 0 0 0 0 0 0 0 0 0 0 0 0 0 0 0 0 0 0 0 0 0 0 0 0 0 0 0 0 0 0 0 -998.794 0 0 647.679 0 0 0 943.098 0 -249.26 0 0 0 0 0 0 0 0 0 
-2117.76 0 0 2007.74 0 0 0 0 0 0 0 0 0.01 0 0 0 0 0 1527.53 1772.59 0 0 0 -1835.92 0 -1160.85 0 0 0 0 0 0 0 0 1540.04 0 0 0 0 0 -1615.57 0 0 0 0 0 0 0 0 0 0 0 0 0 0 1742.07 0 -687.658 0 2229.61 0 -512.482 0 0 0 0 0 0 0 0 0 0 0 0 
0 0 -830.18 0 0 106.128 0 728.706 0 217.063 0 0 0 0.08 0 1147.88 1698.58 -2054.28 0 0 0 0 0 90.2585 646.001 0 0 0 0 0 0 0 -1300.01 0 0 0 0 0 0 0 0 0 0 0 0 288.018 0 0 0 0 0 0 0 2304.53 0 0 0 0 -1522.49 0 0 0 1462.98 0 0 0 0 0 0 0 0 0 0 0 
0 0 0 0 0 0 0 0 0 1854.53 0 0 0 0 0.01 0 0 0 0 0 0 0 1610.08 0 0 0 0 0 0 1664.4 0 1137.96 0 0 0 0 669.5 0 0 0 0 0 0 0 0 0 0 0 0 -1910.23 0 0 -2347.71 0 0 0 0 0 0 0 2159.72 0 0 0 0 0 0 0 0 0 0 0 0 0 
0 0 0 0 0 0 0 -1215.63 -1016.8 0 0 0 0 192.495 0 0.01 0 0 0 -22.66 0 654.393 0 0 0 0 0 11.6733 0 0 0 0 0 0 1706.21 0 0 0 0 0 0 0 0 0 0 0 0 0 0 0 0 0 0 0 0 0 0 2242.58 0 0 0 0 0 -131.611 0 0 0 0 0 0 0 0 0 0 
0 0 0 0 2006.06 0 0 0 0 0 0 0 0 609.378 0 0 0.01 0 918.836 0 0 0 0 0 -2250.36 0 0 0 2044.51 0 0 0 0 0 0 0 0 0 -233.543 0 0 0 0 0 0 0 -1535 2117.6 0 0 0 0 0 0 0 0 0 0 0 0 0 0 2197.87 0 0 0 -2084.64 0 0 0 0 0 0 0 
0 0 0 0 0 575.045 0 0 0 0 0 0 0 1848.73 0 0 0 0 0 0 34.4096 0 0 0 0 1277.28 0 0 0 0 0 0 0 0 0 0 -1706.06 0 0 0 0 0 0 0 0 1831.64 -752.968 0 0 413.449 0 0 0 -592.135 0 0 0 0 920.82 0 0 0 0 0 0 0 0 0 0 0 0 0 0 0 
0 0 0 0 0 0 0 0 0 0 0 0 -1363.34 0 0 0 1351.44 0 0.03 0 0 0 0 0 0 1994.77 -2264.7 0 0 0 0 0 0 1988.97 0 0 0 0 1460.23 0 -1737.8 0 0 0 125.507 0 0 0 0 0 1743.45 0 803.476 0 696.051 0 0 0 0 0 0 0 0 0 0 0 0 0 0 0 0 2222.89 0 0 
0 0 0 0 933.943 0 0 0 0 0 0 2118.98 1873 0 0 -1038.93 0 0 0 0.06 0 0 0 -838.878 0 0 0 0 0 0 0 0 0 0 0 0 0 -673.467 0 0 0 0 0 0 2135.3 0 0 -1153.37 0 -54.5518 0 -1175.8 0 0 0 460.601 0 0 0 0 0 0 1402.55 0 0 0 0 0 0 0 0 0 0 0 
1997.67 0 0 0 0 0 -410.092 0 0 1792.43 0 0 0 0 0 0 0 957.442 0 0 0 0 0 2204.58 0 0 0 0 0 0 0 842.082 0 0 0 0 0 0 0 0 -334.101 0 0 0 0 -2006.97 579.775 0 0 0 0 0 0 2479.71 0 -1060.44 0 0 -1972.79 0 0 0 0 0 0 0 0 0 0 0 0 0 0 0 
0 0 1121.94 -1823.25 0 0 0 0 0 0 0 0 0 0 0 1468.78 0 0 0 0 0 0.03 0 0 0 0 0 0 0 0 0 1817.76 0 -906.323 0 0 0 0 0 0 0 0 0 0 0 2464.75 0 0 0 0 0 0 0 0 0 1175.04 0 0 -1237.3 0 0 0 0 0 0 0 0 0 0 0 0 0 0 0 
31.8155 1011 0 0 0 0 0 0 0 0 0 0 0 0 1230.74 0 0 0 0 0 0 0 0.02 0 0 0 0 0 1665.32 2198.78 0 2251.12 2268.52 0 0 0 0 0 0 0 0 0 0 0 0 0 0 191.275 0 -2204.28 0 0 0 0 0 0 0 0 0 0 0 0 0 0 0 0 0 0 0 0 0 0 0 0 
0 0 0 743.507 0 0 0 0 0 0 0 0 -1251.18 -1261.41 0 0 0 0 0 -1974.78 -806.223 0 0 0.01 0 0 0 1653.72 0 0 0 0 0 0 0 0 0 0 0 2274.32 0 0 0 0 0 0 1218.68 0 0 0 0 0 0 0 0 0 0 0 0 0 0 0 0 0 0 0 0 0 0 0 0 0 0 0 
0 0 0 0 0 0 0 0 0 0 0 0 0 -25.5593 0 0 -1852.85 0 0 0 0 0 0 0 0 997.269 0 0 0 0 2474.67 0 0 0 0 74.5415 0 0 0 0 0 0 0 0 0 0 0 2015.98 0 0 0 0 0 0 0 0 0 0 0 0 0 0 -1418.58 2322.53 0 0 0 0 0 0 0 0 0 0 
0 0 0 0 0 -1910.23 0 0 0 0 0 0 -1981.03 0 0 0 0 2426.3 2230.83 0 0 0 0 0 31.2052 0.07 0 -1707.89 0 0 0 0 0 0 -1693.55 0 0 0 0 0 0 0 -1055.41 0 0 0 0 1341.36 0 0 0 0 2065.26 0 0 0 0 2212.52 0 0 0 0 0 627.384 0 0 0 0 0 0 0 0 0 0 
186.087 0 0 0 -906.934 -433.897 0 0 0 0 0 0 0 0 0 0 0 0 366.146 0 0 0 0 0 0 0 0.01 0 0 0 0 0 0 0 1708.04 0 0 0 0 0 0 1944.11 0 0 0 0 0 0 0 0 0 0 0 0 0 0 0 0 0 -1057.39 0 0 0 0 0 0 2250.51 0 0 0 0 0 0 0 
0 0 -1075.55 0 0 0 0 0 0 0 1294.52 0 0 0 0 -801.492 0 0 0 0 0 0 0 2384.03 0 239.036 0 0.07 0 0 1772.13 0 0 1891.92 0 0 0 0 0 0 0 0 1250.42 0 0 0 0 0 0 0 0 0 -1596.19 0 0 0 1816.39 0 0 0 0 0 0 0 2179.25 0 0 0 0 0 0 0 0 0 
0 1169.09 1118.12 0 1950.97 0 0 0 0 0 0 0 0 0 0 0 1530.58 0 0 0 0 0 -618.229 0 0 0 0 0 0 0 2438.81 0 0 0 -1276.51 0 0 0 0 708.106 0 0 0 0 0 0 0 0 0 0 0 0 0 0 0 -389.035 0 0 -2208.85 0 0 0 0 0 0 0 0 0 0 0 0 0 0 0 
0 0 0 0 0 0 0 0 0 -745.949 0 0 0 0 1853.62 0 0 0 0 0 0 0 2236.47 0 0 0 0 0 0 0.06 0 -50.737 0 0 0 0 0 0 0 0 0 0 0 0 0 0 0 0 0 258.263 0 0 0 0 0 0 -1748.33 0 0 0 0 0 2467.65 0 0 0 0 0 0 0 0 0 0 0 
0 0 0 0 0 493.713 0 0 0 0 0 0 0 0 0 0 0 0 0 0 0 0 0 0 2469.33 0 0 -1171.07 -2197.87 0 0.05 -992.843 0 0 0 0 0 0 0 0 0 1461.46 0 -675.604 0 0 0 0 2029.86 0 0 0 -376.98 0 0 707.038 0 0 0 0 0 0 0 0 0 0 0 0 0 0 0 0 0 0 
-896.863 0 0 0 0 0 0 0 0 0 0 0 0 0 -934.858 0 0 0 0 0 2208.85 -1222.04 739.692 0 0 0 0 0 0 -654.088 1704.08 0.03 -706.122 0 0 0 0 0 0 0 0 867.107 0 0 0 0 0 0 0 0 0 0 -2428.43 0 0 0 0 0 1430.33 2437.28 0 0 0 0 0 0 0 948.897 0 0 0 0 0 0 
0 0 0 0 0 -1233.18 0 0 0 0 0 0 0 2488.86 0 0 0 0 0 0 0 0 -1379.06 0 0 0 0 0 0 0 0 66.3015 0.01 0 0 0 0 0 0 0 1888.87 0 0 -627.079 0 0 0 0 0 0 813.7 0 0 0 0 0 2098.99 0 0 -865.886 0 0 0 0 0 0 0 0 -1966.84 0 0 0 0 1035.42 
0 -2270.96 0 0 -765.023 1294.67 0 0 0 0 0 0 0 0 0 0 0 0 -598.849 0 0 2381.59 0 0 0 0 0 -910.596 0 0 0 0 0 0.07 0 0 0 0 0 -1868.42 0 0 0 0 0 0 0 0 -1014.21 0 0 0 0 1988.81 0 0 0 0 0 0 0 0 1406.67 0 0 503.174 0 0 -250.328 0 0 0 0 0 
0 0 0 0 0 0 0 0 0 0 0 0 -172.658 0 0 1097.22 0 0 0 0 0 0 0 0 0 911.054 1397.37 0 -1318.48 0 0 0 0 0 0.08 566.652 0 0 0 829.875 0 -33.4941 0 0 0 0 0 0 1428.34 0 0 0 0 0 470.367 0 0 0 0 0 0 0 389.34 0 0 0 0 0 0 -1883.83 -2423.25 -703.375 0 0 
0 0 0 0 2168.57 0 0 0 0 0 0 0 0 0 0 0 0 0 0 0 0 0 0 0 2464.45 0 0 0 0 0 0 0 0 0 -1060.59 0.08 0 0 0 0 0 0 355.159 0 0 0 0 0 0 0 0 0 0 0 1199 2357.48 141.682 0 0 1670.2 -277.642 0 0 0 0 -805.612 0 0 0 0 0 0 0 0 
2109.36 -60.3504 0 1690.65 883.587 0 0 0 0 -1390.19 0 0 0 0 -1662.57 0 0 -104.45 0 0 0 0 0 0 0 0 0 0 0 0 0 0 0 0 0 0 0.07 0 0 0 -234.153 0 0 0 0 0 -2112.26 0 0 0 0 0 0 0 0 0 0 0 0 212.79 1045.64 0 0 0 0 0 0 0 0 0 0 0 0 0 
0 0 0 1708.35 0 234.916 0 1524.17 0 0 0 0 0 0 0 0 0 0 0 -2112.26 0 0 0 0 0 0 0 0 0 0 0 0 0 0 0 0 0 0.06 281.61 0 2184.29 0 0 0 0 0 0 0 0 0 0 0 0 0 1972.95 0 0 0 0 0 0 -380.337 0 492.798 1862.77 0 0 0 0 0 0 0 0 0 
0 0 0 1674.93 0 0 0 0 0 0 0 0 0 0 0 0 1847.21 0 -2325.28 0 0 0 0 0 0 0 0 0 0 0 0 0 0 0 0 0 0 203.33 0 0 0 0 0 0 0 -2014.15 0 0 0 0 0 0 0 0 0 2272.79 0 0 1310.24 0 1194.42 -1961.81 0 0 0 0 0 0 0 0 0 0 0 0 
0 0 0 0 0 0 0 -1103.17 0 0 449.767 0 0 0 0 0 0 0 0 0 0 0 0 745.643 0 0 0 0 172.964 0 0 0 0 1273.46 326.624 0 0 0 0 0.01 0 0 0 0 0 0 0 0 0 0 0 1877.73 0 0 0 0 0 0 0 0 0 -83.5444 0 0 0 0 0 0 0 0 0 0 0 0 
0 0 0 0 0 0 2051.23 0 0 0 0 0 2262.87 0 0 0 0 0 1952.04 0 315.332 0 0 0 0 0 0 0 0 0 0 0 2170.4 0 0 0 132.221 115.589 0 0 0.05 0 0 0 0 73.4733 0 683.996 0 0 0 0 0 0 0 0 0 0 0 0 0 0 0 0 0 0 0 0 0 0 0 0 0 0 
0 0 0 0 0 0 768.685 0 0 0 1093.86 0 0 0 0 0 0 0 0 0 0 0 0 0 0 0 -645.238 0 0 0 -545.9 1651.59 0 0 -1632.05 0 0 0 0 0 0 0.07 0 0 0 0 2442.93 0 0 0 2136.83 1339.08 0 0 0 0 0 0 0 0 0 0 0 0 0 0 0 0 0 0 0 0 0 0 
750.526 0 0 674.383 0 0 0 0 0 0 0 0 0 0 0 0 0 0 0 0 0 0 0 0 0 1422.85 0 2277.67 0 0 0 0 0 0 0 1817.3 0 0 0 0 0 0 0.08 0 0 1010.24 0 0 0 0 0 0 0 0 0 0 0 0 0 -1680.58 0 0 -1426.66 0 0 0 0 -125.355 0 0 0 0 0 0 
-172.201 0 0 0 0 0 0 0 0 0 0 0 0 0 0 0 0 0 0 0 0 0 0 0 0 0 0 0 0 0 1906.57 0 1116.44 0 0 0 0 0 0 0 0 0 0 0.07 0 0 -1617.1 0 0 0 0 0 0 0 0 0 0 0 0 0 0 0 0 1556.37 0 0 0 0 0 0 0 0 0 0 
0 0 0 -552.919 0 0 -1319.54 0 0 0 0 0 0 0 0 0 0 0 2491.45 1722.69 0 0 0 0 0 0 0 0 0 0 0 0 0 0 0 0 0 0 0 0 0 0 0 0 0.05 0 0 0 0 0 0 2255.7 2343.29 0 0 0 2270.96 0 0 0 0 0 0 0 0 0 0 0 0 0 0 0 201.346 0 
0 0 0 0 0 0 0 0 0 0 0 0 0 2028.49 0 0 0 561.617 0 0 -120.624 876.72 0 0 0 0 0 0 0 0 0 0 0 0 0 0 0 0 1882.15 0 -66.4541 0 1257.13 0 0 0.07 0 1744.82 0 0 0 0 0 264.214 0 -2166.43 0 0 0 0 0 0 0 0 0 0 0 0 0 0 0 0 0 0 
1916.03 0 0 0 0 0 0 0 2168.11 0 0 0 0 0 0 0 1317.71 -2119.89 0 0 2086.78 0 0 -109.333 0 0 0 0 0 0 0 0 0 0 0 0 2105.7 0 0 0 0 2192.68 0 -865.429 0 0 0.04 0 0 0 0 751.137 0 0 0 0 0 2473.75 0 0 0 0 0 0 0 0 0 0 0 0 -558.718 0 0 0 
-561.159 0 0 0 0 0 0 758.003 -2379.45 0 0 0 0 0 0 0 452.361 0 0 1815.93 0 0 1444.82 0 -135.121 1032.67 0 0 0 0 0 0 0 0 0 0 0 0 0 0 2183.22 0 0 0 0 983.383 0 0.05 -1793.5 0 0 0 0 0 0 0 -718.329 0 0 -785.165 0 0 0 0 0 0 0 0 0 0 0 0 0 0 
0 0 0 0 2034.59 0 0 0 0 1689.28 0 0 0 0 0 0 0 0 0 0 0 0 0 0 0 0 0 0 0 0 -1642.74 0 0 1165.88 91.0215 0 0 0 0 0 0 0 0 0 0 0 0 -2421.26 0.02 0 0 0 0 0 0 0 0 0 1203.88 0 0 -509.125 0 0 0 0 0 0 0 0 0 0 0 0 
0 0 0 0 1845.23 0 817.972 -659.886 0 0 0 0 0 0 -2.21259 0 0 2077.47 0 261.773 0 0 1939.53 0 0 0 0 0 0 226.829 0 0 0 0 0 0 0 0 0 0 0 0 0 0 0 0 0 0 0 0.08 0 0 0 0 0 0 0 0 0 0 -874.126 0 -587.252 0 0 0 0 0 0 0 0 0 0 0 
0 0 0 2193.75 0 0 0 0 0 0 0 0 0 0 0 0 0 0 -582.369 0 0 0 0 0 0 0 0 0 0 0 0 0 957.595 0 0 0 0 0 0 0 0 1810.13 0 0 0 0 0 0 0 0 0.08 0 0 0 -1430.78 0 0 0 0 0 -1421.32 0 179.525 0 0 0 0 0 0 0 0 0 -67.217 0 
0 0 829.569 0 0 0 0 0 0 0 0 0 0 0 0 0 0 0 0 477.081 0 0 0 0 0 0 0 0 0 0 0 0 0 0 0 0 0 0 0 -1873.15 0 1663.95 0 0 -917.31 0 -103.992 0 0 0 0 0.06 0 0 0 0 0 0 0 1284.6 1084.25 517.212 1227.23 123.676 434.355 0 0 0 0 0 0 0 0 0 
0 0 0 -1530.58 0 0 0 0 638.218 2483.98 0 0 0 0 1034.65 0 0 0 -20.9815 0 0 0 0 0 0 446.104 0 1970.81 0 0 -1004.59 -1650.67 0 0 0 0 0 0 0 0 0 0 0 0 2111.5 0 0 0 0 0 0 0 0.05 -109.18 0 0 0 0 0 0 585.421 0 0 0 0 0 0 0 0 0 0 0 0 0 
0 0 0 0 0 0 0 0 0 0 0 0 0 1585.21 0 0 0 1915.42 0 0 1582 0 0 0 0 0 0 0 0 0 0 0 0 -2428.28 0 0 0 0 0 0 0 0 0 0 0 1406.52 0 0 0 0 0 0 2093.04 0.09 0 0 0 0 1756.11 0 0 0 0 -1412.63 0 0 0 0 0 0 0 0 0 0 
0 0 0 0 0 1166.04 0 0 0 0 0 0 0 0 0 0 0 0 2027.57 0 0 0 0 0 0 0 0 0 0 0 0 0 0 0 -1238.67 881.298 0 62.9444 0 0 0 0 0 0 0 0 0 0 0 0 133.29 0 0 0 0.07 0 0 1291.47 0 0 0 0 97.1252 0 0 -1285.36 0 0 0 0 0 0 0 0 
0 0 0 0 0 0 0 0 0 0 0 -212.79 -646.153 0 0 0 0 0 0 2280.88 2448.73 1379.06 0 0 0 0 0 0 2276.3 0 1410.79 0 0 0 0 1971.42 0 0 2356.72 0 0 0 0 0 0 762.581 0 0 0 0 0 0 0 0 0 0.08 0 0 0 0 0 0 0 0 0 0 0 0 0 0 0 0 0 0 
0 -545.442 805.918 0 0 0 0 0 0 0 0 0 0 0 0 0 0 0 0 0 0 0 0 0 0 0 0 2200.31 0 2100.21 0 0 330.134 0 0 -1865.37 0 0 0 0 0 0 0 0 2456.51 0 0 -1393.7 0 0 0 0 0 0 0 0 0.05 0 0 0 0 0 365.535 0 0 0 0 0 0 0 0 0 0 0 
0 0 0 0 1859.26 0 -484.558 0 0 0 0 0 -1268.88 0 0 1883.37 0 0 0 0 0 0 0 0 0 1854.23 0 0 0 0 0 0 0 0 0 0 0 0 0 0 0 0 0 0 0 0 2390.29 0 0 0 0 0 0 0 2351.99 0 0 0.04 0 1070.21 0 0 0 0 0 0 0 0 0 0 0 0 47.9904 0 
0 0 2486.27 0 0 0 0 0 0 0 0 1488.31 0 1057.08 0 0 0 1931.14 0 0 602.817 704.443 0 0 0 0 0 0 -1527.07 0 0 -231.407 0 0 0 0 0 0 125.965 0 0 0 0 0 0 0 0 0 1722.54 0 0 0 0 -378.964 0 0 0 0 0.05 0 0 0 0 0 -1392.94 0 0 0 0 0 0 0 0 0 
0 0 0 0 0 0 0 0 0 0 0 0 1880.32 0 0 0 0 0 0 0 0 0 0 0 0 0 -821.177 0 0 0 0 1615.73 -2444.61 0 0 -964.614 -902.966 0 0 0 0 0 26.017 0 0 0 0 -71.9474 0 0 0 877.483 0 0 0 0 0 189.138 0 0.06 1927.47 0 0 0 0 0 0 -83.5444 0 0 0 0 0 0 
0 0 0 0 0 817.667 0 0 0 0 0 0 0 0 -14.42 0 0 0 0 0 0 0 0 0 0 0 0 0 0 0 0 0 0 0 0 621.891 1694.62 0 2460.94 0 0 0 0 0 0 0 0 0 0 -1586.58 1890.85 153.89 -1359.52 0 0 0 0 0 0 -1628.54 0.05 0 -1535.16 1425.29 1171.07 0 0 0 0 0 0 -998.642 0 0 
0 0 1703.62 0 0 0 0 0 0 0 0 0 1309.32 0 0 0 0 0 0 0 0 0 0 0 0 0 0 0 0 0 0 0 0 0 0 0 0 2380.83 578.86 -1799.3 0 0 0 0 0 0 0 0 -47.6852 0 0 -1520.97 0 0 0 0 0 0 0 0 0 0.03 0 0 1165.43 0 0 0 0 0 0 0 0 0 
0 0 0 0 -1875.9 0 0 0 0 0 0 2112.42 0 1513.03 0 0 -771.584 0 0 2439.27 0 0 0 0 435.27 0 0 0 0 -349.513 0 0 0 -1246.15 1335.87 0 0 0 0 0 0 0 290.155 0 0 0 0 0 0 1874.83 2130.57 321.894 0 0 -2389.68 0 -1392.33 0 0 0 1578.04 0 0 0 0 0 0 0 0 0 0 0 0 0 
0 0 0 0 0 0 1639.99 0 0 0 0 0 0 0 0 1822.18 0 0 0 0 0 0 0 0 411.313 -2406.92 0 0 0 0 0 0 0 0 0 0 0 -1022.75 0 0 0 0 0 -1596.65 0 0 0 0 0 0 0 -673.925 0 2279.05 0 0 0 0 0 0 1982.86 0 0 0.01 0 0 0 0 0 0 0 0 0 0 
-1206.93 -1148.95 1043.05 0 0 0 0 2498.47 0 0 1271.78 1898.48 0 0 0 0 0 0 0 0 0 0 0 0 0 0 0 2048.17 0 0 0 0 0 0 0 0 0 -1699.19 0 0 0 0 0 0 0 0 0 0 0 0 0 522.706 0 0 0 0 0 0 -1416.59 0 1471.98 2055.65 0 0 0.07 0 0 0 0 0 0 0 0 0 
0 0 0 0 0 0 0 0 0 0 0 0 0 0 0 0 0 0 0 0 0 0 0 0 0 0 0 0 0 0 0 0 0 494.781 0 2151.02 0 0 0 0 0 0 0 0 0 0 0 0 0 0 0 0 0 0 1967.6 0 0 0 0 0 0 0 0 0 0 0.04 0 0 0 0 0 0 0 0 
0 0 0 0 0 0 0 0 0 0 0 0 0 0 0 0 -599.155 0 0 0 0 0 0 0 0 0 904.95 0 0 0 0 0 0 0 0 0 0 0 0 0 0 0 0 0 0 0 0 0 0 0 0 0 0 0 0 0 0 0 0 0 0 0 0 0 0 0 0.06 0 0 0 0 0 0 0 
0 0 0 0 0 0 0 0 0 0 0 0 0 0 0 0 0 0 0 0 0 0 0 0 0 0 0 0 0 0 0 2144.61 0 0 0 0 0 0 0 0 0 0 1247.98 0 0 0 0 0 0 0 0 0 0 0 0 0 0 0 0 1325.65 0 0 0 0 0 0 0 0.06 0 0 0 0 0 0 
0 0 0 0 0 0 0 0 0 0 0 0 0 0 0 0 0 0 0 0 0 0 0 0 0 0 0 0 0 0 0 0 2286.68 1458.25 0 0 0 0 0 0 0 0 0 0 0 0 0 0 0 0 0 0 0 0 0 0 0 0 0 0 0 0 0 0 0 0 0 0 0.06 0 0 0 0 0 
0 0 0 0 0 0 0 0 0 0 1136.28 0 0 0 0 0 0 0 0 0 0 0 0 0 0 0 0 0 0 0 0 0 0 0 -521.79 0 0 0 0 0 0 0 0 0 0 0 0 0 0 0 0 0 0 0 0 0 0 0 0 0 0 0 0 0 0 0 0 0 0 0.07 0 0 0 0 
0 0 0 0 0 0 0 0 0 0 0 0 0 0 0 0 0 0 0 0 0 0 0 0 0 0 0 0 0 0 0 0 0 0 547.578 0 0 0 0 0 0 0 0 0 0 0 1870.86 0 0 0 0 0 0 0 0 0 0 0 0 0 0 0 0 0 0 0 0 0 0 0 0.05 0 0 0 
0 0 0 0 0 0 0 0 0 0 0 0 0 0 0 0 0 0 649.358 0 0 0 0 0 0 0 0 0 0 0 0 0 0 0 1839.43 0 0 0 0 0 0 0 0 0 0 0 0 0 0 0 0 0 0 0 0 0 0 0 0 0 -311.518 0 0 0 0 0 0 0 0 0 0 0.02 0 0 
0 0 0 0 0 0 0 0 0 0 0 0 0 0 0 0 0 0 0 0 0 0 0 0 0 0 0 0 0 0 0 0 0 0 0 0 0 0 0 0 0 0 0 0 -1344.11 0 0 0 0 0 2372.13 0 0 0 0 0 0 -591.678 0 0 0 0 0 0 0 0 0 0 0 0 0 0 0.01 0 
0 0 0 0 0 0 0 0 -1563.84 0 0 0 0 0 0 0 0 0 0 0 0 0 0 0 0 0 0 0 0 0 0 0 2174.21 0 0 0 0 0 0 0 0 0 0 0 0 0 0 0 0 0 0 0 0 0 0 0 0 0 0 0 0 0 0 0 0 0 0 0 0 0 0 0 0 0.07 
