*Vertices 54
*Matrix 
0.05 0 0 -2161.85 0 321.589 0 0 0 0 0 -1553.32 0 0 1414.91 0 773.11 0 0 0 0 1720.1 0 0 0 0 0 -207.907 1351.28 0 0 0 0 0 0 0 299.31 749.458 0 0 0 1259.58 0 0 0 0 0 0 -2305.75 0 0 0 0 0 
0 0.01 0 0 0 0 0 0 0 0 0 0 0 0 1343.04 0 0 0 0 0 0 0 0 0 0 0 0 0 0 871.685 0 1541.72 0 0 661.565 0 0 0 0 0 0 0 0 0 0 2155.45 0 0 0 0 0 0 -674.23 0 
0 0 0.07 0 0 2006.52 0 1189.99 0 0 0 1834.39 0 0 0 0 0 1100.12 0 2376.86 0 0 -1602.15 0 0 0 0 2385.86 0 -1202.2 0 0 0 0 286.492 0 0 0 -1663.64 2405.7 -134.816 0 -1806.31 0 0 0 0 0 0 0 0 -2083.12 922.04 0 
1849.19 0 0 0.03 0 606.021 0 0 0 0 0 0 0 0 0 0 1868.72 0 0 0 0 -858.867 -312.433 0 0 0 844.981 0 -582.827 0 0 0 0 0 0 0 18.54 0 0 0 0 0 0 0 0 0 -752.358 0 0 0 0 93.3103 0 0 
0 0 0 0 0 0 0 0 0 -376.217 1161.61 0 1464.66 0 -30.5948 -1472.75 0 0 0 1803.42 -1238.36 0 0 -24.1859 0 0 0 258.11 0 0 1155.05 0 1590.09 -2120.2 0 0 0 0 0 0 0 0 0 0 0 0 0 0 1775.95 0 0 0 0 0 
-1200.83 0 1829.2 1914.2 0 0.08 -1881.54 0 0 0 0 1323.82 1664.1 0 0 0 -1710.94 0 1327.94 0 0 -409.024 0 0 180.441 0 -1.75481 0 0 0 0 -459.227 0 0 0 0 -950.27 0 0 0 0 0 2354.88 -1376.92 1468.17 0 1389.58 0 0 0 0 1125.6 0 0 
0 0 0 0 0 603.58 0.05 846.965 -2357.94 0 0 0 0 -2236.32 0 0 0 0 0 0 2052.9 0 0 12.1311 0 2041 -1392.48 0 0 0 0 0 0 -1248.74 2318.57 -647.221 0 1484.95 875.042 0 0 1782.2 0 0 0 399.411 0 0 0 0 0 0 0 0 
0 0 275.506 0 0 0 1551.18 0.07 0 0 0 0 2159.26 0 0 0 0 0 -856.426 0 0 576.113 1399.5 0 0 0 2168.42 0 0 0 0 0 0 0 600.07 0 0 0 0 0 0 1315.12 0 0 0 -1597.87 0 0 0 0 0 0 0 0 
0 0 0 0 0 0 1006.42 0 0.04 0 -2274.47 0 0 0 0 1000.63 0 0 0 2256.92 0 602.054 0 0 0 0 0 0 0 0 1598.03 1753.21 0 0 0 0 1737.19 0 0 0 0 0 0 0 0 0 0 0 0 0 0 0 0 0 
0 0 0 0 1952.96 0 0 0 0 0.09 0 0 0 0 0 0 0 69.5059 0 1406.37 0 0 -1414.15 743.355 -1278.34 799.203 0 -1068.99 0 0 0 1343.35 0 0 0 0 2039.02 590.762 0 -379.879 -236.442 0 0 1083.79 0 0 0 0 853.984 -888.165 0 0 382.321 0 
0 0 0 0 2453.46 0 0 0 -1279.56 0 0.03 0 0 0 2240.9 0 1965.32 0 0 0 -691.931 0 -2357.17 0 0 0 0 0 679.724 0 0 0 0 0 -835.521 0 0 0 0 0 0 0 0 -1303.52 -1356.47 1472.44 0 2450.1 0 0 0 1400.11 0 0 
1770.76 0 -297.174 0 0 -1141.16 0 0 0 0 0 0.05 0 0 0 -740.608 0 0 0 0 0 0 -698.34 0 0 0 1310.39 0 -157.857 -1857.74 0 0 600.681 0 0 196.31 0 0 0 0 371.639 0 0 1586.28 -2017.96 0 0 0 0 1931.44 1482.21 355.007 0 0 
0 0 0 0 2343.75 -1008.41 0 208.823 0 0 0 0 0.09 0 0 0 0 -1113.24 2451.93 0 -1020.62 980.178 -1486.63 0 0 0 0 0 366.146 0 0 0 0 0 0 0 0 0 2324.37 0 0 0 0 0 0 1807.99 0 321.131 0 0 0 0 0 0 
0 0 0 0 0 0 747.017 0 0 0 0 0 0 0 0 0 0 0 516.907 0 0 0 0 0 0 0 0 -1669.13 0 2125.23 0 0 1509.98 0 0 -1455.2 0 0 0 0 1405.3 0 0 2230.22 2325.28 0 0 0 0 0 0 0 0 0 
800.729 159.993 0 0 537.202 0 0 0 0 0 1386.23 0 0 0 0.07 -2442.47 1259.58 0 -1054.49 -149.312 1888.87 0 0 550.02 0 0 499.207 0 0 1485.11 0 0 0 0 -940.199 779.824 0 1892.83 1194.57 0 0 -1488.01 1945.33 0 385.983 0 0 0 0 0 0 -172.201 0 0 
0 0 0 0 2338.86 0 0 0 2028.95 0 0 -1965.93 0 0 -81.4081 0.06 0 0 0 1822.95 0 0 0 0 0 1556.67 982.315 -531.251 0 0 1669.9 321.131 0 0 0 0 2256.77 0 0 0 -1081.5 0 0 0 0 0 0 0 586.795 994.98 0 0 0 0 
-544.069 0 0 2064.81 0 -2464.45 0 0 0 0 2301.17 0 0 0 2219.99 0 0.02 2102.95 0 1851.94 0 1061.51 0 -1578.49 0 0 0 0 0 0 0 1219.29 0 0 0 0 0 0 0 0 0 0 0 0 0 0 0 0 0 0 0 0 0 0 
0 0 702.155 0 0 0 0 0 0 -969.649 0 0 -212.027 0 0 0 2036.27 0.02 0 0 0 0 0 0 148.701 1010.54 0 0 0 0 0 2301.17 0 0 0 0 2481.38 0 0 409.024 0 0 0 0 0 0 0 0 17.0141 0 0 0 0 0 
0 0 0 0 0 2434.54 0 -1696.45 0 0 0 0 1853.31 1800.21 1200.06 0 0 0 0 0 0 1206.47 0 -2374.11 0 0 0 0 0 -1368.83 0 0 -233.238 0 0 0 0 0 0 0 0 -1729.87 0 0 0 -471.129 0 0 -1459.32 0 0 409.177 0 0 
0 0 -1225.7 0 459.227 0 0 0 955 -1574.22 0 0 0 0 815.073 -1646.7 418.638 0 0 0.03 0 0 0 0 0 0 0 0 0 0 -755.104 0 0 1046.4 0 0 0 0 0 0 1133.08 1820.35 0 1222.5 0 0 0 0 2180.47 0 0 0 0 0 
0 0 0 0 153.737 0 -273.827 0 0 0 2395.78 0 962.63 0 -486.541 0 0 0 0 0 0 -22.8126 -2051.53 0 0 922.956 0 2308.34 0 0 0 0 0 -2270.81 0 2357.02 1570.1 -1355.1 0 0 0 0 -2213.43 0 0 0 0 0 0 0 0 2073.81 0 0 
-1392.48 0 0 2165.52 0 973.159 0 492.645 1369.75 0 0 0 851.848 0 0 0 -1721.63 0 -1704.54 0 72.7104 0.07 0 0 0 0 0 0 0 0 0 2380.98 0 0 0 0 0 116.504 0 -1352.96 0 0 0 2282.25 0 -1681.65 0 -1598.79 0 -253.227 1872.54 2317.96 0 0 
0 0 -2191.61 1361.96 0 0 0 502.411 0 2312.62 2497.56 -2352.14 -218.589 0 0 0 0 0 0 0 677.129 0 0.05 0 0 -217.673 0 0 0 0 0 -1315.88 0 0 488.83 0 0 -705.969 0 0 0 0 0 0 0 0 0 0 2198.02 1325.8 0 0 0 2255.39 
0 0 0 0 1647.47 0 197.684 0 0 -2237.24 0 0 0 0 579.012 0 2090.75 0 1356.62 0 0 0 0 0.03 0 0 1444.36 0 2416.38 0 0 1852.24 -410.703 -1090.35 -541.78 0 0 1921.37 0 0 0 0 0 -2229.91 0 0 997.879 0 -1100.27 0 0 0 0 895.642 
0 0 0 0 0 -632.115 0 0 0 2458.34 0 0 0 0 0 0 0 2097.77 0 0 0 0 0 0 0.09 0 0 0 0 0 0 0 1928.24 0 293.664 0 0 0 0 1940.29 0 -1915.11 0 0 0 0 0 0 1265.37 0 0 0 0 -1452.45 
0 0 0 0 0 0 -1719.49 0 0 1950.06 0 0 0 0 0 782.266 0 -2049.7 0 0 1134.75 0 -299.615 0 0 0.09 0 0 0 1819.59 0 0 0 0 0 0 0 0 545.442 0 0 1363.8 0 1512.88 0 0 0 -858.409 0 0 -7.09555 0 0 0 
0 0 0 1796.4 0 -52.1104 1589.33 -88.2748 0 0 0 2262.57 0 0 1489.38 411.924 0 0 0 0 0 0 0 -1233.94 0 0 0.08 0 0 0 0 0 -2304.99 0 0 0 0 -1253.47 712.073 -652.257 0 1864.45 0 0 0 0 1474.88 834.147 2387.84 0 0 0 0 0 
-1190.3 0 1266.29 0 453.276 0 0 0 0 -722.297 0 0 0 919.446 0 2197.41 0 0 0 0 -1792.73 0 0 0 0 0 0 0.01 0 -1894.97 0 0 0 2386.78 0 0 -593.661 0 0 0 0 0 0 -289.697 0 0 0 0 0 0 1652.81 0 0 0 
2073.35 0 0 -1425.29 0 0 0 0 0 0 1865.52 14.7252 -836.894 0 0 0 0 0 0 0 0 0 0 498.291 0 0 0 0 0.08 327.54 1430.63 30.4422 0 -646.763 0 0 0 0 0 0 0 0 0 0 -822.55 0 454.955 0 1092.79 0 0 232.17 0 -1097.37 
0 228.813 -337.916 0 0 0 0 0 0 0 0 -326.93 0 2000.87 1848.28 0 0 0 1436.28 0 0 0 0 0 0 -1104.69 0 1848.43 -483.337 0.05 -515.839 0 0 0 0 0 1874.83 0 0 1320.46 0 0 -204.093 -1458.4 0 0 0 0 0 837.352 0 0 1703.16 0 
0 0 0 0 2402.04 0 0 0 -1962.87 0 0 0 0 0 0 -1421.32 0 0 0 2337.64 0 0 0 0 0 0 0 0 2383.27 1299.1 0.05 0 0 0 0 0 0 0 0 0 0 1828.44 1117.36 0 -1528.6 0 0 0 0 0 0 0 -1667.46 0 
0 1283.38 0 0 0 1978.74 0 0 2208.09 562.532 0 0 0 0 0 -623.264 -1382.72 1461.61 0 0 0 -716.956 -1642.43 2152.7 0 0 0 0 1973.56 0 0 0 0 0 0 0 0 0 0 -1250.42 0 0 0 1918.32 0 0 0 -561.007 1629.61 -745.949 0 0 0 0 
0 0 0 0 -51.5 0 0 0 0 0 0 553.987 0 1950.21 0 0 0 0 1890.55 0 0 0 0 313.654 988.113 0 2024.37 0 0 0 0 0 0.02 0 48.7533 -1329.16 0 0 0 1253.17 0 0 0 0 0 138.478 0 0 -1487.7 0 1444.82 -686.132 0 0 
0 0 0 0 -1329.46 0 -1182.82 0 0 0 0 0 0 0 0 0 0 0 0 -778.298 1537.14 0 0 1846.14 0 0 0 505.005 -1540.35 0 0 0 0 0.02 0 0 0 2402.49 0 0 0 604.038 0 0 0 0 0 -1865.52 0 2409.05 0 0 -1140.55 0 
0 -300.684 2498.17 0 0 0 -2472.53 980.941 0 0 2011.09 0 0 0 613.956 0 0 0 0 0 0 0 1871.47 2419.74 1251.03 0 0 0 0 0 0 0 -330.897 0 0.03 0 0 0 0 0 -226.829 0 0 -11.6733 0 0 0 0 0 1016.04 0 0 0 0 
0 0 0 0 0 0 -656.377 0 0 0 0 1033.43 0 2276.91 -1530.73 0 0 0 0 0 1463.44 0 0 0 0 0 0 0 0 0 0 0 -521.638 0 0 0.02 -1200.37 0 0 0 0 -1657.54 0 0 -992.843 0 0 2435.76 1603.37 0 0 0 958.052 0 
2001.48 0 0 261.315 0 435.423 0 0 2262.41 1334.96 0 0 0 0 0 1798.99 0 757.851 0 0 1197.78 0 0 0 0 0 0 1298.79 0 1677.22 0 0 0 0 0 2212.21 0.04 0 1461.76 0 0 0 0 0 0 0 0 0 0 317.316 -2341 0 -1365.32 0 
1920.91 0 0 0 0 0 1925.49 0 0 1208.61 0 0 0 0 1277.43 0 0 0 0 0 -1175.19 1941.36 -1757.33 95.9044 0 0 374.386 0 0 0 0 0 0 -1917.4 0 0 0 0.09 1082.72 0 819.956 1716.13 0 0 0 0 0 0 1493.8 0 769.448 0 -1307.18 452.971 
0 0 -51.8052 0 0 0 737.709 0 0 0 0 0 1176.56 0 142.445 0 0 0 0 0 0 0 0 0 0 -1135.98 1667 0 0 0 0 0 0 0 0 0 -659.124 1117.05 0.05 0 0 0 -857.189 0 -1107.14 -820.414 1805.4 2077.47 0 1614.05 2209.16 0 0 0 
0 0 -884.045 0 0 0 0 0 0 2369.99 0 0 0 0 0 0 0 1097.67 0 0 0 1764.35 0 0 935.621 0 -1516.54 0 0 -2240.14 0 -33.7992 516.755 0 0 0 0 0 0 0.08 -2449.64 0 1502.2 2162.01 0 1517.61 0 0 0 0 0 0 0 0 
0 0 516.602 0 0 0 0 0 0 2021.32 0 -1053.88 0 -1321.68 0 969.802 0 0 0 898.083 0 0 0 0 0 0 0 0 0 0 0 0 0 0 1068.22 0 0 949.66 0 -1494.26 0.08 1101.95 0 0 0 -1400.42 0 0 -1643.19 0 674.688 0 0 0 
-984.451 0 0 0 0 0 459.075 1591.16 0 0 0 0 0 0 1277.73 0 0 0 -314.722 1594.52 0 0 0 0 -2147.51 428.861 904.645 0 0 0 2006.06 0 0 676.061 0 -1231.35 0 -354.854 0 0 2451.02 0.01 0 0 0 -1097.67 0 0 0 2004.38 0 2375.33 -4.0437 0 
0 0 1309.02 0 0 -1995.38 0 0 0 0 0 0 0 0 825.449 0 0 0 0 0 1013.6 0 0 0 0 0 0 0 0 588.931 1377.99 0 0 0 0 0 0 0 197.073 -112.232 0 0 0.05 1610.23 0 0 -2343.13 0 -1189.23 0 0 2299.95 1451.54 0 
0 0 0 0 0 911.206 0 0 0 960.952 1081.8 -739.235 0 1201.28 0 0 0 0 0 -225.303 0 156.941 0 601.291 0 -709.174 0 1025.5 0 97.5829 0 1977.07 0 0 -748.848 0 0 0 0 1804.79 0 0 -2259.06 0.04 0 0 1032.82 1837.75 0 0 2463.99 0 -1703.01 0 
0 0 0 0 0 -1539.12 0 0 0 0 545.442 1961.2 0 152.669 1502.81 0 0 0 0 0 0 0 0 0 0 0 0 0 848.186 0 1433.23 0 0 0 0 1724.68 0 0 1327.78 0 0 0 0 0 0.01 2223.5 0 0 0 0 0 0 0 0 
0 -1506.16 0 0 0 0 2381.74 1124.68 0 0 -153.89 0 -195.395 0 0 0 0 0 47.5326 0 0 -902.356 0 0 0 0 0 0 0 0 0 0 446.867 0 0 0 0 0 1286.58 1794.87 48.4481 2307.73 0 0 -529.572 0.08 0 0 0 0 0 0 0 0 
0 0 0 1220.82 0 -1016.04 0 0 0 0 0 0 0 0 0 0 0 0 0 0 0 0 0 438.169 0 0 -706.58 0 -90.2585 0 0 0 0 0 0 0 0 0 443.052 0 0 0 1065.94 -1808.45 0 0 0.03 0 0 0 0 1545.99 0 0 
0 0 0 0 0 0 0 0 0 0 588.473 0 1946.09 0 0 0 0 0 0 0 0 -2015.67 0 0 0 -1798.84 -511.719 0 0 0 0 620.212 0 1250.57 0 1347.93 0 0 1634.95 0 0 0 0 -481.506 0 0 0 0.01 0 1895.12 2299.34 1041.98 0 1983.32 
1907.33 0 0 0 -74.8466 0 0 0 0 -975.6 0 0 0 0 0 1045.64 0 2082.05 -2329.86 -300.378 0 0 1471.83 223.167 227.592 0 1748.33 0 1913.43 0 0 -1451.99 -1930.98 0 0 -1065.94 0 -565.737 0 0 -1842.02 0 1754.28 0 0 0 0 0 0.09 0 0 0 2255.24 0 
0 0 0 0 0 0 0 0 0 -2045.88 0 2244.25 0 0 0 57.4511 0 0 0 0 0 -1399.81 -968.429 0 0 0 0 0 0 2099.75 0 229.728 0 2405.85 -204.398 0 1260.95 0 -1108.81 0 0 830.027 0 0 0 0 0 -1069.9 0 0 0 -2114.4 0 0 
0 0 0 0 0 0 0 0 0 0 0 -135.884 0 0 0 0 0 0 0 0 0 -184.713 0 0 0 1073.11 0 -637.455 0 0 0 0 1730.93 0 0 0 1576.2 -1199.15 -1985.61 0 -370.571 0 0 -207.907 0 0 0 1291.77 0 0 0.04 0 0 0 
0 0 1108.2 1549.81 0 -485.931 0 0 0 0 -364.162 -1241.72 0 0 2453.15 0 0 0 570.162 0 2438.35 -988.876 0 0 0 0 0 0 -1260.64 0 0 0 -1897.11 0 0 0 0 0 0 0 0 18.9978 -1528.75 0 0 0 1442.08 1925.34 0 -2270.81 0 0.05 0 2028.79 
0 859.478 1864.6 0 0 0 0 0 0 885.266 0 0 0 0 0 0 0 0 0 0 0 0 0 0 0 0 0 0 0 912.885 -162.74 0 0 1858.35 0 1953.11 1273.92 -1838.51 0 0 0 1141.32 995.59 452.055 0 0 0 0 2374.57 0 0 0 0 0 
0 0 0 0 0 0 0 0 0 0 0 0 0 0 0 0 0 0 0 0 0 0 1121.02 1115.38 -235.527 0 0 0 43.26 0 0 0 0 0 0 0 0 -493.561 0 0 0 0 0 0 0 0 0 2105.55 0 0 0 1663.03 0 0.05 
