*Vertices 83
*Matrix 
0.06 0 950.117 0 0 0 -210.044 1464.81 78.3563 0 0 104.755 0 1329.92 0 -1701.64 1850.57 0 0 0 443.663 0 0 0 0 -745.949 0 0 0 0 385.83 0 2094.56 798.44 0 0 2295.53 -1646.4 0 1043.96 0 0 0 0 0 0 -1501.13 0 528.047 0 0 0 0 0 345.546 0 0 0 0 0 0 0 0 0 0 743.049 0 0 1300.01 0 0 2154.07 0 -605.106 0 0 0 0 0 0 0 0 0 
0 0 0 -818.43 0 0 0 0 -463.805 0 0 0 349.666 1720.86 0 0 1648.69 -1040.15 -600.528 0 1586.73 0 0 0 0 0 194.021 0 0 0 0 0 0 0 0 0 0 0 0 2313.38 0 0 0 0 0 -1383.94 0 2336.73 -301.294 0 0 0 -567.873 70.8792 0 0 0 0 0 0 0 0 0 1824.17 0 0 0 0 0 0 0 1773.66 -1345.94 0 0 0 0 0 0 0 0 0 -1856.97 
-1513.18 0 0.06 0 2294.92 0 2168.72 0 0 0 0 0 0 0 -1427.58 -383.084 0 1120.87 0 0 0 1956.31 551.546 -1566.59 2295.07 0 0 0 46.0067 0 0 2010.03 0 1096 0 1495.03 0 1287.96 0 0 0 0 0 0 0 0 0 0 -2188.71 0 0 0 0 0 0 0 0 0 0 0 0 0 0 0 0 0 0 0 0 0 0 0 -1829.05 0 -815.531 0 0 929.518 2025.59 0 0 160.756 0 
0 827.586 0 0.05 75.3044 0 0 2179.86 0 0 0 0 -2454.99 0 -405.362 0 -896.1 0 2487.18 0 -335.322 0 0 0 2227.93 1491.52 0 0 0 0 0 0 0 0 0 0 0 2213.43 0 1512.88 0 0 0 0 0 0 1920.45 2218.31 45.7015 0 0 0 0 0 0 0 0 0 0 0 0 1954.18 0 0 0 214.316 -1533.17 0 0 0 0 0 0 0 0 0 0 0 0 0 0 0 0 
0 0 1315.27 416.654 0.01 380.032 0 36.6985 0 0 1331.6 0 0 0 0 0 2253.87 0 -1041.37 0 0 1480.22 0 0 0 0 396.054 0 0 0 0 0 2041.46 0 0 0 0 0 0 2257.99 0 0 0 0 0 0 -2064.35 0 0 1786.63 0 1059.68 0 0 0 0 0 0 0 -2258.29 0 0 0 0 -1116.14 0 0 0 0 0 0 0 0 0 0 0 0 0 1724.52 0 602.664 0 0 
0 0 0 0 814.005 0.07 0 0 0 0 1519.29 0 0 -1716.59 0 0 0 0 0 0 0 0 1867.05 0 0 0 0 0 0 0 0 0 1313.75 0 1802.65 0 1738.87 469.909 0 0 -1446.65 0 -2111.65 761.818 0 0 0 0 539.033 0 0 0 0 0 0 0 0 1487.85 0 0 -2309.87 0 392.85 -836.894 0 0 0 0 0 0 0 0 0 0 0 0 -1376.77 0 0 0 0 0 844.829 
2421.11 0 -2471.62 0 0 0 0.07 0 817.515 0 0 0 0 -2158.65 0 0 0 0 0 1406.52 0 -1038.47 2486.72 0 0 1206.63 0 -1524.63 0 0 0 -1066.55 0 0 0 0 0 0 0 0 0 0 -447.63 0 0 0 0 1136.13 2375.64 2313.53 0 -881.451 0 0 0 0 0 0 0 0 0 0 0 -1187.7 0 0 0 0 0 0 0 0 0 0 0 1166.65 0 0 0 0 0 0 0 
-235.679 0 0 1303.67 -2211.45 0 0 0.07 0 2099.9 1409.88 0 0 0 0 0 0 0 0 0 0 0 822.55 0 0 1345.18 0 0 0 -1729.1 0 0 0 0 0 0 1722.39 0 0 1542.02 0 0 0 0 0 0 0 -1520.51 0 0 0 0 0 0 0 0 0 0 0 1199.3 589.541 0 0 0 0 0 0 0 0 0 1767.86 0 -312.738 0 0 0 0 0 0 0 0 0 0 
-2170.71 1237.14 0 0 0 0 1231.35 0 0.06 0 0 0 0 0 0 0 999.1 1286.28 0 0 2400.2 0 0 -1672.95 0 0 0 362.789 0 0 -986.74 0 0 0 0 0 0 2013.99 0 0 0 -2194.97 0 0 -1770.61 0 0 1324.43 0 0 0 0 0 0 0 0 0 0 0 0 0 0 0 0 0 0 0 0 0 598.239 0 0 0 0 -900.983 0 0 0 0 0 0 0 0 
0 0 0 0 0 0 0 -244.377 0 0.09 0 0 1435.67 -343.562 0 2337.34 -822.245 -61.4185 0 0 0 0 0 2385.56 0 0 0 0 -1008.87 -988.876 0 0 0 0 450.072 0 0 0 805.307 2104.18 0 0 0 0 0 1424.99 776.009 0 0 -2375.03 0 0 0 0 0 0 0 -291.986 0 418.485 0 0 0 0 0 0 0 0 0 0 0 0 0 0 0 0 0 0 0 0 0 0 0 
0 0 0 0 1402.55 1181.45 0 -1037.86 0 0 0.04 0 0 0 2200.77 -636.387 0 0 0 -2447.05 0 0 0 0 1952.35 994.98 0 0 0 0 0 0 0 2263.18 0 0 0 0 0 0 0 0 0 0 0 0 0 898.083 0 -1714.15 0 0 0 0 0 1173.36 1761.6 0 0 0 -2354.88 0 0 0 0 0 -1460.84 0 0 357.448 0 0 0 0 0 0 0 0 0 0 0 0 0 
2397.31 0 0 0 0 0 0 0 0 0 0 0.07 -787.606 0 0 0 -1934.03 0 0 0 0 2002.7 -486.999 0 0 1746.96 -214.164 620.365 1293.45 -1482.67 0 0 0 1535.31 0 0 0 998.184 0 0 0 1878.19 0 1267.05 0 -748.238 0 0 -1042.44 0 -259.178 0 0 -1735.97 0 -894.879 0 -2135.15 0 0 0 0 0 659.276 0 0 1307.18 0 0 0 -915.937 0 0 0 0 0 0 0 0 0 -1431.55 0 0 
0 1737.95 0 39.14 0 0 0 0 0 1580.32 0 2318.57 0.04 0 2179.4 0 346.156 -368.892 1450.32 0 0 0 1359.07 1384.09 -894.116 0 0 -1157.8 0 882.519 0 0 0 -1090.35 0 -1211.05 0 0 0 2069.84 0 0 0 0 0 -1063.19 0 0 0 0 0 0 0 0 0 0 0 0 0 0 0 0 0 0 0 0 1673.56 0 0 0 0 -567.873 0 0 0 0 0 0 -1940.75 0 0 0 0 
1426.36 641.118 0 0 0 2374.11 9.99481 0 0 2125.08 0 0 0 0.08 1156.12 0 2155.45 0 0 2006.52 0 0 0 0 -2452.09 441.374 0 0 0 0 0 416.196 -111.927 -64.7755 0 0 0 -1276.36 0 0 0 0 0 -384.457 0 2243.34 767.159 0 1437.5 0 0 -2305.6 0 0 0 -1489.38 0 0 0 0 0 0 0 0 0 0 0 -639.134 0 0 0 0 -1222.04 0 0 0 0 0 0 171.285 0 0 0 
0 0 1000.32 -834.452 0 0 0 0 0 0 1271.94 0 2362.82 -1761.15 0.01 0 -1074.02 0 2044.66 2317.19 0 0 0 0 0 0 0 -839.641 1646.7 0 0 0 0 0 0 0 460.906 0 0 0 0 -1615.27 0 -2445.37 0 0 958.052 0 1040.15 0 1165.27 0 0 0 0 0 0 0 0 0 1138.87 0 0 0 0 1645.48 0 0 0 0 0 0 0 0 0 0 0 0 2484.28 0 0 0 0 
1363.49 0 1074.48 0 0 0 0 0 0 341.731 -2071.37 0 0 0 0 0.05 0 0 0 0 0 0 0 0 1097.06 1994.16 0 -1112.63 2007.89 -2318.57 0 1553.47 0 0 2286.07 0 2258.29 0 922.803 0 0 0 0 0 0 477.691 0 147.938 -281.457 0 0 0 1074.94 0 0 0 0 2185.51 0 0 0 0 0 0 0 0 0 1696.91 0 0 0 0 0 0 0 0 0 -1632.21 0 0 0 0 -1118.12 
1327.78 171.285 0 1313.14 53.0259 0 0 0 1099.05 -2141.25 0 -876.568 1621.83 2427.82 718.94 0 0.03 0 0 0 0 0 0 0 0 0 0 0 0 2091.05 -406.583 0 -2068.16 -2193.75 0 -1164.51 0 0 0 -905.408 0 1685.16 -714.362 0 75.1518 0 0 0 0 0 0 0 0 166.402 0 0 0 0 0 0 0 2409.36 0 0 0 -360.042 -1820.81 0 0 0 0 0 0 1825.54 0 779.519 0 0 0 0 0 0 917.005 
0 -936.079 -784.707 0 0 0 0 0 267.113 1071.89 0 0 1591.46 0 0 0 0 0.09 1602.15 0 943.098 0 0 0 0 0 0 0 0 0 0 1881.69 0 0 0 711.005 0 0 0 0 -519.501 0 0 -575.35 0 0 0 0 569.552 0 0 0 0 0 0 0 0 0 0 -1908.7 0 0 0 0 0 0 0 429.624 2393.03 0 0 845.134 0 0 0 0 0 0 0 0 0 0 0 
0 713.294 0 1311.46 342.952 0 0 0 0 0 0 0 -63.097 0 166.86 0 0 2359.31 0.07 0 0 0 419.706 0 0 0 0 -1054.8 0 0 0 2229.76 0 2134.69 0 0 0 0 2396.69 0 0 888.165 0 0 0 1271.32 0 0 0 -1444.21 0 0 0 -460.143 0 0 0 0 0 0 0 0 0 0 0 2051.68 0 0 0 0 0 0 0 0 0 0 902.203 -619.907 0 0 0 0 0 
0 0 0 0 0 0 -24.1859 0 0 0 2147.97 0 0 1573.92 576.418 0 0 0 0 0.03 0 2030.47 0 288.781 -2328.33 0 0 0 1381.34 1145.59 0 0 -1492.58 0 0 -2.36518 1382.72 0 0 -2201.38 -88.7326 0 0 0 0 0 0 0 1625.49 -1758.25 0 0 0 0 0 0 0 -1678.29 0 0 0 0 0 0 0 0 0 0 0 0 0 0 0 0 1043.66 0 0 0 0 0 941.115 0 992.538 
560.091 738.929 0 1566.74 0 0 0 0 773.11 0 0 0 0 0 0 0 0 -1134.14 0 0 0.07 148.701 0 1704.84 0 0 0 0 1548.59 0 0 1053.73 0 0 0 -586.947 0 -1627.02 0 0 0 0 1218.38 0 0 0 -1027.48 0 0 0 0 0 0 0 0 0 0 0 0 0 0 0 0 0 0 0 0 0 0 0 0 0 0 0 0 0 -1991.26 0 0 0 0 0 0 
0 0 -242.088 0 2095.02 0 1348.38 0 0 0 0 -427.641 0 0 0 0 0 0 0 187.155 -1309.47 0.08 0 0 0 0 0 0 -265.587 0 0 -687.811 0 -1084.4 1977.98 0 0 0 0 249.413 0 -407.193 0 -1174.58 1642.12 0 0 0 0 0 0 0 0 0 0 0 0 1891.46 1016.5 -284.509 0 0 0 0 0 0 0 0 0 0 0 0 0 0 0 0 -76.22 0 0 0 0 1340.45 0 
0 0 2223.2 0 0 2025.74 -2182.3 -994.522 0 0 0 1805.09 1080.13 0 0 0 0 0 -177.084 0 0 0 0.05 2109.97 -2490.54 0 0 0 -1208.61 -205.466 984.756 0 129.933 0 566.195 0 0 0 0 0 0 1151.54 0 0 0 0 0 0 0 0 0 0 0 0 0 0 0 0 0 2362.06 0 664.769 0 0 0 0 0 -1595.74 0 -2263.02 0 0 0 0 0 0 0 0 0 0 0 0 -1625.8 
0 0 -1776.86 0 0 0 0 0 2137.29 1898.94 0 0 1395.23 0 0 0 0 0 0 -1192.59 -1220.21 0 1384.55 0.02 1243.4 0 0 0 0 -1702.7 0 -1866.13 0 2134.08 -686.895 1504.79 0 0 0 -1282.46 2469.18 0 0 0 -2442.47 0 0 0 0 0 0 0 0 0 701.239 0 0 0 0 0 0 0 -1262.78 0 2248.99 0 0 0 0 0 0 0 0 0 -1066.85 0 0 699.408 0 0 0 0 0 
0 0 431.761 -1523.87 0 0 0 0 0 0 2104.63 0 1735.05 2194.51 0 -1097.67 0 0 0 -2281.49 0 0 -592.288 -211.875 0.06 0 0 -1836.53 -47.9904 -871.075 0 0 0 0 2475.59 1868.42 0 -1213.8 0 -171.285 1846.6 0 0 1972.03 0 204.093 0 0 0 0 0 0 0 -450.072 0 0 49.0585 0 0 0 0 0 0 0 0 0 0 0 0 1535.92 0 0 0 0 0 0 -1617.56 0 0 2189.78 -1737.95 0 0 
1302.3 0 0 1675.39 0 0 175.863 1739.48 0 0 1833.78 874.279 0 2417.14 0 2360.99 0 0 0 0 0 0 0 0 0 0.03 0 0 0 0 0 0 0 0 -1318.63 0 -1606.72 0 0 0 1461.76 0 -1012.22 0 0 0 0 0 0 -1197.93 0 0 0 0 0 0 0 0 787.912 0 0 0 0 0 0 0 0 0 0 0 -451.598 0 0 0 0 0 0 0 0 0 -160.604 0 0 
0 -2494.96 0 0 -893.658 0 0 0 0 0 0 972.854 0 0 0 0 0 0 0 0 0 0 0 0 0 0 0.01 0 0 -108.875 0 0 0 0 0 -1315.58 1804.18 0 0 0 0 0 843.303 -174.795 0 0 0 2231.89 2.21259 0 1903.97 0 0 0 0 0 1564.3 618.534 0 0 0 0 0 0 0 0 0 0 0 1923.96 2413.02 0 0 0 0 0 0 0 0 0 0 -2225.49 0 
0 0 0 0 0 0 -2142.48 0 -1193.66 0 0 1677.68 -60.5029 0 -1957.23 -1579.1 0 0 862.529 0 0 0 0 0 -218.284 0 0 0.08 0 1647.01 0 2153.61 0 2369.38 1876.2 -322.657 0 1379.51 0 0 0 2428.28 2060.99 0 0 1388.67 0 0 0 0 0 0 0 0 0 0 0 0 1.14444 0 808.512 0 0 0 0 0 0 0 -1119.19 -1391.57 907.544 0 0 -387.967 0 1905.04 0 0 802.408 90.5637 0 410.398 0 
0 0 570.62 0 0 0 0 0 0 2095.02 0 2208.55 0 0 1078.6 413.449 0 0 0 1195.49 539.491 -2463.38 1023.67 0 1657.99 0 0 0 0.05 352.565 0 0 0 0 -734.657 0 -1741.77 0 0 -933.027 0 0 0 -1723.46 0 0 -1317.41 -1283.84 926.313 0 0 0 0 0 0 0 1765.72 -1356.78 0 0 -1631.75 0 0 0 -701.849 0 0 577.181 0 0 0 0 0 0 0 0 0 0 0 0 0 0 0 
0 0 0 0 0 0 0 375.759 0 2356.87 0 2207.63 -879.925 0 0 -1254.39 -2216.94 0 0 2189.78 0 0 2032.61 -742.744 -95.4466 0 2281.49 -743.66 1466.34 0.05 1020.77 0 0 0 0 0 0 277.49 -808.817 0 0 475.402 0 341.273 0 0 0 0 0 -1633.88 0 0 0 0 0 0 -607.242 0 0 0 0 0 0 0 0 0 0 0 1123 0 0 0 0 0 0 0 -1171.99 0 0 0 0 0 0 
897.931 0 0 0 0 0 0 0 2380.21 0 0 0 0 0 0 0 -1430.48 0 0 0 0 0 345.546 0 0 0 0 0 0 1570.56 0.07 -186.544 761.818 -607.547 0 0 0 0 0 1098.9 0 0 0 0 1779.76 0 0 2251.73 -1763.59 0 0 0 -1931.59 0 0 0 0 0 0 0 0 0 0 0 0 0 0 0 -1638.31 0 0 0 -1477.32 0 0 0 0 0 0 0 0 0 2372.59 
0 0 949.965 0 0 0 2097.77 0 0 0 0 0 0 -414.975 0 -1041.37 0 1992.93 2321.31 0 172.658 -2411.8 0 1107.14 0 0 0 -53.1785 0 0 -1106.37 0.03 0 0 0 500.275 1297.72 0 0 0 0 0 0 0 0 0 0 -171.896 1474.73 0 0 0 1682.87 0 0 0 0 0 0 0 0 0 0 0 0 0 -1603.06 -550.63 0 0 0 881.909 0 0 0 757.698 0 0 2076.56 0 0 0 0 
-1877.27 0 0 0 2295.07 -1160.39 0 0 0 0 0 0 0 1937.7 0 0 557.039 0 0 -580.233 0 0 -2200 0 0 0 0 0 0 0 1417.81 0 0.01 0 0 0 0 0 -1393.09 0 0 1862.93 0 0 1788.92 1139.03 0 279.473 0 0 1345.03 0 0 0 0 0 0 0 0 0 1862.77 -299.31 -370.113 0 0 0 0 0 0 0 36.2407 0 0 0 0 0 0 0 0 0 0 0 0 
891.522 0 -1694.46 0 0 0 0 0 0 0 -880.84 1687.44 -968.429 1166.65 0 0 -975.295 0 2129.66 0 0 -96.82 0 1162.22 0 0 0 2444.91 0 0 475.86 0 0 0 0 0 -1265.07 0 -2104.79 0 0 0 0 0 0 0 0 0 0 0 0 0 0 0 0 0 0 0 0 2436.52 0 1696.6 0 902.203 0 0 0 0 2245.63 0 0 0 0 0 0 0 0 0 0 0 0 0 0 
0 0 0 0 0 -42.0392 0 0 0 1414 0 0 0 0 0 1657.54 0 0 0 0 0 2434.84 219.199 1557.13 -880.078 664.312 0 167.47 1766.03 0 0 0 0 0 0.06 0 0 0 1975.23 0 0 -579.318 0 0 0 0 -689.032 0 0 0 -2311.7 0 -1637.24 1095.23 0 0 0 0 0 0 0 0 0 0 0 0 0 0 0 0 0 0 0 0 0 0 0 -1344.11 1120.72 -1048.39 0 0 0 
0 0 1875.59 0 0 0 0 0 0 0 0 0 546.51 0 0 0 -1499.45 973.617 0 -170.217 -1277.28 0 0 2304.68 1159.17 0 -1409.27 1417.97 0 0 0 -1208.15 0 0 0 0.03 0 0 0 0 0 0 0 0 0 1110.64 0 0 -1789.68 1106.07 0 0 0 0 0 0 0 0 0 0 0 0 0 0 0 0 0 0 0 0 0 0 0 0 0 0 0 0 0 0 -910.901 0 0 
2455.44 0 0 0 0 -407.956 0 1065.32 0 0 0 0 0 0 -733.589 -842.997 0 0 0 193.869 0 0 0 0 0 2065.72 1627.93 0 1158.1 0 0 2083.88 0 -1945.33 0 0 0.01 0 1067.31 0 0 -657.14 0 -1990.04 1272.7 0 -1059.22 0 243.004 -707.343 0 0 0 0 0 0 0 0 -1267.66 0 0 0 0 1467.56 2470.09 0 1618.78 0 0 -1998.58 0 0 0 -127.491 2389.83 -2104.33 0 0 0 0 0 0 0 
2420.19 0 1012.83 951.186 0 1276.97 0 0 -436.491 0 0 -191.122 0 -2392.88 0 0 0 0 0 0 754.036 0 0 0 1594.82 0 0 -459.532 0 -1827.98 0 0 0 0 0 0 0 0 0 863.598 0 0 0 0 0 2368.47 0 1012.83 2179.86 0 0 0 0 0 0 0 0 0 0 0 0 0 0 0 0 0 0 0 0 0 0 0 0 102.618 0 0 0 0 0 0 0 0 751.747 
0 0 0 0 0 0 0 0 0 -724.891 0 0 0 0 0 -1963.79 0 0 -882.061 0 0 0 0 0 0 0 0 0 0 2404.78 0 0 266.045 -111.469 2429.96 0 1591.31 0 0.02 0 0 0 0 0 0 0 0 0 1523.56 0 0 0 -463.195 0 0 0 0 0 0 0 0 0 0 123.829 0 0 0 1892.22 0 0 0 0 0 0 76.6778 0 0 2286.37 178.61 0 683.233 0 629.368 
-175.253 -1000.93 0 2378.99 239.189 0 0 -367.519 0 1860.18 0 0 -1650.36 0 0 0 931.043 0 0 774.331 0 1533.78 0 -1698.13 1236.08 0 0 0 1284.45 0 1418.27 0 0 0 0 0 0 -2054.12 0 0.03 1997.82 828.196 0 0 0 0 -1246.91 0 0 0 -2384.18 0 0 0 1010.09 0 0 0 0 0 0 0 0 0 0 0 0 0 0 0 0 0 0 0 0 0 0 0 -1671.12 0 0 0 0 
0 0 0 0 0 1054.64 0 0 0 0 0 0 0 0 0 0 0 -1291.92 0 1553.47 0 0 0 -2161.85 1406.37 -206.992 0 0 0 0 0 0 0 0 0 0 0 0 0 1200.06 0.07 0 2379.45 0 -201.956 0 1706.21 1535.92 0 0 -48.9059 0 0 0 0 0 0 0 0 0 0 0 0 -1083.48 0 -1360.13 0 0 0 0 0 692.541 0 0 0 0 0 0 0 0 0 -428.556 0 
0 0 0 0 0 0 0 0 238.121 0 0 -751.595 0 0 1720.25 0 -447.172 0 615.329 0 0 1659.06 -917.463 0 0 0 0 -107.349 0 1094.62 0 0 -267.571 0 1569.34 0 -1813.03 0 0 -2350.15 0 0.07 0 0 0 0 0 2300.1 -2046.04 0 0 0 0 0 0 0 0 0 0 0 1961.04 136.036 -1674.17 0 0 0 0 0 0 0 0 0 0 0 0 0 0 0 0 0 922.346 0 0 
0 0 0 0 0 1848.58 1453.98 0 0 0 0 0 0 0 0 0 1489.53 0 0 0 1511.96 0 0 0 0 2096.55 -458.159 1520.2 0 0 0 0 0 0 0 0 0 0 0 0 -280.236 0 0.02 0 1227.68 0 0 743.965 0 0 -353.481 0 0 0 0 600.681 -1918.32 0 0 0 0 0 0 0 0 -929.365 1170.77 0 0 0 0 0 0 0 0 0 0 0 0 580.233 0 0 0 
0 0 0 0 0 -1223.41 0 0 0 0 0 1045.64 0 161.977 -93.6155 0 0 1581.39 0 0 0 1873.61 0 0 2313.38 0 1953.72 0 556.276 968.886 0 0 0 0 0 0 287.561 0 0 0 0 0 0 0.05 0 0 0 -915.326 2376.55 0 0 0 -307.55 0 0 0 -827.128 0 0 0 0 0 0 -269.25 0 0 0 0 0 -283.441 0 0 0 0 0 0 0 0 0 -1441.62 -260.399 0 0 
0 0 0 0 0 0 0 0 1908.4 0 0 0 0 0 0 0 2350.92 0 0 0 0 2027.57 0 -2398.07 0 0 0 0 0 0 -1155.81 0 -1353.11 0 0 0 1663.18 0 0 0 1305.81 0 1557.89 0 0.05 0 0 0 0 -1357.84 0 0 0 0 -370.876 0 0 0 0 0 0 0 0 0 0 0 0 0 0 0 0 0 0 0 0 0 0 0 0 0 0 0 0 
0 1237.91 0 0 0 0 0 0 0 652.867 0 936.842 545.747 287.713 0 -361.11 0 0 432.829 0 0 0 0 0 2095.32 0 0 2253.41 0 0 0 0 385.22 0 0 1877.57 0 2418.82 0 0 0 0 0 0 0 0.05 0 0 1073.87 0 0 1397.82 1043.2 0 1504.79 0 0 0 0 -956.679 0 0 0 0 0 0 0 0 0 0 0 0 0 0 0 0 0 0 0 0 0 0 0 
1382.26 0 0 -388.119 2391.05 0 0 0 0 716.346 0 0 0 -1317.87 731.147 0 0 0 0 0 1460.84 0 0 0 0 0 0 0 189.749 0 0 0 0 0 -220.267 0 598.697 0 0 -1072.95 -1506.78 0 0 0 0 0 0.04 0 0 -110.858 0 0 0 1886.58 0 1876.05 0 0 0 0 0 0 0 0 -1442.53 0 0 2070.91 0 0 0 0 0 -1782.82 0 0 0 0 0 0 0 0 0 
0 632.42 0 -1930.98 0 0 943.251 1527.68 1092.49 0 -2110.28 0 0 0 0 1398.59 0 0 0 0 0 0 0 0 0 0 2045.88 0 -1759.62 0 581.149 1889.02 -1972.03 0 0 0 0 -872.906 0 0 -590.609 757.698 1631.14 1452.3 0 0 0 0.04 0 0 0 0 0 0 0 -1365.78 0 0 0 0 0 0 0 1563.84 0 -43.7178 0 0 0 0 0 0 0 807.291 -237.663 0 828.959 0 389.34 0 0 0 0 
322.199 547.273 -692.999 1509.98 0 1029.92 -1659.06 0 0 0 0 2233.73 0 -1617.1 1601.38 1397.06 0 -1730.93 0 996.658 0 0 0 0 0 0 1992.17 0 -1215.17 0 959.12 1787.85 0 0 0 -1612.06 -1936.93 1914.2 -521.638 0 0 513.703 0 292.749 0 21.897 0 0 0.03 0 0 0 1220.82 0 0 0 0 0 0 0 0 0 0 0 0 -732.063 0 0 0 0 0 0 0 0 0 0 0 0 0 0 0 0 0 
0 0 0 0 696.814 0 -2034.59 0 0 -1171.38 1492.89 0 0 0 0 0 0 0 86.7489 2182.3 0 0 0 0 0 -1719.03 0 0 0 -743.965 0 0 0 0 0 2304.83 499.054 0 0 0 0 0 0 0 2139.73 0 1860.79 0 0 0.08 0 0 0 0 1739.02 1265.83 0 0 1046.71 0 0 0 0 0 0 0 0 2357.63 0 0 -1331.75 0 0 0 0 0 0 0 0 0 0 0 -1218.99 
0 0 0 0 0 0 0 0 0 0 0 2077.17 0 0 -2101.58 0 0 0 0 0 0 0 0 0 0 0 392.697 0 0 0 0 0 2065.87 0 1538.21 0 0 0 0 -582.675 -2039.63 0 334.712 0 0 0 0 0 0 0 0.09 0 0 304.956 0 0 -105.823 0 0 0 0 0 0 0 0 0 0 0 0 0 0 0 0 0 0 0 0 0 0 0 2342.98 0 0 
0 0 0 0 485.321 0 1766.49 0 0 0 0 0 0 -74.3889 0 0 0 0 0 0 0 0 0 0 0 0 0 0 0 0 0 0 0 0 0 0 0 0 0 0 0 0 0 0 0 2438.96 0 0 0 0 0 0.04 0 0 0 0 0 0 0 0 0 0 0 0 0 0 -942.488 0 0 -1865.67 0 0 0 0 0 -940.352 0 0 0 0 0 0 0 
0 -488.372 0 0 0 0 0 0 0 0 0 0 0 0 0 815.683 0 0 0 0 0 0 0 0 0 0 0 0 0 0 -688.116 2117.91 0 0 40.8185 0 0 0 2487.49 0 0 0 0 -696.203 0 -1521.58 0 0 1297.42 0 0 0 0.05 1624.12 0 0 0 0 0 0 0 0 0 0 0 0 0 0 0 0 0 0 0 0 -2084.03 0 0 0 0 0 0 0 0 
0 -1385.31 0 0 0 0 0 0 0 0 0 189.444 0 0 0 0 1822.03 0 -544.069 0 0 0 0 0 -587.863 0 0 0 0 0 0 0 0 0 -1751.69 0 0 0 0 0 0 0 0 0 0 0 1538.97 0 0 0 1793.95 0 2373.04 0.09 0 0 0 0 0 0 0 0 0 0 0 0 0 0 0 0 0 0 -2151.63 0 0 0 0 0 0 -1092.03 1640.29 0 0 
1143.15 0 0 0 0 0 0 0 0 0 0 0 0 0 0 0 0 0 0 0 0 0 0 -1351.59 0 0 0 0 0 0 0 0 0 0 0 0 0 0 0 1554.08 0 0 0 0 -1262.63 1762.06 0 0 0 1501.74 0 0 0 0 0.05 0 0 0 0 1714.91 0 0 1479 0 0 0 0 1639.38 0 0 0 0 1964.4 0 0 2421.26 0 0 0 0 0 0 0 
0 0 0 0 0 0 0 0 0 0 -2228.39 2477.42 0 1909.31 0 0 0 0 0 0 0 0 0 0 0 0 0 0 0 0 0 0 0 0 0 0 0 0 0 0 0 0 -2382.35 0 0 0 915.632 2201.22 0 -370.876 0 0 0 0 0 0.08 0 0 0 0 0 0 0 0 0 0 0 0 -599.002 0 0 1596.96 -1905.8 0 0 0 0 0 0 0 0 1574.07 0 
0 0 0 0 0 0 0 0 0 0 1871.62 0 0 0 0 0 0 0 0 0 0 0 0 0 681.707 0 1798.84 0 1569.95 -1232.26 0 0 0 0 0 0 0 0 0 0 0 0 1507.23 1287.8 0 0 0 0 0 0 -870.464 0 0 0 0 0 0.01 0 0 0 0 0 426.115 1695.84 1174.73 -1052.81 0 0 0 0 0 0 0 0 0 0 0 -1139.48 0 0 0 0 0 
0 0 0 0 0 878.094 0 0 0 571.688 0 -2158.35 0 0 0 1674.47 0 0 0 1951.58 0 1248.89 0 0 0 0 889.081 0 -975.448 0 0 0 0 0 0 0 0 0 0 0 0 0 0 0 0 0 0 0 0 0 0 0 0 0 0 0 0 0.08 2192.68 -1158.86 0 1172.75 0 0 0 0 0 0 0 0 0 -910.749 0 0 0 0 0 0 0 -927.992 0 0 0 
0 0 0 0 0 0 0 0 0 0 0 0 0 0 0 0 0 0 0 0 0 1198.08 0 0 0 37.3089 0 1676.76 0 0 0 0 0 0 0 0 -385.372 0 0 0 0 0 0 0 0 0 0 0 0 1940.6 0 0 0 0 0 0 0 -2060.38 0.02 0 0 0 0 0 0 0 0 0 0 0 0 0 0 0 0 0 0 0 0 0 0 0 2330.93 
0 0 0 0 1682.26 0 0 1746.04 0 437.559 0 0 0 0 0 0 0 1713.39 0 0 0 -750.679 -1424.38 0 0 0 0 0 0 0 0 0 0 2206.72 0 0 0 0 0 0 0 0 0 0 0 126.881 0 0 0 0 0 0 0 0 968.886 0 0 -2210.99 0 0.03 0 -41.8867 0 0 0 0 0 0 0 0 0 0 0 0 0 -2275.84 0 0 0 0 0 0 0 
0 0 0 0 0 2224.72 0 2099.29 0 0 -1497.01 0 0 0 1385.01 0 0 0 0 0 0 0 0 0 0 0 0 -736.183 2166.28 0 0 0 1350.22 0 0 0 0 0 0 0 0 687.048 0 0 0 0 0 0 0 0 0 0 0 0 0 0 0 0 0 0 0.05 0 0 152.364 0 0 0 0 0 0 0 0 0 0 0 0 0 0 0 -638.676 0 0 0 
0 0 0 1826.46 0 0 0 0 0 0 0 0 0 0 0 0 -1141.47 0 0 0 0 0 1080.43 0 0 0 0 0 0 0 0 0 -469.298 1474.73 0 0 0 0 0 0 0 1897.56 0 0 0 0 0 0 0 0 0 0 0 0 0 0 0 1963.79 0 -2354.58 0 0.09 0 0 0 -189.291 0 0 0 0 0 0 0 0 0 0 0 0 0 1460.69 0 1310.85 0 
0 0 0 0 0 -1530.73 0 0 0 0 0 0 0 0 0 0 0 0 0 0 0 0 0 60.5029 0 0 0 0 0 0 0 0 1621.37 0 0 0 0 0 0 0 0 -546.205 0 0 0 0 0 0 0 0 0 0 0 0 861.003 0 1883.22 0 0 0 0 0 0.01 0 0 0 0 0 0 0 0 0 0 0 0 0 0 0 -584.353 0 0 0 0 
0 -1172.6 0 0 0 -1242.18 -1401.94 0 0 0 0 2183.68 0 0 0 0 0 0 0 0 0 0 0 0 0 0 0 0 0 0 0 0 0 1192.28 0 0 1724.07 0 1376.77 0 -36.2407 0 0 1329.46 0 0 0 1076.77 0 0 0 0 0 0 0 0 -2168.87 0 0 0 1247.37 0 0 0.04 0 0 0 0 0 0 0 0 0 0 0 0 0 0 2238.46 0 0 0 0 
0 0 0 0 -2380.37 0 0 0 0 0 0 0 0 0 0 0 0 0 0 0 0 0 0 -358.058 0 0 0 0 -18.54 0 0 0 0 0 0 0 2411.95 0 0 0 0 0 0 0 0 0 1456.88 0 0 0 0 0 0 0 0 0 1639.53 0 0 0 0 0 0 0 0.03 0 994.522 0 0 -1117.21 0 0 0 0 0 0 0 0 0 0 0 -912.122 0 
-2430.72 0 0 -142.903 0 0 0 0 0 0 0 0 0 0 -1253.93 0 1598.03 0 1241.42 0 0 0 0 0 0 0 0 0 0 0 0 0 0 0 0 0 0 0 0 0 2350.76 0 -2099.9 0 0 0 0 1812.57 -413.449 0 0 0 0 0 0 0 -413.907 0 0 0 0 689.947 0 0 0 0.03 0 0 0 0 0 0 0 0 0 -530.335 826.212 0 0 0 0 0 0 
0 0 0 1201.44 0 0 0 0 0 0 -682.165 -1692.02 2403.87 0 0 0 2030.93 0 0 0 0 0 0 0 0 0 0 0 0 0 0 2440.18 0 0 0 0 -2193.44 0 0 0 0 0 2141.25 0 0 0 0 0 0 0 0 1697.52 0 0 0 0 0 0 0 0 0 0 0 0 1990.8 0 0.07 0 0 0 -778.298 0 0 0 1552.25 -815.683 -1207.85 0 267.571 0 0 0 0 
0 0 0 0 0 0 0 0 0 0 0 0 0 18.8452 0 1567.05 0 -2257.07 0 0 0 0 1772.29 0 0 0 0 0 853.984 0 0 1410.79 0 0 0 0 0 0 1222.65 0 0 0 0 0 0 0 -2039.93 0 0 2359.31 0 0 0 0 1372.95 0 0 0 0 0 0 0 0 0 0 0 0 0.04 0 0 0 0 0 0 0 0 0 0 0 0 0 0 0 
1900.62 0 0 0 0 0 0 0 0 0 0 0 0 0 0 0 0 1731.24 0 0 0 0 0 0 0 0 0 2160.79 0 -1892.53 -1620.61 0 0 -1395.84 0 0 0 0 0 0 0 0 0 0 0 0 0 0 0 0 0 0 0 0 0 -53.9415 0 0 0 0 0 0 0 0 0 0 0 0 0.05 0 0 0 2344.66 0 0 0 0 0 2230.22 0 0 0 993.149 
0 0 0 0 0 0 0 0 2206.72 0 -47.2274 0 0 0 0 0 0 0 0 0 0 0 2422.18 0 -1093.55 0 1156.42 981.246 0 0 0 0 0 0 0 0 -2028.64 0 0 0 0 0 0 2296.75 0 0 0 0 0 0 0 1182.06 0 0 0 0 0 0 0 0 0 0 0 0 -556.734 0 0 0 0 0.01 245.293 0 2075.79 0 -2203.67 0 0 0 0 0 0 0 1800.82 
0 0 0 0 0 0 0 -1403.93 0 0 0 708.106 0 0 0 0 0 0 0 0 0 0 0 0 0 2323.91 212.485 1849.8 0 0 0 0 704.138 0 0 0 0 0 0 0 0 0 0 0 0 0 0 0 0 1263.08 0 0 0 0 0 0 0 0 0 0 0 0 0 0 0 0 824.686 0 0 -2142.93 0.05 -298.7 0 0 0 0 0 0 0 0 0 -1441.47 0 
2365.57 1704.08 0 0 0 0 0 0 0 0 0 0 82.6289 0 0 0 0 1762.83 0 0 0 0 0 0 0 0 0 0 0 0 0 2151.94 0 0 0 0 0 0 0 0 435.118 0 0 0 0 0 0 0 0 0 0 0 0 0 0 1489.07 0 2221.98 0 0 0 0 0 0 0 0 0 0 0 0 -2093.65 0.08 0 0 -1713.69 1805.09 0 0 0 0 0 0 0 
0 -825.144 441.832 0 0 0 0 -145.497 0 0 0 0 0 -871.99 0 0 0 0 0 0 0 0 0 0 0 0 0 0 0 0 139.546 0 0 0 0 0 0 0 0 0 0 0 0 0 0 0 0 0 0 0 0 0 0 838.725 -330.439 1639.23 0 0 0 0 0 0 0 0 0 0 0 0 2363.73 2362.36 0 0 0.06 0 1018.33 0 0 0 2261.04 0 1010.85 0 0 
-1587.95 0 0 0 0 0 0 0 0 0 0 0 0 0 0 0 565.737 0 0 0 0 0 0 0 0 0 0 714.362 0 0 0 0 0 0 0 0 1353.57 1884.75 0 0 0 0 0 0 0 0 -160.604 -433.287 0 0 0 0 0 0 0 0 0 0 0 0 0 0 0 0 0 0 0 0 0 0 0 0 0 0.03 0 0 0 0 0 0 0 0 0 
0 0 2468.11 0 0 0 0 0 -620.212 0 0 0 0 0 0 0 0 0 0 315.332 0 0 0 1298.03 0 0 0 0 0 0 0 0 0 0 0 0 1501.13 0 -57.2985 0 0 0 0 0 0 0 0 1828.14 0 0 0 0 -981.857 0 0 0 0 0 0 0 0 0 0 0 0 0 597.629 0 0 -2007.13 0 -2113.64 -596.561 0 0.07 0 0 0 0 0 0 -948.286 0 
0 0 0 0 0 0 935.469 0 0 0 0 0 0 0 0 0 1485.11 0 0 0 0 0 0 0 0 0 0 -1550.11 0 0 0 1842.94 0 0 0 0 -833.842 0 0 0 0 0 0 0 0 0 0 0 0 0 0 2458.95 0 0 973.922 0 0 0 0 -466.552 0 0 0 0 0 2272.48 448.393 0 0 0 0 254.753 0 0 0 0.07 0 0 0 0 0 0 -348.292 
0 0 0 0 0 -121.387 0 0 0 0 0 0 0 0 0 0 0 0 1472.75 0 1220.36 1298.49 0 0 -978.5 0 0 0 0 -1335.26 0 0 0 0 0 0 0 0 0 0 0 0 0 0 0 0 0 -883.282 0 0 0 0 0 0 0 0 0 0 0 0 0 0 0 0 0 -1278.8 2379.45 0 0 0 0 0 0 0 0 0 0.09 0 0 0 0 0 0 
0 0 -1187.7 0 0 0 0 0 0 0 0 0 0 0 0 -1025.65 0 0 1244.01 0 0 0 0 1784.95 0 0 0 0 0 0 0 0 0 0 806.07 0 0 0 1582.31 0 0 0 0 0 0 0 0 0 0 0 0 0 0 0 0 0 2275.08 0 0 0 0 0 0 0 0 0 0 0 0 0 0 0 0 0 0 0 0 0.09 0 0 -2271.42 0 0 
0 0 -1598.64 0 1596.5 0 0 0 0 0 0 0 2434.08 0 1589.33 0 0 0 0 0 0 0 0 0 0 0 0 1348.08 0 0 0 872.6 0 0 461.974 0 0 0 367.367 1753.67 0 0 0 0 0 0 0 243.309 0 0 0 0 0 0 0 0 0 0 0 0 0 0 -1531.5 845.439 0 0 2391.66 0 -473.418 0 0 0 -1781.29 0 0 0 0 0 0.07 0 0 0 0 
0 0 0 0 0 0 0 0 0 0 0 0 0 1162.83 0 0 0 0 0 0 0 0 0 0 -1320.92 0 0 -1613.9 0 0 0 0 0 0 1944.72 0 0 0 0 0 0 0 -142.75 1796.24 0 0 0 0 0 0 0 0 0 2459.26 0 0 0 1476.56 0 0 -63.2496 -261.773 0 0 0 0 0 0 0 0 0 0 0 0 0 0 0 0 0 0.04 0 0 0 
0 0 0 0 1270.71 0 0 0 0 0 0 -599.918 0 0 0 0 0 0 0 2257.68 0 0 0 0 847.728 971.175 0 0 0 0 0 0 0 0 0 1704.23 0 0 -346.309 0 0 183.34 0 766.091 0 0 0 0 0 0 -2361.29 0 0 -2358.7 0 0 0 0 0 0 0 0 0 0 0 0 0 0 0 0 0 0 389.95 0 0 0 0 2006.06 0 0 0.05 0 0 
0 0 -1178.09 0 0 0 0 0 0 0 0 0 0 0 0 0 0 0 0 0 0 2050.46 0 0 0 0 311.365 456.633 0 0 0 0 0 0 0 0 0 0 0 0 1398.59 0 0 0 0 0 0 0 0 0 0 0 0 0 0 2050 0 0 0 0 0 704.749 0 0 1835 0 0 0 0 0 635.014 0 0 0 -1791.82 0 0 0 0 0 0 0.01 0 
0 -1858.2 0 0 0 1527.22 0 0 0 0 0 0 0 0 0 1222.95 -234.916 0 0 1286.28 0 0 -33.0363 0 0 0 0 0 0 0 20.5237 0 0 0 0 0 0 -1056.63 567.11 0 0 0 0 0 0 0 0 0 0 -956.374 0 0 0 0 0 0 0 0 1724.07 0 0 0 0 0 0 0 0 0 1048.39 1246.15 0 0 0 0 0 888.928 0 0 0 0 0 0 0.07 
