*Vertices 57
*Matrix 
0.05 0 0 0 0 0 0 0 0 0 0 1770.91 0 0 0 2478.64 0 0 0 0 1357.23 0 0 0 0 0 0 -29.6793 0 2031.69 -1235.47 0 0 0 0 0 0 0 0 0 -1721.02 0 0 0 0 0 0 0 0 0 0 1604.59 0 0 0 1547.98 0 
0 0.05 0 0 -1933.88 0 0 0 1064.71 759.072 2005.91 -438.932 0 0 0 0 0 612.735 -1855.45 0 0 0 0 2128.9 0 0 1395.08 0 0 2302.55 0 0 0 907.849 0 0 0 0 0 0 0 770.516 0 0 0 0 0 0 -1433.84 1236.53 0 0 0 0 0 0 0 
0 0 0.02 803.323 0 -1696.45 708.258 98.9563 -733.589 0 0 503.021 0 0 0 0 -346.919 0 2361.75 0 0 0 0 0 2162.77 447.172 374.691 2359 0 0 0 0 0 0 0 0 1425.29 0 1724.98 0 0 -42.0392 0 0 0 0 0 0 0 0 0 0 0 0 0 0 -1143.15 
0 0 1309.17 0.02 0 0 0 0 0 0 0 0 -691.626 0 0 0 0 0 0 0 667.669 0 2464.6 0 0 0 0 0 0 0 1131.24 0 0 0 1557.13 0 0 0 0 0 0 0 -1467.25 0 0 0 -837.962 0 0 0 1174.12 0 0 0 0 0 -324.793 
0 -1620.15 0 0 0.04 2019.79 1403.47 1587.34 1486.18 0 -1773.96 0 0 0 0 0 0 0 0 0 0 1914.2 0 306.635 0 0 0 0 -891.369 -1920.45 0 0 694.372 0 430.692 0 0 0 0 0 0 0 0 0 0 0 0 -1324.73 0 0 0 0 0 0 0 0 0 
0 0 928.602 0 136.952 0.05 2227.62 0 -1565.98 -1310.54 -1824.02 1353.72 0 485.015 1173.51 0 0 0 0 0 0 1883.68 0 -2201.07 0 0 0 2441.86 792.795 0 1709.11 333.033 1912.67 0 0 -1393.25 0 0 0 0 0 0 0 0 0 0 0 0 60.0452 0 -2080.52 0 0 0 0 0 0 
0 0 2414.24 0 2230.06 -521.485 0.01 19.7607 0 0 0 0 0 2127.06 0 0 0 0 0 0 0 -1284.3 0 0 0 0 0 0 0 0 0 0 -362.789 -434.355 -1333.89 0 0 0 0 77.2881 0 0 0 0 1873 0 0 0 0 0 0 0 0 0 0 0 0 
0 0 -1815.47 0 650.426 0 2382.2 0.04 1173.06 0 0 0 0 0 0 1586.43 0 0 -754.799 -2108.45 1396.91 -504.242 1894.67 1371.12 0 0 1766.34 0 0 1995.53 0 -1775.49 0 0 0 0 0 0 0 0 0 0 1835.15 0 0 0 0 -2374.57 0 2486.11 0 0 0 -2351.22 0 -775.094 0 
0 -39.7504 -94.0733 0 1581.55 774.026 0 2101.73 0.09 -433.897 80.6452 0 0 1751.53 0 0 0 -641.881 0 1106.52 0 0 0 0 0 0 190.512 0 0 0 0 0 0 0 2357.78 0 0 0 0 0 0 0 0 0 0 0 0 0 0 0 0 0 0 0 -440.916 0 0 
0 -2216.18 0 0 0 1607.64 0 0 -1033.13 0.03 1209.83 0 0 0 0 1634.34 0 0 0 0 0 0 52.5681 0 0 0 0 969.649 704.901 0 -395.901 0 0 0 0 0 0 0 0 -2116.99 0 0 0 0 357.448 0 0 0 0 -254.295 0 0 -265.893 0 0 0 0 
0 402.31 0 0 228.05 1774.12 0 0 -2466.28 -1614.66 0.09 0 0 0 0 0 0 0 -296.716 0 604.801 1916.94 0 1504.64 0 479.827 0 0 0 0 0 0 0 777.993 682.318 1601.84 0 1425.14 0 0 0 0 0 0 0 0 0 0 0 0 0 0 0 2351.37 0 0 0 
1726.2 -933.027 1176.26 0 0 437.559 0 0 0 0 0 0.03 0 0 0 0 0 2318.11 0 0 465.178 -1773.05 0 684.149 0 0 0 0 0 0 0 0 0 0 0 0 0 0 0 199.973 0 0 0 0 0 0 0 0 0 0 0 0 0 0 0 0 0 
0 0 0 1168.94 0 0 0 0 0 0 0 0 0.08 0 2224.27 1764.05 0 0 0 0 0 0 0 0 0 2050.92 -1466.49 1000.02 0 -2297.2 -143.818 0 0 1343.65 -1496.55 0 0 0 0 0 2000.56 0 2055.35 0 0 0 0 0 0 0 0 0 0 0 0 1084.55 0 
0 0 0 0 0 458.922 -2426.91 0 598.697 0 0 0 0 0.07 0 0 -695.746 0 0 1073.72 -1661.5 0 0 0 540.101 0 0 2471.92 0 0 0 0 0 453.581 0 0 -1062.58 -80.6452 1586.73 0 0 0 0 1901.53 0 0 0 0 0 616.245 0 0 0 0 -1314.66 0 -1142.99 
0 0 0 0 0 -156.178 0 0 0 0 0 0 1082.57 0 0.01 0 1879.71 0 0 0 751.9 1492.89 1420.56 672.399 0 0 0 0 0 0 0 0 333.644 0 -297.174 -1260.19 0 1332.06 0 0 0 0 0 0 545.137 0 0 0 0 0 -1430.94 0 0 0 0 0 0 
1797.92 0 0 0 0 0 0 1834.39 0 179.983 0 0 182.119 0 0 0.01 0 1559.57 0 0 2185.05 0 0 0 2348.63 0 0 0 0 0 0 771.889 0 669.958 0 0 0 0 0 0 0 0 0 0 -801.34 0 0 0 0 0 0 0 1721.02 0 0 0 0 
0 0 -2079.91 0 0 0 0 0 0 0 0 0 0 986.435 2454.37 0 0.05 0 0 1547.06 0 0 336.238 0 -1730.17 1510.74 0 0 0 1358.46 0 0 0 -1710.94 0 0 0 0 0 0 0 0 0 0 0 0 0 0 0 0 985.977 2171.01 -754.646 0 -956.984 0 0 
0 -949.355 0 0 0 0 0 0 1308.4 0 0 -1318.32 0 0 0 2017.04 0 0.02 0 0 0 0 0 648.442 -2168.87 0 0 1554.23 0 994.217 319.758 0 0 -1496.09 0 0 0 0 0 0 0 0 0 0 0 0 0 0 0 0 0 0 0 0 0 0 0 
0 -1348.23 892.895 0 0 0 0 2428.74 0 0 -1208.3 0 0 0 0 0 0 0 0.02 2258.9 0 0 0 2498.32 0 0 0 464.721 0 0 0 0 0 0 2201.83 0 0 0 0 0 0 0 0 0 0 0 0 0 0 774.331 0 0 0 0 0 0 0 
0 0 0 0 0 0 0 1196.4 -1352.66 0 0 0 0 2275.84 0 0 -2325.89 0 1468.93 0.04 0 1954.33 -1186.33 0 0 0 0 0 -1200.83 -1035.57 0 573.519 1392.48 990.555 0 511.872 0 0 2256.61 0 0 0 0 0 0 0 0 0 0 0 0 0 0 0 0 0 0 
-1996.75 0 0 -1441.47 0 0 0 1136.13 0 0 822.855 -1774.42 0 776.162 -331.965 2418.36 0 0 0 0 0.03 0 0 0 0 0 0 1807.69 -1131.09 0 2410.58 1752.91 0 0 0 -1405.15 0 0 0 0 0 0 0 0 1681.8 0 0 0 0 0 0 0 0 0 0 0 0 
0 0 0 0 2156.21 1974.47 -1310.39 664.922 0 0 975.906 2180.78 0 0 -383.236 0 0 0 0 -2346.95 0 0.06 0 -1665.01 -1155.81 0 209.281 0 0 284.814 0 0 2067.09 0 -801.798 0 0 0 0 0 0 0 0 0 0 0 0 0 -93.6155 0 0 0 0 0 0 0 0 
0 0 0 2391.05 0 0 0 1312.68 0 904.34 0 0 0 0 573.367 0 1574.83 0 0 1601.84 0 0 0.09 0 0 0 0 2149.19 0 0 0 0 0 193.106 0 0 0 -97.2777 0 0 0 0 0 0 0 0 231.559 0 0 0 0 0 0 0 0 0 0 
0 2104.63 0 0 1126.06 -2096.24 0 -1801.28 0 0 -60.9607 1125.75 0 0 -2300.26 0 0 583.895 -449.919 0 0 -362.636 0 0.01 1703.92 0 0 1557.44 0 -947.676 0 2486.57 2373.81 0 0 -2019.49 0 0 0 0 0 0 0 0 0 1891.31 0 0 0 0 0 0 0 212.79 0 0 0 
0 0 -1607.79 0 0 0 0 0 0 0 0 0 0 -1546.45 0 1704.38 1179.46 1942.73 0 0 0 -325.709 0 2035.81 0.05 0 0 0 2390.9 -546.052 1273.77 0 0 -2394.25 0 0 0 0 1523.1 0 0 0 0 -126.118 0 0 0 -1219.44 0 0 0 0 0 -2459.11 -1130.33 809.885 0 
0 0 -2419.58 0 0 0 0 0 0 0 2009.72 0 2382.96 0 0 0 -413.449 0 0 0 0 0 0 0 0 0.09 -1061.66 0 0 2207.48 0 0 0 0 0 0 0 0 0 0 0 0 0 0 0 0 2258.6 -1802.04 0 0 0 -2060.23 0 0 0 0 0 
0 1053.88 -2272.79 0 0 0 0 -1556.98 2493.44 0 0 0 -1279.41 0 0 0 0 0 0 0 0 2484.13 0 0 0 1628.24 0 0 -73.7785 0 1707.74 -406.735 0 1802.96 0 0 0 0 0 -1165.27 0 0 1247.67 0 0 0 0 0 0 0 0 0 2063.13 399.258 1172.6 0 0 
877.636 0 -562.685 0 0 2064.04 0 0 0 1287.65 0 0 -2156.82 1582.61 0 0 0 366.451 -65.0807 0 2095.93 0 -1117.05 1930.37 0 0 0 0 2235.25 -656.072 0 -1368.37 1289.48 -815.989 0 0 0 0 0 0 0 0 1584.44 2160.48 0 0 0 0 0 0 0 1773.66 0 1293.76 0 0 0 
0 0 0 0 -781.35 907.697 0 0 0 1632.97 0 0 0 0 0 0 0 0 0 1765.88 -1168.63 0 0 0 1419.03 0 940.046 -1874.52 0.05 168.538 702.307 0 0 0 0 -245.75 0 0 0 0 -2499.54 0 0 0 0 0 0 0 0 0 0 0 0 0 0 0 0 
366.451 2084.49 0 0 656.529 0 0 -1344.11 0 0 0 0 1932.81 0 0 0 -2344.81 1350.83 0 -883.129 0 -1605.81 0 -846.355 -1078.3 -1240.04 0 2265.47 1907.18 0.01 0 -431.455 0 0 17.1667 1044.88 2151.63 0 -409.635 0 0 0 0 0 0 2296.14 -1679.05 0 0 2072.28 0 0 0 -2129.35 0 0 0 
-1124.99 0 0 1108.05 0 745.186 0 0 0 1870.1 0 0 2455.6 0 0 0 0 -565.127 0 0 -1300.62 0 0 0 617.161 0 2486.11 0 -672.857 0 0.05 0 180.746 0 0 0 0 0 0 0 310.297 0 0 0 0 0 0 0 0 0 0 0 0 0 0 0 0 
0 0 0 0 0 -95.5992 0 2334.59 0 0 0 0 0 0 0 2398.83 0 0 0 -328.15 1986.68 0 0 -786.233 0 0 2017.81 -706.122 0 1481.75 0 0.08 1695.84 0 0 0 0 0 0 0 0 -267.876 0 0 0 0 0 0 0 0 0 0 0 0 0 0 0 
0 0 0 0 1679.2 2092.88 -271.233 0 0 0 0 0 0 0 2097.31 0 0 0 0 -150.533 0 679.266 0 1681.95 0 0 0 -2021.47 0 0 -1576.51 1050.22 0.04 0 0 0 0 0 0 0 0 0 0 0 0 0 0 0 -1195.79 0 0 -1940.44 0 0 0 0 0 
0 1721.78 0 0 0 0 2341 0 0 0 -369.503 0 -2024.67 -513.092 0 -2250.05 186.392 1542.02 0 2291.1 0 0 -2169.94 0 -9.53703 0 -810.953 2222.13 0 0 0 0 0 0.08 0 0 0 1054.34 0 0 0 0 0 0 0 0 -803.781 0 0 0 0 0 0 0 0 0 0 
0 0 0 -799.966 -702.765 0 2253.87 0 541.475 0 -210.196 0 1635.56 0 -1196.25 0 0 0 962.477 0 0 374.386 0 0 0 0 0 0 0 -1472.14 0 0 0 0 0.01 0 470.367 1032.52 0 0 1217.61 0 0 0 0 0 0 0 0 0 -1737.8 0 0 0 -1633.88 0 0 
0 0 0 0 0 1960.59 0 0 0 0 -1799.6 0 0 0 2325.59 0 0 0 0 -273.98 -373.928 0 0 589.389 0 0 0 0 1917.25 2119.74 0 0 0 0 0 0.03 0 0 0 0 0 0 -1193.66 0 0 0 0 0 0 0 0 0 0 0 0 0 0 
0 0 1712.01 0 0 0 0 0 0 0 0 0 0 859.02 0 0 0 0 0 0 0 0 0 0 0 0 0 0 0 559.633 0 0 0 0 -56.3829 0 0.03 0 0 1148.49 -966.14 0 0 0 0 0 0 0 787.606 0 0 0 0 0 0 0 0 
0 0 0 0 0 0 0 0 0 0 -597.324 0 0 1651.59 -1377.83 0 0 0 0 0 0 0 -881.603 0 0 0 0 0 0 0 0 0 0 1520.81 2147.51 0 0 0.04 0 0 0 0 0 -6.94296 0 0 -503.021 0 0 0 0 0 0 0 0 0 0 
0 0 -2499.69 0 0 0 0 0 0 0 0 0 0 -873.363 0 0 0 0 0 2030.02 0 0 0 0 1543.09 0 0 0 0 1839.12 0 0 0 0 0 0 0 0 0.08 0 0 1764.66 0 0 0 0 0 0 0 0 0 0 0 0 0 0 0 
0 0 0 0 0 0 -1769.08 0 0 844.371 0 561.922 0 0 0 0 0 0 0 0 0 0 0 0 0 0 257.195 0 0 0 0 0 0 0 0 0 777.23 0 0 0.02 0 0 838.725 0 0 332.27 0 0 0 0 0 0 -1429.26 0 0 0 0 
-1134.45 0 0 0 0 0 0 0 0 0 0 0 -794.168 0 0 0 0 0 0 0 0 0 0 0 0 0 0 0 950.88 0 -67.217 0 0 0 2432.1 0 1251.49 0 0 0 0 0 0 0 0 0 0 0 0 0 0 0 0 -1355.4 0 0 0 
0 -1998.73 2305.75 0 0 0 0 0 0 0 0 0 0 0 0 0 0 0 0 0 0 0 0 0 0 0 0 0 0 0 0 -1603.82 0 0 0 0 0 0 1449.4 0 0 0.06 1815.62 -401.7 0 0 0 996.048 0 0 0 0 0 0 0 0 0 
0 0 0 -1329.46 0 0 0 1144.98 0 0 0 0 1179.77 0 0 0 0 0 0 0 0 0 0 0 0 0 -1204.49 2457.88 0 0 0 0 0 0 0 -1036.94 0 0 0 607.852 0 1249.05 0 0 0 0 0 0 0 -1170.92 0 0 0 0 48.1429 0 0 
0 0 0 0 0 0 0 0 0 0 0 0 0 -1785.26 0 0 0 0 0 0 0 0 0 0 -18.3874 0 0 1985.76 0 0 0 0 0 0 0 0 0 2221.67 0 0 0 817.515 0 0.02 0 0 0 0 0 0 -660.955 0 0 0 0 359.737 0 
0 0 0 0 0 0 -1739.94 0 0 1847.82 0 0 0 0 -1836.83 1752.45 0 0 0 0 299.005 0 0 0 0 0 0 0 0 0 0 0 0 0 0 0 0 0 0 0 0 0 0 0 0.09 743.507 0 0 0 0 0 0 0 0 0 0 0 
0 0 0 0 0 0 0 0 0 0 0 0 0 0 0 0 0 0 0 0 0 0 0 1950.67 0 0 0 0 0 -2112.26 0 0 0 0 0 0 0 0 0 1501.74 0 0 0 0 2391.2 0.08 0 0 0 0 -1521.12 0 0 0 0 0 0 
0 0 0 -298.7 0 0 0 0 0 0 0 0 0 0 0 0 0 0 0 0 0 0 -211.112 0 0 1299.86 0 0 0 2237.69 0 0 0 1682.56 0 0 0 1999.5 0 0 0 0 0 0 0 0 0.01 0 0 0 0 0 0 0 0 0 0 
0 0 0 0 1579.56 0 0 1010.85 0 0 0 0 0 0 0 0 0 0 0 0 0 0 0 0 839.335 2118.82 0 0 0 0 0 0 0 0 0 0 0 0 0 0 0 -673.925 0 0 0 0 0 0.04 0 0 0 0 0 0 0 0 0 
0 545.747 0 0 0 -11.063 0 0 0 0 0 0 0 0 0 0 0 0 0 0 0 1062.43 0 0 0 0 0 0 0 0 0 0 -2295.53 0 0 0 1618.78 0 0 0 0 0 0 0 0 0 0 0 0.04 0 -305.719 0 0 0 0 0 0 
0 956.832 0 0 0 0 0 1880.47 0 -454.344 0 0 0 1739.78 0 0 0 0 -1472.75 0 0 0 0 0 0 0 0 0 0 -486.084 0 0 0 0 0 0 0 0 0 0 0 0 2477.42 0 0 0 0 0 0 0 0 0 0 0 0 0 2324.37 
0 0 0 -597.018 0 344.02 0 0 0 0 0 0 0 0 -1959.82 0 -162.13 0 0 0 0 0 0 0 0 0 0 0 0 0 0 0 0 0 332.575 0 0 0 0 0 0 0 0 1641.97 0 1010.24 0 0 631.657 0 0.06 0 905.255 0 0 -648.9 0 
2322.84 0 0 0 0 0 0 0 0 0 0 0 0 0 0 0 -2292.93 0 0 0 0 0 0 0 0 2006.36 0 2330.93 0 0 0 0 -1174.73 0 0 0 0 0 0 0 0 0 0 0 0 0 0 0 0 0 0 0.06 0 0 0 -2309.26 0 
0 0 0 0 0 0 0 0 0 1956.16 0 0 0 0 0 373.623 574.282 0 0 0 0 0 0 0 0 0 -2307.89 0 0 0 0 0 0 0 0 0 0 0 0 1100.73 0 0 0 0 0 0 0 0 0 0 -1159.47 0 0.06 0 0 0 77.7459 
0 0 0 0 0 0 0 -2226.4 0 0 1339.99 0 0 0 0 0 0 0 0 0 0 0 0 1998.28 -506.378 0 767.769 -99.8718 0 1728.34 0 0 0 0 0 0 0 0 0 0 1271.48 0 0 0 0 0 0 0 0 0 0 0 0 0.04 -40.8185 0 -87.6644 
0 0 0 0 0 0 0 0 -799.966 0 0 0 0 1658.15 0 0 1273.16 0 0 0 0 0 0 0 656.987 0 -37.7667 0 0 0 0 0 0 0 -1244.32 0 0 0 0 0 0 0 2109.67 0 0 0 0 0 0 0 0 0 0 502.106 0.09 0 0 
-503.174 0 0 0 0 0 0 -316.858 0 0 0 0 2104.63 0 0 0 0 0 0 0 0 0 0 0 193.564 0 0 0 0 0 0 0 0 0 0 0 0 0 0 0 0 0 0 2466.58 0 0 0 0 0 0 2426.3 549.867 0 0 0 0.08 -1349.3 
0 0 -1457.03 2478.48 0 0 0 0 0 0 0 0 0 -247.429 0 0 0 0 0 0 0 0 0 0 0 0 0 0 0 0 0 0 0 0 0 0 0 0 0 0 0 0 0 0 0 0 0 0 0 63.097 0 0 442.595 -1819.74 0 769.753 0.05 
