*Vertices 58
*Matrix 
0.08 0 0 -509.125 0 2322.53 -1427.88 0 74.0837 0 0 0 0 0 1152 0 0 0 0 0 2362.36 0 0 0 0 1242.94 0 627.689 0 0 0 0 0 0 -1414.3 -410.245 0 0 0 0 0 0 0 0 0 0 0 0 858.409 0 0 0 808.359 0 0 0 -549.257 0 
0 0.07 83.697 0 -785.47 1109.27 1996.14 0 0 0 0 0 1135.67 0 0 0 0 -888.623 0 0 -507.141 0 0 0 0 0 0 0 1488.01 0 0 0 0 0 0 0 0 0 0 0 0 858.257 0 0 0 0 0 0 0 0 0 0 0 0 0 0 0 0 
0 2231.44 0.07 0 0 0 0 1647.01 432.676 473.876 0 0 0 0 0 -105.06 0 0 0 0 2091.36 1092.03 -633.183 0 0 0 0 0 0 0 0 0 0 0 0 0 0 0 0 -944.319 0 -1237.6 0 0 0 0 -1310.24 0 1894.82 0 0 0 0 0 0 0 0 0 
1933.73 0 0 0 353.938 0 -274.743 -45.7015 0 0 0 0 0 0 0 0 0 1381.34 0 0 0 -148.549 0 0 0 0 0 0 2456.21 0 0 0 0 0 0 0 0 0 0 1982.86 0 0 0 -2455.9 0 0 0 0 0 0 0 181.356 0 0 0 0 0 0 
0 -174.184 0 1240.65 0.02 924.635 0 0 -1312.83 -1344.87 0 2098.07 0 0 -403.989 0 0 0 0 0 0 0 1067.92 0 0 0 -963.851 0 0 1945.78 0 0 0 0 0 0 0 0 2239.83 0 1307.79 0 0 0 621.128 879.009 0 0 0 0 0 0 0 0 0 0 0 0 
116.962 723.823 0 0 -1248.13 0.07 0 0 0 0 0 0 2363.12 0 0 0 0 -1867.5 0 855.052 2152.55 -1473.97 506.073 931.349 0 0 0 0 0 0 0 0 0 1993.39 0 0 0 0 0 553.224 0 0 0 -1706.37 0 0 0 0 0 0 0 0 0 0 0 0 -2213.74 0 
666.448 1676.15 0 1248.13 0 0 0.08 0 0 0 2037.95 0 1428.5 0 0 2057.18 0 0 0 0 -1451.69 -2478.33 0 0 1966.84 1902.6 -1994.92 0 0 0 0 0 -1811.81 0 0 0 0 0 1715.37 0 0 0 0 0 0 2073.66 0 0 0 0 0 0 0 -1658.91 0 0 0 0 
0 0 134.205 520.569 0 0 0 0.07 0 0 0 0 0 0 2031.85 0 0 1843.55 0 0 0 0 0 0 0 0 1002.76 2444 0 0 0 -439.543 0 0 0 0 0 0 0 0 0 0 0 0 -2472.99 2376.25 2042.99 0 0 0 0 0 0 -918.073 174.947 -1300.78 0 0 
1462.37 0 -2371.97 0 -544.984 0 0 0 0.01 0 0 833.537 2382.2 -215.995 0 -2414.85 0 -32.4259 0 1692.33 0 2457.43 1630.53 0 450.682 1546.6 172.506 0 0 0 0 0 0 0 0 0 0 0 0 0 0 0 0 0 -1654.03 0 0 0 0 0 0 0 0 0 0 0 -1594.67 0 
0 0 -1177.79 0 880.078 0 0 0 0 0 0 0 2061.14 1268.43 0 0 0 0 0 0 0 0 0 0 0 0 813.852 0 0 1137.96 0 0 0 0 0 0 -222.861 0 2398.83 0 -1555.45 0 0 0 0 0 0 0 0 0 0 0 776.772 0 0 0 0 0 
0 0 0 0 0 0 570.467 0 0 0 0.03 0 0 0 0 0 2026.66 2417.14 0 0 0 0 0 0 698.645 -423.673 0 -1974.32 0 0 -713.599 0 0 0 0 0 0 0 0 0 0 1092.79 0 0 0 0 0 -167.623 0 0 0 0 0 0 0 0 0 0 
0 0 0 0 1248.89 0 0 0 2169.03 0 0 0.05 0 0 0 -1616.34 0 2115.77 0 1496.55 0 0 0 0 0 2164.14 0 0 0 0 0 0 0 0 0 0 0 0 0 -757.393 0 0 0 0 0 0 0 0 0 2493.74 0 2360.99 0 0 0 0 2.51778 0 
0 -526.215 0 0 0 1621.37 1442.38 0 -839.335 566.805 0 0 0.07 0 235.984 0 2001.33 0 0 -1684.39 0 0 0 0 0 0 -486.541 0 0 0 0 0 1272.7 0 0 0 0 0 0 0 0 0 0 0 0 0 0 0 0 0 0 0 0 0 -1052.2 0 0 0 
0 0 0 0 0 0 0 0 427.946 971.328 0 0 0 0.01 0 0 -1455.81 -227.439 0 1668.68 1204.64 -1554.23 0 0 0 0 0 -643.406 0 0 0 0 0 0 0 0 0 0 0 0 1938 0 -91.3266 0 0 0 0 0 -39.4452 0 0 0 -1178.7 -110.706 0 0 0 0 
-827.281 0 0 0 2181.54 0 0 -863.598 0 0 0 0 268.334 0 0.03 -1863.38 1735.05 0 0 0 0 0 0 1963.79 0 0 1541.57 0 0 0 -1644.26 0 0 0 0 0 2192.83 0 0 0 0 0 0 0 0 0 0 0 0 2235.86 0 0 -1702.4 0 0 -1112.78 0 0 
0 0 391.018 0 0 0 2087.24 0 1508.15 0 0 -1774.73 0 0 1128.5 0.03 0 0 0 1414 0 1489.07 0 -22.66 0 0 0 0 -1840.34 0 0 0 2038.41 0 0 0 1494.26 0 0 0 0 0 394.223 0 0 0 0 0 0 -471.892 0 0 0 0 0 0 0 0 
0 0 0 0 0 0 0 0 0 0 1428.19 0 1327.63 1457.49 1574.37 0 0.06 0 0 0 0 2184.9 0 1289.48 -2271.87 0 0 0 0 0 0 -320.063 0 -1687.75 0 0 0 0 0 0 0 1398.13 -699.561 0 0 0 0 0 0 0 0 0 0 753.578 0 0 0 0 
0 263.451 0 624.332 0 1498.99 0 875.958 1579.41 0 2215.26 911.054 0 643.254 0 0 0 0 0 0 -597.324 0 -740.303 0 0 0 0 0 0 0 0 0 1801.89 0 0 -2487.95 0 0 0 0 0 0 0 0 -1572.39 0 -1584.14 0 0 0 0 0 0 0 0 0 0 -2034.29 
0 0 0 0 0 0 0 0 0 0 0 0 0 0 0 0 0 0 0.03 0 0 0 0 0 0 0 2073.05 0 0 0 0 0 0 0 0 0 0 0 0 0 0 0 0 0 0 0 0 648.9 0 0 0 0 0 0 0 0 0 788.827 
0 0 0 0 0 -1517 0 0 -51.9578 0 0 -29.0689 1351.13 2173.6 0 -283.441 0 0 0 0.06 1543.09 0 0 0 0 0 0 0 0 155.873 0 0 0 0 0 0 -105.67 0 0 0 0 0 0 0 0 0 0 657.75 0 1376.61 -2458.49 0 2425.08 0 0 0 321.741 0 
-1314.36 2139.12 -441.374 0 0 -1185.57 1217.31 0 0 0 0 0 0 -2376.55 0 0 0 1112.93 0 376.064 0.02 2404.17 0 2312.62 252.312 0 0 0 1329.77 0 0 0 0 0 0 0 0 439.543 0 0 355.007 0 0 0 0 0 0 0 0 0 0 -396.817 0 -160.146 0 0 0 0 
0 0 1461.15 1884.59 0 -1567.05 333.491 0 2128.59 0 0 0 0 1751.99 0 -1181.45 2009.26 0 0 0 1739.33 0.02 0 0 0 385.22 0 0 0 0 -790.963 0 0 0 0 0 0 0 0 0 0 0 0 0 0 0 0 0 0 0 0 0 0 0 0 0 0 0 
0 0 -224.54 0 751.595 -1286.28 0 0 -599.155 0 0 0 0 0 0 0 0 701.544 0 0 0 0 0 1707.74 0 0 1736.12 0 0 0 0 0 0 603.275 0 0 0 0 0 0 0 0 0 0 0 0 2375.79 0 0 0 0 1207.08 0 0 0 0 0 0 
0 0 0 0 0 -209.738 0 0 0 0 0 0 0 0 -1543.86 2039.48 1783.43 0 0 0 2387.69 0 -731.758 0 0 0 0 2068.32 0 0 0 0 0 0 0 0 0 0 0 0 0 -1149.4 0 0 0 0 0 0 0 0 0 268.944 0 0 0 0 -950.88 0 
0 0 0 0 0 0 -316.401 0 2001.33 0 2346.49 0 0 0 0 0 -1271.02 0 0 0 1136.74 0 0 0 0.02 0 0 0 0 0 0 1802.04 0 0 0 0 0 0 151.296 0 0 0 0 2118.52 0 -2212.97 -1017.11 0 1426.51 0 0 0 0 0 0 0 0 0 
666.295 0 0 0 0 0 -1523.87 0 2398.07 0 186.544 -203.635 0 0 0 0 0 0 0 0 0 1357.23 0 0 0 0.06 0 0 0 0 0 0 0 0 0 0 0 0 0 0 0 0 0 0 0 0 0 0 1958.3 0 0 0 0 0 0 0 0 0 
0 0 0 0 2379.91 0 2367.09 2209.31 1395.54 -118.793 0 0 1553.32 0 -1546.3 0 0 0 1046.1 0 0 0 -1193.35 0 0 0 0.02 0 0 0 0 0 0 0 0 0 0 0 0 0 0 0 0 0 -794.473 0 -686.285 0 0 -1939.83 0 958.205 0 0 0 0 0 0 
-930.128 0 0 0 0 0 0 215.537 0 0 1816.84 0 0 1450.77 0 0 0 0 0 0 0 0 0 866.039 0 0 0 0 0 0 0 0 0 -632.115 0 0 0 2137.14 0 0 0 0 0 0 0 0 0 1957.69 0 0 -1433.38 0 0 0 0 0 0 0 
0 1790.14 0 338.374 0 0 0 0 0 0 0 0 0 0 0 1350.22 0 0 0 0 -247.429 0 0 0 0 0 0 0 0.05 0 0 0 0 0 0 0 0 0 0 0 0 0 1278.65 0 0 0 0 0 0 0 0 0 0 0 0 0 0 -2233.42 
0 0 0 0 666.448 0 0 0 0 2284.08 0 0 0 0 0 0 0 0 0 -99.7192 0 0 0 0 0 0 0 0 0 0.02 0 0 0 0 1763.28 0 -2143.24 0 0 0 0 0 0 0 0 0 0 0 0 0 1082.72 0 0 0 0 0 0 2403.56 
0 0 0 0 0 0 0 0 0 0 1340.3 0 0 0 -1307.49 0 0 0 0 0 0 932.722 0 0 0 0 0 0 0 0 0.09 0 1906.26 0 743.202 0 0 0 0 0 0 0 0 1434.29 0 0 0 0 0 0 0 0 0 772.805 0 166.402 0 0 
0 0 0 0 0 0 0 465.789 0 0 0 0 0 0 0 0 1822.18 0 0 0 0 0 0 0 500.732 0 0 0 0 0 0 0.03 0 0 0 0 0 -558.565 0 0 0 -1070.82 0 1547.82 0 0 0 0 0 0 0 0 0 0 0 0 444.884 0 
0 0 0 0 0 0 2442.63 0 0 0 0 0 -1856.67 0 0 2475.43 0 451.292 0 0 0 0 0 0 0 0 0 0 0 0 527.284 0 0.01 0 0 0 0 0 0 0 0 0 0 -1212.58 0 0 0 0 0 0 0 0 0 0 0 0 0 0 
0 0 0 0 0 1291.31 0 0 0 0 0 0 0 0 0 0 -1055.86 0 0 0 0 0 801.34 0 0 0 0 1412.02 0 0 0 0 0 0.02 0 0 0 0 0 0 -733.436 0 0 0 0 0 0 0 0 0 0 0 0 0 0 0 0 0 
-1203.27 0 0 0 0 0 0 0 0 0 0 0 0 0 0 0 0 0 0 0 0 0 0 0 0 0 0 0 0 2317.04 -163.35 0 0 0 0.09 0 0 0 0 0 0 -155.416 1565.52 1830.42 0 0 0 0 0 0 1498.69 0 0 0 0 0 0 0 
1970.66 0 0 0 0 0 0 0 0 0 0 0 0 0 0 0 0 262.535 0 0 0 0 0 0 0 0 0 0 0 0 0 0 0 0 0 0.06 0 0 0 0 0 0 0 0 0 759.682 0 0 2272.79 0 0 0 0 0 0 0 0 0 
0 0 0 0 0 0 0 0 0 -2028.64 0 0 0 0 2352.75 58.3666 0 0 0 -236.595 0 0 0 0 0 0 0 0 0 1961.04 0 0 0 0 0 0 0 0 0 0 0 0 0 0 0 526.978 0 0 -2267.75 0 0 0 0 0 0 308.618 0 878.399 
0 0 0 0 0 0 0 0 0 0 0 0 0 0 0 0 0 0 0 0 1032.52 0 0 0 0 0 0 -15.183 0 0 0 1237.45 0 0 0 0 0 0.03 0 0 0 0 0 0 0 0 0 0 0 0 0 0 0 0 0 0 0 -1788.77 
0 0 0 0 2019.79 0 2064.65 0 0 432.981 0 0 0 0 0 0 0 0 0 0 0 0 0 0 -1851.02 0 0 0 0 0 0 0 0 0 0 0 0 0 0.02 0 0 0 0 0 0 0 0 0 0 0 0 0 0 0 0 0 0 0 
0 0 1963.33 1163.75 0 -1039.99 0 0 0 0 0 2214.65 0 0 0 0 0 0 0 0 0 0 0 0 0 0 0 0 0 0 0 0 0 0 0 0 0 0 0 0.08 0 0 0 0 0 0 1677.68 -1119.5 0 0 0 0 0 0 0 0 0 -1581.7 
0 0 0 0 470.824 0 0 0 0 -572.451 0 0 0 1885.97 0 0 0 0 0 0 1992.02 0 0 0 0 0 0 0 0 0 0 0 0 1641.21 0 0 0 0 0 0 0.07 0 0 0 0 0 0 0 0 0 0 -1896.8 1937.85 0 0 0 0 0 
0 -355.922 -951.491 0 0 0 0 0 0 0 2104.33 0 0 0 0 0 1519.29 0 0 0 0 0 0 -2482.45 0 0 0 0 0 0 0 1692.02 0 0 -2375.18 0 0 0 0 0 0 0.05 0 0 0 0 0 0 0 0 0 0 0 0 1623.05 0 0 0 
0 0 0 0 0 0 0 0 0 0 0 0 0 768.075 0 1651.13 1466.19 0 0 0 0 0 0 0 0 0 0 0 -1054.8 0 0 0 0 0 2339.01 0 0 0 0 0 0 0 0.03 0 0 1315.12 0 0 0 0 0 0 0 0 0 0 0 0 
0 0 0 1641.67 0 494.324 0 0 0 0 0 0 0 0 0 0 0 0 0 0 0 0 0 0 -1390.65 0 0 0 0 0 -263.146 -53.1785 2249.44 0 2300.87 0 0 0 0 0 0 0 0 0.07 0 0 0 0 0 0 0 0 0 0 0 0 0 0 
0 0 0 0 465.941 0 0 1773.51 345.546 0 0 0 0 0 0 0 0 2454.68 0 0 0 0 0 0 0 0 -570.162 0 0 0 0 0 0 0 0 0 0 0 0 0 0 0 0 0 0.01 0 0 0 0 0 0 0 0 0 0 0 0 -2186.42 
0 0 0 0 1891.61 0 1915.72 -266.808 0 0 0 0 0 0 0 0 0 0 0 0 0 0 0 0 1476.1 0 0 0 0 0 0 0 0 0 0 -199.515 1472.59 0 0 0 0 0 1484.8 0 0 0.04 0 0 0 0 0 0 0 0 0 0 0 0 
0 0 1859.87 0 0 0 0 -508.057 0 0 0 0 0 0 0 0 0 -2459.72 0 0 0 0 2298.88 0 2102.19 0 -764.718 0 0 0 0 0 0 0 0 0 0 0 0 2302.7 0 0 0 0 0 0 0.07 0 0 0 0 0 0 0 0 -519.807 0 -2109.82 
0 0 0 0 0 0 0 0 0 0 38.6822 0 0 0 0 0 0 0 1611.45 1068.99 0 0 0 0 0 0 0 -60.3504 0 0 0 0 0 0 0 0 0 0 0 222.556 0 0 0 0 0 0 0 0.06 0 0 0 548.799 0 0 0 0 0 0 
1392.48 0 -1003.37 0 0 0 0 0 0 0 0 0 0 1089.74 0 0 0 0 0 0 0 0 0 0 1518.83 563.448 0 0 0 0 0 0 0 0 0 2267.3 301.904 0 0 0 0 0 0 0 0 0 0 0 0.02 0 0 0 0 1241.72 0 0 0 0 
0 0 0 0 0 0 0 0 0 0 0 955.458 0 0 16.5563 -492.035 0 0 0 -501.953 0 0 0 0 0 0 1414.61 0 0 0 0 0 0 0 0 0 0 0 0 0 0 0 0 0 0 0 0 0 0 0.05 0 0 0 0 -953.932 0 2369.69 0 
0 0 0 0 0 0 0 0 0 0 0 0 0 0 0 0 0 0 0 281.61 0 0 0 0 0 0 0 2287.29 0 104.755 0 0 0 0 2492.22 0 0 0 0 0 0 0 0 0 0 0 0 0 0 0 0.05 0 0 0 0 -2481.38 0 0 
0 0 0 1448.48 0 0 0 0 0 0 0 -125.202 0 0 0 0 0 0 0 0 -1052.96 0 1773.05 595.95 0 0 1020.16 0 0 0 0 0 0 0 0 0 0 0 0 0 -1802.5 0 0 0 0 0 0 -1423.31 0 0 0 0 -676.977 0 0 0 0 0 
1279.87 0 0 0 0 0 0 0 0 1381.34 0 0 0 2416.53 -248.039 0 0 0 0 -22.66 0 0 0 0 0 0 0 0 0 0 0 0 0 0 0 0 0 0 0 0 1411.71 0 0 0 0 0 0 0 0 0 0 -1759.77 0.06 0 0 0 0 0 
0 0 0 0 0 0 2252.49 2193.59 0 0 0 0 0 -1214.41 0 0 1229.36 0 0 0 -1679.36 0 0 0 0 0 0 0 0 0 -239.189 0 0 0 0 0 0 0 0 0 0 0 0 0 0 0 0 0 651.646 0 0 0 0 0.03 0 0 0 0 
0 0 0 0 0 0 0 -488.983 0 0 0 0 1618.78 0 0 0 0 0 0 0 0 0 0 0 0 0 0 0 0 0 0 0 0 0 0 0 0 0 0 0 0 512.635 0 0 0 0 0 0 0 793.558 0 0 0 0 0.08 0 0 0 
0 0 0 0 0 0 0 1501.89 0 0 0 0 0 0 1169.09 0 0 0 0 0 0 0 0 0 0 0 0 0 0 0 1323.82 0 0 0 0 0 -37.7667 0 0 0 0 0 0 0 0 0 -2293.69 0 0 0 521.027 0 0 0 0 0.06 -1937.54 0 
-1668.07 0 0 0 0 1270.56 0 0 1890.7 0 0 788.369 0 0 0 0 0 0 0 1868.42 0 0 0 -1807.23 0 0 0 0 0 0 0 -2207.17 0 0 0 0 0 0 0 0 0 0 0 0 0 0 0 0 0 1567.81 0 0 0 0 0 -1699.65 0.02 0 
0 0 0 0 0 0 0 0 0 0 0 0 0 0 0 0 0 -1932.81 -885.723 0 0 0 0 0 0 0 0 0 749.611 1309.47 0 0 0 0 0 0 -921.735 -1304.28 0 -633.641 0 0 0 0 1714 0 2479.09 0 0 0 0 0 0 0 0 0 0 0.07 
