*Vertices 68
*Matrix 
0.09 0 737.404 1744.51 0 -1254.08 0 2068.16 0 0 0 0 0 0 0 0 1351.44 0 0 0 0 0 2148.58 0 0 -67.6748 0 0 0 0 234.001 0 2118.67 0 0 0 0 0 0 2107.38 0 0 -692.389 0 0 0 0 0 0 0 0 0 0 0 0 0 0 0 -1173.97 0 680.181 0 0 0 0 0 0 0 
0 0.04 -1742.53 0 660.039 0 0 0 0 0 0 0 -1260.95 0 214.621 1841.26 2142.63 -1484.8 0 0 0 0 2415.01 0 0 2217.55 -2145.53 0 0 0 0 0 0 -2074.57 0 -1374.63 2221.37 0 0 1807.08 0 0 0 0 335.322 0 0 0 0 0 0 0 0 0 19.303 743.965 0 0 0 0 0 0 0 0 0 0 0 0 
2114.55 -2380.21 0.06 0 0 409.635 0 0 0 1657.23 0 1732.15 0 0 0 0 0 0 -159.383 0 0 0 -2193.9 0 0 0 0 0 -2411.19 -1404.23 0 0 0 2061.14 1194.72 2220.45 768.99 0 0 0 2345.58 0 0 0 0 0 -426.267 0 0 0 0 0 0 0 0 0 0 0 0 0 0 0 0 0 1364.25 0 0 0 
-824.229 0 0 0 0 0 -1673.71 0 0 0 2266.99 0 1833.48 0 2088 0 0 0 0 0 2172.99 -105.518 0 0 1472.9 0 0 739.998 0 2132.4 0 0 0 0 0 0 0 0 0 1149.4 0 0 -1733.07 -1104.39 0 0 0 0 0 0 0 0 0 813.395 0 0 0 0 -156.178 0 0 0 0 0 2321.62 24.7963 2325.43 0 
0 2184.13 0 0 0 0 0 0 0 0 0 0 0 0 0 0 0 0 -1473.82 0 -2468.11 0 0 0 0 0 0 1419.8 0 0 0 1554.23 0 0 1650.98 0 0 0 0 0 -1051.59 0 0 0 0 0 0 0 0 0 0 0 0 0 0 0 0 0 0 0 0 0 0 0 0 -1767.71 0 0 
-1680.58 0 -864.666 0 0 0.01 0 1293.91 2378.84 1347.62 0 0 0 596.561 -32.1207 0 0 0 1734.14 0 0 0 0 0 0 0 -1261.25 0 0 0 0 2340.08 0 0 0 234.764 0 0 0 0 0 0 0 0 1858.5 0 0 0 0 0 0 0 0 0 0 0 0 0 -1065.63 0 0 0 0 0 0 0 0 2358.24 
0 0 0 760.75 0 0 0.05 0 1956.62 0 0 0 0 1388.36 1506.78 449.767 0 0 1924.73 0 0 0 0 -900.067 790.963 0 0 -2380.52 2028.64 0 -2123.71 0 0 0 -2405.55 1914.81 0 0 0 0 0 0 0 0 0 0 0 0 0 0 0 0 1656.62 0 0 0 0 0 0 0 0 470.977 0 0 0 0 0 0 
917.31 0 0 0 0 -923.566 0 0.08 0 0 0 0 0 0 -1288.11 0 0 -502.106 0 -1917.4 0 0 2481.54 0 0 0 0 -1298.03 0 -9.53703 0 0 0 0 0 0 747.627 0 0 0 916.395 0 0 0 484.558 0 2205.8 0 0 0 0 0 0 2384.49 0 0 0 -1851.94 0 0 0 0 0 0 0 0 -2231.59 0 
0 0 0 0 0 2111.65 -850.322 0 0.07 0 2266.69 2289.88 0 0 0 -1387.91 -891.98 188.223 0 0 0 755.867 21.1341 -1165.12 -1823.25 -78.6615 0 0 0 0 0 -1430.02 665.532 2427.67 0 0 0 0 1558.96 0 0 1713.69 1192.13 0 -889.691 2106.16 0 233.543 0 0 0 -165.487 0 0 0 0 0 -2208.85 0 0 0 0 0 0 0 0 0 0 
0 0 2427.21 0 0 88.8852 0 0 0 0 0 0 0 0 0 0 0 0 0 0 191.733 2121.72 0 0 0 853.679 -242.698 0 0 0 969.802 0 0 0 0 0 -2031.24 0 0 0 514.618 646.001 0 0 0 0 0 -884.35 0 0 0 0 0 0 0 0 0 0 0 0 0 0 0 0 -1579.1 -769.753 -951.033 0 
0 0 0 2067.25 0 0 0 0 -2472.84 0 0.07 0 -2357.94 0 0 0 0 1465.58 0 0 0 0 0 0 1807.99 0 0 446.104 0 0 28.6111 0 0 0 0 1234.24 0 0 2450.25 0 0 1098.13 1568.12 0 0 0 0 0 0 0 0 0 0 0 0 0 0 0 0 0 0 0 0 0 0 0 0 0 
0 0 -2015.21 0 0 0 0 0 2248.38 0 0 0.03 2084.34 0 -715.43 0 0 0 0 0 567.721 0 0 0 2200.61 0 -698.798 0 2378.38 0 0 0 2455.6 0 -2430.88 1540.8 0 0 0 55.7726 0 0 0 -567.873 0 0 0 396.512 0 0 0 0 0 0 0 807.138 0 -1758.55 -2087.24 0 193.869 0 0 0 2258.14 0 0 0 
0 -839.641 0 1560.49 0 0 0 0 0 0 -463.042 1700.42 0.03 -1466.34 -1979.96 -1510.9 0 2231.28 1684.7 1691.26 0 1623.05 1019.85 461.821 0 -1260.64 -1308.56 0 -2064.5 -2248.68 0 0 0 0 0 0 0 0 0 -787.454 0 0 0 0 0 0 0 0 0 0 0 0 0 0 0 0 0 0 0 2077.17 1640.29 0 -1790.9 0 0 0 0 0 
0 0 0 0 0 -152.974 -2077.47 0 0 0 0 0 -161.061 0.07 0 0 0 0 0 0 0 -1160.7 0 0 0 0 0 -672.094 1346.4 0 1036.03 0 -1575.29 2357.94 0 0 0 0 0 0 697.577 -462.127 2400.05 0 0 -648.747 0 0 0 0 -1363.8 0 2226.71 0 0 0 0 0 0 0 0 0 0 0 0 0 0 0 
0 -2218.01 0 574.129 0 -1435.06 1413.85 -1152.15 0 0 0 448.698 -1369.9 0 0 0 0 0 0 0 0 1755.81 0 0 0 0 0 0 0 0 0 2489.62 0 0 1906.42 0 0 1878.49 0 0 0 0 0 0 0 914.563 0 0 0 0 0 0 0 -834.605 0 0 0 0 0 0 -717.566 -126.881 0 0 0 0 0 0 
0 2407.38 0 0 0 0 2411.5 0 -1081.5 0 0 0 412.687 0 0 0.09 0 0 0 0 392.697 1874.68 -1382.56 0 0 511.109 -1882.31 0 0 0 0 0 0 0 2283.47 831.248 1764.96 2472.84 0 0 -844.218 513.092 0 0 0 0 0 0 0 -1743.6 -1493.04 0 0 0 0 542.085 0 0 0 0 0 0 0 532.167 0 -1985.76 0 0 
1218.07 700.476 0 0 0 0 0 0 2229.61 0 0 0 0 0 0 0 0.06 0 927.229 0 0 0 -816.904 1495.94 0 0 1361.66 -1859.57 0 -2209.77 507.599 0 0 0 0 -772.5 0 1919.69 0 0 2112.26 0 0 -2459.87 0 859.478 0 0 0 0 0 0 0 0 0 0 -2327.57 0 0 0 0 0 0 0 0 0 0 0 
0 -1704.99 0 0 0 0 0 -1631.75 2466.43 0 1941.05 0 780.435 0 0 0 0 0.01 1531.95 -83.3918 0 524.689 0 0 0 0 0 0 0 0 0 73.3207 0 0 0 0 0 0 0 0 0 0 0 -1470.15 1349.6 676.366 0 0 0 2252.8 0 0 0 0 0 0 0 742.744 0 0 0 0 0 0 0 0 0 0 
0 0 155.873 0 -1427.43 252.464 2189.17 0 0 0 0 0 1933.42 0 0 0 902.356 1268.58 0.09 1076.01 -2157.12 1472.44 281.304 0 0 0 0 0 0 -200.43 0 0 0 658.971 0 0 0 0 0 0 0 0 -580.538 0 414.823 2353.05 0 0 0 0 0 0 0 0 0 0 0 0 0 0 0 -477.844 -394.07 0 1486.02 0 0 0 
0 0 0 0 0 0 0 -2076.25 0 0 0 0 1635.72 0 0 0 0 689.032 752.205 0.04 560.244 0 0 0 0 1662.27 0 0 333.186 1447.72 0 0 0 0 0 0 0 0 975.6 0 0 0 0 0 0 0 0 0 -1685.77 0 0 777.535 0 0 0 0 0 0 -522.248 0 1307.34 0 2288.96 0 0 0 0 0 
0 0 0 2477.42 1986.83 0 0 0 0 -598.849 0 -230.949 0 0 0 -2040.24 0 0 1610.84 243.156 0 0 0 -1707.59 0 0 0 0 707.801 0 0 0 0 0 0 -267.266 0 1180.53 0 0 0 1403.62 0 0 0 0 1721.47 1500.82 0 0 0 1701.03 0 -2417.45 0 0 0 0 0 -2359.16 0 0 0 0 0 1157.64 0 0 
0 0 0 815.226 0 0 0 0 1108.81 -1093.55 0 0 -1544.47 -1957.08 -0.686666 2046.95 0 2049.55 836.436 0 0 0.03 0 0 0 2438.81 0 -698.645 -1960.59 0 495.239 0 764.107 0 0 0 0 0 0 0 0 0 701.392 1878.95 0 2062.97 0 0 0 0 0 0 -1902.75 0 0 0 0 0 0 0 0 1321.07 0 0 0 0 0 0 
2382.81 1664.71 -1642.43 0 0 0 0 1473.05 1670.96 0 0 0 780.435 0 0 2211.75 2340.08 0 2321.16 0 0 0 0.03 0 0 0 0 942.488 0 1800.82 0 -536.744 0 0 0 0 862.835 1433.38 0 0 -1035.57 -1839.73 0 0 0 0 0 0 0 0 0 0 0 0 0 0 0 0 0 0 0 0 0 1214.87 0 0 -1697.21 0 
0 0 0 0 0 0 -1106.37 0 -1749.7 0 0 0 -1471.68 0 0 0 94.2259 0 0 0 2430.27 0 0 0.01 0 0 0 -838.725 0 0 2035.36 0 0 0 0 0 2330.16 0 0 1552.86 1632.05 0 0 0 0 0 0 0 0 0 0 0 0 0 0 0 0 0 0 -508.82 0 0 0 0 0 0 -195.7 2067.86 
0 0 0 -654.851 0 0 240.867 0 1937.24 0 2194.81 -399.716 0 0 0 0 0 0 0 0 0 0 0 0 0.06 -1355.56 255.821 0 0 0 1480.83 -256.279 0 0 895.489 0 -671.789 0 0 712.836 305.719 0 0 1483.73 0 0 0 0 0 0 0 0 0 0 0 0 0 0 0 0 0 0 0 2334.59 0 0 0 0 
-660.955 1859.87 0 0 0 0 0 0 334.254 342.036 0 0 1401.64 0 0 -870.769 0 0 0 -572.756 0 422.91 0 0 2212.97 0.03 0 0 0 0 -618.076 843.303 0 0 0 -1804.48 0 0 0 2276.45 0 0 0 0 0 668.432 0 0 2386.93 0 0 0 0 186.392 -656.072 -798.288 1884.75 0 0 0 0 0 -557.649 0 0 0 0 0 
0 125.66 0 0 0 -2058.4 0 0 0 1915.72 0 1267.82 1937.85 0 0 1092.33 -804.544 0 0 0 0 0 0 0 2432.1 0 0.04 0 0 0 -2334.89 0 1958.75 -1865.98 2312.77 0 0 365.993 2386.47 0 0 -673.009 0 0 1914.04 -1133.84 0 0 0 0 0 0 0 0 -5.41704 995.132 0 0 659.886 0 0 0 0 0 0 0 0 0 
0 0 0 -1288.72 1946.85 0 1845.07 855.052 0 0 2497.56 0 0 2202.75 0 0 1480.38 0 0 0 0 601.596 399.258 -1837.75 0 0 0 0.08 0 0 0 -13.8096 927.229 577.639 0 0 0 0 0 0 0 0 89.4955 0 0 0 0 0 0 0 0 0 0 0 0 0 0 1972.49 0 -658.513 0 0 0 0 0 0 0 0 
0 0 -1681.95 0 0 0 1084.55 0 0 0 0 -1258.2 -1892.07 1536.07 0 0 0 0 0 580.691 -1436.58 1382.72 0 0 0 0 0 0 0.08 0 0 0 -94.0733 0 0 0 0 2146.44 0 0 2181.54 1732.46 0 0 0 -1767.86 0 0 0 0 -322.199 0 0 0 1248.59 0 0 0 0 0 0 0 0 0 0 0 0 0 
0 0 -42.9548 -784.097 0 0 0 -1574.07 0 0 0 0 1085.77 0 0 0 -212.638 0 739.387 2294.31 0 0 339.747 0 0 0 0 0 0 0.09 0 0 0 0 0 0 -1519.9 0 2009.26 0 0 1059.68 0 0 0 -312.433 0 0 0 0 0 0 0 0 0 0 0 0 0 0 0 -163.808 0 0 558.87 0 0 0 
1577.58 0 0 0 0 0 1366.08 0 0 2324.52 2118.67 0 0 -824.076 0 0 238.121 0 0 0 0 1763.59 0 -745.796 1578.8 1276.51 -1838.51 0 0 0 0.05 616.55 0 -2251.27 0 0 1427.43 0 0 0 0 378.658 0 2127.22 0 0 0 0 0 0 0 0 -1193.66 0 0 1801.13 415.281 0 0 -1611.3 0 0 -1879.1 0 0 0 0 0 
0 0 0 0 -644.169 1880.78 0 0 452.055 0 0 0 0 0 973.464 0 0 -1218.07 0 0 0 0 842.997 0 -266.655 -2319.18 0 -2007.74 0 0 1671.42 0 0 0 0 0 0 0 0 0 -1295.13 1875.59 0 1653.42 0 0 0 0 0 0 0 0 0 0 0 0 0 1893.9 2102.95 0 0 0 0 0 0 0 0 0 
711.31 0 0 0 0 0 0 0 1698.13 0 0 145.192 0 2215.57 0 0 0 0 0 0 0 -310.907 0 0 0 0 -141.53 -953.78 -1500.21 0 0 0 0.07 -1332.51 2049.85 0 0 1163.75 0 1344.57 0 -2390.29 0 0 74.5415 0 0 0 0 1308.71 2329.4 0 0 0 0 0 0 0 0 0 0 0 0 0 0 0 0 0 
0 -1524.93 1899.85 0 0 0 0 0 973.769 0 0 0 0 820.109 0 0 0 0 908.155 0 0 0 0 0 0 0 -1979.2 -1421.63 0 0 2166.43 0 -555.208 0 0 0 0 0 0 1010.54 0 626.469 2407.38 0 0 1459.47 0 0 0 0 0 0 0 0 0 0 0 0 0 0 0 0 0 0 -678.045 1058.46 0 0 
0 0 133.137 0 1854.69 0 1492.43 0 0 0 0 -1852.24 0 0 -333.338 -1584.9 0 0 0 0 0 0 0 0 1995.83 0 -462.432 0 0 0 0 0 837.657 0 0.01 0 0 423.215 0 0 0 0 0 0 0 0 0 0 0 0 0 0 0 0 0 0 -879.315 0 0 0 0 0 0 0 0 0 0 0 
0 -1580.78 -853.069 0 0 2220.45 -710.7 0 0 0 1402.4 1021.53 0 0 0 1863.08 776.315 0 0 0 535.829 0 0 0 0 635.624 0 0 0 0 0 0 0 0 0 0.08 0 327.693 -2416.23 0 0 -1158.1 0 0 -2420.19 2413.48 1698.58 0 2019.64 0 0 0 1782.82 1877.42 0 -1815.93 -1569.19 0 0 0 0 0 0 0 0 0 0 0 
0 -1179.77 857.952 0 0 0 0 2041 0 1421.63 0 0 0 0 0 -1709.42 0 0 0 0 0 0 -69.3533 2150.87 -1068.99 0 0 0 0 -2312.77 -1911.45 0 0 0 0 0 0.08 2449.19 0 0 0 0 0 0 0 0 0 0 0 0 0 473.724 0 0 0 0 0 0 0 0 0 0 0 0 0 13.1993 0 0 
0 0 0 0 0 0 0 0 0 0 0 0 0 0 2464.14 -859.478 1947.92 0 0 0 249.413 0 1063.49 0 0 0 -1152.91 0 -454.802 0 0 0 2012.16 0 -1844.31 -1394.47 1253.01 0.02 -170.98 0 1755.5 0 1820.96 0 0 0 0 0 0 0 -2134.24 -1356.32 0 0 -1866.74 0 0 0 0 -422.758 0 0 0 0 0 0 0 0 
0 0 0 0 0 0 0 0 2457.73 0 342.494 0 0 0 0 0 0 0 0 -1313.44 0 0 0 0 0 0 1311.15 0 0 893.506 0 0 0 0 0 -816.141 0 1354.95 0.05 -733.894 0 0 1506.32 -760.292 0 0 0 0 0 0 0 0 0 0 0 663.091 0 0 0 0 0 0 0 0 0 0 0 0 
1560.03 658.055 0 1121.02 0 0 0 0 0 0 0 1479.46 2455.9 0 0 0 0 0 0 0 0 0 0 2091.05 -1893.75 29.5267 0 0 0 0 0 0 -1550.72 439.085 0 0 0 0 888.012 0.09 0 0 0 0 0 0 0 0 0 721.992 0 0 0 0 0 0 0 0 1818.22 0 0 0 0 0 -2221.52 0 0 0 
0 0 681.402 0 76.8303 0 0 -460.143 0 2143.24 0 0 0 -1748.02 0 -774.789 1938.46 0 0 0 0 0 87.817 -1400.11 2026.66 0 0 0 -1214.1 0 0 1810.13 0 0 0 0 0 481.353 0 0 0.08 1059.98 0 507.294 0 514.008 0 0 -796.609 0 0 0 1600.77 0 804.849 0 0 0 0 0 0 -1587.5 0 0 0 0 0 0 
0 0 0 0 0 0 0 0 -350.734 -1424.53 2064.04 0 0 1220.05 0 -1727.58 0 0 0 0 2467.5 0 -535.829 0 0 0 739.235 0 1345.03 -1390.96 551.698 2113.48 932.112 -2106.46 0 1338.92 0 0 0 0 -2492.07 0.05 0 0 0 1357.54 2437.74 0 0 0 0 0 1808.15 0 0 0 -1840.49 0 -450.835 0 0 0 0 0 0 0 0 0 
-170.522 0 0 1255.76 0 0 0 0 -1061.97 0 1816.84 0 0 -841.624 0 0 0 0 -613.346 0 0 943.098 0 0 0 0 0 1257.9 0 0 0 0 0 21.2867 0 0 0 785.165 717.566 0 0 0 0.02 0 0 0 0 0 0 0 0 0 0 0 0 0 0 -1385.16 0 0 0 -441.527 0 0 0 0 0 0 
0 0 0 1479.16 0 0 0 0 0 0 0 1001.54 0 0 0 0 1451.99 -95.1415 0 0 0 -1026.72 0 0 2092.73 0 0 0 0 0 312.281 -1615.42 0 0 0 0 0 0 -1528.9 0 2486.42 0 0 0.07 0 0 -1752.75 0 0 1495.94 0 0 1925.18 0 0 0 0 0 0 -813.7 0 -985.977 0 0 0 0 0 0 
0 -1529.51 0 0 0 -859.325 0 253.227 1374.32 0 0 0 0 0 0 0 0 1975.08 -291.07 0 0 0 0 0 0 0 2215.41 0 0 0 0 0 1134.45 0 0 1205.4 0 0 0 0 0 0 0 0 0.03 0 0 0 0 0 0 0 0 0 0 0 0 0 0 0 -1948.84 0 1990.34 -573.977 0 0 0 0 
0 0 0 0 0 0 0 0 2475.74 0 0 0 0 1492.13 -2264.09 0 -2116.84 1480.68 1938.76 0 0 -1599.09 0 0 0 24.7963 2058.09 0 1245.99 1316.95 0 0 0 193.564 0 372.707 0 0 0 0 -1361.81 1000.63 0 0 0 0 -839.03 -1477.78 0 0 0 -108.57 0 0 0 0 0 -121.235 0 0 0 0 0 462.584 0 0 0 0 
0 0 1636.02 0 0 0 0 1451.54 0 0 0 0 0 0 0 0 0 0 0 0 249.87 0 0 0 0 0 0 0 0 0 0 0 0 0 0 -2351.68 0 0 0 0 0 -282.83 0 2332.76 0 1607.33 0.01 0 0 -568.484 0 0 0 0 0 0 0 0 0 -1376.31 0 0 0 0 0 0 0 -544.984 
0 0 0 0 0 0 0 0 1915.72 232.78 0 -1352.66 0 0 0 0 0 0 0 0 -25.7118 0 0 0 0 0 0 0 0 0 0 0 0 0 0 0 0 0 0 0 0 0 0 0 0 1135.21 0 0.02 -697.882 0 0 0 0 385.525 0 0 0 0 0 0 113.453 0 0 1675.7 0 0 0 0 
0 0 0 0 0 0 0 0 0 0 0 0 0 0 0 0 0 0 0 -304.346 0 0 0 0 0 943.098 0 0 0 0 0 0 0 0 0 1536.99 0 0 0 0 1601.99 0 0 0 0 0 0 739.845 0.01 -217.521 0 0 -1310.85 0 -1895.12 0 0 0 0 222.098 0 0 0 0 0 0 0 -1991.87 
0 0 0 0 0 0 0 0 0 0 0 0 0 0 0 -2137.75 0 1781.44 0 0 0 0 0 0 0 0 0 0 0 0 0 0 2380.06 0 0 0 0 0 0 948.439 0 0 0 2319.48 0 0 -214.621 0 2069.99 0.08 0 0 0 0 0 0 0 0 0 0 0 0 0 0 0 0 0 -1243.4 
0 0 0 0 0 0 0 0 0 0 0 0 0 -1257.13 0 521.18 0 0 0 0 0 0 0 0 0 0 0 0 726.264 0 0 0 1433.07 0 0 0 0 -692.999 0 0 0 0 0 0 0 0 0 0 0 0 0.09 0 0 0 0 0 0 0 0 0 0 0 0 0 -1534.39 0 1150.62 0 
0 0 0 0 0 0 0 0 768.685 0 0 0 0 0 0 0 0 0 0 2239.83 557.039 0 0 0 0 0 0 0 0 0 0 0 0 0 0 0 -2094.71 2138.2 0 0 0 0 0 0 0 387.814 0 0 0 0 0 0.09 0 0 0 0 0 0 0 0 0 0 0 0 0 0 0 0 
0 0 0 0 0 0 2408.9 0 0 0 0 0 0 362.941 0 0 0 0 0 0 0 -2485.2 0 0 0 0 0 0 0 0 -465.331 0 0 0 0 -1275.44 0 0 0 0 976.821 2208.4 0 -1078.3 0 0 0 0 610.752 0 0 0 0.04 0 0 0 0 -781.655 0 0 0 0 0 1144.06 536.744 0 0 0 
0 0 0 651.189 0 0 0 2272.79 0 0 0 0 0 0 710.852 0 0 0 0 0 -808.969 0 0 0 0 162.587 0 0 0 0 0 0 0 0 0 -1243.25 0 0 0 0 0 0 0 0 0 0 0 -505.005 0 0 0 0 0 0.03 0 0 0 0 0 0 216.453 0 0 0 0 0 0 0 
0 -1245.38 0 0 0 0 0 0 0 0 0 0 0 0 0 0 0 0 0 0 0 0 0 0 0 -54.0941 -884.655 0 570.315 0 0 0 0 0 0 0 0 2498.02 0 0 383.541 0 0 0 0 0 0 0 1321.07 0 0 0 0 0 0.06 0 0 0 0 0 0 0 0 483.795 0 0 0 0 
0 2014.6 0 0 0 0 0 0 0 0 0 2397.15 0 0 0 -2216.48 0 0 0 0 0 0 0 0 0 1441.62 540.712 0 0 0 1892.22 0 0 0 0 1972.49 0 0 924.482 0 0 0 0 0 0 0 0 0 0 0 0 0 0 0 0 0.07 0 -2225.03 0 0 0 0 0 0 0 0 0 0 
0 0 0 0 0 0 0 0 0 0 0 0 0 0 0 0 -1601.38 0 0 0 0 0 0 0 0 708.716 0 0 0 0 -709.021 0 0 0 895.184 1707.43 0 0 0 0 0 -604.648 0 0 0 0 0 0 0 0 0 0 0 0 0 0 0.07 0 0 0 0 1673.71 0 1155.35 0 0 0 0 
0 0 0 0 0 0 0 303.125 -64.9281 0 0 259.484 0 0 0 0 0 -2413.63 0 0 0 0 0 0 0 0 0 355.464 0 0 0 -1889.32 0 0 0 0 0 0 0 0 0 0 1471.53 0 0 1474.73 0 0 0 0 0 0 804.392 0 0 2445.68 0 0.08 0 0 0 -1722.08 0 0 0 0 0 0 
-1135.67 0 0 -96.82 0 -1838.36 0 0 0 0 0 596.255 0 0 0 0 0 0 0 -2398.68 0 0 0 0 0 0 2092.88 0 0 0 0 430.235 0 0 0 0 0 0 0 1871.47 0 1683.17 0 0 0 0 0 0 0 0 0 0 0 0 0 0 0 0 0.09 0 0 0 0 0 0 0 0 0 
0 0 0 0 0 0 0 0 0 0 0 0 -2376.09 0 0 0 0 0 0 0 -1009.17 0 0 1579.26 0 0 0 588.321 0 0 -1424.07 0 0 0 0 0 0 -22.5074 0 0 0 0 0 1386.53 0 0 1884.44 0 1987.9 0 0 0 0 0 0 0 0 0 0 0.01 0 0 0 0 0 0 0 1275.44 
2071.21 0 0 0 0 0 0 0 0 0 0 2361.6 -2345.27 0 -1473.36 0 0 0 0 1163.9 0 0 0 0 0 0 0 0 0 0 0 0 0 0 0 0 0 0 0 0 0 0 0 0 1367 0 0 -1854.08 0 0 0 0 0 26.017 0 0 0 0 0 0 0.06 0 2037.03 0 0 0 0 0 
0 0 0 0 0 0 297.174 0 0 0 0 0 0 0 2157.12 0 0 0 691.778 0 0 1008.87 0 0 0 0 0 0 0 2365.57 0 0 0 0 0 0 0 0 0 0 -2038.41 0 1730.78 786.233 0 0 0 0 0 0 0 0 0 0 0 0 2361.9 -2380.06 0 0 0 0.09 0 1627.32 0 0 0 0 
0 0 0 0 0 0 0 0 0 0 0 0 2365.11 0 0 0 0 0 401.395 2495.12 0 0 0 0 0 -527.284 0 0 0 0 -2293.54 0 0 0 0 0 0 0 0 0 0 0 0 0 -1243.1 0 0 0 0 0 0 0 0 0 0 0 0 0 0 0 2072.89 0 0.05 2016.89 0 125.965 -203.787 0 
0 0 0 0 0 0 0 0 0 0 0 0 0 0 0 -1713.84 0 0 0 0 0 0 1606.88 0 1670.35 0 0 0 0 0 0 0 0 0 0 0 0 0 0 0 0 0 0 0 465.789 2132.25 0 84.3074 0 0 0 0 -48.7533 0 958.357 0 -1123.92 0 0 0 0 864.055 1837.29 0.07 0 0 0 0 
0 0 74.3889 -124.287 0 0 0 0 0 2167.96 0 -2139.73 0 0 0 0 0 0 1939.83 0 0 0 0 0 0 0 0 0 0 640.812 0 0 0 912.732 0 0 0 0 0 1513.64 0 0 0 0 0 0 0 0 0 0 2280.57 0 962.325 0 0 0 0 0 0 0 0 0 0 0 0.08 0 2084.8 0 
0 0 0 745.491 1748.94 0 0 0 0 -2147.21 0 0 0 0 0 563.448 0 0 0 0 2058.24 0 0 0 0 0 0 0 0 0 0 0 0 269.86 0 0 -1466.8 0 0 0 0 0 0 0 0 0 0 0 0 0 0 0 0 0 0 0 0 0 0 0 0 0 1763.28 0 0 0.02 0 0 
0 0 0 -791.269 0 0 0 2396.85 0 975.448 0 0 0 0 0 0 0 0 0 0 0 0 -387.204 -2219.53 0 0 0 0 0 0 0 0 0 0 0 0 0 0 0 0 0 0 0 0 0 0 0 0 0 0 -1998.58 0 0 0 0 0 0 0 0 0 0 0 2177.88 0 46.0067 0 0.06 0 
0 0 0 0 0 2089.07 0 0 0 0 0 0 0 0 0 0 0 0 0 0 0 0 0 1280.79 0 0 0 0 0 0 0 0 0 0 0 0 0 0 0 0 0 0 0 0 0 0 1240.96 0 2174.52 -1883.98 0 0 0 0 0 0 0 0 0 -628.605 0 0 0 0 0 0 0 0.09 
