*Vertices 55
*Matrix 
0.01 0 0 0 0 0 0 0 1597.42 2240.59 0 0 0 0 0 0 0 0 0 0 0 0 0 0 0 0 0 0 0 0 0 0 0 0 0 0 0 0 0 0 0 0 414.212 0 0 0 0 0 0 0 0 0 0 0 0 
0 0.07 0 0 0 1676.76 0 1843.09 0 0 725.349 0 0 573.977 -1094.47 0 0 -172.964 0 0 0 0 0 0 0 0 0 0 0 -26.017 0 -1195.49 0 0 1561.25 0 0 -1277.12 2085.71 0 -1479.46 0 0 0 0 -1967.3 0 0 0 0 0 0 0 0 0 
0 0 0.02 0 0 0 0 0 0 147.786 -2466.58 1965.93 0 0 0 0 0 0 0 0 1000.02 0 0 0 0 0 0 0 0 0 1728.34 0 0 1058.15 0 0 0 1873.3 -219.199 0 0 0 0 0 0 2177.72 1706.21 -1123.62 0 0 0 0 -235.374 0 -2096.39 
0 0 0 0.03 0 0 0 0 0 0 0 0 0 0 0 -387.356 0 1058.76 0 0 0 0 736.641 0 0 0 0 0 0 0 0 1128.65 0 0 0 0 0 2196.04 0 0 0 0 0 0 0 1899.55 0 0 0 0 0 0 0 0 0 
0 0 0 0 0.07 0 0 0 0 0 0 0 0 1406.98 0 419.095 0 0 0 -2079.45 2087.24 0 0 0 0 0 0 0 0 0 0 0 0 0 0 0 1827.22 0 0 0 0 0 0 0 2070.91 0 0 0 0 0 0 0 0 0 0 
0 -2456.82 0 0 0 0.01 0 0 0 0 0 0 -53.4837 0 0 0 0 0 0 1475.95 0 0 0 1870.71 0 0 0 0 0 0 0 0 2375.79 0 0 0 0 0 0 0 0 0 0 0 0 0 -1558.96 0 0 0 0 0 0 0 0 
0 0 0 0 0 0 0.04 734.657 0 0 0 0 0 0 0 0 0 0 0 0 0 0 2070.91 0 0 0 0 0 0 0 0 479.522 0 0 0 0 0 0 0 0 0 0 -329.524 0 0 0 0 0 0 0 0 0 0 2286.83 0 
0 2163.38 0 0 0 0 1434.9 0.08 0 0 0 0 1251.49 0 0 0 0 0 0 0 0 0 0 0 0 0 0 -379.574 0 0 -739.235 0 0 1188.31 0 0 0 0 0 148.244 0 0 0 -331.202 0 -467.62 537.507 0 0 0 2239.83 -183.645 0 0 0 
877.941 0 0 0 0 0 0 0 0.09 0 0 0 1919.23 0 0 0 0 0 0 0 0 0 0 0 0 2134.54 0 0 -1195.49 -2477.87 0 0 0 241.935 0 0 0 0 0 0 0 0 0 0 0 0 0 0 0 0 0 0 0 0 0 
1441.31 0 -1335.41 0 0 0 0 0 0 0.06 0 0 0 0 0 0 0 0 0 0 0 0 0 0 0 0 0 1304.28 0 0 0 0 0 0 0 0 0 0 0 0 0 0 0 0 0 0 0 0 0 0 -1022.14 0 464.721 0 0 
0 -1012.38 1434.45 0 0 0 0 0 0 0 0.06 0 0 0 0 0 0 0 0 0 882.672 0 0 0 0 0 0 0 -1266.9 0 0 0 0 0 0 0 1765.72 0 0 0 0 93.7681 0 0 0 0 0 0 0 0 0 0 0 0 0 
0 0 1059.07 0 0 0 0 0 0 0 0 0.08 0 0 1593.75 0 0 0 207.297 0 0 0 0 0 0 0 0 0 0 0 0 0 0 0 0 0 0 0 0 0 0 0 0 0 0 0 0 0 0 0 -1145.89 108.112 0 0 0 
0 0 0 0 0 217.521 0 -121.54 -602.206 0 0 0 0.01 0 0 0 0 -1909.16 0 -515.229 0 0 0 0 0 1584.44 0 0 0 0 -1215.17 0 957.289 0 0 0 0 0 0 -591.22 0 2146.6 0 0 0 0 1795.79 0 0 0 0 0 0 0 0 
0 1696.75 0 0 -1645.94 0 0 0 0 0 0 0 0 0.02 0 0 0 0 0 0 0 1942.58 1062.88 1973.71 0 0 0 -1335.11 0 0 0 0 0 0 0 0 0 0 0 0 0 0 0 0 0 0 0 0 0 0 0 0 0 0 0 
0 2372.89 0 0 0 0 0 0 0 0 0 23.7281 0 0 0.06 0 0 0 0 0 0 445.799 1101.79 0 0 0 0 0 0 0 0 0 0 1176.26 0 1322.44 0 0 0 0 0 0 0 0 0 0 0 -1888.71 0 0 0 0 0 0 0 
0 0 0 1973.56 1093.25 0 0 0 0 0 0 0 0 0 0 0.04 0 0 0 0 0 0 0 0 0 0 0 0 0 0 0 0 0 0 0 0 0 0 0 0 0 0 1975.84 0 0 0 1965.47 969.192 0 0 0 0 2002.09 0 0 
0 0 0 0 0 0 0 0 0 0 0 0 0 0 0 0 0.05 1088.98 0 0 0 0 0 0 0 964.919 0 0 0 0 0 -125.507 0 0 0 0 0 0 0 0 0 0 0 0 0 0 0 0 0 0 0 0 0 2359 0 
0 974.075 0 1386.84 0 0 0 0 0 0 0 0 266.655 0 0 0 -1644.87 0.09 0 0 0 0 0 0 0 2419.13 0 0 0 0 0 0 0 0 0 696.814 0 0 0 0 0 -2223.2 0 0 0 0 0 435.27 0 0 0 0 0 0 0 
0 0 0 0 0 0 0 0 0 0 0 2498.02 0 0 0 0 0 0 0.05 0 0 0 0 0 0 0 0 0 0 0 0 0 0 0 -549.409 0 1008.56 0 0 0 0 0 0 0 0 0 0 0 0 0 0 0 715.43 0 0 
0 0 0 0 1752.14 2128.44 0 0 0 0 0 0 1253.32 0 0 0 0 0 0 0.05 0 0 0 177.541 0 0 2097 0 0 0 0 -1441.92 0 0 0 0 0 0 1882.46 0 0 0 0 -344.63 0 0 0 0 0 0 0 0 0 0 -1126.21 
0 0 1952.5 0 1151.23 0 0 0 0 0 -421.537 0 0 0 0 0 0 0 0 0 0.07 0 0 0 0 0 0 0 0 0 0 0 -1018.02 0 0 0 0 0 0 0 0 1995.99 0 0 0 0 0 0 0 0 0 0 0 0 0 
0 0 0 0 0 0 0 0 0 0 0 0 0 1727.42 -1522.64 0 0 0 0 0 0 0.08 0 0 281.61 -472.961 0 0 0 0 0 0 0 0 0 0 0 0 972.854 0 463.805 0 0 0 0 0 0 0 0 0 1610.69 0 0 0 -2162.31 
0 0 0 1301.54 0 0 -949.812 0 0 0 0 0 0 -921.43 1777.17 0 0 0 0 0 0 0 0.05 0 0 0 0 0 0 0 0 0 0 0 -362.178 0 -1641.97 0 0 0 0 -782.113 0 0 0 0 0 0 0 2369.38 0 0 0 0 0 
0 0 0 0 0 686.59 0 0 0 0 0 0 0 -1158.56 0 0 0 0 0 966.14 0 0 0 0.06 0 -900.22 0 0 0 0 0 0 0 -160.604 0 0 0 0 0 0 0 0 0 1119.34 1961.35 985.519 0 693.304 0 1846.14 0 1188.01 0 0 0 
0 0 0 0 0 0 0 0 0 0 0 0 0 0 0 0 0 0 0 0 0 -932.875 0 0 0.08 0 0 2476.81 -664.617 0 0 258.11 0 0 0 0 0 0 0 0 0 0 0 0 -2023.15 0 0 2435.3 0 0 0 2164.91 0 0 0 
0 0 0 0 0 0 0 0 1757.64 0 0 0 -2278.28 0 0 0 1210.75 2246.24 0 0 0 -703.07 0 1700.72 0 0.04 801.34 0 0 0 0 0 0 0 0 -1016.95 -168.386 0 0 0 0 0 0 0 0 0 0 0 0 0 0 0 0 0 0 
0 0 0 0 0 0 0 0 0 0 0 0 0 0 0 0 0 0 0 -1532.41 0 0 0 0 0 2291.56 0.02 0 0 2077.32 259.636 0 1725.59 -1753.67 0 0 -1278.04 0 0 1213.19 0 0 0 0 0 0 0 0 0 0 0 -881.603 0 -1281.7 0 
0 0 0 0 0 0 0 -2305.6 0 1495.18 0 0 0 1686.99 0 0 0 0 0 0 0 0 0 0 323.267 0 0 0.05 0 0 395.596 0 1977.07 0 0 0 0 0 -540.254 0 0 0 0 0 0 0 0 0 0 0 0 0 0 0 0 
0 0 0 0 0 0 0 0 8.31629 0 826.06 0 0 0 0 0 0 0 0 0 0 0 0 0 -1874.83 0 0 0 0.05 0 0 0 0 0 0 0 0 2388.15 0 0 0 0 0 0 0 0 0 0 0 0 0 0 0 0 0 
0 2015.52 0 0 0 0 0 0 1676.61 0 0 0 0 0 0 0 0 0 0 0 0 0 0 0 0 0 2380.67 0 0 0.04 0 0 0 0 0 0 0 0 0 0 0 0 0 0 0 0 0 1872.84 0 0 0 0 0 0 0 
0 0 -800.272 0 0 0 0 1965.01 0 0 0 0 647.374 0 0 0 0 0 0 0 0 0 0 0 0 0 2451.02 1669.59 0 0 0.02 0 0 -637.761 0 0 0 0 0 0 0 0 0 0 0 0 0 0 0 0 0 0 0 0 0 
0 1157.03 0 1773.66 0 0 -1245.23 0 0 0 0 0 0 0 0 0 -1406.52 0 0 -608.158 0 0 0 0 -924.94 0 0 0 0 0 0 0.06 896.1 0 0 0 0 0 0 0 2390.9 0 0 0 0 0 0 0 0 0 0 0 0 0 0 
0 0 0 0 0 1490.6 0 0 0 0 0 0 2170.25 0 0 0 0 0 0 0 875.042 0 0 0 0 0 -103.381 -444.426 0 0 0 2210.38 0.06 0 492.95 0 0 0 0 0 -872.143 0 0 0 0 0 0 0 -1980.27 0 0 604.801 0 0 0 
0 0 1678.44 0 0 0 0 -2463.07 1180.84 0 0 0 0 0 -841.014 0 0 0 0 0 0 0 0 2234.64 0 0 894.269 0 0 0 2235.56 0 0 0 0 958.357 -1449.4 0 0 0 0 0 0 0 0 0 0 0 0 0 0 935.163 2357.02 0 0 
0 -1112.78 0 0 0 0 0 0 0 0 0 0 0 0 0 0 0 0 2370.14 0 0 0 -2177.72 0 0 0 0 0 0 0 0 0 2399.14 0 0.02 -1944.72 770.516 396.664 0 0 0 0 0 0 0 0 1576.36 0 0 0 0 0 0 0 0 
0 0 0 0 0 0 0 0 0 0 0 0 0 0 1330.84 0 0 2408.6 0 0 0 0 0 0 0 -1148.79 0 0 0 0 0 0 0 -265.74 330.287 0.06 0 0 0 0 0 0 0 0 0 0 0 0 859.02 0 0 0 0 642.033 2109.67 
0 0 0 0 352.412 0 0 0 0 0 2118.82 0 0 0 0 0 0 0 -652.715 0 0 0 2073.05 0 0 -1243.55 -643.864 0 0 0 0 0 0 1482.21 -978.957 0 0.08 0 0 0 0 0 0 0 -1885.36 0 0 0 -451.445 0 0 0 2237.08 0 0 
0 2029.86 -1696.75 2399.14 0 0 0 0 0 0 0 0 0 0 0 0 0 0 0 0 0 0 0 0 0 0 0 0 2452.24 0 0 0 0 0 -61.1133 0 0 0.01 0 0 0 0 0 0 0 437.101 0 -2167.2 -873.058 628.147 0 2020.1 0 0 0 
0 259.178 -1931.29 0 0 0 0 0 0 0 0 0 0 0 0 0 0 0 0 1872.08 0 2080.37 0 0 0 0 0 -65.9963 0 0 0 0 0 0 0 0 0 0 0.07 0 -1898.63 0 0 0 0 0 0 0 0 181.356 1956.31 0 -17.1667 0 0 
0 0 0 0 0 0 0 1527.53 0 0 0 0 1539.28 0 0 0 0 0 0 0 0 0 0 0 0 0 -356.685 0 0 0 0 0 0 0 0 0 0 0 0 0.08 0 -1347.62 0 0 0 0 882.214 0 0 0 0 0 0 0 0 
0 2448.27 0 0 0 0 0 0 0 0 0 0 0 0 0 0 0 0 0 0 0 -858.409 0 0 0 0 0 0 0 0 0 1282.92 1063.34 0 0 0 0 0 -2485.81 0 0.06 0 0 0 482.116 0 0 0 -1096.91 0 0 0 0 0 2494.35 
0 0 0 0 0 0 0 0 0 0 924.94 0 2475.43 0 0 0 0 -983.993 0 0 60.0452 0 1964.4 0 0 0 0 0 0 0 0 0 0 0 0 0 0 0 0 2191 0 0.03 0 0 0 0 0 0 0 0 0 0 0 0 0 
2452.54 0 0 0 0 0 2371.06 0 0 0 0 0 0 0 0 -1723.91 0 0 0 0 0 0 0 0 0 0 0 0 0 0 0 0 0 0 0 0 0 0 0 0 0 0 0.03 0 0 0 -575.35 -1842.33 0 675.756 0 0 0 0 0 
0 0 0 0 0 0 0 -2303.46 0 0 0 0 0 0 0 0 0 0 0 1045.95 0 0 0 2024.67 0 0 0 0 0 0 0 0 0 0 0 0 0 0 0 0 0 0 0 0.05 0 0 0 0 0 0 -163.503 0 0 0 1922.28 
0 0 0 0 1859.72 0 0 0 0 0 0 0 0 0 0 0 0 0 0 0 0 0 0 2101.12 1270.71 0 0 0 0 0 0 0 0 0 0 0 -869.091 0 0 0 1407.9 0 0 0 0.08 0 0 0 0 0 0 0 0 0 0 
0 2486.88 -516.907 2396.54 0 0 0 607.089 0 0 0 0 0 0 0 0 0 0 0 0 0 0 0 1302 0 0 0 0 0 0 0 0 0 0 0 0 0 505.921 0 0 0 0 0 0 0 0.09 0 0 0 0 2211.6 0 0 0 0 
0 0 635.014 0 0 -1960.28 0 773.873 0 0 0 0 -2289.57 0 0 1288.87 0 0 0 0 0 0 0 0 0 0 0 0 0 0 0 0 0 0 1383.48 0 0 0 0 1750.01 0 0 -1185.57 0 0 0 0.01 0 0 0 0 0 0 0 0 
0 0 225.608 0 0 0 0 0 0 0 0 0 0 0 351.192 -16.4037 0 506.226 0 0 0 0 0 -1433.38 -980.178 0 0 0 0 833.384 0 0 0 0 0 0 0 -419.706 0 0 0 0 2234.79 0 0 0 0 0.01 0 -880.84 0 0 0 0 0 
0 0 0 0 0 0 0 0 0 0 0 0 0 0 0 0 0 0 0 0 0 0 0 0 0 0 0 0 0 0 0 0 -1612.67 0 0 254.448 2484.89 1007.95 0 0 -274.285 0 0 0 0 0 0 0 0.04 0 0 2211.6 0 0 0 
0 0 0 0 0 0 0 0 0 0 0 0 0 0 0 0 0 0 0 0 0 0 1340.91 2003.31 0 0 0 0 0 0 0 0 0 0 0 0 0 1183.43 351.955 0 0 0 -146.26 0 0 0 0 1915.11 0 0.05 1492.89 0 0 0 0 
0 0 0 0 0 0 0 1585.36 0 -521.485 0 1747.72 0 0 0 0 0 0 0 0 0 -1252.1 0 0 0 0 0 0 0 0 0 0 0 0 0 0 0 0 2469.18 0 0 0 0 -2024.06 0 1651.59 0 0 0 -1237.6 0.07 -1227.07 0 0 0 
0 0 0 0 0 0 0 -1149.25 0 0 0 1580.63 0 0 0 0 0 0 0 0 0 0 0 -1175.65 2379.45 0 2064.65 0 0 0 0 0 2080.07 506.989 0 0 0 1901.07 0 0 0 0 0 0 0 0 0 0 -1238.98 0 1323.82 0.06 0 0 0 
0 0 -1418.42 0 0 0 0 0 0 -874.737 0 0 0 0 0 1586.73 0 0 801.645 0 0 0 0 0 0 0 0 0 0 0 0 0 0 1401.94 0 0 95.5992 0 1458.4 0 0 0 0 0 0 0 0 0 0 0 0 0 0.05 2151.63 0 
0 0 0 0 0 0 2142.02 0 0 0 0 0 0 0 0 0 -469.756 0 0 0 0 0 0 0 0 0 671.026 0 0 0 0 0 0 0 0 -153.127 0 0 0 0 0 0 0 0 0 0 0 0 0 0 0 0 1811.2 0 0 
0 0 1607.94 0 0 0 0 0 0 0 0 0 0 0 0 0 0 0 0 -183.34 0 1638.62 0 0 0 0 0 0 0 0 0 0 0 0 0 -1424.38 0 0 0 0 527.741 0 0 -1732.46 0 0 0 0 0 0 0 0 0 0 0 
