*Vertices 51
*Matrix 
0.03 0 -432.829 0 0 0 0 0 0 0 0 0 92.0896 821.787 0 0 0 0 0 593.051 0 0 0 1836.53 0 0 0 1503.42 0 0 0 -1512.27 0 0 0 0 0 0 0 0 0 0 1968.83 0 0 0 0 0 0 0 0 
0 0.01 -425.962 0 0 0 0 0 2081.44 -1283.53 0 0 60.3504 0 0 -904.797 -670.721 -1774.88 0 0 2203.21 1136.13 0 0 0 0 0 0 0 0 0 0 0 0 0 1398.43 0 0 0 0 0 0 0 523.011 0 0 0 0 0 0 0 
998.947 222.709 0.03 0 0 -384.457 0 0 0 0 0 0 0 0 1631.14 0 -893.201 0 0 1502.35 0 0 -319.3 339.595 0 -1443.91 0 0 0 0 0 60.5029 0 236.137 0 0 0 0 0 0 0 0 0 0 2314.75 0 0 0 0 0 0 
0 0 0 0.03 0 0 0 2374.87 0 0 1093.86 0 0 -1803.87 0 0 1737.04 87.3592 0 0 586.489 0 0 0 0 0 0 0 0 0 1828.29 0 0 0 0 1715.83 2233.73 0 0 0 569.552 0 0 0 0 0 58.6718 1114.31 0 0 0 
0 0 0 0 0.03 0 -1260.8 201.804 0 0 1034.81 -317.774 0 0 0 0 666.601 0 1132.16 498.901 0 0 -2303.16 2187.95 0 -683.691 0 253.685 -1638.46 0 -1033.43 0 0 2123.25 -1688.36 0 0 0 0 0 0 0 0 0 0 2023.76 0 0 0 0 0 
0 0 1140.86 0 0 0.03 -77.5933 1318.32 0 -2360.99 0 0 0 0 2277.67 -452.055 0 0 0 -138.783 0 0 1705.3 -1070.21 0 1605.35 0 0 0 0 0 -1107.44 0 0 0 890.301 0 0 0 0 0 1947.31 0 0 1001.08 0 0 0 0 -2146.44 0 
0 0 0 0 -1759.77 1495.48 0.01 0 0 0 0 0 0 0 0 0 0 0 -1982.1 0 0 0 0 0 0 0 0 1922.44 0 0 1528.29 0 2451.78 0 0 0 1839.88 -1719.64 1182.82 0 -42.8022 0 0 429.777 0 0 0 0 0 0 0 
0 0 0 587.863 1419.49 2499.08 0 0 0 -2248.83 0 0 -1334.65 -347.835 0 0 0 0 1209.22 0 0 0 -1290.09 0 0 0 0 2207.79 0 0 1310.39 0 0 0 0 1983.17 1252.4 0 0 0 0 0 0 0 0 0 0 0 0 2115.92 0 
0 -771.584 0 0 0 0 0 0 0.02 0 0 -795.694 1694.01 0 0 1063.95 0 1821.88 0 0 0 545.595 0 0 -2247 0 986.435 0 0 0 0 0 258.873 0 1910.54 0 806.986 1178.09 0 1325.95 555.361 0 0 0 0 332.27 0 0 0 0 0 
0 -1067 0 0 0 1788.31 0 691.473 0 0 0 -766.549 0 0 2433.16 1727.42 1819.59 0 0 0 0 0 0 0 -1659.98 1717.66 -1555.91 -1545.84 1439.94 0 0 0 0 1174.43 0 0 0 0 0 0 0 0 0 2228.39 0 1304.13 0 0 0 0 2320.4 
0 0 0 -202.567 2104.33 0 0 0 0 0 0.09 -1424.22 0 0 1748.94 0 0 0 0 452.208 0 -1614.35 0 1536.68 0 0 0 0 0 0 313.501 1164.82 2206.87 0 1533.78 0 0 1665.93 0 0 0 845.744 705.969 0 0 0 0 0 0 0 0 
0 0 0 0 1473.82 0 0 0 -2107.07 320.215 1088.06 0.02 0 0 1835.92 2077.78 438.017 -1065.63 2465.21 0 0 -2142.02 47.38 0 0 0 -1586.12 421.69 0 0 1746.35 0 0 0 0 0 0 0 0 0 0 2198.02 0 -1835.61 0 0 1528.29 0 0 0 0 
-565.584 575.198 0 0 0 0 0 208.365 -1541.41 0 0 0 0.05 0 1714 0 0 0 0 0 0 0 0 0 0 0 0 0 0 0 0 2331.54 0 -2347.56 0 1982.1 0 1240.81 0 0 0 2432.25 0 0 952.406 0 0 0 0 0 0 
389.492 0 0 1728.95 0 0 0 333.644 0 0 0 0 0 0.03 964.461 0 985.519 0 0 2057.02 0 0 0 0 -936.079 0 0 0 -632.115 0 978.5 0 0 0 0 0 0 759.682 0 0 0 0 0 2073.5 0 0 0 0 0 0 -1160.7 
0 0 1811.2 0 0 2324.67 0 0 0 -394.528 -961.867 2181.23 1853.92 1136.43 0.08 0 2355.19 0 0 0 0 0 2326.5 -1258.81 0 0 0 0 0 0 0 0 0 0 0 0 0 0 0 -1878.49 0 0 329.981 0 0 0 0 0 0 0 0 
0 1346.86 0 0 0 -836.741 0 0 -686.895 136.799 0 -1040.15 0 0 0 0.05 0 0 0 0 0 0 0 0 0 0 0 0 0 0 0 0 0 0 102.161 2414.09 2113.64 0 2480.93 0 1092.18 0 0 0 0 886.334 0 0 0 0 0 
0 -1466.34 -1234.86 2490.69 2035.66 0 0 0 0 1894.51 0 2351.22 0 -675.146 185.476 0 0.01 0 0 0 984.451 0 0 0 0 0 0 -5.87481 0 -546.663 0 0 0 0 0 0 0 0 1089.89 0 996.658 0 0 0 1699.96 0 0 939.131 0 0 0 
0 540.559 0 1220.51 0 0 0 0 -1725.59 0 0 1261.41 0 0 0 0 0 0.04 0 743.965 0 0 0 1174.28 0 0 0 2471.62 299.768 0 0 0 0 0 0 1488.62 0 0 0 0 0 0 0 0 0 0 0 0 0 0 0 
0 0 0 0 525.3 0 1125.14 916.395 0 0 0 684.759 0 0 0 0 0 0 0.07 0 0 0 0 905.408 0 0 0 0 0 0 0 0 0 -1611 931.196 0 0 0 0 -1618.02 0 0 0 1993.55 0 0 0 0 0 0 0 
2265.16 0 1284.75 0 819.498 220.267 0 0 0 0 -74.3889 0 0 -58.5192 0 0 0 -315.943 0 0.04 0 0 0 0 0 0 0 0 0 0 0 0 0 0 1159.47 0 0 0 602.664 1433.68 1392.64 0 0 -1042.44 0 -262.535 -1717.2 0 0 0 0 
0 211.875 0 2140.03 0 0 0 0 0 0 0 0 0 0 0 0 742.439 0 0 0 0.03 577.639 0 808.664 889.081 0 0 0 0 1872.08 0 0 -406.43 -663.244 0 -438.169 0 0 0 0 0 722.297 0 360.042 0 -744.88 0 0 0 0 0 
0 1318.48 0 0 0 0 0 0 2080.68 0 116.352 -510.193 0 0 0 0 0 0 0 0 2272.18 0 0 0 0 589.694 0 0 0 0 698.798 0 0 0 0 0 0 0 0 0 0 -1477.78 0 -2185.35 0 0 0 0 0 926.313 0 
0 0 1861.4 0 2069.99 2006.97 0 -81.7133 0 0 0 -1082.72 0 0 254.143 0 0 0 0 0 0 0 0 0 0 0 0 0 899.152 0 0 0 888.318 1758.86 0 0 0 0 0 0 0 0 0 -1918.16 0 0 0 0 0 0 -494.629 
1045.95 0 2179.25 0 629.368 1251.79 0 0 0 0 1984.69 0 0 0 -880.993 0 0 -1634.19 473.113 0 -825.144 0 0 0.03 0 0 0 -1868.42 -412.687 0 -1853.31 0 1806.01 347.224 0 0 0 0 1002.61 0 0 -789.438 0 0 0 0 0 -70.7266 0 2068.47 0 
0 0 0 0 0 0 0 0 1949.14 -966.597 0 0 0 -1830.42 0 0 0 0 0 0 -266.045 0 0 0 0.06 0 1839.88 0 0 0 0 -218.436 -1026.87 0 0 0 1565.83 2250.05 1781.75 0 1493.96 0 0 0 0 0 0 0 0 0 0 
0 0 691.626 0 1236.08 230.186 0 0 0 -1963.79 0 0 0 0 0 0 0 0 0 0 0 2065.87 0 0 0 0 -669.042 0 0 -1406.37 0 0 0 2109.67 0 0 1015.73 0 0 0 0 -1039.38 0 0 0 -262.688 0 0 0 0 0 
0 0 0 0 0 0 0 0 2496.49 -389.798 0 1054.19 0 0 0 0 0 0 0 0 0 0 0 0 -170.98 1020 0.09 0 0 0 2358.55 0 0 0 0 0 0 0 0 0 0 0 0 0 0 0 0 -551.241 0 0 2419.74 
511.261 0 0 0 1843.09 0 2415.92 1897.87 0 -203.635 0 -2162.92 0 0 0 0 1049.46 1228.14 0 0 0 0 0 -1498.99 0 0 0 0.07 0 0 0 0 0 0 0 0 0 1290.09 1067.92 0 -596.561 819.956 0 0 0 -777.383 0 0 -133.29 0 0 
0 0 0 0 1809.21 0 0 0 0 2045.88 0 0 0 2191.61 0 0 0 -783.486 0 0 0 0 2164.14 -1794.87 0 0 0 0 0.03 0 0 -1805.25 0 1804.03 0 0 0 0 0 0 0 0 -267.876 0 -636.082 0 0 0 0 0 -815.836 
0 0 0 0 0 0 0 0 0 0 0 0 0 0 0 0 1870.71 0 0 0 900.372 0 0 0 0 -1699.19 0 0 0 0.09 0 0 -1314.97 418.638 0 1414.3 -1319.54 1475.8 0 0 -108.417 1225.39 2365.26 -1607.49 0 0 0 0 0 2282.25 0 
0 0 0 959.883 -712.531 0 466.552 -1634.04 0 0 1001.24 -908.155 0 1298.03 0 0 0 0 0 0 0 1122.09 0 182.424 0 0 293.97 0 0 0 0 199.362 0 0 0 19.1504 0 0 0 1344.26 0 1878.8 -1900.92 0 0 1940.14 0 0 0 0 0 
-135.121 0 1841.87 0 0 -1428.5 0 0 0 0 393.002 0 1929.91 0 0 0 0 0 0 0 0 0 0 0 804.392 0 0 0 402.31 0 -635.319 0.01 0 2343.29 1870.56 0 0 0 0 0 -24.0333 1889.78 -1854.08 0 953.932 0 0 0 0 0 1152.15 
0 0 0 0 0 0 -2026.66 0 175.71 0 2474.97 0 0 0 0 0 0 0 0 0 -2067.71 0 -1592.99 1226 1657.54 0 0 0 0 -1070.67 0 0 0.02 0 0 0 2260.58 -1598.18 0 0 860.851 0 0 0 0 0 2141.87 0 -1062.12 1859.26 0 
0 0 767.922 0 2388.45 0 0 0 0 579.775 0 0 -2274.32 0 0 0 0 0 1638.31 0 1747.11 0 1405.76 -451.598 0 -1821.73 0 0 1370.51 -397.122 0 78.5089 0 0.09 0 0 0 0 0 0 0 1571.32 0 0 0 0 0 -2477.57 0 0 0 
0 0 0 0 1294.37 0 0 0 1205.1 0 820.109 0 0 0 0 -997.421 0 0 -227.897 -2317.04 0 0 0 0 0 0 0 0 0 0 0 729.316 0 0 0.08 0 0 0 0 0 1190.6 0 1932.97 1004.14 0 0 0 0 0 0 -2212.82 
0 -112.537 0 1734.14 0 -1571.17 0 1900.77 0 0 0 0 -168.996 0 0 -750.832 0 543.001 0 0 -568.789 0 0 0 0 0 0 0 0 -505.615 88.58 0 0 0 0 0.05 0 0 0 0 0 2123.71 0 0 0 0 0 -2283.93 0 0 0 
0 0 0 12.7415 0 0 -2384.49 700.476 -2206.72 0 0 0 0 0 0 330.439 0 0 0 0 0 0 0 0 1706.67 1458.1 0 0 0 -957.747 0 0 1546.3 0 0 0 0.09 0 2342.83 0 0 0 0 0 0 0 31.3578 0 1373.26 0 0 
0 0 0 0 0 0 -26.017 0 76.5252 0 -588.931 0 -1441.92 -29.5267 0 0 0 0 0 0 0 0 0 0 -1595.28 0 0 -1080.58 0 501.495 0 0 1189.84 0 0 0 0 0.09 2290.8 2498.32 0 0 0 0 0 0 -943.556 0 0 0 0 
0 0 0 0 0 0 1558.35 0 0 0 0 0 0 0 0 1574.53 1312.52 0 0 464.568 0 0 0 -849.712 -1411.56 0 0 -1355.71 0 0 0 0 0 0 0 0 426.42 1018.63 0.05 0 -1553.32 1051.9 334.864 0 0 0 0 0 0 0 0 
0 0 0 0 0 0 0 0 1914.81 0 0 0 0 0 2084.8 0 0 0 -386.593 -555.818 0 0 0 0 0 0 0 0 0 0 270.318 0 0 0 0 0 0 289.697 0 0.01 0 0 0 0 2239.52 1778.85 0 365.841 0 0 0 
0 0 0 -2284.69 0 0 2468.11 0 1627.32 0 0 0 0 0 0 638.676 1906.72 0 0 -1341.67 0 0 0 0 1316.95 0 0 2258.75 0 1272.7 0 1611.15 -2015.06 0 261.01 0 0 0 238.731 0 0.05 0 0.839259 1151.84 -32.8837 -2274.47 0 0 0 0 0 
0 0 0 0 0 -2404.32 0 0 0 0 2266.23 164.724 474.334 0 0 0 0 0 0 0 2110.43 1860.79 0 785.165 0 411.313 0 -1623.81 0 1318.63 -2074.88 -1262.78 0 -1090.81 0 2090.75 0 0 -518.281 0 0 0.02 2107.84 0 0 0 0 0 0 0 -726.417 
-1076.77 0 0 0 0 0 0 0 0 0 -2.97555 0 0 0 2196.95 0 0 0 0 0 0 0 0 0 0 0 0 0 -1384.09 248.344 -699.255 1977.37 0 0 -1705.3 0 0 0 -1311.61 0 788.217 868.023 0.09 0 1409.57 0 1042.44 0 0 0 -1034.65 
0 -426.878 0 0 0 0 -2216.18 0 0 2061.14 0 1550.87 0 2133.93 0 0 0 0 228.202 2320.09 1256.98 85.2229 1224.02 0 0 0 0 0 0 -2213.58 0 0 0 0 -1780.83 0 0 0 0 0 383.541 0 0 0.09 0 1314.66 0 0 -1288.57 0 0 
0 0 657.75 0 0 -660.497 0 0 0 0 0 0 2313.53 0 0 0 -1472.29 0 0 0 0 0 0 0 0 0 0 0 -239.799 0 0 1988.51 0 0 0 0 0 0 0 1860.03 -1332.67 0 1722.85 0 0.03 2214.65 0 0 -472.961 0 0 
0 0 0 0 1622.75 0 0 0 2201.38 1581.39 0 0 0 0 0 -1791.97 0 0 0 -23.2704 1010.54 0 0 0 0 1962.26 0 1386.84 0 0 -2135.61 0 0 0 0 0 0 0 0 2405.55 168.996 0 0 9.23185 -2404.93 0.04 0 0 0 2081.13 0 
0 0 0 1813.79 0 0 0 0 0 0 0 1714.45 0 0 0 0 0 0 0 1049.91 0 0 0 0 0 0 0 0 0 0 0 0 627.079 0 0 0 -401.09 708.106 0 0 0 0 868.633 0 0 0 0.01 0 0 0 0 
0 0 0 1616.03 0 0 0 0 0 0 0 0 0 0 0 0 -895.337 0 0 0 0 0 0 -374.081 0 0 867.107 0 0 0 0 0 0 -1259.73 0 -389.035 0 0 0 1385.16 0 0 0 0 0 0 0 0.09 0 1522.49 0 
0 0 0 0 0 0 0 0 0 0 0 0 0 0 0 0 0 0 0 0 0 0 0 0 0 0 0 1841.87 0 0 0 0 1202.05 0 0 0 -1144.83 0 0 0 0 0 0 -2037.19 896.71 0 0 0 0.01 0 0 
0 0 0 0 0 -2500 0 1251.03 0 0 0 0 0 0 0 0 0 0 0 0 0 -20.5237 0 -161.214 0 0 0 0 0 -1199.15 0 0 -620.67 0 0 0 0 0 0 0 0 0 0 0 0 2476.04 0 681.86 0 0 0 
0 0 0 0 0 0 0 0 0 1891.92 0 0 0 499.664 0 0 0 0 0 0 0 0 1245.54 0 0 0 2244.71 0 -2169.03 0 0 366.909 0 0 -1748.94 0 0 0 0 0 0 -1585.67 1513.03 0 0 0 0 0 0 0 0.09 
