*Vertices 59
*Matrix 
0.09 0 0 2394.86 0 0 0 0 -863.292 0 0 -1632.97 0 0 0 0 0 0 0 0 428.251 0 1217.76 0 1854.23 0 0 0 0 0 0 0 0 0 0 0 0 0 0 0 0 0 0 0 0 0 1051.13 0 0 0 0 0 0 0 0 0 0 0 0 
0 0.03 0 0 -574.435 0 0 -2405.7 0 0 0 0 0 1868.88 0 1401.94 1613.74 0 0 0 0 0 0 0 0 0 0 0 0 -1201.44 0 0 0 0 0 0 0 0 0 0 0 0 -379.269 0 0 0 0 2041.15 0 0 0 0 0 0 0 0 0 0 0 
0 0 0 0 0 0 0 0 0 0 0 0 0 -1186.48 0 1479 -166.707 0 0 0 0 0 0 0 0 0 0 0 0 1400.72 0 0 851.085 0 0 0 0 0 0 0 0 0 0 0 0 0 0 0 0 0 0 0 0 0 0 0 0 0 0 
-688.879 0 0 0.05 0 0 0 0 0 0 0 1959.82 0 0 0 0 0 0 0 0 0 1014.36 0 0 0 0 0 0 0 0 0 0 -578.555 0 0 0 -295.953 0 0 0 0 0 0 0 0 0 -373.47 0 0 0 0 0 0 0 0 0 0 0 0 
0 187.765 0 0 0.02 0 0 0 0 -1738.56 0 0 0 0 0 0 0 0 0 0 0 0 67.98 0 0 2012.62 0 0 0 0 0 0 0 0 0 0 0 0 0 906.476 0 0 0 0 0 473.113 -213.553 0 0 0 0 0 0 0 0 0 0 0 0 
0 0 0 0 0 0.01 0 0 0 637.913 0 0 0 0 0 2239.52 390.561 528.504 0 -1407.13 681.86 0 0 0 -617.466 0 0 0 1255.46 0 0 2482.3 0 0 0 0 0 0 1817.76 -1312.52 0 0 0 0 0 0 0 0 0 0 0 0 0 0 0 0 0 0 0 
0 0 0 0 0 0 0.02 0 0 0 0 0 0 0 0 0 0 0 0 0 0 2380.37 0 0 0 0 1885.97 0 0 0 0 0 0 0 -756.172 0 0 0 0 0 1790.29 0 0 0 0 0 0 -1286.89 0 0 0 0 0 0 0 0 0 0 0 
0 1033.74 0 0 0 0 0 0.09 0 0 0 336.848 0 0 0 0 0 0 0 0 0 0 0 0 0 1024.58 0 0 160.146 1511.2 0 0 0 0 0 0 0 0 0 0 0 0 0 0 0 0 0 1612.37 0 0 0 0 0 0 0 0 0 0 0 
418.18 0 0 0 0 0 0 0 0.08 -1047.01 0 0 0 0 0 0 0 1931.14 0 0 630.741 0 0 1439.48 0 -348.903 0 0 0 2413.79 0 0 0 0 521.943 0 0 0 0 0 912.58 0 0 0 0 0 0 316.248 0 0 0 0 -2336.12 0 0 0 0 0 0 
0 0 0 0 1626.41 -1159.63 0 0 2273.09 0 0 0 0 0 1357.84 0 0 0 0 0 0 0 274.438 1886.58 1471.22 0 0 -2085.71 0 0 0 0 0 0 44.9385 0 0 0 0 0 0 0 0 0 0 0 0 0 0 0 0 0 0 0 0 0 0 0 0 
0 0 0 0 0 0 0 0 0 0 0.05 0 0 0 0 0 0 0 0 0 0 0 0 0 0 0 0 0 0 2416.99 0 0 0 -670.568 0 0 938.673 0 0 0 -667.821 0 0 0 0 0 0 0 0 0 0 0 0 0 0 0 0 0 0 
1021.07 0 0 357.448 0 0 0 2337.34 0 0 0 0.05 240.41 0 0 2174.21 0 0 0 0 0 0 0 0 0 0 0 0 0 0 0 0 0 0 381.252 0 0 0 0 0 -456.175 0 359.89 0 0 437.864 0 0 0 0 0 0 0 0 839.183 0 0 0 0 
0 0 0 0 0 0 0 0 0 0 0 1520.66 0.02 0 0 0 0 0 0 0 0 0 0 0 0 1412.93 -2106.31 909.375 0 0 0 0 0 0 0 0 0 0 0 462.279 768.38 0 0 0 0 2217.4 0 0 0 0 0 0 0 1385.16 0 0 0 0 0 
0 2009.87 327.387 0 0 0 0 0 0 0 0 0 0 0.04 1898.94 0 0 2314.14 0 0 0 0 0 0 0 0 0 0 0 0 0 0 0 0 0 0 0 0 0 0 0 0 840.403 0 0 0 0 0 0 0 0 0 0 0 0 0 0 0 0 
0 0 0 0 0 0 0 0 0 -857.494 0 0 0 -874.432 0 0 0 0 1877.42 0 0 0 0 0 0 1810.59 2189.32 0 0 0 0 0 0 0 0 0 0 0 0 0 313.654 0 0 -1130.18 0 0 0 -374.538 0 0 0 0 0 0 0 0 0 0 0 
0 -562.227 1855.3 0 0 -1481.75 0 0 0 0 0 2305.44 0 0 0 0.05 0 0 0 0 0 2344.66 0 0 0 0 2417.91 0 0 0 0 0 0 0 0 0 0 0 0 0 0 0 -1402.71 0 0 0 0 0 0 0 0 0 0 0 0 0 -1598.18 0 0 
0 2017.65 2458.65 0 0 1945.33 0 0 0 0 0 0 0 0 0 0 0.05 0 0 1371.12 0 0 0 0 0 0 1185.42 2110.89 0 0 226.218 0 0 0 0 0 0 0 1595.89 0 -1773.2 0 0 0 0 0 0 2483.37 0 0 0 -477.996 0 0 0 0 0 0 0 
0 0 0 0 0 1641.97 0 0 2240.29 0 0 0 0 1100.27 0 0 0 0.06 0 0 0 -320.826 0 0 0 0 0 0 0 0 0 0 0 0 0 -2438.51 0 0 884.198 0 0 -1210.14 0 0 0 0 0 0 0 0 0 0 0 0 0 0 0 0 0 
0 0 0 0 0 0 0 0 0 0 0 0 0 0 1961.04 0 0 0 0.08 0 0 0 0 0 0 0 0 0 0 0 0 0 0 0 0 0 0 0 1133.53 0 0 0 0 0 0 0 0 0 0 0 0 0 0 0 0 0 0 0 0 
0 0 0 0 0 1070.06 0 0 0 0 0 0 0 0 0 0 568.026 0 0 0.06 0 0 0 0 0 0 534.303 0 0 0 0 2463.84 0 0 0 0 0 0 0 0 0 0 657.445 0 0 0 0 566.347 0 0 0 0 0 0 0 0 0 0 761.971 
1668.98 0 0 0 0 -197.531 0 0 -2004.23 0 0 0 0 0 0 0 0 0 0 0 0.01 0 457.549 -1921.83 0 0 644.932 0 0 0 0 0 0 0 0 0 0 0 0 0 0 904.035 0 2195.27 0 0 0 0 0 0 0 0 0 0 0 0 0 0 0 
0 0 0 1831.03 0 0 446.715 0 0 0 0 0 0 0 0 2330.62 0 1707.43 0 0 0 0.02 0 0 0 0 0 0 1731.85 427.03 711.768 0 0 0 0 0 0 0 0 -411.161 0 0 0 0 0 -278.863 0 0 0 0 0 0 0 0 0 0 0 0 0 
1995.83 0 0 0 -1460.84 0 0 0 0 756.783 0 0 0 0 0 0 0 0 0 0 -130.848 0 0 0 0 0 1804.64 0 0 0 0 0 0 0 0 0 0 0 1898.79 0 0 1590.55 0 1841.26 0 0 0 -1636.33 0 1398.74 0 0 0 0 0 0 0 0 0 
0 0 0 0 0 0 0 0 125.813 721.534 0 0 0 0 0 0 0 0 0 0 -1061.2 0 0 0.08 0 -717.414 0 0 0 1878.49 0 0 0 0 0 381.405 951.033 0 0 0 0 0 0 0 0 -360.042 0 0 0 0 0 0 0 0 0 0 0 0 0 
-1161.61 0 0 0 0 -479.217 0 0 0 1574.37 0 0 0 0 0 0 0 0 0 0 0 0 0 0 0.08 0 0 0 0 0 0 0 0 0 1528.9 79.577 0 0 0 0 0 0 0 0 0 0 0 2418.97 0 0 0 0 0 0 0 0 0 0 0 
0 0 0 0 1336.79 0 0 1063.19 -636.692 0 0 0 -1555.76 0 102.008 0 0 0 0 0 0 0 0 517.212 0 0.05 0 0 0 0 0 0 0 -1679.36 0 0 -9.23185 0 0 0 0 634.251 0 0 0 378.811 0 0 0 0 0 0 0 0 0 0 0 0 0 
0 0 0 0 0 0 886.029 0 0 0 0 0 -2428.89 0 2241.51 2463.07 -1147.42 0 0 821.329 1407.44 0 -1652.81 0 0 0 0.09 0 0 625.706 0 0 32.2733 0 0 0 0 0 0 0 0 0 0 0 0 0 0 0 -146.26 0 0 0 0 0 0 0 0 0 0 
0 0 0 0 0 0 0 0 0 391.018 0 0 2287.59 0 0 0 1475.65 0 0 0 0 0 0 0 0 0 0 0.03 0 0 1993.85 0 0 0 1150.32 0 0 724.738 0 0 0 0 0 0 0 0 0 0 0 0 0 0 0 0 0 0 0 0 0 
0 0 0 0 0 88.1222 0 -1062.27 0 0 0 0 0 0 0 0 0 0 0 0 0 -515.076 0 0 0 0 0 0 0.07 0 0 0 2242.88 0 0 0 0 0 0 0 0 0 0 0 0 0 0 0 0 0 0 0 0 0 0 0 0 0 0 
0 1371.58 1732.76 0 0 0 0 2097.92 2248.68 0 2344.97 0 0 0 0 0 0 0 0 0 0 -2086.02 0 -2226.4 0 0 378.964 0 0 0.09 0 0 0 121.387 0 0 2109.67 0 0 0 -1456.57 0 0 0 0 1031.45 0 0 0 0 0 0 0 0 0 0 0 0 0 
0 0 0 0 0 0 0 0 0 0 0 0 0 0 0 0 -89.4955 0 0 0 0 -1913.74 0 0 0 0 0 1606.57 0 0 0 0 0 0 0 0 0 0 0 0 0 266.198 0 -1388.21 2450.71 0 0 0 0 0 0 0 0 0 0 -189.291 0 0 0 
0 0 0 0 0 1079.82 0 0 0 0 0 0 0 0 0 0 0 0 0 2348.93 0 0 0 0 0 0 0 0 0 0 0 0.05 0 0 0 0 0 0 245.445 0 0 0 0 0 0 0 0 0 0 0 0 0 0 0 0 0 0 0 0 
0 0 1828.59 1956.16 0 0 0 0 0 0 0 0 0 0 0 0 0 0 0 0 0 0 0 0 0 0 1724.22 0 -346.156 0 0 0 0.02 0 0 0 0 0 -771.889 0 0 0 0 0 0 0 0 0 0 0 0 0 0 0 0 0 0 0 0 
0 0 0 0 0 0 0 0 0 0 -1621.37 0 0 0 0 0 0 0 0 0 0 0 0 0 0 1525.24 0 0 0 132.527 0 0 0 0.09 0 230.033 0 0 0 0 0 0 0 0 0 0 0 0 0 0 0 0 0 0 0 0 0 0 0 
0 0 0 0 0 0 -1811.04 0 214.011 828.043 0 2298.58 0 0 0 0 0 0 0 0 0 0 0 0 -63.86 0 0 1374.94 0 0 0 0 0 0 0.06 0 0 0 0 2317.19 0 0 0 0 0 465.178 0 0 0 0 0 0 0 0 0 0 0 0 0 
0 0 0 0 0 0 0 0 0 0 0 0 0 0 0 0 0 986.129 0 0 0 0 0 1291.01 -346.309 0 0 0 0 0 0 0 0 1908.7 0 0 0 0 0 0 0 0 0 0 0 0 0 0 0 0 0 0 0 0 0 0 0 0 0 
0 0 0 1048.08 0 0 0 0 0 0 1423.61 0 0 0 0 0 0 0 0 0 0 0 0 -1886.12 0 81.8659 0 0 0 2291.41 0 0 0 0 0 0 0.09 0 0 0 0 0 0 0 0 0 0 0 0 0 0 0 0 0 0 0 0 0 0 
0 0 0 0 0 0 0 0 0 0 0 0 0 0 0 0 0 0 0 0 0 0 0 0 0 0 0 1484.04 0 0 0 0 0 0 0 0 0 0.03 0 0 0 0 0 0 0 0 0 0 0 0 0 0 0 0 0 0 0 0 0 
0 0 0 0 0 -1255.91 0 0 0 0 0 0 0 0 0 0 -1368.83 -459.38 1976 0 0 0 1091.57 0 0 0 0 0 0 0 0 -744.728 2203.97 0 0 0 0 0 0.07 0 769.143 0 0 0 0 0 1412.47 0 0 0 0 0 0 0 0 0 0 0 0 
0 0 0 0 -1804.64 1736.73 0 0 0 0 0 0 2246.09 0 0 0 0 0 0 0 0 1993.55 0 0 0 0 0 0 0 0 0 0 0 0 34.1044 0 0 0 0 0.07 0 -1674.93 0 0 0 0 -285.119 581.301 0 0 0 0 0 0 0 0 0 0 0 
0 0 0 0 0 0 1705.6 0 130.238 0 2402.8 718.329 -1240.65 0 -2163.69 0 492.035 0 0 0 0 0 0 0 0 0 0 0 0 2134.85 0 0 0 0 0 0 0 0 -1996.9 0 0.04 0 0 0 0 0 0 0 0 0 0 0 0 0 0 0 0 0 0 
0 0 0 0 0 0 0 0 0 0 0 0 0 0 0 0 0 1848.89 0 0 2398.37 0 439.543 0 0 -1842.78 0 0 0 0 -1007.8 0 0 0 0 0 0 0 0 1753.97 0 0.09 0 0 0 0 0 0 0 0 0 0 0 0 0 0 0 0 0 
0 -704.596 0 0 0 0 0 0 0 0 0 1918.93 0 1931.14 0 888.775 0 0 0 878.704 0 0 0 0 0 0 0 0 0 0 0 0 0 0 0 0 0 0 0 0 0 0 0.08 0 0 0 0 0 0 0 0 0 0 0 0 0 0 0 0 
0 0 0 0 0 0 0 0 0 0 0 0 0 0 -145.192 0 0 0 0 0 1839.27 0 1180.68 0 0 0 0 0 0 0 849.559 0 0 0 0 0 0 0 0 0 0 0 0 0.09 0 0 0 0 0 0 0 0 0 0 0 0 0 1734.6 0 
0 0 0 0 0 0 0 0 0 0 0 0 0 0 0 0 0 0 0 0 0 0 0 0 0 0 0 0 0 0 2017.35 0 0 0 0 0 0 0 0 0 0 0 0 0 0.09 0 -1420.26 0 0 0 0 0 0 0 0 0 0 0 0 
0 0 0 0 119.861 0 0 0 0 0 0 1161.15 860.851 0 0 0 0 0 0 0 0 1835.31 0 982.62 0 2169.03 0 0 0 1608.1 0 0 0 0 1651.59 0 0 0 0 0 0 0 0 0 0 0.08 -2388.91 0 0 0 0 0 0 0 0 0 0 0 0 
-1951.89 0 0 1576.05 1655.25 0 0 0 0 0 0 0 0 0 0 0 0 0 0 0 0 0 0 0 0 0 0 0 0 0 0 0 0 0 0 0 0 0 1463.9 -1769.08 0 0 0 0 1880.47 1031.45 0.04 0 0 0 0 0 0 0 0 0 0 0 0 
0 281.762 0 0 0 0 -2181.84 608.005 -1739.94 0 0 0 0 0 1389.13 0 1426.05 0 0 1143.76 0 0 1704.69 0 1213.8 0 0 0 0 0 0 0 0 0 0 0 0 0 0 -2486.11 0 0 0 0 0 0 0 0.06 0 0 0 0 0 0 0 0 0 0 0 
0 0 0 0 0 0 0 0 0 0 0 0 0 0 0 0 0 0 0 0 0 0 0 0 0 0 129.322 0 0 0 0 0 0 0 0 0 0 0 0 0 0 0 0 0 0 0 0 0 0.07 0 0 0 0 0 0 0 0 0 0 
0 0 0 0 0 0 0 0 0 0 0 0 0 0 0 0 0 0 0 0 0 0 785.928 0 0 0 0 0 0 0 0 0 0 0 0 0 0 0 0 0 0 0 0 0 0 0 0 0 0 0.02 -732.368 0 0 0 0 0 0 0 0 
0 0 0 0 0 0 0 0 0 0 0 0 0 0 0 0 0 0 0 0 0 0 0 0 0 0 0 0 0 0 0 0 0 0 0 0 0 0 0 0 0 0 0 0 0 0 0 0 0 871.38 0.08 0 0 0 0 0 0 0 0 
0 0 0 0 0 0 0 0 0 0 0 0 0 0 0 0 973.617 0 0 0 0 0 0 0 0 0 0 0 0 0 0 0 0 0 0 0 0 0 0 0 0 0 0 0 0 0 0 0 0 0 0 0.08 0 0 0 0 0 0 0 
0 0 0 0 0 0 0 0 1118.58 0 0 0 0 0 0 0 0 0 0 0 0 0 0 0 0 0 0 0 0 0 0 0 0 0 0 0 0 0 0 0 0 0 0 0 0 0 0 0 0 0 0 0 0.03 0 0 0 0 0 0 
0 0 0 0 0 0 0 0 0 0 0 0 1494.11 0 0 0 0 0 0 0 0 0 0 0 0 0 0 0 0 0 0 0 0 0 0 0 0 0 0 0 0 0 0 0 0 0 0 0 0 0 0 0 0 0.04 0 0 0 0 0 
0 0 0 0 0 0 0 0 0 0 0 2368.62 0 0 0 0 0 0 0 0 0 0 0 0 0 0 0 0 0 0 0 0 0 0 0 0 0 0 0 0 0 0 0 0 0 0 0 0 0 0 0 0 0 0 0.05 0 0 0 0 
0 0 0 0 0 0 0 0 0 0 0 0 0 0 0 0 0 0 0 0 0 0 0 0 0 0 0 0 0 0 1983.63 0 0 0 0 0 0 0 0 0 0 0 0 0 0 0 0 0 0 0 0 0 0 0 0 0 0 0 0 
0 0 0 0 0 0 0 0 0 0 0 0 0 0 0 809.427 0 0 0 0 0 0 0 0 0 0 0 0 0 0 0 0 0 0 0 0 0 0 0 0 0 0 0 0 0 0 0 0 0 0 0 0 0 0 0 0 0.08 0 0 
0 0 0 0 0 0 0 0 0 0 0 0 0 0 0 0 0 0 0 0 0 0 0 0 0 0 0 0 0 0 0 0 0 0 0 0 0 0 0 0 0 0 0 373.165 0 0 0 0 0 0 0 0 0 0 0 0 0 0.02 0 
0 0 0 0 0 0 0 0 0 0 0 0 0 0 0 0 0 0 0 2211.45 0 0 0 0 0 0 0 0 0 0 0 0 0 0 0 0 0 0 0 0 0 0 0 0 0 0 0 0 0 0 0 0 0 0 0 0 0 0 0.06 
