*Vertices 34
*Matrix 
0 -1903.97 0 0 0 0 -618.076 0 0 0 0 0 -957.747 1310.69 0 121.54 2241.36 2111.5 0 0 0 0 0 -53.7889 0 0 0 0 0 0 0 0 0 0 
-995.438 0 0 0 -1910.54 606.174 0 0 0 2225.18 0 1494.87 0 1425.14 0 1712.78 0 186.85 0 0 0 -1971.72 0 0 0 -1221.73 0 0 0 0 0 0 0 0 
0 0 0.02 0 0 0 0 0 0 0 0 -198.447 0 2281.03 0 2392.27 1700.87 0 -495.849 0 0 2088.31 0 0 0 0 0 0 0 0 0 0 0 0 
0 0 0 0.08 2048.63 0 0 496.307 0 0 -2299.04 0 2146.29 0 0 0 0 0 0 0 0 0 0 0 -1530.73 0 0 523.469 -1381.19 0 -312.281 0 0 0 
0 -597.934 0 2207.48 0.03 0 -968.276 0 0 0 0 1909.92 0 461.669 0 0 0 0 0 174.337 0 0 0 0 0 0 0 0 0 0 0 0 0 0 
0 447.478 0 0 0 0.03 -1231.5 412.687 0 2346.03 0 -378.964 677.892 0 0 -1336.33 0 2494.2 0 0 0 0 0 0 796.304 0 2172.38 0 0 0 0 -2138.36 513.398 0 
-87.817 0 0 0 1923.51 2464.29 0.06 0 0 0 1849.8 0 0 2074.27 0 -489.746 19.303 0 0 0 1132.47 0 0 0 -693.152 -1823.71 0 0 0 -1107.9 0 0 0 0 
0 0 0 -1870.25 0 854.747 0 0.02 0 0 0 1450.16 1654.18 0 159.993 0 0 0 0 0 0 0 0 0 0 0 0 0 0 0 0 0 0 0 
0 0 0 0 0 0 0 0 0 0 0 0 1188.62 752.358 1688.06 0 0 0 0 0 0 0 0 0 0 0 0 0 0 0 0 0 0 0 
0 -2029.86 0 0 0 1699.8 0 0 0 0.04 0 1425.14 0 0 0 -588.473 0 2104.02 -1359.37 0 0 0 0 0 0 0 0 0 0 0 0 0 0 0 
0 0 0 459.838 0 0 747.627 0 0 0 0.02 0 0 0 0 0 0 0 1336.02 0 -1685.16 0 0 0 -3.12815 1832.71 0 885.418 0 0 0 0 -2138.36 0 
0 -1606.57 839.793 0 829.875 1032.52 0 -1208.91 0 958.052 0 0.02 0 0 0 0 -377.743 1766.95 0 0 0 0 0 324.183 0 0 0 0 0 0 0 -186.392 0 0 
650.121 0 0 2398.68 0 -261.315 0 -1687.6 2143.7 0 0 0 0.09 0 0 0 1906.11 0 0 0 0 0 0 0 0 0 -1473.82 0 0 1835.61 2014.3 0 0 0 
884.045 462.584 -225.15 0 -1378.75 0 2416.23 0 1076.31 0 0 0 0 0 0 0 0 0 0 142.445 0 0 0 -26.78 0 0 0 0 0 0 0 0 0 0 
0 0 0 0 0 0 0 1669.29 -2142.48 0 0 0 0 0 0.05 0 -2128.9 0 591.525 1714 0 0 0 0 0 0 0 0 0 0 0 0 0 0 
2315.21 384.457 376.98 0 0 2121.42 -764.107 0 0 728.858 0 0 0 0 0 0.04 0 0 0 0 0 0 0 0 0 0 0 0 0 0 0 0 0 0 
-2183.83 0 2460.17 0 0 0 2488.1 0 0 0 0 2472.53 2203.05 0 1567.05 0 0.02 0 0 0 0 0 0 0 0 0 0 0 0 66.3015 0 0 0 0 
-1132.31 1644.41 0 0 0 -490.509 0 0 0 129.627 0 1426.51 0 0 0 0 0 0.01 0 1347.16 1557.44 0 643.101 0 0 -274.59 0 0 -1355.56 0 0 1267.82 0 0 
0 0 114.978 0 0 0 0 0 0 -278.1 281.762 0 0 0 663.244 0 0 0 0 0 0 0 1131.55 0 0 0 0 0 0 0 0 1324.88 0 0 
0 0 0 0 1949.45 0 0 0 0 0 0 0 0 1169.09 -2467.8 0 0 1755.2 0 0 0 0 0 0 0 0 0 0 0 0 0 0 0 0 
0 0 0 0 0 0 -183.645 0 0 0 1243.4 0 0 0 0 0 0 2341 0 0 0.02 -1231.8 0 -896.71 0 0 0 0 0 0 0 0 0 0 
0 1746.96 406.43 0 0 0 0 0 0 0 0 0 0 0 0 0 0 0 0 0 1488.01 0.07 0 0 -1170.61 0 0 0 0 0 0 0 0 0 
0 0 0 0 0 0 0 0 0 0 0 0 0 0 0 0 0 1696.6 525.91 0 0 0 0.09 0 0 0 0 -1156.42 0 0 0 0 0 0 
-75.457 0 0 0 0 0 0 0 0 0 0 998.947 0 1323.05 0 0 0 0 0 0 2225.18 0 0 0 0 0 0 0 0 0 0 0 1496.25 0 
0 0 0 751.595 0 1499.3 -62.6392 0 0 0 -2454.22 0 0 0 0 0 0 0 0 0 0 1839.43 0 0 0 0 0 0 0 0 0 0 0 0 
0 -88.4274 0 0 0 0 -645.848 0 0 0 1293.76 0 0 0 0 0 0 1633.88 0 0 0 0 0 0 0 0.04 0 0 393.612 0 0 0 2036.88 0 
0 0 0 0 0 -627.689 0 0 0 0 0 0 1238.82 0 0 0 0 0 0 0 0 0 0 0 0 0 0 0 0 0 0 0 0 480.895 
0 0 0 1838.51 0 0 0 0 0 0 1383.63 0 0 0 0 0 0 0 0 0 0 0 -1763.74 0 0 0 0 0.06 0 882.824 0 0 0 0 
0 0 0 -271.538 0 0 0 0 0 0 0 0 0 0 0 0 0 1991.41 0 0 0 0 0 0 0 -742.744 0 0 0.01 0 0 0 0 0 
0 0 0 0 0 0 2027.73 0 0 0 0 0 227.897 0 0 0 -498.749 0 0 0 0 0 0 0 0 0 0 1713.39 0 0 0 0 0 0 
0 0 0 1448.33 0 0 0 0 0 0 0 0 2192.98 0 0 0 0 0 0 0 0 0 0 0 0 0 0 0 0 0 0.02 0 0 1494.57 
0 0 0 0 0 -1935.26 0 0 0 0 0 -1088.67 0 0 0 0 0 2411.5 1825.69 0 0 0 0 0 0 0 0 0 0 0 0 0 0 0 
0 0 0 0 0 -254.906 0 0 0 0 -1880.93 0 0 0 0 0 0 0 0 0 0 0 0 2190.54 0 1606.88 0 0 0 0 0 0 0.08 0 
0 0 0 0 0 0 0 0 0 0 0 0 0 0 0 0 0 0 0 0 0 0 0 0 0 0 -2322.69 0 0 0 2449.03 0 0 0.04 
