*Vertices 44
*Matrix 
0 -217.673 0 0 0 1943.04 0 2438.35 0 0 2035.97 0 0 -1522.49 1108.81 2328.33 0 0 560.701 0 0 -868.48 0 0 0 0 1676.76 0 0 193.411 -1102.4 0 0 0 0 0 1603.52 -160.604 0 -2437.28 0 -1633.12 0 0 
-2498.93 0.07 0 0 0 0 0 0 0 0 0 0 992.386 0 0 0 -28.9163 0 0 0 0 0 0 0 0 -43.1074 -1702.4 0 2145.68 0 0 0 2275.54 0 1920.3 0 0 2249.9 29.5267 1717.35 -823.008 -628.91 0 0 
0 0 0.08 0 1250.72 0 0 -54.2467 0 0 90.1059 2078.84 0 0 0 0 -106.891 0 1021.23 0 0 0 0 -195.547 0 0 -1901.38 0 271.844 0 0 100.94 0 0 0 0 0 799.814 -544.679 -2205.04 673.62 1054.8 0 0 
0 0 0 0.08 0 0 0 0 2370.3 1083.48 -1353.57 0 0 0 1438.57 0 0 0 -393.46 0 528.657 1888.1 0 0 0 -1143.3 0 0 0 0 0 0 0 0 0 -819.803 0 0 1685 0 -1471.53 0 0 987.808 
0 0 -1335.57 0 0.02 0 250.023 0 0 723.365 0 -1708.96 0 408.261 2279.35 -152.669 0 0 0 1944.11 2203.82 0 0 0 -1768.78 -984.451 1692.48 0 0 1272.39 0 0 696.814 1955.09 0 0 0 0 0 0 0 0 1354.03 0 
2116.69 0 0 0 0 0.06 0 0 0 0 0 1568.12 0 2096.39 -2322.84 0 0 0 2446.75 0 233.848 0 0 0 0 0 0 0 1866.74 0 0 0 464.568 0 0 0 0 0 -2203.67 0 1886.27 0 0 -2259.51 
0 0 0 0 430.998 0 0.01 242.698 0 0 337.458 0 0 0 -963.546 0 -257.805 -592.746 0 0 0 0 0 0 0 0 -2158.35 1010.39 1018.78 0 0 0 0 0 0 0 0 0 0 0 0 2198.17 0 0 
-1628.24 0 -98.4985 0 0 0 -1868.11 0.05 0 -896.252 0 0 0 0 -2480.93 0 0 0 0 1706.21 1088.67 0 1783.43 0 0 0 0 0 0 0 2096.55 1450.77 0 0 1512.57 0 0 0 1883.83 -1664.4 0 0 0 0 
0 0 0 1137.2 0 0 0 0 0.02 0 -818.583 0 0 0 0 0 0 0 0 0 0 0 -2068.62 0 -750.832 0 0 1667.61 1953.41 611.82 0 0 0 0 1030.84 2014.91 0 0 -24.3385 1996.9 952.101 0 0 0 
0 0 0 825.144 -478.912 0 0 518.281 0 0.01 508.972 0 1311.3 0 -1059.53 0 869.396 0 0 0 0 1389.89 0 0 0 932.875 0 -1929.46 0 0 0 0 0 0 0 0 0 0 0 0 0 0 0 0 
-339.137 0 -1911.3 1706.82 0 0 1572.85 0 1298.33 768.532 0.08 0 2202.14 0 2479.55 -236.29 0 0 2063.59 0 0 485.626 0 0 0 104.297 0 0 0 0 0 0 737.404 0 0 0 2375.48 0 0 0 0 0 0 0 
0 0 1097.22 0 1564 1358.61 0 0 0 0 0 0.08 1894.97 0 0 0 0 0 972.549 0 0 1052.96 0 0 578.707 0 0 -20.2185 0 0 0 0 0 0 1833.17 0 0 0 0 0 0 0 0 0 
0 2371.21 0 0 0 0 0 0 0 1431.24 -1722.69 544.221 0.04 2400.97 865.734 0 0 0 0 95.5992 656.072 0 0 0 0 0 -1416.29 0 0 0 -1634.19 0 0 1156.27 -1108.05 0 0 -1576.51 0 0 0 2024.37 0 0 
1893.75 0 0 0 -980.331 2453 0 0 0 0 0 0 440.306 0.07 0 0 0 0 0 0 0 0 0 0 0 0 1377.07 0 0 0 0 1653.87 0 0 0 0 0 -2436.06 0 0 0 0 0 0 
675.451 0 0 -544.069 -1915.42 1138.57 -2124.47 199.21 0 -343.257 -984.451 0 273.37 0 0.07 0 780.282 -1289.18 0 0 0 0 -511.567 1690.8 -22.3548 0 0 0 0 679.113 0 0 1600.92 738.777 0 -874.889 0 0 2280.72 0 0 1527.83 0 0 
-251.244 0 0 0 -1354.03 0 0 0 0 0 1310.24 0 0 0 0 0.03 -283.135 0 2326.5 974.685 0 1198.69 0 0 0 0 0 0 0 0 -1201.13 0 -380.337 -2430.88 0 503.937 0 1863.23 0 0 -547.731 2443.69 0 0 
0 -896.557 904.035 0 0 0 2298.12 0 0 1383.02 0 0 0 0 716.041 857.494 0.08 0 -898.541 707.495 0 -2485.5 0 0 0 0 0 0 711.463 631.199 422.605 0 0 0 0 -1842.78 0 0 0 1972.64 0 0 0 0 
0 0 0 0 0 0 2321.62 0 0 0 0 0 0 0 1083.03 0 0 0.01 0 390.561 -1647.92 0 0 0 0 0 0 0 0 0 87.6644 0 0 0 0 0 0 0 0 1284.3 0 274.59 2166.43 0 
1481.44 0 -2320.09 257.347 0 -2473.14 0 0 0 0 -1676.46 2148.73 0 0 0 1639.23 199.057 0 0.04 0 0 0 1077.68 728.095 1695.84 1258.66 0 0 0 0 0 0 0 0 0 0 0 0 0 0 0 0 0 0 
0 0 0 0 1830.58 0 0 -2276.15 0 0 0 0 -1031.45 0 0 2443.85 -2390.9 -2107.23 0 0.04 2084.95 0 0 0 0 0 0 0 0 0 0 0 0 0 -931.349 0 -2147.66 2191.46 0 0 2058.09 0 0 1229.36 
0 0 0 -311.365 2400.66 -536.286 0 -1674.93 0 0 0 0 -803.629 0 0 0 0 1093.25 0 2495.88 0 0 0 0 0 1379.67 0 0 0 0 49.2111 0 0 0 -533.692 0 0 0 1419.95 0 -219.962 0 0 0 
-2219.53 0 0 -633.946 0 0 0 0 0 2099.14 -1631.14 2099.29 0 0 0 1955.55 2027.57 0 0 0 0 0.01 0 0 0 0 0 0 -652.715 973.922 0 0 1639.68 -1845.23 0 0 0 -2433.47 0 -692.236 0 0 0 0 
0 0 0 0 0 0 0 300.378 1751.99 0 0 0 0 0 1501.43 0 0 0 -1158.41 0 0 0 0.05 0 0 0 -414.823 0 0 0 0 136.799 1488.01 0 -1360.44 0 0 0 0 -916.7 626.164 0 0 0 
0 0 1329.77 0 0 0 0 0 0 0 0 0 0 0 -1038.47 0 0 0 890.454 0 0 0 0 0.06 0 2333.37 1814.4 0 0 -771.889 -571.078 -994.827 392.239 559.328 2221.37 0 0 -1502.5 0 0 1121.17 2338.1 0 0 
0 0 0 0 1215.63 0 0 0 -237.205 0 0 1805.4 0 0 -784.86 0 0 0 880.993 0 0 0 0 0 0.05 0 -1986.07 403.378 0 0 0 -1112.02 0 0 0 0 1499.15 -1237.6 0 0 0 0 0 0 
0 -1212.12 0 -1326.11 1323.05 0 0 0 0 456.938 2441.4 0 0 0 0 0 0 0 1874.37 0 247.734 0 0 701.849 0 0.07 0 0 0 0 0 0 0 -1947.31 0 0 2042.38 0 0 0 0 83.697 1892.68 0 
1874.22 -491.119 2473.75 0 1579.41 0 -1591.01 0 0 0 0 0 -1159.02 994.217 0 0 0 0 0 0 0 0 278.71 -1807.23 1089.28 0 0.09 0 0 0 -168.844 0 0 -648.747 0 2341.15 0 0 0 0 0 0 0 0 
0 0 0 0 0 0 2217.55 0 291.375 1058.31 0 2230.06 0 0 0 0 0 0 0 0 0 0 0 0 966.292 0 0 0 0 0 0 -2283.78 1972.33 0 -2229.91 -1629 0 0 0 0 0 291.833 0 0 
0 1911.45 -129.17 0 0 2234.64 -2425.69 0 2269.13 0 0 0 0 0 0 0 1653.57 0 0 0 0 -1747.57 0 0 0 0 0 0 0.05 0 0 0 0 0 0 -2047.41 0 266.35 0 0 876.72 672.857 0 0 
316.095 0 0 0 -1788.46 0 0 0 1939.07 0 0 0 0 0 2291.41 0 1815.01 0 0 0 0 45.0911 0 112.69 0 0 0 0 0 0.09 -799.661 0 -146.87 -837.657 0 0 0 0 0 0 0 0 0 0 
-627.232 0 0 0 0 0 0 -2471.47 0 0 0 0 1420.87 0 0 2469.33 935.926 79.577 0 0 1785.87 0 0 -103.687 0 0 159.078 0 0 390.408 0.09 0 0 0 0 0 1031.91 -2494.35 0 947.981 1144.37 0 0 0 
0 0 -688.574 0 0 0 0 -597.476 0 0 0 0 0 179.525 0 0 0 0 0 0 0 0 -1506.93 887.249 -1461.3 0 0 1415.52 0 0 0 0.05 1399.35 0 823.008 0 0 0 0 0 0 2307.89 0 -818.583 
0 131.611 0 0 -1537.14 1580.78 0 0 0 0 1845.68 0 0 0 1769.69 988.418 0 0 0 0 0 196.768 -152.669 -707.19 0 0 0 1114.15 0 -909.528 0 1049.3 0 0 0 0 1758.71 0 0 1795.33 0 0 0 0 
0 0 0 0 2254.63 0 0 0 0 0 0 0 856.273 0 2283.78 -2394.86 0 0 0 0 0 432.676 0 -706.58 0 2283.17 2247.46 0 0 2078.54 0 0 0 0.06 1233.63 0 0 1361.66 -1192.89 0 0 0 0 0 
0 -1471.37 0 0 0 0 0 1441.31 -102.466 0 0 784.097 -1502.04 0 0 0 0 0 0 2352.29 949.202 0 -877.941 1263.54 0 0 0 -444.884 0 0 0 226.371 0 2403.41 0.09 0 0 -1498.84 0 -388.882 0 -14.5726 0 0 
0 0 0 1560.03 0 0 0 0 -441.221 0 0 0 0 0 293.97 1201.9 1551.33 0 0 0 0 0 0 0 0 0 633.946 153.279 -1594.36 0 0 0 0 0 0 0 1146.96 849.254 0 0 0 235.221 0 0 
-408.872 0 0 0 0 0 0 0 0 0 1498.69 0 0 0 0 0 0 0 0 625.858 0 0 0 0 352.718 -486.847 0 0 0 0 -2027.27 0 2474.67 0 0 -685.064 0.02 -1249.96 2328.94 0 -99.414 0 0 0 
2171.62 -373.165 -594.272 0 0 0 0 0 0 0 0 0 1328.85 -1890.85 0 -841.929 0 0 0 1288.57 0 -1988.81 0 6.79037 2279.2 0 0 0 -1049.61 0 2049.55 0 0 1306.73 385.983 -784.555 -289.697 0.09 0 0 0 0 0 0 
0 -197.836 283.593 -2197.41 0 -465.178 0 1881.08 436.186 0 0 0 0 0 -615.329 0 0 0 0 0 2137.59 0 0 0 0 0 0 0 0 0 0 0 0 1090.81 0 0 -1859.26 0 0.02 0 0 0 0 0 
1099.81 1285.97 -1830.73 0 0 0 0 1517.15 -257.653 0 0 0 0 0 0 0 -1751.38 -967.208 0 0 0 -341.578 2164.91 0 0 0 0 0 0 0 -759.377 0 -331.202 0 -1622.9 0 0 0 0 0.06 2425.53 -312.281 446.867 0 
0 1290.55 -1728.8 -341.578 0 -852.763 0 0 -847.27 0 0 0 0 0 0 660.802 0 0 0 -1017.26 172.353 0 -839.641 1792.43 0 0 0 0 1038.77 0 1905.04 0 0 0 0 0 600.375 0 0 -335.475 0.01 0 0 0 
1003.07 2221.67 -1297.88 0 0 0 871.227 0 0 0 0 0 266.503 0 2038.87 857.036 0 -1293.45 0 0 0 0 0 -2174.21 0 1583.22 0 1819.44 962.477 0 0 1673.86 0 0 -1858.2 -223.319 0 0 0 -1103.32 0 0.01 997.116 0 
0 0 0 0 2341.3 0 0 0 0 0 0 0 0 0 0 0 0 1814.25 0 0 0 0 0 0 0 -577.181 0 0 0 0 0 0 0 0 0 0 0 0 0 2129.81 0 -1544.62 0.02 0 
0 0 0 -145.955 0 2142.32 0 0 0 0 0 0 0 0 0 0 0 0 0 2465.67 0 0 0 0 0 0 0 0 0 0 0 304.041 0 0 0 0 0 0 0 0 0 0 0 0.08 
