*Vertices 47
*Matrix 
0.09 0 996.963 0 711.005 0 0 0 891.064 1556.98 0 0 0 -1897.41 0 0 0 0 0 0 0 0 2198.02 0 2318.41 0 0 271.691 0 0 0 1296.04 0 0 0 0 0 0 0 0 0 0 0 0 0 0 0 
0 0.01 0 0 0 0 0 2494.35 0 0 0 0 0 0 0 0 0 0 143.666 0 0 0 1070.21 1767.4 0 0 0 0 0 712.531 0 0 0 0 0 0 0 0 755.104 0 9.84222 0 0 0 0 0 0 
-809.885 0 0.09 0 0 0 0 1526.46 0 1532.26 0 0 0 0 0 0 0 0 0 0 0 0 1003.07 1235.77 0 0 0 0 0 0 0 0 0 0 0 0 0 0 0 0 0 0 0 0 0 0 0 
0 0 0 0.09 0 0 0 326.167 0 0 0 0 0 960.952 0 0 0 1560.18 -374.386 0 0 0 832.163 0 1966.99 0 0 0 0 0 0 0 0 0 0 0 0 0 0 0 0 0 1695.84 -2196.65 0 0 1923.66 
1682.41 0 0 0 0.01 0 0 0 0 0 -340.358 0 0 0 0 0 0 0 0 0 0 0 0 0 1271.78 0 -285.272 616.398 0 0 0 0 -372.097 0 0 0 0 0 0 0 0 0 0 -1517.46 0 0 0 
0 0 0 0 0 0.06 0 171.896 -334.101 0 0 -2437.59 60.5029 0 0 0 1274.83 24.0333 0 0 -973.464 0 0 0 0 2115.01 1934.34 0 0 0 0 0 1279.41 0 -53.7889 1412.47 0 2128.59 0 1719.79 0 0 0 0 0 0 0 
0 0 0 0 0 0 0.05 0 0 0 0 0 0 0 0 0 1886.73 0 0 0 1395.99 -1192.89 0 -271.386 0 0 0 0 0 0 0 0 0 0 0 -647.984 0 0 0 0 0 0 0 0 0 0 0 
0 464.415 336.39 -177.694 0 -80.4926 0 0.05 0 0 0 1120.11 0 0 -549.715 0 0 0 2015.06 -792.947 0 1176.72 0 -1255.91 0 0 0 0 0 0 0 0 0 0 0 0 0 0 0 0 0 0 987.655 0 0 0 0 
-1682.1 0 0 0 0 1517.46 0 0 0.09 1992.63 0 1584.75 2050.77 0 -976.516 0 2348.93 0 0 0 0 0 0 0 0 0 0 1213.49 0 0 0 0 0 0 0 0 0 0 0 0 0 0 0 0 0 0 0 
-661.26 0 2240.59 0 0 0 0 0 2196.65 0.02 0 -1159.17 -1038.62 326.93 0 0 0 0 0 1746.96 0 2290.8 0 0 0 0 970.412 2178.64 0 0 0 0 0 0 0 0 0 0 0 0 0 0 0 0 0 0 0 
0 0 0 0 -270.013 0 0 0 0 0 0.07 0 0 1882.61 2299.49 0 849.101 0 0 0 0 0 0 0 0 -2316.74 0 0 0 0 0 0 0 0 0 0 0 0 0 1899.4 0 0 -755.104 0 0 114.673 0 
0 0 0 0 0 429.777 0 737.709 -443.815 1907.48 0 0.07 0 0 0 2371.21 0 0 0 0 0 0 0 2086.63 0 0 0 -359.89 0 0 0 0 0 0 0 325.556 0 0 0 0 0 0 0 -2466.73 80.1874 0 0 
0 0 0 0 0 1863.54 0 0 2065.72 2381.44 0 0 0.01 0 0 0 0 -1943.04 0 1573.76 1760.08 0 1648.84 0 2420.35 -179.983 0 0 0 0 0 0 0 -1740.55 371.181 0 0 0 0 0 0 0 0 0 0 0 0 
1668.52 0 0 1655.71 0 0 0 0 0 2064.5 631.657 0 0 0 0 0 0 0 0 0 0 789.438 56.8407 0 0 0 0 0 0 0 0 0 0 0 0 0 0 749.916 0 0 677.282 0 0 0 0 0 0 
0 0 0 0 0 0 0 -851.238 1457.34 0 190.817 0 0 0 0.05 0 0 0 0 0 0 0 0 0 2022.08 0 0 2198.17 0 0 0 0 0 0 -2060.69 0 0 0 -681.555 0 0 869.549 0 0 0 0 0 
0 0 0 0 0 0 0 0 0 0 0 -121.235 0 0 0 0.03 605.411 0 0 2236.63 0 317.164 0 -341.884 0 -521.638 690.558 0 0 0 0 955.306 0 2177.27 0 0 0 0 0 0 0 0 0 -1324.27 355.77 0 0 
0 0 0 0 0 -24.9489 2028.49 0 1387.6 0 230.949 0 0 0 0 35.783 0.07 -1761.6 0 -1759.01 2039.63 0 0 2364.04 -724.891 0 0 393.765 2271.87 0 0 2220.91 0 0 0 0 0 0 0 0 0 0 0 0 0 0 0 
0 0 0 2406.61 0 606.021 0 0 0 0 0 0 -1085.77 0 0 0 2471.31 0.06 1694.77 0 0 0 0 0 0 21.7444 0 -161.367 0 0 0 0 0 714.362 0 0 0 0 0 0 0 313.044 0 0 -524.232 0 -1746.19 
0 -1072.19 0 1459.78 0 0 0 1996.75 0 0 0 0 0 0 0 0 0 894.269 0.07 0 0 -412.839 0 0 0 0 1410.64 0 1022.9 0 0 180.898 0 0 0 0 0 70.8792 0 0 -2421.72 0 2317.35 0 0 0 0 
0 0 0 0 0 0 0 474.944 0 1981.95 0 0 836.741 0 0 2328.49 -669.652 0 0 0.09 -2423.09 0 0 0 0 1019.24 0 0 0 0 0 0 0 0 0 0 0 0 0 0 0 0 0 0 0 0 0 
0 0 0 0 0 211.417 1520.36 0 0 0 0 0 1096 0 0 0 131.916 0 0 -239.341 0.09 0 0 2172.54 -39.2926 -130.238 2231.59 0 0 0 0 0 0 0 0 0 0 0 -1564.46 0 0 0 0 0 0 0 0 
0 0 0 0 0 0 1897.56 -773.11 0 -27.6955 0 0 0 1615.57 0 1805.7 0 0 -2006.06 0 0 0.02 1730.93 119.098 0 0 0 1685 0 0 0 0 0 0 0 0 0 0 0 0 0 0 0 -2201.83 0 0 0 
1532.56 -235.221 -1762.83 1221.88 0 0 0 0 0 0 0 0 1016.04 1668.83 0 0 0 0 0 0 0 1125.75 0.04 0 0 0 1325.65 -1083.18 0 0 0 0 0 0 0 0 0 0 0 0 0 -996.506 -919.752 0 0 1787.7 0 
0 253.227 1019.24 0 0 0 2014.91 -1461.76 0 0 0 1898.63 0 0 0 1374.32 -1807.69 0 0 0 268.029 -574.587 0 0.02 0 0 0 1159.17 0 0 -1794.26 0 0 0 0 0 0 0 0 0 0 0 0 0 0 0 0 
766.396 0 0 2185.05 -1947.77 0 0 0 0 0 0 0 1592.53 0 -1955.55 0 2042.53 0 0 0 -769.906 0 0 0 0.09 2137.14 0 2315.06 0 0 0 2429.5 0 0 0 0 0 0 0 0 425.047 0 0 0 2294.31 1845.38 0 
0 0 0 0 0 665.227 0 0 0 0 -92.5474 0 364.467 0 0 2216.18 0 -735.572 0 2199.09 -573.824 0 0 0 -282.067 0.04 0 0 0 0 0 0 0 0 0 0 0 0 0 0 0 0 0 0 0 0 0 
0 0 0 0 1781.9 2026.81 0 0 0 -260.857 0 0 0 0 0 965.835 0 0 921.735 0 460.143 0 -2003.92 0 0 0 0.03 0 0 0 0 0 0 0 238.578 0 0 0 0 0 0 323.725 -1296.5 0 0 0 -1659.06 
225.608 0 0 0 1442.69 0 0 0 2230.22 476.012 0 2136.37 0 0 1040.91 0 1252.86 -253.838 0 0 0 1933.12 -1264.15 1642.43 -1709.11 0 0 0.09 0 0 0 0 0 0 0 0 0 0 0 0 0 0 0 0 -169.454 1239.89 0 
0 0 0 0 0 0 0 0 0 0 0 0 0 0 0 0 846.202 0 -47.9904 0 0 0 0 0 0 0 0 0 0.02 0 0 0 84.6126 0 0 0 0 0 0 0 701.239 0 0 0 0 0 0 
0 1016.19 0 0 0 0 0 0 0 0 0 0 0 0 0 0 0 0 0 0 0 0 0 0 0 0 0 0 0 0.08 0 0 0 0 0 0 0 0 0 0 0 0 0 0 0 0 0 
0 0 0 0 0 0 0 0 0 0 0 0 0 0 0 0 0 0 0 0 0 0 0 -1321.53 0 0 0 0 0 0 0.04 0 0 0 0 0 2176.81 0 0 0 0 -1064.26 0 0 0 834.452 0 
-159.688 0 0 0 0 0 0 0 0 0 0 0 0 0 0 2492.37 1685.16 0 -1204.18 0 0 0 0 0 2464.9 0 0 0 0 0 0 0.05 827.128 0 0 1828.14 0 0 0 0 606.784 0 -1529.51 0 0 0 939.283 
0 0 0 0 119.709 -1984.08 0 0 0 0 0 0 0 0 0 0 0 0 0 0 0 0 0 0 0 0 0 0 -368.13 0 0 2236.93 0.02 0 0 0 1479 0 0 0 0 0 0 0 0 0 0 
0 0 0 0 0 0 0 0 0 0 0 0 31.9681 0 0 1726.66 0 1794.87 0 0 0 0 0 0 0 0 0 0 0 0 0 0 0 0.05 0 0 0 0 0 0 0 0 0 0 0 0 -1590.24 
0 0 0 0 0 -1128.65 0 0 0 0 0 0 2176.66 0 2039.63 0 0 0 0 0 0 0 0 0 0 0 2380.37 0 0 0 0 0 0 0 0.05 0 0 0 0 -919.904 0 0 0 0 0 0 0 
0 0 0 0 0 1375.55 -636.387 0 0 0 0 1142.23 0 0 0 0 0 0 0 0 0 0 0 0 0 0 0 0 0 0 0 2127.52 0 0 0 0.04 0 0 0 0 -1884.75 0 0 0 0 0 0 
0 0 0 0 0 0 0 0 0 0 0 0 0 0 0 0 0 0 0 0 0 0 0 0 0 0 0 0 0 0 1007.03 0 -208.365 0 0 0 0.07 0 -332.423 0 0 0 0 0 0 0 0 
0 0 0 0 0 1841.26 0 0 0 0 0 0 0 1829.51 0 0 0 0 1132.92 0 0 0 0 0 0 0 0 0 0 0 0 0 0 0 0 0 0 0.05 0 0 0 0 0 0 0 0 0 
0 -367.672 0 0 0 0 0 0 0 0 0 0 0 0 1260.8 0 0 0 0 0 270.013 0 0 0 0 0 0 0 0 0 0 0 0 0 0 0 1958.45 0 0.06 1963.33 0 2491.3 0 0 0 0 0 
0 0 0 0 0 2480.01 0 0 0 0 1971.27 0 0 0 0 0 0 0 0 0 0 0 0 0 0 0 0 0 0 0 0 0 0 0 2107.68 0 0 0 2235.71 0.02 0 0 0 0 2235.25 0 -953.475 
0 1708.2 0 0 0 0 0 0 0 0 0 0 0 785.775 0 0 0 0 205.771 0 0 0 0 0 2203.97 0 0 0 1611.76 0 0 1518.52 0 0 0 1309.78 0 0 0 0 0.05 -15.183 0 0 0 0 0 
0 0 0 0 0 0 0 0 0 0 0 0 0 0 -1505.86 0 0 2378.38 0 0 0 0 2483.37 0 0 0 -60.8081 0 0 0 1945.17 0 0 0 0 0 0 0 258.568 0 -346.614 0 0 0 0 -368.587 0 
0 0 0 1940.75 0 0 0 -1166.49 0 0 -2342.52 0 0 0 0 0 0 0 907.544 0 0 0 1509.22 0 0 0 -1164.2 0 0 0 0 -2.36518 0 0 0 0 0 0 0 0 0 0 0 0 0 0 0 
0 0 0 1515.93 -802.56 0 0 0 0 0 0 933.332 0 0 0 1488.31 0 0 0 0 0 957.137 0 0 0 0 0 0 0 0 0 0 0 0 0 0 0 0 0 0 0 0 0 0.04 0 0 429.319 
0 0 0 0 0 0 0 0 0 0 0 -694.22 0 0 0 2015.52 0 -419.095 0 0 0 0 0 0 50.1267 0 0 -1799.91 0 0 0 0 0 0 0 0 0 0 0 1635.11 0 0 0 0 0.06 0 0 
0 0 0 0 0 0 0 0 0 0 1269.49 0 0 0 0 0 0 0 0 0 0 0 -888.47 0 -2223.2 0 0 617.313 0 0 1829.36 0 0 0 0 0 0 0 0 0 0 1573.92 0 0 0 0.05 0 
0 0 0 2130.88 0 0 0 0 0 0 0 0 0 0 0 0 0 -1748.63 0 0 0 0 0 0 0 0 419.401 0 0 0 0 131.306 0 1951.89 0 0 0 0 0 2371.82 0 0 0 686.438 0 0 0.07 
