*Vertices 55
*Matrix 
0.03 0 0 0 0 -543.001 0 0 0 2122.64 0 0 0 488.678 934.095 0 0 0 0 0 0 0 0 0 0 1795.79 0 0 1067.92 -135.121 0 0 -740.303 0 0 1016.95 0 0 5.87481 68.1326 0 0 0 1035.42 0 -61.8763 0 1316.64 -806.833 0 0 2423.7 0 0 0 
0 0.05 0 0 0 1673.1 2074.27 0 0 0 0 0 0 0 0 0 0 0 0 0 0 0 0 0 0 0 -2280.11 0 0 -367.214 0 0 0 369.503 2243.19 0 0 0 0 0 0 1625.03 0 0 0 0 690.71 -1058.76 -2091.36 -1790.44 1325.5 0 0 0 0 
0 0 0.05 0 0 0 0 1039.23 0 0 0 0 0 0 0 1103.32 2426.45 0 1365.78 837.962 646.458 0 0 353.023 0 0 0 0 -816.141 0 0 498.291 0 0 -692.236 0 0 0 0 0 0 0 0 -1517.3 0 0 0 0 0 0 0 0 0 0 -45.2437 
0 0 0 0.07 -642.796 29.8318 0 0 -302.973 0 0 -1258.35 0 0 0 1460.84 0 0 0 0 0 0 0 0 0 0 1993.39 0 0 0 0 0 0 0 1777.63 0 0 -1611.45 2276.76 0 -1770 0 0 0 0 0 0 0 0 776.772 0 0 0 0 0 
0 0 0 1299.71 0.02 0 0 459.838 0 0 0 0 2393.19 1371.43 0 0 0 0 0 1732.76 0 -2175.28 0 0 1566.74 0 0 -241.02 0 873.821 0 0 0 2014.91 2364.65 1180.23 1676.15 0 -916.395 0 0 0 0 0 0 0 0 1961.81 0 0 0 0 0 0 0 
-808.359 -1842.48 0 -764.87 0 0.03 0 -109.485 0 0 0 0 0 0 0 0 0 0 0 0 0 0 2230.98 0 0 0 0 0 0 0 0 0 0 0 0 0 0 0 -616.55 1664.25 0 0 0 0 0 -2241.66 0 0 1320.92 0 2446.9 0 0 2194.51 0 
0 -239.189 0 0 0 0 0 1782.05 0 0 0 0 1794.72 -1545.53 0 0 0 0 0 0 0 0 0 0 0 0 0 0 0 0 0 -174.947 0 0 0 0 0 0 0 0 1584.29 0 0 -1284.45 0 0 0 0 2257.68 0 -1666.08 0 0 0 0 
0 0 2073.81 0 -505.921 -236.9 -1455.35 0.06 0 0 1873.3 0 0 0 0 0 0 0 537.049 0 0 0 964.003 265.13 0 -541.017 284.509 0 -1040.45 0 0 0 0 0 0 0 0 0 0 -1898.79 0 0 0 0 1174.28 0 0 -1187.4 0 2113.94 0 0 -805.612 -1692.18 0 
0 0 0 2183.07 0 0 0 0 0.08 0 0 -1108.81 2094.71 1537.14 0 0 1938.46 -158.467 0 0 -80.4926 0 0 1611.76 0 0 0 0 -449.614 0 0 0 0 0 0 0 0 0 137.257 0 0 0 0 -2309.87 0 0 0 -593.509 0 -1966.23 0 0 -342.952 0 0 
2429.5 0 0 0 0 0 0 0 0 0.09 515.839 -1470.92 0 0 0 0 0 0 0 0 0 0 0 0 -1719.64 0 0 0 2087.39 0 0 1458.56 0 0 553.987 0 0 0 0 0 -851.085 0 0 0 0 0 0 0 0 0 0 0 0 0 0 
0 0 0 0 0 0 0 -1295.89 0 2449.03 0.06 0 0 0 0 0 0 0 0 0 0 -177.084 241.783 1643.8 0 0 0 0 0 0 0 2153.16 0 0 0 1320.46 0 0 0 0 0 0 0 0 0 0 0 0 0 0 0 0 1730.78 1463.59 0 
0 0 0 -1221.12 0 0 0 0 -903.119 727.18 0 0.04 0 -1238.52 0 0 2117.91 0 0 0 0 -1020.92 1651.89 0 0 0 0 603.275 0 0 -1459.47 0 0 0 0 0 0 1855.75 0 0 1407.13 0 0 -1138.11 0 1110.95 0 1444.52 0 -396.97 -186.087 0 0 0 0 
0 0 0 0 -2044.51 0 -575.045 0 -44.6333 0 0 0 0.07 0 0 0 0 1167.26 0 0 0 0 1198.23 0 0 521.332 0 0 0 0 -304.041 0 0 0 0 2173.91 0 0 0 0 0 0 0 0 1231.5 0 802.255 0 0 0 0 -1605.04 911.512 0 0 
1774.27 0 0 0 -641.881 0 -286.95 0 -912.122 0 0 1650.06 0 0.09 0 -1184.19 0 0 668.279 0 0 77.2881 -50.2792 0 0 991.012 0 0 0 0 0 -1362.73 0 1518.37 0 0 -2051.68 0 1718.57 0 0 0 0 0 0 0 219.199 -812.326 737.709 0 2097.77 0 0 0 0 
2289.88 0 0 0 0 0 0 0 0 0 0 0 0 0 0.06 0 0 2370.6 0 0 -1386.84 1338.31 0 0 0 0 0 950.117 49.2111 0 -340.815 0 0 0 0 0 0 0 0 1326.11 0 0 0 0 0 0 -144.581 0 -915.326 2002.24 0 -106.891 0 0 0 
0 0 318.384 974.38 0 0 0 0 0 0 0 0 0 1479.46 0 0.08 -1254.23 0 0 0 0 0 0 0 0 0 0 0 2212.82 0 0 -587.71 0 0 0 0 0 0 2347.87 0 0 0 0 0 0 -1631.29 1495.03 -641.118 0 0 0 1135.52 1671.27 0 530.946 
0 0 2331.39 0 0 0 0 0 1798.53 0 0 1903.52 0 0 0 -194.937 0.09 -2391.51 0 -80.9503 0 0 0 0 -185.018 -2333.52 0 0 0 0 0 0 2122.79 0 0 1359.52 0 0 1502.2 0 2187.34 0 0 0 0 0 0 0 0 -609.226 0 0 0 -2286.52 0 
0 0 0 0 0 0 0 0 -1161.31 0 0 0 -421.842 0 -452.361 0 2286.37 0.08 0 0 0 0 0 1654.64 -404.447 0 0 0 0 0 0 0 -1566.29 0 1863.23 -163.503 0 -753.121 0 0 0 0 0 0 0 0 -499.054 0 1109.88 0 2478.33 0 192.495 0 0 
0 0 8.1637 0 0 0 0 1218.83 0 0 0 0 0 -567.568 0 0 0 0 0.04 0 0 302.973 0 0 0 0 1786.32 0 2366.18 0 0 615.024 2369.23 0 0 0 0 0 -195.09 0 0 0 0 0 0 0 0 0 0 0 0 0 0 138.02 0 
0 0 1096.15 0 1715.37 0 0 0 0 0 0 0 0 0 0 0 1435.51 0 0 0.04 0 0 -251.244 0 0 0 0 1688.21 0 0 0 0 566.805 0 0 0 1018.02 -2309.26 0 0 622.959 0 0 -1229.21 0 0 0 1296.35 0 0 0 0 0 0 1696.91 
0 0 61.1133 0 0 0 0 0 -1763.44 0 0 0 0 0 2428.13 0 0 0 0 0 0.07 0 0 -107.807 0 0 0 0 0 0 0 0 0 0 968.429 0 762.886 0 0 0 1372.34 0 0 0 0 0 0 0 0 0 2324.52 0 -331.05 0 0 
0 0 0 0 1123.62 0 0 0 0 0 364.467 -769.448 0 760.598 -2025.44 0 0 0 2095.78 0 0 0.06 0 0 -463.347 0 0 0 -196.768 0 444.731 0 2201.99 0 0 0 -2346.34 142.293 0 0 0 0 102.008 0 0 0 0 0 0 0 -1729.87 0 614.719 0 0 
0 0 0 0 0 -1945.63 0 -2110.13 0 0 434.049 2359.92 1024.12 -1429.72 0 0 0 0 0 1165.73 0 0 0.08 0 0 2321.01 0 0 0 0 1359.98 0 1954.18 -1572.24 0 0 0 2404.48 0 0 -203.787 0 0 0 0 0 0 146.107 0 0 0 0 0 0 0 
0 0 386.135 0 0 0 0 1333.58 -2369.99 0 3.12815 0 0 0 0 0 0 1349.3 0 0 1761.91 0 0 0.07 0 0 -652.562 0 0 0 0 0 0 0 0 0 0 0 0 0 0 0 781.655 0 0 1328.55 0 0 0 -1.75481 0 0 0 0 0 
0 0 0 0 2064.04 0 0 0 0 371.944 0 0 0 0 0 0 -1066.24 -39.903 0 0 0 906.629 0 0 0.02 0 0 0 1761.76 -277.184 0 1371.88 0 325.861 1206.47 0 2279.5 0 0 0 0 -1916.18 0 648.595 -2499.24 0 0 0 0 2367.24 0 0 -1014.36 0 0 
1845.07 0 0 0 0 0 0 1414 0 0 0 0 -1472.29 1480.68 0 0 -695.288 0 0 0 0 0 2369.23 0 0 0.06 0 0 1840.04 -253.838 494.476 0 -1170.31 -2241.51 -121.998 1978.74 0 0 0 0 566.805 1401.94 -2048.17 -1584.9 0 2268.36 0 0 1754.74 0 0 0 0 0 0 
0 -1068.99 0 -302.82 0 0 0 1289.33 0 0 0 0 0 0 0 0 0 0 172.964 0 0 0 0 1031.75 0 0 0.05 0 1761.15 0 0 0 1466.64 0 0 0 0 0 0 0 2422.94 0 0 0 0 0 0 0 0 0 0 0 2329.71 0 1371.58 
0 0 0 0 2257.68 0 0 0 0 0 0 -864.818 0 0 -1413.69 0 0 0 0 2386.17 0 0 0 0 0 0 0 0.03 0 0 0 0 0 -360.347 0 0 0 0 0 174.49 0 60.5029 0 0 0 1813.49 0 0 0 0 0 0 -714.209 0 0 
1900.16 0 -133.29 0 0 0 0 694.372 1953.72 1149.71 0 0 0 0 108.722 -458.922 0 0 -1126.82 0 0 861.003 0 0 -9.68963 2372.89 940.199 0 0.09 1068.68 -1606.42 -470.672 1727.88 1658.91 -359.432 0 0 0 0 0 -2191.15 0 0 0 0 -2012.01 0 0 0 0 0 0 -1205.25 1826 -1471.53 
2494.96 23.8807 0 0 -2335.81 0 0 0 0 0 0 0 0 0 0 0 0 0 0 0 0 0 0 0 1713.23 926.313 0 0 2087.85 0.08 0 0 0 -1793.34 1737.34 0 -1520.36 0 0 0 0 0 0 0 0 0 0 0 856.578 0 0 0 0 0 0 
0 0 0 0 0 0 0 0 0 0 0 2231.89 -336.085 0 -1939.07 0 0 0 0 0 0 -351.192 2222.59 0 0 418.943 0 0 -1728.34 0 0.03 0 0 -1091.88 0 1460.84 0 0 0 1756.11 0 0 0 0 0 0 0 1441.62 0 608.158 0 0 34.8674 0 0 
0 0 35.02 0 0 0 -930.128 0 0 1004.9 633.793 0 0 2314.91 0 2479.4 0 0 2216.18 0 0 0 0 0 -893.048 0 0 0 1016.65 0 0 0.04 0 0 1699.96 896.1 -1367 2213.43 -2040.39 0 0 0 0 0 2262.11 608.005 0 -843.455 0 0 1020.77 0 0 0 0 
824.992 0 0 0 0 0 0 0 0 0 0 0 0 0 0 0 1462.68 -1723.61 -728.706 -479.827 0 -704.443 1740.24 0 0 311.365 -1209.98 0 2404.48 0 0 0 0.06 0 0 0 0 0 0 0 0 814.158 0 1227.68 -2254.94 0 0 -324.793 0 0 0 395.596 -1045.79 0 0 
0 -1508.45 0 0 -745.491 0 0 0 0 0 0 0 0 2019.79 0 0 0 0 0 0 0 0 1109.27 0 -806.223 1842.02 0 -1777.17 -1053.73 -444.121 2303.31 0 0 0.04 0 0 0 0 0 0 0 0 0 0 1831.64 0 0 1086.54 0 1096.45 0 0 0 -538.575 0 
0 2164.14 1785.56 1986.68 1091.11 0 0 0 0 2084.49 0 0 0 0 0 0 0 1606.42 0 0 91.6318 0 0 0 1634.95 -660.802 0 0 -2299.8 2325.28 0 1397.37 0 0 0.06 0 0 0 0 0 0 183.187 0 -1893.6 56.6881 0 0 0 1725.59 0 0 -1875.29 0 0 0 
2496.19 0 0 0 -2137.75 0 0 0 0 0 -384.457 0 -1685 0 0 0 -1146.2 1267.82 0 0 0 0 0 0 0 304.804 0 0 0 0 1300.32 1712.01 0 0 0 0.01 0 -1181.91 0 0 0 0 874.889 1611 0 0 0 0 0 0 0 585.421 -1232.26 0 0 
0 0 0 0 1014.97 0 0 0 0 0 0 0 0 1429.72 0 0 0 0 0 -453.124 -218.589 163.198 0 0 -1287.96 0 0 0 0 -637.913 0 600.986 0 0 0 0 0.09 653.63 0 0 0 0 578.555 0 0 251.396 1822.79 0 0 0 0 461.364 0 -618.229 0 
0 0 0 283.593 0 0 0 0 0 0 0 2227.62 0 0 0 0 0 -1394.31 0 -288.476 0 1412.93 388.424 0 0 0 0 0 0 0 0 2153.77 0 0 0 -2170.25 1806.01 0.04 0 0 0 1672.64 0 0 0 0 0 1776.86 0 0 0 0 0 0 0 
-39.2926 0 0 2361.6 1205.25 -1092.94 0 0 244.072 0 0 0 0 1605.35 0 -566.195 -2208.4 0 416.501 0 0 0 0 0 0 0 0 0 0 0 0 -1746.19 0 0 0 0 0 0 0.07 0 0 951.338 0 0 -1526.15 1963.33 0 1397.21 1251.64 0 0 1107.29 0 2497.1 0 
-1888.56 0 0 0 0 1341.52 0 -1091.11 0 0 0 0 0 0 1426.66 0 0 0 0 0 0 0 0 0 0 0 0 -936.537 0 0 -1927.32 0 0 0 0 0 0 0 0 0.08 532.319 -362.484 2490.54 -1047.62 1829.2 0 0 1942.58 0 -1822.79 0 2249.44 0 0 0 
0 0 0 2393.19 0 0 -192.801 0 0 1941.21 0 -132.374 0 0 0 0 -1313.75 0 0 2438.96 461.058 0 -812.632 0 0 -1883.83 11.6733 0 1403.32 0 0 0 0 0 0 0 0 0 0 -236.9 0 0 0 0 2317.5 0 0 0 0 1390.19 2412.56 0 0 0 0 
0 2345.42 0 0 0 0 0 0 0 0 0 0 0 0 0 0 0 0 0 0 0 0 0 0 482.727 674.23 0 -653.325 0 0 0 0 1147.88 0 2155.6 0 0 -88.1222 -1269.19 1010.39 0 0.09 0 0 0 -1354.64 0 0 -1130.33 -1873.61 0 0 0 0 0 
0 0 0 0 0 0 0 0 0 0 0 0 0 0 0 0 0 0 0 0 0 1754.59 0 565.889 0 1749.09 0 0 0 0 0 0 0 0 0 1880.93 -2431.18 0 0 2043.75 0 0 0.02 0 893.506 1441.77 -657.14 0 0 1219.6 2238.3 2360.38 -311.212 0 0 
237.815 0 2392.42 0 0 0 1655.1 0 2239.07 0 0 -738.472 0 0 0 0 0 0 0 304.956 0 0 0 0 163.961 -171.743 0 0 0 0 0 0 1170.16 0 -207.297 164.876 0 0 0 234.764 0 0 0 0.01 2309.41 0 0 0 846.049 0 0 0 1560.64 0 0 
0 0 0 0 0 0 0 2292.17 0 0 0 0 -421.384 0 0 0 0 0 0 0 0 0 0 0 1180.99 0 0 0 0 0 0 -1115.53 1904.58 -1345.33 1187.4 0 0 0 -2464.14 2226.71 1189.54 0 1598.79 1235.92 0.07 0 0 0 0 0 0 0 1238.67 0 0 
889.081 0 0 0 0 -109.027 0 0 0 0 0 1470.15 0 0 0 -1011.31 0 0 0 0 0 0 0 -1142.54 0 464.11 0 2357.17 545.595 0 0 -2309.41 0 0 0 0 1189.84 0 993.301 0 0 -1533.94 1724.98 0 0 0.06 0 0 0 0 0 0 1721.47 0 0 
0 -1594.52 0 0 0 0 0 0 0 0 0 0 1926.86 -1381.04 1300.32 -604.19 0 -419.706 0 0 0 0 0 0 0 0 0 0 0 0 0 0 0 0 0 0 324.335 0 0 0 0 0 2461.24 0 0 0 0.07 700.323 615.024 0 0 0 0 0 0 
1185.57 1271.02 0 0 -1931.44 0 0 1908.55 -73.7785 0 0 -245.598 0 170.522 0 -1287.19 0 0 0 -166.86 0 0 2079.3 0 0 0 0 0 0 0 -450.682 2273.25 1835.76 754.036 0 0 0 65.3859 -2338.71 2375.18 0 0 0 0 0 0 1457.03 0.03 -1554.84 0 0 0 0 0 0 
1334.65 1506.47 0 0 0 -1927.32 1416.29 0 0 0 0 0 0 192.495 1119.5 0 0 -276.116 0 0 0 0 0 0 0 450.072 0 0 0 -1529.82 0 0 0 0 2066.33 0 0 0 -84.7652 0 0 2000.72 0 11.3681 0 0 -400.327 126.27 0.02 0 936.689 2123.86 -538.27 0 0 
0 -1149.1 0 779.214 0 0 0 311.06 -2025.74 0 0 -2121.42 0 0 1520.2 0 1149.56 0 0 0 0 0 0 412.992 1172.44 0 0 0 0 0 1250.88 0 0 -1382.26 0 0 0 0 0 -2405.09 809.58 2370.14 766.854 0 0 0 0 0 0 0.09 0 311.975 0 0 0 
0 519.654 0 0 0 1195.33 659.734 0 0 0 0 -2033.83 0 140.004 0 0 0 2232.35 0 0 1886.58 1380.89 0 0 0 0 0 0 0 0 0 566.347 0 0 0 0 0 0 0 0 -244.987 0 -785.928 0 0 0 0 0 1605.96 0 0.08 0 0 0 0 
-1509.67 0 0 0 0 0 0 0 0 0 0 0 1243.71 0 1998.58 1773.66 0 0 0 0 0 0 0 0 0 0 0 0 0 0 0 0 194.632 0 1844.61 -623.264 2199.55 0 210.654 -2460.17 0 0 -1758.71 0 0 0 0 0 1978.74 -705.512 0 0 0 0 0 
0 0 0 0 0 0 0 -1599.09 -829.875 0 -545.9 0 -1364.71 0 0 -396.512 0 1921.67 0 0 2187.34 1853.16 0 0 210.807 0 -1745.28 1122.24 -1452.91 0 1716.59 0 -2391.05 0 0 1620.76 0 0 0 0 0 0 1356.47 -1278.04 1014.66 -204.703 0 0 -506.684 0 0 0 0.09 2241.66 0 
0 0 0 0 0 1530.12 0 -2189.63 0 0 -974.38 0 0 0 0 0 170.064 0 -1847.97 0 0 0 0 0 0 0 0 0 495.392 0 0 0 0 1146.2 0 0 -643.712 0 2454.22 0 0 0 0 0 0 0 0 0 0 0 0 0 2191.61 0 0 
0 0 2101.12 0 0 0 0 0 0 0 0 0 0 0 0 466.399 0 0 0 -1824.78 0 0 0 0 0 0 2446.29 0 1000.17 0 0 0 0 0 0 0 0 0 0 0 0 0 0 0 0 0 0 0 0 0 0 0 0 0 0 
