*Vertices 57
*Matrix 
0.05 38.377 1844 0 0 0 702.002 0 2412.41 0 0 1756.42 0 0 0 883.892 691.168 -1990.19 0 0 0 0 0 0 0 1265.83 0 0 0 0 0 0 593.509 0 0 2243.8 -1269.49 2380.83 0 0 1265.68 1324.43 0 0 -698.645 0 0 0 -1018.63 0 0 0 -52.1104 0 0 0 0 
1179.46 0.08 0 -344.63 0 0 1410.79 0 0 -1029.31 0 1947.92 -1525.85 0 0 -2305.44 -960.952 0 0 0 0 0 0 0 0 1518.07 0 1949.14 634.251 1811.66 0 0 -880.078 0 0 0 0 -1689.58 -1444.82 0 1940.14 172.353 0 0 0 0 0 0 0 1516.85 -125.965 672.552 0 0 0 0 0 
1362.42 0 0.07 0 0 0 0 0 0 0 0 0 0 0 0 0 0 -1433.38 0 345.393 862.072 -923.109 1824.32 0 0 0 0 0 0 1643.65 0 0 0 0 0 0 981.857 0 248.344 0 1224.02 0 0 303.888 0 -1855.91 0 0 0 0 1540.19 0 0 0 0 0 0 
0 872.753 0 0.04 -2188.86 0 0 -1300.47 0 0 0 0 0 0 0 0 0 -2006.06 0 2284.84 846.965 1980.42 0 -773.721 0 0 507.447 0 0 1457.03 0 0 0 0 0 0 0 2025.59 0 1186.33 0 2229.15 0 2182.45 0 881.603 0 0 1075.24 0 0 1547.98 0 273.217 1322.75 0 0 
0 0 0 1911.91 0.06 0 0 0 -859.783 0 0 0 0 936.232 2060.38 286.798 0 0 0 0 0 0 0 0 0 0 0 0 0 0 453.429 1725.29 -143.818 0 0 191.427 0 0 0 -711.615 0 0 0 0 0 0 0 1126.97 0 0 0 0 0 -578.707 0 0 0 
0 0 0 0 0 0.01 -428.251 0 2229.91 0 0 0 -1041.22 1015.88 0 2470.4 -1177.94 0 0 0 0 0 -2182.91 0 0 690.558 978.347 0 0 0 0 0 1500.21 0 -1257.59 0 0 0 -2421.41 0 0 2395.78 0 0 0 0 -2160.63 -59.4348 0 1227.23 0 0 0 0 0 0 0 
1551.64 1167.56 0 0 0 -2383.27 0.01 1532.26 0 0 -906.629 0 823.008 0 0 0 0 -1675.24 0 0 0 0 0 0 1909.62 0 0 -2382.66 0 0 1380.89 0 0 0 0 0 0 0 0 0 0 0 0 0 2302.09 0 0 1966.99 0 0 0 2066.79 0 384.457 0 0 0 
0 0 0 1293.6 0 0 2117.91 0.04 1414.61 0 -555.208 -308.771 0 485.626 0 0 0 0 0 -61.2659 0 0 0 0 -2301.17 0 0 -644.78 -2144.15 -1898.48 2028.49 0 0 0 0 0 0 1616.95 0 0 0 -2292.32 0 841.624 361.721 0 0 0 0 0 0 0 0 0 0 0 0 
1935.71 0 0 0 -1558.5 1747.26 0 1263.54 0.05 0 0 0 0 0 0 1090.5 0 0 0 0 -795.999 0 682.318 -249.26 0 2291.71 -933.79 0 0 0 0 0 0 0 0 0 0 0 366.146 0 -42.497 -938.978 0 -1077.23 0 731.605 0 0 0 0 0 0 2236.78 0 0 0 0 
0 1007.64 0 0 0 0 0 0 0 0.02 233.695 0 0 0 0 0 141.987 0 0 0 0 0 1955.4 0 778.756 0 0 0 0 0 0 -1296.04 0 0 0 0 0 0 0 0 0 0 0 0 0 1754.28 0 0 0 0 -123.981 0 8.62148 0 0 0 0 
0 0 0 0 0 0 -802.56 1763.28 0 87.3592 0.06 0 -296.411 0 0 0 0 0 -1972.18 0 835.368 0 0 -245.14 0 0 0 0 0 0 0 -1176.56 0 0 0 2204.89 0 0 0 0 0 0 0 0 0 0 2473.45 0 2285.3 0 0 0 0 0 0 -654.241 0 
1922.9 1655.55 0 0 0 0 0 -78.0511 0 0 0 0.08 -111.469 0 0 0 0 0 0 0 -388.424 0 -337.916 0 1604.59 2024.83 -1548.59 0 0 0 0 0 0 0 0 475.097 0 0 0 -1983.32 1076.62 1775.34 0 0 0 0 0 0 -417.722 0 0 474.792 0 0 0 0 0 
0 502.258 0 0 0 711.463 -2238.76 0 0 0 1764.35 1612.98 0.09 1228.75 0 0 2308.34 -1084.7 0 2152.85 -1412.02 0 0 -1994 0 0 0 0 0 0 0 -1562.17 0 1567.81 0 0 0 0 0 -1063.8 0 0 0 0 0 -621.281 -213.706 0 0 0 0 2158.8 0 -899.609 0 0 0 
0 0 0 0 -599.765 1649.75 0 1156.12 0 0 0 0 97.5829 0.05 -185.476 0 0 614.566 0 0 0 0 2265.31 0 0 0 0 0 0 0 0 -199.21 112.537 0 0 0 0 0 0 1043.35 0 509.583 0 1898.02 0 0 0 0 0 0 0 0 0 0 0 0 0 
0 0 0 0 1913.13 0 0 0 0 0 0 0 0 1348.23 0.01 0 735.725 2289.57 0 958.815 0 0 0 0 0 -1581.7 0 0 0 0 0 -1214.1 0 2247.31 -604.801 0 0 1813.49 -1010.39 0 0 0 0 0 -1756.57 0 1881.24 -2131.18 -259.178 0 0 0 0 0 -1447.26 0 0 
145.955 1673.71 0 0 551.088 790.963 0 0 2478.64 0 0 0 0 0 0 0.01 0 0 0 -2180.93 0 0 0 540.406 250.938 0 0 0 0 -1902.45 0 0 -902.814 0 0 0 -137.104 -1302.76 2036.12 -708.563 1700.57 0 0 0 0 0 0 -902.203 0 0 0 0 0 0 0 -412.687 0 
1693.4 -1208.46 0 0 0 911.206 0 0 0 -1026.41 0 0 1053.73 0 -505.921 0 0 1136.59 0 -1819.44 0 0 1831.49 0 0 0 0 -470.824 0 0 2257.53 0 0 0 -2131.49 0 -837.046 0 0 0 0 0 0 1396.91 1289.79 0 0 0 0 0 689.642 0 291.833 0 0 0 0 
138.325 0 2060.23 1218.07 0 0 2315.52 0 0 0 0 0 -1354.79 -2220.45 -1084.09 0 -210.807 0.04 942.793 0 2481.23 1835.92 962.935 0 -1535.16 -1208.61 0 0 0 0 0 0 0 0 0 882.366 0 609.836 0 0 0 0 0 712.226 0 758.919 2098.07 0 0 0 2318.57 0 0 0 0 0 0 
0 0 0 0 0 0 0 0 0 0 123.676 0 0 0 0 0 0 -547.426 0.06 0 288.018 2303.16 0 0 -2494.51 0 0 0 0 0 2101.89 1424.53 0 0 0 0 -39.7504 -201.804 0 0 0 0 -1715.37 0 1584.14 0 0 0 2238.91 2407.07 0 0 -242.546 0 0 0 0 
0 0 2353.51 47.2274 0 0 0 -2153.31 0 0 0 0 -1286.13 0 922.956 2321.62 -325.098 0 0 0.04 1443.45 0 0 0 0 0 -1035.57 1094.16 -1004.59 1582 0 0 0 0 0 0 0 -212.027 -2043.75 1323.97 0 0 0 0 240.562 0 0 414.518 -2238 436.033 0 0 0 0 158.925 0 0 
0 0 -1351.89 543.306 0 0 0 0 -2492.52 0 2154.53 -100.177 1843.55 0 0 0 0 288.476 1850.11 2348.48 0.06 -120.319 0 0 -792.184 0 0 0 0 0 0 0 0 0 488.678 0 0 1940.29 0 0 1250.88 1007.19 0 1537.14 0 2028.18 2487.33 0 0 0 0 0 0 327.54 0 0 0 
0 0 2364.96 1672.19 0 0 0 0 0 0 0 0 0 0 0 0 0 234.306 -1970.05 0 -1034.2 0.04 0 1676.15 -1169.85 0 0 0 0 0 0 0 0 0 0 1426.66 0 -1000.78 -640.202 0 0 0 0 1732 0 135.731 2216.94 0 0 0 0 0 1617.4 0 0 0 0 
0 0 -440.764 0 0 421.079 0 0 -1723.15 90.8689 0 544.374 0 794.473 0 0 -812.174 -44.0229 0 0 0 0 0.06 0 0 0 0 0 0 0 0 0 0 0 0 0 0 0 506.836 0 1193.81 0 0 0 0 0 1097.67 0 0 0 0 0 0 2034.75 2114.86 -1260.49 0 
0 0 0 1459.93 0 0 0 0 1661.35 0 -430.54 0 1254.54 0 0 339.137 0 0 0 0 0 2435.15 0 0.03 0 -2141.71 0 0 0 0 1870.71 2487.18 0 0 0 0 0 1318.48 1093.71 0 -2256.31 0 0 0 0 0 0 0 0 0 0 2015.37 0 0 0 50.737 0 
0 0 0 0 0 0 2216.03 184.713 0 1690.65 0 2005.6 0 0 0 1190.91 0 -2394.41 2141.1 0 -1102.56 1435.06 0 0 0.09 0 -1876.81 0 -831.553 1546.91 0 2238.61 0 -1286.58 -888.318 0 -578.402 -1315.88 0 0 0 0 0 782.876 226.524 0 0 0 1538.97 0 0 2175.44 0 2245.93 0 0 0 
-1751.99 671.484 0 0 0 1292.08 0 0 1680.88 0 0 -1438.26 0 0 2269.74 0 0 -642.033 0 0 0 0 0 1701.18 0 0.01 0 0 0 997.269 0 0 0 0 0 -485.473 0 0 0 0 2142.17 840.403 288.934 0 0 -132.679 0 863.75 0 0 0 0 500.58 824.229 0 0 0 
0 0 0 686.285 0 216.605 0 0 -774.941 0 0 2210.84 0 0 0 0 0 0 0 2446.13 0 0 0 0 1354.49 0 0.02 0 0 0 0 -1674.17 -1354.64 -262.078 0 0 0 0 0 0 0 0 0 197.989 -538.118 0 0 0 0 0 0 0 0 0 0 0 0 
0 2019.03 0 0 0 0 -369.961 2372.28 0 0 0 0 0 0 0 0 1552.1 0 0 -618.381 0 0 0 0 0 0 0 0 0 1624.12 0 0 0 0 197.226 0 0 0 0 0 1106.22 0 0 0 0 0 0 0 934.553 2296.14 0 0 0 0 0 0 0 
0 1241.11 0 0 0 0 0 1956.31 0 0 0 0 0 0 0 0 0 0 0 2277.52 0 0 0 0 1417.97 0 0 0 0.08 0 0 0 2443.85 0 0 0 0 0 0 -249.718 0 0 0 -1892.38 2077.78 -2259.36 0 364.01 -1452.3 0 0 -2156.51 0 0 0 0 0 
0 -1535.62 971.938 -1485.11 0 0 0 2107.23 0 0 0 0 0 0 0 1521.27 0 0 0 66.3015 0 0 0 0 1342.89 1471.37 0 417.112 0 0.05 0 199.667 1675.08 -1993.39 0 0 -1173.36 0 0 0 0 0 0 0 -1287.35 -548.799 1418.88 369.198 -432.981 0 0 0 654.851 0 0 0 0 
0 0 0 0 1794.41 0 -1085.16 2219.69 0 0 0 0 0 0 0 0 1278.95 0 1695.68 0 0 0 0 -2214.65 0 0 0 0 0 0 0.02 0 0 1585.67 0 0 0 1189.99 0 0 0 1783.43 559.481 0 1681.49 0 0 1322.75 0 0 2162.77 512.482 0 0 180.135 0 0 
0 0 0 0 148.549 0 0 0 0 -845.439 -1202.2 0 1504.03 1614.35 -1010.09 0 0 0 1833.78 0 0 0 0 -2436.83 1351.74 0 131.306 0 0 1329.77 0 0.02 0 0 0 0 -51.5 0 0 0 0 0 1039.08 0 0 699.255 0 0 -1997.82 0 0 0 812.021 0 895.337 0 0 
-1583.38 -1701.33 0 0 -2273.09 2126.61 0 0 0 0 0 0 0 -89.1903 0 -1838.05 0 0 0 0 0 0 0 0 0 0 1991.56 0 -1169.55 2287.44 0 0 0.03 0 0 -545.9 0 0 0 1605.35 0 -1545.38 0 0 1749.7 0 1661.35 0 0 0 0 -1132.16 0 2476.04 0 0 0 
0 0 0 0 0 0 0 0 0 0 0 0 -1128.8 0 460.753 0 0 0 0 0 0 0 0 0 -2110.43 0 -2122.18 0 0 2174.06 1838.36 0 0 0.08 0 0 0 1993.24 0 0 0 0 1183.74 -1334.19 1545.53 0 0 0 120.014 0 1479.77 -1575.14 189.444 0 -928.755 0 0 
0 0 0 0 0 2428.13 0 0 0 0 0 0 0 0 1589.48 0 -798.593 0 0 0 -1434.45 0 0 0 1291.01 0 0 1889.17 0 0 0 0 0 0 0 0 0 0 0 861.461 0 0 -1741.46 0 0 0 -2051.53 0 1149.86 521.18 0 0 0 0 0 0 0 
2241.81 0 0 0 -1936.78 0 0 0 0 0 2145.38 -745.186 0 0 0 0 0 1724.98 0 0 0 2054.28 0 0 0 -1314.66 0 0 0 0 0 0 -933.027 0 0 0.07 0 0 -415.738 707.801 0 -1127.28 0 0 0 -1923.05 0 0 -405.21 0 0 0 0 0 0 0 0 
2467.19 0 -474.792 0 0 0 0 0 0 0 0 0 0 0 0 -1542.33 -270.165 0 722.144 0 0 0 0 0 -618.839 0 0 0 0 365.078 0 1421.48 0 0 0 0 0.08 2147.97 0 0 -2488.25 0 0 0 580.844 0 0 0 0 0 1360.44 0 0 0 -1114.15 0 -1356.93 
-211.57 2010.64 0 -1788.46 0 0 0 2444.3 0 0 0 0 0 0 -938.063 554.903 0 139.241 -621.891 2350.15 1687.14 -46.9222 0 -480.59 -1017.11 0 0 0 0 0 -652.562 0 0 -1341.98 0 0 1174.12 0.02 2144.61 0 0 0 0 0 0 0 0 -1117.82 1895.89 1281.24 0 -144.887 1541.11 0 1808.3 0 0 
0 -1465.42 -1220.36 0 0 -1855.14 0 0 1593.75 0 0 0 0 0 2467.04 -811.563 0 0 0 1775.19 0 -2169.64 -797.525 2025.28 0 0 0 0 0 0 0 0 0 0 0 2163.38 0 262.383 0.08 0 0 0 0 0 0 0 1883.68 2078.39 0 -1468.17 0 0 -566.5 0 0 0 451.903 
0 0 0 992.843 506.684 0 0 0 0 0 0 2273.71 720.923 -618.839 0 797.22 0 0 0 2342.83 0 0 0 0 0 0 0 0 -1777.63 0 0 0 2282.86 0 -446.257 1822.03 0 0 0 0.07 0 0 0 2234.34 0 0 0 0 0 0 -2317.5 0 2373.96 1793.34 0 0 0 
-1683.48 -1144.67 -861.309 0 0 0 0 0 -1278.19 0 0 238.273 0 0 0 843.455 0 0 0 0 513.092 0 -739.692 1330.38 0 -1723.61 0 -286.187 0 0 0 0 0 0 0 0 529.42 0 0 0 0.09 0 2313.84 0 0 0 0 0 0 913.953 0 0 2247 0 0 0 0 
-657.598 -559.175 0 1630.83 0 1991.87 0 -1071.43 -568.484 0 0 -432.218 0 1664.25 0 0 0 0 0 0 419.095 0 0 0 0 1511.66 0 0 0 0 -1316.34 0 388.882 0 0 1883.37 0 0 0 0 0 0.04 0 0 0 0 0 2393.03 0 0 -1839.88 -301.447 0 -491.882 0 0 0 
0 0 0 0 0 0 0 0 0 0 0 0 0 0 0 0 0 0 -814.92 0 0 0 0 0 0 -737.861 0 0 0 0 2176.5 -1106.22 0 1312.37 784.249 0 0 0 0 0 -1387.75 0 0.09 0 0 0 -1275.14 -597.324 0 0 0 0 1206.17 -1442.23 2247.76 0 612.735 
0 0 -2181.69 1073.26 0 0 0 2254.17 776.162 0 0 0 0 2073.96 0 0 1882.46 1735.36 0 0 2081.29 -1493.96 0 0 -512.787 0 1303.37 0 803.781 0 0 0 0 1874.37 0 0 0 0 0 -557.192 0 0 0 0.02 0 0 0 0 -1619.69 0 0 0 0 -463.958 0 0 0 
-139.088 0 0 0 0 0 -1450.01 920.515 0 0 0 0 0 0 -1909.92 0 1777.02 0 -344.325 585.421 0 0 0 0 -683.233 0 -1081.96 0 814.005 1604.28 1326.56 0 -1733.53 1966.08 0 0 2225.79 0 0 0 0 0 0 0 0.06 -780.435 -1952.04 0 0 0 0 0 1939.22 592.441 0 0 -1766.95 
0 0 1400.42 -1271.17 0 0 0 0 -1019.39 1392.03 0 0 -521.638 0 0 0 0 2402.8 0 0 -463.958 1466.64 0 0 0 276.727 0 0 2125.08 502.258 0 59.8926 0 0 0 -866.344 0 0 0 0 0 0 0 0 -1333.43 0.01 0 71.6422 0 0 0 0 0 0 0 0 0 
0 0 0 0 0 -468.535 0 0 0 0 1244.93 0 -1476.26 0 1574.22 0 0 -1288.11 0 0 1886.27 -633.793 -2257.99 0 0 0 0 0 0 794.778 0 0 -375.454 0 484.863 0 0 0 249.107 0 0 0 857.799 0 871.99 0 0 0 1920.61 0 0 0 0 -182.424 2484.59 0 1476.41 
0 0 0 0 2444.76 1139.33 521.943 0 0 0 0 0 0 0 -990.707 -1365.32 0 0 0 2332.3 0 0 0 0 0 -1840.65 0 0 -1045.18 2046.8 1988.51 0 0 0 0 0 0 -1025.65 -511.109 0 0 -2408.44 -1396.15 0 0 1041.67 0 0.04 0 0 0 2098.83 1741.77 0 0 0 0 
1230.58 0 0 2135 0 0 0 0 0 0 177.389 -518.281 0 0 -1655.1 0 0 0 -1919.84 1474.43 0 0 0 0 -2260.43 0 0 -1287.35 -13.5044 1862.32 0 -2352.75 0 2440.79 -512.94 1694.62 0 2432.25 0 0 0 0 0 -823.923 0 0 224.693 0 0.04 1628.85 0 0 0 0 0 0 0 
0 96.6674 0 0 0 1905.65 0 0 0 0 0 0 0 0 0 0 0 0 -1110.95 -1581.09 0 0 0 0 0 0 0 452.208 0 0 0 0 0 0 2222.43 0 0 -1565.37 -141.682 0 2183.98 0 0 0 0 0 0 0 2373.5 0.01 0 0 0 0 0 0 0 
0 1966.84 1686.68 0 0 0 0 0 0 876.263 0 0 0 0 0 0 -619.144 2128.28 0 0 0 0 0 0 0 0 0 0 0 0 286.035 0 0 2119.89 0 0 1812.72 0 0 -813.242 0 -1396.91 0 0 0 0 0 0 0 0 0.02 998.184 1352.5 0 -1549.96 -535.066 0 
0 729.469 0 2061.91 0 0 2046.19 0 0 0 0 -62.7918 2134.08 0 0 0 0 0 0 0 0 0 0 769.753 -2009.41 0 0 0 -167.165 0 1889.32 0 2099.14 -1942.88 0 0 0 2358.7 0 0 0 1298.03 0 0 0 0 0 435.881 0 0 -1197.32 0.07 0 0 0 1028.55 0 
-2264.55 0 0 0 0 0 0 0 -1390.8 -62.7918 0 0 0 0 0 0 725.501 0 2470.24 0 0 1424.99 0 0 0 1191.06 0 0 0 1293.15 0 1954.94 0 2458.95 0 0 0 2407.53 1047.17 962.325 1875.9 0 -686.743 0 2074.57 0 0 2220.76 0 0 -1913.59 0 0.05 933.027 0 0 0 
0 0 0 686.132 1565.83 0 1519.59 0 0 0 0 0 2355.34 0 0 0 0 0 0 0 -280.236 0 -982.467 0 2052.9 242.698 0 0 0 0 0 0 -998.794 0 0 0 0 0 0 1347.16 0 -938.826 1831.03 -357.143 -1144.83 0 852.763 0 0 0 0 0 1091.42 0.09 0 0 0 
0 0 0 1869.64 0 0 0 0 0 0 0 0 0 0 -2295.07 0 0 0 0 2251.43 0 0 1158.56 0 0 0 0 0 0 0 2030.17 -1354.95 0 -1072.34 0 0 3.28074 1009.02 0 0 0 0 39.4452 0 0 0 1325.65 0 0 0 2000.72 0 0 0 0.02 0 0 
0 0 0 0 0 0 0 0 0 0 1501.59 0 0 0 0 1647.62 0 0 0 0 0 0 -1875.13 1371.88 0 0 0 0 0 0 0 0 0 0 0 0 0 0 0 0 0 0 0 0 0 0 0 0 0 0 2440.49 2462.31 0 0 0 0.01 0 
0 0 0 0 0 0 0 0 0 0 0 0 0 0 0 0 0 0 0 0 0 0 0 0 0 0 0 0 0 0 0 0 0 0 0 0 2005.29 0 -1274.38 0 0 0 1339.84 0 2145.68 0 -2267.45 0 0 0 0 0 0 0 0 0 0.07 
