*Vertices 66
*Matrix 
0.04 0 -619.449 0 595.798 0 0 0 76.9829 0 0 0 0 0 0 0 0 0 0 0 0 -830.485 0 0 0 0 0 0 0 0 0 0 0 0 0 0 0 0 0 0 0 0 0 0 0 0 0 1449.71 0 0 1993.39 0 0 695.288 0 2270.04 0 0 0 0 0 0 0 0 0 0 
0 0.09 0 0 0 0 0 0 0 2064.81 0 0 0 0 0 0 0 0 0 856.883 0 0 0 0 0 0 0 0 389.035 0 1530.27 997.574 0 0 0 0 -1806.01 0 0 0 0 0 0 0 0 0 683.844 0 0 0 0 0 0 0 0 0 0 0 0 0 1105.76 0 0 0 0 0 
1844.46 0 0.08 0 0 0 0 0 0 0 0 0 0 0 -1032.52 0 1968.83 0 0 0 0 0 0 0 0 0 0 0 -823.313 0 0 -1137.2 1390.96 2432.55 0 0 0 0 311.67 0 -358.211 0 -86.7489 0 0 0 0 -479.675 0 0 0 0 -1032.98 -808.664 0 0 0 0 0 0 0 0 0 0 0 0 
0 0 0 0.04 0 0 0 0 0 0 0 0 0 0 0 0 0 -857.494 0 0 2287.59 0 0 0 0 0 0 0 0 0 0 1949.29 0 0 0 0 0 0 0 0 0 0 0 0 1985.15 0 0 0 0 0 -1159.17 0 1109.12 0 0 0 0 0 0 0 0 0 0 0 0 0 
-2006.97 0 0 0 0.09 -358.516 0 0 0 0 0 0 0 0 0 0 0 1279.11 0 0 -1612.52 1361.2 0 0 0 0 191.427 0 0 0 0 0 0 0 0 0 0 0 0 2107.53 0 0 -1300.01 1613.44 0 0 0 0 0 0 0 2076.71 0 0 0 0 0 0 0 0 0 0 0 0 0 0 
0 0 0 0 1596.8 0.09 0 0 0 0 2158.35 0 0 0 0 0 0 0 1852.85 0 0 0 0 0 0 0 0 -1122.55 1724.07 635.319 329.218 0 0 0 -777.23 0 0 986.129 0 0 0 0 0 0 0 0 -2172.84 0 0 0 0 0 0 -1117.97 0 0 0 0 0 0 0 0 0 0 0 0 
0 0 0 0 0 0 0.03 0 -1950.67 0 0 0 0 0 0 1278.5 0 221.335 0 0 0 1611.3 0 0 0 0 0 0 0 0 0 0 256.737 -278.1 0 0 0 1632.51 0 0 0 0 0 0 0 0 0 0 0 0 1920.91 0 -708.716 0 -1274.22 0 0 0 0 0 0 0 0 0 0 0 
0 0 0 0 0 0 0 0 0 0 0 0 0 0 2486.11 0 0 0 0 0 0 0 0 0 0 0 0 0 0 0 0 0 -2266.69 0 0 0 2167.81 0 0 0 0 0 0 0 0 0 0 0 0 0 -471.435 0 0 0 0 0 0 0 0 0 0 0 0 0 0 0 
-1007.03 0 0 0 0 0 2199.09 0 0.04 0 0 0 0 665.685 791.879 0 0 0 -782.723 0 0 0 0 0 0 0 0 0 0 0 0 0 0 0 0 -1732.76 0 0 0 0 0 0 0 2145.99 0 0 0 0 0 0 0 0 0 0 0 0 0 0 0 0 0 0 0 0 0 0 
0 -1953.26 0 0 0 0 0 0 0 0.09 0 1746.5 0 0 0 0 -543.458 0 1331.45 455.565 660.649 0 0 0 0 2233.73 0 0 0 0 0 -1201.74 -905.866 2440.49 0 0 0 0 0 -1679.97 -1095.84 747.932 0 0 0 0 0 0 0 0 0 0 0 0 0 0 0 0 0 0 0 0 0 0 0 0 
0 0 0 0 0 -2325.74 0 0 0 0 0.02 0 0 0 0 0 -85.6807 0 0 0 1681.65 0 0 0 0 1210.59 0 0 0 0 0 0 0 0 0 0 0 2384.79 0 0 0 0 0 0 2421.57 1015.58 0 0 970.107 0 0 0 0 2034.75 0 0 0 0 0 0 0 0 0 0 0 0 
0 0 0 0 0 0 0 0 0 1911.91 0 0.07 0 0 0 0 0 0 0 0 0 0 0 0 0 0 0 0 0 0 0 0 0 0 0 0 0 2282.1 0 0 0 0 0 0 0 0 0 0 0 0 0 0 883.282 -1602.3 0 0 0 0 0 0 0 0 0 0 0 0 
0 0 0 0 0 0 0 0 0 0 0 0 0.04 0 0 -1093.86 0 0 0 0 0 0 0 0 0 0 0 0 0 0 0 0 0 0 0 0 0 0 0 0 0 0 0 0 1171.83 0 0 0 0 0 0 0 0 0 0 0 0 0 0 0 0 0 0 0 0 0 
0 0 0 0 0 0 0 0 906.629 0 0 0 0 0.01 0 0 0 0 0 0 0 632.267 0 0 0 0 0 0 0 0 0 0 0 0 0 0 0 0 1439.63 2280.11 0 0 0 0 0 0 0 0 0 0 -1993.39 0 0 0 -1257.44 0 0 0 0 0 0 0 0 0 -443.205 0 
0 0 -2428.74 0 0 0 0 -181.661 2251.43 0 0 0 0 0 0.01 0 0 0 0 0 -564.669 0 0 0 0 0 0 0 0 0 0 0 0 0 0 1801.28 0 0 1349.6 0 0 0 0 1583.38 0 0 0 0 1581.7 0 0 0 1655.4 0 0 0 0 0 0 0 0 0 -1640.75 0 0 0 
0 0 0 0 0 0 -532.624 0 0 0 0 0 -1626.1 0 0 0.04 0 0 0 0 0 0 0 1092.94 379.116 0 0 0 0 -665.227 0 0 0 0 0 0 377.59 0 308.771 0 0 2018.42 0 0 0 0 0 0 0 0 0 0 0 0 991.928 0 0 0 0 0 0 0 0 0 0 0 
0 0 2216.48 0 0 0 0 0 0 -2124.93 -1520.66 0 0 0 0 0 0.04 0 0 0 0 0 0 0 0 0 0 0 0 0 0 0 452.513 0 0 0 0 0 1681.8 2186.42 1596.19 0 0 -2271.42 0 0 0 0 0 0 1701.79 0 0 0 0 0 0 0 0 0 0 0 0 0 0 0 
0 0 0 2494.66 -2229.3 0 -2039.32 0 0 0 0 0 0 0 0 0 0 0.03 0 0 0 0 0 0 0 0 0 0 956.832 0 0 476.623 0 1077.23 0 0 0 0 0 0 0 1305.51 0 0 0 0 0 0 0 0 0 0 0 0 0 0 0 0 -1246.3 0 0 0 0 0 0 0 
0 0 0 0 0 1363.19 0 0 -91.7844 -1562.78 0 0 0 0 0 0 0 0 0.03 -342.189 486.541 0 0 0 0 0 0 0 0 0 1062.12 0 0 0 0 0 0 0 0 0 0 0 0 0 424.741 637.455 31.663 0 0 0 0 0 0 0 0 0 0 0 0 0 0 0 0 0 0 0 
0 -2279.35 0 0 0 0 0 0 0 1235.62 0 0 0 0 0 0 0 0 793.863 0.09 0 0 0 0 0 0 0 747.017 0 1460.54 0 0 0 0 0 0 0 0 0 0 0 0 1420.87 0 1166.8 0 0 0 0 1827.98 0 0 0 0 0 0 0 0 0 0 0 0 0 0 0 0 
0 0 0 233.543 1180.84 0 0 0 0 -1181.14 2096.09 0 0 0 -1466.49 0 0 0 -1264.76 0 0.08 1320.92 1417.51 0 0 0 0 0 0 0 0 0 -285.73 0 0 0 0 -366.909 0 525.91 0 0 0 415.281 0 0 0 0 0 0 0 0 0 0 0 0 0 0 0 0 0 0 0 0 0 0 
481.658 0 0 0 -1322.6 0 -1081.04 0 0 0 0 0 0 1127.89 0 0 0 0 0 0 1405.91 0.02 0 0 0 453.734 0 0 0 0 0 0 0 2329.1 0 0 0 0 0 0 0 2318.57 -1952.65 0 0 1612.22 0 0 0 0 0 0 0 0 0 0 0 0 0 0 0 0 0 0 0 0 
0 0 0 0 0 0 0 0 0 0 0 0 0 0 0 0 0 0 0 0 2366.63 0 0.02 0 0 1058.76 0 1105.61 0 0 0 0 0 0 0 -2493.9 0 0 0 0 0 0 434.965 0 0 0 2246.7 0 0 -2325.13 0 0 0 0 0 0 0 0 0 0 0 0 0 0 0 0 
0 0 0 0 0 0 0 0 0 0 0 0 0 0 0 2325.89 0 0 0 0 0 0 0 0 0 0 0 0 0 0 604.038 0 0 0 -456.175 0 0 0 0 0 0 1549.81 0 0 0 0 1118.88 290.307 0 0 0 0 0 0 0 0 0 0 0 0 0 0 0 0 0 0 
0 0 0 0 0 0 0 0 0 0 0 0 0 0 0 2165.52 0 0 0 0 0 0 0 0 0.06 0 0 0 0 0 0 0 866.497 0 0 0 1726.97 0 118.946 0 0 0 0 0 0 0 -1346.4 0 0 0 0 -509.888 0 0 0 0 0 0 0 -560.396 0 0 0 0 0 0 
0 0 0 0 0 0 0 0 0 751.9 1425.75 0 0 0 0 0 0 0 0 0 0 187.002 2228.39 0 0 0.09 0 0 0 63.7074 0 0 0 0 0 0 0 322.962 0 0 0 0 0 0 0 0 0 0 0 0 -1017.72 0 0 0 0 0 0 0 0 0 0 0 0 0 0 0 
0 0 0 0 1836.53 0 0 0 0 0 0 0 0 0 0 0 0 0 0 0 0 0 0 0 0 0 0.05 0 0 0 0 0 0 1908.4 0 0 0 0 0 0 0 0 355.312 0 0 0 0 0 0 0 0 0 0 0 0 0 0 0 0 0 0 0 0 0 0 0 
0 0 0 0 0 1210.59 0 0 0 0 0 0 0 0 0 0 0 0 0 189.138 0 0 -1585.97 0 0 0 0 0.01 2112.11 0 0 0 0 0 0 0 0 -1247.06 0 0 0 0 0 0 0 0 0 0 0 1933.27 0 0 0 1224.48 0 0 0 0 0 0 0 0 0 0 0 0 
0 1005.81 -538.575 0 0 1577.12 0 0 0 0 0 0 0 0 0 0 0 1794.72 0 0 0 0 0 0 0 0 0 -410.55 0.03 0 0 0 0 0 0 0 0 0 0 0 0 1392.18 0 0 0 0 0 0 0 0 1787.55 0 0 0 0 0 0 0 0 0 0 0 0 0 0 0 
0 0 0 0 0 1282.31 0 0 0 0 0 0 0 0 0 -1997.21 0 0 0 -211.112 0 0 0 0 0 2224.27 0 0 0 0.09 0 0 0 0 0 0 -177.847 0 0 1018.48 0 0 0 0 0 0 0 0 816.141 0 0 -1335.87 0 0 0 0 0 0 0 0 0 0 0 0 0 0 
0 -178.304 0 0 0 1007.8 0 0 0 0 0 0 0 0 0 0 0 0 934.858 0 0 0 0 939.283 0 0 0 0 0 0 0.03 0 0 0 0 0 0 0 0 0 0 0 0 0 0 0 0 0 0 0 -1123.62 0 0 0 1257.9 0 0 0 0 0 0 0 0 0 0 0 
0 -165.334 2437.59 1298.18 0 0 0 0 0 1875.13 0 0 0 0 0 0 0 -1677.22 0 0 0 0 0 0 0 0 0 0 0 0 0 0.03 0 0 -926.008 0 0 -1203.88 0 0 0 2061.75 441.374 0 0 0 0 0 -1009.32 0 0 766.091 0 0 0 0 0 1632.66 0 0 0 0 0 0 0 0 
0 0 -365.078 0 0 0 -437.864 2044.21 0 -2068.77 0 0 0 0 0 0 263.909 0 0 0 -1084.7 0 0 0 2277.83 0 0 0 0 0 0 0 0.07 0 0 0 0 0 1352.81 0 2437.89 -853.984 0 0 0 0 0 0 776.772 0 0 0 0 0 0 0 0 0 0 0 0 0 0 0 0 0 
0 0 -711.615 0 0 0 2232.2 0 0 1751.99 0 0 0 0 0 0 0 2228.39 0 0 0 -531.251 0 0 0 0 -495.239 0 0 0 0 0 0 0.07 -51.1948 0 0 0 0 0 0 0 0 0 0 0 0 0 0 0 0 0 0 0 0 0 0 0 0 0 0 0 0 0 0 0 
0 0 0 0 0 327.387 0 0 0 0 0 0 0 0 0 0 0 0 0 0 0 0 0 1590.09 0 0 0 0 0 0 0 13.657 0 -1074.33 0.06 0 0 0 0 0 0 0 0 0 0 0 0 0 0 0 0 0 0 0 0 0 0 0 0 0 0 0 0 0 0 0 
0 0 0 0 0 0 0 0 2464.14 0 0 0 0 0 376.064 0 0 0 0 0 0 0 2384.95 0 0 0 0 0 0 0 0 0 0 0 0 0.02 0 0 0 0 0 0 0 0 0 0 0 0 0 0 0 0 0 0 0 0 0 0 0 0 0 0 0 0 0 0 
0 909.986 0 0 0 0 0 1859.72 0 0 0 0 0 0 0 -654.698 0 0 0 0 0 0 0 0 -1008.56 0 0 0 0 187.307 0 0 0 0 0 0 0.03 0 0 0 0 0 0 0 0 0 0 1783.88 0 0 0 0 0 0 0 0 0 0 0 0 0 0 0 0 0 0 
0 0 0 0 0 1272.09 2422.64 0 0 0 1147.42 830.332 0 0 0 0 0 0 0 0 -750.526 0 0 0 0 -594.272 0 -2363.58 0 0 0 533.387 0 0 0 0 0 0.05 0 0 0 0 0 455.87 0 0 0 0 0 -755.867 0 0 0 0 0 0 0 0 0 0 0 0 0 0 0 0 
0 0 2269.74 0 0 0 0 0 0 0 0 0 0 1373.1 357.601 157.704 -1353.57 0 0 0 0 0 0 0 -2090.9 0 0 0 0 0 0 0 -1030.84 0 0 0 0 0 0.07 0 1892.53 0 0 0 919.294 0 0 0 0 492.492 0 0 0 0 0 0 0 0 0 0 0 0 0 0 0 0 
0 0 0 0 696.203 0 0 0 0 -688.116 0 0 0 -929.823 0 0 1758.86 0 0 0 1827.52 0 0 0 0 0 0 0 0 2449.95 0 0 0 0 0 0 0 0 0 0.05 0 0 0 0 0 0 0 0 0 0 0 0 0 0 0 0 0 0 0 0 0 0 0 0 0 1931.29 
0 0 2110.13 0 0 0 0 0 0 -991.012 0 0 0 0 0 0 1962.42 0 0 0 0 0 0 0 0 0 0 0 0 0 0 0 1432.16 0 0 0 0 0 574.892 0 0.05 0 0 0 0 1831.49 0 0 0 0 2388.45 0 0 0 0 0 0 0 0 0 0 0 0 0 0 0 
0 0 0 0 0 0 0 0 0 1783.58 0 0 0 0 0 -402.31 0 -984.756 0 0 0 2468.11 0 62.3341 0 0 0 0 1945.33 0 0 -1697.82 2422.03 0 0 0 0 0 0 0 0 0.08 0 123.371 0 0 0 0 -1904.74 0 0 20.3711 0 0 0 0 0 0 0 0 0 0 0 0 0 0 
0 0 -849.101 0 589.999 0 0 0 0 0 0 0 0 0 0 0 0 0 0 915.937 0 159.078 1796.09 0 0 0 326.93 0 0 0 0 2403.71 0 0 0 0 0 0 0 0 0 0 0.07 0 0 0 0 0 0 2423.7 0 2492.22 -2009.87 0 0 0 0 0 0 0 0 0 0 0 0 0 
0 0 0 0 -1080.58 0 0 0 -1730.02 0 0 0 0 0 298.09 0 878.399 0 0 0 586.642 0 0 0 0 0 0 0 0 0 0 0 0 0 0 0 0 2047.72 0 0 0 2487.49 0 0.07 0 -178.61 0 0 0 0 0 0 0 0 0 0 0 0 0 0 0 0 0 0 0 0 
0 0 0 -314.875 0 0 0 0 0 0 1935.26 0 -287.408 0 0 0 0 0 946.455 -1673.41 0 0 0 0 0 0 0 0 0 0 0 0 0 0 0 0 0 0 2494.81 0 0 0 0 0 0.08 0 0 0 0 0 -732.368 0 0 327.845 0 0 0 0 0 0 0 0 0 0 0 0 
0 0 0 0 0 0 0 0 0 0 291.681 0 0 0 0 0 0 0 1023.97 0 0 1667.46 0 0 0 0 0 0 0 0 0 0 0 0 0 0 0 0 0 0 -602.512 0 0 2118.82 0 0.01 0 0 2410.43 2082.05 0 0 0 0 0 0 0 0 0 0 0 0 0 0 0 0 
0 -627.689 0 0 0 -145.192 0 0 0 0 0 0 0 0 0 0 0 0 1708.66 0 0 0 2420.5 1708.66 -2195.12 0 0 0 0 0 0 0 0 0 0 0 0 0 0 0 0 0 0 0 0 0 0.07 0 0 0 0 0 0 0 0 0 0 0 0 0 0 0 0 0 0 0 
1086.84 0 909.223 0 0 0 0 0 0 0 0 0 0 0 0 0 0 0 0 0 0 0 0 1289.18 0 0 0 0 0 0 0 0 0 0 0 0 -1401.03 0 0 0 0 0 0 0 0 0 0 0.09 0 1290.86 0 0 0 0 0 0 0 0 0 0 0 -1168.48 0 0 0 0 
0 0 0 0 0 0 0 0 0 0 1091.72 0 0 0 417.264 0 0 0 0 0 0 0 0 0 0 0 0 0 0 1345.18 0 -2450.87 2222.28 0 0 0 0 0 0 0 0 1262.47 0 0 0 -240.562 0 0 0.04 0 0 0 0 0 0 0 -2036.73 0 0 0 0 0 0 0 0 0 
0 0 0 0 0 0 0 0 0 0 0 0 0 0 0 0 0 0 0 -819.956 0 0 -1829.66 0 0 0 0 648.747 0 0 0 0 0 0 0 0 0 2234.34 1843.55 0 0 0 2399.14 0 0 -1391.11 0 -699.561 0 0.02 0 0 0 0 0 0 0 0 0 0 0 0 0 0 0 0 
-606.632 0 0 -422.758 0 0 1580.78 -68.5903 0 0 0 0 0 2412.56 0 0 1080.74 0 0 0 0 0 0 0 0 -2259.97 0 0 -1444.52 0 2326.04 0 0 0 0 0 0 0 0 0 1132.01 0 0 0 2443.08 0 0 0 0 0 0.06 0 0 0 0 0 0 0 0 0 0 0 0 0 0 0 
0 0 0 0 1650.82 0 0 0 0 0 0 0 0 0 0 0 0 0 0 0 0 0 0 0 38.8348 0 0 0 0 1920.3 0 -630.131 0 0 0 0 0 0 0 0 0 2172.84 244.682 0 0 0 0 0 0 0 0 0.09 0 0 0 0 0 0 0 0 0 0 0 2008.35 0 0 
0 0 2474.52 829.264 0 0 -298.547 0 0 0 0 1253.17 0 0 -305.261 0 0 0 0 0 0 0 0 0 0 0 0 0 0 0 0 0 0 0 0 0 0 0 0 0 0 0 135.273 0 0 0 0 0 0 0 0 0 0.01 2335.2 0 0 0 0 0 0 0 0 0 0 0 0 
693.915 0 -284.509 0 0 1630.38 0 0 0 0 38.377 -2417.75 0 0 0 0 0 0 0 0 0 0 0 0 0 0 0 1540.8 0 0 0 0 0 0 0 0 0 0 0 0 0 0 0 0 2125.08 0 0 0 0 0 0 0 921.43 0.01 0 0 0 0 0 0 0 0 0 0 0 0 
0 0 0 0 0 0 237.358 0 0 0 0 0 0 1631.44 0 -167.776 0 0 0 0 0 0 0 0 0 0 0 0 0 0 -910.443 0 0 0 0 0 0 0 0 0 0 0 0 0 0 0 0 0 0 0 0 0 0 0 0.06 0 0 0 0 0 0 0 0 0 0 0 
1718.27 0 0 0 0 0 0 0 0 0 0 0 0 0 0 0 0 0 0 0 0 0 0 0 0 0 0 0 0 0 0 0 0 0 0 0 0 0 0 0 0 0 0 0 0 0 0 0 0 0 0 0 0 0 0 0.07 0 0 0 0 0 0 0 0 0 0 
0 0 0 0 0 0 0 0 0 0 0 0 0 0 0 0 0 0 0 0 0 0 0 0 0 0 0 0 0 0 0 0 0 0 0 0 0 0 0 0 0 0 0 0 0 0 0 0 1036.94 0 0 0 0 0 0 0 0.04 0 0 0 0 0 0 0 0 0 
0 0 0 0 0 0 0 0 0 0 0 0 0 0 0 0 0 0 0 0 0 0 0 0 0 0 0 0 0 0 0 581.759 0 0 0 0 0 0 0 0 0 0 0 0 0 0 0 0 0 0 0 0 0 0 0 0 0 0.01 0 0 0 0 0 0 0 0 
0 0 0 0 0 0 0 0 0 0 0 0 0 0 0 0 0 758.766 0 0 0 0 0 0 0 0 0 0 0 0 0 0 0 0 0 0 0 0 0 0 0 0 0 0 0 0 0 0 0 0 0 0 0 0 0 0 0 0 0.08 0 0 0 0 0 0 0 
0 0 0 0 0 0 0 0 0 0 0 0 0 0 0 0 0 0 0 0 0 0 0 0 616.398 0 0 0 0 0 0 0 0 0 0 0 0 0 0 0 0 0 0 0 0 0 0 0 0 0 0 0 0 0 0 0 0 0 0 0.06 0 0 0 0 0 0 
0 1174.28 0 0 0 0 0 0 0 0 0 0 0 0 0 0 0 0 0 0 0 0 0 0 0 0 0 0 0 0 0 0 0 0 0 0 0 0 0 0 0 0 0 0 0 0 0 0 0 0 0 0 0 0 0 0 0 0 0 0 0.05 0 0 0 0 0 
0 0 0 0 0 0 0 0 0 0 0 0 0 0 0 0 0 0 0 0 0 0 0 0 0 0 0 0 0 0 0 0 0 0 0 0 0 0 0 0 0 0 0 0 0 0 0 541.627 0 0 0 0 0 0 0 0 0 0 0 0 0 0.04 0 0 0 0 
0 0 0 0 0 0 0 0 0 0 0 0 0 0 812.174 0 0 0 0 0 0 0 0 0 0 0 0 0 0 0 0 0 0 0 0 0 0 0 0 0 0 0 0 0 0 0 0 0 0 0 0 0 0 0 0 0 0 0 0 0 0 0 0 0 0 1682.71 
0 0 0 0 0 0 0 0 0 0 0 0 0 0 0 0 0 0 0 0 0 0 0 0 0 0 0 0 0 0 0 0 0 0 0 0 0 0 0 0 0 0 0 0 0 0 0 0 0 0 0 429.93 0 0 0 0 0 0 0 0 0 0 0 0 0 0 
0 0 0 0 0 0 0 0 0 0 0 0 0 2431.64 0 0 0 0 0 0 0 0 0 0 0 0 0 0 0 0 0 0 0 0 0 0 0 0 0 0 0 0 0 0 0 0 0 0 0 0 0 0 0 0 0 0 0 0 0 0 0 0 0 0 0.05 0 
0 0 0 0 0 0 0 0 0 0 0 0 0 0 0 0 0 0 0 0 0 0 0 0 0 0 0 0 0 0 0 0 0 0 0 0 0 0 0 -126.423 0 0 0 0 0 0 0 0 0 0 0 0 0 0 0 0 0 0 0 0 0 0 1975.84 0 0 0.05 
