*Vertices 65
*Matrix 
0.03 0 0 721.686 0 -1396.76 0 0 0 0 0 0 0 0 -686.895 0 1697.21 0 0 0 0 0 0 245.903 2075.95 291.07 0 0 0 0 0 0 0 0 0 0 0 0 0 0 0 0 0 -1534.24 0 0 0 -1004.9 0 196.158 0 0 0 0 0 0 0 0 0 0 0 0 0 0 0 
0 0.06 0 2072.44 0 0 0 -2245.63 1509.37 0 0 0 0 1493.04 0 1157.03 0 0 905.103 0 974.685 -2486.27 0 0 2060.84 0 -642.338 -1359.98 0 0 0 -100.482 0 0 0 1283.84 -1697.67 0 0 -2259.21 1326.72 1148.64 0 0 0 0 0 0 0 -1371.27 0 0 1602.15 2495.57 0 617.161 0 1544.01 -133.29 0 0 0 0 0 0 
0 0 0.04 0 0 0 0 -1601.54 -2360.38 0 -992.538 0 -2406.92 0 746.254 1815.62 1171.83 2418.67 0 0 0 0 -307.092 0 0 1972.79 0 -1085.77 0 0 0 0 -1461 0 323.267 2339.47 -1862.93 0 41.7341 0 2083.88 0 173.269 0 1279.56 0 0 0 0 0 937.3 0 0 -1141.01 0 0 0 0 0 0 0 0 0 0 0 
-1805.09 -1375.09 0 0.09 0 0 0 1524.48 0 701.697 0 0 294.275 0 0 0 0 0 0 0 0 0 0 0 0 0 0 1231.8 0 0 0 0 501.343 0 623.722 0 0 0 0 0 0 0 0 0 0 0 -1201.28 -103.076 0 0 0 2432.1 -2060.53 576.876 0 0 -1106.37 869.549 1.29704 0 2244.56 0 0 0 -958.815 
0 0 0 0 0.04 1237.45 0 -1014.51 352.412 0 0 0 1080.28 1126.67 0 -1583.22 -608.31 0 0 0 0 0 -260.399 -450.072 0 0 0 -992.996 0 0 0 0 0 0 0 0 0 0 975.753 0 0 0 0 0 0 0 0 0 -2151.17 0 0 1546.91 0 0 1234.7 0 793.252 0 0 0 0 521.485 1315.42 596.713 0 
1343.5 0 0 0 -1574.07 0.09 1352.35 0 1961.5 0 1661.96 0 0 0 0 1891.77 0 0 0 0 0 1834.85 1988.36 0 -1969.13 0 0 0 0 0 1634.65 0 0 1095.08 0 0 0 0 0 1291.31 0 0 0 1659.06 0 0 0 -733.284 697.882 0 -1215.48 -1279.56 0 0 0 0 1904.43 -889.691 0 0 0 836.589 0 0 0 
0 0 0 0 0 -2201.83 0.06 0 0 0 0 0 -576.418 0 285.882 880.23 0 0 0 0 -589.084 -1114.31 0 0 0 0 -792.795 959.12 0 0 -205.313 0 1824.32 0 0 0 0 0 -834.3 0 -41.2763 0 2137.44 1912.52 0 0 0 0 0 0 0 0 2156.21 0 0 0 0 0 0 0 0 0 0 0 0 
0 -1772.59 -1275.44 -1838.21 -355.464 0 0 0.03 0 2011.09 0 0 0 1779.46 0 0 989.639 0 0 0 2479.71 0 0 0 0 0 0 -1453.67 2496.49 2414.09 0 0 0 0 0 0 0 0 0 0 0 1111.56 0 0 0 0 0 0 0 0 0 0 0 0 -1307.64 0 0 1318.02 0 0 0 537.965 -2200.92 0 -772.805 
0 2260.12 1371.73 0 -1226.16 1132.47 0 0 0.05 0 0 0 0 0 0 0 -597.324 1958.3 2175.89 0 0 0 0 0 0 0 0 0 0 0 -570.009 0 0 0 0 0 0 0 0 0 257.958 0 0 0 1718.57 0 0 -1374.02 0 0 0 -1747.57 2303.77 0 0 -486.236 2451.02 1149.56 2213.89 0 776.009 0 0 0 0 
0 0 0 1444.06 0 0 0 1402.86 0 0.06 -184.713 1202.2 0 0 1384.09 0 0 0 0 1260.64 0 0 0 0 0 0 0 0 0 0 0 0 0 0 0 0 2232.96 0 -821.482 0 0 507.752 0 0 0 0 0 0 1090.96 0 0 0 -1030.38 0 0 0 -1300.78 283.441 0 0 0 0 -804.697 1780.83 0 
0 0 -1890.09 0 0 -441.984 0 0 0 1927.78 0.06 0 -1935.71 0 1387.14 -89.4955 0 0 0 0 787.149 0 0 117.878 0 0 0 0 0 1498.54 2268.52 1601.99 0 0 542.39 0 95.294 252.007 0 0 1268.73 0 0 0 0 0 -744.88 0 0 0 -2030.32 0 -2025.28 0 0 0 0 0 1802.5 0 0 0 0 0 0 
0 0 0 0 0 0 0 0 0 99.1089 0 0.08 0 0 0 0 0 0 0 -2180.32 0 0 1308.56 0 0 -1339.99 0 1161.46 577.487 0 0 0 0 1864.6 0 0 0 -1209.07 0 0 0 0 0 0 0 0 975.753 0 0 0 -1589.33 -421.842 0 0 -120.014 0 1893.9 0 0 0 0 2170.09 0 0 0 
0 0 1133.08 -1440.86 705.817 0 2357.02 0 0 0 2030.17 0 0.04 0 0 2341.61 0 2077.93 2270.04 0 -2126.91 0 -92.8526 0 0 0 0 0 0 -154.347 1120.26 0 0 0 0 0 558.107 0 0 0 0 0 0 0 0 0 1366.08 0 0 2149.65 0 -2375.94 0 0 1931.14 0 0 -218.284 0 -988.113 -1724.98 0 0 0 0 
0 172.658 0 0 -973.617 0 0 -381.1 0 0 0 0 0 0.09 0 0 0 2277.06 0 0 0 0 0 13.657 0 0 0 0 0 2338.56 0 0 0 0 0 0 0 106.586 0 0 0 155.568 0 0 -2168.42 0 0 0 0 0 0 0 0 0 0 0 -2127.52 0 1368.53 1319.54 0 0 0 0 0 
138.325 0 311.67 0 0 0 1813.64 0 0 1657.38 438.322 0 0 0 0.04 0 -136.647 0 2192.98 0 0 0 0 0 0 0 0 216.605 0 0 0 0 -407.346 0 -2192.68 0 0 -2202.75 0 0 0 0 0 0 0 555.055 0 1988.36 0 0 2150.11 0 0 0 0 0 1437.19 0 721.076 0 0 0 0 0 371.639 
0 515.992 1159.32 0 -539.338 -240.715 696.051 0 0 0 -2122.03 0 1586.58 0 0 0.01 1128.35 -73.9311 777.23 -1326.41 0 0 0 0 0 0 0 0 0 0 1124.38 0 0 0 0 0 0 -257.195 0 0 0 1733.68 0 -559.938 0 2200.31 0 1838.82 0 0 0 0 0 0 0 0 -1594.21 0 0 0 0 0 0 -667.974 0 
860.393 0 -161.977 0 1214.56 0 0 333.796 1159.32 0 0 0 0 0 -2014.6 481.048 0.05 0 1508.91 0 0 0 0 0 0 734.962 0 0 0 0 0 0 0 0 -1583.99 0 0 0 0 0 0 -2126.3 0 0 1868.72 0 0 0 0 74.0837 294.733 0 0 0 0 0 0 1005.66 0 0 0 0 0 0 0 
0 0 1636.02 0 0 0 0 0 1337.7 0 0 0 434.507 -709.021 0 121.235 0 0.06 1518.22 0 0 0 0 0 0 2002.24 0 0 0 0 0 0 0 0 0 0 1488.31 0 0 0 0 0 0 0 0 0 -1043.81 0 0 0 0 0 0 1109.12 0 0 -555.208 420.927 -1236.08 0 0 0 0 0 0 
0 -347.377 0 0 0 0 0 0 -1033.59 0 0 0 -442.442 0 1110.34 -337.764 1910.69 -765.481 0.09 0 0 0 0 0 0 0 0 859.783 0 0 0 0 0 0 0 0 2440.03 0 0 0 -1264 0 -1248.28 -1567.96 0 0 0 0 926.923 0 248.344 0 -2215.72 0 0 0 0 -425.047 2480.47 1052.51 0 0 0 0 0 
0 0 0 0 0 0 0 0 0 1404.54 0 -121.54 0 0 0 1155.96 0 0 0 0.03 -934.706 0 -1513.79 0 0 1546.45 0 -1955.4 0 0 1787.55 151.906 0 0 1520.51 -1701.33 0 0 0 -1275.14 0 1560.95 0 0 0 0 93.0052 0 0 0 1341.82 2134.85 0 0 0 -275.964 1513.34 0 0 0 0 0 0 0 0 
0 2318.11 0 0 0 0 1142.54 637.913 0 0 -245.75 0 714.362 0 0 0 0 0 0 2406 0.05 1826.46 0 0 2019.79 0 1491.06 0 0 0 -829.264 -1885.05 0 0 0 0 -840.403 0 0 0 -476.165 0 0 0 0 -65.6911 -1725.44 0 1613.9 0 0 0 0 0 0 0 0 0 0 0 0 0 1665.93 0 0 
0 1404.84 0 0 0 764.107 1493.96 0 0 0 0 0 0 0 0 0 0 0 0 0 2254.02 0.03 1302 0 2034.44 0 1377.22 0 0 0 0 -567.568 2144.92 0 0 1654.33 0 979.72 0 0 0 272.607 0 -989.792 0 0 0 0 200.278 0 1162.98 -2214.65 2357.78 0 0 0 0 0 0 0 0 0 -590.304 0 0 
0 0 -104.907 0 2484.44 -2461.39 0 0 0 0 0 1984.08 1007.34 0 0 0 0 0 0 -395.596 0 210.196 0.04 0 0 0 0 0 2425.84 0 0 1365.47 0 0 0 1091.88 -263.909 0 0 0 0 0 0 1148.95 0 0 0 0 0 0 -1642.12 0 0 0 0 0 -1119.95 1238.21 0 0 0 0 0 0 0 
-796.304 0 0 0 879.62 0 0 0 0 0 457.701 0 0 1571.93 0 0 0 0 0 0 0 0 0 0.01 0 0 1598.33 0 0 0 0 0 0 0 0 0 0 0 0 0 0 374.996 737.251 0 -1356.93 0 0 0 0 0 -1867.96 0 0 0 0 1310.08 0 0 1304.74 0 0 0 0 0 0 
199.82 1193.35 0 0 0 -1766.34 0 0 0 0 0 0 0 0 0 0 0 0 0 0 31.9681 1906.26 0 0 0.03 1287.65 0 0 0 1954.94 0 0 0 -439.543 0 0 491.424 0 0 1779.76 0 0 0 -953.627 0 0 0 0 2070.15 0 0 -123.218 0 0 1005.81 0 0 0 0 288.934 0 0 0 0 0 
-336.085 0 -2465.67 0 0 0 0 0 0 0 0 -1349.45 0 0 0 0 2276.76 -1989.43 0 94.0733 0 0 0 0 1724.68 0.04 0 0 255.211 0 -1905.65 0 0 0 0 0 0 1526.46 0 1797.62 0 -531.404 0 0 0 915.784 1688.21 0 0 0 -1239.13 2478.18 0 0 394.223 0 0 2499.08 0 0 2184.44 0 0 0 0 
0 2211.14 0 0 0 0 610.599 0 0 0 0 0 0 0 0 0 0 0 0 0 2284.84 -1186.79 0 -921.278 0 0 0.05 0 0 -1035.11 0 2075.33 0 0 0 0 0 0 1027.79 0 0 -1303.83 0 1927.78 0 0 -1197.93 0 0 0 0 -665.838 -356.227 838.42 0 0 0 0 0 0 74.9992 0 0 0 0 
0 1944.56 900.83 -127.796 1536.23 0 -427.335 -1146.66 0 0 0 658.361 0 0 419.706 0 0 0 -1521.12 678.503 0 0 0 0 0 0 0 0.02 0 0 0 1566.29 0 1220.36 0 0 0 2306.21 0 0 0 0 0 0 0 2325.89 -2084.95 2004.99 245.14 0 -885.571 -278.863 0 0 0 2356.26 0 0 0 0 0 0 0 -1499.45 0 
0 0 0 0 0 0 0 -1690.34 0 0 0 676.519 0 0 0 0 0 0 0 0 0 0 450.072 0 0 353.633 0 0 0.01 0 0 0 0 0 633.946 0 -1854.38 1636.17 0 0 0 0 0 0 0 0 0 0 979.72 0 0 0 0 0 1191.37 0 -1815.93 0 0 0 0 870.617 0 0 0 
0 0 0 0 0 0 0 1436.28 0 0 1025.8 0 1367 -2404.63 0 0 0 0 0 0 0 0 0 0 -580.538 0 -1054.19 0 0 0.09 0 0 0 0 0 -1246.6 0 2354.73 0 0 0 1392.18 0 0 2171.77 0 0 0 479.217 834.605 0 0 0 0 0 -2108.6 0 817.515 -2156.36 2024.22 0 0 0 -2158.19 0 
0 0 0 0 0 -2061.45 1871.01 0 -210.349 0 1907.18 0 1327.63 0 0 -1967.45 0 0 0 2441.56 -878.552 0 0 0 0 1123.92 0 0 0 0 0.09 -1639.99 0 630.436 -1867.66 1268.12 2171.77 0 -925.703 0 0 0 0 0 0 0 2184.29 1534.24 0 2423.4 0 2083.27 0 0 0 0 0 0 0 0 -1373.71 0 0 0 0 
0 1628.09 0 0 0 0 0 0 0 0 96.3622 0 0 0 0 0 0 0 0 922.346 -873.363 -2433.62 1845.84 0 0 0 833.079 151.143 0 0 73.6259 0.01 0 0 0 0 0 0 -863.598 0 0 0 0 873.211 1736.27 0 0 0 -754.646 0 0 0 0 0 0 2370.75 0 802.255 0 -205.313 886.792 0 0 747.475 2062.82 
0 0 864.36 -504.089 0 0 2374.26 0 0 0 0 0 0 0 2115.62 0 0 0 0 0 0 -165.487 0 0 0 0 0 0 0 0 0 0 0.06 0 0 0 0 0 0 -1793.5 0 450.072 0 0 -1000.47 1429.11 0 -373.012 0 0 0 2313.07 0 0 -775.552 1601.08 0 0 988.571 0 0 0 0 0 0 
0 0 0 0 0 2467.65 0 0 0 0 0 -646.611 0 0 0 0 0 0 0 0 0 0 0 0 1366.24 0 0 69.8111 0 0 -394.375 0 0 0.06 0 0 0 -1999.34 0 0 394.681 136.494 0 0 -612.125 0 828.806 0 0 0 1895.89 0 0 0 0 0 0 0 0 1790.14 0 0 0 0 0 
0 0 2424.77 348.14 0 0 0 0 0 0 1740.24 0 0 0 1571.02 0 -393.46 0 0 -1009.02 0 0 0 0 0 0 0 0 -2417.29 0 1972.03 0 0 0 0.06 2010.94 0 0 0 -609.684 0 -1791.36 2021.47 -952.712 0 0 0 -749.611 0 0 -2393.03 0 -362.789 0 1226.62 -1802.5 0 0 0 0 0 0 0 0 0 
0 1849.65 588.778 0 0 0 0 0 0 0 0 0 0 0 0 0 0 0 0 478.149 0 -1311.46 -476.165 0 0 0 0 0 0 -2085.41 -529.115 0 0 0 1062.73 0.09 0 0 0 0 1134.91 0 0 -743.049 0 0 0 2274.77 0 0 0 0 494.476 0 0 1415.52 1144.22 0 0 0 0 0 0 0 0 
0 2408.29 283.746 0 0 0 0 0 0 472.503 1377.07 0 -1310.54 0 0 0 0 1542.33 -2125.54 0 -251.091 0 1289.48 0 -1517.91 0 0 0 1435.06 0 1870.4 0 0 0 0 0 0 0 0 0 -940.962 0 0 0 0 0 0 0 0 0 0 -42.9548 0 0 0 0 0 0 0 0 0 0 0 0 0 
0 0 0 0 0 0 0 0 0 0 103.229 2241.81 0 -919.141 -1277.28 1334.19 0 0 0 0 0 -2239.83 0 0 0 1670.05 0 1537.75 1991.1 -134.816 0 0 0 -701.544 0 0 0 0.02 0 733.589 0 0 0 1316.95 374.386 -820.719 -989.639 0 0 0 0 0 0 0 0 0 -1096.91 0 0 2284.84 0 0 0 0 0 
0 0 688.421 0 1674.78 0 1897.56 0 0 -2289.12 0 0 0 0 0 0 0 0 0 0 0 0 0 0 0 0 -897.931 0 0 0 2472.53 2023.76 0 0 0 0 0 0 0.01 0 0 0 0 0 0 0 -2207.79 0 0 0 0 29.0689 0 -2284.39 0 0 0 0 0 -1862.93 0 0 0 0 0 
0 221.641 0 0 0 1745.28 0 0 0 0 0 0 0 0 0 0 0 0 0 112.384 0 0 0 0 -1800.36 1439.48 0 0 0 0 0 0 895.337 0 402.463 0 0 -1416.75 0 0.03 0 0 0 0 2004.68 0 0 0 0 0 0 438.932 0 -1959.82 0 -2270.5 1908.25 0 0 1373.1 0 0 669.652 0 0 
0 -137.257 -1837.9 0 0 0 -441.679 0 418.638 0 1043.35 0 0 0 0 0 0 0 1665.17 0 2125.84 0 0 0 0 0 0 0 0 0 0 0 0 1786.02 0 2165.97 -404.599 0 0 0 0.03 0 0 0 0 0 0 0 0 0 0 0 -1793.19 0 0 -1387.91 0 0 0 0 0 0 0 0 -1367.61 
0 36.2407 0 0 0 0 0 300.226 0 -2120.04 0 0 0 -1121.02 0 -1686.22 -1380.12 0 0 1326.41 0 582.217 0 -1472.9 0 1601.84 1937.7 0 0 152.516 0 0 2347.71 1379.06 1052.35 0 0 0 0 0 0 0.01 -590.762 1061.2 1982.56 0 0 0 2271.11 0 0 0 0 0 0 0 0 0 0 0 0 0 0 0 0 
0 0 -467.772 0 0 0 -2351.68 0 0 0 0 0 0 0 0 0 0 0 1330.23 0 0 0 0 150.99 0 0 0 0 0 0 0 0 0 0 924.635 0 0 0 0 0 0 2145.68 0.02 0 0 -567.721 0 0 0 0 0 482.116 0 0 0 0 0 0 0 0 1268.88 2202.44 0 0 0 
-1091.27 0 0 0 0 965.072 -1309.32 0 0 0 0 0 0 0 0 474.639 0 0 852.916 0 0 778.909 878.704 0 -128.407 0 -2258.6 0 0 0 0 1659.37 0 0 -1395.54 358.364 0 1166.19 0 0 0 460.753 0 0.09 0 0 1594.06 -2280.42 0 -1052.05 0 0 1223.41 964.156 0 1962.87 0 492.34 0 0 0 828.501 0 0 0 
0 0 -933.638 0 0 0 0 0 2242.58 0 0 0 0 412.534 0 0 2002.85 0 0 0 0 0 0 -202.261 0 0 0 0 0 2461.39 0 1318.32 1341.21 2057.02 0 0 0 1891 0 -87.2066 0 262.23 0 0 0.07 0 0 0 -1574.37 0 0 2374.72 -2266.84 -1239.59 0 0 0 2059.16 -1136.59 0 0 0 0 0 0 
0 0 0 0 0 0 0 0 0 0 0 0 0 0 2360.23 2053.97 0 0 0 0 -1201.28 0 0 0 0 -1945.63 0 -2210.84 0 0 0 0 1600.31 0 0 0 0 2370.14 0 0 0 0 1347.01 0 0 0.08 0 0 0 -2319.03 2260.89 0 0 0 0 0 0 0 0 0 0 0 0 0 0 
0 0 0 2396.85 0 0 0 0 0 0 -1458.4 1467.71 -233.085 0 0 0 0 511.719 0 1451.69 44.7859 0 0 0 0 1872.54 237.663 1441.62 0 0 1089.43 0 0 -2286.68 0 0 0 2139.42 949.202 0 0 0 0 -1931.75 0 0 0.02 0 -855.815 880.535 0 0 2488.4 0 0 0 0 0 0 0 0 0 0 0 -311.67 
-524.689 0 0 193.716 0 1053.58 0 0 -443.968 0 0 0 0 0 1272.55 -1130.94 0 0 0 0 0 0 0 0 0 0 0 2317.04 0 0 2402.19 0 1718.88 0 1125.6 -1852.7 0 0 0 0 0 0 0 -13.1993 0 0 0 0.05 0 0 0 0 -1546.14 0 0 0 0 0 0 0 -2066.03 1710.64 0 0 0 
0 0 0 0 -1281.09 2142.63 0 0 0 -739.54 0 0 0 0 0 0 0 0 687.353 0 -1844.31 -1427.88 0 0 798.898 0 0 -1390.04 1631.44 922.193 0 2435.3 0 0 0 0 0 0 0 0 0 1994.16 0 0 402.005 0 953.78 0 0.02 1933.27 0 -221.03 0 0 0 -1506.93 0 0 0 0 0 0 -2416.84 0 0 
2258.9 2018.72 0 0 0 0 0 0 0 0 0 0 2237.08 0 0 0 1179.46 0 0 0 0 0 0 0 0 0 0 0 0 -728.706 168.996 0 0 0 0 0 0 0 0 0 0 0 0 837.046 0 -414.518 1277.73 0 1752.3 0.04 0 2369.08 1614.96 0 0 0 0 -121.387 0 0 0 0 0 0 0 
0 0 -1803.11 0 0 74.2363 0 0 0 0 2043.9 -828.806 0 0 1876.51 0 981.399 0 2063.28 2475.13 0 -99.1089 -1370.66 -3.28074 0 2282.86 0 1695.99 0 0 0 0 0 -1685.61 -1103.17 0 0 0 0 0 0 0 0 0 0 1505.1 0 0 0 0 0.05 0 0 0 0 0 -938.978 -669.958 0 0 0 1195.18 0 0 0 
0 0 0 2097 111.316 2049.7 0 0 669.5 0 0 -910.596 -1158.71 0 0 0 0 0 0 313.044 0 966.292 0 0 -2269.59 -1002.76 838.572 -2358.24 0 0 -1629.46 0 -1303.22 0 0 0 1559.72 0 928.449 -222.404 0 0 1941.82 0 1567.35 0 0 0 70.1163 986.129 0 0.06 0 0 537.812 -1095.23 0 1836.38 0 0 0 42.8022 0 0 0 
0 -1365.17 0 1508.45 0 0 299.921 0 -1790.29 2334.44 -770.516 0 0 0 0 0 0 0 996.658 0 0 -451.445 0 0 0 0 1852.09 0 0 0 0 0 0 0 -1884.44 822.398 0 0 0 0 338.527 0 0 1782.66 909.986 0 -1093.86 2335.81 0 1968.98 0 0 0.07 0 1470.31 0 0 -2067.55 0 2101.58 -2494.05 -1430.78 0 0 0 
0 -565.889 2100.82 -403.378 0 0 0 0 0 0 0 0 0 0 0 0 0 769.906 0 0 0 0 0 0 0 0 -203.94 0 0 0 0 0 0 0 0 0 0 0 -1451.38 417.875 0 0 0 924.329 -1551.79 0 0 0 0 0 0 0 0 0.08 0 -915.784 0 0 0 0 0 0 0 2104.18 0 
0 0 0 0 -1564.15 0 0 -822.092 0 0 0 -2244.71 2116.99 0 0 0 0 0 0 0 0 0 0 0 545.289 1187.4 0 0 -423.215 0 0 0 2321.77 0 2265.77 0 0 0 0 0 0 0 0 0 0 0 0 0 0 0 0 -2464.14 1752.75 0 0.04 0 0 0 0 0 0 0 0 0 0 
0 -1835 0 0 0 0 0 0 1275.29 0 0 0 0 0 0 0 0 0 0 -1030.38 0 0 0 2013.38 0 0 0 -477.844 0 -800.729 0 1170.31 -2192.37 0 -416.349 2124.01 0 0 0 2053.06 1485.11 0 0 821.787 0 0 0 0 -1012.83 0 0 374.538 0 -871.532 0 0.09 0 0 0 -1464.35 0 0 0 0 0 
0 0 0 -1397.67 -438.627 239.647 0 0 1151.23 350.124 0 1303.98 0 1833.63 2116.23 1717.51 0 -616.855 0 -2158.5 0 0 1314.97 0 0 0 0 0 706.427 0 0 0 0 0 0 -1845.99 0 -2416.99 0 1622.44 0 0 0 0 0 0 0 0 0 0 -200.125 0 0 0 0 0 0.09 0 2148.43 42.3444 -1428.04 1238.36 0 0 0 
0 -8.01111 0 1977.98 0 630.284 0 -2135 1011.61 -320.673 0 0 2116.69 0 0 0 2295.22 687.964 -588.015 0 0 0 -2013.69 0 0 -2042.07 0 0 0 1606.27 0 -943.403 0 0 0 0 0 0 0 0 0 0 0 2384.79 -900.067 0 0 0 0 2307.89 -1507.39 1778.24 -1792.58 0 0 0 0 0.07 0 -1110.03 786.691 0 0 1166.04 0 
0 -403.073 0 -130.848 0 0 0 0 347.682 0 -450.835 0 0 975.448 338.374 0 0 1605.2 492.645 0 0 0 0 2185.05 0 0 0 0 0 -636.998 0 0 -230.491 0 0 0 0 0 0 0 0 0 0 0 -664.464 0 0 0 0 0 0 0 0 0 0 0 932.875 0 0.05 -933.027 0 0 0 0 0 
0 0 0 0 0 0 0 0 0 0 0 0 -434.202 -270.775 0 0 0 0 1961.04 0 0 0 0 0 -159.383 0 0 0 0 -698.187 0 839.183 0 1300.01 0 0 0 755.409 -1307.18 -1013.44 0 0 0 0 0 0 0 0 0 0 0 0 2485.81 0 0 -584.201 1612.83 555.513 1661.05 0.05 0 0 0 0 0 
0 0 0 -298.395 0 0 0 0 -571.841 0 0 0 -2073.81 0 0 0 0 0 0 0 0 0 0 0 0 2372.74 -466.704 0 0 0 1950.06 -819.651 0 0 0 0 0 0 0 0 0 0 1672.03 0 0 0 0 126.881 0 0 0 0 12.4363 0 0 0 2467.8 117.115 0 0 0.07 -657.292 0 0 0 
0 0 0 0 2353.21 -1070.67 0 -2097.92 0 0 0 1623.05 0 0 0 0 0 0 0 0 0 0 0 0 0 0 0 0 -1514.1 0 0 0 0 0 0 0 0 0 0 0 0 0 -2042.83 2036.88 0 0 0 1296.35 0 0 -539.491 1130.63 -230.033 0 0 0 111.621 0 0 0 2322.23 0.02 0 0 1793.19 
0 0 0 0 1057.85 0 0 2164.75 0 1965.62 0 0 0 0 0 0 0 0 0 0 -1743.45 1470.31 0 0 0 0 0 0 0 0 0 0 0 0 0 0 0 0 0 -2097.31 0 0 0 0 0 0 0 0 -2053.51 0 0 0 0 0 0 0 0 0 0 0 0 0 0.09 0 1575.44 
0 0 0 0 1534.55 0 0 0 0 2372.89 0 0 0 0 0 423.368 0 0 0 0 0 0 0 0 0 0 0 -1157.19 0 1817 0 -839.335 0 0 0 0 0 0 0 0 0 0 0 0 0 0 0 0 0 0 0 0 0 1338.77 0 0 0 -1650.98 0 0 0 0 0 0.04 0 
0 0 0 -1409.12 0 0 0 1964.25 0 0 0 0 0 0 248.955 0 0 0 0 0 0 0 0 0 0 0 0 0 0 0 0 2112.57 0 0 0 0 0 0 0 0 -1877.88 0 0 0 0 0 1481.75 0 0 0 0 0 0 0 0 0 0 0 0 0 0 -798.135 1675.24 0 0.08 
