*Vertices 69
*Matrix 
0.08 0 0 0 0 0 2413.02 0 -2200.92 1125.45 0 0 0 0 0 0 0 0 0 0 0 0 0 0 0 0 0 0 0 0 0 0 0 0 0 0 668.126 0 0 0 0 0 0 0 0 0 0 0 0 0 0 0 0 0 0 0 1300.93 573.672 0 0 0 0 0 0 0 0 0 0 0 
0 0.05 0 1657.23 -768.838 0 0 0 0 -245.598 0 0 0 0 0 0 -631.047 0 0 0 0 0 0 0 0 0 0 -1055.71 0 0 -649.968 0 1328.85 0 0 0 0 0 0 0 0 0 0 0 0 0 0 0 0 187.155 0 0 0 0 0 0 0 0 0 0 0 0 0 0 0 0 0 0 0 
0 0 0.03 0 0 0 0 1050.83 0 0 0 -116.352 0 0 0 0 0 0 0 0 0 268.639 2156.67 0 0 0 0 0 0 0 0 0 0 0 0 0 0 0 0 0 0 0 0 0 0 0 0 0 971.786 72.7104 0 -674.688 0 0 0 0 0 0 821.024 0 -764.412 0 -619.449 0 0 0 0 0 0 
0 2370.3 0 0 0 0 0 -692.694 0 0 0 0 0 0 1232.11 0 852.763 0 0 0 0 0 0 0 0 0 0 0 0 2458.49 0 0 0 0 0 0 0 0 0 0 0 0 0 0 0 0 109.18 0 0 0 -1121.48 0 0 -335.017 0 0 0 -1442.99 -2030.17 0 0 0 0 0 0 0 0 0 0 
0 -283.441 0 0 0.09 916.089 0 0 0 0 0 0 0 -1258.96 0 0 0 0 2209.31 0 0 0 0 904.797 0 0 0 0 0 0 0 0 0 0 0 0 0 0 0 527.894 0 0 0 0 0 0 0 0 711.463 -502.411 0 1561.86 0 0 0 0 0 0 0 0 0 0 0 0 0 0 0 0 0 
0 0 0 0 757.851 0.04 0 0 0 0 0 0 0 0 0 0 0 0 960.799 0 0 0 0 0 0 1252.25 0 0 0 0 0 -1977.07 0 0 0 0 0 2251.58 0 0 0 2374.26 0 0 0 0 0 0 0 0 0 0 0 0 0 0 0 -1167.71 0 0 0 0 0 0 0 0 0 0 0 
-898.083 0 0 0 0 0 0.08 0 0 0 -1628.54 0 2425.23 0 0 0 0 431.303 0 0 0 0 0 2453.15 1619.69 154.805 613.193 0 -1156.88 0 0 0 0 0 -1203.42 0 0 2404.93 1635.11 0 0 0 0 0 0 0 0 0 0 0 0 -205.313 0 0 0 0 0 1826.3 0 0 -561.769 0 0 0 0 0 0 0 0 
0 0 -2390.29 965.987 0 0 0 0.09 0 -720.466 0 -2151.78 0 0 0 1471.83 0 0 0 0 1672.95 0 0 0 0 -300.684 0 0 0 2474.36 0 0 0 0 0 0 0 0 0 1679.36 0 0 0 0 2356.11 0 0 0 0 0 -1553.93 0 0 0 0 0 0 -2215.41 0 0 0 0 0 0 0 0 0 0 0 
-1036.79 0 0 0 0 0 0 0 0.03 0 0 0 1528.75 0 0 0 0 0 0 0 0 -2336.27 0 0 0 0 0 0 0 0 0 0 0 0 -87.817 0 0 0 0 0 0 0 0 1594.97 0 0 0 0 1848.89 0 0 0 -2349.09 669.652 0 0 0 0 0 0 0 0 0 2233.88 0 0 0 0 0 
-794.32 1028.55 0 0 0 0 0 2474.97 0 0.04 848.643 0 -74.9992 0 0 0 0 2308.19 0 0 0 -2471.47 0 0 0 0 0 0 0 0 0 -1392.18 0 2034.29 0 0 0 0 0 0 0 0 0 0 0 0 0 0 0 0 -1545.38 0 0 0 707.495 0 0 230.338 0 0 -2099.29 0 0 0 0 1473.36 0 0 0 
0 0 0 0 0 0 -1311.61 0 0 -536.439 0.09 0 0 0 0 0 0 0 0 -1634.8 0 0 0 0 0 0 1283.99 0 -435.728 0 0 0 0 0 0 0 0 0 0 0 0 0 0 0 0 0 212.485 0 0 1666.23 0 0 0 0 -1135.36 0 1868.42 0 0 0 0 0 0 0 -356.075 0 0 0 0 
0 0 -1361.81 0 0 0 0 1408.2 0 0 0 0.07 0 0 641.423 0 0 0 0 0 0 0 0 2100.51 0 0 0 -834.147 0 0 0 0 0 0 0 -1908.55 0 0 2223.65 0 0 -2005.91 0 547.884 0 971.48 0 0 0 0 0 0 0 0 0 0 0 0 0 0 0 -8.01111 0 0 2122.33 0 -857.494 0 0 
0 0 0 0 0 0 2089.83 0 -214.927 36.3933 0 0 0.04 0 0 2070.15 0 0 0 0 0 0 0 0 0 0 2443.24 6.94296 0 0 0 0 0 -62.4866 0 0 0 1504.49 0 0 0 1608.1 0 0 0 0 0 0 0 0 0 0 0 0 0 0 0 0 0 0 0 0 0 1101.79 316.401 0 0 0 0 
0 0 0 0 -954.848 0 0 0 0 0 0 0 0 0.01 0 0 0 1287.5 1894.51 0 0 0 0 0 0 -2456.05 0 0 0 0 -36.5459 0 0 0 0 0 0 0 0 0 0 0 0 0 0 0 0 0 1411.71 0 -1425.75 0 0 0 0 0 0 0 0 795.083 0 0 0 0 0 0 0 0 0 
0 0 0 2239.68 0 0 0 0 0 0 0 2126.76 0 0 0.03 2155.29 0 0 0 0 0 0 0 0 2231.13 0 0 -1514.86 0 -1994.31 0 0 0 0 0 0 0 0 0 0 0 0 0 300.226 0 0 0 0 0 0 0 0 1812.11 0 0 0 0 0 0 0 0 2413.63 116.047 1060.44 0 0 38.8348 0 2340.39 
0 0 0 0 0 0 0 -397.58 0 0 0 0 -1976.15 0 701.239 0.06 0 0 0 0 531.556 0 0 1521.88 0 0 0 0 0 0 0 0 0 0 322.199 0 0 1266.75 0 0 1861.71 0 0 0 0 -840.709 0 0 0 0 0 0 0 -2087.24 2006.06 0 0 0 0 0 0 0 0 0 0 0 0 0 0 
0 -61.1133 0 2381.44 0 0 0 0 0 0 0 0 0 0 0 0 0.08 -252.464 0 1874.37 0 0 0 0 0 0 0 27.2378 -382.321 0 0 0 0 0 0 0 0 0 0 0 0 0 0 0 -985.214 0 0 0 0 0 0 0 0 0 0 0 1897.26 0 0 0 0 -77.8985 -1219.6 0 0 0 0 0 0 
0 0 0 0 0 0 1218.38 0 0 2208.09 0 0 0 616.855 0 0 1960.89 0.01 0 0 0 0 0 0 0 1088.21 0 0 0 -1375.09 0 0 0 0 1212.88 0 0 0 0 0 0 0 0 0 0 1102.4 0 0 0 0 1848.28 0 149.922 0 0 0 0 0 0 -2000.26 0 0 0 0 0 0 0 0 0 
0 0 0 0 -1417.51 812.479 0 0 0 0 0 0 0 721.839 0 0 0 0 0.02 1337.55 847.728 2277.83 0 0 0 0 203.33 0 0 0 0 0 0 0 1455.5 0 0 0 0 0 0 0 0 0 0 0 0 0 0 0 0 0 0 0 0 0 0 0 0 1213.34 0 0 -1251.64 0 0 0 0 0 0 
0 0 0 0 0 0 0 0 0 0 1789.68 0 0 0 0 0 2186.12 0 1523.41 0.03 0 0 0 0 2285.3 0 0 0 -961.257 0 0 0 0 0 0 0 0 0 0 0 0 0 1613.28 0 0 0 0 0 0 2436.83 -1213.95 0 0 0 -581.607 0 2418.82 0 0 -0.839259 0 0 0 0 0 0 0 0 -1064.56 
0 0 0 0 0 0 0 -161.672 0 0 0 0 0 0 0 -452.818 0 0 396.054 0 0.04 0 0 0 0 0 0 0 -613.193 0 2216.03 0 0 0 0 0 0 0 0 0 0 0 0 0 0 0 0 1051.74 0 -355.922 0 1541.87 0 0 -441.527 0 0 0 0 0 0 0 0 0 355.312 760.292 0 0 0 
0 0 -2384.79 0 0 0 0 0 1019.39 518.738 0 0 0 0 0 0 0 0 2223.5 0 0 0.01 2285.3 -2280.42 0 0 0 0 0 0 0 0 0 0 0 0 941.267 -828.501 0 0 806.375 0 0 0 0 0 0 387.967 0 0 0 0 0 -1143.45 0 0 0 0 0 0 2132.25 8.77407 1570.56 0 -210.654 -347.072 0 0 0 
0 0 1575.59 0 0 0 0 0 0 0 0 0 0 0 0 0 0 0 0 0 0 -2360.84 0.01 0 0 2026.35 0 0 0 -2081.74 0 162.435 0 0 0 0 0 0 0 0 0 -1103.78 0 0 0 0 -887.249 0 0 0 -1542.18 0 0 0 0 0 0 0 0 0 0 2139.88 0 0 2094.26 1088.06 0 0 0 
0 0 0 0 -2145.53 0 -2334.74 0 0 0 0 2404.17 0 0 0 -687.506 0 0 0 0 0 2039.17 0 0.09 0 2126.45 0 0 0 0 0 0 0 0 0 0 0 0 0 0 0 0 1543.4 0 0 0 0 0 0 0 0 0 0 0 0 -549.867 0 1106.98 0 0 0 0 0 0 0 -743.812 0 0 0 
0 0 0 0 0 0 -2379.45 0 0 0 0 0 0 0 2016.13 0 0 0 0 1157.95 0 0 0 0 0.09 0 0 0 -1695.84 0 0 0 0 0 0 0 0 0 0 1131.7 0 0 0 0 0 0 0 0 0 0 0 0 0 0 0 0 0 0 0 0 0 0 0 0 0 0 0 2039.63 0 
0 0 0 0 0 -877.026 2053.21 1710.79 0 0 0 0 0 -2090.9 0 0 0 1772.29 0 0 0 0 -477.538 -1179.77 0 0 0 0 0 0 0 0 0 0 0 0 0 2141.1 0 0 0 0 0 0 0 0 0 0 0 0 0 0 594.119 1330.99 0 0 0 0 0 0 0 0 1216.09 0 -2398.07 0 2281.03 0 0 
0 0 0 0 0 0 -1077.68 0 0 0 528.047 0 1862.01 0 0 0 0 0 -2021.01 0 0 0 0 0 0 0 0 630.284 1738.11 -997.726 0 1909.62 0 0 0 0 1119.34 0 0 0 0 0 0 0 0 1247.52 2179.56 0 0 0 0 0 0 0 0 1612.52 0 0 0 0 0 0 0 0 0 0 0 0 0 
0 2269.13 0 0 0 0 0 0 0 0 0 -268.944 1390.5 0 1772.74 0 1457.49 0 0 0 0 0 0 0 0 0 -1350.83 0.06 0 0 0 0 0 0 0 0 0 0 0 0 0 0 0 0 0 0 0 0 0 -1681.34 0 0 0 0 0 0 0 0 0 0 0 0 0 0 453.124 0 0 0 0 
0 0 0 0 0 0 -1214.71 0 0 0 -1566.44 0 0 0 0 0 -1712.16 0 0 1783.73 -285.119 0 0 0 -1157.8 0 745.491 0 0.07 0 0 0 -1663.64 0 0 0 0 0 -272.912 1619.54 0 0 0 0 0 0 0 0 0 0 0 0 0 985.366 591.22 0 0 0 0 0 0 0 0 317.011 0 0 2367.09 0 0 
0 0 0 1576.66 0 0 0 -916.7 0 0 0 0 0 0 -2323.6 0 0 1111.41 0 0 0 0 1135.52 0 0 0 -1948.68 0 0 0 0 0 0 0 0 0 0 0 0 0 0 0 1423.46 0 0 0 0 0 0 2459.26 516.449 0 0 0 0 0 0 0 0 0 0 0 0 0 0 0 0 -2471.77 0 
0 -2056.87 0 0 0 0 0 0 0 0 0 0 0 -1045.64 0 0 0 0 0 0 -1468.47 0 0 0 0 0 0 0 0 0 0.01 0 1759.62 0 0 0 0 0 0 0 0 0 0 0 528.047 0 0 0 0 0 0 0 0 1342.28 0 -1526.76 396.512 0 0 2386.01 0 0 0 0 0 0 260.399 0 0 
0 0 0 0 0 -1946.85 0 0 0 -1961.65 0 0 0 0 0 0 0 0 0 0 0 0 -1106.68 0 0 0 1639.38 0 0 0 0 0.01 0 0 0 1327.02 0 0 0 0 1734.9 0 0 0 0 0 0 0 0 0 0 0 0 0 0 0 714.82 0 -428.709 0 0 0 0 0 0 809.732 0 0 0 
0 -2441.86 0 0 0 0 0 0 0 0 0 0 0 0 0 0 0 0 0 0 0 0 0 0 0 0 0 0 -929.823 0 2288.05 0 0.05 22.9652 -1843.09 0 0 0 0 0 0 2477.87 0 0 0 0 0 986.282 0 0 0 0 0 0 0 0 0 904.797 2348.63 0 0 0 0 0 0 -35.6304 0 0 0 
0 0 0 0 0 0 0 0 0 -135.426 0 0 270.165 0 0 0 0 0 0 0 0 0 0 0 0 0 0 0 0 0 0 0 767.769 0.07 0 0 0 0 0 2037.95 0 0 0 0 0 2399.75 0 0 0 0 0 0 0 0 0 0 0 0 0 0 0 0 0 0 0 1833.17 -453.887 0 0 
0 0 0 0 0 0 -1107.59 0 1668.68 0 0 0 0 0 0 2441.56 0 -158.467 -2185.81 0 0 0 0 0 0 0 0 0 0 0 0 0 810.8 0 0.08 0 0 0 0 0 0 0 0 0 0 0 0 0 0 0 0 1873.61 0 0 0 0 1434.75 1692.18 0 0 0 -2208.24 0 0 0 -109.485 0 0 0 
0 0 0 0 0 0 0 0 0 0 0 -2169.64 0 0 0 0 0 0 0 0 0 0 0 0 0 0 0 0 0 0 0 2469.33 0 0 0 0.02 1542.33 669.805 0 0 0 0 1243.25 -777.383 0 0 0 0 -2415.77 0 1364.56 74.9992 0 0 0 0 0 0 1589.79 0 1088.52 0 2151.33 0 0 0 0 0 0 
-378.811 0 0 0 0 0 0 0 0 0 0 0 0 0 0 0 0 0 0 0 0 1298.03 0 0 0 0 -2277.67 0 0 0 0 0 0 0 0 921.888 0.04 0 0 0 0 0 0 0 0 520.569 0 0 0 -555.971 0 0 0 228.813 1967.3 -1442.69 0 2110.58 0 0 0 0 0 0 0 0 0 0 0 
0 0 0 0 0 1996.44 -749.763 0 0 0 0 0 413.449 0 0 803.629 0 0 0 0 0 -1434.9 0 0 0 -1450.62 0 0 0 0 0 0 0 0 0 1761.45 0 0.01 2084.34 0 0 0 0 0 0 -1238.21 0 -1429.56 0 0 0 0 0 0 0 0 0 0 0 1416.44 0 1247.67 0 0 0 0 0 0 0 
0 0 0 0 0 0 -2466.73 0 0 0 0 1216.54 0 0 0 0 0 0 0 0 0 0 0 0 0 0 0 0 -269.86 0 0 0 0 0 0 0 0 2366.02 0.01 0 0 0 -786.691 0 0 0 0 0 0 0 0 0 0 0 0 0 1665.93 0 -1236.53 0 2453.46 0 0 0 0 0 1700.57 0 0 
0 0 0 0 -1777.93 0 0 2072.74 0 0 0 0 0 0 0 0 0 0 0 0 0 0 0 0 73.0155 0 0 0 -305.567 0 0 0 0 246.818 0 0 0 0 0 0.02 -1515.63 0 0 0 0 0 0 0 0 0 0 0 0 1723.76 0 0 0 0 0 0 0 1832.56 0 -629.521 0 0 0 0 0 
0 0 0 0 0 0 0 0 0 0 0 0 0 0 0 306.482 0 0 0 0 0 1004.29 0 0 0 0 0 0 0 0 0 -1819.9 0 0 0 0 0 0 0 -1465.73 0 0 0 2496.49 0 0 0 0 0 0 0 0 0 0 0 0 0 2145.38 0 484.863 0 0 1657.08 0 0 0 0 0 0 
0 0 0 0 0 -917.31 0 0 0 0 0 -598.086 2297.66 0 0 0 0 0 0 0 0 0 -36.5459 0 0 0 0 0 0 0 0 0 346.156 0 0 0 0 0 0 0 0 0.04 0 0 0 0 0 0 -1861.86 0 0 0 -952.101 0 1221.12 -889.233 0 754.799 0 0 0 0 0 0 0 1559.42 0 0 0 
0 0 0 0 0 0 0 0 0 0 0 0 0 0 0 0 0 0 0 109.333 0 0 0 -863.14 0 0 0 0 0 67.0644 0 0 0 0 0 1782.51 0 0 1598.48 0 0 0 0.01 0 0 789.743 0 0 0 0 0 0 0 0 0 0 0 -31.0526 0 0 0 0 0 0 0 0 0 0 0 
0 0 0 0 0 0 0 0 -913.495 0 0 1848.73 0 0 1608.55 0 0 0 0 0 0 0 0 0 0 0 0 0 0 0 0 0 0 0 0 -1163.75 0 0 0 0 1017.87 0 0 0.03 0 0 0 0 0 0 0 0 0 178.457 0 0 0 0 0 0 0 0 0 0 0 0 0 0 0 
0 0 0 0 0 0 0 1195.33 0 0 0 0 0 0 0 0 841.472 0 0 0 0 0 0 0 0 0 0 0 0 0 2228.23 0 0 0 0 0 0 0 0 0 0 0 0 0 0.02 2349.7 0 0 0 0 -783.639 0 -334.864 0 0 0 0 2470.24 0 0 0 0 0 0 2285 0 0 0 0 
0 0 0 0 0 0 0 0 0 0 0 1917.4 0 0 0 1077.23 0 -1452.6 0 0 0 0 0 0 0 0 979.11 0 0 0 0 0 0 937.3 0 0 2465.21 1872.54 0 0 0 0 -1324.73 0 -325.404 0.08 0 0 -319.452 0 0 0 0 0 0 0 914.869 -1065.78 0 0 0 0 0 0 0 0 0 0 0 
0 0 0 -1662.72 0 0 0 0 0 0 -1626.41 0 0 0 0 0 0 0 0 0 0 0 2420.65 0 0 0 2468.11 0 0 0 0 0 0 0 0 0 0 0 0 0 0 0 0 0 0 0 0.01 0 0 0 0 0 0 -2229 0 446.867 -1381.8 0 0 0 0 1368.98 0 0 -780.129 0 0 0 0 
0 0 0 0 0 0 0 0 0 0 0 0 0 0 0 0 0 0 0 0 319.147 -1285.97 0 0 0 0 0 0 0 0 0 0 1858.5 0 0 0 0 1773.51 0 0 0 0 0 0 0 0 0 0.08 0 0 0 -1484.19 0 0 0 0 -1354.64 0 0 0 0 0 0 1803.72 0 0 0 0 0 
0 0 -1137.5 0 685.522 0 0 0 41.1237 0 0 0 0 398.648 0 0 0 0 0 0 0 0 0 0 0 0 0 0 0 0 0 0 0 0 0 2299.04 0 0 0 0 0 241.935 0 0 0 2257.99 0 0 0.05 0 0 -2035.05 0 0 0 0 0 0 0 1238.52 0 0 0 0 0 0 0 0 0 
0 724.281 -56.3829 0 -157.552 0 0 0 0 0 -1615.73 0 0 0 0 0 0 0 0 -985.672 -350.581 0 0 0 0 0 0 2373.5 0 508.667 0 0 0 0 0 0 401.242 0 0 0 0 0 0 0 0 0 0 0 0 0 0 0 0 0 0 0 0 0 0 0 0 952.406 0 0 0 0 0 0 0 
0 0 0 -907.849 0 0 0 1764.81 0 2223.04 0 0 0 1213.64 0 0 0 -493.255 0 -2067.09 0 0 1923.05 0 0 0 0 0 0 -1935.87 0 0 0 0 0 -804.697 0 0 0 0 0 0 0 0 1800.82 0 0 0 0 0 0.07 78.9666 0 0 0 0 0 0 245.903 0 0 0 0 2372.74 0 0 1217.92 0 0 
0 0 -978.5 0 -147.328 0 1088.98 0 0 0 0 0 0 0 0 0 0 0 0 0 1637.55 0 0 0 0 0 0 0 0 0 0 0 0 0 -86.2911 2358.7 0 0 0 0 0 0 0 0 0 0 0 914.869 -1086.84 0 2040.09 0.05 2431.49 0 -762.429 0 0 0 2447.05 0 0 0 0 0 0 0 0 0 0 
0 0 0 0 0 0 0 0 1448.48 0 0 0 0 0 1206.63 0 0 -2322.23 0 0 0 0 0 0 0 -718.024 0 0 0 0 0 0 0 0 0 0 0 0 0 0 0 775.246 0 0 2402.49 0 0 0 0 0 0 -1366.54 0.09 0 0 2442.78 0 0 0 0 0 -2097.61 0 0 0 1026.72 0 1218.22 0 
0 0 0 2083.73 0 0 0 0 2089.68 0 0 0 0 0 0 -1612.98 0 0 0 0 0 -1776.41 0 0 0 1179.31 0 0 -51.3474 0 640.66 0 0 0 0 0 1491.21 0 0 1181.75 0 0 0 -454.955 0 0 -351.344 0 0 0 0 0 0 0.03 0 0 0 -1208.46 0 0 0 0 0 0 0 0 0 0 0 
0 0 0 0 0 0 0 0 0 1758.71 795.389 0 0 0 0 1879.1 0 0 0 -1444.82 360.958 0 0 0 0 0 0 0 1160.7 0 0 0 0 0 0 0 68.2852 0 0 0 0 1096.76 0 0 0 0 0 0 0 0 0 531.098 0 0 0.04 0 0 91.0215 0 0 0 0 0 0 0 0 0 0 0 
0 0 0 0 0 0 0 0 0 0 0 0 0 0 0 0 0 0 0 0 0 0 0 -267.266 0 0 747.322 0 0 0 -60.8081 0 0 0 0 0 2362.36 0 0 0 0 754.494 0 0 0 0 -421.232 0 0 0 0 0 -593.661 0 0 0.05 0 0 0 0 0 0 0 1692.02 0 1267.05 0 0 0 
2063.74 0 0 0 0 0 0 0 0 0 433.897 0 0 0 0 0 213.401 0 0 2415.62 0 0 0 0 0 0 0 0 0 0 -1865.52 1326.87 0 0 1062.12 0 0 0 -1676.31 0 0 0 0 0 0 1646.55 551.851 312.433 0 0 0 0 0 0 0 0 0 0 0 -899.152 0 0 0 0 0 0 1826 -2364.19 0 
-1634.65 0 0 -54.0941 0 -440.153 2396.08 571.23 0 -688.269 0 0 0 0 0 0 0 0 0 0 0 0 0 1698.74 0 0 0 0 0 0 0 0 1689.28 0 -829.417 0 -2209.62 0 0 0 579.623 -282.22 1192.59 0 2170.71 -238.273 0 0 0 0 0 0 0 -1575.29 1792.12 0 0 0.05 0 0 0 0 0 0 0 0 0 0 0 
0 0 -1625.8 -490.661 0 0 0 0 0 0 0 0 0 0 0 0 0 0 0 0 0 0 0 0 0 0 0 0 0 0 0 -1225.7 2427.67 0 0 -974.38 0 0 1573.31 0 0 0 0 0 0 0 0 0 0 0 -2009.57 -101.856 0 0 0 0 0 0 0.06 0 0 0 0 0 2389.37 0 2102.95 0 0 
0 0 0 0 0 0 0 0 0 0 0 0 0 -561.769 0 0 0 2209.31 1690.8 2106.16 0 0 0 0 0 0 0 0 0 0 289.85 0 0 0 0 0 0 -1024.43 0 0 1106.07 0 0 0 0 0 0 0 2434.08 0 0 0 0 0 0 0 2050.61 0 0 0.07 0 0 0 0 0 0 0 0 0 
0 0 -1350.06 0 0 0 2234.34 0 0 952.712 0 0 0 0 0 0 0 0 0 0 0 -1873.45 0 0 0 0 0 0 0 0 0 0 0 0 0 2035.51 0 0 1837.14 0 0 0 0 0 0 0 0 0 0 0 0 0 0 0 0 0 0 0 0 0 0.09 0 0 0 0 0 -562.685 0 0 
0 0 0 0 0 0 0 0 0 0 0 -961.562 0 0 2172.99 0 -1510.13 0 0 0 0 1804.03 -1031.91 0 0 0 0 0 0 0 0 0 0 0 1062.88 0 0 893.811 0 2364.35 0 0 0 0 0 0 -687.353 0 0 1364.71 0 0 246.208 0 0 0 0 0 0 0 0 0.05 1783.12 1168.94 0 0 0 0 0 
0 0 547.731 0 0 0 0 0 0 0 0 0 0 0 1533.48 0 1495.79 0 1070.82 0 0 2352.29 0 0 0 57.7563 0 0 0 0 0 0 0 0 0 1518.07 0 0 0 0 1101.34 0 0 0 0 0 0 0 0 0 0 0 0 0 0 0 0 0 0 0 0 476.928 0.01 0 -291.986 2205.04 0 0 0 
0 0 0 0 0 0 0 0 -1724.52 0 0 0 989.486 0 1780.83 0 0 0 0 0 0 0 0 0 0 0 0 0 2238.76 0 0 0 0 0 0 0 0 0 0 -625.248 0 0 0 0 0 0 0 130.543 0 0 2112.87 0 0 0 0 1955.24 0 0 0 0 0 1408.96 0 0.01 0 0 0 0 0 
0 0 0 0 0 0 0 0 0 0 1326.26 -327.235 2135.76 0 0 0 0 0 0 0 -1329.16 25.4067 2024.52 0 0 -1367.46 0 1336.33 0 0 0 0 0 0 0 0 0 0 0 0 0 0 0 0 -217.978 0 1547.36 0 0 0 0 0 0 0 0 0 0 0 -1919.84 0 0 0 1943.19 0 0 0 2324.98 0 0 
0 0 0 0 0 0 0 0 0 2358.7 0 0 0 0 0 0 0 0 0 0 -574.129 295.801 185.934 -958.968 0 0 0 0 0 0 0 -1435.36 657.598 -1670.96 997.574 0 0 0 0 0 0 1903.67 0 0 0 0 0 0 0 0 0 0 -1424.83 0 0 1372.95 0 0 0 0 0 0 2495.42 0 0 0.06 0 0 0 
0 0 0 0 0 0 0 0 0 0 0 -1807.08 0 0 1932.36 0 0 0 0 0 0 0 0 0 0 1777.47 0 0 1916.33 0 -1222.8 0 0 683.233 0 0 0 0 1794.87 0 0 0 0 0 0 0 0 0 0 0 2005.45 0 0 0 0 0 1310.85 0 -1583.99 0 -228.05 0 0 0 -928.907 0 0.03 0 0 
0 0 0 0 0 0 0 0 0 0 0 0 0 0 0 0 0 0 0 0 0 0 0 0 688.269 0 0 0 0 1911.3 0 0 0 0 0 0 0 0 0 0 0 0 0 0 0 0 0 0 0 0 0 0 -1806.01 0 0 0 2152.39 0 0 0 0 0 0 0 0 0 0 0.02 0 
0 0 0 0 0 0 0 0 0 0 0 0 0 0 1406.22 0 0 0 0 -1435.06 0 0 0 0 0 0 0 0 0 0 0 0 0 0 0 0 0 0 0 0 0 0 0 0 0 0 0 0 0 0 0 0 0 0 0 0 0 0 0 0 0 0 0 0 0 0 0 0 0.04 
