*Vertices 63
*Matrix 
0.01 0 -1742.38 452.666 1219.9 0 0 1752.45 0 -1948.07 0 0 0 0 0 71.0318 0 1328.09 0 0 0 0 0 0 0 0 0 585.727 632.572 0 0 0 0 907.697 469.146 0 -1977.07 0 787.759 0 0 0 -45.0911 0 259.789 0 0 0 0 0 255.516 0 0 0 0 0 0 0 0 0 0 0 1403.16 
0 0.01 -451.445 0 -1077.99 0 0 -1333.43 0 0 0 0 0 0 0 0 -624.18 2237.39 0 349.971 0 0 0 0 0 0 0 0 0 0 1636.63 0 -924.329 0 0 0 2486.88 0 0 0 1225.85 -1719.95 0 0 0 -500.427 0 1806.01 0 190.512 0 -526.978 1647.77 0 0 0 0 0 0 0 0 427.793 0 
2032 -1507.23 0.07 0 2018.88 0 -2030.02 0 0 -594.577 0 0 0 0 550.783 -1726.36 0 -868.633 0 -1998.58 0 0 0 0 0 0 0 678.808 0 0 -914.258 0 0 0 2387.54 1927.63 0 0 0 0 0 -2232.66 2185.96 0 0 0 -778.603 0 1365.93 1197.93 -419.401 0 0 0 0 0 -535.371 0 0 0 0 0 0 
1939.68 0 0 0.02 0 2002.85 0 1265.83 345.241 2279.96 0 0 0 0 -789.895 -1261.56 0 0 0 0 0 1821.27 704.138 0 0 0 1673.86 0 0 0 0 0 0 0 0 1863.38 0 0 0 1855.14 0 0 0 0 0 0 0 -630.131 0 0 0 0 0 0 0 0 0 0 -1791.67 0 0 0 0 
-87.5118 1724.83 -1491.67 0 0.05 0 0 0 0 -1704.38 0 -504.242 2075.95 0 1287.8 64.9281 0 0 0 541.017 0 0 0 0 0 0 0 0 689.795 0 1700.26 1947 0 0 0 0 0 0 0 1549.2 0 1965.93 0 0 475.097 1389.13 0 0 0 -1225.24 -1902.75 0 0 0 0 0 0 0 0 0 0 0 0 
0 0 0 -357.753 0 0.04 0 0 2046.04 0 -1317.41 0 0 -2062.36 0 -582.98 0 0 815.989 0 0 0 0 0 2215.41 1330.99 0 0 0 0 0 1580.78 0 663.244 -2166.74 2313.07 0 -1095.84 1314.05 0 2093.19 889.691 0 0 0 0 0 0 0 0 794.626 0 0 0 0 0 0 0 -2237.54 -1690.65 0 317.621 0 
0 0 -1940.75 0 0 0 0.06 0 0 0 0 0 0 1591.62 0 0 0 0 0 -162.74 0 2279.66 0 0 563.753 0 0 0 0 0 26.3222 1588.26 0 1567.96 0 0 0 -891.675 0 0 0 0 0 -1483.89 0 0 0 0 1609.01 1332.67 0 0 0 0 0 0 0 0 0 0 0 0 -2441.56 
878.704 -1679.97 0 -616.245 0 0 0 0.04 1408.51 0 0 0 1424.99 548.952 0 0 0 0 0 0 0 0 0 0 -1898.79 0 0 0 0 0 0 1639.38 -1408.05 2018.72 0 -1709.72 0 0 0 0 1031.45 0 1065.02 0 2124.32 0 0 -728.248 363.247 -341.121 0 0 0 0 0 371.029 0 0 0 0 0 0 -933.79 
0 0 0 -2055.65 0 788.522 0 783.639 0 2238.61 0 0 0 0 506.684 1478.39 0 0 -1215.02 -887.555 0 -419.706 0 0 0 0 -1269.95 0 0 808.969 1846.29 -1116.6 0 0 -99.1089 0 0 0 0 0 1340.75 0 0 0 0 2252.19 0 873.363 0 0 0 0 0 0 810.343 0 0 0 0 0 0 0 0 
1165.88 0 2088.61 1808.91 -1337.55 0 0 0 -659.886 0.03 0 776.772 0 -121.387 1222.34 -1368.98 0 0 0 0 0 1140.86 0 0 0 0 0 -1292.84 1492.89 0 0 0 0 0 0 -1901.84 712.683 0 0 0 0 0 0 2313.84 2315.67 0 0 0 0 0 0 0 0 1099.35 0 0 0 0 0 0 0 0 0 
0 0 0 0 0 -2295.07 0 0 0 0 0.03 0 2212.06 0 0 1797.92 0 0 0 -948.134 0 132.527 0 1386.23 614.109 0 939.741 0 0 0 0 0 1452.3 746.406 834.91 1821.27 -49.5163 0 -1271.63 0 0 0 758.614 363.857 -52.2629 0 0 0 0 1049.3 0 1552.1 0 0 0 0 0 0 2398.68 0 0 0 0 
0 0 0 0 -1397.98 0 0 0 0 1582 0 0.01 0 0 735.878 975.906 1939.68 -259.484 2416.99 0 0 0 -32.1207 0 0 0 0 0 0 0 -2459.26 0 0 0 0 0 0 0 0 0 0 -479.217 0 0 0 1395.54 0 0 0 1764.66 0 0 -774.636 0 0 0 0 0 0 1034.2 0 0 0 
0 0 0 0 172.353 0 0 1987.9 0 0 2467.5 0 0.05 -444.426 0 0 -823.771 0 0 0 -1154.44 0 1155.51 0 0 0 0 0 342.494 0 0 0 -306.94 434.66 0 0 0 0 2434.08 0 0 0 0 0 0 1897.56 0 0 0 1237.6 0 0 -349.208 0 0 588.626 0 0 0 0 0 2363.12 0 
0 0 0 0 0 1663.95 1684.24 2009.11 0 -1959.67 0 0 -2229.61 0.02 0 0 -2096.24 0 0 0 1915.72 0 0 1099.96 0 2242.42 0 0 -104.755 0 0 -998.337 0 0 0 0 1932.2 0 0 0 -1611.3 0 0 0 0 0 0 0 0 0 0 0 0 0 0 0 0 -593.814 2276.91 0 0 0 0 
0 0 623.264 -80.9503 376.064 0 0 0 856.426 1716.44 0 494.476 0 0 0.09 1620 0 0 0 0 -1442.08 0 0 0 2284.84 0 0 0 0 0 0 0 0 0 0 0 0 -176.016 0 0 -1034.2 0 0 0 1600.47 0 0 851.085 0 0 0 0 0 0 0 0 1047.93 0 0 0 0 0 0 
1433.07 0 1413.08 633.946 -1363.19 -1860.48 0 0 2188.71 934.095 -1698.74 880.23 0 0 5.87481 0.02 0 0 0 0 0 0 0 1170.61 258.873 0 0 0 0 0 -1794.41 0 0 0 0 0 699.255 0 2246.39 0 1208.76 -342.189 0 1565.22 -1077.38 0 0 0 -2097.31 0 0 0 0 0 0 0 0 0 0 0 -1890.85 0 0 
0 -730.384 0 0 0 0 0 0 0 0 0 2454.68 -251.396 -874.279 0 0 0.04 -678.045 0 -529.267 0 0 0 -606.326 0 -154.958 0 859.63 -1354.95 2271.87 0 0 0 -305.719 0 1360.44 0 0 0 0 0 1976 511.719 0 0 0 0 0 2125.84 -994.674 0 0 0 -1157.19 0 0 0 0 0 0 0 0 0 
2273.86 -1673.56 -2038.56 0 0 0 0 0 0 0 0 2109.82 0 0 0 0 1975.39 0.01 -1629.61 0 0 1340.14 0 0 0 1460.69 -719.703 -1479.61 0 0 0 1535.16 0 0 0 0 -2285.76 0 0 559.175 0 0 0 0 589.236 0 1630.99 0 0 849.406 0 0 0 0 -984.603 0 0 0 0 0 0 0 0 
0 0 0 0 0 -662.786 0 0 -1171.99 0 0 1401.18 0 0 0 0 0 1510.74 0.02 -1917.4 0 0 -1465.12 1062.43 0 0 -2425.38 2041.15 0 0 -1287.8 0 1957.84 0 -306.482 1650.36 0 0 0 0 0 0 0 0 0 0 0 0 0 0 1370.97 0 1986.22 0 2023.45 0 0 187.613 0 0 0 0 0 
0 -107.501 -1628.09 0 1031.6 0 -483.642 0 906.781 0 -102.924 0 0 0 0 0 869.854 0 2015.06 0.08 0 0 -199.057 679.113 1633.58 0 0 0 -119.861 0 0 -819.803 0 0 1794.11 0 -118.793 0 0 0 0 1845.84 0 -48.4481 -1301.39 -133.595 -2358.85 0 81.7133 0 2214.04 0 0 0 0 0 653.325 381.558 -1316.64 1362.42 1840.65 0 0 
0 0 0 0 0 0 0 0 0 0 0 0 2391.05 -1052.96 1878.95 0 0 0 0 0 0.03 0 0 0 -2316.89 0 0 -1976.15 0 -770.516 0 0 0 0 -47.6852 0 0 0 1817 -1362.58 1171.07 0 1092.79 0 0 0 0 0 2417.75 0 0 0 0 -1693.24 0 0 0 0 0 0 0 0 0 
0 0 0 123.218 0 0 -299.31 0 2494.96 1049.15 1352.35 0 0 0 0 0 0 2223.81 0 0 0 0.05 0 -678.35 0 0 0 0 0 0 0 0 1881.08 0 0 -657.903 2032.15 0 -111.774 0 0 0 0 -1184.04 0 -1127.74 -1530.27 0 0 -688.116 0 2198.78 0 0 0 898.541 0 0 0 0 0 0 0 
0 0 0 1860.18 0 0 0 0 0 0 0 -1626.1 1665.32 0 0 0 0 0 945.845 1756.72 0 0 0.02 0 0 82.3237 0 -1166.8 0 -2045.58 0 -2071.98 646.916 -1339.23 -167.013 0 0 0 1202.96 0 0 -2313.84 0 0 0 0 2323.3 0 0 0 0 0 0 0 0 0 0 0 0 0 0 0 0 
0 0 0 0 0 0 0 0 0 0 2050 0 0 1604.89 0 -1167.87 1945.02 0 2258.9 -798.593 0 1663.95 0 0.05 -23.5755 0 0 0 -904.187 0 0 0 0 0 -1826.76 0 46.3118 802.866 -163.503 2110.28 0 1741.77 -1265.83 -743.507 -1812.42 0 0 0 0 0 0 0 -636.235 0 -24.3385 0 996.811 748.39 0 0 0 0 0 
0 0 0 0 0 1270.41 -98.1933 -819.193 0 0 958.052 0 0 0 -236.137 765.023 0 0 0 2064.04 1907.18 0 0 922.346 0 1570.25 0 0 0 0 0 0 1354.79 -866.497 0 166.402 838.42 0 975.753 1493.5 0 0 0 0 -2372.89 534.15 0 969.649 -1931.14 0 0 0 -1773.05 0 0 0 0 -580.691 0 0 0 1334.35 0 
0 0 0 0 0 -475.86 0 0 0 0 0 0 0 -372.707 0 0 1202.35 783.944 0 0 0 0 194.632 0 1267.51 0.05 0 0 0 0 0 0 0 0 0 987.045 0 0 0 0 0 -893.506 0 243.004 0 -1763.59 0 0 761.666 0 0 0 0 0 0 0 0 0 87.6644 0 0 0 0 
0 0 0 -1517.46 0 0 0 0 -473.724 0 -1867.2 0 0 0 0 0 0 2011.86 2312.46 0 0 0 0 0 0 0 0.03 0 0 0 2109.06 0 -2376.4 0 0 2070.45 0 0 0 0 -707.038 -216.605 1559.88 0 0 0 0 0 0 -2305.44 0 2300.71 0 0 0 0 0 0 0 0 0 -1354.49 0 
-968.123 0 1966.69 0 0 0 0 0 0 -1892.38 0 0 0 0 0 0 2297.05 -1125.9 1560.95 0 780.282 0 2172.69 0 0 0 0 0.03 0 0 2288.81 -1923.2 0 0 1795.79 -1082.72 0 0 0 -886.792 2216.79 0 0 0 0 0 0 1941.97 735.572 507.294 -52.1104 0 0 0 0 0 0 0 0 0 0 -2148.12 0 
1225.39 0 0 0 2428.89 0 0 0 0 -1405.45 0 0 1527.53 2420.8 0 0 -1380.73 0 0 1765.72 0 0 0 -762.429 0 0 0 0 0.03 0 0 0 0 0 0 0 0 0 0 0 0 0 0 0 0 0 2324.06 0 -204.093 158.925 0 -2198.32 0 0 0 0 0 -1866.89 0 0 0 0 0 
0 0 0 0 0 0 0 0 -1827.37 0 0 0 0 0 0 0 1659.52 0 0 0 435.423 0 2413.17 0 0 0 0 0 0 0.09 0 0 -191.885 0 0 0 2466.12 0 1569.19 -517.06 0 0 2336.73 0 0 0 0 -1711.4 0 0 0 0 -939.283 0 0 0 0 0 0 0 0 2006.06 0 
0 1637.24 458.312 0 571.383 0 1843.39 0 -1325.5 0 0 -483.337 0 0 0 -1173.21 0 0 -1761.76 0 0 0 0 0 0 0 1854.53 2315.67 0 0 0.07 0 0 2444.91 0 0 0 0 0 1456.88 0 0 0 309.076 -956.069 0 0 0 0 -36.5459 -2483.37 -288.171 0 563.753 -981.552 1587.5 0 0 0 0 0 0 0 
0 0 0 0 633.183 -174.49 860.088 2496.95 -166.402 0 0 0 0 -167.013 0 0 0 1784.8 0 867.412 0 0 1435.82 0 0 0 0 -636.998 0 0 0 0.09 0 0 0 -944.929 0 0 0 778.909 -1846.45 0 514.466 0 1226.46 0 0 0 0 2471.47 -2250.51 0 -975.143 0 0 1174.58 0 0 0 0 0 0 0 
0 867.26 0 0 0 0 0 2407.99 0 0 -412.076 0 -419.401 0 0 0 0 0 -206.229 0 0 737.709 -1578.8 0 1452.91 0 -625.858 0 0 -530.335 0 0 0.06 0 0 0 0 1674.32 0 0 0 1158.1 0 0 0 0 0 0 0 0 647.374 0 0 0 0 0 0 0 -2270.5 -192.648 -362.789 0 0 
576.724 0 0 0 0 2214.35 667.058 -1250.11 0 0 2144.61 0 195.853 0 0 0 689.489 0 0 0 0 0 1712.01 0 -635.929 0 0 0 0 0 1374.94 0 0 0.06 0 1611.61 0 0 0 0 -17.1667 0 0 0 0 0 694.83 384.762 2161.4 0 0 472.808 0 0 0 -1148.34 91.937 0 0 0 0 0 0 
-826.518 0 2219.23 0 0 -174.642 0 0 1916.94 0 -1697.36 0 0 0 0 0 0 0 -815.378 1394.92 -1229.67 0 2344.81 1136.74 0 0 0 2252.34 0 0 0 0 0 0 0.06 1676.76 2210.07 -2152.24 424.131 0 0 0 0 0 0 0 0 484.863 0 0 0 0 0 0 0 0 0 0 0 0 0 0 1117.82 
0 0 -1248.44 1133.84 0 1860.48 0 2425.08 0 -578.86 357.295 0 0 0 0 0 -91.937 0 -941.42 0 0 -197.989 0 0 753.426 -810.8 1831.95 824.381 0 0 0 75.3044 0 -658.818 345.851 0.01 -1179.16 0 0 -1762.98 0 0 658.971 0 0 -1111.71 0 0 0 1038.32 2329.25 0 0 -1480.22 0 0 0 0 0 0 0 0 0 
-275.658 1450.01 0 0 0 0 0 0 0 1366.24 1566.13 0 0 2266.23 0 976.974 0 442.595 0 1839.27 0 1569.03 0 418.638 -1639.99 0 0 0 0 457.701 0 0 0 0 -1534.39 2355.49 0.02 0 0 -1260.19 0 1358.76 1619.24 506.531 1485.72 0 0 0 0 0 -835.673 0 -27.6955 0 0 0 0 0 0 103.534 0 0 0 
0 0 0 0 0 1660.13 2025.44 0 0 0 0 0 0 0 -389.95 0 0 0 0 0 0 0 0 -16.7089 0 0 0 0 0 0 0 0 1242.94 0 1539.43 0 0 0.02 0 0 0 1394.77 0 1266.9 0 1505.1 0 -214.316 0 0 0 0 0 0 0 0 -1596.96 0 0 0 0 0 0 
1330.53 0 0 0 0 1240.04 0 0 0 0 -292.138 0 -255.669 0 0 2322.23 0 0 0 0 -2294.92 1772.59 1061.36 190.97 1822.64 0 0 0 0 1982.25 0 0 0 0 -1772.29 0 0 0 0.04 0 0 0 815.226 0 0 -2203.51 0 1643.04 0 24.0333 0 0 0 0 0 0 0 0 0 0 0 0 1100.12 
0 0 0 2005.14 -522.401 0 0 0 0 0 0 0 0 0 0 0 0 -2001.48 0 0 1390.5 0 0 -2422.18 -1728.03 0 0 1470.76 0 304.956 -1764.96 1296.04 0 0 0 2053.36 -2465.36 0 0 0.04 0 0 2246.54 0 346.004 0 -1005.2 0 0 0 0 1882.76 0 0 0 0 0 0 0 0 0 271.691 0 
0 -403.226 0 0 0 457.701 0 -423.673 1153.37 0 0 0 0 1399.2 1070.67 1126.97 0 0 0 0 -2203.36 0 0 0 0 0 957.595 656.987 0 0 0 -1963.79 0 -446.409 0 0 0 0 0 0 0.07 2223.04 0 0 1564.76 789.285 0 0 0 0 0 0 0 0 0 0 0 0 0 0 0 0 0 
0 2115.92 2420.65 0 -624.79 -1879.25 0 0 0 0 0 -1043.66 0 0 0 -2070.6 2334.28 0 0 1943.04 0 0 655.919 2261.65 0 1691.87 349.818 0 0 0 0 0 1851.18 0 0 0 -2414.24 1095.84 0 0 1341.98 0.08 0 -471.129 -1356.47 -1131.24 0 0 -1703.16 0 0 0 0 -2319.79 0 0 0 781.35 0 0 0 0 0 
-148.244 0 1194.27 0 0 0 0 956.221 0 0 239.647 0 0 0 0 0 -2465.51 0 0 0 700.323 0 0 239.036 0 0 2423.7 0 0 -1930.83 0 2399.75 0 0 0 2023.15 1306.88 0 683.538 1720.4 0 0 0.01 -976.363 -1444.82 0 -1017.87 0 0 404.599 0 0 0 0 0 1588.11 0 1386.99 0 0 0 0 0 
0 0 0 0 0 0 1886.43 0 0 1158.56 -599.612 0 0 0 0 -374.996 0 0 0 -955 0 -1755.35 0 1568.88 0 -1282.46 0 0 0 0 -1888.41 0 0 0 0 0 -880.84 1529.05 0 0 0 -123.981 696.203 0.01 0 452.361 1605.96 0 0 0 0 0 0 0 0 605.258 0 0 0 0 0 0 0 
1796.55 0 0 0 635.319 0 0 -1722.69 0 2013.38 753.731 0 0 0 2493.29 2493.44 0 445.189 0 378.964 0 0 0 209.433 -2243.34 0 0 0 0 0 1291.62 -966.14 0 0 0 0 -551.851 0 0 2113.64 1055.86 2493.29 -458.922 0 0.06 -1922.9 -1480.53 0 0 1892.07 -602.664 579.775 0 0 -1953.72 0 0 0 0 0 0 0 0 
0 2090.29 0 0 -165.029 0 0 0 -743.355 0 0 -2290.49 -64.1652 0 0 0 0 0 0 153.279 0 1557.89 0 0 -1034.2 -1644.87 0 0 0 0 0 0 0 0 0 790.353 0 2464.14 1611.91 0 717.414 1156.12 0 841.319 701.239 0.08 -30.2896 0 0 0 0 0 0 0 2257.07 0 0 0 0 0 0 0 0 
0 0 1495.48 0 0 0 0 0 0 0 0 0 0 0 0 0 0 1282.62 0 1518.07 0 137.257 -844.066 0 0 0 0 0 -1556.52 0 0 0 0 2379.6 0 0 0 0 0 -480.285 0 0 2051.53 -2171.47 -126.576 924.635 0.03 0 0 0 0 0 -1375.85 0 0 0 0 0 0 0 0 796.152 0 
0 -2041.76 0 774.789 0 0 0 -2189.93 -696.966 0 0 0 0 0 -2103.87 0 0 0 0 0 0 0 0 0 898.846 0 0 2316.28 0 2386.17 0 0 0 2045.27 2477.72 0 0 -202.261 2303.77 0 0 0 0 0 0 0 0 0 554.292 0 0 1855.45 -2464.75 0 0 0 0 0 0 0 0 0 0 
0 0 1747.11 0 0 0 -368.435 -2007.43 0 0 0 0 0 0 0 -1930.07 -2161.85 0 0 888.47 911.512 0 0 0 -2175.59 1017.26 0 1738.56 -157.552 0 0 0 0 591.83 0 0 0 0 0 0 0 -74.2363 0 0 0 0 0 645.39 0.08 -300.989 2496.03 0 1154.29 0 -1851.94 0 0 0 0 0 0 0 0 
0 -1011.31 -54.5518 0 1971.11 0 34.1044 1139.33 0 0 1916.33 752.358 2413.94 0 0 0 725.959 -1972.33 0 0 0 -1491.82 0 0 0 0 -235.527 1674.17 -105.67 0 574.129 648.9 0 0 0 1556.22 0 0 -1128.19 0 0 0 2089.53 0 1271.48 0 0 0 2224.27 0.03 0 0 0 0 -1230.58 0 0 0 0 0 292.749 -2306.97 2385.56 
-1088.37 0 1727.12 0 1475.8 2465.51 0 0 0 0 0 0 0 0 0 0 0 0 1222.34 402.463 0 0 0 0 0 0 0 -1144.67 0 0 242.241 -1572.08 268.487 0 0 -1750.16 1098.13 0 0 0 0 0 0 0 -518.738 0 0 0 2238.15 0 0.09 0 0 0 0 0 0 0 -1789.22 0 0 0 2117.3 
0 358.211 0 0 0 0 0 0 0 0 -2182.76 0 0 0 0 0 0 0 0 0 0 -414.212 0 0 0 0 1065.78 0 1670.35 0 2203.82 0 0 -1291.92 0 0 0 0 0 -278.1 0 0 0 0 237.205 0 0 1786.32 0 0 0 0.08 0 0 0 0 0 0 0 243.614 0 0 0 
0 2313.07 0 0 0 0 0 0 0 0 0 1455.05 -1338.77 0 0 0 0 0 -2217.4 0 0 0 0 1491.82 2325.13 0 0 0 0 -1019.85 0 1133.84 0 0 0 0 -1173.36 0 0 0 0 0 0 0 0 0 703.375 2426.45 -656.987 0 0 0 0 0 0 0 0 0 0 0 0 0 0 
0 0 0 0 0 0 0 0 0 1816.84 0 0 0 0 0 0 599.918 0 0 0 53.9415 0 0 0 0 0 0 0 0 0 909.833 0 0 0 0 2375.79 0 0 0 0 0 -511.872 0 0 0 0 0 0 0 0 0 0 0 0.09 0 0 0 0 0 0 0 0 0 
0 0 0 0 0 0 0 0 1983.47 0 0 0 0 0 0 0 0 -720.008 505.31 0 0 0 0 2093.04 0 0 0 0 0 0 1648.99 0 0 0 0 0 0 0 0 0 0 0 0 0 708.258 -1343.81 0 0 811.106 1904.28 0 0 0 0 0.07 0 217.978 0 0 0 0 0 0 
0 0 0 0 0 0 0 -629.673 0 0 0 0 565.127 0 0 0 0 0 0 0 0 -640.66 0 0 0 0 0 0 0 0 2424.47 2408.9 0 2446.13 0 0 0 0 0 0 0 0 -1425.9 1487.4 0 0 0 0 0 0 0 0 0 0 0 0.01 0 476.775 2135.3 683.538 -2039.93 0 0 
0 0 1723.15 0 0 0 0 0 0 0 0 0 0 0 -1260.34 0 0 0 0 -2315.21 0 0 0 -141.53 0 0 0 0 0 0 0 0 0 295.953 0 0 0 2307.28 0 0 0 0 0 0 0 0 0 0 0 0 0 0 0 0 -203.33 0 0.03 0 0 269.86 0 0 0 
0 0 0 0 0 0 0 0 0 0 0 0 0 2025.89 0 0 0 0 1891 712.378 0 0 0 -491.729 -1933.12 0 0 0 632.878 0 0 0 0 0 0 0 0 0 0 0 0 716.651 -1018.02 0 0 0 0 0 0 0 0 0 0 0 0 1543.7 0 0.04 0 0 -733.284 0 -1339.38 
0 0 0 1120.87 0 375.607 0 0 0 0 2321.16 0 0 1369.29 0 0 0 0 0 101.093 0 0 0 0 0 1990.95 0 0 0 0 0 0 54.7044 0 0 0 0 0 0 0 0 0 0 0 0 0 0 0 0 0 25.2541 0 0 0 0 2410.12 0 0 0.01 0 0 0 0 
0 0 0 0 0 1342.28 0 0 0 0 0 549.562 0 0 0 0 0 0 0 408.414 0 0 0 0 0 0 0 0 0 0 0 0 1152.15 0 0 0 -658.971 0 0 0 0 0 0 0 0 0 0 0 0 0 0 1114.15 0 0 0 1202.51 2410.73 0 0 0.07 2469.79 0 0 
0 0 0 0 0 0 0 0 0 0 0 0 0 0 0 -1827.37 0 0 0 1892.07 0 0 0 0 0 0 0 0 0 0 0 0 2458.04 0 0 0 0 0 0 0 0 0 0 0 0 0 0 0 0 -1048.69 0 0 0 0 0 1232.57 0 2485.96 0 -201.193 0 0 -1612.52 
0 857.036 0 0 0 1907.48 0 0 0 0 0 0 721.839 0 0 0 0 0 0 0 0 0 0 0 -2086.32 0 -389.492 -48.6007 0 2358.09 0 0 0 0 0 0 0 0 0 -950.117 0 0 0 0 0 0 2336.88 0 0 2429.35 0 0 0 0 0 0 0 0 0 0 0 0.05 0 
-161.519 0 0 0 0 0 1390.5 -332.423 0 0 0 0 0 0 0 0 0 0 0 0 0 0 0 0 0 0 0 0 0 0 0 0 0 0 -139.546 0 0 0 -1257.13 0 0 0 0 0 0 0 0 0 0 801.035 1013.29 0 0 0 0 0 0 -268.334 0 0 -206.992 0 0.09 
