*Vertices 43
*Matrix 
0.05 0 0 0 0 0 73.0155 0 0 0 0 0 0 0 0 -96.5148 0 0 0 0 0 0 0 -2435 1693.24 0 0 283.288 0 0 0 0 1619.39 0 0 0 0 350.429 0 0 0 0 0 
0 0.06 0 0 0 0 0 0 -834.91 0 0 0 770.058 -840.403 0 0 0 0 0 0 0 0 1572.7 0 255.058 0 -891.369 0 0 0 2457.12 0 0 0 0 0 0 2313.99 0 0 0 0 0 
0 0 0.04 0 0 0 0 0 0 0 0 0 2276.15 0 0 0 0 0 0 0 -552.309 0 0 0 0 0 0 1242.48 0 0 0 0 0 0 0 0 0 -77.5933 0 0 0 0 0 
0 0 0 0.04 0 0 0 0 0 0 0 0 0 0 0 0 0 0 1787.85 -374.996 0 1708.04 0 0 -1116.14 0 0 0 0 1769.39 0 0 0 0 0 0 0 0 0 0 1258.51 0 0 
0 0 0 0 0.07 0 0 0 0 2003.77 0 0 0 0 0 0 0 0 -2284.08 0 0 0 0 0 0 0 0 0 0 0 0 0 0 2335.2 0 0 0 0 0 0 0 0 -283.898 
0 0 0 0 0 0.01 905.56 -1208.46 1599.7 0 1940.9 0 0 0 0 0 0 0 0 0 0 0 0 0 0 0 0 0 0 0 0 0 0 0 1777.63 0 0 0 0 269.402 0 0 0 
2074.57 0 0 0 0 2485.96 0.01 0 0 0 0 0 0 0 0 0 0 0 0 0 0 0 0 0 -68.8955 0 0 0 0 0 0 0 -2491.61 0 0 0 0 6.63778 0 0 427.641 0 0 
0 0 0 0 0 1055.56 0 0.01 0 -761.208 0 0 -669.042 0 0 0 -1558.66 0 0 1438.57 0 -933.027 2315.97 1939.22 0 0 0 0 0 0 0 0 0 0 0 0 0 0 2359.77 318.69 0 0 0 
0 -1527.22 0 0 0 1293.45 0 0 0.09 0 0 0 0 0 -1532.26 0 -149.312 0 0 0 0 0 0 0 0 2043.14 0 0 0 -1804.18 0 1511.51 -322.657 0 1026.26 0 0 0 0 0 0 0 0 
0 0 0 0 478.607 0 0 622.959 0 0.05 0 0 0 0 0 0 0 588.473 0 0 0 0 0 0 0 0 495.849 0 1333.43 0 0 558.107 0 0 0 0 906.629 0 0 0 0 0 0 
0 0 0 0 0 1976.45 0 0 0 0 0.08 2444 0 1912.98 0 0 0 0 0 0 0 619.602 0 -260.552 270.775 0 0 0 0 0 1129.72 0 0 0 -2382.35 0 0 0 0 0 1350.06 0 0 
0 0 0 0 0 0 0 0 0 0 2262.72 0.04 6.94296 0 0 0 1691.11 0 -1721.93 0 0 0 0 0 0 0 0 0 0 0 0 0 0 0 0 2193.75 0 0 0 0 0 0 0 
0 583.438 253.38 0 0 0 0 799.051 0 0 0 2450.56 0.05 0 0 0 0 0 0 0 0 680.792 0 0 0 0 0 0 0 0 0 0 0 0 0 0 0 0 0 0 0 0 0 
0 1625.64 0 0 0 0 0 0 0 0 2169.33 0 0 0.03 0 0 0 -385.525 0 0 2170.71 0 0 0 0 2022.08 0 0 1305.05 0 0 0 0 -2313.38 1788.61 0 0 0 0 0 -2165.21 0 0 
0 0 0 0 0 0 0 0 2302.39 0 0 0 0 0 0.08 0 0 0 0 0 0 0 0 0 0 2482.45 0 0 0 0 0 0 0 0 0 0 0 -1101.95 0 0 -538.27 0 0 
-1677.83 0 0 0 0 0 0 0 0 0 0 0 0 0 0 0.03 0 0 0 483.489 0 0 0 0 0 0 0 0 0 0 1603.52 0 0 0 0 0 0 0 0 0 0 0 0 
0 0 0 0 0 0 0 1036.64 359.432 0 0 2237.39 0 0 0 0 0.01 0 0 0 -740.608 0 0 0 0 0 0 -547.884 0 0 0 0 -17.777 0 0 0 0 0 0 0 0 0 0 
0 0 0 0 0 0 0 0 0 -85.0703 0 0 0 -1241.26 0 0 0 0.02 0 0 0 0 0 0 2472.69 0 0 0 0 0 0 0 0 0 0 0 -647.374 0 0 1151.84 0 0 0 
0 0 0 2404.48 762.429 0 0 0 0 0 0 1641.36 0 0 0 0 0 0 0 0 0 0 0 0 -670.721 0 0 0 2462.61 0 0 0 0 0 0 0 0 0 1498.69 0 0 0 0 
0 0 0 2196.34 0 0 0 -1658.76 0 0 0 0 0 0 0 2430.88 0 0 0 0 1573.76 0 0 0 0 0 0 0 0 314.722 0 0 -516.449 0 0 0 0 0 0 1000.17 0 2403.26 0 
0 0 493.408 0 0 0 0 0 0 0 0 0 0 1664.1 0 0 -743.812 0 0 1946.7 0.07 0 0 0 0 -1808.15 -377.743 0 0 0 0 60.8081 0 0 0 0 0 0 0 0 0 0 0 
0 0 0 2472.99 0 0 0 2388.15 0 0 -456.328 0 -296.106 0 0 0 0 0 0 0 0 0.07 -1780.37 0 0 1856.67 0 0 0 0 2254.17 0 0 0 631.657 1795.79 0 0 0 0 0 0 0 
0 -1401.79 0 0 0 0 0 1831.95 0 0 0 0 0 0 0 0 0 0 0 0 0 2109.97 0.06 0 0 0 0 0 0 2490.39 0 0 1152.15 0 0 0 0 0 0 0 0 0 0 
-753.578 0 0 0 0 0 0 -704.443 0 0 -119.404 0 0 0 0 0 0 0 0 0 0 0 0 0.09 0 1399.2 0 0 0 0 0 0 0 0 0 0 416.807 0 0 1817.76 1905.8 -1606.42 0 
2240.29 -1004.75 0 1238.21 0 0 164.266 0 0 0 -1986.37 0 0 0 0 0 0 -419.553 2092.88 0 0 0 0 0 0.01 0 0 0 0 0 0 0 0 0 0 0 0 0 -17.4718 0 0 0 0 
0 0 0 0 0 0 0 0 2279.96 0 0 0 0 -257.653 -1764.96 0 0 0 0 0 -551.698 -2080.37 0 1473.2 0 0.07 0 0 0 0 0 0 1370.97 0 0 0 0 0 0 1840.04 0 0 0 
0 -435.728 0 0 0 0 0 0 0 533.235 0 0 0 0 0 0 0 0 0 0 -313.654 0 0 0 0 0 0.07 0 0 0 0 0 1622.9 0 0 0 -732.521 0 0 0 0 0 0 
127.338 0 -1263.54 0 0 0 0 0 0 0 0 0 0 0 0 0 253.99 0 0 0 0 0 0 0 0 0 0 0.04 0 0 0 2148.58 0 0 197.836 0 0 1867.2 561.617 0 0 0 0 
0 0 0 0 0 0 0 0 0 -2271.11 0 0 0 2084.19 0 0 0 0 234.001 0 0 0 0 0 0 0 0 0 0.08 0 0 0 0 0 0 1864.3 0 0 0 0 0 0 0 
0 0 0 -1471.07 0 0 0 0 1546.3 0 0 0 0 0 0 0 0 0 0 993.912 0 0 1594.36 0 0 0 0 0 0 0.01 0 -1756.72 0 0 0 0 0 0 0 0 0 0 0 
0 609.836 0 0 0 0 0 0 0 0 -1732.15 0 0 0 0 1553.32 0 0 0 0 0 1075.24 0 0 0 0 0 0 0 0 0.09 1546.14 0 0 0 0 0 847.118 0 0 0 0 0 
0 0 0 0 0 0 0 0 1578.65 -219.047 0 0 0 0 0 0 0 0 0 0 1403.01 0 0 0 0 0 0 1803.26 0 338.221 931.654 0.04 0 0 0 0 0 1804.79 0 0 0 0 0 
1436.89 0 0 0 0 0 1902.91 0 987.198 0 0 0 0 0 0 0 604.19 0 0 -785.928 0 0 1746.8 0 0 2329.4 -1964.4 0 0 0 0 0 0.03 0 0 0 0 0 471.435 0 0 0 0 
0 0 0 0 2498.63 0 0 0 0 0 0 0 0 -1183.58 0 0 0 0 0 0 0 0 0 0 0 0 0 0 0 0 0 0 0 0.02 0 0 0 -404.752 0 0 0 1256.68 0 
0 0 0 0 0 -1012.68 0 0 1092.94 0 374.691 0 0 619.297 0 0 0 0 0 0 0 101.55 0 0 0 0 0 153.127 0 0 0 0 0 0 0.05 0 0 0 -649.51 0 0 0 0 
0 0 0 0 0 0 0 0 0 0 0 1841.26 0 0 0 0 0 0 0 0 0 -1164.66 0 0 0 0 0 0 2075.49 0 0 0 0 0 0 0 -1393.7 0 0 2095.02 0 -2176.2 0 
0 0 0 0 0 0 0 0 0 -675.909 0 0 0 0 0 0 0 -1098.28 0 0 0 0 0 2112.57 0 0 2100.05 0 0 0 0 0 0 0 0 -882.519 0.02 0 -498.291 -113.758 2355.19 0 0 
-2482.91 530.183 403.226 0 0 0 395.138 0 0 0 0 0 0 0 1276.21 0 0 0 0 0 0 0 0 0 0 0 0 717.414 0 0 -1953.11 -283.746 0 2011.4 0 0 0 0.06 0 0 0 0 0 
0 0 0 0 0 0 0 1897.87 0 0 0 0 0 0 0 0 0 0 2340.85 0 0 0 0 0 -1770.76 0 0 -535.981 0 0 0 0 -1225.7 0 -502.258 0 1696.91 0 0.07 0 0 0 0 
0 0 0 0 0 561.159 0 493.713 0 0 0 0 0 0 0 0 0 300.226 0 -250.938 0 0 0 1407.28 0 -866.955 0 0 0 0 0 0 0 0 0 709.479 -1810.28 0 0 0.05 1264.15 0 0 
0 0 0 1463.74 0 0 -2437.44 0 0 0 1068.22 0 0 2350.31 1847.82 0 0 0 0 0 0 0 0 -1262.47 0 0 0 0 0 0 0 0 0 0 0 0 -1590.4 0 0 -1233.18 0.04 1127.58 0 
0 0 0 0 0 0 0 0 0 0 0 0 0 0 0 0 0 0 0 -702.002 0 0 0 2226.4 0 0 0 0 0 0 0 0 0 2283.32 0 555.055 0 0 0 0 -745.796 0.07 0 
0 0 0 0 1730.02 0 0 0 0 0 0 0 0 0 0 0 0 0 0 0 0 0 0 0 0 0 0 0 0 0 0 0 0 0 0 0 0 0 0 0 0 0 0.03 
