*Vertices 66
*Matrix 
0.07 0 0 0 0 -147.176 0 0 0 0 0 0 299.921 0 0 0 0 0 0 1495.18 0 0 0 0 0 470.519 0 0 0 0 0 0 0 0 0 1132.77 -609.226 0 1049 0 0 0 0 0 0 0 0 0 0 0 0 0 0 0 930.891 0 0 0 0 2126.91 0 0 0 0 0 0 
0 0.02 -1920.76 1180.07 0 0 -146.107 0 0 0 191.885 0 784.249 0 0 0 0 2426.6 0 1979.81 0 1488.31 0 0 0 1645.02 -2436.22 0 231.254 0 1878.8 2263.79 0 0 -756.478 0 0 0 0 2306.97 0 2291.1 0 0 0 0 0 0 0 0 -2049.24 0 0 0 0 0 0 0 0 0 0 0 0 0 0 0 
0 1418.58 0.01 0 0 0 594.424 0 0 0 0 0 0 0 0 0 0 0 0 -638.829 0 0 0 -1962.87 0 0 0 0 0 744.728 2278.74 0 0 172.353 1683.63 0 0 0 0 0 0 0 0 0 0 1705.6 0 0 0 0 0 0 0 0 0 0 -1475.95 0 0 0 0 0 0 0 0 0 
0 2427.82 0 0.04 0 -436.949 -575.655 -1525.7 0 0 0 0 0 0 931.501 0 0 0 0 927.076 0 2442.01 233.39 0 0 -368.74 2322.23 0 0 0 0 0 0 0 0 0 0 0 0 0 0 0 0 0 0 0 0 1837.75 0 0 -2472.23 0 0 0 0 0 0 0 0 0 0 0 0 0 0 0 
0 0 0 0 0.03 0 0 0 0 0 -103.992 -1733.38 1959.21 0 0 0 0 0 -837.962 0 0 0 0 1205.56 0 0 0 -1622.44 0 0 1185.87 0 0 2466.73 0 0 0 0 0 0 0 0 0 0 0 0 0 0 1679.36 0 0 0 1361.05 0 0 0 0 0 0 0 -618.534 0 0 0 0 0 
-452.818 0 0 1861.86 0 0.06 -647.832 0 649.663 0 -1043.96 0 0 0 0 0 0 0 0 0 0 0 0 0 0 0 -2059.16 0 1312.83 0 0 0 0 2304.07 0 -2212.06 -560.091 1388.21 0 0 533.54 0 0 0 0 0 0 0 0 0 -574.282 0 0 0 2339.93 0 1402.25 805.307 0 0 0 0 0 584.048 0 0 
0 -1379.36 600.07 194.174 0 971.175 0.04 0 -1800.97 0 0 0 -735.878 0 1616.64 -1578.19 0 0 331.355 1289.18 0 0 0 0 2358.24 0 0 0 0 -376.064 0 0 1832.1 0 0 0 0 0 0 0 0 0 0 0 0 0 0 0 0 0 0 0 1158.71 0 0 0 0 -2114.4 0 0 0 0 0 0 0 0 
0 0 0 1704.69 0 0 0 0 910.138 1997.97 0 -417.57 0 798.44 0 0 1638.62 0 0 -1780.68 -1383.02 0 746.101 0 2203.51 0 2118.82 -780.282 0 0 0 0 0 0 1594.36 0 0 0 0 0 0 0 0 0 936.384 0 0 0 0 0 1945.17 0 1841.56 0 0 0 0 0 0 0 -1482.21 0 0 0 0 0 
0 0 0 0 0 -119.251 -1059.37 -1920 0.06 0 0 0 0 0 0 0 0 0 0 0 0 0 0 0 1430.94 0 0 0 0 0 0 -1305.81 971.786 0 2277.06 0 2196.19 0 0 0 0 0 0 0 0 0 0 0 0 0 0 -1706.82 0 389.34 0 0 1671.73 0 0 0 0 0 0 0 0 -758.919 
0 0 0 0 0 0 0 238.426 0 0.08 0 -1044.72 0 0 0 0 0 0 0 0 0 0 0 884.198 0 1410.03 799.356 0 0 0 0 0 0 0 0 0 0 0 0 0 0 0 147.786 0 -900.067 0 0 0 0 0 0 -1454.13 0 0 0 1467.1 0 0 0 0 0 0 0 2333.06 0 0 
0 -881.756 0 0 -302.667 1864.91 0 0 0 0 0.05 0 0 0 600.833 595.492 0 0 1176.87 0 0 0 0 0 0 0 0 1665.32 -2328.94 0 0 0 0 -1085.01 1032.21 0 911.054 0 0 1234.7 0 0 0 0 0 0 0 0 0 0 0 0 0 2338.56 0 0 0 0 0 0 0 -1475.95 0 0 0 0 
0 0 0 0 1199.3 0 0 2320.4 0 -164.113 0 0.06 0 0 -949.66 0 0 0 2410.89 0 563.448 0 0 1505.86 1694.92 1841.56 0 0 0 0 292.596 -729.469 0 1399.2 0 0 0 0 0 0 0 0 0 0 1918.78 0 0 0 0 0 0 0 0 0 0 0 0 0 0 0 0 0 -704.138 0 0 0 
199.973 1946.55 0 0 -1222.65 0 2465.67 0 0 0 0 0 0.04 0 0 355.007 0 0 0 0 0 2419.74 972.854 0 0 0 1574.07 0 -942.64 0 0 0 -938.215 1943.49 -1829.81 0 0 0 0 0 1050.98 -818.583 0 0 0 0 0 1785.71 0 414.365 0 0 0 0 95.294 0 0 -504.395 -2479.55 0 0 0 0 0 0 0 
0 0 0 0 0 0 0 2030.47 0 0 0 0 0 0.09 2375.48 0 0 0 0 0 0 0 -400.784 0 0 0 0 0 369.655 0 0 0 33.1889 0 0 0 0 0 2383.11 0 0 0 0 447.935 0 0 0 0 0 0 0 -1486.18 0 0 0 -694.678 -1589.48 0 0 0 0 0 0 0 1751.99 0 
0 0 0 1992.02 0 0 1640.14 0 0 0 1796.09 -1131.86 0 2106.92 0.05 0 0 0 0 1423.76 0 0 0 0 0 0 0 -2285.15 734.504 0 0 0 1356.93 715.125 0 0 -2122.94 0 0 0 0 0 0 0 0 0 0 0 0 -426.42 0 0 0 0 0 0 0 0 0 0 0 0 0 -1607.18 0 0 
0 0 0 0 0 0 2469.79 0 0 0 2161.09 0 512.024 0 0 0.03 0 0 0 0 -891.522 0 0 0 1158.41 -8.01111 0 0 0 2370.75 0 2130.12 0 -1508.91 0 1137.04 0 0 0 2416.38 0 0 0 0 0 0 0 0 0 0 0 0 0 0 0 0 -2083.27 0 0 0 0 0 0 0 0 0 
0 0 0 0 0 0 0 -291.833 0 0 0 0 0 0 0 0 0.05 0 595.645 0 -1340.6 1595.28 0 0 1723.15 0 0 2346.49 0 0 0 0 -95.7518 0 0 0 2017.5 -57.6037 0 0 0 0 -2469.63 0 0 0 0 0 0 0 0 0 0 0 0 0 0 0 0 -1202.2 0 0 0 0 0 0 
0 553.224 0 0 0 0 0 0 0 0 0 0 0 0 0 0 0 0 -1857.74 0 207.907 0 0 0 -2454.07 1829.05 0 0 1394.01 -1394.62 0 0 1916.33 0 0 0 0 -1559.72 0 921.43 0 0 0 0 0 0 0 1563.39 0 0 0 0 0 -783.944 0 -477.538 0 0 0 0 0 0 0 0 0 0 
0 0 0 0 1491.82 0 1337.55 0 0 0 -182.119 420.927 0 0 0 0 206.992 -2283.17 0 1969.89 0 0 -64.4704 0 0 0 0 -2084.8 960.341 283.898 0 0 0 0 0 0 0 0 0 0 0 0 0 0 0 -902.509 0 0 0 0 0 0 0 0 0 0 0 43.26 0 0 893.658 0 0 0 0 0 
-1492.58 2480.16 -1524.17 479.827 0 0 1608.25 2484.59 0 0 0 0 0 0 1488.46 0 0 0 842.845 0.04 0 489.593 0 0 0 0 0 0 0 1590.4 0 0 0 0 0 0 0 -409.177 0 0 0 0 0 785.318 0 0 1611.45 0 0 0 0 0 0 2177.42 0 0 0 0 0 0 0 0 0 -816.446 0 0 
0 0 0 0 0 0 0 -235.069 0 0 0 1184.96 0 0 0 263.146 288.324 -439.39 0 0 0.04 934.248 0 0 0 0 0 0 0 0 0 -1273 0 0 0 1914.35 0 0 0 1474.43 0 0 0 474.487 0 0 0 0 0 0 0 0 -775.094 0 0 2388 0 0 0 547.273 0 0 899.152 0 0 0 
0 -666.753 0 31.2052 0 0 0 0 0 0 0 0 -907.239 0 0 0 1592.53 0 0 -589.541 296.716 0.05 0 -21.7444 -764.26 0 0 0 0 0 1625.64 0 -1596.35 0 0 1719.03 1108.36 0 0 0 0 0 0 1084.7 0 683.081 0 0 0 0 0 0 0 0 0 0 0 0 0 0 0 0 0 0 0 0 
0 0 0 725.044 0 0 0 2180.78 0 0 0 0 1998.43 -513.855 0 0 0 0 706.732 0 0 0 0.02 0 0 0 0 217.978 0 0 0 0 213.858 0 0 0 0 0 0 0 0 0 0 0 -533.998 0 0 0 0 1109.58 0 0 0 0 0 0 0 0 0 0 -2435.15 0 0 1470 0 0 
0 0 2197.41 0 -1679.82 0 0 0 0 633.793 0 929.518 0 0 0 0 0 0 0 0 0 1354.18 0 0.07 -2003.31 0 0 0 2271.72 0 0 -2196.8 0 0 -536.439 0 0 0 0 0 0 0 2149.19 0 0 0 0 0 0 0 0 0 -476.775 0 2294.61 0 0 0 0 0 1066.85 0 0 0 0 0 
0 0 0 0 0 0 -1665.01 2339.93 521.027 0 0 2189.93 0 0 0 -69.3533 500.427 -905.56 0 0 0 -1485.56 0 1695.53 0 1965.93 0 0 0 -44.9385 0 0 0 22.2022 0 0 0 0 0 0 0 2458.19 0 0 0 0 -757.698 0 0 0 0 0 0 0 0 0 0 0 0 0 0 0 0 0 0 0 
2306.82 -441.069 0 1978.13 0 0 0 0 0 1876.66 0 -707.343 0 0 0 440.001 0 -948.897 0 0 0 0 0 0 874.584 0.06 0 -768.685 0 2349.09 832.469 0 0 0 0 0 0 -216.91 0 0 0 0 0 0 0 0 0 -132.069 0 0 0 2315.52 0 0 0 0 0 0 0 0 0 0 0 0 0 0 
0 1381.19 0 -649.052 0 -135.426 0 -388.119 0 1871.93 0 0 36.3933 0 0 0 0 0 0 0 0 0 0 0 0 0 0.05 2310.17 0 0 0 0 -1808.45 -1313.44 1955.7 -681.249 0 0 0 0 0 0 0 0 0 0 0 -198.294 0 0 0 0 1176.26 0 0 501.495 0 0 0 0 0 0 0 0 0 0 
0 0 0 0 -2031.69 0 0 1121.02 0 0 294.885 0 0 0 1400.42 0 569.552 0 580.691 0 0 0 1186.79 0 0 1682.1 2034.75 0.02 0 0 0 -729.316 0 0 0 20.6763 0 0 0 0 0 0 2436.22 0 850.627 0 0 0 1168.17 0 0 0 0 -2483.67 0 0 0 0 0 0 0 0 0 0 909.375 0 
0 1950.67 0 0 0 2057.63 0 0 0 0 -86.2911 0 -390.866 1505.86 -1555.15 0 0 667.974 488.372 0 0 0 0 1711.25 0 0 0 0 0.05 0 0 0 0 0 -1350.67 0 -402.31 0 0 1885.2 0 0 0 0 0 0 0 0 0 0 0 0 0 0 0 0 0 -444.426 0 0 0 0 0 0 0 0 
0 0 2466.89 0 0 0 -312.586 0 0 0 0 0 0 0 0 -1619.39 0 1078.3 144.887 771.279 0 0 0 0 913.343 1450.16 0 0 0 0.06 0 0 0 0 0 0 -1894.97 -317.164 0 0 0 0 0 0 0 0 0 0 -1702.09 0 0 0 372.86 0 0 0 0 0 0 0 0 0 0 0 0 0 
0 -1919.84 827.891 0 -676.519 0 0 0 0 0 0 -1726.05 0 0 0 0 0 0 0 0 0 2128.59 0 0 0 2229.91 0 0 0 0 0.09 0 0 0 0 0 0 0 0 0 0 0 0 0 0 0 1005.05 0 0 -918.226 0 0 0 0 0 0 0 0 0 0 1470.76 152.669 0 0 0 -354.549 
0 -171.743 0 0 0 0 0 0 1460.84 0 0 51.1948 0 0 0 477.538 0 0 0 0 1103.32 0 0 784.707 0 0 0 1697.36 0 0 0 0.08 0 0 0 0 1693.09 0 0 0 0 0 0 0 2483.06 0 -40.2081 0 -1829.36 0 -770.669 0 0 0 0 0 0 0 0 0 0 0 0 0 0 0 
0 0 0 0 0 0 1908.4 0 613.346 0 0 0 1208.15 -110.248 -252.007 0 1826.91 2378.54 0 0 0 -791.116 1071.58 0 0 0 283.746 0 0 0 0 0 0.02 0 0 0 0 0 0 0 0 0 0 0 0 0 0 0 0 0 0 0 0 0 0 0 0 -1087.6 0 0 0 -1530.88 0 2206.11 0 0 
0 0 2364.35 0 1718.12 -1122.09 0 0 0 0 632.115 -2073.66 2304.07 0 -865.123 1317.56 0 0 0 0 0 0 0 0 1696.14 0 -1553.62 0 0 0 0 0 0 0.01 0 0 0 0 0 0 0 0 0 0 0 0 -959.12 0 0 0 0 0 0 0 0 0 0 0 0 0 0 0 0 0 -86.2911 0 
0 2262.11 1853.62 0 0 0 0 -133.747 2485.81 0 -1204.64 0 895.184 0 0 0 0 0 0 0 0 0 0 2179.4 0 0 -2449.49 0 -2042.38 0 0 0 0 0 0.06 653.63 0 0 0 0 0 0 0 -1267.36 -868.48 0 0 0 0 0 0 0 0 466.399 0 0 0 0 0 1170.92 0 0 -1588.56 0 0 0 
2328.64 0 0 0 0 -218.436 0 0 0 0 0 0 0 0 0 -416.349 0 0 0 0 -476.165 -837.809 0 0 0 0 2068.93 1008.87 0 0 0 0 0 0 1585.06 0.04 -2119.59 0 0 0 2470.24 0 0 0 0 0 0 1121.17 0 0 0 0 0 0 0 0 0 2322.99 0 0 0 0 0 0 1955.7 0 
1944.11 0 0 0 0 -1170 0 0 -1550.87 0 1056.17 0 0 0 1041.22 0 -1329.62 0 0 0 0 721.229 0 0 0 0 0 0 2353.05 -1849.35 0 -2429.35 0 0 0 74.6941 0.08 0 0 0 0 0 0 0 0 0 2121.11 0 0 0 0 0 0 0 0 0 0 0 0 2315.82 0 0 1276.51 0 0 0 
0 0 0 0 0 1621.83 0 0 0 0 0 0 0 0 0 0 805.307 -303.888 0 1957.38 0 0 0 0 0 1814.55 0 0 0 2437.13 0 0 0 0 0 0 0 0.05 0 0 0 0 1463.29 0 0 0 0 0 0 0 0 0 0 0 0 0 0 0 0 0 0 0 0 0 0 0 
1215.78 0 0 0 0 0 0 0 0 0 0 0 0 1206.47 0 0 0 0 0 0 0 0 0 0 0 0 0 0 0 0 0 0 0 0 0 0 0 0 0.04 0 0 0 0 0 0 0 0 0 0 0 0 0 0 0 0 0 0 0 0 1351.28 0 0 0 0 0 0 
0 952.101 0 0 0 0 0 0 0 0 -95.294 0 0 0 0 -1603.06 0 1034.2 0 0 2452.85 0 0 0 0 0 0 0 -1958.3 0 0 0 0 0 0 0 0 0 0 0 0 0 2122.64 0 0 -1131.09 0 0 0 0 0 0 0 0 0 1248.89 0 0 -2034.75 0 0 0 0 0 0 -703.681 
0 0 0 0 0 1596.96 0 0 0 0 0 0 2230.83 0 0 0 0 0 0 0 0 0 0 0 0 0 0 0 0 0 0 0 0 0 0 709.632 0 0 0 0 0 0 0 0 -1983.32 0 0 0 0 0 0 0 0 0 0 0 735.115 0 0 0 0 0 0 0 -545.137 -1600.31 
0 2383.11 0 0 0 0 0 0 0 0 0 0 2470.7 0 0 0 0 0 0 0 0 0 0 0 -340.663 0 0 0 0 0 0 0 0 0 0 0 0 0 0 0 0 0.07 0 0 0 0 0 0 0 0 0 0 0 0 0 0 0 0 0 2075.95 0 0 0 0 0 0 
0 0 0 0 0 0 0 0 0 2263.94 0 0 0 0 0 0 -1887.95 0 0 0 0 0 0 -1487.24 0 0 0 2409.36 0 0 0 0 0 0 0 0 0 -239.799 0 1454.13 0 0 0.09 0 0 0 0 0 0 -2374.57 0 0 0 0 0 0 0 0 0 434.049 0 0 1527.38 0 0 0 
0 0 0 0 0 0 0 0 0 0 0 0 0 -1808.3 0 0 0 0 0 1904.58 115.436 829.875 0 0 0 0 0 0 0 0 0 0 0 0 123.524 0 0 0 0 0 0 0 0 0.01 0 0 0 0 0 0 0 0 0 0 152.211 0 0 0 0 0 0 0 0 0 0 -263.756 
0 0 0 0 0 0 0 842.235 0 2421.11 0 2157.73 0 0 0 0 0 0 0 0 0 0 1468.02 0 0 0 0 -1880.78 0 0 0 523.621 0 0 -1839.27 0 0 0 0 0 -21.897 0 0 0 0.08 0 0 0 0 0 0 0 -1540.8 0 0 0 1493.5 0 2068.77 0 0 0 0 -1839.27 892.743 0 
0 0 1956.77 0 0 0 0 0 0 0 0 0 0 0 0 0 0 0 1729.41 0 0 1693.4 0 0 0 0 0 0 0 0 0 0 0 0 0 0 0 0 0 -665.99 0 0 0 0 0 0.05 0 0 67.3696 0 0 0 0 0 0 0 0 -2188.25 0 0 0 0 0 0 0 0 
0 0 0 0 0 0 0 0 0 0 0 0 0 0 0 0 0 0 0 671.026 0 0 0 0 1466.95 0 0 0 0 0 209.891 151.143 0 -272.454 0 0 1830.12 0 0 0 0 0 0 0 0 0 0.09 0 0 0 0 0 0 0 0 387.509 0 0 0 -1486.79 0 0 0 0 0 0 
0 0 0 2396.85 0 0 0 0 0 0 0 0 374.081 0 0 0 0 -261.773 0 0 0 0 0 0 0 2069.54 -1156.42 0 0 0 0 0 0 0 0 1098.59 0 0 0 0 0 0 0 0 0 0 0 0.07 -842.235 0 0 0 0 0 0 0 0 0 0 0 0 0 0 0 0 0 
0 0 0 0 220.725 0 0 0 0 0 0 0 0 0 0 0 0 0 0 0 0 0 0 0 0 0 0 1220.51 0 77.8985 0 1580.94 0 0 0 0 0 0 0 0 0 0 0 0 0 -1168.48 0 2455.9 0.09 0 0 0 0 -452.666 0 0 0 0 0 0 0 0 0 0 0 0 
0 0 0 0 0 0 0 0 0 0 0 0 1638.92 0 970.717 0 0 0 0 0 0 0 1497.31 0 0 0 0 0 0 0 924.482 0 0 0 0 0 0 0 0 0 0 0 -321.284 0 0 0 0 0 0 0.02 0 0 0 0 0 0 0 0 0 0 950.88 0 0 0 0 0 
0 1298.64 0 1693.24 0 -2232.2 0 1434.6 0 0 0 0 0 0 0 0 0 0 0 0 0 0 0 0 0 0 0 0 0 0 0 154.195 0 0 0 0 0 0 0 0 0 0 0 0 0 0 0 0 0 0 0.08 0 0 0 0 0 0 0 1881.54 0 367.977 0 0 0 0 0 
0 0 0 0 0 0 0 0 211.875 -2342.07 0 0 0 2127.22 0 0 0 0 0 0 0 0 0 0 0 952.254 0 0 0 0 0 0 0 0 0 0 0 0 0 0 0 0 0 0 0 0 0 0 0 0 0 0.01 0 0 458.007 0 0 0 0 0 0 -181.814 0 0 0 0 
0 0 0 0 -1148.18 0 -104.297 -1330.53 0 0 0 0 0 0 0 0 0 0 0 0 1874.52 0 0 2349.09 0 0 -833.842 0 0 607.852 0 0 0 0 0 0 0 0 0 0 0 0 0 0 -1410.95 0 0 0 0 0 0 0 0.03 640.66 0 0 0 0 0 0 0 0 0 0 0 0 
0 0 0 0 0 0 0 0 1444.98 0 2324.52 0 0 0 0 0 0 1126.67 0 1039.69 0 0 0 0 0 0 0 -1659.37 0 0 0 0 0 0 -229.881 0 0 0 0 0 0 0 0 0 0 0 0 0 -1995.68 0 0 0 -697.882 0.06 0 0 0 0 0 0 0 0 0 -315.485 0 0 
2237.69 0 0 0 0 -2119.43 0 0 0 0 0 0 987.35 0 0 0 0 0 0 0 0 0 0 -2163.84 0 0 0 0 0 0 0 0 0 0 0 0 0 0 0 0 0 0 0 1933.88 0 0 0 0 0 0 0 445.799 0 0 0.03 0 0 0 1182.82 0 0 0 0 0 0 0 
0 0 0 0 0 0 0 0 0 1275.75 0 0 0 445.799 0 0 0 98.4985 0 0 -1145.13 0 0 0 0 0 1265.98 0 0 0 0 0 0 0 0 0 0 0 0 908.46 0 0 0 0 0 0 883.435 0 0 0 0 0 0 0 0 0.04 0 0 0 1986.22 0 -143.056 -253.533 0 0 0 
0 0 1923.66 0 0 1072.19 0 0 1473.36 0 0 0 0 1442.53 0 1863.99 0 0 0 0 0 0 0 0 0 0 0 0 0 0 0 0 0 0 0 0 0 0 0 0 -1656.01 0 0 0 2193.75 0 0 0 0 0 0 0 0 0 0 0 0.08 0 0 0 -2029.1 493.561 0 0 0 0 
0 0 0 0 0 -1641.51 1188.92 0 0 0 0 0 -1127.28 0 0 0 0 0 542.695 0 0 0 0 0 0 0 0 0 1178.55 0 0 0 1741.16 0 0 -254.753 0 0 0 0 0 0 0 0 0 -1587.8 0 0 0 0 0 0 0 0 0 0 0 0.07 0 0 0 759.072 0 0 0 0 
0 0 0 0 0 0 0 0 0 0 0 0 -413.297 0 0 0 0 0 0 0 0 0 0 0 0 0 0 0 0 0 0 0 0 0 0 0 0 0 0 1551.79 0 0 0 0 2207.94 0 0 0 0 0 76.22 0 0 0 -321.284 0 0 0 0.02 0 0 0 0 0 0 0 
795.999 0 0 0 0 0 0 0 0 0 0 0 0 0 0 0 381.558 0 0 0 -57.9089 0 0 0 0 0 0 0 0 0 0 0 0 0 -1135.98 0 -1020.31 0 44.7859 0 0 1958.14 1341.82 0 0 0 366.146 0 0 0 0 0 0 0 0 583.59 0 0 0 0.08 0 0 0 0 -928.907 0 
0 0 0 0 -196.463 0 0 -933.485 0 0 0 0 0 0 0 0 0 0 -2008.19 0 0 0 2097.77 1317.41 0 0 0 0 0 0 390.103 0 0 0 0 0 0 0 0 0 0 0 0 0 0 0 0 0 0 -1058 788.064 0 0 0 0 0 -11.8259 0 0 0 0.08 0 0 0 0 0 
0 0 0 0 0 0 0 0 0 0 2124.93 0 0 0 0 0 0 0 0 0 0 0 0 0 0 0 0 0 0 0 1125.9 0 2146.29 0 0 0 0 0 0 0 0 0 0 0 0 0 0 0 0 0 0 1809.82 0 0 0 1513.49 -1066.24 2266.84 0 0 0 0.06 0 -1416.9 0 0 
0 0 0 0 0 0 0 0 0 0 0 2053.21 0 0 0 0 0 0 0 0 -705.969 0 0 0 0 0 0 0 0 0 0 0 0 0 1579.1 0 764.718 0 0 0 0 0 1369.29 0 0 0 0 0 0 0 0 0 0 0 0 504.395 0 0 0 0 0 0 0.06 0 0 0 
0 0 0 0 0 2121.27 0 0 0 -1261.56 0 0 0 0 2047.56 0 0 0 0 -104.144 0 0 -1361.66 0 0 0 0 0 0 0 0 0 1895.43 0 0 0 0 0 0 0 0 0 0 0 -1719.34 0 0 0 0 0 0 0 0 -1285.82 0 0 0 0 0 0 0 403.684 0 0.06 0 0 
0 0 0 0 0 0 0 0 0 0 0 0 0 222.709 0 0 0 0 0 0 0 0 0 0 0 0 0 226.218 0 0 0 0 0 -2129.66 0 1015.12 0 0 0 0 222.556 0 0 0 1908.25 0 0 0 0 0 0 0 0 0 0 0 0 0 0 1376 0 0 0 0 0.04 0 
0 0 0 0 0 0 0 0 -218.741 0 0 0 0 0 0 0 0 0 0 0 0 0 0 0 0 0 0 0 0 0 1509.98 0 0 0 0 0 0 0 0 1917.1 563.295 0 0 1329.31 0 0 0 0 0 0 0 0 0 0 0 0 0 0 0 0 0 0 0 0 0 0.04 
