*Vertices 55
*Matrix 
0.04 0 0 0 0 0 0 0 0 0 1757.94 0 -1050.07 0 17.1667 -1276.21 -792.337 0 0 0 0 0 1170.61 294.122 -942.03 0 0 1370.66 0 0 0 2058.85 1473.36 0 0 -1105.91 0 0 0 0 0 0 0 0 291.223 1704.99 0 0 701.849 0 -2369.23 0 0 0 0 
0 0.08 -1461.46 0 0 0 0 0 0 0 0 0 0 0 0 0 0 0 1701.94 1813.79 585.879 428.404 1376.46 0 1595.89 0 0 0 2242.27 0 0 0 0 0 0 1372.34 0 0 -1391.42 1760.54 0 -1844.92 0 0 0 0 -2367.09 0 0 2191.15 2075.33 0 1159.78 0 0 
0 -132.984 0.09 0 0 0 0 0 2261.8 0 2019.18 0 0 0 -2289.88 0 0 0 0 0 -1519.9 0 0 0 755.104 0 0 0 0 0 0 -549.715 0 0 0 0 0 0 1292.69 999.557 2484.89 942.793 0 0 1036.18 0 0 0 0 0 -1810.89 0 0 2225.03 0 
0 0 0 0 -233.238 1374.32 0 906.934 0 0 0 1643.04 0 0 0 0 0 0 0 0 0 0 0 0 0 0 2463.53 1312.37 0 200.888 0 0 0 0 0 0 -1690.95 0 0 225.913 0 0 0 371.792 0 0 0 -283.898 0 0 0 1565.22 0 0 0 
0 0 0 -963.24 0.09 0 2336.88 0 0 0 0 0 0 886.486 427.03 -910.901 -1313.59 2357.17 1116.44 0 0 0 3.12815 0 0 0 974.99 0 915.784 0 0 0 0 0 0 2194.66 0 -1678.44 1725.75 0 0 0 1928.85 2420.96 584.201 -1905.65 -1409.57 0 0 0 2069.08 0 0 0 195.09 
0 0 0 -849.406 0 0.08 0 -286.645 2077.62 -2344.66 0 0 -484.71 1299.55 2395.47 0 0 0 0 0 0 0 0 0 0 0 0 0 0 0 2433.32 0 0 1618.63 -1381.34 -1435.82 0 -239.189 0 0 2142.63 0 0 494.171 1494.11 0 0 0 2413.02 0 0 0 0 0 0 
0 0 0 0 2062.52 0 0.05 0 0 1019.7 1967.76 0 0 0 -1938 0 0 0 0 0 0 770.516 0 0 0 0 0 0 -78.5089 0 0 0 0 0 0 0 0 360.805 0 0 0 0 -2276.6 2264.24 0 944.472 0 0 0 0 0 387.051 0 0 0 
0 0 0 1799.6 0 -364.01 0 0 0 0 0 0 0 0 -1318.02 0 0 0 0 0 1038.47 0 0 0 0 -216.147 0 -2177.11 0 0 0 0 0 0 0 0 0 0 0 0 0 1878.8 0 64.4704 0 0 0 0 0 0 2196.95 0 0 0 0 
0 0 -407.041 0 0 -1896.19 0 0 0 0 0 0 1511.96 964.766 -816.294 1834.54 0 0 0 -531.861 0 0 -32.7311 0 0 0 1580.94 0 -1942.88 0 0 -2085.25 0 0 0 0 1309.02 0 0 0 0 0 0 0 0 0 1267.36 1381.95 0 0 0 0 0 0 0 
0 0 0 0 0 -468.23 1234.86 0 0 0.03 0 0 0 0 0 -146.413 134.51 0 -212.485 0 990.249 0 0 0 0 0 0 0 0 -569.857 720.923 1970.2 0 0 0 0 0 0 0 0 0 2255.7 0 0 821.787 2379.76 812.937 0 60.0452 0 0 -1096.15 0 0 0 
-2335.2 0 1307.95 0 0 0 1636.94 0 0 0 0.04 0 -1975.08 -648.595 0 0 0 1532.11 -645.238 0 1992.78 0 0 0 0 0 0 1605.96 -1401.18 419.858 0 0 0 0 0 -743.049 0 0 959.12 0 1354.95 921.735 -354.701 0 0 0 0 -421.995 -364.315 0 0 0 0 2181.84 0 
0 0 0 -373.775 0 0 0 0 0 0 0 0.05 0 0 0 0 1800.52 0 632.725 0 0 0 0 0 -740.913 0 0 0 2416.84 0 0 0 -1422.24 0 0 0 0 0 0 0 0 0 0 302.667 698.187 0 0 0 0 807.291 0 0 0 2264.7 0 
1086.69 0 0 0 0 2221.82 0 0 1409.27 0 -493.866 0 0.05 0 0 0 0 2355.49 736.183 -160.146 0 0 0 -1907.94 0 795.541 568.484 -630.131 2012.62 -771.584 1847.51 0 -2127.83 0 0 0 0 17.6244 0 1180.07 0 0 0 0 0 0 0 0 0 -257.347 0 0 0 0 1447.87 
0 0 0 0 284.814 666.448 0 0 1008.1 0 1723.46 0 0 0.01 0 -1397.82 0 0 -492.798 0 -1223.56 0 1899.4 0 0 663.396 0 0 0 0 0 0 -2153.92 0 0 -547.273 0 0 2329.55 0 1611.61 0 0 -66.4541 0 0 299.31 0 -392.392 0 0 0 0 1055.71 0 
2072.89 0 1040.6 0 1260.03 239.647 -942.03 1168.78 430.845 0 0 0 0 0 0 0 0 0 0 0 0 2055.19 0 0 0 0 0 -146.413 849.101 0 1567.05 0 446.104 0 0 0 1281.55 -1387.45 0 0 0 0 0 0 0 0 0 -1667.91 0 0 0 0 0 0 0 
481.048 0 0 0 341.273 0 0 0 1711.4 -1309.47 0 0 0 -2254.78 0 0.09 0 0 594.577 1025.19 0 0 0 0 0 0 -2182.76 0 0 2465.21 0 0 -1708.5 0 0 0 0 0 2333.83 0 0 0 0 406.125 0 2458.95 0 0 0 0 0 0 -2040.24 0 0 
1287.5 0 0 0 2108.91 0 0 0 0 2297.36 0 1789.68 0 0 0 0 0 2265.31 0 0 0 0 -1460.08 0 0 0 0 0 -1057.54 -51.1948 0 0 0 2194.05 0 0 2154.84 2465.21 0 1816.54 0 0 667.364 -1549.35 0 0 0 0 673.315 0 80.0348 0 0 0 2102.04 
0 0 0 0 1428.34 0 0 0 0 0 -1052.96 0 -267.418 0 0 0 787.454 0 0 1731.54 -2094.26 0 0 0 0 0 1224.78 0 0 1689.12 -141.682 1956.62 1337.4 0 -1547.98 0 0 0 -308.771 0 0 -2089.98 0 0 2277.21 -803.781 0 0 0 0 0 0 0 0 0 
0 -1730.78 0 0 2182.3 0 0 0 0 -225.761 1260.49 212.638 1375.09 -36.6985 0 -638.218 0 0 0.07 -829.569 0 1497.47 0 0 582.675 0 0 0 0 0 -751.747 0 0 -857.189 -801.187 0 0 0 0 0 -604.038 0 -905.255 0 0 -367.061 0 0 2283.62 0 0 1121.94 0 0 0 
0 -1064.26 0 0 0 0 0 0 -1705.76 0 0 0 1903.67 0 0 -2097.77 0 2413.17 235.527 0.07 1458.25 0 0 1735.05 0 0 0 0 677.129 0 0 -1092.18 -966.903 0 0 0 0 0 0 0 0 0 0 1090.04 0 0 0 0 0 -1414.91 687.353 -978.5 0 0 0 
0 732.215 483.489 0 0 0 0 1230.89 0 2492.83 -412.076 0 0 -1730.63 0 0 0 2266.08 0 121.998 0.03 0 0 0 281.915 0 0 0 0 0 0 0 -2353.97 743.202 0 0 0 680.181 1353.88 0 0 0 0 811.563 0 0 0 0 0 0 1304.9 332.728 0 0 0 
0 1030.23 0 0 0 0 1904.43 0 0 0 0 0 0 0 1349.45 0 0 0 -10.1474 0 0 0.04 0 -1677.68 0 0 1648.38 0 0 0 1282.77 0 0 -105.365 0 651.189 0 0 0 2399.75 0 0 0 0 0 0 0 0 0 0 0 496.46 0 0 0 
209.433 684.149 0 0 -2049.7 0 0 0 -1254.54 0 0 0 0 1187.86 0 0 2123.1 0 0 0 0 0 0.05 0 0 1190.76 1529.36 0 0 1711.1 0 0 356.685 0 617.008 900.83 0 0 0 0 0 0 0 0 670.11 0 0 0 0 0 -1636.48 0 0 0 0 
-924.635 0 0 0 0 0 0 0 0 0 0 0 1483.12 0 0 0 0 0 0 -1634.19 0 -2326.35 0 0.08 2357.33 0 2370.3 0 0 0 0 1102.86 0 1453.67 0 0 0 -117.725 1059.37 0 -576.571 0 0 0 0 0 2234.03 0 0 0 0 1828.14 0 0 0 
1225.39 864.513 707.343 0 0 0 0 0 0 0 0 768.38 0 0 0 0 0 0 -7.85852 0 2136.37 0 0 -2158.8 0.02 2045.73 0 0 0 0 0 -114.673 581.454 0 0 -1035.42 0 -542.238 0 1097.37 -1041.52 -2007.74 -654.851 0 0 0 -275.658 -811.869 0 0 0 0 0 0 0 
0 0 0 0 0 0 0 -1312.68 0 0 0 0 451.598 188.986 0 0 0 0 0 0 0 0 -1539.74 0 156.789 0.09 0 -917.768 0 0 1983.63 1616.49 0 0 791.116 0 -1304.13 0 0 0 0 403.226 0 0 0 0 0 0 0 311.67 0 0 0 2455.75 0 
0 0 0 1660.74 2139.42 0 0 0 -40.9711 0 0 0 46.0067 0 0 2247.92 0 -2281.18 0 0 0 343.562 -409.329 2094.56 0 0 0.02 1570.1 0 0 0 0 0 0 1166.8 0 0 0 0 0 2462.77 0 0 0 -1186.03 111.621 0 0 0 0 0 0 2072.28 0 0 
-1414.3 0 0 779.672 0 0 0 835.826 0 0 792.795 0 -1347.62 0 2199.7 0 0 0 0 0 0 0 0 0 0 1096 2125.84 0.06 2129.35 2047.11 0 0 0 0 0 -740.913 0 0 0 0 -1763.74 1461.61 0 0 0 0 0 0 0 0 0 1623.36 0 -1833.02 0 
0 2198.32 0 0 -1262.63 0 -1132.62 0 -1589.79 0 -499.359 117.573 1913.43 0 -98.8037 0 1525.7 0 0 -111.316 0 0 0 0 0 0 0 -2329.25 0.08 -808.206 2115.01 0 1826.76 0 0 0 -1141.32 0 0 0 0 0 0 1029.31 0 -710.089 -1826.3 0 0 2275.69 0 0 0 0 0 
0 0 0 -2105.24 0 0 0 0 0 2437.59 1130.33 0 1237.45 0 0 -863.903 -257.347 1986.83 0 0 0 0 1450.01 0 0 0 0 -1090.66 1671.73 0.07 0 0 0 0 0 0 1145.44 0 0 0 0 0 0 0 2366.33 0 0 0 0 0 -253.38 0 0 0 0 
0 0 0 0 0 873.669 0 0 0 306.635 0 0 288.018 0 253.99 0 0 1779.15 -333.491 0 0 132.527 0 0 0 -1537.6 0 0 253.838 0 0.07 -1397.98 0 2369.08 0 2483.98 0 0 2040.85 0 0 0 1549.65 0 0 33.9518 0 0 0 0 -1677.07 350.429 0 0 0 
-424.131 0 1636.48 0 0 0 0 0 1886.12 2252.19 0 0 0 0 0 0 0 1757.33 0 1495.48 0 0 0 -2324.52 -2129.35 -323.115 0 0 0 0 1146.96 0.01 829.417 0 0 2220.45 -1653.57 0 0 0 -1891.46 0 -1484.19 -400.327 0 0 0 0 0 1266.59 -733.741 1980.57 -1381.95 -586.032 0 
44.9385 0 0 0 0 0 0 0 0 0 0 2471.01 545.595 -799.966 1766.79 176.931 0 -1590.24 0 -1880.78 1738.87 0 -1900.01 0 1878.8 0 0 0 120.167 0 0 86.4437 0.01 1767.25 0 1724.22 -236.442 -2304.99 -693.609 0 433.287 -182.424 0 0 0 -445.036 1822.49 0 0 0 0 0 0 -663.244 0 
0 0 0 0 0 -736.183 0 0 0 0 0 0 0 0 0 0 506.226 0 1506.47 0 755.562 1185.26 0 1524.78 0 0 0 0 0 0 -2031.39 0 1211.97 0 0 0 0 0 0 0 -1402.25 0 0 0 0 0 0 0 56.0778 -1924.57 0 0 0 0 0 
0 0 0 0 0 -371.029 0 0 0 0 0 0 0 0 0 0 0 959.578 1706.06 0 0 0 268.944 0 0 1750.62 2100.82 0 0 0 0 0 0 0 0.09 -2319.48 1984.08 832.316 0 0 2255.7 0 0 935.011 0 0 1364.1 -2286.52 0 0 0 0 2075.79 2036.12 0 
2423.7 -1231.04 0 0 2235.4 -713.599 0 0 0 0 -1885.66 0 0 -2198.02 0 0 0 0 0 0 0 2006.52 1683.02 0 2100.51 0 0 -2293.24 0 0 -242.393 -236.595 -482.421 0 1257.9 0.05 2095.17 0 0 -1028.55 0 0 0 0 0 0 0 0 0 0 0 0 0 0 0 
0 0 0 2366.18 0 0 0 0 -274.133 0 0 0 0 0 858.409 0 2442.78 0 0 0 0 0 0 0 0 -575.503 0 0 -1091.27 -277.795 0 692.389 -1308.71 0 583.438 686.285 0.07 744.575 0 0 -1508 0 0 0 0 0 0 0 0 2309.72 144.734 -1941.36 0 0 0 
0 0 0 0 1997.21 -686.895 -1309.93 0 0 0 0 0 2276.15 0 -1068.53 0 159.078 0 0 0 1847.82 0 0 755.867 -553.224 0 0 0 0 0 0 0 2373.96 0 595.492 0 -273.98 0.03 0 -1228.9 336.543 0 0 0 0 0 0 2360.99 2210.84 0 0 0 0 0 0 
0 1468.63 2291.71 0 -108.57 0 0 0 0 0 -2254.63 0 0 2480.93 0 2449.34 0 1092.33 0 0 -1710.49 0 0 -2295.98 0 0 0 0 0 0 -589.236 0 811.258 0 0 0 0 0 0.01 -2393.34 0 0 0 0 411.161 -210.654 0 0 0 0 300.531 0 0 0 0 
0 -850.78 1381.34 1891.77 0 0 0 0 0 0 0 0 -83.697 0 0 0 -2069.69 0 0 0 0 -586.489 0 0 2100.97 0 0 0 0 0 0 0 0 0 0 552.614 0 1860.64 -703.223 0.07 0 0 0 0 0 0 0 0 0 0 -872.6 0 0 0 0 
0 0 -1720.56 0 0 666.753 0 0 0 0 -1191.67 0 0 1291.62 0 0 0 0 2260.73 0 0 0 0 -669.652 827.433 0 1684.39 -459.38 0 0 0 152.058 1816.23 714.515 1783.43 0 -1518.37 -973.006 0 0 0.07 0 0 0 1830.73 0 0 0 -1355.1 0 0 -221.183 0 0 -1867.66 
0 880.688 2294 0 0 0 0 1781.9 0 307.398 -994.98 0 0 0 0 0 0 1970.66 0 0 0 0 0 0 1047.47 -1310.69 0 942.183 0 0 0 0 2094.26 0 0 0 0 0 0 0 0 0.09 0 -2165.06 517.365 0 0 0 0 0 0 1580.48 0 0 0 
0 0 0 0 1589.33 0 1797.62 0 0 0 2088.15 0 0 0 0 0 -586.489 0 1451.69 0 0 0 0 0 2001.33 0 0 0 0 0 756.935 -739.387 0 0 0 0 0 0 0 0 0 0 0.06 736.183 0 0 0 0 0 680.181 0 0 0 0 0 
0 0 0 530.335 159.536 -237.358 1132.16 2194.36 0 0 0 2155.9 0 -594.577 0 1405.3 2068.62 0 0 1175.34 -2033.52 0 0 0 0 0 0 0 -363.094 0 0 -1870.56 0 0 2174.83 0 0 0 0 0 0 953.627 -67.5222 0 1673.1 0 0 0 0 0 0 0 -1329.31 0 0 
1638 0 360.042 0 -1094.62 -1561.71 0 0 0 2237.69 0 2039.78 0 0 0 0 0 -1670.35 0 0 0 0 2394.25 0 0 0 1685.31 0 0 -830.332 0 0 0 0 0 0 0 0 1477.48 0 -89.4955 -1274.68 0 140.309 0.03 0 0 0 0 0 0 0 0 0 0 
494.629 0 0 0 -393.612 0 655.461 0 0 1412.47 0 0 0 0 0 -222.709 0 -1560.79 2447.2 0 0 0 0 0 0 0 -1173.21 0 1610.39 0 1307.95 0 -86.5963 0 0 0 0 0 -948.592 0 0 0 0 0 0 0.06 0 0 0 778.451 0 0 0 0 0 
0 306.024 0 0 192.953 0 0 0 504.089 144.276 0 0 0 2236.47 0 0 0 0 0 0 0 0 0 -2286.37 95.4466 0 0 0 -1118.27 0 0 0 1366.85 0 1670.96 0 0 0 0 0 0 0 0 0 0 0 0.05 1008.56 0 0 0 2229.3 0 0 964.614 
0 0 0 -1702.09 0 0 0 0 -1348.99 0 2062.52 0 0 0 -579.623 0 0 0 0 0 0 0 0 0 -7.24815 0 0 0 0 0 0 0 0 0 2374.42 0 0 174.184 0 0 0 0 0 0 0 0 1522.34 0.01 0 -1608.86 0 1725.9 0 0 0 
2043.75 0 0 0 0 -1791.06 0 0 0 692.389 139.851 0 0 2082.96 0 0 -43.1074 0 -2254.48 0 0 0 0 0 0 0 0 0 0 0 0 0 0 -963.698 0 0 0 -44.7859 0 0 -765.786 0 0 0 0 0 0 0 0.06 389.035 0 2200.31 0 0 0 
0 2340.39 0 0 0 0 0 0 0 0 0 1640.29 -1334.5 0 0 0 0 0 0 1829.2 0 0 0 0 0 798.44 0 0 -2178.49 0 0 837.046 0 -1110.19 0 0 793.71 0 0 0 0 0 1896.95 0 0 -1220.66 0 -1625.19 1216.24 0.01 0 0 0 0 0 
-814.158 649.968 130.085 0 215.384 0 0 1052.81 0 0 0 0 0 0 0 0 -143.818 0 0 1976.15 -2432.4 0 1368.07 0 0 0 0 0 0 -1742.53 341.273 -1585.51 0 0 0 0 2378.23 0 -201.498 1194.11 0 0 0 0 0 0 0 0 0 0 0.07 -1583.38 0 0 1700.11 
0 0 0 2078.69 0 0 1450.77 0 0 -1543.55 0 0 0 0 0 0 0 0 1404.54 -1677.37 -284.204 446.104 0 1801.43 0 0 0 391.171 0 0 -22.9652 -2425.23 0 0 0 0 795.236 0 0 0 892.285 2089.53 0 0 0 0 -859.478 2179.1 -164.724 0 -1004.44 0.09 1157.49 0 0 
0 1777.47 0 0 0 0 0 0 0 0 0 0 0 0 0 -292.444 0 0 0 0 0 0 0 0 0 0 -1672.19 0 0 0 0 -2072.13 0 0 2313.38 0 0 0 0 0 0 0 0 -504.852 0 0 0 0 0 0 0 1656.62 0.04 0 0 
0 0 1619.08 0 0 0 0 0 0 0 -1898.79 -1003.52 0 -3.28074 0 0 0 0 0 0 0 0 0 0 0 -2322.84 0 943.556 0 0 0 758.766 829.264 0 1412.17 0 0 0 0 0 0 0 0 0 0 0 0 0 0 0 0 0 0 0.04 0 
0 0 0 0 1001.54 0 0 0 0 0 0 0 492.035 0 0 0 2045.27 0 0 0 0 0 0 0 0 0 0 0 0 0 0 0 0 0 0 0 0 0 0 0 2169.94 0 0 0 0 0 1929.3 0 0 0 1025.65 0 0 0 0.09 
