*Vertices 46
*Matrix 
0.04 0 0 770.974 2123.55 0 0 0 0 0 0 0 0 0 0 0 0 0 0 0 0 0 0 0 2419.89 0 0 0 0 0 1717.05 0 0 0 0 0 0 0 0 0 0 -1157.95 0 0 0 0 
0 0.04 1874.68 0 1071.58 -2369.53 0 0 0 0 0 0 2077.93 0 0 0 -1711.1 0 2280.42 0 0 0 0 0 0 0 0 0 0 0 0 0 542.848 0 0 -1922.13 0 0 2291.86 0 0 1846.75 0 0 0 0 
0 -812.021 0.08 0 0 1872.54 0 -2060.84 -446.715 0 0 0 0 0 0 0 138.478 1784.95 0 971.023 0 0 0 0 0 2433.62 0 -978.652 0 0 0 -64.3178 0 0 0 0 0 0 0 0 0 0 0 0 0 0 
1938.31 0 0 0.07 0 0 0 0 0 0 0 2414.85 0 -2012.16 0 0 -1431.85 0 0 0 0 0 0 0 0 0 0 0 0 1227.23 -382.931 0 0 0 0 0 0 0 0 0 0 426.878 0 0 0 0 
1363.95 -28.4585 0 0 0.05 0 0 0 0 0 0 0 0 1048.84 0 0 0 0 0 0 0 0 0 0 0 0 0 0 0 0 0 0 0 555.208 -2283.32 0 0 0 0 0 0 0 0 0 2294.61 2459.56 
0 1188.31 2033.52 0 0 0.09 0 0 0 0 -43.7178 0 0 0 0 0 0 0 1260.03 0 0 0 -2063.74 640.965 0 0 0 0 0 752.815 -806.07 -1410.03 0 0 0 1867.81 0 0 0 0 0 2068.47 0 0 0 0 
0 0 0 0 0 0 0 -377.59 0 0 0 0 -687.811 0 0 0 1586.43 0 0 0 0 0 0 447.63 0 1710.64 0 0 0 0 372.402 0 0 2327.88 2417.29 0 303.735 0 0 1497.62 0 0 2175.59 0 0 0 
0 0 1035.11 0 0 0 1688.67 0.09 0 2135.15 2239.98 0 0 0 0 0 0 0 0 0 0 0 -1717.05 0 0 0 0 0 340.663 730.232 0 0 0 1946.7 0 0 0 0 0 0 0 0 0 0 -2309.87 0 
0 0 2013.23 0 0 0 0 0 0.04 2230.22 0 320.978 0 0 0 0 -733.131 0 0 0 0 -1019.39 0 0 0 0 0 0 0 0 0 0 0 0 0 0 0 0 0 1361.05 0 0 0 -772.5 0 0 
0 0 0 0 0 0 0 -420.011 1872.69 0.06 0 0 -444.121 2496.49 0 762.123 -85.5281 0 0 0 0 0 0 0 0 0 0 0 1019.24 0 0 0 0 0 0 0 0 0 0 0 -1971.11 0 0 0 0 0 
0 0 0 0 0 -851.543 0 -872.448 0 0 0.05 2151.17 0 0 -337.306 1617.71 0 0 0 0 0 0 0 0 0 -550.63 0 0 0 0 0 0 0 0 0 0 0 1569.19 0 0 0 0 0 0 1408.51 0 
0 0 0 -1468.78 0 0 0 0 1915.88 0 1318.17 0.08 0 0 -582.522 0 0 0 0 0 0 0 0 0 0 0 0 0 0 0 0 0 0 0 0 0 0 0 -404.752 282.067 0 0 0 2196.8 0 0 
0 1824.63 0 0 0 0 488.067 0 0 2090.9 0 0 0.01 0 1723 0 0 -866.192 0 0 2324.21 1421.02 1649.91 0 0 0 0 0 0 1814.1 0 -235.832 0 0 0 0 0 0 0 0 0 0 0 0 0 0 
0 0 0 1257.9 1763.13 0 0 0 0 2181.23 0 0 0 0.05 0 0 0 0 0 0 0 0 -870.769 0 0 0 0 0 0 0 0 0 0 0 0 735.878 0 0 0 0 0 0 0 0 0 0 
0 0 0 0 0 0 0 0 0 0 141.682 1547.52 -336.238 0 0.09 0 1631.75 0 0 0 0 -2003.01 0 0 0 0 0 0 0 2103.56 0 0 0 0 1065.17 0 0 0 0 0 0 0 0 0 0 0 
0 0 0 0 0 0 0 0 0 17.3193 1191.06 0 0 0 0 0.06 0 0 0 0 0 0 0 0 0 0 0 0 0 0 0 0 0 0 0 1170.31 0 0 0 0 0 0 1994.92 0 0 0 
0 -2284.54 203.024 -31.9681 0 0 -673.467 0 768.838 1367.46 0 0 0 0 -1585.21 0 0.05 0 0 0 0 0 0 0 0 0 0 0 0 0 2121.72 0 0 0 2293.24 0 0 0 0 0 0 0 1327.94 -610.752 0 0 
0 0 128.864 0 0 0 0 0 0 0 0 0 2011.7 0 0 0 0 0.03 0 0 0 0 0 -2487.18 0 0 0 1908.7 0 0 0 0 0 0 0 0 0 0 0 0 0 0 0 -644.169 0 0 
0 756.935 0 0 0 239.952 0 0 0 0 0 0 0 0 0 0 0 0 0.07 0 0 0 0 1314.81 0 -648.595 12.8941 1601.69 838.572 0 518.738 0 0 0 0 198.294 0 0 -1211.51 0 0 -13.5044 0 0 0 0 
0 0 1388.97 0 0 0 0 0 0 0 0 0 0 0 0 0 0 0 0 0.05 0 0 0 0 0 0 0 -406.735 0 0 0 0 0 0 0 0 0 0 0 1486.48 0 0 0 0 0 0 
0 0 0 0 0 0 0 0 0 0 0 0 1839.27 0 0 0 0 0 0 0 0.07 1023.06 0 0 0 0 0 0 0 0 0 0 0 0 0 0 -325.556 0 2072.59 -2396.69 -2220.76 0 0 0 0 0 
0 0 0 0 0 0 0 0 1108.66 0 0 0 392.392 0 226.371 0 0 0 0 0 -608.005 0.04 0 0 0 0 0 0 0 0 0 0 0 0 0 0 0 0 2414.7 0 0 0 0 0 0 0 
0 0 0 0 0 2427.82 0 237.815 0 0 0 0 1453.67 -2182.15 0 0 0 0 0 0 0 0 0.02 0 0 0 0 0 0 0 0 0 0 0 633.641 2489.47 -792.337 1343.81 0 600.375 0 0 0 0 0 0 
0 0 0 0 0 1474.88 2036.27 0 0 0 0 0 0 0 0 0 0 840.709 -1367.76 0 0 0 0 0.02 0 0 0 0 0 0 0 0 0 0 0 0 0 0 1246.76 0 0 0 563.143 0 0 0 
2444.3 0 0 0 0 0 0 0 0 0 0 0 0 0 0 0 0 0 0 0 0 0 0 0 0.06 0 0 0 0 0 0 0 0 0 0 0 0 0 0 0 0 0 0 0 0 0 
0 0 -929.67 0 0 0 1234.55 0 0 0 -1312.98 0 0 0 0 0 0 0 1585.51 0 0 0 0 0 0 0.06 -763.955 0 2261.19 0 0 0 -241.173 0 0 -1735.51 1226.16 0 0 1173.67 523.927 0 0 0 0 0 
0 0 0 0 0 0 0 0 0 0 0 0 0 0 0 0 0 0 2053.67 0 0 0 0 0 0 1967.45 0.08 0 0 -621.433 0 0 0 -517.212 -2362.21 0 0 0 0 0 282.22 0 0 0 0 0 
0 0 2293.85 0 0 0 0 0 0 0 0 0 0 0 0 0 0 -1826.91 1518.83 -502.258 0 0 0 0 0 0 0 0.01 0 -483.489 -2185.35 0 0 0 1727.12 287.561 0 0 0 0 0 653.63 0 0 0 0 
0 0 0 0 0 0 0 2129.2 0 910.749 0 0 0 0 0 0 0 0 -1917.86 0 0 0 0 0 0 2366.48 0 0 0.01 165.792 0 -734.199 0 0 0 2340.69 0 0 0 0 0 0 0 0 0 0 
0 0 0 -2016.74 0 -1785.87 0 1635.11 0 0 0 0 2220.91 0 -1553.32 0 0 0 0 0 0 0 0 0 0 0 2215.11 -836.436 2261.5 0.09 0 0 0 0 0 0 0 0 2445.07 0 0 2301.63 -2172.38 0 0 0 
921.583 0 0 815.836 0 -590.609 2026.96 0 0 0 0 0 0 0 0 0 1994.92 0 -1672.34 0 0 0 0 0 0 0 0 -833.537 0 0 0.02 0 0 0 0 0 -991.928 0 2362.06 0 0 0 0 1808.6 0 0 
0 0 1902.14 0 0 1248.89 0 0 0 0 0 0 -1890.85 0 0 0 0 0 0 0 0 0 0 0 0 0 0 0 1895.89 0 0 0.08 0 0 904.95 0 0 0 0 0 -843.913 0 0 0 0 0 
0 441.221 0 0 0 0 0 0 0 0 0 0 0 0 0 0 0 0 0 0 0 0 0 0 0 1382.56 0 0 0 0 0 0 0.01 0 0 0 0 0 1997.36 0 0 0 0 0 -2072.89 0 
0 0 0 0 2264.55 0 -364.467 2144.92 0 0 0 0 0 0 0 0 0 0 0 0 0 0 0 0 0 0 -725.196 0 0 0 0 0 0 0.06 0 0 0 0 0 0 0 0 0 0 0 0 
0 0 0 0 281.304 0 1613.59 0 0 0 0 0 0 0 2293.24 0 2224.88 0 0 0 0 0 -564.974 0 0 0 -1039.08 -200.278 0 0 0 -2051.07 0 0 0.06 0 0 0 0 2165.36 1981.95 0 1336.63 0 0 -949.202 
0 -1613.44 0 0 0 -148.244 0 0 0 0 0 0 0 1817.3 0 1646.7 0 0 1967.6 0 0 0 -390.713 0 0 -1691.11 0 1999.8 1719.18 0 0 0 0 0 0 0.07 -73.9311 0 0 0 0 0 0 0 0 0 
0 0 0 0 0 0 1456.72 0 0 0 0 0 0 0 0 0 0 0 0 0 -2292.93 0 1661.96 0 0 253.533 0 0 0 0 2033.52 0 0 0 0 -135.884 0.05 0 0 0 -1006.27 -122.456 0 0 0 0 
0 0 0 0 0 0 0 0 0 0 -661.107 0 0 0 0 0 0 0 0 0 0 0 1304.9 0 0 0 0 0 0 0 0 0 0 0 0 0 0 0.07 0 0 0 0 0 0 0 0 
0 -287.255 0 0 0 0 0 0 0 0 0 2140.64 0 0 0 0 0 0 1345.94 0 1835.92 -1187.4 0 -2091.2 0 0 0 0 0 721.381 -2039.32 0 1724.83 0 0 0 0 0 0 1592.68 2253.41 0 -2352.14 0 0 0 
0 0 0 0 0 0 1157.64 0 282.372 0 0 1892.07 0 0 0 0 0 0 0 1401.03 2414.7 0 1478.55 0 0 -2294.76 0 0 0 0 0 0 0 0 806.223 0 0 0 1982.71 0 0 0 0 0 0 0 
0 0 0 0 0 0 0 0 0 644.475 0 0 0 0 0 0 0 0 0 0 1119.04 0 0 0 0 1474.73 2079.45 0 0 0 0 -724.891 0 0 892.59 0 -522.401 0 -794.168 0 0.04 0 2398.68 -706.885 0 0 
2363.89 1212.27 0 -2299.95 0 385.678 0 0 0 0 0 0 0 0 0 0 0 0 1362.27 0 0 0 0 0 0 0 0 1630.22 0 -2180.93 0 0 0 0 0 0 -377.743 0 0 0 0 0.08 0 0 0 0 
0 0 0 0 0 0 2222.89 0 0 0 0 0 0 0 0 652.104 -1919.39 0 0 0 0 0 0 2419.89 0 0 0 0 0 2440.03 0 0 0 0 -65.2333 0 0 0 831.248 0 2420.5 0 0.09 0 0 0 
0 0 0 0 0 0 0 0 2154.38 0 0 1825.54 0 0 0 0 1140.1 -327.845 0 0 0 0 0 0 0 0 0 0 0 0 -2065.11 0 0 0 0 0 0 0 0 0 306.33 0 0 0.06 0 0 
0 0 0 0 1706.21 0 0 2342.98 0 0 46.0067 0 0 0 0 0 0 0 0 0 0 0 0 0 0 0 0 0 0 0 0 0 -9.23185 0 0 0 0 0 0 0 0 0 0 0 0 0 
0 0 0 0 1630.38 0 0 0 0 0 0 0 0 0 0 0 0 0 0 0 0 0 0 0 0 0 0 0 0 0 0 0 0 0 540.101 0 0 0 0 0 0 0 0 0 0 0.06 
