*Vertices 61
*Matrix 
0.01 0 0 0 0 956.679 0 0 0 0 0 0 0 0 0 0 -349.818 0 0 0 0 1328.39 0 1594.97 2303.31 0 0 0 2156.51 827.738 -909.68 -2192.53 0 -2232.51 0 -1559.42 550.172 421.995 0 0 0 0 -1814.86 1446.5 0 0 0 0 0 0 1203.73 0 0 0 -1096.91 0 0 0 667.211 1767.4 0 
0 0.08 0 -230.644 0 0 0 0 0 1468.02 0 0 -1318.17 892.132 1991.1 0 -1032.98 0 0 0 0 0 0 0 0 0 1383.94 1632.66 0 -1332.21 0 0 0 0 0 0 0 902.356 0 0 0 2040.7 0 0 0 -1163.75 0 0 136.494 0 0 0 0 0 0 0 0 0 0 0 0 
0 0 0 0 0 0 2423.55 0 0 0 0 0 0 -1522.8 756.935 0 0 0 0 0 0 0 0 0 1035.26 0 0 0 0 0 -405.21 0 0 0 0 0 1636.78 0 0 -231.407 -1755.81 0 0 0 0 0 1625.49 0 0 0 0 0 0 0 0 1744.67 0 0 0 0 0 
0 1449.1 0 0.02 1795.18 0 0 2193.14 -2374.57 0 0 0 0 1448.03 -1600.01 -706.58 0 0 0 0 0 0 -667.364 0 0 0 0 0 -333.796 0 0 0 1934.8 0 0 0 0 0 0 0 0 1491.36 0 0 1749.55 0 2482.3 0 0 0 0 0 0 0 0 0 0 705.359 0 0 0 
0 0 0 761.666 0.07 0 0 1566.13 0 0 0 -2265.62 0 0 0 0 0 0 0 0 0 0 1191.37 0 0 0 0 1475.65 0 0 0 0 0 0 0 0 0 0 0 610.294 0 0 0 0 0 0 0 0 0 -227.897 0 0 0 0 0 0 0 0 0 0 0 
682.928 0 0 0 0 0.04 0 0 0 436.186 0 0 0 0 -438.017 0 0 0 176.016 1352.96 -271.233 0 0 0 715.888 0 0 0 0 0 0 1092.79 0 2231.89 0 0 0 0 1423.92 0 0 0 -658.208 0 0 0 0 0 0 0 0 0 0 0 0 0 -14.8778 0 0 0 0 
0 0 2010.94 0 0 0 0.03 0 0 0 0 0 770.974 0 0 0 -856.578 0 0 0 0 2025.28 0 26.4748 0 0 0 0 0 0 0 0 0 2483.98 0 0 374.996 0 0 0 0 0 193.564 0 851.085 -2003.31 0 0 0 0 0 0 0 0 0 0 0 0 0 0 0 
0 0 0 -211.112 1582.46 0 0 0.01 0 350.581 0 1042.28 -1549.35 0 0 0 0 0 0 0 0 1674.02 0 0 0 -528.657 1356.93 0 1590.09 2260.89 0 -1037.1 0 0 0 0 0 0 0 1793.65 0 0 -561.617 0 0 -1881.08 0 -653.63 0 0 0 0 0 0 0 0 0 0 0 1504.33 -1496.55 
0 0 0 1029.01 0 0 0 0 0.04 0 -698.95 0 996.353 -2262.87 0 -564.058 0 0 -148.549 0 2028.49 937.147 0 0 0 0 0 0 1964.25 127.338 0 0 225.913 1942.73 0 -2111.04 0 0 0 0 0 1925.18 0 0 0 0 0 0 0 0 0 0 0 0 0 0 -455.718 0 0 0 0 
0 1600.01 0 0 0 -272.454 0 2371.21 0 0.05 -42.6496 0 -1883.98 0 0 0 0 -1596.5 0 0 0 0 0 0 0 0 0 0 0 0 -172.811 0 -2483.98 -1562.93 0 2298.88 0 0 0 0 529.572 0 1622.29 391.171 0 0 0 0 0 0 0 0 1677.53 0 0 0 0 -1349.3 0 0 0 
0 0 0 0 0 0 0 0 1561.86 -1085.62 0.08 0 0 864.666 0 1489.68 440.153 0 0 0 -376.98 0 0 0 632.42 0 0 0 0 0 -1139.48 0 0 437.101 -130.238 -1957.38 0 0 2084.19 2266.08 0 -1647.77 0 0 0 0 0 0 0 0 0 0 0 0 0 0 0 0 0 0 0 
0 0 0 0 -1001.39 0 0 -1739.78 0 0 0 0.06 0 -287.255 0 0 0 0 2224.88 0 0 0 0 1808.76 1767.1 1051.9 837.046 0 0 0 0 0 2234.79 -2198.78 0 0 0 0 0 1308.56 0 0 0 0 0 0 0 0 0 0 0 380.49 0 0 0 -425.81 0 0 0 0 0 
0 -424.589 0 0 0 0 555.055 -934.858 1094.16 384.457 0 0 0.08 0 -921.125 0 2009.11 0 0 0 41.5815 0 2021.32 0 -918.531 0 0 0 0 0 0 0 1786.02 333.796 0 0 0 0 -1258.96 0 0 0 0 -571.688 0 0 0 0 0 0 0 0 0 0 0 0 0 0 0 -475.402 0 
0 1586.43 -193.564 -819.956 0 0 0 0 2383.72 0 -753.578 2069.08 0 0.01 0 0 0 0 1900.16 -2009.72 2015.82 0 0 207.755 0 0 0 0 0 0 0 2176.5 143.818 0 0 0 0 -554.445 0 0 0 0 304.346 0 0 0 -897.015 2272.64 0 0 -721.992 0 0 0 0 -1428.34 0 0 0 0 0 
0 2218.62 2217.25 828.959 0 -892.438 0 0 0 0 0 0 638.371 0 0.08 0 0 0 0 0 0 0 0 0 0 1469.24 0 0 0 -1168.17 0 0 1061.82 0 0 0 -767.006 945.235 0 156.636 0 -1942.27 0 0 0 0 0 0 0 703.07 1273.77 0 0 0 0 0 0 0 0 0 0 
0 0 0 1282.62 0 0 0 0 1838.36 0 1821.12 0 0 0 0 0.09 0 0 0 0 433.592 -401.395 607.7 1979.2 0 0 471.435 0 0 755.562 0 0 -1962.72 0 0 0 971.786 0 0 0 0 0 1627.02 0 0 0 0 0 0 0 0 0 0 -2477.26 -1844 0 0 0 0 0 0 
-2158.8 918.378 0 0 0 0 734.657 0 0 0 1741 0 1002.15 0 0 0 0.05 862.072 0 0 671.331 0 1390.04 -1128.8 0 1205.4 0 0 0 0 0 0 0 -252.617 0 0 0 0 0 -903.882 0 899.915 0 0 1009.78 0 0 0 0 2115.16 0 0 0 0 0 0 -1564 0 0 0 0 
0 0 0 0 0 0 0 0 0 -1514.4 0 0 0 0 0 0 1000.93 0.07 0 -684.301 0 0 465.178 0 992.691 0 0 2099.6 0 0 0 0 0 0 0 -111.621 0 0 0 -1584.29 1014.21 0 1006.12 0 0 0 0 0 1499.76 0 0 0 0 0 0 0 0 0 0 1859.72 0 
0 0 0 0 0 -99.7192 0 0 -504.852 0 0 1757.18 0 1492.13 0 0 0 0 0.05 0 0 0 992.538 -1708.04 0 0 0 0 0 0 0 0 -883.282 0 0 870.617 -850.017 0 0 2015.82 0 2332.91 2227.77 -1890.39 227.287 0 0 0 -181.051 0 0 0 0 0 0 0 0 0 -561.769 0 0 
0 0 0 0 0 2066.79 0 0 0 0 0 0 0 -504.242 0 0 0 2226.25 0 0.05 0 725.196 0 0 133.747 0 0 0 0 0 0 0 2279.66 0 2399.9 0 0 0 0 0 0 0 0 0 0 0 0 0 0 0 0 0 2141.56 -1102.71 0 0 0 0 -194.784 0 2287.74 
0 0 0 0 0 2493.59 0 0 1466.49 0 129.627 0 -1999.8 2263.94 0 288.018 -1302.3 0 0 0 0.02 0 0 2137.14 546.815 0 -1770.76 0 0 2082.2 0 614.109 0 -1162.98 0 0 -566.195 0 0 0 0 0 -43.8704 0 0 0 0 0 0 0 0 0 0 0 0 0 798.898 0 0 0 -851.543 
-941.267 0 0 0 0 0 1800.67 652.715 624.485 0 0 0 0 0 0 627.384 0 0 0 744.728 0 0.07 351.344 0 0 0 0 0 -653.63 0 -831.248 0 602.359 0 0 0 0 -1623.36 0 1713.54 0 0 0 0 0 0 0 0 0 -479.98 0 0 0 0 0 0 0 0 0 0 0 
0 0 0 824.839 477.996 0 0 0 0 0 0 0 -272.759 0 0 -338.221 1994.31 966.445 -171.896 0 0 1410.34 0.02 0 0 0 0 0 0 -1235.31 0 -1188.92 -2266.08 -472.35 0 0 1759.01 -95.7518 1591.92 1511.66 1451.69 0 838.878 0 0 0 0 0 0 0 0 0 0 0 0 0 0 0 -1034.65 0 0 
407.651 0 0 0 0 0 2494.81 0 0 0 0 -672.246 0 1325.04 0 1938.92 1701.18 0 1957.69 0 1961.65 0 0 0.04 0 -140.309 -1200.67 0 -931.043 0 -2040.54 0 1215.63 2210.84 0 -929.823 0 0 0 0 0 0 0 0 0 0 0 0 0 800.882 0 0 0 0 0 0 0 1133.99 0 0 0 
900.067 0 2293.39 0 0 -1609.62 0 0 0 0 1222.95 653.63 574.892 0 0 0 0 1964.86 0 -162.893 -351.955 0 0 0 0.06 2054.43 0 0 0 0 0 0 0 0 0 1046.56 0 0 0 1258.96 0 -1309.47 0 0 0 1084.55 0 0 -48.2955 0 625.401 0 -466.704 0 0 0 0 0 0 0 0 
0 0 0 0 0 0 0 -74.2363 0 0 0 1495.33 0 0 1579.87 0 1309.02 0 0 0 0 0 0 2184.29 219.352 0 0 -514.771 -2030.78 -1114 0 0 0 0 0 0 0 0 0 0 0 0 0 0 0 0 0 0 0 0 -1391.26 751.747 0 0 -1064.71 0 0 0 0 0 0 
0 -387.051 0 0 0 0 0 1046.71 0 0 0 1004.59 0 0 0 1964.4 0 0 0 0 -25.2541 0 0 919.599 0 0 0.08 0 0 0 0 53.9415 0 -826.518 0 2116.69 0 224.235 0 -967.818 14.1148 0 1049.61 0 0 -2128.59 0 0 0 -1826.3 0 -1423.61 0 0 1361.51 0 0 0 0 0 0 
0 -698.187 0 0 413.602 0 0 0 0 0 0 0 0 0 0 0 0 1042.13 0 0 0 0 0 0 0 -318.232 0 0.04 0 0 0 0 471.282 0 -725.501 0 0 0 0 0 0 1055.86 -355.007 2479.55 0 0 0 0 0 0 0 0 0 0 0 -2222.28 0 0 0 0 0 
-2303.31 0 0 -2267.45 0 0 0 2425.84 607.089 0 0 0 0 0 0 0 0 0 0 0 0 2246.7 0 47.0748 0 1777.47 0 0 0.07 0 0 0 406.278 0 0 0 -333.186 0 0 0 0 2460.02 1229.82 0 0 0 0 821.177 0 0 0 0 0 0 0 0 0 0 0 0 0 
2139.27 1967.45 0 0 0 0 0 -1252.4 1179.31 0 0 0 0 0 2458.8 -267.113 0 0 0 0 2421.57 0 -575.655 0 0 1792.89 0 0 0 0 0 0 0 0 0 0 0 1861.4 0 0 -799.356 1717.96 0 0 0 0 0 0 0 0 0 0 0 0 0 0 0 0 0 0 0 
2271.87 0 2391.35 0 0 0 0 0 0 709.174 1187.25 0 0 0 0 0 0 0 0 0 0 1350.52 0 -63.4022 0 0 0 0 0 0 0.03 0 0 0 0 0 -814.615 0 0 0 -1087.6 208.213 0 0 0 0 0 0 0 0 0 0 0 0 0 -1713.69 0 0 0 0 0 
2374.42 0 0 0 0 2204.12 0 476.47 0 0 0 0 0 -1901.84 0 0 0 0 0 0 177.847 0 825.602 0 0 0 2148.58 0 0 0 0 0 0 0 0 0 -1612.06 463.805 0 0 2380.21 0 1810.59 0 0 0 0 -1129.57 0 0 0 -512.329 0 0 0 -2048.33 0 0 0 -1814.4 0 
0 0 0 -704.291 0 0 0 0 105.518 979.11 0 2102.5 2367.55 118.946 -1686.68 -595.035 0 0 997.574 447.63 0 -2359.16 -667.516 1706.82 0 0 0 -2401.27 1505.1 0 0 0 0.05 0 0 0 1270.87 1174.89 2198.17 0 647.069 0 0 0 0 1889.32 2189.47 2398.07 0 0 -141.987 0 0 0 0 1401.18 0 0 0 449.767 0 
1821.88 0 0 0 0 2431.18 -1769.84 0 -212.333 206.992 1996.14 -728.553 -1761.45 0 0 0 282.067 0 0 0 2463.53 0 -358.516 -1023.06 0 0 1338.31 0 0 0 0 0 0 0.07 0 -1167.26 0 0 1718.57 0 0 0 -292.444 0 0 0 0 271.538 -317.927 0 0 0 0 0 0 2465.36 -1414.46 0 0 0 0 
0 0 0 0 0 0 0 0 0 0 -173.727 0 0 0 0 0 0 0 0 1855.6 0 0 0 0 0 0 0 1598.94 0 0 0 0 0 0 0.04 1849.04 -528.199 945.845 349.818 0 1716.74 0 0 220.725 0 0 0 0 0 0 0 0 0 2195.88 0 -737.098 0 0 0 0 0 
2348.48 0 0 0 0 0 0 0 -1353.57 2300.1 1014.82 0 0 0 0 0 0 -356.227 -1665.47 0 0 0 0 723.67 -170.98 0 1066.24 0 0 0 0 0 0 -2395.47 944.014 0.08 -2268.06 728.248 0 0 1815.16 0 0 0 0 0 0 0 0 0 0 0 0 0 0 0 0 0 0 0 2465.06 
1258.51 0 2314.45 0 0 0 -1877.27 0 0 0 0 0 0 0 2152.55 -376.37 0 0 1866.89 0 -1837.75 0 303.278 0 0 0 0 0 877.941 0 1024.89 -1816.23 697.577 0 604.495 173.116 0.06 -963.851 0 2086.02 1621.83 589.999 0 2419.89 0 0 0 0 0 -795.236 0 0 0 1383.94 0 0 0 0 0 0 0 
552.004 -2368.92 0 0 0 0 0 0 0 0 0 0 0 498.901 468.688 0 0 0 0 0 0 806.68 2265.31 0 0 0 -107.501 0 0 243.767 0 1776.71 1963.48 0 100.94 -1564.3 2148.58 0.04 0 -1896.19 0 222.098 0 0 0 0 0 0 0 0 0 0 -1277.43 0 0 0 -2359.31 0 0 0 0 
0 0 0 0 0 1868.88 0 0 0 0 936.842 0 1785.56 0 0 0 0 0 0 0 0 0 899.762 0 0 0 0 0 0 0 0 0 1702.4 2393.8 -705.054 0 0 0 0.04 1783.27 0 -2040.85 0 0 0 0 0 -80.4926 0 0 0 0 0 0 0 0 -801.492 0 499.359 0 0 
0 0 -1092.94 0 -13.657 0 0 876.72 0 0 1030.99 -352.26 0 0 297.479 0 566.652 1447.26 -638.523 0 0 -1636.94 217.063 0 -622.044 0 -2248.07 0 0 0 0 0 0 0 0 0 -939.131 2333.67 1763.89 0.03 1703.77 0 0 0 0 1881.69 0 0 0 0 0 0 0 -1890.09 0 0 0 0 0 0 0 
0 0 -450.987 0 0 0 0 0 0 1368.37 0 0 0 0 0 0 0 1994.77 0 0 0 0 -1012.38 0 0 0 1028.4 0 0 -1863.08 -405.057 1003.83 1785.87 0 -941.878 804.544 863.445 0 0 688.726 0.01 0 2356.26 0 0 0 0 0 0 0 0 538.423 0 -1354.49 0 0 0 0 0 0 0 
0 -1164.05 0 2413.94 0 0 0 0 1438.11 0 -4.34889 0 0 0 1899.4 0 -422.3 0 659.734 0 0 0 0 0 2086.47 0 0 -995.59 2090.9 938.826 -2112.26 0 0 0 0 0 274.59 546.815 514.313 0 0 0.03 0 -1715.83 0 0 0 0 0 0 0 0 0 0 0 0 505.005 -2032.61 0 0 0 
-2192.98 0 0 0 0 918.836 1526.92 265.435 0 -123.218 0 0 0 836.894 0 -2131.95 0 1065.02 1381.95 0 -966.597 0 1939.53 0 0 0 175.1 952.406 406.735 0 0 2148.27 0 1975.39 0 0 0 0 0 0 -2055.35 0 0.06 0 2120.5 0 0 0 0 0 0 1196.55 0 0 0 0 0 0 1568.88 0 0 
-2143.09 0 0 0 0 0 0 0 0 2223.2 0 0 409.329 0 0 0 0 0 2097.31 0 0 0 0 0 0 0 0 2055.04 0 0 0 0 0 0 1523.41 0 999.252 0 0 0 0 -1426.82 0 0.06 603.427 0 0 0 0 0 0 0 0 1441.92 0 0 0 0 0 0 0 
0 0 0 -1030.38 0 0 2442.01 0 0 0 0 0 0 0 0 0 1924.88 0 688.726 0 0 0 0 0 0 0 0 0 0 0 0 0 0 0 0 0 0 0 0 0 0 0 1856.21 1555.15 0.06 0 1763.44 0 0 0 0 0 0 0 0 0 0 0 0 0 0 
0 2094.1 0 0 0 0 2491 1647.92 0 0 0 0 0 0 0 0 0 0 0 0 0 0 0 0 2296.29 0 1399.96 0 0 0 0 0 -1316.8 0 0 0 0 0 0 1196.4 0 0 0 0 0 0.03 0 0 0 0 0 0 0 0 0 0 0 0 0 0 1979.05 
0 0 -2367.24 788.675 0 0 0 0 0 0 0 0 0 -594.729 0 0 0 0 0 0 0 0 0 0 0 0 0 0 0 0 0 0 1228.29 0 0 0 0 0 0 0 0 0 0 0 2130.27 0 0.08 0 0 0 0 0 0 0 0 0 0 0 0 0 0 
0 0 0 0 0 0 0 124.134 0 0 0 0 0 1275.75 0 0 0 0 0 0 0 0 0 0 0 0 0 0 -1710.94 0 0 897.168 628.91 185.324 0 0 0 0 1542.48 0 0 0 0 0 0 0 0 0.08 0 0 0 0 0 0 0 546.663 0 0 0 0 -544.679 
0 1080.43 0 0 0 0 0 0 0 0 0 0 0 0 0 0 0 2108.6 759.377 0 0 0 0 0 213.095 0 0 0 0 0 0 0 0 1904.89 0 0 0 0 0 0 0 0 0 0 0 0 0 0 0 0 0 0 0 0 0 0 0 0 0 0 0 
0 0 0 0 1380.28 0 0 0 0 0 0 0 0 0 846.812 0 -1687.75 0 0 0 0 1647.01 0 2259.82 0 0 2187.34 0 0 0 0 0 0 0 0 0 466.704 0 0 0 0 0 0 0 0 0 0 0 0 0.06 0 0 0 0 -1637.39 0 0 55.1622 0 -1643.96 0 
1492.58 0 0 0 0 0 0 0 0 0 0 0 0 1291.92 1920.15 0 0 0 0 0 0 0 0 0 -252.007 32.8837 0 0 0 0 0 0 89.9533 0 0 0 0 0 0 0 0 0 0 0 0 0 0 0 0 0 0 2400.97 0 0 0 0 0 0 0 0 0 
0 0 0 0 0 0 0 0 0 0 0 2385.4 0 0 0 0 0 0 0 0 0 0 0 0 0 258.873 1419.03 0 0 0 0 2442.78 0 0 0 0 0 0 0 0 -2276.91 0 2199.7 0 0 0 0 0 0 0 -1200.83 0.05 0 -630.284 0 0 0 0 332.881 124.897 0 
0 0 0 0 0 0 0 0 0 -1410.49 0 0 0 0 0 0 0 0 0 2445.37 0 0 0 0 56.6881 0 0 0 0 0 0 0 0 0 0 0 0 1186.18 0 0 0 0 0 0 0 0 0 0 0 0 0 0 0.03 0 1482.21 0 0 0 0 0 0 
0 0 0 0 0 0 0 0 0 0 0 0 0 0 0 -128.712 0 0 0 -615.177 0 0 0 0 0 0 0 0 0 0 0 0 0 0 578.249 0 2171.32 0 0 1164.51 1943.19 0 0 -2495.73 0 0 0 0 0 0 0 -1540.8 0 0.02 0 0 0 1856.97 0 0 0 
667.821 0 0 0 0 0 0 0 0 0 0 0 0 0 0 984.756 0 0 0 0 0 0 0 0 0 1038.93 554.292 0 0 0 0 0 0 0 0 0 0 0 0 0 0 0 0 0 0 0 0 0 0 464.721 0 0 267.113 0 0.01 0 -237.663 0 0 0 0 
0 0 803.323 0 0 0 0 0 0 0 0 741.066 0 2239.83 0 0 0 0 0 0 0 0 0 0 0 0 0 -1002 0 0 -2163.08 1699.8 -1444.67 -2353.21 2044.66 0 0 0 0 0 0 0 0 0 0 0 0 539.796 0 0 0 0 0 0 0 0.01 0 0 -6.94296 0 0 
0 0 0 0 0 -659.124 0 0 204.093 0 0 0 0 0 0 0 -474.792 0 0 0 -702.002 0 0 0 0 0 0 0 0 0 0 0 0 653.172 0 0 0 1795.18 1862.62 0 0 1096.61 0 0 0 0 0 0 0 0 0 0 0 0 -555.666 0 0.09 0 0 0 0 
0 0 0 -37.4615 0 0 0 0 0 1825.54 0 0 0 0 0 0 0 0 0 0 0 0 0 -275.201 0 0 0 0 0 0 0 0 0 0 0 0 0 0 0 0 0 1922.9 0 0 0 0 0 0 0 -268.334 0 0 0 2116.08 0 0 0 0.05 0 0 0 
-28.1533 0 0 0 0 0 0 0 0 0 0 0 0 0 0 0 0 0 2265.92 1316.49 0 0 1940.6 0 0 0 0 0 0 0 0 0 0 0 0 0 0 0 -2357.63 0 0 0 -1267.05 0 0 0 0 0 0 0 0 1746.96 0 0 0 -1124.53 0 0 0 0 0 
1963.03 0 0 0 0 0 0 -1316.19 0 0 0 0 353.633 0 0 0 0 -2462.77 0 0 0 0 0 0 0 0 0 0 0 0 0 989.181 1663.79 0 0 0 0 0 0 0 0 0 0 0 0 0 0 0 0 1764.05 0 -1276.67 0 0 0 0 0 0 0 0 0 
0 0 0 0 0 0 0 626.621 0 0 0 0 0 0 0 0 0 0 0 359.432 -393.155 0 0 0 0 0 0 0 0 0 0 0 0 0 0 1612.67 0 0 0 0 0 0 0 0 0 -50.5844 0 267.876 0 0 0 0 0 0 0 0 0 0 0 0 0.09 
