*Vertices 65
*Matrix 
0 0 2452.09 1287.8 2416.99 0 0 -1070.97 0 0 0 0 0 0 0 0 365.535 1161.31 0 0 849.406 0 0 229.118 0 0 0 0 0 0 0 1206.17 -303.888 0 1755.5 -147.633 0 0 1453.98 0 0 0 0 0 0 0 0 0 0 -1702.86 0 0 1959.06 0 0 0 0 0 0 0 0 0 0 414.365 0 
0 0.03 0 0 0 0 0 0 0 575.35 0 0 0 0 2468.87 0 49.6689 0 0 879.772 0 0 411.313 0 -2260.73 0 0 0 0 0 0 0 0 0 0 0 0 0 880.84 1651.28 0 0 0 0 1992.02 0 0 0 0 0 0 459.075 0 0 0 0 0 0 0 0 -1288.72 0 0 1314.05 0 
-1900.01 0 0.06 1484.19 0 -1713.69 0 0 0 0 0 -939.283 1630.38 -797.83 0 0 1834.85 0 0 163.045 0 1871.32 0 -2378.38 0 0 0 0 0 0 0 0 0 0 0 528.047 0 0 0 2115.92 0 0 -1050.83 0 0 0 1348.23 1678.29 0 0 0 0 0 1975.39 1950.06 -21.2867 0 0 -1675.39 0 0 0 -2402.95 0 0 
2343.59 0 317.774 0.03 -1326.56 0 0 0 0 0 2449.8 0 0 0 0 0 0 1741.31 0 0 2241.2 0 0 199.21 0 0 -1656.47 0 536.592 0 0 0 0 0 0 0 0 -217.673 0 1559.27 0 -1236.38 0 0 0 1056.17 0 2269.13 0 -331.965 0 2238.76 0 0 0 0 0 0 0 0 0 0 0 0 -1125.45 
1862.32 0 0 -663.701 0.05 0 0 0 0 0 0 0 -1629.61 0 891.675 0 -781.35 0 0 0 300.836 0 0 0 2151.94 0 0 821.94 0 -78.6615 0 0 0 0 0 0 0 0 0 0 0 0 0 -82.6289 0 -518.433 0 0 0 0 -211.112 0 0 1549.96 0 0 0 1216.85 0 -2360.07 0 0 0 0 0 
0 0 99.414 0 0 0.08 0 1855.14 0 0 0 755.867 0 0 1042.28 0 0 0 0 0 2104.02 2057.63 -765.481 0 0 0 0 1823.1 0 0 1113.24 0 0 0 0 0 0 0 0 0 0 0 1596.35 1098.28 0 0 0 0 2237.39 0 0 0 0 0 2058.85 0 0 -683.386 0 0 0 0 0 0 0 
0 0 0 0 0 0 0.05 0 0 0 0 0 0 0 -994.98 0 0 0 0 0 0 0 0 0 0 0 0 0 0 -1907.64 0 0 0 0 0 0 0 0 0 0 2058.85 0 0 0 0 0 0 -193.106 0 2110.13 0 0 2378.69 0 0 1978.13 0 0 0 0 0 0 0 0 0 
-1.75481 0 0 0 0 -721.839 0 0.08 0 0 0 0 0 527.741 0 0 -2135 1300.93 0 0 0 2394.71 -1578.65 0 0 0 -1886.43 0 0 1171.68 0 -1671.73 0 -423.978 0 0 1208.91 -1431.24 0 0 2222.59 0 -65.2333 570.467 0 2257.84 2393.34 2093.95 -1350.52 111.011 0 0 0 0 -309.076 0 0 0 -1221.73 0 0 0 1274.99 2048.48 -1193.96 
0 0 0 0 0 0 0 0 0.05 102.161 -1414.15 0 1202.05 0 0 0 0 0 1248.28 0 0 0 1271.17 0 0 0 -470.519 462.584 0 0 2452.24 0 0 0 0 2362.06 0 768.075 0 0 0 0 0 0 0 0 0 0 0 0 1948.99 1486.79 0 -1898.18 353.175 0 0 0 335.627 240.257 0 0 0 0 0 
0 -1189.69 0 0 0 0 0 0 1601.69 0.04 0 0 0 0 0 0 0 0 0 0 604.343 0 -994.064 0 0 0 210.349 0 0 0 0 0 0 -2013.23 0 0 0 2175.44 357.906 -42.8022 2190.69 0 0 0 0 0 0 0 2474.82 1498.54 1984.85 0 -632.725 0 0 0 0 996.658 0 0 0 0 0 0 0 
0 0 0 1179.46 0 0 0 0 1203.73 0 0 0 0 0 0 536.286 -888.623 2045.12 0 0 0 0 0 858.562 0 678.808 0 232.78 -483.184 374.081 0 -1889.02 -572.604 0 0 1916.79 0 0 0 0 0 205.161 2363.43 1362.42 1803.57 -2205.8 -1052.05 0 0 0 0 0 2053.51 0 364.62 0 0 -197.836 0 0 0 0 0 0 0 
0 0 1432.92 0 0 799.814 0 0 0 0 0 0.05 -664.769 0 620.518 0 0 0 0 -1043.5 0 2358.24 0 0 1375.85 0 2236.63 1109.73 0 -2050.61 0 0 0 0 0 0 0 0 0 0 0 0 2416.23 0 -503.632 640.66 0 0 0 0 -1820.05 0 938.826 0 0 0 -1451.23 0 0 0 0 0 0 1421.17 0 
0 0 1797.46 0 2051.99 0 0 0 -1502.35 0 0 1110.49 0.08 0 1477.63 1031.45 560.549 0 125.355 2273.71 0 0 0 -1478.09 0 0 -2086.63 0 0 0 415.891 224.54 -238.578 0 0 0 0 0 1822.49 0 0 0 0 -1084.25 1431.85 0 0 -2413.33 2404.02 0 0 -1295.74 859.478 0 0 0 0 0 0 0 0 0 0 0 0 
0 0 1421.48 0 0 0 0 1635.11 0 0 0 0 0 0.02 -1104.08 0 0 0 0 0 0 0 0 1217.76 0 0 0 0 0 -1216.7 0 0 -2024.37 1687.6 1500.82 0 0 2201.68 0 1484.65 0 0 2396.08 0 0 0 -430.387 0 0 -2364.8 -1504.03 0 0 0 0 0 0 0 0 0 0 0 0 0 0 
0 -1249.81 0 0 1969.44 -1249.66 1655.4 0 0 0 0 -1088.52 349.818 1066.39 0.07 -131.764 0 0 0 0 0 0 189.138 -383.694 0 0 499.054 0 0 1346.1 0 0 180.593 0 0 0 0 2187.34 0 0 0 1151.69 0 -1800.67 1343.5 2416.68 0 0 0 0 0 0 0 0 0 888.928 1405.76 0 0 0 0 0 0 0 0 
0 0 0 0 0 0 0 0 0 0 2170.55 0 1879.25 0 1837.9 0.02 0 0 2357.63 0 0 0 0 0 0 -625.095 0 0 0 0 0 -1667 0 0 0 0 -1078.75 -514.313 0 0 0 0 0 -1085.77 0 891.064 0 0 0 0 0 -250.786 0 -351.039 0 0 0 0 0 0 0 0 0 0 0 
1293.3 1409.27 -1958.75 0 -1058.92 0 0 1064.1 0 0 1697.67 0 739.54 0 0 0 0.08 0 2299.65 0 0 0 0 0 0 0 -975.143 0 0 0 0 0 0 2177.88 0 0 0 0 0 0 0 0 0 2187.8 0 0 0 0 -623.264 0 0 -1051.13 0 -814.768 0 0 0 0 0 0 0 1045.64 0 0 0 
1548.89 0 0 -1585.67 0 0 0 -718.635 0 0 420.927 0 0 0 0 0 0 0.09 0 -1048.08 0 0 -2140.49 0 0 0 0 0 0 0 0 2141.87 2138.05 0 2497.86 1870.25 0 0 0 0 0 0 445.952 0 1918.01 0 1544.01 -1201.74 1818.37 0 1042.13 0 0 0 0 0 -2010.33 0 0 0 0 0 0 0 -2247.61 
0 0 0 0 0 0 0 0 -855.815 0 0 0 838.42 0 0 933.18 -1400.57 0 0.01 2291.71 -908.46 0 0 0 -1025.19 2138.05 0 2050.16 0 0 985.061 0 0 0 0 -34.1044 -1364.1 0 0 0 0 2057.18 0 140.309 0 510.193 567.11 0 0 0 0 0 0 0 0 -1019.24 0 0 -1927.47 0 0 0 0 0 0 
0 -572.298 2490.84 0 0 0 0 0 0 0 0 -196.921 -1477.02 0 0 0 0 831.706 -493.866 0.01 0 1239.43 0 0 -1480.22 -16.8615 0 0 0 0 2252.65 0 0 0 482.574 0 0 0 0 0 0 0 0 0 0 0 0 1557.89 0 0 1873 1083.64 2294.61 0 1502.04 0 0 0 0 0 -2463.68 -1408.51 0 0 0 
-2011.7 0 0 1856.06 -1499.76 -84.6126 0 0 0 347.682 0 0 0 0 0 0 0 0 1904.89 0 0.06 0 1410.18 0 0 0 -1155.66 1233.33 1847.51 0 0 1694.92 0 -825.602 0 0 0 -1558.35 0 0 0 1554.23 0 -624.79 244.072 282.525 -1333.74 0 -908.155 0 0 0 0 0 0 0 0 0 0 0 0 0 0 0 0 
0 0 -1919.23 0 0 2015.82 0 1985 0 0 0 1831.49 0 0 0 0 0 0 0 788.064 0 0.07 0 0 0 2394.56 0 0 0 0 0 0 -734.046 1099.05 0 1948.53 -54.0941 1360.59 0 -384.457 0 0 -859.172 0 1808.45 -1928.08 0 2385.56 0 0 0 0 2449.19 0 0 -727.485 0 -286.34 794.626 0 0 0 -1643.96 0 0 
0 -454.955 0 0 0 1671.12 0 2414.09 1963.33 1562.78 0 0 0 0 -826.518 0 0 -1071.58 0 0 1567.05 0 0.09 -1418.42 0 0 474.334 -1630.99 0 0 1897.26 66.6066 0 0 -1360.44 0 -903.577 -1338.47 0 2069.99 -2240.29 0 0 0 0 0 0 0 0 1497.92 0 0 0 0 0 0 193.106 0 0 0 902.203 -2074.27 0 -1934.19 0 
-888.623 0 1461.91 1309.93 0 0 0 0 0 0 -1991.56 0 -593.814 -2064.2 1200.52 0 0 0 0 0 0 0 -1336.33 0.07 0 0 0 0 648.747 0 0 0 0 1450.01 -514.313 0 0 0 0 326.624 -595.798 0 -752.51 0 0 390.866 0 990.249 1716.74 0 0 0 0 351.65 0 0 0 0 0 0 0 0 0 0 0 
0 1693.4 0 0 -26.3222 0 0 0 0 0 0 380.49 0 0 0 0 0 0 -2339.01 2126.45 0 0 0 0 0.05 0 599.155 0 0 0 0 0 703.223 0 0 -1400.57 0 0 0 -542.695 0 608.31 0 0 -65.3859 0 0 0 0 0 -897.626 0 0 0 0 0 0 0 0 0 0 0 0 1644.57 0 
0 0 0 0 0 0 0 0 0 0 -1354.03 0 0 0 0 -1611.15 0 0 2329.86 932.875 0 2233.57 0 0 0 0.03 0 0 0 0 -2004.84 737.251 0 0 0 0 0 0 0 0 1789.53 0 0 1719.64 2257.99 0 0 0 0 0 -674.078 -1294.67 0 0 0 445.341 -42.497 0 0 1381.19 0 0 0 0 0 
0 0 0 1465.27 0 0 0 -1500.37 2091.2 1965.16 0 -1448.64 2227.32 0 2185.96 0 -2387.08 0 0 0 409.329 0 97.8881 0 -2194.05 0 0.04 0 -1129.41 0 0 0 -1437.65 0 321.131 0 0 0 0 0 0 0 0 -2085.41 -6.18 0 0 2400.81 0 0 0 -1820.2 0 0 0 0 0 0 0 918.226 0 0 0 0 0 
0 0 0 0 2466.43 -563.906 0 0 978.5 0 -1901.53 -996.963 0 0 0 0 0 0 44.6333 0 595.645 0 2376.71 0 0 0 0 0.09 0 0 0 0 0 2120.96 -428.709 0 0 0 1234.09 0 0 0 0 0 2405.85 0 0 553.835 0 0 996.506 0 1491.52 0 0 -487.457 178.915 0 0 0 -364.315 0 0 0 0 
0 0 0 -508.362 0 0 0 0 0 0 1723.76 0 0 0 0 0 0 0 0 0 -289.392 0 0 0.686666 0 0 -1179.01 0 0.05 0 0 1825.54 0 0 1310.69 0 0 0 0 0 0 2196.19 -804.544 0 0 0 0 470.367 0 0 0 0 877.026 0 -1302.91 0 0 0 0 0 0 0 0 0 0 
0 0 0 0 1739.33 0 -304.041 -1276.21 0 0 0.381481 513.855 0 -2194.66 2473.45 0 0 0 0 0 0 0 0 0 0 0 0 0 0 0.09 2478.79 0 -718.329 0 0 0 0 396.97 0 1404.84 0 0 0 0 0 0 0 0 0 0 0 0 0 0 0 0 0 1864.6 0 0 0 0 0 0 0 
0 0 0 0 0 2298.12 0 0 135.884 0 0 0 1107.75 0 0 0 0 0 -1195.64 2250.05 0 0 1115.22 0 0 -72.8629 0 0 0 191.122 0.04 0 2191.15 0 650.426 0 -207.755 705.359 -2098.99 0 0 951.796 1809.98 0 0 0 0 0 0 1414.91 0 0 0 0 0 0 0 0 0 -1981.19 0 25.7118 0 -1222.95 0 
440.153 0 0 0 0 0 0 1637.7 0 0 408.567 0 -642.491 0 0 738.014 0 -591.372 0 0 1953.57 0 2207.02 0 0 -847.423 0 0 -1363.95 0 0 0.02 0 0 -1709.11 0 0 0 0 0 2270.81 -357.753 0 -1617.56 1973.86 0 0 1332.97 0 505.921 0 0 0 1403.62 -1544.92 0 0 0 0 0 0 0 0 0 0 
1720.4 0 0 0 0 0 0 0 0 0 -2378.54 0 2482.3 -698.645 -1873 0 0 -1617.4 0 0 0 -2326.5 0 0 2019.94 0 -177.541 0 0 1834.54 873.516 0 0 0 0 0 -626.164 0 0 0 0 -431.303 0 0 0 0 0 0 1754.43 -31.9681 0 2410.89 0 14.7252 0 0 0 0 0 0 0 0 0 0 0 
0 0 0 0 0 0 0 2465.67 0 2383.27 0 0 0 536.286 0 0 168.538 0 0 0 -1214.26 2458.04 0 -2325.74 0 0 0 740.15 0 0 0 0 0 0.08 0 0 0 0 33.1889 0 0 0 0 947.066 0 0 0 0 2034.75 0 0 0 0 0 0 0 0 0 0 0 0 0 0 1144.22 0 
-175.71 0 0 0 0 0 0 0 0 0 0 0 0 -2063.43 0 0 0 1580.48 0 1535 0 0 -2203.05 -1886.88 0 0 389.95 -1329.62 2276.91 0 1968.52 1051.29 0 0 0 0 0 1093.86 0 0 0 0 0 0 0 0 2215.11 0 1721.63 0 0 721.686 0 1881.69 0 428.556 -2166.74 0 0 0 2407.83 0 0 0 0 
2325.43 0 1023.97 0 0 0 0 0 778.909 0 2050.77 0 0 0 0 0 0 -1155.35 79.2718 0 0 -793.71 0 0 -1849.5 0 0 0 0 0 0 0 0 0 0 0.06 0 0 0 0 0 0 0 1475.8 0 0 1610.69 0 1078.45 0 0 0 934.248 1569.64 0 -1854.99 0 0 0 0 0 0 0 2342.52 0 
0 0 0 0 0 0 0 -151.601 0 0 0 0 0 0 0 2293.54 0 0 1289.94 0 0 411.161 2369.53 0 0 0 0 0 0 0 757.241 0 2328.79 0 0 0 0.09 -1515.63 0 0 0 0 0 0 0 0 -1098.28 2156.36 0 0 0 0 73.7785 0 -691.321 0 0 0 0 0 0 0 0 0 0 
0 0 0 -1962.57 0 0 0 -950.88 -296.258 1922.28 0 0 0 1851.48 2396.08 2471.31 0 0 0 0 805.155 -1266.14 1783.27 0 0 0 0 0 0 -513.855 -1264.92 0 0 0 -157.552 0 698.187 0.02 0 0 0 -1833.93 0 140.156 0 -1421.32 -513.703 513.855 0 0 0 0 0 0 0 0 0 -251.244 0 0 0 0 0 0 -1625.8 
-1427.27 550.935 0 0 0 0 0 0 0 2352.75 0 0 2098.22 0 0 0 0 0 0 0 0 0 0 0 0 0 0 -1492.74 0 0 1932.05 0 0 -1131.7 0 0 0 0 0.02 0 0 0 0 0 1149.4 -2135.46 0 0 0 0 0 556.734 0 0 0 0 -58.3666 0 0 0 0 0 0 0 0 
0 2409.51 -1095.54 -2407.07 0 0 0 0 0 -397.58 0 0 0 1302.15 0 0 0 0 0 0 0 1504.33 -1228.9 2480.93 1452.76 0 0 0 0 2459.41 0 0 0 0 0 0 0 0 0 0.08 0 0 -790.811 0 0 0 0 0 0 0 0 0 0 0 445.189 769.753 -2401.58 0 0 0 0 0 0 0 0 
0 0 0 0 0 0 -16.8615 1950.21 0 -1754.43 0 0 0 0 0 0 0 0 0 0 0 0 2428.13 -2015.98 0 -656.682 0 0 0 0 0 -371.944 0 0 0 0 0 0 0 0 0.01 0 0 0 1001.08 1543.4 0 1226.62 -1774.88 0 859.172 0 2460.17 -889.538 0 0 2447.66 0 0 0 0 0 -2412.87 0 1757.64 
0 0 0 629.826 0 0 0 0 0 0 -2277.37 0 0 0 602.969 0 0 0 234.916 0 2101.58 0 0 0 1915.57 0 0 0 435.575 0 -1397.82 -1097.67 1788.61 0 0 0 0 1144.52 0 0 0 0.06 0 0 0 -1320.92 0 963.546 0 0 0 0 0 0 0 -1157.8 2222.28 0 0 0 1397.67 0 0 0 0 
0 0 789.438 0 0 2143.24 0 -556.124 0 0 131.458 -1445.13 0 1384.55 0 0 0 1764.5 0 0 0 2469.63 0 2496.19 0 0 0 0 608.921 0 1737.04 0 0 0 0 0 0 0 0 2177.88 0 0 0.02 0 0 -1182.67 0 0 0 0 2408.9 81.2555 0 -1139.03 -398.038 0 1027.63 0 0 0 0 0 -1217.76 0 0 
0 0 0 0 -2096.85 1142.38 0 -479.675 0 0 -178.457 0 -498.749 0 780.587 1887.65 -2238 0 -1983.17 0 -909.223 0 0 0 0 2403.56 -1101.18 0 0 0 0 338.527 0 1401.64 0 1647.62 0 268.029 0 0 0 0 0 0.08 1344.11 0 632.572 1591.01 0 0 0 0 0 0 1672.8 -643.406 0 -2212.21 0 0 -247.124 0 0 -2214.35 0 
0 524.079 0 0 0 0 0 0 0 0 -1492.74 -1075.7 1588.56 0 -1113.54 0 0 2088.31 0 0 -2205.19 2283.32 0 0 2369.53 -632.42 1283.23 2200.61 0 0 0 906.018 0 0 0 0 0 0 -2152.39 0 1758.25 0 0 -1729.26 0.07 -321.741 0 0 0 0 0 0 0 0 0 0 0 0 0 0 0 0 0 0 -354.854 
0 0 0 818.43 1181.75 0 0 2112.57 0 0 605.106 1780.37 0 0 1921.83 -1875.9 0 0 1209.22 0 -1604.59 -2450.71 0 -1061.82 0 0 0 0 0 0 0 0 0 0 0 0 0 -372.097 2091.51 0 1408.35 2343.59 -137.715 0 2418.52 0.03 -1115.53 0 0 0 -2342.68 0 -1456.42 0 2448.12 -1935.87 -1013.9 0 -875.652 0 0 0 -1708.35 0 0 
0 0 -1182.52 0 0 0 0 -1760.84 0 0 122.608 0 0 2154.07 0 0 0 1397.06 369.503 0 1979.05 0 0 0 0 0 0 0 0 0 0 0 0 0 -954.085 -446.104 2139.58 2363.28 0 0 0 0 0 -614.261 0 1942.27 0.04 0 0 0 0 1804.79 0 2144.31 -1798.68 -99.2615 0 0 0 0 0 0 -1770 0 0 
0 0 939.131 -773.721 0 0 -2459.41 -1357.08 0 0 0 0 1902.14 0 0 0 0 2233.88 0 2463.07 0 1073.56 0 -1528.44 0 0 2078.08 -379.269 383.847 0 0 -2255.09 0 0 0 0 226.981 2088.46 0 0 -112.995 1625.03 0 858.257 0 0 0 0.02 1924.27 0 0 0 0 0 0 0 545.747 0 0 0 0 0 0 0 0 
0 0 0 0 0 1156.73 0 2292.78 0 -406.583 0 0 2495.57 0 0 0 -493.103 1415.68 0 0 -367.977 0 0 799.203 0 0 0 0 0 0 0 0 1959.82 -183.187 374.538 -1664.56 0 0 0 0 1220.05 0 0 0 0 0 0 230.491 0 0 0 0 0 -367.824 0 0 0 0 0 0 0 0 0 0 0 
-168.233 0 0 -1755.35 0 0 642.949 1645.63 0 329.981 0 0 0 1119.5 0 0 0 0 0 0 0 0 2035.66 0 0 0 0 0 0 0 1718.57 -290.155 1807.23 0 0 0 0 0 0 0 0 0 0 0 0 0 0 0 0 0.08 2202.44 -2052.9 -312.281 0 0 0 0 0 0 0 0 1429.87 0 0 0 
0 0 0 0 2337.03 0 0 0 2005.14 899.609 0 -618.992 0 1318.93 0 0 0 -1023.82 0 -1008.56 0 0 0 0 1759.47 2468.26 0 -2110.28 0 0 0 0 0 0 0 0 0 0 0 0 948.439 0 -1005.05 0 0 -1519.9 0 0 0 1609.78 0 -1558.2 0 0 0 0 0 0 0 0 0 0 0 0 0 
0 1941.05 0 450.377 0 0 0 0 -841.014 0 0 0 1507.23 0 0 891.827 -1581.55 0 0 1228.14 0 0 0 0 0 897.931 -188.833 0 0 0 0 0 -1977.22 0 -1313.14 0 0 0 -182.272 0 0 0 48.7533 0 0 0 -2343.13 0 0 2417.6 1599.7 0.04 2135.61 0 0 1277.58 0 0 0 1301.54 0 0 1813.33 0 0 
-1556.22 0 0 0 0 0 2202.75 0 0 -2167.5 510.498 1829.81 1043.66 0 0 0 0 0 0 -1497.16 0 -105.823 0 0 0 0 0 223.167 -45.5489 0 0 0 0 0 0 1359.22 277.032 0 0 0 -2248.38 0 0 0 0 -2197.87 0 0 0 -981.704 0 -779.672 0.09 1817.15 2143.39 0 2291.71 0 0 0 0 0 2086.02 0 0 
0 0 -796.609 0 -1063.65 0 0 0 115.131 0 0 0 0 0 0 1748.02 876.568 0 0 0 0 0 0 -1095.39 0 0 0 0 0 0 0 1625.49 728.553 0 -1458.4 -1712.16 0 0 0 0 1977.52 0 1681.95 0 0 0 1919.84 0 -55.1622 0 0 0 1675.7 0.01 1572.54 0 0 0 0 -1387.45 0 0 0 0 0 
0 0 278.1 0 0 -1224.94 0 -2454.83 -1215.93 0 -1976.61 0 0 0 0 0 0 0 0 2458.65 0 0 0 0 0 0 0 0 1062.73 0 0 -1876.81 0 0 0 0 1639.23 0 0 1187.86 0 0 1964.55 1415.07 0 -463.5 -1191.06 0 0 0 0 0 -907.697 2146.14 0.08 0 0 0 0 0 0 0 0 0 0 
0 0 2325.43 0 0 0 530.488 0 0 0 0 0 0 0 963.851 0 0 0 -71.0318 0 0 -282.372 0 0 0 1014.05 0 171.133 0 0 0 0 0 0 1810.59 -2309.41 0 0 0 1885.05 0 1927.63 0 -2037.49 0 -1483.58 778.603 0 0 0 0 88.2748 0 0 0 0.06 0 0 0 0 0 0 0 -171.896 0 
0 0 0 0 0 0 0 0 0 0 0 2112.26 0 0 -943.403 0 0 2049.24 0 0 0 0 1035.72 0 0 817.209 0 -2035.97 0 0 0 0 0 0 2140.19 0 0 0 1898.33 1869.95 -2043.44 276.269 1610.84 0 0 -1027.33 0 -2386.01 0 0 0 0 1835.15 0 0 0 0.09 0 0 2116.69 0 0 0 0 502.106 
0 0 0 0 -1848.28 -38.6822 0 0 0 608.31 373.775 0 0 0 0 0 0 0 0 0 0 1797.77 0 0 0 0 0 0 0 2492.22 0 0 0 0 0 0 0 -112.537 0 0 0 0 0 1112.17 0 0 0 0 0 0 0 0 0 0 0 0 0 0.01 0 0 0 0 0 0 0 
0 0 758.614 0 0 0 0 67.3696 1383.33 0 0 0 0 0 0 0 0 0 1097.52 0 0 -302.82 0 0 0 0 0 0 0 0 0 0 0 0 0 0 0 0 0 0 0 0 0 0 0 -105.976 0 0 0 0 0 0 0 0 0 0 0 0 0.06 0 0 0 0 0 0 
0 0 0 0 -138.783 0 0 0 2388.15 0 0 0 0 0 0 0 0 0 0 0 0 0 0 0 0 -913.19 1487.55 0 0 0 2016.59 0 0 0 0 0 0 0 0 0 0 0 0 0 0 0 0 0 0 0 0 2346.64 0 1553.16 0 0 1456.88 0 0 0.09 1109.42 0 0 0 0 
0 1669.59 0 0 0 0 0 0 0 0 0 0 0 0 0 0 0 0 0 1976.3 0 0 1657.38 0 0 0 0 917.463 0 0 0 0 0 0 -230.491 0 0 0 0 0 0 -377.438 0 296.564 0 0 0 0 0 0 0 0 0 0 0 0 0 0 0 -165.181 0.02 2040.85 -2411.95 0 -1338.62 
0 0 0 0 0 0 0 0 0 0 0 0 0 0 0 0 -1314.36 0 0 -1161.92 0 0 2115.47 0 0 0 0 0 0 0 627.689 0 0 0 0 0 0 0 0 0 0 0 0 0 0 0 0 0 0 882.061 0 0 0 0 0 0 0 0 0 0 381.71 0.02 0 0 0 
0 0 -1144.37 0 0 0 0 1292.99 0 0 0 0 0 0 0 0 0 0 0 0 0 -1296.2 0 0 0 0 0 0 0 0 0 0 0 0 0 0 0 0 0 0 -785.47 0 1966.99 0 0 -12.8941 803.781 0 0 0 0 874.126 997.879 0 0 0 0 0 0 0 -230.491 0 0.05 0 0 
219.504 -29.6793 0 0 0 0 0 1592.23 0 0 0 420.621 0 0 0 0 0 0 0 0 0 0 -1016.8 0 405.362 0 0 0 0 0 -515.229 0 0 1983.78 0 -188.833 0 0 0 0 0 0 0 -848.338 0 0 0 0 0 0 0 0 0 0 0 78.814 0 0 0 0 0 0 0 0.01 0 
0 0 0 -1552.55 0 0 0 -985.214 0 0 0 0 0 0 0 0 0 28.4585 0 0 0 0 0 0 0 0 0 0 0 0 0 0 0 0 0 0 0 1570.41 0 0 2172.99 0 0 0 710.7 0 0 0 0 0 0 0 0 0 0 0 818.735 0 0 0 -526.521 0 0 0 0.02 
