*Vertices 54
*Matrix 
0.08 0 299.005 0 0 -2074.11 0 0 -698.34 -492.187 0 0 -1779.15 0 2301.17 0 0 2218.01 0 0 0 0 0 0 -381.863 0 -1705.6 1827.07 0 0 -728.401 0 0 0 0 0 1669.59 0 0 2236.63 0 0 1877.42 0 0 0 0 -1837.14 0 0 -1473.36 0 0 0 
0 0.06 0 -1625.8 0 0 0 0 0 0 0 1886.12 -38.377 0 0 0 0 0 433.897 0 0 2327.27 335.932 0 0 0 0 0 -511.567 0 0 0 0 0 0 -2454.99 0 0 0 -119.404 0 0 -1739.63 914.869 2208.85 0 1482.36 0 1221.88 0 -2466.89 2332.3 0 0 
-493.866 0 0.05 0 0 0 624.638 0 0 0 0 0 0 0 0 0 0 0 -682.928 0 0 660.802 -1803.42 0 0 0 0 0 0 0 1957.23 -1802.04 720.008 0 0 0 0 0 0 0 0 1955.55 1851.94 0 0 0 0 0 1739.78 0 -3.12815 0 0 -9.68963 
0 -278.405 0 0.02 -1632.97 0 0 0 643.406 0 0 -1074.48 0 2098.07 1845.53 -2473.45 0 0 2461.7 0 0 -1578.04 -1388.67 -1602.91 0 0 0 0 0 0 0 0 0 0 0 0 0 0 1512.88 0 0 2083.57 0 0 0 -1180.53 0 0 0 0 0 0 0 0 
0 0 0 -899.762 0.07 1072.95 0 0 0 1313.59 0 0 0 0 0 -36.0881 0 639.744 -821.94 0 0 0 0 0 0 0 0 0 0 -575.35 0 0 0 0 1750.92 1379.97 396.512 -2321.77 0 2111.8 0 731.452 0 0 0 0 572.756 1127.12 0 1501.43 0 0 0 0 
628.91 0 0 0 2051.53 0.06 0 0 1802.8 0 0 0 -734.962 854.595 -663.091 0 0 1106.07 0 -2245.02 0 0 0 0 0 1105.76 -1202.66 -2400.66 0 0 -641.881 0 0 0 0 0 0 0 0 -2488.4 1576.97 0 0 0 0 2002.55 2097.31 -2000.56 0 1236.08 0 0 0 0 
0 0 1261.56 0 0 0 0.07 0 0 -163.503 0 0 805.918 0 0 -2141.56 0 0 704.291 0 0 0 0 0 0 0 1702.86 0 1522.34 1232.26 0 0 -836.131 0 0 0 0 0 0 1727.27 0 98.8037 0 2288.66 933.943 1038.32 0 0 0 0 0 0 0 0 
0 0 0 0 0 0 0 0.03 0 0 0 863.903 0 0 0 0 0 0 0 -1112.93 0 1255.76 0 2019.49 0 1063.49 0 0 0 0 93.9207 0 1910.38 0 0 0 0 0 0 0 0 1277.43 0 0 0 0 -1152.46 0 0 0 0 449.919 0 0 
1442.38 0 0 -1010.7 0 -1803.42 0 0 0.05 0 0 2392.73 0 981.704 0 566.5 0 2194.81 0 0 1112.63 -168.844 0 0 -164.113 0 0 2404.17 0 -2139.12 0 0 0 0 -2101.43 0 0 0 -893.048 945.997 0 0 0 0 0 2487.95 2224.11 0 0 0 1038.93 0 0 0 
-1348.99 0 0 0 2138.2 0 327.693 0 0 0.05 0 0 129.17 -753.883 0 0 0 1627.17 0 992.233 0 0 0 0 -984.756 0 0 0 0 0 0 0 0 -989.944 0 377.895 -2367.09 0 2036.58 0 0 0 0 494.018 906.476 0 -2023 332.575 0 0 1617.1 0 0 -557.344 
0 0 0 0 0 0 0 0 0 0 0.01 789.59 0 0 0 1691.56 132.984 -555.971 0 0 0 0 0 0 0 0 -978.347 0 0 0 0 0 -426.725 0 0 0 0 1803.72 0 0 1718.27 0 0 0 0 0 118.183 0 0 0 0 0 0 0 
0 2408.29 0 651.799 0 0 0 570.467 1890.39 0 -832.926 0.01 0 902.966 0 0 0 0 0 0 0 -1098.59 0 1779.92 0 334.712 0 0 0 0 1004.75 1218.07 0 0 0 0 0 0 -170.217 0 -2454.22 1911.91 0 0 0 0 -2378.38 0 0 0 0 0 0 0 
1069.14 -2255.09 0 0 0 -1610.69 2470.7 0 0 -0.228889 0 0 0.01 0 -1345.33 0 0 0 0 0 0 -12.5889 1880.47 0 0 0 0 0 0 0 0 0 2384.95 0 0 0 0 0 -1827.68 0 0 0 0 0 0 0 0 2461.55 0 0 0 0 0 0 
0 0 0 1896.8 0 -1527.38 0 0 1972.49 -1409.42 0 747.017 0 0.04 -535.676 0 575.808 0 0 844.523 0 0 0 2154.23 0 -29.9844 0 0 -1318.02 0 0 0 0 0 0 0 -698.645 0 0 0 0 0 0 1311 0 0 0 0 239.952 341.578 0 0 0 0 
1612.06 0 0 349.361 0 1682.1 0 0 0 0 0 0 -1249.2 1988.81 0.03 0 0 -97.1252 0 1751.38 994.064 0 0 0 280.999 0 0 0 0 0 0 0 0 0 0 1972.64 0 -980.026 0 -300.378 0 49.0585 -185.629 0 0 1477.17 0 0 0 0 0 0 0 0 
0 0 0 -2357.63 -2109.06 0 2402.34 0 -2387.39 0 -285.424 0 0 0 0 0.09 0 0 0 0 0 0 -1074.18 0 610.752 0 0 0 0 0 0 0 143.666 0 0 0 1725.75 0 0 -827.128 0 -1261.71 0 1417.05 821.482 2421.87 0 2120.2 1278.5 170.675 -367.367 0 0 0 
0 0 0 0 0 0 0 0 0 0 -2076.1 0 0 701.239 0 0 0.07 0 2024.83 0 0 0 0 0 892.895 0 0 1177.02 1824.17 0 0 0 0 0 0 0 0 0 0 0 -1045.18 0 0 0 0 0 0 0 2282.56 1065.63 0 0 0 0 
1850.57 0 0 0 2223.81 1039.54 0 0 965.224 1105 2439.12 0 0 0 -1892.68 0 0 0.03 0 0 0 0 705.359 0 0 -1919.23 0 0 0 0 863.14 0 -2094.41 0 0 0 314.417 0 0 0 0 0 0 0 0 0 0 2457.58 901.746 0 1462.83 0 0 0 
0 1900.16 -111.621 2339.47 -329.371 0 2101.73 0 0 0 0 0 0 0 0 0 2458.65 0 0.03 0 0 586.642 0 0 808.664 0 0 0 0 0 -139.393 0 0 0 0 0 0 0 1811.35 1191.21 -453.276 0 1158.56 2266.23 0 -2210.53 0 0 0 0 0 0 165.487 1947.92 
0 0 0 0 0 1599.25 0 -1354.03 0 -472.35 0 0 0 1158.1 815.989 0 0 0 0 0.06 655.919 0 0 -1906.11 398.495 0 0 -2305.6 0 0 2386.62 0 -1918.93 0 -1608.25 0 456.175 0 0 1883.53 1428.5 0 0 0 1320.61 -2209.16 0 0 0 987.045 0 0 0 0 
0 0 0 0 0 0 0 0 46.617 0 0 0 0 0 673.772 0 0 0 0 806.68 0.09 0 0 0 0 1718.12 -1594.97 -1025.65 2282.71 0 0 0 0 0 0 2432.55 0 0 1482.67 -1095.54 0 0 -998.032 0 -599.155 1274.22 336.695 0 0 0 0 0 0 0 
0 1213.19 -2092.88 -69.6585 0 0 0 595.035 277.947 0 0 -102.771 -154.653 0 0 0 0 0 1675.54 0 0 0.07 0 0 18.2348 0 0 0 0 -131.001 292.444 0 0 433.287 -2100.82 2465.36 0 1903.21 0 0 1929.76 0 378.353 0 0 0 0 560.244 0 0 0 0 0 -2400.81 
0 1518.83 839.793 601.596 0 0 0 0 0 0 0 0 980.026 0 0 1865.98 0 -2371.97 0 0 0 0 0.01 0 0 -1251.49 1179.16 0 0 0 0 0 562.227 0 931.806 0 2308.5 1645.33 0 0 1300.32 0 789.285 0 0 1799.6 0 0 0 0 563.906 0 0 0 
0 0 0 -956.679 0 0 0 -1849.8 0 0 0 -1184.19 0 -297.479 0 0 0 0 0 1061.05 0 0 0 0.07 0 0 0 0 0 0 0 0 1638.62 -108.264 0 1083.94 -479.064 0 0 1340.6 0 0 605.106 0 0 0 0 0 -344.63 0 1755.04 0 0 0 
-1491.52 0 0 0 0 0 0 0 2195.58 -1074.79 0 0 0 0 -2214.65 -886.486 1945.33 0 874.279 6.79037 0 -1575.59 0 0 0.08 0 2258.14 0 -1073.41 0 0 2490.84 0 0 0 0 0 0 989.181 2345.42 0 0 0 0 0 0 131.764 637.303 1333.74 -1149.25 0 -1154.59 0 -117.115 
0 0 0 0 0 969.039 0 711.31 0 0 0 489.746 0 437.559 0 0 0 -580.386 0 0 -2345.27 0 826.518 0 0 0.04 0 -443.51 1131.86 0 0 0 -337.611 0 0 678.961 0 1025.35 0 0 0 2357.02 2321.92 0 0 0 0 0 0 0 0 0 2295.53 0 
-864.208 0 0 0 0 1052.2 1032.82 0 0 0 1061.36 0 0 0 0 0 0 0 0 0 1345.48 0 613.956 0 1121.63 0 0 0 0 0 0 0 0 -571.841 1645.33 -671.331 0 0 0 0 0 0 0 -1616.03 0 0 0 0 0 0 -1677.83 0 0 0 
2460.94 0 0 0 0 513.855 0 0 1796.7 0 0 0 0 0 0 0 -1482.51 0 0 874.432 -475.097 0 0 0 0 394.528 0 0.09 0 616.855 0 -1783.12 0 0 -1746.65 0 -1026.72 0 0 1060.59 0 0 0 0 0 0 1243.1 0 -749.458 0 0 2182.3 0 0 
0 -1021.68 0 0 0 0 2254.78 0 0 0 0 0 0 -1020.62 0 0 1169.39 0 0 0 2171.32 0 0 0 594.729 -924.024 0 0 0.03 0 0 1687.14 0 0 0 0 0 0 0 1389.74 1611.3 0 -1709.88 1336.48 0 0 1760.54 1174.73 1638.31 0 0 0 0 699.866 
0 0 0 0 1605.35 0 2161.7 0 2025.89 0 0 0 0 0 0 0 0 0 0 0 0 773.415 0 0 0 0 0 -2185.51 0 0.08 -963.24 0 407.651 0 -2039.93 0 0 0 1869.49 2388.76 -578.86 0 195.547 0 0 1550.57 0 22.5074 0 0 1856.52 0 0 0 
-262.841 0 1260.64 0 0 1995.53 0 2222.13 0 0 0 2114.25 0 0 0 0 0 -927.534 714.362 1907.64 0 -461.211 0 0 0 0 0 0 0 -1343.2 0.04 0 -1068.99 0 0 0 0 0 0 1390.04 1343.81 1470.31 0 822.703 0 -225.303 -616.398 0 0 449.614 0 0 -759.377 0 
0 0 2409.36 0 0 0 0 0 0 0 0 2382.35 0 0 0 0 0 0 0 0 0 0 0 0 -1185.42 0 0 1676.31 1283.68 0 0 0.04 0 -1654.79 957.442 -2460.48 0 0 0 318.69 0 0 0 0 0 0 -125.202 0 0 0 0 0 0 0 
0 0 638.371 0 0 0 -1368.37 2031.69 0 0 420.316 0 2154.38 0 0 1257.29 0 1906.26 0 1893.29 0 0 1681.8 -955.611 0 1900.46 0 0 0 2096.39 554.292 0 0.04 0 0 0 -2467.8 0 0 0 0 0 0 0 0 1918.62 0 -1020 0 0 1606.72 0 0 0 
0 0 0 0 0 0 0 0 0 1639.68 0 0 0 0 0 0 0 0 0 0 0 2309.72 0 -1459.47 0 0 1106.83 0 0 0 0 2155.45 0 0.04 0 2299.19 1091.57 0 -305.719 0 0 2159.26 0 0 0 1590.24 0 -815.378 0 0 0 0 0 0 
0 0 0 0 1070.67 0 0 0 2163.23 0 0 0 0 0 0 0 0 0 0 -1811.04 0 1782.2 494.934 0 0 0 -106.586 -1170.31 0 92.8526 0 271.386 0 0 0.07 0 0 876.72 0 882.672 0 -2189.47 0 -1578.49 0 0 0 617.161 1214.26 1227.38 -2098.38 0 0 0 
0 2310.17 0 0 -507.599 0 0 0 0 -240.562 0 0 0 0 2096.24 0 0 0 0 0 2488.86 -771.279 0 1598.64 0 -1522.03 675.451 0 0 0 0 915.937 0 -1938.46 0 0.06 -278.558 0 0 470.061 0 0 1507.69 -2359 0 0 0 1494.26 0 0 2330.16 0 0 0 
1198.39 0 0 0 895.032 0 0 0 0 1300.78 0 0 0 100.177 0 -1717.35 0 -1123.16 0 2432.1 0 0 -1762.06 638.066 0 0 0 1743.9 0 0 0 0 -884.96 -241.783 0 1813.33 0.05 0 0 0 0 0 0 0 2086.02 0 0 -2487.79 0 0 0 0 0 0 
0 0 0 0 2072.28 0 0 0 0 0 -564.058 0 0 0 -1725.75 0 0 0 0 0 0 -414.212 1324.88 0 0 -495.849 0 0 0 0 0 0 0 0 2084.49 0 0 0.08 0 2166.74 -531.098 0 0 0 0 0 -85.6807 0 0 0 0 2049.55 0 0 
0 0 0 2345.58 0 0 0 0 1525.85 481.353 0 -1704.99 78.814 0 0 0 0 0 -132.527 0 2060.69 0 0 0 -152.821 0 0 0 0 1558.05 0 0 0 2161.4 0 0 0 0 0 0 34.7148 0 0 0 1517.76 0 1171.53 0 0 48.1429 1499.45 0 0 0 
1043.05 2243.34 0 0 -1155.66 1078.3 1548.13 0 -2.06 0 0 0 0 0 -1508.15 -55.62 0 0 -1352.96 -1341.52 1197.32 0 0 127.796 1290.55 0 0 -1057.85 -1131.09 280.084 315.943 1324.12 0 0 2294.15 1426.21 0 -187.002 0 0.09 -2209.77 0 0 0 0 0 0 1656.16 0 38.5296 0 2496.49 0 0 
0 0 0 0 0 649.968 0 0 0 0 2222.74 -308.008 0 0 0 0 -880.535 0 -839.793 853.832 0 1745.58 -2039.02 0 0 0 0 0 1172.9 1049.61 -329.371 0 0 0 0 0 0 2024.06 326.319 2362.21 0.05 2015.06 0 1847.21 -1569.34 2479.4 0 0 1484.95 0 0 0 0 0 
0 0 2272.94 -2474.82 -1698.58 0 160.604 -2329.4 0 0 0 1502.66 0 0 499.054 1984.54 0 0 0 0 0 0 0 0 0 370.876 0 0 0 0 -978.042 0 0 1516.54 559.023 0 0 0 0 0 -582.064 0 0 0 -260.552 0 0 0 0 0 0 0 0 0 
-1574.53 755.715 1659.83 0 0 0 0 0 0 0 0 0 0 0 2269.89 0 0 0 -1607.64 0 323.573 1427.58 -1945.48 -19.4555 0 2409.05 0 0 -2099.44 -354.244 0 0 0 0 0 1608.55 0 0 0 0 0 0 0.07 0 0 -179.678 0 2417.75 0 0 0 0 0 0 
0 -718.177 0 0 0 0 1516.39 0 0 2400.66 0 0 0 1715.83 0 -795.236 0 0 -1634.19 0 0 0 0 0 0 0 1278.04 0 -2406.77 0 617.313 0 0 0 1406.37 -2051.68 0 0 0 0 -826.06 0 0 0.08 0 0 0 0 0 1388.52 -46.9222 0 1161.31 0 
0 852.153 0 0 0 0 1266.75 0 0 -1820.35 0 0 0 0 0 1560.95 0 0 0 593.051 147.481 0 0 0 0 0 0 0 0 0 0 0 0 0 0 0 2371.36 0 -1802.5 0 1796.09 -1802.5 0 0 0.08 0 0 0 0 998.794 0 0 0 0 
0 0 0 -323.267 0 2294.92 -1024.12 0 -876.415 0 0 0 0 0 -1763.28 2117.45 0 0 1059.68 404.141 -1522.49 0 658.818 0 0 0 0 0 0 264.977 -1508.45 0 1905.35 66.9118 0 0 0 0 0 0 -2052.9 0 2440.64 0 0 0.04 1566.74 0 0 0 0 0 340.358 0 
0 -1820.96 0 0 1508.91 2203.97 0 -1979.81 2137.29 -4.1963 1900.46 1198.08 0 0 0 0 0 0 0 0 68.7429 0 0 0 1805.25 0 0 29.0689 680.486 0 366.146 1998.73 0 0 0 0 0 -1456.88 -187.002 0 0 0 0 0 0 -1918.47 0.06 403.073 0 0 0 0 0 0 
-561.617 0 0 0 1481.44 2228.84 0 0 0 1341.36 0 0 1951.58 0 0 -757.698 0 -1386.84 0 0 0 -2252.04 0 0 -2216.03 0 0 0 588.015 2398.83 0 0 -658.055 -655.461 1502.96 2162.47 -1032.82 0 0 2390.44 0 0 -1533.02 0 0 0 2025.44 0.08 0 0 0 0 0 0 
0 1426.05 608.463 0 0 0 0 0 0 0 0 0 0 -1448.79 0 182.424 1730.02 1338.47 0 0 0 0 0 762.581 -361.263 0 0 -2431.18 638.981 0 0 0 0 0 -559.023 0 0 0 0 0 504.089 0 0 0 0 0 0 0 0.02 1624.27 0 1958.45 1431.39 0 
0 0 0 0 2197.26 2303 0 0 0 0 0 0 0 -681.707 0 1390.04 487.762 0 0 379.879 0 0 0 0 47.0748 0 0 0 0 0 -1471.98 0 0 0 -2319.79 0 0 0 1731.09 -2002.24 0 0 0 2403.56 -241.02 0 0 0 -1060.75 0 0 0 0 0 
-1050.83 -1141.62 1217.92 0 0 0 0 0 232.627 2002.09 0 0 0 0 0 497.833 0 2423.55 0 0 0 0 582.369 2056.11 0 0 -773.415 0 0 -2121.11 0 0 429.777 0 785.318 -524.995 0 0 2471.62 0 0 0 0 1736.58 0 0 0 0 0 0 0.05 0 0 0 
0 765.938 0 0 0 0 0 229.575 0 0 0 0 0 0 0 0 0 0 0 0 0 0 0 0 860.24 0 0 2099.9 0 0 0 0 0 0 0 0 0 -268.334 0 816.599 0 0 0 0 0 0 0 0 920.209 0 0 0.08 0 0 
0 0 0 0 0 0 0 0 0 0 0 0 0 0 0 0 0 0 -2372.59 0 0 0 0 0 0 -586.795 0 0 0 0 929.518 0 0 0 0 0 0 0 0 0 0 0 0 849.712 0 2263.33 0 0 767.006 0 0 0 0.06 0 
0 0 -2311.55 0 0 0 0 0 0 2325.74 0 0 0 0 0 0 0 0 662.786 0 0 -1939.83 0 0 1145.13 0 0 0 2112.42 0 0 0 0 0 0 0 0 0 0 0 0 0 0 0 0 0 0 0 0 0 0 0 0 0.06 
