*Vertices 46
*Matrix 
0.04 0 0 -517.518 0 0 0 0 0 0 0 0 0 0 0 -845.897 0 0 0 0 -393.155 0 0 0 0 0 1638.62 0 2358.09 0 329.524 0 -1317.1 0 0 2215.87 0 2361.14 0 0 251.701 0 0 0 0 0 
0 0.08 0 2246.54 0 0 0 0 0 0 0 1529.51 -1655.71 0 -250.328 0 0 0 0 0 0 0 0 0 0 1451.84 0 0 0 683.844 0 -95.294 0 0 0 0 0 0 0 0 0 0 313.501 -307.092 0 0 
0 0 0.06 -701.086 0 0 -295.495 0 0 858.867 1743.29 0 -1386.07 0 0 0 0 0 0 696.203 2327.88 0 511.261 0 0 0 0 -867.718 2360.23 1178.09 0 0 0 0 0 1853.31 0 0 -1557.28 0 0 0 -620.975 -1063.04 0 -456.175 
2136.22 111.469 768.685 0.05 1269.95 0 0 0 1621.68 1577.27 0 0 0 0 0 0 0 -1597.42 2321.01 2008.96 0 0 0 0 0 887.097 0 0 -1121.17 0 39.4452 0 0 0 370.266 0 0 -1130.94 0 0 0 0 0 0 -2213.58 0 
0 0 0 18.54 0.01 0 0 1886.27 0 -162.13 -1632.97 -1520.66 0 0 0 0 0 140.004 0 -1361.81 0 -291.528 0 0 1672.8 0 0 0 707.343 0 2477.72 0 0 0 0 0 -1481.29 0 0 753.426 0 0 0 0 0 0 
0 0 0 0 0 0.09 0 0 2465.21 2373.96 0 0 -1293.3 -1366.39 0 0 460.906 -576.266 1383.48 0 0 0 0 0 0 -1735.66 0 0 0 0 0 0 0 0 2433.47 479.98 0 559.328 0 0 0 0 0 0 0 0 
0 0 -2161.24 0 0 0 0.06 2120.81 0 0 0 0 0 -232.017 456.175 916.089 0 0 0 -80.0348 162.74 1698.58 0 0 0 0 0 -189.596 0 0 0 0 0 0 0 0 0 0 -2377.62 0 0 0 0 1295.28 0 0 
0 0 0 0 2444.15 0 21.1341 0.06 0 0 0 1573.31 0 2140.19 0 1712.47 0 0 0 0 0 0 -856.426 -940.046 0 0 0 0 0 0 0 0 0 0 0 123.524 0 2042.99 0 0 0 0 0 0 0 0 
0 0 0 -73.9311 0 1571.32 0 0 0.04 -36.2407 0 0 0 0 1977.22 720.771 0 0 -1094.62 0 2459.41 0 0 0 0 0 -678.35 0 1519.14 1051.59 -235.679 0 0 0 0 461.821 0 0 -241.173 0 0 0 0 2306.36 0 0 
0 0 1817.45 -572.298 1120.11 144.734 0 0 1538.51 0.03 0 0 0 316.858 0 0 0 0 0 0 0 0 0 0 0 0 0 0 0 -834.452 -306.177 -988.418 0 0 0 2042.22 0 0 0 1158.71 0 0 1346.71 0 0 0 
0 0 1741.77 0 -2396.69 0 0 0 0 0 0.07 0 0 1561.1 0 0 1523.87 0 0 0 0 0 0 -187.002 0 -2110.58 0 0 -1071.58 0 -1574.98 1566.9 0 0 0 0 0 0 579.928 2339.78 0 0 -583.438 0 0 0 
0 887.402 0 0 2156.06 0 0 -46.3118 0 0 0 0.01 0 0 0 0 0 0 0 -724.891 0 0 0 0 0 0 0 2474.82 0 0 0 0 0 -151.906 0 0 0 0 0 0 0 0 0 0 0 0 
0 2353.51 2346.34 0 0 318.842 0 0 0 0 0 0 0.09 0 0 0 869.396 -771.737 0 0 0 0 0 143.056 0 -514.771 0 0 0 0 0 0 0 0 -2117.6 0 -1780.37 0 0 949.049 0 0 0 -388.119 0 0 
0 0 0 0 0 1230.28 -369.655 -616.55 0 31.2052 16.4037 0 0 0.08 -1950.06 -1345.64 0 1648.99 2252.65 0 0 0 -1453.67 0 0 0 0 0 0 0 0 0 911.817 0 0 0 0 0 0 2458.65 -53.0259 0 0 0 0 0 
0 2394.86 0 0 0 0 2306.51 0 2307.28 0 0 0 0 -444.426 0 0 -492.645 0 0 1757.94 -190.054 0 0 0 0 0 1864.15 0 0 0 0 -1834.09 0 0 0 0 0 -208.975 0 -2000.41 0 0 0 0 0 0 
1496.55 0 0 0 0 0 2185.66 -1342.59 795.236 0 0 0 0 746.559 0 0.06 0 0 2278.74 0 0 0 0 0 0 0 0 0 0 0 0 1311.91 0 0 0 0 1619.85 0 0 0 0 -586.184 0 -1759.93 0 1476.56 
0 0 0 0 0 402.31 0 0 0 0 -1910.38 0 624.485 0 -76.3726 0 0.04 0 0 0 0 377.743 0 0 1967.6 0 1775.03 0 461.974 0 0 0 0 23.5755 0 0 685.522 0 -240.867 0 721.381 -2210.38 0 998.489 0 0 
0 0 0 1701.03 -1128.5 2470.24 0 0 0 0 0 0 975.906 2134.24 0 0 0 0.04 0 0 -2084.19 -258.568 2199.55 0 0 -1023.21 0 0 0 0 0 0 0 0 0 0 0 -36.8511 0 2422.03 0 -2266.99 -408.567 773.263 -54.0941 0 
0 0 0 656.072 0 269.097 0 0 1364.71 0 0 0 0 2199.85 0 1382.87 0 0 0 0 0 0 1291.77 0 0 0 0 813.547 2236.47 0 0 0 0 0 0 0 0 1600.31 618.381 0 0 0 0 0 0 0 
0 0 -1942.88 661.718 1369.29 0 608.463 0 0 0 0 1483.58 0 0 -909.986 0 0 0 0 0.01 0 0 0 637.455 -993.759 0 1651.59 0 0 0 1809.21 -1892.53 0 0 0 0 -1098.9 0 0 1655.71 185.476 0 0 1075.7 0 0 
160.298 0 -126.27 0 0 0 2155.45 0 -544.221 0 0 0 0 0 1666.23 0 0 -408.261 0 0 0 0 0 0 0 21.7444 0 0 0 -132.679 0 0 -409.482 0 0 0 -80.9503 0 -828.806 0 0 0 0 1564.61 0 0 
0 0 0 0 1864.91 0 1799.75 0 0 0 0 0 0 0 0 0 2145.99 1943.49 0 0 0 0.08 0 -1633.27 -324.946 1406.98 828.196 0 0 0 0 0 553.529 -530.488 0 -761.208 0 0 -763.497 569.094 0 -553.987 -248.192 994.522 0 0 
0 0 -174.947 0 0 0 0 1365.17 0 0 0 0 0 -73.6259 0 0 0 -566.042 -48.6007 0 0 0 0.01 1029.31 1828.9 0 -1621.52 -1095.84 0 0 0 0 79.577 0 0 -167.318 0 0 0 1322.6 2290.03 652.104 0 0 0 0 
0 0 0 0 0 0 0 -1826.3 0 0 574.892 0 -1237.45 0 0 0 0 0 0 503.327 0 -815.683 1125.14 0.02 1482.51 0 0 0 2435.91 0 -1242.33 1406.98 0 0 2305.9 0 -1022.29 0 290.765 0 0 -228.965 1650.82 0 0 0 
0 0 0 0 2223.81 0 0 0 0 0 0 0 0 0 0 0 69.0481 0 0 -1201.13 0 1638.31 60.9607 54.2467 0.01 0 0 0 0 2041.92 0 -1130.48 0 0 0 -1794.26 0 0 0 0 0 0 -1065.17 0 0 0 
0 2242.27 0 -1947.16 0 -984.756 0 0 0 0 1946.39 0 1382.87 0 0 0 0 215.69 0 0 402.921 -592.135 0 0 0 0.06 -2.06 0 0 -346.614 0 262.383 0 0 0 0 0 1483.43 0 0 0 0 0 -69.0481 0 1551.64 
1063.34 0 0 0 0 0 0 0 -1337.24 0 0 0 0 0 -2075.64 0 477.691 0 0 1657.99 0 1923.66 -556.734 0 0 1258.2 0 -592.135 0 0 0 0 0 0 0 0 0 0 0 0 0 0 0 -1514.71 0 0 
0 0 -1556.83 0 0 0 1678.59 0 0 0 0 -1224.63 0 0 0 0 0 0 2163.08 0 0 0 2219.23 0 0 0 -1361.2 0.04 0 0 0 0 0 0 746.101 0 364.62 0 0 0 0 2047.26 0 0 0 0 
1080.13 0 -1252.71 1618.17 -1427.43 0 0 0 1760.69 0 1649.45 0 0 0 0 0 640.202 0 -1114.46 0 0 0 0 2093.65 0 0 0 0 0.07 0 0 0 746.864 0 -666.753 0 0 0 0 0 0 0 0 0 1983.32 0 
0 -5.41704 1164.51 0 0 0 0 0 1110.8 -1522.34 0 0 0 0 0 0 0 0 0 0 -586.489 0 0 0 1695.38 1105.15 0 0 0 0.01 0 0 0 0 -1231.19 0 0 1914.2 0 0 0 655.309 0 0 0 0 
1972.79 0 0 1477.78 -2461.7 0 0 0 -343.41 -1502.5 764.565 0 0 0 0 0 0 0 0 742.744 0 0 0 1716.74 0 0 0 0 0 0 0.08 0 1090.35 0 0 0 0 0 0 0 -1623.97 0 0 772.5 0 0 
0 2239.22 0 0 0 0 0 0 0 -35.783 132.221 0 0 0 1135.98 -1754.59 0 0 0 1259.73 0 0 0 2145.68 614.566 -1664.4 0 0 0 0 0 0.05 0 0 0 0 0 0 -82.1711 0 3.73852 0 0 0 0 0 
-2478.33 0 0 0 0 0 0 0 0 0 0 0 0 626.469 0 0 0 0 0 0 -1307.03 1703.62 -665.838 0 0 0 0 0 2394.56 0 583.895 0 0.09 0 0 0 0 0 -316.858 1655.4 0 0 0 0 0 0 
0 0 0 0 0 0 0 0 0 0 0 2009.26 0 0 0 0 -163.808 0 0 0 0 2086.47 0 0 0 0 0 0 0 0 0 0 0 0.03 -829.875 0 0 0 0 0 0 2227.32 -1666.69 1497.47 0 0 
0 0 0 -1172.29 0 653.325 0 0 0 0 0 0 979.11 0 0 0 0 0 0 0 0 0 0 -1435.36 0 0 0 -1407.13 1627.32 1130.94 0 0 0 -474.944 0.06 0 0 0 0 0 2265.01 0 -1512.73 0 0 0 
514.313 0 -806.375 0 0 -996.353 0 -1633.12 1021.38 252.007 0 0 0 0 0 0 0 0 0 0 0 -630.741 1528.6 0 2205.8 0 0 0 0 0 0 0 0 0 0 0.02 0 0 -1354.79 1775.64 0 684.301 0 1421.63 0 0 
0 0 0 0 -1671.58 0 0 0 0 0 0 0 101.55 0 0 814.31 2123.55 0 0 1315.42 -150.533 0 0 -25.8644 0 0 0 -2460.78 0 0 0 0 0 0 0 0 0.01 0 551.393 0 0 2248.99 -578.097 0 0 0 
2414.85 0 0 -2021.93 0 1105.3 0 1677.98 0 0 0 0 0 0 954.848 0 0 -1275.6 -1634.04 0 0 0 0 0 0 -2012.01 0 0 0 2302.7 0 0 0 0 0 0 0 0.08 774.636 0 0 0 0 0 0 0 
0 0 2128.59 0 0 0 1713.08 0 614.109 0 175.558 0 0 0 0 0 243.461 0 -1791.97 0 578.707 2069.38 0 2280.88 0 0 0 0 0 0 0 735.725 -1046.1 0 0 1322.29 -682.47 2356.56 0.09 0 0 0 0 0 0 0 
0 0 0 0 1196.71 0 0 0 0 -584.658 2063.74 0 449.004 778.756 136.341 0 0 686.743 0 -51.6526 0 648.137 -1010.7 0 0 0 0 0 0 0 0 0 2067.09 0 0 2097.46 0 0 0 0.03 0 0 0 1997.36 0 0 
1476.41 0 0 0 0 0 0 0 0 0 0 0 0 134.968 0 0 -546.51 0 0 -636.54 0 0 1246.76 0 0 0 0 0 0 0 1429.87 -745.491 0 0 -865.429 0 0 0 0 0 0.07 -653.478 0 1771.83 0 0 
0 0 0 0 0 0 0 0 0 0 0 0 0 0 0 -1589.63 235.069 2393.95 0 0 0 1310.24 -1340.6 123.066 0 0 0 -2203.67 0 1400.11 0 0 0 1799.6 0 -1751.84 756.783 0 0 0 1597.72 0.03 0 0 0 -946.303 
0 1155.66 -1777.63 0 0 0 0 0 0 2049.55 -390.255 0 0 0 0 0 0 1398.89 0 0 0 2109.52 0 1308.1 2245.93 0 0 0 0 0 0 0 0 -149.464 -1595.43 0 475.097 0 0 0 0 0 0.04 0 0 0 
0 1661.81 1739.02 0 0 0 -1873.91 0 982.162 0 0 0 -1235.92 0 0 451.445 231.559 1497.16 0 943.861 -2045.27 -589.084 0 0 0 1296.2 -1797.92 0 0 0 -674.383 0 0 -893.048 0 -80.9503 0 0 0 -1527.38 1922.28 0 0 0 0 0 
0 0 0 121.998 0 0 0 0 0 0 0 0 0 0 0 0 0 2485.5 0 0 0 0 0 0 0 0 0 0 -1927.47 0 0 0 0 0 0 0 0 0 0 0 0 0 0 0 0.02 0 
0 0 -1520.36 0 0 0 0 0 0 0 0 0 0 0 0 -1564.15 0 0 0 0 0 0 0 0 0 2084.03 0 0 0 0 0 0 0 0 0 0 0 0 0 0 0 2247.15 0 0 0 0.05 
