*Vertices 48
*Matrix 
0.02 0 0 0 -433.592 0 0 1505.1 0 -1806.01 0 0 0 0 -1241.11 0 0 0 0 0 0 0 0 0 0 0 0 0 0 0 0 1372.49 0 0 0 0 0 0 0 659.581 2064.65 -998.184 0 0 0 0 0 0 
0 0.06 0 0 0 0 0 0 0 0 0 0 2076.1 0 0 0 0 0 0 0 0 0 -875.652 0 1336.33 0 0 0 0 0 -1820.96 0 0 0 0 648.747 0 0 0 0 0 0 0 1901.53 0 0 0 0 
0 0 0.04 0 0 0 888.47 0 0 0 0 0 128.254 0 0 0 0 0 0 0 0 0 0 0 0 0 -1020.77 0 0 0 0 0 2033.98 0 0 612.278 0 0 -1093.4 0 -430.845 0 0 0 0 0 0 0 
0 0 0 0.04 0 0 0 0 0 0 0 0 2344.97 0 0 0 0 0 0 0 0 0 1586.73 0 0 0 0 0 0 0 0 752.51 0 0 0 0 0 -1295.13 0 0 0 2030.02 0 0 324.183 0 0 0 
2208.7 0 0 0 0.05 -840.098 0 0 0 0 0 0 0 1642.89 0 0 0 0 0 0 0 0 0 0 0 0 0 0 0 0 0 0 0 36.8511 0 0 0 0 0 -1090.5 0 0 0 0 0 0 0 0 
0 0 0 0 -1618.32 0.02 0 0 0 2303 0 0 0 0 0 0 823.923 0 0 0 0 0 0 0 0 0 0 0 0 0 0 -421.995 0 0 0 0 0 0 2226.25 0 0 0 -1723.91 0 0 0 0 0 
0 0 -365.383 0 0 0 0.03 0 0 0 0 0 1832.41 0 1318.78 0 0 0 0 0 0 0 -1020.62 0 0 0 0 0 0 0 0 0 0 0 0 0 0 0 -1770.3 0 0 1021.38 0 0 0 0 0 0 
1049.15 0 0 0 0 0 0 0.03 0 0 0 0 0 2151.94 0 0 1445.28 0 0 0 0 0 -1873 0 0 0 0 0 -2387.69 0 0 0 0 0 0 0 0 0 0 1998.28 0 0 0 0 0 0 0 0 
0 0 0 0 0 0 0 0 0.02 0 -916.089 0 0 0 0 0 0 0 0 0 0 2282.1 0 0 0 0 -1172.9 0 0 788.522 0 0 0 0 0 0 0 0 0 0 0 350.276 0 0 0 0 0 0 
889.538 0 0 0 0 1522.19 0 0 0 0.04 0 0 0 0 0 0 0 0 0 337.153 0 0 0 0 2057.63 1177.18 0 0 0 -593.204 0 0 533.692 0 0 0 0 0 0 0 0 992.538 0 0 0 0 0 0 
0 0 0 0 0 0 0 0 986.282 0 0.03 0 0 0 0 0 0 1508.61 0 0 0 0 0 0 151.753 217.063 0 0 0 0 0 0 0 0 0 0 0 0 0 0 0 0 0 0 0 0 0 0 
0 0 0 0 0 0 0 0 0 0 0 0.01 0 0 0 0 0 0 0 0 248.65 0 0 0 0 0 0 0 0 1906.72 0 1466.64 0 -923.261 0 0 0 0 0 0 0 0 -896.405 0 0 0 0 0 
0 682.47 -270.318 2294.46 0 0 337.764 0 0 0 0 0 0.03 2127.06 0 0 0 0 0 0 0 0 0 0 0 0 0 0 0 0 2215.26 372.707 0 0 596.713 0 0 0 0 0 0 -166.707 0 0 0 0 0 0 
0 0 0 0 1990.8 0 0 1333.58 0 0 0 0 231.559 0.06 0 0 0 0 0 0 0 0 0 0 0 0 972.243 0 0 0 0 0 0 2409.67 0 0 0 0 0 0 1178.09 0 0 -729.774 0 0 0 0 
2253.56 0 0 0 0 0 681.707 0 0 0 0 0 0 0 0 0 0 0 0 -1750.62 0 0 0 0 2288.35 0 0 0 0 0 0 0 0 0 0 0 0 0 0 712.531 -883.74 0 0 0 0 0 0 0 
0 0 0 0 0 0 0 0 0 0 0 0 0 0 0 0.06 0 0 0 700.934 0 276.727 0 0 0 61.7237 0 0 0 0 0 0 0 0 -928.907 0 0 0 0 0 0 0 0 0 0 1912.06 0 0 
0 0 0 0 0 878.399 0 -132.069 0 0 0 0 0 0 0 0 0.07 0 0 0 0 0 0 0 0 0 -511.109 0 -640.66 0 0 2148.58 1546.14 0 0 -1303.37 0 0 0 0 0 -544.221 0 0 0 0 0 0 
0 0 0 0 0 0 0 0 0 0 2379.76 0 0 0 0 0 0 0.02 0 0 588.473 1693.7 0 0 0 0 0 0 0 0 0 0 0 0 0 0 0 0 0 0 0 0 0 -321.589 0 0 0 0 
0 0 0 0 0 0 0 0 0 0 0 0 0 0 0 0 0 0 0.09 0 0 0 0 0 0 0 555.666 631.047 0 0 0 2302.7 0 0 0 0 0 0 2348.78 0 0 0 0 0 0 0 0 0 
0 0 0 0 0 0 0 0 0 575.961 0 0 0 0 1424.53 -2142.63 0 0 0 0 0 0 -879.772 0 0 0 0 0 0 0 0 552.004 1506.16 1670.2 0 0 0 0 0 0 0 0 0 0 193.869 0 0 0 
0 0 0 0 0 0 0 0 0 0 0 1728.49 0 0 0 0 0 389.34 0 0 0.04 0 0 0 0 0 0 0 0 0 0 0 2312.62 767.922 0 0 0 0 0 0 0 0 -471.282 0 0 0 0 0 
0 0 0 0 0 0 0 0 1194.88 0 0 0 0 0 0 -539.491 0 2453.61 0 0 0 0.04 0 0 0 0 0 0 0 0 0 0 0 0 0 0 0 0 0 0 0 0 0 0 120.319 0 0 0 
0 118.946 0 -636.998 0 0 -297.021 2252.65 0 0 0 0 0 0 0 0 0 0 0 -562.99 0 0 0.07 0 0 0 0 0 0 999.252 0 0 0 0 0 0 -1217 0 0 0 0 0 0 0 0 0 0 0 
0 0 0 0 0 0 0 0 0 0 0 0 0 0 0 0 0 0 0 0 0 0 0 0.07 0 0 1300.62 0 0 1713.08 0 -431.15 0 1496.7 0 0 0 0 0 0 0 0 0 -392.239 0 0 0 0 
0 2414.85 0 0 0 0 0 0 0 -193.869 1817.3 0 0 0 -186.85 0 0 0 0 0 0 0 0 0 0 98.3459 0 0 0 0 0 0 0 824.992 0 0 0 0 0 0 0 0 0 0 0 0 0 0 
0 0 0 0 0 0 0 0 0 2354.88 1952.5 0 0 0 0 1976.45 0 0 0 0 0 0 0 0 891.98 0 0 0 0 0 0 0 0 0 0 0 0 0 -2247.15 0 0 0 0 0 0 161.367 0 0 
0 0 -1877.42 0 0 0 0 0 1995.83 0 0 0 0 -661.718 0 0 1388.06 0 2331.08 0 0 0 0 2469.79 0 0 0.02 -1154.44 0 0 -628.147 0 0 0 0 0 0 0 0 0 0 0 0 0 1006.42 0 0 0 
0 0 0 0 0 0 0 0 0 0 0 0 0 0 0 0 0 0 1390.65 0 0 0 0 0 0 0 1352.2 0.01 0 0 0 0 2096.24 -1422.24 0 0 0 0 0 0 0 0 0 0 0 0 0 0 
0 0 0 0 0 0 0 808.664 0 0 0 0 0 0 0 0 692.389 0 0 0 0 0 0 0 0 0 0 0 0.08 0 0 0 0 0 0 1947.77 0 0 0 -1412.47 0 0 0 0 0 0 0 0 
0 0 0 0 0 0 0 0 1573.92 69.3533 0 280.541 0 0 0 0 0 0 0 0 0 0 -1293.3 736.793 0 0 0 0 0 0.03 0 0 -16.5563 2033.22 0 0 0 0 -1090.66 -1558.81 0 147.938 0 0 0 0 0 0 
0 1408.35 0 0 0 0 0 0 0 0 0 0 -1316.95 0 0 0 0 0 0 0 0 0 0 0 0 0 1888.1 0 0 0 0.07 0 0 0 0 0 0 0 -960.952 0 0 0 0 0 0 0 0 -1259.42 
1678.14 0 0 636.235 0 1748.33 0 0 0 0 0 620.365 1615.12 0 0 0 2350.15 0 -1493.65 2230.37 0 0 0 1409.57 0 0 0 0 0 0 0 0.08 2298.58 0 -414.823 0 -574.892 0 0 0 0 0 0 -372.86 0 1681.95 0 0 
0 0 2334.74 0 0 0 0 0 0 940.809 0 0 0 0 0 0 -2232.81 0 0 1800.06 1800.82 0 0 0 0 0 0 1536.99 0 278.71 0 1554.99 0.01 0 1560.49 0 0 0 0 0 0 0 -1050.37 -227.897 0 0 0 0 
0 0 0 0 963.24 0 0 0 0 0 0 9.23185 0 2304.07 0 0 0 0 0 1333.12 -1792.28 0 0 1527.22 2370.14 0 0 448.393 0 879.62 0 0 0 0.08 0 2349.24 0 0 0 0 0 0 0 0 0 0 0 0 
0 0 0 0 0 0 0 0 0 0 0 0 2341.46 0 0 1966.08 0 0 0 0 0 0 0 0 0 0 0 0 0 0 0 -147.481 274.133 0 0.05 0 0 0 0 0 0 0 0 0 0 0 0 0 
0 -1256.52 758.766 0 0 0 0 0 0 0 0 0 0 0 0 0 -1916.18 0 0 0 0 0 0 0 0 0 0 0 482.116 0 0 0 0 -618.686 0 0.08 0 2486.88 0 0 0 0 0 0 0 0 0 0 
0 0 0 0 0 0 0 0 0 0 0 0 0 0 0 0 0 0 0 0 0 0 1041.83 0 0 0 0 0 0 0 0 1632.51 0 0 0 0 0.05 0 0 0 0 0 -13.657 192.038 0 2281.79 0 0 
0 0 0 2158.5 0 0 0 0 0 0 0 0 0 0 0 0 0 0 0 0 0 0 0 0 0 0 0 0 0 0 0 0 0 0 0 -1696.6 0 0.01 0 0 0 0 0 0 0 0 0 0 
0 0 1621.22 0 0 -642.491 -856.883 0 0 0 0 0 0 0 0 0 0 0 -1291.31 0 0 0 0 0 0 2089.22 0 0 0 -109.638 -351.192 0 0 0 0 0 0 0 0.07 0 0 0 0 0 0 0 0 0 
-312.891 0 0 0 1827.37 0 0 -191.885 0 0 0 0 0 0 1407.74 0 0 0 0 0 0 0 0 0 0 0 0 0 1682.26 -526.215 0 0 0 0 0 0 0 0 0 0.07 0 0 0 0 0 0 0 0 
-256.584 0 27.3904 0 0 0 0 0 0 0 0 0 0 -288.629 1280.79 0 0 0 0 0 0 0 0 0 0 0 0 0 0 0 0 0 0 0 0 0 0 0 0 0 0.08 0 0 0 0 0 0 0 
-277.184 0 0 277.642 0 0 560.091 0 1759.77 1024.43 0 0 -2050.92 0 0 0 2166.13 0 0 0 0 0 0 0 0 0 0 0 0 994.369 0 0 0 0 0 0 0 0 0 0 0 0.01 0 0 0 0 0 0 
0 0 0 0 0 1092.94 0 0 0 0 0 2248.07 0 0 0 0 0 0 0 0 -705.512 0 0 0 0 0 0 0 0 0 0 0 983.993 0 0 0 -355.007 0 0 0 0 0 0.09 0 0 0 0 0 
0 1516.39 0 0 0 0 0 0 0 0 0 0 0 2111.8 0 0 0 1096 0 0 0 0 0 1886.43 0 0 0 0 0 0 0 -2372.28 2108.6 0 0 0 1626.1 0 0 0 0 0 0 0.03 0 0 -679.113 0 
0 0 0 -1466.64 0 0 0 0 0 0 0 0 0 0 0 0 0 0 0 2277.21 0 -1048.84 0 0 0 0 1740.55 0 0 0 0 0 0 0 0 0 0 0 0 0 0 0 0 0 0.02 0 0 0 
0 0 0 0 0 0 0 0 0 0 0 0 0 0 0 -761.971 0 0 0 0 0 0 0 0 0 1228.6 0 0 0 0 0 1111.41 0 0 0 0 865.734 0 0 0 0 0 0 0 0 0.08 0 0 
0 0 0 0 0 0 0 0 0 0 0 0 0 0 0 0 0 0 0 0 0 0 0 0 0 0 0 0 0 0 0 0 0 0 0 0 0 0 0 0 0 0 0 915.937 0 0 0.08 0 
0 0 0 0 0 0 0 0 0 0 0 0 0 0 0 0 0 0 0 0 0 0 0 0 0 0 0 0 0 0 1932.66 0 0 0 0 0 0 0 0 0 0 0 0 0 0 0 0 0.03 
