*Vertices 65
*Matrix 
0.02 0 0 0 -277.795 0 0 0 0 0 0 0 0 0 0 2068.93 0 0 0 0 0 0 0 0 -153.737 0 0 0 687.201 0 0 0 0 0 0 0 0 0 0 0 1657.99 0 0 0 0 0 0 0 0 0 0 0 0 0 0 0 0 0 0 0 0 0 0 0 0 
0 0.01 0 0 754.036 0 0 0 0 0 0 0 0 0 0 0 0 0 0 0 -1270.26 0 0 -221.488 0 0 0 0 0 787.606 0 0 0 0 0 0 0 0 0 0 0 311.975 0 0 0 0 0 0 184.713 849.559 0 0 0 857.494 0 0 0 0 0 0 0 0 0 0 0 
0 0 0.02 0 0 0 931.043 0 0 -620.212 0 0 0 0 0 0 0 0 0 0 0 391.324 1815.78 0 1299.55 2081.29 0 0 0 2074.72 0 -1213.19 0 0 0 2432.4 -482.727 0 0 0 0 0 0 1627.93 0 0 0 0 0 0 0 0 0 0 0 0 0 0 0 0 0 1349.15 0 0 0 
0 0 0 0.01 0 0 0 0 0 0 0 0 0 0 0 0 0 1022.9 0 0 0 0 0 0 0 0 0 -2151.63 0 0 0 0 2406.92 2050.92 0 0 0 0 -1284.75 170.98 2418.36 0 0 0 0 0 0 0 0 0 0 0 0 0 0 0 0 0 0 0 0 0 0 0 0 
-1666.39 1865.37 0 0 0.03 0 0 0 0 0 0 0 0 0 145.344 0 0 0 0 0 -1654.03 964.156 0 0 1760.84 0 0 0 0 0 0 1693.7 0 0 0 0 0 0 0 0 0 0 0 0 -1079.82 0 0 0 0 -318.079 0 1801.43 0 0 0 0 0 0 0 0 0 0 0 0 0 
0 0 0 0 0 0.04 0 2111.65 0 0 0 -2401.73 0 0 0 0 0 0 0 0 0 0 576.418 0 0 0 0 0 0 0 0 0 -1711.86 0 0 0 570.925 -137.41 0 0 0 636.998 1720.1 0 0 0 0 0 0 -142.75 0 776.925 0 0 0 0 0 0 0 0 0 0 0 0 0 
0 0 2280.88 0 0 0 0.04 0 0 0 0 0 0 0 0 0 1434.14 0 0 0 -2269.74 0 2429.04 2403.56 0 0 -186.697 0 0 -227.439 0 0 2394.86 0 0 0 0 0 0 0 0 0 0 0 0 0 0 0 0 0 0 0 0 0 0 0 0 0 -1056.32 0 0 0 0 0 0 
0 0 0 0 0 927.534 0 0.01 0 0 0 935.926 605.716 0 0 0 0 0 0 0 0 0 0 0 0 0 0 0 0 -356.533 0 0 0 0 0 0 0 0 0 0 0 0 0 0 0 0 -2442.93 0 258.873 0 0 0 0 0 0 0 0 0 0 0 0 0 0 0 0 
0 0 0 0 0 0 0 0 0.03 0 0 0 0 0 0 0 0 0 0 0 0 116.962 0 0 0 1459.62 0 0 186.544 0 0 0 0 0 0 0 0 0 0 0 0 0 1837.14 0 0 0 0 0 0 0 0 0 0 0 0 0 0 0 0 0 0 0 0 0 0 
0 0 -2151.02 0 0 0 0 0 0 0.04 0 1226.16 0 0 0 0 0 1158.86 0 0 0 0 1296.2 0 0 0 693.762 1704.23 0 0 0 0 -2468.57 0 0 0 0 0 0 0 308.924 0 0 0 0 0 0 0 878.552 0 0 0 0 0 0 0 0 0 0 0 0 0 0 925.855 0 
0 0 0 0 0 0 0 0 0 0 0.09 0 0 0 0 0 0 0 0 0 0 0 0 0 0 -645.848 -1535.92 0 0 0 0 2114.4 0 0 0 0 -652.257 905.103 0 0 0 0 0 0 0 1504.03 0 0 0 0 0 0 0 0 0 0 0 0 0 0 0 0 0 0 0 
0 0 0 0 0 324.641 0 1670.81 0 679.113 0 0.02 0 0 0 987.045 0 -2061.3 1714.15 0 0 2386.78 0 0 0 0 0 0 0 -2203.51 0 0 0 0 0 0 0 0 2265.77 1115.83 0 0 0 0 0 -272.454 103.381 0 0 0 0 0 0 0 -694.983 0 0 0 0 0 0 0 0 0 0 
0 0 0 0 0 0 0 -496.002 0 0 0 0 0.03 0 0 0 0 -2179.86 0 0 0 0 0 0 0 0 0 0 0 0 1495.94 0 0 0 0 0 0 0 0 0 0 1708.2 0 0 0 0 0 0 0 0 0 -406.583 0 0 0 0 0 0 0 0 0 0 733.589 0 0 
0 0 0 0 0 0 0 0 0 0 0 0 0 0.01 0 0 0 -623.112 0 0 0 0 2108.45 0 -923.414 19.1504 0 0 0 0 155.11 0 0 0 0 0 0 0 0 0 0 0 0 0 0 0 0 0 0 0 0 0 0 0 0 0 0 247.734 0 0 0 0 0 0 0 
0 0 0 0 -1886.27 0 0 0 0 0 0 0 0 0 0.06 0 0 1439.79 0 0 0 -1121.02 0 0 0 0 0 2222.28 0 0 0 0 0 0 0 0 0 0 -1849.65 0 0 0 2390.59 0 0 77.1355 0 0 0 0 0 0 0 0 0 0 0 0 0 0 0 0 0 0 0 
2168.42 0 0 0 0 0 0 0 0 0 0 2327.11 0 0 0 0.09 0 0 0 0 0 0 0 0 0 0 -553.529 0 0 0 0 0 -1467.41 0 0 0 0 0 0 -25.7118 1003.22 0 0 0 0 -1088.98 0 0 0 0 -1309.93 0 0 0 0 0 0 0 0 0 0 0 0 0 0 
0 0 0 0 0 0 -164.113 0 0 0 0 0 0 0 0 0 0 0 0 0 0 0 0 0 0 375.607 0 0 0 0 0 0 -1390.19 0 -1545.99 0 0 2228.23 0 0 0 0 0 0 0 0 0 2486.42 0 0 1741 0 0 0 0 0 0 0 0 0 0 0 0 0 0 
0 0 0 -2157.43 0 0 0 0 0 -1510.74 0 1590.85 2424.92 591.983 1154.9 0 0 0.01 0 0 0 0 0 0 0 0 338.527 0 1237.3 0 0 0 0 0 702.307 -2177.57 0 0 1804.33 0 0 0 0 0 0 0 0 0 0 0 0 0 -1702.09 0 0 0 0 0 0 -687.048 0 0 0 0 0 
0 0 0 0 0 0 0 0 0 0 0 783.029 0 0 0 0 0 0 0 823.161 0 1225.09 0 0 0 0 0 0 0 0 0 0 0 0 0 -2176.05 0 0 0 0 0 0 0 0 0 0 0 0 0 0 0 0 0 0 0 0 0 0 0 0 0 0 0 0 0 
0 0 0 0 0 0 0 0 0 0 0 0 0 0 0 0 0 0 -1814.71 0.04 0 716.041 -906.934 0 0 0 0 0 0 0 0 0 0 0 0 1242.79 0 0 0 437.101 0 0 0 0 0 0 0 0 -209.128 1997.82 0 0 0 0 0 0 0 0 0 0 0 0 0 0 0 
0 1947.61 0 0 1879.86 0 489.746 0 0 0 0 0 0 0 0 0 0 0 0 0 0.01 0 0 0 0 0 0 0 0 0 2210.38 0 0 0 0 0 0 0 2022.54 0 0 0 0 0 0 0 0 0 0 0 0 0 0 0 0 0 0 0 0 0 0 0 0 0 0 
0 0 1288.26 0 521.18 0 0 0 23.5755 0 0 -19.7607 0 0 1766.49 0 0 0 -852.916 2483.52 0 0.08 0 0 0 0 0 0 0 0 0 0 0 0 0 0 0 0 1079.52 0 0 0 0 0 0 0 0 0 -140.309 -419.706 0 0 0 0 0 0 0 0 0 0 0 0 0 0 0 
0 0 936.384 0 0 -2076.56 263.756 0 0 1542.79 0 0 0 1973.86 0 0 0 0 0 357.753 0 0 0.01 0 0 0 0 0 0 -486.541 0 0 0 0 292.138 0 0 0 0 0 0 0 0 63.097 0 0 0 0 0 0 0 0 0 0 0 985.824 0 0 0 0 0 0 0 0 0 
0 -846.965 0 0 0 0 1064.71 0 0 0 0 0 0 0 0 0 0 0 0 0 0 0 0 0.04 0 0 0 -375.912 0 0 0 0 0 0 0 0 0 0 0 0 0 0 0 0 0 0 -589.999 0 0 0 0 1499.3 0 0 0 0 0 0 0 0 0 0 0 0 0 
1843.09 0 -700.476 0 -462.889 0 0 0 0 0 0 0 0 1908.4 0 0 0 0 0 0 0 0 0 0 0.07 0 1723.61 0 0 0 0 0 0 0 0 0 0 2438.51 0 0 0 0 0 0 0 0 0 0 0 0 0 457.396 0 0 0 0 0 0 0 0 0 0 0 0 0 
0 0 -2386.93 0 0 0 0 0 -1361.35 0 1189.54 0 0 -1911.3 0 0 241.02 0 0 0 0 0 0 0 0 0.04 0 0 0 0 0 0 0 2252.65 1805.7 0 0 0 0 0 0 0 0 0 0 0 1788.92 825.297 0 0 0 0 0 0 0 0 0 0 0 0 0 0 0 0 0 
0 0 0 0 0 0 -804.086 0 0 -755.104 1221.73 0 0 0 0 2196.49 0 341.273 0 0 0 0 0 0 230.796 0 0 0 0 0 0 0 0 0 -734.962 1783.12 0 0 0 0 0 0 0 0 -235.984 0 0 0 0 0 0 0 0 0 0 0 0 0 0 0 0 0 0 0 0 
0 0 0 -501.19 0 0 0 0 0 2466.58 0 0 0 0 757.241 0 0 0 0 0 0 0 0 -1638.31 0 0 0 0.02 0 0 328.455 0 0 0 0 0 0 -183.493 0 0 1463.9 0 0 0 0 0 0 0 0 0 0 0 0 0 0 0 0 0 0 0 2421.26 0 0 0 0 
47.9904 0 0 0 0 0 0 0 1158.56 0 0 0 0 0 0 0 0 2345.88 0 0 0 0 0 0 0 0 0 0 0.04 0 0 0 0 0 0 0 0 0 0 0 0 809.427 1380.58 0 -959.883 0 -706.885 0 0 0 -77.8985 0 0 0 0 0 0 0 0 0 0 0 0 0 0 
0 1770 279.168 0 0 0 1602.91 -1041.83 0 0 0 -1157.95 0 0 0 0 0 0 0 0 0 0 2298.27 0 0 0 0 0 0 0.09 0 0 0 -1645.79 0 0 820.719 0 121.998 0 0 0 0 0 0 0 0 0 0 0 0 0 0 0 0 0 0 0 0 0 0 0 0 0 0 
0 0 0 0 0 0 0 0 0 0 0 0 -2041.15 -828.043 0 0 0 0 0 0 -620.975 0 0 0 0 0 0 -549.409 0 0 0 0 -338.984 1880.93 0 1946.55 0 1105.3 0 0 0 0 1559.57 0 0 0 120.472 0 0 0 0 0 0 0 0 0 0 0 0 0 0 0 0 0 0 
0 0 -714.209 0 1963.94 0 0 0 0 0 2309.11 0 0 0 0 0 0 0 0 0 0 0 0 0 0 0 0 0 0 0 0 0.08 0 0 0 0 -2237.54 0 0 0 0 0 0 0 0 0 0 0 0 0 0 0 0 0 0 0 0 0 0 0 0 0 0 0 0 
0 0 0 2011.25 0 -2107.68 384.304 0 0 -270.013 0 0 0 0 0 -565.432 2253.56 0 0 0 0 0 0 0 0 0 0 0 0 0 596.408 0 0.07 0 0 1975.08 0 0 0 0 0 -1070.36 0 0 0 0 0 0 0 0 0 0 0 0 0 0 0 0 0 0 0 0 0 0 0 
0 0 0 848.796 0 0 0 0 0 0 0 0 0 0 0 0 0 0 0 0 0 0 0 0 0 835.673 0 0 0 1920.45 754.036 0 0 0.09 0 0 0 0 0 0 0 0 -2066.48 0 0 0 0 0 0 0 0 1954.79 0 0 0 0 0 0 0 0 0 0 0 0 0 
0 0 0 0 0 0 0 0 0 0 0 0 0 0 0 0 1180.23 1134.91 0 0 0 0 -600.223 0 0 -496.307 1495.64 0 0 0 0 0 0 0 0.02 2219.38 0 0 0 0 0 0 1314.36 0 0 1237.75 0 0 0 0 -940.504 0 0 0 0 0 0 0 0 0 0 0 0 0 0 
0 0 -1513.49 0 0 0 0 0 0 0 0 0 0 0 0 0 0 313.349 332.728 -2190.24 0 0 0 0 0 0 84.7652 0 0 0 990.555 0 -568.941 0 -50.737 0.04 2017.81 0 0 0 0 0 0 1098.59 1450.16 0 0 -329.829 0 0 380.947 0 0 0 0 0 0 0 0 0 0 0 0 0 0 
0 0 -1453.37 0 0 -129.017 0 0 0 0 1255.91 0 0 0 0 0 0 0 0 0 0 0 0 0 0 0 0 0 0 2165.21 0 567.568 0 0 0 2481.23 0.09 0 0 0 0 0 0 0 0 2249.6 0 0 0 0 -2170.25 0 0 0 0 0 0 0 0 0 0 0 0 0 0 
0 0 0 0 0 -913.648 0 0 0 0 2331.84 0 0 0 0 0 2408.44 0 0 0 0 0 0 0 1196.86 0 0 -134.816 0 0 2427.21 0 0 0 0 0 0 0.05 0 0 0 0 0 -1408.51 0 0 0 0 0 0 0 0 0 0 0 0 0 0 0 0 0 0 0 0 0 
0 0 0 649.51 0 0 0 0 0 0 0 1866.44 0 0 1636.17 0 0 -2198.93 0 0 1773.81 -155.721 0 0 0 0 0 0 0 -42.8022 0 0 0 0 0 0 0 0 0.09 0 1145.28 0 0 0 -1938.15 0 0 0 0 0 0 0 0 0 0 0 0 0 0 0 0 0 0 0 0 
0 0 0 2126.15 0 0 0 0 0 0 0 2241.36 0 0 0 426.725 0 0 0 -76.8303 0 0 0 0 0 0 0 0 0 0 0 0 0 0 0 0 0 0 0 0.08 0 0 0 0 0 0 0 0 1976.45 0 0 0 0 0 0 0 0 0 0 0 0 0 0 0 0 
1905.19 0 0 2232.66 0 0 0 0 0 1195.79 0 0 0 0 0 -2072.44 0 0 0 0 0 0 0 0 0 0 0 916.089 0 0 0 0 0 0 0 0 0 0 -808.359 0 0.02 -1979.96 0 0 0 0 0 0 0 0 0 0 0 0 0 0 0 0 0 0 0 0 0 0 0 
0 1041.37 0 0 0 -1973.25 0 0 0 0 0 0 1786.94 0 0 0 0 0 0 0 0 0 0 0 0 0 0 0 -431.15 0 0 0 393.765 0 0 0 0 0 0 0 488.525 0.08 1270.41 0 0 0 0 0 2022.23 0 0 0 0 0 0 0 -1881.39 0 0 0 0 0 0 0 0 
0 0 0 0 0 1220.97 0 0 406.125 0 0 0 0 0 2468.72 0 0 0 0 0 0 0 0 0 0 0 0 0 -1281.24 0 -718.329 0 0 1228.75 1253.62 0 0 0 0 0 0 2154.38 0.05 0 0 0 0 0 0 0 0 1180.99 0 0 0 0 0 0 0 0 0 0 0 0 -112.079 
0 0 2049.85 0 0 0 0 0 0 0 0 0 0 0 0 0 0 0 0 0 0 0 2173.15 0 0 0 0 0 0 0 0 0 0 0 0 875.042 0 -1236.38 0 0 0 0 0 0.05 0 0 0 0 2357.48 0 0 0 0 0 0 0 0 0 0 0 0 0 0 0 0 
0 0 0 0 -797.22 0 0 0 0 0 0 0 0 0 0 0 0 0 0 0 0 0 0 0 0 0 -233.695 0 975.6 0 0 0 0 0 0 2400.97 0 0 1876.35 0 0 0 0 0 0.04 0 0 0 0 -614.414 0 -19.9133 0 0 0 0 0 0 0 0 0 0 0 0 0 
0 0 0 0 0 0 0 0 0 0 2042.99 -889.081 0 0 2429.96 1807.08 0 0 0 0 0 0 0 0 0 0 0 0 0 0 0 0 0 0 -1723.3 0 2206.72 0 0 0 0 0 0 0 0 0.04 0 0 0 0 0 -1015.43 0 0 0 0 0 0 0 0 0 0 0 0 0 
0 0 0 0 0 0 0 1535.92 0 0 0 1327.17 0 0 0 0 0 0 0 0 0 0 0 -1939.22 0 1681.19 0 0 272.912 0 -1742.07 0 0 0 0 0 0 0 0 0 0 0 0 0 0 0 0.03 2487.18 2090.29 0 0 2239.22 0 0 0 0 0 0 0 0 0 0 0 0 0 
0 0 0 0 0 0 0 0 0 0 0 0 0 0 0 0 2361.45 0 0 0 0 0 0 0 0 217.368 0 0 0 0 0 0 0 0 0 -1162.83 0 0 0 0 0 0 0 0 0 0 2168.87 0.04 0 0 0 1368.53 0 0 0 0 0 0 0 0 0 0 0 0 0 
0 -1273.61 0 0 0 0 0 389.645 0 2200.16 0 0 0 0 0 0 0 0 0 -720.466 0 -1668.22 0 0 0 0 0 0 0 0 0 0 0 0 0 0 0 0 0 2194.36 0 1460.84 0 -909.223 0 0 1063.19 0 0.07 0 0 0 0 0 0 0 0 0 0 0 0 0 0 0 0 
0 1035.57 0 0 2498.17 1233.18 0 0 0 0 0 0 0 0 0 0 0 0 0 -347.53 0 -2412.87 0 0 0 0 0 0 0 0 0 0 0 0 0 0 0 0 0 0 0 0 0 0 228.507 0 0 0 0 0.03 2245.93 0 0 0 0 0 0 0 0 0 0 0 0 0 0 
0 0 0 0 0 0 0 0 0 0 0 0 0 0 0 -526.673 624.638 0 0 0 0 0 0 0 0 0 0 0 -842.387 0 0 0 0 0 2261.96 2404.93 -1165.12 0 0 0 0 0 0 0 0 0 0 0 0 1351.44 0.08 535.981 0 0 0 0 0 0 0 0 0 0 0 0 0 
0 0 0 0 2365.87 1167.26 0 0 0 0 0 0 634.404 0 0 0 0 0 0 0 0 0 0 594.272 1195.64 0 0 0 0 0 0 0 0 2194.66 0 0 0 0 0 0 0 0 1490.75 0 834.91 -1807.38 -2121.57 -492.95 0 0 -1845.53 0.05 0 0 0 0 0 0 0 0 0 0 0 0 0 
0 0 0 0 0 0 0 0 0 0 0 0 0 0 0 0 0 1690.19 0 0 0 0 0 0 0 0 0 0 0 0 0 0 0 0 0 0 0 0 0 0 0 0 0 0 0 0 0 0 0 0 0 0 0.09 0 0 0 0 0 0 0 0 0 0 0 0 
0 1820.81 0 0 0 0 0 0 0 0 0 0 0 0 0 0 0 0 0 0 0 0 0 0 0 0 0 0 0 0 0 0 0 0 0 0 0 0 0 0 0 0 0 0 0 0 0 0 0 0 0 0 0 0.05 0 0 0 0 0 0 0 0 0 0 0 
0 0 0 0 0 0 0 0 0 0 0 1655.55 0 0 0 0 0 0 0 0 0 0 0 0 0 0 0 0 0 0 0 0 0 0 0 0 0 0 0 0 0 0 0 0 0 0 0 0 0 0 0 0 0 0 0.02 0 0 0 0 0 0 0 0 0 0 
0 0 0 0 0 0 0 0 0 0 0 0 0 0 0 0 0 0 0 0 0 0 444.121 0 0 0 0 0 0 0 0 0 0 0 0 0 0 0 0 0 0 0 0 0 0 0 0 0 0 0 0 0 0 0 0 0.05 0 0 0 0 0 0 0 0 0 
0 0 0 0 0 0 0 0 0 0 0 0 0 0 0 0 0 0 0 0 0 0 0 0 0 0 0 0 0 0 0 0 0 0 0 0 0 0 0 0 0 1909.77 0 0 0 0 0 0 0 0 0 0 0 0 0 0 0 0 0 0 0 0 0 0 0 
0 0 0 0 0 0 0 0 0 0 0 0 0 1494.57 0 0 0 0 0 0 0 0 0 0 0 0 0 0 0 0 0 0 0 0 0 0 0 0 0 0 0 0 0 0 0 0 0 0 0 0 0 0 0 0 0 0 0 0.01 0 0 0 0 0 0 0 
0 0 0 0 0 0 480.895 0 0 0 0 0 0 0 0 0 0 0 0 0 0 0 0 0 0 0 0 0 0 0 0 0 0 0 0 0 0 0 0 0 0 0 0 0 0 0 0 0 0 0 0 0 0 0 0 0 0 0 0.07 0 0 0 0 0 0 
0 0 0 0 0 0 0 0 0 0 0 0 0 0 0 0 0 862.529 0 0 0 0 0 0 0 0 0 0 0 0 0 0 0 0 0 0 0 0 0 0 0 0 0 0 0 0 0 0 0 0 0 0 0 0 0 0 0 0 0 0.07 0 0 0 0 0 
0 0 0 0 0 0 0 0 0 0 0 0 0 0 0 0 0 0 0 0 0 0 0 0 0 0 0 182.272 0 0 0 0 0 0 0 0 0 0 0 0 0 0 0 0 0 0 0 0 0 0 0 0 0 0 0 0 0 0 0 0 0.03 0 0 0 0 
0 0 521.027 0 0 0 0 0 0 0 0 0 0 0 0 0 0 0 0 0 0 0 0 0 0 0 0 0 0 0 0 0 0 0 0 0 0 0 0 0 0 0 0 0 0 0 0 0 0 0 0 0 0 0 0 0 0 0 0 0 0 0.09 0 0 0 
0 0 0 0 0 0 0 0 0 0 0 0 644.78 0 0 0 0 0 0 0 0 0 0 0 0 0 0 0 0 0 0 0 0 0 0 0 0 0 0 0 0 0 0 0 0 0 0 0 0 0 0 0 0 0 0 0 0 0 0 0 0 0 0.07 0 0 
0 0 0 0 0 0 0 0 0 306.33 0 0 0 0 0 0 0 0 0 0 0 0 0 0 0 0 0 0 0 0 0 0 0 0 0 0 0 0 0 0 0 0 0 0 0 0 0 0 0 0 0 0 0 0 0 0 0 0 0 0 0 0 0 0.06 0 
0 0 0 0 0 0 0 0 0 0 0 0 0 0 0 0 0 0 0 0 0 0 0 0 0 0 0 0 0 0 0 0 0 0 0 0 0 0 0 0 0 0 1045.49 0 0 0 0 0 0 0 0 0 0 0 0 0 0 0 0 0 0 0 0 0 0.04 
