*Vertices 48
*Matrix 
0.03 0 0 0 0 0 1191.82 0 0 0 0 0 0 -961.715 0 0 0 0 2406 0 0 0 0 0 0 0 0 0 0 0 0 2202.6 0 0 0 0 0 0 0 -1083.33 0 0 0 0 0 887.097 0 0 
0 0.05 1112.63 0 0 -894.421 0 923.414 0 0 0 0 0 0 0 0 0 0 0 0 0 0 1680.73 0 0 -1807.38 -914.716 0 0 0 0 0 0 1641.36 0 0 -574.587 0 0 0 0 0 0 0 0 -15.6407 0 -275.201 
0 -1251.95 0.01 1171.38 0 0 0 1576.51 0 0 -2449.95 0 0 0 0 0 0 827.738 0 0 0 1670.66 0 678.503 0 0 0 0 561.922 0 0 -1245.08 0 0 0 0 0 0 0 0 1586.28 0 0 0 0 0 0 0 
0 0 1328.39 0.02 0 0 0 -1087.45 0 0 0 0 0 -2033.98 0 0 0 0 1211.51 0 0 0 1544.62 0 0 0 0 0 0 0 0 0 0 0 0 1545.53 2288.51 0 0 0 0 0 0 0 0 0 0 0 
0 0 0 0 0.03 1626.87 0 0 0 21.1341 0 0 435.728 0 0 800.119 1004.29 1408.2 0 0 0 0 0 0 0 0 0 0 0 0 0 0 0 0 -1384.85 0 0 0 0 0 0 0 0 0 0 0 0 0 
0 -249.565 0 0 2457.12 0.05 1855.91 0 0 0 0 0 0 -281.61 0 0 0 0 0 0 0 0 2406.46 0 0 0 0 0 0 0 0 0 0 0 0 1869.03 0 0 0 0 0 0 0 0 0 0 0 0 
2249.44 0 0 0 0 2256 0.08 0 0 0 0 0 0 -790.811 0 0 0 0 0 0 0 0 0 0 0 890.301 0 0 0 0 0 0 135.731 0 0 0 0 0 0 0 0 0 0 0 0 0 0 0 
0 -1306.88 1647.62 1750.92 0 0 0 0.01 0 0 0 0 0 0 0 0 0 0 0 0 0 0 1889.93 0 0 0 0 1747.57 0 0 0 0 0 0 0 -1302.61 0 2497.71 -670.11 0 1395.23 0 0 0 -649.205 0 -1895.12 0 
0 0 0 0 0 0 0 0 0.06 0 0 0 0 0 0 620.06 0 0 0 0 197.073 0 0 0 0 0 0 0 0 0 1209.83 0 0 0 0 0 0 -1292.08 0 0 0 0 2446.59 0 0 1987.9 0 0 
0 0 0 0 -1908.25 0 0 0 0 0.07 0 0 0 -2328.18 0 0 0 550.935 0 0 2366.48 0 773.415 0 0 272.301 0 0 0 615.787 0 0 0 0 0 0 0 625.095 0 0 0 0 0 0 0 0 0 0 
0 0 1524.02 0 0 0 0 0 0 0 0.01 0 0 0 0 0 0 0 0 0 0 0 0 0 1789.38 0 0 0 0 0 0 1695.07 0 0 0 0 0 0 0 0 0 0 1625.64 0 0 2426.45 0 0 
0 0 0 0 0 0 0 0 0 0 0 0 5.87481 0 0 0 0 0 293.054 -2.06 0 0 0 0 1886.88 0 1284.6 0 0 -1845.53 0 0 0 1988.05 114.978 0 0 0 0 0 0 0 0 0 0 -827.891 0 0 
0 0 0 0 -247.124 0 0 0 0 0 0 406.43 0.05 0 0 0 0 0 0 0 0 0 1749.85 0 0 0 0 0 0 0 0 0 0 0 0 0 0 0 0 0 0 0 0 0 0 0 0 2174.67 
-1303.22 0 0 1009.93 0 2090.9 -147.938 0 0 -2306.97 0 0 0 0 0 0 0 0 0 0 0 0 0 0 0 0 0 0 0 0 0 1722.54 0 0 0 0 0 0 1059.07 0 0 -843.913 0 0 0 0 0 0 
0 0 0 0 0 0 0 0 0 0 0 0 0 0 0.09 581.912 0 0 0 0 0 0 0 0 0 0 90.7163 275.353 0 0 0 0 0 532.014 0 258.263 0 0 0 0 0 0 0 0 0 -874.126 0 0 
0 0 0 0 -1117.21 0 0 0 1750.47 0 0 0 0 0 -1270.26 0.05 0 0 0 0 0 0 0 0 0 0 855.663 0 0 0 0 1721.32 0 0 0 0 0 1218.68 1809.06 0 -729.621 0 0 0 0 0 0 0 
0 0 0 0 665.227 0 0 0 0 0 0 0 0 0 0 0 0.02 0 0 0 0 1708.2 0 0 75.6096 0 0 0 0 0 0 -349.818 0 0 0 0 0 0 0 2447.97 0 0 0 0 0 0 0 0 
0 0 -1198.84 0 23.5755 0 0 0 0 1319.24 0 0 0 0 0 0 0 0.03 0 0 0 0 0 0 0 934.248 0 0 0 1987.14 0 0 0 0 0 0 0 0 0 0 0 0 1171.22 0 0 0 0 0 
386.135 0 0 -647.679 0 0 0 0 0 0 0 1784.95 0 0 0 0 0 0 0.02 0 0 1217.76 0 0 0 0 0 -488.22 0 0 0 0 1669.29 0 -514.618 0 0 0 0 562.838 0 0 0 0 2299.34 0 0 0 
0 0 0 0 0 0 0 0 0 0 0 854.137 0 0 0 0 0 0 0 0.04 0 0 0 0 0 0 0 0 0 2039.32 0 0 0 0 0 0 -1061.2 0 0 -511.261 0 0 0 0 0 0 0 0 
0 0 0 0 0 0 0 0 1504.94 1498.23 0 0 0 0 0 0 0 0 0 0 0.01 0 658.971 0 624.027 0 0 0 0 -1397.82 0 0 0 0 0 957.289 0 0 0 0 1668.22 0 0 0 0 0 2066.94 0 
0 0 2358.24 0 0 0 0 0 0 0 0 0 0 0 0 0 -1811.96 0 -557.802 0 0 0.09 0 0 0 0 0 0 0 0 0 0 0 1876.96 0 0 0 0 0 0 0 0 893.658 0 0 0 0 0 
0 1487.7 0 -318.842 0 864.818 0 2489.32 0 -341.121 0 0 -377.438 0 0 0 0 0 0 0 -2160.02 0 0.05 0 0 0 0 0 0 0 0 0 0 0 0 0 1537.6 1849.5 0 0 0 0 0 0 0 0 0 0 
0 0 2081.59 0 0 0 0 0 0 0 0 0 0 0 0 0 0 0 0 0 0 0 0 0.04 0 0 0 0 0 340.052 0 0 0 0 0 0 0 0 0 0 0 0 0 0 0 0 0 -461.058 
0 0 0 0 0 0 0 0 0 0 2000.11 2384.64 0 0 0 0 1469.85 0 0 0 986.129 0 0 0 0.02 0 0 0 0 -1027.33 0 0 0 -1492.43 0 0 0 0 0 0 0 -1558.05 0 0 0 2146.29 0 0 
0 443.968 0 0 0 0 1398.59 0 0 -465.178 0 0 0 0 0 0 0 1849.8 0 0 0 0 0 0 0 0.09 0 0 0 0 0 0 0 0 0 0 0 0 1266.14 0 0 0 0 0 0 0 -496.307 0 
0 1916.03 0 0 0 0 0 0 0 0 0 -261.315 0 0 -142.445 1859.42 0 0 0 0 0 0 0 0 0 0 0.04 0 0 0 2277.06 0 0 0 0 0 0 0 0 0 0 0 0 0 0 0 2074.88 0 
0 0 0 0 0 0 0 653.02 0 0 0 0 0 0 -1298.18 0 0 0 2328.03 0 0 0 0 0 0 0 0 0.09 0 -1150.32 -321.741 2131.18 0 0 0 0 0 0 0 0 0 0 0 0 0 0 0 0 
0 0 1144.83 0 0 0 0 0 0 0 0 0 0 0 0 0 0 0 0 0 0 0 0 0 0 0 0 0 0.07 0 0 0 0 0 0 0 0 0 0 0 0 0 0 49.0585 0 0 0 0 
0 0 0 0 0 0 0 0 0 2460.48 0 1574.22 0 0 0 0 0 2051.53 0 -832.469 -428.709 0 0 -1542.63 511.109 0 0 2292.02 0 0.08 0 0 -1578.65 0 0 0 0 0 0 0 -1240.81 1202.51 0 0 0 0 0 0 
0 0 0 0 0 0 0 0 1218.99 0 0 0 0 0 0 0 0 0 0 0 0 0 0 0 0 0 1326.87 1742.23 0 0 0.06 0 0 0 0 0 0 0 0 0 0 0 0 0 -262.993 0 0 0 
2064.96 0 -499.817 0 0 0 0 0 0 0 873.974 0 0 849.406 0 327.998 205.618 0 0 0 0 0 0 0 0 0 0 273.827 0 0 0 0.09 0 0 0 0 0 0 0 -897.015 -720.618 668.279 0 0 0 0 0 0 
0 0 0 0 0 0 1969.74 0 0 0 0 0 0 0 0 0 0 0 -1025.96 0 0 0 0 0 0 0 0 0 0 1444.52 0 0 0.02 0 0 0 2470.55 0 0 0 0 0 0 0 0 0 -1112.48 0 
0 -334.101 0 0 0 0 0 0 0 0 0 -6.18 0 0 1755.96 0 0 0 0 0 0 2488.1 0 0 1618.93 0 0 0 0 0 0 0 0 0.09 0 0 0 0 -242.546 0 0 0 811.258 0 -407.956 0 0 0 
0 0 0 0 2432.71 0 0 0 0 0 0 -246.818 0 0 0 0 0 0 -1002.91 0 0 0 0 0 0 0 0 0 0 0 0 0 0 0 0.05 0 0 0 0 538.423 0 0 0 0 0 0 0 0 
0 0 0 702.307 0 483.032 0 -318.232 0 0 0 0 0 0 1522.8 0 0 0 0 0 2383.11 0 0 0 0 0 0 0 0 0 0 0 0 0 0 0.04 -1465.73 0 2436.37 0 0 0 0 0 0 0 0 90.4111 
0 753.426 0 2142.63 0 0 0 0 0 0 0 0 0 0 0 0 0 0 0 2231.59 0 0 -1759.77 0 0 0 0 0 0 0 0 0 -326.93 0 0 -1898.79 0.05 0 0 0 0 0 2211.14 0 0 0 0 0 
0 0 0 0 0 0 0 285.272 -1067.31 -534.913 0 0 0 0 0 2454.07 0 0 0 0 0 0 1297.27 0 0 0 0 0 0 0 0 0 0 0 0 0 0 0.06 0 0 0 0 0 0 0 0 0 0 
0 0 0 0 0 0 0 -469.756 0 0 0 0 0 2291.56 0 1536.53 0 0 0 0 0 0 0 0 0 272.149 0 0 0 0 0 0 0 -1809.37 0 -1341.52 0 0 0.05 0 0 -14.1148 0 605.564 0 0 890.912 0 
1785.71 0 0 0 0 0 0 0 0 0 0 0 0 0 0 0 322.657 0 -2342.22 -27.8481 0 0 0 0 0 0 0 0 0 0 0 2386.62 0 0 1846.29 0 0 0 0 0.05 0 0 0 0 0 0 0 0 
0 0 48.7533 0 0 0 0 1485.11 0 0 0 0 0 0 0 -1401.64 0 0 0 0 1098.13 0 0 0 0 0 0 0 0 -364.925 0 641.27 0 0 0 0 0 0 0 0 0.04 0 -1078.14 0 0 0 0 0 
0 0 0 0 0 0 0 0 0 0 0 0 0 853.984 0 0 0 0 0 0 0 0 0 0 -721.381 0 0 0 0 2323.76 0 649.358 0 0 0 0 0 0 2462.92 0 0 0.04 0 968.734 0 -1034.96 -843.76 0 
0 0 0 0 0 0 0 0 -204.703 0 1796.7 0 0 0 0 0 0 -633.335 0 0 0 1992.32 0 0 0 0 0 0 0 0 0 0 0 36.8511 0 0 -2381.13 0 0 0 1551.64 0 0.07 0 0 0 0 53.0259 
0 0 0 0 0 0 0 0 0 0 0 0 0 0 0 0 0 0 0 0 0 0 0 0 0 0 0 0 1426.66 0 0 0 0 0 0 0 0 0 2016.74 0 0 2408.75 0 0.08 0 0 -1275.9 0 
0 0 0 0 0 0 0 -392.85 0 0 0 0 0 0 0 0 0 0 -765.786 0 0 0 0 0 0 0 0 0 0 0 -193.258 0 0 1190.15 0 0 0 0 0 0 0 0 0 0 0.02 0 0 1943.8 
392.85 2171.47 0 0 0 0 0 0 971.786 0 2231.74 446.257 0 0 1354.03 0 0 0 0 0 0 0 0 0 -1086.54 0 0 0 0 0 0 0 0 0 0 0 0 0 0 0 0 -472.655 0 0 0 0.02 0 0 
0 0 0 0 0 0 0 1552.71 0 0 0 0 0 0 0 0 0 0 0 0 1511.35 0 0 0 0 1775.64 -949.965 0 0 0 0 0 511.109 0 0 0 0 0 2145.68 0 0 834.758 0 -484.252 0 0 0.08 -2132.4 
0 2020.25 0 0 0 0 0 0 0 0 0 0 -34.8674 0 0 0 0 0 0 0 0 0 0 -274.743 0 0 0 0 0 0 0 0 0 0 0 1316.8 0 0 0 0 0 0 158.925 0 938.063 0 700.171 0.02 
