*Vertices 47
*Matrix 
0.05 -2482.6 0 251.396 0 0 0 0 0 0 0 0 2198.17 1267.05 0 -2216.03 0 0 -266.045 0 0 0 0 0 1289.18 262.23 2444.91 -398.953 0 0 -1671.27 0 0 0 0 1449.4 1062.73 0 0 0 0 0 0 -1327.78 0 0 -217.368 
1501.13 0.09 0 0 1875.13 -2454.83 -142.14 -1361.96 2221.67 931.806 0 0 0 0 0 0 0 0 0 0 0 0 0 0 0 0 0 2188.25 0 0 0 0 0 0 1322.9 1151.84 0 0 0 643.864 0 0 -284.356 0 -1314.36 0 0 
0 0 0.07 -1066.7 0 0 2494.51 0 538.118 1014.36 0 -790.048 0 0 0 0 0 0 1934.19 1234.4 0 0 0 0 0 508.667 0 0 0 0 0 473.113 0 0 0 0 -272.912 -546.815 0 0 0 0 0 0 0 1896.34 0 
-264.367 0 285.424 0.02 0 0 0 0 0 0 0 0 0 0 0 2154.84 0 -37.0037 0 0 636.235 0 0 0 0 0 1784.8 0 0 0 0 0 0 0 0 0 -217.063 0 0 0 0 -952.254 0 0 0 0 0 
0 1241.42 0 0 0.02 0 0 0 0 0 0 -268.639 621.281 0 0 0 0 0 0 0 0 0 -1017.41 201.804 0 0 0 0 0 792.489 0 0 0 0 0 0 0 0 0 0 0 2223.96 -1464.96 0 0 0 0 
0 -1126.21 0 0 0 0 0 1026.41 0 2041.46 0 0 0 -850.169 0 0 2130.42 0 0 1063.19 0 -2234.79 0 0 -868.328 0 0 0 0 -673.315 -731.3 0 0 166.097 0 0 0 461.669 0 0 0 1495.48 0 1134.6 0 143.056 0 
0 2457.88 1818.98 0 0 0 0.09 0 0 0 -16.8615 0 978.347 1025.19 0 767.922 0 0 -346.004 0 0 0 0 0 0 0 0 -1746.19 0 -1110.34 0 -2287.9 2172.84 0 0 351.497 0 0 -570.925 0 0 0 427.946 0 1238.98 0 0 
0 164.113 0 0 0 -1689.28 0 0.08 0 -913.038 0 0 0 0 0 0 0 1625.03 0 0 0 0 0 0 0 0 1015.43 0 0 0 0 0 882.824 632.42 0 -962.477 -2422.79 -223.93 0 0 0 1216.85 0 923.109 0 2487.33 -354.701 
0 -2327.57 -2154.99 0 0 0 0 0 0.06 0 -802.255 0 0 0 0 0 0 0 0 643.254 2052.75 0 0 0 0 0 0 0 0 0 0 0 0 0 0 0 0 2222.74 0 0 0 0 0 -1984.39 -2084.95 581.454 0 
0 452.666 70.2689 0 0 239.036 0 -622.044 0 0.08 1773.81 0 -1943.04 424.894 0 0 0 0 0 0 1647.31 0 0 0 2003.31 -1062.58 0 0 0 0 1208.15 -1036.33 -1189.54 -1277.58 0 -1468.02 0 -387.204 0 0 1551.64 0 0 0 0 1180.68 0 
0 0 0 0 0 0 1427.27 0 405.972 2045.88 0.06 0 0 0 -137.41 0 0 0 -304.346 0 0 0 -1053.58 0 0 0 1377.22 0 0 0 0 0 0 0 0 -298.395 454.497 0 0 0 0 2315.67 0 0 0 0 0 
0 0 1975.84 0 -851.695 0 0 0 0 0 0 0.05 0 0 0 600.223 0 2328.79 0 0 0 0 2346.03 2092.12 0 -1902.6 1212.88 -403.226 0 -1679.2 0 391.934 0 0 0 0 2166.89 0 0 0 0 0 0 0 0 -2438.05 0 
133.9 0 0 0 -1404.08 0 455.718 0 0 -1986.07 0 0 0.01 -1120.56 0 1325.19 721.076 113.758 674.535 0 -48.1429 0 0 -2396.54 0 0 0 0 0 0 0 0 0 679.571 0 -9.84222 0 0 0 -59.2822 0 1793.34 0 2286.98 0 0 0 
1685.77 0 0 0 0 -895.947 1238.06 0 0 109.638 0 0 2305.6 0.03 0 0 -1324.88 0 0 0 21.2867 0 702.46 0 0 0 1056.78 0 615.482 0 0 -637.761 -935.926 1509.83 0 587.405 1490.91 0 0 0 0 776.925 946.455 0 0 280.541 0 
0 0 0 0 0 0 0 0 0 0 2293.85 0 0 0 0.08 0 -1946.09 1729.56 0 0 0 0 0 0 1055.1 -87.3592 0 -2481.38 0 0 0 0 0 0 0 2397 0 -688.726 0 0 2232.35 1146.66 0 -2266.38 0 0 0 
415.128 0 0 -1959.36 0 0 -1278.95 0 0 0 0 2337.18 1712.93 0 0 0 556.581 -947.218 1948.23 1604.28 0 -1297.42 0 133.29 0 0 0 0 0 0 0 -467.315 629.826 0 892.132 625.706 0 0 0 0 811.869 0 0 0 0 0 2080.98 
0 0 0 0 0 -1980.42 0 0 0 0 0 0 597.629 2410.58 1938.76 496.918 0.08 1457.79 -2409.67 0 871.227 1807.38 2497.25 0 2316.58 -1738.41 0 0 -2298.58 0 0 0 0 0 -200.583 0 0 0 0 0 0 0 2298.12 182.73 -1702.55 0 0 
0 0 0 2128.13 0 0 0 1318.78 0 0 0 -1755.2 559.023 0 1892.83 -254.143 2332.61 0.07 1473.82 0 546.052 -822.55 1088.06 2195.27 0 0 1695.84 0 864.666 0 0 0 0 457.396 -900.677 0 0 1168.94 0 2496.95 1695.84 379.421 -1776.56 2102.04 0 0 0 
1368.83 0 -1653.42 0 0 0 2280.88 0 0 0 -937.605 0 1371.58 0 0 -35.9355 2264.85 -2033.83 0.02 0 0 1167.56 0 0 0 2268.67 0 0 0 308.313 0 0 46.1592 -1827.83 -1766.79 -1626.71 0 2124.62 804.849 0 777.23 0 0 239.189 0 0 0 
0 0 2273.25 0 0 72.4052 0 0 -28.0007 0 0 0 0 0 0 1612.06 0 0 0 0.06 0 1929 0 0 1657.84 0 1764.81 0 0 -521.027 0 0 0 0 0 2292.78 528.504 0 0 0 0 0 0 9.53703 0 -592.593 0 
0 0 0 -1743.14 0 0 0 0 1202.35 1352.66 0 0 -2368.77 223.319 0 0 -583.285 578.249 0 0 0 0 0 0 0 0 1919.84 0 0 0 0 0 0 0 296.106 0 0 231.407 0 2238.61 0 0 0 0 2224.27 0 0 
0 0 0 0 0 1762.37 0 0 0 0 0 0 0 0 0 912.275 -1041.67 1142.99 257.195 -42.497 0 0.04 0 0 0 0 0 1034.5 1699.04 0 0 0 0 0 0 1929.3 0 0 0 -2422.94 0 0 0 0 0 0 0 
0 0 0 0 1191.06 0 0 0 0 0 1709.57 1679.2 0 2407.07 0 0 1351.89 -198.447 0 0 0 0 0.08 0 0 0 0 0 0 0 -2424.62 0 0 0 0 0 0 -2143.85 0 0 -626.011 0 0 1413.85 0 0 0 
0 0 0 0 -383.084 0 0 0 0 0 0 301.752 902.966 0 0 -1061.66 0 -598.849 0 0 0 0 0 0.09 0 0 0 0 0 90.2585 0 0 -923.261 -90.2585 0 0 0 269.86 0 0 0 0 533.692 0 718.635 966.292 0 
1715.37 0 0 0 0 1637.39 0 0 0 1613.44 0 0 0 0 266.045 0 -1106.52 0 0 426.42 0 0 0 0 0.07 0 -1494.87 0 0 2360.53 0 0 0 0 0 0 -959.426 0 0 0 0 1108.05 0 207.45 -2079.15 0 0 
-854.747 0 1880.63 0 0 0 0 0 0 673.467 0 1135.36 0 0 2193.75 0 558.107 0 1907.64 0 0 0 0 0 0 0.07 0 0 -1340.91 0 0 0 365.841 0 0 0 -597.781 0 0 0 2420.19 0 2451.32 -1007.49 0 1501.74 0 
914.106 0 0 -2480.32 0 0 0 2169.64 0 0 1824.17 664.922 0 648.289 0 0 0 227.439 0 -394.223 2.82296 0 0 0 -1172.9 0 0.01 0 0 0 0 0 0 0 0 0 0 0 890.606 0 0 -561.769 0 0 0 0 0 
1569.34 831.095 0 0 0 0 927.381 0 0 0 0 -741.981 0 0 1033.28 0 0 0 0 0 0 2494.96 0 0 0 0 0 0.02 0 0 0 0 0 0 0 0 0 0 0 0 0 0 0 0 589.541 0 1184.5 
0 0 0 0 0 0 0 0 0 0 0 0 0 2293.54 0 0 34.4096 656.072 0 0 0 -967.055 0 0 0 -243.004 0 0 0.08 0 0 0 0 0 0 0 -1935.56 0 0 0 0 0 0 0 -244.987 1108.81 0 
0 0 0 0 1888.87 973.312 651.189 0 0 0 0 322.962 0 0 0 0 0 0 1106.37 -903.577 0 0 0 -680.792 -241.935 0 0 0 0 0.04 0 0 -485.015 331.812 0 0 -368.282 0 1874.37 0 408.719 0 -480.59 0 0 0 0 
50.5844 0 0 0 0 -1514.25 0 0 0 2410.43 0 0 0 0 0 0 0 0 0 0 0 0 1052.05 0 0 0 0 0 0 0 0.07 0 1051.59 0 0 0 0 0 0 0 0 0 0 0 -842.997 0 0 
0 0 777.078 0 0 0 942.03 0 0 1026.11 0 -316.553 0 275.506 0 1081.65 0 0 0 0 0 0 0 0 0 0 0 0 0 0 0 0.01 0 0 0 0 -774.789 0 0 0 0 -478.454 0 0 0 0 0 
0 0 0 0 0 0 1065.32 528.047 0 1182.97 0 0 0 -2366.48 0 -2223.81 0 0 2221.98 0 0 0 0 -93.9207 0 602.512 0 0 0 -465.178 1178.24 0 0.02 0 0 0 0 1958.75 0 0 -1506.32 943.709 911.054 0 0 0 0 
0 0 0 0 0 1757.33 0 -2170.25 0 -1599.25 0 0 -1163.59 -485.015 0 0 0 745.643 1383.63 0 0 0 0 -637.608 0 0 0 0 0 355.617 0 0 0 0.08 2182.76 0 0 0 1858.2 0 0 650.273 0 0 0 0 843.913 
0 2178.03 0 0 0 0 0 0 0 0 0 0 0 0 0 1862.77 1719.95 1299.55 523.316 0 1176.56 0 0 0 0 0 0 0 0 0 0 0 0 1633.58 0.06 0 0 0 1427.73 0 -422.3 2000.72 0 -1159.17 0 0 1290.55 
2372.43 986.74 0 0 0 0 -2221.37 -1093.1 0 1175.04 608.158 0 568.636 2087.39 162.893 -714.362 0 0 -471.74 -988.418 0 -300.378 0 0 0 0 0 0 0 0 0 0 0 0 0 0.06 8.46889 0 -505.768 1359.98 0 0 -923.566 0 0 0 0 
822.55 0 -866.649 2416.68 0 0 0 -308.924 0 0 597.324 -1267.66 0 1015.43 0 0 0 0 0 1493.96 0 0 0 0 2402.8 1730.32 0 0 -1257.29 1289.94 0 684.912 0 0 0 302.82 0.06 -928.755 0 0 0 0 0 0 0 1568.42 0 
0 0 -834.147 0 0 -2012.62 0 -1721.02 47.9904 -1620.3 0 0 0 0 -1554.54 0 0 -383.541 -270.013 0 -2297.36 0 -2.06 1798.38 0 0 0 0 0 0 0 0 279.321 0 0 0 2415.31 0.04 0 0 0 2075.03 1558.35 0 2077.17 2252.8 0 
0 0 0 0 0 0 -2134.39 0 0 0 0 0 0 0 0 0 0 0 2007.13 0 0 0 0 0 0 0 2243.19 0 0 616.245 0 0 0 1723.15 109.485 2261.04 0 0 0.06 0 0 0 0 0 2308.65 0 0 
0 1599.86 0 0 0 0 0 0 0 0 0 0 1350.52 0 0 0 0 -2047.41 0 0 978.042 564.058 0 0 0 0 0 0 0 0 0 0 0 0 0 571.841 0 0 0 0.08 0 0 0 1609.78 0 -2072.74 0 
0 0 0 0 0 0 0 0 0 -1309.47 0 0 0 0 2492.52 830.638 0 1755.2 -2323.45 0 0 0 2473.3 0 0 -2231.89 0 0 0 2197.87 0 0 -2136.07 0 2418.21 0 0 0 0 0 0.03 79.7296 -2102.19 2449.34 2112.87 0 0 
0 0 0 407.651 315.027 -1459.32 0 -296.716 0 0 -807.596 0 247.734 1217 1068.53 0 0 -1676.76 0 0 0 0 0 0 -219.504 0 2019.79 0 0 0 0 -482.574 -1141.01 -2027.12 353.786 0 0 -506.073 0 0 2443.39 0.06 -58.2141 0 0 0 1020.92 
0 834.452 0 0 -352.565 0 -126.423 0 0 0 0 0 0 619.907 0 0 1916.64 -2461.24 0 0 0 0 0 1138.57 0 -1539.74 0 0 0 314.264 0 0 2402.34 0 0 1271.78 0 2326.04 0 0 2412.87 521.18 0.09 0 0 0 0 
1410.49 0 0 0 0 2252.8 0 659.734 -868.633 0 0 0 987.808 0 -1529.66 0 524.384 2180.93 -1365.17 -1853.47 0 0 -2196.49 0 1521.27 2462.77 0 0 0 0 0 0 0 0 -65.9963 0 0 0 0 -2413.48 1955.55 0 0 0.03 0 -26.1696 -66.3015 
0 -281.457 0 0 0 0 -590.915 0 2090.75 0 0 0 0 0 0 0 1040.91 0 0 0 -2178.03 0 0 1389.13 -2182.61 0 0 1763.28 -777.078 0 -551.546 0 0 0 0 0 0 1575.29 -166.097 0 2462.46 0 0 0 0.07 0 0 
0 0 1507.54 0 0 2082.96 0 2294 -1929.91 984.146 0 497.986 0 -381.71 0 0 0 0 0 226.218 0 0 0 -1108.05 0 1345.94 0 0 1509.83 0 0 0 0 0 0 0 -807.901 1171.83 0 -1703.47 0 0 0 313.349 0 0.08 0 
-650.883 0 0 0 0 0 0 -484.1 0 0 0 0 0 0 0 1778.39 0 0 0 0 0 0 0 0 0 0 0 -390.408 0 0 0 0 0 -1653.72 -262.383 0 0 0 0 0 0 -354.854 0 2185.35 0 0 0.04 
