*Vertices 56
*Matrix 
0.08 -1700.57 0 0 0 0 0 1650.67 1456.72 1433.38 0 0 0 1293.6 0 1776.56 541.932 263.298 0 0 0 1029.16 0 0 -442.442 0 0 1322.29 2105.4 0 0 0 -475.555 0 0 -443.663 0 0 0 0 0 0 0 0 0 0 0 0 0 0 0 1728.64 2321.77 0 0 -1736.43 
1286.89 0.03 0 -1640.9 0 0 0 0 0 0 0 0 0 1138.57 0 0 0 -1139.18 -1081.19 0 0 0 2240.29 0 2176.81 0 0 0 1378.9 0 -1757.33 2381.89 0 0 0 574.282 0 1467.25 0 0 0 -1858.04 0 0 1794.56 -308.771 0 0 0 0 1192.13 0 1084.55 0 0 0 
0 0 0.07 0 357.448 -659.276 214.316 1357.69 0 0 -2163.84 0 0 0 0 0 773.263 2007.58 0 0 992.386 0 0 -258.721 0 0 0 0 985.977 0 0 264.367 0 1170.92 -1294.98 0 0 0 -349.666 0 1610.69 -1710.33 0 -1027.63 0 0 0 0 0 0 0 0 2201.38 1496.7 0 0 
0 -1837.29 0 0.04 0 0 0 0 0 0 0 666.295 0 0 1868.72 0 0 0 1556.22 0 -2010.33 -333.491 -111.316 1974.93 1541.11 0 -551.088 0 0 0 0 664.769 777.383 0 0 0 0 -1644.26 0 0 0 -2268.82 0 0 0 0 2245.78 602.969 0 0 2258.9 756.478 0 488.067 0 0 
0 0 2387.08 0 0.03 0 0 0 0 622.959 0 1442.23 794.015 0 0 0 -1525.7 0 0 0 0 0 0 0 0 -981.246 1485.26 0 0 0 0 0 2360.68 0 0 0 0 0 0 63.86 0 0 0 0 0 0 433.439 0 0 926.313 0 0 0 0 0 0 
0 0 1001.85 0 0 0.04 0 0 0 2039.63 0 -909.986 0 1832.56 0 0 -2123.86 0 0 -546.663 0 0 0 0 0 0 0 0 0 0 0 -119.709 0 1586.43 0 0 0 0 0 0 0 -114.826 1602.91 0 -1744.82 -736.335 0 0 1869.49 -418.943 0 0 0 0 0 0 
0 0 -61.7237 0 0 0 0.01 0 0 2176.96 0 0 13.0467 0 0 -941.42 0 0 0 0 -42.1918 0 0 0 0 -1023.51 -1838.36 1936.48 0 0 -1736.58 0 0 1751.23 0 0 359.279 0 0 0 0 0 1022.75 0 0 0 0 0 0 0 1791.97 0 0 0 0 0 
-813.242 0 2500 0 0 0 0 0.09 0 0 545.595 0 -965.682 0 0 0 1020.77 0 -55.0096 2333.98 0 0 0 -1413.54 0 0 0 0 1751.53 0 0 0 -118.946 0 0 0 0 0 0 0 159.078 0 581.301 0 0 0 0 -1369.44 0 145.497 0 -500.122 0 0 0 0 
-1107.59 0 0 0 0 0 0 0 0.03 0 0 0 0 0 0 0 0 0 -1950.21 781.503 0 1975.84 2437.13 0 1869.03 0 -347.224 0 0 1535.92 0 -1888.71 0 -689.489 -1187.55 1898.94 0 0 -644.322 2405.7 0 0 0 0 -1229.51 0 0 0 0 0 0 0 0 0 0 0 
-373.318 0 0 0 -1182.52 1531.19 -2481.23 0 0 0.08 0 -2369.08 0 0 0 0 0 0 0 0 2037.64 0 0 0 691.626 0 1739.48 171.896 0 1428.34 0 1266.14 0 -1806.16 0 113.91 0 0 2088.61 0 2364.19 -2063.89 0 0.839259 0 0 0 0 1385.01 -29.6793 0 0 0 1784.95 0 2300.56 
0 0 -1476.56 0 0 0 0 -599.307 0 0 0.06 0 -2039.02 0 0 0 -317.927 352.718 2327.88 0 0 0 0 0 0 -1954.02 367.824 0 -47.2274 1451.69 0 0 840.403 0 518.586 0 0 0 0 0 410.703 0 0 0 0 2382.35 0 0 0 0 0 0 0 0 0 0 
0 0 0 -897.32 606.326 1452.3 0 0 0 -1026.87 0 0.05 0 0 0 0 0 0 0 0 0 0 0 1621.83 -1337.24 0 -1815.16 2213.13 1491.36 0 0 0 0 1858.81 0 0 0 0 0 0 0 0 0 0 0 0 0 0 2296.75 0 -2177.42 0 76.5252 0 2357.33 0 
0 0 0 0 -1925.18 0 -1080.74 -1755.96 0 0 999.557 0 0.06 0 0 0 0 2229.61 -632.878 0 0 0 274.285 0 0 2185.05 1122.09 0 0 0 -1181.91 0 0 0 0 0 0 0 0 2277.52 0 0 0 0 -2356.72 2273.86 0 -2112.72 0 1186.64 0 0 -915.784 0 0 0 
1751.23 -1885.97 0 0 0 1743.14 0 0 0 0 0 0 0 0.04 -1080.28 0 -429.93 -1924.57 0 0 0 0 0 0 0 0 0 0 0 0 0 0 0 2353.66 0 0 0 1747.26 0 0 0 0 0 -557.497 374.691 0 0 0 171.896 0 0 0 0 0 0 0 
0 0 0 -1427.27 0 0 0 0 0 0 0 0 0 1506.78 0.07 65.0807 0 0 0 2457.58 0 0 1600.31 0 0 -1245.84 0 0 0 0 0 0 0 0 0 0 0 0 0 0 0 1865.06 0 -1450.77 87.6644 0 0 -1.75481 1520.05 0 0 0 0 0 61.5711 0 
1324.58 0 0 0 0 0 -2250.36 0 0 0 0 0 0 0 -1756.42 0.06 0 0 0 0 0 0 -689.032 2498.17 0 0 0 0 0 0 0 0 0 0 0 357.143 0 0 0 1792.12 0 0 2233.27 0 1634.8 -515.687 -1206.93 0 0 0 0 0 0 0 0 0 
1901.84 0 2224.42 0 -561.007 308.313 0 745.186 0 0 -1775.95 0 0 2193.14 0 0 0.08 1839.43 -504.852 0 0 -1788.31 0 -2252.04 0 0 0 0 0 0 -858.867 0 783.181 995.285 0 587.252 0 0 2143.09 0 0 -2408.44 0 0 -1825.69 0 0 1536.68 0 0 2262.11 404.294 865.276 -1598.79 0 0 
2448.12 -1083.64 1374.78 0 0 0 0 0 0 0 1525.24 0 2341.76 -57.1459 0 0 116.657 0.07 0 -1078.91 0 0 0 2190.69 0 1138.42 0 0 0 743.507 0 0 379.574 0 0 -770.363 488.525 -1094.47 -236.9 1049.15 -2353.66 0 0 0 0 0 0 339.747 0 1574.68 -2448.27 2496.34 0 0 0 0 
0 836.436 0 -1899.55 0 0 0 307.398 1673.71 0 -2362.67 0 839.03 0 0 0 1503.57 0 0.05 177.694 2057.02 -1029.92 0 0 789.59 0 0 1331.14 0 0 0 -1607.49 591.22 0 0 0 0 0 0 0 0 0 0 -34.257 572.909 -853.679 0 0 0 0 919.599 0 1090.5 0 0 0 
0 0 0 0 0 1379.36 0 710.242 613.193 0 0 0 0 0 2460.33 0 0 483.642 -1627.48 0.08 0 0 1450.16 0 865.276 -2323.45 183.645 -2185.96 782.723 0 0 2275.84 -464.263 0 0 0 0 1485.26 0 1827.37 0 0 -2355.19 0 -1611.91 1883.98 0 0 -575.808 1465.58 718.482 1863.54 0 2041.76 0 0 
0 0 -427.946 2473.3 0 0 942.335 0 0 -1173.51 0 0 0 0 0 0 0 0 -1564.15 0 0.06 0 2307.89 -1737.19 1508.76 0 0 818.583 0 0 1166.8 0 0 0 0 0 0 0 0 0 0 0 0 0 0 0 -454.955 -344.02 0 1307.49 0 745.491 0 0 0 0 
1338.92 0 0 -574.282 0 0 0 0 2118.37 0 0 0 0 0 0 0 -171.133 0 2204.28 0 0 0.01 0 0 0 0 0 -2277.06 0 0 0 0 0 0 0 0 973.464 0 0 0 0 0 0 0 0 0 0 0 0 0 0 0 0 0 0 0 
0 -488.22 0 -1352.96 0 0 0 0 2405.85 0 0 0 64.0126 0 661.87 -2242.42 0 0 0 2168.72 1859.72 0 0.03 0 0 0 0 0 0 0 0 -2488.56 0 0 606.937 0 2024.67 0 0 0 0 0 -216.147 0 0 2499.85 0 0 0 0 805.002 2001.94 0 0 0 0 
0 0 1783.73 1768.93 0 0 0 1689.43 0 0 0 268.944 0 0 0 1079.36 65.0807 1112.17 0 0 -81.1029 0 0 0.01 0 0 0 0 1305.05 0 1199.91 0 0 -2139.42 0 -1014.82 0 0 0 0 0 0 0 0 0 0 0 0 0 304.346 1577.27 0 0 0 0 0 
1248.74 -2176.66 0 728.401 0 0 0 0 55.9252 1211.81 0 1341.67 0 0 0 0 0 0 -1200.83 1338.62 -301.599 0 0 0 0.03 0 0 858.867 0 0 0 0 0 0 0 0 0 0 0 0 -23.2704 1459.93 0 0 0 0 463.652 0 0 710.242 0 -2302.85 0 0 0 0 
0 0 0 0 2028.03 0 1973.1 0 0 0 -1008.41 0 -90.7163 0 -1332.97 0 0 -1627.48 0 -1433.84 0 0 0 0 0 0 -956.679 0 0 0 0 1475.49 2195.73 0 2428.13 0 0 0 0 0 0 0 0 0 -1946.55 0 0 593.509 586.947 0 -2320.55 0 1005.51 0 0 -1319.85 
0 0 0 558.26 2375.94 0 2236.01 0 -2362.51 1634.95 -373.012 188.223 -422.605 0 0 0 0 0 0 -520.722 0 0 0 0 0 1907.33 0.09 0 2131.49 0 0 2479.55 0 -1674.17 0 0 0 0 -2481.69 0 -442.595 2197.1 0 0 818.735 0 0 0 -1885.97 0 0 0 0 0 0 0 
-450.835 0 0 0 0 0 -345.698 0 0 1928.85 0 2230.37 0 0 0 0 0 0 -2491 1296.2 585.116 -39.4452 0 0 424.131 0 0 0.06 0 0 0 0 2405.7 0 -2251.12 -839.183 0 0 0 0 0 0 0 0 0 -930.891 0 -2048.94 1947 0 0 0 0 0 -1150.78 0 
-2400.66 2.36518 1657.69 0 0 0 0 101.856 0 0 2037.19 -655.156 0 0 0 0 0 0 0 2166.28 0 0 0 -88.8852 0 0 -635.777 0 0.05 0 0 -1550.87 0 0 0 0 0 0 0 0 0 1955.09 1002.91 0 0 -1849.35 0 0 -46.4644 0 0 1820.05 0 -1429.41 0 0 
0 0 0 0 0 0 0 0 1693.4 -77.7459 -124.897 0 0 0 0 0 0 1676.46 0 0 0 0 0 0 0 0 0 0 0 0.09 0 2217.09 0 0 0 0 0 -710.395 2359.77 0 -244.682 0 -856.578 -2447.81 0 0 -535.066 -609.073 0 0 0 0 0 0 1260.19 0 
0 421.232 0 0 0 0 2260.89 0 0 0 0 0 2218.01 0 0 0 393.155 0 0 0 1660.44 0 0 -2434.23 0 0 0 0 0 0 0.01 -1578.19 0 0 -1596.35 -1264.61 0 0 0 -898.389 -2030.17 0 0 0 0 0 2372.74 1732.46 1106.83 2348.17 0 -1361.35 0 -611.972 0 0 
0 -1974.93 1722.69 42.8022 0 -724.738 0 0 1200.52 2261.8 0 0 0 0 0 0 0 0 1442.99 -822.703 0 0 1274.83 0 0 318.69 982.925 0 -646.916 2200 2317.65 0.04 397.732 0 0 0 0 0 0 0 0 0 0 0 0 0 0 0 0 -105.365 0 0 0 0 0 0 
1927.32 0 0 989.181 187.002 0 0 315.638 0 0 -1183.89 0 0 0 0 0 2425.08 700.171 1487.24 -1925.49 0 0 0 0 0 -743.66 0 -1484.19 0 0 0 -2424.77 0.03 -1828.44 0 0 0 0 -180.441 2490.54 0 0 0 0 0 0 0 -1245.23 50.2792 1551.64 0 -542.695 1444.82 0 0 0 
0 0 -2077.78 0 0 2327.11 421.842 0 -1347.01 1256.07 0 2267.6 0 1403.93 0 0 -1574.37 0 0 0 0 0 0 129.78 0 0 2415.31 0 0 0 0 0 -195.7 0.03 0 -2188.25 0 81.8659 0 0 0 0 0 0 0 29.6793 0 0 0 0 0 1621.37 0 0 0 0 
0 0 88.2748 0 0 0 0 0 2449.8 0 1465.42 0 0 0 0 0 0 0 0 0 0 0 2366.63 0 0 682.623 0 2064.04 0 0 202.567 0 0 0 0.06 0 0 0 0 0 0 0 -1715.83 0 0 0 0 -2015.37 0 0 613.041 0 0 0 0 0 
935.469 -925.55 0 0 0 0 0 0 -1273.61 1909.16 0 0 0 0 0 -2031.08 164.571 2168.42 0 0 0 0 0 1574.68 0 0 0 -956.679 0 0 -1914.04 0 0 -1378.75 0 0.05 0 0 0 806.986 654.241 -105.823 0 0 0 1823.1 0 0 2034.75 2439.12 0 0 0 0 0 1477.48 
0 0 0 0 0 0 2331.23 0 0 0 0 0 0 0 0 0 0 828.349 0 0 0 1727.58 68.1326 0 0 0 0 0 0 0 0 0 0 0 0 0 0.02 0 0 0 0 0 0 0 0 0 0 0 0 0 0 0 0 0 0 0 
0 1419.8 0 437.254 0 0 0 0 0 0 0 0 0 873.821 0 0 0 -1983.93 0 957.9 0 0 0 0 0 0 0 0 0 -1762.52 0 0 0 -1064.71 0 0 0 0.08 0 0 -203.024 0 0 2191.31 0 1957.84 -49.0585 0 0 1583.83 -456.328 -1113.54 0 0 0 0 
0 0 -463.195 0 0 0 0 0 1540.96 1993.7 0 0 0 0 0 0 -2237.24 -394.375 0 0 0 0 0 0 0 0 -324.946 0 0 2026.81 0 0 -1475.04 0 0 0 0 0 0 -1112.17 0 0 0 0 0 0 0 0 1891.16 0 3.58592 0 441.984 0 0 0 
0 0 0 0 -1330.23 0 0 0 1893.6 0 0 0 854.442 0 0 -631.352 0 -1614.05 0 63.86 0 0 0 0 0 0 0 0 0 0 1446.04 0 2183.22 0 0 306.94 0 0 -501.953 0.01 0 0 777.841 0 0 0 0 0 0 0 257.195 0 1021.84 2045.88 0 0 
0 0 595.798 0 0 0 0 -644.78 0 2060.23 -1565.22 0 0 0 0 0 0 -2365.72 0 0 0 0 0 0 2206.26 0 1393.7 0 0 -753.731 -2122.18 0 0 0 0 736.183 0 1906.42 0 0 0.04 530.793 2145.53 0 -879.467 0 0 0 0 1078.14 0 0 62.1815 -2495.88 0 0 
0 740.303 2424.31 1373.26 0 -80.6452 0 0 0 -1290.7 0 0 0 0 2117.45 0 1105.61 0 0 0 0 0 0 0 1714.76 0 -2025.59 0 1986.68 0 0 0 0 0 0 -2116.08 0 0 0 0 1635.41 0.04 0 1024.58 0 0 0 0 -814.92 0 0 0 0 -1356.78 112.537 0 
0 0 0 0 0 2139.42 2221.06 -1841.87 0 0 0 0 0 0 0 -92.0896 0 0 0 517.518 0 0 1779.46 0 0 0 0 0 410.703 -1915.88 0 0 0 0 -1318.78 0 0 0 0 -194.174 -1390.65 0 0.03 158.62 -2292.93 0 0 0 1458.86 0 1267.97 0 942.793 1473.51 0 0 
0 0 -1422.39 0 0 0 0 0 0 1537.29 0 0 0 1101.95 2229.45 0 0 0 -280.084 0 0 0 0 0 0 0 0 0 0 -818.125 0 0 0 0 0 0 0 -1008.26 0 0 0 -984.909 -177.541 0.05 376.522 0 0 0 0 0 0 1791.67 0 -148.701 0 0 
0 1531.8 0 0 0 -2452.85 0 0 -1410.03 0 0 0 1545.08 1934.8 2046.65 1210.75 2213.58 0 433.897 -2410.89 0 0 0 0 0 -1356.01 1810.59 0 0 0 0 0 0 0 0 0 0 0 0 0 1076.01 0 -1849.35 -1393.25 0.04 0 0 0 0 0 0 0 0 0 0 1023.21 
0 -2381.28 0 0 0 897.015 0 0 0 0 -1984.69 0 2485.96 0 0 815.989 0 0 1582.77 2497.56 0 0 253.99 0 0 0 0 258.568 1512.88 0 0 0 0 -1627.32 0 -1571.47 0 323.573 0 0 0 0 0 0 0 0 0 0 0 0 0 0 0 1102.25 0 0 
0 0 0 1455.96 1342.28 0 0 0 0 0 0 0 0 0 0 787.454 0 0 0 0 -881.603 0 0 0 2215.26 0 0 0 0 -1089.89 -867.87 0 0 0 0 0 0 1766.03 0 0 0 0 0 0 0 0 0.09 0 1186.03 0 0 -1704.08 0 793.405 0 0 
0 0 0 -1870.25 0 0 0 2157.89 0 0 0 0 -1623.2 0 -1785.87 0 1709.11 27.543 0 0 1479.77 0 0 0 0 -248.192 0 1805.25 0 -767.159 1611 0 1303.22 0 1581.7 0 0 0 0 0 0 0 0 0 0 0 0 0.07 -354.244 0 2350.76 933.79 0 0 0 0 
0 0 0 0 0 -1860.94 0 0 0 -780.282 0 1014.05 0 -29.0689 1531.65 0 0 0 0 913.495 0 0 0 0 0 -1689.73 1927.78 -613.956 -1069.6 0 367.977 0 -763.192 0 0 1285.06 0 0 1215.78 0 0 317.621 2111.5 0 0 0 -2121.42 1512.57 0.08 390.255 0 1789.99 0 0 0 0 
0 0 0 0 743.812 2275.38 0 1277.12 0 -2187.95 0 0 -678.655 0 0 0 0 -2370.14 0 2281.33 2018.57 0 0 -278.405 2410.73 0 0 0 0 0 -753.883 176.626 -257.347 0 0 -446.104 0 -750.832 0 0 -2047.87 0 0 0 0 0 0 0 2403.87 0.06 2063.43 0 0 0 0 0 
0 -803.476 0 -632.572 0 0 -2214.96 0 0 0 0 269.555 0 0 0 0 2031.24 -1046.4 -2167.5 1939.53 0 0 16.0985 1250.11 0 2247.46 0 0 0 0 0 0 0 0 -1958.6 0 0 2142.17 1515.63 2133.17 0 0 1625.64 0 0 0 0 -215.842 0 172.658 0 0 0 0 -605.716 0 
-1930.07 0 0 2277.98 0 0 0 -263.604 0 0 0 0 0 0 0 0 1210.44 912.732 0 -1311.3 -297.021 0 885.418 0 1406.52 0 0 0 -1523.1 0 221.03 0 140.614 545.595 0 0 0 1667.46 0 0 0 0 0 1838.36 0 0 2140.49 -813.547 -1617.56 0 0 0.07 0 0 0 0 
127.949 1028.86 1405.76 0 0 0 0 0 0 0 0 -135.884 2008.8 0 0 0 663.396 0 607.395 0 0 0 0 0 0 2456.05 0 0 0 0 0 0 -253.38 0 0 0 0 0 -2090.75 -1844 -1344.87 0 1389.58 0 0 0 0 0 0 0 0 0 0.01 926.618 0 0 
0 0 -107.349 -619.449 0 0 0 0 0 -1541.72 0 0 0 0 0 0 479.522 0 0 519.044 0 0 0 0 0 0 0 0 -1999.34 0 -2312.31 0 0 0 0 0 0 0 0 2318.57 1255.76 1425.44 -845.592 2400.66 0 1857.13 2424.47 0 0 0 0 0 1398.89 0.05 0 -1470.61 
0 0 0 0 0 0 0 0 0 0 0 1150.17 0 0 162.13 0 0 0 0 0 0 0 0 0 0 0 0 -763.192 0 524.537 0 0 0 0 0 0 0 0 0 0 0 848.186 0 0 0 0 0 0 0 0 1857.74 0 0 0 0.01 -570.772 
2024.98 0 0 0 0 0 0 0 0 1513.64 0 0 0 0 0 0 0 0 0 0 0 0 0 0 0 1058.92 0 0 0 0 0 0 0 0 0 -287.713 0 0 0 0 0 0 0 0 -783.029 0 0 0 0 0 0 0 0 -1589.02 1090.04 0.05 
