*Vertices 69
*Matrix 
0.03 0 0 0 0 0 0 0 1297.27 -431.913 0 0 0 0 188.528 0 0 0 0 -153.737 0 0 0 0 0 0 0 0 264.824 0 0 732.368 0 0 0 0 -607.547 0 1095.39 187.765 0 0 0 0 0 -1485.26 1813.64 -1997.97 0 846.507 2214.96 0 1015.12 -1568.42 0 0 0 0 0 0 0 0 0 0 -2376.09 0 0 0 0 
0 0.08 0 1584.14 0 0 0 0 0 0 0 0 877.941 -2401.27 0 0 -1697.67 0 0 0 -1335.87 0 0 449.309 0 0 0 0 448.241 0 -163.35 2406.77 -808.359 0 0 0 0 0 1836.22 0 0 797.525 0 0 0 0 2265.62 0 0 0 0 0 0 0 0 0 0 0 0 0 0 -1263.39 0 0 0 0 0 657.292 0 
0 0 0 0 -1668.37 -1487.85 0 0 0 0 0 -1171.53 0 0 0 0 1838.82 0 1560.95 0 0 0 0 0 0 0 0 0 0 0 0 0 0 -2155.75 1397.21 -1394.62 0 0 0 0 0 2272.33 0 1378.6 0 0 2048.02 0 0 0 0 0 0 0 0 0 0 0 0 0 0 0 0 0 0 0 0 0 0 
0 1053.12 0 0.01 0 0 0 2366.79 0 0 0 0 0 0 0 0 1366.54 -2057.18 939.741 0 0 0 0 0 0 0 268.792 78.0511 -1235.16 0 -1873.91 0 1039.23 2328.79 0 0 2072.44 0 0 0 0 -1338.62 2241.2 0 0 0 2189.02 -1864.76 1008.71 -60.6555 0 0 0 0 0 -1228.14 0 0 0 0 0 0 0 0 0 0 0 0 -1990.04 
0 0 1624.42 0 0.03 0 0 0 2329.86 0 2450.1 0 0 0 0 0 0 0 0 0 -1404.54 0 0 0 0 0 0 0 0 0 940.352 0 0 -125.355 1814.55 -17.4718 -1233.79 0 0 2271.11 0 0 0 0 0 0 1944.56 0 1821.73 0 -1696.3 -228.05 2061.45 625.095 0 0 0 0 0 -1558.5 0 0 0 0 0 0 0 0 0 
0 0 1002.46 0 0 0.01 -643.101 0 2371.82 0 0 0 793.405 -933.638 0 0 0 0 0 0 0 0 0 0 0 -1030.08 815.378 0 0 0 0 0 1363.95 0 0 -522.706 705.206 0 0 0 0 785.318 2285.45 2353.97 398.19 0 0 0 0 0 0 0 0 0 0 -1617.71 0 0 0 0 0 0 0 0 0 0 0 0 0 
0 0 0 0 0 572.604 0.04 -860.24 1332.97 0 0 0 0 0 0 0 628.758 2461.09 -817.209 0 -2087.24 0 758.156 0 0 0 0 0 -498.901 1708.96 0 2149.49 0 0 0 0 398.801 -1594.67 -651.189 0 0 0 0 0 0 0 0 0 2412.72 0 0 0 0 0 0 0 -1162.53 0 0 -1663.64 0 0 0 0 0 0 0 0 2240.44 
0 0 0 -1358.61 0 0 1056.32 0.06 0 860.393 0 0 0 2420.35 0 0 -500.732 0 0 0 0 0 0 0 0 0 0 1952.19 0 0 1501.13 0 918.378 0 1332.82 0 0 0 0 0 1818.98 262.383 0 0 0 0 0 -410.703 0 0 -2303.46 0 0 0 385.372 0 0 0 0 -1992.63 876.873 0 0 0 0 184.866 0 0 0 
2096.09 0 0 0 973.769 -753.883 -246.055 0 0 0 0 -709.632 0 964.766 0 0 0 631.809 0 0 -2151.33 0 0 0 1954.18 0 0 0 -826.365 0 -1769.69 -1644.41 0 448.851 0 -1480.83 0 0 447.935 -354.701 -618.992 0 0 2336.73 -690.71 797.525 0 939.741 -221.335 0 0 0 0 0 1561.25 0 -713.141 0 0 2056.41 0 0 -164.418 0 0 0 0 0 0 
2175.74 0 0 0 0 0 0 640.202 0 0.04 0 0 0 -1187.25 0 0 0 0 0 1835.15 0 846.202 0 0 0 0 0 11.6733 0 -1961.2 0 0 0 0 0 0 0 0 0 0 0 0 0 2166.28 0 134.663 -2115.77 0 0 0 0 0 0 0 0 0 870.159 0 434.812 0 -844.218 0 0 0 0 0 0 0 0 
0 0 0 0 1512.12 0 0 0 0 0 0.08 0 0 0 0 0 0 0 0 2054.28 0 0 987.655 0 0 -658.055 0 0 0 0 -1215.17 0 0 1242.79 0 208.365 0 0 0 2074.88 -1947.31 0 0 0 0 -2051.53 0 0 0 2224.72 0 0 0 -234.764 0 623.112 944.014 1130.63 0 0 0 0 0 0 0 0 0 -692.694 0 
0 0 -859.325 0 0 0 0 0 104.45 0 0 0.03 0 0 -98.6511 0 0 -743.812 -1753.06 0 0 0 -1576.51 0 0 0 682.012 0 0 0 1841.11 0 -1889.17 0 0 0 0 830.638 1891.31 1850.87 2093.49 1977.52 0 0 0 0 0 0 0 0 0 389.492 0 0 0 0 1533.78 0 0 0 0 0 0 0 560.396 0 -960.646 0 0 
0 -1681.95 0 0 0 -745.491 0 0 0 0 0 0 0.01 2246.85 1777.02 0 394.375 -891.217 0 1031.6 2006.97 0 0 -707.495 0 0 2135.3 0 0 0 768.38 0 -375.912 -598.086 -1082.11 0 0 0 0 0 0 0 0 0 0 -449.767 -30.7474 2358.39 2145.83 2209.62 0 0 -264.214 0 0 0 0 485.321 2019.49 -2252.8 0 1457.18 0 0 0 0 0 0 0 
0 1394.47 0 0 0 -706.275 0 611.057 -1611 932.112 0 0 1377.68 0.06 0 0 0 0 0 392.239 0 -1104.39 57.2985 0 0 2004.23 0 1378.6 0 0 0 0 0 0 0 1683.48 0 0 0 0 0 0 1070.82 0 0 -1719.49 0 0 0 0 0 -1032.21 0 -1495.33 1138.26 0 0 0 0 0 0 186.239 0 -1542.79 0 0 -823.618 0 0 
1507.69 0 0 0 0 0 0 0 0 0 0 -1250.72 2286.52 0 0.09 -2270.35 0 0 1576.36 0 0 0 0 0 0 0 -1983.17 0 428.404 0 0 0 0 0 0 0 795.083 0 -452.971 1173.67 0 0 0 -172.811 0 0 -462.279 0 0 0 0 2073.2 1857.13 -1713.39 0 0 0 0 0 1694.16 0 -417.112 0 0 0 0 0 0 0 
0 0 0 0 0 0 0 0 0 0 0 0 0 0 -243.309 0.03 1936.32 0 0 0 583.59 1540.5 0 -303.278 -224.082 0 0 0 0 0 0 0 -1579.87 0 0 0 0 0 0 2454.22 526.215 0 0 0 0 2183.07 0 1977.37 462.584 0 0 0 0 0 0 0 0 0 0 0 -687.201 -2078.84 0 -955.763 0 0 0 0 0 
0 -803.781 -34.7148 2152.85 0 0 714.82 1697.52 0 0 0 0 2237.08 0 0 -2058.55 0.04 0 2139.88 0 -1787.24 0 0 0 -807.443 -1843.09 0 0 2238.91 0 -333.796 0 0 0 0 0 520.112 0 0 0 0 1878.95 1883.22 0 0 0 0 0 0 0 0 0 0 0 0 0 1055.56 0 0 0 0 0 0 0 0 0 0 0 0 
0 0 0 590.609 0 0 131.153 0 391.934 0 0 -499.969 1267.05 0 0 0 0 0.04 0 202.872 0 2021.32 0 0 0 0 0 0 0 0 0 -1498.54 0 0 0 0 -1885.97 -263.604 -483.489 0 0 0 0 0 0 0 0 0 0 0 0 0 1652.65 0 0 0 595.34 0 0 0 0 0 0 0 0 195.547 0 0 0 
0 0 2430.72 1145.44 0 0 -717.872 0 0 0 0 -1099.2 0 0 487.304 0 60.6555 0 0.07 1648.69 408.414 0 0 0 2400.51 0 0 0 0 0 0 0 0 0 -1460.39 0 1957.23 697.882 0 -214.774 0 0 0 0 0 0 0 -2469.18 0 0 0 0 -956.069 -1026.26 0 0 0 -1345.64 0 0 0 0 0 0 0 0 0 0 0 
550.478 0 0 0 0 0 0 0 0 872.906 -2267.14 0 1282.62 1438.41 0 0 0 2468.87 1757.33 0.01 0 0 0 0 -2111.19 0 0 0 624.485 0 0 2465.51 0 0 0 0 0 -74.8466 0 0 0 0 0 0 0 570.162 0 0 0 0 93.6155 0 0 -1355.56 0 374.996 -2397.31 1892.68 0 277.947 0 0 0 0 0 0 1924.12 0 0 
0 507.294 0 0 1301.54 0 -2357.17 0 -607.089 0 0 0 -699.255 0 0 1038.77 1121.94 0 -1485.11 0 0.01 0 0 0 0 0 0 -78.2037 0 0 0 0 0 0 1608.86 0 0 0 2091.36 118.488 0 0 0 0 0 0 1129.41 0 -1986.98 0 110.553 -2012.01 0 0 0 -1356.17 0 0 701.544 0 0 0 2030.02 -1808.3 0 0 0 0 0 
0 0 0 0 0 0 0 0 0 -2165.21 0 0 0 -1057.08 0 1344.11 0 -1465.73 0 0 0 0.01 0 1733.99 0 0 0 0 0 0 0 -1908.25 163.198 0 0 0 -1216.39 0 610.294 -390.561 1599.25 0 0 2.36518 0 0 0 0 0 513.703 0 2213.43 0 1072.8 0 0 0 0 0 0 0 0 -199.515 0 0 1200.22 0 0 -371.944 
0 0 0 0 0 0 1128.19 0 0 0 360.805 -2160.63 0 -589.389 0 0 0 0 0 0 0 0 0.01 1286.74 0 -2486.57 -1485.56 1474.27 0 1843.39 0 0 0 0 1885.2 0 2148.43 0 0 0 0 0 0 0 0 0 0 0 -516.449 2111.8 -949.66 0 -1468.78 -801.95 0 2078.69 0 2376.86 0 0 0 0 0 0 11.6733 0 0 0 0 
0 864.971 0 0 0 0 0 0 0 0 0 0 -1181.3 0 0 331.507 0 0 0 0 0 1994.46 1198.54 0.02 0 1838.05 0 0 0 0 0 -212.638 0 0 749.306 0 0 1720.1 0 0 0 -2446.75 0 0 0 0 1781.14 -2179.4 1256.07 0 0 -598.392 -1036.03 0 0 0 0 0 0 0 0 0 -2108.75 0 0 0 0 0 0 
0 0 0 0 0 0 0 0 -991.318 0 0 0 0 0 0 2255.85 806.986 0 270.165 2064.5 0 0 0 0 0.04 0 0 0 0 -1374.78 822.092 0 0 0 0 -1739.78 0 -1835.76 0 0 -1625.95 0 0 -784.86 0 1032.21 0 0 0 773.873 0 0 0 0 0 0 2059.92 2469.79 0 0 0 0 -1177.02 0 0 0 0 0 0 
0 0 0 0 0 2322.08 0 0 0 0 -272.759 0 0 522.248 0 0 2155.9 0 0 0 0 0 -1857.28 618.992 0 0.06 0 1186.33 1131.4 0 0 0 0 0 0 0 112.079 0 0 1967.15 595.492 0 0 0 -2252.34 0 0 0 0 0 0 0 0 0 0 0 0 0 0 0 0 0 2100.05 0 0 0 0 0 0 
0 0 0 -1601.69 0 1166.65 0 0 0 0 0 2135.91 1982.86 0 383.694 0 0 0 0 0 0 0 -573.061 0 0 0 0.07 1708.2 0 0 0 -536.134 0 2255.7 0 0 1905.04 -335.932 0 0 0 0 0 0 0 0 0 0 0 0 0 0 -112.995 -2417.91 0 0 0 -2497.41 0 0 0 1945.94 0 0 0 0 0 0 0 
0 0 0 2369.38 0 0 0 725.349 0 -779.214 0 0 0 1980.42 0 0 0 0 0 0 -583.285 0 -1408.05 0 0 740.455 -107.807 0.03 -1024.74 0 0 1525.24 0 0 -1537.14 0 0 0 0 -135.731 0 0 0 0 0 0 -821.635 0 515.076 0 0 1932.05 0 0 0 0 0 2042.83 0 0 0 0 0 0 0 0 0 0 -1175.5 
-265.587 2145.53 0 1312.83 0 0 771.737 0 -494.781 0 0 0 0 0 1573 0 -2485.2 0 0 -2294.15 0 0 0 0 0 71.4896 0 -2068.77 0.02 0 0 0 0 0 0 2084.8 0 0 1083.03 -1730.93 36.3933 0 0 0 0 0 1040.91 0 0 0 0 0 0 0 0 0 1482.97 2393.64 1986.83 2050 0 0 592.898 0 0 -751.747 0 0 0 
0 0 0 0 0 0 2281.64 0 0 1389.28 0 0 0 0 0 0 0 0 0 0 0 0 -2098.22 0 -1167.71 0 0 0 0 0.07 0 0 0 0 0 1536.99 0 0 0 1890.24 -277.795 0 0 0 1554.84 0 0 0 0 0 0 -507.752 0 0 0 0 0 0 0 0 0 0 0 1067.16 0 0 0 760.445 0 
0 -1044.57 0 -2016.13 1184.5 0 0 2413.33 442.442 0 -736.793 1942.73 448.241 0 0 0 1667.91 0 0 0 0 0 0 0 1030.38 0 0 0 0 0 0.08 0 -2152.24 0 0 0 0 0 0 1674.63 0 -444.121 0 0 0 0 0 0 0 -1758.1 -6.18 -1898.94 2430.72 0 0 0 0 0 664.617 0 0 0 0 0 0 0 0 0 0 
2370.6 1584.14 0 0 0 0 55.62 0 590.304 0 0 0 0 0 0 0 0 -172.048 0 602.817 0 694.83 0 1996.9 0 0 2051.68 747.932 0 0 0 0.06 -245.293 0 0 0 0 0 0 0 -1200.52 0 2182.3 -81.5607 0 0 -389.798 0 0 0 -1496.25 0 0 0 -136.952 0 -1525.7 -2459.26 0 0 0 0 0 0 0 0 0 0 0 
0 -578.097 0 -970.565 0 257.958 0 608.615 0 0 0 544.221 -1328.55 0 0 1266.44 0 0 0 0 0 1814.86 0 0 0 0 0 0 0 0 -973.922 2121.42 0.01 0.0762963 0 1027.94 0 0 1619.54 0 0 0 0 1294.21 0 0 0 0 0 0 0 0 0 0 299.31 1807.38 525.91 1419.64 0 0 0 -1886.73 0 0 0 0 -1274.53 0 1979.51 
0 0 747.017 944.166 -740.303 0 0 0 -1358.61 0 2326.96 0 -1222.5 0 0 0 0 0 0 0 0 0 0 0 0 0 884.045 0 0 0 0 0 1124.38 0.08 0 0 2167.81 0 1689.58 417.417 0 1084.25 0 0 0 0 0 0 -2476.5 0 0 0 1427.88 0 0 0 0 0 1802.35 0 0 0 0 0 0 0 -1918.47 0 0 
0 0 241.02 0 -1258.66 0 0 2006.36 0 0 0 0 1536.07 0 0 0 0 0 1477.02 0 2005.75 0 2266.38 -5.56963 0 0 0 1833.93 0 0 0 0 0 0 0.08 0 0 0 0 0 0 0 0 0 0 0 -1309.02 0 0 0 0 0 0 0 0 -1611.3 -1803.42 0 0 0 0 0 0 548.952 0 -377.438 0 0 0 
0 0 1432.46 0 491.882 -52.2629 0 0 1695.23 0 -1585.06 0 0 982.162 0 0 0 0 0 0 0 0 0 0 1582.31 0 0 0 -615.787 -319.758 0 0 -2499.24 0 0 0.06 0 0 0 2056.72 0 734.504 0 0 0 0 0 0 304.804 0 0 0 0 0 0 1547.82 0 0 0 2233.88 0 0 0 0 1049.76 0 -266.198 0 0 
851.695 0 0 1678.59 610.752 -1308.71 231.559 0 0 0 0 0 0 0 -248.039 0 929.518 -1581.7 -2415.77 0 0 1482.82 1854.38 0 0 2300.56 1672.49 0 0 0 0 0 0 1579.87 0 0 0.07 0 0 84.7652 0 0 0 0 188.07 -2233.73 20.0659 0 0 0 0 620.518 0 -127.644 -1925.18 687.658 0 1360.29 0 0 0 0 0 0 0 0 0 0 0 
0 0 0 0 0 0 -7.40074 0 0 0 0 -1407.28 0 0 0 0 0 2050.16 214.469 1973.86 0 0 0 -2271.87 -1729.56 0 -1057.08 0 0 0 0 0 0 0 0 0 0 0.01 0 0 0 676.061 0 2373.81 0 0 0 0 0 -1752.45 0 0 0 0 0 0 682.775 1515.78 0 2483.21 0 0 0 0 0 0 0 0 0 
2075.49 -2209.46 0 0 0 0 503.327 0 1585.36 0 0 -2034.14 0 0 -743.202 0 0 -922.04 0 0 2453.31 -2223.2 0 0 0 0 0 0 1939.53 0 0 0 -504.7 1159.32 0 0 0 0 0.05 0 0 0 1944.72 0 1538.06 821.787 0 0 0 0 0 1102.56 0 0 0 0 0 0 0 0 2303.77 0 0 0 0 0 0 0 0 
-1316.19 0 0 0 1435.21 0 0 0 2403.41 0 2046.8 -2409.36 0 0 -1689.73 -864.971 0 0 2298.43 0 1955.55 -1871.17 0 0 0 -1296.96 0 1556.22 -180.288 1287.8 1971.57 0 0 1438.11 0 -759.835 1104.08 0 0 0 0 0 2328.49 -325.861 0 0 0 0 -730.384 0 0 0 0 0 0 0 2201.68 0 0 0 0 0 0 0 2053.51 0 0 0 0 
0 0 0 0 0 0 0 2060.23 -2102.65 0 -1854.84 -146.87 0 0 0 2425.38 0 0 0 0 0 1932.2 0 0 -1512.12 2332 0 0 -1634.65 -1663.95 0 1763.28 0 0 0 0 0 0 0 0 0.08 0 0 0 0 -649.815 0 0 0 0 -2086.47 0 0 395.596 0 0 1662.27 0 0 0 0 1268.58 0 0 0 0 0 0 -2291.1 
0 -326.014 -1246.76 -129.017 0 1868.42 0 1248.89 0 0 0 -145.497 0 0 0 0 1395.84 0 0 0 0 0 0 -1551.94 0 0 0 0 0 0 2251.58 0 0 2235.71 0 -2314.45 0 1024.74 0 0 0 0.05 0 0 1817.76 0 2084.95 0 -2222.28 0 0 0 0 0 0 0 0 0 -1417.2 0 0 0 0 0 0 0 0 0 0 
0 0 0 1929.61 0 620.518 0 0 0 0 0 0 0 1029.16 0 0 744.575 0 0 0 0 0 0 0 0 0 0 0 0 0 0 1307.64 0 0 0 0 0 0 -1586.28 476.47 0 0 0.08 2278.28 0 0 0 0 0 0 0 0 0 0 641.575 0 0 0 0 0 0 0 0 0 0 0 0 0 0 
0 0 2069.54 0 0 1040.76 0 0 -638.676 1360.59 0 0 0 0 1618.02 0 0 0 0 0 0 742.134 0 0 -418.485 0 0 0 0 0 0 -465.331 -2435.91 0 0 0 0 2296.75 0 1969.44 0 0 -604.495 0.03 0 0 -862.529 0 0 0 0 0 2500 727.332 0 1442.53 0 0 0 -2403.1 0 0 0 0 0 0 -2370.75 0 0 
0 0 0 0 0 2083.57 0 0 918.531 0 0 0 0 0 0 0 0 0 0 0 0 0 0 0 0 -2191 0 0 0 788.064 0 0 0 0 0 0 -977.279 0 -1053.88 0 0 2458.34 0 0 0.02 0 0 0 1831.64 0 -1215.48 0 1308.25 1288.11 0 0 0 0 0 0 0 0 0 -661.412 0 0 0 609.836 0 
179.525 0 0 0 0 0 0 0 -326.167 1616.18 1162.83 0 2375.03 1206.63 0 2345.42 0 0 0 1763.44 0 0 0 0 -727.027 0 0 0 0 0 0 0 0 0 0 0 1618.93 0 -970.107 0 -453.429 0 0 0 0 0.05 0 -1419.03 0 0 0 0 0 2487.33 0 0 0 0 -1533.17 -1396.91 0 0 0 0 0 0 0 0 0 
237.968 2302.55 2378.54 100.94 2114.55 0 0 0 0 1070.21 0 0 -1415.52 0 1338.01 0 0 0 0 0 -749.458 0 0 -802.866 0 0 0 2059.47 1758.4 0 0 306.177 0 0 203.787 0 1203.42 0 0 0 0 -1693.85 0 1912.21 0 0 0.05 0 0 0 -1759.93 0 0 0 0 0 0 2403.41 0 0 0 0 0 0 0 0 0 0 0 
317.927 0 0 1533.63 0 0 0 -712.531 1565.98 0 0 0 -313.349 0 0 315.638 0 0 1753.21 0 0 0 0 -1558.96 0 0 0 0 0 0 0 0 0 0 0 0 0 0 0 0 0 0 0 0 0 2137.75 0 0 0 0 1908.7 0 0 1209.83 0 0 0 -2145.07 0 0 0 0 0 0 0 0 0 0 0 
0 0 0 1458.86 1274.83 0 1981.19 0 240.257 0 0 0 -1102.86 0 0 2321.92 0 0 0 0 1672.03 0 511.109 -2247.31 0 0 0 -2387.08 0 0 0 0 0 1765.57 0 1137.65 0 0 0 -857.494 0 521.332 0 0 139.393 0 0 0 0.09 0 0 0 0 1260.49 1923.2 0 0 0 0 0 0 0 0 0 0 0 0 0 0 
2068.32 0 0 -287.866 0 0 0 0 0 0 163.503 0 -1321.83 0 0 0 0 0 0 0 0 1213.8 1827.52 0 2189.47 0 0 0 0 0 1862.32 0 0 0 0 0 0 -1496.55 0 0 0 0 0 0 0 0 0 0 0 0.01 0 0 0 0 0 0 0 0 0 -2045.58 0 2169.94 0 0 0 0 0 0 0 
2419.89 0 0 0 -2140.19 0 0 -788.217 0 0 0 0 0 0 0 0 0 0 0 304.498 -1794.72 0 1561.86 0 0 0 0 0 0 0 -674.535 803.323 0 0 0 0 0 0 0 0 12.8941 0 0 0 1736.58 0 1339.69 1858.81 0 0 0 0 0 1317.87 0 0 0 2426.15 0 0 477.386 -1530.58 0 0 0 0 0 0 0 
0 0 0 0 1544.01 0 0 0 0 0 0 -975.295 0 -34.5622 -2394.86 0 0 0 0 0 188.376 970.565 0 2487.49 0 0 0 949.965 0 1802.65 1274.53 0 0 0 0 0 -2121.88 0 549.562 0 0 0 0 0 0 0 0 0 0 0 0 0.07 -1080.74 0 0 0 0 0 -713.141 23.1178 0 0 0 0 0 -1513.18 0 0 0 
914.716 0 0 0 1393.55 0 0 0 0 0 0 0 999.863 0 -1161.92 0 0 2426.91 -210.196 0 0 0 2294.31 1653.72 0 0 -963.546 0 0 0 -765.023 0 0 1655.86 0 0 0 0 0 0 0 0 0 -82.6289 -1742.99 0 0 0 0 0 0 1916.03 0.09 0 0 0 -1701.48 0 0 0 0 0 0 0 -1801.89 0 -363.247 0 0 
781.045 0 0 0 478.607 0 0 0 0 0 1469.39 0 0 -150.685 1461 0 0 0 775.857 -1574.07 0 -1771.07 -943.709 0 0 0 2155.45 0 0 0 0 0 0 0 0 0 -578.86 0 0 0 -1862.62 0 0 1544.77 -80.4926 2326.81 0 575.503 245.903 0 -2237.85 0 0 0.08 0 2198.02 0 2265.92 -2245.78 0 0 0 0 0 0 0 0 0 0 
0 0 0 0 0 0 0 1489.07 -1540.8 0 0 0 0 -1724.98 0 0 0 0 0 0 0 0 0 0 0 0 0 0 0 0 0 1570.1 -508.515 0 0 0 1853.31 0 0 0 0 0 -1106.07 0 0 0 0 0 2027.57 0 0 0 0 0 0.01 0 0 0 0 0 0 0 0 0 0 0 0 0 395.596 
0 0 0 812.632 0 -2218.01 0 0 0 0 835.063 0 0 0 0 0 0 0 0 2315.52 1780.98 0 -776.009 0 0 0 0 0 0 0 0 0 2237.69 0 1956.77 1182.21 1299.1 0 0 0 0 0 0 -2164.14 0 0 0 0 0 0 0 0 0 -84.3074 0 0.04 -1887.19 0 0 0 0 0 0 0 0 0 0 0 0 
0 0 0 0 0 0 -1167.41 0 1768.01 693.457 -2016.89 -2135.61 0 0 0 0 1638.62 1301.39 0 986.435 0 0 0 0 356.227 0 0 0 612.735 0 0 -1528.6 777.841 0 632.725 0 0 -201.498 0 -1875.13 1049.91 0 0 0 0 0 0 0 0 0 0 0 1753.06 0 0 2301.02 0.09 0 0 0 0 0 0 876.11 0 -1205.4 0 0 653.783 
0 0 0 0 0 0 0 0 0 0 282.83 0 951.949 0 0 0 0 0 6.94296 2109.82 0 0 197.378 0 1137.35 0 29.9844 1755.35 314.264 0 0 1913.74 2066.94 0 0 0 410.55 280.541 0 0 0 0 0 0 0 0 1779 624.027 0 0 -787.149 0 0 -808.054 0 0 0 0 -888.775 0 0 0 0 0 0 0 0 1098.74 0 
0 0 0 0 0 0 0 0 0 1274.22 0 0 1921.98 0 0 0 0 0 0 0 -1075.24 0 0 0 0 0 0 0 -1095.39 0 -1166.04 0 0 1415.22 0 0 0 0 0 0 0 -2087.39 0 0 0 1558.2 0 0 0 0 0 387.204 0 1095.84 0 0 0 -2073.81 0.05 0 0 2280.88 156.941 1549.96 0 0 0 0 0 
0 0 0 0 -74.6941 0 1101.64 1046.25 -2262.11 0 0 0 1137.04 0 1458.56 0 0 0 0 1729.26 0 0 0 0 0 0 0 0 1293.76 0 0 0 0 0 0 1788 0 -159.23 0 0 0 0 0 811.258 0 764.412 0 0 0 1609.62 0 260.552 0 0 0 0 0 0 0 0.06 0 0 0 983.993 0 0 0 0 0 
0 0 0 0 0 0 0 -1089.74 0 2440.79 0 0 0 0 0 2224.42 0 0 0 0 0 0 0 0 0 0 0 0 0 0 0 0 0 0 0 0 0 0 -2346.95 0 0 0 0 0 0 0 0 0 0 0 1284.75 0 0 0 0 0 0 0 0 0 0.09 0 0 0 0 0 0 0 0 
0 -498.749 0 0 0 0 0 0 0 0 0 0 1316.34 -2207.63 1703.62 181.509 0 0 0 0 0 0 0 0 0 0 2204.73 0 0 0 0 0 1142.69 0 0 0 0 0 0 0 178.304 0 0 0 0 0 0 0 0 -1720.25 2068.01 0 0 0 0 0 0 0 -2355.8 0 0 0.01 0 0 0 0 0 0 671.636 
0 0 0 0 0 0 0 0 796.915 0 0 0 0 0 0 0 0 0 0 0 -2463.07 -1606.88 0 1455.35 2448.12 1001.24 0 0 1439.48 0 0 0 0 0 0 0 0 0 0 0 0 0 0 0 0 0 0 0 0 0 0 0 0 0 0 0 0 0 -1930.22 0 0 0 0.03 0 0 0 0 1603.67 0 
0 0 0 0 0 0 0 0 0 0 0 0 0 1598.48 0 1839.88 0 0 0 0 -1253.47 0 0 0 0 0 0 0 0 -827.586 0 0 0 0 797.372 0 0 0 0 0 0 0 0 0 730.842 0 0 0 0 0 0 0 0 0 0 0 -1043.96 0 59.8926 1999.8 0 0 0 0.09 0 0 0 0 0 
384.457 0 0 0 0 0 0 0 0 0 0 -1371.58 0 0 0 0 0 0 0 0 0 0 1355.56 0 0 0 0 0 0 0 0 0 0 0 0 1187.86 0 0 0 -776.009 0 0 0 0 0 0 0 0 0 0 0 0 1554.99 0 0 0 0 0 0 0 0 0 0 0 0.02 0 0 0 0 
0 0 0 0 0 0 0 791.116 0 0 0 0 0 0 0 0 0 2102.19 0 0 0 1358 0 0 0 0 0 0 -507.294 0 0 0 0 0 -714.209 0 0 0 0 0 0 0 0 0 0 0 0 0 0 0 0 -165.944 0 0 0 0 -39.4452 0 0 0 0 0 0 0 0 0.05 0 0 0 
0 0 0 0 0 0 0 0 0 0 0 -679.724 0 -1068.68 0 0 0 0 0 -968.429 0 0 0 0 0 0 0 0 0 0 0 0 -1025.35 1729.87 0 -550.478 0 0 0 0 0 0 0 1666.08 0 0 0 0 0 0 0 0 2270.81 0 0 0 0 0 0 0 0 0 0 0 0 0 0.08 0 0 
0 2444.91 0 0 0 0 0 0 0 0 1716.44 0 0 0 0 0 0 0 0 0 0 0 0 0 0 0 0 0 0 61.1133 0 0 0 0 0 0 0 0 0 0 0 0 0 0 -2098.22 0 0 0 0 0 0 0 0 0 0 0 0 318.232 0 0 0 0 -1519.59 0 0 0 0 0.05 0 
0 0 0 2445.83 0 0 496.918 0 0 0 0 0 0 0 0 0 0 0 0 0 0 -2315.67 0 0 0 0 0 1781.9 0 0 0 0 2393.19 0 0 0 0 0 0 0 419.401 0 0 0 0 0 0 0 0 0 0 0 0 0 242.851 0 1517.15 0 0 0 0 2476.2 0 0 0 0 0 0 0.03 
