*Vertices 56
*Matrix 
0.03 0 0 0 212.333 0 0 0 0 0 2132.56 0 -802.56 0 0 0 1017.56 0 0 0 0 0 0 0 0 0 0 0 652.409 0 2243.8 0 0 -1085.31 0 0 0 0 0 -1986.37 0 0 0 2030.17 0 0 1.14444 -1248.13 0 0 0 0 0 0 0 0 
0 0.07 0 0 0 0 0 0 0 0 0 0 0 0 0 -211.417 0 0 0 0 0 0 0 438.017 2013.99 1525.39 1042.28 -2239.68 -1066.09 0 0 0 55.3148 0 0 0 0 143.361 984.756 0 0 0 0 0 0 0 0 0 1905.5 71.4896 507.752 0 0 0 0 0 
0 0 0 -1110.49 0 0 1206.47 0 146.565 51.6526 0 0 0 0 0 -339.29 0 0 0 0 0 0 160.604 0 -2089.98 -906.476 0 0 0 0 0 -524.232 0 0 0 0 0 0 1495.79 0 0 0 388.577 0 0 0 0 1218.99 743.507 0 0 2178.79 0 0 0 -278.253 
0 0 -606.326 0 12.1311 -1970.35 0 1258.66 0 0 0 0 0 0 1592.23 0 0 0 0 0 0 0 -1402.1 0 0 0 0 0 0 2420.35 781.808 0 0 0 1865.83 365.23 0 0 0 0 0 0 -364.772 0 0 0 0 0 0 0 379.879 1460.39 37.6141 0 0 0 
1246.91 0 0 1155.51 0.07 1868.27 1637.55 0 0 0 1130.33 0 0 619.602 0 -1293.6 -1410.18 1009.48 0 0 0 0 0 -180.593 0 645.085 0 0 0 0 0 0 0 0 0 0 0 877.636 -1234.24 -741.981 875.347 0 -168.844 0 0 0 0 0 -1236.53 0 0 1615.88 0 0 0 0 
0 0 0 1749.7 2427.67 0.05 0 0 -2222.89 0 0 0 0 0 -291.833 0 0 0 0 -1728.19 0 223.624 0 0 889.843 0 0 0 0 359.89 441.832 -484.558 0 0 0 0 -524.232 1229.21 0 0 102.313 0 409.177 914.563 0 0 1230.74 -2429.65 0 0 0 0 1662.88 0 0 0 
0 0 2353.21 0 1126.36 0 0.09 0 0 0 220.725 232.17 -783.486 0 0 0 2457.43 0 905.866 0 0 0 0 1054.49 0 0 0 0 0 0 -521.638 0 0 0 0 0 130.543 0 0 -570.772 0 0 0 1219.75 0 0 0 0 0 -49.9741 0 0 -683.081 0 0 0 
0 0 0 1864.3 0 0 0 0.03 0 0 0 0 0 0 0 0 0 0 0 0 0 0 1512.88 0 0 0 0 0 0 0 0 0 259.178 1858.04 0 0 0 0 936.842 1287.19 0 0 0 0 -201.804 0 0 1447.72 0 0 0 0 0 0 0 0 
0 0 2150.87 0 0 -1478.39 0 0 0.08 2345.12 -403.073 0 0 0 0 2436.83 1283.07 0 2305.14 0 165.639 0 0 0 0 0 0 0 -1194.72 0 0 0 2.51778 0 0 0 0 0 0 0 0 0 0 0 0 0 0 0 0 2285.76 0 0 0 0 0 0 
0 0 -11.9785 0 0 0 0 0 2209.77 0.09 0 0 0 0 0 -106.128 823.161 822.245 419.858 0 -260.399 0 1829.05 0 -46.9222 0 0 1231.19 0 0 -1037.1 0 0 0 0 -804.239 0 0 0 0 1437.04 0 0 0 1248.59 0 -2447.66 -2025.74 0 0 -486.541 1986.37 0 1390.35 0 0 
539.644 0 0 0 -461.974 0 -1812.27 0 -573.672 0 0.06 1654.64 0 0 0 0 0 0 -645.39 0 0 2133.32 0 0 301.904 -1936.17 0 0 700.018 0 0 0 0 0 0 0 0 0 0 1223.72 0 0 0 0 0 918.683 0 374.538 0 0 0 0 0 0 0 0 
0 0 0 0 0 0 403.684 0 0 0 502.258 0 -1815.16 0 -1541.57 0 0 0 0 2468.87 678.35 0 1961.5 0 0 0 704.138 0 0 714.209 0 0 0 0 0 0 0 0 0 0 0 0 0 0 -310.45 0 -64.1652 0 1215.48 0 472.808 0 0 -2481.08 626.926 -1657.84 
1692.48 0 0 0 0 0 666.143 0 0 0 0 2408.44 0.04 -307.092 1296.66 0 0 0 0 -442.595 797.525 0 0 0 -2416.99 1854.23 1115.99 0 371.944 0 0 0 0 184.866 0 0 1595.74 0 0 0 0 0 0 0 -372.707 0 0 0 0 0 0 0 2435.76 0 0 0 
0 0 0 0 39.4452 0 0 0 0 0 0 0 -1394.01 0.08 0 0 -1521.88 0 0 0 331.66 0 -1449.1 0 0 0 0 0 0 0 0 0 0 0 0 0 0 0 2248.68 0 -32.4259 764.87 0 0 1184.35 0 0 0 0 0 0 0 0 0 -338.527 0 
0 0 0 2283.62 0 -158.162 0 0 0 0 0 1307.64 528.657 0 0.05 0 -2493.13 0 -68.2852 0 0 0 0 -541.475 -565.127 0 0 0 0 2006.52 388.577 1832.41 0 0 0 0 0 0 0 0 0 85.2229 0 -1300.93 0 319.452 0 0 0 0 85.2229 0 0 0 0 0 
0 119.251 -340.51 0 1648.69 0 0 0 -380.795 193.869 0 0 0 0 0 0.06 2392.42 0 0 0 382.015 0 0 0 0 0 0 0 0 -519.501 0 -1553.62 0 0 0 532.472 0 0 0 1153.83 0 1112.32 0 0 0 2257.99 0 0 0 0 71.1844 0 0 0 0 0 
-2214.04 0 0 0 2236.93 0 1699.35 0 1281.24 -512.787 0 0 0 285.119 -2429.96 -398.038 0.09 0 0 1416.75 0 0 0 0 0 17.3193 0 0 0 0 0 -2159.72 0 0 0 0 0 0 0 0 1878.64 0 0 0 1413.08 0 0 0 -50.1267 0 2388.15 0 0 0 0 0 
0 0 0 0 362.178 0 0 0 0 -577.029 0 0 0 0 0 0 0 0.02 1382.11 0 -1395.08 0 0 0 0 -57.7563 -283.898 0 0 0 0 0 0 2182.91 0 0 0 0 -1564 0 0 0 0 0 -302.82 0 0 940.657 0 0 2498.78 986.129 -1876.96 0 0 1659.98 
0 0 0 0 0 0 1274.99 0 756.172 -411.313 1715.98 0 0 0 -2206.41 0 0 -1134.75 0.01 0 0 0 0 0 3.28074 0 0 1544.92 1026.87 0 0 0 0 0 1837.14 0 0 1739.02 0 0 -1598.94 0 0 0 0 0 -2291.25 0 0 0 0 0 0 0 0 0 
0 0 0 0 0 1570.25 0 0 0 0 0 -1043.2 1089.89 0 0 0 720.161 0 0 0.06 0 1944.11 0 2381.59 0 0 2197.26 2442.32 0 0 0 -2249.44 -2293.39 0 0 0 0 0 0 -2453.46 0 1534.85 146.565 0 0 0 0 0 0 0 -1015.12 0 0 0 0 -1744.36 
0 0 0 0 0 0 0 0 -970.107 1669.59 0 -664.159 2145.53 -1564.3 0 2459.26 0 148.396 0 0 0.02 0 2160.48 0 -442.747 -1080.58 0 0 0 0 0 -1892.38 783.334 -1077.38 745.643 0 -864.36 349.971 -289.392 -2085.25 0 -283.593 0 0 0 0 -1252.71 0 0 0 2144.46 0 0 0 0 0 
0 0 0 0 0 1076.01 0 0 0 0 1777.93 0 0 0 0 0 0 0 0 -1277.73 0 0.04 0 0 0 0 0 0 0 1149.4 0 0 0 668.584 0 0 0 0 0 0 2492.98 552.614 0 0 0 0 0 0 0 0 0 0 0 2089.22 0 0 
0 0 -1508.91 -661.26 0 0 0 -1376.31 0 800.577 0 -167.623 0 -567.568 0 0 0 0 0 0 -401.395 0 0 0 0 0 0 0 0 0 0 0 0 0 0 0 153.279 0 0 738.929 -702.155 0 0 0 0 0 0 0 0 0 1233.18 0 0 1844.61 0 0 
0 2430.57 0 0 1058.31 0 874.737 0 0 0 0 0 0 0 665.99 0 0 0 0 -2012.92 0 0 0 0.06 0 0 0 2186.12 0 0 1609.78 0 -1066.85 0 -2372.43 -142.293 0 0 0 0 0 0 1127.89 0 0 739.387 2445.07 -57.2985 0 0 0 0 -1485.26 -1856.36 0 0 
0 -2331.39 -2330.47 0 0 1881.39 0 0 0 965.835 1876.2 0 -2252.49 0 286.95 0 0 0 1194.42 0 2280.42 0 0 0 0.01 0 0 0 -89.9533 0 0 0 0 0 0 -1641.67 415.281 0 0 0 0 1784.95 0 1836.07 0 0 0 0 1091.57 0 0 -91.6318 402.921 0 0 0 
0 1460.54 508.057 0 2048.17 0 0 0 0 0 2222.28 0 2001.02 0 0 0 2369.38 -549.104 0 0 -660.649 0 0 0 0 0.01 0 536.439 0 0 0 0 0 0 0 0 0 -468.535 0 0 0 0 0 0 0 0 -2212.82 0 0 2441.56 0 0 -645.848 0 0 0 
0 2174.52 0 0 0 0 0 0 0 0 0 -1441.92 -1185.87 0 0 0 0 829.264 0 2325.43 0 0 0 0 0 0 0.02 0 0 0 -1553.32 0 1747.41 0 0 1978.9 0 0 2.06 0 0 0 0 0 1824.63 0 0 2329.71 0 0 -2308.5 0 0 0 0 0 
0 1264.15 0 0 0 0 0 0 0 1194.42 0 0 0 0 0 0 0 0 2353.97 -255.211 0 0 0 -31.8155 0 -241.783 0 0.06 0 0 0 1514.56 0 -2066.94 194.937 0 1535 0 -1472.14 0 0 0 0 0 0 2255.85 0 1990.19 0 0 0 0 0 -189.444 0 0 
415.128 -140.919 0 0 0 0 0 0 2245.63 0 -2063.13 0 -1448.79 0 0 0 0 0 2157.43 0 0 0 0 0 494.629 0 0 0 0.03 154.805 0 0 2337.03 0 0 0 1730.48 -2207.48 0 646.458 795.541 -1988.81 0 -406.125 0 0 0 0 0 0 0 0 0 0 0 0 
0 0 0 -1748.33 0 318.232 0 0 0 0 0 1617.1 0 0 -2306.36 1947.92 0 0 0 0 0 526.063 0 0 0 0 0 0 820.414 0.09 0 0 0 -984.603 0 0 -519.501 0 0 0 0 0 0 0 0 0 0 0 1692.48 0 808.206 0 0 0 0 0 
236.595 0 0 1277.43 0 -1518.07 1779.92 0 0 2040.54 0 0 0 0 -156.484 0 0 0 0 0 0 0 0 -589.694 0 0 -709.174 0 0 0 0.04 0 0 0 0 0 749.001 0 0 0 2375.18 0 223.319 0 -1387.75 0 0 0 0 0 1910.23 0 0 0 0 0 
0 0 -623.417 0 0 684.759 0 0 0 0 0 0 0 0 -1737.04 822.55 177.999 0 0 1976.3 28.4585 0 0 0 0 0 0 2258.9 0 0 0 0.01 0 0 0 0 0 0 0 0 -1195.33 0 0 0 0 0 0 -43.26 0 0 0 0 0 0 0 0 
0 2385.4 0 0 0 0 0 430.998 -1736.58 0 0 0 0 0 0 0 0 0 0 -124.897 -727.18 0 0 1700.11 0 0 314.57 0 1570.56 0 0 0 0.06 0 0 0 528.809 0 0 0 0 0 2236.93 2460.48 0 0 0 0 0 0 0 0 0 0 0 779.214 
197.073 0 0 0 0 0 0 -1441.62 0 0 0 0 -1573 0 0 0 0 -867.107 0 0 2365.57 1169.7 0 0 0 0 0 -1882.46 0 1752.3 0 0 0 0.05 0 2165.21 0 0 1313.59 0 0 0 0 0 0 0 0 2358.7 0 0 2054.12 0 0 251.396 0 0 
0 0 0 -737.404 0 0 0 0 0 0 0 0 0 0 0 0 0 0 -1522.34 0 1458.86 0 0 2137.9 0 0 0 33.0363 0 0 0 0 0 0 0.01 0 497.223 0 0 -2117.6 0 0 2101.89 0 -456.175 0 0 -1522.8 0 0 2138.05 0 0 0 0 0 
0 0 0 -320.215 0 0 0 0 0 1802.96 0 0 0 0 0 -1259.42 0 0 0 0 0 0 0 -1522.49 372.097 0 620.823 0 0 0 0 0 0 4.0437 0 0.06 0 0 0 0 0 0 0 0 0 0 -893.811 0 0 0 2258.45 0 1753.06 -934.4 0 0 
0 0 0 0 0 1481.14 1699.65 0 0 0 0 0 1189.54 0 0 0 0 0 0 0 -2479.71 0 617.161 0 1417.36 0 0 -2086.17 1683.78 -2170.25 330.744 0 -1206.02 0 1442.38 0 0.07 0 0 0 1257.9 0 0 -1517.61 1735.82 858.715 0 1490.14 0 0 0 -797.22 0 0 0 -1484.04 
0 573.061 0 0 2144 2454.68 0 0 0 0 0 0 0 0 0 0 0 0 308.771 0 -2130.12 0 0 0 0 -716.346 0 0 -52.4155 0 0 0 0 0 0 0 0 0.02 -1773.66 0 0 0 0 -278.558 0 1210.59 0 0 -219.81 0 0 0 0 0 0 0 
0 1885.81 1969.44 0 -732.673 0 0 2021.16 0 0 0 0 0 907.239 0 0 0 317.621 0 0 284.814 0 0 0 0 0 926.313 -1639.23 0 0 0 0 0 -2378.38 0 0 0 -998.794 0.03 0 0 0 0 2105.09 0 0 0 2097.16 736.946 269.707 0 257.042 0 0 0 0 
437.559 0 0 0 1311.46 0 1525.85 616.55 0 0 -1192.28 0 0 0 0 927.686 0 0 0 1203.57 629.215 0 -1403.16 0 0 0 0 0 1404.69 0 0 0 0 0 263.909 0 0 0 0 0 0 -1581.85 -2202.75 0 -88.4274 0 0 0 0 0 0 -1211.66 900.83 0 0 0 
0 0 0 0 812.021 713.141 0 0 0 -618.534 0 0 0 -445.341 0 0 1151.23 0 2266.69 0 0 -683.081 635.624 0 0 0 0 0 2004.99 0 413.297 2099.44 0 0 0 0 -1260.64 0 0 0 0.03 0 0 -12.8941 0 0 0 0 1776.25 2305.9 847.118 0 0 -1689.43 0 0 
0 0 0 0 0 0 0 0 0 0 0 0 0 -457.549 -1319.7 -1795.79 0 0 0 1803.57 929.06 861.919 0 0 -35.02 0 0 0 393.002 0 0 0 0 0 0 0 0 0 0 1036.18 0 0.05 0 0 -377.59 0 0 1718.73 0 0 0 0 1229.21 0 -2028.34 0 
0 0 368.13 2411.34 2378.69 -438.169 0 0 0 0 0 0 0 0 0 0 0 0 0 -191.733 0 0 0 1891.31 0 0 0 0 0 0 -1826.3 0 -2466.58 0 -900.983 0 0 0 0 1897.72 0 0 0.06 0 0 658.818 0 0 0 0 -1117.51 1424.99 0 1478.39 0 0 
-1652.5 0 0 0 0 -872.906 577.181 0 0 0 0 0 0 0 1518.07 0 0 0 0 0 0 0 0 0 2335.51 0 0 0 787.912 0 0 0 166.555 0 0 0 1829.05 1243.1 -887.555 0 -2064.04 0 0 0.05 0 2361.45 0 -633.641 0 0 -705.206 0 0 0 2107.38 0 
0 0 0 0 0 0 0 1973.25 0 1207.39 0 2495.42 -614.872 155.721 0 0 -831.706 2354.27 0 0 0 0 0 0 0 0 526.063 0 0 0 491.882 0 0 0 1264.92 0 2319.33 0 0 -2368.31 0 2084.64 0 0 0.07 0 2392.42 0 0 0 0 0 0 0 0 0 
0 0 0 0 0 0 0 0 0 0 -846.507 0 0 0 666.601 1064.56 0 0 0 0 0 0 0 1070.51 0 0 0 -1302.91 0 0 0 0 0 0 0 0 -1925.18 1707.28 0 0 0 0 1466.95 -2368.16 0 0.08 0 0 0 -2158.8 2262.57 2033.22 0 1289.79 -869.701 0 
-1719.03 0 0 0 0 -1437.35 0 0 0 988.876 0 25.5593 0 0 0 0 0 0 670.568 0 -1136.74 0 0 1197.62 0 -1492.13 0 0 0 0 0 0 0 0 0 485.626 0 0 0 0 0 0 0 0 329.218 0 0.06 0 1684.85 0 0 0 1262.17 0 2015.37 2001.94 
2146.44 0 -1181.3 0 0 -938.368 0 1277.12 0 399.258 -423.215 0 0 0 0 0 0 -350.276 0 0 0 0 0 -1775.8 0 0 -582.98 -1866.89 0 0 0 1856.21 0 1409.12 2152.09 0 -2185.2 0 2310.02 0 0 -1476.1 0 1744.97 0 0 0 0.06 0 -682.165 1627.17 2215.11 0 0 0 0 
0 -2199.7 44.9385 0 1821.27 0 0 0 0 0 0 -629.215 0 0 0 0 2306.82 0 0 0 0 0 0 0 678.961 0 0 0 0 -935.011 0 0 0 0 0 0 0 2187.49 -624.027 0 877.483 0 0 0 0 0 1602.76 0 0.02 0 0 0 0 -1196.25 -197.378 0 
0 273.522 0 0 0 0 -1337.55 0 1060.9 0 0 0 0 0 0 0 0 0 0 0 0 0 0 0 0 1341.67 0 0 0 0 0 0 0 0 0 0 0 0 1860.33 0 -1290.86 0 0 0 0 -464.263 0 224.998 0 0.01 2103.41 0 0 0 0 -1854.99 
0 -103.839 0 652.257 0 0 0 0 0 184.103 0 1070.06 0 0 -221.03 -193.716 2111.96 2345.58 0 413.602 391.171 0 -599.002 0 0 0 -369.808 0 0 1199.91 -2323.3 0 0 1439.94 965.377 1315.58 0 0 0 0 1885.05 0 -868.938 -2202.29 0 2034.75 0 -1796.55 0 1751.08 0.06 0 756.935 -1875.59 0 0 
0 0 -1263.08 2407.53 -1999.5 0 0 0 0 -1058.92 0 0 0 0 0 0 0 2424.47 0 0 0 0 0 0 1970.96 0 0 0 0 0 0 0 0 0 0 0 2013.69 0 -1055.86 -937.452 0 0 1362.73 0 0 -1065.48 0 -1512.73 0 0 0 0.02 0 0 0 0 
0 0 0 -1598.64 0 -2092.43 1235.01 0 0 0 0 0 536.134 0 0 0 0 2014.15 0 0 0 0 0 -178.915 -310.907 -962.02 0 0 0 0 0 0 0 0 0 -18.54 0 0 0 1771.37 0 2478.64 0 0 0 0 702.307 0 0 0 1561.86 0 0.08 0 0 0 
0 0 0 0 0 0 0 0 0 -839.641 0 -2046.95 0 0 0 0 0 0 0 0 0 2189.32 -1436.28 1278.8 0 0 0 -1446.65 0 0 0 0 0 676.672 0 -39.4452 0 0 0 0 -1039.38 0 1854.53 0 0 1691.26 0 0 1067.61 0 1180.38 0 0 0.07 0 0 
0 0 0 0 0 0 0 0 0 0 0 -1126.67 0 744.88 0 0 0 0 0 0 0 0 0 0 0 0 0 0 0 0 0 0 0 0 0 0 0 0 0 0 0 2263.63 0 1430.17 0 1767.4 -1351.44 0 381.405 0 0 0 0 0 0.08 0 
0 0 2473.14 0 0 0 0 0 0 0 0 1120.41 0 0 0 0 0 2188.71 0 1396.91 0 0 0 0 0 0 0 0 0 0 0 0 -728.553 0 0 0 -423.368 0 0 0 0 0 0 0 0 0 2449.19 0 0 1263.08 0 0 0 0 0 0.08 
