*Vertices 61
*Matrix 
0.07 0 0 1061.97 0 0 0 0 0 0 397.427 0 0 0 311.212 0 0 0 0 0 0 0 0 0 0 0 0 0 0 744.728 0 -174.947 0 0 0 0 0 0 0 0 258.873 0 1838.36 0 0 0 0 0 0 0 0 0 0 0 0 0 0 0 0 0 0 
0 0.06 0 0 0 241.173 1447.72 0 0 0 -579.928 0 0 0 0 0 0 0 0 0 0 0 -813.395 0 0 0 0 0 1489.07 0 0 2250.97 0 0 0 0 0 0 0 0 0 0 489.441 0 0 0 0 0 0 0 0 0 0 0 0 0 0 0 0 0 0 
0 0 0.01 0 0 0 -472.655 0 0 0 -106.891 0 0 -2420.96 0 0 0 -1904.13 0 0 0 341.121 0 1133.38 0 0 0 1901.84 0 0 0 0 0 1892.99 -466.857 0 0 0 0 0 2222.74 0 0 0 0 0 0 -134.663 0 0 1093.86 0 0 0 0 0 595.035 0 0 0 0 
231.407 0 0 0.08 0 0 0 0 0 0 0 0 240.562 0 0 0 550.63 97.5829 1624.42 0 0 0 0 0 0 0 0 0 0 0 0 0 0 0 0 1881.39 0 0 0 0 902.051 -1760.08 0 0 0 1242.03 0 70.5741 0 0 0 0 750.679 0 0 0 0 0 0 0 0 
0 0 0 0 0.06 0 0 0 0 0 0 0 0 0 0 -835.673 0 0 -439.39 0 0 0 0 0 0 0 0 0 0 0 0 0 0 1981.8 0 0 0 0 0 189.138 0 0 0 0 0 0 1426.97 0 0 0 77.2881 0 0 0 0 0 0 0 0 0 0 
0 1371.88 0 0 0 0.05 0 0 0 0 0 0 2091.51 0 0 0 0 0 121.387 0 0 0 0 0 0 0 0 0 -296.411 0 0 0 0 0 0 0 0 0 0 930.28 0 0 0 0 2303.46 0 0 0 -594.119 0 0 0 0 0 0 0 0 0 0 0 0 
0 1356.78 -599.612 0 0 0 0.03 0 0 0 0 0 0 0 0 0 0 0 0 0 0 0 0 0 0 0 0 0 0 0 2389.22 -152.364 0 0 0 0 0 0 0 0 0 0 0 0 0 0 0 0 0 0 0 0 0 0 0 0 0 0 0 0 0 
0 0 0 0 0 0 0 0.03 0 0 0 0 0 0 0 0 0 0 0 0 0 0 0 0 0 0 0 1225.55 0 0 0 0 0 0 0 412.076 1707.28 0 -2372.89 0 0 0 0 0 0 854.289 1331.75 0 0 0 0 0 0 0 0 0 0 0 0 0 0 
0 0 0 0 0 0 0 0 0.01 0 0 0 0 0 0 0 0 0 -290.613 0 930.28 0 0 0 0 0 0 0 0 0 -191.275 0 0 0 0 387.509 0 0 0 0 0 2427.82 0 0 0 76.3726 -831.858 0 0 0 0 0 0 0 0 0 0 0 0 0 0 
0 0 0 0 0 0 0 0 0 0.09 0 -113.605 1465.58 0 0 0 0 0 1225.55 0 2491.3 0 903.272 0 0 0 0 -95.9044 0 0 498.444 314.875 0 0 0 -413.449 0 685.522 0 0 0 0 0 -1665.47 0 -2346.03 0 0 0 0 0 0 0 0 0 0 0 0 0 0 0 
-1465.73 -2031.69 1546.75 0 0 0 0 0 0 0 0 0 0 0 0 0 0 893.506 1889.93 0 0 0 0 0 0 -754.189 0 759.835 726.875 0 0 0 0 0 0 0 588.168 0 0 35.4778 0 0 0 0 0 -0.686666 0 2034.29 0 620.518 0 0 0 0 0 0 0 0 0 0 0 
0 0 0 0 0 0 0 0 0 568.331 0 0 0 -1128.04 1926.1 0 0 0 1228.14 0 2170.86 0 0 0 0 0 2244.71 0 0 0 0 0 0 0 0 0 0 0 0 0 0 0 0 -2337.79 0 0 0 0 0 -1251.95 2320.25 0 0 0 0 0 0 -479.064 0 0 0 
0 0 0 1490.45 0 1312.07 0 0 0 -597.324 0 0 0.09 0 0 0 0 0 0 -817.362 0 0 0 0 0 0 0 -1999.95 0 0 0 0 0 -762.886 1601.54 0 0 0 0 0 0 0 0 0 0 299.005 0 0 0 0 0 0 0 0 0 0 0 0 0 0 0 
0 0 178.152 0 0 0 0 0 0 0 0 65.5385 0 0.09 0 0 0 0 0 0 0 0 0 0 0 0 0 0 1752.45 0 0 0 1690.04 -1273.61 0 -974.38 0 0 0 0 0 0 0 0 0 0 0 0 2356.56 0 0 0 0 0 -2459.11 0 0 0 0 0 0 
100.635 0 0 0 0 0 0 0 0 0 0 -162.435 0 0 0.05 0 0 0 0 0 0 0 0 0 0 0 -157.552 2401.27 0 0 0 1914.96 0 0 0 0 0 0 0 0 256.584 0 0 0 0 625.095 0 0 0 0 0 0 0 0 0 0 0 0 0 0 0 
0 0 0 0 2444.91 0 0 0 0 0 0 0 0 0 0 0.05 0 0 0 0 2413.79 0 0 0 2393.95 0 0 0 0 0 0 0 0 -2370.45 0 0 -130.543 0 0 0 0 0 0 2248.83 0 0 0 0 0 -1229.82 0 0 0 0 0 0 0 0 0 0 0 
0 0 0 879.925 0 0 0 0 0 0 0 0 0 0 0 0 0.06 0 0 0 0 0 0 0 0 0 554.445 0 0 0 0 0 0 2115.77 0 0 0 0 0 0 0 0 0 -1130.02 0 0 0 0 0 0 0 0 0 0 0 0 0 0 0 0 0 
0 0 -502.411 -1056.63 0 0 0 0 0 0 1591.62 0 0 0 0 0 0 0.05 0 0 -1006.27 0 0 0 0 0 0 0 -1180.07 0 0 888.623 1156.27 1508.61 0 0 0 0 0 0 0 0 0 0 0 1794.56 0 0 0 0 1094.78 0 0 0 0 0 0 0 0 0 -1866.13 
0 0 0 308.771 1531.04 2278.28 0 0 -2.51778 1244.93 891.827 -1053.27 0 0 0 0 0 0 0.07 2460.02 0 0 0 0 0 0 0 0 0 0 0 449.767 0 -1704.23 0 0 0 0 0 0 0 0 0 0 0 0 -2000.87 0 63.097 2308.95 0 0 0 0 0 0 0 0 0 0 0 
0 0 0 0 0 0 0 0 0 0 0 0 -1269.19 0 0 0 0 0 1761.15 0.06 0 0 0 0 0 0 0 0 0 0 2392.42 0 0 0 0 0 0 2127.83 0 0 0 0 736.946 0 -486.389 0 0 0 0 0 0 0 0 -1431.7 0 0 0 0 0 0 0 
0 0 0 0 0 0 0 0 1128.04 1560.64 0 444.121 0 0 0 -463.805 0 -2044.82 0 0 0.01 0 0 1519.44 0 2421.72 0 0 0 0 0 0 0 -861.766 567.721 0 2194.36 0 0 0 0 0 0 0 0 0 0 0 0 0 0 0 0 0 0 0 0 0 0 0 0 
0 0 976.974 0 0 0 0 0 0 0 0 0 0 0 0 0 0 0 0 0 0 0.02 0 0 1165.43 0 0 0 0 1750.31 0 -1148.34 0 0 0 0 0 0 0 2021.01 0 0 0 0 0 0 0 0 0 553.682 0 0 0 0 0 0 0 0 0 0 0 
0 -1383.18 0 0 0 0 0 0 0 2233.12 0 0 0 0 0 0 0 0 0 0 0 0 0.09 0 0 0 0 0 0 0 0 0 0 2268.06 0 -1865.21 1304.13 0 0 0 0 0 0 0 0 0 1878.03 0 0 0 0 0 0 0 0 0 0 0 0 0 0 
0 0 2366.79 0 0 0 0 0 0 0 0 0 0 0 0 0 0 0 0 0 423.673 0 0 0.03 -123.524 0 1731.54 0 0 0 0 0 -1342.74 0 0 0 0 0 2373.96 0 0 2390.44 0 1148.03 0 0 0 -1231.35 0 0 0 0 0 0 0 0 0 0 0 0 0 
0 0 0 0 0 0 0 0 0 0 0 0 0 0 0 598.086 0 0 0 0 0 1408.66 0 763.497 0.06 0 0 0 0 0 0 0 2256.92 2016.13 0 0 0 0 0 0 0 -1587.04 -2145.07 0 0 0 0 0 0 0 0 0 0 0 0 0 0 0 0 0 0 
0 0 0 0 0 0 0 0 0 0 1282.16 0 0 0 0 0 0 0 0 0 1933.88 0 0 0 0 0.08 0 0 0 0 -230.796 0 0 0 0 0 0 0 -1805.09 0 0 0 0 0 0 0 0 0 0 0 0 0 0 0 0 0 0 0 0 0 0 
0 0 0 0 0 0 0 0 0 0 0 831.553 0 0 -77.8985 0 -1316.49 0 0 0 0 0 0 -327.082 0 0 0.07 0 0 1492.43 0 0 0 0 0 0 0 883.587 0 0 0 2294.15 0 0 0 0 0 0 0 0 0 0 0 0 0 0 0 0 0 0 0 
0 0 1732.31 0 0 0 0 265.435 0 131.458 2338.25 0 376.675 0 946.455 0 0 0 0 0 0 0 0 0 0 0 0 0.02 0 0 0 0 -2495.12 0 0 0 0 0 910.443 0 0 0 0 0 0 0 0 0 0 0 0 0 0 0 0 0 0 0 0 0 0 
0 1085.77 0 0 0 -2433.47 0 0 0 0 1576.05 0 0 261.467 0 0 0 1261.41 0 0 0 0 0 0 0 0 0 0 0.06 0 0 0 0 0 0 0 0 0 0 0 -1426.05 252.007 2237.85 0 0 0 0 0 0 0 1277.58 0 0 0 0 0 0 0 0 0 0 
773.873 0 0 0 0 0 0 0 0 0 0 0 0 0 0 0 0 0 0 0 0 1148.34 0 0 0 0 388.577 0 0 0.04 0 0 0 0 0 0 0 0 0 0 0 0 0 0 0 0 0 0 2386.01 0 0 0 0 0 0 0 0 0 0 -310.144 0 
0 0 0 0 0 0 2337.95 0 -600.375 124.287 0 0 0 0 0 0 0 0 0 -2143.39 0 0 0 0 0 -1329.31 0 0 0 0 0.09 0 0 0 1639.99 0 0 0 271.081 0 0 0 0 -362.484 0 0 654.241 1982.41 742.592 0 0 0 0 0 0 0 0 0 0 0 0 
-464.415 -2445.52 0 0 0 0 -1691.26 0 0 2314.75 0 0 0 0 786.691 0 0 1626.26 -1731.54 0 0 1435.21 0 0 0 0 0 0 0 0 0 0.02 0 1834.54 0 0 0 0 2378.38 0 0 0 0 0 -1915.27 0 0 0 0 1130.48 0 0 0 0 0 0 0 0 0 0 0 
0 0 0 0 0 0 0 0 0 0 0 0 0 -234.153 0 0 0 207.144 0 0 0 0 0 725.654 -393.46 0 0 1956.62 0 0 0 0 0.09 0 0 0 0 0 0 0 0 0 0 0 0 0 0 0 901.898 0 0 0 0 0 0 0 0 0 0 0 0 
0 0 -2448.88 0 1661.5 0 0 0 0 0 0 0 179.373 2269.74 0 222.709 -345.241 -2382.96 2416.23 0 2394.25 0 1300.93 0 -1037.55 0 0 0 0 0 0 2267.14 0 0.05 0 -37.0037 0 0 0 0 0 0 0 118.03 0 0 0 0 0 0 0 0 0 0 0 0 0 0 0 0 0 
0 0 2022.69 0 0 0 0 0 0 0 0 0 1493.19 0 0 0 0 0 0 0 127.033 0 0 0 0 0 0 0 0 0 699.408 0 0 0 0.07 0 0 0 0 0 0 0 0 0 0 0 0 0 0 0 0 0 0 0 0 0 0 0 0 0 0 
0 0 0 1666.08 0 0 0 -1115.99 1507.54 -2071.52 0 0 0 -526.521 0 0 0 0 0 0 0 0 -1553.77 0 0 0 0 0 0 0 0 0 0 1860.33 0 0.02 1051.29 0 0 0 0 0 -819.193 1188.01 0 0 583.743 0 0 0 0 0 0 0 0 0 0 0 0 0 0 
0 0 0 0 0 0 0 -1821.12 0 0 1402.86 0 0 0 0 681.555 0 0 0 0 -469.909 0 -961.562 0 0 0 0 0 0 0 0 0 0 0 0 621.891 0.03 0 0 0 0 0 0 0 0 0 0 2136.98 0 0 0 0 0 0 0 1994 0 0 0 0 0 
0 0 0 0 0 0 0 0 0 -1589.63 0 0 0 0 0 0 0 0 0 -727.638 0 0 0 0 0 0 2429.04 0 0 0 0 0 0 0 0 0 0 0 0 0 299.31 2473.6 0 0 0 0 0 0 0 0 0 0 0 0 0 0 0 0 0 0 0 
0 0 0 0 0 0 0 494.781 0 0 0 0 0 0 0 0 0 0 0 0 0 0 0 -770.211 0 1910.38 0 1546.45 0 0 -975.143 378.506 0 0 0 0 0 0 0.09 0 0 0 0 0 0 0 -2151.63 -568.941 0 0 0 0 0 0 0 0 0 0 0 0 0 
0 0 0 0 -45.7015 1963.48 0 0 0 0 -1047.32 0 0 0 0 0 0 0 0 0 0 -1108.97 0 0 0 0 0 0 0 0 0 0 0 0 0 0 0 0 0 0.01 0 0 1843.09 0 0 0 0 -907.239 0 0 0 0 0 0 0 0 0 0 0 0 0 
2412.11 0 2396.54 2059.47 0 0 0 0 0 0 0 0 0 0 811.563 0 0 0 0 0 0 0 0 0 0 0 0 0 -521.027 0 0 0 0 0 0 0 0 1946.85 0 0 0.09 0 -703.07 0 0 0 0 0 0 0 0 0 0 0 0 0 0 0 0 0 0 
0 0 0 -1124.84 0 0 0 0 2120.04 0 0 0 0 0 0 0 0 0 0 0 0 0 0 689.184 1404.08 0 -123.371 0 1855.6 0 0 0 0 0 0 0 0 -1324.27 0 0 0 0.07 0 0 0 0 0 0 0 0 0 0 0 0 0 0 0 0 0 0 0 
400.632 -1650.52 0 0 0 0 0 0 0 0 0 0 0 0 0 0 0 0 0 2483.83 0 0 0 0 -2397.31 0 0 0 -145.65 0 0 0 0 0 0 949.66 0 0 0 531.556 1323.82 0 0.09 0 0 0 0 0 0 2119.13 0 -2013.69 0 0 0 0 0 0 0 0 0 
0 0 0 0 0 0 0 0 0 1957.69 0 -1397.98 0 0 0 -924.024 1683.17 0 0 0 0 0 0 -817.972 0 0 0 0 0 0 1414.76 0 0 1334.65 0 152.821 0 0 0 0 0 0 0 0.06 1666.39 0 0 0 0 0 0 0 0 0 0 0 0 0 0 0 0 
0 0 0 0 0 -710.7 0 0 0 0 0 0 0 0 0 0 0 0 0 2256.31 0 0 0 0 0 0 0 0 0 0 0 -2159.87 0 0 0 0 0 0 0 0 0 0 0 1139.18 0 0 0 0 0 1345.64 0 0 0 0 0 0 0 0 0 0 0 
0 0 0 1618.93 0 0 0 975.753 165.334 852 -1518.22 0 692.083 0 1743.29 0 0 671.484 0 0 0 0 0 0 0 0 0 0 0 0 0 0 0 0 0 0 0 0 0 0 0 0 0 0 0 0 1656.32 0 0 0 -1078.45 0 0 0 0 0 0 0 0 0 0 
0 0 0 0 1082.42 0 0 1751.38 746.254 0 0 0 0 0 0 0 0 0 1428.5 0 0 0 2040.54 0 0 0 0 0 0 0 -2258.29 0 0 0 0 468.688 0 0 -1937.54 0 0 0 0 0 0 822.703 0.02 0 0 0 0 0 0 0 0 0 0 0 0 0 0 
0 0 -1694.31 913.19 0 0 0 0 0 0 -31.3578 0 0 0 0 0 0 0 0 0 0 0 0 497.375 0 0 0 0 0 0 2323.91 0 0 0 0 0 717.414 0 -237.815 -2049.7 0 0 0 0 0 0 0 0.02 0 2137.29 0 0 0 0 0 0 0 0 0 0 0 
0 0 0 0 0 -1109.58 0 0 0 0 0 0 0 1697.82 0 0 0 0 2056.11 0 0 0 0 0 0 0 0 0 0 1290.55 -377.895 0 359.127 0 0 0 0 0 0 0 0 0 0 0 0 0 0 0 0.05 0 0 0 0 0 0 0 0 0 0 0 0 
0 0 0 0 0 0 0 0 0 0 507.752 900.067 0 0 0 582.064 0 0 -202.261 0 0 1206.32 0 0 0 0 0 0 0 0 0 2328.49 0 0 0 0 0 0 0 0 0 0 2383.27 0 -1964.86 0 0 2478.48 0 0.02 0 0 0 0 0 0 0 0 0 0 0 
0 0 -225.761 0 2085.1 0 0 0 0 0 0 2373.81 0 0 0 0 0 -1748.94 0 0 0 0 0 0 0 0 0 0 -293.207 0 0 0 0 0 0 0 0 0 0 0 0 0 0 0 0 2013.23 0 0 0 0 0.03 0 0 0 0 0 0 0 0 0 0 
0 0 0 0 0 0 0 0 0 0 0 0 0 0 0 0 0 0 0 0 0 0 0 0 0 0 0 0 0 0 0 0 0 0 0 0 0 0 0 0 0 0 614.414 0 0 0 0 0 0 0 0 0.05 0 0 0 0 0 0 0 0 0 
0 0 0 1708.5 0 0 0 0 0 0 0 0 0 0 0 0 0 0 0 0 0 0 0 0 0 0 0 0 0 0 0 0 0 0 0 0 0 0 0 0 0 0 0 0 0 0 0 0 0 0 0 0 0.08 0 0 0 0 0 0 0 0 
0 0 0 0 0 0 0 0 0 0 0 0 0 0 0 0 0 0 0 454.497 0 0 0 0 0 0 0 0 0 0 0 0 0 0 0 0 0 0 0 0 0 0 0 0 0 0 0 0 0 0 0 0 0 0.05 0 0 0 0 0 0 0 
0 0 0 0 0 0 0 0 0 0 0 0 0 594.424 0 0 0 0 0 0 0 0 0 0 0 0 0 0 0 0 0 0 0 0 0 0 0 0 0 0 0 0 0 0 0 0 0 0 0 0 0 0 0 0 0.09 0 0 0 0 0 0 
0 0 0 0 0 0 0 0 0 0 0 0 0 0 0 0 0 0 0 0 0 0 0 0 0 0 0 0 0 0 0 0 0 0 0 0 2213.58 0 0 0 0 0 0 0 0 0 0 0 0 0 0 0 0 0 0 0.01 0 0 0 0 0 
0 0 1038.77 0 0 0 0 0 0 0 0 0 0 0 0 0 0 0 0 0 0 0 0 0 0 0 0 0 0 0 0 0 0 0 0 0 0 0 0 0 0 0 0 0 0 0 0 0 0 0 0 0 0 0 0 0 0.03 0 0 0 0 
0 0 0 0 0 0 0 0 0 0 0 2146.44 0 0 0 0 0 0 0 0 0 0 0 0 0 0 0 0 0 0 0 0 0 0 0 0 0 0 0 0 0 0 0 0 0 0 0 0 0 0 0 0 0 0 0 0 0 0.07 -1464.66 0 0 
0 0 0 0 0 0 0 0 0 0 0 0 0 0 0 0 0 0 0 0 0 0 0 0 0 0 0 0 0 0 0 0 0 0 0 0 0 0 0 0 0 0 0 0 0 0 0 0 0 0 0 0 0 0 0 0 0 1555.3 0.01 0 0 
0 0 0 0 0 0 0 0 0 0 0 0 0 0 0 0 0 0 0 0 0 0 0 0 0 0 0 0 0 888.928 0 0 0 0 0 0 0 0 0 0 0 0 0 0 0 0 0 0 0 0 0 0 0 0 0 0 0 0 0 0.06 0 
0 0 0 0 0 0 0 0 0 0 0 0 0 0 0 0 0 2218.16 0 0 0 0 0 0 0 0 0 0 0 0 0 0 0 0 0 0 0 0 0 0 0 0 0 0 0 0 0 0 0 0 0 0 0 0 0 0 0 0 0 0 0.03 
