*Vertices 69
*Matrix 
0.03 0 0 0 0 0 0 1679.97 0 1523.26 -2326.81 0 0 0 0 0 0 0 0 0 0 0 0 0 0 -943.709 0 0 2091.97 -2423.86 -575.198 1127.58 -1134.91 0 0 0 1193.96 -729.621 615.94 0 0 0 -1874.68 0 0 52.8733 -1717.81 2365.87 0 2362.36 0 1724.68 0 0 0 0 0 0 0 1545.69 0 0 -240.562 0 0 0 0 0 0 
0 0.07 0 0 0 8.62148 0 0 0 0 -773.11 0 0 0 0 323.878 472.961 0 0 0 0 0 0 0 0 0 550.325 0 -732.673 -1378.14 0 0 2414.09 622.349 0 0 -1424.83 0 2446.29 0 -1258.66 0 903.729 -990.097 0 0 0 0 170.37 -481.201 0 0 0 0 0 0 0 0 1605.5 0 0 -858.867 0 0 0 0 0 0 0 
0 0 0 904.645 2089.37 0 0 0 336.39 0 -731.147 0 0 -2288.81 0 0 0 1425.29 -2077.32 315.638 0 0 -326.93 0 0 1466.03 1257.13 0 0 0 0 0 0 0 215.537 135.426 0 469.298 0 0 0 -2156.82 0 0 702.46 0 0 0 0 0 2337.03 -733.589 0 1369.29 0 0 0 1502.96 -515.229 0 119.098 0 -1029.31 0 0 0 0 0 0 
0 0 1665.17 0.02 0 -2336.57 1150.47 0 0 0 0 669.958 -1179.16 0 2214.65 -724.433 0 1620 0 0 0 0 0 0 0 -1746.65 0 817.82 0 0 0 0 0 0 0 0 0 0 0 0 588.626 0 -1622.29 0 0 0 0 1784.19 0 0 0 0 611.667 0 1290.86 0 -1692.79 0 0 0 0 0 0 0 0 0 0 1192.13 0 
0 0 1878.34 0 0.04 0 0 0 1032.06 0 0 0 0 -2296.14 239.189 0 0 -2482.3 -225.913 1448.94 -1599.4 0 1726.66 2325.43 0 0 0 740.608 -1188.77 450.835 0 0 0 -1079.52 0 0 139.088 0 0 0 459.685 0 -1830.27 0 0 469.604 0 0 -452.513 0 -499.664 0 0 0 0 0 0 1877.12 0 0 0 -471.282 0 0 0 0 0 0 -220.267 
0 104.755 0 188.986 0 0.06 -981.246 0 0 0 0 0 0 0 0 0 0 0 0 0 -161.977 0 2319.33 0 0 2009.87 0 -1002.46 0 2418.52 19.6081 0 0 403.684 1408.05 0 -1357.54 0 0 0 0 0 0 0 469.909 0 2435.3 0 0 0 0 -696.966 0 0 0 0 0 -472.808 295.495 0 0 0 0 0 0 0 0 0 479.98 
0 0 0 -1780.07 0 757.088 0.09 0 0 0 0 0 0 0 0 0 2204.58 0 602.969 0 0 0 0 805.918 0 -2274.16 0 0 957.595 1052.2 2100.36 2402.8 0 0 -157.704 2484.89 0 -1424.22 0 0 -913.8 0 -539.186 0 0 0 0 1350.83 -630.436 -1935.26 0 0 0 0 317.316 0 0 2290.03 0 0 0 2241.36 0 -1618.78 0 0 0 0 0 
-2453 0 0 0 0 0 0 0.05 0 0 0 0 0 0 0 0 312.433 0 2493.74 0 2058.4 0 -2413.79 0 0 -238.731 226.371 0 0 1853.31 0 -877.941 -504.7 -1075.55 0 0 0 1934.49 -2116.99 0 0 0 -306.024 0 0 0 0 2241.81 -149.159 0 0 0 0 0 0 0 1377.38 0 0 802.103 0 0 0 0 0 -1623.81 0 0 0 
0 0 600.223 0 474.181 0 0 0 0.02 1812.57 1539.12 0 0 -2258.9 0 0 0 0 815.836 618.839 0 622.959 0 0 0 0 0 0 -1145.13 0 0 0 0 0 0 2065.87 0 0 -1411.56 0 0 0 0 0 0 0 0 0 0 0 0 237.663 -103.381 0 -744.27 0 0 0 0 0 0 0 0 0 0 0 0 0 0 
-1262.32 0 0 0 0 0 0 0 1478.09 0.05 1397.37 -681.707 0 -1609.01 -823.466 0 310.297 2225.49 -2463.38 0 1572.08 0 1996.14 0 1891.61 0 0 1467.86 82.1711 0 -679.113 0 0 0 0 0 0 -1379.51 0 0 0 0 2497.86 0 0 0 0 0 0 0 0 707.343 -511.719 0 0 0 0 -398.038 0 0 0 0 0 0 0 0 1382.26 0 0 
2086.63 1126.51 1300.93 0 0 0 0 0 886.792 2007.74 0.05 303.735 0 0 985.366 870.312 0 -1999.95 0 1754.13 0 0 0 0 0 0 0 751.747 0 0 198.294 0 0 0 -521.79 2443.39 0 0 0 0 0 1578.65 0 2100.67 0 0 0 0 0 0 -2493.59 0 0 0 1660.89 594.882 0 1431.24 0 0 0 0 0 0 0 0 0 0 0 
0 0 0 -2350.31 0 0 0 0 0 624.79 802.255 0.01 0 0 2212.52 0 392.087 0 -2310.94 0 1556.83 0 0 -359.584 0 0 0 2244.1 -519.807 0 0 0 0 0 0 0 0 0 0 -1145.28 1995.83 0 0 0 0 0 0 0 0 1621.98 1471.22 0 -2187.49 1934.95 0 0 0 0 938.368 0 0 0 0 0 0 0 0 1972.95 0 
0 0 0 -751.442 0 0 0 0 0 0 0 0 0.05 247.887 -1047.78 0 0 0 0 0 0 0 0 0 0 0 423.673 1804.48 1768.01 -1351.13 0 0 -1277.12 0 2291.56 0 1635.56 0 2133.63 1188.31 2366.63 0 0 0 0 0 0 0 0 -960.036 0 0 1493.96 0 0 0 0 0 0 -935.926 0 0 1771.37 0 0 0 0 0 0 
0 0 574.587 0 1142.08 0 0 0 -2090.29 -788.98 0 0 -1365.78 0.06 0 0 0 2328.03 2413.02 0 0 2164.45 -842.54 0 0 0 0 0 459.838 0 0 0 0 0 -1485.72 0 0 0 0 0 0 0 0 0 -998.947 0 1497.62 0 0 0 2293.85 0 0 -1171.99 0 0 1279.87 0 0 0 0 0 0 0 0 0 0 0 0 
0 0 0 562.075 352.87 0 0 0 0 1387.75 765.328 75.7622 -1608.71 0 0.01 0 -251.244 0 963.088 -2047.87 -170.522 -2096.39 -1268.73 0 1374.32 0 0 0 1824.78 0 1089.13 0 0 0 0 0 0 0 0 1687.44 -210.044 481.964 0 0 0 0 0 0 0 0 0 0 0 0 0 0 0 0 523.774 1117.36 0 0 0 0 0 0 0 0 0 
0 1808.15 0 1304.74 0 0 0 0 0 0 2372.74 0 0 0 0 0.08 0 0 0 0 -440.001 0 0 -600.681 0 0 0 0 0 0 0 1496.7 0 -2434.84 2256.46 1202.35 2011.25 0 0 278.405 0 0 0 0 927.381 0 -395.749 0 0 0 0 235.832 0 0 -752.815 0 1003.98 0 0 -210.654 0 0 698.95 0 1084.7 511.567 0 0 0 
0 2226.71 0 0 0 0 -1867.05 1538.21 0 1848.89 0 1861.86 0 0 -850.627 0 0.06 0 0 2275.99 0 0 0 0 2205.8 0 0 0 800.272 0 0 0 1161.15 0 0 0 0 0 -889.233 0 0 0 0 1855.45 0 607.852 -2304.68 810.495 0 1576.05 0 0 -1917.4 0 0 -507.599 0 1636.94 -701.849 -2385.86 1302.15 0 0 -1937.39 0 0 -2286.37 0 0 
0 0 -1568.12 -2195.27 84.6126 0 0 0 0 634.098 1273.77 0 0 -1397.67 0 0 0 0.07 1407.74 0 0 0 0 0 -2230.52 0 0 -714.667 1041.67 0 -857.189 0 -2389.83 0 2455.29 1737.65 0 0 0 0 0 0 -2025.59 1491.67 0 2148.73 0 0 580.844 0 0 0 0 0 2477.11 0 0 0 2053.51 0 -1785.56 0 0 0 2045.43 0 0 0 0 
0 0 2340.54 0 -30.5948 0 -1941.21 1530.12 -812.784 1957.53 0 1830.73 0 303.583 -16.2511 0 0 1740.39 0.01 0 2018.88 0 0 0 0 0 0 1441.77 0 0 -22.3548 0 0 0 0 0 0 0 0 0 0 0 -2064.65 0 -1353.88 1420.1 0 0 0 0 1789.53 0 0 2159.87 -152.211 0 0 1108.36 0 -2175.28 -542.848 0 0 0 1841.26 0 0 0 0 
0 0 -1668.07 0 1382.26 0 0 0 1934.49 0 466.094 0 0 0 -605.716 0 2220.76 0 0 0.08 0 0 356.075 0 0 0 0 1129.41 0 1535.16 0 0 2442.78 692.999 0 1354.18 0 2118.98 -1730.48 286.492 0 -1548.28 0 -1952.5 0 654.698 0 0 0 0 -1493.65 0 0 -1589.18 0 2292.63 1880.78 432.066 0 0 0 0 0 432.981 0 0 0 2450.41 0 
0 0 0 0 -202.719 1419.49 0 2408.6 0 490.967 0 -520.417 0 0 -1761.45 379.269 0 0 1452.45 0 0.09 0 0 0 0 0 0 0 0 1383.94 0 0 0 0 0 0 0 0 0 2404.17 -250.786 -163.656 0 0 0 0 117.115 158.01 1182.21 0 0 0 0 0 0 0 0 0 0 0 0 0 0 0 0 0 0 0 0 
0 0 0 0 0 0 0 0 1586.28 0 0 0 0 -1014.36 107.807 0 0 0 0 0 0 0.03 0 0 0 0 1707.89 0 -360.195 0 0 850.78 0 0 1803.42 0 803.171 0 2114.7 0 0 0 0 0 0 0 0 0 0 0 0 0 0 0 1948.53 0 0 -1064.87 0 -226.066 0 0 -273.217 0 0 0 0 0 0 
0 0 1929 0 -2433.01 211.417 0 1238.36 0 2200.16 0 0 0 -1733.53 -667.211 0 0 0 0 2351.68 0 0 0.01 -563.143 -1328.09 0 0 0 0 0 0 0 0 0 0 0 2396.85 0 -267.876 762.886 0 0 0 0 0 0 0 0 0 0 0 0 0 0 0 0 0 -238.273 0 0 0 0 0 0 0 0 0 0 -2230.22 
0 0 0 0 771.126 0 1821.88 0 0 0 0 1810.74 0 0 0 475.86 0 0 0 0 0 0 -566.5 0.03 0 0 0 0 0 0 0 -990.555 -2207.79 0 0 0 0 0 2362.51 0 0 0 -2149.19 0 0 143.361 0 -330.744 0 0 0 612.125 0 0 0 0 0 0 0 0 0 0 0 0 343.104 0 0 0 0 
0 0 0 0 0 0 0 0 0 -1047.93 0 0 0 0 808.512 0 -687.811 1854.08 0 0 0 0 1188.16 0 0 0 -87.054 0 0 -130.238 0 0 0 1375.39 0 0 275.048 0 0 -1057.08 -507.447 0 0 0 1261.56 0 0 0 0 0 0 0 224.998 -1996.6 857.799 2190.08 0 0 0 0 0 0 0 0 0 0 0 0 131.001 
1368.22 0 505.158 -2066.94 0 924.94 2100.97 -213.248 0 0 0 0 0 0 0 0 0 0 0 0 0 0 0 0 0 0.09 0 0 0 0 0 0 0 0 2429.65 0 0 0 0 1371.43 0 0 0 0 0 0 0 0 -191.275 0 0 1897.11 1099.2 111.164 0 0 0 336.085 0 0 0 369.503 0 0 0 0 -2261.96 0 0 
0 -823.618 2179.86 0 0 0 0 -386.441 0 0 0 0 -1376 0 0 0 0 0 0 0 0 -1744.67 0 0 169.301 0 0.04 -2314.91 0 0 0 0 240.867 0 0 2001.79 0 0 0 0 1947.31 0 0 1150.47 -656.987 0 0 -305.719 -183.187 2071.06 0 0 2186.88 0 0 -773.721 0 479.369 -1199.61 0 0 2370.3 0 0 0 0 678.35 0 0 
0 0 0 -718.177 912.122 2234.18 0 0 0 292.444 1406.37 -63.097 965.835 0 0 0 0 2423.86 -410.092 -1680.27 0 0 0 0 0 0 759.682 0.02 1762.52 -539.491 0 0 0 0 0 0 0 0 0 0 -376.217 0 0 0 0 0 0 0 0 0 467.009 0 0 -1776.25 0 0 0 0 898.999 0 2239.22 0 0 0 0 0 0 0 0 
-1320.15 -1822.49 0 0 1114.61 0 -465.178 0 2476.04 156.178 0 1971.57 723.212 585.879 8.31629 0 1472.29 1750.77 0 0 0 2028.03 0 0 0 0 0 836.894 0.07 0 0 0 0 766.854 0 0 0 1196.55 794.32 0 0 0 0 1751.84 0 0 0 -971.48 0 0 0 0 1136.89 0 1826.46 0 0 0 588.015 281.762 0 0 0 0 1897.11 0 0 0 0 
-2269.59 2424.47 0 0 -944.624 1854.69 1510.44 -509.888 0 0 0 0 364.772 0 0 0 0 0 0 1307.95 2342.37 0 0 0 -2080.98 0 0 624.485 0 0.04 0 0 594.882 0 0 1873.45 0 0 -582.369 0 1035.11 0 0 0 0 0 0 0 1093.55 0 0 0 1899.24 0 0 -1599.7 0 0 1230.12 0 0 0 120.93 0 0 0 0 0 0 
302.515 0 0 0 0 1039.84 -2244.56 0 0 1341.98 2371.06 0 0 0 -837.657 0 0 1204.64 -512.177 0 0 0 0 0 0 0 0 0 0 0 0.05 0 0 0 1175.65 0 0 0 -705.817 980.178 0 0 2475.13 0 0 0 0 0 0 0 1004.14 0 -169.912 0 0 0 0 0 -715.888 0 0 -2370.75 0 0 217.368 0 0 0 0 
2481.69 0 0 0 0 0 -1343.65 -1555.91 0 0 0 0 0 0 0 1516.39 0 0 0 0 0 -1907.33 0 -620.975 0 0 0 0 0 0 0 0.06 0 0 0 0 -486.084 570.162 -1030.53 0 2096.09 2185.35 -1123.46 -1735.05 0 1030.08 0 1714.45 0 867.565 0 0 1361.66 0 0 0 -727.332 0 0 982.315 0 0 -2303.61 0 0 0 0 0 0 
1427.58 -2250.97 0 0 0 0 0 923.719 0 0 0 0 76.9829 0 0 0 2180.01 2246.24 0 1940.29 0 0 0 1510.9 0 0 2477.42 0 0 1029.62 0 0 0.02 0 0 0 0 0 0 0 0 0 -446.257 -109.485 2111.65 0 0 0 0 1457.18 0 0 -1152.3 2026.35 843.608 1875.9 0 0 -422.605 0 0 0 246.055 0 0 0 0 -2164.75 0 
0 -973.464 0 0 2451.32 -2123.55 0 -1534.7 0 0 0 0 0 0 0 2116.99 0 0 0 -1369.29 0 0 0 0 1234.24 0 0 0 1140.4 0 0 0 0 0.07 0 0 0 0 1228.29 0 0 0 0 0 -1195.18 0 0 0 0 0 940.199 0 0 0 0 0 0 2222.89 0 0 0 0 0 -456.633 0 0 341.731 0 0 
0 0 -2129.2 0 0 186.544 1599.55 0 0 0 -1311.91 0 987.655 2367.09 0 -234.458 0 1266.59 0 0 0 -2043.9 0 0 0 732.521 0 0 0 0 -915.174 0 0 0 0 0 0 0 0 0 1623.2 0 0 0 1907.94 -1521.73 0 25.8644 0 0 0 0 0 -524.384 163.045 0 0 0 0 1595.58 0 0 0 1290.25 0 0 0 0 0 
0 0 1540.5 0 0 0 -358.211 0 369.961 0 -670.415 0 0 0 0 2393.34 0 1868.57 0 -467.925 0 0 0 0 0 0 -1765.72 0 0 2410.58 0 0 0 0 0 0.09 0 0 0 -2068.93 280.694 1375.55 0 389.95 1346.86 0 0 0 0 1230.89 0 -130.848 0 0 0 -1481.44 0 0 0 0 0 0 0 0 0 0 0 0 0 
1652.2 -2339.47 0 0 -1791.06 -1613.9 0 0 0 0 0 0 1551.03 0 0 438.169 0 0 0 0 0 1693.7 2241.81 0 591.983 0 0 0 0 0 0 1219.44 0 0 0 0 0.05 0 -184.408 -2002.7 0 0 0 1179.46 0 0 0 2206.72 0 0 0 0 0 0 2362.97 0 -2391.35 0 0 0 2045.27 0 0 0 0 0 0 0 0 
-1240.2 0 -309.534 0 0 0 267.418 1337.4 0 -573.214 0 0 0 0 0 0 0 0 0 -910.596 0 0 0 0 0 0 0 0 -2398.83 0 0 1952.65 0 0 0 0 0 0.09 2467.96 0 0 0 0 -185.934 520.417 0 1916.03 0 0 0 0 0 1455.96 0 0 0 -1385.77 0 510.956 0 0 0 0 0 0 0 0 0 0 
-1032.67 1945.48 0 0 0 0 0 1620.46 1477.78 0 0 0 1059.68 0 0 0 2286.37 0 0 -1863.69 0 2144.61 1783.43 -1326.56 0 0 0 0 821.024 -2368.01 545.442 1901.99 0 1639.38 0 0 -2202.75 574.435 0.08 0 0 0 0 0 0 -2153 1142.69 0 0 0 -2472.38 -1729.1 0 2006.82 0 -2282.71 1548.13 0 -72.8629 -1059.68 628.452 0 -2434.39 0 0 0 0 -96.9726 -1683.63 
0 0 0 0 0 0 0 0 0 0 0 1648.23 -1859.11 0 1400.42 376.064 0 0 0 1995.68 2135 0 -1554.84 0 -1385.16 2305.29 0 0 0 0 -898.541 0 0 0 0 -158.773 1988.05 0 0 0.02 0 0 0 0 0 -1705.15 0 0 0 0 0 0 1753.06 0 0 0 0 -2110.13 1865.37 0 0 0 0 0 0 0 0 0 0 
0 -201.956 0 578.249 1832.26 0 1064.41 0 0 0 0 1699.96 -340.052 0 -1794.11 0 0 0 0 0 2107.84 0 0 0 -1587.34 0 -762.123 1062.43 0 2063.13 0 -594.577 0 0 17.0141 974.532 0 0 0 0 0.04 1110.34 0 0 0 0 0 0 0 892.438 0 -892.132 0 0 707.343 540.101 -549.562 0 0 0 -405.515 0 0 0 0 0 0 0 0 
0 0 1968.98 0 0 0 0 0 0 0 -458.617 0 0 0 -407.498 0 0 0 0 1171.99 998.794 0 0 0 0 0 0 0 0 0 0 -294.122 0 0 0 1637.55 0 0 0 0 1610.84 0.09 -1809.67 0 0 0 0 2209.92 0 0 2174.21 0 0 0 -288.018 -744.728 0 -1658.76 0 0 0 0 0 0 0 0 0 -478.912 0 
1177.63 -501.343 0 621.738 -14.1148 0 1811.81 1402.55 0 806.833 0 0 0 0 0 0 0 1271.94 2355.34 0 0 0 0 -26.78 0 0 0 0 0 0 165.639 482.269 2301.02 0 0 0 0 0 0 0 0 2264.85 0.09 0 1243.86 0 -1834.39 0 1136.74 0 0 0 0 0 0 400.479 0 0 0 0 0 0 0 0 0 0 0 0 0 
0 317.621 0 0 0 0 0 0 0 0 981.704 0 0 0 0 0 -1350.06 293.207 0 -40.0555 0 0 0 0 0 0 -1088.82 0 1440.24 0 0 -26.9326 1875.9 0 0 -1126.97 -790.506 11.8259 0 0 0 0 0 0 0 0 0 0 0 0 0 -1362.88 2373.81 0 0 0 0 0 0 0 0 1470 0 0 0 0 0 1384.85 0 
0 0 1049.15 0 0 -1012.22 0 0 0 0 0 0 0 -1387.75 0 2238.15 0 0 -1423.92 0 0 0 0 0 412.687 0 1967.3 0 0 0 0 0 69.9637 1121.48 2225.79 933.332 0 555.971 0 0 0 0 -394.681 0 0.06 1447.26 0 0 0 0 -1491.06 2351.22 0 1043.35 0 0 0 413.907 -326.472 0 0 0 0 0 0 153.279 1561.71 33.3415 0 
101.856 0 0 0 2363.43 0 0 0 0 0 0 0 0 0 0 0 -286.645 1744.06 953.322 2035.36 0 0 0 -979.873 0 0 0 0 0 0 0 -2133.17 0 0 -1200.67 0 0 0 1323.66 -1896.04 0 0 0 0 -873.974 0.02 0 0 0 -382.321 1976.61 -1156.12 0 0 0 1860.48 0 -1906.26 0 0 0 0 0 0 -986.129 0 0 0 0 
2480.47 0 0 0 0 -2211.29 0 0 0 0 0 0 0 1893.75 0 1805.55 1708.5 0 0 0 710.852 0 0 0 0 0 0 0 0 0 0 0 0 0 0 0 0 -216.3 -1590.55 0 0 0 1868.42 0 0 0 0.04 1952.5 0 0 0 0 0 1111.41 -1874.37 0 0 0 0 0 0 0 0 0 0 0 0 0 0 
56.3829 0 0 168.844 0 0 -149.77 49.6689 0 0 0 0 0 0 0 0 -368.892 0 0 0 1370.36 0 0 -1193.2 0 0 1019.85 0 -833.232 0 0 409.177 0 0 -1230.12 0 1453.37 0 0 0 0 1471.68 0 0 0 0 -1066.39 0.02 -58.2141 0 0 0 374.386 0 2469.63 0 0 0 0 0 0 0 2347.87 0 6.02741 0 0 0 0 
0 929.518 0 0 1668.37 0 983.383 2424.92 0 0 0 0 0 0 0 0 0 797.983 0 0 -574.282 0 0 0 0 -2064.96 11.3681 0 0 -258.11 0 0 0 0 0 0 0 0 0 0 0 0 2443.69 0 0 0 0 -2353.21 0.05 0 0 0 0 0 1370.51 277.795 0 0 0 0 -2177.42 0 0 0 0 0 0 0 0 
1783.43 1288.11 0 0 0 0 -1834.54 0 0 0 0 -2470.24 2426.91 0 0 0 1826.91 0 0 0 0 0 0 0 0 0 2064.04 0 0 0 0 1867.66 -2424.62 0 0 -1065.63 0 0 0 0 -2081.74 0 0 0 0 1081.65 0 0 0 0.04 0 -249.26 0 0 0 0 1161.31 1399.2 0 0 0 0 474.487 0 0 0 0 0 1990.65 
0 0 2025.13 0 37.4615 0 0 0 0 0 1085.47 -972.854 0 -51.3474 0 0 0 0 -1260.64 1173.97 0 0 0 0 0 0 0 -2326.5 0 0 1695.07 0 0 -923.261 0 0 0 0 401.547 0 0 1161.76 0 0 1454.74 -2265.77 0 0 0 0 0.05 0 0 0 0 0 2027.57 0 0 0 -1491.36 1944.87 0 0 -1714.15 0 0 0 0 
1593.14 0 -2.67037 0 0 -673.772 0 0 338.832 -696.661 0 0 0 0 0 -147.786 0 0 0 0 0 0 0 621.281 0 1389.43 0 0 0 0 0 0 0 0 0 1037.86 0 0 -1494.57 0 627.689 0 0 -1068.07 652.409 -2059.47 0 0 0 -577.029 0 0.01 0 294.122 0 1823.1 0 0 0 0 440.916 0 0 0 0 0 591.678 0 0 
0 0 0 1986.98 0 0 0 0 1451.84 -2341 0 1857.89 164.113 0 0 0 -462.584 0 0 0 0 0 0 0 1725.44 -2201.99 -1068.99 0 1388.82 -302.973 -761.971 2250.05 976.821 0 0 0 0 597.324 0 1627.02 0 0 0 -88.4274 0 0 0 1478.55 0 0 0 0 0.08 0 0 0 0 0 0 0 0 0 0 0 0 1508.15 0 0 0 
0 0 2190.24 0 0 0 0 0 0 0 0 -117.115 0 351.497 0 0 0 0 1297.57 2039.93 0 0 0 0 1536.99 -1531.95 0 2143.7 0 0 0 0 -1897.11 0 2360.99 0 0 0 -425.504 0 0 0 0 0 1560.49 0 -719.55 0 0 0 0 583.743 0 0.07 298.09 -628.91 0 0 0 122.761 0 0 0 64.7755 0 -340.205 0 0 0 
0 0 0 -562.838 0 0 1227.23 0 -1681.95 0 1425.29 0 0 0 0 2068.01 0 1558.35 1911.76 0 0 -806.07 0 0 -1179.62 0 0 0 -535.829 0 0 0 2137.59 0 -1917.86 0 -759.224 0 0 0 -1285.06 -1218.99 0 0 0 0 -801.645 1981.95 2380.21 0 0 0 0 2098.68 0.07 0 1506.01 0 194.479 0 0 0 0 0 0 0 0 0 -600.986 
0 0 0 0 0 0 0 0 0 0 1502.66 0 0 0 0 0 1121.94 0 0 1015.58 0 0 0 0 2464.14 0 2152.24 0 0 -89.0378 0 0 -2366.79 0 0 2489.47 0 0 1073.41 0 -1504.33 1984.69 255.058 0 0 -1649.14 0 0 1136.28 0 0 -53.7889 0 -282.83 0 0 -1977.68 589.084 0 -1284.6 0 2081.9 0 0 0 389.645 0 0 0 
0 0 0 -1063.65 0 0 0 850.932 0 0 0 0 0 -1219.14 0 2047.26 0 0 0 -1671.73 0 0 0 0 0 0 0 0 0 0 0 439.848 0 0 0 0 -886.486 554.598 791.421 0 -511.414 0 0 0 0 0 0 0 0 -565.279 556.124 0 0 0 1999.5 2456.51 0.01 0 274.59 -369.808 0 0 0 0 0 0 0 0 1120.87 
0 0 -261.467 0 1712.47 -202.872 -51.3474 0 0 1886.12 2492.37 0 0 0 0 0 463.195 0 -1926.71 723.365 0 -2398.22 760.14 0 0 -101.55 2197.56 0 0 0 0 0 0 1769.23 0 0 0 0 0 540.406 0 -1477.94 0 0 284.661 -2263.63 0 0 0 1258.96 0 0 0 0 0 -472.808 0 0.07 0 0 0 0 0 0 0 0 0 0 0 
0 -1023.51 -2114.7 0 0 983.688 0 0 0 0 0 1960.74 0 0 -1670.35 0 2023.15 -324.946 0 0 0 0 0 0 0 0 -597.476 -535.829 2469.94 1500.06 1259.58 0 1303.83 0 0 0 0 1370.82 1793.04 -806.528 0 0 0 0 -131.764 0 0 0 0 0 0 0 0 0 -1446.04 0 -2062.21 0 0 0 0 0 0 0 178.152 1077.84 0 2476.81 0 
-756.478 0 0 0 0 0 0 2404.32 0 0 0 0 2168.11 0 1098.74 2012.16 -1057.39 0 -1546.45 0 0 776.467 0 0 0 0 0 0 1649.3 0 0 1957.99 0 0 2225.18 0 0 0 2266.38 0 0 0 0 0 0 0 0 0 0 0 0 0 0 -251.701 0 1984.85 -1151.23 0 0 0.07 447.935 0 0 -2147.05 0 0 0 0 0 
0 0 104.907 0 0 0 0 0 0 0 0 0 0 0 0 0 -1958.3 -438.78 1976.15 0 0 0 0 0 0 0 0 1717.81 0 0 0 0 0 0 0 0 601.596 0 828.959 0 -524.842 0 0 0 0 0 0 0 -1526.46 0 1930.22 -280.236 0 0 0 0 0 0 0 472.808 0.01 0 0 0 -727.485 0 0 0 876.72 
0 -649.205 0 0 -2332.3 0 444.731 0 0 0 0 0 0 0 0 0 0 0 0 0 0 0 0 0 0 1627.17 2312.46 0 0 0 2319.79 0 0 0 0 0 0 0 0 0 0 0 0 -1945.48 0 0 0 0 0 0 313.501 0 0 0 0 -964.156 0 0 0 0 0 0.03 0 0 0 0 0 452.666 846.965 
-572.451 0 1605.2 0 0 0 0 0 0 0 0 0 -474.029 0 0 1498.38 0 0 0 0 0 1912.98 0 0 0 0 0 0 0 2225.94 0 2343.44 110.858 0 0 0 0 0 2076.1 0 0 0 0 0 0 0 0 1261.71 0 1048.23 0 0 0 0 0 0 0 0 0 0 0 0 0.06 0 0 0 0 0 0 
0 0 0 0 0 0 -780.74 0 0 0 0 0 0 0 0 0 1728.95 0 0 -264.214 0 0 0 0 0 0 0 0 0 0 0 0 0 1155.51 -870.006 0 0 0 0 0 0 0 0 0 0 0 0 0 0 0 0 0 0 483.795 0 0 0 0 0 1178.4 0 0 0 0.07 0 0 1267.36 0 0 
0 0 0 0 0 0 0 0 0 0 0 0 0 0 0 133.747 0 2207.94 1322.6 0 0 0 0 2019.49 0 0 0 0 1858.35 0 -1437.8 0 0 0 0 0 0 0 0 0 0 0 0 0 0 -100.024 0 -1869.33 0 0 103.076 0 0 0 0 0 0 0 2160.48 0 -1693.4 0 0 0 0.09 0 0 0 0 
0 0 0 0 0 0 0 -342.799 0 0 0 0 0 0 0 1850.57 0 0 0 0 0 0 0 0 0 0 0 0 0 0 0 0 0 0 0 0 0 0 0 0 0 0 0 0 2316.89 0 0 0 0 0 0 0 -1658.76 -1047.01 0 -1468.32 0 0 726.569 0 0 0 0 0 0 0 0 0 0 
0 0 0 0 0 0 0 0 0 385.983 0 0 0 0 0 0 -2053.06 0 0 0 0 0 0 0 0 1127.74 1928.69 0 0 0 0 0 0 -2045.73 0 0 0 0 0 0 0 0 0 0 -278.863 0 0 0 0 0 0 2304.07 0 0 0 0 0 0 0 0 0 0 0 1845.99 0 0 0.07 0 0 
0 0 0 -251.244 0 0 0 0 0 0 0 1784.04 0 0 0 0 0 0 0 -606.632 0 0 0 0 0 0 0 0 0 0 0 0 -1579.26 0 0 0 0 0 2270.2 0 0 1437.04 0 -1807.54 -2499.85 0 0 0 0 0 0 0 0 0 0 0 0 0 2360.99 0 0 403.836 0 0 0 0 0 0.01 0 
0 0 0 0 1287.5 -1917.71 0 0 0 0 0 0 0 0 0 0 0 0 0 0 0 0 2193.29 0 -1674.63 0 0 0 0 0 0 0 0 0 0 0 0 0 -1106.37 0 0 0 0 0 0 0 0 0 0 1060.44 0 0 0 0 386.593 0 294.58 0 0 0 501.953 1005.51 0 0 0 0 0 0 0.07 
