*Vertices 52
*Matrix 
0 0 0 790.963 0 0 0 0 -937.91 2061.45 -2097.61 1119.04 0 -840.098 777.078 0 0 0 0 0 0 0 -94.2259 1470.46 0 0 0 -2146.9 0 1366.54 438.017 0 0 0 996.658 0 -151.448 0 0 0 0 0 0 0 0 2063.59 1954.79 2116.23 0 0 0 0 
0 0.03 0 1969.28 -1346.25 0 0 0 0 1415.52 0 0 -1311.3 1889.48 0 0 0 0 1665.47 0 0 0 -1682.26 0 0 0 0 0 0 0 0 0 0 0 0 0 0 1929.76 -945.54 -664.312 0 907.544 0 -907.849 0 0 0 0 1127.74 0 606.326 0 
0 0 0.08 0 0 -561.159 0 -547.884 1624.58 0 -1832.87 240.104 0 0 0 0 0 0 -776.467 0 0 0 0 0 0 0 0 -1878.19 0 0 1877.57 0 2321.77 1009.93 473.724 0 0 2058.7 0 1027.63 0 0 688.116 0 0 -950.88 0 0 0 0 0 0 
471.129 -1560.34 0 0.04 0 0 0 2319.64 1671.58 0 0 -2076.71 1266.29 0 -1102.1 0 0 0 0 -825.297 0 2355.95 -1189.23 0 0 -1912.52 2438.96 0 0 0 0 0 0 -1639.68 0 2417.14 0 0 -1517.15 0 0 1390.35 0 78.814 0 0 0 0 0 -332.728 0 0 
0 550.478 0 0 0 0 0 0 0 0 1692.18 0 0 0 0 0 0 0 -320.978 0 0 0 910.901 -283.746 0 -415.128 -292.596 0 0 0 0 0 0 0 1368.07 0 -1622.59 0 -1891.77 0 0 0 0 0 0 0 0 975.753 0 0 0 0 
0 0 -1546.91 0 0 0.05 -1391.72 0 0 0 0 0 0 0 0 2331.84 0 0 0 0 1581.55 -374.081 0 0 66.7592 0 0 0 0 -1487.85 0 0 0 646.001 0 0 1692.79 1718.57 0 0 0 0 0 565.279 0 0 0 0 739.235 -287.408 0 715.583 
0 0 0 0 0 866.955 0.03 1461.91 0 0 0 0 0 1220.36 0 0 0 0 0 0 0 0 0 0 0 0 0 -2229.3 0 1641.51 631.962 0 0 0 0 0 0 0 0 0 2421.57 -240.41 0 -928.144 0 0 0 0 0 10.6052 -1861.25 0 
0 0 2085.86 -2239.98 0 0 2013.38 0.09 0 0 -174.947 0 -795.389 0 0 0 -1529.97 0 2353.36 0 0 0 0 0 0 0 0 299.158 0 0 0 -1401.18 2106.92 -493.408 62.4866 0 2293.69 27.3904 0 0 0 0 0 0 0 0 -2464.29 0 0 0 0 0 
1406.98 0 -733.894 1903.82 0 0 0 0 0.07 1666.69 0 0 0 1132.77 0 0 -798.593 2254.63 587.863 1802.04 0 0 0 0 0 0 0 0 0 0 0 0 0 0 0 0 0 0 0 0 0 -1879.71 -2342.98 0 -1849.19 0 0 -2416.53 0 0 2287.29 2454.07 
1236.38 1114.31 0 0 0 0 0 0 2338.4 0.05 0 0 0 0 0 0 0 0 0 2163.38 645.695 1560.49 0 0 0 0 0 0 0 -1625.34 0 0 -295.343 2287.9 -1797.92 0 0 0 -1840.95 0 0 0 1969.59 0 0 0 0 -936.995 31.0526 0 0 0 
2273.71 0 -1820.2 0 942.183 0 0 2424.31 0 0 0.02 0 133.9 0 0 0 0 0 0 1766.34 0 -1512.12 0 385.22 0 0 1567.05 0 0 0 0 0 1870.56 0 0 0 0 0 0 0 -1756.26 409.329 0 0 1460.84 2068.01 0 0 0 0 0 0 
1916.03 0 -1177.79 723.67 0 0 0 0 0 0 0 0.01 0 0 0 2337.79 0 0 0 -527.436 0 0 308.008 364.467 0 185.781 -532.472 -18.3874 0 0 0 0 0 1263.39 0 0 0 0 0 0 0 0 0 0 -497.833 0 0 1217.61 0 -2325.28 0 0 
0 473.113 0 -1219.29 0 0 0 2316.28 0 0 1541.87 0 0.09 0 0 0 -1488.62 -2041.61 0 0 0 0 789.59 0 2285.3 -983.993 0 -1380.73 0 1691.72 0 0 -26.4748 241.325 0 0 0 -2209.92 1049.15 1193.5 -511.109 0 0 125.507 0 0 0 0 1805.86 0 -354.396 0 
-1696.3 737.251 0 0 0 0 1716.9 0 -2143.24 0 0 0 0 0.06 743.355 0 0 0 0 0 0 0 0 496.46 -196.615 0 1130.94 1851.79 0 0 0 0 0 0 924.94 0 0 0 0 0 -60.3504 2110.43 -1257.74 0 0 0 -1860.64 0 0 0 0 0 
-2350.76 0 0 -2064.96 0 0 0 0 0 0 0 0 0 -314.264 0.06 0 1072.34 1726.81 2179.86 0 -1537.9 838.42 1034.81 0 0 0 0 0 0 0 0 0 0 1460.54 0 0 0 1652.04 0 0 0 502.411 0 0 0 164.724 -1007.8 0 0 0 -1545.23 0 
0 0 0 0 0 1939.38 0 0 0 0 0 2034.44 0 0 0 0.08 314.264 -1710.79 -706.732 1117.97 0 0 0 0 0 0 0 0 204.398 0 1480.22 0 0 0 -1988.51 0 0 1768.93 0 0 873.516 0 39.5978 -1261.41 0 0 0 -1904.89 -245.445 1695.23 0 0 
0 0 0 0 0 0 0 -1649.3 1092.18 0 0 0 2457.27 0 1653.72 -79.7296 0.08 0 0 0 0 0 0 0 2326.81 0 -919.446 0 668.889 0 -1217.31 0 0 0 -42.497 -1034.96 0 0 0 2013.08 2294.46 0 1143.15 0 0 0 0 0 0 -284.356 0 0 
0 0 0 0 0 0 0 0 2236.63 0 0 0 2041.31 0 2041.31 2441.56 0 0.06 1860.64 0 0 0 -1395.84 0 0 2380.21 0 0 0 0 0 0 -1072.95 0 0 0 0 0 -52.8733 -1713.69 0 412.992 0 0 0 0 0 0 0 0 0 0 
0 -245.903 -118.793 0 -2154.23 0 0 -313.807 -710.089 0 0 0 0 0 1863.23 2238.76 0 -2489.47 0.04 0 -1754.59 0 0 2192.07 0 1465.42 0 701.392 0 0 0 0 0 395.138 0 0 0 0 618.686 0 0 0 0 0 -1524.78 0 490.051 2500 -1905.8 -855.358 0 0 
0 0 0 -901.746 0 0 0 0 2079 534.761 1730.17 -1436.43 0 0 0 1265.68 0 0 0 0.03 0 -1650.06 0 0 0 140.004 1201.9 1471.68 0 0 0 0 0 0 0 0 -576.266 0 -978.042 0 1988.2 0 0 0 0 1317.1 0 1955.85 0 0 0 0 
0 0 0 0 0 1640.75 0 0 0 196.921 0 0 0 0 1932.36 0 0 0 2040.7 0 0.09 942.183 0 0 0 0 0 0 0 0 0 0 0 0 -1231.19 0 0 178.61 705.206 0 0 0 0 0 0 0 -1902.75 0 0 0 0 2473.75 
0 0 0 -2039.17 0 855.663 0 0 0 -1233.79 -892.285 0 0 0 -2181.69 0 0 0 0 -2130.27 -169.454 0.03 0 2263.02 981.399 0 0 0 0 0 0 0 0 0 0 0 0 0 2499.08 0 0 0 0 0 1385.31 0 0 1772.9 -795.846 0 0 0 
1355.71 2039.17 0 -64.1652 2323.76 0 0 0 0 0 0 2228.23 -1513.03 0 -312.586 0 0 -1345.33 0 0 0 0 0.08 0 811.106 271.233 0 -12.5889 0 0 0 -1682.71 0 0 -1007.49 0 0 0 0 0 0 0 0 0 -1822.03 0 0 2364.65 0 1633.73 0 0 
1758.1 0 0 0 1575.14 0 0 0 0 0 756.478 577.639 0 -1950.67 0 0 0 0 403.378 0 0 -354.854 0 0.08 0 0 0 0 0 0 150.227 0 0 0 0 0 0 -1105.76 0 0 2150.72 0 0 0 0 0 0 0 0 0 0 0 
0 0 0 0 0 249.565 0 0 0 0 0 0 1741.61 -201.651 0 0 1373.26 0 0 0 0 2101.89 -1970.5 0 0.06 0 0 0 0 0 0 0 -1214.26 0 2172.84 0 0 0 0 0 0 0 0 262.383 0 966.903 1711.71 0 -74.9992 0 0 0 
0 0 0 1183.43 1440.24 0 0 0 0 0 0 2306.82 424.741 0 0 0 0 2055.65 2054.73 2485.35 0 0 -1345.03 0 0 0.01 40.9711 0 0 0 0 0 -393.307 0 71.7948 1648.53 85.9859 0 1225.85 0 0 0 0 0 0 -1717.81 0 0 -99.8718 1780.07 0 0 
0 0 0 -2118.52 -917.768 0 0 0 0 0 2186.27 -1424.53 0 -705.206 0 0 2398.53 0 0 2402.8 0 0 0 0 0 1456.11 0.04 0 0 2164.45 0 0 -956.526 0 0 0 0 0 2393.64 0 -580.691 2113.79 684.301 0 0 0 0 2147.36 0 2057.48 0 1731.54 
1354.03 0 2228.39 0 0 0 -25.4067 749.001 0 0 0 1296.81 -913.19 -936.689 0 0 0 0 -265.435 1409.42 0 0 -1408.51 0 0 0 0 0.08 -2185.2 0 0 0 0 1127.89 0 0 0 0 0 0 0 0 0 0 0 673.772 0 0 0 0 85.0703 0 
0 0 0 0 0 0 0 0 0 0 0 0 0 0 0 -2285 -75.3044 0 0 0 0 0 0 0 0 0 0 969.497 0.02 0 0 2279.35 0 0 1863.69 0 0 0 0 0 0 0 0 0 0 0 0 0 -715.735 449.461 1179.92 0 
-286.187 0 0 0 0 -276.727 1333.89 0 0 1553.77 0 0 -18.8452 0 0 0 0 0 0 0 0 0 0 0 0 0 1212.42 0 0 0.05 -1773.2 -10.6052 0 0 0 0 0 0 0 0 0 0 0 0 2203.36 2312.77 2270.65 -997.879 0 0 0 0 
-630.894 0 -1068.68 0 0 0 2251.73 0 0 0 0 0 0 0 0 2179.1 833.995 0 0 0 0 0 0 -201.193 0 0 0 0 0 -43.5652 0.07 0 -406.888 0 0 0 1482.36 0 0 0 0 781.961 0 0 0 -1075.85 2125.84 0 -2067.86 1782.51 0 0 
0 0 0 0 0 0 0 -1162.68 0 0 0 0 0 0 0 0 0 0 0 0 0 0 1174.89 0 0 0 0 0 190.512 1243.55 0 0.01 0 0 0 0 1015.58 0 -47.9904 794.626 0 0 -723.975 -914.869 0 0 0 0 -486.236 0 0 0 
0 0 2285.76 0 0 0 0 1609.78 0 -213.248 686.132 0 -1285.67 0 0 0 0 1765.27 0 0 0 0 0 0 746.406 907.544 2177.42 0 0 0 -113.758 0 0.03 0 0 0 0 0 1001.54 -354.244 0 0 1929.46 0 0 0 0 0 0 0 0 0 
0 0 -1336.63 1171.99 0 -2185.96 0 2109.97 0 543.306 0 -688.726 -2423.86 0 -1029.01 0 0 0 1461.46 0 0 0 0 0 0 0 0 1995.22 0 0 0 0 0 0.08 0 219.657 -2186.73 0 0 0 0 -562.075 2013.69 -134.663 0 0 1886.12 -775.857 2252.8 0 0 0 
2308.95 0 598.849 0 941.42 0 0 284.051 0 1650.82 0 0 0 -202.109 0 -432.218 1043.2 0 0 0 -243.919 0 414.212 0 -1000.17 309.687 0 0 -2359.77 0 0 0 0 0 0.06 0 0 0 0 2340.69 0 0 2108.45 0 -728.706 0 0 0 754.494 893.201 0 0 
0 0 0 214.774 0 0 0 0 0 0 0 0 0 0 0 0 -95.294 0 0 0 0 0 0 0 0 652.715 0 0 0 0 0 0 0 496.46 0 0.03 0 465.941 0 -1697.52 0 0 0 0 0 0 1458.56 674.841 0 0 1859.11 0 
-858.715 0 0 0 1230.12 -2147.66 0 -548.494 0 0 0 0 0 0 0 0 0 0 0 738.472 0 0 0 0 0 -309.992 0 0 0 0 261.467 1374.94 0 239.494 0 0 0.02 0 0 0 2332.76 0 0 0 215.384 0 0 1100.12 0 0 0 0 
0 -459.532 1860.64 0 0 -241.63 0 646.153 0 0 0 0 2453.61 0 1519.44 -2286.07 0 0 0 0 -264.672 0 0 898.541 0 0 0 0 0 0 0 0 0 0 0 -583.743 0 0.01 -1644.41 2215.72 0 0 0 0 241.63 0 0 0 0 0 0 0 
0 2253.11 0 -923.566 170.064 0 0 0 0 -899.304 0 0 -2265.77 0 0 0 0 261.773 1661.2 1933.27 -1433.68 198.752 0 0 0 992.538 238.426 0 0 0 0 -2274.32 871.38 0 0 0 0 1197.01 0.05 0 0 0 0 0 0 1256.68 0 0 0 0 0 0 
0 -429.167 -333.033 0 0 0 0 0 0 0 0 0 1476.26 0 0 0 898.389 1915.57 0 0 0 0 0 0 0 0 0 0 0 0 0 -2163.53 -1392.94 0 1437.8 1653.26 0 1649.91 0 0.07 -1219.6 0 0 0 0 0 0 2059.92 -684.912 2346.49 0 0 
0 0 0 0 0 0 1984.54 0 0 0 1649.14 0 1323.21 257.347 0 94.9889 -1643.5 0 0 599.002 0 0 0 1823.1 0 0 -432.524 0 0 0 0 0 0 0 0 0 1135.82 0 0 -2427.21 0.01 0 0 0 -1410.18 0 -783.792 1721.93 0 1791.36 0 0 
0 221.793 0 1577.43 0 0 474.487 0 2041.76 0 1233.18 0 0 563.753 1036.03 0 0 1308.56 0 0 0 0 0 0 0 0 574.282 0 0 0 1459.62 0 0 1171.53 0 0 0 0 0 0 0 0.01 0 0 -1992.02 0 0 -1012.38 0 0 1337.24 0 
0 0 184.256 0 0 0 0 0 -924.94 1612.52 0 0 0 -2492.22 0 2268.52 1592.84 0 0 0 0 0 0 0 0 0 -206.381 0 0 0 0 -101.703 1941.36 -1420.87 -770.821 0 0 0 0 0 0 0 0.06 0 446.257 0 0 0 2491 0 0 0 
0 851.39 0 -961.715 0 2222.89 43.7178 0 0 0 0 0 -1594.67 0 0 600.681 0 0 0 0 0 0 0 0 1876.05 0 0 0 0 0 0 236.747 0 653.935 0 0 0 0 0 0 0 0 0 0.01 0 0 1314.2 0 0 0 0 0 
0 0 0 0 0 0 0 0 -1462.07 0 2177.57 -134.816 0 0 0 0 0 0 -1930.98 0 0 1257.44 2496.19 0 0 0 0 0 0 920.82 0 0 0 0 -329.218 0 1201.9 -2252.49 0 0 1177.02 1302.61 1546.3 0 0.04 0 0 -451.75 0 0 0 0 
585.574 0 2374.57 0 0 0 0 0 0 0 2379.15 0 0 0 1242.64 0 0 0 0 1213.8 0 0 0 0 76.8303 -2411.8 0 1209.07 0 2020.55 1186.33 0 0 0 0 0 0 0 421.842 0 0 0 0 0 0 0 1135.67 0 0 604.495 0 0 
2318.41 0 0 0 0 0 0 151.753 0 0 0 0 0 1689.43 1407.9 0 0 0 2058.24 0 1587.65 0 0 0 2042.99 0 0 0 0 861.614 1580.78 0 0 1037.71 0 -2178.49 0 0 0 0 1409.57 0 0 -2026.05 0 2374.87 0.03 0 0 0 0 0 
1925.64 0 0 0 141.377 0 0 0 22.0496 -1606.11 0 1970.5 0 0 0 -1084.86 0 0 379.574 2213.89 0 -177.389 -699.561 0 0 0 1667.3 0 0 -89.0378 0 0 0 1292.08 0 2391.81 1721.93 0 0 1352.5 -1683.02 730.232 0 0 1556.52 0 0 0.03 0 0 859.783 0 
0 2430.72 0 0 0 924.635 0 0 0 2250.97 0 0 -690.405 0 0 -1159.63 0 0 10.6052 0 0 -2021.32 0 0 110.553 681.097 0 0 282.678 0 -1587.19 2401.12 0 1622.29 2232.51 0 0 0 0 986.282 0 0 883.587 0 0 0 0 0 0.03 2330.62 0 0 
0 0 0 2112.87 0 2140.49 -1642.58 0 0 0 0 1097.22 0 0 0 1451.54 -1867.81 0 2013.69 0 0 0 -878.094 0 0 1340.14 -313.807 0 -2406.77 0 -1388.52 0 0 0 140.614 0 0 0 0 -211.722 -897.931 0 0 0 0 1721.63 0 0 1453.06 0.08 0 0 
0 -1069.44 0 0 0 0 -2140.19 0 -670.415 0 0 0 1790.14 0 2015.52 0 0 0 0 0 0 0 0 0 0 0 0 -1933.88 138.936 0 0 0 0 0 0 -435.881 0 0 0 0 0 1009.78 0 0 0 0 0 -382.778 0 0 0.04 2328.33 
0 0 0 0 0 -1584.75 0 0 2186.73 0 0 0 0 0 0 0 0 0 0 0 1807.84 0 0 0 0 0 142.598 0 0 0 0 0 0 0 0 0 0 0 0 0 0 0 0 0 0 0 0 0 0 0 2036.12 0 
