*Vertices 53
*Matrix 
0 0 0 0 0 0 0 0 401.242 0 -985.061 0 0 0 0 0 -1102.56 0 0 0 2461.24 0 0 0 0 1401.79 0 2169.48 152.974 0 0 0 0 977.889 0 0 0 0 0 0 0 0 1860.18 0 0 0 0 0 0 0 0 0 0 
0 0.05 0 2430.11 0 0 0 1269.95 -2064.04 0 0 0 -385.678 0 0 0 0 0 1357.39 0 0 0 2017.65 0 0 0 2109.21 0 0 2135.76 0 0 0 0 0 301.447 0 870.312 2291.1 -1668.68 0 0 0 0 0 0 0 0 0 0 0 0 0 
0 0 0.05 0 1978.29 0 -997.726 0 0 -1158.25 0 0 0 2038.41 0 590.304 0 -1980.73 0 0 406.583 874.279 0 0 0 0 0 0 0 0 -788.522 2483.98 0 0 0 0 0 0 2300.71 0 0 -810.953 0 -2176.81 -2088.46 1916.64 0 0 0 0 0 0 -43.8704 
0 2415.31 0 0.09 0 0 -931.806 0 1565.98 0 0 0 0 0 0 0 0 0 0 -126.881 0 0 0 -2391.05 1663.18 0 0 0 1947.77 0 -1030.84 0 2217.4 0 0 -358.821 0 0 0 0 461.516 0 0 -781.961 1262.47 0 0 0 0 0 0 0 0 
0 0 -1905.5 0 0.07 0 0 0 0 1448.64 0 366.298 0 0 0 -2297.97 0 2371.36 0 -918.836 1744.06 2243.8 0 1562.93 0 0 -265.587 0 0 1259.27 0 0 0 105.67 0 0 0 0 0 0 0 0 1969.28 -689.795 0 0 2492.37 0 0 0 0 0 0 
0 0 0 0 0 0.09 0 0 -117.267 0 0 0 1804.79 0 0 -2433.93 0 0 0 0 0 0 1022.14 2265.47 0 0 0 0 1450.62 1497.47 0 -1257.29 0 0 0 0 0 0 -870.006 0 0 -600.833 0 1360.13 0 0 0 0 0 0 0 0 0 
0 0 -1021.38 1923.35 0 0 0 1190.45 0 1188.47 0 0 0 0 326.167 0 0 0 -1601.84 45.2437 0 0 0 208.06 -1027.48 -598.239 0 0 0 0 0 0 -2223.35 0 2361.29 0 0 0 0 0 0 0 0 0 0 0 0 0 0 0 0 0 0 
0 1469.54 0 0 0 0 2000.41 0.01 0 0 0 0 0 -369.808 0 -2252.34 -1379.51 0 0 0 0 0 0 0 585.574 0 0 0 0 0 0 0 0 0 0 -1318.48 1780.83 0 2067.55 0 0 0 0 0 0 0 0 0 0 0 0 0 0 
879.925 -733.131 0 -120.777 0 -774.026 0 0 0.08 0 0 0 0 2108.45 -579.623 1583.38 68.7429 0 0 1876.66 2046.19 0 0 0 0 0 0 0 0 0 -2411.65 0 0 0 0 0 -1122.55 0 0 0 0 0 1002.46 2245.02 0 0 0 0 0 1326.72 0 0 0 
0 0 -529.725 0 1983.17 0 25.5593 0 0 0.05 0 0 0 0 0 0 0 31.8155 0 0 0 0 0 0 0 0 0 0 0 0 0 0 1214.26 0 0 0 0 0 0 0 1201.44 0 0 0 0 0 0 0 0 -1976.76 0 0 0 
2348.32 0 0 0 0 0 0 0 0 0 0.02 0 1917.71 0 0 0 0 0 0 0 0 0 0 1209.98 -1544.31 -45.5489 -2006.21 0 0 0 0 -308.008 0 -884.045 -1163.14 0 0 1584.29 0 513.703 0 0 950.728 -2091.05 0 0 0 0 0 0 0 0 0 
0 0 0 0 1423.15 0 0 0 0 0 0 0.01 0 -43.7178 0 0 0 0 -1549.96 0 2113.03 589.084 0 0 0 1457.79 0 0 0 0 0 0 2059.47 -455.718 -1557.44 0 0 60.0452 0 1995.68 -90.4111 0 0 0 0 0 2047.26 1000.02 0 0 0 0 0 
0 2412.56 0 0 0 -366.756 0 0 0 0 2097.77 0 0.05 0 0 0 -2038.71 0 0 885.113 0 0 0 0 0 0 -280.389 0 1226.77 0 0 0 0 0 -83.3918 0 -238.731 1262.17 0 0 0 0 0 -696.966 0 0 0 0 0 0 0 0 0 
0 0 -2492.98 0 0 0 0 -2339.01 342.189 0 0 1987.75 0 0.07 0 0 0 0 0 0 1255.46 2100.05 0 0 0 0 0 1072.04 -348.598 0 0 945.54 1718.12 2327.42 0 -1138.11 -1359.52 0 0 0 0 0 0 0 0 0 0 0 0 0 2457.43 0 1061.05 
0 0 0 0 0 0 -1524.17 0 -713.294 0 0 0 0 0 0.09 0 -1066.55 0 0 0 0 0 0 0 0 1022.45 1984.85 1861.71 0 449.614 0 0 -63.097 475.707 0 0 -1629.76 1913.59 0 -25.1015 0 0 0 0 0 0 0 0 0 0 1462.98 0 0 
0 0 -749.306 0 2435.45 -1311.61 0 465.178 1132.77 0 0 0 0 0 0 0.04 0 0 0 0 0 0 569.247 0 0 0 0 264.672 0 0 0 -409.177 0 0 1894.06 1973.25 0 0 0 0 0 343.104 -309.992 0 0 -1873.15 0 0 0 0 0 0 -1656.62 
-707.038 0 0 0 0 0 0 -201.346 2248.22 0 0 0 2475.89 0 -1332.82 0 0.05 -1336.18 0 401.547 0 0 1786.02 0 -1236.69 308.618 743.049 1530.27 -2340.85 0 0 0 2130.88 -2344.36 531.251 0 0 0 -306.33 0 0 0 0 0 0 0 0 2169.48 976.516 0 0 0 0 
0 0 -2319.94 0 2429.04 0 0 0 0 -501.343 0 0 0 0 0 0 1403.78 0.01 0 0 0 0 0 0 0 0 0 1455.81 0 -377.895 -44.7859 -1516.69 -1727.42 0 821.635 0 0 0 951.338 0 0 0 0 0 0 0 0 0 0 0 0 0 0 
0 741.829 0 0 0 0 19.7607 0 0 0 0 354.549 0 0 0 0 0 0 0.06 0 0 0 0 0 0 0 1829.51 2121.88 932.417 0 0 0 0 0 0 0 0 0 2424.31 0 0 0 1844.61 0 0 0 453.734 0 0 0 2418.97 0 0 
0 0 0 -150.685 1865.83 0 292.291 0 1333.89 0 0 0 1874.07 0 0 0 -510.956 0 0 0.01 0 0 158.467 254.753 0 2118.37 0 0 0 1212.88 0 0 0 -302.82 0 0 0 0 0 0 0 0 536.897 772.805 0 0 0 0 -896.863 874.584 0 -911.664 0 
452.971 0 1390.35 0 2412.41 0 0 0 -1530.43 0 0 968.581 0 2335.66 0 0 0 0 0 0 0.01 1523.1 0 -904.035 0 0 0 -410.245 0 774.636 0 0 0 0 -1296.2 1799.75 0 1155.05 -488.678 -1122.55 0 0 0 0 0 0 856.273 0 -1635.41 756.478 0 -2458.95 0 
0 0 2306.97 0 1322.6 0 0 0 0 0 0 -289.087 0 568.026 0 0 0 0 0 0 409.177 0.06 0 1323.97 0 0 0 1845.84 0 0 717.261 0 0 0 0 0 846.049 0 589.084 0 1613.44 -2285.45 0 -462.127 0 0 0 0 0 0 -947.676 0 0 
0 534.303 0 0 0 403.836 0 0 0 0 0 0 0 0 0 -354.549 -1.29704 0 0 -838.725 0 0 0.09 0 0 0 1952.96 0 -2044.21 0 0 0 0 0 0 -221.793 0 926.008 0 0 1785.56 0 -1288.72 817.82 0 0 0 0 0 0 0 0 0 
0 0 0 -1288.26 2397.46 1869.18 2367.85 0 0 0 -1600.62 0 0 0 0 0 0 0 0 2350.76 2426.91 -1575.44 0 0.09 0 0 2073.35 0 0 0 0 279.473 -2000.72 0 -771.889 0 0 0 0 0 0 0 0 -1287.8 0 0 0 0 0 0 0 2355.19 0 
0 0 0 1325.65 0 0 1222.19 -2317.96 0 0 1173.97 0 0 0 0 0 -2059.77 0 0 0 0 0 0 0 0 0 0 0 1183.58 0 -465.941 0 0 366.909 0 0 2158.35 106.891 0 1790.9 0 0 0 0 0 0 0 0 0 0 0 0 0 
-1694.16 0 0 0 0 0 730.232 0 0 0 1207.85 1658.15 0 0 2409.36 0 779.977 0 0 -481.658 0 0 0 0 0 0.01 0 0 -1551.33 0 210.196 0 -1120.26 0 0 0 0 0 0 0 -27.6955 -377.132 0 0 0 0 0 0 0 0 0 0 0 
0 -929.06 0 0 918.683 0 0 0 0 0 1799.75 0 721.686 0 402.768 0 -2221.67 0 -748.695 0 0 0 1782.97 -1768.17 0 0 0 0 0 0 -1231.5 194.479 974.38 1030.08 0 0 0 2143.09 0 0 -705.359 0 0 0 0 0 0 0 0 -938.673 0 0 0 
-1164.05 0 0 0 0 0 0 0 0 0 0 0 0 -1834.09 348.445 1090.96 2391.05 2319.18 -1286.13 0 -674.841 1817.61 0 0 0 0 0 0.07 0 0 0 153.127 1275.29 1101.79 0 550.783 0 0 0 0 0 0 0 0 1056.47 0 0 0 0 0 0 0 0 
2422.03 0 0 886.792 0 -1515.78 0 0 0 0 0 0 -572.451 2181.39 0 0 -2248.22 0 -877.636 0 0 0 -1937.09 0 2450.71 1103.17 0 0 0.03 -2329.25 0 -2302.85 0 0 0 1595.74 0 -219.81 0 0 2160.48 0 955.916 0 0 0 0 0 0 0 0 0 0 
0 1691.56 0 0 -299.463 1842.94 0 0 0 0 0 0 0 0 2305.9 0 0 -2251.88 0 -1712.32 2488.4 0 0 0 0 0 0 0 104.602 0.08 0 0 0 0 0 0 0 0 0 0 0 1128.19 0 0 0 0 2428.43 -1335.57 0 121.082 0 0 0 
0 0 -382.321 262.688 0 0 0 0 16.7089 0 0 0 0 0 0 0 0 280.084 0 0 0 1235.92 0 0 -121.845 808.817 2036.42 0 0 0 0.04 0 1428.8 0 0 0 0 0 0 0 2449.95 -178.457 -287.103 0 0 0 0 0 0 0 0 0 0 
0 0 1708.81 0 0 -1099.66 0 0 0 0 1417.97 0 0 2258.6 0 -1060.9 0 -290.155 0 0 0 0 0 1606.42 0 0 -1336.94 1142.69 2458.19 0 0 0.07 -997.116 0 2045.88 0 0 0 0 0 0 -805.918 1259.73 0 -1012.38 0 0 0 0 0 0 0 0 
0 0 0 2007.43 0 0 1832.71 0 0 -1445.28 0 761.208 0 -841.472 2410.12 0 -526.368 436.338 0 0 0 0 0 705.969 0 1513.34 1337.09 -398.038 0 0 1872.23 -304.041 0.07 -1202.81 0 0 0 0 2315.67 0 0 1116.44 0 0 -1849.96 0 0 0 0 0 -2025.28 0 -426.42 
1751.23 0 0 0 -1725.75 0 0 0 0 0 66.4541 2276.91 0 -2031.08 -792.947 0 -2318.87 0 0 1333.28 0 0 0 0 1377.83 0 647.679 978.5 0 0 0 0 -1109.27 0.07 0 -475.86 2114.86 0 771.279 0 0 -1320.61 0 0 0 0 1158.1 0 0 0 0 0 0 
0 0 0 0 0 0 959.12 0 0 0 1548.13 -122.761 1630.22 0 0 1719.49 2124.77 757.241 0 0 -523.469 0 0 2101.43 0 0 0 0 0 0 0 257.5 0 0 0.01 0 0 0 -1187.4 0 -976.211 0 0 0 -1398.43 -1963.48 -2128.28 -296.869 0 0 0 0 0 
0 1788.16 0 2017.35 0 0 0 -920.82 0 0 0 0 0 -542.39 0 2036.88 0 0 0 0 -1019.85 0 -1298.03 0 0 0 0 1886.12 -1984.08 0 0 0 0 974.685 0 0.08 496.46 0 0 0 0 0 0 0 0 0 0 0 0 0 0 0 -1724.52 
0 0 0 0 0 0 0 1746.8 -876.263 0 0 0 -135.578 1161 -1119.19 0 0 0 0 0 0 996.048 0 0 -1689.73 0 0 0 0 0 0 0 0 -1195.79 0 1157.95 0.03 0 0 0 1708.96 0 0 0 0 0 0 0 0 0 0 0 0 
0 1668.83 0 0 0 0 0 0 0 0 -848.186 532.472 2427.37 0 272.149 0 0 0 0 0 1725.59 0 -1772.74 0 2436.06 0 1710.49 0 10.3 0 0 0 0 0 0 0 0 0.02 0 0 0 0 0 0 0 0 0 0 0 0 704.291 0 0 
0 -1314.66 754.341 0 0 159.841 0 -20.8289 0 0 0 0 0 0 0 0 2067.09 265.74 2464.29 0 -74.2363 -1593.6 0 0 0 0 0 0 0 0 0 0 2087.39 1230.74 2449.64 0 0 0 0.01 1247.22 0 -308.618 0 -1568.42 0 0 0 0 0 -1980.27 0 0 -1956.47 
0 1865.98 0 0 0 0 0 0 0 0 -296.411 135.731 0 0 1341.21 0 0 0 0 0 1999.65 0 0 0 -1507.84 0 0 0 0 0 0 0 0 0 0 0 0 0 1128.5 0.09 0 0 -791.574 0 0 0 0 0 0 0 1166.49 0 -898.389 
0 0 0 -1410.49 0 0 0 0 0 2438.51 0 -902.661 0 0 0 0 0 0 0 0 0 -1556.67 730.232 0 0 1570.41 1615.12 0 2253.87 0 -1295.28 0 0 0 -118.946 0 -1788.92 0 0 0 0.01 0 0 0 0 0 0 0 0 0 0 0 -630.436 
0 0 -2166.89 0 0 2301.17 0 0 0 0 0 0 0 0 0 160.298 0 0 0 0 0 -1077.84 0 0 0 476.012 0 0 0 1776.56 2145.07 1686.83 -1760.54 1172.75 0 0 0 0 428.861 0 0 0.09 461.974 0 0 0 0 0 0 -741.066 0 0 0 
1142.23 0 0 0 2355.95 0 0 0 1338.92 0 -1464.05 0 0 0 0 1415.52 0 0 1759.32 -535.676 0 0 1198.54 0 0 0 0 0 -1334.35 0 -199.82 -1129.87 0 0 0 0 0 0 0 427.03 0 -1993.85 0 305.109 0 0 0 0 0 0 0 0 0 
0 0 663.244 -345.546 -3.73852 940.809 0 0 271.233 0 721.534 0 1473.05 0 0 0 0 0 0 421.232 0 1787.09 -1348.38 1637.85 0 0 0 0 0 0 0 0 0 0 0 0 0 0 -248.802 0 0 0 -2024.67 0 0 0 0 0 0 0 0 0 0 
0 0 237.663 -1590.4 0 0 0 0 0 0 0 0 0 0 0 0 0 0 0 0 0 0 0 0 0 0 0 2133.32 0 0 0 -2384.18 1773.81 0 395.749 0 0 0 0 0 0 0 0 0 0.05 0 0 0 0 0 0 -638.218 0 
0 0 469.298 0 0 0 0 0 0 0 0 0 0 0 0 -639.592 0 0 0 0 0 0 0 0 0 0 0 0 0 0 0 0 0 0 2355.8 0 0 0 0 0 0 0 0 0 0 0.04 332.575 0 0 0 0 0 0 
0 0 0 0 1996.75 0 0 0 0 0 0 -510.498 0 0 0 0 0 0 2214.65 0 -841.014 0 0 0 0 0 0 0 0 -1634.8 0 0 0 2010.48 -2414.7 0 0 0 0 0 0 0 0 0 0 2423.4 0.06 0 -2125.69 0 0 0 0 
0 0 0 0 0 0 0 0 0 0 0 1592.23 0 0 0 0 2164.14 0 0 0 0 0 0 0 0 0 0 0 0 1171.07 0 0 0 0 -411.313 0 0 0 0 0 0 0 0 0 0 0 0 0.02 2482.3 0 0 0 0 
0 0 0 0 0 0 0 0 0 0 0 0 0 0 0 0 -2136.07 0 0 551.241 447.172 0 0 0 0 0 0 0 0 0 0 0 0 0 0 0 0 0 0 0 0 0 0 0 0 0 474.639 1121.94 0.05 0 0 0 0 
0 0 0 0 0 0 0 0 2022.54 2157.73 0 0 0 0 0 0 0 0 0 -557.192 972.854 0 0 0 0 0 1816.84 0 0 -2183.52 0 0 0 0 0 0 0 0 1853.62 0 0 1654.18 0 0 0 0 0 0 0 0.04 0 0 0 
0 0 0 0 0 0 0 0 0 0 0 0 0 1884.44 1394.47 0 0 0 2095.48 0 0 -288.171 0 0 0 0 0 0 0 0 0 0 -1145.89 0 0 0 0 -1543.09 0 1896.5 0 0 0 0 0 0 0 0 0 0 0.07 0 0 
0 0 0 0 0 0 0 0 0 0 0 0 0 0 0 0 0 0 0 2426.15 -303.583 0 0 -37.4615 0 0 0 0 0 0 0 0 0 0 0 0 0 0 0 0 0 0 0 0 -485.321 0 0 0 0 0 0 0.03 0 
0 0 243.156 0 0 0 0 0 0 0 0 0 0 1066.09 0 -463.042 0 0 0 0 0 0 0 0 0 0 0 0 0 0 0 0 -1060.59 0 0 774.483 0 0 177.236 573.672 -1037.55 0 0 0 0 0 0 0 0 0 0 0 0.07 
