*Vertices 64
*Matrix 
0.03 0 0 0 0 1202.66 215.995 0 0 0 0 0 0 0 0 0 0 0 0 0 0 0 0 0 0 0 2294.15 0 0 0 0 0 0 0 0 0 0 0 0 0 0 1926.4 0 0 0 0 0 0 0 0 0 0 1899.4 891.369 -764.718 -2098.22 0 0 0 0 0 0 0 0 
0 0.03 0 0 0 0 0 0 0 0 0 0 0 0 0 0 0 0 0 0 244.987 0 0 0 0 0 0 0 -437.254 0 0 -4.50148 0 0 0 0 0 0 0 0 0 0 0 0 2348.63 0 0 0 0 1879.25 -1395.54 0 0 0 0 0 0 0 0 0 0 0 0 0 
0 0 0.08 0 0 0 0 0 0 0 0 0 0 0 0 0 0 0 -976.669 0 0 0 0 0 0 0 0 0 0 2049.85 0 0 0 0 -1820.81 0 0 0 0 0 0 0 0 0 0 0 0 0 316.401 0 0 0 1066.55 0 0 0 0 0 0 0 0 0 0 0 
0 0 0 0.07 0 728.858 491.577 0 0 0 0 800.424 0 0 0 0 0 0 0 -108.417 -393.155 0 0 0 0 0 0 0 -103.534 0 0 0 0 0 0 0 0 0 1718.73 0 0 0 0 0 0 0 0 404.141 0 0 0 0 -543.306 0 0 0 1684.55 0 0 -505.768 711.615 0 0 0 
0 0 0 0 0.05 0 0 0 0 1503.42 2035.51 0 0 0 0 -2059.62 0 1543.4 2253.26 0 0 0 0 0 0 0 0 2139.42 0 0 0 0 0 0 0 0 0 0 0 769.601 0 0 0 0 0 0 0 0 0 0 0 0 0 0 0 0 0 0 0 0 0 0 0 0 
-1645.02 0 0 2452.85 0 0.04 0 0 0 0 0 0 0 0 0 0 0 0 0 79.8822 0 0 0 0 0 0 0 0 0 -1528.29 0 0 0 0 0 0 0 0 0 0 0 0 1574.37 0 0 0 0 0 762.886 1664.1 0 -1143.3 0 1523.56 0 0 966.292 714.972 0 0 0 0 0 0 
2482.3 0 0 1312.22 0 0 0.05 0 0 0 0 0 0 0 0 0 0 0 -1729.56 0 0 0 0 0 0 0 0 -845.286 -1.60222 0 0 1117.97 0 0 0 0 0 0 2059.77 0 0 0 0 0 0 0 0 0 0 0 0 -2435.61 0 0 0 785.318 0 0 0 0 0 0 0 0 
0 0 0 0 0 0 0 0.07 0 0 0 0 0 0 0 0 0 1835.76 959.731 -2465.51 0 0 0 0 0 0 0 0 1725.59 965.072 0 0 0 0 0 0 0 0 0 0 0 0 0 0 0 0 0 0 0 1032.36 0 0 0 0 1459.78 0 0 0 0 -1230.74 -603.58 0 0 0 
0 0 0 0 0 0 0 0 0.01 0 0 0 0 907.544 0 0 0 2384.03 0 0 0 0 0 0 0 0 0 -1452.45 0 0 0 0 0 0 0 0 0 0 0 0 0 1967.3 0 0 0 0 0 0 0 0 0 0 0 0 0 1145.74 0 0 0 0 0 0 0 0 
0 0 0 0 -1547.21 0 0 0 0 0.04 0 0 0 0 0 0 0 0 0 0 0 0 0 0 0 1347.01 0 0 0 0 0 1432.16 0 0 0 1818.06 0 0 -2040.85 0 0 -2090.59 0 0 0 0 0 0 0 1622.75 0 0 0 0 0 0 0 0 0 0 0 0 0 0 
0 0 0 0 939.131 0 0 0 0 0 0.06 0 639.744 0 -822.398 0 0 0 0 0 0 0 0 0 0 0 0 0 0 0 0 0 0 0 0 0 0 0 0 0 0 0 0 0 0 0 0 0 0 0 0 0 0 0 -123.371 0 0 -392.392 0 0 0 0 0 0 
0 0 0 228.507 0 0 0 0 0 0 0 0.01 0 0 -713.904 1912.82 0 0 0 0 -2483.67 0 0 0 0 0 0 0 0 0 0 0 0 0 -67.98 0 0 0 0 0 1683.63 0 0 0 0 0 0 0 0 0 0 0 681.555 0 0 0 0 0 0 0 0 0 0 0 
0 0 0 0 0 0 0 0 0 0 -675.909 0 0 0 1874.37 0 0 0 0 0 0 0 0 0 0 0 2201.38 0 0 0 0 0 0 0 0 0 0 0 0 0 0 0 0 0 0 0 0 0 0 0 0 0 0 0 0 0 0 0 0 0 0 0 0 0 
0 0 0 0 0 0 0 0 -2064.04 0 0 0 0 0.07 0 0 0 0 0 0 0 0 0 0 0 0 0 0 0 0 0 0 1578.8 276.727 0 0 0 0 0 0 2220.45 0 0 0 0 0 0 0 0 0 0 0 0 0 0 0 0 0 0 0 0 -1460.39 0 0 
0 0 0 0 0 0 0 0 0 0 2378.99 727.332 -1266.59 0 0 0 0 -1428.04 0 -483.337 0 0 0 0 0 0 0 0 0 0 0 680.029 0 0 0 0 0 0 0 0 0 0 0 0 1505.4 0 0 0 1418.12 0 -1018.48 1107.14 0 0 0 0 0 0 0 0 0 0 0 0 
0 0 0 0 2404.48 0 0 0 0 0 0 -528.809 0 0 0 0.02 0 1408.2 0 0 0 0 -274.895 1059.83 -1782.66 0 0 0 0 2104.94 -1138.11 0 0 0 -442.289 2127.98 2308.04 0 0 0 0 0 -793.252 0 0 0 0 0 0 0 0 0 0 0 0 0 0 0 0 -1522.03 0 0 0 0 
0 0 0 0 0 0 0 0 0 0 0 0 0 0 0 0 0.01 0 0 0 0 0 0 0 0 0 0 0 -2168.42 1710.03 0 0 0 0 1878.8 0 0 -183.95 0 0 0 -981.246 0 0 0 0 0 0 0 0 0 0 0 0 0 0 0 0 0 -721.381 0 0 0 0 
0 0 0 0 -1117.82 0 0 -1874.52 1277.43 0 0 0 0 0 2447.05 1648.38 0 0 0 1646.86 0 0 556.886 -1652.81 0 1473.66 0 0 0 0 0 0 0 0 0 0 0 0 0 0 0 0 0 0 0 0 0 0 0 0 1341.82 0 0 0 0 0 0 0 0 -617.466 0 0 0 2487.33 
0 0 -794.32 0 2038.26 0 -1637.24 -2494.66 0 0 0 0 0 0 0 0 0 0 0.07 0 0 0 0 0 0 0 0 0 0 0 0 871.685 0 0 0 0 0 0 0 0 0 0 -1515.78 0 0 0 0 0 0 0 0 0 0 0 2472.99 0 0 0 0 0 0 0 0 0 
0 0 0 1115.53 0 -2174.06 0 -1220.66 0 0 0 0 0 0 -1298.49 0 0 273.675 0 0.07 0 0 0 0 0 2418.97 0 0 0 0 0 0 0 0 0 0 0 0 0 0 0 0 0 0 0 0 0 0 0 0 0 0 0 0 0 0 1620.46 0 0 1113.7 0 0 0 0 
0 -780.892 0 -404.447 0 0 0 0 0 0 0 1336.18 0 0 0 0 0 0 0 0 0.09 0 -458.617 0 0 0 0 1177.18 0 0 0 0 0 0 0 0 0 0 0 0 0 -2363.73 0 0 0 0 0 0 0 0 0 0 -1298.79 0 1756.87 818.735 0 2102.04 0 0 0 0 0 0 
0 0 0 0 0 0 0 0 0 0 0 0 0 0 0 0 0 0 0 0 0 0.04 0 0 0 0 0 0 0 0 0 2352.14 0 0 0 0 0 0 0 0 1474.73 0 -1534.24 363.552 0 0 -1650.98 0 0 -1851.63 0 0 0 0 0 1650.52 0 0 0 0 0 0 0 0 
0 0 0 0 0 0 0 0 0 0 0 0 0 0 0 2115.92 0 -1540.8 0 0 214.774 0 0.04 0 -1204.18 0 0 0 0 0 0 0 0 0 0 2145.53 0 0 0 0 -2365.87 0 0 0 0 0 0 -325.861 0 0 0 1992.02 0 0 2316.74 1455.2 384.61 0 0 0 0 0 0 0 
0 0 0 0 0 0 0 0 0 0 0 0 0 0 0 -1781.75 0 2234.64 0 0 0 0 0 0.08 0 0 0 0 0 219.504 2398.37 0 0 0 0 0 -252.922 0 0 1879.71 0 0 0 0 0 0 0 2429.04 0 0 0 0 -232.475 0 0 0 0 0 0 -1588.72 0 0 0 0 
0 0 0 0 0 0 0 0 0 0 0 0 0 0 0 -748.695 0 0 0 0 0 0 2437.74 0 0.04 0 0 0 -2486.72 0 0 0 0 0 919.141 931.196 0 0 0 0 0 0 -1530.27 0 1970.66 0 0 0 0 0 0 0 0 0 0 0 0 0 0 0 0 0 0 0 
0 0 0 0 0 0 0 0 0 -2083.73 0 0 0 0 0 0 0 1652.2 0 -1428.5 0 0 0 0 0 0.05 0 0 0 0 253.99 0 0 2310.94 -377.438 0 0 0 1138.57 0 0 0 0 63.86 0 0 1479.46 0 0 0 0 0 0 0 0 0 0 -1155.05 0 0 0 0 0 0 
-8.92666 0 0 0 0 0 0 0 0 0 0 0 1084.86 0 0 0 0 0 0 0 0 0 0 0 0 0 0.06 0 0 0 0 0 1023.21 0 0 0 0 -696.051 0 0 0 0 0 0 0 0 5.26444 0 0 0 0 -301.752 0 0 0 0 0 0 0 0 0 2145.38 0 0 
0 0 0 0 1274.07 0 2395.63 0 2211.14 0 0 0 0 0 0 0 0 0 0 0 1066.7 0 0 0 0 0 0 0.03 0 0 0 0 1828.44 0 0 0 0 0 0 0 0 0 0 0 0 0 0 0 -2307.73 0 0 0 -2115.62 0 0 892.438 0 0 0 653.325 0 0 0 0 
0 1796.85 0 678.198 0 0 2339.78 -2122.03 0 0 0 0 0 0 0 0 -2005.29 0 0 0 0 0 0 0 825.449 0 0 0 0.08 0 0 0 0 0 0 0 176.778 1805.25 0 0 0 0 0 0 -2311.7 0 0 0 0 0 0 0 0 0 1227.07 0 0 0 0 0 0 0 0 0 
0 0 2438.05 0 0 -1030.38 0 358.058 0 0 0 0 0 0 0 1145.59 -1242.94 0 0 0 0 0 0 983.23 0 0 0 0 0 0.03 0 0 0 0 0 0 0 0 0 0 0 0 0 0 0 0 0 0 0 0 0 0 0 0 2419.58 0 0 0 0 0 0 0 0 0 
0 0 0 0 0 0 0 0 0 0 0 0 0 0 0 -255.211 0 0 0 0 0 0 0 -273.37 0 1351.44 0 0 0 0 0.06 0 -1268.43 0 0 0 0 0 0 0 573.977 0 0 0 713.294 0 2497.41 0 0 0 947.218 0 233.39 0 0 0 0 0 0 0 0 0 0 0 
0 2303.61 0 0 0 0 -871.227 0 0 914.258 0 0 0 0 -361.721 0 0 0 1041.22 0 0 1372.34 0 0 0 0 0 0 0 0 0 0.03 0 0 0 0 0 0 0 0 0 0 0 0 -1310.24 0 0 0 1921.37 0 0 -1375.24 0 0 0 0 0 0 -1802.5 0 0 688.574 0 0 
0 0 0 0 0 0 0 0 0 0 0 0 0 1169.85 0 0 0 0 0 0 0 0 0 0 0 0 436.949 -962.783 0 0 2211.91 0 0.07 0 0 0 0 0 0 0 0 0 -2173.15 0 0 0 0 0 0 0 0 0 0 0 0 0 0 0 2279.5 0 0 0 0 0 
0 0 0 0 0 0 0 0 0 0 0 0 0 -467.467 0 0 0 0 0 0 0 0 0 0 0 414.67 0 0 0 0 0 0 0 0 0 -1508 0 -434.202 0 0 0 0 0 0 1994.46 0 1942.43 0 0 0 0 -1025.35 0 1136.13 0 742.592 0 0 0 0 0 0 0 0 
0 0 505.158 0 0 0 0 0 0 0 0 1696.6 0 0 0 -940.046 -1958.75 0 0 0 0 0 0 0 2059.01 1336.02 0 0 0 0 0 0 0 0 0.05 0 0 1357.54 0 0 0 0 0 0 0 0 -1364.56 0 0 0 0 0 0 0 0 -874.584 0 0 242.546 0 0 0 0 0 
0 0 0 0 0 0 0 0 0 -2062.67 0 0 0 0 0 28.6111 0 0 0 0 0 0 -265.13 0 1632.05 0 0 0 0 0 0 0 0 86.5963 0 0.07 0 0 0 0 0 0 0 0 0 0 2162.16 1141.01 0 0 0 0 0 0 0 0 84.0022 -1795.94 0 0 0 0 0 0 
0 0 0 0 0 0 0 0 0 0 0 0 0 0 0 737.861 0 0 0 0 0 0 0 807.749 0 0 0 0 2073.81 0 0 0 0 0 0 0 0.07 0 -1540.19 0 0 0 0 0 0 0 0 0 0 0 1400.27 0 0 0 0 335.78 0 0 0 896.71 0 0 0 0 
0 0 0 0 0 0 0 0 0 0 0 0 0 0 0 0 -1029.31 0 0 0 0 0 0 0 0 0 -2414.7 0 -852.306 0 0 0 0 2365.57 2176.5 0 0 0.01 0 0 0 -892.743 1962.26 0 0 0 0 0 0 0 0 0 0 0 0 0 0 0 0 -1577.27 0 0 0 0 
0 0 0 2305.6 0 0 1933.88 0 0 1414.91 0 0 0 0 0 0 0 0 0 0 0 0 0 0 0 1487.24 0 0 0 0 0 0 0 0 0 0 2176.35 0 0.01 0 0 0 0 0 0 0 0 1061.82 0 1132.92 0 0 0 0 0 0 0 0 0 1682.56 0 0 0 0 
0 0 0 0 1240.2 0 0 0 0 0 0 0 0 0 0 0 0 0 0 0 0 0 0 759.835 0 0 0 0 0 0 0 0 0 0 0 0 0 0 0 0.03 0 0 0 -867.26 -829.569 0 0 0 1012.22 0 273.98 0 0 0 0 0 0 0 0 0 0 0 0 0 
0 0 0 0 0 0 0 0 0 0 0 779.977 0 214.774 0 0 0 0 0 0 0 1609.47 -1805.86 0 0 0 0 0 0 0 2183.37 0 0 0 0 0 0 0 0 0 0.03 955.611 0 0 0 0 0 0 0 985.824 0 0 0 0 0 2224.11 -21.897 0 0 0 0 0 0 0 
2140.34 0 0 0 0 0 0 0 759.682 1536.99 0 0 0 0 0 0 1770.91 0 0 0 -2074.72 0 0 0 0 0 0 0 0 0 0 0 0 0 0 0 0 2049.24 0 0 1974.17 0.01 0 0 0 0 0 0 0 0 0 0 0 0 0 0 0 0 0 0 1374.02 0 0 0 
0 0 0 0 0 1366.54 0 0 0 0 0 0 0 0 0 164.266 0 0 415.891 0 0 -1676.15 0 0 516.144 0 0 0 0 0 0 0 1530.73 0 0 0 0 -972.854 0 0 0 0 0.04 0 0 0 0 0 0 0 0 -832.774 0 0 0 2406.61 0 0 0 0 0 0 0 0 
0 0 0 0 0 0 0 0 0 0 0 0 0 0 0 0 0 0 0 0 0 1053.42 0 0 0 1218.99 0 0 0 0 0 0 0 0 0 0 0 0 0 1705.76 0 0 0 0 0 -1880.93 0 0 977.432 0 0 0 0 0 0 0 1384.85 0 0 0 0 0 0 0 
0 -2269.43 0 0 0 0 0 0 0 0 0 0 0 0 306.635 0 0 0 0 0 0 0 0 0 -790.811 0 0 0 -539.338 0 194.021 2162.31 0 1173.21 0 0 0 0 0 1823.1 0 0 0 0 0.07 0 0 2302.7 0 0 0 0 0 0 0 0 0 0 0 0 0 0 0 0 
0 0 0 0 0 0 0 0 0 0 0 0 0 0 0 0 0 0 0 0 0 0 0 0 0 0 0 0 0 0 0 0 0 0 0 0 0 0 0 0 0 0 0 873.058 0 0.05 1140.71 0 0 0 0 0 0 0 0 0 0 0 -137.715 0 0 0 0 0 
0 0 0 0 0 0 0 0 0 0 0 0 0 0 0 0 0 0 0 0 0 1306.42 0 0 0 1154.9 1135.52 0 0 0 -781.045 0 0 1927.78 -632.267 1952.35 0 0 0 0 0 0 0 0 0 -154.347 0.01 0 0 0 0 0 -1052.35 0 0 0 0 0 0 0 0 0 0 0 
0 0 0 1145.74 0 0 0 0 0 0 0 0 0 0 0 0 0 0 0 0 0 0 4.65407 1991.56 0 0 0 0 0 0 0 0 0 0 0 1134.75 0 0 -849.254 0 0 0 0 0 -735.267 0 0 0.09 0 0 0 0 0 0 0 1415.37 0 0 0 0 0 -2481.69 0 0 
0 0 1749.4 0 0 -881.451 0 0 0 0 0 0 0 0 -1953.11 0 0 0 0 0 0 0 0 0 0 0 0 1849.5 0 0 0 2366.02 0 0 0 0 0 0 0 929.823 0 0 0 1910.23 0 0 0 0 0.02 0 718.177 0 0 0 0 2491.45 0 0 -1285.52 0 0 0 0 0 
0 -716.651 0 0 0 -389.798 0 1357.54 0 -317.469 0 0 0 0 0 0 0 0 0 0 0 -424.741 0 0 0 0 0 0 0 0 0 0 0 0 0 0 0 0 -2151.94 0 2042.53 0 0 0 0 0 0 0 0 0.04 0 0 0 2194.36 0 0 0 0 0 0 0 0 0 0 
0 -1023.36 0 0 0 0 0 0 0 0 0 0 0 0 -1849.8 0 0 1634.19 0 0 0 0 0 0 0 0 0 0 0 0 1454.28 0 0 0 0 0 -432.218 0 0 -1389.89 0 0 0 0 0 0 0 0 2155.75 0 0.08 0 0 0 1476.26 0 0 0 0 0 1670.35 0 0 0 
0 0 0 0 0 -610.752 -297.479 0 0 0 0 0 0 0 1350.67 0 0 0 0 0 0 0 318.079 0 0 0 1522.03 0 0 0 0 -1838.66 0 -1739.94 0 0 0 0 0 0 0 0 2247.46 0 0 0 0 0 0 0 0 0.06 0 0 0 0 0 0 0 0 0 776.62 0 0 
534.913 0 31.3578 2044.66 0 0 0 0 0 0 0 1669.44 0 0 0 0 0 0 0 0 1821.12 0 0 -729.469 0 0 0 2023.76 0 0 -1018.48 0 0 0 0 0 0 0 0 0 0 0 0 0 0 0 1510.59 0 0 0 0 0 0.01 0 0 0 0 0 796.152 0 0 0 0 0 
456.328 0 0 0 0 2169.03 0 0 0 0 0 0 0 0 0 0 0 0 0 0 0 0 0 0 0 0 0 0 0 0 0 0 0 -101.703 0 0 0 0 0 0 0 0 0 0 0 0 0 0 0 -1905.8 0 0 0 0.08 0 0 0 0 0 0 0 0 -97.2777 0 
1899.4 0 0 0 0 0 0 -1269.34 0 0 -1065.17 0 0 0 0 0 0 0 300.531 0 1118.12 0 2131.95 0 0 0 0 0 -183.187 -37.4615 0 0 0 0 0 0 0 0 0 0 0 0 0 0 0 0 0 0 0 0 1611.76 0 0 0 0.04 0 0 620.518 0 0 0 0 0 0 
915.632 0 0 0 0 0 1055.41 0 2327.88 0 0 0 0 0 0 0 0 0 0 0 -188.986 -1017.87 -117.573 0 0 0 0 -2424.92 0 0 0 0 0 1056.93 -2422.64 0 2357.33 0 0 0 279.931 0 2093.19 0 0 0 0 1022.45 -1705.15 0 0 0 0 0 0 0.02 0 0 2144 0 0 0 0 0 
0 0 0 -757.241 0 1367.15 0 0 0 0 0 0 0 0 0 0 0 0 0 1662.72 0 0 2405.24 0 0 0 0 0 0 0 0 0 0 0 0 -939.894 0 0 0 0 559.786 0 0 -2498.32 0 0 0 0 0 0 0 0 0 0 0 0 0.08 691.015 0 0 0 -724.586 0 0 
0 0 0 0 0 -1229.67 0 0 0 0 1564 0 0 0 0 0 0 0 0 0 -878.552 0 0 0 0 2370.75 0 0 0 0 0 0 0 0 0 1865.37 0 0 0 0 0 0 0 0 0 0 0 0 0 0 0 0 0 0 -2215.26 0 -242.851 0.09 0 0 0 0 0 0 
0 0 0 0 0 0 0 0 0 0 0 0 0 0 0 0 0 0 0 0 0 0 0 0 0 0 0 0 0 0 0 271.538 1466.03 0 -1231.5 0 0 0 0 0 0 0 0 0 0 242.546 0 0 2404.02 0 0 0 417.722 0 0 2012.77 0 0 0.02 -1733.68 0 0 0 0 
0 0 0 685.217 0 0 0 -345.698 0 0 0 0 0 0 0 -437.712 2041 -2245.17 0 1987.75 0 0 0 -1467.71 0 0 0 -797.983 0 0 0 0 0 0 0 0 -634.556 1110.19 1492.89 0 0 0 0 0 0 0 0 0 0 0 0 0 0 0 0 0 0 0 -0.381481 0.02 0 0 0 0 
0 0 0 -1070.21 0 0 0 617.771 0 0 0 0 0 0 0 0 0 0 0 0 0 0 0 0 0 0 0 0 0 0 0 0 0 0 0 0 0 0 0 0 0 738.472 0 0 0 0 0 0 0 0 2411.34 0 0 0 0 0 0 0 0 0 0.06 -227.897 0 0 
0 0 0 0 0 0 0 0 0 0 0 0 0 1640.6 0 0 0 0 0 0 0 0 0 0 0 0 -2192.98 0 0 0 0 1306.42 0 0 0 0 0 0 0 0 0 0 0 0 0 0 0 -275.506 0 0 0 1910.99 0 0 0 0 1027.94 0 0 0 1240.65 0.09 0 0 
0 0 0 0 0 0 0 0 0 0 0 0 0 0 0 0 0 0 0 0 0 0 0 0 0 0 0 0 0 0 0 0 0 0 0 0 0 0 0 0 0 0 0 0 0 0 0 0 0 0 0 0 0 418.79 0 0 0 0 0 0 0 0 0.08 0 
0 0 0 0 0 0 0 0 0 0 0 0 0 0 0 0 0 1293.3 0 0 0 0 0 0 0 0 0 0 0 0 0 0 0 0 0 0 0 0 0 0 0 0 0 0 0 0 0 0 0 0 0 0 0 0 0 0 0 0 0 0 0 0 0 0.04 
