*Vertices 41
*Matrix 
0.07 0 2353.05 0 0 0 0 0 0 0 0 0 0 0 0 0 0 0 0 2242.27 0 2013.38 0 0 0 0 0 0 0 0 124.287 0 0 0 0 0 0 0 0 0 0 
0 0.02 0 0 0 0 0 0 0 0 0 0 0 1458.86 0 0 0 0 0 0 0 0 0 0 0 0 0 0 0 178.762 0 1084.55 0 0 0 0 0 0 0 0 0 
-476.623 0 0.06 0 0 0 0 0 0 0 0 0 0 0 0 0 0 319.147 0 0 0 0 0 0 1698.89 2324.21 0 0 0 2181.39 0 0 0 0 1687.14 0 0 0 0 0 0 
0 0 0 0.01 0 0 -1692.79 0 595.187 0 0 2318.57 0 0 0 0 0 2107.99 -1736.58 0 0 0 0 1430.63 0 0 0 0 0 0 0 0 0 0 0 0 0 0 0 0 0 
0 0 0 0 0.09 0 0 602.359 0 0 2109.21 0 -1361.35 0 0 0 0 1358.15 0 0 0 849.864 0 0 0 0 0 980.026 0 0 0 0 0 0 0 0 0 0 0 0 0 
0 0 0 0 0 0.05 0 0 0 0 0 0 0 0 0 0 0 0 0 0 0 0 0 0 0 0 0 0 0 2012.47 0 0 0 0 2020.71 1484.8 0 658.055 0 0 0 
0 0 0 2148.58 0 0 0.07 0 0 900.22 0 0 0 0 198.599 910.291 0 0 0 0 0 0 0 0 0 0 0 0 0 0 0 0 0 0 0 0 0 530.946 0 0 0 
0 0 0 0 -1075.7 0 0 0.03 0 0 0 0 0 0 0 0 0 2314.45 0 0 0 0 0 0 0 0 0 0 0 0 339.137 0 0 0 0 0 0 1913.89 1473.82 0 0 
0 0 0 224.998 0 0 0 0 0.08 0 0 0 0 0 0 0 0 0 0 0 0 0 0 0 830.79 0 0 0 0 0 0 0 0 0 0 0 0 0 0 0 0 
0 0 0 0 0 0 390.103 0 0 0.09 0 0 0 0 0 0 0 0 0 0 0 0 0 0 0 0 0 0 0 0 0 0 2499.54 0 0 529.267 -2063.28 0 167.623 0 0 
0 0 0 0 974.685 0 0 0 0 0 0.09 0 0 0 0 0 0 0 0 0 0 0 0 0 0 0 0 0 1908.4 0 0 0 0 0 0 0 0 0 0 0 0 
0 0 0 2053.97 0 0 0 0 0 0 0 0.01 0 0 0 0 990.86 0 0 0 0 1325.65 0 -2317.65 0 -2084.49 0 0 0 0 0 0 0 0 0 0 0 0 0 0 0 
0 0 0 0 1177.63 0 0 0 0 0 0 0 0.01 0 0 1898.33 1379.06 0 0 0 0 0 0 354.091 0 0 0 0 0 0 0 0 0 0 0 0 0 0 0 0 0 
0 1531.8 0 0 0 0 0 0 0 0 0 0 0 0.07 0 0 0 0 0 0 0 0 0 0 0 0 0 1543.09 -1835.61 0 0 0 0 0 620.823 0 0 0 0 0 0 
0 0 0 0 0 0 2178.79 0 0 0 0 0 0 0 0.06 1464.05 0 0 0 0 0 0 0 1552.1 0 0 531.709 0 0 0 -1074.48 0 2470.7 0 1359.52 0 0 0 0 -1522.34 0 
0 0 0 0 0 0 -1601.99 0 0 0 0 0 968.276 0 1519.44 0.08 0 -222.404 0 0 0 0 0 0 0 0 0 0 0 2130.12 0 0 -2198.02 0 0 1768.62 0 0 -1756.57 0 0 
0 0 0 0 0 0 0 0 0 0 0 2399.75 1653.72 0 0 0 0.08 0 0 1154.74 0 519.654 0 -892.895 0 0 0 0 0 0 0 0 0 0 0 0 0 0 0 0 0 
0 0 844.981 -449.614 2049.7 0 0 1300.47 0 0 0 0 0 0 0 222.251 0 0.07 0 0 0 0 381.863 0 0 0 442.9 0 0 0 0 0 1752.3 0 1241.57 0 0 0 -1285.21 0 0 
0 0 0 1543.86 0 0 0 0 0 0 0 0 0 0 0 0 0 0 0.02 0 0 0 0 0 2388 1708.96 1380.28 0 0 -979.72 0 0 -1937.09 0 0 -991.47 0 0 0 0 0 
1313.59 0 0 0 0 0 0 0 0 0 0 0 0 0 0 0 1671.88 0 0 0.07 0 897.015 652.867 1502.81 -2470.4 -1444.98 0 0 0 0 0 0 -805.918 105.518 2199.85 0 0 0 0 0 0 
0 0 0 0 0 0 0 0 0 0 0 0 0 0 0 0 0 0 0 0 0.09 0 0 0 0 484.405 0 0 0 0 0 0 0 0 0 0 0 0 0 0 0 
1432.46 0 0 0 886.792 0 0 0 0 0 0 -1547.52 0 0 0 0 -777.993 0 0 1655.25 0 0 0 0 0 0 0 0 617.161 1367.46 0 0 0 0 0 1548.13 -2301.48 0 0 0 0 
0 0 0 0 0 0 0 0 0 0 0 0 0 0 0 0 0 -765.633 0 2315.36 0 0 0.06 0 0 0 0 0 0 0 0 0 0 0 0 1396.6 0 0 0 0 0 
0 0 0 177.389 0 0 0 0 0 0 0 2213.58 1793.19 0 61.4185 0 -136.799 0 0 1851.02 0 0 0 0.04 0 0 0 0 0 0 0 0 0 0 0 0 0 0 0 0 0 
0 0 -1496.25 0 0 0 0 0 1799.6 0 0 0 0 0 0 0 0 0 1442.08 1872.69 0 0 0 0 0.06 -957.137 0 0 0 0 0 0 0 0 0 2448.88 0 0 420.469 0 0 
0 0 -1531.95 0 0 0 0 0 0 0 0 -2113.03 0 0 0 0 0 0 2383.42 2071.06 -798.135 0 0 0 1185.42 0 0 0 783.944 0 1531.19 0 0 0 0 -551.088 0 0 0 0 0 
0 0 0 0 0 0 0 0 0 0 0 0 0 0 -174.032 0 0 663.549 -611.667 0 0 0 0 0 0 0 0.09 0 0 0 0 0 0 0 1599.4 0 0 0 2414.4 0 0 
0 0 0 0 -687.964 0 0 0 0 0 0 0 0 -152.821 0 0 0 0 0 0 0 0 0 0 0 0 0 0.09 0 0 0 0 0 0 112.69 2285 0 0 0 0 0 
0 0 0 0 0 0 0 0 0 0 -1919.84 0 0 826.823 0 0 0 0 0 0 0 767.464 0 0 0 2267.91 0 0 0.03 0 1937.24 0 0 -1979.51 0 0 0 0 0 0 0 
0 1947.92 2456.51 0 0 2296.14 0 0 0 0 0 0 0 0 0 1819.9 0 0 2404.17 0 0 -671.941 0 0 0 0 0 0 0 0.09 0 0 0 0 0 0 0 0 0 0 0 
-16.0985 0 0 0 0 0 0 818.888 0 0 0 0 0 0 -253.685 0 0 0 0 0 0 0 0 0 0 1395.08 0 0 2483.37 0 0.05 0 0 0 0 0 0 0 -2458.65 0 0 
0 778.603 0 0 0 0 0 0 0 0 0 0 0 0 0 0 0 0 0 0 0 0 0 0 0 0 0 0 0 0 0 0.09 0 0 614.872 0 0 179.983 0 0 0 
0 0 0 0 0 0 0 0 0 1777.47 0 0 0 0 -1511.51 1679.66 0 -1425.75 2007.74 -414.365 0 0 0 0 0 0 0 0 0 0 0 0 0.01 -671.484 0 0 0 610.599 0 0 0 
0 0 0 0 0 0 0 0 0 0 0 0 0 0 0 0 0 0 0 2065.11 0 0 0 0 0 0 0 0 -41.5815 0 0 0 -532.014 0.02 0 0 0 745.491 0 0 0 
0 0 1717.96 0 0 1909.16 0 0 0 0 0 0 0 626.469 -1726.81 0 0 -183.493 0 2199.85 0 0 0 0 0 0 -1422.39 1363.19 0 0 0 1239.13 0 0 0.02 0 0 0 0 0 0 
0 0 0 0 0 2330.93 0 0 0 955.458 0 0 0 0 0 -915.632 0 0 1118.27 0 0 -834.91 -1921.83 0 800.119 187.46 0 -1101.95 0 0 0 0 0 0 0 0.02 0 0 0 0 0 
0 0 0 0 0 0 0 0 0 1403.93 0 0 0 0 0 0 0 0 0 0 0 372.25 0 0 0 0 0 0 0 0 0 0 0 0 0 0 0.09 0 0 0 0 
0 0 0 0 0 1594.67 2223.35 705.054 0 0 0 0 0 0 0 0 0 0 0 0 0 0 0 0 0 0 0 0 0 0 0 137.867 1826.76 1392.79 0 0 0 0.06 754.799 0 1286.58 
0 0 0 0 0 0 0 1237.45 0 1609.32 0 0 0 0 0 -1151.23 0 -2042.53 0 0 0 0 0 0 1842.48 0 2187.95 0 0 0 1025.8 0 0 0 0 0 0 -1278.95 0.09 0 0 
0 0 0 0 0 0 0 0 0 0 0 0 0 0 2487.18 0 0 0 0 0 0 0 0 0 0 0 0 0 0 0 0 0 0 0 0 0 0 0 0 0 0 
0 0 0 0 0 0 0 0 0 0 0 0 0 0 0 0 0 0 0 0 0 0 0 0 0 0 0 0 0 0 0 0 0 0 0 0 0 593.051 0 0 0.08 
