*Vertices 57
*Matrix 
0.05 -1065.32 1652.04 0 1754.28 0 0 -2043.14 0 0 0 2242.88 0 788.522 0 0 -171.896 0 0 0 -618.534 -1298.79 0 1987.59 0 1197.47 -1520.2 0 0 0 0 1512.57 0 0 0 0 0 0 0 0 0 0 0 0 0 0 0 0 0 0 653.02 0 0 0 -1469.85 0 0 
498.596 0.04 2312.92 -1264.15 1325.34 0 0 0 1228.29 0 -514.161 0 -1424.99 478.607 0 0 0 0 0 0 0 -144.429 0 0 0 -1518.52 0 2036.88 1834.39 0 -2181.54 0 4.34889 -1850.41 0 0 870.464 0 0 0 0 0 0 0 0 -2117.6 0 0 2352.9 0 0 0 0 0 1864.3 0 0 
648.9 -480.743 0 -1401.18 0 0 0 0 0 0 1859.42 0 0 0 0 899.609 0 -432.829 0 884.808 0 0 0 0 0 2436.83 0 0 -34.257 0 0 0 0 563.601 1304.74 0 0 0 0 0 -469.604 0 0 0 0 0 0 0 0 -2442.93 -824.381 581.759 0 0 0 0 0 
0 3.73852 2213.74 0.03 0 0 0 0 0 -235.679 0 0 1917.71 0 0 0 0 1248.74 0 0 -2116.38 2344.36 0 317.469 -1405.61 571.23 0 0 0 0 0 0 0 0 0 0 0 0 0 0 0 0 0 0 0 0 0 2230.52 -1919.69 0 0 0 0 0 0 -2312.16 0 
1039.23 2116.69 0 0 0.07 0 0 0 0 2207.63 0 -1180.53 -1950.97 0 2118.52 0 0 0 0 0 0 0 0 27.0852 0 -494.781 0 0 0 0 1911.15 2376.86 0 0 0 418.638 294.122 0 0 0 0 2191 0 0 0 0 -1426.36 0 0 0 0 0 0 0 0 0 0 
0 0 0 0 0 0.07 0 0 2356.87 1439.79 0 0 0 0 103.534 0 0 0 0 0 0 0 0 0 0 -1980.88 1046.4 0 1328.7 0 -1466.34 0 0 0 2157.58 0 0 0 0 0 -414.365 0 0 0 0 0 0 0 0 0 0 0 0 0 0 -1943.04 2284.39 
0 0 0 0 0 0 0.01 0 0 -449.461 2241.36 1496.7 0 0 0 2258.29 0 0 0 0 0 0 0 0 0 -1412.78 0 0 0 0 0 0 -1003.37 0 2307.73 0 8.1637 0 0 0 0 0 0 0 0 0 0 0 0 0 0 0 0 0 0 0 0 
-539.186 0 0 0 0 0 0 0.05 1768.62 0 1724.07 0 0 0 -185.934 0 0 0 1985.92 879.62 -1203.12 1733.68 0 0 0 0 1034.81 -194.937 0 -1626.1 362.026 0 784.249 1658.76 283.441 0 -672.094 0 0 0 0 0 0 0 0 0 0 0 0 0 0 -1035.26 0 0 0 0 0 
0 1914.35 0 0 0 -1181.6 0 1728.49 0.06 -1904.43 378.658 0 0 0 1830.12 0 0 -1762.22 0 0 0 0 0 0 0 0 896.71 0 -1614.66 0 1781.44 0 0 0 0 -932.722 409.787 0 0 0 0 0 0 0 0 395.596 0 0 0 0 0 0 0 1458.71 0 0 0 
0 0 0 -2228.08 184.256 1030.23 1032.98 0 420.774 0.09 1838.97 0 0 0 -2474.21 0 0 0 2149.34 0 0 -562.532 0 0 0 -1256.37 1250.88 0 2349.54 -1830.42 1476.56 2463.53 192.038 0 -2484.44 0 0 982.009 0 0 0 0 0 0 0 0 0 0 731.605 0 0 0 2146.75 0 0 -1664.56 0 
0 137.562 829.722 0 0 0 1557.59 1024.58 1329.77 -1920.76 0.05 0 0 0 0 0 0 1459.78 0 0 681.249 0 2191.76 0 911.206 0 0 696.966 0 0 0 0 0 974.532 -1037.71 0 -2038.87 0 1273.92 0 -1427.88 0 0 0 0 0 -117.42 -2089.98 0 -912.732 0 1724.83 0 0 0 283.593 0 
2044.51 0 0 0 -299.463 0 -92.7 0 0 0 0 0.04 1918.47 0 0 -1911.15 0 0 0 0 0 1548.28 0 0 0 0 0 2015.82 442.747 0 0 -946.608 0 0 0 0 0 0 0 0 0 2177.88 0 0 0 0 0 0 -1290.55 0 -215.384 0 0 0 0 98.9563 0 
0 810.19 0 -972.854 2262.41 0 0 0 0 0 0 2449.64 0.07 0 0 0 0 0 0 -460.295 0 0 0 1566.59 0 1224.94 0 0 507.141 0 0 1263.54 0 966.292 0 0 0 0 0 0 0 0 0 0 0 0 0 0 0 0 0 0 0 0 0 -435.423 -2357.48 
-518.281 530.793 0 0 0 0 0 0 0 0 0 0 0 0.06 0 0 0 0 0 0 530.488 0 909.528 0 -1024.58 0 0 2068.16 0 1755.2 0 731.91 0 0 771.126 0 0 0 0 -90.8689 -1968.37 0 0 0 0 0 0 0 0 0 0 0 -1354.18 0 0 0 0 
0 0 0 0 22.3548 1103.47 0 -2155.75 -1571.32 -929.06 0 0 0 0 0.01 0 0 0 0 0 0 0 2206.56 0 0 0 0 0 2490.23 0 0 -1162.98 0 2115.31 391.324 0 0 0 -1041.98 0 0 0 2010.48 0 0 2329.1 1565.07 0 0 0 0 0 0 0 0 0 0 
0 0 2355.8 0 0 0 -51.8052 0 0 0 0 2030.02 0 0 0 0.01 0 0 1105.3 0 0 0 0 0 0 0 0 0 1007.95 -460.753 1165.27 0 0 0 -529.878 0 -2372.43 0 0 0 0 1594.36 0 0 0 0 0 0 0 0 0 0 0 0 0 0 0 
1196.4 0 0 0 0 0 0 0 0 0 0 0 0 0 0 0 0.04 0 995.438 0 0 0 -238.121 0 0 1533.48 0 842.387 0 1885.36 0 0 0 0 2182.45 0 629.368 0 0 0 0 0 2137.59 1386.23 0 0 0 -1775.8 0 0 0 0 0 0 0 104.602 0 
0 0 1815.01 1066.7 0 0 0 0 2288.66 0 -467.162 0 0 0 0 0 0 0.07 2235.25 0 -887.707 0 -1162.37 -1131.7 0 0 0 -2349.85 0 0 0 0 0 1993.09 0 0 0 0 0 0 0 0 0 0 0 692.999 0 0 0 2248.83 0 0 562.532 0 0 0 0 
0 0 0 0 0 0 0 1685.46 0 -692.541 0 0 0 0 0 -56.0778 -1103.93 2259.36 0.07 0 0 0 0 2388.3 0 0 0 0 0 -915.021 0 1456.88 0 0 0 0 0 0 0 0 1706.06 0 0 -95.7518 0 0 -2422.94 0 0 0 0 -730.232 0 0 0 0 0 
0 0 -1801.89 0 0 0 0 214.927 0 0 0 0 758.003 0 0 0 0 0 0 0.08 0 2092.12 2244.71 0 0 326.014 0 0 -176.016 -729.926 0 0 0 0 190.207 0 0 0 0 691.168 0 0 0 0 0 0 0 0 0 -317.316 0 0 0 2058.4 -1702.4 -2069.54 -392.392 
2146.9 0 0 861.156 0 0 0 2180.17 0 0 2182.3 0 0 -958.51 0 0 0 1675.24 0 0 0.07 0 0 -1653.72 1084.7 226.981 0 0 0 -623.569 0 0 -1987.14 0 0 883.129 0 0 0 0 0 0 0 0 0 0 0 0 0 0 0 0 1436.58 1255.76 -791.116 0 0 
797.067 585.574 0 962.325 0 0 0 1211.05 0 -837.657 0 2135 0 0 0 0 0 0 0 709.326 0 0 289.544 0 0 -1509.37 0 0 0 -532.167 0 0 891.217 0 0 1797.46 1977.22 0 0 1634.34 0 0 -2291.56 0 0 0 0 -1439.48 1247.52 0 0 0 0 0 1157.8 0 0 
0 0 0 0 0 0 0 0 0 0 -282.83 0 0 432.676 -42.3444 0 1808.76 -1369.44 0 1501.89 0 2228.23 0.01 0 0 0 1680.58 0 448.851 647.221 -1310.85 0 0 1590.24 0 0 0 -2204.12 0 0 0 0 0 0 2352.9 0 0 0 0 0 0 -769.753 0 0 1588.26 0 0 
-1747.41 0 0 -1301.08 1597.26 0 0 0 0 0 0 0 1080.89 0 0 0 0 311.365 1333.12 0 -1334.5 0 0 0.08 1636.78 0 -2158.96 134.816 1771.22 0 0 0 1657.99 0 0 1376.31 0 0 0 0 0 0 0 0 0 0 0 0 0 0 0 0 0 0 0 0 0 
0 0 0 -1410.34 0 0 0 0 0 0 451.75 0 0 1423.76 0 0 0 0 0 0 2415.77 0 0 1819.74 0.05 92.8526 0 0 0 0 1787.7 0 0 2008.19 0 0 0 0 0 0 0 0 0 0 0 0 2274.16 0 0 0 0 -576.113 0 0 0 0 0 
-2419.58 1396.3 -1403.01 1671.27 -73.0155 -1524.63 1200.98 0 0 210.654 0 0 1286.13 0 0 0 -1360.74 0 0 262.535 -301.599 990.249 0 0 -575.961 0 481.506 0 2149.95 0 0 0 0 0 0 0 0 0 0 0 0 0 -769.601 644.627 0 0 0 0 0 0 0 0 0 0 0 0 0 
-123.981 0 0 0 0 1478.7 0 1815.62 -1843.85 -1232.87 0 0 0 0 0 0 0 0 0 0 0 0 -2340.85 -129.475 0 824.839 0.02 0 0 2429.96 811.106 0 0 1081.8 0 0 0 0 0 0 0 0 0 0 0 0 0 0 0 0 0 0 0 0 0 0 0 
0 -2453.31 0 0 0 0 0 2431.64 0 0 1613.9 820.719 0 328.761 0 0 61.7237 -1870.56 0 0 0 0 0 -399.564 0 0 0 0 1338.01 -270.318 0 0 0 139.546 0 123.524 0 0 0 0 0 0 0 0 1018.02 455.26 435.118 0 0 0 0 0 0 0 0 -1162.53 0 
0 -1704.69 94.2259 0 0 -1158.56 0 0 66.4541 1717.81 0 1578.65 1971.88 0 -1864.45 1582.16 0 0 0 -2255.09 0 0 -771.432 2414.09 0 2106.46 0 -1517 0.02 1067.46 0 0 0 0 -148.854 0 0 0 0 0 0 0 0 0 0 0 1359.37 1622.44 0 0 0 0 0 973.464 0 0 0 
0 0 0 0 0 0 0 1151.23 0 -1347.16 0 0 0 1271.32 0 907.086 2435.15 0 2461.7 295.038 -588.168 974.075 -2374.42 0 0 0 1317.41 -220.573 -266.655 0.04 0 0 1761.6 0 2436.83 0 0 0 0 0 0 0 0 0 0 0 0 0 0 0 0 0 0 0 0 0 0 
0 2401.43 0 0 -767.159 1855.91 0 -11.8259 352.26 -687.811 0 0 0 0 0 2308.34 0 0 0 0 0 0 -2140.95 0 1901.38 0 -983.993 0 0 0 0.04 -1265.98 0 0 381.252 -1470.46 1452.3 0 0 0 0 2104.63 2217.09 -2224.72 918.989 0 0 0 0 0 0 0 -18.54 0 0 0 0 
2382.5 0 0 0 -486.847 0 0 0 0 -293.97 0 121.845 1630.38 -1560.64 -1084.09 0 0 0 -750.984 0 0 0 0 0 0 0 0 0 0 0 677.74 0.09 -62.3341 0 -1801.89 -345.088 0 0 -247.276 0 0 0 0 0 0 0 0 0 0 0 2075.33 0 15.6407 0 0 0 0 
0 1841.87 0 0 0 0 1412.78 -2455.44 0 2126.76 0 0 0 0 0 0 0 0 0 0 1864.6 1913.43 0 2203.51 0 0 0 0 0 2441.71 0 -1071.58 0.06 -998.947 1975.69 0 0 2335.2 0 0 0 0 0 0 0 0 0 0 0 0 0 2355.95 0 -53.4837 1572.85 0 0 
0 140.614 297.021 0 0 0 0 866.039 0 0 2251.43 0 -10.9104 0 1152.61 0 0 2370.3 0 0 0 0 2318.72 0 1195.79 0 1337.09 -699.866 0 0 0 0 1805.09 0.07 0 0 0 378.811 -2397.61 0 0 0 0 0 2053.51 -2313.68 0 0 0 0 0 0 0 0 0 0 0 
0 0 -541.169 0 0 2326.96 -891.522 -790.201 0 -1925.49 1532.11 0 0 -2309.87 1190.6 -94.2259 1688.97 0 0 -2475.13 0 0 0 0 0 0 0 0 1840.49 918.989 1217.92 -2261.04 1943.49 0 0.01 0 2346.95 0 -2019.18 0 0 -470.977 0 0 0 0 0 0 0 0 0 1929 0 0 0 0 0 
0 0 0 0 1481.44 0 0 0 -1164.66 0 0 0 0 0 0 0 0 0 0 0 -384.61 2139.73 0 2154.99 0 0 0 221.488 0 0 2169.79 1862.16 0 0 0 0.02 0 0 0 0 0 0 0 0 0 0 0 0 0 0 0 0 0 0 0 0 0 
0 2309.56 0 0 1645.18 0 1677.07 -2379.3 -2217.55 0 792.795 0 0 0 0 -255.211 1645.48 0 0 0 0 632.42 0 0 0 0 0 0 0 0 -533.082 0 0 0 1798.68 0 0.09 0 0 0 0 362.789 0 0 0 0 0 0 0 0 0 0 -898.999 0 0 0 0 
0 0 0 0 0 0 0 0 0 -1178.7 0 0 0 0 0 0 0 0 0 0 0 0 -651.036 0 0 0 0 0 0 0 0 0 2451.93 1468.47 0 0 0 0.09 1470.31 0 0 0 0 0 0 0 0 0 0 -2212.97 0 0 0 0 0 0 0 
0 0 0 0 0 0 0 0 0 0 751.9 0 0 0 1451.38 0 0 0 0 0 0 0 0 0 0 0 0 0 0 0 0 1798.99 0 685.369 -1466.03 0 0 2083.73 0.03 0 0 0 995.285 0 -1080.13 0 0 0 0 0 0 0 0 0 0 0 1425.6 
0 0 0 0 0 0 0 0 0 0 0 0 0 2259.82 0 0 0 0 0 322.657 0 -52.8733 0 0 0 0 0 0 0 0 0 0 0 0 0 0 0 0 0 0.04 0 0 0 0 0 0 0 0 0 0 0 0 0 0 0 0 0 
0 0 1727.12 0 0 -39.5978 0 0 0 0 956.832 0 0 -1182.82 0 0 0 0 1206.47 0 0 0 0 0 0 0 0 0 0 0 0 0 0 0 0 0 0 0 0 0 0 0 0 0 0 0 0 0 0 0 0 0 0 0 0 0 0 
0 0 0 0 2181.23 0 0 0 0 0 0 808.664 0 0 0 2398.22 0 0 0 0 0 0 0 0 0 0 0 0 0 0 -1199.61 0 0 0 510.651 0 -395.749 0 0 0 0 0.04 1466.03 0 0 2247.61 369.503 0 0 0 0 0 0 0 0 0 0 
0 0 0 0 0 0 0 0 0 0 0 0 0 0 1938.61 0 2239.52 0 0 0 0 1233.94 0 0 0 -485.168 0 0 0 0 2289.57 0 0 0 0 0 0 0 -1818.37 0 0 450.072 0.06 0 -2374.87 0 0 0 0 0 0 0 0 0 0 0 0 
0 0 0 0 0 0 0 0 0 0 0 0 0 0 0 0 1530.58 0 -2221.82 0 0 0 0 0 0 447.63 0 0 0 0 1098.28 0 0 0 0 0 0 0 0 0 0 0 0 0.01 0 0 2392.12 -1115.07 0 0 0 0 0 0 0 0 0 
0 0 0 0 0 0 0 0 0 0 0 0 0 0 0 0 0 0 0 0 0 0 -258.11 0 0 0 0 -709.479 0 0 -2008.35 0 0 598.544 0 0 0 0 2291.25 0 0 0 17.3193 0 0.06 0 0 0 0 1986.98 1034.81 -389.492 0 0 0 0 0 
0 -2328.79 0 0 0 0 0 0 1421.17 0 0 0 0 0 -967.971 0 0 -2306.36 0 0 0 0 0 0 0 0 0 2282.1 0 0 0 0 0 547.426 0 0 0 0 0 0 0 2448.12 0 0 0 0.08 0 0 0 0 0 0 0 0 -179.067 0 409.94 
0 0 0 0 1880.17 0 0 0 0 0 -2155.9 0 0 0 -931.806 0 0 0 -1206.78 0 0 0 0 0 415.738 0 0 2183.52 2128.9 0 0 0 0 0 0 0 0 0 0 0 0 1759.01 0 -1475.8 0 0 0.07 0 0 0 2201.07 0 0 -607.242 -860.24 0 0 
0 0 0 450.377 0 0 0 0 0 0 1207.85 0 0 0 0 0 603.885 0 0 0 0 2261.35 0 0 0 0 0 0 2466.58 0 0 0 0 0 0 0 0 0 0 0 0 0 0 -1569.95 0 0 0 0.01 0 0 0 -1822.95 0 0 0 0 0 
0 -1834.7 0 1891.77 0 0 0 0 0 1360.13 0 1538.51 0 0 0 0 0 0 0 0 0 2154.07 0 0 0 0 0 0 0 0 0 0 0 0 0 0 0 0 0 0 0 0 0 0 0 0 0 0 0.04 0 0 384.762 -338.832 0 0 0 0 
0 0 -551.546 0 0 0 0 0 0 0 447.783 0 0 0 0 0 0 2372.28 0 -267.418 0 0 0 0 0 0 0 0 0 0 0 0 0 0 0 0 0 2151.17 0 0 0 0 0 0 -1320.31 0 0 0 0 0.02 0 0 1186.03 0 0 1309.78 0 
831.401 0 854.289 0 0 0 0 0 0 0 0 1068.07 0 0 0 0 0 0 0 0 0 0 0 0 0 0 0 0 0 0 0 -829.875 0 0 0 0 0 0 0 0 0 0 0 0 558.87 0 567.263 0 0 0 0.07 0 0 0 0 0 0 
0 0 2365.11 0 0 0 0 -1142.84 0 0 2055.5 0 0 0 0 0 0 0 292.901 0 0 0 1742.38 0 -2206.26 0 0 0 0 0 0 0 1128.04 0 -233.238 0 0 0 0 0 0 0 0 0 -78.5089 0 0 717.109 2233.57 0 0 0.03 0 0 634.404 0 0 
0 0 0 0 0 0 0 0 0 -866.497 0 0 0 -603.275 0 0 0 -869.701 0 0 1846.29 0 0 0 0 0 0 0 0 0 -767.006 1933.42 0 0 0 0 1721.32 0 0 0 0 0 0 0 0 0 0 0 1841.26 -158.467 0 0 0.08 0 0 0 0 
0 0 0 0 0 0 0 0 -1567.2 0 0 0 0 0 0 0 0 0 0 -560.396 2325.59 0 0 0 0 0 0 0 -50.2792 0 0 0 785.165 0 0 0 0 0 0 0 0 0 0 0 0 0 1999.95 0 0 0 0 0 0 0.05 0 0 1699.96 
-515.229 -1848.58 0 0 0 0 0 0 0 0 0 0 0 0 0 0 0 0 0 -1188.92 -540.101 2202.75 -917.158 0 0 0 0 0 0 0 0 0 1502.04 0 0 0 0 0 0 0 0 0 0 0 0 241.325 1883.22 0 0 0 0 2066.79 0 0 0.02 0 0 
0 0 0 1636.33 0 1798.23 0 0 0 2024.83 403.684 61.2659 1706.21 0 0 0 679.113 0 0 -1296.81 0 0 0 0 0 0 0 -1435.36 0 0 0 0 0 0 0 0 0 0 0 0 0 0 0 0 0 0 0 0 0 -2115.77 0 0 0 0 0 0.05 0 
0 0 0 0 0 1788.16 0 0 0 0 0 0 -224.235 0 0 0 0 0 0 2465.51 0 0 0 0 0 0 0 0 0 0 0 0 0 0 0 0 0 0 -1094.01 0 0 0 0 0 0 -1688.51 0 0 0 0 0 0 0 1222.04 0 0 0.09 
