*Vertices 70
*Matrix 
0.09 874.584 0 0 0 0 0 0 2453.76 0 0 0 1521.12 0 0 1467.71 201.346 0 0 0 0 0 0 -853.221 546.815 0 0 -1843.39 0 0 902.356 0 0 0 -1159.17 0 0 0 0 0 886.029 0 0 0 1772.44 0 0 0 0 0 -1398.89 0 2307.58 360.195 0 0 0 0 0 0 0 0 0 0 0 0 -2259.06 0 0 0 
-1775.8 0.02 0 0 0 1786.94 0 0 0 0 2387.69 0 0 0 207.45 0 0 0 0 0 0 2187.03 0 0 -1804.64 0 0 0 0 0 0 0 0 0 0 0 0 0 1192.28 0 -1997.21 0 0 0 0 1204.18 0 0 0 0 0 0 230.644 0 0 -857.799 0 0 0 0 0 0 0 0 0 0 0 0 0 0 
0 0 0 -725.959 0 0 0 -10.1474 0 -1818.22 -801.035 2450.71 0 1867.05 305.567 0 0 0 0 2452.85 0 0 -1911.6 0 1124.38 0 1883.68 0 0 0 0 0 0 0 0 0 0 0 0 0 0 1294.06 428.098 0 0 0 0 0 -2058.24 0 0 0 0 0 0 0 0 0 0 0 1607.03 -304.041 0 0 0 -774.483 1417.05 0 0 -1018.78 
0 0 1925.95 0.02 0 0 0 0 1806.77 0 0 0 0 0 0 0 186.85 -131.306 1877.88 0 2410.73 0 0 0 -1428.95 0 1083.64 0 71.9474 0 0 0 0 0 0 0 0 0 0 0 0 0 0 0 0 0 0 0 0 0 814.463 0 0 0 0 0 0 0 0 1112.78 0 -2184.13 2454.99 -518.128 0 0 0 -1629.76 0 -1423.76 
0 0 0 0 0.07 357.906 0 0 0 0 2484.89 -1229.67 2113.48 0 0 0 0 1624.58 0 0 0 2486.88 0 2306.51 385.83 0 0 103.229 -662.633 1417.81 0 0 0 0 0 0 0 0 1402.4 0 0 -765.938 0 0 0 0 0 0 0 0 0 0 0 0 0 0 0 0 0 -1872.39 0 -857.646 0 0 0 -278.405 0 0 0 0 
0 2233.57 0 0 -1969.13 0.06 0 0 0 0 0 0 963.24 0 0 0 0 1379.67 0 2451.17 0 2052.45 0 0 0 0 0 -2351.07 733.284 0 0 0 0 0 650.273 0 0 0 0 0 0 0 0 0 0 -283.441 0 0 0 0 0 0 -2424.31 0 0 0 0 0 0 0 0 -334.254 0 0 0 0 0 0 0 0 
0 0 0 0 0 0 0.08 1028.55 0 0 319.605 0 0 0 0 0 0 0 0 2167.5 0 0 0 0 0 956.069 0 0 0 0 0 0 0 0 0 -1930.83 0 0 0 0 0 0 0 0 0 0 875.5 0 0 0 0 0 0 0 0 0 0 0 0 0 0 0 2362.51 0 0 0 -1062.12 0 0 0 
0 0 2408.14 0 0 0 1992.02 0.06 0 0 0 0 0 0 0 -322.352 0 0 0 0 0 0 0 -473.571 1351.74 0 1829.81 0 0 0 750.526 0 0 0 0 0 0 0 0 0 0 0 0 0 0 611.82 0 0 0 0 0 0 0 0 101.856 0 0 -391.934 361.415 0 0 0 0 0 0 0 0 0 0 0 
2447.66 0 0 1765.72 0 0 0 0 0.03 0 0 0 0 0 0 1771.22 0 460.906 0 0 -1068.07 0 0 0 0 0 0 0 0 0 0 0 0 0 940.046 0 2322.84 0 0 0 0 0 0 0 1751.38 0 0 0 -189.138 0 0 0 0 0 0 1805.4 0 0 0 0 0 0 0 0 0 0 0 0 0 0 
0 0 1945.63 0 0 0 0 0 0 0 1690.5 0 -855.358 0 937.605 0 1338.01 1047.17 0 -99.1089 0 1117.66 0 0 0 0 0 0 0 0 0 0 0 0 0 0 0 0 -2305.6 0 0 0 0 0 1926.4 0 0 0 0 0 0 0 906.629 0 0 0 0 0 0 0 0 0 0 0 0 0 0 0 0 0 
0 786.538 1038.93 0 -2305.14 0 1788.77 0 0 2249.29 0.01 0 0 0 0 0 0 -763.649 0 0 -2221.37 0 0 0 0 1539.28 0 0 0 -1287.19 0 0 1531.8 0 0 878.704 -403.531 0 0 0 0 0 0 0 0 0 0 0 224.693 0 0 0 0 0 0 0 0 0 0 0 0 0 0 -2034.29 0 0 0 0 0 0 
0 0 892.132 0 -507.447 0 0 0 0 0 0 0.03 0 1383.33 0 1859.72 1169.24 0 0 0 0 0 0 0 -2441.1 1878.19 0 0 0 1796.24 0 0 0 0 0 0 0 0 0 0 -547.121 0 0 0 0 0 0 1842.02 0 0 0 0 0 0 0 0 0 0 0 0 0 0 1109.12 0 0 886.486 0 0 0 0 
1102.25 0 0 0 1820.2 838.572 0 0 0 2207.63 0 0 0.01 0 0 0 0 0 0 0 -736.03 0 0 0 0 136.799 0 0 0 0 0 0 -839.488 0 0 0 0 0 0 0 0 0 1121.48 0 0 0 815.989 0 0 -1446.96 0 0 0 0 0 0 -430.845 0 0 0 0 0 0 1491.82 0 0 0 0 0 0 
0 0 1835.76 0 0 0 0 0 0 0 0 1506.62 0 0.08 0 0 0 0 0 1185.42 -553.987 0 0 0 -136.494 1792.58 1793.34 0 0 0 19.7607 0 0 222.098 0 0 0 0 0 0 0 0 0 2380.06 0 0 0 0 0 0 0 0 0 0 0 0 0 282.525 0 0 0 0 -2313.38 0 0 -1664.56 0 0 -2185.66 0 
0 386.288 1189.23 0 0 0 0 0 0 1202.51 0 0 0 0 0.05 0 0 1750.31 0 -1780.53 1668.98 0 -2413.17 0 0 0 0 -891.675 0 0 0 0 0 0 0 0 0 0 0 780.587 0 0 0 0 0 0 0 0 0 0 0 0 0 0 0 0 2277.83 0 0 0 827.128 0 0 0 0 0 0 0 -1427.12 1905.5 
2106.92 0 0 0 0 0 0 -95.294 2469.48 0 0 1732.92 0 0 0 0 1571.17 619.755 0 -1246.45 0 0 0 581.454 0 0 0 0 0 0 0 0 0 0 0 0 0 0 0 -1317.41 0 -2391.51 0 0 -1784.65 0 1783.58 0 0 0 0 0 0 0 0 0 0 0 0 0 0 -698.798 0 0 0 0 0 0 0 0 
266.503 0 0 1295.13 0 0 0 0 0 1303.06 0 110.706 0 0 0 2415.62 0.03 0 0 0 0 0 0 1694.16 -2057.33 0 0 -1930.37 0 577.181 0 0 0 0 0 0 0 0 0 0 -1453.67 0 0 0 0 0 -9.99481 0 0 0 0 1983.17 0 0 0 0 0 0 0 0 0 0 0 0 0 0 0 0 0 0 
0 0 0 -1080.74 2386.47 -597.324 0 0 -313.654 2067.86 -916.7 0 0 0 -2408.75 796.457 0 0.06 -739.692 0 0 2135.46 0 -1147.11 0 0 0 2302.24 0 0 0 0 129.017 378.048 0 0 0 0 0 0 0 0 0 0 0 0 0 0 1763.89 0 0 0 0 0 36.0881 0 0 -1148.64 0 0 0 0 0 0 583.743 0 0 0 0 616.398 
0 0 0 1604.28 0 0 0 0 0 0 0 0 0 0 0 0 0 671.636 0.05 456.328 -100.787 2074.42 0 0 0 0 0 631.504 0 313.196 0 0 0 0 0 2019.94 -1034.81 0 0 0 0 0 0 0 0 0 0 0 0 -1032.06 0 0 0 0 0 -2435 921.735 0 326.472 0 0 0 0 0 0 0 0 0 0 0 
0 0 1587.5 0 0 -2091.97 2336.12 0 0 87.9696 0 0 0 1591.77 970.717 452.513 0 0 -355.922 0.01 0 0 0 0 1397.82 0 0 -1769.84 -1296.04 0 0 0 0 0 0 0 0 0 0 0 0 0 0 0 0 0 439.695 0 0 0 0 0 0 0 0 -2080.98 0 2304.83 0 0 -2236.47 0 0 0 2004.84 0 0 0 0 0 
0 0 0 807.443 0 0 0 0 1457.49 0 -1456.72 0 766.701 1946.7 1238.98 0 0 0 541.475 0 0.09 0 0 0 0 0 1379.97 -1251.34 -1920.76 0 0 0 0 0 0 0 0 0 0 0 0 0 0 0 0 0 0 0 0 0 0 0 0 0 0 0 0 0 0 0 0 0 0 0 0 0 -386.135 0 0 0 
0 -349.971 0 0 2326.65 35.9355 0 0 0 2188.56 0 0 0 0 0 0 0 -1668.98 2165.82 0 0 0.05 -1128.35 0 0 0 0 0 0 0 0 0 0 0 0 0 0 0 0 0 0 0 0 0 0 0 0 0 0 0 0 0 0 0 0 0 0 0 0 0 0 -2278.89 0 0 0 0 0 0 0 0 
0 0 2429.81 0 0 0 0 0 0 0 0 0 0 0 1475.19 0 0 0 0 0 0 -1691.41 0.03 0 1710.33 0 0 858.867 0 0 0 1874.83 704.901 0 0 0 0 0 0 0 0 0 0 0 0 0 0 0 2118.37 0 0 0 0 0 -1118.73 0 727.79 -1556.37 0 0 0 0 488.525 0 0 0 0 0 0 0 
2271.87 0 0 0 819.498 0 0 -2111.5 0 0 0 0 0 0 0 2442.63 1970.05 -1053.58 0 0 0 0 0 0.06 0 1772.44 0 0 0 -2270.04 0 0 0 0 0 0 0 0 0 0 0 0 0 0 0 0 0 0 0 0 0 0 0 0 0 0 0 0 0 0 0 0 0 770.974 0 0 0 0 0 0 
1800.67 1716.13 1902.45 80.9503 -1065.94 0 0 444.273 0 0 0 425.199 0 -610.599 0 0 902.661 0 0 1955.7 0 0 -1229.51 0 0.06 0 0 -1135.21 0 2241.97 0 0 0 0 0 1099.81 -1478.39 0 0 0 0 0 0 -2332.76 0 0 0 0 0 0 0 0 0 0 0 0 0 0 0 0 0 0 0 0 0 -2377.01 0 0 878.399 0 
0 0 0 0 0 0 2165.82 0 0 0 203.635 -597.018 2363.28 491.882 0 0 0 0 0 0 0 0 0 434.66 0 0.06 2462.61 0 0 1260.95 0 0 2287.59 0 -1583.83 0 -2170.09 0 0 0 0 0 0 0 0 0 0 -933.485 0 0 0 0 -1260.34 0 0 0 0 0 -1905.04 0 0 0 0 0 0 0 0 0 0 0 
0 0 -134.816 991.318 0 0 0 351.955 0 0 0 0 0 -1893.9 0 0 0 0 0 0 95.5992 0 0 0 0 -465.026 0.03 401.242 0 0 1803.11 0 0 0 0 0 0 2254.94 0 0 -641.881 0 0 0 1175.5 0 0 1045.95 0 0 0 0 0 0 0 0 0 0 0 -583.743 0 0 0 0 0 0 0 0 388.577 0 
-1354.95 0 0 0 1734.75 1567.35 0 0 0 0 0 0 0 0 593.966 0 940.809 2115.92 1834.85 -852.306 1323.36 0 -1497.77 0 1297.11 0 2196.19 0.02 0 0 0 0 0 0 0 0 0 1101.79 0 0 0 0 0 -2155.9 0 0 0 0 0 0 0 0 0 0 0 0 0 0 0 0 0 0 0 0 0 0 0 0 0 0 
0 0 0 1945.02 728.706 -1400.11 0 0 0 0 0 0 0 0 0 0 0 0 0 2462.77 1396.6 0 0 0 0 0 0 0 0.09 0 0 0 0 0 0 0 0 0 0 0 0 0 0 0 0 0 -404.752 0 0 0 0 0 -2039.48 0 0 0 0 0 0 1555.76 0 0 0 0 0 0 0 0 0 1600.77 
0 0 0 0 1616.03 0 0 0 0 0 1572.54 922.498 0 0 0 0 -2118.98 0 -1625.03 0 0 0 0 581.149 400.021 2427.21 0 0 0 0.04 0 0 0 0 0 0 0 0 0 0 0 0 0 0 0 0 0 0 0 0 0 0 0 0 0 0 0 0 0 0 0 0 0 0 0 0 750.374 0 0 -81.8659 
333.644 0 0 0 0 0 0 1213.34 0 0 0 0 0 122.761 0 0 0 0 0 0 0 0 0 0 0 0 2360.07 0 0 0 0.07 -2444.91 0 0 0 -282.678 0 1897.56 0 280.694 0 0 0 0 0 0 0 0 0 0 0 0 0 0 0 0 0 0 0 998.337 0 0 0 0 0 0 0 0 0 0 
0 0 0 0 0 0 0 0 0 0 0 0 0 0 0 0 0 0 0 0 0 0 2016.28 0 0 0 0 0 0 0 944.929 0.04 0 1614.35 0 0 0 0 2057.33 0 0 617.313 0 0 973.464 0 0 0 0 0 0 0 0 0 0 0 0 452.818 0 0 0 -1933.27 0 0 2067.55 0 0 1369.14 0 0 
0 0 0 0 0 0 0 0 0 0 41.2763 0 2316.28 0 0 0 0 1130.79 0 0 0 0 2475.13 0 0 125.202 0 0 0 0 0 0 0.08 0 0 0 -2006.36 454.955 0 643.712 0 0 0 0 0 0 0 0 0 -488.067 0 0 0 0 0 0 -1590.55 0 0 0 0 0 0 0 0 0 0 0 0 0 
0 0 0 0 0 0 0 0 0 0 0 0 0 1866.13 0 0 0 1413.24 0 0 0 0 0 0 0 0 0 0 0 0 0 1293.15 0 0.03 0 0 0 0 0 -139.851 0 0 -1717.35 0 1329.92 0 0 0 0 758.766 0 0 0 0 0 0 0 0 0 0 0 0 0 0 0 0 0 0 0 0 
2384.03 0 0 0 0 1154.74 0 0 677.74 0 0 0 0 0 0 0 0 0 0 0 0 0 0 0 0 1392.64 0 0 0 0 0 0 0 0 0.08 0 0 0 0 0 0 657.598 0 839.03 787.606 0 0 0 1604.28 2196.95 0 1573.61 0 0 0 0 0 2388.61 0 0 0 0 0 0 0 0 0 -2434.84 0 0 
0 0 0 0 0 0 625.401 0 0 0 1958.3 0 0 0 0 0 0 0 447.02 0 0 0 0 0 1577.88 0 0 0 0 0 1029.62 0 0 0 0 0.03 0 730.384 0 0 0 0 0 0 0 0 0 0 0 0 0 57.7563 0 0 0 0 0 0 0 0 0 0 0 1507.54 0 0 0 535.066 0 0 
0 0 0 0 0 0 0 0 -277.795 0 -25.4067 0 0 0 0 0 0 0 2345.88 0 0 0 0 0 1684.85 1384.24 0 0 0 0 0 0 1572.24 0 0 0 0.03 2210.99 0 -1293.3 0 0 0 0 0 0 0 0 0 0 0 0 0 0 0 -1414.76 0 0 0 0 0 0 0 0 1132.16 0 0 0 0 0 
0 0 0 0 0 0 0 0 0 0 0 0 0 0 0 0 0 0 0 0 0 0 0 0 0 0 212.333 1488.77 0 0 1094.01 0 1042.89 0 0 -858.257 2062.67 0 0 0 0 0 897.32 0 0 0 0 0 0 0 0 0 0 0 0 -1863.69 0 0 0 0 0 0 0 0 0 -805.155 0 673.467 0 0 
0 2209.92 0 0 1078.3 0 0 0 0 184.866 0 0 0 0 0 0 0 0 0 0 0 0 0 0 0 0 0 0 0 0 0 1467.56 0 0 0 0 0 0 0.03 0 0 0 0 0 0 0 0 0 0 0 0 0 -1289.33 0 0 0 0 -860.851 0 0 868.328 0 0 0 0 0 0 0 -835.368 0 
0 0 0 0 0 0 0 0 0 0 0 0 0 0 15.4881 2309.72 0 0 0 0 0 0 0 0 0 0 0 0 0 0 261.925 0 1664.4 -1991.56 0 0 -543.001 0 0 0.06 0 0 0 0 0 -136.189 0 0 0 0 -2170.71 0 0 0 0 0 0 0 0 0 0 0 0 0 0 0 0 0 0 0 
-1339.08 1111.87 0 0 0 0 0 0 0 0 0 -929.365 0 0 0 0 2194.2 0 0 0 0 0 0 0 0 0 1271.78 0 0 0 0 0 0 0 0 0 0 0 0 0 0.03 0 -2215.26 0 0 0 0 0 0 0 1449.71 0 198.141 0 0 0 2218.47 0 0 0 0 0 0 0 -517.67 0 0 0 0 0 
0 0 -1819.9 0 316.095 0 0 0 0 0 0 0 0 0 0 1495.18 0 0 0 0 0 0 0 0 0 0 0 0 0 0 0 1892.53 0 0 2180.01 0 0 0 0 0 0 0.01 0 0 0 0 0 0 0 0 0 0 0 0 0 0 0 0 0 0 -981.552 0 0 0 0 0 0 0 0 0 
0 0 -1106.83 0 0 0 0 0 0 0 0 0 1140.71 0 0 0 0 0 0 0 0 0 0 0 0 0 0 0 0 0 0 0 0 -2382.5 0 0 0 1926.1 0 0 1862.16 0 0.03 659.124 0 0 0 0 0 379.269 0 0 0 0 0 0 0 1191.37 0 0 0 0 0 2490.39 33.6467 2194.97 0 464.263 0 0 
0 0 0 0 0 0 0 0 0 0 0 0 0 339.442 0 0 0 0 0 0 0 0 0 0 1677.68 0 0 1278.65 0 0 0 0 0 0 74.6941 0 0 0 0 0 0 0 1699.35 0.01 0 0 0 0 0 0 254.295 1310.54 0 0 0 0 1657.38 0 -1431.55 0 0 0 0 0 0 0 2227.62 0 2351.83 0 
-1310.24 0 0 0 0 0 0 0 1664.71 1604.28 0 0 0 0 0 1773.05 0 0 0 0 0 0 0 0 0 0 1318.02 0 0 0 0 415.738 0 -252.007 824.992 0 0 0 0 0 0 0 0 0 0.09 0 0 -209.433 0 0 0 0 -881.756 675.909 0 0 0 0 0 0 0 0 0 0 0 0 0 0 0 0 
0 -1224.63 0 0 0 -1304.74 0 917.92 0 0 0 0 0 0 0 0 0 0 0 0 0 0 0 0 0 0 0 0 0 0 0 0 0 0 0 0 0 0 0 1441.01 0 0 0 0 0 0.06 0 0 0 0 2175.44 0 0 0 0 0 0 0 0 0 0 0 0 0 0 0 0 0 0 0 
0 0 0 0 0 0 2381.59 0 0 0 0 0 -1955.55 0 0 1332.21 1615.12 0 0 1923.96 0 0 0 0 0 0 0 0 1519.44 0 0 0 0 0 0 0 0 0 0 0 0 0 0 0 0 0 0 0 0 0 0 0 -607.852 0 0 0 0 0 0 0 0 -223.472 0 0 0 0 0 0 411.008 0 
0 0 0 0 0 0 0 0 0 0 0 1904.89 0 0 0 0 0 0 0 0 0 0 0 0 0 2057.48 1617.1 0 0 0 0 0 0 0 0 0 0 0 0 0 0 0 0 0 -1305.81 0 0 0.06 0 0 0 0 0 0 0 0 0 0 0 0 0 0 0 0 1353.42 993.606 0 0 0 0 
0 0 -646.916 0 0 0 0 0 -2254.63 0 -1366.54 0 0 0 0 0 0 2364.65 0 0 0 0 2304.22 0 0 0 0 0 0 0 0 0 0 0 11.063 0 0 0 0 0 0 0 0 0 0 0 0 0 0 0 0 0 0 1896.95 0 0 0 0 0 0 0 0 0 0 0 1874.83 -1252.4 0 0 0 
0 0 0 0 0 0 0 0 0 0 0 0 -1827.68 0 0 0 0 0 2188.41 0 0 0 0 0 0 0 0 0 0 0 0 0 -1291.47 877.483 2390.59 0 0 0 0 0 0 0 -1140.71 0 0 0 0 0 0 0.02 0 0 0 0 0 0 0 0 0 622.806 0 0 0 0 0 0 0 0 0 0 
-332.118 0 0 1380.12 0 0 0 0 0 0 0 0 0 0 0 0 0 0 0 0 0 0 0 0 0 0 0 0 0 0 0 0 0 0 0 0 0 0 0 2370.91 1312.52 0 0 -1515.32 0 -318.69 0 0 0 0 0.03 0 0 923.719 0 0 0 0 0 0 0 0 78.6615 0 0 0 0 0 0 0 
0 0 0 0 0 0 0 0 0 0 0 0 0 0 0 0 1846.45 0 0 0 0 0 0 0 0 0 0 0 0 0 0 0 0 0 833.384 1450.93 0 0 0 0 0 0 0 139.698 0 0 0 0 0 0 0 0 0 0 0 0 0 0 0 0 0 0 0 0 0 0 0 0 0 0 
152.058 -101.093 0 0 0 -2280.88 0 0 0 -1175.8 0 0 0 0 0 0 0 0 0 0 0 0 0 0 0 2292.78 0 0 577.944 0 0 0 0 0 0 0 0 0 -2040.24 0 1991.1 0 0 0 -489.593 0 1306.42 0 0 0 0 0 0.08 0 0 0 0 0 0 0 0 0 0 0 0 250.481 0 0 0 0 
1091.72 0 0 0 0 0 0 0 0 0 0 0 0 0 0 0 0 0 0 0 0 0 0 0 0 0 0 0 0 0 0 0 0 0 0 0 0 0 0 0 0 0 0 0 283.898 0 0 0 2010.48 0 2217.09 0 0 0.04 0 0 0 0 -2281.95 0 -690.1 0 0 0 0 0 0 0 0 0 
0 0 0 0 0 0 0 2211.75 0 0 0 0 0 0 0 0 0 1518.22 0 0 0 0 -8.77407 0 0 0 0 0 0 0 0 0 0 0 0 0 0 0 0 0 0 0 0 0 0 0 0 0 0 0 0 0 0 0 0.05 0 0 0 0 0 0 0 1567.35 0 0 0 0 0 0 0 
0 -46.7696 0 0 0 0 0 0 2422.94 0 0 0 0 0 0 0 0 0 1971.72 -1007.34 0 0 0 0 0 0 0 0 0 0 0 0 0 0 0 0 1521.58 1234.7 0 0 0 0 0 0 0 0 0 0 0 0 0 0 0 0 0 0.07 0 0 -141.987 0 0 0 0 0 0 0 0 0 0 0 
0 0 0 0 0 0 0 0 0 0 0 0 -613.956 0 -18.9978 0 0 0 1855.3 0 0 0 -2403.26 0 0 0 0 0 0 0 0 0 953.932 0 0 0 0 0 0 0 714.515 0 0 2383.42 0 0 0 0 0 0 0 0 0 0 0 0 0.07 0 1870.4 0 673.772 0 0 0 0 0 0 0 0 0 
0 0 0 0 0 0 0 -1351.44 0 0 0 0 0 268.487 0 0 0 1745.89 0 261.773 0 0 758.461 0 0 0 0 0 0 0 0 784.249 0 0 -1038.93 0 0 0 2240.75 0 0 0 213.858 0 0 0 0 0 0 0 0 0 0 0 0 0 0 0.06 0 0 0 0 0 0 0 0 0 -310.144 0 0 
0 0 0 0 0 0 0 -1964.71 0 0 0 0 0 0 0 0 0 0 2103.41 0 0 0 0 0 0 1085.62 0 0 0 0 0 0 0 0 0 0 0 0 0 0 0 0 0 -1518.83 0 0 0 0 0 0 0 0 0 -2140.03 0 281.152 2050 0 0.04 0 2357.94 -1281.7 0 2071.83 0 0 0 0 -360.805 0 
0 0 0 -128.254 -1298.79 0 0 0 0 0 0 0 0 0 0 0 0 0 0 0 0 0 0 0 0 0 -94.3785 0 440.001 0 524.384 0 0 0 0 0 0 0 0 0 0 0 0 0 0 0 0 0 0 1262.02 0 0 0 0 0 0 0 0 0 0.07 0 0 0 0 0 0 0 0 1428.19 0 
0 0 1003.52 0 0 0 0 0 0 0 0 0 0 0 1524.32 0 0 0 0 1752.6 0 0 0 0 0 0 0 0 0 0 0 0 0 0 0 0 0 0 -511.261 0 0 96.82 0 0 0 0 0 0 0 0 0 0 0 838.267 0 0 178.61 0 -371.334 0 0.06 0 -2154.84 0 0 0 0 265.74 0 828.806 
0 0 -1571.17 1777.02 1945.48 -1271.32 0 0 0 0 0 0 0 0 0 -589.694 0 0 0 0 0 1960.89 0 0 0 0 0 0 0 0 0 -1365.78 0 0 0 0 0 0 0 0 0 0 0 0 0 0 1635.26 0 0 0 0 0 0 0 0 0 0 0 2028.49 0 0 0.04 0 0 0 674.535 -1077.07 0 0 0 
0 0 0 2382.66 0 0 922.04 0 0 0 0 -736.335 0 2061.75 0 0 0 0 0 0 0 0 606.021 0 0 0 0 0 0 0 0 0 0 0 0 0 0 0 0 0 0 0 0 0 0 0 0 0 0 0 1830.12 0 0 0 -832.621 0 0 0 0 0 1149.71 0 0.01 -395.444 0 0 0 0 0 -2387.23 
0 0 0 -1144.37 0 0 0 0 0 0 -516.297 0 1962.87 0 0 0 0 0 0 0 0 0 0 149.77 0 0 0 0 0 0 0 0 0 0 0 1255.76 0 0 0 0 0 0 2109.97 0 0 0 0 0 0 0 0 0 0 0 0 0 0 0 -2374.57 0 0 0 2370.45 0.02 0 0 0 0 130.39 0 
0 0 0 0 0 0 0 0 0 0 0 0 0 0 0 0 0 2034.59 0 2300.71 0 0 0 0 0 0 0 0 0 0 0 665.685 0 0 0 0 -1146.2 0 0 0 -378.506 0 -827.891 0 0 0 0 -2041.61 0 0 0 0 0 0 0 0 0 0 0 0 0 0 0 0 0.04 0 0 0 0 0 
0 0 1962.26 0 -1745.58 0 0 0 0 0 0 523.316 0 2456.21 0 0 0 0 0 0 0 0 0 0 1188.16 0 0 0 0 0 0 0 0 0 0 0 0 -263.604 0 0 0 0 2419.89 0 0 0 0 1278.65 -367.061 0 0 0 -478.759 0 0 0 0 0 0 0 0 -1509.37 0 0 0 0.08 -1353.88 0 0 0 
648.289 0 2000.72 0 0 0 1480.53 0 0 0 0 0 0 0 0 0 0 0 0 0 992.538 0 0 0 0 0 0 0 0 1313.59 0 0 0 0 0 0 0 0 0 0 0 0 0 -693.304 0 0 0 0 1277.28 0 0 0 0 0 0 0 0 0 0 0 0 -2265.77 0 0 0 1731.39 0.07 0 0 0 
0 0 0 -14.42 0 0 0 0 0 0 0 0 0 0 0 0 0 0 0 0 0 0 0 0 0 0 0 0 0 0 0 -2285.3 0 0 1793.95 2142.02 0 463.347 0 0 0 0 1643.19 0 0 0 0 0 0 0 0 0 0 0 0 0 0 -1060.14 0 0 1104.24 0 0 0 0 0 0 0.03 -1016.65 1560.49 
0 0 0 0 0 0 0 0 0 0 0 0 0 699.103 -1946.24 0 0 0 0 0 0 0 0 0 550.478 0 -2302.7 0 0 0 0 0 0 0 0 0 0 0 495.392 0 0 0 0 2360.53 0 0 1425.29 0 0 0 0 0 0 0 0 0 0 0 763.955 2227.16 0 0 0 494.171 0 0 0 920.667 0.04 0 
0 0 1004.9 63.2496 0 0 0 0 0 0 0 0 0 0 883.587 0 0 809.732 0 0 0 0 0 0 0 0 0 0 1126.82 -2028.95 0 0 0 0 0 0 0 0 0 0 0 0 0 0 0 0 0 0 0 0 0 0 0 0 0 0 0 0 0 0 -2491.91 0 2467.8 0 0 0 0 2362.67 0 0.04 
