*Vertices 61
*Matrix 
0.01 0 0 0 0 0 0 0 106.128 0 0 0 2075.18 0 886.029 1541.26 0 0 0 0 0 -199.515 0 0 0 0 0 0 0 0 0 0 0 0 0 0 718.94 0 -1034.04 0 0 0 0 0 0 1834.85 0 0 0 0 2434.84 0 0 0 0 0 0 0 -1912.52 800.577 0 
0 0.01 1408.96 0 0 428.251 0 0 467.009 2377.01 0 837.046 -28.6111 0 -757.088 0 0 0 0 0 0 877.636 134.053 0 0 -1250.11 1469.7 0 0 0 0 2246.85 0 0 0 0 0 0 1972.03 0 0 0 0 0 0 0 0 0 0 0 0 0 0 0 0 0 0 0 0 0 0 
0 -919.752 0.02 0 0 0 0 0 0 0 0 0 -1768.62 1516.24 0 0 0 0 0 0 0 0 2140.95 0 0 0 0 0 0 1768.32 -1901.68 0 1032.21 0 0 0 0 0 0 0 -1895.28 0 0 0 0 0 0 0 0 0 0 0 0 0 0 0 895.947 0 491.119 0 0 
0 0 0 0.04 0 2067.71 0 30.9 11.3681 0 0 0 2354.58 0 0 0 0 421.232 0 0 0 -2224.57 0 0 0 -1763.44 -82.7815 0 0 0 0 0 0 0 0 0 0 0 0 0 0 0 0 0 0 0 0 0 0 0 0 0 0 2282.1 0 0 0 0 0 0 0 
0 0 0 0 0.02 0 604.19 0 -184.713 0 0 2328.49 0 0 0 0 0 0 0 0 0 1038.32 0 0 2464.9 0 0 1560.64 0 0 -1302.3 0 0 0 0 0 0 0 0 0 1037.86 0 0 0 0 0 0 -2317.65 0 0 0 214.469 0 0 0 0 0 0 0 0 0 
0 2147.82 0 1669.9 0 0.04 1843.09 0 0 1982.86 0 0 -1412.93 0 655.004 0 -2388.45 0 0 0 0 0 0 0 0 0 0 0 0 -147.176 0 0 -920.515 0 0 0 0 0 0 0 0 0 0 0 0 0 0 0 2423.7 0 0 0 0 0 -716.651 0 0 0 0 0 0 
0 0 0 0 -857.189 365.535 0.04 0 462.889 0 0 0 0 0 0 -1533.48 0 0 2101.43 0 2023.61 0 0 0 0 1867.81 0 0 0 0 0 0 0 0 0 0 0 0 0 0 -111.316 0 0 1577.88 1228.45 14.8778 0 0 350.581 0 0 0 1832.1 0 1498.38 0 0 0 0 0 0 
0 0 0 1624.27 0 0 0 0.03 0 -51.9578 -987.045 0 576.571 -1941.97 1785.71 867.26 0 692.846 1883.98 0 0 0 0 692.846 0 0 0 0 0 0 0 0 0 0 0 -1307.95 0 0 0 -1200.83 0 0 0 0 0 -550.783 0 0 0 0 0 0 0 0 0 0 0 0 0 0 0 
1784.65 -2333.98 0 -750.526 924.787 0 -1839.43 0 0.03 0 0 0 2464.9 0 -368.13 0 -1355.56 2497.1 0 -1543.09 0 0 0 811.716 1001.69 0 1416.29 0 0 0 0 0 0 220.115 0 0 0 2227.16 0 0 0 0 0 0 984.603 0 0 0 0 0 0 -1941.66 0 2470.85 -713.904 -286.95 0 0 0 0 -677.282 
0 526.368 0 0 0 1642.74 0 967.36 0 0 0 0 0 0 0 0 0 573.824 0 0 -32.2733 -2443.69 0 0 1892.83 1146.81 0 0 0 0 0 0 0 0 0 0 0 0 0 0 0 2132.71 0 0 0 0 0 0 0 -628.3 0 0 2192.22 0 0 0 0 0 0 0 -1605.2 
0 0 0 0 0 0 0 -1492.13 0 0 0.09 0 0 0 1539.74 0 0 0 0 0 0 0 0 0 0 1972.33 0 0 0 0 0 0 0 0 0 0 0 0 1978.74 0 0 0 0 0 0 0 42.0392 0 0 0 0 -722.449 0 0 0 0 0 0 0 0 0 
0 690.405 0 0 -612.583 0 0 0 0 0 0 0.06 0 1662.42 0 -924.787 0 0 -1408.66 0 0 681.402 1715.67 0 335.322 -384.457 0 0 0 0 0 0 0 0 0 0 0 0 0 0 0 0 0 0 0 0 0 0 -228.507 0 0 0 0 0 0 0 1997.36 151.296 0 0 0 
-1864.3 -363.857 1253.62 2199.85 0 -788.98 0 1765.11 2177.27 0 0 0 0.02 -159.23 0 0 2031.39 0 0 0 0 0 1920.3 0 0 -1121.48 0 0 0 0 0 0 0 0 0 0 0 0 0 0 0 0 0 0 0 0 0 0 0 0 0 0 1093.86 0 502.106 0 0 0 0 0 0 
0 0 702.46 0 0 0 0 -2294.15 0 0 0 499.054 1404.39 0.02 2498.63 0 0 236.595 2327.42 -2296.14 2138.36 0 0 0 2214.04 0 40.5133 0 0 0 0 0 0 0 0 0 0 1114.76 0 0 0 0 112.232 0 0 0 0 0 0 0 0 0 -1112.17 0 0 0 0 0 0 0 0 
1956.62 1410.18 0 0 0 791.726 0 2249.44 -1721.32 0 -345.546 0 0 1572.54 0 804.086 0 -235.527 2451.17 0 0 0 0 0 0 0 0 0 0 0 0 0 0 0 -707.953 0 0 0 -1387.75 0 0 0 0 0 0 0 0 0 0 0 0 1182.67 0 0 0 0 0 0 0 0 0 
577.181 0 0 0 0 0 -1057.85 851.085 0 0 0 2356.87 0 0 242.241 0.09 1562.32 0 0 1480.38 0 -10.7578 0 0 0 0 2370.6 0 0 0 0 0 -713.446 0 0 0 0 0 0 0 0 0 0 0 0 0 0 0 0 0 0 0 0 0 0 0 0 0 0 0 0 
0 0 0 0 0 -617.161 0 0 1573 0 0 0 1764.5 0 0 2343.13 0 0 851.543 0 0 653.935 0 0 0 -1208.61 0 0 0 0 0 0 0 0 39.2926 0 0 0 0 0 0 0 0 0 0 0 0 0 -1322.14 0 0 0 0 0 0 0 0 -536.286 491.882 0 0 
0 0 0 -1944.11 0 0 0 505.463 -202.719 1602.91 0 0 0 -1213.49 -469.146 0 0 0.01 192.801 0 0 0 0 0 2320.09 0 1632.66 1376 0 0 0 0 850.78 0 -2014.15 0 0 20.3711 0 0 0 0 0 0 0 0 0 817.515 1661.2 0 0 -412.534 -1685.77 1748.63 0 -408.109 0 -2251.73 0 0 -2429.2 
0 0 0 0 0 0 1076.16 2095.02 0 0 0 105.823 0 351.039 -2442.47 0 2330.16 1516.24 0.05 0 0 0 0 0 0 2133.47 0 0 0 0 0 0 0 0 1975.08 0 -1212.73 0 0 0 0 0 0 0 0 0 0 0 -2202.9 0 0 0 0 0 0 0 0 0 0 0 0 
0 0 0 0 0 0 0 0 942.64 0 0 0 0 2286.83 0 1082.11 0 0 0 0.08 1523.56 0 0 0 0 0 0 0 0 -1874.52 0 0 0 0 0 0 0 0 0 0 0 0 -1032.67 0 0 0 2409.97 0 0 -2354.12 0 0 0 0 0 0 0 0 0 1557.74 0 
0 0 0 0 0 0 -2168.26 0 0 875.347 0 0 0 -302.515 0 0 0 0 0 2311.24 0.09 -1247.37 0 0 0 1889.32 1887.95 0 0 1855.3 0 0 0 0 0 0 0 0 0 0 0 -199.667 0 0 0 0 0 0 0 0 0 -1563.23 0 0 0 0 0 41.8867 0 0 0 
1753.21 1328.24 0 1929.76 -1169.09 0 0 0 0 2191.76 0 795.694 0 0 0 117.267 -960.036 0 0 0 1291.77 0.08 0 -784.555 -1832.41 0 0 0 0 0 0 0 0 0 853.679 0 0 0 0 0 0 -1768.93 0 0 -1934.49 0 2355.19 0 0 0 1580.32 0 0 0 0 0 0 0 0 0 0 
0 -67.5222 1797.31 0 0 0 0 0 0 0 0 1126.82 2417.91 0 0 0 0 0 0 0 0 0 0.07 0 0 -77.8985 0 -2188.41 2411.8 1570.86 0 0 0 -1382.26 0 0 0 0 0 0 -858.867 0 0 0 0 0 0 0 0 0 0 0 0 0 0 0 0 0 0 0 0 
0 0 0 0 0 0 0 1760.99 807.138 0 0 0 0 0 0 0 0 0 0 0 0 1565.07 0 0 0 0 1433.38 0 0 0 1207.24 0 0 0 0 0 0 0 0 0 0 2160.02 0 0 0 0 0 0 0 0 0 0 0 0 0 0 0 0 0 0 0 
0 0 0 0 1665.47 0 0 0 -829.569 2240.44 0 -911.359 0 -579.623 0 0 0 -2.36518 0 0 0 670.568 0 0 0.02 2016.74 0 0 0 0 0 -1103.93 0 0 0 0 0 0 0 0 0 0 0 0 0 0 0 0 0 0 0 0 0 -1007.64 0 0 691.626 0 0 0 -1596.8 
0 1456.42 0 -960.189 0 0 2425.08 0 0 1181.6 2492.98 1958.14 36.8511 0 0 0 1654.79 0 -1012.22 0 1654.03 0 925.703 0 -2110.74 0.01 -497.681 -574.587 0 0 0 0 0 0 0 0 0 -2491.76 109.333 0 0 0 0 0 0 -745.949 0 0 0 0 0 0 0 0 0 0 647.832 0 0 0 0 
0 2241.05 0 -352.26 0 0 0 0 1140.71 0 0 0 0 -557.039 0 -673.772 0 1196.71 0 0 -146.565 0 0 2187.49 0 2483.83 0.01 0 0 0 -1042.28 0 0 0 0 1895.73 0 0 0 0 0 0 0 0 0 0 0 -146.87 0 0 1912.37 0 0 -1731.85 0 0 0 0 0 -720.161 0 
0 0 0 0 1888.41 0 0 0 0 0 0 0 0 0 0 0 0 792.795 0 0 0 0 943.098 0 0 2496.49 0 0.07 -1615.73 0 0 0 0 0 0 0 -568.178 0 0 0 0 0 0 0 0 0 0 0 0 0 0 0 1467.86 0 0 914.563 1585.82 0 0 0 0 
0 0 0 0 0 0 0 0 0 0 0 0 0 0 0 0 0 0 0 0 0 0 1637.09 0 0 0 0 2329.71 0.08 0 0 0 1440.4 -1698.13 0 0 1160.39 0 0 -1520.51 0 0 1033.13 0 0 0 0 0 0 0 0 0 0 0 1099.35 0 0 0 0 0 0 
0 0 327.235 0 0 1939.68 0 0 0 0 0 0 0 0 0 0 0 0 0 2395.63 50.1267 0 2014.6 0 0 0 0 0 0 0.07 0 0 787.301 0 0 0 0 0 0 0 0 1448.48 2024.22 -1159.63 -829.112 0 0 0 0 0 0 0 0 0 0 0 0 0 0 0 0 
0 0 2404.32 0 2057.33 0 0 0 0 0 0 0 0 0 0 0 0 0 0 0 0 0 0 2475.89 0 0 1820.96 0 0 0 0.07 0 0 0 0 0 0 0 0 2131.64 -1299.4 0 0 606.021 0 0 0 -1426.21 -1415.37 0 -1093.55 0 0 0 0 0 0 -1625.19 0 0 0 
0 2450.41 0 0 0 0 0 0 0 0 0 0 0 0 0 0 0 0 0 0 0 0 0 0 -530.183 0 0 0 0 0 0 0.09 0 0 0 0 0 0 0 0 0 0 0 0 0 0 0 0 0 0 0 0 0 0 0 0 0 0 0 1468.93 1160.7 
0 0 2093.49 0 0 2466.12 0 0 0 0 0 0 0 0 0 1709.88 0 -1363.49 0 0 0 0 0 0 0 0 0 0 2227.16 702.155 0 0 0 0 0 0 0 0 0 0 0 0 -368.282 0 0 0 0 0 0 0 0 0 0 0 -1097.98 0 -1736.73 0 0 0 0 
0 0 0 0 0 0 0 0 -12.7415 0 0 0 0 0 0 0 0 0 0 0 0 0 893.201 0 0 0 0 0 2315.97 0 0 0 0 0.04 0 0 0 0 0 0 0 443.663 0 0 0 1626.56 0 0 0 0 0 0 0 0 0 0 0 0 0 0 0 
0 0 0 0 0 0 0 0 0 0 0 0 0 0 -314.57 0 -527.284 467.467 1305.35 0 0 2177.27 0 0 0 0 0 0 0 0 0 0 0 0 0.08 0 0 0 0 0 0 0 0 0 0 0 342.647 0 0 1731.85 0 0 0 0 0 0 0 0 0 -1013.14 0 
0 0 0 0 0 0 0 607.089 0 0 0 0 0 0 0 0 0 0 0 0 0 0 0 0 0 0 1994.92 0 0 0 0 0 0 0 0 0.02 0 0 0 0 0 0 0 1898.94 -2435.76 0 0 -978.195 2112.87 0 0 0 0 0 0 0 0 0 0 0 0 
-1535.46 0 0 0 0 0 0 0 0 0 0 0 0 0 0 0 0 0 -229.575 0 0 0 0 0 0 0 0 1699.96 2376.4 0 0 0 0 0 0 0 0.09 0 0 0 0 0 0 0 -951.338 665.99 0 0 0 1696.45 61.5711 0 0 -1824.93 0 0 0 0 0 0 0 
0 0 0 0 0 0 0 0 -1456.42 0 0 0 0 1723.76 0 0 0 2418.06 0 0 0 0 0 0 0 1772.13 0 0 0 0 0 0 0 0 0 0 0 0.05 0 -1728.03 0 0 -924.024 0 -101.093 0 1634.5 0 0 0 0 0 0 0 -565.127 0 0 0 0 0 0 
-84.7652 -672.857 0 0 0 0 0 0 0 0 1737.34 0 0 0 528.962 0 0 0 0 0 0 0 0 0 0 1896.04 0 0 0 0 0 0 0 0 0 0 0 0 0 0 0 0 1717.96 0 0 0 0 -2012.01 0 0 0 0 0 0 0 0 0 0 0 0 -222.251 
0 0 0 0 0 0 0 2263.02 0 0 0 0 0 0 0 0 0 0 0 0 0 0 0 0 0 0 0 0 2222.13 0 1885.2 0 0 0 0 0 0 -52.8733 0 0.04 0 0 0 0 -1504.79 0 2291.86 0 0 -2299.04 0 0 0 0 0 0 0 -2164.75 0 0 0 
0 0 1068.38 0 -1545.53 0 1617.71 0 0 0 0 0 0 0 0 0 0 0 0 0 0 0 573.824 0 0 0 0 0 0 0 2499.24 0 0 0 0 0 0 0 0 0 0.03 0 0 0 0 0 0 -1056.02 0 0 0 0 0 0 0 0 1447.11 0 0 0 852.153 
0 0 0 0 0 0 0 0 0 -1775.64 0 0 0 0 0 0 0 0 0 0 95.7518 1266.75 0 2386.62 0 0 0 0 0 -2000.72 0 0 0 1703.01 0 0 0 0 0 0 0 0.09 0 1535.62 0 0 0 0 0 0 0 0 1386.53 0 0 0 0 0 0 0 0 
0 0 0 0 0 0 0 0 0 0 0 0 0 -1215.93 0 0 0 0 0 -718.787 0 0 0 0 0 0 0 0 2320.86 1372.34 0 0 69.6585 0 0 0 0 2166.13 1925.34 0 0 0 0.09 0 0 0 0 0 0 -919.752 0 0 0 0 0 0 0 0 0 -1379.82 0 
0 0 0 0 0 0 -18.3874 0 0 0 0 0 0 0 0 0 0 0 0 0 0 0 0 0 0 0 0 0 0 -1923.35 864.055 0 0 0 0 1884.75 0 0 0 0 0 1593.3 0 0.09 0 0 0 0 0 0 0 0 0 0 0 0 0 -1459.17 1345.48 0 0 
0 0 0 0 0 0 1704.69 0 417.264 0 0 0 0 0 0 0 0 0 0 0 0 -2390.9 0 0 0 0 0 0 0 -2132.1 0 0 0 0 0 2403.41 2044.51 1289.64 0 -1077.38 0 0 0 0 0 0 -1048.08 0 0 0 0 0 0 0 0 0 0 0 0 0 0 
-1205.86 0 0 0 0 0 1814.71 1305.66 0 0 0 0 0 0 0 0 0 0 0 0 0 0 0 0 0 1876.66 0 0 0 0 0 0 0 -2278.59 0 0 92.5474 0 0 0 0 0 0 0 0 0.06 0 0 0 0 1040.91 0 0 0 0 0 0 0 0 0 0 
0 0 0 0 0 0 0 0 0 0 237.663 0 0 0 0 0 0 0 0 -347.682 0 2240.29 0 0 0 0 0 0 0 0 0 0 0 0 -1384.24 0 0 2398.53 0 2336.42 0 0 0 0 2257.99 0 0.09 0 0 0 0 0 0 0 0 1361.05 0 0 0 0 0 
0 0 0 0 -702.46 0 0 0 0 0 0 0 0 0 0 0 0 253.38 0 0 0 0 0 0 0 0 1551.48 0 0 0 1479.77 0 0 0 0 561.312 0 0 708.106 0 -2333.52 0 0 0 0 0 0 0.02 0 0 0 0 0 803.018 0 0 0 0 0 0 -1880.63 
0 0 0 0 0 -1468.32 2217.86 0 0 0 0 -226.829 0 0 0 0 -1204.34 2459.56 458.77 0 0 0 0 0 0 0 0 0 0 0 747.475 0 0 0 0 -554.75 0 0 0 0 0 0 0 0 0 0 0 0 0.02 0 0 0 0 0 0 0 0 0 0 0 0 
0 0 0 0 0 0 0 0 0 2047.41 0 0 0 0 0 0 0 0 0 1464.96 0 0 0 0 0 0 0 0 0 0 0 0 0 0 474.334 0 785.47 0 0 -477.691 0 0 -1481.44 0 0 0 0 0 0 0 0 0 0 0 -1096.45 0 0 0 0 0 0 
1351.28 0 0 0 0 0 0 0 0 0 0 0 0 0 0 0 0 0 0 0 0 273.98 0 0 0 0 1685 0 0 0 2068.77 0 0 0 0 0 -1376.61 0 0 0 0 0 0 0 0 -1247.98 0 0 0 0 0.07 39.903 -1764.05 0 0 0 0 0 0 0 0 
0 0 0 0 1774.42 0 0 0 939.894 0 1650.06 0 0 0 2438.35 0 0 -907.697 0 0 -1060.59 0 0 0 0 0 0 0 0 0 0 0 0 0 0 0 0 0 0 0 0 0 0 0 0 0 0 0 0 0 -1707.13 0.04 0 0 0 0 0 0 0 0 0 
0 0 0 0 0 0 1202.66 0 0 2094.87 0 0 -42.497 1640.14 0 0 0 -829.112 0 0 0 0 0 0 0 0 0 -1486.63 0 0 0 0 0 0 0 0 0 0 0 0 0 2288.81 0 0 0 0 0 0 0 0 -990.097 0 0.03 0 0 0 0 53.7889 0 0 0 
0 0 0 2334.44 0 0 0 0 2048.17 0 0 0 0 0 0 0 0 1677.07 0 0 0 0 0 0 1558.05 0 -402.921 0 0 0 0 0 0 0 0 0 1775.03 0 0 0 0 0 0 0 0 0 0 -827.281 0 0 0 0 0 0.05 0 681.402 0 0 0 552.614 0 
0 0 0 0 0 2113.79 2179.86 0 2360.53 0 0 0 -1396.76 0 0 0 0 0 0 0 0 0 0 0 0 0 0 0 1492.89 0 0 0 517.518 0 0 0 0 2339.17 0 0 0 0 0 0 0 0 0 0 0 978.805 0 0 0 0 0.08 0 0 0 0 0 0 
0 0 0 0 0 0 0 0 -688.269 0 0 0 0 0 0 0 0 -527.894 0 0 0 0 0 0 0 0 0 371.029 0 0 0 0 0 0 0 0 0 0 0 0 0 0 0 0 0 0 -862.377 0 0 0 0 0 0 2337.03 0 0.06 0 0 -139.088 0 0 
0 0 601.596 0 0 0 0 0 0 0 0 1570.86 0 0 0 0 0 0 0 0 0 0 0 0 -190.359 869.549 0 1659.52 0 0 0 0 -1109.27 0 0 0 0 0 0 0 -1026.41 0 0 0 0 0 0 0 0 0 0 0 0 0 0 0 0.05 0 2427.98 0 194.327 
0 0 0 0 0 0 0 0 0 0 0 2483.67 0 0 0 0 -872.295 2171.62 0 0 2386.47 0 0 0 0 0 0 0 0 0 910.291 0 0 0 0 0 0 0 0 -672.094 0 0 0 -512.024 0 0 0 0 0 0 0 0 517.975 0 0 0 0 0.06 0 0 0 
619.449 0 1098.28 0 0 0 0 0 0 0 0 0 0 0 0 0 -86.2911 0 0 0 0 0 0 0 0 0 0 0 0 0 0 0 0 0 0 0 0 0 0 0 0 0 0 2159.72 0 0 0 0 0 0 0 0 0 0 0 1417.51 416.044 0 0.05 0 0 
1771.83 0 0 0 0 0 0 0 0 0 0 0 0 0 0 0 0 0 0 2182.15 0 0 0 0 0 0 1207.39 0 0 0 0 -1017.26 0 0 1070.82 0 0 0 0 0 0 0 798.288 0 0 0 0 0 0 0 0 0 0 2173.91 0 0 0 0 0 0.03 0 
0 0 0 0 0 0 0 0 1947.92 749.458 0 0 0 0 0 0 0 1354.64 0 0 0 0 0 0 -1647.62 0 0 0 0 0 0 -223.624 0 0 0 0 0 0 1546.91 0 -402.768 0 0 0 0 0 0 778.603 0 0 0 0 0 0 0 0 2141.41 0 0 0 0.09 
