*Vertices 67
*Matrix 
0.01 0 0 0 0 0 0 0 0 0 0 0 0 0 1462.98 0 0 0 0 0 0 0 347.987 1287.96 -2070.76 0 0 0 0 0 0 0 0 0 0 0 0 0 0 0 2392.57 0 -341.731 0 0 0 0 0 0 0 0 0 0 0 2352.75 0 938.673 0 0 1846.6 0 0 0 0 0 0 0 
0 0.04 0 0 0 0 665.532 0 0 0 0 0 0 0 0 0 0 1974.17 0 0 0 0 0 801.187 0 0 0 0 0 0 0 0 1072.8 0 0 0 0 0 0 0 -1506.01 0 -1614.81 0 0 0 0 0 2107.07 0 0 0 0 0 0 0 0 0 0 0 0 0 0 0 0 0 0 
0 0 0.08 0 0 0 -613.346 0 0 0 0 0 0 0 0 0 0 0 0 0 0 0 0 0 0 0 0 2369.08 0 0 0 0 2229.76 875.042 0 0 0 0 918.989 0 0 1028.7 0 0 0 0 0 0 0 0 0 0 0 0 0 -1358 0 0 0 0 0 0 0 0 0 0 0 
0 0 0 0.04 0 0 1981.19 0 0 0 0 0 0 0 0 0 -261.01 0 0 0 0 0 0 1070.36 0 -133.137 0 0 0 0 0 0 0 0 0 0 1526.76 0 0 2304.07 0 0 0 0 0 1436.12 0 -975.906 0 0 0 0 0 0 -1192.43 0 0 1616.64 0 0 0 0 0 -2169.03 -1142.08 0 0 
0 0 0 0 0.02 0 1319.24 0 0 0 0 0 0 0 0 0 0 0 0 0 0 0 -19.4555 0 0 0 716.956 0 0 0 0 0 0 0 0 0 0 0 0 0 0 1628.85 0 2464.45 0 0 199.667 638.829 0 1632.05 0 0 0 0 0 0 0 0 1372.8 0 0 0 0 0 -640.812 0 0 
0 0 0 0 0 0 0 0 0 0 0 0 0 0 0 0 0 0 0 0 0 0 0 0 0 0 0 0 0 0 0 0 0 -836.741 0 0 0 0 0 0 0 0 0 0 0 0 0 0 2335.2 377.59 0 0 667.058 0 0 0 0 2477.72 0 1643.35 0 0 0 0 0 1684.7 0 
0 -1665.32 2013.38 838.267 -398.495 0 0.07 0 -2056.11 0 2336.73 1763.89 0 0 0 0 0 0 0 0 0 25.4067 0 0 -906.476 0 0 0 0 0 0 0 0 0 0 0 474.792 0 0 0 0 0 0 0 0 0 493.408 0 0 0 258.415 0 0 0 0 0 0 0 0 0 0 0 0 0 0 0 48.9059 
0 0 0 0 0 0 0 0.04 0 458.312 0 1412.47 0 0 0 0 0 792.795 2268.06 0 0 0 0 0 0 0 0 0 0 0 0 0 0 0 -1672.95 0 0 -1381.19 0 0 0 -2151.94 0 0 0 0 0 0 0 0 0 0 0 0 0 0 0 0 0 0 0 0 0 0 0 192.953 0 
0 0 0 0 0 0 1718.42 0 0.09 0 0 0 0 0 -2397 2391.66 0 0 0 1155.51 0 0 0 1308.71 -1338.62 0 0 0 0 0 0 0 -2294 0 0 0 0 0 0 0 0 0 0 0 0 0 0 0 0 0 0 1249.2 0 1041.37 0 0 0 0 847.575 0 0 0 0 0 0 0 0 
0 0 0 0 0 0 0 1542.48 0 0.05 0 0 0 0 1034.35 662.633 0 0 0 0 0 0 0 0 0 -1960.74 0 0 0 0 0 0 0 0 0 0 -95.1415 0 0 0 0 0 -469.604 1644.57 0 2354.73 0 0 0 0 0 0 -1357.23 0 -168.844 0 0 0 0 0 322.657 0 2377.47 0 1554.99 0 0 
0 0 0 0 0 0 1732.46 0 0 0 0 0 737.861 0 0 0 0 0 0 0 1323.66 0 0 0 0 0 -1041.06 2030.93 -1712.93 0 0 0 0 0 0 0 0 0 0 1881.24 -827.738 0 0 0 0 0 0 0 0 0 0 0 2194.51 0 0 0 0 0 0 0 0 0 0 0 0 0 0 
0 0 0 0 0 0 1011.92 931.501 0 0 0 0.06 0 0 0 0 0 0 2112.26 0 0 0 0 1601.69 0 -35.1726 0 0 0 0 0 0 -604.343 -2317.65 0 0 1537.6 -1398.59 0 0 0 0 0 0 -86.4437 0 0 0 0 0 0 0 425.962 0 2409.67 0 0 0 1112.17 0 0 0 0 -564.974 0 -805.765 -1409.42 
0 0 0 0 0 0 0 0 0 0 2392.57 0 0.06 0 0 0 0 0 0 -1923.2 0 0 0 0 0 0 0 0 -1274.53 0 597.781 0 0 0 0 0 0 1268.88 93.9207 0 0 507.447 -2030.93 0 0 1921.98 0 0 0 0 0 0 526.215 -2003.01 0 0 0 0 0 0 0 0 1476.56 0 0 0 0 
0 0 0 0 0 0 0 0 0 0 0 0 0 0.08 0 0 0 0 0 1454.44 1300.32 0 0 0 0 0 0 0 1075.7 0 0 0 0 0 0 0 0 0 0 0 0 0 0 -2162.62 0 1575.75 0 0 0 0 1281.85 0 0 0 0 0 0 0 0 0 0 0 -890.149 0 0 0 0 
-1110.49 0 0 0 0 0 0 0 -599.918 592.746 0 0 0 0 0.01 0 0 0 0 0 2444.91 0 0 0 -121.387 0 0 0 0 0 2450.87 0 0 -1475.8 0 0 0 0 0 0 0 0 0 1354.64 -267.418 0 0 0 0 0 0 0 0 0 -2004.99 0 0 0 2003.31 0 0 0 0 0 -882.214 0 0 
0 0 0 0 0 0 0 0 2072.89 1580.94 0 0 0 0 0 0.06 0 0 0 0 2095.02 0 0 0 0 0 -2033.52 0 0 -488.983 0 0 0 1405.3 1639.68 0 0 0 0 1551.48 -686.895 0 570.925 0 0 1512.27 0 0 0 -695.593 2451.93 0 1385.92 0 0 -1220.97 0 -1013.9 0 0 0 -1795.94 0 0 -1981.34 0 0 
0 0 0 1985.92 0 0 0 0 0 0 0 0 0 0 0 0 0.09 0 0 0 0 -1435.67 0 -1256.07 0 0 0 0 0 0 0 0 0 0 0 0 0 0 0 0 0 0 0 1394.16 0 0 -1431.85 0 0 0 -1089.74 0 0 0 0 0 2215.57 0 0 0 0 0 0 0 0 0 0 
0 -901.44 0 0 0 0 0 1570.56 0 0 0 0 0 0 0 0 0 0.02 0 0 -1200.06 0 0 0 0 0 0 179.983 0 0 0 0 0 0 0 0 0 0 1229.97 0 0 0 2328.18 1066.09 0 1828.9 0 0 0 -766.854 0 0 0 0 0 0 352.107 0 0 0 0 0 0 0 0 0 1578.04 
0 0 0 0 0 0 0 -2483.67 0 0 0 1053.58 0 0 0 0 0 0 0.02 0 0 0 0 0 0 0 0 -1987.29 0 0 0 0 0 195.7 0 0 2133.93 0 0 0 0 0 0 0 0 0 2267.45 0 0 0 0 0 0 -1648.08 0 0 0 0 0 0 775.094 1490.75 0 0 0 0 0 
0 0 0 0 0 0 0 0 -925.703 0 0 0 646.001 -459.227 0 0 0 0 0 0.02 0 0 0 0 0 0 0 0 0 0 0 0 0 0 0 0 0 1387.75 0 0 382.168 2286.22 0 0 1914.96 0 0 0 1358.76 0 0 -215.384 0 0 0 840.098 0 0 0 0 0 0 0 0 0 0 0 
0 0 0 0 0 0 0 0 0 0 -1204.18 0 0 -2243.19 1323.21 -190.207 0 -893.353 0 0 0.09 0 0 0 0 0 1495.18 0 0 2016.28 0 0 0 0 0 1583.07 0 0 0 0 0 972.396 0 -2159.57 0 0 0 0 0 0 0 0 0 0 0 0 0 0 1622.29 0 0 0 0 0 0 0 0 
0 0 0 0 0 0 992.691 0 0 0 0 0 0 0 0 0 -93.3103 0 0 0 0 0.05 -554.598 0 -1004.59 0 0 0 0 0 2466.43 0 0 1339.08 0 0 -1038.93 0 0 0 0 0 0 0 0 0 0 0 0 1002.46 -1279.41 0 0 547.121 0 0 0 0 0 0 0 -1059.37 0 0 0 0 0 
2464.45 0 0 0 -613.804 0 0 0 0 0 0 0 0 0 0 0 0 0 0 0 0 2155.75 0.02 0 0 0 79.7296 -416.959 0 0 0 0 0 0 0 0 2137.29 0 0 0 0 0 0 0 0 0 0 0 0 0 0 0 -1197.47 2145.07 0 0 0 0 0 -1611.3 0 0 0 0 0 0 0 
1184.19 1062.88 0 -2047.26 0 0 0 0 2247.76 0 0 -21.897 0 0 0 0 1052.81 0 0 0 0 0 0 0.08 0 0 0 0 0 0 0 0 0 333.338 1868.27 563.448 0 0 0 0 1419.34 0 0 0 -85.2229 0 0 0 0 2333.52 0 0 0 0 0 0 0 0 0 0 0 0 0 0 0 -2362.36 0 
-651.952 0 0 0 0 0 -1796.55 0 346.767 0 0 0 0 0 975.143 0 0 0 0 0 0 2186.42 0 0 0.06 0 0 0 0 0 0 0 1255.3 -811.258 0 0 0 65.6911 0 0 0 0 -893.506 0 0 0 0 1312.22 0 0 64.7755 0 0 0 0 0 0 0 0 0 1228.6 0 0 -264.367 0 0 0 
0 0 0 1931.9 0 0 0 0 0 -2318.11 0 1717.2 0 0 0 0 0 0 0 0 0 0 0 0 0 0.03 0 0 479.064 0 0 0 0 0 0 0 0 0 0 0 0 0 0 0 2129.66 0 1155.05 0 1355.1 0 0 0 0 0 0 0 0 1291.47 0 0 1808.3 0 0 0 -376.522 0 0 
0 0 0 0 -2135.46 0 0 0 0 0 2269.13 0 0 0 0 801.645 0 0 0 0 616.55 0 404.447 0 0 0 0.03 0 0 0 0 0 0 0 2043.29 0 0 0 0 0 0 0 0 0 0 0 0 0 0 0 0 0 0 0 0 0 0 0 -2327.57 0 0 1383.79 0 0 2484.59 1892.22 2107.84 
0 0 -1211.66 0 0 0 0 0 0 0 -346.614 0 0 0 0 0 0 1835 845.286 0 0 0 1962.42 0 0 0 0 0 0 0 0 29.8318 -1717.05 0 22.9652 0 0 0 0 2451.02 1629.92 0 0 0 0 0 0 0 0 0 0 0 0 0 0 0 -1220.66 0 0 2325.89 0 0 0 0 0 0 0 
0 0 0 0 0 0 0 0 0 0 1848.28 0 1923.35 682.012 0 0 0 0 0 0 0 0 0 0 0 415.433 0 0 0.03 0 0 0 0 0 0 -1833.32 0 0 0 0 0 0 0 0 0 0 -242.851 0 0 0 0 2037.19 0 0 0 0 0 0 0 0 0 0 0 0 0 -736.183 0 
0 0 0 0 0 0 0 0 0 0 0 0 0 0 0 2291.86 0 0 0 0 -918.378 0 0 0 0 0 0 0 0 0.08 0 0 0 0 0 0 0 63.86 0 0 0 0 0 0 -37.1563 -1374.94 0 950.27 0 0 -86.4437 0 1441.47 -1415.07 919.599 0 2199.55 0 0 -64.6229 0 0 0 0 0 0 0 
0 0 0 0 0 0 0 0 0 0 0 0 -1747.41 0 -1158.86 0 0 0 0 0 0 1956.01 0 0 0 0 0 0 0 0 0.08 0 0 0 0 0 -993.454 0 657.445 0 0 0 0 0 0 0 0 0 1557.44 0 1021.38 0 0 0 0 0 0 0 0 0 0 0 0 0 0 0 0 
0 0 0 0 0 0 0 0 0 0 0 0 0 0 0 0 0 0 0 0 0 0 0 0 0 0 0 1177.63 0 0 0 0.04 0 0 0 0 0 0 0 0 0 0 0 0 0 0 0 1367.61 0 0 0 0 0 -188.986 0 0 0 0 0 0 1765.88 0 0 0 2094.26 0 0 
0 2363.28 2060.69 0 0 0 0 0 -1056.32 0 0 -1314.97 0 0 0 0 0 0 0 0 0 0 0 0 1516.24 0 0 305.261 0 0 0 0 0.01 -473.418 0 0 0 0 0 0 0 0 -2233.27 0 -1474.43 0 2397 0 0 0 0 0 0 43.8704 0 0 0 0 0 0 0 0 0 0 0 0 0 
0 0 2351.37 0 0 369.961 0 0 0 0 0 1290.7 0 0 1976.76 217.978 0 0 -119.556 0 0 -772.195 0 1928.24 1386.23 0 0 0 0 0 0 0 -1321.53 0.08 0 2085.71 506.378 0 0 -1333.43 0 0 0 0 0 0 0 0 0 0 0 0 0 0 0 0 0 0 0 0 0 0 0 0 0 0 0 
0 0 0 0 0 0 0 2051.38 0 0 0 0 0 0 0 480.132 0 0 0 0 0 0 0 332.575 0 0 1648.53 703.986 0 0 0 0 0 0 0.05 0 0 0 0 -1085.31 0 0 0 1435.21 0 0 0 0 1055.71 0 0 0 0 0 0 0 0 0 0 0 0 0 0 0 217.978 0 0 
0 0 0 0 0 0 0 0 0 0 0 0 0 0 0 0 0 0 0 0 -1767.4 0 0 2449.49 0 0 0 0 -125.355 0 0 0 0 945.235 0 0.02 0 0 0 0 0 0 0 0 0 0 0 0 0 0 0 0 0 0 0 0 0 0 0 0 0 0 0 0 0 1581.7 0 
0 0 0 1719.79 0 0 -750.374 0 0 393.155 0 2038.26 0 0 0 0 0 0 -2.82296 0 0 -852.763 1432.92 0 0 0 0 0 0 0 -840.403 0 0 -1064.41 0 0 0.05 0 0 -39.14 0 0 0 0 0 0 0 0 0 0 0 0 0 0 0 0 0 0 0 0 0 0 0 0 0 0 0 
0 0 0 0 0 0 0 588.931 0 0 0 215.537 1991.87 0 0 0 0 0 0 2475.89 0 0 0 0 1596.8 0 0 0 0 -2486.88 0 0 0 0 0 0 0 0.02 0 -823.466 148.854 0 0 0 0 0 0 0 0 0 0 0 0 0 0 0 0 0 0 0 0 0 0 0 0 0 0 
0 0 -17.0141 0 0 0 0 0 0 0 0 0 870.312 0 0 0 0 -1080.74 0 0 0 0 0 0 0 0 0 0 0 0 -291.681 0 0 0 0 0 0 0 0.02 0 0 0 -233.848 0 0 0 0 0 0 0 0 0 0 0 0 0 0 0 0 0 0 0 0 0 2388.91 0 0 
0 0 0 2383.11 0 0 0 0 0 0 -2263.94 0 0 0 0 -1183.58 0 0 0 0 0 0 0 0 0 0 0 -99.414 0 0 0 0 0 1513.49 576.113 0 392.392 102.313 0 0.06 0 0 0 0 0 0 0 0 -1839.73 0 0 0 0 0 2138.05 0 0 0 -2397.46 -250.175 0 1186.79 0 0 0 0 0 
1730.48 2436.52 0 0 0 0 0 0 0 0 -1575.44 0 0 0 0 1583.22 0 0 0 -84.1548 0 0 0 -100.94 0 0 0 814.615 0 0 0 0 0 0 0 0 0 -1414.15 0 0 0.01 0 0 0 0 0 0 0 0 0 0 0 0 0 0 0 0 0 0 820.719 0 0 0 0 -974.532 671.941 0 
0 0 150.227 0 1880.63 0 0 -719.703 0 0 0 0 -2296.44 0 0 0 0 0 0 1985.61 1763.44 0 0 0 0 0 0 0 0 0 0 0 0 0 0 0 0 0 0 0 0 0.02 0 0 0 0 1037.55 0 0 0 0 0 2409.51 0 0 0 0 0 0 0 0 0 0 2138.36 0 1591.16 67.5222 
1549.96 -1636.94 0 0 0 0 0 0 0 1224.94 0 0 698.187 0 0 1980.88 0 1385.77 0 0 0 0 0 0 -1113.54 0 0 0 0 0 0 0 212.943 0 0 0 0 0 -2353.21 0 0 0 0.05 0 0 0 0 0 0 0 0 0 0 0 0 0 1137.35 0 0 0 0 0 0 0 0 0 0 
0 0 0 0 776.467 0 0 0 0 887.555 0 0 0 -95.4466 -52.4155 0 1199.45 1027.33 0 0 1595.58 0 0 0 0 0 0 0 0 0 0 0 0 0 740.455 0 0 0 0 0 0 0 0 0 0 0 0 -561.312 0 0 0 0 0 0 0 0 0 1856.97 0 0 0 0 -606.937 0 0 0 0 
0 0 0 0 0 0 0 0 0 0 0 2414.85 0 0 2041.61 0 0 0 0 -1623.66 0 0 0 -476.928 0 2217.7 0 0 0 1492.43 0 0 -173.574 0 0 0 0 0 0 0 0 0 0 0 0.03 0 0 0 0 0 0 0 0 0 0 -537.355 0 0 -2323.91 0 0 1228.45 0 0 0 0 0 
0 0 0 1911.15 0 0 0 0 0 -598.392 0 0 36.2407 2315.52 0 385.678 0 -2086.32 0 0 0 0 0 0 0 0 0 0 0 -1201.9 0 0 0 0 0 0 0 0 0 0 0 0 0 0 0 0 0 0 0 1734.14 0 0 0 0 -1768.93 0 -352.87 0 0 0 0 0 0 0 0 0 0 
0 0 0 0 2480.47 0 1269.8 0 0 0 0 0 0 0 0 0 2372.89 0 -1661.5 0 0 0 0 0 0 -849.101 0 0 539.491 0 0 0 1318.17 0 0 0 0 0 0 0 0 -27.2378 0 0 0 0 0.03 0 0 0 0 0 0 0 0 0 0 0 0 0 0 0 -1362.12 0 -2006.52 0 0 
0 0 0 2421.57 1877.12 0 0 0 0 0 0 0 0 0 0 0 0 0 0 0 0 0 0 0 2165.82 0 0 0 0 177.694 0 1820.2 0 0 0 0 0 0 0 0 0 0 0 -1700.11 0 0 0 0.05 0 0 0 0 0 595.798 0 -1735.21 0 0 0 -289.239 0 0 0 0 0 0 2379.76 
0 -2460.02 0 0 0 -1264.76 0 0 0 0 0 0 0 0 0 0 0 0 0 -1052.05 0 0 0 0 0 -122.913 0 0 0 0 899.304 0 0 0 1901.23 0 0 0 0 1286.89 0 0 0 0 0 0 0 0 0.04 0 471.282 248.039 0 0 0 0 -1187.4 0 0 0 1675.85 14.8778 0 0 0 0 0 
0 0 0 0 953.932 1635.87 0 0 0 0 0 0 0 0 0 -1906.42 0 69.0481 0 0 0 246.055 0 945.387 0 0 0 0 0 0 0 0 0 0 0 0 0 0 0 0 0 0 0 0 0 172.506 0 0 0 0.08 0 0 0 0 0 1533.02 0 -1301.39 0 0 0 0 0 0 0 0 0 
0 0 0 0 0 0 -1329.46 0 0 0 0 0 0 1493.04 0 -1348.08 1812.88 0 0 0 0 682.775 0 0 713.752 0 0 0 0 671.026 2485.35 0 0 0 0 0 0 0 0 0 0 0 0 0 0 0 0 0 1685.92 0 0.01 0 0 0 0 0 0 0 0 0 0 0 0 0 0 128.254 0 
0 0 0 0 0 0 0 0 -615.635 0 0 0 0 0 0 0 0 0 0 1483.28 0 0 0 0 0 0 0 0 2137.29 0 0 0 0 0 0 0 0 0 0 0 0 0 0 0 0 0 0 0 164.113 0 0 0.08 0 -2004.68 0 0 2261.5 -1454.89 0 0 0 0 0 0 0 0 0 
0 0 0 0 0 1848.43 0 0 0 707.953 688.116 2061.45 50.1267 0 0 -1152.15 0 0 0 0 0 0 692.999 0 0 0 0 0 0 2351.22 0 0 0 0 0 0 0 0 0 0 0 316.095 0 0 0 0 0 0 0 0 0 0 0.02 0 0 0 0 0 2336.57 0 0 0 0 -731.605 0 -838.267 0 
0 0 0 0 0 0 0 0 1032.98 0 0 0 632.725 0 0 0 0 0 -2181.23 0 0 692.999 279.473 0 0 0 0 0 0 -425.504 0 -75.3044 409.94 0 0 0 0 0 0 0 0 0 0 0 0 0 0 -873.058 0 0 0 1309.63 0 0.04 0 0 0 0 1032.21 0 0 0 0 0 0 0 0 
-1771.83 0 0 -1111.87 0 0 0 0 0 870.006 0 2066.48 0 0 1105.46 0 0 0 0 0 0 0 0 0 0 0 0 0 0 -267.113 0 0 0 0 0 0 0 0 0 972.243 0 0 0 0 0 2462.77 0 0 0 0 0 0 0 0 0.06 0 0 0 0 0 0 0 1081.04 0 -2472.69 0 0 
0 0 254.906 0 0 0 0 0 0 0 0 0 0 0 0 -1621.52 0 0 0 2002.85 0 0 0 0 0 0 0 0 0 0 0 0 0 0 0 0 0 0 0 0 0 0 0 0 661.107 0 0 -2368.92 0 160.909 0 0 0 0 0 0.07 0 0 0 2289.73 0 0 0 0 0 0 0 
1293.6 0 0 0 0 0 0 0 0 0 0 0 0 0 0 0 -1103.47 1354.49 0 0 0 0 0 0 0 0 0 -1453.83 0 1002.61 0 0 0 0 0 0 0 0 0 0 0 0 2407.22 0 0 -762.276 0 0 2493.59 0 0 -1219.75 0 0 0 0 0.07 0 0 0 0 0 0 0 0 334.254 0 
0 0 0 2437.59 0 1024.12 0 0 0 0 0 0 0 0 0 1208.61 0 0 0 0 0 0 0 0 0 -1612.52 0 0 0 0 0 0 0 0 0 0 0 0 0 0 0 0 0 571.078 0 0 0 0 0 -1461.61 0 2340.54 0 0 0 0 0 0.04 0 0 0 0 0 1895.73 0 0 0 
0 0 0 0 -1139.33 0 0 0 102.161 0 0 -389.492 0 0 1199.61 0 0 0 0 0 -774.026 0 0 0 0 0 2095.48 0 0 0 0 0 0 0 0 0 0 0 0 -2238.3 0 0 0 0 1809.67 0 0 0 0 0 0 0 1996.14 1743.6 0 0 0 0 0.02 0 0 0 0 0 0 2245.02 0 
796.609 0 0 0 0 -2186.57 0 0 0 0 0 0 0 0 0 0 0 0 0 0 0 0 1359.83 0 0 0 0 1543.24 0 2494.66 0 0 0 0 0 0 0 0 0 1210.29 1824.78 0 0 0 0 0 0 2048.02 0 0 0 0 0 0 0 -2496.34 0 0 0 0.05 0 1625.03 0 0 0 0 0 
0 0 0 0 0 0 0 0 0 -1589.18 0 0 0 0 0 0 0 0 1220.82 0 0 0 0 0 -383.236 1725.44 0 0 0 0 0 747.017 0 0 0 0 0 0 0 0 0 0 0 0 0 0 0 0 1332.21 0 0 0 0 0 0 0 0 0 0 0 0.09 124.287 0 0 0 0 649.663 
0 0 0 0 0 0 0 0 0 0 0 0 0 0 0 -600.986 0 0 1847.36 0 0 1583.07 0 0 0 0 -25.8644 0 0 0 0 0 0 0 0 0 0 0 0 -1528.44 0 0 0 0 163.656 0 0 0 -84.7652 0 0 0 0 0 0 0 0 0 0 1914.66 83.0866 0 927.076 0 0 0 0 
0 0 0 0 0 0 0 0 0 1873.76 0 0 1742.84 1887.95 0 0 0 0 0 0 0 0 0 0 0 0 0 0 0 0 0 0 0 0 0 0 0 0 0 0 0 0 0 1180.68 0 0 697.577 0 0 0 0 0 0 0 -457.244 0 0 0 0 0 0 731.452 0.06 0 0 0 0 
0 0 0 -293.664 0 0 0 0 0 0 0 -975.753 0 0 0 0 0 0 0 0 0 0 0 0 -1061.82 0 0 0 0 0 0 0 0 0 0 0 0 0 0 0 0 1896.19 0 0 0 0 0 0 0 0 0 0 951.338 0 0 0 0 1115.22 0 0 0 0 0 0.01 0 0 0 
0 0 0 1656.77 1109.58 0 0 0 0 1704.08 0 0 0 0 -2042.53 2100.97 0 0 0 0 0 0 0 0 0 -1987.44 2333.83 0 0 0 0 547.273 0 0 1576.05 0 0 0 -1505.25 0 -452.666 0 0 0 0 0 -1351.44 0 0 0 0 0 0 0 2206.26 0 0 0 0 0 0 0 0 0 0.01 0 0 
0 0 0 0 0 -639.134 0 2450.87 0 0 0 32.1207 0 0 0 0 0 0 0 0 0 0 0 652.867 0 0 216.147 0 643.101 0 0 0 0 0 0 857.799 0 0 0 0 -106.128 -1413.69 0 0 0 0 0 0 0 0 1726.2 0 723.67 0 0 0 -1310.69 0 -1108.2 0 0 0 0 0 0 0.03 0 
0 0 0 0 0 0 897.931 0 0 0 0 1259.88 0 0 0 0 0 1719.64 0 0 0 0 0 0 0 0 416.959 0 0 0 0 0 0 0 0 0 0 0 0 0 0 -1174.43 0 0 0 0 0 919.446 0 0 0 0 0 0 0 0 0 0 0 0 -1529.05 0 0 0 0 0 0.07 
