*Vertices 47
*Matrix 
0.09 -169.454 0 0 0 64.4704 0 0 0 0 0 0 -88.8852 0 336.39 0 1513.34 0 2079.76 0 0 0 0 0 0 0 0 0 0 -502.106 0 0 0 0 2150.11 0 0 2425.69 0 0 0 0 0 0 0 0 0 
919.446 0.02 0 196.158 0 0 0 0 0 0 0 0 2215.87 0 0 0 0 0 0 -747.322 0 0 0 0 0 0 -936.079 0 0 0 0 0 1373.87 0 0 0 0 0 0 0 2362.51 0 0 0 0 0 0 
0 0 0.04 0 0 0 -918.989 0 0 0 0 0 0 0 0 540.559 0 0 0 0 0 0 0 0 0 0 0 0 0 0 0 0 0 0 0 0 0 455.718 0 0 0 0 0 0 0 0 0 
0 973.006 0 0.01 0 0 0 0 0 -1397.52 0 0 0 0 0 0 -1378.75 0 0 0 0 112.384 0 0 0 0 0 0 0 0 0 0 0 0 0 2133.63 0 0 0 0 0 0 0 0 0 0 0 
0 0 0 0 0.05 0 0 0 0 0 616.092 0 1788 0 0 0 0 0 0 0 0 0 0 0 0 0 0 0 0 0 1052.05 -149.77 0 0 0 0 453.581 0 0 0 0 0 0 0 0 0 0 
2097.77 0 0 0 0 0.07 0 0 0 0 0 0 0 0 0 0 0 0 0 827.281 0 -1788 0 0 0 0 0 0 0 0 0 0 0 0 0 0 0 1197.32 0 1605.5 0 0 0 0 0 0 0 
0 0 -1529.82 0 0 0 0.05 0 0 0 482.116 0 0 0 0 -1454.44 0 0 0 0 0 0 0 0 0 1475.49 372.402 0 0 0 0 0 0 0 629.826 43.7178 0 0 0 0 0 0 0 1851.63 0 0 0 
0 0 0 0 0 0 0 0.04 0 0 0 0 0 0 0 0 0 -577.944 0 0 0 0 0 0 0 0 0 0 2144.31 0 0 0 -1195.94 0 0 0 0 0 0 0 0 0 0 0 0 0 0 
0 0 0 0 0 0 0 0 0.04 0 0 0 0 0 0 0 0 1660.28 0 0 0 0 0 0 0 0 0 0 0 0 0 0 0 0 0 0 0 0 0 0 0 0 0 0 0 0 0 
0 0 0 -326.777 0 0 0 0 0 0.09 0 0 0 0 0 0 0 0 0 0 0 0 0 0 0 638.066 0 0 0 0 0 0 0 0 0 0 111.164 0 -101.245 0 0 1051.29 0 0 0 0 0 
0 0 0 0 1750.77 0 1046.56 0 0 0 0.04 0 -1264 0 0 456.938 0 -162.74 0 0 0 0 0 0 0 0 0 179.22 0 0 0 0 0 0 0 0 0 0 0 0 0 0 0 0 0 0 0 
0 0 0 0 0 0 0 0 0 0 0 0 -2059.62 0 0 0 0 0 0 0 0 0 0 0 0 2047.11 0 0 0 0 898.083 0 0 0 1358.3 0 1124.23 0 0 0 0 0 0 0 0 0 0 
2470.7 -1598.48 0 0 -2485.35 0 0 0 0 0 1377.22 405.362 0.08 0 0 0 0 0 0 0 0 0 0 0 1613.9 0 0 0 0 0 0 0 0 1517.61 0 0 478.454 0 0 0 0 0 0 0 0 0 0 
0 0 0 0 0 0 0 0 0 0 0 0 0 0.04 0 0 0 0 -1426.82 0 0 0 -141.987 0 0 0 563.448 0 0 0 1792.12 0 0 -926.618 1723.91 0 0 0 0 0 0 0 0 0 0 0 0 
2263.48 0 0 0 0 0 0 0 0 0 0 0 0 0 0 0 -1031.14 0 0 0 -294.58 0 0 1287.04 0 0 0 0 -2044.66 0 2250.51 0 -1708.5 1166.95 0 0 0 0 0 0 0 0 0 0 0 0 0 
0 0 -1662.72 0 0 0 2312.16 0 0 0 2129.96 0 0 0 0 0.04 -1148.34 0 0 0 0 0 0 0 0 0 0 0 0 0 0 0 0 1241.72 0 -2123.25 0 0 0 0 0 0 0 0 0 0 0 
2274.77 0 0 1541.26 0 0 0 0 0 0 0 0 0 0 1304.28 -9.38444 0.05 0 0 1893.14 0 -1658.91 0 0 0 1095.39 -2345.27 0 0 0 0 0 0 0 0 0 0 0 0 0 1143.91 0 -880.84 0 0 0 0 
0 0 0 0 0 0 0 2396.69 471.129 0 985.977 0 0 0 0 0 0 0.03 0 0 0 0 -1617.56 0 0 0 0 0 0 0 0 1889.02 0 0 877.178 0 447.63 0 0 0 0 0 0 0 0 0 0 
1935.87 0 0 0 0 0 0 0 0 0 0 0 0 2089.53 0 0 0 0 0.08 0 2313.84 0 0 0 0 0 0 0 0 -1440.7 2062.82 0 0 0 0 0 -217.673 0 0 0 802.408 0 0 0 2117.6 0 0 
0 2132.4 0 0 0 -617.771 0 0 0 0 0 0 0 0 0 0 2044.82 0 0 0.07 0 0 0 0 0 0 0 0 0 0 0 0 0 0 0 0 0 0 0 -1614.96 1524.63 0 0 0 0 0 0 
0 0 0 0 0 0 0 0 0 0 0 0 0 0 -553.377 0 0 0 1942.27 0 0.05 0 0 0 0 0 0 0 0 0 0 0 0 0 0 0 0 0 0 0 0 0 0 0 0 0 0 
0 0 0 1238.21 0 904.035 0 0 0 0 0 0 0 0 0 0 -1622.29 0 0 0 0 0 0 1298.94 -1705.76 0 0 0 0 0 0 835.368 0 0 0 0 0 0 0 0 0 0 0 0 0 0 0 
0 0 0 0 0 0 0 0 0 0 0 0 0 2232.2 0 0 0 -99.5666 0 0 0 0 0.08 0 0 0 0 0 0 0 0 0 0 0 0 0 1205.4 -732.215 0 0 961.867 0 0 0 0 1189.23 0 
0 0 0 0 0 0 0 0 0 0 0 0 0 0 529.878 0 0 0 0 0 0 541.322 0 0.06 0 488.525 0 0 0 0 0 0 -1167.71 0 0 0 0 0 0 1779 2366.79 0 0 0 0 0 0 
0 0 0 0 0 0 0 0 0 0 0 0 1645.02 0 0 0 0 0 0 0 0 -1430.17 0 0 0.01 1484.8 0 0 0 0 0 0 0 0 0 1766.95 0 0 1026.11 0 0 0 0 0 0 0 20.3711 
0 0 0 0 0 0 246.361 0 0 2438.51 0 -367.519 0 0 0 0 -1408.96 0 0 0 0 0 0 1012.99 725.959 0.03 0 0 0 0 0 0 0 0 0 0 0 0 0 0 0 0 0 0 0 0 0 
0 1977.83 0 0 0 0 -271.691 0 0 0 0 0 0 313.349 0 0 -2303.31 0 0 0 0 0 0 0 0 0 0 0 0 226.524 0 377.285 0 0 0 0 0 1210.44 2224.27 0 0 0 0 0 0 0 0 
0 0 0 0 0 0 0 0 0 0 921.583 0 0 0 0 0 0 0 0 0 0 0 0 0 0 0 0 0.01 0 0 0 0 0 0 0 0 0 0 0 1723.3 0 0 0 0 0 0 0 
0 0 0 0 0 0 0 2432.86 0 0 0 0 0 0 -728.553 0 0 0 0 0 0 0 0 0 0 0 0 0 0.08 0 1354.49 747.169 0 0 0 -351.039 0 0 1340.6 2013.53 0 0 0 0 0 0 0 
1305.05 0 0 0 0 0 0 0 0 0 0 0 0 0 0 0 0 0 1829.66 0 0 0 0 0 0 0 1927.78 0 0 0.07 0 0 0 0 0 0 0 0 0 0 0 0 0 0 0 0 0 
0 0 0 0 -2230.22 0 0 0 0 0 0 445.189 0 1923.66 1331.45 0 0 0 1966.23 0 0 0 0 0 0 0 0 0 627.995 0 0.02 0 0 0 2351.83 0 0 0 0 0 0 0 0 0 0 0 0 
0 0 0 0 2452.39 0 0 0 0 0 0 0 0 0 0 0 0 2375.03 0 0 0 1306.73 0 0 0 0 1871.17 0 -1519.29 0 0 0.08 0 0 0 0 0 -2004.38 0 0 0 0 0 0 0 0 0 
0 1570.56 0 0 0 0 0 91.0215 0 0 0 0 0 0 2135.46 0 0 0 0 0 0 0 0 612.43 0 0 0 0 0 0 0 0 0.06 0 0 -192.495 0 0 0 0 0 0 0 0 0 0 0 
0 0 0 0 0 0 0 0 0 0 0 0 -53.9415 -368.74 356.838 1740.09 0 0 0 0 0 0 0 0 0 0 0 0 0 0 0 0 0 0.08 0 0 0 0 0 0 0 0 0 0 0 0 0 
362.941 0 0 0 0 0 1758.55 0 0 0 0 800.729 0 2353.97 0 0 0 1179.31 0 0 0 0 0 0 0 0 0 0 0 0 278.253 0 0 0 0.06 0 0 0 2279.81 0 0 0 0 0 0 0 0 
0 0 0 1094.78 0 0 695.135 0 0 0 0 0 0 0 0 1706.52 0 0 0 0 0 0 0 0 1137.65 0 0 0 559.023 0 0 0 -1952.8 0 0 0.04 0 0 0 0 0 0 0 0 0 0 0 
0 0 0 0 1333.12 0 0 0 0 -278.405 0 758.156 617.161 0 0 0 0 -1099.35 2184.29 0 0 0 736.488 0 0 0 0 0 0 0 0 0 0 0 0 0 0.04 205.313 0 0 0 0 0 0 0 0 0 
2223.35 0 620.365 0 0 347.072 0 0 0 0 0 0 0 0 0 0 0 0 0 0 0 0 237.663 0 0 0 110.706 0 0 0 0 671.636 0 0 0 0 1437.65 0.02 0 0 0 -1916.18 0 0 0 0 0 
0 0 0 0 0 0 0 0 0 857.189 0 0 0 0 0 0 0 0 0 0 0 0 0 0 -2108.14 0 1975.08 0 2069.38 0 0 0 0 0 1366.54 0 0 0 0.08 0 0 0 0 0 0 0 0 
0 0 0 0 0 -1829.05 0 0 0 0 0 0 0 0 0 0 0 0 0 -812.021 0 0 0 2308.5 0 0 0 27.543 1822.79 0 0 0 0 0 0 0 0 0 0 0.01 257.5 0 0 0 0 0 0 
0 502.258 0 0 0 0 0 0 0 0 0 0 0 0 0 0 -1797.92 0 2361.14 -0.381481 0 0 1135.98 1003.98 0 0 0 0 0 0 0 0 0 0 0 0 0 0 0 -1661.5 0.03 0 0 0 0 0 0 
0 0 0 0 0 0 0 0 0 2299.95 0 0 0 0 0 0 0 0 0 0 0 0 0 0 0 0 0 0 0 0 0 0 0 0 0 0 0 -1310.85 0 0 0 0.02 0 0 0 0 0 
0 0 0 0 0 0 0 0 0 0 0 0 0 0 0 0 1735.36 0 0 0 0 0 0 0 0 0 0 0 0 0 0 0 0 0 0 0 0 0 0 0 0 0 0.09 0 0 0 0 
0 0 0 0 0 0 2122.64 0 0 0 0 0 0 0 0 0 0 0 0 0 0 0 0 0 0 0 0 0 0 0 0 0 0 0 0 0 0 0 0 0 0 0 0 0.09 0 0 0 
0 0 0 0 0 0 0 0 0 0 0 0 0 0 0 0 0 0 395.749 0 0 0 0 0 0 0 0 0 0 0 0 0 0 0 0 0 0 0 0 0 0 0 0 0 0.09 0 0 
0 0 0 0 0 0 0 0 0 0 0 0 0 0 0 0 0 0 0 0 0 0 789.132 0 0 0 0 0 0 0 0 0 0 0 0 0 0 0 0 0 0 0 0 0 0 0.01 0 
0 0 0 0 0 0 0 0 0 0 0 0 0 0 0 0 0 0 0 0 0 0 0 0 2047.11 0 0 0 0 0 0 0 0 0 0 0 0 0 0 0 0 0 0 0 0 0 0.06 
