*Vertices 34
*Matrix 
0.05 1011.46 747.169 0 1806.77 -588.321 0 2313.07 0 -1836.99 -2383.27 0 0 0 0 2283.32 0 0 300.684 0 0 0 -2143.09 0 0 75.7622 0 0 0 0 0 0 0 0 
173.269 0.01 -394.223 0 0 0 -1695.38 0 213.553 0 763.802 143.971 0 0 0 0 0 -888.012 2117.91 0 0 0 2034.29 0 0 0 0 0 0 0 0 0 0 0 
1061.82 -2144.92 0.01 0 0 0 0 2279.66 754.952 0 0 0 1930.68 0 1900.46 0 0 763.649 0 -541.169 0 0 0 0 0 0 862.682 0 0 0 0 0 0 0 
0 0 0 0.03 0 0 532.472 2122.94 0 0 0 0 0 0 0 0 -2355.34 905.408 0 0 0 741.981 0 0 1318.63 0 2144.61 0 0 0 0 0 0 0 
674.23 0 0 0 0.01 -728.858 -1948.84 -2410.73 0 2468.72 0 0 0 0 0 2390.44 1539.28 -474.639 0 0 0 2286.98 0 0 756.325 0 0 0 0 0 0 0 0 0 
1785.26 0 0 0 1771.68 0 0 0 0 0 2029.86 0 1121.02 0 0 0 0 0 0 37.9192 0 0 0 0 0 0 0 0 0 1243.4 0 0 0 0 
0 2444.15 0 -909.223 1772.9 0 0.09 0 46.9222 0 0 0 0 1300.16 -787.454 0 0 0 -2141.41 0 0 0 0 0 0 404.141 -1892.53 0 0 0 0 0 0 0 
1936.48 0 -1854.38 2359.92 739.54 0 0 0 -124.439 0 0 -756.478 0 -1836.68 0 0 0 1268.73 0 0 0 0 0 0 571.535 0 0 0 0 0 0 0 -2473.91 0 
0 -1268.27 205.313 0 0 0 -1010.39 -429.777 0.08 0 0 0 -56.5355 2177.42 0 0 0 -2144.15 -1727.12 774.331 1355.86 0 490.814 0 1301.23 1040.6 0 0 0 0 0 0 0 0 
2436.98 0 0 0 1414.76 0 0 0 0 0.08 0 0 1694.01 0 0 1435.21 2176.2 -969.802 -2123.1 2050 0 0 798.288 0 0 0 0 0 -1522.8 0 0 0 0 1426.05 
1595.43 1441.77 0 0 0 -2258.29 0 0 0 0 0.01 0 0 1088.37 0 0 0 0 1640.75 -2200.46 0 0 -333.186 0 0 1636.17 0 0 0 0 -284.509 -44.0229 0 0 
0 -264.672 0 0 0 0 0 2369.08 0 0 0 0.03 0 0 0 0 0 0 197.989 0 0 0 0 0 0 0 0 0 0 0 0 -192.495 -1389.74 0 
0 0 1255.76 0 0 1993.39 0 0 -1762.52 244.377 0 0 0.09 0 -2113.64 2339.47 0 0 2373.96 0 0 0 0 -1791.51 0 -142.445 0 735.725 0 0 0 0 0 -1304.13 
0 0 0 0 0 0 2120.04 -1997.36 -914.716 0 1361.96 0 0 0 0 2274.62 0 0 0 0 1902.6 0 0 1753.82 0 -103.534 0 -702.765 0 0 0 0 0 0 
0 0 2059.01 0 0 0 -1669.29 0 0 0 0 0 -2091.51 0 0.02 683.996 0 2412.72 0 0 0 0 0 0 0 0 0 1837.75 -1806.77 0 0 0 0 1910.08 
2018.27 0 0 0 -1853.77 0 0 0 0 -880.078 0 0 1261.25 -384.915 1552.86 0 0 -2006.97 0 0 0 0 0 0 -12.4363 806.07 0 0 -649.968 0 0 0 0 0 
0 0 0 736.793 2045.12 0 0 0 0 1180.68 0 0 0 0 0 0 0.05 0 0 0 0 0 -846.507 0 0 0 1752.45 0 0 0 0 0 0 0 
0 981.399 1170.16 688.421 322.657 0 0 2457.12 -591.372 -2305.9 0 0 0 0 -164.418 1183.13 0 0 0 0 0 1325.8 1938.76 0 0 0 0 0 0 -2099.29 0 627.842 0 0 
32.1207 1411.56 0 0 0 0 -1213.03 0 1502.04 995.132 -2368.16 1733.38 -87.3592 0 0 0 0 0 0.07 0 0 0 0 -1199.45 2428.89 0 0 0 0 0 0 0 0 0 
0 0 622.044 0 0 -2067.4 0 0 -367.367 883.587 1091.11 0 0 0 0 0 0 0 0 0.09 0 0 1832.71 -380.795 2248.38 0 0 0 0 0 0 0 0 0 
0 0 0 0 0 0 0 0 -277.795 0 0 0 0 1063.49 0 0 0 0 0 0 0.08 0 0 0 0 0 1026.11 0 0 2001.48 0 0 0 0 
0 0 0 2467.96 -2361.6 0 0 0 0 0 0 0 0 0 0 0 0 909.223 0 0 0 0.09 0 0 0 0 0 0 2347.25 0 0 0 0 0 
905.103 2070.45 0 0 0 0 0 0 1069.44 -866.039 -1066.39 0 0 0 0 0 402.158 -2413.94 0 1112.32 0 0 0 0 0 0 2279.2 0 0 0 0 0 -1997.21 0 
0 0 0 0 0 0 0 0 0 0 0 0 1951.58 859.478 0 0 0 0 2308.65 1871.47 0 0 0 0.02 0 0 -1091.88 0 0 0 0 0 -2380.21 0 
0 0 0 863.598 2037.34 0 0 -1036.48 -178.304 0 0 0 0 0 0 409.482 0 0 2360.53 -1955.55 0 0 0 0 0.05 0 0 0 0 0 0 422.3 0 0 
2066.94 0 0 0 0 0 -890.454 0 -572.756 0 122.15 0 842.692 1500.82 0 1628.09 0 0 0 0 0 0 0 0 0 0.09 -162.74 0 0 0 419.095 0 0 0 
0 0 2195.43 177.999 0 0 1094.01 0 0 0 0 0 0 0 0 0 889.996 0 0 0 -2049.39 0 -1237.91 2222.59 0 996.048 0.07 0 0 0 0 0 0 0 
0 0 0 0 0 0 0 0 0 0 0 0 2202.6 1746.96 364.315 0 0 0 0 0 0 0 0 0 0 0 0 0.09 0 0 0 0 0 0 
0 0 0 0 0 0 0 0 0 101.703 0 0 0 0 -1701.94 1101.18 0 0 0 0 0 2305.44 0 0 0 0 0 0 0.01 0 -1173.97 0 0 0 
0 0 0 0 0 -551.241 0 0 0 0 0 0 0 0 0 0 0 683.081 0 0 1139.03 0 0 0 0 0 0 0 0 0.09 0 0 0 0 
0 0 0 0 0 0 0 0 0 0 -687.353 0 0 0 0 0 0 0 0 0 0 0 0 0 0 2460.02 0 0 2092.43 0 0.08 0 0 0 
0 0 0 0 0 0 0 0 0 0 2038.26 1532.56 0 0 0 0 0 2102.34 0 0 0 0 0 0 -534.608 0 0 0 0 0 0 0.07 0 0 
0 0 0 0 0 0 0 -1898.48 0 0 0 2254.63 0 0 0 0 0 0 0 0 0 0 149.617 1607.03 0 0 0 0 0 0 0 0 0.04 0 
0 0 0 0 0 0 0 0 0 -46.1592 0 0 69.5059 0 141.682 0 0 0 0 0 0 0 0 0 0 0 0 0 0 0 0 0 0 0.06 
