*Vertices 64
*Matrix 
0.09 -898.846 0 0 0 894.116 0 0 0 1197.78 0 0 0 0 0 0 0 0 1771.37 0 0 0 0 0 0 2414.4 0 0 0 0 0 0 0 0 0 0 -2106.62 0 0 0 0 0 0 0 773.11 0 0 811.869 0 0 0 2426.3 0 -1701.18 0 0 -913.495 0 1267.2 0 2225.03 0 0 0 
250.481 0.05 0 0 -1514.1 0 2234.79 0 0 0 806.07 0 0 0 0 1092.49 0 0 -138.63 0 1796.4 75.1518 0 -1334.35 -64.9281 0 0 0 0 0 1000.78 0 0 0 0 0 0 0 0 0 0 0 0 0 0 0 0 -1029.16 0 0 -208.67 720.923 0 0 0 0 0 0 0 -1951.28 0 0 0 0 
0 0 0.05 0 0 0 -1373.56 457.854 0 0 0 0 0 0 -92.2422 0 0 0 0 0 0 0 0 0 2335.51 0 0 150.99 0 1395.08 0 0 0 0 0 -317.774 0 0 0 0 0 0 0 0 0 -540.559 0 0 0 0 0 0 0 0 1049 0 0 -1750.62 -1214.87 0 0 0 0 0 
0 0 0 0.08 2120.04 2148.73 0 0 0 0 0 0 0 0 0 0 0 2472.99 1668.68 0 0 0 0 0 0 0 0 0 0 0 0 0 0 0 0 0 0 0 0 0 0 0 0 505.31 0 0 -1085.47 0 638.981 -2073.96 0 0 0 0 0 0 0 0 0 0 0 0 0 0 
0 977.279 0 226.066 0.03 1429.26 1522.8 0 0 0 -2262.57 0 0 1559.88 226.981 0 0 419.095 2367.7 0 0 683.996 0 0 0 0 619.297 0 0 0 0 0 0 0 0 1623.05 0 0 0 0 0 0 1531.65 0 0 0 0 1970.05 0 0 0 0 0 696.051 0 -1187.7 0 0 0 0 0 0 0 0 
-103.687 0 0 1017.56 399.716 0.08 0 0 0 0 1309.78 0 0 88.1222 -771.279 0 0 2429.5 0 0 0 1370.97 490.204 0 0 1730.78 0 0 0 0 0 0 0 0 0 0 0 0 -804.392 -699.866 385.22 -990.097 0 0 0 0 0 0 0 0 0 0 0 0 -675.298 -1677.22 0 0 0 1273.16 0 0 0 0 
0 1584.9 -1435.67 0 -989.486 0 0.04 0 2303.61 0 0 0 0 0 0 617.618 0 0 0 0 0 0 1781.59 0 0 0 0 0 0 0 0 191.122 0 0 -234.458 0 0 0 0 0 0 0 0 0 1239.28 0 253.227 0 0 0 0 0 0 0 0 0 0 0 0 0 0 -1631.14 0 0 
0 0 658.361 0 0 0 0 0.06 401.7 -1782.51 0 -45.2437 0 0 0 0 2131.95 0 0 0 0 0 2346.95 0 0 114.216 -1447.72 2033.52 0 0 0 0 0 398.19 0 0 0 0 0 0 0 0 0 0 0 0 0 0 0 0 0 0 0 94.5311 0 0 0 0 0 0 1299.86 0 1052.2 0 
0 0 0 0 0 0 -791.879 2386.47 0.02 0 0 0 2002.24 0 -1111.56 0 0 0 -311.212 0 1203.57 0 0 0 0 0 -1148.64 0 0 0 0 0 0 0 0 0 0 0 0 0 0 0 0 0 0 0 0 0 0 0 0 0 0 0 0 0 0 0 0 917.615 0 0 0 0 
2353.21 0 0 0 0 0 0 2388.61 0 0.03 0 0 0 0 0 0 0 0 0 0 2111.96 0 0 0 -453.124 -540.101 2002.4 -138.325 2442.17 0 0 0 2134.08 -1274.53 0 0 -1103.78 0 0 0 1725.44 0 0 0 -1448.64 0 -2111.96 0 0 0 0 0 0 0 0 0 0 0 0 0 0 0 0 0 
0 -1829.97 0 0 703.07 1383.02 0 0 0 0 0.06 0 0 987.96 0 0 0 0 0 0 0 -1569.34 1607.79 1050.83 0 -1438.11 0 904.035 0 0 0 0 0 0 -839.793 1970.81 0 0 0 0 0 0 0 0 0 0 0 -1438.72 0 0 0 0 0 0 0 0 0 0 0 0 -335.475 0 0 0 
0 0 0 0 0 0 0 1368.83 0 0 0 0.01 0 0 0 567.721 2212.36 0 0 856.273 817.82 0 0 1592.68 -1787.39 0 0 0 0 0 0 0 0 909.528 0 0 0 0 0 0 0 0 0 0 0 0 0 0 0 0 0 1655.71 0 0 0 0 0 0 0 0 0 0 2096.7 0 
0 0 0 0 0 0 0 0 2470.4 0 0 0 0.09 0 0 0 0 0 0 0 0 0 0 0 0 0 1671.88 0 0 0 0 0 0 0 0 0 0 738.777 261.773 0 0 0 -193.258 0 0 0 0 -1965.16 0 0 0 0 0 734.962 -1347.93 423.368 0 0 0 0 0 0 0 0 
0 0 0 0 -1691.72 -443.052 0 0 0 0 1237.75 0 0 0.01 1374.17 0 2107.84 0 -377.743 0 0 0 0 0 0 -318.537 0 0 0 0 0 0 0 0 0 0 0 624.485 0 0 0 492.035 0 0 0 0 0 0 0 0 0 0 0 0 0 0 0 0 0 0 0 0 1308.25 0 
0 0 1131.09 0 247.581 2242.42 0 0 2153.92 0 0 0 0 368.435 0.03 0 0 0 0 0 0 0 0 0 0 0 0 0 1953.87 0 0 0 0 0 0 0 0 0 0 0 0 -476.623 0 1952.5 299.768 0 0 898.083 0 0 114.978 0 0 0 266.045 0 728.248 0 0 0 0 0 0 0 
0 1185.42 0 0 0 0 -1502.96 0 0 0 0 2284.23 0 0 0 0.09 1515.47 0 2485.5 0 0 0 0 2023.15 0 0 0 0 0 0 0 0 0 0 0 0 944.319 0 0 0 0 0 0 0 0 0 0 0 0 0 0 0 2448.88 -1499.91 0 0 0 0 0 0 0 0 627.689 0 
0 0 0 0 0 0 0 -1409.27 0 0 0 1801.58 0 -1014.66 0 1713.08 0.07 0 0 1564.46 0 0 0 0 0 0 548.189 0 0 0 0 0 0 0 0 0 0 0 0 0 0 0 0 0 0 1915.88 0 0 -1507.54 0 0 0 0 0 0 0 0 0 0 0 0 0 0 0 
0 0 0 613.804 1209.22 2093.65 0 0 0 0 0 0 0 0 0 0 0 0.03 0 0 0 0 0 0 0 0 1716.59 0 0 0 -2415.01 0 0 0 1757.03 0 0 0 0 0 0 0 0 0 0 0 0 0 0 0 0 0 -2073.35 -2025.89 0 0 0 0 0 0 0 0 675.451 0 
1296.5 2161.55 0 895.795 -1456.27 0 0 0 1735.36 0 0 0 0 -2171.62 0 2444.61 0 0 0.06 0 0 1505.1 0 0 0 -1781.14 0 0 2023.3 1815.93 16.4037 0 0 0 0 0 0 0 0 0 0 0 317.011 0 0 0 0 0 0 1210.44 0 0 0 0 -1961.96 0 0 0 0 0 2247.92 0 0 0 
0 0 0 0 0 0 0 0 0 0 0 2389.07 0 0 0 0 702.612 0 0 0.02 -120.319 0 0 0 0 233.39 0 718.94 0 0 0 1672.64 0 -2303.92 0 0 0 0 0 0 0 0 0 -1041.22 0 0 0 0 -1587.5 0 0 0 0 0 0 0 0 0 0 0 0 0 0 0 
0 2145.68 0 0 0 0 0 0 2245.63 -212.18 0 -68.2852 0 0 0 0 0 0 0 -1007.8 0.08 2473.45 0 0 0 0 0 0 0 0 0 0 0 0 0 0 0 0 0 1595.28 0 -2038.41 0 0 0 1705.45 1338.47 0 0 0 -1785.71 0 0 1215.17 0 0 0 1511.66 0 0 0 0 0 0 
0 -916.852 0 0 2358.24 2047.87 0 0 0 0 2092.27 0 0 0 0 0 0 0 210.501 0 2376.71 0.09 1499.3 0 0 0 0 0 0 0 0 0 989.792 0 0 0 0 0 0 0 0 0 0 1219.75 0 0 0 0 0 0 0 906.781 0 0 0 0 0 0 0 0 2290.03 752.51 -1755.96 0 
0 0 0 0 0 1435.06 1180.23 996.048 0 0 2034.44 0 0 0 0 0 0 0 0 0 0 1637.55 0.06 -654.698 0 0 0 530.488 0 -2358.09 0 0 0 0 -417.417 -1252.56 0 0 0 0 677.587 0 0 0 0 0 0 476.775 0 0 0 0 0 0 0 0 0 0 0 0 0 1272.55 0 0 
0 262.688 0 0 0 0 0 0 0 0 1408.66 1440.09 0 0 0 2142.17 0 0 0 0 0 0 773.415 0.05 948.744 0 0 -2453.31 0 0 0 0 0 0 0 0 1861.25 0 0 0 0 0 0 0 0 0 41.4289 0 0 0 0 0 1253.62 0 0 0 0 0 0 0 0 0 0 0 
0 2431.79 548.341 0 0 0 0 0 0 163.656 0 1076.77 0 0 0 0 0 0 0 0 0 0 0 1767.56 0.07 500.58 0 0 0 0 1989.12 0 0 2377.32 608.31 0 -2115.16 2264.09 0 -131.306 0 0 0 0 2132.86 0 0 0 0 0 0 0 0 0 0 0 0 0 0 0 0 0 0 0 
2402.65 0 0 0 0 -2475.59 0 -196.768 0 -2096.85 -464.263 0 0 1315.12 0 0 0 0 813.7 2091.66 0 0 0 0 120.624 0.07 0 0 0 886.792 0 1806.16 2288.96 0 -2110.13 0 0 0 0 0 0 0 0 0 0 0 0 0 0 2077.01 0 0 0 0 0 0 0 0 0 0 0 0 0 0 
0 0 0 0 -614.719 0 0 2138.51 357.601 2247.76 0 0 -581.454 0 0 0 1335.72 1348.99 0 0 0 0 0 0 0 0 0.06 810.038 0 0 0 0 0 0 0 0 0 0 0 0 0 0 0 0 0 180.441 0 0 -1498.84 0 0 0 0 0 0 0 0 0 0 0 0 0 0 1372.49 
0 0 2497.25 0 0 0 0 -29.8318 0 1327.48 -224.387 0 0 0 0 0 0 0 0 600.07 0 0 479.217 -1505.4 0 0 2135.61 0.06 -1179.01 0 0 0 -1295.74 0 0 0 0 0 0 0 0 0 0 0 0 0 0 0 0 -70.4215 0 0 0 0 0 804.697 0 0 0 0 0 0 0 0 
0 0 0 0 0 0 0 0 0 2130.42 0 0 0 0 -1417.05 0 0 0 1050.68 0 0 0 0 0 0 0 0 1637.39 0.07 0 0 0 0 0 0 0 0 0 0 0 0 0 0 672.704 0 2388.61 0 0 0 0 0 0 0 0 0 0 1999.95 0 0 1388.36 0 0 0 0 
0 0 2417.45 0 0 0 0 0 0 0 0 0 0 0 0 0 0 0 850.017 0 0 0 -205.771 0 0 -1067.77 0 0 0 0.08 0 0 0 0 0 0 0 0 0 0 2236.01 0 0 0 0 0 0 0 0 0 0 0 0 0 0 0 0 2001.94 0 0 0 0 0 0 
0 713.599 0 0 0 0 0 0 0 0 0 0 0 0 0 0 0 199.667 1423.92 0 0 0 0 0 -288.324 0 0 0 0 0 0.01 0 0 1783.12 0 0 0 0 0 183.035 0 0 0 0 0 0 0 0 228.355 0 0 0 77.4407 -504.242 0 0 0 0 -928.449 0 0 0 0 0 
0 0 0 0 0 0 2499.08 0 0 0 0 0 0 0 0 0 0 0 0 2191.15 0 0 0 0 0 2076.1 0 0 0 0 0 0.08 0 0 0 0 0 0 0 1293.45 0 1948.07 1333.74 0 0 0 0 0 0 0 0 0 0 0 0 0 0 0 0 -188.376 0 0 0 0 
0 0 0 0 0 0 0 0 0 -1544.16 0 0 0 0 0 0 0 0 0 0 0 1445.28 0 0 0 2461.55 0 -761.208 0 0 0 0 0.05 0 0 165.639 0 0 0 0 0 0 0 0 0 0 0 0 0 0 0 0 0 0 0 1091.11 0 0 0 0 0 -1038.47 0 0 
0 0 0 0 0 0 0 112.232 0 1894.67 0 643.406 0 0 0 0 0 0 0 2172.69 0 0 0 0 -849.864 0 0 0 0 0 1735.05 0 0 0.09 0 0 0 -150.838 1823.71 0 0 0 0 0 -1529.36 0 0 0 821.177 -260.094 0 -1434.45 0 0 0 0 0 0 0 1988.51 0 0 0 0 
0 0 0 0 0 0 -1496.86 0 0 0 1073.56 0 0 0 0 0 0 516.755 0 0 0 0 -211.112 0 1770.91 2071.52 0 0 0 0 0 0 0 0 0.05 0 0 0 0 0 0 0 0 0 0 0 0 0 0 0 0 0 0 0 1403.78 0 0 -272.759 0 0 0 0 0 0 
0 0 -391.171 0 1850.57 0 0 0 0 0 614.109 0 0 0 0 0 0 0 0 0 0 0 319.3 0 0 0 0 0 0 0 0 0 -700.934 0 0 0.05 0 0 0 0 0 0 0 0 0 0 0 0 0 0 0 0 0 0 0 0 0 421.995 0 0 0 0 0 0 
-301.904 0 0 0 0 0 0 0 0 1818.98 0 0 0 0 0 -2151.48 0 0 0 0 0 0 0 2405.09 1738.26 0 0 0 0 0 0 0 0 0 0 0 0.07 0 0 0 0 0 0 0 0 -2002.7 0 0 0 0 0 0 0 -1548.13 770.821 0 0 0 0 0 0 0 0 0 
0 0 0 0 0 0 0 0 0 0 0 0 1864.45 -2018.57 0 0 0 0 0 0 0 0 0 0 1242.64 0 0 0 0 0 0 0 0 829.112 0 0 0 0.08 223.93 0 0 0 0 0 0 0 0 0 0 0 0 0 0 0 0 0 0 0 0 0 0 0 0 0 
0 0 0 0 0 -1923.51 0 0 0 0 0 0 2457.12 0 0 0 0 0 0 0 0 0 0 0 0 0 0 0 0 0 0 0 0 1098.59 0 0 0 -1377.68 0.06 0 0 0 0 0 0 0 0 0 0 1992.63 0 0 0 -1261.71 0 0 0 0 0 0 0 0 0 0 
0 0 0 0 0 1001.85 0 0 0 0 0 0 0 0 0 0 0 0 0 0 656.987 0 0 0 1497.92 0 0 0 0 0 2476.2 1092.33 0 0 0 0 0 0 0 0.04 0 0 0 0 0 0 0 0 0 0 0 0 0 0 0 0 -384.762 0 0 0 0 0 0 760.903 
0 0 0 0 0 540.559 0 0 0 2234.95 0 0 0 0 0 0 0 0 0 0 0 0 1633.43 0 0 0 0 0 0 369.045 0 0 0 0 0 0 0 0 0 0 0.03 0 0 0 0 0 0 0 0 0 0 0 0 0 0 0 0 0 972.243 0 0 0 0 0 
0 0 0 0 0 -1608.55 0 0 0 0 0 0 0 1576.82 -486.389 0 0 0 0 0 1501.43 0 0 0 0 0 0 0 0 0 0 682.318 0 0 0 0 0 0 0 0 0 0.06 1220.36 0 0 0 0 0 0 -1954.18 0 0 0 0 0 0 0 0 0 2170.86 0 0 0 0 
0 0 0 0 592.135 0 0 0 0 0 0 0 2111.5 0 0 0 0 0 222.861 0 0 0 0 0 0 0 0 0 0 0 0 372.097 0 0 0 0 0 0 0 0 0 2323.15 0.07 0 0 -2373.65 0 -1482.51 -2006.36 0 824.686 0 0 0 0 0 0 0 0 0 0 0 0 0 
0 0 0 -253.38 0 0 0 0 0 0 0 0 0 0 2087.24 0 0 0 0 853.984 0 1038.47 0 0 0 0 0 0 1169.85 0 0 0 0 0 0 0 0 0 0 0 0 0 0 0.01 -1757.33 0 0 0 0 0 0 267.876 0 0 0 0 0 0 0 0 0 0 -1312.98 0 
-1456.27 0 0 0 0 0 1298.18 0 0 -1624.12 0 0 0 0 1769.69 0 0 0 0 0 0 0 0 0 1083.94 0 0 0 0 0 0 0 0 2181.84 0 0 0 0 0 0 0 0 0 1409.88 0.09 0 0 0 0 0 1695.68 0 0 0 0 0 0 1154.9 0 0 0 0 0 0 
0 0 2368.47 0 0 0 0 0 0 0 0 0 0 0 0 0 -52.8733 0 0 0 -692.999 0 0 0 0 0 2404.63 0 -2424.01 0 0 0 0 0 0 0 2077.32 0 0 0 0 0 929.365 0 0 0.04 0 0 0 0 0 0 0 0 0 0 -1623.05 0 0 0 0 0 -1801.43 0 
0 0 0 1975.54 0 0 -1883.22 0 0 1334.35 0 0 0 0 0 0 0 0 0 0 366.756 0 0 -1083.64 0 0 0 0 0 0 0 0 0 0 0 0 0 0 0 0 0 0 0 0 0 0 0.04 0 0 0 0 0 0 0 438.78 0 0 0 0 0 0 -1497.77 0 0 
934.095 -1765.72 0 0 852.306 0 0 0 0 0 224.845 0 354.396 0 1832.41 0 0 0 0 0 0 0 267.266 0 0 0 0 0 0 0 0 0 0 0 0 0 0 0 0 0 0 0 912.732 0 0 0 0 0.09 0 0 0 0 0 0 0 0 0 0 0 0 0 0 0 0 
0 0 0 642.643 0 0 0 0 0 0 0 0 0 0 0 0 881.603 0 0 -258.721 0 0 0 0 0 0 848.491 0 0 0 1264.61 0 0 246.208 0 0 0 0 0 0 0 0 964.461 0 0 0 0 0 0.05 0 0 0 0 0 0 0 2007.28 0 0 0 0 0 0 0 
0 0 0 2010.03 0 0 0 0 0 0 0 0 0 0 0 0 0 0 -150.227 0 0 0 0 0 0 301.904 0 1397.52 0 0 0 0 0 2158.5 0 0 0 0 -478.759 0 0 2038.87 0 0 0 0 0 0 0 0.07 0 0 0 0 0 0 0 0 1264.15 0 0 0 0 0 
0 -1900.01 0 0 0 0 0 0 0 0 0 0 0 0 712.226 0 0 0 0 0 185.476 0 0 0 0 0 0 0 0 0 0 0 0 0 0 0 0 0 0 0 0 0 688.116 0 1899.85 0 0 0 0 0 0.04 0 0 0 0 0 0 0 0 0 0 0 0 0 
893.658 364.467 0 0 0 0 0 0 0 0 0 -1451.69 0 0 0 0 0 0 0 0 0 277.337 0 0 0 0 0 0 0 0 0 0 0 2060.38 0 0 0 0 0 0 0 0 0 -223.167 0 0 0 0 0 0 0 0.08 0 0 0 0 0 0 0 0 -1524.02 0 0 0 
0 0 0 0 0 0 0 0 0 0 0 0 0 0 0 1828.29 0 -20.5237 0 0 0 0 0 1603.98 0 0 0 0 0 0 -504.7 0 0 0 0 0 0 0 0 0 0 0 0 0 0 0 0 0 0 0 0 0 0.09 0 0 0 0 0 1305.81 0 0 0 0 0 
1844.77 0 0 0 1820.81 0 0 1578.19 0 0 0 0 -2414.85 0 0 716.346 0 1514.86 0 0 631.199 0 0 0 0 0 0 0 0 0 -344.478 0 0 0 0 0 -1986.53 0 808.969 0 0 0 0 0 0 0 0 0 0 0 0 0 0 0.03 0 0 0 0 0 0 0 0 0 400.327 
0 0 1901.38 0 0 886.029 0 0 0 0 0 0 2105.4 0 1587.65 0 0 0 -892.285 0 0 0 0 0 0 0 0 0 0 0 0 0 0 0 -694.372 0 -1771.52 0 0 0 0 0 0 0 0 0 511.719 0 0 0 0 0 0 0 0.07 0 0 0 0 297.632 -1846.45 0 0 1597.11 
0 0 0 0 -263.909 1583.99 0 0 0 0 0 0 815.836 0 0 0 0 0 0 0 0 0 0 0 0 0 0 -2060.53 0 0 0 0 1659.52 0 0 0 0 0 0 0 0 0 0 0 0 0 0 0 0 0 0 0 0 0 0 0.02 0 0 0 0 0 0 0 2165.06 
1950.67 0 0 0 0 0 0 0 0 0 0 0 0 0 1505.71 0 0 0 0 0 0 0 0 0 0 0 0 0 1531.65 0 0 0 0 0 0 0 0 0 0 2145.99 0 0 0 0 0 529.725 0 0 -2366.63 0 0 0 0 0 0 0 0.01 0 1080.13 0 0 0 1266.75 0 
0 0 1210.75 0 0 0 0 0 0 0 0 0 0 0 0 0 0 0 0 0 239.341 0 0 0 0 0 0 0 0 -1718.88 0 0 0 0 607.395 2257.38 0 0 0 0 0 0 0 0 1495.03 0 0 0 0 0 0 0 0 0 0 0 0 0.06 0 0 -336.39 0 0 -1709.11 
2482.3 0 1077.38 0 0 0 0 0 0 0 0 0 0 0 0 0 0 0 0 0 0 0 0 0 0 0 0 0 0 0 -680.029 0 0 0 0 0 0 0 0 0 1386.38 0 0 0 0 0 0 0 0 140.919 0 0 496.765 0 0 0 -1181.75 0 0.07 0 0 -1344.72 0 0 
0 1454.44 0 0 0 2124.32 0 0 -663.854 0 0 0 0 0 0 0 0 0 0 0 0 0 0 0 0 0 0 0 2315.82 0 0 -1679.82 0 554.292 0 0 0 0 0 0 0 -2317.35 0 0 0 0 0 0 0 0 0 0 0 0 1124.99 0 0 0 0 0.07 0 0 -88.58 0 
1827.98 0 0 0 0 0 0 -1220.36 0 0 -326.167 0 0 0 0 0 0 0 -1452.91 0 0 1424.53 0 0 0 0 0 0 0 0 0 0 0 0 0 0 0 0 0 0 0 0 0 0 0 0 0 0 0 0 0 -1773.81 0 0 2027.12 0 0 1715.83 0 0 0.01 0 0 0 
0 0 0 0 0 0 -1408.35 0 0 0 0 0 0 0 0 0 0 0 0 0 0 -567.415 1880.93 0 0 0 0 0 0 0 0 0 -567.11 0 0 0 0 0 0 0 0 0 0 0 0 0 1497.62 0 0 0 0 0 0 0 0 0 0 0 1983.63 0 0 0 0 0 
0 0 0 0 0 0 0 532.472 0 0 0 1023.97 0 849.559 0 1479.61 0 1285.06 0 0 0 1784.8 0 0 0 0 0 0 0 0 0 0 0 0 0 0 0 0 0 0 0 0 0 -606.174 0 -2259.97 0 0 0 0 0 0 0 0 0 0 1564.76 0 0 -78.2037 0 0 0.09 0 
0 0 0 0 0 0 0 0 0 0 0 0 0 0 0 0 0 0 0 0 0 0 0 0 0 0 1513.49 0 0 0 0 0 0 0 0 0 0 0 0 -1540.19 0 0 0 0 0 0 0 0 0 0 0 0 0 1739.78 2280.57 557.039 0 -85.5281 0 0 0 0 0 0.04 
