*Vertices 36
*Matrix 
0.07 0 1020.46 0 0 0 0 2478.48 0 0 0 0 0 0 0 0 0 0 0 -346.004 0 0 1594.82 0 0 0 0 0 2068.32 0 0 0 0 1160.08 0 1903.36 
0 0.02 0 0 0 0 0 0 0 50.4318 0 0 0 1709.11 0 0 0 0 0 0 0 0 0 0 -842.997 0 0 0 0 0 1175.34 0 0 0 0 0 
1439.33 0 0.08 0 0 0 0 0 0 0 0 1129.72 0 0 0 0 0 0 0 0 0 0 0 0 0 0 0 0 1508.3 0 0 0 0 0 -2095.17 0 
0 0 0 0.03 0 0 0 0 0 0 0 0 0 0 395.138 0 -1448.03 0 0 0 0 0 -682.775 0 0 0 0 0 0 0 0 0 0 0 1405.61 0 
0 0 0 0 0.03 0 0 0 0 0 338.984 0 0 0 2071.06 0 0 0 0 0 0 0 0 -35.4778 0 0 0 0 0 0 0 0 0 0 0 0 
0 0 0 0 0 0.05 0 0 0 1387.3 0 0 0 1079.36 0 0 0 0 0 1740.85 0 0 -1171.68 0 0 0 358.669 0 0 0 0 -1495.03 0 0 0 0 
0 0 0 0 0 0 0.08 -179.525 0 0 0 0 2259.67 0 0 0 0 0 0 0 0 949.202 0 -1395.08 0 0 0 0 0 0 0 -523.316 0 -237.358 0 0 
1951.73 0 0 0 0 0 -520.417 0.08 0 0 0 0 0 0 0 0 0 0 1288.26 0 0 0 0 0 0 0 -1627.63 0 0 0 0 0 0 0 0 0 
0 0 0 0 0 0 0 0 0.06 -1726.51 0 0 584.353 1831.95 0 1465.58 0 0 0 0 0 0 0 1192.43 0 0 0 0 0 0 0 0 0 0 0 0 
0 -237.358 0 0 0 2409.21 0 0 859.935 0.07 0 0 0 0 0 0 0 0 0 0 0 0 0 0 0 0 0 0 0 549.409 0 0 0 0 0 0 
0 0 0 0 -1654.79 0 0 0 0 0 0 0 0 0 1747.11 1827.22 0 0 0 0 0 0 0 0 0 291.681 0 0 0 0 0 0 0 0 0 0 
0 0 1620 0 0 0 0 0 0 0 0 0.08 0 0 2110.43 0 0 0 0 0 0 0 0 0 1711.25 0 0 0 0 0 0 0 0 0 0 0 
0 0 0 0 0 0 1239.13 0 1551.79 0 0 0 0.09 -1133.23 0 0 0 0 0 0 -1571.78 0 0 0 0 0 0 0 0 0 0 0 0 2222.13 0 0 
0 509.278 0 0 0 622.196 0 0 2282.1 0 0 0 1905.19 0.07 0 0 -510.041 -2128.59 0 -2038.1 0 0 0 0 0 0 0 0 0 0 0 0 0 0 0 0 
0 0 0 389.645 1094.32 0 0 0 0 0 1591.31 -312.586 0 0 0.07 0 0 0 0 0 0 0 -805.155 0 0 0 -82.0185 1223.72 0 0 0 0 0 0 -801.187 0 
0 0 0 0 0 0 0 0 444.731 0 794.32 0 0 0 0 0.09 0 0 0 0 0 -879.467 0 0 0 0 0 0 0 0 0 0 1659.83 0 0 0 
0 0 0 521.943 0 0 0 0 0 0 0 0 0 1377.38 0 0 0.08 0 0 0 0 0 0 291.223 0 0 0 1300.16 0 0 0 -876.72 0 0 0 0 
0 0 0 0 0 0 0 0 0 0 0 0 0 2072.89 0 0 0 0 0 0 0 0 0 -2117.3 0 1962.87 -899.762 -255.669 -748.39 0 0 0 0 0 726.569 0 
0 0 0 0 0 0 0 2265.31 0 0 0 0 0 0 0 0 0 0 0.07 0 1392.64 0 0 0 0 0 -1137.81 -1537.75 0 -2041.15 0 2103.72 1711.4 0 0 0 
233.848 0 0 0 0 661.107 0 0 0 0 0 0 0 496.918 0 0 0 0 0 0.02 0 0 0 0 0 0 0 0 0 0 0 0 1833.63 0 0 0 
0 0 0 0 0 0 0 0 0 0 0 0 558.718 0 0 0 0 0 -418.79 0 0.07 0 0 0 0 0 1967.45 0 0 0 0 0 0 0 0 0 
0 0 0 0 0 0 1433.84 0 0 0 0 0 0 0 0 2237.85 0 0 0 0 0 0.08 0 0 0 0 0 0 2085.71 0 0 0 0 0 0 0 
1287.96 0 0 2354.73 0 2426.76 0 0 0 0 0 0 0 0 481.506 0 0 0 0 0 0 0 0 0 -2131.03 2431.33 0 0 0 0 0 941.572 0 0 0 0 
0 0 0 0 1552.55 0 1295.74 0 2023.76 0 0 0 0 0 0 0 -1984.85 1545.23 0 0 0 0 0 0.01 0 637.303 0 0 0 587.558 0 0 0 0 0 0 
0 812.021 0 0 0 0 0 0 0 0 0 -503.479 0 0 0 0 0 0 0 0 0 0 569.399 0 0 0 0 0 0 0 0 0 0 0 0 0 
0 0 0 0 0 0 0 0 0 0 2465.21 0 0 0 0 0 0 2214.35 0 0 0 0 425.657 2371.82 0 0.09 0 0 600.375 0 0 0 0 0 0 0 
0 0 0 0 0 -462.737 0 -581.912 0 0 0 0 0 0 -951.643 0 0 2046.19 2384.03 0 -258.873 0 0 0 0 0 0.08 0 0 0 0 0 0 0 0 0 
0 0 0 0 0 0 0 0 0 0 0 0 0 0 2302.24 0 776.162 -1411.56 2379.91 0 0 0 0 0 0 0 0 0.07 0 -1665.62 0 0 0 0 0 0 
1595.89 0 -2468.87 0 0 0 0 0 0 0 0 0 0 0 0 0 0 1534.24 0 0 0 1700.57 0 0 0 1520.66 0 0 0.07 0 0 0 0 2215.57 0 0 
0 0 0 0 0 0 0 0 0 706.58 0 0 0 0 0 0 0 0 2239.22 0 0 0 0 2093.34 0 0 0 1943.19 0 0.06 0 -1410.64 0 0 0 0 
0 1515.63 0 0 0 0 0 0 0 0 0 0 0 0 0 0 0 0 0 0 0 0 0 0 0 0 0 0 0 0 0.06 0 0 0 0 0 
0 0 0 0 0 937.91 1462.37 0 0 0 0 0 0 0 0 0 -1570.41 0 1309.17 0 0 0 1557.13 0 0 0 0 0 0 -334.712 0 0.04 0 0 0 0 
0 0 0 0 0 0 0 0 0 0 0 0 0 0 0 1831.49 0 0 -1122.24 1857.89 0 0 0 0 0 0 0 0 0 0 0 0 0.08 126.27 2268.97 0 
1726.36 0 0 0 0 0 16.5563 0 0 0 0 0 -1118.12 0 0 0 0 0 0 0 0 0 0 0 0 0 0 0 2373.04 0 0 0 2349.7 0.09 0 0 
0 0 -2350.15 -785.318 0 0 0 0 0 0 0 0 0 0 1675.7 0 0 1034.04 0 0 0 0 0 0 0 0 0 0 0 0 0 0 2404.17 0 0.05 0 
2021.47 0 0 0 0 0 0 0 0 0 0 0 0 0 0 0 0 0 0 0 0 0 0 0 0 0 0 0 0 0 0 0 0 0 0 0.03 
