*Vertices 41
*Matrix 
0.01 0 0 0 0 2295.37 0 0 1045.03 1461.15 0 1091.72 0 -852.763 0 0 0 0 0 0 1783.73 0 0 0 0 0 1175.95 0 0 -1500.52 0 0 0 0 27.543 2264.85 1226 0 301.141 0 0 
0 0.01 0 0 722.297 0 0 0 0 0 147.786 0 0 0 2235.56 0 -286.187 0 0 0 0 -1363.49 2348.02 0 0 0 0 0 371.029 0 0 0 0 0 0 0 1078.3 236.9 0 0 0 
0 0 0.05 83.8496 0 -1079.97 0 2114.4 0 0 0 0 -175.253 0 2100.82 1422.85 1619.69 -924.024 2171.47 0 0 0 0 0 0 0 0 -2019.33 937.147 0 0 0 2287.29 1386.23 0 0 0 0 0 0 2409.97 
0 0 585.879 0.05 0 0 0 0 0 -2481.08 0 0 349.513 -817.057 0 0 0 871.38 0 0 0 2308.95 -2418.97 0 0 0 0 0 0 0 0 144.581 0 0 2436.83 0 0 2254.17 0 0 0 
0 1177.02 0 0 0.07 0 0 0 1553.62 0 0 0 87.9696 0 -371.487 0 0 0 0 0 0 -1171.68 0 0 856.273 0 0 -308.161 0 0 -1105.76 0 554.75 0 0 496.918 0 0 1926.25 0 0 
1709.57 0 316.401 0 0 0.06 0 0 304.804 0 0 0 0 1579.56 -1295.89 0 0 0 -883.435 0 0 0 1131.7 0 2140.03 0 -933.943 0 0 0 0 -533.845 0 0 0 1157.03 2174.06 1575.44 0 0 0 
0 0 0 0 0 0 0.02 0 -2367.7 0 0 0 714.667 0 1968.06 0 -1966.23 937.452 0 0 0 0 0 0 0 0 1156.27 -447.935 0 -2236.78 0 0 0 1827.22 0 0 0 -51.8052 0 2137.44 0 
0 0 -753.121 0 0 0 0 0.03 0 -1518.37 0 0 0 0 0 0 2362.21 0 0 0 0 -98.0407 1873.45 -916.852 591.372 706.275 0 0 0 0 0 -1955.7 1762.67 0 1019.7 0 0 0 0 0 0 
1770.91 0 0 0 1781.9 -907.849 -1724.07 0 0 0 978.652 -24.9489 0 0 2463.99 0 0 0 0 0 -1765.88 0 0 0 0 0 0 0 0 975.753 0 0 0 0 719.092 2230.37 0 0 0 0 0 
1621.98 0 0 1889.63 0 0 0 -1409.27 0 0.08 -778.298 0 0 0 0 0 0 0 2467.65 0 -2196.34 0 0 1800.21 -745.491 1468.17 -58.0615 0 0 0 763.955 0 0 0 0 0 0 2033.07 0 0 0 
0 -1575.44 0 0 0 0 0 0 -616.855 1338.01 0.03 750.374 0 914.106 313.349 0 0 0 0 0 0 0 0 0 -2013.69 1652.04 0 0 0 0 0 0 1104.69 2327.42 0 0 0 0 0 0 0 
-190.97 0 0 0 0 0 0 0 1976.45 0 -1042.89 0.07 195.395 0 0 0 0 0 0 0 0 433.592 0 0 0 0 0 0 0 0 0 0 0 0 0 0 0 1478.55 0 0 0 
0 0 1900.31 1340.75 -2284.08 0 1038.93 0 0 0 0 1473.82 0.02 0 -1254.39 2419.58 0 0 0 0 854.442 0 0 0 0 -149.77 0 0 0 0 0 -839.183 0 0 0 0 1435.36 0 0 -654.393 0 
1334.8 0 0 -1084.7 0 1814.4 0 0 0 0 -2425.53 0 0 0 0 0 0 0 0 0 638.371 -1670.81 0 -1466.95 926.16 0 0 0 0 1829.81 0 6.02741 396.664 2396.39 0 0 0 1814.86 0 0 0 
0 -1155.05 2484.59 0 -1130.63 2493.74 1263.39 0 438.322 0 803.629 0 -699.561 0 0.04 0 -1044.27 0 0 524.842 0 -1525.24 1078.3 0 -1599.7 1374.94 0 0 0 0 416.959 0 0 0 0 0 0 0 0 0 0 
0 0 422.147 0 0 0 0 0 0 0 0 0 -914.716 0 0 0.06 0 -1933.58 0 0 0 1008.41 0 0 0 0 0 0 0 0 2074.27 1915.42 1085.16 1389.28 2353.82 0 0 0 0 0 0 
0 316.706 -1423.15 0 0 0 1996.9 1209.07 0 0 0 0 0 0 -627.842 0 0.07 0 0 0 -1412.17 1360.44 -1795.79 -793.863 0 949.812 0 0 0 0 0 0 0 2462 0 0 0 1194.11 -1011 -1003.22 0 
0 0 1801.28 615.329 0 0 -1115.38 0 0 0 0 0 0 0 0 991.012 0 0.03 0 0 0 0 0 -824.992 0 0 -973.312 0 0 0 0 0 0 0 0 0 0 0 0 0 0 
0 0 2476.96 0 0 -1054.19 0 0 0 -761.361 0 0 0 0 0 0 0 0 0.03 2104.18 0 0 0 0 0 0 0 1430.17 0 0 0 0 0 0 -797.372 -42.6496 0 0 0 0 648.595 
0 0 0 0 0 0 0 0 0 0 0 0 0 0 359.279 0 0 0 703.07 0.01 0 0 0 79.8822 1003.68 0 0 0 2116.84 1082.72 1813.03 0 -1210.14 0 0 -2486.27 0 -701.697 0 0 0 
1321.53 0 0 0 0 0 0 0 458.312 -895.642 0 0 1062.73 1643.04 0 0 590.762 0 0 0 0.07 966.445 0 0 0 0 1670.2 0 0 0 0 0 0 2338.1 0 -1232.72 0 0 0 0 1353.72 
0 -2467.65 0 85.2229 -747.322 0 0 -1696.6 0 0 0 227.134 0 2326.35 2431.64 911.359 -2311.85 0 0 0 913.038 0.03 985.824 0 0 0 0 -1204.95 0 0 0 0 0 0 0 0 0 0 0 0 0 
0 2084.8 0 1271.02 0 21.2867 0 1854.08 0 0 0 0 0 0 -333.033 0 -1556.98 0 0 0 0 2468.72 0.05 0 0 0 0 0 0 0 2137.14 2365.87 0 0 0 1795.18 0 0 2315.21 0 0 
0 0 0 0 0 0 0 2253.41 0 -1165.12 0 0 0 11.5207 0 0 -2374.11 -34.5622 0 1339.08 0 0 0 0.03 0 0 0 0 0 0 940.352 0 0 0 0 0 740.455 0 2199.55 0 0 
0 0 0 0 932.569 55.0096 0 2241.36 0 544.069 1764.35 0 0 1264 2099.9 0 0 0 0 587.252 0 0 0 0 0 660.802 1335.87 0 -1857.28 -1836.07 1666.54 842.235 0 2109.21 0 0 0 0 0 0 0 
0 0 0 0 0 0 0 -1420.41 0 1852.4 1713.54 0 -1240.81 0 668.432 0 1446.65 0 0 0 0 0 0 0 -1936.02 0.08 0 0 0 0 1398.59 0 -1541.57 2284.39 2002.85 0 0 0 0 -121.387 -1061.51 
2195.12 0 0 0 0 99.5666 324.793 0 0 -951.186 0 0 0 0 0 0 0 -1132.47 0 0 -1665.93 0 0 0 1499.6 0 0.03 0 603.732 2209.46 1726.81 0 0 0 0 0 0 0 -76.22 0 1353.57 
0 0 -206.076 0 1253.78 0 -1620.3 0 0 0 0 0 0 0 0 0 0 0 2499.39 0 0 315.485 0 0 0 0 0 0.08 0 1727.58 0 0 0 0 0 0 0 0 0 0 0 
0 2109.97 1713.84 0 0 0 0 0 0 0 0 0 0 0 0 0 0 0 0 1841.87 0 0 0 0 1743.45 0 -1390.5 0 0.02 0 0 0 0 891.369 0 0 0 0 0 0 0 
1069.9 0 0 0 0 0 -1142.99 0 2108.45 0 0 0 0 -1847.36 0 0 0 0 0 440.916 0 0 0 0 2266.23 0 1092.94 -574.129 0 0.02 -1763.28 -377.59 0 -1041.37 0 0 0 0 0 0 1921.52 
0 0 0 0 438.78 0 0 0 0 -1143.3 0 0 0 0 1139.64 -850.627 0 0 0 584.658 0 0 -997.574 1643.35 1720.71 2256.61 -2176.66 0 0 2007.13 0.06 0 0 0 0 1722.69 0 0 0 0 0 
0 0 0 -743.049 0 2445.68 0 157.094 0 0 0 0 1987.29 -1377.38 0 -92.5474 0 0 0 0 0 0 1712.93 0 338.527 0 0 0 0 1620.61 0 0.01 0 128.407 0 86.5963 0 0 0 0 0 
0 0 1596.65 0 -1997.36 0 0 2377.47 0 0 -2433.16 0 0 1277.58 0 -292.749 0 0 0 519.959 0 0 0 0 0 1939.68 0 0 0 0 0 0 0.02 0 -1802.65 64.3178 1703.62 2170.86 0 0 0 
0 0 1391.87 0 0 0 2120.81 0 0 0 94.3785 0 0 547.884 0 2120.04 -465.789 0 0 0 -1741.16 0 0 0 1012.07 -821.635 0 0 27.2378 84.0022 0 -719.855 0 0.05 12.2837 0 0 0 -154.195 0 0 
1330.07 0 0 1786.02 0 0 0 -1193.04 1408.51 0 0 0 0 0 0 911.359 0 0 -1579.26 0 0 0 0 0 0 -272.607 0 0 0 0 0 0 -545.747 -1009.78 0.08 0 1744.82 2348.17 0 0 0 
-314.57 0 0 0 -1258.81 2287.29 0 0 2082.2 0 0 0 0 0 0 0 0 0 -130.39 423.215 6.33259 0 1726.36 0 0 0 0 0 0 0 -238.578 1779.76 1103.17 0 0 0.06 0 0 0 -337.764 122.761 
-40.8185 -806.833 0 0 0 -2401.27 0 0 0 0 0 0 1570.56 0 0 0 0 0 0 0 0 0 0 -2236.63 0 0 0 0 0 0 0 0 2148.58 0 2214.8 0 0.09 0 0 0 0 
0 2292.93 0 1713.08 0 -1918.32 1673.1 0 0 -854.595 0 2239.83 0 821.635 0 0 -1031.6 0 0 2488.4 0 0 0 0 0 0 0 0 0 0 0 0 -958.51 0 -2308.19 0 0 0.02 0 0 0 
631.352 0 0 0 1784.04 0 0 0 0 0 0 0 0 0 0 0 2088.46 0 0 0 0 0 1630.83 608.921 0 0 1460.23 0 0 0 0 0 0 2128.13 0 0 0 0 0.06 0 0 
0 0 0 0 0 0 2377.01 0 0 0 0 0 71.1844 0 0 0 575.655 0 0 0 0 0 0 0 0 598.239 0 0 0 0 0 0 0 0 0 -2453.92 0 0 0 0.04 0 
0 0 -66.6066 0 0 0 0 0 0 0 0 0 0 0 0 0 0 0 1888.41 0 2096.09 0 0 0 0 -1092.79 2091.66 0 0 -447.935 0 0 0 0 0 2256.46 0 0 0 0 0.02 
