*Vertices 54
*Matrix 
0.05 0 0 0 0 0 0 -2215.57 1141.01 0 -630.741 0 0 0 2038.71 2137.59 0 -420.316 502.564 0 2410.28 0 -1872.54 0 -884.35 0 2131.03 0 0 0 0 0 0 -1086.54 -21.897 -97.7355 0 0 0 2484.59 0 0 0 0 0 0 -998.642 0 1661.05 0 0 0 0 0 
0 0.03 -378.811 0 1089.59 0 0 0 0 0 0 0 0 0 0 0 261.62 0 0 -9.84222 0 0 0 0 2319.94 638.829 0 0 0 1451.23 0 0 0 0 0 0 -867.26 2235.1 0 0 0 0 1986.37 0 0 -1212.73 0 0 2363.43 0 0 2040.7 0 0 
0 -292.749 0.01 0 0 -17.1667 -224.845 0 0 0 -306.33 2229 0 0 654.851 0 0 0 -1485.41 0 0 0 0 0 0 0 0 0 0 0 1549.81 -1521.58 2471.77 2411.65 0 0 1946.85 -1139.94 0 0 0 0 1372.04 0 -311.365 0 0 0 0 0 0 0 0 0 
0 0 0 0.04 0 0 2441.1 0 0 0 0 0 1550.11 0 0 0 0 0 0 0 0 0 0 0 0 548.494 0 0 0 0 2221.82 0 0 -338.679 0 0 0 0 0 0 0 0 1580.63 0 1001.24 0 0 -1607.18 147.023 0 0 -166.402 0 0 
0 1395.69 0 0 0.03 2440.18 0 0 1680.12 0 0 0 0 0 0 0 0 1672.64 0 0 -1736.88 0 -826.212 0 -1226 0 0 0 0 1979.81 -961.409 1313.44 0 -1415.83 0 0 0 0 1380.43 0 0 0 0 0 0 0 -377.59 0 0 0 0 0 264.977 0 
0 0 -2050.16 0 1829.51 0.02 -2490.54 -121.693 0 0 0 0 0 0 0 1297.57 -1399.96 0 2419.58 0 2196.49 0 0 2399.29 1599.25 0 0 0 0 569.247 0 0 0 0 0 153.432 0 547.121 0 0 1438.72 0 0 -2089.68 0 0 -2147.51 0 0 0 0 0 -1767.1 0 
0 0 -2432.71 -1161.31 0 2338.25 0 0 -643.254 0 1552.86 0 -981.094 0 2056.87 0 -173.421 0 0 0 334.254 0 0 747.932 0 1881.24 0 0 1950.51 0 0 0 0 0 -11.063 0 0 0 0 0 0 0 0 0 0 0 2026.35 0 0 0 1321.22 0 -1848.73 0 
-1524.93 0 0 0 0 -330.287 0 0 0 0 0 0 -236.595 2457.12 -527.436 0 0 0 -413.297 0 0 0 0 0 0 0 0 0 -927.076 0 0 -86.1385 822.703 2093.65 0 322.81 0 2266.38 0 2222.28 -2377.62 0 490.814 0 0 0 1168.48 0 0 0 0 2112.26 -413.602 0 
57.4511 0 0 0 2215.26 0 1763.44 0 0.08 0 0 -65.8437 0 -758.461 -1971.57 0 2385.1 -212.18 376.37 0 0 326.319 0 0 1931.44 0 0 0 0 15.6407 0 0 0 0 0 0 0 -505.005 0 0 675.146 0 0 0 0 0 698.492 0 0 794.473 0 0 0 -178.152 
0 0 0 0 0 0 0 0 0 0.06 0 0 0 1175.65 0 0 0 1218.53 0 0 0 0 726.264 124.897 2273.55 1896.5 0 0 0 0 2414.4 0 -1923.81 0 795.236 -744.728 0 0 0 0 0 -1987.14 0 0 1783.12 1968.52 0 0 0 0 0 0 0 0 
1650.21 0 1706.37 0 0 0 -1240.5 0 0 0 0.09 1349.6 0 0 0 0 0 0 0 0 2115.77 0 1241.57 0 0 339.29 136.952 0 0 0 0 0 0 -2013.23 0 0 0 0 -131.001 0 0 0 0 -251.549 0 0 0 0 0 0 0 0 0 413.907 
0 0 508.667 0 0 0 0 0 283.288 0 2131.18 0.07 -2263.48 1947.92 1983.47 0 0 -897.778 0 0 0 0 0 0 1519.44 0 0 1598.18 0 0 0 -2032.46 0 0 0 281.762 0 0 0 2026.81 1401.18 -117.267 0 0 0 0 0 0 1654.18 0 1964.86 2434.23 0 0 
0 0 0 1468.93 0 0 -1241.87 725.501 0 0 0 -1574.98 0 0 0 0 0 0 0 0 0 0 0 900.525 0 0 0 0 0 0 0 1449.71 0 0 0 0 0 0 0 0 0 0 -959.273 0 0 0 0 0 0 2319.33 0 0 -264.824 0 
0 0 0 0 0 0 0 21.4393 1571.93 -2095.63 0 711.005 0 0.07 391.934 -1462.68 0 0 0 0 0 0 0 879.009 0 1562.93 1238.36 0 0 0 1790.14 0 352.107 0 0 0 0 2022.69 0 -1927.17 0 0 -729.774 0 0 0 12.1311 0 0 0 0 0 0 0 
-2319.03 0 1503.11 0 0 0 1577.88 2100.36 -568.178 0 0 734.962 0 2313.53 0.01 -55.1622 -271.538 0 0 0 0 0 -1642.74 443.51 0 0 0 1793.34 -1403.78 -271.538 0 -1829.66 0 -1593.3 0 2272.94 0 1982.1 1775.95 1358.46 0 0 0 0 0 0 0 0 -902.356 0 0 0 1710.94 0 
597.629 0 0 0 0 2225.94 0 0 0 0 0 0 0 10.9104 1003.98 0.07 1130.18 0 0 0 1723.91 -30.7474 0 0 0 0 0 354.854 0 0 -2476.35 0 0 0 0 303.583 0 -2378.23 0 0 1637.09 0 0 0 0 0 0 0 0 -1960.59 -562.075 0 1493.35 145.497 
0 300.836 0 0 0 946.608 2347.25 0 2215.26 0 0 0 0 0 706.275 1060.75 0 0 0 -1906.72 0 0 0 -688.879 0 0 0 0 0 18.8452 -681.249 0 0 174.184 2310.02 -255.516 1204.95 -5.41704 0 2139.27 -2107.23 2431.49 0 0 0 0 -704.749 0 0 -390.255 0 347.224 0 1949.75 
591.83 0 0 0 -68.8955 0 0 0 -2472.99 -2132.71 0 1139.79 0 0 0 0 0 0.05 1476.1 0 0 0 2092.58 0 -1120.56 0 0 0 0 0 1211.66 0 1901.84 0 0 0 -73.1681 -961.562 2117.76 825.602 0 0 0 1308.25 0 0 0 0 0 0 -955.916 0 0 -1058.15 
1455.81 0 -174.032 0 0 -957.442 0 2320.4 2363.28 0 0 0 0 0 0 0 0 -1594.52 0.06 0 1865.21 0 0 0 0 -1576.82 0 0 0 0 0 0 0 0 -1539.12 -512.787 0 0 0 0 -1619.24 0 0 1184.65 0 0 1781.14 0 0 0 0 1263.24 0 0 
0 1180.38 0 0 0 0 0 0 0 0 0 0 0 0 0 0 -2073.05 0 0 0.04 0 0 1629.46 0 1479.77 0 -1601.84 0 2258.14 0 162.74 0 450.072 0 0 0 0 0 0 1541.72 -926.008 0 0 0 -179.678 1228.45 0 0 0 2240.14 1410.18 0 0 0 
1580.78 0 0 0 2235.25 607.242 369.503 0 0 0 547.426 0 0 0 0 -508.057 0 0 1076.01 0 0.01 0 0 0 -366.298 1977.22 0 1525.09 0 0 0 0 0 -1390.19 0 1351.89 0 0 0 0 0 0 0 0 0 0 0 -1080.89 0 0 0 0 0 0 
0 0 0 0 0 0 0 0 1097.22 0 0 0 0 0 0 -440.001 0 0 0 0 0 0.01 0 0 0 0 0 0 0 0 0 0 0 0 0 0 919.752 0 0 1643.96 -1827.07 0 0 0 0 -2085.25 2025.28 0 0 0 0 0 0 0 
-1348.23 0 0 0 1335.11 0 0 0 0 1363.19 1752.6 0 0 0 -1247.52 0 0 236.747 0 2153.61 0 0 0.03 0 0 0 0 0 0 0 147.786 2230.98 701.697 0 0 -849.559 0 0 0 0 2487.49 0 2125.69 175.1 -10.3 0 0 0 0 0 0 0 1327.48 0 
0 0 0 0 0 1443.6 1956.62 0 0 992.08 0 0 -1630.22 -296.869 -224.387 0 1802.19 0 0 0 0 0 0 0.03 1209.37 0 0 608.005 0 0 0 0 0 -2494.96 2240.29 0 0 0 0 0 2087.24 1553.16 0 1731.7 467.772 -1826 0 0 -1642.74 1434.9 0 916.089 0 0 
369.808 1602.6 0 0 503.937 -605.564 0 0 1300.62 95.9044 0 -22.3548 0 0 0 0 0 1201.74 0 -187.46 36.0881 0 0 -967.818 0.08 868.48 -2395.32 0 -1673.41 0 0 0 0 -618.076 168.233 0 1748.94 0 927.839 0 0 -285.119 1400.72 0 0 0 2338.86 -734.809 0 0 0 0 0 0 
0 183.95 0 287.408 0 0 -1962.42 0 0 -302.82 -1195.64 0 0 -666.295 0 0 0 0 1096.15 0 1580.78 0 0 0 1804.64 0.04 1578.95 0 0 0 0 0 0 -1870.1 -382.321 0 0 0 602.512 0 0 0 0 0 0 0 0 0 -420.927 993.454 0 0 0 0 
1666.54 0 0 0 0 0 0 0 0 0 -1298.03 0 0 32.8837 0 0 0 0 0 751.595 0 0 0 0 1652.96 1608.71 0.01 0 289.544 0 0 0 0 0 0 0 0 0 0 0 0 0 0 -2180.93 0 0 0 0 0 0 842.997 103.229 0 0 
0 0 0 0 0 0 0 0 0 0 0 719.855 0 0 728.248 1976.91 0 0 0 0 2269.28 0 0 -234.916 0 0 0 0.07 0 0 0 680.334 0 0 0 0 -1730.78 -477.386 0 0 0 0 0 -324.793 0 0 0 0 0 0 0 0 0 0 
0 0 0 0 0 0 544.984 1782.36 0 0 0 0 0 0 -378.353 0 0 0 0 887.402 0 0 0 0 616.245 0 -934.4 0 0.07 -443.205 1867.05 0 1187.86 -1271.78 -836.131 1691.26 2247.31 -740.303 0 0 0 2258.45 -1342.89 0 0 0 1045.79 0 0 0 0 0 0 0 
0 2468.41 0 0 -109.943 2266.99 0 0 1054.19 0 0 0 0 0 86.1385 0 -802.866 0 0 0 0 0 0 0 0 0 0 0 2395.78 0 0 0 -36.8511 0 0 0 1659.52 0 -877.636 0 0 0 0 0 0 0 1119.19 0 0 0 -2009.11 0 0 0 
0 0 1720.4 452.818 743.507 0 0 0 0 1683.02 0 0 0 -222.861 0 -2308.5 2071.83 -502.869 0 1673.1 0 0 -275.048 0 0 0 0 0 -2247.92 0 0.02 0 0 0 0 0 1292.69 0 1708.96 0 0 -1414.91 0 1491.82 0 0 0 0 0 0 0 0 753.883 0 
0 0 -1446.81 0 2169.79 0 0 1452.45 0 0 0 2394.1 -262.23 0 -2417.29 0 0 0 0 0 0 0 436.186 0 0 0 0 1750.01 0 0 0 0.08 0 0 0 0 0 1013.9 0 -1314.51 -1101.18 0 0 0 0 0 0 -2069.54 1925.95 0 749.458 0 935.469 1411.71 
0 0 2245.02 0 0 0 0 622.806 0 1538.21 0 0 0 98.3459 0 0 0 1492.58 0 -724.586 0 0 -1143.6 0 0 0 0 0 -914.258 88.2748 0 0 0.06 -49.2111 -536.744 0 0 608.158 0 0 0 0 1317.87 0 0 0 0 0 2032.15 0 -895.489 -1596.04 2372.28 0 
1194.57 0 -1645.18 -1468.78 1017.11 0 0 1414.3 0 0 2053.82 0 0 0 -326.472 0 850.169 0 0 0 -50.2792 0 0 816.446 1797.92 2470.85 0 0 -1892.53 0 0 0 -1595.58 0 739.082 0 -2086.02 0 -938.063 -1455.5 0 442.9 0 0 0 0 0 0 2056.26 0 0 0 -1527.68 0 
1323.36 0 0 0 0 0 -454.802 0 0 -2360.84 0 0 0 0 0 0 1675.39 0 -572.909 0 0 0 0 -1836.68 -667.516 490.509 0 0 -1513.18 0 0 0 2027.12 -69.2007 0.03 1429.11 0 0 0 -365.535 0 0 1991.1 0 0 280.236 0 0 185.018 0 2261.65 -499.664 0 0 
-80.1874 0 0 0 0 1113.09 0 -1284.91 0 218.284 0 2118.82 0 0 2008.8 -2123.25 -1209.83 0 -1843.85 0 739.54 0 -1868.72 0 0 0 0 0 -929.06 0 0 0 0 0 1966.54 0.02 -348.14 2259.97 0 0 0 0 0 0 0 1648.69 0 1949.45 0 0 545.442 0 0 0 
0 2131.18 -132.374 0 0 0 0 0 0 0 0 0 0 0 0 0 1415.22 923.261 0 0 0 -1599.4 0 0 -943.556 0 0 680.486 969.497 748.085 -1263.85 0 0 1940.29 0 1205.1 0.06 0 0 0 0 0 0 0 0 0 0 0 152.516 -1023.21 0 0 2490.39 0 
0 2006.82 -958.052 0 0 -767.006 0 1836.68 1299.71 0 0 0 0 78.814 1407.59 153.89 1987.9 -1272.55 0 0 0 0 0 0 0 0 0 -557.802 -832.469 0 0 -1243.86 713.752 0 0 132.832 0 0.06 0 0 0 0 441.221 0 0 0 787.301 0 207.297 0 485.168 0 0 0 
0 0 0 0 394.833 0 0 0 0 0 1023.97 0 0 0 1191.37 0 0 -2070.45 0 0 0 0 0 0 643.559 -928.449 0 0 0 -73.3207 -635.319 0 0 2433.01 0 0 0 0 0.05 -184.866 0 0 0 0 0 0 0 -63.5548 273.675 0 0 823.008 0 0 
861.309 0 0 0 0 0 0 -365.383 0 0 0 -953.627 0 -318.232 1611.15 0 -80.1874 757.546 0 -383.847 0 -147.786 0 0 0 0 0 0 0 0 0 1252.56 0 816.141 2315.52 0 0 0 1880.93 0 671.789 0 0 1166.04 0 0 0 0 0 0 0 0 0 0 
0 0 0 0 0 2131.79 0 486.694 198.294 0 0 -605.716 0 0 0 1576.05 186.85 0 -1192.89 1288.57 0 1951.12 -58.977 1409.73 0 0 0 0 0 0 0 -1642.12 0 0 0 0 0 0 0 860.393 0 0 0 0 793.1 0 0 -1418.12 0 0 0 2265.62 0 0 
0 0 0 0 0 0 0 0 0 -2376.4 0 -1057.85 0 0 0 0 2483.37 0 0 0 0 0 0 -2245.17 2296.44 0 0 0 2230.52 0 334.559 0 0 295.038 0 0 0 0 0 0 0 0.04 -1753.82 0 0 0 1951.73 0 0 0 0 0 0 0 
0 -1087.3 820.109 326.472 0 0 0 1662.88 0 0 0 0 -1627.78 -1468.32 0 0 0 0 0 0 0 0 -1841.41 0 -763.955 0 0 0 2212.67 0 0 0 2299.04 0 807.596 0 0 28.6111 0 0 0 2373.04 0.06 0 0 0 0 0 0 -985.519 0 2078.08 1712.01 0 
0 0 0 0 0 1664.56 0 0 0 0 -414.823 0 0 0 0 0 0 578.097 -1028.24 0 0 0 1251.03 1642.89 0 0 1973.86 -2279.66 0 0 -714.667 0 0 0 0 0 0 0 0 1399.2 0 0 0 0.03 0 1089.43 2392.42 0 -31.8155 0 0 0 1296.96 1892.99 
0 0 2442.01 2485.35 0 0 0 0 0 1492.58 0 0 0 0 0 0 0 0 0 -2092.88 0 0 732.521 -584.048 0 0 0 0 0 0 0 0 0 0 0 0 0 0 0 0 2393.49 0 0 0 0.07 0 0 2035.2 0 502.716 0 0 1283.07 1119.95 
0 61.1133 0 0 0 0 0 0 0 1622.75 0 0 0 0 0 0 0 0 0 625.401 0 -1491.36 0 -683.386 0 0 0 0 0 0 0 0 0 0 -1871.01 384.304 0 0 0 0 0 0 0 2259.67 0 0 0 0 2233.42 1362.12 -1467.1 -1752.14 0 -155.263 
92.2422 0 0 0 2474.21 2159.26 2378.99 -1854.84 1513.95 0 0 0 0 1477.63 0 0 2224.72 0 978.195 0 0 480.132 0 0 105.365 0 0 0 -1204.64 384.915 0 0 0 0 0 0 0 -626.011 0 0 0 -1910.84 0 309.534 0 0 0.05 0 0 874.584 0 0 0 0 
0 0 0 1017.11 0 0 0 0 0 0 0 0 0 0 0 0 0 0 0 0 -613.498 0 0 0 1356.78 0 0 0 0 0 0 2114.7 0 0 0 984.451 0 0 -2132.25 0 2011.7 0 0 0 -99.414 0 0 0.02 -385.83 2279.05 0 0 0 0 
2409.21 1810.28 0 -752.663 0 0 0 0 0 0 0 -1220.97 0 0 2230.22 0 0 0 0 0 0 0 0 1350.06 0 -931.349 0 0 0 0 0 2159.72 -425.199 -585.727 1655.1 0 -1217.92 752.51 2212.36 0 0 0 0 -1094.47 0 737.709 0 -793.71 0.01 -1740.55 0 0 0 0 
0 0 0 0 0 0 0 0 420.316 0 0 0 1584.6 0 0 952.101 465.636 0 0 632.572 0 0 0 2377.62 0 20.6763 0 0 0 0 0 0 0 0 0 0 -538.423 0 0 0 0 0 -1691.41 0 2111.5 1834.54 1538.51 -2015.98 -811.106 0.06 0 0 0 -434.355 
0 0 0 0 0 0 -1153.37 0 0 0 0 2300.1 0 0 0 -795.694 0 1177.18 0 1774.58 0 0 0 0 0 0 -237.815 0 0 263.604 0 594.424 102.466 0 -2319.64 252.617 0 2227.77 0 0 0 0 0 0 0 560.701 0 0 0 0 0 0 0 0 
0 1259.12 0 -1752.75 0 0 0 -1499.3 0 0 0 1898.63 0 0 0 0 -1080.58 0 1160.85 0 0 0 0 1083.79 0 0 974.99 0 0 0 0 0 -17.3193 0 1532.87 0 0 0 2166.89 0 1711.55 0 790.811 0 0 -1801.74 0 0 0 0 0 0.09 0 0 
0 0 0 0 1970.35 2339.32 1872.08 132.069 0 0 0 0 -301.294 0 1567.96 427.946 0 0 0 0 0 0 886.486 0 0 0 0 0 0 0 2357.78 49.2111 605.258 1268.88 0 0 603.58 0 0 0 0 0 2458.65 -2432.71 2245.63 0 0 0 0 0 0 0 0 0 
0 0 0 0 0 0 0 0 2316.13 0 -2351.68 0 0 0 0 1128.04 -660.192 1206.63 0 0 0 0 0 0 0 0 0 0 0 0 0 1735.97 0 0 0 0 0 0 0 0 0 0 0 -2330.01 2327.88 -659.429 0 0 0 244.987 0 0 0 0.05 
