*Vertices 52
*Matrix 
0 0 0 0 0 0 0 -688.726 0 0 0 0 0 0 0 0 0 0 0 0 0 1057.24 0 0 1122.85 0 0 0 0 1207.08 0 0 0 0 0 0 948.897 0 0 0 0 0 0 0 -965.377 2454.53 0 -2377.93 0 0 0 0 
0 0 0 -966.445 0 0 0 -1323.05 2496.64 0 1799.6 1978.74 -370.266 0 0 0 0 0 -117.878 0 0 0 0 0 0 0 0 -758.309 0 -2365.87 -385.067 1579.41 0 0 -1314.2 0 973.922 0 0 0 0 0 0 0 0 -511.414 0 0 881.146 0 0 0 
0 0 0.05 0 0 -1671.42 0 0 0 0 0 0 -419.706 0 0 1941.97 2387.84 1421.17 0 0 0 0 0 0 0 0 0 0 0 1977.83 0 0 -2436.06 0 0 0 0 0 0 0 0 0 0 0 0 0 0 0 0 592.135 0 1307.49 
0 -1504.64 0 0.06 0 0 0 -1719.95 684.606 0 1124.07 0 387.204 0 1496.4 -2028.79 0 732.978 2279.35 0 0 0 0 0 0 1328.09 0 -2144.76 1500.06 0 0 0 0 -898.846 1910.84 0 343.562 770.821 0 0 0 -1397.06 0 1756.72 0 0 0 0 0 0 0 0 
0 0 0 0 0 2007.13 0 0 0 0 1030.99 573.214 0 0 0 0 0 0 544.374 2202.44 0 0 0 0 0 0 0 0 0 0 0 0 478.149 0 0 0 0 1085.62 0 -1950.21 0 0 0 -27.2378 0 0 0 2351.37 0 0 -1496.09 0 
0 0 2347.87 0 -1623.51 0.01 2237.85 -1750.01 0 0 0 0 0 -1672.19 0 0 1880.47 -2436.52 -367.672 0 592.746 0 0 0 0 0 -1880.47 0 0 0 124.744 2374.72 0 1276.97 0 0 0 0 0 0 0 0 0 -1321.38 0 0 0 -611.667 0 0 0 0 
0 0 0 0 0 -890.454 0.09 0 1508.61 2029.4 0 -0.686666 0 0 0 0 0 0 0 0 0 0 0 0 0 0 0 0 0 0 0 -1427.27 0 0 0 2477.42 113.3 0 0 0 0 766.854 0 0 -187.002 0 0 0 0 1026.41 2098.22 0 
-59.8926 304.956 0 -1179.01 0 -595.035 0 0.02 2021.32 507.447 0 0 0 0 0 0 0 0 0 0 0 0 0 0 0 0 1569.49 -508.515 0 0 0 1283.68 0 0 0 0 1985.15 0 0 945.235 0 398.648 0 0 0 0 0 0 0 0 0 -669.958 
0 -178.304 0 1415.68 0 0 2042.68 -1430.33 0.05 0 0 0 0 463.042 0 -1747.41 2239.68 0 0 0 2034.9 501.19 0 0 0 971.023 0 0 0 0 0 62.1815 110.401 0 -191.733 0 -2499.24 0 0 0 -2316.43 0 1089.43 0 406.888 0 369.808 -2398.22 0 0 0 0 
0 0 0 0 0 0 1924.42 1287.8 0 0.07 0 1129.57 0 0 0 -370.266 0 1663.49 2311.4 0 -539.491 0 0 0 765.481 0 -1462.68 0 0 0 0 0 0 0 0 0 -1965.93 0 -1232.41 0 0 0 0 0 0 0 0 0 -698.035 0 -990.097 168.081 
0 463.805 0 533.54 -1385.77 0 0 0 0 0 0.05 1859.57 349.971 0 0 530.183 0 0 0 0 -1298.03 0 751.289 0 0 0 0 1370.97 0 0 -2176.5 0 994.369 0 0 0 0 0 0 0 0 1697.52 0 -753.273 0 0 0 -449.004 0 473.418 0 0 
0 633.335 0 0 1137.81 0 2357.94 0 0 -476.775 -1445.13 0.02 874.889 0 1466.19 -118.488 0 0 0 0 171.743 0 0 884.35 0 0 0 0 0 566.042 1900.46 0 969.192 0 0 0 -2437.28 0 -1488.01 0 0 0 0 -2105.55 0 0 517.06 0 0 0 0 0 
0 1900.16 470.214 -938.368 0 0 0 0 0 0 2497.71 326.93 0 -2174.83 0 0 -2093.65 353.481 341.884 4.0437 0 0 0 662.023 0 0 0 0 0 0 1855.3 924.94 0 225.303 0 2078.08 5.41704 0 498.749 0 1118.43 0 0 -256.432 -2389.98 0 0 0 1145.44 -1178.4 0 0 
0 0 0 0 0 1169.39 0 0 507.141 0 0 0 2113.03 0 290.613 1091.57 0 0 1385.16 0 0 0 0 -1489.53 0 0 0 0 0 0 -657.75 0 0 0 0 -1818.06 1790.29 0 -2200.92 690.1 0 0 0 0 0 0 0 0 0 0 0 0 
0 0 0 559.328 0 0 0 0 0 0 0 2193.14 0 2019.64 0.07 0 0 0 0 0 0 2106.62 0 0 0 0 0 648.9 -1926.1 0 0 0 0 0 -225.303 0 0 0 -2288.66 0 0 -167.47 0 0 872.6 0 0 -123.218 0 0 0 0 
0 0 -754.799 -1861.4 0 0 0 0 1687.6 2125.39 1242.48 880.993 0 1336.79 0 0 0 0 0 0 0 584.658 0 0 0 0 -1086.54 1104.85 0 0 0 0 0 0 0 0 0 0 0 0 295.19 0 -1827.83 0 0 747.322 0 0 0 0 0 0 
0 0 1876.51 0 0 -86.7489 0 0 1091.42 0 0 0 -509.278 0 0 0 0.09 0 0 -1008.26 0 0 0 0 0 2309.11 0 0 0 -1380.73 0 0 0 901.898 0 0 0 0 0 501.038 0 0 244.224 0 0 0 0 2160.94 0 0 0 0 
0 0 882.977 1211.97 0 232.78 0 0 0 1294.06 0 0 1601.08 0 0 0 0 0.08 0 -2128.9 2079.3 0 0 0 0 0 0 0 943.709 0 0 -2221.06 0 0 0 -873.363 0 777.535 0 0 0 0 0 -1866.89 1737.04 0 0 0 0 0 167.623 0 
0 -1496.7 0 2074.88 1431.24 -2066.48 0 0 0 241.935 0 0 2310.79 -1251.18 0 0 0 0 0.01 0 0 0 0 -1908.25 -1382.56 0 0 0 0 0 0 0 0 0 0 72.4052 667.516 0 0 0 0 0 0 0 0 1818.52 0 2011.4 0 0 0 0 
0 0 0 0 216.453 0 0 0 0 0 0 0 -1111.1 0 0 0 -1761.3 119.709 0 0.09 0 0 2170.25 1469.85 1698.13 0 0 302.515 -336.085 1238.52 0 0 0 -251.244 0 -1718.73 29.5267 -1024.74 0 -13.0467 0 2345.58 0 0 0 0 0 0 0 0 0 0 
0 0 0 0 0 1927.17 0 0 -955.763 1260.34 1103.17 1699.35 0 0 0 0 0 -746.101 0 0 0.09 870.769 0 0 0 0 0 0 1261.86 0 1337.4 0 0 0 0 -1740.24 0 438.017 0 0 0 0 0 0 0 0 0 827.891 0 0 0 0 
2185.81 0 0 0 0 0 0 0 2202.44 0 0 0 0 0 -668.126 1678.44 0 0 0 0 -74.6941 0.01 0 -1853.47 0 1311 0 2401.73 0 0 1410.95 0 0 0 153.89 0 0 0 0 0 -655.309 0 -184.713 0 0 0 0 -201.346 0 -832.774 1273.61 0 
0 0 0 0 0 0 0 0 0 0 -176.168 0 0 0 0 0 0 0 0 678.503 0 0 0.08 0 2359.61 0 0 0 0 0 0 0 1308.25 -2289.88 -2160.18 0 2009.41 0 0 0 0 0 0 0 0 0 0 -1020.77 0 0 0 1156.88 
0 0 0 0 0 0 0 0 0 0 0 1809.67 1774.88 1105.3 0 0 0 0 345.088 1775.64 0 -89.9533 0 0.08 0 -208.365 0 0 0 0 0 243.767 0 0 -2210.99 0 -1890.55 0 0 -36.6985 2239.22 1725.59 0 0 0 0 0 0 0 0 0 0 
1334.04 0 0 0 0 0 0 0 0 2343.13 0 0 0 0 0 0 0 0 955.458 -286.798 0 0 1815.62 0 0.06 0 0 0 0 0 0 0 0 0 0 -805.002 0 0 0 0 0 1057.54 -1512.73 530.183 0 0 0 2008.19 0 0 0 0 
0 0 0 188.986 0 0 0 0 -426.42 0 0 0 0 0 0 0 -1082.57 0 0 0 0 15.0304 0 441.527 0 0.06 591.678 0 -1175.65 0 0 1484.34 0 0 0 0 0 0 0 0 0 1186.48 0 1640.14 0 2408.75 0 0 746.864 0 0 0 
0 0 0 0 0 1715.06 0 185.629 0 -2366.48 0 0 0 0 0 991.47 0 0 0 0 0 0 0 0 0 -1250.27 0.09 0 0 0 0 0 0 0 0 -2145.07 -420.774 -1641.82 2306.36 0 0 899.457 1454.44 1938.76 -20.5237 0 997.269 0 0 971.328 -1822.79 1367.15 
0 -372.25 0 -603.427 0 0 0 2374.11 0 0 1373.56 0 0 0 2093.49 -773.721 0 0 0 1100.12 0 -264.061 0 0 0 0 0 0 0 -1852.09 0 0 0 1007.49 0 1313.9 0 -555.666 0 0 0 0 1754.13 0 0 0 0 0 0 0 0 0 
0 0 0 451.75 0 0 0 0 0 0 0 0 0 0 2178.95 0 0 -1305.2 0 2162.77 -2021.32 0 0 0 0 1595.13 0 0 0.03 0 0 1072.8 0 0 0 0 0 0 0 0 0 0 -2137.14 0 0 0 1465.12 0 0 -1658.6 0 0 
927.686 -1549.65 -1877.57 0 0 0 0 0 0 0 0 2302.39 0 0 0 0 1687.6 0 0 1322.75 0 0 0 0 0 0 0 -436.796 0 0.02 -182.882 -686.285 0 0 2453.46 0 2151.17 2150.26 0 0 1199.15 -22.0496 -387.967 0 0 0 2102.95 0 0 0 0 0 
0 -103.992 0 0 0 829.417 0 0 0 0 288.324 455.718 366.604 235.374 0 0 0 0 0 0 1139.48 -563.601 0 0 0 0 0 0 0 587.71 0 0 0 0 0 0 0 0 0 0 0 0 0 0 0 0 0 0 0 0 0 0 
0 201.346 0 0 0 137.562 -73.1681 -118.03 586.337 0 0 0 1965.47 0 0 0 0 1453.98 0 0 0 0 0 2123.4 0 -1515.78 0 0 2036.58 -329.981 0 0.02 1857.13 1677.68 0 0 1439.02 0 0 -5.87481 0 0 0 0 1045.49 0 0 0 0 0 0 0 
0 0 659.734 0 -2366.79 0 0 0 -115.741 0 1677.37 272.759 0 0 0 0 0 0 0 0 0 0 1980.12 0 0 0 0 0 0 0 0 -2106.92 0.09 0 0 0 0 0 -265.587 783.792 0 0 1367.46 0 0 0 0 0 0 0 0 0 
0 0 0 -1795.33 0 -149.464 0 0 0 0 0 0 2234.79 0 0 0 1524.93 0 0 2192.22 0 0 2497.56 0 0 0 0 -2307.43 0 0 0 -1580.17 0 0.01 0 0 0 0 0 0 2071.37 0 0 0 -1343.96 0 0 0 -104.45 0 0 0 
0 1145.74 0 -1718.88 0 0 0 0 1605.5 0 0 0 0 0 358.669 0 0 0 0 0 0 -196.921 2346.49 -1665.93 0 0 0 0 0 -605.564 0 0 0 0 0.06 0 2091.05 535.981 0 0 0 0 0 0 177.389 -588.015 -798.898 0 0 634.556 0 0 
0 0 0 0 0 0 1817 0 0 0 0 0 1435.21 1780.68 0 0 0 -2486.11 -1237.14 -980.331 1272.24 0 0 0 -1077.84 0 1785.1 2123.1 0 0 0 0 0 0 0 0.05 0 0 0 0 -1665.17 0 -1862.62 914.563 0 0 0 0 0 0 0 0 
-1019.09 2493.9 0 2131.64 0 0 1465.88 -2475.59 -1966.23 379.116 0 -1889.63 1364.56 2100.82 0 0 0 0 -147.023 -1878.64 0 0 -1110.34 18.8452 0 0 116.657 0 0 -450.835 0 1091.88 0 0 229.27 0 0 0 0 0 0 0 0 0 1080.89 2177.42 0 0 0 0 0 0 
0 0 0 2110.89 -1795.02 0 0 0 0 0 0 0 0 0 0 0 0 -1370.05 0 1565.98 1057.7 0 0 0 0 0 324.183 -19.303 0 902.661 0 0 0 0 1544.16 0 0 0.04 0 0 0 6.48518 0 0 0 0 0 0 0 0 0 0 
0 0 0 0 0 0 0 0 0 715.735 0 -431.761 2470.85 -803.476 1140.1 0 0 0 0 0 0 0 0 0 0 0 -642.949 0 0 0 0 0 1187.09 0 0 0 0 0 0.05 0 0 0 0 2490.23 0 0 0 0 0 0 0 0 
0 0 0 0 -718.787 0 0 7.55333 0 0 0 0 0 -471.74 0 0 -956.984 0 0 2002.09 0 0 0 189.138 0 0 0 0 0 0 0 1513.79 2126.3 0 0 0 0 0 0 0.06 0 0 362.178 1157.49 0 -1186.64 0 0 0 0 0 0 
0 0 0 0 0 0 0 0 2114.55 0 0 0 256.127 0 0 -119.709 0 0 0 0 0 1891.61 0 436.186 0 0 0 0 0 -965.529 0 0 0 1469.39 0 -1433.53 0 0 0 0 0.04 1588.87 0 1092.94 0 0 0 210.654 1763.89 2173.6 0 0 
0 0 0 132.069 0 0 -2427.37 2455.9 0 0 -943.098 0 0 0 90.4111 0 0 0 0 202.414 0 0 0 452.818 463.347 -167.776 1680.43 0 0 1208 0 0 0 0 0 0 0 1306.88 0 0 2092.43 0.06 0 0 0 0 0 -557.344 0 0 1045.18 0 
0 0 0 0 0 0 0 0 1142.23 0 0 0 0 0 0 -1545.84 1383.94 0 0 0 0 -622.501 0 0 -1457.79 0 1910.99 -951.796 -665.99 1952.8 0 0 -2303.16 0 0 2395.32 0 0 0 737.556 0 0 0.03 0 1742.23 0 0 0 0 0 0 0 
0 0 0 1279.26 -2060.84 427.488 0 0 0 0 1729.1 1187.55 -457.854 0 0 0 0 2418.97 0 0 0 0 0 0 -2306.51 2177.88 1938.92 0 0 0 0 0 0 0 0 2478.33 0 0 -1798.53 -2054.28 109.485 0 0 0.06 0 0 0 0 0 0 0 0 
2330.77 0 0 0 0 0 2305.75 0 1749.55 0 0 0 63.86 0 879.772 0 0 501.648 0 0 0 0 0 0 0 0 501.801 0 0 0 0 1616.79 0 1452.3 278.405 0 -998.642 0 0 0 0 0 -1770.15 0 0.04 0 0 -2017.04 0 0 0 0 
1054.19 2328.94 0 0 0 0 0 0 0 0 0 0 0 0 0 1547.98 0 0 353.175 0 0 0 0 0 0 -1427.58 0 0 0 0 0 0 0 0 1925.49 0 686.59 0 0 2373.81 0 0 0 0 0 0.05 0 0 -1021.07 0 0 0 
0 0 0 0 0 0 0 0 1797.77 0 0 1113.7 0 0 0 0 0 0 0 0 0 0 0 0 0 0 1165.27 0 2110.74 411.771 0 0 0 0 -239.494 0 0 0 0 0 0 0 0 0 0 0 0.09 -675.146 -2033.07 0 0 0 
-2282.4 0 0 0 -647.832 1158.86 0 0 -446.715 0 104.144 0 0 0 1889.32 0 2007.28 0 197.836 0 2360.07 -2415.16 2029.1 0 1926.4 0 0 0 0 0 0 0 0 0 0 0 0 0 0 0 1756.42 -1794.87 0 0 -1269.95 0 2303.31 0.02 0 0 0 0 
0 -1625.03 0 0 0 0 0 0 0 -857.036 0 0 -305.109 0 0 0 0 0 0 0 0 0 0 0 0 547.578 0 0 0 0 0 0 0 -119.709 0 0 0 0 0 0 2478.18 0 0 0 0 -1420.41 2083.42 0 0.02 0 0 0 
0 0 2270.2 0 0 0 -2373.2 0 0 0 -2129.05 0 1087.3 0 0 0 0 0 0 0 0 1212.12 0 0 0 0 274.895 0 1195.79 0 0 0 0 0 1382.87 0 0 0 0 0 600.681 0 0 0 0 0 0 0 0 0.07 0 0 
0 0 0 0 -2443.08 0 -258.263 0 0 2195.27 0 0 0 0 0 0 0 -2053.97 0 0 0 2339.32 0 0 0 0 2429.35 0 0 0 0 0 0 0 0 0 0 0 0 0 0 2464.45 0 0 0 0 0 0 0 0 0.08 0 
0 0 -2124.77 0 0 0 0 2472.23 0 -1195.49 0 0 0 0 0 0 0 0 0 0 0 0 -1156.73 0 0 0 1985.76 0 0 0 0 0 0 0 0 0 0 0 0 0 0 0 0 0 0 0 0 0 0 0 0 0.08 
