*Vertices 51
*Matrix 
0 0 0 96.057 0 0 0 0 0 0 0 0 0 1766.03 0 0 0 0 2485.96 0 0 1065.17 0 -646.001 -2153 0 0 0 0 0 0 798.288 1253.62 0 1176.87 0 -430.082 1065.63 0 0 0 626.164 0 0 0 0 0 0 0 0 0 
0 0.07 0 0 -87.817 1713.08 0 0 0 0 -1418.88 0 0 0 0 -93.0052 0 0 1552.1 -941.572 0 0 1337.4 0 -1599.25 0 0 0 -307.092 681.249 0 1788 -1433.38 0 922.193 0 0 1514.86 0 0 0 0 1507.69 0 0 -2206.26 0 0 -2458.04 0 0 
0 0 0.07 0 -1783.88 1409.42 0 0 0 0 0 0 2266.23 0 254.906 2330.01 2298.27 0 0 0 0 0 0 49.2111 -1977.37 0 0 0 0 0 2360.07 0 0 0 0 0 0 0 0 0 0 -1291.92 0 2173.6 -285.424 0 -2159.11 0 0 0 0 
-782.418 0 0 0.03 0 -2443.24 0 349.666 0 0 0 -957.9 0 0 0 0 0 -2496.03 2390.59 0 0 0 0 0 0 0 -1890.7 0 0 0 0 -84.6126 0 -779.519 0 1456.11 0 2442.47 0 -139.241 0 0 2052.29 0 1015.58 0 0 -478.912 0 0 0 
0 -1427.27 2150.87 0 0.03 0 0 0 -484.1 0 0 1558.05 0 0 0 0 1082.26 0 0 0 2036.88 0 0 0 2010.48 0 0 1929.15 0 0 0 0 0 141.072 0 0 0 -638.066 0 0 0 0 0 0 0 0 0 -591.067 -693.304 -36.8511 0 
0 -126.118 1724.68 -49.3637 0 0.05 0 0 0 -567.415 0 0 0 30.4422 0 0 0 0 0 0 0 0 0 0 0 1766.18 0 0 170.37 0 0 0 -2439.27 0 0 1745.12 0 0 0 -1667.76 0 0 0 0 0 0 0 777.993 0 0 0 
0 0 0 0 0 0 0.06 0 0 0 -680.639 2116.23 0 0 0 0 252.77 849.254 0 0 0 601.749 0 0 0 -1002.46 0 188.986 0 -1209.98 1968.83 0 0 0 0 0 0 0 0 0 -965.987 1751.23 -113.147 0 0 2202.29 0 2071.52 0 -1605.66 0 
0 0 0 1335.87 0 0 0 0.07 1429.26 0 0 0 2267.6 0 0 0 0 2366.33 0 0 0 1408.2 -172.048 0 0 0 0 0 0 -2176.81 0 -255.669 -271.996 0 2245.02 -1879.56 0 -203.177 0 0 846.049 0 0 0 0 722.144 0 0 0 -471.74 0 
0 0 0 0 -27.2378 0 0 -853.832 0.01 0 0 0 2064.81 2229.91 0 2315.52 0 0 1332.06 -1639.07 2374.11 302.362 0 1425.6 0 0 1779.31 2483.67 0 0 0 0 0 1953.72 0 0 -1673.41 1933.58 -1266.75 0 0 0 -1265.68 0 0 0 0 0 0 0 0 
0 0 0 0 0 2238.61 0 0 0 0.05 0 0 -1403.78 0 0 0 1010.24 0 0 0 0 0 0 -167.928 0 -1303.37 0 0 0 0 0 0 0 1539.28 0 0 0 -75.9148 836.131 0 0 0 0 0 0 0 1358.91 0 0 0 -365.841 
0 -55.1622 0 0 0 0 736.335 0 0 0 0.08 1867.96 0 0 0 0 0 0 0 0 0 0 0 0 0 659.886 0 0 0 -1580.32 0 0 0 0 0 0 0 -1813.33 0 -2248.07 1501.13 0 1910.08 0 0 204.398 1319.7 0 0 0 0 
0 0 0 469.909 1321.22 0 2286.52 0 0 0 1888.26 0.05 0 0 0 575.503 2125.69 0 0 0 0 0 0 0 0 0 0 0 -2104.18 0 0 0 0 0 0 0 0 185.476 263.909 0 0 0 0 0 0 0 1376.92 0 0 0 0 
0 0 -1997.82 0 0 0 0 -900.067 1004.75 1772.29 0 0 0.04 0 399.106 0 0 0 0 0 0 0 0 -2215.87 0 0 551.241 0 0 0 0 -95.1415 -432.066 0 0 0 0 0 0 0 -879.467 -460.753 2117.6 0 0 0 1996.29 0 0 2349.85 0 
2383.11 0 0 0 0 -1554.54 0 0 1781.44 0 0 0 0 0 0 0 0 559.328 0 -162.435 -715.278 0 0 0 0 0 1561.4 0 0 0 0 0 0 0 0 0 0 0 0 0 0 0 0 0 0 0 2366.63 0 0 0 0 
0 0 1022.45 0 0 0 0 0 0 0 0 0 408.414 0 0.02 0 0 0 0 0 -257.042 0 0 0 1490.3 1805.7 0 0 0 795.389 919.599 0 0 0 0 0 0 0 -482.116 0 0 2213.28 0 653.02 0 0 0 -325.861 0 0 -1672.19 
0 1331.29 -2196.65 0 0 0 0 0 2356.26 0 0 1924.57 0 0 0 0 0 133.9 0 0 0 2220.45 -1526.76 0 0 0 0 0 0 0 0 0 0 0 0 0 -72.8629 1032.21 0 0 0 0 0 0 1764.2 2215.26 0 0 0 0 0 
0 0 -2058.85 0 -912.885 0 -154.042 0 0 -1800.82 0 -670.873 0 0 0 0 0 0 0 -1360.9 0 0 0 -341.121 0 2254.33 0 -291.833 0 1017.56 0 -794.015 0 0 -124.592 1608.25 1788.31 0 2014.45 0 2064.35 0 0 1080.58 0 143.056 0 0 0 0 0 
0 0 0 1472.75 0 0 -1719.95 31.663 0 0 0 0 0 -701.849 0 -1627.48 0 0.09 0 0 0 1894.67 0 0 0 0 0 0 -706.885 -1099.66 -1754.89 0 513.245 -388.882 0 2483.06 2440.49 0 0 0 0 0 1755.96 0 0 0 -555.055 1443.45 0 997.879 0 
1164.36 164.113 0 376.522 0 0 0 0 -243.614 0 0 0 0 0 0 0 0 0 0 0 0 0 0 1376.61 0 0 0 997.116 0 1472.59 0 0 0 0 0 0 0 0 0 0 0 0 192.038 2174.37 -546.968 0 0 0 0 0 0 
0 -1263.24 0 0 0 0 0 0 752.968 0 0 0 0 1053.88 0 0 1837.29 0 0 0.08 332.728 -1710.94 0 1995.68 1556.06 -593.814 2111.96 0 1858.5 0 2095.32 0 -1339.84 0 0 0 0 0 0 0 -755.867 -579.165 1030.38 0 0 0 0 0 2390.29 0 0 
0 0 0 0 -2224.27 0 0 0 -1442.84 0 0 0 0 -808.206 2345.88 0 0 0 0 2081.44 0.07 0 0 392.85 0 0 0 0 0 -514.466 0 0 2106.31 -156.941 0 0 0 1206.32 0 1008.1 852.458 2369.99 0 1940.9 1815.01 0 0 496.918 0 0 0 
-0.991852 0 0 0 0 0 1339.84 2295.83 2137.29 0 0 0 0 0 0 1848.28 0 -367.672 0 -1208.61 0 0.07 0 0 650.578 0 0 1594.67 930.28 0 0 0 0 0 0 0 0 0 0 2251.73 0 -2247.31 0 0 0 0 0 2090.14 0 0 0 
0 2102.19 0 0 0 0 0 718.177 0 0 0 0 0 0 0 980.178 0 0 0 0 0 0 0.02 0 0 20.3711 0 -1617.56 0 -96.9726 2191 -2192.07 0 0 0 0 1654.18 0 0 0 -426.572 0 0 0 0 0 0 0 0 0 0 
2082.81 0 1721.78 0 0 0 0 0 1627.32 747.932 0 0 -118.641 0 0 0 992.538 0 1584.9 2243.49 1926.56 0 0 0.01 1973.4 0 0 0 0 -1710.94 0 0 1413.54 0 0 509.125 0 0 0 0 289.239 0 0 -952.559 0 0 0 0 0 0 0 
1563.84 1880.32 10.7578 0 -2236.17 0 0 0 0 0 0 0 0 0 150.685 0 0 0 0 1313.59 0 -513.855 0 1649.91 0.07 0 0 0 0 -461.669 0 0 0 0 -1066.55 0 0 33.4941 0 0 0 1611.76 0 0 0 0 -737.098 1492.58 0 0 0 
0 0 0 0 0 2067.25 -2314.6 0 0 -683.996 707.953 0 0 0 -307.703 0 1232.26 0 0 1948.23 0 0 1879.25 0 0 0.04 0 0 769.143 2210.07 0 0 0 0 -1834.54 367.824 0 0 791.574 0 0 0 -227.439 0 0 0 -835.215 0 -1038.32 -1634.04 0 
0 0 0 -1079.52 0 0 0 0 -1269.34 0 0 0 -1125.6 2026.96 0 0 0 0 0 2467.8 0 0 0 0 0 0 0.03 -1400.11 1250.11 0 -716.651 0 0 1907.94 1232.57 -1784.04 0 0 1859.57 0 0 0 0 1662.11 -2104.18 0 0 0 0 0 0 
0 0 0 0 -1141.01 0 1762.52 0 2060.53 0 0 0 0 0 0 0 -1493.8 0 1796.85 0 0 -1607.03 489.288 0 0 0 -1505.55 0.04 1681.04 0 -1888.26 748.39 0 1152.15 0 0 1825.85 0 0 0 456.786 0 1737.49 0 0 1395.38 0 0 0 0 0 
0 1508.15 0 0 0 774.789 0 0 0 0 0 1429.11 0 0 0 0 0 -2407.22 0 319.147 0 -1963.18 0 0 0 1226.77 854.9 1941.82 0.09 0 0 -210.959 1438.11 0 1645.79 2315.21 0 2409.05 0 0 0 0 0 0 0 0 0 84.3074 0 0 1299.4 
0 730.079 0 0 0 0 1427.12 951.796 0 0 -761.055 0 0 0 -630.131 0 369.045 1934.03 2248.68 0 -1866.44 0 476.012 1895.43 2039.32 516.907 0 0 0 0 1093.86 314.417 0 1405.45 0 0 0 0 0 0 0 0 2209.92 0 0 1881.69 0 0 0 0 0 
0 0 290.765 0 0 0 2385.4 0 0 0 0 0 0 0 1541.11 0 0 128.864 0 2253.11 0 0 -611.362 0 0 0 -2015.06 2229.76 0 -945.082 0 -1102.1 1172.29 0 0 0 0 0 0 0 0 0 0 0 1205.56 2082.05 0 0 0 0 0 
-1319.09 -2016.28 0 -260.094 0 0 0 -1819.59 0 0 0 0 1657.84 0 0 0 723.06 0 0 0 0 0 -398.801 0 0 0 0 14.5726 1475.95 -1169.09 1134.45 0.04 1602.15 0 0 0 0 0 0 -2230.52 0 0 2420.35 -666.906 2447.97 0 -998.337 0 1325.65 0 0 
1932.97 2303.61 0 0 0 1218.99 0 340.358 0 0 0 0 1671.27 0 0 0 0 -1491.52 0 -1074.63 1652.65 0 0 1484.95 0 0 0 0 287.866 0 -1916.94 -471.129 0.02 0 1392.94 0 0 398.495 -2309.41 0 0 1704.69 0 0 0 0 0 0 0 0 0 
0 0 0 237.815 -1675.85 0 0 0 1874.68 1481.9 0 0 0 0 0 0 0 2234.64 0 0 156.789 0 0 0 0 0 2212.21 -339.29 0 -358.058 0 0 0 0 0 0 0 0 0 -1859.11 0 0 -943.556 0 0 0 2084.64 0 0 0 0 
-1525.09 287.255 0 0 0 0 0 509.43 0 0 0 0 0 0 0 0 2250.36 0 0 0 0 0 0 0 -717.719 -2436.98 1292.84 0 406.888 0 0 0 -680.181 0 0.09 0 -619.449 2116.69 0 0 0 349.361 1221.12 0 1743.6 2115.92 471.892 -1236.23 0 0 2286.22 
0 0 0 -1092.64 0 -2452.85 0 2451.48 0 0 0 0 0 0 0 0 809.427 -375.607 0 0 0 0 0 -937.452 0 920.057 1915.27 0 371.944 0 0 0 0 0 0 0.06 2227.16 646.458 -329.371 0 579.012 1811.96 0 0 -1493.65 0 -1417.05 0 0 0 0 
2215.11 0 0 0 0 0 0 0 -838.572 0 0 0 0 0 0 2328.79 2035.2 -633.946 0 0 0 0 2433.62 0 0 0 0 861.614 0 0 0 0 0 0 -1238.52 1696.45 0 0 214.774 0 -74.2363 -810.8 0 0 0 0 0 0 0 0 0 
2153.16 -13.0467 0 -85.0703 890.149 0 0 -1153.52 -1754.43 1470 1982.86 -1359.37 0 0 0 369.808 0 0 0 0 1675.54 0 0 0 747.78 0 0 0 -1203.57 0 0 0 1453.67 0 483.032 -1278.5 0 0.01 0 0 0 0 0 758.003 1960.43 0 1015.27 0 0 703.375 1742.68 
0 0 0 0 0 0 0 0 -2478.94 770.363 0 1831.19 0 0 -94.5311 0 1903.67 0 0 0 0 0 0 0 0 -2389.52 -392.544 0 0 0 0 0 -710.242 0 0 2386.78 426.42 0 0.02 0 0 0 -198.447 0 0 -962.783 1264.15 0 0 0 0 
0 0 0 1286.74 0 -1959.52 0 0 0 0 1478.85 0 0 0 0 0 0 0 0 0 -1042.89 767.006 0 0 0 0 0 0 0 0 0 -1007.8 0 -2279.05 0 0 0 0 0 0.03 0 0 0 0 0 0 1858.81 1297.11 0 0 0 
0 0 0 0 0 0 -891.064 -1400.11 0 0 2008.65 0 -712.073 0 0 0 1839.43 0 0 1745.12 1925.49 0 -1574.07 -539.338 0 0 0 1909.92 0 0 0 0 0 0 0 1824.63 1957.69 0 0 0 0.09 1387.91 145.802 0 0 0 -344.478 0 0 0 0 
795.999 0 18.0822 0 0 0 2082.66 0 0 0 0 0 2332.76 0 -1605.66 0 0 0 0 -199.973 105.518 -785.318 0 0 -1101.03 0 0 0 0 0 0 0 -1368.83 0 239.494 1900.16 559.175 0 0 0 2318.11 0.01 0 -1478.24 0 0 0 -1184.04 0 0 2037.64 
0 -848.033 0 2097.46 0 0 -1157.64 0 -1569.03 0 -289.239 0 -211.57 0 0 0 0 1197.62 -1557.89 -98.6511 0 0 0 0 0 2200.92 0 -1086.38 0 -787.149 0 1274.38 0 2377.47 2193.9 0 0 0 1813.49 0 -824.992 0 0.04 0 0 0 698.645 0 0 0 0 
0 0 2458.04 0 0 0 0 0 0 0 0 0 0 0 1560.95 0 91.4792 0 866.039 0 -1726.81 0 0 -2171.93 0 0 2069.08 0 0 0 0 2375.79 0 0 0 0 0 -957.289 0 0 0 1440.55 0 0.09 0 1722.85 0 2066.64 0 0 0 
0 0 -520.722 1211.51 0 0 0 0 0 0 0 0 0 0 0 2248.53 0 0 -1433.07 0 1791.21 0 0 0 0 0 -377.285 0 0 0 -2290.19 506.989 0 0 -607.242 525.605 0 2367.4 0 0 0 0 0 0 0.07 0 2477.42 598.849 0 0 2386.93 
0 2344.66 0 0 0 0 2230.22 237.663 0 0 321.131 0 0 0 0 518.586 279.778 0 0 0 0 0 0 0 0 0 0 733.284 0 1279.72 -2140.95 0 0 0 -2065.42 0 0 0 -509.735 0 0 0 0 1966.69 0 0 1534.24 0 0 0 0 
0 0 423.215 0 0 0 0 0 0 2094.41 2466.28 1378.14 -1903.67 -692.541 0 0 0 1426.36 0 0 0 0 0 0 1595.58 987.045 0 0 0 0 0 -1490.3 0 38.8348 -423.368 1114.15 0 -2180.62 23.2704 -475.402 1734.29 0 1749.55 0 2267.45 1968.37 0.01 0 162.74 0 0 
0 0 0 1188.62 -2090.59 1796.09 2485.2 0 0 0 0 0 0 0 -368.13 0 0 -717.719 0 0 -69.5059 2439.42 0 0 -1861.55 0 0 0 1028.4 0 0 0 0 0 -1689.73 0 0 0 0 -1155.51 0 2255.7 0 1661.05 974.685 0 0 0.04 0 0 0 
0 1311.15 0 0 -2186.42 0 0 0 0 0 0 0 0 0 0 0 0 0 0 2069.54 0 0 0 0 0 -667.058 0 0 0 0 0 1535 0 0 0 0 0 0 0 0 0 0 0 0 0 0 706.732 0 0 0 0 
0 0 0 0 -1081.96 0 2072.13 1016.04 0 0 0 0 419.553 0 0 0 0 1634.04 0 0 0 0 0 0 0 -2165.97 0 0 0 0 0 0 0 0 0 0 0 102.771 0 0 0 0 0 0 0 0 0 0 0 0.09 0 
0 0 0 0 0 0 0 0 0 -481.353 0 0 0 0 -1323.36 0 0 0 0 0 0 0 0 0 0 0 0 0 659.581 0 0 0 0 0 2454.37 0 0 -608.31 0 0 0 2047.72 0 0 -1405.91 0 0 0 0 0 0.05 
