*Vertices 68
*Matrix 
0.03 880.078 0 0 0 0 0 0 0 0 0 2133.17 0 0 0 0 0 0 0 0 0 0 0 -1784.65 0 0 0 0 0 0 0 0 713.599 0 0 1503.72 381.558 0 940.809 0 0 0 0 1330.38 0 0 0 0 0 0 0 0 -2262.11 0 0 0 0 0 0 0 0 0 0 0 0 0 0 0 
-272.759 0.08 0 0 0 -1054.64 0 0 0 209.281 912.427 0 0 0 0 0 -542.238 0 0 0 -624.332 0 206.381 2246.24 0 491.272 0 943.709 0 1637.55 0 0 0 0 0 0 0 0 0 0 1364.56 0 2185.81 0 -1466.64 0 0 0 1348.99 0 0 -199.82 0 0 0 2416.53 0 0 0 0 -2009.87 0 0 0 0 0 0 0 
0 0 0.06 0 0 0 769.906 0 407.193 0 -236.137 -1143.45 0 0 1260.64 0 0 -1385.46 0 0 0 0 0 242.546 0 0 -239.341 1814.25 1033.89 0 0 0 2188.56 1406.67 0 0 0 662.938 0 -1510.59 -891.522 0 0 0 496.46 0 0 0 0 0 0 0 0 0 0 0 0 0 -2425.69 0 0 0 2138.66 0 0 0 0 0 
0 0 0 0.05 459.075 306.33 1405.91 0 1295.89 -499.664 0 1728.03 0 0 0 503.632 0 0 -1641.97 0 0 0 0 0 750.679 0 0 -394.07 2471.16 0 1779.31 0 1535.92 0 963.546 0 0 0 0 0 0 1196.71 0 0 0 1162.37 0 0 0 1318.02 0 0 0 0 0 0 0 0 0 0 0 0 -167.47 0 0 0 0 0 
0 0 0 -301.294 0.02 0 0 2463.68 0 0 0 0 2122.64 0 -1108.97 0 0 -1730.02 0 -1617.71 0 2271.72 0 0 0 0 0 0 0 0 -383.236 0 0 0 0 0 0 2169.18 0 288.171 0 0 0 0 -1109.27 0 0 0 0 0 0 0 1719.95 0 0 0 0 0 0 0 0 0 0 0 0 0 0 0 
0 -1926.25 0 -575.198 0 0.08 0 0 0 2021.77 0 0 0 1979.2 0 0 0 -62.0289 0 -2310.94 0 1494.11 0 0 0 0 1499.3 -275.811 0 1409.42 0 0 0 0 0 0 1056.02 -439.848 0 0 -1942.73 -1670.05 0 1967.45 0 1459.62 0 0 -1865.52 0 0 0 0 0 0 0 0 0 0 0 1475.95 0 0 0 203.33 0 0 0 
0 0 -1842.48 365.23 0 0 0.02 0 0 0 0 -1157.49 0 0 -292.444 0 0 1411.4 0 0 0 0 981.552 0 0 0 113.91 0 0 0 0 0 0 -76.22 0 0 -691.778 0 0 0 0 0 2117.91 0 0 368.282 1659.22 0 0 0 -1126.36 0 0 0 0 0 2166.74 0 0 0 -2323.6 0 0 0 0 0 0 0 
0 0 0 0 695.441 0 0 0.02 0 -772.042 -1363.95 0 0 0 0 0 0 0 -913.953 0 0 1660.74 0 0 0 0 0 0 1658.91 2114.09 -18.2348 931.959 0 0 0 0 -805.765 0 0 -1494.87 0 0 -178.457 0 0 0 0 0 0 0 0 0 0 0 0 0 0 0 0 0 0 0 0 0 -781.503 0 0 0 
0 0 1579.26 264.367 0 0 0 0 0.08 0 -768.838 0 0 0 1186.94 0 -188.07 0 0 0 0 0 0 0 871.532 1877.57 0 0 0 0 0 831.706 0 0 0 0 0 0 -306.177 0 0 0 0 0 166.25 -569.399 1920.45 -2308.65 0 0 -248.039 0 0 0 0 0 -785.012 0 0 121.235 0 0 0 0 0 0 0 0 
0 -1061.66 0 2322.38 0 -730.232 0 2297.81 0 0.08 574.892 -2034.44 0 0 632.878 0 0 0 0 229.118 2056.57 0 0 0 2046.34 0 -249.413 -1224.63 -2450.71 0 0 0 0 0 0 2032.3 0 1038.16 -492.95 -2110.58 0 -1193.66 0 0 1422.09 0 0 -885.418 2180.01 0 -1514.4 0 0 0 0 726.569 0 0 0 0 0 0 0 0 0 193.258 1679.97 -1848.28 
0 -2212.97 1760.54 0 0 0 0 1402.86 1113.39 2245.32 0 0 -1000.17 0 -1418.88 0 0 0 0 0 0 0 0 0 2161.85 0 0 0 0 1454.74 1865.52 0 0 0 0 0 0 853.832 -2247.76 0 -2083.42 0 1670.35 0 1161.31 -188.376 0 2187.19 -895.184 0 0 0 -933.027 0 0 0 0 0 0 0 0 0 0 0 0 0 0 0 
-327.998 0 -948.897 1825.54 0 0 66.9118 0 0 1828.14 0 0.02 0 0 -594.729 2362.67 0 840.861 0 0 0 -790.963 873.211 0 0 0 1573.76 0 0 0 -472.045 -987.96 2004.53 0 0 1549.04 0 0 0 -1157.8 0 -1205.86 0 0 0 1014.66 0 2436.06 0 0 1840.19 0 0 0 0 0 1393.55 0 -2251.88 0 0 0 0 2392.42 0 0 0 0 
0 0 0 0 806.68 0 0 0 0 0 1771.83 0 0.07 0 0 1634.65 0 -2489.62 -2035.51 0 1753.67 0 0 0 0 0 0 0 0 0 0 -1555.45 0 0 0 -29.9844 -676.061 0 -876.873 0 1233.33 0 0 710.547 1923.96 0 1695.07 0 0 0 514.008 0 0 -327.235 0 -642.033 0 -1413.39 0 0 0 0 0 0 0 0 0 0 
0 0 0 0 0 1709.57 0 0 0 0 0 0 0 0.09 0 -850.322 0 0 0 0 254.295 1684.85 0 1651.28 530.335 0 329.524 0 0 0 0 359.584 0 -1512.27 0 0 0 0 796.304 0 1965.47 0 0 0 0 0 0 2131.79 0 0 0 0 0 0 -1164.05 0 0 0 0 0 0 0 0 0 0 0 0 0 
0 0 405.362 0 1863.54 0 2353.66 0 1837.6 1321.83 -172.811 149.922 0 0 0.07 425.657 0 0 0 0 0 -125.965 0 0 864.36 0 0 0 0 0 0 0 0 0 -996.048 0 0 0 2142.48 0 0 0 0 85.0703 -1605.96 0 1195.33 0 0 0 0 0 0 0 0 0 0 0 0 0 0 0 -2060.84 0 0 0 0 0 
0 0 0 385.678 0 0 0 0 0 0 0 -2064.5 124.592 864.513 2196.95 0.01 0 0 0 0 0 0 0 674.993 0 898.236 0 306.177 0 0 0 1109.12 0 -693.152 -151.143 0 -753.731 0 0 0 0 0 0 -2210.84 0 0 1995.07 2463.38 699.408 0 0 0 0 0 0 0 0 0 0 0 0 0 0 0 0 0 0 -1852.7 
0 -416.044 0 0 0 0 0 0 391.171 0 0 0 0 0 0 0 0.08 0 0 867.565 2212.21 0 732.215 0 836.283 0 0 0 0 -1774.42 1118.73 0 0 0 0 0 0 0 0 0 416.959 0 0 0 -94.0733 0 0 -760.903 0 0 0 0 0 0 0 0 0 0 0 0 0 792.642 0 0 0 0 0 0 
0 0 -6.18 0 676.824 1022.29 455.107 0 0 0 0 949.812 -2057.94 0 0 0 0 0.02 0 0 0 0 0 1638.46 1941.97 0 -493.255 0 0 1571.78 0 0 0 0 0 1476.56 0 0 -2342.83 0 0 0 0 -2429.5 0 701.849 0 0 0 0 0 -13.657 0 0 0 -253.99 0 0 0 0 0 0 0 0 197.531 0 0 0 
0 0 0 475.86 0 0 0 -1184.35 0 0 0 0 2335.81 0 0 0 0 0 0.03 0 0 0 1347.93 0 0 0 0 0 0 1242.33 2245.63 0 0 -1418.73 0 -1143.3 0 0 0 0 0 -3.12815 0 0 0 0 0 0 0 0 0 0 0 0 0 0 0 2425.84 0 488.067 0 0 0 0 0 0 0 -463.5 
0 0 0 0 1262.47 97.7355 0 0 0 559.786 0 0 0 0 0 0 -1032.21 0 0 0.01 -1529.21 0 0 0 0 1483.43 0 964.003 0 -111.774 55.3148 1918.16 0 0 0 0 0 0 0 0 0 0 -212.18 0 0 0 0 0 0 0 0 0 0 0 0 0 0 0 0 0 2045.73 0 0 0 0 0 0 0 
0 1794.41 0 0 0 0 0 0 0 -1030.38 0 0 -27.6955 -1891.46 0 0 1613.44 0 0 1926.1 0.03 0 0 0 0 0 1561.56 0 1077.99 0 -2094.1 0 0 0 2327.11 0 0 0 -176.168 0 0 0 0 915.021 909.68 -519.807 0 0 0 0 0 0 0 0 0 0 0 0 0 0 0 0 0 0 0 0 0 0 
0 0 0 0 -1404.23 539.186 0 1549.2 0 0 0 1439.48 0 -546.052 -102.008 0 0 0 0 0 0 0.09 0 0 0 0 0 0 0 0 1887.19 0 0 0 0 0 0 0 0 0 0 838.42 0 0 0 504.852 0 1261.86 0 0 0 -1724.83 -1008.41 0 0 -1164.51 0 0 0 0 0 0 0 0 0 0 -743.507 0 
0 -1183.74 0 0 0 0 1988.97 0 0 0 0 996.963 0 0 0 0 -362.636 0 -2421.11 0 0 0 0.05 0 2127.83 0 0 0 1534.7 341.426 -848.796 0 0 2161.09 0 0 0 0 0 1858.2 0 -2195.58 0 0 0 0 0 0 -52.5681 0 0 0 0 672.094 0 0 625.248 0 0 0 0 0 0 760.598 0 0 0 0 
146.718 1455.2 2352.9 0 0 0 0 0 0 0 0 0 0 -1885.97 0 -844.676 0 -2055.8 0 0 0 0 0 0.04 0 1625.19 2192.07 0 0 0 0 0 -763.039 0 -2059.16 0 1738.11 0 0 0 0 0 0 0 0 0 0 0 0 0 0 0 0 0 0 0 0 0 916.852 0 0 1623.05 0 0 0 0 0 0 
0 0 0 -7.09555 0 0 0 0 1543.09 -46.617 764.107 0 0 1880.93 -449.767 0 1964.86 182.119 0 0 0 0 2452.09 0 0.04 0 0 0 1452.45 0 -2248.68 305.414 -1241.87 0 0 1780.07 0 0 0 0 0 0 -1139.33 0 0 0 2093.65 0 0 0 0 0 0 0 0 0 663.854 0 0 -129.933 0 0 0 0 0 0 0 1535.62 
0 -846.202 0 0 0 0 0 0 2359.92 0 0 0 0 0 0 1363.8 0 0 0 1834.54 0 0 0 -2348.78 0 0.03 -124.897 773.873 0 0 929.67 0 317.621 0 0 0 2198.93 1881.08 -197.836 0 0 0 0 0 0 0 0 0 -950.27 0 -985.519 0 -1290.09 0 0 0 0 0 0 0 0 0 0 0 0 0 0 0 
0 0 1217.76 0 0 -1916.18 953.322 0 0 1802.96 0 1277.89 0 995.743 0 0 0 -1079.67 0 0 54.2467 0 0 219.962 0 2489.62 0.07 1440.24 0 2476.35 1507.54 -1406.52 0 0 0 381.71 0 -1188.01 0 0 950.575 0 -1390.96 0 0 0 0 0 0 0 0 0 0 -1362.27 0 0 0 0 0 0 2387.69 0 0 -1372.49 0 0 0 0 
0 -798.44 2219.99 206.534 0 -86.4437 0 0 0 -792.947 0 0 0 0 0 1574.53 0 0 0 1952.5 0 0 0 0 0 -508.972 -323.42 0.06 0 0 0 0 -675.451 0 0 0 0 0 0 0 0 0 1933.88 0 0 -167.165 0 2039.93 0 0 0 0 0 0 0 0 0 0 0 0 0 1705.3 0 0 0 0 0 0 
0 0 -613.956 1429.26 0 0 0 1401.64 0 890.301 0 0 0 0 0 0 0 0 0 0 2004.53 0 1631.14 0 1848.12 0 0 0 0.02 0 -1280.94 0 1880.93 -685.98 0 0 0 2002.24 0 0 0 0 0 0 1143.15 0 0 0 0 0 0 0 0 0 0 0 0 0 0 0 0 0 0 0 0 0 0 0 
0 2355.8 0 0 0 -1594.21 0 694.067 0 0 -747.627 0 0 0 0 0 1901.23 1922.74 -2437.28 -1192.13 0 0 1176.72 0 0 0 -520.722 0 0 0.07 0 2487.49 0 0 -808.969 0 0 0 1613.9 1798.23 0 -2325.89 448.241 113.91 0 0 0 0 0 0 0 0 1785.87 0 0 0 0 0 -774.636 0 0 0 0 0 0 0 1761.6 0 
0 0 0 -1073.87 2485.2 0 0 -2395.32 0 0 -237.053 -1572.39 0 0 0 0 241.173 0 -998.337 -428.404 486.541 -1891.46 1977.68 0 2328.79 -976.669 1638.62 0 1017.72 0 0.07 0 0 0 0 -199.362 0 0 1258.66 0 0 0 0 -1959.21 0 0 0 0 0 0 0 0 0 0 0 0 0 0 0 0 0 0 0 0 0 0 0 0 
0 0 0 0 0 0 0 78.6615 1364.25 0 0 -1736.27 118.793 -752.51 0 1242.03 0 0 0 2090.75 0 0 0 0 1289.03 0 -1481.75 0 0 1981.95 0 0.03 -953.017 0 0 0 0 0 0 0 0 1342.89 0 0 0 0 0 0 0 0 0 0 0 0 0 0 0 -1288.57 1706.21 -165.334 0 0 0 0 0 -1126.51 0 0 
-829.112 0 1761.3 309.992 0 0 0 0 0 0 0 915.326 0 0 0 0 0 0 0 0 0 0 0 1453.98 498.444 494.629 0 -1029.31 -580.996 0 0 625.858 0.01 0 0 2254.33 0 -1397.98 0 0 0 0 0 0 -1732.31 -309.534 360.195 0 0 0 0 0 0 0 0 0 0 0 0 0 0 0 0 -2302.7 0 0 0 0 
0 0 -2190.54 0 0 0 -2123.71 0 0 0 0 0 0 944.929 0 -821.94 0 0 -1049.15 0 0 0 1681.04 0 0 0 0 0 -292.749 0 0 0 0 0.07 387.509 -225.608 0 -1087.76 0 0 0 0 0 2189.78 2254.78 821.329 1946.55 0 1116.6 0 1417.36 0 0 0 1444.21 1310.85 -253.38 0 0 0 0 0 0 0 0 0 0 0 
0 0 0 448.241 0 0 0 0 0 0 0 0 0 0 1201.28 -349.055 0 0 0 0 -1158.1 0 0 1649.45 0 0 0 0 0 276.574 0 0 0 -1881.39 0.06 0 1306.73 0 0 0 0 0 1179.62 89.3429 0 0 0 0 0 0 0 0 0 0 0 0 0 1325.19 0 0 0 0 0 0 0 0 0 0 
20.5237 0 0 0 0 0 0 0 0 -1591.62 0 -1385.31 1113.7 0 0 0 0 2044.05 1319.54 0 0 0 0 0 -762.123 0 1394.92 0 0 0 2456.05 0 -603.275 -587.863 0 0.09 0 0 0 0 -1037.4 0 0 0 780.129 0 1484.95 791.726 0 0 0 0 0 0 0 0 0 0 0 0 1120.87 -1532.87 0 -1497.16 0 0 0 0 
871.838 0 0 0 0 -1840.49 -1700.87 1292.23 0 0 0 0 2301.93 0 0 -604.953 0 0 0 0 0 0 0 2159.87 0 -1257.9 0 0 0 0 0 0 0 0 -919.599 0 0.05 0 1859.26 0 0 746.254 0 2457.58 0 0 0 -342.647 0 0 0 0 0 0 2259.36 0 0 0 0 0 0 0 0 0 0 0 1882.15 0 
0 0 302.21 0 -278.558 1469.24 0 0 0 1168.63 -1968.98 0 0 0 0 0 0 0 0 0 0 0 0 0 0 1677.53 1307.03 0 1116.75 0 0 0 1717.05 1180.38 0 0 0 0 0 0 0 1470 0 0 0 1619.39 0 0 0 0 0 1580.94 0 0 0 0 0 0 -544.069 0 0 0 0 0 728.401 0 0 0 
-1082.87 0 0 0 0 0 0 0 2240.44 -552.461 1841.87 0 1235.31 1512.57 168.081 0 0 2122.49 0 0 941.42 0 0 0 0 698.492 0 0 0 1851.48 1241.87 0 0 0 0 0 1419.03 0 0.07 -2029.56 876.72 0 0 1378.44 0 0 0 0 0 0 0 0 0 1231.96 0 0 -2433.62 121.235 0 2257.84 0 0 0 0 0 649.358 0 -2220.91 
0 0 -1068.83 0 2458.34 0 0 2489.32 0 2145.68 0 779.214 0 0 0 0 0 0 0 0 0 0 -1437.04 0 0 0 0 0 0 897.931 0 0 0 0 0 0 0 0 -957.747 0.01 0 -299.615 -993.149 -1721.17 0 1521.42 0 0 0 0 0 0 0 0 0 0 0 0 0 0 0 0 75.7622 0 0 0 0 0 
0 144.124 394.375 0 0 -1055.41 0 0 0 0 1430.63 0 2042.53 1197.93 0 0 -1882.76 0 0 0 0 0 0 0 0 0 1459.32 0 0 0 0 0 0 0 0 1651.89 0 0 709.021 0 0 0 0 664.464 0 0 0 0 2386.32 0 0 2043.29 0 0 0 0 0 0 2227.77 931.196 0 0 0 0 0 -2420.8 1680.43 0 
0 0 0 -2170.25 0 -2489.93 0 0 0 1517.61 0 1525.39 0 0 0 0 0 0 -436.644 0 0 -1052.35 1723.46 0 0 0 0 0 0 2287.9 0 -337.611 0 0 0 0 2241.51 1448.94 0 1067.46 0 0 0 0 0 0 0 0 0 0 0 0 0 170.827 0 0 0 0 0 0 0 0 0 0 0 0 0 0 
0 2123.86 0 0 0 0 -308.466 -1747.72 0 0 1570.71 0 0 0 0 0 0 0 0 2181.39 0 0 0 0 -825.755 0 -1948.68 -368.435 0 1212.58 0 0 0 0 1435.06 0 0 0 0 1655.25 0 0 0 0 0 1265.07 -36.0881 0 -1556.83 2412.56 0 701.392 0 0 0 0 0 0 0 0 0 1633.43 0 0 0 0 0 590.457 
780.74 0 0 0 0 195.242 0 0 0 0 0 0 -997.116 0 1939.22 1180.07 0 760.445 0 0 761.971 0 0 0 0 0 0 0 0 -1330.68 -38.0718 0 0 2355.04 -2404.02 0 2019.03 0 2067.86 1060.75 1935.26 0 0 0 0 0 0 0 0 0 867.107 0 0 0 0 0 0 0 0 0 -2285.61 0 0 0 0 0 0 0 
0 -2177.72 1879.71 0 1647.01 0 0 0 -1339.08 806.833 285.73 0 1807.38 0 -232.017 0 -1260.19 0 0 0 2478.33 0 0 0 0 0 0 0 -1050.37 0 0 0 -2153.31 1315.42 0 639.286 0 0 0 0 0 0 0 0 0.07 0 0 0 0 0 0 0 -1000.63 0 1300.78 0 0 0 0 0 0 0 0 0 2173.91 0 0 0 
0 0 0 -1557.89 0 -1106.98 517.365 0 2322.99 0 2090.75 -1351.59 0 0 0 0 0 256.279 0 0 130.238 -530.488 0 0 0 0 0 1707.59 0 0 0 0 1723.46 2253.11 0 0 0 59.8926 0 -333.033 0 0 -474.334 0 0 0.04 0 -848.338 0 0 0 -2349.39 0 0 0 0 0 0 -245.75 0 0 0 0 0 0 0 0 0 
0 0 0 0 0 0 158.467 0 -380.49 0 0 0 2216.94 0 1409.73 370.724 0 0 0 0 0 0 0 0 25.8644 0 0 0 0 0 0 0 -1129.41 -1937.24 0 2476.2 0 0 0 0 0 0 1765.42 0 0 0 0.04 64.6229 0 2377.77 0 0 0 0 0 0 0 0 0 0 0 0 0 0 0 0 0 0 
0 0 0 0 0 0 0 0 1604.89 2000.72 1104.85 -1592.68 0 2229.45 0 1398.43 -2302.85 0 0 0 0 1932.36 0 0 0 0 0 -2058.85 0 0 0 0 0 0 0 -216.758 321.894 0 0 0 0 0 0 0 0 2350.31 744.118 0.06 -1995.83 0 0 0 0 0 0 0 0 -1328.39 0 0 1513.34 0 82.9341 0 0 0 0 0 
0 1920.91 0 0 0 2410.73 0 0 0 -1398.43 -1629.76 0 0 0 0 994.827 0 0 0 0 0 0 2185.05 0 0 -2236.78 0 0 0 0 0 0 0 -514.161 0 0 0 0 0 0 1193.66 0 -1407.9 0 0 0 0 -981.857 0.04 0 0 0 2187.19 0 0 0 0 -1174.89 0 0 0 0 -1080.74 -613.193 0 0 0 -330.134 
0 0 0 1392.79 0 0 0 0 0 0 0 0 0 0 0 0 0 0 0 0 0 0 0 0 0 0 0 0 0 0 0 0 0 0 0 0 0 0 0 0 0 0 179.678 0 0 0 2047.26 0 0 0.01 1482.21 0 0 0 0 168.233 0 0 -1851.33 0 0 0 0 0 0 0 0 0 
0 0 0 0 0 0 707.038 0 1629 -311.518 0 2032.3 -410.092 0 0 0 0 0 0 0 0 0 0 0 0 578.249 0 0 0 0 0 0 0 755.409 0 0 0 0 0 0 0 0 0 -1231.04 0 0 0 0 0 -1544.01 0.09 0 0 0 0 0 0 0 0 0 0 0 0 0 -760.903 0 0 0 
0 1780.53 0 0 0 0 0 0 0 0 0 0 0 0 0 0 0 -2374.11 0 0 0 -302.82 0 0 0 0 0 0 0 0 0 0 0 0 0 0 0 1037.4 0 0 -1358.46 0 1325.34 0 0 2010.48 0 0 0 0 0 0.04 0 0 0 0 0 0 0 0 0 0 0 0 0 0 0 0 
526.521 0 0 0 2201.22 0 0 0 0 0 1002.61 0 0 0 0 0 0 0 0 0 0 -665.227 0 0 0 684.454 0 0 0 -1087.91 0 0 0 0 0 0 0 0 0 0 0 0 0 0 -622.044 0 0 0 522.553 0 0 0 0.05 1635.26 0 673.62 0 0 0 0 0 0 -1028.55 0 0 0 0 0 
0 0 0 0 0 0 0 0 0 0 0 0 -1661.81 0 0 0 0 0 0 0 0 0 1410.79 0 0 0 1967.76 0 0 0 0 0 0 0 0 0 0 0 -2167.65 0 0 814.615 0 0 0 0 0 0 0 0 0 0 931.196 0.07 0 0 0 -696.661 0 2448.27 -1307.34 0 0 0 221.488 0 0 0 
0 0 0 0 0 0 0 0 0 0 0 0 0 1350.52 0 0 0 0 0 0 0 0 0 0 0 0 0 0 0 0 0 0 0 1917.1 0 0 161.977 0 0 0 0 0 0 0 718.635 0 0 0 0 0 0 0 0 0 0.04 0 0 0 0 0 0 0 0 0 -751.595 0 0 0 
0 2276.45 0 0 0 0 0 0 0 -195.09 0 0 120.014 0 0 0 0 1363.64 0 0 0 1190.45 0 0 0 0 0 0 0 0 0 0 0 1121.02 0 0 0 0 0 0 0 0 0 0 0 0 0 0 0 -965.835 0 0 -2406.16 0 0 0 0 0 0 0 0 0 0 0 725.044 0 0 0 
0 0 0 0 0 0 -92.8526 0 -402.158 0 0 -839.641 0 0 0 0 0 0 0 0 0 0 1209.07 0 426.878 0 0 0 0 0 0 0 0 2371.21 0 0 0 0 1791.97 0 0 0 0 0 0 0 0 0 0 0 0 0 0 0 0 0 0 0 0 0 0 0 1376.77 0 0 -794.931 0 0 
0 0 0 0 0 0 0 0 0 0 0 0 259.178 0 0 0 0 0 -79.4244 0 0 0 0 0 0 0 0 0 0 0 0 909.528 0 0 906.629 0 0 0 -1863.08 0 0 0 0 0 0 0 0 -764.26 1704.23 0 0 0 0 -801.645 0 0 0 0.09 0 368.13 0 0 -332.118 2325.74 -885.266 0 0 0 
0 0 2300.26 0 0 0 0 0 0 0 0 2355.19 0 0 0 0 0 0 0 0 0 0 0 899.762 0 0 0 0 0 -2398.53 0 -2173.15 0 0 0 0 0 1373.56 0 0 -1981.49 0 0 0 0 2273.09 0 0 0 2076.25 0 0 0 0 0 0 0 0 0.09 0 0 0 0 0 1302.76 0 0 0 
0 0 0 0 0 0 0 0 964.461 0 0 0 0 0 0 0 0 0 -1417.97 0 0 0 0 0 762.123 0 0 0 0 0 0 -938.673 0 0 0 0 0 0 2290.95 0 1434.9 0 0 0 0 0 0 0 0 0 0 0 0 285.424 0 0 0 741.523 0 0.09 0 48.6007 0 0 0 0 0 0 
0 1909.47 0 0 0 1856.36 1368.37 0 0 0 0 0 0 0 0 0 0 0 0 421.232 0 0 0 0 0 0 -419.553 0 0 0 0 0 0 0 0 1575.29 0 0 0 0 0 0 0 -1360.44 0 0 0 -2415.46 0 0 0 0 0 1156.27 0 0 0 0 0 0 0.07 0 655.156 0 0 1857.74 0 0 
0 0 0 0 0 0 0 0 0 0 0 0 0 0 0 0 -211.875 0 0 0 0 0 0 1882.76 0 0 0 715.278 0 0 0 0 0 0 0 2460.17 0 0 0 0 0 0 -1787.55 0 0 0 0 0 0 0 0 0 0 0 0 0 0 0 0 -817.515 0 0.04 0 0 0 0 0 0 
0 0 431.455 -2013.38 0 0 0 0 0 0 0 0 0 0 2088.61 0 0 0 0 0 0 0 0 0 0 0 0 0 0 0 0 0 0 0 0 0 0 0 0 503.937 0 0 0 0 0 0 0 2017.2 -1585.06 0 0 0 1402.4 0 0 0 1102.1 1282.77 0 0 -2183.83 0 0.07 0 0 0 0 0 
0 0 0 0 0 0 0 0 0 0 0 957.595 0 0 0 0 0 0 0 0 0 0 -1533.63 0 0 0 2001.94 0 0 0 0 0 772.958 0 0 -994.064 0 0 0 0 0 0 0 0 0 0 0 0 -1305.51 0 0 0 0 0 0 0 0 1793.04 0 0 0 0 0 0.01 0 0 -396.207 0 
0 0 0 0 0 -1033.43 0 971.938 0 0 0 0 0 0 0 0 0 971.786 0 0 0 0 0 0 0 0 0 0 0 0 0 0 0 0 0 0 0 -99.5666 0 0 0 0 0 0 -2374.72 0 0 0 0 0 1255.91 0 0 1646.7 98.3459 635.319 0 2127.37 743.202 0 0 0 0 0 0.05 0 0 0 
0 0 0 0 0 0 0 0 0 1583.83 0 0 0 0 0 0 0 0 0 0 0 0 0 0 0 0 0 0 0 0 0 -1010.39 0 0 0 0 0 0 1953.87 0 941.115 0 0 0 0 0 0 0 0 0 0 0 0 0 0 0 133.29 0 0 0 160.451 0 0 0 0 0.07 0 0 
0 0 0 0 0 0 0 0 0 1645.02 0 0 0 0 0 0 0 0 0 0 0 -132.069 0 0 0 0 0 0 0 1981.03 0 0 0 0 0 0 1365.78 0 0 0 -2486.88 0 0 0 0 0 0 0 0 0 0 0 0 0 0 0 0 0 0 0 0 0 0 1533.48 0 0 0.05 0 
0 0 0 0 0 0 0 0 0 976.058 0 0 0 0 0 -83.8496 0 0 2080.98 0 0 0 0 0 187.918 0 0 0 0 0 0 0 0 0 0 0 0 0 -2043.6 0 0 0 -1325.65 0 0 0 0 0 559.633 0 0 0 0 0 0 0 0 0 0 0 0 0 0 0 0 0 0 0.02 
