*Vertices 56
*Matrix 
0.03 0 0 -1772.59 0 0 0 0 1036.48 0 478.301 0 0 0 913.495 0 1007.64 0 0 911.206 0 0 621.128 0 1120.41 0 0 0 0 0 -1556.37 0 0 0 0 0 0 2411.65 0 0 -1159.02 1509.83 0 0 0 0 0 0 0 0 0 -1173.67 -277.642 0 2421.57 -1401.18 
0 0.05 0 371.639 0 0 0 0 0 0 0 378.658 0 0 1702.7 0 0 0 -57.6037 0 2308.34 -1585.06 0 0 0 0 0 0 0 0 0 0 2414.4 -2489.62 0 0 0 0 -1868.11 0 2316.58 0 0 0 0 1268.58 0 0 0 0 0 1550.87 0 0 0 0 
0 0 0.01 0 0 0 0 2441.25 -110.401 0 1878.95 0 0 0 -824.076 0 -1290.09 0 0 1951.58 0 0 0 0 0 0 1454.13 0 0 0 -183.798 0 0 -2138.36 -459.838 0 0 0 1235.62 0 0 0 776.162 0 -559.633 0 0 0 0 0 0 -1535.16 0 -772.042 936.689 1613.28 
1870.25 -1413.69 0 0 0 0 0 0 1597.87 1686.53 1331.14 0 0 0 0 808.969 637.913 -1301.08 0 2377.77 1286.58 -248.65 -1397.06 0 0 0 0 0 -1515.17 0 1358.91 0 0 0 -1564.76 963.088 -845.439 0 0 0 0 876.263 0 -435.118 0 0 0 -26.3222 0 0 0 0 0 -2356.72 0 0 
0 0 0 0 0.06 0 0 0 0 -1320.46 0 1659.67 0 1571.32 0 0 0 0 -2108.14 0 0 0 0 0 617.008 0 1569.19 0 1760.99 0 0 0 0 0 0 0 0 0 0 0 0 0 0 797.983 0 -1308.4 -618.229 0 0 0 0 0 0 0 0 0 
0 0 0 0 0 0.04 0 0 0 0 0 2076.4 0 2154.38 -856.12 0 0 -2087.85 0 0 0 -2432.4 0 0 1111.56 0 0 0 0 1004.14 0 0 0 0 0 0 -668.126 0 0 -1186.64 0 0 1253.01 0 0 843.608 0 0 0 0 0 0 0 0 0 0 
0 0 0 0 0 0 0.02 -73.1681 0 0 0 0 0 1410.03 0 0 -2024.67 0 -494.171 0 0 0 -1249.35 0 449.156 0 0 -1416.14 1351.89 0 1291.01 0 -1204.34 -421.842 0 353.481 0 0 0 -301.752 0 2169.64 0 0 0 0 0 0 0 560.701 0 0 0 0 1945.17 0 
0 0 -2058.55 0 0 0 938.063 0.04 0 0 1721.63 0 0 -2205.34 0 0 -199.973 2014.45 0 0 0 0 0 -154.5 0 0 0 0 0 0 1771.83 -300.226 0 0 0 0 0 0 0 0 806.223 0 472.961 1577.88 0 0 0 0 0 -1083.79 0 1053.73 0 0 0 249.107 
-1695.07 0 2498.02 -712.683 0 0 0 0 0.05 0 0 0 0 0 0 0 1977.83 0 946.608 0 0 1295.59 -1629 0 816.294 0 0 0 0 0 0 1961.5 0 0 0 2256.16 0 0 -1129.41 0 0 0 0 0 -1381.95 0 0 822.245 0 0 0 0 1153.68 0 -1409.88 1447.87 
0 0 0 -2164.14 -204.398 0 0 0 0 0.07 0 0 0 0 0 0 1035.26 0 462.279 -2380.98 0 0 2403.56 0 0 0 0 0 0 0 0 0 0 0 0 0 0 0 0 -1232.26 0 1999.04 1612.83 0 0 0 2166.74 1148.49 1187.86 0 0 0 0 0 889.996 0 
1931.29 0 -1686.99 1370.36 0 0 0 343.867 0 0 0 0 0 -1094.32 0 0 0 -338.832 0 1030.84 0 0 -963.546 0 0 0 0 0 0 0 0 -1743.75 -617.924 0 0 0 0 0 0 0 2091.51 0 0 0 0 0 1087.15 0 0 0 0 0 0 2366.02 0 0 
0 -1456.11 0 0 2461.09 1224.48 0 0 0 0 0 0 1488.77 0 0 -1503.72 -1309.93 -2436.67 0 0 0 1397.52 761.971 -137.257 0 0 0 0 477.081 0 0 0 0 0 0 0 0 0 2446.44 0 0 -971.328 0 0 2402.8 0 0 0 0 0 0 0 0 -1690.8 0 0 
0 0 0 0 0 0 0 0 0 0 0 1708.5 0 929.212 1938.76 0 1563.54 0 0 0 0 0 -90.2585 0 0 958.815 0 0 -2118.67 0 -47.9904 0 1316.03 0 0 0 0 0 1374.32 0 286.492 0 0 0 -55.1622 0 0 0 0 0 2098.38 0 1568.12 0 0 -749.611 
0 0 0 0 -2232.66 553.682 1055.41 955.458 0 0 -1181.45 0 -2394.86 0.02 2149.19 -1136.89 0 0 984.909 0 0 0 0 0 0 1672.03 0 0 0 0 0 0 1543.55 0 2267.14 0 0 0 0 115.894 0 625.248 0 0 0 0 2460.17 -1469.08 0 0 0 2330.47 0 0 0 14.1148 
1434.45 -2148.73 -2158.8 0 0 1489.23 0 0 0 0 0 0 -1391.42 2468.57 0.06 2331.23 0 0 0 976.974 1413.08 0 0 -1268.58 0 0 1986.53 0 1388.97 -1854.69 0 0 0 0 0 0 0 1204.49 0 0 0 0 0 0 0 0 0 -586.795 0 0 0 0 0 -1188.62 0 0 
0 0 0 -1410.18 0 0 0 0 0 0 0 2202.75 0 -385.983 1213.95 0.06 2173.15 0 -382.168 0 0 2460.63 0 677.74 0 0 0 0 0 0 2010.48 0 0 0 0 2118.52 0 0 0 0 0 0 0 0 2338.71 0 0 0 477.691 0 0 0 2007.43 0 0 -2297.97 
1494.42 0 1871.17 -2435 0 0 -1716.44 -59.4348 1514.1 1939.99 0 1547.98 853.374 0 0 969.344 0.05 0 0 0 0 0 0 0 -1995.07 -521.638 0 0 0 0 0 596.103 0 0 1034.65 -1767.1 2097.77 0 0 0 0 0 2180.47 0 0 2372.13 0 0 0 0 0 0 0 0 0 0 
0 0 0 2026.66 0 1108.81 0 786.386 0 0 -1551.64 910.901 0 0 0 0 0 0.01 0 0 0 0 579.165 400.327 899.762 0 0 2279.2 0 0 0 0 -1972.95 1881.08 0 0 0 0 0 0 0 0 197.378 770.363 0 0 -710.547 0 0 723.518 0 -1878.64 0 0 0 0 
0 1213.64 0 0 2388.45 0 -1786.17 0 -1140.71 1431.39 0 0 0 -1879.86 0 -796.457 0 0 0.09 0 0 0 0 0 -661.565 0 0 0 0 -482.574 0 2230.83 0 0 -1588.87 0 1321.68 1745.89 0 -2093.95 0 -1359.22 1738.26 0 1210.9 -204.703 1756.11 0 405.667 0 0 0 0 0 0 0 
-377.743 0 187.002 1083.18 0 0 0 0 0 1573.31 17.1667 0 0 0 981.857 0 0 0 0 0 1360.44 0 0 0 0 -623.875 0 0 0 0 0 0 2171.62 0 1600.31 666.295 0 1557.74 228.507 -1642.43 0 -2300.71 0 -1513.18 0 0 0 0 0 -1150.01 0 0 0 0 0 0 
0 2187.19 0 -223.014 0 0 0 0 0 0 0 0 0 0 -1789.83 0 0 0 0 -615.94 0.09 -1433.99 1788 0 0 0 0 0 0 0 0 0 460.295 0 0 0 0 727.943 -1232.87 0 0 0 1994.31 -1999.19 0 0 0 0 1619.54 0 0 0 0 0 -234.611 0 
0 120.319 0 -2359 0 1283.23 0 0 1877.12 0 0 2138.66 0 0 0 -745.491 0 0 0 0 -1320.76 0.04 0 0 0 841.624 0 0 2192.07 822.703 0 0 0 0 0 0 0 -961.867 0 0 0 322.504 0 -655.919 0 0 2252.19 2178.03 0 1637.7 -212.18 0 0 0 -2008.19 0 
1320.61 0 0 -2247.76 0 0 964.003 0 478.454 -1673.56 -981.857 1158.56 467.315 0 0 0 0 640.507 0 0 -1256.83 0 0.07 0 1107.9 0 0 0 0 1641.21 0 1974.47 0 0 0 0 -69.2007 0 -1333.89 0 -1136.59 0 -2454.68 0 1694.77 0 0 597.629 -196.615 0 1344.72 0 0 0 0 690.71 
0 0 0 0 0 0 0 1423 0 0 0 1142.84 0 0 1256.07 -1856.36 0 2100.51 0 0 0 0 0 0 0 1587.95 0 0 627.232 0 0 0 0 0 0 384.61 0 -879.315 0 0 0 0 0 0 0 466.857 1233.94 0 0 0 0 615.635 1049.3 1211.81 0 0 
973.617 0 0 0 1213.19 2496.03 1040.6 0 -1462.98 0 0 0 0 0 0 0 2300.56 121.998 -1549.81 0 0 0 1976 0 0.03 0 0 -911.817 0 0 0 0 0 1501.59 2235.4 0 0 0 107.959 0 0 1642.74 -617.618 2248.99 0 573.367 0 -1556.52 0 0 0 0 112.079 0 0 0 
0 0 0 0 0 0 0 0 0 0 0 0 469.298 155.11 0 0 2202.14 0 0 -865.429 0 -1290.4 0 1376.61 0 0.02 0 0 0 0 0 56.0778 -330.744 91.4792 0 2153.31 0 255.364 0 -1438.72 0 0 0 0 0 1847.82 -2438.35 0 2264.7 0 0 0 0 0 0 1430.48 
0 0 374.996 0 2332 0 0 0 0 0 0 0 0 0 -716.803 0 0 0 0 0 0 0 0 0 0 0 0.06 119.098 2227.62 0 638.523 2294.61 -191.427 0 0 0 1000.32 1694.31 0 0 0 0 0 0 0 0 2412.26 0 0 0 -1902.75 0 0 0 0 0 
0 0 0 0 0 0 -244.224 0 0 0 0 0 0 0 0 0 0 1696.75 0 0 0 0 0 0 -2053.36 0 -1056.63 0.08 0 -1681.34 0 584.201 0 0 0 0 0 0 0 0 0 2251.88 0 0 0 0 0 0 0 0 1078.75 0 0 1062.12 0 1447.72 
0 0 0 1464.81 425.81 0 -290.155 0 0 0 0 2478.03 -437.712 0 824.534 0 0 0 0 0 0 -2454.07 0 2031.24 0 0 454.955 0 0.09 0 0 0 0 -721.381 -798.746 0 0 0 -883.74 -761.361 -1141.93 0 0 1820.2 0 0 -1945.78 0 0 2263.18 0 0 579.928 0 -269.555 2119.28 
0 0 0 0 0 -1540.19 0 0 0 0 0 0 0 0 -2229.76 0 0 0 767.922 0 0 1168.94 1552.25 0 0 0 0 -500.885 0 0 0 0 0 0 1931.75 0 0 0 0 -1990.8 -2219.23 0 0 0 2428.13 0 1235.92 0 0 0 0 0 2003.31 0 0 0 
-945.692 0 432.524 641.881 0 0 9.68963 89.3429 0 0 0 0 1091.42 0 0 -879.467 0 0 0 0 0 0 0 0 0 0 2333.52 0 0 0 0.01 2215.72 1128.8 -465.484 0 1878.95 824.992 -898.999 311.06 0 0 0 0 0 0 0 0 0 0 0 0 -2118.52 -299.463 0 0 0 
0 0 0 0 0 0 0 1461.76 -1713.23 0 -537.507 0 0 0 0 0 -187.002 0 -929.06 0 0 0 436.033 0 0 2190.54 983.23 -1115.38 0 0 -2081.29 0.01 0 0 0 -1984.69 0 1645.63 0 0 1830.12 0 0 2419.43 0 1548.74 0 0 0 0 0 701.544 0 2341.46 1140.55 775.857 
0 -157.094 0 0 0 0 -2210.07 0 0 0 1074.94 0 1296.04 -691.168 0 0 0 -652.257 0 -64.6229 1070.67 0 0 0 0 251.701 1311.46 0 0 0 -1639.23 0 0 0 0 0 0 0 1531.65 0 0 -893.048 364.315 2375.33 0 0 0 0 0 0 0 0 0 0 0 0 
0 2035.36 1341.36 0 0 0 -1681.95 0 0 0 0 0 0 0 0 0 0 -1371.73 0 0 0 0 0 0 -1700.57 -1233.79 0 0 -1180.38 0 1029.92 0 0 0.01 0 1781.14 0 0 -1862.47 0 0 0 0 0 0 0 0 0 196.463 0 0 0 2022.39 0 0 0 
0 0 480.285 1997.21 0 0 0 0 0 0 0 0 0 1102.1 0 0 -2187.64 0 265.587 -967.971 0 0 0 0 91.174 0 0 0 -2033.68 692.236 0 0 0 0 0.09 0 1229.06 0 0 1687.44 -2150.72 -53.6363 -107.807 0 0 0 -821.94 -1587.34 0 0 0 -1979.96 801.798 2375.64 0 0 
0 0 0 803.629 0 0 -457.854 0 2061.45 0 0 0 0 0 0 746.254 561.464 0 0 2263.02 0 0 0 721.992 0 586.642 0 0 0 0 -2112.87 1052.81 0 -1020.77 0 0.08 0 0 0 0 1535.16 0 -1809.21 -1540.8 444.578 0 873.974 0 0 -322.047 0 1593.3 0 0 0 2054.73 
0 0 0 -2333.37 0 1983.17 0 0 0 0 0 0 0 0 0 0 2064.35 0 1342.89 0 0 0 2364.96 0 0 0 -438.322 0 0 0 -1525.24 0 0 0 2476.35 0 0.09 709.021 0 0 0 0 0 0 -446.104 0 -1991.26 0 0 298.395 0 0 -189.596 0 0 0 
-988.723 0 0 0 0 0 0 0 0 0 0 0 0 0 487.915 0 0 0 1584.9 1843.85 849.101 -488.22 0 1277.73 0 1648.38 2262.11 0 0 0 125.813 -965.072 0 0 0 0 1975.23 0 0 0 0 2485.96 0 0 936.842 0 0 1341.06 575.808 343.562 -1320.15 0 -2271.87 613.346 1929.91 1723.15 
0 -890.149 1157.95 0 0 0 0 0 1158.56 0 0 1858.5 1097.83 0 0 0 0 0 0 1047.93 -1507.84 0 111.011 0 1944.11 0 0 0 -2264.09 0 -78.0511 0 -375.759 -768.532 0 0 0 0 0.03 0 0 0 0 0 0 0 0 0 0 2136.68 0 0 948.286 0 0 0 
0 0 0 0 0 2471.92 -240.715 0 0 -853.832 0 0 0 -2156.51 0 0 0 0 2253.87 -154.805 0 0 0 0 0 -1271.32 0 0 225.608 1008.56 0 0 0 0 151.143 0 0 0 0 0.08 0 0 0 2014.45 0 0 1757.48 0 0 0 0 0 0 0 -2477.42 0 
-678.045 1171.68 0 0 0 0 0 1530.12 0 0 1767.1 0 700.629 0 0 0 0 0 0 0 0 0 311.518 0 0 0 0 0 -659.429 264.367 0 1062.12 0 0 779.519 -1277.12 0 0 0 0 0.04 0 0 -598.544 0 0 0 0 0 0 0 -1255.15 -1440.24 -215.69 0 0 
-1236.08 0 0 1406.37 0 0 -395.444 0 0 2131.34 0 -1768.01 0 815.073 0 0 0 0 2183.68 1574.07 0 -1195.94 0 0 1018.33 0 0 -390.713 0 0 0 0 1884.14 0 2346.03 0 0 -603.732 0 0 0 0.09 1928.08 0 0 0 0 -349.361 0 0 0 0 0 0 -1123.77 0 
0 0 1152.3 0 0 -1917.25 0 714.057 0 -189.291 0 0 0 0 0 0 691.931 -1656.62 1126.21 0 958.968 0 1967.45 0 -200.43 0 0 0 0 0 0 0 -232.017 0 -357.601 655.004 0 0 0 0 0 -843.303 0.01 -644.169 749.001 -582.98 463.958 2250.82 -937.91 0 0 0 0 1972.49 0 0 
0 0 0 741.066 -723.06 0 0 2033.98 0 0 0 0 0 0 0 0 0 788.98 0 534.761 -2099.6 -2394.56 0 0 1689.58 0 0 0 225.608 0 0 204.093 1824.93 0 0 -1463.74 0 0 0 -2104.33 -1239.43 0 1718.12 0.07 556.124 -329.218 1257.9 0 2425.99 438.932 0 0 0 0 113.605 960.494 
0 0 -744.27 0 0 0 0 0 -1744.21 0 0 -2124.93 2175.44 0 0 -2033.37 0 0 469.146 0 0 0 -505.615 0 0 0 0 0 0 1909.92 0 0 0 0 0 1397.52 1871.01 1627.32 0 0 0 0 2162.92 -1728.49 0.05 0 0 0 0 -519.807 0 0 0 516.602 0 0 
0 2081.74 0 0 1062.27 2369.69 0 0 0 0 0 0 0 0 0 0 1236.99 0 -1277.28 0 0 0 0 1191.21 -76.3726 377.743 0 0 0 0 0 1306.73 0 0 0 0 0 0 0 0 0 0 -2204.58 1081.96 0 0.03 733.131 0 0 0 0 0 0 0 0 0 
0 0 0 0 -1387.14 0 0 0 0 1365.93 -827.128 0 0 1741.31 0 0 0 -29.2215 -122.15 0 0 1944.72 0 -2413.94 0 -1703.01 1768.32 0 -968.581 -5.56963 0 0 0 0 -2032 2304.22 2291.1 0 0 -147.938 0 0 1355.25 1960.28 0 -2039.32 0.04 0 0 0 0 0 0 0 71.9474 1277.58 
0 0 0 -161.977 0 0 0 0 854.289 314.875 0 0 0 2424.77 1756.87 0 0 0 0 0 0 489.135 -1431.09 0 -522.553 0 0 0 0 0 0 0 0 0 2150.11 0 0 -270.623 0 0 0 -2174.21 1863.84 0 0 0 0 0.08 0 0 217.673 0 0 2038.87 -676.672 0 
0 0 0 0 0 0 0 0 0 316.706 0 0 0 0 0 -1152.76 0 0 785.47 0 2296.59 0 -913.648 0 0 -2304.83 0 0 0 0 0 0 0 1738.72 0 0 0 -201.346 0 0 0 0 1887.19 2119.13 0 0 0 0 0.05 2462.31 0 -911.206 0 0 -2462.46 1151.84 
0 0 0 0 0 0 165.334 -1112.17 0 0 0 0 0 0 0 0 0 -269.555 0 901.135 0 1723.61 0 0 0 0 0 0 2397.46 0 0 0 0 0 0 -478.912 1826.3 1914.81 -803.476 0 0 0 0 1208.91 1000.47 0 0 0 -442.289 0.06 0 2496.64 0 1051.44 0 0 
0 0 0 0 0 0 0 0 0 0 0 0 1388.36 0 0 0 0 0 0 0 0 343.104 1599.7 0 0 0 -2043.14 2368.77 0 0 0 0 0 0 0 0 0 556.429 0 0 0 0 0 0 0 0 0 -2471.77 0 0 0.05 0 0 1930.22 0 -30.2896 
1736.12 1848.28 2253.41 0 0 0 0 1023.06 0 0 0 0 0 -1485.87 0 0 0 2243.19 0 0 0 0 0 2362.82 0 0 0 0 0 0 -1855.3 943.098 0 0 1560.18 1081.19 0 0 0 0 -1695.99 0 0 0 0 0 0 0 -2261.8 -286.34 0 0.05 -136.036 -1421.63 0 -2412.87 
291.223 0 0 0 0 0 0 0 451.445 0 0 0 -1179.31 0 0 -1103.32 0 0 0 0 0 0 0 2396.08 -1163.44 0 0 0 2277.52 2416.84 1947.92 0 0 1626.26 -1442.38 0 -1926.25 2391.51 -51.6526 0 588.778 0 0 0 0 0 0 0 0 0 0 -1424.68 0 -526.215 0 0 
0 0 -426.725 -1022.6 0 0 0 0 0 0 -24.9489 -767.922 0 0 2372.89 0 0 0 0 0 0 0 0 720.771 0 0 0 -102.161 0 0 0 560.244 0 0 -1663.34 0 0 -1657.08 0 0 1464.96 0 1673.41 0 248.344 0 0 216.91 0 2268.52 515.076 -1326.87 2295.22 0 0 -2220.76 
1252.4 0 2064.35 0 0 0 1202.35 0 -1972.49 2119.43 0 0 0 0 0 0 0 0 0 0 710.089 -686.59 0 0 0 0 0 0 2387.39 0 0 884.045 0 0 0 0 0 -1962.26 0 -1744.97 0 5.11185 0 756.935 0 0 946.455 566.347 918.989 0 0 0 0 0 0.06 0 
-1712.93 0 -289.087 0 0 0 0 -1458.4 158.62 0 0 0 407.193 -1777.78 0 2025.44 0 0 0 0 0 0 1124.23 0 0 1242.18 0 1076.62 -402.768 0 0 -271.844 0 0 0 2383.72 0 1730.93 0 0 0 0 0 -329.371 0 0 -1309.32 0 -551.241 0 1341.36 8.01111 0 320.368 0 0.03 
