*Vertices 57
*Matrix 
0 0 0 0 1133.08 0 0 0 0 2092.43 0 0 0 0 0 0 0 0 246.055 0 0 0 0 -2162.62 0 1344.26 0 0 0 1975.08 0 0 0 0 0 0 0 0 0 0 0 0 0 0 0 0 0 0 0 2390.9 0 0 0 0 797.22 0 0 
0 0.01 0 0 0 -723.975 0 0 0 197.836 884.045 38.8348 0 0 0 0 0 0 0 0 -1483.43 0 0 0 0 0 619.297 -1762.52 0 0 0 0 0 0 2358.39 1623.36 -457.701 0 0 0 0 0 0 0 0 0 889.233 0 0 0 0 0 0 0 0 0 0 
0 0 0.05 0 0 0 1838.97 0 0 0 0 0 1883.83 0 0 966.903 0 0 0 0 0 0 0 -1303.98 0 0 0 0 -161.519 0 0 93.3103 0 0 0 0 0 1314.2 800.424 0 0 0 0 2417.91 -1652.04 0 0 0 0 0 0 0 2086.02 0 0 0 0 
0 0 0 0.09 0 0 0 -299.463 0 0 0 0 0 1092.94 1005.36 0 0 0 0 0 0 0 2154.38 0 0 0 0 917.768 0 0 0 0 -1747.26 0 0 2076.86 0 0 0 0 0 0 0 -730.537 0 0 0 0 0 0 0 0 0 0 0 0 0 
1333.12 0 0 0 0.02 0 0 0 0 681.86 0 0 0 0 0 0 0 0 1283.38 0 0 0 0 0 2254.94 0 1943.04 0 0 0 0 0 0 0 0 0 0 0 0 0 -1705.3 0 0 0 0 0 0 0 0 0 774.178 0 0 0 -368.892 0 0 
0 -1429.56 0 0 0 0.06 0 0 0 0 0 0 -580.081 0 0 0 0 1323.21 0 0 0 15.183 0 0 0 0 0 0 0 0 0 0 0 0 0 0 2069.38 0 0 0 0 0 0 0 0 0 0 0 0 0 0 0 0 0 0 0 0 
0 0 424.894 0 0 0 0.08 0 0 0 0 0 0 0 0 0 0 0 0 0 0 1180.68 0 0 0 0 0 0 0 0 0 0 0 0 0 0 0 0 0 0 0 2020.86 -2305.29 0 418.79 -782.876 0 0 0 0 0 0 0 0 0 -58.2141 0 
0 0 0 -276.574 0 0 0 0 0 1154.74 0 0 0 0 0 0 0 0 0 0 0 0 0 0 0 0 0 0 0 0 1733.53 0 0 0 0 0 0 0 0 0 0 0 1375.7 0 0 0 0 0 0 2086.63 1998.12 0 0 -1597.42 0 0 0 
0 0 0 0 0 0 0 0 0.08 0 0 0 0 0 1372.34 0 0 0 198.294 -1286.28 716.803 0 0 0 0 0 0 0 0 0 0 716.193 0 0 0 175.71 0 0 -1179.16 2490.08 0 0 0 0 0 0 0 0 0 0 0 0 0 0 0 0 0 
-1007.34 -1131.55 0 0 2220.6 0 0 1561.86 0 0.04 446.562 0 0 0 0 613.193 0 0 -2203.97 0 0 0 0 0 0 0 0 1697.67 0 -1980.73 0 0 0 0 0 120.777 0 0 0 0 0 0 0 0 -49.0585 0 0 0 0 0 0 0 0 0 0 0 0 
0 1459.47 0 0 0 0 0 0 0 -2395.63 0.06 0 0 0 0 963.088 0 0 0 0 0 0 0 0 -725.654 0 -1988.97 0 -517.67 541.627 0 0 0 0 942.946 0 2196.19 0 0 0 0 0 0 0 0 0 0 0 0 -718.177 0 0 0 1132.62 0 0 0 
0 1981.49 0 0 0 0 0 0 0 0 0 0.08 0 0 0 0 0 0 0 0 0 0 0 0 2217.7 1861.09 0 0 0 -454.344 0 0 0 0 0 0 0 0 0 1990.04 2265.01 0 0 913.953 575.045 0 0 0 0 0 0 0 0 0 0 0 0 
0 0 330.897 0 0 1619.08 0 0 0 0 0 0 0.05 0 0 0 0 0 0 0 0 0 2336.42 0 0 0 0 0 0 0 0 2167.2 1175.95 0 2432.25 0 0 0 0 0 0 0 -771.432 0 0 0 0 0 0 0 0 0 0 0 0 0 0 
0 0 0 -271.844 0 0 0 0 0 0 0 0 0 0.07 0 0 0 0 0 0 0 0 1746.8 -1747.72 0 0 0 2454.99 0 1713.54 0 0 0 401.547 0 936.384 0 2482.45 1620.76 0 0 0 0 -2237.08 0 0 0 0 0 0 0 0 0 0 0 0 0 
0 0 0 998.642 0 0 0 0 62.7918 0 0 0 0 0 0.05 2419.28 0 -2193.9 0 0 0 0 0 0 0 0 0 0 0 0 127.949 0 0 0 0 1458.4 667.058 0 0 0 0 0 0 0 0 0 0 0 0 0 1373.41 0 0 0 0 -807.749 0 
0 0 -1391.72 0 0 0 0 0 0 207.755 -1528.44 0 0 0 986.282 0.09 0 1892.38 -1404.54 0 0 0 2302.39 0 0 0 0 0 0 0 0 0 0 0 0 0 0 0 0 683.081 0 0 0 2083.73 0 0 1736.88 0 0 0 0 119.098 0 0 0 1402.71 0 
0 0 0 0 0 0 0 0 0 0 0 0 0 0 0 0 0.08 0 -1949.29 0 0 0 0 0 0 0 2317.04 0 -45.7015 0 0 0 0 0 0 0 0 -84.46 0 0 0 0 0 0 0 0 1663.49 0 0 0 0 0 0 2274.01 0 0 0 
0 0 0 0 0 -1906.26 0 0 0 0 0 0 0 0 -1396.91 1457.79 0 0 0 0 2006.52 0 0 0 0 0 0 0 0 0 0 0 0 0 996.2 982.772 0 -729.011 0 0 0 0 0 0 0 0 1878.95 0 0 0 0 0 0 0 0 0 0 
2484.59 0 0 0 1715.52 0 0 0 -1240.65 -2417.75 0 0 0 0 0 -831.858 1944.11 0 0.07 0 0 0 0 0 0 0 0 0 0 0 1799.3 0 0 0 0 0 1371.27 0 0 0 -880.078 0 0 0 0 0 0 0 0 134.51 0 0 0 0 0 0 0 
0 0 0 0 0 0 0 0 -1083.79 0 0 0 0 0 0 0 0 0 0 0.03 0 0 0 0 0 0 0 0 0 0 0 0 0 0 0 306.94 0 0 -1441.92 0 0 0 1669.59 0 2401.12 0 0 0 0 0 0 0 0 0 -2080.22 0 1280.63 
0 1549.5 0 0 0 0 0 0 168.386 0 0 0 0 0 0 0 0 -292.901 0 0 0.07 0 0 0 0 0 0 0 0 0 0 0 0 0 0 0 0 1464.66 0 0 0 0 0 0 0 0 0 1606.27 0 0 500.275 0 0 0 0 0 0 
0 0 0 0 0 1167.26 2415.01 0 0 0 0 0 0 0 0 0 0 0 0 0 0 0.02 1382.41 0 0 0 0 0 1216.24 0 0 0 0 0 0 0 0 0 0 0 0 0 0 0 0 0 0 0 0 0 0 1270.71 0 0 0 0 0 
0 0 0 265.893 0 0 0 0 0 0 0 0 1092.18 -1645.94 0 1029.16 0 0 0 0 0 1823.71 0.08 0 0 0 0 0 0 0 0 0 0 0 0 0 0 0 0 0 0 0 0 0 0 1877.12 -190.664 0 0 -331.812 25.8644 0 0 -803.171 0 0 0 
2055.96 0 -742.592 0 0 0 0 0 0 0 0 0 0 302.667 0 0 0 0 0 0 0 0 0 0 0 0 0 0 0 0 0 -779.061 0 0 0 0 0 0 0 0 0 0 -1799.14 0 0 0 0 0 0 0 0 0 0 1475.8 0 0 0 
0 0 0 0 -472.35 0 0 0 0 0 -1293.6 687.048 0 0 0 0 0 0 0 0 0 0 0 0 0.08 0 0 0 0 0 0 0 -707.038 0 0 0 0 0 0 0 0 0 0 0 0 0 0 0 0 1931.9 0 0 0 0 0 1960.43 0 
1019.09 0 0 0 0 0 0 0 0 0 0 2116.84 0 0 0 0 0 0 0 0 0 0 0 0 0 0.04 0 0 0 0 0 0 0 0 0 0 0 0 0 683.691 0 -2154.84 0 0 0 0 503.021 0 -669.652 0 0 0 0 0 0 0 0 
0 -282.22 0 0 2324.67 0 0 0 0 0 -2005.75 0 0 0 0 0 1934.03 0 0 0 0 0 0 0 0 0 0.05 0 0 0 0 0 0 -1172.14 872.6 0 0 0 0 0 0 0 0 0 0 0 0 0 0 0 0 0 0 0 0 0 0 
0 -1502.66 0 1117.05 0 0 0 0 0 2140.19 0 0 0 1696.75 0 0 0 0 0 0 0 0 0 0 0 0 0 0.07 -2067.71 0 0 0 0 0 0 0 0 0 0 0 0 -1185.72 0 0 0 0 0 0 0 0 0 -47.0748 2043.75 0 0 0 0 
0 0 2360.23 0 0 0 0 0 0 0 -1929.46 0 0 0 0 0 294.427 0 0 0 0 -1585.82 0 0 0 0 0 22.2022 0.07 0 0 0 0 0 0 2163.53 0 0 0 0 0 471.282 0 0 0 0 0 0 0 0 0 0 0 0 0 0 0 
530.793 0 0 0 0 0 0 0 0 2311.55 -216.453 1741.92 0 2035.05 0 0 0 0 0 0 0 0 0 0 0 0 0 0 0 0.06 0 0 0 0 0 0 0 382.931 0 0 0 -2253.11 0 0 0 0 973.464 0 0 0 0 0 0 0 0 -1977.22 0 
0 0 0 0 0 0 0 1965.77 0 0 0 0 0 0 844.218 0 0 0 1862.32 0 0 0 0 0 0 0 0 0 0 0 0 -121.54 0 0 -1288.42 2103.56 0 0 1159.78 0 0 0 -358.058 0 0 0 0 0 0 0 0 516.755 0 0 0 0 0 
0 0 -149.007 0 0 0 0 0 406.43 0 0 0 248.344 0 0 0 0 0 0 0 0 0 0 2136.83 0 0 0 0 0 0 930.433 0 0 1876.66 0 1095.54 0 0 0 0 0 0 0 0 0 0 0 0 0 0 0 0 0 0 0 0 0 
0 0 0 840.709 0 0 0 0 0 0 0 0 1394.47 0 0 0 0 0 0 0 0 0 0 0 102.618 0 0 0 0 0 0 0 0 0 0 0 0 0 0 0 0 -1636.33 0 0 0 0 1612.52 0 0 0 0 0 0 0 0 0 0 
0 0 0 0 0 0 0 0 0 0 0 0 0 -2448.42 0 0 0 0 0 0 0 0 0 0 0 0 1026.72 0 0 0 0 1594.52 0 0.08 0 0 0 0 0 0 0 0 0 0 0 2497.86 0 0 0 0 0 0 0 0 2424.31 0 0 
0 1195.03 0 0 0 0 0 0 0 0 2349.24 0 69.0481 0 0 0 0 -564.821 0 0 0 0 0 0 0 0 1052.96 0 0 0 2112.42 0 0 0 0.02 0 0 0 1052.35 2397 0 0 -2052.75 0 0 0 0 0 0 0 0 0 0 0 0 0 0 
0 -1534.24 0 761.971 0 0 0 0 827.586 -1193.5 0 0 0 1294.06 -1562.93 0 0 2315.82 0 419.095 0 0 0 0 0 0 0 0 2361.6 0 -449.919 2131.95 0 0 0 0.06 0 0 0 0 0 0 0 0 0 2285 0 0 0 0 0 0 0 0 0 0 0 
0 -2337.18 0 0 0 75.7622 0 0 0 0 1152.3 0 0 0 1166.19 0 0 0 174.032 0 0 0 0 0 0 0 0 0 0 0 0 0 0 0 0 0 0.05 0 0 0 0 0 1778.39 0 0 2233.42 0 0 0 0 0 0 0 0 0 0 0 
0 0 566.958 0 0 0 0 0 0 0 0 0 0 2330.77 0 0 2225.64 155.263 0 0 2127.83 0 0 0 0 0 0 0 0 12.2837 0 0 0 0 0 0 0 0.05 0 0 0 0 0 0 0 0 0 0 0 2079.91 0 0 0 127.491 0 0 0 
0 0 -1513.03 0 0 0 0 0 1527.68 0 0 0 0 1468.32 0 0 0 0 0 -879.009 0 0 0 0 0 0 0 0 0 0 2309.26 0 0 0 585.269 0 0 0 0.06 0 -88.8852 -1790.14 0 0 0 0 0 0 0 0 0 0 0 -1466.34 0 2252.04 0 
0 0 0 0 0 0 0 0 151.143 0 0 467.925 0 0 0 1867.35 0 0 0 0 0 0 0 0 0 2403.71 0 0 0 0 0 0 0 0 -1323.05 0 0 0 0 0.01 0 1093.86 0 0 0 0 0 0 0 0 0 0 -2231.74 0 0 0 0 
0 0 0 0 1737.49 0 0 0 0 0 0 -1888.56 0 0 0 0 0 0 826.212 0 0 0 0 0 0 0 0 0 0 0 0 0 0 0 0 0 0 0 -564.364 0 0.08 0 0 0 0 0 0 0 0 0 103.229 0 0 0 2159.87 0 0 
0 0 0 0 0 0 1840.19 0 0 0 0 0 0 0 0 0 0 0 0 0 0 0 0 0 0 -2440.34 0 1640.45 2177.57 -1830.88 0 0 764.718 0 0 0 0 0 1577.27 2476.65 0 0.07 0 0 -2110.89 2429.35 0 0 0 0 0 0 0 -2021.93 0 0 -1335.72 
0 0 0 0 0 0 122.456 781.35 0 0 0 0 -1236.08 0 0 0 0 0 0 -1152.46 0 0 0 645.543 0 0 0 0 0 0 1229.97 0 0 0 1654.79 0 -1880.63 0 0 0 0 0 0.04 0 1427.58 0 0 0 0 0 0 0 0 0 0 0 0 
0 0 2408.6 -137.104 0 0 0 0 0 0 0 63.4022 0 1287.19 0 -345.393 0 0 0 0 0 0 0 0 0 0 0 0 0 0 0 0 0 0 0 0 0 0 0 0 0 0 0 0.03 0 0 0 0 0 0 0 0 0 0 0 137.257 0 
0 0 1938.61 0 0 0 1466.64 0 0 1522.03 0 -1271.02 0 0 0 0 0 0 0 -909.375 0 0 0 0 0 0 0 0 0 0 0 0 0 0 0 0 0 0 0 0 0 -2376.4 1491.82 0 0.05 0 -582.369 0 0 0 0 0 0 0 0 0 0 
0 0 0 0 0 0 512.482 0 0 0 0 0 0 0 0 0 0 0 0 0 0 0 566.347 0 0 0 0 0 0 0 0 0 0 1114.46 0 1244.01 489.593 0 0 0 0 -1068.99 0 0 0 0.03 0 0 -682.623 0 0 0 0 0 0 0 0 
0 1422.54 0 0 0 0 0 0 0 0 0 0 0 0 0 -1976.61 405.82 1571.32 0 0 0 0 488.22 0 0 -623.417 0 0 0 1697.21 0 0 -1436.74 0 0 0 0 0 0 0 0 0 0 0 -839.641 0 0.04 0 2470.24 0 0 0 0 0 0 0 0 
0 0 0 0 0 0 0 0 0 0 0 0 0 0 0 0 0 0 0 0 2047.41 0 0 0 0 0 0 0 0 0 0 0 0 0 0 0 0 0 0 0 0 0 0 0 0 0 0 0 0 0 0 0 2488.56 304.804 0 0 0 
0 0 0 0 0 0 0 0 0 0 0 0 0 0 0 0 0 0 0 0 0 0 0 0 0 -626.316 0 0 0 0 0 0 0 0 0 0 0 0 0 0 0 0 0 0 0 1746.04 -1719.18 0 0.07 0 0 1864.3 0 0 0 0 0 
2362.06 0 0 0 0 0 0 2325.74 0 0 213.858 0 0 0 0 0 0 0 -2064.04 0 0 0 864.055 0 2270.81 0 0 0 0 0 0 0 0 0 0 0 0 -1497.62 0 0 0 0 0 0 0 0 0 0 0 0.09 0 0 0 0 0 0 0 
0 0 0 0 368.435 0 0 2108.6 0 0 0 0 0 0 2013.99 0 0 0 0 0 764.718 0 -1372.95 0 0 0 0 0 0 0 0 0 0 0 0 0 0 0 0 0 2186.57 0 0 0 0 0 0 0 0 0 0.07 238.273 1630.83 -166.707 1179.46 0 0 
0 0 0 0 0 0 0 0 0 0 0 0 0 0 0 -52.4155 0 0 0 0 0 1284.91 0 0 0 0 0 2388.45 0 0 -964.461 0 0 0 0 0 0 0 0 0 0 0 0 0 0 0 0 0 -10.7578 0 -2054.12 0 0 1883.53 0 0 0 
0 0 511.261 0 0 0 0 0 0 0 0 0 0 0 0 0 0 0 0 0 0 0 0 0 0 0 0 -1520.51 0 0 0 0 0 0 0 0 0 0 0 2263.63 0 0 0 0 0 0 0 1250.42 0 0 -1054.49 0 0.02 0 0 0 0 
0 0 0 0 0 0 0 2359.77 0 0 -1306.42 0 0 0 0 0 686.895 0 0 0 0 0 -1300.32 341.273 0 0 0 0 0 0 0 0 0 0 0 0 0 619.297 -600.986 0 0 2137.9 0 0 0 0 0 -1258.96 0 0 1349.76 -59.4348 0 0.02 0 0 0 
2356.11 0 0 0 -61.7237 0 0 0 0 0 0 0 0 0 0 0 0 0 0 568.331 0 0 0 0 0 0 0 0 0 0 0 0 0 -1927.78 0 0 0 0 0 0 871.99 0 0 0 0 0 0 0 0 0 2315.82 0 0 0 0.09 0 0 
0 0 0 0 0 0 -2329.86 0 0 0 0 0 0 0 -138.02 1470.15 0 0 0 0 0 0 0 0 -916.089 0 0 0 0 2382.81 0 0 0 0 0 0 0 0 162.435 0 0 0 0 1887.04 0 0 0 0 0 0 0 0 0 0 0 0.08 0 
0 0 0 0 0 0 0 0 0 0 0 0 0 0 0 0 0 0 0 2385.86 0 0 0 0 0 0 0 0 0 0 0 0 0 0 0 0 0 0 0 0 0 -183.95 0 0 0 0 0 0 0 0 0 0 0 0 0 0 0.04 
