*Vertices 50
*Matrix 
0.09 1104.85 0 0 0 -1535.62 0 727.638 0 0 0 0 1580.02 0 2362.97 -926.618 1931.59 0 0 0 0 0 0 0 0 0 -861.766 0 0 -333.186 0 -1569.49 0 0 -381.252 2145.07 0 0 0 -24.3385 0 0 0 -423.673 0 0 0 0 0 0 
-1812.11 0.04 0 0 0 -60.8081 0 0 0 0 1448.03 0 0 0 1965.62 1071.58 0 0 0 0 0 0 0 0 0 0 339.747 -102.008 0 -1141.77 0 -1817.91 0 0 1065.32 0 1127.43 0 0 0 0 781.503 0 0 0 0 0 0 0 0 
0 0 0.07 1557.59 0 0 0 0 0 -1611.76 2319.48 1134.6 0 0 0 0 0 0 0 0 -931.349 -1338.77 0 -9.53703 0 858.104 0 0 0 0 0 0 0 0 0 0 -327.387 -1574.22 0 0 2212.21 0 -493.103 0 0 0 0 0 1370.05 0 
0 0 1120.11 0.03 0 0 0 0 0 0 1886.88 0 0 0 0 0 2099.75 0 0 0 0 0 0 0 1640.14 0 0 0 0 0 1989.27 1688.51 0 830.332 0 0 716.498 -966.597 0 2064.65 0 0 0 0 0 0 0 0 0 0 
0 0 0 0 0.08 0 0 0 0 0 0 0 -1771.07 0 0 0 -690.405 0 -469.909 0 0 0 0 0 1725.75 0 0 1299.86 0 0 0 0 0 614.566 1906.26 0 0 0 0 0 0 0 0 0 0 0 0 0 0 0 
1836.22 1532.41 0 0 0 0.07 0 2374.72 0 414.67 -949.965 0 -4.1963 0 0 0 0 0 0 155.721 0 0 0 0 0 0 136.036 0 827.433 0 0 1714.15 0 0 0 0 0 771.889 0 0 0 0 0 0 0 0 -957.9 0 -2376.55 105.823 
0 0 0 0 0 0 0.03 0 0 0 0 0 1148.79 0 0 638.829 0 0 -1840.95 0 0 0 0 0 -888.775 2231.44 0 0 0 0 0 0 -998.642 1789.38 -1113.39 0 1458.56 -1861.25 0 1434.14 0 0 0 0 2406.61 0 0 0 0 0 
-75.9148 0 0 0 0 1352.2 0 0.06 0 0 0 0 2409.05 0 0 0 185.324 2137.29 0 0 -1568.27 0 0 0 0 0 0 0 -2380.21 0 0 0 -544.221 0 793.71 -580.538 0 0 0 0 0 0 0 0 0 0 0 0 0 0 
0 0 0 0 0 0 0 0 0.09 0 -1007.49 1403.01 0 0 -1952.8 0 0 0 0 1693.55 -2388.76 2260.43 0 815.683 -628.605 0 365.383 1545.53 0 0 0 0 0 0 2078.39 0 0 1195.49 0 1806.62 0 0 0 0 887.86 1655.4 0 0 774.026 0 
0 0 -1056.17 0 0 506.226 0 0 0 0.07 0 58.3666 0 0 -1082.57 0 0 1950.67 0 0 0 0 0 0 0 0 0 0 0 482.269 1362.73 0 2157.12 0 1142.23 0 0 -1786.94 0 0 1218.83 0 0 0 0 0 0 1040.6 25.7118 0 
0 -1766.64 933.943 -2190.69 0 2120.04 0 0 -983.993 0 0.08 -691.473 0 0 1609.01 0 2475.13 0 0 0 0 24.7963 -1061.66 0 0 0 0 0 0 2143.09 0 179.983 1417.05 0 0 0 1430.94 1629 412.229 0 2168.26 0 0 -1207.69 0 0 0 0 0 0 
0 0 2182 0 0 0 0 0 504.547 2123.71 1230.74 0.02 0 0 0 0 1167.41 0 0 0 0 0 0 0 1347.62 -541.322 0 0 0 -2063.13 -2357.02 0 0 0 0 -1404.39 1560.34 1034.96 0 0 0 0 0 0 0 0 0 0 0 0 
285.73 0 0 0 130.543 2329.4 2267.75 -237.51 0 0 0 0 0.07 0 0 0 0 0 0 0 0 0 0 0 0 0 0 0 0 0 0 0 0 0 -1217.76 1664.56 0 0 0 0 0 0 0 0 0 0 0 0 1203.12 1596.65 
0 0 0 0 0 0 0 0 0 0 0 0 0 0.03 0 0 0 0 1992.02 0 0 0 0 -2061.6 0 500.275 2000.26 -1684.55 0 0 -1834.7 0 2482.76 0 0 0 0 0 0 114.673 0 2359.77 0 1131.24 0 0 0 0 0 0 
2336.27 449.614 0 0 0 0 0 0 1346.25 -1606.27 2218.47 0 0 0 0.01 0 231.254 0 0 0 373.775 728.401 1516.85 0 0 0 0 1622.75 -1373.1 0 0 -170.37 0 1847.51 0 0 0 2279.05 206.992 0 -2285 -916.395 1157.64 0 0 0 0 0 0 0 
5.72222 2240.29 0 0 0 0 1973.71 0 0 0 0 0 0 0 0 0.06 0 0 -1831.95 0 1084.7 -297.021 0 -1343.96 0 0 -2085.25 0 -99.5666 0 0 826.06 0 0 0 383.847 0 0 -807.138 0 0 0 0 0 0 0 227.897 0 0 0 
1458.1 0 0 1434.75 -2439.12 0 0 1117.21 0 0 -977.737 -2179.1 0 0 2150.41 0 0.06 0 74.6941 0 0 0 0 1790.9 2415.62 0 0 1661.5 0 1618.63 0 0 0 0 0 0 0 0 2379.6 0 0 0 0 0 2118.67 0 0 0 0 -2396.39 
0 0 0 0 0 0 0 175.863 0 -1335.72 0 0 0 0 0 0 0 0.07 2471.31 2463.07 0 0 0 0 0 0 0 0 0 0 786.233 0 0 0 -159.841 0 0 2250.21 1487.55 1296.5 0 0 0 0 0 0 -1912.37 0 0 0 
0 0 0 0 773.873 0 -203.177 0 0 0 0 0 0 -2091.97 0 1828.29 1886.12 1097.67 0.09 0 0 0 0 -200.43 0 0 0 0 0 0 0 1689.73 0 -256.127 0 337.458 0 0 2117.6 -2064.81 0 0 0 0 -118.03 -2263.79 0 0 0 0 
0 0 0 0 0 -1011.15 0 0 1791.21 0 0 0 0 0 0 0 0 -1121.48 0 0.01 0 0 0 0 1341.52 1371.88 -248.497 0 0 0 0 0 1049.3 -2252.65 0 1218.07 0 0 0 0 0 0 0 0 0 0 0 0 0 0 
0 0 549.562 0 0 0 0 454.344 -1558.81 0 0 0 0 0 1486.79 -1001.69 0 0 0 0 0 0 1490.6 0 0 0 -111.774 0 85.0703 1593.75 0 0 0 0 -140.767 0 0 0 0 0 0 1746.35 0 0 837.809 0 0 0 0 0 
0 0 -1389.43 0 0 0 0 0 -1802.96 0 2274.47 0 0 0 -1455.35 1392.03 0 0 0 0 0 0.08 0 0 0 0 0 1285.21 0 0 0 2095.48 0 0 -1492.28 0 0 0 0 -196.005 1538.67 0 137.257 0 0 0 0 0 0 0 
0 0 0 0 0 0 0 0 0 0 1739.17 0 0 0 -809.275 0 0 0 0 0 2147.21 0 0.08 0 -915.632 0 0 0 692.846 0 0 0 744.88 0 0 675.451 0 -2083.27 1635.87 1257.29 0 -1203.12 0 0 0 0 0 0 0 0 
0 0 2445.52 0 0 0 0 0 1247.98 0 0 0 0 553.987 0 2413.63 -745.949 0 -1049.3 0 0 0 0 0.04 703.986 1874.22 0 0 0 -1933.88 0 1264.31 716.651 0 0 0 0 0 904.645 0 -1980.42 0 0 1296.96 0 0 0 -209.128 0 0 
0 0 0 2162.77 1480.38 0 -2370.91 0 527.131 0 0 169.149 0 0 0 0 2446.9 0 0 1135.36 0 0 742.439 -2482.15 0.03 0 0 0 -836.283 0 0 0 0 0 0 946.303 0 0 106.281 0 1267.51 0 0 0 0 0 -2001.02 0 0 0 
0 0 -2311.7 0 0 0 1059.07 0 0 0 0 -228.202 0 5.72222 0 0 0 0 0 -1950.82 0 0 0 30.7474 0 0.07 1152.91 0 2114.55 0 0 0 754.952 0 0 0 0 0 0 0 1390.35 563.753 0 0 0 0 0 0 0 0 
33.9518 -2255.09 0 0 0 1913.13 0 0 370.724 0 0 0 0 -345.088 0 2216.94 0 0 0 769.448 -179.678 0 0 0 0 -318.69 0.08 818.43 0 -813.242 0 2271.87 1765.88 -479.064 -1142.08 0 0 0 1580.48 0 -228.965 0 114.063 0 0 0 0 0 0 0 
0 -608.31 0 0 944.472 0 0 0 1758.25 0 0 0 0 496.46 -2039.02 0 24.3385 0 0 0 0 282.678 0 0 0 0 -1367.76 0.06 0 0 -7.85852 -2395.63 1547.98 0 0 2346.95 0 0 0 2335.35 0 0 0 0 0 0 0 -1830.88 1873.91 0 
0 0 0 0 0 204.703 0 -2381.74 0 0 0 0 0 0 2038.1 1692.18 0 0 0 0 1287.5 0 -446.257 0 1398.89 -905.103 0 0 0.07 0 1684.85 0 0 0 -1594.21 0 0 0 0 0 0 0 1229.36 0 0 0 0 0 0 1317.87 
694.83 748.085 0 0 0 0 0 0 0 -374.081 -873.363 988.571 0 0 0 0 1718.73 0 0 0 675.451 0 0 -1661.66 0 0 118.488 0 0 0.07 0 1412.63 0 0 0 0 0 332.575 0 0 0 0 0 0 0 0 0 0 -1728.95 0 
0 0 0 -744.728 0 0 0 0 0 -2217.55 0 -1833.78 0 -1103.63 0 0 0 1811.04 0 0 0 0 0 0 0 0 0 2236.01 1378.14 0 0.08 0 0 0 0 0 2259.51 0 0 0 0 0 -568.636 0 1556.67 -426.572 0 0 0 0 
302.667 1904.89 0 -1654.64 0 -883.587 0 0 0 0 -1228.45 0 0 0 1935.56 1761.15 0 0 -46.7696 0 0 1726.51 0 -332.27 0 0 645.543 -742.744 0 1757.64 0 0.07 2470.24 0 0 0 0 0 0 0 141.377 0 0 0 0 0 0 0 0 0 
0 0 0 0 0 0 -2323.91 -638.218 0 -1777.93 -1085.62 0 0 1396.91 0 0 0 0 0 1010.09 0 0 -275.506 1873 0 2287.9 1855.45 1254.23 0 0 0 -623.417 0.09 0 0 0 0 0 0 223.167 0 0 0 210.807 0 0 0 2451.63 0 0 
0 0 0 268.944 943.403 0 -450.072 0 0 0 0 0 0 0 650.426 0 0 0 -646.153 134.968 0 0 0 0 0 0 618.534 0 0 0 0 0 0 0.02 0 0 0 0 0 0 0 0 0 0 0 0 0 0 0 0 
42.0392 471.74 0 0 -663.701 0 1285.82 -2291.25 1684.39 1831.64 0 0 -1684.55 0 0 0 0 2320.09 0 0 -254.143 1300.16 0 0 0 0 -552.309 0 -2057.02 0 0 0 0 0 0.07 0 0 1978.13 0 0 0 0 0 0 0 1040.15 0 0 0 0 
-1983.93 0 0 0 0 0 0 2421.87 0 0 0 2098.38 2401.88 0 0 -490.356 0 0 477.996 -329.066 0 0 -139.851 0 456.328 0 0 -547.731 0 0 0 0 0 0 0 0 0 0 -124.897 0 0 0 0 0 0 0 0 0 0 0 
0 464.721 -1384.85 1423.46 0 0 1376.77 0 0 0 776.315 -425.047 0 0 0 0 0 0 0 0 0 0 0 0 0 0 0 0 0 0 1518.07 0 0 0 0 0 0.08 0 2389.83 0 0 0 0 0 0 0 0 0 0 0 
0 0 640.66 -1285.82 0 -1115.83 -180.135 0 1845.38 -2495.42 613.651 -535.066 0 0 683.538 0 0 -115.741 0 0 0 0 134.51 0 0 0 0 0 0 1744.36 0 0 0 0 733.436 0 0 0.01 0 1038.62 -877.331 2278.13 0 0 0 0 0 0 0 0 
0 0 0 0 0 0 0 0 0 0 -694.678 0 0 0 2093.04 -712.226 -1652.96 -701.849 -2223.04 0 0 0 1817.15 405.362 536.744 0 1792.12 0 0 0 0 0 0 0 0 -2299.34 1709.27 0 0.01 0 118.641 0 0 0 1318.17 0 0 0 0 -1247.52 
-434.202 0 0 1487.85 0 0 2405.55 0 -2444.61 0 0 0 0 -155.263 0 0 0 -1094.32 912.122 0 0 -1132.47 -2104.33 0 0 0 0 2177.57 0 0 0 0 1001.85 0 0 0 0 2103.87 0 0.02 0 0 0 0 0 0 0 0 0 0 
0 0 -2266.69 0 0 0 0 0 0 449.919 -752.968 0 0 0 -530.183 0 0 0 0 0 0 1203.27 0 -187.46 2047.26 2439.73 -1094.16 0 0 0 0 510.498 0 0 0 0 0 1582.46 -148.701 0 0.05 0 0 0 0 0 -1259.42 0 0 0 
0 -632.115 0 0 0 0 0 0 0 0 0 0 0 -2199.55 -2177.57 0 0 0 0 0 2494.81 0 743.812 0 0 2246.09 0 0 0 0 0 0 0 0 0 0 0 909.68 0 0 0 0.05 886.639 0 0 0 0 0 0 0 
0 0 1677.83 0 0 0 0 0 0 0 0 0 0 0 2101.58 0 0 0 0 0 0 303.43 0 0 0 0 262.993 0 1539.43 0 2134.54 0 0 0 0 0 0 0 0 0 0 -1566.9 0.01 0 0 0 0 0 0 0 
713.599 0 0 0 0 0 0 0 0 0 -11.2156 0 0 1520.36 0 0 0 0 0 0 0 0 0 1058.31 0 0 0 0 0 0 0 0 700.934 0 0 0 0 0 0 0 0 0 0 0.09 0 -1664.4 0 0 0 0 
0 0 0 0 0 0 228.507 0 487.762 0 0 0 0 0 0 0 -604.648 0 -489.288 0 353.786 0 0 0 0 0 0 0 0 0 1395.08 0 0 0 0 0 0 0 38.377 0 0 0 0 0 0.02 0 0 0 0 0 
0 0 0 0 0 0 0 0 1391.11 0 0 0 0 0 0 0 0 0 589.389 0 0 0 0 0 0 0 0 0 0 0 -286.492 0 0 0 -466.704 0 0 0 0 0 0 0 0 -1128.19 0 0.08 2464.45 0 0 0 
0 0 0 0 0 1991.71 0 0 0 0 0 0 0 0 0 -2095.93 0 111.927 0 0 0 0 0 0 2340.08 0 0 0 0 0 0 0 0 0 0 0 0 0 0 0 755.104 0 0 0 0 -361.873 0.03 0 0 0 
0 0 0 0 0 0 0 0 0 -550.783 0 0 0 0 0 0 0 0 0 0 0 0 0 2093.04 0 0 0 433.134 0 0 0 0 2270.2 0 0 0 0 0 0 0 0 0 0 0 0 0 0 0.04 0 812.326 
0 0 1333.58 0 0 872.448 0 0 -1756.42 1967.3 0 0 -2030.17 0 0 0 0 0 0 0 0 0 0 0 0 0 0 397.122 0 965.987 0 0 0 0 0 0 0 0 0 0 0 0 0 0 0 0 0 0 0.08 0 
0 0 0 0 0 2173.45 0 0 0 0 0 0 -568.789 0 0 0 2275.23 0 0 0 0 0 0 0 0 0 0 0 2222.59 0 0 0 0 0 0 0 0 0 -2394.56 0 0 0 0 0 0 0 0 -1916.33 0 0.05 
