*Vertices 55
*Matrix 
0.07 2026.66 0 0 0 0 0 0 2483.06 0 0 0 0 2331.08 0 0 0 0 0 0 0 0 0 0 0 -1472.14 0 0 0 0 0 0 0 0 0 0 0 1730.02 0 0 1437.5 0 0 0 -2232.05 0 0 -1222.19 0 0 0 -2212.21 0 0 0 
-863.445 0.04 0 0 0 0 0 780.892 0 0 0 0 2404.48 2181.84 0 0 0 -1900.16 0 0 0 0 0 0 0 0 0 0 0 -1204.64 0 0 0 0 0 0 725.806 0 0 0 0 -623.722 0 0 0 0 0 0 1655.25 0 0 0 0 0 0 
0 0 0.05 0 0 0 0 0 0 0 0 0 0 -443.815 0 0 0 0 0 0 0 0 0 0 0 0 0 0 0 0 0 0 0 -108.417 0 0 0 0 0 0 0 -1756.26 0 0 0 0 2229.76 0 0 792.795 261.773 0 0 0 0 
0 0 0 0.01 0 0 0 0 0 0 0 0 0 0 0 0 0 0 0 0 0 0 0 0 0 0 0 0 0 0 0 0 0 0 0 681.249 0 0 0 2475.89 0 1501.74 0 0 0 0 0 0 0 0 0 0 0 0 0 
0 0 0 0 0.03 0 1404.84 0 0 0 -2129.51 0 1868.57 0 0 0 0 1782.2 0 0 0 0 0 0 0 0 0 0 0 0 0 0 2164.91 0 0 -368.13 0 0 0 0 1344.11 0 -1607.49 0 0 0 0 0 0 0 2378.69 1276.67 0 0 0 
0 0 0 0 0 0.04 0 -2084.95 0 0 0 0 -1694.92 0 0 0 0 0 0 0 0 0 0 0 0 0 0 13.1993 0 0 0 0 0 0 0 0 0 0 -90.1059 0 0 0 0 0 2141.41 0 0 274.285 0 0 0 0 250.786 2406.31 0 
0 0 0 0 -704.138 0 0.02 0 0 0 0 0 0 0 0 0 0 0 0 -500.427 0 0 0 0 0 0 1841.41 0 0 0 0 0 1491.21 0 0 0 0 -2250.21 -1195.03 -955 0 0 0 0 2258.6 873.974 0 0 0 0 0 0 0 0 0 
0 -1294.37 0 0 0 -1189.69 0 0.02 0 0 0 0 2442.32 0 -227.592 1843.85 0 0 0 764.412 0 0 2330.47 0 0 0 0 0 0 0 0 0 0 -438.017 0 0 0 0 250.175 0 0 0 -1189.69 0 0 -710.852 0 1557.59 478.759 0 0 0 0 0 0 
2040.24 0 0 0 0 0 0 0 0.07 -128.407 0 0 0 0 -636.692 0 0 0 0 1720.86 0 0 0 0 0 0 0 0 0 0 0 0 0 0 0 0 0 0 2313.68 0 -1400.11 0 0 -1203.12 0 0 0 0 0 878.704 0 0 0 0 0 
0 0 0 0 0 0 0 0 1233.02 0.06 -647.984 0 0 2049.39 0 0 2456.97 0 -1901.99 0 0 0 0 0 0 0 0 2428.28 0 0 0 0 0 0 0 0 0 0 0 0 0 0 0 0 0 0 0 -534.608 0 -494.781 0 0 0 0 0 
0 0 0 0 2072.74 0 0 0 0 -1194.57 0.03 0 0 0 0 0 0 0 0 0 0 0 -156.178 0 0 0 0 0 0 -396.054 0 0 0 -406.583 0 -1491.97 0 0 0 0 0 0 0 0 0 0 2382.5 0 0 0 0 0 0 0 0 
0 0 0 0 0 0 0 0 0 0 0 0 0 0 0 0 0 -859.478 0 0 0 0 0 2249.14 0 274.133 0 0 0 0 0 0 0 0 0 0 0 0 -872.6 0 0 682.012 2180.32 0 0 0 0 0 0 0 0 0 0 0 0 
0 1698.89 0 0 -344.783 -163.35 0 -1370.36 0 0 0 0 0.07 0 0 0 0 0 0 0 0 0 0 0 0 0 0 2326.5 0 1506.01 0 0 0 0 0 0 927.992 0 0 0 0 0 0 -1374.48 0 0 0 0 0 0 1442.23 0 0 0 0 
934.553 1835.61 525.452 0 0 0 0 0 0 -1744.67 0 0 0 0.04 0 0 0 0 0 0 0 0 0 0 0 0 0 0 0 0 -2047.56 0 0 0 0 0 0 0 0 0 0 0 0 0 0 0 0 0 0 -1248.59 0 0 0 2396.24 0 
0 0 0 0 0 0 0 1317.41 465.636 0 0 0 0 0 0 0 0 0 1012.38 0 0 0 0 0 0 -2086.78 0 0 0 0 450.987 0 0 0 0 0 0 0 1513.79 0 0 0 0 829.264 0 0 0 0 0 0 2227.32 0 0 0 0 
0 0 0 0 0 0 0 -542.695 0 0 0 0 0 0 0 0.09 0 0 0 0 1513.34 0 1942.58 0 0 0 0 0 0 0 54.857 0 -938.978 0 0 0 0 0 0 0 2146.9 1680.43 0 0 0 0 0 0 0 0 0 0 0 -440.153 0 
0 0 0 0 0 0 0 0 0 -610.599 0 0 0 0 0 0 0.07 0 0 494.476 0 0 0 0 0 1561.4 0 0 0 0 0 0 0 0 1650.67 0 0 0 0 0 0 0 0 0 0 0 0 0 0 0 0 0 0 0 0 
0 1499.76 0 0 -1331.9 0 0 0 0 0 0 2200 0 0 0 0 0 0.05 -1179.77 0 0 0 -2305.44 966.597 0 0 0 0 0 0 0 0 1931.14 0 0 0 0 0 0 1597.26 0 0 0 -1239.43 0 0 0 -1159.63 93.0052 0 0 0 0 0 0 
0 0 0 0 0 0 0 0 0 -2248.38 0 0 0 0 2027.73 0 0 2095.63 0.02 0 0 0 2477.87 0 0 0 0 0 0 0 0 0 0 0 0 0 0 0 1876.96 0 0 0 0 0 0 0 1842.33 0 0 0 -1313.9 0 0 0 0 
0 0 0 0 0 0 -2094.26 2352.75 488.372 0 0 0 0 0 0 0 -61.2659 0 0 0.05 0 0 0 0 0 0 0 0 0 2331.39 0 0 696.966 0 0 0 0 935.469 0 0 0 0 -4.95926 2000.56 1005.51 0 859.63 0 -320.521 0 0 0 0 0 0 
0 0 0 0 0 0 0 0 0 0 0 0 0 0 0 -2285.45 0 0 0 0 0 0 0 0 0 0 0 0 0 0 0 0 0 0 0 0 1801.89 1883.37 0 0 0 0 0 0 0 0 0 -760.445 0 0 107.349 0 0 0 0 
0 0 0 0 0 0 0 0 0 0 0 0 0 0 0 0 0 0 0 0 0 0.05 0 0 0 0 0 0 0 0 1491.36 0 0 0 0 0 1128.65 0 0 1982.1 0 0 0 0 0 0 0 -82.4763 0 0 0 0 0 0 0 
0 0 0 0 0 0 0 2257.23 0 0 -1505.25 0 0 0 0 2002.09 0 1111.71 338.374 0 0 0 0.08 0 -631.657 0 0 0 1171.99 0 0 0 0 0 0 1157.34 505.615 0 0 0 0 0 0 -2125.08 0 0 -727.332 746.712 0 0 0 0 0 0 682.928 
0 0 0 0 0 0 0 0 0 0 0 1707.89 0 0 0 0 0 -2428.28 0 0 0 0 0 0 1422.39 0 0 0 0 0 0 0 0 1983.02 1537.45 -1358.3 0 0 0 0 0 0 0 0 0 0 0 0 1369.9 0 0 0 1235.47 0 0 
0 0 0 0 0 0 0 0 0 0 0 0 0 0 0 0 0 0 0 0 0 0 -2034.59 1540.8 0.03 0 0 0 -2465.06 0 1585.97 -450.072 0 0 0 0 0 0 0 2031.69 0 0 0 1797.46 0 0 0 0 2219.23 0 0 0 0 0 0 
-140.919 0 0 0 0 0 0 0 0 0 0 -1492.89 0 0 -1486.33 0 1874.37 0 0 0 0 0 0 0 0 0.08 0 0 0 0 2108.14 0 0 0 0 0 0 -1970.05 0 0 0 2426.6 2385.56 1647.47 530.641 0 0 0 0 0 0 0 0 0 0 
0 0 0 0 0 0 1597.42 0 0 0 0 0 0 0 0 0 0 0 0 0 0 0 0 0 0 0 0.01 1362.73 0 0 0 0 0 209.891 0 0 0 0 0 0 0 0 0 0 519.654 0 0 0 0 -94.5311 0 0 0 0 0 
0 0 0 0 0 571.383 0 0 0 -2246.7 0 0 -323.115 0 0 0 0 0 0 0 0 0 0 0 0 0 -2127.22 0.02 0 0 0 0 -1123.31 2156.67 0 0 0 0 0 0 0 0 0 0 0 0 0 2376.09 0 1756.42 0 1600.92 0 0 0 
0 0 0 0 0 0 0 0 0 0 0 0 0 0 0 0 0 0 0 0 0 0 -920.209 0 2311.85 0 0 0 0.01 0 0 0 1918.78 0 0 0 0 0 0 0 0 0 0 0 719.092 0 0 0 0 0 0 0 1126.67 0 0 
0 -2384.95 0 0 0 0 0 0 0 0 -1892.53 0 902.356 0 0 0 0 0 0 1505.86 0 0 0 0 0 0 0 0 0 0.03 0 0 0 0 0 0 0 0 0 0 0 0 0 0 2309.11 0 0 0 0 0 0 0 0 0 0 
0 0 0 0 0 0 0 0 0 0 0 0 0 2408.75 -931.196 -223.93 0 0 0 0 0 1194.88 0 0 1124.23 -1410.64 0 0 0 0 0.07 2391.35 0 0 0 0 0 0 0 -274.895 0 0 -578.555 0 0 0 0 0 0 0 1395.08 0 0 0 0 
0 0 0 0 0 0 0 0 0 0 0 0 0 0 0 0 0 0 0 0 0 0 0 0 -212.18 0 0 0 0 0 -1564 0 0 0 0 0 0 0 0 0 1047.78 0 0 385.22 0 0 0 1278.8 160.909 -179.983 0 0 0 0 0 
0 0 0 0 962.935 0 -892.743 0 0 0 0 0 0 0 0 2211.75 0 2078.54 0 -1293.91 0 0 0 0 0 0 0 368.892 483.489 0 0 0 0.04 0 0 2308.95 125.202 0 0 0 0 0 0 0 0 0 0 0 0 2105.7 2080.68 0 0 0 0 
0 0 662.023 0 0 0 0 -2426.15 0 0 1242.18 0 0 0 0 0 0 0 0 0 0 0 0 789.132 0 0 -640.355 700.171 0 0 0 0 0 0.02 1881.39 0 0 0 0 -812.479 0 0 0 253.227 0 0 0 0 0 0 0 0 0 -357.601 0 
0 0 0 0 0 0 0 0 0 0 0 0 0 0 0 0 2157.73 0 0 0 0 0 0 767.617 0 0 0 0 0 0 0 0 0 1072.95 0 0 0 0 239.952 1794.11 0 0 0 0 0 0 0 0 0 1546.75 0 -1767.4 0 0 0 
0 0 0 -1740.85 2464.9 0 0 0 0 0 -2088.15 0 0 0 0 0 0 0 0 0 0 0 1534.7 1411.86 0 0 0 0 0 0 0 0 1944.11 0 0 0.04 0 0 0 0 0 0 0 0 0 0 0 0 0 0 0 0 0 0 0 
0 -1451.23 0 0 0 0 0 0 0 0 0 0 1788 0 0 0 0 0 0 0 1224.02 -2135 894.269 0 0 0 0 0 0 0 0 0 1517.91 0 0 0 0.04 0 0 0 0 850.017 0 0 0 0 0 0 0 0 0 0 -132.527 0 0 
1871.17 0 0 0 0 0 -2024.67 0 0 0 0 0 0 0 0 0 0 0 0 559.786 242.698 0 0 0 0 47.5326 0 0 0 0 0 0 0 0 0 0 0 0.01 0 0 903.577 0 0 601.444 0 0 0 0 2413.33 0 1395.38 0 0 0 0 
0 0 0 0 0 1634.34 1094.47 -950.27 -47.8378 0 0 637.608 0 0 1497.31 0 0 0 1721.32 0 0 0 0 0 0 0 0 0 0 0 0 0 0 0 -1555.3 0 0 0 0.08 0 0 0 0 0 0 0 0 0 0 0 0 0 0 0 0 
0 0 0 2177.27 0 0 1607.03 0 0 0 0 0 0 0 0 0 0 532.777 0 0 0 -2079.3 0 0 -2189.78 0 0 0 0 0 -68.8955 0 0 228.66 -1519.44 0 0 0 0 0.09 0 0 0 0 0 1805.86 0 0 0 0 0 0 0 0 0 
2462.61 0 0 0 -282.372 0 0 0 -303.125 0 0 0 0 0 0 2059.31 0 0 0 0 0 0 0 0 0 0 0 0 0 0 0 51.1948 0 0 0 0 0 1400.57 0 0 0.02 0 838.42 0 0 0 0 0 2194.66 0 -545.289 0 0 0 0 
0 1936.48 2458.65 1097.83 0 0 0 0 0 0 0 -2015.37 0 0 0 -1032.67 0 0 0 0 0 0 0 0 0 89.1903 0 0 0 0 0 0 0 0 0 0 790.048 0 0 0 0 0.03 0 0 0 0 0 0 2357.78 0 0 1823.4 2096.85 0 0 
0 0 0 0 1581.24 0 0 109.027 0 0 0 -515.534 0 0 0 0 0 0 0 1001.24 0 0 0 0 0 1871.32 0 0 0 0 590.915 0 0 0 0 0 0 0 0 0 -1130.94 0 0 0 0 0 -1941.97 0 0 0 0 0 0 0 0 
0 0 0 0 0 0 0 0 -1978.74 0 0 0 -24.7963 0 -275.811 0 0 264.519 0 908.765 0 0 2483.98 0 -2427.06 1217.15 0 0 0 0 0 638.523 0 -694.372 0 0 0 235.984 0 0 0 0 0 0.08 0 -47.6852 0 1723.15 2130.57 0 0 2026.96 259.636 0 0 
-965.987 0 0 0 0 11.2156 1926.1 0 0 0 0 0 0 0 0 0 0 0 0 711.768 0 0 0 0 0 2234.95 -495.544 0 261.467 2398.83 0 0 0 0 0 0 0 0 0 0 0 0 0 0 0.01 0 0 0 0 -1318.48 0 0 0 0 0 
0 0 0 0 0 0 554.445 -590.609 0 0 0 0 0 0 0 0 0 0 0 0 0 0 0 0 0 0 0 0 0 0 0 0 0 0 0 0 0 0 0 -1763.13 0 0 0 1128.04 0 0.01 0 0 1599.7 0 0 0 0 0 1476.87 
0 0 2185.51 0 0 0 0 0 0 0 778.756 0 0 0 0 0 0 0 -302.667 1291.77 0 0 -1118.58 0 0 0 0 0 0 0 0 0 0 0 0 0 0 0 0 0 0 0 1478.24 0 0 0 0.01 0 0 0 0 -1440.86 1329.62 0 0 
1734.75 0 0 0 0 1049.61 0 -900.22 0 -1378.9 0 0 0 0 0 0 0 1547.21 0 0 -283.898 22.3548 575.808 0 0 0 0 572.604 0 0 0 589.541 0 0 0 0 0 0 0 0 0 0 0 -755.409 0 0 0 0.07 0 0 0 0 0 0 0 
0 -191.275 0 0 0 0 0 2429.96 0 0 0 0 0 0 0 0 0 -1551.64 0 -2304.83 0 0 0 1550.87 -846.049 0 0 0 0 0 0 -1963.33 0 0 0 0 0 2386.62 0 0 2149.8 1539.28 0 1999.19 0 -929.06 0 0 0 0 0 253.685 0 0 0 
0 0 -1859.26 0 0 0 0 0 1767.1 158.467 0 0 0 1468.93 0 0 0 0 0 0 0 0 0 0 0 0 1928.24 32.5785 0 0 0 -1974.32 -1682.1 0 -1510.28 0 0 0 0 0 0 0 0 0 2383.42 0 0 0 0 0.01 0 0 1167.56 0 0 
0 0 -1321.07 0 1137.5 0 0 0 0 0 0 0 1733.83 0 1752.14 0 0 0 50.5844 0 1370.97 0 0 0 0 0 0 0 0 0 2399.75 0 -1983.17 0 0 0 0 -311.67 0 0 -2200 0 0 0 0 0 0 0 0 0 0.07 0 0 0 0 
1177.18 0 0 0 943.251 0 0 0 0 0 0 0 0 0 0 0 0 0 0 0 0 0 0 0 0 0 0 2380.98 0 0 0 0 0 0 291.375 0 0 0 0 0 0 1014.82 0 -506.684 0 0 420.164 0 1496.4 0 0 0.08 0 0 0 
0 0 0 0 0 1781.75 0 0 0 0 0 0 0 0 0 0 0 0 0 0 0 0 0 -2404.32 0 0 0 0 1513.03 0 0 0 0 0 0 0 2167.04 0 0 0 0 487.915 0 349.971 0 0 1593.3 0 0 287.408 0 0 0.09 0 0 
0 0 0 0 0 2032.91 0 0 0 0 0 0 0 1723.3 0 2191.15 0 0 0 0 0 0 0 0 0 0 0 0 0 0 0 0 0 1103.47 0 0 0 0 0 0 0 0 0 0 0 0 0 0 0 0 0 0 0 0.05 0 
0 0 0 0 0 0 0 0 0 0 0 0 0 0 0 0 0 0 0 0 0 0 1189.54 0 0 0 0 0 0 0 0 0 0 0 0 0 0 0 0 0 0 0 0 0 0 1572.08 0 0 0 0 0 0 0 0 0.09 
