*Vertices 68
*Matrix 
0.05 2014.6 0 0 0 1512.27 0 0 0 0 2290.49 0 0 0 0 0 1356.32 0 0 0 0 1065.02 0 0 2399.14 0 0 -399.716 0 -1406.06 0 0 0 1264.92 0 0 0 0 0 0 0 0 1926.25 0 0 0 0 0 0 0 0 0 -1265.98 412.381 0 -431.303 0 0 0 0 880.688 0 0 0 0 0 0 0 
-1358.15 0.07 0 0 -1318.78 0 0 0 0 0 0 -592.593 0 0 0 0 0 0 0 0 0 0 0 1098.59 0 0 2470.4 0 -193.869 0 0 0 0 0 0 946.76 0 0 0 1963.48 0 -1302 0 0 0 0 0 0 0 0 0 0 0 0 0 0 0 0 2162.16 -1558.66 0 0 -465.331 -2112.57 0 0 0 0 
0 0 0.07 0 0 0 -704.138 0 0 0 60.0452 0 0 0 -624.485 0 -1186.18 0 0 1879.71 0 0 729.011 1938.76 0 0 0 0 0 1770.91 0 0 1721.32 1871.78 0 0 0 0 0 0 2488.71 0 2249.9 -584.964 0 0 0 0 0 0 629.826 0 0 -1276.21 0 0 0 0 0 2420.04 0 0 69.5059 0 0 -1239.43 0 0 
0 0 0 0.02 -1089.28 0 -1659.06 0 0 1728.95 0 0 2182.15 2154.07 -1948.68 1254.69 0 0 0 2448.27 0 0 476.47 0 1048.54 1956.31 -723.518 -1307.49 0 0 -568.026 0 0 0 0 0 0 0 0 -272.149 -470.214 0 1113.24 0 0 0 0 1800.21 0 0 0 0 0 84.1548 0 0 340.968 0 0 0 -2360.07 0 0 729.011 0 -1642.12 0 0 
0 -229.881 0 -2095.63 0.01 0 0 0 1990.34 0 0 1244.32 0 0 0 0 0 0 0 0 0 0 0 0 0 0 0 0 0 997.116 0 0 0 792.337 0 0 0 2429.65 0 0 0 0 0 0 0 0 -65.9963 0 988.723 0 0 -621.586 0 0 2442.78 0 0 0 -164.113 -1932.05 0 0 0 0 0 2153.46 176.473 0 
-1322.44 0 0 0 0 0.04 0 -1556.83 0 -697.729 0 0 0 0 0 396.359 0 2035.81 401.242 349.971 0 0 0 2363.12 0 0 0 0 0 -207.907 2185.81 0 -835.368 1734.75 804.544 -197.989 0 0 -977.737 0 0 0 0 -440.916 0 0 0 0 0 -1217.46 0 0 0 0 1752.14 -892.132 417.417 779.977 0 140.156 0 -2480.01 -640.355 0 0 -1280.48 1482.21 1878.64 
0 0 1757.79 -69.5059 0 0 0.04 0 0 0 0 0 0 917.31 -194.327 0 962.477 -912.122 -1236.38 0 0 0 0 0 0 0 1994.77 0 0 0 0 2170.4 0 -1197.47 1696.45 0 0 0 0 0 0 0 0 0 557.955 896.71 0 0 672.399 401.09 0 1494.42 0 521.79 329.676 0 -2009.87 -1224.63 -150.38 1823.1 0 -1334.35 0 0 0 0 0 0 
0 0 0 0 0 1058.61 0 0.09 0 706.732 0 0 -2484.13 860.24 0 0 -913.038 0 0 0 0 0 0 0 0 0 0 0 0 0 0 0 -1080.13 0 0 0 0 0 0 0 0 0 -2246.24 0 0 0 0 0 0 0 0 0 0 24.4911 0 0 0 0 0 0 1906.72 0 0 2403.56 0 0 0 0 
0 0 0 0 2280.57 0 0 0 0.04 0 0 1905.04 943.098 0 0 724.281 -2462.16 0 0 -1353.27 0 0 -1457.95 0 1562.93 0 0 1519.9 0 461.211 0 0 -1467.71 0 0 0 0 1972.03 0 0 0 0 0 0 0 0 0 -1055.71 0 0 0 0 1891.77 0 0 -1282.92 0 0 0 0 0 0 0 0 0 0 -1518.52 0 
0 0 0 -1110.49 0 -203.33 0 -206.381 0 0.07 0 0 0 0 0 0 0 0 0 0 125.355 0 -1952.65 -1364.1 0 0 2096.24 82.0185 -1099.05 -822.245 -1183.28 0 -861.461 0 0 0 0 0 1897.11 0 0 0 -1424.22 0 0 336.848 -247.734 0 -620.67 0 0 0 0 2101.28 0 1559.72 0 0 2176.5 0 0 0 1526.15 1483.73 0 0 -1301.08 0 
-1003.07 0 633.946 0 0 0 0 0 0 0 0.03 0 -147.328 0 2396.39 1729.87 0 0 0 0 0 0 0 0 0 0 0 2451.48 0 0 0 0 1744.21 2003.92 0 0 0 0 -2139.42 -2466.43 0 0 0 -1473.36 0 2454.22 -185.324 0 -1787.85 0 0 0 0 -2078.08 0 0 0 0 0 0 0 0 0 0 1797.46 245.598 0 0 
0 -1179.46 0 0 -394.681 0 0 0 1486.63 0 0 0.07 0 0 158.925 0 1567.66 0 0 0 0 0 0 0 1629.92 0 690.863 0 0 0 0 0 -1162.37 0 0 0 0 2249.14 0 0 -1321.38 0 -1141.01 0 0 0 0 -2045.43 0 0 0 0 0 0 0 0 -629.215 0 0 0 0 0 0 0 0 0 0 0 
0 0 0 -561.159 0 0 0 2332.15 532.014 0 2061.6 0 0.04 0 0 0 0 498.291 0 0 0 0 0 0 0 0 0 396.512 0 780.74 0 0 0 0 0 0 0 0 1217.31 -2452.39 169.607 0 0 0 1614.81 0 0 0 0 -1449.1 0 0 0 0 0 0 1802.8 0 0 0 0 0 0 -327.998 0 0 0 0 
0 0 0 -2152.09 0 0 24.1859 927.992 0 0 0 0 0 0.01 782.571 0 0 -2154.07 0 0 0 0 0 0 -815.989 0 0 700.476 -2416.38 636.54 -73.1681 0 0 0 0 0 0 0 0 0 0 1429.26 0 0 0 0 0 0 0 0 0 0 0 1502.66 0 0 0 0 0 0 1433.84 1466.95 0 0 0 0 0 0 
0 0 2345.42 353.938 0 0 1640.75 0 0 0 2287.9 -889.843 0 -902.966 0.05 539.796 0 0 0 204.093 -2214.19 2263.63 0 0 0 0 2018.27 518.128 0 0 1833.17 0 0 0 0 -2451.02 0 0 0 -321.284 0 0 -2338.56 0 0 -98.6511 0 2489.47 0 1485.11 948.744 0 0 0 0 -127.644 0 0 0 0 0 0 -2310.94 0 0 -1546.6 0 0 
0 0 0 826.365 0 1836.38 0 0 -1089.89 0 2123.1 0 0 0 814.463 0.05 0 0 0 0 0 0 0 0 0 0 671.178 0 0 0 1743.29 0 1140.86 0 0 0 0 -1402.86 -312.586 1914.35 0 -464.873 -489.746 0 0 0 0 0 0 0 -1028.4 0 2200.31 0 0 0 0 0 0 1274.38 0 0 -2286.83 0 0 1753.97 0 0 
-2294.15 0 1854.23 0 0 0 1539.58 900.22 840.098 0 0 -1766.64 0 0 0 0 0.03 2027.12 0 0 0 0 1673.25 0 0 1202.2 0 0 0 2314.6 0 0 614.261 0 0 -1923.66 0 0 0 0 0 0 0 0 0 0 -852.153 1760.08 -614.414 0 -570.162 0 -1566.59 -1446.2 0 -735.725 0 0 -360.958 0 0 0 0 289.239 0 1418.42 271.538 0 
0 0 0 0 0 440.611 1976 0 0 0 0 0 531.556 764.26 0 0 -1112.32 0.06 0 0 0 0 0 1449.4 -1346.25 0 2229.61 0 0 0 247.429 0 0 -2052.9 0 0 0 2403.87 -2468.57 0 0 0 0 0 104.144 0 0 0 677.129 0 0 0 0 0 2178.79 379.727 -444.731 0 0 0 0 0 0 0 0 0 268.181 0 
0 0 0 0 0 170.827 354.091 0 0 0 0 0 0 0 0 0 0 0 0.08 0 0 0 0 0 0 0 0 -1793.5 0 0 2235.71 0 0 -333.186 -606.632 0 0 0 0 0 0 0 0 0 0 1661.81 0 0 0 0 1985.15 447.478 586.337 2349.24 0 0 0 0 1138.26 -1126.67 -784.86 1523.56 180.135 -1321.53 0 0 0 0 
0 0 -2014.15 2115.77 0 779.061 0 0 -533.692 0 0 0 0 0 909.986 0 0 0 0 0.03 0 0 0 0 0 0 0 0 557.497 0 0 0 0 0 0 2054.12 0 0 0 0 0 0 638.523 -1207.39 1632.51 0 -1845.38 2316.43 0 0 0 -18.54 -2206.72 0 -32.7311 0 0 0 0 1737.65 1430.33 0 0 0 0 -2026.66 664.922 0 
0 0 0 0 0 0 0 0 0 -2125.54 0 0 0 0 1005.2 0 0 0 0 0 0.06 0 0 2124.93 889.538 0 0 1697.52 1227.68 0 0 0 0 2431.49 0 -786.538 -1038.77 0 0 0 2364.65 0 0 0 -1393.86 0 0 -2095.48 0 0 2028.34 0 0 0 0 0 -157.704 1630.53 1112.02 0 0 0 202.109 -431.303 0 0 0 0 
1076.62 0 0 0 0 0 0 0 0 0 0 0 0 0 -1072.34 0 0 0 0 0 0 0 0 2315.82 0 0 0 0 0 0 0 0 0 0 0 1253.32 0 1736.27 -982.162 0 0 -1629.92 0 294.885 0 0 1429.41 0 310.907 0 0 0 0 0 -2277.21 0 -608.615 2063.28 1582 0 -1929.46 -611.515 0 899.152 0 0 0 0 
0 0 392.392 -2094.1 0 0 0 0 1180.99 1528.6 0 0 0 0 0 0 1588.26 0 0 0 0 0 0.02 0 323.725 0 0 0 776.62 0 -1294.67 0 2009.57 0 511.872 0 0 27.2378 0 0 0 0 0 -123.524 0 0 0 1915.42 0 0 0 1277.28 0 0 -1361.81 2053.06 0 -1793.04 0 -1061.36 0 -809.122 0 0 -308.466 0 0 0 
0 1329 1908.7 0 0 -1190.6 0 0 0 1582.46 0 0 0 0 0 0 0 1900.16 0 0 -1953.87 1077.38 0 0.03 0 0 0 0 2262.72 0 0 -2440.95 0 0 0 217.063 0 1159.93 0 0 0 0 1457.64 0 1833.17 0 0 0 0 0 -1705.6 0 886.029 -255.821 -1750.77 0 -127.186 0 0 0 0 0 0 0 0 0 0 0 
2165.06 0 0 459.838 0 0 0 0 -544.832 0 0 1988.2 0 1208.15 0 0 0 -515.076 0 0 910.138 0 218.894 0 0.07 -194.479 0 0 0 0 0 0 0 0 2029.1 0 0 0 0 0 0 0 -6.02741 0 0 0 0 0 -1874.52 0 -84.0022 0 0 0 0 0 0 -2038.87 0 101.55 0 0 2203.51 0 0 0 0 0 
0 0 0 1020.31 0 0 0 0 0 0 0 0 0 0 0 0 2178.79 0 0 0 0 0 0 0 550.783 0.04 0 0 1823.1 0 0 0 0 -1555.15 0 -1613.13 0 0 0 1134.75 1444.52 -2064.04 37.1563 0 0 0 0 0 2123.55 918.836 0 0 0 0 0 0 2130.42 0 0 1164.82 0 1025.96 0 0 0 0 -764.107 0 
0 -270.47 0 -264.824 0 0 -1867.2 0 0 177.999 0 591.678 0 0 1495.33 446.715 0 1624.58 0 0 0 0 0 0 0 0 0.04 0 0 0 0 0 0 -151.753 -1575.14 0 0 0 322.81 0 927.992 822.245 0 0 0 0 2001.17 0 1859.57 0 -775.094 178.61 937.758 0 -2415.92 0 -790.353 -1415.22 691.321 0 1994.92 0 0 0 -528.504 -1018.48 0 0 
-17.1667 0 0 -1442.69 0 0 0 0 730.384 -170.064 -1860.18 0 429.624 417.722 353.023 0 0 0 2183.37 0 232.17 0 0 0 0 0 0 0.07 458.922 0 0 0 -28.6111 -1700.11 0 0 0 433.287 0 0 0 0 0 0 0 0 0 0 1820.81 0 0 0 0 0 0 0 0 0 1430.02 -78.0511 0 2227.01 0 0 0 0 0 0 
0 842.997 0 0 0 0 0 0 0 -1725.44 0 0 0 -2036.58 0 0 0 0 0 2333.83 545.442 0 546.815 2289.57 0 -1995.07 0 2302.09 0.04 0 0 0 0 0 0 -725.501 -2445.98 0 0 2069.99 0 -2420.96 2481.99 0 0 0 731.91 0 -234.916 1689.73 0 0 0 1694.46 -175.1 0 0 0 0 0 0 0 0 -2123.1 0 -149.617 -530.335 0 
2055.5 0 396.817 0 1019.39 1182.97 0 0 205.008 496.002 0 0 1758.71 1156.58 0 0 516.297 0 0 0 0 0 0 0 0 0 0 0 0 0.07 0 0 1486.48 1105.15 0 0 0 1433.23 0 0 0 0 0 0 311.67 0 0 -999.863 -1686.83 -464.568 0 0 0 835.368 0 0 0 0 0 0 0 0 0 0 0 0 0 0 
0 0 0 -864.36 0 -1121.02 0 0 0 2489.47 0 0 0 1409.42 1412.17 98.3459 0 2396.54 1578.34 0 0 0 -2262.11 0 0 0 0 0 0 0 0.07 0 0 0 0 0 0 0 -602.359 0 0 -945.997 0 0 1095.54 -374.386 0 -123.829 0 0 0 -1629.92 0 -1325.95 0 0 2330.01 2479.86 0 0 0 0 0 0 0 0 0 0 
0 0 0 0 0 0 1427.88 0 0 0 0 0 0 0 0 0 0 0 0 0 0 0 0 -1648.99 0 0 0 0 0 0 0 0.03 0 0 0 0 0 0 0 0 0 1638.16 489.441 0 0 0 0 0 -2295.07 0 0 0 0 0 0 -721.229 0 427.335 2120.5 0 1437.96 0 0 -568.941 0 0 0 0 
0 0 862.072 0 0 463.958 0 -426.572 2268.06 2344.81 -2423.25 -621.891 0 0 0 447.783 2318.11 0 0 0 0 0 -1782.2 0 0 0 0 1518.37 0 171.438 0 0 0.01 0 0 1027.48 987.35 0 0 1740.7 0 -653.63 0 0 0 1831.95 0 0 1396.91 0 0 -2062.21 0 0 2105.24 0 0 0 0 0 0 0 763.039 0 1939.22 2223.35 -1532.11 0 
-2116.69 0 1184.8 0 321.589 1441.77 300.073 0 0 0 2235.4 0 0 0 0 0 0 -26.017 -651.036 0 414.365 0 0 0 0 2264.55 -984.451 -692.541 0 -293.359 0 0 0 0.08 -1481.75 0 0 0 -1050.07 0 -1038.93 0 1866.13 0 1198.69 0 1310.08 0 0 0 0 0 0 0 1414 0 0 -712.378 0 0 0 585.574 0 0 0 0 0 0 
0 0 0 0 0 -20.9815 -1518.07 0 0 0 0 0 0 0 0 0 0 0 2321.62 0 0 0 -1263.7 0 -170.37 0 -897.473 0 0 0 0 0 0 -698.34 0.02 0 0 1001.69 0 2242.73 852.306 2466.73 0 0 2303.31 0 354.091 0 0 0 -656.072 0 0 1999.5 0 0 0 0 0 0 0 320.521 0 0 1566.44 0 0 -600.375 
0 -1360.13 0 0 0 307.855 0 0 0 0 0 0 0 0 1899.7 0 -750.679 0 0 -1780.68 -253.227 1693.7 0 -10.1474 0 -481.201 0 0 948.897 0 0 0 -622.654 0 0 0.03 -764.107 0 0 0 0 -758.766 0 -484.1 0 0 1947.46 0 0 0 0 557.802 0 550.02 -661.107 1749.55 0 -1638.77 1884.29 0 0 0 0 -411.313 0 0 0 0 
0 0 0 0 0 0 0 0 0 0 0 0 0 0 0 0 0 0 0 0 1180.07 0 0 0 0 0 0 0 2423.4 0 0 0 -1454.28 0 0 1768.17 0.07 0 0 0 0 0 0 0 0 0 0 2328.03 -2159.87 -1979.66 0 0 0 0 0 1730.48 911.054 0 0 500.427 0 0 0 0 0 -1035.11 0 0 
0 0 0 0 -2466.73 0 0 0 212.027 0 0 2183.68 0 0 0 2341.91 0 2263.94 0 0 0 626.316 -168.386 -975.6 0 0 0 -2463.99 0 -2302.55 0 0 0 0 -849.101 0 0 0.08 0 0 0 434.965 0 0 0 0 0 0 0 0 2172.23 0 0 -161.672 0 987.198 0 0 0 0 0 0 1214.56 0 -1856.36 0 1238.98 0 
0 0 0 0 0 -947.981 0 0 0 -1918.01 1405.3 0 709.937 0 0 -1860.48 0 -60.8081 0 0 0 619.602 0 0 0 0 2043.75 0 0 0 -737.404 0 0 -1107.75 0 0 0 0 0.08 0 -1509.83 0 0 2351.53 0 0 0 0 0 0 0 0 -1128.8 0 0 214.927 0 0 0 0 -592.441 0 0 0 2487.33 0 0 723.212 
0 2480.16 0 -2060.23 0 0 0 0 0 0 -2428.74 0 -493.713 0 1279.26 910.749 0 0 0 0 0 0 0 0 0 2289.73 0 0 -2041.61 0 0 0 1293.76 0 1390.96 0 0 0 0 0.05 0 0 2104.79 0 0 0 0 0 1767.56 -1639.68 -1939.53 0 0 -429.472 0 2166.59 0 1666.84 -120.472 0 1313.44 0 1082.26 2335.2 0 0 0 -45.5489 
0 0 -321.131 930.128 0 0 0 0 0 0 0 2220.3 -713.599 0 0 0 0 0 0 0 -1727.27 0 0 0 0 2037.34 1461.3 0 0 0 0 0 0 1234.09 -323.878 0 0 0 2169.64 0 0.07 0 1014.66 0 2258.9 0 0 0 0 0 808.664 0 0 1583.83 0 0 2062.52 0 0 0 0 0 0 -766.396 0 0 -600.223 0 
0 -1515.63 0 0 0 0 0 0 0 0 0 0 0 2066.03 0 1325.8 0 0 0 0 0 -589.084 0 0 0 -1323.66 2012.62 0 1718.42 0 -601.596 -1184.19 -2382.96 0 1830.73 2337.79 0 -133.29 0 0 0 0.02 -171.133 0 0 0 2405.39 0 0 2049.85 239.189 -257.195 0 0 0 0 1566.13 0 0 0 1906.42 0 2326.5 1354.18 0 0 -744.27 -2346.34 
-552.004 0 -606.784 -480.895 0 0 0 -365.383 0 1612.83 0 -1209.83 0 0 1351.74 -1184.19 0 0 0 -766.701 0 0 0 -2158.35 -695.746 1273.77 0 0 1848.58 0 0 1648.99 0 -2301.93 0 0 0 0 0 -878.399 723.518 1021.53 0.07 0 1693.4 0 0 0 0 0 2115.16 0 0 1477.63 0 -2193.59 0 2345.12 0 1701.48 0 0 0 -158.467 -716.346 0 0 0 
0 0 1913.28 0 0 -971.786 0 0 0 0 -72.2526 0 0 0 0 0 0 0 0 -1551.03 0 941.725 1728.34 0 0 0 0 0 0 0 0 0 0 0 0 1372.49 0 0 326.014 0 0 0 0 0 0 683.538 0 0 0 283.593 0 0 -2275.84 1870.56 835.978 0 -935.774 0 0 0 0 -708.563 0 1299.1 0 0 0 0 
0 0 0 0 0 0 2237.69 0 0 0 0 0 -1726.66 0 0 0 0 -1790.44 0 -1145.89 -1059.98 0 0 818.43 0 0 0 0 0 -1440.09 2474.67 0 0 1473.2 1255.3 0 0 0 0 0 1968.83 0 1758.25 0 0.02 0 0 0 124.744 0 -2087.69 0 0 -1599.86 1134.75 0 0 2236.32 0 -2064.2 0 206.992 0 0 0 0 0 0 
0 0 0 0 0 0 480.895 0 0 -1399.5 2239.52 0 0 0 1723.3 0 0 0 447.478 0 0 0 0 0 0 0 0 0 0 0 1329.92 0 1466.95 0 0 0 0 0 0 0 0 0 0 1918.78 0 0.05 0 0 0 0 0 -2304.99 0 0 0 0 0 -2316.74 0 0 -582.064 0 0 -1431.24 -91.3266 0 0 0 
0 0 0 0 -323.267 0 0 0 0 1724.83 -1275.29 0 0 0 0 0 -1461.91 0 0 46.3118 0 -2394.25 0 0 0 0 1015.43 0 1829.51 0 0 0 0 2446.9 1375.09 -2329.25 0 0 0 0 0 1344.57 0 0 0 0 0.06 0 0 1565.98 -1286.89 0 0 0 0 0 0 0 0 0 908.307 0 -1111.87 0 0 0 0 0 
0 0 0 1335.41 0 0 0 0 101.398 0 0 1857.13 0 0 -697.729 0 2095.78 0 0 935.774 1709.42 0 1615.88 0 0 0 0 0 0 2346.19 2474.06 0 0 0 0 0 922.956 0 0 0 0 0 0 0 0 0 0 0.04 623.264 -726.722 0 0 -2099.75 0 0 0 0 0 0 0 0 0 -911.664 0 0 0 0 0 
0 0 0 0 117.878 0 998.947 0 0 456.633 197.684 0 0 0 0 0 1694.01 671.636 0 0 0 959.731 0 0 177.847 1759.62 1251.49 -2093.8 1533.63 1191.98 0 1706.21 -1396.91 0 0 0 1662.72 0 0 2060.84 0 0 0 0 975.906 0 0 -108.264 0.01 -496.765 0 0 0 0 0 1484.65 0 0 -1928.69 1066.24 0 0 1843.55 0 0 0 0 0 
0 0 0 0 0 -1077.84 1691.26 0 0 0 0 0 2326.5 0 -1025.5 0 0 0 0 0 0 0 0 0 0 1127.74 0 0 1656.16 -1836.07 0 0 0 0 0 0 -223.319 0 0 1074.33 0 -264.824 0 487.915 0 0 796.915 1592.07 1046.71 0.08 621.586 654.546 -490.204 0 0 0 0 230.949 2060.38 0 0 0 0 0 0 0 0 0 
0 0 -1307.34 0 0 0 0 0 0 0 0 0 0 0 818.125 1566.59 -1096.91 0 1731.85 0 2054.89 0 0 -1423 -1009.17 0 1413.39 0 0 0 0 0 0 0 586.337 0 0 1568.58 0 2249.75 -138.325 1418.12 2209.92 0 -677.892 0 -525.147 0 0 -299.005 0.05 0 196.31 0 0 0 454.955 0 -1426.97 0 2479.71 0 0 0 2238.3 0 0 0 
0 0 0 0 -2100.51 0 1873.15 0 0 0 0 0 0 0 0 0 0 0 1923.2 -2015.21 0 0 644.169 0 0 0 -2202.75 0 0 0 831.248 0 1813.79 0 0 -1813.49 0 0 0 0 0 2431.94 0 0 0 -1608.55 0 0 0 -153.737 0 0.07 0 -828.043 0 1128.04 -2383.11 1703.77 -1848.58 0 1874.98 2186.88 1005.2 0 0 0 0 0 
-1281.7 0 0 0 0 0 0 0 1676.15 0 0 0 0 0 0 517.06 1019.24 0 -796.609 -523.927 0 0 0 -180.898 0 0 -277.795 0 0 0 0 0 0 0 0 0 0 0 -1234.86 0 0 0 0 1475.19 0 0 0 114.673 0 1796.09 2184.74 0 0.03 0 0 0 0 0 0 0 0 0 0 -773.873 0 0 1406.98 0 
-1373.87 0 -1202.35 -2293.24 0 0 792.947 -1439.18 0 998.794 -1862.47 0 0 2101.89 0 0 641.728 0 -615.177 0 0 0 0 908.765 0 0 0 0 -957.9 1011.15 -1055.1 0 0 0 -1883.37 2496.19 0 -1344.87 0 1723.91 2347.25 0 -1691.26 -1168.78 1738.72 0 0 0 0 0 0 -906.934 0 0.03 0 0 283.746 0 -1956.16 139.851 2083.73 -1181.14 2336.12 1577.88 2401.27 0 0 0 
0 0 0 0 2484.89 -874.126 1118.12 0 0 0 0 0 0 0 0 0 0 -263.146 0 -870.617 0 1430.94 650.883 1531.8 0 0 -775.399 0 423.978 0 0 0 -1608.4 -1732.31 0 -1446.81 0 0 0 0 0 0 0 -1389.43 182.73 0 0 0 0 0 0 0 0 0 0.08 0 0 0 938.978 0 0 -1172.6 0 1576.36 -383.541 0 -94.8363 0 
1786.17 0 0 0 0 -134.205 0 0 984.146 -1856.97 0 0 0 0 1714.45 0 -919.294 -1651.43 0 0 0 0 401.242 0 0 0 0 0 0 0 0 1428.8 0 0 0 -814.005 336.085 2414.24 -320.826 -154.958 0 0 2038.87 0 0 0 0 0 1446.81 0 0 1938.31 0 0 0 0.03 -120.93 -550.325 0 0 0 0 0 -1451.84 0 2370.45 0 0 
0 0 0 1067.46 0 -1590.7 697.882 0 0 0 0 496.46 -1003.52 0 0 0 0 1301.84 0 0 -338.679 -1477.94 0 -788.827 0 -1566.9 576.113 0 0 0 1049.15 0 0 0 0 0 2209.77 0 0 0 1584.44 -263.451 0 -2393.03 0 0 0 0 0 0 248.192 1973.86 0 1701.48 0 1841.56 0.05 0 0 0 0 0 0 0 0 -949.507 0 0 
0 0 0 0 0 -579.775 666.448 0 0 0 0 0 0 0 0 0 0 0 0 0 -559.481 164.571 1541.87 0 -369.961 0 1072.95 0 0 0 841.777 1000.63 0 -774.178 0 1868.57 0 0 0 321.284 0 0 179.067 0 151.906 2472.38 0 0 0 -1494.42 0 1019.55 0 0 0 -1183.28 0 0.03 344.325 0 -1578.19 0 0 0 0 0 -1416.29 0 
0 1607.64 0 0 828.196 0 -1287.19 0 0 -1622.29 0 0 0 0 0 0 704.749 0 2291.25 0 -211.417 2173.45 0 0 0 0 -1154.44 -542.238 0 0 0 1077.99 0 0 0 597.476 0 0 0 537.049 0 0 0 0 0 0 0 0 -1455.05 -1591.92 341.426 -1110.49 0 792.947 1517.61 0 0 1401.33 0.02 0 0 0 0 0 0 0 0 0 
0 2143.09 1490.75 0 -1783.27 -104.45 -2202.14 0 0 0 0 0 0 0 0 -2146.14 0 0 2293.85 2047.11 0 0 -2013.53 0 506.836 -1089.28 0 -1042.28 0 0 0 0 0 0 0 0 2160.33 0 0 0 0 0 2484.89 0 784.86 0 0 0 -2342.37 0 0 0 0 240.867 0 0 0 0 0 0.03 0 0 -2267.75 0 0 0 0 2051.53 
756.325 0 0 2227.93 0 0 0 -2213.58 0 0 0 0 0 1887.65 0 0 0 0 191.58 -1175.19 0 1245.54 0 0 0 0 101.093 0 0 0 0 2087.39 0 0 0 0 0 0 -2412.41 414.67 0 1623.81 0 0 0 356.38 645.695 0 0 0 -1146.5 1357.69 0 1098.9 0 0 0 -1908.86 0 0 0.06 0 0 522.553 0 0 0 0 
0 0 0 0 0 -1587.8 1382.87 0 0 0 0 0 0 -1979.51 0 0 0 0 -929.67 0 0 1624.88 1237.45 0 0 -2377.93 0 -387.661 0 0 0 0 0 1226.16 224.845 0 0 0 0 0 0 0 0 1762.83 1248.28 0 0 0 0 0 0 620.518 0 1003.98 377.59 0 0 0 0 0 0 0.08 0 0 -348.292 0 0 0 
0 501.343 645.39 0 0 995.438 0 0 0 -112.995 0 0 0 0 825.602 6.02741 0 0 1969.13 0 500.427 0 0 0 -573.977 0 0 0 0 0 0 0 -946.15 0 0 0 0 2371.82 0 -187.46 0 2126.3 0 0 0 0 -28.4585 1928.85 -556.581 0 0 1412.02 0 -96.3622 0 0 0 0 0 1272.55 0 0 0.05 0 -1049 0 0 0 
0 -1485.72 0 2121.27 0 0 0 2157.89 0 -926.313 0 0 2126.76 0 0 0 -1560.79 0 1744.97 0 359.584 1842.78 0 0 0 0 0 0 -1644.57 0 0 -1516.69 0 0 0 -680.486 0 0 0 945.845 -2416.84 2055.96 1239.28 2346.49 0 -1929.46 0 0 0 0 0 0 -1732.92 2477.42 433.287 1006.58 0 0 0 0 1995.83 0 0 0 -1522.34 0 -745.643 0 
0 0 0 0 0 0 0 0 0 0 -1245.08 0 0 0 0 0 0 0 0 0 0 0 2080.22 0 0 0 -242.698 0 0 0 0 0 -2470.09 0 809.58 0 0 -88.1222 1194.72 0 0 0 2391.81 0 0 -874.279 0 0 0 0 367.214 0 0 -738.472 -263.909 0 0 0 0 0 0 387.967 2094.56 782.723 0.05 0 0 0 
0 0 -685.064 -640.202 297.632 2230.52 0 0 0 0 864.818 0 0 0 505.005 -1151.54 -1976.61 0 0 746.254 0 0 0 0 0 0 2192.68 0 450.987 0 0 0 1311.61 0 0 0 -379.574 0 0 0 0 0 0 0 0 0 0 0 0 0 0 0 0 0 0 1523.71 2499.24 0 0 0 0 0 0 0 0 0.04 0 0 
0 0 0 0 -831.248 1194.11 0 0 2191.76 -495.849 0 0 0 0 0 0 -568.941 -158.62 0 823.161 0 0 0 0 0 1955.55 0 0 -497.07 0 0 0 1283.38 0 0 0 0 1943.34 0 0 -1873.45 566.347 0 0 0 0 0 0 0 0 0 0 -504.242 0 -1854.08 0 0 -589.999 0 0 0 0 0 847.118 0 0 0 0 
0 0 0 0 0 1997.05 0 0 0 0 0 0 0 0 0 0 0 0 0 0 0 0 0 0 0 0 0 0 0 0 0 0 0 0 -1370.97 0 0 0 -787.759 2123.71 0 -269.86 0 0 0 0 0 0 0 0 0 0 0 0 0 0 0 0 0 -17.4718 0 0 0 0 0 0 0 0.08 
