*Vertices 37
*Matrix 
0.08 0 0 49.2111 -72.2526 0 0 0 0 0 0 -1834.09 0 0 0 0 0 0 329.981 0 573.061 1307.79 0 0 0 0 0 0 0 0 0 0 0 0 0 0 0 
0 0 -2323.45 0 0 0 0 0 0 0 0 1707.13 0 0 0 0 0 0 0 0 0 0 0 0 0 0 2401.43 0 -1095.84 2390.13 0 0 0 0 0 0 0 
0 107.654 0.02 1889.78 0 245.903 0 0 0 0 0 0 0 0 0 0 0 0 0 0 0 0 0 0 -1393.09 0 0 395.749 0 0 0 2431.49 0 0 0 0 0 
2113.03 0 -1170.92 0.06 0 0 0 1690.5 1207.69 0 0 -1036.79 0 0 0 -2467.19 0 0 0 0 0 0 0 0 0 0 0 0 0 0 0 0 0 0 0 0 0 
1805.09 0 0 0 0.07 0 0 2341 0 0 0 0 0 0 0 0 0 0 0 1233.79 0 1229.97 0 0 0 0 0 0 0 0 0 1841.41 0 0 -1075.4 0 0 
0 0 1273.16 0 0 0 0 0 0 0 0 0 0 0 0 0 0 1559.88 0 -84.1548 0 0 0 0 0 0 651.341 0 0 0 0 0 -840.251 2300.71 0 0 0 
0 0 0 0 0 0 0.01 0 0 0 0 0 0 2336.88 0 0 0 0 0 0 0 0 879.315 0 0 0 -1141.77 0 -134.51 0 0 0 0 0 2216.79 0 0 
0 0 0 -414.212 2138.51 0 0 0.01 381.405 -2196.19 0 0 0 0 0 0 0 0 0 0 0 0 0 0 2290.64 0 0 0 0 0 0 0 0 0 0 0 0 
0 0 0 -754.189 0 0 0 709.326 0.06 0 0 -1840.34 0 0 0 0 0 -911.054 0 1849.04 0 0 0 0 1877.73 0 0 0 0 1507.08 0 0 0 2487.18 0 0 0 
0 0 0 0 0 0 0 -66.9118 0 0.03 0 0 0 0 0 0 0 0 0 1153.98 0 723.518 0 0 0 0 0 0 0 1345.48 0 0 0 0 0 0 0 
0 0 0 0 0 0 0 0 0 0 0 0 0 0 0 0 1433.53 0 0 0 0 -783.944 0 0 0 0 0 0 0 0 0 0 0 0 0 0 0 
1258.81 -2406.92 0 2415.31 0 0 0 0 -359.279 0 0 0 0 0 0 0 0 0 0 0 0 2248.99 0 0 0 0 0 0 0 0 0 0 0 0 0 0 0 
0 0 0 0 0 0 0 0 0 0 0 0 0.05 -935.621 0 0 0 1252.86 0 0 0 0 1291.01 0 0 0 0 0 0 0 0 0 1418.27 0 0 0 0 
0 0 0 0 0 0 1314.97 0 0 0 0 0 2301.78 0.02 0 0 0 0 0 0 1839.58 0 0 0 0 0 0 0 0 0 0 0 625.553 1382.56 1702.7 0 0 
0 0 0 0 0 0 0 0 0 0 0 0 0 0 0.08 0 0 0 0 0 0 0 0 0 0 0 2346.64 0 0 0 -965.987 0 0 0 0 0 0 
0 0 0 1380.28 0 0 0 0 0 0 0 0 0 0 0 0 0 0 0 0 0 0 0 0 0 1159.63 0 0 92.7 -2086.47 1132.47 0 0 0 2370.3 0 0 
0 0 0 0 0 0 0 0 0 0 -1411.25 0 0 0 0 0 0.09 0 0 0 223.167 0 0 0 0 0 816.752 0 0 968.734 -307.245 0 0 0 0 0 0 
0 0 0 0 0 -487.304 0 0 1300.32 0 0 0 -1165.12 0 0 0 0 0.03 0 0 0 0 0 0 1968.83 0 0 0 0 0 0 0 0 0 0 0 0 
-1825.08 0 0 0 0 0 0 0 0 0 0 0 0 0 0 0 0 0 0.06 0 0 0 0 0 0 0 0 0 0 1740.7 0 249.26 0 0 0 0 0 
0 0 0 0 -183.187 -499.054 0 0 1504.49 1548.28 0 0 0 0 0 0 0 0 0 0.06 0 0 0 0 0 0 0 0 0 0 0 0 0 0 0 0 0 
309.839 0 0 0 0 0 0 0 0 0 0 0 0 -2115.16 0 0 2192.83 0 0 0 0.08 0 0 0 0 1669.74 0 0 0 0 0 0 0 0 0 0 0 
-644.169 0 0 0 603.732 0 0 0 0 1766.64 -1950.21 1809.67 0 0 0 0 0 0 0 0 0 0.09 0 0 990.555 0 0 -1820.2 0 0 0 0 0 0 0 0 0 
0 0 0 0 0 0 1779.92 0 0 0 0 0 -1625.64 0 0 0 0 0 0 0 0 0 0.06 0 0 0 714.667 0 0 0 0 0 0 0 0 0 0 
0 0 0 0 0 0 0 0 0 0 0 0 0 0 0 0 0 0 0 0 0 0 0 0.02 1568.12 0 0 0 2247.61 0 0 0 0 0 0 -298.853 0 
0 0 189.444 0 0 0 0 -1096.45 2497.56 0 0 0 0 0 0 0 0 1068.53 0 0 0 813.7 0 50.2792 0.04 0 0 0 0 0 0 0 0 0 0 0 -782.723 
0 0 0 0 0 0 0 0 0 0 0 0 0 0 0 1436.43 0 0 0 0 1695.07 0 0 0 0 0.01 1340.91 0 0 0 -269.555 0 0 0 0 0 0 
0 -1210.14 0 0 0 471.435 2298.27 0 0 0 0 0 0 0 620.823 0 1984.54 0 0 0 0 0 1233.63 0 0 2227.93 0.03 0 0 0 -598.086 0 0 0 0 0 0 
0 0 2159.26 0 0 0 0 0 0 0 0 0 0 0 0 0 0 0 0 0 0 -2018.88 0 0 0 0 0 0.07 0 0 0 0 621.891 1778.39 0 0 0 
0 2145.22 0 0 0 0 1511.51 0 0 0 0 0 0 0 0 1202.96 0 0 0 0 0 0 0 2491 0 0 0 0 0.03 0 1517.46 0 1741.16 2068.47 0 0 0 
0 1550.87 0 0 0 0 0 0 1992.93 -2173.6 0 0 0 0 0 1397.98 1035.26 0 1916.64 0 0 0 0 0 0 0 0 0 0 0.07 0 0 0 -1602.45 0 0 0 
0 0 0 0 0 0 0 0 0 0 0 0 0 0 1231.04 877.483 1863.54 0 0 0 0 0 0 0 0 470.672 -1332.82 0 740.455 0 0.04 0 186.697 0 0 0 0 
0 0 2320.25 0 315.943 0 0 0 0 0 0 0 0 0 0 0 0 0 626.469 0 0 0 0 0 0 0 0 0 0 0 0 0.01 0 0 0 0 0 
0 0 0 0 0 2136.68 0 0 0 0 0 0 1209.98 1470.31 0 0 0 0 0 0 0 0 0 0 0 0 0 16.8615 -494.018 0 -789.438 0 0.03 756.783 0 0 0 
0 0 0 0 0 -235.527 0 0 1922.44 0 0 0 0 -45.7015 0 0 0 0 0 0 0 0 0 0 0 0 0 -2212.21 -954.695 1918.47 0 0 1855.3 0.02 0 0 0 
0 0 0 0 549.562 0 850.322 0 0 0 0 0 0 1997.82 0 -1157.49 0 0 0 0 0 0 0 0 0 0 0 0 0 0 0 0 0 0 0.01 0 0 
0 0 0 0 0 0 0 0 0 0 0 0 0 0 0 0 0 0 0 0 0 0 0 2173.91 0 0 0 0 0 0 0 0 0 0 0 0.04 0 
0 0 0 0 0 0 0 0 0 0 0 0 0 0 0 0 0 0 0 0 0 0 0 0 70.1163 0 0 0 0 0 0 0 0 0 0 0 0.06 
