*Vertices 45
*Matrix 
0.03 0 0 0 0 0 0 2435.91 0 0 638.676 0 0 0 0 -1768.78 0 0 580.538 0 0 0 0 0 0 -1359.07 0 0 0 0 0 0 0 0 0 0 0 0 0 0 0 0 0 0 0 
0 0 0 0 0 0 0 0 0 0 0 0 0 0 0 0 0 0 0 0 2124.93 0 0 0 0 0 0 0 0 0 0 0 0 0 0 2417.6 0 0 0 0 0 0 0 0 0 
0 0 0.06 0 0 0 0 1626.56 0 497.223 0 0 0 -1080.13 0 0 0 1548.89 0 0 0 0 0 0 0 0 0 0 0 0 0 0 0 0 0 0 0 0 0 0 0 0 0 0 0 
0 0 0 0.02 1667.3 0 0 0 0 0 0 0 0 0 0 0 0 0 0 0 0 0 0 0 0 0 0 0 0 2.51778 0 1264.76 0 1275.9 -2428.13 0 0 967.818 0 0 0 0 0 0 0 
0 0 0 -2425.84 0.04 0 0 0 0 0 2265.62 0 910.138 0 0 0 0 0 0 0 0 468.078 0 0 0 0 0 0 0 0 0 0 1547.67 2175.59 0 0 0 0 0 0 6.33259 0 0 1984.69 0 
0 0 0 0 0 0.09 0 0 638.676 0 0 0 0 0 541.475 0 824.839 0 0 0 0 0 0 0 0 0 0 0 0 0 0 0 1210.29 1797.01 0 0 0 0 2427.06 0 1302.45 0 0 0 0 
0 0 0 0 0 0 0.07 0 -1462.37 0 0 0 0 0 0 0 0 0 0 0 0 0 0 0 0 0 0 0 0 0 2066.79 0 0 340.205 0 0 2329.86 0 0 43.26 0 0 0 0 0 
-1144.37 0 1816.08 0 0 0 0 0.04 773.11 0 2090.14 0 0 0 0 2215.26 0 0 0 0 0 0 0 0 0 0 0 0 0 0 0 0 0 1246.3 0 0 0 0 0 0 0 0 0 906.629 0 
0 0 0 0 0 2168.42 -1710.03 1992.17 0.06 0 0 0 0 0 0 657.445 0 0 0 0 -2028.34 0 0 0 0 0 0 0 0 -1650.21 0 0 0 0 0 1072.65 0 0 0 0 1662.11 0 0 0 0 
0 0 2020.86 0 0 0 0 0 0 0.01 0 0 815.836 0 0 0 0 0 0 1265.83 0 0 0 0 0 0 0 0 698.798 0 0 0 0 0 0 1130.94 0 0 0 1188.31 0 0 0 0 0 
753.578 0 0 0 2397.92 0 0 531.251 0 0 0.09 0 0 2039.93 0 0 0 0 0 0 0 0 0 0 0 0 0 0 0 0 0 0 0 0 651.494 0 0 0 -1304.28 0 0 0 0 2167.65 0 
0 0 0 0 0 0 0 0 0 0 0 0 0 0 0 0 0 0 0 0 685.522 -1245.69 0 0 -1377.38 0 0 0 0 0 0 0 0 0 0 0 0 2075.33 0 0 0 1542.33 0 0 0 
0 0 0 0 2121.27 0 0 0 0 729.774 0 0 0.07 -37.7667 0 0 0 1589.18 0 0 0 0 0 0 0 720.313 0 0 0 0 0 0 0 0 0 0 0 0 0 0 0 0 0 0 0 
0 0 -665.532 0 0 0 0 0 0 0 2482.45 0 40.8185 0.08 0 -160.909 0 0 0 0 -2218.31 0 0 0 0 0 0 0 0 2226.55 754.494 0 0 0 0 0 0 0 0 0 0 0 0 0 0 
0 0 0 0 0 280.999 0 0 0 0 0 0 0 0 0.05 0 0 2233.27 0 0 0 -908.002 0 0 974.227 0 0 0 0 0 0 0 0 0 0 0 0 917.31 0 0 0 0 0 0 0 
2388 0 0 0 0 0 0 1085.16 -383.389 0 0 0 0 2197.1 0 0.06 0 0 0 0 -179.983 0 0 0 0 0 0 0 0 0 0 0 0 -301.904 -370.266 0 0 0 0 0 0 0 0 0 0 
0 0 0 0 0 1661.05 0 0 0 0 0 0 0 0 0 0 0.09 0 0 0 0 0 0 0 0 1509.98 0 0 0 0 0 1094.47 0 0 0 0 0 0 0 722.755 -449.309 0 0 0 0 
0 0 589.389 0 0 0 0 0 0 0 0 0 1851.02 0 2414.09 0 0 0.07 0 -763.039 0 0 -820.261 0 0 0 0 0 0 0 1517.15 0 0 0 0 -587.405 0 0 2463.07 0 0 0 0 0 0 
45.5489 0 0 0 0 0 0 0 0 0 0 0 0 0 0 0 0 0 0.08 0 0 -1310.85 0 0 2252.49 0 0 0 0 0 0 -1207.54 -2456.97 0 0 0 0 0 0 0 0 0 0 2313.38 0 
0 0 0 0 0 0 0 0 0 590.152 0 0 0 0 0 0 0 814.92 0 0.03 0 0 0 -1124.99 0 0 0 0 0 0 0 0 0 0 0 1484.8 0 0 0 0 0 0 309.076 267.724 0 
0 1240.2 0 0 0 0 0 0 2279.05 0 0 1241.42 0 -1698.43 0 -1028.09 0 0 0 0 0.07 0 0 0 708.563 0 0 -1851.63 0 0 0 0 0 0 0 0 0 0 0 -1746.5 2106.16 2472.99 0 0 0 
0 0 0 0 -331.202 0 0 0 0 0 0 324.488 0 0 1947.46 0 0 0 -104.907 0 0 0 0 0 0 0 0 0 0 0 0 0 0 0 0 0 0 0 0 0 0 0 2186.12 0 0 
0 0 0 0 0 0 0 0 0 0 0 0 0 0 0 0 0 2481.54 0 0 0 0 0.05 0 0 2481.38 0 0 0 0 0 0 0 0 1027.48 0 0 0 0 0 0 -31.0526 0 0 987.35 
0 0 0 0 0 0 0 0 0 0 0 0 0 0 0 0 0 0 0 1594.36 0 0 0 0.03 0 0 0 2393.95 -628.452 0 0 0 0 0 0 375.759 0 -1832.71 514.924 0 0 0 0 0 0 
0 0 0 0 0 0 0 0 0 0 0 603.427 0 0 229.728 0 0 0 1049 0 1770.15 0 0 0 0.06 0 0 0 0 0 0 0 0 0 0 0 0 771.279 0 0 -2274.93 0 0 0 0 
2266.23 0 0 0 0 0 0 0 0 0 0 0 -1376.77 0 0 0 -1223.72 0 0 0 0 0 2246.09 0 0 0.03 0 0 0 0 0 0 0 330.287 0 0 0 2182.61 0 0 -415.738 0 0 0 0 
0 0 0 0 0 0 0 0 0 0 0 0 0 0 0 0 0 0 0 0 0 0 0 0 0 0 0.02 1901.38 0 2346.03 0 0 1596.19 0 0 0 0 0 0 0 0 1009.17 0 0 0 
0 0 0 0 0 0 0 0 0 0 0 0 0 0 0 0 0 0 0 0 2179.86 0 0 -858.409 0 0 -1282.46 0 0 0 0 0 323.115 896.405 0 0 520.417 0 -50.5844 0 0 0 0 2223.2 0 
0 0 0 0 0 0 0 0 0 1708.2 0 0 0 0 0 0 0 0 0 0 0 0 0 -305.567 0 0 0 0 0.06 0 0 0 0 0 0 0 0 0 0 0 1829.36 -412.687 0 1072.65 0 
0 0 0 1366.7 0 0 0 0 -1295.59 0 0 0 0 2271.26 0 0 0 0 0 0 0 0 0 0 0 0 2165.06 0 0 0.05 0 0 0 0 0 0 0 0 0 0 0 425.504 0 0 0 
0 0 0 0 0 0 2434.69 0 0 0 0 0 0 339.595 0 0 0 2478.33 0 0 0 0 0 0 0 0 0 0 0 0 0.04 0 0 0 0 544.984 0 0 0 0 0 1197.01 0 0 0 
0 0 0 1691.56 0 0 0 0 0 0 0 0 0 0 0 0 1290.55 0 458.007 0 0 0 0 0 0 0 0 0 0 0 0 0.05 0 0 0 0 413.449 0 0 2220.45 0 -194.937 0 0 0 
0 0 0 0 2449.49 -239.341 0 0 0 0 0 0 0 0 0 0 0 0 1046.25 0 0 0 0 0 0 0 660.497 2233.12 0 0 0 0 0.07 0 0 0 0 0 0 1530.58 0 0 0 0 0 
0 0 0 1495.94 -1126.06 -77.5933 2057.33 858.867 0 0 0 0 0 0 0 1546.3 0 0 0 0 0 0 0 0 0 -1555.76 0 1187.55 0 0 0 0 0 0.08 0 0 0 0 -13.9622 0 0 0 -168.233 0 0 
0 0 0 -1615.27 0 0 0 0 0 0 172.658 0 0 0 0 1275.29 0 0 0 0 0 0 611.82 0 0 0 0 0 0 0 0 0 0 0 0.03 0 0 0 2323.45 1719.34 0 525.91 0 0 0 
0 654.088 0 0 0 0 0 0 2216.64 36.5459 0 0 0 0 0 0 0 2352.6 0 -929.975 0 0 0 -1848.89 0 0 0 0 0 0 -377.438 0 0 0 0 0 0 0 0 0 0 0 0 0 0 
0 0 0 0 0 0 -596.408 0 0 0 0 0 0 0 0 0 0 0 0 0 0 0 0 0 0 0 0 1378.9 0 0 0 -776.162 0 0 0 0 0.03 0 0 0 0 0 0 0 0 
0 0 0 -990.707 0 0 0 0 0 0 0 2434.54 0 0 935.011 0 0 0 0 0 0 0 0 1377.07 -1405.76 1826.61 0 0 0 0 0 0 0 0 0 0 0 0.02 0 0 0 0 0 0 0 
0 0 0 0 0 -1468.47 0 0 0 0 -209.281 0 0 0 0 0 0 2141.25 0 0 0 0 0 1395.23 0 0 0 1914.96 0 0 0 0 0 -2393.49 1124.68 0 0 0 0.07 739.082 0 0 648.747 0 0 
0 0 0 0 0 0 1727.88 0 0 -366.756 0 0 0 0 0 0 2429.5 0 0 0 -1562.93 0 0 0 0 0 0 0 0 0 0 1501.28 12.1311 0 1653.42 0 0 0 2.51778 0.02 0 0 0 0 696.509 
0 0 0 0 1107.75 -112.995 0 0 -842.082 0 0 0 0 0 0 0 -129.627 0 0 0 1665.62 0 0 0 492.34 -369.808 0 0 1617.4 0 0 0 0 0 0 0 0 0 0 0 0.08 0 0 0 0 
0 0 0 0 0 0 0 0 0 0 0 1867.66 0 0 0 0 0 0 0 0 627.995 0 1085.47 0 0 0 279.778 0 1534.24 1404.23 1078.14 962.477 0 0 109.333 0 0 0 0 0 0 0.05 0 0 0 
0 0 0 0 0 0 0 0 0 0 0 0 0 0 0 0 0 0 0 1208.76 0 1592.38 0 0 0 0 0 0 0 0 0 0 0 -857.646 0 0 0 0 2128.59 0 0 0 0.01 0 0 
0 0 0 0 -1977.83 0 0 1778.08 0 0 -634.556 0 0 0 0 0 0 0 1726.97 1384.85 0 0 0 0 0 0 0 304.804 2039.48 0 0 0 0 0 0 0 0 0 0 0 0 0 0 0.02 0 
0 0 0 0 0 0 0 0 0 0 0 0 0 0 0 0 0 0 0 0 0 0 349.513 0 0 0 0 0 0 0 0 0 0 0 0 0 0 0 0 1431.85 0 0 0 0 0 
