*Vertices 64
*Matrix 
0.05 0 0 0 0 0 0 0 0 0 0 -2146.6 0 -2438.66 0 1657.23 0 0 0 0 0 0 583.743 0 0 344.783 0 0 0 0 0 0 0 0 0 596.866 0 0 1985.76 0 0 0 0 0 0 0 0 525.605 0 0 0 0 0 0 2308.95 0 0 0 0 0 0 0 0 0 
0 0.06 0 0 -50.1267 1700.26 0 -2019.49 0 0 0 2384.03 0 0 0 0 2460.17 -2132.86 0 2056.87 0 0 -465.941 -1471.53 0 -1157.64 0 1226.16 0 0 0 -1617.56 0 0 0 0 0 0 0 0 0 0 0 977.737 2192.98 0 0 138.783 912.885 285.73 0 0 0 501.038 0 0 0 0 0 0 -2210.53 0 -2433.32 0 
0 0 0.08 0 0 2394.56 0 557.649 0 0 1364.25 0 0 0 0 232.933 0 -1138.42 0 0 0 817.515 -666.448 0 0 0 0 0 0 0 0 -508.209 0 467.925 0 0 1900.77 0 1970.5 0 0 0 1811.96 0 0 0 0 1683.94 1035.26 338.832 0 2212.97 0 1536.38 0 0 0 0 0 0 0 0 2144.92 0 
0 0 0 0 757.241 0 2475.43 0 0 0 0 -935.316 0 0 91.0215 2438.05 0 0 0 0 0 0 1111.26 0 1012.99 0 0 0 0 0 -433.134 0 -1537.45 0 918.378 0 0 0 0 0 -1237.6 1947.46 0 457.396 0 -174.795 0 0 0 0 0 78.2037 0 0 0 0 -1789.99 2063.43 0 0 0 0 0 0 
0 2046.04 0 205.161 0.07 0 0 -2328.03 -145.802 0 -990.097 0 0 1419.34 862.835 0 0 0 0 0 0 0 -595.035 1540.96 0 0 0 1282.46 0 0 0 0 0 0 848.643 0 2032.3 0 0 0 903.729 0 0 0 1255.3 -1575.59 0 222.709 0 0 968.886 0 0 0 0 0 0 0 0 0 0 0 0 0 
0 2183.68 1872.39 0 0 0.05 0 0 -2120.66 0 0 1777.47 0 0 0 0 0 0 0 0 -374.386 1417.36 0 0 19.4555 1160.85 1087.91 0 0 -1914.96 331.507 0 0 2272.94 0 0 0 0 1227.99 0 0 -651.341 2465.67 1541.87 -2190.39 0 0 0 0 570.925 -710.089 1877.27 -2482.76 0 0 0 0 0 0 0 -2131.49 0 0 0 
0 0 0 284.967 0 0 0 0 0 0 2010.94 -1069.75 436.186 2113.94 0 0 0 0 0 -1290.86 0 371.181 0 340.51 0 1493.5 1355.4 0 0 0 0 0 0 0 0 1298.49 0 -2133.17 -439.39 0 1415.68 0 2122.33 0 1988.81 0 -1608.1 0 0 0 0 1699.96 468.383 0 0 0 -2116.38 -372.555 0 0 0 0 0 0 
0 2033.68 -55.9252 0 1825.39 0 0 0.04 -24.9489 0 0 0 2379.76 0 2081.13 0 -296.564 928.755 0 0 0 -1947.92 0 0 -2245.17 0 0 0 0 0 1908.86 0 0 0 174.49 0 0 0 0 0 -1473.05 0 0 -1337.86 0 -1394.01 -1599.55 0 0 0 0 59.2822 0 0 2479.86 0 0 0 0 0 0 0 0 0 
0 0 0 0 889.996 9.23185 0 708.563 0.07 0 0 1858.81 1550.57 0 0 0 0 0 0 0 0 0 0 0 0 0 0 -748.085 490.509 0 518.281 0 0 0 0 0 0 0 1625.03 0 0 0 0 891.522 0 0 0 0 0 0 -513.855 0 0 0 0 0 0 0 0 0 -790.963 0 0 0 
0 0 0 0 0 0 0 0 0 0.09 1935.71 0 0 0 0 0 0 0 0 0 0 0 1252.86 0 0 2164.14 0 0 0 0 0 -991.775 1997.36 165.181 0 0 0 0 0 0 -855.51 -1826.76 0 0 -789.285 0 0 0 -820.261 0 0 0 0 0 -370.418 1945.02 0 0 0 0 0 0 0 588.931 
0 0 1976.3 0 -2062.52 0 31.663 0 0 1806.92 0.01 0 0 1207.54 -45.8541 0 0 0 0 0 318.995 0 0 2260.12 0 0 -1783.73 0 0 -2286.68 2474.82 0 -1123.77 0 0 0 0 1512.88 0 0 0 0 0 0 0 0 -2277.52 -300.073 0 0 1637.39 0 0 653.783 0 0 0 0 0 0 0 0 0 0 
142.903 586.947 0 -350.429 0 1312.52 -2220.3 0 -1587.8 0 0 0.04 0 -1112.17 -1283.53 0 0 0 2257.84 1036.18 -1535.77 0 157.247 0 0 0 0 0 1514.4 -1312.83 0 0 0 288.934 0 0 0 1326.56 2003.92 1753.97 -453.124 0 0 1116.75 -1106.22 0 0 0 -470.214 0 0 0 0 0 0 0 956.984 0 0 0 0 0 0 0 
0 0 0 0 0 0 -197.073 803.781 1825.24 0 0 0 0 1126.51 0 0 0 0 0 1428.8 -1503.88 0 1604.43 0 -1903.36 0 2390.9 0 0 -2358.55 0 0 0 0 -873.058 0 1439.02 2442.93 0 -752.205 0 0 0 0 0 0 0 0 0 1119.5 0 0 0 0 0 0 0 0 0 0 0 0 0 0 
-1842.33 0 0 0 1694.92 0 1873.15 0 0 0 -218.741 1624.27 -1787.7 0.09 0 0 0 0 0 0 0 -552.919 -1034.35 0 1447.72 0 0 0 0 0 0 0 0 -1938.76 0 0 0 0 0 0 2276.3 0 1119.34 -2015.21 992.233 0 0 0 0 0 453.734 0 2274.62 0 0 -1414.46 0 0 0 0 0 0 0 0 
0 0 0 -1848.43 -427.03 0 0 1552.4 0 0 -2044.82 2357.17 0 0 0 0 0 0 -220.573 0 0 0 0 0 0 0 0 1835.61 1288.11 0 0 0 0 1893.44 0 0 1273.77 0 0 0 0 0 0 0 0 0 0 0 0 0 0 2111.19 0 0 -1694.77 0 -184.408 0 0 0 0 0 0 0 
-213.248 0 967.818 2459.72 0 0 0 0 0 0 0 0 0 0 0 0.07 0 -616.55 0 0 -2164.91 0 220.267 0 0 0 0 1107.9 0 0 1125.45 739.998 -2243.64 -298.242 0 -2017.96 0 0 0 0 2466.12 1302.45 0 1153.98 0 0 0 0 1281.4 0 0 0 587.558 0 0 1899.7 0 0 0 0 0 0 0 0 
0 1767.1 0 0 0 0 0 -1432.62 0 0 0 0 0 0 0 0 0.07 0 0 0 0 0 0 -810.038 0 0 0 0 0 0 0 0 0 2251.58 -284.661 0 2321.92 0 0 0 1923.96 1286.13 0 0 0 0 -1865.21 2323.91 0 378.506 0 0 0 0 0 0 0 0 -1122.7 0 0 0 0 0 
0 129.017 -828.349 0 0 0 0 88.8852 0 0 0 0 0 0 0 2261.65 0 0.04 0 0 0 -585.421 0 0 0 -30.137 0 0 0 0 0 0 909.833 0 0 1218.07 0 426.267 0 0 0 0 0 0 0 0 1323.36 0 1812.88 0 0 0 2282.56 0 -1047.17 736.03 0 0 0 1115.68 0 589.236 0 0 
0 0 0 0 0 0 0 0 0 0 0 2367.09 0 0 1944.56 0 0 0 0.08 0 0 0 0 0 0 -1867.5 0 1530.88 0 0 0 0 0 981.857 -91.4792 1900.46 0 0 0 0 -69.0481 0 0 0 376.827 84.46 1891 -2368.92 0 0 0 0 0 1166.49 0 -1878.8 -1025.35 0 0 0 0 0 0 0 
0 113.147 0 0 0 0 658.361 0 0 0 0 97.8881 823.618 0 0 0 0 0 0 0.09 0 0 0 0 0 0 0 0 0 0 0 -872.295 0 356.838 1320.31 1972.79 0 125.813 0 0 294.733 0 0 -1134.6 0 0 0 2177.88 0 0 0 0 931.501 0 -1092.94 0 0 0 -1544.16 0 0 0 0 0 
0 0 0 0 0 -1723.91 0 0 0 0 1083.18 -558.565 1540.19 0 0 1181.6 0 0 0 0 0.08 1960.43 0 0 0 0 0 1711.25 0 0 1803.11 0 0 0 0 0 -696.203 0 0 0 2223.35 2292.78 -1818.22 0 0 0 0 0 0 -898.236 0 0 0 0 0 0 0 0 0 0 0 0 0 0 
0 0 1894.97 0 0 796.762 2079.76 -1102.25 0 0 0 0 0 -1540.5 0 0 0 546.052 0 0 897.626 0.04 1679.36 0 0 -1395.99 0 0 0 0 0 0 0 0 0 0 0 1195.03 0 0 0 0 0 2446.75 0 447.325 0 636.235 0 -283.135 0 0 1263.85 286.492 0 -841.014 0 0 0 0 0 0 -356.075 0 
1514.71 1228.6 -1294.21 -1584.6 -977.432 0 0 0 0 1555.91 0 1172.44 704.749 2225.18 0 -194.327 0 0 0 0 0 -500.122 0.01 0 0 1056.47 0 1674.32 0 0 0 0 0 0 0 0 0 0 2177.57 2016.74 644.322 0 1228.6 0 0 0 0 0 0 -1780.53 1414 0 -1007.95 0 1875.59 0 0 0 0 -1729.71 0 -1635.56 0 0 
0 -1876.2 0 0 1845.68 0 2468.41 0 0 0 682.165 0 0 0 0 0 2075.49 0 0 0 0 0 0 0.01 -2073.66 0 0 -1528.75 0 0 0 0 0 0 0 0 0 0 1529.36 1599.25 0 0 0 0 1909.01 0 0 2358.55 0 0 0 0 0 2233.73 -1757.48 0 1908.86 0 0 -1351.13 0 0 0 0 
0 0 0 1757.79 0 1460.39 0 -987.045 0 0 0 0 2271.11 -613.804 0 0 0 0 0 0 0 0 0 266.503 0.07 2409.21 0 0 0 0 429.777 0 0 0 0 1292.69 0 0 0 0 -1991.1 0 0 0 0 0 0 0 0 -238.426 0 0 2355.65 0 0 -2177.88 0 0 0 0 0 -1594.21 0 0 
801.187 2391.96 0 0 0 94.5311 -1930.22 0 0 1345.03 0 0 0 0 0 0 0 1108.51 1299.25 0 0 -1086.54 -559.633 0 1872.69 0 0 -185.934 0 0 0 123.371 0 -1305.81 0 0 0 0 0 0 0 0 562.227 0 -775.246 0 2136.22 0 0 0 0 0 1108.81 506.989 0 -36.8511 -1869.95 0 0 0 0 0 0 0 
0 0 0 0 0 377.59 2431.49 0 0 0 1837.6 0 1073.41 0 0 0 0 0 0 0 0 0 0 0 0 0 0.08 0 0 0 0 0 0 0 0 -1617.56 0 482.116 -381.863 0 0 0 0 0 0 0 0 0 0 0 0 2069.99 0 0 0 2449.19 0 0 0 0 0 0 0 0 
0 1174.12 0 0 -2127.83 0 0 0 -386.593 0 0 0 0 0 2336.88 1183.74 0 0 1707.59 0 -957.595 0 -1341.52 1539.43 0 -2390.44 0 0.03 0 0 0 1893.9 5.41704 -971.328 0 656.987 456.328 672.246 -931.806 1235.47 0 0 0 983.688 0 0 0 0 19.9133 526.826 0 0 0 0 -762.886 0 -97.2777 1276.97 0 0 0 0 0 0 
0 0 0 0 0 0 0 0 1273.31 0 0 1066.7 0 0 -1079.52 0 0 0 0 0 0 0 0 0 0 0 0 0 0.07 0 2254.63 -162.13 -1058.46 0 1376.31 0 0 0 0 0 0 0 0 0 0 0 0 0 1724.37 0 0 0 0 0 -1574.53 0 0 0 0 0 0 0 0 0 
0 0 0 0 0 95.294 0 0 0 0 1011 1634.95 453.276 0 0 0 0 0 0 0 0 0 0 0 0 0 0 0 0 0.09 -534.303 0 1291.77 0 0 0 0 0 0 0 -1230.58 0 1478.09 0 0 0 -213.858 -2234.79 0 0 0 0 0 0 0 0 0 0 0 0 0 0 0 0 
0 0 0 652.562 0 2324.06 0 915.632 -117.725 0 -777.078 0 0 0 0 2109.67 0 0 0 0 -1569.19 0 0 0 1555.15 0 0 0 284.814 -17.4718 0.09 0 0 -1638.46 -396.817 1680.43 0 -884.35 1134.6 0 0 0 0 0 2491 0 1087.45 0 0 0 0 0 0 0 0 742.286 0 0 -2158.8 0 0 0 0 0 
0 447.172 -1317.26 0 0 0 0 0 0 -546.358 0 0 0 0 0 1695.68 0 0 0 438.932 0 0 0 0 0 2114.55 0 2129.51 886.792 0 0 0.04 0 0 0 0 0 0 -1846.29 0 0 0 0 0 0 0 0 1720.71 563.295 0 0 0 2043.29 0 0 0 0 0 0 0 0 0 0 0 
0 0 0 1236.53 0 0 0 0 0 2015.06 542.238 0 0 0 0 1619.39 0 2442.78 0 0 0 0 0 0 0 0 0 -1675.08 25.8644 1878.03 0 0 0.03 0 -1258.51 0 913.8 0 0 -23.2704 -442.289 0 0 0 0 0 0 -92.5474 354.549 0 0 0 0 0 0 0 0 15.9459 848.033 0 0 0 0 0 
0 0 1061.51 0 0 -1602.6 0 0 0 -757.851 0 303.278 0 -1249.5 1663.03 1944.87 -2370.45 0 595.34 25.7118 0 0 0 0 0 -2349.7 0 -951.338 0 0 -1153.68 0 0 0.02 2494.35 0 0 1545.23 0 0 0 0 0 0 -669.652 0 0 0 0 0 0 1298.18 0 1207.69 0 0 0 0 1143.45 1507.69 0 0 0 0 
0 0 0 1233.33 -767.769 0 0 1633.58 0 0 0 0 -694.678 0 0 0 -387.814 0 1974.01 -1364.86 0 0 0 0 0 0 0 0 85.0703 0 -804.086 0 862.529 738.014 0.03 0 -459.38 0 0 0 473.113 587.405 2398.22 0 0 1421.02 -2034.44 0 638.218 0 0 0 0 0 -2245.93 0 0 0 -342.799 1975.23 -1863.99 0 -1899.7 0 
2172.38 0 0 0 0 0 361.568 0 0 0 0 0 0 0 0 682.775 0 330.897 2241.51 1177.18 0 0 0 0 -1679.51 0 -1477.63 -1313.59 0 0 -483.489 0 0 0 0 0.02 0 0 0 0 0 0 0 0 0 0 0 0 0 2318.72 0 -2061.14 0 0 0 0 0 0 0 0 0 0 0 0 
0 0 -462.127 0 -860.088 0 0 0 0 0 0 0 306.94 0 886.334 0 1754.89 0 0 0 1993.7 0 0 0 0 0 0 1347.47 0 0 0 0 -1974.93 0 787.301 0 0 0 2102.95 0 874.432 0 0 0 0 0 0 0 0 -904.34 272.301 0 -1062.58 0 0 -1570.71 0 0 0 0 0 0 -1470.46 -585.269 
0 0 0 0 0 0 -1712.47 0 0 0 -2210.38 -1112.63 1535.16 0 0 0 0 -1208.3 0 -243.004 0 -1160.85 0 0 0 0 590.762 1055.56 0 0 -2474.06 0 0 -839.641 0 0 0 0.02 2241.05 -1610.08 1110.64 1247.98 -877.026 0 0 1776.41 0 0 1601.54 1320.61 0 378.811 0 0 1111.1 0 0 0 0 0 0 0 0 0 
2143.54 0 1982.71 0 0 2249.9 1223.11 0 -1930.98 0 0 -193.411 0 0 0 0 0 0 0 0 0 0 -2309.26 1393.7 0 0 2383.11 535.829 0 0 -2034.59 -1179.77 0 0 0 0 1745.89 2311.4 0.03 -1681.8 0 0 2460.02 0 0 0 535.066 0 0 0 0 1701.94 0 0 0 -2210.84 -54.5518 0 0 535.066 0 0 0 0 
0 0 0 0 0 0 0 0 0 0 0 -1381.04 -276.727 0 0 0 0 0 0 0 0 0 2101.58 590.457 0 0 0 408.109 0 0 0 0 -1520.05 0 0 0 0 1803.42 1591.46 0.04 0 2385.71 0 0 -377.895 0 0 0 0 0 0 0 0 0 0 1098.28 0 0 0 0 0 -616.855 1173.97 0 
0 0 0 458.922 2243.19 0 543.306 1964.09 0 144.734 0 -64.1652 0 1084.55 0 1927.02 1070.97 0 631.047 1018.94 -56.0778 0 634.709 0 -883.129 0 0 0 0 487.152 0 0 -1802.5 0 -1742.23 0 1186.33 1463.29 0 0 0.01 0 0 -1421.17 -219.81 0 0 0 882.366 0 0 0 0 1642.74 0 0 0 2371.97 0 -2249.14 0 0 0 0 
0 0 0 64.6229 0 96.057 0 0 0 438.932 0 0 0 0 0 436.491 -1659.52 0 0 0 2057.79 0 0 0 0 0 0 0 0 0 0 0 0 0 2350.92 0 0 -1325.04 0 2053.36 0 0.05 0 0 0 0 -1307.49 0 0 1105.76 0 0 0 0 0 0 0 0 0 0 0 0 0 2103.87 
0 0 249.107 0 0 -1868.11 1608.71 0 0 0 0 0 0 -1725.59 0 0 0 0 0 0 2473.91 0 -202.872 0 0 2326.65 0 0 0 -238.731 0 0 0 0 746.712 0 0 853.374 -517.06 0 0 0 0.08 578.707 2374.87 1989.27 0 2217.86 0 0 0 0 0 0 173.421 46.0067 90.8689 0 0 0 0 0 -1031.91 0 
0 2056.41 0 2075.64 0 1208.15 0 -1152.76 -1588.87 0 0 -172.964 0 -2400.36 0 1627.78 0 0 0 -645.543 0 2215.11 0 0 0 0 0 2024.37 0 0 0 0 0 0 0 0 0 0 0 0 -1022.6 0 534.913 0.07 0 0 0 0 2429.96 0 0 0 1730.48 0 -366.298 0 0 0 0 0 0 0 0 0 
0 1023.36 0 0 896.71 650.578 1521.27 0 0 -1410.79 0 2030.02 0 1859.42 0 0 0 0 1195.94 0 0 0 0 550.783 0 -2336.57 0 0 0 0 1637.39 0 0 2306.05 0 0 0 0 0 -2017.35 1098.9 0 -2169.94 0 0.09 0 -2231.13 629.368 0 0 0 0 0 0 0 2290.19 0 0 0 0 0 0 0 0 
0 0 0 844.371 1478.09 0 0 -888.012 0 0 0 0 0 0 0 0 0 0 458.617 0 0 2039.48 0 0 0 0 0 0 0 0 0 0 0 0 -1536.23 0 0 2308.19 0 0 0 0 1873.15 0 0 0.06 0 0 0 0 2406.31 0 0 0 0 0 0 1098.13 0 -729.011 0 2240.29 0 0 
0 0 0 0 0 0 -777.078 1794.26 0 0 -1918.16 0 0 0 0 0 -1670.96 1506.16 1451.08 0 0 0 0 0 0 -1900.31 0 0 0 410.703 2272.03 0 0 0 2448.73 0 0 0 1120.11 0 0 2432.1 0 0 -1508 0 0 0 0 418.943 0 0 0 0 0 0 0 0 0 0 0 0 0 0 
-762.581 -387.204 1700.87 0 2039.78 0 0 0 0 0 -148.396 0 0 0 0 0 465.941 0 2469.48 -1106.68 0 1547.67 0 166.555 0 0 0 0 0 293.817 0 1713.69 2203.51 0 0 0 0 0 0 0 0 0 1674.02 0 -1557.44 0 0 0.03 0 0 0 159.688 0 0 -1965.77 -829.417 0 0 0 0 -2001.63 0 0 0 
0 349.818 -648.9 0 0 0 0 0 0 49.2111 0 -2467.5 0 0 0 2299.04 0 1017.72 0 0 0 0 0 0 0 0 0 -1311.61 757.851 0 0 901.288 2329.25 0 1082.57 0 0 1406.52 0 0 934.095 0 0 99.5666 0 0 0 0 0 1306.27 0 0 0 -287.561 0 0 0 0 0 0 0 0 0 0 
0 -2118.98 -317.774 0 0 -968.581 0 0 0 0 0 0 2311.09 0 0 0 -2060.23 0 0 0 1207.08 -770.058 224.693 0 807.596 0 0 2273.71 0 0 0 0 0 0 0 1854.69 -1865.98 -1076.62 0 0 0 1405.91 0 0 0 0 1851.02 0 -1912.98 0.06 2448.88 0 0 0 0 0 0 0 0 0 226.981 0 0 0 
0 0 0 0 1192.13 1518.98 0 0 -1182.21 0 1415.83 0 0 -741.981 0 0 0 0 0 0 0 0 -424.741 0 0 0 0 0 0 0 0 0 0 0 0 0 235.221 0 0 0 0 0 0 0 0 164.266 0 0 0 -1093.25 0.07 0 0 0 1710.94 0 0 0 0 0 100.635 2205.8 0 0 
0 0 -701.849 554.445 0 1864.76 -92.7 2146.9 0 0 0 0 0 0 2232.96 0 0 0 0 0 0 0 0 0 0 0 1264.31 0 0 0 0 0 0 609.989 0 1671.73 0 1360.13 -1270.56 0 0 0 0 0 0 0 0 782.266 0 0 0 0.01 0 0 0 0 0 629.978 0 0 0 0 0 0 
0 0 0 0 0 1976.45 -665.532 0 0 0 0 0 0 -760.445 0 2464.29 0 -1562.47 0 -574.129 0 1229.51 322.657 0 2093.65 -108.264 0 0 0 0 0 639.439 0 0 0 0 302.667 0 0 0 0 0 0 -2046.8 0 0 0 0 0 0 0 0 0.06 2267.3 1258.05 0 0 0 0 0 1842.94 0 0 0 
0 1728.95 2219.84 0 0 0 0 0 0 0 -37.3089 0 0 0 0 0 0 0 795.083 0 0 1919.23 0 2442.78 0 2497.1 0 0 0 0 0 0 0 -2405.7 0 0 0 0 0 0 -2098.99 0 0 0 0 0 0 0 -718.329 0 0 0 -2357.94 0 0 0 2482.76 0 0 0 0 0 0 0 
1790.44 0 0 0 0 0 0 230.949 0 702.46 0 0 0 0 2221.21 0 0 -1801.28 0 -691.626 0 0 173.421 2315.36 0 0 0 1763.44 273.98 0 0 0 0 0 -1352.2 0 0 -1601.69 0 0 0 0 -777.383 -2161.4 0 0 0 1610.08 0 0 -784.707 0 513.55 0 0.07 0 0 0 0 0 0 0 0 -2173.3 
0 0 0 0 0 0 0 0 0 -2212.21 0 0 0 -1078.75 0 249.26 0 182.577 729.316 0 0 -446.562 0 0 31.3578 1110.8 1066.24 0 0 0 1323.97 0 0 0 0 0 -1465.12 0 242.851 2280.72 0 0 2236.78 0 1041.22 0 0 -2203.82 0 0 0 0 0 0 0 0.08 -109.333 0 -297.632 -344.478 0 0 0 -959.12 
0 0 0 1836.68 0 0 1112.63 0 0 0 0 256.279 0 0 -2145.68 0 0 0 -604.953 0 0 0 0 184.256 0 2465.21 0 435.118 0 0 0 0 0 0 0 0 0 0 2424.31 0 0 0 1545.23 0 0 0 0 0 0 0 0 0 0 440.306 0 974.38 0.04 0 0 -84.3074 2222.89 0 0 0 
0 0 0 -1177.02 0 0 362.941 0 0 0 0 0 0 0 0 0 0 0 0 0 0 0 0 0 0 0 0 -1188.16 0 0 0 0 365.993 0 0 0 0 0 0 0 1900.16 0 0 0 0 1580.48 0 0 0 0 0 -1835.15 0 0 0 0 0 0.08 0 0 0 0 0 0 
0 0 0 0 0 0 0 0 0 0 0 0 0 0 0 0 1285.21 0 0 2099.29 0 0 0 0 0 0 0 0 0 0 898.846 0 49.8215 306.33 -1350.52 0 0 0 0 0 0 0 0 0 0 0 0 0 0 0 0 0 0 0 0 1602.6 0 0 0.08 0 0 0 -2391.81 0 
0 0 0 0 0 0 0 0 0 0 0 0 0 0 0 0 0 1227.38 0 0 0 0 -1158.71 -1470.92 0 0 0 0 0 0 0 0 0 683.996 -1622.75 0 0 0 1437.5 0 1733.83 0 0 0 0 -1475.65 0 0 0 0 0 0 0 0 0 -376.37 1634.5 0 0 0.05 0 0 0 211.57 
0 2327.72 0 0 0 968.123 0 0 -796.457 0 0 0 0 0 0 0 0 0 0 0 0 0 0 0 0 0 0 0 0 0 0 0 0 0 -259.789 0 0 0 0 0 0 0 0 0 0 0 0 -1788.16 0 2255.24 417.57 0 -274.743 0 0 0 -1567.05 0 0 0 0.04 1197.62 0 0 
0 0 0 0 0 0 0 0 0 0 0 0 0 0 0 0 0 -1645.02 0 0 0 0 -48.7533 0 637.303 0 0 0 0 0 0 0 0 0 0 0 0 0 0 -1018.94 0 0 0 0 0 2149.19 0 0 0 0 1075.55 0 0 0 0 0 0 0 0 0 629.215 0.05 0 0 
0 368.435 266.35 0 0 0 0 0 0 0 0 0 0 0 0 0 0 0 0 0 0 1208.76 0 0 0 0 0 0 0 0 0 0 0 0 -26.6274 0 2441.86 0 0 1368.53 0 0 444.426 0 0 0 0 0 0 0 0 0 0 0 0 0 0 0 -1308.25 0 0 0 0.06 0 
0 0 0 0 0 0 0 0 0 994.369 0 0 0 0 0 0 0 0 0 0 0 0 0 0 0 0 0 0 0 0 0 0 0 0 0 0 399.716 0 0 0 0 1342.13 0 0 0 0 0 0 0 0 0 0 0 0 406.583 2005.6 0 0 0 810.343 0 0 0 0.02 
