*Vertices 65
*Matrix 
0.08 0 0 1451.38 -1346.86 0 0 0 0 0 282.067 0 0 0 0 1275.75 871.227 0 -1989.27 0 0 0 0 2187.8 0 -268.181 0 0 0 0 0 0 0 0 1918.01 0 0 0 0 0 0 0 0 0 0 0 0 0 0 0 0 0 0 0 0 0 0 0 0 0 0 0 0 0 0 
0 0 -2001.33 0 0 0 0 0 0 0 0 0 2385.1 0 0 0 0 0 0 0 2062.52 0 0 0 -132.984 0 0 0 0 -362.941 0 0 0 0 -1129.11 0 0 0 0 0 0 0 0 0 0 0 0 0 553.224 0 0 0 0 568.178 0 0 0 0 0 0 0 0 0 -1510.74 0 
0 -136.189 0.05 0 0 0 0 0 0 -1000.93 0 0 0 0 0 1229.97 0 0 0 848.186 0 0 0 0 0 0 0 0 0 0 0 0 0 183.035 0 0 0 0 0 0 0 2306.97 0 0 0 0 0 2193.14 0 0 0 0 0 615.94 0 0 0 0 0 0 0 0 0 0 0 
1171.22 0 0 0.07 -2216.64 0 0 0 0 0 0 0 0 0 0 0 0 0 0 0 0 0 0 0 0 0 0 0 0 384.457 0 0 0 432.066 0 858.715 0 899.304 1871.78 -1042.74 0 0 0 0 0 0 0 -1133.53 0 0 1247.98 0 0 1787.39 0 0 0 0 0 0 0 0 0 0 0 
-474.792 0 0 1193.2 0.02 0 0 1825.69 0 -1670.51 0 2151.48 0 0 0 -516.297 0 0 0 0 -866.649 0 0 0 0 907.239 0 0 0 0 0 0 0 0 0 0 0 0 -276.879 0 0 0 0 0 0 0 0 0 0 0 0 0 0 0 0 1945.33 0 0 0 0 0 0 0 0 0 
0 0 0 0 0 0.02 0 0 0 0 -2085.41 0 0 0 0 0 0 388.424 0 0 0 0 0 0 0 0 0 0 0 0 0 0 0 0 0 0 0 0 0 0 -2230.98 0 0 0 0 2264.85 0 2062.21 0 0 0 0 0 0 0 0 0 2244.56 0 1293.15 0 0 0 0 0 
0 0 0 0 0 0 0 0 0 0 0 0 0 0 0 0 0 -19.1504 0 0 0 0 0 919.141 0 -783.944 0 158.162 0 0 0 0 0 0 -142.14 0 1031.3 0 0 0 2420.5 0 0 0 0 0 1061.97 1850.72 -1256.83 0 0 0 0 0 0 0 0 0 0 0 0 0 0 0 0 
0 0 0 0 2010.64 0 0 0.03 0 0 0 0 0 0 1206.17 0 0 0 0 0 0 0 458.617 0 0 0 2330.77 0 0 0 0 0 0 0 0 0 0 0 -2307.73 0 0 0 0 0 0 0 1983.63 0 0 0 0 0 0 0 -2432.4 0 0 0 0 0 0 0 0 0 0 
0 0 0 0 0 0 0 0 0.03 -1673.71 0 0 0 0 906.171 0 0 0 0 0 -1154.9 0 0 0 0 0 1854.23 0 0 0 0 0 0 505.31 0 0 0 0 0 0 0 0 0 0 0 0 0 0 0 0 0 0 0 0 982.162 0 0 0 0 0 0 0 0 0 0 
0 0 -203.177 0 -449.156 0 0 0 -2387.23 0.06 0 2221.21 0 0 0 1858.35 0 0 0 -2255.09 0 0 0 0 0 2372.59 251.701 0 0 0 0 0 -713.904 0 1104.08 0 1929.46 0 0 0 0 0 0 0 0 0 0 0 0 0 0 0 0 0 0 0 -834.452 0 0 0 0 0 0 0 0 
1369.59 0 0 0 0 670.415 0 0 0 0 0.04 -2381.28 -1885.05 0 0 0 0 722.144 0 0 2382.2 1452.91 0 0 0 0 0 0 0 0 0 0 0 0 0 0 0 0 0 0 0 0 0 -644.322 0 0 0 0 481.353 0 0 0 0 0 0 0 0 1036.48 0 0 0 0 0 0 0 
0 0 0 0 1194.11 0 0 0 0 -1595.58 1648.53 0 0 0 0 0 0 0 0 -529.42 0 740.455 0 0 0 0 0 0 0 0 0 0 0 0 0 0 0 0 0 0 0 0 1564 0 0 0 0 -1488.01 0 0 0 0 0 0 0 0 0 0 0 0 0 0 0 0 0 
0 -2304.83 0 0 0 0 0 0 0 0 1828.14 0 0.04 0 0 0 0 0 0 0 0 0 0 0 0 0 0 0 0 0 0 2383.88 261.773 0 0 0 0 0 0 0 0 0 0 1801.43 -2213.43 0 0 0 0 0 0 0 0 0 0 991.318 1679.05 0 0 0 -1272.55 0 0 0 0 
0 0 0 0 0 0 0 0 0 0 0 0 0 0.07 0 0 0 2224.88 0 0 0 0 1407.74 0 0 0 0 -798.593 0 0 973.617 0 0 -100.024 0 0 0 0 1834.7 2472.99 0 0 0 1802.8 0 0 453.124 -609.531 0 0 0 0 0 0 886.944 0 0 0 0 0 0 0 0 0 0 
0 0 0 0 0 0 0 -1190.6 -2482.15 0 0 0 0 0 0.09 0 0 0 0 2342.22 0 0 0 0 0 0 0 1417.51 0 0 0 0 0 0 0 0 0 0 0 0 0 0 0 0 0 0 0 0 1584.44 0 0 0 0 -752.052 0 0 0 0 0 0 0 0 0 0 0 
-947.981 0 -1109.12 0 -445.189 0 0 0 0 1122.85 0 0 0 0 0 0.08 0 0 0 0 0 -568.331 0 0 0 1473.82 0 0 0 0 0 0 0 0 0 0 0 1588.72 0 0 0 0 0 0 -886.486 0 0 654.851 0 0 1517.91 0 0 0 0 0 0 0 0 0 0 0 0 0 0 
1412.02 0 0 0 0 0 0 0 0 0 0 0 0 0 0 0 0.05 -1362.12 0 0 0 0 0 0 0 0 0 0 0 0 0 1723.46 0 0 0 0 0 0 0 0 0 0 0 0 0 0 0 0 -1727.12 0 0 0 0 0 0 0 0 0 0 0 0 0 0 0 0 
0 0 0 0 0 -1038.16 105.823 0 0 0 1462.52 0 0 -1753.21 0 0 2027.88 0 0 0 0 0 0 0 0 0 0 0 0 0 0 549.104 -680.792 0 0 0 0 939.436 0 0 0 0 1064.41 0 0 0 0 0 0 0 0 0 0 0 0 -970.87 0 0 0 0 0 0 0 0 0 
-1890.39 0 0 0 0 0 0 0 0 0 0 0 0 0 0 0 0 0 0.09 0 0 0 0 0 1356.62 0 0 0 0 0 0 0 -189.749 0 0 0 0 0 1162.98 0 0 0 0 0 0 0 0 0 0 0 0 841.166 1152 0 0 2245.32 0 0 0 0 0 0 0 0 0 
0 0 2362.51 0 0 0 0 0 0 1500.98 0 575.35 0 0 -1101.49 0 0 0 0 0.03 0 0 0 0 0 -1107.29 0 0 0 2355.04 0 1023.36 0 0 0 0 0 0 -331.507 0 0 749.611 0 0 0 0 0 0 0 0 0 0 0 0 0 46.9222 0 0 0 0 0 0 0 0 0 
0 2207.17 0 0 -1193.81 0 0 0 334.712 0 -2116.84 0 0 0 0 0 0 0 0 0 0.08 0 0 0 0 0 0 0 0 0 0 2153.92 0 0 0 0 887.707 0 0 0 0 0 0 0 0 2425.99 0 0 0 0 0 0 0 0 0 0 1353.72 0 0 0 0 0 0 0 0 
0 0 0 0 0 0 0 0 0 0 2474.36 -470.672 0 0 0 1995.38 0 0 0 0 0 0.02 0 0 0 751.442 0 0 0 0 0 -1929.15 0 0 -135.121 599.46 0 0 0 0 0 0 1271.94 0 0 0 0 0 0 -868.023 1839.27 0 0 517.518 0 0 0 0 1527.83 0 0 0 0 0 0 
0 0 0 0 0 0 0 -834.147 0 0 0 0 0 2361.14 0 0 0 0 0 0 0 0 0.02 0 0 0 0 0 0 0 0 0 0 0 0 0 0 2090.9 0 0 -1229.36 0 0 0 0 979.263 0 0 0 0 0 0 0 0 0 0 -36.5459 0 0 0 0 0 0 0 0 
-1527.53 0 0 0 0 0 106.738 0 0 0 0 0 0 0 0 0 0 0 0 0 0 0 0 0.09 0 0 0 0 0 0 0 0 2241.2 0 0 0 0 1486.48 0 0 0 0 0 0 0 0 0 0 0 810.343 0 0 0 0 0 0 454.955 0 0 0 0 0 0 0 0 
0 -974.227 0 0 0 0 0 0 0 0 0 0 0 0 0 0 0 0 200.278 0 0 0 0 0 0.08 0 0 0 0 0 2280.11 0 0 0 0 0 -322.504 0 0 0 0 0 0 0 0 1681.19 0 0 -1606.11 0 0 0 -301.141 0 -738.624 0 0 1038.77 0 0 0 0 0 0 0 
165.334 0 0 0 1348.23 0 1000.17 0 0 887.402 0 0 0 0 0 -406.43 0 0 0 608.463 0 482.421 0 0 0 0.07 0 0 0 0 0 -446.257 0 0 0 0 0 0 0 1406.98 -224.54 0 0 0 0 0 0 -812.937 0 0 0 0 0 -2235.56 0 0 0 0 0 0 0 0 0 0 0 
0 0 0 0 0 0 0 -1222.5 866.802 1384.24 0 0 0 0 0 0 0 0 0 0 0 0 0 0 0 0 0.04 0 0 0 0 0 0 0 0 0 0 0 0 0 0 -20.0659 976.669 1987.14 0 0 0 0 -1502.04 0 -638.066 0 0 0 0 0 0 437.712 0 0 0 0 0 0 0 
0 0 0 0 0 0 459.838 0 0 0 0 0 0 -1206.32 2128.9 0 0 0 0 0 0 0 0 0 0 0 0 0.06 -18.6926 0 0 0 0 0 1306.12 0 0 0 0 0 0 215.842 0 0 0 0 0 0 0 0 -118.488 0 0 0 0 0 1910.69 0 0 0 0 0 0 0 0 
0 0 0 0 0 0 0 0 0 0 0 0 0 0 0 0 0 0 0 0 0 0 0 0 0 0 0 -755.562 0.05 0 2476.81 0 0 0 0 0 0 0 0 0 0 0 0 0 0 0 0 0 0 0 0 0 0 0 0 0 0 0 854.747 0 0 0 0 0 0 
0 1515.32 0 583.438 0 0 0 0 0 0 0 0 0 0 0 0 0 0 0 1020.92 0 0 0 0 0 0 0 0 0 0.09 0 0 0 0 0 770.516 0 -64.9281 0 135.731 0 0 0 0 0 0 0 0 0 0 0 0 2354.12 0 1895.73 0 0 0 0 0 0 -2349.54 0 0 0 
0 0 0 0 0 0 0 0 0 0 0 0 0 -510.193 0 0 0 0 0 0 0 0 0 0 519.044 0 0 0 -1042.28 0 0.04 -1246.15 0 0 0 0 0 0 0 0 0 2077.93 0 0 0 0 0 0 1424.83 0 0 -195.395 0 1901.68 0 0 0 0 0 0 0 0 0 0 0 
0 0 0 0 0 0 0 0 0 0 0 0 -221.335 0 0 0 2460.33 1571.93 0 -1835.15 1858.65 -2067.4 0 0 0 -419.858 0 0 0 0 1179.77 0.08 2140.8 0 0 0 0 0 0 0 0 0 0 0 268.487 0 0 -559.633 0 0 0 0 0 0 0 0 0 -1569.19 0 0 0 0 0 0 0 
0 0 0 0 0 0 0 0 0 -2463.38 0 0 -205.466 0 0 0 0 1710.64 2184.9 0 0 0 0 1491.82 0 0 0 0 0 0 0 1503.72 0.03 0 0 0 0 0 0 0 0 1756.11 1719.95 0 0 1009.32 0 2047.26 0 0 0 0 -975.906 0 1662.27 0 0 0 -2275.54 0 0 0 0 0 0 
0 0 344.478 945.997 0 0 0 0 2399.14 0 0 0 0 852.916 0 0 0 0 0 0 0 0 0 0 0 0 0 0 0 0 0 0 0 0.08 0 0 0 0 0 0 0 0 0 0 1880.93 0 0 0 0 0 -2463.38 0 0 0 0 0 0 0 0 0 0 0 0 0 0 
-282.372 -50.1267 0 0 0 0 -136.341 0 0 -508.515 0 0 0 0 0 0 0 0 0 0 0 620.212 0 0 0 0 0 1329.77 0 0 0 0 0 0 0.04 0 0 0 0 0 0 0 2317.96 0 0 76.9829 0 0 -877.331 0 0 2059.31 0 0 0 0 0 0 0 0 0 0 0 0 0 
0 0 0 -278.71 0 0 0 0 0 0 0 0 0 0 0 0 0 0 0 0 0 1841.87 0 0 0 0 0 0 0 1463.9 0 0 0 0 0 0.02 0 0 0 0 0 0 0 0 0 0 0 0 -444.884 0 0 0 0 0 0 0 0 0 0 0 0 0 0 0 0 
0 0 0 0 0 0 -685.522 0 0 2474.52 0 0 0 0 0 0 0 0 0 0 -678.198 0 0 0 -621.128 0 0 0 0 0 0 0 0 0 0 0 0.07 0 0 0 0 0 0 0 0 0 0 0 0 0 0 0 0 1101.64 0 0 0 0 0 0 0 0 0 0 0 
0 0 0 2176.66 0 0 0 0 0 0 0 0 0 0 0 2135 0 1084.55 0 0 0 0 1405.61 1758.71 0 0 0 0 0 -2373.2 0 0 0 0 0 0 0 0.05 0 0 0 0 2036.12 0 0 0 0 -1235.31 0 0 0 0 0 0 0 0 0 0 0 0 0 0 0 0 0 
0 0 0 391.476 1699.19 0 0 -718.177 0 0 0 0 0 567.873 0 0 0 0 1104.54 689.489 0 0 0 0 0 0 0 0 0 0 0 0 0 0 0 0 0 0 0.08 0 0 0 0 0 0 0 0 0 0 0 2137.59 0 0 0 -19.303 0 0 0 0 0 0 0 0 0 0 
0 0 0 -276.879 0 0 0 0 0 0 0 0 0 2045.88 0 0 0 0 0 0 0 0 0 0 0 -168.233 0 0 0 -221.793 0 0 0 0 0 0 0 0 0 0.07 0 0 0 0 -275.658 0 0 0 0 0 0 0 0 0 0 0 0 879.162 0 0 0 0 0 0 0 
0 0 0 0 0 1931.14 1496.7 0 0 0 0 0 0 0 0 0 0 0 0 0 0 0 -1359.22 0 0 276.574 0 0 0 0 0 0 0 0 0 0 0 0 0 0 0.02 0 -471.74 2174.98 0 0 0 0 0 2011.55 0 0 0 0 0 2258.29 0 0 0 -879.009 0 0 0 0 0 
0 0 629.673 0 0 0 0 0 0 0 0 0 0 0 0 0 0 0 0 -801.798 0 0 0 0 0 0 -179.067 1944.11 0 0 1333.58 0 254.143 0 0 0 0 0 0 0 0 0 0 0 2421.11 2326.65 1641.51 0 0 -14.1148 0 0 259.331 0 0 0 398.953 0 0 0 0 0 0 0 0 
0 0 0 0 0 0 0 0 0 0 0 -253.227 0 0 0 0 0 1921.67 0 0 0 226.371 0 0 0 0 -658.666 0 0 0 0 0 2.67037 0 -602.817 0 0 1409.42 0 0 1715.67 0 0.05 0 0 -2197.41 0 0 0 0 0 0 0 0 0 0 961.104 332.575 0 0 0 0 0 0 0 
0 0 0 0 0 0 0 0 0 0 1942.12 0 -1865.21 1419.19 0 0 0 0 0 0 0 0 0 0 0 0 -233.543 0 0 0 0 0 0 0 0 0 0 0 0 0 1655.71 0 0 0.06 0 0 1891.77 0 0 1547.52 0 0 0 1658.3 0 2271.26 0 0 0 0 0 0 0 0 0 
0 0 0 0 0 0 0 0 0 0 0 0 -476.012 0 0 752.205 0 0 0 0 0 0 0 0 0 0 0 0 0 0 0 2486.72 0 -640.965 0 0 0 0 0 1739.48 0 -378.353 0 0 0.06 0 0 0 0 0 0 0 0 0 0 0 0 0 0 0 0 0 0 0 470.061 
0 0 0 0 0 1445.89 0 0 0 0 0 0 0 0 0 0 0 0 0 0 566.652 0 -1596.96 0 631.047 0 0 0 0 0 0 0 1975.39 0 490.509 0 0 0 0 0 0 1995.68 2008.35 0 0 0.06 0 1906.42 0 0 0 0 0 0 0 0 0 1835.92 0 0 0 0 0 0 0 
0 0 0 0 0 0 545.9 1744.67 0 0 0 0 0 1650.52 0 0 0 0 0 0 0 0 0 0 0 0 0 0 0 0 0 0 0 0 0 0 0 0 0 0 0 -232.627 0 -1203.27 0 0 0 0 0 0 0 0 0 0 0 -2122.03 0 2084.8 0 0 0 0 0 0 0 
0 0 734.809 -1478.55 0 1711.25 1545.69 0 0 0 0 314.417 0 533.54 0 -2364.35 0 0 0 0 0 0 0 0 0 1547.21 0 0 0 0 0 -801.187 2146.6 0 0 0 0 93.9207 0 0 0 0 0 0 0 -2288.35 0 0.08 0 0 0 0 0 0 0 0 0 0 -658.513 0 0 0 0 0 0 
0 2029.4 0 0 0 0 1592.23 0 0 0 1750.16 0 0 0 111.927 0 536.439 0 0 0 0 0 0 0 -114.978 0 355.922 0 0 0 1025.65 0 0 0 850.169 -2123.86 0 0 0 0 0 0 0 0 0 0 0 0 0.09 0 0 0 0 0 0 0 0 0 0 0 0 0 0 0 0 
0 0 0 0 0 0 0 0 0 0 0 0 0 0 0 0 0 0 0 0 0 2155.6 0 182.119 0 0 0 0 0 0 0 0 0 0 0 0 0 0 0 0 -944.166 637.761 0 656.835 0 0 0 0 0 0.07 0 0 0 0 0 0 0 -671.789 0 0 0 0 0 0 0 
0 0 0 1655.25 0 0 0 0 0 0 0 0 0 0 0 1963.94 0 0 0 0 0 1450.01 0 0 0 0 -1491.67 610.294 0 0 0 0 0 1387.6 0 0 0 0 2279.96 0 0 0 0 0 0 0 0 0 0 0 0.08 0 0 0 1224.94 0 0 0 0 0 0 0 0 0 0 
0 0 0 0 0 0 0 0 0 0 0 0 0 0 0 0 0 0 1691.26 0 0 0 0 0 0 0 0 0 0 0 1668.22 0 0 0 1432.92 0 0 0 0 0 0 0 0 0 0 0 0 0 0 0 0 0.02 0 -318.537 0 0 0 0 0 0 0 0 -1050.37 0 0 
0 0 0 0 0 0 0 0 0 0 0 0 0 0 0 0 0 0 2172.23 0 0 0 0 0 -121.998 0 0 0 0 1581.24 0 0 7.24815 0 0 0 0 0 0 0 0 2205.04 0 0 0 0 0 0 0 0 0 0 0.04 0 0 0 0 0 0 -1914.96 0 0 0 0 0 
0 2335.66 1704.84 1526.76 0 0 0 0 0 0 0 0 0 0 -639.744 0 0 0 0 0 0 -1012.68 0 0 0 1363.49 0 0 0 0 -783.486 0 0 0 0 0 118.641 0 0 0 0 0 0 1618.17 0 0 0 0 0 0 0 1750.62 0 0 0 0 0 0 -2059.47 0 0 0 0 0 0 
0 0 0 0 0 0 0 2098.83 2395.63 0 0 0 0 2059.62 0 0 0 0 0 0 0 0 0 0 1874.37 0 0 0 0 -1127.74 0 0 944.166 0 0 0 0 0 -1007.64 0 0 0 0 0 0 0 0 0 0 0 -880.993 0 0 0 0.02 0 0 0 2385.4 0 0 0 0 0 0 
0 0 0 0 2041.31 0 0 0 0 0 0 0 -2324.21 0 0 0 0 -250.633 -278.558 1674.17 0 0 0 0 0 0 0 0 0 0 0 0 0 0 0 0 0 0 0 0 1529.82 0 0 72.1 0 0 -2145.83 0 0 0 0 0 0 0 0 0.08 0 0 151.601 0 0 0 0 0 0 
0 0 0 0 0 0 0 0 0 747.627 0 0 -468.993 0 0 0 0 0 0 0 228.355 0 1438.41 542.238 0 0 0 2159.57 0 0 0 0 0 0 0 0 0 0 0 0 0 45.7015 2226.86 0 0 0 0 0 0 0 0 0 0 0 0 0 0.06 0 0 0 0 0 0 0 0 
0 0 0 0 0 -908.155 0 0 0 0 742.286 0 0 0 0 0 0 0 0 0 0 0 0 0 1478.85 0 2196.34 0 0 0 0 1369.9 0 0 0 0 0 0 0 520.264 0 0 -2285.91 0 0 -454.802 2321.31 0 0 2033.07 0 0 0 0 0 0 0 0.01 0 0 0 0 0 0 0 
0 0 0 0 0 0 0 0 0 0 0 0 0 0 0 0 0 0 0 0 0 1768.62 0 0 0 0 0 0 -722.907 0 0 0 199.667 0 0 0 0 0 0 0 0 0 0 0 0 0 0 -123.066 0 0 0 0 0 699.408 1209.22 -816.904 0 0 0.03 0 0 0 0 0 0 
0 0 0 0 0 162.435 0 0 0 0 0 0 0 0 0 0 0 0 0 0 0 0 0 0 0 0 0 0 0 0 0 0 0 0 0 0 0 0 0 0 2225.18 0 0 0 0 0 0 0 0 0 0 0 2239.37 0 0 0 0 0 0 0.09 0 0 0 0 0 
0 0 0 0 0 0 0 0 0 0 0 0 432.218 0 0 0 0 0 0 0 0 0 0 0 0 0 0 0 0 0 0 0 0 0 0 0 0 0 0 0 0 0 0 0 0 0 0 0 0 0 0 0 0 0 0 0 0 0 0 0 0.08 0 0 0 0 
0 0 0 0 0 0 0 0 0 0 0 0 0 0 0 0 0 0 0 0 0 0 0 0 0 0 0 0 0 1452.15 0 0 0 0 0 0 0 0 0 0 0 0 0 0 0 0 0 0 0 0 0 0 0 0 0 0 0 0 0 0 0 0.03 0 0 0 
0 0 0 0 0 0 0 0 0 0 0 0 0 0 0 0 0 0 0 0 0 0 0 0 0 0 0 0 0 0 0 0 0 0 0 0 0 0 0 0 0 0 0 0 0 0 0 0 0 0 0 1303.67 0 0 0 0 0 0 0 0 0 0 0.09 0 0 
0 2346.03 0 0 0 0 0 0 0 0 0 0 0 0 0 0 0 0 0 0 0 0 0 0 0 0 0 0 0 0 0 0 0 0 0 0 0 0 0 0 0 0 0 0 0 0 0 0 0 0 0 0 0 0 0 0 0 0 0 0 0 0 0 0.03 0 
0 0 0 0 0 0 0 0 0 0 0 0 0 0 0 0 0 0 0 0 0 0 0 0 0 0 0 0 0 0 0 0 0 0 0 0 0 0 0 0 0 0 0 0 1595.89 0 0 0 0 0 0 0 0 0 0 0 0 0 0 0 0 0 0 0 0.01 
