*Vertices 48
*Matrix 
0.06 0 0 0 0 0 0 0 0 -1824.93 0 0 0 0 0 860.393 1834.85 2189.32 0 0 0 0 281.152 0 -588.473 1634.19 -159.383 0 0 0 -209.891 0 -110.096 0 0 0 0 0 0 0 0 0 634.556 0 0 0 0 0 
0 0.01 66.7592 0 -1994.31 0 0 0 -43.7178 0 0 0 1774.27 0 0 2088.31 0 0 0 -373.318 0 0 0 0 0 0 0 0 -1030.69 0 -317.621 -557.497 0 -42.3444 0 171.285 0 0 0 0 0 2048.33 0 0 0 0 0 0 
0 1101.95 0.05 0 0 0 0 0 0 1280.94 -571.535 0 0 -2085.41 347.53 0 0 2481.08 2231.74 0 0 0 0 0 0 0 0 0 0 2478.64 0 -1818.83 0 0 0 0 0 7.85852 0 -1814.86 2249.9 0 0 -2301.32 0 0 0 0 
0 0 0 0.02 0 0 0 0 0 -225.913 -24.3385 0 2029.25 -451.75 0 0 382.931 0 0 0 1728.03 2115.16 0 1471.98 0 1039.99 0 -1612.98 0 -1139.48 0 925.55 0 0 0 0 0 0 0 0 0 0 1487.24 0 0 0 0 0 
0 2317.35 0 0 0.05 0 0 0 0 0 0 0 0 0 -1234.55 0 0 0 0 -1766.18 0 0 1412.32 0 0 -1690.34 0 0 0 0 0 0 0 0 0 0 1739.17 0 1945.48 2307.89 0 0 0 -280.847 0 0 0 0 
0 0 0 0 0 0.04 0 1668.22 0 -1507.54 -1790.29 0 0 -1551.48 2213.89 0 0 0 0 0 0 0 0 -265.435 2060.69 910.596 0 0 0 0 0 0 0 0 0 0 0 0 0 0 572.298 0 0 0 0 0 2205.04 0 
0 0 0 0 0 0 0.05 0 0 0 0 0 0 0 404.294 999.405 -1142.23 -79.7296 0 0 0 2179.4 0 0 0 0 0 0 -2055.04 -799.051 -1279.11 -1771.37 0 0 0 1770 1101.03 0 -835.063 1398.28 0 0 2237.69 0 0 0 0 0 
0 0 0 0 0 -852.458 0 0.03 2303.16 0 0 1067.77 0 -39.7504 0 0 0 1504.64 0 2049.7 0 0 0 0 -2086.78 0 0 0 0 0 0 0 0 0 0 0 0 0 0 0 0 0 1946.24 0 0 -406.43 0 0 
0 2365.26 0 0 0 0 0 1346.55 0.07 0 0 1501.74 0 0 0 0 0 0 0 0 0 0 -116.657 0 0 0 0 0 -1763.44 2024.98 0 0 0 2166.89 1912.21 0 0 0 0 0 0 0 0 1709.42 0 0 0 0 
-2107.38 0 1496.09 -322.657 0 2499.54 0 0 0 0.04 0 0 0 0 0 0 0 0 0 542.695 0 -1891.31 0 0 1590.09 1022.75 0 1275.44 0 0 0 0 638.981 0 0 0 1611.15 -1273.77 0 0 0 0 0 1082.72 0 0 0 0 
0 0 288.629 907.849 0 -1359.52 0 0 0 0 0.08 1474.88 0 0 -474.487 0 0 0 0 0 1846.45 0 0 0 1438.41 0 0 0 1856.06 -1014.51 0 347.53 0 0 1569.03 0 0 -1553.16 0 350.429 0 0 0 0 0 0 1578.8 -218.894 
0 0 0 0 0 0 0 129.933 -1922.28 0 -1070.51 0.04 0 1811.66 0 0 0 0 2202.29 0 0 1240.96 0 0 0 1593.75 0 0 -652.715 0 0 0 0 0 0 0 0 0 0 -1413.08 -1319.7 307.398 0 45.5489 0 0 0 0 
0 497.223 0 -98.9563 0 0 0 0 0 0 0 0 0.05 -233.695 0 607.395 0 466.399 0 1356.01 1809.37 0 -1314.05 0 0 929.518 0 0 0 427.488 0 0 0 0 0 0 0 0 0 2291.41 0 1744.06 0 0 0 0 0 0 
0 0 -491.272 -873.974 0 417.57 0 -1025.35 0 0 0 622.654 2459.87 0 0 0 701.239 2278.89 0 0 -1609.32 0 0 0 0 0 0 0 1638.46 0 0 0 0 0 0 0 -78.0511 2026.51 0 -367.977 0 0 -78.9666 1365.32 0 1269.34 0 0 
0 0 2225.64 0 -201.804 150.533 -694.678 0 0 0 -273.217 0 0 0 0.02 1627.02 0 0 0 0 0 -1382.11 0 0 0 0 0 -987.198 0 0 0 -1346.71 0 0 0 1983.32 -1146.96 1858.04 0 0 -1170.77 0 -800.729 600.223 -639.592 1689.73 0 0 
2193.29 35.6304 0 0 0 0 690.405 0 0 0 0 0 2251.27 0 -618.381 0.01 0 0 1785.56 0 465.178 0 0 0 0 0 918.531 0 -2397.92 1759.93 -1966.38 188.986 0 0 0 2333.52 278.71 0 -2210.99 0 0 0 2001.94 0 0 -1219.14 0 1934.8 
1711.25 0 0 882.366 0 0 1002 0 0 0 0 0 0 -296.564 0 0 0.01 0 0 0 0 703.07 0 1959.06 2388.76 0 0 874.279 0 0 -1226.77 0 0 0 0 0 -2421.11 0 0 -929.975 0 0 0 1558.05 0 0 -305.414 0 
1226.92 0 322.047 0 0 0 -56.6881 -1362.88 0 0 0 0 2036.12 1169.24 0 0 0 0.03 0 0 93.4629 0 0 0 310.755 0 0 0 0 -2135 0 1213.34 0 0 639.592 0 0 0 0 1655.25 0 0 2227.47 0 0 0 0 0 
0 0 2273.09 0 0 0 0 0 0 0 0 1532.26 0 0 0 -979.72 0 0 0.01 0 0 0 0 0 2324.52 0 0 0 -2187.8 0 0 0 0 0 0 0 0 817.82 337.764 0 0 0 0 0 0 0 0 0 
0 -1843.39 0 0 1608.1 0 0 481.811 0 -1009.48 0 0 -775.552 0 0 0 0 0 0 0.08 0 0 0 0 0 0 1771.52 0 -2264.4 -611.82 0 0 1026.87 0 0 0 2331.23 0 2276.76 32.2733 -606.632 -402.768 0 0 0 0 0 0 
0 0 0 -750.374 0 0 0 0 0 0 -550.478 0 1677.22 1063.49 0 2327.88 0 -1510.13 0 0 0.08 0 0 0 -994.064 0 2468.26 0 0 0 0 939.894 0 0 0 0 0 -2436.83 0 0 0 0 2366.33 0 0 0 0 0 
0 0 0 2373.5 0 0 1545.53 0 0 1559.72 0 -1834.39 0 0 -897.626 0 1884.29 0 0 0 0 0.05 -1279.41 -560.701 0 5.41704 0 0 0 -458.159 0 0 0 0 0 0 -1112.17 0 0 0 1868.88 0 0 0 0 0 0 0 
2223.5 0 0 0 1887.19 0 0 0 -1896.19 0 0 0 1718.27 0 0 0 0 0 0 0 0 -451.445 0.06 2383.88 0 2304.99 -1095.54 -606.021 0 0 0 0 0 0 0 0 2299.04 2421.41 0 0 1883.83 1598.18 2176.66 0 -2121.88 0 0 -1903.67 
0 0 0 -497.375 0 -1307.79 0 0 0 0 0 0 0 0 0 0 1557.74 0 0 0 0 2399.44 1041.37 0.05 0 -1916.94 0 0 0 0 0 0 0 0 0 0 2460.94 0 0 0 1659.37 -406.125 0 0 0 0 0 0 
1420.1 0 0 0 0 886.181 0 514.008 0 547.121 -1340.45 0 0 0 0 0 756.172 956.984 550.02 0 1027.33 0 0 0 0.08 0 0 979.873 0 1640.75 396.817 -1638.77 0 0 0 -1556.67 -2475.89 0 0 0 0 0 0 0 0 0 0 0 
-1874.37 0 0 2363.58 845.592 920.209 0 0 0 -1287.04 0 -1795.18 787.149 0 0 0 0 0 0 0 0 -1736.12 1540.8 -94.6837 0 0.08 2454.37 0 1485.41 0 0 0 0 0 0 0 0 0 0 0 0 -1507.54 0 0 0 0 0 -1519.14 
384.61 0 0 0 0 0 0 0 0 0 0 0 0 0 0 1592.38 0 0 0 1689.89 -1493.8 0 1183.89 0 0 679.571 0.05 -2188.71 0 -821.329 0 0 0 0 0 2108.14 0 0 2238 1820.96 0 0 0 0 0 0 0 0 
0 0 0 -920.209 0 0 0 0 0 -2372.74 0 0 0 0 725.196 0 -1120.41 0 0 0 0 0 196.463 0 2396.24 0 -556.734 0.04 0 0 0 0 0 0 594.882 0 0 0 0 1758.86 0 0 0 0 0 0 0 0 
0 893.658 0 0 0 0 -1437.8 0 -1435.51 0 -2302.09 1168.78 0 2168.57 0 267.876 0 0 1096.15 2186.42 0 0 0 0 0 949.355 0 0 0.03 452.513 -2309.41 0 0 -1888.26 0 2330.93 0 0 0 351.65 0 0 0 0 0 0 0 0 
0 0 -1683.48 -1647.92 0 0 1378.29 0 1562.78 0 20.2185 0 2343.29 0 0 -796.762 0 -229.575 0 1804.94 0 -283.441 0 0 1358.15 0 232.475 0 2034.44 0 1856.67 0 0 0 0 0 0 906.934 317.469 0 0 0 0 0 0 1233.33 0 0 
-1772.13 -742.134 0 0 0 0 2480.01 0 0 0 0 0 0 0 0 345.393 1140.4 0 0 0 0 0 0 0 1309.93 0 0 0 602.359 -2409.21 0.09 660.955 0 0 0 0 0 0 0 0 0 0 0 0 0 0 0 0 
0 -1387.14 -420.164 1824.02 0 0 -499.664 0 0 0 146.26 0 0 0 -2140.34 1242.48 0 -194.021 0 0 -1879.56 0 0 0 1436.28 0 0 0 0 0 2281.03 0.01 0 0 0 0 2233.57 0 -2369.99 603.122 0 0 -1101.03 0 0 0 0 0 
-2297.05 0 0 0 0 0 0 0 0 377.285 0 0 0 0 0 0 0 0 0 66.6066 0 0 0 0 0 0 0 0 0 0 0 0 0.06 0 1614.51 0 0 2127.67 0 0 0 0 0 0 0 0 0 -423.521 
0 2104.94 0 0 0 0 0 0 -91.174 0 0 0 0 0 0 0 0 0 0 0 0 0 0 0 0 0 0 0 -1885.2 0 0 0 0 0.03 0 1415.07 0 0 0 0 -2459.41 0 1870.25 0 0 0 0 0 
0 0 0 0 0 0 0 0 -2142.63 0 -1299.86 0 0 0 0 0 0 1689.43 0 0 0 0 0 0 0 0 0 2448.73 0 0 0 0 -2169.18 0 0.01 0 652.715 -338.221 0 0 0 2083.73 0 2197.41 0 0 0 0 
0 -1721.17 0 0 0 0 1980.57 0 0 0 0 0 0 0 2123.1 1789.07 0 0 0 0 0 0 0 0 -624.638 0 2492.22 0 1986.53 0 0 0 0 -1156.73 0 0.07 0 0 0 0 761.055 2430.88 0 0 0 0 0 0 
0 0 0 0 -707.495 0 537.507 0 0 -817.972 0 0 0 1026.57 -1682.41 1109.27 -1025.5 0 0 -2289.88 0 -1747.87 1798.38 1405.15 -1391.57 0 0 0 0 0 0 830.027 0 0 463.652 0 0.01 0 0 0 0 1054.34 2077.93 1670.51 0 -196.463 0 0 
0 0 -669.958 0 0 0 0 0 0 1591.16 811.716 0 0 570.467 402.463 0 0 0 2000.87 0 -668.432 0 -1433.99 0 0 0 0 0 0 -1908.25 0 0 -1295.59 0 929.823 0 0 0.08 1886.27 0 -916.7 815.378 0 0 248.802 0 0 0 
0 0 0 0 -1862.62 0 1217.46 0 0 0 0 0 0 0 0 1220.51 0 0 -2298.58 1167.56 0 0 0 0 0 0 1122.55 0 0 1016.19 0 -2405.55 0 0 0 0 0 1691.56 0 0 -1564.91 0 0 1945.48 0 0 0 0 
0 0 -818.888 0 -1700.42 0 223.624 0 0 0 425.199 2402.34 2483.06 -1662.11 0 0 1951.28 2139.12 0 -163.198 0 0 0 0 0 0 -260.247 1081.96 2142.78 0 0 1221.12 0 0 0 0 0 0 0 0.01 0 0 0 0 0 0 0 0 
0 0 1764.05 0 0 917.463 0 0 0 0 0 292.291 0 0 -644.475 0 0 0 0 -2012.31 0 473.724 1519.9 -591.372 0 0 0 0 0 0 0 0 0 2476.5 0 504.547 0 -1177.33 1895.73 0 0.05 0 0 0 0 0 0 0 
0 600.528 0 0 0 0 0 0 0 0 0 -1043.2 -1920.15 0 0 0 0 0 0 1788.92 0 0 42.8022 2143.39 0 -803.476 0 0 0 0 0 0 0 0 682.775 1827.52 -2487.49 121.082 0 0 0 0 0 0 0 0 0 0 
-1111.71 0 0 1262.47 0 0 1402.86 -1939.99 0 0 0 0 0 1772.13 -501.953 1896.34 0 -754.799 0 0 -1541.26 0 -164.724 0 0 0 0 0 0 0 0 1862.93 0 2130.12 0 0 -1360.9 0 0 0 0 0 0.08 -1067.16 0 0 0 0 
0 0 2249.44 0 157.399 0 0 0 1826.46 478.607 0 -514.924 0 2086.17 -1313.29 0 1233.02 0 0 0 0 0 0 0 0 0 0 0 0 0 0 0 0 0 -912.122 0 -621.891 0 -1068.83 0 0 0 2223.04 0.06 0 0 0 0 
0 0 0 0 0 0 0 0 0 0 0 0 0 0 1776.1 0 0 0 0 0 0 0 2470.4 0 0 0 0 0 0 0 0 0 0 0 0 0 0 -1903.36 0 0 0 0 0 0 0 0 0 0 
0 0 0 0 0 0 0 808.969 0 0 0 0 0 312.281 230.796 404.141 0 0 0 0 0 0 0 0 0 0 0 0 0 349.971 0 0 0 0 0 0 2438.2 0 0 0 0 0 0 0 0 0.01 0 0 
0 0 0 0 0 2087.39 0 0 0 0 603.122 0 0 0 0 0 -343.257 0 0 0 0 0 0 0 0 0 0 0 0 0 0 0 0 0 0 0 0 0 0 0 0 0 0 0 0 0 0 0 
0 0 0 0 0 0 0 0 0 0 2155.29 0 0 0 0 -91.174 0 0 0 0 0 0 -1732.31 0 0 1351.59 0 0 0 0 0 0 2112.11 0 0 0 0 0 0 0 0 0 0 0 0 0 0 0.09 
