*Vertices 60
*Matrix 
0.08 0 1972.03 0 0 0 0 0 0 0 0 0 257.805 0 0 0 0 0 0 0 0 0 0 -714.057 0 0 0 0 0 0 0 2201.83 630.436 0 0 0 0 0 0 0 0 0 0 0 0 0 -1631.29 0 0 0 0 0 0 0 0 0 0 0 0 0 
0 0.06 1337.09 0 0 -2268.97 0 0 0 0 0 0 0 0 0 0 0 0 0 2428.89 1692.02 0 0 0 0 0 0 0 1027.02 0 0 0 0 0 0 227.439 0 0 0 0 0 0 0 0 -90.2585 0 0 0 0 0 0 0 0 0 0 0 0 0 0 0 
-1038.32 1786.63 0.02 0 0 2394.71 0 0 0 0 0 0 0 0 0 0 0 0 0 0 0 0 0 0 0 0 1752.75 0 0 0 0 0 0 0 0 0 0 0 0 0 0 0 0 0 0 0 0 1164.05 0 0 0 0 0 0 0 0 0 0 0 0 
0 0 0 0.08 0 0 0 810.953 0 2229.61 0 1002.46 0 0 -622.806 0 0 0 0 0 0 0 0 0 0 0 0 0 0 0 0 0 0 0 0 0 0 0 0 0 0 0 0 -2402.04 0 2292.63 0 0 0 0 0 0 0 1711.25 0 0 0 0 0 0 
0 0 0 0 0.03 0 0 839.183 0 0 0 0 0 -30.7474 0 0 0 1825.69 0 0 0 0 0 0 2025.13 -1839.12 0 0 0 0 0 0 0 0 0 2379.45 0 0 0 0 0 0 0 0 0 0 0 0 0 0 0 0 0 0 0 0 0 0 0 0 
0 778.146 -1609.16 0 0 0.06 1069.14 0 0 2014.6 0 0 0 0 -28.1533 0 74.2363 0 0 0 -1149.86 0 0 0 0 0 0 0 0 0 0 0 0 0 -766.549 0 0 0 0 0 0 0 1759.93 385.372 0 0 0 -615.024 0 0 0 0 0 0 0 0 0 0 0 0 
0 0 0 0 0 -1310.24 0.05 0 1957.53 0 0 0 0 0 2376.71 0 0 0 0 0 0 0 0 1773.2 0 0 0 0 0 0 0 0 0 0 0 0 0 0 0 0 0 0 0 2152.09 0 0 0 0 0 0 0 0 0 0 0 0 0 0 0 0 
0 0 0 2290.03 -1917.86 0 0 0.08 0 -732.063 0 0 0 -345.393 0 0 0 0 0 0 0 -2396.69 0 2368.77 -1513.34 0 0 0 0 1860.64 0 -1136.13 -323.115 0 341.731 0 2008.5 0 0 1094.01 0 0 0 0 0 0 0 0 0 0 0 0 0 0 0 0 0 0 0 0 
0 0 0 0 0 0 695.288 0 0.03 313.044 0 0 0 0 0 0 1297.57 1072.5 0 0 0 0 0 523.011 -2493.9 0 0 0 0 0 0 0 0 0 0 0 0 0 0 0 0 1758.71 0 0 1472.59 0 0 0 0 0 0 0 0 0 0 0 0 0 0 0 
0 0 0 1180.53 0 565.584 0 -916.7 1905.35 0.02 0 -1766.18 0 0 0 0 0 0 0 0 0 0 0 0 1843.39 0 0 0 0 0 0 0 0 1789.07 0 0 0 0 -2318.41 0 0 0 -311.823 0 0 0 0 0 0 0 0 0 0 0 0 0 0 0 -372.25 0 
0 0 0 0 0 0 0 0 0 0 0.07 0 375.149 0 0 0 0 -585.421 0 0 0 0 0 0 0 0 0 0 0 0 0 0 0 -108.875 0 1174.89 0 0 0 1953.11 0 2354.88 0 0 0 0 0 0 1796.55 0 -2347.1 0 0 0 0 0 0 0 0 0 
0 0 0 -1572.85 0 0 0 0 0 1316.8 0 0.02 2427.98 0 0 0 0 0 0 0 0 0 0 0 -2072.28 0 0 0 0 0 0 0 0 0 0 0 0 0 0 834.91 0 0 0 0 0 -1581.7 0 0 203.635 0 0 0 0 0 0 0 0 0 0 0 
1926.86 0 0 0 0 0 0 0 0 0 2377.01 -489.288 0.08 0 0 0 0 665.838 0 0 -446.715 0 0 0 0 0 0 0 0 0 0 0 0 0 0 0 0 0 -365.078 0 0 0 0 0 0 0 0 0 0 0 0 0 0 0 0 0 0 0 0 0 
0 0 0 0 1077.53 0 0 1378.75 0 0 0 0 0 0.06 0 0 0 0 0 0 0 -2330.62 0 0 0 0 0 0 0 0 0 0 0 2047.56 0 0 -1387.45 0 -554.75 0 0 0 1435.67 0 0 0 0 0 0 1946.55 0 0 0 0 0 0 0 0 0 0 
0 0 0 199.057 0 2454.99 -2405.85 0 0 0 0 0 0 0 0.08 0 1282.46 0 0 0 0 0 0 0 179.983 0 0 0 0 0 0 0 -117.42 0 789.285 0 0 0 0 0 0 0 0 0 0 0 991.012 0 0 0 0 0 0 0 0 0 0 0 0 0 
0 0 0 0 0 0 0 0 0 0 0 0 0 0 0 0 0 0 0 2418.67 0 0 0 141.682 0 0 0 0 1593.14 0 0 903.882 0 0 0 0 0 0 0 0 0 -105.365 0 0 0 0 -307.855 0 0 0 0 0 0 0 0 0 0 0 0 0 
0 0 0 0 0 1983.93 0 0 1096.45 0 0 0 0 0 2243.03 0 0 0 0 0 0 0 0 0 0 0 0 0 0 0 0 0 0 -1785.87 0 0 1873.61 0 0 0 0 0 0 0 0 0 0 0 0 0 0 0 0 0 0 0 0 0 0 0 
0 0 0 0 149.77 0 0 0 2016.43 0 -1421.78 0 -1653.42 0 0 0 0 0.02 0 156.178 140.614 0 0 0 0 0 0 0 0 0 0 0 0 0 0 0 822.092 0 0 0 1818.52 0 0 0 0 0 0 0 0 0 0 0 0 0 0 0 0 0 0 0 
0 0 0 0 0 0 0 0 0 0 0 0 0 0 0 0 0 0 0.03 0 0 0 -1654.03 0 0 0 0 0 0 0 0 0 0 -1520.2 1242.64 0 0 0 2272.03 0 0 0 0 0 0 0 0 0 0 0 0 0 0 0 0 0 0 0 0 0 
0 -1830.73 0 0 0 0 0 0 0 0 0 0 0 0 0 889.233 0 949.66 0 0.05 0 0 -1455.35 0 0 0 0 0 0 0 0 0 -147.786 0 0 0 0 0 0 0 0 0 0 0 2052.75 0 0 0 0 0 0 0 0 0 0 0 0 761.208 0 0 
0 672.857 0 0 0 2421.11 0 0 0 0 0 0 -1350.06 0 0 0 0 -887.555 0 0 0.07 2017.96 -2246.24 0 0 0 0 1257.74 0 0 0 0 0 0 0 0 0 1137.2 0 0 0 0 0 0 0 0 0 0 0 0 0 0 0 0 0 0 0 0 0 0 
0 0 0 0 0 0 0 -1453.83 0 0 0 0 0 581.759 0 0 0 0 0 0 266.503 0.02 0 0 946.913 0 0 1833.48 0 0 0 -695.441 0 0 0 0 0 0 0 -196.005 0 0 0 0 0 1870.25 0 0 -800.272 0 0 0 0 0 0 0 0 0 0 0 
0 0 0 0 0 0 0 0 0 0 0 0 0 0 0 0 0 0 -2315.21 665.227 2006.67 0 0.07 0 0 0 0 -300.836 0 0 2330.16 0 0 0 -688.269 0 0 0 0 -2099.14 0 0 1402.25 1201.74 0 0 0 0 0 0 0 0 0 0 0 0 0 0 0 0 
1878.19 0 0 0 0 0 -787.912 332.728 1351.59 0 0 0 0 0 0 -20.8289 0 0 0 0 0 0 0 0.07 80.6452 0 0 0 -2259.21 0 0 0 0 0 0 0 0 0 0 0 0 0 -1624.73 0 0 0 0 0 0 0 0 1011.76 0 0 0 0 0 0 0 0 
0 0 0 0 -631.657 0 0 933.943 675.298 -107.959 0 -1814.71 0 0 871.685 0 0 0 0 0 0 2203.82 0 2297.97 0.06 408.261 -2346.03 0 1207.69 0 0 0 0 0 0 0 0 0 0 0 0 1726.97 1329.77 0 0 0 0 0 125.813 0 0 0 0 0 0 0 0 0 0 0 
0 0 0 0 645.695 0 0 0 0 0 0 0 0 0 0 0 0 0 0 0 0 0 0 0 978.652 0.06 0 0 0 0 -158.773 0 0 0 0 0 2210.07 0 0 0 0 0 2234.03 133.137 0 0 0 0 0 0 0 0 0 0 0 0 0 0 0 0 
0 0 660.649 0 0 0 0 0 0 0 0 0 0 0 0 0 0 0 0 0 0 0 0 0 -458.007 0 0.08 0 0 0 0 0 431.455 0 0 0 0 0 0 0 0 0 0 0 0 0 2375.33 0 0 0 0 0 0 0 0 0 0 0 0 0 
0 0 0 0 0 0 0 0 0 0 0 0 0 0 0 0 0 0 0 0 1059.98 1569.49 -1473.36 0 0 0 0 0.04 1725.75 0 0 0 0 0 0 0 0 0 0 0 0 0 0 0 -2451.93 148.091 0 0 0 0 0 0 0 0 0 0 0 0 0 0 
0 2153.16 0 0 0 0 0 0 0 0 0 0 0 0 0 903.882 0 0 0 0 0 0 0 -1392.94 -1061.05 0 0 524.842 0.07 0 0 2474.97 0 0 0 0 239.647 0 1175.19 0 0 -1630.53 0 0 0 0 0 0 0 0 0 0 0 0 0 0 0 0 0 0 
0 0 0 0 0 0 0 -580.386 0 0 0 0 0 0 0 0 0 0 0 0 0 0 0 0 0 0 0 0 0 0.09 0 0 0 0 0 1818.37 0 0 0 0 0 0 0 0 0 0 656.682 0 0 0 0 0 0 0 0 0 0 0 0 0 
0 0 0 0 0 0 0 0 0 0 0 0 0 0 0 0 0 0 0 0 0 0 2403.26 0 0 1516.24 0 0 0 0 0.05 0 0 0 0 345.241 0 0 0 0 0 0 0 0 -679.418 0 0 0 0 0 0 0 0 0 0 -1225.24 1124.68 0 0 0 
485.931 0 0 0 0 0 0 1774.27 0 0 0 0 0 0 0 1929.3 0 0 0 0 0 -635.014 0 0 0 0 0 0 881.146 0 0 0.05 0 0 0 0 0 0 0 -1730.32 -480.285 0 0 0 742.439 0 0 0 0 0 0 0 0 0 0 0 0 0 0 0 
966.75 0 0 0 0 0 0 -364.162 0 0 0 0 0 0 416.959 0 0 0 0 152.669 0 0 0 0 0 0 1222.04 0 0 0 0 0 0 0 0 0 0 0 0 0 0 910.749 0 0 0 0 0 0 0 -1910.08 0 0 0 0 0 0 0 0 0 0 
0 0 0 0 0 0 0 0 0 1503.57 2352.29 0 0 958.052 0 0 -294.122 0 1273.16 0 0 0 0 0 0 0 0 0 0 0 0 0 0 0.08 0 0 0 0 0 0 0 0 0 0 0 0 0 0 0 0 0 0 0 0 0 0 0 0 0 0 
0 0 0 0 0 677.282 0 -1345.03 0 0 0 0 0 0 2082.05 0 0 0 2263.79 0 0 0 -661.718 0 0 0 0 0 0 0 0 0 0 0 0.06 0 0 0 0 0 0 0 0 0 0 0 0 0 0 0 0 0 0 0 0 0 0 0 0 0 
0 2483.06 0 0 -2061.91 0 0 0 0 0 2179.1 0 0 0 0 0 0 0 0 0 0 0 0 0 0 0 0 0 0 -793.558 -1677.98 0 0 0 0 0.09 0 0 0 0 0 0 0 0 0 0 0 0 0 0 0 0 0 0 0 0 0 0 0 0 
0 0 0 0 0 0 0 2418.82 0 0 0 0 0 -870.769 0 0 -2278.74 2205.04 0 0 0 0 0 0 0 1455.05 0 0 2168.87 0 0 0 0 0 0 0 0.02 0 0 0 0 0 0 0 0 0 0 0 0 0 0 0 0 0 0 0 0 0 0 0 
0 0 0 0 0 0 0 0 0 0 0 0 0 0 0 0 0 0 0 0 1630.53 0 0 0 0 0 0 0 0 0 0 0 0 0 0 0 0 0.09 0 0 -98.4985 0 -150.99 0 0 0 2330.77 130.085 0 0 0 0 0 0 0 0 0 0 0 0 
0 0 0 0 0 0 0 0 0 2429.65 0 0 1257.74 2127.67 0 0 0 0 2131.34 0 0 0 0 0 0 0 0 0 -1025.04 0 0 0 0 0 0 0 0 0 0 0 0 761.971 2038.41 0 0 0 0 0 0 0 0 0 0 0 0 0 0 0 0 0 
0 0 0 0 0 0 0 1750.92 0 0 -162.893 1253.32 0 0 0 0 0 0 0 0 0 215.995 -1034.96 0 0 0 0 0 0 0 0 1632.66 0 0 0 0 0 0 0 0 0 0 -687.658 0 0 0 0 0 0 0 0 0 0 0 0 0 0 0 0 0 
0 0 0 0 0 0 0 0 0 0 0 0 0 0 0 0 0 1383.48 0 0 0 0 0 0 0 0 0 0 0 0 0 -1600.47 0 0 0 0 0 1970.5 0 0 0.03 0 0 310.755 557.649 0 0 0 -2304.22 0 0 0 0 0 0 0 0 0 0 0 
0 0 0 0 0 0 0 0 -134.358 0 2071.52 0 0 0 0 759.377 0 0 0 0 0 0 0 0 855.358 0 0 0 114.368 0 0 0 2141.87 0 0 0 0 0 -1898.63 0 0 0 0 0 442.289 0 0 0 1706.37 0 0 0 0 0 0 0 0 0 0 0 
0 0 0 0 0 -1582.77 0 0 0 2458.04 0 0 0 1121.33 0 0 0 0 0 0 0 0 2348.17 -9.07926 2326.96 -2235.4 0 0 0 0 0 0 0 0 0 0 0 1739.78 484.252 -2371.52 0 0 0.09 0 0 0 0 0 0 0 0 0 0 0 0 0 0 0 0 0 
0 0 0 2270.81 0 -706.885 -409.024 0 0 0 0 0 0 0 0 0 0 0 0 0 0 0 1970.35 0 0 1063.95 0 0 0 0 0 0 0 0 0 0 0 0 0 0 2437.59 0 0 0.08 0 0 0 0 0 0 0 0 0 0 0 0 0 0 0 0 
0 -1080.43 0 0 0 0 0 0 2319.18 0 0 0 0 0 0 0 0 0 0 357.295 0 0 0 0 0 0 0 -14.5726 0 0 2494.2 -2470.24 0 0 0 0 0 0 0 0 1608.71 -1148.18 0 0 0.06 0 2224.57 0 0 0 0 0 2118.37 0 0 0 0 0 0 0 
0 0 0 2158.65 0 0 0 0 0 0 0 2460.02 0 0 0 0 0 0 0 0 0 565.889 0 0 0 0 0 714.209 0 0 0 0 0 0 0 0 0 0 0 0 0 0 0 0 0 0.07 0 0 0 0 0 0 0 0 1216.39 0 0 0 0 0 
-83.3918 0 0 0 0 0 0 0 0 0 0 0 0 0 525.147 1681.65 0 0 0 0 0 0 0 0 0 0 1039.99 0 0 -619.907 0 0 0 0 0 0 0 -972.243 0 0 0 0 0 0 1160.24 0 0.04 0 0 0 0 0 0 0 0 0 0 0 0 0 
0 0 -417.875 0 0 1219.29 0 0 0 0 0 0 0 0 0 0 0 0 0 0 0 0 0 0 0 0 0 0 0 0 0 0 0 0 0 0 0 -261.925 0 0 0 0 0 0 0 0 0 0.05 1401.49 0 0 0 0 0 0 0 0 0 0 0 
0 0 0 0 0 0 0 0 0 0 1547.06 2015.52 0 0 0 0 0 0 0 0 0 2129.81 0 0 -837.046 0 0 0 0 0 0 0 0 0 0 0 0 0 0 0 -700.781 2176.66 0 0 0 0 0 -592.135 0 0 0 0 0 0 0 0 0 0 0 0 
0 0 0 0 0 0 0 0 0 0 0 0 0 879.62 0 0 0 0 0 0 0 0 0 0 0 0 0 0 0 0 0 0 685.827 0 0 0 0 0 0 0 0 0 0 0 0 0 0 0 0 0 0 0 0 0 0 0 0 0 0 0 
0 0 0 0 0 0 0 0 0 0 1324.12 0 0 0 0 0 0 0 0 0 0 0 0 0 0 0 0 0 0 0 0 0 0 0 0 0 0 0 0 0 0 0 0 0 0 0 0 0 0 0 0.08 0 0 0 0 0 0 0 0 0 
0 0 0 0 0 0 0 0 0 0 0 0 0 0 0 0 0 0 0 0 0 0 0 1216.7 0 0 0 0 0 0 0 0 0 0 0 0 0 0 0 0 0 0 0 0 0 0 0 0 0 0 0 0.01 0 0 0 0 0 0 0 0 
0 0 0 0 0 0 0 0 0 0 0 0 0 0 0 0 0 0 0 0 0 0 0 0 0 0 0 0 0 0 0 0 0 0 0 0 0 0 0 0 0 0 0 0 879.772 0 0 0 0 0 0 0 0 0 0 0 0 0 0 0 
0 0 0 112.232 0 0 0 0 0 0 0 0 0 0 0 0 0 0 0 0 0 0 0 0 0 0 0 0 0 0 0 0 0 0 0 0 0 0 0 0 0 0 0 0 0 0 0 0 0 0 0 0 0 0.07 0 0 0 0 0 0 
0 0 0 0 0 0 0 0 0 0 0 0 0 0 0 0 0 0 0 0 0 0 0 0 0 0 0 0 0 0 0 0 0 0 0 0 0 0 0 0 0 0 0 0 0 423.063 0 0 0 0 0 0 0 0 0 0 0 0 0 0 
0 0 0 0 0 0 0 0 0 0 0 0 0 0 0 0 0 0 0 0 0 0 0 0 0 0 0 0 0 0 412.076 0 0 0 0 0 0 0 0 0 0 0 0 0 0 0 0 0 0 0 0 0 0 0 0 0.03 0 0 0 0 
0 0 0 0 0 0 0 0 0 0 0 0 0 0 0 0 0 0 0 0 0 0 0 0 0 0 0 0 0 0 1255.3 0 0 0 0 0 0 0 0 0 0 0 0 0 0 0 0 0 0 0 0 0 0 0 0 0 0.07 0 0 947.523 
0 0 0 0 0 0 0 0 0 0 0 0 0 0 0 0 0 0 0 1092.33 0 0 0 0 0 0 0 0 0 0 0 0 0 0 0 0 0 0 0 0 0 0 0 0 0 0 0 0 0 0 0 0 0 0 0 0 0 0.01 0 0 
0 0 0 0 0 0 0 0 0 2314.29 0 0 0 0 0 0 0 0 0 0 0 0 0 0 0 0 0 0 0 0 0 0 0 0 0 0 0 0 0 0 0 0 0 0 0 0 0 0 0 0 0 0 0 0 0 0 0 0 0.06 0 
0 0 0 0 0 0 0 0 0 0 0 0 0 0 0 0 0 0 0 0 0 0 0 0 0 0 0 0 0 0 0 0 0 0 0 0 0 0 0 0 0 0 0 0 0 0 0 0 0 0 0 0 0 0 0 0 407.346 0 0 0 
