*Vertices 55
*Matrix 
0.09 -1002.91 0 0 0 1078.6 -1739.48 0 0 2437.89 0 0 0 953.627 1903.67 0 0 1416.14 0 0 0 0 1491.67 0 -1900.92 0 0 -1139.64 -72.2526 -1050.83 0 0 2183.83 0 978.042 0 0 1040.3 -795.236 462.432 0 0 -1332.51 2245.32 0 0 0 0 0 0 0 95.1415 0 0 0 
323.42 0.02 0 -303.888 0 1051.44 0 0 1067.92 0 0 0 0 2285.45 0 1209.83 0 0 0 0 -1840.49 0 0 0 0 0 0 0 2236.63 0 0 0 -1676.92 1597.87 0 -1692.18 -215.079 0 1933.12 0 0 0 -1450.47 2032 0 0 0 0 0 0 0 0 0 0 0 
0 0 0.07 0 0 1690.5 1025.19 0 0 0 0 0 0 0 0 0 -1417.05 2051.99 -336.238 0 0 0 0 1820.81 0 0 0 -1525.54 0 0 0 0 0 0 490.051 0 0 0 0 1329.46 0 0 0 0 0 0 0 0 0 0 631.657 0 0 0 0 
0 1056.02 0 0.07 0 -249.565 0 0 -2096.85 0 0 2302.24 2363.58 0 0 0 0 0 1618.17 0 0 0 1997.51 1308.1 100.482 0 917.615 0 0 0 467.925 0 419.553 0 0 0 0 0 0 0 0 0 0 0 308.924 0 -1662.72 0 0 0 0 0 0 0 0 
0 0 0 0 0.04 1793.04 1156.88 0 0 0 0 0 0 0 510.956 0 0 -1358.91 1007.8 0 1255.91 0 0 228.813 0 0 0 0 0 0 0 0 0 161.061 0 -2298.73 0 2057.94 0 0 -719.703 0 0 0 0 0 0 0 0 0 0 0 0 0 0 
51.6526 -909.375 1600.62 824.229 -1034.96 0.06 1946.7 0 0 0 -736.335 0 0 0 0 0 0 0 0 0 0 0 886.944 0 0 0 0 0 0 0 0 0 0 0 0 0 0 -1106.98 2246.09 0 0 0 0 1689.28 761.361 0 -1489.23 0 0 464.11 0 925.092 -1609.78 0 -1660.44 
-889.996 0 -1224.33 0 2118.98 2189.17 0.02 -2457.12 0 0 0 0 0 0 -1767.71 762.886 2256.92 0 0 0 0 0 0 0 0 0 0 0 0 0 2337.49 1807.23 -463.5 0 0 -1426.51 0 -296.716 0 0 0 0 0 1932.36 1154.29 0 0 464.568 0 472.198 0 0 0 0 0 
0 0 0 0 0 0 -1236.23 0.01 0 0 -792.337 1037.1 -2027.57 0 0 0 -205.618 0 0 0 0 0 0 -1707.13 1894.06 0 0 -859.172 1330.84 0 -1300.78 2116.84 0 0 -362.484 0 0 0 0 0 0 1748.48 0 1682.1 0 0 0 0 0 0 291.986 0 0 0 0 
0 -1730.78 0 615.635 0 0 0 0 0.08 0 0 0 309.229 0 0 0 1284.3 -2396.69 -591.983 0 0 0 0 0 0 0 823.466 0 0 1595.13 474.639 -120.472 779.519 2429.65 0 0 0 0 1470.31 0 0 0 0 -127.491 0 -2391.35 0 0 0 0 0 0 189.291 0 0 
1424.53 0 0 0 0 0 0 0 0 0.01 -605.564 1445.43 0 1204.64 2042.38 1068.99 0 0 0 0 2452.85 0 -577.029 0 159.383 0 0 0 2444.76 244.072 0 0 -1807.38 0 0 0 0 0 0 -583.438 0 2411.34 0 0 891.675 0 -199.515 -1424.22 0 0 -477.538 0 2389.37 0 0 
0 0 0 0 0 872.295 0 -579.012 0 -119.861 0.05 -1173.36 0 0 0 0 2255.39 -82.0185 0 0 -1374.48 0 0 1253.17 0 0 728.248 0 0 0 0 0 0 0 0 0 0 0 0 0 553.529 0 275.658 0 0 0 0 0 0 0 0 0 0 0 0 
0 0 0 664.769 0 0 0 1453.98 0 -1368.22 2434.84 0 0 0 -1302.15 -2152.39 1914.66 378.506 0 0 0 0 0 0 -675.298 0 0 1249.05 0 0 0 1353.42 0 0 0 0 0 828.959 0 -789.59 0 0 0 0 0 0 0 0 0 0 0 0 -202.261 0 -2113.03 
0 0 0 -1680.58 0 0 0 -516.297 120.624 0 0 0 0.03 0 0 -804.392 1426.05 0 0 353.328 0 0 1033.59 0 0 0 432.981 1975.23 0 2418.97 0 0 0 0 0 0 0 2287.9 0 0 0 0 0 0 -835.521 -1194.88 0 0 -1905.35 0 512.024 0 0 0 0 
972.091 -1083.18 0 0 0 0 0 0 0 650.121 0 0 0 0 0 1256.83 0 0 0 0 0 823.771 1357.54 1942.88 0 0 0 0 0 -1313.9 0 0 0 0 2411.04 0 1295.43 0 595.95 0 0 0 0 0 0 0 0 0 0 0 0 0 0 0 0 
-2200.77 0 0 0 992.233 0 -2199.09 0 0 -529.115 0 -1148.79 0 0 0.07 0 0 1116.14 0 0 0 479.98 0 861.156 0 807.901 0 0 0 2434.23 0 0 -439.695 2316.58 -608.005 2416.53 0 0 0 0 -240.41 0 0 0 0 0 -1252.1 0 0 0 1096.91 0 0 1807.99 0 
0 -1427.58 0 0 0 0 -2379.76 0 0 2127.83 0 -489.288 816.904 -52.7207 0 0.04 736.946 0 133.9 0 0 0 0 2371.97 0 0 0 0 1972.49 0 937.605 0 0 0 0 0 0 0 1835.15 0 0 -1371.73 0 1728.03 815.836 0 0 395.749 0 0 0 -548.189 0 0 0 
0 0 2380.67 0 0 0 -324.488 2323.6 1334.8 0 625.858 2328.94 -93.4629 0 0 692.846 0.03 0 0 0 0 0 0 2427.37 0 1720.4 0 0 0 0 0 0 0 0 0 0 -2131.18 -430.998 -887.097 1175.95 2420.5 0 0 0 -1422.09 -509.583 849.406 -96.2096 0 0 0 0 0 0 0 
-2213.74 0 -462.127 0 1603.82 0 0 0 1289.03 0 -542.085 -721.229 0 0 1429.26 0 0 0.04 2379.15 0 0 0 0 0 -546.358 0 25.4067 0 -1244.47 0 0 0 0 2284.69 0 0 0 0 0 0 0 615.177 0 164.876 0 0 -812.784 0 0 0 0 -2419.13 0 0 0 
0 0 -1040.45 416.044 2398.68 0 0 0 -240.867 0 0 0 0 0 0 -686.438 0 -218.741 0.02 0 0 0 0 0 0 51.3474 1023.67 2212.06 0 -2354.73 0 -1132.01 -544.069 0 0 0 0 0 0 0 1724.98 1586.58 0 0 -1757.33 2082.81 0 -962.935 0 0 0 0 0 0 0 
0 0 0 0 0 0 0 0 0 0 0 0 -2429.04 0 0 0 0 0 0 0.04 0 0 0 0 2246.54 0 253.227 0 0 2041.31 0 0 0 0 827.891 0 0 0 784.402 0 0 0 0 0 0 0 0 -1779.61 0 0 0 0 0 0 0 
0 394.833 0 0 875.805 0 0 0 0 991.623 1743.6 0 0 0 0 0 0 0 0 0 0.01 -2398.98 0 0 -1277.28 0 0 2456.51 0 738.319 -587.863 0 0 0 0 -1728.34 0 0 0 0 1931.44 0 2277.83 2208.09 1241.26 0 2465.21 0 0 304.041 0 73.6259 0 0 0 
0 0 0 0 0 0 0 0 0 0 0 0 0 -283.441 2314.45 0 0 0 0 0 1750.47 0.01 1994.16 0 0 0 0 0 0 0 -294.58 0 0 0 0 0 -2136.22 0 0 0 0 0 94.3785 0 -191.885 -320.978 0 0 0 0 0 0 -1293.15 0 0 
2044.36 0 0 2273.4 0 1862.32 0 0 0 2122.94 0 0 -1340.14 -2073.5 0 0 0 0 0 0 0 2168.42 0.05 0 0 -2154.68 0 -459.38 1948.38 0 0 0 0 0 0 2297.81 0 0 -1786.17 0 13.3518 0 -561.464 0 0 0 0 0 2114.4 -135.731 0 0 0 0 -365.993 
0 0 -172.811 577.181 2033.07 0 0 -613.498 0 0 2004.99 0 0 2471.77 1146.35 868.48 1254.23 0 0 0 0 0 0 0.09 0 0 0 0 321.131 0 0 0 0 0 -394.375 0 0 0 0 0 0 0 0 0 0 0 0 0 0 0 0 0 0 836.436 -2162.62 
1951.58 0 0 -994.522 0 0 0 1889.78 0 299.005 0 -2232.96 0 0 0 0 0 -609.836 0 2265.77 698.187 0 0 0 0.03 0 -2155.45 1419.95 -307.245 0 -1415.98 1046.56 0 1817.76 2097.61 0 0 -309.229 629.826 0 647.374 0 0 0 0 0 0 0 0 0 1493.96 0 0 0 0 
0 0 0 0 0 0 0 0 0 0 0 0 0 0 802.713 0 221.183 0 848.186 0 0 0 132.984 0 0 0.08 0 0 2469.63 0 0 0 2431.18 0 0 -1874.68 0 0 0 0 0 594.424 0 -1809.37 0 -1614.81 0 0 0 0 0 0 0 0 0 
0 0 0 1759.01 0 0 0 0 143.208 0 2226.25 0 1135.98 0 0 0 0 -815.836 -24.4911 -841.166 0 0 0 0 -2369.84 0 0.06 0 0 0 0 0 0 0 0 0 0 0 0 1366.39 0 0 0 0 0 0 0 0 0 0 0 0 1205.71 0 0 
-2122.79 0 237.663 0 0 0 0 -270.775 0 0 0 407.346 809.122 0 0 0 0 0 2122.03 0 1289.64 0 -1691.41 0 365.23 0 0 0.01 1135.98 1522.19 0 0 0 1545.23 0 1308.86 0 0 0 1381.19 -1184.96 0 0 0 0 0 105.518 0 0 0 0 0 1168.94 0 0 
929.518 -415.128 0 0 0 0 0 -1503.72 0 1685.46 0 0 0 0 0 671.941 0 -1874.22 0 0 0 0 -774.789 -69.0481 -2367.7 -835.063 0 1304.9 0.06 0 -1707.43 307.092 2429.5 0 0 -332.728 0 0 1395.08 0 1737.04 0 0 1166.04 0 0 0 0 0 0 0 0 0 0 0 
2212.52 0 0 0 0 0 0 0 722.297 2184.29 0 0 335.017 1482.36 -1323.51 0 0 0 -509.735 379.574 -1321.99 0 0 0 0 0 0 2045.73 0 0.01 0 0 0 0 0 0 0 0 0 0 -1093.1 0 0 0 0 0 0 0 0 0 0 0 1.90741 0 0 
0 0 0 -1520.05 0 0 1161.46 1120.87 -1123.77 0 0 0 0 0 0 1101.34 0 0 0 0 1731.09 2215.87 0 0 -1007.03 0 0 0 -1658.45 0 0.05 0 0 0 -2489.47 0 0 0 0 538.27 1920.76 1872.39 0 0 340.815 0 0 0 0 0 -718.94 0 0 0 0 
0 0 0 0 0 0 2082.2 452.666 -346.309 0 0 316.858 0 0 0 0 0 0 -181.509 0 0 0 0 0 -204.398 0 0 0 1589.63 0 0 0.07 0 0 0 0 0 0 -1288.42 0 0 0 0 150.838 123.981 0 2348.78 0 0 -2033.22 0 -1258.66 0 0 0 
1995.07 -977.432 0 454.497 0 0 2433.93 0 914.869 -1262.02 0 0 0 0 1334.5 0 0 0 -1694.16 0 0 0 0 0 0 2211.45 0 0 -1930.98 0 0 0 0.06 0 0 0 0 2409.82 -218.589 2151.17 0 0 -834.3 -286.492 0 0 0 0 0 0 0 0 0 0 0 
0 2033.98 0 0 -868.938 0 0 0 -626.469 0 0 0 0 0 -1202.51 0 0 329.066 0 0 0 0 0 0 669.5 0 0 305.719 0 0 0 0 0 0.01 0 987.198 0 2151.78 0 1289.03 0 -978.652 806.986 -1498.84 0 0 0 0 0 -716.803 0 1660.28 0 0 0 
1106.37 0 -1217.76 0 0 0 0 -393.765 0 0 0 0 0 -252.007 1349.6 0 0 0 0 -63.2496 0 0 0 1927.32 1653.11 0 0 0 0 0 2111.35 0 0 0 0 0 0 1190.15 998.184 -1625.03 0 0 0 2267.14 0 0 0 272.301 0 0 0 0 0 0 2290.34 
0 -2124.62 0 0 -243.767 0 1594.36 0 0 0 0 0 0 0 2458.49 0 0 0 0 0 1535.77 0 1500.52 0 0 -647.832 0 2418.82 -256.432 0 0 0 0 -1028.4 0 0.08 -1459.01 0 0 0 0 0 0 1892.38 0 0 0 0 0 0 0 0 183.34 0 0 
0 2133.01 0 0 0 0 0 0 0 0 0 0 0 -149.312 0 0 20.2185 0 0 0 0 -2351.22 0 0 0 0 0 0 0 0 0 0 0 0 0 2386.78 0.05 0 0 0 0 0 0 0 0 -1946.55 0 0 0 0 0 0 0 0 0 
1729.1 0 0 0 -2169.33 2446.13 589.236 0 0 0 0 -372.707 -200.278 0 0 0 1776.25 0 0 0 0 0 0 0 1224.02 0 0 0 0 0 0 0 -2385.71 1085.01 -69.5059 0 0 0.04 0 1156.88 0 -2195.73 0 0 0 1916.79 2389.68 2485.66 0 0 0 0 0 0 1106.98 
-627.232 303.583 0 0 0 500.427 0 0 1748.33 0 0 0 0 1269.65 0 -952.406 1632.97 0 0 2122.18 0 0 53.7889 0 -815.836 0 0 0 -55.62 0 0 -2339.32 566.042 0 -873.211 0 0 0 0.05 0 779.061 0 542.085 -17.1667 0 0 0 0 0 0 0 0 0 -2375.48 -871.532 
1108.36 0 -965.529 0 0 0 0 0 0 898.541 0 546.51 0 0 0 0 808.512 0 0 0 0 0 0 0 0 0 1895.58 173.269 0 0 1229.06 0 1062.58 886.334 1672.49 0 0 266.808 0 0 0 0 0 0 186.239 0 0 0 0 0 0 0 0 -871.838 0 
0 0 0 0 2127.52 0 0 0 0 0 1115.22 0 0 0 1475.95 0 1324.58 0 2191.92 0 2409.21 0 2430.88 0 -1559.27 0 0 -924.329 -1963.18 2163.84 978.957 0 0 0 0 0 0 0 2226.86 0 0.02 -2338.56 0 0 0 0 0 0 1138.57 0 0 0 0 0 0 
0 0 0 0 0 0 0 2202.14 0 2222.89 0 0 0 0 0 -2410.58 0 1274.53 -1353.57 0 0 0 0 0 0 905.866 0 0 0 0 415.128 0 0 472.503 0 0 0 1287.19 0 0 1566.74 0.03 1752.91 0 0 0 0 0 0 0 0 0 0 0 0 
-651.036 1943.34 0 0 0 0 0 0 0 0 300.989 0 0 0 0 0 0 0 0 0 -1573.92 2173.3 14.5726 0 0 0 0 0 0 0 0 0 -1893.6 -1130.94 0 0 0 0 884.808 0 0 -337.458 0.06 1352.5 0 0 6.48518 0 0 0 0 356.685 0 503.632 0 
764.565 -1329.46 0 0 0 65.5385 -907.086 2144.92 1812.88 0 0 0 0 0 0 250.328 0 15.4881 0 0 -211.264 0 0 0 0 1685.31 0 0 -514.618 0 0 1857.59 1967.6 2412.41 -1844.16 469.604 0 0 -2415.16 0 0 0 777.535 0 0 0 0 0 0 0 0 0 0 0 0 
0 0 0 -1910.84 0 186.85 1385.01 0 0 -1940.14 0 0 -753.883 0 0 1821.12 -650.273 0 -1005.97 0 1941.51 -888.47 0 0 0 0 0 0 0 0 842.54 -361.873 0 0 0 0 0 0 0 2312.77 0 0 0 0 0.03 0 0 0 -51.3474 0 0 0 0 0 2456.82 
0 0 0 0 0 0 0 0 362.178 0 0 0 1846.45 0 0 0 -1550.26 0 -249.26 0 0 1464.96 0 0 0 -555.208 0 0 0 0 0 0 0 0 0 0 2195.73 1293.15 0 0 0 0 0 0 0 0.03 0 0 2293.85 0 0 0 0 0 828.349 
0 0 0 1534.09 0 -1377.07 0 0 0 -474.639 0 0 0 0 56.8407 0 -8.01111 762.276 0 0 1480.22 0 0 0 0 0 0 -917.158 0 0 0 620.06 0 0 0 0 0 1492.28 0 0 0 0 949.507 0 0 0 0.07 0 0 0 0 0 0 0 0 
0 0 0 0 0 0 -215.232 0 0 -393.46 0 0 0 0 0 1721.02 1473.05 0 205.771 775.552 0 0 0 0 0 0 0 0 0 0 0 0 0 0 -275.811 0 0 2397 0 0 0 0 0 0 0 0 0 0 0 0 0 0 0 0 0 
0 0 0 0 0 0 0 0 0 0 0 0 1660.89 0 0 0 0 0 0 0 0 0 1503.42 0 0 0 0 0 0 0 0 0 0 0 0 0 0 0 0 0 121.235 0 0 0 -2418.52 1422.7 0 0 0.09 0 0 -1672.34 0 0 0 
0 0 0 0 0 -971.023 1019.55 0 0 0 0 0 0 0 0 0 0 0 0 0 -732.368 0 400.784 0 0 0 0 0 0 0 0 1508.3 0 2098.99 0 0 0 0 0 0 0 0 0 0 0 0 0 0 0 0.06 0 0 0 0 0 
0 0 1549.04 0 0 0 0 -123.676 0 -2379.45 0 0 1512.57 0 1427.88 0 0 0 0 0 0 0 0 0 1725.44 0 0 0 0 0 -816.446 0 0 0 0 0 0 0 0 0 0 0 0 0 0 0 0 0 0 0 0.09 0 0 0 0 
2389.52 0 0 0 0 1202.2 0 0 0 0 0 0 0 0 0 1229.21 0 -1760.38 0 0 1463.59 0 0 0 0 0 0 0 0 0 0 -94.8363 0 -2033.68 0 0 0 0 0 0 0 0 2276.3 0 0 0 0 0 -1730.63 0 0 0.08 0 0 0 
0 0 0 0 0 1677.07 0 0 1900.46 -865.123 0 1436.43 0 0 0 0 0 0 0 0 0 -840.556 0 0 0 0 2443.54 1059.68 0 -11.5207 0 0 0 0 0 1376.16 0 0 0 0 0 0 0 0 0 0 0 0 0 0 0 0 0.03 0 0 
0 0 0 0 0 0 0 0 0 0 0 0 0 0 191.427 0 0 0 0 0 0 0 0 1213.49 0 0 0 0 0 0 0 0 0 0 0 0 0 0 2307.43 -282.22 0 0 2342.98 0 0 0 0 0 0 0 0 0 0 0.06 0 
0 0 0 0 0 538.423 0 0 0 0 0 1989.88 0 0 0 0 0 0 0 0 0 0 1249.81 -2010.48 0 0 0 0 0 0 0 0 0 0 -696.203 0 0 2477.42 -390.866 0 0 0 0 0 2069.99 -2062.97 0 0 0 0 0 0 0 0 0.08 
