*Vertices 59
*Matrix 
0.03 0 0 0 1025.04 0 0 0 0 0 -439.543 -1978.9 0 0 0 0 1508.15 0 0 0 0 0 0 0 1487.7 0 0 0 0 -109.638 0 0 0 541.017 0 -2280.88 0 -28.3059 0 0 0 0 0 0 0 0 2243.19 0 0 0 0 0 0 0 0 0 0 0 0 
0 0 0 656.529 0 423.368 0 0 0 0 0 0 -1927.02 0 744.728 0 0 0 0 0 0 0 -1012.53 0 0 0 0 0 0 2340.85 0 0 0 0 0 0 0 2499.24 0 892.438 0 0 0 0 0 0 0 0 -1414 0 0 0 0 0 0 0 0 954.39 0 
0 0 0.08 0 0 0 0 0 0 0 0 0 0 -2148.27 0 0 0 0 0 1113.09 0 0 0 0 0 0 0 0 0 0 727.79 0 0 0 0 0 1310.54 0 0 2385.25 0 0 0 0 2315.97 0 0 0 0 0 0 0 0 0 0 2266.53 1618.32 0 0 
0 1279.11 0 0.02 -298.547 0 0 0 0 0 0 0 0 0 1080.58 0 0 0 1102.25 0 0 0 0 0 0 0 0 0 0 -565.127 0 0 0 0 0 0 0 0 0 0 0 0 0 0 0 0 -22.0496 0 0 0 102.924 0 669.652 0 0 0 511.261 0 0 
2000.26 0 0 -275.048 0.05 0 0 0 0 0 0 0 0 0 0 0 0 0 0 0 0 0 0 0 0 0 -1651.89 -286.187 0 1720.56 0 0 0 0 0 -861.309 0 0 0 0 0 2498.63 0 0 0 0 0 0 1213.19 0 0 0 -322.657 0 0 0 0 0 0 
0 125.965 0 0 0 0.02 0 0 0 0 0 -2051.53 0 0 0 850.017 -1702.25 1721.02 2483.52 2406.16 2313.84 1287.96 0 0 0 0 0 0 0 210.807 0 0 -385.678 0 0 0 0 2208.7 0 1043.96 0 0 0 0 0 481.964 0 0 0 2039.78 0 -2161.24 0 0 0 0 0 0 0 
0 0 0 0 0 0 0 2351.99 0 0 0 0 0 0 0 0 0 0 0 0 0 -442.9 0 0 0 0 0 -1045.79 0 0 0 0 0 0 0 -700.171 -362.636 0 0 0 -1694.46 632.725 0 0 0 0 0 0 0 0 0 861.461 0 0 0 0 0 2107.53 0 
0 0 0 0 0 0 -1692.02 0 2085.1 0 0 2079.45 0 0 0 0 0 0 0 0 0 0 0 0 0 2057.18 2045.12 -2435.15 0 0 0 0 0 0 0 0 0 0 0 163.961 0 0 0 0 0 0 0 0 0 0 0 1859.11 0 0 0 0 0 0 0 
0 0 0 0 0 0 0 -1313.29 0 0 0 0 0 0 0 0 0 -1139.64 0 0 0 0 0 0 0 0 0 0 0 0 0 0 0 0 0 0 0 0 0 0 0 0 0 955.306 0 1658.3 0 0 0 0 0 0 0 0 0 0 0 0 0 
0 0 0 0 0 0 0 0 0 0.09 0 250.786 0 0 0 0 0 0 0 0 0 0 0 -535.524 0 0 0 0 0 0 0 383.236 0 0 283.288 0 0 -1456.11 0 0 0 0 0 0 0 0 0 1879.86 0 0 0 -1936.63 698.798 1072.34 0 0 0 0 0 
1465.88 0 0 0 0 0 0 0 0 0 0.07 1861.09 0 0 0 1444.52 0 0 0 0 306.33 0 0 0 0 -415.586 0 0 -1426.36 0 0 0 -1402.55 0 0 0 0 2016.74 0 2452.85 0 0 758.309 0 0 -556.124 0 0 0 2125.54 0 0 0 0 0 0 0 0 0 
1488.46 0 0 0 0 1775.49 0 -55.62 0 1534.24 1528.6 0 973.312 0 0 0 0 0 0 -53.1785 0 0 0 1227.38 0 0 0 0 1142.23 0 0 0 0 0 80.4926 0 0 0 0 0 0 0 0 1207.85 649.815 0 0 0 0 0 0 0 0 0 0 0 0 0 0 
0 2108.75 0 0 0 0 0 0 0 0 0 1987.14 0.01 0 0 0 0 0 1016.8 -2104.33 -290.155 0 0 0 0 0 0 0 0 0 1165.27 0 0 0 0 0 0 0 0 0 0 -2137.9 0 0 0 0 0 0 0 1533.17 0 0 0 0 0 0 0 0 0 
0 0 2398.83 0 0 0 0 0 0 0 0 0 0 0 0 0 0 0 0 0 0 0 0 0 0 2323.76 0 2277.67 0 0 0 0 0 0 0 0 0 0 0 0 0 0 0 0 0 0 0 0 0 -1411.86 0 0 0 0 0 0 0 0 24.1859 
0 2086.78 0 -2482.15 0 0 0 0 0 0 0 0 0 0 0.05 0 0 0 0 0 0 0 0 0 0 0 0 0 0 0 0 0 0 0 0 0 1826.46 0 0 1812.72 0 0 0 1991.56 0 0 18.9978 0 2017.04 345.241 0 0 0 1141.32 0 521.027 0 0 0 
0 0 0 0 0 1740.09 0 0 0 0 532.472 0 0 0 0 0.05 0 0 0 0 0 0 0 0 0 0 0 0 0 2410.73 0 0 0 0 0 0 0 0 0 -880.383 0 0 -2458.04 0 0 0 0 0 0 414.06 0 0 0 0 0 0 0 0 0 
991.623 0 0 0 0 2247.46 0 0 0 0 0 0 0 0 0 0 0.01 0 0 0 0 -284.661 0 0 0 0 0 0 0 0 1546.14 0 0 0 0 380.947 1889.93 0 0 0 0 0 0 0 0 608.615 0 0 0 0 0 0 0 0 -1602.45 2359.77 -256.127 0 0 
0 0 0 0 0 2134.69 0 0 -954.39 0 0 0 0 0 0 0 0 0.08 0 0 0 0 0 0 0 0 1914.5 2066.03 0 0 0 0 0 0 0 0 0 0 0 -882.061 2184.44 0 0 1720.56 0 0 0 -2198.32 0 0 0 842.845 0 -595.645 -2091.97 0 0 0 0 
0 0 0 -682.165 0 -405.667 0 0 0 0 0 0 -890.912 0 0 0 0 0 0.07 0 0 2029.4 0 0 0 0 0 0 0 0 0 0 0 0 0 0 0 0 0 0 0 0 0 0 0 0 0 0 0 0 425.352 76.8303 0 86.4437 0 0 0 0 0 
0 0 2012.16 0 0 97.2777 0 0 0 0 0 2105.7 -725.196 0 0 0 0 0 0 0.02 0 0 0 0 0 -2362.67 0 0 0 0 0 0 0 0 0 0 0 0 0 0 0 0 0 2287.74 -2089.83 0 0 0 0 0 0 0 0 1681.34 0 0 0 0 0 
0 0 0 0 0 -710.395 0 0 0 0 -312.281 0 -2300.87 0 0 0 0 0 0 0 0 0 0 -963.546 0 2378.08 412.381 0 0 0 0 0 0 0 0 0 0 0 0 0 0 0 0 0 0 0 1660.28 0 409.94 0 0 0 0 0 0 0 0 0 0 
0 0 0 0 0 2466.12 1153.83 0 0 0 0 0 0 0 0 0 1338.92 0 -819.041 0 0 0.03 1914.81 0 -790.353 -2208.55 0 0 0 0 0 0 0 -371.029 0 0 -1121.94 0 0 0 0 0 0 0 0 0 0 0 0 0 0 0 0 0 0 0 0 0 0 
0 2371.52 0 0 0 0 0 0 0 0 0 0 0 0 0 0 0 0 0 0 0 1788.61 0.07 0 0 0 0 509.43 0 0 0 0 -680.334 -240.715 0 0 0 0 0 0 0 0 -1298.18 0 0 0 0 0 0 0 0 0 2432.55 0 2370.75 0 1782.82 0 0 
0 0 0 0 0 0 0 0 0 1710.03 0 -274.285 0 0 0 0 0 0 0 0 -1626.1 0 0 0.09 0 0 1510.74 0 0 0 -80.6452 0 0 0 0 0 0 0 0 0 0 0 0 -1068.68 0 0 0 2119.59 0 0 -284.967 0 0 0 0 0 0 0 0 
1022.6 0 0 0 0 0 0 0 0 0 0 0 0 0 0 0 0 0 0 0 0 2023.3 0 0 0.05 0 0 2066.64 0 0 0 0 0 0 0 0 0 0 0 0 0 0 0 0 0 0 0 0 0 0 0 0 0 2340.69 0 0 0 0 0 
0 0 0 0 0 0 0 2346.49 0 0 -1251.34 0 0 -356.838 0 0 0 0 0 1481.29 1320.76 1975.54 0 0 0 0.09 0 0 0 0 0 0 940.657 0 0 0 0 0 0 0 0 0 0 0 0 0 0 0 0 0 0 0 0 0 0 0 1653.42 0 0 
0 0 0 0 -1344.26 0 0 -2041.46 0 0 0 0 0 0 0 0 0 2027.57 0 0 2327.42 0 0 2175.59 0 0 0.03 0 0 0 0 0 0 0 0 289.087 0 0 0 0 0 0 0 0 0 577.334 0 0 0 0 0 0 0 0 0 0 0 0 0 
0 0 0 0 1688.51 0 824.992 -1583.68 0 0 0 0 0 681.555 0 0 0 2064.81 0 0 0 0 -2220.91 0 104.907 0 0 0.08 0 0 0 0 0 0 0 0 0 0 1278.04 0 0 0 -613.804 0 0 0 -1843.7 0 0 0 0 0 -136.341 0 0 0 0 0 0 
0 0 0 0 0 0 0 0 0 0 1255.61 1479 0 0 0 0 0 0 0 0 0 0 0 0 0 0 0 0 0.06 0 -1192.13 0 0 1502.5 1969.44 0 0 0 0 0 0 0 0 0 1281.09 0 0 0 0 0 0 0 0 0 -969.344 0 0 0 0 
2112.42 -300.989 0 829.875 -427.488 -414.365 0 0 0 0 0 0 0 0 0 2034.9 0 0 0 0 0 0 0 0 0 0 0 0 0 0.04 0 0 0 0 0 0 0 0 0 0 0 0 0 0 0 0 0 0 0 0 0 0 0 0 0 0 0 0 0 
0 0 1769.08 0 0 0 0 0 0 0 0 0 -1251.79 0 0 0 -617.161 0 0 0 0 0 0 1667.15 0 0 0 0 -527.131 0 0.05 0 0 0 0 0 0 0 -2180.01 0 0 0 0 0 161.672 0 0 0 0 0 0 0 1964.25 428.251 0 0 0 0 0 
0 0 0 0 0 0 0 0 0 561.922 0 0 0 0 0 0 0 0 0 0 0 0 0 0 0 0 0 0 0 0 0 0.01 0 0 0 0 1808.3 0 0 2380.98 -1770 1302.3 0 0 0 0 0 1659.52 0 -1158.86 0 0 0 0 2281.79 0 0 0 0 
0 0 0 0 0 1988.66 0 0 0 0 1197.16 0 0 0 0 0 0 0 0 0 0 0 -4.34889 0 0 -1825.39 0 0 0 0 0 0 0.04 0 0 0 0 1998.28 0 -789.285 311.823 0 0 0 0 0 0 -1453.83 0 0 -405.057 0 0 0 0 0 0 0 0 
2472.53 0 0 0 0 0 0 0 0 0 0 0 0 0 0 0 0 0 0 0 0 1904.58 1993.55 0 0 0 0 0 -1567.66 0 0 0 0 0.05 0 0 0 0 0 0 0 0 0 0 0 0 0 0 0 0 -1363.19 -93.6155 0 0 0 0 0 0 0 
0 0 0 0 0 0 0 0 0 -547.426 0 156.331 0 0 0 0 0 0 0 0 0 0 0 0 0 0 0 0 1442.99 0 0 0 0 0 0.09 0 0 0 0 0 0 0 -507.141 0 0 0 0 0 0 0 0 0 0 0 0 0 0 0 0 
-2415.46 0 0 0 1541.41 0 2132.86 0 0 0 0 0 0 0 0 0 1065.48 0 0 0 0 0 0 0 0 0 1870.25 0 0 0 0 0 0 0 0 0.07 0 0 0 0 0 91.174 0 0 -1257.13 0 -6.33259 0 0 0 0 0 0 0 0 0 -336.39 29.3741 0 
0 0 -893.658 0 0 0 777.688 0 0 0 0 0 0 0 1276.67 0 1336.94 0 0 0 0 35.3252 0 0 0 0 0 0 0 0 0 -632.42 0 0 0 0 0.08 0 0 0 0 0 0 0 0 0 0 -817.362 0 0 526.368 0 0 0 0 0 0 0 0 
2081.74 2285.76 0 0 0 -261.162 0 0 0 -108.264 1215.02 0 0 0 0 0 0 0 0 0 0 0 0 0 0 0 0 0 0 0 0 0 -1507.39 0 0 0 0 0.07 0 0 0 0 1515.63 0 0 0 0 0 0 0 0 0 0 0 0 0 0 0 0 
0 0 0 0 0 0 0 0 0 0 0 0 0 0 0 0 0 0 0 0 0 0 0 0 0 0 0 1726.05 0 0 567.873 0 0 0 0 0 0 0 0.02 0 0 -1009.63 0 0 0 0 0 0 -740.76 0 0 0 0 0 0 0 2046.04 2000.11 0 
0 2146.14 159.383 0 0 -558.26 0 -1204.64 0 0 -1179.16 0 0 0 -1839.73 143.971 0 2374.57 0 0 0 0 0 0 0 0 0 0 0 0 0 1509.52 1134.3 0 0 0 0 0 0 0.09 0 0 0 0 0 0 0 0 0 0 0 0 0 0 0 0 0 0 0 
0 0 0 0 0 0 -161.824 0 0 0 0 0 0 0 0 0 0 450.224 0 0 0 0 0 0 0 0 0 0 0 0 0 2350.76 959.273 0 0 0 0 0 0 0 0.07 0 1076.31 0 0 0 0 0 0 0 0 0 0 0 0 -854.747 0 0 0 
0 0 0 0 1568.27 0 -1389.74 0 0 0 0 0 1302.91 0 0 0 0 0 0 0 0 0 0 0 0 0 0 0 0 0 0 2199.55 0 0 0 -422.91 0 0 -979.11 0 0 0 -482.574 0 0 703.223 0 0 0 -1182.21 0 0 0 0 0 0 0 0 0 
0 0 0 0 0 0 0 0 0 0 1437.8 0 0 0 0 750.679 0 0 0 0 0 0 562.532 0 0 0 0 801.492 0 0 0 0 0 0 -1510.28 0 0 953.932 0 0 567.721 2465.97 0.06 0 -602.359 0 0 0 0 0 0 0 0 0 0 0 0 0 0 
0 0 0 0 0 0 0 0 -75.457 0 0 286.95 0 0 1199.3 0 0 -792.489 0 -1430.02 0 0 0 1707.43 0 0 0 0 0 0 0 0 0 0 0 0 0 0 0 0 0 0 0 0.08 0 0 0 2466.43 0 0 0 0 0 0 42.1918 2051.99 0 0 0 
0 0 -251.854 0 0 0 0 0 0 0 0 1903.36 0 0 0 0 0 0 0 331.202 0 0 0 0 0 0 0 0 -1281.24 0 -253.38 0 0 0 0 -1049 0 0 0 0 0 0 -581.607 0 0.02 0 0 0 0 -1751.84 0 0 1926.86 0 0 776.009 0 0 0 
0 0 0 0 0 -1752.91 0 0 1565.37 0 1399.66 0 0 0 0 0 689.337 0 0 0 0 0 0 0 0 0 493.561 0 0 0 0 0 0 0 0 0 0 0 0 0 0 -2454.53 0 0 0 0 0 0 0 0 -577.639 0 0 0 0 0 0 0 0 
2013.99 0 0 -289.697 0 0 0 0 0 0 0 0 0 0 -1370.2 0 0 0 0 0 810.343 0 0 0 0 0 0 935.621 0 0 0 0 0 0 0 -799.051 0 0 0 0 0 0 0 0 0 0 0.07 0 0 0 0 0 1313.14 0 0 0 0 0 0 
0 0 0 0 0 0 0 0 0 804.544 0 0 0 0 0 0 0 -2412.41 0 0 0 0 0 1004.29 0 0 0 0 0 0 0 1472.59 -280.236 0 0 0 -1999.65 0 0 0 0 0 0 285.882 0 0 0 0.06 0 0 0 0 0 2285 0 0 0 0 0 
0 1043.05 0 0 -66.3015 0 0 0 0 0 0 0 0 0 1812.42 0 0 0 0 0 1260.49 0 0 0 0 0 0 0 0 0 0 0 0 0 0 0 0 0 -1043.66 0 0 0 0 0 0 0 0 0 0.03 0 0 0 0 1544.16 0 0 0 -2030.02 0 
0 0 0 0 0 1325.95 0 0 0 0 1224.17 0 -145.802 1612.67 -803.018 994.369 0 0 0 0 0 0 0 0 0 0 0 0 0 0 0 1680.43 0 0 0 0 0 0 0 0 0 -588.015 0 0 -2379.6 0 0 0 0 0.01 0 557.955 0 -2246.7 0 2122.94 -721.229 0 0 
0 0 0 -2057.94 0 0 0 0 0 0 0 0 0 0 0 0 0 0 1838.05 0 0 0 0 -1193.35 0 0 0 0 0 0 0 0 -735.42 2422.79 0 0 2454.53 0 0 0 0 0 0 0 0 -937.3 0 0 0 0 0.07 0 0 0 0 0 0 0 0 
0 0 0 0 0 823.771 -101.703 2362.67 0 1828.44 0 0 0 0 0 0 0 2343.75 -1691.41 0 0 0 0 0 0 0 0 0 0 0 0 0 0 1423 0 0 0 0 0 0 0 0 0 0 0 0 0 0 0 570.315 0 0.09 0 0 -139.546 0 0 0 0 
0 0 0 1450.77 -1169.39 0 0 0 0 557.955 0 0 0 0 0 0 0 0 0 0 0 0 -967.971 0 0 0 0 -808.817 0 0 913.343 0 0 0 0 0 0 0 0 0 0 0 0 0 2102.5 0 -882.824 0 0 0 0 0 0.07 0 0 0 0 0 0 
0 0 0 0 0 0 0 0 0 799.509 0 0 0 0 912.427 0 0 1910.08 1504.49 -699.408 0 0 0 0 2471.31 0 0 0 0 0 2295.53 0 0 0 0 0 0 0 0 0 0 0 0 0 0 0 0 1681.95 -1753.21 -156.331 0 0 0 0.06 0 0 0 0 0 
0 0 0 0 0 0 0 0 0 0 0 0 0 0 0 0 943.403 -1012.99 0 0 0 0 457.244 0 0 0 0 0 1801.43 0 0 -257.195 0 0 0 0 0 0 0 0 0 0 0 -91.3266 0 0 0 0 0 0 0 292.901 0 0 0.06 746.254 0 0 0 
0 0 2313.84 0 0 0 0 0 0 0 0 0 0 0 -442.9 0 -1347.32 0 0 0 0 0 0 0 0 0 0 0 0 0 0 0 0 0 0 0 0 0 0 0 -743.66 0 0 2439.12 1855.45 0 0 0 0 2159.72 0 0 0 0 854.595 0.08 0 0 0 
0 0 1076.31 2144.46 0 0 0 0 0 0 0 0 0 0 0 0 -1800.67 0 0 0 0 0 -161.367 0 0 1326.87 0 0 0 0 0 0 0 0 0 1575.44 0 0 172.048 0 0 0 0 0 0 0 0 0 0 1734.29 0 0 0 0 0 0 0.08 -1891.77 0 
0 240.562 0 0 0 0 1068.99 0 0 0 0 0 0 0 0 0 0 0 0 0 0 0 0 0 0 0 0 0 0 0 0 0 0 0 0 2092.12 0 0 496.155 0 0 0 0 0 0 0 0 0 30.137 0 0 0 0 0 0 0 1172.75 0.08 0 
0 0 0 0 0 0 0 0 0 0 0 0 0 277.184 0 0 0 0 0 0 0 0 0 0 0 0 0 0 0 0 0 0 0 0 0 0 0 0 0 0 0 0 0 0 0 0 0 0 0 0 0 0 0 0 0 0 0 0 0.05 
