*Vertices 35
*Matrix 
0.08 0 0 -1994.92 2215.57 1471.68 0 -140.919 0 0 -1774.12 0 0 0 143.513 0 0 0 0 0 253.685 0 1261.41 0 0 0 0 0 0 0 0 0 0 0 0 
0 0.08 0 0 0 1363.64 -1590.4 2183.83 0 0 0 0 1740.39 0 0 0 868.786 0 0 -268.792 0 0 0 1395.84 0 0 0 -1139.94 0 0 -1240.35 0 0 0 0 
0 0 0 0 0 0 0 -49.2111 -567.11 -745.491 0 0 2460.17 0 0 1937.09 0 0 0 0 0 0 0 0 0 0 0 0 0 0 0 1301.54 0 0 0 
1364.86 0 0 0.01 0 0 0 0 1911.6 -89.1903 0 0 0 0 0 0 0 0 674.383 0 0 0 0 0 0 0 0 0 0 2333.06 0 0 0 2041.15 0 
-92.7 0 0 0 0.02 2432.25 0 0 0 0 1002.61 734.809 0 0 0 0 0 0 0 0 0 0 0 0 0 0 0 1032.98 0 0 0 0 0 0 670.263 
98.6511 -1505.71 0 0 -10.1474 0.02 2067.09 2149.95 0 2443.85 0 308.008 0 923.414 352.718 -764.87 119.098 439.848 0 894.421 0 0 0 0 0 0 0 0 0 0 0 0 0 0 0 
0 2101.73 0 0 0 1819.28 0.08 0 0 0 2388.61 0 1892.38 0 1498.08 0 0 0 0 0 0 0 0 0 0 0 0 0 0 0 0 0 0 0 0 
1792.73 1868.42 -1255 0 0 -941.878 0 0 0 0 -1872.54 -532.929 0 0 0 1487.85 0 0 0 0 0 0 0 0 0 0 0 0 0 0 0 0 0 0 0 
0 0 -759.377 1638.77 0 0 0 0 0.04 0 0 0 0 0 0 0 0 0 0 0 0 1424.07 0 1925.03 -2316.89 0 0 0 0 0 2180.93 0 0 0 0 
0 0 -279.168 -1427.88 0 595.95 0 0 0 0.07 0 0 2385.86 0 0 0 0 0 0 0 0 0 0 1186.18 2280.42 0 0 0 0 0 0 0 0 0 0 
2261.04 0 0 0 1365.17 0 1345.94 2151.02 0 0 0.05 0 0 522.553 0 0 1014.97 0 0 -1360.13 0 0 0 0 0 2361.75 0 0 0 0 0 0 0 0 0 
0 0 0 0 559.481 1068.99 0 2202.9 0 0 0 0.03 0 0 0 0 317.927 0 -1600.01 0 0 0 0 0 0 0 0 0 0 0 0 0 0 0 0 
0 2158.8 502.258 0 0 0 2243.64 0 0 2481.54 0 0 0.09 0 0 0 0 1501.59 0 0 -631.809 0 0 0 0 -161.824 0 2088.31 -823.466 0 0 0 0 622.196 0 
0 0 0 0 0 2279.5 0 0 0 0 190.054 0 0 0.05 2008.65 0 -225.608 0 0 0 0 0 596.713 0 0 0 -1614.96 0 0 0 0 0 0 -1235.62 0 
2163.84 0 0 0 0 -338.527 939.589 0 0 0 0 0 0 1556.83 0.09 0 -964.003 804.239 0 0 0 0 0 0 -451.445 0 0 0 0 0 825.907 0 0 0 0 
0 0 2382.05 0 0 -216.758 0 1365.17 0 0 0 0 0 0 0 0.06 0 0 0 0 128.864 -1598.94 0 0 0 0 0 0 0 0 0 0 0 0 0 
0 1322.75 0 0 0 2243.64 0 0 0 0 -2089.98 -132.221 0 -134.358 2152.24 0 0.02 0 0 0 0 0 0 0 0 0 0 0 0 0 0 0 0 0 0 
0 0 0 0 0 1224.63 0 0 0 0 0 0 2268.97 0 -1994.61 0 0 0.04 0 0 0 0 0 0 0 0 0 0 0 0 1668.37 0 0 0 0 
0 0 0 621.891 0 0 0 0 0 0 0 480.132 0 0 0 0 0 0 0.09 0 0 0 0 0 0 0 0 0 0 0 0 0 0 0 0 
0 1419.49 0 0 0 1510.13 0 0 0 0 -1330.99 0 0 0 0 0 0 0 0 0.02 0 0 0 0 0 0 0 0 0 0 0 0 0 0 0 
-2190.69 0 0 0 0 0 0 0 0 0 0 0 -238.731 0 0 1772.13 0 0 0 0 0.03 1773.96 0 0 0 0 0 0 0 2431.33 0 0 0 0 0 
0 0 0 0 0 0 0 0 1408.05 0 0 0 0 0 0 1132.31 0 0 0 0 1383.48 0.08 0 0 0 0 0 0 0 0 0 0 0 0 0 
1056.78 0 0 0 0 0 0 0 0 0 0 0 0 402.463 0 0 0 0 0 0 0 0 0.04 1691.56 0 0 0 0 1102.4 0 0 0 0 0 1404.84 
0 1039.54 0 0 0 0 0 0 1673.86 1313.75 0 0 0 0 0 0 0 0 0 0 0 0 543.916 0.09 744.575 -139.546 0 0 0 0 0 0 0 0 349.818 
0 0 0 0 0 0 0 0 938.368 2179.25 0 0 0 0 718.482 0 0 0 0 0 0 0 0 254.906 0.06 0 0 0 0 0 0 0 0 0 0 
0 0 0 0 0 0 0 0 0 0 69.8111 0 395.291 0 0 0 0 0 0 0 0 0 0 1359.22 0 0.06 -483.032 0 0 0 0 0 0 0 0 
0 0 0 0 0 0 0 0 0 0 0 0 0 -1526.61 0 0 0 0 0 0 0 0 0 0 0 -145.344 0.08 0 0 0 0 2205.95 0 0 0 
0 1962.72 0 0 1918.01 0 0 0 0 0 0 0 2472.69 0 0 0 0 0 0 0 0 0 0 0 0 0 0 0.07 2006.67 0 0 0 384.915 0 0 
0 0 0 0 0 0 0 0 0 0 0 0 70.4215 0 0 0 0 0 0 0 0 0 481.353 0 0 0 0 1953.87 0.03 559.481 0 2479.55 0 0 0 
0 0 0 2105.55 0 0 0 0 0 0 0 0 0 0 0 0 0 0 0 0 -234.001 0 0 0 0 0 0 0 -1293.15 0.04 0 0 1253.62 356.99 0 
0 1999.19 0 0 0 0 0 0 2379.91 0 0 0 0 0 611.209 0 0 -1343.65 0 0 0 0 0 0 0 0 0 0 0 0 0.05 0 0 0 0 
0 0 -750.832 0 0 0 0 0 0 0 0 0 0 0 0 0 0 0 0 0 0 0 0 0 0 0 1960.28 0 -345.088 0 0 0.09 0 0 0 
0 0 0 0 0 0 0 0 0 0 0 0 0 0 0 0 0 0 0 0 0 0 0 0 0 0 0 2051.23 0 -805.002 0 0 0.04 0 0 
0 0 0 164.876 0 0 0 0 0 0 0 0 -1077.68 1361.2 0 0 0 0 0 0 0 0 0 0 0 0 0 0 0 74.5415 0 0 0 0.06 0 
0 0 0 0 2147.97 0 0 0 0 0 0 0 0 0 0 0 0 0 0 0 0 0 290.613 2387.84 0 0 0 0 0 0 0 0 0 0 0.07 
