*Vertices 66
*Matrix 
0.05 0 0 0 0 0 0 0 2153.61 0 1604.89 856.12 0 721.534 0 -141.377 0 0 0 0 0 2378.84 0 0 0 1948.99 0 0 -1957.69 155.263 2041.61 1688.21 0 -1472.44 0 0 -1042.89 0 0 0 0 0 0 0 0 0 0 1296.35 0 0 0 0 0 0 0 0 0 0 0 0 0 0 0 0 0 0 
0 0.07 2413.48 0 306.177 0 1533.78 0 0 0 0 0 0 0 0 2438.96 0 0 0 0 448.698 0 0 0 -32.7311 297.021 0 0 0 0 174.032 0 0 0 0 0 0 -2047.11 -1602.45 0 0 0 0 0 0 1026.57 0 0 537.202 0 2251.58 0 0 0 0 0 0 0 2393.64 0 -1417.97 0 973.617 0 0 0 
0 2096.24 0.07 1771.07 -628.147 0 -301.141 0 0 30.4422 0 672.857 0 0 0 0 0 0 -192.953 0 2094.26 0 0 -1428.19 -1796.85 0 0 0 1641.67 0 0 0 0 0 0 0 1358.91 0 0 0 0 0 899.304 1491.52 0 0 0 0 0 0 0 2067.55 0 0 0 0 0 0 0 0 0 -329.981 -1795.79 0 0 0 
0 0 1620.61 0.08 0 41.7341 0 0 0 0 0 0 0 981.857 0 2395.78 0 0 -678.961 -1786.63 1876.05 -989.181 0 0 0 0 0 0 2448.27 579.928 0 0 0 0 0 0 0 0 0 0 1095.23 -1825.54 0 0 0 0 0 0 0 0 0 0 -1345.18 0 0 0 -506.378 0 0 206.229 0 0 430.54 0 0 0 
0 -877.636 35.02 0 0.08 0 1046.1 0 0 0 0 0 923.261 355.617 0 0 0 2279.66 0 1846.14 0 0 0 0 0 0 1567.05 0 1657.08 0 903.424 0 0 0 -1538.51 0 0 0 0 0 306.787 0 0 0 0 0 0 0 0 0 0 0 0 0 0 0 0 0 0 0 0 0 0 0 0 0 
0 0 0 2135.76 0 0.07 0 0 0 0 0 0 0 0 0 0 0 0 0 0 2427.67 735.572 924.329 0 -2076.4 0 0 0 0 1235.92 0 1704.38 0 -1309.78 2113.18 1439.02 0 0 0 0 0 0 0 0 -572.451 0 0 0 0 0 154.195 0 0 0 1202.35 0 0 0 0 0 0 0 0 -2122.33 0 0 
0 -2355.49 89.3429 0 -1137.2 0 0.06 0 0 2218.01 0 0 0 1036.64 0 0 1348.08 2344.2 192.648 -1451.84 0 1688.06 0 0 0 2234.79 0 0 0 0 695.135 2031.08 0 0 0 0 0 0 -840.861 0 0 0 0 0 0 1894.36 0 0 0 0 0 -932.722 0 0 0 0 -1443.75 0 0 0 0 0 2165.06 0 -1560.34 0 
0 0 0 0 0 0 0 0.08 0 0 0 0 0 1365.63 0 2229.91 0 1775.8 0 0 0 0 -1771.37 0 0 0 2191.76 0 1055.1 105.213 0 0 0 0 0 -684.454 0 0 0 0 1010.24 0 0 0 0 0 0 0 0 0 0 0 0 0 0 0 0 0 0 0 0 0 0 0 989.029 0 
1620.61 0 0 0 0 0 0 0 0.01 0 0 -436.949 0 0 0 736.946 0 -394.528 0 0 2381.28 0 718.787 0 0 0 -755.257 0 2041.76 -1286.58 1845.99 0 0 -28.0007 -1475.19 2321.16 0 0 0 0 455.87 1773.51 0 0 784.402 0 0 1703.62 2026.81 0 0 0 0 0 795.541 0 -1169.39 -1568.12 0 0 0 0 0 0 0 1501.89 
0 0 1231.65 0 0 0 1436.58 0 0 0.03 992.538 0 0 0 1477.02 602.817 0 -451.445 0 1668.37 0 0 0 0 0 -1271.78 0 0 0 0 0 0 0 0 0 552.766 0 0 0 0 -1171.68 0 0 -8.77407 0 0 0 0 1765.57 0 0 0 0 0 0 0 0 0 0 1284.14 0 32.4259 0 0 0 0 
-1518.83 0 0 0 0 0 0 0 0 575.503 0.07 0 0 1463.13 0 2024.52 0 0 0 0 1493.96 0 0 0 0 0 0 1396.15 0 0 -326.014 1192.13 -50.5844 609.073 -129.322 0 0 0 0 277.032 0 213.553 0 0 0 0 0 0 0 0 0 0 0 390.408 0 0 0 0 -1710.64 201.804 0 0 0 0 0 0 
-1214.1 0 2158.5 0 0 0 0 0 -735.42 0 0 0.05 0 -292.291 -1848.12 0 0 0 748.39 1802.04 0 1650.82 0 -2289.88 0 1118.12 2421.57 0 0 0 0 343.715 0 0 0 0 0 1569.8 0 0 0 0 0 0 0 -1419.64 0 0 0 0 0 2211.45 0 0 0 1076.16 0 0 0 0 2443.85 0 0 0 0 0 
0 0 0 0 1397.67 0 0 0 0 0 0 0 0 0 0 -1099.05 0 0 0 -1442.23 0 0 0 0 2463.38 0 0 -1231.04 0 0 0 0 0 0 1332.06 0 0 0 0 0 0 0 0 0 0 0 0 0 0 0 0 0 0 -1392.18 1679.97 0 0 0 -1230.58 0 0 0 0 0 1433.38 0 
-1499.6 0 0 1036.03 -1193.66 0 2389.07 -0.0762963 0 0 1092.64 -423.063 0 0.09 0 2457.58 0 0 0 0 0 0 0 0 0 0 0 0 0 0 0 2167.65 -240.41 -1810.13 1271.48 0 0 0 0 0 0 0 0 0 0 0 1325.65 0 0 0 0 0 0 0 -1736.73 0 0 0 1563.84 0 0 0 0 0 0 0 
0 0 0 0 0 0 0 0 0 -162.74 0 -47.8378 0 0 0.01 0 110.401 2187.95 0 0 1613.13 0 2341.61 0 0 0 0 0 0 0 -488.525 1017.26 2117.6 0 0 64.7755 0 0 0 0 0 0 0 0 0 0 135.731 0 0 -2320.86 0 0 -74.8466 0 0 0 0 0 0 0 0 0 0 0 0 0 
1255.46 -893.658 0 1842.48 0 0 0 551.698 1713.08 -1676.92 1012.53 0 2144.31 -502.716 0 0.07 0 0 1929.61 1626.41 0 0 0 0 2151.02 0 -765.633 -2166.89 0 0 0 0 0 0 950.728 0 0 -1307.95 -881.909 0 1345.18 0 0 0 0 0 0 1430.17 0 -239.799 0 0 0 -2315.52 0 0 0 0 0 0 0 0 0 0 0 0 
0 0 0 0 0 0 4.95926 0 0 0 0 0 0 0 -358.974 0 0 0 0 0 0 0 733.894 0 0 2494.96 0 -1483.73 0 2245.32 0 0 0 458.922 0 0 0 0 0 0 0 0 1136.28 0 0 0 0 0 0 0 0 0 0 0 0 0 0 0 0 0 0 0 0 0 0 0 
0 0 0 0 2283.93 0 -987.96 1952.65 628.452 -520.264 0 0 0 0 476.775 0 0 0.02 0 0 0 0 0 2294.15 1629.15 887.707 0 -399.564 0 0 0 0 595.34 0 0 -107.501 0 0 0 0 0 0 0 0 0 0 0 0 -2304.99 0 0 0 0 0 0 0 0 0 0 0 0 0 0 0 0 0 
0 0 2048.48 1921.67 0 0 2306.05 0 0 0 0 2484.28 0 0 0 -1001.08 0 0 0.09 0 0 0 0 -2346.95 0 0 0 0 -1417.36 0 0 -173.116 456.175 0 -410.245 0 0 109.638 0 0 0 0 0 -656.529 865.734 0 0 0 0 0 0 0 0 0 0 0 0 -213.553 0 0 0 0 0 0 0 -1305.81 
0 0 0 -17.6244 -351.802 0 1213.95 0 0 1445.43 0 410.398 46.9222 0 0 -13.657 0 0 0 0.08 449.004 0 0 0 2235.56 0 -2247.15 0 -492.035 0 2125.84 0 0 0 0 116.047 0 0 0 0 0 0 0 0 0 -713.141 0 0 0 0 0 0 0 0 0 0 -1174.73 227.592 0 0 0 0 -2048.78 0 -533.692 0 
0 1714.61 681.555 -202.261 0 2437.89 0 0 -856.426 0 1195.94 0 0 0 -2498.17 0 0 0 0 1997.67 0.09 0 0 0 0 0 -402.158 0 2125.54 1780.98 0 -195.09 458.312 -1529.36 -1121.94 0 0 579.775 0 -421.69 0 0 0 0 0 0 0 0 -1535.62 -1245.99 0 2164.6 0 0 0 0 0 0 0 0 0 0 0 0 0 0 
-2234.49 0 0 2051.38 0 1735.97 255.974 0 0 0 0 1313.9 0 0 0 0 0 0 0 0 0 0.05 0 0 0 0 -2397.46 0 0 0 0 0 0 0 156.636 85.0703 0 0 2074.42 0 0 0 0 0 0 -207.297 161.214 0 0 0 0 -64.0126 0 0 0 0 0 -1691.72 0 0 -492.95 0 0 0 0 0 
0 0 0 0 0 2125.08 0 -1394.01 -634.251 0 0 0 0 0 -464.11 0 2127.98 0 0 0 0 0 0 0 0 0 0 -1393.4 -1291.77 1272.7 0 0 0 0 0 740.303 0 0 0 0 0 0 0 0 1812.72 0 0 0 0 0 0 0 0 0 0 0 -475.402 0 1855.45 0 0 0 0 0 0 2369.08 
0 0 1012.99 0 0 0 0 0 0 0 0 -362.941 0 0 0 0 0 2058.4 -1531.5 0 0 0 0 0.04 0 0 0 0 0 0 1411.86 0 0 -1037.25 1695.23 0 0 1643.8 0 0 0 0 0 0 26.1696 0 0 0 0 0 0 0 0 0 0 0 0 0 0 0 -1848.58 0 0 -1357.39 0 0 
0 -266.503 1032.52 0 0 2268.52 0 0 0 0 0 0 -1923.2 0 0 -2071.37 0 -440.764 0 -309.992 0 0 0 0 0.05 8.01111 0 0 0 0 0 0 0 0 0 -99.2615 0 0 0 0 0 2461.55 0 0 0 0 0 0 0 0 0 0 0 0 0 -276.421 0 0 1273.61 0 0 0 0 0 0 0 
-1173.82 395.749 0 0 0 0 82.0185 0 0 -2197.26 0 2256.77 0 0 0 0 1061.82 -929.212 0 0 0 0 0 0 1096.91 0.03 0 -1599.4 0 0 0 0 0 371.639 0 0 1751.53 0 0 0 0 811.258 0 0 0 0 -1806.77 0 -411.618 0 1718.73 0 0 0 0 0 0 0 0 0 0 0 0 0 0 0 
0 0 0 0 674.23 0 0 1285.36 -1252.56 0 0 1971.27 0 0 0 -887.707 0 0 0 276.116 901.135 2166.74 0 0 0 0 0 0 0 -413.144 0 2396.54 471.282 0 0 116.352 0 2164.75 233.238 0 0 0 0 0 0 0 0 0 0 0 0 0 0 0 0 0 0 0 0 0 1573.61 0 0 0 0 0 
0 0 0 0 0 0 0 0 0 0 -1368.07 0 -53.4837 0 0 -733.436 1599.7 405.972 0 0 0 0 -272.607 0 0 912.427 0 0.02 0 -981.094 0 0 0 0 0 0 0 -976.058 442.9 0 0 0 0 2402.04 0 0 0 0 0 0 0 0 198.447 0 0 2082.96 0 0 0 0 0 509.888 0 -1256.22 0 0 
-2396.69 0 -955.153 2236.01 2181.84 0 0 -1979.35 -315.638 0 0 0 0 0 0 0 0 0 1613.59 1794.26 153.279 0 1450.16 0 0 0 0 0 0.08 1573.15 -278.405 0 0 0 0 0 0 0 0 0 0 0 0 0 0 0 0 0 313.196 0 0 0 0 0 0 -921.888 0 0 0 395.596 2148.73 0 0 0 0 -1820.81 
830.943 0 0 -1821.12 0 -1625.19 0 1218.83 -2380.52 0 0 0 0 0 0 0 -1256.68 0 0 0 2097.31 0 1292.23 0 0 0 1876.51 -1873.3 2250.21 0.04 0 0 0 -1950.82 0 2182.45 -16.2511 0 2337.34 0 0 0 0 2008.19 0 -2367.09 0 0 0 0 0 0 0 0 0 0 0 0 0 0 0 0 0 0 0 0 
1481.29 395.291 0 0 1135.82 0 1004.9 0 -2025.59 0 1839.12 0 0 0 1778.24 0 0 0 0 1046.4 0 0 0 1068.07 0 0 0 0 -2146.6 0 0.02 0 0 0 172.658 -541.017 0 1331.14 0 0 2421.11 0 0 0 0 -1323.66 0 -1944.56 0 -828.349 -2361.14 0 0 0 0 0 0 0 0 0 -1729.41 0 0 0 0 0 
-513.855 0 0 0 0 276.879 1747.11 0 0 0 -928.755 1011.31 0 1123.31 870.312 0 0 0 720.466 0 -590.457 0 0 0 0 0 79.4244 0 0 0 0 0.01 0 0 0 0 1618.17 0 0 0 0 0 0 0 0 0 -952.864 0 0 0 0 0 891.675 0 0 0 0 0 0 0 2293.85 0 0 0 0 0 
0 0 0 0 0 0 0 0 0 0 2339.63 0 0 2062.06 2471.62 0 0 -1901.38 -805.307 0 2061.75 0 0 0 0 0 644.017 0 0 0 0 0 0.01 0 462.737 1309.63 -704.901 0 0 0 0 0 0 0 0 0 0 0 0 0 0 0 0 0 0 0 0 -1946.85 0 0 -2327.11 0 2090.44 1996.9 0 2146.6 
-645.848 0 0 0 0 277.947 0 0 1749.4 0 760.598 0 0 1604.74 0 0 1377.07 0 0 0 1219.6 0 0 2082.81 0 1942.88 0 0 0 1360.44 0 0 0 0.01 0 0 0 0 1435.36 0 0 0 0 0 0 0 0 0 0 0 0 0 0 0 0 0 0 0 0 1007.8 0 0 0 -1198.39 0 1243.4 
0 0 0 0 1755.65 -2206.26 0 0 1843.55 0 -1718.42 0 -1084.09 1977.83 0 1428.04 0 0 362.484 0 1873.91 1289.64 0 -1818.67 0 0 0 0 0 0 437.864 0 -470.977 0 0.03 1515.47 0 0 -2160.33 0 0 0 1800.06 0 0 886.792 0 0 0 0 0 0 0 0 0 0 -483.795 -217.826 0 0 0 0 0 0 0 0 
0 0 0 0 0 -473.266 0 1982.25 2039.17 -347.377 0 0 0 0 -1736.88 0 0 -1703.31 0 -919.904 0 2396.39 905.866 0 1309.63 0 1263.39 0 0 -589.541 1902.45 0 -1226.77 0 1050.22 0.03 0 0 0 0 0 0 0 0 0 0 0 211.57 0 0 0 0 0 0 0 0 0 0 0 0 0 0 0 0 0 0 
-251.549 0 2218.31 0 0 0 0 0 0 0 0 0 0 0 0 0 0 0 0 0 0 0 0 0 0 -1719.64 0 0 0 -1216.24 0 2452.54 620.212 0 0 0 0.02 1631.14 0 0 0 0 0 0 0 0 0 0 0 -2111.19 0 0 0 0 0 0 0 0 0 161.367 0 2090.75 0 0 0 0 
0 -2024.06 0 0 0 0 0 0 0 0 0 2204.73 0 0 0 50.1267 0 0 -379.421 0 152.974 0 0 409.94 0 0 1100.57 -261.467 0 0 84.1548 0 0 0 0 0 1912.52 0.07 1971.72 990.402 0 1657.99 0 0 0 0 0 0 0 0 0 0 0 -1738.41 0 0 0 -1847.67 0 -2400.36 0 0 0 0 -1522.8 0 
0 1250.27 0 0 0 0 1616.95 0 0 0 0 0 0 0 0 -971.938 0 0 0 0 0 2031.69 0 0 0 0 -2349.7 -271.538 0 -317.621 0 0 0 1477.63 -921.583 0 0 -3.28074 0.05 2258.45 0 0 0 -1621.52 1261.86 0 0 0 0 0 -360.958 0 0 673.315 0 -630.741 0 0 0 0 0 0 0 0 0 -1527.83 
0 0 0 0 0 0 0 0 0 0 898.236 0 0 0 0 0 0 0 0 0 -445.189 0 0 0 0 0 0 0 0 0 0 0 0 0 0 0 0 203.33 1198.54 0.04 0 0 0 0 0 0 0 0 0 0 0 0 0 0 0 0 0 0 0 0 0 0 -188.528 0 0 0 
0 0 0 2304.38 2497.71 0 0 -165.487 323.115 220.725 0 0 0 0 0 432.371 0 0 0 0 0 0 0 0 0 0 0 0 0 0 -2163.23 0 0 0 0 0 0 0 0 0 0.04 0 0 0 0 0 0 0 0 1670.66 0 0 0 0 0 0 99.5666 0 -77.1355 0 0 -2430.72 0 0 0 0 
0 0 0 1435.97 0 0 0 0 2401.58 0 -1356.17 0 0 0 0 0 0 0 0 0 0 0 0 0 2279.81 237.358 0 0 0 0 0 0 0 0 0 0 0 1896.04 0 0 0 0 0 0 0 0 0 0 0 0 0 0 0 0 0 574.892 0 -1838.05 -673.925 0 0 0 -590.915 0 0 -768.99 
0 0 262.688 0 0 0 0 0 0 0 0 0 0 0 0 0 -1983.63 0 0 0 0 0 0 0 0 0 0 0 0 0 0 0 0 0 525.91 0 0 0 0 0 0 0 0.05 2434.69 0 0 0 0 0 0 0 0 0 0 2035.36 0 0 2382.66 0 -1546.3 0 -254.295 1547.21 0 0 0 
0 0 1304.74 0 0 0 0 0 0 1300.93 0 0 0 0 0 0 0 0 1062.88 0 0 0 0 0 0 0 0 -369.045 0 521.638 0 0 0 0 0 0 0 0 1213.03 0 0 0 1874.52 0 0 0 0 0 0 0 0 0 0 0 0 0 0 0 0 0 0 0 0 0 0 0 
0 0 0 0 0 -2398.07 0 0 2198.78 0 0 0 0 0 0 0 0 0 1514.56 0 0 0 1645.63 -725.044 0 0 0 0 0 0 0 0 0 0 0 0 0 0 1819.9 0 0 0 0 0 0.06 0 0 0 1403.01 -1737.65 0 0 0 0 0 0 0 0 0 0 0 0 0 0 0 0 
0 1472.14 0 0 0 0 2181.39 0 0 0 0 2381.28 0 0 0 0 0 0 0 -2134.08 0 725.806 0 0 0 0 0 0 0 2236.93 -965.072 0 0 0 -1953.57 0 0 0 0 0 0 0 0 0 0 0.05 0 0 0 0 0 0 0 1890.55 0 0 0 0 0 0 -335.78 0 0 0 0 0 
0 0 0 0 0 0 0 0 0 0 0 0 0 1195.94 1934.34 0 0 0 0 0 0 2131.34 0 0 0 -1381.65 0 0 0 0 0 -1502.2 0 0 0 0 0 0 0 0 0 0 0 0 0 0 0.02 -68.7429 0 0 1422.7 0 0 0 2036.88 0 0 0 0 0 0 0 0 0 0 0 
2145.53 0 0 0 0 0 0 0 -571.383 0 0 0 0 0 0 2499.39 0 0 0 0 0 0 0 0 0 0 0 0 0 0 1614.2 0 0 0 0 -2124.77 0 0 0 0 0 0 0 0 0 0 -781.808 0.09 0 0 0 0 0 0 0 0 0 0 0 0 0 0 0 0 0 0 
0 -2059.01 0 0 0 0 0 0 1801.89 -311.823 0 0 0 0 0 0 0 -370.418 0 0 2023.45 0 0 0 0 -1593.75 0 0 235.832 0 0 0 0 0 0 0 0 0 0 0 0 0 0 0 1362.27 0 0 0 0.09 0 0 0 0 0 0 0 0 0 0 0 0 0 0 0 1586.73 0 
0 0 0 0 0 0 0 0 0 0 0 0 0 0 2150.87 -1802.19 0 0 0 0 2480.47 0 0 0 0 0 0 0 0 0 2148.88 0 0 0 0 0 -1970.35 0 0 0 2404.02 0 0 0 1645.48 0 0 0 0 0.09 0 0 0 0 0 0 0 762.429 0 0 0 0 0 0 0 0 
0 279.473 0 0 0 876.263 0 0 0 0 0 0 0 0 0 0 0 0 0 0 0 0 0 0 0 -1091.11 0 0 0 0 1026.87 0 0 0 0 0 0 0 608.768 0 0 0 0 0 0 0 482.574 0 0 0 0.04 0 0 0 0 0 0 0 0 0 0 0 0 0 0 0 
0 0 -1176.26 0 0 0 2033.22 0 0 0 0 2276.91 0 0 0 0 0 0 0 0 -1004.59 618.381 0 0 0 0 0 0 0 0 0 0 0 0 0 0 0 0 0 0 0 0 0 0 0 0 0 0 0 0 0 0.03 0 0 0 -1742.07 0 0 0 1883.68 0 0 0 0 0 0 
0 0 0 -1739.94 0 0 0 0 0 0 0 0 0 0 -1537.29 0 0 0 0 0 0 0 0 0 0 0 0 2019.03 0 0 0 1673.71 0 0 0 0 0 0 0 0 0 0 0 0 0 0 0 0 0 0 0 0 0.08 0 0 0 0 0 0 0 0 0 0 0 0 0 
0 0 0 0 0 0 0 0 0 0 -730.995 0 2327.88 0 0 -1825.54 0 0 0 0 0 0 0 0 0 0 0 0 0 0 0 0 0 0 0 0 0 2043.9 2033.07 0 0 0 0 0 0 2462 0 0 0 0 0 0 0 0.03 0 0 1029.92 0 0 0 0 0 0 0 0 0 
0 0 0 0 0 606.479 0 0 -1193.04 0 0 0 2191 2073.2 0 0 0 0 0 0 0 0 0 0 0 0 0 0 0 0 0 0 0 0 0 0 0 0 0 0 0 0 66.9118 0 0 0 -580.844 0 0 0 0 0 0 0 0.09 0 0 0 0 0 0 0 0 0 0 1228.9 
0 0 0 0 0 0 0 0 0 0 0 612.735 0 0 0 0 0 0 0 0 0 0 0 0 1480.22 0 0 2441.71 -747.932 0 0 0 0 0 0 0 0 0 1682.71 0 0 593.356 0 0 0 0 0 0 0 0 0 1496.55 0 0 0 0.04 0 0 0 0 0 2236.63 0 0 0 0 
0 0 0 -2002.4 0 0 2229.3 0 2213.58 0 0 0 0 0 0 0 0 0 0 -642.643 0 0 2413.48 0 0 0 0 0 0 0 0 0 0 0 1021.84 0 0 0 0 0 1841.11 0 0 0 0 0 0 0 0 0 0 0 0 1380.43 0 0 0.02 0 0 0 0 0 0 0 0 0 
0 0 0 0 0 0 0 0 1296.35 0 0 0 0 0 0 0 0 0 2468.26 -151.448 0 1869.79 0 0 0 0 0 0 0 0 0 0 -2408.14 0 495.239 0 0 -554.445 0 0 0 -885.876 -426.572 0 0 0 0 0 0 2122.79 0 0 0 0 0 0 0 0.01 0 0 -105.518 0 0 0 0 0 
0 649.663 0 0 0 0 0 0 0 0 1788.61 0 -1794.87 -650.121 0 0 0 0 0 0 0 0 2152.39 0 120.167 0 0 0 0 0 0 0 0 0 0 0 0 0 0 0 1909.31 -1893.14 0 0 0 0 0 0 0 0 0 0 0 0 0 0 0 0 0.04 0 0 0 0 0 0 -927.229 
0 0 0 2407.83 0 0 0 0 0 2258.14 -335.475 0 0 0 0 0 0 0 0 0 0 0 0 0 0 0 0 0 -2455.75 0 0 0 0 157.094 0 0 1913.28 2357.33 0 0 0 0 2207.79 0 0 0 0 0 0 0 0 1055.41 0 0 0 0 0 0 0 0.03 0 -158.01 0 0 0 0 
0 541.78 0 0 0 0 0 0 0 0 0 -304.041 0 0 0 0 0 0 0 0 0 -104.144 0 1918.32 0 0 -523.774 0 1407.13 0 34.257 1200.83 -2103.87 0 0 0 0 0 0 0 0 0 0 0 0 2063.13 0 0 0 0 0 0 0 0 0 0 0 1985.92 0 0 0.08 1349.6 0 0 0 0 
0 0 2493.29 0 0 0 0 0 0 -1057.24 0 0 0 0 0 0 0 0 0 0 0 0 0 0 0 0 0 525.91 0 0 0 0 0 0 0 0 24.9489 0 0 0 1844.61 0 591.678 0 0 0 0 0 0 0 0 0 0 0 0 -1814.55 0 0 0 1301.08 2176.5 0.01 0 -2095.48 0 0 
0 539.796 1310.69 1746.5 0 0 -129.627 0 0 0 0 0 0 0 0 0 0 0 0 956.984 0 0 0 0 0 0 0 0 0 0 0 0 1167.87 0 0 0 0 0 0 1194.57 0 1064.71 2047.26 0 0 0 0 0 0 0 0 0 0 0 0 0 0 0 0 0 0 0 0.06 0 0 231.559 
0 0 0 0 0 2379.76 0 0 0 0 0 0 0 0 0 0 0 0 0 0 0 0 0 -597.781 0 0 0 412.229 0 0 0 0 942.488 1819.44 0 0 0 0 0 0 0 0 0 0 0 0 0 0 0 0 0 0 0 0 0 0 0 0 0 0 0 -20.0659 0 0.08 0 0 
0 0 0 0 0 0 -1029.62 277.49 0 0 0 0 268.944 0 0 0 0 0 0 -1514.1 0 0 0 0 0 0 0 0 0 0 0 0 0 0 0 0 0 2227.01 0 0 0 0 0 0 0 0 0 0 2253.11 0 0 0 0 0 0 0 0 0 0 0 0 0 0 0 0.07 0 
0 0 0 0 0 0 0 0 1233.02 0 0 0 0 0 0 0 0 0 1542.18 0 0 0 -2231.89 0 0 0 0 0 578.249 0 0 0 -836.283 -1921.83 0 0 0 0 333.186 0 0 1772.74 0 0 0 0 0 0 0 0 0 0 0 0 1963.18 0 0 0 -1067.77 0 0 0 1791.82 0 0 0.06 
