*Vertices 47
*Matrix 
0.02 0 -2379.6 0 0 0 0 0 0 0 0 0 0 0 0 0 -1022.29 0 0 0 0 0 0 0 0 0 0 0 2211.6 0 937.91 2141.87 0 1904.89 0 -1363.49 1125.14 0 61.8763 -950.117 0 0 0 0 0 0 0 
0 0.07 -429.319 0 0 2451.63 0 0 0 1544.01 0 0 2051.23 1509.52 1838.97 0 0 0 0 0 1690.65 1415.37 0 0 -1908.4 1580.48 0 0 0 0 0 0 0 0 0 0 0 0 0 1622.44 314.875 0 0 0 0 0 -1235.01 
494.629 1447.42 0.03 0 0 0 1971.72 0 0 946.303 0 0 0 0 1186.18 0 0 0 0 0 302.057 0 0 0 0 0 0 0 0 -634.098 0 1256.98 0 0 -2471.47 1829.36 0 0 0 0 0 0 0 -2303.31 0 0 0 
0 0 0 0.08 0 0 0 -203.024 0 0 0 0 0 0 1941.21 119.098 0 53.1785 0 0 0 0 0 -9.38444 -1447.26 0 0 0 0 0 0 -38.9874 -467.467 0 0 0 0 0 0 0 0 0 0 2055.5 -82.4763 0 0 
0 0 0 0 0.07 0 0 -1225.09 2116.53 0 0 593.204 0 0 0 0 -1173.82 0 0 0 0 287.561 264.367 1647.01 0 0 599.918 0 0 567.263 0 0 0 1607.49 0 0 0 0 2424.92 0 0 -358.669 0 0 0 0 -2400.97 
0 -753.273 0 0 0 0.05 0 2342.52 0 0 0 0 0 0 0 0 0 0 -1216.54 0 0 0 0 0 0 0 0 0 0 0 0 0 0 0 0 0 1647.01 0 1993.24 -2119.13 0 1359.07 0 0 0 0 0 
0 0 576.113 0 0 0 0.01 0 0 0 0 0 0 -1254.84 0 0 -673.62 -716.803 0 0 0 0 0 2059.62 0 493.103 0 0 0 0 -1994.61 0 0 2176.2 0 219.962 0 0 0 0 0 0 0 0 0 0 501.343 
0 0 0 1148.95 -2190.08 1952.8 0 0.08 0 0 0 0 0 1310.08 659.276 0 0 2314.14 -907.392 2299.34 0 0 -1644.41 0 0 0 828.043 -2221.21 1081.65 0 0 0 0 0 0 0 0 0 0 -2116.99 0 0 0 0 0 0 0 
0 0 0 0 2368.16 0 0 0 0.03 0 0 0 0 1083.18 0 0 0 1463.59 0 131.458 0 0 0 0 0 0 -1108.2 0 0 1269.8 0 1255.76 1758.71 1766.18 0 0 0 0 0 0 0 2013.84 0 -1062.27 -1053.42 0 0 
0 909.986 1402.25 0 0 0 0 0 0 0.01 0 0 0 -68.5903 0 -2462 0 2422.03 -527.741 0 0 0 0 -1561.4 0 0 0 1120.26 2148.12 605.411 0 0 0 0 -2411.8 0 0 0 0 0 0 -404.141 0 0 0 0 0 
0 0 0 0 0 0 0 0 0 0 0.05 0 0 0 0 0 0 0 0 0 0 0 0 0 265.435 0 0 0 0 0 1932.36 191.885 0 0 1630.07 0 0 0 -398.038 2122.49 -712.073 0 1369.29 0 0 0 0 
0 0 0 0 -320.368 0 0 0 0 0 0 0.06 0 0 0 0 0 0 0 0 1290.7 -130.696 0 1147.11 0 0 0 0 -129.78 0 0 0 1878.64 0 0 0 0 536.744 0 0 -71.337 0 0 1389.74 0 0 0 
0 86.1385 0 0 0 0 0 0 0 0 0 0 0.08 1986.53 0 0 0 0 0 -353.938 0 0 0 0 -674.383 0 0 0 1101.64 509.125 0 1914.96 0 0 0 0 0 0 0 0 0 0 353.633 0 0 0 -786.233 
0 875.652 0 0 0 0 -1925.03 -1693.24 379.269 23.423 0 0 -871.99 0.03 0 0 0 0 2273.86 -301.294 1114 0 0 0 0 0 0 -844.066 -1249.35 0 0 0 0 0 0 0 0 0 0 0 0 0 2306.36 0 0 0 0 
0 1775.95 2381.28 -1551.18 0 0 0 939.894 0 0 0 0 0 0 0.01 0 -2150.56 0 0 0 0 564.516 0 0 0 0 0 0 0 0 0 0 -805.002 0 -532.624 0 0 0 0 0 1507.69 0 0 0 0 -2040.85 0 
0 0 0 -2236.01 0 0 0 0 0 639.439 0 0 0 0 0 0.06 0 0 0 0 0 0 661.565 793.252 1142.38 0 0 0 0 0 0 0 0 0 0 0 -2357.94 0 1673.86 0 1962.11 0 0 0 0 0 272.301 
-2070.6 0 0 0 -2096.7 0 2183.07 0 0 0 0 0 0 0 1641.67 0 0 0 0 442.747 0 -465.636 2138.2 0 0 -528.962 0 0 0 0 0 0 631.657 0 0 675.604 0 0 -407.041 0 0 281.152 0 0 0 0 0 
0 0 0 1760.38 0 0 1814.86 338.832 1415.52 1651.28 0 0 0 0 0 0 0 0.04 0 0 0 0 699.408 0 0 0 -854.747 0 0 0 0 0 -2129.35 1991.1 0 0 1565.98 0 0 -391.324 0 -371.487 0 0 0 0 0 
0 0 0 0 0 1659.67 0 -1142.38 0 -1785.1 0 0 0 -398.801 0 0 0 0 0.09 0 0 0 0 0 0 0 392.697 0 -832.011 0 0 0 0 0 0 0 0 642.796 -2139.27 0 0 2333.22 873.363 0 0 0 977.737 
0 0 0 0 0 0 0 727.79 -882.061 0 0 0 776.772 1103.63 0 0 -337.458 0 0 0.02 -667.364 0 0 0 0 0 2359.46 0 0 -2209.92 0 -2225.33 1938.15 0 0 0 0 0 0 0 0 0 0 1211.81 0 -336.543 2240.75 
0 -2162.31 2131.79 0 0 0 0 0 0 0 0 -1869.64 0 2020.86 0 0 0 0 0 1234.86 0.07 0 -769.448 0 -1519.29 1739.02 0 0 1868.57 0 0 0 -1139.79 0 0 0 0 0 501.495 0 0 0 0 0 0 0 0 
0 -608.921 0 0 -463.805 0 0 0 0 0 0 1384.85 0 0 415.128 0 2073.66 0 0 0 0 0.05 0 0 0 -1097.98 0 216.3 0 1524.78 124.134 0 0 0 0 277.642 1372.34 513.855 1762.37 0 0 -1851.02 269.097 0 -1956.92 0 0 
0 0 0 0 1951.43 0 0 -137.257 0 0 0 0 0 0 0 1670.35 1247.52 1008.71 0 0 -2202.9 0 0.02 0 0 0 -2016.43 0 0 -997.116 0 0 0 0 -2008.5 0 0 0 0 456.633 0 1348.99 0 0 0 0 0 
0 0 0 -1800.97 1633.12 0 -1829.81 0 0 -533.845 0 1095.84 0 0 0 1332.36 0 0 0 0 0 0 0 0 -1390.96 -2229 2325.59 -2429.96 0 2385.1 1994.16 0 -2326.96 1817.61 0 -222.098 0 0 1743.29 0 36.5459 0 0 0 0 0 0 
0 1389.89 0 1419.8 0 0 0 0 0 0 1201.9 0 2158.5 0 0 -208.213 0 0 0 0 -40.8185 0 0 727.485 0.07 0 572.909 0 0 0 0 0 0 -815.226 -2012.77 0 -1221.88 0 652.562 0 0 -1710.18 0 0 0 -1154.13 0 
0 -436.186 0 0 0 0 1641.06 0 0 0 0 0 0 0 0 0 1463.44 0 0 0 -2107.38 771.737 0 300.684 0 0.02 -424.131 0 1081.96 -561.769 0 0 0 0 0 0 135.578 0 0 0 1129.57 0 1370.97 -2165.67 0 0 0 
0 0 0 0 2136.98 0 0 1991.1 2090.75 0 0 0 0 0 0 0 0 -841.472 1703.92 -1810.43 0 0 1605.04 -531.556 925.703 1816.69 0.06 0 631.199 0 0 0 2330.62 0 0 0 -575.655 -1493.04 0 0 -1654.48 0 778.298 0 0 0 0 
0 0 0 0 0 0 0 2407.53 0 -934.4 0 0 0 877.789 0 0 0 0 0 0 0 1478.09 0 746.406 0 0 0 0.09 120.93 -260.552 0 0 0 0 2023.91 0 0 0 -1410.34 0 214.927 0 0 0 0 -284.356 0 
-564.669 0 0 0 0 0 0 -512.787 0 -1777.93 0 68.1326 -90.5637 -91.3266 0 0 0 0 1662.27 0 -1820.51 0 0 0 0 318.69 2162.31 473.266 0 0 -855.358 0 -518.281 0 0 2014.3 2014.3 -283.135 0 2407.22 0 -1950.51 0 0 0 -771.584 0 
0 0 -755.715 0 -969.344 0 0 0 -1031.91 1246.91 0 0 -1647.92 0 0 0 0 0 0 1949.45 0 -1690.8 1209.22 752.358 0 693.304 0 1588.87 0 0.06 0 0 -1654.79 0 0 0 0 0 1528.75 -1218.07 -357.906 2432.86 2121.57 0 -180.593 0 -2181.08 
2231.44 0 0 0 0 0 983.535 0 0 0 87.9696 0 0 0 0 0 0 0 0 0 0 520.112 0 2428.74 0 0 0 0 -28.3059 0 0.09 0 0 0 -773.873 0 0 0 0 0 0 0 1080.74 0 0 0 544.832 
378.658 0 1828.44 690.863 0 0 0 0 1119.95 0 -1033.59 0 260.094 0 0 0 0 0 0 784.249 0 0 0 0 0 0 0 0 0 0 0 0.04 0 2158.04 0 0 0 394.986 0 0 -92.7 0 0 0 0 1045.03 52.1104 
0 0 0 -1391.87 0 0 0 0 -1329.31 0 0 2149.04 0 0 -501.648 0 640.507 -1972.03 0 -769.601 2477.26 0 0 675.909 0 0 -1239.89 0 1835.76 -611.209 0 0 0.04 120.93 0 0 790.353 1771.22 0 2071.67 0 -327.693 0 0 -288.171 0 0 
1988.05 0 0 0 1617.86 0 516.907 0 1923.35 0 0 0 0 0 0 0 0 -1755.81 0 0 0 0 0 -145.192 -2425.69 0 0 0 0 0 0 865.276 -1976.45 0.08 0 2314.45 0 0 0 0 1265.68 0 0 0 -1577.58 -617.161 -2292.63 
0 0 99.5666 0 0 0 0 0 0 2370.91 2338.25 0 0 0 -1122.55 0 0 0 0 0 0 0 2117.76 0 -1091.11 0 0 141.377 0 0 1264.76 0 0 0 0 0 0 0 0 0 -2276.3 0 1933.12 0 0 -319.147 -104.144 
1943.65 0 -2057.33 0 0 0 1501.59 0 0 0 0 0 0 0 0 0 990.402 0 0 0 0 209.128 0 -1356.93 0 0 0 0 1154.44 0 0 0 0 862.377 0 0.06 -1552.55 2120.2 1410.18 0 2393.34 0 0 0 1548.43 -1064.56 1611.91 
2384.18 0 0 0 0 1909.47 0 0 0 0 0 0 0 0 0 -1679.82 0 787.454 0 0 0 -1527.38 0 0 -604.953 -597.018 1664.4 0 1813.33 0 0 0 -74.9992 0 0 2109.82 0.09 0 0 -173.727 0 1626.56 0 729.011 0 0 1809.67 
0 0 0 0 0 0 0 0 0 0 0 1666.39 0 0 0 0 0 0 -1021.38 0 0 -854.747 0 0 0 0 1834.39 0 622.501 0 0 2373.04 -243.156 0 0 -1154.13 0 0.01 -525.3 0 8.46889 0 0 0 0 0 0 
-2415.77 0 0 0 2264.55 1874.07 0 0 0 0 424.894 0 0 0 0 1211.36 -2042.22 0 496.918 0 -721.992 92.2422 0 1918.01 -1683.78 0 0 66.3015 0 -64.6229 0 0 0 0 0 1249.66 0 376.217 0.03 0 0 0 0 -808.206 -1068.53 1375.55 0 
-2070.45 -388.424 0 0 0 1416.75 0 1603.98 0 0 1840.8 0 0 0 0 0 0 1790.14 0 0 0 0 -2073.81 0 0 0 0 0 436.033 -1075.09 0 0 -2422.48 0 0 0 1188.01 0 0 0.08 0 0 0 0 0 0 0 
0 697.729 0 0 0 0 0 0 0 0 -647.374 -1586.73 0 0 59.2822 2257.07 0 0 0 0 0 0 0 1089.28 0 -1813.03 2293.69 1633.73 0 628.758 0 -1552.1 0 2274.62 -1966.99 2051.68 0 444.884 0 0 0.08 -1028.09 2124.77 0 0 0 0 
0 0 0 0 1453.83 1212.73 0 0 -2241.51 -65.2333 0 0 0 0 0 0 2163.08 2331.39 -564.211 0 0 492.645 1409.42 0 -1433.38 0 0 0 990.555 1904.89 0 0 1404.54 0 0 0 -857.799 0 0 0 494.781 0.06 -1746.65 0 0 1224.33 0 
0 0 0 0 0 0 0 0 0 0 2219.69 0 1201.28 -680.944 0 0 0 0 1009.93 0 0 -1335.11 0 0 0 1187.09 -985.519 0 0 -1935.1 -2228.69 0 0 0 1920.15 0 0 0 0 0 2262.26 297.784 0.04 0 0 0 -255.058 
0 0 1688.51 -985.214 0 0 0 0 2334.13 0 0 -2107.68 0 0 0 0 0 0 0 -316.553 0 0 0 0 0 559.023 0 0 0 0 0 0 0 0 0 0 63.5548 0 1082.57 0 0 0 0 0.03 -389.187 0 0 
0 0 0 778.451 0 0 0 0 -1484.19 0 0 0 0 0 0 0 0 0 0 0 0 761.208 0 0 0 0 0 0 0 467.62 0 0 2203.97 1223.72 0 -1707.89 0 0 -869.396 0 0 0 0 1635.11 0 0 1302.61 
0 0 0 0 0 0 0 0 0 0 0 0 0 0 779.214 0 0 0 0 874.432 0 0 0 0 776.315 0 0 1018.17 -376.98 0 0 -1849.04 0 1493.65 -1386.68 -80.0348 0 0 982.009 0 0 -336.695 0 0 0 0.07 0 
0 1955.7 0 0 2006.67 0 1557.13 0 0 0 0 0 1146.5 0 0 1157.03 0 0 380.337 1461 0 0 0 0 0 0 0 0 0 1042.13 753.578 -2289.42 0 1077.68 -197.684 -1862.47 948.592 0 0 0 0 0 -1047.32 0 1652.04 0 0.04 
