*Vertices 58
*Matrix 
0.04 0 0 0 360.958 0 0 0 0 0 0 0 0 0 0 0 0 0 0 0 0 1702.09 0 0 0 0 -914.258 0 0 0 -781.503 0 0 0 0 1029.01 1867.66 0 0 2301.63 0 738.624 82.4763 0 0 0 0 0 0 0 -1783.88 0 0 0 0 0 0 0 
0 0.08 0 0 0 0 0 0 0 0 0 0 0 471.282 0 0 1071.12 0 2001.02 0 0 0 0 0 0 0 139.241 0 0 0 0 0 0 0 0 0 0 -892.285 0 0 0 0 0 2128.13 0 0 0 2189.17 0 0 0 0 0 0 0 0 0 0 
0 0 0.08 0 0 0 0 0 0 0 0 0 0 0 0 0 0 0 717.109 0 0 0 0 0 859.325 -2337.64 0 0 0 0 0 0 0 2137.75 0 0 0 0 0 0 0 0 0 0 0 926.771 0 0 0 2110.13 0 0 0 0 1080.89 0 0 0 
0 0 0 0.02 0 0 0 0 0 0 0 0 2088.15 0 0 0 0 0 0 0 0 0 0 0 0 0 0 0 0 0 0 0 0 0 -2364.96 0 0 0 0 2442.63 0 -762.123 1464.81 0 -686.285 0 0 0 0 1976.15 0 0 0 0 0 0 0 0 
-384.457 0 0 0 0.06 0 0 0 0 0 -1412.17 0 0 0 0 0 -1022.6 2015.82 0 0 2191 0 0 0 0 1663.64 536.744 0 0 0 0 0 0 0 0 0 0 0 28.7637 0 0 0 0 787.912 0 -1022.45 0 -1884.14 0 0 0 0 0 0 0 0 0 0 
0 0 0 0 0 0 0 0 601.291 0 0 0 0 0 0 0 0 0 0 0 0 0 0 0 0 2068.47 0 0 0 0 0 0 0 115.894 0 0 0 0 0 0 457.854 0 0 0 0 0 0 729.316 0 0 0 0 0 0 0 0 0 0 
0 0 0 0 0 0 0.01 0 0 0 0 0 0 0 0 0 0 0 0 1698.43 0 0 0 0 0 0 0 0 -1079.82 0 0 1056.63 0 0 0 0 0 0 0 0 0 889.233 1444.67 1675.39 0 0 0 0 0 0 0 0 0 0 0 0 0 0 
0 0 0 0 0 0 0 0.06 0 0 0 0 1755.96 0 0 0 0 0 0 0 0 0 0 0 0 0 -2312.62 -2451.63 0 0 0 0 1700.26 0 0 0 0 1528.29 0 -2021.32 1310.85 0 0 2372.74 0 0 0 0 0 621.586 0 0 1511.66 -1822.49 0 0 0 0 
0 0 0 0 0 2493.29 0 0 0.05 0 0 0 0 0 0 0 0 0 0 0 1326.26 1291.77 0 0 0 0 0 0 1260.95 0 0 0 -2182.61 1220.21 0 0 0 0 0 0 -517.823 0 0 0 0 0 0 0 0 0 0 0 0 0 0 0 0 0 
0 0 0 0 0 0 0 0 0 0.04 0 0 554.903 0 0 0 0 0 1226.77 0 0 0 0 0 0 -628.91 0 0 -152.669 799.203 -304.804 0 0 0 0 -1974.01 1255.61 0 0 0 0 0 931.043 -84.7652 0 0 0 0 0 0 0 0 0 0 0 0 0 0 
0 0 0 0 2248.22 0 0 0 0 0 0.08 0 0 866.649 390.255 0 0 0 2352.44 0 0 0 0 290.46 0 0 45.8541 0 0 0 0 0 0 0 0 0 0 0 -1559.88 0 0 0 0 0 0 0 -855.052 0 0 0 0 0 0 0 0 0 0 0 
0 0 0 0 0 0 0 0 0 0 0 0.02 0 0 0 0 0 -60.8081 -1471.68 0 1337.24 2241.97 0 2317.65 0 659.124 0 0 0 0 0 0 0 0 0 0 0 0 0 0 2392.27 0 -2386.93 0 0 0 0 0 0 0 0 0 0 0 0 0 0 0 
0 0 0 552.461 0 0 0 916.852 0 1152.61 0 0 0.07 0 0 0 1636.63 0 0 0 0 0 0 1751.38 0 0 0 0 0 0 0 0 0 0 0 0 0 2305.6 -496.765 0 0 -116.504 0 0 341.121 1803.42 0 0 0 -2093.19 0 0 0 0 0 0 0 0 
0 -343.104 0 0 0 0 0 0 0 0 522.553 0 0 0.08 378.506 0 0 0 0 0 0 0 0 0 0 0 0 0 0 0 0 0 -1141.47 0 0 0 1004.75 0 0 2073.35 0 0 0 0 0 0 0 0 -1704.08 0 0 0 0 0 0 0 0 0 
0 0 0 0 0 0 0 0 0 0 -1258.2 0 0 1724.22 0.07 0 0 0 0 0 -401.395 0 0 0 0 0 0 1585.97 0 0 0 0 0 0 0 0 0 0 0 0 0 0 0 0 0 0 0 0 0 0 0 0 0 0 0 0 0 0 
0 0 0 0 0 0 0 0 0 0 0 0 0 0 0 0.05 0 0 0 1952.5 0 0 0 0 0 0 0 0 0 0 0 0 0 1222.65 -1102.56 0 0 0 1497.62 0 0 0 1787.85 0 0 0 0 0 0 0 0 0 0 0 0 0 0 0 
0 1824.63 0 0 -1385.16 0 0 0 0 0 0 0 -545.442 0 0 0 0.06 0 0 0 0 0 0 2417.14 0 0 0 0 0 0 0 0 0 0 -1115.68 0 0 0 0 0 134.51 0 2361.6 0 0 0 -1051.13 0 0 0 0 0 0 0 0 0 0 0 
0 0 0 0 2342.52 0 0 0 0 0 0 327.387 0 0 0 0 0 0.01 0 0 0 0 0 0 0 -1384.09 0 0 0 0 0 0 0 0 0 0 0 0 0 0 0 0 0 0 0 0 0 0 0 0 0 0 0 0 0 0 0 0 
0 -121.998 1524.48 0 0 0 0 0 0 1209.68 -1640.29 2171.01 0 0 0 0 0 0 0.06 -138.325 0 549.562 0 0 0 0 0 0 0 0 0 0 0 0 0 11.9785 0 0 0 0 -2014.45 0 -194.327 0 0 0 0 0 0 0 2482.15 0 0 0 0 0 0 0 
0 0 0 0 0 0 1239.43 0 0 0 0 0 0 0 0 -1549.96 0 0 1923.96 0.09 2081.44 0 0 21.4393 0 -486.389 0 1678.75 0 0 0 0 1051.29 0 1353.72 1408.96 0 0 0 0 0 0 0 0 0 0 0 0 0 0 0 0 0 0 0 0 0 0 
0 0 0 0 1941.36 0 0 0 -117.725 0 0 -954.695 0 0 1065.63 0 0 0 0 2474.67 0.05 0 0 0 0 0 0 0 0 0 0 0 0 0 0 0 0 0 0 0 0 1103.78 0 -125.965 0 0 0 0 0 -1703.62 0 0 0 0 0 0 0 0 
1671.73 0 0 0 0 0 0 0 2103.11 0 0 -874.432 0 0 0 0 0 0 1220.21 0 0 0.01 0 0 0 0 0 0 0 0 0 -1519.29 0 0 0 0 0 0 0 0 0 0 1912.06 0 0 0 0 0 0 0 0 0 0 0 0 0 0 0 
0 0 0 0 0 0 0 0 0 0 0 0 0 0 0 0 0 0 0 0 0 0 0.02 1439.48 0 0 0 0 0 0 0 0 0 0 0 0 0 0 0 -375.454 0 0 0 416.349 0 0 0 0 0 0 0 0 0 0 0 0 0 0 
0 0 0 0 0 0 0 0 0 0 1167.41 -2417.91 -1221.27 0 0 0 1877.42 0 0 123.524 0 0 372.555 0.08 0 0 0 0 1720.56 1593.91 -1339.53 0 0 491.577 0 0 0 0 0 0 0 0 0 0 0 0 0 0 0 0 0 0 0 0 0 0 0 0 
0 0 -312.738 0 0 0 0 0 0 0 0 0 0 0 0 0 0 0 0 0 0 0 0 0 0.05 0 0 0 0 0 1744.21 1298.18 0 0 0 0 0 0 1323.66 0 0 0 0 0 0 0 0 0 0 1035.72 0 0 0 0 0 0 0 0 
0 0 2452.24 0 1816.69 718.482 0 0 0 759.835 0 -878.857 0 0 0 0 0 1247.06 0 371.029 0 0 0 0 0 0.04 0 0 0 0 0 0 0 0 1219.44 0 0 0 0 1171.53 0 0 0 0 -1655.4 0 0 -658.666 0 0 0 0 0 0 0 0 0 0 
1733.68 1927.02 0 0 -664.312 0 0 1516.39 0 0 -1338.92 0 0 0 0 0 0 0 0 0 0 0 0 0 0 0 0.03 0 0 0 0 0 0 0 0 0 0 0 0 0 0 0 0 0 0 0 0 0 0 0 0 0 0 0 0 0 0 0 
0 0 0 0 0 0 0 731.147 0 0 0 0 0 0 548.799 0 0 0 0 1436.89 0 0 0 0 0 0 0 0.08 0 0 0 0 0 0 0 0 0 0 0 0 0 0 0 0 1648.84 0 0 -2089.98 0 573.367 0 0 0 0 0 0 0 0 
0 0 0 0 0 0 2303.77 0 1350.22 -1380.12 0 0 0 0 0 0 0 0 0 0 0 0 0 -86.2911 0 0 0 0 0.08 0 -475.249 0 0 0 0 0 0 0 0 0 0 0 0 0 2117.15 -98.4985 0 0 -1660.28 0 0 0 0 0 0 0 0 0 
0 0 0 0 0 0 0 0 0 1268.58 0 0 0 0 0 0 0 0 0 0 0 0 0 2450.41 0 0 0 0 0 0.05 0 0 0 0 0 0 0 0 0 0 0 0 0 0 0 0 -1393.4 0 0 0 0 0 0 0 0 0 0 0 
2339.93 0 0 0 0 0 0 0 0 1397.67 0 0 0 0 0 0 0 0 0 0 0 0 0 1360.13 -2013.23 0 0 0 2184.44 0 0.03 0 0 0 0 0 0 2442.01 0 0 0 0 0 0 1988.05 0 0 -395.138 0 0 0 0 0 0 0 0 0 0 
0 0 0 0 0 0 1492.43 0 0 0 0 0 0 0 0 0 0 0 0 0 0 -796.915 0 0 984.603 0 0 0 0 0 0 0 0 0 0 0 0 0 2414.09 0 0 0 0 0 0 0 0 0 0 0 0 0 0 0 0 0 0 0 
0 0 0 0 0 0 0 1161.31 645.695 0 0 0 0 1482.67 0 0 0 0 0 1562.47 0 0 0 0 0 0 0 0 0 0 0 0 0.09 0 0 0 0 0 0 0 0 0 0 0 0 0 0 0 -2390.29 0 0 0 0 0 0 0 0 0 
0 0 2191.61 0 0 1221.88 0 0 2431.79 0 0 0 0 0 0 1114.15 0 0 0 0 0 0 0 868.48 0 0 0 0 0 0 0 0 0 0.04 0 653.63 0 0 0 -1248.44 0 0 0 0 0 0 0 0 0 -2243.34 309.534 0 0 0 0 0 0 0 
0 0 0 -1330.84 0 0 0 0 0 0 0 0 0 0 0 -56.2304 -1549.96 0 0 2070.15 0 0 0 0 0 839.183 0 0 0 0 0 0 0 0 0.09 0 1394.31 0 0 0 0 960.646 0 0 0 0 0 0 0 1989.27 450.072 0 0 0 0 0 0 0 
-1645.79 0 0 0 0 0 0 0 0 846.507 0 0 0 0 0 0 0 0 1469.24 983.84 0 0 0 0 0 0 0 0 0 0 0 0 0 2257.07 0 0 0 0 0 0 0 0 0 0 0 -1063.95 0 0 0 0 0 0 0 0 0 0 0 0 
1956.47 0 0 0 0 0 0 0 0 -2355.95 0 0 0 786.081 0 0 0 0 0 0 0 0 0 0 0 0 0 0 0 0 0 0 0 0 2215.26 0 0.04 0 0 0 1339.38 0 0 0 0 0 0 0 0 0 0 0 0 0 0 0 0 0 
0 495.697 0 0 0 0 0 2487.49 0 0 0 0 535.981 0 0 0 0 0 0 0 0 0 0 0 0 0 0 0 0 0 867.565 0 0 0 0 0 0 0.05 0 0 0 0 0 0 0 0 0 667.364 0 0 0 0 0 0 0 0 0 0 
0 0 0 0 1702.7 0 0 0 0 0 2047.26 0 -663.091 0 0 351.344 0 0 0 0 0 0 0 0 1971.72 0 0 0 0 0 0 960.036 0 0 0 0 0 0 0 0 0 1665.47 0 0 0 0 0 0 0 0 0 0 0 0 0 0 0 0 
704.596 0 0 661.565 0 0 0 2038.87 0 0 0 0 0 1257.13 0 0 0 0 0 0 0 0 1635.72 0 0 -491.577 0 0 0 0 0 0 0 -1744.82 0 0 0 0 0 0.09 0 0 0 0 0 0 -866.192 0 0 0 1368.68 0 0 0 0 0 0 0 
0 0 0 0 0 -2000.56 0 1463.13 465.484 0 0 366.909 0 0 0 0 -427.03 0 1993.39 0 0 0 0 0 0 0 0 0 0 0 0 0 0 0 0 0 458.159 0 0 0 0.02 0 0 0 0 -200.888 -68.5903 0 1845.38 -1706.98 0 0 0 0 0 0 0 0 
1990.04 0 0 2393.64 0 0 1919.08 0 0 0 0 0 -1692.02 0 0 0 0 0 0 0 1929.91 0 0 0 0 0 0 0 0 0 0 0 0 0 -429.167 0 0 0 20.0659 0 0 0.07 0 0 0 0 0 0 0 0 0 0 0 0 0 0 0 960.952 
-1572.85 0 0 1005.66 0 0 6.79037 0 0 -58.6718 0 -2123.86 0 0 0 1497.31 2150.41 0 -869.091 0 0 1927.78 0 0 0 0 0 0 0 0 0 0 0 0 0 0 0 0 0 0 0 0 0.03 0 0 0 0 0 0 0 1406.06 0 0 0 0 0 0 0 
0 -1227.38 0 0 1792.12 0 1540.8 695.746 0 1321.83 0 0 0 0 0 0 0 0 0 0 2227.01 0 -153.89 0 0 0 0 0 0 0 0 0 0 0 0 0 0 0 0 0 0 0 0 0.01 2428.13 0 0 0 0 0 0 0 0 0 0 0 0 0 
0 0 0 -14.1148 0 0 0 0 0 0 0 0 209.586 0 0 0 0 0 0 0 0 0 0 0 0 -2409.36 0 1626.41 422.452 0 1205.86 0 0 0 0 0 0 0 0 0 0 0 0 2015.37 0.01 -909.68 -127.796 0 0 0 0 0 0 0 0 -821.177 0 0 
0 0 -5.72222 0 -911.206 0 0 0 0 0 0 0 1177.94 0 0 0 0 0 0 0 0 0 0 0 0 0 0 0 2013.99 0 0 0 0 0 0 -483.032 0 0 0 0 -1395.99 0 0 0 815.378 0.03 1862.16 0 0 0 0 0 0 0 0 0 0 0 
0 0 0 0 0 0 0 0 0 0 -247.887 0 0 0 0 0 658.818 0 0 0 0 0 0 0 0 0 0 0 0 -1489.07 0 0 0 0 0 0 0 0 0 1756.87 -299.615 0 0 0 1038.01 1359.52 0.09 0 0 0 0 0 0 0 0 0 168.386 0 
0 2418.06 0 0 -1591.46 400.327 0 0 0 0 0 0 0 0 0 0 0 0 0 0 0 0 0 0 0 2418.36 0 1150.78 0 0 53.0259 0 0 0 0 0 0 -1355.25 0 0 0 0 0 0 0 0 0 0.09 0 0 0 0 0 0 0 0 0 0 
0 0 0 0 0 0 0 0 0 0 0 0 0 2328.18 0 0 0 0 0 0 0 0 0 0 0 0 0 0 1458.1 0 0 0 13.5044 0 0 0 0 0 0 0 1112.78 0 0 0 0 0 0 0 0.04 0 1433.38 0 0 0 0 0 0 0 
0 0 2485.35 1808.91 0 0 0 2191 0 0 0 0 -22.3548 0 0 0 0 0 0 0 896.557 0 0 0 164.724 0 0 -2424.77 0 0 0 0 0 -1536.38 1988.2 0 0 0 0 0 114.063 0 0 0 0 0 0 0 0 0.06 0 0 0 0 0 0 0 0 
1886.58 0 0 0 0 0 0 0 0 0 0 0 0 0 0 0 0 0 1473.66 0 0 0 0 0 0 0 0 0 0 0 0 0 0 821.94 511.261 0 0 0 0 -1502.2 0 0 1799.45 0 0 0 0 0 429.014 0 0.07 -895.795 0 0 0 0 0 0 
0 0 0 0 0 0 0 0 0 0 0 0 0 0 0 0 0 0 0 0 0 0 0 0 0 0 0 0 0 0 0 0 0 0 0 0 0 0 0 0 0 0 0 0 0 0 0 0 0 0 674.535 0.05 0 0 0 0 0 0 
0 0 0 0 0 0 0 555.361 0 0 0 0 0 0 0 0 0 0 0 0 0 0 0 0 0 0 0 0 0 0 0 0 0 0 0 0 0 0 0 0 0 0 0 0 0 0 0 0 0 0 0 0 0.02 0 0 0 0 0 
0 0 0 0 0 0 0 326.167 0 0 0 0 0 0 0 0 0 0 0 0 0 0 0 0 0 0 0 0 0 0 0 0 0 0 0 0 0 0 0 0 0 0 0 0 0 0 0 0 0 0 0 0 0 0.05 0 0 0 0 
0 0 1958.3 0 0 0 0 0 0 0 0 0 0 0 0 0 0 0 0 0 0 0 0 0 0 0 0 0 0 0 0 0 0 0 0 0 0 0 0 0 0 0 0 0 0 0 0 0 0 0 0 0 0 0 0.01 0 0 0 
0 0 0 0 0 0 0 0 0 0 0 0 0 0 0 0 0 0 0 0 0 0 0 0 0 0 0 0 0 0 0 0 0 0 0 0 0 0 0 0 0 0 0 0 2141.41 0 0 0 0 0 0 0 0 0 0 0.05 0 0 
0 0 0 0 0 0 0 0 0 0 0 0 0 0 0 0 0 0 0 0 0 0 0 0 0 0 0 0 0 0 0 0 0 0 0 0 0 0 0 0 0 0 0 0 0 0 503.174 0 0 0 0 0 0 0 0 0 0.01 0 
0 0 0 0 0 0 0 0 0 0 0 0 0 0 0 0 0 0 0 0 0 0 0 0 0 0 0 0 0 0 0 0 0 0 0 0 0 0 0 0 0 1053.42 0 0 0 0 0 0 0 0 0 0 0 0 0 0 0 0.09 
