*Vertices 50
*Matrix 
0.01 0 0 0 0 0 0 0 0 0 0 0 0 0 0 0 0 0 0 0 0 0 0 0 0 0 0 0 0 0 1390.35 1341.21 0 1667.61 0 0 0 0 0 0 0 0 0 0 0 0 0 0 0 0 
0 0 0 0 0 0 0 0 0 0 1392.33 0 0 0 0 0 0 1797.31 0 1812.72 0 0 1676 0 0 0 0 0 0 0 0 0 0 0 0 0 0 0 -428.861 0 0 0 0 722.755 0 -972.243 -281.304 0 0 0 
0 0 0 1542.02 1531.19 0 0 0 0 0 0 0 1598.03 0 -19.4555 -926.618 0 0 0 0 0 -14.1148 468.23 0 0 0 0 0 0 0 0 0 -1667.76 0 0 0 514.313 0 0 0 0 0 0 0 0 0 0 0 0 0 
0 0 1007.34 0.03 0 0 0 0 0 0 0 0 0 0 0 0 0 0 0 0 0 0 0 -1524.32 0 0 0 0 0 0 0 0 0 0 0 0 0 0 1910.38 0 0 0 1410.79 1572.39 0 1684.09 1784.65 0 0 0 
0 0 1898.94 0 0 1929.76 681.555 0 0 0 0 0 0 0 0 0 0 0 0 0 0 0 0 0 0 0 0 0 1093.25 0 0 1884.29 0 0 0 0 40.9711 0 0 -2140.95 223.93 0 0 0 0 2112.87 -405.667 0 0 0 
0 0 0 0 1543.86 0.03 0 0 -601.901 0 781.503 0 0 0 0 0 0 0 0 1151.23 0 0 0 0 0 0 0 0 0 0 0 0 0 0 0 0 0 0 -1631.29 0 0 0 0 0 0 0 0 0 0 0 
0 0 0 0 833.537 0 0.01 0 0 0 0 0 0 2400.05 0 0 0 0 0 0 0 0 0 0 -214.316 568.331 0 1151.54 70.2689 0 0 0 0 -2148.58 0 -1400.88 0 0 0 0 0 0 0 0 0 0 0 0 0 0 
0 0 0 0 0 0 0 0.04 0 0 0 0 0 0 0 0 0 0 0 0 0 0 0 1109.42 0 0 2316.89 0 0 0 0 0 0 0 0 1786.48 0 0 873.211 0 0 164.876 0 0 0 0 0 0 0 0 
0 0 0 0 0 2087.69 0 0 0.04 0 0 0 0 0 0 1242.18 0 1952.04 0 0 0 0 0 -2395.93 0 0 0 0 0 0 0 0 0 0 0 0 275.964 0 0 0 0 0 0 1917.1 0 0 0 0 0 0 
0 0 0 0 0 0 0 0 0 0.06 0 0 -169.912 0 0 0 0 0 1913.74 0 0 0 0 0 0 0 0 743.049 0 1262.63 0 0 0 0 0 0 0 0 2055.04 0 0 0 0 0 0 0 0 0 0 0 
0 2163.38 0 0 0 -1625.95 0 0 0 0 0 0 0 0 0 1659.67 1163.9 0 2014.45 0 0 0 0 0 0 0 0 0 0 0 0 0 0 1805.09 0 0 0 0 0 168.691 -747.78 0 0 0 0 0 0 0 0 0 
0 0 0 0 0 0 0 0 0 0 0 0 0 1080.13 0 0 -806.986 0 0 0 0 0 0 0 0 0 0 0 0 0 0 0 0 0 0 0 0 0 0 0 0 0 0 0 591.372 0 0 0 0 0 
0 0 -525.758 0 0 0 0 0 0 2482.91 0 0 0.05 0 0 0 519.959 0 778.909 0 0 0 -1574.37 0 0 0 0 0 0 0 0 0 0 0 0 0 0 0 0 0 0 0 -63.097 1865.37 0 0 0 0 0 0 
0 0 0 0 0 0 1144.37 0 0 0 0 -1251.79 0 0.03 1577.12 2465.51 0 0 0 0 0 0 0 0 0 0 0 0 0 0 0 -353.633 0 1331.14 0 1560.18 0 0 0 518.281 0 0 363.399 0 0 0 0 463.5 0 0 
0 0 1752.45 0 0 0 0 0 0 0 0 0 0 -818.583 0 0 0 0 0 645.39 940.352 0 0 0 0 0 0 0 0 0 0 0 0 0 0 0 0 0 0 0 -2045.73 0 0 0 0 0 0 0 0 0 
0 0 1259.88 0 0 0 0 0 865.123 0 1740.39 0 0 240.41 0 0.05 0 0 0 2153.16 0 0 976.669 0 0 0 0 0 0 0 0 0 0 0 0 0 0 0 0 0 -1425.29 0 0 0 0 1564.61 0 0 0 0 
0 0 0 0 0 0 0 0 0 0 -468.23 760.445 -176.168 0 0 0 0.04 0 0 530.335 0 1325.5 0 0 0 0 0 1807.08 0 0 0 0 0 0 0 0 0 0 0 0 0 0 0 0 0 0 644.932 0 0 0 
0 -1834.24 0 0 0 0 0 0 -1460.54 0 0 0 0 0 0 0 0 0.03 0 0 0 0 -1627.78 0 0 0 0 0 0 0 0 0 0 2202.14 0 0 2156.82 0 1573.15 0 0 0 0 0 0 0 0 0 0 0 
0 0 0 0 0 0 0 0 0 -2183.68 -1882.61 0 832.621 0 0 0 0 0 0.04 0 0 0 761.971 0 0 0 0 0 0 0 1307.18 0 203.94 2117.76 0 1181.75 0 -1446.81 0 0 0 0 0 0 0 0 0 0 0 0 
0 700.323 0 0 0 -1878.49 0 0 0 0 0 0 0 0 130.085 -2106.16 2435.15 0 0 0.06 -824.229 1319.39 0 0 0 0 0 0 0 0 2471.62 0 0 0 0 0 0 0 47.8378 0 0 0 1641.97 517.67 0 0 0 0 0 0 
0 0 0 0 0 0 0 0 0 0 0 0 0 0 2307.12 0 0 0 0 1730.02 0.07 0 0 0 0 0 0 0 0 0 0 0 0 0 0 0 0 0 0 0 0 0 0 0 0 0 0 0 0 0 
0 0 1437.8 0 0 0 0 0 0 0 0 0 0 0 0 0 -1166.34 0 0 646.153 0 0.03 0 0 1797.92 0 0 0 0 0 0 0 0 0 0 0 1124.53 709.174 0 -5.26444 0 0 0 0 0 0 0 0 0 0 
0 -959.883 1618.93 0 0 0 0 0 0 0 0 0 -2342.07 0 0 2086.47 0 -1065.32 960.646 0 0 0 0.04 0 0 0 0 0 0 0 0 0 0 0 1271.63 0 0 0 0 0 0 0 0 0 0 0 0 0 0 0 
0 0 0 -525.452 0 0 0 320.673 840.556 0 0 0 0 0 0 0 0 0 0 0 0 0 0 0.09 0 884.045 0 0 0 0 0 0 0 0 0 0 0 0 0 1414.61 0 0 -1772.74 0 0 0 0 0 0 0 
0 0 0 0 0 0 2026.51 0 0 0 0 0 0 0 0 0 0 0 0 0 0 1856.52 0 0 0.09 881.603 0 708.411 0 -1135.21 -2393.49 0 -1606.27 0 2471.47 0 0 0 0 0 0 0 0 0 0 0 0 0 0 0 
0 0 0 0 0 0 2107.68 0 0 0 0 0 0 0 0 0 0 0 0 0 0 0 0 2440.95 -1036.64 0.09 0 23.2704 0 0 0 0 0 0 0 0 0 -784.86 0 0 0 0 219.199 0 0 0 0 0 0 0 
0 0 0 0 0 0 0 1664.86 0 0 0 0 0 0 0 0 0 0 0 0 0 0 0 0 0 0 0.02 0 -1299.1 0 0 0 0 0 0 0 0 0 0 0 0 0 0 0 2194.97 0 0 0 0 -144.276 
0 0 0 0 0 0 1970.66 0 0 1596.19 0 0 0 0 0 0 1060.44 0 0 0 0 0 0 0 1551.64 761.513 0 0.09 0 0 0 0 1387.91 1378.14 0 0 0 0 0 0 2129.05 0 0 0 0 -591.22 136.799 0 -1595.74 0 
0 0 0 0 2223.65 0 -1128.19 0 0 0 0 0 0 0 0 0 0 0 0 0 0 0 0 0 0 0 1189.54 0 0.07 2019.18 0 0 0 0 1528.9 0 0 0 0 0 0 0 0 0 0 777.078 0 0 0 0 
0 0 0 0 0 0 0 0 0 1484.8 0 0 0 0 0 0 0 0 0 0 0 0 0 0 1131.09 0 0 0 1231.65 0.07 0 0 0 0 0 0 0 0 0 0 0 0 0 0 0 0 0 0 0 0 
-1706.98 0 0 0 0 0 0 0 0 0 0 0 0 0 0 0 0 0 2175.89 -2207.63 0 0 0 0 943.403 0 0 0 0 0 0.03 2347.1 0 0 0 -1419.8 0 0 1357.23 0 0 0 0 0 0 0 0 0 0 0 
1720.86 0 0 0 1500.98 0 0 0 0 0 0 0 0 1240.96 0 0 0 0 0 0 0 0 0 0 0 0 0 0 0 0 1348.23 0.04 0 0 0 -2275.99 0 0 0 0 0 2151.94 0 0 0 0 0 0 0 0 
0 0 2065.11 0 0 0 0 0 0 0 0 0 0 0 0 0 0 0 -586.032 0 0 0 0 0 -861.003 0 0 1513.34 0 0 0 0 0.03 0 0 1941.66 0 0 0 -14.2674 0 0 243.614 0 -431.455 0 0 0 0 0 
2389.68 0 0 0 0 0 -452.818 0 0 0 1788.92 0 0 -981.246 0 0 0 -537.049 1448.18 0 0 0 0 0 0 0 0 -418.943 0 0 0 0 0 0.03 0 0 0 0 0 0 0 0 0 0 369.35 -721.686 0 0 0 0 
0 0 0 0 0 0 0 0 0 0 0 0 0 0 0 0 0 0 0 0 0 0 -2327.72 0 2056.72 0 0 0 779.824 0 0 0 0 0 0.04 0 0 0 0 0 0 0 0 0 1106.83 1864.6 0 0 0 0 
0 0 0 0 0 0 -1840.19 1761.15 0 0 0 0 0 -504.242 0 0 0 0 -182.272 0 0 0 0 0 0 0 0 0 0 0 182.577 1805.09 404.599 0 0 0.04 0 1736.73 0 0 0 0 1571.63 0 0 0 0 0 0 0 
0 0 1527.38 0 -116.199 0 0 0 -832.011 0 0 0 0 0 0 0 0 415.586 0 0 0 1414.91 0 0 0 0 0 0 0 0 0 0 0 0 0 0 0.09 0 0 0 0 0 0 0 0 0 0 0 0 0 
0 0 0 0 0 0 0 0 0 0 0 0 0 0 0 0 0 0 1506.32 0 0 277.947 0 0 0 -1308.71 0 0 0 0 0 0 0 0 0 913.343 0 0.09 0 0 819.498 0 680.334 535.829 0 0 0 0 0 0 
0 -151.601 0 1329.16 0 1679.66 0 870.769 0 -84.3074 0 0 0 0 0 0 0 -208.823 0 1190.15 0 0 0 0 0 0 0 0 0 0 1164.97 0 0 0 0 0 0 0 0 0 0 0 0 0 2156.97 -2297.81 0 0 0 0 
0 0 0 0 -472.808 0 0 0 0 0 39.7504 0 0 48.9059 0 0 0 0 0 0 0 1078.14 0 -970.87 0 0 0 0 0 0 0 0 305.261 0 0 0 0 0 0 0.01 0 0 0 0 0 -656.377 1114.46 0 0 0 
0 0 0 0 -2048.63 0 0 0 0 0 493.713 0 0 0 1907.94 2013.84 0 0 0 0 0 0 0 0 0 0 0 1882.31 0 0 0 0 0 0 0 0 0 1291.92 0 0 0 0 0 0 0 0 0 0 0 0 
0 0 0 0 0 0 0 369.35 0 0 0 0 0 0 0 0 0 0 0 0 0 0 0 0 0 0 0 0 0 0 0 550.783 0 0 0 0 0 0 0 0 0 0.03 0 0 0 0 0 0 0 0 
0 0 0 -2165.97 0 0 0 0 0 0 0 0 -327.235 -931.349 0 0 0 0 0 2274.77 0 0 0 -760.14 0 -2260.28 0 0 0 0 0 0 2204.43 0 0 309.839 0 -590.457 0 0 0 0 0.09 0 0 0 2214.04 0 0 0 
0 242.393 0 -142.14 0 0 0 0 -1228.14 0 0 0 2262.87 0 0 0 0 0 0 2450.1 0 0 0 0 0 0 0 0 0 0 0 0 0 0 0 0 0 1186.03 0 0 0 0 0 0.07 0 0 0 0 0 0 
0 0 0 0 0 0 0 0 0 0 0 -349.055 0 0 0 0 0 0 0 0 0 0 0 0 0 0 1718.42 0 0 0 0 0 1203.27 1528.14 1618.93 0 0 0 -655.461 0 0 0 0 0 0.02 0 0 0 0 0 
0 551.241 0 2242.42 -670.721 0 0 0 0 0 0 0 0 0 0 2407.38 0 0 0 0 0 0 0 0 0 0 0 -1356.17 1722.85 0 0 0 0 162.435 143.666 0 0 0 934.553 1186.48 0 0 0 0 0 0.09 0 0 0 0 
0 -24.4911 0 2294.46 920.209 0 0 0 0 0 0 0 0 0 0 0 1833.78 0 0 0 0 0 0 0 0 0 0 1226.92 0 0 0 0 0 0 0 0 0 0 0 -88.58 0 0 -1149.25 0 0 0 0.08 0 0 0 
0 0 0 0 0 0 0 0 0 0 0 0 0 49.5163 0 0 0 0 0 0 0 0 0 0 0 0 0 0 0 0 0 0 0 0 0 0 0 0 0 0 0 0 0 0 0 0 0 0.07 0 0 
0 0 0 0 0 0 0 0 0 0 0 0 0 0 0 0 0 0 0 0 0 0 0 0 0 0 0 1440.24 0 0 0 0 0 0 0 0 0 0 0 0 0 0 0 0 0 0 0 0 0.09 0 
0 0 0 0 0 0 0 0 0 0 0 0 0 0 0 0 0 0 0 0 0 0 0 0 0 0 2205.65 0 0 0 0 0 0 0 0 0 0 0 0 0 0 0 0 0 0 0 0 0 0 0.03 
