*Vertices 41
*Matrix 
0.03 0 0 0 0 2467.04 0 0 1491.36 0 0 0 0 0 0 0 0 0 0 0 0 1483.58 0 1785.41 0 0 0 0 0 2098.22 0 0 0 0 0 0 -721.381 0 0 0 0 
0 0.02 0 0 2062.21 0 0 0 0 22.5074 1171.07 2299.19 0 0 0 -87.2066 -1958.75 0 0 0 1683.78 0 0 0 0 0 0 0 0 0 0 0 0 0 405.362 1081.19 0 0 0 0 0 
0 0 0 0 2086.47 0 0 0 0 0 0 0 0 0 0 0 0 -150.075 0 0 0 0 0 0 0 0 0 0 -964.003 -2017.2 -73.3207 2455.75 0 2137.44 2362.36 0 0 0 0 2066.48 0 
0 0 0 0.07 0 -155.263 0 0 0 0 -768.38 0 2364.96 0 0 0 277.642 0 0 0 0 0 -2380.67 0 0 0 0 840.098 0 0 0 2365.87 0 0 0 0 -308.618 0 0 0 0 
0 523.011 1372.65 0 0.06 0 0 0 0 0 0 0 0 0 0 0 0 0 -254.295 0 0 0 1308.1 1457.34 -1155.2 614.566 0 0 0 0 0 -221.183 0 0 0 1808.3 0 0 0 0 0 
762.123 0 0 55.7726 0 0.01 0 0 0 0 0 -2306.05 0 -312.128 743.507 0 1559.27 -458.007 0 0 0 2389.98 0 0 0 0 0 2139.58 0 0 0 690.405 0 147.938 1094.47 0 0 0 0 0 0 
0 0 0 0 0 0 0.08 -552.766 0 -1257.9 0 0 679.571 0 0 247.429 0 1507.23 0 -1697.97 0 2349.09 0 780.129 0 -1869.64 0 0 2397.31 0 0 0 1100.12 0 0 0 0 0 0 0 0 
0 0 0 0 0 0 -1350.37 0.04 1907.18 0 0 0 0 0 0 0 0 0 0 0 0 0 0 0 0 0 0 0 0 0 0 571.23 0 0 0 399.869 0 0 0 0 0 
-1863.69 0 0 0 0 0 0 -932.875 0.07 0 1324.27 0 -95.5992 995.132 0 0 0 0 190.054 0 0 0 0 0 0 177.541 0 0 0 0 0 0 0 1873.91 0 0 0 0 -862.529 0 1418.88 
0 -569.552 0 0 0 0 -710.242 0 0 0.05 664.159 0 0 0 0 1202.66 0 0 0 0 0 -1977.52 0 0 0 0 0 1344.87 473.266 1553.77 0 0 0 726.417 0 0 0 0 0 0 0 
0 524.079 0 251.549 0 0 0 0 -1785.41 2126.15 0.06 -1313.59 0 0 -1804.79 0 1840.49 0 0 0 -143.971 0 0 0 0 2126 0 0 0 -1613.74 0 0 -794.626 110.096 -243.309 1332.67 899.762 0 0 0 0 
0 242.241 0 0 0 -1555.15 0 0 0 0 -379.727 0.04 740.913 0 0 -1776.1 595.95 0 0 0 0 0 0 0 0 0 0 0 201.498 1593.75 1518.52 0 0 0 0 0 1617.4 0 0 574.282 0 
0 0 0 1398.13 0 0 1867.5 0 -2411.95 0 0 1079.21 0.02 0 0 0 1530.12 0 471.282 0 0 0 0 -2.21259 0 0 0 671.178 0 2449.64 0 1476.71 0 1824.93 0 1924.42 2084.8 0 0 0 0 
0 0 0 0 0 1049.61 0 0 -528.047 0 0 0 0 0.01 0 -2354.43 0 0 0 0 0 0 0 734.352 -2341 1889.78 0 0 184.866 0 1446.5 1574.68 0 0 0 0 0 0 0 0 0 
0 0 0 0 0 1891.77 0 0 0 0 1651.89 0 0 0 0.06 0 0 709.174 0 -635.319 666.448 0 0 0 0 0 0 0 0 0 0 0 0 0 -385.067 0 0 0 0 0 0 
0 -209.891 0 0 0 0 -557.344 0 0 1725.59 0 -228.355 0 -106.586 0 0.07 -644.932 0 0 0 0 0 0 1645.33 0 0 0 0 0 746.712 0 0 969.802 2217.55 0 0 0 0 0 0 0 
0 490.509 0 -415.586 0 -1619.69 0 0 0 0 -929.823 987.808 1496.09 0 0 -585.116 0.01 0 0 0 0 0 0 0 0 2074.42 0 1775.64 1196.55 0 1916.79 0 0 1520.2 0 0 2441.4 -83.3918 0 0 0 
0 0 -1945.94 0 0 2457.88 396.664 0 0 0 0 0 0 0 1454.89 0 0 0.05 0 0 0 0 120.014 0 1610.39 0 0 655.461 0 0 1057.7 1292.84 0 0 1629.31 0 0 114.368 0 0 0 
0 0 0 0 1162.98 0 0 0 1952.19 0 0 0 -1889.02 0 0 0 0 0 0.02 0 0 0 0 0 0 1230.43 0 0 1013.75 -554.14 0 0 7.70592 0 0 0 0 0 0 0 0 
0 0 0 0 0 0 -1249.05 0 0 0 0 0 0 0 1814.4 0 0 0 0 0.01 0 0 0 -1838.97 0 0 0 0 0 0 0 0 1981.8 0 0 1188.01 0 0 0 0 0 
0 1695.23 0 0 0 0 0 0 0 0 1406.22 0 0 0 -646.916 0 0 0 0 0 0.08 924.635 0 0 868.938 0 0 2145.07 0 -686.743 0 0 -1034.96 0 -608.31 0 -658.666 -2191.15 0 0 0 
1705.3 0 0 0 0 2282.86 195.547 0 0 1760.99 0 0 0 0 0 0 0 0 0 0 1469.85 0.02 0 0 0 0 0 0 0 -181.661 0 0 0 172.353 1224.94 0 0 -852.153 1444.21 -631.962 0 
0 0 0 240.562 798.746 0 0 0 0 0 0 0 0 0 0 0 0 -940.504 0 0 0 0 0.08 0 0 0 0 0 0 0 1491.52 0 0 -1719.95 0 1058.46 0 0 0 0 0 
-639.592 0 0 0 -913.19 0 1564.61 0 0 0 0 0 28.7637 436.186 0 2082.35 0 0 0 1069.44 0 0 0 0.01 0 1360.74 -1495.79 0 0 0 0 0 0 1131.4 -157.399 0 0 0 0 0 0 
0 0 0 0 -2069.99 0 0 0 0 0 0 0 0 54.7044 0 0 0 -276.269 0 0 2140.95 0 0 0 0.02 0 0 0 0 1198.39 0 0 0 1862.16 369.503 1805.55 0 0 0 0 -442.137 
0 0 0 0 -2113.33 0 623.722 0 2423.25 0 2248.07 0 0 -47.0748 0 0 -240.41 0 1328.85 0 0 0 0 1314.97 0 0.02 0 0 1086.84 0 0 0 0 0 0 0 0 0 1931.59 0 0 
0 0 0 0 0 0 0 0 0 0 0 0 0 0 0 0 0 0 0 0 0 0 0 -552.614 0 0 0.09 0 0 0 0 0 1029.77 0 0 0 0 0 0 0 0 
0 0 0 -456.023 0 1107.14 0 0 0 -1629.61 0 0 1637.7 0 0 0 1173.82 208.213 0 0 -685.064 0 0 0 0 0 0 0.09 0 0 0 0 0 0 0 0 1332.67 0 0 0 1065.63 
0 0 1343.81 0 0 0 0.534074 0 0 -1171.38 0 -88.1222 0 1523.26 0 0 -918.073 0 -277.642 0 0 0 0 0 0 1623.2 0 0 0.08 0 0 0 0 -2299.95 0 0 1496.7 0 0 0 1036.64 
1907.03 0 847.88 0 0 0 0 0 0 -1300.62 -2173.15 -722.144 499.664 0 0 -1922.9 0 0 770.363 0 -794.32 1676.15 0 0 2475.13 0 0 0 0 0.09 113.758 0 -1643.35 0 1844 0 0 0 1715.52 0 0 
0 0 248.344 0 0 0 0 0 0 0 0 -59.4348 0 -2129.35 0 0 199.057 2437.59 0 0 0 0 692.694 0 0 0 0 0 0 659.124 0.04 -216.453 0 0 2000.26 0 0 0 0 0 0 
0 0 2071.37 -1618.47 374.691 37.0037 0 -2205.8 0 0 0 0 600.681 -357.753 0 0 0 -984.146 0 0 0 0 0 0 0 0 0 0 0 0 2186.12 0 0 0 0 0 0 0 0 0 0 
0 0 0 0 0 0 -871.838 0 0 0 1489.53 0 0 0 0 -848.033 0 0 594.424 119.861 2052.29 0 0 0 0 0 -1392.03 0 0 -11.8259 0 0 0.09 2449.8 0 0 0 0 0 -622.044 0 
0 0 -1539.28 0 0 -284.661 0 0 2021.47 211.722 1120.41 0 2079.76 0 0 1882.61 1707.59 0 0 0 0 -983.383 2257.23 -55.1622 548.341 0 0 0 -1861.86 0 0 0 2279.35 0.08 0 2458.19 0 1956.31 0 -1086.84 0 
0 -12.8941 -1240.2 0 0 2163.08 0 0 0 0 -1030.08 0 0 0 -777.078 0 0 2035.97 0 0 -874.889 2218.47 0 -99.2615 1732.15 0 0 0 0 -1678.44 760.445 0 0 0 0.04 0 0 0 0 0 0 
0 -849.712 0 0 2382.81 0 0 1188.31 0 0 2185.2 0 2134.24 0 0 0 0 0 0 72.4052 0 0 54.2467 0 -2438.51 0 0 0 0 0 0 0 0 720.618 0 0.07 0 0 0 0 0 
1315.58 0 0 503.937 0 0 0 0 0 0 -1234.09 2480.01 977.889 0 0 0 -2234.18 0 0 0 490.051 0 0 0 0 0 0 706.427 2464.6 0 0 0 0 0 0 0 0.03 0 0 0 0 
0 0 0 0 0 0 0 0 0 0 0 0 0 0 0 0 275.811 -1655.71 0 0 2356.26 1314.05 0 0 0 0 0 0 0 0 0 0 0 494.476 0 0 0 0.07 -743.049 0 0 
0 0 0 0 0 0 0 0 790.658 0 0 0 0 0 0 0 0 0 0 0 0 1770.15 0 0 0 680.029 0 0 0 -803.323 0 0 0 0 0 0 0 -1399.5 0.05 0 1005.81 
0 0 -1153.52 0 0 0 0 0 0 0 0 -2153.92 0 0 0 0 0 0 0 0 0 1510.28 0 0 0 0 0 0 0 0 0 0 1944.72 53.4837 0 0 0 0 0 0.01 -63.5548 
0 0 0 0 0 0 0 0 567.263 0 0 0 0 0 0 0 0 0 0 0 0 0 0 0 -307.092 0 0 1771.98 -1713.39 0 0 0 0 0 0 0 0 0 1432.31 1772.13 0.01 
