*Vertices 42
*Matrix 
0.08 0 0 0 0 0 0 0 0 0 0 -872.753 0 0 0 -34.8674 2022.39 0 0 0 2094.26 1298.03 0 0 0 0 0 0 0 0 0 0 0 0 -509.125 2416.53 0 -2127.22 0 0 0 -243.614 
0 0.06 824.839 0 0 1950.67 0 0 0 0 0 0 0 -115.894 0 0 0 -749.458 0 0 0 0 0 0 0 0 0 1744.36 0 0 0 0 -391.629 0 0 0 0 0 0 0 0 0 
0 2107.23 0.01 0 0 973.464 0 0 0 -1164.82 -804.239 0 0 0 0 0 0 -2037.8 0 0 0 2142.78 0 -1082.87 0 0 0 0 0 0 0 0 0 0 1270.87 0 0 0 0 0 0 0 
0 0 0 0.07 0 0 1892.99 1433.07 2046.95 0 2331.54 0 0 1804.33 0 0 0 0 857.799 1747.41 0 2443.69 0 0 0 0 0 2073.5 0 1603.98 0 0 0 0 0 0 0 2301.78 0 0 0 0 
0 0 0 0 0.08 1935.41 0 0 0 0 0 0 0 0 0 2003.46 2113.33 125.965 -972.549 1887.19 0 0 0 0 0 0 0 0 0 0 0 0 0 0 0 0 0 0 0 0 0 -68.1326 
0 2386.32 775.246 0 -22.2022 0.05 0 -1741 0 0 0 0 0 701.392 -96.82 1041.06 1684.39 0 1770.91 0 1937.54 0 0 0 0 0 0 0 0 0 0 0 0 0 0 0 -860.393 0 0 0 0 0 
0 0 0 2021.32 0 0 0.08 1896.65 0 -2094.1 0 0 0 0 1857.43 0 -743.66 0 0 0 0 0 0 0 156.026 637.761 0 345.241 -1371.73 1100.42 -1538.82 2244.71 0 0 0 0 0 0 0 0 0 0 
0 0 0 2303 0 2218.47 37.4615 0 -651.494 -1589.18 -900.677 1532.72 0 0 0 -781.045 261.467 0 0 0 0 0 2141.25 1908.4 0 0 0 0 0 0 0 0 0 0 0 0 0 0 0 0 0 -553.682 
0 0 0 -1783.12 0 0 0 974.837 0.02 2441.56 2494.51 0 0 0 0 1890.7 0 0 0 0 0 -1480.99 0 0 0 0 0 0 0 0 0 0 0 1699.96 0 160.756 0 0 801.645 0 792.337 0 
0 0 893.658 0 0 0 -1645.18 673.009 557.344 0.06 -2413.94 1100.42 1780.98 0 0 0 0 2474.67 0 -1309.93 0 0 0 0 0 0 0 0 0 -1128.5 0 0 0 0 0 -549.867 0 0 0 0 1899.24 0 
0 0 -377.132 -1758.86 0 0 0 759.835 761.666 776.009 0.01 0 0 0 0 1042.28 1560.64 2491.76 0 0 -1979.96 0 1072.34 0 0 0 0 0 0 0 -1902.14 0 0 0 0 0 0 -936.842 0 1721.17 0 0 
2254.33 0 0 0 0 0 0 1126.67 0 -1659.06 0 0.02 785.928 0 0 0 0 2087.24 -1376.61 0 0 0 0 0 0 0 0 0 0 0 0 0 0 0 0 0 0 0 0 0 0 662.633 
0 0 0 0 0 0 0 0 0 -1165.73 0 1286.28 0.02 0 0 0 1144.06 0 449.614 -2055.65 0 0 925.703 847.423 0 0 0 0 -987.655 0 0 0 0 0 0 -361.721 0 0 0 0 0 0 
0 1726.81 0 573.367 0 1306.12 0 0 0 0 0 0 0 0.09 0 0 2181.08 0 0 0 -2238.61 -229.575 0 0 1954.79 0 0 0 0 0 0 0 0 0 0 0 0 0 0 0 0 0 
0 0 0 0 0 1309.93 1306.12 0 0 0 0 0 0 0 0.06 0 -922.803 2073.35 0 -470.519 0 513.703 0 0 0 0 0 0 0 0 0 0 0 848.033 0 0 0 0 0 0 0 0 
1528.75 0 0 0 86.2911 -985.214 0 -72.7104 726.875 0 -2393.19 0 0 0 0 0.04 0 2187.64 0 0 -201.956 0 -670.415 0 0 0 0 0 0 0 0 0 0 0 0 1116.29 0 0 0 0 0 0 
2411.95 0 0 0 1116.6 330.744 2116.99 174.032 0 0 -200.583 0 1959.36 461.974 -2156.51 0 0.03 1429.26 -1393.25 0 0 0 0 0 -1532.56 0 0 2126.61 0 0 450.224 328.913 0 0 0 0 1322.75 0 0 0 -2112.57 0 
0 1153.52 2341 0 -472.961 0 0 0 0 -0.228889 1599.09 2071.67 0 0 -6.02741 651.799 1078.75 0.03 0 2451.02 -592.746 -638.676 0 2340.39 544.221 -712.531 0 0 0 0 1638.77 0 0 0 0 0 0 0 0 -583.285 0 0 
0 0 0 1456.57 -1022.9 1765.88 0 0 0 0 0 2330.32 -1578.04 0 0 0 2321.01 0 0.01 0 2469.48 0 2261.8 -2310.02 0 0 0 0 0 0 0 0 0 0 0 0 0 0 0 0 0 0 
0 0 0 -1133.99 2039.78 0 0 0 0 2235.71 0 0 1406.06 0 800.119 0 0 -1862.01 0 0 1882.31 0 687.658 0 447.478 0 0 1775.34 -1322.44 0 0 0 782.723 0 0 -2338.4 0 0 0 0 -1953.41 0 
2324.52 0 0 0 0 -193.411 0 0 0 0 -1455.35 0 0 867.718 0 -906.934 0 1399.2 -476.012 1175.65 0.05 0 0 0 1930.52 0 0 -2211.45 0 0 0 0 0 0 0 0 0 0 0 0 0 0 
-737.709 0 -519.807 1723.3 0 0 0 0 1732.31 0 0 0 0 -1233.48 1886.58 0 0 1512.57 0 0 0 0.05 0 1486.79 -2210.68 0 0 0 0 0 0 0 0 0 0 0 231.864 0 0 -809.122 0 0 
0 0 0 0 0 0 0 2329.55 0 0 2023.61 0 1667.15 0 0 -880.688 0 0 -1290.25 328.303 0 0 0 0 0 -503.479 0 0 0 -2239.07 0 0 0 0 0 0 0 0 1337.24 -1502.5 0 -168.996 
0 0 -1997.82 0 0 0 0 1375.7 0 0 0 0 1605.35 0 0 0 0 2220.45 1996.75 0 0 -664.006 0 0.05 0 0 0 0 -1292.54 0 0 0 0 -1263.54 531.556 0 0 0 0 0 0 0 
0 0 0 0 0 0 2402.65 0 0 0 0 0 0 834.605 0 0 -1696.45 603.58 0 1359.83 2186.57 345.698 0 0 0.09 0 1524.02 0 1664.1 -1843.24 0 0 0 -2072.44 0 0 0 0 0 0 0 0 
0 0 0 0 0 0 2404.63 0 0 0 0 0 0 0 0 0 0 2395.78 0 0 0 0 -1571.02 0 0 0.07 0 0 0 0 0 0 1849.19 0 271.081 0 773.873 0 463.652 0 0 0 
0 0 0 0 0 0 0 0 0 0 0 0 0 0 0 0 0 0 0 0 0 0 0 0 1319.39 0 0.08 0 0 0 0 -442.289 0 0 0 0 1592.38 0 0 0 0 0 
0 2016.59 0 -439.238 0 0 1675.39 0 0 0 0 0 0 0 0 0 815.836 0 0 251.244 -2230.22 0 0 0 0 0 0 0.06 0 0 0 0 0 0 0 0 0 0 0 0 0 0 
0 0 0 0 0 0 -1455.81 0 0 0 0 0 1828.14 0 0 0 0 0 0 -195.547 0 0 0 1423.15 429.93 0 0 0 0.01 0 0 0 0 0 -1859.72 0 394.07 -662.175 0 -135.426 0 0 
0 0 0 1105.15 0 0 2102.5 0 0 -541.627 0 0 0 0 0 0 0 0 0 0 0 0 242.546 0 1219.14 0 0 0 0 0.05 0 0 -532.472 0 0 0 0 0 2045.58 0 0 0 
0 0 0 0 0 0 -651.799 0 0 0 2321.01 0 0 0 0 0 -56.9933 1188.47 0 0 0 0 0 0 0 0 0 0 0 0 0.07 0 0 0 0 0 1190.91 0 0 0 0 0 
0 0 0 0 0 0 378.811 0 0 0 0 0 0 0 0 0 -654.698 0 0 0 0 0 0 0 0 0 2444 0 0 0 0 0.08 0 0 0 0 0 0 0 0 1432.31 0 
0 751.9 0 0 0 0 0 0 0 0 0 0 0 0 0 0 0 0 0 340.663 0 0 0 0 0 2083.73 0 0 0 -36.0881 0 0 0.05 0 0 0 0 0 0 0 0 0 
0 0 0 0 0 0 0 0 -365.841 0 0 0 0 0 1544.01 0 0 0 0 0 0 0 0 -2012.31 2359.61 0 0 0 0 0 0 0 0 0.05 0 0 330.287 0 0 0 0 0 
292.291 0 161.977 0 0 0 0 0 0 0 0 0 0 0 0 0 0 0 0 0 0 0 0 1509.06 0 1733.99 0 0 -863.445 0 0 0 0 0 0.09 0 0 0 0 0 -1838.51 0 
877.941 0 0 0 0 0 0 0 1270.56 2455.9 0 0 1515.17 0 0 377.132 0 0 0 -1222.8 0 0 0 0 0 0 0 0 0 0 0 0 0 0 0 0.08 0 0 0 0 0 0 
0 0 0 0 0 -1484.5 0 0 0 0 0 0 0 0 0 0 -76.5252 0 0 0 0 -405.515 0 0 0 1458.25 -1235.62 0 0.991852 0 1500.06 0 0 2496.19 0 0 0.08 0 0 0 0 0 
1827.83 0 0 66.1489 0 0 0 0 0 0 -1064.41 0 0 0 0 0 0 0 0 0 0 0 0 0 0 0 0 0 1634.65 0 0 0 0 0 0 0 0 0.03 0 0 0 0 
0 0 0 0 0 0 0 0 1038.47 0 0 0 0 0 0 0 0 0 0 0 0 0 93.7681 0 0 -1327.17 0 0 0 2041.92 0 0 0 0 0 0 0 0 0.05 208.518 0 0 
0 0 0 0 0 0 0 0 0 0 1469.54 0 0 0 0 0 0 2195.88 0 0 0 1478.24 1426.36 0 0 0 0 0 -839.641 0 0 0 0 0 0 0 0 0 1448.18 0.08 0 0 
0 0 0 0 0 0 0 0 547.884 -917.768 0 0 0 0 0 0 2498.02 0 0 603.122 0 0 0 0 0 0 0 0 0 0 0 -1885.97 0 0 -1343.5 0 0 0 0 0 0.04 0 
2331.08 0 0 0 -794.626 0 0 -2166.28 0 0 0 1709.42 0 0 0 0 0 0 0 0 0 0 717.719 0 0 0 0 0 0 0 0 0 0 0 0 0 0 0 0 0 0 0.01 
