*Vertices 62
*Matrix 
0.07 0 0 0 1340.6 0 46.4644 0 0 0 0 0 0 0 0 0 0 0 563.143 0 0 0 0 0 0 0 0 0 0 0 0 0 0 1584.75 0 0 0 0 0 0 0 -318.69 0 0 0 428.251 873.821 0 0 1006.88 0 0 0 0 0 203.482 0 0 0 0 0 0 
0 0.07 0 -1522.64 0 1308.4 0 0 0 0 0 -600.528 0 0 2126.61 0 0 0 0 0 0 0 0 0 0 0 1267.66 0 0 0 0 0 0 0 0 0 0 0 0 1776.41 0 0 0 0 0 0 0 0 0 374.996 0 0 0 1444.82 0 1993.24 0 0 0 0 0 0 
0 0 0.07 0 0 0 0 0 0 0 0 1525.24 1860.64 0 0 0 0 0 0 -1524.02 -1340.75 1213.95 0 0 0 0 1860.94 0 0 0 0 0 0 0 0 0 0 0 0 0 0 1098.59 0 0 0 0 0 0 0 0 0 0 0 0 0 0 0 -1454.44 0 0 0 0 
0 695.135 0 0.01 0 0 0 0 0 0 0 -1946.7 1246.91 0 0 0 0 1082.11 0 1506.93 0 95.9044 0 0 987.198 0 0 0 0 0 0 0 0 0 0 0 0 0 0 0 0 0 0 0 0 0 2467.5 0 1515.93 0 0 0 0 0 0 0 0 0 0 0 0 0 
-262.383 0 0 0 0.06 -765.938 0 0 0 644.322 0 0 0 0 0 0 0 0 0 0 0 0 0 0 56.3829 0 2295.22 0 0 0 0 0 0 0 0 0 0 0 1382.11 0 0 0 0 1490.14 0 0 0 0 0 0 0 0 0 2481.38 0 0 0 0 0 0 0 0 
0 -617.466 0 0 -23.1178 0.04 1868.42 0 0 0 0 0 2467.96 2447.51 0 0 0 0 0 747.78 676.977 0 0 0 0 0 1934.64 0 616.245 0 1976.45 -1416.9 0 1316.8 0 0 0 0 0 0 0 0 0 0 0 0 0 0 0 0 0 0 0 0 1132.47 0 0 0 0 0 0 0 
-1882 0 0 0 0 166.25 0.05 0 0 0 0 0 0 0 0 0 0 0 0 0 -781.198 0 0 0 2307.12 0 0 0 0 0 0 0 508.667 0 0 0 0 0 0 0 0 0 0 0 0 0 0 0 1857.89 0 0 0 0 0 0 0 1505.1 0 0 0 0 0 
0 0 0 0 0 0 0 0.07 0 0 0 0 0 0 0 0 -101.55 -2100.05 0 0 0 0 0 0 0 0 0 0 0 2370.14 0 0 0 0 1454.28 0 0 0 0 0 0 0 -1374.02 0 0 0 0 0 0 0 0 0 0 0 0 0 0 0 0 0 0 0 
0 0 0 0 0 0 0 0 0.06 0 0 0 0 1990.19 0 0 0 0 0 0 0 0 0 1830.73 0 -1019.24 0 0 0 0 0 0 0 0 0 0 0 1560.64 0 0 -734.504 458.922 0 0 0 0 0 0 0 0 0 0 0 0 0 0 0 0 0 0 0 0 
0 0 0 0 -224.54 0 0 0 0 0.01 0 1410.95 0 0 -650.426 0 -74.3889 0 0 0 0 0 0 0 0 0 0 0 0 0 765.938 0 2236.63 0 -1584.29 0 0 0 2331.08 0 0 -1391.11 0 0 929.06 0 0 0 0 0 0 0 0 0 0 0 0 0 0 0 0 0 
0 0 0 0 0 0 0 0 0 0 0 0 0 0 0 0 0 0 0 0 0 53.1785 0 0 -2229.76 0 0 0 0 2197.71 598.697 0 0 0 17.1667 0 1462.37 0 0 -39.4452 0 0 -1774.58 0 0 0 0 0 0 0 0 0 0 0 0 0 0 0 0 0 0 0 
0 -2489.93 -410.703 1620.76 0 0 0 0 0 -1819.9 0 0.03 2192.83 0 0 0 677.892 0 0 0 0 0 0 0 0 0 0 0 0 0 0 0 0 0 595.035 2494.96 0 0 79.4244 0 1357.69 -403.378 0 0 0 2202.9 0 0 0 0 0 0 0 2356.26 0 -2431.03 0 0 0 0 0 0 
0 0 -564.058 2355.04 0 1008.87 0 0 0 0 0 443.815 0.07 0 0 0 0 0 0 0 0 0 0 2267.6 0 0 0 0 0 0 0 0 0 0 0 284.509 0 0 0 0 0 0 1288.87 0 0 0 0 0 0 0 0 0 0 0 0 -1593.91 0 479.217 0 0 0 1475.65 
0 0 0 0 0 2022.84 0 0 586.184 0 0 0 0 0.09 0 0 0 0 738.624 0 0 0 0 0 -2048.02 0 0 0 0 0 0 0 477.844 0 0 0 0 0 0 0 0 -701.544 1088.21 1816.69 0 0 0 0 0 0 0 0 0 0 0 0 0 0 0 0 0 0 
0 -721.992 0 0 0 0 0 0 0 737.556 0 0 0 0 0.02 0 0 0 0 2280.72 0 0 0 -2337.64 0 0 0 0 2236.78 0 0 0 0 784.555 0 0 0 0 0 0 0 0 0 0 422.91 0 0 0 0 0 0 0 1817.61 1179.01 0 0 0 0 -2286.07 0 0 0 
0 0 0 0 0 0 0 0 0 0 0 0 0 0 0 0 1819.28 0 0 0 0 0 0 0 0 0 1914.96 0 0 0 0 0 0 0 0 0 0 0 0 0 0 0 339.137 0 0 0 0 0 0 0 0 1674.17 0 -252.159 0 0 1933.73 0 0 0 0 0 
0 0 0 0 0 0 0 265.587 0 2435.91 0 -2067.09 0 0 0 1860.79 0.08 0 0 -2268.97 0 0 0 0 1087.91 0 0 0 0 0 0 0 0 -857.952 0 0 0 0 0 2218.31 0 0 0 0 0 0 0 0 0 0 0 0 0 0 0 -2160.02 0 2380.52 280.541 0 0 0 
0 0 0 -201.804 0 0 0 -1554.99 0 0 0 0 0 0 0 0 0 0.01 0 2116.84 0 0 0 0 2075.18 2207.17 0 0 0 0 -751.289 0 0 0 0 0 0 0 0 0 0 0 0 1790.44 0 0 0 0 756.63 0 0 0 0 0 0 -1309.93 826.518 0 0 0 0 0 
2402.49 0 0 0 0 0 0 0 0 0 0 0 0 1213.03 0 0 0 0 0.04 0 0 0 0 0 0 -1305.05 0 0 0 0 0 0 0 0 97.1252 0 0 0 0 -1922.13 0 0 0 0 0 0 0 0 0 0 892.438 0 2235.71 0 959.426 0 0 0 0 0 0 0 
0 0 2332.3 1117.97 0 -311.06 0 0 0 0 0 0 0 0 2082.35 0 -1359.37 -1594.21 0 0 0 0 0 0 0 0 0 0 0 -2162.01 0 0 0 0 0 -1871.01 0 0 0 0 0 0 0 0 0 0 0 0 0 0 0 0 0 0 0 0 1866.28 0 0 0 0 0 
0 0 1669.59 0 0 -363.704 1686.22 0 0 0 0 0 0 0 0 0 0 0 0 0 0.08 0 0 0 0 -1836.99 0 0 0 0 0 0 0 0 0 0 0 0 0 0 0 0 0 0 594.119 0 0 0 0 0 0 0 0 0 0 0 0 0 0 0 0 0 
0 0 814.768 -1321.38 0 0 0 0 0 0 2311.4 0 0 0 0 0 0 0 0 0 0 0.06 0 0 0 0 0 0 0 0 0 0 0 0 0 0 0 0 0 0 0 0 1885.66 0 0 0 0 0 1540.5 0 0 0 0 0 1710.64 0 0 0 0 0 0 0 
0 0 0 0 0 0 0 0 0 0 0 0 0 0 0 0 0 0 0 0 0 0 0.08 0 0 0 0 0 100.787 0 0 2290.95 0 0 0 0 0 0 0 0 -1230.12 0 0 0 0 0 0 0 0 1516.39 0 0 0 0 0 1828.59 0 0.228889 0 0 0 0 
0 0 0 0 0 0 0 0 218.894 0 0 0 1298.64 0 570.467 0 0 0 0 0 0 0 0 0.08 0 0 0 0 -1393.7 904.95 0 0 0 0 0 0 0 0 0 0 0 0 0 324.03 0 0 0 0 -482.116 0 639.744 0 0 0 0 0 0 0 0 0 0 0 
0 0 0 -1377.22 493.408 0 1154.44 0 0 0 1622.75 0 0 1730.32 0 0 1029.92 1438.11 0 0 0 0 0 0 0 0 2266.38 0 0 0 0 0 0 0 0 0 0 0 0 0 0 0 0 0 0 0 0 0 0 0 0 0 0 0 66.1489 0 0 0 0 0 0 0 
0 0 0 0 0 0 0 0 -905.103 0 0 0 0 0 0 0 0 405.515 2393.03 0 1295.28 0 0 0 0 0.07 0 0 0 0 0 1025.8 0 0 0 0 0 0 0 0 0 0 0 0 2402.65 0 0 0 0 0 0 0 0 0 0 10.6052 -1945.17 0 0 0 0 0 
0 1416.14 902.661 0 2116.53 -344.172 0 0 0 0 0 0 0 0 0 -1243.25 0 0 0 0 0 0 0 0 1148.34 0 0.06 0 0 0 0 0 -451.14 817.209 0 0 0 0 0 0 0 0 0 0 0 0 0 0 0 0 0 0 0 873.974 0 0 0 0 0 0 0 0 
0 0 0 0 0 0 0 0 0 0 0 0 0 0 0 0 0 0 0 0 0 0 0 0 0 0 0 0.06 0 -102.924 -1854.99 0 0 0 0 0 0 0 0 0 0 0 -374.844 0 0 0 0 2385.56 1464.05 0 0 0 0 0 0 0 0 0 0 0 0 0 
0 0 0 0 0 -211.875 0 0 0 0 0 0 0 0 -2047.11 0 0 0 0 0 0 0 -997.726 -267.113 0 0 0 0 0.05 2407.38 0 281.61 0 0 0 0 0 0 0 0 -642.643 0 0 0 0 0 0 0 0 0 0 0 2272.48 0 0 0 0 0 0 0 0 0 
0 0 0 0 0 0 0 -1111.71 0 0 1894.82 0 0 0 0 0 0 0 0 2146.9 0 0 0 1159.02 0 0 0 2355.49 -2470.7 0.08 0 0 0 0 0 0 0 141.224 0 0 0 0 0 0 0 0 0 0 0 0 0 0 0 324.03 0 0 0 0 0 0 0 0 
0 0 0 0 0 -533.082 0 0 0 410.855 1069.6 0 0 0 0 0 0 641.575 0 0 0 0 0 0 0 0 0 67.6748 0 0 0 0 0 0 0 0 0 0 0 0 0 0 0 -724.128 0 0 0 1354.34 0 2080.98 0 0 0 0 0 0 0 0 0 0 0 0 
0 0 0 0 0 1462.52 0 0 0 0 0 0 0 0 0 0 0 0 0 0 0 0 -2140.19 0 0 -787.149 0 0 881.909 0 0 0 1238.82 0 0 0 0 0 0 2243.49 0 0 0 0 0 0 0 0 0 0 -928.602 0 -349.361 0 0 0 0 0 2202.6 0 0 0 
0 0 0 0 0 0 2448.73 0 0 2344.81 0 0 0 -741.523 0 0 0 0 0 0 0 0 0 0 0 0 -118.183 0 0 0 0 840.861 0.03 0 0 0 0 0 0 0 0 0 0 0 0 0 0 0 0 0 -2048.33 0 0 0 0 0 0 0 0 0 0 0 
1768.01 0 0 0 0 2345.27 0 0 0 0 0 0 0 0 1809.67 0 777.383 0 0 0 0 0 0 0 0 0 1352.66 0 0 0 0 0 0 0.09 0 0 0 -1702.09 0 0 0 -2012.31 0 0 1841.41 0 0 0 0 -1309.17 0 0 0 0 0 0 0 0 0 0 0 0 
0 0 0 0 0 0 0 37.3089 0 -801.035 1809.52 -814.92 0 0 0 0 0 0 2385.25 0 0 0 0 0 0 0 0 0 0 0 0 0 0 0 0.05 0 -1566.74 0 0 0 0 0 0 0 0 0 0 0 -415.891 0 0 0 0 0 0 0 0 2323.45 0 2058.7 0 0 
0 0 0 0 0 0 0 0 0 0 0 685.522 1686.68 0 0 0 0 0 0 2443.24 0 0 0 0 0 0 0 0 0 0 0 0 0 0 0 0.05 1600.01 0 0 711.615 0 0 0 0 0 0 0 0 0 0 0 0 0 0 0 0 0 0 0 0 0 0 
0 0 0 0 0 0 0 0 0 0 1602.15 0 0 0 0 0 0 0 0 0 0 0 0 0 0 0 0 0 0 0 0 0 0 0 -1531.5 714.209 0.07 0 0 0 0 0 1599.55 -221.488 -333.491 0 0 0 0 0 0 0 -731.452 0 0 0 0 0 0 0 0 0 
0 0 0 0 0 0 0 0 627.537 0 0 0 0 0 0 0 0 0 0 0 0 0 0 0 0 0 0 0 0 493.408 0 0 0 661.412 0 0 0 0.02 0 0 0 0 0 0 0 0 -558.565 0 0 0 0 0 0 0 0 0 0 0 0 0 0 0 
0 0 0 0 2439.27 0 0 0 0 2479.86 0 -1854.84 0 0 0 0 0 0 0 0 0 0 0 0 0 0 0 0 0 0 0 0 0 0 0 0 0 0 0.02 0 0 1702.25 0 -1901.68 1212.27 0 0 0 0 -427.183 0 0 1742.23 -906.018 0 0 0 0 0 0 0 0 
0 1196.4 0 0 0 0 0 0 0 0 -820.109 0 0 0 0 0 1803.42 0 -1819.59 0 0 0 0 0 0 0 0 0 0 0 0 1403.32 0 0 0 931.501 0 0 0 0.01 0 0 0 0 0 0 0 0 0 0 84.3074 0 1283.23 0 0 0 -136.036 0 0 0 0 0 
0 0 0 0 0 0 0 0 -2494.81 0 0 2140.64 0 0 0 0 0 0 0 0 0 0 1119.8 0 0 0 0 0 132.832 0 0 0 0 0 0 0 0 0 0 0 0.03 0 0 0 0 0 0 -164.876 0 0 0 0 0 0 2262.87 868.633 0 0 0 0 0 0 
2295.22 0 1613.44 0 0 0 0 0 1918.78 737.709 0 1657.54 0 1258.96 0 0 0 0 0 0 0 0 0 0 0 0 0 0 0 0 0 0 0 1131.86 0 0 0 0 170.827 0 0 0.09 -2088.46 0 0 -823.161 -1975.39 244.682 0 0 0 0 1147.88 0 0 -1976.3 -294.427 0 0 0 0 0 
0 0 0 0 0 0 0 -320.673 0 0 618.686 0 2026.96 -2085.86 0 -31.8155 0 0 0 0 0 2374.72 0 0 0 0 0 1921.22 0 0 0 0 0 0 0 0 1449.25 0 0 0 0 1354.03 0.05 0 0 0 0 -1574.98 0 0 0 0 0 0 0 0 0 0 2209.01 0 0 0 
0 0 0 0 2194.36 0 0 0 0 0 0 0 0 1898.02 0 0 0 -382.168 0 0 0 0 0 -105.518 0 0 0 0 0 0 1725.14 0 0 0 0 0 1320.61 0 -807.138 0 0 0 0 0.02 0 0 0 0 0 0 0 0 0 0 0 983.535 0 733.131 0 0 0 0 
0 0 0 0 0 0 0 0 0 1559.11 0 0 0 0 813.089 0 0 0 0 0 -1185.11 0 0 0 0 2191 0 0 0 0 0 0 0 1036.48 0 0 394.833 0 1439.63 0 0 0 0 0 0.02 0 0 38.8348 0 0 0 -503.632 0 0 0 0 0 899.915 0 0 0 0 
-1297.57 0 0 0 0 0 0 0 0 0 0 1064.56 0 0 0 0 0 0 0 0 0 0 0 0 0 0 0 0 0 0 0 0 0 0 0 0 0 0 0 0 0 423.826 0 0 0 0.06 0 0 0 1528.9 2181.08 0 0 0 -1803.42 0 0 1035.72 0 0 0 0 
945.845 0 0 -696.966 0 0 0 0 0 0 0 0 0 0 0 0 0 0 0 0 0 0 0 0 0 0 0 0 0 0 0 0 0 0 0 0 0 -132.527 0 0 0 1546.91 0 0 0 0 0.02 0 0 0 0 0 0 -333.949 978.652 0 0 0 0 0 0 0 
0 0 0 0 0 0 0 0 0 0 0 0 0 0 0 0 0 0 0 0 0 0 0 0 0 0 0 1316.64 0 0 1264.15 0 0 0 0 0 0 0 0 0 1880.32 1049.46 -1117.51 0 305.872 0 0 0.05 0 0 0 -464.415 0 309.992 0 1765.72 0 0 -2369.08 0 0 0 
0 0 0 1662.27 0 0 -1880.78 0 0 0 0 0 0 0 0 0 0 -156.331 0 0 0 1723.3 0 502.106 0 0 0 -18.3874 0 0 0 0 0 0 552.309 0 0 0 0 0 0 0 0 0 0 0 0 0 0.08 0 0 0 0 0 0 0 0 0 1320 0 0 0 
989.029 -917.31 0 0 0 0 0 0 0 0 0 0 0 0 0 0 0 0 0 0 0 0 -383.541 0 0 0 0 0 0 0 564.821 0 0 -2280.88 0 0 0 0 2386.78 0 0 0 0 0 0 1899.4 0 0 0 0.03 0 0 0 0 0 0 0 0 0 0 0 0 
0 0 0 0 0 0 0 0 0 0 0 0 0 0 0 0 0 0 -569.704 0 0 0 0 -759.682 0 0 0 0 0 0 0 2177.11 1592.23 0 0 0 0 0 0 -1652.35 0 0 0 0 0 1278.95 0 0 0 0 0.07 1074.79 0 0 0 0 0 0 0 0 2204.43 0 
0 0 0 0 0 0 0 0 0 0 0 0 0 0 0 -1618.93 0 0 0 0 0 0 0 0 0 0 0 0 0 0 0 0 0 0 0 0 0 0 0 0 0 0 0 0 1494.87 0 0 2146.9 0 0 -2118.82 0 1437.5 0 0 0 0 0 0 0 0 0 
0 0 0 0 0 0 0 0 0 0 0 0 0 0 1755.5 0 0 0 -1746.35 0 0 0 0 0 0 0 0 0 -15.7933 0 0 2027.88 0 0 0 0 -1471.68 0 1140.4 -382.321 0 241.478 0 0 0 0 0 0 0 0 0 426.42 0.07 0 0 0 0 0 0 0 0 0 
0 -2011.25 0 0 2050.31 0 0 0 0 0 0 1147.72 0 0 1463.59 2141.87 0 0 0 0 0 0 0 0 0 0 1902.6 0 0 -48.1429 0 0 0 0 0 0 0 0 2174.06 0 0 0 0 0 0 0 -816.752 189.901 0 0 0 0 0 0.09 0 2315.36 0 0 0 0 0 0 
0 0 0 0 0 1616.64 0 0 0 0 0 0 0 0 0 0 0 0 1773.66 0 0 1804.64 0 0 927.992 0 0 0 0 0 0 0 0 0 0 0 0 0 0 0 1425.44 0 0 0 0 -1278.95 194.937 0 0 0 0 0 0 0 0.09 0 0 0 0 0 0 0 
-1383.48 -1205.71 0 0 0 0 0 0 0 0 0 -2272.33 785.775 0 0 0 1748.63 1370.36 0 0 0 0 -644.627 0 0 -167.776 0 0 0 0 0 0 0 0 0 0 0 0 0 0 1469.39 2371.97 0 2201.68 0 0 0 -1296.96 0 0 0 0 0 -2058.09 0 0.09 2065.87 0 0 0 0 0 
0 0 0 0 0 0 167.318 0 0 0 0 0 0 0 0 1312.52 0 -156.178 0 749.611 0 0 0 0 0 2123.55 0 0 0 0 0 0 0 0 0 0 0 0 0 1072.19 0 -223.777 0 0 0 0 0 0 0 0 0 0 0 0 0 -322.199 0.04 0 0 0 0 0 
0 0 -1209.52 0 0 0 0 0 0 0 0 0 2050 0 0 0 1052.51 0 0 0 0 0 1467.1 0 0 0 0 0 0 0 0 0 0 0 -2201.53 0 0 0 0 0 0 0 0 1032.82 1169.24 14.2674 0 0 0 0 0 0 0 0 0 0 0 0.04 0 0 0 0 
0 0 0 0 0 0 0 0 0 0 0 0 0 0 1881.85 0 -2260.89 0 0 0 0 0 0 0 0 0 0 0 0 0 0 2240.75 0 0 0 0 0 0 0 0 0 0 1954.18 0 0 0 0 -1852.24 892.59 0 0 0 0 0 0 0 0 0 0.06 0 0 0 
0 0 0 0 0 0 0 0 0 0 0 0 0 0 0 0 0 0 0 0 0 0 0 0 0 0 0 0 0 0 0 0 0 0 998.642 0 0 0 0 0 0 0 0 0 0 0 0 0 0 0 0 0 0 0 0 0 0 0 0 0.01 0 0 
0 0 0 0 0 0 0 0 0 0 0 0 0 0 0 0 0 0 0 0 0 0 0 0 0 0 0 0 0 0 0 0 0 0 0 0 0 0 0 0 0 0 0 0 0 0 0 0 0 0 1170.77 0 0 0 0 0 0 0 0 0 0.01 0 
0 0 0 0 0 0 0 0 0 0 0 0 905.713 0 0 0 0 0 0 0 0 0 0 0 0 0 0 0 0 0 0 0 0 0 0 0 0 0 0 0 0 0 0 0 0 0 0 0 0 0 0 0 0 0 0 0 0 0 0 0 0 0 
