*Vertices 58
*Matrix 
0.09 0 -938.215 0 1109.42 850.78 0 0 257.958 0 0 0 0 -2105.24 0 0 0 0 0 2388.45 0 381.405 0 1719.18 0 2485.2 -1088.37 0 0 0 1577.27 -782.266 0 0 1469.39 0 0 0 -576.876 0 0 0 0 0 1577.27 0 0 0 1157.34 -2010.48 0 0 1555.91 0 0 0 0 0 
0 0.02 0 0 0 0 0 1532.11 -654.698 2449.8 0 0 0 0 0 846.507 0 -316.401 0 0 0 0 0 0 1142.69 1188.62 0 0 0 0 -127.949 0 0 1856.06 0 0 0 0 0 0 -1147.72 0 0 0 0 0 0 0 0 -1654.94 2250.05 0 -1037.55 0 -2240.14 0 0 0 
1291.77 0 0.02 0 1514.71 0 0 0 0 0 0 275.964 0 0 0 0 0 0 0 0 0 0 0 0 0 -576.571 -1481.14 0 -162.13 0 0 2076.25 0 1208.61 0 0 2244.56 0 0 0 0 0 0 0 0 0 1760.99 0 -556.581 0 1884.29 1157.95 1645.63 0 0 0 0 0 
0 0 0 0.09 0 0 0 -139.393 0 0 0 -1847.82 0 0 0 0 0 60.9607 0 0 0 0 0 0 1501.89 0 -1323.51 0 333.491 0 0 0 617.161 2213.74 0 0 0 0 0 1009.78 0 0 0 0 0 0 -317.927 0 0 0 1254.23 0 0 0 -375.149 0 0 0 
-2388.3 0 2017.2 0 0.07 0 0 0 0 0 2155.9 0 0 1514.56 0 0 0 0 2046.19 565.432 0 0 0 0 0 0 0 0 0 0 0 0 0 0 0 0 0 0 512.482 0 0 0 0 260.399 0 0 0 0 0 825.449 0 -24.1859 0 2104.18 0 -1400.42 0 0 
2489.78 0 0 0 0 0.04 0 0 -1461.61 0 0 0 0 0 0 0 0 0 0 363.857 0 0 0 0 0 0 288.476 -2423.86 0 0 2448.42 0 0 0 0 0 0 0 0 0 0 -111.316 0 0 0 0 -389.645 2474.67 0 0 430.082 0 0 0 0 0 819.498 1103.78 
0 0 0 0 0 0 0.02 0 0 -1680.88 0 0 0 0 634.861 2351.37 0 -561.312 0 0 0 -1342.28 0 786.386 2442.93 0 0 0 1217.31 0 1337.7 -2314.14 0 0 0 0 0 0 2209.46 0 0 0 0 0 0 0 0 0 0 0 0 1332.36 -1780.22 0 0 0 0 0 
0 2057.48 0 -578.097 0 0 0 0.08 760.445 0 0 1601.84 0 0 0 -150.227 0 0 0 -1139.33 0 2229.45 0 -770.669 0 0 0 0 0 0 0 374.996 0 1426.21 0 0 1185.57 0 0 0 0 1570.71 0 1484.04 0 0 1375.09 0 0 0 1803.87 0 0 0 675.756 0 0 0 
-826.975 1598.79 0 0 0 -798.746 0 -592.135 0.07 0 0 36.2407 0 0 0 300.531 -2266.53 0 -210.501 1579.71 0 1484.04 0 0 0 2391.05 0 0 0 1919.39 0 0 0 -976.974 0 1596.65 -2006.82 1849.19 0 0 0 0 0 0 0 -2300.26 0 0 0 554.903 0 1576.2 0 0 0 -895.032 0 0 
0 -74.2363 0 0 0 0 1335.41 0 0 0 -1058.92 0 0 438.017 0 -1104.24 0 0 -96.5148 0 0 0 0 957.137 -369.503 1559.11 0 2053.97 0 0 0 0 0 0 816.904 0 0 0 0 0 0 -2038.56 0 805.307 0 0 414.518 1918.93 0 0 1354.79 0 0 -543.001 0 0 0 0 
0 0 0 0 -1430.78 0 0 0 0 -1944.41 0.03 688.421 0 0 -2335.35 -1000.47 0 0 0 1838.97 1319.54 0 0 -899.915 0 0 0 0 0 0 -499.664 0 0 0 0 0 1309.02 0 0 2494.05 1128.35 0 0 0 0 0 0 0 0 1150.62 0 0 0 0 1878.8 -1380.12 0 0 
0 0 -254.753 1671.88 0 0 0 1066.55 -1812.11 0 1754.13 0.03 204.855 -2024.52 0 0 0 0 0 0 -1522.19 0 0 -1484.65 0 0 0 0 0 0 0 0 1169.55 2414.4 0 659.581 0 0 0 0 709.021 0 0 0 0 0 0 0 0 0 -2264.09 0 0 2092.27 2140.8 -246.055 -141.072 0 
0 0 0 0 0 0 0 0 0 0 0 2073.2 0.01 1525.39 0 0 0 0 -2350.15 160.909 2177.11 1702.09 0 0 0 0 0 0 0 0 0 0 0 0 0 0 0 0 -938.368 1165.27 373.775 0 784.097 -463.652 0 0 -1769.69 0 -977.432 0 -1577.58 -1405.3 2401.12 0 1005.05 0 -1452.3 0 
758.614 0 0 0 338.984 0 0 0 0 -1905.04 0 -1704.84 1173.67 0.07 0 0 0 1884.75 0 0 0 1957.38 0 0 1324.27 0 0 0 0 0 0 -1101.34 0 0 0 971.633 0 0 0 1815.01 -2042.38 0 0 -730.232 0 0 1710.79 0 0 -259.941 0 0 0 0 0 0 -2287.29 0 
0 0 0 0 0 0 -452.361 0 0 0 -204.245 0 0 0 0.01 0 0 93.9207 0 0 0 1021.38 2356.56 1636.33 0 1680.58 0 -911.969 0 0 -1232.41 0 0 -773.873 0 0 0 0 0 0 0 0 0 0 0 0 302.362 0 0 -411.924 0 0 0 356.838 0 0 0 0 
0 573.061 0 0 0 0 1272.55 1011.92 889.386 -307.245 1831.19 0 0 0 0 0.09 0 0 0 0 0 0 0 0 0 0 0 0 0 0 0 0 0 0 0 1705.3 0 0 0 0 337.458 1447.42 0 0 0 0 0 0 0 0 2336.88 0 0 1172.6 -99.414 0 0 0 
0 0 0 0 0 0 0 0 1395.38 0 0 0 0 0 0 0 0.02 0 0 -1058.61 0 0 0 390.713 0 0 1520.81 0 0 -1150.47 0 0 0 653.783 0 0 0 0 0 0 0 0 0 779.672 0 0 899.152 0 0 0 0 0 848.949 0 398.19 0 0 0 
0 1195.33 0 1780.53 0 0 -1996.14 0 0 0 0 0 0 -1900.01 669.958 0 0 0.04 0 0 2435.3 0 0 1775.49 -2253.72 0 0 915.632 0 0 0 0 0 0 1286.43 851.238 0 0 2472.23 -1401.49 0 0 0 0 0 0 -837.352 0 0 1780.83 0 0 -1638.77 0 0 0 0 0 
0 0 0 0 2154.99 0 0 0 1990.19 -543.611 0 0 -1747.87 0 0 0 0 0 0.06 1072.5 0 0 141.835 0 -1258.2 0 0 -1854.23 1913.89 0 0 1819.9 0 -1339.53 0 0 0 909.68 1987.14 0 0 0 0 0 -1368.22 0 1619.39 0 0 2493.74 0 0 463.958 -579.928 0 0 0 0 
1166.8 0 0 0 2421.72 136.341 0 -764.26 -1263.39 0 1391.26 0 264.672 0 0 0 559.481 0 36.0881 0.04 1499.45 0 0 0 1144.22 -1159.47 0 0 0 0 0 0 0 0 1890.09 0 0 0 0 0 1513.79 0 0 0 0 -1541.26 0 0 -2492.07 0 -214.316 0 0 980.636 0 0 -1209.22 0 
0 0 0 0 0 0 0 0 0 0 562.532 1614.51 -22.66 0 0 0 0 82.3237 0 -592.593 0 0 0 0 -563.906 0 0 0 0 119.251 0 946.608 0 0 0 0 0 0 0 -1601.69 0 2337.64 0 207.45 0 0 559.938 -374.538 0 0 0 0 1084.55 1043.81 0 -743.66 0 0 
797.983 0 0 0 0 0 -1730.02 -103.229 435.118 0 0 0 31.0526 2071.98 -1521.12 0 0 0 0 0 0 0.07 -2255.39 0 0 1745.73 0 871.685 0 0 0 0 0 0 0 278.71 0 0 -1516.85 -309.229 640.507 0 0 0 0 0 0 2028.03 0 0 0 0 1339.23 1683.63 0 0 0 0 
0 0 0 0 0 0 0 0 0 0 0 0 0 0 775.552 0 0 0 -2319.64 0 0 2419.74 0.04 -833.689 0 0 -2329.4 0 0 -1414.3 0 0 0 0 0 0 0 -560.091 0 0 0 0 848.033 1743.45 0 0 0 2369.69 0 0 1548.74 0 0 0 2302.09 0 0 0 
-2350.76 0 0 0 0 0 2129.2 -1146.35 0 -1760.38 1869.79 -665.838 0 0 -1232.11 0 1073.87 2098.53 0 0 0 0 1331.45 0.07 0 0 -1761.6 0 9.23185 0 0 0 0 0 996.2 0 0 -698.95 0 824.686 -1732.46 0 0 0 0 -2318.11 0 0 758.156 0 958.968 0 0 0 -405.667 0 0 2103.11 
0 -2492.52 0 -424.894 0 0 -597.018 0 0 -671.331 0 0 0 91.7844 0 0 0 493.561 2011.7 882.366 26.3222 0 0 0 0 100.94 768.075 0 0 0 623.417 1430.17 0 -405.667 0 -2239.22 0 0 -1117.36 0 0 0 0 2349.7 0 0 736.335 0 0 0 0 0 0 0 156.941 -1290.7 0 0 
28.9163 884.045 -41.5815 0 0 0 0 0 913.648 2302.85 0 0 0 0 -1794.56 0 0 0 0 -2008.35 0 -2458.95 0 0 992.08 0.02 0 0 0 0 0 0 1781.29 0 0 0 0 0 0 0 0 2218.16 313.501 0 0 0 0 -2392.12 0 2230.98 0 0 -2048.94 0 434.965 1382.26 0 0 
2217.7 0 117.42 1944.26 0 -828.654 0 0 0 0 0 0 0 0 0 0 -154.347 0 0 0 0 0 1694.31 1683.94 -1387.3 0 0.06 0 0 0 0 0 0 0 0 716.803 613.193 0 0 0 0 0 0 -1735.82 0 0 0 0 0 0 0 0 257.195 0 -2433.77 0 0 0 
0 0 0 0 0 86.2911 0 0 0 -2397.31 0 0 0 0 600.07 0 0 -1542.48 -2254.48 0 0 1581.09 0 0 0 0 0 0.08 0 0 0 0 0 2104.63 1365.32 1978.44 2230.22 0 -1329.62 0 2067.86 -1075.7 0 0 0 0 0 0 -419.706 0 0 0 0 0 0 -277.337 0 -452.208 
0 0 -1960.89 286.798 0 0 1825.24 0 0 0 0 0 0 0 0 0 0 0 1834.7 0 0 0 0 2453.31 0 0 0 0 0.04 0 0 0 0 0 0 0 0 0 0 0 0 0 -2238.3 0 0 0 0 0 0 0 0 -733.131 1249.35 606.784 0 0 0 0 
0 0 0 0 0 0 0 0 -590.762 0 0 0 0 0 0 0 837.657 0 0 0 1374.17 0 1338.92 0 0 0 0 0 0 0.05 0 0 0 0 0 0 0 0 2351.83 0 0 0 0 0 0 0 0 0 0 0 -1206.47 0 -1034.65 0 2081.59 -569.094 0 0 
1683.02 -641.118 0 0 0 1169.85 2150.72 0 0 0 -1912.67 0 0 0 371.639 0 0 0 0 0 0 0 0 0 326.014 0 0 0 0 0 0.08 0 0 0 0 0 0 0 2157.89 0 0 2436.83 0 0 0 -465.178 0 0 0 0 -1304.13 0 0 0 0 0 0 82.0185 
-697.882 0 -1244.01 0 0 0 2012.62 754.952 0 0 0 0 0 -364.315 0 0 0 0 -1849.65 0 645.695 0 0 0 1702.7 0 0 0 0 0 0 0.09 -1674.32 0 0 0 -1570.41 0 -2104.79 0 0 0 540.559 1267.05 0 0 857.952 0 131.764 0 0 0 2420.8 0 0 0 0 0 
0 0 0 -1483.28 0 0 0 0 0 0 0 1074.94 0 0 0 0 0 0 0 0 0 0 0 0 0 -333.796 0 0 0 0 0 1953.26 0.06 0 0 0 0 -1139.18 1712.62 0 0 1894.97 0 -1193.35 0 2125.08 0 0 0 0 0 0 0 -315.332 0 0 0 0 
0 1640.14 1547.67 1726.81 0 0 0 951.491 -49.3637 0 0 -31.5104 0 0 -1794.41 0 669.652 0 1628.24 0 0 0 0 0 842.845 0 0 1747.26 0 0 0 0 0 0.09 0 0 0 1668.07 0 -1203.27 1805.55 -1046.56 0 1804.03 1136.13 0 0 0 -2198.78 539.949 -1535.62 0 1736.88 -904.187 0 0 0 0 
-1461 0 0 0 0 0 0 0 0 1962.87 0 0 0 0 0 0 0 -260.247 0 -112.384 0 0 0 740.15 0 0 0 2256.61 0 0 0 0 0 0 0.06 90.7163 -909.68 0 1732.31 0 -1152.15 0 0 0 1245.08 204.398 359.127 0 0 0 0 0 1642.28 1910.69 0 2155.75 0 0 
0 0 0 0 0 0 0 0 2478.18 0 0 160.146 0 2360.38 0 160.146 0 -440.001 0 0 0 1756.11 0 0 1709.27 0 -2389.68 154.5 0 0 0 0 0 0 1121.63 0.02 0 0 0 0 0 0 0 0 0 0 0 -2407.07 0 0 0 -1493.19 0 2395.17 0 0 0 0 
0 0 -1574.53 0 0 0 0 -136.189 517.823 0 1113.39 0 0 0 0 0 0 0 0 0 0 0 0 0 0 0 1903.97 536.286 0 0 0 -1639.84 0 0 -2410.43 0 0.09 1865.67 0 0 -222.556 -516.602 677.74 0 0 0 0 0 2069.08 0 0 0 0 2325.13 192.801 0 0 0 
0 0 0 0 0 0 0 0 2364.04 0 0 0 0 0 0 0 0 0 -646.001 0 0 0 -859.478 -2266.08 0 0 0 0 0 0 0 0 2447.36 1824.63 0 0 2065.26 0.08 0 0 -2313.53 0 0 0 0 0 -288.171 0 2432.25 0 0 -934.4 0 0 0 983.383 0 0 
-1488.77 0 0 0 -2305.9 0 2200.92 0 0 0 0 0 1289.48 0 0 0 0 -1127.58 -1043.2 0 0 -2099.6 0 0 1359.98 0 0 129.322 0 -680.639 1666.69 959.578 -1411.71 0 -889.996 0 0 0 0 0 555.513 0 0 0 2483.83 -947.676 0 1448.03 0 0 0 1969.74 912.732 0 1545.23 0 1934.19 0 
0 0 0 586.184 0 0 0 0 0 0 44.3281 0 2258.14 2366.63 0 0 0 1712.32 0 0 2321.16 163.045 0 1243.1 0 0 0 0 0 0 0 0 0 -2451.63 0 0 0 0 0 0.05 0 -636.387 0 -1863.08 138.936 -157.094 0 0 0 -1821.27 0 0 0 0 0 0 0 0 
0 -219.352 0 0 0 0 0 0 0 0 2434.08 901.135 1874.83 -271.538 0 2085.25 0 0 0 1023.97 0 -1872.69 0 2321.31 0 0 0 -635.472 0 0 0 0 0 -1452.45 914.106 0 -1792.89 2382.81 -866.192 0 0.08 -1268.73 0 0 -30.5948 0 0 1874.37 0 0 -1189.08 -374.691 0 0 -355.922 0 489.746 0 
0 0 0 0 0 235.832 0 53.3311 0 1987.59 0 0 0 0 0 2175.44 0 0 0 0 1043.66 0 0 0 0 2002.7 0 -1640.9 0 0 1822.64 0 -152.974 2013.53 0 0 1630.99 0 0 -1986.68 -2352.9 0.07 0 0 0 -2495.73 -1471.22 0 0 544.069 -198.752 0 0 0 0 0 0 0 
0 0 0 0 0 0 0 0 0 0 0 0 1204.95 0 0 0 0 0 0 0 0 0 -234.764 0 0 2090.29 0 0 -373.47 0 0 1189.38 0 0 0 0 534.608 0 0 0 0 0 0.01 0 0 0 -1542.79 0 0 0 0 0 -2498.32 0 2233.27 0 2251.73 1406.52 
0 0 0 0 425.199 0 0 -143.971 0 597.476 0 0 -854.442 -501.038 0 0 2031.85 0 0 0 775.704 0 1656.47 0 -1816.08 0 2389.37 0 0 0 0 1049.91 -361.415 -1785.87 0 0 0 0 0 -1798.38 0 0 0 0.05 0 0 0 0 0 0 0 0 0 0 0 1823.71 0 0 
-234.153 0 0 0 0 0 0 0 0 0 0 0 0 0 0 0 0 0 -4.0437 0 0 0 0 0 0 0 0 0 0 0 0 0 0 1716.59 25.4067 0 0 0 -648.137 -1067.31 -64.0126 0 0 0 0 266.808 0 0 0 0 0 1813.94 0 0 2414.7 591.678 0 -980.178 
0 0 0 0 0 0 0 0 404.599 0 0 0 0 0 0 0 0 0 0 -1265.98 0 0 0 -2492.22 0 0 0 0 0 0 2025.89 0 900.677 0 991.165 0 0 0 1704.84 1949.14 0 161.977 0 0 1860.79 0.04 0 -790.048 0 0 0 0 0 421.995 -2145.83 0 0 -1351.74 
0 0 1302 2202.9 0 122.761 0 -262.23 0 -1530.43 0 0 -2142.32 659.581 -1553.16 0 1183.28 2250.51 -2159.11 0 1681.95 0 0 0 2334.89 0 0 0 0 0 0 2314.45 0 0 -1072.95 0 0 1780.22 0 0 0 -1611.61 -1150.62 0 0 0 0.02 0 1616.79 0 2024.52 -1514.1 -38.5296 342.189 0 0 0 0 
0 0 0 0 0 1135.21 0 0 0 -1427.27 0 0 0 0 0 0 0 0 0 0 1429.56 1668.68 -1285.21 0 0 2497.56 0 0 0 0 0 0 0 0 0 1463.74 0 0 307.398 0 1386.53 0 0 0 0 1582.92 0 0 -2009.26 -2023 0 0 0 0 1592.68 0 0 0 
1475.65 0 2258.9 0 0 0 0 0 0 0 0 0 1137.96 0 0 0 0 0 0 1048.84 0 0 0 2139.27 0 0 0 1924.73 0 0 0 1884.14 0 -1353.57 0 0 -326.624 -1321.68 0 0 0 0 0 0 0 0 -1270.1 641.423 0.02 -77.5933 -1683.32 1722.24 0 0 -1184.5 0 296.411 0 
-860.698 2482.6 0 0 1495.94 0 0 0 -1994.61 0 1860.79 0 0 -1143.91 -92.2422 0 0 -1834.7 1556.22 0 0 0 0 0 0 110.401 0 0 0 0 0 0 0 2243.8 0 0 0 0 0 1694.92 0 1654.64 0 0 0 0 0 -11.9785 1677.53 0.07 0 0 0 1762.67 795.999 0 0 0 
0 739.082 -812.326 1837.75 0 550.02 0 -511.567 0 -801.34 0 959.578 272.149 0 0 1617.25 0 0 0 -1010.09 0 0 -913.8 2110.13 0 0 0 0 0 -1945.02 1428.65 0 0 2350.61 0 0 0 0 0 0 882.977 -638.829 0 0 0 0 1509.22 0 -17.1667 0 0.08 0 0 0 -714.972 445.036 0 0 
0 0 560.091 0 -179.983 0 -2369.53 0 -576.113 0 0 0 2393.03 0 0 0 0 0 0 0 0 0 0 0 0 0 0 0 1711.4 0 0 0 0 0 0 -2024.98 0 960.952 -1203.12 0 -366.909 0 0 0 266.045 0 -1853.31 0 2391.96 0 0 0.05 0 1221.27 0 0 0 0 
311.823 -416.349 -872.6 0 0 0 -127.033 0 0 0 0 0 239.341 0 0 0 2048.33 1020.31 -1844.31 0 125.05 -2156.51 0 0 0 -300.989 2479.4 0 56.9933 -928.449 0 2051.07 0 -2067.55 -1653.42 0 0 0 1427.43 0 0 0 91.4792 0 0 0 1283.07 0 0 0 0 0 0.04 0 2180.93 0 0 0 
0 0 0 0 1825.08 0 0 0 0 -715.888 0 -215.079 0 0 2037.03 875.805 0 0 -475.402 -844.066 -1141.01 1427.73 0 0 0 0 0 0 1430.33 0 0 0 1779.31 2477.87 1472.29 1075.55 -1468.17 0 0 0 0 0 0 0 0 -506.073 891.827 0 0 2018.88 0 -540.254 0 0.08 0 0 2028.64 0 
0 -1203.27 0 2360.84 0 0 0 -844.523 0 0 1616.64 2152.85 1397.37 0 0 132.832 -843.76 0 0 0 0 0 -786.996 -1653.72 2279.2 -2323.3 1957.99 0 0 473.266 0 0 0 0 0 0 258.568 0 -1612.83 0 2345.73 0 547.884 0 1064.26 -1750.62 0 -454.039 1054.8 1276.67 -1564.46 0 -1422.85 0 0.06 0 0 0 
0 0 0 0 -2107.38 0 0 0 2237.08 0 748.085 243.767 0 0 0 0 0 0 0 0 -529.725 0 0 0 338.374 2480.47 0 -889.233 0 1200.83 0 0 0 0 -479.827 0 0 2429.65 0 0 0 0 0 -361.11 1410.95 0 0 0 0 0 -64.7755 0 0 0 0 0.08 0 0 
0 0 0 0 0 2418.21 0 0 0 0 0 -1273.46 544.832 249.718 0 0 0 0 0 935.469 0 0 0 0 0 0 0 0 0 0 0 0 0 0 0 0 0 0 -782.571 0 1858.2 0 1203.27 0 0 0 0 0 1194.27 0 0 0 0 1973.4 0 0 0 0 
0 0 0 0 0 1966.69 0 0 0 0 0 0 0 0 0 0 0 0 0 0 0 0 0 -507.294 0 0 0 -653.783 0 0 -147.176 0 0 0 0 0 0 0 0 0 0 0 -733.131 0 -1149.86 2458.34 0 0 0 0 0 0 0 0 0 0 0 0.02 
