*Vertices 60
*Matrix 
0.01 0 0 0 1295.43 0 0 0 0 0 0 0 0 0 1587.65 0 0 -882.061 0 0 -1508 0 2392.88 290.613 0 0 0 0 0 0 0 0 0 0 0 0 0 0 309.381 0 0 0 0 0 0 0 0 1736.73 0 753.578 0 0 0 0 0 0 0 0 0 0 
0 0.05 0 0 0 0 699.255 0 0 0 0 0 0 -1222.34 -1228.14 0 -676.977 906.171 0 0 0 0 0 0 0 0 -85.6807 0 0 0 0 0 0 0 0 0 0 0 270.47 0 1504.33 0 0 0 0 0 2370.6 0 0 0 0 0 0 0 0 0 0 0 0 0 
0 0 0.04 0 0 0 -565.584 0 0 0 639.286 -930.738 0 0 0 0 0 0 0 0 0 0 0 0 0 0 1411.1 0 0 0 0 1893.29 0 0 0 0 0 -49.6689 0 0 0 0 0 0 2117.3 0 475.86 0 0 0 0 0 0 0 0 0 0 1801.43 0 0 
0 0 0 0.01 0 -705.206 2138.81 0 0 0 0 0 0 0 0 0 0 0 0 797.678 0 2150.11 0 0 0 0 0 0 0 0 624.485 0 0 0 0 2391.35 0 0 0 0 0 0 0 0 0 0 0 0 1420.26 0 0 0 0 0 0 0 0 0 0 0 
-1001.08 0 0 0 0.02 0 0 0 0 -194.021 2021.01 0 0 0 -548.494 0 0 0 0 0 0 0 0 0 0 0 2309.26 0 0 0 1921.37 0 0 -1249.35 1907.33 0 0 0 0 0 773.568 0 0 0 0 -985.977 0 0 0 0 1361.35 0 0 0 0 0 0 0 284.661 0 
0 0 0 -1067.46 0 0.02 2380.06 0 0 0 0 0 0 0 193.564 0 0 0 0 0 0 0 0 0 0 0 0 0 0 0 0 0 0 0 0 0 0 0 0 0 0 1178.7 0 0 0 0 747.169 0 0 -303.125 0 0 0 0 0 0 0 0 0 0 
0 -871.685 -1623.51 1340.6 0 -531.098 0.03 0 0 0 0 0 0 0 0 0 0 0 0 0 0 666.601 0 0 0 1297.27 0 0 0 0 0 0 -751.442 0 0 0 2093.34 0 0 0 -622.806 0 0 0 0 0 0 0 0 -321.436 816.904 0 0 0 0 0 0 0 0 0 
0 0 0 0 0 0 0 0.04 0 0 -531.861 0 0 0 0 0 0 -249.413 0 0 1872.39 -1294.82 0 0 0 0 0 2359 0 1739.48 0 0 0 0 0 0 0 0 0 0 0 0 0 0 0 0 0 0 0 0 0 0 0 0 0 0 0 0 0 0 
0 0 0 0 0 0 0 0 0.02 1060.29 0 0 0 0 0 0 0 0 0 -1190.76 0 0 0 0 1069.6 0 0 1263.54 0 0 0 0 0 0 0 0 0 0 -416.349 0 0 0 0 0 -2249.75 0 0 0 0 0 0 0 -163.198 2130.42 0 0 0 0 0 0 
0 0 0 0 -468.23 0 0 0 1072.04 0.04 2091.36 0 0 0 0 0 0 0 268.181 0 0 0 1768.78 0 0 0 0 -62.1815 2178.79 0 0 0 0 0 0 0 2183.98 326.777 0 0 0 0 -482.116 0 0 0 0 0 0 0 0 0 0 0 0 0 0 0 0 0 
0 0 2041.46 0 1301.84 0 0 509.735 0 509.583 0 0 0 0 0 0 0 0 0 0 -1614.2 -716.651 0 0 0 0 0 0 -1177.79 0 0 0 0 0 0 0 2175.74 0 0 0 0 0 0 -354.701 0 0 0 0 0 0 0 0 0 0 0 0 0 0 0 0 
0 0 2197.71 0 0 0 0 0 0 0 0 0.07 0 976.058 0 0 0 0 0 0 0 0 0 0 2050.92 0 0 0 0 0 0 0 0 0 0 0 0 0 0 0 0 0 0 0 0 0 0 0 0 0 0 0 1976.15 0 0 0 1231.8 -1305.35 0 0 
0 0 0 0 0 0 0 0 0 0 0 0 0.03 212.027 0 0 0 0 0 809.275 0 0 0 0 1698.43 0 0 0 0 0 0 0 0 0 0 0 0 0 0 0 0 0 0 0 0 0 0 1434.6 0 0 0 0 0 0 0 0 0 1171.99 0 0 
0 -906.476 0 0 0 0 0 0 0 0 0 -984.451 2043.14 0.06 0 0 -1408.35 0 0 0 0 0 0 0 2074.42 0 0 0 0 0 0 0 0 0 0 0 0 0 667.516 0 0 0 0 0 0 0 0 0 338.984 -100.024 0 0 2283.47 0 0 0 0 0 0 0 
1105.3 -594.119 0 0 1783.73 356.38 0 0 0 0 0 0 0 0 0.03 0 0 0 0 0 0 2449.19 0 0 0 0 0 0 0 0 0 254.143 0 0 0 0 0 0 0 0 0 -398.648 0 0 0 0 0 1071.73 0 0 0 -1173.06 -2288.66 0 0 0 0 0 0 0 
0 0 0 0 0 0 0 0 0 0 0 0 0 0 0 0.04 0 0 0 0 798.746 0 0 0 0 -1930.83 1888.71 0 0 0 0 0 0 0 0 0 0 731.452 0 -2094.41 1267.82 0 0 0 0 0 0 0 0 36.3933 0 0 -1304.28 0 1913.74 0 0 0 0 0 
0 -1609.93 0 0 0 0 0 0 0 0 0 0 0 -2007.89 0 0 0.09 0 2228.39 1746.96 0 2401.12 251.244 0 -345.088 0 0 0 0 0 0 0 0 0 0 0 0 0 0 0 781.655 0 0 -902.203 0 0 0 0 0 2025.89 0 0 0 0 0 0 0 1478.09 0 0 
261.467 1459.93 0 0 0 0 0 2017.65 0 0 0 0 0 0 0 0 0 0.07 0 0 -812.632 984.756 0 0 0 0 0 -1803.87 0 0 0 0 0 0 0 0 0 0 0 0 0 -1602.76 0 0 0 0 1132.16 0 0 0 0 0 0 0 0 0 0 0 0 0 
0 0 0 0 0 0 0 0 0 -532.014 0 0 0 0 0 0 654.546 0 0.05 0 0 0 0 0 0 0 0 0 -909.68 0 -535.524 0 0 1262.93 1257.13 0 0 0 0 0 0 0 0 0 0 0 0 0 0 0 0 -438.932 2108.6 0 0 0 0 0 0 0 
0 0 0 2331.39 0 0 0 0 -406.43 0 0 0 -1163.59 0 0 0 2433.93 0 0 0.04 -380.184 0 0 -1834.24 0 0 0 0 0 0 0 0 0 0 0 0 0 0 0 0 0 0 0 -1914.66 0 0 0 0 0 0 2100.82 50.1267 0 0 1145.44 0 0 0 0 0 
-357.753 0 0 0 0 0 0 1201.74 0 0 1549.96 0 0 0 0 1041.83 0 1642.58 0 -1615.12 0.07 0 0 0 0 0 0 0 0 0 0 0 0 0 1291.77 0 0 0 0 2464.6 0 0 0 0 0 600.07 0 0 0 0 0 0 0 0 0 0 -71.0318 0 0 0 
0 0 0 1839.27 0 0 2348.48 -1892.22 0 0 2319.48 0 0 0 863.903 0 -1462.68 -703.681 0 0 0 0.03 0 0 0 0 0 0 2156.67 0 0 0 0 0 0 -1165.58 0 0 0 1686.53 0 0 0 0 0 0 0 0 0 0 0 0 0 0 2071.37 0 0 0 0 0 
-466.552 0 0 0 0 0 0 0 0 2496.19 0 0 0 0 0 0 -15.183 0 0 0 0 0 0.09 0 0 0 0 0 0 0 0 0 0 0 0 0 0 0 0 0 0 0 0 0 0 0 0 0 0 0 0 0 0 0 0 796.304 0 2055.8 0 0 
1982.25 0 0 0 0 0 0 0 0 0 0 0 0 0 0 0 0 0 0 -1089.13 0 0 0 0.01 0 0 0 0 0 0 0 0 0 0 0 0 0 0 0 0 1848.12 0 0 633.335 0 0 0 0 0 0 0 0 945.235 0 1330.68 0 -2460.33 -2188.41 0 0 
0 0 0 0 0 0 0 0 -2410.28 0 0 -506.989 2017.2 475.249 0 0 1203.57 0 0 0 0 0 0 0 0.09 0 0 0 0 1529.82 0 0 0 0 0 0 0 0 0 0 0 0 0 0 0 0 0 0 0 0 0 0 0 -367.061 0 0 -1004.29 0 0 0 
0 0 0 0 0 0 2224.57 0 0 0 0 0 0 0 0 -26.9326 0 0 0 0 0 0 0 0 0 0.01 1498.08 2054.43 0 0 0 0 0 0 0 0 1890.85 0 0 1161.15 0 0 671.331 0 0 0 0 0 0 0 0 0 0 0 0 0 0 1688.36 0 0 
0 -1551.64 1380.28 0 1331.29 0 0 0 0 0 0 0 0 0 0 1951.89 0 0 0 0 0 0 0 0 0 113.91 0.03 0 0 0 0 0 0 0 0 0 0 0 0 906.781 0 0 -2384.33 0 0 2056.87 0 0 0 0 0 0 0 2426.76 0 0 0 0 0 0 
0 0 0 0 0 0 0 -445.647 1683.94 1249.81 0 0 0 0 0 0 0 950.117 0 0 0 0 0 0 0 1382.11 0 0.05 0 0 0 0 0 0 0 1645.33 0 0 0 0 0 0 1431.24 0 0 0 814.158 0 0 0 0 1778.7 0 0 0 0 0 557.649 0 0 
0 0 0 0 0 0 0 0 0 1056.17 -1855.14 0 0 0 0 0 0 0 1436.43 0 0 -2129.66 0 0 0 0 0 0 0.03 0 0 0 0 0 0 0 0 0 0 0 0 0 0 0 0 0 0 0 0 0 0 0 0 617.924 0 673.62 0 0 0 0 
0 0 0 0 0 0 0 1669.13 0 0 0 0 0 0 0 0 0 0 0 0 0 0 0 0 -2013.69 0 0 0 0 0.03 0 0 0 0 0 0 -185.629 0 434.202 0 0 1482.82 0 0 0 0 0 2064.35 855.815 0 0 0 0 0 0 0 -994.522 0 0 0 
0 0 0 -1207.24 1967.15 0 0 0 0 0 0 0 0 0 0 0 0 0 1051.74 0 0 0 0 0 0 0 0 0 0 0 0.07 0 0 0 0 1055.41 0 0 0 0 0 0 0 1325.95 0 0 0 0 0 0 0 0 0 0 0 0 0 0 0 0 
0 0 -591.525 0 0 0 0 0 0 0 0 0 0 0 2337.64 0 0 0 0 0 0 0 0 0 0 0 0 0 0 0 0 0.09 1564.15 0 0 0 0 2014.3 0 0 0 0 0 0 0 0 0 0 0 0 0 1426.66 0 0 0 0 0 0 0 0 
0 0 0 0 0 0 -752.052 0 0 0 0 0 0 0 0 0 0 0 0 0 0 0 0 0 0 0 0 0 0 0 0 -1283.07 0.09 0 0 0 0 0 0 0 0 0 0 0 0 0 0 0 2496.34 0 0 1005.2 0 0 0 0 0 0 0 0 
0 0 0 0 1661.2 0 0 0 0 0 0 0 0 0 0 0 0 0 -1026.11 0 0 0 0 0 0 0 0 0 0 0 0 0 0 0.01 0 985.519 0 0 -437.864 0 0 476.012 0 0 0 -359.89 0 0 1806.62 0 0 -1334.04 2236.63 1698.58 0 0 0 0 0 0 
0 0 0 0 259.484 0 0 0 0 0 0 0 0 0 0 0 0 0 369.503 0 -569.247 0 0 0 0 0 0 0 0 0 0 0 0 0 0.02 0 0 0 0 0 0 0 0 0 0 0 -325.251 0 0 0 0 0 0 0 144.429 1963.94 0 0 0 0 
0 0 0 544.832 0 0 0 0 0 0 0 0 0 0 0 0 0 0 0 0 0 -351.802 0 0 0 0 0 1418.27 0 0 -1165.58 0 0 -1656.01 0 0.01 0 0 0 0 0 0 0 0 0 0 -285.882 365.078 0 0 1722.24 0 0 2068.01 301.904 0 0 0 0 0 
0 0 0 0 0 0 2368.62 0 0 268.334 1045.95 0 0 0 0 0 0 0 0 0 0 0 0 0 0 1408.51 0 0 0 1629.92 0 0 0 0 0 0 0 0 0 0 931.959 0 0 0 0 0 0 0 0 0 -760.14 0 0 -496.612 0 0 0 0 0 0 
0 0 2284.08 0 0 0 0 0 0 -1416.59 0 0 0 0 0 1550.26 0 0 0 0 0 0 0 0 0 0 0 0 0 0 0 2297.97 0 0 0 0 0 0.03 0 0 0 0 0 0 1505.86 0 0 0 0 0 0 0 0 0 1974.78 -707.343 0 -1002.46 0 0 
2377.01 -1472.44 0 0 0 0 0 0 -754.646 0 0 0 0 2367.85 0 0 0 0 0 0 0 0 0 0 0 0 0 0 0 -342.647 0 0 0 1419.19 0 0 0 0 0.04 0 0 714.057 0 1477.32 2025.59 0 0 -1976.15 0 0 0 0 0 0 -1202.05 0 0 257.195 0 0 
0 0 0 0 0 0 0 0 0 0 0 0 0 0 0 216.3 0 0 0 0 -672.552 550.172 0 0 0 1083.33 -1181.75 0 0 0 0 0 0 0 0 0 0 0 0 0.09 0 0 0 -1245.69 0 0 1739.48 0 -1685.92 0 0 -151.601 0 0 0 0 2260.28 0 0 0 
0 -674.993 0 0 -1518.07 0 1761.91 0 0 0 0 0 0 0 0 1681.04 157.704 0 0 0 0 0 0 -499.054 0 0 0 0 0 0 0 0 0 0 0 0 1815.01 0 0 0 0.03 0 0 0 0 0 0 0 0 0 0 0 0 0 0 0 0 0 0 0 
0 0 0 0 0 1788 0 0 0 0 0 0 0 0 1976.15 0 0 1869.33 0 0 0 0 0 0 0 0 0 0 0 -1691.26 0 0 0 1096.76 0 0 0 0 1851.02 0 0 0.07 0 0 0 0 0 0 0 0 0 0 0 0 0 0 0 2130.57 0 0 
0 0 0 0 0 0 0 0 0 1064.87 0 0 0 0 0 0 0 0 0 0 0 0 0 0 0 -865.276 417.722 541.932 0 0 0 0 0 0 0 0 0 0 0 0 0 0 0.07 0 0 0 1469.39 0 2129.2 0 0 0 0 0 0 0 0 0 0 0 
0 0 0 0 0 0 0 0 0 0 -809.732 0 0 0 0 0 1541.72 0 0 1657.99 0 0 0 2379.15 0 0 0 0 0 0 -1643.19 0 0 0 0 0 0 0 297.327 1282.01 0 0 0 0 744.423 0 0 2361.6 0 1065.48 0 0 0 0 0 -1410.34 0 0 0 0 
0 0 1314.66 0 0 0 0 0 283.441 0 0 0 0 0 0 0 0 0 0 0 0 0 0 0 0 0 0 0 0 0 0 0 0 0 0 0 0 -449.004 977.737 0 0 0 0 -1328.85 0.07 2370.14 0 0 0 0 0 0 0 0 0 0 0 0 0 0 
0 0 0 0 2306.21 0 0 0 0 0 0 0 0 0 0 0 0 0 0 0 1184.19 0 0 0 0 0 1582.77 0 0 0 0 0 0 -2252.19 0 0 0 0 0 0 0 0 0 0 373.775 0.09 0 0 0 793.252 0 0 0 0 0 0 0 0 0 0 
0 -1572.85 475.555 0 0 1500.67 0 0 0 0 0 0 0 0 0 0 0 1627.78 0 0 0 0 0 0 0 0 0 891.369 0 0 0 0 0 0 2042.83 -1863.69 0 0 0 2435.15 0 0 2434.39 0 0 0 0.05 0 0 -2445.98 0 0 0 0 -277.947 0 0 0 0 0 
539.033 0 0 0 0 0 0 0 0 0 0 0 -515.992 0 -14.1148 0 0 0 0 0 0 0 0 0 0 0 0 0 0 1130.48 0 0 0 0 0 -571.535 0 0 -1246.76 0 0 0 0 1572.7 0 0 0 0.04 0 0 0 0 0 0 645.085 0 0 0 0 0 
0 0 0 -549.562 0 0 0 0 0 0 0 0 0 -214.774 0 0 0 0 0 0 0 0 0 0 0 0 0 0 0 631.809 0 0 2488.71 2172.08 0 0 0 0 0 2389.52 0 0 -1689.43 0 0 0 0 0 0.04 0 0 -2445.68 -64.6229 0 0 0 0 0 0 0 
612.125 0 0 0 0 1761.15 2464.14 0 0 0 0 0 0 -1717.05 0 1156.88 -1440.86 0 0 0 0 0 0 0 0 0 0 0 0 0 0 0 0 0 0 0 0 0 0 0 0 0 0 -1715.98 0 1966.38 1661.35 0 0 0.04 0 -133.442 1506.32 0 0 2350.46 0 0 0 192.648 
0 0 0 0 194.937 0 -681.097 0 0 0 0 0 0 0 0 0 0 0 0 689.642 0 0 0 0 0 0 0 0 0 0 0 0 0 0 0 1144.83 1964.25 0 0 0 0 0 0 0 0 0 0 0 0 0 0.07 0 424.894 -1900.16 0 538.881 -2155.6 1966.84 0 0 
0 0 0 0 0 0 0 0 0 0 0 0 0 0 -1864.76 0 0 0 -903.272 1858.81 0 0 0 0 0 0 0 -449.156 0 0 0 255.974 524.995 2149.34 0 0 0 0 0 -1639.84 0 0 0 0 0 0 0 0 900.372 -105.06 0 0.02 488.372 0 0 0 0 0 0 0 
0 0 0 0 0 0 0 0 -1231.19 0 0 804.239 0 2409.36 624.485 -1288.42 0 0 579.165 0 0 0 0 -1328.55 0 0 0 0 0 0 0 0 0 -2029.86 0 0 0 0 0 0 0 0 0 0 0 0 0 0 888.47 2290.95 -109.027 1354.49 0.03 2425.84 0 0 0 0 0 0 
0 0 0 0 0 0 0 0 2312.92 0 0 0 0 0 0 0 0 0 0 0 0 0 0 0 624.18 0 1528.44 0 -1103.47 0 0 0 0 -147.328 0 -1591.62 1653.26 0 0 0 0 0 0 0 0 0 0 0 0 0 206.839 0 1142.84 0.05 0 0 0 0 0 0 
0 0 0 0 0 0 0 0 0 0 0 0 0 0 0 395.901 0 0 0 1411.25 0 -1752.3 0 271.386 0 0 0 0 0 0 0 0 0 0 457.091 -571.993 0 1321.53 353.938 0 0 0 0 0 0 0 2056.87 435.575 0 0 0 0 0 0 0.03 0 0 0 0 0 
0 0 0 0 0 0 0 0 0 0 0 0 0 0 0 0 0 0 0 0 0 0 2416.84 0 0 0 0 0 -2320.7 0 0 0 0 0 2301.93 0 0 1422.7 0 0 0 0 0 -284.356 0 0 0 0 0 1672.34 -750.069 0 0 0 0 0.09 0 0 0 0 
0 0 0 0 0 0 0 0 0 0 0 1562.62 0 0 0 0 0 0 0 0 562.227 0 0 2141.56 1116.14 0 0 0 0 -707.19 0 0 0 0 0 0 0 0 0 973.617 0 0 0 0 0 0 0 0 0 0 -2097.61 0 0 0 0 0 0.09 0 0 0 
0 0 -1710.64 0 0 0 0 0 0 0 0 1603.21 348.75 0 0 0 -1406.22 0 0 0 0 0 2185.51 1347.77 0 -228.965 0 -10.4526 0 0 0 0 0 0 0 0 0 149.464 -1018.33 0 0 1938.92 0 0 0 0 0 0 0 0 2480.62 0 0 0 0 0 0 0 0 0 
0 0 0 0 1175.04 0 0 0 0 0 0 0 0 0 0 0 0 0 0 0 0 0 0 0 0 0 0 0 0 0 0 0 0 0 0 0 0 0 0 0 0 0 0 0 0 0 0 0 0 0 0 0 0 0 0 0 0 0 0.06 0 
0 0 0 0 0 0 0 0 0 0 0 0 0 0 0 0 0 0 0 0 0 0 0 0 0 0 0 0 0 0 0 0 0 0 0 0 0 0 0 0 0 0 0 0 0 0 0 0 0 2030.17 0 0 0 0 0 0 0 0 0 0.03 
