*Vertices 53
*Matrix 
0.02 0 -1839.73 0 0 0 0 2193.9 0 0 0 -150.38 0 0 0 0 0 0 0 -1574.37 0 0 0 0 0 962.02 1169.24 0 1238.21 0 760.445 0 0 0 0 0 0 0 0 -506.836 -2264.09 -700.629 0 0 0 0 0 0 0 0 487.915 0 2443.24 
0 0.08 0 2248.38 0 -995.743 0 377.59 0 0 0 0 0 0 0 0 2488.86 0 -1057.54 0 0 861.003 -27.8481 0 0 0 -608.005 0 0 0 0 1853.16 0 0 0 202.872 0 0 0 0 0 0 0 0 0 0 0 0 0 0 0 0 0 
776.925 0 0.09 -640.049 0 0 0 0 2102.65 0 0 0 1734.29 0 112.69 -31.2052 0 0 0 0 0 0 0 0 481.201 0 0 0 0 -761.818 -1356.32 0 0 0 0 0 0 0 0 0 0 0 0 0 0 1578.95 0 0 0 0 694.678 -830.027 0 
0 1286.74 313.196 0.05 0 0 -646.916 1296.81 86.2911 2203.82 0 -2365.87 146.26 0 -286.187 0 -15.7933 0 0 -1671.27 1672.64 2424.16 -981.857 0 -869.243 2447.97 652.409 0 0 0 0 0 0 0 758.614 0 0 0 0 0 0 -1976.91 0 0 0 0 504.7 -349.208 -1223.56 2309.26 0 0 0 
0 0 0 0 0 -2117.3 0 0 0 0 0 0 0 0 2343.59 0 0 0 0 1968.06 -600.375 540.406 0 0 0 0 -138.173 0 0 787.301 0 0 0 0 0 0 0 0 0 0 0 0 1242.94 0 0 0 0 0 0 0 -1863.69 0 -2283.62 
0 1146.5 0 0 1889.32 0.05 1147.57 0 0 0 -1989.88 0 0 2382.66 0 0 0 0 0 0 0 1791.67 0 0 0 1587.5 581.759 0 0 0 -1005.97 1626.56 -133.9 0 927.076 0 1152.61 1056.17 0 0 0 0 0 0 0 0 0 0 0 0 0 0 0 
0 0 0 783.944 0 2409.82 0.09 0 -1758.1 -1061.66 0 0 0 0 0 0 0 0 0 1414 0 0 -1731.7 0 0 0 0 2239.98 0 -28.0007 0 0 0 0 0 0 -978.347 0 -2098.83 -310.144 0 0 0 0 0 0 0 0 0 765.633 1734.6 1804.94 0 
1653.87 -2091.36 0 -183.95 0 0 0 0.01 -365.841 0 0 0 0 0 867.26 0 0 0 0 0 1619.08 0 0 0 113.3 0 0 0 2457.43 0 0 0 0 0 0 0 0 0 0 0 -480.132 -2213.89 0 0 1613.44 0 0 1391.57 0 0 0 0 0 
0 0 -1736.12 7.85852 0 0 -1632.51 -1243.4 0 2393.49 2378.08 0 -651.189 0 1603.82 -568.484 0 0 0 0 0 0 -24.1859 0 0 -1524.63 0 0 961.104 2002.55 0 -428.861 0 0 0 0 0 0 0 0 -1369.9 299.615 0 0 333.338 2033.98 0 0 0 0 0 0 0 
0 0 0 -2004.23 0 0 360.652 0 1154.29 0 0 2238 0 0 0 -1573.46 2054.43 1871.62 0 0 1021.53 0 0 0 0 2342.37 0 0 2273.71 1867.05 0 -358.516 0 0 0 -850.78 -1383.18 -1194.57 0 0 0 -825.755 0 0 -1676.31 0 1256.22 0 1741.16 0 0 0 0 
0 0 0 0 0 -926.466 0 0 -1793.65 0 0 0 -693.609 0 1433.38 0 0 0 0 604.495 1142.54 0 0 0 0 0 0 0 0 0 1874.68 0 -1301.54 1508.45 383.541 1549.5 0 289.85 0 0 -1334.04 0 0 0 0 1770.15 985.824 -1921.22 0 0 0 219.047 0 
-1361.35 0 0 362.789 0 0 0 0 0 677.892 0 0.09 0 0 0 0 0 0 425.81 0 0 0 -1060.44 0 0 0 0 0 -935.316 0 0 212.79 0 0 -1369.59 0 2441.4 0 0 0 0 0 0 0 0 0 0 0 0 0 1412.47 0 0 
0 0 732.673 1038.93 0 0 0 0 1282.92 0 1018.33 0 0.04 -421.995 0 0 -1551.48 1426.21 0 0 1612.22 0 0 0 0.534074 0 0 2095.32 0 0 0 -758.309 -2087.54 0 0 0 0 0 0 -1039.99 0 0 0 0 0 0 0 0 0 470.977 0 2152.55 0 
0 0 0 0 0 2360.68 0 0 0 0 0 0 -1481.9 0.07 0 2061.3 0 0 0 0 0 0 0 1277.28 0 0 0 0 0 0 0 0 411.161 0 -1039.08 865.581 2167.2 0 321.589 0 -1930.22 -2147.36 0 0 0 0 0 -2306.97 0 0 0 0 0 
0 0 1794.87 571.23 -38.9874 0 0 252.922 -991.928 0 1813.03 0 0 0 0.04 0 0 934.095 0 0 0 0 0 0 0 0 0 619.907 0 0 0 0 0 0 734.046 0 0 0 -2401.73 0 974.227 0 0 1467.1 0 0 0 0 0 2406.61 -1993.39 0 0 
0 0 -227.134 0 0 0 0 0 2064.65 1663.95 0 0 0 2342.98 0 0.07 0 1083.03 0 0 0 0 1896.5 0 0 0 0 0 -1674.17 0 0 734.657 -2126.45 0 0 0 0 0 0 0 0 2355.19 0 0 0 0 0 0 0 0 1565.83 0 0 
0 1180.07 0 2416.68 0 0 0 0 0 -1976.61 0 0 -266.808 0 0 0 0.01 0 2445.22 0 0 0 0 0 0 0 0 0 0 -871.838 1813.18 0 -2355.8 -1087.45 1829.36 0 0 -1596.8 0 0 0 0 0 0 0 1606.27 0 -2209.92 0 0 467.467 262.078 0 
0 0 0 0 0 0 0 0 0 -1996.44 0 0 2439.27 0 2394.56 -1195.33 0 0.05 0 0 0 0 0 0 0 0 538.575 0 1115.07 2243.64 0 0 0 1052.2 -1257.9 -1402.1 0 0 0 1527.83 -661.718 197.073 0 0 -359.432 -1856.97 0 0 0 2051.68 0 0 0 
0 -2429.35 0 0 0 0 0 0 0 0 0 -263.146 0 0 0 0 -1348.99 0 0.01 1591.62 0 0 0 -926.313 0 0 1068.68 0 -1564.3 0 0 0 0 0 0 375.301 0 0 0 612.583 0 -2364.35 0 2125.39 0 2479.4 -1949.14 0 0 1518.83 0 1635.72 1152.46 
-422.605 0 0 -536.134 60.8081 0 310.907 0 0 0 1141.32 0 0 0 0 0 0 0 784.86 0.05 0 263.756 -887.097 0 0 0 0 0 1225.24 1730.78 0 0 0 0 964.156 1738.26 0 0 0 0 0 -411.313 667.821 354.701 0 0 0 -2493.13 0 0 0 0 2365.57 
0 0 0 -1385.16 2002.85 0 0 147.938 0 1254.39 767.769 0 1806.92 0 0 0 0 0 0 0 0.04 -1561.25 -1254.54 0 2497.86 0 0 2339.47 0 0 0 1919.39 0 0 -637.761 0 1126.36 0 0 0 2269.59 0 0 1778.08 0 0 0 0 962.02 0 97.5829 0 0 
0 2148.27 0 192.038 742.134 2219.99 0 0 0 0 0 0 0 0 0 0 0 0 0 667.669 908.002 0.08 -1134.75 0 0 0 0 0 0 0 0 1632.97 -1693.85 0 0 1982.86 1394.77 0 0 1449.1 0 0 0 0 -2081.9 -1198.84 0 0 -825.144 1528.6 0 -1493.5 0 
0 1396.76 0 -2129.05 0 0 1497.16 0 1032.36 0 0 -992.691 0 0 0 -1128.96 0 0 0 577.029 2466.73 881.756 0.07 -1354.34 2415.01 0 2093.49 0 0 0 0 0 0 0 2459.11 0 0 0 297.327 0 2468.26 -2227.16 0 0 0 0 -631.809 0 0 0 -1398.59 0 -789.438 
0 0 0 0 0 0 0 0 0 0 0 0 0 2170.55 0 0 0 0 1842.48 0 0 0 2489.32 0.07 -1999.95 0 0 -365.688 0 0 2156.67 0 0 0 2148.12 0 -2162.47 0 1705.45 0 -636.998 1414 0 0 1666.23 0 0 0 0 0 22.66 0 0 
0 0 2212.67 -662.786 0 0 0 2046.49 0 0 0 0 1257.29 0 0 0 0 0 0 0 1398.74 0 1445.13 -2227.16 0 444.426 0 0 0 -102.008 -1913.59 1710.79 0 0 0 0 1153.37 0 0 2259.06 -266.35 0 0 0 0 -1726.66 0 0 0 0 -1721.78 0 0 
1243.25 0 0 2329.25 0 2013.38 0 0 -1941.66 1878.03 0 0 0 0 0 0 0 0 0 0 0 0 0 0 442.442 0.03 46.3118 0 0 0 -2046.49 1415.98 0 2394.56 0 841.777 0 -617.161 0 0 -791.574 2049.24 0 1909.62 0 0 0 -225.608 0 0 2354.27 0 -1831.34 
-2430.88 -252.159 0 -79.7296 -1736.73 718.177 0 0 0 0 0 0 0 0 0 0 0 -358.821 1782.36 0 0 0 2031.08 0 0 757.393 0.05 0 0 0 2119.59 -444.426 0 0 0 264.672 2478.48 0 0 0 0 0 0 0 -1300.47 0 0 389.492 0 0 0 0 2295.83 
0 0 0 0 0 0 503.937 0 0 0 0 0 1704.08 0 1450.01 0 0 0 0 0 -2337.18 0 0 694.678 0 0 0 0.04 0 0 0 0 2305.44 0 0 0 0 0 0 475.097 0 0 0 0 0 0 0 0 0 0 0 2493.59 1336.48 
1263.85 0 0 0 0 0 0 -118.336 488.372 567.721 0 -2116.69 0 0 0 -817.057 0 1872.23 -1235.01 1852.7 0 0 0 0 0 0 0 0 0.08 -58.5192 726.417 0 1636.78 0 0 0 -758.156 0 0 0 0 0 -1253.01 0 0 0 0 0 0 0 0 0 421.079 
0 0 -2347.41 0 1126.06 0 -261.773 0 2165.97 756.325 0 0 0 0 0 0 -1387.3 -1299.71 0 1220.82 0 0 0 0 1268.27 0 0 0 1324.58 0.08 2061.14 607.852 0 0 0 -1784.95 0 605.258 0 0 -679.113 0 0 0 1260.03 628.147 0 834.758 0 0 95.5992 2455.6 0 
-1564.15 0 -44.3281 0 0 538.118 0 0 0 0 -2372.28 0 0 0 0 0 2164.91 0 0 0 0 0 0 -2073.66 -1220.36 1711.71 186.239 0 2426.76 2413.33 0.02 0 -2316.43 672.704 0 0 0 1479.16 0 0 1542.33 -1844 0 0 605.869 1374.17 0 2477.42 2285.91 0 0 0 0 
0 2067.55 0 0 0 -1238.36 0 0 -1307.18 -680.334 0 -456.328 1122.24 0 0 1978.74 0 0 0 0 859.935 856.731 0 0 -1482.67 -191.733 2456.21 0 0 -69.0481 0 0.03 0 0 0 0 -2122.79 0 0 0 2492.22 -720.008 0 0 0 667.211 1395.99 0 0 0 1312.98 1761.15 0 
0 0 0 0 0 557.955 0 0 0 0 1932.51 0 -1496.09 707.648 0 2172.69 -1749.55 0 0 0 0 1229.67 0 0 0 0 0 673.772 -1422.85 0 1527.68 0 0.01 0 0 0 0 0 0 -259.331 398.495 0 0 0 0 0 2418.06 0 -21.5918 0 0 2088.92 0 
0 0 0 0 0 0 0 0 0 0 -338.984 0 0 0 0 0 -1230.12 -1489.07 0 0 0 0 0 0 0 1924.42 0 0 0 0 2102.34 0 0 0.03 0 -714.362 0 0 0 0 1869.33 0 0 0 -1050.98 0 2361.9 0 -1685.46 0 -1869.64 519.349 0 
0 0 0 -2058.4 0 1505.4 0 0 0 0 938.978 -671.789 0 2415.16 423.215 0 742.439 -926.466 0 -92.8526 -1824.47 0 573.824 2252.34 0 0 0 0 0 0 0 0 0 0 0.01 0 0 0 1660.59 1771.83 477.691 1167.26 147.633 977.432 0 0 0 0 0 -1208.15 1782.51 0 0 
0 -1902.14 0 0 0 0 0 0 0 1685.77 78.6615 0 0 -2216.48 0 0 0 1610.08 2445.07 -316.095 0 2446.75 0 0 0 1323.21 1091.42 0 0 69.9637 0 0 0 -425.962 0 0 0 2449.8 -432.829 0 722.144 0 -2372.43 -1216.24 0 0 0 0 0 0 0 0 0 
0 0 0 0 0 590.762 2068.93 0 0 -1727.12 0 445.799 0 113.758 0 0 0 0 0 0 -881.603 -549.867 0 2250.05 -518.738 0 1575.75 0 -637.455 0 0 1297.42 0 0 0 0 0.09 0 0 1761.45 2093.34 -451.75 1377.07 1887.19 0 0 0 0 0 -753.731 0 0 2403.41 
0 0 0 0 0 1149.86 0 0 0 -107.044 705.817 0 0 0 0 0 -215.079 0 0 0 0 0 0 0 0 1078.6 0 0 0 1168.48 399.106 0 0 0 0 2497.56 0 0.07 0 -1117.21 0 0 0 27.8481 0 -1369.14 0 0 0 -1184.5 0 0 0 
0 0 0 0 0 0 -821.482 0 0 0 0 0 0 2304.07 -523.164 0 0 0 0 0 0 0 -518.281 1580.78 0 0 0 0 0 0 0 0 0 0 961.715 -148.701 0 0 0.02 0 0 0 0 0 -800.882 0 0 0 0 0 0 0 60.9607 
1574.22 0 0 0 0 0 224.54 0 0 0 0 0 1011.15 0 0 0 0 -2276.76 2112.57 0 0 2231.44 0 0 1706.82 0 0 -945.54 0 0 0 0 2290.64 0 1221.88 0 -1762.98 2238 0 0.07 0 0 0 0 -1081.35 0 1541.26 1013.14 0 0 1318.48 0 0 
-1158.86 0 0 0 0 0 0 -2068.47 -1645.33 0 -1083.64 0 0 841.624 -1459.47 0 0 1395.38 0 0 -554.14 0 1204.18 -889.233 1858.35 705.512 0 0 0 1731.24 1186.03 -1196.25 -145.039 1451.08 1139.94 2322.08 1827.83 0 0 0 0.01 0 231.407 0 -874.889 0 758.766 33.4941 0 892.59 0 0 0 
-2120.81 0 0 1653.87 0 0 0 836.741 1760.69 1289.03 0 0 0 293.512 0 2077.32 0 -2287.9 690.71 280.541 0 0 1999.5 -1154.59 0 2039.48 0 0 0 0 -1061.97 1904.89 0 0 -2397.31 0 2036.88 0 0 0 0 0.02 0 0 2224.88 0 -1144.06 0 0 0 0 0 0 
0 0 0 0 221.183 0 0 0 0 0 0 0 0 0 0 0 0 0 0 -196.463 0 0 0 0 0 0 0 0 -1577.88 0 0 0 0 0 2429.65 -2441.86 2108.29 0 0 0 2012.92 0 0.02 0 1988.81 0 0 -334.712 -2021.01 0 0 0 0 
0 0 0 0 0 0 0 0 0 0 0 0 0 0 -1989.88 0 0 0 -694.678 2058.4 -1246.45 0 0 0 0 -751.137 0 0 0 0 0 0 0 0 -496.918 2047.26 2496.03 -240.257 0 0 0 0 0 0.02 974.99 0 405.362 0 0 0 366.909 0 1937.24 
0 0 0 0 0 0 0 469.909 2367.24 -1101.18 0 0 0 0 0 0 0 -1931.14 0 0 0 219.047 0 2126.76 0 0 2257.07 0 0 -945.845 -878.552 0 0 1623.36 0 0 0 0 672.399 802.408 1659.06 110.096 -649.663 -2198.02 0 0 673.009 1130.02 0 0 2148.73 0 0 
0 0 346.919 0 0 0 0 0 1357.08 0 -660.039 0 0 0 0 0 93.6155 1718.27 691.473 0 0 -2297.97 0 0 2046.49 0 0 0 0 1797.16 2039.17 1603.52 0 0 0 0 0 -855.51 0 0 0 0 0 0 0 0.06 0 0 0 0 0 -2020.1 0 
0 0 0 292.444 0 0 0 0 0 -1042.74 -196.921 0 0 0 0 0 0 0 1320.46 0 0 0 -1103.78 0 0 0 0 0 0 0 0 2350.46 961.715 -2410.73 0 0 0 0 0 990.555 -1541.57 1318.32 0 747.169 2182 0 0.06 0 0 690.405 0 0 0 
0 0 0 1875.59 0 0 0 -384.304 0 0 1851.63 0 0 223.624 0 0 218.589 0 0 870.617 0 0 0 0 0 -1166.65 1932.81 0 0 311.212 -1236.84 0 0 0 0 0 0 0 0 -2043.44 1378.6 0 954.085 0 -1466.19 0 0 0.01 0 0 2106.31 0 0 
0 0 0 1458.25 0 0 0 0 0 -1731.39 0 0 0 0 0 0 0 0 0 0 2217.7 -1806.62 0 0 0 0 0 0 0 0 2159.26 0 1657.54 812.937 0 0 0 0 0 0 0 0 -818.125 0 0 0 0 0 0.08 0 0 0 0 
0 0 0 602.359 0 0 455.412 0 0 0 0 0 1382.72 0 1518.83 0 0 2231.13 -706.732 0 0 -1380.73 0 0 0 0 0 0 0 0 0 0 0 0 -1585.97 0 -1753.82 1733.22 0 0 -65.6911 0 0 0 0 0 321.284 0 0 0.07 0 0 0 
1434.29 0 2308.95 0 -1708.2 0 -1181.45 0 0 0 0 -309.992 0 0 715.735 2306.05 522.553 0 0 0 1582.16 0 2125.08 2488.56 -1119.65 -1999.04 0 0 0 2219.23 0 1650.82 0 263.756 1162.98 0 0 0 0 -1518.68 0 0 0 2152.39 -1804.03 0 0 -92.0896 0 0 0.02 0 1124.53 
0 0 1749.85 0 0 0 80.6452 0 0 0 2060.08 0 1252.56 0 0 0 915.174 0 506.836 0 0 2120.35 0 0 0 0 0 1226.62 0 -1492.28 0 1314.97 1163.75 -792.489 0 0 0 0 0 0 0 0 0 0 0 2495.57 0 0 0 0 0 0.06 805.765 
663.549 0 0 0 2131.18 0 0 0 0 0 0 0 0 0 0 0 0 0 174.337 -1616.49 0 0 611.82 0 0 2210.23 -1709.57 -906.476 2454.53 0 0 0 0 0 0 0 -1012.22 0 -1180.68 0 0 0 0 2172.08 0 0 0 0 0 0 2275.08 -2219.08 0.09 
