*Vertices 60
*Matrix 
0 592.593 0 -2161.4 0 0 0 0 0 0 0 0 0 0 0 0 0 1302.15 0 -579.47 0 0 0 0 0 248.955 0 0 2226.25 0 0 2360.99 0 0 447.63 0 0 0 0 1546.45 0 0 0 0 0 0 2161.7 -1819.74 0 -2277.21 0 0 0 0 0 0 -84.3074 0 0 0 
-1971.57 0.06 0 0 0 1921.52 0 0 0 0 0 2163.99 0 0 0 0 0 0 -673.925 0 0 0 0 0 0 0 0 0 -1712.16 -312.586 0 1553.16 0 0 0 0 0 0 0 0 0 0 0 0 0 0 0 -817.057 0 0 0 0 0 2045.73 2359.46 -2344.05 655.309 0 0 0 
0 0 0.08 0 2331.69 0 0 -283.288 0 0 2091.51 0 0 -883.892 0 0 -2234.49 0 0 0 1862.32 0 0 -2295.07 0 1800.52 0 0 774.026 305.261 0 2126.61 0 0 1263.08 0 0 0 1016.5 0 0 0 0 1809.82 0 627.079 0 0 0 1884.59 -854.9 -1121.78 0 0 2224.88 0 0 0 -198.141 0 
843.455 0 0 0.01 0 0 0 0 805.002 0 1101.18 2085.56 0 0 -2295.98 0 0 0 0 2335.05 -755.104 0 0 0 0 0 1557.44 -699.103 0 -839.335 0 1262.93 0 -248.344 0 0 0 -975.6 0 0 0 0 -429.167 0 0 -637.913 0 0 0 0 0 0 0 0 0 0 0 -973.769 0 0 
0 0 -1921.67 0 0.07 0 0 0 766.701 2135.76 0 0 0 2462.77 0 0 0 1512.27 -109.027 0 0 -2046.49 -215.384 0 -256.279 0 0 0 0 0 0 0 0 -106.433 1125.6 0 0 0 0 0 1386.99 0 0 0 2052.9 -285.272 0 0 19.303 0 0 0 0 0 -1681.49 0 0 0 0 -705.054 
0 -1019.24 0 0 0 0.05 1417.36 0 0 0 0 -1237.45 0 -2490.08 0 -61.7237 -1745.43 0 0 115.589 0 -1228.14 0 0 0 0 2285.91 0 0 0 0 0 0 0 961.409 0 0 0 0 0 0 0 0 0 0 0 2130.27 0 0 1011.92 0 0 0 0 0 0 0 0 0 2357.94 
0 0 0 0 0 -943.861 0 1308.86 0 0 0 0 2070.3 0 0 0 0 0 0 0 1783.58 1523.1 0 0 0 2194.81 0 0 0 0 0 0 1061.51 0 340.663 0 0 -892.743 0 0 1069.9 222.861 0 0 0 0 1355.25 0 0 0 0 0 0 0 0 1418.12 -621.891 0 0 0 
0 0 -134.053 0 0 0 1967.6 0.02 -390.408 0 0 0 0 0 0 385.525 0 1513.18 275.201 0 0 -2403.87 0 181.204 258.415 1704.69 0 0 0 -1117.51 0 886.944 0 0 694.983 0 0 963.698 942.488 1072.19 2171.93 0 0 0 0 -193.716 0 0 0 0 589.846 0 732.215 0 0 0 1278.65 -955.153 0 0 
0 0 0 -594.882 421.384 0 0 435.881 0.05 0 0 0 0 935.926 0 0 0 2410.43 -1901.07 0 0 -650.426 2095.63 0 0 0 1354.34 0 0 0 0 0 0 1199 0 0 -747.017 0 1096 0 -2064.35 0 1513.49 0 0 966.292 0 0 0 0 0 0 1688.51 -1896.5 0 0 0 -1577.88 0 0 
0 0 0 0 1309.17 0 0 0 0 0.02 0 -363.094 0 0 0 0 58.0615 0 0 0 0 0 0 0 0 -950.728 -2131.79 0 2337.49 0 -2327.57 0 0 0 0 0 1940.9 1904.58 0 0 0 0 0 0 0 0 0 0 1316.19 -700.629 0 0 0 0 0 0 0 1726.66 0 0 
0 0 703.681 -1201.74 0 0 0 0 0 0 0.06 1892.22 0 0 0 0 -2201.22 -482.269 0 -67.0644 0 -1986.07 1442.53 1415.98 0 0 0 0 0 0 0 687.964 0 0 963.546 0 0 0 1325.34 0 -916.242 0 -1242.03 0 721.381 0 0 800.882 1771.83 0 0 0 0 -857.189 0 0 0 0 0 36.0881 
0 -1280.79 0 -1071.28 0 1465.88 0 0 0 -1058.92 -397.275 0.08 0 1964.55 0 0 2205.8 0 0 -995.438 1477.17 0 0 0 0 0 0 0 0 0 1441.16 0 0 0 716.346 0 0 0 0 0 0 0 0 0 0 0 0 0 0 -880.84 -1713.23 -549.257 131.153 0 0 0 0 752.968 0 0 
0 0 0 0 0 0 2392.42 0 0 0 0 0 0.01 1054.49 0 0 0 0 0 0 0 0 0 0 0 0 0 -2191.15 0 0 0 0 0 0 -44.1755 0 0 0 0 2496.34 0 -2208.09 0 0 0 2190.24 1172.9 0 -424.131 0 117.42 0 0 2272.03 901.44 0 0 -693.609 0 0 
0 0 -629.521 0 -2255.85 -31.9681 0 0 1641.06 0 0 -1585.36 773.721 0 0 0 0 -2472.84 0 0 1918.93 0 0 0 -1273.61 0 -2196.65 0 168.081 0 0 0 0 0 0 2278.89 0 0 1169.7 0 0 0 0 0 0 0 0 2034.75 0 0 0 0 235.984 0 2090.44 0 -541.627 0 0 0 
0 0 0 -2225.64 0 0 0 0 0 0 0 0 0 0 0.09 0 0 370.113 0 0 0 0 0 0 -1103.02 0 0 0 0 0 0 0 0 0 2420.35 0 0 0 0 0 0 1178.55 0 0 1130.33 0 0 0 0 2473.6 0 0 0 0 0 0 0 199.667 0 0 
0 0 0 0 0 2052.14 0 1944.56 0 0 0 0 0 0 0 0.03 -2016.74 0 0 0 0 0 0 547.121 0 0 0 0 0 1179.01 0 0 80.0348 0 0 0 0 756.63 622.959 0 0 0 0 0 0 0 0 1914.35 0 -1424.38 1483.28 0 -37.3089 0 160.451 -284.204 709.632 -1124.07 0 0 
0 0 2330.32 0 0 -1811.81 0 0 0 169.301 -2259.06 118.336 0 0 0 -1659.37 0.08 -530.793 1510.9 -72.4052 0 1838.66 0 0 0 2048.63 -488.83 0 0 0 0 0 0 520.112 -880.383 0 2183.52 0 0 0 0 -791.269 0 0 0 0 0 1375.85 0 0 2181.84 1583.22 -1771.83 -1269.65 0 0 0 2047.26 0 0 
901.898 0 0 0 678.655 0 0 1084.86 2021.01 0 742.897 0 0 -1460.54 853.679 0 1679.66 0.09 0 0 0 1592.99 0 0 -132.527 0 964.766 2050 0 0 0 0 2178.33 0 0 0 0 0 0 0 0 0 0 0 0 176.626 0 941.42 1021.53 0 2425.53 2373.35 0 0 0 0 0 573.214 1195.18 -102.161 
0 412.229 0 0 1394.47 0 0 1106.83 -368.435 0 0 0 0 0 0 0 2281.64 0 0.09 0 0 0 -480.438 0 0 0 1832.56 0 2014.45 0 0 0 0 0 0 0 -2052.29 0 0 0 -1026.87 0 1590.09 -16.5563 0 0 -1509.52 0 0 417.722 0 0 0 0 2321.31 0 0 0 0 0 
415.128 0 0 391.476 0 -1360.9 0 0 0 0 1983.47 1647.47 0 0 0 0 776.925 0 0 0.03 0 -2250.66 1444.21 0 0 0 0 2413.48 -1692.18 0 0 0 0 0 0 35.6304 0 0 -2108.29 0 0 0 0 0 0 1196.71 0 0 0 0 0 -1243.25 -258.721 -20.3711 358.058 0 0 0 1767.71 0 
0 0 982.009 -834.605 0 0 -543.916 0 0 0 0 2435.76 0 1533.48 0 0 0 0 0 0 0 1642.28 0 0 0 0 0 0 1828.75 1052.05 0 -778.451 0 0 0 0 1785.41 0 0 1189.54 0 0 -1654.48 0 0 0 0 0 0 0 1516.85 1656.62 0 2190.24 0 0 -886.334 2163.38 374.386 0 
0 0 0 0 -675.146 -1139.48 -1411.56 -524.079 199.362 0 1834.85 0 0 0 0 0 1978.59 2019.79 0 -2176.35 1274.99 0.04 1542.79 0 0 0 0 1381.95 1492.13 2388.45 0 0 0 555.971 0 0 0 0 -1708.66 0 0 0 0 0 0 0 2395.47 0 0 0 0 0 0 0 0 0 1065.17 0 0 -2118.67 
0 0 0 0 2200.46 0 0 0 -2158.04 0 -313.959 0 0 0 0 0 0 0 1191.52 -1516.39 0 16.5563 0.05 0 0 79.8822 -1682.56 0 237.205 0 0 2216.94 1629 0 895.795 -407.193 -314.875 2032.61 0 0 0 0 0 1689.12 0 0 0 1849.35 0 -930.28 -1664.71 0 0 0 1980.42 0 -1247.83 0 0 -1608.4 
0 0 2262.26 0 0 0 0 2255.09 0 0 -759.529 0 0 0 0 2169.33 0 0 0 0 0 0 0 0.02 1683.63 478.912 1376.31 0 0 0 0 0 0 -1670.05 0 0 0 0 0 0 0 -833.689 1057.24 -2260.12 0 0 0 0 855.205 0 0 315.027 0 0 -1906.26 0 -2231.89 748.238 1591.46 0 
0 0 0 0 -1193.5 0 0 2253.87 0 0 0 0 0 213.706 1940.14 0 0 2147.97 0 0 0 0 0 -1911.76 0.03 0 0 0 0 0 0 2417.14 0 -2073.35 0 0 0 0 -77.4407 0 0 -1289.79 1584.14 2180.32 0 0 0 0 0 0 0 -1881.24 0 -811.258 0 0 -90.4111 0 -633.641 0 
1907.79 0 1783.27 0 0 0 857.799 2108.14 0 1712.93 0 0 0 0 0 0 1180.07 0 0 0 0 0 -1802.5 -1566.9 0 0.01 0 0 0 -1964.25 -427.946 983.688 0 -518.891 2228.08 -2128.13 0 0 0 0 0 0 0 0 0 0 -263.146 0 0 0 1745.73 -1399.66 0 1580.17 0 0 0 0 0 0 
0 0 0 1752.6 0 1040.91 0 0 -1630.07 747.78 0 0 0 -2442.47 0 0 -2481.54 1085.92 828.654 0 0 0 1719.03 -758.919 0 0 0.04 0 0 0 2069.23 0 0 0 0 0 0 0 2022.39 0 -952.101 0 -1681.19 1051.59 0 0 0 0 -1492.58 -515.229 1700.87 0 0 0 0 -101.55 0 0 0 0 
0 0 0 2283.78 0 0 0 0 0 0 0 0 -825.144 0 0 0 0 -1847.51 0 -1931.44 0 301.752 0 0 0 0 0 0.06 0 0 0 0 0 0 2117.76 0 0 0 0 0 805.46 0 0 0 533.692 0 2004.68 0 -2159.72 0 792.795 1415.07 0 0 0 0 0 0 0 0 
667.516 2402.95 -183.645 0 0 0 0 0 0 1105.46 0 0 0 314.722 0 0 0 0 456.938 2420.35 392.392 -2236.01 2377.32 0 0 0 0 0 0.05 0 0 0 1713.84 0 0 0 0 0 0 -2375.18 0 0 0 0 0 1399.35 -1725.14 0 0 0 0 0 0 0 -327.693 0 0 0 1094.47 1321.07 
0 -978.042 476.928 -2245.02 0 0 0 -628.147 0 0 0 0 0 0 0 2351.68 0 0 0 0 151.296 -417.264 0 0 0 2222.59 0 0 0 0.04 0 0 0 0 0 0 0 220.725 1657.08 0 0 -1841.56 0 0 0 1985.92 0 0 0 0 -23.7281 0 0 757.851 0 0 0 0 0 -609.989 
0 0 0 0 0 0 0 0 0 1431.24 0 -1041.98 0 0 0 0 0 0 0 0 0 0 0 0 0 -1652.04 -2464.6 0 0 0 0.06 0 0 0 0 -992.538 0 0 0 2399.59 0 -2166.89 1621.07 0 1621.98 0 0 0 2420.04 1236.53 0 0 0 2056.72 0 0 1446.65 0 0 1054.19 
1159.32 783.792 -401.242 -1712.62 0 0 0 456.633 0 0 438.475 0 0 0 0 0 0 0 0 0 -2482.91 0 -2358.09 0 839.946 1649.45 0 0 0 0 0 0.06 0 1481.44 0 0 0 1644.41 0 0 0 0 1258.2 0 1718.12 -1361.51 784.555 -523.621 0 0 0 0 -1227.23 -51.0422 0 0 0 1373.1 0 0 
0 0 0 0 0 0 656.072 0 0 0 0 0 0 0 0 1219.75 0 1464.05 0 0 0 0 2233.27 0 0 0 0 0 1109.73 0 0 0 0.01 0 0 0 0 0 0 0 0 0 0 1537.45 1121.63 1539.43 0 -238.273 0 0 1427.88 0 0 0 0 0 -556.734 0 1204.03 0 
0 0 0 -1436.74 67.6748 0 0 0 -2176.66 0 0 0 0 0 0 0 -529.725 0 0 0 0 1830.58 0 -1392.48 -669.347 777.993 0 0 0 0 0 1279.56 0 0.09 0 -1044.72 2317.5 0 0 0 0 979.72 0 0 -1962.87 0 0 0 0 0 0 1876.35 0 0 0 0 0 0 0 0 
2007.28 0 2139.58 0 -399.564 -160.756 -143.666 -532.624 0 0 405.667 131.306 227.134 0 990.86 0 2300.1 0 0 0 0 0 -1393.55 0 0 103.534 0 373.775 0 0 0 0 0 0 0.08 -2453.61 1171.53 0 0 -1480.22 0 0 0 1975.69 0 0 0 0 1540.5 0 0 1467.56 0 1042.74 0 0 0 0 0 0 
0 0 0 0 0 0 0 0 0 0 0 0 0 1722.39 0 0 0 0 0 2057.48 0 0 2256 0 0 -2323.6 0 0 0 0 -1399.04 0 0 648.595 1310.08 0.07 0 0 0 1578.49 0 0 0 1418.73 -644.78 0 0 0 -1177.63 0 0 0 0 1271.78 0 0 0 0 0 2308.8 
0 0 0 0 0 0 0 0 1356.47 1760.08 0 0 0 0 0 0 -98.4985 0 2381.74 0 -2307.12 0 656.987 0 0 0 0 0 0 0 0 0 0 2027.88 1106.68 0 0.04 -1095.84 0 859.935 -1918.16 0 1829.05 0 0 0 2200.92 0 0 0 0 0 -1442.84 0 0 -654.698 0 0 0 302.667 
0 0 0 -850.627 0 0 694.678 1065.94 0 1776.71 0 0 0 0 0 -1995.68 0 0 0 0 0 0 444.273 0 0 0 0 0 0 1009.93 0 1349.45 0 0 0 0 -110.858 0.01 0 0 0 0 0 1885.05 0 0 0 2398.83 1935.71 0 0 -148.091 -2297.81 0 0 0 0 -114.368 0 0 
0 0 1883.07 0 0 0 0 -1909.31 -403.531 0 1778.54 0 0 1728.49 0 1660.89 0 0 0 1028.55 0 -390.713 0 0 760.903 0 -1225.85 0 0 680.792 0 0 0 0 0 0 0 0 0.01 -1025.19 0 0 -2263.94 1389.13 1274.83 0 0 0 0 1362.27 0 0 0 0 -1355.25 0 0 0 0 0 
1432.16 0 0 0 0 0 0 -160.146 0 0 0 0 349.361 0 0 0 0 0 0 0 735.725 0 0 0 0 0 0 0 -1789.83 0 -1433.38 0 0 0 1706.98 260.552 1813.64 0 274.285 0.03 0 0 -161.977 -1652.81 0 0 730.079 0 0 671.941 2091.36 0 -1396.15 74.6941 0 1939.68 0 0 147.176 853.526 
0 0 0 0 2202.9 0 1105.46 -1039.54 2261.35 0 368.892 0 0 0 0 0 0 0 932.875 0 0 0 0 0 0 0 1809.06 508.209 0 0 0 0 0 0 0 0 2215.41 0 0 0 0.01 0 0 0 0 965.529 0 0 -1440.09 -1971.11 0 0 0 0 0 0 -1956.77 0 0 0 
0 0 0 0 0 0 -1458.56 0 0 0 0 0 1227.53 0 -2148.58 0 -1049.15 0 0 0 0 0 0 681.097 -1840.8 0 0 0 0 -750.832 -1766.95 0 0 1770.15 0 0 0 0 0 0 0 0.09 0 1678.44 0 1041.83 1175.65 1592.68 0 397.732 0 0 875.805 0 -1164.05 1221.88 0 0 1936.93 99.7192 
0 0 0 -1137.96 0 0 0 0 931.501 0 -1376.16 0 0 0 0 0 0 0 2462.92 0 2259.51 0 0 -2032.15 -1881.08 0 -2327.88 0 0 0 -1808.6 -598.392 0 0 0 0 1337.09 0 2465.51 -773.873 0 0 0.03 1531.04 1193.81 0 0 0 874.584 0 0 0 0 0 0 505.31 0 148.244 0 0 
0 0 949.507 0 0 0 0 0 0 0 0 0 0 0 0 0 0 0 1959.97 0 0 0 -360.042 112.995 -2455.6 0 418.332 0 0 0 0 0 748.238 0 -898.083 1726.05 0 342.952 628.452 -670.263 0 1275.44 1705.91 0 0 2291.86 -1176.41 0 0 1360.13 0 0 0 0 0 0 0 0 0 0 
0 0 0 0 461.211 0 0 0 0 0 -2099.14 0 0 0 -880.993 0 0 0 0 0 0 0 0 0 0 0 0 -1383.48 0 0 61.1133 461.974 -102.924 937.3 0 1453.52 0 0 -743.812 0 0 0 523.621 0 0.08 385.525 0 -315.332 0 0 0 0 502.564 0 1910.38 0 0 0 0 2007.89 
0 0 2348.32 -954.848 1440.09 0 0 1101.34 1542.94 0 0 0 1231.5 0 0 0 0 998.794 0 -720.008 0 0 0 0 0 0 0 0 619.755 243.004 0 -110.248 -1907.79 0 0 0 0 0 0 0 -1576.51 667.974 0 2216.94 692.694 0 0 0 0 0 0 0 343.41 0 0 0 273.064 0 0 0 
-188.833 0 0 0 0 -593.356 210.654 0 0 0 0 0 425.352 0 0 0 0 0 1736.73 0 0 56.9933 0 0 0 -1511.2 0 2350.46 1800.52 0 0 -673.162 0 0 0 0 -66.6066 0 0 -1873.45 0 1355.56 0 1432.31 0 0 0.05 0 0 0 2409.51 0 0 0 0 1950.67 0 0 1205.56 0 
2418.97 516.755 0 0 0 0 0 0 0 0 1987.14 0 0 -2025.59 0 -1460.84 -1964.71 918.683 0 0 0 0 986.892 0 0 0 0 0 0 0 0 1698.13 -418.638 0 0 0 0 1306.42 0 0 0 -2486.42 0 0 2494.51 0 0 0.05 0 -1105 0 2281.79 -2482.15 -1723.15 0 0 0 0 0 431.761 
0 0 0 0 -29.8318 0 0 0 0 2145.07 197.226 0 -866.192 0 0 0 0 -2083.27 0 0 0 0 0 2243.34 0 0 714.82 1569.34 0 0 -328.15 0 0 0 1441.62 1383.79 0 -399.869 0 0 452.971 0 1205.56 0 0 0 0 0 0.02 0 0 0 0 0 1285.97 0 0 0 1620.3 0 
-1007.03 0 1532.72 0 0 684.149 0 0 0 -1779.31 0 1807.54 0 0 -509.43 2004.23 0 0 -2098.38 0 0 0 2451.63 0 0 0 293.664 0 0 0 1147.72 0 0 0 0 0 0 0 163.045 -1354.95 1442.84 1948.68 0 -747.017 0 0 0 640.66 0 0.07 0 0 0 0 0 0 0 0 0 0 
0 0 1134.91 0 0 0 0 1905.96 0 0 0 2072.89 1837.14 0 0 -2338.86 1367.15 -59.5874 0 0 -358.058 0 -1960.28 0 0 74.2363 1467.86 914.258 0 -812.021 0 0 1817.3 0 0 0 0 0 0 1171.07 0 0 0 0 0 0 -350.429 0 0 0 0 0 0 0 0 0 0 0 0 0 
0 0 1117.05 0 0 0 0 0 0 0 0 1456.27 0 0 0 0 -21.897 783.181 0 745.338 -2310.48 0 0 46.617 -821.635 630.741 0 -644.169 0 0 0 0 0 -1718.57 890.759 0 0 1466.8 0 0 0 0 0 0 0 0 0 852.153 0 0 0 0.06 0 0 0 0 0 0 0 0 
0 0 0 0 0 0 0 1887.8 -805.765 0 0 -1196.25 0 -1545.23 0 -256.89 1292.38 0 0 -2463.68 0 0 0 0 0 0 0 0 0 0 0 368.282 0 0 0 0 -2295.68 758.461 0 1493.35 0 1868.42 0 0 -1632.51 761.666 0 2451.63 0 0 0 0 0 0 0 0 1175.5 0 0 0 
0 2473.45 0 0 0 0 0 0 -865.581 0 1316.19 0 1169.85 0 0 0 -696.814 0 0 -1283.23 -426.878 0 0 0 -2443.85 -1036.64 0 0 0 1592.84 568.789 1257.74 0 0 -1718.42 -1237.91 0 0 0 2151.78 0 0 0 0 0 0 0 2224.11 0 0 0 0 0 0.03 1768.62 0 -398.648 2035.2 0 0 
0 -2122.64 1803.57 0 1124.07 0 0 0 0 0 0 0 -1115.07 -815.989 0 2469.63 0 0 -1935.71 2223.2 0 0 1235.92 900.372 0 0 0 0 2201.53 0 0 0 0 0 0 0 0 0 -1090.35 0 0 1937.09 0 0 772.805 0 0 0 -191.885 0 0 0 0 -1165.58 0.04 0 0 -381.252 0 0 
0 2445.83 0 0 0 0 -268.181 0 0 0 0 0 0 0 0 -2189.47 0 0 0 0 0 0 0 0 0 0 2094.87 0 0 0 0 0 0 0 0 0 2111.96 0 0 528.962 0 1560.34 -334.712 0 0 0 1237.45 0 0 0 0 0 0 0 0 0.04 0 0 0 0 
1539.12 975.6 0 0 0 0 -1373.71 2444.3 0 0 0 0 0 -91.4792 0 2216.18 0 0 0 0 1542.63 2073.2 -655.156 872.6 2069.38 0 0 0 0 0 -420.774 0 1584.75 0 0 0 0 0 0 0 -114.673 0 0 0 0 1070.21 0 0 0 0 0 0 1841.87 497.833 0 0 0.09 0 0 0 
0 0 0 -2455.6 0 0 0 2228.08 1835.92 -1803.87 0 2006.82 463.958 0 255.058 2053.51 2030.93 2293.24 0 0 -1172.9 0 0 2190.39 0 0 0 0 0 0 0 622.959 0 0 0 0 0 -1144.67 0 0 0 0 677.892 0 0 0 0 0 0 0 0 0 0 -557.497 94.8363 0 0 0.01 -1731.54 0 
0 0 -1401.79 0 0 0 0 0 0 0 0 0 0 0 0 0 0 421.079 0 2359.92 -745.643 0 0 646.153 2445.98 0 0 0 -1962.42 0 0 0 696.814 0 0 0 0 0 0 1098.9 0 1189.54 0 0 0 0 2174.37 0 -591.83 0 0 0 0 0 0 0 0 -1222.8 0.06 0 
0 0 0 0 -2351.68 993.149 0 0 0 0 2061.45 0 0 0 0 0 0 -1645.02 0 0 0 -1578.04 1554.99 0 0 0 0 0 -1519.29 -987.808 2471.77 0 0 0 0 -1943.49 2068.77 0 0 926.771 0 2480.16 0 0 42.9548 0 0 -817.362 0 0 0 0 0 0 0 0 0 0 0 0.09 
