*Vertices 51
*Matrix 
0.08 0 0 0 0 11.3681 0 2295.37 0 0 0 0 606.632 0 -287.713 -1227.23 -969.497 1291.62 0 0 -369.503 0 0 0 0 2010.48 0 0 1461 0 0 -344.172 -541.017 0 1769.54 0 0 0 0 0 0 0 -912.885 1019.85 606.479 0 0 0 -490.051 0 0 
0 0 297.632 0 0 0 -1252.56 0 -2365.57 0 0 91.174 0 0 1602.3 -603.122 0 0 -1224.94 0 0 -2463.07 0 0 0 932.569 1371.27 0 0 1522.49 0 0 962.63 0 0 0 0 0 1175.04 0 1505.86 0 0 0 0 0 -596.866 0 1731.7 0 0 
0 -1688.97 0.03 1781.14 0 0 0 0 0 -1992.78 0 1782.05 0 0 0 0 303.125 760.903 0 1783.88 0 0 0 0 0 0 0 1994.16 0 0 -151.906 0 0 0 0 0 0 1464.2 1590.4 0 -2131.79 2055.19 1698.43 0 0 0 767.006 0 0 0 0 
0 0 -1446.35 0.01 0 -154.195 0 0 1531.95 0 0 0 0 1368.37 0 0 0 0 0 0 0 0 0 0 0 0 0 2298.58 0 0 2047.56 -71.1844 221.793 1406.06 0 0 0 2445.83 0 0 0 0 0 1354.79 0 1050.07 0 0 0 0 0 
0 0 0 0 0.03 0 602.512 0 0 0 779.366 -1094.78 0 0 0 0 411.161 0 -17.777 0 0 -479.217 -564.364 0 0 663.549 0 2281.49 0 0 0 0 0 -178.457 0 -234.458 0 -1043.5 0 0 2259.21 -1459.93 0 -1034.96 0 0 0 -824.229 0 0 0 
691.626 0 0 521.18 0 0.04 0 -99.414 0 0 1359.37 0 0 0 888.47 0 -165.639 0 -441.069 0 -342.189 -72.2526 0 0 0 2497.41 0 0 -2281.33 0 0 0 0 6.79037 0 1371.73 0 0 0 -124.134 1753.21 0 0 0 1793.65 0 0 0 0 0 0 
0 -1316.95 0 0 1735.66 0 0.05 0 0 2368.01 0 -2063.28 2105.4 227.134 0 0 0 0 722.297 0 0 0 0 0 0 0 0 512.329 0 0 0 0 0 0 0 0 0 1982.56 -1534.39 0 0 0 0 0 -272.149 -790.353 0 0 0 0 0 
2135.15 0 0 0 0 -1962.11 0 0.03 1770.61 0 0 0 0 0 -1432.31 0 0 0 0 858.257 -1099.05 0 0 -602.664 -328.761 0 0 0 0 0 0 0 0 0 0 0 0 0 2029.71 -168.538 0 1169.85 69.0481 0 -1112.93 2322.38 0 0 0 1529.66 0 
0 608.921 0 2269.74 0 0 0 956.069 0 0 0 0 2107.84 0 0 -145.192 0 0 -1176.56 2455.9 -2363.28 0 -288.018 0 -1596.04 0 0 0 0 0 0 0 0 0 0 0 0 0 1534.09 0 -505.158 598.697 0 0 0 0 0 0 0 0 0 
0 0 1006.58 0 0 0 670.568 0 0 0.01 -945.082 0 -2176.81 0 479.064 1331.45 0 0 0 -1357.54 0 0 0 0 2325.28 1272.85 0 -1221.88 0 0 0 -1107.44 0 -2185.96 0 0 0 0 0 2297.51 0 -1703.92 0 0 2180.17 0 0 -132.069 0 0 0 
0 0 0 0 -593.509 1263.08 0 0 0 -658.818 0.09 0 264.214 0 0 -342.799 0 2377.47 611.667 -757.393 0 0 -2124.16 0 0 0 0 1290.7 0 0 0 0 0 0 0 0 2266.08 0 -133.747 0 0 0 1566.29 -331.812 2129.2 0 0 0 0 0 -1652.2 
0 1616.34 1043.5 0 -2214.96 0 -2156.67 0 0 0 0 0.07 0 0 0 0 298.09 0 0 0 0 0 0 0 0 1531.65 0 0 0 0 0 0 0 0 0 0 0 0 1698.74 57.1459 0 2044.51 0 -1668.98 358.058 0 0 0 0 0 0 
1074.33 0 0 0 0 0 -2421.41 0 -44.7859 1722.69 678.503 0 0.07 0 0 0 601.749 0 0 0 0 0 0 0 0 0 1637.24 0 0 0 0 0 0 0 -2440.18 0 0 2258.14 0 0 0 0 0 0 0 0 0 0 0 -1683.78 0 
0 0 0 -18.54 0 0 1887.8 0 0 0 0 0 0 0.05 -321.284 0 0 -1868.11 0 1114.76 0 0 740.303 2344.66 0 0 1736.73 0 2443.85 -2095.78 0 20.2185 0 0 0 0 0 0 0 846.355 2139.58 0 0 0 0 0 -539.644 0 0 0 0 
233.238 -610.752 0 0 0 422.758 0 1129.41 0 -2223.5 0 0 0 642.338 0.06 0 0 0 0 0 0 0 -2124.93 0 0 0 0 2204.28 2256.46 -833.842 0 -703.528 -1283.53 592.441 11.5207 0 0 0 0 0 -797.678 813.7 1889.48 0 0 1860.48 0 0 0 0 0 
364.772 1284.45 0 0 0 0 0 0 1637.85 -512.177 1495.79 0 0 0 0 0.01 0 0 308.466 -1681.95 1327.63 0 0 902.966 0 0 0 0 0 0 0 0 2322.53 0 0 0 0 0 0 0 0 -1698.13 0 0 1632.82 -653.63 -1189.08 0 0 0 0 
16.4037 0 592.288 0 -1012.99 -1465.73 0 0 0 0 0 332.728 -899.609 0 0 0 0.06 1887.04 677.74 0 332.881 0 0 0 0 0 0 0 -2369.23 2339.47 -284.051 0 434.202 2432.1 -210.654 0 0 0 0 460.295 0 -329.218 0 0 0 0 0 0 0 0 0 
116.81 0 -93.7681 0 0 0 0 0 0 0 1005.2 0 0 2051.84 0 0 2479.09 0.09 0 2354.73 1139.03 0 1422.54 1971.42 -1218.68 2342.37 -1268.58 -1045.34 0 0 0 0 0 -1859.11 0 0 0 0 481.353 0 -191.427 0 0 -1145.74 0 0 -580.691 0 0 0 0 
0 1988.81 0 0 899.762 1936.63 -2099.6 0 2484.44 0 -2146.9 0 0 0 0 1278.04 1672.8 0 0.03 0 0 0 0 0 0 0 0 0 0 -2454.99 0 183.95 0 0 -933.485 1916.18 0 1646.7 0 0 0 0 0 0 0 0 0 0 0 0 0 
0 0 2185.96 0 0 0 0 590.304 -942.793 -588.168 -2356.11 0 0 -330.287 0 915.479 0 1404.54 0 0.08 1375.55 0 0 1449.1 0 0 0 0 0 1185.87 0 437.559 0 0 0 0 0 0 0 0 0 0 0 0 0 -1882.15 0 0 0 0 0 
-837.046 0 0 0 0 376.37 0 1481.9 2420.8 0 0 0 0 0 0 -1355.86 -1980.12 1831.49 0 1772.74 0.06 0 0 0 2454.22 0 0 1084.4 0 0 0 0 94.2259 0 0 0 0 -935.163 0 2065.57 0 0 2389.98 -1042.13 0 0 0 0 0 696.356 0 
0 -926.008 0 0 1559.57 264.061 0 0 0 0 0 0 0 0 0 0 0 0 0 0 0 0.09 -2089.22 0 0 0 1525.7 0 0 0 0 2235.86 0 0 0 0 0 0 0 81.4081 2285.3 1538.82 0 0 0 1415.98 0 0 0 0 0 
0 0 0 0 958.357 0 0 0 -1153.22 0 -723.67 0 0 1409.27 608.768 0 0 425.962 0 0 0 2444.91 0.01 0 0 0 1224.63 -466.857 0 0 1488.01 0 -972.549 -807.901 0 0 933.638 0 -1115.99 0 850.627 0 0 -155.568 -2221.21 0 0 0 0 0 0 
0 0 0 0 0 0 0 609.226 0 0 0 0 0 2433.16 0 482.574 0 533.692 0 -352.87 0 0 0 0.01 0 0 0 0 -285.119 0 0 353.633 0 1661.96 0 -81.7133 0 0 2353.82 -1095.84 0 0 0 425.504 0 -2470.55 0 -1478.55 0 0 269.86 
0 0 0 0 0 0 0 294.427 759.377 2239.37 0 0 0 0 0 0 0 -1856.67 0 0 2363.73 0 0 0 0.09 0 0 0 -909.68 2021.77 2450.56 0 0 233.39 0 0 0 0 0 0 0 -1654.94 0 0 0 -490.509 0 0 810.648 0 0 
262.688 555.055 0 0 2395.02 -586.795 0 0 0 952.406 0 -1767.56 0 0 0 0 0 -723.06 0 0 0 0 0 0 0 0.09 0 535.676 0 0 0 2022.84 0 0 0 0 32.5785 148.854 0 2090.44 0 0 0 0 1547.06 0 0 0 0 0 731.147 
0 -468.535 0 0 0 0 0 0 0 0 0 0 2106.31 670.11 0 0 0 -1320.46 0 0 0 452.818 -124.134 0 0 0 0.03 0 0 0 2417.14 616.55 0 -2266.69 0 0 0 0 603.58 0 0 0 0 0 0 0 0 0 0 -13.5044 -1083.94 
0 0 -1568.12 -266.808 2207.48 0 930.28 0 0 -223.167 -202.567 0 0 0 596.713 0 0 -768.532 0 0 1795.79 0 -7.40074 0 0 -2317.19 0 0.01 0 -1086.08 0 0 410.092 0 0 0 1865.37 0 0 2391.96 2280.88 0 0 0 0 0 0 2412.72 0 0 0 
1033.28 0 0 0 0 -2416.38 0 0 0 0 0 0 0 1556.67 720.771 0 -2277.52 0 0 0 0 0 0 2165.06 1857.74 0 0 0 0.08 0 0 2475.13 0 -875.958 0 0 0 0 -1202.05 1999.95 0 0 134.968 0 0 0 0 0 0 0 0 
0 2094.56 0 0 0 0 0 0 0 0 0 0 0 1090.2 -2315.36 0 595.34 0 1688.82 -1553.77 0 0 0 0 1533.17 0 0 -158.925 0 0.05 0 2326.81 0 0 0 0 0 0 0 0 0 0 -2453.92 2129.81 0 0 0 871.99 0 -737.556 0 
0 0 -2387.08 2177.57 0 0 0 0 0 0 0 0 0 0 0 0 1105.46 0 0 0 0 0 -826.212 0 1558.35 0 -42.6496 0 0 0 0.08 -777.383 0 0 0 666.753 0 0 0 0 0 0 -5.41704 0 0 0 503.632 0 0 0 0 
735.267 0 0 1298.18 0 0 0 0 0 2015.98 0 0 0 641.575 -627.842 0 0 0 1088.37 -2042.38 0 1152.46 0 -1799.14 0 -1547.36 -2135.3 0 2483.67 -2348.63 -1402.25 0.06 169.607 0 0 -1784.65 0 0 0 1862.32 0 2471.62 0 0 0 1451.38 0 0 0 0 0 
1795.02 778.451 0 -2068.77 0 0 0 0 0 0 0 0 0 0 1303.37 -768.075 2043.44 0 0 0 935.011 0 496.765 0 0 0 0 829.722 0 0 0 1963.48 0.01 0 -91.3266 0 -1091.88 0 812.479 0 0 0 0 0 0 0 1468.63 0 0 0 0 
0 0 0 -470.824 757.393 1977.22 0 0 0 -102.466 0 0 0 0 32.5785 0 2115.47 -923.872 0 0 0 0 -573.367 1760.99 2086.63 0 2105.7 0 -648.595 0 0 0 0 0.04 0 0 0 0 0 208.365 0 -1504.64 0 0 0 0 0 0 0 0 0 
1299.55 0 0 0 0 0 0 0 0 0 0 0 -2383.88 0 501.19 0 -1706.67 0 2023 0 0 0 0 0 0 0 0 0 0 0 0 0 -2106.46 0 0.07 0 -994.064 0 2163.53 0 -1992.02 0 1659.67 0 1189.23 0 0 0 0 0 0 
0 0 0 0 1957.69 118.336 0 0 0 0 0 0 0 0 0 0 0 0 1890.7 0 0 0 0 1120.26 0 0 0 0 0 0 -952.712 1744.51 0 0 0 0.03 685.522 0 0 0 432.371 0 0 0 -736.793 0 0 0 0 -1473.2 0 
0 0 0 0 0 0 0 0 0 0 1000.93 0 0 0 0 0 0 0 0 0 0 0 77.4407 0 0 -2182.91 0 -2006.21 0 0 0 0 2453 0 1037.1 497.681 0.07 0 0 0 0 1688.36 1220.36 1027.33 0 0 0 0 0 0 0 
0 0 1318.93 473.876 -157.247 0 1141.77 0 0 0 0 0 -2311.7 0 0 0 0 0 2293.24 0 2386.62 0 0 0 0 931.501 0 0 0 0 0 0 0 0 0 0 0 0.08 2202.75 1551.94 0 465.636 29.5267 0 0 0 2212.21 0 0 0 0 
0 -2467.35 -255.821 0 0 0 1094.16 964.156 96.82 0 1975.69 1177.94 0 0 0 0 0 -2158.19 0 0 0 0 980.483 2177.27 0 0 -540.406 0 1067.61 0 0 0 -2187.34 0 -278.405 0 0 1002.3 0.06 0 1801.89 0 -27.3904 0 0 0 0 0 -1666.39 0 -596.408 
0 0 0 0 0 -449.309 0 2365.26 0 -803.934 0 203.482 0 1124.53 0 0 189.901 0 0 0 1382.26 717.566 0 -1674.93 0 -201.193 0 54.5518 2226.71 0 0 -1907.64 0 -800.272 0 0 0 -2017.96 0 0.04 1598.79 0 517.67 0 2227.77 0 847.423 0 0 0 1388.06 
0 2406.61 -1258.81 0 988.876 2287.29 0 0 1240.65 0 0 0 0 1708.66 1399.96 0 0 2180.32 0 0 0 -1782.36 -2140.64 0 0 0 0 2158.35 0 0 0 0 0 0 -1651.13 -1754.13 0 0 -1535.92 344.325 0.08 961.257 0 0 0 0 0 0 0 0 0 
0 0 -1509.06 0 157.399 0 0 1098.59 1951.73 -2168.26 0 1387.75 0 0 2059.31 761.208 1986.68 0 0 0 0 -1704.54 0 0 1837.44 0 0 0 0 0 0 2093.65 0 -800.119 0 0 -1016.5 -2213.74 0 0 -851.238 0.04 0 -511.719 0 0 0 0 0 0 0 
-893.201 0 872.448 0 0 0 0 -1412.78 0 0 120.777 0 0 0 1226.31 0 0 0 0 0 1710.94 0 0 0 0 0 0 0 -1343.65 -2317.04 901.135 0 0 0 526.521 0 -1745.12 -2206.87 560.701 2261.35 0 0 0 0 0 1255.61 0 0 0 1636.94 0 
1480.38 0 0 -803.018 -2447.66 0 0 0 0 0 -652.409 567.11 0 0 0 0 0 -124.897 0 0 868.328 0 1740.24 1581.09 0 0 0 0 0 2363.58 0 0 0 0 0 0 1684.39 0 0 0 0 -560.854 0 0.05 -977.126 0 -7.09555 -609.226 0 0 -2315.36 
1462.98 0 0 0 0 2323.3 1493.04 -393.612 0 1843.24 -651.799 2124.62 0 0 0 1948.07 0 0 0 0 0 0 1648.84 0 0 2011.09 0 0 0 0 0 0 0 0 439.848 -1679.51 0 0 0 1030.23 0 0 0 -269.25 0.07 0 0 0 0 -726.875 0 
0 0 0 -476.928 0 0 492.645 1875.44 0 0 0 0 0 0 -343.104 -1506.47 0 0 0 228.813 0 1377.68 0 2327.57 1036.03 0 0 0 0 0 0 1712.32 0 0 0 0 0 0 0 0 0 0 -337.611 0 0 0.01 0 0 0 0 0 
0 2131.03 -988.418 0 0 0 0 0 0 0 0 0 0 120.624 0 2271.11 0 1966.84 0 0 0 0 0 0 0 0 0 0 0 0 -1450.32 0 -1172.44 0 0 0 0 1882.31 0 1523.71 0 0 0 1867.96 0 0 0.03 0 -143.208 0 1209.83 
0 0 0 0 -406.888 0 0 0 0 -941.878 0 0 0 0 0 0 0 0 0 0 0 0 0 1303.22 0 0 0 1443.91 0 2389.68 0 0 0 0 0 0 0 0 0 0 0 0 0 -2375.18 0 0 0 0.05 -710.547 0 0 
1017.56 -1135.52 0 0 0 0 0 0 0 0 0 0 0 0 0 0 0 0 0 0 0 0 0 0 1607.33 0 0 0 0 0 0 0 0 0 0 0 0 0 1283.68 0 0 0 0 0 0 0 1343.81 1528.29 0.09 0 0 
0 0 0 0 0 0 0 -2247.46 0 0 0 0 -548.341 0 0 0 0 0 0 0 517.06 0 0 0 0 0 -1799.14 0 0 1125.14 0 0 0 0 0 1741.61 0 0 0 0 0 0 695.135 0 1648.84 0 0 0 0 0.03 0 
0 0 0 0 0 0 0 0 0 0 -203.94 0 0 0 0 0 0 0 0 0 0 0 0 -1031.14 0 -1258.05 2194.05 0 0 0 0 0 0 0 0 0 0 0 -248.955 -436.644 0 0 0 2144.61 0 0 -1254.54 0 0 0 0.08 
