*Vertices 48
*Matrix 
0.03 0 0 0 0 0 -1950.21 2272.64 0 341.121 0 0 0 0 723.67 0 0 0 0 -255.211 0 0 0 0 0 0 0 0 0 0 0 114.216 0 0 0 0 0 -275.811 0 0 0 0 0 0 0 0 0 0 
0 0.08 1593.45 748.085 0 -1222.95 0 0 0 0 0 -1118.27 0 0 0 0 0 0 0 0 1502.66 0 0 0 0 0 0 0 0 0 0 1429.11 0 0 0 0 0 0 0 0 0 0 0 0 0 0 0 0 
0 1966.54 0.01 1791.51 0 2492.52 0 0 -2480.93 1553.01 0 0 -1177.79 0 0 1217.15 1371.58 1251.03 0 0 0 0 39.14 -27.543 0 0 973.769 0 0 0 0 0 1569.49 0 0 0 0 0 0 0 0 0 0 0 0 -2360.38 0 0 
0 260.857 1510.44 0.02 0 1711.1 0 -1388.82 2138.51 0 0 0 0 745.186 0 -295.801 1885.2 0 0 0 1201.13 0 -668.889 0 0 925.55 0 0 0 0 0 0 0 0 0 0 0 0 0 0 0 0 0 0 0 -477.996 0 0 
0 0 0 0 0.06 135.121 0 -1777.32 -61.7237 0 0 1563.23 0 0 0 1805.86 516.907 0 0 0 0 0 0 806.833 0 0 0 0 0 0 0 886.792 0 0 0 0 0 0 0 0 -1733.99 0 0 1361.51 -579.47 0 0 0 
0 1416.44 -346.156 2387.69 -882.061 0 763.192 0 -1572.7 0 106.433 0 0 0 0 0 0 0 0 0 0 0 0 0 0 0 0 2063.89 0 0 0 0 0 0 0 0 0 0 -89.1903 0 0 0 0 0 0 0 0 0 
-1238.36 0 0 0 0 2224.72 0.08 0 0 0 0 2355.19 0 0 0 -1577.88 1156.27 0 2345.12 0 1908.55 1598.33 0 0 0 0 0 0 0 0 0 0 0 0 0 0 0 0 -153.89 0 115.741 1673.56 840.098 0 0 0 0 0 
1837.29 0 0 622.196 1059.53 0 0 0.04 2096.09 0 0 -466.247 0 0 0 0 0 0 802.713 787.759 1851.33 0 0 0 0 522.553 -1674.63 0 -1328.09 0 0 0 0 0 0 0 0 0 0 0 0 0 0 0 0 971.48 0 353.938 
0 0 1609.47 1713.84 277.184 812.326 0 1114.92 0.03 0 1815.47 0 0 0 0 0 1919.08 0 0 0 1692.33 0 0 0 0 594.882 0 0 0 0 0 0 0 0 0 0 0 0 0 0 0 0 -2210.99 0 0 0 0 0 
1532.56 0 -720.161 0 0 0 0 0 0 0 2487.79 0 0 0 0 0 0 -33.6467 0 1140.86 1671.58 0 0 0 -425.352 0 0 0 0 0 509.888 0 0 0 0 881.451 0 0 0 0 0 0 0 0 0 0 0 0 
0 0 0 0 0 1984.69 0 0 1604.59 1582 0.02 0 2069.23 -2412.26 1342.28 0 0 0 2013.08 0 0 0 0 0 0 0 0 0 0 0 0 0 0 0 0 0 0 0 2314.91 0 0 -1343.65 0 0 0 0 0 0 
0 -1362.58 0 0 2385.4 0 1718.42 1402.4 0 0 0 0.03 0 0 0 0 0 0 1908.4 717.566 879.009 0 0 0 0 0 0 0 0 0 -1602.91 0 0 0 0 0 0 -2164.75 0 0 0 0 0 0 0 0 0 0 
0 0 -409.329 0 0 0 0 0 0 0 2387.23 0 0 1635.72 -1439.33 260.247 0 0 0 0 0 0 0 0 0 0 0 0 0 0 0 0 0 0 0 0 1773.81 0 0 0 0 0 0 0 0 0 -2401.88 0 
0 0 0 1795.33 0 0 0 0 0 0 351.039 0 -351.65 0.05 1724.37 0 0 0 0 0 0 0 0 0 0 0 0 0 0 0 0 0 0 0 0 1688.97 0 -2094.1 0 0 -651.799 0 0 0 -1965.16 0 0 0 
-1208.15 0 0 0 0 0 0 0 0 0 1706.52 0 -1890.85 1094.62 0.06 0 0 0 0 0 0 0 0 0 0 0 0 0 0 698.34 0 0 0 0 0 0 0 0 0 0 0 107.959 0 0 0 0 0 0 
0 0 946.76 685.064 1881.54 0 -1065.63 0 0 0 0 0 741.981 0 0 0.02 944.319 -1550.87 0 670.263 -752.51 0 0 0 0 0 0 2185.35 0 0 0 0 0 0 0 0 0 0 0 -2064.81 0 0 0 0 0 0 0 0 
0 0 2020.86 259.484 445.494 0 1679.05 0 -1226.31 0 0 0 0 0 0 -419.095 0.02 0 0 1532.41 0 -1080.28 928.755 0 0 0 0 0 0 0 2187.03 0 0 0 0 0 0 0 0 -291.986 0 0 0 0 0 0 0 0 
0 0 1564.3 0 0 0 0 0 0 2082.81 0 0 0 0 0 1131.09 0 0 0 0 -80.0348 0 0 0 0 0 0 0 0 0 0 0 1878.64 0 0 0 2296.75 0 0 0 478.301 0 2277.83 0 0 0 0 0 
0 0 0 0 0 0 1672.95 1714.15 0 0 1996.29 815.683 0 0 0 0 0 0 0.05 721.229 0 0 0 0 0 0 0 0 2271.26 0 0 0 0 0 1529.97 0 0 0 0 0 0 0 0 0 -88.7326 0 0 0 
-1516.24 0 0 0 0 0 0 673.009 0 228.202 0 -115.436 0 0 0 1103.32 2348.63 0 -269.86 0.06 -1325.04 0 0 0 0 0 0 0 1544.77 0 0 0 0 0 0 0 0 0 0 0 0 0 0 0 0 0 0 0 
0 775.246 0 -28.3059 0 0 -1118.73 64.0126 975.6 -538.575 0 732.215 0 0 0 729.469 0 2179.86 0 2183.68 0 0 0 0 0 192.953 -1833.02 0 0 190.207 0 0 0 0 0 -2087.69 0 0 0 0 0 0 0 0 0 0 0 -11.9785 
0 0 0 0 0 0 2278.59 0 0 0 0 0 0 0 0 0 947.981 0 0 0 0 0.04 0 203.177 0 0 0 0 0 0 0 0 0 0 0 0 0 0 0 0 0 0 0 0 0 0 -1850.57 0 
0 0 1392.64 1440.7 0 0 0 0 0 0 0 0 0 0 0 0 96.3622 0 0 0 0 0 0.08 0 0 0 0 0 0 0 0 0 1562.93 0 0 0 0 0 0 0 0 0 2263.48 0 -587.252 0 0 0 
0 0 2389.98 0 -1535 0 0 0 0 0 0 0 0 0 0 0 0 0 0 0 0 1767.56 0 0.05 0 -2458.34 0 0 0 1927.47 0 0 0 0 -8.31629 0 64.1652 0 1800.52 0 0 2047.87 0 0 0 0 0 0 
0 0 0 0 0 0 0 0 0 1754.13 0 0 0 0 0 0 0 0 0 0 0 0 0 0 0 0 752.205 0 -2324.21 0 0 0 0 756.02 1951.58 0 0 0 0 45.3963 0 0 0 0 0 0 0 0 
0 0 0 -750.984 0 0 0 -1127.12 938.215 0 0 0 0 0 0 0 0 0 0 0 402.615 0 0 2498.63 0 0 0 0 0 0 0 0 0 0 0 1958.6 0 0 0 0 0 0 2079 0 0 0 0 0 
0 0 -453.581 0 0 0 0 -497.833 0 0 0 0 0 0 0 0 0 0 0 0 -89.6481 0 0 0 1746.8 0 0 0 0 0 0 0 0 0 0 0 0 0 0 0 0 0 0 0 1540.35 0 1109.42 0 
0 0 0 0 0 -1092.49 0 0 0 0 0 0 0 0 0 46.3118 0 0 0 0 0 0 0 0 0 0 0 0.06 0 0 0 0 0 0 2008.19 0 0 0 0 0 0 0 0 1195.94 0 0 0 0 
0 0 0 0 0 0 0 -881.451 0 0 0 0 0 0 0 0 0 0 2380.52 1378.14 0 0 0 0 2047.11 0 0 0 0.04 0 0 -1605.66 181.814 0 0 0 0 746.712 -289.85 0 1215.63 0 0 0 2389.22 -146.87 -1016.95 -895.947 
0 0 0 0 0 0 0 0 0 0 0 0 0 0 1371.88 0 0 0 0 0 1356.32 0 0 2306.21 0 0 0 0 0 0.03 0 -1245.69 0 -176.473 0 0 0 0 0 0 0 0 0 0 0 0 0 0 
0 0 0 0 0 0 0 0 0 -842.387 0 2237.69 0 0 0 0 -565.127 0 0 0 0 0 0 0 0 0 0 0 0 0 0.03 0 0 0 0 0 0 516.602 0 0 0 0 0 0 0 0 0 0 
649.51 1974.62 0 0 1420.56 0 0 0 0 0 0 0 0 0 0 0 0 0 0 0 0 0 0 0 0 0 0 0 2175.59 2212.67 0 0 0 0 0 2424.01 0 0 0 0 0 0 0 0 0 0 0 0 
0 0 1531.04 0 0 0 0 0 0 0 0 0 0 0 0 0 0 1664.4 0 0 0 0 -667.669 0 0 0 0 0 -894.574 0 0 0 0.03 0 0 0 0 0 0 0 0 0 0 0 0 0 -146.26 0 
0 0 0 0 0 0 0 0 0 0 0 0 0 0 0 0 0 0 0 0 0 0 0 0 -666.295 0 0 0 0 2269.13 0 0 0 0.04 0 0 0 0 0 0 0 366.298 0 -492.492 0 0 0 0 
0 0 0 0 0 0 0 0 0 0 0 0 0 0 0 0 0 0 1989.58 0 0 0 0 -286.798 414.67 0 0 -1864.6 0 0 0 0 0 0 0.05 75.1518 0 0 0 0 1838.51 0 0 -653.935 0 1647.31 0 0 
0 0 0 0 0 0 0 0 0 -430.387 0 0 0 1842.78 0 0 0 0 0 0 1191.82 0 0 0 0 -1999.5 0 0 0 0 0 1813.49 0 0 360.347 0 0 0 0 0 0 0 0 0 0 0 0 0 
0 0 0 0 0 0 0 0 0 0 0 0 2039.63 0 0 0 0 -968.734 0 0 0 0 0 2203.97 0 0 0 0 0 0 0 0 0 0 0 0 0.07 0 0 0 0 0 0 0 0 0 0 1331.6 
2449.95 0 0 0 0 0 0 0 0 0 0 -1631.75 0 -1556.52 0 0 0 0 0 0 0 0 0 0 0 0 0 0 1600.01 0 384.762 0 0 0 0 0 0 0.08 0 498.901 0 0 0 0 0 0 0 0 
0 0 0 0 0 -142.75 546.205 0 0 0 1656.47 0 0 0 0 0 0 0 0 0 0 0 0 130.085 0 0 0 0 1945.33 0 0 0 0 0 0 0 0 0 0.06 0 0 0 0 0 0 0 0 0 
0 0 0 0 0 0 0 0 0 0 0 0 0 0 0 -1.14444 2199.09 0 0 0 0 0 0 0 -533.235 0 0 0 0 0 0 0 0 0 0 0 0 944.319 0 0 0 0 -2172.08 0 0 0 0 1954.79 
0 0 0 0 -272.759 0 1826.76 0 0 0 0 0 0 2404.48 0 0 0 -1904.43 0 0 0 0 0 0 0 0 0 0 2081.9 0 0 0 0 0 158.62 0 0 0 0 0 0.03 0 0 750.221 0 0 0 0 
0 0 0 0 0 0 78.5089 0 0 0 714.667 0 0 0 1468.02 0 0 0 0 0 0 0 0 -335.017 0 0 0 0 0 0 0 0 0 -88.1222 0 0 0 0 0 0 0 0.01 0 0 0 0 0 0 
0 0 0 0 0 0 2041.31 0 -230.491 0 0 0 0 0 0 0 0 1546.45 0 0 0 0 695.898 0 0 1106.68 0 0 0 0 0 0 0 0 0 0 0 0 0 2487.95 0 0 0.04 0 0 0 0 0 
0 0 0 0 1779.61 0 0 0 0 0 0 0 0 0 0 0 0 0 0 0 0 0 0 0 0 0 0 1853.01 0 0 0 0 0 -57.2985 -952.406 0 0 0 0 0 1901.23 0 0 0 0 0 0 0 
0 0 0 0 -1656.77 0 0 0 0 0 0 0 0 1987.59 0 0 0 0 -924.177 0 0 0 2434.23 0 0 0 -604.648 0 1884.9 0 0 0 0 0 0 0 0 0 0 0 0 0 0 0 0.01 0 0 0 
0 0 2091.51 2298.58 0 0 0 -1115.99 0 0 0 0 0 0 0 0 0 0 0 0 0 0 0 0 0 0 0 0 -2497.56 0 0 0 0 0 2467.5 0 0 0 0 0 0 0 0 0 0 0.05 0 0 
0 0 0 0 0 0 0 0 0 0 0 0 -2353.97 0 0 0 0 0 0 0 0 1282.77 0 0 0 0 1005.97 0 2253.87 0 0 0 1173.67 0 0 0 0 0 0 0 0 0 0 0 0 0 0.09 0 
0 0 0 0 0 0 0 2088.92 0 0 0 0 0 0 0 0 0 0 0 0 -212.943 0 0 0 0 0 0 0 1266.59 0 0 0 0 0 0 0 1912.52 0 0 2442.47 0 0 0 0 0 0 0 0.03 
