*Vertices 72
*Matrix 
0.07 0 0 0 -558.26 0 0 0 0 0 0 0 0 -2194.97 0 0 0 0 1844.61 0 0 0 0 0 0 0 0 1958.3 0 0 -1633.88 0 0 0 0 276.727 1730.78 0 0 2176.05 1814.4 0 0 0 0 0 0 0 0 -2425.53 0 0 0 0 0 0 0 0 0 0 0 0 0 0 0 0 1511.66 0 0 0 0 0 
0 0.05 0 0 0 0 1793.65 -1545.69 0 0 846.812 0 0 0 0 0 -1952.35 0 2498.32 0 0 1531.5 -222.709 -567.11 2311.55 0 0 0 0 0 0 0 357.906 -1723.91 0 0 1623.81 1886.43 0 0 -1288.42 0 -556.276 1455.96 0 0 0 0 4.95926 0 0 0 0 0 0 0 0 0 0 -975.448 0 920.209 0 0 0 0 0 0 0 0 0 0 
0 0 0.06 0 0 0 0 -1299.86 0 555.208 1730.48 1856.06 0 2279.81 1789.68 0 2417.29 0 0 0 0 0 0 -2302.39 0 0 0 0 -43.5652 -1393.55 0 0 0 0 1032.06 0 0 0 1265.07 0 2404.63 0 -2417.91 0 0 0 0 0 0 0 0 0 0 0 0 0 0 0 0 0 0 0 2355.19 -956.221 1541.26 2323.45 0 0 1942.58 0 0 0 
0 0 0 0.07 0 1677.83 0 0 0 1656.32 -636.998 0 0 2252.19 0 752.663 0 -2268.82 0 0 0 0 -1558.5 0 0 0 1932.97 0 0 0 0 580.691 0 0 0 0 0 0 0 -51.6526 0 850.475 1256.52 0 2406.16 0 -1757.94 0 2110.43 0 0 0 0 0 933.18 0 0 0 0 0 0 0 -1170.16 2000.72 0 0 0 0 0 0 0 0 
1840.19 0 0 0 0.02 0 2102.34 -2134.39 0 0 0 496.46 0 0 1773.96 0 0 0 2441.25 0 0 0 0 2402.34 -1227.23 0 0 0 -2059.92 0 0 464.568 0 0 0 0 2453.76 0 1526.92 0 0 0 1688.21 0 0 1125.29 -682.012 -1347.62 0 0 0 0 0 1754.28 0 0 0 102.008 0 0 0 0 0 669.958 0 -1838.21 0 0 0 0 0 2023.61 
0 0 0 -559.938 0 0.03 0 0 0 0 0 0 0 0 0 0 0 0 0 532.167 0 0 1244.47 0 0 0 -1532.41 0 0 0 0 0 0 -353.023 0 2200.16 -1773.81 0 0 0 0 0 -868.328 0 0 0 2418.21 0 0 0 0 0 0 0 0 0 0 0 0 0 0 0 0 0 0 0 0 0 0 478.607 0 0 
0 1960.59 0 0 927.992 0 0.06 0 0 -1664.71 0 0 0 -103.992 0 -1757.18 2485.66 0 0 0 0 0 0 0 0 215.69 -1917.71 0 0 0 1317.56 70.8792 773.263 0 0 0 243.156 0 0 2469.94 0 0 698.34 0 910.443 0 -805.612 0 0 0 -1931.75 0 0 0 0 0 0 0 0 0 0 0 0 0 0 0 0 0 0 180.898 0 -941.42 
0 2172.54 -2249.44 0 -988.876 0 0 0.02 920.82 0 -2171.62 0 0 -2483.98 2033.07 0 -891.369 2010.33 0 0 0 0 1832.26 1367.46 0 -1432.77 0 0 2451.32 0 0 0 -448.088 0 0 -84.7652 0 0 0 186.544 2305.75 14.42 0 0 0 0 0 0 0 0 0 0 0 -1690.19 0 0 634.709 0 0 0 -697.272 0 2314.45 0 0 0 0 0 0 0 0 0 
0 0 0 0 0 0 0 1697.06 0.03 0 0 0 0 761.208 0 0 -1672.95 0 0 1085.77 0 0 0 0 -986.74 0 0 0 271.233 0 0 0 1753.52 0 0 0 0 0 0 0 0 69.3533 0 0 0 0 0 0 0 1440.7 0 0 0 0 0 0 0 0 0 0 0 0 -1508.76 0 0 0 438.322 0 0 0 -856.12 0 
0 0 612.735 1445.13 0 0 540.254 0 0 0.06 0 0 0 0 0 0 2053.51 0 0 0 0 0 0 0 0 0 0 0 -1173.06 0 0 0 0 0 0 0 0 0 0 0 0 -2210.53 0 0 0 0 0 0 0 0 0 0 0 0 0 0 0 0 0 1116.44 0 0 0 0 0 0 0 0 0 0 0 0 
0 186.544 2154.99 -1938.46 0 0 0 960.494 0 0 0.01 0 697.882 0 472.808 0 0 0 0 0 2269.28 0 0 0 0 0 0 0 0 0 1887.34 0 0 -975.295 0 2304.38 79.7296 0 0 0 0 0 2291.41 0 0 0 0 0 0 0 0 2156.21 0 0 0 -376.675 0 0 0 0 0 0 0 0 0 -1760.38 0 0 0 0 0 0 
0 0 1606.88 0 761.971 0 0 0 0 0 0 0.07 0 0 0 0 0 87.6644 0 0 1289.79 0 0 -351.802 -446.562 1110.95 0 0 0 0 1617.71 0 -1853.16 -1909.31 0 0 0 0 0 0 0 1638.77 823.618 1014.21 -1175.8 0 0 0 0 0 0 0 1440.86 261.162 0 0 2162.62 0 0 0 0 0 0 0 0 0 0 0 0 0 -1693.24 0 
0 0 0 0 0 0 0 0 0 0 -820.872 0 0 0 0 2341.15 0 0 0 0 0 0 0 0 0 0 1877.57 0 -1562.93 1708.5 0 0 0 0 -91.6318 0 0 0 0 734.657 0 0 0 0 0 1810.89 0 0 0 0 0 0 0 0 0 0 0 0 143.208 1039.38 0 0 1383.79 0 0 0 0 0 971.175 1328.39 780.74 0 
1277.12 0 2393.8 2373.65 0 0 209.586 1363.64 -882.061 0 0 0 0 0 0 0 1507.23 -1554.69 0 0 0 -433.744 0 0 -1464.81 2049.7 0 0 0 -2033.07 0 0 795.389 0 -2397.46 830.485 0 0 -1882.31 0 -1429.87 787.149 1937.09 0 -2456.21 0 1068.07 0 -684.759 0 0 0 0 0 225.761 0 0 0 0 0 0 0 0 0 0 0 0 678.655 0 0 0 0 
0 0 -1974.17 0 -1360.44 0 0 1950.36 0 0 -1134.3 0 0 0 0.01 0 0 0 0 0 0 0 1582 0 0 0 -21.2867 2343.13 -334.101 0 0 0 0 0 0 -1584.29 1672.03 1546.3 0 0 0 0 0 0 0 0 0 497.833 0 0 0 367.367 -1751.84 0 0 0 0 0 0 0 -1715.67 0 0 -608.005 0 1716.74 0 0 -2145.83 -562.532 0 0 
0 0 0 -1247.22 0 0 2406.16 0 0 0 0 0 -786.081 0 0 0.09 0 0 0 -115.589 0 0 0 0 2320.55 0 0 0 -2047.11 0 0 0 0 2274.93 0 0 0 924.482 0 0 0 0 0 0 0 2356.87 0 0 0 0 0 0 0 0 0 0 0 0 0 -2099.14 0 0 0 0 0 0 0 0 0 0 0 -153.127 
0 782.876 -1520.81 0 0 0 1407.9 2058.85 1641.97 985.214 0 0 0 -760.292 0 0 0.09 0 0 -339.442 0 0 0 0 0 0 0 0 0 0 1846.9 1392.94 -815.989 0 0 822.703 -1253.93 0 0 0 0 0 -2406.61 0 0 0 0 0 0 0 0 0 0 0 0 0 0 0 0 0 -1083.79 0 0 0 0 0 -1705.76 0 1920.15 0 0 0 
0 0 0 -370.113 0 0 0 -151.296 0 0 0 -1006.42 0 -2423.55 0 0 0 0.07 0 0 -806.986 2340.85 59.4348 0 0 0 2350.92 0 0 0 0 -1086.99 0 1416.44 0 0 0 0 0 0 0 0 0 628.452 0 0 0 2214.04 0 0 0 0 0 0 0 0 0 -1860.03 0 0 0 0 0 1439.18 0 0 0 0 0 0 0 0 
-768.532 656.529 0 0 380.49 0 0 0 0 0 0 0 0 0 0 0 0 0 0.07 0 0 0 0 0 1761.3 -997.269 0 0 0 0 0 0 0 -1786.94 1221.88 1875.9 0 0 2430.11 0 0 0 0 1619.54 0 0 0 0 0 0 0 0 0 0 0 0 2084.34 0 0 0 0 0 0 0 0 0 0 0 0 0 0 0 
0 0 0 0 0 -2367.7 0 0 -1160.39 0 0 0 0 0 0 1729.41 2208.4 0 0 0.04 0 0 1553.77 0 0 0 1561.1 931.501 531.251 -871.99 0 2464.14 0 -1971.27 0 0 599.765 0 0 0 0 -704.443 0 2155.29 0 75.1518 0 0 0 0 0 0 0 0 2122.94 0 0 0 0 0 0 0 0 0 0 0 0 0 0 0 0 0 
0 0 0 0 0 0 0 0 0 0 -292.291 1073.26 0 0 0 0 0 997.574 0 0 0.09 0 2077.62 -1795.48 0 0 -2024.52 0 1917.25 2043.44 1779.76 0 0 0 0 2328.49 0 0 0 0 1337.55 1098.59 0 0 0 -2230.83 0 0 0 0 0 0 0 0 0 192.19 0 0 0 0 0 0 0 0 0 0 0 0 0 0 0 0 
0 222.404 0 0 0 0 0 0 0 0 0 0 0 1526.76 0 0 0 99.1089 0 0 0 0 -1399.35 0 -506.226 0 0 0 0 747.78 0 1826 0 1892.38 0 0 0 0 0 0 0 0 0 0 0 0 0 0 0 0 0 0 0 0 0 -1857.74 0 0 1115.38 0 0 -1807.38 0 0 0 0 0 0 -301.599 0 0 2231.59 
0 -2295.37 0 1527.22 0 728.706 0 1406.52 0 0 0 0 0 0 -716.651 0 0 1891.46 0 811.411 2106.62 2077.32 0.07 0 0 0 0 0 0 0 0 0 0 0 0 0 2294.15 0 0 -110.401 -1068.99 258.873 -365.078 -902.203 0 0 0 0 -1174.43 0 0 0 0 0 0 0 0 0 -1032.98 0 0 0 -2359 0 0 0 0 -130.848 0 0 0 0 
0 -2149.65 1635.87 0 -306.33 0 0 1575.29 0 0 0 1770.61 0 0 0 0 0 0 0 0 1357.69 0 0 0.01 0 0 1902.6 0 0 0 0 0 -2278.89 0 2190.39 0 0 0 -223.472 1027.02 0 -1036.33 -932.417 0 1188.16 193.106 0 0 0 0 0 -1831.8 0 -2379.76 0 2195.43 0 0 0 0 1892.07 0 0 0 0 0 0 0 0 0 1911.91 0 
0 1373.87 0 0 2273.25 0 0 0 2448.27 0 0 1598.33 0 577.334 0 494.781 0 0 -978.957 0 0 1614.35 0 0 0.05 0 -1396.15 0 0 0 0 1090.04 0 0 0 0 0 524.689 0 0 160.909 -214.316 0 0 -1980.88 0 0 0 0 0 0 -644.78 0 -687.353 2146.44 0 0 0 0 0 0 -1012.53 0 0 0 0 0 0 0 0 0 0 
0 0 0 0 0 0 1381.34 2119.13 0 0 0 -1423 0 -1199.45 0 0 0 0 -951.033 0 0 0 0 0 0 0 0 0 0 0 2382.81 0 0 0 0 0 0 0 0 0 0 0 860.24 0 677.587 0 0 0 0 0 0 0 0 0 0 0 423.521 0 0 0 0 0 -1747.72 0 0 483.642 0 0 0 -911.054 0 0 
0 0 0 590.762 0 255.669 965.835 0 0 0 0 0 -1019.09 0 2434.69 0 0 -1714.91 0 1170 1240.04 0 0 4.95926 -110.553 0 0.06 -1508.15 -1628.7 0 1250.88 0 0 0 167.928 0 0 1944.72 517.518 0 0 0 0 0 -19.7607 0 0 0 0 0 0 1024.28 1766.79 0 0 -989.792 0 0 0 0 -26.6274 0 0 0 0 0 1323.97 1142.99 646.458 -1527.99 651.646 1033.89 
1335.11 0 0 0 0 0 0 0 0 0 0 0 0 0 1828.44 0 0 0 0 62.9444 0 0 0 0 0 0 17.4718 0.05 0 0 0 0 0 0 614.566 0 0 0 1638.16 0 0 0 0 0 0 374.538 0 0 0 0 0 0 0 0 687.048 0 0 0 0 0 0 0 0 0 0 0 0 -2294.46 0 0 0 -1682.41 
0 0 2389.98 0 -400.937 0 0 -1519.9 371.487 1067.77 0 0 2169.03 0 1034.04 890.606 0 0 0 -1623.97 2223.96 0 0 0 0 0 -1437.35 0 0.08 0 0 0 0 0 0 0 0 0 0 0 0 0 0 0 0 2306.67 0 0 0 0 0 0 0 0 0 0 0 0 0 0 0 0 0 0 0 0 0 0 0 0 0 1906.11 
0 0 1603.82 0 0 0 0 0 0 0 0 0 2091.97 -1643.8 0 0 0 0 0 2009.26 657.598 1135.21 0 0 0 0 0 0 0 0 0 0 1928.69 0 0 0 0 0 0 0 0 -25.8644 2219.08 0 0 0 0 0 0 0 0 0 0 0 0 0 0 0 0 0 0 0 0 0 -2265.77 0 0 0 0 0 0 0 
475.249 0 0 0 0 0 1424.99 0 0 0 2333.67 588.473 0 0 0 0 2214.65 0 0 0 -1295.13 0 0 0 0 1470.92 -2321.62 0 0 0 0.03 0 0 0 0 0 0 0 0 0 0 0 0 0 0 0 261.62 0 110.401 0 0 0 0 0 0 0 2100.51 0 0 0 0 0 -1006.27 0 0 0 0 0 0 0 0 -1359.22 
0 0 0 2064.65 -1241.11 0 -307.245 0 0 0 0 0 0 0 0 0 1870.86 -536.744 0 284.661 0 -1884.9 0 0 2022.54 0 0 0 0 0 0 0.01 1795.63 1886.12 -491.882 0 0 0 0 0 0 0 0 0 1978.29 0 0 0 0 0 0 0 0 0 0 0 0 0 -1686.99 0 -403.226 0 0 0 0 0 -1195.49 0 0 -1738.11 0 0 
0 496.918 0 0 0 0 358.364 -284.356 -577.639 0 0 35.9355 0 727.79 0 0 464.11 0 0 0 0 0 0 705.206 0 0 0 0 0 2238.46 0 -818.583 0 496.155 2438.81 -868.48 0 1887.04 2073.66 0 0 0 1518.22 1655.1 -1794.41 0 0 0 0 0 0 0 0 0 0 0 0 0 0 0 0 0 0 0 0 0 0 0 0 694.22 0 0 
0 1899.24 0 0 0 -446.257 0 0 0 0 -927.076 -699.866 0 0 0 1150.62 0 -1819.28 2276.91 -1310.08 0 -1852.7 0 0 0 0 0 0 0 0 0 -629.978 1523.71 0.07 0 0 0 -561.464 0 0 0 225.455 2439.12 0 -126.118 0 0 0 0 0 365.383 0 0 0 0 0 0 0 0 0 0 0 0 0 0 836.436 0 0 0 0 0 0 
0 0 -100.482 0 0 0 0 0 0 0 0 0 -189.901 -1289.18 0 0 0 0 -1887.34 0 0 0 0 2330.77 0 0 -172.353 645.695 0 0 0 187.918 770.516 0 0.04 0 0 0 -347.835 35.02 1908.09 0 1696.45 0 0 0 0 0 0 0 0 0 0 0 0 0 0 0 0 0 0 0 0 0 0 0 0 0 0 0 0 0 
2134.24 0 0 0 0 2069.23 0 1485.11 0 0 174.642 0 0 1491.82 2054.73 0 933.332 0 -1764.05 0 -1978.13 0 0 0 0 0 0 0 0 0 0 0 -363.857 0 0 0.08 0 0 0 0 -387.356 0 7.85852 0 0 1421.93 0 0 0 0 0 0 0 0 0 0 0 0 0 0 0 0 0 0 0 0 1397.37 2099.75 0 0 0 2161.09 
1077.07 1917.55 0 0 -1169.39 -1683.17 2379.3 0 0 0 2416.84 0 0 0 374.691 0 1156.27 0 0 -602.664 0 0 1119.8 0 0 0 0 0 0 0 0 0 0 0 0 0 0 0 0 0 1579.56 0 0 0 0 0 0 0 0 170.98 867.718 0 0 0 0 0 0 -1495.94 0 0 0 0 0 -2423.09 0 0 0 0 0 0 -701.544 0 
0 1307.03 0 0 0 0 0 0 0 0 0 0 0 0 -1449.86 2382.2 0 0 0 0 0 0 0 0 2294.92 0 1037.55 0 0 0 0 0 1083.03 -265.74 0 0 0 0.04 0 0 1085.77 0 0 0 0 2151.94 0 0 0 -1678.14 0 0 0 0 0 0 0 0 0 0 1855.6 0 0 0 0 0 0 -1403.01 0 0 0 0 
0 0 1506.32 0 275.048 0 0 0 0 0 0 0 0 932.875 0 0 0 0 2413.63 0 0 0 0 1628.24 0 0 1262.47 1917.25 0 0 0 0 -1125.6 0 -1557.74 0 0 0 0.06 0 0 0 0 0 1203.42 0 -1093.86 0 0 0 0 0 0 1893.9 0 0 0 0 0 0 0 0 0 1966.99 0 0 0 -344.935 0 0 0 0 
-2045.27 0 0 2296.29 0 0 1455.5 -415.281 0 0 0 0 -2392.57 0 0 0 0 0 0 0 0 0 2322.99 -2216.48 0 0 0 0 0 0 0 0 0 0 1353.57 0 0 0 0 0.04 2492.83 0 -1049.3 0 0 0 -1308.1 0 0 0 0 0 0 2088.92 0 0 0 0 0 0 0 0 0 0 0 0 -1632.36 0 0 0 0 0 
2274.47 -2122.18 1643.65 0 0 0 0 365.841 0 0 0 0 0 -1119.04 0 0 0 0 0 0 -235.374 0 1290.7 0 -1536.38 0 0 0 0 0 0 0 0 0 -645.085 -368.892 2184.44 -2370.6 0 2250.97 0.08 0 2306.51 0 -516.297 0 0 0 0 0 0 0 -325.098 501.801 0 0 0 447.325 0 0 0 0 1770.46 0 0 0 0 0 0 0 0 0 
0 0 0 1278.95 0 0 0 -1976.61 -1268.58 582.522 0 912.275 0 -366.146 0 0 0 0 0 -530.03 2435.76 0 -837.046 -341.121 1463.74 0 0 0 0 1818.52 0 0 0 380.49 0 0 0 0 0 0 0 0.05 1040.91 0 118.946 2424.47 0 -896.1 0 0 0 0 0 0 -692.083 0 0 0 1141.62 0 0 0 0 0 -386.135 172.658 0 0 0 0 1277.28 0 
0 1380.43 -566.347 133.9 2408.75 2468.11 -587.252 0 0 0 -581.454 822.245 0 -256.127 0 0 959.12 0 0 0 0 0 197.989 -2362.97 0 -517.975 0 0 0 1903.97 0 0 -692.999 2487.03 793.71 -941.115 0 0 0 2448.42 2114.4 -1292.99 0.04 1274.83 0 0 0 0 1173.97 0 0 0 0 0 0 0 0 0 0 0 0 0 0 0 0 0 73.4733 0 0 0 0 0 
0 1297.88 0 0 0 0 0 0 0 0 0 2006.21 0 0 0 0 0 2217.55 1922.13 766.854 0 0 -613.193 0 0 0 0 0 0 0 0 0 1437.35 0 0 0 0 0 0 0 0 0 166.402 0.09 0 0 0 0 -336.238 -1300.62 0 0 0 -1223.72 0 0 0 0 0 0 0 599.155 0 0 -510.346 0 0 -214.927 0 0 0 0 
0 0 0 1746.8 0 0 1009.78 0 0 0 0 -790.658 0 1497.62 0 0 0 0 0 0 0 0 0 -2416.99 1537.6 2350.46 -1726.81 0 0 0 0 2166.13 2130.88 999.557 0 0 0 0 -767.769 0 -656.377 -1848.73 0 0 0.05 0 0 0 2430.42 0 2492.98 0 -2096.24 2390.13 0 0 400.174 0 0 1187.86 0 2258.9 0 0 0 0 0 0 0 0 0 0 
0 0 0 0 -660.649 0 0 0 0 0 0 0 -1054.03 0 0 -1925.03 0 0 0 2317.8 2176.5 0 0 -1440.7 0 0 0 648.442 2488.4 0 0 0 0 0 0 -2453.92 0 -335.627 0 0 0 1779.15 0 0 0 0.07 514.008 0 0 0 0 0 0 0 0 0 0 0 0 0 0 0 0 0 0 0 0 0 0 0 -344.783 0 
0 0 0 -1290.4 1802.96 870.769 -689.642 0 0 0 0 0 0 606.326 0 0 0 0 0 0 0 0 0 0 0 0 0 0 0 0 2489.62 0 0 0 0 0 0 0 -34.4096 -1347.62 0 0 0 0 0 -704.443 0 0 0 0 0 0 0 0 0 0 0 0 0 0 0 604.648 0 -1284.14 0 0 0 0 0 0 0 0 
0 0 0 0 -540.864 0 0 0 0 0 0 0 0 0 1921.06 0 0 -291.833 0 0 0 0 0 0 0 0 0 0 0 0 0 0 0 0 0 0 0 0 0 0 0 1843.85 0 0 0 0 0 0.01 0 0 0 0 0 0 271.691 0 0 0 0 0 0 0 0 0 0 0 0 0 2363.73 0 0 0 
0 2274.32 0 -251.396 0 0 0 0 0 0 0 0 0 1462.98 0 0 0 0 0 0 0 0 365.993 0 0 0 0 0 0 0 409.787 0 0 0 0 0 0 0 0 0 0 0 2182.15 -351.497 1925.34 0 0 0 0 0 0 0 0 0 -901.44 0 0 0 0 0 0 0 -982.467 0 0 -28.9163 0 0 0 0 0 0 
2217.09 0 0 0 0 0 0 0 2469.63 0 0 0 0 0 0 0 0 0 0 0 0 0 0 0 0 0 0 0 0 0 0 0 0 0 0 0 1321.83 -999.863 0 0 0 0 0 -484.1 0 0 0 0 0 0.04 -894.879 0 0 0 0 0 0 0 0 0 0 0 -43.7178 0 0 0 0 0 0 0 0 -2321.16 
0 0 0 0 0 0 2058.85 0 0 0 0 0 0 0 0 0 0 0 0 0 0 0 0 0 0 0 0 0 0 0 0 0 0 -782.876 0 0 -365.23 0 0 0 0 0 0 0 -1040.3 0 0 0 0 956.832 0.08 0 0 0 0 0 0 0 0 0 0 0 0 0 0 0 0 0 0 0 0 -132.832 
0 0 0 0 0 0 0 0 0 0 1453.67 0 0 0 1477.02 0 0 0 0 0 0 0 0 -1045.79 -747.932 0 2346.49 0 0 0 0 0 0 0 0 0 0 0 0 0 0 0 0 0 0 0 0 0 0 0 0 0 0 0 0 0 1490.91 0 0 0 0 1862.93 0 0 -1681.34 0 -536.897 0 0 0 0 0 
0 0 0 0 0 0 0 0 0 0 0 644.017 0 0 2333.22 0 0 0 0 0 0 0 0 0 0 0 -479.827 0 0 0 0 0 0 0 0 0 0 0 0 0 1893.44 0 0 0 -914.258 0 0 0 0 0 0 0 0 0 0 0 -1399.96 0 0 0 0 0 0 760.903 1534.24 0 802.103 0 0 0 0 0 
0 0 0 0 723.518 0 0 -1966.38 0 0 0 900.983 0 0 0 0 0 0 0 0 0 0 0 1393.4 2206.41 0 0 0 0 0 0 0 0 0 0 0 0 0 -1718.73 122.761 2395.93 0 0 1698.28 -1692.02 0 0 0 0 0 0 0 0 0.08 0 0 0 0 0 0 0 0 0 0 0 1239.74 0 0 0 0 2461.85 0 
0 0 0 -2144.76 0 0 0 0 0 0 0 0 0 1628.39 0 0 0 0 0 1591.77 0 0 0 0 -2330.01 0 0 -351.039 0 0 0 0 0 0 0 0 0 0 0 0 0 1887.34 0 0 0 0 0 -1710.33 1594.97 0 0 0 0 0 0.04 0 0 0 0 0 0 0 0 0 72.8629 0 0 0 0 0 0 0 
0 0 0 0 0 0 0 0 0 0 2093.65 0 0 0 0 0 0 0 0 0 -772.652 -538.728 0 -470.824 0 0 -785.012 0 0 0 0 0 0 0 0 0 0 0 0 0 0 0 0 0 0 0 0 0 0 0 0 0 0 0 0 0.02 0 2193.44 0 0 0 0 0 0 0 1884.59 0 0 0 0 -1273.31 0 
0 0 0 0 0 0 0 932.264 0 0 0 2255.39 0 0 0 0 0 0 2142.02 0 0 0 0 0 0 -1911.6 0 0 0 0 2241.66 0 0 0 0 0 0 0 0 0 0 0 0 0 2022.69 0 0 0 0 0 0 -333.033 -1761.45 0 0 0 0.01 0 0 0 -535.676 0 0 1027.33 0 0 0 0 0 2153.61 0 0 
0 0 0 0 -2052.6 0 0 0 0 0 0 0 0 0 0 0 0 -1149.25 0 0 0 0 0 0 0 0 0 0 0 0 0 0 0 0 0 0 1815.01 0 0 0 2315.97 0 0 0 0 0 0 0 0 0 0 0 0 0 0 -1036.94 0 0.03 0 0 0 0 0 0 0 0 0 0 0 0 0 1216.7 
0 0 0 0 0 0 0 0 0 0 0 0 2118.82 0 0 0 0 0 0 0 0 337.611 -316.401 0 0 0 0 0 0 0 0 922.651 0 0 0 0 0 0 0 0 0 428.709 0 0 0 0 0 0 0 0 0 0 0 0 0 0 0 0 0.08 0 -541.475 0 0 1126.82 0 0 0 0 -115.894 0 1451.38 0 
0 2036.73 0 0 0 0 0 0 0 1479.31 0 0 -1736.27 0 0 1475.04 0 0 0 0 0 0 0 0 0 0 0 0 0 0 0 0 0 0 0 0 0 0 0 0 0 0 0 0 -1757.94 0 0 0 0 0 0 0 0 0 0 0 0 0 0 0 0 0 0 0 0 2363.43 0 0 0 0 0 0 
0 0 0 0 0 0 0 442.595 0 0 0 0 0 0 2464.9 0 1463.9 0 0 0 0 0 0 385.678 0 0 487.304 0 0 0 0 -1348.84 0 0 0 0 0 -2057.18 0 0 0 0 0 0 0 0 0 0 0 0 0 0 0 0 0 0 1345.03 0 -1830.88 0 0.05 0 0 0 0 0 0 0 0 0 0 0 
0 1796.24 0 0 0 0 0 0 0 0 0 0 0 0 0 0 0 0 0 0 0 1712.32 0 0 1777.78 0 0 0 0 0 0 0 0 0 0 0 0 0 0 0 0 0 0 1665.47 -799.661 0 1512.42 0 0 0 0 -18.0822 0 0 0 0 0 0 0 0 0 0.02 0 0 0 0 0 0 0 0 0 0 
0 0 686.895 1229.51 0 0 0 1551.48 95.9044 0 0 0 -1904.74 0 0 0 0 0 0 0 0 0 -1697.36 0 0 2108.6 0 0 0 0 300.836 0 0 0 0 0 0 0 0 0 1309.93 0 0 0 0 0 0 0 1020 1824.93 0 0 0 0 0 0 0 0 0 0 0 0 0 0 0 0 0 0 0 0 0 0 
0 0 -618.381 1938.61 1713.39 0 0 0 0 0 0 0 0 0 -2198.02 0 0 836.589 0 0 0 0 0 0 0 0 0 0 0 0 0 0 0 0 0 0 -2125.84 0 499.817 0 0 0 0 0 0 0 972.549 0 0 0 0 0 1362.58 0 0 0 -1.90741 0 555.513 0 0 0 0 0.05 0 0 252.922 0 0 0 0 0 
0 0 1485.26 0 0 0 0 0 0 0 0 0 0 0 0 0 0 0 0 0 0 0 0 0 0 0 0 0 0 2325.89 0 0 0 0 0 0 0 0 0 0 0 1765.88 0 -268.334 0 0 0 0 0 0 0 -1491.82 2334.28 0 -1644.72 0 0 0 0 0 0 0 0 0 0.08 0 0 0 0 0 0 0 
0 0 2254.17 0 2398.37 0 0 0 0 0 -208.518 0 0 0 464.263 0 0 0 0 0 0 0 0 0 0 1177.79 0 0 0 0 0 0 0 -2470.85 0 0 0 0 0 0 0 -282.678 0 0 0 0 0 0 1826.15 0 0 0 0 1046.1 0 -1842.94 0 0 0 2300.87 0 0 0 0 0 0.09 0 0 0 0 0 0 
761.971 0 0 0 0 0 0 0 -2495.73 0 0 0 0 0 0 0 1113.7 0 0 0 0 0 0 0 0 0 -64.4704 0 0 0 0 326.472 0 0 0 -1467.56 0 0 0 1161.92 0 0 2446.13 0 0 0 0 0 0 0 0 -1414.46 339.9 0 0 0 0 0 0 0 0 0 0 960.799 0 0 0.05 0 0 0 0 0 
0 0 0 0 0 0 0 0 0 0 0 0 0 -966.292 0 0 0 0 0 0 0 0 2321.47 0 0 0 1555.3 -2429.65 0 0 0 0 0 0 0 765.481 0 965.224 1370.36 0 0 0 0 2022.23 0 0 0 0 0 0 0 0 0 0 0 0 0 0 0 0 0 0 0 0 0 0 0 0.08 0 0 0 0 
0 0 289.239 0 0 0 0 0 0 0 0 0 -1358 0 -151.906 0 1979.35 0 0 0 0 -1865.21 0 0 0 0 946.455 0 0 0 0 0 0 0 0 0 0 0 0 0 0 0 0 0 0 0 0 -215.69 0 0 0 0 0 0 0 0 0 0 2042.53 0 0 0 0 0 0 0 0 0 0.04 0 0 0 
0 0 0 0 0 -1268.58 -21.4393 0 0 0 0 0 109.18 0 1360.29 0 0 0 0 0 0 0 0 0 0 -966.903 840.251 0 0 0 0 1006.27 -104.602 0 0 0 0 0 0 0 0 0 0 0 0 0 0 0 0 0 0 0 0 0 0 0 832.163 0 0 0 0 0 0 0 0 0 0 0 0 0.01 0 0 
0 0 0 0 0 0 0 0 -1315.12 0 0 -1617.25 2171.16 0 0 0 0 0 0 0 0 0 0 1180.23 0 0 1849.04 0 0 0 0 0 0 0 0 0 2128.13 0 0 0 0 -1640.29 0 0 0 1826.3 0 0 0 0 0 0 0 -320.978 0 -1545.84 0 0 1010.09 0 0 0 0 0 0 0 0 0 0 0 0.01 0 
0 0 0 0 -309.534 0 -1182.06 0 0 0 0 0 0 0 0 -1719.34 0 0 0 0 0 1781.9 0 0 0 0 965.987 1615.88 -1261.71 0 -2424.47 0 0 0 0 -321.284 0 0 0 0 0 0 0 0 0 0 0 0 0 341.578 639.134 0 0 0 0 0 0 2195.27 0 0 0 0 0 0 0 0 0 0 0 0 0 0.05 
