*Vertices 49
*Matrix 
0.07 0 0 -188.376 0 0 648.442 0 0 0 1941.97 0 0 0 -745.643 0 1477.48 1862.93 0 -2330.01 0 0 -2264.7 0 932.264 0 0 -423.063 0 0 0 0 0 0 0 -2015.82 0 0 0 0 0 0 0 0 0 0 0 0 0 
0 0.08 723.975 0 -1115.38 1861.25 0 0 0 0 0 -83.3918 0 0 0 -914.869 0 0 0 0 639.286 0 0 0 1807.99 0 -1695.53 0 1286.74 0 0 0 0 0 0 0 811.258 0 0 0 0 2175.13 0 0 0 0 0 -1599.86 2032.46 
0 -517.975 0.05 2426.3 0 0 -406.735 0 0 0 1226.46 0 0 0 0 -1555.6 0 0 -528.962 2265.31 0 0 -1054.64 0 -1055.86 873.058 0 0 0 0 0 2143.85 0 0 0 0 0 1984.54 -1794.87 0 0 0 0 0 0 0 0 0 -183.493 
-1983.32 0 1559.88 0 -986.435 1173.21 0 1691.26 0 0 1061.2 0 0 -2025.28 0 0 0 0 1930.98 0 0 0 0 0 0 -416.654 1640.9 0 0 0 0 0 0 -316.401 0 0 0 0 0 -1771.98 0 1014.97 0 0 0 2252.04 0 -718.94 0 
0 -1970.35 0 2473.14 0.07 -751.595 1026.11 0 0 0 0 0 -523.164 823.618 -507.141 0 0 0 671.941 0 0 0 0 1439.94 0 0 0 0 0 0 0 0 0 0 0 0 0 0 0 0 0 0 0 0 0 0 0 0 0 
0 2343.75 0 1955.85 -387.204 0.06 0 0 0 0 0 0 0 0 0 0 1502.35 836.131 0 -526.063 0 0 0 0 0 0 0 0 0 0 0 0 0 1092.79 0 0 0 0 0 0 0 0 -855.815 0 0 0 -1603.67 0 0 
903.424 0 -613.346 0 -89.3429 0 0.05 0 0 0 0 0 0 0 0 1370.05 1018.17 0 0 0 -22.0496 0 0 79.577 0 0 0 2224.11 0 0 0 0 0 0 0 0 0 0 0 0 -2284.69 0 0 0 0 0 0 0 0 
0 0 0 -578.707 0 0 0 0.09 0 0 -660.192 0 0 470.367 2427.52 0 0 0 2046.49 -1199.15 0 0 0 0 0 0 0 0 589.236 0 0 0 0 0 87.2066 0 1387.6 1832.41 0 0 0 0 0 504.395 0 0 0 0 0 
0 0 0 0 0 0 0 0 0 0 0 925.245 0 0 0 0 0 0 1209.68 0 0 0 1985 0 0 93.9207 0 0 0 0 0 0 1337.86 0 0 0 0 0 2269.59 0 0 0 0 0 850.78 0 0 0 0 
0 0 0 0 0 0 0 0 0 0.01 0 0 0 2123.25 0 0 0 1385.01 0 0 0 628.147 0 -159.23 278.558 1544.31 0 0 -2172.69 0 0 0 0 0 0 0 0 0 0 0 0 -1181.6 0 0 0 0 0 0 0 
1508.61 0 -2112.72 2202.44 0 0 0 -2456.05 0 0 0.05 417.112 0 0 0 0 1226.62 0 0 2371.06 0 0 0 0 0 0 -525.605 0 0 878.704 0 0 0 0 0 0 0 0 0 0 0 0 691.321 0 0 -465.941 0 0 0 
0 2111.96 0 0 0 0 0 0 -1561.56 0 732.978 0.09 925.703 0 1219.29 0 -1629.46 1796.85 0 0 0 0 0 0 961.257 0 0 0 0 0 -7.85852 0 0 879.925 0 0 -1470.92 -1551.03 0 0 0 0 0 0 0 0 0 0 0 
0 0 0 0 1848.43 0 0 0 0 0 0 1665.32 0.04 1571.93 0 2216.03 1282.62 0 -131.611 0 0 0 0 0 0 -2317.96 957.747 0 0 0 -2428.59 0 0 0 -362.331 0 0 0 0 0 0 0 0 0 0 0 0 0 0 
0 0 0 1279.72 -267.113 0 0 750.984 0 -428.861 0 0 1861.4 0.03 0 0 0 0 0 2358.09 0 1216.24 0 0 -2372.74 0 0 1601.38 0 0 0 0 0 0 0 -749.458 0 0 0 0 0 0 0 0 0 0 0 0 0 
2451.32 0 0 0 519.807 0 0 1448.18 0 0 0 -335.17 0 0 0.09 -1090.35 2215.41 0 0 0 0 0 0 0 0 1120.11 0 0 0 0 0 0 0 0 0 0 0 0 0 0 -2172.54 0 0 0 0 0 0 0 0 
0 1903.36 987.045 0 0 0 1315.88 0 0 0 0 0 -789.438 0 1334.65 0 0 0 0 2309.72 0 -729.316 0 0 0 -648.747 0 0 0 0 2061.3 0 1748.48 0 0 0 0 0 0 2059.92 0 0 832.621 0 0 0 0 0 0 
0.991852 0 0 0 0 2379.76 -1973.86 0 0 0 1601.08 1997.82 1885.97 0 1829.2 0 0.05 0 1330.68 0 691.015 -1905.96 0 0 0 0 2299.04 0 0 0 0 -1667.15 0 0 0 0 0 0 0 0 0 0 0 0 993.301 0 0 2382.2 -228.66 
-4.50148 0 0 0 0 -606.479 0 0 0 -261.01 0 -1658.15 0 0 0 0 0 0.05 1676.76 0 1836.68 0 2408.9 -552.004 1984.24 632.267 -470.824 0 0 0 0 -1195.64 877.789 0 0 0 0 0 -2080.68 -2297.05 0 0 78.0511 0 0 0 -175.1 0 0 
0 0 1873.15 -888.775 661.718 0 0 1757.64 2163.08 0 0 0 611.515 0 0 0 757.698 2284.08 0.05 0 0 0 0 0 0 0 0 95.9044 -1429.87 0 0 0 0 0 0 0 0 0 0 0 0 0 0 293.97 0 0 0 0 0 
1545.99 0 1217.61 0 0 1484.5 0 -882.672 0 0 -110.401 0 0 -508.972 0 -871.99 0 0 0 0.07 0 97.8881 0 0 1582.92 0 0 0 0 0 0 0 0 0 0 0 0 -2124.62 0 0 0 0 0 0 0 0 0 0 0 
0 -475.249 0 0 0 0 -222.251 0 0 0 0 0 0 0 0 0 -2096.09 1477.17 0 0 0.08 0 521.027 1292.69 0 0 1820.51 0 0 0 0 0 0 0 0 0 0 0 0 0 0 0 0 0 0 0 0 0 0 
0 0 0 0 0 0 0 0 0 -470.672 0 0 0 -1823.25 0 1134.75 1864.15 0 0 1058.15 0 0.01 0 0 592.746 0 0 1347.01 0 0 575.808 0 0 0 0 0 0 0 0 0 -2040.24 0 0 0 0 249.718 1213.03 563.906 -1046.25 
82.7815 0 260.247 0 0 0 0 0 2368.47 0 0 0 0 0 0 0 0 -636.387 0 0 -1214.26 0 0.05 0 0 145.039 0 2346.34 0 0 -2183.52 0 0 0 0 0 0 0 0 0 0 0 0 0 0 0 -2.36518 0 0 
0 0 0 0 344.172 0 181.661 0 0 909.833 0 0 0 0 0 0 0 2476.35 0 0 -10.4526 0 0 0.04 0 -2339.63 0 509.583 152.058 0 0 0 0 0 -155.263 0 0 0 2290.19 0 0 65.0807 0 0 0 0 0 0 0 
225.913 66.9118 1626.26 0 0 0 0 0 0 1293.6 0 -607.089 0 108.417 0 0 0 2259.06 0 749.763 0 901.288 0 0 0.02 0 -1536.07 0 0 0 0 0 0 0 0 0 0 0 0 0 75.9148 0 0 0 0 0 0 12.4363 2162.16 
0 0 1554.38 2196.49 0 0 0 0 -149.007 615.024 0 0 194.174 0 2238.91 -511.872 0 929.365 0 0 0 0 2096.24 -532.319 0 0.05 0 2140.34 0 -1929.61 0 0 0 0 0 0 0 801.798 0 0 0 0 0 0 0 0 0 -121.387 0 
0 -1385.16 0 2095.17 0 0 0 0 0 0 2232.51 0 -1157.34 0 0 0 -1511.05 1336.18 0 0 1488.31 0 0 0 1462.37 0 0.03 0 0 -2301.32 0 0 0 738.929 0 0 0 0 0 -41.5815 0 0 0 0 0 0 0 0 0 
977.737 0 0 0 0 0 -754.646 0 0 0 0 0 0 1008.1 0 0 0 0 1795.48 0 0 1831.03 -1577.88 1302.45 0 1515.17 0 0 0 -755.867 0 0 0 0 0 0 1126.51 0 0 -964.309 0 0 0 -44.4807 0 0 0 0 0 
0 1476.87 0 0 0 0 0 2344.97 0 -1238.67 0 0 0 0 0 0 0 0 1333.58 0 0 0 0 2195.58 0 0 0 0 0.07 0 -1896.65 0 0 0 0 0 0 0 0 0 0 0 0 0 0 0 0 0 0 
0 0 0 0 0 0 0 0 0 0 -1486.48 0 0 0 0 0 0 0 0 0 0 0 0 0 0 822.245 1730.02 1275.14 0 0.09 0 0 0 0 0 0 0 0 0 2356.41 0 0 -976.516 0 0 0 0 0 0 
0 0 0 0 0 0 0 0 0 0 0 519.501 2287.59 0 0 376.37 0 0 0 0 0 -462.737 138.325 0 0 0 0 0 -1159.47 0 0.08 0 0 0 0 0 0 0 0 0 0 0 0 0 0 0 0 0 0 
0 0 2360.68 0 0 0 0 0 0 0 0 0 0 0 0 0 1676 -389.492 0 0 0 0 0 0 0 0 0 0 0 0 0 0.06 0 0 0 0 0 0 0 0 0 0 0 0 0 0 0 0 0 
0 0 0 0 0 0 0 0 2004.38 0 0 0 0 0 0 -1796.85 0 -196.158 0 0 0 0 0 0 0 0 0 0 0 0 0 0 0 0 0 0 0 0 0 0 0 0 0 0 0 0 0 0 0 
0 0 0 1984.08 0 2315.06 0 0 0 0 0 1394.62 0 0 0 0 0 0 0 0 0 0 0 0 0 0 -1915.57 0 0 0 0 0 0 0.09 0 0 0 0 0 0 0 0 0 0 0 0 0 0 0 
0 0 0 0 0 0 0 722.907 0 0 0 0 1353.88 0 0 0 0 0 0 0 0 0 0 2113.18 0 0 0 0 0 0 0 0 0 0 0.07 1351.74 0 0 0 0 0 0 0 0 0 0 0 0 -341.426 
-726.417 0 0 0 0 0 0 0 0 0 0 0 0 -416.044 0 0 0 0 0 0 0 0 0 0 0 0 0 0 0 0 0 0 0 0 1534.24 0.07 0 0 0 0 1174.28 0 0 476.165 0 0 0 0 0 
0 1528.6 0 0 0 0 0 1953.41 0 0 0 1036.18 0 0 0 0 0 0 0 0 0 0 0 0 0 0 0 980.483 0 0 0 0 0 0 0 0 0.03 0 0 0 0 0 0 0 -2160.79 0 0 0 0 
0 0 -1208.3 0 0 0 0 -1572.54 0 0 0 2395.02 0 0 0 0 0 0 0 2198.17 0 0 0 0 0 1931.9 0 0 0 0 0 0 0 0 0 0 0 0.01 747.169 0 0 0 0 0 0 0 0 0 -519.807 
0 0 -2462 0 0 0 0 0 1815.62 0 0 0 0 0 0 0 0 1609.32 0 0 0 0 0 918.683 0 0 0 0 0 0 0 0 0 0 0 0 0 -1375.55 0.08 0 0 970.26 0 0 0 0 0 0 0 
0 0 0 244.987 0 0 0 0 0 0 0 0 0 0 0 2463.84 0 -221.793 0 0 0 0 0 0 0 0 -776.925 1715.37 0 -616.092 0 0 0 0 0 0 0 0 0 0 0 0 0 0 655.614 0 0 0 0 
0 0 0 0 0 0 776.467 0 0 0 0 0 0 0 1276.06 0 0 0 0 0 0 569.857 0 0 -755.867 0 0 0 0 0 0 0 0 0 0 -142.293 0 0 0 0 0.04 0 0 0 0 0 0 0 0 
0 1853.77 0 -1933.88 0 0 0 0 0 1381.34 0 0 0 0 0 0 0 0 0 0 0 0 0 1251.95 0 0 0 0 0 0 0 0 0 0 0 0 0 0 2363.12 0 0 0.05 0 0 0 0 0 0 0 
0 0 0 0 0 -793.558 0 0 0 0 1432.31 0 0 0 0 2002.55 0 -1844.92 0 0 0 0 0 0 0 0 0 0 0 1081.65 0 0 0 0 0 0 0 0 0 0 0 0 0.02 0 0 0 0 0 0 
0 0 0 0 0 0 0 1488.01 0 0 0 0 0 0 0 0 0 0 2025.44 0 0 0 0 0 0 0 0 -119.098 0 0 0 0 0 0 0 -1370.05 0 0 0 0 0 0 0 0.05 -1999.34 0 0 0 0 
0 0 0 0 0 0 0 0 -2414.85 0 0 0 0 0 0 0 -37.4615 0 0 0 0 0 0 0 0 0 0 0 0 0 0 0 0 0 0 0 1210.59 0 0 1190.91 0 0 0 1311.91 0 0 0 0 0 
0 0 0 1638.46 0 0 0 0 0 0 2441.4 0 0 0 0 0 0 0 0 0 0 -238.121 0 0 0 0 0 0 0 0 0 0 0 0 0 0 0 0 0 0 0 0 0 0 0 0.07 0 0 0 
0 0 0 0 0 857.341 0 0 0 0 0 0 0 0 0 0 0 1401.18 0 0 0 741.981 -2483.21 0 0 0 0 0 0 0 0 0 0 0 0 0 0 0 0 0 0 0 0 0 0 0 0.09 437.101 0 
0 953.169 0 -2327.42 0 0 0 0 0 0 0 0 0 0 0 0 2253.87 0 0 0 0 1051.13 0 0 -719.703 1434.29 0 0 0 0 0 0 0 0 0 0 0 0 0 0 0 0 0 0 0 0 -1723.76 0.03 0 
0 1370.36 2494.35 0 0 0 0 0 0 0 0 0 0 0 0 0 79.577 0 0 0 0 1278.19 0 0 -938.215 0 0 0 0 0 0 0 0 0 1860.64 0 0 -452.513 0 0 0 0 0 0 0 0 0 0 0.05 
