*Vertices 58
*Matrix 
0.07 1277.73 0 0 0 0 0 0 0 0 0 0 0 0 0 0 0 1494.57 0 0 0 0 0 0 -2157.58 0 0 0 0 0 2017.65 0 0 2137.59 0 0 -294.275 0 0 0 0 0 0 0 0 0 0 2158.65 0 0 -1728.49 0 0 0 0 0 0 0 
1614.2 0.06 0 0 0 -28.4585 0 -1353.57 0 -1576.66 -901.593 0 2049.39 0 0 0 0 0 0 0 1423.76 0 0 0 0 0 0 1235.62 0 0 0 0 0 0 0 0 0 0 0 0 0 0 0 0 0 0 -2136.07 0 0 0 0 0 0 0 0 0 0 0 
0 0 0.04 0 0 0 0 0 0 0 0 0 0 0 14.1148 -1081.96 0 0 0 0 0 0 0 862.224 -1360.44 0 0 0 0 0 0 0 0 0 0 0 0 1809.21 0 0 0 0 0 0 0 0 0 0 0 0 0 0 0 2399.9 0 0 0 0 
0 0 0 0.01 0 0 0 0 0 0 0 0 1894.06 -114.826 0 0 0 314.57 0 0 0 1356.47 0 0 0 0 0 0 0 0 0 0 0 0 931.501 0 0 0 0 0 0 0 417.57 0 0 0 0 0 978.042 0 0 0 0 0 0 0 0 0 
0 0 0 0 0.02 0 0 0 0 0 0 0 0 0 37.3089 0 0 0 0 0 0 0 0 1179.31 0 0 -1416.75 2138.51 -1456.11 0 2319.79 0 0 0 0 -185.324 0 0 0 0 0 0 -431.761 0 0 0 0 -2164.14 0 0 0 0 0 0 0 0 0 0 
0 1424.07 0 0 0 0.04 834.3 0 0 0 0 0 214.011 0 0 1819.59 0 0 0 0 0 0 0 0 0 0 0 0 0 0 -553.072 0 0 0 0 -1990.49 0 0 -195.09 0 367.367 0 0 2180.78 0 0 0 0 0 0 0 0 0 450.224 0 0 0 0 
0 0 0 0 0 1992.17 0.02 0 0 0 0 0 1405 0 -1045.64 0 0 1902.75 0 -399.869 0 0 0 0 0 0 0 0 0 0 1231.5 0 0 0 0 0 0 2411.65 0 0 0 0 0 0 0 -1548.59 -81.8659 0 0 0 0 0 244.224 0 0 0 0 0 
0 -678.045 0 0 0 0 0 0.03 0 0 0 0 0 0 2293.39 0 1318.48 0 0 2488.25 0 0 284.204 0 0 0 0 0 0 2294.76 0 0 0 0 0 0 644.322 0 0 0 0 0 0 0 0 0 0 0 0 0 0 0 0 0 0 0 0 0 
0 0 0 0 0 0 0 0 0 0 0 0 0 0 0 0 0 0 0 0 -1327.33 0 0 1303.67 0 0 0 0 0 998.642 0 0 0 0 0 0 0 0 0 0 0 0 0 0 0 0 0 0 0 0 0 0 0 0 0 0 0 0 
0 358.974 0 0 0 0 0 0 0 0.07 0 0 0 -2034.59 2309.56 0 1531.95 0 0 0 0 0 0 2221.52 0 0 0 0 1396.76 0 0 0 0 0 0 0 0 0 0 0 0 0 0 0 0 0 -333.796 1389.58 0 0 0 0 2018.88 0 0 0 0 0 
0 1381.04 0 0 0 0 0 0 0 0 0.03 0 1849.65 0 -2000.11 0 0 0 0 0 1995.22 0 0 0 0 0 0 0 0 0 -2309.56 234.153 0 0 0 0 0 0 0 0 0 0 0 0 0 0 0 0 0 0 0 0 0 0 0 0 0 0 
0 0 0 0 0 0 0 0 0 0 0 0.04 0 794.015 0 0 0 0 0 0 0 -480.743 0 0 -2375.18 0 0 0 0 502.869 0 1099.81 0 0 0 2360.99 -389.492 0 0 0 0 0 0 0 0 0 0 0 0 0 0 0 0 0 0 20.6763 0 0 
0 1026.87 0 112.537 0 371.029 954.39 0 0 0 1390.5 0 0.04 0 0 2202.29 0 0 0 0 0 0 0 0 0 0 0 0 893.353 0 0 0 0 0 0 0 0 0 0 0 0 0 0 0 532.624 0 0 0 0 1815.32 1332.97 0 0 0 0 0 0 0 
0 0 0 2210.68 0 0 0 0 0 46.1592 0 2104.48 0 0 0 0 0 0 0 0 0 0 0 0 0 -664.006 0 0 0 0 0 0 0 0 669.195 0 0 0 0 -239.189 0 0 0 0 0 0 0 0 0 0 0 0 0 429.167 0 0 0 0 
0 0 453.887 0 -731.605 0 -1321.53 615.482 0 466.399 -567.11 0 0 0 0.05 0 2191 0 -532.319 0 0 0 0 0 0 0 2306.36 0 0 0 595.035 0 0 0 0 0 0 0 0 0 0 0 0 0 0 0 0 0 0 0 0 1858.04 0 0 0 0 0 0 
0 0 1790.75 0 0 -1135.06 0 0 0 0 0 0 1881.08 0 0 0.03 0 0 0 0 0 0 0 0 0 0 0 0 2169.18 0 0 0 1746.04 0 0 0 1746.5 0 -1118.27 0 0 0 0 -1779.31 0 0 0 0 0 0 0 0 1571.78 0 0 0 0 1878.49 
0 0 0 0 0 0 0 2285.45 0 1316.8 0 0 0 0 604.343 0 0.07 0 0 0 0 -240.715 0 0 0 0 0 0 0 0 926.008 2386.17 0 0 1958.91 0 0 0 0 0 0 0 0 -151.296 959.731 0 1537.75 0 436.338 0 0 0 0 0 898.236 0 0 0 
-2460.02 0 0 1884.29 0 0 -74.5415 0 0 0 0 0 0 0 0 0 0 0.06 0 0 947.066 0 0 0 1931.59 0 0 -24.6437 0 0 0 0 0 0 1395.69 1633.88 0 0 0 0 0 1753.97 0 0 0 0 0 1563.84 0 0 0 0 0 0 0 0 0 0 
0 0 0 0 0 0 0 0 0 0 0 0 0 0 -2047.72 0 0 0 0.03 0 0 0 0 2472.53 0 0 0 0 0 0 0 0 0 0 0 0 0 0 0 0 0 0 0 0 291.681 0 0 0 -853.069 0 0 0 1129.57 0 0 0 0 0 
0 0 0 0 0 0 2233.73 -975.448 0 0 0 0 0 0 0 0 0 0 0 0.07 0 0 0 0 0 0 0 0 0 0 0 0 0 -2343.13 0 0 0 0 0 0 0 0 0 0 0 0 0 0 2130.27 0 616.55 0 0 0 0 0 0 0 
0 702.918 0 0 0 0 0 0 1216.85 0 2062.52 0 0 0 0 0 0 -543.764 0 0 0.01 0 0 16.4037 0 0 0 0 0 1782.66 0 0 0 0 0 0 0 0 0 0 0 0 0 0 0 0 0 0 0 0 0 0 0 0 0 0 0 0 
0 0 0 1438.41 0 0 0 0 0 0 0 275.506 0 0 0 0 -2213.28 0 0 0 0 0.01 0 0 0 0 0 0 0 123.218 0 0 0 0 0 0 2195.43 0 925.245 0 0 0 0 0 0 0 0 0 0 0 0 0 0 0 0 0 0 0 
0 0 0 0 0 0 0 -332.27 0 0 0 0 0 0 0 0 0 0 0 0 0 0 0.03 0 980.026 0 0 0 0 0 0 0 0 0 -318.384 0 0 0 0 0 0 281.61 0 0 0 0 0 0 0 0 0 0 0 0 0 0 0 0 
0 0 253.685 0 -905.713 0 0 0 1182.67 1451.84 0 0 0 0 0 0 0 0 2225.33 0 461.821 0 0 0.03 0 0 0 0 0 0 0 0 0 0 0 0 0 0 0 0 0 0 0 0 0 0 0 0 0 0 0 0 0 112.384 0 0 0 0 
-1016.5 0 944.319 0 0 0 0 0 0 0 0 1273.61 0 0 0 0 0 1384.4 0 0 0 0 -888.165 0 0.09 0 0 -2462.77 0 0 0 0 0 -705.054 0 0 0 -766.854 0 0 -87.054 0 0 0 1045.49 0 0 0 0 0 0 1315.58 0 0 0 0 0 0 
0 0 0 0 0 0 0 0 0 0 0 0 0 886.334 0 0 0 0 0 0 0 0 0 0 0 0.08 1115.99 0 0 0 0 0 0 0 0 2283.47 0 0 0 0 0 0 0 0 0 0 0 0 0 0 0 0 0 0 1896.8 0 0 0 
0 0 0 0 1044.88 0 0 0 0 0 0 0 0 0 1517.3 0 0 0 0 0 0 0 0 0 0 1802.8 0.04 0 0 -1325.95 0 0 0 0 0 1665.93 0 0 0 0 0 0 0 0 -2319.18 0 0 -985.672 2187.95 0 0 0 0 0 0 0 0 0 
0 1390.65 0 0 830.638 0 0 0 0 0 0 0 0 0 0 0 0 819.956 0 0 0 0 0 0 -821.787 0 0 0.06 0 0 0 0 0 0 0 0 0 0 0 0 0 0 0 0 -1900.46 0 0 0 0 -2369.08 0 0 0 1887.04 0 0 0 0 
0 0 0 0 -155.11 0 0 0 0 78.814 0 0 1501.89 0 0 2395.17 0 0 0 0 0 0 0 0 0 0 0 0 0.02 2153.61 0 0 0 -473.113 0 0 0 0 0 0 0 0 -2239.98 0 0 0 0 0 0 0 0 1678.29 0 0 0 0 0 0 
0 0 0 0 0 0 0 -2279.96 995.285 0 0 1147.42 0 0 0 0 0 0 0 0 702.307 1408.51 0 0 0 0 2401.12 0 2083.88 0.05 0 0 0 -573.061 0 0 0 0 0 0 2412.72 0 -520.264 0 0 0 0 0 0 1865.21 0 0 0 0 0 0 0 0 
-364.315 0 0 0 -83.0866 1174.89 -1978.9 0 0 0 -359.737 0 0 0 1985.61 0 1370.05 0 0 0 0 0 0 0 0 0 0 0 0 0 0.02 -857.646 0 0 0 0 0 1816.23 1098.9 0 0 0 0 0 0 0 0 0 0 0 0 0 0 0 0 2131.03 0 0 
0 0 0 0 0 0 0 0 0 0 1115.22 291.833 0 0 0 0 -524.842 0 0 0 0 0 0 0 0 0 0 0 0 0 2381.59 0.06 0 0 0 0 0 0 0 725.806 2263.94 1133.53 0 0 0 0 2150.41 0 0 0 0 0 -1942.73 0 0 0 0 0 
0 0 0 0 0 0 0 0 0 0 0 0 0 0 0 555.513 0 0 0 0 0 0 0 0 0 0 0 0 0 0 0 0 0.02 1958.14 312.891 0 271.233 280.847 0 0 0 0 0 0 0 0 0 0 0 0 0 0 -190.512 0 0 0 0 0 
554.903 0 0 0 0 0 0 0 0 0 0 0 0 0 0 0 0 0 0 313.044 0 0 0 0 -538.27 0 0 0 1052.35 -2057.63 0 0 143.513 0 0 931.196 0 -743.965 0 0 0 2111.96 0 0 0 1540.65 0 0 1748.79 0 0 0 -1748.79 0 0 0 0 0 
0 0 0 1587.19 0 0 0 0 0 0 0 0 0 -205.924 0 0 -659.429 2476.65 0 0 0 0 776.772 0 0 0 0 0 0 0 0 0 1898.18 0 0.01 0 0 0 -1146.96 0 0 0 1985.92 0 0 -1228.9 0 0 0 0 750.832 0 0 1884.29 0 0 0 0 
0 0 0 0 2356.72 1936.63 0 0 0 0 0 1045.64 0 0 0 0 0 -1557.89 0 0 0 0 0 0 0 1565.83 -935.469 0 0 0 0 0 0 -82.6289 0 0.03 0 0 0 0 2252.34 0 0 0 0 0 0 0 0 0 0 0 0 0 0 0 0 0 
969.344 0 0 0 0 0 0 815.531 0 0 0 696.814 0 0 0 -314.417 0 0 0 0 0 -308.008 0 0 0 0 0 0 0 0 0 0 2177.72 0 0 0 0.04 0 0 0 0 0 0 -49.9741 0 0 0 2063.89 0 0 0 0 0 0 0 839.03 0 0 
0 0 365.23 0 0 0 1966.69 0 0 0 0 0 0 0 0 0 0 0 0 0 0 0 0 0 -253.533 0 0 0 0 0 2457.88 0 -1116.44 -1662.57 0 0 0 0.09 0 0 0 0 0 0 0 0 0 0 0 0 0 0 -948.134 0 2098.22 0 0 0 
0 0 0 0 0 1869.33 0 0 0 0 0 0 0 0 0 1980.57 0 0 0 0 0 -2032.15 0 0 0 0 0 0 0 0 -1948.38 0 0 0 2016.43 0 0 0 0.09 0 -478.301 0 0 0 -1842.78 0 0 0 0 0 0 0 0 0 0 0 0 0 
0 0 0 0 0 0 0 0 0 0 0 0 0 1946.55 0 0 0 0 0 0 0 0 0 0 0 0 0 0 0 0 0 -277.49 0 0 0 0 0 0 0 0.03 0 0 0 0 0 0 0 0 0 0 0 0 0 0 0 0 0 0 
0 0 0 0 0 2445.83 0 0 0 0 0 0 0 0 0 0 0 0 0 0 0 0 0 0 -2182.3 0 0 0 0 -425.657 0 1143.3 0 0 0 709.174 0 0 -426.42 0 0.08 0 0 0 0 0 0 0 0 0 883.129 0 0 0 0 0 0 0 
0 0 0 0 0 0 0 0 0 0 0 0 0 0 0 0 0 -605.258 0 0 0 0 1254.54 0 0 0 0 0 0 0 0 1263.08 0 1618.02 0 0 0 0 0 0 0 0.06 0 -853.832 0 0 0 -334.559 -648.137 0 0 0 0 0 0 0 0 0 
0 0 0 -298.395 1259.73 0 0 0 0 0 0 0 0 0 0 0 0 0 0 0 0 0 0 0 0 0 0 0 -1032.06 1333.28 0 0 0 0 1221.73 0 0 0 0 0 0 0 0.08 -2263.94 0 0 0 1642.43 0 0 0 0 0 0 0 0 0 0 
0 0 0 0 0 -711.768 0 0 0 0 0 0 0 0 0 1464.2 -280.694 0 0 0 0 0 0 0 0 0 0 0 0 0 0 0 0 0 0 0 1756.57 0 0 0 0 1408.81 -1620.46 0.01 0 0 0 0 0 0 0 0 0 0 0 0 0 0 
0 0 0 0 0 0 0 0 0 0 0 0 -2093.49 0 0 0 -578.707 0 198.752 0 0 0 0 0 -729.774 0 845.439 1960.28 0 0 0 0 0 0 0 0 0 0 2107.23 0 0 0 0 0 0.09 0 0 0 0 0 0 0 0 0 0 0 0 0 
0 0 0 0 0 0 1564.15 0 0 0 0 0 0 0 0 0 0 0 0 0 0 0 0 0 0 0 0 0 0 0 0 0 0 -1321.38 632.878 0 0 0 0 0 0 0 0 0 0 0.05 0 0 0 0 0 0 0 0 0 0 0 0 
0 -1354.79 0 0 0 0 707.495 0 0 -43.26 0 0 0 0 0 0 2491.3 0 0 0 0 0 0 0 0 0 0 0 0 0 0 1387.14 0 0 0 0 0 0 0 0 0 0 0 0 0 0 0.03 0 0 0 0 0 0 0 0 0 0 0 
2001.79 0 0 0 -880.535 0 0 0 0 1591.01 0 0 0 0 0 0 0 791.726 0 0 0 0 0 0 0 0 1255 0 0 0 0 0 0 0 0 0 1029.31 0 0 0 0 672.399 -40.8185 0 0 0 0 0.02 0 0 0 -1846.75 0 0 0 0 0 0 
0 0 0 444.578 0 0 0 0 0 0 0 0 0 0 0 0 -1813.33 0 1711.86 913.648 0 0 0 0 0 0 -1663.79 0 0 0 0 0 0 1022.45 0 0 0 0 0 0 0 -1729.41 0 0 0 0 0 0 0.01 1888.56 0 0 0 1860.18 0 0 -819.956 0 
0 0 0 0 0 0 0 0 0 0 0 0 -1259.42 0 0 0 0 0 0 0 0 0 0 0 0 0 0 1465.58 0 106.738 0 0 0 0 0 0 0 0 0 0 0 0 0 0 0 0 0 0 2418.06 0.05 0 0 385.983 0 647.221 0 0 0 
-328.913 0 0 0 0 0 0 0 0 0 0 0 -1677.68 0 0 0 0 0 0 1003.68 0 0 0 0 0 0 0 0 0 0 0 0 0 0 1964.25 0 0 0 0 0 -1325.65 0 0 0 0 0 0 0 0 0 0.09 0 0 0 0 0 0 0 
0 0 0 0 0 0 0 0 0 0 0 0 0 0 1325.34 0 0 0 0 0 0 0 0 0 2182.76 0 0 0 2415.62 0 0 0 0 0 0 0 0 0 0 0 0 0 0 0 0 0 0 532.472 0 0 0 0.07 0 0 0 0 0 0 
0 0 0 0 0 0 760.292 0 0 538.423 0 0 0 0 0 2030.93 0 0 -1556.52 0 0 0 0 0 0 0 0 0 0 0 0 -1063.8 -30.137 -1236.84 0 0 0 670.263 0 0 0 0 0 0 0 0 0 0 0 1918.93 0 0 0.05 0 0 0 0 0 
0 0 -982.315 0 0 2016.13 0 0 0 0 0 0 0 1020 0 0 0 0 0 0 0 0 0 -1434.29 0 0 0 1251.18 0 0 0 0 0 0 2430.72 0 0 0 0 0 0 0 0 0 0 0 0 0 2292.93 0 0 0 0 0.09 -2492.68 0 0 0 
0 0 0 0 0 0 0 0 0 0 0 0 0 0 0 0 2413.17 0 0 0 0 0 0 0 0 1620.91 0 0 0 0 0 0 0 0 0 0 0 2439.42 0 0 0 0 0 0 0 0 0 0 0 1628.24 0 0 0 1085.77 0.08 0 0 0 
0 0 0 0 0 0 0 0 0 0 0 2456.21 0 0 0 0 0 0 0 0 0 0 0 0 0 0 0 0 0 0 1323.21 0 0 0 0 0 -1371.27 0 0 0 0 0 0 0 0 0 0 0 0 0 0 0 0 0 0 0.04 0 0 
0 0 0 0 0 0 0 0 0 0 0 0 0 0 0 0 0 0 0 0 0 0 0 0 0 0 0 0 0 0 0 0 0 0 0 0 0 0 0 0 0 0 0 0 0 0 0 0 448.088 0 0 0 0 0 0 0 0.09 0 
0 0 0 0 0 0 0 0 0 0 0 0 0 0 0 2174.98 0 0 0 0 0 0 0 0 0 0 0 0 0 0 0 0 0 0 0 0 0 0 0 0 0 0 0 0 0 0 0 0 0 0 0 0 0 0 0 0 0 0.08 
