*Vertices 41
*Matrix 
0.03 555.055 0 0 0 0 0 0 411.008 1885.66 0 0 0 0 1359.98 0 0 972.549 0 0 1632.51 0 0 0 0 0 0 510.956 1748.63 0 0 -1906.72 555.818 0 0 -841.777 0 0 0 0 0 
1493.19 0.01 0 0 0 0 0 0 0 2140.03 0 -985.061 0 0 0 0 0 0 1695.07 0 0 0 0 0 0 0 0 0 0 0 -325.098 0 1312.83 0 0 0 56.5355 159.688 0 0 0 
0 0 0.01 0 0 0 0 -1294.37 0 -673.467 0 0 0 1603.52 0 0 -357.753 2466.58 0 0 2321.62 0 2438.96 0 0 498.138 0 -2008.8 994.522 2170.86 0 0 0 0 -90.7163 0 0 0 0 0 -824.992 
0 0 0 0.01 0 0 0 0 0 0 0 0 0 0 0 0 2211.91 0 0 0 0 -2411.8 0 0 578.86 0 1682.71 0 758.156 0 0 1922.44 1772.9 0 0 0 0 0 0 0 0 
0 0 0 0 0.06 -396.97 0 0 0 0 -1403.16 0 0 0 1114.92 0 0 0 0 0 238.121 659.581 0 0 410.855 0 0 0 0 0 1086.23 0 1502.2 -1637.09 0 0 0 0 0 0 0 
0 0 0 0 -0.228889 0 0 0 0 0 0 0 0 0 1767.86 0 0 0 0 0 0 0 0 0 1932.97 0 -1297.57 0 0 0 1002.76 0 0 0 0 0 0 0 0 -188.528 0 
0 0 0 0 0 0 0.03 0 0 2335.2 0 0 0 1780.83 0 0 0 1608.71 0 0 1729.1 0 0 0 0 -983.84 0 0 0 0 0 0 1323.21 0 0 0 0 0 0 0 0 
0 0 -898.694 0 0 0 0 0.05 1712.93 0 0 1103.32 1060.14 0 0 0 -1722.24 0 622.196 0 191.885 0 0 0 2355.65 790.048 2122.49 1257.44 0 0 0 -237.51 -818.735 0 0 0 0 0 0 0 0 
2453 0 0 0 0 0 0 -1304.9 0.07 0 1381.95 0 0 1935.71 0 0 0 0 0 0 -783.486 0 0 0 0 0 -1798.23 0 903.729 0 0 0 0 -494.476 0 0 0 0 0 0 0 
1143.91 1390.5 -887.402 0 0 0 1140.4 0 0 0.04 1024.43 0 0 0 0 0 0 0 0 423.368 438.932 0 -208.975 0 -304.498 0 -959.883 -1216.85 0 0 1762.22 0 0 0 0 0 0 0 0 0 -751.9 
0 0 0 0 -2343.29 0 0 0 771.126 -2401.43 0.04 0 0 0 0 0 0 0 2460.17 0 1887.65 0 0 0 0 2470.09 1984.08 0 0 0 0 0 0 0 0 0 0 0 0 0 0 
0 -284.051 0 0 0 0 0 862.224 0 0 0 0.01 234.764 0 898.389 0 0 0 0 116.199 0 970.26 0 -259.789 0 0 0 0 0 110.096 -598.849 0 1020.31 0 0 0 0 0 0 0 0 
0 0 0 0 0 0 0 2035.36 0 0 0 -284.051 0.09 0 0 0 2412.11 0 0 0 -1198.08 0 -1621.52 0 0 0 0 0 0 657.75 0 0 0 0 0 0 0 0 0 0 0 
0 0 2412.72 0 0 0 651.036 0 -2036.58 0 0 0 0 0.04 2131.79 0 0 0 0 0 -784.555 0 0 0 0 0 18.2348 0 0 0 0 0 0 0 0 668.279 0 0 0 0 0 
1382.26 0 0 0 -360.805 -1942.88 0 0 0 0 0 -1686.22 0 631.809 0.07 0 1239.28 1690.34 -1023.21 0 0 -1243.25 0 0 0 0 0 -271.081 0 2300.71 0 0 -679.113 0 0 0 -1013.14 300.684 0 0 0 
0 0 0 0 0 0 0 0 0 0 0 0 0 0 0 0.07 0 2326.5 -370.113 0 0 1606.11 0 0 -1452.6 -517.06 0 0 0 2382.81 1684.24 -1074.79 0 0 0 0 0 0 0 0 0 
0 0 964.309 2265.01 0 0 0 1662.42 0 0 0 0 1225.39 0 947.066 0 0.06 0 0 0 0 0 0 0 0 0 0 1518.37 0 0 1878.34 0 417.722 0 0 0 0 1800.21 0 651.341 0 
754.494 0 -42.9548 0 0 0 -26.4748 0 0 0 0 0 0 0 2121.72 1985.15 0 0.06 1486.48 0 0 0 0 0 1718.12 2212.82 -847.575 0 0 0 0 0 -107.654 0 0 0 0 0 -831.858 0 0 
0 -817.667 0 0 0 0 0 1621.22 0 0 1938.46 0 0 0 -1542.63 -2480.77 0 1311.15 0.04 0 0 0 0 0 0 0 0 0 0 993.454 -1264 0 2292.47 1637.7 470.672 0 0 0 0 0 0 
0 0 0 0 0 0 0 0 0 1413.24 0 2164.91 0 0 0 0 0 0 0 0.07 0 0 793.71 0 -1964.25 0 583.285 0 1693.24 0 0 0 0 0 0 0 0 0 0 0 -1199.45 
-971.328 0 552.309 0 1483.28 0 -1992.63 -1996.75 -449.156 2165.36 -263.909 0 -1001.24 1130.02 0 0 0 0 0 0 0.02 0 0 1192.74 0 0 0 0 0 0 0 0 1618.63 0 -1200.22 0 0 0 0 0 0 
0 0 0 1325.65 -580.538 0 0 0 0 0 0 -57.4511 0 0 -1074.18 838.725 0 0 0 0 0 0.09 -9.07926 690.863 0 0 23.423 0 0 0 0 0 0 0 0 0 0 0 0 0 0 
0 0 103.381 0 0 0 0 0 0 1792.89 0 0 -2045.43 0 0 0 0 0 0 1761.45 0 -516.449 0.09 0 1159.32 2442.17 0 0 0 1847.97 0 2216.79 1889.93 -2104.02 0 0 0 -1361.35 0 0 0 
0 0 0 0 0 0 0 0 0 0 0 -2442.78 0 0 0 0 0 0 0 0 2173.6 417.112 0 0.03 2275.54 0 1927.32 0 0 -1052.35 0 0 1695.84 0 0 0 0 0 0 0 -2232.66 
0 0 0 273.522 -536.439 599.46 0 -709.784 0 1511.81 0 0 0 0 0 -208.823 0 -1536.07 0 1580.17 0 0 796.762 1383.63 0.03 0 0 1311.61 0 0 0 -1971.72 0 0 0 0 0 0 -179.373 0 0 
0 0 1840.95 0 0 0 -1375.85 -179.983 0 0 2002.4 0 0 0 0 -2444.15 0 -104.45 0 0 0 0 1914.96 0 0 0.05 0 0 0 0 0 0 0 0 0 0 0 0 0 0 0 
0 0 0 1822.03 0 1341.36 0 -1299.25 2473.91 -1081.96 1798.84 0 0 2463.68 0 0 0 1706.06 0 -1119.5 0 883.74 0 -2222.43 0 0 0.08 0 0 0 2344.36 1681.8 -482.879 0 0 0 0 0 0 0 0 
-2064.35 0 -1262.17 0 0 0 0 1872.08 0 1568.42 0 0 0 0 1926.71 0 277.184 0 0 0 0 0 0 0 724.128 0 0 0.05 486.389 0 0 0 0 0 0 0 0 2392.57 0 0 0 
1402.86 0 2194.2 1601.99 0 0 0 0 -2344.66 0 0 0 0 0 0 0 0 0 0 2454.22 0 0 0 0 0 0 0 -1643.96 0.05 0 0 0 0 668.584 0 0 -1634.04 0 0 0 0 
0 0 1639.99 0 0 0 0 0 0 0 0 -780.435 2086.63 0 -483.947 -97.4303 0 0 1042.59 0 0 0 10.9104 -95.7518 0 0 0 0 0 0.07 -1613.13 1021.23 -2294.61 -493.866 0 2403.41 0 0 0 0 -268.792 
0 2446.44 0 0 1918.01 315.027 0 0 0 894.574 0 -42.3444 0 0 0 -1661.66 727.18 0 -80.6452 0 0 0 0 0 0 0 561.464 0 0 2027.42 0.05 1305.35 0 0 0 0 0 0 0 2116.53 0 
-2043.9 0 0 -104.297 0 0 0 1894.51 0 0 0 0 0 0 0 2293.24 0 0 0 0 0 0 -264.519 0 1590.09 0 2204.12 0 0 1461.61 -2213.13 0.04 -1046.25 0 0 0 0 0 0 0 196.31 
-2439.73 2400.81 0 -2380.52 769.601 0 1345.48 848.186 0 0 0 578.402 0 0 4.50148 0 -461.821 256.89 -853.679 0 1122.24 0 1916.94 1770.3 0 0 612.735 0 0 -359.279 0 1120.87 0.05 668.279 -2463.99 0 0 0 0 0 0 
0 0 0 0 -605.716 0 0 0 -103.687 0 0 0 0 0 0 0 0 0 73.4733 0 0 0 1714.15 0 0 0 0 0 1727.58 -434.965 0 0 2287.29 0.03 0 0 0 0 -911.969 0 0 
0 0 2323.76 0 0 0 0 0 0 0 0 0 0 0 0 0 0 0 1226.92 0 -936.232 0 0 0 0 0 0 0 0 0 0 0 -842.845 0 0.05 2306.51 0 0 1179.31 0 -1749.7 
530.335 0 0 0 0 0 0 0 0 0 0 0 0 1185.87 0 0 0 0 0 0 0 0 0 0 0 0 0 0 0 1827.98 0 0 0 0 -1003.22 0.04 0 0 0 -945.082 0 
0 1867.66 0 0 0 0 0 0 0 0 0 0 0 0 807.138 0 0 0 0 0 0 0 0 0 0 0 0 0 -1365.78 0 0 0 0 0 0 0 0.04 0 0 0 0 
0 2403.41 0 0 0 0 0 0 0 0 0 0 0 0 602.969 0 643.559 0 0 0 0 0 1729.87 0 0 0 0 65.8437 0 0 0 0 0 0 0 0 0 0.01 0 0 0 
0 0 0 0 0 0 0 0 0 0 0 0 0 0 0 0 0 1990.04 0 0 0 0 0 0 1824.63 0 0 0 0 0 0 0 0 689.642 -987.045 0 0 0 0.07 0 0 
0 0 0 0 0 -420.469 0 0 0 0 0 0 0 0 0 0 1835.61 0 0 0 0 0 0 0 0 0 0 0 0 0 2393.8 0 0 0 0 -950.423 0 0 0 0.05 0 
0 0 1501.59 0 0 0 0 0 0 53.0259 0 0 0 0 0 0 0 0 0 -22.8126 0 0 0 -198.447 0 0 0 0 0 2188.25 0 -385.22 0 0 2329.1 0 0 0 0 0 0 
