*Vertices 52
*Matrix 
0.02 0 0 0 0 0 0 0 0 0 0 0 -547.884 1794.56 0 0 0 0 673.315 0 0 0 0 0 0 0 0 0 0 0 0 0 0 0 0 0 0 0 0 0 0 0 0 785.775 0 0 214.011 0 0 0 0 0 
0 0.02 0 0 1030.38 0 0 0 -134.053 0 0 0 0 0 964.003 -182.577 0 1769.54 0 0 0 2279.81 -480.743 0 0 0 0 178.61 0 0 0 0 0 0 0 0 0 0 0 0 0 0 0 0 0 0 0 0 0 0 0 0 
0 0 0.03 1549.35 0 0 2184.44 349.818 0 0 57.2985 0 0 0 0 1750.47 -628.758 0 0 0 2450.87 -754.646 0 0 0 0 1430.33 0 -1395.08 44.3281 0 -2012.01 0 0 0 -1374.02 0 0 0 0 1775.03 0 0 0 0 0 0 0 0 0 0 0 
0 0 130.543 0.03 -2092.58 1754.28 0 0 0 1405.3 0 0 0 0 0 0 0 0 808.206 0 714.972 0 0 95.7518 0 0 0 0 0 0 752.51 0 0 0 0 0 -1769.54 2337.03 0 0 662.633 0 0 0 0 0 0 370.266 -337.306 0 200.888 0 
0 2128.44 0 -182.882 0.09 0 2273.55 -1464.96 0 2146.29 0 0 0 0 0 547.731 0 0 0 0 0 1595.58 0 0 0 2203.05 1084.86 0 0 -2069.84 0 -527.131 0 0 0 0 0 0 -1017.87 0 0 0 0 0 0 0 0 0 0 -515.534 0 450.377 
0 0 0 2055.19 0 0.03 0 -269.097 -89.8007 0 0 0 0 0 0 0 0 0 0 0 0 0 975.906 0 0 0 0 0 0 0 0 0 0 0 0 0 0 0 0 -1852.85 0 0 0 0 0 0 0 0 0 0 0 0 
0 0 1404.84 0 -64.7755 0 0.07 -1286.28 0 1542.94 0 0 0 0 0 0 0 0 30.2896 0 0 0 0 0 0 0 0 0 -1192.28 519.196 0 0 0 0 0 0 186.239 0 0 0 0 0 0 1448.79 0 -1179.01 0 0 0 0 0 1915.72 
0 0 811.563 0 466.247 -898.541 62.0289 0.02 0 0 0 -2493.74 2212.67 0 0 2219.38 1339.53 2113.03 447.02 0 1936.48 0 0 0 0 0 0 0 0 0 0 0 0 0 1995.38 0 0 0 0 2369.84 0 -718.94 0 0 0 0 0 0 0 2242.73 0 0 
0 -1959.06 0 0 0 2424.47 0 0 0.05 373.012 0 0 1386.23 0 -1525.39 1482.51 1788.46 1862.93 -1645.18 815.073 0 0 628.758 0 0 0 0 0 0 0 0 0 0 -1501.89 0 0 0 0 0 0 0 0 0 0 0 0 0 1877.73 0 0 503.784 654.241 
0 0 0 1999.8 841.929 0 1924.88 0 -897.168 0.07 0 0 0 0 0 -10.3 0 0 0 0 460.906 2161.7 -1153.83 0 0 0 0 -109.027 -1588.11 0 0 0 0 0 -1483.58 0 0 0 0 0 0 -248.192 0 0 0 0 0 0 0 0 0 0 
0 0 -1088.37 0 0 0 0 0 0 0 0.07 112.69 0 0 0 655.919 0 0 0 805.155 0 861.919 0 0 0 0 0 0 0 0 0 0 0 0 0 0 0 0 -792.337 0 0 1876.05 -456.786 0 0 0 0 0 74.0837 0 0 0 
0 0 0 0 0 0 0 24.4911 0 0 1895.43 0.05 0 1327.94 0 0 0 0 1221.12 0 0 198.447 0 1231.8 0 0 0 0 0 0 0 0 0 0 0 0 0 0 0 238.578 0 0 0 -1148.49 338.832 0 0 2484.89 0 -259.484 1627.02 0 
2255.09 0 0 0 0 0 0 2140.34 1978.74 0 0 0 0.02 0 0 0 0 0 0 0 0 1965.62 -2273.71 0 0 0 0 0 0 0 0 0 0 -463.805 2495.42 0 1977.98 -1946.24 0 0 -2085.25 0 0 0 0 781.503 0 0 0 0 0 0 
1121.63 0 0 0 0 0 0 0 0 0 0 2299.34 0 0.01 0 0 1176.41 0 0 1973.56 -2049.55 0 0 0 0 0 0 0 0 0 0 0 0 -1248.28 -504.242 0 -467.315 0 0 0 0 -1299.4 0 0 0 0 0 1111.71 2347.71 0 0 0 
0 2015.67 0 0 0 0 0 0 -363.857 0 0 0 0 0 0.05 -1091.88 0 1731.7 0 1686.53 0 -1701.64 0 0 -184.256 0 0 0 0 2299.19 0 0 0 275.201 -734.657 0 0 -2186.12 0 0 0 -1067.31 0 0 0 0 0 0 0 0 0 0 
0 -2031.85 938.978 0 2323.3 0 0 1299.71 -259.941 255.669 1069.29 0 0 0 1676.92 0.08 0 -704.749 0 0 0 0 0 0 -387.509 0 0 0 0 2051.68 1849.04 0 0 0 0 0 0 0 0 0 0 0 0 0 0 0 0 0 0 0 0 0 
0 0 1852.4 0 0 0 0 2250.51 1225.7 0 0 0 0 -911.817 0 0 0.01 0 0 0 -77.5933 0 0 0 -406.888 0 0 0 1133.23 0 0 0 0 0 0 0 0 0 0 0 0 0 0 0 0 0 0 0 0 0 453.429 0 
0 1974.93 0 0 0 0 0 1957.84 118.793 0 0 0 0 0 1497.01 952.406 0 0.06 0 0 0 0 0 0 0 0 0 0 -1403.01 0 0 0 0 0 0 0 0 0 0 0 203.33 0 0 0 0 0 0 0 0 0 0 0 
1560.18 0 0 670.873 0 0 1172.14 1754.13 1142.54 0 0 -2184.74 0 0 0 0 0 0 0.06 -1001.85 385.525 0 0 0 0 0 0 0 0 0 0 0 -553.072 0 0 0 0 0 0 0 0 0 0 0 0 0 0 0 0 250.938 -1826 0 
0 0 0 0 0 0 0 0 1295.74 0 -990.555 0 0 315.332 426.42 0 0 0 -98.3459 0.01 714.057 0 0 0 0 2191.46 0 0 0 0 0 0 0 0 0 0 0 -729.621 0 0 0 0 0 0 0 0 0 0 0 0 0 0 
0 0 1797.01 -2137.29 0 0 0 963.088 0 -1475.8 0 0 0 -1114.92 0 0 1592.07 0 2084.49 1620.91 0.06 0 0 0 0 0 0 0 0 0 1146.2 0 1351.28 0 0 0 0 0 0 0 0 0 0 0 0 0 0 0 0 0 0 0 
0 1385.31 -153.737 0 2264.24 0 0 0 0 405.82 75.9148 2169.64 1077.84 0 1451.99 0 0 0 0 0 0 0.01 -1253.01 0 -255.516 0 0 0 0 0 0 0 0 742.592 0 0 0 0 0 0 0 0 0 0 0 0 0 0 0 0 0 0 
0 1726.36 0 0 0 -90.4111 0 0 1871.32 -1844.46 0 0 383.389 0 0 0 0 0 0 0 0 771.126 0.04 0 0 0 0 0 0 0 0 216.605 0 0 0 0 0 0 0 0 0 0 0 0 0 0 0 2459.56 0 0 0 0 
0 0 0 -248.192 0 0 0 0 0 0 0 2269.13 0 0 0 0 0 0 0 0 0 0 0 0.01 0 0 1281.7 0 0 1447.42 0 0 0 0 0 0 1459.93 0 0 0 0 0 -2366.79 0 0 0 0 0 0 0 0 0 
0 0 0 0 0 0 0 0 0 0 0 0 0 0 -491.272 1079.06 354.091 0 0 0 0 -365.688 0 0 0.03 0 0 0 0 0 0 0 1633.12 0 0 0 0 0 0 0 0 0 0 0 0 0 0 0 0 0 0 0 
0 0 0 0 712.073 0 0 0 0 0 0 0 0 0 0 0 0 0 0 2082.05 0 0 0 0 0 0.06 0 0 1143.45 0 0 0 0 0 0 0 -1325.65 -2463.84 0 0 0 0 0 0 0 0 0 0 959.12 0 0 0 
0 0 2388.91 0 -2074.57 0 0 0 0 0 0 0 0 0 0 0 0 0 0 0 0 0 0 -1358.91 0 0 0.02 0 0 0 0 0 0 0 0 0 0 0 0 488.983 0 0 0 0 0 0 1550.42 0 0 0 0 0 
0 -129.627 0 0 0 0 0 0 0 1186.18 0 0 0 0 0 0 0 0 0 0 0 0 0 0 0 0 0 0.03 0 0 0 0 0 0 1728.8 0 0 0 0 0 0 0 -166.707 0 0 0 0 0 0 0 0 2266.84 
0 0 1436.74 0 0 0 2001.48 0 0 644.78 0 0 0 0 0 0 -1770.46 -2011.55 0 0 0 0 0 0 0 2398.53 0 0 0.01 0 0 0 -419.706 0 0 0 0 0 0 0 0 0 -1192.59 0 0 0 0 0 0 0 0 0 
0 0 -808.054 0 -922.803 0 1946.39 0 0 0 0 0 0 0 1774.73 -1768.93 0 0 0 0 0 0 0 1759.01 0 0 0 0 0 0.08 -1312.68 0 0 -284.356 0 0 0 0 0 0 0 0 0 0 0 0 0 0 0 0 0 0 
0 0 0 1500.82 0 0 0 0 0 0 0 0 0 0 0 2098.68 0 0 0 0 -1668.98 0 0 0 0 0 0 0 0 551.393 0.04 0 0 0 0 0 0 0 0 0 0 0 0 0 -356.99 0 0 0 0 0 0 0 
0 0 398.648 0 1859.42 0 0 0 0 0 0 0 0 0 0 0 0 0 0 0 0 0 1826.46 0 0 0 0 0 0 0 0 0.01 0 0 0 0 0 0 0 0 0 0 0 0 0 0 -382.321 0 0 0 0 0 
0 0 0 0 0 0 0 0 0 0 0 0 0 0 0 0 0 0 323.115 0 -1762.67 0 0 0 1341.98 0 0 0 974.685 0 0 0 0.08 1140.71 0 0 0 0 0 0 1110.34 0 -2209.62 0 0 0 0 0 -420.927 0 0 0 
0 0 0 0 0 0 0 0 -1746.96 0 0 0 1227.68 2413.63 724.281 0 0 0 0 0 0 1334.8 0 0 0 0 0 0 0 499.817 0 0 -1208.15 0.06 0 0 0 0 0 422.91 0 0 0 1578.34 1949.29 0 0 2038.41 0 0 0 0 
0 0 0 0 0 0 0 1619.08 0 1459.32 0 0 125.813 1481.6 -1638.31 0 0 0 0 0 0 0 0 0 0 0 0 -1600.47 0 0 0 0 0 0 0.03 0 0 0 0 0 0 0 0 0 0 0 0 0 0 306.024 0 0 
0 0 1135.21 0 0 0 0 0 0 0 0 0 0 0 0 0 0 0 0 0 0 0 0 0 0 0 0 0 0 0 0 0 0 0 0 0.09 0 0 0 0 0 0 -892.895 0 0 2005.91 0 0 0 1550.87 0 0 
0 0 0 1503.27 0 0 -151.906 0 0 0 0 0 -712.683 1709.11 0 0 0 0 0 0 0 0 0 -2145.53 0 634.098 0 0 0 0 0 0 0 0 0 0 0.08 0 0 0 1875.59 0 0 0 0 276.574 -707.495 0 0 0 0 0 
0 0 0 986.892 0 0 0 0 0 0 0 0 2057.94 0 1379.82 0 0 0 0 2322.99 0 0 0 0 0 239.036 0 0 0 0 0 0 0 0 0 0 0 0.08 0 0 0 0 0 0 41.7341 0 0 0 0 0 0 -151.753 
0 0 0 0 2026.2 0 0 0 0 0 1844.77 0 0 0 0 0 0 0 0 0 0 0 0 0 0 0 0 0 0 0 0 0 0 0 0 0 0 0 0.06 0 0 -515.381 0 0 0 0 0 0 0 0 0 0 
0 0 0 0 0 -875.805 0 1301.54 0 0 0 2496.8 0 0 0 0 0 0 0 0 0 0 0 0 0 0 -978.957 0 0 0 0 0 0 -519.959 0 0 0 0 0 0.08 0 0 0 0 0 0 0 0 0 -406.583 0 -421.232 
0 0 885.723 2313.99 0 0 0 0 0 0 0 0 -970.107 0 0 0 0 390.255 0 0 0 0 0 0 0 0 0 0 0 0 0 0 368.587 0 0 0 405.362 0 0 0 0.09 0 0 0 0 1362.42 0 0 2176.35 0 0 0 
0 0 0 0 0 0 0 1763.13 0 -1924.12 1470.31 0 0 757.698 160.451 0 0 0 0 0 0 0 0 0 0 0 0 0 0 0 0 0 0 0 0 0 0 0 1500.52 0 0 0.02 0 0 0 0 0 0 0 0 0 0 
0 0 0 0 0 0 0 0 0 0 1143.3 0 0 0 0 0 0 0 0 0 0 0 0 40.2081 0 0 0 813.7 -1918.32 0 0 0 774.026 0 0 321.131 0 0 0 0 0 0 0.01 0 0 -126.423 0 0 0 0 0 1499.76 
1525.54 0 0 0 0 0 -1331.75 0 0 0 0 1108.05 0 0 0 0 0 0 0 0 0 0 0 0 0 0 0 0 0 0 0 0 0 -1558.96 0 0 0 0 0 0 0 0 0 0.01 0 0 0 0 0 0 0 0 
0 0 0 0 0 0 0 0 0 0 0 -220.115 0 0 0 0 0 0 0 0 0 0 0 0 0 0 0 0 0 0 170.37 0 0 1369.29 0 0 0 2110.74 0 0 0 0 0 0 0.04 0 0 0 0 0 0 0 
0 0 0 0 0 0 -702.918 0 0 0 0 0 35.783 0 0 0 0 0 0 0 0 0 0 0 0 0 0 0 0 0 0 0 0 0 0 1149.71 -1556.37 0 0 0 2251.27 0 -1084.09 0 0 0.06 0 0 0 0 0 0 
1296.5 0 0 0 0 0 0 0 0 0 0 0 0 0 0 0 0 0 0 0 0 0 0 0 0 0 -104.297 0 0 0 0 1074.94 0 0 0 0 80.7978 0 0 0 0 0 0 0 0 0 0.03 0 0 0 0 0 
0 0 0 1078.14 0 0 0 0 1959.36 0 0 -2147.82 0 2334.59 0 0 0 0 0 0 0 0 2216.48 0 0 0 0 0 0 0 0 0 0 2113.48 0 0 0 0 0 0 0 0 0 0 0 0 0 0.05 -940.962 0 0 0 
0 0 0 1247.06 0 0 0 0 0 0 1279.56 0 0 1656.32 0 0 0 0 0 0 0 0 0 0 0 1327.02 0 0 0 0 0 0 -1800.52 0 0 0 0 0 0 0 -1040.3 0 0 0 0 0 0 229.423 0.09 0 0 0 
0 0 0 0 2053.36 0 0 -1189.99 0 0 0 -87.6644 0 0 0 0 0 0 523.621 0 0 0 0 0 0 0 0 0 0 0 0 0 0 0 934.706 -594.424 0 0 0 1189.99 0 0 0 0 0 0 0 0 0 0.02 0 0 
0 0 0 403.684 0 0 0 0 -221.641 0 0 2491.61 0 0 0 0 1382.56 0 -855.815 0 0 0 0 0 0 0 0 0 0 0 0 0 0 0 0 0 0 0 0 0 0 0 0 0 0 0 0 0 0 0 0.08 0 
0 0 0 0 2437.74 0 1421.17 0 971.938 0 0 0 0 0 0 0 0 0 0 0 0 0 0 0 0 0 0 -2286.98 0 0 0 0 0 0 0 0 0 -596.255 0 -262.993 0 0 1926.1 0 0 0 0 0 0 0 0 0.04 
