*Vertices 63
*Matrix 
0.07 -2410.58 0 -379.116 0 -313.501 0 0 0 0 0 1530.58 0 0 0 534.608 0 1290.86 1540.19 -1834.24 0 0 0 0 0 0 0 0 0 2206.87 0 0 0 0 0 0 900.372 2.51778 0 0 945.082 0 0 0 0 0 0 0 0 0 -1061.36 0 0 0 0 0 0 0 0 0 0 0 0 
1388.21 0.02 0 0 0 0 -345.851 0 1845.07 -1360.13 0 1087.91 0 211.417 0 -1835.46 2010.03 -1251.03 0 27.8481 0 0 0 0 2150.72 0 1902.45 0 -1426.36 0 0 0 0 2001.17 1230.12 0 0 0 1845.68 0 0 -91.937 0 0 0 -2340.54 0 0 -1979.35 0 0 0 0 0 0 0 0 0 0 0 0 0 0 
0 0 0.09 0 0 0 -60.9607 -800.119 1053.12 0 948.134 0 0 0 0 0 862.224 -1143.76 0 0 -2048.78 1881.08 0 537.507 6.02741 0 0 0 2340.08 0 0 0 0 0 0 0 0 -756.783 -383.236 0 0 0 0 0 0 440.458 0 0 0 0 0 0 2090.44 0 0 0 0 0 0 0 0 0 0 
-846.812 0 0 0.01 0 0 154.347 0 0 -597.629 0 0 0 1175.19 0 -1766.34 0 0 0 2234.64 0 0 0 0 -119.404 0 -663.549 0 1121.33 0 0 1576.51 2463.23 0 309.076 0 1152.46 0 0 0 -1400.72 0 0 0 0 0 0 0 0 0 0 0 85.0703 0 0 0 0 0 0 0 0 0 0 
0 0 0 0 0.03 0 0 0 1587.65 0 0 571.078 0 0 0 0 0 0 0 0 0 0 0 0 0 0 0 0 502.564 0 -1018.33 0 0 0 0 0 0 -599.002 0 1938.61 0 0 0 0 0 0 0 0 0 0 0 0 0 0 0 0 0 0 0 0 0 0 353.023 
-1470 0 0 0 0 0.03 0 0 2042.53 660.192 0 0 0 0 0 0 0 1946.55 0 2206.11 0 0 627.689 0 0 -1125.14 0 -1510.44 0 -1882.76 -42.0392 0 0 0 732.826 -388.424 0 0 0 0 0 0 0 0 0 0 0 0 0 0 0 2112.72 -2102.8 0 0 0 0 0 727.332 0 637.15 0 0 
0 1141.77 1611.91 366.909 0 0 0.07 0 -2198.78 0 0 0 0 2299.34 0 -970.717 0 0 0 0 0 0 0 -2143.54 0 1618.02 0 1093.4 0 1746.35 0 0 1723.61 0 0 0 0 2122.03 0 -631.352 0 0 1089.89 -842.235 0 0 0 0 0 0 0 -1300.16 0 0 0 0 0 0 0 0 0 1159.02 0 
0 0 2399.59 0 0 0 0 0 0 1618.17 0 0 0 2004.38 0 0 0 0 1806.77 0 237.663 -407.193 0 0 0 -795.694 2369.69 -1062.73 0 0 0 2333.98 2138.66 0 466.552 0 0 -1657.69 0 1371.73 0 0 0 0 0 0 0 0 0 -1741.61 -2326.96 0 0 0 0 0 0 0 0 0 0 0 0 
0 1172.44 2129.81 0 1747.72 1529.36 -1493.8 0 0.08 0 0 117.878 0 0 0 -1256.68 0 0 0 0 -765.328 0 0 0 0 0 0 0 0 0 0 1135.21 0 0 0 -2059.47 0 1403.62 0 0 0 0 0 0 -2456.36 2091.2 0 0 0 0 0 1145.74 0 0 0 0 0 0 0 0 0 -1477.63 0 
0 2394.71 0 1039.99 0 393.307 0 -2218.77 0 0.05 1339.08 0 0 -340.358 0 0 -971.023 -432.676 0 0 0 1591.31 0 -1394.92 0 0 0 1275.75 0 0 0 0 0 2169.33 0 0 0 0 0 -2309.26 0 0 322.81 2034.75 0 0 770.821 0 0 0 0 0 0 0 -1157.03 0 0 602.359 0 0 0 0 0 
0 0 -1500.98 0 0 0 0 0 0 -974.685 0.09 0 0 0 0 0 1597.87 0 0 0 0 0 0 0 0 0 0 0 0 0 2416.38 0 0 0 0 -2082.81 0 1996.14 -819.041 0 0 0 0 0 0 0 0 0 0 2102.8 0 0 0 0 0 0 0 405.972 0 0 0 0 0 
1117.82 733.741 0 0 -2405.39 0 0 0 1063.65 0 0 0 -1904.43 0 0 0 2390.74 -370.266 0 0 0 -2149.8 0 0 924.024 556.734 -112.995 0 0 -946.608 0 0 2409.67 2474.52 0 1005.66 0 0 0 -635.929 -2183.83 0 0 0 0 0 0 0 0 0 0 1226 0 943.403 0 0 0 0 167.47 0 0 0 0 
0 0 0 0 0 0 0 0 0 0 0 1520.51 0.08 -706.427 0 -388.577 0 1446.96 0 0 0 0 0 -871.075 0 0 0 0 0 0 -916.547 0 0 0 -1066.55 1383.94 0 0 0 0 737.251 0 0 0 1131.09 0 0 0 0 0 0 0 0 0 0 0 0 0 -1625.8 0 0 0 0 
0 -851.085 0 1337.55 0 0 2217.7 2420.65 0 1887.8 0 0 -756.02 0.01 1594.52 0 1781.9 0 803.629 0 0 0 0 -796.915 0 0 0 2357.02 0 0 2091.97 0 0 0 0 0 -1573.61 0 0 0 0 0 -1307.64 -765.938 0 0 -2302.55 0 0 0 0 0 0 0 0 0 0 0 0 0 0 0 0 
0 0 0 0 0 0 0 0 0 0 0 0 0 1411.4 0 0 0 0 0 738.777 2484.74 0 0 0 -721.229 0 0 1957.23 0 0 1087.3 0 635.929 0 0 1656.47 0 0 1014.05 0 0 0 0 0 0 0 0 -1891.61 0 0 0 0 0 0 0 0 -2356.11 1015.88 0 0 -1322.14 0 0 
763.802 943.251 0 73.3207 0 0 1844.61 0 525.91 0 0 0 -1604.74 0 0 0.01 0 0 1799.75 0 0 1023.97 -9.84222 0 0 0 0 1692.48 0 2327.11 0 0 1071.58 0 0 343.41 -2019.79 0 1831.64 0 -1893.29 0 0 0 0 0 0 -27.0852 0 0 0 2304.83 0 0 0 0 0 0 0 -43.8704 0 0 2488.71 
0 764.718 -795.083 0 0 0 0 0 0 2372.74 1640.29 -2066.64 0 -421.232 0 0 0.09 0 0 1864.6 0 0 0 0 0 0 -1066.85 -1924.12 0 2487.64 0 0 150.838 0 1798.84 0 0 0 0 0 0 0 0 0 -427.641 0 0 0 0 0 0 -954.848 0 0 0 0 0 0 0 0 0 0 652.562 
778.451 -1060.44 -1583.22 0 0 2477.26 0 0 0 -1187.25 0 100.94 461.669 0 0 0 0 0.01 1748.33 0 1313.75 0 0 0 0 0 0 215.232 990.097 0 0 0 0 0 0 0 1916.94 -1384.7 0 0 0 0 0 -1861.86 -2055.04 0 0 2272.03 0 0 0 0 0 0 0 0 0 0 0 0 0 0 0 
2086.63 0 0 0 0 0 0 2402.34 0 0 0 0 0 -2335.66 0 1939.53 0 1007.49 0.05 1954.48 0 0 0 1009.32 0 0 0 1302.61 0 -475.555 0 968.886 -1947.77 -613.804 0 0 -319.605 -382.015 1197.62 0 0 0 0 0 0 0 0 0 2499.85 0 0 0 0 0 0 868.938 0 914.716 0 0 0 0 0 
57.4511 -318.995 0 -942.03 0 469.146 0 0 0 0 0 0 0 0 1411.25 0 212.485 0 1363.19 0.01 1401.18 0 0 -2493.44 196.921 -965.529 0 0 0 0 0 1401.18 0 0 0 1728.95 0 1302.61 0 0 0 0 0 0 0 0 0 0 0 0 0 0 0 0 0 0 0 0 0 0 0 0 0 
0 0 -1755.04 0 0 0 0 246.361 228.965 0 0 0 0 0 1942.43 0 0 2184.74 0 637.608 0.03 2412.72 0 2244.71 0 2310.48 0 0 -1644.11 0 0 0 -1593.45 0 0 -985.672 0 387.204 0 0 0 -1555.45 0 0 0 1293.15 1135.36 0 0 0 0 0 0 0 0 -312.433 2248.07 0 -1461.15 2174.37 0 0 0 
0 0 -487.762 0 0 0 0 2085.56 0 1910.23 0 1089.43 0 0 0 2191.46 0 0 0 0 2384.95 0.02 0 1316.19 1033.28 0 1102.86 0 0 -1943.65 0 0 0 0 0 0 0 0 1147.27 0 0 0 0 0 -1213.19 0 0 0 0 0 0 0 420.011 0 0 1283.99 1312.98 0 0 0 0 0 0 
0 0 0 0 0 130.39 0 0 0 0 0 0 0 0 0 2177.57 0 0 0 0 0 0 0.09 0 451.598 0 0 0 0 -237.815 0 0 -225.15 1551.48 0 0 0 0 0 0 0 728.401 0 0 0 0 0 0 0 1359.52 0 0 0 0 0 -1769.08 0 0 0 -1232.57 0 1489.07 0 
0 0 1518.68 0 0 0 -1646.09 0 0 1363.49 0 0 -1905.04 559.481 0 0 0 0 1609.01 2290.19 -425.047 1635.56 0 0.04 0 0 0 0 0 0 0 2149.34 -2148.43 47.9904 0 0 2133.17 0 0 0 0 0 944.929 0 0 0 0 0 0 0 0 0 0 0 0 0 0 0 0 0 0 0 0 
0 2013.23 2282.25 -1163.14 0 0 0 0 0 0 0 -985.366 0 0 337.764 0 0 0 0 -1939.99 0 -224.082 536.592 0 0.02 0 1266.59 0 1780.98 0 0 2266.08 0 0 1119.8 0 0 0 0 0 0 0 0 -1365.02 -1828.9 0 425.047 0 0 0 0 0 0 0 0 0 0 0 0 0 0 0 0 
0 0 0 0 0 2480.93 -1681.34 485.168 0 0 0 2086.78 0 0 0 0 0 0 0 2419.28 208.213 0 0 0 0 0.02 1229.51 0 0 0 0 -12.4363 0 0 0 0 0 0 0 926.923 0 0 0 0 0 0 0 0 0 0 0 0 762.123 0 2215.57 0 0 0 0 0 760.598 0 0 
0 -496.307 0 2186.73 0 0 0 1108.66 0 0 0 -212.943 0 0 0 0 2339.78 0 0 0 0 4.80667 0 0 -457.549 1749.7 0.04 0 0 -92.7 0 -1797.16 0 0 0 0 -232.933 0 0 0 1867.05 0 0 0 0 0 0 2310.48 0 0 0 0 0 0 2424.47 0 0 0 0 0 0 0 0 
0 0 0 0 0 1368.98 2062.67 282.678 0 1826.15 0 0 0 237.663 -688.574 1168.63 -2380.98 2256.31 1518.37 0 0 0 0 0 0 0 0 0.05 0 2463.84 1100.12 0 0 0 -740.455 0 0 0 1939.38 0 0 0 0 0 0 0 0 0 0 0 0 0 0 0 0 0 0 0 0 0 0 855.052 0 
0 1123 1255.3 1167.87 -2480.16 0 0 0 0 0 0 0 0 0 0 0 0 1091.42 0 0 -1273.61 0 0 0 2021.01 0 0 0 0.07 0 1970.96 0 782.876 40.3607 0 2307.43 0 0 0 0 0 0 0 0 0 -1220.36 1494.42 0 0 0 0 -958.51 0 0 0 0 0 0 0 0 0 -306.482 0 
2170.86 0 0 0 0 -265.893 2026.96 0 0 0 0 -753.731 0 0 0 -2040.7 1237.14 0 278.71 0 0 1473.2 2118.98 0 0 0 1999.04 -1894.21 0 0.04 2468.72 0 1096.61 0 0 0 -1573.61 0 0 0 0 0 -1886.12 -903.729 0 1527.99 0 0 0 0 0 0 0 0 0 0 0 0 0 1215.32 -2408.6 0 0 
0 0 0 0 702.002 2115.47 0 0 0 0 1690.34 0 1436.12 959.578 -883.129 0 0 0 0 0 0 0 0 0 0 0 0 132.832 -2310.33 2335.96 0.04 0 0 0 1058.61 1689.58 -1219.6 0 0 0 0 0 0 0 0 0 0 -2142.48 0 -488.525 0 0 0 0 0 0 0 0 0 -48.2955 0 0 0 
0 0 0 -1489.38 0 0 0 1751.38 2433.77 0 0 0 0 0 0 0 0 0 2448.27 1361.66 0 0 0 2408.75 943.251 -2020.4 2193.14 0 0 0 0 0.07 0 0 0 0 0 -291.223 0 0 0 1596.96 1449.55 0 0 0 351.802 0 0 0 1533.33 0 0 0 0 0 0 0 0 0 0 0 869.243 
0 0 0 -1400.27 0 0 513.092 -1310.69 0 0 0 2287.44 0 0 576.266 1992.93 1963.79 0 1039.99 0 1844.77 0 -1332.97 -1132.01 0 0 0 0 1015.88 -1889.78 0 0 0.01 0 0 0 1447.57 0 -991.623 999.252 0 0 0 1953.72 34.1044 0 0 0 0 0 0 0 0 47.0748 0 0 0 0 2006.67 0 0 0 0 
0 -668.279 0 0 0 0 0 0 0 -1189.23 0 1346.86 0 0 0 0 0 0 2494.81 0 0 0 -497.986 -2303 0 0 0 0 -2036.58 0 0 0 0 0.09 0 1987.44 0 0 1387.91 2113.94 2203.97 0 0 0 0 0 0 0 0 0 0 0 0 0 0 0 0 0 0 0 0 0 0 
0 1052.66 0 688.421 0 2270.5 0 802.56 0 0 0 0 -1514.86 0 0 0 -101.55 0 0 0 0 0 0 0 1984.54 0 0 -1816.08 0 0 2442.63 0 0 0 0.08 0 0 0 0 0 0 -1542.63 0 0 0 -1337.4 0 0 0 0 0 0 0 0 0 1274.53 0 0 0 0 0 0 26.4748 
0 0 0 0 0 -2173.91 0 0 1236.38 0 2141.25 2320.55 155.721 0 -2243.64 -783.944 0 0 0 2053.67 2293.85 0 0 0 0 0 0 0 1180.38 0 1156.27 0 0 2476.81 0 0.03 0 0 0 -566.805 0 0 0 0 0 157.247 0 0 -1149.4 0 1373.26 0 0 0 0 0 262.078 0 1833.17 0 -380.642 0 0 
-774.941 0 0 -145.192 0 0 0 0 0 0 0 0 0 23.7281 0 622.349 0 2263.94 -752.51 0 0 0 0 -1093.71 0 0 945.082 0 0 -941.725 219.352 0 2291.25 0 0 0 0.08 0 0 0 1463.44 0 0 0 0 0 -1543.55 0 0 0 0 0 0 0 0 0 0 0 0 0 0 0 0 
-804.392 0 1378.44 0 1791.51 0 -963.393 1699.04 -2065.87 0 286.798 0 0 0 0 0 0 -342.341 2243.03 -551.851 -2268.82 0 0 0 0 0 0 0 0 0 0 408.872 0 0 0 0 0 0.09 653.935 799.051 2258.29 0 0 0 0 0 0 0 0 0 0 0 0 -486.999 -12.5889 0 0 2286.98 0 0 0 0 0 
0 -195.853 1292.69 0 0 0 0 0 0 0 592.441 0 0 0 1356.01 -497.223 0 0 -532.929 0 0 1625.03 0 0 0 0 0 1975.69 0 0 0 0 -2342.37 1032.52 0 0 0 624.943 0.03 0 -908.155 0 0 0 0 0 0 0 0 0 0 0 0 0 0 0 0 0 0 0 0 -766.243 0 
0 0 0 0 -210.501 0 -1922.74 2283.47 0 330.134 0 1589.63 0 0 0 0 0 0 0 0 0 0 0 0 0 -895.795 0 0 0 0 0 0 -2208.85 1691.72 0 1184.19 0 1970.2 0 0.06 -9.23185 0 0 0 0 -1106.68 0 0 0 0 0 0 0 0 0 0 0 0 0 0 94.5311 0 0 
2038.71 0 0 -149.007 0 0 0 0 0 0 0 790.201 -731.91 0 0 -2055.65 0 0 0 0 0 0 0 0 0 0 1644.57 0 0 0 0 0 0 -255.974 0 0 138.02 2492.07 1360.59 -801.187 0.03 0 0 0 0 0 1548.89 1343.04 0 0 0 0 0 0 0 0 0 0 0 0 0 2041.61 0 
0 -654.546 0 0 0 0 0 0 0 0 0 0 0 0 0 0 0 0 0 0 2100.51 0 963.546 0 0 0 0 0 0 0 0 -785.318 0 0 364.925 0 0 0 0 0 0 0.07 0 0 0 0 0 0 0 0 0 -229.423 0 1647.47 0 0 1607.79 0 0 0 0 0 0 
0 0 0 0 0 0 -1645.63 0 0 50.4318 0 0 0 2243.8 0 0 0 0 0 0 0 0 0 487.915 0 0 0 0 0 -1343.04 0 906.781 0 0 0 0 0 0 0 0 0 0 0.03 0 0 0 0 0 0 0 0 0 0 0 0 0 0 0 0 0 0 0 0 
0 0 0 0 0 0 1634.95 0 0 953.932 0 0 0 -2483.67 0 0 0 2041.61 0 0 0 0 0 0 1908.7 0 0 0 0 2089.37 0 0 -830.18 0 0 0 0 0 0 0 0 0 0 0.03 -1298.33 0 -674.535 0 0 0 0 0 0 0 0 2115.16 0 0 0 0 -289.239 0 -253.838 
0 0 0 0 0 0 0 0 542.39 0 0 0 2228.69 0 0 0 -1813.64 -308.618 0 0 0 613.651 0 0 561.769 0 0 0 0 0 0 0 1372.65 0 0 0 0 0 0 0 0 0 0 1470.46 0.05 0 0 0 0 0 0 0 0 1328.7 0 0 0 0 0 0 0 0 0 
0 832.774 1686.22 0 0 0 0 0 2144.46 0 0 0 0 0 0 0 0 0 0 0 -862.682 0 0 0 0 0 0 0 1189.69 1800.21 0 0 0 0 -2300.87 -2056.87 0 0 0 94.3785 0 0 0 0 0 0.03 0 0 0 0 0 0 0 0 0 821.635 0 0 1759.16 -2037.64 2424.62 489.898 -1260.64 
0 0 0 0 0 0 0 0 0 -2091.66 0 0 0 1466.8 0 0 0 0 0 0 2493.9 0 0 0 211.112 0 0 0 -2086.17 0 0 -1259.27 0 0 0 0 1849.8 0 0 0 1610.69 0 0 1791.97 0 0 0.09 441.832 0 0 0 0 0 0 0 0 0 0 0 0 515.687 0 0 
0 0 0 0 0 0 0 0 0 0 0 0 0 0 1246.91 -215.232 0 1402.4 0 0 0 0 0 0 0 0 1018.33 0 0 0 -375.149 0 0 0 0 0 0 0 0 0 -1340.75 0 0 0 0 0 1050.37 0.07 0 0 0 991.318 0 0 0 0 0 0 605.258 0 0 1385.01 0 
0 791.421 0 0 0 0 0 0 0 0 0 0 0 0 0 0 0 0 2368.62 0 0 0 0 0 0 0 0 0 0 0 0 0 0 0 0 569.704 0 0 0 0 0 0 0 0 0 0 0 0 0.08 0 0 0 1388.82 0 0 0 0 0 0 -389.492 0 0 0 
0 0 0 0 0 0 0 1054.34 0 0 1199.45 0 0 0 0 0 0 0 0 0 0 0 757.851 0 0 0 0 0 0 0 281.304 0 0 0 0 0 0 0 0 0 0 0 0 0 0 0 0 0 0 0.03 0 0 0 0 0 0 0 1922.44 0 0 0 0 0 
-1987.75 0 0 0 0 0 0 1401.79 0 0 0 0 0 0 0 0 0 0 0 0 0 0 0 0 0 0 0 0 0 0 0 2442.32 0 0 0 1298.33 0 0 0 0 0 0 0 0 0 0 0 0 0 0 0.08 0 0 0 0 0 0 0 0 0 0 0 0 
0 0 0 0 0 2303.92 -967.36 0 -363.552 0 0 915.174 0 0 0 864.36 964.309 0 0 0 0 0 0 0 0 0 0 0 1026.11 0 0 0 0 0 0 0 0 0 0 0 0 -1486.33 0 0 0 0 0 730.079 0 0 0 0.01 0 0 0 0 0 0 0 2265.92 0 0 0 
0 0 -509.43 1704.08 0 733.131 0 0 0 0 0 0 0 0 0 0 0 0 0 0 0 105.06 0 0 0 1058 0 0 0 0 0 0 0 0 0 0 0 0 0 0 0 0 0 0 0 0 0 0 2454.22 0 0 0 0 0 472.808 0 0 0 0 -1491.06 0 0 -1288.11 
0 0 0 0 0 0 0 0 0 0 0 1673.41 0 0 0 0 0 0 0 0 0 0 0 0 0 0 0 0 0 0 0 0 1367.31 0 0 0 0 545.9 0 0 0 1612.83 0 0 1848.58 0 0 0 0 0 0 0 0 0.06 0 0 0 0 0 0 0 0 -2397.31 
0 0 0 0 0 0 0 0 0 -270.928 0 0 0 0 0 0 0 0 0 0 0 0 0 0 0 -2176.35 2108.91 0 0 0 0 0 0 0 0 0 0 2146.29 0 0 0 0 0 0 0 0 0 0 0 0 0 0 2159.11 0 0.08 0 0 0 0 0 0 0 0 
0 0 0 0 0 0 0 0 0 0 0 0 0 0 0 0 0 0 2192.68 0 -911.359 -861.766 1623.2 0 0 0 0 0 0 0 0 0 0 0 2124.62 0 0 0 0 0 0 0 0 1163.75 0 681.86 0 0 0 0 0 0 0 0 0 0.09 0 0 0 0 0 0 0 
0 0 0 0 0 0 0 0 0 0 0 0 0 0 -659.276 0 0 0 0 0 -592.746 1094.62 0 0 0 0 0 0 0 0 0 0 0 0 0 2346.19 0 0 0 0 0 2074.42 0 0 0 0 0 0 0 0 0 0 0 0 0 0 0.04 0 0 0 0 0 0 
0 0 0 0 0 0 0 0 0 -1034.2 2176.05 0 0 0 -1396.45 0 0 0 293.054 0 0 0 0 0 0 0 0 0 0 0 0 0 0 0 0 0 0 -673.315 0 0 0 0 0 0 0 0 0 0 0 1433.23 0 0 0 0 0 0 0 0.03 0 0 0 0 0 
0 0 0 0 0 -1224.33 0 0 0 0 0 -2336.88 1870.4 0 0 0 0 0 0 0 1610.54 0 0 0 0 0 0 0 0 0 0 0 -453.276 0 0 2170.4 0 0 0 0 0 0 0 0 0 -1785.56 0 2422.33 0 0 0 0 0 0 0 0 0 0 0.01 0 0 0 -33.4941 
0 0 0 0 0 0 0 0 0 0 0 0 0 0 0 1480.99 0 0 0 0 372.707 0 -2379.91 0 0 0 0 0 0 -686.895 1517.46 0 0 0 0 0 0 0 0 0 0 0 0 0 0 1782.36 0 0 -420.469 0 0 904.035 -554.75 0 0 0 0 0 0 0 0 0 0 
0 0 0 0 0 335.017 0 0 0 0 0 0 0 0 1227.07 0 0 0 0 0 0 0 0 0 0 1984.39 0 0 0 -1610.39 0 0 0 0 0 -2296.59 0 0 0 284.814 0 0 0 715.125 0 644.78 329.218 0 0 0 0 0 0 0 0 0 0 0 0 0 0.05 -913.038 0 
0 0 0 0 0 0 -658.513 0 -823.161 0 0 0 0 0 0 0 0 0 0 0 0 0 2047.11 0 0 0 0 221.183 -118.03 0 0 0 0 0 0 0 0 0 613.346 0 224.387 0 0 0 0 -1280.79 0 1107.44 0 0 0 0 0 0 0 0 0 0 0 0 1938.15 0 0 
0 0 0 0 2286.22 0 0 0 0 0 0 0 0 0 0 904.035 -964.919 0 0 0 0 0 0 0 0 0 0 0 0 0 0 118.793 0 0 976.516 0 0 0 0 0 0 0 0 -220.725 0 2229.15 0 0 0 0 0 0 73.3207 -1924.73 0 0 0 0 8.92666 0 0 0 0.08 
