*Vertices 48
*Matrix 
0.07 824.839 1238.21 0 0 0 -1145.74 1937.39 0 0 0 0 0 0 0 0 0 0 1556.67 -1637.55 0 0 0 0 1985.46 0 0 0 0 0 0 0 -174.184 -1352.81 0 0 0 0 1576.66 0 0 2230.52 0 0 0 0 0 0 
580.386 0 0 0 -1937.85 0 0 0 0 0 0 0 0 0 0 0 0 0 0 1738.72 0 768.532 0 0 745.949 0 0 0 0 0 0 1984.39 0 0 0 2489.93 0 0 0 0 0 0 0 0 0 0 0 0 
-2033.98 0 0.07 0 0 0 0 0 0 0 0 195.09 0 0 0 0 1276.67 0 0 0 0 -822.703 0 0 0 643.712 0 0 0 0 0 0 0 0 0 0 1242.33 2095.32 0 0 0 0 0 0 0 0 0 0 
0 0 0 0.06 277.032 0 0 0 0 0 0 0 0 0 0 0 -149.922 0 1496.09 0 0 -1678.29 1987.14 0 -381.405 0 0 0 0 0 0 0 0 0 0 0 0 1676 0 0 0 0 0 0 0 0 0 0 
0 -288.476 0 2341.15 0.07 0 0 0 -364.162 0 0 0 0 0 0 0 0 0 -769.295 0 0 962.172 0 0 0 0 0 0 0 0 0 0 0 1704.08 -1987.9 0 0 0 0 0 0 0 0 0 0 0 0 0 
0 0 0 0 0 0.06 0 0 0 2392.88 0 0 0 0 -1267.51 0 0 0 0 0 0 0 0 0 0 0 0 307.398 0 0 0 0 0 0 0 0 0 0 2186.88 0 0 -720.466 0 0 0 0 0 0 
1137.04 0 0 0 0 0 0 338.832 0 0 -421.69 0 0 0 0 839.335 0 0 0 0 0 0 0 0 -2261.8 0 0 2471.47 0 0 0 0 -1718.42 0 0 0 0 0 0 346.919 0 0 0 0 0 0 0 0 
-863.903 0 0 0 0 0 911.664 0.06 0 0 1448.18 0 0 0 0 0 -472.655 0 0 2470.55 0 0 0 0 0 0 -811.106 0 159.841 0 0 0 0 0 0 0 0 1834.09 0 0 0 0 0 0 0 0 0 0 
0 0 0 0 122.15 0 0 0 0.03 0 0 0 0 0 1980.73 0 0 1467.71 0 0 698.645 0 0 0 0 87.054 0 0 0 0 0 0 0 0 0 0 -1531.19 0 2145.38 0 0 0 0 0 0 0 0 0 
0 0 0 0 0 181.661 0 0 0 0 0 0 1858.81 0 0 0 1840.49 0 0 2380.52 -1353.72 0 0 0 0 0 642.338 0 0 0 0 0 0 0 0 708.411 0 0 0 0 0 0 0 -300.836 0 0 0 0 
0 0 0 0 0 0 967.208 -364.772 0 0 0.03 0 -1394.92 0 0 0 0 0 2006.36 0 0 0 296.716 0 0 0 0 0 -168.233 -1157.64 0 0 1645.33 0 1508.15 -835.521 0 0 0 0 0 0 -102.008 0 0 0 0 0 
0 0 -146.565 0 0 0 0 0 0 0 0 0 0 0 0 0 0 0 0 0 0 0 2292.17 0 0 0 0 0 0 0 1859.42 0 0 0 0 0 0 0 0 0 0 0 0 0 0 0 0 0 
0 0 0 0 0 0 0 0 0 479.369 895.947 0 0.05 0 0 0 0 0 0 0 -2204.58 0 0 0 0 0 -2306.97 1839.58 0 0 0 0 0 0 0 0 824.534 0 0 0 0 816.599 0 0 0 0 0 0 
0 0 0 0 0 0 0 0 0 0 0 0 0 0.07 0 0 0 0 2374.72 0 0 -869.854 0 0 0 0 0 0 0 0 0 0 0 0 0 0 0 0 642.949 0 2008.19 0 -388.424 0 -382.473 0 0 0 
0 0 0 0 0 992.233 0 0 539.644 0 0 0 0 0 0.05 0 0 0 0 0 0 0 0 -575.045 0 0 2033.98 0 0 0 0 0 0 0 -0.0762963 -1690.04 0 0 0 0 0 0 0 0 0 0 0 0 
0 0 0 0 0 0 286.492 0 0 0 0 0 0 0 0 0.01 0 0 0 0 0 0 0 1152 0 -273.827 0 0 0 0 0 0 0 2125.54 0 0 0 0 0 0 0 0 0 0 0 0 0 0 
0 0 1780.22 434.049 0 0 0 -1372.19 0 166.25 0 0 0 0 0 0 0 0 0 0 0 0 0 0 0 0 0 0 0 0 0 0 0 0 0 0 -326.472 0 1323.05 0 0 0 2281.49 0 0 0 0 0 
0 0 0 0 0 0 0 0 486.084 0 0 0 0 0 0 0 0 0.08 0 0 1761.91 0 1162.53 1338.01 0 0 0 0 0 0 0 0 0 732.368 0 0 0 0 0 0 0 0 0 0 0 0 0 0 
844.523 0 0 1049.61 2400.36 0 0 0 0 0 -1166.65 0 0 -241.173 0 0 0 0 0.01 0 486.694 1117.51 0 1878.8 0 -998.794 0 0 0 0 0 0 -309.076 0 898.999 0 0 0 0 0 0 0 0 0 0 0 0 -890.912 
-1025.65 -568.636 0 0 0 0 0 902.356 0 2182.91 0 0 0 0 0 0 0 0 0 0.09 703.986 0 0 -999.863 0 0 0 1576.36 0 0 0 0 0 0 0 0 0 1447.87 -661.87 0 0 0 0 0 0 0 0 0 
0 0 0 0 0 0 0 0 1173.97 -689.337 0 0 1642.58 0 0 0 0 2377.32 1189.69 -1615.27 0.07 0 0 0 1696.14 0 0 0 0 1765.11 0 0 0 -56.5355 0 -18.6926 0 0 0 0 0 0 0 0 0 0 0 0 
0 1416.9 -137.867 1000.17 -430.387 0 0 0 0 0 0 0 0 300.836 0 0 0 0 1012.38 0 0 0.04 0 0 0 0 0 0 0 0 0 0 0 0 0 0 0 0 0 0 1784.04 0 1526 0 0 0 0 0 
0 0 0 212.027 0 0 0 0 0 0 -1607.79 2127.67 0 0 0 0 0 1392.94 0 0 0 0 0.01 0 0 0 0 0 0 0 0 0 0 0 0 0 0 0 0 0 0 0 0 0 0 -2075.95 0 0 
0 0 0 0 0 0 0 0 0 0 0 0 0 0 2019.18 -210.501 0 1933.58 1170.46 855.358 0 0 0 0.04 0 0 0 0 0 0 0 0 0 0 0 0 0 0 0 0 0 0 0 0 0 0 0 0 
2241.05 2498.93 0 177.541 0 0 231.407 0 0 0 0 0 0 0 0 0 0 0 0 0 2134.39 0 0 0 0 0 0 0 0 0 0 0 0 0 0 0 0 0 0 -2162.77 0 0 1855.14 0 0 0 0 0 
0 0 1306.42 0 0 0 0 0 1564.15 0 0 0 0 0 0 -262.078 0 0 -1371.58 0 0 0 0 0 0 0.08 0 0 0 0 0 0 0 -41.8867 0 0 0 0 0 0 0 2275.38 0 0 0 0 0 0 
0 0 0 0 0 0 0 -566.805 0 -1229.36 0 0 -984.603 0 2452.39 0 0 0 0 0 0 0 0 0 0 0 0.04 0 0 0 0 0 0 0 0 0 0 0 0 0 707.495 0 0 0 0 0 0 0 
0 0 0 0 0 -706.58 2395.78 0 0 0 0 0 -2301.17 0 0 0 0 0 0 2029.86 0 0 0 0 0 0 0 0.04 0 0 0 0 0 0 0 0 0 0 0 0 652.562 0 0 0 0 0 0 0 
0 0 0 0 0 0 0 303.735 0 0 1935.41 0 0 0 0 0 0 0 0 0 0 0 0 0 0 0 0 0 0.02 0 0 -981.704 0 0 961.409 0 0 0 0 299.921 0 0 0 0 0 0 0 0 
0 0 0 0 0 0 0 0 0 0 1373.71 0 0 0 0 0 0 0 0 0 1552.86 0 0 0 0 0 0 0 0 0.07 0 0 2254.02 0 1610.08 0 0 -2269.13 -611.362 204.245 0 0 0 0 0 0 0 0 
0 0 0 0 0 0 0 0 0 0 0 1410.18 0 0 0 0 0 0 0 0 0 0 0 0 0 0 0 0 0 0 0.08 0 0 0 0 1271.63 0 0 0 0 0 0 0 0 0 0 0 0 
0 -1413.08 0 0 0 0 0 0 0 0 0 0 0 0 0 0 0 0 0 0 0 0 0 0 0 0 0 0 -1156.12 0 0 0.03 0 0 0 2280.11 0 0 -1796.55 590.609 2465.82 0 0 0 0 0 0 0 
1328.55 0 0 0 0 0 591.372 0 0 0 1847.21 0 0 0 0 0 0 0 591.678 0 0 0 0 0 0 0 0 0 0 2058.55 0 0 0.04 0 0 0 -735.115 0 0 0 -2154.53 0 2311.55 0 0 0 0 0 
-59.5874 0 0 0 2490.23 0 0 0 0 0 0 0 0 0 0 -1.29704 0 619.907 0 0 910.901 0 0 0 0 -484.252 0 0 0 0 0 0 0 0.09 0 0 0 0 -1598.18 0 -87.9696 0 0 0 0 0 0 0 
0 0 0 0 -1774.27 0 0 0 0 0 35.783 0 0 0 -874.584 0 0 0 -2049.7 0 0 0 0 0 0 0 0 0 2145.22 1648.08 0 0 0 0 0.03 0 0 0 0 0 1654.48 1629.46 0 0 0 0 0 0 
0 1896.65 0 0 0 0 0 0 0 -871.075 -809.427 0 0 0 1110.64 0 0 0 0 0 808.206 0 0 0 0 0 0 0 0 0 -2337.03 224.235 0 0 0 0.04 0 2257.68 0 0 0 0 0 0 0 0 0 0 
0 0 2012.92 0 0 0 0 0 552.919 0 0 0 1746.65 0 0 0 -2179.1 0 0 0 0 0 0 0 0 0 0 0 0 0 0 0 1828.29 0 0 0 0.04 0 0 0 1922.9 0 0 0 0 0 0 0 
0 0 -1145.74 452.361 0 0 0 -631.962 0 0 0 0 0 0 0 0 0 0 0 758.309 0 0 0 0 0 0 0 0 0 1718.42 0 0 0 0 0 -693.609 0 0.07 0 0 0 1345.94 0 0 0 0 -442.289 0 
-1175.04 0 0 0 0 2028.03 0 0 1760.99 0 0 0 0 -1361.51 0 0 2182 0 0 -1859.57 0 0 0 0 0 0 0 0 0 2110.74 0 -203.482 0 846.507 0 0 0 0 0.02 0 0 1698.13 0 0 0 0 0 0 
0 0 0 0 0 0 -1461 0 0 0 0 0 0 0 0 0 0 0 0 0 0 0 0 0 2260.12 0 0 0 2434.54 -1219.29 0 -2034.9 0 0 0 0 0 0 0 0.03 0 1305.05 0 0 0 0 0 0 
0 0 0 0 0 0 0 0 0 0 0 0 0 -203.177 0 0 0 0 0 0 0 987.045 0 0 0 0 548.646 -322.352 0 0 0 349.513 -2166.13 2146.29 -1491.21 0 1787.7 0 0 0 0.09 0 0 0 0 0 0 0 
378.048 0 0 0 0 -987.503 0 0 0 0 0 0 730.232 0 0 0 0 0 0 0 0 0 0 0 0 1608.4 0 0 0 0 0 0 0 0 -998.337 0 0 1026.11 218.131 -1472.44 0 0.01 0 0 0 0 0 0 
0 0 0 0 0 0 0 0 0 0 -1883.98 0 0 -8.77407 0 0 2138.66 0 0 0 0 186.239 0 0 2467.8 0 0 0 0 0 0 0 2086.78 0 0 0 0 0 0 0 0 0 0 0 0 0 0 0 
0 0 0 0 0 0 0 0 0 1581.7 0 0 0 0 0 0 0 0 0 0 0 0 0 0 0 0 0 0 0 0 0 0 0 0 0 0 0 0 0 0 0 0 0 0.04 0 0 0 0 
0 0 0 0 0 0 0 0 0 0 0 0 0 701.086 0 0 0 0 0 0 0 0 0 0 0 0 0 0 0 0 0 0 0 0 0 0 0 0 0 0 0 0 0 0 0.01 0 0 0 
0 0 0 0 0 0 0 0 0 0 0 0 0 0 0 0 0 0 0 0 0 0 937.91 0 0 0 0 0 0 0 0 0 0 0 0 0 0 0 0 0 0 0 0 0 0 0.04 0 0 
0 0 0 0 0 0 0 0 0 0 0 0 0 0 0 0 0 0 0 0 0 0 0 0 0 0 0 0 0 0 0 0 0 0 0 0 0 2197.1 0 0 0 0 0 0 0 0 0.01 0 
0 0 0 0 0 0 0 0 0 0 0 0 0 0 0 0 0 0 1042.28 0 0 0 0 0 0 0 0 0 0 0 0 0 0 0 0 0 0 0 0 0 0 0 0 0 0 0 0 0.09 
