*Vertices 52
*Matrix 
0.03 0 0 2340.24 0 0 0 0 0 945.997 0 0 0 1296.35 0 2228.08 0 0 0 -2453.76 0 0 0 0 0 0 0 0 -165.181 0 0 0 0 0 0 0 0 0 -1649.45 0 0 0 0 0 -1749.85 0 0 0 0 0 0 1882.31 
0 0.04 0 0 1706.67 471.129 -768.532 -2033.68 0 0 0 0 0 0 0 -703.375 0 0 -80.7978 0 0 0 0 0 0 0 0 1597.42 0 -713.904 0 0 0 0 0 0 0 0 0 0 0 0 0 1905.5 0 0 0 0 0 0 0 0 
0 0 0 0 0 0 0 1660.44 0 1503.88 -15.6407 0 0 0 0 1921.67 0 0 609.073 0 0 -356.838 -167.928 0 0 0 0 0 -1180.38 0 0 0 501.648 1618.47 -615.329 0 0 0 -1579.71 0 0 0 0 0 78.814 -1475.49 0 0 -79.577 0 0 0 
-2138.97 0 0 0.08 0 -1598.18 0 -1864.91 0 2266.08 0 1638.77 0 0 0 0 0 0 0 0 0 0 2088.46 0 0 0 0 0 2425.08 2231.44 0 1111.71 -104.297 0 1001.08 -1421.17 0 0 0 0 -31.2052 -1418.58 0 0 1170.61 435.118 0 0 0 0 1848.73 0 
0 -1267.36 0 0 0.08 0 0 77.7459 0 0 0 0 0 0 0 0 0 1638 0 0 2480.47 0 0 -1427.43 0 1803.72 0 0 0 0 -1383.33 0 0 2453.15 -215.537 0 -362.026 1363.34 -2413.17 -707.038 0 -1317.71 0 0 0 0 1711.25 0 0 0 1753.52 0 
0 1659.52 0 649.052 0 0.07 0 0 0 0 2295.07 0 0 0 0 0 2277.67 0 958.357 -2286.83 0 0 0 0 0 0 0 0 349.818 0 0 -709.174 0 0 0 -882.977 0 0 0 0 0 0 -1946.39 0 0 -1963.03 0 1079.06 1819.28 2316.58 0 0 
0 -1072.8 0 0 0 0 0.09 2175.44 -427.946 0 0 0 0 0 0 -2421.87 0 -655.461 0 1785.56 0 1715.83 -370.418 0 293.97 0 0 0 -1225.55 0 0 0 0 0 0 2118.98 0 472.045 0 0 0 0 0 0 0 0 0 40.0555 0 2394.25 0 0 
0 -746.254 252.159 -63.4022 -1744.51 0 1671.58 0.05 0 0 0 0 0 0 0 0 -356.075 0 0 0 0 0 -540.101 -2346.49 0 -1902.3 2162.16 0 0 2353.97 -1007.34 892.285 0 0 1400.72 -1967.15 0 0 0 0 1641.36 0 765.786 0 0 0 1410.64 1415.83 0 38.0718 0 0 
0 0 0 0 0 0 342.952 0 0.05 0 0 0 -292.749 -346.004 2315.97 0 0 0 0 -999.71 0 0 0 0 0 687.048 0 0 0 0 0 0 0 0 0 0 1535.46 2341 -717.414 0 0 0 -1633.12 0 0 0 2294.76 0 0 1551.64 0 0 
678.045 0 349.513 1736.43 0 0 0 0 0 0.01 2445.22 0 0 0 0 0 0 0 0 0 0 0 0 0 0 0 0 0 0 0 0 0 0 0 0 626.774 0 0 0 0 0 -375.912 0 0 0 -1401.18 0 0 1998.12 0 0 0 
0 0 371.487 0 0 1470.15 0 0 0 -2252.19 0 0 0 0 0 0 0 2003.77 0 0 1595.13 0 -148.244 0 0 0 0 0 817.209 0 0 0 640.812 0 0 0 0 0 0 0 -799.203 -15.183 0 0 0 0 0 0 0 0 0 0 
0 0 0 327.082 0 0 0 0 0 0 0 0.08 1499.76 0 0 -1695.84 1557.59 0 0 0 0 0 1301.69 -1133.69 0 1781.44 0 1471.68 0 1190.45 0 0 0 0 0 1630.38 -1983.32 1317.1 0 0 2115.16 0 0 0 0 0 -2279.5 0 -398.953 0 0 0 
0 0 0 0 0 0 0 0 715.583 0 0 1944.41 0.04 -2354.43 2457.73 0 0 -199.362 0 0 0 0 0 0 0 308.618 2364.96 2403.1 0 -812.784 0 0 0 0 0 -2003.62 0 1226.46 0 -1126.21 0 0 2480.93 -2053.21 0 0 0 785.47 -1252.86 -1561.1 2171.16 2116.69 
2403.71 0 0 0 0 0 0 0 2331.39 0 0 0 -2032.76 0.05 0 0 0 1730.32 0 0 0 0 0 0 0 0 0 0 -480.285 0 0 0 0 -133.137 0 0 0 968.734 0 0 -519.349 0 0 0 0 0 0 0 0 0 0 0 
0 0 0 0 0 0 0 0 946.608 0 0 0 -1515.02 0 0.08 0 0 0 909.68 0 -926.008 2042.53 1595.58 0 0 -716.956 1351.74 0 -210.196 0 0 0 0 26.6274 0 0 0 0 0 411.161 1772.9 0 1775.19 -2193.75 0 0 0 0 0 1886.27 0 0 
835.521 -1213.64 -67.6748 0 0 0 -534.761 0 0 0 0 602.054 0 0 0 0.06 0 0 894.726 0 0 -537.812 -722.144 0 0 0 1237.75 0 0 0 0 -84.9178 2074.42 0 0 0 0 0 0 0 0 0 0 0 0 0 0 -1123.92 0 0 -59.1296 0 
0 0 0 0 0 398.648 0 -1742.99 0 0 0 133.9 0 0 0 0 0.02 0 0 0 0 0 0 0 0 0 -567.263 0 0 0 0 0 0 0 0 0 -856.883 0 0 0 0 0 0 0 0 0 1750.92 0 2140.49 0 0 0 
0 0 0 0 1609.47 0 -1267.36 0 0 0 2468.26 0 1397.98 -875.958 0 0 0 0.01 0 0 -487.915 0 0 0 0 0 0 1530.58 0 0 -353.023 0 0 -1251.18 1518.37 0 0 0 0 -1649.6 0 0 -990.249 0 0 0 0 0 0 0 0 0 
0 1646.24 -278.405 0 0 2379.45 0 0 0 0 0 0 0 0 -2400.36 41.8867 0 0 0.02 0 0 0 2370.14 0 -2083.73 0 -795.236 2139.27 -2283.17 0 0 0 0 0 0 0 0 321.741 0 -623.722 2283.17 1575.9 0 0 0 0 0 2205.04 0 0 0 0 
2434.84 0 0 0 0 2078.39 1557.28 0 1766.49 0 0 0 0 0 0 0 0 0 0 0.07 0 1165.88 0 1607.03 0 0 0 0 -1574.68 0 -536.286 0 0 0 -191.885 0 0 2021.62 -2134.69 0 -2382.05 0 0 0 499.512 0 1948.53 0 0 997.879 1717.35 0 
0 0 0 0 -633.946 0 0 0 0 0 -533.692 0 0 0 1168.48 0 0 -1381.95 0 0 0.06 0 0 0 0 0 0 0 0 2410.89 -1372.65 0 0 0 0 0 -820.566 0 0 0 1770.15 0 1985.31 0 0 0 -592.898 -624.638 0 0 -901.135 2201.22 
0 0 -1010.54 0 0 0 1274.07 0 0 0 0 0 0 0 -2066.48 829.722 0 0 0 86.9015 0 0.06 724.281 0 0 -2164.75 0 0 0 0 0 736.641 0 0 0 0 1891.16 1922.13 674.383 0 -1729.87 0 0 0 0 0 966.597 0 -724.891 0 0 0 
0 0 1076.92 -1788.16 0 0 -679.571 596.561 0 0 -35.783 -593.966 0 0 300.836 564.211 0 0 627.842 0 0 436.186 0.04 0 1102.25 0 0 -385.067 -557.039 0 786.538 0 2390.44 0 0 1458.25 0 0 2186.88 -2499.85 0 0 0 2024.52 0 2460.17 601.444 2100.36 -524.842 0 1721.63 1421.48 
0 0 0 0 -801.187 0 0 -925.245 0 0 0 -913.8 0 0 0 0 0 0 0 1517.3 0 0 0 0.01 0 -766.549 0 0 0 2433.32 2328.33 1589.94 0 0 0 2294.46 -1274.68 0 2114.86 -503.174 0 0 0 0 293.97 0 0 379.574 0 0 -2466.43 0 
0 0 0 0 0 0 -2459.11 0 0 0 0 0 0 0 0 0 0 0 1063.95 0 0 0 -2275.54 0 0.04 0 0 1539.28 -1417.81 0 0 0 0 0 0 0 475.555 461.058 0 0 1099.05 0 0 1464.51 0 648.9 0 711.921 0 0 1100.42 0 
0 0 0 0 295.953 0 0 192.953 -1440.4 0 0 914.563 744.728 0 -41.5815 0 0 0 0 0 0 2389.22 0 2186.88 0 0.06 0 0 503.937 0 0 0 2106.77 -239.341 -1897.56 0 1944.11 0 0 1244.62 0 0 0 0 0 0 0 0 0 1606.42 0 272.301 
0 0 0 0 0 0 0 1631.75 0 0 0 0 -1608.55 0 1875.13 -888.775 1656.62 0 -172.201 0 0 0 0 0 0 0 0.01 0 0 1926.86 -1177.63 0 0 0 0 0 0 -1612.37 0 0 0 0 -1889.93 2207.17 0 0 0 0 2011.7 2068.77 0 -1296.04 
0 -196.921 0 0 0 0 0 0 0 0 0 947.829 -1802.96 0 0 0 0 1713.39 2162.01 0 0 0 2018.27 0 -1379.51 0 0 0.03 0 0 0 939.894 0 0 0 -1467.1 0 0 1777.17 0 0 0 0 0 0 0 0 0 0 0 -970.107 0 
414.518 0 -665.227 1952.8 0 1412.93 1859.87 0 0 0 970.412 0 0 -1194.11 113.3 0 0 0 -1753.21 273.675 0 0 147.328 0 -435.575 -581.454 0 0 0.05 0 1050.22 0 0 1024.58 0 0 0 0 0 0 0 0 0 0 0 0 0 0 0 0 960.646 0 
0 1997.97 0 -116.657 0 0 0 -502.411 0 0 0 1431.09 1750.92 0 0 0 0 0 0 0 1746.19 0 0 -2189.02 0 0 2433.01 0 0 0.07 0 -440.153 0 0 0 -326.93 0 0 1928.08 0 0 1366.24 0 0 0 0 1611.15 -465.026 0 0 0 0 
0 0 0 0 -427.335 0 0 -2324.82 0 0 0 0 0 0 0 0 0 391.476 0 2071.06 2183.52 0 2476.96 -595.798 0 0 -1020.77 0 1607.18 0 0.03 0 -194.937 0 0 0 672.246 2263.33 0 0 -1733.99 0 512.787 0 0 0 0 0 -1006.58 0 0 -1551.79 
0 0 0 -1444.36 0 94.5311 0 2007.58 0 0 0 0 0 0 0 1435.82 0 0 0 0 0 -2004.99 0 1438.26 0 0 0 1544.77 0 304.498 0 0.06 0 0 0 794.015 0 0 0 1617.56 0 0 0 0 0 0 0 1082.42 0 0 260.857 0 
0 0 1053.42 1267.82 0 0 0 0 0 0 -460.906 0 0 0 0 -749.916 0 0 0 0 0 0 -1786.63 0 0 875.958 0 0 0 0 2434.69 0 0.09 -91.4792 0 0 0 0 0 0 0 2425.38 0 -373.165 0 -579.47 0 -885.113 2092.58 0 0 0 
0 0 233.238 0 531.098 0 0 0 0 0 0 0 0 2240.9 1003.98 0 0 2151.78 0 0 0 0 0 0 0 1320.61 0 0 1066.39 0 0 0 -2216.03 0.04 0 0 0 0 2436.98 0 0 0 1178.7 0 -1793.34 0 0 0 0 0 0 0 
0 0 1996.9 -1602.91 1109.73 0 0 -1759.93 0 0 0 0 0 0 0 0 0 -1765.72 0 514.924 0 0 0 0 0 -86.4437 0 0 0 0 0 0 0 0 0.08 0 0 0 1629.76 510.956 0 -1042.44 0 0 0 0 0 0 2198.02 1256.37 0 0 
0 0 0 1010.54 0 1925.79 1259.12 -1742.23 0 1858.81 0 -1602.91 -1909.01 0 0 0 0 0 0 0 0 0 1779.61 2245.93 0 0 0 1747.11 0 -1297.88 0 387.661 0 0 0 0.02 0 0 0 0 0 0 53.4837 0 0 0 0 2395.63 0 0 0 -1844.16 
0 0 0 0 -1239.89 0 0 0 -551.698 0 0 -472.045 0 0 0 0 -734.962 0 0 0 -1214.56 1964.55 0 508.362 2192.22 1414.76 0 0 0 0 -593.661 0 0 0 0 0 0.05 0 2244.56 0 0 0 0 0 0 0 1560.03 1832.56 0 0 0 0 
0 0 0 0 -357.295 0 557.649 0 536.439 0 0 -1160.39 2048.17 -1743.9 0 0 0 0 950.728 1737.95 0 538.575 0 0 10.9104 0 -1030.08 0 0 0 -1085.16 0 0 0 0 0 0 0.03 0 0 0 690.558 0 0 1590.4 0 0 0 0 0 0 0 
731.758 0 1687.44 0 -335.17 0 0 0 615.024 0 0 0 0 0 0 0 0 0 0 795.694 0 -2278.59 528.047 -903.119 0 0 0 157.857 0 1206.63 0 0 0 2296.14 -1406.98 0 524.842 0 0.07 0 0 0 0 0 -337.458 0 0 0 0 1515.47 791.269 -704.901 
0 0 0 0 814.768 0 0 0 0 0 0 0 -1587.95 0 1849.04 0 0 -626.926 -440.764 0 0 0 2185.2 1292.38 0 2245.48 0 0 0 0 0 -332.728 0 0 661.718 0 0 0 0 0.08 0 0 57.4511 0 1633.27 2489.78 0 0 0 -74.3889 0 0 
0 0 0 -2206.26 0 0 0 1686.22 0 0 -126.423 -2336.27 0 2314.6 145.039 0 0 0 1645.18 1792.12 1222.5 1720.1 0 0 302.82 0 0 0 0 0 687.048 0 0 0 0 0 0 0 0 0 0.07 0 -51.5 900.067 0 0 0 0 0 0 0 0 
0 0 0 -790.353 1683.32 0 0 0 0 1804.03 909.223 0 0 0 0 0 0 0 88.2748 0 0 0 0 0 0 0 0 0 0 1807.69 0 0 -357.601 0 -276.574 0 0 1589.94 0 0 0 0.07 448.698 0 0 0 1273 0 2043.29 0 0 0 
0 0 0 0 0 2448.58 0 863.598 972.091 0 0 0 725.654 0 -268.639 0 0 293.664 0 0 2080.83 0 0 0 0 0 -1676.15 0 0 0 649.815 0 0 -827.891 0 1835 0 0 0 -437.407 1634.65 1280.33 0 0 1442.99 0 0 0 -1046.86 0 0 0 
0 417.112 0 0 0 0 0 0 0 0 0 0 -1422.54 0 2463.38 0 0 0 0 0 0 0 -192.495 0 1388.82 0 127.491 0 0 0 0 0 -1121.48 0 0 0 0 0 0 0 2123.25 0 0 0.08 0 0 -2025.74 0 59.8926 0 -2432.4 1628.7 
-275.201 0 -1373.87 1709.27 0 0 0 0 0 0 0 0 0 0 0 0 0 0 0 -1663.95 0 0 0 -105.67 0 0 0 0 0 0 0 0 0 1019.24 0 0 0 1073.26 -1478.39 2476.5 0 0 1054.95 0 0.05 0 1089.74 0 -876.72 0 0 379.727 
0 0 2037.34 -582.827 0 1058.15 0 0 0 2307.89 0 0 0 0 0 0 0 0 0 0 0 0 1723 0 1957.38 0 0 0 0 0 0 0 -1214.26 0 0 0 0 0 0 -1051.29 0 0 0 0 0 0 -1351.59 0 1439.63 0 -167.013 0 
0 0 0 0 1762.98 0 0 226.066 2110.89 0 0 439.39 0 0 0 0 -225.761 0 0 71.7948 400.937 -1340.75 2127.52 0 0 0 0 0 0 -2243.34 0 0 0 0 0 0 2493.44 0 0 0 0 -514.924 0 1904.74 766.701 -14.8778 0.07 1209.98 0 -2088.46 0 0 
0 0 0 0 0 -1250.42 -356.38 2010.48 0 0 0 0 -272.759 0 0 -20.6763 0 0 1757.64 0 1776.41 0 556.886 228.202 -1363.8 0 0 0 0 220.573 0 249.718 -2152.39 0 0 1900.01 1467.71 0 0 0 0 0 0 0 0 0 707.343 0.09 -1533.33 0 0 0 
0 0 2161.85 0 0 -2180.01 0 0 0 2207.17 0 287.713 1966.23 0 0 0 655.309 0 0 0 0 2039.63 1727.88 0 0 0 2276.76 0 0 0 -2000.56 0 1949.45 0 -2334.28 0 0 0 0 0 0 1751.69 1250.27 -973.617 -2349.09 -1001.24 0 395.901 0.05 -1772.9 0 0 
0 0 0 0 0 -1236.38 948.134 1471.68 -713.904 0 0 0 880.688 0 -4.65407 0 0 0 0 923.414 0 0 0 0 0 1040.45 -448.241 0 0 0 0 0 0 0 1116.75 0 0 0 -671.789 -961.715 0 0 0 0 0 0 1921.06 0 1770.76 0.02 0 0 
0 0 0 7.55333 720.923 0 0 0 0 0 0 0 -585.727 0 0 768.99 0 0 0 2090.29 -2498.93 0 -192.038 80.34 1667.3 0 0 619.602 1169.24 0 0 1024.74 0 0 0 0 0 0 -734.962 0 0 0 0 2462.16 0 -103.687 0 0 0 0 0.01 0 
534.608 0 0 0 0 0 0 0 0 0 0 0 1408.35 0 0 0 0 0 0 0 -1454.74 0 -2097 0 0 1728.34 1283.53 0 0 0 -518.586 0 0 0 0 -680.181 0 0 2325.43 0 0 0 0 -1444.21 790.963 0 0 0 0 0 0 0.05 
