*Vertices 58
*Matrix 
0.03 0 0 0 0 0 0 0 0 0 0 0 0 0 0 -1893.75 0 0 0 2426.3 1954.02 0 0 0 0 0 0 0 0 0 0 2160.79 0 0 0 895.184 0 0 0 -1751.69 0 0 0 0 0 0 0 0 0 0 -664.922 0 0 0 -797.83 0 0 1451.84 
0 0.03 0 0 0 0 0 0 0 0 1094.16 0 295.953 0 0 2342.22 0 0 -133.137 0 0 0 0 0 0 -723.06 0 0 0 0 0 0 0 0 0 0 0 0 0 0 0 0 0 0 0 0 0 0 685.064 0 0 -1885.2 0 0 0 0 0 0 
0 0 0.09 0 0 -2151.02 0 0 0 0 484.863 0 0 0 2465.67 0 0 0 0 0 0 0 0 0 0 0 0 0 0 0 0 0 0 0 0 0 0 0 0 0 0 0 0 0 0 0 0 0 0 0 0 0 0 0 0 0 0 0 
0 0 0 0.09 0 1736.73 0 0 0 0 0 0 0 0 0 -2071.21 0 0 0 0 0 0 0 0 0 0 0 0 0 0 0 0 0 0 0 0 0 0 -1012.53 0 0 1681.65 0 0 483.642 0 0 0 0 0 -1846.6 0 0 2343.9 0 -2272.48 0 1935.71 
0 0 0 0 0.02 0 0 0 0 0 0 0 -762.429 0 0 0 0 0 -817.82 0 -937.605 0 0 1445.28 0 0 0 0 0 0 448.241 0 0 0 0 0 715.125 0 0 0 0 0 0 0 0 0 -1546.91 0 0 0 0 0 0 0 2338.86 0 0 0 
0 0 2166.13 2067.55 0 0.09 0 0 0 -1756.87 0 0 0 0 0 0 0 0 0 -531.709 0 0 0 0 -1694.77 0 0 0 0 0 0 0 0 0 0 0 0 0 0 0 0 2288.05 92.5474 0 1337.24 0 0 0 0 0 0 0 0 0 0 0 0 1049.46 
0 0 0 0 0 0 0.07 1454.59 0 663.396 0 0 0 -1732.76 769.753 0 0 0 1024.58 0 0 0 1576.97 0 0 0 0 0 0 0 0 0 0 -265.893 0 0 0 0 0 0 0 0 0 0 0 0 -823.618 0 0 0 2482.15 0 0 -1143.45 970.87 0 0 0 
0 0 0 0 0 0 1917.55 0.08 0 0 0 0 0 0 0 0 0 0 0 0 0 0 1663.79 -2336.73 0 1907.18 0 0 0 0 2481.84 0 0 0 0 1526.31 0 0 1028.09 0 0 0 0 0 0 -1273.31 0 0 -1237.6 0 0 0 0 0 0 0 0 0 
0 0 0 0 0 0 0 0 0.02 0 0 0 437.254 246.361 0 0 0 2454.53 -627.842 0 2466.12 0 0 0 0 1404.39 0 0 0 0 0 0 -604.343 0 0 0 0 0 0 0 0 0 0 0 -555.666 0 0 0 0 -294.122 0 0 0 0 0 0 0 0 
0 0 0 0 0 1950.67 1942.12 0 0 0.08 0 0 0 0 0 0 0 0 0 0 0 0 0 0 0 0 0 0 0 0 0 0 0 0 -2317.96 27.2378 0 371.487 0 -1591.77 2475.43 0 0 0 0 0 0 0 0 0 0 0 0 0 0 0 0 -116.504 
0 1889.63 1304.59 0 0 0 0 0 0 0 0 0 0 0 0 0 382.931 0 0 -2082.81 867.107 0 0 0 2325.89 0 0 0 0 0 0 0 0 0 0 0 0 0 0 0 1657.99 0 -1254.69 0 0 -61.2659 0 0 0 2005.75 0 0 -2172.23 0 0 923.109 0 -2211.75 
0 0 0 0 0 0 0 0 0 0 0 0.03 1412.02 0 -481.353 0 0 0 0 0 0 0 0 0 0 0 0 0 0 0 0 0 0 0 0 0 2310.79 0 0 0 -1355.86 0 0 0 0 0 -998.337 0 0 0 0 0 0 0 0 0 0 0 
0 1589.02 0 0 124.897 0 0 0 216.91 0 0 859.172 0.04 0 0 0 0 0 0 2122.79 0 -420.011 0 0 0 0 0 0 0 0 0 0 0 0 0 0 0 0 2014.3 0 0 0 0 0 0 0 0 0 0 0 0 -512.024 0 0 0 0 0 -1513.18 
0 0 0 0 0 0 1249.2 0 1524.78 0 0 0 0 0.03 0 0 374.233 2331.54 94.2259 0 0 0 0 0 0 0 0 0 0 152.669 0 0 0 0 0 0 0 0 0 0 0 0 0 0 0 0 0 0 0 0 0 0 0 0 0 0 0 0 
0 0 -691.168 0 0 0 760.14 0 0 0 0 -1128.65 0 0 0 0 0 0 0 0 0 0 0 0 0 0 0 0 0 0 0 0 0 0 0 0 0 0 0 2052.29 2400.51 0 0 0 0 966.903 0 0 0 0 0 0 0 0 0 0 0 0 
-769.448 2189.63 0 908.307 0 0 0 0 0 0 0 0 0 0 0 0.09 0 0 0 0 0 0 -1821.27 -439.238 0 0 0 0 0 0 0 0 0 0 0 0 0 0 0 0 0 0 0 0 0 0 1308.71 0 0 -267.266 0 0 0 0 0 0 0 0 
0 0 0 0 0 0 0 0 0 0 2470.4 0 0 -1300.47 0 0 0.06 0 0 0 0 -1213.95 0 0 0 0 0 0 0 0 0 1221.73 -1454.44 404.141 0 0 0 0 0 0 0 0 0 0 0 0 0 0 0 1067.16 0 0 723.518 0 0 0 2310.94 0 
0 0 0 0 0 0 0 0 2253.56 0 0 0 0 2337.64 0 0 0 0.04 0 0 0 0 0 -2425.38 0 1407.59 0 0 0 975.143 0 0 1150.32 0 0 0 0 0 0 0 0 0 0 0 0 0 0 0 0 0 0 0 0 0 0 0 0 0 
0 -1403.78 0 0 2359.77 0 2389.22 0 911.054 0 0 0 0 -569.247 0 0 0 0 0.02 0 0 0 0 156.331 0 0 0 0 0 0 -1121.33 190.512 0 0 46.617 0 0 0 0 0 0 -2127.67 0 0 0 0 0 0 0 0 0 0 0 0 0 0 0 2018.27 
-412.839 0 0 0 0 -140.767 0 0 0 0 1808.76 0 -1517.76 0 0 0 0 0 0 0.03 0 0 156.789 0 0 0 0 0 0 0 0 0 0 0 0 0 0 1926.71 0 0 0 2068.16 0 0 0 0 0 0 0 0 0 0 0 1841.56 0 0 0 0 
1661.05 0 0 0 -419.248 0 0 0 1365.93 0 832.774 0 0 0 0 0 0 0 0 0 0.06 0 0 0 2332.3 0 0 0 0 0 408.109 0 0 0 0 1597.57 0 0 0 0 0 0 0 0 0 0 0 71.337 -1577.88 0 0 0 0 0 0 220.878 0 0 
0 0 0 0 0 0 0 0 0 0 0 0 1942.27 0 0 0 846.355 0 0 0 0 0.06 0 2215.72 0 0 0 0 0 0 0 0 429.472 0 0 0 0 0 0 0 0 0 0 0 0 0 0 0 0 0 0 0 0 -155.416 0 0 0 1500.06 
0 0 0 0 0 0 32.1207 -946.455 0 0 0 0 0 0 0 544.679 0 0 0 1130.48 0 0 0.05 0 0 1987.44 -969.192 0 -770.211 0 0 0 0 0 0 0 0 0 0 0 0 0 0 0 0 0 0 0 0 0 0 0 0 0 0 0 0 1531.04 
0 0 0 0 1277.12 0 0 2166.28 0 0 0 0 0 0 0 2136.83 0 2254.63 2055.04 0 0 -273.522 0 0.06 0 0 0 0 0 0 0 0 0 0 0 0 0 1072.65 0 0 0 0 0 0 0 0 0 0 0 0 1054.95 0 0 0 0 0 0 0 
0 0 0 0 0 2336.27 0 0 0 0 -2032.46 0 0 0 0 0 0 0 0 0 1724.68 0 0 0 0.09 0 0 0 0 0 0 0 0 0 0 0 0 1770 0 0 0 66.1489 0 0 0 0 -625.553 0 0 0 0 0 -1813.33 0 0 0 0 309.076 
0 -161.977 0 0 0 0 0 -281.152 -1797.92 0 0 0 0 0 0 0 0 1449.55 0 0 0 0 333.186 0 0 0.07 0 0 2343.13 0 1424.68 1677.83 0 0 0 0 0 0 0 0 0 0 0 0 0 0 0 0 0 0 -1796.09 0 0 1544.62 0 0 0 0 
0 0 0 0 0 0 0 0 0 0 0 0 0 0 0 0 0 0 0 0 0 0 1200.37 0 0 0 0.01 0 0 0 1457.18 0 0 0 0 0 0 1600.16 0 0 0 0 1923.51 0 0 0 584.353 0 0 0 0 0 173.116 0 0 -1591.16 0 0 
0 0 0 0 0 0 0 0 0 0 0 0 0 0 0 0 0 0 0 0 0 0 0 0 0 0 0 0.03 0 0 0 0 0 0 0 0 0 0 0 0 0 0 868.023 0 0 0 943.251 0 0 2004.68 0 0 0 -2108.14 0 0 0 0 
0 0 0 0 0 0 0 0 0 0 0 0 0 0 0 0 0 0 0 0 0 0 2033.68 0 0 663.396 0 0 0.05 0 0 0 0 0 829.722 0 0 0 0 0 1883.37 0 0 1810.43 0 0 30.4422 0 0 0 0 0 0 0 2458.34 0 1109.42 0 
0 0 0 0 0 0 0 0 0 0 0 0 0 2056.72 0 0 0 1084.25 0 0 0 0 0 0 0 0 0 0 0 0.08 0 0 0 2119.13 0 0 -463.805 0 0 0 0 -1862.32 0 815.989 0 0 0 0 0 0 0 0 0 0 -1678.44 0 0 0 
0 0 0 0 -662.938 0 0 1931.59 0 0 0 0 0 0 0 0 0 0 1052.96 0 1299.71 0 0 0 0 2074.11 -130.085 0 0 0 0.01 0 0 0 0 0 0 0 0 0 0 2246.7 0 0 0 0 0 -217.368 0 0 0 2169.79 1669.9 0 0 0 0 0 
2382.66 0 0 0 0 0 0 0 0 0 0 0 0 0 0 0 -1650.67 0 1511.96 0 0 0 0 0 0 1015.12 0 0 0 0 0 0.08 211.264 2242.12 0 0 0 0 0 0 0 0 0 2426.3 0 2435.15 0 0 0 -1972.49 0 0 0 0 0 0 0 1803.11 
0 0 0 0 0 0 0 0 -50.1267 0 0 0 0 0 0 0 -757.851 1985 0 0 0 -505.615 0 0 0 0 0 0 0 0 0 -540.254 0.02 0 0 0 1030.38 0 0 0 0 0 0 0 0 2325.59 -1190.3 0 0 0 0 -356.38 0 216.605 0 0 0 0 
0 0 0 0 0 0 187.613 0 0 0 0 0 0 0 0 0 2097.31 0 0 0 0 0 0 0 0 0 0 0 0 2480.62 0 1765.42 0 0.07 0 0 0 -2091.66 1587.34 2448.73 0 0 1723.91 0 0 0 0 0 0 0 0 0 0 0 -906.629 0 0 0 
0 0 0 0 0 0 0 0 0 425.657 0 0 0 0 0 0 0 0 667.669 0 0 0 0 0 0 0 0 0 -612.583 0 0 0 0 0 0.09 0 1233.79 0 0 0 1548.13 0 0 897.626 0 0 0 0 0 0 0 0 0 0 0 0 0 0 
2275.38 0 0 0 0 0 0 -136.799 0 74.0837 0 0 0 0 0 0 0 0 0 0 815.836 0 0 0 0 0 0 0 0 0 0 0 0 0 0 0.01 -863.445 0 0 0 0 1940.44 0 0 0 0 0 0 0 0 0 0 0 0 0 0 0 0 
0 0 0 0 1549.65 0 0 0 0 0 0 1314.66 0 0 0 0 0 0 0 0 0 0 0 0 0 0 0 0 0 1744.36 0 0 -112.842 0 1928.39 -610.294 0 0 0 0 0 0 1209.07 0 0 0 0 0 0 0 0 0 -617.161 -1071.43 0 0 0 0 
0 0 0 0 0 0 0 0 0 -237.968 0 0 0 0 0 0 0 0 0 822.245 0 0 0 1112.02 2152.09 0 -1201.13 0 0 0 0 0 0 159.078 0 0 0 0.08 0 0 0 0 0 0 0 0 0 2372.89 0 -1542.02 0 0 0 0 0 0 0 0 
0 0 0 662.328 0 0 0 1036.79 0 0 0 0 2436.52 0 0 0 0 0 0 0 0 0 0 0 0 0 0 0 0 0 0 0 0 820.109 0 0 0 0 0.03 0 0 0 0 0 0 0 0 0 0 277.032 0 0 0 0 0 0 0 0 
-356.075 0 0 0 0 0 0 0 0 2172.99 0 0 0 0 947.676 0 0 0 0 0 0 0 0 0 0 0 0 0 0 0 0 0 0 479.675 0 0 0 0 0 0.03 0 0 -949.355 1698.58 0 2436.22 758.614 0 0 234.153 0 0 0 0 0 0 0 0 
0 0 0 0 0 0 0 0 0 1966.69 177.694 -1444.06 0 0 1003.22 0 0 0 0 0 0 0 0 0 0 0 0 0 316.858 0 0 0 0 0 675.451 0 0 0 0 0 0.06 0 0 0 0 0 81.1029 0 0 0 0 0 0 0 0 0 0 0 
0 0 0 1382.87 0 1155.81 0 0 0 0 0 0 0 0 0 0 0 0 1260.64 -1792.12 0 0 0 0 65.8437 0 0 0 0 681.402 -1340.91 0 0 0 0 2032 0 0 0 0 0 0.07 0 0 0 0 0 0 0 0 0 0 0 0 0 0 1755.81 326.472 
0 0 0 0 0 2105.85 0 0 0 0 -1446.65 0 0 0 0 0 0 0 0 0 0 0 0 0 0 0 102.466 2326.96 0 0 0 0 0 -1606.27 0 0 1899.7 0 0 -1910.84 0 0 0.09 0 0 0 0 0 0 0 0 0 0 0 2221.52 0 -1742.99 0 
0 0 0 0 0 0 0 0 0 0 0 0 0 0 0 0 0 0 0 0 0 0 0 0 0 0 0 0 -2320.7 2217.55 0 366.756 0 0 2035.05 0 0 0 0 -1079.36 0 0 0 0.07 0 0 0 0 1468.93 1394.92 0 0 0 0 0 0 0 0 
0 0 0 1715.06 0 1777.32 0 0 -397.58 0 0 0 0 0 0 0 0 0 0 0 0 0 0 0 0 0 0 0 0 0 0 0 0 0 0 0 0 0 0 0 0 0 0 0 0.03 0 -1391.26 0 0 0 0 0 0 0 0 0 0 -13.657 
0 0 0 0 0 0 0 841.014 0 0 2389.68 0 0 0 1308.4 0 0 0 0 0 0 0 0 0 0 0 0 0 0 0 0 -515.076 577.029 0 0 0 0 0 0 1583.99 0 0 0 0 0 0.01 0 0 0 0 0 -840.098 0 0 0 0 0 0 
0 0 0 0 911.054 0 -1540.8 0 0 0 0 1471.83 0 0 0 472.808 0 0 0 0 0 0 0 0 966.14 0 2351.22 2152.39 -2404.17 0 0 0 2357.63 0 0 0 0 0 0 -2334.13 1973.25 0 0 0 -635.014 0 0.07 1573.92 0 0 0 597.629 0 0 0 0 -1736.88 0 
0 0 0 0 0 0 0 0 0 0 0 0 0 0 0 0 0 0 0 0 663.396 0 0 0 0 0 0 0 0 0 1270.71 0 0 0 0 0 0 -1276.82 0 0 0 0 0 0 0 0 2266.84 0.07 0 1004.9 0 0 0 0 0 0 0 -1112.48 
0 -190.512 0 0 0 0 0 1655.86 0 0 0 0 0 0 0 0 0 0 0 0 2198.32 0 0 0 0 0 0 0 0 0 0 0 0 0 0 0 0 0 0 0 0 0 0 1420.56 0 0 0 0 0.07 0 0 0 0 0 0 0 0 0 
0 0 0 0 0 0 0 0 -1101.95 0 392.392 0 0 0 0 1264.15 175.405 0 0 0 0 0 0 0 0 0 0 -230.338 0 0 0 -1659.98 0 0 0 0 0 1668.22 630.131 474.487 0 0 0 -1969.13 0 0 0 2414.85 0 0.07 0 0 0 0 0 -1093.1 0 0 
1483.73 0 0 1869.49 0 0 640.965 0 0 0 0 0 0 0 0 0 0 0 0 0 0 0 0 -275.658 0 1431.09 0 0 0 0 0 0 0 0 0 0 0 0 0 0 0 0 0 0 0 0 0 0 0 0 0.03 0 0 0 0 0 0 0 
0 1585.06 0 0 0 0 0 0 0 0 0 0 187.307 0 0 0 0 0 0 0 0 0 0 0 0 0 0 0 0 0 -441.069 0 1659.06 0 0 0 0 0 0 0 0 0 0 0 0 1689.43 -1262.32 0 0 0 0 0.01 0 0 0 0 0 0 
0 0 0 0 0 0 0 0 0 0 -139.393 0 0 0 0 0 -1274.83 0 0 0 0 0 0 0 1696.6 0 1485.11 0 0 0 1832.26 0 0 0 0 0 -539.949 0 0 0 0 0 0 0 0 0 0 0 0 0 0 0 0.08 0 0 0 0 0 
0 0 0 916.547 0 0 2106.77 0 0 0 0 0 0 0 0 0 0 0 0 2476.96 0 -1569.49 0 0 0 971.48 0 -1591.46 0 0 0 0 -284.661 0 0 0 -68.8955 0 0 0 0 0 0 0 0 0 0 0 0 0 0 0 0 0 0 0 0 0 
-1437.35 0 0 0 -1432.46 0 1146.81 0 0 0 0 0 0 0 0 0 0 0 0 0 0 0 0 0 0 0 0 0 -444.578 622.196 0 0 0 249.565 0 0 0 0 0 0 0 0 1887.34 0 0 0 0 0 0 0 0 0 0 0 0.01 0 0 0 
0 0 0 1278.95 0 0 0 0 0 0 537.202 0 0 0 0 0 0 0 0 0 -1535.31 0 0 0 0 0 2080.98 0 0 0 0 0 0 0 0 0 0 0 0 0 0 0 0 0 0 0 0 0 0 259.331 0 0 0 0 0 0 0 0 
0 0 0 0 0 0 0 0 0 0 0 0 0 0 0 0 1901.68 0 0 0 0 0 0 0 0 0 0 0 1149.4 0 0 0 0 0 0 0 0 0 0 0 0 1134.75 841.319 0 0 0 -1639.68 0 0 0 0 0 0 0 0 0 0.09 0 
192.648 0 0 1635.72 0 -2031.54 0 0 0 1986.22 2014.6 0 1375.7 0 0 0 0 0 1871.32 0 0 -1550.57 -1835.76 0 -2167.5 0 0 0 0 0 0 624.332 0 0 0 0 0 0 0 0 0 741.676 0 0 1921.98 0 0 -814.31 0 0 0 0 0 0 0 0 0 0.08 
