*Vertices 57
*Matrix 
0.01 0 0 0 0 0 0 0 0 0 0 0 0 1296.2 0 0 1453.06 0 0 0 0 0 0 1274.68 0 0 0 -877.026 0 0 0 0 1688.82 0 0 0 0 0 0 0 2412.11 0 0 0 0 0 0 0 0 0 0 0 0 0 0 0 0 
0 0.08 0 0 0 0 0 0 0 0 0 0 0 -291.375 0 0 0 0 913.8 0 166.707 -1460.54 0 282.067 2303.92 0 0 672.246 0 0 0 0 0 0 0 0 0 0 0 0 0 0 0 0 0 0 0 0 0 0 0 0 0 0 0 0 0 
0 0 0.05 -47.6852 0 1359.98 0 0 0 0 0 -1028.24 0 0 -196.921 0 0 0 0 -858.257 0 0 0 0 -1289.48 0 0 0 0 0 2458.65 0 0 1308.25 0 0 0 0 0 0 0 0 0 0 0 0 0 0 0 0 0 0 0 0 0 0 0 
0 0 -1869.18 0.02 1768.93 0 0 0 2134.69 1475.49 0 0 0 0 855.663 832.316 0 0 -429.777 0 0 0 0 0 0 0 0 0 0 1924.88 1326.26 0 0 0 0 0 0 0 570.925 0 0 0 -426.267 0 -602.359 0 0 0 0 0 0 0 0 0 0 0 0 
0 0 0 215.079 0.04 0 0 0 0 0 0 0 0 2279.5 0 0 0 0 0 942.64 0 0 0 0 0 0 0 0 0 0 0 0 0 0 1559.11 1320.15 0 0 0 0 0 0 0 0 0 0 0 0 0 0 -2441.25 0 0 0 0 0 0 
0 0 891.827 0 0 0.02 0 0 0 0 0 0 0 0 0 0 0 0 0 0 0 0 0 366.604 0 0 0 0 0 0 0 0 0 1447.87 0 2136.52 0 0 0 0 0 0 0 0 0 0 0 0 0 0 0 0 0 0 0 0 0 
0 0 0 0 0 0 0 0 0 0 304.498 0 0 0 1015.43 19.1504 0 -1366.54 0 0 0 0 0 0 1829.97 -320.521 0 0 0 -331.965 0 0 0 0 0 0 0 0 0 0 0 0 0 0 0 0 0 0 0 0 0 0 0 0 0 0 0 
0 0 0 0 0 0 0 0.01 0 0 0 0 0 -204.55 0 0 0 0 0 0 0 0 0 0 0 0 0 0 0 0 0 0 0 0 0 0 1535 0 0 0 0 0 0 2114.4 0 0 0 0 0 0 0 0 0 0 0 0 0 
0 0 0 1221.58 0 0 0 0 0.05 0 0 0 0 0 0 0 0 2273.71 0 0 0 1891.31 849.406 0 0 0 0 0 -149.312 0 0 0 0 0 -2241.51 0 0 1491.67 -585.574 0 1921.52 0 0 0 0 0 0 0 0 0 0 0 0 0 0 0 0 
0 0 0 1761.76 0 0 0 0 0 0.03 0 0 0 2319.94 0 0 0 0 0 0 0 1542.02 0 0 0 0 0 0 0 0 0 0 0 0 0 0 0 0 0 0 0 0 0 0 0 0 0 0 0 0 0 0 0 0 0 0 0 
0 0 0 0 0 0 2382.05 0 0 0 0.04 -1679.66 0 0 0 0 0 0 0 0 0 0 0 0 -1672.03 0 1955.55 0 1792.43 0 0 0 2178.49 0 -1354.64 0 0 0 1679.2 0 0 0 0 0 0 0 0 0 0 0 0 0 0 0 0 0 0 
0 0 -179.067 0 0 0 0 0 0 0 864.971 0.08 0 0 0 0 0 0 0 0 1852.55 0 0 0 0 0 0 0 0 0 0 0 0 0 0 502.411 0 0 0 0 0 0 0 0 0 0 0 0 0 0 0 0 0 0 0 0 0 
0 0 0 0 0 0 0 0 0 0 0 0 0.07 -789.285 0 0 0 0 0 1850.57 2004.53 0 0 0 0 0 0 0 0 0 0 0 0 0 0 710.7 0 0 0 0 0 -489.441 0 -1710.33 0 0 0 0 0 0 0 0 0 0 0 0 0 
-2485.2 -2426.76 0 0 1517.91 0 0 -431.761 0 2350.46 0 0 2268.67 0.07 0 0 0 0 0 0 0 0 0 0 0 0 0 0 0 0 0 0 0 0 0 0 1273.31 0 0 0 0 0 0 0 0 0 0 0 0 0 0 0 0 0 0 0 0 
0 0 -328.608 1675.54 0 0 -1584.9 0 0 0 0 0 0 0 0.07 0 0 0 0 0 -785.165 0 0 0 0 943.251 0 0 0 0 0 0 0 2486.72 0 0 0 0 0 0 0 0 0 0 0 0 0 0 422.3 0 0 0 0 0 0 0 0 
0 0 0 -404.752 0 0 -1242.03 0 0 0 0 0 0 0 0 0.06 0 1216.09 0 0 0 2411.95 0 0 1550.72 1267.36 0 0 0 0 0 0 0 0 0 0 0 0 2237.54 0 0 0 0 0 0 0 0 0 0 0 0 0 0 0 0 0 0 
2342.98 0 0 0 0 0 0 0 0 0 0 0 0 0 0 0 0.04 0 0 0 0 0 -134.51 0 0 0 0 -27.8481 0 0 0 2415.62 0 0 1934.64 -1676 0 0 0 0 0 0 0 0 0 0 0 0 0 0 0 0 0 0 0 0 0 
0 0 0 0 0 0 2176.05 0 107.501 0 0 0 0 0 0 187.307 0 0.06 0 0 0 0 0 0 0 0 0 0 0 0 0 0 0 0 0 0 0 0 0 0 0 0 0 0 0 0 0 0 0 0 0 0 0 0 0 0 0 
0 2137.44 0 -1524.17 0 0 0 0 0 0 0 0 0 0 0 0 0 0 0.09 0 0 0 0 1248.59 0 0 0 0 0 0 0 1189.08 0 0 0 0 0 0 0 0 0 0 0 0 0 0 0 0 0 0 0 0 0 0 0 0 0 
0 0 187.002 0 1985.92 0 0 0 0 0 0 0 1475.8 0 0 0 0 0 0 0.06 0 0 0 0 1435.97 0 0 0 0 0 2247.46 0 0 0 0 -1986.22 0 0 0 0 0 0 -1916.33 0 0 2391.96 0 0 0 0 0 0 0 0 0 0 0 
0 2349.85 0 0 0 0 0 0 0 0 0 616.703 1500.37 0 -168.538 0 0 0 0 0 0.01 0 0 0 0 0 0 0 0 0 0 0 0 0 0 0 0 0 0 0 0 708.258 0 0 0 0 0 2215.87 0 0 0 0 0 0 0 0 0 
0 642.338 0 0 0 0 0 0 647.526 -694.22 0 0 0 0 0 799.051 0 0 0 0 0 0 0 0 0 -449.461 0 0 -2178.79 0 0 0 0 0 0 0 0 0 0 1727.88 1608.86 -23.7281 0 -10.4526 486.541 0 0 0 0 8.01111 0 0 0 0 0 1252.1 0 
0 0 0 0 0 0 0 0 841.777 0 0 0 0 0 0 0 -1697.36 0 0 0 0 0 0.07 0 0 2380.83 0 0 0 0 1136.74 -2414.55 0 0 0 0 0 0 1116.6 0 0 0 0 0 0 0 0 0 0 0 0 0 0 0 0 0 0 
1073.72 2319.94 0 0 0 -1746.8 0 0 0 0 0 0 0 0 0 0 0 0 973.159 0 0 0 0 0.03 0 0 0 0 0 0 -258.415 0 0 0 0 0 0 568.331 0 0 0 0 0 0 0 0 0 0 0 0 0 0 0 0 0 0 0 
0 109.943 -750.832 0 0 0 2323.45 0 0 0 2181.84 0 0 0 0 -1302.3 0 0 0 2447.51 0 0 0 0 0.03 -1565.83 0 0 0 0 0 1440.86 0 0 0 0 0 0 0 -2221.67 0 0 0 0 0 0 0 0 0 0 0 0 0 0 0 0 0 
0 0 0 0 0 0 -2118.82 0 0 0 0 0 0 0 -2287.59 2264.4 0 0 0 0 0 357.143 2491.15 0 2429.2 0.07 0 0 0 0 0 953.322 0 0 0 0 0 0 2115.31 0 0 0 0 0 0 0 0 0 0 0 0 0 0 0 0 0 0 
0 0 0 0 0 0 0 0 0 0 1084.4 0 0 0 0 0 0 0 0 0 0 0 0 0 0 0 0.08 0 0 0 0 0 0 0 0 0 0 0 0 0 0 1883.68 0 0 0 0 0 0 0 0 0 0 0 0 0 0 0 
951.491 -158.62 0 0 0 0 0 0 0 0 0 0 0 0 0 0 -1790.14 0 0 0 0 0 0 0 0 0 0 0.01 0 0 0 0 0 0 0 0 0 0 2210.23 1081.8 0 0 2478.18 0 0 0 0 0 0 0 0 0 0 0 0 0 0 
0 0 0 0 0 0 0 0 81.8659 0 2366.18 0 0 0 0 0 0 0 0 0 0 1378.14 0 0 0 0 0 0 0.04 0 0 0 2364.19 0 0 0 0 0 0 0 0 1080.89 0 0 0 0 0 0 0 0 0 0 0 0 0 0 0 
0 0 0 1506.16 0 0 459.685 0 0 0 0 0 0 0 0 0 0 0 0 0 0 0 0 0 0 0 0 0 0 0.06 0 0 0 0 -1818.06 0 0 0 0 0 0 0 0 0 0 0 0 0 0 0 0 0 0 0 0 0 0 
0 0 334.101 -631.962 0 0 0 0 0 0 0 0 0 0 0 0 0 0 0 -278.253 0 0 1287.8 713.752 0 0 0 0 0 0 0.07 1690.8 0 0 0 0 0 0 0 0 2079.76 0 0 0 -593.051 0 0 0 0 0 0 0 0 0 1027.18 0 0 
0 0 0 0 0 0 0 0 0 0 0 0 0 0 0 0 -403.684 0 -100.33 0 0 0 -233.848 0 1436.28 1709.42 0 0 0 0 -591.22 0.03 745.338 775.399 0 0 0 0 0 0 0 0 0 0 0 0 0 0 0 0 0 0 0 0 0 0 0 
-917.463 0 0 0 0 0 0 0 0 0 -387.051 0 0 0 0 0 0 0 0 0 0 0 0 0 0 0 0 0 -1737.65 0 0 2143.54 0.04 0 0 -1045.95 1973.25 18.2348 490.051 0 0 0 0 0 0 0 0 0 0 0 0 0 0 0 0 0 0 
0 0 -2456.05 0 0 2329.86 0 0 0 0 0 0 0 0 -787.759 0 0 0 0 0 0 0 0 0 0 0 0 0 0 0 0 2224.88 0 0.03 0 -196.158 0 284.967 0 0 1252.71 0 0 0 398.19 0 0 0 0 0 0 0 0 0 0 0 0 
0 0 0 0 1601.38 0 0 0 913.343 0 443.052 0 0 0 0 0 116.504 0 0 0 0 0 0 0 0 0 0 0 0 -179.525 0 0 0 0 0.05 0 -1029.31 0 0 0 -231.407 0 0 0 0 0 0 0 0 0 0 0 0 0 0 0 0 
0 0 0 0 -1860.79 2023.3 0 0 0 0 0 835.215 830.638 0 0 0 2357.33 0 0 -110.401 0 0 0 0 0 0 0 0 0 0 0 0 839.946 -1587.19 0 0.09 0 0 1872.84 0 0 0 0 0 0 0 0 0 0 0 0 0 0 2459.56 0 0 0 
0 0 0 0 0 0 0 1642.43 0 0 0 0 0 -80.7978 0 0 0 0 0 0 0 0 0 0 0 0 0 0 0 0 0 0 -453.124 0 -1178.24 0 0.08 0 0 0 1801.43 0 0 0 0 0 0 0 0 0 0 0 0 0 0 0 0 
0 0 0 0 0 0 0 0 2430.42 0 0 0 0 0 0 0 0 0 0 0 0 0 0 1714.3 0 0 0 0 0 0 0 0 -1741.46 2122.79 0 0 0 0.01 0 0 0 0 0 0 0 0 0 0 0 0 0 382.626 0 0 0 0 0 
0 0 0 -2051.84 0 0 0 0 -1567.96 0 -1336.33 0 0 0 0 1529.36 0 0 0 0 0 0 1177.18 0 0 2004.38 0 939.741 0 0 0 0 1370.51 0 0 356.38 0 0 0.06 0 1165.73 0 0 -368.13 0 0 0 0 0 0 0 0 0 0 0 0 0 
0 0 0 0 0 0 0 0 0 0 0 0 0 0 0 0 0 0 0 0 0 546.358 0 0 1404.54 0 0 1124.53 0 0 0 0 0 0 0 0 0 0 0 0.01 0 0 0 0 0 0 0 0 0 0 0 0 0 0 0 0 -1450.62 
1318.32 0 0 0 0 0 0 0 -209.586 0 0 0 0 0 0 0 0 0 0 0 0 421.995 0 0 0 0 0 0 0 0 2449.19 0 0 1902.3 -576.418 0 2110.58 0 1428.34 0 0.05 0 0 2203.51 0 0 0 0 0 0 0 0 0 0 0 0 0 
0 0 0 0 0 0 0 0 0 0 0 0 990.249 0 0 0 0 0 0 0 -1305.66 736.488 0 0 0 0 1500.82 0 871.838 0 0 0 0 0 0 0 0 0 0 0 0 0.01 0 0 0 0 1255.46 0 0 0 0 0 0 0 0 0 0 
0 0 0 -335.17 0 0 0 0 0 0 0 0 0 0 0 0 0 0 0 -733.436 0 0 0 0 0 0 0 2307.28 0 0 0 0 0 0 0 0 0 0 0 0 0 0 0.01 0 0 0 0 0 0 0 0 0 0 0 0 0 0 
0 0 0 0 0 0 0 1569.95 0 0 0 0 -582.217 0 0 0 0 0 0 0 0 1885.97 0 0 0 0 0 0 0 0 0 0 0 0 0 0 0 0 1867.2 0 987.198 0 0 0.04 0 0 0 0 0 0 0 0 0 0 0 0 0 
0 0 0 492.187 0 0 0 0 0 0 0 0 0 0 0 0 0 0 0 0 0 2341.3 0 0 0 0 0 0 0 0 1782.05 0 0 1068.22 0 0 0 0 0 0 0 0 0 0 0.05 0 0 0 0 0 0 0 0 0 0 0 0 
0 0 0 0 0 0 0 0 0 0 0 0 0 0 0 0 0 0 0 860.698 0 0 0 0 0 0 0 0 0 0 0 0 0 0 0 0 0 0 0 0 0 0 0 0 0 0.06 0 0 0 0 0 0 0 0 0 0 0 
0 0 0 0 0 0 0 0 0 0 0 0 0 0 0 0 0 0 0 0 0 0 0 0 0 0 0 0 0 0 0 0 0 0 0 0 0 0 0 0 0 979.72 0 0 0 0 0.04 0 0 0 0 0 0 0 0 0 0 
0 0 0 0 0 0 0 0 0 0 0 0 0 0 0 0 0 0 0 0 2005.91 0 0 0 0 0 0 0 0 0 0 0 0 0 0 0 0 0 0 0 0 0 0 0 0 0 0 0.09 0 0 0 0 0 0 0 0 0 
0 0 0 0 0 0 0 0 0 0 0 0 0 0 979.263 0 0 0 0 0 0 0 0 0 0 0 0 0 0 0 0 0 0 0 0 0 0 0 0 0 0 0 0 0 0 0 0 0 0.04 0 0 0 0 0 0 0 0 
0 0 0 0 0 0 0 0 0 0 0 0 0 0 0 0 0 0 0 0 0 997.879 0 0 0 0 0 0 0 0 0 0 0 0 0 0 0 0 0 0 0 0 0 0 0 0 0 0 0 0.03 0 0 0 0 0 0 0 
0 0 0 0 68.5903 0 0 0 0 0 0 0 0 0 0 0 0 0 0 0 0 0 0 0 0 0 0 0 0 0 0 0 0 0 0 0 0 0 0 0 0 0 0 0 0 0 0 0 0 0 0.01 0 0 0 0 0 0 
0 0 0 0 0 0 0 0 0 0 0 0 0 0 0 0 0 0 0 0 0 0 0 0 0 0 0 0 0 0 0 0 0 0 0 0 0 1241.72 0 0 0 0 0 0 0 0 0 0 0 0 0 0.03 2270.96 0 0 0 0 
0 0 0 0 0 0 0 0 0 0 0 0 0 0 0 0 0 0 0 0 0 0 0 0 0 0 0 0 0 0 0 0 0 0 0 0 0 0 0 0 0 0 0 0 0 0 0 0 0 0 0 643.864 0 0 0 0 0 
0 0 0 0 0 0 0 0 0 0 0 0 0 0 0 0 0 0 0 0 0 0 0 0 0 0 0 0 0 0 0 0 0 0 0 1666.69 0 0 0 0 0 0 0 0 0 0 0 0 0 0 0 0 0 0.09 0 0 0 
0 0 0 0 0 0 0 0 0 0 0 0 0 0 0 0 0 0 0 0 0 0 0 0 0 0 0 0 0 0 688.269 0 0 0 0 0 0 0 0 0 0 0 0 0 0 0 0 0 0 0 0 0 0 0 0.01 0 0 
0 0 0 0 0 0 0 0 0 0 0 0 0 0 0 0 0 0 0 0 0 528.504 0 0 0 0 0 0 0 0 0 0 0 0 0 0 0 0 0 0 0 0 0 0 0 0 0 0 0 0 0 0 0 0 0 0.02 0 
0 0 0 0 0 0 0 0 0 0 0 0 0 0 0 0 0 0 0 0 0 0 0 0 0 0 0 0 0 0 0 0 0 0 0 0 0 0 0 1900.62 0 0 0 0 0 0 0 0 0 0 0 0 0 0 0 0 0.09 
