*Vertices 49
*Matrix 
0.09 0 0 0 0 0 1363.34 0 1011.15 0 1913.74 -1038.93 0 -233.39 0 0 0 -573.214 0 46.1592 -420.469 1101.49 343.257 0 478.912 0 0 0 609.684 2333.06 2292.47 0 0 1360.29 0 0 0 0 0 0 -1397.37 0 0 0 0 1945.63 0 0 0 
0 0.09 0 0 0 859.935 0 0 0 2166.43 0 0 -18.6926 -624.79 0 2323.6 -635.624 0 0 0 -1987.59 0 0 0 0 2167.96 0 0 0 1077.99 0 0 0 1055.1 -153.432 -629.673 0 0 0 0 0 0 0 0 0 2207.48 0 0 0 
0 0 0.01 -807.291 0 0 126.27 0 285.424 1942.88 0 -603.122 0 0 0 2062.52 0 0 0 0 0 1940.75 0 0 0 0 205.161 0 0 2492.83 0 -1563.23 -1430.17 -1888.71 0 0 0 0 0 0 1182.06 0 0 867.412 1950.21 0 -1474.12 0 -1532.41 
0 0 1007.64 0.08 0 0 0 2374.26 0 0 0 0 0 0 0 0 0 -1981.8 0 84.46 0 -583.285 0 447.325 0 0 0 0 0 0 1145.28 0 0 0 0 0 0 0 0 0 0 2267.3 0 1005.81 0 0 1676.15 0 -2207.33 
0 0 0 0 0 0 0 0 1895.89 0 0 735.267 0 0 0 0 0 -446.409 0 0 0 0 0 0 0 739.387 0 0 0 0 -196.158 -1733.68 1609.47 0 0 0 0 1766.18 0 0 0 -348.598 0 0 1719.18 0 -1587.8 0 -869.549 
0 1098.28 0 0 0 0.05 0 -19.9133 1397.98 0 0 0 -476.47 0 0 0 0 297.937 -1771.22 0 0 0 0 0 -1304.9 0 2001.02 0 0 0 0 0 0 0 -2319.03 0 0 0 0 0 0 0 0 1497.31 0 1759.77 1812.72 0 0 
1688.97 0 534.913 0 0 0 0.06 -656.987 0 0 0 -2498.63 0 0 0 0 -2449.49 -867.26 -797.372 0 0 0 2058.09 0 0 0 341.884 0 0 0 853.526 2044.36 2205.95 0 0 0 0 0 1668.98 0 2269.28 0 772.805 -676.519 0 0 0 0 0 
0 0 0 1340.91 0 865.276 399.716 0.06 447.935 894.421 0 0 0 0 0 0 0 1538.67 0 0 0 0 2092.88 0 0 0 0 0 0 573.519 0 2160.48 0 0 0 0 0 -1930.52 0 1805.25 0 -1348.84 -810.953 0 0 -1891.31 0 0 0 
2100.67 0 734.504 0 2251.43 1726.36 0 -1320.61 0.03 0 0 0 0 0 0 0 0 0 0 -2086.17 -716.956 0 0 0 0 0 0 -48.2955 0 0 1427.12 -66.4541 153.584 0 0 -200.735 0 2249.29 0 0 0 0 0 0 0 0 2362.36 0 0 
0 2121.42 1358.46 0 0 0 0 2410.12 0 0.05 1107.44 0 127.949 -1958.45 0 0 0 0 0 0 1816.39 0 0 863.903 0 0 0 0 0 58.977 1413.85 0 0 0 0 0 0 0 0 0 0 0 2332.61 -518.433 0 0 0 0 1107.44 
1885.51 0 0 0 0 0 0 0 0 -387.356 0.09 0 1855.45 2158.19 0 0 0 -479.217 0 0 0 0 2182.61 0 0 -460.753 0 -394.07 0 0 0 0 0 2184.9 0 0 0 0 0 0 1046.86 0 0 0 57.7563 0 0 936.232 0 
1167.1 0 -258.415 0 2348.02 0 1549.5 0 0 0 0 0.03 -1484.34 0 0 0 0 0 0 2393.34 0 0 0 407.804 0 0 0 902.356 962.935 0 2154.99 0 232.78 931.043 0 -630.436 0 -1264.31 0 0 0 0 0 0 0 0 0 0 0 
0 741.371 0 0 0 1146.05 0 0 0 2247.15 425.81 -1189.84 0.07 0 0 0 0 0 0 0 0 -1852.4 -276.879 0 0 0 0 0 844.676 0 0 0 0 0 0 100.177 0 0 0 -191.733 0 0 0 0 1753.06 0 -670.11 0 0 
396.512 -1095.39 0 0 0 0 0 0 0 -100.33 1388.97 0 0 0.08 0 2091.81 0 2246.54 0 614.261 0 -645.695 0 0 0 -383.084 0 2053.67 0 -1103.47 0 -594.882 0 0 0 0 2284.39 2021.47 0 -384.762 0 0 0 1424.22 0 -1021.23 -1488.62 0 0 
0 0 0 0 0 0 0 0 0 0 0 0 0 0 0.02 0 0 0 0 0 2165.52 0 0 0 0 -869.549 -91.937 0 0 -151.906 0 0 42.497 0 393.002 0 1828.29 0 0 0 0 0 0 -1224.48 0 2349.54 0 0 0 
0 2101.58 2315.06 0 0 0 0 0 0 0 0 0 0 673.925 0 0.01 0 0 0 0 0 0 0 1046.86 0 0 0 0 0 908.612 0 0 0 0 0 0 1209.52 0 0 0 0 0 0 0 0 1304.74 2214.65 0 0 
0 -1195.18 0 0 0 0 2044.21 0 0 0 0 0 0 0 0 0 0 0 1465.12 -626.164 0 -1494.87 2236.93 334.864 0 0 0 0 -2460.02 0 0 0 0 0 1080.43 466.704 2053.97 0 0 -1259.12 0 0 0 0 2177.11 0 0 0 2357.63 
628.91 0 0 2286.52 -1291.16 -331.05 1022.45 -16.5563 0 0 -1621.22 0 0 770.211 0 0 0 0.06 337.153 0 0 0 0 0 0 0 547.426 0 -193.258 0 0 0 0 0 0 0 0 0 2352.9 0 0 0 -1118.88 0 1302.76 0 608.921 0 2456.97 
0 0 0 0 0 -372.86 1143.6 0 0 0 0 0 0 0 0 0 -1334.35 1714.61 0.08 0 -641.423 0 0 0 2187.03 -1174.89 0 1083.48 -499.359 -687.201 0 0 0 0 -46.3118 0 0 0 0 710.7 0 0 0 0 0 0 799.661 0 0 
1184.5 0 0 -1004.14 0 0 0 0 954.237 0 0 -296.411 0 2391.35 0 0 -1042.89 0 0 0.03 0 1609.01 0 0 0 0 0 195.547 -771.737 0 0 402.005 0 0 874.737 0 0 2476.81 0 0 -1564.15 0 0 0 0 0 0 0 0 
-1357.69 2061.75 0 0 0 0 0 0 2281.79 778.909 0 0 0 0 980.331 0 0 0 165.944 0 0 1609.01 44.9385 -642.796 2449.64 0 0 0 0 -745.949 1028.09 2487.49 0 0 831.401 0 0 0 0 0 1649.3 0 0 0 0 0 0 0 0 
-1599.55 0 1090.04 -1020.92 0 0 0 0 0 0 0 0 -1150.93 1871.01 0 0 654.241 0 0 247.734 -2134.85 0.04 0 2026.2 0 0 0 0 -202.261 -2268.97 1145.44 2464.14 0 0 0 0 0 0 0.534074 -1329.31 0 0 0 0 0 0 0 0 0 
131.611 0 0 0 0 0 -695.746 273.217 0 0 1486.48 0 1674.47 0 0 0 -1639.68 0 0 0 -1807.99 0 0.09 0 2354.58 0 0 1753.06 1430.78 758.766 0 0 0 0 0 0 869.701 0 0 -2448.58 0 0 0 2411.04 -2349.39 -1575.44 0 0 0 
0 0 0 1339.84 0 0 0 0 0 427.03 0 1933.42 0 0 0 -2395.63 -655.919 0 0 0 759.835 1433.38 0 0.03 0 0 0 0 0 -129.78 0 0 0 0 -882.977 1340.3 1849.8 0 0 0 0 2445.98 0 0 -956.984 0 0 0 1112.48 
1039.84 0 0 0 0 -621.128 0 0 0 0 0 0 0 0 0 0 0 0 2152.55 0 -932.722 0 -606.021 0 0.01 0 0 584.811 1767.1 2024.37 0 277.947 0 0 0 0 0 -1262.93 555.055 0 0 0 387.509 0 0 441.527 777.23 1446.81 0 
0 2393.03 0 0 2097.77 0 0 0 0 0 -159.688 0 0 -1147.11 1305.96 0 0 0 -1579.1 0 0 0 0 0 0 0.04 0 0 0 0 2399.29 0 1272.55 0 0 0 0 0 0 0 0 0 0 0 0 1749.7 0 0 0 
0 0 2385.1 0 0 569.857 821.635 0 0 0 0 0 0 0 1316.95 0 0 1648.53 0 0 0 0 0 0 0 0 0 0 1424.68 0 0 0 0 1888.41 0 1658.45 -491.119 0 0 0 0 0 0 0 0 0 0 -858.715 0 
0 0 0 0 0 0 0 0 -759.682 0 2431.94 228.05 0 343.715 0 0 0 0 465.941 253.99 0 0 955.916 0 -905.255 0 0 0.08 -1711.1 420.927 0 -326.167 0 0 0 0 0 0 510.956 0 0 0 0 0 0 -2438.96 0 1139.03 0 
1463.44 0 0 0 0 0 0 0 0 0 0 1642.28 -2342.83 0 0 0 878.704 -688.421 1273.16 -872.143 0 2463.38 950.728 0 334.559 0 400.937 362.941 0.08 0 -657.903 0 0 0 0 0 0 0 0 0 0 0 0 2350.92 0 -2414.09 0 0 0 
1042.28 2407.38 145.65 0 0 0 0 2208.09 0 851.238 0 0 0 1576.51 -1043.96 2191.46 0 0 997.269 0 -980.178 -823.313 1155.35 -2254.48 740.76 0 0 -1663.79 0 0.03 816.294 0 -87.054 0 0 0 0 0 0 0 0 0 0 0 0 633.03 0 0 0 
1536.07 0 0 -2121.88 11.3681 0 295.343 0 -1668.83 -1557.74 0 2094.41 0 0 0 0 0 0 0 0 2323.76 -234.458 0 0 0 1994.61 0 0 1323.05 2077.32 0.08 0 0 0 0 -1891 2457.43 0 0 0 0 0 -480.285 0 0 0 -378.201 0 0 
0 0 685.522 0 387.204 0 -129.78 1599.55 -57.1459 0 0 0 0 -113.605 0 0 0 0 0 1638.31 988.113 263.451 0 0 2417.6 0 0 1528.9 0 0 0 0.09 0 0 0 0 0 0 0 0 0 0 0 0 0 0 0 0 0 
0 0 1142.84 0 342.799 0 -690.558 0 -1359.83 0 0 -815.531 0 0 1203.57 0 0 0 0 0 0 0 0 0 0 2238 0 0 0 658.055 0 0 0.09 0 0 0 1662.57 0 0 0 0 0 1846.14 799.814 -1455.96 -54.7044 0 0 0 
-755.257 940.657 2112.87 0 0 0 0 0 0 0 -727.027 269.402 0 0 0 0 0 0 0 0 0 0 0 0 0 0 -968.429 0 0 0 0 0 0 0.02 0 0 0 0 0 0 600.681 0 0 708.258 0 -686.895 0 0 0 
0 1607.94 0 0 0 299.005 0 0 0 0 0 0 0 0 -1723 0 1933.88 0 -657.445 -308.008 48.7533 0 0 875.5 0 0 0 0 0 0 0 0 0 0 0 0 0 0 0 0 0 0 0 0 0 0 0 0 0 
0 1793.19 0 0 0 0 0 0 700.934 0 0 1612.83 72.7104 0 0 0 1476.56 0 0 0 0 0 0 748.39 0 0 -939.589 0 0 0 9.99481 0 0 0 0 0.01 0 0 0 -1809.37 0 0 -173.574 0 0 382.473 0 0 0 
0 0 0 0 0 0 0 0 0 0 0 0 0 2459.72 1611.91 1831.95 983.383 0 0 0 0 0 194.327 2343.13 0 0 568.178 0 0 0 1970.96 0 476.623 0 0 0 0.05 -2233.12 0 0 0 1971.11 0 1494.87 -89.1903 0 0 0 0 
0 0 0 0 271.233 0 0 1693.09 1321.07 0 0 2462.46 0 -96.9726 0 0 0 0 0 2331.69 0 0 0 0 2097.16 0 0 0 0 0 0 0 0 0 0 0 -2268.36 0.01 0 0 0 0 0 0 0 -2018.42 0 0 0 
0 0 0 0 0 0 1392.18 0 0 0 0 0 0 0 0 0 0 760.598 0 0 0 1649.14 0 0 2218.47 0 0 -1688.67 0 0 0 0 0 0 0 0 0 0 0.07 0 0 595.492 1082.57 755.867 -1910.84 0 0 -1185.26 0 
0 0 0 0 0 0 0 84.3074 0 0 0 0 -436.644 -343.257 0 0 -2447.36 0 1935.1 0 0 -2388.45 -142.75 0 0 0 0 0 0 0 0 0 0 0 0 1655.86 0 0 0 0.01 -1696.6 0 0 2335.51 1647.62 0 0 0 0 
727.943 0 -1088.21 0 0 0 1713.23 0 0 0 1642.74 0 0 0 0 0 0 0 0 1943.49 2050.92 0 0 0 0 0 0 0 0 0 0 0 0 2346.19 0 0 0 0 0 165.944 0.05 -259.789 512.94 0 0 -846.812 0 0 0 
0 0 0 -18.0822 309.534 0 0 1839.12 0 0 0 0 0 0 0 0 0 0 0 0 0 0 0 2212.52 0 0 0 0 0 0 0 0 0 0 0 0 -84.0022 0 1736.12 0 1132.01 0.04 1581.7 1721.93 0 0 0 0 0 
0 0 0 0 0 0 310.907 1184.65 0 -1558.66 0 0 0 0 0 0 0 685.675 0 0 0 0 0 0 2401.12 0 0 0 0 0 -1498.99 0 1518.68 0 0 362.636 0 0 962.935 0 -2143.85 1739.33 0.09 0 -964.919 0 0 0 0 
0 0 159.536 1325.34 0 581.912 -1577.58 0 0 1317.71 0 0 0 1249.2 -1523.41 0 0 0 0 0 0 0 328.303 0 0 0 0 0 627.995 0 0 0 -1423.46 2053.06 0 0 -1882.46 0 1229.06 -1746.8 0 133.29 0 0.09 0 0 1963.48 0 0 
0 0 -948.439 0 1303.83 0 0 0 0 0 -879.162 0 1769.39 0 0 0 257.195 1115.38 0 0 0 0 2133.17 1555.45 0 0 0 0 0 0 0 0 2227.62 0 0 0 2360.38 0 -429.014 1320.31 0 0 -229.575 0 0.02 0 0 0 2375.48 
-1918.16 -1623.66 0 0 0 385.678 0 -563.143 0 0 0 0 0 1426.36 1053.88 2234.34 0 0 0 0 0 0 -2019.79 0 1218.68 506.378 0 -82.6289 1298.18 -1630.68 0 0 479.369 237.663 0 2347.56 0 1354.49 0 0 1884.75 0 0 0 0 0.02 0 1282.92 0 
0 0 327.998 2105.85 189.596 -748.695 0 0 1271.32 0 0 0 1566.44 714.362 0 317.316 0 885.723 -280.084 0 0 0 0 0 -2043.44 0 0 0 0 0 2391.96 0 0 0 0 0 0 0 0 0 0 0 0 -1994.31 0 0 0.08 0 0 
0 0 0 0 0 0 0 0 0 0 2046.49 0 0 0 0 0 0 0 0 0 0 0 0 0 479.064 0 1989.73 -2221.37 0 0 0 0 0 0 0 0 0 0 2428.74 0 0 0 0 0 0 2167.35 0 0.09 0 
0 0 1338.62 -803.171 -1749.55 0 0 0 0 -1713.39 0 0 0 0 0 0 1812.72 -1156.42 0 0 0 0 0 1521.73 0 0 0 0 0 0 0 0 0 0 0 0 0 0 0 0 0 0 0 0 1854.38 0 0 0 0.03 
