*Vertices 70
*Matrix 
0.01 1937.7 0 0 0 0 0 0 0 0 0 0 0 0 1445.13 0 0 0 0 0 1135.52 -1268.27 -628.452 0 0 0 0 0 0 0 -2261.96 0 1186.79 0 0 0 0 0 0 0 2450.25 0 0 0 0 0 0 0 0 0 0 0 0 0 0 501.801 0 0 1400.42 0 -1879.86 -1011.76 -436.796 0 -2497.86 1654.03 1282.92 0 0 0 
-1159.47 0.03 1333.43 2039.32 139.851 0 0 0 0 0 0 0 0 -759.377 0 0 0 0 0 0 0 0 0 0 804.849 0 0 0 0 0 0 0 0 0 0 0 0 2361.9 0 0 1114.61 1848.89 0 0 0 -828.349 -1262.47 -1659.37 0 0 0 0 0 0 0 0 0 0 0 0 0 0 0 0 0 -1862.62 0 0 1845.38 0 
0 -920.362 0.06 1550.26 0 1943.95 -1948.07 0 0 2245.32 0 0 0 0 0 0 730.995 0 0 0 1540.19 0 0 -2216.33 0 -767.006 0 0 1917.25 -251.091 -783.181 0 0 0 1003.22 0 0 0 0 0 0 -665.075 480.285 0 0 0 0 0 0 0 0 0 0 771.126 0 0 0 -1329.16 0 0 0 0 0 0 0 0 0 0 0 0 
0 348.903 -480.285 0.09 0 653.02 0 0 0 1718.73 0 0 0 1619.08 0 1823.4 0 0 0 0 0 1745.58 0 -1674.93 0 0 -244.377 0 0 0 -1106.37 0 0 -246.818 0 716.956 -265.587 0 2182.61 1453.98 1356.78 0 0 -1540.65 0 0 -74.3889 0 0 1199.3 -1634.19 0 0 0 0 -2060.69 0 0 0 0 0 0 0 1058.61 0 0 0 0 0 0 
0 -848.949 0 0 0.07 -389.492 0 0 0 0 2097.46 0 -1819.9 0 2066.48 0 0 84.6126 0 1780.22 0 0 0 0 0 0 0 0 0 0 -1323.36 -491.729 0 0 2329.25 0 376.827 0 0 0 0 0 0 0 0 0 0 0 0 0 0 0 0 0 1044.27 0 0 0 0 0 0 0 0 0 0 0 0 0 -277.49 1102.86 
0 0 -812.174 -202.567 1722.69 0.01 0 0 0 0 0 416.959 1880.63 0 0 0 0 0 0 0 0 0 81.2555 1406.83 0 0 -640.507 0 1269.19 0 0 0 0 0 34.5622 0 -109.943 255.211 0 0 0 2394.1 0 0 0 0 0 0 0 0 0 0 0 0 963.088 0 0 0 0 0 0 2158.19 0 0 -2180.62 0 0 0 0 0 
0 0 1924.57 0 0 0 0.05 0 0 0 0 0 0 -1465.58 0 2170.25 0 0 0 0 0 1840.04 0 -736.183 169.607 0 0 1120.56 0 0 0 0 0 0 0 1322.14 2324.98 0 1571.17 0 0 1160.39 0 0 -2026.66 0 0 0 0 0 0 0 0 0 0 0 0 0 0 -1231.04 0 0 0 0 0 0 1153.22 0 0 0 
0 0 0 0 0 0 0 0.03 304.041 0 1969.28 1835.61 0 1591.92 0 0 -1465.73 0 0 1492.89 671.484 0 0 0 0 0 0 0 0 0 0 0 -264.519 0 1486.02 0 0 0 -1426.51 2461.39 1262.78 0 0 0 -128.712 0 0 0 -65.8437 0 0 0 0 0 0 0 0 0 0 0 0 0 0 0 0 0 0 0 0 0 
0 0 0 0 0 0 0 1697.21 0.07 0 -2495.42 -514.924 0 0 0 0 0 1674.78 1353.11 0 0 0 0 0 0 0 0 1136.89 2065.26 0 0 0 1854.38 0 0 0 0 0 -2151.48 0 800.272 0 0 0 0 0 0 0 113.453 0 0 0 0 0 0 0 0 0 0 0 0 0 0 0 2424.47 0 0 0 0 0 
0 0 -2373.35 277.947 0 0 0 0 0 0.01 0 0 0 0 2013.23 0 0 0 0 0 0 -2225.03 0 0 0 0 0 0 0 0 0 975.906 2348.93 542.848 0 0 0 0 1905.35 340.052 0 0 0 0 0 0 0 0 0 -1214.41 0 0 -1943.8 0 0 0 0 0 0 0 0 2483.37 0 0 0 0 -2394.25 0 0 0 
0 0 0 0 -415.128 0 0 -402.158 1909.77 0 0 -2170.4 2431.79 0 2110.43 0 0 1076.92 0 2211.45 0 380.184 0 0 0 0 0 0 0 0 0 -856.426 0 0 0 0 0 1283.07 0 0 1788.77 0 1063.19 0 0 0 0 0 0 0 0 -1344.72 0 0 0 0 0 0 -1777.93 0 0 0 0 0 0 0 0 0 0 0 
0 0 0 0 0 -0.381481 0 -1475.34 1278.04 0 155.873 0.06 709.784 0 0 0 1402.25 0 0 102.466 0 0 0 -18.54 0 -1671.42 0 -2262.26 0 0 1622.59 0 0 0 896.71 0 0 1053.12 -1025.8 0 0 0 0 0 0 0 0 0 0 0 0 0 0 0 85.0703 0 0 1825.08 0 0 0 0 0 0 0 0 0 0 0 2408.9 
0 0 0 0 -811.716 1953.41 0 0 0 0 -1.44963 -1642.58 0.01 0 -684.912 0 0 957.137 0 0 0 0 0 0 -231.864 0 2365.57 -2009.72 -2191.92 -972.854 108.722 -493.255 0 0 0 -2202.75 0 0 0 2327.88 1839.73 718.482 0 0 224.235 0 0 0 0 0 0 0 0 0 0 0 0 0 0 0 0 1019.85 0 0 0 0 0 0 0 0 
0 -1519.9 0 2187.8 0 0 -814.92 -982.925 0 0 0 0 0 0 0 0 1914.96 1708.5 -1317.71 936.842 0 0 0 0 0 -1122.24 0 0 -1984.69 0 0 0 0 0 223.319 0 0 0 0 0 0 692.999 1606.88 0 129.322 0 0 2429.65 927.992 0 0 0 0 0 0 -86.9015 0 0 0 0 0 929.212 2477.72 0 1570.71 33.7992 0 -1245.84 0 0 
2392.57 0 0 0 1507.69 0 0 0 0 1488.92 1103.02 0 -198.294 0 0.01 796.915 -1027.79 0 0 0 2271.87 0 0 2060.53 -789.59 1208.46 0 0 0 0 0 -772.805 -1319.85 0 0 -282.067 0 0 0 1830.58 747.78 0 -18.3874 -1852.4 0 0 0 0 0 0 0 132.984 0 1510.9 0 0 0 0 0 0 0 0 1857.89 -2124.01 0 0 0 0 0 0 
0 0 0 -121.845 0 0 -2244.56 0 0 0 0 0 0 0 -1916.18 0.02 0 971.786 0 0 0 0 0 35.783 0 0 0 1140.55 -1102.86 2162.92 0 0 2116.84 0 164.418 0 0 1660.28 0 0 248.955 0 0 0 0 0 0 0 0 0 1856.21 0 0 2055.19 0 0 0 1262.17 0 0 737.404 0 0 0 0 0 0 0 2432.25 0 
0 0 2145.53 0 0 0 0 -1546.91 0 0 0 -427.641 0 1356.93 2492.52 0 0.07 997.269 0 0 0 744.88 0 0 0 503.479 734.352 0 0 -968.276 0 192.801 -1694.46 0 0 0 0 0 1280.48 0 0 0 0 -2130.88 0 2483.98 0 0 0 0 0 0 0 0 0 0 0 0 0 0 0 0 0 0 0 0 0 0 0 0 
0 0 0 0 -993.149 0 0 0 1841.41 0 -1196.71 0 1670.2 2306.21 0 1138.26 -880.993 0.02 371.792 0 0 0 0 0 0 0 0 0 0 0 0 0 1995.68 0 0 2268.67 0 0 1635.87 0 0 0 0 1491.06 0 0 0 0 0 0 0 0 0 0 0 0 0 0 0 0 0 0 0 0 0 0 0 0 0 0 
0 0 0 0 0 0 0 0 -389.492 0 0 0 0 2052.29 0 0 0 634.861 0.05 0 0 2309.11 0 0 0 0 0 0 -176.778 0 910.749 0 0 0 0 0 0 0 0 0 0 0 0 0 0 0 788.827 2030.63 0 1658.76 0 0 0 0 0 0 0 0 0 89.3429 0 0 0 0 0 0 0 -741.523 0 2220.45 
0 0 0 0 860.088 0 0 1614.81 0 0 1732.46 2318.57 0 -1271.02 0 0 0 0 0 0.09 0 0 0 0 0 -1081.8 0 0 0 706.732 0 615.024 0 0 1804.18 0 0 0 0 0 0 -1364.71 -577.639 -636.235 0 0 0 0 0 0 0 0 0 0 -172.353 0 0 2041.61 0 0 0 1307.34 0 0 -2076.86 0 0 0 0 0 
84.9178 0 667.974 0 0 0 0 1916.94 0 0 0 0 0 0 2062.67 0 0 0 0 0 0.03 0 1693.55 0 528.504 0 0 -500.427 0 610.446 0 0 0 1418.58 2224.72 0 0 72.7104 0 0 2111.5 840.251 0 0 0 0 0 0 0 0 0 -245.14 0 0 0 0 0 0 0 0 0 2438.51 0 1026.87 0 0 0 0 0 -871.685 
-24.1859 0 0 -2355.95 0 0 2002.4 0 0 -735.572 2475.28 0 0 0 0 0 2029.56 0 193.564 0 0 0.08 0 0 -154.347 -1713.69 0 0 0 0 0 0 2393.64 0 0 -2244.41 0 0 0 0 0 0 0 0 0 0 0 0 0 0 0 0 0 0 0 -1321.83 0 0 0 0 0 0 0 0 0 2400.81 0 0 0 2070.6 
1656.77 0 0 0 0 -1733.22 0 0 0 0 0 0 0 0 0 0 0 0 0 0 1311.3 0 0.04 0 517.975 0 0 0 0 0 0 2357.94 536.286 0 -2337.18 0 0 0 0 0 -176.778 0 -92.7 0 0 0 0 0 0 0 0 0 0 0 8.92666 0 0 0 0 0 457.244 0 0 0 0 0 0 -1067 0 0 
0 0 1774.42 1733.68 0 -333.186 -467.925 0 0 0 0 -1338.16 0 0 2238.61 1229.21 0 0 0 0 0 0 0 0.07 0 0 0 0 0 0 0 0 0 0 0 0 0 764.87 748.238 0 0 0 0 0 0 0 0 0 0 0 -2068.32 0 0 0 0 0 0 -434.965 0 0 0 0 -318.842 0 0 0 0 -161.672 0 0 
0 -1242.64 0 0 0 0 1545.53 0 0 0 0 0 1257.29 0 1589.63 0 0 0 0 0 1081.5 2085.41 -203.177 0 0.08 2069.84 0 -88.4274 0 0 0 0 -65.5385 0 0 0 0 0 0 -2200.16 1936.78 2392.27 0 -2159.72 0 0 0 0 0 0 0 0 0 0 0 0 0 0 0 0 0 0 0 0 0 0 0 0 0 0 
0 0 1312.83 0 0 0 0 0 0 0 0 -810.343 0 1647.01 -1609.01 0 2480.93 0 0 2353.05 0 1976.76 0 0 -1460.23 0.05 -2478.03 0 0 0 0 0 1830.73 0 2429.5 0 0 -2061.14 0 0 0 2084.64 0 0 0 0 0 0 1614.51 0 0 0 -1692.63 0 0 0 0 0 0 0 0 0 0 0 0 -688.421 0 0 0 -1145.59 
0 0 0 1966.99 0 -696.661 0 0 0 0 0 0 -171.438 0 0 0 783.639 0 0 0 0 0 0 0 0 527.284 0 3.58592 0 0 0 -1981.64 0 0 -1372.19 2369.08 0 0 240.257 -1187.86 0 0 0 0 0 1627.48 0 0 0 0 0 0 0 0 0 0 0 0 0 0 2116.38 0 0 0 0 0 0 1124.99 0 0 
0 0 0 0 0 0 2421.41 0 1813.49 0 0 1128.5 1218.22 0 0 -668.126 0 0 0 0 2453.92 0 0 0 -1384.4 0 -2486.27 0.07 0 0 0 0 0 1437.04 0 0 0 0 1389.58 0 0 0 0 2486.88 -1101.64 0 0 0 0 0 0 2256.31 -664.006 0 0 0 -683.233 1637.85 0 0 0 0 0 1204.95 0 0 0 0 0 0 
0 0 1978.74 0 0 1024.89 0 0 2497.71 0 0 0 -2417.91 -517.975 0 -2351.53 0 0 2162.77 0 0 0 0 0 0 0 0 0 0.08 619.755 0 0 0 0 0 0 1076.01 -1401.03 1208.91 0 902.051 0 0 0 0 0 0 0 0 0 1085.16 0 0 0 2316.89 0 0 0 -1948.23 0 0 0 0 0 0 0 0 -2156.67 0 0 
0 0 1388.52 0 0 0 0 0 0 0 0 0 -2293.39 0 0 761.818 1869.03 0 0 2048.48 2329.1 0 0 0 0 0 0 0 -2173.6 0.02 -1974.32 0 0 0 0 0 0 0 1787.39 767.159 0 698.035 0 0 0 0 0 0 0 0 0 0 0 0 0 0 0 0 0 0 0 0 0 0 0 0 0 0 0 0 
-46.1592 0 -1393.86 950.575 -175.71 0 0 0 0 0 0 956.221 421.079 0 0 0 0 0 2121.57 0 0 0 0 0 0 0 0 0 0 382.778 0.06 0 0 0 0 0 0 0 0 -1298.18 0 0 2018.27 1171.22 2145.68 0 0 0 0 0 0 0 0 0 0 0 0 0 0 -1685 0 0 0 0 0 0 0 0 545.9 0 
0 0 0 0 -1130.63 0 0 0 0 2164.6 1760.99 0 -1430.17 0 -184.103 0 -1844 0 0 -1327.94 0 0 1293.15 0 0 0 192.343 0 0 0 0 0.05 2219.08 0 0 -2131.34 0 0 2428.43 0 0 617.008 208.06 151.601 0 0 0 0 0 0 0 0 0 0 0 0 1807.54 0 0 0 0 0 0 0 0 0 0 0 0 0 
1793.04 0 0 0 0 0 0 561.159 1008.71 -2337.64 0 0 0 0 686.59 -1306.12 1086.99 -2453.31 0 0 0 2316.89 1077.38 0 -9.53703 1088.06 0 0 0 0 0 571.535 0.04 0 0 0 0 2021.62 0 0 -369.503 0 0 0 0 -1946.24 257.195 0 0 0 0 0 0 0 0 0 0 0 0 0 0 0 0 0 0 0 0 0 0 0 
0 0 0 -685.827 0 0 0 0 0 -746.406 0 0 0 0 0 0 0 0 0 0 854.442 0 0 0 0 0 0 1894.36 0 0 0 0 0 0.07 1597.87 0 0 0 1376.61 0 1572.7 0 0 0 -332.881 2376.55 0 0 0 -427.183 661.87 0 0 0 0 2466.43 0 0 -649.052 0 0 0 0 0 0 0 0 0 0 0 
0 0 -315.18 0 1941.66 -2194.51 0 1754.13 0 0 0 203.482 0 486.999 0 991.012 0 0 0 2070.91 1359.22 0 1810.74 0 0 -279.168 88.1222 0 0 0 0 0 0 -1978.9 0.01 0 1845.68 0 -1514.56 0 0 0 0 0 0 0 0 0 0 0 0 0 0 0 0 0 0 0 0 0 -1011 0 0 0 0 0 0 0 0 0 
0 0 0 1914.66 0 0 2054.12 0 0 0 0 0 -2140.95 0 1427.43 0 0 -533.387 0 0 0 1562.47 0 0 0 0 675.451 0 0 0 0 -120.472 0 0 0 0.01 0 0 0 0 1296.96 0 843.455 0 0 0 0 0 0 0 0 0 0 0 -306.177 0 0 0 -329.524 0 -816.294 0 0 0 0 903.424 0 0 0 0 
0 0 0 -951.338 1035.72 -340.052 2209.77 0 0 0 0 0 0 0 0 0 0 0 0 0 0 0 0 0 0 0 0 0 1951.89 0 0 0 0 0 1832.41 0 0.07 0 0 0 0 -228.813 -1079.36 0 -197.226 2023.3 0 0 0 0 0 -1735.66 1313.9 -1747.26 0 0 0 0 0 0 0 0 -711.31 0 0 0 0 2266.99 -1084.09 0 
0 -1000.93 0 0 0 -2048.17 0 0 0 0 2229.15 893.048 0 0 0 -996.811 0 0 0 0 1267.05 0 0 1418.27 0 -829.112 0 0 13.1993 0 0 0 2491.61 0 0 0 0 0.05 0 -403.989 0 0 0 0 0 0 0 -494.476 0 0 1470.92 0 0 0 0 2340.69 0 0 0 0 0 0 0 0 654.698 0 0 0 1718.42 0 
0 0 0 730.384 0 0 1792.58 2418.21 -2315.97 1974.62 0 -1823.86 0 0 0 0 1489.84 -208.518 0 0 0 0 0 2251.73 0 0 2017.5 469.909 1046.1 539.338 0 -1763.89 0 1482.67 -1405.3 0 0 0 0.04 0 0 284.204 0 0 0 0 0 374.386 0 0 0 -256.737 0 0 0 0 0 0 -1676.76 0 0 -2323.6 0 0 0 0 0 0 0 0 
0 0 0 -212.027 0 0 0 2272.94 0 -1526.46 0 0 1231.65 0 -727.638 0 0 0 0 0 0 0 0 0 -827.128 0 -1084.86 0 0 2015.37 -619.602 0 0 0 0 0 0 -514.161 0 0.05 2270.5 0 0 0 0 0 1080.13 0 0 0 0 0 0 0 0 0 0 0 0 0 0 0 0 0 0 0 0 1675.08 0 0 
943.556 -969.649 0 -1278.04 0 0 0 507.141 2378.84 0 2075.79 0 -1760.99 0 1289.33 -1723.15 0 0 0 0 2109.82 0 1948.53 0 394.375 0 0 0 -1507.23 0 0 0 2352.14 1613.13 0 964.919 0 0 0 -1146.35 0.05 -94.3785 0 169.454 -74.3889 0 0 0 0 0 0 0 0 0 0 -2191.46 0 0 0 0 0 0 0 0 -641.728 0 0 0 0 0 
0 266.503 2437.74 0 0 1750.01 -306.024 0 0 0 0 0 1169.55 -1588.56 0 0 0 0 0 1146.5 1729.1 0 0 0 271.233 575.35 0 0 0 2119.28 0 878.399 0 0 0 0 1539.43 0 1473.36 0 -310.907 0.01 -180.135 2313.38 611.667 0 0 0 0 0 0 0 -1465.42 0 0 972.091 0 0 0 0 0 0 0 0 0 0 1269.19 0 0 0 
0 0 1073.26 0 0 0 0 0 0 0 -1356.93 0 0 1132.31 2390.59 0 0 0 0 -652.257 0 0 757.698 0 0 0 0 0 0 0 1714.15 63.86 0 0 0 -719.398 481.658 0 0 0 0 1451.08 0.05 -1418.88 0 0 0 0 0 0 0 0 0 1718.27 0 -124.897 0 0 0 0 0 0 0 0 0 0 -760.75 0 0 -1414.3 
0 0 0 199.82 0 0 0 0 0 0 0 0 0 0 1391.57 0 379.421 -1569.03 0 1282.46 0 0 0 0 1902.14 0 0 1743.45 0 0 1209.98 739.387 0 0 0 0 0 0 0 0 2319.79 -61.7237 280.236 0.01 -2377.32 543.458 0 0 0 -714.82 0 0 0 0 0 0 0 0 0 0 0 0 -2196.19 0 0 0 -1851.33 0 0 1507.54 
0 0 0 0 0 0 -2116.84 -1268.43 0 0 0 0 -1856.36 1401.18 0 0 0 0 0 0 0 0 0 0 0 0 0 1923.05 0 0 1789.38 0 0 398.953 0 0 840.251 0 0 0 2050.61 -1.60222 0 -737.709 0.09 -307.703 0 0 0 0 0 0 0 0 0 0 -576.266 0 0 0 0 0 0 2083.73 0 0 0 0 0 0 
0 2064.81 0 0 0 0 0 0 0 0 0 0 0 0 0 0 -401.7 0 0 0 0 0 0 0 0 0 2411.04 0 0 0 0 0 -899.304 -228.965 0 0 571.841 0 0 0 0 0 0 2289.73 779.214 0.06 0 0 1612.37 0 0 -1009.48 0 0 0 1812.11 0 0 1838.66 0 0 0 0 -1578.65 -2138.2 0 0 0 0 0 
0 1910.38 0 2418.21 0 0 0 0 0 0 0 0 0 0 0 0 0 0 1782.82 0 0 0 0 0 0 0 0 0 0 0 0 0 207.602 0 0 0 0 0 0 1711.86 0 0 0 0 0 0 0.07 215.69 0 0 -2241.66 1781.75 0 0 0 2037.8 246.513 0 0 -625.401 0 0 0 -2304.38 0 0 0 0 0 0 
0 2465.51 0 0 0 0 0 0 0 0 0 0 0 -1305.81 0 0 0 0 116.657 0 0 0 0 0 0 0 0 0 0 0 0 0 0 0 0 0 0 884.808 1091.57 0 0 0 0 0 0 0 564.669 0.05 0 -698.34 0 2490.84 0 0 0 0 0 0 0 0 0 0 0 -426.42 0 0 1970.5 0 0 0 
0 0 0 0 0 0 0 711.31 2241.66 0 0 0 0 -2289.27 0 0 0 0 0 0 0 0 0 0 0 -586.184 0 0 0 0 0 0 0 0 0 0 0 0 0 0 0 0 0 0 0 2055.96 0 0 0.06 0 0 0 0 0 0 0 0 0 0 0 0 0 0 0 0 0 0 0 0 0 
0 0 0 -401.395 0 0 0 0 0 1059.22 0 0 0 0 0 0 0 0 1143.45 0 0 0 0 0 0 0 0 0 0 0 0 0 0 352.412 0 0 0 0 0 0 0 0 0 1780.83 0 0 0 -37.0037 0 0.06 0 0 0 0 0 0 0 0 -874.889 0 0 0 0 1703.77 0 0 0 0 0 -1351.44 
0 0 0 385.22 0 0 0 0 0 0 0 0 0 0 0 747.78 0 0 0 0 0 0 0 953.017 0 0 0 0 -83.3918 0 0 0 0 1362.27 0 0 0 2305.6 0 0 0 0 0 0 0 0 -1291.62 0 0 0 0.07 0 0 0 -1929.3 0 0 0 0 0 0 0 0 0 0 0 0 -1684.7 0 0 
0 0 0 0 0 0 0 0 0 0 -74.3889 0 0 0 -783.639 0 0 0 0 0 886.486 0 0 0 0 0 0 2391.96 0 0 0 0 0 0 0 0 2412.87 0 1910.38 0 0 0 0 0 0 1145.13 1880.47 -2412.11 0 0 0 0.02 0 0 0 0 0 0 0 2315.82 0 0 0 0 0 298.242 704.749 -320.368 0 0 
0 0 0 0 0 0 0 0 0 2183.68 0 0 0 0 0 0 0 0 0 0 0 0 0 0 0 -24.0333 0 -272.149 0 0 0 0 0 0 0 0 821.787 0 0 0 0 1412.32 0 0 0 0 0 0 0 0 0 0 0.03 0 0 0 0 534.455 0 0 1357.39 0 0 0 0 869.549 0 0 0 0 
0 0 -1878.19 0 0 0 0 0 0 0 0 0 0 0 -93.9207 1903.52 0 0 0 0 0 0 0 0 0 0 0 0 0 0 0 0 0 0 0 0 -2374.26 0 0 0 0 0 1323.82 0 0 0 0 0 0 0 0 0 0 0.01 0 0 0 0 0 0 0 1976.3 0 0 0 0 0 0 0 0 
0 0 0 0 1317.41 2462.16 0 0 0 0 0 418.485 0 0 0 0 0 0 0 -648.595 0 0 -613.041 0 0 0 0 0 -2025.44 0 0 0 0 0 0 2160.48 0 0 0 0 0 0 0 0 0 0 0 0 0 0 -728.248 0 0 0 0.04 0 0 0 0 0 0 0 0 0 312.433 0 0 0 0 0 
-1118.12 0 0 -1742.84 0 0 0 0 0 0 0 0 0 1853.31 0 0 0 0 0 0 0 2230.67 0 0 0 0 0 0 0 0 0 0 0 -1470.46 0 0 0 1686.38 0 0 -1989.12 808.206 841.014 0 0 -292.749 941.878 0 0 0 0 0 0 0 0 0.07 0 0 0 0 0 0 0 -1611.91 0 0 0 0 0 0 
0 0 0 0 0 0 0 0 0 0 0 0 0 0 0 0 0 0 0 0 0 0 0 0 0 0 0 -2081.44 0 0 0 -301.599 0 0 0 0 0 0 0 0 0 0 0 0 536.439 0 2295.37 0 0 0 0 0 0 0 0 0 0.08 0 0 0 1884.75 0 0 0 0 0 0 0 0 -2137.59 
0 0 1916.18 0 0 0 0 0 0 0 0 1041.37 0 0 0 1856.67 0 0 0 1733.68 0 0 0 -566.5 0 0 0 -1919.84 0 0 0 0 0 0 0 0 0 0 0 0 0 0 0 0 0 0 0 0 0 0 0 0 58.2141 0 0 0 0 0.05 0 0 0 0 0 0 0 0 0 0 0 0 
2291.71 0 0 0 0 0 0 0 0 0 1285.52 0 0 0 0 0 0 0 0 0 0 0 0 0 0 0 0 0 -386.441 0 0 0 0 -35.1726 0 1388.21 0 0 -2324.98 0 0 0 0 0 0 2301.02 0 0 0 -1085.01 0 0 0 0 0 0 0 0 0.06 0 0 0 0 0 -1358.15 0 0 0 2461.85 0 
0 0 0 0 0 0 2201.53 0 0 0 0 0 0 0 0 0 0 0 1159.47 0 0 0 0 0 0 0 0 0 0 0 236.29 0 0 0 0 0 0 0 0 0 0 0 0 0 0 0 -1121.17 0 0 0 0 153.432 0 0 0 0 0 0 0 0.01 -1825.24 0 0 0 0 0 0 0 0 0 
355.312 0 0 0 0 0 0 0 0 0 0 0 0 0 0 727.79 0 0 0 0 0 0 260.094 0 0 0 2206.26 0 0 0 0 0 0 0 2248.38 -1236.08 0 0 0 0 0 0 0 0 0 0 0 0 0 0 0 0 648.9 0 0 0 -382.931 0 0 -2485.81 0.04 0 146.26 0 0 -160.146 -1407.9 0 0 0 
1316.49 0 0 0 0 195.7 0 0 0 -416.349 0 0 1745.28 1547.06 0 0 0 0 0 -2016.13 1237.91 0 0 0 0 0 0 0 0 0 0 0 0 0 0 0 0 0 -1122.85 0 0 0 0 0 0 0 0 0 0 0 0 0 0 2410.43 0 0 0 0 0 0 0 0.06 0 0 0 0 0 -2254.33 0 -1706.98 
-1401.33 0 0 0 0 0 0 0 0 0 0 0 0 2032.15 -662.633 0 0 0 0 0 0 0 0 808.664 0 0 0 0 0 0 0 0 0 0 0 0 2203.05 0 0 0 0 0 0 1662.88 0 0 0 0 0 0 0 0 0 0 0 0 0 0 0 0 -1290.4 0 0 0 0 0 0 0 0 0 
0 0 0 -1561.25 0 0 0 0 0 0 0 0 0 0 1007.34 0 0 0 0 0 2321.92 0 0 0 0 0 0 315.943 0 0 0 0 0 0 0 0 0 0 0 0 0 0 0 0 -1511.66 1415.68 -1447.42 -832.926 0 -1479.16 0 0 0 0 0 501.801 0 0 0 0 0 0 0 0.02 0 1197.93 0 0 0 0 
-254.753 0 0 0 0 1302 0 0 -181.661 0 0 0 0 -468.841 0 0 0 0 0 -2247.61 0 0 0 0 0 0 0 0 0 0 0 0 0 0 0 0 0 2220.3 0 0 -1927.02 0 0 0 0 725.349 0 0 0 0 0 0 0 0 608.158 0 0 0 1108.81 0 0 0 0 0 0.02 0 0 0 0 0 
-1887.95 -1172.14 0 0 0 0 0 0 0 0 0 0 0 1352.35 0 0 0 0 0 0 0 -164.876 0 0 0 2444.46 0 0 0 0 0 0 0 0 0 830.79 0 0 0 0 0 0 0 0 0 0 0 0 0 0 0 493.255 1666.23 0 0 0 0 0 0 0 990.707 0 0 2397 0 0.03 0 0 0 0 
-1157.03 0 0 0 0 0 1643.8 0 0 407.804 0 0 0 0 0 0 0 0 0 0 0 0 0 0 0 0 0 0 0 0 0 0 0 0 0 0 0 0 0 0 0 160.298 -404.294 121.235 0 0 0 1450.93 0 0 0 2089.68 0 0 0 0 0 0 0 0 -613.651 0 0 0 0 0 0.03 0 0 0 
0 0 0 0 0 0 0 0 0 0 0 0 0 902.661 0 0 0 0 -1817 0 0 0 968.581 2007.28 0 0 -454.497 0 2081.59 0 0 0 0 0 0 0 -465.941 0 0 1443.75 0 0 0 0 0 0 0 0 0 0 2220.6 1019.09 0 0 0 0 0 0 0 0 0 -2386.47 0 0 0 0 0 0.01 0 0 
0 -1721.78 0 0 -160.451 0 0 0 0 0 0 0 0 0 0 1884.59 0 0 0 0 0 0 0 0 0 0 0 0 0 0 334.254 0 0 0 0 0 2442.01 -2206.41 0 0 0 0 0 0 0 0 0 0 0 0 0 0 0 0 0 0 0 0 2264.24 0 0 0 0 0 0 0 0 0 0.03 0 
0 0 0 0 -1383.33 0 0 0 0 0 0 610.904 0 0 0 0 0 0 1736.43 0 -1524.78 1158.71 0 0 0 2424.62 0 0 0 0 0 0 0 0 0 0 0 0 0 0 0 0 243.004 1236.69 0 0 0 0 0 -1940.14 0 0 0 0 0 0 1031.75 0 0 0 0 -522.706 0 0 0 0 0 0 0 0.06 
