*Vertices 75
*Matrix 
0.04 0 -849.406 0 0 0 2461.39 1718.27 0 -602.359 0 1733.68 0 0 0 0 0 0 -291.223 2241.81 -1647.77 0 0 0 0 0 1233.18 -478.607 0 0 0 0 0 0 -2090.9 0 0 0 0 0 1860.64 0 0 0 0 0 -2060.84 0 0 850.017 805.155 0 0 0 0 0 0 0 0 0 0 0 0 0 0 0 0 0 -879.62 0 0 0 0 0 0 
0 0.07 0 0 0 0 0 0 0 0 0 2025.89 0 0 0 0 0 0 0 0 1860.33 0 0 0 0 0 0 -1979.51 0 1511.81 -1122.24 0 -20.5237 2050.16 0 988.723 0 -1222.95 0 39.14 2200.16 0 0 0 -1437.65 1258.2 2346.64 0 1541.87 693.152 0 0 -17.4718 0 0 0 0 0 0 0 0 0 0 0 0 0 0 0 0 0 0 0 0 0 0 
1335.26 0 0.08 0 0 0 859.935 0 -525.3 0 1541.87 -266.503 0 0 0 0 0 0 0 0 2248.53 0 0 0 0 1390.04 0 -1858.35 0 0 0 0 -593.204 0 0 0 1169.7 0 0 0 0 1059.98 2173.3 2193.9 0 0 0 0 0 0 -2206.87 0 0 0 0 0 0 0 0 0 0 0 0 0 0 387.356 0 1625.8 0 0 0 0 0 0 0 
0 0 0 0.03 1885.05 496.612 1912.52 0 0 0 0 0 0 0 0 -1083.94 0 0 0 -911.664 0 0 0 1459.17 0 37.1563 -650.578 0 0 0 0 0 0 0 0 0 -248.344 443.815 0 2330.47 -1945.48 -541.932 -1269.8 0 -1372.19 288.934 2099.6 0 1572.39 0 0 0 0 0 0 -1762.37 0 -1666.08 0 0 0 0 0 0 0 0 0 0 0 0 0 0 0 0 0 
0 0 0 -1150.62 0.02 0 595.34 -1515.93 2475.89 2322.38 2322.38 0 772.042 0 72.2526 0 0 -1440.55 0 0 0 0 0 0 0 102.924 0 0 0 0 1122.09 0 1926.25 0 -123.218 2034.44 -389.798 0 -356.38 0 0 0 -192.19 0 0 0 0 0 0 0 0 -158.925 1399.96 0 0 0 0 0 0 0 0 0 0 -1649.75 0 0 0 0 0 -1290.09 0 0 0 0 0 
0 0 0 -1355.25 0 0.09 340.663 0 0 0 -848.338 1324.58 0 0 0 0 0 0 2.36518 -428.556 -526.826 0 804.849 0 0 0 0 0 -219.657 1651.13 0 1363.49 0 0 298.242 0 -568.789 0 0 0 0 -2158.8 0 0 0 0 0 0 0 0 0 2146.14 0 0 0 67.217 0 0 1972.18 0 0 0 0 0 0 0 0 0 0 0 0 0 0 0 0 
1005.2 0 -683.538 -90.5637 -1892.07 -947.676 0.01 0 0 0 0 0 0 -2250.05 0 2418.52 0 642.186 0 0 -1446.04 0 0 2070.76 2424.92 0 0 0 0 40.8185 0 0 0 0 0 0 0 0 0 0 0 1696.75 -2048.78 0 0 2201.68 0 1540.96 0 -400.632 1384.24 0 0 0 164.876 -871.227 0 0 0 0 0 0 0 0 0 0 0 0 0 0 0 0 0 0 0 
1592.84 0 0 0 -1767.71 0 0 0 0 2076.1 2403.87 0 0 0 1191.06 0 0 0 0 -82.4763 0 -713.904 0 0 1838.66 0 0 2419.74 0 0 2277.37 0 1816.39 0 0 -2281.18 2267.45 0 1198.39 0 0 1648.38 0 0 0 0 0 0 0 739.235 0 1715.67 0 0 -258.873 0 1049.46 0 0 0 -912.427 0 0 0 0 0 0 0 0 0 0 0 0 -1333.12 0 
0 0 1404.69 0 1740.24 0 0 0 0.09 0 0 782.876 0 0 0 0 0 -33.9518 0 0 0 0 0 0 0 1159.93 0 0 2116.08 0 0 0 0 0 -63.5548 1547.36 0 0 0 0 -810.19 0 0 -257.958 0 0 0 0 1741.46 -1664.4 0 0 0 0 0 0 0 0 253.99 -311.365 0 0 0 0 0 -1059.98 0 0 0 0 0 0 0 0 0 
2367.24 0 0 0 1932.2 0 0 -1727.88 0 0.09 -443.51 0 0 0 0 -486.084 0 0 0 0 2243.49 -632.42 0 0 -693.152 506.073 0 0 0 0 0 0 0 0 1427.88 0 0 0 0 0 0 0 0 0 0 1665.47 0 150.685 0 0 0 39.7504 0 174.49 0 0 0 0 0 0 0 0 0 0 0 0 0 0 0 0 -1625.95 0 0 0 0 
0 0 -90.8689 0 -1254.69 2034.75 0 1283.68 0 -797.525 0.09 0 0 629.521 0 -1072.19 0 -621.433 0 0 1463.9 0 0 0 0 0 1064.71 1941.36 355.159 -1082.42 0 0 1918.93 1916.03 0 0 0 0 0 628.3 2316.74 762.123 0 434.812 1801.28 0 0 0 0 0 -1066.09 1462.07 0 0 0 0 0 0 0 0 0 1565.83 0 0 0 0 0 -213.401 -1823.56 0 0 0 0 0 0 
1225.85 1230.89 -20.2185 0 0 -230.491 0 0 1272.09 0 0 0.05 -550.935 0 0 0 -1465.12 0 0 0 0 386.746 0 0 0 0 903.272 0 0 0 0 0 0 0 0 0 0 0 161.214 0 561.769 0 0 0 0 0 0 0 0 386.288 0 -790.048 0 0 0 0 0 0 0 0 -579.928 0 0 0 -1260.95 0 0 0 0 0 1793.19 0 0 0 0 
0 0 0 0 -1900.62 0 0 0 0 0 0 -2310.48 0.04 -866.344 -96.5148 -2265.16 0 0 0 0 204.093 -1102.86 0 0 -539.949 0 1673.1 0 1314.51 0 1702.55 0 0 0 0 1567.05 2003.62 116.352 181.814 1288.11 1959.36 0 0 0 0 0 1394.16 0 0 -921.43 1997.97 0 0 0 0 0 0 0 0 580.538 0 -1017.87 0 0 0 0 0 0 855.358 0 0 0 0 0 0 
0 0 0 0 0 0 2329.55 0 0 0 1264.31 0 1414.15 0.05 0 0 0 0 0 0 1280.33 0 0 419.706 0 0 0 0 0 0 0 0 0 917.158 0 1975.84 0 0 0 0 0 0 0 0 1558.66 0 0 -330.287 0 0 -1187.25 0 0 0 0 0 0 0 0 245.598 0 0 0 0 0 0 -883.892 0 0 -1251.34 0 0 0 0 0 
0 0 0 0 967.666 0 0 -548.646 0 0 0 0 1113.39 0 0.02 0 0 0 741.829 0 0 0 0 0 0 0 0 0 0 0 0 0 0 -32.2733 0 0 0 0 0 0 0 798.44 0 2179.71 0 1863.69 0 0 -430.54 0 0 0 0 0 0 0 0 1102.1 0 0 0 0 0 -687.506 0 0 0 0 0 0 0 0 0 0 0 
0 0 0 -1616.18 0 0 1632.66 0 0 -370.571 441.221 0 2105.09 0 0 0.01 0 0 1567.81 0 0 0 0 1443.45 0 0 0 -942.488 829.264 0 0 709.174 1342.89 0 0 1992.02 0 0 1466.95 0 0 0 0 0 0 0 0 0 0 0 0 0 1354.03 0 0 0 0 0 0 0 1513.18 -205.161 0 1986.53 0 0 0 0 0 0 0 0 0 0 0 
0 0 0 0 0 0 0 0 0 0 0 115.284 0 0 0 0 0.04 0 0 0 0 0 0 2106.01 0 0 0 1153.37 0 0 0 0 0 0 0 0 0 -1479.31 -186.544 0 0 0 395.444 1103.47 -1162.83 -1945.17 0 0 0 2146.44 768.075 0 0 -202.567 0 0 854.137 0 0 0 0 0 0 0 0 0 0 0 -795.083 0 0 0 0 0 0 
0 0 0 0 2064.81 0 2311.55 0 -1166.04 0 1630.83 0 0 0 0 0 0 0.08 166.555 0 0 1857.89 -365.993 0 0 0 0 0 0 0 -172.353 0 0 1675.08 870.312 0 1564.46 0 0 0 0 0 2471.92 -412.992 0 0 0 0 1079.67 0 0 0 0 0 0 0 0 0 0 0 0 0 0 1951.58 0 0 0 0 0 0 0 0 0 0 0 
704.749 0 0 0 0 -482.574 0 0 0 0 0 0 0 0 -1555.45 -1874.37 0 1312.52 0.05 0 0 -1755.81 0 0 0 0 0 0 0 0 0 0 1008.56 462.889 0 2378.99 2091.51 0 0 0 0 626.621 0 -2276.15 0 0 1331.6 0 0 0 0 0 0 0 0 0 0 0 0 0 0 0 0 0 0 0 -1029.16 0 0 0 0 0 0 0 0 
1662.27 0 0 954.543 0 148.549 0 -441.984 0 0 0 0 0 0 0 0 0 0 0 0.02 0 0 345.241 2203.51 0 0 0 0 1583.83 0 21.897 -729.469 0 0 0 0 2245.32 0 0 0 0 0 0 0 1331.6 0 0 0 0 0 0 0 0 0 0 0 0 0 0 0 0 0 0 0 -357.601 0 0 -77.4407 0 0 0 0 0 0 -1607.94 
1956.01 2344.81 496.46 0 0 2159.57 1248.28 0 0 -1207.39 1962.87 0 1397.06 444.884 0 0 0 0 0 0 0.08 -1523.56 -805.46 0 1466.49 0 2400.05 0 0 0 0 0 292.749 0 0 0 0 0 -1585.97 0 0 0 0 -1254.84 -1125.75 -439.085 1608.1 0 0 0 771.737 0 0 0 0 0 1080.74 0 0 0 0 0 2110.28 -2178.49 0 0 0 0 0 0 0 0 -1345.33 1374.94 0 
0 0 0 0 0 0 0 2445.68 0 811.258 0 2061.14 -775.704 0 0 0 0 1535.77 450.987 0 -2349.09 0.04 0 0 0 2368.92 0 0 0 2151.48 0 0 435.728 269.25 0 0 174.947 0 626.774 0 0 0 -1655.1 0 0 449.004 0 0 0 992.996 0 0 0 925.092 0 0 0 0 0 -1645.94 0 0 0 0 -582.675 0 1973.25 0 0 0 0 0 0 0 0 
0 0 0 0 0 1021.68 0 0 0 0 0 0 0 0 0 0 0 349.513 0 -1508.61 1144.22 0 0.09 0 0 0 0 1913.74 0 0 0 0 0 0 0 0 2446.29 2292.17 0 0 0 0 1491.06 -1831.8 0 0 0 0 -1077.38 0 0 0 0 0 0 0 0 0 0 0 0 0 0 0 0 0 0 0 1861.71 -1957.38 0 112.384 0 0 0 
0 0 0 -1735.66 0 0 -331.965 0 0 0 0 0 0 -830.79 0 2400.2 -311.06 0 0 1802.8 0 0 0 0.03 0 0 0 -982.315 0 0 1103.17 0 0 0 0 0 0 1038.93 1108.81 0 0 0 0 0 0 0 0 0 0 1945.33 0 -211.417 0 0 0 0 0 0 0 0 0 0 0 0 0 0 0 0 0 0 0 0 0 -2368.16 0 
0 0 0 0 0 0 447.783 1692.18 0 1755.2 0 0 -1174.89 0 0 0 0 0 0 0 554.75 0 0 0 0.09 2199.09 0 -1138.72 1626.26 0 0 -265.13 861.156 1874.52 0 0 0 0 0 266.045 270.013 -807.901 1562.32 0 0 0 -2122.94 0 -2398.07 0 0 0 0 0 0 0 -1559.42 0 0 0 0 0 0 0 0 0 0 0 0 0 0 0 0 0 0 
0 0 23.423 584.658 -1183.58 0 0 0 442.747 522.553 0 0 0 0 0 0 0 0 0 0 0 -1330.07 0 0 964.919 0.02 0 2461.85 0 0 0 867.412 178.457 0 -2086.02 0 0 0 0 0 1753.52 0 0 0 707.953 0 0 0 0 2336.27 0 0 0 0 0 0 0 0 0 0 0 -1264.31 0 0 0 0 0 0 0 0 0 0 0 2304.68 0 
1121.33 0 0 666.601 0 0 0 0 0 0 2477.11 1704.99 1149.71 0 0 0 0 0 0 0 1794.26 0 0 0 0 0 0.09 0 0 0 0 0 -1075.55 0 0 0 897.32 0 888.318 0 739.692 0 0 0 0 0 0 1215.78 2255.7 0 0 -932.417 0 -659.581 -1121.63 0 0 0 888.165 0 0 0 0 -353.175 0 0 0 0 0 0 0 0 0 0 0 
-901.746 306.94 1922.28 0 0 0 0 -1326.41 0 0 55.9252 0 0 0 0 -174.947 -678.655 0 0 0 0 0 2328.79 -2092.58 2498.17 -2126.15 0 0.06 0 1075.4 0 0 0 1442.99 1934.03 0 -494.018 -42.6496 0 0 1420.26 165.029 912.732 2403.26 0 0 0 0 0 -424.589 0 1243.71 0 0 0 1140.25 0 -2186.42 0 0 0 -2221.37 477.386 0 0 0 0 0 0 0 0 0 1031.14 0 0 
0 0 0 0 0 1173.97 0 0 1269.8 0 1734.29 0 2220.91 0 0 -1668.37 0 0 0 667.516 0 0 0 0 1112.63 0 0 0 0.04 0 -1907.64 0 -369.503 191.275 0 0 0 -705.359 0 0 0 0 0 0 0 0 0 0 0 0 0 0 0 0 0 0 0 0 0 0 0 0 0 513.55 0 0 0 -1306.42 0 0 0 2465.51 0 -683.844 0 
0 89.6481 0 0 0 1606.11 1963.64 0 0 0 1738.56 0 0 0 0 0 0 0 0 0 0 -1523.71 0 0 0 0 0 -1839.27 0 0.09 0 0 527.589 838.42 0 0 0 0 0 0 853.832 0 0 0 2441.4 0 0 0 863.598 -996.506 251.244 -2304.68 0 0 0 0 0 -189.138 0 0 0 0 406.278 0 0 -517.975 -127.644 0 0 0 0 0 0 0 0 
0 -1698.43 0 0 -1873.76 0 0 2186.88 0 0 0 0 281.915 0 0 0 0 2306.21 0 657.445 0 0 0 2336.57 0 0 0 0 -1116.6 0 0.09 -724.281 687.048 0 0 0 0 0 0 0 0 0 -1458.4 0 1183.58 0 0 0 2308.34 0 0 0 0 978.652 0 -355.464 -2162.47 0 0 0 662.328 0 0 0 0 0 0 0 -810.038 31.0526 0 2002.55 0 0 0 
0 0 0 0 0 1663.03 0 0 0 0 0 0 0 0 0 -1916.94 0 0 0 2093.34 0 0 0 0 2381.89 817.209 0 0 0 0 -1930.68 0.01 0 -194.174 0 0 -587.863 0 0 0 -1773.96 0 0 0 0 0 0 0 0 2163.53 0 0 0 1512.42 0 0 0 0 0 0 0 0 0 0 0 0 0 0 -942.793 0 0 0 0 0 0 
0 1911.45 1651.43 0 2363.43 0 0 -1448.18 0 0 -259.636 0 0 0 0 -1961.65 0 0 795.694 0 243.614 -2225.03 0 0 224.082 2029.71 -1656.01 0 2323.76 631.962 832.926 0 0 0 -1289.48 0 0 0 0 0 0 1921.37 0 0 0 0 1462.83 0 0 0 0 0 -811.563 0 0 0 0 608.768 0 0 0 1578.04 0 0 0 0 0 0 0 0 655.766 0 0 0 0 
0 2406.61 0 0 0 0 0 0 0 0 2325.59 0 0 -2054.73 -609.073 0 0 -199.21 2498.78 0 0 526.368 0 0 -1067.31 0 0 -1460.84 1020.77 -757.546 0 159.841 0 0.08 0 -1150.17 0 109.485 0 934.553 0 0 -1430.48 23.8807 0 2272.48 0 2440.49 0 0 0 0 0 0 0 0 81.1029 0 0 0 0 0 0 0 0 0 0 0 0 0 0 0 0 0 0 
1075.24 0 0 0 1685.46 -1236.53 0 0 2312.46 711.615 0 0 0 0 0 0 0 2010.33 0 0 0 0 0 0 0 2075.49 0 987.35 0 0 0 0 2494.96 0 0.04 0 0 0 0 92.3948 0 0 -1151.39 0 0 0 0 2207.63 -114.673 0 0 0 0 0 0 0 0 0 -1677.98 0 0 0 417.875 0 0 0 0 0 0 0 -1049.3 -998.642 0 0 0 
0 2067.09 0 0 2214.8 0 0 1964.4 -1241.57 0 0 0 -1124.84 2465.51 0 -1882.92 0 0 -1003.83 0 0 0 0 0 0 0 0 0 0 0 0 0 0 2310.02 0 0.03 0 0 0 0 0 1238.67 0 0 -1098.59 0 0 -1101.95 0 -314.57 0 0 0 0 0 0 0 0 0 29.0689 0 0 0 -2424.31 2026.96 0 0 0 0 0 0 0 0 0 -1777.93 
0 0 -2101.28 -1174.73 1968.52 2312.77 0 1756.72 0 0 0 0 911.206 0 0 0 0 1277.73 2248.07 2233.57 0 -940.657 -108.417 0 0 0 1036.79 1967.45 0 0 0 -486.999 0 0 0 0 0.05 1492.43 0 -1793.5 0 0 0 -272.759 0 2115.77 0 0 0 0 0 0 0 0 0 0 -330.592 0 0 0 -930.891 709.326 0 0 0 -514.161 0 0 0 0 0 0 0 0 0 
0 1948.23 0 458.007 0 0 0 0 0 0 0 0 1712.78 0 0 0 2293.54 0 0 0 0 0 1508.61 -2190.69 0 0 0 238.731 2325.28 0 0 0 0 -101.093 0 0 1609.32 0.01 0 0 0 218.436 -1211.36 0 0 0 0 533.387 0 0 0 0 446.257 0 0 0 0 0 0 0 0 0 0 0 0 0 0 0 0 0 0 0 0 0 -1456.88 
0 0 0 0 1355.1 0 0 591.525 0 0 0 1719.79 1295.28 0 0 -2038.56 630.284 0 0 0 2360.68 -1097.98 0 43.8704 0 0 -764.26 0 0 0 0 0 0 0 0 0 0 0 0.02 0 0 0 0 -2154.53 0 0 0 0 0 0 1748.79 1509.52 -1427.27 0 -68.7429 0 0 0 344.325 0 0 0 0 0 0 0 0 0 0 0 0 0 0 0 0 
0 1966.38 0 2465.36 0 0 0 0 0 0 -2238.3 0 432.829 0 0 0 0 0 0 0 0 0 0 0 -1658.15 0 0 0 0 0 0 0 0 1515.47 2404.02 0 1873.3 0 0 0.01 2016.43 0 0 0 0 0 0 -1849.8 0 -642.338 0 0 0 0 0 0 0 0 0 0 0 0 0 0 0 -1741.61 0 0 0 0 1704.99 0 0 0 0 
928.449 1712.93 0 2330.77 0 0 0 0 -1571.78 0 569.857 2113.94 -1016.5 0 0 0 0 0 0 0 0 0 0 0 -772.5 1009.17 583.743 1243.55 0 -553.987 0 750.526 0 0 0 0 0 0 0 -566.042 0.09 0 0 1760.84 0 0 0 1764.5 487.304 0 0 23.1178 0 0 0 0 0 0 0 0 0 0 0 0 0 0 0 0 0 0 0 0 0 0 0 
0 0 1392.94 -1688.36 0 1060.29 1418.58 -17.777 0 0 -847.118 0 0 0 2120.96 0 0 0 -873.821 0 0 0 0 0 -1452.45 0 0 1936.17 0 0 0 0 2485.05 0 0 -1565.07 0 -1114.31 0 0 0 0.09 0 -2227.47 0 0 0 -2444.15 0 1871.78 0 970.565 0 0 0 0 0 0 0 0 0 0 0 0 0 0 0 914.411 0 0 0 0 0 -413.144 0 
0 0 1183.58 -1624.12 -673.467 0 1017.87 0 0 0 0 0 0 0 0 0 -325.556 -1816.23 0 0 0 2099.6 -2071.06 0 2151.63 0 0 -438.169 0 0 826.212 0 0 -1388.82 -1297.57 0 0 2202.6 0 0 0 0 0.06 1350.83 0 0 0 0 -1817.91 0 0 0 0 0 0 0 0 0 2148.73 0 0 0 0 0 0 0 0 0 2137.75 0 -2045.58 0 0 0 0 
0 0 1486.02 0 0 0 0 0 332.423 0 2206.56 0 0 0 -2118.06 0 -1131.24 -1163.44 1658.15 0 568.941 0 1934.8 0 0 0 0 1687.29 0 0 0 0 0 -254.753 0 0 -108.57 0 2012.47 0 2137.75 -442.747 -604.038 0.06 0 0 0 0 502.411 1601.54 0 0 0 0 0 0 0 0 0 0 0 794.473 0 100.482 0 0 0 0 0 0 0 0 0 0 0 
0 2444.46 0 2263.18 0 0 0 0 0 0 -837.199 0 0 1547.67 0 0 1643.19 0 0 -400.937 1455.05 0 0 0 0 769.143 0 0 0 2219.84 1624.58 0 0 0 0 -557.192 0 0 0 0 0 0 0 0 0 1791.06 0 0 -2341.46 0 0 0 0 0 0 0 0 982.162 0 -1894.97 0 0 0 0 -316.248 0 0 0 1159.47 0 0 0 0 0 0 
0 -2423.25 0 -2118.98 0 0 978.5 0 0 705.512 0 0 0 0 -528.657 0 -537.965 0 0 0 2300.1 1113.39 0 0 0 0 0 0 0 0 0 0 0 2243.03 0 0 2110.13 0 0 0 0 0 0 0 -696.051 0.01 0 0 0 0 0 1813.79 0 0 0 0 0 0 0 0 0 0 0 0 0 0 -1805.7 0 0 0 0 1051.74 0 0 0 
656.987 2144.76 0 1370.2 0 0 0 0 0 0 0 0 1638 0 0 0 0 0 83.0866 0 -1466.03 0 0 0 -1268.73 0 0 0 0 0 0 0 1298.94 0 0 0 0 0 0 0 0 0 0 0 0 0 0.01 0 -1138.26 0 1713.39 0 0 0 0 -1620.15 0 -2235.1 0 0 0 0 138.325 0 0 0 -34.1044 0 0 -473.571 0 0 0 0 0 
0 0 0 0 0 0 2393.03 0 0 1842.48 0 0 0 199.667 0 0 0 0 0 0 0 0 0 0 0 0 -1341.52 0 0 0 0 0 0 1624.42 -30.2896 420.011 0 2356.56 0 -1863.69 -918.073 -1985.61 0 0 0 0 0 0 0 -1106.22 443.358 0 2121.42 1479.61 0 0 0 0 0 0 0 0 0 0 0 0 0 0 0 0 0 -2395.47 1283.38 0 0 
0 1536.68 0 120.624 0 0 0 0 -1333.12 0 0 0 0 0 1303.37 0 0 -2177.11 0 0 0 0 -918.531 0 1170.16 0 -230.796 0 0 -2104.48 1520.36 0 0 0 1773.05 0 0 0 0 0 2358.24 0 421.079 1722.85 2147.97 0 1759.62 0 0.03 0 0 0 0 0 0 0 0 1013.75 0 0 0 0 1837.44 0 0 0 0 0 0 0 0 0 0 0 0 
-1583.53 645.848 0 0 0 0 796.915 -928.449 1316.64 0 0 169.759 -647.069 0 0 0 2490.39 0 0 0 0 1506.93 0 -337.764 0 -313.349 0 -709.021 0 -1906.26 0 1025.35 0 0 0 -769.906 0 0 0 1566.29 0 -1142.38 0 1245.08 0 0 0 -920.515 0 0 0 0 0 0 -335.322 0 0 0 0 0 594.577 0 2296.44 0 0 -416.807 0 0 -487.762 2007.74 0 0 0 0 0 
1487.4 0 1760.69 0 0 0 1352.5 0 0 0 1038.01 0 -1874.52 -2497.71 0 0 201.346 0 0 0 952.559 0 0 0 0 0 0 0 0 -2034.29 0 0 0 0 0 0 0 0 816.904 0 0 0 0 0 0 0 -604.648 2462.31 0 0 0.01 0 0 0 0 0 0 0 0 -32.5785 0 0 0 0 0 0 2333.67 0 0 0 0 0 0 0 -2214.96 
0 0 0 0 -41.8867 -727.485 0 2080.22 0 128.407 2182 61.1133 0 0 0 0 0 0 0 0 0 0 0 -1289.79 0 0 2119.28 -658.513 0 1582.77 0 0 0 0 0 0 0 0 1793.19 0 2109.21 1791.21 0 0 0 816.904 0 0 0 0 0 0.03 0 0 0 0 0 0 755.257 0 0 0 0 0 0 2057.48 2051.68 0 0 0 0 0 0 0 0 
0 1729.41 0 0 -160.756 0 0 0 0 0 0 0 0 0 0 764.718 0 0 0 0 0 0 0 0 0 0 0 0 0 0 0 0 1601.08 0 0 0 0 1363.64 164.113 0 0 0 0 0 0 0 0 -840.861 0 0 0 0 0.08 0 0 0 -233.085 0 0 0 0 0 0 0 0 0 0 0 0 0 0 0 0 0 0 
0 0 0 0 0 0 0 0 0 810.495 0 0 0 0 0 0 221.641 0 0 0 0 2439.73 0 0 0 0 -1170.31 0 0 0 2098.53 1758.1 0 0 0 0 0 0 0 0 0 0 0 0 0 0 0 2182 0 0 0 0 0 0.02 -375.149 0 0 -84.1548 0 0 0 0 0 0 0 0 0 0 0 0 0 0 0 0 0 
0 0 0 0 0 0 1544.77 1927.32 0 0 0 0 0 0 0 0 0 0 0 0 0 0 0 0 0 0 551.241 0 0 0 0 0 0 0 0 0 0 0 1745.73 0 0 0 0 0 0 0 0 0 0 -1617.1 0 0 0 626.164 0.01 0 0 0 0 0 0 0 0 0 0 1098.9 0 0 0 0 0 1121.48 -2290.03 0 0 
0 0 0 1528.75 0 -317.469 -290.307 0 0 0 0 0 0 0 0 0 0 0 0 0 0 0 0 0 0 0 0 263.146 0 0 2252.04 0 0 0 0 0 0 0 0 0 0 0 0 0 0 0 821.787 0 0 0 0 0 0 0 0 0 0 517.518 0 0 0 0 0 0 0 0 0 0 0 0 -1936.63 0 2232.96 0 0 
0 0 0 0 0 0 0 -97.2777 0 0 0 0 0 0 0 0 1092.49 0 0 0 -1162.37 0 0 0 334.712 0 0 0 0 0 2202.75 0 0 -1212.58 0 0 671.789 0 0 0 0 0 0 0 0 0 0 0 0 0 0 0 1895.73 0 0 0 0.02 0 0 0 -864.055 0 0 0 -2050.31 0 0 0 0 0 0 0 0 0 0 
0 0 0 1203.88 0 0 0 0 0 0 0 0 0 0 -1946.39 0 0 0 0 0 0 0 0 0 0 0 0 1675.7 0 2038.87 0 0 1311.61 0 0 0 0 0 0 0 0 0 0 0 2102.95 0 -685.827 0 1101.79 0 0 0 0 -275.658 0 1805.25 0 0.08 0 0 0 0 0 0 0 0 0 0 0 0 0 0 0 0 0 
0 0 0 0 0 -2429.2 0 0 -1968.67 0 0 0 0 0 0 0 0 0 0 0 0 0 0 0 0 0 2098.07 0 0 0 0 0 0 0 1738.72 0 0 0 -1018.48 0 0 0 -148.701 0 0 0 0 0 0 0 0 1493.65 0 0 0 0 0 0 0 0 0 0 0 0 0 0 0 0 0 0 0 0 0 0 0 
0 0 0 0 0 0 0 0 1454.13 0 0 0 2344.05 -1101.18 0 0 0 0 0 0 0 2019.33 0 0 0 0 0 0 0 0 0 0 0 0 0 2301.17 0 0 0 0 0 0 0 0 -941.115 0 0 0 0 0 702.612 0 0 0 0 0 0 0 0 0.02 0 1624.58 0 0 0 0 0 0 0 0 0 0 0 0 0 
0 0 0 0 0 0 0 1075.85 0 0 0 2045.73 0 0 0 -2092.88 0 0 0 0 0 0 0 0 0 0 0 0 0 0 -58.3666 0 0 0 0 0 -284.204 0 0 0 0 0 0 0 0 0 0 0 0 1381.95 0 0 0 0 0 0 939.741 0 0 0 0 0 0 0 0 0 0 0 -280.694 0 0 0 0 0 0 
0 0 0 0 0 0 0 0 0 0 737.251 0 -262.841 0 0 2056.87 0 0 0 0 0 0 0 0 0 -620.212 0 290.307 0 0 0 0 1197.01 0 0 0 -2077.62 0 0 0 0 0 0 -558.87 0 0 0 0 0 0 0 0 0 0 0 0 0 0 0 1854.69 0 0.08 0 0 0 0 0 0 1334.5 0 0 0 0 1689.73 0 
0 0 0 0 0 0 0 0 0 0 0 0 0 0 0 0 0 0 0 0 490.967 0 0 0 0 0 0 2256.31 0 -1316.95 0 0 0 0 147.481 0 0 0 0 0 0 0 0 0 0 0 -60.8081 0 1033.13 -1709.27 0 0 0 0 0 0 0 0 0 0 0 0 0.04 0 -2065.11 0 2252.65 0 0 0 0 0 0 0 0 
0 0 0 0 561.617 0 0 0 0 0 0 0 0 0 1056.17 674.078 0 1138.26 0 0 710.242 0 0 0 0 0 -1342.13 0 -1524.02 0 0 0 0 0 0 1388.21 0 0 0 0 0 0 0 470.214 0 0 0 0 0 0 0 0 0 0 0 0 0 0 0 0 0 0 0 0.04 0 0 0 0 1602.6 -792.795 -644.017 0 0 0 0 
0 0 0 0 0 0 0 0 0 0 0 -1222.5 0 0 0 0 0 0 0 -476.318 0 1539.89 0 0 0 0 0 0 0 0 0 0 0 0 0 181.509 0 0 0 0 0 0 0 0 -1494.11 0 0 0 0 0 0 0 0 0 0 0 1443.6 0 0 0 0 0 -924.329 0 0.02 0 0 2335.66 0 0 0 0 1630.07 0 -421.232 
0 0 1002.15 0 0 0 0 0 2153.92 0 0 0 0 0 0 0 0 0 0 0 0 0 0 0 0 0 0 0 0 373.775 0 0 0 0 0 0 2488.71 0 0 -1469.85 0 0 0 0 0 0 0 0 0 1203.12 0 -78.814 0 0 370.418 0 0 0 0 0 0 0 0 0 0 0.08 -260.094 1882 0 0 0 0 0 0 0 
0 0 0 0 0 0 0 0 0 0 0 0 0 -1344.42 0 0 0 0 1482.82 0 0 -833.842 0 0 0 0 0 0 0 80.34 0 0 0 0 0 0 0 0 0 0 0 0 0 0 0 1469.85 -1633.43 0 0 0 -321.589 2162.01 0 0 0 0 0 0 0 0 0 0 2035.05 0 0 -104.755 0.09 0 0 0 -975.448 1386.38 0 0 0 
0 0 -308.313 0 0 0 0 0 0 0 1867.05 0 0 0 0 0 0 0 0 -443.358 0 0 0 0 0 0 0 0 -1528.75 0 0 0 0 0 0 0 0 0 0 0 0 1535.77 0 0 0 0 0 0 0 0 0 0 0 0 0 0 0 0 0 0 0 0 0 0 1177.33 -760.445 0 0.04 0 0 0 0 0 0 0 
-2457.27 0 0 0 0 0 0 0 0 0 551.851 0 -633.488 0 0 0 2006.97 0 0 0 0 0 -1097.98 0 0 0 0 0 0 0 -1349.15 1317.1 0 0 0 0 0 0 0 0 0 0 1104.24 0 -1739.17 0 0 0 0 2477.87 0 0 0 0 0 0 0 0 0 0 2400.36 -412.381 0 1926.25 0 0 0 0 0.02 0 0 0 1523.1 0 0 
0 0 0 0 -619.144 0 0 0 0 0 0 0 0 -1032.36 0 0 0 0 0 0 0 0 169.759 0 0 0 0 0 0 0 1507.39 0 0 0 0 0 0 0 0 0 0 0 0 0 0 0 -1036.18 0 0 1187.25 0 0 0 0 0 0 0 0 0 0 0 0 0 29.2215 0 0 0 0 0 0.05 0 0 0 0 0 
0 0 0 0 0 0 0 0 0 963.851 0 1193.5 0 0 0 0 0 0 0 0 0 0 0 0 0 0 0 0 0 0 0 0 2336.42 0 -991.012 0 0 0 0 -1451.99 0 0 1385.16 0 0 0 0 0 0 0 0 0 0 0 0 1360.9 0 0 0 0 0 0 0 -2367.09 0 0 2257.53 0 0 0 0.04 0 0 0 0 
0 0 0 0 0 0 0 0 0 0 0 0 0 0 0 0 0 0 0 0 0 0 1906.42 0 0 0 0 0 432.371 0 1653.42 0 0 0 902.051 0 0 0 0 0 0 0 0 0 0 -177.084 0 1133.08 0 0 0 0 0 0 -8.01111 0 0 0 0 0 0 0 0 0 0 0 -2406.77 0 0 0 0 0.05 0 0 0 
0 0 0 0 0 0 0 0 0 0 0 0 0 0 0 0 0 0 0 0 -368.587 0 0 0 0 0 0 523.011 0 0 0 0 0 0 0 0 0 0 0 0 0 0 0 0 0 0 0 118.03 0 0 0 0 0 0 271.233 884.655 0 0 0 0 0 0 0 0 850.932 0 0 0 215.079 0 0 0 0.06 0 -1539.58 
0 0 0 0 0 0 0 -1775.19 0 0 0 0 0 0 0 0 0 0 0 0 469.909 0 0 1848.12 0 1223.11 0 0 1059.68 0 0 0 0 0 0 0 0 0 0 0 0 -463.5 0 0 0 0 0 0 0 0 0 0 0 0 0 0 0 0 0 0 0 284.204 0 0 0 0 0 0 0 0 0 0 0 0.08 0 
0 0 0 0 0 0 0 0 0 0 0 0 0 0 0 0 0 0 0 -425.199 0 0 0 0 0 0 0 0 0 0 0 0 0 0 0 1586.12 0 -262.993 0 0 0 0 0 0 0 0 0 0 0 0 562.838 0 0 0 0 0 0 0 0 0 0 0 0 0 -7.24815 0 0 0 0 0 0 0 325.709 0 0.06 
