*Vertices 56
*Matrix 
0.04 0 0 0 0 0 -334.101 0 0 0 0 0 0 0 -1214.1 0 0 0 0 0 0 0 0 0 0 0 0 0 0 0 0 0 0 0 1519.75 0 0 0 0 0 0 0 0 0 0 0 1595.43 0 0 0 0 0 0 0 0 0 
0 0.05 0 0 -1903.97 1944.87 0 0 1736.88 0 0 2163.38 0 0 0 0 0 0 0 0 0 -433.287 0 0 0 0 0 0 0 0 0 0 2247 0 0 0 0 0 0 0 0 0 0 0 0 0 0 0 2466.58 0 0 0 0 0 0 0 
0 0 0.06 0 918.989 0 0 0 0 0 158.773 0 0 0 0 0 0 0 0 1365.63 0 1386.38 0 533.998 2480.47 0 0 0 0 0 0 0 0 0 0 0 0 0 0 0 0 0 0 0 0 0 1574.83 1883.53 0 851.085 0 0 0 0 0 0 
0 0 0 0.01 0 0 0 0 0 0 0 0 0 0 0 0 0 0 2425.38 0 0 0 0 0 0 0 0 0 0 0 810.343 0 0 0 0 0 0 0 986.892 0 0 -941.572 0 0 0 0 0 0 0 0 -621.128 0 0 0 0 0 
0 -293.664 1539.74 0 0.04 0 0 0 0 0 0 190.512 0 0 0 -123.981 0 0 0 0 0 0 0 0 0 0 0 0 0 0 0 0 0 1590.09 0 0 0 0 -2392.88 0 0 0 0 0 0 0 0 0 0 0 0 0 0 0 0 0 
0 -1346.71 0 0 0 0.04 -1281.09 0 0 0 0 0 0 0 -985.519 0 0 0 786.691 0 0 0 0 0 0 0 0 0 1138.42 2050.46 178.152 0 -214.621 0 0 0 0 0 0 610.141 0 0 0 0 0 0 0 0 0 0 1654.18 0 0 0 0 0 
-1755.04 0 0 0 0 -2164.45 0.07 0 2442.32 0 0 0 0 0 1115.07 0 0 0 0 0 -1773.96 0 0 0 0 0 0 0 0 0 0 0 1729.71 0 0 0 0 125.965 0 0 0 0 0 0 0 0 0 983.688 0 0 -1162.07 0 0 0 0 0 
0 0 0 0 0 0 0 0 0 0 0 0 0 37.9192 1385.62 0 0 0 0 0 0 1966.23 0 0 -1730.93 0 0 0 0 0 0 0 0 0 0 0 0 0 0 0 0 0 0 0 0 0 0 0 0 0 0 0 0 0 0 0 
0 -1034.5 0 0 0 0 -836.436 0 0.09 0 0 0 0 -1987.44 0 1361.51 0 0 0 0 0 0 0 0 0 0 0 0 0 0 0 0 2058.55 0 0 1690.5 0 0 0 0 89.1903 1366.08 0 0 0 0 0 0 0 0 0 0 0 0 0 0 
0 0 0 0 0 0 0 0 0 0.04 0 0 0 0 0 -2002.4 0 0 0 0 0 419.858 0 0 0 0 0 405.515 0 0 2482.15 0 0 0 0 2476.96 0 0 1280.02 0 0 0 1915.88 0 0 0 0 0 0 0 0 0 0 0 0 0 
0 0 676.519 0 0 0 0 0 0 0 0.05 125.05 -1551.18 0 0 0 0 0 0 0 0 711.768 0 0 0 0 0 123.371 0 0 0 0 0 0 0 0 0 0 2375.33 0 0 -2037.64 0 -50.4318 0 0 0 0 2274.01 0 -2064.04 0 0 0 0 0 
0 -1938.46 0 0 1519.44 0 0 0 0 0 -2385.86 0.07 0 158.467 -602.969 2418.52 0 0 2198.32 0 0 0 0 0 0 0 0 0 0 0 25.2541 997.574 0 0 -232.627 0 0 0 0 0 0 2192.53 -467.467 0 0 0 0 0 0 1757.64 0 0 0 0 0 0 
0 0 0 0 0 0 0 0 0 0 2280.42 0 0 0 0 0 0 0 0 0 0 0 0 0 0 0 0 0 0 0 -294.427 0 0 0 0 0 0 0 0 0 0 1907.03 0 0 0 0 0 2323.45 0 0 0 0 0 0 0 0 
0 0 0 0 0 0 0 1628.24 73.7785 0 0 -1042.28 0 0.01 0 0 0 0 0 0 0 -35.6304 0 0 0 0 0 0 1165.43 0 0 0 0 0 0 0 0 0 0 0 0 0 0 0 2422.18 0 0 0 0 0 1368.22 0 0 0 0 0 
-1591.31 0 0 0 0 -1724.68 2116.99 1956.47 0 0 0 128.101 0 0 0.01 0 0 0 0 0 0 0 0 0 0 0 0 0 0 0 0 616.245 1310.39 0 0 0 0 0 0 0 0 0 0 0 0 0 0 0 0 0 0 0 0 0 0 0 
0 0 0 0 -58.8244 0 0 0 -1453.67 -1789.68 0 1854.53 0 0 0 0.02 0 0 0 0 0 0 1490.14 0 0 0 0 0 0 0 0 0 0 0 2425.69 0 857.341 0 0 0 0 0 0 0 0 0 0 0 0 930.586 0 0 1934.8 0 0 0 
0 0 0 0 0 0 0 0 0 0 0 0 0 0 0 0 0 911.512 -1658.45 0 0 0 0 0 0 665.075 -2216.64 0 0 0 0 0 0 0 1390.04 0 1549.5 0 1723.15 0 49.3637 0 0 0 1083.33 0 0 0 0 0 0 0 0 0 0 0 
0 0 0 0 0 0 0 0 0 0 0 0 0 0 0 0 -1281.09 0.03 0 0 0 0 0 0 0 0 0 0 0 0 0 0 0 0 52.1104 1833.02 718.329 0 -507.752 -1252.1 0 2183.68 0 0 -385.83 204.093 0 0 1986.53 0 0 0 0 0 -544.526 0 
0 0 0 2476.04 0 188.681 0 0 0 0 0 -1573.76 0 0 0 0 -750.679 0 0.01 0 0 0 0 0 0 0 0 0 0 2455.6 928.755 0 0 0 0 1663.18 0 0 0 0 0 0 0 -1311.76 0 0 -883.892 0 0 0 0 0 0 0 0 0 
0 0 1438.11 0 0 0 0 0 0 0 0 0 0 0 0 0 0 0 0 0 0 0 0 0 0 0 0 0 0 0 0 0 0 0 0 0 1337.55 -1649.14 1037.25 0 0 0 0 0 2388.61 0 140.004 0 1145.44 0 0 0 0 0 0 0 
0 0 0 0 0 0 1464.35 0 0 0 0 0 0 0 0 0 0 0 0 0 0.07 0 0 0 0 0 0 0 0 0 0 0 0 0 0 0 0 154.805 0 0 -877.636 -549.409 0 0 0 -554.75 0 0 0 2215.26 0 0 0 0 0 0 
0 -396.664 -1440.86 0 0 0 0 -1178.7 0 1789.83 1032.36 0 0 1844.46 0 0 0 0 0 0 0 0.09 0 0 0 0 0 0 0 -1869.03 -1940.9 1307.49 0 0 0 0 0 0 0 0 0 0 0 0 0 0 0 0 0 2365.26 0 0 0 0 0 0 
0 0 0 0 0 0 0 0 0 0 0 0 0 0 0 1564.91 0 0 0 0 0 0 0.03 0 0 -2185.05 0 0 0 0 0 0 -761.055 0 0 0 417.264 0 0 2241.36 0 0 0 1788 0 0 0 0 0 0 0 0 0 0 0 0 
0 0 1514.25 0 0 0 0 0 0 0 0 0 0 0 0 0 0 0 0 0 0 0 0 0 0 1627.63 52.1104 0 0 0 0 0 0 0 0 0 0 0 0 0 0 -1342.89 -298.853 0 0 0 0 0 0 0 0 0 0 0 0 0 
0 0 2194.66 0 0 0 0 1094.93 0 0 0 0 0 0 0 0 0 0 0 0 0 0 0 0 0.07 0 0 0 0 0 0 0 0 0 0 2371.52 0 0 1450.01 0 0 -1853.92 0 0 0 0 0 -1641.06 0 1304.9 0 0 0 0 0 0 
0 0 0 0 0 0 0 0 0 0 0 0 0 0 0 0 -560.091 0 0 0 0 0 55.4674 1219.29 0 0.02 1754.89 0 0 0 0 0 0 0 0 0 0 0 0 0 0 0 0 0 0 0 0 0 0 0 0 0 0 0 0 0 
0 0 0 0 0 0 0 0 0 0 0 0 0 0 0 0 -871.227 0 0 0 0 0 0 -963.851 0 -195.242 0.09 -1862.47 402.921 0 0 0 276.574 0 0 0 491.272 0 0 0 1418.42 0 0 0 0 0 0 1754.13 0 0 0 0 0 0 0 0 
0 0 0 0 0 0 0 0 0 230.033 1817.91 0 0 0 0 0 0 0 0 0 0 0 0 0 0 0 1133.08 0 0 0 0 0 0 -34.1044 0 0 0 0 0 0 0 0 1880.32 0 0 0 0 1699.65 0 0 0 0 0 0 0 0 
0 0 0 0 0 -1136.13 0 0 0 0 0 0 0 2057.63 0 0 0 0 0 0 0 0 0 0 0 0 -21.897 0 0 0 0 0 0 0 0 0 2496.19 0 0 0 1584.44 0 0 0 0 0 0 0 0 0 0 0 0 0 0 0 
0 0 0 0 0 2223.2 0 0 0 0 0 0 0 0 0 0 0 0 450.682 0 0 -1479.77 0 0 0 0 0 0 0 0.05 0 0 0 0 0 0 0 0 0 0 0 0 0 0 0 0 0 0 0 0 0 0 0 0 0 0 
0 0 0 926.618 0 -1396.15 0 0 0 -550.325 0 782.723 -2023.91 0 0 0 0 0 1235.47 0 0 713.599 0 0 0 0 0 0 0 0 0.06 0 0 0 0 0 0 0 0 0 1277.73 0 -522.706 0 0 0 0 950.88 1619.85 0 0 0 0 0 0 0 
0 0 0 0 0 0 0 0 0 0 0 -561.159 0 0 614.719 0 0 0 0 0 0 2028.18 0 0 0 0 0 0 0 0 0 0.05 1536.84 0 997.269 0 -2062.82 0 -1740.7 0 0 0 0 0 0 0 0 1485.87 0 0 0 0 0 0 0 988.266 
0 566.958 0 0 0 1162.22 -2045.27 0 2396.39 0 0 0 0 0 1179.31 0 0 0 0 0 0 0 2230.52 0 0 0 -636.082 0 0 0 0 -2299.04 0.07 0 0 0 0 0 0 -1458.25 0 0 0 1739.78 0 0 0 0 0 0 0 0 0 0 0 0 
0 0 0 0 -95.7518 0 0 0 0 0 0 0 0 0 0 0 0 0 0 0 0 0 0 0 0 0 0 1804.03 0 0 0 0 0 0.04 0 0 0 0 0 0 0 0 0 0 0 0 0 0 0 0 0 2361.9 0 0 0 0 
2114.25 0 0 0 0 0 0 0 0 0 0 -915.479 0 0 0 893.811 2196.8 2079.15 0 0 0 0 0 0 0 0 0 0 0 0 0 -2183.07 0 0 0.05 643.406 0 1370.36 0 0 -378.353 0 0 0 0 0 0 0 0 0 0 0 0 0 0 0 
0 0 0 0 0 0 0 0 446.409 2059.16 0 0 0 0 0 0 0 953.169 -1951.43 0 0 0 0 0 -216.147 0 0 0 0 0 0 0 0 0 -2288.35 0.04 0 0 0 0 1291.31 0 0 1237.6 0 0 0 0 0 0 0 0 0 0 0 0 
0 0 0 0 0 0 0 0 0 0 0 0 0 0 0 1719.64 -335.475 1676.92 0 -108.112 0 0 682.623 0 0 0 894.269 0 -1605.66 0 0 2054.73 0 0 0 0 0.01 0 0 0 0 0 0 0 0 0 0 0 0 0 0 0 0 0 0 0 
0 0 0 0 0 0 -1453.06 0 0 0 0 0 0 0 0 0 0 0 0 1920.61 -0.381481 0 0 0 0 0 0 0 0 0 0 0 0 0 294.122 0 0 0.03 0 0 0 0 0 0 0 0 0 0 0 1684.24 0 0 0 0 0 0 
0 0 0 -1978.29 635.014 0 0 0 0 -1182.97 703.07 0 0 0 0 0 2060.23 -0.991852 0 791.116 0 0 0 0 1211.51 0 0 0 0 0 0 1366.24 0 0 0 0 0 0 0.02 0 0 0 0 0 0 0 0 0 -668.126 0 -1590.24 0 0 0 0 0 
0 0 0 0 0 2352.29 0 0 0 0 0 0 0 0 0 0 0 834.3 0 0 0 0 -145.802 0 0 0 0 0 0 0 0 0 17.777 0 0 0 0 0 0 0.03 0 0 -1697.21 -1695.38 0 0 0 0 0 0 0 0 0 0 0 0 
0 0 0 0 0 0 0 0 -60.6555 0 0 0 0 0 0 0 1170.61 0 0 0 2116.99 0 0 0 0 0 -978.195 0 6.18 0 -426.572 0 0 0 1680.12 1992.63 0 0 0 0 0.02 0 0 0 0 0 0 0 0 0 0 0 0 0 0 0 
0 0 0 2470.09 0 0 0 0 -439.543 0 470.672 1849.19 -761.055 0 0 0 0 -1565.22 0 0 140.309 0 0 -1014.97 2418.67 0 0 0 0 0 0 0 0 0 0 0 0 0 0 0 0 0.05 0 418.79 0 0 0 0 -1698.89 545.9 2363.28 0 0 0 0 0 
0 0 0 0 0 0 0 0 0 -712.531 0 -256.127 0 0 0 0 0 0 0 0 0 0 0 1448.48 0 0 0 551.698 0 0 1522.34 0 0 0 0 0 0 0 0 2106.92 0 0 0.08 0 0 0 0 0 907.849 -2115.31 -306.94 0 0 0 0 0 
0 0 0 0 0 0 0 0 0 0 464.11 0 0 0 0 0 0 0 2037.8 0 0 0 -221.335 0 0 0 0 0 0 0 0 0 -1552.71 0 0 -1589.94 0 0 0 -2451.17 0 2217.25 0 0.07 0 1330.99 0 0 0 29.9844 0 0 0 0 0 0 
0 0 0 0 0 0 0 0 0 0 0 0 0 2024.52 0 0 1617.86 2273.25 0 892.743 0 0 0 0 0 0 0 0 0 0 0 0 0 0 0 0 0 0 0 0 0 0 0 0 0.09 0 0 0 -2257.07 1458.86 0 0 0 0 0 0 
0 0 0 0 0 0 0 0 0 0 0 0 0 0 0 0 0 -227.744 0 0 638.066 0 0 0 0 0 0 0 0 0 0 0 0 0 0 0 0 0 0 0 0 0 0 390.713 0 0.04 0 0 0 0 2267.45 0 0 -1553.93 0 0 
1623.97 0 1152.61 0 0 0 0 0 0 0 0 0 0 0 0 0 0 0 387.509 756.63 0 0 0 0 0 0 0 0 0 0 0 0 0 0 0 0 0 0 0 0 0 0 0 0 0 0 0.05 -1275.14 0 0 0 0 0 0 0 0 
0 0 947.676 0 0 0 365.078 0 0 0 0 0 900.83 0 0 0 0 0 0 0 0 0 0 0 2304.83 0 10.4526 -2155.45 0 0 2454.37 1251.79 0 0 0 0 0 0 0 0 0 0 0 0 0 0 -1519.44 0.08 0 0 -161.061 0 0 0 0 0 
0 -483.337 0 0 0 0 0 0 0 0 2277.06 0 0 0 0 0 0 -1337.55 0 2442.78 0 0 0 0 0 0 0 0 0 0 1394.16 0 0 0 0 0 0 0 1968.67 0 0 -1290.25 231.407 0 1781.9 0 0 0 0.02 0 0 0 0 0 0 0 
0 0 -1952.65 0 0 0 0 0 0 0 0 1153.98 0 0 0 -462.127 0 0 0 0 -1649.75 1814.71 0 0 421.384 0 0 0 0 0 0 0 0 0 0 0 0 1674.93 0 0 0 2353.21 -81.4081 -2319.48 1297.88 0 0 0 0 0.01 0 0 0 0 0 0 
0 0 0 -2488.56 0 1527.83 -550.172 0 0 0 2469.79 0 0 -552.766 0 0 0 0 0 0 0 0 0 0 0 0 0 0 0 0 0 0 0 0 0 0 0 0 2396.69 0 0 954.237 -550.783 0 0 -1527.53 0 1142.99 0 0 0.09 0 0 0 0 0 
0 0 0 0 0 0 0 0 0 0 0 0 0 0 0 0 0 0 0 0 0 0 0 0 0 0 0 0 0 0 0 0 0 514.466 0 0 0 0 0 0 0 0 0 0 0 0 0 0 0 0 0 0.05 0 0 0 0 
0 0 0 0 0 0 0 0 0 0 0 0 0 0 0 2154.84 0 0 0 0 0 0 0 0 0 0 0 0 0 0 0 0 0 0 0 0 0 0 0 0 0 0 0 0 0 0 0 0 0 0 0 0 0.03 0 0 0 
0 0 0 0 0 0 0 0 0 0 0 0 0 0 0 0 0 0 0 0 0 0 0 0 0 0 0 0 0 0 0 0 0 0 0 0 0 0 0 0 0 0 0 0 0 1299.55 0 0 0 0 0 0 0 0.01 0 0 
0 0 0 0 0 0 0 0 0 0 0 0 0 0 0 0 0 2037.49 0 0 0 0 0 0 0 0 0 0 0 0 0 0 0 0 0 0 0 0 0 0 0 0 0 0 0 0 0 0 0 0 0 0 0 0 0.07 0 
0 0 0 0 0 0 0 0 0 0 0 0 0 0 0 0 0 0 0 0 0 0 0 0 0 0 0 0 0 0 0 424.284 0 0 0 0 0 0 0 0 0 0 0 0 0 0 0 0 0 0 0 0 0 0 0 0.01 
