*Vertices 47
*Matrix 
0.02 0 0 324.488 0 0 0 0 0 238.273 1688.67 0 0 0 0 0 0 -283.593 0 1875.74 0 -2182 0 0 0 0 841.319 0 0 0 -1447.57 0 0 1224.33 0 -2232.81 0 0 0 0 1036.18 0 1257.13 -1057.08 0 0 0 
0 0.02 1601.23 0 0 0 0 0 -1494.26 0 0 1686.68 0 1877.73 0 0 0 0 0 0 0 -221.488 0 0 0 0 0 0 0 0 0 0 1590.24 -826.06 0 0 0 0 2004.38 0 0 0 0 0 0 0 0 
0 -345.088 0.06 -1861.71 0 0 0 0 0 0 1125.6 0 0 1670.35 0 0 0 0 -711.005 0 0 0 0 0 1956.77 -1441.92 0 -692.389 1566.13 0 0 0 0 0 151.906 -2321.92 0 0 0 1140.86 0 0 0 0 0 0 0 
143.208 0 -1027.79 0.01 0 0 0 1762.06 0 0 -1443.14 0 0 0 -1466.8 0 0 0 0 0 0 -865.886 -598.086 0 0 1736.73 0 0 1737.65 0 2231.28 0 624.79 0 2425.38 0 0 0 0 -975.143 327.693 1286.28 0 0 0 0 0 
0 0 0 0 0.03 -2270.04 0 0 143.361 0 0 0 0 0 0 0 1683.63 0 0 0 0 0 0 0 0 0 0 -1386.07 0 0 0 0 0 1472.14 1704.23 0 0 0 0 75.7622 0 0 0 0 0 0 0 
0 0 0 0 1668.52 0.07 0 0 1484.34 0 -1853.62 0 0 0 0 0 0 2266.69 0 2153.92 0 -619.602 705.359 0 0 1844.61 0 -1026.72 0 0 0 0 0 0 0 0 743.812 0 0 0 266.655 0 1001.08 0 0 0 0 
0 0 0 0 0 0 0.05 -152.974 -2463.07 0 0 0 0 0 0 966.445 0 0 0 2206.41 0 0 1437.04 0 0 0 0 0 0 0 0 0 0 0 0 0 0 0 1522.95 0 0 0 0 0 0 0 0 
0 0 0 -1397.52 0 0 -625.401 0.05 -227.439 0 0 0 1394.92 0 0 0 0 0 0 0 1684.85 0 0 0 -898.694 0 0 1553.77 0 602.359 1038.01 0 0 0 0 0 -316.858 -1081.65 0 2283.47 0 0 0 0 0 0 0 
0 724.891 0 0 -708.258 -1513.79 484.863 16.8615 0.06 0 0 0 -811.716 0 0 1409.57 0 -932.722 0 0 0 0 -1934.8 1264.31 0 0 0 0 1594.97 0 0 0 0 626.621 0 0 0 -1924.88 0 0 0 0 0 0 1943.95 0 2186.27 
228.202 0 0 0 0 0 0 0 0 0.04 0 0 0 0 0 0 0 0 0 0 1016.19 -2145.99 0 0 0 1937.7 -1260.03 -774.331 -619.755 0 0 -1383.48 2199.39 0 -164.113 1720.56 0 140.614 2080.98 0 0 0 0 0 0 -212.027 0 
-1493.35 0 929.975 2338.86 0 -665.075 0 0 0 0 0.05 0 0 -910.596 -2406.77 0 820.261 0 0 0 0 0 0 -104.144 2035.2 0 0 0 0 2257.38 0 0 0 1208.3 0 0 0 0 -761.513 0 0 0 -1485.87 928.907 0 0 0 
0 -341.426 0 0 0 0 0 0 0 0 0 0.03 -206.687 0 0 0 0 0 0 0 1894.67 0 0 0 0 0 0 0 0 0 0 0 0 0 0 0 0 0 0 0 0 0 0 0 0 0 0 
0 0 0 0 0 0 0 514.008 -815.073 0 0 2413.48 0.05 0 0 0 0 0 0 0 2327.42 0 0 -19.4555 -1751.69 0 0 0 2437.28 -869.701 217.368 0 0 0 1899.85 1600.31 0 0 0 0 0 -2448.88 0 0 -606.937 0 0 
0 882.061 -655.919 0 0 0 0 0 0 0 -769.906 0 0 0.03 705.359 0 1847.21 0 0 1006.12 1671.12 0 0 1556.83 2111.65 0 -51.1948 0 0 0 0 1992.93 0 1251.79 0 564.669 0 0 0 0 0 0 1754.89 0 0 0 0 
0 0 0 1869.18 0 0 0 0 0 0 -325.098 0 0 1985.61 0 0 0 0 0 0 0 138.173 0 -976.516 -222.251 0 693.152 0 1695.23 2062.52 611.057 0 0 0 -958.357 0 0 0 0 0 0 -1659.83 0 0 0 0 1776.86 
0 0 0 0 0 0 1211.51 0 -871.38 0 0 0 0 0 0 0.08 0 -1804.94 0 1003.98 -1983.47 0 360.347 0 1478.09 1570.71 2248.99 1578.49 0 0 0 -326.167 0 0 0 1773.2 0 -429.472 0 0 0 0 151.448 -774.331 -1281.09 -2029.56 0 
0 0 0 0 1775.49 0 0 0 0 0 311.67 0 0 -426.115 0 0 0 0 0 0 0 0 0 0 -535.829 2050.77 -1877.27 0 0 733.436 0 0 0 879.772 0 0 -290.613 -410.245 0 0 0 0 0 0 0 0 0 
-1934.03 0 0 0 0 454.802 0 0 813.242 0 0 0 0 0 0 -1038.93 0 0.06 0 1127.12 0 1626.26 0 0 82.7815 0 0 2236.78 0 0 1755.5 0 11.6733 0 2231.59 0 0 -738.777 0 0 0 -202.567 0 2242.58 0 0 0 
0 0 158.162 0 0 0 0 0 0 0 0 0 0 0 0 0 0 0 0.08 0 0 0 0 1430.63 0 739.54 0 0 2185.51 1179.01 0 0 0 0 0 343.867 351.344 0 0 0 0 0 0 1107.9 0 0 0 
-432.371 0 0 0 0 1876.35 -1790.6 0 0 0 0 0 0 -750.832 0 -835.368 0 2331.39 0 0.01 0 0 -200.735 0 -1424.38 0 0 0 0 0 0 -1181.3 0 0 0 0 215.69 444.578 2323.76 0 0 2353.05 0 0 0 0 0 
0 0 0 0 0 0 0 -971.48 0 1216.39 0 -1611.61 -508.515 1952.5 0 475.86 0 0 0 0 0.01 0 0 -915.326 0 0 1751.53 0 0 0 0 0 0 0 0 0 231.407 0 2063.59 -2243.19 1590.4 0 -2223.35 2237.54 0 0 0 
-1712.47 1123.31 0 -135.121 0 1696.45 0 0 0 2324.67 0 0 0 0 -403.073 0 0 -1600.47 0 0 0 0.02 0 0 623.417 0 0 2434.39 0 0 0 0 26.6274 -2096.85 -100.94 -587.1 2344.05 0 0 0 0 686.132 0 0 -734.809 0 0 
0 0 0 348.75 0 2144.92 684.606 0 1965.62 0 0 0 0 0 0 -684.912 0 0 0 -1202.66 0 0 0.09 2136.98 0 0 0 0 0 0 0 0 0 -2450.71 0 0 0 0 1687.75 0 0 0 0 0 0 0 0 
0 0 0 0 0 0 0 0 810.038 0 1240.5 0 1444.36 327.998 2016.43 0 0 0 47.6852 0 -1670.96 0 -808.512 0 0 0 0 0 0 0 0 0 0 0 0 -2071.83 0 0 -829.569 702.155 0 0 0 2474.67 1039.23 0 0 
0 0 -849.864 0 0 0 0 1894.67 0 0 1688.21 0 -1553.77 -352.107 775.552 214.316 1755.81 -149.007 0 1840.95 0 1386.38 0 0 0.02 0 -1843.09 1335.41 0 2259.82 0 2397.46 0 0 1595.74 0 -1615.57 0 0 -2347.71 0 0 0 0 0 0 0 
0 0 1409.88 -951.033 0 -1447.87 0 0 0 -1555.91 0 0 0 0 0 1686.68 2495.73 0 2062.21 0 0 0 0 0 0 0.07 1440.7 0 498.749 708.258 1734.6 0 0 584.353 -1462.98 0 0 2183.68 -498.596 -1895.43 0 0 0 -489.441 1118.58 0 0 
1839.43 0 0 0 0 0 0 0 0 398.343 0 0 0 1682.26 955 -688.269 2162.62 0 0 0 -1640.9 0 0 0 -190.512 -2237.54 0.09 0 0 815.836 1363.03 0 0 0 0 0 -793.71 1467.56 1959.67 0 0 0 893.048 345.698 0 0 0 
0 0 45.5489 0 -362.331 142.903 0 -1098.13 0 1794.26 0 0 0 0 0 717.414 0 -1873.3 0 0 0 1170.92 0 0 1029.16 0 0 0.06 -728.401 0 -2308.04 0 -598.086 0 -972.549 2295.53 695.593 1825.54 0 0 0 -431.455 0 0 0 1807.69 0 
0 0 -1394.47 -1975.23 0 0 0 0 1279.11 2033.52 0 0 -1285.97 0 -234.306 0 0 0 1908.7 0 0 0 0 0 0 -1315.12 0 222.098 0.04 0 2104.18 0 0 1204.95 0 0 0 0 0 0 -1173.21 0 0 0 1392.18 0 0 
0 0 0 0 0 0 0 -749.306 0 0 857.341 0 1037.4 0 1912.98 0 -798.44 0 2273.71 0 0 0 0 0 765.175 559.023 -638.371 0 0 0.02 0 0 -296.716 0 0 -796.762 0 0 0 0 0 0 757.241 0 0 0 0 
-1395.23 0 0 1933.73 0 0 0 -295.038 0 0 0 0 2183.37 0 287.103 0 0 -759.682 0 0 0 0 0 0 0 -592.746 795.083 -12.2837 -1561.71 0 0.05 0 0 0 1443.75 0 0 0 0 1784.19 0 0 0 0 0 0 0 
0 0 0 0 0 0 0 0 0 1184.5 0 0 0 294.427 0 -91.6318 0 0 0 1853.31 0 0 0 0 1066.55 0 0 0 0 0 0 0.08 0 0 0 1470.31 0 0 -1469.7 0 0 0 0 0 0 0 0 
0 2107.07 0 -408.261 0 0 0 0 0 -204.398 0 0 0 0 0 0 0 1779.92 0 0 0 1448.94 0 0 0 0 0 1553.32 0 -188.833 0 0 0.01 0 0 0 2046.04 0 0 -836.283 0 1123 0 0 0 -396.359 0 
1652.96 1970.35 0 0 1621.52 0 0 0 1884.59 0 -1301.54 0 0 -224.998 0 0 1718.27 0 0 0 0 -1399.66 2258.6 0 0 -2182.15 0 0 1899.24 0 0 0 0 0.01 -2305.29 0 -1429.72 -1817.15 0 0 0 -1101.79 0 0 0 0 0 
0 0 -2441.4 1064.87 1980.27 0 0 0 0 2373.04 0 0 609.226 0 557.649 0 0 894.574 0 0 0 -1544.01 0 0 1388.67 2161.85 0 -185.781 0 0 -895.947 0 0 1305.05 0 231.101 0 0 0 0 0 0 0 0 0 0 -2087.54 
-1124.07 0 -2423.09 0 0 0 0 0 0 2084.03 0 0 471.892 456.481 0 2081.74 0 0 1982.41 0 0 -323.115 0 -907.392 0 0 0 1161.92 0 338.527 0 400.021 0 0 2357.63 0.06 0 0 0 0 0 0 0 0 0 0 0 
0 0 0 0 0 -1802.04 0 1678.29 0 0 0 0 0 0 0 0 416.349 0 -1988.36 1317.1 -1511.96 -1985.92 0 0 1724.52 0 1914.2 753.426 0 0 0 0 -1683.48 -1144.06 0 0 0.07 0 2065.72 298.853 0 1994.61 -1205.4 0 2390.44 0 0 
0 0 0 0 0 0 0 1161 -725.959 1635.26 0 0 0 0 0 218.284 -934.858 947.066 0 932.569 0 0 0 0 0 -2276.76 477.233 1321.53 0 0 0 0 0 -546.663 0 0 0 0.01 0 0 1937.24 0 0 0 -2150.26 0 0 
0 1952.19 0 0 0 0 -2331.23 0 0 -2214.04 -1230.43 0 0 0 0 0 0 0 0 -1836.53 415.128 0 191.733 2278.74 0 44.9385 1187.09 0 0 0 0 1882 0 0 0 0 2311.7 0 0.07 1374.78 0 0 0 0 1578.65 0 0 
0 0 -2244.25 1882.76 -2168.87 0 0 1247.67 0 0 0 0 0 0 0 0 0 0 0 0 2334.28 0 0 1386.99 2098.38 256.279 0 0 0 0 2476.2 0 1234.24 0 0 0 1439.63 0 417.722 0.02 -2356.11 0 1676.15 0 -1535.62 0 0 
2373.2 0 0 1901.23 0 -1247.37 0 0 0 0 0 0 0 0 0 0 0 0 0 0 1055.41 0 0 0 0 0 0 0 -398.19 0 0 0 0 0 0 0 0 -1013.6 0 2341.15 0.06 0 0 976.516 1478.39 0 0 
0 0 0 598.239 0 0 0 0 0 0 0 0 2372.28 0 1906.11 0 0 -886.181 0 1744.06 0 828.349 0 0 0 0 0 -1169.85 0 0 0 0 -1613.13 1815.78 0 0 -973.769 0 0 0 0 0 0 0 0 0 0 
2461.55 0 0 0 0 1215.17 0 0 0 0 -1554.38 0 0 567.568 0 -378.811 0 0 0 0 -895.947 0 0 0 0 0 1232.72 0 0 -433.134 0 0 0 0 0 0 87.6644 0 0 -712.226 0 0 0.09 0 0 0 0 
1786.02 0 0 0 0 0 0 0 0 0 1554.23 0 0 0 0 -37.7667 0 -1112.32 -1551.64 0 256.89 0 0 1233.48 0 317.927 1646.7 0 0 0 0 0 0 0 0 0 0 0 0 0 154.195 0 0 0.08 0 0 0 
0 0 0 0 0 0 0 0 -400.937 0 0 0 664.006 0 0 -1521.42 0 0 0 0 0 -674.383 0 316.706 0 964.614 0 0 1628.24 0 0 0 0 0 0 0 185.171 620.518 2404.93 1648.23 -1691.26 0 0 0 0.06 0 0 
0 0 0 0 0 0 0 0 0 854.289 0 0 0 0 0 582.98 0 0 0 0 0 0 0 0 0 0 0 1473.51 0 0 0 0 1759.93 0 0 0 0 0 0 0 0 0 0 0 0 0.05 2172.38 
0 0 0 0 0 0 0 0 125.965 0 0 0 0 0 758.766 0 0 0 0 0 0 0 0 0 0 0 0 0 0 0 0 0 0 0 2473.3 0 0 0 0 0 0 0 0 0 0 -1710.18 0.05 
