File Name,Connectivity,Clustering,Avg Shortest Path Length
adjacencies0.net,0.21420765027322405,0.21457933628288395,1.9158469945355192
adjacencies1.net,0.2098360655737705,0.1910027693296739,1.8934426229508197
adjacencies10.net,0.1937984496124031,0.17691417110021765,2.0908084163898115
adjacencies100.net,0.19865319865319866,0.21622707951584946,1.9643097643097642
adjacencies101.net,0.23464912280701755,0.23853511484683057,1.8609022556390977
adjacencies102.net,0.2111756168359942,0.20533444818449786,1.9223512336719883
adjacencies103.net,0.22528693076638281,0.22201543484623293,1.8330248056275453
adjacencies104.net,0.23524254821741672,0.24028119836877773,1.8398597311513734
adjacencies105.net,0.2326073805202662,0.2782740864463935,1.8729582577132486
adjacencies106.net,0.21526315789473685,0.22096634259330583,1.8449122807017544
adjacencies107.net,0.20279720279720279,0.21802633062906066,1.9188811188811188
adjacencies108.net,0.21493506493506492,0.22130251131246262,1.9025974025974026
adjacencies109.net,0.22801932367149758,0.23258831606018307,1.952657004830918
adjacencies11.net,0.2220376522702104,0.23603683138566858,1.9634551495016612
adjacencies110.net,0.2262987012987013,0.23054486946293667,1.8863636363636365
adjacencies111.net,0.20857142857142857,0.20893945923357687,1.9755102040816326
adjacencies112.net,0.1832579185520362,0.1643707787938557,2.0505279034690798
adjacencies113.net,0.22589129164231445,0.22708218673925662,1.8760958503798948
adjacencies114.net,0.2205128205128205,0.251706943624062,1.8685314685314685
adjacencies115.net,0.21619841966637401,0.21927831439769938,1.8674275680421422
adjacencies116.net,0.22187281621243884,0.2121878938055407,1.9077568134171907
adjacencies117.net,0.22746521476104054,0.25118235100486624,1.8868723532970357
adjacencies118.net,0.23865698729582577,0.2592129659214152,1.8433151845130067
adjacencies119.net,0.21683226183518411,0.23053416836147597,1.9064874342489773
adjacencies12.net,0.24061343204653624,0.28077899848482873,1.8408249603384452
adjacencies120.net,0.21582491582491584,0.2197978193742336,1.9016835016835016
adjacencies121.net,0.20212765957446807,0.22279687904687898,1.9920212765957446
adjacencies122.net,0.2222222222222222,0.21361721067603417,1.9147449336128581
adjacencies123.net,0.22762478485370052,0.23705376761217276,1.8089500860585197
adjacencies124.net,0.2192090395480226,0.2191009878780776,1.8892655367231639
adjacencies125.net,0.20417422867513613,0.20212108997605954,1.9322444041137325
adjacencies126.net,0.20703331570597566,0.21743695261871632,1.9249074563722899
adjacencies127.net,0.22033898305084745,0.2266087958597386,1.8930450029222676
adjacencies128.net,0.21638599304998662,0.22435738007621567,1.8267842822774658
adjacencies129.net,0.21232152300370175,0.22173259678106638,1.8984664198836594
adjacencies13.net,0.18076923076923077,0.14104076479076483,2.1807692307692306
adjacencies130.net,0.2083553675304072,0.22129241199449917,1.9127445795875198
adjacencies131.net,0.20280612244897958,0.21207573605532784,2
adjacencies132.net,0.2074001947419669,0.21293003292688056,1.8584875040571243
adjacencies133.net,0.1840882694541231,0.16589706589706588,2.1451800232288036
adjacencies134.net,0.22692307692307692,0.21626342472853533,1.8451923076923078
adjacencies135.net,0.23245192307692308,0.2593013983426815,1.841826923076923
adjacencies136.net,0.19903206291591047,0.19404393839912143,1.939503932244404
adjacencies137.net,0.22270531400966184,0.20885976058610328,1.9246376811594204
adjacencies138.net,0.2247585601404741,0.22481948852823525,1.8489903424056189
adjacencies139.net,0.2128205128205128,0.2177446164946165,2.0538461538461537
adjacencies14.net,0.22727272727272727,0.2166307569601173,1.8461538461538463
adjacencies140.net,0.23861532765642354,0.2545565502669419,1.8182154757497224
adjacencies141.net,0.21842105263157896,0.21753643116284008,1.831578947368421
adjacencies142.net,0.20153061224489796,0.19635353308822695,1.9991496598639455
adjacencies143.net,0.21875,0.20767258090206994,1.8576388888888888
adjacencies144.net,0.2189625850340136,0.21524245395794006,1.9319727891156462
adjacencies145.net,0.22954545454545455,0.23906052544929146,1.8727272727272728
adjacencies146.net,0.1980392156862745,0.17702643377383864,1.996078431372549
adjacencies147.net,0.23591836734693877,0.23090747161335398,1.8906122448979592
adjacencies148.net,0.1954390451832907,0.1860885034360603,1.9130434782608696
adjacencies149.net,0.1981382978723404,0.19052382802382795,2.0150709219858154
adjacencies15.net,0.23511904761904762,0.23792727880362935,1.8920068027210883
adjacencies150.net,0.2178741406663141,0.21996295619335662,1.872025383395029
adjacencies151.net,0.223265306122449,0.229653031179347,1.910204081632653
adjacencies152.net,0.21202185792349726,0.23127561659384221,1.8978142076502733
adjacencies153.net,0.20448717948717948,0.23495088245088244,2.108974358974359
adjacencies154.net,0.19685374149659865,0.1862295301070811,2.0229591836734695
adjacencies155.net,0.22885835095137422,0.24427037608855792,1.9482029598308668
adjacencies156.net,0.2204968944099379,0.23857148797440694,1.860455486542443
adjacencies157.net,0.2201923076923077,0.24434970750418525,1.8634615384615385
adjacencies158.net,0.24743589743589745,0.24365259740259743,1.9884615384615385
adjacencies159.net,0.1870967741935484,0.19587813620071684,2.378494623655914
adjacencies16.net,0.24064625850340135,0.2483123529657933,1.8656462585034013
adjacencies160.net,0.23444976076555024,0.23609349913785513,1.8140806561859193
adjacencies161.net,0.2318577648766328,0.260421678132993,1.8657474600870827
adjacencies162.net,0.21052631578947367,0.20088942396634704,2.0620782726045883
adjacencies163.net,0.21584699453551912,0.21404159023683966,1.8830601092896175
adjacencies164.net,0.18556005398110662,0.20870055870055873,2.136302294197031
adjacencies165.net,0.22094075079149705,0.22879659571406116,1.8715513342379013
adjacencies166.net,0.21077441077441078,0.23291100665291492,1.936026936026936
adjacencies167.net,0.19847452125933138,0.187072382666624,1.878610840636157
adjacencies168.net,0.2127946127946128,0.21758880172896494,1.9245791245791246
adjacencies169.net,0.18907563025210083,0.17472701901273327,2.211764705882353
adjacencies17.net,0.22998246639392167,0.2381745151934583,1.874342489772063
adjacencies170.net,0.23758320532514082,0.2451448036845674,1.8453661034306195
adjacencies171.net,0.1987179487179487,0.2150721500721501,2.0782051282051284
adjacencies172.net,0.20072115384615385,0.22027603340534993,1.927403846153846
adjacencies173.net,0.19430272108843538,0.20146462514409685,2.0008503401360542
adjacencies174.net,0.1906779661016949,0.17980099249449086,1.963276836158192
adjacencies175.net,0.21959183673469387,0.23171435581961894,1.9281632653061225
adjacencies176.net,0.2255990648743425,0.2528887229915724,1.875511396843951
adjacencies177.net,0.19592198581560283,0.2081335331335331,2.0354609929078014
adjacencies178.net,0.2133879781420765,0.24524134346877074,1.9010928961748634
adjacencies179.net,0.20609548167092925,0.21476924822670332,1.881926683716965
adjacencies18.net,0.22629499561018437,0.24218563845248417,1.8546971027216856
adjacencies180.net,0.22576530612244897,0.2599768229846577,1.9438775510204083
adjacencies181.net,0.20708020050125314,0.1852506335600681,1.9291979949874687
adjacencies182.net,0.2297527706734868,0.21737095512435384,1.8269394714407503
adjacencies183.net,0.2320280537697253,0.25130001883163444,1.8679135008766803
adjacencies184.net,0.2161917684305744,0.2330643973393846,1.8769787426503843
adjacencies185.net,0.21717171717171718,0.2421363766170971,1.8983164983164984
adjacencies186.net,0.21553884711779447,0.23688289709554156,1.9154135338345866
adjacencies187.net,0.21226874391431352,0.22224659061601518,1.8591366439467705
adjacencies188.net,0.1989795918367347,0.1850301059484733,2.0136054421768708
adjacencies189.net,0.21804511278195488,0.22215850361630401,1.8978696741854637
adjacencies19.net,0.21249359959037378,0.21288450806876028,1.8894009216589862
adjacencies190.net,0.19490196078431374,0.19723075207504273,2.0109803921568625
adjacencies191.net,0.21200828157349896,0.22635348448960163,1.8766045548654244
adjacencies192.net,0.19023569023569023,0.19239330188528053,2.0175084175084175
adjacencies193.net,0.21337916446324695,0.23811585993891388,1.883130618720254
adjacencies194.net,0.2127403846153846,0.20049864942815643,1.8754807692307693
adjacencies195.net,0.22602739726027396,0.24014650355740516,1.828386605783866
adjacencies196.net,0.22354312354312356,0.2265593144148008,1.8568764568764569
adjacencies197.net,0.2356902356902357,0.26082648739038305,1.8754208754208754
adjacencies198.net,0.2195483154387264,0.231042869671891,1.8430211032950758
adjacencies199.net,0.2223441615452151,0.23763131283336283,1.8577699736611062
adjacencies2.net,0.21087636932707354,0.22722927198518347,1.8634585289514867
adjacencies20.net,0.23464912280701755,0.2507495974763298,1.8571428571428572
adjacencies200.net,0.20050125313283207,0.20910899401204103,1.9749373433583959
adjacencies201.net,0.21987577639751552,0.2249916619680574,1.848447204968944
adjacencies202.net,0.2401129943502825,0.25231882210210377,1.8276836158192091
adjacencies203.net,0.21101694915254238,0.21467619726907644,1.9073446327683616
adjacencies204.net,0.2242199894235854,0.23778410854212306,1.8757271285034374
adjacencies205.net,0.19343434343434343,0.23109717443050773,2.0383838383838384
adjacencies206.net,0.22792792792792793,0.23788270814452,1.8371171171171172
adjacencies207.net,0.2404870624048706,0.2450370481815928,1.801750380517504
adjacencies208.net,0.2170809095716552,0.2260806109677576,1.8958223162347965
adjacencies209.net,0.22340425531914893,0.23492208320118202,1.9417206290471785
adjacencies21.net,0.21710189452124937,0.23347215711213942,1.881720430107527
adjacencies210.net,0.1949404761904762,0.21189843330903693,1.9513888888888888
adjacencies211.net,0.21021303258145363,0.20428653808969924,1.9342105263157894
adjacencies212.net,0.22323049001814882,0.23427011747845522,1.8911070780399275
adjacencies213.net,0.20901960784313725,0.1979594575615337,1.948235294117647
adjacencies214.net,0.2160633484162896,0.22774675477997697,1.9276018099547512
adjacencies215.net,0.2174185463659148,0.22522271963366952,1.894736842105263
adjacencies216.net,0.21390999415546463,0.2385021753534635,1.8988895382817066
adjacencies217.net,0.2135306553911205,0.19964076698702368,1.9968287526427062
adjacencies218.net,0.2209653092006033,0.20822071028518988,1.918552036199095
adjacencies219.net,0.19252271139063593,0.19526576969387424,2.025856044723969
adjacencies22.net,0.22183098591549297,0.22634768568412605,1.85641627543036
adjacencies220.net,0.23363095238095238,0.24599513376845036,1.8363095238095237
adjacencies221.net,0.21915584415584416,0.2539778508017118,1.8993506493506493
adjacencies222.net,0.2183163737280296,0.20374389204176435,1.9343200740055504
adjacencies223.net,0.22455902306648576,0.22449118295343154,1.842605156037992
adjacencies224.net,0.20643074581430745,0.20231960707595795,1.8713850837138508
adjacencies225.net,0.21229260935143288,0.21933979304626555,1.9464555052790347
adjacencies226.net,0.21523003701745108,0.22660674406654627,1.9021681649920676
adjacencies227.net,0.23126293995859212,0.2302548409772127,1.8231884057971015
adjacencies228.net,0.2273924495171203,0.23721023096508076,1.8459174714661983
adjacencies229.net,0.19461279461279463,0.19883591156318428,1.973063973063973
adjacencies23.net,0.23689727463312368,0.24854271254919616,1.8644304682040531
adjacencies230.net,0.2213352685050798,0.2368728612872545,1.9150943396226414
adjacencies231.net,0.22354124748490944,0.22476302365739267,1.827364185110664
adjacencies232.net,0.17634408602150536,0.12165898617511521,2.41505376344086
adjacencies233.net,0.22627118644067798,0.23741710559822,1.880225988700565
adjacencies234.net,0.20075757575757575,0.26892551892551897,2.0984848484848486
adjacencies235.net,0.19685374149659865,0.2118962669983078,2.0187074829931975
adjacencies236.net,0.2470679012345679,0.2512024931349605,1.780246913580247
adjacencies237.net,0.22074468085106383,0.21973606798974443,1.9397163120567376
adjacencies238.net,0.21121664405246496,0.21575361117926245,1.8855721393034826
adjacencies239.net,0.22300263388937663,0.21815789421169357,1.8472344161545216
adjacencies24.net,0.2235329703569268,0.22368017096718915,1.8802177858439202
adjacencies240.net,0.21972501322051824,0.21455998117088695,1.8836594394500263
adjacencies241.net,0.22822910578609001,0.26643670285507937,1.8854471069549972
adjacencies242.net,0.19494949494949496,0.19391633058299718,2.0373737373737373
adjacencies243.net,0.2519661222020569,0.2592828884407553,1.8197217180883243
adjacencies244.net,0.19802555168408828,0.2193399193399193,2.0638792102206738
adjacencies245.net,0.20074005550416282,0.2212142467461616,2.0296022201665127
adjacencies246.net,0.21973572037510655,0.2409022478446358,1.8776641091219097
adjacencies247.net,0.23351351351351352,0.256107840948995,1.8277477477477477
adjacencies248.net,0.23652882205513784,0.2264932292796069,1.837719298245614
adjacencies249.net,0.2,0.2302347326721788,1.955737704918033
adjacencies25.net,0.21710189452124937,0.21205871252503164,1.89810547875064
adjacencies250.net,0.23098039215686275,0.23888247890706452,1.8870588235294117
adjacencies251.net,0.1994949494949495,0.23401623068289734,2.0686868686868687
adjacencies252.net,0.2191919191919192,0.2331090484397548,1.8983164983164984
adjacencies253.net,0.2363031233998976,0.2639795829026898,1.8381976446492576
adjacencies254.net,0.2255420412480169,0.2419969477020311,1.8625066102591221
adjacencies255.net,0.2426553672316384,0.2652790216979542,1.8429378531073446
adjacencies256.net,0.20983086680761098,0.23698511084874718,2.009513742071882
adjacencies257.net,0.2098997493734336,0.23592349343123337,1.9229323308270676
adjacencies258.net,0.21717171717171718,0.2565352215098907,1.917845117845118
adjacencies259.net,0.21300211416490486,0.20447519652065108,2.029598308668076
adjacencies26.net,0.2007843137254902,0.18376612814329077,1.9850980392156863
adjacencies260.net,0.20317460317460317,0.19967254967254966,2.096825396825397
adjacencies261.net,0.2364341085271318,0.2601186585112713,1.9335548172757475
adjacencies262.net,0.21006944444444445,0.22657827128366978,1.9017857142857142
adjacencies263.net,0.2148846960167715,0.2150358477155863,1.9140461215932913
adjacencies264.net,0.21390798519301957,0.22235053261783727,1.8995240613432047
adjacencies265.net,0.22347928298560094,0.2243793324792161,1.8239788421980605
adjacencies266.net,0.21707638279192273,0.21480504988181584,1.870939420544337
adjacencies267.net,0.2319004524886878,0.24063821521549547,1.9087481146304677
adjacencies268.net,0.2185897435897436,0.21853188478188473,2.0205128205128204
adjacencies269.net,0.23990384615384616,0.2647542258223372,1.8240384615384615
adjacencies27.net,0.1875,0.21374050820882184,2.0552721088435373
adjacencies270.net,0.21337916446324695,0.2347544731300196,1.8873611845584346
adjacencies271.net,0.22501130710085934,0.2486831980817932,1.861148801447309
adjacencies272.net,0.19328493647912887,0.20143754149839338,1.9770114942528736
adjacencies273.net,0.19855072463768117,0.17763673524543092,2.03768115942029
adjacencies274.net,0.22435064935064936,0.2543520599566044,1.8746753246753247
adjacencies275.net,0.21215986394557823,0.1983538003946167,1.9506802721088434
adjacencies276.net,0.23361717882265828,0.2219907872613485,1.8059977786005184
adjacencies277.net,0.20754716981132076,0.20288638171546045,1.9680696661828738
adjacencies278.net,0.23065476190476192,0.25831335981055403,1.8591269841269842
adjacencies279.net,0.22173038229376257,0.22716105928369812,1.8462776659959759
adjacencies28.net,0.21930512016718914,0.22577446245371446,1.8312434691745036
adjacencies280.net,0.21760443307757885,0.23569377746061937,1.8665814151747655
adjacencies281.net,0.20040485829959515,0.17133237133237134,2.125506072874494
adjacencies282.net,0.2039969834087481,0.20906459992998452,1.9720965309200604
adjacencies283.net,0.22413793103448276,0.25298860314209004,1.8877849210987727
adjacencies284.net,0.216078431372549,0.24483508980413,1.9803921568627452
adjacencies285.net,0.21843137254901962,0.205279796456267,1.9254901960784314
adjacencies286.net,0.22151360544217688,0.23025804008618195,1.9489795918367347
adjacencies287.net,0.21556122448979592,0.2634057685678334,1.9642857142857142
adjacencies288.net,0.21205711263881544,0.20931350821243952,1.884188260179799
adjacencies289.net,0.1891891891891892,0.2631048775785618,2.220483641536273
adjacencies29.net,0.18956228956228957,0.1958563817893961,1.9993265993265994
adjacencies290.net,0.21180124223602484,0.21278614884849137,1.8662525879917184
adjacencies291.net,0.2375533428165007,0.2560921534605745,1.961593172119488
adjacencies292.net,0.21807909604519773,0.2080602160710519,1.8740112994350282
adjacencies293.net,0.24283717679944095,0.24821129576891518,1.8483577917540182
adjacencies294.net,0.2248447204968944,0.23895273740547088,1.8492753623188405
adjacencies295.net,0.2115171650055371,0.20621639342569578,1.9723145071982282
adjacencies296.net,0.203656462585034,0.19289423061932065,2.006802721088435
adjacencies297.net,0.2126865671641791,0.21648528945810852,1.8867427568042143
adjacencies298.net,0.20499419279907086,0.20349333206476064,2.0418118466898956
adjacencies299.net,0.206629243517776,0.2149199106310411,1.8481689387864206
adjacencies3.net,0.19666182873730043,0.2010201538503425,1.9825834542815675
adjacencies30.net,0.19292929292929292,0.2105881164212152,1.981144781144781
adjacencies300.net,0.22880414661236578,0.2366085241919808,1.8337652721214366
adjacencies301.net,0.19556025369978858,0.1584222595586232,2.04122621564482
adjacencies302.net,0.22298136645962732,0.22674277658981423,1.8525879917184265
adjacencies303.net,0.23076923076923078,0.26255896253068206,1.8996983408748114
adjacencies304.net,0.2073732718894009,0.20975332730455828,1.9093701996927803
adjacencies305.net,0.2088174982911825,0.22628181290560032,1.85850991114149
adjacencies306.net,0.2247086247086247,0.21741045384445326,1.84988344988345
adjacencies307.net,0.2305263157894737,0.2453400780046003,1.8214035087719298
adjacencies308.net,0.2026936026936027,0.1950995795648202,1.9521885521885523
adjacencies309.net,0.22081632653061226,0.23265141050899557,1.9379591836734693
adjacencies31.net,0.22964912280701755,0.24187403890479844,1.8196491228070175
adjacencies310.net,0.1799645390070922,0.18303120490620492,2.095744680851064
adjacencies311.net,0.19811320754716982,0.1975978391011071,1.9874213836477987
adjacencies312.net,0.22020568663036902,0.2266351018766412,1.8905021173623715
adjacencies313.net,0.21298076923076922,0.21927669859687823,1.8942307692307692
adjacencies314.net,0.17849462365591398,0.12211981566820278,2.4064516129032256
adjacencies315.net,0.22432432432432434,0.2350572479782871,1.8317117117117117
adjacencies316.net,0.2198051948051948,0.23845793853671995,1.9207792207792207
adjacencies317.net,0.20238095238095238,0.21055421895408857,1.9743107769423558
adjacencies318.net,0.22534013605442177,0.22425051973924146,1.9209183673469388
adjacencies319.net,0.2144230769230769,0.221860092379626,1.883173076923077
adjacencies32.net,0.21644042232277527,0.2315717653387336,1.9283559577677225
adjacencies320.net,0.2070578231292517,0.20020042649094272,1.9574829931972788
adjacencies321.net,0.21972501322051824,0.2332831486843771,1.87625594923321
adjacencies322.net,0.20155793573515093,0.20994465697452275,1.8711457319052256
adjacencies323.net,0.19696969696969696,0.1417267917267917,2.2291666666666665
adjacencies324.net,0.24924924924924924,0.2546992796992797,1.9144144144144144
adjacencies325.net,0.19885864793678665,0.2087910739500198,1.92756804214223
adjacencies326.net,0.22299027137736815,0.22525764630771392,1.8704557091653866
adjacencies327.net,0.1966966966966967,0.16687366687366686,2.171171171171171
adjacencies328.net,0.21872816212438853,0.21774943466119934,1.9007686932215233
adjacencies329.net,0.22953964194373402,0.24366474176991504,1.841858482523444
adjacencies33.net,0.22322775263951736,0.20622437467668472,1.901206636500754
adjacencies330.net,0.2400793650793651,0.2621824402634613,1.8328373015873016
adjacencies331.net,0.22608695652173913,0.2533551167502574,1.9671497584541062
adjacencies332.net,0.2286195286195286,0.24725638295157001,1.8835016835016836
adjacencies333.net,0.17124735729386892,0.12073292868747414,2.1881606765327697
adjacencies334.net,0.21088794926004228,0.22301587301587295,2.0158562367864694
adjacencies335.net,0.20578923563998192,0.2224145467855575,1.9063772048846677
adjacencies336.net,0.22410147991543342,0.2250935932754114,1.959830866807611
adjacencies337.net,0.18536585365853658,0.19872065603772915,2.1670731707317072
adjacencies338.net,0.21890547263681592,0.22868022718643416,1.8738127544097694
adjacencies339.net,0.2032051282051282,0.2243388555888557,2.1025641025641026
adjacencies34.net,0.2148664343786295,0.2287921540022381,2.0209059233449476
adjacencies340.net,0.20952659263588544,0.21971110434404761,1.929281122150789
adjacencies341.net,0.21214689265536724,0.22793101627736165,1.8937853107344633
adjacencies342.net,0.20625942684766213,0.1845644346656493,1.9268476621417798
adjacencies343.net,0.20081967213114754,0.1995943220020772,1.9295081967213115
adjacencies344.net,0.22387518142235124,0.24362899969097765,1.9005805515239478
adjacencies345.net,0.22568940493468795,0.21508969203197834,1.909288824383164
adjacencies346.net,0.2388888888888889,0.24308123974790646,1.904040404040404
adjacencies347.net,0.22953414744459522,0.24044938799907722,1.8276797829036635
adjacencies348.net,0.2204016913319239,0.24449943995398546,1.9566596194503172
adjacencies349.net,0.21584699453551912,0.24644058536105437,1.9185792349726776
adjacencies35.net,0.23113207547169812,0.2497329532758004,1.9013062409288823
adjacencies350.net,0.2130456349206349,0.21711063059747251,1.8759920634920635
adjacencies351.net,0.20833333333333334,0.22052243913146158,1.9795918367346939
adjacencies352.net,0.22296626984126985,0.22559925803101824,1.8650793650793651
adjacencies353.net,0.21917007597895968,0.23659525087740446,1.8924605493863238
adjacencies354.net,0.22626262626262628,0.24831615846392083,1.8821548821548821
adjacencies355.net,0.22468354430379747,0.2269734756697587,1.820886075949367
adjacencies356.net,0.19635627530364372,0.18391978391978392,2.11336032388664
adjacencies357.net,0.22241784037558684,0.23252024667420962,1.8583724569640063
adjacencies358.net,0.21458773784355178,0.193068673750492,1.9799154334038056
adjacencies359.net,0.19714285714285715,0.17335242535242534,2.0146938775510206
adjacencies36.net,0.22431372549019607,0.24159598436597157,1.9098039215686275
adjacencies360.net,0.19370567375886524,0.1433680902430903,2.0425531914893615
adjacencies361.net,0.1999113475177305,0.2004134176009177,2.021276595744681
adjacencies362.net,0.1946938775510204,0.19207914307914312,1.9910204081632652
adjacencies363.net,0.2062146892655367,0.19751913391619266,1.926553672316384
adjacencies364.net,0.20758928571428573,0.217519673685018,1.9047619047619047
adjacencies365.net,0.21642512077294687,0.2142019212671386,1.9565217391304348
adjacencies366.net,0.2285007610350076,0.25014271203384764,1.8295281582952816
adjacencies367.net,0.2158994032395567,0.24200874330902358,1.871696504688832
adjacencies368.net,0.230327868852459,0.24857601841177498,1.8530054644808742
adjacencies369.net,0.20428156748911466,0.21027448372205146,1.9622641509433962
adjacencies37.net,0.2255504352278546,0.21007310976928112,1.8458781362007168
adjacencies370.net,0.2093220338983051,0.2102664087145511,1.911864406779661
adjacencies371.net,0.22823529411764706,0.21003936639522128,1.900392156862745
adjacencies372.net,0.17714285714285713,0.21103962703962703,2.11265306122449
adjacencies373.net,0.22655583972719523,0.22625261112607978,1.8371696504688833
adjacencies374.net,0.20448979591836736,0.2392454343042579,1.989387755102041
adjacencies375.net,0.21129807692307692,0.22086824900113783,1.8966346153846154
adjacencies376.net,0.2158953722334004,0.22510972435542861,1.8531187122736419
adjacencies377.net,0.2105654761904762,0.2526439771904653,1.9156746031746033
adjacencies378.net,0.162873399715505,0.09954051796157064,2.283072546230441
adjacencies379.net,0.1937158469945355,0.19253260288128068,1.9513661202185792
adjacencies38.net,0.1923497267759563,0.18712143155248262,1.9754098360655739
adjacencies380.net,0.2183163737280296,0.1889224250926379,1.9509713228492136
adjacencies381.net,0.19415584415584416,0.1942157544836116,1.9746753246753246
adjacencies382.net,0.2146103896103896,0.23932353781286778,1.9506493506493507
adjacencies383.net,0.22469635627530365,0.20759098451406147,1.9973009446693657
adjacencies384.net,0.22891865079365079,0.21449137847768845,1.8561507936507937
adjacencies385.net,0.2127403846153846,0.23788081289494664,1.8865384615384615
adjacencies386.net,0.21858562244301577,0.22696959233008962,1.8936294564582117
adjacencies387.net,0.22192513368983957,0.27366734572616924,2.1336898395721926
adjacencies388.net,0.17777777777777778,0.12859748276414948,2.2222222222222223
adjacencies389.net,0.2273232136245835,0.2384534052793576,1.8348759718622731
adjacencies39.net,0.22489795918367347,0.2350600869718516,1.9110204081632653
adjacencies390.net,0.21800116890707188,0.24884006689642416,1.8959672706019872
adjacencies391.net,0.21507890122735243,0.2257473562860034,1.9000584453535945
adjacencies392.net,0.18882978723404256,0.2051397676397676,2.0664893617021276
adjacencies393.net,0.2262061403508772,0.23269874905700808,1.8037280701754386
adjacencies394.net,0.21061224489795918,0.2153808838220603,1.956734693877551
adjacencies395.net,0.2186700767263427,0.20656899349186322,1.8465473145780051
adjacencies396.net,0.2147108843537415,0.23232159576065559,1.967687074829932
adjacencies397.net,0.23581681476418317,0.24064497692354814,1.813397129186603
adjacencies398.net,0.2314207650273224,0.250176350348913,1.8595628415300547
adjacencies399.net,0.2221246707638279,0.21983063049188048,1.8459174714661983
adjacencies4.net,0.23990342405618964,0.2486301886976311,1.8121158911325725
adjacencies40.net,0.22816326530612244,0.23583575248281125,1.8987755102040815
adjacencies400.net,0.22144144144144143,0.2425451385876836,1.8464864864864865
adjacencies401.net,0.22109158186864014,0.2130350736733715,1.935245143385754
adjacencies402.net,0.21634615384615385,0.2210631886766187,1.8798076923076923
adjacencies403.net,0.20677361853832443,0.1624055682879212,2.1336898395721926
adjacencies404.net,0.20122448979591837,0.20488609429785895,2.013061224489796
adjacencies405.net,0.2041958041958042,0.2094577680018336,1.9090909090909092
adjacencies406.net,0.20556309362279512,0.21181834741305183,1.889642695612845
adjacencies407.net,0.21945701357466063,0.2240981209589807,1.9238310708898945
adjacencies408.net,0.20734463276836157,0.21817407996200566,1.92090395480226
adjacencies409.net,0.21807909604519773,0.23373831391633254,1.8903954802259888
adjacencies41.net,0.2319254185692542,0.250567799170701,1.8162100456621004
adjacencies410.net,0.21748251748251748,0.23607330783590275,1.8792540792540793
adjacencies411.net,0.21116138763197587,0.20081179818170772,1.9464555052790347
adjacencies412.net,0.22413793103448276,0.24802843122489449,1.8942139099941555
adjacencies413.net,0.2132486388384755,0.2193997727359529,1.8983666061705988
adjacencies414.net,0.1828231292517007,0.1730009219805138,2.070578231292517
adjacencies415.net,0.19056429232192415,0.19841984256877868,2.057354301572618
adjacencies416.net,0.2177579365079365,0.22054799104189574,1.875
adjacencies417.net,0.22759562841530054,0.24574479499871565,1.8775956284153006
adjacencies418.net,0.22284382284382284,0.225929003708345,1.8578088578088578
adjacencies419.net,0.20303030303030303,0.21279156219206866,1.9434343434343435
adjacencies42.net,0.21322115384615384,0.2288554660310358,1.8875
adjacencies420.net,0.23251366120218578,0.24525326571334788,1.844808743169399
adjacencies421.net,0.2016072676450035,0.21512304870148005,1.997204751921733
adjacencies422.net,0.1945921985815603,0.1709243302993303,2.017730496453901
adjacencies423.net,0.2375,0.24856514512405656,1.8302884615384616
adjacencies424.net,0.2288961038961039,0.2165105945457559,1.8727272727272728
adjacencies425.net,0.23019607843137255,0.24632988420173774,1.8925490196078432
adjacencies426.net,0.2078373015873016,0.21086889660453775,1.8998015873015872
adjacencies427.net,0.19393939393939394,0.18007300252398295,2.0575757575757576
adjacencies428.net,0.21767676767676766,0.19919717174619128,1.9747474747474747
adjacencies429.net,0.21274108708357686,0.2080792916365146,1.918176504967855
adjacencies43.net,0.2159709618874773,0.2229927506096504,1.9086509376890501
adjacencies430.net,0.19837662337662337,0.20014840496375216,1.9506493506493507
adjacencies431.net,0.20202020202020202,0.21293706293706294,2.0525252525252524
adjacencies432.net,0.22531347962382445,0.2361295077324397,1.815569487983281
adjacencies433.net,0.21065573770491802,0.2112689575449052,1.9032786885245903
adjacencies434.net,0.23214285714285715,0.23426267609941076,1.9022108843537415
adjacencies435.net,0.21207729468599035,0.23361668524712,2.0115942028985505
adjacencies436.net,0.2453115547489413,0.2648307328888092,1.8300060496067756
adjacencies437.net,0.22824675324675325,0.2322485010137044,1.8662337662337662
adjacencies438.net,0.22163536776212833,0.21534088817113475,1.84037558685446
adjacencies439.net,0.24244897959183673,0.2729310727112584,1.8620408163265305
adjacencies44.net,0.20252525252525252,0.2249782316448983,2.0373737373737373
adjacencies440.net,0.19343434343434343,0.2008347208347209,2.101010101010101
adjacencies441.net,0.2119815668202765,0.2142114106273224,1.8786482334869432
adjacencies442.net,0.22005649717514125,0.23451809561043635,1.8768361581920905
adjacencies443.net,0.20806545879602573,0.24957384711805658,1.9193454120397428
adjacencies444.net,0.20134424313267096,0.202653198690088,1.9485680888369374
adjacencies445.net,0.23697681421258657,0.24079503549048795,1.8033724781692262
adjacencies446.net,0.21019607843137256,0.1843717028838136,1.9552941176470588
adjacencies447.net,0.19058823529411764,0.23874105197634607,2.0470588235294116
adjacencies448.net,0.23684210526315788,0.26193392742981725,1.8433151845130067
adjacencies449.net,0.19595959595959597,0.1794695827048768,1.9845117845117846
adjacencies45.net,0.23156942559927635,0.24782345175229664,1.8376300316598824
adjacencies450.net,0.2189957652752571,0.2224619558584542,1.8929219600725953
adjacencies451.net,0.20302099334357399,0.212147402798049,1.93394777265745
adjacencies452.net,0.1904262753319357,0.19662436329103003,2.007686932215234
adjacencies453.net,0.22413793103448276,0.23291945645673923,1.8573933372296902
adjacencies454.net,0.20784313725490197,0.23289739544064803,1.9662745098039216
adjacencies455.net,0.211840888066605,0.1846130229108952,1.9685476410730804
adjacencies456.net,0.22963659147869675,0.25169649751693096,1.867794486215539
adjacencies457.net,0.20762928827444957,0.2222445575239324,1.89247311827957
adjacencies458.net,0.2220744680851064,0.23103205685926267,1.949468085106383
adjacencies459.net,0.19591836734693877,0.22259396399953676,2.0187755102040814
adjacencies46.net,0.20643074581430745,0.20938475531098483,1.8812785388127853
adjacencies460.net,0.22711390635918938,0.22499090224838414,1.8874912648497555
adjacencies461.net,0.2370500438981563,0.24099854236976828,1.8064091308165058
adjacencies462.net,0.21552579365079366,0.2545168053802922,1.8973214285714286
adjacencies463.net,0.22344161545215102,0.23391186433773903,1.850307287093942
adjacencies464.net,0.1957047791893527,0.1950349684122503,1.970961887477314
adjacencies465.net,0.2140096618357488,0.2169482691221822,1.9951690821256038
adjacencies466.net,0.23934426229508196,0.261749964776915,1.8420765027322403
adjacencies467.net,0.23685300207039336,0.2505443477845069,1.8202898550724638
adjacencies468.net,0.21414141414141413,0.22219132448375334,1.9185185185185185
adjacencies469.net,0.21290605794556627,0.23924955935017855,1.8665496049165935
adjacencies47.net,0.26073805202661826,0.24165800659608713,1.7894736842105263
adjacencies470.net,0.20061457418788411,0.21612513679423564,1.9135206321334504
adjacencies471.net,0.19220779220779222,0.1795626992055563,1.9987012987012986
adjacencies472.net,0.19519774011299434,0.18660381285381283,1.9559322033898305
adjacencies473.net,0.22887864823348694,0.2510577454029434,1.855094726062468
adjacencies474.net,0.22005649717514125,0.22422794196400994,1.8977401129943503
adjacencies475.net,0.2161339421613394,0.2337433141080271,1.8656773211567732
adjacencies476.net,0.2117845117845118,0.22222969247033406,1.9387205387205386
adjacencies477.net,0.2177348551360843,0.2146515799049489,1.8669885864793678
adjacencies478.net,0.22209234365867914,0.24830743045378315,1.90239625949737
adjacencies479.net,0.2253061224489796,0.24412412046158175,1.9151020408163266
adjacencies48.net,0.22247823860727087,0.22654233194121912,1.874551971326165
adjacencies480.net,0.21753246753246752,0.22134300981464847,1.911038961038961
adjacencies481.net,0.1955732946298984,0.18831518531121305,1.9840348330914368
adjacencies482.net,0.2253968253968254,0.19801186467853135,1.9793650793650794
adjacencies483.net,0.1938898971566848,0.22492490576455554,1.9897156684815487
adjacencies484.net,0.19811320754716982,0.17437022625847906,1.9811320754716981
adjacencies485.net,0.21052631578947367,0.2325265483066807,1.9364791288566243
adjacencies486.net,0.20202020202020202,0.1851886385219719,2.0232323232323233
adjacencies487.net,0.23433583959899748,0.256308680094732,1.855889724310777
adjacencies488.net,0.2006048387096774,0.21647727272727274,2.2379032258064515
adjacencies489.net,0.204644412191582,0.20104071357503212,1.9506531204644413
adjacencies49.net,0.22610759493670887,0.23192174151446926,1.8193037974683544
adjacencies490.net,0.23963782696177063,0.2589667909421671,1.8064386317907444
adjacencies491.net,0.18107769423558898,0.19339328828492905,2.0181704260651627
adjacencies492.net,0.2170809095716552,0.21114538931002522,1.8915917503966155
adjacencies493.net,0.22842261904761904,0.23721909795463395,1.849702380952381
adjacencies494.net,0.2206312098188194,0.20153602686923777,1.8831092928112214
adjacencies495.net,0.22969023962594973,0.2305087436745095,1.8609000584453537
adjacencies496.net,0.22897937599153886,0.2570808267151391,1.857218402961396
adjacencies497.net,0.2127477785372522,0.20308983791955043,1.8472317156527682
adjacencies498.net,0.23410202655485673,0.22734386499866374,1.8532494758909854
adjacencies499.net,0.20558115719406042,0.214009566103676,1.9144905273937531
adjacencies5.net,0.20336700336700336,0.18188991044606012,1.9521885521885523
adjacencies50.net,0.19947209653092007,0.2278928368012078,1.9758672699849171
adjacencies500.net,0.20457393483709274,0.21825234991684397,1.9598997493734336
adjacencies501.net,0.2010752688172043,0.1318484383000512,2.247311827956989
adjacencies502.net,0.23420523138833,0.23599742988652836,1.816096579476861
adjacencies503.net,0.2130333138515488,0.21197001458716305,1.9170075978959673
adjacencies504.net,0.21393034825870647,0.23596921038698213,1.893713251922207
adjacencies505.net,0.23450980392156862,0.24915192812206097,1.8658823529411765
adjacencies506.net,0.2309027777777778,0.2554915670053033,1.8521825396825398
adjacencies507.net,0.20251758607922993,0.1975152770246321,1.8930025916327287
adjacencies508.net,0.21422274463708493,0.21415267566880342,1.8348516015280634
adjacencies509.net,0.20672268907563024,0.1906353963496821,2.1210084033613446
adjacencies51.net,0.22525252525252526,0.23696427505321394,1.874074074074074
adjacencies510.net,0.21688311688311687,0.2325958676011197,1.9103896103896103
adjacencies511.net,0.22578947368421054,0.23219213604238328,1.8182456140350878
adjacencies512.net,0.22171717171717173,0.23045235084450766,1.9373737373737374
adjacencies513.net,0.2320280537697253,0.2387090871440455,1.8527177089421392
adjacencies514.net,0.23149492017416545,0.2414894078732504,1.8715529753265603
adjacencies515.net,0.2046448087431694,0.2136671510548586,1.9240437158469945
adjacencies516.net,0.21475409836065573,0.21694607830602342,1.8939890710382514
adjacencies517.net,0.18395390070921985,0.16570720945720946,2.102836879432624
adjacencies518.net,0.22759562841530054,0.23778347262486726,1.8633879781420766
adjacencies519.net,0.21517996870109546,0.22055114813491322,1.8575899843505477
adjacencies52.net,0.19387755102040816,0.21271132495622294,2.0289115646258504
adjacencies520.net,0.2028027498677948,0.206260237897859,1.9079851930195664
adjacencies521.net,0.2243169398907104,0.21216530527168492,1.8475409836065573
adjacencies522.net,0.22908186341022163,0.23596721693967657,1.8285843509724107
adjacencies523.net,0.1925133689839572,0.19407096171802046,2.242424242424242
adjacencies524.net,0.2054263565891473,0.21392535113465347,2.0210409745293467
adjacencies525.net,0.21917007597895968,0.23391599989569237,1.890707188778492
adjacencies526.net,0.22388059701492538,0.2242043857281341,1.8494293239683934
adjacencies527.net,0.216538789428815,0.23101760391435977,1.8640238704177323
adjacencies528.net,0.1976950354609929,0.18974306943056943,2.0558510638297873
adjacencies529.net,0.2147610405323654,0.21223007328484,1.895341802782819
adjacencies53.net,0.1981382978723404,0.2376639564139564,2.0106382978723403
adjacencies530.net,0.24347826086956523,0.25205451243989413,1.8124223602484473
adjacencies531.net,0.20450680272108843,0.24086956794039627,2.0297619047619047
adjacencies532.net,0.2261904761904762,0.23296471730327856,1.8482142857142858
adjacencies533.net,0.19411764705882353,0.2049755255637608,2.022745098039216
adjacencies534.net,0.2329192546583851,0.24859066098368637,1.8161490683229813
adjacencies535.net,0.1871951219512195,0.20724979627418652,2.1792682926829268
adjacencies536.net,0.21409574468085107,0.2295844950256715,1.9627659574468086
adjacencies537.net,0.17983193277310924,0.11428571428571428,2.257142857142857
adjacencies538.net,0.17733990147783252,0.11321839080459771,2.4926108374384235
adjacencies539.net,0.22427884615384616,0.22269383572675241,1.8490384615384616
adjacencies54.net,0.23735119047619047,0.24022420258512558,1.8214285714285714
adjacencies540.net,0.21947115384615384,0.21564029273364824,1.8658653846153845
adjacencies541.net,0.21676587301587302,0.23127031695692085,1.8735119047619047
adjacencies542.net,0.20645863570391873,0.234076856900912,1.9542815674891147
adjacencies543.net,0.2365747460087083,0.24966527280768766,1.86066763425254
adjacencies544.net,0.2080909571655209,0.22248286642948575,1.9185616076150185
adjacencies545.net,0.20875850340136054,0.2142620584697415,1.965986394557823
adjacencies546.net,0.23149492017416545,0.23301110783732423,1.886066763425254
adjacencies547.net,0.20072115384615385,0.21133205076524908,1.9288461538461539
adjacencies548.net,0.20432692307692307,0.20048942034652906,1.9
adjacencies549.net,0.21705426356589147,0.21409823266868414,1.973421926910299
adjacencies55.net,0.23721227621483376,0.26041153037960507,1.8205456095481671
adjacencies550.net,0.22840343735866123,0.23872000215075864,1.8353686114880146
adjacencies551.net,0.2231623479640402,0.21183827906837985,1.8662083553675304
adjacencies552.net,0.21196283391405343,0.19288832860261435,2.0034843205574915
adjacencies553.net,0.20124113475177305,0.18625136437636433,2.00354609929078
adjacencies554.net,0.2135593220338983,0.22941505094318382,1.9056497175141243
adjacencies555.net,0.24775251189846642,0.25803042369705703,1.8117398202009518
adjacencies556.net,0.18351063829787234,0.18291338291338285,2.0691489361702127
adjacencies557.net,0.21858562244301577,0.265534915050841,1.9041496201052017
adjacencies558.net,0.19207317073170732,0.17834266004997718,2.101219512195122
adjacencies559.net,0.20952821461609622,0.22072279688049404,2.012025901942646
adjacencies56.net,0.2033898305084746,0.2116075487979512,1.9372881355932203
adjacencies560.net,0.1992600422832981,0.2217074592074592,2.051797040169133
adjacencies561.net,0.21800090456806875,0.24243928714262794,1.8629579375848033
adjacencies562.net,0.18963922294172064,0.24707750877963647,2.122109158186864
adjacencies563.net,0.19090909090909092,0.17499579940756413,2.083838383838384
adjacencies564.net,0.20980392156862746,0.18968471615530447,1.9592156862745098
adjacencies565.net,0.2353896103896104,0.2360122539385033,1.846103896103896
adjacencies566.net,0.22596153846153846,0.2260088986190439,1.854326923076923
adjacencies567.net,0.21841491841491842,0.2203372673775823,1.8592074592074592
adjacencies568.net,0.22786547700754975,0.2477824268052995,1.8059940517044155
adjacencies569.net,0.19642857142857142,0.23753106304126714,2.0255102040816326
adjacencies57.net,0.194947209653092,0.21424687052515096,2.0060331825037707
adjacencies570.net,0.21915584415584416,0.22178487945294673,1.901948051948052
adjacencies571.net,0.23076923076923078,0.2424792569397392,1.8475961538461538
adjacencies572.net,0.20162337662337662,0.19101402415339833,1.9577922077922079
adjacencies573.net,0.23084415584415585,0.23570140146599666,1.8668831168831168
adjacencies574.net,0.19207317073170732,0.19307806015123088,2.152439024390244
adjacencies575.net,0.19482846902201742,0.20313158947244153,1.9508448540706604
adjacencies576.net,0.21775956284153006,0.22416754043409867,1.9049180327868853
adjacencies577.net,0.21478174603174602,0.23528347566176505,1.8908730158730158
adjacencies578.net,0.19674185463659147,0.19305725807273796,1.9705513784461153
adjacencies579.net,0.22072072072072071,0.25984195984195985,2.039039039039039
adjacencies58.net,0.22378048780487805,0.22913170840000108,2.0134146341463413
adjacencies580.net,0.19806763285024154,0.18952050365093842,2.026086956521739
adjacencies581.net,0.2409502262443439,0.2634170579559363,1.8672699849170438
adjacencies582.net,0.22447552447552446,0.23855233923342317,1.847086247086247
adjacencies583.net,0.2193683409436834,0.23727906525031633,1.8546423135464232
adjacencies584.net,0.1995645863570392,0.2213502670392674,2.0130624092888243
adjacencies585.net,0.2028027498677948,0.2192836573803817,1.9323109465891062
adjacencies586.net,0.19133192389006343,0.17891187095732555,2.068710359408034
adjacencies587.net,0.2323671497584541,0.22587788383824187,1.9188405797101449
adjacencies588.net,0.21518987341772153,0.21901982777365556,1.839240506329114
adjacencies589.net,0.22994350282485876,0.25045959472817053,1.8728813559322033
adjacencies59.net,0.20597567424643046,0.20697173899261181,1.9196192490745638
adjacencies590.net,0.1992156862745098,0.16534168445933153,1.9992156862745099
adjacencies591.net,0.19986023759608665,0.20979232580539767,1.9804332634521313
adjacencies592.net,0.18927304964539007,0.19385265684607791,2.0682624113475176
adjacencies593.net,0.243734335839599,0.23714226693288112,1.8208020050125313
adjacencies594.net,0.19073083778966132,0.22023809523809518,2.2085561497326203
adjacencies595.net,0.19285714285714287,0.15199214365881034,2.1952380952380954
adjacencies596.net,0.20930232558139536,0.18552042272972508,2.0022148394241417
adjacencies597.net,0.22612244897959183,0.2223429185193891,1.9020408163265305
adjacencies598.net,0.1946938775510204,0.2005986040103687,2.04
adjacencies599.net,0.19630973986690864,0.19001233722329045,1.9637023593466425
adjacencies6.net,0.20598911070780399,0.19720865945911317,1.940713853599516
adjacencies60.net,0.21535215839013308,0.2343277778592086,1.851671535215839
adjacencies600.net,0.22847399829497017,0.23576139785574607,1.8367433930093777
adjacencies601.net,0.21623376623376622,0.19838046247820676,1.901948051948052
adjacencies602.net,0.23135593220338982,0.2496121698791977,1.852542372881356
adjacencies603.net,0.22621251388374677,0.25281926112589725,1.8300629396519807
adjacencies604.net,0.21778846153846154,0.2195796230569002,1.885096153846154
adjacencies605.net,0.1956521739130435,0.17741521763260892,2.0473429951690822
adjacencies606.net,0.20512820512820512,0.24460581085581082,2.080769230769231
adjacencies607.net,0.2165991902834008,0.28045074583536117,2.08502024291498
adjacencies608.net,0.21008593396653097,0.21209456434954332,1.8783355947535052
adjacencies609.net,0.20507399577167018,0.20534434000343094,2.033826638477801
adjacencies61.net,0.20697980684811237,0.22827560504242897,1.8933274802458298
adjacencies610.net,0.21877890841813136,0.21645942709772498,1.9417206290471785
adjacencies611.net,0.203656462585034,0.18424297791044486,1.9804421768707483
adjacencies612.net,0.19701754385964912,0.20681497895881767,1.8912280701754387
adjacencies613.net,0.22427035330261136,0.24147921499115976,1.8591909882232462
adjacencies614.net,0.2054354178842782,0.20357740916328312,1.934541203974284
adjacencies615.net,0.2046448087431694,0.2009281799085382,1.9038251366120218
adjacencies616.net,0.22775689223057644,0.2354153928498071,1.8615288220551378
adjacencies617.net,0.1883298392732355,0.16693258629533134,2.023759608665269
adjacencies618.net,0.2152777777777778,0.20771652453154,1.880952380952381
adjacencies619.net,0.2067603160667252,0.21430228177826022,1.8880597014925373
adjacencies62.net,0.20927318295739347,0.21507394680769285,1.9335839598997493
adjacencies620.net,0.2247918593894542,0.24829828095917272,1.93154486586494
adjacencies621.net,0.22237762237762237,0.23592702034037577,1.8624708624708626
adjacencies622.net,0.21008403361344538,0.18023912595341166,2.085714285714286
adjacencies623.net,0.23270911360799001,0.23803688076226068,1.7995006242197253
adjacencies624.net,0.2314935064935065,0.25433691127659513,1.8681818181818182
adjacencies625.net,0.2332099418297197,0.26852871348277313,1.8487572712850344
adjacencies626.net,0.19449485783424078,0.18989356372723512,1.9540229885057472
adjacencies627.net,0.19423076923076923,0.20250194250194253,2.082051282051282
adjacencies628.net,0.21165501165501166,0.23801592350782255,1.8932400932400932
adjacencies629.net,0.22373737373737373,0.2118275551608885,1.9363636363636363
adjacencies63.net,0.21136363636363636,0.2229075452718199,1.9324675324675324
adjacencies630.net,0.19221835075493612,0.20940620226334508,2.0603948896631823
adjacencies631.net,0.20656634746922026,0.20578610059387764,1.8522571819425444
adjacencies632.net,0.20212765957446807,0.17939288843544157,2.028677150786309
adjacencies633.net,0.22169811320754718,0.22953797862086894,1.9056603773584906
adjacencies634.net,0.2048131080389145,0.20997346043689522,1.9022017409114182
adjacencies635.net,0.20571126388154415,0.2152667617400964,1.9122157588577473
adjacencies636.net,0.21311475409836064,0.2282290239606384,1.9005464480874317
adjacencies637.net,0.22676767676767676,0.25082709592513514,1.9414141414141415
adjacencies638.net,0.221027216856892,0.23438696697012665,1.86215978928885
adjacencies639.net,0.2011764705882353,0.18183425621506116,1.9756862745098038
adjacencies64.net,0.21479774705581156,0.2310734505465257,1.8822324628776241
adjacencies640.net,0.20480225988700565,0.23983261645076834,1.9344632768361583
adjacencies641.net,0.23661106233538193,0.23755546124835192,1.8208955223880596
adjacencies642.net,0.18363499245852188,0.2332066688967141,2.0588235294117645
adjacencies643.net,0.2185064935064935,0.2163454192865957,1.914935064935065
adjacencies644.net,0.2423497267759563,0.2690972308250965,1.830601092896175
adjacencies645.net,0.21757164404223228,0.2132129967820012,1.9306184012066365
adjacencies646.net,0.19508448540706605,0.19886289703111168,1.9365079365079365
adjacencies647.net,0.22117400419287211,0.2209191286805666,1.9035639412997905
adjacencies648.net,0.22296626984126985,0.23238730854950865,1.8700396825396826
adjacencies649.net,0.20048076923076924,0.2151726941260163,1.9235576923076922
adjacencies65.net,0.19393939393939394,0.20575547908881234,2.0606060606060606
adjacencies650.net,0.21373456790123457,0.2251946278222708,1.8410493827160495
adjacencies651.net,0.22207792207792207,0.21100920570043732,1.905194805194805
adjacencies652.net,0.20814132104454686,0.21377996692754178,1.903225806451613
adjacencies653.net,0.22816326530612244,0.21306546394781692,1.8955102040816327
adjacencies654.net,0.21449444769140855,0.2157860742803283,1.901811805961426
adjacencies655.net,0.23005464480874316,0.22212887182181193,1.849726775956284
adjacencies656.net,0.20394736842105263,0.2554800343622243,1.9573934837092732
adjacencies657.net,0.2032312925170068,0.20348945105847863,2.003401360544218
adjacencies658.net,0.22598870056497175,0.239314325265328,1.8779661016949152
adjacencies659.net,0.22294172062904719,0.2322578478398253,1.9500462534690102
adjacencies66.net,0.22812971342383107,0.25723481190556685,1.885369532428356
adjacencies660.net,0.19047619047619047,0.11963684463684464,2.1698412698412697
adjacencies661.net,0.2261420171867933,0.22758369116687563,1.8525554047942108
adjacencies662.net,0.2126530612244898,0.265410142429324,1.933061224489796
adjacencies663.net,0.23387755102040816,0.26531652008122597,1.9240816326530612
adjacencies664.net,0.22317351598173515,0.24494715076013313,1.8424657534246576
adjacencies665.net,0.22045454545454546,0.2368045641763023,1.903896103896104
adjacencies666.net,0.20768136557610242,0.22589617984354832,2.0640113798008537
adjacencies667.net,0.22745098039215686,0.23083638843063356,1.9050980392156862
adjacencies668.net,0.2108173076923077,0.17368262496150083,1.896153846153846
adjacencies669.net,0.18831168831168832,0.21137913437366107,2.0142857142857142
adjacencies67.net,0.2204861111111111,0.24222335756778474,1.8804563492063493
adjacencies670.net,0.22941970310391363,0.21738247507478278,1.998650472334683
adjacencies671.net,0.22058823529411764,0.229277439465316,1.8511852502194908
adjacencies672.net,0.20174165457184326,0.21714307704873742,1.97677793904209
adjacencies673.net,0.2128205128205128,0.23618978148952804,1.8867132867132868
adjacencies674.net,0.23921568627450981,0.27030500257143847,1.8847058823529412
adjacencies675.net,0.21877551020408162,0.22443011890070705,1.9412244897959183
adjacencies676.net,0.20122448979591837,0.20659185259185261,1.9853061224489796
adjacencies677.net,0.22884615384615384,0.2512722285704465,1.85625
adjacencies678.net,0.2034965034965035,0.20395409257638344,1.9067599067599068
adjacencies679.net,0.2326007326007326,0.2334300839208322,1.812187812187812
adjacencies68.net,0.21342383107088989,0.22147432526987176,1.9283559577677225
adjacencies680.net,0.21928794992175274,0.23059429402112352,1.846244131455399
adjacencies681.net,0.1937984496124031,0.1873009419521047,2.0730897009966776
adjacencies682.net,0.2161917684305744,0.23015470431225152,1.8656716417910448
adjacencies683.net,0.22119487908961594,0.22859143780196414,2.056899004267425
adjacencies684.net,0.21418588399720476,0.21485319392096133,1.912648497554158
adjacencies685.net,0.20894213909994155,0.20475771378982796,1.908240794856809
adjacencies686.net,0.20027322404371584,0.1964689173464486,1.9568306010928962
adjacencies687.net,0.18798043326345212,0.19240251301654807,2.007686932215234
adjacencies688.net,0.23027027027027028,0.22922002614327283,1.821981981981982
adjacencies689.net,0.2452636968766001,0.24083770562983298,1.8218125960061444
adjacencies69.net,0.22323049001814882,0.21875100437206763,1.8862673926194797
adjacencies690.net,0.20163170163170163,0.18881680779082233,1.901165501165501
adjacencies691.net,0.2414918414918415,0.24184274511309828,1.8195804195804195
adjacencies692.net,0.2111111111111111,0.2129599040294227,1.9326599326599327
adjacencies693.net,0.20426651081239042,0.19934736862374997,1.929865575686733
adjacencies694.net,0.21363636363636362,0.20670823004156336,1.9717171717171718
adjacencies695.net,0.19924812030075187,0.19292058869621184,1.944235588972431
adjacencies696.net,0.22848200312989045,0.22871259105465144,1.8266823161189358
adjacencies697.net,0.2243169398907104,0.22736846606561878,1.8644808743169399
adjacencies698.net,0.2362155388471178,0.23245660277597704,1.8421052631578947
adjacencies699.net,0.22807017543859648,0.21679351750345663,1.884452510586812
adjacencies7.net,0.20258999122036875,0.2115462353771781,1.908252853380158
adjacencies70.net,0.19782214156079855,0.21533199446485446,1.9618874773139745
adjacencies700.net,0.20676691729323307,0.25739203267718824,1.9523809523809523
adjacencies701.net,0.2101010101010101,0.20854447394554354,1.9461279461279462
adjacencies702.net,0.19696084161309177,0.2065902372626936,1.9631794272355347
adjacencies703.net,0.17729468599033815,0.20230904361339147,2.157487922705314
adjacencies704.net,0.20614954577218728,0.20751782473918692,1.952480782669462
adjacencies705.net,0.2437214611872146,0.2445257167809319,1.8120243531202436
adjacencies706.net,0.1921921921921922,0.1586892086892087,2.1636636636636637
adjacencies707.net,0.20792682926829267,0.16091415359708042,2.021951219512195
adjacencies708.net,0.21311475409836064,0.20871453263221013,1.8885245901639345
adjacencies709.net,0.21872816212438853,0.20653702260524615,1.8958770090845563
adjacencies71.net,0.23367003367003367,0.2560168225619957,1.85993265993266
adjacencies710.net,0.24797979797979797,0.24792960126293456,1.8656565656565656
adjacencies711.net,0.20700354609929078,0.19797216672216675,2.006205673758865
adjacencies712.net,0.22324628776241678,0.22942565840251217,1.8597030209933436
adjacencies713.net,0.21928794992175274,0.21208151703900335,1.8489827856025038
adjacencies714.net,0.21864801864801864,0.25030349668374474,1.8918414918414919
adjacencies715.net,0.2271729587357331,0.23336622693693163,1.8292361720807726
adjacencies716.net,0.21372549019607842,0.21172523170793064,1.9176470588235295
adjacencies717.net,0.21126388154415654,0.20372579180753556,1.8889476467477526
adjacencies718.net,0.20227272727272727,0.19533680896601066,1.9564935064935065
adjacencies719.net,0.21915584415584416,0.21906192899807442,1.905194805194805
adjacencies72.net,0.2020460358056266,0.19496667700665538,1.9057971014492754
adjacencies720.net,0.20195578231292516,0.18238088442170072,2.004251700680272
adjacencies721.net,0.2078272604588394,0.17499722499722498,2.0715249662618085
adjacencies722.net,0.1862348178137652,0.13786768786768783,2.1565452091767883
adjacencies723.net,0.19636524822695037,0.2558197113344172,2.0398936170212765
adjacencies724.net,0.2197420634920635,0.21448134270130406,1.873015873015873
adjacencies725.net,0.21483491632745363,0.22428916826079617,1.8710990502035278
adjacencies726.net,0.22014260249554368,0.1854087089381207,2.0802139037433154
adjacencies727.net,0.23337245696400627,0.24635720276160888,1.8317683881064162
adjacencies728.net,0.2057142857142857,0.1938700515171103,2.0138775510204083
adjacencies729.net,0.21999007936507936,0.24062351262428666,1.8799603174603174
adjacencies73.net,0.2199195171026157,0.23852538060137032,1.8474849094567405
adjacencies730.net,0.1960167714884696,0.199637588010481,1.9692522711390636
adjacencies731.net,0.19374634716540035,0.21550668507298618,1.9590882524839275
adjacencies732.net,0.2030527289546716,0.24110180599542314,2.0101757631822386
adjacencies733.net,0.2390453834115806,0.2559363687572864,1.804773082942097
adjacencies734.net,0.23875181422351233,0.24979143825454936,1.86066763425254
adjacencies735.net,0.21483375959079284,0.22068427349959183,1.8780903665814153
adjacencies736.net,0.20910384068278806,0.18348143084985188,2.069701280227596
adjacencies737.net,0.19005102040816327,0.18781366026263982,2.05187074829932
adjacencies738.net,0.19393939393939394,0.21598975098975093,2.081818181818182
adjacencies739.net,0.19285714285714287,0.08548752834467119,2.7476190476190476
adjacencies74.net,0.2136591478696742,0.23685368216898273,1.9229323308270676
adjacencies740.net,0.22478169226136704,0.21968167560693871,1.8124059018367962
adjacencies741.net,0.23506081438392384,0.23349580144185192,1.8455843469063988
adjacencies742.net,0.20988700564971752,0.21310050344106068,1.9096045197740112
adjacencies743.net,0.20844155844155843,0.18977707924661708,1.9318181818181819
adjacencies744.net,0.21351351351351353,0.22780020864421635,1.858018018018018
adjacencies745.net,0.2155657962109575,0.2212282668062462,1.9083461341525858
adjacencies746.net,0.21525974025974026,0.2262900846450713,1.9155844155844155
adjacencies747.net,0.20423728813559322,0.20639511904217786,1.9259887005649718
adjacencies748.net,0.229320987654321,0.24647613168954258,1.8148148148148149
adjacencies749.net,0.18452380952380953,0.18364300098993974,2.0841836734693877
adjacencies75.net,0.1938898971566848,0.19065976533815754,1.970356926799758
adjacencies750.net,0.1876600102406554,0.2073400397114092,1.966205837173579
adjacencies751.net,0.2106280193236715,0.20416085051634927,2.0077294685990337
adjacencies752.net,0.22732919254658385,0.22319831187343625,1.8322981366459627
adjacencies753.net,0.19810040705563092,0.18839922276399534,1.9140660334690185
adjacencies754.net,0.22703962703962705,0.24698698508292974,1.8512820512820514
adjacencies755.net,0.19855072463768117,0.20884514036687954,2.059903381642512
adjacencies756.net,0.2168164992067689,0.20849654523378666,1.8836594394500263
adjacencies757.net,0.23134328358208955,0.22909100931242876,1.8317503392130259
adjacencies758.net,0.2079100145137881,0.1949489190055227,1.9484760522496372
adjacencies759.net,0.22867762128325508,0.24629286012160412,1.8352895148669797
adjacencies76.net,0.2377085162423178,0.2454445705046688,1.8125548726953469
adjacencies760.net,0.24086538461538462,0.26651451458213943,1.823076923076923
adjacencies761.net,0.2082459818308875,0.2340798090798091,1.930817610062893
adjacencies762.net,0.2245253164556962,0.22051926680243059,1.8193037974683544
adjacencies763.net,0.22489795918367347,0.22650382950382947,1.916734693877551
adjacencies764.net,0.21480406386066764,0.22933223207918,1.9121915820029027
adjacencies765.net,0.2289795918367347,0.21694826226405173,1.876734693877551
adjacencies766.net,0.20606060606060606,0.21858277524944186,1.996969696969697
adjacencies767.net,0.21490196078431373,0.20658018132066566,1.9529411764705882
adjacencies768.net,0.21785606744956337,0.22116746679876823,1.8349894610057211
adjacencies769.net,0.2320280537697253,0.2309928102251132,1.8457042665108123
adjacencies77.net,0.22704081632653061,0.24674509830572258,1.9319727891156462
adjacencies770.net,0.2087737843551797,0.2007284382284382,2.0454545454545454
adjacencies771.net,0.1773049645390071,0.1868755087505087,2.12322695035461
adjacencies772.net,0.19966329966329965,0.24661951036423307,1.975084175084175
adjacencies773.net,0.1950354609929078,0.2187447968697969,2.023049645390071
adjacencies774.net,0.17995337995337995,0.17867076242392865,1.9934731934731935
adjacencies775.net,0.19796484736355227,0.17217699558125102,2.026827012025902
adjacencies776.net,0.19747899159663865,0.24245722531436817,2.2016806722689077
adjacencies777.net,0.211864406779661,0.19457453565812696,1.911864406779661
adjacencies778.net,0.22698209718670076,0.22381332734780138,1.8435635123614664
adjacencies779.net,0.20754716981132076,0.19850938519239172,1.946890286512928
adjacencies78.net,0.2039969834087481,0.21423206946396986,1.9592760180995474
adjacencies780.net,0.20588235294117646,0.21508858755226934,1.9879336349924586
adjacencies781.net,0.23276942355889724,0.2192658285293123,1.8753132832080202
adjacencies782.net,0.20606060606060606,0.19425985232205323,1.962962962962963
adjacencies783.net,0.2021505376344086,0.18320532514080895,2.2688172043010755
adjacencies784.net,0.198005698005698,0.15955320399764847,2.3475783475783474
adjacencies785.net,0.23274094326725905,0.24841263336398237,1.8188653451811347
adjacencies786.net,0.21836734693877552,0.21775352425352434,1.9477551020408164
adjacencies787.net,0.20862470862470864,0.22284849210686525,1.9067599067599068
adjacencies788.net,0.22895467160037003,0.22171246220057225,1.913968547641073
adjacencies789.net,0.21973572037510655,0.22617395407309004,1.8674339300937766
adjacencies79.net,0.20842105263157895,0.2080896103478922,1.8543859649122807
adjacencies790.net,0.23726953467954345,0.2239575193286008,1.818700614574188
adjacencies791.net,0.19005102040816327,0.16228136942422655,2.0493197278911564
adjacencies792.net,0.2048076923076923,0.2223103269411915,1.9028846153846153
adjacencies793.net,0.22214452214452216,0.23465749060791205,1.8596736596736596
adjacencies794.net,0.23573573573573572,0.20711570711570715,1.9624624624624625
adjacencies795.net,0.21904761904761905,0.18918072668072672,2.046031746031746
adjacencies796.net,0.19433080070134423,0.1999289114679784,1.9696084161309175
adjacencies797.net,0.2176560121765601,0.2286687142858441,1.8489345509893456
adjacencies798.net,0.23527568922305764,0.23284718573540464,1.8577694235588973
adjacencies799.net,0.21226415094339623,0.25031227948016305,1.9412191582002902
adjacencies8.net,0.22703962703962705,0.22917488609432954,1.8554778554778555
adjacencies80.net,0.22514124293785312,0.24506284366511177,1.8717514124293786
adjacencies800.net,0.18518518518518517,0.21421578905239033,2.0433263452131376
adjacencies801.net,0.20310734463276836,0.23151930456884023,1.9548022598870056
adjacencies802.net,0.14814814814814814,0.31234567901234567,3.113960113960114
adjacencies803.net,0.23380221653878944,0.25879582486343883,1.841005967604433
adjacencies804.net,0.21405919661733616,0.21420978011887098,1.9693446088794926
adjacencies805.net,0.2231372549019608,0.22894712887428226,1.9058823529411764
adjacencies806.net,0.20938775510204083,0.21973606132429657,1.95265306122449
adjacencies807.net,0.20084745762711864,0.21719537113499948,1.9531073446327685
adjacencies808.net,0.226764500349406,0.25383847493840617,1.8958770090845563
adjacencies809.net,0.23472474289171205,0.2392458975730033,1.865698729582577
adjacencies81.net,0.1954595791805094,0.1821236902632251,2.079734219269103
adjacencies810.net,0.24745762711864408,0.24676470888932192,1.8271186440677967
adjacencies811.net,0.20676691729323307,0.18805216684473647,1.9385964912280702
adjacencies812.net,0.21300563236047107,0.21656066091082657,1.8986175115207373
adjacencies813.net,0.2236611062335382,0.21679272714924921,1.8529411764705883
adjacencies814.net,0.20336134453781513,0.229546485260771,2.1210084033613446
adjacencies815.net,0.18867924528301888,0.18024440459080984,2.025856044723969
adjacencies816.net,0.22292800967937085,0.23257268883803517,1.8753781004234724
adjacencies817.net,0.24100156494522693,0.23105461992454213,1.8051643192488263
adjacencies818.net,0.21661828737300434,0.22492444662255975,1.932510885341074
adjacencies819.net,0.2545454545454545,0.26703861737309326,1.8103896103896104
adjacencies82.net,0.2066326530612245,0.19647285820755206,1.9889455782312926
adjacencies820.net,0.20609756097560974,0.20305764696008602,2.047560975609756
adjacencies821.net,0.18926553672316385,0.20069024771811142,1.9824858757062147
adjacencies822.net,0.22597402597402597,0.2436234636448446,1.8805194805194805
adjacencies823.net,0.2233468286099865,0.21740951356335975,1.9959514170040487
adjacencies824.net,0.21734531993654152,0.2183177301298743,1.9011105235325225
adjacencies825.net,0.22826086956521738,0.24273815492219275,1.839300937766411
adjacencies826.net,0.17510204081632652,0.19302833114597825,2.1053061224489795
adjacencies827.net,0.22125435540069685,0.24497380925952358,1.9721254355400697
adjacencies828.net,0.19201228878648233,0.18212119264750837,1.9539170506912442
adjacencies829.net,0.20064102564102565,0.1642556055056055,2.0833333333333335
adjacencies83.net,0.2104032729398013,0.2381822979280606,1.9152542372881356
adjacencies830.net,0.20105355575065847,0.20511009925847826,1.9161545215100966
adjacencies831.net,0.20545609548167093,0.20841614281131557,1.8981244671781756
adjacencies832.net,0.2136177673874927,0.204501640750788,1.8901227352425483
adjacencies833.net,0.1987179487179487,0.1894191919191919,2.1153846153846154
adjacencies834.net,0.2237851662404092,0.2367526861377341,1.8486786018755328
adjacencies835.net,0.22163461538461537,0.25426088385385115,1.8836538461538461
adjacencies836.net,0.21095750128008192,0.23528754368107654,1.8986175115207373
adjacencies837.net,0.22686025408348456,0.2273071179618099,1.883847549909256
adjacencies838.net,0.19862155388471178,0.1891529666297468,1.9454887218045114
adjacencies839.net,0.2030527289546716,0.1889354144673294,2.0074005550416283
adjacencies84.net,0.20039215686274509,0.2376157643458682,2.019607843137255
adjacencies840.net,0.23991628614916286,0.23625102490104863,1.8021308980213089
adjacencies841.net,0.21760211578019395,0.21207664813838595,1.8230972671172494
adjacencies842.net,0.17882352941176471,0.16271076418135244,2.076078431372549
adjacencies843.net,0.19020408163265307,0.18834709734709734,2.0408163265306123
adjacencies844.net,0.22117400419287211,0.20917020222575772,1.8867924528301887
adjacencies845.net,0.24096045197740112,0.23208786880748114,1.8333333333333333
adjacencies846.net,0.22704658525554047,0.24187655073001527,1.8484848484848484
adjacencies847.net,0.2231418370658877,0.23432025642533208,1.8279779292437521
adjacencies848.net,0.2124223602484472,0.23207563950833568,1.8745341614906832
adjacencies849.net,0.22259615384615383,0.22780888918592512,1.8682692307692308
adjacencies85.net,0.2040983606557377,0.20881638789571585,1.9349726775956284
adjacencies850.net,0.21047065044949761,0.232038333793552,1.901639344262295
adjacencies851.net,0.23076923076923078,0.24199623956228372,1.841958041958042
adjacencies852.net,0.2207843137254902,0.24277216439846203,1.943529411764706
adjacencies853.net,0.1949404761904762,0.1800417668524286,1.9598214285714286
adjacencies854.net,0.22363945578231292,0.2074656102867387,1.9064625850340136
adjacencies855.net,0.23436586791350086,0.26516351943753946,1.8632378725891292
adjacencies856.net,0.22625529340592862,0.2540617453729977,1.8784029038112522
adjacencies857.net,0.22242380261248185,0.201636879291824,1.902757619738752
adjacencies858.net,0.22991071428571427,0.24211703980704688,1.8492063492063493
adjacencies859.net,0.22836438923395444,0.220412236678875,1.820703933747412
adjacencies86.net,0.2020735524256651,0.20796040365884882,1.8884976525821595
adjacencies860.net,0.23714539007092197,0.2412312326834385,1.9175531914893618
adjacencies861.net,0.23468013468013468,0.2412192058890501,1.874074074074074
adjacencies862.net,0.2560331825037707,0.24430982855756603,1.8122171945701357
adjacencies863.net,0.19674185463659147,0.21068354635243988,1.969298245614035
adjacencies864.net,0.2071977638015374,0.23958188227194072,1.9503843466107618
adjacencies865.net,0.21052631578947367,0.18958126210448187,1.9066416040100251
adjacencies866.net,0.20789779326364694,0.20077898292184,2.040650406504065
adjacencies867.net,0.20412480169222633,0.2017687653735791,1.9127445795875198
adjacencies868.net,0.2189265536723164,0.22581087428223648,1.8734463276836157
adjacencies869.net,0.1906906906906907,0.18253023253023254,2.1966966966966965
adjacencies87.net,0.2074074074074074,0.19503401436415785,1.934006734006734
adjacencies870.net,0.22571628232005592,0.23176870031445188,1.8770090845562544
adjacencies871.net,0.22542372881355932,0.2551199628831207,1.8728813559322033
adjacencies872.net,0.19959183673469388,0.214338011661541,2.0195918367346937
adjacencies873.net,0.21843251088534107,0.24388690344645705,1.9172714078374455
adjacencies874.net,0.2236611062335382,0.23736310774948113,1.8507462686567164
adjacencies875.net,0.237468671679198,0.2460186899082124,1.8533834586466165
adjacencies876.net,0.24,0.24416217038521515,1.8025225225225225
adjacencies877.net,0.19967532467532467,0.20455189160684512,1.9525974025974027
adjacencies878.net,0.20652680652680652,0.21410028193028466,1.9062937062937062
adjacencies879.net,0.19193061840120665,0.17902076555922705,2.002262443438914
adjacencies88.net,0.21949078138718173,0.23310113574573,1.8568920105355575
adjacencies880.net,0.20363408521303258,0.24397687358417366,1.950501253132832
adjacencies881.net,0.2132768361581921,0.2198196019093851,1.9112994350282486
adjacencies882.net,0.20909090909090908,0.21794123813731656,1.9808080808080808
adjacencies883.net,0.23502824858757063,0.2440484526690611,1.8491525423728814
adjacencies884.net,0.25448717948717947,0.2382001332001332,1.8935897435897435
adjacencies885.net,0.2411764705882353,0.23973217258931545,1.973109243697479
adjacencies886.net,0.20202020202020202,0.19958421554678235,1.9663299663299663
adjacencies887.net,0.22259887005649717,0.22730350259762028,1.892090395480226
adjacencies888.net,0.21342383107088989,0.26132739544861466,1.9638009049773755
adjacencies889.net,0.2233100233100233,0.2224080401465709,1.8573426573426572
adjacencies89.net,0.19005102040816327,0.15267406996098473,2.0374149659863945
adjacencies890.net,0.21568627450980393,0.20593228729540936,1.9147812971342384
adjacencies891.net,0.2238667900092507,0.2260979355785363,1.9306197964847363
adjacencies892.net,0.20653377630121816,0.23767692256064346,2.0199335548172757
adjacencies893.net,0.22161917684305743,0.24078526562030095,1.864314789687924
adjacencies894.net,0.18359941944847605,0.2261658953945302,2.0609579100145137
adjacencies895.net,0.20567375886524822,0.2266347656972657,1.9955673758865249
adjacencies896.net,0.18112244897959184,0.1614037889548094,2.0875850340136055
adjacencies897.net,0.21598639455782312,0.21825629019506573,1.9515306122448979
adjacencies898.net,0.21242937853107344,0.2074139700455489,1.9124293785310735
adjacencies899.net,0.20645645645645647,0.2555777555777556,2.0945945945945947
adjacencies9.net,0.20246734397677793,0.18617142815256021,1.9825834542815675
adjacencies90.net,0.2196969696969697,0.19663533996867327,1.9505050505050505
adjacencies900.net,0.22327044025157233,0.21581448084716057,1.9161425576519917
adjacencies901.net,0.2392857142857143,0.23244179296005624,1.8383116883116883
adjacencies902.net,0.2078577699736611,0.20534761261127718,1.8801580333625987
adjacencies903.net,0.22629399585921325,0.2410250038310437,1.843064182194617
adjacencies904.net,0.215513342379014,0.20785272975625227,1.864314789687924
adjacencies905.net,0.23677884615384615,0.23532813183045648,1.8264423076923078
adjacencies906.net,0.20530612244897958,0.21175435675435675,1.9918367346938775
adjacencies907.net,0.22795115332428764,0.2588249314169617,1.8616010854816825
adjacencies908.net,0.2138364779874214,0.21556723783675955,1.9252271139063593
adjacencies909.net,0.22514124293785312,0.23232087647200717,1.8700564971751412
adjacencies91.net,0.24322033898305084,0.2467038259360577,1.8451977401129944
adjacencies910.net,0.21526001705029837,0.23646026620728178,1.8891730605285593
adjacencies911.net,0.19170075978959672,0.1982107633377507,1.9877264757451782
adjacencies912.net,0.20606060606060606,0.21296621085391135,1.9313131313131313
adjacencies913.net,0.21138211382113822,0.18690462976177266,2.0336817653890824
adjacencies914.net,0.22736418511066397,0.21480908931058615,1.8177062374245472
adjacencies915.net,0.20865335381464414,0.2272413988837399,1.9129544290834612
adjacencies916.net,0.21143375680580762,0.21927615624236732,1.9080459770114941
adjacencies917.net,0.23158953722334005,0.2176996167896882,1.8237424547283703
adjacencies918.net,0.22232304900181488,0.2232271873886051,1.8771929824561404
adjacencies919.net,0.23135135135135135,0.23555288763026003,1.8172972972972974
adjacencies92.net,0.20480225988700565,0.21420649182259083,1.9491525423728813
adjacencies920.net,0.19244685662596112,0.20475428655156952,1.9443690637720488
adjacencies921.net,0.2149122807017544,0.21920456278041411,1.9229323308270676
adjacencies922.net,0.219558599695586,0.23062487038321272,1.8493150684931507
adjacencies923.net,0.20894213909994155,0.23817536617295237,1.9228521332554063
adjacencies924.net,0.20625,0.19445880103883556,1.8879807692307693
adjacencies925.net,0.21215986394557823,0.21533024798330921,1.96343537414966
adjacencies926.net,0.21176470588235294,0.21978369893594796,1.943529411764706
adjacencies927.net,0.19642857142857142,0.2036716486929019,1.9221230158730158
adjacencies928.net,0.20545609548167093,0.22077097229174572,1.902387041773231
adjacencies929.net,0.2234283129805518,0.218582400731572,1.8584350972410675
adjacencies93.net,0.2248587570621469,0.22701556126478725,1.8508474576271186
adjacencies930.net,0.20096618357487922,0.23008579584666541,2.042512077294686
adjacencies931.net,0.20993788819875778,0.2144087555277293,1.8786749482401657
adjacencies932.net,0.19158200290275762,0.1981101707516801,2.0043541364296082
adjacencies933.net,0.1758454106280193,0.11467312880356363,2.1381642512077295
adjacencies934.net,0.2033898305084746,0.21951261614377532,1.9222676797194622
adjacencies935.net,0.23552747575668528,0.24760583043501763,1.7948868645312959
adjacencies936.net,0.23188653451811347,0.23638871519295376,1.8185235816814764
adjacencies937.net,0.21073506081438392,0.20591857562057161,1.9069275515600213
adjacencies938.net,0.1868640148011101,0.22441317547700534,2.089731729879741
adjacencies939.net,0.20551378446115287,0.19870676852101005,1.9248120300751879
adjacencies94.net,0.2074468085106383,0.20613738113738123,1.9937943262411348
adjacencies940.net,0.220810647307925,0.22521610306578116,1.8929219600725953
adjacencies941.net,0.2344514325646401,0.24657480032867019,1.880503144654088
adjacencies942.net,0.2144927536231884,0.19247178297689804,1.9990338164251207
adjacencies943.net,0.21077441077441078,0.2635950353864792,1.9367003367003368
adjacencies944.net,0.2158953722334004,0.23317997238216617,1.8595573440643862
adjacencies945.net,0.2100456621004566,0.22852876049304507,1.865296803652968
adjacencies946.net,0.19412191582002902,0.1563320327471271,1.988388969521045
adjacencies947.net,0.19102990033222592,0.1764816578770067,2.1029900332225915
adjacencies948.net,0.19802555168408828,0.17365042365042363,2.097560975609756
adjacencies949.net,0.20833333333333334,0.2087491873206159,1.9846938775510203
adjacencies95.net,0.19004524886877827,0.17933889263074784,2.0052790346907994
adjacencies950.net,0.23001508295625941,0.26450537584587364,1.8815987933634992
adjacencies951.net,0.21591836734693878,0.22407994946230234,1.9363265306122448
adjacencies952.net,0.1823170731707317,0.16589413296730365,2.1646341463414633
adjacencies953.net,0.18927304964539007,0.2038845991970992,2.0558510638297873
adjacencies954.net,0.1907103825136612,0.18623209534492072,1.966120218579235
adjacencies955.net,0.2150635208711434,0.23083832617568062,1.91167574107683
adjacencies956.net,0.211369622475856,0.21242298338425983,1.8762071992976295
adjacencies957.net,0.21194503171247359,0.2276894822349368,2.0052854122621566
adjacencies958.net,0.20875850340136054,0.22039444815555262,1.9761904761904763
adjacencies959.net,0.2081967213114754,0.1940155499702269,1.8994535519125684
adjacencies96.net,0.22489795918367347,0.23443085672497432,1.9273469387755102
adjacencies960.net,0.2072155411655874,0.21116283243942818,1.9916743755781683
adjacencies961.net,0.2058531746031746,0.2135222032138361,1.910218253968254
adjacencies962.net,0.25254303599374023,0.24907571988772167,1.7769953051643192
adjacencies963.net,0.19019607843137254,0.19400577955941278,2.0274509803921568
adjacencies964.net,0.20470588235294118,0.22488861900626597,1.9780392156862745
adjacencies965.net,0.19883449883449883,0.1853970812104783,1.9146853146853147
adjacencies966.net,0.22064777327935223,0.24626918665380204,2.0269905533063426
adjacencies967.net,0.2441860465116279,0.24203148658890283,1.9133192389006342
adjacencies968.net,0.21288411699370605,0.2167614077507737,1.851536467974824
adjacencies969.net,0.20067340067340067,0.20418550255448648,1.958922558922559
adjacencies97.net,0.2029598308668076,0.25007921371557734,2.0549682875264272
adjacencies970.net,0.2175084175084175,0.22299547451953866,1.9272727272727272
adjacencies971.net,0.23248587570621468,0.24317339122292672,1.852542372881356
adjacencies972.net,0.22893772893772893,0.24530290953165088,1.82983682983683
adjacencies973.net,0.19576271186440677,0.1843319097769561,1.9502824858757062
adjacencies974.net,0.21657592256503327,0.22895010387403897,1.8886872353297035
adjacencies975.net,0.22371794871794873,0.27015410243351423,2.0025641025641026
adjacencies976.net,0.19121915820029028,0.20478691058602264,2.014513788098694
adjacencies977.net,0.24702702702702703,0.2695517667577433,1.7960360360360361
adjacencies978.net,0.2250453720508167,0.23437613879852123,1.8687235329703569
adjacencies979.net,0.2323549965059399,0.2382056485857655,1.8749126484975542
adjacencies98.net,0.22122448979591836,0.2373201014671603,1.9363265306122448
adjacencies980.net,0.22184170471841705,0.23460264557347063,1.8424657534246576
adjacencies981.net,0.21843137254901962,0.22127782070415467,1.916078431372549
adjacencies982.net,0.23020174646190905,0.23379954728572025,1.8124059018367962
adjacencies983.net,0.22214452214452216,0.23418455344574116,1.8536130536130535
adjacencies984.net,0.18579931972789115,0.1812982935431915,2.07312925170068
adjacencies985.net,0.20505050505050504,0.22079642282850825,1.9602693602693602
adjacencies986.net,0.22540983606557377,0.24580856244606414,1.862295081967213
adjacencies987.net,0.21369102682701202,0.231392484583974,1.9592969472710453
adjacencies988.net,0.22824858757062147,0.23344923050805408,1.8683615819209038
adjacencies989.net,0.1854764107308048,0.17765083616147448,2.0721554116558742
adjacencies99.net,0.1843137254901961,0.19503496311454793,2.0815686274509804
adjacencies990.net,0.21232152300370175,0.22989035226349538,1.8921205711263882
adjacencies991.net,0.23905723905723905,0.2637727119489012,1.861952861952862
adjacencies992.net,0.2473469387755102,0.2955795855331459,1.8726530612244898
adjacencies993.net,0.20876623376623377,0.22822941530924723,1.9305194805194805
adjacencies994.net,0.23149492017416545,0.23039194191714787,1.8584905660377358
adjacencies995.net,0.19155844155844157,0.22584980962081788,1.9954545454545454
adjacencies996.net,0.2275974025974026,0.23367278484206824,1.8623376623376624
adjacencies997.net,0.19392230576441102,0.19236545761313556,1.9899749373433584
adjacencies998.net,0.21514423076923078,0.23027515153735684,1.885576923076923
adjacencies999.net,0.18974358974358974,0.24935633810633812,2.1756410256410255
