*Vertices 62
*Matrix 
0.06 0 0 0 0 -1424.53 1157.49 -357.295 0 0 0 0 1607.79 0 0 0 0 0 2269.28 0 0 0 0 0 0 0 0 -2308.34 -1250.42 -420.316 0 0 2288.66 0 0 -1408.81 0 0 0 0 673.62 0 0 0 0 1574.68 0 0 0 0 236.137 0 0 0 2355.04 0 1735.36 0 0 -272.607 0 0 
0 0.08 0 410.855 2262.87 0 922.498 0 0 0 0 0 0 2231.28 0 0 0 1104.39 2431.03 0 -284.051 798.593 0 78.0511 0 0 0 0 1853.01 -748.695 0 2358.39 -488.678 146.107 0 0 0 -100.024 -544.526 0 0 0 0 1043.35 0 0 0 0 -368.282 0 0 0 0 2199.39 0 0 0 0 1634.19 0 0 0 
0 0 0.03 -1104.08 0 0 -424.131 0 0 0 586.489 0 0 0 0 0 -176.473 0 0 -79.2718 1189.08 0 2123.1 -1797.31 0 0 0 0 0 25.2541 2002.7 0 0 0 0 0 0 1268.43 0 0 -427.641 2140.64 0 0 0 0 0 0 0 0 -1189.54 0 0 0 1190.91 0 0 -631.047 0 2101.12 1480.68 0 
0 -1712.93 617.771 0.01 1151.39 1838.66 0 0 -1166.8 0 -1425.75 0 2189.78 0 0 0 0 0 0 0 -1157.19 0 0 162.74 0 1904.13 0 0 -174.184 0 -283.135 0 0 0 0 0 0 0 -273.522 0 0 0 0 123.829 0 0 0 0 -2315.52 -683.996 0 0 0 1185.57 1634.5 0 1780.22 0 -628.452 0 0 0 
0 1780.98 0 -551.851 0.03 0 0 0 0 0 1321.38 0 0 0 0 0 0 0 2186.27 0 0 0 0 0 0 0 0 0 1829.66 0 -127.491 0 0 0 0 0 0 186.087 0 0 0 0 0 0 0 0 0 1773.96 33.0363 1903.52 127.338 0 0 0 -1545.38 0 0 0 0 0 0 0 
1318.78 0 0 190.512 0 0.06 0 -1118.43 0 0 2468.26 0 0 -1199.61 0 0 -1033.28 0 0 0 -715.888 -1288.42 0 0 0 0 0 0 0 0 0 0 1641.36 0 0 0 0 0 0 0 0 0 0 0 1624.73 0 0 0 0 0 167.928 0 0 0 0 644.932 0 1890.24 624.027 703.681 0 0 
-923.872 2216.79 1898.18 0 0 0 0.04 0 0 0 0 0 0 0 0 -1181.45 0 -699.408 0 0 0 0 0 0 0 0 1789.68 115.284 0 0 0 0 0 1766.18 0 1329.92 0 -1232.41 0 0 0 0 0 0 0 0 0 0 0 0 0 -891.522 2241.81 1501.89 0 0 1617.86 0 -996.506 0 1259.58 0 
-1320.61 0 0 0 0 763.344 0 0.08 -128.559 0 0 2173.3 0 -433.439 0 0 0 0 0 0 0 2484.28 0 2312.31 0 2133.93 0 0 -255.974 0 1028.7 0 1669.74 0 0 0 0 0 0 1820.96 1891.92 0 0 0 0 0 0 0 0 0 0 0 0 0 0 0 2227.16 0 1638.31 0 0 0 
0 0 0 1323.66 0 0 0 2067.09 0.09 0 0 0 0 652.715 0 0 1963.33 0 0 0 0 0 0 0 1025.19 -288.934 0 -994.217 0 0 0 0 -332.423 0 2162.92 0 344.63 0 0 0 0 -171.133 0 0 0 -857.799 1169.85 0 0 0 0 0 0 0 597.934 0 0 0 0 0 1083.18 0 
0 0 0 0 0 0 0 0 0 0.09 0 0 1951.73 -1966.54 0 0 1409.73 0 0 0 0 0 266.045 0 0 0 0 0 0 1157.95 0 0 0 0 0 0 0 0 0 0 0 0 659.886 0 0 -750.832 334.712 0 0 0 -1364.25 0 0 0 0 0 0 1306.57 0 0 0 0 
0 0 1626.26 2421.72 1679.36 130.848 0 0 0 0 0.09 -2159.26 0 -2080.98 -1337.7 0 0 -107.349 -2262.41 0 0 0 -206.229 0 0 0 1533.78 0 392.697 -369.503 0 -767.159 -1212.42 0 0 0 1616.79 0 0 2478.48 0 1324.73 0 -925.55 0 0 0 0 0 2181.69 694.83 0 0 0 0 0 1438.41 0 587.1 0 0 0 
0 0 0 0 0 0 0 -1074.63 0 0 1405.76 0.06 1713.23 0 254.601 2265.31 2370.75 0 0 0 0 0 0 0 -1649.6 -851.085 0 1209.98 1200.22 0 0 0 1954.48 0 0 0 0 0 2131.18 -1153.22 -725.044 0 0 -626.164 0 0 -621.586 0 0 906.323 -615.482 0 0 0 2441.4 -954.848 0 0 0 0 -489.288 2151.02 
2375.94 0 0 781.655 0 0 0 0 0 -2391.66 0 1478.7 0.02 0 0 1901.99 0 0 0 257.195 413.144 0 0 0 0 0 0 0 0 1179.01 1848.89 284.204 0 0 1080.74 0 0 0 0 2092.27 1145.28 -58.2141 1342.89 -1971.11 0 2441.25 107.807 0 1342.28 0 0 0 0 -2310.02 0 0 644.627 0 0 -771.584 0 0 
0 -308.008 0 0 0 627.842 0 -879.315 493.103 1721.02 2415.62 0 0 0.05 0 -801.798 379.727 0 -1329.31 0 0 0 -539.186 0 -1619.24 -821.482 2057.79 0 39.2926 0 2400.97 0 0 0 0 0 0 0 0 0 0 0 -1440.55 2398.37 0 0 0 1192.74 0 -29.0689 0 1111.41 0 -2031.54 0 0 0 473.418 1960.43 0 0 0 
0 0 0 0 0 0 0 0 0 0 -1578.8 -153.127 0 0 0 1310.54 0 0 1903.97 -112.995 0 -446.867 0 0 0 0 0 0 351.497 0 0 0 1575.29 0 0 0 0 0 647.984 0 0 0 0 0 0 0 0 0 -2278.74 -1184.96 0 0 0 0 1839.12 0 0 0 0 0 0 0 
0 0 0 0 0 0 -1554.23 0 0 0 0 2442.47 418.943 719.245 -985.977 0.09 -370.113 0 0 0 0 1775.8 0 0 0 0 0 0 804.697 0 0 0 0 1831.34 0 0 0 0 0 0 0 0 0 0 0 0 0 0 644.78 0 2176.81 0 0 -1724.52 0 0 -1563.08 -1258.51 0 0 0 0 
0 0 1274.07 0 0 1456.27 0 0 -1044.11 -1051.9 0 174.642 0 -469.146 0 711.31 0.06 0 0 0 0 0 0 2125.84 0 1396.76 0 0 0 0 0 0 0 0 -2008.04 0 0 0 0 0 0 0 0 0 1693.09 0 -1646.4 0 1594.36 0 0 0 0 0 -361.568 378.048 1206.32 0 0 0 0 0 
0 1399.5 0 0 0 0 -270.623 0 0 0 -2104.18 0 0 0 0 0 0 0.05 0 0 0 0 0 0 0 0 -354.091 0 0 -1558.05 0 0 0 0 0 0 0 1948.99 0 0 168.081 0 0 0 0 0 0 0 0 0 -874.584 0 0 0 0 2240.75 0 0 0 0 0 0 
1170.92 -2276.6 0 0 1067.92 0 0 0 0 0 69.6585 0 0 -165.792 1437.96 0 0 0 0.04 0 0 -703.223 0 0 0 46.4644 0 0 530.641 0 0 0 543.764 2048.17 0 1644.72 0 -1277.73 0 0 0 0 0 0 0 -2391.96 0 0 0 -1238.67 0 0 1672.95 0 0 0 0 871.685 0 1175.04 0 0 
0 0 2063.89 0 0 0 0 0 0 0 0 0 1901.38 0 1998.43 0 0 0 0 0.04 0 0 0 2278.13 0 0 0 2093.95 0 0 0 -13.0467 1923.35 0 1437.65 0 0 0 0 0 0 0 0 0 1917.71 0 0 1055.71 2295.22 0 -1818.83 0 0 -928.755 0 0 2098.83 2273.25 0 0 0 0 
0 1679.2 413.755 784.249 0 -1262.93 0 0 0 0 0 0 532.624 0 0 0 0 0 0 0 0.09 2441.1 0 0 0 0 -510.346 0 0 0 0 0 0 0 0 0 0 0 0 0 1405.15 0 0 0 0 0 0 -1051.74 0 -415.586 0 0 461.669 0 0 0 0 0 0 0 0 -1582.46 
0 292.444 0 0 0 1677.83 0 -1177.48 0 0 0 0 0 0 -278.71 1797.01 0 0 1121.94 0 668.737 0 0 1667.61 0 -111.469 0 0 0 0 0 0 0 0 1256.98 1046.86 0 0 0 -988.113 0 0 0 2211.91 0 0 0 0 0 690.71 2330.32 1443.75 0 0 0 46.9222 -987.35 0 0 0 0 0 
0 0 -1421.17 0 0 0 0 0 0 778.756 -1430.02 0 0 92.0896 0 0 0 0 0 0 0 0 0.07 894.269 0 0 0 0 0 0 0 425.047 0 1007.8 0 -995.285 -1679.97 0 0 1255.3 -0.686666 0 1628.7 0 0 0 0 0 0 0 1019.55 0 0 0 0 0 0 0 0 0 0 2400.66 
0 2229.3 1954.94 2405.24 0 0 0 -1798.84 0 0 0 0 0 0 0 0 -737.556 0 0 -1213.03 0 659.429 -328.15 0 1674.63 0 0 2179.1 0 0 1956.01 0 0 0 0 2335.35 0 -188.528 765.786 0 0 0 -910.138 0 319.147 0 1997.21 0 2159.41 -1181.14 0 0 1190.3 0 0 1429.41 0 0 0 0 0 0 
0 0 0 0 0 0 0 0 1425.6 0 0 452.361 0 -610.599 0 0 0 0 0 0 0 0 0 640.355 0.06 0 -843.608 0 0 -351.65 0 792.642 0 0 1324.43 0 656.835 -22.5074 453.581 1189.54 2277.83 0 0 -65.2333 0 -2162.01 0 0 0 1446.81 0 0 0 0 0 -2249.75 0 229.575 0 0 0 0 
0 0 0 -822.398 0 0 0 -1043.81 -1008.1 0 0 952.559 0 915.937 0 0 -170.675 0 -1020.62 0 0 -2458.8 0 0 0 0.03 -127.338 0 0 0 2464.6 0 0 0 0 931.654 0 1848.12 -1976.45 0 0 0 2283.17 0 0 -1037.71 622.806 403.378 0 0 735.42 0 0 1415.68 0 0 0 824.534 0 0 0 0 
0 0 0 0 0 0 -1864.91 0 0 0 1947.61 0 0 540.864 0 0 0 643.712 0 0 1377.38 0 0 0 1852.09 841.624 0.08 0 0 0 0 1783.88 1334.04 1703.31 0 -2210.68 983.688 0 0 957.442 0 0 1544.92 81.5607 0 0 0 0 0 0 0 0 0 0 -173.116 1662.27 0 0 0 0 0 0 
2312.46 0 0 0 0 0 2353.97 0 1768.32 0 0 1333.43 0 0 0 0 0 0 0 1952.96 0 0 0 -548.341 0 0 0 0.01 0 0 0 0 0 0 1803.72 0 0 1444.21 0 0 0 -255.058 0 0 0 0 0 0 0 0 0 -605.258 0 0 0 0 0 0 0 0 0 0 
2294.15 -2164.91 0 -1157.49 704.291 0 0 2361.6 0 0 -1265.83 1146.66 0 1390.5 1314.97 -1696.45 0 0 58.0615 0 0 0 0 0 0 0 0 0 0.07 2048.48 2326.81 2360.99 729.926 0 0 -1925.64 0 0 0 0 -1246.15 419.553 0 0 1217 0 0 0 0 0 0 0 0 0 0 -1149.1 0 0 2242.12 0 0 2140.64 
465.026 2174.83 99.1089 0 0 0 0 0 0 1446.5 -2147.66 0 -2468.87 0 0 0 0 2409.67 0 0 0 0 0 0 -103.381 0 0 0 884.503 0.02 985.824 0 0 0 736.335 0 2493.59 -1455.5 -398.495 0 -565.889 0 0 0 0 0 0 964.309 -898.999 0 0 0 0 604.19 0 0 -175.71 0 0 0 0 0 
0 0 2384.95 774.636 -1031.45 0 0 333.491 0 0 0 0 -2338.56 714.667 0 0 0 0 0 0 0 0 0 1863.99 0 2159.57 0 0 1020.77 1686.83 0.08 579.47 0 0 0 0 0 0 0 0 0 0 1996.9 -1842.78 0 0 1101.95 0 0 0 0 0 -564.364 0 0 0 -210.044 0 0 0 0 0 
0 -377.285 0 0 0 0 0 0 0 0 -159.536 0 1602.15 0 0 0 0 0 0 -2369.99 0 0 2027.88 0 116.657 0 -823.313 0 -2179.25 0 1659.06 0.02 0 0 0 57.7563 0 0 0 -1013.9 0 0 0 0 2028.95 -1250.42 571.23 0 0 0 0 0 -1240.5 870.617 2429.81 907.392 0 0 -15.0304 0 0 -2027.42 
-1297.42 -487.609 0 0 0 -1297.42 0 -495.239 892.59 0 2113.03 2037.8 0 0 656.682 0 0 0 -536.439 2351.83 0 0 0 0 0 0 1279.56 0 -1323.97 0 0 0 0.07 0 0 0 1421.32 0 1479.92 -1549.5 0 0 0 0 0 0 -1278.95 0 0 0 -390.255 -1233.33 0 0 0 0 0 1285.06 2253.56 0 0 0 
0 1285.67 0 0 0 0 1163.44 0 0 0 0 0 0 0 0 -1527.68 0 0 681.249 0 0 0 2393.19 0 0 0 1659.37 0 0 0 0 0 0 0.07 0 0 0 0 0 0 0 734.809 0 0 0 0 0 0 0 0 -2140.8 0 0 0 0 0 0 0 0 0 0 118.03 
0 0 0 0 0 0 0 0 1050.52 0 0 0 2155.6 0 0 0 1836.07 0 0 -665.075 0 2089.37 0 0 -1812.57 0 0 2104.02 0 2128.74 0 0 0 0 0.08 0 0 0 0 0 0 0 0 0 0 0 0 0 0 0 0 182.424 1371.12 0 0 1342.13 0 0 -1098.74 0 -2152.55 0 
783.944 0 0 0 0 0 592.288 0 0 0 0 0 0 0 0 0 0 0 578.555 0 0 1217.31 -1218.38 -99.5666 0 843.15 2219.99 0 -1945.78 0 0 1100.27 0 0 0 0.09 0 0 -2174.21 0 1835.76 -397.732 147.328 0 1187.25 0 0 0 0 0 0 0 -1730.17 0 0 1753.36 1046.86 0 0 -640.507 0 0 
0 0 0 0 0 0 0 0 -1162.68 0 -2065.42 0 0 0 0 0 0 0 0 0 0 0 2021.01 0 1076.77 0 1788.16 0 0 279.321 0 0 306.94 0 0 0 0.07 -1191.67 -2304.22 -2155.75 -274.285 1105 2315.06 0 0 0 0 0 0 0 0 -166.707 0 0 0 0 910.138 0 1724.07 0 0 0 
0 461.058 1871.93 0 1826.15 0 1706.06 0 0 0 0 0 0 0 0 0 0 772.5 -2415.01 0 0 0 0 -946.913 1429.56 2447.05 0 2195.27 0 978.042 0 0 0 0 0 0 -1083.33 0.06 1117.82 0 0 0 0 0 0 -2090.9 0 0 -1420.56 -2269.74 0 0 -1948.99 0 0 836.283 -1097.83 0 0 0 1758.55 0 
0 1289.94 0 -755.715 0 0 0 0 0 0 0 2272.64 0 0 -1298.49 0 0 0 0 0 0 0 0 -976.058 1407.13 1085.92 0 0 0 -315.638 0 0 2132.25 0 0 1618.93 103.381 1882 0.08 239.494 -1363.64 0 0 0 2174.98 803.171 0 -1768.32 -592.441 0 -757.546 0 0 0 0 0 0 0 2057.63 0 0 0 
0 0 0 0 0 0 0 1578.19 0 0 -2047.11 1169.09 -114.826 0 0 0 0 0 0 0 0 962.783 1914.81 0 -1288.11 0 1972.49 0 0 0 0 -2265.16 279.931 0 0 0 -411.008 0 1458.4 0 0 -1229.51 -1206.17 0 0 -227.592 0 -1102.4 0 -49.5163 0 727.638 1726.2 0 -1983.63 0 0 -378.201 0 0 0 0 
1068.22 0 317.011 0 0 0 0 1271.94 0 0 0 2079.76 442.595 0 0 0 0 -2259.67 0 0 -608.921 0 846.049 0 1660.89 0 0 0 -821.177 -2193.75 0 0 0 0 0 -854.595 1088.37 0 2268.67 0 0.04 0 352.107 0 291.833 0 -1285.82 743.507 0 0 0 -1197.01 0 0 -705.054 0 2153.16 0 -30.137 0 0 0 
0 0 844.981 0 0 0 0 0 -2002.24 0 899.457 0 567.873 0 0 0 0 0 0 0 0 0 0 0 0 0 0 -787.149 -917.768 0 0 0 0 236.747 0 403.226 -400.632 0 0 1550.57 0 0.08 0 0 0 0 0 -2203.05 0 0 0 910.901 0 290.46 0 302.21 0 0 0 0 0 0 
0 0 0 0 0 0 0 0 0 1745.89 0 0 1152.91 -89.8007 0 0 0 0 0 0 0 0 -1341.06 1175.95 0 2174.98 265.282 0 0 0 1226.62 0 0 0 0 -1255.3 1537.29 0 0 -439.085 -160.756 0 0.03 0 0 0 0 -482.269 1923.51 554.14 0 0 0 0 1293.91 0 0 0 0 0 0 2031.54 
0 1091.57 0 1895.12 0 0 0 0 0 0 2184.74 1697.97 -6.02741 1056.17 0 0 0 0 0 0 0 850.475 0 0 -712.683 0 -2151.78 0 0 0 -865.123 0 0 0 0 0 0 0 0 0 0 0 0 0.02 0 0 0 0 0 0 679.113 0 1970.66 -1713.08 1116.6 0 0 0 0 1007.8 0 0 
0 0 0 0 0 1770.76 0 0 0 0 0 0 0 0 0 0 1226.77 0 0 2380.52 0 0 0 2358.39 0 0 0 0 -1420.26 0 0 2449.03 0 0 0 1045.49 0 0 -501.648 0 57.7563 0 0 0 0.01 1438.87 0 0 0 0 0 0 -1287.65 0 0 0 0 0 0 0 2066.94 0 
2498.02 0 0 0 0 0 0 0 -399.564 -1454.74 0 0 2496.95 0 0 0 0 0 26.9326 0 0 0 0 0 -1292.08 -367.519 0 0 0 0 0 1498.99 0 0 0 0 0 465.331 1565.37 -1034.96 0 0 0 0 -1189.84 0.01 0 1387.14 0 -760.445 0 0 -695.135 -1032.36 0 0 0 0 1426.51 0 0 0 
0 0 0 0 0 0 0 0 561.922 894.879 0 -1396.76 -1130.02 0 0 0 698.035 0 0 0 0 0 0 724.128 0 1561.56 0 0 0 0 1838.82 1009.32 663.854 0 0 0 0 0 0 0 2064.04 0 0 0 0 0 0.01 0 0 0 0 0 0 -939.436 0 0 0 0 1516.54 1016.04 1589.79 0 
0 0 0 0 -490.204 0 0 0 0 0 0 0 0 271.081 0 0 0 0 0 517.67 369.655 0 0 0 0 -2238.91 0 0 0 126.118 0 0 0 0 0 0 0 0 -39.14 -439.39 -391.171 -1203.57 1225.24 0 0 -5.41704 0 0.08 0 0 -105.823 0 0 0 0 -130.696 0 1341.52 0 0 0 1803.42 
0 -853.374 0 -990.86 -2286.07 0 0 0 0 0 0 0 -752.51 0 1123 1032.06 787.606 0 0 -1551.48 0 0 0 1860.18 0 0 0 0 0 301.447 0 0 0 0 0 0 0 1907.64 -576.876 0 0 0 1906.87 0 0 0 0 0 0 0 93.6155 0 0 2065.57 0 0 0 0 0 0 0 0 
0 0 0 2041.31 784.707 0 0 0 0 0 900.983 359.89 0 -292.749 -433.592 0 0 0 -1411.86 0 2181.08 1509.98 0 435.27 1587.95 0 0 0 0 0 0 0 0 0 0 0 0 -1334.65 0 1307.64 0 0 -943.251 0 0 1246.45 0 0 0 0.07 0 -1362.73 0 0 0 0 1414.46 0 0 0 0 0 
967.055 0 -191.122 0 187.613 581.301 0 0 0 1615.27 2351.07 546.968 0 0 0 -1380.89 0 -1843.7 0 2246.24 0 404.141 1440.7 0 0 1626.87 0 0 0 0 0 0 -806.07 1222.8 0 0 0 0 -568.178 0 0 0 0 838.42 0 0 0 -747.322 -754.799 0 0.06 0 0 0 0 -2349.85 0 0 0 0 0 0 
0 0 0 0 0 0 764.718 0 0 0 0 0 0 -1093.71 0 0 0 0 0 0 0 617.313 0 0 0 0 0 1035.11 0 0 0 0 2105.4 0 -2204.89 0 -2347.56 0 0 -2411.34 1210.9 1252.71 0 0 0 0 0 0 0 2143.09 0 0.08 0 0 0 -1116.29 1727.73 675.604 0 0 0 0 
0 0 0 0 0 0 1522.64 0 0 0 0 0 0 0 0 0 0 0 -222.861 0 566.195 0 0 461.974 0 0 0 0 0 0 -478.607 2466.28 0 0 -1860.33 1644.11 0 -901.135 0 1608.1 0 0 0 863.903 2180.32 712.683 0 0 0 0 0 0 0.04 -1477.32 0 0 652.104 0 0 0 0 0 
0 2116.69 0 2214.65 0 0 1105.3 0 0 0 0 0 1831.49 291.223 0 -657.445 0 0 0 1391.72 0 0 0 0 0 2235.25 0 0 0 -1873.15 0 1886.73 0 0 0 0 0 0 0 0 0 60.9607 0 1543.55 0 -1561.71 -1093.4 0 -785.47 0 0 0 771.126 0.03 0 0 0 0 -1973.56 0 0 0 
-1880.63 0 -2499.54 -224.387 2330.16 0 0 0 1679.51 0 0 -176.473 0 0 1744.36 0 2256.31 0 0 0 0 0 0 0 0 0 1634.8 0 0 0 0 2316.58 0 0 0 0 0 0 0 2418.52 -936.689 0 1395.08 -1734.75 0 0 0 0 0 0 0 0 0 0 0.06 0 0 0 0 0 770.974 0 
0 0 0 0 0 446.562 0 0 0 0 0 1754.13 0 0 0 0 -1668.98 1121.02 0 0 0 1893.14 0 -2126 288.781 0 -2486.88 0 -915.021 0 0 -385.525 0 0 2135.15 315.485 0 1530.73 0 0 0 505.31 0 0 0 0 0 -1408.51 0 0 2333.06 81.2555 0 0 0 0.09 986.435 0 0 0 0 0 
575.35 0 0 1878.34 0 0 606.326 -11.2156 0 0 1864.91 0 50.1267 0 0 416.807 -235.221 0 0 -1302.3 0 -1583.68 0 0 0 0 0 0 0 -1668.83 -1347.47 0 0 0 0 1639.07 -37.9192 -1746.35 0 0 495.392 0 0 0 0 0 0 0 0 2418.52 0 2309.72 1532.11 0 0 1141.77 0.06 0 0 0 0 0 
0 0 2413.17 0 0 -944.319 0 0 0 -2431.33 0 0 0 2006.52 0 -1878.19 0 0 362.789 -2163.23 0 0 0 0 2000.26 1542.79 0 0 0 0 0 0 2447.81 0 0 0 0 0 0 -1867.66 0 0 0 0 0 0 0 1273.46 0 0 0 1902.6 0 0 0 0 0 0 0 0 0 0 
0 -1438.26 0 1838.82 0 -1800.52 -1889.32 2086.32 0 0 -10.1474 0 0 1256.22 0 0 0 0 0 0 0 0 0 0 0 0 0 0 28.4585 0 0 2021.01 1925.03 0 1571.02 0 1278.19 0 504.395 0 -400.937 0 0 0 0 -2150.56 -1499.91 0 0 0 0 0 0 1467.86 0 0 0 0 0.05 0 0 0 
-487.915 0 153.737 0 0 1287.8 0 0 0 0 0 0 377.743 0 0 0 0 0 1315.12 0 0 0 0 0 0 0 0 0 0 0 0 0 0 0 0 -2481.69 0 0 0 0 0 0 0 2149.49 0 0 -127.186 0 0 0 0 0 0 0 0 0 0 0 0 0.02 0 0 
0 0 141.072 0 0 0 -1847.36 0 2461.09 0 0 -2374.26 0 0 0 0 0 0 0 0 0 0 0 0 0 0 0 0 0 0 0 0 0 0 -1081.96 0 0 819.651 0 0 0 0 0 0 1470 0 2362.21 0 0 0 0 0 0 0 1642.89 0 0 0 0 0 0.09 0 
0 0 0 0 0 0 0 0 0 0 0 -1195.18 0 0 0 0 0 0 0 0 -735.115 0 1183.43 0 0 0 0 0 1118.27 0 0 -1926.25 0 1287.96 0 0 0 0 0 0 0 0 -1683.32 0 0 0 0 2239.07 0 0 0 0 0 0 0 0 0 0 0 0 0 0.07 
