*Vertices 41
*Matrix 
0.05 0 0 1623.05 0 0 0 0 0 0 -747.322 0 -219.047 721.381 0 86.7489 0 257.653 0 0 0 0 0 0 0 0 0 1915.11 0 0 0 0 0 0 0 0 0 0 0 0 0 
0 0.08 1882.15 0 0 0 0 0 1575.9 -385.067 0 0 2479.09 0 0 0 0 0 0 0 1989.58 -1450.47 0 0 0 0 0 -1024.12 0 0 0 1331.29 0 -2159.41 0 0 0 0 0 0 0 
0 -453.276 0.09 0 0 0 0 1725.75 0 0 0 0 1736.12 1400.11 0 0 0 -261.925 0 0 0 0 0 0 -577.944 0 -44.0229 0 0 0 0 -928.602 0 350.429 0 0 0 0 0 0 0 
-387.509 0 0 0.05 0 0 2481.08 0 0 0 0 -1545.53 768.38 0 978.042 0 0 0 0 0 0 0 2477.42 -752.052 0 60.1978 0 0 1171.83 1365.93 0 0 0 0 0 0 0 0 0 0 2166.59 
0 0 0 0 0 0 0 0 0 705.664 0 0 0 38.377 0 0 1509.37 375.454 0 0 0 0 0 -781.503 0 0 0 0 1380.12 0 0 0 0 0 0 0 0 0 0 0 0 
0 0 0 0 0 0.07 0 0 0 0 0 1003.07 0 2167.35 0 0 0 0 0 0 -1641.51 -315.18 0 1002.61 0 0 0 0 0 -1099.66 0 0 0 0 293.664 0 0 0 0 0 0 
0 0 0 1895.58 0 0 0.04 0 0 0 -1872.69 2120.66 1193.04 0 1720.4 1171.07 0 -2206.26 2186.88 0 0 0 -2243.03 0 0 0 2010.48 0 -819.651 660.955 639.286 0 0 -1852.55 0 0 0 0 0 0 0 
0 0 2318.11 0 0 0 0 0.09 1675.54 0 0 744.575 0 0 1876.66 2375.94 0 0 0 2037.34 0 0 1645.33 0 0 0 0 0 0 0 0 0 0 2379.15 0 0 0 0 0 0 0 
0 2150.26 0 0 0 0 0 -1650.67 0.06 1412.47 0 0 0 0 0 2348.63 0 0 0 1180.23 0 0 276.727 0 0 1192.28 2411.19 0 1141.16 298.547 0 0 599.307 546.052 0 0 0 0 0 0 0 
0 800.272 0 0 2012.47 0 0 0 -154.805 0 263.756 0 0 0 0 0 1459.47 -1577.73 0 -415.128 0 1212.27 1906.26 0.839259 0 0 0 0 -2174.67 0 697.729 264.977 1249.81 783.486 0 0 2003.92 0 0 0 5.56963 
-2023 0 0 0 0 0 1559.11 0 0 -1288.26 0.09 0 0 0 1705.15 61.5711 0 0 0 0 -2079.15 0 0 0 0 1282.01 0 967.818 0 1478.09 442.137 2165.21 0 -457.549 0 0 2349.7 0 0 0 -2210.68 
0 0 0 -514.771 0 -2387.39 1813.18 1847.06 0 0 0 0.02 0 0 0 -85.3755 0 0 454.344 0 0 0 0 0 0 -644.627 0 1008.56 0 0 0 2212.06 -1508 0 0 0 0 0 0 0 0 
2374.11 -2268.52 -1705.45 -1338.77 0 0 1301.84 0 0 0 0 0 0.07 0 0 1907.48 0 0 0 0 114.673 0 0 0 2305.75 2204.73 0 0 2147.36 0 0 0 0 2200.16 0 0 0 0 0 0 0 
1414.76 0 -1611.61 0 1791.97 2110.74 0 0 0 0 0 0 0 0.07 -79.4244 0 0 -2330.62 0 0 0 2496.34 0 0 0 0 0 1805.25 0 0 69.0481 0 0 -12.8941 0 0 0 0 -2023.3 0 0 
0 0 0 -969.344 0 0 1343.96 -895.032 0 0 211.875 0 0 1189.99 0.01 876.11 0 740.608 0 2119.59 2236.93 -1435.51 0 0 2480.01 0 0 0 0 0 0 -1206.17 0 0 0 0 0 0 0 0 0 
384.915 0 0 0 0 0 625.553 2282.4 1241.42 0 -764.565 -494.324 -1835.92 0 662.633 0.02 2390.29 -564.669 0 -505.921 0 109.18 0 0 0 0 1538.36 0 0 0 0 0 -2207.33 0 0 0 0 0 0 0 0 
0 0 0 0 333.033 0 0 0 0 -1737.04 0 0 0 0 0 1850.26 0.05 1025.5 -1404.84 0 0 0 2019.64 0 0 2206.56 0 214.927 0 0 0 1015.88 0 0 0 -1110.64 0 0 0 0 0 
-1198.69 0 -891.369 0 -1404.54 0 1357.39 0 0 477.386 0 0 0 2101.28 761.208 403.226 293.207 0.01 2482.6 -210.807 0 0 0 0 0 0 0 498.138 1567.96 0 0 0 0 0 0 0 0 0 0 0 0 
0 0 0 0 0 0 71.6422 0 0 0 0 1856.97 0 0 0 0 1142.54 -2092.43 0 0 0 0 0 0 2171.77 0 0 2330.62 0 0 2095.93 0 0 0 0 0 0 1332.21 0 786.386 0 
0 0 0 0 0 0 0 575.503 1845.99 126.423 0 0 0 0 1068.68 -1793.95 0 2361.14 0 0.02 0 0 0 0 1854.84 -960.036 0 0 -443.815 752.663 0 1702.25 -1110.64 0 0 0 0 0 0 0 2000.72 
0 2285.61 0 0 0 -1425.75 0 0 0 0 1001.39 0 1519.9 0 2342.52 0 0 0 0 0 0.09 1487.09 0 0 0 0 0 0 0 -343.867 0 -549.409 0 2229 2008.35 0 0 0 0 0 0 
0 1367.61 0 0 0 1681.49 0 0 0 -314.264 0 0 0 577.792 -364.467 -1594.82 0 0 0 0 2266.69 0 167.776 0 -1191.52 1940.6 0 0 0 0 0 1842.02 0 0 0 0 0 0 0 -2425.99 0 
0 0 0 -1691.11 0 0 1329.77 397.427 1509.22 -2176.96 0 0 0 0 0 0 2116.69 0 0 0 0 200.888 0.01 0 0 2433.77 0 0 608.158 0 0 0 0 -1270.1 0 0 1693.85 0 1334.8 -1556.98 0 
0 0 0 582.675 115.131 988.876 0 0 0 -1048.08 0 0 0 0 0 0 0 0 0 0 0 0 0 0.01 242.698 1653.42 0 0 1996.6 0 0 0 0 0 -1035.87 0 0 0 0 0 0 
0 0 827.128 0 0 0 0 0 0 0 0 0 1275.6 0 2384.33 0 0 0 -616.855 -189.138 0 -1817.45 0 1001.54 0.04 0 0 0 0 -2170.4 0 0 0 0 0 0 0 0 0 0 0 
0 0 0 -2178.18 0 0 0 0 2422.94 0 2390.59 2102.95 1398.43 0 0 0 -220.42 0 0 1996.75 0 513.55 -836.894 -899.152 0 0.05 0 -671.636 -854.747 0 0 0 0 -333.644 0 649.663 0 0 0 0 0 
0 0 676.824 0 0 0 604.801 0 1809.52 0 0 0 0 0 0 -818.278 0 0 0 0 0 0 0 0 0 0 0 2269.74 0 -469.604 -655.004 0 0 0 0 0 0 0 0 0 0 
1358.46 2490.69 0 0 0 0 0 0 0 0 -376.827 2407.22 0 -1645.18 0 0 -1472.75 2216.18 1820.96 0 0 0 0 0 0 -1409.42 1586.58 0 0 0 0 0 0 0 0 0 0 0 0 677.129 0 
0 0 0 2416.53 866.802 0 1245.38 0 1923.66 1793.34 0 0 2086.32 0 0 0 0 -1453.83 0 -1218.07 0 0 1398.59 -936.995 0 1889.32 0 0 0.03 -1634.95 0 2429.65 0 638.371 0 0 0 -2082.2 0 0 0 
0 0 0 1141.62 0 -606.784 -532.929 0 1021.68 0 104.144 0 0 0 0 0 0 0 0 -279.931 1401.33 0 0 0 1920.76 0 1300.47 0 2130.57 0.01 0 1145.74 0 0 0 1318.32 0 0 0 0 0 
0 0 0 0 0 0 1326.26 0 0 1440.86 2062.21 0 0 1629.15 0 0 0 0 -165.029 0 0 0 0 0 0 0 -1914.66 0 0 0 0.03 2185.51 0 0 0 0 0 0 0 2004.99 0 
0 -168.996 -313.959 0 0 0 0 0 0 2270.04 1308.56 -1780.98 0 0 1909.77 0 1289.48 0 0 843.303 -1468.02 1974.93 0 0 0 0 0 0 -2011.25 -1910.08 1633.58 0.09 -1294.82 14.2674 0 0 0 952.712 0 0 0 
0 0 0 0 0 0 0 0 -186.85 1950.67 0 1619.24 0 0 0 -1219.6 0 0 0 42.3444 0 0 0 0 0 0 0 0 0 0 0 1734.14 0.03 0 0 0 0 0 0 0 0 
0 1450.47 1012.07 0 0 0 1796.55 2100.51 1061.97 1363.03 -1545.69 0 -913.343 2170.4 0 0 0 0 0 0 -1394.31 0 -2478.18 0 0 -33.0363 0 0 737.404 0 0 14.2674 0 0.07 0 0 0 0 0 0 0 
0 0 0 0 0 2449.64 0 0 0 0 0 0 0 0 0 0 0 0 0 0 -538.27 0 0 1900.77 0 0 0 0 0 0 0 0 0 0 0.04 0 -97.7355 0 0 0 0 
0 0 0 0 0 0 0 0 0 0 0 0 0 0 0 0 2304.22 0 0 0 0 0 0 0 0 1643.65 0 0 0 2220.15 0 0 0 0 0 0.04 0 0 -512.177 0 0 
0 0 0 0 0 0 0 0 0 -100.482 1092.64 0 0 0 0 0 0 0 0 0 0 0 2144.92 0 0 0 0 0 0 0 0 0 0 0 -1300.16 0 0.09 0 0 0 0 
0 0 0 0 0 0 0 0 0 0 0 0 0 0 0 0 0 0 2389.68 0 0 0 0 0 0 0 0 0 -1872.69 0 0 -929.365 0 0 0 0 0 0.08 0 0 0 
0 0 0 0 0 0 0 0 0 0 0 0 0 1662.42 0 0 0 0 0 0 0 0 2486.27 0 0 0 0 0 0 0 0 0 0 0 0 -933.18 0 0 0.01 -1144.06 0 
0 0 0 0 0 0 0 0 0 0 0 0 0 0 0 0 0 0 -186.392 0 0 1483.58 2237.85 0 0 0 0 2103.87 0 0 2446.59 0 0 0 0 0 0 0 -2153.46 0.07 0 
0 0 0 -613.804 0 0 0 0 0 2405.39 2448.88 0 0 0 0 0 0 0 0 -1704.99 0 0 0 0 0 0 0 0 0 0 0 0 0 0 0 0 0 0 0 0 0.04 
