*Vertices 62
*Matrix 
0.02 0 0 0 0 0 1301.69 0 0 0 0 0 0 0 0 0 0 0 0 0 0 0 0 0 0 0 0 0 0 0 -1450.93 0 0 0 0 0 0 0 0 0 0 0 0 0 0 0 0 -442.137 2459.56 0 0 2365.26 0 0 0 0 0 0 0 0 0 0 
0 0.01 0 0 0 0 0 0 0 1614.05 0 0 0 0 0 0 0 0 1366.85 0 0 0 0 0 0 0 0 0 0 0 0 2401.58 0 -1680.43 0 0 0 0 0 0 0 -138.02 0 0 0 0 0 0 0 0 0 0 0 0 1457.64 0 0 0 0 0 0 0 
0 0 0.07 0 0 0 0 0 0 0 0 0 0 0 0 0 696.966 0 755.409 0 0 0 0 0 0 0 0 0 0 0 -1412.63 1995.68 0 0 0 0 0 2317.04 0 0 606.937 0 0 0 0 2368.62 -2070.3 0 0 1089.89 0 0 0 0 0 0 0 865.734 0 0 0 0 
0 0 0 0.05 0 0 0 0 0 0 0 0 0 0 0 0 138.783 0 2322.84 0 0 0 0 0 0 0 0 0 0 0 0 0 0 0 0 0 0 957.595 0 0 0 -510.498 0 2479.55 0 0 -1776.86 0 0 0 0 0 0 0 0 0 -1744.36 0 0 0 0 0 
0 0 0 0 0.03 0 0 0 -1580.17 0 0 0 0 0 0 0 2218.01 0 0 992.538 0 -2348.02 0 0 1740.7 0 0 0 -1224.17 0 0 -838.725 0 0 0 2186.12 0 0 0 355.922 0 1833.32 118.641 0 0 368.282 0 0 0 0 0 0 0 0 0 0 0 0 0 0 0 0 
0 0 0 0 0 0.08 2130.57 0 0 -1061.82 0 0 0 0 0 0 0 0 2050.31 0 0 0 0 0 0 0 0 0 0 0 1650.21 0 0 0 0 0 0 0 -485.321 2384.03 0 0 0 -1048.84 0 0 0 0 0 0 0 0 0 0 0 0 0 0 0 0 0 0 
2159.57 0 0 0 0 -1355.71 0.09 1309.63 0 0 0 0 0 -1677.98 0 0 0 0 0 0 0 0 0 -1435.51 0 657.598 0 0 0 0 0 0 802.866 0 0 0 0 1513.18 0 0 -562.532 0 1318.93 0 0 0 0 -1641.67 0 0 0 0 0 0 483.032 0 0 0 0 0 0 0 
0 0 0 0 0 0 1174.58 0.04 0 0 2374.11 0 0 0 0 0 0 0 0 0 0 0 0 0 0 0 0 -894.269 0 0 -2475.28 -2458.19 0 0 0 0 -409.94 0 721.381 0 430.235 0 1158.56 0 0 0 1330.23 0 0 -1108.05 0 0 0 0 -423.521 0 0 0 0 0 0 0 
0 0 0 0 -2198.63 0 0 0 0.02 0 0 0 1568.27 0 0 0 0 -41.7341 0 0 0 -101.856 0 0 0 659.429 31.5104 0 0 -943.709 0 0 0 179.83 0 0 0 0 0 0 0 0 0 0 0 0 0 969.192 0 0 0 0 0 0 0 0 0 2472.23 0 0 0 0 
0 2250.82 0 0 0 586.032 0 0 0 0.02 0 -592.593 0 0 0 0 0 0 0 0 0 0 0 0 0 0 2453.76 0 0 0 0 0 0 0 0 0 -2372.28 0 0 0 0 0 -2351.53 485.626 1861.4 0 0 0 0 -840.556 0 1723.61 0 0 0 0 0 310.907 0 0 2405.85 0 
0 0 0 0 0 0 0 1793.65 0 0 0.06 0 0 0 152.211 0 0 0 0 0 0 0 0 0 0 0 0 0 0 0 0 -1105.61 75.6096 0 -203.33 947.676 623.264 0 0 0 0 0 0 0 0 0 0 0 0 0 0 0 0 0 0 0 0 577.334 0 0 0 0 
0 0 0 0 0 0 0 0 0 1217.92 0 0.06 0 0 0 0 0 0 1688.51 2011.25 0 2363.43 0 0 0 0 0 0 0 0 0 0 0 0 0 0 0 0 0 0 157.857 -2444.15 0 0 0 -2443.69 0 0 0 0 0 0 0 0 0 0 0 0 0 0 0 0 
0 0 0 0 0 0 0 0 1693.09 0 0 0 0.09 0 0 -1165.43 0 0 0 0 171.896 0 0 0 0 0 -542.848 0 1238.67 -1279.26 0 0 0 0 0 1359.37 0 0 0 1216.54 0 0 0 0 0 0 0 0 0 0 165.639 0 0 958.815 -2043.14 0 0 0 0 0 0 0 
0 0 0 0 0 0 -226.524 0 0 0 0 0 0 0.03 0 0 0 0 0 0 0 0 0 1786.17 0 651.799 -1950.06 0 0 0 0 0 0 0 0 304.041 0 0 0 0 0 0 0 331.66 0 0 0 0 0 0 1550.26 0 0 0 0 0 -1685.61 0 0 0 1380.28 0 
0 0 0 0 0 0 0 0 0 0 2374.87 0 0 0 0.02 991.318 0 0 0 0 0 0 0 0 0 1573.76 0 0 0 0 119.404 0 0 0 -966.75 0 0 0 0 0 0 0 0 0 0 -36.6985 325.861 0 -1886.73 0 0 0 0 0 0 0 0 0 0 0 0 0 
0 0 0 0 0 0 0 0 0 0 0 0 1834.09 0 1117.66 0.08 0 1970.81 0 -499.817 0 -884.35 0 0 0 0 0 0 0 0 0 0 0 0 0 0 -474.029 0 0 0 0 394.375 0 0 0 0 0 0 -726.417 0 0 0 0 1936.02 0 0 0 0 1975.08 0 0 0 
0 0 -1765.27 -844.829 1449.25 0 0 0 0 0 0 0 0 0 0 0 0.01 0 0 0 0 0 0 0 0 0 0 0 0 0 0 0 0 802.408 0 -56.8407 0 0 -1309.78 0 1652.81 0 0 0 0 0 0 0 962.935 0 0 0 0 0 2404.78 0 0 -1806.16 0 2058.24 0 0 
0 0 0 0 0 0 0 0 947.218 0 0 0 0 0 0 -1212.27 0 0.09 0 0 0 -129.933 0 0 0 0 2224.42 0 0 0 0 0 810.648 -1647.47 0 0 0 2312.46 0 0 0 2425.23 0 0 0 0 0 0 0 0 0 0 0 0 0 0 0 0 0 0 0 0 
0 1868.88 -256.127 1255.46 0 2111.04 0 0 0 0 0 930.28 0 0 0 0 0 0 0.06 1888.71 0 0 0 0 1569.64 0 0 0 0 0 0 0 0 0 0 0 0 0 0 0 0 0 0 0 0 0 -2381.89 0 0 0 0 0 0 0 0 0 0 0 0 0 0 0 
0 0 0 0 2378.38 0 0 0 0 0 0 272.301 0 0 0 855.51 0 0 504.395 0.04 0 0 1805.09 0 0 0 0 940.046 0 117.267 0 0 0 -542.39 0 0 0 0 0 0 0 0 0 0 0 0 0 0 0 0 0 0 0 0 0 0 0 0 0 0 0 0 
0 0 0 0 0 0 0 0 0 0 0 0 220.573 0 0 0 0 0 0 0 0.07 0 0 0 0 0 0 0 0 0 0 0 0 0 0 1647.47 0 0 2489.01 0 0 0 0 0 0 0 0 392.087 0 0 0 0 0 0 2155.14 0 0 0 994.522 0 0 0 
0 0 0 0 -2290.03 0 0 0 516.755 0 0 1725.44 0 0 0 2227.77 0 85.8333 0 0 0 0.01 -277.642 0 0 0 0 1898.79 0 0 0 0 0 0 0 -456.633 0 0 0 0 0 0 0 0 0 0 0 0 0 0 0 0 0 0 0 0 0 -371.029 0 0 0 0 
0 0 0 0 0 0 0 0 0 0 0 0 0 0 0 0 0 0 0 1843.24 0 2066.03 0.08 0 0 0 0 1242.03 0 -1297.42 0 0 0 0 0 0 0 0 0 0 1516.85 0 0 0 0 0 -2200.77 0 0 0 0 0 0 65.9963 0 0 0 0 0 0 976.821 -2244.41 
0 0 0 0 0 0 2184.44 0 0 0 0 0 0 414.975 0 0 0 0 0 0 0 0 0 0.06 0 1570.41 0 0 0 0 0 0 2455.14 0 0 0 0 0 0 0 1387.91 0 0 -533.692 0 -1164.51 0 0 0 0 0 0 0 0 0 1195.33 0 0 0 0 0 0 
0 0 0 0 -768.075 0 0 0 0 0 0 0 0 0 0 0 0 0 1411.71 0 0 0 0 0 0.05 0 1967.6 0 0 0 0 0 1096.61 0 0 0 0 0 -328.608 2172.84 0 0 0 0 1231.19 0 0 0 0 -956.221 0 0 0 0 0 0 0 0 0 0 0 0 
0 0 0 0 0 0 1677.83 0 1332.06 0 0 0 0 -1471.83 2127.67 0 0 0 0 0 0 0 0 -2283.32 0 0.03 0 0 0 0 0 0 0 0 0 0 0 403.836 0 0 0 0 0 0 0 2382.66 0 0 0 0 411.161 0 0 0 0 2225.94 0 0 0 0 0 0 
0 0 0 0 0 0 0 0 -2404.32 1569.19 0 0 -926.771 1869.33 0 0 0 811.106 0 0 0 0 0 0 -324.183 0 0.05 2445.98 0 0 1949.14 0 1341.82 0 0 1540.96 0 0 0 0 0 -958.51 0 0 0 0 0 0 0 -2241.36 0 0 0 0 0 0 0 0 0 656.072 0 0 
0 0 0 0 0 0 0 1753.67 0 0 0 0 0 0 0 0 0 0 0 450.224 0 1709.42 -1752.3 0 0 0 2245.93 0.04 0 0 0 0 0 0 0 0 0 0 0 0 0 0 1585.67 0 0 0 0 0 160.146 0 0 0 0 0 0 0 0 -1233.48 0 0 0 -620.518 
0 0 0 0 -2454.07 0 0 0 0 0 0 0 2029.4 0 0 0 0 0 0 0 0 0 0 0 0 0 0 0 0.03 0 0 0 0 0 0 0 0 0 -311.823 0 0 0 0 0 0 0 0 0 0 0 2433.77 0 0 0 0 0 0 0 0 1768.62 0 0 
0 0 0 0 0 0 0 0 867.565 0 0 0 -137.41 0 0 0 0 0 0 944.472 0 0 620.975 0 0 0 0 0 0 0.06 0 0 0 1244.32 0 0 0 0 0 0 0 0 0 0 0 0 0 200.735 2287.44 0 0 0 0 0 0 0 0 0 0 0 0 0 
-259.789 0 1211.36 0 0 2091.51 0 -649.968 0 0 0 0 0 0 1084.7 0 0 0 0 0 0 0 0 0 0 0 1877.73 0 0 0 0.07 0 0 0 0 0 0 0 -2324.67 0 0 0 0 -440.916 0 0 0 -242.698 417.57 0 0 0 0 0 1829.05 0 2188.71 0 0 0 0 0 
0 -1324.12 -1657.84 0 2439.88 0 0 -856.273 0 0 940.046 0 0 0 0 0 0 0 0 0 0 0 0 0 0 0 0 0 0 0 0 0.07 0 0 0 1305.66 0 0 0 2409.67 0 0 0 -1055.41 2056.41 0 0 0 0 0 0 0 1380.12 0 0 0 0 0 0 0 0 0 
0 0 0 0 0 0 1310.54 0 0 0 2413.94 0 0 0 0 0 0 -1511.05 0 0 0 0 0 -710.852 -433.592 0 -274.133 0 0 0 0 0 0.04 0 0 0 2451.32 0 0 0 0 0 0 0 0 0 0 2419.43 0 0 0 0 0 0 0 0 0 0 0 0 0 0 
0 -686.895 0 0 0 0 0 0 -1928.85 0 0 0 0 0 0 0 -520.569 2460.78 0 2148.12 0 0 0 0 0 0 0 0 0 46.0067 0 0 0 0.06 0 0 0 0 0 545.289 0 0 0 0 0 657.75 -676.519 0 0 0 0 0 0 0 0 0 0 0 0 0 0 0 
0 0 0 0 0 0 0 0 0 0 -1057.24 0 0 0 2451.32 0 0 0 0 0 0 0 0 0 0 0 0 0 0 0 0 0 0 0 0.01 0 0 0 0 0 2432.1 0 0 0 0 0 0 1070.97 0 0 447.325 0 0 0 0 1955.4 0 0 0 0 2436.67 0 
0 0 0 0 656.072 0 0 0 0 0 -1544.62 0 -1636.02 615.177 0 0 2317.19 0 0 0 2308.5 170.827 0 0 0 0 -1192.43 0 0 0 0 -1271.02 0 0 0 0.08 0 0 0 0 0 0 0 0 0 0 0 0 0 0 0 2205.04 0 0 0 0 0 0 0 0 0 0 
0 0 0 0 0 0 0 1283.38 0 1676.76 1846.14 0 0 0 0 2328.49 0 0 0 0 0 0 0 0 0 0 0 0 0 0 0 0 -1284.75 0 0 0 0.01 0 0 0 0 1989.73 0 0 1673.56 0 0 0 0 0 0 0 0 0 0 0 0 0 0 0 0 0 
0 0 -57.9089 1446.81 0 0 -989.029 0 0 0 0 0 0 0 0 0 0 322.657 0 0 0 0 0 0 0 1309.17 0 0 0 0 0 0 0 0 0 0 0 0.03 0 0 0 1776.71 0 0 0 0 1249.96 -696.203 -301.294 0 0 0 0 0 0 0 0 0 0 0 0 0 
0 0 0 0 0 -135.578 0 894.421 0 0 0 0 0 0 0 0 -1264.76 0 0 0 1021.53 0 0 0 -2325.59 0 0 0 716.803 0 1968.52 0 0 0 0 0 0 0 0.02 0 0 0 0 0 0 0 -1214.56 0 0 0 0 0 -1564.91 0 2158.96 0 0 0 0 0 0 0 
0 0 0 0 -486.389 -386.135 0 0 0 0 0 0 2012.77 0 0 0 0 0 0 0 0 0 0 0 1030.69 0 0 0 0 0 0 1703.31 0 1847.82 0 0 0 0 0 0.01 0 0 0 0 0 0 1362.73 0 0 0 0 0 0 0 0 0 0 0 0 0 0 0 
0 0 1992.17 0 0 0 -717.261 1065.63 0 0 0 1321.83 0 0 0 0 1765.42 0 0 0 0 0 1192.74 -785.165 0 0 0 0 0 0 0 0 0 0 -2001.94 0 0 0 0 0 0.02 0 0 0 0 0 0 0 0 0 2337.03 0 0 0 0 0 0 0 0 0 0 0 
0 -745.186 0 -602.664 1187.25 0 0 0 0 0 0 1865.67 0 0 0 -1708.5 0 2265.47 0 0 0 0 0 0 0 0 2492.07 0 0 0 0 0 0 0 0 0 -1532.26 -1681.49 0 0 0 0.08 0 0 0 0 0 0 0 2457.73 0 1529.97 0 -2129.2 0 0 0 0 0 -2011.4 0 0 
0 0 0 0 1478.55 0 -1737.49 -431.761 0 -182.882 0 0 0 0 0 0 0 0 0 0 0 0 0 0 0 0 0 2433.01 0 0 0 0 0 0 0 0 0 0 0 0 0 0 0.05 0 0 0 0 0 0 1897.72 0 0 0 0 0 0 0 0 0 0 0 0 
0 0 0 552.309 0 1155.81 0 0 0 2154.99 0 0 0 -948.897 0 0 0 0 0 0 0 0 0 -2235.71 0 0 0 0 0 0 609.684 -2163.53 0 0 0 0 0 0 0 0 0 0 0 0.08 0 0 0 0 0 0 0 0 0 0 0 0 0 0 -716.651 0 1841.87 0 
0 0 0 0 0 0 0 0 0 -2241.05 0 0 0 0 0 0 0 0 0 0 0 0 0 0 -1025.65 0 0 0 0 0 0 1907.03 0 0 0 0 1785.41 0 0 0 0 0 0 0 0.09 0 0 0 0 1796.24 0 0 0 0 0 0 0 0 0 0 0 0 
0 0 -191.122 0 387.814 0 0 0 0 0 0 1585.82 0 0 -2404.78 0 0 0 0 0 0 0 0 2205.5 0 1025.5 0 0 0 0 0 0 0 -557.344 0 0 0 0 0 0 0 0 0 0 0 0.03 0 1079.97 0 0 0 0 1536.38 814.31 0 -1600.47 0 0 0 540.864 0 0 
0 0 2056.26 1456.11 0 0 0 -1756.42 0 0 0 0 0 0 710.395 0 0 0 1371.43 0 0 0 1655.71 0 0 0 0 0 0 0 0 0 0 -1596.5 0 0 0 -1324.12 -495.697 890.149 0 0 0 0 0 0 0.06 0 -1352.05 0 2486.88 0 0 0 0 0 0 0 0 0 0 0 
-451.75 0 0 0 0 0 -904.492 0 -131.611 0 0 0 0 0 0 0 0 0 0 0 -2356.26 0 0 0 0 0 0 0 0 1232.57 1009.32 0 -1636.48 0 2422.48 0 0 640.202 0 0 0 0 0 0 0 268.181 0 0.04 0 0 0 0 0 0 0 0 0 0 0 0 0 0 
74.2363 0 0 0 0 0 0 0 0 0 0 0 0 0 2271.11 837.352 738.777 0 0 0 0 0 0 0 0 0 0 -504.852 0 -562.532 -913.343 0 0 0 0 0 0 272.149 0 0 0 0 0 0 0 0 -398.343 0 0.09 0 0 537.66 0 812.326 -1918.32 0 0 0 0 0 0 0 
0 0 1251.79 0 0 0 0 1678.29 0 -295.648 0 0 0 0 0 0 0 0 0 0 0 0 0 0 2093.95 0 737.251 0 0 0 0 0 0 0 0 0 0 0 0 0 0 -88.58 -1961.04 0 1896.95 0 0 0 0 0.06 0 0 0 0 0 -10.1474 0 0 0 0 0 0 
0 0 0 0 0 0 0 0 0 0 0 0 -64.4704 -822.092 0 0 0 0 0 0 0 0 0 0 0 2424.01 0 0 2258.29 0 0 0 0 0 1594.67 0 0 0 0 0 1823.25 0 0 0 0 0 -348.75 0 0 0 0 0 0 0 0 0 0 0 0 -940.046 0 0 
1886.43 0 0 0 0 0 0 0 0 2226.86 0 0 0 0 0 0 0 0 0 0 0 0 0 0 0 0 0 0 0 0 0 0 0 0 0 -1326.56 0 0 0 0 0 406.888 0 0 0 0 0 0 -1109.27 0 0 0 0 0 0 0 0 0 0 0 0 0 
0 0 0 0 0 0 0 0 0 0 0 0 0 0 0 0 0 0 0 0 0 0 0 0 0 0 0 0 0 0 0 -241.935 0 0 0 0 0 0 1041.22 0 0 0 0 0 0 582.98 0 0 0 0 0 0 0.02 0 0 0 0 0 0 0 0 0 
0 0 0 0 0 0 0 0 0 0 0 0 149.007 0 0 1253.17 0 0 0 0 0 0 1860.33 0 0 0 0 0 0 0 0 0 0 0 0 0 0 0 0 0 0 979.263 0 0 0 2038.71 0 0 2382.05 0 0 0 0 0.05 901.746 0 0 0 0 -1547.21 0 0 
0 -461.364 0 0 0 0 2311.4 -1383.33 0 0 0 0 1074.48 0 0 0 1099.05 0 0 0 2027.57 0 0 0 0 0 0 0 0 0 1091.27 0 0 0 0 0 0 0 2286.83 0 0 0 0 0 0 0 0 0 190.817 0 0 0 0 -1589.94 0.02 -2355.95 2354.73 0 0 0 0 0 
0 0 0 0 0 0 0 0 0 0 0 0 0 0 0 0 0 0 0 0 0 0 0 345.851 0 2132.1 0 0 0 0 0 0 0 0 -1029.62 0 0 0 0 0 0 0 0 0 0 1947 0 0 0 1175.95 0 0 0 0 1677.07 0.09 0 978.805 0 0 0 0 
0 0 0 1194.42 0 0 0 0 0 0 0 0 0 -1161.31 0 0 0 0 0 0 0 0 0 0 0 0 0 0 0 0 2288.81 0 0 0 0 0 0 0 0 0 0 0 0 0 0 0 0 0 0 0 0 0 0 0 -578.249 0 0 0 378.658 0 0 0 
0 0 2190.24 0 0 0 0 0 1134.45 774.331 2328.18 0 0 0 0 0 605.106 0 0 0 0 787.454 0 0 0 0 0 1579.1 0 0 0 0 0 0 0 0 0 0 0 0 0 0 0 0 0 0 0 0 0 0 0 0 0 0 0 -2004.84 0 0.03 0 0 0 0 
0 0 0 0 0 0 0 0 0 0 0 0 0 0 0 -1725.44 0 0 0 0 400.632 0 0 0 0 0 0 0 0 0 0 0 0 0 0 0 0 0 0 0 0 0 0 1564.61 0 0 0 0 0 0 0 0 0 0 0 0 1710.79 0 0 1880.93 2446.75 0 
0 0 0 0 0 0 0 0 0 0 0 0 0 0 0 0 2316.43 0 0 0 0 0 0 0 0 0 1343.35 0 143.361 0 0 0 0 0 0 0 0 0 0 0 0 1310.54 0 0 0 1168.94 0 0 0 0 -1911.15 0 0 2124.01 0 0 0 0 -765.328 0.02 0 0 
0 0 0 0 0 0 0 0 0 2232.2 0 0 0 -2145.68 0 0 0 0 0 0 0 0 -1775.49 0 0 0 0 0 0 0 0 0 0 0 2436.83 0 0 0 0 0 0 0 0 643.254 0 0 0 0 0 0 0 0 0 0 0 0 0 0 -344.783 0 0.04 0 
0 0 0 0 0 0 0 0 0 0 0 0 0 0 0 0 0 0 0 0 0 0 1475.95 0 0 0 0 1412.32 0 0 0 0 0 0 0 0 0 0 0 0 0 0 0 0 0 0 0 0 0 0 0 0 0 0 0 0 0 0 0 0 0 0.01 
