*Vertices 37
*Matrix 
0.05 0 0 0 0 0 0 0 2182.91 0 0 0 0 0 -825.907 0 0 0 401.7 0 0 0 0 0 0 0 0 0 0 0 0 0 0 0 721.076 0 0 
0 0.05 0 0 0 0 0 0 0 0 0 0 0 0 0 0 0 0 0 2412.72 0 0 0 0 0 393.765 -336.238 0 0 0 0 0 0 0 0 0 0 
0 0 0.09 0 0 0 0 -24.0333 1556.67 -1941.82 0 0 0 0 2233.73 0 0 0 1441.92 0 0 0 1439.63 0 0 0 0 0 0 0 0 0 0 0 0 0 0 
0 0 0 0.07 0 0 0 0 0 -656.224 0 0 0 0 0 0 0 0 -1501.59 0 0 0 2312.01 0 0 0 0 0 0 0 0 0 0 0 0 671.484 0 
0 0 0 0 0.07 0 0 0 0 0 0 0 -471.129 0 0 0 0 0 0 0 0 0 0 1748.33 0 1837.29 0 -1852.4 0 0 0 0 0 0 0 0 0 
0 0 0 0 0 0.02 0 0 0 0 918.378 0 2456.51 1251.34 0 0 0 0 0 0 0 0 0 0 0 0 0 0 0 -2368.31 0 0 -790.506 -175.405 0 0 0 
0 0 0 0 0 0 0.08 0 0 0 833.842 0 0 0 0 0 0 0 0 0 0 0 102.161 0 0 0 0 0 0 0 0 0 0 0 41.1237 0 0 
0 0 -1798.38 0 0 0 0 0.07 0 0 0 0 0 0 0 0 0 0 0 0 0 0 0 0 0 0 0 0 0 0 0 1883.37 0 0 0 742.897 0 
-1524.78 0 1930.07 0 0 0 0 0 0 0 0 0 0 0 0 0 0 2465.21 1593.6 0 0 0 0 0 0 0 0 0 0 0 0 0 0 0 0 0 0 
0 0 594.424 -1060.14 0 0 0 0 0 0.08 0 0 0 0 0 0 0 0 0 0 0 0 0 0 922.193 2360.38 0 0 1101.95 0 0 0 -1157.64 0 0 0 0 
0 0 0 0 0 -103.687 2210.53 0 0 0 0.09 0 0 0 0 0 0 0 0 0 0 0 0 0 1663.34 0 0 0 0 0 507.447 0 0 0 0 0 0 
0 0 0 0 0 0 0 0 0 0 0 0.01 -1851.48 531.251 0 0 0 0 0 0 0 0 0 1521.27 0 -5.11185 0 0 1186.48 0 0 0 0 0 0 0 0 
0 0 0 0 765.786 -932.264 0 0 0 0 0 692.694 0.03 0 0 0 0 1213.03 1294.37 0 0 -980.331 0 0 0 0 0 0 1561.25 0 2376.4 0 0 0 0 0 0 
0 0 0 0 0 919.446 0 0 0 0 0 1205.25 0 0 0 0 0 0 0 0 0 0 0 0 0 0 0 0 0 0 0 0 0 0 1042.28 0 0 
-12.8941 0 272.301 0 0 0 0 0 0 0 0 0 0 0 0.09 0 0 0 0 0 0 1370.2 0 0 0 0 0 0 0 0 0 0 0 0 0 0 0 
0 0 0 0 0 0 0 0 0 0 0 0 0 0 0 0.03 0 0 0 0 0 0 0 0 0 0 0 0 0 0 0 0 0 0 0 86.2911 0 
0 0 0 0 0 0 0 0 0 0 0 0 0 0 0 0 0.02 -584.201 -1645.18 0 0 0 0 0 1918.01 0 0 1551.64 0 0 0 0 0 0 0 0 0 
0 0 0 0 0 0 0 0 2050.31 0 0 0 1727.58 0 0 0 273.217 0.06 0 0 0 0 0 0 0 0 0 1919.08 0 -491.119 0 0 0 0 0 0 0 
1828.9 0 2236.93 956.984 0 0 0 0 -927.381 0 0 0 644.169 0 0 0 197.226 0 0.09 0 0 0 1183.13 0 0 0 0 0 0 0 0 0 0 0 1404.69 794.931 0 
0 1465.12 0 0 0 0 0 0 0 0 0 0 0 0 0 0 0 0 0 0.03 442.9 0 0 0 0 0 0 0 0 0 1291.01 0 1985.61 0 0 0 0 
0 0 0 0 0 0 0 0 0 0 0 0 0 0 0 0 0 0 0 -1695.84 0.08 0 2302.09 0 0 0 0 0 0 0 0 0 0 0 0 0 0 
0 0 0 0 0 0 0 0 0 0 0 0 381.71 0 1229.82 0 0 0 0 0 0 0.07 -2017.35 1956.77 0 0 0 0 -625.095 0 0 0 0 0 0 0 0 
0 0 244.682 2002.4 0 0 1014.97 0 0 0 0 0 0 0 0 0 0 0 1839.43 0 2097.31 732.368 0.02 0 0 0 0 0 0 0 0 0 950.728 0 0 2190.85 0 
0 0 0 0 -184.103 0 0 0 0 0 0 -2277.83 0 0 0 0 0 0 0 0 0 2204.89 0 0.09 0 0 0 0 0 0 0 0 0 0 1964.4 0 0 
0 0 0 0 0 0 0 0 0 -394.375 2084.64 0 0 0 0 0 1368.22 0 0 0 0 0 0 0 0.01 1881.08 -184.866 0 0 0 0 0 0 1470 0 -1264.31 -2388.91 
0 -703.375 0 0 2449.95 0 0 0 0 2027.42 0 -1631.6 0 0 0 0 0 0 0 0 0 0 0 0 -1618.17 0.09 0 0 0 0 0 0 0 0 0 0 0 
0 2299.34 0 0 0 0 0 0 0 0 0 0 0 0 0 0 0 0 0 0 0 0 0 0 -622.196 0 0.02 0 0 794.32 0 0 0 0 0 0 0 
0 0 0 0 134.663 0 0 0 0 0 0 0 0 0 0 0 1130.79 1031.3 0 0 0 0 0 0 0 0 0 0.06 0 0 0 0 0 0 0 0 0 
0 0 0 0 0 0 0 0 0 -1170.46 0 -1028.55 1670.96 0 0 0 0 0 0 0 0 508.057 0 0 0 0 0 0 0.06 0 0 0 0 0 845.897 0 0 
0 0 0 0 0 2196.95 0 0 0 0 0 0 0 0 0 0 0 -1427.43 0 0 0 0 0 0 0 0 -191.885 0 0 0.02 0 0 0 0 0 0 0 
0 0 0 0 0 0 0 0 0 0 -2347.41 0 468.535 0 0 0 0 0 0 1974.32 0 0 0 0 0 0 0 0 0 0 0.01 0 1374.78 0 0 0 0 
0 0 0 0 0 0 0 2206.72 0 0 0 0 0 0 0 0 0 0 0 0 0 0 0 0 0 0 0 0 0 0 0 0.07 0 0 0 0 0 
0 0 0 0 0 2115.77 0 0 0 1043.81 0 0 0 0 0 0 0 0 0 772.958 0 0 450.072 0 0 0 0 0 0 0 -2011.25 0 0.03 0 0 -851.085 0 
0 0 0 0 0 2246.24 0 0 0 0 0 0 0 0 0 0 0 0 0 0 0 0 0 0 2400.36 0 0 0 0 0 0 0 0 0.07 0 0 0 
1228.14 0 0 0 0 0 -583.438 0 0 0 0 0 0 596.713 0 0 0 0 2409.97 0 0 0 0 1962.42 0 0 0 0 -333.338 0 0 0 0 0 0.08 0 0 
0 0 0 2236.63 0 0 0 2147.21 0 0 0 0 0 0 0 148.244 0 0 761.361 0 0 0 -1507.69 0 -2171.16 0 0 0 0 0 0 0 2398.98 0 0 0.03 0 
0 0 0 0 0 0 0 0 0 0 0 0 0 0 0 0 0 0 0 0 0 0 0 0 1598.03 0 0 0 0 0 0 0 0 0 0 0 0.03 
