*Vertices 41
*Matrix 
0.05 -1352.05 0 0 2253.56 0 0 0 0 1624.58 1803.87 0 0 0 0 0 -588.931 0 0 0 0 0 0 0 1484.95 -916.395 0 1401.64 0 0 0 0 303.278 -479.217 0 0 -1204.49 615.787 0 0 0 
2162.77 0.03 0 0 0 0 0 1747.11 0 0 0 2274.32 -702.765 -2039.17 -1965.01 -1289.64 2481.84 2420.04 0 0 0 0 0 0 0 0 0 2039.48 0 0 0 -760.903 1844.46 0 0 0 -753.121 0 0 -1694.77 0 
0 0 0.09 0 0 0 0 0 0 465.941 0 0 0 0 0 0 0 0 2291.1 0 2367.55 0 -808.054 0 0 0 0 0 0 0 280.389 0 0 0 0 -694.067 0 0 0 0 2231.44 
0 0 0 0.02 0 0 0 0 1111.41 0 0 0 0 0 1496.7 28.3059 0 1216.7 2379.3 0 -2291.1 0 -2226.86 0 0 0 0 0 -559.328 0 0 0 0 0 0 0 0 0 684.301 0 1471.68 
-241.63 0 0 0 0.07 0 0 0 -637.15 0 0 0 833.232 0 0 0 0 0 0 0 -313.044 249.718 0 0 0 0 1656.62 0 0 -1048.39 0 2241.97 0 0 0 0 0 0 0 0 0 
0 0 0 0 0 0.04 0 2313.23 0 0 0 0 0 0 0 0 2410.89 -1588.11 0 0 0 -929.212 0 0 0 0 450.224 0 1767.1 581.759 0 0 0 0 0 0 0 0 0 0 0 
0 0 0 0 0 0 0.04 -179.678 918.836 0 0 1039.69 366.298 0 0 31.0526 0 2229.45 0 0 0 1817.15 0 -954.848 768.075 0 0 0 0 2037.19 0 0 -103.229 0 0 0 0 0 2221.37 1256.83 2359.61 
0 -1587.04 0 0 0 1961.2 1980.57 0.04 282.983 0 0 0 0 -2043.14 0 0 0 0 0 0 0 0 1574.37 0 0 -1910.38 2358.85 0 0 -1868.72 0 2226.1 1505.86 0 0 381.863 2103.41 1542.02 0 0 0 
0 0 0 528.199 2144.61 0 -2138.97 -667.669 0.07 0 0 0 0 0 2076.71 0 0 0 0 0 0 2359.77 -1029.47 0 2113.48 -1859.42 0 0 -1105.15 -574.282 -1614.05 0 0 0 0 0 0 0 0 1162.37 0 
380.184 0 -2371.67 0 0 0 0 0 0 0.05 0 0 0 0 0 0 0 0 0 2369.84 1806.16 0 -88.58 0 0 0 0 -15.0304 -606.021 -1263.54 0 0 0 0 2491 0 -773.11 0 0 89.1903 0 
-60.5029 0 0 0 0 0 0 0 0 0 0.03 0 0 0 0 0 0 2145.99 -373.928 -1584.29 721.229 0 -2307.73 0 -1891.77 0 0 324.03 0 0 0 1985.31 1402.86 0 885.571 0 0 0 0 0 0 
0 -687.353 0 0 0 0 1166.04 0 0 0 0 0.04 0 -1003.22 0 0 1345.18 0 0 0 0 0 0 2451.78 0 0 0 1346.55 -2420.96 1612.37 0 337.764 0 0 0 0 0 455.565 644.475 0 -1057.54 
0 786.081 0 0 2063.43 0 2254.02 0 0 0 0 0 0.06 0 713.294 -611.362 0 0 895.947 0 0 1386.23 0 0 0 0 -401.7 -2402.95 0 -1667.61 0 0 0 1063.04 0 0 0 0 -1390.65 1212.73 -99.8718 
0 1997.82 0 0 0 0 0 -1769.39 0 0 0 1568.12 0 0.05 0 0 0 0 -259.941 0 0 0 0 0 0 0 0 0 0 0 0 2019.03 0 1175.5 0 0 0 0 0 0 -1418.58 
0 -1547.82 0 -1335.11 0 0 0 0 2358.39 0 0 0 -849.559 0 0.02 0 -56.3829 0 0 -695.441 0 0 -1467.25 0 1024.74 -596.561 0 2471.92 0 0 0 0 0 0 0 0 0 377.743 0 2318.87 274.133 
0 -883.892 0 646.611 0 0 2269.28 0 0 0 0 0 2092.12 0 0 0 0 790.506 -1283.38 920.667 -688.726 0 0 0 0 313.349 0 0 0 0 0 2326.81 0 0 -1422.85 -270.928 0 54.2467 0 0 0 
1277.12 299.615 0 0 0 1041.52 0 0 0 0 0 2457.88 0 0 -833.079 0 0.04 0 0 0 0 545.137 206.381 0 0 -2256.46 0 0 0 0 764.87 0 0 2006.21 0 0 0 0 0 -444.121 0 
0 -2496.64 0 2402.95 0 -261.773 -319.3 0 0 0 -1789.22 0 0 0 0 537.66 0 0.08 0 -129.933 -1647.01 0 0 -1548.59 0 0 -1445.28 0 2347.71 0 0 0 1280.94 0 2444.46 1699.8 0 0 0 0 171.285 
0 0 1878.95 -2266.53 0 0 0 0 0 0 1229.36 0 -347.835 2221.52 0 -1610.69 0 0 0.05 -647.221 0 0 0 119.709 337.001 0 0 0 0 0 0 0 0 0 0 0 0 -1028.24 2305.9 0 0 
0 0 0 0 0 0 0 0 0 1749.4 2419.28 0 0 0 566.958 -1398.59 0 1273 -183.035 0.09 0 0 0 1486.79 0 0 0 0 0 0 1043.81 0 0 0 1551.33 1543.86 0 0 0 1983.47 0 
0 0 -205.771 2132.56 -1288.26 0 0 0 0 1733.38 1267.36 0 0 0 0 761.208 0 -501.343 0 0 0.02 0 0 0 0 0 0 0 0 0 0 1889.63 0 -1746.8 0 0 0 0 0 0 0 
0 0 0 0 -1032.21 582.827 1661.5 0 -1732.15 0 0 0 1701.48 0 0 0 703.528 0 0 0 0 0.02 0 0 0 444.578 0 0 0 0 0 0 0 0 0 0 0 1853.92 0 0 0 
0 0 2386.47 -2443.08 0 0 0 2095.32 1211.81 2330.93 2440.95 0 0 0 1565.68 0 1277.89 0 0 0 0 0 0 0 0 0 0 352.718 0 0 0 0 0 0 0 82.4763 672.552 0 0 0 0 
0 0 0 0 0 0 2402.65 0 0 0 0 1177.79 0 0 0 0 0 -872.295 -816.752 1835 0 0 0 0.02 2025.59 0 -678.198 0 -216.605 -457.701 0 0 0 0 0 0 0 0 0 0 0 
-850.475 0 0 0 0 0 -1558.35 0 2004.07 0 1195.03 0 0 0 51.6526 0 0 0 1616.03 0 0 0 0 -521.79 0.08 0 0 2113.79 0 0 0 0 586.184 0 -118.488 2150.41 0 0 0 0 -599.46 
714.515 0 0 0 0 0 0 -475.555 1725.59 0 0 0 0 0 -2309.72 1136.43 388.882 0 0 0 0 -1039.08 0 0 0 0.03 0 0 1415.83 168.996 0 1696.3 606.937 0 0 0 0 -1175.04 -553.224 0 557.497 
0 0 0 0 -111.316 884.96 0 1343.81 0 0 0 0 -578.097 0 0 0 0 1644.26 0 0 0 0 0 2476.35 0 0 0.01 0 0 0 0 0 0 0 0 0 0 0 0 0 734.046 
1115.83 -267.418 0 0 0 0 0 0 0 2367.4 -1435.21 -575.198 -2295.07 0 1187.7 0 0 0 0 0 0 0 960.646 0 2244.41 0 0 0.09 0 0 0 0 -2291.86 0 0 0 0 0 0 1493.65 0 
0 0 0 833.079 0 1030.84 0 0 985.519 1369.44 0 695.288 0 0 0 0 0 -1448.94 0 0 0 0 0 2017.5 0 1279.56 0 0 0.05 0 2143.39 0 0 0 374.386 0 317.011 -244.53 0 -975.448 0 
0 0 0 0 2449.49 -924.024 -242.698 -1174.43 2253.56 1420.26 0 2012.47 575.808 0 0 0 0 0 0 0 0 0 0 -381.405 0 1870.1 0 0 0 0 0 146.718 0 0 0 -58.0615 0 0 -2134.69 0 0 
0 0 -880.078 0 0 0 0 0 2411.34 0 0 0 0 0 0 0 302.057 0 0 -2051.23 0 0 0 0 0 0 0 0 1941.66 0 0.05 0 981.399 0 1782.05 0 0 0 -1556.98 -160.756 0 
0 -221.335 0 0 -1363.8 0 0 419.706 0 0 -1440.7 2148.88 0 -2364.19 0 1229.51 0 0 0 0 1950.67 0 0 0 0 516.602 0 0 0 2398.37 0 0.02 2038.71 0 783.639 0 0 0 0 0 0 
-2098.53 -136.799 0 0 0 0 -1824.02 1871.47 0 0 -231.712 0 0 0 0 0 0 105.365 0 0 0 0 0 0 2230.06 194.174 0 -77.5933 0 0 -266.808 1744.97 0.04 0 1265.68 -1273 0 2309.72 0 2162.92 0 
-281.61 0 0 0 0 0 0 0 0 0 0 0 653.172 -63.097 0 0 738.166 0 0 0 1276.82 0 0 0 0 0 0 0 0 0 0 0 0 0.07 0 0 0 0 0 -95.7518 0 
0 0 0 0 0 0 0 0 0 -56.3829 -1076.62 0 0 0 0 2087.54 0 -59.1296 0 1576.82 0 0 0 0 2290.49 0 0 0 -1054.19 0 1645.02 -230.796 406.278 0 0.04 0 0 0 0 -985.061 2348.32 
0 0 1989.12 0 0 0 0 833.842 0 0 0 0 0 0 0 2170.25 0 2258.9 0 1039.69 0 0 1715.52 0 2247.15 0 0 0 0 -946.913 0 0 703.681 0 0 0.06 0 0 0 0 0 
409.635 1014.21 0 0 0 0 0 2241.2 0 1439.63 0 0 0 0 0 0 0 0 0 0 0 0 1261.56 0 0 0 0 0 1990.49 0 0 0 0 0 0 0 0.05 0 0 -1955.55 -2352.14 
2192.07 0 0 0 0 0 0 1199.15 0 0 0 2206.26 0 0 1268.27 -837.046 0 0 -379.269 0 0 999.405 0 0 0 1029.31 0 0 -128.712 0 0 0 2046.65 0 0 0 0 0.08 0 0 0 
0 0 0 2260.73 0 0 -1649.14 0 0 0 0 1281.4 1241.57 0 0 0 0 0 -1319.54 0 0 0 0 0 0 901.44 0 0 0 772.042 -1975.84 0 0 0 0 0 0 0 0.07 0 0 
0 2384.95 0 0 0 0 580.691 0 -222.556 469.909 0 0 2176.5 0 175.1 0 -957.595 0 0 675.604 0 0 0 0 0 0 0 -375.454 -554.903 0 218.131 0 -778.603 756.02 -2171.62 0 1932.36 0 0 0.08 0 
0 0 -958.357 -785.775 0 0 -1881.85 0 0 0 0 526.063 -536.744 1104.08 2110.58 0 0 -1998.89 0 0 0 0 0 0 111.469 1859.72 2483.37 0 0 0 0 0 0 0 823.313 0 2261.35 0 0 0 0.05 
