*Vertices 50
*Matrix 
0.03 0 1809.37 1182.97 0 0 0 0 0 0 0 0 0 0 0 0 0 0 0 0 0 0 0 0 0 0 0 0 0 2148.58 0 0 0 0 0 0 0 0 -972.701 0 0 0 0 -855.205 0 0 1668.37 1575.14 2151.02 0 
0 0.02 0 0 0 0 0 2251.27 0 -580.996 2256.31 0 1745.73 -1892.53 -1329.92 420.621 0 0 0 0 0 0 0 0 0 0 0 0 0 0 0 0 0 0 0 0 0 0 0 0 0 0 0 0 0 0 0 0 0 0 
-786.691 0 0.06 -425.962 0 2312.92 0 0 0 0 0 0 -577.639 0 0 914.869 526.521 0 0 0 0 0 0 0 0 0 0 0 -572.909 -2008.19 2134.24 0 0 723.67 0 0 0 0 0 0 0 0 0 0 0 0 -1862.93 0 0 0 
-401.395 0 -310.45 0.06 0 0 0 0 0 -433.592 0 0 665.075 0 167.318 0 0 0 0 0 0 0 0 0 0 0 1885.2 -2207.02 0 0 0 674.688 1103.63 0 0 0 0 0 0 0 0 0 0 0 0 0 -424.741 0 0 0 
0 0 0 0 0.03 0 0 0 0 0 0 0 0 0 257.347 998.642 0 0 0 0 0 0 0 0 0 0 0 0 -758.461 0 0 2467.35 0 0 0 0 0 0 0 0 0 0 0 0 0 2187.49 0 0 0 0 
0 0 1986.68 0 0 0.05 247.734 0 0 0 0 -557.955 0 0 0 0 0 -205.161 279.168 0 1736.73 0 -512.329 0 0 0 0 1894.51 1589.94 -217.368 0 0 0 1972.49 0 0 0 0 242.393 0 1797.16 0 0 0 0 0 0 0 0 0 
0 0 0 0 0 1767.71 0 0 0 0 0 -136.494 0 2389.83 -736.641 -1479 -654.393 0 1605.96 0 0 0 0 0 585.727 0 728.248 1515.02 0 0 0 0 -1646.09 0 0 0 0 0 0 0 0 2163.23 0 0 0 0 1851.94 0 0 0 
0 863.14 0 0 0 0 0 0 0 69.2007 145.955 0 0 0 0 0 0 0 0 0 0 0 0 0 0 0 2236.93 0 0 -226.981 -785.928 0 0 0 0 0 0 0 0 0 0 0 0 0 0 0 0 0 0 0 
0 0 0 0 0 0 0 0 0.09 0 0 0 0 0 -46.3118 0 0 0 0 0 0 0 0 0 2257.68 0 0 -2117.15 0 0 0 0 0 0 970.87 0 -231.864 -194.632 0 0 0 1409.12 0 0 0 0 0 0 0 0 
0 1249.96 0 -1992.48 0 0 0 1200.52 0 0.05 0 2464.6 0 692.846 0 0 683.538 -334.407 0 -241.02 1000.93 -1279.11 826.06 0 617.313 0 0 939.894 0 0 0 0 0 1252.25 1510.74 0 0 0 0 0 0 0 0 0 0 0 0 0 1605.04 2315.06 
0 1491.67 0 0 0 0 0 1288.57 0 0 0.04 0 0 0 0 0 0 1709.57 0 0 1831.19 0 0 0 2366.48 1531.95 -798.898 0 0 -252.007 0 0 0 0 0 0 212.333 -2253.87 0 0 125.355 2237.69 0 0 0 0 0 0 0 714.82 
0 0 0 0 0 785.775 -634.556 0 0 1657.84 0 0.03 0 0 0 2385.56 0 1904.58 0 0 686.895 0 0 0 0 0 0 0 0 0 -26.9326 0 0 0 1212.42 0 0 1498.23 0 1898.63 0 0 0 1043.35 0 0 0 0 0 0 
0 2081.13 2324.52 -1719.34 0 0 0 0 0 0 0 0 0.07 0 399.564 0 -166.097 0 0 0 0 0 -760.445 471.587 0 -1520.05 -994.217 0 0 0 0 1902.14 0 0 0 0 0 -2492.37 0 928.144 0 0 0 0 0 0 0 0 0 156.331 
0 2340.69 0 0 0 0 1060.9 0 0 862.224 0 0 0 0.02 0 -67.5222 2223.96 -1906.11 -1552.86 0 1182.06 0 0 0 -53.7889 0 0 0 0 0 0 0 0 0 0 0 0 0 0 0 0 0 0 0 0 0 0 0 1423 -118.336 
0 2003.31 0 1551.79 832.163 0 124.897 0 1362.58 0 0 0 -2282.25 0 0.05 -715.43 0 0 0 0 0 1209.52 549.715 0 2400.66 0 0 0 0 2207.48 -1939.83 0 0 0 -2119.28 0 0 0 0 0 0 0 827.281 526.368 0 0 0 0 0 0 
0 -1801.43 -1032.98 0 -2402.8 0 -256.737 0 0 0 0 1042.13 0 497.375 1173.21 0.06 0 2400.36 0 0 531.709 0 -354.549 0 0 0 0 0 0 0 2388.15 0 0 0 0 0 0 0 0 0 0 0 0 -104.755 0 0 0 0 0 0 
0 0 1828.29 0 0 0 1739.48 0 0 -896.71 0 0 143.056 161.977 0 0 0.04 -509.43 0 -817.667 0 0 1846.75 0 -105.06 0 -321.284 0 0 489.746 0 0 0 0 0 0 0 0 0 0 0 0 0 0 0 0 0 0 0 0 
0 0 0 0 0 -2038.26 0 0 0 -2413.02 2386.47 -2431.03 0 2267.3 0 29.6793 913.8 0 2499.08 2432.55 0 716.193 -826.975 0 0 0 0 2246.24 0 1905.19 0 1137.2 0 0 0 0 0 0 0 0 0 0 0 0 0 0 0 0 0 0 
0 0 0 0 0 892.132 2403.87 0 0 0 0 0 0 -873.058 0 0 0 548.036 0.07 0 0 0 0 0 1226.46 0 0 1771.68 0 0 0 -1173.51 0 0 0 0 0 0 0 0 0 0 0 0 0 0 0 0 0 0 
0 0 0 0 0 0 0 0 0 1357.84 0 0 0 0 0 0 1827.98 1737.19 0 0.05 -259.484 666.295 0 1175.5 0 0 1563.69 -1335.41 0 0 0 0 -1860.33 0 0 0 0 0 0 0 0 0 0 0 931.501 0 0 0 0 0 
0 0 0 0 0 2385.71 0 0 0 -342.647 -850.475 1700.87 0 -21.4393 0 -578.707 0 0 0 -1234.09 0.04 0 0 0 0 2279.2 0 0 0 0 -875.5 0 0 0 0 0 0 0 0 0 0 0 0 0 0 0 0 0 0 0 
0 0 0 0 0 0 0 0 0 1726.2 0 0 0 0 1386.68 0 0 280.847 0 1990.8 0 0.09 0 1859.11 0 0 0 0 0 0 0 0 -1574.98 0 0 0 0 0 0 0 0 -1002.46 0 0 0 0 0 1252.4 0 0 
0 0 0 0 0 1939.22 0 0 0 1240.04 0 0 -1647.77 0 -2075.33 240.41 1904.58 2392.88 0 0 0 0 0.03 0 0 0 1247.83 348.14 0 -573.977 0 593.356 0 0 0 0 0 0 -2044.05 0 0 0 0 0 0 0 0 0 0 0 
0 0 0 0 0 0 0 0 0 0 0 0 -1148.79 0 0 0 0 0 0 1839.73 0 -1003.37 0 0.01 0 0 0 0 0 0 1619.24 0 0 926.16 0 0 0 473.418 0 0 0 0 0 0 0 1744.21 0 0 0 0 
0 0 0 0 0 0 1459.17 0 -199.362 547.273 1796.24 0 0 2132.71 2234.18 0 -232.627 0 2494.05 0 0 0 0 0 0.03 0 -129.17 0 0 -310.602 0 0 0 0 0 0 0 0 0 0 0 0 0 0 0 0 0 424.894 0 0 
0 0 0 0 0 0 0 0 0 0 2228.84 0 -744.118 0 0 0 0 0 0 0 2255.39 0 0 0 0 0.07 0 -808.817 0 0 0 0 0 0 0 0 1904.13 -1635.56 2461.39 0 0 0 757.088 0 0 0 0 0 0 0 
0 0 0 1532.41 0 0 1082.26 -1850.72 0 0 1540.8 0 -102.008 0 0 0 1300.32 0 0 1521.27 0 0 -1360.9 0 872.143 0 0.07 0 0 -1916.94 0 0 0 0 0 0 0 0 0 0 0 0 0 0 0 0 0 0 0 0 
0 0 0 1232.41 0 -1293.15 -170.064 0 1807.69 -724.891 0 0 0 0 0 0 0 1700.72 801.187 1325.19 0 0 -286.798 0 0 391.476 0 0.08 1214.26 -1139.79 1490.45 0 0 0 0 2127.98 0 0 0 0 0 0 0 0 0 0 468.078 -2103.56 0 0 
0 0 -252.464 0 39.14 1328.55 0 0 0 0 0 0 0 0 0 0 0 0 0 0 0 0 0 0 0 0 0 -2135.91 0.06 0 0 0 0 0 0 0 0 0 1410.79 0 0 0 0 0 0 0 0 0 -142.293 0 
2062.82 0 1026.57 0 0 738.319 0 -1221.43 0 0 2221.82 0 0 0 1604.13 0 211.57 1241.57 0 0 0 0 2110.58 0 354.244 0 1397.06 -2405.55 0 0.08 2324.52 0 0 0 0 -1056.02 0 0 0 0 0 0 0 0 0 0 0 0 0 0 
0 0 1263.08 0 0 0 0 698.95 0 0 0 -57.2985 0 0 -58.0615 -1048.54 0 0 0 0 -652.104 0 0 -512.177 0 0 0 1295.74 0 2195.27 0.05 0 1107.44 0 -736.641 0 0 0 0 0 0 420.469 0 0 0 0 -671.178 0 0 0 
0 0 0 1552.1 2222.59 0 0 0 0 0 0 0 2457.43 0 0 0 0 936.995 -745.643 0 0 0 201.498 0 0 0 0 0 0 0 0 0.04 0 0 0 0 0 0 1509.37 0 0 -2202.14 -517.365 0 0 0 0 489.593 0 0 
0 0 0 1999.5 0 0 2486.42 0 0 0 0 0 0 0 0 0 0 0 0 2151.02 0 -129.322 0 0 0 0 0 0 0 0 150.533 0 0.07 -210.501 0 0 0 0 0 -822.855 0 0 0 0 0 0 0 0 0 0 
0 0 -102.008 0 0 1161.92 0 0 0 1141.32 0 0 0 0 0 0 0 0 0 0 0 0 0 1402.4 0 0 0 0 0 0 0 0 755.715 0.05 0 0 0 0 0 0 0 0 0 0 0 0 0 0 0 0 
0 0 0 0 0 0 0 0 85.0703 1216.54 0 1884.29 0 0 -2211.75 0 0 0 0 0 0 0 0 0 0 0 0 0 0 0 -1113.09 0 0 0 0.02 0 0 0 0 0 0 0 0 0 0 0 0 0 1655.4 0 
0 0 0 0 0 0 0 0 0 0 0 0 0 0 0 0 0 0 0 0 0 0 0 0 0 0 0 -1344.26 0 1358.76 0 0 0 0 0 0.04 0 1928.85 0 0 -2199.55 0 1863.54 0 1338.77 0 0 0 0 0 
0 0 0 0 0 0 0 0 1229.82 0 408.567 0 0 0 0 0 0 0 0 0 0 0 0 0 0 365.383 0 0 0 0 0 0 0 0 0 0 0.04 0 -251.091 0 0 2097.61 0 0 0 0 0 0 0 0 
0 0 0 0 0 0 0 0 -211.112 0 -1033.28 2051.23 -1803.87 0 0 0 0 0 0 0 0 0 0 2243.64 0 152.516 0 0 0 0 0 0 0 0 0 810.19 0 0.01 0 1024.12 0 0 0 0 0 0 0 0 0 0 
528.352 0 0 0 0 -1744.97 0 0 0 0 0 0 0 0 0 0 0 0 0 0 0 0 -2122.64 0 0 1199.3 0 0 2189.78 0 0 1089.89 0 0 0 0 -282.678 0 0.06 0 0 0 0 0 0 0 0 -332.575 0 0 
0 0 0 0 0 0 0 0 0 0 0 -1001.24 2499.24 0 0 0 0 0 0 0 0 0 0 0 0 0 0 0 0 0 0 0 124.744 0 0 0 0 1520.2 0 0.04 331.05 0 0 0 -282.22 0 -1568.12 0 0 0 
0 0 0 0 0 1207.54 0 0 0 0 2430.72 0 0 0 0 0 0 0 0 0 0 0 0 0 0 0 0 0 0 0 0 0 0 0 0 618.839 0 0 0 -2252.19 0.07 0 0 0 0 622.044 0 0 -1582.31 0 
0 0 0 0 0 0 -159.841 0 1203.27 0 1813.33 0 0 0 0 0 0 0 0 0 0 2084.8 0 0 0 0 0 0 0 0 -1864.15 93.0052 0 0 0 0 2083.27 0 0 0 0 0.01 0 0 0 -1346.86 0 0 0 0 
0 0 0 0 0 0 0 0 0 0 0 0 0 0 2343.13 0 0 0 0 0 0 0 0 0 0 653.935 0 0 0 0 0 643.712 0 0 0 -1361.05 0 0 0 0 0 0 0.07 0 0 0 0 -1201.44 0 0 
1918.32 0 0 0 0 0 0 0 0 0 0 2096.55 0 0 -1832.41 2404.78 0 0 0 0 0 0 0 0 0 0 0 0 0 0 0 0 0 0 0 0 0 0 0 0 0 0 0 0.08 0 0 0 0 0 0 
0 0 0 0 0 0 0 0 0 0 0 0 0 0 0 0 0 0 0 552.156 0 0 0 0 0 0 0 0 0 0 0 0 0 0 0 530.793 0 0 0 29.9844 0 0 0 0 0.01 0 0 0 0 0 
0 0 0 0 1043.35 0 0 0 0 0 0 0 0 0 0 0 0 0 0 0 0 0 0 1958.45 0 0 0 0 0 0 0 0 0 0 0 0 0 0 0 0 -1414.76 1788.77 0 0 0 0.07 0 0 0 0 
1273.77 0 -897.778 -1336.63 0 0 -691.626 0 0 0 0 0 0 0 0 0 0 0 0 0 0 0 0 0 0 0 0 -1383.63 0 0 1494.57 0 0 0 0 0 0 0 0 2374.72 0 0 0 0 0 0 0.08 0 0 0 
-1230.12 0 0 0 0 0 0 0 0 0 0 0 0 0 0 0 0 0 0 0 0 334.254 0 0 -1786.17 0 0 -497.375 0 0 0 1281.24 0 0 0 0 0 0 515.076 0 0 0 1547.98 0 0 0 0 0.09 0 -213.401 
1184.96 0 0 0 0 0 0 0 0 914.716 0 0 0 420.774 0 0 0 0 0 0 0 0 0 0 0 0 0 0 1962.57 0 0 0 0 0 -145.65 0 0 0 0 0 333.644 0 0 0 0 0 0 0 0.04 0 
0 0 0 0 0 0 0 0 0 -558.718 442.747 0 1994.61 -938.063 0 0 0 0 0 0 0 0 0 0 0 0 0 0 0 0 0 0 0 0 0 0 0 0 0 0 0 0 0 0 0 0 0 1111.56 0 0.05 
