*Vertices 52
*Matrix 
0.04 0 2270.04 0 0 0 -761.818 0 0 1966.84 2321.77 0 0 0 0 0 -2206.56 0 0 0 -2234.03 0 0 0 0 -295.495 0 918.683 0 0 0 0 0 0 0 0 0 0 0 0 0 0 0 0 0 0 0 0 0 0 0 0 
0 0 0 0 1008.71 0 0 1244.47 -879.162 2474.06 0 0 0 0 0 512.635 0 0 0 0 0 0 0 0 0 1654.03 0 0 0 0 0 -194.479 0 0 0 0 0 0 0 0 0 0 0 0 0 0 0 0 0 0 0 0 
-2476.65 0 0.07 0 0 0 0 0 0 0 0 1881.85 0 0 2478.48 0 0 0 0 0 0 0 0 2113.03 0 0 0 0 0 0 0 0 1431.39 0 0 0 0 0 -726.417 672.094 0 -576.113 0 1931.44 0 200.43 0 598.849 0 0 0 0 
0 0 0 0.02 0 0 0 0 981.552 0 -1199.61 0 0 0 0 0 0 781.198 0 0 0 0 0 0 0 0 0 0 0 0 0 0 0 0 0 0 0 0 0 0 0 0 0 0 0 -375.149 0 0 0 2422.64 0 1921.37 
0 910.596 0 0 0.06 0 0 0 861.309 0 0 0 0 0 0 0 0 0 0 0 0 0 0 0 1399.66 0 0 0 0 0 0 2346.34 -955.458 0 0 0 0 0 0 0 0 -1450.77 0 2461.09 1863.84 0 0 0 0 0 0 0 
0 0 0 0 0 0.07 0 1701.64 0 0 0 0 0 0 0 0 0 0 0 0 -226.829 0 0 0 0 0 0 0 0 0 0 0 0 0 -635.777 1487.24 0 0 0 2387.84 0 0 0 0 0 0 0 0 0 0 0 0 
-47.5326 0 0 0 0 0 0.09 0 0 0 0 0 0 0 0 0 0 2389.98 0 0 0 0 0 0 0 0 0 107.807 0 0 0 0 0 0 0 0 0 0 0 0 -1791.21 0 0 0 0 0 0 1845.68 0 0 0 0 
0 2244.41 0 0 0 -2331.69 0 0.03 0 0 0 0 0 0 0 0 0 0 907.849 0 -1219.29 0 1954.02 0 0 0 0 0 338.374 0 0 0 0 0 0 0 0 0 0 0 0 -361.263 0 0 0 0 0 0 0 0 0 0 
0 1414.3 0 99.5666 1458.71 0 0 0 0.06 0 579.165 0 0 0 0 2360.53 0 0 -285.882 0 0 0 0 0 0 0 0 0 0 1260.49 0 0 0 0 0 0 0 0 0 0 0 0 0 0 0 0 0 0 0 0 0 0 
105.06 1641.97 0 0 0 0 0 0 0 0 0 2233.42 914.563 0 579.012 0 0 0 0 0 0 0 0 0 335.017 0 0 0 0 0 0 0 0 0 0 0 0 0 0 0 2358.7 0 0 0 0 -2407.38 0 0 0 0 2389.07 0 
977.432 0 0 -667.211 0 0 0 0 -1207.85 0 0.05 0 0 0 0 0 0 0 0 -698.645 0 129.17 0 0 0 0 0 0 0 0 0 0 0 0 0 0 0 168.844 0 0 0 1830.88 0 0 0 0 0 0 0 2174.83 0 0 
0 0 -662.175 0 0 0 0 0 0 222.709 0 0.03 0 0 0 0 0 0 0 0 0 0 0 0 -535.066 0 0 0 0 1126.82 0 2229.61 0 0 0 0 0 0 0 0 0 0 0 0 0 0 0 0 0 0 0 0 
0 0 0 0 0 0 0 0 0 -2131.79 0 0 0.06 0 0 0 0 0 1518.98 0 0 0 0 0 0 0 0 0 0 0 0 0 0 989.029 0 0 0 0 0 0 0 0 0 0 0 0 0 0 0 0 0 0 
0 0 0 0 0 0 0 0 0 0 0 0 0 0.04 -538.575 0 2414.85 0 0 0 0 0 0 0 0 0 0 0 0 1712.32 1426.36 0 0 0 0 0 0 0 0 0 0 0 0 0 0 0 977.584 0 0 0 0 0 
0 0 2019.79 0 0 0 0 0 0 2277.52 0 0 0 1428.95 0 0 0 0 0 0 0 0 0 0 0 0 0 0 0 1451.69 0 0 0 0 0 0 0 0 0 0 0 0 0 0 0 0 0 0 0 0 0 -564.364 
0 -344.935 0 0 0 0 0 0 -1069.6 0 0 0 0 0 0 0.08 0 0 0 0 0 0 0 1992.48 0 0 0 0 0 0 0 0 0 0 0 0 0 0 0 0 0 0 1949.45 0 0 0 0 2350.46 0 0 0 0 
2176.35 0 0 0 0 0 0 0 0 0 0 0 0 460.906 0 0 0.02 0 -1175.34 0 1947.61 0 405.667 0 0 0 0 0 0 0 0 0 0 0 0 0 0 0 0 0 0 0 0 0 0 0 0 0 0 2448.42 0 0 
0 0 0 -81.4081 0 0 -1276.51 0 0 0 0 0 0 0 0 0 0 0.01 0 0 -460.601 770.974 2261.65 0 0 0 2427.52 -1104.54 0 11.6733 244.072 0 0 0 0 0 0 0 0 0 0 0 0 0 0 0 0 0 1837.44 0 0 0 
0 0 0 0 0 0 0 68.2852 1925.64 0 0 0 -118.793 0 0 0 -332.728 0 0.03 0 0 0 0 0 0 985.977 1295.59 0 0 0 0 0 0 0 1920.45 0 0 0 0 0 0 0 0 0 0 0 0 0 0 0 0 0 
0 0 0 0 0 0 0 0 0 0 2234.18 0 0 0 0 0 0 0 0 0.04 0 1704.54 0 0 0 0 0 0 -29.5267 0 0 0 0 0 0 0 0 0 0 0 0 0 0 0 0 0 0 0 0 0 0 0 
2239.22 0 0 0 0 1208.61 0 938.826 0 0 0 0 0 0 0 0 -59.4348 63.7074 0 0 0.04 1339.84 0 0 0 0 0 -146.107 0 0 1461.15 0 0 0 0 0 0 0 0 0 0 0 0 0 0 0 0 888.47 0 0 0 0 
0 0 0 0 0 0 0 0 0 0 -2225.33 0 0 0 0 0 0 1096.61 0 1374.02 1657.08 0.03 0 0 0 0 0 0 0 0 0 0 0 0 -282.525 -1287.5 0 0 0 0 0 0 -562.532 0 0 0 0 0 0 0 0 1352.35 
0 0 0 0 0 0 0 1658.3 0 0 0 0 0 0 0 0 1604.74 -2333.52 0 0 0 0 0.08 0 0 0 0 0 0 0 0 0 0 0 1653.26 0 0 0 0 0 0 0 0 0 0 0 0 0 0 0 -2192.98 0 
0 0 1741 0 0 0 0 0 0 0 0 0 0 0 0 9.07926 0 0 0 0 0 0 0 0.04 0 0 0 0 0 0 0 0 0 0 0 0 0 0 0 0 0 0 0 0 0 -647.679 0 0 0 0 0 0 
0 0 0 0 1274.07 0 0 0 0 349.055 0 546.052 0 0 0 0 0 0 0 0 0 0 0 0 0 0 -583.59 0 0 0 1811.66 0 0 0 0 0 0 0 0 0 0 0 0 0 0 0 0 0 0 371.334 -46.4644 0 
1996.14 1319.7 0 0 0 0 0 0 0 0 0 0 0 0 0 0 0 0 -258.263 0 0 0 0 0 0 0.03 379.421 0 0 0 0 0 0 0 0 0 0 0 0 0 0 0 0 0 0 0 0 0 0 57.9089 0 0 
0 0 0 0 0 0 0 0 0 0 0 0 0 0 0 0 0 1068.68 1844.92 0 0 0 0 0 1594.21 -246.971 0 0 0 0 0 0 0 0 0 0 0 -316.858 0 0 0 -603.427 0 0 0 0 0 0 0 0 0 0 
2495.12 0 0 0 0 0 -2068.77 0 0 0 0 0 0 0 0 0 0 1788.16 0 0 -1735.36 0 0 0 0 0 0 0.06 0 0 203.177 0 0 1209.98 0 0 0 0 0 0 0 0 0 2255.09 0 0 0 -2434.84 0 182.882 0 0 
0 0 0 0 0 0 0 -342.036 0 0 0 0 0 0 0 0 0 0 0 1205.25 0 0 0 0 0 0 0 0 0.09 0 0 0 0 -2224.88 0 0 0 0 0 0 -850.475 0 0 0 0 0 0 0 0 2248.83 0 0 
0 0 0 0 0 0 0 0 2356.56 0 0 1321.99 0 1293.6 1377.07 0 0 -928.755 0 0 0 0 0 0 0 0 0 0 0 0.04 0 0 0 -560.701 0 0 0 0 0 0 0 0 0 0 0 0 0 0 0 0 0 0 
0 0 0 0 0 0 0 0 0 0 0 0 0 -1898.48 0 0 0 345.546 0 0 2158.65 0 0 0 482.574 0 0 1442.69 0 0 0.03 0 0 0 1926.1 1990.04 0 917.158 583.59 0 0 0 0 0 0 0 0 0 0 0 0 0 
0 2.06 0 0 1756.42 0 0 0 0 0 0 1262.32 0 0 0 0 0 0 0 0 0 0 0 0 0 0 0 0 0 0 0 0.09 0 0 0 0 0 0 -1650.98 0 1811.96 0 402.31 0 0 0 0 0 0 0 2310.17 1493.5 
0 0 -1671.27 0 2398.68 0 0 0 0 0 0 0 0 0 0 0 0 0 0 0 0 0 0 0 0 0 0 0 0 0 0 0 0.01 0 0 0 0 0 0 0 0 0 2168.11 0 0 0 0 1491.52 0 0 0 0 
0 0 0 0 0 0 0 0 0 0 0 0 2076.71 0 0 0 0 0 0 0 0 0 0 0 0 0 0 -671.178 -314.722 2258.45 0 0 0 0.03 0 0 0 2455.75 0 0 0 0 0 0 1404.54 0 0 0 0 0 0 0 
0 0 0 0 0 197.531 0 0 0 0 0 0 0 0 0 0 0 0 841.929 0 0 755.867 1766.64 0 0 0 0 0 0 0 -716.346 0 0 0 0.02 0 0 676.977 0 0 0 0 0 0 0 0 0 0 0 0 0 0 
0 0 0 0 0 -378.048 0 0 0 0 0 0 0 0 0 0 0 0 0 0 0 2353.97 0 0 0 0 0 0 0 0 -106.586 0 0 0 0 0.05 0 0 0 0 0 0 0 0 0 604.343 0 -1963.64 1157.03 0 0 0 
0 0 0 0 0 0 0 0 0 0 0 0 0 0 0 0 0 0 0 0 0 0 0 0 0 0 0 0 0 0 0 0 0 0 0 0 0.02 0 0 0 2021.01 1897.11 0 0 0 0 0 0 0 -767.006 0 0 
0 0 0 0 0 0 0 0 0 0 602.054 0 0 0 0 0 0 0 0 0 0 0 0 0 0 0 651.036 0 0 0 1056.02 0 0 212.638 422.91 0 0 0.07 0 0 0 0 0 0 0 0 0 0 0 0 0 0 
0 0 1169.7 0 0 0 0 0 0 0 0 0 0 0 0 0 0 0 0 0 0 0 0 0 0 0 0 0 0 0 539.644 -1757.79 0 0 0 0 0 0 0 657.75 0 0 0 0 911.512 0 0 0 0 0 0 0 
0 0 2287.74 0 0 2284.23 0 0 0 0 0 0 0 0 0 0 0 0 0 0 0 0 0 0 0 0 0 0 0 0 0 0 0 0 0 0 0 0 -225.608 0.06 1506.93 0 0 0 0 0 0 0 0 -914.563 0 0 
0 0 0 0 0 0 -1327.63 0 0 1211.36 0 0 0 0 0 0 0 0 0 0 0 0 0 0 0 0 0 0 2485.66 0 0 1023.51 0 0 0 0 -1131.09 0 0 -262.993 0.03 0 0 0 0 0 0 0 0 0 0 0 
0 0 1498.99 0 2467.5 0 0 -588.626 0 0 -2310.33 0 0 0 0 0 0 0 0 0 0 0 0 0 0 0 69.8111 0 0 0 0 0 0 0 0 0 2349.85 0 0 0 0 0.08 0 0 0 0 0 0 0 0 0 -1628.7 
0 0 0 0 0 0 0 0 0 0 0 0 0 0 0 -1572.08 0 0 0 0 0 -408.567 0 0 0 0 0 0 0 0 0 -294.427 -270.165 0 0 0 0 0 0 0 0 0 0.03 370.418 0 0 0 0 0 2485.05 0 0 
0 0 -82.0185 0 468.383 0 0 0 0 0 0 0 0 0 0 0 0 0 0 0 0 0 0 0 0 0 0 -1026.72 0 0 0 0 0 0 0 0 0 0 0 0 0 0 1932.05 0.01 0 0 0 0 0 0 0 0 
0 0 0 0 2229.15 0 0 0 0 0 0 0 0 0 0 0 0 0 0 0 0 0 0 0 0 0 0 0 0 0 0 0 0 1298.79 0 0 0 0 1369.14 0 0 0 0 0 0.01 0 0 0 631.352 0 0 0 
0 0 235.069 -1893.14 0 0 0 0 0 2095.32 0 0 0 0 0 0 0 0 0 0 0 0 0 1707.13 0 0 0 0 0 0 0 0 0 0 0 2327.42 0 0 0 0 0 0 0 0 0 0.06 -2155.45 0 0 0 357.906 0 
0 0 0 0 0 0 0 0 0 0 0 0 0 393.918 0 0 0 0 0 0 0 0 0 0 0 0 0 0 0 0 0 0 0 0 0 0 0 0 0 0 0 0 0 0 0 2087.08 0.07 0 0 0 0 0 
0 0 -483.642 0 0 0 2415.31 0 0 0 0 0 0 0 0 -448.088 0 0 0 0 1550.26 0 0 0 0 0 0 -380.795 0 0 0 0 438.627 0 0 -1426.36 0 0 0 0 0 0 0 0 0 0 0 0.02 0 -2266.99 1803.87 0 
0 0 0 0 0 0 0 0 0 0 0 0 0 0 0 0 0 2027.88 0 0 0 0 0 0 0 0 0 0 0 0 0 0 0 0 0 -737.709 0 0 0 0 0 0 0 0 114.673 0 0 0 0.02 0 0 0 
0 0 0 1290.09 0 0 0 0 0 0 -460.295 0 0 0 0 0 2424.47 0 0 0 0 0 0 0 -1521.73 -315.79 0 522.248 925.245 0 0 0 0 0 0 0 2492.37 0 0 399.564 0 0 1349.6 0 0 0 0 891.522 0 0.09 -2261.8 0 
0 0 0 0 0 0 0 0 0 45.7015 0 0 0 0 0 0 0 0 0 0 0 0 -30.2896 0 1248.89 0 0 0 0 0 0 440.153 0 0 0 0 0 0 0 0 0 0 0 0 0 -1238.67 0 1301.23 0 -339.747 0.08 0 
0 0 0 2299.65 0 0 0 0 0 0 0 0 0 0 1160.7 0 0 0 0 0 0 1426.21 0 0 0 0 0 0 0 0 0 1459.78 0 0 0 0 0 0 0 0 0 1058.15 0 0 0 0 0 0 0 0 0 0.09 
