*Vertices 56
*Matrix 
0.08 0 0 0 0 0 538.881 0 0 159.536 0 -904.645 0 0 0 0 0 -2208.4 0 0 0 0 1620.61 0 0 0 1686.22 0 0 0 0 0 0 0 0 0 0 243.919 0 0 0 0 0 0 -194.479 0 0 0 0 0 0 0 0 0 0 0 
0 0 0 -385.22 0 0 949.812 0 0 1377.22 0 0 0 0 0 0 0 0 0 0 0 0 0 0 0 0 0 0 0 -452.666 0 0 0 0 0 0 0 -612.43 0 0 0 0 0 0 0 0 0 0 0 0 0 0 0 0 0 0 
0 0 0.08 0 0 0 0 0 0 0 0 0 1997.05 0 0 0 0 0 0 0 -1363.8 0 1945.78 0 0 0 0 0 0 0 0 601.138 0 0 1852.09 -882.977 0 0 0 0 1539.89 0 684.301 0 0 0 0 0 0 0 0 0 0 0 0 0 
0 764.26 0 0.02 0 0 0 -116.504 0 2376.25 0 0 0 0 0 0 33.7992 0 0 0 0 0 0 -783.181 987.198 0 0 -2450.1 0 0 0 0 0 0 0 0 0 0 0 0 0 0 0 0 0 0 0 0 0 0 0 0 0 0 0 0 
0 0 0 0 0.06 0 0 0 0 2409.36 0 2079.3 0 0 2218.47 827.891 1471.83 0 0 0 0 -1550.57 0 0 -124.134 548.494 0 0 0 0 0 0 0 0 0 0 0 -261.467 0 0 0 0 0 0 0 0 0 0 0 0 0 0 0 -1394.47 0 0 
0 0 0 0 0 0.06 0 0 0 0 0 0 0 0 0 0 0 0 0 0 0 -1617.4 0 0 0 0 0 0 0 1677.83 1935.41 0 0 0 0 0 0 2300.71 0 0 0 -940.352 0 0 1092.03 0 0 0 0 0 66.4541 0 0 0 0 0 
-1913.13 2055.96 0 0 0 0 0.01 -541.932 0 0 0 0 0 0 0 0 0 0 0 0 0 0 0 0 0 0 0 0 0 0 1527.38 0 0 0 0 0 0 0 0 0 0 0 0 0 0 0 0 0 0 0 0 0 0 0 0 0 
0 0 0 1220.51 0 0 1745.73 0.02 -172.201 0 0 0 0 0 0 0 0 0 0 0 454.497 0 0 0 0 0 0 0 0 0 0 0 -552.919 0 0 0 0 0 0 0 0 0 0 0 0 0 0 0 0 0 0 0 0 0 0 0 
0 0 0 0 0 0 0 2487.03 0.05 0 0 2444.15 0 0 0 0 0 0 0 0 0 0 0 0 0 0 0 0 0 712.683 -1596.19 0 0 0 0 0 219.199 0 0 0 0 724.586 0 0 0 0 0 0 0 0 0 0 0 0 0 0 
1261.71 2086.32 0 1197.62 -550.478 0 0 0 0 0.04 -807.138 1593.75 0 1216.09 -212.18 0 482.421 0 0 0 0 0 0 0 736.641 0 0 0 0 0 0 0 0 0 0 0 0 0 0 91.3266 0 0 0 0 0 0 0 0 0 0 -1390.96 0 0 0 0 0 
0 0 0 0 0 0 0 0 0 -2087.08 0.01 0 0 13.1993 0 0 0 0 0 0 0 0 0 0 0 0 0 0 792.947 0 0 0 293.817 0 0 720.466 0 2408.6 0 0 0 0 2028.18 0 0 0 0 0 0 0 -1780.22 0 0 0 0 0 
775.399 0 0 0 464.721 0 0 0 2393.19 1369.44 0 0.06 0 0 0 0 0 0 0 0 0 0 0 0 0 0 0 0 0 0 0 0 0 0 0 0 0 0 0 0 0 0 0 0 0 0 0 0 0 0 0 1004.9 0 0 0 0 
0 0 2027.42 0 0 0 0 0 0 0 0 0 0.06 0 0 0 0 0 0 0 0 0 0 0 0 0 0 0 0 0 0 0 0 938.978 0 0 0 0 0 0 0 0 0 0 0 0 890.149 0 0 0 0 0 0 0 0 0 
0 0 0 0 0 0 0 0 0 -565.127 -1277.28 0 0 0.03 0 0 0 0 0 0 0 0 0 0 0 0 0 -1003.98 0 0 0 0 1930.68 1869.49 0 0 0 0 0 0 0 0 0 0 0 700.629 0 0 0 0 0 0 0 0 0 0 
0 0 0 0 1606.42 0 0 0 0 2397.46 0 0 0 0 0.05 0 0 0 0 0 0 2412.87 0 0 0 0 0 0 0 1667.46 0 0 0 0 0 0 0 0 0 0 0 0 0 0 0 0 0 0 0 0 -2435.15 0 0 0 0 0 
0 0 0 0 1126.67 0 0 0 0 0 0 0 0 0 0 0.05 0 0 0 0 -2010.33 0 0 0 0 0 0 0 0 0 0 0 0 0 0 -1479.77 0 0 1169.7 2373.81 0 0 2066.94 0 0 0 782.266 0 0 0 0 0 0 0 0 0 
0 0 0 446.104 -718.635 0 0 0 0 1029.01 0 0 0 0 0 0 0.01 0 628.147 1595.74 0 0 0 0 0 0 0 0 0 -1715.06 0 0 472.808 0 0 0 0 0 0 0 0 0 0 0 0 0 0 -895.795 0 0 0 0 0 0 0 2123.55 
24.4911 0 0 0 0 0 0 0 0 0 0 0 0 0 0 0 0 0.04 0 0 0 0 0 0 963.851 2439.27 0 0 0 1236.69 0 0 0 0 0 0 0 0 2159.72 0 -883.129 0 0 0 1163.9 -861.156 0 0 0 0 0 0 0 0 0 0 
0 0 0 0 0 0 0 0 0 0 0 0 0 0 0 0 2095.78 0 0.03 0 757.393 0 0 0 -265.282 0 0 0 0 0 0 0 0 0 0 0 0 0 0 0 0 0 0 0 0 0 0 0 0 0 0 0 0 0 0 0 
0 0 0 0 0 0 0 0 0 0 0 0 0 0 0 0 -10.9104 0 0 0.01 0 0 0 0 0 0 0 0 0 0 0 362.331 0 0 0 0 0 0 0 0 0 2403.1 0 -115.589 0 0 1934.19 0 -1004.29 960.189 0 0 0 0 0 0 
0 0 1717.81 0 0 0 0 1206.47 0 0 0 0 0 0 0 324.335 0 0 -579.775 0 0.07 0 0 0 0 0 0 0 0 0 1132.16 0 0 2067.4 0 0 0 0 1154.9 0 0 -1100.73 0 0 0 0 0 0 0 1777.93 0 0 0 0 0 0 
0 0 0 0 1406.52 953.169 0 0 0 0 0 0 0 0 1473.97 0 0 0 0 0 0 0 0 0 0 0 0 0 0 -174.49 2255.24 0 0 0 1198.54 0 0 0 0 0 0 0 0 -2182.91 -1326.72 0 0 0 0 -938.978 -249.565 0 0 0 0 0 
2355.19 0 -944.014 0 0 0 0 0 0 0 0 0 0 0 0 0 0 0 0 0 0 0 0.09 0 0 0 0 0 0 0 0 0 0 0 0 0 1720.1 1800.52 0 0 -1771.98 -494.171 0 0 0 0 0 0 0 0 0 0 0 0 0 0 
0 0 0 -1648.99 0 0 0 0 0 0 0 0 0 0 0 0 0 0 0 0 0 0 0 0.02 0 0 -4.80667 0 0 0 0 2130.73 0 0 355.159 0 0 0 0 0 1102.25 0 -569.247 0 0 0 0 0 0 2429.2 462.889 0 983.993 0 0 0 
0 0 0 7.24815 -13.657 0 0 0 0 1047.32 0 0 0 0 0 0 0 -178.152 -1321.83 0 0 0 0 0 0.07 0 0 0 0 -1913.74 0 0 0 0 2272.03 0 0 0 0 0 0 0 0 0 0 0 0 667.669 0 0 0 0 0 0 0 0 
0 0 0 0 2482.6 0 0 0 0 0 0 0 0 0 0 0 0 -911.817 0 0 0 0 0 0 0 0.09 0 0 0 0 0 0 0 0 1075.55 0 0 0 932.112 0 0 0 0 0 0 0 0 873.821 736.335 654.393 0 0 0 0 0 0 
1206.78 0 0 0 0 0 0 0 0 0 0 0 0 0 0 0 0 0 0 0 0 0 0 -2489.17 0 0 0.05 0 0 0 1868.11 0 0 0 0 0 0 0 0 0 0 0 0 -253.38 486.389 0 0 0 0 0 0 0 0 0 0 0 
0 0 0 127.949 0 0 0 0 0 0 0 0 0 914.258 0 0 0 0 0 0 0 0 0 0 0 0 0 0 0 0 0 0 0 0 0 0 0 -261.162 0 0 0 0 0 0 0 0 0 0 0 0 0 0 0 0 0 0 
0 0 0 0 0 0 0 0 0 0 578.86 0 0 0 0 0 0 0 0 0 0 0 0 0 0 0 0 0 0.01 0 0 0 1846.75 0 -141.224 0 0 0 0 0 0 0 0 0 0 0 0 0 0 0 0 0 0 0 0 0 
0 1934.03 0 0 0 -296.869 0 0 1126.67 0 0 0 0 0 -108.875 0 1150.32 -188.833 0 0 0 -1836.53 0 0 -2297.05 0 0 0 0 0.01 0 -1622.29 0 0 0 0 0 0 0 1784.95 0 0 0 0 0 0 1287.5 0 0 0 0 0 0 0 0 0 
0 0 0 0 0 600.833 132.832 0 -290.613 0 0 0 0 0 0 0 0 0 0 0 -1448.79 -491.577 0 0 0 0 -558.718 0 0 0 0.09 2173.3 0 0 0 1395.99 0 0 0 0 0 0 0 0 -256.89 2019.79 -709.174 0 0 1722.85 0 0 0 0 0 0 
0 0 1935.26 0 0 0 0 0 0 0 0 0 0 0 0 0 0 0 0 -514.771 0 0 0 -1454.44 0 0 0 0 0 1468.47 -344.63 0 0 0 0 0 0 0 0 0 0 0 1219.44 0 0 632.115 0 0 -518.128 0 0 0 0 0 0 0 
0 0 0 0 0 0 0 1756.11 0 0 -781.655 0 0 -1137.2 0 0 1460.54 0 0 0 0 0 0 0 0 0 0 0 2312.16 0 0 0 0.05 0 -654.088 0 0 0 0 0 0 0 0 380.947 0 0 0 0 -2454.22 591.83 0 0 0 0 0 0 
0 0 0 0 0 0 0 0 0 0 0 0 -1257.13 514.161 0 0 0 0 0 0 1028.09 0 0 0 0 0 0 0 0 0 0 0 0 0.05 0 0 0 2488.86 0 0 0 0 -894.879 0 0 0 0 0 0 0 0 0 0 0 0 0 
0 0 -191.427 0 0 0 0 0 0 0 0 0 0 0 0 0 0 0 0 0 0 -1834.09 0 1718.27 2361.29 -424.741 0 0 43.5652 0 0 0 439.695 0 0.03 0 0 0 0 0 0 0 0 0 0 0 2343.13 0 0 0 0 0 0 0 0 0 
0 0 -900.372 0 0 0 0 0 0 0 2002.7 0 0 0 0 -670.873 0 0 0 0 0 0 0 0 0 0 0 0 0 0 1384.24 0 0 0 0 0 0 213.706 0 0 0 414.365 0 1956.16 174.184 -1618.17 0 0 0 0 0 0 0 0 0 0 
0 0 0 0 0 0 0 0 1671.42 0 0 0 0 0 0 0 0 0 0 0 0 0 396.817 0 0 0 0 0 0 0 0 0 0 0 0 0 0.07 0 0 0 0 0 0 -2158.96 0 0 0 0 0 0 0 0 0 0 0 0 
-809.122 1376.46 0 0 2140.64 -1687.44 0 0 0 0 1536.84 0 0 0 0 0 0 0 0 0 0 0 2065.57 0 0 0 0 1171.53 0 0 0 0 0 -1323.82 0 -963.546 0 0.05 0 0 0 0 0 0 0 0 0 0 0 2475.13 0 0 0 0 0 0 
0 0 0 0 0 0 0 0 0 0 0 0 0 0 0 2164.91 0 1899.7 0 0 -210.349 0 0 0 0 1625.95 0 0 0 0 0 0 0 0 0 0 0 0 0.01 -1459.47 0 0 0 0 0 0 0 0 0 0 0 0 0 0 0 0 
0 0 0 0 0 0 0 0 0 1685.92 0 0 0 0 0 1719.34 0 0 0 0 0 0 0 0 0 0 0 0 0 1371.12 0 0 0 0 0 0 0 0 -1618.47 0.01 0 0 0 0 628.3 0 0 0 138.783 0 0 0 0 0 0 0 
0 0 1890.24 0 0 0 0 0 0 0 0 0 0 0 0 0 0 -836.741 0 0 0 0 2272.64 1272.24 0 0 0 0 0 0 0 0 0 0 0 0 0 0 0 0 0.09 0 0 -2015.82 0 0 0 0 0 0 354.854 0 0 0 0 0 
0 0 0 0 0 -1777.47 0 0 910.291 0 0 0 0 0 0 0 0 0 0 290.002 -780.74 0 2271.87 0 0 0 0 0 0 0 0 0 0 0 0 2127.67 0 0 0 0 0 0 606.632 0 0 0 0 0 0 -2234.34 0 0 0 0 0 0 
0 0 1852.7 0 0 0 0 0 0 0 1588.26 0 0 0 0 24.9489 0 0 0 0 0 0 0 468.993 0 0 0 0 0 0 0 1582 0 -408.567 0 0 0 0 0 0 0 2202.14 0 0 0 0 0 0 0 81.2555 0 0 0 0 -102.313 0 
0 0 0 0 0 0 0 0 0 0 0 0 0 0 0 0 0 0 0 1104.54 0 2063.43 0 0 0 0 1143.3 0 0 0 0 0 1572.24 0 0 -737.098 -1896.04 0 0 0 -1759.01 0 0 0.03 0 0 0 0 0 0 517.365 0 0 0 0 0 
1730.78 0 0 0 0 -2061.3 0 0 0 0 0 0 0 0 0 0 0 1498.54 0 0 0 -704.901 0 0 0 0 375.301 0 0 0 -1039.69 0 0 0 0 2039.02 0 0 0 -85.5281 0 0 0 0 0 0 0 0 0 929.212 0 0 0 0 0 0 
0 0 0 0 0 0 0 0 0 0 0 0 0 2468.41 0 0 0 -1707.59 0 0 0 0 0 0 0 0 0 0 0 0 1966.23 809.58 0 0 0 317.621 0 0 0 0 0 0 0 0 0 0 0 0 0 0 0 0 0 0 0 0 
0 0 0 0 0 0 0 0 0 0 0 0 -2087.39 0 0 -489.898 0 0 0 1854.99 0 0 0 0 0 0 0 0 0 2332.76 1992.78 0 0 0 414.06 0 0 0 0 0 0 0 0 0 0 0 0.02 0 0 0 0 0 0 0 0 0 
0 0 0 0 0 0 0 0 0 0 0 0 0 0 0 0 -662.023 0 0 0 0 0 0 0 670.873 2214.8 0 0 0 0 0 0 0 0 0 0 0 0 0 0 0 0 0 0 0 0 0 0.08 -773.721 0 0 0 0 0 0 0 
0 0 0 0 0 0 0 0 0 0 0 0 0 0 0 0 0 0 0 147.633 0 0 0 0 0 806.833 0 0 0 0 0 759.835 -886.944 0 0 0 0 0 0 1519.75 0 0 0 0 0 0 0 -862.224 0.03 0 0 0 0 0 0 0 
0 0 0 0 0 0 0 0 0 0 0 0 0 0 0 0 0 0 0 -404.904 2085.71 2475.28 0 831.858 0 371.029 0 0 0 0 -849.101 0 2067.4 0 0 0 0 1879.25 0 0 0 1497.01 -566.5 0 -2084.03 0 0 0 0 0.03 0 0 0 0 0 0 
0 0 0 0 0 -2383.72 0 0 0 1733.83 588.626 0 0 0 1360.59 0 0 0 0 0 0 675.756 0 2084.95 0 0 0 0 0 0 0 0 0 0 0 0 0 0 0 0 -872.295 0 0 -1412.93 0 0 0 0 0 0 0.08 0 0 0 0 0 
0 0 0 0 0 0 0 0 0 0 0 313.044 0 0 0 0 0 0 0 0 0 0 0 0 0 0 0 0 0 0 0 0 0 0 0 0 0 0 0 0 0 0 0 0 0 0 0 0 0 0 0 0.01 0 0 0 0 
0 0 0 0 0 0 0 0 0 0 0 0 0 0 0 0 0 0 0 0 0 0 0 1558.2 0 0 0 0 0 0 0 0 0 0 0 0 0 0 0 0 0 0 0 0 0 0 0 0 0 0 0 0 0.07 0 0 0 
0 0 0 0 1600.31 0 0 0 0 0 0 0 0 0 0 0 0 0 0 0 0 0 0 0 0 0 0 0 0 0 0 0 0 0 0 0 0 0 0 0 0 0 0 0 0 0 0 0 0 0 0 0 0 0.01 0 0 
0 0 0 0 0 0 0 0 0 0 0 0 0 0 0 0 0 0 0 0 0 0 0 0 0 0 0 0 0 0 0 0 0 0 0 0 0 0 0 0 0 0 1484.5 0 0 0 0 0 0 0 0 0 0 0 0.08 0 
0 0 0 0 0 0 0 0 0 0 0 0 0 0 0 0 1641.82 0 0 0 0 0 0 0 0 0 0 0 0 0 0 0 0 0 0 0 0 0 0 0 0 0 0 0 0 0 0 0 0 0 0 0 0 0 0 0.08 
