*Vertices 67
*Matrix 
0 0 0 0 0 0 -1899.09 0 0 0 0 0 0 0 0 0 0 0 0 -1267.05 0 0 0 0 0 1663.79 0 0 0 0 0 0 0 1842.78 0 0 0 0 631.809 0 0 0 0 45.3963 0 0 5.56963 206.687 0 0 368.74 0 0 0 0 0 0 0 0 0 0 0 0 0 0 0 0 
0 0 0 0 0 0 0 0 0 0 0 0 0 0 0 0 0 0 0 0 0 0 0 0 0 0 22.8126 0 0 0 0 0 1510.28 0 0 0 707.953 0 0 0 0 0 0 0 0 0 0 0 2456.66 -2286.68 2424.92 0 0 0 -2446.13 0 0 0 0 0 0 0 0 0 0 0 0 
0 0 0.06 0 0 0 0 0 0 0 0 0 1723 0 0 0 0 0 0 0 0 839.183 0 1826.76 -609.378 0 0 0 0 0 0 1224.78 0 0 0 0 0 1847.82 0 0 0 0 0 0 0 0 0 0 0 0 0 0 0 0 1012.53 0 2252.95 -2477.42 0 0 0 0 0 0 0 0 0 
0 0 0 0 1725.59 0 0 0 0 0 0 0 0 0 0 0 0 0 0 0 0 0 0 0 0 1792.58 0 0 0 0 0 0 0 1328.7 0 0 0 -2297.97 2357.02 0 0 0 0 0 1980.42 0 0 0 0 0 0 0 0 0 0 0 0 0 0 0 0 0 0 0 0 0 0 
0 0 0 2233.57 0.09 0 0 0 0 0 0 0 0 0 0 0 0 0 0 0 -873.363 666.448 0 0 0 0 0 -1966.99 0 0 0 0 0 0 0 0 1273.92 0 -2341.76 512.94 0 0 0 0 0 0 0 0 0 0 0 0 0 0 0 0 2162.31 0 0 0 0 0 0 0 0 0 0 
0 0 0 0 0 0.01 0 0 0 0 2276.6 0 0 0 0 1977.07 0 0 0 0 0 0 0 0 0 0 1669.29 0 0 0 0 0 0 0 0 0 0 0 0 0 0 0 0 0 -460.143 0 0 0 0 0 0 0 0 1894.97 0 0 0 0 0 0 0 0 0 0 0 0 0 
1050.52 0 0 0 0 0 0.04 0 0 -1938.46 0 0 0 0 0 0 0 0 0 1364.25 0 0 0 0 0 0 0 2326.96 0 0 0 0 0 0 0 0 1130.33 0 0 1277.28 0 0 0 0 0 0 0 0 0 0 1968.67 0 0 0 0 0 0 0 0 0 0 0 0 0 0 0 0 
0 0 0 0 0 0 0 0.09 0 0 0 0 0 0 0 0 0 0 0 841.777 -2141.71 1451.54 0 0 0 0 0 0 0 -311.518 0 556.734 0 0 0 0 0 0 0 -452.513 0 0 0 0 0 0 0 0 0 0 0 1864.3 0 0 0 0 0 469.451 0 0 0 0 0 0 0 0 0 
0 0 0 0 0 0 0 0 0.08 0 0 -1985 0 0 0 0 0 225.608 1866.28 0 0 0 0 0 0 0 0 0 1799.45 0 0 0 0 1720.4 0 0 0 0 0 0 2083.73 0 159.993 1249.05 0 0 0 0 0 0 0 0 0 0 0 0 0 0 0 0 0 0 0 0 0 0 0 
0 0 0 0 0 0 -242.546 0 0 0.09 0 0 0 0 0 0 0 0 0 0 0 0 0 0 -91.7844 0 0 0 0 0 0 -327.845 -41.1237 0 0 0 0 882.672 0 0 0 0 0 0 0 2312.46 0 0 0 0 0 0 550.935 2191.92 -363.094 0 0 0 0 0 0 0 0 0 0 0 0 
0 0 0 0 0 1520.05 0 0 0 0 0 0 250.328 0 0 0 0 -668.279 0 0 0 0 -720.466 0 0 0 0 0 2396.85 0 0 0 0 0 0 0 0 0 0 0 940.504 0 0 0 0 51.8052 -637.608 0 0 0 0 0 0 0 0 0 0 1745.43 0 0 0 0 0 0 0 0 0 
0 0 0 0 0 0 0 0 -185.781 0 0 0 2371.97 0 0 0 0 0 0 0 0 0 1021.68 0 0 0 0 0 -1370.82 1176.41 0 2144.31 2388.3 0 0 2273.55 0 0 0 0 0 -1713.23 -593.356 0 0 0 0 0 0 0 1804.94 0 0 0 0 0 0 0 0 0 0 0 0 0 0 253.075 0 
0 0 1003.52 0 0 0 0 0 0 0 2443.54 -1392.94 0.07 0 0 0 1642.28 0 0 0 0 0 0 0 0 0 0 0 0 565.279 0 0 0 0 0 0 2109.21 0 0 0 0 -323.725 0 0 0 0 0 0 0 2016.74 -1633.73 0 0 -871.685 0 0 0 0 0 0 0 0 0 0 0 0 0 
0 0 0 0 0 0 0 0 0 0 0 0 0 0 0 -666.295 0 0 0 0 0 -504.547 0 0 0 0 0 0 0 0 0 1849.96 0 0 2423.55 0 0 0 0 0 2136.52 -537.66 0 0 0 0 0 0 0 0 0 0 0 0 0 -807.291 -515.076 -2415.16 0 0 0 0 0 0 0 0 0 
0 0 0 0 0 0 0 0 0 0 0 0 0 0 0.01 0 0 2250.05 0 0 -2259.06 1631.9 0 0 2299.04 0 0 0 0 0 0 0 0 1302 0 0 0 0 0 0 0 0 0 0 0 0 1702.86 0 0 0 0 0 0 0 0 0 0 0 577.792 0 0 0 0 0 0 0 0 
0 0 0 0 0 2304.38 0 0 0 0 0 0 0 486.999 0 0.05 0 0 0 0 -1761.91 0 0 0 0 0 647.832 0 0 0 0 0 0 0 0 0 0 0 0 0 0 0 0 0 0 0 0 0 0 0 0 0 0 0 1090.66 0 0 0 0 0 0 0 0 0 0 0 0 
0 0 0 0 0 0 0 0 0 0 0 0 -213.858 0 0 0 0.05 0 0 0 0 0 0 0 -2181.54 0 2087.85 0 0 0 0 0 0 0 0 0 0 0 0 0 0 0 54.7044 0 909.375 0 0 2268.06 -648.9 0 0 0 0 869.549 0 0 0 0 0 0 0 0 0 0 0 0 0 
0 0 0 0 0 0 0 0 2205.8 0 -516.755 0 0 0 2470.85 0 0 0.02 0 0 0 0 0 2134.08 1880.78 0 0 1535.46 0 0 1950.21 0 0 0 0 0 0 0 0 2471.01 0 0 0 0 0 2206.87 0 -1305.2 0 0 0 0 0 0 0 0 0 0 0 0 0 0 0 0 0 0 0 
0 0 0 0 0 0 0 0 -112.232 0 0 0 0 0 0 0 0 0 0.07 -1384.55 0 0 0 0 0 0 0 0 0 238.273 0 0 0 0 0 0 0 0 0 0 -599.612 649.358 0 1031.91 0 0 0 0 0 0 0 0 1764.05 0 46.4644 62.6392 0 0 0 0 0 0 0 0 0 0 0 
2352.75 0 0 0 0 0 335.627 -1000.17 0 0 0 0 0 0 0 0 0 0 -1537.29 0.04 0 0 0 0 0 1300.01 0 0 1024.43 0 0 0 0 0 0 0 0 0 0 0 0 0 0 0 0 0 0 0 -819.041 -53.6363 0 0 0 0 0 0 0 1158.86 0 0 0 0 0 0 0 0 0 
0 0 0 0 395.749 0 0 67.0644 0 0 0 0 0 0 -735.725 -454.344 0 0 0 0 0.09 2226.4 0 769.143 0 0 0 0 0 0 0 0 0 0 0 14.5726 0 0 0 0 0 0 0 0 0 0 0 0 1290.7 0 0 0 0 0 2194.97 0 0 0 0 0 0 0 0 0 -1879.1 0 0 
0 0 -140.156 0 -1491.67 0 0 2452.24 0 0 0 0 0 2093.65 -1281.85 0 0 0 0 0 1226.92 0.02 0 1527.83 0 0 0 0 0 0 0 0 0 0 159.078 0 0 0 0 0 0 0 0 0 1915.72 528.047 0 0 0 0 0 0 0 0 0 0 0 0 0 0 0 0 0 0 0 0 0 
0 0 0 0 0 0 0 0 0 0 292.596 1876.96 0 0 0 0 0 0 0 0 0 0 0.05 0 0 0 0 0 0 1051.13 0 0 0 0 0 0 0 0 0 1036.48 0 0 0 2443.08 0 0 0 0 0 0 0 0 -1071.43 0 0 0 0 0 1468.17 0 0 0 0 0 0 577.487 0 
0 0 185.018 0 0 0 0 0 0 0 0 0 0 0 0 0 0 -924.482 0 0 1753.36 2463.23 0 0.06 0 0 0 0 0 0 0 0 0 1079.21 0 112.537 0 0 1603.37 0 0 0 0 0 -1317.41 0 1446.2 0 0 0 0 0 0 0 0 0 0 0 0 0 0 0 0 0 0 0 0 
0 0 1372.65 0 0 0 0 0 0 798.135 0 0 0 0 2420.5 0 517.67 -1116.6 0 0 0 0 0 0 0.02 0 0 0 0 0 0 0 0 0 0 0 0 0 0 0 0 -2480.93 0 474.944 0 -400.479 0 0 0 1611.91 0 1179.31 0 0 0 0 0 0 0 0 0 0 0 0 0 0 0 
1553.01 0 0 -83.0866 0 0 0 0 0 0 0 0 0 0 0 0 0 0 0 2122.18 0 0 0 0 0 0.06 0 0 0 2260.73 0 0 0 0 0 0 0 0 0 0 0 0 0 0 0 0 0 0 0 0 0 0 0 0 0 0 0 0 0 0 0 0 0 0 0 0 0 
0 350.276 0 0 0 954.39 0 0 0 0 0 0 0 0 0 1498.69 770.363 0 0 0 0 0 0 0 0 0 0.02 0 1941.97 0 0 0 0 0 -956.069 -1590.55 0 0 0 0 0 0 0 0 -1867.66 0 0 -89.1903 0 -939.894 0 0 522.095 0 0 0 0 0 0 0 0 0 0 0 0 0 0 
0 0 0 0 -1968.21 0 426.572 0 0 0 0 0 0 0 0 0 0 1897.87 0 0 0 0 0 0 0 0 0 0.01 0 0 0 0 0 -465.178 0 0 0 0 1195.94 0 0 1717.81 0 0 0 0 0 0 0 0 0 0 0 0 0 0 0 0 0 0 0 0 0 0 0 0 0 
0 0 0 0 0 0 0 0 812.174 0 -2006.06 1829.81 0 0 0 0 0 0 0 -918.836 0 0 0 0 0 0 1607.18 0 0.01 0 1767.56 0 0 0 0 0 0 0 0 -151.448 0 0 0 0 0 0 -471.587 0 0 -1528.14 0 1816.08 0 0 0 338.069 -339.9 0 0 0 0 0 2416.07 0 0 0 0 
0 0 0 0 0 0 0 -1099.51 0 0 0 501.648 1901.23 0 0 0 0 0 2150.11 0 0 0 -2139.12 0 0 1316.64 0 0 0 0 0 176.778 0 0 0 0 0 0 0 0 0 0 0 0 2339.32 -2124.62 0 0 0 0 0 0 0 0 0 0 0 0 0 0 0 0 0 0 0 0 0 
0 0 0 0 0 0 0 0 0 0 0 0 0 0 0 0 0 2026.66 0 0 0 0 0 0 0 0 0 0 -1740.39 0 0.08 -1328.09 603.427 0 0 0 0 0 0 -2460.63 2438.96 0 0 0 0 0 529.725 113.758 0 0 0 0 0 0 0 0 0 0 0 0 0 0 0 0 0 0 0 
0 0 2222.59 0 0 0 0 -33.7992 0 -498.138 0 439.238 0 -2293.08 0 0 0 0 0 0 0 0 0 0 0 0 0 0 0 597.171 21.897 0 0 0 0 0 0 0 0 0 0 0 0 0 767.769 0 0 0 0 0 0 0 0 0 0 0 0 0 0 0 1414.91 170.827 0 -1663.95 0 0 0 
0 -201.041 0 0 0 0 0 0 0 1986.98 0 1923.51 0 0 0 0 0 0 0 0 0 0 0 0 0 0 0 0 0 0 28.9163 0 0.01 0 0 0 0 0 0 0 0 0 0 0 0 0 0 0 0 0 0 0 0 0 0 0 0 0 0 0 0 0 0 0 0 0 0 
-1998.12 0 0 -2413.79 0 0 0 0 998.032 0 0 0 0 0 653.325 0 0 0 0 0 0 0 0 2427.67 0 0 0 1300.62 0 0 0 0 0 0.08 0 0 1526.46 0 0 0 0 0 0 0 1654.94 0 0 0 0 0 0 0 0 0 1690.04 0 0 0 0 0 0 0 0 0 0 0 0 
0 0 0 0 0 0 0 0 0 0 0 0 0 -2141.56 0 0 0 0 0 0 0 -938.215 0 0 0 0 -152.516 0 0 0 0 0 0 0 0 0 0 0 0 2138.2 0 0 0 1043.81 0 0 0 0 0 0 -777.078 46.9222 0 0 751.595 0 0 0 0 0 0 0 0 0 0 0 0 
0 0 0 0 0 0 0 0 0 0 0 851.238 0 0 0 0 0 0 0 0 1906.11 0 0 1561.4 0 0 -751.747 0 0 0 0 0 0 0 0 0.04 -51.6526 0 0 0 1261.56 0 0 40.3607 0 0 0 0 0 0 0 0 0 0 0 -490.967 0 0 0 0 0 0 0 0 0 0 0 
0 -1689.28 0 0 2163.08 0 2209.31 0 0 0 0 0 -2168.72 0 0 0 0 0 0 0 0 0 0 0 0 0 0 0 0 0 0 0 0 201.193 0 -2097.77 0 0 1547.67 0 0 0 0 0 0 0 0 0 2397.31 0 0 0 0 0 0 0 0 0 0 0 0 0 0 0 0 0 0 
0 0 -1182.97 -1290.09 0 0 0 0 0 1168.32 0 0 0 0 0 0 0 0 0 0 0 0 0 0 0 0 0 0 0 0 0 0 0 0 0 0 0 0.08 0 0 0 0 0 0 2407.07 0 0 0 0 0 0 1818.52 0 0 0 0 -1620 -212.79 0 0 0 0 0 0 0 0 0 
2073.35 0 0 1795.02 -252.312 0 0 0 0 0 0 0 0 0 0 0 0 0 0 0 0 0 0 1506.78 0 0 0 -1133.69 0 0 0 0 0 0 0 0 2075.18 0 0.09 0 0 0 0 0 857.799 0 0 0 0 0 0 0 1340.91 0 0 0 0 0 0 0 0 0 0 0 0 0 0 
0 0 0 0 1995.07 0 -1647.47 2208.55 0 0 0 0 0 0 0 0 0 514.618 0 0 0 0 2220.76 0 0 0 0 0 952.406 0 2351.83 0 0 0 182.882 0 0 0 0 0.01 0 0 0 0 0 2206.87 0 -461.058 1619.39 0 0 -1937.39 0 0 0 -2119.13 0 0 0 0 0 0 0 0 0 0 0 
0 0 0 0 0 0 0 0 797.067 0 -1027.48 0 0 1056.32 0 0 0 0 -786.081 0 0 0 0 0 0 0 0 0 0 0 2183.37 0 0 0 0 -1103.32 0 0 0 0 0.03 0 0 0 0 -148.244 738.166 0 0 0 0 0 0 0 0 0 0 0 0 0 0 0 0 0 0 0 0 
0 0 0 0 0 0 0 0 0 0 0 968.123 762.734 2039.48 0 0 0 0 1000.63 0 0 0 0 0 163.503 0 0 -1437.19 0 0 0 0 0 0 0 0 0 0 0 0 0 0.02 448.088 0 0 0 0 0 0 0 0 0 0 0 2186.12 0 0 0 0 1002.91 0 0 0 0 0 0 0 
0 0 0 0 0 0 0 0 2476.96 0 0 1392.48 0 0 0 0 -2301.02 0 0 0 0 0 0 0 0 0 0 0 0 0 0 0 0 0 0 0 0 0 0 0 0 782.113 0.03 1272.85 0 0 0 0 0 0 0 0 2182.91 0 0 0 0 0 0 0 0 0 0 0 0 0 0 
-1516.08 0 0 0 0 0 0 0 2110.58 0 0 0 0 0 0 0 0 0 -1556.98 0 0 0 1356.01 0 -1620.46 0 0 0 0 0 0 0 0 0 1649.75 1108.05 0 0 0 0 0 0 2440.18 0.03 0 0 0 0 0 0 0 0 0 607.7 0 0 0 0 0 0 0 0 0 0 0 0 0 
0 0 0 2247.15 0 1191.37 0 0 0 0 0 0 0 0 0 0 -404.752 0 0 0 0 672.246 0 2310.48 0 0 -322.047 0 0 -385.22 0 -1832.26 0 982.925 0 0 0 -1549.35 2448.12 0 0 0 0 0 0.06 0 0 2189.63 0 0 2441.4 0 0 0 0 0 0 0 0 0 0 0 0 0 0 0 0 
0 0 0 0 0 0 0 0 0 2293.54 1020.46 0 0 0 0 0 0 -1596.35 0 0 0 770.058 0 0 484.1 0 0 0 0 2486.57 0 0 0 0 0 0 0 0 0 1524.32 816.446 0 0 0 0 0.01 0 1573 0 0 0 0 0 0 0 -1187.4 0 0 0 0 0 0 0 0 0 0 0 
2361.14 0 0 0 0 0 0 0 0 0 1777.47 0 0 0 -1005.36 0 0 0 0 0 0 0 0 -2236.32 0 0 0 0 534.15 0 687.506 0 0 0 0 0 0 0 0 0 12.8941 0 0 0 0 0 0.09 0 0 853.832 0 0 0 0 0 -1198.39 0 0 0 0 0 0 0 0 0 0 0 
1044.88 0 0 0 0 0 0 0 0 0 0 0 0 0 0 0 1949.45 -2006.82 0 0 0 0 0 0 0 0 2493.59 0 0 0 2372.43 0 0 0 0 0 0 0 0 1407.59 0 0 0 0 2424.31 383.999 0 0.07 0 0 0 0 0 0 0 0 0 0 0 0 0 0 0 0 0 0 0 
0 1565.37 0 0 0 0 0 0 0 0 0 0 0 0 0 0 657.903 0 0 -506.073 900.83 0 0 0 0 0 0 0 0 0 0 0 0 0 0 0 1976.45 0 0 2406.46 0 0 0 0 0 0 0 0 0.05 0 0 636.998 0 0 0 0 1482.21 0 0 0 0 0 0 0 0 0 0 
0 1217.92 0 0 0 0 0 0 0 0 0 0 -880.688 0 0 0 0 0 0 862.682 0 0 0 0 2253.11 0 -1170.16 0 -1501.59 0 0 0 0 0 0 0 0 0 0 0 0 0 0 0 0 0 444.426 0 0 0.08 0 0 1198.39 0 0 0 0 0 0 0 0 0 0 0 0 0 -1282.01 
-163.961 -1157.95 0 0 0 0 1945.94 0 0 0 0 -6.48518 2335.81 0 0 0 0 0 0 0 0 0 0 0 0 0 0 0 0 0 0 0 0 0 -571.688 0 0 0 0 0 0 0 0 0 -517.823 0 0 0 0 0 0.01 -1098.44 0 0 0 0 0 0 0 0 0 0 0 0 0 0 0 
0 0 0 0 0 0 0 85.8333 0 0 0 0 0 0 0 0 0 0 0 0 0 0 0 0 -1878.64 0 0 0 -168.233 0 0 0 0 0 1698.13 0 0 2136.83 0 1884.44 0 0 0 0 0 0 0 0 -285.119 0 -1491.67 0.02 0 0 0 0 0 0 0 0 0 0 0 0 0 0 0 
0 0 0 0 0 0 0 0 0 -257.347 0 0 0 0 0 0 0 0 1260.64 0 0 0 1887.8 0 0 0 584.658 0 0 0 0 0 0 0 0 0 0 0 572.146 0 0 0 -1456.88 0 0 0 0 0 0 800.272 0 0 0.08 0 0 0 0 0 0 0 0 0 0 0 0 0 0 
0 0 0 0 0 1435.82 0 0 0 -65.8437 0 0 1923.2 0 0 0 -1688.36 0 0 0 0 0 0 0 0 0 0 0 0 0 0 0 0 0 0 0 0 0 0 0 0 0 0 658.818 0 0 0 0 0 0 0 0 0 0.07 0 0 252.77 0 0 0 0 0 0 0 0 0 0 
0 -366.756 -1815.62 0 0 0 0 0 0 -452.513 0 0 0 0 0 2022.84 0 0 2340.39 0 -569.094 0 0 0 0 0 0 0 0 0 0 0 0 40.5133 1716.13 0 0 0 0 0 0 1452.6 0 0 0 0 0 0 0 0 0 0 0 0 0.01 0 0 0 0 0 0 0 0 0 0 0 0 
0 0 0 0 0 0 0 0 0 0 0 0 0 362.178 0 0 0 0 1019.7 0 0 0 0 0 0 0 0 0 2245.48 0 0 0 0 0 0 668.126 0 0 0 1582.61 0 0 0 0 0 1483.73 -296.716 0 0 0 0 0 0 0 0 0.09 0 0 0 0 0 0 0 0 0 0 0 
0 0 54.0941 0 -1889.78 0 0 0 0 0 0 0 0 464.11 0 0 0 0 0 0 0 0 0 0 0 0 0 0 -7.09555 0 0 0 0 0 0 0 0 -1085.62 0 0 0 0 0 0 0 0 0 0 2136.98 0 0 0 0 2139.58 0 0 0.08 81.4081 0 0 0 0 0 0 0 0 0 
0 0 2479.4 0 0 0 0 -745.643 0 0 -1019.39 0 0 2166.13 0 0 0 0 0 -474.029 0 0 0 0 0 0 0 0 0 0 0 0 0 0 0 0 0 -580.386 0 0 0 0 0 0 0 0 0 0 0 0 0 0 0 0 0 0 -327.235 0.01 0 0 0 0 0 0 0 0 1508.61 
0 0 0 0 0 0 0 0 0 0 0 0 0 0 1069.75 0 0 0 0 0 0 0 1768.17 0 0 0 0 0 0 0 0 0 0 0 0 0 0 0 0 0 0 0 0 0 0 0 0 0 0 0 0 0 0 0 0 0 0 0 0.03 0 0 0 0 0 0 0 0 
0 0 0 0 0 0 0 0 0 0 0 0 0 0 0 0 0 0 0 0 0 0 0 0 0 0 0 0 0 0 0 0 0 0 0 0 0 0 0 0 0 2492.52 0 0 0 0 0 0 0 0 0 0 0 0 0 0 0 0 0 0.06 0 0 0 0 0 0 0 
0 0 0 0 0 0 0 0 0 0 0 0 0 0 0 0 0 0 0 0 0 0 0 0 0 0 0 0 0 0 0 2327.27 0 0 0 0 0 0 0 0 0 0 0 0 0 0 0 0 0 0 0 0 0 0 0 0 0 0 0 0 0 0 0 0 0 0 0 
0 0 0 0 0 0 0 0 0 0 0 0 0 0 0 0 0 0 0 0 0 0 0 0 0 0 0 0 0 0 0 678.655 0 0 0 0 0 0 0 0 0 0 0 0 0 0 0 0 0 0 0 0 0 0 0 0 0 0 0 0 0 0.04 0 0 0 0 0 
0 0 0 0 0 0 0 0 0 0 0 0 0 0 0 0 0 0 0 0 0 0 0 0 0 0 0 0 1789.53 0 0 0 0 0 0 0 0 0 0 0 0 0 0 0 0 0 0 0 0 0 0 0 0 0 0 0 0 0 0 0 0 0 0.07 0 0 0 0 
0 0 0 0 0 0 0 0 0 0 0 0 0 0 0 0 0 0 0 0 0 0 0 0 0 0 0 0 0 0 0 139.851 0 0 0 0 0 0 0 0 0 0 0 0 0 0 0 0 0 0 0 0 0 0 0 0 0 0 0 0 0 0 0 0 0 0 0 
0 0 0 0 0 0 0 0 0 0 0 0 0 0 0 0 0 0 0 0 585.727 0 0 0 0 0 0 0 0 0 0 0 0 0 0 0 0 0 0 0 0 0 0 0 0 0 0 0 0 0 0 0 0 0 0 0 0 0 0 0 0 0 0 0 0.03 0 0 
0 0 0 0 0 0 0 0 0 0 0 1218.99 0 0 0 0 0 0 0 0 0 0 219.504 0 0 0 0 0 0 0 0 0 0 0 0 0 0 0 0 0 0 0 0 0 0 0 0 0 0 0 0 0 0 0 0 0 0 0 0 0 0 0 0 0 0 0.07 0 
0 0 0 0 0 0 0 0 0 0 0 0 0 0 0 0 0 0 0 0 0 0 0 0 0 0 0 0 0 0 0 0 0 0 0 0 0 0 0 0 0 0 0 0 0 0 0 0 0 1807.08 0 0 0 0 0 0 0 1217.31 0 0 0 0 0 0 0 0 0 
