*Vertices 67
*Matrix 
0.01 0 0 0 0 2346.19 0 0 -543.458 50.2792 0 0 0 -2323.45 -2175.89 0 0 0 0 0 1383.18 0 0 2311.4 1233.02 2120.96 0 0 1563.08 0 0 0 0 -439.39 0 0 0 2079.61 1360.9 90.2585 0 1986.37 0 0 0 0 0 -1150.93 0 0 0 0 0 -1335.11 2423.86 -1113.7 0 0 0 0 990.707 0 0 0 0 2125.54 1319.24 
0 0.08 0 -2476.2 0 -1447.57 0 0 0 0 0 176.473 0 0 2396.69 0 0 0 1229.82 0 0 -686.132 0 0 0 0 1866.59 -1096.76 0 2375.18 0 0 0 0 0 0 0 0 0 1220.97 0 0 0 0 0 0 0 0 0 0 0 0 0 0 0 0 0 0 0 0 0 0 0 0 0 0 0 
0 0 0.03 0 0 0 0 -1464.96 0 0 0 0 0 0 0 221.641 0 0 -1055.25 0 0 2400.66 0 1445.43 0 1773.81 0 0 0 0 0 -1629.31 0 2201.38 0 -738.014 -304.041 0 0 0 0 0 1127.28 0 0 0 0 -604.801 646.153 0 1901.38 0 0 0 0 501.648 0 0 -493.408 0 187.46 -2079.3 0 0 0 0 0 
0 -455.412 0 0.07 0 0 0 0 0 0 0 0 0 0 0 0 0 0 -109.943 0 0 0 0 0 0 0 0 0 0 0 0 0 0 -302.362 0 0 0 2001.48 0 -428.098 1467.56 0 0 0 0 0 0 0 1874.22 0 0 0 0 0 0 0 -1300.47 0 0 0 0 0 0 0 0 0 0 
0 0 0 0 0.05 481.506 0 0 764.565 0 0 0 0 0 -1948.68 0 0 0 1241.42 0 509.43 2294.76 0 0 -1478.85 0 620.975 0 0 0 0 0 0 1988.36 1539.74 0 0 0 0 0 0 0 0 0 0 -400.021 0 1880.02 0 0 0 0 421.537 0 0 0 71.4896 0 0 -1638.16 0 0 0 -756.172 0 0 0 
1918.01 1681.95 0 0 352.107 0.04 0 0 0 0 0 -1146.81 0 0 0 0 0 0 -1031.6 -7.40074 2202.9 0 0 0 0 0 0 1475.49 0 237.51 0 0 618.381 0 0 -19.6081 0 1240.96 0 756.325 0 513.855 0 0 695.593 0 0 0 0 0 0 0 0 -1638.77 0 0 0 0 0 0 -357.143 0 0 0 0 0 0 
0 0 0 0 0 0 0.07 0 0 0 0 0 0 0 0 0 1632.05 0 15.4881 1689.43 0 1238.21 2487.79 0 -849.254 1303.52 108.722 0 0 0 0 0 0 0 0 -1433.23 0 1114.46 0 665.075 -689.642 0 0 2459.87 0 0 0 -1073.26 2327.88 2452.09 0 0 0 180.593 0 0 0 0 0 0 -2348.93 0 0 0 0 0 0 
0 0 1448.64 0 0 0 0 0.06 -2087.24 0 -353.938 0 0 2371.67 0 0 0 2138.05 0 -1106.98 0 0 0 0 0 -802.866 0 -1232.72 0 0 0 0 -612.125 0 1668.22 2018.27 0 0 0 0 -929.365 0 0 -1817 0 0 0 0 0 0 0 0 0 0 1155.05 0 0 0 0 0 0 0 0 0 0 0 0 
1369.75 0 0 0 1045.18 0 0 1510.28 0.06 0 0 776.772 0 0 -688.879 0 0 1209.22 0 0 0 0 0 0 0 0 -1782.97 265.74 0 0 0 0 0 0 0 -564.058 0 0 0 -459.075 0 0 0 0 0 0 1537.45 158.773 -700.781 0 0 94.6837 0 0 0 0 0 0 0 -259.178 0 0 -2147.36 1998.73 28.7637 0 0 
1684.39 0 0 0 0 0 0 0 0 0 0 0 0 0 0 0 0 0 -1904.13 0 0 0 0 0 0 0 0 0 0 2456.82 0 0 -783.029 0 0 2160.18 0 0 0 0 -598.544 796.915 0 0 2325.74 -255.364 0 0 -1715.83 0 0 0 0 1987.75 0 0 0 0 0 0 0 0 0 0 0 0 1896.65 
0 0 0 0 0 0 0 -10.9104 0 0 0 622.806 0 0 -20.2185 0 0 375.912 0 0 0 0 -1479.77 -773.568 0 0 0 0 0 0 0 0 0 0 0 0 0 0 0 0 0 0 1393.25 1941.51 0 0 0 0 0 0 0 0 0 0 0 268.029 0 0 0 0 0 0 0 0 0 0 0 
0 958.815 0 0 0 -196.005 0 0 -1687.9 0 2093.8 0.03 0 1569.03 0 0 0 -1946.85 429.624 0 0 0 0 0 0 0 0 1546.45 0 0 1408.35 1027.33 0 0 0 0 -197.836 0 -622.044 0 0 0 0 -1028.7 2117.76 0 -42.6496 0 2146.9 0 0 0 287.255 0 688.726 1243.1 0 0 0 0 0 0 0 0 0 0 0 
0 0 0 0 0 0 0 0 0 0 0 0 0.08 0 0 0 0 0 0 -1726.36 0 0 0 0 0 0 0 -59.74 1284.45 676.519 0 0 0 0 0 -132.832 0 0 0 0 0 0 0 1545.08 0 0 2128.59 0 0 0 0 0 0 0 0 0 0 0 0 0 0 0 0 0 0 0 0 
1060.75 0 0 0 0 0 0 1105.91 0 0 0 561.159 0 0.02 0 1071.12 0 0 0 0 357.143 0 0 0 0 0 0 0 0 -2343.29 -1083.03 0 0 -397.58 2194.36 0 -1139.18 0 0 0 0 -262.078 0 817.057 -169.607 0 0 0 2386.32 792.947 0 0 0 0 0 0 0 0 0 2310.63 0 0 0 0 0 1315.73 0 
-1060.59 2265.31 0 0 1892.53 0 0 0 -335.475 0 1011.31 0 0 0 0.07 0 79.8822 1495.64 0 320.978 0 0 408.414 0 0 0 0 1348.69 0 0 0 0 -387.051 -2107.99 432.371 0 0 -1370.36 0 -1197.01 0 1432 0 0 0 0 1401.64 0 0 -1172.29 0 0 0 0 1217.46 0 0 -879.772 0 0 0 0 0 0 -255.669 0 0 
0 0 -465.178 0 0 0 0 0 0 0 0 0 0 -2265.92 0 0.04 0 -2099.6 291.375 0 0 0 -1211.97 569.552 0 2124.77 0 1993.7 0 1699.5 0 -515.534 0 2200.31 0 749.458 0 0 -1874.37 1437.5 0 0 0 -2343.75 0 0 -610.446 2067.55 0 0 0 0 0 0 0 0 0 608.768 0 0 0 0 0 0 0 0 2215.11 
0 0 0 0 0 0 506.378 0 0 0 0 0 0 0 1221.73 0 0.01 769.753 0 633.03 0 -1772.74 0 0 0 724.433 0 0 0 0 0 -1551.48 0 0 0 0 0 0 2442.47 0 0 0 0 0 0 0 0 0 0 0 1927.63 0 0 0 0 0 0 0 0 0 0 0 0 0 0 0 0 
0 0 0 0 0 0 0 1479.61 -1565.22 0 -1369.75 -1394.47 0 0 1239.59 2114.55 1208.3 0.09 -443.968 -1142.84 0 0 0 1736.12 0 194.784 0 0 0 0 0 1594.06 0 0 -2208.24 0 0 -2414.55 0 0 0 0 0 2013.99 0 0 0 0 0 0 0 0 0 0 1790.6 0 0 0 0 0 0 0 0 0 0 0 0 
0 1510.74 -1008.87 2149.04 2039.78 1104.69 -752.815 0 0 -790.963 0 550.478 0 0 0 1254.54 0 -915.021 0.05 2365.87 0 0 0 -321.131 0 -416.044 0 0 0 0 0 0 0 0 0 0 -491.424 0 -673.925 0 0 0 0 0 -9.99481 0 0 0 0 0 0 0 0 0 0 0 0 0 -2089.07 0 0 1550.57 0 -1049 0 0 0 
0 0 0 0 0 2386.93 2327.42 -460.601 0 0 0 0 545.137 0 2366.63 0 2284.23 1288.26 922.803 0.01 0 -1949.29 0 0 1376.31 0 -626.316 1404.84 0 0 1785.87 0 982.467 0 0 2037.64 -38.2244 0 0 -324.488 565.279 0 0 0 0 1715.52 0 0 0 0 0 0 0 0 0 0 0 0 0 -1158.25 0 -1159.78 -908.46 0 0 0 -2489.62 
-515.839 0 0 0 -2145.53 -801.645 0 0 0 0 0 0 0 2265.92 0 0 0 0 0 0 0.02 0 0 0 0 19.6081 0 882.061 0 -1090.66 1287.5 0 0 0 1124.23 0 62.7918 0 1910.99 0 167.165 0 0 0 0 -1732.31 0 0 0 0 0 0 0 0 0 -481.048 0 0 0 0 1148.79 0 0 0 -387.967 0 0 
0 1932.2 1053.73 0 2315.36 0 486.999 0 0 0 0 0 0 0 0 0 -570.009 0 0 -629.673 0 0.04 2315.97 0 0 814.463 508.362 -1629.92 2390.59 0 0 275.506 0 0 0 0 0 0 0 0 0 0 635.167 -1623.2 0 0 0 1811.96 0 0 0 0 -2355.95 0 0 0 0 0 0 0 0 0 571.841 0 0 0 -1592.99 
0 0 0 0 0 0 -1554.38 0 0 0 2374.42 0 0 0 -421.079 2269.13 0 0 0 0 0 1912.98 0 681.402 0 0 0 0 -629.521 0 1092.49 0 0 0 0 0 1919.84 -752.358 0 0 0 0 0 0 0 -210.807 815.989 0 -1638.92 210.196 0 0 0 0 0 0 0 0 0 0 0 0 1499.76 0 0 0 0 
2117.91 0 2247.92 0 0 0 0 0 0 0 1250.72 0 0 0 0 -1173.06 0 2147.21 2344.66 0 0 0 -637.303 0.07 0 0 0 0 0 0 1389.58 0 0 0 0 1872.84 -487.304 0 0 0 0 0 -2476.96 0 0 -1699.5 0 0 629.215 0 0 0 0 0 0 0 0 0 746.254 0 0 0 0 0 252.312 -1157.95 -30.9 
-200.735 0 0 0 -2413.48 0 2427.21 0 0 0 0 0 0 0 0 0 0 0 0 -149.617 0 0 0 0 0.01 0 0 1900.46 0 0 0 0 0 2473.3 0 0 -626.011 2000.87 0 0 2144 0 0 0 0 -1473.82 0 0 0 0 0 0 2179.4 0 0 -85.0703 0 0 0 0 -281.304 0 0 0 0 0 0 
1727.58 0 -1171.83 0 0 0 -148.549 264.824 0 0 0 0 0 0 0 1993.09 1279.11 -2117.91 1288.87 0 1522.95 -1162.22 0 0 0 0.01 0 0 0 0 0 866.192 0 2465.82 0 0 0 0 0 -2299.8 0 0 1598.18 0 334.101 -2334.59 971.633 0 744.27 1796.4 0 0 -729.621 0 -573.672 0 -170.522 0 0 0 0 0 0 0 925.55 0 0 
0 902.356 0 0 549.562 0 -972.701 0 -1379.97 0 0 0 0 0 0 0 0 0 0 -686.285 0 -1190.6 0 0 0 0 0.07 0 2153.92 0 0 0 0 0 2023.61 308.771 0 1323.82 -851.848 0 0 0 2444.46 0 21.1341 -892.59 0 0 0 0 0 -1305.05 0 0 0 0 0 0 0 0 0 0 0 0 0 0 0 
0 2313.53 0 0 0 -434.66 0 641.728 82.4763 0 0 1231.65 -94.0733 0 2274.01 -1351.59 0 0 0 2194.51 14.2674 -486.084 0 0 1764.5 0 0 0 -40.9711 0 0 0 0 0 1199.15 0 -2219.53 0 0 0 0 0 1669.13 1546.45 0 0 0 0 0 924.329 0 0 0 0 0 0 0 0 0 0 0 -1711.4 0 0 0 0 0 
1697.67 0 0 0 0 0 0 0 0 0 0 0 1771.68 0 0 0 0 0 0 0 0 -1737.34 967.36 0 0 0 260.704 1903.06 0.05 0 0 0 0 0 0 2462.92 0 0 0 0 0 727.485 0 0 0 -766.396 0 0 0 -2062.21 0 0 0 0 0 0 0 0 0 0 0 -2262.57 0 0 0 0 0 
0 -1253.32 0 0 0 -1427.12 0 0 0 1110.19 0 0 98.1933 -815.683 0 987.808 0 0 0 0 -1688.97 0 0 0 0 0 0 0 0 0.05 0 0 0 0 2219.84 0 0 0 0 0 0 0 0 0 0 -266.808 0 2368.31 0 0 1404.69 -333.949 0 0 0 0 0 0 0 0 1302.3 0 0 0 -1983.93 0 0 
0 0 0 0 0 0 0 0 0 0 0 2299.49 0 2322.69 0 0 0 0 0 -474.334 -210.501 0 -2177.27 -680.181 0 0 0 0 0 0 0.05 0 2393.49 2135.3 0 0 0 0 441.374 1685.16 0 0 0 0 0 0 0 0 917.92 0 0 0 0 0 0 0 0 -2082.96 0 0 0 0 0 0 0 0 0 
0 0 267.418 0 0 0 0 0 0 0 0 -1001.85 0 0 0 619.297 -171.59 1094.47 0 0 0 -933.943 0 0 0 -852.458 0 0 0 0 0 0.09 2060.99 672.857 0 0 598.239 0 -917.31 2344.05 0 0 0 0 0 0 0 -1096.3 0 0 0 0 0 0 0 0 0 0 0 0 0 0 0 0 0 0 0 
0 0 0 0 0 -111.621 0 932.112 0 2493.9 0 0 0 0 -1412.17 0 0 0 0 964.919 0 0 0 0 0 0 0 0 0 0 310.907 -1697.21 0.03 0 0 -156.178 0 0 0 0 0 0 0 0 0 0 0 0 0 0 0 1620.76 0 0 -264.061 0 0 1791.67 0 0 0 0 1749.4 0 0 0 0 
2213.28 0 -1966.84 1384.55 -2118.67 0 0 0 0 0 0 0 0 1099.35 -2304.83 -1989.58 0 0 0 0 0 0 0 0 247.124 1097.37 0 0 0 0 1332.67 -1195.49 0 0.05 0 0 0 1422.24 0 0 0 0 -298.242 0 0 0 0 -987.503 0 0 0 386.441 0 -683.233 0 0 0 0 0 0 0 2123.4 0 -406.583 0 0 0 
0 0 0 0 1314.36 0 0 2097.92 0 0 0 0 0 1157.8 236.9 0 0 2389.98 0 0 -1341.21 0 0 0 0 0 525.605 -2171.93 0 -2036.88 0 0 0 0 0.06 -1028.7 0 2031.08 0 0 0 764.87 1349.91 0 0 0 842.082 0 0 0 0 0 0 0 0 0 0 -1817.45 0 0 0 0 0 0 0 2027.12 0 
0 0 2127.06 0 0 1565.98 2050.31 -1720.86 1553.62 1449.4 0 0 -2057.63 0 0 229.728 0 0 0 1288.26 0 0 0 -913.495 0 0 1786.78 0 958.205 0 0 0 -1660.13 0 2216.03 0.05 0 0 -1118.58 -79.577 0 0 1783.27 1213.03 0 0 0 373.775 0 0 0 0 -1576.2 0 0 0 0 0 0 0 0 0 0 0 0 0 0 
0 0 -217.368 0 0 0 0 0 0 0 0 2303.61 0 1921.83 0 0 0 0 1567.96 -711.463 -2233.88 0 988.113 -73.6259 -187.613 0 0 -1230.43 0 0 0 -1595.58 0 0 0 0 0.07 0 0 -329.218 2012.47 0 0 2121.11 0 0 0 0 0 0 0 0 0 0 0 0 1241.26 0 0 -2147.36 0 -1112.78 0 0 0 0 0 
1315.73 0 0 1390.8 0 461.974 -187.46 0 0 0 0 0 0 0 115.741 0 0 987.96 0 0 0 0 1162.68 0 -1665.17 0 -1208.3 0 0 0 0 0 0 1280.94 134.205 0 0 0 1205.86 607.395 0 0 -792.642 1758.4 0 0 0 0 0 0 0 0 0 -689.337 678.503 0 0 0 -1076.31 0 0 0 0 0 0 0 0 
1291.31 0 0 0 0 0 0 0 0 0 0 1186.64 0 0 0 -159.23 1502.5 0 1574.98 0 2094.1 0 0 0 0 0 -177.694 0 0 0 -2459.72 859.02 0 0 0 258.263 0 1821.27 0.07 0 -971.938 1090.5 0 0 0 -1008.56 0 0 -1238.21 0 0 0 2160.18 0 0 0 1036.18 0 0 2467.5 0 0 0 0 0 0 0 
1240.96 -2210.53 0 -908.612 0 2294.46 1024.89 0 1524.17 0 0 0 0 0 1650.36 448.851 0 0 0 487.152 0 0 0 0 0 1719.64 0 0 0 0 -1683.32 2473.75 0 0 0 2073.81 -466.399 1414.91 0 0.08 0 -516.755 -1426.36 368.13 0 0 0 0 0 0 0 0 0 0 0 280.389 0 0 0 0 0 0 0 0 0 0 0 
0 0 0 1218.53 0 0 -2427.06 538.575 0 1041.98 0 0 0 0 0 0 0 0 0 2175.59 1346.55 0 0 0 848.949 0 0 0 0 0 0 0 0 0 0 0 2282.4 0 2088.15 0 0.05 0 0 0 0 0 2151.17 -1550.87 955.458 0 0 0 0 0 0 0 0 0 -2197.1 -1672.34 0 0 0 826.518 0 2120.5 0 
2408.29 0 0 0 0 1224.63 0 0 0 2180.62 0 0 0 1147.57 362.026 0 0 0 0 0 0 0 0 0 0 0 0 0 1431.39 0 0 0 0 0 1251.34 0 0 0 -639.286 393.307 0 0 0 -1898.48 0 0 0 0 -2398.83 -2414.85 0 0 0 0 -379.574 0 0 632.115 0 0 2092.12 0 0 0 0 0 -1058.76 
0 0 100.482 0 0 0 0 0 0 0 -635.319 0 0 0 0 0 0 0 0 0 0 1923.51 0 -1858.04 0 2010.03 1744.36 -53.3311 0 0 0 0 0 2346.64 1950.21 623.417 0 1823.86 0 2121.57 0 0 0.09 0 0 0 0 0 0 0 0 0 -2425.53 0 0 0 0 0 0 1995.83 0 0 0 0 0 0 0 
0 0 0 0 0 0 -1846.75 2440.95 0 0 887.707 -55.62 -1060.9 1101.79 0 1565.98 0 306.635 0 0 0 2139.88 0 0 0 0 0 -1534.24 0 0 0 0 0 0 0 -340.205 1287.5 360.195 0 1521.27 0 -996.353 0 0.09 0 -774.483 -955.458 0 1814.1 0 0 0 0 299.463 0 0 0 0 0 -2016.89 0 0 0 0 0 0 0 
0 0 0 0 0 147.328 0 0 0 -937.91 0 1909.16 0 217.673 0 0 0 0 -781.961 0 0 0 0 0 0 674.535 2341.61 0 0 0 0 0 0 0 0 0 0 0 0 0 0 0 0 0 0.07 0 0 0 0 0 0 0 0 1558.81 0 0 0 0 1810.59 0 0 0 0 0 0 0 0 
0 0 0 0 -198.752 0 0 0 0 2465.82 0 0 0 0 0 0 0 0 0 -1310.69 -642.491 0 1152.15 948.134 804.086 681.402 2108.14 0 1715.22 994.674 0 0 0 0 0 0 0 0 2100.97 0 0 0 0 -1887.04 0 0.01 0 0 0 0 0 0 -2124.62 0 0 0 -1541.72 2496.34 0 0 0 0 0 0 0 0 0 
0 0 0 0 0 0 0 0 1343.65 0 0 1970.5 967.36 0 -2069.69 257.347 0 0 0 0 0 0 2412.87 0 0 -2124.77 0 0 0 0 0 0 0 0 279.321 0 0 0 0 0 841.319 0 0 2320.4 0 0 0.08 0 0 0 0 0 0 0 0 0 -2226.71 0 0 0 0 0 0 0 -1765.88 0 0 
1279.41 0 479.98 0 -1726.81 0 -577.792 0 1061.51 0 0 0 0 0 0 1789.53 0 0 0 0 0 506.989 0 0 0 0 0 0 0 1727.12 0 -1351.74 0 170.37 0 1651.89 0 0 0 0 615.329 0 0 0 0 0 0 0.04 0 0 0 0 0 0 0 0 0 0 0 0 0 -60.9607 0 0 0 0 38.5296 
0 0 816.446 961.867 0 0 826.365 0 2294.31 -505.921 0 -1999.04 0 372.097 0 0 0 0 0 0 0 0 2180.01 -256.127 0 1887.49 0 0 0 0 -712.531 0 0 0 0 0 0 0 -1901.23 0 -2030.78 823.466 0 -435.575 0 0 0 0 0.03 0 -488.067 0 0 0 0 0 0 0 0 0 0 0 0 0 0 0 0 
0 0 0 0 0 0 61.7237 0 0 0 0 0 0 1061.36 -473.724 0 0 0 0 0 0 0 1692.18 0 0 -2076.86 0 1225.85 -996.963 0 0 0 0 0 0 0 0 0 0 0 0 1455.05 0 0 0 0 0 0 0 0.09 0 0 0 0 0 0 0 0 429.624 0 370.266 0 -1259.73 0 0 0 0 
0 0 1458.71 0 0 0 0 0 0 0 0 0 0 0 0 0 -2211.91 0 0 0 0 0 0 0 0 0 0 0 0 504.7 0 0 0 0 0 0 0 0 0 0 0 0 0 0 0 0 0 0 1954.33 0 0.04 0 0 739.54 0 0 -1010.24 -1637.39 0 441.527 0 0 0 0 0 0 0 
0 0 0 0 0 0 0 0 -183.34 0 0 0 0 0 0 0 0 0 0 0 0 0 0 0 0 0 2238.61 0 0 -2483.67 0 0 2278.44 -7.40074 0 0 0 0 0 0 0 0 0 0 0 0 0 0 0 0 0 0.03 0 729.316 0 0 0 0 0 0 0 2399.44 0 0 0 -276.574 0 
0 0 0 0 -2110.43 0 0 0 0 0 0 93.0052 0 0 0 0 0 0 0 0 0 -17.777 0 0 163.656 -850.475 0 0 0 0 0 0 0 0 0 635.319 0 0 2360.68 0 0 0 2464.75 0 0 -278.253 0 0 0 0 0 0 0.09 0 0 0 0 0 0 0 0 0 0 1676.61 0 0 0 
1914.35 0 0 0 0 -149.007 -110.706 0 0 -769.448 0 0 0 0 0 0 0 0 0 0 0 0 0 0 0 0 0 0 0 0 0 0 0 1044.88 0 0 0 1702.25 0 0 0 0 0 1664.4 2062.97 0 0 0 0 0 838.878 -1707.43 0 0.02 0 0 0 0 0 0 0 0 0 0 0 0 91.174 
353.023 0 0 0 0 0 0 268.181 0 0 0 -1545.84 0 0 2062.82 0 0 1007.03 0 0 0 0 0 0 0 364.162 0 0 0 0 0 0 2213.74 0 0 0 0 133.442 0 0 0 2393.03 0 0 0 0 0 0 0 0 0 0 0 0 0.01 0 0 0 0 0 0 0 0 -1010.39 0 0 0 
497.07 0 -524.079 0 0 0 0 0 0 0 -1022.75 1396.6 0 0 0 0 0 0 0 0 1101.18 0 0 0 2499.39 0 0 0 0 0 0 0 0 0 0 0 0 0 0 -922.498 0 0 0 0 0 0 0 0 0 0 0 0 0 0 0 0.03 0 0 0 0 0 0 0 0 0 0 0 
0 0 0 1651.89 1662.42 0 0 0 0 0 0 0 0 0 0 0 0 0 0 0 0 0 0 0 0 1558.2 0 0 0 0 0 0 0 0 0 0 -2299.65 0 1538.21 0 0 0 0 0 0 385.067 -1462.83 0 0 0 2336.27 0 0 0 0 0 0.06 0 595.34 0 0 0 0 0 0 0 0 
0 0 0 0 0 0 0 0 0 0 0 0 0 0 -677.282 1506.32 0 0 0 0 0 0 0 0 0 0 0 0 0 0 -1629.31 0 -2118.67 0 1865.52 0 0 0 0 0 0 1138.72 0 0 0 1605.35 0 0 0 0 1827.22 0 0 0 0 0 0 0.06 0 0 0 0 0 0 0 0 0 
0 0 781.35 0 0 0 0 0 0 0 0 0 0 0 0 0 0 0 -415.891 0 0 0 0 1597.57 0 0 0 0 0 0 0 0 0 0 0 0 0 2210.38 0 0 -1592.38 0 0 0 1395.84 0 0 0 0 240.715 0 0 0 0 0 0 -2098.68 0 0.02 0 0 0 0 -518.433 0 0 0 
0 0 0 0 1111.1 0 0 0 1952.5 0 0 0 0 409.787 0 0 0 0 0 181.051 0 0 0 0 0 0 0 0 0 0 0 0 0 0 0 0 2196.49 0 2120.96 0 688.116 0 -2309.56 1883.37 0 0 0 0 0 0 196.768 0 0 0 0 0 0 0 0 0.03 0 0 0 0 0 0 0 
1497.47 0 -1562.32 0 0 -1509.52 70.4215 0 0 0 0 0 0 0 0 0 0 0 0 0 1646.24 0 0 0 -225.608 0 0 0 0 506.073 0 0 0 0 0 0 0 0 0 0 0 -1203.73 0 0 0 0 0 0 0 2096.85 0 0 0 0 0 0 0 0 0 0 0.03 0 0 0 0 -1559.57 0 
0 0 1811.04 0 0 0 0 0 0 0 0 0 0 0 0 0 0 0 1273.92 2049.09 0 0 0 0 0 0 0 -159.23 -1528.14 0 0 0 0 1964.4 0 0 2120.04 0 0 0 0 0 0 0 0 0 0 1317.56 0 0 0 919.752 0 0 0 0 0 0 0 0 0 0.03 0 0 0 2277.83 0 
0 0 0 0 0 0 0 0 1448.33 0 0 0 0 0 0 0 0 0 0 215.995 0 1881.39 -20.9815 0 0 0 0 0 0 0 0 0 -1202.81 0 0 0 0 0 0 0 0 0 0 0 0 0 0 0 0 840.251 0 0 0 0 0 0 0 0 0 0 0 0 0.07 0 0 0 0 
0 0 0 0 448.851 0 0 0 2399.75 0 0 0 0 0 0 0 0 0 -1191.21 0 0 0 0 0 0 0 0 0 0 0 0 0 0 347.224 0 0 0 0 0 0 1531.8 0 0 0 0 0 0 0 0 0 0 0 -1056.63 0 -1387.75 0 0 0 313.959 0 0 0 0 0.04 -90.4111 0 0 
0 0 0 0 0 0 0 0 1107.59 0 0 0 0 0 -164.724 0 0 0 0 0 1671.88 0 0 -1580.17 0 1339.99 0 0 0 1189.99 0 0 0 0 0 0 0 0 0 0 0 0 0 0 0 0 2351.99 0 0 0 0 0 0 0 0 0 0 0 0 0 0 0 0 -2462.61 0.08 1807.54 0 
-1844 0 0 0 0 0 0 0 0 0 0 0 0 -2408.75 0 0 0 0 0 0 0 0 0 -2233.42 0 0 0 0 0 0 0 0 0 0 -1809.37 0 0 0 0 0 2319.33 0 0 0 0 0 0 0 0 0 0 1377.83 0 0 0 0 0 0 0 0 660.649 2106.77 0 0 1887.19 0.01 0 
-2173.45 0 0 0 0 0 0 0 0 16.2511 0 0 0 0 0 -1248.13 0 0 0 471.892 0 583.743 0 297.327 0 0 0 0 0 0 0 0 0 0 0 0 0 0 0 0 0 1135.67 0 0 0 0 0 -56.5355 0 0 0 0 0 2189.32 0 0 0 0 0 0 0 0 0 0 0 0 0.09 
