*Vertices 54
*Matrix 
0.02 0 0 0 0 0 0 0 0 0 0 292.596 0 0 0 0 0 0 0 0 0 0 0 0 0 0 0 0 0 0 0 0 0 1954.33 0 0 0 0 0 0 1677.37 0 0 0 0 0 0 0 0 0 -1126.82 0 0 0 
0 0 0 0 0 -833.842 0 0 0 0 460.601 1240.35 0 0 0 0 -2242.58 0 0 0 0 0 0 0 0 2459.11 0 0 0 0 1284.6 0 0 0 0 0 0 432.981 0 0 -1001.69 0 0 0 0 0 0 0 0 0 0 0 0 0 
0 0 0.01 0 0 2056.26 -1987.59 0 0 0 0 0 0 0 0 0 1742.84 0 0 0 0 0 0 -614.566 0 0 0 1258.05 -1514.25 0 0 0 0 0 0 0 -2460.78 0 0 0 0 0 0 0 0 0 0 0 2460.48 0 0 0 0 0 
0 0 0 0.02 0 0 1124.84 0 1835 0 -407.193 0 0 0 0 -2270.2 0 0 0 0 0 0 0 0 1392.64 0 0 2492.68 0 0 0 517.212 1832.87 0 2100.51 0 0 0 0 0 1111.71 0 -1304.59 674.535 0 0 0 0 0 0 -562.838 0 0 0 
0 0 0 0 0.03 0 2408.44 0 0 0 0 0 0 0 0 0 -2117.6 0 0 0 0 0 0 0 0 0 0 -1571.63 0 0 0 0 1681.65 0 0 0 0 0 0 2092.58 2277.67 0 0 0 0 -1791.06 0 0 0 0 0 0 0 0 
0 2101.73 1993.85 0 0 0.06 0 0 0 0 0 0 -674.383 0 0 0 0 0 -627.689 0 -1263.08 0 1731.7 0 0 0 0 0 0 0 0 1308.1 0 0 0 0 -2208.24 0 0 1981.64 0 0 0 0 0 0 1092.18 0 0 0 170.217 0 0 0 
0 0 636.235 -192.343 879.925 0 0 0 0 0 0 0 -1117.51 0 0 0 -514.313 0 0 0 0 0 1648.38 0 0 0 -2287.44 0 0 0 0 0 2272.03 96.82 0 0 0 0 0 0 0 0 0 0 0 0 0 0 0 0 0 0 0 0 
0 0 0 0 0 0 0 0.03 0 -206.076 0 0 0 2334.59 0 0 0 0 0 0 0 0 0 0 0 0 0 0 0 0 0 -699.561 0 0 0 0 0 0 0 0 0 0 1758.4 0 0 0 0 0 2165.36 -2035.2 0 0 0 0 
0 0 0 -33.9518 0 0 0 0 0.02 0 0 0 0 1903.21 0 0 0 0 0 -1415.37 0 0 0 0 0 -453.124 0 0 0 0 0 0 0 0 1297.42 0 1438.11 0 0 0 0 0 0 0 0 -692.083 0 0 0 0 0 -280.236 0 0 
0 0 0 0 0 0 0 -1123 0 0 987.35 0 0 0 0 0 1139.18 0 0 0 0 -1891.46 0 -1517.3 0 0 0 0 -506.531 1947.61 0 0 0 0 0 0 0 0 0 -2.21259 485.778 0 0 1942.43 0 0 0 0 0 1910.38 0 0 0 0 
0 -775.094 0 2064.5 0 0 0 0 0 1870.4 0.01 0 0 0 1302.61 0 0 0 0 2034.75 0 0 0 2003.16 0 0 0 367.824 0 0 0 1139.33 0 0 -2126.3 0 0 0 16.8615 0 0 0 0 0 0 0 0 0 0 0 496.155 0 0 0 
678.961 -272.301 0 0 0 0 0 0 0 0 0 0.05 0 0 0 0 -1577.58 0 0 0 0 0 0 0 0 0 0 0 0 -1019.39 0 0 0 0 0 0 0 2347.71 0 0 0 0 0 0 0 0 1589.79 1198.23 0 0 0 0 0 0 
0 0 0 0 0 1841.72 2055.35 0 0 0 0 0 0.06 0 0 0 0 0 0 0 0 0 0 -1764.81 0 0 0 0 0 0 0 -650.426 0 2112.57 0 0 0 0 0 0 0 0 0 0 0 0 0 0 0 -1442.69 0 0 0 0 
0 0 0 0 0 0 0 716.803 1814.4 0 0 0 0 0.02 2276.3 0 0 0 0 0 0 0 0 0 0 0 392.087 0 0 0 0 0 0 0 0 0 0 2155.6 0 0 0 0 0 0 0 0 0 1338.47 0 0 0 0 0 0 
0 0 0 0 0 0 0 0 0 0 2065.11 0 0 2471.92 0.09 0 0 0 1094.16 0 0 0 0 0 0 0 0 -897.473 0 0 0 0 0 0 0 0 0 0 0 0 -652.715 0 0 0 0 1860.79 0 0 0 0 0 0 0 0 
0 0 0 -113.3 0 0 0 0 0 0 0 0 0 0 0 0.03 0 0 0 0 0 -2007.74 0 0 0 0 0 0 0 0 0 0 2495.12 0 0 0 0 0 0 0 0 893.811 0 0 0 0 0 0 0 -1034.65 0 0 0 0 
0 -642.033 636.54 0 2196.65 0 2423.55 0 0 -1357.39 0 -1992.48 0 0 0 0 0.03 0 0 0 0 0 0 0 0 1199.76 0 0 -2263.94 0 0 0 2225.79 0 0 0 0 0 0 0 0 0 -170.98 -565.737 0 0 0 0 0 0 0 0 0 0 
0 0 0 0 0 0 0 0 0 0 0 0 0 0 0 0 0 0.03 0 0 0 0 0 0 0 1563.08 1653.87 0 0 0 0 0 0 -2356.56 0 -910.749 0 0 0 0 0 0 0 0 0 0 0 0 0 0 0 0 0 0 
0 0 0 0 0 1636.78 0 0 0 0 0 0 0 0 1066.85 0 0 0 0 0 0 1849.96 0 0 0 0 0 0 0 -1121.63 0 0 0 0 0 0 0 0 0 0 0 0 0 0 1460.69 -1364.71 0 0 0 -462.889 0 1590.85 0 0 
0 0 0 0 0 0 0 0 1394.47 0 -1954.79 0 0 0 0 0 0 0 0 0.03 0 0 1619.54 0 0 0 0 689.642 0 0 545.595 0 0 0 0 0 0 0 0 0 0 0 0 0 -587.1 0 0 2354.12 1639.07 0 0 0 0 0 
0 0 0 0 0 1481.6 0 0 0 0 0 0 0 0 0 0 0 0 0 0 0.06 0 0 0 0 0 0 0 1066.55 0 0 0 0 0 0 0 0 0 0 0 0 0 0 0 0 0 0 0 0 0 0 0 0 0 
0 0 0 0 0 0 0 0 0 -2285.45 0 0 0 0 0 1050.52 0 0 1000.02 0 0 0.01 0 0 0 0 0 0 0 0 0 17.9296 0 1659.67 0 0 0 0 0 0 0 0 0 0 0 0 0 303.43 2179.1 0 0 0 0 0 
0 0 0 0 0 -1436.89 1885.36 0 0 0 0 0 0 0 0 0 0 0 0 -1000.17 0 0 0.05 0 0 0 0 0 0 0 0 0 0 0 0 0 0 0 0 1963.18 0 0 0 0 0 -2165.36 232.933 0 0 919.752 0 0 0 319.758 
0 0 -2030.47 0 0 0 0 0 0 1916.49 -1498.38 0 -220.42 0 0 0 0 0 0 0 0 0 0 0.05 0 0 0 0 0 0 0 0 0 0 0 0 0 0 -5.87481 0 459.227 0 0 0 0 0 0 0 0 0 2091.05 2210.23 0 0 
0 0 0 1709.72 0 0 0 0 0 0 0 0 0 0 0 0 0 0 0 0 0 0 0 0 0.01 0 0 0 0 0 0 0 0 -953.627 0 0 0 0 0 0 0 0 65.6911 0 0 0 0 1972.95 0 0 0 0 0 0 
0 38.9874 0 0 0 0 0 0 290.155 0 0 0 0 0 0 0 289.087 1817.76 0 0 0 0 0 0 0 0.08 0 0 1448.64 0 0 0 0 -266.503 0 0 1871.93 930.433 0 0 0 -2426.6 0 0 899.762 0 0 0 0 0 0 0 0 0 
0 0 0 0 0 0 -562.838 0 0 0 0 0 0 1993.85 0 0 0 -78.5089 0 0 0 0 0 0 0 0 0.07 0 0 0 1757.79 0 0 0 0 0 0 -1162.83 1289.18 0 0 0 0 0 0 0 0 0 0 0 0 0 0 0 
0 0 -1340.75 -1746.19 1627.17 0 0 0 0 0 1667 0 0 0 -2257.07 0 0 0 0 1858.04 0 0 0 0 0 0 0 0.07 0 0 0 1488.31 0 0 0 0 0 -1925.64 212.18 0 0 0 0 0 2411.34 0 0 0 0 1563.54 0 -976.516 0 0 
0 0 -844.829 0 0 0 0 0 0 450.835 0 0 0 0 0 0 74.2363 0 0 0 -1589.94 0 0 0 0 1055.1 0 0 0.08 0 0 0 0 0 0 0 0 0 0 0 0 1806.77 0 1057.85 0 0 0 0 0 0 0 0 0 0 
0 0 0 0 0 0 0 0 0 2237.24 0 -483.184 0 0 0 0 0 0 1507.39 0 0 0 0 0 0 0 0 0 0 0.06 0 0 1081.8 0 0 0 0 849.406 0 -522.401 0 0 0 0 1505.1 0 0 0 0 0 0 0 0 0 
0 -491.882 0 0 0 0 0 0 0 0 0 0 0 0 0 0 0 0 0 459.227 0 0 0 0 0 0 -475.86 0 0 0 0.03 0 0 0 0 0 0 0 0 0 0 0 1122.7 0 0 0 1839.73 0 0 0 0 0 0 0 
0 0 0 2121.11 0 -328.303 0 -686.895 0 0 -436.949 0 538.118 0 0 0 0 0 0 0 0 -647.679 0 0 0 0 0 1743.9 0 0 0 0.08 656.835 0 0 0 0 0 0 0 0 0 0 0 0 0 0 0 0 0 0 2131.18 0 0 
0 0 0 -65.3859 -2151.78 0 1079.97 0 0 0 0 0 0 0 0 -973.922 1345.79 0 0 0 0 0 0 0 0 0 0 0 0 655.461 0 1697.06 0 1639.68 0 0 0 0 1633.27 0 0 0 0 0 0 -203.33 0 0 0 0 278.863 0 0 0 
-1395.38 0 0 0 0 0 1486.94 0 0 0 0 0 117.267 0 0 0 0 -141.072 0 0 0 1574.98 0 0 1859.72 -1053.88 0 0 0 0 0 0 2378.23 0.03 0 0 0 -1125.45 0 0 847.728 0 0 0 0 0 0 1009.63 0 0 0 0 0 0 
0 0 0 1652.81 0 0 0 0 1191.37 0 690.71 0 0 0 0 0 0 0 0 0 0 0 0 0 0 0 0 0 0 0 0 0 0 0 0.08 1734.6 0 0 0 0 -1919.84 0 0 0 0 0 -1542.02 0 0 0 0 0 0 0 
0 0 0 0 0 0 0 0 0 0 0 0 0 0 0 0 0 -1187.4 0 0 0 0 0 0 0 0 0 0 0 0 0 0 0 0 -481.811 0.02 0 0 0 0 0 0 0 0 1425.29 0 -1426.51 2367.85 0 0 0 0 0 0 
0 0 1461.15 0 0 723.06 0 0 -1902.91 0 0 0 0 0 0 0 0 0 0 0 0 0 0 0 0 -1403.16 0 0 0 0 0 0 0 0 0 0 0.01 693.762 0 0 0 0 0 0 0 1483.58 0 0 0 0 432.829 0 0 0 
0 1454.44 0 0 0 0 0 0 0 0 0 2371.67 0 1740.7 0 0 0 0 0 0 0 0 0 0 0 197.836 -1907.33 1744.51 0 -1705.3 0 0 0 1956.16 0 0 -1880.63 0 0 0 0 0 0 0 0 0 0 0 0 0 0 0 0 0 
0 0 0 0 0 0 0 0 0 0 -2296.14 0 0 0 0 0 0 0 0 0 0 0 0 483.489 0 0 -229.27 2043.29 0 0 0 0 -333.796 0 0 0 0 0 0.04 0 0 1715.52 0 937.605 1410.34 1365.63 0 0 0 0 0 0 0 0 
0 0 0 0 1997.36 2274.01 0 0 0 1030.69 0 0 0 0 0 0 0 0 0 0 0 0 -976.669 0 0 0 0 0 0 955 0 0 0 0 0 0 0 0 0 0.06 0 0 0 -587.252 0 0 0 0 745.338 0 -2495.42 0 0 0 
1585.51 1460.23 0 1378.44 1652.65 0 0 0 0 -985.366 0 0 0 0 100.177 0 0 0 0 0 0 0 0 -1416.29 0 0 0 0 0 0 0 0 0 84.0022 1162.68 0 0 0 0 0 0.05 0 0 0 -1634.19 0 -1378.6 0 0 0 0 2258.75 0 0 
0 0 0 0 0 0 0 0 0 0 0 0 0 0 0 1702.55 0 0 0 0 0 0 0 0 0 107.196 0 0 -41.7341 0 0 0 0 0 0 0 0 0 2143.09 0 0 0.01 0 -257.958 0 0 0 2003.62 0 0 0 0 0 0 
0 0 0 -354.396 0 0 0 -352.107 0 0 0 0 0 0 0 0 -100.482 0 0 0 0 0 0 0 2285.15 0 0 0 0 0 -280.389 0 0 0 0 0 0 0 0 0 0 0 0.07 0 0 0 0 0 1899.55 0 0 0 0 0 
0 0 0 460.753 0 0 0 0 0 1433.53 0 0 0 0 0 0 57.9089 0 0 0 0 0 0 0 0 0 0 0 2262.72 0 0 0 0 0 0 0 0 0 1286.43 -933.485 0 -671.789 0 0.08 0 0 0 0 0 0 1571.02 0 0 0 
0 0 0 0 0 0 0 0 0 0 0 0 0 0 0 0 0 0 -624.943 -1021.07 0 0 0 0 0 -940.657 0 1031.91 0 981.399 0 0 0 0 0 -1145.59 0 0 2425.53 0 -191.885 0 0 0 0 0 288.171 0 0 0 2114.09 0 0 0 
0 0 0 0 557.802 0 0 0 2330.47 0 0 0 0 0 2061.75 0 0 0 -711.921 0 0 0 1382.11 0 0 0 0 0 0 0 0 0 2079.15 0 0 0 889.843 0 -831.401 0 0 0 0 0 0 0.07 -2384.18 0 0 0 -2267.14 0 0 0 
0 0 0 0 0 1657.38 0 0 0 0 0 2094.1 0 0 0 0 0 0 0 0 0 0 868.938 0 0 0 0 0 0 0 -687.506 0 0 0 804.239 -2355.34 0 0 0 0 300.989 0 0 0 -95.1415 2270.04 0 -509.278 0 366.756 0 0 0 0 
0 0 0 0 0 0 0 0 0 0 0 -204.703 0 -511.109 0 0 0 0 0 1522.95 0 1666.54 0 0 -1704.23 0 0 0 0 0 0 0 0 -438.169 0 -1562.17 0 0 0 0 0 1577.12 0 0 0 0 1718.42 0.06 -1406.37 0 0 0 0 0 
0 0 -682.928 0 0 0 0 1296.2 0 0 0 0 0 0 0 0 0 0 0 2280.27 0 -915.937 0 0 0 0 0 0 0 0 0 0 0 0 0 0 0 0 0 2368.16 0 0 1008.41 0 0 0 0 -55.3148 0.01 -373.623 0 0 0 0 
0 0 0 0 0 0 0 -1209.22 0 1811.66 0 0 -674.688 0 0 2340.24 0 0 54.857 0 0 0 1717.35 0 0 0 0 1540.35 0 0 0 0 0 0 0 0 0 0 0 0 0 0 0 0 0 0 -1072.65 0 1741.16 0.01 0 0 0 0 
1231.35 0 0 -1558.5 0 -660.497 0 0 0 0 -913.038 0 0 0 0 0 0 0 0 0 0 0 0 -1053.27 0 0 0 0 0 0 0 0 -664.769 0 0 0 528.352 0 0 -497.833 0 0 0 1883.53 1013.75 1749.4 0 0 0 0 0.09 0 0 0 
0 0 0 0 0 0 0 0 601.138 0 0 0 0 0 0 0 0 0 2299.95 0 0 0 0 2100.36 0 0 0 -1315.42 0 0 0 -1202.66 0 0 0 0 0 0 0 0 1655.25 0 0 0 0 0 0 0 0 0 0 0.05 -1755.04 0 
0 0 0 0 0 0 0 0 0 0 0 0 0 0 0 0 0 0 0 0 0 0 0 0 0 0 0 0 0 0 0 0 0 0 0 0 0 0 0 0 0 0 0 0 0 0 0 0 0 0 0 975.143 0 0 
0 0 0 0 0 0 0 0 0 0 0 0 0 0 0 0 0 0 0 0 0 0 2012.31 0 0 0 0 0 0 0 0 0 0 0 0 0 0 0 0 0 0 0 0 0 0 0 0 0 0 0 0 0 0 0 
