*Vertices 62
*Matrix 
0 0 0 0 0 0 0 0 0 0 0 0 0 0 0 -773.568 0 1648.38 452.513 -196.921 0 0 1936.48 0 0 0 0 0 0 0 0 0 0 0 0 0 2309.56 0 1117.36 0 0 0 0 0 0 0 180.746 -2041.92 -190.207 0 0 0 2478.94 0 0 0 0 -2446.9 0 0 0 436.949 
0 0.04 0 613.651 -512.024 2376.71 0 0 0 1159.93 0 0 0 0 0 0 0 11.6733 0 0 2222.59 -1970.2 0 0 0 0 1381.34 0 0 0 2253.87 0 0 0 0 0 -2140.64 0 673.315 0 1907.94 -1323.21 0 -1893.9 0 0 -2.36518 0 -847.728 0 1068.22 0 -1051.29 0 0 0 1325.34 0 0 0 0 0 
0 0 0.09 -2132.71 0 1102.25 2159.57 0 0 0 0 0 0 0 0 0 0 1089.74 0 0 0 0 0 0 0 0 0 1166.34 0 2243.34 0 663.244 0 0 404.141 0 0 0 0 -473.266 0 79.1192 0 1219.14 0 870.922 0 0 -2088.76 0 -1087.76 1717.66 2408.44 1508.15 0 0 0 0 0 0 0 0 
0 2040.39 940.809 0.07 -1040.15 255.058 0 0 0 0 0 0 0 -2405.85 319.452 316.401 4.1963 913.953 -713.904 0 1858.04 0 765.023 0 0 0 2393.8 0 0 0 0 0 2029.71 -2084.95 1236.99 0 0 0 0 0 -1014.82 -817.972 0 0 0 0 0 0 0 0 0 0 -2324.06 0 0 0 0 0 0 -1769.84 0 0 
0 -1772.44 0 569.552 0 0 0 -940.809 -598.239 0 1938.92 0 0 0 0 0 0 -694.22 0 0 0 0 0 1670.2 0 1319.39 1218.38 -1049.3 0 0 0 0 -2106.46 0 0 0 0 1245.38 0 0 0 0 0 -1133.84 0 1025.19 0 0 834.452 0 0 0 -315.485 0 0 0 0 0 0 0 0 -225.455 
0 -2249.44 -1123.77 -701.849 0 0.01 0 0 0 0 0 0 0 0 0 0 0 0 0 0 0 -1502.96 0 0 0 1921.06 1260.95 0 0 0 1279.11 0 0 0 0 0 1044.88 -367.061 0 0 0 0 0 0 0 1872.23 0 0 -1066.7 0 0 0 0 1897.56 0 266.808 0 0 0 0 0 0 
0 0 2440.64 0 0 0 0.09 -540.559 0 2407.68 0 -1537.6 0 0 0 0 -676.061 0 1657.69 0 0 0 0 0 0 0 0 0 0 433.897 0 0 0 0 0 0 0 -350.734 0 0 1919.39 0 0 1935.71 0 1912.37 0 0 -1353.11 0 0 -1522.95 0 -268.944 0 0 2003.16 0 0 0 0 0 
0 0 0 0 -364.925 0 743.66 0.04 0 -1912.37 0 1585.21 0 0 0 0 1754.59 1366.54 0 0 0 0 0 0 0 0 0 -715.125 0 0 0 0 758.919 0 -932.722 0 -2113.94 0 0 0 1910.08 0 -918.989 0 1538.82 0 0 0 0 0 0 0 0 2295.22 0 0 0 0 0 0 0 0 
0 0 0 0 2181.69 0 0 0 0.02 0 0 0 1536.84 0 0 0 -1826.61 9.07926 0 0 0 -1515.78 0 1199.61 0 0 0 0 0 1887.49 0 0 0 0 0 0 0 0 0 0 0 1577.73 0 1993.39 0 -1629.76 0 0 1678.75 0 -221.183 56.8407 0 2392.42 1325.5 0 0 0 0 1864.91 0 0 
0 835.063 0 0 0 0 1285.36 1933.73 0 0 0 0 0 2008.04 0 1424.53 0 0 -1140.86 0 2026.35 2171.62 0 0 0 0 0 0 0 591.067 0 0 0 0 -403.989 -626.164 2243.19 0 0 1778.39 0 0 0 0 0 0 0 0 0 1344.87 0 0 0 -1471.53 51.0422 0 0 0 1579.26 0 -210.349 0 
0 0 0 0 -1350.06 0 0 0 0 0 0.08 0 2268.06 0 0 0 0 0 -1875.44 1926.4 0 0 0 0 0 0 -1448.18 0 0 0 997.726 153.279 2491.76 0 0 1844.77 0 -812.479 0 0 0 0 0 0 0 0 0 0 0 -481.964 418.485 2284.69 0 0 -1214.1 0 0 0 890.759 0 0 0 
0 0 0 0 0 0 1308.4 1224.17 0 0 0 0.01 0 -1602.91 0 0 280.694 0 329.218 0 0 1487.24 -1097.83 0 -235.221 0 1218.22 2305.75 1744.06 0 -281.762 0 0 0 -56.8407 0 -2055.96 -901.746 0 0 0 0 -2426.15 -147.938 0 0 0 0 -1579.71 0 0 0 0 673.772 0 0 0 0 0 0 0 0 
0 0 0 0 0 0 0 0 165.334 0 -880.535 0 0.01 0 0 0 0 0 -1155.35 0 1278.34 0 0 0 0 0 0 0 1705.15 1879.56 0 0 0 0 0 0 0 0 0 207.297 0 0 0 881.756 0 0 0 0 0 0 0 -467.009 0 691.626 0 0 0 0 0 -609.073 0 0 
0 0 0 2407.83 0 0 0 0 0 -249.565 0 2039.48 0 0.02 2191 0 0 -2109.36 0 0 0 0 0 0 -566.958 0 0 0 -2006.67 0 0 0 0 2471.77 0 0 0 0 305.414 0 0 0 0 374.691 0 0 0 0 0 0 -1394.16 0 0 0 0 0 0 0 0 -410.703 441.374 0 
0 0 0 2057.79 0 0 0 0 0 0 0 0 0 332.575 0.09 0 0 1713.08 0 0 0 0 0 -2067.4 -98.4985 -1933.42 0 -1795.18 0 0 0 0 0 0 1645.18 0 0 0 0 0 -2240.75 0 0 0 0 0 0 0 1323.05 832.621 0 0 0 0 0 0 0 0 0 0 0 0 
807.901 0 0 -1170.46 0 0 0 0 0 2268.82 0 0 0 0 0 0.02 0 0 0 0 1362.42 2373.04 1681.8 0 0 -486.847 1292.69 502.869 0 -937.91 0 638.066 943.098 -512.94 0 1014.51 0 0 0 0 0 1348.23 967.666 375.607 0 0 0 0 252.159 0 0 0 0 0 0 0 0 0 0 0 0 0 
0 0 0 1899.4 0 0 1049.91 316.095 -2230.37 0 0 -2362.21 0 0 0 0 0 503.479 -727.79 0 0 0 0 0 0 0 -2079.76 997.574 0 1561.86 1364.71 0 0 0 0 1875.59 0 0 -608.463 0 0 0 0 0 1329.46 0 710.089 0 0 1532.26 0 600.681 0 -831.553 2111.04 0 0 0 0 0 0 0 
2214.19 383.389 2123.86 -441.679 1408.05 0 0 -1243.55 1326.11 0 0 0 0 754.952 -530.335 0 -543.764 0.02 0 1967.76 0 0 0 0 0 0 0 -1765.57 0 0 0 0 0 770.974 0 0 0 0 -1681.19 0 0 -1866.13 0 0 0 0 -2239.83 -876.72 756.02 660.497 2421.57 0 0 0 0 1030.38 0 0 0 0 0 0 
2011.86 0 0 -1016.19 0 0 -673.467 0 0 2367.7 -651.952 2272.48 -228.355 0 0 0 -252.159 0 0.09 0 1862.32 -2116.99 1259.27 0 -1582 0 1166.34 1307.95 466.704 0 0 0 1320 0 -1816.39 0 0 0 -1339.08 2163.08 -178.915 -356.38 0 0 -393.918 -48.9059 -2045.12 0 2483.67 0 1288.26 0 0 0 -1515.63 0 0 0 -2394.86 0 901.593 0 
1971.72 0 0 0 0 0 0 0 0 0 2126.15 0 0 0 0 0 0 1873.3 0 0 0 0 0 -2473.14 0 0 297.937 0 0 0 0 721.076 -2406.16 812.174 0 0 0 0 0 0 177.847 0 0 -1899.4 0 1795.33 0 0 0 0 0 0 0 -162.74 0 -511.719 0 0 0 -2270.5 0 0 
0 1914.81 0 1149.25 0 0 0 0 0 1292.08 0 0 -126.881 0 0 -2202.14 0 0 709.021 0 0.02 0 -1362.88 421.232 1863.08 0 0 0 0 0 0 0 0 0 0 962.02 0 0 -115.436 799.203 -1986.68 0 0 0 0 0 0 0 0 0 0 0 1392.64 1333.89 58.0615 0 0 1752.45 0 0 0 0 
0 1356.62 0 0 0 -2215.41 0 0 1903.21 174.337 0 -263.756 0 0 0 -613.804 0 0 1084.25 0 0 0.03 0 0 0 0 0 1618.32 0 0 0 0 0 0 0 0 0 0 -1174.73 0 0 0 0 0 0 0 0 2159.57 0 0 0 0 0 0 0 0 0 0 0 0 0 0 
2290.03 0 0 -976.058 0 0 0 0 0 0 0 -42.9548 0 0 0 1298.79 0 0 -1443.91 0 708.563 0 0.03 0 0 987.655 0 0 0 2212.67 0 0 0 0 -2010.48 0 -2125.54 0 0 0 0 0 0 0 0 0 0 0 0 0 859.783 0 0 2060.84 0 0 0 0 0 0 0 0 
0 0 0 0 1388.06 0 0 0 -1588.11 0 0 0 0 0 413.144 0 0 0 0 404.599 180.441 0 0 0.07 0 0 2167.96 0 1549.65 0 -1097.98 0 0 -810.19 0 0 0 0 0 -760.292 2189.63 0 0 0 0 -1188.16 0 0 1580.02 0 0 0 0 0 0 0 0 0 2240.59 0 0 -1246.3 
0 0 0 0 0 0 0 0 0 0 0 -1866.44 0 2074.11 2180.62 0 0 0 -89.0378 0 -819.803 0 0 0 0.08 0 1517.61 0 0 1812.11 0 0 3.89111 -1981.03 0 0 0 169.454 -1016.65 0 0 0 0 0 0 904.492 0 0 0 0 0 0 0 0 1148.79 805.002 0 0 0 0 0 0 
0 0 0 0 1998.12 -1310.24 0 0 0 0 0 0 0 0 1644.11 -1760.69 0 0 0 0 0 0 -672.246 0 0 0.05 0 0 0 1331.6 0 1296.81 504.242 0 0 0 1797.77 0 0 -37.3089 0 -1614.05 0 0 2467.19 631.199 2051.23 0 0 -2305.14 0 0 0 0 0 0 0 0 0 0 1122.24 0 
0 298.395 0 1559.42 961.867 2467.35 0 0 0 0 -1464.81 2360.84 0 0 0 1206.02 -1318.78 0 2451.78 1545.08 0 0 0 1172.75 356.99 0 0.08 2141.41 0 0 0 0 1661.81 0 2338.4 0 0 0 -2233.12 0 0 0 0 0 -1411.71 0 -1956.16 0 0 0 1837.9 1746.65 0 0 0 0 0 0 0 0 833.689 0 
0 0 -15.183 0 1822.95 0 0 -987.503 0 0 0 2243.95 0 0 2289.27 1526 2141.25 2037.03 980.483 0 0 2093.19 0 0 0 0 -107.959 0.02 0 0 0 -2049.24 0 0 0 0 0 0 0 0 0 0 0 0 0 0 0 0 0 988.113 0 0 0 35.02 2187.8 0 0 0 0 0 0 0 
0 0 0 0 0 0 0 0 0 0 0 2409.82 -2028.18 942.946 0 0 0 0 2347.56 0 0 0 0 -2273.71 0 0 0 0 0.06 0 0 -1502.96 0 -227.287 0 0 0 0 0 0 0 1104.69 -1284.14 2070.3 0 0 0 493.713 0 0 -1493.35 0 0 0 676.366 0 0 0 0 0 0 0 
0 0 2444.46 0 0 0 1487.55 0 1279.87 1000.47 0 0 511.719 0 0 -675.451 558.565 0 0 0 0 0 2459.72 0 2172.38 1535.31 0 0 0 0.04 0 0 0 0 0 0 164.724 0 0 0 333.949 0 0 0 0 0 0 0 0 0 0 1007.03 0 2278.59 0 0 0 0 0 0 0 0 
0 -1019.39 0 0 0 1781.29 0 0 0 0 538.118 1890.85 0 0 0 0 896.252 0 0 0 0 0 0 540.101 0 0 0 0 0 0 0.02 0 0 0 0 0 -23.423 0 0 0 -65.2333 0 0 0 1297.57 0 0 0 0 0 0 0 0 0 0 0 0 0 0 0 0 0 
0 0 1910.69 0 0 0 0 0 0 0 1783.88 0 0 0 0 1334.5 0 0 0 -234.153 0 0 0 0 0 2049.24 0 -1456.27 1711.55 0 0 0.02 0 1901.53 0 0 0 0 1524.48 1587.34 0 0 0 0 0 2468.26 0 -1104.39 0 0 0 0 0 -2440.79 -1435.06 0 0 0 0 0 0 0 
0 0 0 2335.66 925.398 0 0 -8.1637 0 0 -763.649 0 0 0 0 2290.34 0 0 -2295.68 624.638 0 0 0 0 -2444.76 2126.45 2146.44 0 0 0 0 0 0.08 0 0 0 755.562 0 0 0 0 0 0 0 -1956.31 1405.3 0 -2098.22 2107.07 0 0 0 0 1992.02 0 1247.98 0 0 0 0 0 1184.8 
0 0 0 838.878 0 0 0 0 0 0 0 0 0 -1135.06 0 1800.97 0 -1884.44 0 -2498.78 0 0 0 2371.67 1275.29 0 0 0 1522.34 0 0 695.593 0 0 0 0 -1577.27 0 0 0 1695.53 0 0 0 0 0 1885.51 0 0 0 0 0 0 -402.158 961.715 0 0 0 0 0 0 0 
0 0 870.006 28.4585 0 0 0 1590.85 0 1094.47 0 -735.115 0 0 -1349.91 0 0 0 1577.73 0 0 0 1567.66 0 0 0 843.608 0 0 0 0 0 0 0 0.07 0 0 0 0 -2272.48 0 0 0 0 0 -1321.99 46.0067 0 0 0 0 0 0 0 0 -874.737 0 0 0 0 0 337.306 
0 0 0 0 0 0 0 0 0 -368.435 2173.6 0 0 0 0 863.598 982.162 0 0 0 2033.98 0 0 0 0 0 0 0 0 0 0 0 0 0 0 0 0 -578.555 0 0 0 1167.71 0 0 0 0 -44.4807 0 -1408.66 0 -2034.44 0 0 0 0 0 0 -1744.97 0 0 0 0 
-393.918 1877.88 0 0 0 1226 0 659.429 0 -2267.14 0 961.562 0 0 0 0 0 0 0 0 0 0 2412.41 0 0 -1311.91 0 0 0 -1465.73 -1033.13 0 2302.85 -370.266 0 0 0.07 0 0 0 0 1171.07 -835.826 -250.175 0 0 0 0 0 0 0 -1444.21 0 0 0 0 0 0 0 0 0 -28.3059 
0 0 0 0 1765.57 1242.33 1393.55 0 0 0 1799.75 2118.82 0 0 0 0 0 0 0 0 0 0 0 0 -570.009 0 0 0 0 0 0 0 0 0 0 -1494.57 0 0.02 0 -2174.98 0 0 1933.27 0 0 0 0 0 2079.91 0 -548.189 0 0 0 -463.195 0 0 0 -95.1415 0 0 0 
-1405.61 224.54 0 0 0 0 0 0 0 0 0 0 0 -1260.95 0 0 -1672.34 456.175 334.254 0 -1055.56 1942.12 0 0 -637.15 0 -1869.49 0 0 0 0 832.926 0 0 0 0 0 0 0.04 0 0 0 0 0 1938 0 2484.13 0 0 1456.11 0 0 0 0 0 0 0 -528.352 0 0 0 0 
0 0 2218.16 0 0 0 0 0 0 1401.79 0 0 899.609 0 0 0 0 0 -1419.34 0 -1073.87 0 0 -46.9222 0 2156.51 0 0 0 0 0 2308.5 0 0 2330.47 0 0 -2459.72 0 0.02 891.675 1066.24 0 0 0 0 0 0 0 0 1067.31 0 -988.418 0 -1669.74 0 0 0 0 -590.762 -2409.36 -2032.46 
0 -1024.74 0 2026.96 0 0 -555.971 2146.14 0 0 0 0 0 0 -58.3666 0 0 0 1038.32 1822.18 1051.44 0 0 466.247 0 0 0 0 0 693.762 -2186.42 0 0 -453.124 0 0 0 0 0 2242.88 0 0 0 2444.76 0 0 0 -1375.39 0 0 0 0 -922.956 0 0 1524.17 0 0 0 0 0 0 
0 -1575.29 151.601 2446.75 0 0 0 0 1617.1 0 0 0 0 0 0 -1192.59 0 2427.52 1444.21 0 0 0 0 0 0 685.98 0 0 572.451 0 0 0 0 0 0 1822.34 820.414 0 0 1607.33 0 0.07 0 0 0 0 -2373.81 0 2112.87 2406.77 0 1697.06 0 0 0 0 0 0 1680.58 0 0 0 
0 0 0 0 0 0 0 2233.27 0 0 0 -1608.25 0 0 0 1865.67 0 0 0 0 0 0 0 0 0 0 0 0 2312.62 0 0 0 0 0 0 0 -1751.69 1835.76 0 0 0 0 0.05 0 0 0 0 0 0 -1452.91 -1155.81 1052.05 2163.38 0 0 0 0 0 0 0 0 0 
0 1600.47 680.181 0 1116.6 0 -884.198 0 -2352.14 0 0 815.989 -955.153 810.19 0 -1405.76 0 0 0 -1749.4 0 0 0 0 0 0 0 0 806.68 0 0 0 0 0 0 0 561.769 0 0 0 1952.65 0 0 0.02 0 0 0 0 0 0 0 0 0 0 0 0 0 -411.771 0 0 0 0 
0 0 0 0 0 0 0 2468.11 0 0 0 0 0 0 0 0 1257.13 0 -186.697 0 0 0 0 0 0 1828.75 453.276 0 0 0 2351.37 0 -1188.47 0 0 0 0 0 540.712 0 0 0 0 0 0.08 0 0 0 -1728.64 0 0 0 0 1650.98 0 0 0 -525.758 441.984 0 210.501 0 
0 0 983.535 0 -1029.16 889.996 -1811.96 0 -2340.54 0 0 0 0 0 0 0 0 0 2365.11 88.1222 0 0 0 780.74 114.521 2321.62 0 0 0 0 0 -806.528 -2175.89 0 -334.254 0 0 0 0 0 0 0 0 0 0 0 1019.7 0 0 2404.17 1830.88 0 0 -152.211 -1717.51 0 0 0 0 0 66.3015 0 
2390.59 2467.8 0 0 0 0 0 0 0 0 0 0 0 0 0 0 1164.82 1299.86 -58.6718 0 0 0 0 0 0 -1489.53 -1843.09 0 0 0 0 0 0 454.344 1003.22 -505.921 0 0 -938.368 0 0 -1640.9 0 0 0 798.746 0 0 0 0 0 -93.7681 0 674.993 -729.164 0 0 0 0 0 0 0 
-582.369 0 0 0 0 0 0 0 0 0 0 0 0 0 0 0 0 -1458.4 0 0 0 -1587.95 0 0 0 0 0 0 2328.79 0 0 -13.5044 1201.13 0 0 0 0 0 0 0 1054.8 0 0 0 0 0 0 0.04 0 0 2121.11 0 0 1982.41 -116.81 0 0 1677.53 0 0 0 977.432 
-2246.24 -1984.08 1810.28 0 -976.669 1428.65 1910.84 0 2326.2 0 0 -627.995 0 0 2095.48 -343.257 0 2046.34 -1409.42 0 0 0 0 -1987.14 0 0 0 0 0 0 0 0 1484.04 0 0 1761.3 0 -1333.74 0 0 0 2313.07 0 0 -1007.34 0 0 0 0.02 599.612 0 0 0 0 0 0 0 0 0 0 0 0 
0 0 0 0 0 0 0 0 0 1162.22 -158.01 0 0 0 2025.44 0 907.086 -822.245 0 0 0 0 0 0 0 2276.3 0 -1902.75 0 0 0 0 0 0 0 0 0 0 50.4318 0 0 -559.481 621.891 0 0 866.039 0 0 540.406 0.02 0 -411.466 0 0 0 455.412 -2384.33 0 0 0 -175.1 0 
0 1164.97 966.292 0 0 0 0 0 990.402 0 1645.33 0 0 -2024.22 0 0 0 641.423 1930.98 0 0 0 -2147.05 0 0 0 471.74 0 341.731 0 0 0 0 0 0 -856.578 0 -299.005 0 -1255.3 0 0 1140.25 0 0 2207.79 0 -457.701 0 0 0.02 0 0 -841.624 0 0 0 0 0 0 -1089.13 0 
0 0 -2207.17 0 0 0 -1771.22 0 -408.261 0 2082.66 0 -2233.88 0 0 0 -844.523 0 0 0 0 0 0 0 0 0 2468.57 0 0 1745.89 0 0 0 0 0 0 1763.28 0 0 0 0 216.147 1226.92 0 0 0 755.562 0 0 297.021 0 0.01 0 0 0 0 0 0 0 0 0 0 
976.516 -1615.88 -752.205 2009.87 -1250.72 0 0 0 0 0 0 0 0 0 0 0 0 0 0 0 -140.309 0 0 0 0 0 0 0 0 0 0 0 0 0 0 0 0 0 0 2352.75 2352.75 0 -495.849 0 0 0 0 0 0 0 0 0 0 0 0 0 0 0 0 -2413.79 1740.55 0 
0 0 518.128 0 0 588.778 -310.144 1293.45 -150.99 229.118 0 -1314.97 2298.58 0 0 0 529.42 0 0 -2164.91 1219.75 0 -1822.49 0 0 0 0 1747.26 0 154.805 0 1553.01 2398.98 -1630.07 0 0 0 0 0 0 0 0 0 0 1179.16 -1795.79 1730.02 -1122.24 0 0 2332.15 0 0 0.09 1981.03 0 924.94 -1808.15 1240.35 0 0 0 
0 0 0 0 0 0 0 0 2050.16 2373.5 1181.75 0 0 0 0 0 761.208 0 1924.73 0 2437.13 0 0 0 -1984.39 0 0 23.423 -2076.71 0 0 181.661 0 -1873.45 0 0 0 1161.46 0 -2195.12 0 0 0 0 0 -619.602 191.733 732.368 0 0 0 0 0 -1234.7 0.09 0 2022.23 0 0 0 0 0 
0 0 0 0 0 -829.264 0 0 0 0 0 0 0 0 0 0 0 1402.4 0 139.088 0 0 0 0 -401.09 0 0 0 0 0 0 0 -1604.43 0 1077.38 0 0 0 0 0 -864.513 0 0 0 0 0 0 0 0 2416.84 0 0 0 0 0 0.05 0 0 0 0 0 0 
0 -1999.19 0 0 0 0 452.666 0 0 0 0 0 0 0 0 0 0 0 0 0 0 0 0 0 0 0 0 0 0 0 0 0 0 0 0 0 0 0 0 0 0 0 0 0 0 0 0 0 0 804.849 0 0 0 3.43333 2019.33 0 0.07 0 0 0 0 0 
1069.44 0 0 0 0 0 0 0 0 0 0 0 0 0 0 0 0 0 0 0 -1157.95 0 0 0 0 0 0 0 0 0 0 0 0 0 0 203.787 0 0 993.606 0 0 0 0 1791.82 -2115.01 0 0 795.083 0 0 0 0 0 1533.78 0 0 0 0.02 0 0 0 0 
0 0 0 0 0 0 0 0 0 1193.66 -1998.89 0 0 0 0 0 0 0 2308.8 0 0 0 0 -843.455 0 0 0 0 0 0 0 0 0 0 0 0 0 -438.932 0 0 0 2020.4 0 0 874.432 0 0 0 0 0 0 0 0 -2009.11 0 0 0 0 0.04 0 0 0 
0 0 0 218.284 0 0 0 0 -625.401 0 0 0 1935.41 -1425.75 0 0 0 0 0 940.962 0 0 0 0 0 0 0 0 0 0 0 0 0 0 0 0 0 0 0 2071.98 0 0 0 0 0 0 0 0 0 0 0 0 -1828.75 0 0 0 0 0 0 0.09 0 0 
0 0 0 0 0 0 0 0 0 -1710.03 0 0 0 2437.13 0 0 0 0 -450.987 0 0 0 0 0 0 -1536.38 -1683.02 0 0 0 0 0 0 0 0 0 0 0 0 316.858 0 0 0 0 -1763.59 1096.61 0 0 0 970.717 1517.15 0 1988.2 0 0 0 0 0 0 0 0 0 
1508.76 0 0 0 1317.87 0 0 0 0 0 0 0 0 0 0 0 0 0 0 0 0 0 0 1235.01 0 0 0 0 0 0 0 0 -1491.36 0 -1274.38 0 -1114.61 0 0 387.814 0 0 0 0 0 0 0 -1151.69 0 0 0 0 0 0 0 0 0 0 0 0 0 0.03 
