*Vertices 58
*Matrix 
0.05 0 0 0 437.407 85.2229 0 0 0 0 0 0 0 941.878 0 -9.84222 0 1604.13 0 0 0 0 0 -1477.02 0 502.869 0 0 0 0 -926.771 0 0 1196.4 0 0 0 0 0 0 0 0 0 0 0 0 0 0 0 0 0 0 1133.38 0 0 0 0 0 
0 0.05 347.835 0 -67.3696 0 0 0 -1725.44 0 -488.372 755.257 0 0 0 1726.81 2478.64 1283.53 13.8096 0 0 0 2117.6 -1961.2 0 0 0 0 0 0 0 0 0 122.456 -1038.62 0 -772.958 0 0 0 0 0 0 0 0 0 0 0 0 840.861 0 0 0 0 0 1955.09 279.778 0 
0 -130.696 0 2045.73 0 0 0 0 -1355.86 2167.5 0 521.18 0 1655.55 1359.22 -1221.43 0 0 -815.073 0 0 1882.31 0 0 0 -342.341 -32.1207 0 0 0 0 0 242.851 0 0 0 0 0 0 0 0 0 0 0 -2376.25 0 0 0 0 0 0 -564.669 1248.59 0 0 0 -1007.19 0 
0 0 235.221 0.03 939.741 -436.949 0 0 0 0 0 832.163 0 1160.7 0 2149.19 0 0 161.672 0 0 266.198 0 -1960.89 0 0 0 0 0 0 -757.851 0 0 0 0 0 0 0 0 0 0 0 0 0 0 0 0 0 0 0 0 0 0 0 0 0 -1670.66 0 
713.294 -794.168 0 49.5163 0.07 0 1151.23 0 0 0 0 0 0 -473.418 0 0 1834.7 0 0 0 1036.33 2328.18 0 -872.753 1470.61 0 0 2026.51 0 0 0 0 0 0 -719.398 0 0 0 -1347.01 2088.76 0 0 0 0 0 0 -191.275 0 0 0 0 0 0 -1814.71 0 0 0 0 
1782.36 0 0 -2498.93 0 0.08 0 426.878 850.78 0 0 0 -286.645 0 0 0 1320.15 704.749 0 459.532 0 2453.15 481.048 -1969.89 0 0 0 0 0 0 -1832.26 0 0 1664.71 0 0 0 0 0 1831.64 0 0 2255.85 0 0 0 0 0 0 0 -2072.13 0 0 0 0 0 0 0 
0 0 0 0 1907.94 0 0.07 0 0 0 0 0 0 0 0 336.238 1672.64 0 0 0 0 0 0 0 0 -2260.43 0 0 0 0 0 0 0 0 0 1890.39 -37.7667 0 0 0 0 0 0 0 0 0 0 0 0 0 0 1117.66 0 749.916 0 0 0 0 
0 0 0 0 0 1497.62 0 0.06 1747.26 0 0 1716.28 1005.97 0 0 0 564.058 0 0 0 0 0 0 0 0 0 0 0 0 0 0 1765.57 0 0 -2189.32 0 0 0 0 0 1542.94 0 0 0 0 0 0 0 0 0 0 0 0 0 47.38 0 0 0 
0 -1772.29 49.5163 0 0 1916.79 0 391.476 0.03 0 0 0 0 0 1661.66 0 0 0 0 0 0 0 0 0 0 0 0 0 0 0 640.049 0 0 0 0 0 0 0 -2273.25 0 0 1115.22 0 0 -1544.47 0 1426.05 0 0 0 -176.168 0 0 0 0 0 0 780.74 
0 0 1281.55 0 0 0 0 0 0 0.03 794.626 0 1644.87 1917.25 -1121.33 0 0 -377.132 457.091 0 0 0 0 0 -405.515 0 0 0 0 0 0 0 0 0 0 0 0 0 0 0 0 2173.76 0 0 0 230.949 0 0 0 0 0 0 0 0 0 0 0 0 
0 2071.52 0 0 0 0 0 0 0 2184.74 0.09 1397.06 -122.761 2007.13 0 1022.6 0 0 0 -1525.85 0 0 0 0 0 0 0 1856.82 0 0 0 0 0 0 0 0 0 0 0 0 0 0 0 0 0 0 0 0 0 0 0 0 0 0 0 0 0 0 
0 -417.112 -183.34 1446.5 0 0 0 -473.571 0 0 796.915 0.02 2123.55 1105 0 0 80.9503 0 0 0 1733.07 0 -1840.04 0 0 0 0 0 0 0 0 0 0 0 0 0 -705.512 0 0 1567.35 0 0 0 0 0 0 0 0 0 0 0 0 0 0 0 0 0 0 
0 0 0 0 0 1298.18 0 272.454 0 2336.88 1043.96 2381.74 0.07 0 0 0 0 0 0 0 0 2060.38 0 0 -2331.69 0 2274.77 0 -1896.8 0 0 0 0 0 967.055 0 -1374.02 0 0 0 0 0 0 0 0 0 0 0 -119.098 0 103.687 0 0 1154.59 0 0 0 0 
2159.41 0 -761.971 -334.407 775.246 0 0 0 0 -249.87 -1534.09 1540.04 0 0.08 0 0 0 1421.02 0 0 0 0 0 0 0 0 0 0 1431.09 -1546.14 0 2111.96 0 0 0 0 0 0 0 -2051.07 0 0 0 -2195.27 0 0 0 0 0 0 0 0 1912.06 0 0 0 0 0 
0 0 848.949 0 0 0 0 0 1328.85 -2080.37 0 0 0 0 0.01 0 91.6318 -241.783 0 750.069 0 0 807.291 0 0 0 0 0 0 0 0 0 0 0 0 0 0 0 0 0 0 0 0 0 0 0 2061.45 0 0 0 0 0 0 0 0 0 0 0 
2468.41 768.38 2368.16 -580.386 0 0 114.216 0 0 0 1018.17 0 0 0 0 0.02 806.528 0 0 0 0 0 0 0 0 0 0 0 1660.44 0 0 0 1188.47 0 0 0 0 -2399.9 0 0 0 0 0 1346.1 0 0 0 0 0 0 0 0 0 0 0 0 0 0 
0 -216.147 0 0 1070.67 -1690.8 376.98 1292.38 0 0 0 -183.035 0 0 956.679 2418.36 0.05 0 0 0 1811.96 0 972.243 0 0 0 0 0 0 0 0 0 0 0 0 0 0 0 0 0 0 0 0 0 0 0 0 1309.93 0 0 0 0 0 0 0 0 0 588.321 
-1705.3 848.491 0 0 0 610.446 0 0 0 2020.25 0 0 0 575.808 -190.359 0 0 0.08 0 0 0 0 0 0 0 0 0 0 0 0 0 0 0 0 0 0 0 0 0 0 1510.74 0 0 0 0 0 0 0 0 0 0 0 0 0 1514.56 0 0 0 
0 407.498 491.577 723.823 0 0 0 0 0 -681.86 0 0 0 0 0 0 0 0 0.05 0 2385.71 0 0 0 0 0 0 0 0 0 0 0 0 0 0 0 0 313.196 1831.95 -570.009 0 0 0 0 0 0 0 0 0 0 -1471.98 0 0 0 0 0 0 0 
0 0 0 0 0 1090.35 0 0 0 0 74.2363 0 0 0 945.387 0 0 0 0 0.02 -1527.22 0 0 0 0 0 0 0 0 1007.19 0 0 0 0 0 1826 0 2321.47 0 0 0 0 0 -505.158 -2436.22 0 0 -77.7459 0 0 0 -2249.6 0 0 0 0 0 0 
0 0 0 0 602.359 0 0 0 0 0 0 1273.77 0 0 0 0 -251.701 0 303.125 1460.23 0.09 0 1243.25 0 0 0 0 0 0 0 0 0 0 0 0 0 0 0 0 0 0 0 0 0 0 0 0 0 0 0 -2245.48 646.153 0 0 293.207 1319.54 0 0 
0 0 503.937 660.955 -869.701 2343.29 0 0 0 0 0 0 1811.04 0 0 0 0 0 0 0 0 0.08 0 0 0 0 0 0 0 0 0 0 1690.95 0 0 0 0 0 0 0 0 0 0 0 0 0 0 0 1611.3 0 0 0 0 0 0 0 0 0 
0 -1135.36 0 0 0 1504.03 0 0 0 0 0 -127.644 0 0 1843.24 0 1459.17 0 0 0 1433.53 0 0.03 0 -1010.24 0 0 0 -742.592 0 0 0 0 0 0 0 0 0 1634.34 0 1759.01 0 0 0 0 0 0 0 0 0 0 0 0 0 0 0 0 0 
-2215.41 525.758 0 2067.09 1200.67 1760.69 0 0 0 0 0 0 0 0 0 0 0 0 0 0 0 0 0 0 0 0 0 0 0 0 0 0 0 0 0 0 0 0 0 0 0 0 0 0 0 0 -1332.67 68.5903 1377.22 0 0 0 0 0 0 2072.89 0 0 
0 0 0 0 581.912 0 0 0 0 -943.861 0 0 127.644 0 0 0 0 0 0 0 0 0 2143.54 0 0.08 0 0 0 0 669.958 0 -1237.75 0 0 0 0 0 0 0 0 0 0 0 0 0 0 141.377 0 0 0 0 52.4155 0 0 0 2241.05 0 0 
387.051 0 1061.2 0 0 0 1710.94 0 0 0 0 0 0 0 0 0 0 0 0 0 0 0 0 0 0 0.05 0 1023.97 0 0 0 0 470.519 0 0 0 0 0 0 0 0 0 0 -1139.94 -494.629 0 -1998.43 0 0 0 0 0 0 0 2059.62 0 0 0 
0 0 2143.09 0 0 0 0 0 0 0 0 0 2221.98 0 0 0 0 0 0 0 0 0 0 0 0 0 0.03 0 0 0 0 0 0 0 0 0 0 0 0 0 0 0 0 0 0 0 -1231.35 0 0 0 0 0 0 0 0 0 0 0 
0 0 0 0 2344.2 0 0 0 0 0 325.098 0 0 0 0 0 0 0 0 0 0 0 0 0 0 -169.149 0 0 0 0 1407.59 0 0 0 0 0 0 0 0 0 0 0 0 0 0 0 0 0 -1701.64 0 0 0 0 0 0 0 0 -2408.75 
0 0 0 0 0 0 0 0 0 0 0 0 1735.21 1873.45 0 -2340.85 0 0 0 0 0 0 -885.571 0 0 0 0 0 0.09 0 1460.39 0 0 0 0 0 -159.536 0 0 0 0 0 0 0 0 -1087.45 0 -143.666 0 0 907.544 0 1831.19 0 -1884.29 0 0 0 
0 0 0 0 0 0 0 0 0 0 0 0 0 724.586 0 0 0 0 0 1842.33 0 0 0 0 -659.276 0 0 0 0 0.08 0 0 0 0 0 0 0 0 658.513 1168.02 0 -762.886 0 0 0 0 0 0 0 0 0 0 0 -976.516 0 0 0 0 
-1088.98 0 0 -973.159 0 1606.11 0 0 -906.018 0 0 0 0 0 0 0 0 0 0 0 0 0 0 0 0 0 0 1640.75 -130.238 0 0.04 0 1161.46 0 0 0 0 0 0 1980.12 2091.36 0 0 0 0 0 0 -2154.38 0 0 0 0 0 0 0 0 0 0 
0 0 0 0 0 0 0 -1621.22 0 0 0 0 0 1979.2 0 0 0 0 0 0 0 0 0 0 -40.2081 0 0 0 0 0 0 0.03 0 576.266 2192.68 0 0 2275.38 0 0 0 0 0 0 0 2168.87 0 0 0 0 0 -569.399 0 0 0 0 1041.52 0 
0 0 2327.42 0 0 0 0 0 0 0 0 0 0 0 0 1655.86 0 0 0 0 0 470.672 0 0 0 1410.03 0 0 0 0 584.048 0 0.06 0 0 0 0 0 0 0 0 0 0 0 0 0 0 0 0 0 0 0 -947.676 0 0 0 0 0 
1714.76 1794.87 0 0 0 -1402.25 0 0 0 0 0 0 0 0 0 0 0 0 0 0 0 0 0 0 0 0 0 0 0 0 0 2069.69 0 0.02 0 0 0 0 0 0 0 0 1697.52 0 0 0 1903.67 0 0 0 0 0 0 0 0 0 0 0 
0 715.278 0 0 2459.41 0 0 2256.46 0 0 0 0 -1851.02 0 0 0 0 0 0 0 0 0 0 0 0 0 0 0 0 0 0 2431.94 0 0 0.04 0 0 0 0 0 330.897 0 -2209.62 0 0 0 0 0 0 0 0 0 0 0 0 0 0 0 
0 0 0 0 0 0 567.568 0 0 0 0 0 0 0 0 0 0 0 0 1632.21 0 0 0 0 0 0 0 0 0 0 0 0 0 0 0 0.06 0 0 1680.27 0 0 0 1348.84 77.5933 0 0 0 0 0 0 0 1854.08 0 -610.752 0 0 0 -208.213 
0 -1525.39 0 0 0 0 2069.38 0 0 0 0 2484.59 1345.18 0 0 0 0 0 0 0 0 0 0 0 0 0 0 0 2404.02 0 0 0 0 0 0 0 0 0 0 0 0 -1273 0 1435.06 0 0 0 0 -1764.05 0 0 0 0 0 0 0 0 0 
0 0 0 0 0 0 0 0 0 0 0 0 0 0 0 -147.786 0 0 497.528 801.187 0 0 0 0 0 0 0 0 0 0 0 1246.15 0 0 0 0 0 0 0 0 0 0 0 0 0 1529.97 0 0 0 0 0 0 0 0 -10.9104 0 0 0 
0 0 0 0 215.079 0 0 0 287.713 0 0 0 0 0 0 0 0 0 537.049 0 0 0 -409.024 0 0 0 0 0 0 918.531 0 0 0 0 0 -342.799 0 0 0.05 0 0 0 0 0 0 -285.73 0 0 0 0 0 0 0 0 546.663 0 0 0 
0 0 0 0 2408.44 -190.512 0 0 0 0 0 -699.103 0 1670.51 0 0 0 0 -992.538 0 0 0 0 0 0 0 0 0 0 2147.82 87.2066 0 0 0 0 0 0 0 0 0.08 0 1333.74 0 0 0 0 0 0 0 0 0 -2332 -1607.64 -2064.65 0 0 0 0 
0 0 0 0 0 0 0 1565.83 0 0 0 0 0 0 0 0 0 -368.435 0 0 0 0 1314.2 0 0 0 0 0 0 0 640.507 0 0 0 1484.8 0 0 0 0 0 0.02 1880.17 0 0 2024.98 0 0 0 0 0 0 0 0 0 0 -2424.31 0 0 
0 0 0 0 0 0 0 0 -10.7578 -951.643 0 0 0 0 0 0 0 0 0 0 0 0 0 0 0 0 0 0 0 316.858 0 0 0 0 0 0 -604.953 0 0 1846.14 1161.46 0.06 0 0 0 0 0 0 0 -1182.36 0 0 0 0 0 0 0 0 
0 0 0 0 0 -22.9652 0 0 0 0 0 0 0 0 0 0 0 0 0 0 0 0 0 0 0 0 0 0 0 0 0 0 0 -2217.4 1461.46 1350.83 0 0 0 0 0 0 0 0 0 777.993 0 0 -145.497 0 0 0 -459.38 0 0 0 0 0 
0 0 0 0 0 0 0 0 0 0 0 0 0 2358.39 0 538.575 0 0 0 685.369 0 0 0 0 0 2451.32 0 0 0 0 0 0 0 0 0 -2058.55 -103.992 0 0 0 0 0 0 0.05 0 0 0 0 0 0 0 0 0 0 0 0 0 0 
0 0 542.848 0 0 0 0 0 -328.15 0 0 0 0 0 0 0 0 0 0 -827.891 0 0 0 0 0 2329.71 0 0 0 0 0 0 0 0 0 0 0 0 0 0 416.654 0 0 0 0.08 0 2464.75 0 0 0 1310.39 0 0 0 0 0 0 0 
0 0 0 0 0 0 0 0 0 840.251 0 0 0 0 0 0 0 0 0 0 0 0 0 0 0 0 0 0 2456.21 0 0 -512.635 0 0 0 0 0 2251.12 -1034.65 0 0 0 -1887.19 0 0 0.05 0 0 0 0 0 -111.927 -2128.28 0 0 0 0 0 
0 0 0 0 768.838 0 0 0 8.77407 0 0 0 0 0 -849.864 0 0 0 0 0 0 0 0 851.238 -527.284 702.46 1574.98 0 0 0 0 0 0 -1053.42 0 0 0 0 0 0 0 0 0 0 -170.675 0 0.05 0 0 0 641.423 0 0 0 -356.838 0 0 0 
0 0 0 0 0 0 0 0 0 0 0 0 0 0 0 0 -407.346 0 0 386.898 0 0 0 -570.925 0 0 0 0 952.254 0 2066.79 0 0 0 0 0 0 0 0 0 0 0 0 0 0 0 0 0.04 0 0 0 0 0 0 0 0 0 0 
0 0 0 0 0 0 0 0 0 0 0 0 1458.56 0 0 0 0 0 0 0 0 272.912 0 1205.71 0 0 0 1094.47 0 0 0 0 0 0 0 0 2214.8 0 0 0 0 0 -597.476 0 0 0 0 0 0.05 0 0 0 -553.987 -2204.89 0 0 0 0 
0 2169.48 0 0 0 0 0 0 0 0 0 0 0 0 0 0 0 0 0 0 0 0 0 0 0 0 0 0 0 0 0 0 0 0 0 0 0 0 0 0 0 -948.134 0 0 0 0 0 0 0 0.08 0 0 0 0 0 0 0 -116.047 
0 0 0 0 0 2117.15 0 0 2075.33 0 0 0 2282.25 0 0 0 0 0 -946.15 0 -2277.21 0 0 0 0 0 0 0 362.331 0 0 0 0 0 0 0 0 0 0 0 0 0 0 0 -489.135 0 2384.49 0 0 0 0.09 0 0 0 0 0 257.347 0 
0 0 -1665.01 0 0 0 1476.56 0 0 0 0 0 0 0 0 0 0 0 0 -1623.97 2250.82 0 0 0 2096.09 0 0 0 0 0 0 1278.8 0 0 0 1642.12 0 0 0 -1723 0 0 0 0 0 265.74 0 0 0 0 0 0.02 0 1001.85 0 0 0 0 
1647.01 0 -2024.67 0 0 0 0 0 0 0 0 0 0 1475.49 0 0 0 0 0 0 0 0 0 0 0 0 0 0 1647.31 0 0 0 -1132.47 0 0 0 0 0 0 -1131.86 0 0 1444.67 0 0 -232.322 0 0 393.765 0 0 0 0 0 0 0 0 191.122 
0 0 0 0 557.192 0 1815.32 0 0 0 0 0 1216.09 0 0 0 0 0 0 0 0 0 0 0 0 0 0 0 0 2366.48 0 0 0 0 0 1272.85 0 0 0 1113.7 0 0 0 0 0 0 0 0 -1355.56 0 0 -110.401 0 0.05 0 0 0 0 
0 0 0 0 0 0 0 792.489 0 0 0 0 0 0 0 0 0 -1576.51 0 0 2215.87 0 0 0 0 1295.59 0 0 -1243.1 0 0 0 0 0 0 0 0 1875.59 -360.347 0 0 0 0 0 0 0 -2301.48 0 0 0 0 0 0 0 0.06 0 0 0 
0 932.875 0 0 0 0 0 0 0 0 0 0 0 0 0 0 0 0 0 0 2138.2 0 0 -1905.8 -1383.33 0 0 0 0 0 0 0 0 0 0 0 0 0 0 0 2414.4 0 0 0 0 0 0 0 0 0 0 0 0 0 0 0.03 0 0 
0 339.747 1354.79 1086.38 0 0 0 0 0 0 0 0 0 0 0 0 0 0 0 0 0 0 0 0 0 0 0 0 0 0 0 205.008 0 0 0 0 0 0 0 0 0 0 0 0 0 0 0 0 0 0 2014.91 0 0 0 0 0 0.02 0 
0 0 0 0 0 0 0 0 -484.1 0 0 0 0 0 0 0 1977.52 0 0 0 0 0 0 0 0 0 0 1529.05 0 0 0 0 0 0 0 -2178.95 0 0 0 0 0 0 0 0 0 0 0 0 0 1847.51 0 0 208.67 0 0 0 0 0.01 
