*Vertices 49
*Matrix 
0.04 -2289.57 0 0 0 0 0 0 0 1987.29 0 0 -2148.88 0 0 0 0 1121.17 2228.23 0 0 0 0 0 0 0 0 0 0 0 2429.2 1009.93 0 0 0 0 0 0 0 0 0 0 0 0 1139.48 0 0 0 0 
481.353 0.01 173.421 0 0 0 0 220.267 -461.669 0 0 2220.76 2319.79 0 0 0 0 0 0 0 0 0 -428.709 0 0 0 0 0 0 267.876 0 -1696.3 0 0 0 0 0 0 0 0 0 962.477 0 0 0 0 -397.122 1499.3 0 
0 1480.99 0 -1450.93 0 0 0 0 -1502.96 0 0 0 0 0 0 0 861.614 0 0 0 0 0 0 0 0 0 1065.02 0 -31.8155 0 0 0 0 0 0 0 0 0 0 756.172 0 0 0 0 0 0 -1753.52 0 0 
0 0 -889.843 0.06 1819.13 0 1680.12 1545.84 -1390.8 0 -389.645 0 0 0 0 0 0 0 0 0 0 62.0289 0 0 0 1956.31 0 -1777.02 0 982.009 1612.52 0 0 0 0 0 0 0 0 0 0 -401.242 -902.051 0 -89.4955 0 0 -1509.67 0 
0 0 0 820.414 0.07 0 1539.43 0 0 0 656.224 0 -2405.39 0 0 0 0 0 1323.51 0 0 965.072 0 0 0 2333.22 0 0 0 0 -510.041 0 0 0 0 0 -2373.2 0 0 0 0 0 0 1221.43 0 0 0 0 0 
0 0 0 0 0 0 0 0 0 0 1963.33 0 0 -1437.04 0 0 0 0 -2487.79 0 2126.3 -1173.21 0 0 0 0 0 0 0 0 1524.78 -806.07 0 0 0 0 0 0 0 0 0 0 0 0 1560.18 0 0 0 0 
0 0 0 1895.28 418.18 0 0.05 0 1284.75 0 0 -1801.43 -825.602 0 -864.971 0 0 2246.24 0 22.8126 0 -1434.75 0 0 -2322.38 0 0 454.955 -759.072 2394.71 0 0 0 0 0 0 0 0 0 0 0 0 0 0 0 0 0 0 0 
0 1779.15 0 1774.58 0 0 0 0.05 0 0 0 0 0 219.199 0 -1539.43 0 0 0 0 0 509.278 0 0 0 0 0 0 2259.82 -664.464 1994.61 0 0 0 0 1755.2 0 0 0 0 0 0 0 0 0 0 0 -744.423 0 
0 2265.92 -1989.12 -2317.65 0 0 -912.885 0 0.04 2172.08 0 0 0 0 0 1715.83 0 0 -273.98 2376.09 0 0 0 0 0 0 393.612 0 0 0 0 0 0 0 0 0 0 0 0 0 0 0 0 0 0 0 0 0 0 
1483.73 0 0 0 0 0 0 0 -107.654 0.02 0 0 -1367.15 0 -629.826 0 -1255.3 0 2203.97 0 1359.68 0 0 2178.03 0 78.0511 0 0 0 1478.24 0 0 -136.952 0 0 0 0 0 2326.81 0 0 0 0 0 0 0 0 0 154.805 
0 0 0 2324.98 1887.95 -1884.75 0 0 0 0 0.02 0 0 0 0 1189.08 -1364.86 0 0 0 0 0 2091.51 1188.16 0 1410.49 0 0 0 509.735 0 0 -1211.51 0 1911.91 0 0 0 0 0 0 0 0 0 0 0 0 0 -858.562 
0 2019.18 0 0 0 0 897.931 0 0 0 0 0.06 0 1442.38 0 0 0 0 0 0 0 0 0 0 2457.88 0 0 1710.64 0 0 0 0 0 0 2081.59 0 0 0 0 0 0 0 0 0 0 0 0 0 0 
195.09 -2163.84 0 0 -422.605 0 1730.32 0 0 -884.35 0 0 0 0 0 0 2006.67 2172.84 0 1419.64 0 0 0 0 0 0 0 -26.9326 0 0 0 0 0 0 0 0 0 0 1115.07 -1670.51 0 0 0 0 0 0 0 0 163.961 
0 0 0 0 0 433.134 0 -1603.67 0 0 0 -1960.13 0 0.09 -980.636 0 0 0 0 2283.01 0 0 0 2310.48 391.781 0 0 0 0 0 666.601 2311.7 0 0 0 0 -182.73 0 0 0 2261.04 0 0 0 0 0 0 0 0 
0 0 0 0 0 0 1359.52 0 0 611.972 0 0 0 2228.84 0.08 0 0 -1920.15 0 0 0 0 0 983.383 712.683 0 0 1234.24 0 0 0 0 0 0 0 0 0 0 0 0 0 0 0 0 2256.61 0 -225.761 0 1194.42 
0 0 0 0 0 0 0 1635.87 -2447.51 0 2016.43 0 0 0 0 0 427.793 1471.07 0 -134.51 0 0 1129.57 681.249 0 0 0 0 0 0 0 0 0 0 0 -2014.3 0 0 671.484 2076.56 0 0 0 0 0 0 0 0 0 
0 0 -721.534 0 0 0 0 0 0 1458.4 -257.347 0 -1445.89 0 0 1301.08 0.07 0 0 0 0 -258.721 327.693 2291.41 0 0 1976.3 0 -1551.18 -167.928 0 0 0 0 0 0 0 0 0 0 0 0 0 -107.654 -772.958 0 0 0 0 
2354.27 0 0 0 0 0 1898.63 0 0 0 0 0 1189.84 0 2059.01 -2479.55 0 0.01 0 -1217.92 -857.341 0 0 646.611 0 0 646.458 0 0 0 0 0 2298.12 0 0 1846.14 0 0 0 0 0 0 469.146 0 0 0 0 0 0 
233.695 0 0 0 1946.09 390.408 0 0 1387.14 1966.99 0 0 0 0 0 0 0 0 0.01 0 0 0 1885.66 0 0 -1238.06 -472.808 0 -1870.1 0 0 350.429 -2166.28 0 0 1550.26 0 -673.315 0 0 0 0 0 0 0 0 0 0 0 
0 0 0 0 0 0 584.048 0 -156.941 0 0 0 2431.33 -1928.85 0 -2328.79 0 -372.707 0 0.06 0 0 0 0 0 0 0 0 0 1633.27 0 0 0 0 0 0 2010.48 0 0 0 0 0 0 0 0 0 0 0 0 
0 0 0 0 0 -1452.91 0 0 0 1920.91 0 0 0 0 0 0 0 -129.322 0 0 0.05 0 2034.44 0 1719.03 0 0 0 0 0 -431.608 0 0 0 0 2397.46 349.208 0 0 0 0 0 0 0 0 0 0 0 0 
0 0 0 874.432 1282.46 -1833.63 2371.97 -1505.25 0 0 0 0 0 0 0 0 48.1429 0 0 0 0 0.07 0 0 0 0 0 2092.88 2066.79 0 0 0 0 0 0 0 0 0 0 0 0 0 0 0 -1958.45 0 0 0 0 
0 860.851 0 0 0 0 0 0 0 0 1194.88 0 0 0 0 2210.07 -428.098 0 -337.458 0 -942.488 0 0.06 1520.2 0 0 0 -483.032 0 1130.33 0 0 0 0 0 0 0 0 0 0 0 0 0 0 0 0 0 0 -1477.94 
0 0 0 0 0 0 0 0 0 -260.857 -274.743 0 0 753.883 179.22 669.195 120.319 146.107 0 0 0 0 1882.15 0 0 2248.38 0 0 1271.94 0 0 0 0 0 0 0 0 0 0 1533.94 0 0 0 0 0 0 350.429 -2165.82 0 
0 0 0 0 0 0 -2.82296 0 0 0 0 1223.11 0 -554.903 1911.76 0 0 0 0 0 1312.98 0 0 0 0.09 -1927.78 0 0 2269.74 0 2369.53 0 0 0 666.143 0 0 0 -383.847 0 0 0 1721.17 0 0 315.027 0 0 0 
0 0 0 346.767 1275.6 0 0 0 0 83.8496 905.103 0 0 0 0 0 0 0 1256.07 0 0 0 0 -2380.37 2418.06 0.08 0 0 0 0 0 0 0 -2231.28 0 0 0 0 0 2031.24 0 0 0 0 513.398 0 0 0 0 
0 0 -1065.78 0 0 0 0 0 1126.51 0 0 0 0 0 0 0 2495.42 -1689.43 2493.74 0 0 0 0 0 0 0 0 600.681 0 0 1095.84 736.488 0 0 0 -1170.46 0 0 0 0 0 0 0 639.134 0 0 0 0 0 
0 0 0 1816.84 0 0 2449.03 0 0 0 0 380.032 1586.28 0 1051.44 0 0 0 0 0 0 -1109.42 -1493.5 0 0 0 1173.97 0 2013.99 0 -2102.5 0 0 0 673.467 0 0 0 0 0 0 0 0 0 0 0 0 0 0 
0 0 985.672 0 0 0 1478.55 2404.63 0 0 0 0 0 0 0 0 787.759 0 2279.81 0 0 -2223.65 0 340.968 -1220.82 0 0 654.241 0.02 0 0 0 0 0 0 0 0 515.992 1476.1 -851.39 0 0 0 0 1545.84 0 0 0 0 
0 -621.738 0 -2262.72 0 0 1860.79 1894.67 0 -1503.57 1928.08 0 0 0 0 0 -505.463 0 0 -1252.1 0 0 1177.18 0 0 0 0 0 0 0.08 752.815 0 0 0 0 0 0 2479.86 1719.49 0 0 0 0 0 0 0 0 0 -75.1518 
914.411 0 0 -264.824 1495.79 658.361 0 74.8466 0 0 0 0 0 -382.626 0 0 0 0 0 0 1926.56 0 0 0 331.355 0 1533.02 -1439.63 0 1473.36 0.05 0 0 -16.5563 0 0 0 0 0 2444.3 0 0 0 0 0 -770.516 0 -947.218 0 
1072.34 -1487.24 0 0 0 -330.897 0 0 0 0 0 0 0 1673.56 0 0 0 0 2104.94 0 0 0 0 0 0 0 1617.71 0 0 0 0 0.08 0 0 0 0 0 0 0 0 0 -77.2881 0 0 0 0 0 0 0 
0 0 0 0 0 0 0 0 0 100.177 238.273 0 0 0 0 0 0 2013.99 -87.2066 0 0 0 0 0 0 0 0 0 0 0 0 0 0.08 0 0 0 0 0 0 0 1897.72 0 0 -1052.96 0 0 86.4437 0 0 
0 0 0 0 0 0 0 0 0 0 0 0 0 0 0 0 0 0 0 0 0 0 0 0 0 979.263 0 0 0 0 558.107 0 0 0.02 -678.961 0 0 2107.53 0 0 0 0 0 0 0 -152.211 0 0 0 
0 0 0 0 0 0 0 0 0 0 918.073 226.218 0 0 0 0 0 0 0 0 0 0 0 0 1904.74 0 0 1451.54 0 0 0 0 0 1392.94 0.06 0 0 0 0 0 0 0 1431.09 0 0 0 0 0 0 
0 0 0 0 0 0 0 413.297 0 0 0 0 0 0 0 1920 0 -1419.19 201.193 0 2091.05 0 0 0 0 0 2452.54 0 0 0 0 0 0 0 0 0.09 0 1902.45 -690.558 0 1874.83 0 0 0 1276.06 0 0 0 0 
0 0 0 0 -1846.45 0 0 0 0 0 0 0 0 1267.05 0 0 0 0 0 1706.98 1829.51 0 0 0 0 0 0 0 0 0 0 0 0 0 0 0 0.07 0 0 0 0 -1227.38 0 0 0 0 0 1899.09 0 
0 0 0 0 0 0 0 0 0 0 0 0 0 0 0 0 0 0 1358.61 0 0 0 0 0 0 0 0 0 -1886.27 986.892 0 0 0 1845.68 0 446.104 0 0.02 -2411.34 0 0 0 226.524 0 0 0 0 0 0 
0 0 0 0 0 0 0 0 0 2004.53 0 0 2150.11 0 0 167.928 0 0 0 0 0 0 0 0 -147.938 0 0 0 -781.35 699.561 0 0 0 0 0 -908.307 0 -658.666 0.01 0 0 0 0 0 0 47.5326 0 -63.4022 0 
0 0 -962.325 0 0 0 0 0 0 0 0 0 1385.01 0 0 -1728.34 0 0 0 0 0 0 0 2029.4 0 1772.74 0 0 -1278.34 0 2490.08 0 0 0 0 0 0 0 0 0.01 0 0 0 0 0 0 0 0 1664.71 
0 0 0 0 0 0 0 0 0 0 0 0 0 2394.1 0 0 0 0 0 0 0 0 0 0 0 0 0 0 0 0 0 0 -187.918 0 0 2255.85 0 0 0 0 0.09 0 0 0 0 1207.24 0 0 0 
0 2075.79 0 -842.692 0 0 0 0 0 0 0 0 0 0 0 0 0 0 0 0 0 0 0 0 0 0 0 0 0 0 0 1613.9 0 0 0 0 1800.67 0 0 0 0 0.06 0 0 0 0 0 0 0 
0 0 0 -242.851 0 0 0 0 0 0 0 0 0 0 0 0 0 -1446.81 0 0 0 0 0 0 2181.23 0 0 0 0 0 0 0 0 0 -885.266 0 0 1482.21 0 0 0 0 0.01 0 0 0 0 0 0 
0 0 0 0 1445.74 0 0 0 0 0 0 0 0 0 0 0 721.381 0 0 0 0 0 0 0 0 0 -139.241 0 0 0 0 0 -1035.87 0 0 0 0 0 0 0 0 0 0 0 0 0 0 0 0 
1396.91 0 0 -1298.03 0 2458.49 0 0 0 0 0 0 0 0 1305.81 0 980.483 0 0 0 0 1522.64 0 0 0 -1890.09 0 0 1754.59 0 0 0 0 0 0 -1398.74 0 0 0 0 0 0 0 0 0.08 0 0 0 0 
0 0 0 0 0 0 0 0 0 0 0 0 0 0 0 0 0 0 0 0 0 0 0 0 2079.15 0 0 0 0 0 -96.2096 0 0 2498.47 0 0 0 0 -1657.84 0 2283.32 0 0 0 0 0.09 0 2272.03 0 
0 -166.25 1056.47 0 0 0 0 0 0 0 0 0 0 0 -1156.88 0 0 0 0 0 0 0 0 2374.42 0 0 0 0 0 0 0 0 -785.012 0 0 0 0 0 0 0 0 0 0 0 0 0 0.01 0 -277.947 
0 608.768 0 -578.402 0 0 0 2354.73 0 0 0 0 0 0 0 0 0 0 0 0 0 0 0 -1118.27 0 0 0 0 0 0 1009.93 0 0 0 0 0 1312.83 0 -2426.45 0 0 0 0 0 0 1887.95 0 0.08 0 
0 0 0 0 0 0 0 0 0 1572.54 -562.99 0 1676.61 0 -432.218 0 0 0 0 0 0 0 -2394.25 0 0 0 0 0 0 1999.95 0 0 0 0 0 0 0 0 0 977.889 0 0 0 0 0 0 2375.79 0 0.07 
