*Vertices 71
*Matrix 
0.09 0 0 0 850.627 0 0 0 0 2274.77 0 0 0 634.556 423.826 0 0 0 -556.734 0 0 0 1520.51 0 -1224.02 2232.05 0 0 0 0 0 1932.97 0 -2191.31 0 0 0 0 0 -2375.48 0 0 0 0 2121.27 0 0 0 0 0 0 162.13 -2450.56 0 0 0 0 0 0 0 0 0 0 0 0 0 0 0 0 0 0 
0 0.07 -215.537 0 400.479 -812.174 0 -1093.86 1256.07 -578.249 0 0 2193.29 0 0 1293.91 0 0 0 0 0 0 0 1634.65 0 0 0 -2447.81 435.728 0 0 0 0 -1718.42 0 2389.37 1739.17 2172.84 718.482 0 0 0 -1285.52 0 0 0 0 982.772 0 17.4718 0 -1896.65 640.355 0 0 0 1685.77 0 0 -2420.35 0 0 914.869 0 0 0 0 1507.08 0 617.466 0 
0 -2433.01 0 -1340.91 0 0 0 0 0 957.442 -815.073 0 0 0 0 0 0 0 0 0 0 0 0 -1485.87 2004.53 0 436.644 -853.679 0 0 0 2109.36 0 0 0 1710.03 2387.39 2129.51 0 -179.83 0 0 2332.91 0 0 0 0 0 2196.95 2379.3 -751.595 0 0 0 0 0 -1082.72 0 -2120.04 -158.315 0 0 2342.07 -1410.03 1840.34 0 0 0 0 0 1399.5 
0 0 1005.2 0.02 0 0 0 -1129.87 1615.57 0 0 0 0 0 0 0 0 -1113.7 0 0 415.586 -301.599 389.187 1758.25 -1277.43 0 0 -297.327 0 -738.472 0 0 2487.95 738.319 0 0 0 0 -332.575 0 0 1133.99 0 0 0 0 0 0 0 2046.04 0 -235.374 -1358.46 0 0 0 -1669.59 0 -420.316 0 0 0 0 0 0 0 0 0 0 0 1618.02 
-1038.47 2060.08 0 0 0.05 0 0 0 0 0 0 0 0 0 0 0 1620.46 0 0 0 0 0 0 0 0 0 -1462.37 0 418.638 0 1252.1 0 0 0 0 0 0 1995.53 2436.83 0 -2420.8 403.684 0 0 -179.373 559.786 1344.11 0 2194.2 0 -367.519 0 0 0 0 0 0 0 0 484.863 0 0 631.809 0 312.433 0 0 -1943.19 0 0 0 
0 -1899.09 0 0 0 0.09 0 0 0 -656.835 0 0 0 0 248.192 149.312 0 1600.01 1040.15 0 0 0 0 0 0 0 -1295.74 1948.68 0 1960.13 1526.92 0 1806.92 0 0 0 -344.325 0 0 0 132.679 0 392.544 0 1865.98 -1444.21 0 0 1881.69 0 603.58 0 2009.26 0 1811.35 0 -79.7296 0 0 0 2140.49 0 0 0 -2251.27 0 0 0 0 0 0 
0 0 0 0 0 0 0.07 0 0 1260.95 1819.28 0 0 0 0 -467.162 0 148.701 70.8792 0 0 -696.966 0 2412.11 0 0 0 1957.08 0 0 1405.15 0 1815.32 751.289 0 1731.09 0 0 459.532 0 0 0 -246.971 0 0 -1150.01 -1815.01 -1097.52 -2139.42 0 0 2282.56 -651.036 0 -1911.3 -554.445 2382.96 -1338.16 0 -926.313 0 0 0 0 -567.263 0 0 0 0 -172.353 0 
0 969.192 0 -560.701 0 0 0 0.09 366.146 0 0 0 0 0 -275.658 0 0 0 0 500.732 0 0 0 -806.07 0 0 0 0 0 0 0 0 -536.439 -761.055 0 0 0 1400.57 0 0 0 0 0 0 0 0 0 0 1226.77 0 -1900.16 0 0 1994.46 0 0 0 0 834.91 0 916.7 0 0 0 0 0 0 0 0 0 0 
0 -2317.5 0 -664.617 0 0 0 2010.79 0.02 0 2332.76 0 0 -1440.86 -1424.83 1101.64 0 0 0 0 0 0 0 -2065.11 1358.91 0 0 0 0 908.612 0 -1287.35 0 0 0 0 0 0 -2496.64 0 0 1381.34 0 1503.27 -1533.94 -622.501 2048.48 0 0 0 2237.54 0 0 1501.28 0 0 1969.28 0 0 0 0 0 0 0 0 0 0 0 0 0 0 
827.586 -867.718 821.177 0 0 -1132.01 -72.2526 0 0 0.05 1053.88 2475.59 0 0 0 0 0 0 0 1645.33 0 0 -1062.12 1495.33 0 0 0 0 2116.99 0 0 0 -1561.56 198.752 0 0 -1377.07 0 -441.679 0 0 0 0 0 0 -2459.87 0 0 0 1968.21 0 0 0 0 0 0 -828.654 -1112.93 0 0 0 0 0 0 1174.12 0 0 0 -1618.02 0 823.313 
0 0 2405.55 0 0 0 328.608 0 -1633.58 -1697.06 0.05 0 0 1771.22 0 0 0 -1085.01 -1485.87 0 0 0 0 0 0 0 0 0 0 0 0 0 0 0 0 0 0 1937.39 0 175.558 0 0 0 0 0 1583.22 0 0 0 0 1523.71 0 0 0 0 0 0 0 0 378.658 0 909.375 0 0 0 0 0 0 0 0 0 
0 0 0 0 0 0 0 0 0 2142.17 0 0.02 0 0 0 0 0 2091.81 0 2281.79 0 0 0 0 423.978 0 -840.251 0 391.934 0 0 0 0 0 824.076 -2302.09 0 0 -2497.71 2378.84 829.417 2230.98 0 127.491 0 0 0 0 0 0 -705.054 -793.558 0 0 0 0 -1423.61 -1938.31 0 2179.71 -2100.05 0 0 238.884 0 0 0 0 0 0 0 
0 1958.3 0 0 0 0 0 0 0 0 0 0 0.08 0 0 0 0 -1163.44 0 0 0 2416.68 0 1427.27 149.312 0 0 0 591.22 0 518.891 -2229.91 2386.62 0 0 0 -2471.77 0 0 0 0 0 0 0 0 0 604.953 1904.13 0 0 0 0 1069.6 0 0 0 -347.224 0 -1823.1 -2334.28 2118.52 0 0 0 0 0 0 0 0 0 0 
-444.731 0 0 0 0 0 0 0 584.506 0 -1350.67 0 0 0.06 -1791.36 0 1965.62 719.398 0 0 0 0 0 0 773.873 0 2138.51 0 1839.73 0 0 0 0 0 0 0 2169.64 0 -1211.51 0 1740.24 0 0 0 0 0 0 0 0 0 -1229.97 0 0 0 0 0 0 489.593 0 0 0 1471.37 1728.95 2189.78 0 1085.16 0 0 0 0 0 
-1560.34 0 0 0 0 -187.46 0 -131.611 932.569 0 0 0 0 572.298 0.08 0 0 0 0 0 0 0 0 0 0 2108.14 0 0 1317.56 2006.67 559.328 0 0 -181.051 819.346 0 0 0 1144.37 0 -1351.44 0 556.429 0 -90.1059 0 0 -341.578 0 0 0 0 0 0 0 0 0 0 910.596 0 0 0 0 0 0 0 0 0 0 0 0 
0 234.916 0 0 0 -1182.97 -2404.78 0 2193.14 0 0 0 0 0 0 0.03 0 -2239.07 129.933 0 0 0 2099.75 0 0 1245.84 0 577.792 4.95926 0 220.725 1050.07 0 0 0 2001.94 2138.36 1444.21 0 0 0 0 0 0 0 -23.8807 0 0 -60.0452 0 0 -1055.25 0 0 0 0 0 0 0 2295.22 1415.98 -64.7755 0 0 423.368 0 1356.47 0 0 0 0 
0 0 0 0 1746.8 0 0 0 0 0 0 0 0 -729.316 0 0 0.06 -326.93 0 1948.84 0 0 -2236.63 1654.79 0 0 0 0 0 0 0 0 0 0 0 0 0 1998.89 0 0 0 895.184 2288.35 -788.675 0 0 0 0 0 0 0 -334.712 0 121.693 0 0 2446.13 0 0 0 0 0 0 0 0 0 0 0 0 0 0 
0 0 0 1156.12 0 1800.21 -1894.51 0 0 0 1838.21 1838.51 2328.03 1554.38 0 874.279 -56.5355 0.03 0 0 0 0 2325.28 0 1797.77 0 0 0 0 -936.079 0 0 1940.29 -139.698 0 0 0 1044.57 0 0 0 0 0 0 0 1432.77 765.786 0 0 -1175.65 0 0 69.3533 0 0 0 0 0 0 0 0 0 -344.478 0 0 0 0 0 0 0 0 
-378.811 0 0 0 0 1174.89 2446.29 0 0 0 870.617 0 0 0 0 645.543 0 0 0.06 -1391.26 0 0 -2427.67 0 1138.87 884.96 0 0 0 0 0 840.556 712.226 0 0 750.374 0 0 447.325 0 -1143.3 0 0 0 0 0 -1618.02 0 0 0 -388.73 0 -1779 -672.399 1154.9 0 2480.77 0 0 0 -374.844 0 0 0 -1881.24 0 0 0 0 0 -831.248 
0 0 0 0 0 0 0 -335.017 0 -2160.79 0 -673.772 0 0 0 0 -743.965 0 -2299.34 0 0 0 1494.11 0 634.556 0 0 2426.45 0 0 0 0 0 123.371 0 2409.51 -708.411 0 -1830.42 0 2082.2 0 0 -908.612 0 0 0 0 0 0 0 0 0 0 0 0 2199.85 1579.87 0 0 364.315 0 0 0 0 0 0 0 0 0 0 
0 0 0 26.1696 0 0 0 0 0 0 0 0 0 0 0 0 0 0 0 0 0 0 0 0 0 0 0 0 0 0 0 0 0 0 0 0 0 -2483.67 0 220.115 603.275 0 0 1768.32 0 0 0 0 0 0 0 0 0 0 -2234.03 0 0 0 0 0 2300.1 0 0 0 0 0 0 0 0 0 0 
0 0 0 -412.687 0 0 836.589 0 0 0 0 0 -1467.56 0 0 0 0 0 0 0 0 0.02 0 0 735.878 0 0 0 0 0 0 -1785.56 0 1251.49 0 0 0 0 1086.54 0 0 0 -1829.05 0 0 0 0 0 0 0 0 0 567.415 0 0 0 -382.778 0 0 0 0 2171.47 1339.99 0 0 0 0 0 0 0 0 
2283.17 0 0 1966.99 0 0 0 0 0 2283.78 0 0 0 0 0 -846.355 -2158.35 -2174.98 983.383 -2258.6 0 0 0.01 0 0 0 0 0 0 0 0 0 0 1476.56 0 0 0 0 2091.97 0 0 0 903.729 -1989.43 0 0 0 2283.78 -774.636 -916.089 0 0 131.306 -329.829 0 0 0 0 1918.47 0 -1830.12 1565.07 0 -1279.87 1569.03 0 0 0 0 0 0 
0 467.467 1724.83 1684.39 0 0 -1999.5 -1865.98 1611.61 -1476.1 0 0 -748.085 0 0 0 1656.16 0 0 0 0 0 0 0.01 0 0 2350.46 0 655.919 0 1420.41 0 0 0 0 1658.76 0 0 0 0 0 0 0 0 0 0 0 0 0 2470.7 0 0 1716.9 0 0 0 0 0 0 0 2230.06 0 0 -2227.32 2285.45 2097.61 0 0 0 0 0 
530.641 0 1080.58 1500.21 0 0 0 0 -599.918 0 0 -2374.42 719.092 1878.03 0 0 0 -1470.61 -1930.37 1437.04 0 2253.72 0 0 0.02 0 869.549 2307.58 0 0 0 0 0 0 0 2079.45 0 1774.42 1895.12 -945.845 1225.24 0 0 456.175 0 0 0 0 -331.66 0 1081.65 1643.04 0 1881.54 0 0 0 0 0 0 0 52.5681 0 0 0 0 295.495 0 0 0 0 
961.409 0 0 0 0 0 0 0 0 0 0 0 0 0 -1407.44 -1242.79 0 0 1784.34 0 0 0 0 0 0 0.05 545.595 2391.96 0 1677.98 0 0 0 -1558.5 0 0 -366.756 544.221 544.221 0 0 0 -1488.77 824.229 0 0 0 0 0 0 0 0 0 0 0 0 0 0 2332.76 0 0 0 0 0 0 0 0 0 0 0 0 
0 0 2453 0 -918.683 1583.68 0 0 0 0 0 1258.2 0 920.515 0 0 0 0 0 0 0 0 0 136.494 -2114.4 -1460.54 0.07 0 0 0 437.712 -2174.52 0 0 0 0 0 0 0 0 0 0 0 -900.983 1627.63 0 1596.65 0 0 -2032.61 0 0 0 1572.39 1647.16 0 -636.998 0 0 0 0 0 2097.92 0 0 0 0 2288.05 0 0 0 
0 -1732.46 884.35 2088.15 0 -507.447 -1122.24 0 0 0 0 0 0 0 0 405.057 0 0 0 2292.47 0 0 0 0 1828.75 2001.79 0 0.08 0 0 0 0 0 0 0 0 0 0 2130.88 0 28.3059 0 0 0 -1921.98 0 0 0 0 -2044.21 0 0 0 0 0 0 0 -12.5889 0 1451.23 0 0 -688.116 0 -516.144 0 571.23 -1003.52 0 0 0 
0 -1303.52 0 0 933.332 0 0 0 0 779.824 0 1183.89 1821.88 868.938 2407.38 -1627.93 0 0 0 0 0 0 0 2310.48 0 0 0 0 0.02 0 0 0 0 0 0 1835.46 0 -1738.72 81.1029 -1818.83 0 -1286.28 0 0 0 1901.23 1325.34 0 0 0 0 0 0 0 -851.238 0 642.643 0 0 0 0 0 0 0 0 0 0 0 0 0 0 
0 0 0 997.879 0 2172.69 0 0 999.1 0 0 0 0 0 889.081 0 0 168.996 0 0 0 0 0 0 0 1077.07 0 0 0 0.04 0 -1083.64 0 0 0 0 1368.98 124.744 0 0 1970.81 -2389.37 0 0 1892.53 -449.614 0 0 0 0 -2043.75 0 0 0 -44.9385 0 0 -952.712 0 0 0 0 -2330.16 0 0 0 0 0 0 0 0 
0 0 0 0 1702.09 1122.39 969.802 0 0 0 0 0 -1521.42 0 -1119.5 -1450.47 0 0 0 0 0 0 0 1730.48 0 0 -450.682 0 0 0 0.04 0 0 0 0 0 0 0 1671.12 2237.24 0 2363.58 0 0 2207.33 0 1994.61 0 2304.07 -1043.96 0 -924.482 205.008 0 1081.96 0 0 0 0 317.774 -2392.12 40.9711 0 0 -1032.67 0 -1367.46 0 0 0 0 
-87.3592 0 1544.16 0 0 0 0 0 2320.09 0 0 0 1838.82 0 0 -807.749 0 0 -2088.92 0 0 -1660.74 0 0 0 0 106.586 0 0 -1032.06 0 0.09 0 0 646.458 0 0 0 0 0 -810.8 -424.894 0 -23.8807 0 0 0 0 0 -254.448 -442.289 0 0 0 0 0 2236.93 0 0 0 12.4363 1310.39 830.18 0 1841.41 0 0 0 -436.796 0 -658.361 
0 0 0 1983.47 0 1628.24 -494.018 638.829 0 -2112.87 0 0 2229.76 0 0 0 0 -1069.14 1060.44 0 0 0 0 0 0 0 0 0 0 0 0 0 0.02 726.417 0 0 0 0 0 1274.53 0 0 -2211.75 0 0 0 0 0 1247.83 0 0 0 -2447.2 0 0 0 0 0 -1799.3 0 0 0 0 0 0 0 0 0 0 0 0 
-1173.36 -873.058 0 -2350.76 0 0 482.116 2250.97 0 -674.383 0 0 0 0 -1406.83 0 0 1074.48 0 -2355.04 0 2327.42 1050.07 0 0 -1031.14 0 0 0 0 0 0 697.272 0.06 0 0 0 0 0 0 565.127 0 0 0 0 0 2297.05 2053.82 -1153.68 0 0 1569.34 0 0 0 0 0 0 0 0 0 0 0 0 0 0 0 0 0 0 0 
0 0 0 0 0 0 0 0 0 0 0 -2232.66 0 0 2440.79 0 0 0 0 0 0 0 0 0 0 0 0 0 0 0 0 -1816.23 0 0 0 2142.78 0 0 0 -2372.74 0 0 0 0 0 0 0 0 0 1054.34 0 0 0 0 0 618.839 0 1747.41 0 628.147 -457.091 1279.87 2122.33 0 0 0 419.401 0 0 0 0 
0 1603.06 -1724.37 0 0 0 -1866.44 0 0 0 0 -2044.82 0 0 0 -290.765 0 0 -655.156 2368.62 0 0 0 -825.907 196.463 0 0 0 -35.783 0 0 0 0 0 1940.9 0.02 0 0 0 0 -478.454 0 0 0 0 1010.24 0 0 0 0 1841.56 0 0 0 0 0 0 0 0 744.118 0 0 0 0 846.965 0 0 0 0 0 0 
0 -421.69 839.793 0 0 -2288.96 0 0 0 -691.931 0 0 1624.73 2149.49 0 -2355.19 0 0 0 -705.969 0 0 0 0 0 -1461 0 0 0 -378.201 0 0 0 0 0 0 0 0 111.469 1995.68 0 0 -10.9104 2306.67 1185.42 0 0 0 2095.02 0 0 0 2343.29 0 -127.644 0 0 -272.607 0 0 190.97 -338.221 0 0 0 333.644 0 0 0 0 0 
0 -541.169 700.171 0 2347.87 0 0 1539.58 0 0 -1217.31 0 0 0 0 -958.205 -871.99 2050.31 0 0 1116.75 0 0 0 1000.93 2293.85 0 0 -822.703 457.854 0 0 0 0 0 0 0 0.03 452.208 0 0 1879.25 0 0 0 0 -2235.56 0 -1441.62 406.43 0 0 0 0 0 2342.07 773.415 0 0 0 0 0 0 0 0 0 0 0 0 0 0 
0 -826.823 0 -1281.7 -1001.24 0 -1628.54 0 1950.82 -559.786 0 593.204 0 864.055 -1306.57 0 0 0 -61.8763 972.549 0 2144.61 -811.563 0 -2247.92 -2370.14 0 396.664 -1491.67 0 798.746 0 0 0 0 0 1607.94 1903.52 0.01 0 0 0 2158.96 0 -651.341 0 2035.81 1197.62 0 587.405 0 0 743.812 -528.047 -1950.67 -1128.65 0 0 0 0 0 0 0 0 0 0 0 0 0 1216.39 0 
123.218 0 -702.765 0 0 0 0 0 0 0 -625.706 -1340.3 0 0 0 0 0 0 0 0 983.688 0 0 0 -1694.01 0 0 0 256.432 0 447.172 0 -2023.15 0 971.938 0 1739.48 0 0 0.04 0 0 1152.15 0 1880.17 937.452 -175.863 0 0 0 0 0 2262.72 -1145.59 0 0 0 0 0 606.174 0 0 -1125.29 0 0 0 0 0 0 0 0 
0 0 0 0 -438.78 -1312.07 0 0 0 0 0 -1212.42 0 2211.45 427.183 0 0 0 1817.15 1177.79 -383.694 0 0 0 -62.4866 0 0 -894.574 0 -376.064 0 2240.75 0 -1410.49 0 994.827 0 0 0 0 0.01 0 0 0 0 2430.42 0 0 1498.84 0 0 0 0 0 1882.46 91.4792 143.513 0 0 0 0 0 0 0 0 -1434.14 0 0 -301.904 0 0 
0 0 0 2369.53 465.941 0 0 0 -786.386 0 0 1938.31 0 0 0 0 -1877.73 0 0 0 0 0 0 0 0 0 0 0 475.249 978.347 1589.94 -588.778 0 0 0 0 0 -2301.78 0 0 0 0.05 0 0 0 926.771 0 0 0 0 828.806 0 0 0 0 0 0 0 0 0 259.636 0 0 0 0 0 0 0 0 0 0 
0 -592.746 -1710.64 0 0 2465.06 1421.32 0 0 0 0 0 0 0 -1144.06 0 -1281.55 0 0 0 0 762.429 1372.19 0 0 -2098.38 0 0 0 0 0 0 1305.51 0 0 0 876.72 0 -356.075 10.1474 0 0 0.08 -2145.53 0 2034.59 0 621.586 0 -1629.61 445.036 0 0 0 0 1791.67 0 0 435.881 0 0 0 2142.78 0 0 0 0 -1577.43 0 0 0 
0 0 0 0 0 0 0 0 -961.409 0 0 1470.92 0 0 0 0 238.578 0 0 2465.36 690.252 0 -848.186 0 -2154.68 -946.76 1931.75 0 0 0 0 2476.2 0 0 0 0 1365.32 0 0 0 0 0 -1056.32 0.09 2415.31 187.46 0 0 0 1166.19 0 -1550.26 0 0 0 0 0 904.645 0 -332.881 0 0 0 1747.87 0 0 0 0 -1868.27 0 0 
-224.998 0 0 0 -1533.17 91.937 0 0 745.491 0 0 0 0 0 1162.53 0 0 0 0 0 0 0 0 0 0 0 1012.38 319.605 0 2453.15 -557.497 0 0 0 0 0 698.035 0 -1337.7 1190.15 0 0 0 -2450.41 0.07 -984.603 2187.95 -669.805 0 1782.66 0 0 0 0 0 0 0 0 0 0 0 0 -146.565 0 0 0 0 0 0 0 -440.001 
0 0 0 0 2424.62 -1267.97 -1196.4 0 573.977 907.544 1139.64 0 0 0 0 138.478 0 1174.89 0 0 0 0 0 0 0 0 0 0 -2419.43 2315.06 0 0 0 0 0 -2416.53 0 0 0 1373.87 1341.82 1681.04 2053.67 159.993 -552.309 0.09 0 2002.85 0 0 0 0 0 0 1017.72 0 -69.9637 0 -210.654 0 0 1317.41 0 0 0 0 0 -946.608 0 0 0 
0 0 0 0 -285.577 0 -2400.36 0 -149.159 0 0 0 -2161.24 0 0 0 0 1811.96 2240.29 0 0 0 0 0 0 0 425.199 0 1438.57 0 -1821.12 0 0 -720.771 0 0 0 2353.97 2335.2 1645.48 0 0 0 0 -39.7504 0 0 0 2353.82 0 0 0 0 0 0 0 0 0 0 -1411.86 0 0 0 0 0 0 0 0 0 0 0 
0 1872.39 0 0 0 0 1325.04 0 0 0 0 0 -568.331 0 590.762 0 0 0 0 0 0 0 -1349.3 0 0 0 0 0 0 0 0 0 0 1411.56 0 0 0 0 -1927.63 0 0 0 1779.31 0 662.023 -220.878 0 0.09 0 0 0 0 0 0 2290.34 0 959.426 0 0 0 0 0 0 -2456.21 0 59.8926 0 0 0 0 891.675 
0 0 2396.08 0 -359.584 1484.5 25.5593 -1728.34 0 0 0 0 0 0 0 -2299.04 0 0 0 0 0 0 2164.75 0 2112.26 0 0 0 0 0 -931.501 0 2013.23 -351.65 0 0 1957.69 -75.457 0 0 60.1978 0 0 0 0 0 -796.609 0 0.08 0 -2094.1 352.718 0 2247.31 0 0 0 0 0 0 0 0 1063.65 1238.21 0 0 0 0 -2190.24 0 0 
0 -678.198 939.589 512.024 0 0 0 0 0 -619.297 0 0 0 0 0 0 0 1920.3 0 0 0 0 1148.03 677.129 0 0 1009.78 663.244 0 0 -677.435 -520.264 0 0 1215.63 0 0 1973.71 -2054.12 0 0 0 1335.11 2117.6 218.741 0 0 0 0 0.03 0 0 657.75 -2456.51 -2233.73 1120.41 0 0 -1992.63 0 1431.24 188.986 0 -1661.35 0 0 0 0 0 0 0 
0 0 2065.26 0 90.2585 2045.73 0 -1428.95 -966.597 0 60.3504 -1385.62 0 1168.32 0 0 0 0 -1752.6 0 0 0 0 0 2276.45 0 0 0 0 134.968 0 945.692 0 0 0 -2012.47 0 0 0 0 0 1714.76 1659.83 0 0 0 0 0 1292.69 0 0.05 0 0 0 0 0 0 0 0 0 0 1425.44 0 -1537.45 0 0 -1674.93 -2145.22 0 884.35 0 
2287.59 2191.76 0 -2003.62 0 0 -1437.5 0 0 0 0 383.541 0 0 0 1068.22 1672.95 0 0 0 0 0 0 0 -2180.17 0 0 0 0 0 2039.93 0 0 -996.963 0 0 0 0 0 0 0 0 0 -572.298 0 0 0 0 750.984 0 0 0.02 -1424.83 0 1591.16 0 0 0 2483.83 357.143 0 0 0 729.011 0 0 0 0 0 0 0 
723.212 68.1326 0 1839.43 0 -755.257 -719.55 0 0 0 0 0 1797.31 0 0 0 0 -1826.76 -115.131 0 0 2404.93 2336.57 -2156.51 0 0 0 0 0 0 1052.2 0 2199.7 0 0 0 1620.61 0 -1271.94 -1489.23 0 0 0 0 0 0 0 0 0 -710.852 0 -342.341 0 0 -1743.75 0 0 0 2007.89 0 -513.55 0 0 355.77 0 0 0 0 0 0 0 
0 0 0 0 0 0 0 -148.396 -1694.77 0 0 0 0 0 0 0 -214.927 0 -338.221 0 0 0 2017.81 0 2160.94 0 -2281.03 0 0 0 0 0 0 0 0 0 0 0 908.002 1927.78 0 0 0 0 0 0 0 0 -541.932 1122.39 0 0 0 0.01 0 2008.96 0 0 0 0 0 0 0 -256.89 0 -2022.23 0 0 0 0 0 
0 0 0 0 0 1203.27 -1015.12 0 0 0 0 0 0 0 0 0 0 0 410.55 0 -295.801 0 0 0 0 0 -1487.7 0 629.063 1214.71 -1818.67 0 0 0 0 0 -1447.87 0 2273.71 0 1320.92 0 0 0 0 -1370.36 0 638.981 0 604.953 0 -2210.23 2428.89 0 0.04 0 -1479.31 0 0 0 0 0 1011.76 0 -401.7 0 0 0 0 0 98.3459 
0 0 0 0 0 0 107.044 0 0 0 0 0 0 0 0 0 0 0 0 0 0 0 0 0 0 0 0 0 0 0 0 0 0 0 329.524 0 0 2146.9 -827.281 0 -92.5474 0 -2345.88 0 0 0 0 0 0 978.5 0 0 0 427.335 0 0.02 0 0 0 0 0 0 0 0 -363.857 0 0 0 0 183.34 0 
0 1698.89 544.374 -1639.84 0 796.915 869.243 0 -719.55 -923.872 0 -194.174 -872.753 0 0 0 1280.94 0 1786.48 -478.149 0 1299.4 0 0 0 0 -1954.48 0 -2312.77 0 0 -73.6259 0 0 0 0 0 2171.62 0 0 -1669.44 0 0 0 0 2016.28 0 -1285.06 0 0 0 0 0 0 1760.99 0 0.03 0 0 0 0 0 0 0 0 0 0 0 0 52.8733 0 
0 0 0 0 0 0 2119.59 0 0 -244.682 0 625.248 0 91.174 0 0 0 0 0 -1437.96 0 0 0 0 0 0 0 512.329 0 1566.74 0 0 0 0 -177.999 0 1996.14 0 0 0 0 0 0 761.208 0 0 0 0 0 0 0 0 0 0 0 0 0 0.06 0 0 0 -2253.72 0 0 0 0 2094.71 0 0 0 0 
0 0 2032.76 -698.798 0 0 0 503.784 0 0 0 0 -1488.16 0 2268.21 0 0 0 0 0 0 0 -1015.73 0 0 1899.7 0 0 0 0 0 0 69.5059 0 0 0 0 0 0 0 0 0 -695.898 0 0 2437.13 0 0 0 -2133.93 0 32.2733 -2059.31 0 0 0 0 0 0.05 525.452 0 0 0 0 0 0 0 0 0 0 0 
0 2101.73 2401.58 0 -1760.38 0 1877.27 0 0 0 1565.37 -1641.97 1896.8 0 0 1751.84 0 0 0 0 0 0 0 0 0 0 0 94.3785 0 0 832.621 0 0 0 1662.42 826.823 0 0 0 1167.41 0 0 0 -185.629 0 0 887.097 0 0 0 0 2117.76 0 0 0 0 0 0 -1299.86 0 0 2099.6 0 0 0 0 0 0 0 0 0 
0 0 0 0 0 1533.02 0 -341.426 0 0 0 1339.99 2022.23 0 0 1815.01 0 0 2357.63 -525.605 -1051.9 0 1579.41 2433.62 0 0 0 0 0 0 -2250.05 897.626 0 0 2191.76 0 1.90741 0 0 0 0 -1246.91 0 0 0 0 0 0 0 -461.516 0 0 2198.02 0 0 0 0 0 0 0 0.02 0 -1885.66 0 0 0 -1222.95 0 0 0 0 
0 0 0 0 0 0 0 0 0 0 832.621 0 0 1928.85 0 2094.26 0 0 0 0 0 -508.209 -2024.67 0 -510.193 0 0 0 0 0 1473.82 2481.84 0 0 1058.15 0 2107.84 0 0 0 0 0 0 0 0 -570.315 0 0 0 -2212.82 -1729.87 0 0 0 0 0 0 -1911.15 0 -591.525 0 0.07 0 0 0 0 0 0 0 0 0 
0 822.398 1841.87 0 -125.05 0 0 0 0 0 0 0 0 -1439.02 0 0 0 -667.211 0 0 0 -69.3533 0 0 0 0 -822.55 -333.491 0 -1315.58 0 627.232 0 0 -437.712 0 0 0 0 2107.23 0 0 -627.232 0 -194.174 0 0 0 -187.765 0 0 0 0 0 -696.356 0 0 0 0 0 1346.55 0 0.01 0 0 0 0 0 0 0 0 
0 0 2356.26 0 0 0 0 0 0 0 0 309.076 0 140.461 0 0 0 0 0 0 0 0 -1015.12 1253.78 0 0 0 0 0 0 0 0 0 0 0 0 0 0 0 0 0 0 0 2441.86 0 0 0 -1976.3 930.891 -1259.27 1188.77 1599.4 509.125 1402.71 0 0 0 0 0 0 0 0 0 0.09 1418.58 0 0 0 0 0 244.987 
0 0 1613.59 0 -557.497 -2430.42 -815.683 0 0 2105.7 0 0 0 0 0 1019.09 0 0 952.559 0 0 0 2293.24 -453.581 0 0 0 1492.43 0 0 55.9252 -690.252 0 0 0 2095.63 0 0 0 0 0 0 0 0 0 0 0 0 0 0 0 0 0 0 -863.292 1862.01 0 0 0 0 0 0 0 1330.07 0.03 0 0 0 0 0 0 
0 0 0 0 0 0 0 0 0 0 0 0 0 1213.19 0 0 0 0 0 0 0 0 0 1920.91 0 0 0 0 0 0 0 0 0 0 0 0 1673.71 0 0 0 -42.3444 0 0 0 0 0 0 -617.008 0 0 0 0 0 -1048.39 0 0 0 0 0 0 0 0 0 0 0 0.09 0 0 0 0 0 
0 0 0 0 0 0 0 0 0 0 0 0 0 0 0 1161.31 0 0 0 0 0 0 0 0 2245.63 0 0 398.953 0 0 -1047.78 0 0 0 -771.584 0 0 0 0 0 0 0 0 0 0 0 0 0 0 0 -111.316 0 0 0 0 0 0 1619.24 0 0 -1521.27 0 0 0 0 0 0.01 0 0 0 2427.37 
0 2068.47 0 0 -1462.83 0 0 0 0 0 0 0 0 0 0 0 0 0 0 0 0 0 0 0 0 0 -644.475 -2152.39 0 0 0 0 0 0 0 0 0 0 0 0 0 0 1908.7 0 0 529.115 0 0 0 0 2229.91 0 0 0 0 0 0 0 0 0 0 0 0 0 0 0 0 0.04 0 830.027 0 
0 0 0 0 0 0 0 0 0 -697.424 0 0 0 0 0 0 0 0 0 0 0 0 0 0 0 0 0 0 0 0 0 2277.83 0 0 0 0 0 0 0 0 -1098.74 0 0 -2082.35 0 0 0 0 1998.58 0 0 0 0 0 0 0 0 0 0 0 0 0 0 0 0 0 0 0 0 0 0 
0 1394.77 0 0 0 0 997.574 0 0 0 0 0 0 0 0 0 0 0 0 0 0 0 0 0 0 0 0 0 0 0 0 0 0 0 0 0 0 0 1017.56 0 0 0 0 0 0 0 0 0 0 0 -2283.17 0 0 0 0 1886.27 1005.05 0 0 0 0 0 0 0 0 0 0 -1639.68 0 0.02 721.076 
0 0 1876.81 -1473.51 0 0 0 0 0 0.228889 0 0 0 0 0 0 0 0 841.624 0 0 0 0 0 0 0 0 0 0 0 0 -1929.46 0 0 0 0 0 0 0 0 0 0 0 0 547.731 0 0 513.245 0 0 0 0 0 0 0.534074 0 0 0 0 0 0 0 0 1790.6 0 0 403.073 0 0 1248.59 0.06 
