*Vertices 79
*Matrix 
0.03 0 0 0 1783.12 -1473.82 0 0 0 0 2328.64 633.335 0 0 0 0 0 0 0 0 0 0 0 0 0 0 0 0 0 0 0 0 0 0 0 0 0 2490.69 -1170 0 0 0 0 0 0 0 -334.712 0 -35.02 0 0 0 0 2224.57 0 0 0 0 0 0 1022.6 0 0 0 0 0 0 0 0 0 0 0 0 0 0 637.761 0 0 0 
0 0.09 660.344 0 0 -1517.76 641.881 0 0 0 0 2155.14 0 0 0 0 0 0 0 0 0 0 0 354.701 0 0 0 0 2358.39 0 0 0 0 0 0 0 0 0 -2042.07 379.421 0 0 0 0 0 0 0 0 0 1470.46 0 0 0 0 0 0 0 0 0 0 0 0 0 0 0 0 -787.149 0 0 0 0 0 0 0 0 0 0 0 0 
0 685.064 0.05 0 0 0 1540.35 0 0 0 0 0 0 0 0 728.401 0 0 0 0 0 0 0 -845.592 0 0 1216.54 0 0 0 0 0 609.531 0 1931.29 0 0 0 0 0 0 0 0 0 0 0 0 391.629 0 -790.811 0 1126.67 0 0 0 0 0 0 0 0 0 -784.249 0 0 0 0 0 0 0 0 0 0 0 0 0 0 0 0 0 
0 0 0 0.02 0 0 0 -1524.48 0 0 0 0 0 0 0 313.654 0 0 0 0 0 0 0 0 0 0 1014.82 0 1408.35 0 0 -709.479 0 0 0 0 0 0 0 0 0 0 0 0 0 0 0 0 0 0 0 0 0 786.386 0 0 0 0 0 0 0 0 0 0 0 0 0 0 0 0 0 0 0 0 0 0 0 0 0 
1031.14 0 0 0 0.02 0 -479.827 1676.15 0 0 0 0 1224.94 0 0 0 0 0 0 0 0 0 0 0 0 0 0 0 0 0 0 0 0 0 0 0 0 0 0 741.829 0 0 0 0 945.54 0 0 0 0 0 -1150.47 -1086.54 0 0 0 0 0 0 0 -463.042 0 0 0 0 0 0 -1081.19 0 0 0 0 0 2196.04 0 0 0 0 0 0 
-587.71 1430.17 0 0 0 0.03 0 0 0 0 0 0 0 0 0 0 0 0 0 0 0 0 0 0 0 0 0 0 0 0 0 0 0 0 0 1589.48 0 0 0 0 0 0 0 0 0 0 0 0 0 0 0 0 0 0 0 0 0 0 0 0 0 0 1293.3 0 0 0 0 0 0 0 0 0 0 0 0 0 0 0 0 
0 2171.01 -872.143 0 -1386.23 0 0.01 0 0 0 0 0 0 0 0 0 0 0 15.4881 0 0 -22.3548 0 510.193 0 0 0 -2009.87 0 0 0 0 0 0 0 0 0 0 0 558.565 0 0 0 0 1945.33 0 872.295 0 0 235.832 0 0 0 0 0 0 0 83.5444 0 0 0 0 0 0 0 0 0 0 0 0 0 0 0 0 0 0 0 0 0 
0 0 0 1526 237.053 0 0 0.07 0 0 0 0 0 0 0 0 -474.792 0 0 0 0 0 0 0 2261.5 1784.34 0 -1879.1 0 0 0 0 0 0 0 0 0 0 0 0 0 0 0 0 0 0 0 0 0 -2117.91 -200.735 0 0 0 0 0 0 0 0 0 0 0 0 0 0 -1192.43 0 0 0 0 0 0 0 0 0 0 0 0 0 
0 0 0 0 0 0 0 0 0 -1318.48 0 0 0 0 0 2383.72 0 2225.18 0 -818.888 0 0 0 0 0 0 0 0 0 0 0 0 0 0 0 0 0 0 0 0 507.294 0 0 0 0 0 0 0 0 0 -1942.27 0 0 0 1462.68 0 0 0 0 0 0 0 386.288 0 0 0 2031.54 0 0 0 0 0 0 0 0 0 0 0 0 
0 0 0 0 0 0 0 0 1963.48 0.09 0 0 0 0 0 0 0 0 0 0 0 0 0 0 0 0 0 2487.49 0 0 0 0 0 0 741.523 0 0 0 141.224 0 0 0 1884.29 1891.46 0 0 0 0 0 0 1654.94 0 0 0 0 0 0 0 0 0 0 0 0 0 0 1357.69 0 0 0 0 0 0 0 0 0 0 0 0 0 
702.918 0 0 0 0 0 0 0 0 0 0.08 0 0 0 0 0 0 0 300.989 0 0 0 0 0 0 0 0 0 521.943 0 0 0 0 0 0 0 0 0 0 0 0 0 0 0 0 0 0 0 0 1689.12 0 1367.31 0 0 2299.65 0 0 978.5 0 0 0 1800.82 0 212.79 -1107.29 0 0 0 0 0 0 0 0 0 0 0 0 0 0 
2450.41 -227.744 0 0 0 0 0 0 0 0 0 0.08 0 0 0 0 0 0 0 0 1306.73 0 0 0 0 0 0 0 0 0 1578.8 0 0 0 0 0 0 0 0 178.152 0 0 0 0 0 0 0 0 0 0 0 0 0 0 0 0 0 0 0 0 0 0 -59.8926 2418.52 0 0 0 0 0 0 0 0 0 0 0 0 0 0 0 
0 0 0 0 1238.36 0 0 0 0 0 0 0 0.04 0 558.107 0 0 0 0 0 0 0 0 0 0 0 0 0 0 0 0 -584.658 0 0 -1732 0 0 0 0 2156.97 0 -89.3429 0 0 -392.697 0 0 0 -2326.81 2482.3 0 1020.77 0 0 2184.13 0 0 0 0 0 0 0 0 0 0 0 0 0 0 0 0 0 0 0 0 0 0 0 0 
0 0 0 0 0 0 0 0 0 0 0 0 0 0.09 0 0 0 0 0 0 1437.04 0 0 0 0 1543.09 0 0 0 0 0 2233.12 0 0 0 0 0 0 0 0 0 0 0 -2219.69 1262.02 0 0 57.1459 0 0 0 0 -1985.15 0 0 0 0 0 0 -240.257 0 0 0 0 0 0 0 0 0 0 0 0 0 0 0 0 0 0 0 
0 0 0 0 0 0 0 0 0 0 0 0 -1793.5 0 0.05 0 0 0 0 1338.47 0 0 0 0 0 0 842.54 0 0 0 0 0 0 0 0 0 0 986.74 0 -1164.82 0 0 1137.65 -1551.48 0 0 0 0 0 826.823 0 -1559.42 0 1784.34 0 0 2147.51 -249.26 0 0 -912.427 0 0 0 0 0 0 0 0 0 0 0 0 0 0 0 0 0 0 
0 0 -355.922 1338.92 0 0 0 0 1856.21 0 0 0 0 0 0 0 0 0 0 0 0 0 0 0 0 0 0 0 2134.85 0 2040.09 0 0 0 0 0 -371.944 0 0 -299.921 0 0 -1319.24 0 0 0 0 0 0 0 0 0 0 0 0 0 0 0 0 0 0 0 0 0 0 0 0 0 0 0 0 0 0 0 0 0 0 1894.21 0 
0 0 0 0 0 0 0 1806.16 0 0 0 0 0 0 0 0 0.07 -342.647 0 0 -87.5118 0 0 0 0 0 0 0 0 0 0 0 0 0 -1803.26 2049.09 -54.7044 0 0 -906.629 0 0 -920.515 0 0 0 -1101.18 0 0 0 0 0 0 0 0 0 0 0 0 0 0 2105.09 0 0 248.344 0 0 0 0 0 0 0 1202.96 0 0 0 0 0 0 
0 0 0 0 0 0 0 0 1565.83 0 0 0 0 0 0 0 1829.81 0.06 0 0 0 0 210.349 -589.694 0 0 0 0 0 0 -1009.17 0 0 0 0 0 0 0 0 0 0 0 0 0 0 0 -729.316 0 0 0 0 0 674.383 0 0 0 0 0 0 0 0 2351.53 0 0 0 0 0 0 0 0 0 0 0 0 0 0 0 0 0 
0 0 0 0 0 0 1020 0 0 0 511.872 0 0 0 0 0 0 0 0.04 0 0 0 0 0 0 0 0 0 0 0 0 0 0 0 1955.4 0 0 0 0 0 0 0 0 0 0 0 0 0 0 0 0 0 0 0 0 0 0 0 -1916.94 0 1826.91 1577.43 0 1173.06 0 0 0 0 0 0 0 0 0 0 1884.59 0 0 0 0 
0 0 0 0 0 0 0 0 1902.75 0 0 0 0 0 -345.698 0 0 0 0 0 0 0 0 -2162.62 0 0 0 0 0 0 0 0 0 -1309.32 0 0 0 -293.207 0 0 0 0 0 0 0 0 0 0 0 786.996 0 2185.35 0 0 0 0 0 0 0 -101.856 0 2125.69 0 0 0 0 0 0 0 0 0 0 0 0 0 0 0 0 0 
0 0 0 0 0 0 0 0 0 0 0 2326.35 0 104.297 0 0 191.275 0 0 0 0 0 0 0 0 2018.27 1491.52 0 0 0 0 0 0 0 -309.381 -135.884 0 0 -2241.36 0 0 0 0 0 0 0 0 0 0 0 0 0 0 0 0 0 0 0 745.338 0 0 0 0 0 1679.05 0 0 993.606 0 0 0 0 0 0 0 0 0 0 0 
0 0 0 0 0 0 -2065.87 0 0 0 0 0 0 0 0 0 0 0 0 0 0 0 0 0 0 0 0 0 0 0 0 0 0 0 0 0 0 1262.93 0 0 0 0 0 -387.509 0 0 0 0 0 0 0 0 0 0 1763.13 0 0 0 0 0 2452.7 0 0 0 0 -823.466 0 0 0 0 0 0 0 0 0 0 0 0 0 
0 0 0 0 0 0 0 0 0 0 0 0 0 0 0 0 0 1846.29 0 0 0 0 0.02 0 0 0 0 0 0 0 0 -65.3859 0 -2493.59 0 0 0 0 0 0 0 0 0 0 0 0 0 0 1656.47 1470.46 0 0 1702.55 0 0 0 0 0 0 0 0 0 0 0 -2199.09 2346.19 0 -1847.06 0 0 0 0 0 0 0 0 0 0 0 
0 -359.279 1221.27 0 0 0 739.387 0 0 0 0 0 0 0 0 0 0 -237.663 0 -465.636 0 0 0 0.02 0 0 0 0 0 0 0 0 0 0 0 1695.68 0 2198.78 0 0 0 0 0 0 0 0 260.552 0 1626.1 0 0 0 0 0 804.392 0 0 0 0 0 0 0 0 0 0 0 0 0 0 0 0 0 0 0 1239.59 0 0 0 0 
0 0 0 0 0 0 0 1172.9 0 0 0 0 0 0 0 0 0 0 0 0 0 0 0 0 0.06 510.346 0 0 0 0 0 0 0 0 0 0 0 0 0 2021.16 0 0 0 0 0 -364.925 0 0 0 0 0 1721.47 0 0 0 0 0 0 276.727 0 924.329 -166.707 0 -189.444 0 0 -1229.67 0 0 0 0 0 0 0 0 0 795.541 0 415.586 
0 0 0 0 0 0 0 2366.48 0 0 0 0 0 123.981 0 0 0 0 0 0 1226.62 0 0 0 -1645.48 0.06 0 1494.42 0 0 0 2102.5 0 -1245.99 0 0 0 0 0 0 0 0 0 0 1290.7 0 0 0 0 0 0 -2331.54 0 0 1252.71 0 0 0 0 0 0 0 1387.14 0 765.938 0 1821.57 0 0 0 0 0 0 0 0 0 0 0 0 
0 0 1234.4 -1833.93 0 0 0 0 0 0 0 0 0 0 155.721 0 0 0 0 0 2018.88 0 0 0 0 0 0.08 0 1427.43 0 0 1277.58 0 0 0 0 0 934.095 0 0 0 0 0 0 0 0 0 1559.42 0 0 0 0 0 0 0 0 0 0 -478.759 0 0 0 0 0 651.494 0 0 -1816.39 0 0 0 0 0 0 0 0 0 0 0 
0 0 0 0 0 0 2335.2 95.7518 0 1424.99 0 0 0 0 0 0 0 0 0 0 0 0 0 0 0 -893.658 0 0.07 1211.51 -2346.64 0 0 0 0 0 1958.3 0 0 0 0 0 0 0 0 0 0 0 0 0 0 0 0 0 0 1335.26 0 0 -586.795 -1757.03 -971.175 0 0 0 0 0 0 0 0 0 0 0 0 0 0 0 0 0 0 0 
0 737.556 0 1599.4 0 0 0 0 0 0 -1055.1 0 0 0 0 2467.35 0 0 0 0 0 0 0 0 0 0 1607.94 -1705.45 0.03 0 -2087.54 1480.83 0 0 0 -2326.5 0 0 0 0 -227.744 0 0 0 0 2162.16 0 0 81.2555 0 -901.44 0 0 0 0 0 0 0 0 0 0 0 0 0 0 0 0 0 0 0 0 0 0 0 0 0 0 0 0 
0 0 0 0 0 0 0 0 0 0 0 0 0 0 0 0 0 0 0 0 0 0 0 0 0 0 0 651.646 0 0.02 0 0 0 0 0 0 0 0 0 0 0 0 0 0 0 0 0 0 0 0 0 0 2126.15 0 0 0 0 0 0 0 0 0 0 0 0 0 0 0 0 0 0 0 0 0 0 0 0 0 0 
0 0 0 0 0 0 0 0 0 0 0 -591.22 0 0 0 1320.31 0 1939.22 0 0 0 0 0 0 0 0 0 0 951.949 0 0.05 0 1205.1 0 -1840.95 0 861.766 0 -1847.51 0 0 0 0 0 0 282.983 0 0 0 -1343.65 0 0 0 0 0 0 0 0 0 2367.7 0 614.261 0 0 0 0 0 0 0 0 0 0 0 0 0 0 0 0 0 
0 0 0 1574.22 0 0 0 0 0 0 0 0 1507.39 109.638 0 0 0 0 0 0 0 0 1680.73 0 0 2498.93 1765.42 0 -706.275 0 0 0.06 0 0 0 0 0 0 0 0 0 2336.12 0 0 847.575 0 159.23 0 0 0 0 0 0 0 0 0 0 0 -2219.99 952.559 0 0 0 0 0 0 0 0 0 0 0 0 0 0 0 0 0 0 0 
0 0 1988.81 0 0 0 0 0 0 0 0 0 0 0 0 0 0 0 0 0 0 0 0 0 0 0 0 0 0 0 2345.73 0 0.08 0 0 1172.29 0 0 0 0 0 0 0 0 0 1992.48 0 -34.8674 0 0 0 0 0 0 0 0 0 0 0 0 0 0 1986.83 0 0 0 0 0 0 0 0 0 0 0 0 0 0 0 0 
0 0 0 0 0 0 0 0 0 0 0 0 0 0 0 0 0 0 0 -2340.54 0 0 2176.35 0 0 -819.193 0 0 0 0 0 0 0 0 0 0 0 2164.3 0 0 -1359.07 0 2013.38 0 0 0 0 0 0 0 0 0 0 0 0 0 0 0 0 0 0 0 0 0 0 0 0 0 0 0 0 0 0 0 0 0 0 0 0 
0 0 1209.98 0 0 0 0 0 0 11.5207 0 0 2488.56 0 0 0 -1328.7 0 1678.75 0 1173.67 0 0 0 0 0 0 0 0 0 1543.09 0 0 0 0.07 0 0 0 0 0 0 0 0 0 -106.128 0 0 0 0 0 0 0 0 0 0 0 1283.53 0 0 0 45.5489 0 0 0 0 0 0 0 0 0 0 0 0 0 0 -2233.73 0 0 0 
0 0 0 0 0 -501.953 0 0 0 0 0 0 0 0 0 0 2042.38 0 0 0 793.405 0 0 235.374 0 0 0 2111.19 1982.86 0 0 0 1766.18 0 0 0.07 0 0 0 0 0 0 0 1626.26 0 0 0 -255.058 0 1822.34 1182.97 0 0 0 0 0 752.052 0 0 405.057 0 0 0 0 -1060.9 0 0 0 -2364.35 0 0 0 0 0 0 0 0 0 0 
0 0 0 0 0 0 0 0 0 0 0 0 0 0 0 -998.947 1968.21 0 0 0 0 0 0 0 0 0 0 0 0 0 1736.12 0 0 0 0 0 0.02 0 0 0 0 0 0 0 0 0 -1112.78 0 0 0 -1692.94 0 0 0 0 0 0 0 0 2203.82 2119.74 -253.838 0 0 0 0 300.684 0 0 0 0 0 0 0 0 0 0 0 0 
-325.251 0 0 0 0 0 0 0 0 0 0 0 0 0 2255.7 0 0 0 0 2404.63 0 -168.538 0 -430.998 0 0 1341.36 0 0 0 0 0 0 794.626 0 0 0 0.08 0 0 0 0 0 0 0 0 0 1596.04 0 -315.027 0 0 0 2479.55 0 0 0 0 0 0 0 0 0 0 0 0 0 0 0 0 0 -1641.67 0 0 0 0 0 0 0 
-1665.93 1782.82 0 0 0 0 0 0 0 -603.58 0 0 0 0 0 0 0 0 0 0 -2419.43 0 0 0 0 0 0 0 0 0 600.833 0 0 0 0 0 0 0 0.01 0 0 0 0 0 -614.872 409.482 653.02 0 2303 0 0 0 0 0 0 0 0 0 0 0 0 0 0 0 0 0 0 0 0 0 0 -921.583 0 0 0 0 0 0 0 
0 821.329 0 0 1231.8 0 -242.546 0 0 0 0 1197.93 361.873 0 2172.38 769.906 1367.46 0 0 0 0 0 0 0 2051.84 0 0 0 0 0 0 0 0 0 0 0 0 0 0 0.04 0 0 0 0 -484.558 0 0 0 0 0 0 0 1081.8 0 0 0 0 0 0 1428.8 0 0 488.525 2347.1 0 -927.076 0 0 0 0 0 0 0 0 0 0 0 0 0 
0 0 0 0 0 0 0 0 189.444 0 0 0 0 0 0 0 0 0 0 0 0 0 0 0 0 0 0 0 640.202 0 0 0 0 2321.01 0 0 0 0 0 0 0.03 0 0 0 0 0 671.484 0 0 0 0 0 0 0 0 0 1121.33 0 0 0 0 0 -2326.5 0 0 0 0 0 0 0 1429.72 0 0 0 0 0 0 0 0 
0 0 0 0 0 0 0 0 0 0 0 0 1248.44 0 0 0 0 0 0 0 0 0 0 0 0 0 0 0 0 0 0 -1039.69 0 0 0 0 0 0 0 0 0 0.05 0 -2424.92 0 0 0 1065.94 0 1661.5 0 0 393.918 0 0 0 0 0 0 0 0 0 0 0 0 0 0 0 0 0 0 0 0 0 0 0 0 0 0 
0 0 0 0 0 0 0 0 0 -1650.82 0 0 0 0 1025.19 11.2156 1796.4 0 0 0 0 0 0 0 0 0 0 0 0 0 0 0 0 2381.13 0 0 0 0 0 0 0 0 0 0 0 0 2173.91 0 0 0 0 0 0 0 0 0 0 0 0 0 0 0 0 0 0 0 0 0 0 0 0 0 0 0 0 1686.53 0 0 0 
0 0 0 0 0 0 0 0 0 2345.42 0 0 0 2227.62 -1410.18 0 0 0 0 0 0 -1351.74 0 0 0 0 0 0 0 0 0 0 0 0 0 279.931 0 0 0 0 0 -851.238 0 0.02 0 -508.362 372.707 0 0 0 0 0 0 0 0 0 0 2460.33 0 0 0 0 0 0 0 0 0 0 0 0 0 0 0 0 0 0 0 0 0 
0 0 0 0 -162.282 0 456.633 0 0 0 0 0 1294.67 1025.96 0 0 0 0 0 0 0 0 0 0 0 1994.77 0 0 0 0 0 -1401.49 0 0 1234.09 0 0 0 1317.87 -943.098 0 0 0 0 0.03 0 0 2370.91 0 0 0 0 0 0 0 624.79 1939.22 0 0 0 -1516.08 2440.95 0 0 -44.7859 0 0 0 0 0 0 0 0 0 0 0 0 0 0 
0 0 0 0 0 0 0 0 0 0 0 0 0 0 0 0 0 0 0 0 0 0 0 0 2444.61 0 0 0 2107.07 0 1352.2 0 1569.03 0 0 0 0 0 1444.98 0 0 0 0 -2399.44 0 0.01 0 0 0 -102.924 -1146.05 0 0 0 0 0 0 -1290.86 0 1133.38 0 361.568 0 0 -2158.04 0 0 0 0 0 0 -984.756 0 0 0 0 0 0 0 
1285.97 0 0 0 0 0 1388.52 0 0 0 0 0 0 0 0 0 -457.549 1521.88 0 0 0 0 0 1901.99 0 0 0 0 0 0 0 -340.968 0 0 0 0 -717.261 0 -1436.58 0 873.516 0 315.18 -859.783 0 0 0.02 0 0 0 0 0 0 0 0 0 0 0 0 0 0 0 0 0 2467.8 -1853.92 0 0 0 0 0 0 0 0 0 0 0 0 0 
0 0 225.761 0 0 0 0 0 0 0 0 0 0 268.944 0 0 0 0 0 0 0 0 0 0 0 0 995.438 0 0 0 0 0 2210.38 0 0 2495.27 0 -1687.9 0 0 0 1180.99 0 0 -746.406 0 0 0.01 0 0 0 0 1863.08 0 0 0 0 0 0 0 0 0 0 0 0 1453.22 0 0 0 -2312.46 0 0 0 -896.71 0 0 0 0 0 
186.544 0 0 0 0 0 0 0 0 0 0 0 1555.91 0 0 0 0 0 0 0 0 0 975.6 -2192.83 0 0 0 0 1345.18 0 0 0 0 0 0 0 0 0 -2061.14 0 0 0 0 0 0 0 0 0 0.04 1720.86 0 0 0 0 0 561.007 0 0 0 0 0 0 0 0 0 0 0 0 0 0 0 0 0 0 0 0 0 0 0 
0 -102.008 1250.11 0 0 0 -757.241 -2139.88 0 0 1842.33 0 -739.54 0 -980.483 0 0 0 0 -926.618 0 0 1214.41 0 0 0 0 0 0 0 1920.15 0 0 0 0 2478.94 0 377.285 0 0 0 2283.78 0 0 0 -1342.74 0 0 1291.16 0.09 0 0 0 0 0 0 -1915.42 0 0 0 0 0 -261.62 0 0 0 0 0 0 0 0 0 0 0 0 0 0 0 0 
0 0 0 0 1428.34 0 0 2320.86 2434.08 -2267.14 0 0 0 0 0 0 0 0 0 0 0 0 0 0 0 0 0 0 2271.72 0 0 0 0 0 0 -1735.51 -1379.36 0 0 0 0 0 0 0 0 -415.586 0 0 0 0 0.04 0 0 0 0 0 0 0 0 0 0 -794.931 0 0 0 0 0 0 0 0 0 0 0 0 0 0 0 0 0 
0 0 1185.57 0 2371.06 0 0 0 0 0 -429.319 0 1498.54 0 2351.83 0 0 0 0 1566.74 0 0 0 0 -203.635 1519.75 0 0 0 0 0 0 0 0 0 0 0 0 0 0 0 0 0 0 0 0 0 0 0 0 0 0.01 0 0 0 -286.798 0 0 1066.39 0 0 0 1947.31 0 0 0 0 0 0 0 0 0 0 0 0 0 0 0 0 
0 0 0 0 0 0 0 0 0 0 0 0 0 -763.192 0 0 0 -192.19 0 0 0 0 -118.183 0 0 0 0 0 0 359.584 0 0 0 0 0 0 0 0 0 -987.96 0 15.9459 0 0 0 0 0 896.557 0 0 0 0 0.01 0 0 841.319 0 0 0 0 0 0 0 0 1701.18 0 0 0 0 0 0 0 0 0 0 0 0 0 0 
2014.76 0 0 -758.461 0 0 0 0 0 0 0 0 0 0 -1636.17 0 0 0 0 0 0 0 0 0 0 0 0 0 0 0 0 0 0 0 0 0 0 1630.99 0 0 0 0 0 0 0 0 0 0 0 0 0 0 0 0.02 0 0 2123.25 0 -175.1 0 -1823.4 1986.53 0 0 0 0 0 0 0 0 0 0 0 0 0 0 0 -1692.48 0 
0 0 0 0 0 0 0 0 2459.56 0 2073.66 0 -1812.27 0 0 0 0 0 0 0 0 -1467.41 0 1321.53 0 2279.05 0 834.452 0 0 0 0 0 0 0 0 0 0 0 0 0 0 0 0 0 0 0 0 0 0 0 0 0 0 0.04 0 0 0 0 0 0 0 0 0 0 0 -688.879 0 0 0 0 0 0 0 0 0 0 0 0 
0 0 0 0 0 0 0 0 0 0 0 0 0 0 0 0 0 0 0 0 0 0 0 0 0 0 0 0 0 0 0 0 0 0 0 0 0 0 0 0 0 0 0 0 476.775 0 0 0 1804.18 0 0 -237.815 1808.15 0 0 0.01 0 460.753 0 0 0 0 0 0 0 0 0 0 0 0 0 0 0 0 0 0 0 0 0 
0 0 0 0 0 0 0 0 0 0 0 0 0 0 639.897 0 0 0 0 0 0 0 0 0 0 0 0 0 0 0 0 0 0 0 -450.224 -268.487 0 0 0 0 -7.70592 0 0 0 -22.66 0 0 0 0 323.725 0 0 0 1898.18 0 0 0.01 123.981 0 0 2232.35 0 0 0 -1566.29 0 0 0 0 0 0 0 0 0 0 0 0 0 0 
0 0 0 0 0 0 1016.8 0 0 0 1303.37 0 0 0 1696.6 0 0 0 0 0 0 0 0 0 0 0 0 -1200.06 0 0 0 0 0 0 0 0 0 0 0 0 0 0 0 -1418.42 0 1418.12 0 0 0 0 0 0 0 0 0 -2102.5 -26.1696 0.03 0 0 0 0 0 2169.79 0 0 0 0 0 0 -1716.74 0 0 0 0 0 0 0 0 
0 0 0 0 0 0 0 0 0 0 0 0 0 0 0 0 0 0 -1256.98 0 1867.96 0 0 0 122.913 0 2478.64 966.903 0 0 0 -2452.09 0 0 0 0 0 0 0 0 0 0 0 0 0 0 0 0 0 0 0 2288.66 0 -831.553 0 0 0 0 0 -2447.05 0 0 0 845.897 0 0 0 0 0 0 0 0 0 0 0 0 0 0 0 
0 0 0 0 538.423 0 0 0 0 0 0 0 0 -1192.43 0 0 0 0 0 1364.71 0 0 0 0 0 0 0 246.513 0 0 1397.06 -1736.27 0 0 0 1876.66 -2254.94 0 0 -364.925 0 0 0 0 0 1844.16 0 0 0 0 0 0 0 0 0 0 0 0 745.796 0.04 0 0 0 0 0 0 0 0 0 -1750.92 0 0 0 0 0 0 0 0 0 
-2333.52 0 0 0 0 0 0 0 0 0 0 0 0 0 733.741 0 0 0 2362.97 0 0 1181.45 0 0 2053.51 0 0 0 0 0 0 0 0 0 -1750.77 0 2047.56 0 0 0 0 0 0 0 1958.6 0 0 0 0 0 0 0 0 1516.85 0 0 672.857 0 0 0 0.01 0 0 0 0 0 0 0 0 0 0 0 0 0 0 0 0 0 0 
0 0 -1008.87 0 0 0 0 0 0 0 2263.33 0 0 0 0 0 2419.13 1976.61 -178.304 1529.51 0 0 0 0 1498.08 0 0 0 0 0 60.3504 0 0 0 0 0 -1316.95 0 0 0 0 0 0 0 278.863 -2100.97 0 0 0 0 2305.6 0 0 1188.62 0 0 0 0 0 0 0 0.02 0 0 0 0 0 0 0 0 0 0 0 0 0 0 0 0 0 
0 0 0 0 0 724.128 0 0 544.221 0 0 -624.638 0 0 0 0 0 0 0 0 0 0 0 0 0 446.867 0 0 0 0 0 0 779.061 0 0 0 0 0 0 2418.67 -89.8007 0 0 0 0 0 0 0 0 -1810.28 0 1364.25 0 0 0 0 0 0 0 0 0 0 0.05 0 0 0 0 0 0 0 0 0 0 0 0 0 -1431.39 0 0 
0 0 0 0 0 0 0 0 0 0 1729.41 646.153 0 0 0 0 0 0 599.155 0 0 0 0 0 139.698 0 0 0 0 0 0 0 0 0 0 0 0 0 0 114.978 0 0 0 0 0 0 0 0 0 0 0 0 0 0 0 0 0 -2415.01 2456.51 0 0 0 0 0.07 0 0 0 0 0 0 0 0 0 0 0 0 0 0 0 
0 0 0 0 0 0 0 0 0 0 782.723 0 0 0 0 0 2472.08 0 0 0 2485.66 0 -1559.11 0 0 -572.298 1216.39 0 0 0 0 0 0 0 0 1041.98 0 0 0 0 0 0 0 0 1529.82 1385.16 -472.808 0 0 0 0 0 -2095.78 0 0 0 2187.64 0 0 0 0 0 0 0 0.05 0 0 0 0 0 0 0 0 0 0 0 0 0 0 
0 0 0 0 0 0 0 816.904 0 885.876 0 0 0 0 0 0 0 0 0 0 0 1850.41 -1894.67 0 0 0 0 0 0 0 0 0 0 0 0 0 0 0 0 850.932 0 0 0 0 0 0 2353.82 105.213 0 0 0 0 0 0 0 0 0 0 0 0 0 0 0 0 0 0 0 0 1606.88 0 0 0 0 0 0 0 0 0 0 
0 -711.463 0 0 -1958.6 0 0 0 2156.51 0 0 0 0 0 0 0 0 0 0 0 0 0 0 0 -523.011 1774.88 0 0 0 0 0 0 0 0 0 0 -486.694 0 0 0 0 0 0 0 0 0 0 0 0 0 0 0 0 0 1167.1 0 0 0 0 0 0 0 0 0 0 0 0.02 0 0 0 0 0 0 0 0 0 0 0 0 
0 0 0 0 0 0 0 0 0 0 0 0 0 0 0 0 0 0 0 0 -768.38 0 1748.48 0 0 0 1288.57 0 0 0 0 0 0 0 0 0 0 0 0 0 0 0 0 0 0 0 0 0 0 0 0 0 0 0 0 0 0 0 0 0 0 0 0 0 0 0 0 0.03 0 0 0 0 0 0 0 0 0 0 0 
0 0 0 0 0 0 0 0 0 0 0 0 0 0 0 0 0 0 0 0 0 0 0 0 0 0 0 0 0 0 0 0 0 0 0 2270.96 0 0 0 0 0 0 0 0 0 0 0 0 0 0 0 0 0 0 0 0 0 0 0 0 0 0 0 0 0 987.655 0 0 0.07 0 -2459.41 0 0 0 0 0 0 0 0 
0 0 0 0 0 0 0 0 0 0 0 0 0 0 0 0 0 0 0 0 0 0 0 0 0 0 0 0 0 0 0 0 0 0 0 0 0 0 0 0 0 0 0 0 0 0 0 -859.02 0 0 0 0 0 0 0 0 0 0 0 2439.42 0 0 0 0 0 0 0 0 0 0.01 0 0 0 0 0 0 0 0 -312.433 
0 0 0 0 0 0 0 0 0 0 0 0 0 0 0 0 0 0 0 0 0 0 0 0 0 0 0 0 0 0 0 0 0 0 0 0 0 0 0 0 1175.5 0 0 0 0 0 0 0 0 0 0 0 0 0 0 0 0 1438.11 0 0 0 0 0 0 0 0 0 0 955.611 0 0.04 0 0 0 0 0 0 0 0 
0 0 0 0 0 0 0 0 0 0 0 0 0 0 0 0 0 0 0 0 0 0 0 0 0 0 0 0 0 0 0 0 0 0 0 0 0 1293.45 1923.2 0 0 0 0 0 0 1083.18 0 0 0 0 0 0 0 0 0 0 0 0 0 0 0 0 0 0 0 0 0 0 0 0 0 0.02 0 0 0 0 0 0 0 
0 0 0 0 2378.84 0 0 0 0 0 0 0 0 0 0 0 271.691 0 0 0 0 0 0 0 0 0 0 0 0 0 0 0 0 0 0 0 0 0 0 0 0 0 0 0 0 0 0 0 0 0 0 0 0 0 0 0 0 0 0 0 0 0 0 0 0 0 0 0 0 0 0 0 0.07 0 0 0 0 -609.226 0 
0 0 0 0 0 0 0 0 0 0 0 0 0 0 0 0 0 0 0 0 0 0 0 0 0 0 0 0 0 0 0 0 0 0 0 0 0 0 0 0 0 0 0 0 0 0 0 2380.67 0 0 0 0 0 0 0 0 0 0 0 0 0 0 0 0 0 0 0 0 0 0 0 0 0 0.01 0 0 0 0 0 
0 0 0 0 0 0 0 0 0 0 0 0 0 0 0 0 0 0 1885.81 0 0 0 0 1441.62 0 0 0 0 0 0 0 0 0 0 0 0 0 0 0 0 0 0 0 0 0 0 0 0 0 0 0 0 0 0 0 0 0 0 0 0 0 0 0 0 0 0 0 0 0 0 0 0 0 0 0.02 0 0 0 0 
-1564.76 0 0 0 0 0 0 0 0 0 0 0 0 0 0 0 0 0 0 0 0 0 0 0 0 0 0 0 0 0 0 0 0 0 646.611 0 0 0 0 0 0 0 1752.3 0 0 0 0 0 0 0 0 0 0 0 0 0 0 0 0 0 0 0 0 0 0 0 0 0 0 0 0 0 0 0 0 0.02 0 0 0 
0 0 0 0 0 0 0 0 0 0 0 0 0 0 0 0 0 0 0 0 0 0 0 0 567.263 0 0 0 0 0 0 0 0 0 0 0 0 0 0 0 0 0 0 0 0 0 0 0 0 0 0 0 0 0 0 0 0 0 0 0 0 0 -27.6955 0 0 0 0 0 0 0 0 0 0 0 0 0 0.04 0 0 
0 0 0 0 0 0 0 0 0 0 0 0 0 0 0 2475.43 0 0 0 0 0 0 0 0 0 0 0 0 0 0 0 0 0 0 0 0 0 0 0 0 0 0 0 0 0 0 0 0 0 0 0 0 0 -1003.83 0 0 0 0 0 0 0 0 0 0 0 0 0 0 0 0 0 0 2069.08 0 0 0 0 0.04 -81.4081 
0 0 0 0 0 0 0 0 0 0 0 0 0 0 0 0 0 0 0 0 0 0 0 0 532.167 0 0 0 0 0 0 0 0 0 0 0 0 0 0 0 0 0 0 0 0 0 0 0 0 0 0 0 0 0 0 0 0 0 0 0 0 0 0 0 0 0 0 0 0 1987.59 0 0 0 0 0 0 0 1623.66 0.04 
