*Vertices 52
*Matrix 
0.07 0 0 0 -838.725 0 0 0 0 0 0 -144.429 1465.73 0 0 0 0 0 0 0 0 0 0 0 0 0 2142.48 1100.42 0 0 0 -2232.96 0 0 0 0 0 0 0 1380.28 0 0 0 0 0 0 0 0 0 0 0 0 
0 0.08 1530.73 0 0 0 0 331.965 0 0 0 0 -906.781 1724.22 -466.094 0 0 0 0 -204.245 1940.75 0 0 0 0 1637.24 0 0 0 0 0 -2092.12 0 0 0 0 0 0 0 0 0 0 959.273 0 0 0 2131.03 1492.28 0 0 0 0 
0 -597.324 0.01 -1125.75 0 -293.207 0 -30.137 -846.66 2428.43 1447.57 524.995 0 756.63 2010.94 0 0 0 0 0 0 0 0 0 2005.91 0 1274.83 0 0 0 -1214.1 -1814.4 0 764.718 0 1809.67 0 -2089.07 0 0 0 -560.396 372.86 0 0 0 0 0 0 0 -891.827 0 
0 0 503.632 0.06 0 0 -2001.79 1260.49 1479.31 -975.906 0 -1377.38 0 0 1001.54 0 0 0 435.423 0 0 0 0 2018.72 0 0 1031.75 0 0 0 0 0 0 0 0 0 2001.02 0 0 0 0 0 0 0 0 0 0 0 0 0 0 -583.59 
-620.212 0 0 0 0.08 0 2188.25 0 2460.94 0 0 0 1374.17 -1408.81 -512.177 0 0 -473.876 0 0 0 524.842 0 1501.43 0 1708.81 0 1804.03 0 0 0 0 0 0 0 0 0 0 720.008 0 0 1324.73 0 0 0 0 0 0 0 0 0 -933.332 
0 0 -1116.14 0 0 0.01 -1009.32 0 -68.7429 211.722 0 0 0 0 0 2437.74 0 0 0 0 1180.38 0 2067.25 0 0 0 0 0 -979.568 0 0 0 601.444 0 0 0 0 0 0 0 2269.74 0 0 0 0 0 0 0 0 0 0 0 
0 0 0 -1307.18 2316.43 829.417 0.01 2143.24 1915.57 0 0 0 0 0 -538.881 0 2174.52 0 0 0 379.727 -312.586 0 0 0 0 0 0 0 1898.48 0 0 0 0 0 0 0 0 0 0 0 0 -667.058 0 0 -1267.51 0 0 0 0 0 0 
0 -129.475 667.211 439.238 0 0 319.605 0.01 1302.61 0 0 0 0 353.328 1532.11 0 0 0 -1649.75 2449.03 0 0 0 0 754.952 0 0 0 0 0 -1691.11 0 0 0 0 0 0 0 0 -1917.1 0 0 0 0 0 0 1948.53 0 0 0 0 0 
0 0 1926.71 906.323 -747.475 1126.82 -264.672 1111.1 0.09 0 0 -1687.6 0 0 0 0 0 -1988.81 -2173.3 0 0 1782.82 0 2404.17 0 0 0 0 0 0 1797.16 0 0 0 0 0 0 1780.53 -2429.5 0 0 0 0 0 -1039.99 0 0 0 0 152.364 0 0 
0 0 1249.2 1741 0 470.672 0 0 0 0 0 0 0 2185.2 0 0 0 0 0 0 0 -1017.41 0 0 1158.1 0 0 0 0 0 -65.5385 0 0 1688.97 0 0 -759.377 0 0 0 0 0 225.455 0 -2134.85 0 0 0 0 0 0 0 
0 0 1636.94 0 0 0 0 0 0 0 0.07 0 0 0 0 906.781 -226.524 0 -1480.38 0 0 0 1150.47 0 0 0 0 0 999.252 0 0 0 0 0 -735.115 1498.23 0 0 924.329 2449.8 0 0 0 -448.546 347.072 0 0 0 0 0 897.778 0 
937.3 0 1385.01 2017.5 0 0 0 0 -56.8407 0 0 0.01 0 0 0 0 0 0 0 0 -1362.58 0 0 -256.279 -129.17 0 0 0 0 0 0 0 0 0 0 0 0 0 0 0 0 0 0 0 0 0 0 0 0 0 0 0 
1016.04 1203.12 0 0 65.3859 0 0 0 0 0 0 0 0.04 0 0 0 0 0 0 0 0 0 0 909.68 0 0 0 0 0 0 0 0 0 0 0 0 0 0 0 0 0 0 0 0 0 0 0 0 0 0 0 0 
0 114.368 -1682.87 0 831.553 0 0 630.589 0 2480.01 0 0 0 0.04 0 0 -147.023 0 0 1968.06 -613.651 0 0 0 0 -255.516 0 0 0 -2122.94 0 0 0 0 0 0 0 0 0 0 0 0 0 0 0 -454.802 0 0 0 0 0 0 
0 -1376.16 687.658 -586.947 1675.39 0 -1384.4 -288.324 0 0 0 0 0 0 0.02 1191.21 0 0 0 0 1562.62 0 0 0 0 2088.61 0 0 0 0 0 0 -111.621 0 0 0 0 0 0 0 0 1495.79 384.915 0 0 0 0 0 0 0 -1736.12 2258.9 
0 0 0 0 0 1460.08 0 0 0 0 2444.3 0 0 0 19.4555 0.08 0 0 927.076 -1255.61 0 0 0 745.186 0 1298.18 0 0 0 0 0 0 0 0 0 -253.227 0 0 0 0 0 0 0 0 0 0 -368.13 0 0 0 0 0 
0 0 0 0 0 0 764.87 0 0 0 1722.69 0 0 237.205 0 0 0.06 0 515.839 0 0 0 0 0 773.873 0 0 0 0 0 0 0 0 0 -617.924 0 0 0 0 0 0 0 0 0 0 0 0 0 0 0 0 854.137 
0 0 0 0 1669.29 0 0 0 732.063 0 0 0 0 0 0 0 0 0.03 0 0 0 0 0 0 -1137.35 2099.44 -1704.99 0 0 0 0 1531.19 0 0 0 0 0 0 0 0 0 0 0 -506.836 0 0 0 0 -2201.68 0 0 0 
0 0 0 675.756 0 0 0 -1337.09 -1748.48 0 -137.41 0 0 0 0 1730.48 2147.66 0 0.07 0 0 0 0 0 0 2064.96 0 1898.48 0 0 0 0 0 0 0 0 179.067 0 0 1514.71 0 0 0 -1453.98 0 0 0 0 0 692.999 0 0 
0 1761.15 0 0 0 0 0 1613.74 0 0 0 0 0 1947.61 0 -960.036 0 0 0 0.07 0 -1890.55 0 -2486.88 0 975.6 0 0 0 0 0 0 1110.34 0 0 0 0 975.295 0 0 0 -81.2555 0 0 0 0 0 0 0 0 -1294.37 2057.63 
0 -1694.01 0 0 0 154.653 661.565 0 0 0 0 2492.37 0 1818.52 1871.17 0 0 0 0 0 0 1581.09 0 0 0 0 0 0 0 0 0 2400.51 0 0 0 0 0 0 0 0 0 0 0 0 2136.22 0 0 0 0 0 0 0 
0 0 0 0 -349.666 0 -641.728 0 2247.31 2433.62 0 0 0 0 0 0 0 0 0 140.156 2429.2 0.06 -1498.84 0 -1212.88 0 0 0 0 0 0 0 0 -609.836 1699.96 0 0 0 0 0 1500.06 0 0 0 0 0 -2001.63 0 -774.636 0 0 0 
0 0 0 0 0 1054.19 0 0 0 0 2269.74 0 0 0 0 0 0 0 0 0 0 -1489.84 0.02 0 0 -302.667 1861.4 0 0 0 0 0 0 0 0 0 2190.39 0 0 0 0 0 0 -1782.82 -2427.37 0 0 0 0 1582.77 0 0 
0 0 0 716.193 2337.79 0 0 0 1273.61 0 0 1580.78 -1282.92 0 0 164.876 0 0 0 875.042 0 0 0 0.08 2097.61 0 951.643 0 0 0 0 0 0 0 2311.4 0 0 2167.2 0 0 0 0 0 0 0 0 0 0 0 0 0 0 
0 0 1728.19 0 0 0 0 315.79 0 -1817.61 0 794.931 0 0 0 0 322.504 -589.236 0 0 0 1226.31 0 2451.63 0.08 -1925.18 0 0 0 0 0 -310.45 0 0 0 0 0 0 0 0 0 0 0 0 0 -568.178 697.272 -1293.6 1279.87 -188.681 0 0 
0 2274.01 0 0 -925.855 0 0 0 0 0 0 0 0 789.132 -1404.39 845.744 0 -410.55 1633.88 1191.21 0 0 18.9978 0 2136.98 0.04 -1085.31 0 0 0 0 0 0 -2337.79 0 0 0 0 -1246.6 0 0 0 0 0 0 0 0 0 0 0 0 0 
-400.479 0 2151.02 1043.5 0 0 0 0 0 0 0 0 0 0 0 0 0 667.211 0 0 0 0 427.488 2378.99 0 1560.49 0.06 0 0 0 0 0 0 0 0 0 0 0 0 0 2233.27 0 0 -1840.49 0 0 0 0 0 0 0 0 
2175.13 0 0 0 21.5918 0 0 0 0 0 0 0 0 0 0 0 0 0 2001.79 0 0 0 0 0 0 0 0 0.05 0 0 0 0 0 0 0 0 0 0 0 0 0 0 0 0 0 0 0 0 0 0 0 0 
0 0 0 0 0 1578.49 0 0 0 0 2099.29 0 0 0 0 0 0 0 0 0 0 0 0 0 0 0 0 0 0.06 0 0 0 0 0 0 0 0 287.255 0 0 0 0 0 0 0 0 0 0 0 0 0 0 
0 0 0 0 0 0 1930.22 0 0 0 0 0 0 2081.74 0 0 0 0 0 0 0 0 0 0 0 0 0 0 0 0.06 2202.44 0 0 1976.61 0 0 0 0 0 0 0 0 0 0 0 0 2378.99 0 0 0 0 0 
0 0 2180.62 0 0 0 0 -763.039 -69.6585 2243.64 0 0 0 0 0 0 0 0 0 0 0 0 0 0 0 0 0 0 0 2345.42 0.07 0 0 1104.85 0 0 0 0 1198.69 0 0 0 0 1377.38 0 0 0 0 0 0 0 137.41 
-160.756 1760.84 1696.3 0 0 0 0 0 0 0 0 0 0 0 0 0 0 -436.796 0 0 2249.29 0 0 0 1737.65 0 0 0 0 0 0 0.01 0 0 0 0 0 0 0 0 0 0 -749.763 0 0 0 0 0 0 444.884 0 0 
0 0 0 0 0 2407.83 0 0 0 0 0 0 0 0 1402.86 0 0 0 0 -1310.54 0 0 0 0 0 0 0 0 0 0 0 0 0.01 0 0 0 0 0 0 0 0 0 0 0 0 0 0 0 0 0 -1508.15 0 
0 0 -1034.81 0 0 0 0 0 0 -39.4452 0 0 0 0 0 0 0 0 0 0 0 -224.845 0 0 0 2385.1 0 0 0 228.965 233.085 0 0 0.05 0 0 0 0 0 0 0 2175.44 0 0 0 -954.848 0 0 0 0 0 0 
0 0 0 0 0 0 0 0 0 0 2453.76 0 0 0 0 0 -566.5 0 0 0 0 591.83 0 1872.69 0 0 0 0 0 0 0 0 0 0 0.09 0 0 0 0 1243.4 -552.919 0 0 0 0 0 0 0 -284.509 0 0 0 
0 0 1294.06 0 0 0 0 0 0 0 1403.78 0 0 0 0 -1774.73 0 0 0 0 0 0 0 0 0 0 0 0 0 0 0 0 0 0 0 0.07 0 0 0 0 -98.3459 0 0 0 0 0 0 0 0 0 -179.983 0 
0 0 0 932.569 0 0 0 0 0 2076.25 0 0 0 0 0 0 0 0 -636.692 0 0 0 2023.76 0 0 0 0 0 0 0 0 0 0 0 0 0 0.07 0 0 0 0 0 0 0 0 0 2423.7 0 -517.67 0 0 0 
0 0 907.697 0 0 0 0 0 218.741 0 0 0 0 0 0 0 0 0 0 -127.796 0 0 0 773.721 0 0 0 0 -1016.65 0 0 0 0 0 0 0 0 0.02 0 0 0 0 0 0 0 0 0 0 0 0 0 0 
0 0 0 0 1940.9 0 0 0 2306.05 0 2360.68 0 0 0 0 0 0 0 0 0 0 0 0 0 0 -2194.66 0 0 0 0 1102.25 0 0 0 0 0 0 0 0.09 0 -299.615 0 1522.8 0 0 0 0 0 0 0 1055.41 0 
-133.442 0 0 0 0 0 0 2322.84 0 0 -1387.91 0 0 0 0 0 0 0 -354.701 0 0 0 0 0 0 0 0 0 0 0 0 0 0 0 328.761 0 0 0 0 0.06 0 0 0 0 847.728 0 0 0 0 0 0 0 
0 0 0 0 0 840.403 0 0 0 0 0 0 0 0 0 0 0 0 0 0 0 -1062.12 0 0 0 0 326.472 0 0 0 0 0 0 0 1414.3 -905.56 0 0 2464.45 0 0.07 0 0 161.672 0 0 0 0 0 0 0 0 
0 0 1874.68 0 546.968 0 0 0 0 0 0 0 0 0 1596.8 0 0 0 0 -54.5518 0 0 0 0 0 0 0 0 0 0 0 0 0 -1634.34 0 0 0 0 0 0 0 0.02 0 0 0 0 0 -962.02 0 0 0 0 
0 2188.25 322.657 0 0 0 -1249.05 0 0 1107.14 0 0 0 0 -508.515 0 0 0 0 0 0 0 0 0 0 0 0 0 0 0 0 -952.406 0 0 0 0 0 0 803.781 0 0 0 0.02 948.439 0 0 0 -1061.66 0 1246.15 0 -530.03 
0 0 0 0 0 0 0 0 0 0 1776.86 0 0 0 0 0 0 -1628.7 783.639 0 0 0 -670.11 0 0 0 -2017.2 0 0 0 892.132 0 0 0 0 0 0 0 0 0 1549.81 0 1300.62 0.08 0 2007.13 0 759.835 -1844.16 0 0 0 
0 0 0 0 0 0 0 0 -306.787 215.842 256.584 0 0 0 0 0 0 0 0 0 -1889.93 0 1819.44 0 0 0 0 0 0 0 0 0 0 0 0 0 0 0 0 143.361 0 0 0 0 0.08 0 0 0 0 0 0 0 
0 0 0 0 0 0 2181.39 0 0 0 0 0 0 -883.129 0 0 0 0 0 0 0 0 0 0 -1291.01 0 0 0 0 0 0 0 0 2393.64 0 0 0 0 0 0 0 0 0 -1544.16 0 0.01 0 0 0 0 0 0 
0 -2375.18 0 0 0 0 0 2322.84 0 0 0 0 0 0 0 2091.2 0 0 0 0 0 1475.04 0 0 584.506 0 0 0 0 -2148.58 0 0 0 0 0 0 -570.009 0 0 0 0 0 0 0 0 0 0.05 0 0 0 0 0 
0 1142.99 0 0 0 0 0 0 0 0 0 0 0 0 0 0 0 0 0 0 0 0 0 0 969.649 0 0 0 0 0 0 0 0 0 0 0 0 0 0 0 0 651.494 -2397.92 1824.93 0 0 0 0.02 0 0 0 0 
0 0 0 0 0 0 0 0 0 0 0 0 0 0 0 0 0 -991.318 0 0 0 2165.36 0 0 -2429.2 0 0 0 0 0 0 0 0 0 99.7192 0 596.408 0 0 0 0 0 0 1949.45 0 0 0 0 0.05 0 0 -1869.18 
0 0 0 0 0 0 0 0 1056.63 0 0 0 0 0 0 0 0 0 6.48518 0 0 0 -1524.32 0 1416.9 0 0 0 0 0 0 -229.118 0 0 0 0 0 0 0 0 0 0 1453.06 0 0 0 0 0 0 0.09 0 0 
0 0 1878.64 0 0 0 0 0 0 0 1947.16 0 0 0 -2138.05 0 0 0 0 -1941.97 0 0 0 0 0 0 0 0 0 0 0 0 90.4111 0 0 1447.87 0 0 -894.574 0 0 0 0 0 0 0 0 0 0 0 0.07 0 
0 0 0 2123.25 1542.33 0 0 0 0 0 0 0 0 0 -685.522 0 451.14 0 0 -185.324 0 0 0 0 0 0 0 0 0 0 758.003 0 0 0 0 0 0 0 0 0 0 0 -2312.62 0 0 0 0 0 -684.149 0 0 0.09 
