*Vertices 74
*Matrix 
0.03 0 0 2491.3 0 0 0 0 0 0 0 0 -709.021 0 -849.559 0 0 0 0 0 0 0 0 -2035.51 1887.8 0 0 0 0 0 0 -584.506 0 0 2152.09 0 1975.08 0 0 0 0 0 -2107.68 0 0 0 0 0 0 0 0 0 0 0 0 1343.96 -922.346 0 0 0 0 0 0 0 2078.54 0 0 0 0 0 0 0 0 0 
0 0.06 0 0 0 0 0 0 0 0 0 1021.23 0 0 0 0 0 0 0 0 0 0 0 0 0 0 0 0 0 0 0 0 0 0 0 0 0 0 -149.77 0 2231.59 0 0 0 0 0 0 0 0 0 0 0 0 0 0 0 0 0 0 0 0 0 0 0 0 0 0 0 -863.598 0 983.993 0 0 0 
0 0 0.06 0 0 0 0 0 0 0 0 0 0 0 0 0 0 0 0 0 0 0 0 0 0 0 2471.01 0 0 0 0 0 0 0 0 0 0 0 0 0 0 0 -1489.53 0 0 0 0 0 0 0 1317.71 1064.56 0 0 0 0 0 0 0 0 0 0 -6.02741 0 0 0 0 0 0 -100.177 0 0 0 0 
1305.35 0 0 0.05 0 -2241.05 0 0 0 0 0 0 1157.19 0 0 0 0 1405.76 0 0 0 0 0 0 0 0 2487.95 0 -2077.32 0 0 2445.68 0 0 0 0 0 0 0 0 0 -886.944 0 0 0 0 0 0 0 0 1255.3 0 0 1160.85 -1051.59 0 0 0 812.937 0 0 0 0 0 0 0 0 0 0 0 0 0 0 0 
0 0 0 0 0.08 1378.75 0 0 0 0 0 0 0 0 0 0 0 -2224.88 0 0 0 1923.66 0 0 0 0 0 0 0 0 0 0 0 -1559.27 0 0 0 0 0 0 0 0 0 0 0 0 0 2096.85 0 -382.626 0 0 2193.9 0 0 0 0 0 0 0 0 0 0 0 0 0 0 0 0 0 1758.1 0 0 -698.95 
0 0 0 -1647.31 1122.09 0.06 0 -1127.28 0 0 0 0 0 0 0 1946.85 755.867 0 -873.211 468.993 0 -1212.12 0 0 0 0 1668.68 0 0 0 0 0 0 0 0 914.106 0 0 0 0 0 0 0 0 1028.4 0 0 0 0 0 0 0 0 0 0 -679.418 0 0 0 0 0 0 0 0 0 0 0 0 0 0 0 0 0 0 
0 0 0 0 0 0 0.01 0 0 0 1959.06 0 0 0 0 0 0 1525.09 0 0 -134.968 0 -261.467 0 0 0 0 0 0 0 0 0 0 0 0 0 0 2242.42 0 0 0 0 0 0 -901.288 0 0 1220.51 766.243 0 0 0 0 0 0 0 0 0 0 0 0 0 0 0 0 1867.05 0 0 0 0 0 0 0 0 
0 0 0 0 0 226.066 0 0.03 0 0 0 0 0 0 0 0 -484.405 0 0 0 0 0 588.321 0 0 0 0 0 0 0 0 0 0 1356.01 0 0 0 0 1198.84 1257.9 0 0 0 0 0 0 2055.35 0 0 0 0 0 0 -17.9296 0 1827.22 0 0 213.248 0 0 -589.999 1479.46 0 786.386 0 0 0 0 -2312.92 0 -565.889 0 0 
0 0 0 0 0 0 0 0 0.04 0 0 0 0 11.3681 2086.17 0 0 0 0 0 163.045 0 0 0 0 0 881.146 0 0 0 0 0 0 0 0 0 2123.25 0 0 -1428.8 0 0 0 0 0 0 0 0 0 0 0 0 0 0 0 0 0 0 0 0 0 0 0 -2269.74 0 0 0 0 0 0 0 0 0 0 
0 0 0 0 0 0 0 0 0 0.08 0 0 0 0 0 0 1563.39 0 0 -1489.38 0 818.583 0 0 0 0 0 0 0 0 0 0 0 0 0 1481.44 0 0 0 0 0 0 0 0 0 0 -485.473 -2113.94 0 -1927.02 -571.688 0 0 0 1007.49 0 0 0 0 0 0 0 2128.28 0 0 0 1794.72 0 0 0 0 0 0 0 
0 0 0 0 0 0 -1482.82 0 0 0 0.06 0 -166.707 0 166.25 1344.11 0 0 0 0 0 -40.6659 0 0 981.246 0 -2079.91 0 0 0 0 0 0 0 0 0 0 2138.51 0 0 0 0 0 0 0 0 1753.97 0 0 0 0 0 0 0 0 0 2215.41 0 -2103.11 0 0 0 0 0 1689.73 0 0 0 0 0 0 0 0 0 
0 -1058.15 0 0 0 0 0 0 0 0 0 0.03 385.983 0 0 0 0 0 0 0 0 0 0 0 0 0 0 0 0 0 0 0 0 1927.47 0 -1082.57 0 0 0 0 0 0 0 0 2382.81 0 579.318 0 0 0 0 0 0 0 0 0 -1123.92 0 0 0 0 0 0 0 0 0 0 0 0 0 1306.12 0 634.098 0 
1158.86 0 0 1778.7 0 0 0 0 0 0 1941.97 2243.49 0.08 210.959 0 0 0 0 -1733.22 0 0 0 0 0 -391.018 0 0 0 0 0 0 -562.075 -824.381 0 0 0 0 777.078 0 0 -735.267 0 0 2344.66 0 0 0 -528.657 0 0 -1834.09 0 0 0 0 0 0 0 0 0 0 0 0 0 -757.851 0 0 0 0 0 -2018.72 0 0 0 
0 0 0 0 0 0 0 0 1864.15 0 0 0 2422.79 0.04 0 0 0 0 -1191.06 0 0 0 0 -1157.95 0 0 0 0 0 -316.858 0 0 0 0 0 0 0 0 2492.52 0 0 0 0 0 0 -1315.73 0 0 0 0 0 -2402.65 0 0 0 0 0 0 0 0 0 0 0 0 0 0 0 0 0 -315.18 0 0 0 475.86 
2219.84 0 0 0 0 0 0 0 -2475.89 0 14.42 0 0 0 0.08 0 0 0 0 0 0 0 2292.78 0 0 0 1374.17 0 0 0 0 2158.19 0 0 0 0 0 0 720.161 0 0 0 0 0 0 0 0 0 0 0 0 0 0 601.444 0 0 0 0 0 0 0 0 0 0 0 -701.849 0 0 0 0 0 0 0 0 
0 0 0 0 0 1299.86 0 0 0 0 1328.7 0 0 0 0 0.08 0 0 0 0 0 0 0 0 0 0 0 0 0 -389.95 0 0 0 0 0 0 0 0 23.5755 -1494.11 0 0 0 1887.04 0 0 0 0 0 0 0 0 0 0 0 0 0 0 0 0 0 0 0 0 0 0 0 0 0 0 0 1790.29 0 0 
0 0 0 0 0 -28.9163 0 2377.32 0 -652.409 0 0 0 0 0 0 0.09 0 0 0 0 0 0 0 2167.35 0 0 1489.99 0 0 0 0 0 0 0 0 0 0 0 0 -874.279 1753.67 0 -1411.86 0 0 0 -791.574 0 0 0 0 0 0 0 0 0 0 0 0 0 0 0 0 0 0 0 0 0 0 0 0 0 0 
0 0 0 2343.44 -2004.99 0 -331.965 0 0 0 0 0 0 0 0 0 0 0.09 -1349.6 0 -448.393 0 0 0 0 0 0 1085.62 0 0 0 0 0 0 0 0 0 0 0 0 0 0 0 1949.6 0 0 0 0 0 0 1812.88 0 0 0 0 0 0 0 0 0 0 0 0 2287.44 0 0 2205.95 0 0 0 0 -1643.8 0 0 
0 0 0 0 0 2309.11 0 0 0 0 0 0 341.426 1165.27 0 0 0 1587.5 0.02 0 0 0 -633.488 0 0 0 0 0 0 0 0 0 0 0 0 0 0 983.688 0 0 50.8896 0 0 0 0 0 0 0 0 0 -375.759 0 0 0 0 0 0 0 0 0 0 -399.106 482.421 0 0 0 446.257 0 0 0 1167.41 0 0 -837.046 
0 0 0 0 0 -670.415 0 0 0 -1339.84 0 0 0 0 0 0 0 0 0 0.04 0 0 0 0 -1032.67 0 0 0 0 0 -1445.89 0 0 1144.67 0 0 0 0 133.137 0 0 0 0 2006.21 0 0 0 0 0 0 897.778 2471.31 0 0 0 0 0 0 -839.03 0 0 0 0 0 0 0 0 0 0 0 680.181 0 -235.527 0 
0 0 0 0 0 0 -2475.43 0 -2288.2 0 0 0 0 0 0 0 0 -1455.05 0 0 0.01 0 0 0 0 0 0 0 0 0 2163.08 0 0 0 0 0 0 0 -460.295 0 0 2485.05 2447.2 0 0 0 0 0 0 0 0 0 0 0 0 0 -152.058 0 0 0 0 0 0 0 0 0 0 0 0 0 1022.9 0 0 0 
0 0 0 0 1877.73 725.806 0 0 0 -2014.15 1183.13 0 0 0 0 0 0 0 0 0 0 0.03 0 31.0526 0 0 2333.83 0 2467.19 -336.085 0 0 0 0 0 -727.18 0 893.506 0 0 0 0 0 0 0 0 0 0 0 0 -1163.75 0 176.016 -1999.19 0 -829.417 0 0 0 0 0 0 0 0 0 0 0 1660.44 0 2296.29 0 0 0 0 
0 0 0 0 0 0 1891 595.34 0 0 0 0 0 0 -2148.43 0 0 0 2363.28 0 0 0 0.02 -486.084 0 0 0 725.806 0 0 0 756.172 0 0 0 0 0 0 0 0 0 0 0 0 0 0 0 0 0 0 0 0 0 0 0 0 -383.084 0 472.655 0 0 0 0 0 0 0 0 0 0 0 0 0 0 1289.48 
-1393.55 0 0 0 0 0 0 0 0 0 0 0 0 -141.53 0 0 0 0 0 0 0 707.648 1053.73 0 0 0 0 0 0 0 0 0 0 0 0 0 0 0 0 0 0 0 0 0 0 0 0 0 0 0 0 0 0 -2012.62 0 0 0 0 0 0 2173.91 0 0 0 0 0 0 0 0 0 0 0 0 0 
2305.6 0 0 0 0 0 0 0 0 0 -342.341 0 278.1 0 0 0 1323.05 0 0 1977.68 0 0 0 0 0.08 0 794.778 0 0 0 0 0 0 0 0 0 0 0 0 0 0 345.393 0 0 0 0 -944.624 0 0 0 0 0 0 0 0 0 0 0 0 0 0 0 0 0 0 0 0 0 0 0 0 0 0 846.812 
0 0 0 0 0 0 0 0 0 0 0 0 0 0 0 0 0 0 0 0 0 0 0 0 0 0.04 0 0 0 0 0 0 0 0 0 0 0 0 0 0 0 1764.5 0 0 0 0 -2318.26 0 1364.86 0 0 0 0 0 0 0 0 1076.46 0 0 0 0 0 0 0 0 0 0 0 0 0 0 0 0 
0 0 1020.31 1449.86 0 -116.81 0 0 2380.37 0 -94.2259 0 0 0 1327.17 0 0 0 0 0 0 -1722.39 0 0 285.73 0 0.01 0 0 0 0 0 0 0 0 0 0 0 975.906 0 5.72222 867.26 0 0 0 0 0 0 0 0 0 0 0 0 0 0 0 0 2089.98 0 -2397.46 0 0 0 0 0 0 0 0 0 0 -1214.41 0 0 
0 0 0 0 0 0 0 0 0 0 0 0 0 0 0 0 2374.42 40.2081 0 0 0 0 -1207.24 0 0 0 0 0.06 0 -390.713 0 0 0 0 -267.266 0 0 0 0 0 0 0 0 0 0 0 0 0 0 0 -785.928 0 0 0 0 0 0 0 0 0 1930.52 0 1896.65 0 0 0 879.162 1228.29 -777.993 0 0 0 0 0 
0 0 0 464.263 0 0 0 0 0 0 0 0 0 0 0 0 0 0 0 0 0 -1488.62 0 0 0 0 0 0 0.08 623.722 0 0 69.9637 0 0 1190.15 0 0 0 0 0 -356.99 0 0 0 0 0 0 0 0 0 0 0 0 0 0 1196.55 0 67.3696 0 0 0 0 2275.38 0 0 0 0 0 0 548.036 0 0 0 
0 0 0 0 0 0 0 0 0 0 0 0 0 -737.251 0 2249.9 0 0 0 0 0 -2103.87 0 0 0 0 0 -517.212 2251.58 0.02 0 0 0 0 0 0 -910.291 0 721.381 0 0 0 0 0 0 0 0 0 -749.458 0 0 0 0 0 1081.96 0 0 0 0 0 0 0 0 0 0 0 -795.236 0 0 0 0 489.593 0 0 
0 0 0 0 0 0 0 0 0 0 0 0 0 0 0 0 0 0 0 1218.99 2019.18 0 0 0 0 0 0 0 0 0 0.08 0 -871.532 0 0 0 0 0 0 0 0 0 -2044.36 0 0 0 0 0 0 0 0 0 0 0 1521.58 0 0 0 0 0 0 0 0 0 2011.25 0 0 0 0 0 0 0 0 0 
-214.011 0 0 2214.04 0 0 0 0 0 0 0 0 -2446.29 0 -635.014 0 0 0 0 0 0 0 -2493.9 0 0 0 0 0 0 0 0 0.01 0 0 0 0 0 990.555 1325.34 0 0 0 0 -405.515 0 0 0 1567.81 0 0 0 0 0 0 0 0 0 0 0 0 0 0 1339.69 0 0 0 987.655 0 0 0 0 0 0 0 
0 0 0 0 0 0 0 0 0 0 0 0 2019.64 0 0 0 0 0 0 0 0 0 0 0 0 0 0 0 63.097 0 1735.51 0 0.03 0 0 0 0 473.266 0 0 0 0 0 0 0 -472.808 0 0 1427.58 0 0 0 0 0 0 0 0 904.035 0 2052.6 0 0 991.318 0 0 0 0 0 0 2480.01 -1463.44 0 0 0 
0 0 0 0 -1753.52 0 0 1885.05 0 0 0 1057.08 0 0 0 0 0 0 0 -1507.69 0 0 0 0 0 0 0 0 0 0 0 0 0 0.04 0 0 -235.527 0 0 2104.18 0 0 0 0 0 0 0 0 0 0 0 0 0 0 0 0 0 0 0 0 0 1788.16 0 0 0 0 1214.71 0 -1069.29 2239.98 0 0 0 0 
-1158.56 0 0 0 0 0 0 0 0 0 0 0 0 0 0 0 0 0 0 0 0 0 0 0 0 0 0 1562.47 0 0 0 0 0 0 0.09 -2017.04 2064.81 0 0 0 0 0 0 1984.39 0 0 1432.92 -1930.22 0 0 0 0 0 0 2040.54 2346.95 0 0 0 0 2460.78 0 0 0 0 0 0 0 0 0 2395.78 0 0 0 
0 0 0 0 0 -78.6615 0 0 0 2295.37 0 1372.95 0 0 0 0 0 0 0 0 0 1769.23 0 0 0 0 0 0 1900.62 0 0 0 0 0 1971.27 0.08 1755.35 0 0 938.368 0 0 0 0 0 0 0 0 0 0 0 -1470.31 0 -1845.07 0 0 1838.51 0 0 0 0 0 0 0 0 0 0 0 0 0 0 0 0 0 
815.683 0 0 0 0 0 0 0 -1665.62 0 0 0 0 0 0 0 0 0 0 0 0 0 0 0 0 0 0 0 0 -1582.16 0 0 0 710.547 -161.061 -319.452 0.02 0 1263.7 0 0 0 0 0 0 0 0 0 0 0 0 0 0 0 0 994.369 0 0 0 0 0 0 0 0 0 0 0 0 0 0 0 1764.35 0 0 
0 0 0 0 0 0 10.7578 0 0 0 2256.61 0 2400.81 0 0 0 0 0 -102.618 0 0 2271.87 0 0 0 0 0 0 0 0 0 2278.74 -200.125 0 0 0 0 0.08 492.34 0 0 0 0 0 0 2225.33 0 0 0 0 0 0 0 0 0 128.864 0 0 0 0 0 0 0 0 1531.5 0 0 0 0 0 0 0 0 0 
0 -82.9341 0 0 0 0 0 -831.858 0 0 0 0 0 -1789.68 1352.96 1560.95 0 0 0 1356.62 353.481 0 0 0 0 0 -500.427 0 0 -1711.86 0 -2310.63 0 0 0 0 877.941 -1192.89 0.04 0 0 0 0 0 0 0 0 1874.98 2116.99 0 0 0 0 2394.71 0 0 0 0 0 0 0 788.675 -24.3385 0 0 0 0 0 0 -1768.17 0 0 0 0 
0 0 0 0 0 0 0 1657.38 506.378 0 0 0 0 0 0 849.559 0 0 0 0 0 0 0 0 0 0 0 0 0 0 0 0 0 -1513.95 0 -880.535 0 0 0 0 0 0 0 0 0 0 890.454 0 0 0 567.721 0 0 0 0 0 0 0 0 0 0 0 0 0 0 0 0 0 0 0 0 0 -894.269 0 
0 -1481.9 0 0 0 0 0 0 0 0 0 0 437.254 0 0 0 1200.52 0 2272.64 0 0 0 0 0 0 0 2220.91 0 0 0 0 0 0 0 0 0 0 0 0 0 0.03 0 874.889 0 0 0 0 0 0 220.573 668.432 0 0 0 0 1451.23 0 0 -1240.5 0 0 0 0 0 0 -851.695 0 0 0 0 0 0 0 34.5622 
0 0 0 1757.03 0 0 0 0 0 0 0 0 0 0 0 0 374.233 0 0 0 1951.58 0 0 0 -2327.42 1698.13 243.614 0 2220.6 0 0 0 0 0 0 0 0 0 0 0 0 0.05 0 0 0 -29.9844 -293.054 0 0 0 0 0 -68.4378 0 0 0 0 0 0 0 0 0 0 0 195.09 0 0 0 1589.94 0 0 0 0 0 
-1551.33 0 -1089.59 0 0 0 0 0 0 0 0 0 0 0 0 0 0 0 0 0 -2069.54 0 0 0 0 0 0 0 0 0 2419.43 0 0 0 0 0 0 0 0 0 434.965 0 0.05 0 0 0 434.812 363.094 0 0 0 0 0 0 0 596.713 1134.6 0 0 0 0 0 0 0 0 0 0 0 0 0 0 0 0 0 
0 0 0 0 0 0 0 0 0 0 0 0 1036.94 0 0 780.892 -2287.74 2153.46 0 2046.19 0 0 0 0 0 0 0 0 0 0 0 353.328 0 0 -854.137 0 0 0 0 0 0 0 0 0.01 0 0 0 0 0 0 0 0 0 0 2442.63 0 0 0 0 0 1616.34 0 0 0 0 0 0 0 -2471.16 0 0 0 0 0 
0 0 0 0 0 -956.221 -869.091 0 0 0 0 1264.15 0 0 0 0 0 0 0 0 0 0 0 0 0 0 0 0 0 0 0 0 0 0 0 0 0 0 0 0 0 0 0 0 0.01 -177.847 0 0 0 1822.64 0 0 0 1694.92 0 0 0 0 0 0 0 0 0 0 0 0 0 0 0 -659.124 0 2485.05 0 0 
0 0 0 0 0 0 0 0 0 0 0 0 0 791.726 0 0 0 0 0 0 0 0 0 0 0 0 0 0 0 0 0 0 1126.97 0 0 0 0 -90.8689 0 0 0 46.1592 0 0 2370.6 0.01 0 1209.98 0 543.001 0 0 0 0 0 0 0 0 0 0 0 0 0 730.995 0 0 -281.304 -1877.27 0 0 0 -1513.64 -63.4022 0 
0 0 0 0 0 0 0 140.461 0 -144.734 -955.611 1436.28 0 0 0 0 0 0 0 0 0 0 0 0 2039.02 1905.35 0 0 0 0 0 0 0 0 2230.83 0 0 0 0 2330.77 0 -2221.06 -1110.64 0 0 0 0.08 0 0 0 0 0 0 -2163.69 0 1719.34 0 0 0 0 0 0 0 0 -1244.93 0 0 0 0 0 0 -1540.8 0 0 
0 0 0 0 -2150.11 0 423.521 0 0 2499.69 0 0 -106.281 0 0 0 538.27 0 0 0 0 0 0 0 0 0 0 0 0 0 0 1025.96 0 0 613.346 0 0 0 2196.8 0 0 0 2083.73 0 0 -344.478 0 0.01 0 0 0 2478.79 0 0 1759.32 0 0 0 0 0 0 0 0 0 -2206.56 -1958.45 0 0 0 0 0 0 0 0 
0 0 0 0 0 0 -2053.97 0 0 0 0 0 0 0 0 0 0 0 0 0 0 0 0 0 0 2021.62 0 0 0 1640.9 0 0 624.485 0 0 0 0 0 -1484.95 0 0 0 0 0 0 0 0 0 0 0 0 0 0 0 -1874.22 0 0 0 0 0 0 0 0 0 0 0 2175.89 0 0 0 0 0 0 0 
0 0 0 0 -2279.35 0 0 0 0 1748.48 0 0 0 0 0 0 0 0 0 0 0 0 0 0 0 0 0 0 0 0 0 0 0 0 0 0 0 0 0 0 632.267 0 0 0 1753.36 59.74 0 0 0 0.08 0 0 0 0 0 0 0 0 -2028.18 0 0 0 0 0 0 0 0 0 0 0 0 0 0 0 
0 0 1118.43 -525.3 0 0 0 0 0 -130.696 0 0 1727.12 0 0 0 0 2266.08 -2183.98 138.936 0 1364.56 0 0 0 0 0 544.526 0 0 0 0 0 0 0 0 0 0 0 1559.88 -2105.7 0 0 0 0 0 0 0 0 0 0.07 0 0 0 0 0 0 0 0 726.264 0 0 0 0 0 0 0 0 0 0 0 0 0 0 
0 0 1303.52 0 0 0 0 0 0 0 0 0 0 -463.042 0 0 0 0 0 -110.096 0 0 0 0 0 0 0 0 0 0 0 0 0 0 0 1231.96 0 0 0 0 0 0 0 0 0 0 0 -692.846 0 0 0 0.09 0 -2001.33 0 0 0 0 0 0 0 0 0 0 1733.83 2060.69 0 0 0 0 0 -357.143 0 0 
0 0 0 0 848.491 0 0 0 0 0 0 0 0 0 0 0 0 0 0 0 0 1608.1 0 0 0 0 0 0 0 0 0 0 0 0 0 0 0 0 0 0 0 2172.38 0 0 0 0 0 0 0 0 0 0 0.06 0 0 0 0 -270.47 0 0 0 0 0 0 0 -2109.36 0 0 0 0 0 0 0 0 
0 0 0 -886.334 0 0 0 844.981 0 0 0 0 0 0 -2.36518 0 0 0 0 0 0 2054.89 0 1730.32 0 0 0 0 0 0 0 0 0 0 0 1484.65 0 0 -463.195 0 0 0 0 0 270.47 0 1798.84 0 0 0 0 -862.682 0 0.02 0 0 0 0 0 0 0 0 0 0 0 0 0 -1842.94 -167.623 0 0 1007.19 449.309 0 
0 0 0 1704.99 0 0 0 0 0 -149.77 0 0 0 0 0 0 0 0 0 0 0 0 0 0 0 0 0 0 0 1889.32 -1842.63 0 0 0 2293.24 0 0 0 0 0 0 0 0 1050.22 0 0 0 -2143.24 2298.73 0 0 0 0 0 0.04 0 0 0 0 1483.43 0 0 0 0 0 0 0 0 0 0 0 0 0 0 
-586.947 0 0 0 0 1737.04 0 -1717.51 0 0 0 0 0 0 0 0 0 0 0 0 0 -1137.81 0 0 0 0 0 0 0 0 0 0 0 0 100.787 0 1530.12 -123.676 0 0 -1205.4 0 -159.383 0 0 0 297.784 0 0 0 0 0 0 0 0 0.01 0 0 0 -530.641 1559.57 0 0 0 1669.74 0 0 0 0 0 0 0 0 0 
-381.1 0 0 0 0 0 0 0 0 0 1772.74 1478.24 0 0 0 0 0 0 0 0 1311.15 0 -536.744 0 0 0 0 0 170.217 0 0 0 0 0 0 687.048 0 0 0 0 0 0 -2387.54 0 0 0 0 0 0 0 0 0 0 0 0 0 0.03 2368.01 0 0 0 0 2028.03 0 0 0 0 0 -1940.6 2269.13 0 0 0 0 
0 0 0 0 0 0 0 0 0 0 0 0 0 0 0 0 0 0 0 0 0 0 0 0 0 837.504 0 0 0 0 0 0 -1307.79 0 0 0 0 0 0 0 0 0 0 0 0 0 0 0 0 0 0 0 79.577 0 0 0 -913.953 0.07 0 0 0 337.153 0 2068.93 -132.069 0 -300.378 1830.42 0 0 0 0 0 0 
0 0 0 1426.97 0 0 0 2282.56 0 0 380.49 0 0 0 0 0 0 0 0 -1277.73 0 0 966.75 0 0 0 314.417 0 459.227 0 0 0 0 0 0 0 0 0 0 0 2129.35 0 0 0 0 0 0 0 0 867.26 0 0 0 0 0 0 0 0 0.03 0 0 2212.82 0 0 -795.694 0 0 0 0 0 0 0 0 0 
0 0 0 0 0 0 0 0 0 0 0 0 0 0 0 0 0 0 0 0 0 0 0 0 0 0 0 0 0 0 0 0 -2447.81 0 0 0 0 0 0 0 0 0 0 0 0 0 0 0 0 0 7.55333 0 0 0 -1281.85 -732.673 0 0 0 0 0 0 0 2249.75 1291.92 0 -673.315 0 2049.24 0 0 0 0 0 
0 0 0 0 0 0 0 0 0 0 0 0 0 0 0 0 0 0 0 0 0 0 0 2333.22 0 0 395.596 1728.34 0 0 0 0 0 0 -183.493 0 0 0 0 0 0 0 0 -780.129 0 0 0 0 0 0 0 0 0 0 0 1173.36 0 0 0 0 0.08 0 0 2131.49 0 0 0 0 0 0 0 0 0 1576.2 
0 0 0 0 0 0 0 2389.52 0 0 0 0 0 0 0 0 0 0 -422.147 0 0 0 0 0 0 0 0 0 0 0 0 0 0 2312.01 0 0 0 0 601.901 0 0 0 0 0 0 0 0 0 0 0 0 0 0 0 0 0 0 83.697 -1284.45 0 0 0.05 0 0 0 0 0 0 0 0 0 0 0 0 
0 0 -733.741 0 0 0 0 -196.463 0 687.811 0 0 0 0 0 0 0 0 218.131 0 0 0 0 0 0 0 0 -191.275 0 0 0 710.395 2315.67 0 0 0 0 0 1720.86 0 0 0 0 0 0 0 0 0 0 0 0 0 0 0 0 0 1285.52 0 0 0 0 0 0.04 0 -2061.14 0 0 2065.11 0 0 0 0 0 0 
0 0 0 0 0 0 0 0 159.383 0 0 0 0 0 0 0 0 1873.76 0 0 0 0 0 0 0 0 0 0 1727.42 0 0 0 0 0 0 0 0 0 0 0 0 0 0 0 0 -633.641 0 0 0 0 0 0 0 0 0 0 0 665.838 0 834.91 2420.19 0 0 0.06 0 0 0 0 0 0 1922.13 706.122 0 0 
2328.94 0 0 0 0 0 0 1961.81 0 0 -2053.36 0 -575.045 0 0 0 0 0 0 0 0 0 0 0 0 0 0 0 0 0 -617.924 0 0 0 0 0 0 -1831.19 0 0 0 862.529 0 0 0 0 2381.74 2364.19 0 0 0 -2051.23 0 0 0 1442.23 0 1672.49 507.599 -944.624 0 0 1054.03 0 0.06 0 0 0 0 0 0 2010.03 -2274.01 0 
0 0 0 0 0 0 1109.88 0 0 0 0 0 0 0 -1513.95 0 0 0 0 0 0 0 0 0 0 0 0 0 0 0 0 0 0 0 0 0 0 0 0 0 2266.84 0 0 0 0 0 0 -745.949 0 0 0 1876.2 -652.562 0 0 0 0 0 0 0 0 0 0 0 0 0.09 0 0 0 -729.011 0 0 0 0 
0 0 0 0 0 0 0 0 0 2243.03 0 0 0 0 0 0 0 462.279 956.526 0 0 0 0 0 0 0 0 2109.97 0 -1055.1 0 -1319.09 0 13.5044 0 0 0 0 0 0 0 0 0 0 0 -1529.36 0 0 -195.547 0 0 0 0 0 0 0 0 2304.38 0 1247.52 0 0 0 0 0 0 0.08 0 0 0 0 0 0 0 
0 0 0 0 0 0 0 0 0 0 0 0 0 0 0 0 0 0 0 0 0 1904.74 0 0 0 0 0 40.8185 0 0 0 0 0 0 0 0 0 0 0 0 0 0 0 0 0 1737.95 0 0 0 0 0 0 0 -1159.02 0 0 0 1517 0 0 0 0 -161.214 0 0 0 0 0.01 0 0 0 0 0 -1476.26 
0 2303.92 0 0 0 0 0 0 0 0 0 0 0 0 0 0 0 0 0 0 0 0 0 0 0 0 0 -1114.15 0 0 0 0 0 518.433 0 0 0 0 0 0 0 1898.79 0 1583.38 0 0 0 0 0 0 0 0 0 603.58 0 0 -337.306 0 0 417.57 0 0 0 0 0 0 0 0 0.08 0 0 0 0 0 
0 0 -495.239 0 0 0 0 1487.7 0 0 0 0 0 -1253.78 0 0 0 0 0 0 0 2446.59 0 0 0 0 0 0 0 0 0 0 2220.91 1662.42 0 0 0 0 -1898.48 0 0 0 0 0 -1692.18 0 0 0 0 0 0 0 0 0 0 0 -1671.73 0 0 0 0 0 0 0 0 1560.95 0 0 0 0.09 0 0 -176.016 0 
0 998.642 0 0 1025.04 0 0 0 0 0 0 451.292 -1012.38 0 0 0 0 0 403.836 2441.4 -342.647 0 0 0 0 0 0 0 -1130.63 0 0 0 -831.248 0 1056.17 0 0 0 0 0 0 0 0 0 0 0 0 0 0 0 0 0 0 0 0 0 0 0 0 0 0 0 0 815.073 0 0 0 0 0 0 0.05 0 0 0 
0 0 0 0 0 0 0 383.694 0 0 0 0 0 0 0 -44.4807 0 -537.66 0 0 0 0 0 0 0 0 1960.59 0 0 2431.18 0 0 0 0 0 0 -2221.37 0 0 0 0 0 0 0 518.738 2306.97 805.918 0 0 0 0 -214.927 0 1266.75 0 0 0 0 0 0 0 0 0 249.87 -201.193 0 0 0 0 0 0 0.03 0 0 
0 0 0 0 0 0 0 0 0 0 0 893.201 0 0 0 0 0 0 0 801.187 0 0 0 0 0 0 0 0 0 0 0 0 0 0 0 0 0 0 0 84.3074 0 0 0 0 0 2465.36 0 0 0 0 0 0 0 51.5 0 0 0 0 0 0 0 0 0 0 696.051 0 0 0 0 -1342.13 0 0 0.09 0 
0 0 0 0 1948.53 0 0 0 0 0 0 0 0 -2183.68 0 0 0 0 367.977 0 0 0 2036.12 0 1810.13 0 0 0 0 0 0 0 0 0 0 0 0 0 0 0 2044.97 0 0 0 0 0 0 0 0 0 0 0 0 0 0 0 0 0 0 0 -1540.8 0 0 0 0 0 0 -2005.6 0 0 0 0 0 0.01 
