*Vertices 45
*Matrix 
0.05 67.3696 0 0 0 0 0 0 408.261 2288.05 0 0 0 0 0 0 0 0 -1984.24 0 1387.3 0 0 0 0 0 0 0 0 -152.058 -1549.65 0 0 0 0 0 0 0 0 0 0 0 0 0 0 
840.098 0.07 0 0 0 0 2270.04 0 0 0 0 0 0 0 0 0 0 0 0 2061.91 0 0 0 0 0 0 0 0 0 0 -1226.31 0 0 2114.4 0 0 0 0 0 0 0 0 0 0 0 
0 0 0.05 0 0 0 1191.06 0 0 0 0 0 0 502.411 1100.27 491.577 0 0 0 0 2126.76 0 1472.75 0 0 0 0 0 0 0 0 0 0 0 0 0 0 0 0 0 0 0 -830.18 0 0 
0 0 0 0.09 0 0 0 0 0 0 0 0 960.189 0 2110.43 0 0 0 0 0 0 0 0 0 0 0 0 0 0 0 0 -329.066 0 0 0 0 0 0 0 0 0 0 0 0 0 
0 0 0 0 0.02 0 0 505.158 0 0 0 2058.55 0 0 0 0 0 0 0 0 0 0 0 0 0 89.0378 0 -1188.77 0 1020 0 0 0 0 0 0 0 0 0 0 0 0 0 0 0 
0 0 0 0 0 0.04 0 1463.29 -1390.5 1779.31 0 -532.624 0 0 0 1119.19 0 -1609.32 1592.23 0 0 0 0 0 0 0 0 0 -437.559 0 0 0 0 0 0 0 0 0 -1852.4 0 0 0 0 0 1082.11 
0 -1554.99 -714.057 0 0 0 0.09 1936.78 0 0 0 0 0 2055.65 0 0 2285.61 0 0 0 0 0 -1440.7 0 0 0 -1047.47 0 0 0 0 0 0 0 0 0 0 0 0 0 0 0 0 0 0 
0 0 0 0 -881.451 1763.74 1510.59 0.08 0 0 608.158 233.695 0 0 0 0 0 0 0 0 0 0 0 0 0 0 0 0 0 0 0 0 0 0 2091.51 1413.24 0 0 0 0 0 0 0 0 0 
2079.45 0 0 0 0 1891.61 0 0 0.08 0 0 0 0 0 0 0 0 0 0 435.423 0 0 0 0 -646.916 -1447.26 0 0 0 0 0 0 0 0 0 0 0 0 0 0 0 0 0 0 0 
1120.56 0 0 0 0 1346.55 0 0 0 0.04 0 -1655.71 0 0 0 0 0 0 0 0 0 0 0 0 0 0 -1518.37 0 0 0 0 0 326.93 0 0 0 1702.25 -442.137 0 396.97 0 1729.26 0 0 0 
0 0 0 0 0 0 0 -954.848 0 0 0.01 0 0 0 0 0 0 0 0 0 0 0 0 0 0 0 0 0 0 0 2427.06 0 0 0 0 0 0 0 0 0 0 0 236.9 0 0 
0 0 0 0 2479.4 -1867.05 0 -1015.88 0 2018.72 0 0.08 576.418 0 -348.445 0 0 0 0 2350 0 0 0 0 0 -56.8407 0 0 0 0 0 0 0 0 0 -2077.47 0 0 0 0 0 0 0 0 -2050.77 
0 0 0 563.906 0 0 0 0 0 0 0 2453.61 0.01 0 0 0 0 0 0 0 0 0 0 0 1374.63 0 0 -124.287 -412.839 0 0 0 0 0 0 0 0 0 0 1938.46 0 0 0 0 0 
0 0 -1484.8 0 0 0 2441.86 0 0 0 0 0 0 0.02 1658.15 0 0 0 2240.75 0 0 1591.62 0 0 429.319 0 0 -1571.63 0 1391.72 0 0 0 0 0 0 0 31.0526 0 0 0 0 -488.525 1278.19 0 
0 0 -1956.01 1069.29 0 0 0 0 0 0 0 -277.795 0 2274.01 0 821.94 0 0 0 0 0 0 0 0 0 0 0 0 0 0 0 0 0 0 0 0 0 0 0 1431.39 0 418.79 0 0 0 
0 0 -145.192 0 0 704.443 0 0 0 0 0 0 0 0 -421.232 0.02 0 0 0 0 -1012.38 0 0 0 0 0 0 2459.11 0 0 0 0 0 0 1059.22 0 0 -40.9711 0 0 0 0 2387.23 0 0 
0 0 0 0 0 0 -1258.51 0 0 0 0 0 0 0 0 0 0.01 0 1716.74 0 0 0 -803.171 0 0 1174.58 0 0 0 0 0 0 0 0 0 0 731.758 0 0 -659.734 0 0 2275.69 0 0 
0 0 0 0 0 735.42 0 0 0 0 0 0 0 0 0 0 0 0.05 633.946 0 0 0 0 0 0 1562.01 0 -887.097 0 0 0 2438.96 0 0 0 -14.42 0 0 0 0 0 0 0 1675.7 2150.41 
2243.34 0 0 0 0 1645.48 0 0 0 0 0 0 0 627.079 0 0 2334.28 -1435.21 0.07 0 0 0 0 0 0 0 0 -326.014 0 0 0 0 2167.2 2015.52 0 0 0 0 0 0 456.786 0 0 0 0 
0 -2016.59 0 0 0 0 0 0 259.789 0 0 1600.77 0 0 0 0 0 0 0 0.06 0 0 0 0 0 0 0 0 0 0 -610.446 382.015 0 2326.35 0 849.101 0 482.574 0 0 0 0 0 0 0 
-971.328 0 1788.77 0 0 0 0 0 0 0 0 0 0 0 0 -2272.48 0 0 0 0 0.07 0 0 0 1934.49 0 0 0 0 0 0 0 0 0 0 0 0 0 0 0 0 0 0 0 0 
0 0 0 0 0 0 0 0 0 0 0 0 0 2460.02 0 0 0 0 0 0 0 0.01 -2043.75 0 2095.48 0 0 0 610.904 0 0 0 0 0 1575.9 0 0 0 0 0 0 0 0 0 0 
0 0 287.866 0 0 0 1113.85 0 0 0 0 0 0 0 0 0 -885.113 0 0 0 0 570.315 0.02 0 0 0 0 0 2180.17 0 1930.52 0 0 0 0 0 0 0 0 -489.135 749.001 0 0 0 0 
0 0 0 0 0 0 0 0 0 0 0 0 0 0 0 0 0 0 0 0 0 0 0 0.05 0 530.793 0 0 0 0 0 0 0 2214.96 0 0 0 0 0 0 0 0 0 0 1480.83 
0 0 0 0 0 0 0 0 2384.18 0 0 0 2190.85 2026.2 0 0 0 0 0 0 2105.85 521.332 0 0 0.09 0 1881.85 0 0 0 0 0 0 0 0 0 307.855 758.919 0 -48.9059 0 0 0 0 0 
0 0 0 0 1730.17 0 0 0 748.695 0 0 -1142.69 0 0 0 0 -1141.47 -1818.83 0 0 0 0 0 2340.85 0 0.08 0 0 0 0 0 0 0 0 0 0 1307.34 0 0 0 0 2168.26 0 0 0 
0 0 0 0 0 0 -1893.29 0 0 1454.44 0 0 0 0 0 0 0 0 0 0 0 0 0 0 -1097.83 0 0.04 0 0 0 0 0 0 2027.57 0 0 0 0 0 0 0 1675.54 0 0 0 
0 0 0 0 1715.06 0 0 0 0 0 0 0 1077.53 2408.75 0 488.83 0 -1013.44 432.981 0 0 0 0 0 0 0 0 0.09 0 0 0 0 0 0 0 0 0 0 0 0 0 0 0 0 0 
0 0 0 0 0 -1212.12 0 0 0 0 0 0 -2236.78 0 0 0 0 0 0 0 0 1089.74 1659.37 0 0 0 0 0 0.08 0 1565.83 0 1024.12 0 0 0 0 0 0 0 895.795 0 0 0 0 
2466.58 0 0 0 416.349 0 0 0 0 0 0 0 0 -2095.02 0 0 0 0 0 0 0 0 0 0 0 0 0 0 0 0 0 0 0 0 0 0 0 0 0 1796.55 0 0 0 0 0 
-1254.54 -1467.1 0 0 0 0 0 0 0 0 1665.62 0 0 0 0 0 0 0 0 -1174.89 0 0 -1745.58 0 0 0 0 0 2317.8 0 0.06 0 0 0 0 0 1229.67 0 0 0 644.78 0 0 0 0 
0 0 0 155.568 0 0 0 0 0 0 0 0 0 0 0 0 0 935.316 0 1326.41 0 0 0 0 0 0 0 0 0 0 0 0.02 0 0 0 0 1324.27 0 0 0 0 0 0 0 0 
0 0 0 0 0 0 0 0 0 -20.6763 0 0 0 0 0 0 0 0 -459.38 0 0 0 0 0 0 0 0 0 2155.6 0 0 0 0.08 0 0 0 214.621 0 0 -1924.12 0 0 0 0 0 
0 -2165.97 0 0 0 0 0 0 0 0 0 0 0 0 0 0 0 0 -235.527 2305.75 0 0 0 1026.11 0 0 1329.62 0 0 0 0 0 0 0.07 0 0 0 0 0 0 0 0 0 0 0 
0 0 0 0 0 0 0 742.286 0 0 0 0 0 0 0 -20.6763 0 0 0 0 0 -1757.79 0 0 0 0 0 0 0 0 0 0 0 0 0.06 0 1571.02 0 0 0 0 167.776 331.507 0 0 
0 0 0 0 0 0 0 1896.34 0 0 0 1066.39 0 0 0 0 0 20.9815 0 2121.57 0 0 0 0 0 0 0 0 0 0 0 0 0 0 0 0.03 0 0 0 0 0 0 0 0 -2169.64 
0 0 0 0 0 0 0 0 0 1920.61 0 0 0 0 0 0 1446.2 0 0 0 0 0 0 0 966.597 -1304.9 0 0 0 0 -1397.37 554.14 -92.3948 0 1848.28 0 0.02 0 0 0 0 0 -1904.74 0 2354.58 
0 0 0 0 0 0 0 0 0 1556.22 0 0 0 -926.16 0 2210.38 0 0 0 -721.992 0 0 0 0 -1878.49 0 0 0 0 0 0 0 0 0 0 0 0 0.05 0 0 0 0 2288.96 0 0 
0 0 0 0 0 2492.07 0 0 0 0 0 0 0 0 0 0 0 0 0 0 0 0 0 0 0 0 0 0 0 0 0 0 0 0 0 0 0 0 0.03 0 0 0 0 -1497.16 0 
0 0 0 0 0 0 0 0 0 1375.24 0 0 -140.156 0 -268.639 0 1808.6 0 0 0 0 0 1505.4 0 1741.31 0 0 0 0 -1038.01 0 0 1232.57 0 0 0 0 0 0 0 0 0 0 0 0 
0 0 0 0 0 0 0 0 0 0 0 0 0 0 0 0 0 0 -1168.94 0 0 0 796.609 0 0 0 0 0 1048.39 0 1465.12 0 0 0 0 0 0 0 0 0 0.08 0 0 0 0 
0 0 0 0 0 0 0 0 0 616.398 0 0 0 0 -520.569 0 0 0 0 0 0 0 0 0 0 -2362.21 1431.09 0 0 0 0 0 0 0 1357.39 0 0 0 0 0 0 0.07 0 0 0 
0 0 210.807 0 0 0 0 0 0 0 850.78 0 0 2394.41 0 -1763.89 -1277.58 0 0 0 0 0 0 0 0 0 0 0 0 0 0 0 0 0 384.915 0 108.57 865.734 0 0 0 0 0.03 0 0 
0 0 0 0 0 0 0 0 0 0 0 0 0 2182.3 0 0 0 1823.1 0 0 0 0 0 0 0 0 0 0 0 0 0 0 0 0 0 0 0 0 -622.501 0 0 0 0 0.05 0 
0 0 0 0 0 -1534.09 0 0 0 0 0 1123 0 0 0 0 0 2200.77 0 0 0 0 0 1373.41 0 0 0 0 0 0 0 0 0 0 0 -2279.96 2024.06 0 0 0 0 0 0 0 0.08 
