*Vertices 58
*Matrix 
0.04 0 -147.328 0 -293.817 0 0 1439.02 0 0 0 0 666.143 0 0 0 0 2196.8 0 1003.68 0 -624.18 478.454 629.673 0 0 0 0 0 0 0 0 0 0 0 0 0 0 0 -1071.89 0 0 0 0 0 0 0 0 0 0 0 0 0 -1330.23 130.848 0 0 0 
0 0.05 0 0 0 2152.85 0 0 1990.34 0 1506.32 1204.64 0 0 0 0 0 0 0 0 -1131.55 0 2128.44 0 1727.27 0 0 0 0 0 1560.34 0 0 0 0 -1155.96 0 0 0 0 0 0 0 0 -35.6304 0 0 0 -1477.32 0 0 -2099.9 0 0 0 0 0 0 
-1294.82 0 0.09 0 399.869 -657.292 0 -2173.6 0 0 2432.86 2355.19 0 0 0 0 1629.31 1189.23 0 0 1387.6 0 640.507 0 0 0 0 0 0 0 0 0 0 0 0 0 0 0 0 0 0 0 0 0 0 0 0 0 0 0 -340.205 0 0 0 0 0 0 0 
0 0 0 0.04 466.247 977.889 0 0 0 0 0 0 1057.54 -46.3118 0 0 0 0 -615.177 0 0 0 521.485 0 0 0 0 0 585.116 0 0 0 0 -363.704 0 2140.34 0 0 0 0 0 0 0 0 0 0 0 0 -252.77 0 24.6437 0 0 0 0 0 0 0 
237.815 0 -89.0378 440.764 0 0 0 0 1727.12 239.189 0 0 0 0 0 0 821.177 0 0 0 0 -1022.6 0 0 0 0 0 0 0 0 0 0 0 0 0 0 0 0 0 0 0 0 1417.97 0 0 -940.809 0 0 0 0 0 0 0 0 0 0 0 1759.32 
0 1037.1 -1780.53 -1236.23 0 0.07 0 0 2086.63 -1981.49 1222.19 0 -1458.71 2365.87 189.749 0 0 0 0 2061.75 0 0 2428.43 0 0 0 0 0 0 0 0 0 0 0 0 0 0 0 0 -167.776 0 0 0 0 0 0 0 0 0 0 1579.56 0 0 0 519.044 0 0 0 
0 0 0 0 0 0 0.01 0 -2314.14 1523.56 996.963 1710.18 906.018 1262.02 2035.05 0 0 0 0 0 0 0 0 0 0 -1331.75 0 0 0 0 0 0 0 0 0 0 0 0 0 0 0 0 0 0 0 0 0 0 0 0 0 0 0 0 0 0 0 0 
1767.4 0 924.94 0 0 0 0 0.04 0 0 0 0 0 435.881 0 0 -67.217 0 0 0 -1661.35 0 707.648 1241.87 0 0 0 0 0 0 0 0 0 948.439 -900.372 0 0 0 0 0 0 521.943 0 0 0 0 -1095.39 0 -1216.09 0 0 0 0 0 0 0 0 1416.75 
0 -148.701 0 0 245.293 2208.85 416.959 0 0.06 0 0 0 484.558 0 0 0 0 0 0 -646.153 2458.04 2140.95 0 0 0 0 0 -95.9044 0 0 0 0 0 0 -2238 -835.673 0 0 0 0 0 0 0 -1445.74 0 0 0 0 0 1556.52 0 0 92.0896 0 0 0 0 0 
0 0 0 0 1406.37 188.223 -191.885 0 0 0.01 -1222.34 0 1599.55 832.469 0 0 0 1140.4 2035.2 -2039.78 0 0 0 0 0 -2199.55 0 0 0 0 0 0 0 0 0 0 0 0 0 0 0 0 0 0 0 0 0 0 0 0 0 0 0 0 0 0 0 0 
0 -877.483 2263.48 0 0 -364.01 -1526.15 0 0 1461.76 0.06 0 0 0 -759.682 0 0 0 0 0 0 0 0 0 2428.89 0 2367.4 0 0 0 0 0 0 0 0 0 0 0 0 0 0 0 0 0 0 0 0 0 0 0 1332.36 -888.165 0 0 0 1807.69 0 -267.113 
0 2417.75 -1830.58 0 0 0 -481.201 0 0 0 0 0 0 0 0 1053.42 0 0 0 0 0 0 0 0 1746.8 0 0 0 -329.981 0 -212.027 0 0 0 0 0 -507.447 0 0 0 0 782.571 0 0 0 0 0 -424.894 1093.55 0 0 0 0 0 -622.501 0 0 0 
2205.8 0 0 929.975 0 -921.43 2030.78 0 2023.15 -836.741 0 0 0.04 0 -1694.01 2448.88 0 2246.24 0 -2132.25 0 1161 0 1511.66 0 -143.361 234.764 0 0 0 0 0 0 0 0 0 0 0 0 0 0 0 1745.43 0 0 0 0 0 0 0 0 0 0 0 -718.635 0 0 0 
0 0 0 969.039 0 2392.12 -2362.51 2029.25 0 339.9 0 0 0 0.04 284.814 0 -911.969 0 1907.79 0 0 258.415 322.199 -1415.22 0 0 0 2342.22 -2432.1 0 0 0 0 0 0 0 0 0 0 0 0 0 0 0 0 0 0 0 0 -1853.47 0 0 0 1812.11 0 0 0 -458.312 
0 0 0 0 0 1267.2 2333.83 0 0 0 1872.23 0 -846.355 -1690.8 0.09 0 0 280.236 0 1751.38 0 0 0 0 0 374.691 -1186.48 0 0 0 0 0 0 0 0 0 0 -912.58 0 0 0 -1039.54 0 0 0 0 0 0 713.141 0 0 0 0 0 0 0 0 0 
0 0 0 0 0 0 0 0 0 0 0 1548.28 -1032.36 0 0 0.06 0 0 0 0 0 0 0 0 -457.701 0 0 -1629.92 -346.309 0 0 0 0 0 2045.58 0 0 1940.29 0 0 0 0 0 0 0 0 0 0 0 0 -1827.98 1557.44 0 450.224 0 0 0 0 
0 0 848.796 0 1601.54 0 0 426.267 0 0 0 0 0 -1457.79 0 0 0.09 0 0 1903.52 0 0 0 0 0 0 0 0 0 287.255 0 0 0 0 0 -1692.79 0 2465.51 0 0 0 0 0 0 0 0 0 -960.189 0 0 0 2198.78 0 0 0 181.814 0 0 
-1796.7 0 1573.92 0 0 0 0 0 0 -842.845 0 0 534.15 0 2160.02 0 0 0.09 0 0 -2427.21 0 0 0 0 1514.4 -237.815 0 0 0 0 0 985.061 0 0 0 2314.14 0 0 0 0 0 0 0 0 0 0 0 0 0 2498.47 0 0 0 0 0 0 0 
0 0 0 1945.63 0 0 0 0 0 851.695 0 0 0 2186.42 0 0 0 0 0.02 0 1699.96 0 -473.724 0 0 0 0 0 0 0 0 0 0 0 0 0 0 0 0 0 0 0 0 0 2313.99 0 0 0 0 0 0 -1580.17 0 0 0 0 0 0 
155.568 0 0 0 0 -18.54 0 0 -1901.38 -202.567 0 0 -1300.01 0 1762.52 0 1269.8 0 0 0.01 0 0 0 0 -953.475 1617.4 0 0 0 -606.632 0 0 0 0 0 0 0 110.096 0 0 -8.1637 0 2370.14 0 0 0 0 0 0 0 -553.987 0 0 0 0 0 0 0 
0 2188.86 2204.12 0 0 0 0 -2185.05 469.909 0 0 0 0 0 0 0 0 1624.73 -565.889 0 0.03 0 0 0 1283.07 0 0 0 0 0 0 -936.995 0 0 0 0 0 0 0 0 0 0 0 0 0 0 0 0 0 0 0 0 0 0 -832.316 0 0 0 
1075.55 0 0 0 -98.3459 0 0 0 -396.97 0 0 0 946.455 2487.33 0 0 0 0 0 0 0 0.05 1980.42 0 0 -693.609 0 0 0 0 0 0 852.916 -49.8215 0 0 1932.36 0 0 0 0 1970.66 0 0 0 0 0 0 0 0 0 0 1919.84 0 0 0 0 0 
1199.3 323.42 1044.27 1543.7 0 2114.55 0 -855.51 0 0 0 0 0 2384.79 0 0 0 0 1459.78 0 0 1350.06 0.09 0 796.304 892.743 -1911.76 0 0 0 0 0 0 0 0 438.017 0 0 0 -30.137 0 0 0 0 0 0 0 0 0 0 0 0 0 0 0 0 0 0 
213.858 0 0 0 0 0 0 -87.817 0 0 0 0 1827.83 1994.16 0 0 0 0 0 0 0 0 0 0.04 0 0 1406.67 639.897 0 0 1092.79 0 -1766.34 1281.55 -65.5385 0 0 0 0 0 0 0 0 0 -901.44 0 0 0 0 0 0 0 1977.22 0 0 0 0 0 
0 -43.1074 0 0 0 0 0 0 0 0 -318.537 -2037.49 0 0 0 -2396.39 0 0 0 845.286 1482.82 0 2222.13 0 0.08 0 0 0 0 1608.25 0 -220.267 0 0 0 0 0 0 0 0 0 0 0 0 0 0 0 0 0 1473.36 0 2109.82 0 0 0 0 0 0 
0 0 0 0 0 0 1744.82 0 0 1463.9 0 0 1598.94 0 -2446.29 0 0 1452.76 0 -285.882 0 404.752 -969.955 0 0 0.02 0 0 -384.457 0 0 979.11 0 0 1690.19 0 0 0 0 0 0 0 0 0 0 770.821 0 0 0 -291.375 0 -1629.31 0 0 0 0 0 0 
0 0 0 0 0 0 0 0 0 0 1271.63 0 184.713 0 801.187 0 0 1620.76 0 0 0 0 -1930.68 1071.89 0 0 0.06 0 0 0 0 1863.08 0 -2480.32 -1129.11 915.632 819.041 -685.064 0 0 0 0 0 0 0 0 0 -8.77407 0 0 0 0 0 0 1739.33 0 0 -2301.48 
0 0 0 0 0 0 0 0 1195.64 0 0 0 0 -1159.17 0 2493.74 0 0 0 0 0 0 0 1305.2 0 0 0 0.09 0 0 0 0 0 0 0 0 0 0 0 0 98.9563 0 0 0 0 0 0 0 0 0 0 0 0 0 0 0 2083.57 0 
0 0 0 1367.31 0 0 0 0 0 0 0 -1951.28 0 712.226 0 1453.67 0 0 0 0 0 0 0 0 0 1039.84 0 0 0.04 0 2195.58 0 -2357.33 0 -239.494 0 0 0 0 0 0 1850.57 0 0 353.786 0 0 0 0 0 0 0 0 -589.999 -662.023 0 0 0 
0 0 0 0 0 0 0 0 0 0 0 0 0 0 0 0 1355.25 0 0 2216.33 0 0 0 0 774.941 0 0 0 0 0.08 0 0 0 0 0 -2413.48 2412.87 0 0 0 0 0 0 0 0 0 0 0 0 0 0 0 0 0 0 1852.85 0 0 
0 -807.596 0 0 0 0 0 0 0 0 0 168.691 0 0 0 0 0 0 0 0 0 0 0 -33.4941 0 0 0 0 2195.58 0 0.04 0 0 2216.03 0 0 0 0 1830.27 0 -142.14 0 0 0 0 0 0 0 0 0 0 0 0 0 0 0 0 1085.31 
0 0 0 0 0 0 0 0 0 0 0 0 0 0 0 0 0 0 0 0 1028.7 0 0 0 1452.3 1714.76 -771.584 0 0 0 0 0.02 0 0 -2175.89 0 0 0 0 0 1055.1 2481.84 543.611 0 1346.1 201.193 0 0 0 0 0 0 0 0 0 0 0 0 
0 0 0 0 0 0 0 0 0 0 0 0 0 0 0 0 0 1990.19 0 0 0 505.31 0 2425.99 0 0 0 0 -599.307 0 0 0 0 0 0 0 0 0 -199.362 0 0 0 0 0 0 0 0 0 0 0 0 0 0 0 0 0 0 0 
0 0 0 1638.46 0 0 0 1555.76 0 0 0 0 0 0 0 0 0 0 0 0 0 -2204.89 0 1157.19 0 0 -13.5044 0 0 0 -239.494 0 0 0.04 0 0 0 917.463 0 1289.48 0 0 0 1312.07 0 0 0 0 0 0 0 0 1571.78 0 0 0 0 0 
0 0 0 0 0 0 0 -28.9163 1484.95 0 0 0 0 0 0 1203.12 0 0 0 0 0 0 0 1159.63 0 953.322 1646.55 0 88.7326 0 0 -806.68 0 0 0.09 0 -534.761 0 0 0 0 0 0 0 0 0 -1350.37 0 0 0 0 0 0 0 0 316.706 0 0 
0 2326.35 0 1901.53 0 0 0 0 -2171.32 0 0 0 0 0 0 0 963.546 0 0 0 0 0 1923.81 0 0 0 2096.85 0 0 486.084 0 0 0 0 0 0 0 0 0 2446.13 0 1463.74 0 0 0 0 0 -1426.05 0 0 0 0 0 34.7148 0 0 0 1934.49 
0 0 0 0 0 0 0 0 0 0 0 2334.28 0 0 0 0 0 68.2852 0 0 0 2279.81 0 0 0 0 -776.009 0 0 2436.52 0 0 0 0 -599.918 0 0.08 0 -390.713 0 0 0 -753.883 1374.02 -1867.35 0 0 0 0 0 0 0 0 265.74 0 0 0 0 
0 0 0 0 0 0 0 0 0 0 0 0 0 0 1716.9 1685.46 -989.334 0 0 2368.92 0 0 0 0 0 0 1661.05 0 0 0 0 0 0 -2265.77 0 0 0 0 0 0 0 0 0 0 748.39 0 0 0 0 0 0 -1908.25 0 0 1183.89 1439.48 1171.99 0 
0 0 0 0 0 0 0 0 0 0 0 0 0 0 0 0 0 0 0 0 0 0 0 0 0 0 0 0 0 0 -424.589 0 -142.598 0 0 0 1193.66 0 0.06 0 0 -1285.82 0 0 0 0 0 -493.866 936.232 0 0 1363.03 0 0 -271.844 0 0 0 
2042.22 0 0 0 0 1665.78 0 0 0 0 0 0 0 0 0 0 0 0 0 0 0 0 899.915 0 0 0 0 0 0 0 0 0 0 2458.49 0 1802.19 0 0 0 0.01 0 0 0 0 0 0 0 0 0 2424.62 0 273.522 0 0 0 0 0 924.482 
0 0 0 0 0 0 0 0 0 0 0 0 0 0 0 0 0 0 0 1696.75 0 0 0 0 0 0 0 -2247.92 0 0 473.418 -615.482 0 0 0 0 0 0 0 0 0.09 0 2480.93 0 0 0 0 0 -2115.47 0 0 620.212 0 0 0 0 0 0 
0 0 0 0 0 0 0 1738.41 0 0 0 395.138 0 0 1588.72 0 0 0 0 0 0 1632.66 0 0 0 0 0 0 1674.63 0 0 -402.005 0 0 0 1216.09 0 0 -1112.17 0 0 0.07 0 1844.77 0 2439.57 0 0 0 0 0 0 0 0 0 0 430.845 0 
0 0 0 0 2336.42 0 0 0 0 0 0 0 1650.52 0 0 0 0 0 0 -2489.62 0 0 0 0 0 0 0 0 0 0 0 513.398 0 0 0 0 1777.02 0 0 0 39.2926 0 0.07 0 0 0 0 -507.294 0 0 0 0 0 0 0 0 0 0 
0 0 0 0 0 0 0 0 1684.85 0 0 0 0 0 0 0 0 0 0 0 0 0 0 0 0 0 0 0 0 0 0 0 0 1606.11 0 0 308.313 0 0 0 0 853.221 0 0.02 0 0 0 0 0 -2031.85 0 0 0 -1343.65 0 0 0 0 
0 784.249 0 0 0 0 0 0 0 0 0 0 0 0 0 0 0 0 -1398.89 0 0 0 0 -1334.19 0 0 0 0 -551.546 0 0 -277.947 0 0 0 0 2049.55 2001.79 0 0 0 0 0 0 0.01 0 0 705.206 0 0 -374.996 0 0 0 0 0 0 0 
0 0 0 0 2004.84 0 0 0 0 0 0 0 0 0 0 0 0 0 0 0 0 0 0 0 0 -1768.78 0 0 0 0 0 2110.28 0 0 0 0 0 0 0 0 0 1529.97 0 0 0 0.03 0 0 0 0 0 0 1546.45 -748.238 0 0 0 0 
0 0 0 0 0 0 0 1118.58 0 0 0 0 0 0 0 0 0 0 0 0 0 0 0 0 0 0 0 0 0 0 0 0 0 0 382.931 0 0 0 0 0 0 0 0 0 0 0 0.07 0 0 0 0 0 0 0 0 0 0 0 
0 0 0 0 0 0 0 0 0 0 0 -784.249 0 0 0 0 -1920.3 0 0 0 0 0 0 0 0 0 1726.66 0 0 0 0 0 0 0 0 1717.2 0 0 2253.41 0 0 0 960.036 0 -1173.67 0 0 0.09 0 0 0 0 0 0 0 0 1420.26 0 
0 1495.48 0 -1297.42 0 0 0 1178.24 0 0 0 1530.27 0 0 -1330.07 0 0 0 0 0 0 0 0 0 0 0 0 0 0 0 0 0 0 0 0 0 0 0 -1695.38 0 1687.6 0 0 0 0 0 0 0 0.04 0 0 0 0 0 0 0 0 0 
0 0 0 0 0 0 0 0 1707.13 0 0 0 0 1023.51 0 0 0 0 0 0 0 0 0 0 1453.67 1135.36 0 0 0 0 0 0 0 0 0 0 0 0 0 2482.76 0 0 0 1475.34 0 0 0 0 0 0.03 0 0 0 0 0 0 0 0 
0 0 -2116.53 533.845 0 1432.46 0 0 0 0 1508.91 0 0 0 0 982.772 0 1861.25 0 1228.14 0 0 0 0 0 0 0 0 0 0 0 0 0 0 0 0 0 0 0 0 0 0 0 0 -91.7844 0 0 0 0 0 0.04 0 0 0 0 0 0 0 
0 -2327.11 0 0 0 0 0 0 0 0 2375.33 0 0 0 0 1583.83 2128.59 0 1247.52 0 0 0 0 0 1121.94 -1082.42 0 0 0 0 0 0 0 0 0 0 0 2091.97 -1176.72 2491.3 -1333.58 0 0 0 0 0 0 0 0 0 0 0.02 0 2269.59 0 0 1343.5 -1533.17 
0 0 0 0 0 0 0 0 -2083.57 0 0 0 0 0 0 0 0 0 0 0 0 1319.7 0 1340.45 0 0 0 0 0 0 0 0 0 580.844 0 0 0 0 0 0 0 0 0 0 0 1644.87 0 0 0 0 0 0 0.07 0 0 0 0 0 
1903.52 0 0 0 0 0 0 0 0 0 0 0 0 1519.75 0 2293.69 0 0 0 0 0 0 0 0 0 0 0 0 405.972 0 0 0 0 0 0 -404.752 1696.14 0 0 0 0 0 0 -404.752 0 1555.45 0 0 0 0 0 -2112.72 0 0.01 772.347 0 0 0 
1863.54 0 0 0 0 1694.62 0 0 0 0 0 1837.9 335.78 0 0 0 0 0 0 0 936.384 0 0 0 0 0 -1164.51 0 93.1578 0 0 0 0 0 0 0 0 1015.58 -2036.12 0 0 0 0 0 0 0 0 0 0 0 0 0 0 -2147.36 0.02 0 0 0 
0 0 0 0 0 0 0 0 0 0 2319.03 0 0 0 0 0 -1707.59 0 0 0 0 0 0 0 0 0 0 0 0 1393.4 0 0 0 0 -738.472 0 0 2428.13 0 0 0 0 0 0 0 0 0 0 0 0 0 0 0 0 0 0.06 0 0 
0 0 0 0 0 0 0 0 0 0 0 0 0 0 0 0 0 0 0 0 0 0 0 0 0 0 0 1112.02 0 0 0 0 0 0 0 0 0 -2094.87 0 0 0 2111.19 0 0 0 0 0 1654.79 0 0 0 2028.49 0 0 0 0 0.09 0 
0 0 0 0 1232.41 0 0 -1442.69 0 0 2080.68 0 0 -2454.83 0 0 0 0 0 0 0 0 0 0 0 0 271.538 0 0 0 2086.02 0 0 0 0 -170.217 0 0 0 1856.82 0 0 0 0 0 0 0 0 0 0 0 -548.341 0 0 0 0 0 0.04 
