*Vertices 64
*Matrix 
0 0 0 0 854.747 0 -935.926 0 -1862.47 0 0 0 0 0 0 -1587.65 0 0 0 0 0 0 0 0 0 0 0 0 592.441 2152.39 0 0 0 0 0 0 0 0 0 0 2083.27 0 0 0 0 0 0 0 0 0 0 1061.36 2212.36 0 0 0 0 0 0 0 -890.301 0 0 0 
0 0.04 1548.89 0 0 1230.74 2157.73 0 -267.876 0 0 0 0 0 0 -1253.01 0 0 0 0 0 0 0 0 0 0 0 0 0 0 0 0 -2010.18 0 0 0 0 0 0 0 638.218 0 0 0 1947.16 0 2340.69 0 0 0 0 0 0 0 0 0 0 499.969 0 0 0 -1271.02 0 0 
0 -1.75481 0.01 0 2304.83 0 0 0 -1995.07 0 -340.052 428.861 0 0 0 0 0 0 0 994.674 0 0 0 0 0 -606.326 0 0 0 0 0 0 0 0 2176.81 0 0 0 0 0 0 0 0 0 0 0 0 0 0 1281.09 0 0 0 -965.835 0 0 0 409.635 0 0 0 0 0 -270.775 
0 0 0 0.04 0 -1520.2 915.479 0 0 0 0 0 0 0 0 0 1583.83 0 0 1558.5 0 0 0 0 0 0 0 0 1278.04 -291.681 0 0 0 0 0 0 0 0 0 0 0 0 0 0 0 0 0 0 0 -1133.99 0 0 0 -1321.07 0 0 -448.546 0 0 0 0 0 0 0 
672.704 0 -2436.83 0 0.01 0 1121.94 0 2072.13 2157.73 0 0 0 -370.418 -603.275 0 0 0 0 0 0 0 0 0 0 0 0 0 0 0 1444.98 0 0 0 1641.36 0 0 584.048 0 0 0 0 0 0 0 0 0 0 0 0 0 0 0 0 0 0 -125.507 0 0 251.854 0 0 0 0 
0 1176.26 0 644.78 0 0.03 820.261 0 -1016.34 0 0 0 0 0 0 0 0 0 0 -586.642 0 0 0 0 -218.436 0 0 0 0 0 546.358 0 0 0 213.858 0 1133.08 0 0 2103.87 0 0 0 2435.3 0 0 0 0 2367.55 0 0 0 0 0 -1142.69 0 0 0 0 0 0 0 0 0 
-214.621 1945.48 0 60.5029 -337.458 2484.74 0.03 -252.77 0 0 0 0 0 0 0 0 0 0 0 0 0 0 0 0 0 0 0 0 0 454.344 0 0 0 0 0 0 0 0 0 0 0 0 0 0 0 0 0 0 0 -1795.18 0 1075.55 0 0 0 0 -1688.97 0 -49.8215 91.0215 0 2336.88 0 0 
0 0 0 0 0 0 615.94 0.03 0 151.296 0 0 0 0 -657.903 0 0 0 0 0 0 0 0 0 0 0 0 0 0 0 2285.76 2228.69 0 0 0 0 0 0 0 0 0 0 0 0 0 460.906 0 0 0 0 0 0 0 0 0 0 1686.53 0 0 -347.224 0 0 0 0 
2452.7 -1176.11 112.384 0 -1713.39 -701.697 0 0 0 0 0 0 1060.9 0 0 -192.953 0 0 0 0 0 0 0 0 0 0 0 2411.34 0 0 0 0 0 0 0 0 0 0 0 0 0 0 -96.2096 0 0 1129.41 0 0 0 0 0 0 0 0 0 0 0 0 0 0 0 0 0 0 
0 0 0 0 1415.68 0 0 -2285.61 0 0.03 0 0 0 -1559.42 0 0 0 0 0 -630.436 0 0 0 -17.1667 0 0 0 0 0 0 0 0 0 0 0 0 0 997.269 0 0 0 0 0 0 2454.22 0 0 0 51.3474 505.921 0 0 0 0 0 0 0 0 0 0 0 0 0 0 
0 0 -473.418 0 0 0 0 0 0 0 0.01 0 0 0 0 0 0 0 0 0 0 0 0 0 1951.89 0 1630.99 0 0 0 0 0 0 0 0 2203.67 0 0 -1346.86 0 54.0941 0 0 0 0 0 0 0 0 0 0 0 0 0 1850.57 0 0 0 0 0 0 -469.909 0 0 
0 0 1188.16 0 0 0 0 0 0 0 0 0.02 0 0 0 0 -1151.23 0 2487.64 0 0 0 393.765 0 -2067.86 0 0 0 0 0 -156.789 0 0 0 0 -1899.55 2436.37 0 -423.826 0 0 0 0 -103.687 0 0 0 0 0 0 0 0 0 0 0 0 1862.93 0 268.181 0 1607.49 0 0 0 
0 0 0 0 0 0 0 0 -1565.22 0 0 0 0.07 0 0 0 0 0 0 0 0 0 0 0 0 0 0 0 0 0 0 0 -1603.06 0 0 0 0 0 1011.46 0 0 0 0 0 1751.08 0 0 1199 0 0 0 -763.344 0 0 0 0 0 0 0 0 0 0 0 0 
0 0 0 0 -1576.51 0 0 0 0 1712.16 0 0 0 0.05 0 0 0 0 0 0 0 0 0 0 0 0 0 0 0 0 0 0 0 0 -166.86 0 0 0 0 0 1969.13 0 0 0 0 0 0 0 0 0 0 0 0 0 0 2273.71 0 0 0 0 0 0 0 0 
0 0 0 0 1294.21 0 0 1019.24 0 0 0 0 0 0 0.02 0 0 0 0 0 0 0 0 0 0 326.167 -97.8881 0 0 -1896.95 755.104 0 0 0 0 0 0 0 0 0 0 0 433.287 0 0 0 0 0 -324.488 0 0 0 0 2265.16 0 0 0 0 825.602 0 0 0 0 0 
1156.12 -893.201 0 0 0 0 0 0 1757.33 0 0 0 0 0 0 0.05 0 0 0 0 0 0 0 639.897 0 0 0 0 0 -218.589 0 0 0 0 0 0 465.178 2189.47 0 0 0 0 1300.62 -1865.21 0 0 1806.47 0 0 0 0 0 -734.046 -362.941 0 -1079.21 0 0 0 0 0 0 0 0 
0 0 0 1619.39 0 0 0 0 0 0 0 604.648 0 0 0 0 0.05 0 0 0 -1171.07 0 0 0 0 0 0 0 0 0 0 0 0 0 0 0 0 0 0 0 0 0 700.629 0 0 0 0 0 2083.73 1233.48 0 0 0 0 0 0 0 0 0 0 0 0 0 0 
0 0 0 0 0 0 0 0 0 0 0 0 0 0 0 0 0 0.03 0 69.0481 0 0 0 0 0 0 0 0 0 0 0 0 0 0 0 -18.2348 0 0 0 0 0 0 454.192 0 0 0 0 0 0 0 0 0 0 0 0 0 0 0 0 0 0 0 0 0 
0 0 0 0 0 0 0 0 0 0 0 2364.65 0 0 0 0 0 0 0.08 0 0 0 0 2218.47 -894.421 0 -2172.38 0 0 0 0 0 0 1552.86 -2162.77 0 0 0 1549.5 0 0 0 0 0 0 0 0 0 0 0 0 0 0 0 0 0 0 0 0 0 0 1298.64 0 0 
0 0 2134.39 -200.583 0 2238.46 0 0 0 1505.86 0 0 0 0 0 0 0 452.361 0 0.02 0 0 0 0 0 0 0 0 0 0 0 0 0 0 0 0 0 0 0 0 0 0 0 0 0 468.383 0 2231.44 0 0 0 0 0 0 1184.8 0 0 2335.66 0 -2228.08 0 0 0 0 
0 0 0 0 0 0 0 0 0 0 0 0 0 0 0 0 1394.62 0 0 0 0.09 0 308.161 0 0 0 0 0 0 0 152.974 2440.18 0 0 0 0 0 0 0 0 0 2046.49 0 0 0 0 0 0 0 0 0 0 0 0 0 1612.98 0 0 -385.067 40.0555 0 0 0 0 
0 0 0 0 0 0 0 0 0 0 0 0 0 0 0 0 0 0 0 0 0 0.01 0 0 0 186.087 0 0 0 0 -716.346 0 0 0 0 415.281 0 0 0 2009.87 0 0 0 0 0 0 -911.969 0 0 0 0 0 0 0 0 0 0 -536.897 0 2473.75 0 -1834.85 0 0 
0 0 0 0 0 0 0 0 0 0 0 1327.78 0 0 0 0 0 0 0 0 2313.07 0 0.02 -594.882 0 0 0 0 0 410.703 0 0 0 0 0 1110.19 0 0 0 0 0 0 -638.829 0 0 0 0 0 0 0 0 0 0 0 0 0 0 0 1885.81 0 0 2440.49 0 0 
0 0 0 0 0 0 0 0 0 -2294.31 0 0 0 0 0 663.396 0 0 -155.568 0 0 0 -459.38 0.02 0 0 0 0 0 0 0 0 0 1201.9 926.923 0 0 0 0 0 0 0 -780.587 1554.38 0 52.7207 0 0 0 0 0 0 0 0 0 0 2248.99 0 0 0 0 0 0 0 
0 0 0 0 0 1007.34 0 0 0 0 2460.78 -1302.91 0 0 0 0 0 0 1201.74 0 0 0 0 0 0.04 -2267.14 0 0 0 2030.02 0 0 0 0 0 0 1892.07 0 0 0 0 -1795.94 0 0 0 0 -824.076 34.257 -1127.28 -1627.02 0 983.23 0 0 0 1244.93 2299.95 0 0 0 2052.6 0 0 0 
0 0 1356.93 0 0 0 0 0 0 0 0 0 0 0 -2240.14 0 0 0 0 0 0 149.77 0 0 1724.68 0.08 1258.35 0 0 0 0 0 0 0 0 0 0 0 0 0 0 0 0 0 0 0 0 0 0 0 2243.95 0 0 0 0 0 0 0 118.793 0 0 0 0 0 
0 0 0 0 0 0 0 0 0 0 709.479 0 0 0 1195.03 0 0 0 1616.18 0 0 0 0 0 0 1325.95 0.09 0 0 0 0 0 0 728.095 0 1807.38 -478.759 0 0 0 0 0 0 0 0 0 0 0 0 -1992.63 0 0 0 0 0 0 0 0 0 0 0 0 0 0 
0 0 0 0 0 0 0 0 -978.195 0 0 0 0 0 0 0 0 0 0 0 0 0 0 0 0 0 0 0.07 0 0 0 0 -725.501 0 0 0 0 0 0 0 0 0 0 1124.07 0 0 0 0 0 0 1535.92 0 0 0 1455.81 0 0 0 0 0 95.7518 0 0 0 
-1265.68 0 0 1955.85 0 0 0 0 0 0 0 0 0 0 0 0 0 0 0 0 0 0 0 0 0 0 0 0 0.03 0 1495.18 0 0 0 0 0 0 0 0 0 1982.1 0 0 0 0 0 1125.9 943.098 0 0 0 0 0 0 1442.69 0 0 0 0 0 0 0 0 0 
1043.2 0 0 -387.204 0 0 1396.91 0 0 0 0 0 0 0 1635.26 907.239 0 0 0 0 0 0 -192.953 0 -996.353 0 0 0 0 0.02 0 0 0 1310.85 0 0 0 0 0 0 0 0 0 0 0 0 0 0 0 2330.62 0 0 0 -770.516 0 0 0 0 0 0 0 0 0 0 
0 0 0 0 -143.818 629.215 0 894.421 0 0 0 -78.5089 0 0 193.716 0 0 0 0 0 -1321.99 -177.236 0 0 0 0 0 0 2024.37 0 0.02 1688.82 0 0 0 0 0 0 0 0 -607.852 0 0 0 0 0 0 0 0 0 0 0 0 0 0 0 0 0 -1022.29 0 0 0 0 0 
0 0 0 0 0 0 0 1381.8 0 0 0 0 0 0 0 0 0 0 0 0 2409.51 0 0 0 0 0 0 0 0 0 -629.826 0.01 0 0 0 0 0 0 0 0 0 0 689.642 0 0 0 0 0 0 0 0 0 0 0 0 0 0 0 0 0 0 0 0 0 
0 -312.738 0 0 0 0 0 0 0 0 0 0 839.335 0 0 0 0 0 0 0 0 0 0 0 0 0 0 -1153.98 0 0 0 0 0.01 2157.28 0 0 0 0 0 -1108.05 0 0 0 0 0 0 0 0 0 0 0 0 0 0 0 0 0 0 -270.47 0 0 1831.49 0 0 
0 0 0 0 0 0 0 0 0 0 0 0 0 0 0 0 0 0 1176.56 0 0 0 0 2213.58 0 0 899.609 0 0 1591.01 0 0 2446.44 0.02 0 0 0 0 0 0 0 -2304.07 0 0 0 0 0 0 0 0 0 0 0 0 0 0 571.383 0 0 2077.78 0 0 0 0 
0 0 -409.024 0 1192.59 -1998.43 0 0 0 0 0 0 0 2070.76 0 0 0 0 1593.14 0 0 0 0 -2276.6 0 0 0 0 0 0 0 0 0 0 0.01 0 353.023 0 0 1647.77 -683.538 0 0 0 0 0 0 0 0 0 0 0 0 0 0 0 0 0 0 0 2217.7 -391.018 0 0 
0 0 0 0 0 0 0 0 0 0 1681.49 -1021.53 0 0 0 0 0 1885.36 0 0 0 -1035.42 743.66 0 0 0 245.445 0 0 0 0 0 0 0 0 0.05 0 0 0 0 0 2424.62 0 0 1794.26 0 0 0 0 1125.29 0 0 0 0 0 0 -594.577 0 0 0 0 0 0 0 
0 0 0 0 0 -284.814 0 0 0 0 0 -6.94296 0 0 0 2180.62 0 0 0 0 0 0 0 0 600.528 0 380.032 0 0 0 0 0 0 0 956.526 0 0.04 0 0 0 0 0 0 0 0 0 0 0 0 2149.19 0 0 2364.04 0 377.438 0 0 0 146.565 0 0 0 0 0 
0 0 0 0 2137.14 0 0 0 0 1416.59 0 0 0 0 0 -145.192 0 0 0 0 0 0 0 0 0 0 0 0 0 0 0 0 0 0 0 0 0 0 690.252 0 1504.18 0 0 0 0 0 0 0 0 0 1574.68 0 0 0 0 0 0 561.617 0 0 0 -2251.43 0 0 
0 0 0 0 0 0 0 0 0 0 894.574 2017.2 -380.337 0 0 0 0 0 -1179.01 0 0 0 0 0 0 0 0 0 0 0 0 0 0 0 0 0 0 339.595 0.08 0 0 0 0 0 0 0 0 0 0 0 0 0 0 0 0 0 0 0 0 0 149.77 -2481.38 0 0 
0 0 0 0 0 2373.04 0 0 0 0 0 0 0 0 0 0 0 0 0 0 0 371.639 0 0 0 0 0 0 0 0 0 0 -2441.4 0 1609.62 0 0 0 0 0.08 0 0 0 0 0 0 0 -67.3696 1699.5 -921.735 0 0 2103.11 0 0 0 0 0 0 0 0 0 0 0 
-1145.28 1024.74 0 0 0 0 0 0 0 0 1656.32 0 0 -645.39 0 0 0 0 0 0 0 0 0 0 0 0 0 0 -573.214 0 -1407.44 0 0 0 604.19 0 0 1793.04 0 0 0.07 0 0 0 0 0 484.252 0 0 0 0 -1409.88 0 0 0 1164.36 0 0 0 0 0 0 0 0 
0 0 0 0 0 0 0 0 0 0 0 0 0 0 0 0 0 0 0 0 2239.98 0 0 0 699.866 0 0 0 0 0 0 0 0 1057.39 0 -1288.11 0 0 0 0 0 0 0 0 0 0 0 1445.13 0 0 0 0 0 0 0 0 0 0 0 0 0 0 0 0 
0 0 0 0 0 0 0 0 1230.89 0 0 0 0 0 1021.53 1762.06 -682.928 -1264 0 0 0 0 974.38 -870.312 0 0 0 0 0 0 0 -1302.61 0 0 0 0 0 0 0 0 0 0 0.04 0 0 -300.836 0 0 0 -1534.39 1055.1 0 2149.34 0 1515.63 0 0 0 0 0 0 0 0 0 
0 0 0 0 0 1327.02 0 0 0 0 0 427.488 0 0 0 1930.22 0 0 0 0 0 0 0 824.534 0 0 0 -902.509 0 0 0 0 0 0 0 0 0 0 0 0 0 0 0 0.01 0 0 0 0 0 0 152.974 0 0 0 0 0 0 0 0 0 0 0 0 0 
0 122.15 0 0 0 0 0 0 0 1489.23 0 0 -528.504 0 0 0 0 0 0 0 0 0 0 0 0 0 0 0 0 0 0 0 0 0 0 2291.56 0 0 0 0 0 0 0 0 0 0 0 0 0 0 0 0 0 0 0 0 -2352.6 0 0 2497.86 0 0 0 0 
0 0 0 0 0 0 0 -545.137 1004.44 0 0 0 0 0 0 0 0 0 0 1321.38 0 0 0 663.396 0 0 0 0 0 0 0 0 0 0 0 0 0 0 0 0 0 0 -1538.36 0 0 0.03 0 0 0 0 0 1143.6 0 0 0 0 0 0 0 0 0 0 0 0 
0 -975.753 0 0 0 0 0 0 0 0 0 0 0 0 0 2291.71 0 0 0 0 0 -246.971 0 0 -762.276 0 0 0 2175.28 0 0 0 0 0 0 0 0 0 0 0 1731.85 0 0 0 0 0 0.03 0 0 -777.841 -1300.93 0 0 0 0 0 0 2331.54 0 0 0 0 -1992.02 0 
0 0 0 0 0 0 0 0 0 0 0 0 -165.181 0 0 0 0 0 0 -255.516 0 0 0 0 -767.617 0 0 0 1319.85 0 0 0 0 0 0 0 0 0 0 -122.303 0 -358.669 0 0 0 0 0 0.03 0 0 0 -219.352 0 -297.021 0 2024.22 0 0 0 0 0 1126.67 0 0 
0 0 0 0 0 1034.96 0 0 0 173.727 0 0 0 0 2439.57 0 28.4585 0 0 0 0 0 0 0 -793.863 0 0 0 0 0 0 0 0 0 0 0 0 0 0 661.565 0 0 0 0 0 0 0 0 0.06 0 0 0 0 0 0 -466.552 0 0 0 0 0 0 0 0 
0 0 1285.82 -768.685 0 0 439.848 0 0 -171.59 0 0 0 0 0 0 -446.257 0 0 0 0 0 0 0 -2040.24 0 1903.67 0 0 685.827 0 0 0 0 0 286.798 898.541 0 0 2491 0 0 -925.398 0 0 0 1067.46 0 0 0.03 1806.47 -304.346 0 0 0 0 0 0 0 0 0 0 0 0 
0 0 0 0 0 0 0 0 0 0 0 0 0 0 0 0 0 0 0 0 0 0 0 0 0 782.723 0 1672.8 0 0 0 0 0 0 0 0 0 1737.95 0 0 0 0 -2038.87 -823.466 0 0 500.885 0 0 -331.355 0.01 0 0 1553.32 0 0 0 0 0 0 0 0 0 0 
1960.89 0 0 0 0 0 1742.23 0 0 0 0 0 320.673 0 0 0 0 0 0 0 0 0 0 0 -794.015 0 0 0 0 0 0 0 0 0 0 0 0 0 0 0 405.21 0 0 0 0 304.041 0 -1464.51 0 -848.643 0 0.04 0 1704.08 0 0 0 0 2243.49 0 0 0 0 0 
-1883.53 0 0 0 0 0 0 0 0 0 0 0 0 0 0 1482.97 0 0 0 0 0 0 0 0 0 0 0 0 0 0 0 0 0 0 0 0 1137.2 0 0 8.46889 0 0 307.703 0 0 0 0 0 0 0 0 0 0.04 0 0 1020.62 0 0 0 0 0 0 0 0 
0 0 1608.86 -1096.15 0 0 0 0 0 0 0 0 0 0 579.012 -798.135 0 0 0 0 0 0 0 0 0 0 0 0 0 -647.374 0 0 0 0 0 0 0 0 0 0 0 0 0 0 0 0 0 2032.46 0 0 -620.212 1841.56 0 0.07 0 0 814.31 0 0 0 0 -2324.52 0 0 
0 0 0 0 0 1748.79 0 0 0 0 513.855 0 0 0 0 0 0 0 0 627.689 0 0 0 0 0 0 0 1717.66 -1966.99 0 0 0 0 0 0 0 344.935 0 0 0 0 0 1926.4 0 0 0 0 0 0 0 0 0 0 0 0.07 0 0 0 0 0 0 1058.92 0 0 
0 0 0 0 0 0 0 0 0 0 0 0 0 324.183 0 1408.2 0 0 0 0 -1407.13 0 0 0 1372.95 0 0 0 0 0 0 0 0 0 0 0 0 0 0 0 694.678 0 0 0 0 0 0 1551.33 2199.24 0 0 0 1505.25 0 0 0.02 409.787 0 0 0 0 0 0 0 
0 0 0 598.392 1701.18 0 1303.22 -215.232 0 0 0 -2061.14 0 0 0 0 0 0 0 0 0 0 0 969.955 1907.33 0 0 0 0 0 0 0 0 205.771 0 1462.83 0 0 0 0 0 0 0 0 -511.567 0 0 0 0 0 0 0 0 845.134 0 1021.38 0.05 0 0 0 0 1740.09 0 0 
0 -1180.53 -233.39 0 0 0 0 0 0 0 0 0 0 0 0 0 0 0 0 2214.5 0 2196.8 0 0 0 0 0 0 0 0 0 0 0 0 0 0 0 765.481 0 0 0 0 0 0 0 0 1276.21 0 0 0 0 0 0 0 0 0 0 0.07 0 0 0 0 0 0 
0 0 0 0 0 0 564.821 0 0 0 0 2289.88 0 0 1922.74 0 0 0 0 0 559.328 0 -1639.68 0 0 1007.95 0 0 0 0 -1168.32 0 -540.101 0 0 0 1500.37 0 0 0 0 0 0 0 0 0 0 0 0 0 0 -781.198 0 0 0 0 0 0 0.06 0 0 1242.94 0 0 
0 0 0 0 1580.17 0 -928.144 -2437.59 0 0 0 0 0 0 0 0 0 0 0 1888.26 1693.09 -204.703 0 0 0 0 0 0 0 0 0 0 0 1139.94 0 0 0 0 0 0 0 0 0 0 200.735 0 0 0 0 0 0 0 0 0 0 0 0 0 0 0.07 0 0 0 0 
-746.254 0 0 0 0 0 0 0 0 0 0 -1711.1 0 0 0 0 0 0 0 0 0 0 0 0 1975.54 0 0 -914.716 0 0 0 0 0 0 251.701 0 0 0 318.537 0 0 0 0 0 0 0 0 0 0 0 0 0 0 0 0 0 0 0 0 0 0.01 2138.81 0 0 
0 -756.478 0 0 0 0 989.792 0 0 0 1910.38 0 0 0 0 0 0 0 2216.33 0 0 -962.783 -446.715 0 0 0 0 0 0 0 0 0 -176.626 0 -236.9 0 0 1597.72 -1978.74 0 0 0 0 0 0 0 0 264.519 0 0 0 0 0 -873.974 753.426 0 322.657 0 481.811 0 2272.18 0.09 0 0 
0 0 0 0 0 0 0 0 0 0 0 0 0 0 0 0 0 0 0 0 0 0 0 0 0 0 0 0 0 0 0 0 0 0 0 0 0 0 0 0 0 0 0 0 0 0 351.955 0 0 0 0 0 0 0 0 0 0 0 0 0 0 0 0.07 0 
0 0 2162.01 0 0 0 0 0 0 0 0 0 0 0 0 0 0 0 0 0 0 0 0 0 0 0 0 0 0 0 0 0 0 0 0 0 0 0 0 0 0 0 0 0 0 0 0 0 0 0 0 0 0 0 0 0 0 0 0 0 0 0 0 0.08 
