*Vertices 63
*Matrix 
0 0 828.654 0 0 -2480.47 0 0 758.003 0 0 0 0 0 0 1258.35 0 0 0 0 0 0 0 0 0 0 0 0 0 0 0 0 0 0 0 0 0 0 0 0 0 0 0 0 0 0 0 0 0 0 1827.22 0 0 0 0 0 0 0 0 0 0 0 0 
0 0.04 0 97.8881 0 0 0 0 0 2013.08 0 0 -1961.04 0 0 0 0 355.159 0 399.258 -54.5518 434.66 0 0 0 224.387 0 0 0 0 0 0 2098.53 0 0 497.681 0 0 0 0 0 0 0 0 0 0 0 0 1542.02 0 0 0 0 0 0 0 0 0 0 0 0 0 0 
-1126.51 0 0.01 2238.76 1766.49 0 0 0 0 0 0 2259.36 965.682 0 0 0 1690.04 0 0 0 -1178.7 0 0 0 0 0 0 0 0 0 0 0 1554.69 -436.644 0 0 0 0 0 0 0 0 -1139.64 0 -1424.53 0 0 0 626.469 0 0 0 1169.55 0 0 0 0 0 -1916.33 0 0 0 0 
0 -2017.96 -872.295 0.03 2059.92 0 0 0 0 0 0 1942.58 0 1125.6 0 0 0 0 0 0 0 0 0 0 0 0 -2389.68 0 0 -120.93 0 -766.701 0 0 0 0 0 1513.03 0 0 2105.24 0 0 0 0 0 0 0 -1373.56 2398.07 0 2085.1 0 0 0 0 0 0 0 0 0 0 0 
0 0 1573.76 -2286.68 0.05 0 0 0 0 0 0 0 0 2171.01 0 0 0 0 0 0 0 0 0 0 -1729.26 0 0 0 0 0 0 0 1766.34 0 0 0 0 0 0 0 0 0 0 0 0 0 0 0 0 0 0 0 0 0 0 0 0 0 1586.73 0 0 0 0 
386.441 0 0 0 0 0.04 0 0 0 0 0 0 0 0 0 0 0 0 0 0 0 1884.14 0 0 1741.46 0 1752.75 0 0 0 -150.227 0 0 0 0 0 0 0 0 0 0 0 0 0 0 0 0 0 0 0 0 2043.44 0 0 0 0 0 0 0 0 0 0 0 
0 0 0 0 0 0 0.06 0 0 0 0 0 0 0 1607.64 0 0 0 0 -1200.52 0 0 0 0 0 0 0 0 0 0 1957.53 0 0 469.909 0 1133.84 0 -1707.74 -1638.77 0 0 0 0 2160.02 0 0 0 0 0 158.162 0 0 0 0 0 0 0 2399.75 0 0 0 0 0 
0 0 0 0 0 0 0 0 0 0 0 0 -2262.11 0 2075.79 -447.325 0 0 0 0 0 0 0 914.258 2288.2 0 0 0 668.279 0 0 0 1195.94 -1315.88 0 0 387.967 2443.08 0 0 0 0 0 0 0 0 0 0 0 0 0 0 2076.25 0 0 0 0 0 -549.867 0 0 0 0 
1768.93 0 0 0 0 0 0 0 0.08 0 2035.81 -476.318 0 0 0 0 0 0 0 0 0 0 0 0 0 0 0 0 0 0 0 0 0 0 0 0 0 0 0 0 0 0 0 0 0 0 802.408 0 0 0 0 0 0 0 -2345.42 0 -982.162 0 0 0 0 0 0 
0 1538.82 0 0 0 0 0 0 0 0.04 0 0 0 0 0 0 0 -2402.04 0 0 0 0 0 0 0 -2376.86 0 0 0 0 0 0 0 0 0 0 0 0 0 0 0 0 0 1516.24 0 0 0 1246.15 0 -15.9459 0 0 0 0 2165.97 0 0 0 0 0 0 0 0 
0 0 0 0 0 0 0 0 598.849 0 0.06 0 0 0 0 199.21 0 0 0 0 0 0 0 0 0 0 0 14.7252 0 0 0 0 0 1347.01 1954.02 -771.432 0 0 0 -1605.2 0 0 570.009 76.6778 0 0 1729.1 -147.023 0 623.722 0 0 0 0 0 0 0 2092.43 0 0 0 0 0 
0 0 -1857.89 1683.63 0 0 0 0 -1293.76 0 0 0.06 0 0 0 0 1535.62 -311.518 0 0 0 0 0 0 0 0 0 0 -2487.33 0 0 1200.67 -1267.2 0 0 0 0 0 0 0 0 0 1554.99 2261.96 0 0 0 472.655 0 2361.6 0 0 0 0 0 0 0 0 0 0 0 0 0 
0 989.029 405.667 0 0 0 0 -239.036 0 0 0 0 0.06 0 0 0 0 0 1508.76 0 0 0 0 0 0 0 0 0 0 0 597.324 477.844 0 823.313 0 0 0 0 150.38 0 0 0 0 0 0 0 2499.08 1006.73 0 0 0 0 0 0 0 301.141 0 0 0 0 0 0 0 
0 0 0 -1991.87 732.215 0 0 0 0 0 0 0 0 0.08 0 0 0 0 1617.86 0 0 0 0 0 0 0 0 0 2489.78 0 0 0 0 0 0 0 0 0 -1574.68 0 0 0 0 0 0 112.537 0 0 1145.89 0 0 0 0 0 0 0 0 0 0 0 0 0 0 
0 0 0 0 0 0 -1191.21 -38.9874 0 0 0 0 0 0 0 0 0 0 0 0 0 2062.52 0 0 0 0 0 0 0 0 0 0 0 0 0 0 0 0 0 0 0 0 0 0 0 0 0 0 0 191.427 0 0 0 0 0 0 0 0 0 0 0 0 0 
1271.02 0 0 0 0 0 0 559.481 0 0 2468.26 0 0 0 0 0.05 0 0 0 0 0 0 0 0 0 0 0 0 0 0 0 1342.28 0 1424.22 0 0 0 0 0 1616.03 0 0 0 0 -571.688 0 0 0 2094.71 0 0 0 0 0 0 0 584.048 0 1418.42 0 0 0 0 
0 0 877.331 0 0 0 0 0 0 0 0 1847.51 0 0 0 0 0.06 0 0 0 0 0 -1716.59 1210.14 0 0 0 0 0 0 0 584.201 1109.12 0 0 0 0 0 0 0 0 0 0 0 0 0 0 0 0 0 0 0 0 0 -496.46 462.889 0 0 0 0 0 0 0 
0 871.38 0 0 0 0 0 0 0 1179.46 0 858.562 0 0 0 0 0 0.03 0 0 -1148.95 0 0 0 0 0 0 0 752.358 863.75 -2418.06 907.544 0 0 0 0 0 687.201 0 0 0 0 0 0 0 0 0 0 0 0 144.276 0 0 0 0 478.301 0 0 0 0 0 0 0 
0 0 0 0 0 0 0 0 0 0 0 0 320.368 -186.697 0 0 0 0 0.09 0 0 0 2136.98 2022.69 0 0 0 0 0 -780.587 0 0 0 0 0 0 -155.416 0 -1327.78 0 0 1544.92 0 0 0 0 0 0 0 0 0 -272.454 0 0 0 0 -2093.19 0 0 0 0 0 0 
0 1681.65 0 0 0 0 24.3385 0 0 0 0 0 0 0 0 0 0 0 0 0.01 0 0 0 0 0 0 0 0 640.66 129.017 0 2152.7 0 0 0 0 0 0 0 0 0 0 0 0 0 0 0 0 0 1706.67 0 0 0 1388.21 -2222.43 0 0 0 0 0 0 0 0 
0 -803.018 1251.18 0 0 0 0 0 0 0 0 0 0 0 0 0 0 -2088 0 0 0.01 0 2407.68 0 0 0 0 1976.76 0 -2010.79 0 -73.7785 0 0 0 0 0 0 0 0 0 540.254 0 0 0 0 0 0 0 0 0 0 0 0 0 1850.57 0 0 0 0 0 0 0 
0 697.272 0 0 0 -1613.13 0 0 0 0 0 0 0 0 2446.9 0 0 0 0 0 0 0.07 0 0 0 0 1535.62 -86.9015 0 1071.28 -2313.68 0 159.23 0 0 0 0 0 0 0 0 0 0 1463.13 0 0 0 0 0 0 2441.25 0 0 0 -866.955 0 0 0 -357.906 0 0 0 0 
0 0 0 0 0 0 0 0 0 0 0 0 0 0 0 0 493.866 0 1836.83 0 -687.048 0 0 0 0 0 0 0 0 0 0 0 0 2146.6 0 -1179.16 0 -48.6007 0 0 -323.573 0 1773.96 0 0 0 0 0 0 0 0 0 0 0 0 0 1633.73 207.144 0 0 0 0 0 
0 0 0 0 0 0 0 2206.72 0 0 0 0 0 0 0 0 1483.89 0 -368.13 0 0 0 0 0.01 0 0 0 0 -248.802 0 0 1580.32 0 -1643.65 0 0 0 0 0 0 0 1242.64 0 0 0 1203.73 0 0 0 1535.31 0 0 0 0 0 0 0 0 0 0 0 0 0 
0 0 0 0 -1357.08 -686.743 0 1130.02 0 0 0 0 0 0 0 0 0 0 0 0 0 0 0 0 0.01 0 0 0 0 0 0 0 0 486.236 0 0 0 0 0 0 0 635.929 0 0 0 0 0 0 0 0 0 0 0 0 461.364 -2019.79 1379.82 0 0 0 0 0 0 
0 2048.78 0 0 0 0 0 0 0 2320.4 0 0 0 0 0 0 0 0 0 0 0 0 0 0 0 0.02 0 0 0 -248.192 0 0 0 0 0 0 0 0 0 0 0 0 -542.695 0 1472.75 -1598.03 0 0 0 0 0 0 0 0 0 2307.12 0 0 -1236.84 0 0 0 0 
0 0 0 1518.52 0 1079.52 0 0 0 0 0 0 0 0 0 0 0 0 0 0 0 -1038.01 0 0 0 0 0.07 521.18 0 0 2162.62 0 0 0 0 0 0 0 0 0 0 0 0 0 0 -1104.85 0 0 0 0 0 0 0 0 0 0 0 0 0 0 0 0 0 
0 0 0 0 0 0 0 0 0 0 739.54 0 0 0 0 0 0 0 0 0 1616.18 1204.03 0 0 0 0 314.264 0.08 0 0 0 0 0 0 1354.03 0 0 0 0 0 0 0 1148.64 0 0 0 0 0 0 2473.3 -848.186 0 0 0 0 0 0 0 0 0 0 0 0 
0 0 0 0 0 0 0 -55.9252 0 0 0 -1434.14 0 -1197.47 0 0 0 1466.03 0 374.996 0 0 0 400.479 0 0 0 0 0.02 0 0 0 0 0 0 0 -1065.48 0 0 0 0 0 0 0 0 0 0 2470.09 -1341.36 1039.38 0 0 0 0 169.454 0 0 0 0 0 0 0 0 
0 0 0 1188.77 0 0 0 0 0 0 0 0 0 0 0 0 0 -1003.22 -919.599 1584.9 399.258 -695.898 0 0 0 121.082 0 0 0 0.04 0 0 0 0 0 44.7859 763.497 0 0 0 0 0 0 2233.88 0 0 0 0 0 0 0 0 0 0 550.172 0 0 0 0 0 0 0 0 
0 0 0 0 0 1030.84 -560.701 0 0 0 0 0 1651.59 0 0 0 0 -1568.73 0 0 0 -236.9 0 0 0 0 -712.073 0 0 0 0 0 0 0 0 0 1783.73 0 0 582.217 0 0 0 0 0 0 0 0 0 0 0 0 0 2053.06 0 0 0 0 0 0 0 0 0 
0 0 0 2462 0 0 0 0 0 0 0 1468.93 1477.63 0 0 1148.03 -1749.4 -121.693 0 -2363.43 -103.992 0 0 -125.355 0 0 0 0 0 0 0 0.06 0 0 0 0 0 0 0 0 0 0 0 0 0 0 0 0 0 -532.472 859.63 0 0 0 0 0 0 0 0 0 0 0 0 
0 1537.6 -491.424 0 2453 0 0 185.324 0 0 0 1670.2 0 0 0 0 387.051 0 0 0 0 -1171.83 0 0 0 0 0 0 0 0 0 0 0.04 0 0 0 0 0 0 0 0 0 0 0 0 0 -24.1859 0 -1900.16 -1193.5 0 0 0 0 0 2002.4 0 0 0 0 0 0 0 
0 0 1358.3 0 0 0 -2484.44 1833.02 0 0 1726.51 0 1077.68 0 0 -2197.56 0 0 0 0 0 0 -1067.46 -2.21259 1697.52 0 0 0 0 0 0 0 0 0.04 0 0 0 0 0 0 0 0 0 0 0 0 0 0 0 0 0 0 0 0 0 0 0 0 0 0 0 0 0 
0 0 0 0 0 0 0 0 0 0 -548.646 0 0 0 0 0 0 0 0 0 0 0 0 0 0 0 0 -25.1015 0 0 0 0 0 0 0 2038.41 0 0 0 0 275.964 0 0 0 0 2223.5 0 0 535.066 1900.46 0 0 0 0 0 -1633.88 0 0 0 0 0 0 0 
0 674.841 0 0 0 0 427.641 0 0 0 -11.6733 0 0 0 0 0 0 0 0 0 0 0 2420.19 0 0 0 0 0 0 66.9118 0 0 0 0 1281.4 0 0 0 0 0 0 -454.344 0 0 0 0 0 0 0 0 0 0 0 0 0 0 0 0 1641.51 0 0 0 0 
0 0 0 0 0 0 0 2129.2 0 0 0 0 0 0 0 0 0 0 2440.95 0 0 0 0 0 0 0 0 0 1213.03 -1412.78 -1676.61 0 0 0 0 0 0.01 0 0 0 0 0 0 1182.36 0 2193.75 0 0 -526.521 0 0 0 0 0 563.295 0 0 0 0 0 0 0 0 
0 0 0 2309.87 0 0 2238.3 -1615.42 0 0 0 0 0 0 0 0 0 -1113.54 0 0 0 0 -1958.14 0 0 0 0 0 0 0 0 0 0 0 0 0 0 0.02 257.805 0 0 0 0 0 0 0 0 0 0 0 0 0 0 2263.79 0 0 0 0 0 0 0 0 0 
0 0 0 0 0 0 82.0185 0 0 0 0 0 -860.088 1856.21 0 0 0 0 -412.839 0 0 0 0 0 0 0 0 0 0 0 0 0 0 0 0 0 0 1896.8 0.06 123.524 0 0 1880.32 0 0 0 0 0 0 0 0 -481.811 0 0 1825.69 471.74 0 0 604.801 0 0 0 0 
0 0 0 0 0 0 0 0 0 0 661.412 0 0 0 0 627.232 0 0 0 0 0 0 0 0 0 0 0 0 0 0 1883.22 0 0 0 0 0 0 0 1662.72 0.07 0 0 0 0 0 0 0 488.525 0 0 -933.18 0 130.848 0 0 0 0 1053.58 0 0 0 0 0 
0 0 0 1718.73 0 0 0 0 0 0 0 0 0 0 0 0 0 0 0 0 0 0 -124.592 0 0 0 0 0 0 0 0 0 0 0 -1753.82 0 0 0 0 0 0 0 605.869 0 0 0 0 2492.68 0 0 0 0 0 0 0 -286.187 0 0 -442.9 0 0 0 0 
0 0 0 0 0 0 0 0 0 0 0 0 0 0 0 0 0 0 1083.33 0 866.344 0 0 2030.02 -1116.29 0 0 0 0 0 0 0 0 0 0 2426.6 0 0 0 0 0 0.06 850.78 0 0 0 -2212.06 0 0 0 0 0 0 0 0 0 0 1186.79 0 0 0 0 0 
0 0 13.9622 0 0 0 0 0 0 0 -1890.39 1679.2 0 0 0 0 0 0 0 0 0 0 56.6881 0 0 -1217.31 0 1592.53 0 0 0 0 0 0 0 0 0 0 2039.93 0 1775.49 565.432 0.03 0 0 0 0 0 0 0 0 0 0 0 0 0 0 0 0 0 0 2366.02 0 
0 0 0 0 0 0 -2161.7 0 0 1639.68 1890.39 2019.49 0 0 0 0 0 0 0 0 0 1243.1 0 0 0 0 0 0 0 -2035.51 0 0 0 0 0 0 1612.06 0 0 0 0 0 0 0.05 0 0 0 0 0 0 0 0 -528.657 0 0 0 0 0 0 0 0 0 0 
0 0 456.481 0 0 0 0 0 0 0 0 0 0 0 0 -1968.52 0 0 0 0 0 0 0 0 0 1470.15 0 0 0 0 0 0 0 0 0 0 0 0 0 0 0 0 0 0 0.02 0 0 0 0 0 0 -1408.2 1887.95 0 176.778 0 1136.89 0 0 0 0 0 0 
0 0 0 0 0 0 0 0 0 0 0 0 0 258.721 0 0 0 0 0 0 0 0 0 -533.387 0 -1791.82 1409.88 0 0 0 0 0 0 0 -1816.08 0 1989.12 0 0 0 0 0 0 0 0 0.07 0 0 0 0 0 0 0 0 2380.06 0 1959.97 2079.91 0 0 0 0 0 
0 0 0 0 0 0 0 0 1938.31 0 -2448.27 0 -48.9059 0 0 0 0 0 0 0 0 0 0 0 0 0 0 0 0 0 0 0 -1360.13 0 0 0 0 0 0 0 0 1909.31 0 0 0 0 0.03 1990.49 0 0 0 0 0 1563.23 0 0 0 0 -2059.77 0 0 0 0 
0 0 0 0 0 0 0 0 0 -793.252 1083.48 1683.17 -155.11 0 0 0 0 0 0 0 0 0 0 0 0 0 0 0 -2437.59 0 0 0 0 0 0 0 0 0 0 2439.88 145.955 0 0 0 0 0 1589.33 0.09 0 0 0 0 0 0 0 0 0 0 0 0 0 0 0 
0 972.854 -1278.5 1354.18 0 0 0 0 0 0 0 0 0 233.085 0 -2461.24 0 0 0 0 0 0 0 0 0 0 0 0 0.228889 0 0 0 2147.36 0 864.055 0 -549.104 0 0 0 0 0 0 0 0 0 0 0 0.07 0 0 0 0 0 0 0 0 0 0 0 0 0 0 
0 0 0 -754.646 0 0 -1891.31 0 0 2129.66 -447.935 924.94 0 0 1100.88 0 0 0 0 2246.09 0 0 0 2349.85 0 0 0 871.685 -1543.24 0 0 -1900.92 -1012.22 0 1989.27 0 0 0 0 0 0 0 0 0 0 0 0 0 0 0.07 0 0 -781.198 0 0 0 0 0 0 0 0 0 809.885 
1876.81 0 0 0 0 0 0 0 0 0 0 0 0 0 0 0 0 2328.03 0 0 0 -745.338 0 0 0 0 0 915.937 0 0 0 578.86 0 0 0 0 0 0 0 1947.92 0 0 0 0 0 0 0 0 0 0 0.03 0 0 0 0 0 614.566 1855.3 0 -21.4393 0 0 0 
0 0 0 -40.8185 0 1447.11 0 0 0 0 0 0 0 0 0 0 0 0 335.78 0 0 0 0 0 0 0 0 0 0 0 0 0 0 0 0 0 0 0 2299.49 0 0 0 0 0 1995.68 0 0 0 0 0 0 0.05 0 0 0 0 0 0 0 0 0 0 0 
0 0 1064.41 0 0 0 0 86.9015 0 0 0 0 0 0 0 0 0 0 0 0 0 0 0 0 0 0 0 0 0 0 0 0 0 0 0 0 0 0 0 1041.83 0 0 0 1227.99 886.792 0 0 0 0 -1589.02 0 0 0.02 0 0 1783.88 0 0 0 0 0 0 0 
0 0 0 0 0 0 0 0 0 0 0 0 0 0 0 0 0 0 0 372.555 0 0 0 0 0 0 0 0 0 0 214.927 0 0 0 0 0 0 1097.83 0 0 0 0 0 0 0 0 24.9489 0 0 0 0 0 0 0.09 0 -1154.59 0 0 0 0 -354.091 0 0 
0 0 0 0 0 0 0 0 -1771.68 1844.46 0 0 0 0 0 0 2083.42 0 0 -1779.46 0 2185.05 0 0 775.399 0 0 0 -1549.65 1973.25 0 0 0 0 0 0 -784.86 0 809.427 0 0 0 0 0 -1685.77 2297.97 0 0 0 0 0 0 0 0 0.04 0 0 0 0 0 0 0 0 
0 0 0 0 0 0 0 0 0 0 0 0 -128.864 0 0 0 2460.02 676.824 0 0 -2014.91 0 0 0 -1218.07 -374.386 0 0 0 0 0 0 307.245 0 2142.17 0 0 0 -492.798 0 -2381.74 0 0 0 0 0 0 0 0 0 0 0 568.484 421.384 0 0.03 1948.68 2368.01 0 0 0 0 0 
0 0 0 0 0 0 0 0 -138.63 0 0 0 0 0 0 1666.54 0 0 2404.02 0 0 0 2194.97 0 -1215.17 0 0 0 0 0 0 0 0 0 0 0 0 0 0 0 0 0 0 0 2479.71 -2009.57 0 0 0 0 606.174 0 0 0 0 1917.55 0.01 0 0 0 0 0 0 
0 0 0 0 0 0 1197.78 0 0 0 1842.48 0 0 0 0 0 0 0 0 0 0 0 -1518.37 0 0 0 0 0 0 0 0 0 0 0 0 0 0 0 0 2473.6 0 -2247 0 0 0 844.218 0 0 0 0 -138.936 0 0 0 0 -771.432 0 0.05 0 0 0 0 0 
0 0 -2023.45 0 -10.1474 0 0 1365.17 0 0 0 0 0 0 0 2048.63 0 0 0 0 0 1266.59 0 0 0 720.618 0 0 0 0 0 0 0 0 0 -1923.81 0 0 796.609 0 -1717.2 0 0 0 0 0 2158.96 0 0 0 0 0 0 0 0 0 0 0 0.05 0 0 0 0 
0 0 0 0 0 0 0 0 0 0 0 0 0 0 0 0 0 0 0 0 0 0 0 0 0 0 0 0 0 0 0 0 0 0 0 0 0 0 0 0 0 0 0 0 0 0 0 0 0 0 317.621 0 0 0 0 0 0 0 0 0.06 0 0 0 
0 0 0 0 0 0 0 0 0 0 0 0 0 0 0 0 0 0 0 0 0 0 0 0 0 0 0 0 0 0 0 0 0 0 0 0 0 0 0 0 0 0 0 0 0 0 0 0 0 0 0 0 0 2119.28 0 0 0 0 0 0 0.08 0 0 
0 0 0 0 0 0 0 0 0 0 0 0 0 0 0 0 0 0 0 0 0 0 0 0 0 0 0 0 0 0 0 0 0 0 0 0 0 0 0 0 0 0 684.454 0 0 0 0 0 0 0 0 0 0 0 0 0 0 0 0 0 0 0.07 0 
0 0 0 0 0 0 0 0 0 0 0 0 0 0 0 0 0 0 0 0 0 0 0 0 0 0 0 0 0 0 0 0 0 0 0 0 0 0 0 0 0 0 0 0 0 0 0 0 0 1989.27 0 0 0 0 0 0 0 0 0 0 0 0 0.04 
