*Vertices 32
*Matrix 
0.04 0 0 0 0 2460.63 1170.61 0 0 0 0 754.494 0 2199.55 1177.02 0 0 0 1702.7 361.415 0 2327.72 -958.052 0 0 0 0 0 -1636.94 0 0 0 
0 0.05 0 0 0 -483.795 1186.79 0 0 0 2162.47 0 1882.15 0 0 0 0 -774.941 0 0 0 2359 0 0 0 0 0 2456.05 0 0 0 0 
0 0 0.02 0 -1990.95 0 0 935.011 0 -675.298 0 0 0 2007.74 0 0 0 0 -1444.98 537.202 0 0 0 -496.155 0 0 0 0 1865.98 0 0 0 
0 0 0 0.03 0 0 0 -371.639 0 0 2368.16 0 -667.669 0 0 687.506 2035.51 0 0 0 1699.35 0 0 0 0 0 0 0 0 0 0 -2011.4 
0 0 -1270.87 0 0.07 0 0 0 0 -776.62 0 0 0 0 -318.995 0 2459.41 0 0 0 0 0 0 1531.95 2371.67 1019.09 0 0 0 667.211 0 0 
956.526 2392.57 0 0 0 0.05 0 0 -2274.32 0 0 0 0 2059.77 0 0 0 0 0 0 0 1902.75 0 0 0 0 0 0 0 0 0 0 
-490.814 1696.6 0 0 0 0 0 0 0 0 0 2350 -646.306 0 0 0 0 1953.41 0 0 1991.56 2237.69 0 0 1255.91 0 0 0 0 0 0 0 
0 0 2349.09 1696.6 0 0 0 0.01 0 0 0 0 0 1774.58 0 -554.75 0 -1527.68 0 0 0 -1160.24 0 0 0 1521.12 0 0 0 907.239 0 0 
0 0 0 0 0 608.463 0 0 0.06 0 0 -1219.75 0 0 0 0 356.99 2393.03 0 0 0 1099.66 0 0 0 1864.6 0 -2018.27 -1247.22 -330.897 -30.4422 0 
0 0 -1306.73 0 -1763.74 0 0 0 0 0.01 0 0 0 -606.021 0 162.282 0 0 0 1787.85 0 0 0 0 0 0 0 0 0 0 0 2319.33 
0 1478.85 0 1113.39 0 0 0 0 0 0 0.06 0 0 -703.681 0 0 0 0 0 945.54 0 0 -596.866 0 0 0 0 0 0 0 1428.04 0 
2476.35 0 0 0 0 0 -373.165 0 1715.37 0 0 0.02 0 0 0 0 0 0 0 0 0 0 921.583 0 -134.51 288.018 705.664 0 0 0 0 0 
0 1705.3 0 1861.55 0 0 1504.03 0 0 0 0 0 0.05 621.281 0 0 0 0 0 0 -889.081 0 0 0 0 2124.77 0 0 -1126.21 0 0 0 
317.469 0 1660.59 0 0 209.891 0 166.097 0 1977.37 -1197.62 0 -69.9637 0 0 -1295.13 0 0 0 0 965.377 0 0 0 0 0 0 0 0 1619.24 0 0 
1592.99 0 0 0 2164.3 0 0 0 0 0 0 0 0 0 0.07 -1761.3 0 1998.89 1687.9 0 0 -1115.38 0 0 156.789 -2442.01 0 -259.026 0 -843.455 0 0 
0 0 0 1970.96 0 0 0 -671.484 0 666.906 0 0 0 1845.38 157.857 0 0 -72.1 0 0 0 -1683.48 0 0 -1775.95 0 0 0 1490.3 0 0 0 
0 0 0 -745.643 460.906 0 0 0 713.599 0 0 0 0 0 0 0 0.06 0 0 -1778.85 0 0 0 0 0 260.094 -2224.27 1567.51 1908.7 0 0 0 
0 1340.3 0 0 0 0 686.59 -154.805 1621.37 0 0 0 0 0 1317.41 1913.59 0 0.07 0 0 0 0 0 0 0 1186.33 0 0 -2049.85 0 0 0 
-2150.41 0 2208.85 0 0 0 0 0 0 0 0 0 0 0 1013.29 0 0 0 0.09 0 0 2113.79 0 991.928 0 1369.29 0 0 0 0 0 0 
1346.4 0 425.047 0 0 0 0 0 0 -1967.76 -2128.44 0 0 0 0 0 1390.04 0 0 0.09 0 296.564 0 2041.15 0 0 2053.36 -18.6926 0 0 0 0 
0 0 0 1121.94 0 0 -458.617 0 0 0 0 0 1701.94 -1449.86 0 0 0 0 0 0 0.07 0 0 0 753.578 1372.8 0 0 0 0 0 0 
436.491 -1381.95 0 0 0 2386.01 -432.676 -549.257 842.845 0 0 0 0 0 -1518.37 -815.531 0 0 1468.47 803.629 0 0.07 0 0 -636.387 -626.621 0 0 1087.3 0 0 2189.32 
1968.83 0 0 0 0 0 0 0 0 0 2093.34 430.387 0 0 0 0 0 0 0 0 0 0 0.07 0 0 -1199.91 -1693.24 0 365.383 1661.35 0 0 
0 0 -1056.63 0 -2362.82 0 0 0 0 0 0 0 0 0 0 0 0 0 1687.6 -1623.05 0 0 0 0.09 0 2146.29 1844.61 0 0 0 0 0 
0 0 0 0 -380.947 0 1410.34 0 0 0 0 879.772 0 0 -666.448 1186.79 0 0 0 0 1617.4 127.491 0 0 0.01 -2166.59 0 0 0 0 197.073 2330.16 
0 0 0 0 1701.33 0 0 -74.3889 700.476 0 0 2374.87 -1590.4 0 1806.77 0 539.491 1922.59 902.661 0 550.325 999.71 132.832 -1491.06 -770.669 0.09 -386.135 1627.93 0 467.467 0 0 
0 0 0 0 0 0 0 0 0 0 0 1192.43 0 0 0 0 -446.409 0 0 2408.29 0 0 -808.359 523.164 0 -1356.78 0 0 0 0 0 2324.21 
0 485.778 0 0 0 0 0 0 402.768 0 0 0 0 0 566.347 0 1950.21 0 0 193.564 0 0 0 0 0 2472.84 0 0 0 0 0 0 
1194.72 0 2400.2 0 0 0 0 0 -1175.04 0 0 0 713.752 0 0 854.595 116.962 1439.18 0 0 0 221.946 1924.88 0 0 0 0 0 0.02 0 0 0 
0 0 0 0 1762.37 0 0 -129.475 -1934.8 0 0 0 0 1364.71 -2373.35 0 0 0 0 0 0 0 2410.12 0 0 1000.47 0 0 0 0.04 1068.68 0 
0 0 0 0 0 0 0 0 1136.74 0 -17.3193 0 0 0 0 0 0 0 0 0 0 0 0 0 1894.21 0 0 0 0 302.057 0.02 0 
0 0 0 -1311.46 0 0 0 0 0 -1304.44 0 0 0 0 0 0 0 0 0 0 0 2094.87 0 0 1505.55 0 475.097 0 0 0 0 0.05 
