*Vertices 57
*Matrix 
0.06 0 0 0 879.315 1345.33 0 0 0 0 0 1259.42 0 0 0 0 0 -1601.54 0 0 0 -644.627 0 0 0 0 0 0 0 0 0 1905.35 1774.42 0 0 0 0 0 0 0 -1053.42 684.912 0 0 0 0 0 0 0 0 0 0 0 0 0 0 0 
0 0.04 0 0 0 0 607.395 0 0 0 0 0 0 0 0 0 -1764.66 0 0 0 0 1479.92 0 0 0 0 0 0 0 0 0 0 0 0 0 0 0 0 0 125.202 0 -195.09 0 2400.97 0 -396.207 0 0 0 0 2047.26 0 0 309.534 0 0 0 
0 0 0.09 0 727.027 0 0 0 0 0 0 0 0 0 -1851.94 0 -314.112 0 0 0 0 0 -635.624 0 1298.33 1096 0 0 0 515.381 0 0 0 0 0 0 0 0 0 0 0 0 0 0 0 0 0 0 0 0 0 -597.476 0 -114.978 0 1391.42 0 
0 0 0 0.07 0 0 0 0 0 0 0 0 0 -1989.27 -413.144 0 0 0 0 0 0 0 0 0 0 0 750.526 0 0 0 0 0 0 0 0 563.753 0 1475.19 0 0 0 0 0 0 0 0 0 0 0 0 2174.67 0 0 0 0 0 0 
627.384 0 806.68 0 0.06 0 0 0 0 0 0 0 0 0 0 0 0 0 -483.947 0 0 0 0 -569.552 0 0 0 0 854.289 0 0 0 0 0 0 0 0 0 0 0 0 0 2172.69 0 0 0 0 0 360.5 0 0 0 0 0 0 0 0 
1531.34 0 0 0 0 0.03 0 0 0 0 0 0 0 0 0 -1764.96 -1483.89 0 0 0 0 0 0 67.6748 0 1742.53 0 -1471.22 1706.52 -1472.44 0 0 0 2051.68 0 0 0 0 0 0 0 0 0 0 0 0 1859.72 0 0 1080.89 0 1974.01 0 0 0 0 0 
0 -1245.54 0 0 0 0 0.08 0 -800.272 0 0 2375.64 0 -1104.08 0 0 0 0 0 -1464.66 0 805.307 0 0 2393.34 0 0 0 0 0 0 0 0 0 0 0 0 0 0 0 0 0 928.297 0 0 0 0 0 -2108.29 2159.72 0 0 143.208 0 0 0 0 
0 0 0 0 0 0 0 0.06 0 2101.43 0 0 0 0 0 0 1577.73 0 0 0 0 0 0 -808.512 0 0 0 0 0 -1082.42 0 870.312 0 0 0 0 -239.799 0 0 0 0 0 0 0 0 0 0 0 -132.832 72.5578 0 0 0 0 0 0 0 
0 0 0 0 0 0 2453.76 0 0.06 0 0 0 0 0 0 0 0 0 2326.81 0 0 0 0 0 0 -1977.22 0 0 -2249.9 0 433.134 0 0 0 0 0 0 0 -999.71 0 0 0 0 0 0 0 1826 1444.82 1083.18 0 -2470.24 0 0 0 0 0 0 
0 0 0 0 0 0 0 -984.756 0 0.04 -215.537 0 0 0 0 0 0 0 -1300.62 0 0 0 0 0 0 0 0 0 0 0 0 0 2011.7 0 0 0 0 2395.02 226.676 0 1548.13 0 0 0 0 0 0 0 0 0 0 0 0 0 0 920.209 0 
0 0 0 0 0 0 0 0 0 648.747 0.02 0 0 0 0 0 0 0 2197.1 492.492 0 0 0 0 0 0 0 0 0 345.698 727.79 0 0 0 0 0 0 0 0 0 0 0 0 0 0 0 0 0 0 0 -2107.68 0 0 0 0 0 -632.725 
-753.731 0 0 0 0 0 1609.62 0 0 0 0 0.06 1460.54 0 0 0 0 0 0 0 0 0 0 0 601.596 0 0 0 0 0 0 0 0 0 0 0 0 0 0 0 0 0 0 0 0 0 819.651 0 0 0 0 0 0 0 0 0 0 
0 0 0 0 0 0 0 0 0 0 0 1250.11 0 0 0 0 0 0 0 0 0 0 0 1029.01 0 0 0 0 0 0 0 0 0 0 0 0 0 0 0 965.529 0 -16.4037 0 0 0 0 0 0 0 0 0 0 0 0 0 0 0 
0 0 0 -1261.41 0 0 -2103.41 0 0 0 0 0 0 0.06 0 0 0 0 0 0 0 -108.417 0 0 0 0 0 0 0 0 0 0 0 0 2490.84 0 0 0 0 0 141.224 2190.85 0 0 0 0 0 0 0 1921.37 0 0 0 0 0 0 0 
0 0 -1132.77 1121.33 0 0 0 0 0 0 0 0 0 0 0.06 0 0 0 0 0 137.715 0 0 2193.9 0 0 0 0 -66.3015 0 0 0 0 0 0 0 0 2026.2 0 0 0 0 1114.46 0 0 0 1111.56 0 0 0 0 0 0 0 -1252.86 0 0 
0 0 0 0 0 -1053.27 0 0 0 0 0 0 0 0 0 0.04 1031.91 0 0 0 0 0 0 0 0 0 0 0 1486.18 0 -386.288 1526 486.694 0 0 0 0 0 0 0 0 370.876 0 0 0 0 0 0 -370.724 0 0 0 0 0 0 0 0 
0 -1623.2 -2378.84 0 0 1600.31 0 184.713 0 0 0 0 0 0 0 -895.489 0.03 0 1925.03 0 -1703.47 1936.63 2242.12 -431.303 0 0 0 0 0 0 0 0 0 2035.81 0 0 0 0 0 0 0 0 0 0 0 0 920.972 0 0 0 0 0 0 0 0 855.663 0 
2154.07 0 0 0 0 0 0 0 0 0 0 0 0 0 0 0 0 0 0 0 0 0 0 2058.09 0 0 0 0 -1665.47 0 -1250.42 0 0 0 0 0 0 0 0 0 0 0 0 0 0 0 0 0 0 0 -1558.81 0 0 0 0 0 0 
0 0 0 0 892.438 0 0 0 2202.75 1859.72 -602.664 0 0 0 0 0 2140.03 0 0.05 0 0 2453.46 0 0 0 0 -1516.08 0 0 0 0 -2134.08 0 0 -361.873 0 0 0 0 0 0 -1390.96 0 0 0 0 0 0 0 0 0 0 0 0 0 1199.91 -1744.51 
0 0 0 0 0 0 277.795 0 0 0 -2250.51 0 0 0 0 0 0 0 0 0.07 0 722.907 0 0 0 0 0 0 0 0 0 0 0 0 0 0 0 0 0 2252.65 0 -71.337 0 0 1523.71 717.261 0 -202.414 0 0 0 0 0 0 0 0 0 
0 0 0 0 0 0 0 0 0 0 0 0 0 0 2369.38 0 -355.617 0 0 0 0 -1054.8 0 0 2079.61 0 0 0 0 2097 0 0 0 0 0 2071.37 629.978 0 0 -1276.21 0 0 361.11 0 0 0 0 0 0 0 0 0 0 0 0 0 0 
114.978 1704.38 0 0 0 0 367.672 0 0 0 0 0 0 658.361 0 0 727.79 0 2065.11 -2308.95 1725.75 0.03 0 0 -1845.99 0 -1856.06 0 0 0 0 0 0 0 0 0 0 799.661 0 0 -1744.82 0 0 0 0 1497.92 0 0 0 0 0 0 0 0 0 0 1657.54 
0 0 636.998 0 0 0 0 0 0 0 0 0 0 0 0 0 2224.72 0 0 0 0 0 0.05 0 1205.4 0 0 0 0 0 0 0 0 0 0 0 1150.47 0 -1373.71 0 0 0 0 0 0 0 0 0 0 0 0 15.4881 0 731.452 0 0 0 
0 0 0 0 -847.27 -2288.81 0 -2368.47 0 0 0 0 1867.66 0 2040.24 0 531.556 1604.13 0 0 0 0 0 0.02 0 0 0 0 0 -60.3504 0 0 0 0 0 0 1610.08 0 -337.764 0 778.603 0 0 0 0 0 0 0 0 0 0 0 0 0 0 1105.76 174.642 
0 0 40.0555 0 0 0 1014.51 0 0 0 0 2304.07 0 0 0 0 0 0 0 0 -1562.01 -1034.65 383.999 0 0.06 0 0 0 0 0 206.687 0 0 0 0 0 0 0 0 0 0 0 0 0 0 0 947.676 0 0 0 0 0 -239.647 0 0 0 0 
0 0 2455.14 0 0 -34.1044 0 0 1578.8 0 0 0 0 0 0 0 0 0 0 0 0 0 0 0 0 0.03 0 0 0 0 0 0 0 0 0 0 0 0 0 0 0 0 0 0 0 0 0 0 0 0 0 0 0 0 -125.507 0 847.27 
0 0 0 1671.73 0 0 0 0 0 0 0 0 0 0 0 0 0 0 2473.3 0 0 201.804 0 0 0 0 0.05 0 0 0 0 -1045.18 0 0 0 0 0 0 0 0 24.7963 0 0 0 0 0 0 0 0 2201.07 0 0 0 0 0 -1577.73 0 
0 0 0 0 0 -25.2541 0 0 0 0 0 0 0 0 0 0 0 0 0 0 0 0 0 0 0 0 0 0.02 0 1510.28 0 0 2108.91 0 0 0 0 0 0 0 0 0 0 0 0 252.922 0 0 0 0 0 0 0 0 0 0 1233.79 
0 0 0 0 1890.39 -1300.01 0 0 2014.15 0 0 0 0 0 110.096 1020.31 0 1172.75 0 0 0 0 0 0 0 0 0 0 0.04 769.448 0 0 0 0 -700.781 0 709.937 0 0 0 946.15 0 0 0 0 0 0 343.715 0 0 0 0 0 0 0 0 0 
0 0 -2385.86 0 0 -1222.19 0 -2097 0 0 622.806 0 0 0 0 0 0 0 0 0 2235.25 0 0 2217.25 0 0 0 1554.23 1732.46 0.05 0 -1492.89 0 0 0 0 476.623 0 0 0 0 0 0 0 0 0 0 363.552 265.435 0 0 0 0 0 0 0 0 
0 0 0 0 0 0 0 0 1742.84 0 1120.11 0 0 0 0 692.083 0 2289.42 0 0 0 0 0 0 -924.787 0 0 0 0 0 0.01 0 2440.95 0 -1850.41 0 0 0 0 0 0 0 0 0 0 -1158.86 0 0 0 -806.833 0 0 0 0 0 0 0 
-620.518 0 0 0 0 0 0 2088.76 0 0 0 0 0 0 0 1807.99 0 0 -2457.27 0 0 0 0 0 0 0 -1185.42 0 0 426.115 0 0.09 0 1552.25 0 0 0 0 0 0 0 0 0 0 0 0 0 0 1290.4 1837.29 0 0 0 0 0 -1151.08 0 
2404.48 0 0 0 0 0 0 0 0 -1627.48 0 0 0 0 0 2049.09 0 0 0 0 0 0 0 0 0 0 0 1659.37 0 0 823.161 0 0.01 0 0 0 0 0 0 0 0 0 0 0 0 0 -1242.64 0 0 0 0 0 0 0 0 0 0 
0 0 0 0 0 2079.61 0 0 0 0 0 0 0 0 0 0 -1830.88 0 0 0 0 0 0 0 0 0 0 0 0 0 0 1327.94 0 0.01 0 0 0 0 0 0 0 -1760.08 -844.371 2477.42 -1666.54 0 0 0 0 0 0 0 0 0 0 0 0 
0 0 0 0 0 0 0 0 0 0 0 0 0 1786.48 0 0 0 0 490.051 0 0 0 0 0 0 0 0 0 -310.45 0 1412.63 0 0 0 0 0 0 0 0 0 0 0 0 0 0 0 0 728.858 -1860.03 0 0 1626.41 0 0 0 0 0 
0 0 0 1100.73 0 0 0 0 0 0 0 0 0 0 0 0 0 0 0 0 -786.233 0 0 0 0 0 0 0 0 0 0 0 0 0 0 0.04 0 0 0 0 0 0 0 0 2450.56 0 0 0 0 0 0 0 0 0 -1142.69 0 0 
0 0 0 0 0 0 0 2131.79 0 0 0 0 0 0 0 0 0 0 0 0 1250.11 0 -398.19 1068.53 0 0 0 0 121.845 1616.34 0 0 0 0 0 0 0.07 0 0 0 0 0 0 0 0 0 0 0 0 0 0 0 2387.08 0 0 0 0 
0 0 0 1955.24 0 0 0 0 0 763.344 0 0 0 0 -1567.81 0 0 0 0 0 0 1712.78 0 0 0 0 0 0 0 0 0 0 0 0 0 0 0 0.06 0 0 1881.54 0 0 0 0 0 0 0 0 0 0 0 0 0 0 0 0 
0 0 0 0 0 0 0 0 -2457.43 768.38 0 0 0 0 0 0 0 0 0 0 0 0 -576.724 2312.77 0 0 0 0 0 0 0 0 0 0 0 0 0 0 0.04 0 0 0 0 0 0 0 0 0 0 0 1102.86 0 1060.14 0 0 0 0 
0 -789.438 0 0 0 0 0 0 0 0 0 0 221.335 0 0 0 0 0 0 2328.03 1304.13 0 0 0 0 0 0 0 0 0 0 0 0 0 0 0 0 0 0 0 0 0 0 0 121.082 0 0 0 0 0 0 0 812.479 0 0 0 -131.764 
1634.19 0 0 0 0 0 0 0 0 1110.64 0 0 0 2398.37 0 0 0 0 0 0 0 2053.67 0 77.4407 0 0 -334.559 0 936.232 0 0 0 0 0 0 0 0 487.152 0 0 0.02 0 264.672 0 0 -2316.58 0 0 0 -1581.7 0 0 0 0 0 2409.82 0 
1330.07 975.753 0 0 0 0 0 0 0 0 0 0 -1946.39 2007.43 0 1840.04 0 0 575.198 -696.509 0 0 0 0 0 0 0 0 0 0 0 0 0 169.759 0 0 0 0 0 0 0 0.03 0 0 0 0 0 0 0 0 0 30.137 0 0 -1599.25 0 1225.24 
0 0 0 0 -1883.68 0 552.766 0 0 0 0 0 0 0 -728.095 0 0 0 0 0 242.546 0 0 0 0 0 0 0 0 0 0 0 0 1023.67 0 0 0 0 0 0 -78.9666 0 0.05 0 0 1999.34 0 0 0 0 2000.56 0 0 -922.651 0 0 0 
0 1995.83 0 0 0 0 0 0 0 0 0 0 0 0 0 0 0 0 0 0 0 0 0 0 0 0 0 0 0 0 0 0 0 892.743 0 0 0 0 0 0 0 0 0 0.01 0 0 0 0 0 0 0 0 0 0 0 0 0 
0 0 0 0 0 0 0 0 0 0 0 0 0 0 0 0 0 0 0 404.141 0 0 0 0 0 0 0 0 0 0 0 0 0 1787.39 0 1651.59 0 0 0 1812.88 0 0 0 0 0.06 1503.11 0 0 0 995.132 0 0 0 -1902.3 0 0 0 
0 1207.39 0 0 0 0 0 0 0 0 0 0 0 0 0 0 0 0 0 -841.472 0 1655.4 0 0 0 0 0 339.747 0 0 287.866 0 0 0 0 0 0 0 0 0 -1269.04 0 -299.921 0 2270.65 0.01 0 0 0 0 0 0 0 -818.278 0 0 0 
0 0 0 0 0 1652.96 0 0 -1060.44 0 0 -1807.69 0 0 1271.63 0 205.466 0 0 0 0 0 0 0 -404.294 0 0 0 0 0 0 0 -2018.11 0 0 0 0 0 0 0 0 0 0 0 0 0 0.05 0 1654.94 0 0 0 0 1988.2 0 0 0 
0 0 0 0 0 0 0 0 1368.07 0 0 0 0 0 0 0 0 0 0 887.097 0 0 0 0 0 0 0 0 -1499.6 1871.93 0 0 0 0 -1219.29 0 0 0 0 0 0 0 0 0 0 0 0 0.07 0 0 0 0 0 786.996 0 0 0 
0 0 0 0 -1396.3 0 -480.895 -1478.09 -2153.77 0 0 0 0 0 0 2185.51 0 0 0 0 0 0 0 0 0 0 0 0 0 -1074.94 0 2328.03 0 0 72.2526 0 0 0 0 0 0 0 0 0 0 0 1963.18 0 0.07 0 0 0 0 -1371.88 0 1895.12 0 
0 0 0 0 0 -160.298 1616.64 1805.7 0 0 0 0 0 1188.01 0 0 0 0 0 0 0 0 0 0 0 0 1799.6 0 0 0 -1514.1 2434.54 0 0 0 0 0 0 0 0 -1480.53 0 0 0 2009.11 0 0 0 0 0.09 0 0 0 0 0 0 0 
0 371.181 0 -474.487 0 0 0 0 -1490.6 0 796.609 0 0 0 0 0 0 751.289 0 0 0 0 0 0 0 0 0 0 0 0 0 0 0 0 0 0 0 0 1679.36 0 0 0 233.848 0 0 0 0 0 0 0 0.02 0 0 0 0 2275.54 0 
0 0 -551.851 0 0 -190.359 0 0 0 0 0 0 0 0 0 0 0 0 0 0 0 0 -534.913 0 0 0 0 0 0 0 0 0 0 0 1396.3 0 0 0 0 0 0 103.076 0 0 0 0 0 0 0 0 0 0.08 0 0 0 983.23 0 
0 0 0 0 0 0 862.987 0 0 0 0 0 0 0 0 0 0 0 0 0 0 0 0 0 56.5355 0 0 0 0 0 0 0 0 0 0 0 -2415.31 0 1450.32 2447.2 0 0 0 0 0 0 0 0 0 0 0 0 0.02 0 0 0 0 
0 1835.92 2417.6 0 0 0 0 0 0 0 0 0 0 0 0 0 0 0 0 0 0 0 1545.23 0 0 0 0 0 0 0 0 0 0 0 0 0 0 0 0 0 0 0 429.167 0 664.312 122.913 -498.138 1182.67 1398.89 0 0 0 0 0.09 0 0 0 
0 0 0 0 0 0 0 0 0 0 0 0 0 0 741.066 0 0 0 0 0 0 0 0 0 0 1353.72 0 0 0 0 0 0 0 0 0 -739.998 0 0 0 0 0 -13.0467 0 0 0 0 0 0 0 0 0 0 0 0 0.07 0 -1087.6 
0 0 -559.481 0 0 0 0 0 0 865.886 0 0 0 0 0 0 -451.445 0 1072.04 0 0 0 0 868.633 0 0 1023.97 0 0 0 0 1465.73 0 0 0 0 0 0 0 0 -1411.25 0 0 0 0 0 0 0 402.31 0 1372.95 487.609 0 0 0 0.08 0 
0 0 0 0 0 0 0 0 0 0 2240.29 0 0 0 0 0 0 0 769.906 0 0 -84.3074 0 611.972 0 1452.15 0 2066.79 0 0 0 0 0 0 0 0 0 0 0 2065.26 0 -1392.03 0 0 0 0 0 0 0 0 0 0 0 0 210.807 0 0.06 
