*Vertices 46
*Matrix 
0.03 330.134 0 0 0 18.0822 0 -392.087 0 0 0 0 1342.74 0 0 2021.01 0 0 0 0 0 0 0 0 0 0 0 0 0 0 0 -1104.08 1040.91 0 0 0 0 0 0 0 0 0 0 0 0 0 
-279.931 0.07 0 0 0 697.577 0 0 2212.82 0 1836.99 0 0 0 0 384.304 83.2392 976.058 0 0 0 0 0 0 0 -2241.66 0 0 0 0 0 0 0 0 0 0 508.057 0 0 0 0 0 0 0 0 0 
0 0 0.03 0 0 0 0 0 0 0 0 1477.32 0 432.066 0 0 0 1820.35 0 0 490.814 0 0 0 0 1074.02 0 0 0 0 0 0 0 0 0 0 0 0 -1392.64 0 0 0 0 0 0 0 
0 0 0 0.03 0 0 0 0 0 0 0 -953.475 0 0 889.538 0 0 0 0 0 0 2417.6 0 0 0 0 1376.77 0 0 0 0 0 0 0 1249.81 0 0 0 0 0 0 0 0 0 388.272 0 
0 0 0 0 0.03 0 0 0 0 0 0 0 0 0 0 0 0 0 0 0 0 -754.341 0 0 2145.99 0 0 1781.44 0 0 0 0 0 -894.269 0 2071.21 0 0 -2133.63 0 0 0 0 0 0 0 
-1837.44 82.6289 0 0 0 0.05 0 0 1625.34 0 0 0 0 0 0 0 2399.75 0 -2400.36 0 0 0 0 0 0 0 0 0 0 0 0 0 0 0 0 0 0 0 1024.43 2249.29 -1578.04 0 0 0 0 0 
0 0 0 0 0 0 0.07 0 0 0 0 0 0 2283.32 0 0 0 0 0 356.838 0 701.544 0 0 0 0 -2467.65 0 0 2283.17 0 0 0 0 0 0 0 0 -56.8407 0 -2060.99 1961.96 0 1065.63 0 0 
2183.22 0 0 0 0 0 0 0.01 0 0 0 -799.661 0 0 0 0 0 0 0 0 0 0 0 0 0 -241.63 0 0 922.193 351.497 0 0 0 0 0 0 0 0 0 0 0 0 0 0 -1670.66 2404.48 
0 1003.07 0 0 0 -2072.89 0 0 0.04 0 2281.18 0 0 2004.68 0 0 0 0 0 0 0 0 0 0 -4.80667 0 0 0 0 0 0 0 0 0 0 0 0 0 -143.361 0 0 0 0 0 0 0 
0 0 0 0 0 0 0 0 0 0.04 0 0 0 0 0 0 0 0 0 0 0 0 0 0 0 0 -392.85 0 0 0 0 0 0 0 0 0 0 1758.55 0 0 0 2422.64 -71.9474 0 -779.366 0 
0 -1833.78 0 0 0 0 0 0 300.073 0 0.02 2022.69 0 0 0 0 0 0 0 0 0 0 0 0 0 0 0 0 0 0 1556.98 0 0 0 0 0 1318.63 0 0 0 0 0 0 0 0 0 
0 0 -434.812 1524.32 0 0 0 1114.46 0 0 -1541.41 0.05 0 0 0 0 0 0 0 0 851.848 0 0 0 0 0 1973.1 0 0 0 0 1328.24 0 0 0 0 0 0 0 0 0 0 0 0 0 -159.383 
242.546 0 0 0 0 0 0 0 0 0 0 0 0 0 0 0 0 1896.34 0 0 0 965.529 0 0 0 0 0 0 1617.71 14.1148 0 0 0 0 0 0 0 0 0 0 0 0 0 0 0 0 
0 0 1257.9 0 0 0 2357.17 0 931.654 0 0 0 0 0.05 793.863 0 0 0 0 0 0 0 1967.91 0 666.753 0 0 0 164.418 0 -903.882 0 0 0 0 0 0 0 0 0 0 0 0 -1127.28 0 0 
0 0 0 -2400.81 0 0 0 0 0 0 0 0 0 1162.07 0.04 0 0 0 0 0 0 0 0 0 0 0 1270.41 -464.415 0 0 1196.86 0 0 0 0 0 0 2041.46 0 0 0 0 0 0 0 0 
-562.075 1833.32 0 0 0 0 0 0 0 0 0 0 0 0 0 0.01 0 2088.61 0 0 -1388.52 0 0 0 0 -1665.32 0 0 0 0 0 0 0 0 0 0 0 1006.42 0 0 0 0 0 0 0 0 
0 2324.98 0 0 0 1230.74 0 0 0 0 0 0 0 0 0 0 0.07 0 0 0 0 0 0 0 0 547.426 1582.61 280.236 0 0 0 0 0 0 0 0 0 -495.849 0 247.124 -291.07 0 0 0 0 -154.042 
0 1000.47 1897.56 0 0 0 0 0 0 0 0 0 59.74 0 0 288.324 0 0.02 2400.36 0 1563.39 0 0 0 0 0 0 0 0 0 0 0 599.765 0 0 0 0 0 0 0 0 658.513 1117.82 0 0 0 
0 0 0 0 0 1213.64 0 0 0 0 0 0 0 0 0 0 0 1718.12 0.06 575.655 0 0 0 0 0 0 0 0 0 0 0 0 0 0 0 0 0 0 -11.3681 0 2008.5 0 -519.959 0 0 0 
0 0 0 0 0 0 1019.09 0 0 0 0 0 0 0 0 0 0 0 1810.89 0.03 0 0 0 0 0 0 0 0 0 182.73 0 0 0 0 0 0 0 0 0 42.8022 0 -1552.71 0 0 0 0 
0 0 2339.78 0 0 0 0 0 0 0 0 2459.56 0 0 0 -832.163 0 1974.32 0 0 0.06 0 0 0 0 1242.18 1604.89 0 0 0 0 0 0 0 -1796.85 0 0 0 0 0 0 0 0 0 695.135 0 
0 0 0 2355.8 2284.39 0 -1375.39 0 0 0 0 0 2424.47 0 0 0 0 0 0 0 0 0.06 0 0 -2161.7 -307.092 0 0 0 0 0 0 0 0 778.146 0 0 0 0 0 0 175.253 0 0 0 0 
0 0 0 0 0 0 0 0 0 0 0 0 0 2120.66 0 0 0 0 0 0 0 0 0.09 0 406.888 0 0 0 0 0 0 0 0 0 0 0 0 0 -1003.07 0 0 -710.395 0 0 0 0 
0 0 0 0 0 0 0 0 0 0 0 0 0 0 0 0 0 0 0 0 0 0 0 0.05 1825.39 0 0 0 0 0 0 0 0 0 0 -1888.1 2463.84 0 0 1467.86 0 0 0 0 0 0 
0 0 0 0 1008.26 0 0 0 -1380.73 0 0 0 0 -287.561 0 0 0 0 0 0 0 2113.03 575.961 -804.544 0.02 0 0 0 0 1470.76 0 0 0 0 0 0 0 0 0 0 0 0 0 0 0 161.061 
0 -1194.11 -1816.23 0 0 0 0 2140.64 0 0 0 0 0 0 0 1954.18 33.7992 0 0 0 2357.48 2261.04 0 0 0 0.01 0 0 0 0 0 0 0 0 0 0 0 0 0 0 2075.49 0 0 0 0 0 
0 0 0 -1775.34 0 0 1362.58 0 0 -1491.06 0 1116.14 0 0 890.759 0 2334.59 0 0 0 2237.08 0 0 0 0 0 0.09 0 0 0 0 0 0 0 0 0 0 0 0 0 0 0 0 0 0 0 
0 0 0 0 815.836 0 0 0 0 0 0 0 0 0 -589.389 0 -2133.47 0 0 0 0 0 0 0 0 0 0 0.03 2315.52 -1026.41 0 0 0 0 0 -345.088 0 0 0 0 0 0 1156.27 0 0 0 
0 0 0 0 0 0 0 -620.518 0 0 0 0 1613.44 1984.69 0 0 0 0 0 0 0 0 0 0 0 0 0 -116.352 0.03 0 0 0 0 -166.097 0 0 2154.07 0 0 0 -240.257 0 0 0 0 0 
0 0 0 0 0 0 -1477.63 1316.03 0 0 0 0 1681.34 0 0 0 0 0 0 1148.49 0 0 0 0 -889.081 0 0 91.6318 0 0.06 0 0 0 0 0 0 0 0 0 0 0 0 0 0 0 1826.61 
0 0 0 0 0 0 0 0 0 0 173.574 0 0 1906.11 -2146.6 0 0 0 0 0 0 0 0 0 0 0 0 0 0 0 0.02 0 2452.85 0 -737.556 0 0 0 0 -119.098 1889.78 0 0 0 0 681.707 
2035.97 0 0 0 0 0 0 0 0 0 0 1184.8 0 0 0 0 0 0 0 0 0 0 0 0 0 0 0 0 0 0 0 0.05 0 0 0 -1440.55 0 0 0 0 0 0 0 0 0 1225.55 
-1967.6 0 0 0 0 0 0 0 0 0 0 0 0 0 0 0 0 1692.48 0 0 0 0 0 0 0 0 0 0 0 0 181.204 0 0.06 0 0 0 0 541.322 0 0 0 0 1037.86 0 2374.42 0 
0 0 0 0 2197.26 0 0 0 0 0 0 0 0 0 0 0 0 0 0 0 0 0 0 0 0 0 0 0 -1225.7 0 0 0 0 0.02 0 0 0 0 0 0 0 0 0 0 0 0 
0 0 0 1060.14 0 0 0 0 0 0 0 0 0 0 0 0 0 0 0 0 228.355 1670.96 0 0 0 0 0 0 0 0 2470.55 0 0 0 0.03 2054.73 0 0 1635.26 0 2160.33 1505.1 0 0 0 0 
0 0 0 0 1695.23 0 0 0 0 0 0 0 0 0 0 0 0 0 0 0 0 0 0 1265.83 0 0 0 -1000.17 0 0 0 543.153 0 0 500.122 0.01 1602.76 0 0 0 0 0 0 0 0 0 
0 -465.789 0 0 0 0 0 0 0 0 129.17 0 0 0 0 0 0 0 0 0 0 0 0 289.392 0 0 0 0 964.766 0 0 0 0 0 0 1865.52 0.09 0 0 0 1748.48 0 0 0 2267.75 0 
0 0 0 0 0 0 0 0 0 2485.5 0 0 0 0 823.771 2471.47 1299.4 0 0 0 0 0 0 0 0 0 0 0 0 0 0 0 -1392.94 0 0 0 0 0.09 0 0 1717.35 0 0 0 0 0 
0 0 1914.81 0 2497.71 -1645.33 -1981.95 0 2141.25 0 0 0 0 0 0 0 0 0 385.372 0 0 0 2492.83 0 0 0 0 0 0 0 0 0 0 0 -1878.95 0 0 0 0 0 0 0 0 -499.054 0 -1434.14 
0 0 0 0 0 437.101 0 0 0 0 0 0 0 0 0 0 -2367.55 0 0 2409.36 0 0 0 -2221.52 0 0 0 0 0 0 1253.47 0 0 0 0 0 0 0 0 0.09 0 0 0 0 0 967.055 
0 0 0 0 0 -297.174 2022.23 0 0 0 0 0 0 0 0 0 -1582.61 0 1665.01 0 0 0 0 0 0 -538.881 0 0 1169.55 0 -2427.67 0 0 0 -1045.49 0 2418.06 2123.55 0 0 0.03 0 0 0 0 0 
0 0 0 0 0 0 -1781.29 0 0 1979.51 0 0 0 0 0 0 0 900.525 0 630.741 0 496.765 1370.82 0 0 0 0 0 0 0 0 0 0 0 -633.946 0 0 0 0 0 0 0.05 0 0 0 0 
0 0 0 0 0 0 0 0 0 -2398.07 0 0 0 0 0 0 0 -1145.59 1501.74 0 0 0 0 0 0 0 0 484.71 0 0 0 0 -1074.79 0 0 0 0 0 0 0 0 0 0.07 2397.31 0 2148.58 
0 0 0 0 0 0 -1759.62 0 0 0 0 0 0 1682.71 0 0 0 0 0 0 0 0 0 0 0 0 0 0 0 0 0 0 0 0 0 0 0 0 -929.975 0 0 0 1776.25 0.03 0 0 
0 0 0 1478.85 0 0 0 1416.59 0 -1151.69 0 0 0 0 0 0 0 0 0 0 973.617 0 0 0 0 0 0 0 0 0 0 0 542.848 0 0 0 1572.39 0 0 0 0 0 0 0 0.04 0 
0 0 0 0 0 0 0 -2126 0 0 0 1557.74 0 0 0 0 -138.325 0 0 0 0 0 0 0 1372.95 0 0 0 0 -1170.31 802.56 772.042 0 0 0 0 0 0 -1209.83 2299.65 0 0 -2185.51 0 0 0.03 
