*Vertices 65
*Matrix 
0.01 0 1705.6 -2065.87 0 2010.79 -1249.05 0 0 0 0 1171.22 -1694.77 0 0 0 -1485.87 -1042.28 0 -1676.76 179.22 2357.02 2049.24 0 0 0 1004.44 0 0 0 658.055 0 0 0 0 0 0 0 0 0 0 -1859.72 0 2371.97 100.024 0 0 0 0 0 2268.97 0 0 735.725 540.254 0 0 0 0 2362.82 0 0 -2131.18 0 0 
0 0.07 1558.35 0 0 0 0 0 0 0 0 0 1454.59 0 1297.42 0 0 0 0 280.541 0 785.775 -1898.48 0 0 0 0 0 -2202.9 0 0 0 0 0 2052.6 0 -2054.73 0 0 2261.5 730.079 -373.165 0 69.0481 0 0 0 0 0 0 0 0 0 0 0 0 0 0 0 0 0 0 0 0 0 
839.793 240.562 0 0 0 0 0 -1217.76 390.713 0 0 0 0 0 0 0 0 -232.78 0 0 0 0 0 0 0 2371.06 -1321.68 0 0 0 0 0 0 1347.01 0 0 0 0 0 908.765 0 0 0 0 0 0 0 0 0 0 0 0 0 0 0 0 120.472 0 0 0 0 0 0 0 0 
1314.97 0 0 0.01 0 0 0 0 0 0 0 0 0 0 0 1301.54 0 0 0 -1767.25 0 0 0 0 0 0 0 0 1484.34 0 0 0 1297.88 -994.064 0 0 1668.07 0 0 0 0 0 0 0 0 0 0 0 0 465.789 1407.9 0 0 0 0 0 -1947 0 0 0 -696.051 -544.526 0 0 0 
0 0 0 0 0.06 293.97 0 1847.36 0 0 2004.68 1462.83 433.897 0 0 1961.96 0 716.651 0 0 0 -599.765 -1150.62 0 0 0 0 0 0 0 0 -703.528 0 505.005 980.636 0 890.912 0 0 0 0 0 214.164 -219.199 0 0 0 0 0 0 0 0 0 0 0 0 0 0 0 838.725 0 0 0 0 0 
2333.52 0 0 0 1180.68 0.07 0 -2106.01 0 0 2366.02 0 0 253.99 608.921 0 -675.451 0 0 0 1929.15 2441.71 0 0 0 0 -550.325 901.44 1878.64 0 0 0 0 0 -398.19 0 1426.82 0 0 0 0 0 0 0 -1351.59 0 0 0 0 0 0 0 0 0 1110.03 0 0 0 0 -1230.12 -140.767 0 0 0 0 
812.021 0 0 0 0 0 0.07 -2013.23 0 0 1423.61 0 0 0 1942.43 0 1336.02 0 0 0 0 0 0 0 1189.99 0 0 0 2286.37 0 0 1729.87 2425.84 0 0 0 -359.89 0 0 0 0 0 0 0 0 0 0 0 0 0 0 0 0 316.706 -2153.46 0 0 0 0 -1642.58 0 0 0 0 0 
0 0 1360.44 0 2341.91 -355.922 1213.03 0.04 0 0 0 -386.898 417.264 0 0 0 1586.12 51.6526 0 0 -765.786 2208.4 0 0 2014.15 0 0 0 0 -601.901 0 -564.364 0 -599.46 0 -522.706 -1488.62 0 0 0 0 0 0 0 0 0 0 0 0 0 0 0 0 0 0 -208.365 2490.84 0 0 -2182 0 0 0 244.835 0 
0 0 -427.488 0 0 0 0 0 0.07 0 0 0 0 0 0 0 698.035 0 0 0 0 0 0 0 199.362 0 0 0 0 0 0 0 0 0 0 0 0 0 0 368.587 0 0 0 0 0 0 0 0 -1072.19 0 1643.5 0 0 0 0 0 0 0 0 0 0 0 0 0 0 
0 0 0 0 0 0 0 0 0 0 0 0 0 0 0 -646.001 0 0 0 0 0 2308.19 0 37.9192 0 0 2447.2 2033.52 0 -116.352 0 1788.61 0 0 0 0 0 0 0 0 1113.54 0 0 0 0 0 0 0 0 0 0 0 0 0 0 0 0 1099.05 0 0 -646.001 0 0 0 508.82 
0 0 0 0 1695.38 -2331.84 355.617 0 0 0 0.02 0 0 0 1848.89 0 0 98.1933 0 2366.63 0 0 0 1472.59 0 0 817.82 0 0 790.353 0 0 0 2144.46 0 0 0 0 0 0 0 0 0 0 0 0 0 0 0 0 0 0 0 0 0 0 0 0 1573.76 0 -1292.99 0 0 0 0 
-1721.32 0 0 0 -871.99 0 0 2192.98 0 0 0 0.06 1536.84 0 446.715 1931.9 0 0 2491.15 2447.05 792.337 0 0 0 0 0 -457.701 -1252.56 1454.44 0 0 2364.96 0 0 -896.71 -1271.63 0 0 0 0 0 0 0 0 0 -1753.36 0 100.635 0 0 -838.725 0 0 0 0 0 0 0 0 0 0 0 0 0 0 
1454.44 2013.53 0 0 755.715 0 0 831.858 0 0 0 -1500.06 0.08 0 0 0 0 0 0 0 0 0 -1132.47 0 0 0 0 0 1105.61 288.171 0 0 0 0 0 0 844.218 0 0 0 0 0 0 0 0 0 0 0 0 0 0 0 0 0 0 0 0 1070.06 0 0 0 0 0 0 0 
0 0 0 0 0 -121.998 0 0 0 0 0 0 0 0.03 0 0 2351.37 0 0 0 0 0 -1738.41 0 0 0 0 0 0 0 -2021.32 0 0 0 1870.4 0 0 0 0 0 2420.19 0 0 0 0 0 0 0 0 0 0 0 0 0 0 0 0 0 1939.53 0 0 0 0 0 0 
0 407.956 0 0 0 1981.64 875.195 0 0 0 319.758 -468.23 0 0 0.06 2398.22 0 0 650.578 0 1986.22 0 0 0 0 -2130.42 0 0 0 1193.35 0 0 0 0 1128.35 0 0 2076.25 0 0 0 0 -739.54 0 0 0 0 -511.109 0 0 0 0 0 0 0 0 0 0 0 0 -249.87 0 0 0 0 
0 0 0 -575.198 1658.91 0 0 0 0 -2021.16 0 1827.83 0 0 -39.2926 0.06 0 0 0 0 0 0 0 79.1192 0 -2015.67 0 0 0 0 0 0 0 0 92.3948 0 0 496.002 0 0 0 0 0 0 0 0 0 0 0 534.913 0 0 0 1689.73 0 0 -1016.8 0 0 0 486.694 0 0 221.793 0 
2469.48 0 0 0 0 1605.04 92.3948 -902.814 459.227 0 0 0 0 785.165 0 0 0.07 0 0 0 0 0 0 0 0 110.401 0 0 0 0 0 2326.81 -925.398 1293.3 0 1584.6 0 0 0 0 0 0 0 0 0 0 0 0 0 -1856.06 0 -100.482 0 0 0 0 0 0 0 0 0 0 0 0 0 
1071.58 0 -1426.51 0 2339.78 0 0 -1828.29 0 0 2402.49 0 0 0 0 0 0 0.09 0 1605.96 1663.03 0 0 0 0 0 0 1795.18 0 2236.17 2494.2 0 0 -1359.68 2238 0 224.845 0 0 0 0 0 0 0 0 0 0 0 -322.81 0 0 0 0 959.273 0 0 0 0 0 0 0 0 0 0 0 
0 0 0 0 0 0 0 0 0 0 0 -1981.64 0 0 -1305.35 0 0 0 0.01 1078.45 0 0 0 1059.37 0 0 1095.84 0 0 0 1718.73 1191.67 0 2151.94 0 0 0 0 0 0 0 0 0 0 0 0 0 0 0 0 0 0 0 1398.13 0 0 135.884 0 0 0 0 0 0 0 0 
1735.82 1677.98 0 2461.24 0 0 0 0 0 0 962.02 -2011.09 0 0 0 0 0 1536.53 993.454 0.05 0 0 1845.23 250.023 -369.045 0 1714.61 -1889.63 0 0 -2280.88 0 2151.48 0 0 0 0 0 0 0 0 0 -70.2689 0 0 510.651 0 0 0 0 0 0 0 0 1077.68 0 -454.802 0 0 0 0 0 0 1534.55 0 
2300.87 0 0 0 0 672.704 0 471.892 0 0 0 -101.856 0 0 -1155.51 0 0 -499.054 0 0 0 0 1931.14 -134.968 542.238 1750.77 -1066.55 1215.32 0 0 -159.23 -2477.57 0 0 0 -173.421 0 0 0 0 0 0 0 0 0 0 0 0 0 2167.35 -1888.26 0 0 0 0 0 0 0 -2356.41 0 0 0 0 0 0 
-1215.02 -64.6229 0 0 34.257 1041.67 0 1624.27 0 1987.59 0 0 0 0 0 0 0 0 0 0 0 0 1415.83 0 0 0 0 0 0 0 0 0 0 0 0 0 2059.62 0 0 0 0 0 1212.88 2499.69 0 0 0 0 0 0 0 0 0 0 0 0 0 0 0 0 0 0 0 0 0 
2200.61 1461.3 0 0 1247.37 0 0 0 0 0 0 0 1895.58 -781.045 0 0 0 0 0 -2299.04 2380.52 -1028.24 0 1091.88 0 1767.86 0 0 0 0 0 0 -619.144 0 0 -954.237 0 0 0 0 0 -1880.93 0 0 0 285.424 0 0 0 0 0 0 0 0 0 0 0 0 0 156.331 0 0 0 1511.35 0 
0 0 0 0 0 0 0 0 0 -1932.66 2332 0 0 0 0 1231.35 0 0 1997.05 -1330.53 2266.53 0 -1364.25 0 0 0 504.395 0 0 1126.97 0 0 0 321.894 2207.02 0 0 0 -52.7207 0 0 0 2084.03 0 1947.92 0 0 0 0 0 0 0 0 0 0 0 0 1565.22 0 0 0 0 0 0 -1065.32 
0 0 0 0 0 0 1482.97 461.516 426.42 0 0 0 0 0 0 0 0 0 0 683.844 -101.093 0 0 0 0 0 -893.353 0 0 0 0 -923.872 1908.7 -122.303 0 0 0 0 0 0 0 0 0 0 0 0 0 0 0 0 0 0 0 0 0 0 0 0 0 0 0 1812.57 0 0 0 
0 0 2072.13 0 0 0 0 0 0 0 0 0 0 0 1228.75 1332.82 -676.977 0 0 0 2013.99 0 1062.58 0 0 0.02 0 -771.126 0 1043.05 0 0 0 1578.34 1594.06 0 0 0 0 0 0 606.021 0 -1369.75 0 0 0 -384.304 0 0 0 0 -1728.03 0 0 0 0 0 0 0 0 0 0 0 0 
-1194.72 0 1517.61 0 0 629.215 0 0 0 -1865.06 -2121.42 2443.54 0 0 0 0 0 0 920.667 915.937 660.192 0 0 746.712 1903.06 0 0.04 9.07926 2180.78 0 0 0 -232.322 0 -1860.79 -1022.9 -991.012 0 0 0 0 0 0 0 1393.09 0 2009.57 0 0 0 0 0 0 0 0 0 0 0 0 0 2497.56 0 0 0 0 
0 0 0 0 0 1671.73 0 0 0 1717.81 0 1923.2 0 0 0 0 0 2485.5 0 1550.42 1973.86 0 0 0 0 -974.685 1409.42 0.06 1029.92 0 0 0 0 0 1914.96 1459.62 0 0 0 0 0 0 0 0 0 0 0 0 0 0 0 0 0 0 0 0 0 0 0 0 0 0 0 0 0 
0 2296.9 0 -1564.46 0 -1191.52 -1320.46 0 0 0 0 2365.57 1807.99 0 0 0 0 0 0 0 0 0 0 0 0 0 -1787.85 1837.29 0.03 0 0 0 0 0 0 -996.353 0 0 0 0 0 0 0 0 -2096.09 0 0 0 0 0 0 0 0 2263.94 0 0 0 0 0 0 0 673.62 0 0 0 
0 0 0 0 0 0 0 302.667 0 -2495.12 1299.4 0 2076.56 0 204.093 0 0 285.577 0 0 0 0 0 1184.8 0 480.438 0 0 0 0.01 0 -96.82 2247.76 0 0 0 0 0 0 -2131.18 0 0 0 0 0 0 0 0 0 0 0 332.423 0 0 0 0 0 0 0 0 0 0 1102.4 0 0 
-2257.99 0 0 0 0 0 0 0 0 0 0 0 0 1281.85 0 0 0 -850.627 368.13 2282.1 -433.592 0 0 0 0 0 0 0 0 0 0.08 1739.33 0 0 0 0 0 0 380.032 0 0 0 0 0 0 0 0 0 0 0 0 0 0 0 404.141 -2103.26 0 0 0 0 2248.38 0 0 0 0 
0 0 0 0 -192.953 0 -273.37 1817.15 0 -958.052 0 -264.519 0 0 0 0 1004.59 0 912.427 0 181.356 0 0 0 2417.75 0 0 0 0 -1846.14 1638 0.06 0 735.42 0 0 0 0 0 1586.89 0 0 564.669 0 0 0 2362.51 0 0 0 0 0 0 0 0 0 0 0 1144.98 0 0 0 0 0 0 
0 0 0 -1447.11 0 0 1557.74 0 0 0 0 0 0 0 0 0 1681.8 0 0 -524.689 0 0 -2395.02 0 -170.37 0 1739.02 0 0 189.749 0 0 0.07 0 0 0 0 0 0 425.962 0 0 0 0 2167.81 0 0 0 0 0 0 0 0 0 -382.473 0 1835.15 0 0 0 0 0 0 0 0 
0 0 58.6718 -153.279 1098.44 0 0 -1451.84 0 0 1773.35 0 0 0 0 0 -26.3222 697.882 849.101 0 0 0 0 2285.45 2042.07 139.851 0 0 0 0 0 1677.22 0 0.03 0 0 0 0 0 1728.8 0 0 0 0 0 78.0511 0 1075.7 -1425.6 0 0 0 1543.7 0 -649.968 0 0 0 0 0 0 0 0 0 -1587.19 
0 2198.63 0 0 2301.93 2204.43 0 0 0 0 0 2151.63 0 1041.37 1949.75 1305.66 0 1117.51 0 0 0 0 0 -436.949 0 -2108.29 -1573 2499.69 0 0 0 0 0 0 0.03 0 0 0 0 0 0 0 0 0 0 2487.33 0 2214.65 0 0 -639.897 0 0 0 0 0 0 0 0 0 0 0 -62.0289 0 0 
0 0 0 0 0 0 0 477.233 0 0 0 1813.03 0 0 0 0 -2350.46 0 0 0 2400.2 0 2313.84 0 0 0 2312.92 -792.947 -772.5 0 0 0 0 0 0 0.06 0 0 -2160.63 0 -1581.7 0 0 0 1046.56 0 0 0 0 0 0 -210.959 0 0 0 0 0 0 -1231.5 0 0 0 1424.68 0 0 
0 2406.46 0 1336.94 1520.66 451.292 2241.81 2383.11 0 0 0 0 723.212 0 0 0 0 1432.16 0 0 0 -1640.6 0 0 0 0 1774.12 0 0 0 0 0 0 0 0 0 0 -2443.85 0 0 -947.371 0 0 0 0 0 0 0 0 0 0 752.663 0 0 0 0 0 0 0 0 0 0 0 0 1222.65 
0 0 0 0 0 0 0 0 0 0 0 0 0 0 1194.27 -1152.76 0 0 0 0 0 0 0 0 0 0 0 0 0 0 0 0 0 0 0 0 2122.33 0.06 0 0 0 1787.39 0 0 0 0 0 0 802.56 0 0 0 -935.163 0 0 0 0 622.349 -399.411 0 0 0 -2203.51 1932.81 0 
0 0 0 0 0 0 0 0 0 0 0 0 0 0 0 0 0 0 0 0 0 0 0 -24.9489 0 0 0 0 0 0 520.417 0 0 0 0 1556.06 0 0 0.03 0 0 0 0 -584.506 0 0 0 0 0 1598.79 0 0 0 0 0 0 0 1472.59 0 0 1562.78 0 0 0 0 
0 -422.452 46.1592 0 0 0 0 0 577.639 0 0 0 0 0 0 0 0 0 0 0 0 0 0 0 0 0 0 0 0 -927.381 0 179.525 2300.41 2096.55 0 0 0 0 0 0.04 -942.793 0 0 0 0 -339.29 0 0 0 0 0 0 0 0 0 0 395.444 0 0 0 0 0 0 0 0 
0 1499.3 0 0 0 0 0 0 0 -221.793 0 0 0 673.315 0 0 0 0 0 0 0 0 0 0 0 0 0 0 0 0 0 0 0 0 0 1157.03 1520.05 0 0 -931.043 0.06 0 0 0 0 0 0 0 0 0 0 0 0 -149.617 0 0 0 0 0 0 0 -423.215 0 0 0 
-581.454 2058.85 0 0 0 0 0 0 0 0 0 0 0 0 0 0 0 0 0 0 0 0 1796.55 0 0 -93.4629 0 0 0 0 0 0 0 0 0 0 0 276.269 0 0 0 0.01 0 0 0 0 0 1900.16 -703.375 0 0 0 0 0 0 0 0 0 0 -146.718 0 0 2067.86 0 0 
0 0 0 0 176.016 0 0 0 0 0 0 0 0 0 177.084 0 0 0 0 -1001.39 0 509.583 0 2206.41 0 0 0 0 0 0 0 1657.84 0 0 0 0 0 0 0 0 0 0 0.03 0 0 0 0 0 0 2285.76 -2147.21 0 0 0 0 0 0 0 0 0 0 -2202.9 0 0 0 
-80.9503 159.383 0 0 -1208 0 0 0 0 0 0 0 0 0 0 0 0 0 0 0 0 2305.75 0 0 0 1683.48 0 0 0 0 0 0 0 0 0 0 0 0 1970.5 0 0 0 0 0.09 0 0 0 0 0 0 0 0 0 0 0 613.956 0 0 -2417.29 0 0 0 0 0 744.728 
435.881 0 0 0 0 2482.91 0 0 0 0 0 0 0 0 0 0 0 0 0 0 0 0 0 544.069 0 0 -2293.54 0 1755.96 0 0 0 -1828.59 0 0 -2016.13 0 0 0 0 0 0 0 0 0.07 0 971.786 0 0 0 0 48.4481 0 0 0 0 0 0 0 0 0 0 543.001 0 0 
0 0 0 0 0 0 0 0 0 0 0 2428.74 0 0 0 0 0 0 0 2297.81 0 0 1608.55 0 0 0 0 0 0 0 0 0 0 -1422.85 -382.626 0 0 0 0 1678.29 0 0 0 0 0 0.02 0 0 0 0 0 0 0 0 0 0 0 0 0 -1192.13 0 0 0 0 0 
0 0 0 0 0 0 0 0 0 0 0 0 0 0 0 0 0 0 0 0 0 0 0 0 0 0 -203.482 0 0 0 0 848.338 0 0 0 0 0 0 0 0 0 0 0 0 2472.69 0 0.01 0 0 0 0 0 0 0 0 0 0 0 0 0 0 0 0 2292.32 0 
0 0 0 0 0 0 0 0 0 0 0 1969.89 0 0 95.5992 0 0 0 0 0 0 0 0 0 0 4.0437 0 0 0 0 0 0 0 462.737 1284.91 0 0 0 0 0 0 1170.61 0 0 0 0 0 0.05 0 0 0 0 28.4585 0 0 0 0 0 0 0 -1103.17 -891.98 0 0 0 
0 0 0 0 0 0 0 0 -1420.1 0 0 0 0 0 0 0 0 -1244.01 0 0 0 0 0 0 0 0 0 0 0 0 0 0 0 -1286.89 0 0 0 917.005 0 0 0 2332 0 0 0 0 0 0 0.01 0 0 0 0 2496.19 0 0 0 0 0 0 0 0 0 0 0 
0 0 0 802.866 0 0 0 0 0 0 0 0 0 0 0 -1060.75 1788.92 0 0 0 419.553 0 0 0 0 0 0 0 0 0 0 0 0 0 0 0 0 0 1468.78 0 0 0 -1637.7 0 0 0 0 0 0 0.08 0 0 843.303 1209.98 0 0 2020.25 1655.4 0 0 0 0 775.857 0 2246.7 
1723.3 0 0 -2467.65 0 0 0 0 1710.79 0 0 1276.51 0 0 0 0 0 0 0 0 -350.429 0 0 0 0 0 0 0 0 0 0 0 0 0 2466.28 0 0 0 0 0 0 0 -523.316 0 0 0 0 0 0 0 0.06 0 0 0 0 0 0 0 1885.36 0 -1478.55 1665.62 0 -373.165 0 
0 0 0 0 0 0 0 0 0 0 0 0 0 0 0 0 1296.66 0 0 0 0 0 0 0 0 0 0 0 0 -1039.54 0 0 0 0 0 -968.276 2430.72 0 0 0 0 0 0 0 533.692 0 0 0 0 0 0 0.05 0 0 0 0 0 1156.42 0 0 0 0 0 0 2485.2 
0 0 0 0 0 0 0 0 0 0 0 0 0 0 0 0 0 0 0 0 0 0 0 0 0 286.187 0 0 0 0 0 0 0 471.435 0 0 0 1995.68 0 0 0 0 0 0 0 0 0 -74.6941 0 -1055.1 0 0 0 1752.45 0 0 0 0 0 0 0 0 0 0 0 
1989.88 0 0 0 0 0 -45.8541 0 0 0 0 0 0 0 0 1395.99 0 -1599.86 52.5681 0 0 0 0 0 0 0 0 0 -576.571 0 0 0 0 0 0 0 0 0 0 0 -741.523 0 0 0 0 0 0 0 1657.99 1945.94 0 0 1137.35 0.08 0 0 0 1817.45 0 0 0 0 0 0 0 
1772.59 0 0 0 0 475.249 1552.4 0 0 0 0 0 0 0 0 0 0 0 0 1803.42 0 0 0 0 0 0 0 0 0 0 1392.48 0 1386.84 -463.042 0 0 0 0 0 0 0 0 0 0 0 0 0 0 0 0 0 0 0 0 0.07 -546.205 0 0 0 0 0 0 0 0 -955.458 
0 0 0 0 0 0 0 1895.89 0 0 0 0 0 0 0 0 0 0 0 0 0 0 0 0 0 0 0 0 0 0 1197.32 0 0 0 0 0 0 0 0 0 0 0 0 1216.39 0 0 0 0 0 0 0 0 0 0 -1357.08 0.01 0 0 0 0 0 0 1000.02 0 0 
0 0 1215.02 -1073.56 0 0 0 2007.58 0 0 0 0 0 0 0 -1301.54 0 0 -953.322 1603.82 0 0 0 0 0 0 0 0 0 0 0 0 2130.73 0 0 0 0 0 0 1468.32 0 0 0 0 0 0 0 0 0 -362.789 0 0 0 0 0 0 0.05 0 0 0 0 0 0 0 0 
0 0 0 0 0 0 0 0 0 1869.95 0 0 2282.4 0 0 0 0 0 0 0 0 0 0 -524.384 0 0 0 0 0 0 0 0 0 0 0 0 0 152.669 658.055 0 0 0 0 0 0 0 0 0 0 2303 0 2055.35 0 581.759 0 0 0 0.06 0 -1208.46 0 0 0 0 0 
0 0 0 0 0 0 0 0 0 0 -1615.73 0 0 279.626 0 0 0 0 0 0 395.291 0 0 0 0 0 0 0 0 0 0 411.771 0 0 0 299.615 0 1699.19 0 0 0 0 0 1183.13 0 0 0 0 0 0 398.953 0 0 0 0 0 0 0 0.06 0 0 0 0 0 0 
2226.86 0 0 0 1678.29 -1693.4 651.952 1982.71 0 0 0 0 0 0 0 0 0 0 0 0 0 0 -2429.81 0 0 0 0 0 0 0 0 0 0 0 0 0 0 0 0 0 0 -663.244 0 0 0 -992.691 0 0 0 0 0 0 0 0 0 0 0 390.561 0 0.02 0 490.204 1286.58 0 0 
0 0 0 -397.427 0 -1689.12 0 0 0 1233.48 -2396.85 0 0 0 1638.77 -106.128 0 0 0 0 0 0 0 0 0 0 1264.15 0 0 0 2045.88 0 0 0 0 0 0 0 -1658.15 0 0 0 0 0 0 0 0 2214.96 0 0 336.543 0 0 0 0 0 0 0 0 0 0.08 0 0 0 0 
0 0 0 2322.23 0 0 0 0 0 0 0 0 0 0 0 0 0 0 0 0 0 0 0 0 2173.15 0 0 0 1052.81 0 0 0 0 0 0 0 0 0 0 0 2041.31 0 -2433.77 0 0 0 0 1071.28 0 0 1124.68 0 0 0 0 0 0 0 0 1776.41 0 0.06 0 0 0 
1216.39 0 0 0 0 0 0 0 0 0 0 0 0 0 0 0 0 0 0 0 0 0 0 0 0 0 0 0 0 1974.78 0 0 0 0 -318.995 -797.83 0 -2006.97 0 0 0 1813.18 0 0 1875.9 0 0 0 0 2.97555 0 0 0 0 0 1502.2 0 0 0 -1829.36 0 0 0.04 0 0 
0 0 0 0 0 0 0 1435.82 0 0 0 0 0 0 0 1345.64 0 0 0 -838.878 0 0 2379.76 0 0 0 0 0 0 0 0 0 0 0 0 0 0 2091.81 0 0 0 0 0 0 0 0 1187.7 0 0 0 -1525.54 0 0 0 0 0 0 0 0 0 0 0 0 0.01 0 
0 0 0 0 0 0 0 0 0 -1544.62 0 0 0 0 0 0 0 0 0 0 0 0 0 -379.421 0 0 0 0 0 0 0 0 0 2241.2 0 0 -90.4111 0 0 0 0 0 0 -425.352 0 0 0 0 0 503.479 0 -25.1015 0 0 2091.81 0 0 0 0 0 0 0 0 0 0.07 
