*Vertices 46
*Matrix 
0.06 0 0 0 1689.73 0 0 1444.06 0 0 1816.84 0 0 0 -1329.46 1708.81 0 0 -879.009 0 0 1798.68 0 0 0 0 0 0 0 0 0 0 0 0 0 0 0 0 -170.064 0 0 589.999 0 0 0 0 
0 0.03 0 0 0 2405.85 0 0 0 0 0 0 0 0 104.297 0 0 -1205.86 0 0 0 -1264.92 0 0 1667 0 0 1330.99 0 -453.124 1901.07 1932.05 0 0 -581.301 1155.96 -2143.24 0 0 973.312 0 812.632 0 0 0 0 
0 0 0.04 350.276 0 0 0 0 0 1248.89 -608.463 -1066.85 0 0 0 0 0 0 1867.66 0 727.79 0 0 0 0 241.63 -2118.06 2237.85 -1259.42 0 0 0 0 0 0 0 0 2314.45 0 0 -396.512 0 1405.91 0 646.916 0 
0 0 2486.57 0.08 0 0 0 0 0 0 -1063.65 -2459.41 0 0 0 -964.461 0 -1931.59 0 1849.19 0 0 2125.69 0 0 0 0 1355.1 0 2447.2 0 0 -209.738 0 0 0 0 0 0 0 2179.25 1522.03 0 0 0 0 
1766.03 0 0 0 0.04 369.655 0 0 0 0 0 0 1616.34 0 0 -121.998 0 0 0 0 0 0 0 0 0 -991.623 0 -78.0511 0 -2450.25 736.03 -338.221 0 -438.932 -375.149 0 0 0 0 2459.41 0 0 0 0 0 0 
0 893.811 0 0 1124.84 0.04 0 0 0 0 0 0 0 0 0 4.0437 0 2181.39 0 0 0 13.3518 1435.67 382.473 0 -327.54 0 0 0 0 340.815 0 0 0 0 -550.478 0 1123.31 0 0 1372.19 0 0 0 0 -2125.23 
0 0 0 0 0 0 0.08 0 0 0 0 0 0 358.669 0 -975.6 0 0 1054.19 1913.74 -1671.42 -2139.12 0 0 0 0 0 0 470.367 1901.38 1316.49 -1123.92 0 1065.78 0 1939.53 0 0 0 0 0 0 1863.69 1923.66 0 0 
-1751.23 0 0 0 0 0 0 0.07 0 0 0 0 -1780.83 0 0 1160.54 0 0 0 0 0 0 0 0 0 0 1329.46 0 1506.62 2299.34 0 0 1199.15 0 -1756.42 0 0 -937.452 0 0 2030.47 0 0 0 0 0 
0 0 0 0 0 0 0 0 0.05 0 1757.33 0 0 0 0 2032.61 0 0 0 0 -352.26 0 0 0 -981.399 0 0 985.061 1808.76 -907.086 -864.818 0 0 0 0 1455.66 0 0 -1204.34 1393.55 0 0 0 0 0 0 
0 0 -19.303 0 0 0 0 0 0 0.09 0 1125.45 837.657 0 0 0 -1668.37 0 0 0 0 0 0 0 0 0 0 0 0 1479.16 2037.95 1796.85 899.609 507.141 269.25 0 0 0 0 962.63 0 0 -2247.46 0 0 -502.106 
1125.14 0 -2379.3 529.267 0 0 0 0 -1183.89 0 0.08 0 0 0 0 2408.14 0 -236.595 0 0 -642.796 1776.56 2441.1 0 0 -1271.17 0 0 0 0 0 1800.82 0 0 0 1186.79 0 0 0 0 -2317.65 567.415 0 0 0 0 
0 0 2497.86 2321.62 0 0 0 0 0 1160.85 0 0 0 0 0 0 1659.67 0 581.454 0 0 0 0 0 0 0 0 0 0 0 0 2475.28 -647.069 0 0 0 635.014 0 0 1208.3 0 0 2332 0 0 0 
0 0 0 0 2322.53 0 0 592.135 0 1977.52 0 0 0.07 -859.02 444.731 0 0 2346.8 0 0 0 1622.44 -59.8926 1453.98 0 0 1177.02 0 0 0 -2113.03 0 0 0 2448.88 0 0 -1967.3 0 0 0 0 0 0 0 0 
0 0 0 0 0 0 -1954.02 0 0 0 0 0 -1981.8 0.04 0 197.836 2301.02 1885.2 0 1326.72 0 -1209.98 0 -563.295 0 0 1214.1 0 0 0 -2491 0 0 0 0 2466.73 0 0 0 -1170.77 0 0 0 0 0 0 
518.433 128.254 0 0 0 0 0 0 0 0 0 0 2232.51 0 0.03 0 0 2058.7 0 1129.26 0 0 0 0 0 1813.03 0 0 0 0 0 0 765.328 0 0 2206.41 0 0 0 0 0 0 0 0 0 0 
-6.94296 0 0 -224.845 421.995 1798.38 2047.87 1631.14 -1572.85 0 -381.863 0 0 124.134 0 0.09 2097 0 1693.4 0 0 0 0 0 644.322 0 0 -2298.43 0 0 0 0 0 0 131.916 0 -1808.15 850.322 0 0 0 0 0 0 0 0 
0 0 0 0 0 0 0 0 0 -194.479 0 1701.94 0 2205.34 0 1598.03 0.07 0 0 0 0 -78.814 79.7296 672.246 0 0 733.436 -104.144 0 0 -1961.35 0 2327.88 -2268.06 0 0 0 0 0 0 -1322.14 179.067 1260.95 0 0 0 
0 1943.19 0 106.738 0 -2009.11 0 0 0 0 1348.54 0 1881.08 2208.7 1783.58 0 0 0.09 0 0 -1548.89 -488.983 58.6718 0 0 0 622.196 1451.54 1088.06 0 0 1477.94 0 -1767.56 -1077.07 0 0 0 0 0 0 -2455.29 0 0 0 0 
1973.4 0 -973.312 0 0 0 -754.189 0 0 0 0 1496.7 0 0 0 -2031.54 0 0 0.04 1153.52 0 0 0 1390.19 0 0 0 0 0 0 583.285 0 2020.71 0 0 0 0 0 1870.56 0 0 0 0 0 0 0 
0 0 0 -1213.34 0 0 189.901 0 0 0 0 0 0 -1090.96 -1256.68 0 0 0 1312.37 0.06 0 0 0 583.438 139.088 0 0 0 0 0 0 -2464.14 1683.94 0 845.744 0 0 0 0 0 1898.79 1534.24 0 0 0 0 
0 0 -1173.67 0 0 0 1661.35 0 543.764 0 2332.15 0 0 0 0 0 0 579.775 0 0 0.06 0 0 -1123.62 0 0 0 0 0 0 0 1768.01 0 0 0 0 0 0 0 0 0 1000.32 1747.11 0 0 0 
-801.645 497.528 0 0 0 1787.7 2024.98 0 0 0 908.612 0 986.129 -934.858 0 0 2288.35 -192.648 0 0 0 0.05 1557.13 -1637.55 0 0 0 0 0 1826.91 0 0 732.368 0 0 0 0 -1037.86 -1836.07 0 0 0 0 0 0 723.212 
0 0 0 -738.319 0 -1844.77 0 0 0 0 1464.66 0 1805.09 0 0 0 -1786.94 2076.56 0 0 0 669.347 0.07 335.78 0 -2458.34 1575.9 0 0 0 0 0 0 0 0 0 -43.7178 0 0 623.722 0 0 0 0 0 0 
0 0 0 0 0 -1683.02 0 0 0 0 0 0 2015.82 1860.48 0 0 1030.99 0 833.232 2294.61 1095.54 1654.79 1432.16 0.04 0 1544.01 0 0 0 0 0 0 412.992 2033.07 0 0 0 -654.546 0 0 0 0 -877.483 0 0 0 
0 -2460.94 0 0 0 0 0 0 -1193.96 0 0 0 0 0 0 1483.12 0 0 0 -153.89 0 0 0 0 0.04 -1432.31 0 0 0 1919.23 0 0 2152.09 0 0 2355.65 298.395 0 -1903.67 372.25 0 0 0 0 0 -1800.67 
0 0 1510.74 0 854.595 247.734 0 0 0 0 -587.252 0 0 0 -2241.97 0 0 0 0 0 0 0 -1481.9 -34.8674 1385.77 0.01 0 1392.03 0 1415.52 0 0 0 0 0 0 -774.483 946.76 0 0 0 0 259.331 0 0 0 
0 0 -1239.59 0 0 0 0 -1338.62 0 0 0 0 2238.76 1269.8 0 0 1235.77 1528.44 0 0 0 0 380.947 0 0 0 0.03 0 0 0 0 1656.93 -2378.38 -571.841 46.7696 0 0 2452.7 0 -1946.7 0 -769.143 0 0 -1884.9 0 
0 -2483.98 1471.68 -1918.62 1323.36 0 0 0 1405.15 0 0 0 0 0 0 1687.44 780.892 1819.44 0 0 0 0 0 0 0 -1413.54 0 0.04 0 0 0 0 0 0 0 0 0 0 1393.86 0 0 0 0 0 0 0 
0 0 960.036 0 0 0 1075.55 -869.854 -1502.35 0 0 0 0 0 0 0 0 -253.685 0 0 0 0 0 0 0 0 0 0 0.06 0 0 -1738.87 0 -239.189 0 0 0 1428.5 0 1979.66 0 350.581 0 0 0 0 
0 -2375.03 0 -1105.3 1524.17 0 -679.418 2021.93 256.279 -783.334 0 0 0 0 0 0 0 0 0 0 0 2176.5 0 0 -2090.29 2187.34 0 0 0 0.06 0 0 -222.404 0 2471.77 0 0 0 2022.84 0 0 0 0 0 0 0 
0 1801.13 0 0 167.776 2327.42 -1965.93 0 1435.67 1642.58 0 0 -1232.57 917.615 0 0 -1061.97 0 1585.51 0 0 0 0 0 0 0 0 0 0 0 0.05 0 0 0 -1995.68 1797.92 401.852 0 -1378.6 0 0 -378.353 0 0 782.723 0 
0 -392.85 0 0 2223.5 0 857.189 0 0 167.013 695.441 960.799 0 0 0 0 0 -2482.91 0 946.76 651.646 0 0 0 0 0 -441.527 0 2468.72 0 0 0 1073.26 0 0 2446.13 0 0 1523.56 0 0 0 0 0 0 0 
0 0 0 -1497.77 0 0 0 307.855 0 474.181 0 2394.1 0 0 1933.12 0 1085.92 0 -231.407 118.793 0 1187.25 0 1065.94 -814.615 0 497.223 0 0 1196.25 0 865.581 0.05 83.8496 0 993.149 0 0 0 1652.5 0 -578.097 0 2021.32 -360.958 0 
0 0 0 0 1448.48 0 -2156.97 0 0 716.346 0 0 0 0 0 0 2433.47 1537.45 0 0 0 0 0 2384.03 0 0 2245.17 0 548.189 0 0 0 2033.07 0.05 0 0 0 0 -1560.34 0 0 0 0 0 0 -1676.92 
0 1000.32 0 0 1669.29 0 0 2473.45 0 1645.63 0 0 -1697.52 0 0 2195.43 0 -1908.25 0 1325.5 0 0 0 0 0 0 -507.752 0 0 927.381 1892.38 0 0 0 0.02 -440.916 0 0 0 -1102.86 1711.1 0 0 0 0 0 
0 -237.358 0 0 0 238.121 -1662.42 0 1421.17 0 -1507.39 0 0 787.149 407.956 0 0 0 0 0 0 0 0 0 1838.51 0 0 0 0 0 148.396 1134.91 345.698 0 -1492.43 0 1419.49 0 0 0 2382.05 0 0 0 0 1706.52 
0 -53.0259 0 0 0 0 0 0 0 0 0 -447.478 0 0 0 -268.639 0 0 0 0 0 0 -711.005 0 65.5385 2008.19 0 0 0 0 -647.832 0 0 0 0 1074.94 0.02 0 0 0 0 2052.9 0 0 0 0 
0 0 -2147.05 0 0 -530.793 0 -940.046 0 0 0 0 1430.78 0 0 1107.44 0 0 0 0 0 2407.07 0 76.3726 0 1784.49 1198.84 0 -446.562 0 0 0 0 0 0 0 0 0.03 1034.2 0 0 0 0 2321.92 -947.371 0 
-513.398 0 0 0 0 0 0 0 -28.6111 0 0 0 0 0 0 0 0 0 -500.58 0 0 -2267.3 0 0 1144.22 0 0 -903.424 0 645.085 1343.35 573.519 0 1024.43 0 0 0 695.593 0.04 0 0 724.891 0 0 0 0 
0 2041.15 0 0 -658.361 0 0 0 1667.46 -697.577 0 783.792 0 -240.41 0 0 0 0 0 0 0 0 730.842 0 -1842.94 0 -215.537 0 -343.562 0 0 0 795.541 0 -188.223 0 0 0 0 0.07 -9.53703 0 0 0 1876.2 0 
0 0 1268.43 -2201.99 0 745.338 0 1161.61 0 0 -836.436 0 0 0 0 0 1953.41 0 0 1384.85 0 0 0 0 0 0 0 0 0 0 0 0 0 0 1622.75 1535.92 0 0 0 1121.94 0.03 -749.306 0 0 0 0 
-1558.35 986.74 0 -27.0852 0 0 0 0 0 0 -1588.72 0 0 0 0 0 -1435.06 1400.88 0 -1185.11 2137.14 0 0 0 0 0 2015.82 0 -1710.79 0 1223.41 0 769.753 0 0 0 -771.279 0 2238.61 0 674.535 0.04 0 0 -1390.8 0 
0 0 2009.87 0 0 0 1707.13 0 0 1928.85 0 385.067 0 0 0 0 1069.44 0 0 0 -903.119 0 0 772.805 0 2493.29 0 0 0 0 0 0 0 0 0 0 0 0 0 0 0 0 0.08 0 0 0 
0 0 0 0 0 0 1464.66 0 0 0 0 0 0 0 0 0 0 0 0 0 0 0 0 0 0 0 0 0 0 0 0 0 1545.23 0 0 0 0 1079.82 0 0 0 0 0 0.07 0 0 
0 0 -1694.31 0 0 0 0 0 0 0 0 0 0 0 0 0 0 0 0 0 0 0 0 0 0 0 -152.364 0 0 0 1874.07 0 148.396 0 0 0 0 2417.45 0 1416.29 0 815.836 0 0 0.07 0 
0 0 0 0 0 356.227 0 0 0 -984.756 0 0 0 0 0 0 0 0 0 0 0 331.507 0 0 2009.26 0 0 0 0 0 0 0 0 2384.49 0 616.55 0 0 0 0 0 0 0 0 0 0.04 
