*Vertices 75
*Matrix 
0.02 920.362 -1.29704 0 0 0 0 0 0 0 -1142.99 0 0 388.424 0 157.552 -989.334 0 0 0 0 -1709.57 0 0 2265.47 1771.68 0 0 1729.1 0 0 0 0 0 0 0 1500.37 0 1019.7 416.349 0 991.623 -125.813 0 0 0 0 0 -505.005 1739.02 0 0 0 -729.469 0 1051.59 -1659.22 0 0 0 0 0 0 0 0 1257.74 0 0 0 0 0 -1354.64 0 0 0 
-1805.09 0.01 0 0 0 845.592 -1099.51 393.612 1427.58 1842.63 1088.21 0 -711.768 0 0 0 0 82.6289 0 0 1143.76 0 0 0 -239.494 0 0 1443.91 0 0 1479.61 0 -1527.07 1530.27 0 0 0 -1391.72 0 63.097 1720.56 0 0 0 0 0 0 0 0 0 0 0 0 0 0 -2194.97 0 0 0 0 0 0 0 0 0 0 0 0 0 0 2135.15 0 0 0 0 
-551.241 0 0.06 0 -1550.26 0 0 0 -341.121 0 0 0 0 0 0 1858.65 0 -1699.04 0 1403.62 0 2286.07 0 0 -393.46 0 -1344.42 0 0 0 0 0 0 2260.89 -676.366 0 2416.99 0 0 -1426.36 0 1282.46 0 0 0 0 0 0 -1010.54 0 0 0 0 1548.59 0 0 0 776.009 0 0 2059.92 0 0 0 0 0 0 0 0 0 0 850.932 0 0 0 
0 0 0 0.05 0 -849.101 0 2077.01 0 0 0 0 0 0 0 0 0 -1905.8 0 0 0 -1058 0 0 0 134.663 71.4896 -586.947 0 -817.057 0 0 0 2368.77 2388.45 0 0 0 0 0 0 0 2248.68 0 0 0 0 0 0 0 1358.15 -673.162 -271.233 477.081 0 0 0 0 0 0 1464.66 -1224.17 0 0 0 0 0 0 0 0 0 0 0 0 0 
0 0 355.617 0 0.04 0 0 0 0 0 0 0 0 0 0 0 471.435 0 0 1708.5 0 1916.03 0 0 0 -1918.01 0 0 0 0 2420.8 0 0 0 0 0 0 0 0 -383.389 -980.026 844.218 -1635.72 0 0 0 -1133.69 0 0 0 -286.645 -171.896 906.934 0 0 0 0 0 0 0 0 0 0 0 0 0 0 -2291.71 0 1120.11 0 0 0 0 0 
0 -1145.89 0 -1070.51 0 0.08 0 0 0 0 0 0 -493.408 1585.97 0 0 0 1.14444 0 0 2128.28 529.725 0 5.41704 0 0 0 0 -2279.5 0 0 0 318.232 2071.37 0 0 1007.95 -377.743 0 0 -466.552 0 2098.83 0 0 0 0 2249.44 0 -412.381 0 0 1444.06 0 2196.49 1122.39 0 0 0 0 0 0 0 -569.857 0 0 0 -419.095 0 2233.88 0 0 0 0 -424.741 
0 -44.7859 0 0 0 0 0.05 1629 285.882 -1098.74 0 2367.4 0 0 0 0 -226.371 0 0 0 2048.48 0 -401.852 0 0 2299.95 0 0 0 0 0 331.965 0 1926.71 0 1455.66 0 -562.075 0 0 1390.19 0 0 0 0 906.018 730.842 1227.38 -2467.19 0 0 -1430.33 0 0 0 0 -481.201 0 0 0 0 0 0 0 0 0 0 0 0 0 0 0.381481 0 0 -1900.92 
0 1896.34 0 1794.87 0 0 1424.68 0.03 0 0 1957.08 0 0 -510.651 625.706 0 0 -1783.73 1676.15 0 0 2094.1 0 0 0 0 0 -1146.96 525.452 0 0 0 -44.9385 0 0 -2462.31 0 -427.335 0 0 0 0 -116.047 0 0 -280.541 0 0 0 0 0 0 0 0 0 0 0 0 0 0 0 0 0 0 1037.1 0 0 0 0 0 0 0 0 0 0 
0 2136.07 1280.79 0 0 0 -1091.27 0 0.05 0 0 0 -309.992 0 0 0 1679.36 0 0 0 0 927.686 -1437.35 72.1 0 1105.15 0 0 0 -2407.68 0 0 0 0 0 0 2464.29 0 0 2028.64 -1201.28 1465.12 0 0 0 0 -2022.39 0 0 0 0 0 -1576.2 0 0 0 0 0 -631.657 0 0 0 0 0 1785.71 0 0 0 0 -748.238 0 0 0 0 0 
0 248.192 0 0 0 0 -616.55 0 0 0.07 0 0 456.481 0 0 -466.247 0 0 2266.53 0 0 0 335.475 0 -2407.83 1827.07 347.224 0 -1105.76 0 -55.4674 0 0 0 0 0 1760.38 0 0 0 1545.84 2237.85 0 0 0 1474.88 623.112 -2136.68 0 0 2080.68 0 1818.06 0 0 0 0 0 0 0 0 0 0 0 0 0 0 0 0 0 0 0 0 0 0 
659.276 445.647 0 0 0 0 0 161.977 0 0 0.06 0 0 848.033 0 0 0 0 0 1082.11 0 0 0 0 0 0 0 2307.89 0 0 0 -1559.42 1483.89 1624.73 425.962 0 0 0 0 0 0 2194.2 0 -138.478 0 0 0 0 2360.23 0 0 0 0 0 0 0 0 0 0 0 85.0703 0 0 0 0 0 0 0 0 0 0 0 0 545.442 0 
0 0 0 0 0 0 -1728.49 0 0 0 0 0.06 0 0 1525.85 0 1444.21 0 2005.45 -243.767 0 0 0 -2471.77 0 -256.127 0 -1058.92 0 0 0 1507.69 0 0 0 0 0 -1364.41 -1622.75 0 -651.799 747.78 2404.93 -532.014 1142.54 0 2078.08 0 -536.286 1295.59 1602.91 0 0 0 0 0 0 2262.72 0 0 0 0 -1401.03 0 0 0 0 0 0 -1505.55 0 0 0 0 0 
0 -215.995 0 0 0 2296.44 0 0 -442.289 1074.02 0 0 0.04 0 1503.72 1776.56 0 0 0 0 1147.57 307.703 0 625.248 0 0 1052.35 -1169.85 0 0 0 0 0 0 -1771.98 0 -962.63 0 0 0 0 0 0 -1385.31 0 0 1600.92 0 0 733.894 2268.36 928.602 0 0 0 0 0 0 0 0 0 0 0 0 129.322 0 0 0 0 0 0 0 0 0 0 
1947.16 0 0 0 0 736.641 0 915.021 0 0 145.497 0 0 0.02 0 1532.87 328.15 0 0 1517 -1493.8 0 0 0 0 226.066 163.198 -2081.13 0 0 -862.987 -2472.38 -2342.98 0 0 1695.23 0 1985.15 0 0 0 0 1469.08 0 0 1577.43 1644.87 617.924 0 1382.26 1281.09 0 0 0 0 0 0 0 0 0 0 0 0 0 -2161.85 0 0 0 0 0 0 0 0 0 0 
0 0 0 0 0 0 0 1231.65 0 0 0 -564.669 427.641 0 0.05 0 0 0 0 377.438 0 0 0 0 0 0 0 -2351.22 0 0 -295.19 0 0 0 174.184 1541.26 0 258.873 0 0 0 707.953 1619.85 341.731 0 0 0 0 0 0 -1069.14 0 575.503 2192.98 0 0 0 0 0 607.242 0 0 0 -1502.96 0 0 0 0 0 0 1821.42 0 0 559.175 0 
567.415 0 1613.74 0 0 0 0 0 0 445.952 0 0 -862.835 -1437.5 0 0.06 0 0 0 0 0 926.008 718.482 -590.152 0 0 1163.9 0 0 0 -1222.95 710.7 0 0 1891.16 1704.69 0 -2003.31 0 0 0 0 0 -2354.88 0 0 0 0 0 2345.42 0 0 0 0 0 0 0 0 0 0 0 0 0 0 0 0 0 0 0 0 0 0 0 0 0 
1615.57 0 0 0 -231.864 0 -852 0 -628.452 0 0 -1165.12 0 2120.96 0 0 0.07 0 61.5711 0 -918.073 0 0 -1593.3 0 0 0 0 0 -2273.55 0 0 0 0 0 0 0 -115.589 2316.58 0 0 0 0 0 0 0 2384.79 0 0 1442.38 0 1123.77 -166.707 0 0 1921.67 2489.01 2235.86 -1999.19 -254.753 0 0 0 0 0 0 0 0 0 0 0 2029.4 0 0 0 
0 1427.12 570.467 -1775.49 0 2049.24 0 1424.07 0 0 0 0 0 0 0 0 0 0.07 0 0 0 0 797.83 0 -600.528 0 0 0 239.494 0 0 488.372 0 0 0 0 -1459.01 0 0 2107.23 2371.36 0 0 0 1765.88 0 0 0 0 0 0 0 0 1812.57 0 0 0 0 0 -1436.43 0 0 0 0 0 728.248 1671.58 0 0 0 0 0 -1750.62 0 0 
0 0 0 0 0 0 0 2455.44 0 1313.44 0 -2223.04 0 0 0 0 557.955 0 0.05 0 0 0 0 0 498.901 165.792 0 0 0 0 0 0 -1848.43 0 2164.45 0 0 -243.767 0 0 0 2209.92 0 0 2252.95 0 0 0 0 2278.74 0 0 0 -198.599 1386.84 0 0 0 0 0 0 0 0 0 0 0 0 0 0 0 -14.1148 0 1797.31 0 -1383.94 
0 0 101.856 0 426.725 0 0 0 0 0 908.155 304.804 0 1829.2 -1188.62 0 0 0 0 0.05 0 -663.396 538.575 0 2402.34 0 0 0 0 0 0 0 0 0 0 0 -2260.43 0 0 0 0 0 0 0 0 0 0 0 0 467.62 0 0 2154.84 0 -108.722 693.915 0 821.94 0 0 0 0 0 0 0 0 0 0 0 0 -1556.22 0 0 0 0 
0 2288.35 0 0 0 -421.995 -432.218 0 0 0 0 0 1325.04 -8.77407 0 0 -1237.75 0 0 0 0.08 -43.8704 0 1470.46 0 0 0 0 0 0 0 1441.77 0 0 0 0 0 0 -177.694 0 1918.16 0 0 0 0 0 -1350.83 0 -2409.36 -1953.57 0 0 0 0 2479.55 0 0 1054.64 0 0 0 0 0 -1943.19 0 0 0 0 0 0 0 0 0 0 0 
1699.35 0 1173.21 2147.66 -874.126 -2457.43 0 1779.61 -293.97 0 0 0 -1171.07 0 0 1413.54 0 0 0 741.371 -1164.97 0.08 0 0 0 0 0 0 1012.68 0 228.202 0 0 0 2434.39 0 0 0 0 0 0 245.598 0 0 0 900.677 0 0 1693.4 2164.75 0 0 0 0 0 0 1289.94 0 0 0 0 0 0 0 -2391.35 0 -891.675 0 0 0 0 1707.43 0 0 0 
0 0 0 0 0 0 1804.79 0 918.836 -2470.7 0 0 0 0 0 -326.014 0 1521.73 0 217.826 0 0 0.06 1791.67 -588.473 0 0 0 0 0 288.781 933.79 0 1866.28 0 0 0 0 0 0 -342.647 1047.93 -1956.47 0 0 -973.006 324.641 0 -123.066 0 0 0 2332.15 0 2015.37 0 0 0 0 0 0 0 0 0 0 0 0 0 0 0 0 0 0 0 0 
0 0 0 0 0 -2275.69 0 0 405.057 0 0 426.115 1665.78 0 0 2134.24 1598.64 0 0 0 1808.3 0 1581.7 0.04 0 0 1541.87 389.492 0 0 -1670.35 0 0 0 0 1396.3 1838.21 0 0 -264.824 0 0 0 0 2222.43 0 0 -2216.94 0 2346.95 0 0 0 0 0 0 0 0 0 0 0 0 2428.13 0 0 0 2442.78 0 0 0 0 0 0 0 0 
1427.12 -1008.1 -1232.87 0 0 0 0 0 0 1621.98 0 0 0 0 0 0 0 290.765 -2441.4 1538.21 0 0 -1106.68 0 0.03 0 0 0 0 1356.32 0 0 0 0 270.928 0 0 528.809 0 0 0 0 0 0 0 1489.23 1882.46 0 0 0 0 1341.36 0 990.402 0 586.489 0 0 0 0 0 0 0 0 0 0 0 0 0 0 -1996.75 -1167.1 0 0 0 
1916.33 0 0 -746.254 120.624 0 -716.193 0 215.995 433.897 0 -406.125 0 416.044 0 0 0 0 -933.943 0 0 0 0 0 0 0.07 1773.35 0 -1880.47 0 1401.64 0 0 1469.39 0 0 -1111.41 0 0 0 0 -11.3681 320.063 0 0 0 0 2385.25 0 0 1610.84 -2337.49 -1739.78 0 0 0 0 1358 0 0 1320.46 0 0 0 0 0 0 0 0 1622.29 0 0 0 0 -1549.65 
0 0 899.457 2471.92 0 0 0 0 0 -585.727 0 0 347.835 -1474.88 0 -1042.59 0 0 0 0 0 0 0 2049.7 0 2000.72 0.01 1516.69 0 0 0 1389.89 0 0 0 0 0 0 0 0 1981.34 0 0 0 0 0 1426.05 0 0 0 0 -2329.71 0 0 810.953 0 0 0 0 0 0 0 0 1648.23 -1782.05 0 0 0 -1298.64 0 0 0 0 0 0 
0 -470.977 0 -1205.56 0 0 0 1746.65 0 0 216.91 -1409.73 1327.17 73.3207 2367.4 0 0 0 0 0 0 0 0 -1875.59 0 0 938.368 0.03 0 2183.68 2300.71 0 0 0 1998.58 0 0 0 0 2184.59 0 0 2362.21 -922.956 0 -2180.32 0 0 444.121 2486.42 -2238 0 0 0 1114.61 0 0 0 0 0 0 0 1210.9 0 0 0 0 0 -1492.58 0 0 1383.63 0 0 0 
1278.19 0 0 0 0 841.319 0 -777.078 0 -241.478 0 0 0 0 0 0 0 1977.22 0 0 0 -451.903 0 0 0 1544.01 0 0 0.01 0 0 0 1901.99 0 0 -1539.58 0 0 -1825.69 2339.78 -730.689 2451.78 0 0 0 0 0 0 0 -1820.35 0 0 0 0 0 412.076 0 0 0 0 0 0 0 0 0 0 1175.8 0 0 -1430.78 0 0 0 0 0 
0 0 0 1780.68 0 0 0 0 -550.783 0 0 0 0 0 0 0 351.955 0 0 0 0 0 0 0 -186.544 0 0 1218.68 0 0.05 1423 0 0 0 0 0 364.01 0 0 0 1088.82 0 0 0 0 0 1521.73 605.564 2298.73 -340.052 0 0 0 -465.941 0 -1720.86 0 0 0 0 -1377.38 0 0 0 0 0 0 1400.57 0 0 0 0 0 0 0 
0 668.432 0 0 1227.38 0 0 0 0 1053.12 0 0 0 -568.941 633.335 1304.44 0 0 0 0 0 9.23185 -713.446 6.33259 0 1607.94 0 1851.79 0 1124.84 0 2100.51 0 0 0 0 0 0 0 0 0 0 0 -2498.02 0 454.955 0 0 0 0 0 0 0 0 0 0 13.5044 0 0 0 0 0 0 528.352 0 2489.78 0 0 0 0 0 0 0 0 0 
0 0 0 0 0 0 1425.44 0 0 0 2151.63 -1214.87 0 311.212 0 -1648.84 0 1604.43 0 0 1202.66 0 -1679.51 0 0 0 253.227 0 0 0 2225.03 0.09 0 0 155.11 0 0 0 0 0 0 0 -1037.55 1700.11 0 0 0 421.69 0 0 0 0 0 1761.91 0 0 0 0 0 0 0 0 0 0 0 0 -1986.83 781.198 0 0 483.032 0 0 0 0 
0 576.266 0 0 0 2393.49 0 1789.22 0 0 454.65 0 0 -2034.14 0 0 0 0 2314.75 0 0 0 0 0 0 0 0 0 1467.71 0 0 0 0.04 0 0 0 1746.19 61.4185 0 0 0 1536.84 -321.131 0 0 0 0 0 0 0 0 2221.67 0 0 0 0 0 0 0 0 0 0 0 -1133.08 0 0 0 0 0 0 0 0 0 0 0 
0 -727.943 226.218 1879.71 0 1017.56 -1173.51 0 0 0 1348.99 0 0 0 0 0 0 0 0 0 0 0 1420.26 0 0 503.937 0 0 0 0 0 0 0 0.06 -289.239 1860.03 0 0 490.204 0 0 0 0 -165.944 0 0 0 0 0 0 0 0 0 0 0 0 645.848 0 2282.56 0 0 0 0 0 0 1752.6 0 0 0 0 0 0 2204.58 0 0 
0 0 1570.41 -1410.49 0 0 0 0 0 0 -2010.03 0 26.3222 0 1939.38 -2004.38 0 0 192.801 0 0 1496.09 0 0 1708.81 0 0 -460.143 0 0 0 -381.405 0 -1461.15 0.01 0 0 0 0 0 0 0 -1298.33 0 0 1793.8 0 0 0 0 0 0 0 950.423 -433.439 0 0 0 0 0 0 0 1773.05 0 0 0 0 0 0 0 1635.26 0 0 2100.67 0 
0 0 0 0 0 0 -1889.17 2395.47 0 0 0 0 0 1765.72 339.747 950.575 0 0 0 0 0 0 0 -1715.22 0 0 0 0 -2081.29 0 0 0 0 1466.49 0 0.08 0 0 0 0 0 0 0 0 -1949.75 0 0 93.1578 0 0 -367.672 0 0 0 0 1555.3 0 0 0 -162.435 0 -534.913 0 0 0 0 0 0 0 0 0 0 675.909 0 0 
-127.338 0 336.848 0 0 52.4155 0 0 1918.93 1910.54 0 0 -1975.84 0 0 0 0 970.717 0 -2270.04 0 0 0 -484.1 0 2378.99 0 0 0 2148.43 0 0 1485.56 0 0 0 0.04 2200 0 1399.96 2303.16 0 0 0 0 0 -36.0881 0 0 -1565.83 1040.6 1716.59 0 0 0 -593.966 297.174 0 0 0 0 -1324.88 0 0 0 0 52.4155 0 0 0 0 0 0 0 0 
0 1549.5 0 0 0 -761.971 -508.972 182.424 0 0 0 -1609.16 0 2183.22 888.775 2266.53 1574.68 0 605.564 0 0 0 0 0 570.315 0 0 0 0 0 0 0 717.261 0 0 0 -1265.68 0.07 0 0 0 0 487.457 0 0 0 0 250.175 0 121.235 0 0 0 2107.23 0 0 0 0 0 0 0 0 0 0 0 0 0 0 0 0 1023.51 0 0 0 0 
-959.273 0 0 0 0 0 0 0 0 0 0 1693.4 0 0 0 0 -1677.83 0 0 0 1678.75 0 0 0 0 0 0 0 1492.28 0 0 0 0 2206.87 0 0 0 0 0.03 0 -1187.4 0 0 0 0 0 -1544.92 0 1841.41 0 0 1417.97 0 0 0 0 0 -1327.94 1770.46 0 0 1881.54 0 0 0 0 0 0 0 0 0 0 0 0 0 
-1695.38 641.27 541.932 0 -380.947 0 0 0 -757.851 0 0 0 0 0 0 0 0 -1351.44 0 0 0 0 0 1682.56 0 0 0 1932.66 1994.46 0 0 0 0 0 0 0 1567.2 0 0 0.02 -9.23185 0 -727.485 44.3281 671.789 -20.9815 0 0 2135.3 0 0 2394.41 0 0 0 1058.15 0 132.679 0 0 0 0 0 30.5948 0 0 0 0 0 0 0 0 1228.6 0 0 
0 1606.11 0 0 12.4363 2484.74 2487.03 0 -1863.69 2091.36 0 117.725 0 0 0 0 0 -1366.85 0 0 2031.54 0 -1375.7 0 0 0 1024.12 0 1385.62 1077.84 0 0 0 0 0 0 -2255.55 0 2076.71 1363.34 0.04 0 0 784.555 0 0 -1847.97 0 0 0 0 0 -2127.52 0 0 0 0 1752.91 -2231.74 0 0 0 2236.17 0 0 0 1812.42 0 0 0 0 0 1451.69 0 0 
1660.28 0 898.694 0 -618.686 0 0 0 1712.93 -793.71 767.006 1316.8 0 0 302.21 0 0 0 1961.5 0 0 -45.3963 974.532 0 0 -387.356 0 0 -374.538 0 0 0 1664.25 0 0 0 0 0 0 0 0 0.08 0 0 0 0 0 0 0 0 0 0 0 0 0 1109.73 0 2460.02 0 0 0 -733.741 0 1882.92 0 0 0 0 0 0 0 0 -1626.26 0 0 
-1628.39 0 0 1782.66 477.538 2300.41 0 225.15 0 0 0 84.1548 0 1984.69 977.432 0 0 0 0 0 0 0 -1529.51 0 0 -243.156 0 1662.88 0 0 0 1792.12 -1075.85 0 2452.85 0 0 1436.12 0 198.752 0 0 0.07 1398.59 0 0 0 0 -37.6141 0 0 0 170.827 0 1429.72 -294.733 0 0 0 0 0 679.876 0 2157.12 0 0 0 0 0 0 0 0 0 0 0 
0 0 0 0 0 0 0 0 0 0 -916.7 -234.153 1472.59 0 360.958 -788.522 0 0 0 0 0 0 0 0 0 0 0 1929 0 0 258.263 2287.13 0 545.289 0 0 0 0 0 -446.257 135.731 0 1538.21 0.05 888.928 0 0 0 0 0 0 0 0 0 0 -1811.35 0 0 0 0 0 0 0 0 0 0 0 0 0 0 -1930.37 0 0 0 0 
0 0 0 0 0 0 0 0 0 0 0 -834.91 0 0 0 0 0 1783.12 952.406 0 0 0 0 -2001.48 0 0 0 0 0 0 0 0 0 0 0 -1121.02 0 0 0 1501.43 0 0 0 2422.48 0.01 0 0 0 0 0 0 2255.7 0 0 0 0 0 0 0 0 0 0 0 0 0 0 944.929 0 0 0 0 0 313.044 0 0 
0 0 0 0 0 0 1970.96 -1195.94 0 2329.1 0 0 0 530.793 0 0 0 0 0 0 0 -2192.98 -177.847 0 -2025.28 0 0 1916.18 0 0 1901.53 0 0 0 894.116 0 0 0 0 -1394.92 0 0 0 0 0 0.06 0 0 0 1408.66 -521.79 0 0 0 0 0 0 0 0 0 0 0 0 0 0 0 0 0 0 0 0 0 0 0 0 
0 0 0 0 888.928 0 2328.79 0 302.667 1562.62 0 -2181.69 518.738 -1689.89 0 0 555.666 0 0 0 -500.58 0 2258.14 0 -694.678 0 1767.86 0 0 -1075.7 0 0 0 0 0 0 1788.61 0 -942.64 0 -558.87 0 0 0 0 0 0.02 0 0 0 0 0 0 0 0 0 2422.18 0 0 0 0 0 0 0 0 0 0 0 0 0 0 0 0 0 0 
0 0 0 0 0 1023.51 464.873 0 0 1807.84 0 0 0 -84.9178 0 0 0 0 0 0 0 0 0 1686.99 0 442.289 0 0 0 1867.35 0 910.443 0 0 0 -611.515 0 633.03 0 0 0 0 0 0 0 0 0 0.08 -289.392 -480.895 0 0 0 0 0 0 0 0 0 501.648 0 0 0 0 0 0 0 0 0 0 0 0 0 0 0 
-58.6718 0 -2319.79 0 0 0 1986.22 0 0 0 -1071.73 1510.28 0 0 0 0 0 0 0 0 323.115 2308.19 2202.14 0 0 0 0 1738.11 0 -1169.24 0 0 0 0 0 0 0 0 -1492.89 1427.12 0 0 1103.32 0 0 0 0 -504.089 0.05 0 0 0 821.94 0 0 0 0 0 0 0 200.735 0 0 0 -1836.68 0 0 0 0 0 0 0 0 0 0 
292.291 0 0 0 0 335.475 0 0 0 0 0 1128.5 -2165.06 48.4481 0 2105.09 1984.85 0 -2430.72 169.759 -218.589 199.21 0 276.116 0 0 0 1424.99 -613.804 -421.842 0 0 0 0 0 0 -1293.76 976.821 0 0 0 0 0 0 0 2056.72 0 514.466 0 0.01 0 0 0 0 0 0 0 0 0 0 0 0 0 0 0 0 0 0 0 0 0 0 -384.152 0 0 
0 0 0 1824.93 -268.029 0 0 0 0 -1342.59 0 -892.438 399.411 2212.97 2042.68 0 0 0 0 0 0 0 0 0 0 1701.94 0 -948.134 0 0 0 0 0 0 0 261.773 2217.7 0 0 0 0 0 0 0 0 -227.134 0 0 0 0 0.01 0 0 -2374.57 0 -829.417 0 0 0 0 0 0 0 0 0 0 798.135 0 -2197.87 0 1137.65 2412.72 0 0 0 
0 0 0 2100.05 -1922.13 0 -282.983 0 0 0 0 0 -7.55333 0 0 0 1517.46 0 0 0 0 0 0 0 2411.34 2449.03 -2092.88 0 0 0 0 0 532.167 0 0 0 2082.66 0 1200.67 -2107.38 0 0 0 0 108.112 0 0 0 0 0 0 0.09 0 -479.522 0 0 0 0 0 0 0 0 0 0 0 0 0 0 0 0 0 0 1974.93 0 0 
0 0 0 -481.201 75.7622 2416.84 0 0 2398.22 1902.91 0 0 0 0 869.396 0 -690.558 0 0 -436.033 0 0 -137.41 0 0 851.39 0 0 0 0 0 0 0 0 0 0 0 0 0 0 -970.107 0 2408.29 0 0 0 0 0 890.912 0 0 0 0.08 0 0 0 621.128 0 0 0 0 0 0 -752.052 0 0 0 286.645 0 0 0 0 0 0 0 
-59.1296 0 1434.45 2017.04 0 0 0 0 0 0 0 0 0 0 -1027.33 0 0 697.119 -1388.52 0 0 0 0 0 886.792 0 0 0 0 -2050.46 0 -481.506 0 0 1270.41 0 0 2344.05 0 0 0 0 0 0 0 0 0 0 0 0 689.184 1602.76 0 0.03 0 0 0 0 0 0 0 0 0 0 0 0 0 0 0 -731.91 0 0 0 0 -1203.88 
0 0 0 0 0 1722.39 0 0 0 0 0 0 0 0 0 0 0 0 304.956 2141.41 -310.602 0 261.162 0 0 0 -836.131 2336.27 0 0 0 0 0 0 -2189.63 0 0 0 0 0 0 0 1684.24 0 0 0 0 0 0 0 0 0 0 0 0.08 2384.49 0 0 0 -1287.65 0 0 0 0 0 2298.58 1936.17 0 0 0 0 1959.06 0 0 0 
-884.808 114.673 0 0 0 -2105.85 0 0 0 0 0 0 0 0 0 0 -1301.84 0 0 2042.83 0 0 0 0 2293.69 0 0 0 2473.75 -1667.3 0 0 0 0 0 2483.06 959.12 0 0 -2095.02 0 -298.395 -188.528 824.686 0 0 0 0 0 0 1974.17 0 0 0 1114.76 0.08 0 0 0 0 0 0 0 0 1440.4 0 0 0 -1790.6 0 0 0 0 595.492 0 
1531.19 0 0 0 0 0 1548.74 0 0 0 0 0 0 0 0 0 238.121 0 0 0 0 -633.03 0 0 0 0 0 0 0 0 1818.52 0 0 1952.19 0 0 1318.63 0 0 0 0 0 0 0 0 0 254.753 0 0 0 0 0 434.202 0 0 0 0.03 0 0 0 0 0 0 0 0 0 0 0 0 0 0 360.347 0 0 0 
0 0 -460.295 0 0 0 0 0 0 0 0 2123.1 0 0 0 0 -1597.72 0 0 1303.83 -233.848 0 0 0 0 -310.907 0 0 0 0 0 0 0 0 0 0 0 0 154.5 1497.92 1054.95 1675.08 0 0 0 0 0 0 0 0 0 0 0 0 0 0 0 0 0 0 0 0 0 0 0 0 0 0 0 0 0 0 0 0 0 
0 0 0 0 0 0 0 0 550.172 0 0 0 0 0 0 0 2464.29 0 0 0 0 0 0 0 0 0 0 0 0 0 0 0 0 -1234.24 0 0 0 0 -302.515 0 1303.83 0 0 0 0 0 0 0 0 0 0 0 0 0 0 0 0 0 0 0 0 0 0 0 0 0 0 0 0 0 -165.181 0 0 190.664 0 
0 0 0 0 0 0 0 0 0 0 0 0 0 0 -320.521 0 -790.963 -946.455 0 0 0 0 0 0 0 0 0 0 0 0 0 0 0 0 0 1139.94 0 0 0 0 0 0 0 0 0 0 0 794.473 0 0 0 0 0 0 370.724 0 0 0 0 0.05 0 0 0 0 0 0 0 0 0 203.787 1167.26 0 0 0 0 
0 0 514.008 2179.86 0 0 0 0 0 0 2221.52 0 0 0 0 0 0 0 0 0 0 0 0 0 0 -2049.55 0 0 0 -556.276 0 0 0 0 0 0 0 0 0 0 0 0 0 0 0 0 0 0 1144.83 0 0 0 0 0 0 0 0 0 0 0 0.04 1842.63 0 -314.112 0 0 0 1540.35 0 0 0 0 979.72 0 0 
0 0 0 2474.06 0 0 0 0 0 0 0 0 0 0 0 0 0 0 0 0 0 0 0 0 0 0 0 0 0 0 0 0 0 0 0 -113.91 -2277.06 0 1096.61 0 0 2019.64 -1193.2 0 0 0 0 0 0 0 0 0 0 0 0 0 0 0 0 0 454.344 0.07 208.518 0 0 0 0 0 0 0 0 0 0 -358.211 0 
0 0 0 0 0 0 0 0 0 0 0 -999.71 0 0 0 0 0 0 0 0 0 0 0 -759.682 0 0 0 1823.71 0 0 0 0 0 0 -933.943 0 0 0 0 0 1140.71 0 0 0 0 0 0 0 0 0 0 0 0 0 0 0 0 0 0 0 0 1498.69 0.02 0 0 0 0 0 0 2055.19 0 -2238.91 834.758 0 0 
0 0 0 0 0 2289.42 0 0 0 0 0 0 0 0 302.057 0 0 0 0 0 -119.556 0 0 0 0 0 1528.9 0 0 0 2392.88 0 -709.784 0 0 0 0 0 0 -369.655 0 915.326 -1824.93 0 0 0 0 0 0 0 0 0 -1059.68 0 0 0 0 0 0 0 745.186 0 0 0.04 0 0 0 0 0 0 0 0 0 0 2395.02 
0 0 0 0 0 0 0 -704.443 -153.279 0 0 0 486.236 1037.71 0 0 0 0 0 0 0 666.753 0 0 0 0 -2307.28 0 0 0 0 0 0 0 0 0 0 0 0 0 0 0 0 0 0 0 0 0 880.078 0 0 0 0 0 0 1812.27 0 0 0 0 0 0 0 0 0.05 0 0 0 0 0 0 0 0 0 0 
545.595 0 0 0 0 0 0 0 0 0 0 0 0 0 0 0 0 -1628.85 0 0 0 0 0 0 0 0 0 0 0 0 -2400.2 0 0 855.815 0 0 0 0 0 0 0 0 0 0 0 0 0 0 0 0 0 0 0 0 1942.58 0 0 0 0 0 0 0 0 0 0 0.01 652.409 0 1005.97 0 0 0 0 0 0 
0 0 0 0 0 0 0 0 0 0 0 0 0 0 0 0 0 -356.227 0 0 0 1867.81 0 -445.494 0 0 0 0 268.487 0 0 -2419.28 0 0 0 0 2108.29 0 0 0 1516.39 0 0 0 2024.83 0 0 0 0 0 -1480.22 0 0 0 -1199.15 0 0 0 0 0 0 0 0 0 0 1589.79 0.07 0 0 0 0 0 0 0 0 
0 0 0 0 -1886.58 -124.287 0 0 0 0 0 0 0 0 0 0 0 0 0 0 0 0 0 0 0 0 0 0 0 2381.89 0 -2464.29 0 0 0 0 0 0 0 0 0 0 0 0 0 0 0 0 0 0 0 0 2146.44 0 0 0 0 0 0 0 1919.69 0 0 0 0 0 0 0.06 0 0 0 0 0 1270.1 0 
0 0 0 0 0 0 0 0 0 0 0 0 0 0 0 0 0 0 0 0 0 0 0 0 0 0 945.692 1650.98 0 0 0 0 0 0 0 0 0 0 0 0 0 0 0 0 0 0 0 0 0 0 1345.64 0 0 0 0 266.198 0 0 0 0 0 0 0 0 0 -1671.73 0 0 0.07 0 0 0 0 0 0 
0 0 0 0 -53.3311 1367 0 0 -534.608 0 0 -440.153 0 0 0 0 0 0 0 0 0 0 0 0 0 1506.16 0 0 1496.7 0 0 0 0 0 0 0 0 0 0 0 0 0 0 0 0 0 0 0 0 0 0 0 0 -2317.35 0 0 0 0 0 -1852.7 0 0 1703.77 0 0 0 0 0 0 0.06 0 0 -1478.39 0 -552.004 
0 -2461.55 0 0 0 0 0 0 0 0 0 0 0 0 -537.049 0 0 0 1547.67 108.57 0 0 0 0 -2365.72 0 0 0 0 0 0 1654.48 0 0 2293.54 0 0 -2006.21 0 0 0 0 0 253.075 0 0 0 0 0 0 2072.74 0 0 0 0 0 0 0 1585.36 1849.96 0 0 0 0 0 0 0 0 0 0 0 0 0 0 -1367.61 
1632.82 0 1414 0 0 0 593.661 0 0 0 0 0 0 0 0 0 226.676 0 0 0 0 -287.713 0 0 -1871.93 0 0 -1491.21 0 0 0 0 0 0 0 0 0 0 0 0 0 0 0 0 0 0 0 0 0 0 1835.46 0 0 0 534.303 0 2206.87 0 0 0 0 0 1181.91 0 0 0 0 0 0 0 0 0.07 0 0 0 
0 0 0 0 0 0 0 0 0 0 0 0 0 0 0 0 0 1457.79 1018.17 0 0 0 0 0 0 0 0 0 0 0 0 0 0 -1035.87 0 2276.45 0 0 0 2425.38 1766.79 1168.02 0 0 -378.048 0 0 0 0 -932.875 0 1862.47 0 0 0 0 0 0 0 0 -1889.78 0 -758.309 0 0 0 0 0 0 -1873.61 0 0 0.03 0 0 
0 0 0 0 0 0 0 0 0 0 -950.117 0 0 0 286.34 0 0 0 0 0 0 0 0 0 0 0 0 0 0 0 0 0 0 0 1649.3 0 0 0 0 0 0 0 0 0 0 0 0 0 0 0 0 0 0 0 0 -569.857 0 0 2128.13 0 0 1145.74 0 0 0 0 0 -1398.13 0 0 0 0 0 0.09 0 
0 0 0 0 0 37.7667 -297.479 0 0 0 0 0 0 0 0 0 0 0 -1809.82 0 0 0 0 0 0 1449.71 0 0 0 0 0 0 0 0 0 0 0 0 0 0 0 0 0 0 0 0 0 0 0 0 0 0 0 497.681 0 0 0 0 0 0 0 0 0 -704.291 0 0 0 0 0 30.2896 1600.77 0 0 0 0.07 
