*Vertices 59
*Matrix 
0.07 0 0 0 0 0 0 0 0 -120.319 295.495 0 0 0 0 1005.66 0 0 0 0 0 0 0 0 2299.65 0 2343.59 619.449 0 0 0 0 0 0 2113.64 0 0 0 0 0 0 0 0 -241.63 0 0 0 0 0 0 0 0 0 -153.737 0 0 0 0 0 
0 0.08 0 0 0 -312.281 0 0 0 0 0 0 0 0 0 0 0 0 0 -1173.06 0 -1428.34 0 2340.69 0 0 0 0 0 0 0 -404.752 0 0 0 0 0 1272.09 -2429.35 0 0 0 0 0 0 0 0 2094.87 0 0 0 0 0 0 0 0 0 0 0 
0 0 0.01 0 877.636 300.226 0 1325.8 0 0 0 0 0 0 0 0 0 0 0 0 0 0 0 0 0 1113.54 0 0 0 0 0 0 0 0 0 0 0 0 0 0 0 0 0 0 0 0 0 0 0 0 0 0 0 0 0 0 0 0 0 
0 0 0 0.03 0 0 0 0 0 0 0 0 0 0 -2085.1 0 0 2434.23 0 0 0 0 0 2330.77 0 0 0 0 0 0 0 0 0 0 0 0 235.984 33.9518 0 0 0 0 0 0 0 0 0 0 0 0 0 0 0 0 0 0 0 0 0 
0 0 -418.943 0 0.09 0 0 1624.88 0 0 0 -253.685 -1373.26 0 0 0 1203.12 2368.77 0 0 0 0 0 0 0 0 0 0 0 0 0 0 0 0 0 0 0 0 0 -1038.93 0 0 0 0 0 0 0 0 337.611 0 0 0 0 0 0 0 0 0 0 
0 1642.74 -1792.73 0 0 0.02 0 0 0 0 -1344.87 0 0 1710.18 0 0 1681.19 913.343 0 0 0 0 0 0 0 53.1785 0 0 0 0 0 0 0 0 465.941 0 0 0 0 0 0 0 975.143 0 0 0 0 0 0 0 0 0 0 0 0 0 0 0 0 
0 0 0 0 0 0 0.02 423.521 0 0 0 0 0 -278.863 -892.132 0 0 0 0 0 0 2216.03 0 0 294.275 0 -1713.69 0 0 0 0 0 0 0 0 0 0 0 1545.69 0 0 0 0 0 0 0 0 0 0 0 0 0 0 0 0 0 0 0 0 
0 0 1108.66 0 2356.72 0 -1800.97 0.05 0 0 0 0 0 0 0 0 0 280.847 0 0 0 2243.64 0 -43.26 0 0 0 -532.777 0 0 0 -993.301 0 0 -2417.14 0 0 0 0 0 0 0 0 -1838.97 0 0 0 1415.98 0 0 0 0 0 0 0 0 0 0 0 
0 0 0 0 0 0 0 0 0.08 0 0 1787.85 0 0 0 0 0 0 0 -1050.68 0 2071.06 0 456.786 0 -136.494 0 0 0 0 0 0 0 0 1698.13 0 0 0 0 0 253.227 -814.31 0 0 0 1011.46 0 0 0 0 0 0 0 0 0 0 0 0 0 
802.103 0 0 0 0 0 0 0 0 0.09 -1155.35 -1179.16 0 0 0 0 0 0 0 0 0 0 0 0 0 0 0 0 0 0 -387.509 0 0 -299.921 0 0 0 0 0 0 1697.06 0 1105.15 0 2422.79 0 0 0 0 0 0 0 0 0 0 0 0 0 0 
-1443.45 0 0 0 0 589.084 0 0 0 568.636 0.01 1696.91 814.92 0 0 0 0 0 0 0 426.267 0 0 0 0 0 0 2469.79 0 0 0 0 0 0 0 0 0 0 0 0 0 0 0 0 0 0 0 0 0 0 0 0 0 0 0 0 0 0 0 
0 0 0 0 1016.65 0 0 0 -1575.59 984.146 2046.65 0.06 0 0 0 0 0 0 0 0 0 0 0 651.952 -1442.53 0 0 0 0 0 0 1927.02 0 0 0 0 0 0 0 0 0 0 0 0 0 0 0 0 0 0 0 0 0 0 0 0 0 0 0 
0 0 0 0 426.572 0 0 0 0 0 -339.137 0 0.06 -528.199 -781.35 659.429 0 0 0 0 0 0 0 0 0 0 0 0 0 0 0 0 1375.24 0 0 1435.36 0 0 0 0 0 0 0 0 0 0 0 0 0 0 0 0 0 0 0 0 0 0 0 
0 0 0 0 0 -619.907 860.24 0 0 0 0 0 2015.21 0.03 0 0 0 0 0 0 0 0 0 2156.06 0 0 0 0 -1569.49 0 0 0 0 0 2464.14 0 -257.195 0 229.423 0 0 0 0 0 0 0 0 0 -1303.06 -300.836 0 0 0 0 0 0 0 0 0 
0 0 0 -755.104 0 0 854.289 0 0 0 0 0 2110.74 0 0.01 401.09 0 0 0 0 0 0 0 0 0 1456.57 0 0 0 0 0 0 0 0 -214.927 0 0 95.5992 0 0 0 0 0 0 0 0 0 0 0 0 0 0 0 0 0 0 0 0 0 
-1505.86 0 0 0 0 0 0 0 0 0 0 0 328.608 0 861.309 0.03 0 0 0 0 0 0 0 0 1976.45 0 1302.45 0 0 0 0 1579.56 0 1229.21 0 0 0 0 0 0 0 -1162.98 0 -249.87 0 0 0 415.586 0 0 0 0 0 0 0 0 0 0 0 
0 0 0 0 979.11 -1215.32 0 0 0 0 0 0 0 0 0 0 0.03 0 0 0 0 0 0 0 0 0 0 0 0 0 0 0 0 0 0 0 0 0 0 205.924 0 0 0 0 2279.81 0 0 0 0 0 0 0 0 0 0 0 0 0 0 
0 0 0 -749.153 1293.76 760.598 0 1387.14 0 0 0 0 0 0 0 0 0 0.05 0 0 0 0 0 0 0 0 0 0 865.123 0 -2205.34 0 0 0 0 0 0 0 1889.02 0 0 0 0 0 0 0 0 0 -1474.73 0 0 0 0 0 41.2763 0 0 0 0 
0 0 0 0 0 0 0 0 0 0 0 0 0 0 0 0 0 0 0.08 0 0 0 440.764 0 0 0 0 0 0 0 0 0 0 -1724.83 1799.6 0 0 0 0 0 0 0 0 0 0 0 0 0 0 0 0 0 0 0 0 0 0 0 0 
0 2076.1 0 0 0 0 0 0 1725.9 0 0 0 0 0 0 0 0 0 0 0 0 0 0 0 0 0 0 0 0 0 925.398 0 0 0 2276.45 -152.516 0 0 0 0 -1778.24 0 0 0 2153.46 0 0 0 0 0 0 0 0 0 0 0 0 0 0 
0 0 0 0 0 0 0 0 0 0 -86.5963 0 0 0 0 0 0 0 0 0 0 0 0 0 2370.14 0 0 0 0 0 0 0 0 1847.82 0 0 0 0 0 0 0 0 0 -400.632 0 0 0 0 0 0 0 0 0 0 0 0 0 0 0 
0 2458.65 0 0 0 0 -1014.36 290.002 -153.584 0 0 0 0 0 0 0 0 0 0 0 0 0 1779.46 847.27 0 0 -1803.42 2164.91 0 -1263.85 0 0 0 0 0 0 0 0 2461.39 0 0 915.021 0 0 0 0 0 0 0 0 0 -2464.6 0 0 0 0 0 0 0 
0 0 0 0 0 0 0 0 0 0 0 0 0 0 0 0 0 0 -626.011 0 0 2372.28 0.03 0 0 -145.955 0 0 0 0 0 0 0 0 0 496.155 0 0 0 0 0 0 0 0 0 0 0 0 0 0 0 0 0 0 0 0 0 0 0 
0 391.629 0 1929.76 0 0 0 1748.18 208.06 0 0 1712.78 0 -770.211 0 0 0 0 0 0 0 -1183.13 0 0.08 0 0 0 0 0 0 0 -1500.37 0 0 0 0 0 0 1548.89 0 0 0 0 -2201.83 508.667 0 0 0 1899.4 0 0 0 0 0 0 0 0 0 0 
362.331 0 0 0 0 0 1642.89 0 0 0 0 -390.561 0 0 0 2392.27 0 0 0 0 -270.928 0 0 0 0.04 0 0 0 -958.663 0 0 -1821.42 0 0 0 0 0 0 279.168 0 0 0 0 0 0 0 0 0 0 0 0 0 0 0 0 0 0 0 0 
0 0 198.904 0 0 -1373.41 0 0 1164.51 0 0 0 0 0 620.212 0 0 0 0 0 0 0 2037.8 0 0 0.07 0 0 0 0 1404.39 0 -626.316 0 0 -220.878 0 0 -201.346 -199.057 0 0 0 0 0 0 1333.58 0 0 0 0 0 0 0 0 0 0 0 0 
-1468.78 0 0 0 0 0 -664.159 0 0 0 0 0 0 0 0 1034.2 0 0 0 0 0 1937.39 0 0 0 0 0.07 0 0 0 2324.98 0 0 0 0 0 0 0 2425.69 -1522.49 0 0 0 0 0 0 0 0 0 0 0 0 -841.624 0 0 0 0 0 0 
1054.49 0 0 0 0 0 0 1473.82 0 0 -2341.46 0 0 0 0 0 0 0 0 0 0 2454.07 0 0 0 0 0 0.08 0 0 0 0 0 0 0 0 0 0 0 0 0 2413.48 1027.94 0 0 0 0 0 0 0 0 0 0 0 0 0 0 0 0 
0 0 0 0 0 0 0 0 0 0 0 0 0 2369.99 0 0 0 995.59 0 0 0 0 0 0 -630.741 0 0 0 0 0 0 0 1102.71 0 0 0 0 0 -112.69 0 0 0 0 0 0 0 0 0 0 0 0 0 0 0 0 0 0 0 0 
0 0 0 0 0 0 0 0 0 0 0 0 0 0 0 0 0 0 0 0 0 2193.44 0 0 0 0 0 0 0 0.03 0 0 0 0 0 0 0 0 -1173.06 0 0 0 0 0 0 0 0 0 0 0 0 0 0 0 0 0 0 0 0 
0 0 0 0 0 0 0 0 0 1320.15 0 0 0 0 0 0 0 1199.3 0 248.802 0 0 0 0 0 2252.04 1159.63 0 0 0 0.08 0 0 0 0 0 260.552 -926.923 0 0 32.7311 0 0 0 0 0 0 -2221.52 0 0 0 0 0 0 0 0 -466.704 0 0 
0 506.531 0 0 0 0 0 -931.349 0 0 0 1235.62 0 0 0 -448.851 0 0 0 0 0 0 0 -104.907 818.583 0 0 0 0 0 0 0.09 1207.54 0 0 0 0 0 0 841.472 0 0 0 1208.15 0 0 0 0 0 0 0 0 0 0 0 0 0 0 0 
0 0 0 0 0 0 0 0 0 0 0 0 2498.63 0 0 0 0 0 0 0 0 0 0 0 0 -2097.77 0 0 2073.96 0 0 141.682 0.09 0 0 0 0 0 -345.088 0 278.405 0 0 0 635.929 1009.63 0 0 0 0 0 0 0 0 0 0 0 0 0 
0 0 0 0 0 0 0 0 0 21.2867 0 0 0 0 0 2345.73 0 0 1969.28 0 2140.8 0 0 0 0 0 0 0 0 0 0 0 0 0.05 0 948.897 0 -346.004 0 0 0 0 0 -239.189 100.635 0 0 0 0 0 0 0 0 0 0 0 0 0 0 
388.119 0 0 0 0 401.852 0 -102.161 1987.14 0 0 0 0 2241.2 987.045 0 0 0 -1526.46 -1848.58 0 0 0 0 0 0 0 0 0 0 0 0 0 0 0.08 -2420.8 0 0 0 0 0 0 2454.68 0 0 0 0 0 0 0 0 0 0 0 0 0 0 0 0 
0 0 0 0 0 0 0 0 0 0 0 0 1532.87 0 0 0 0 0 0 771.279 0 0 2498.32 0 0 1975.23 0 0 0 0 0 0 0 1882.31 1833.17 0.01 0 0 0 0 0 0 0 0 0 0 0 0 1230.12 0 -1003.68 0 0 0 0 0 0 0 0 
0 0 0 -1701.48 0 0 0 0 0 0 0 0 0 1941.82 0 0 0 0 0 0 0 0 0 0 0 0 0 0 0 0 -702.46 0 0 0 0 0 0 0 0 2237.39 0 0 0 0 0 0 0 0 0 0 0 0 0 0 0 0 0 0 0 
0 1227.84 0 1267.82 0 0 0 0 0 0 0 0 0 0 -136.036 0 0 0 0 0 0 0 0 0 0 0 0 0 0 0 1473.2 0 0 -911.206 0 0 0 0.03 0 0 1195.49 0 0 0 0 0 0 0 1224.94 0 0 0 0 0 0 0 0 0 0 
0 -341.273 0 0 0 0 -900.525 0 0 0 0 0 0 -2129.2 0 0 0 682.318 0 0 0 1766.95 0 452.666 -1220.21 -1099.05 1904.28 0 1826.3 -671.941 0 0 407.346 0 0 0 0 0 0.06 0 0 0 0 0 0 0 0 0 1748.94 0 0 0 0 0 0 0 0 0 0 
0 0 0 0 -599.918 0 0 0 0 0 0 0 0 0 0 0 1254.69 0 0 0 0 0 0 0 0 1870.56 297.174 0 0 0 0 203.94 0 0 0 0 2123.55 0 0 0.02 0 0 0 612.888 0 0 0 0 0 0 0 0 0 0 0 0 0 0 0 
0 0 0 0 0 0 0 0 2442.93 -1129.72 0 0 0 0 0 0 0 0 0 -271.386 0 0 0 0 0 0 0 0 0 0 1805.25 0 959.883 0 0 0 0 2490.84 0 0 0 0 0 0 0 0 0 0 0 0 0 0 0 0 0 0 0 0 0 
0 0 0 0 0 0 0 0 664.006 0 0 0 0 0 0 886.944 0 0 0 0 0 355.922 0 0 0 0 0 300.073 0 0 0 0 0 0 0 0 0 0 0 0 0 0.09 0 0 0 0 0 0 0 0 0 0 0 0 0 0 0 0 0 
0 0 0 0 0 1661.66 0 0 0 -984.298 0 0 0 0 0 0 0 0 0 0 0 0 0 0 0 0 0 -228.355 0 0 0 0 0 0 220.115 0 0 0 0 0 0 0 0 1050.83 -1318.17 0 0 0 0 0 0 0 0 0 0 0 0 0 0 
1202.35 0 0 0 0 0 0 1468.02 0 0 0 0 0 0 0 381.863 0 0 0 0 -1830.12 0 0 1662.42 0 0 0 0 0 0 0 1529.21 0 1146.5 0 0 0 0 0 -396.97 0 0 443.663 0.01 0 0 0 0 2034.59 0 0 0 0 0 0 0 0 0 0 
0 0 0 0 0 0 0 0 0 -958.052 0 0 0 0 0 0 1143.91 0 0 -882.214 0 0 0 -1664.1 0 0 0 0 0 0 0 0 1550.87 2342.37 0 0 0 0 0 0 0 0 -548.646 0 0.02 0 0 0 0 0 0 0 0 0 0 0 0 0 0 
0 0 0 0 0 0 0 0 -611.362 0 0 0 0 0 0 0 0 0 0 0 0 0 0 0 0 0 0 0 0 0 0 0 2405.09 0 0 0 0 0 0 0 0 0 0 0 0 0.08 100.33 0 120.472 0 0 0 0 0 0 0 0 0 0 
0 0 0 0 0 0 0 0 0 0 0 0 0 0 0 0 0 0 0 0 0 0 0 0 0 -2302.09 0 0 0 0 0 0 0 0 0 0 0 0 0 0 0 0 0 0 0 2162.16 0.01 0 1562.62 0 0 0 0 0 0 0 0 0 -1605.66 
0 1905.65 0 0 0 0 0 1896.65 0 0 0 0 0 0 0 713.294 0 0 0 0 0 0 0 0 0 0 0 0 0 0 1075.09 0 0 0 0 0 0 0 0 0 0 0 0 0 0 0 0 0.07 0 0 0 0 0 0 0 0 0 0 0 
0 0 0 0 -1312.98 0 0 0 0 0 0 0 0 1710.79 0 0 0 2171.77 0 0 0 0 0 -1169.7 0 0 0 0 0 0 0 0 0 0 0 328.15 0 1046.71 1501.89 0 0 0 0 606.479 0 1141.01 -595.645 0 0.03 0 0 0 0 0 0 0 0 0 0 
0 0 0 0 0 0 0 0 0 0 0 0 0 1860.48 0 0 0 0 0 0 0 0 0 0 0 0 0 0 0 0 0 0 0 0 0 0 0 0 0 0 0 0 0 0 0 0 0 0 0 0 0 0 0 0 0 0 0 0 0 
0 0 0 0 0 0 0 0 0 0 0 0 0 0 0 0 0 0 0 0 0 0 0 0 0 0 0 0 0 0 0 0 0 0 0 1751.99 0 0 0 0 0 0 0 0 0 0 0 0 0 0 0.06 0 0 0 0 0 0 0 0 
0 0 0 0 0 0 0 0 0 0 0 0 0 0 0 0 0 0 0 0 0 1810.13 0 0 0 0 0 0 0 0 0 0 0 0 0 0 0 0 0 0 0 0 0 0 0 0 0 0 0 0 0 0.02 0 0 0 0 0 0 0 
0 0 0 0 0 0 0 0 0 0 0 0 0 0 0 0 0 0 0 0 0 0 0 0 0 0 2097.92 0 0 0 0 0 0 0 0 0 0 0 0 0 0 0 0 0 0 0 0 0 0 0 0 0 0 0 0 0 0 0 0 
1373.87 0 0 0 0 0 0 0 0 0 0 0 0 0 0 0 0 0 0 0 0 0 0 0 0 0 0 0 0 0 0 0 0 0 0 0 0 0 0 0 0 0 0 0 0 0 0 0 0 0 0 0 0 0.03 0 0 0 0 0 
0 0 0 0 0 0 0 0 0 0 0 0 0 0 0 0 0 1659.37 0 0 0 0 0 0 0 0 0 0 0 0 0 0 0 0 0 0 0 0 0 0 0 0 0 0 0 0 0 0 0 0 0 0 0 0 0.06 -588.473 0 -268.181 0 
0 0 0 0 0 0 0 0 0 0 0 0 0 0 0 0 0 0 0 0 0 0 0 0 0 0 0 0 0 0 0 0 0 0 0 0 0 0 0 0 0 0 0 0 0 0 0 0 0 0 0 0 0 0 2149.34 0.08 0 0 0 
0 0 0 0 0 0 0 0 0 0 0 0 0 0 0 0 0 0 0 0 0 0 0 0 0 0 0 0 0 0 2113.79 0 0 0 0 0 0 0 0 0 0 0 0 0 0 0 0 0 0 0 0 0 0 0 0 0 0.07 0 0 
0 0 0 0 0 0 0 0 0 0 0 0 0 0 0 0 0 0 0 0 0 0 0 0 0 0 0 0 0 0 0 0 0 0 0 0 0 0 0 0 0 0 0 0 0 0 0 0 0 0 0 0 0 0 2423.4 0 0 0 0 
0 0 0 0 0 0 0 0 0 0 0 0 0 0 0 0 0 0 0 0 0 0 0 0 0 0 0 0 0 0 0 0 0 0 0 0 0 0 0 0 0 0 0 0 0 0 1003.37 0 0 0 0 0 0 0 0 0 0 0 0.03 
