*Vertices 73
*Matrix 
0.08 0 0 -524.689 0 -544.832 0 0 1679.2 0 0 0 -924.482 0 -425.962 1475.34 0 0 1568.73 0 0 0 2332.3 0 0 0 0 2444.3 0 1298.94 0 402.158 0 0 0 -471.587 0 -2000.87 0 0 0 0 -571.078 0 0 1973.71 0 0 0 0 0 0 0 0 0 0 0 0 0 0 0 0 0 0 0 0 0 0 -2134.39 0 0 0 0 
0 0.07 0 0 0 0 0 0 2456.66 0 0 0 0 206.992 0 0 -112.384 0 -485.168 2316.43 0 0 0 0 1482.36 0 -1633.27 0 0 0 0 0 0 0 -1488.46 1656.01 0 0 0 0 676.672 1525.24 0 0 0 -1740.24 0 0 0 0 0 0 0 0 2159.87 1651.89 -2101.58 -257.347 0 0 0 0 0 0 0 0 0 0 0 0 0 0 0 
0 0 0.03 2220.91 0 2179.1 0 0 0 0 -2427.67 0 0 0 0 0 0 0 0 -779.519 991.318 0 0 0 1618.02 649.815 0 0 0 0 0 1135.67 -1297.42 983.078 -232.627 0 0 0 0 0 0 0 0 0 0 0 0 0 0 0 999.405 0 0 0 0 1771.07 -1412.78 1109.12 0 0 0 0 0 0 0 0 0 0 0 0 0 0 0 
452.361 0 2340.69 0.04 0 1812.11 777.841 0 0 0 1645.02 -921.583 0 1693.85 0 0 0 0 1074.79 0 0 0 0 2201.38 0 -1184.35 0 0 0 -1430.78 0 0 0 0 0 819.651 0 2268.97 -1427.12 0 0 0 0 1651.59 0 0 0 1725.9 0 0 0 0 0 0 0 0 0 -1645.18 0 0 0 -439.543 0 0 0 0 0 0 0 0 0 -271.386 0 
0 0 0 0 0.04 826.67 0 -2380.67 0 0 0 0 0 0 0 0 0 0 0 0 0 0 0 1682.56 0 0 0 0 1312.07 0 1079.36 549.867 0 0 2239.52 1745.12 0 50.2792 0 0 -1965.77 -1350.37 1800.36 0 0 0 -401.395 0 0 0 -358.974 0 -594.272 0 0 -1831.95 0 0 0 0 0 0 0 0 0 0 0 0 0 0 -719.703 0 0 
-922.956 0 -87.9696 -2326.35 1484.65 0.06 0 0 0 0 0 132.832 1774.58 0 0 0 1486.94 0 0 0 0 -154.042 0 0 0 0 0 0 1256.68 0 0 0 1332.51 0 0 0 1871.78 0 0 0 0 0 0 0 0 0 -725.349 0 0 -477.081 0 0 0 -810.953 0 -2141.1 0 0 0 0 0 0 0 0 0 0 0 0 0 246.513 0 0 0 
0 0 0 -317.164 0 0 0.09 0 0 0 0 0 1078.75 0 0 46.9222 0 0 -895.184 0 0 0 1659.83 1198.54 0 0 0 0 0 0 0 0 0 0 0 0 0 0 0 0 0 0 -532.014 0 0 0 0 0 0 0 0 0 0 0 0 0 0 2273.55 399.106 0 0 0 0 0 510.956 0 0 0 0 0 0 0 0 
0 0 0 0 2146.29 0 0 0.01 0 0 0 0 0 2186.12 1745.12 0 -91.937 -152.058 -1208.46 0 0 646.763 0 0 0 0 0 0 -1542.48 0 0 -1836.38 0 0 0 -2451.63 558.565 0 1425.9 0 0 0 0 0 0 0 0 0 0 407.804 0 0 0 0 0 0 0 0 0 0 1128.35 0 0 0 0 0 0 1484.8 0 0 0 0 0 
1910.38 994.522 0 0 0 0 0 0 0.03 0 0 0 2278.59 0 0 0 0 0 0 0 0 0 584.048 0 0 0 0 0 0 -1767.1 0 0 0 0 0 0 0 0 0 0 -193.106 1078.14 1610.84 0 0 0 0 0 0 0 0 0 0 -1240.96 0 0 0 0 0 0 0 0 0 0 0 0 0 0 -1320.92 0 0 0 0 
0 0 0 0 0 0 0 0 0 0.03 0 0 0 0 0 0 0 0 2023.45 0 0 -367.977 -335.932 0 0 0 0 -707.343 0 144.276 0 0 0 0 0 0 0 0 0 0 0 523.316 993.606 0 0 0 0 0 0 0 0 0 0 0 0 0 0 0 0 0 0 0 0 0 0 0 0 0 0 0 0 -528.199 0 
0 0 809.427 730.689 0 0 0 0 0 0 0.09 0 0 0 0 0 -342.189 0 0 0 0 2107.53 0 -293.817 0 0 2359.16 -1369.9 0 -1385.77 0 2053.82 0 1206.02 0 0 0 0 0 0 -800.424 -1348.99 0 0 0 0 0 0 0 0 0 0 0 0 0 0 0 0 0 0 0 0 0 0 0 0 0 0 0 0 -1801.58 0 0 
0 0 0 1759.32 0 1227.68 0 0 0 0 0 0.09 2000.72 0 -346.614 0 0 0 0 0 0 1399.81 0 1260.03 0 1461.46 0 0 0 0 2316.74 0 0 0 0 2405.55 0 0 1014.36 2471.01 0 0 716.651 0 0 0 384.304 0 0 0 0 0 0 0 -1330.38 0 647.679 0 0 0 0 0 0 0 0 0 0 0 0 0 0 1177.63 0 
2162.47 0 0 0 0 -2210.84 -2296.44 0 -629.673 0 0 1575.9 0.07 0 -2190.24 0 0 0 1671.58 1059.83 0 1457.49 0 0 0 0 2406.16 2162.01 0 0 76.22 0 0 0 0 0 -1335.87 0 0 0 2006.06 0 0 0 0 0 0 0 0 0 0 0 0 0 0 0 0 0 2271.57 0 0 205.771 0 0 -526.978 0 0 0 0 0 0 0 0 
0 2360.99 0 1269.8 0 0 0 2496.95 0 0 0 0 0 0.05 0 0 0 0 0 0 0 1701.64 0 0 0 0 0 0 0 -253.838 0 0 0 168.844 0 526.521 0 0 -680.944 1662.88 95.9044 0 0 -730.232 0 0 0 0 1956.01 0 0 0 0 0 0 0 0 0 0 1523.1 411.313 0 0 0 0 0 1404.23 732.215 98.6511 0 0 0 0 
295.648 0 0 0 0 0 0 585.727 0 0 0 2273.86 -1773.05 0 0.09 1211.2 584.506 0 0 0 0 0 0 1317.56 0 0 0 0 861.461 0 -1142.08 0 -997.421 2010.64 -1125.75 0 0 2154.99 0 0 0 1406.83 0 0 -1541.87 0 0 0 0 0 0 0 0 829.112 0 0 0 0 -1644.26 0 0 -179.22 0 0 0 0 0 0 0 0 796.152 0 -1202.2 
2321.31 0 0 0 0 0 -981.552 0 0 0 0 0 0 0 1467.41 0.03 0 0 1814.71 0 0 -767.464 1787.55 0 0 0 0 0 0 -2131.64 0 0 0 0 0 0 -1742.84 -66.1489 0 0 1854.38 0 0 0 0 0 0 0 0 0 0 -1194.57 987.808 0 2140.64 -623.722 605.869 0 0 0 0 0 0 0 0 0 0 0 0 0 0 0 0 
0 646.916 0 0 0 1149.1 0 243.767 0 0 310.144 0 0 0 826.212 0 0.05 0 954.695 0 0 2035.66 0 0 0 0 0 0 0 0 -224.998 0 0 0 0 0 0 0 0 0 743.355 0 0 0 0 365.383 1604.28 0 0 0 -480.132 0 0 0 0 0 0 0 0 0 0 0 0 0 1611.3 0 0 0 -1736.12 0 0 0 0 
0 0 0 0 0 0 0 632.42 0 0 0 0 0 0 0 0 0 0.06 0 1446.65 0 0 0 0 0 0 1075.7 0 0 379.116 2299.65 0 1788.61 488.372 0 0 1598.03 0 0 0 0 1372.95 0 0 0 0 0 0 0 567.415 0 0 0 0 0 -2120.96 0 0 0 0 0 0 0 0 0 0 0 -2126.76 0 0 0 -1030.38 0 
19.1504 907.849 0 1374.94 0 0 1401.94 -1392.64 0 1627.17 0 0 2113.33 0 0 2438.05 535.218 0 0.02 0 0 2109.97 0 0 0 0 -693.457 0 -2260.12 0 0 0 0 0 -516.144 0 0 0 0 511.414 0 0 0 0 0 0 0 0 0 0 0 0 0 0 0 0 0 0 0 0 0 0 0 0 0 0 0 0 0 0 0 24.9489 0 
0 1768.01 1851.02 0 0 0 0 0 0 0 0 0 -76.0674 0 0 0 0 -523.774 0 0.09 0 0 0 1982.25 0 0 0 -230.033 0 0 0 -1301.23 0 -593.814 0 0 0 0 2312.62 651.646 0 0 0 0 0 0 0 0 2242.88 0 0 0 0 0 0 0 0 -24.0333 0 0 284.051 0 0 0 0 0 0 -1981.8 0 0 0 0 0 
0 0 822.703 0 0 0 0 0 0 0 0 0 0 0 0 0 0 0 0 0 0.07 -150.533 0 0 1773.05 0 0 1810.59 0 0 0 0 0 0 0 0 0 1452.15 0 0 -1533.33 0 0 0 0 0 0 0 0 2107.23 0 1646.09 0 0 0 0 0 627.537 0 0 0 0 0 0 0 0 0 0 0 -2395.02 0 1409.42 0 
0 0 0 0 0 2452.85 0 1582.61 0 -1800.82 -1937.85 -1160.85 -4.65407 -1256.22 0 693.152 -1679.36 0 2465.82 0 -64.1652 0.09 0 0 -203.787 0 0 0 1581.85 0 1316.49 0 0 0 1229.36 0 974.38 0 0 -2036.58 2043.6 0 0 1600.31 -390.866 0 0 0 1440.86 0 0 -1852.55 841.624 0 0 0 0 0 0 0 0 0 0 0 0 0 0 0 0 0 0 0 0 
1261.86 0 0 0 0 0 107.654 0 -100.482 -1127.74 0 0 0 0 0 2023.91 0 0 0 0 0 0 0.07 0 196.921 0 0 0 0 -1034.35 197.073 -350.124 2299.65 0 0 0 0 0 0 0 0 1050.52 0 0 0 0 0 0 0 0 0 0 0 879.315 0 0 0 0 0 0 0 0 0 0 0 0 0 -1783.88 0 0 0 0 465.941 
0 0 0 2227.62 -712.836 0 2168.57 0 0 0 248.497 -2075.03 0 0 -2032.3 0 0 0 0 2293.24 0 0 0 0.01 0 -307.55 0 0 0 0 0 0 0 -457.549 0 0 0 0 0 0 0 0 2375.18 0 0 0 0 0 0 -1894.97 -368.892 0 0 0 713.294 0 0 0 0 2278.28 0 0 0 0 0 -812.174 0 0 0 0 0 0 739.235 
0 2057.63 -232.78 0 0 0 0 0 0 0 0 0 0 0 0 0 0 0 0 0 611.82 1893.9 474.334 0 0.06 0 0 0 0 1926.71 0 0 0 0 0 0 0 0 848.186 0 0 1598.48 0 0 -884.35 0 0 0 2153.61 0 0 0 0 0 -1337.86 0 0 0 0 0 0 0 0 0 -183.035 0 1032.06 0 0 0 0 0 26.3222 
0 0 1718.42 1911.15 0 0 0 0 0 0 0 2361.14 0 0 0 0 0 0 0 0 0 0 0 1604.43 0 0.07 246.361 0 0 1333.58 0 0 -1676.46 0 0 -1804.64 525.147 0 0 0 0 0 1203.88 0 0 0 -285.882 0 0 0 875.805 0 0 0 0 -2081.59 0 0 0 0 0 0 0 0 0 0 0 0 0 0 0 0 0 
0 2228.84 0 0 0 0 0 0 0 0 -337.764 0 1906.72 0 0 0 0 1940.75 871.99 0 0 0 0 0 0 -77.2881 0.05 0 0 0 0 0 -2245.32 2239.83 -306.024 0 0 0 0 0 0 0 0 0 0 0 -1405.3 0 0 0 0 0 0 0 0 0 1284.6 0 0 0 0 0 0 0 0 0 0 0 0 0 0 0 0 
-326.93 0 0 0 0 0 0 0 0 -2209.01 -828.654 0 2276.91 0 0 0 0 0 0 2330.62 863.903 0 0 0 0 0 0 0.08 521.79 0 0 2232.66 1144.83 -2438.51 0 0 0 0 0 2399.29 1548.89 0 0 0 0 2474.36 0 0 0 0 0 0 0 0 0 0 0 0 0 -1782.05 0 0 0 937.452 0 0 -2328.33 0 0 0 0 0 0 
0 0 0 0 1790.14 2304.07 0 -161.519 0 0 0 0 0 0 344.172 0 0 0 1863.99 0 0 765.938 0 0 0 0 0 -555.971 0.07 0 0 1393.25 0 2192.98 1207.24 0 1848.73 0 0 -1710.49 0 1823.25 0 -917.005 0 -1849.65 56.0778 -1037.1 0 1226.77 1691.56 0 2201.68 0 0 0 0 0 423.215 0 0 0 0 0 0 0 0 0 -1439.33 0 0 0 0 
-525.452 0 0 2379.91 0 0 0 0 -41.7341 2238.76 596.408 0 0 885.571 0 -45.7015 0 2249.9 0 0 0 0 369.503 0 -1516.69 1020.92 0 0 0 0.01 0 0 0 0 0 0 0 0 0 1256.22 0 113.91 2413.94 0 0 0 0 0 0 0 0 0 0 0 -576.724 0 2228.69 0 -1060.29 0 0 0 0 0 1255.91 0 0 2260.43 -2171.62 0 0 -1571.78 0 
0 0 0 0 1972.79 0 0 0 0 0 0 -2355.8 611.209 0 2144.76 0 -686.285 -1301.69 0 0 0 -388.577 -2416.38 0 0 0 0 0 0 0 0.08 -314.112 1952.8 0 0 2290.03 0 0 2084.34 -600.375 0 0 0 0 0 0 0 0 0 0 0 0 768.227 0 0 0 0 0 0 0 0 0 0 0 0 0 0 0 0 0 0 0 0 
-6.48518 0 -178.152 0 1682.1 0 0 -2261.5 0 0 1863.99 0 0 0 0 0 0 0 0 -1487.24 0 0 -741.981 0 0 0 0 2447.97 969.192 0 1454.74 0 0 0 0 0 -431.761 1905.5 0 0 0 539.338 0 0 0 0 0 -1386.23 0 0 0 0 0 0 -220.115 0 0 0 0 0 0 0 -46.617 -1892.99 0 0 0 0 0 2051.68 -2013.53 0 236.137 
0 0 435.881 0 0 2352.29 0 0 0 0 0 0 0 0 -2355.65 0 0 917.463 0 0 0 0 2364.96 0 0 1150.78 1866.59 1715.98 0 0 -2018.72 0 0.09 -2451.02 0 0 0 0 0 0 0 0 0 0 0 0 0 0 0 0 0 0 0 0 0 0 0 0 0 0 0 0 0 0 0 0 0 0 0 0 732.673 0 849.712 
0 0 -20.6763 0 0 0 0 0 0 0 2070.3 0 0 1941.97 633.641 0 0 1801.89 0 2355.34 0 0 0 -989.639 0 0 -754.341 1004.75 464.263 0 0 0 1037.25 0.05 0 0 0 1912.82 0 -1920.15 0 0 0 0 0 0 0 -1770.61 0 -239.494 -1907.18 0 0 0 0 0 0 0 0 0 0 0 0 0 0 1371.27 0 0 0 -1238.82 0 0 0 
0 734.504 -28.7637 0 1770.15 0 0 0 0 0 0 0 0 0 851.085 0 0 0 25.1015 0 0 -1326.72 0 0 0 0 -1876.35 0 -1106.52 0 0 0 0 0 0.04 2395.32 896.557 0 1654.79 0 0 0 0 0 0 0 0 0 -1962.72 0 0 0 0 0 0 0 0 0 0 0 0 0 0 -1602.76 0 0 0 0 0 0 0 0 0 
673.009 1762.06 0 91.3266 -98.0407 0 0 1605.96 0 0 0 937.758 0 -1161.46 0 0 0 0 0 0 0 0 0 0 0 2382.2 0 0 0 0 657.598 0 0 0 670.721 0 0 0 0 -237.815 0 0 -2076.56 0 0 0 0 0 0 0 0 0 0 0 -2101.43 0 0 349.361 0 985.824 0 0 2477.42 0 0 0 0 0 0 0 0 0 0 
0 0 0 0 0 2357.94 0 -106.891 0 0 0 0 -250.328 0 0 783.334 0 1376.92 0 0 0 758.766 0 0 0 -2090.14 0 0 2345.42 0 0 -1022.75 0 0 -114.368 0 0.09 0 0 -492.95 1221.73 0 20.9815 0 0 0 0 0 1071.43 0 0 0 0 0 0 0 0 0 0 0 0 0 0 0 -109.79 0 0 0 0 622.196 0 2465.06 0 
-32.8837 0 0 2418.82 1977.07 0 0 0 0 0 0 0 0 0 -449.767 -2073.81 0 0 0 0 353.481 0 0 0 0 0 0 0 0 0 0 1748.94 0 1658.76 0 0 0 0.08 0 0 473.876 -1534.24 0 0 0 0 0 0 0 0 -2212.52 0 0 0 0 0 0 0 0 0 0 0 0 0 0 0 0 0 0 0 -728.706 0 0 
0 0 0 -631.504 0 0 0 1769.84 0 0 0 -483.947 0 1586.58 0 0 0 0 0 1094.93 0 0 0 0 1315.58 0 0 0 0 0 790.048 0 0 0 1870.86 0 0 0 0.01 0 0 2372.28 0 0 0 0 0 0 0 0 -1226.31 0 0 2.82296 0 -2376.71 0 0 0 -384.915 0 0 0 0 0 0 0 0 0 0 -486.999 -2167.96 0 
0 0 0 0 0 0 0 0 0 0 0 -1478.7 0 -98.1933 0 0 0 0 303.43 -35.783 0 1834.24 0 0 0 0 0 1919.08 2457.43 -442.595 2037.19 0 0 983.535 0 -904.035 2014.76 0 0 0.07 0 410.55 0 0 0 0 0 0 0 0 0 992.538 0 -1117.97 0 0 0 0 0 0 0 0 0 -1706.98 0 0 0 0 0 0 0 0 -738.014 
0 1785.71 0 0 -459.99 0 0 0 1773.96 0 1598.03 0 1862.47 1736.58 0 -635.777 797.22 0 0 0 -1707.43 1816.69 0 0 0 0 0 -615.177 0 0 0 0 0 0 0 0 976.363 -1459.17 0 0 0.09 0 2362.36 0 0 0 0 1607.33 0 0 0 0 0 0 0 1431.85 0 0 -637.761 0 0 0 0 0 0 0 0 0 0 0 0 0 0 
0 2025.59 0 0 -1458.1 0 0 0 -352.87 129.78 2207.79 0 0 0 -2389.52 0 0 -1535.16 0 0 0 0 -20.3711 0 1776.25 0 0 0 1450.16 1821.42 0 -284.356 0 0 0 0 0 1594.97 1993.85 -372.097 0 0.01 0 0 0 0 0 0 0 0 0 0 0 1144.83 0 0 0 0 -1952.96 0 0 0 903.272 0 0 0 2008.8 0 1796.55 -892.895 0 0 0 
1677.53 0 0 0 678.808 0 2129.2 0 1187.4 1858.81 0 592.441 0 0 0 0 0 0 0 0 0 0 0 -1223.41 0 -835.063 0 0 0 604.495 0 0 0 0 0 -2190.24 -1066.55 0 0 0 1547.06 0 0.06 0 0 0 0 0 0 -2310.63 0 0 0 986.282 0 -207.297 0 0 0 0 0 0 0 0 0 0 0 0 0 0 0 0 0 
0 0 0 695.441 0 0 0 0 0 0 0 0 0 2045.43 0 0 0 0 0 0 0 686.895 0 0 0 0 0 0 2101.58 0 0 0 0 0 0 0 0 0 0 0 0 0 0 0.04 0 -709.632 0 0 0 0 0 0 0 0 0 0 0 0 0 0 0 0 0 0 0 0 0 0 2140.8 0 0 0 0 
0 0 0 0 0 0 0 0 0 0 0 0 0 0 2379.76 0 0 0 0 0 0 1565.07 0 0 -535.218 0 0 0 0 0 0 0 0 0 0 0 0 0 0 0 0 0 0 0 0.07 0 0 0 0 1054.19 0 -1309.02 0 0 0 0 0 974.837 0 0 0 0 0 0 0 0 0 0 0 0 0 0 0 
1737.34 2072.13 0 0 0 0 0 0 0 0 0 0 0 0 0 0 1150.32 0 0 0 0 0 0 0 0 0 0 -1673.56 34.7148 0 0 0 0 0 0 0 0 0 0 0 0 0 0 1377.53 0 0.07 0 0 933.18 0 0 0 0 0 0 0 0 0 0 0 0 0 0 0 0 0 0 0 0 0 -1433.84 0 0 
0 0 0 0 2250.36 -702.155 0 0 0 0 0 1609.93 0 0 0 0 -507.141 0 0 0 0 0 0 0 0 -2437.13 2178.49 0 568.331 0 0 0 0 0 0 0 0 0 0 0 0 0 0 0 0 0 0.09 0 0 0 700.781 0 0 0 -1704.54 0 -1766.64 2075.33 0 876.263 0 0 0 0 0 0 0 0 0 0 0 0 0 
0 0 0 -1278.95 0 0 0 0 0 0 0 0 0 0 0 0 0 0 0 0 0 0 0 0 0 0 0 0 1522.19 0 0 2001.79 0 144.887 0 0 0 0 0 0 2201.07 0 0 0 0 0 0 0.03 0 0 0 0 0 0 0 0 0 0 0 0 0 0 1028.24 0 0 0 0 0 0 0 0 0 0 
0 0 0 0 0 0 0 0 0 0 0 0 0 627.995 0 0 0 0 0 2305.9 0 1462.07 0 0 -837.657 0 0 0 0 0 0 0 0 0 -1583.99 0 1650.98 0 0 0 0 0 0 0 0 -497.833 0 0 0.01 0 0 0 0 0 0 0 0 0 0 0 0 0 0 0 0 -1211.2 0 0 0 0 0 0 0 
0 0 0 0 0 2395.93 0 -1528.75 0 0 0 0 0 0 0 0 0 2026.96 0 0 1286.28 0 0 -68.4378 0 0 0 0 1953.41 0 0 0 0 1619.39 0 0 0 0 0 0 0 0 -1648.08 0 1376.92 0 0 0 0 0.01 0 0 0 0 0 0 -533.387 0 17.9296 0 0 0 0 0 0 1596.19 0 0 0 -2208.24 0 0 0 
0 0 -207.602 0 1921.37 0 0 0 0 0 0 0 0 0 0 0 202.872 0 0 0 0 0 0 -2124.77 0 265.74 0 0 -1598.64 0 0 0 0 -404.599 0 0 0 2309.72 1949.29 0 0 0 0 0 0 0 -1438.72 0 0 0 0.01 0 0 0 0 0 0 0 0 0 0 0 -217.521 0 1582.16 2129.51 0 0 0 0 0 0 0 
0 0 0 0 0 0 0 0 0 0 0 0 0 0 0 1901.23 0 0 0 0 1979.96 935.163 0 0 0 0 0 0 0 0 0 0 0 0 0 0 0 0 0 1456.27 0 0 0 0 -65.2333 0 0 0 0 0 0 0.06 0 0 0 0 0 0 0 0 0 0 0 0 0 0 0 0 0 -55.3148 0 0 0 
0 0 0 0 1903.52 0 0 0 0 0 0 0 0 0 0 -1378.6 0 0 0 0 0 2222.59 0 0 0 0 0 0 -1837.29 0 700.476 0 0 0 0 0 0 0 0 0 0 0 0 0 0 0 0 0 0 0 0 0 0.05 0 0 0 0 0 0 0 0 0 0 0 -1886.58 0 0 0 0 0 0 0 0 
0 0 0 0 0 -1762.67 0 0 518.281 0 0 0 0 0 238.273 0 0 0 0 0 0 0 1670.2 0 0 0 0 0 0 0 0 0 0 0 0 0 0 0 2024.22 1314.05 0 2404.17 1413.54 0 0 0 0 0 0 0 0 0 0 0 0 0 0 0 -1841.87 0 0 0 0 0 0 0 0 0 0 0 0 0 0 
0 445.341 0 0 0 0 0 0 0 0 0 126.576 0 0 0 2168.42 0 0 0 0 0 0 0 327.082 -1323.05 0 0 0 0 -1235.62 0 2249.75 0 0 0 -566.347 0 0 0 0 0 0 0 0 0 0 -182.424 0 0 0 0 0 0 0 0.06 0 0 0 0 0 1865.37 0 0 -2496.64 0 0 0 0 0 0 0 0 0 
0 2118.98 982.925 0 1170 -1292.08 0 0 0 0 0 0 0 0 0 -1505.86 0 408.261 0 0 0 0 0 0 0 871.38 0 0 0 0 0 0 0 0 0 0 0 0 248.955 0 -280.236 0 256.89 0 0 0 0 0 0 0 0 0 0 0 0 0.08 0 0 0 0 0 0 0 -1043.66 0 0 0 0 0 0 0 0 -2073.05 
0 -4.1963 1180.99 0 0 0 0 0 0 0 0 -822.398 0 0 0 543.764 0 0 0 0 0 0 0 0 0 0 345.088 0 0 1800.97 0 0 0 0 0 0 0 0 0 0 0 0 0 0 0 0 1900.46 0 0 564.821 0 0 0 0 0 0 0.03 0 0 0 0 0 0 0 0 0 0 0 0 0 0 -912.885 0 
0 1872.39 1207.69 587.863 0 0 -665.685 0 0 0 0 0 0 0 0 0 0 0 0 1345.48 -2240.9 0 0 0 0 0 0 0 0 0 0 0 0 0 0 1976.76 0 0 0 0 0 0 0 0 2084.49 0 80.0348 0 0 0 0 0 0 0 0 0 0 0.02 277.947 0 0 0 2251.73 0 0 0 0 0 0 -131.611 0 526.215 -1312.98 
0 0 0 0 0 0 1244.32 0 0 0 0 0 2075.64 0 -714.209 0 0 0 0 0 0 0 0 0 0 0 0 0 1897.87 2430.11 0 0 0 0 0 0 0 0 0 0 987.808 -1349.6 0 0 0 0 0 0 0 1968.98 0 0 0 -903.272 0 0 0 -567.721 0.02 2383.27 -283.288 1530.27 0 0 0 -805.307 0 0 0 0 -1077.38 0 0 
0 0 0 0 0 0 0 0 0 0 0 0 0 643.101 0 0 0 0 0 0 0 0 0 2306.36 0 0 0 -614.719 0 0 0 0 0 0 0 1910.23 0 0 -47.0748 0 0 0 0 0 0 0 -1366.7 0 0 0 0 0 0 0 0 0 0 0 240.562 0.06 0 0 0 0 0 0 0 0 0 0 0 -1121.48 0 
0 0 0 0 0 0 0 1719.03 0 0 0 0 0 729.164 0 0 0 0 0 1747.72 0 0 0 0 0 0 0 0 0 0 0 0 0 0 0 0 0 0 0 0 0 0 0 0 0 0 0 0 0 0 0 0 0 0 -0.991852 0 0 0 279.778 0 0.01 0 0 0 0 0 -2038.71 0 0 0 0 0 0 
0 0 0 2042.53 0 0 0 0 0 0 0 0 999.71 0 148.091 0 0 0 0 0 0 0 0 0 0 0 0 0 0 0 0 0 0 0 0 0 0 0 0 0 0 0 0 0 0 0 0 0 0 0 0 0 0 0 0 0 0 0 8.31629 0 0 0.01 0 1387.91 0 908.917 0 0 0 0 0 0 0 
0 0 0 0 0 0 0 0 0 0 0 0 0 0 0 0 0 0 0 0 0 0 0 0 0 0 0 0 0 0 0 2208.4 0 0 0 -1102.25 0 0 0 0 0 1867.35 0 0 0 0 0 494.781 0 0 52.2629 0 0 0 0 0 0 1432.46 0 0 0 0 0.03 0 0 0 0 0 0 0 0 0 -2135.46 
0 0 0 0 0 0 0 0 0 0 0 0 0 0 0 0 0 0 0 0 0 0 0 0 0 0 0 -1837.9 0 0 0 1107.75 0 0 1764.05 0 0 0 0 1451.84 0 0 0 0 0 0 0 0 0 0 0 0 0 0 -279.015 384.304 0 0 0 0 0 949.049 0 0.04 -2432.1 0 0 446.257 0 0 0 0 0 
0 0 0 0 0 0 412.381 0 0 0 0 0 2431.49 0 0 0 -68.2852 0 0 0 0 0 0 0 -391.934 0 0 0 0 706.275 0 0 0 0 0 0 -1251.03 0 0 0 0 0 0 0 0 0 0 0 0 0 1882.15 0 2266.84 0 0 0 0 0 0 0 0 0 0 1401.79 0.01 0 0 0 -1818.37 0 0 0 0 
0 0 0 0 0 0 0 0 0 0 0 0 0 0 0 0 0 0 0 0 0 0 0 1361.96 0 0 0 0 0 0 0 0 0 973.159 0 0 0 0 0 0 0 0 0 0 0 0 0 0 532.319 1497.47 -418.638 0 0 0 0 0 0 0 1834.7 0 0 -720.771 0 0 0 0.06 0 0 2485.05 0 0 0 2390.44 
0 0 0 0 0 0 0 0 0 0 0 0 0 2372.28 0 0 0 0 0 0 0 0 0 0 -593.814 0 0 -1051.13 0 0 0 0 0 0 0 0 0 0 0 0 0 662.633 0 0 0 0 0 0 0 0 0 0 0 0 0 0 0 0 0 0 945.387 0 0 0 0 0 0.09 0 0 0 0 0 0 
0 0 0 0 0 0 0 -1991.41 0 0 0 0 0 1274.38 0 0 0 1356.62 0 -1793.04 0 0 2339.63 0 0 0 0 0 0 1751.23 0 0 0 0 0 0 0 0 0 0 0 0 0 0 0 0 0 0 0 0 0 0 0 0 0 0 0 0 0 0 0 0 0 -340.51 0 0 0 0 0 0 0 0 0 
-274.133 0 0 0 0 0 0 0 941.725 0 0 0 0 322.962 0 0 252.77 0 0 0 0 0 0 0 0 0 0 0 1641.97 2433.32 0 0 0 0 0 0 0 0 0 0 0 698.645 0 -2341.61 0 0 0 0 0 0 0 0 0 0 0 0 0 0 0 0 0 0 0 0 1877.88 2021.62 0 0 0.01 -601.749 0 0 0 
0 0 0 0 0 -171.743 0 0 0 0 0 0 0 0 0 0 0 0 0 0 -854.747 0 0 0 0 0 0 0 0 0 0 1900.46 0 856.883 0 0 -841.319 0 0 0 0 -2195.58 0 0 0 0 0 0 0 -964.309 0 2016.89 0 0 0 0 0 0.991852 0 0 0 0 0 0 0 0 0 0 617.771 0.05 0 0 0 
0 0 0 0 2491.61 0 0 0 0 0 2199.09 0 0 0 -910.291 0 0 0 0 0 0 0 0 0 0 0 0 0 0 0 0 -1994.31 380.184 0 0 0 0 449.614 343.41 0 0 0 0 0 0 -618.534 0 0 0 0 0 0 0 0 0 0 0 0 -246.055 0 0 0 0 0 0 0 0 0 0 0 0.03 0 0 
0 0 0 -1093.4 0 0 0 0 0 1135.21 0 1632.51 0 0 0 0 0 -2319.64 -1140.55 0 1918.32 0 0 0 0 0 0 0 0 2266.08 0 0 0 0 0 0 -246.818 0 1630.53 0 0 0 0 0 0 0 0 0 0 0 0 0 0 0 0 0 -2432.4 -2010.64 0 239.189 0 0 0 0 0 0 0 0 0 0 0 0.02 0 
0 0 0 0 0 0 0 0 0 0 0 0 0 0 1786.02 0 0 0 0 0 0 0 677.282 -1912.21 -1012.07 0 0 0 0 0 0 2086.02 463.5 0 0 0 0 0 0 2445.83 0 0 0 0 0 0 0 0 0 0 0 0 0 0 0 547.273 0 -300.378 0 0 0 0 1046.56 0 0 309.229 0 0 0 0 0 0 0.05 
