*Vertices 71
*Matrix 
0 0 0 0 1271.32 0 0 0 0 0 0 0 -40.8185 2091.97 0 0 0 0 0 0 0 0 0 0 0 0 0 0 0 0 0 0 890.301 0 0 304.193 0 0 0 0 0 0 0 0 0 0 0 -1232.26 561.312 -2286.98 0 0 0 0 0 0 0 0 0 0 0 0 167.928 0 0 0 824.534 0 0 0 0 
0 0.04 0 0 0 0 2497.86 0 0 0 0 0 0 0 0 0 -1421.63 0 0 0 0 0 0 0 0 0 0 0 0 0 0 1710.94 0 0 1887.65 0 0 0 0 0 0 0 1706.52 0 0 0 0 0 -1542.48 0 0 0 0 0 0 0 0 0 0 0 -2175.74 0 0 0 0 0 -382.626 0 0 0 0 
0 0 0.01 0 0 0 0 0 0 0 0 2215.41 0 1541.72 0 0 0 0 0 0 0 0 0 0 -1804.79 0 1039.08 0 0 0 0 0 0 1857.28 0 0 -1544.31 0 0 1252.71 0 1049.91 0 0 2189.78 0 0 0 0 0 621.128 0 0 0 0 0 -29.9844 0 0 0 0 0 0 0 0 0 0 0 0 0 0 
0 0 0 0.08 0 0 0 0 0 0 0 0 0 0 0 0 0 0 0 0 0 0 0 0 0 0 0 0 0 0 2289.73 0 0 2475.59 602.969 0 0 0 0 0 0 0 0 0 0 0 0 1157.64 -696.661 0 0 0 2210.23 0 1814.1 0 0 0 0 0 0 0 0 0 0 0 0 -642.338 0 0 0 
627.079 0 0 0 0.04 0 0 0 0 0 0 0 0 0 0 0 0 0 0 0 0 -213.095 0 0 0 0 0 0 0 0 0 0 0 0 0 -275.506 0 0 0 0 0 0 0 -314.875 0 0 0 0 0 1628.7 0 0 0 0 0 1441.31 0 0 0 -33.9518 0 0 0 0 0 0 0 1046.86 0 696.051 0 
0 0 0 0 0 0.02 0 544.526 0 0 0 0 0 2035.05 0 -114.368 0 0 0 0 0 0 0 0 0 429.167 0 0 0 0 0 0 0 0 0 0 0 0 -1427.73 0 0 -408.719 0 0 0 2181.84 0 0 0 0 0 0 2286.07 0 0 0 0 0 0 0 -1228.14 0 1423.92 44.1755 415.891 0 296.106 2052.6 0 0 0 
0 2263.48 0 0 0 0 0 0 0 0 0 0 0 0 0 0 0 0 0 0 0 1145.89 0 0 0 0 2443.69 0 0 0 0 0 2248.99 0 0 0 0 0 0 0 -727.18 -2237.39 0 0 0 1273.77 0 0 0 0 0 0 0 0 0 1269.65 0 0 0 911.969 696.814 -618.534 0 0 0 0 0 2067.86 0 0 0 
0 0 0 0 0 -1725.44 0 0.06 0 0 0 1298.94 0 0 0 0 0 0 0 0 0 0 0 0 0 0 2025.44 0 0 0 0 0 0 0 2127.67 0 0 0 0 0 0 0 0 0 0 0 0 0 0 0 0 0 0 0 0 0 0 0 0 0 0 265.587 834.91 0 2043.9 0 -1993.24 0 0 -506.684 0 
0 0 0 0 0 0 0 0 0.01 0 0 0 0 0 0 2333.83 0 0 0 1678.14 -877.026 0 0 0 0 -683.081 0 0 0 0 0 0 0 0 0 0 0 0 0 0 673.925 0 0 0 0 0 0 0 0 2256.16 0 0 0 0 0 0 0 0 -67.6748 0 0 0 1810.28 0 0 1544.31 0 0 0 0 0 
0 0 0 0 0 0 0 0 0 0.08 0 0 0 0 0 0 0 0 0 0 0 0 0 0 129.627 -206.992 0 -651.494 0 0 2295.07 0 0 0 0 0 0 -566.805 0 0 0 2090.14 0 0 0 0 0 0 0 0 0 0 0 -71.0318 0 0 0 0 0 0 0 0 0 0 0 0 0 0 0 0 0 
0 0 0 0 0 0 0 0 0 0 0 0 788.369 0 0 0 -101.703 0 0 0 0 0 0 0 0 1067.92 842.845 0 0 0 0 0 0 -96.3622 0 0 0 0 1596.96 0 1694.16 0 0 0 0 0 0 0 1205.71 0 0 0 0 641.118 0 0 0 0 0 0 2205.8 0 0 0 0 0 0 0 0 0 0 
0 0 -34.5622 0 0 0 0 -614.414 0 0 0 0.07 0 0 0 0 0 0 292.138 0 0 0 0 0 0 0 0 -442.595 0 0 0 -1860.18 0 0 0 389.798 0 0 0 0 0 0 0 0 0 0 0 919.141 0 0 0 0 0 0 0 0 0 0 0 0 0 0 0 2313.53 1484.19 0 0 0 0 0 0 
504.089 0 0 0 0 0 0 0 0 0 2015.21 0 0.05 1179.31 -378.658 0 0 0 1981.19 0 0 0 0 0 0 144.581 0 0 1044.72 0 2224.11 0 0 0 0 0 0 0 0 0 0 0 0 0 0 0 0 0 -1877.42 0 0 0 0 0 0 0 0 0 0 0 0 0 0 0 0 0 0 0 0 0 0 
588.626 0 1575.9 0 0 2258.14 0 0 0 0 0 0 -1573 0.04 0 -837.199 665.838 0 0 0 0 0 1877.42 975.143 0 0 0 0 0 0 0 0 0 0 0 0 123.981 0 0 0 0 0 0 0 0 0 0 0 0 -631.047 0 0 0 0 0 0 0 0 -186.392 1025.65 1406.06 0 0 0 0 0 0 0 0 0 0 
0 0 0 0 0 0 0 0 0 0 0 0 -802.255 0 0.08 0 0 0 0 0 0 0 0 0 -1106.22 0 0 0 0 -1997.97 0 0 0 0 0 0 0 0 0 1269.49 0 0 0 0 0 0 0 0 0 953.932 0 -804.849 0 0 0 0 0 1039.08 0 0 0 302.21 0 0 0 0 0 1525.39 0 0 0 
0 0 0 0 0 -843.15 0 0 -1183.58 0 0 0 0 593.966 0 0.03 0 -1529.36 -101.245 2085.1 0 0 1459.32 0 0 0 0 0 0 0 0 0 1415.83 0 0 0 0 0 0 0 0 0 0 0 0 0 0 0 0 0 0 0 0 -611.972 0 0 0 0 -890.301 0 1517.46 0 0 0 1667.3 0 0 0 0 0 0 
0 2415.31 0 0 0 0 0 0 0 0 -1731.09 0 0 -1034.65 0 0 0.03 0 0 0 0 0 0 0 0 0 0 0 0 0 0 0 0 0 0 0 0 0 0 0 0 0 0 1959.21 0 0 0 2359.77 0 0 0 0 0 0 0 0 0 0 0 0 0 0 0 0 -1774.58 0 0 0 0 0 0 
0 0 0 0 0 0 0 0 0 0 0 0 0 0 0 2392.57 0 0.03 0 0 0 0 0 311.365 0 0 0 0 0 0 0 0 2295.07 0 0 0 0 0 0 0 0 -101.398 0 0 0 0 0 0 0 0 -1794.87 2164.14 0 0 2137.29 0 0 0 0 0 0 -1514.56 0 0 0 0 0 0 0 0 0 
0 0 0 0 0 0 0 0 0 0 0 1878.8 -717.109 0 0 -2400.66 0 0 0.02 0 0 0 0 0 0 0 0 0 0 0 0 0 0 0 0 0 0 0 0 0 0 0 0 0 0 0 0 0 0 0 0 0 0 0 0 546.968 1418.88 0 0 0 0 0 0 0 0 0 0 0 0 0 260.857 
0 0 0 0 0 0 0 0 -1060.9 0 0 0 0 0 0 2166.13 0 0 0 0.02 0 0 0 0 0 0 0 0 0 0 -1326.41 0 0 625.553 0 0 0 0 2371.21 -295.801 0 0 0 -2345.58 0 -1394.16 0 0 0 0 0 0 0 0 0 0 -1218.07 0 0 1839.43 2154.84 0 0 0 0 0 0 0 0 0 1253.32 
0 0 0 0 0 0 0 0 2431.49 0 0 0 0 0 0 0 0 0 0 0 0.01 0 0 -791.116 0 0 0 -160.298 0 0 0 0 0 -266.503 0 0 0 0 0 0 0 0 0 0 0 0 0 0 0 0 0 0 0 0 0 0 0 0 0 0 0 0 -2487.03 0 0 1684.09 0 0 0 0 0 
0 0 0 0 -1992.93 0 943.861 0 0 0 0 0 0 0 0 0 0 0 0 0 0 0.08 0 0 0 0 0 0 0 0 0 0 2182.45 0 498.291 0 0 2364.8 291.07 0 -994.369 0 0 0 0 0 0 0 0 1920.91 0 0 0 0 308.008 0 -1156.73 0 0 0 -1118.43 0 0 0 0 -9.07926 0 0 0 0 0 
0 0 0 0 0 0 0 0 0 0 0 0 0 2447.05 0 -485.626 0 0 0 0 0 0 0.08 0 0 0 0 2023.61 0 0 0 0 0 0 0 2466.12 0 0 0 0 0 0 794.778 0 0 0 0 0 0 2293.69 0 0 0 0 0 0 0 -1063.8 -554.903 0 0 0 0 0 0 -1006.12 0 0 0 0 0 
0 0 0 0 0 0 0 0 0 0 0 0 0 -1582.31 0 0 0 446.257 0 0 1818.98 0 0 0.06 0 0 0 2239.37 0 0 0 0 0 0 1406.52 0 0 0 0 0 0 1766.64 0 0 0 0 0 0 0 0 0 0 0 -946.913 0 1037.86 0 0 0 0 0 0 0 0 0 0 0 -1313.14 0 0 0 
0 0 -286.492 0 0 0 0 0 0 548.036 0 0 0 0 -1401.03 0 0 0 0 0 0 0 0 0 0.01 0 0 0 0 1062.43 0 0 0 -325.861 0 0 0 0 0 0 0 0 0 0 0 0 0 0 0 0 0 0 0 2447.36 0 0 0 -483.947 0 0 0 0 0 0 0 0 0 0 0 0 0 
0 0 0 0 0 -1570.56 0 0 -1264.46 2384.03 2012.01 0 -2281.95 0 0 0 0 0 0 0 0 0 0 0 0 0.06 0 0 0 0 0 0 1945.33 0 0 0 0 0 0 0 1911.45 0 0 -419.858 0 0 0 0 209.891 0 1991.56 0 12.4363 0 0 0 0 -865.429 0 0 0 0 1214.56 0 0 0 0 0 0 0 0 
0 0 -2459.11 0 0 0 1356.01 287.255 0 0 1314.05 0 0 0 0 0 0 0 0 0 0 0 0 0 0 0 0.03 0 -2435 0 0 0 0 0 0 0 0 0 0 0 0 0 0 0 1444.21 0 0 0 0 0 0 0 0 0 0 0 20.5237 0 0 0 0 0 0 0 0 0 2145.68 0 0 0 0 
0 0 0 0 0 0 0 0 0 935.011 0 2308.65 0 0 0 0 0 0 0 0 1800.21 0 1818.83 961.257 0 0 0 0.05 0 0 0 0 0 0 0 0 0 -733.741 0 0 0 0 0 0 0 0 0 0 0 0 0 0 0 0 0 0 0 0 0 0 0 0 0 0 0 0 0 0 0 0 0 
0 0 0 0 0 0 0 0 0 0 0 0 2456.82 0 0 0 0 0 0 0 0 0 0 0 0 0 -850.017 0 0.03 0 0 0 0 0 0 0 0 0 0 430.54 0 0 0 0 0 943.251 0 0 0 0 0 1003.22 1242.79 0 0 0 0 0 0 0 0 0 0 0 0 0 0 0 0 0 0 
0 0 0 0 0 0 0 0 0 0 0 0 0 0 742.897 0 0 0 0 0 0 0 0 0 -1809.67 0 0 0 0 0.08 0 0 0 0 0 0 0 1533.02 0 655.309 0 0 0 0 -1110.49 0 0 0 -529.42 0 0 0 60.5029 0 0 0 1560.34 0 350.887 2136.22 0 1933.73 0 1118.73 0 0 0 0 0 0 0 
0 0 0 1873.45 0 0 0 0 0 1826.3 0 0 -216.3 0 0 0 0 0 0 -1633.58 0 0 0 0 0 0 0 0 0 0 0.08 0 0 0 -601.444 0 0 0 1001.69 0 0 0 0 0 0 0 -385.22 -734.504 0 0 1303.67 0 1151.23 24.9489 0 0 0 0 0 0 0 0 0 0 0 1850.72 0 891.064 0 0 0 
0 373.928 0 0 0 0 0 0 0 0 0 -396.054 0 0 0 0 0 0 0 0 0 0 0 0 0 0 0 0 0 0 0 0.04 0 0 0 0 0 0 0 0 0 0 2371.06 0 0 0 0 0 0 0 0 0 0 0 -1672.34 0 0 0 0 0 0 0 0 0 0 0 0 1077.38 0 0 0 
-74.6941 0 0 0 0 0 -909.68 0 0 0 0 0 0 0 0 -715.278 0 2209.77 0 0 0 205.466 0 0 0 2375.48 0 0 0 0 0 0 0.03 0 0 1210.14 0 0 36.0881 0 0 0 -620.518 0 0 0 0 0 0 0 0 0 0 0 -2258.75 0 0 1154.59 672.094 1220.21 0 0 0 -1532.11 0 0 0 0 0 0 0 
0 0 -2383.27 1605.66 0 0 0 0 0 0 1027.94 0 0 0 0 0 0 0 0 -310.907 1393.55 0 0 0 421.842 0 0 0 0 0 0 0 0 0.04 0 0 0 0 0 0 0 0 0 0 0 0 0 0 0 0 0 1746.8 0 0 -2134.69 0 2494.05 -2024.98 0 0 0 0 0 0 637.455 0 944.472 0 0 0 0 
0 1625.64 0 -901.593 0 0 0 -1232.57 0 0 0 0 0 0 0 0 0 0 0 0 0 970.412 0 857.036 0 0 0 0 0 0 1911.3 0 0 0 0.07 0 0 0 0 0 -1646.55 0 0 0 0 0 0 0 0 1510.74 2217.86 0 0 0 0 0 0 1716.13 0 0 0 0 0 0 0 0 0 0 0 0 0 
-1097.06 0 0 0 559.481 0 0 0 0 0 0 -294.122 0 0 0 0 0 0 0 0 0 0 -2024.98 0 0 0 0 0 0 0 0 0 2203.05 0 0 0.08 0 0 0 0 0 0 -497.07 -598.086 -120.777 0 0 0 0 0 0 0 0 0 1111.71 0 0 0 0 2059.01 0 0 0 0 0 0 -478.607 0 0 0 0 
0 0 2058.7 0 0 0 0 0 0 0 0 0 0 858.562 0 0 0 0 0 0 0 0 0 0 0 0 0 0 0 0 0 0 0 0 0 0 0.05 0 467.925 0 0 0 0 0 0 0 0 0 0 0 0 0 -115.894 0 0 0 0 -1844.16 0 0 0 2077.01 0 0 0 1983.17 0 0 0 0 0 
0 0 0 0 0 0 0 0 0 2121.57 0 0 0 0 0 0 0 0 0 0 0 1495.48 0 0 0 0 0 2172.99 0 1669.29 0 0 0 0 0 0 0 0 0 -495.087 0 0 0 0 0 0 0 0 -977.432 0 0 0 0 0 0 0 0 0 0 0 0 0 0 757.546 0 0 0 0 0 0 0 
0 0 0 0 0 185.629 0 0 0 0 2361.75 0 0 0 0 0 0 0 0 2230.06 0 1022.9 0 0 0 0 0 0 0 0 -1250.88 0 -2098.83 0 0 0 -2116.08 0 0.05 0 0 0 0 0 0 0 0 0 0 0 0 0 0 0 1726.36 0 0 0 0 0 0 0 0 0 0 0 0 0 0 0 0 
0 0 1320.31 0 0 0 0 0 0 0 0 0 0 0 -162.893 0 0 0 0 1333.12 0 0 0 0 0 0 0 0 1982.1 63.86 0 0 0 0 0 0 0 956.374 0 0.03 -205.161 0 0 0 0 0 0 0 0 0 0 0 0 0 0 0 0 0 0 0 0 0 0 0 0 0 0 0 0 0 0 
0 0 0 0 0 0 -522.858 0 276.269 0 970.412 0 0 0 0 0 0 0 0 0 0 -948.134 0 0 0 641.118 0 0 0 0 0 0 0 0 144.581 0 0 0 0 757.546 0.04 0 0 0 0 0 0 0 0 0 0 0 0 568.484 0 0 0 -1089.89 0 0 0 0 0 0 0 0 0 0 0 0 0 
0 0 2209.31 0 0 1086.08 -1726.2 0 0 401.852 0 0 0 0 0 0 0 1105.46 0 0 0 0 0 -1009.78 0 0 0 0 0 0 0 0 0 0 0 0 0 0 0 0 0 0.08 0 0 936.079 413.755 0 -137.867 -988.571 0 0 0 0 0 0 0 0 0 0 0 0 0 0 0 0 0 0 0 0 0 0 
0 -472.961 0 0 0 0 0 0 0 0 0 0 0 0 0 0 0 0 0 0 0 0 -2002.4 0 0 0 0 0 0 0 0 1782.51 -227.592 0 0 812.937 0 0 0 0 0 0 0.03 0 0 1354.03 0 0 -1737.19 2094.26 0 0 0 0 0 0 0 0 0 0 0 0 0 0 0 0 2134.85 0 0 0 0 
0 0 0 0 -380.032 0 0 0 0 0 0 0 0 0 0 0 2445.68 0 0 1338.31 0 0 0 0 0 -1064.87 0 0 0 0 0 0 0 0 0 634.556 0 0 0 0 0 0 0 0.01 959.273 0 0 0 0 0 0 0 2344.66 0 0 0 0 0 0 0 0 0 0 2296.29 0 -1466.34 0 0 0 0 0 
0 0 1329.46 0 0 0 0 0 0 0 0 0 0 0 0 0 0 0 0 0 0 0 0 0 0 0 1893.75 0 0 -1549.2 0 0 0 0 0 -818.888 0 0 0 0 0 2485.05 0 -123.218 0.04 -1591.62 0 0 0 0 0 0 0 2370.75 0 0 0 0 0 0 -790.048 0 2088.92 208.213 0 0 0 0 0 0 0 
0 0 0 0 0 -1501.74 830.79 0 0 0 0 0 0 0 0 0 0 0 0 -1836.83 0 0 0 0 0 0 0 0 2056.72 0 0 0 0 0 0 0 0 0 0 0 0 627.232 354.396 0 2269.59 0.03 0 0 1774.42 0 0 0 0 0 -541.78 0 0 0 0 0 0 0 0 0 0 0 0 0 0 0 0 
0 0 0 0 0 0 0 0 0 0 0 0 0 0 0 0 0 0 0 0 0 0 0 0 0 0 0 0 0 0 463.042 0 0 0 0 0 0 0 0 0 0 0 0 0 0 0 0.03 0 0 2206.56 785.623 0 0 2492.98 0 0 0 0 0 0 0 0 0 0 0 0 0 0 0 0 0 
-23.1178 0 0 1958.6 0 0 0 0 0 0 0 -181.509 0 0 0 0 -1746.5 0 0 0 0 0 0 0 0 0 0 0 0 0 1404.39 0 0 0 0 0 0 0 0 0 0 1766.49 0 0 0 0 0 0.06 0 0 0 0 0 0 0 0 0 0 -424.131 0 0 0 0 1878.19 0 0 0 0 0 0 0 
2115.62 -1265.37 0 -1499.3 0 0 0 0 0 0 1251.34 0 901.898 0 0 0 0 0 0 0 0 0 0 0 0 20.8289 0 0 0 -803.629 0 0 0 0 0 0 0 235.221 0 0 0 -2259.97 -723.518 0 0 2044.05 0 0 0.05 0 0 0 0 -1588.11 0 0 0 0 1268.88 0 0 1952.19 0 0 0 0 0 0 2225.49 0 0 
574.435 0 0 0 -2176.35 0 0 0 2473.14 0 0 0 0 -1362.58 -1109.27 0 0 0 0 0 0 48.1429 1156.27 0 0 0 0 0 0 0 0 0 0 0 1951.28 0 0 0 0 0 0 0 -2495.42 0 0 0 1376.46 0 0 0 0 0 0 0 0 0 0 0 1113.54 0 0 0 0 0 0 0 0 0 0 0 0 
0 0 804.697 0 0 0 0 0 0 0 0 0 0 0 0 0 0 720.923 0 0 0 0 0 0 0 -779.672 0 0 0 0 1170.46 0 0 0 2044.66 0 0 0 0 0 0 0 0 0 0 0 -1883.53 0 0 0 0.05 0 0 0 -546.663 2415.16 0 0 0 0 2021.01 0 0 0 893.658 145.65 1543.86 0 0 0 0 
0 0 0 0 0 0 0 0 0 0 0 0 0 0 1352.2 0 0 -1697.97 0 0 0 0 0 0 0 0 0 0 1477.48 0 0 0 0 1269.8 0 0 0 0 0 0 0 0 0 0 0 0 0 0 0 0 0 0.03 0 0 0 1805.09 0 0 0 0 0 2102.19 1085.77 0 0 0 0 0 0 0 0 
0 0 0 1784.8 0 -609.073 0 0 0 0 0 0 0 0 0 0 0 0 0 0 0 0 0 0 0 312.281 0 0 -1975.08 900.067 1586.28 0 0 0 0 0 565.584 0 0 0 0 0 0 1923.2 0 0 0 0 0 0 0 0 0.01 0 0 0 0 0 0 0 0 -510.804 0 0 0 0 0 0 0 0 0 
0 0 0 0 0 0 0 0 0 1026.57 -834.452 0 0 0 0 813.547 0 0 0 0 0 0 0 2200.46 -2430.57 0 0 0 0 0 1585.51 0 0 0 0 0 0 0 0 0 1085.62 0 0 0 481.811 0 1691.72 0 555.666 0 0 0 0 0.07 0 0 0 0 0 0 0 0 0 0 0 0 0 0 0 0 0 
0 0 0 1795.02 0 0 0 0 0 0 0 0 0 0 0 0 0 1893.6 0 0 0 1282.77 0 0 0 0 0 0 0 0 0 -358.516 1079.21 -2332.45 0 -28.4585 0 0 1901.99 0 0 0 0 0 0 -1102.56 0 0 0 0 517.365 0 0 0 0.03 0 0 0 0 0 0 0 0 -604.038 0 0 0 0 0 0 0 
0 0 0 0 2329.4 0 2320.7 0 0 0 0 0 0 0 0 0 0 0 558.26 0 0 0 0 -1082.26 0 0 0 0 0 0 0 0 0 0 0 0 0 0 0 0 0 0 0 0 0 0 0 0 0 0 921.735 1582.16 0 0 0 0.07 0 0 0 0 0 0 0 0 0 1498.99 0 0 0 0 0 
0 0 1350.67 0 0 0 0 0 0 0 0 0 0 0 0 0 0 0 430.692 -1747.87 0 542.695 0 0 0 0 647.679 0 0 -548.036 0 0 0 367.214 0 0 0 0 0 0 0 0 0 0 0 0 0 0 0 0 0 0 0 0 0 0 0.06 0 0 0 2108.29 0 0 0 0 0 0 0 0 0 0 
0 0 0 0 0 0 0 0 0 0 0 0 0 0 -882.824 0 0 0 0 0 0 0 -1121.63 0 407.041 2033.83 0 0 0 0 0 0 495.849 217.063 -1173.67 0 1962.11 0 0 0 -1897.41 0 0 0 0 0 0 0 0 0 0 0 0 0 0 0 0 0.04 0 0 0 0 0 0 0 0 0 0 1500.67 0 0 
0 0 0 0 0 0 0 0 -810.19 0 0 0 0 250.328 0 -756.783 0 0 0 0 0 0 -44.7859 0 0 0 0 0 0 1835.92 0 0 1883.68 0 0 0 0 0 0 0 0 0 0 0 0 0 0 -257.958 2309.41 2443.24 0 0 0 0 0 0 0 0 0.03 0 0 0 0 0 0 0 0 0 0 0 0 
0 0 0 0 -1649.3 0 -1973.25 0 0 0 0 0 0 -1991.71 0 0 0 0 0 2091.81 0 0 0 0 0 0 0 0 0 -248.039 0 0 1423.61 0 0 840.556 0 0 0 0 0 0 0 0 0 0 0 0 0 0 0 0 0 0 0 0 0 0 0 0.08 0 2401.73 0 0 0 0 0 0 0 0 0 
0 1462.68 0 0 0 1603.21 135.121 0 0 0 -990.86 0 0 533.692 0 -1238.52 0 0 0 -201.956 0 2466.73 0 0 0 0 0 0 0 0 0 0 0 0 0 0 0 0 0 0 0 0 0 0 266.35 0 0 0 0 0 -229.27 0 0 0 0 0 800.577 0 0 0 0.02 0 0 -1554.54 -981.552 0 31.9681 0 0 0 0 
0 0 0 0 0 0 52.7207 778.603 0 0 0 0 0 0 2432.55 0 0 1180.84 0 0 0 0 0 0 0 0 0 0 0 1069.9 0 0 0 0 0 0 1199.91 0 0 0 0 0 0 0 0 0 0 0 -540.101 0 0 2149.34 654.698 0 0 0 0 0 0 2397.92 0 0.07 0 0 0 -700.171 0 -2097.16 0 0 0 
-1106.98 0 0 0 0 1595.89 0 782.571 1072.19 0 0 0 0 0 0 0 0 0 0 0 624.79 0 0 0 0 -35.4778 0 0 0 0 0 0 0 0 0 0 0 0 0 0 0 0 0 0 -504.395 0 0 0 0 0 0 2129.2 0 0 0 0 0 0 0 0 0 0 0.07 0 0 -1262.47 0 0 0 0 0 
0 0 0 0 0 -1351.74 0 0 0 0 0 2242.58 0 0 0 0 0 0 0 0 0 0 0 0 0 0 0 0 0 -1339.53 0 0 2262.11 0 0 0 0 2102.19 0 0 0 0 0 1704.99 1034.96 0 0 -632.267 0 0 0 0 0 0 -1351.74 0 0 0 0 0 -2142.17 0 0 0.03 671.331 0 -624.638 0 0 0 0 
0 0 0 0 0 1413.24 0 1983.93 0 0 0 421.384 0 0 0 1184.8 2157.73 0 0 0 0 0 0 0 0 0 0 0 0 0 0 0 0 -835.673 0 0 0 0 0 0 0 0 0 0 0 0 0 0 0 0 -911.817 0 0 0 0 0 0 0 0 0 2253.41 0 0 961.715 0.06 0 1118.27 0 0 0 0 
0 0 0 0 0 0 0 0 221.488 0 0 0 0 0 0 0 0 0 0 0 -532.929 1704.38 961.562 0 0 0 0 0 0 0 -1426.51 0 0 0 0 0 1734.44 0 0 0 0 0 0 -927.839 0 0 0 0 0 0 1199.3 0 0 0 0 1471.22 0 0 0 0 0 255.516 2264.7 0 0 0.07 0 -2214.19 0 0 0 
1287.35 1916.64 0 0 0 2.82296 0 1596.35 0 0 0 0 0 0 0 0 0 0 0 0 0 0 0 0 0 0 -1455.66 0 0 0 0 0 0 653.172 0 -110.858 0 0 0 0 0 0 658.208 0 0 0 0 0 0 0 305.719 0 0 0 0 0 0 0 0 0 1923.2 0 0 1142.38 -509.888 0 0.08 680.792 0 0 0 
0 0 0 112.537 -612.583 -861.461 921.125 0 0 0 0 0 0 0 -1984.69 0 0 0 0 0 0 0 0 2494.81 0 0 0 0 0 0 1157.03 888.165 0 0 0 0 0 0 0 0 0 0 0 0 0 0 0 0 0 0 0 0 0 0 0 0 0 0 0 0 0 532.014 0 0 0 1338.01 910.749 0.04 0 0 0 
0 0 0 0 0 0 0 0 0 0 0 0 0 0 0 0 0 0 0 0 0 0 0 0 0 0 0 0 0 0 0 0 0 0 0 0 0 0 0 0 0 0 0 0 0 0 0 0 2335.05 0 0 0 0 0 0 0 0 -798.135 0 0 0 0 0 0 0 0 0 0 0 0 0 
0 0 0 0 1601.54 0 0 794.778 0 0 0 0 0 0 0 0 0 0 0 0 0 0 0 0 0 0 0 0 0 0 0 0 0 0 0 0 0 0 0 0 0 0 0 0 0 0 0 0 0 0 0 0 0 0 0 0 0 0 0 0 0 0 0 0 0 0 0 0 0 0 0 
0 0 0 0 0 0 0 0 0 0 0 0 0 0 0 0 0 0 -724.586 2083.27 0 0 0 0 0 0 0 0 0 0 0 0 0 0 0 0 0 0 0 0 0 0 0 0 0 0 0 0 0 0 0 0 0 0 0 0 0 0 0 0 0 0 0 0 0 0 0 0 0 0 0.02 
