*Vertices 63
*Matrix 
0.01 -286.95 0 0 0 888.318 -542.848 0 350.429 -179.373 0 589.999 0 0 546.205 0 0 2057.02 -235.221 -2299.19 0 1231.04 0 1540.65 1018.94 0 1310.39 1502.96 0 0 0 0 0 353.633 0 252.77 0 0 0 0 0 0 0 0 0 -1643.04 0 0 2161.09 0 0 0 0 0 0 0 0 0 0 0 0 0 0 
1647.77 0.05 0 0 0 0 0 893.658 0 -357.143 0 0 768.38 0 0 0 0 -1627.93 0 0 0 -1232.57 2496.8 0 1672.49 1236.99 2017.04 0 -112.69 0 2065.72 0 0 0 1154.13 0 0 74.5415 749.763 0 0 0 0 0 0 0 -1688.51 0 0 0 0 0 -2404.02 0 0 0 0 0 0 0 0 0 0 
0 0 0.04 1219.14 0 0 0 0 0 0 0 0 0 0 0 0 661.565 0 0 2161.09 0 1109.12 0 -2135.3 0 0 0 0 0 2265.62 0 -66.9118 0 0 0 0 0 0 0 1768.93 0 0 0 0 0 0 591.525 0 0 0 0 2022.23 0 0 0 0 0 0 0 -1712.93 0 0 0 
0 0 -627.384 0.03 0 0 -1175.8 0 0 -515.076 -1008.87 0 0 0 0 0 0 2495.42 0 1866.89 0 0 0 -1948.07 450.377 -178.915 0 0 0 0 -631.047 1651.59 2287.44 0 0 1325.95 0 0 0 0 0 0 0 0 0 0 0 0 0 1981.19 0 0 0 0 0 0 -402.921 0 0 -1216.7 0 0 0 
0 0 0 0 0.03 0 0 0 0 0 0 -225.761 1611.61 0 -1785.1 0 0 0 0 0 0 1854.53 0 -76.5252 0 0 0 154.653 0 0 2370.45 0 0 -1863.69 0 1648.38 0 0 0 0 0 0 0 0 0 263.604 0 0 0 0 0 0 0 0 0 0 0 -1980.42 0 1049.76 0 0 0 
1890.24 0 0 0 0 0.05 0 0 0 0 0 0 797.067 0 1612.06 0 1684.09 0 0 0 -449.156 0 0 1501.43 0 0 0 0 0 0 -443.663 0 -556.429 0 0 0 0 -2192.07 0 0 0 0 0 0 0 0 0 0 2169.03 0 0 0 0 0 0 0 0 0 0 0 0 0 0 
1234.09 0 0 -473.266 0 0 0.04 0 0 0 0 1655.55 0 0 0 0 0 345.698 0 0 -1119.8 0 0 0 852.763 0 0 0 0 0 0 0 0 0 1100.73 0 -2386.47 0 0 0 0 0 0 0 0 0 0 0 0 0 0 0 0 0 0 0 0 0 0 0 0 0 0 
0 572.604 0 0 0 0 0 0.02 1065.02 0 0 2089.98 1102.71 451.292 0 0 0 0 1599.7 0 0 0 0 0 0 0 0 0 0 0 0 0 0 0 0 0 -2409.36 0 0 0 0 0 2217.25 0 0 0 0 0 0 0 0 0 0 0 0 208.06 0 0 0 0 -1130.02 0 0 
-1036.79 0 0 0 0 0 0 826.975 0.09 0 0 0 0 0 1138.72 0 0 0 0 0 0 0 944.014 0 1956.16 2167.35 0 0 -346.919 0 0 -2336.57 0 0 0 278.253 0 0 0 0 0 0 0 0 0 0 0 0 0 0 0 0 0 0 0 0 0 0 0 0 0 0 0 
386.288 1127.89 0 508.82 0 0 0 0 0 0.06 -1961.2 -423.978 0 990.249 0 1018.02 2208.09 0 -27.543 109.79 0 0 0 0 1540.8 0 0 0 0 0 0 1520.66 2091.81 2131.03 0 0 0 0 0 0 0 0 0 0 0 0 0 0 0 0 0 0 0 0 0 0 0 0 0 0 0 0 0 
0 0 0 2170.25 0 0 0 0 0 106.281 0 0 0 0 1153.83 0 0 0 0 0 0 0 0 0 -1379.06 0 2330.77 0 0 0 0 0 -1141.32 0 0 0 0 0 0 0 367.977 0 0 0 0 0 0 0 0 0 0 0 0 0 -2054.89 0 0 0 0 0 0 0 0 
2074.27 0 0 0 1397.82 0 1681.04 1612.06 0 -1330.38 0 0.07 0 0 0 0 0 0 0 0 0 0 0 0 857.952 0 1357.39 0 0 0 0 0 1471.68 0 0 0 0 0 0 0 0 0 0 0 0 0 0 0 0 0 0 0 -1415.83 0 0 0 0 1040.3 0 0 0 0 0 
0 -780.282 0 0 1699.8 1101.34 0 1448.18 0 0 0 0 0.01 0 0 0 0 1575.9 0 0 2469.02 0 -1508.15 0 0 0 0 0 -506.226 0 0 0 0 -1550.42 0 1067.61 0 0 0 0 0 0 1319.85 0 -137.867 0 0 0 0 0 0 0 0 -697.577 0 0 0 116.504 276.879 -1917.86 550.783 1120.72 0 
0 0 0 0 0 0 0 -758.614 0 514.313 0 0 0 0.07 0 0 0 1989.12 496.002 0 0 -1301.08 0 0 0 6.79037 0 0 -1103.17 0 415.433 0 0 1457.95 0 0 1634.04 0 -582.675 0 0 0 0 0 0 0 1929.76 0 0 -1953.11 0 0 0 0 0 0 0 0 0 0 0 0 0 
241.325 0 0 0 1750.47 1771.68 0 0 2159.57 0 -1455.2 0 0 0 0 0 0 0 -1103.32 0 2257.84 0 0 -1093.86 0 0 2463.23 0 0 0 -1544.92 0 -412.687 0 0 0 0 0 0 0 0 0 0 0 828.501 0 0 0 0 0 0 0 1590.4 0 0 0 129.322 0 0 0 0 0 0 
0 0 0 0 0 0 0 0 0 -1170.61 0 0 0 0 0 0.05 0 0 0 1529.05 196.615 0 0 -543.306 0 0 0 1820.2 0 0 -532.929 737.251 0 0 0 0 1978.74 0 0 0 0 0 0 0 0 0 0 0 0 -2281.03 0 0 0 0 0 0 1285.21 0 0 0 0 0 0 
0 0 -995.132 0 0 826.67 0 0 0 493.255 0 0 0 0 0 0 0.01 0 0 0 0 0 1637.7 0 -2370.75 0 0 0 -267.266 0 0 0 1221.88 0 1352.66 1227.23 0 0 0 0 0 0 0 1396.3 0 0 -207.755 0 1431.85 0 -1806.16 0 0 0 0 0 -1710.18 0 0 0 0 0 0 
-1674.47 -763.497 0 2382.96 0 0 679.266 0 0 0 0 0 229.423 827.738 0 0 0 0.03 0 1849.8 0 0 -1929.3 701.544 0 0 0 0 0 0 0 0 648.9 0 0 0 0 2334.28 0 0 -1764.96 -1963.18 0 0 0 -1082.26 1081.5 0 0 0 0 0 0 0 0 0 0 0 0 0 0 0 0 
-1647.62 0 0 0 0 0 0 927.076 0 -1561.25 0 0 0 1500.98 2049.85 0 0 0 0.01 0 0 0 0 0 0 0 0 0 2315.97 0 -1974.62 0 0 0 0 0 0 0 0 0 0 0 0 1261.56 0 0 0 1238.67 0 1635.72 0 0 0 0 0 -1861.86 0 0 -938.673 0 0 0 0 
-2330.01 0 -1225.09 1889.93 0 0 0 0 0 2434.23 0 0 0 0 0 1682.41 0 638.676 0 0 0 0 0 0 1959.36 1951.43 0 0 -405.362 0 0 0 0 0 0 0 0 0 0 0 0 0 0 0 -2401.43 0 0 0 0 0 0 0 0 0 0 0 0 1919.54 731.147 0 0 0 0 
0 0 0 0 0 1776.25 2308.65 0 0 0 0 0 -903.577 0 -146.107 -1766.49 0 0 0 0 0.08 0 0 0 0 0 0 2232.2 0 1455.81 0 -663.244 0 0 0 0 0 0 0 0 0 0 0 0 0 1380.73 0 -1029.47 0 0 0 0 0 0 0 0 0 0 0 0 0 0 0 
1670.81 1308.71 2438.05 0 1867.96 0 0 0 0 0 0 0 0 717.261 0 0 0 0 0 0 0 0.08 0 0 0 -2149.95 -1158.41 0 2417.45 0 1825.54 0 0 0 0 0 0 0 0 0 0 0 0 0 1226.77 0 0 0 0 0 0 0 0 2478.48 0 0 0 0 0 0 0 0 0 
0 2395.32 0 0 0 0 0 0 -1817.76 0 0 0 2346.19 0 0 0 2000.56 537.507 0 0 0 0 0.04 0 0 0 0 1403.62 0 0 0 0 -55.3148 0 0 0 0 0 0 -64.1652 0 0 0 0 0 0 0 -629.368 0 0 0 0 0 0 0 0 0 0 0 0 0 0 0 
-602.817 0 -2238.91 -2099.44 -1329.31 883.74 0 0 0 0 0 0 0 0 2191 722.297 0 -391.324 0 0 0 0 0 0.03 0 0 0 0 0 1931.29 2370.3 1366.7 0 0 0 1141.62 0 0 0 0 491.119 0 -457.549 459.685 0 858.104 0 0 0 0 0 664.464 0 0 0 0 0 0 0 0 0 0 0 
-1077.07 974.227 0 -179.525 0 0 -2177.57 0 445.799 237.51 -95.294 464.415 0 0 0 0 682.165 0 0 2345.88 0 0 0 0 0.03 1715.52 0 0 0 0 1027.79 -327.387 225.15 1337.7 0 0 -759.529 2087.24 0 0 0 862.224 0 0 0 0 0 0 0 0 0 0 0 -1018.33 0 0 0 0 0 0 0 0 0 
0 -2328.33 0 2258.75 0 0 0 0 1438.57 0 0 0 0 847.88 0 0 0 0 0 1632.66 0 1476.41 0 0 946.608 0.06 -548.036 0 0 0 0 1518.98 0 0 0 0 0 503.784 0 -73.4733 0 0 0 0 0 0 0 0 0 0 0 0 0 0 0 0 0 0 0 0 -2375.48 0 0 
235.679 347.987 0 0 0 0 0 0 0 0 1078.75 1732.61 0 0 1979.51 0 0 0 0 0 0 -2034.29 0 0 0 -224.693 0.02 0 0 0 0 0 0 0 0 2070.76 0 0 0 0 0 0 0 0 0 0 0 0 -1908.7 0 660.649 849.406 624.332 0 0 0 0 1384.09 0 0 -1957.08 0 0 
1674.93 0 0 0 672.857 0 0 0 0 0 0 0 0 0 0 1653.72 0 0 0 0 2335.35 0 -2295.37 0 0 0 0 0.03 0 -57.7563 1271.48 0 -1567.35 0 0 696.509 -1317.1 0 0 0 0 0 0 0 0 0 0 0 0 0 0 0 0 0 0 504.852 0 0 0 0 -2469.48 0 0 
0 -664.922 0 0 0 0 0 0 383.084 0 0 0 -39.7504 572.451 0 0 1782.2 0 1840.65 1106.98 0 2138.51 0 0 0 0 0 0 0.02 0 0 0 0 2312.92 0 0 0 0 0 0 0 0 0 0 0 0 0 0 0 -1945.33 0 0 0 0 0 0 0 -369.35 -2256.92 0 0 1132.77 0 
0 0 1310.85 0 0 0 0 0 0 0 0 0 0 0 0 0 0 0 0 0 962.477 0 0 1822.64 0 0 0 1050.22 0 0.08 0 0 0 0 0 0 0 0 0 0 0 0 0 -1075.7 0 0 0 0 0 0 0 0 0 0 0 0 0 0 0 0 -481.506 0 0 
0 566.347 0 -418.79 -979.11 1962.72 0 0 0 0 0 0 0 1000.02 1409.12 1483.58 0 0 86.1385 0 0 1514.71 0 690.71 -1276.97 0 0 1257.59 0 0 0.09 2351.53 -1408.66 0 -1812.72 1501.43 0 0 0 0 0 0 504.852 0 0 0 0 0 0 0 0 0 0 0 1241.57 0 0 346.461 0 0 0 0 0 
0 0 897.931 -187.765 0 0 0 0 978.195 -1651.13 0 0 0 0 0 1193.66 0 0 0 0 1029.31 0 0 589.846 -1506.78 116.352 0 0 0 0 1043.96 0.06 0 -1389.43 -226.371 0 0 0 0 0 2479.09 0 -1262.78 0 0 0 0 962.935 0 0 0 0 0 0 0 0 0 0 0 0 0 0 0 
0 0 0 362.026 0 -2252.65 0 0 0 -689.489 -1608.25 990.402 0 0 -1610.08 0 2007.13 1198.84 0 0 0 0 -154.958 0 894.574 0 0 261.925 0 0 913.343 0 0.03 0 1209.22 254.295 0 0 0 0 -874.279 0 0 0 0 752.51 0 0 0 0 0 0 0 0 0 0 0 0 0 0 0 526.063 843.913 
-430.082 0 0 0 2089.53 0 0 0 0 2357.17 0 0 -1487.7 2004.53 0 0 0 0 0 0 0 0 0 0 1543.86 0 0 0 -1815.16 0 0 -1749.4 0 0.02 0 0 0 2112.26 0 0 0 0 0 0 0 0 0 0 -2043.6 0 0 0 0 0 0 0 0 0 0 0 0 0 0 
0 1510.13 0 0 0 0 -2427.98 0 0 0 0 0 0 0 0 0 -634.709 0 0 0 0 0 0 0 0 0 0 0 0 0 493.255 -51.8052 1937.09 0 0.02 0 2076.56 0 -884.808 0 0 0 264.214 778.146 0 0 0 0 -1668.68 0 0 0 0 0 2099.9 0 0 0 0 0 0 0 0 
2234.18 0 0 571.23 -295.953 0 0 0 2113.03 0 0 0 1191.67 0 0 0 2202.9 0 0 0 0 0 0 -1933.12 0 0 1688.06 2456.36 0 0 1343.65 0 1609.47 0 0 0.07 0 0 1609.78 0 0 0 0 0 0 0 0 0 0 738.166 571.383 0 0 0 0 0 0 0 0 0 0 0 -138.63 
0 0 0 0 0 0 -1284.91 1494.57 0 0 0 0 0 1370.2 0 1278.5 0 0 0 0 0 0 0 0 1481.75 0 0 -1463.29 0 0 0 0 0 0 -271.386 0 0.06 -323.42 2456.51 0 0 0 0 0 0 294.275 0 1658.45 0 0 0 1200.37 0 0 0 0 0 0 0 0 0 0 0 
0 1516.54 0 0 0 907.697 0 0 0 0 0 0 0 0 0 0 0 671.484 0 0 0 0 0 0 -936.995 -928.907 0 0 0 0 0 0 0 1534.55 0 0 828.959 0.08 0 0 0 0 0 0 0 0 0 0 0 0 0 0 0 0 0 0 0 0 0 0 685.064 0 1950.67 
0 1994.77 0 0 0 0 0 0 0 0 0 0 0 1334.35 0 0 0 0 0 0 0 0 0 0 0 0 0 0 0 0 0 0 0 0 -2148.27 1940.29 1855.45 0 0.05 0 0 -1582.77 0 -1909.62 0 0 0 0 0 0 0 0 0 0 0 0 -193.411 0 0 0 0 0 0 
0 0 331.355 0 0 0 0 0 0 0 0 0 0 0 0 0 0 0 0 0 0 0 320.673 0 0 -293.512 0 0 0 0 0 0 0 0 0 0 0 0 0 0.03 0 0 0 507.141 0 0 0 0 0 0 0 0 0 0 0 0 0 0 0 0 0 0 0 
0 0 0 0 0 0 0 0 0 0 -1019.09 0 0 0 0 0 0 937.758 0 0 0 0 0 1516.69 0 0 0 0 0 0 0 -1775.03 1836.07 0 0 0 0 0 0 0 0.05 0 0 0 0 2211.29 0 0 0 0 -2000.26 0 0 1945.63 0 0 0 0 0 0 0 0 1892.07 
0 0 0 0 0 0 0 0 0 0 0 0 0 0 0 0 0 1715.52 0 0 0 0 0 0 1095.69 0 0 0 0 0 0 0 0 0 0 0 0 0 83.8496 0 0 0 -1290.25 0 0 0 0 0 0 0 0 0 0 0 0 0 0 0 0 0 0 0 0 
0 0 0 0 0 0 0 1048.69 0 0 0 0 1340.14 0 0 0 0 0 0 0 0 0 0 2015.98 0 0 0 0 0 0 51.6526 -2403.41 0 0 2106.16 0 0 0 0 0 0 -104.907 0.07 0 0 0 0 0 0 0 0 0 0 0 -1671.88 0 0 0 0 0 0 0 0 
0 0 0 0 0 0 0 0 0 0 0 0 0 0 0 0 -1193.2 0 -357.295 0 0 0 0 2203.97 0 0 0 0 0 -1847.82 0 0 0 0 2127.52 0 0 0 26.78 1634.04 0 0 0 0.01 0 0 0 0 0 217.215 0 0 0 -1251.64 0 0 0 0 0 1821.12 0 0 2281.18 
0 0 0 0 0 0 0 0 0 0 0 0 1407.28 0 1727.12 0 0 0 0 -1094.32 0 485.015 0 0 0 0 0 0 0 0 0 0 0 0 0 0 0 0 0 0 0 0 0 0 0.02 0 0 0 0 0 0 0 0 0 0 0 2353.36 0 0 0 1883.68 0 0 
-961.409 0 0 0 -1302.61 0 0 0 0 0 0 0 0 0 0 0 0 581.301 0 0 729.469 0 0 1503.27 0 0 0 0 0 0 0 0 2065.72 0 0 0 2154.23 0 0 0 -717.566 0 0 0 0 0.03 0 0 0 0 0 0 0 0 0 0 0 0 0 0 0 0 0 
0 -1277.73 -96.5148 0 0 0 0 0 0 0 0 0 0 2184.59 0 0 2305.75 828.654 0 0 0 0 0 0 0 0 0 0 0 0 0 0 0 0 0 0 0 0 0 0 0 0 0 0 0 0 0.02 0 0 0 0 0 0 0 -660.497 0 288.629 0 0 0 0 0 0 
0 0 0 0 0 0 0 0 0 0 0 0 0 0 0 0 0 0 -278.253 0 -1290.55 0 -1472.59 0 0 0 0 0 0 0 0 1402.55 0 0 0 0 1197.62 0 0 0 0 0 0 0 0 0 0 0.01 1754.89 0 0 0 0 0 0 0 0 0 -269.097 0 0 0 0 
11.9785 0 0 0 0 3.43333 0 0 0 0 0 0 0 0 0 0 -1518.07 0 0 0 0 0 0 0 0 0 300.684 0 0 0 0 0 0 -1842.78 2304.53 0 0 0 0 0 0 0 0 0 0 0 0 2381.89 0.02 0 0 0 0 2233.73 0 0 0 0 -2040.7 0 0 0 0 
0 0 0 524.384 0 0 0 0 0 0 0 0 0 1495.03 0 2429.81 0 0 1340.91 0 0 0 0 0 0 0 0 0 863.14 0 0 0 0 0 0 991.775 0 0 0 0 0 0 0 2359 0 0 0 0 0 0.03 0 1608.55 0 0 0 0 0 0 0 0 0 0 -14.1148 
0 0 0 0 0 0 0 0 0 0 0 0 0 0 0 0 -704.749 0 0 0 0 0 0 0 0 0 610.599 0 0 0 0 0 0 0 0 2174.98 0 0 0 0 586.184 0 0 0 0 0 0 0 0 0 0.06 1887.65 0 0 0 0 0 0 0 0 -82.3237 0 -1331.9 
0 0 783.944 0 0 0 0 0 0 0 0 0 0 0 0 0 0 0 0 0 0 0 0 1930.37 0 0 1892.07 0 0 0 0 0 0 0 0 0 1235.77 0 0 0 0 0 0 0 0 0 0 0 0 2325.59 1306.42 0.01 0 0 0 0 0 0 0 0 0 569.399 0 
0 -257.042 0 0 0 0 0 0 0 0 0 692.694 0 0 1763.13 0 0 0 0 0 0 0 0 0 0 0 426.42 0 0 0 0 0 0 0 0 0 0 0 0 0 0 0 0 0 0 0 0 0 0 0 0 0 0.07 0 0 0 0 -202.872 0 0 0 -531.861 0 
0 0 0 0 0 0 0 0 0 0 0 0 826.823 0 0 0 0 0 0 0 0 856.12 0 0 -1793.19 0 0 0 0 0 0 0 0 0 0 0 0 0 0 0 1958.91 0 0 1675.39 0 0 0 0 1772.59 0 0 0 0 0.05 0 -1465.58 0 0 0 0 0 0 0 
0 0 0 0 0 0 0 0 0 0 760.75 0 0 0 0 0 0 0 0 0 0 0 0 0 0 0 0 0 0 0 1486.63 0 0 0 2279.35 0 0 0 0 0 0 0 -1742.07 0 0 0 628.605 0 0 0 0 0 0 0 0.08 853.221 416.959 0 0 0 0 0 0 
0 0 0 0 0 0 0 1129.26 0 0 0 0 0 0 0 0 0 0 2189.63 0 0 0 0 0 0 0 0 -1531.65 0 0 0 0 0 0 0 0 0 0 0 0 0 0 0 0 0 0 0 0 0 0 0 0 0 -139.088 1058.15 0.09 0 0 0 0 0 0 0 
0 0 0 123.066 0 0 0 0 0 0 0 0 0 0 1590.85 1070.06 -436.644 0 0 0 0 0 0 0 0 0 0 0 0 0 0 0 0 0 0 0 0 0 -485.931 0 0 0 0 0 -443.358 0 -1027.18 0 0 0 0 0 0 0 1692.79 0 0.06 0 0 0 0 0 0 
0 0 0 0 722.297 0 0 0 0 0 0 943.251 993.454 0 0 0 0 0 0 2420.96 0 0 0 0 0 0 2447.05 0 1816.69 0 152.211 0 0 0 0 0 0 0 0 0 0 0 0 0 0 0 0 0 0 0 0 0 1574.53 0 0 0 0 0.04 0 -637.761 0 0 0 
0 0 0 0 0 0 0 0 0 0 0 0 -1603.06 0 0 0 0 0 -1576.05 1737.04 0 0 0 0 0 0 0 0 1988.05 0 0 0 0 0 0 0 0 0 0 0 0 0 0 0 0 0 0 -1847.51 1498.23 0 0 0 0 0 0 0 0 0 0.07 0 2215.57 0 111.164 
0 0 -1588.56 -277.947 1705.6 0 0 0 0 0 0 0 -791.421 0 0 0 0 0 0 0 0 0 0 0 0 0 0 0 0 0 0 0 0 0 0 0 0 0 0 0 0 0 0 -564.516 0 0 0 0 0 0 0 0 0 0 0 0 0 2078.69 0 0 0 0 0 
0 0 0 0 0 0 0 507.904 0 0 0 0 236.9 0 0 0 0 0 0 0 0 0 0 0 0 -898.846 1081.96 1817.15 0 -509.43 0 0 0 0 0 0 0 1487.55 0 0 0 0 0 0 255.669 0 0 0 0 0 1660.28 0 0 0 0 0 0 0 503.021 0 0 0 0 
0 0 0 0 0 0 0 0 0 0 0 0 2317.19 0 0 0 0 0 0 0 0 0 0 0 0 0 0 0 291.223 0 0 0 1448.33 0 0 0 0 0 0 0 0 0 0 0 0 0 0 0 0 0 0 -1052.2 958.357 0 0 0 0 0 0 0 0 0.05 -68.5903 
0 0 0 0 0 0 0 0 0 0 0 0 0 0 0 0 0 0 0 0 0 0 0 0 0 0 0 0 0 0 0 0 949.355 0 0 1065.48 0 836.131 0 0 -992.691 0 0 1837.9 0 0 0 0 0 -1392.64 -690.71 0 0 0 0 0 0 0 992.996 0 0 202.872 0.01 
