*Vertices 49
*Matrix 
0 0 0 1610.54 0 1601.54 0 0 937.605 0 0 0 0 952.864 0 0 0 0 0 -2288.2 0 0 0 0 0 0 0 0 0 0 0 0 0 0 855.968 0 -680.029 0 0 -384.457 0 0 0 0 0 0 0 0 0 
0 0.04 0 0 0 1326.56 0 0 0 0 0 0 0 0 0 0 -783.639 0 0 0 0 0 0 0 1584.14 0 1333.58 0 0 1755.04 0 -664.769 0 0 0 0 1640.45 0 0 0 0 0 0 0 0 0 0 0 0 
0 0 0 0 0 0 0 0 2311.7 0 0 0 0 0 0 0 0 2190.85 0 0 0 0 0 0 0 0 0 0 0 1726.81 0 0 0 0 0 0 0 0 0 0 -658.666 0 0 0 0 0 0 0 0 
1284.6 0 0 0.02 0 138.173 0 -442.442 0 0 0 0 1120.56 2410.43 0 0 0 0 0 874.126 514.618 0 0 0 139.088 0 -365.688 0 0 0 0 0 0 0 0 0 0 0 0 0 0 0 0 0 0 0 0 0 0 
0 0 0 0 0 0 0 0 0 0 0 1683.63 0 0 0 1524.32 -85.8333 0 0 0 0 0 0 0 0 0 0 0 0 0 2203.97 0 0 0 0 0 0 0 0 0 235.984 0 0 0 0 0 0 0 0 
708.106 2457.27 0 821.329 0 0.04 0 0 0 0 -1354.95 0 0 0 0 0 0 0 0 0 0 0 0 0 0 0 0 -2015.37 0 0 0 1163.29 0 0 0 0 1712.78 0 1709.27 0 0 0 0 0 0 0 0 0 0 
0 0 0 0 0 0 0.03 1542.18 0 0 1259.42 0 0 0 0 0 0 0 0 2229 0 0 0 0 0 0 0 0 0 0 0 0 0 0 0 0 0 0 0 0 0 0 0 0 0 0 0 0 0 
0 0 0 2297.97 0 0 1469.85 0.07 0 0 0 0 0 0 0 0 563.601 0 0 0 0 0 0 0 0 1488.01 0 0 0 0 0 -2298.88 0 0 0 0 0 0 0 0 0 0 0 0 0 0 0 0 0 
1064.71 0 601.291 0 0 0 0 0 0.04 0 0 0 0 0 0 0 0 0 0 -543.764 0 -16.0985 0 0 0 0 0 0 1798.07 0 0 0 0 0 1186.94 0 0 0 0 0 0 0 0 1006.12 0 0 0 0 0 
0 0 0 0 0 0 0 0 0 0 0 277.032 0 -2269.89 0 1788.92 135.731 0 0 0 1048.69 0 -703.833 0 0 0 0 0 0 0 0 0 0 29.2215 0 0 215.232 0 0 0 0 0 0 0 0 0 0 0 0 
0 0 0 0 0 2187.19 -2366.02 0 0 0 0.07 0 0 1677.07 0 0 0 0 0 0 0 0 0 0 0 0 0 0 0 0 0 0 0 132.527 0 0 0 1326.87 0 63.5548 0 0 0 0 0 0 0 0 0 
0 0 0 0 -2100.51 0 0 0 0 1291.47 0 0.04 0 0 0 0 0 0 0 2326.35 0 0 0 0 0 0 1653.26 0 0 0 0 0 0 0 0 1801.28 0 0 208.365 1755.96 0 0 0 0 0 0 0 0 0 
0 0 0 1123.92 0 0 0 0 0 0 0 0 0.03 0 0 915.174 0 0 0 0 0 0 0 0 0 0 0 -300.989 0 0 0 0 0 0 0 0 0 0 0 0 1582.61 0 0 0 0 0 0 0 0 
1745.89 0 0 1482.51 0 0 0 0 0 1138.72 1780.68 0 0 0.06 0 0 2157.58 0 0 0 0 852.611 0 0 293.359 2135.3 2037.95 0 0 -1652.35 0 0 0 0 0 0 0 0 0 0 0 0 0 0 0 0 0 0 0 
0 0 0 0 0 0 0 0 0 0 0 0 0 0 0.04 -364.925 0 0 -1477.17 -692.846 0 0 0 0 0 0 0 0 0 0 1341.67 0 0 2424.77 0 0 0 0 0 0 0 271.081 0 0 -518.891 0 0 0 0 
0 0 0 0 1463.29 0 0 0 0 1748.48 0 0 2255.7 0 -1924.27 0.07 0 0 0 0 0 0 0 0 0 0 -36.5459 0 0 0 0 0 0 0 0 0 0 0 0 0 0 0 0 0 0 0 -1845.23 0 0 
0 1202.35 0 0 -947.523 0 0 1661.05 0 -656.529 0 0 0 1172.9 0 0 0 2261.19 0 0 0 -935.469 2382.81 0 0 0 -2207.79 0 0 0 0 0 968.429 0 0 0 0 0 0 0 0 0 0 0 0 0 0 0 0 
0 0 1558.96 0 0 0 0 0 0 0 0 0 0 0 0 0 -434.355 0.08 0 0 0 0 0 0 0 0 0 0 0 0 216.91 0 0 0 0 0 1898.33 0 2467.35 0 2424.77 0 236.9 0 0 0 0 0 0 
0 0 0 0 0 0 0 0 0 0 0 0 0 0 2170.25 0 0 0 0.03 0 0 0 0 0 2443.39 0 0 0 0 0 738.624 0 0 0 0 0 0 0 0 0 0 0 0 0 0 0 0 0 0 
595.035 0 0 1876.96 0 0 2246.7 0 1071.43 0 0 -1129.11 0 0 524.842 0 0 0 0 0.05 0 0 0 0 0 801.187 0 0 -674.23 0 0 0 0 0 0 0 303.583 0 0 0 0 0 0 0 0 0 0 0 0 
0 0 0 1704.84 0 0 0 0 0 -9.23185 0 0 0 0 0 0 0 0 0 0 0.06 2169.03 0 0 0 0 0 0 0 0 0 0 0 0 0 0 0 0 0 -997.116 -1551.94 0 0 0 0 0 0 0 0 
0 0 0 0 0 0 0 0 1700.87 0 0 0 0 -97.7355 0 0 -581.301 0 0 0 1701.18 0.06 -267.266 0 0 0 0 0 0 0 -2126.76 0 0 0 0 840.098 0 0 0 0 0 0 0 0 0 0 0 0 0 
0 0 0 0 0 0 0 0 0 2440.03 0 0 0 0 0 0 1372.95 0 0 0 0 2402.04 0.01 0 0 0 0 0 -1800.06 0 0 0 0 0 1894.06 2007.58 0 0 -2037.64 0 0 0 0 0 0 55.9252 0 0 0 
0 0 0 0 0 0 0 0 0 0 0 0 0 0 0 0 0 0 0 0 0 0 0 0.02 0 0 0 0 0 0 0 0 433.897 0 872.906 0 0 0 0 0 0 0 0 0 0 0 0 0 0 
0 675.604 0 -279.778 0 0 0 0 0 0 0 0 0 877.483 0 0 0 0 -1688.82 0 0 0 0 0 0.07 2067.55 0 0 0 0 0 0 0 -917.615 0 0 0 0 0 309.687 0 0 0 0 0 0 0 0 0 
0 0 0 0 0 0 0 715.43 0 0 0 0 0 -260.094 0 0 0 0 0 2101.12 0 0 0 0 2155.6 0.02 0 0 0 0 0 0 0 0 602.512 0 0 0 0 2370.14 0 0 0 0 0 0 0 0 0 
0 -801.95 0 1231.35 0 0 0 0 0 0 0 -1677.83 0 2252.95 0 37.4615 2136.37 0 0 0 0 0 0 0 0 0 0.09 0 0 -673.772 0 0 0 0 0 0 2010.64 0 0 0 0 0 0 0 0 0 0 0 0 
0 0 0 0 0 157.247 0 0 0 0 0 0 1867.96 0 0 0 0 0 0 0 0 0 0 0 0 0 0 0.09 0 0 0 1370.36 0 0 1373.56 0 0 15.0304 0 0 -1908.4 0 0 0 0 0 0 334.712 0 
0 0 0 0 0 0 0 0 1712.16 0 0 0 0 0 0 0 0 0 0 1137.04 0 0 173.421 0 0 0 0 0 0.02 -597.476 0 0 0 0 0 0 0 966.292 0 0 0 0 0 0 0 0 0 0 0 
0 1695.53 1428.19 0 0 0 0 0 0 0 0 0 0 -1680.58 0 0 0 0 0 0 0 0 0 0 0 0 2370.91 0 -1616.34 0.03 0 0 0 0 0 0 0 508.515 0 0 0 0 0 0 0 0 0 0 0 
0 0 0 0 1392.03 0 0 0 0 0 0 0 0 0 -349.971 0 0 2328.18 2455.14 0 0 -336.695 0 0 0 0 0 0 0 0 0.05 0 -1416.59 712.836 0 0 0 0 0 0 999.405 0 0 0 0 0 0 0 1872.84 
0 2087.39 0 0 0 1231.19 0 -843.303 0 0 0 0 0 0 0 0 0 0 0 0 0 0 0 0 0 0 0 -267.113 0 0 0 0 0 0 0 0 0 0 0 0 0 0 0 0 0 0 0 0 0 
0 0 0 0 0 0 0 0 0 0 0 0 0 0 0 0 630.131 0 0 0 0 0 0 -1319.09 0 0 0 0 0 0 1774.42 0 0.04 0 0 -1001.69 0 0 0 0 1857.43 0 0 0 0 0 0 0 0 
0 0 0 0 0 0 0 0 0 -993.606 -894.726 0 0 0 2175.28 0 0 0 0 0 0 0 0 0 934.553 0 0 0 0 0 2244.41 0 0 0.08 0 0 0 0 0 0 0 0 0 0 0 0 0 0 0 
2225.64 0 0 0 0 0 0 0 1138.57 0 0 0 0 0 0 0 0 0 0 0 0 0 764.87 1401.79 0 2174.98 0 -2106.92 0 0 0 0 0 0 0 0 0 0 0 0 0 0 0 0 0 0 0 0 0 
0 0 0 0 0 0 0 0 0 0 0 774.026 0 0 0 0 0 0 0 0 0 -1628.85 2394.86 0 0 0 0 0 0 0 0 0 1171.22 0 0 0.04 0 0 0 0 0 0 0 0 0 0 0 0 0 
2457.88 2419.74 0 0 0 -1820.96 0 0 0 -1512.57 0 0 0 0 0 0 0 -1678.75 0 2294 0 0 0 0 0 0 1661.96 0 0 0 0 0 0 0 0 0 0.06 -1271.17 0 0 0 0 0 0 0 0 0 0 0 
0 0 0 0 0 0 0 0 0 0 1820.96 0 0 0 0 0 0 0 0 0 0 0 0 0 0 0 0 2178.79 948.592 -1220.97 0 0 0 0 0 0 1003.37 0.04 0 0 0 0 0 0 0 0 0 0 0 
0 0 0 0 0 268.181 0 0 0 0 0 -976.363 0 0 0 0 0 1541.11 0 0 0 0 956.374 0 0 0 0 0 0 0 0 0 0 0 0 0 0 0 0.06 0 1939.38 0 0 0 0 0 0 0 0 
1952.19 0 0 0 0 0 0 0 0 0 1424.22 61.2659 0 0 0 0 0 0 0 0 -684.912 0 0 0 2029.25 -1232.72 0 0 0 0 0 0 0 0 0 0 0 0 0 0.09 0 0 0 0 0 0 0 0 0 
0 0 369.655 0 1547.36 0 0 0 0 0 0 0 -1637.09 0 0 0 0 782.876 0 0 1252.56 0 0 0 0 0 0 2389.07 0 0 -380.49 0 264.519 0 0 0 0 0 -516.297 0 0 0 0 0 0 0 0 0 0 
0 0 0 0 0 0 0 0 0 0 0 0 0 0 951.491 0 0 0 0 0 0 0 0 0 0 0 0 0 0 0 0 0 0 0 0 0 0 0 0 0 0 0.09 0 0 0 0 0 0 0 
0 0 0 0 0 0 0 0 0 0 0 0 0 0 0 0 0 669.042 0 0 0 0 0 0 0 0 0 0 0 0 0 0 0 0 0 0 0 0 0 0 0 0 0.08 0 0 0 0 0 0 
0 0 0 0 0 0 0 0 837.504 0 0 0 0 0 0 0 0 0 0 0 0 0 0 0 0 0 0 0 0 0 0 0 0 0 0 0 0 0 0 0 0 0 0 0.06 0 0 0 0 0 
0 0 0 0 0 0 0 0 0 0 0 0 0 0 593.814 0 0 0 0 0 0 0 0 0 0 0 0 0 0 0 0 0 0 0 0 0 0 0 0 0 0 0 0 0 0.02 0 0 0 0 
0 0 0 0 0 0 0 0 0 0 0 0 0 0 0 0 0 0 0 0 0 0 2352.6 0 0 0 0 0 0 0 0 0 0 0 0 0 0 0 0 0 0 0 0 0 0 0.05 0 0 0 
0 0 0 0 0 0 0 0 0 0 0 0 0 0 0 367.061 0 0 0 0 0 0 0 0 0 0 0 0 0 0 0 0 0 0 0 0 0 0 0 0 0 0 0 0 0 0 0.07 0 0 
0 0 0 0 0 0 0 0 0 0 0 0 0 0 0 0 0 0 0 0 0 0 0 0 0 0 0 1300.62 0 0 0 0 0 0 0 0 0 0 0 0 0 0 0 0 0 0 0 0.09 0 
0 0 0 0 0 0 0 0 0 0 0 0 0 0 0 0 0 0 0 0 0 0 0 0 0 0 0 0 0 0 2489.47 0 0 0 0 0 0 0 0 0 0 0 0 0 0 0 0 0 0.05 
