*Vertices 65
*Matrix 
0.06 0 0 0 -590.304 0 0 0 0 0 0 0 1259.58 -1352.66 0 1444.67 0 0 0 0 0 0 0 0 0 0 0 2249.6 0 0 0 0 0 0 0 0 0 0 0 0 0 0 0 0 1617.86 0 0 0 -450.072 0 0 0 0 0 0 0 0 0 -354.701 0 0 674.23 0 0 0 
0 0.01 0 0 0 0 0 1467.1 0 811.258 1549.96 0 0 0 1668.68 0 0 0 0 0 0 0 0 0 0 0 427.793 0 0 0 0 0 0 0 0 0 0 0 0 0 0 0 0 0 0 0 -1808.76 0 0 0 -1292.38 0 0 0 0 1854.23 -819.803 0 0 1681.8 0 0 0 0 0 
0 0 0.08 0 1381.34 0 0 181.356 -497.681 1066.55 0 769.753 0 0 0 0 0 0 0 0 0 0 741.829 0 0 0 0 0 0 0 0 1746.65 0 0 0 0 0 0 0 0 0 0 268.944 1118.88 0 465.026 0 0 0 1309.02 0 0 0 0 0 0 0 1108.66 0 0 0 0 0 0 0 
0 0 0 0.07 0 1732.31 0 0 0 0 0 0 0 0 0 1175.19 0 0 0 1115.68 0 0 0 -1441.31 0 0 0 0 0 0 0 0 0 0 0 0 1730.63 0 -521.485 0 842.997 0 0 0 0 0 0 0 0 0 0 0 0 0 0 0 0 0 0 0 1417.97 0 0 0 0 
1748.48 0 44.7859 0 0.01 380.184 0 0 0 0 0 -2067.4 0 0 1043.05 0 1598.33 0 0 0 0 0 0 0 0 0 0 0 0 -503.021 0 0 0 -155.721 0 0 293.97 0 0 0 0 0 0 0 0 0 0 0 0 0 0 0 0 0 0 0 0 0 0 0 0 0 0 0 0 
0 0 0 2421.57 -1923.81 0 0 0 0 -1286.89 0 633.335 0 0 0 0 0 0 0 0 0 0 0 0 0 1755.35 0 0 0 0 0 0 0 0 0 0 0 0 0 0 0 0 0 0 0 0 2062.36 0 1089.74 547.121 0 0 0 0 0 0 0 0 504.852 2279.5 0 0 0 0 0 
0 0 0 0 0 0 0.05 0 0 0 0 0 0 0 0 0 0 0 0 0 0 0 0 0 0 1755.04 0 0 0 -1593.91 0 0 0 2291.71 0 -210.807 1398.74 0 0 0 0 0 0 0 0 0 0 0 0 0 0 0 0 0 0 0 0 0 2264.55 0 -220.115 0 0 0 0 
0 -425.962 1942.88 0 0 0 0 0.03 0 0 0 0 0 0 0 0 555.971 2055.8 0 0 0 0 0 0 0 0 0 0 -56.8407 0 0 0 1963.64 0 0 0 0 0 0 905.713 -1472.59 0 0 0 0 0 0 0 0 0 0 0 0 0 0 0 0 0 0 0 0 0 0 0 0 
0 0 2453.61 0 0 0 0 0 0.07 0 0 0 0 0 0 0 0 574.129 0 -1161.92 0 0 0 -1845.84 0 0 0 0 0 0 0 0 1948.68 0 0 770.363 0 0 0 0 237.815 -1855.75 0 0 0 0 0 0 0 0 0 0 0 0 0 0 0 0 0 0 0 2375.18 0 0 0 
0 1814.71 293.512 0 0 -328.15 0 0 0 0.06 0 0 0 0 0 0 0 0 0 0 0 0 0 0 0 0 0 0 0 2148.12 0 0 0 0 0 0 0 0 0 0 0 0 0 2177.57 0 -1056.32 0 0 0 0 -876.11 0 0 0 0 0 0 0 0 0 0 0 0 0 0 
0 -1763.28 0 0 0 0 0 0 0 0 0.01 0 -792.795 0 0 0 0 0 0 0 0 0 0 0 0 0 0 0 0 0 0 0 0 0 0 0 0 0 2171.77 0 0 0 0 1354.64 0 0 0 0 0 0 0 0 0 0 0 0 0 0 0 0 0 0 0 0 0 
0 0 1297.88 0 -739.845 1157.19 0 0 0 0 0 0.03 0 0 0 0 0 0 0 0 0 0 0 0 0 0 0 0 0 0 0 0 0 0 0 0 0 0 0 0 -539.033 0 2239.68 -362.789 -222.098 0 0 0 987.96 0 0 0 0 0 0 0 0 0 0 0 0 0 0 0 0 
2163.08 0 0 0 0 0 0 0 0 0 -267.418 0 0.02 -54.857 0 0 0 0 0 0 -1580.48 0 0 0 0 0 0 0 0 0 0 0 0 0 0 2031.54 0 0 -525.147 0 0 0 0 0 0 1893.6 0 466.704 0 0 0 0 0 0 509.583 0 0 0 0 -1264.46 0 0 0 0 0 
1701.79 0 0 0 0 0 0 0 0 0 0 0 809.427 0.08 0 0 0 0 0 1248.59 0 0 -18.2348 0 0 0 0 0 0 0 937.758 0 0 0 0 0 0 0 0 0 0 0 0 0 0 0 0 0 0 0 0 0 0 1983.78 0 0 0 0 1974.93 0 0 0 0 0 0 
0 -1745.12 0 0 2364.35 0 0 0 0 0 0 0 0 0 0.09 0 1264.92 0 -668.584 0 0 81.8659 0 0 0 2035.81 0 0 0 0 0 0 0 0 0 -564.821 0 1454.28 0 -344.02 0 0 0 0 0 0 0 0 0 0 0 2086.47 0 0 0 0 0 0 0 0 0 0 0 0 0 
2117.3 0 0 637.608 0 0 0 0 0 0 0 0 0 0 0 0.05 2086.32 0 -15.183 0 0 1474.88 0 0 0 0 0 0 0 0 0 0 0 0 1147.88 0 0 0 0 0 0 0 0 0 0 0 0 0 -2340.08 0 0 0 0 0 0 0 185.629 2012.77 0 0 1986.68 0 0 0 0 
0 0 0 0 -1019.55 0 0 875.195 0 0 0 0 0 0 788.369 1894.21 0.03 0 0 0 1907.94 0 0 0 0 0 0 0 0 0 0 0 1175.65 0 0 0 0 0 0 0 1884.44 0 0 0 0 -41.2763 0 0 -1909.01 0 0 0 0 0 0 0 0 0 0 -384.152 -1609.32 0 0 0 908.155 
0 0 0 0 0 0 0 -88.58 -1896.95 0 0 0 0 0 0 0 0 0.02 0 0 0 0 0 2125.69 0 0 0 0 -369.961 0 0 0 0 0 0 0 1973.25 0 0 0 0 471.74 0 0 0 0 0 0 0 -588.626 0 0 0 0 0 0 0 0 0 0 0 0 0 0 0 
0 0 0 0 0 0 0 0 0 0 0 0 0 0 -1585.97 689.337 0 0 0.02 0 0 2007.13 0 0 0 0 0 0 0 0 1426.36 0 0 0 52.1104 0 0 0 1585.51 -2178.79 0 0 0 0 0 -683.691 0 0 0 0 0 0 0 0 0 0 0 0 0 0 0 0 0 0 0 
0 0 0 -2298.27 0 0 0 0 1900.46 0 0 0 0 -2097.61 0 0 0 0 0 0.06 0 0 -58.3666 0 0 0 0 -122.761 0 0 429.319 0 0 0 0 0 0 0 0 0 0 0 0 0 0 0 0 0 0 0 0 0 0 0 2076.4 0 -1808.91 2059.47 0 0 0 0 0 0 0 
0 0 0 0 0 0 0 0 0 0 0 0 1689.73 0 0 0 -981.399 0 0 0 0.02 0 0 0 2361.29 0 0 0 0 0 1801.13 0 0 0 0 0 0 0 0 0 -2036.12 0 0 0 0 0 0 0 0 0 -511.261 0 0 0 0 385.22 0 -604.648 0 0 0 0 0 0 0 
0 0 0 0 0 0 0 0 0 0 0 0 0 0 1264.46 500.427 0 0 18.3874 0 0 0.09 0 0 0 0 0 492.035 0 0 0 0 1876.35 0 0 0 0 0 -919.141 0 0 0 0 0 0 -2462.16 0 0 0 0 0 0 -15.183 0 0 0 0 0 0 0 2386.47 0 0 0 0 
0 0 -1827.98 0 0 0 0 0 0 0 0 0 0 -326.624 0 0 0 0 0 -732.521 0 0 0.04 0 0 1791.82 0 0 0 0 0 0 0 0 0 0 0 0 0 -1558.2 0 0 0 0 1850.41 0 0 130.238 0 0 0 0 0 0 0 957.747 0 0 0 0 0 0 0 0 0 
0 0 0 2399.59 0 0 0 0 545.595 0 0 0 0 0 0 0 0 1802.65 0 0 0 0 0 0.02 0 -1121.63 -1509.22 0 -2382.96 0 0 0 0 0 0 0 0 0 0 0 0 0 2235.56 0 0 0 0 0 0 0 0 0 1730.02 0 0 0 0 0 0 0 526.215 0 0 0 0 
0 0 0 0 0 0 0 0 0 0 0 0 0 0 0 0 0 0 0 0 282.83 0 0 0 0.08 0 0 1110.95 0 0 0 0 0 0 0 0 0 0 2290.95 0 0 0 0 0 0 0 0 0 1293.76 0 0 0 0 0 0 0 0 1460.08 0 0 0 0 0 0 0 
0 0 0 0 0 2412.11 -768.99 0 0 0 0 0 0 0 1853.77 0 0 0 0 0 0 0 2265.77 750.679 0 0.02 0 0 0 1875.59 -678.961 0 0 0 0 0 0 0 0 0 1087.6 0 0 0 0 0 0 0 0 0 0 848.949 0 0 0 0 0 0 0 0 0 2277.98 0 0 0 
0 497.528 0 0 0 0 0 0 0 0 0 0 0 0 0 0 0 0 0 0 0 0 0 757.698 0 0 0.04 0 0 0 0 0 0 0 0 0 0 0 0 1774.27 0 0 0 0 0 0 0 0 0 0 0 0 0 0 0 0 0 346.309 1144.52 0 0 0 0 0 0 
-505.768 0 0 0 0 0 0 0 0 0 0 0 0 0 0 0 0 0 0 -1394.92 0 764.412 0 0 286.34 0 0 0.06 0 0 0 0 0 0 0 0 0 0 2206.56 2295.68 1407.9 -1207.08 0 0 0 0 0 1217.61 0 0 0 0 0 158.925 0 0 0 0 0 -708.716 0 0 0 0 0 
0 0 0 0 0 0 0 609.684 0 0 0 0 0 0 0 0 0 -1481.14 0 0 0 0 0 340.815 0 0 0 0 0.09 0 0 0 0 0 0 0 0 0 0 1349.3 0 0 0 0 0 0 0 0 0 0 0 0 0 0 0 0 760.598 0 0 2005.91 0 0 0 -1842.17 0 
0 0 0 0 -497.375 0 -311.212 0 0 800.882 0 0 0 0 0 0 0 0 0 0 0 0 0 0 0 2029.4 0 0 0 0 1259.58 0 0 0 0 0 0 0 0 0 0 0 0 0 0 0 0 0 0 0 0 0 2415.46 0 1328.09 0 0 0 0 0 0 0 433.439 0 0 
0 0 0 0 0 0 0 0 0 0 0 0 0 255.211 0 0 0 0 2402.19 -1818.52 -497.986 0 0 0 0 -2061.91 0 0 0 1260.95 0.06 0 0 0 0 0 0 868.175 0 0 0 0 0 0 0 0 0 0 0 573.214 0 0 0 0 0 0 0 0 0 0 0 0 0 0 0 
0 0 1220.51 0 0 0 0 0 0 0 0 0 0 0 0 0 0 0 0 0 0 0 0 0 0 0 0 0 0 0 0 0.04 0 0 0 0 0 0 0 0 0 0 0 0 0 0 0 0 0 0 0 0 0 0 0 0 -1194.88 0 0 0 941.267 0 0 0 0 
0 0 0 0 0 0 0 -3.89111 1907.18 0 0 0 0 0 0 0 1912.06 0 0 0 0 -264.061 0 0 0 0 0 0 0 0 0 0 0.04 0 0 0 0 0 0 0 0 1246.6 0 -1639.07 -425.504 0 0 0 0 0 -57.1459 1563.54 0 -492.798 0 0 0 0 0 0 0 1425.14 0 0 0 
0 0 0 0 -629.368 0 1349.15 0 0 0 0 0 0 0 0 0 0 0 0 0 0 0 0 0 0 0 0 0 0 0 0 0 0 0.02 0 0 0 0 0 0 0 0 0 0 0 0 0 132.527 0 0 0 0 158.925 0 0 0 0 0 0 0 0 0 0 0 0 
0 0 0 0 0 0 0 0 0 0 0 0 0 0 0 2169.18 0 0 1703.77 0 0 0 0 0 0 0 0 0 0 0 0 0 0 0 0.05 0 0 0 0 0 0 0 0 0 0 2300.41 0 -1527.38 0 0 2482.76 0 1139.03 0 0 0 0 0 0 0 0 0 0 0 0 
0 0 0 0 0 0 321.741 0 769.448 0 0 0 522.248 0 1858.2 0 0 0 0 0 0 0 0 0 0 0 0 0 0 0 0 0 0 0 0 0.09 0 0 1461.46 0 0 1766.95 633.183 0 0 0 0 0 0 0 0 0 0 0 0 0 0 0 0 0 0 -940.657 0 0 0 
0 0 0 -2027.73 1538.06 0 -659.581 0 0 0 0 0 0 0 0 0 0 2167.81 0 0 0 0 0 0 0 0 0 0 0 0 0 0 0 0 0 0 0.07 0 0 1587.8 117.573 0 -311.518 0 -1329.92 2238 -323.878 0 0 0 0 1471.07 0 145.039 0 0 0 0 0 1035.26 -897.168 0 0 0 0 
0 0 0 0 0 0 0 0 0 0 0 0 0 0 1286.58 0 0 0 0 0 0 0 0 0 0 0 0 0 0 0 286.798 0 0 0 0 0 0 0.03 2334.74 0 0 0 0 0 0 0 0 0 0 0 0 0 0 2073.66 133.137 0 0 0 0 0 0 0 0 0 0 
0 0 0 -304.956 0 0 0 0 0 0 -122.761 0 2102.19 0 0 0 0 0 682.318 0 0 2281.33 0 0 1176.56 0 0 -1923.51 0 0 0 0 0 0 0 -1330.07 0 557.344 0.02 -2159.11 0 0 0 790.963 0 231.864 0 0 -839.03 0 0 0 0 0 0 0 2113.94 0 0 0 0 0 0 0 0 
0 0 0 0 0 0 0 -1586.28 0 0 0 0 0 0 -0.228889 0 0 0 -1283.07 0 0 0 2003.31 0 0 0 -1157.8 1230.74 -1042.28 0 0 0 0 0 0 0 93.6155 0 2440.18 0 0 0 281.762 0 0 0 0 0 0 0 0 0 0 0 0 1797.16 0 0 0 -1068.68 294.427 0 0 0 0 
0 0 0 1066.24 0 0 0 1157.8 -70.8792 0 0 -1814.4 0 0 0 0 641.423 0 0 0 -307.703 0 0 0 0 -338.832 0 -1418.73 0 0 0 0 0 0 0 0 2266.53 0 0 0 0.02 0 1162.98 0 0 0 1011.61 0 -1087.76 0 0 0 0 0 0 0 0 0 0 0 0 0 0 0 0 
0 0 0 0 0 0 0 0 348.445 0 0 0 0 0 0 0 0 -1214.26 0 0 0 0 0 0 0 0 0 1431.24 0 0 0 0 1982.56 0 0 2273.71 0 0 0 0 0 0.05 536.134 -2413.17 0 -1993.85 0 0 0 0 1623.81 0 0 0 0 0 0 0 0 0 0 411.618 0 0 0 
0 0 -477.844 0 0 0 0 0 0 0 0 1735.82 0 0 0 0 0 0 0 0 0 0 0 -23.7281 0 0 0 0 0 0 0 0 0 0 0 -1294.82 449.004 0 0 -331.507 1314.36 1934.34 0.07 0 0 0 -1910.84 0 0 0 0 0 0 0 0 0 0 0 0 0 0 0 0 0 0 
0 0 912.427 0 0 0 0 0 0 1429.72 -2170.71 459.838 0 0 0 0 0 0 0 0 0 0 0 0 0 0 0 0 0 0 0 0 2420.8 0 0 0 0 0 -1297.72 0 0 -565.737 0 0.09 0 0 1562.01 0 0 0 0 0 0 0 0 0 0 0 0 0 0 0 0 0 0 
-2425.08 0 0 0 0 0 0 0 0 0 0 -399.258 0 0 0 0 0 0 0 0 0 0 1059.98 0 0 0 0 0 0 0 0 0 1854.53 0 0 0 2413.17 0 0 0 0 0 0 0 0.02 1344.11 0 0 0 0 0 0 0 -970.107 0 0 0 2285 0 0 0 0 0 0 0 
0 0 1273.92 0 0 0 0 0 0 -1901.38 0 0 340.663 0 0 0 -1265.53 0 2165.97 0 0 -2030.63 0 0 0 0 0 0 0 0 0 0 0 0 1155.2 0 2364.5 0 1368.53 0 0 -591.372 0 0 2368.92 0.02 0 0 1871.32 0 0 0 -1030.84 0 0 0 0 0 -1161.76 -940.657 0 0 0 0 0 
0 2223.65 0 0 0 -1311.61 0 0 0 0 0 0 0 0 0 0 0 0 0 0 0 0 0 0 0 0 0 0 0 0 0 0 0 0 0 0 1208 0 0 0 -795.236 0 2241.81 -1007.95 0 0 0.09 0 0 0 2333.67 0 0 0 0 0 -985.061 0 1100.12 0 0 0 0 0 0 
0 0 0 0 0 0 0 0 0 0 0 0 1476.71 0 0 0 0 0 0 0 0 0 1269.19 0 0 0 0 1706.06 0 0 0 0 0 -1406.37 1847.97 0 0 0 0 0 0 0 0 0 0 0 0 0.08 0 0 -2495.57 0 0 0 -1798.23 0 0 0 0 0 0 0 0 0 0 
2.97555 0 0 0 0 174.947 0 0 0 0 0 2441.4 0 0 0 1.60222 714.057 0 0 0 0 0 0 0 1060.44 0 0 0 0 0 0 0 0 0 0 0 0 0 2212.21 0 1491.82 0 0 0 0 123.676 0 0 0.05 0 0 0 0 0 0 0 0 0 0 0 0 0 0 0 0 
0 0 -608.005 0 0 2355.65 0 0 0 0 0 0 0 0 0 0 0 -102.924 0 0 0 0 0 0 0 0 0 0 0 0 1116.29 0 0 0 0 0 0 0 0 0 0 0 0 0 0 0 0 0 0 0.02 0 0 0 0 -1996.6 0 0 0 0 0 0 0 0 0 0 
0 -31.8155 0 0 0 0 0 0 0 -603.732 0 0 0 0 0 0 0 0 0 0 1963.18 0 0 0 0 0 0 0 0 0 0 0 1603.82 0 -468.078 0 0 0 0 0 0 883.435 0 0 0 0 -1612.37 2112.87 0 0 0.05 0 0 0 0 0 0 0 1705.3 1391.87 0 0 0 0 0 
0 0 0 0 0 0 0 0 0 0 0 0 0 0 1730.32 0 0 0 0 0 0 0 0 0 0 288.934 0 0 0 0 0 0 -1906.72 0 0 0 -1075.09 0 0 0 0 0 0 0 0 0 0 0 0 0 0 0.01 1908.4 0 0 0 0 0 0 0 0 0 0 0 0 
0 0 0 0 0 0 0 0 0 0 0 0 0 0 0 0 0 0 0 0 0 2306.67 0 934.858 0 0 0 0 0 1038.32 0 0 0 -1308.4 -1251.64 0 0 0 0 0 0 0 0 0 0 1833.48 0 0 0 0 0 1554.23 0.04 0 -922.956 2482.91 0 0 0 0 0 0 0 0 0 
0 0 0 0 0 0 0 0 0 0 0 0 0 387.967 0 0 0 0 0 0 0 0 0 0 0 0 0 943.709 0 0 0 0 2312.77 0 0 0 2380.67 1521.27 0 0 0 0 0 0 -915.632 0 0 0 0 0 0 0 0 0.03 0 0 0 0 0 0 0 0 0 0 0 
0 0 0 0 0 0 0 0 0 0 0 0 -329.676 0 0 0 0 0 0 1525.7 0 0 0 0 0 0 0 0 0 1022.9 0 0 0 0 0 0 0 942.488 0 0 0 0 0 0 0 0 0 -778.298 0 318.995 0 0 -1214.71 0 0.08 0 0 0 0 0 0 0 0 0 0 
0 1981.8 0 0 0 0 0 0 0 0 0 0 0 0 0 0 0 0 0 0 81.8659 0 344.02 0 0 0 0 0 0 0 0 0 0 0 0 0 0 0 0 726.875 0 0 0 0 0 0 0 0 0 0 0 0 -857.646 0 0 0.05 580.233 0 0 0 0 0 0 0 0 
0 -859.172 0 0 0 0 0 0 0 0 0 0 0 0 0 -875.958 0 0 0 2388.15 0 0 0 0 0 0 0 0 1454.74 0 0 -91.174 0 0 0 0 0 0 918.989 0 0 0 0 0 0 0 -750.374 0 0 0 0 0 0 0 0 -268.944 0.08 0 251.701 0 0 0 0 0 0 
0 0 2322.38 0 0 0 0 0 0 0 0 0 0 0 0 -2191.31 0 0 0 -420.011 -688.269 0 0 0 -823.008 0 914.106 0 0 0 0 0 0 0 0 0 0 0 0 0 0 0 0 0 2495.88 0 0 0 0 0 0 0 0 0 0 0 0 0.01 0 0 0 0 0 0 0 
2304.07 0 0 0 0 -1650.52 -490.814 0 0 0 0 0 0 -2183.07 0 0 0 0 0 0 0 0 0 0 0 0 2032.76 0 0 0 0 0 0 0 0 0 0 0 0 0 0 0 0 0 0 1733.83 -294.427 0 0 0 -1301.23 0 0 0 0 0 -545.9 0 0.03 0 0 0 0 0 0 
0 1251.64 0 0 0 1737.34 0 0 0 0 0 0 -1626.71 0 0 0 -924.94 0 0 0 0 0 0 0 0 0 0 2476.5 1961.5 0 0 0 0 0 0 0 1053.27 0 0 -54.5518 0 0 0 0 0 1110.03 0 0 0 0 -1604.13 0 0 0 0 0 0 0 0 0.01 0 0 0 0 0 
0 0 0 2276.6 0 0 -238.426 0 0 0 0 0 0 0 0 2197.87 -1511.51 0 0 0 0 -1184.96 0 -1378.29 0 0 0 0 0 0 0 2060.08 0 0 0 0 -908.765 0 0 1167.56 0 0 0 0 0 0 0 0 0 0 0 0 0 0 0 0 0 0 0 0 0.03 0 0 0 0 
624.943 0 0 0 0 0 0 0 520.722 0 0 0 0 0 0 0 0 0 0 0 0 0 0 0 0 2474.06 0 0 0 0 0 0 1618.63 0 0 144.734 0 0 0 0 0 -2314.6 0 0 0 0 0 0 0 0 0 0 0 0 0 0 0 0 0 0 0 0.05 0 0 0 
0 0 0 0 0 0 0 0 0 0 0 0 0 0 0 0 0 0 0 0 0 0 0 0 0 0 0 0 0 997.879 0 0 0 0 0 0 0 0 0 0 0 0 0 0 0 0 0 0 0 0 0 0 0 0 0 0 0 0 0 0 0 0 0.02 0 0 
0 0 0 0 0 0 0 0 0 0 0 0 0 0 0 0 0 0 0 0 0 0 0 0 0 0 0 0 253.227 0 0 0 0 0 0 0 0 0 0 0 0 0 0 0 0 0 0 0 0 0 0 0 0 0 0 0 0 0 0 0 0 0 0 0 0 
0 0 0 0 0 0 0 0 0 0 0 0 0 0 0 0 524.232 0 0 0 0 0 0 0 0 0 0 0 0 0 0 0 0 0 0 0 0 0 0 0 0 0 0 0 0 0 0 0 0 0 0 0 0 0 0 0 0 0 0 0 0 0 0 0 0.09 
