*Vertices 49
*Matrix 
0.04 0 2080.68 0 0 0 -1073.87 0 0 0 -1451.08 398.343 0 0 0 2394.86 0 0 1500.67 0 0 0 0 0 0 0 0 0 0 0 0 0 -897.778 0 0 0 0 0 0 384.915 0 0 0 0 0 0 0 0 0 
0 0.08 1016.8 0 0 0 2121.57 2003.01 0 0 504.089 0 0 0 -2309.41 0 1356.62 1426.36 0 0 0 0 0 0 0 0 0 0 0 0 0 0 0 0 0 0 -2477.11 0 0 0 -2366.94 0 0 2246.09 0 0 1833.17 0 0 
2351.68 1209.68 0.08 0 -510.041 1706.37 0 0 0 0 0 0 0 1542.02 2156.36 859.02 961.867 0 0 -1429.87 0 0 0 0 0 0 299.463 0 0 0 0 2393.8 0 0 1242.64 0 0 0 -2001.33 0 0 0 1958.3 0 0 -669.805 367.367 0 2463.07 
0 0 0 0.09 0 0 -1126.21 0 0 0 0 2074.27 -873.974 0 0 0 0 0 0 1911.15 0 0 0 0 -996.048 145.344 0 0 0 0 1931.44 0 2422.94 0 0 0 0 0 467.925 0 0 0 0 0 0 0 0 0 0 
0 0 2427.82 0 0.09 0 -122.303 0 0 0 0 1762.06 0 0 439.848 1632.66 0 1247.67 0 0 0 0 0 0 0 0 -1261.25 0 0 0 0 0 0 0 0 0 -918.073 0 0 0 0 0 0 -1663.79 0 0 0 0 0 
0 0 747.627 0 0 0 0 -324.641 0 1852.85 433.897 2471.62 0 2246.7 0 0 -544.221 927.381 -495.849 2303.77 1042.74 0 0 0 0 0 0 0 0 0 0 0 0 0 0 0 0 0 0 -1491.06 0 0 0 0 0 0 0 0 0 
2319.64 -90.7163 0 2475.89 169.912 0 0.05 -384.61 1197.78 1829.2 0 1365.32 0 0 2326.04 1039.69 0 2395.47 -825.755 -1769.54 0 0 0 0 0 0 0 0 -462.889 0 0 -563.601 0 0 0 0 0 -2190.85 0 0 0 0 0 0 0 0 0 0 0 
0 368.13 0 0 0 1696.14 -81.7133 0.03 0 0 -778.909 0 1084.86 0 0 -387.356 0 0 0 0 2013.38 0 -1170.16 0 0 0 0 0 0 0 0 0 0 0 0 0 0 0 0 0 -1429.26 0 0 0 0 636.692 0 0 0 
0 0 0 0 0 0 -756.02 0 0.06 1069.6 647.069 -411.161 0 -518.891 2438.2 0 0 0 -37.9192 0 0 0 0 0 0 0 0 0 0 0 0 0 0 0 0 0 0 0 0 0 0 0 0 0 0 0 0 -887.707 0 
0 0 0 0 0 846.66 -1812.27 0 1400.27 0.04 -1052.51 0 0 2208.24 0 0 0 -451.903 0 -402.463 0 742.286 2128.74 0 0 0 -206.687 0 0 0 0 0 0 0 0 0 0 0 0 1797.31 0 0 0 0 0 -1196.55 0 0 0 
633.641 153.127 0 0 0 1751.84 0 1718.88 1883.22 -241.63 0.09 0 0 717.872 0 0 2024.98 0 -1764.35 0 0 0 0 0 0 0 0 0 2109.36 0 0 0 0 0 0 -1344.57 0 0 0 0 0 -1199.15 0 0 0 0 0 0 0 
-454.65 0 0 1430.48 2412.87 2365.41 -2475.13 0 1560.49 0 0 0.06 0 1925.64 0 0 0 0 0 0 0 105.976 995.59 -1964.86 0 0 0 0 0 0 2029.71 0 0 0 1807.54 0 0 0 0 0 0 0 0 0 0 0 0 0 0 
0 0 0 -1165.58 0 0 0 1235.77 0 0 0 0 0.08 224.235 0 0 0 0 0 0 0 0 0 0 0 0 1686.38 -602.817 0 0 0 0 0 0 0 0 0 0 -1775.64 0 0 0 0 755.867 0 0 0 0 -884.35 
0 0 -1662.72 0 0 -315.485 0 0 1387.45 2420.35 -824.686 1439.02 1525.09 0.02 0 0 0 0 0 0 0 0 0 0 0 0 0 0 0 0 0 0 0 488.83 0 0 0 0 0 0 0 0 0 0 0 0 0 0 0 
0 -864.208 1987.29 0 713.446 0 678.198 0 1897.87 0 0 0 0 0 0 0 466.704 0 0 189.291 0 -62.3341 0 0 0 0 0 0 0 0 0 0 0 0 0 -1356.93 0 0 0 0 0 0 0 0 923.109 0 0 0 -2443.24 
560.701 0 2125.54 0 -1211.36 0 -699.866 2122.64 0 0 0 0 0 0 0 0.01 -633.641 0 0 -148.549 0 0 0 511.414 0 0 0 0 0 0 0 0 0 0 0 0 0 0 0 0 0 0 0 0 0 0 -1252.1 0 0 
0 1325.34 2251.88 0 0 -1222.5 0 0 0 0 133.595 0 0 0 2249.6 2238.91 0 0 0 0 0 0 0 0 1116.14 382.321 298.395 0 0 0 0 0 0 0 0 0 0 0 64.4704 0 0 0 -714.209 0 0 0 0 0 0 
0 1473.51 0 0 -384.152 -776.467 -466.704 0 0 2465.36 0 0 0 0 0 0 0 0.04 0 1.44963 0 -129.627 0 0 0 0 0 -519.807 0 0 0 0 0 0 0 0 0 0 0 0 -530.488 0 0 0 0 0 0 0 0 
-935.011 0 0 0 0 1199.61 576.266 0 1180.23 0 1688.97 0 0 0 0 0 0 0 0.01 0 0 0 0 0 1130.63 0 0 0 0 0 0 0 0 0 0 0 0 0 0 0 84.0022 0 0 0 0 0 0 0 2167.96 
0 0 1457.18 -1401.94 0 -946.608 1536.84 0 0 328.761 0 0 0 0 2257.99 -170.827 0 -1037.1 0 0.07 0 0 0 0 0 0 0 0 0 0 0 0 0 0 0 0 832.011 0 0 0 0 0 -291.681 0 0 0 0 620.06 0 
0 0 0 0 0 1066.09 0 987.808 0 0 0 0 0 0 0 0 0 0 0 0 0.03 0 0 0 0 223.472 0 0 0 0 0 0 0 0 0 0 0 0 0 0 2020.1 0 0 0 1640.45 0 0 1586.58 0 
0 0 0 0 0 0 0 0 0 -1906.42 0 1891.31 0 0 577.639 0 0 48.9059 0 0 0 0.05 0 0 0 0 0 152.364 0 0 795.389 0 0 0 0 1919.08 0 0 0 0 0 0 1693.7 0 0 0 0 0 0 
0 0 0 0 0 0 0 1972.33 0 1229.82 0 -883.892 0 0 0 0 0 0 0 0 0 0 0.07 -1992.17 0 0 1266.14 0 0 -40.9711 1281.55 0 0 0 2193.29 0 0 0 0 0 0 0 0 0 0 0 -1491.36 0 0 
0 0 0 0 0 0 0 0 0 0 0 2083.27 0 0 0 1937.39 0 0 0 0 0 0 1005.05 0.09 0 0 0 0 0 0 0 0 0 2284.54 -1250.42 0 0 0 0 438.627 0 0 0 -2015.52 0 0 0 0 0 
0 0 0 2286.68 0 0 0 0 0 0 0 0 0 0 0 0 1635.11 0 411.466 0 0 0 0 0 0.07 618.534 0 0 0 0 0 0 0 0 0 0 0 0 0 0 0 0 0 0 0 0 0 0 0 
0 0 0 -528.962 0 0 0 0 0 0 0 0 0 0 0 0 1589.94 0 0 0 930.891 0 0 0 2313.53 0.06 0 0 0 0 0 0 -2339.01 0 0 0 0 1322.44 0 0 0 0 0 0 493.103 0 0 0 0 
0 0 -347.377 0 1504.03 0 0 0 0 1.75481 0 0 2337.64 0 0 0 2038.26 0 0 0 0 0 -37.7667 0 0 0 0.06 0 0 0 0 0 0 0 0 -2355.19 0 0 0 0 0 0 0 0 0 0 0 0 0 
0 0 0 0 0 0 0 0 0 0 0 0 -1843.85 0 0 0 0 2186.12 0 0 0 2224.72 0 0 0 0 0 0 -89.8007 0 0 0 0 0 0 0 0 0 0 0 0 0 0 0 0 1644.41 0 0 -1136.43 
0 0 0 0 0 0 703.375 0 0 0 277.032 0 0 0 0 0 0 0 0 0 0 0 0 0 0 0 0 1093.86 0.09 0 0 0 -405.362 0 0 0 0 0 0 0 507.447 0 0 0 0 0 0 0 0 
0 0 0 0 0 0 0 0 0 0 0 0 0 0 0 0 0 0 0 0 0 0 746.712 0 0 0 0 0 0 0.09 0 0 0 728.706 0 0 0 0 0 0 0 0 0 0 0 0 0 0 0 
0 0 0 1165.58 0 0 0 0 0 0 0 -636.998 0 0 0 0 0 0 0 0 0 1331.6 1619.24 0 0 0 0 0 0 0 0.03 1078.14 0 -481.201 0 0 0 0 0 0 17.6244 -1997.82 0 707.038 0 0 0 0 0 
0 0 6.48518 0 0 0 1646.55 0 0 0 0 0 0 0 0 0 0 0 0 0 0 0 0 0 0 0 0 0 0 0 1946.85 0.05 1366.08 -354.244 0 0 0 961.257 802.408 1252.4 0 0 0 0 0 0 0 0 0 
-180.746 0 0 2128.44 0 0 0 0 0 0 0 0 0 0 0 0 0 0 0 0 0 0 0 0 0 861.309 0 0 560.549 0 0 2278.59 0.01 0 0 0 -625.553 0 -1938 0 0 1357.39 0 0 0 0 0 0 0 
0 0 0 0 0 0 0 0 0 0 0 0 0 1528.44 0 0 0 0 0 0 0 0 0 -2098.68 0 0 0 0 0 531.709 1390.96 2204.43 0 0.02 0 0 0 0 -595.492 0 0 0 0 0 0 0 732.826 0 0 
0 0 942.64 0 0 0 0 0 0 0 0 825.602 0 0 0 0 0 0 0 0 0 0 1962.57 -1661.5 0 0 0 0 0 0 0 0 0 0 0.05 0 0 0 0 0 0 0 0 0 0 0 0 0 0 
0 0 0 0 0 0 0 0 0 0 -845.897 0 0 0 790.811 0 0 0 0 0 0 1392.18 0 0 0 0 541.017 0 0 0 0 0 0 0 0 0.01 0 0 0 0 0 0 0 0 0 0 0 0 0 
0 489.288 0 0 1673.25 0 0 0 0 0 0 0 0 0 0 0 0 0 0 254.295 0 0 0 0 0 0 0 0 0 0 0 0 941.267 0 0 0 0.04 -1690.34 0 0 0 0 0 0 0 0 0 0 0 
0 0 0 0 0 0 1067.77 0 0 0 0 0 0 0 0 0 0 0 0 0 0 0 0 0 0 -349.055 0 0 0 0 0 286.645 0 0 0 0 1555.45 0.03 0 0 0 0 0 0 -716.346 0 0 0 516.907 
0 0 -185.934 1774.88 0 0 0 0 0 0 0 0 -30.9 0 0 0 1050.22 0 0 0 0 0 0 0 0 0 0 0 0 0 0 -861.156 -2335.96 2278.44 0 0 0 0 0.08 0 0 -773.11 2029.4 0 0 0 0 0 0 
-1404.84 0 0 0 0 2320.7 0 0 0 370.724 0 0 0 0 0 0 0 0 0 0 0 0 0 -2293.39 0 0 0 0 0 0 0 2278.44 0 0 0 0 0 0 0 0.09 0 0 0 0 0 0 0 0 0 
0 54.2467 0 0 0 0 0 1252.86 0 0 0 0 0 0 0 0 0 2112.42 1977.83 0 1202.35 0 0 0 0 0 0 0 -243.919 0 1464.2 0 0 0 0 0 0 0 0 0 0.07 0 0 0 0 986.892 0 0 0 
0 0 0 0 0 0 0 0 0 0 2432.86 0 0 0 0 0 0 0 0 0 0 0 0 0 0 0 0 0 0 0 207.144 0 2012.77 0 0 0 0 0 -1401.33 0 0 0.05 0 0 0 0 0 0 0 
0 0 2245.17 0 0 0 0 0 0 0 0 0 0 0 0 0 -460.906 0 0 -436.338 0 1118.12 0 0 0 0 0 0 0 0 0 0 0 0 0 0 0 0 16.5563 0 0 0 0 0 -771.279 0 0 0 0 
0 928.907 0 0 841.472 0 0 0 0 0 0 0 1733.99 0 0 0 0 0 0 0 0 0 0 891.675 0 0 0 0 0 0 8.77407 0 0 0 0 0 0 0 0 0 0 0 0 0.08 0 -1235.31 0 0 2310.79 
0 0 0 0 0 0 0 0 0 0 0 0 0 0 905.408 0 0 0 0 0 1840.34 0 0 0 0 -559.023 0 0 0 0 0 0 0 0 0 0 0 2475.89 0 0 0 0 509.735 0 0.01 -2497.56 0 0 0 
0 0 731.91 0 0 0 0 1104.69 0 -829.112 0 0 0 0 0 0 0 0 0 0 0 0 0 0 0 0 0 -548.952 0 0 0 0 0 0 0 0 0 0 0 0 1122.7 0 0 116.962 59.74 0.01 0 -796.915 0 
0 1480.83 1411.86 0 0 0 0 0 0 0 0 0 0 0 0 2490.84 0 0 0 0 0 0 -1680.12 0 0 0 0 0 0 0 0 0 0 -349.971 0 0 0 0 0 0 0 0 0 0 0 0 0.09 0 0 
0 0 0 0 0 0 0 0 437.254 0 0 0 0 0 0 0 0 0 0 -1239.74 1730.63 0 0 0 0 0 0 0 0 0 0 0 0 0 0 0 0 0 0 0 0 0 0 0 0 -1107.75 0 0.09 0 
0 0 476.318 0 0 0 0 0 0 0 0 0 327.235 0 -1200.67 0 0 0 1585.36 0 0 0 0 0 0 0 0 -101.245 0 0 0 0 0 0 0 0 0 1568.73 0 0 0 0 0 2112.11 0 0 0 0 0 
