*Vertices 29
*Matrix 
0 1164.66 0 369.198 0 0 -1799.14 0 0 0 0 0 0 0 0 2083.73 0 0 -497.223 0 0 -1401.18 1242.94 0 0 0 0 0 1195.33 
1317.87 0.07 0 0 0 0 0 0 0 0 0 -459.075 0 0 0 0 -1015.27 0 0 0 1040.15 2257.84 0 0 620.212 0 0 0 0 
0 0 0.05 0 0 0 0 0 0 0 0 0 1150.62 0 508.209 -962.02 0 -467.315 0 0 0 0 0 0 0 2199.24 1021.23 0 0 
2010.64 0 0 0.01 -1808.3 0 1667.46 2000.87 2190.08 0 -1625.03 0 0 0 0 -2235.25 0 2078.39 0 1012.22 0 0 532.929 0 0 0 -44.0229 0 2417.75 
0 0 0 1265.53 0.05 0 0 0 0 0 0 -301.752 889.233 -901.593 0 0 323.267 0 0 2472.99 2389.68 0 0 0 0 813.242 0 0 0 
0 0 0 0 0 0 0 0 1646.7 0 0 0 2358.55 0 0 0 0 0 -2162.16 570.162 0 1844.46 0 2250.97 0 0 0 0 0 
61.4185 0 0 -62.1815 0 0 0.04 1729.1 0 -674.688 1271.48 -2432.71 0 0 0 0 -663.091 0 2444.15 0 0 -1240.04 0 1732.46 0 0 0 790.811 0 
0 0 0 2060.53 0 0 -2472.84 0.09 142.903 0 0 0 0 0 0 0 0 0 0 0 0 1762.22 2420.04 2484.44 0 306.787 776.772 0 0 
0 0 0 -5.72222 0 456.328 0 2273.09 0.03 0 0 0 0 0 0 0 0 0 0 555.971 0 -1935.87 1008.56 0 0 0 0 0 -1051.44 
0 0 0 0 0 0 2078.23 0 0 0.08 1135.06 0 0 733.284 0 0 0 0 0 0 0 -2471.31 0 0 1399.5 0 270.928 0 0 
0 0 0 -1481.44 0 0 -1342.89 0 0 649.815 0.01 0 0 -1300.47 1837.29 0 -901.593 0 0 0 2151.78 0 0 -1830.73 0 1821.42 0 2401.58 0 
0 1750.16 0 0 2475.89 0 2215.41 0 0 0 0 0.04 1967.3 1803.57 0 0 -1326.56 0 0 0 1356.47 0 -2.82296 0 0 0 0 -1376 1860.03 
0 0 -217.521 0 1445.13 -96.3622 0 0 0 0 0 -430.54 0.08 0 0 1265.37 0 0 0 1546.91 0 0 0 -1218.38 1814.86 0 0 -484.252 0 
0 0 0 0 285.119 0 0 0 0 1758.71 -1369.59 -258.873 0 0.02 -1442.38 0 0 0 -991.775 0 1654.48 0 0 0 -593.204 0 2303.61 727.027 0 
0 0 -2036.42 0 0 0 0 0 0 0 489.441 0 0 1435.97 0.03 0 0 0 0 0 119.098 0 0 1179.62 0 0 0 0 0 
-74.0837 0 1021.53 -1197.78 0 0 0 0 0 0 0 0 1424.22 0 0 0.02 0 2264.7 830.79 0 0 0 0 0 0 0 -1210.29 0 0 
0 1397.98 0 0 1368.07 0 1300.93 0 0 0 -1329.31 -490.509 0 0 0 0 0.01 0 133.137 0 0 0 0 0 0 0 0 0 0 
0 0 -420.469 -428.556 0 0 0 0 0 0 0 0 0 0 0 1819.74 0 0.05 0 0 1773.66 -2072.89 1527.07 0 0 -1142.38 0 0 0 
1142.84 0 0 0 0 -484.863 -190.664 0 0 0 0 0 0 -147.023 0 -2060.53 1957.38 0 0.08 0 0 0 0 0 0 0 0 -1493.5 1972.79 
0 0 0 -723.365 2316.13 -1177.02 0 0 1223.87 0 0 0 -2414.09 0 0 0 0 0 0 0.04 0 0 0 0 0 0 2475.13 0 0 
0 150.075 0 0 878.246 0 0 0 0 0 -2042.22 -1221.43 0 619.602 1497.47 0 0 1643.96 0 0 0.06 -1442.38 2418.36 0 0 0 0 0 -235.221 
-1777.47 2218.01 0 0 0 1798.23 557.649 -5.87481 1906.87 -1117.21 0 0 0 0 0 0 0 1845.84 0 0 -2367.24 0.05 0 -1383.48 1165.73 0 0 1540.96 0 
1147.42 0 0 1798.38 0 0 0 -1240.2 2351.68 0 0 1618.93 0 0 0 0 0 28.7637 0 0 -2067.4 0 0.06 -1596.96 0 0 -408.261 0 1825.39 
0 0 0 0 0 2432.55 1372.04 1155.81 0 0 -613.956 0 1206.17 0 1162.37 0 0 0 0 0 0 -1830.73 763.802 0.03 2304.07 -519.501 206.992 0 0 
0 -617.466 0 0 0 0 0 0 0 2111.19 0 0 2.67037 -82.6289 0 0 0 0 0 0 0 309.076 0 2006.82 0.07 0 0 0 -906.476 
0 0 1698.13 0 -2231.59 0 0 503.327 0 0 271.844 0 0 0 0 0 0 -1250.57 0 0 0 0 0 1085.62 0 0.08 0 1864.76 -846.202 
0 0 -1239.74 1354.34 0 0 0 1946.39 0 -1370.05 0 0 0 2020.55 0 1310.39 0 0 0 -626.011 0 0 -1749.24 791.879 0 0 0.05 0 0 
0 0 0 0 0 0 2331.08 0 0 0 273.37 -113.147 -683.996 767.769 0 0 0 0 -1683.94 0 0 815.989 0 0 0 1172.29 0 0.04 2183.98 
-2121.42 0 0 1912.21 0 0 0 0 461.974 0 0 -1541.57 0 0 0 0 0 0 -1727.88 0 2086.47 0 -247.276 0 2073.81 1600.01 0 1077.23 0.06 
