*Vertices 62
*Matrix 
0.09 0 0 0 0 -1624.27 0 -547.884 752.968 0 0 0 1513.95 0 0 -594.119 0 0 0 0 0 0 0 0 0 0 0 0 1319.7 0 0 0 0 0 0 0 0 1187.09 0 0 0 59.2822 1316.19 0 0 0 779.366 0 0 0 0 -968.886 0 0 0 0 0 0 0 0 0 0 
0 0.06 0 0 0 0 0 0 0 0 0 0 2270.5 0 0 0 0 -487.609 0 0 0 0 0 0 0 1296.66 0 0 0 0 0 0 0 0 0 0 0 0 0 0 0 -698.645 0 0 0 0 0 0 2317.35 0 0 0 0 0 0 2178.03 1046.56 0 0 0 0 0 
0 0 0.03 0 -383.694 0 0 0 0 -779.061 -686.895 0 0 0 0 0 0 0 232.17 0 0 0 521.18 0 0 2493.9 0 0 0 0 303.278 0 0 0 0 0 0 0 0 0 0 0 0 0 0 0 0 0 1821.73 -1555.91 0 0 103.839 0 0 0 0 0 0 0 0 0 
0 0 0 0.05 -911.969 5.11185 0 0 0 0 0 0 0 1483.12 0 0 -978.347 0 0 0 0 515.381 0 0 0 0 0 0 0 969.039 0 0 0 0 0 0 0 0 1568.12 0 0 0 0 0 0 0 0 0 0 0 0 0 -1736.58 0 0 0 0 0 0 0 0 0 
0 0 2085.56 785.928 0.01 0 0 0 0 1092.79 0 0 0 0 0 0 0 1912.21 444.426 0 0 799.203 -438.322 0 0 0 -403.531 0 -2111.19 0 0 0 0 0 0 0 0 499.969 0 0 0 0 0 547.884 382.626 0 0 0 0 0 0 0 0 0 0 0 0 0 0 0 0 0 
376.522 0 0 1744.21 0 0.09 2449.49 0 0 0 1536.23 0 0 0 0 -968.276 0 0 -1716.74 0 -1776.25 0 0 0 0 1517.61 122.303 0 0 0 0 221.793 0 0 0 0 0 0 0 0 0 0 -1068.83 0 -2150.26 0 0 0 0 0 0 0 0 0 0 0 0 0 0 0 0 0 
0 0 0 0 0 1988.36 0.05 0 0 0 0 0 0 0 0 0 0 0 1141.47 0 0 0 0 -870.922 0 0 0 0 0 0 0 0 0 0 333.186 0 0 0 0 0 -1908.86 0 0 0 0 0 0 0 0 0 0 0 0 0 0 0 0 0 0 0 0 0 
394.528 0 0 0 0 0 0 0.06 0 0 0 0 0 2244.41 -302.667 -504.547 1835.31 0 0 0 0 0 0 0 0 0 0 0 -1294.82 0 0 0 0 0 0 0 0 0 0 0 0 0 0 0 0 0 0 0 0 0 0 0 0 0 0 0 0 0 0 0 0 0 
-903.882 0 0 0 0 0 0 0 0.01 0 0 -2265.01 0 0 0 0 0 1105.61 0 0 1786.48 0 0 0 0 0 0 1258.35 0 0 0 -1901.99 0 0 0 137.562 0 0 0 2200.92 0 0 0 280.389 0 2249.6 -1302.61 0 0 0 384.61 0 0 0 0 0 0 0 0 0 0 0 
0 0 1543.86 0 -847.118 0 0 0 0 0.08 0 0 0 0 0 0 2317.96 0 0 0 0 0 0 0 0 -438.475 0 1545.69 0 0 0 0 423.063 0 0 0 0 0 0 0 0 0 0 1625.49 604.648 0 0 0 0 0 0 0 0 0 0 0 0 0 0 0 0 0 
0 0 2349.09 0 0 -184.713 0 0 0 0 0.05 0 0 0 0 0 0 0 0 0 0 -1078.45 0 0 0 744.27 0 0 0 0 0 0 0 0 0 462.127 0 0 0 0 505.31 2060.53 0 0 0 0 0 832.926 1455.5 -2082.96 0 0 119.709 0 0 0 0 0 0 0 0 0 
0 0 0 0 0 0 0 0 246.055 0 0 0.07 0 0 0 0 1550.87 0 0 0 0 0 0 913.648 0 0 0 0 1261.41 12.4363 0 0 0 0 0 0 0 0 0 -154.042 0 0 0 0 1335.26 0 0 221.03 0 1414.91 0 0 0 0 0 0 0 0 0 0 0 0 
-1819.13 2007.13 0 0 0 0 0 0 0 0 0 0 0.09 0 0 0 0 0 0 0 0 0 0 0 0 0 0 0 0 1218.07 0 0 0 0 2215.72 0 0 0 0 0 0 -2324.37 0 0 0 1476.1 0 0 0 2413.79 0 0 16.8615 0 0 0 0 0 0 0 0 0 
0 0 0 2482.45 0 0 0 -478.607 0 0 0 0 0 0.01 0 0 0 0 -948.134 0 0 0 0 0 0 0 0 0 0 -2010.03 0 0 0 0 0 1387.6 0 0 0 0 0 1179.31 0 0 1211.05 0 0 0 0 0 2004.38 -2187.64 818.125 0 0 0 0 0 0 0 0 0 
0 0 0 0 0 0 0 543.001 0 0 0 0 0 0 0.04 0 0 0 0 0 0 0 0 0 812.174 0 0 0 1388.21 0 0 0 0 0 640.66 0 0 0 0 0 48.4481 0 0 0 0 0 0 -1575.59 134.816 0 0 0 0 0 0 0 0 0 0 0 0 0 
-2473.45 0 0 0 0 1880.17 0 755.715 0 0 0 0 0 0 0 0.07 0 0 0 0 0 0 -2364.96 0 0 -858.562 1604.89 0 0 0 0 0 0 0 0 1458.4 0 0 0 0 -1891.46 0 1283.38 0 0 0 0 0 0 0 0 0 0 0 86.4437 0 0 0 0 0 0 0 
0 0 0 -1758.1 0 0 0 1990.19 0 1680.12 0 1584.44 0 0 0 0 0.05 -1024.43 0 0 0 0 0 0 0 0 378.506 0 0 0 0 0 365.535 0 0 0 0 0 0 0 0 0 0 0 0 2013.53 0 0 0 -1961.35 0 0 0 0 0 0 0 0 0 0 0 0 
0 364.315 0 0 1224.78 0 0 0 338.832 0 0 0 0 0 0 0 2177.72 0 0 0 0 0 0 0 0 0 -1036.03 0 0 0 0 0 0 0 0 0 0 0 0 0 0 0 0 0 0 0 0 0 0 0 0 0 0 0 0 0 0 0 0 0 0 0 
0 0 -1850.57 0 -738.166 -748.543 -431.608 0 0 0 0 0 0 -203.94 0 0 0 0 0.04 0 1875.29 0 0 1670.35 -224.845 0 0 0 0 -788.064 0 0 0 0 0 1976.45 0 0 1681.49 0 0 0 0 0 0 1945.48 0 0 0 0 0 0 1286.89 0 0 0 0 0 0 0 0 0 
0 0 0 0 0 0 0 0 0 0 0 0 0 0 0 0 0 0 0 0.02 0 0 -510.346 0 0 0 0 0 0 0 0 0 0 0 0 0 0 0 0 0 0 0 613.956 0 0 0 1535.77 0 0 0 2069.84 2118.37 0 0 0 0 0 0 0 0 0 0 
0 0 0 0 0 2126.91 0 0 -30.7474 0 0 0 0 0 0 0 0 0 -1181.91 0 0 1851.48 0 0 0 0 0 0 0 0 0 825.297 -2415.46 0 0 0 0 0 0 0 0 0 0 0 1979.2 0 0 0 0 0 0 0 0 0 0 0 0 0 0 0 0 0 
0 0 0 -2350.31 2459.11 0 0 0 0 0 -766.091 0 0 0 0 0 0 0 0 0 1760.08 0 0 0 -1957.08 0 0 2139.12 0 0 0 0 0 0 0 0 0 0 0 -794.32 0 943.403 0 0 0 2482.15 0 0 0 0 0 0 0 0 0 0 0 0 0 0 0 0 
0 0 1849.19 0 -587.1 0 0 0 0 0 0 0 0 0 0 -248.497 0 0 0 -452.513 0 0 0.03 0 0 0 0 0 0 0 0 0 0 0 0 0 1182.52 1612.67 0 0 2389.83 0 0 0 98.8037 0 0 0 0 1452.91 0 -407.651 0 0 0 0 0 0 0 0 0 0 
0 0 0 0 0 0 843.455 0 0 0 0 -649.052 0 0 0 0 0 0 2133.78 0 0 0 0 0 0 0 0 2169.64 0 0 1775.8 0 0 1396.15 0 0 0 0 0 0 0 0 2496.64 0 0 0 0 0 0 0 0 0 0 0 0 0 0 0 0 0 0 0 
0 0 0 0 0 0 0 0 0 0 0 0 0 0 -1719.03 0 0 0 1338.31 0 0 -1082.42 0 0 0.06 0 300.073 218.436 0 0 0 0 -865.581 0 0 0 0 -2391.81 0 0 0 0 2030.17 2428.89 2038.71 0 -224.235 0 -298.395 0 0 0 0 0 0 0 0 0 0 0 0 0 
0 1356.93 -1433.23 0 0 -1507.84 0 0 0 1334.65 941.115 0 0 0 0 263.604 0 0 0 0 0 0 0 0 0 0 0 0 0 0 367.672 0 0 0 0 0 0 0 0 0 0 2497.71 0 0 676.366 0 0 0 0 0 0 1614.66 -647.069 0 0 0 0 1648.08 0 0 -1181.14 0 
0 0 0 0 -1715.52 2472.23 0 0 0 0 0 0 0 0 0 22.0496 913.495 922.651 0 0 0 0 0 0 1757.94 0 0.03 0 0 0 0 0 0 0 0 0 0 0 0 0 0 0 2115.77 0 0 0 0 0 0 0 -2102.19 0 1618.32 0 0 0 0 0 0 0 0 0 
0 0 0 0 0 0 0 0 -15.4881 1926.1 0 0 0 0 0 0 0 0 0 0 0 -1565.98 0 1961.2 -75.3044 0 0 0.03 0 0 0 0 0 0 0 0 0 864.055 0 0 3.58592 0 0 0 0 0 501.19 0 0 0 0 941.267 56.2304 0 0 0 0 0 0 0 0 0 
1059.68 0 0 0 -210.501 0 0 426.115 0 0 0 503.021 0 0 -373.47 0 0 0 0 0 0 0 0 0 0 0 0 0 0.08 0 0 0 0 731.758 0 0 0 0 0 0 0 0 1086.08 0 0 0 0 0 0 2275.54 0 0 0 0 0 0 0 0 0 0 0 0 
0 0 0 2254.78 0 0 0 0 0 0 0 -633.03 1367 -1068.38 0 0 0 0 297.479 0 0 0 0 0 0 0 0 0 0 0.03 0 0 0 0 0 0 333.644 0 0 0 0 -2300.1 0 0 0 0 0 0 697.729 0 1235.31 0 0 0 0 0 0 0 0 0 0 0 
0 0 -1510.28 0 0 0 0 0 0 0 0 0 0 0 0 0 0 0 0 0 0 0 0 1396.91 0 1998.12 0 0 0 0 0.03 0 0 0 0 0 2306.82 0 0 0 0 -1688.51 0 314.112 0 0 0 0 0 -567.263 0 0 0 0 0 0 0 0 0 0 0 0 
0 0 0 0 0 -256.432 0 0 258.11 0 0 0 0 0 0 0 0 0 0 0 1123.16 0 0 0 0 0 0 0 0 0 0 0.04 2386.62 979.263 0 -1762.83 0 0 0 0 0 0 0 0 0 0 0 0 1946.55 0 0 2301.02 0 0 0 0 0 0 0 0 0 0 
0 0 0 0 0 0 0 0 0 2434.08 0 0 0 0 0 0 -1239.74 0 0 0 861.919 0 0 0 1612.83 0 0 0 0 0 0 -2074.42 0.01 0 241.935 0 1818.37 0 724.891 -89.3429 0 -1106.07 0 0 0 0 0 0 0 0 -241.02 0 0 0 0 0 0 0 -108.417 0 0 0 
0 0 0 0 0 0 0 0 0 0 0 0 0 0 0 0 0 0 0 0 0 0 0 -955.306 0 0 0 0 793.405 0 0 -455.565 0 0 0 0 0 0 0 0 0 0 0 0 0 0 0 0 0 0 0 1129.72 0 0 0 0 0 0 0 0 0 0 
0 0 0 0 0 0 1627.78 0 0 0 0 0 985.672 0 -1382.11 0 0 0 0 0 0 0 0 0 0 0 0 0 0 0 0 0 2023.61 0 0.05 0 0 630.284 0 787.149 0 476.165 1298.18 0 0 0 0 0 0 246.208 0 0 -1830.27 0 0 0 0 0 0 0 0 0 
0 0 0 0 0 0 0 0 -574.282 0 1762.22 0 0 1712.01 0 -1388.67 0 0 2373.35 0 0 0 0 0 0 0 0 0 0 0 0 -217.521 0 0 0 0.07 0 0 0 0 -1139.33 0 0 553.987 0 0 0 0 0 0 0 0 0 786.386 0 0 0 0 0 0 0 0 
0 0 0 0 0 0 0 0 0 0 0 0 0 0 0 0 0 0 0 0 0 0 2422.64 0 0 0 0 0 0 -1756.26 1459.17 0 -17.777 0 0 0 0.06 0 0 0 916.852 0 2467.19 -359.432 0 560.549 0 0 0 0 0 0 0 0 0 0 0 0 0 0 0 0 
1885.05 0 0 0 -2483.98 0 0 0 0 0 0 0 0 0 0 0 0 0 0 0 0 0 1789.99 0 -513.398 0 0 967.666 0 0 0 0 0 0 -1298.94 0 0 0.08 0 2090.44 0 0 0 0 0 0 0 0 0 0 0 0 0 0 0 0 0 0 0 0 0 0 
0 0 0 -1051.74 0 0 0 0 0 0 0 0 0 0 0 0 0 0 -383.541 0 0 0 0 0 0 0 0 0 0 0 0 0 2069.08 0 0 0 0 0 0.01 0 0 0 0 0 0 1334.8 0 0 0 0 2073.2 1351.59 0 0 0 0 0 0 0 0 0 0 
0 0 0 0 0 0 0 0 1682.71 0 0 1426.82 0 0 0 0 0 0 0 0 0 1180.53 0 0 0 0 0 0 0 0 0 0 -1338.92 0 1501.59 0 0 1000.47 0 0.03 63.097 0 0 0 0 0 0 0 0 1991.56 0 0 0 0 0 0 0 0 0 0 0 0 
0 0 0 0 0 0 2227.32 0 0 0 -356.38 0 0 0 -1858.96 392.392 0 0 0 0 0 0 -1917.55 0 0 0 0 1377.38 0 0 0 0 0 0 0 1280.02 649.51 0 0 1732.92 0.08 1101.64 0 0 0 0 0 0 0 0 0 0 0 0 0 0 0 0 0 0 0 0 
2091.2 1221.88 0 0 0 0 0 0 0 0 2474.82 0 -2150.72 1332.82 0 0 0 0 0 0 0 -823.466 0 0 0 -727.79 0 0 0 -168.081 2109.36 0 -1469.54 0 1411.56 0 0 0 0 0 1377.83 0.01 660.649 0 0 0 0 0 0 0 131.916 0 1208.76 0 0 0 0 0 0 0 0 0 
-550.63 0 0 0 0 2078.84 0 0 0 0 0 0 0 0 0 2068.01 0 0 0 412.229 0 0 0 2206.72 -500.427 0 -2339.93 0 -1328.09 0 0 0 0 0 2244.87 0 -466.704 0 0 0 0 -1906.72 0.03 1311.76 0 0 0 0 0 0 0 549.562 0 0 0 0 0 0 0 0 0 0 
0 0 0 0 -65.6911 0 0 0 -597.781 2200.46 0 0 0 0 0 0 0 0 0 0 0 0 0 0 -1469.85 0 0 0 0 0 -1849.19 0 0 0 0 -444.121 1173.67 0 0 0 0 0 2300.87 0.09 0 0 -1561.56 0 655.461 0 0 0 1004.44 0 0 0 0 0 0 0 0 0 
0 0 0 0 -2446.29 1527.99 0 0 0 1346.86 0 -898.389 0 -291.223 0 0 0 0 0 0 1996.6 0 1704.99 0 -6.63778 2019.64 0 0 0 0 0 0 0 0 0 0 0 0 0 0 0 0 0 0 0.04 0 0 0 0 0 0 0 0 0 0 0 0 0 0 0 0 0 
0 0 0 0 0 0 0 0 -318.384 0 0 0 1601.23 0 0 0 -1148.95 0 1622.59 0 0 2104.79 0 0 0 0 0 0 0 0 0 0 0 0 0 0 -1722.69 0 1895.43 0 0 0 0 0 0 0.09 0 0 0 0 0 0 1353.11 0 0 0 0 0 0 0 0 1294.06 
-1178.24 0 0 0 0 0 0 0 2127.06 0 0 0 0 0 0 0 0 0 0 2226.1 0 0 0 0 -1942.88 0 0 -1802.96 0 0 0 0 0 0 0 0 0 0 0 0 0 0 0 -968.581 0 0 0.07 2395.78 0 0 0 0 0 0 0 0 0 0 0 0 0 0 
0 0 0 0 0 0 0 0 0 0 -1940.6 2398.83 0 0 -187.765 0 0 0 0 0 0 0 0 0 0 0 0 0 0 0 0 0 0 0 0 0 0 0 0 0 0 0 0 0 0 0 2345.88 0.02 -1196.4 0 0 0 0 0 0 0 0 0 0 1060.29 0 0 
0 2349.09 2140.95 0 0 0 0 0 0 0 1267.66 0 0 0 1024.12 0 0 0 0 0 0 0 0 0 510.804 0 0 0 0 706.275 0 -905.408 0 0 0 0 0 0 0 0 0 0 0 1419.03 0 0 0 606.937 0.07 0 0 0 0 0 0 0 0 0 0 0 0 0 
0 0 -2238.3 0 0 0 0 0 0 0 1130.63 -31.3578 1768.17 0 0 0 -938.978 0 0 0 0 0 -2320.25 0 0 0 0 0 2102.19 0 684.759 0 0 0 1875.44 0 0 0 0 2396.24 0 0 0 0 0 0 0 0 0 0.04 0 0 0 0 0 0 0 0 0 0 0 0 
0 0 0 0 0 0 0 0 2122.18 0 0 0 0 2371.36 0 0 0 0 0 1305.05 0 0 0 0 0 0 2121.27 0 0 2014.91 0 0 -807.596 0 0 0 0 0 -379.727 0 0 588.778 0 0 0 0 0 0 0 0 0.07 0 0 0 0 0 0 0 0 0 0 0 
874.889 0 0 0 0 0 0 0 0 0 0 0 0 855.815 0 0 0 0 0 -89.8007 0 0 -1481.9 0 0 1807.08 0 -1935.87 0 0 0 -2150.56 0 1494.72 0 0 0 0 -470.214 0 0 0 1563.84 0 0 0 0 0 0 0 0 0.08 904.95 0 0 0 0 0 0 0 0 0 
0 0 1697.06 -561.007 0 0 0 0 0 0 -1119.19 0 576.418 -25.4067 0 0 0 0 969.192 0 0 0 0 0 0 -232.78 512.787 -279.931 0 0 0 0 0 0 311.212 0 0 0 0 0 0 1047.62 0 1532.72 0 1977.22 0 0 0 0 0 2413.48 0.03 0 0 0 0 0 0 0 0 0 
0 0 0 0 0 0 0 0 0 0 0 0 0 0 0 0 0 0 0 0 0 0 0 0 0 0 0 0 0 0 0 0 0 0 0 1334.5 0 0 0 0 0 0 0 0 0 0 0 0 0 0 0 0 0 0.05 0 0 0 0 0 0 0 0 
0 0 0 0 0 0 0 0 0 0 0 0 0 0 0 202.109 0 0 0 0 0 0 0 0 0 0 0 0 0 0 0 0 0 0 0 0 0 0 0 0 0 0 0 0 0 0 0 0 0 0 0 0 0 0 0.03 0 0 0 0 0 0 0 
0 2058.85 0 0 0 0 0 0 0 0 0 0 0 0 0 0 0 0 0 0 0 0 0 0 0 0 0 0 0 0 0 0 0 0 0 0 0 0 0 0 0 0 0 0 0 0 0 0 0 0 0 0 0 0 0 0.07 0 0 0 0 0 0 
0 92.2422 0 0 0 0 0 0 0 0 0 0 0 0 0 0 0 0 0 0 0 0 0 0 0 0 0 0 0 0 0 0 0 0 0 0 0 0 0 0 0 0 0 0 0 0 0 0 0 0 0 0 0 0 0 0 0.05 0 0 0 0 0 
0 0 0 0 0 0 0 0 0 0 0 0 0 0 0 0 0 0 0 0 0 0 0 0 0 1958.75 0 0 0 0 0 0 0 0 0 0 0 0 0 0 0 0 0 0 0 0 0 0 0 0 0 0 0 0 0 0 0 0.08 0 0 0 0 
0 0 0 0 0 0 0 0 0 0 0 0 0 0 0 0 0 0 0 0 0 0 0 0 0 0 0 0 0 0 0 0 1593.91 0 0 0 0 0 0 0 0 0 0 0 0 0 0 0 0 0 0 0 0 0 0 0 0 0 0.05 0 0 0 
0 0 0 0 0 0 0 0 0 0 0 0 0 0 0 0 0 0 0 0 0 0 0 0 0 0 0 0 0 0 0 0 0 0 0 0 0 0 0 0 0 0 0 0 0 0 0 332.881 0 0 0 0 0 0 0 0 0 0 0 0.06 0 0 
0 0 0 0 0 0 0 0 0 0 0 0 0 0 0 0 0 0 0 0 0 0 0 0 0 2361.6 0 0 0 0 0 0 0 0 0 0 0 0 0 0 0 0 0 0 0 0 0 0 0 0 0 0 0 0 0 0 0 0 0 0 0.04 0 
0 0 0 0 0 0 0 0 0 0 0 0 0 0 0 0 0 0 0 0 0 0 0 0 0 0 0 0 0 0 0 0 0 0 0 0 0 0 0 0 0 0 0 0 0 1498.54 0 0 0 0 0 0 0 0 0 0 0 0 0 0 0 0.01 
