*Vertices 51
*Matrix 
0.06 0 1250.72 0 -583.285 0 356.227 1554.23 0 1775.8 0 0 0 0 0 1405.45 0 0 0 0 -509.583 -613.651 0 -2470.7 815.531 0 0 0 0 0 0 0 0 0 0 0 0 0 0 0 0 0 0 2023.91 0 66.6066 0 0 0 0 0 
0 0.05 0 0 0 0 0 310.602 0 0 0 0 0 0 0 -262.841 2200.61 9.23185 0 0 829.875 54.7044 2018.27 0 0 921.125 0 0 0 0 0 0 2311.85 0 1694.31 0 0 0 0 0 0 0 0 0 0 0 0 0 0 0 0 
1797.77 0 0.07 0 0 0 0 0 0 1971.88 0 0 0 0 2395.93 0 0 2116.08 -1168.17 0 0 0 0 2128.28 -1228.6 -1232.87 0 0 0 0 0 0 228.507 0 0 0 0 0 0 0 0 0 933.485 0 0 0 0 0 0 0 1305.96 
0 0 0 0.01 -1863.23 -2188.41 0 1788.31 2390.13 0 0 0 2227.62 1260.34 0 0 0 586.642 0 0 0 1873.3 0 1447.42 0 0 0 0 0 0 0 0 0 0 0 0 588.778 0 0 0 0 0 0 0 0 -14.8778 0 0 0 0 0 
2101.43 0 0 1327.63 0.05 -1824.78 0 0 0 0 0 0 1291.77 0 0 0 0 0 0 0 0 2079.76 0 0 0 0 529.725 0 0 0 0 0 0 0 -817.209 1523.26 0 0 0 0 0 0 0 -1778.7 949.355 -1265.22 -64.1652 0 0 0 0 
0 0 0 1563.23 880.23 0.06 1504.94 0 0 0 0 0 0 -837.352 0 -1401.18 0 0 0 1158.71 0 0 0 0 1386.07 0 0 0 0 0 0 -1029.16 0 0 0 0 0 0 0 0 0 0 0 0 0 0 122.303 0 0 0 0 
845.286 0 0 0 0 466.552 0.08 0 0 0 0 0 0 0 -1123.77 0 2316.28 0 0 0 0 0 296.564 0 1579.56 0 0 0 0 0 0 0 0 915.326 0 0 0 0 0 0 0 0 0 0 -2078.08 0 0 0 0 0 0 
636.235 -254.295 0 1635.11 0 0 0 0.07 1227.99 0 0 0 2366.33 0 564.669 0 0 1872.23 0 -2124.62 0 0 -880.078 0 1918.01 0 0 0 0 -2438.66 0 0 0 0 0 0 0 0 347.53 0 0 0 0 0 0 0 0 0 8.46889 0 0 
0 0 0 2129.05 0 0 0 -655.766 0.09 0 0 1686.99 -2324.37 0 1763.89 0 1088.98 0 0 -606.021 0 0 1679.36 0 -882.824 0 0 0 0 0 0 0 0 0 0 0 0 0 0 0 0 0 0 0 0 0 0 0 0 0 0 
2487.18 0 2338.56 0 0 0 0 0 0 0.07 -1690.95 0 -1094.62 0 0 0 281.304 0 0 0 0 0 1294.06 2159.57 0 -1973.1 0 0 0 0 0 0 0 0 0 0 0 0 0 0 -1871.47 0 0 0 0 0 0 0 0 2476.96 0 
0 0 0 0 0 0 0 0 0 1781.44 0.05 0 0 0 0 0 0 1122.24 0 0 1939.83 0 0 0 1470.61 0 0 0 0 0 323.573 0 0 0 0 2307.73 547.578 0 0 0 0 0 0 0 0 0 0 0 0 0 0 
0 0 0 0 0 0 0 0 2457.58 0 0 0.04 -163.808 2267.91 0 0 0 0 0 -2303 0 2033.37 0 -2186.27 158.01 0 0 0 0 0 0 0 0 0 0 0 0 0 0 0 0 0 0 0 0 0 0 0 0 0 1398.43 
0 0 0 2334.74 1190.3 0 0 259.789 -550.02 -517.823 0 292.138 0.01 1090.96 1996.44 -2200 0 0 0 0 1900.77 0 0 -203.33 0 0 0 425.199 0 0 0 0 0 0 0 0 -1966.99 0 0 0 0 1910.84 0 0 0 0 0 0 0 -573.977 -1830.42 
0 0 0 174.947 0 2437.89 0 0 0 0 0 2173.45 1406.22 0.08 0 0 0 0 596.713 2466.58 -2396.08 344.935 0 0 0 0 0 0 0 0 0 596.103 0 1581.7 0 -685.369 0 0 0 0 0 0 0 0 0 0 0 0 0 0 0 
0 0 1842.02 0 0 0 1166.34 1050.83 1952.65 0 0 0 1186.79 0 0.03 0 1086.08 0 875.042 0 0 0 371.792 0 863.598 0 0 0 0 0 0 0 0 0 1925.79 0 0 0 0 0 0 0 569.247 0 0 0 0 0 0 1054.95 0 
797.525 227.744 0 0 0 -180.898 0 0 0 0 0 0 1133.38 0 0 0.06 0 0 0 0 -109.79 0 0 0 0 0 0 0 0 0 0 194.479 331.05 0 0 0 0 0 0 0 0 0 0 394.681 0 0 0 -1244.16 0 0 0 
0 2466.28 0 0 0 0 223.167 0 2400.97 597.781 0 0 0 0 2384.95 0 0.02 0 957.289 0 -1210.29 0 -148.701 0 -504.395 0 0 0 0 0 0 0 0 0 0 0 -182.119 0 0 0 -2154.23 0 0 0 0 0 0 0 0 0 0 
0 1886.58 -39.14 1588.56 0 0 0 -1975.08 0 0 819.651 0 0 0 0 0 0 0.01 2251.12 0 0 0 0 0 0 0 0 0 0 0 0 0 1962.26 -2363.58 0 0 0 0 0 0 0 0 0 0 0 0 809.275 0 0 0 -1017.11 
0 0 -902.509 0 0 0 0 0 0 0 0 0 0 1904.89 982.162 0 2364.8 -265.587 0.03 0 0 0 -1203.73 0 -321.894 0 0 0 0 0 0 0 -1834.85 0 1995.07 0 0 0 0 535.524 0 0 0 0 0 0 0 0 0 0 0 
0 0 0 0 0 1943.65 0 270.623 1865.52 0 0 1472.14 0 2464.9 0 0 0 0 0 0.07 0 0 0 -89.1903 0 0 0 0 0 0 2204.73 0 0 0 0 0 0 0 0 0 0 0 -1139.94 0 0 0 0 0 0 0 0 
-1350.06 -391.934 0 0 0 0 0 0 0 0 699.255 0 564.669 235.679 0 1965.93 1995.83 0 0 0 0.08 0 0 0 0 0 0 0 0 0 0 0 0 0 0 0 0 1603.52 959.731 0 0 0 0 0 0 0 0 235.069 -284.204 0 0 
1686.83 2378.99 0 -731.3 -2389.22 0 0 0 0 0 0 -674.383 0 1546.6 0 0 0 0 0 0 0 0.02 0 0 0 0 0 309.992 1988.51 0 0 0 0 0 0 2393.03 0 0 1843.09 0 0 786.996 -76.8303 0 0 0 0 0 0 0 0 
0 19.9133 0 0 0 0 77.4407 -559.786 2282.86 2281.95 0 0 0 0 644.78 0 -908.612 0 -2101.89 0 0 0 0.03 0 0 -692.694 0 1974.01 0 0 -1578.95 0 0 0 0 0 0 0 0 0 0 95.5992 0 0 0 0 0 0 0 -719.092 0 
-390.255 0 -941.725 1583.07 0 0 0 0 0 -109.333 0 921.125 1877.42 0 0 0 0 0 0 1121.02 0 0 0 0.02 0 0 0 0 536.134 -513.855 0 0 0 0 442.442 0 0 0 1156.27 0 0 0 0 0 -2102.5 0 0 0 0 0 0 
-1007.8 0 2262.87 0 0 2112.72 1981.8 1694.92 -138.478 0 -606.632 2454.22 0 0 851.238 0 1804.48 0 -1172.6 0 0 0 0 0 0.02 0 0 730.537 0 0 0 0 0 0 0 0 0 0 0 -2480.01 0 0 0 -1390.96 0 0 0 0 0 0 0 
0 1320.61 720.618 0 0 0 0 0 0 1191.82 0 0 0 0 0 0 0 0 0 0 0 0 -1830.27 0 0 0 0 0 0 364.925 0 0 0 0 0 0 0 357.295 0 0 0 0 0 0 1905.04 0 0 0 0 999.405 0 
0 0 0 0 -108.57 0 0 0 0 0 0 0 0 0 0 0 0 0 0 0 0 0 0 0 0 0 0.07 0 0 0 0 0 0 0 153.737 277.184 2453.61 0 0 0 0 0 0 0 0 0 903.882 0 0 0 0 
0 0 0 0 0 0 0 0 0 0 0 0 510.498 0 0 0 0 0 0 0 0 1411.25 -525.91 0 2405.39 0 0 0.03 0 0 0 0 -204.703 0 0 0 0 0 0 0 -1602.15 0 0 -1060.14 0 0 2131.49 -1609.01 0 0 0 
0 0 0 0 0 0 0 0 0 0 0 0 0 0 0 0 0 0 0 0 0 1489.53 0 653.935 0 0 0 0 0.08 0 1920.15 0 0 2155.75 0 0 0 0 0 0 0 0 0 0 0 0 0 0 0 0 0 
0 0 0 0 0 0 0 1156.58 0 0 0 0 0 0 0 0 0 0 0 0 0 0 0 2245.32 0 -798.898 0 0 0 0.04 0 0 0 0 -1013.29 0 0 0 0 1380.12 0 0 0 0 0 0 0 0 0 0 2391.2 
0 0 0 0 0 0 0 0 0 0 2203.97 0 0 0 0 0 0 0 0 -349.666 0 0 -791.726 0 0 0 0 0 1177.94 0 0.08 0 442.9 0 0 0 0 0 0 0 0 0 0 0 0 0 0 0 0 0 0 
0 0 0 0 0 -1176.72 0 0 0 0 0 0 0 2168.72 0 1192.59 0 0 0 0 0 0 0 0 0 0 0 0 0 0 0 0.02 0 0 0 0 0 0 0 0 0 0 0 0 0 0 0 0 0 0 0 
0 1012.83 534.761 0 0 0 0 0 0 0 0 0 0 0 0 339.29 0 1364.86 -552.004 0 0 0 0 0 0 0 0 1036.18 0 0 -678.655 0 0.04 0 0 0 0 0 0 0 0 0 0 0 0 0 0 0 0 0 0 
0 0 0 0 0 0 969.039 0 0 0 0 0 0 -488.983 0 0 0 -533.54 0 0 0 0 0 0 0 0 0 0 874.279 0 0 0 0 0 0 1193.04 -201.651 1833.78 0 0 0 0 0 0 0 0 0 0 0 0 0 
0 431.761 0 0 672.246 0 0 0 0 0 0 0 0 0 392.239 0 0 0 469.604 0 0 0 0 985.519 0 0 1685 0 0 -1338.62 0 0 0 0 0.09 0 -1352.2 0 0 0 0 0 -836.589 0 0 0 0 0 0 0 2378.23 
0 0 0 0 2087.54 0 0 0 0 0 2283.17 0 0 -1413.85 0 0 0 0 0 0 0 1633.27 0 0 0 0 172.964 0 0 0 0 0 0 -2120.04 0 0.01 0 0 0 0 0 -1858.81 0 0 0 0 0 0 0 0 0 
0 0 0 997.116 0 0 0 0 0 0 339.595 0 1819.59 0 0 0 2040.24 0 0 0 0 0 0 0 0 0 -297.784 0 0 0 0 0 0 -321.284 1450.32 0 0.07 0 0 0 0 0 0 0 2331.08 0 0 0 -1665.93 0 0 
0 0 0 0 0 0 0 0 0 0 0 0 0 0 0 0 0 0 0 0 345.241 0 0 0 0 -433.592 0 0 0 0 0 0 0 1565.68 0 0 0 0.05 0 0 0 0 0 0 0 0 0 0 0 0 0 
0 0 0 0 0 0 0 1423 0 0 0 0 0 0 0 0 0 0 0 0 -1005.66 -328.608 0 1876.05 0 0 0 0 0 0 0 0 0 0 0 0 0 0 0.09 0 0 0 0 0 0 0 0 0 0 0 0 
0 0 0 0 0 0 0 0 0 0 0 0 0 0 0 0 0 0 2469.48 0 0 0 0 0 101.856 0 0 0 0 255.974 0 0 0 0 0 0 0 0 0 0.03 0 0 0 0 -263.756 -1144.06 0 0 742.286 0 0 
0 0 0 0 0 0 0 0 0 687.353 0 0 0 0 0 0 205.313 0 0 0 0 0 0 0 0 0 0 1900.62 0 0 0 0 0 0 0 0 0 0 0 0 0.01 0 382.931 0 0 0 0 0 0 0 0 
0 0 0 0 0 0 0 0 0 0 0 0 1881.85 0 0 0 0 0 0 0 0 411.924 1710.33 0 0 0 0 0 0 0 0 0 0 0 0 -504.547 0 0 0 0 0 0.05 0 0 0 0 0 0 0 -1889.48 0 
0 0 442.747 0 0 0 0 0 0 0 0 0 0 0 469.298 0 0 0 0 1858.81 0 595.492 0 0 0 0 0 0 0 0 0 0 0 0 -567.11 0 0 0 0 0 -1174.89 0 0.02 0 0 0 0 0 0 1560.49 0 
-80.1874 0 0 0 -549.104 0 0 0 0 0 0 0 0 0 0 1625.49 0 0 0 0 0 0 0 0 2310.63 0 0 2225.03 0 0 0 0 0 0 0 0 0 0 0 0 0 0 0 0.07 0 0 -1553.62 1209.98 0 0 2464.75 
0 0 0 0 -1429.41 0 -1188.16 0 0 0 0 0 0 0 0 0 0 0 0 0 0 0 0 2278.13 0 2264.55 0 0 0 0 0 0 0 0 0 0 -637.761 0 0 1706.82 0 0 0 0 0.06 0 0 0 0 0 0 
-1004.75 0 0 -1863.84 2072.44 0 0 0 0 0 0 0 0 0 0 0 0 0 0 0 0 0 0 0 0 0 0 0 0 0 0 0 0 0 0 0 0 0 0 1309.63 0 0 0 0 0 0.07 0 0 0 0 0 
0 0 0 0 2497.41 -1681.34 0 0 0 0 0 0 0 0 0 0 0 -466.552 0 0 0 0 0 0 0 0 -90.5637 1029.77 0 0 0 0 0 0 0 0 0 0 0 0 0 0 0 1993.39 0 0 0.03 0 -1393.25 0 0 
0 0 0 0 0 0 0 0 0 0 0 0 0 0 0 -1216.7 0 0 0 0 2254.33 0 0 0 0 0 0 2002.85 0 0 0 0 0 0 0 0 0 0 0 0 0 0 0 -226.829 0 0 0 0.08 0 0 0 
0 0 0 0 0 0 0 -1919.08 0 0 0 0 0 0 0 0 0 0 0 0 2275.84 0 0 0 0 0 0 0 0 0 0 0 0 0 0 0 1864.45 0 0 -508.82 0 0 0 0 0 0 -1342.74 0 0.04 0 0 
0 0 0 0 0 0 0 0 0 920.515 0 0 -283.746 0 -2192.53 0 0 0 0 0 0 0 831.248 0 0 1968.37 0 0 0 0 0 0 0 0 0 0 0 0 0 0 0 126.576 1494.26 0 0 0 0 0 0 0.07 -1530.43 
0 0 2058.7 0 0 0 0 0 0 0 0 -48.2955 -2493.9 0 0 0 0 -2034.44 0 0 0 0 0 0 0 0 0 0 0 1232.87 0 0 0 0 2287.59 0 0 0 0 0 0 0 0 -2332.3 0 0 0 0 0 1904.43 0.05 
