*Vertices 59
*Matrix 
0.03 0 0 -2204.58 0 1502.04 0 0 -890.454 0 0 0 0 0 0 0 -123.981 0 0 -308.466 2456.82 0 1143.6 -2349.09 0 0 0 2336.12 0 0 92.0896 0 0 880.383 0 0 0 0 0 878.857 0 0 0 0 0 493.408 -438.932 0 0 0 0 1762.37 -1082.72 0 0 0 0 0 0 
0 0.08 0 1138.11 0 -1901.68 0 0 0 2286.52 0 0 0 1525.09 2060.23 0 0 0 0 0 0 410.245 0 0 -429.472 0 2238.3 0 1454.44 0 0 -2221.67 0 0 0 1697.36 0 0 0 0 0 -2370.6 0 0 0 0 -2386.01 0 0 0 0 703.986 0 0 0 0 -470.824 0 0 
0 0 0.05 0 2408.6 0 -223.472 2404.48 0 0 0 677.282 1369.44 0 0 2030.78 0 0 1021.68 0 0 0 0 0 2227.01 0 508.515 0 0 0 2153.92 0 560.701 0 0 0 -2054.12 0 0 0 2016.89 0 0 0 -1511.81 0 0 0 0 0 0 0 0 0 0 0 0 0 0 
-352.26 1240.65 0 0.09 0 0 0 0 0 0 0 0 0 0 1178.4 0 0 -1514.71 0 0 0 1414.3 0 0 0 1169.85 1653.57 0 0 1748.02 0 0 0 0 0 0 0 178.304 0 0 0 0 0 0 0 -1201.9 0 0 0 0 0 0 0 0 0 0 0 0 0 
0 0 1526.46 0 0.01 0 -1933.58 0 0 0 2440.34 0 0 743.355 0 0 1722.69 0 0 0 0 -103.992 0 1588.41 0 1094.32 0 -2079.76 0 0 -1524.32 0 0 0 0 0 0 0 0 0 0 0 0 0 0 0 0 0 0 0 0 0 0 0 0 0 0 0 0 
491.272 -407.041 0 0 0 0 0 -559.786 0 0 0 0 -669.5 1332.36 0 233.085 -1703.16 0 0 -2059.77 0 0 0 1213.8 0 0 0 0 1884.44 2281.33 0 0 0 0 0 0 0 0 -685.217 0 0 0 -1121.78 0 0 0 0 0 0 0 0 56.6881 0 0 0 0 0 0 0 
0 0 -819.041 0 679.266 0 0.05 0 0 0 0 -1435.97 0 0 1612.22 -1769.39 0 0 0 0 0 1657.23 502.106 355.77 1793.19 0 0 0 0 0 0 1175.04 0 0 -174.642 0 1534.09 0 -2328.79 0 0 0 0 0 0 0 0 0 0 0 0 -2053.21 -242.698 0 0 0 0 513.55 0 
0 0 -783.486 0 0 -212.333 0 0.04 980.178 0 0 0 0 0 0 -129.17 0 618.534 2259.82 0 0 -217.826 0 -722.602 0 0 0 0 1665.32 0 0 0 0 1978.13 0 0 0 0 0 0 0 0 0 0 0 0 0 0 0 0 2227.01 1976.61 0 -69.0481 0 0 0 0 0 
1531.5 0 0 0 0 0 0 445.647 0.01 0 1618.63 0 0 0 -1201.9 0 0 0 0 0 0 0 0 -31.3578 0 0 2195.12 0 0 0 0 0 0 0 0 0 609.378 0 0 0 0 0 0 0 0 0 0 1527.99 0 0 0 0 0 0 0 0 -1643.96 0 0 
0 2001.94 0 0 0 0 0 0 0 0 0 0 -818.735 0 0 0 0 0 0 1169.7 0 1966.69 2290.34 1886.27 0 0 0 0 0 -938.063 0 0 0 0 0 -859.172 0 0 0 0 -69.9637 0 0 0 -1816.39 0 0 0 0 0 0 -376.37 0 0 0 0 0 0 0 
0 0 0 0 2477.26 0 0 0 1953.41 0 0.05 0 0 917.92 0 0 747.322 0 0 0 0 0 0 1721.93 0 0 0 807.596 0 -1207.69 0 -959.12 0 0 0 0 0 0 0 0 0 0 0 0 -1486.02 0 2026.05 0 385.22 0 0 0 0 0 0 0 0 0 0 
0 0 1772.29 0 0 0 99.5666 0 0 0 0 0.07 0 0 0 0 -1336.48 1257.29 1900.31 2149.04 0 994.369 0 0 0 0 2159.72 0 0 0 0 0 0 0 0 0 0 0 0 1630.68 0 0 0 0 0 0 0 0 0 0 0 0 -1549.35 0 0 57.9089 0 0 0 
0 0 615.177 0 0 1822.49 0 0 0 2057.18 0 0 0.02 0 0 0 0 0 33.0363 0 0 0 0 0 0 -2073.5 1690.19 0 859.02 0 0 0 0 0 0 0 0 0 0 0 0 -2419.13 0 0 0 0 0 0 0 0 0 0 -2101.73 0 0 1502.5 0 0 1520.97 
0 1898.79 0 0 1460.23 -2476.81 0 0 0 0 700.171 0 0 0.07 0 0 0 0 0 0 0 0 -925.245 946.608 836.283 0 -1255.76 0 819.041 -1868.57 0 0 0 0 0 1665.01 0 0 0 0 0 0 0 0 0 0 0 0 0 0 0 0 0 0 0 0 0 0 0 
0 2284.39 0 2314.6 0 0 2025.74 0 2393.64 0 0 0 0 0 0.04 0 0 0 0 0 0 -659.581 2189.02 0 0 0 0 -150.838 0 0 0 0 0 0 0 0 0 2467.35 0 0 0 0 0 -1339.38 0 0 0 0 0 0 0 0 0 0 0 0 0 0 0 
0 0 -1598.33 0 0 -684.301 1207.85 1270.71 0 0 0 0 0 0 0 0.02 0 0 1877.42 0 0 -1784.49 0 0 0 0 0 1875.74 0 0 0 0 0 0 0 0 0 0 973.617 0 0 0 0 0 0 667.669 0 0 0 0 0 0 -1054.34 -571.688 0 0 0 0 640.66 
1489.99 0 0 0 752.815 539.186 0 0 0 0 2184.29 232.17 0 0 0 0 0.08 820.566 0 0 0 -1261.86 1075.7 0 0 0 0 0 0 0 0 0 0 0 0 0 0 0 0 0 0 -1190.91 0 0 0 0 0 0 0 0 0 0 1397.37 0 1570.41 2156.97 0 0 -696.509 
0 0 0 1495.48 0 0 0 -504.852 0 0 0 98.4985 0 0 0 0 1934.03 0 612.278 0 -369.35 0 0 0 0 0 0 -379.116 0 0 0 0 0 0 0 0 0 0 0 0 0 0 0 -1162.53 0 0 0 0 0 0 751.289 0 0 0 0 0 0 0 0 
0 0 -2292.93 0 0 0 0 -2167.96 0 0 0 -199.973 2194.36 0 0 -606.632 0 1901.84 0 0 0 0 1622.59 1047.47 0 1707.43 0 0 0 0 0 1837.14 0 0 0 0 0 0 0 0 0 0 0 0 0 0 0 -1821.57 0 0 0 0 0 0 -2327.11 0 0 1958.6 0 
-1172.29 0 0 0 0 -1011.46 0 0 0 867.412 0 1537.75 0 0 0 0 0 0 0 0.05 0 0 0 0 0 -2089.83 0 998.032 0 0 1981.03 -833.995 0 0 0 0 0 0 0 0 0 0 0 0 0 0 0 0 0 0 0 0 0 0 0 0 0 0 301.294 
294.275 0 0 0 0 0 0 0 0 0 0 0 0 0 0 0 0 1061.51 0 0 0.08 0 0 0 0 0 0 1792.89 197.378 0 0 0 0 0 0 0 2357.94 0 0 0 0 0 0 0 0 0 0 0 0 -1927.47 0 852.153 0 685.369 0 0 0 0 0 
0 -186.697 0 1142.69 -1734.29 0 394.833 2443.69 0 1370.2 0 1755.35 0 0 1473.2 1735.21 979.11 0 0 0 0 0.01 0 0 1078.6 0 0 0 0 0 0 0 0 0 0 0 0 0 0 0 895.947 0 0 0 0 1304.44 0 0 0 1627.63 0 0 0 0 0 0 0 0 0 
1801.74 0 0 0 0 0 183.493 0 0 1264.61 0 0 0 -272.301 2480.93 0 338.069 0 -1994.31 0 0 0 0.05 1055.1 -968.123 0 0 1662.88 -653.02 0 0 0 0 0 0 0 0 46.1592 0 0 0 2034.75 -870.006 0 0 0 0 0 0 -1899.24 1638 0 0 -1752.6 0 0 1672.64 0 0 
847.575 0 0 0 -1074.02 2100.21 1791.51 46.3118 -108.264 1354.49 -521.79 0 0 -1380.73 0 0 0 0 -2414.09 0 0 0 -1828.14 0.05 0 0 432.066 1910.84 -1424.38 1976.3 2481.69 0 0 0 0 0 0 1356.32 -2390.13 0 0 0 0 2226.25 0 0 0 0 0 0 0 0 0 0 0 0 -2446.59 0 0 
0 1838.51 -1345.64 0 0 0 -1928.85 0 0 0 0 0 0 2108.91 0 0 0 0 0 0 0 1992.32 -1325.65 0 0.09 0 0 -2095.32 0 0 0 0 0 1864.91 0 0 0 0 0 0 0 0 0 0 0 0 0 0 1786.17 0 0 0 0 0 0 0 0 0 -1397.98 
0 0 0 1946.85 -1556.67 0 0 0 0 0 0 0 -568.026 0 0 0 0 0 2235.25 -1367.76 0 0 0 0 0 0.09 2328.79 0 0 0 0 2169.03 0 0 0 0 47.5326 0 0 0 0 0 0 0 0 0 -2260.58 -2238.3 0 0 0 0 0 0 0 0 0 0 0 
0 1861.86 2250.51 1677.53 0 0 0 0 255.821 0 0 1352.96 2378.84 225.455 0 0 0 0 0 0 0 0 0 -2380.37 0 496.918 0.01 1339.69 0 0 2491.45 0 0 0 0 0 1694.62 0 0 0 0 0 0 0 0 0 0 0 0 0 -774.178 0 0 240.867 0 0 0 0 0 
-1261.25 0 0 0 490.356 0 0 0 0 0 -993.149 0 0 0 -691.321 1596.19 0 2366.48 0 589.236 -360.042 0 1705.76 -1763.44 2410.58 0 2283.93 0.01 0 0 2389.22 0 0 1436.43 -977.126 0 0 0 0 0 0 0 0 0 2390.44 0 0 -506.531 0 0 0 0 0 0 0 0 0 0 0 
0 -1339.38 0 0 0 2453.15 0 2138.05 0 0 0 0 -929.823 2483.37 0 0 0 0 0 0 1468.47 0 -1509.83 363.857 0 0 0 0 0.07 0 0 0 -270.013 -995.285 0 0 0 0 0 0 0 0 0 0 0 0 0 0 0 0 0 0 -580.081 0 0 0 0 -1061.66 0 
0 0 0 2496.8 0 639.592 0 0 0 1500.21 1763.28 0 0 1906.72 0 0 0 0 0 0 0 0 0 -2180.93 0 0 0 0 0 0.09 0 0 0 0 1218.07 0 0 0 0 0 0 0 0 -758.309 0 1176.87 0 0 0 0 0 0 0 0 0 0 0 0 0 
2228.69 0 1511.35 0 -344.63 0 0 0 0 0 0 0 0 0 0 0 0 0 0 -2120.2 0 0 0 1386.84 0 0 2031.08 -2035.05 0 0 0.01 1179.01 0 0 0 0 0 0 0 0 0 0 1853.92 414.975 0 0 0 0 -2232.81 0 0 0 0 0 -1570.71 0 1342.28 0 0 
0 2416.68 0 0 0 0 -288.934 0 0 0 2446.75 0 0 0 0 0 0 0 -111.774 -400.021 0 0 0 0 0 1654.18 0 0 0 0 562.532 0.06 -1489.38 0 0 0 0 2245.63 -1704.84 -1253.93 0 0 302.515 0 0 0 0 0 0 0 0 0 0 0 0 0 0 1553.93 0 
0 0 -165.334 0 0 0 0 0 0 0 0 0 0 0 0 0 0 0 0 0 0 0 0 0 0 0 0 0 1942.58 0 0 2176.96 0.05 0 0 0 0 0 0 0 0 0 0 0 0 0 0 0 0 0 0 0 0 0 0 0 0 0 0 
1183.28 0 0 0 0 0 0 -683.386 0 0 0 0 0 0 0 0 0 0 0 0 0 0 0 0 2049.09 0 0 875.5 1060.9 0 0 0 0 0.05 0 0 0 0 0 0 0 0 -1017.87 0 0 0 0 0 0 -1735.66 0 0 0 0 0 1958.91 0 192.19 0 
0 0 0 0 0 0 2025.59 0 0 0 0 0 0 0 0 0 0 0 0 0 0 0 0 0 0 0 0 84.46 0 1348.99 0 0 0 0 0.08 0 0 0 0 0 0 0 0 0 0 0 0 0 0 0 0 0 0 0 276.269 0 0 0 0 
0 -614.872 0 0 0 0 0 0 0 2222.74 0 0 0 506.836 0 0 0 0 0 0 0 0 0 0 0 0 0 0 0 0 0 0 0 0 0 0.04 0 0 0 0 0 0 192.343 0 0 0 0 0 0 0 0 0 0 0 0 0 1439.79 0 0 
0 0 145.65 0 0 0 -1774.42 0 1641.51 0 0 0 0 0 0 0 0 0 0 0 -329.981 0 0 0 0 885.876 -459.838 0 0 0 0 0 0 0 0 0 0.06 0 0 0 0 -962.783 0 0 1960.28 0 0 0 0 0 0 0 0 2300.26 0 0 0 0 0 
0 0 0 2173.45 0 0 0 0 0 0 0 0 0 0 1282.92 0 0 0 0 0 0 0 758.766 1182.36 0 0 0 0 0 0 0 2399.44 0 0 0 0 0 0.08 0 -1238.36 1984.85 0 0 0 -123.676 0 0 0 0 0 0 0 2188.86 0 0 0 0 0 0 
0 0 0 0 0 2018.11 1256.98 0 0 0 0 0 0 0 0 -1259.27 0 0 0 0 0 0 0 -423.063 0 0 0 0 0 0 0 2110.89 0 0 0 0 0 0 0.01 0 0 0 0 0 1908.55 0 0 0 0 0 0 0 0 0 0 0 0 0 0 
1290.86 0 0 0 0 0 0 0 0 0 0 902.509 0 0 0 0 0 0 0 0 0 0 0 0 0 0 0 0 0 0 0 1152.46 0 0 0 0 0 -605.106 0 0.09 0 -300.378 0 0 0 0 0 0 0 0 0 -1093.25 0 0 0 0 0 0 0 
0 0 210.654 0 0 0 0 0 0 2422.94 0 0 0 0 0 0 0 0 0 0 0 1730.63 0 0 0 0 0 0 0 0 0 0 0 0 0 0 0 -1918.47 0 0 0.08 0 0 0 0 0 0 0 -454.039 0 0 1188.16 0 0 0 0 0 0 0 
0 19.4555 0 0 0 0 0 0 0 0 0 0 1023.67 0 0 0 1327.94 0 0 0 0 0 -661.87 0 0 0 0 0 0 0 0 0 0 0 0 0 182.882 0 0 2104.33 0 0.08 0 1972.03 1472.75 0 0 0 -2220.45 -98.9563 0 0 0 0 0 0 0 0 0 
0 0 0 0 0 -745.491 0 0 0 0 0 0 0 0 0 0 0 0 0 0 0 0 1995.38 0 0 0 0 0 0 0 738.777 2007.43 0 -1791.82 0 1373.1 0 0 0 0 0 0 0 -832.774 0 0 0 0 -130.238 0 0 0 0 0 0 0 0 0 0 
0 0 0 0 0 0 0 0 0 0 0 0 0 0 -1919.69 0 0 992.08 0 0 0 0 0 1638.31 0 0 0 0 0 1620.3 -1334.04 0 0 0 0 0 0 0 0 0 0 -48.4481 1614.81 0.04 0 0 2199.7 0 0 0 -739.387 0 0 0 0 0 -1010.09 0 0 
0 0 2225.64 0 0 0 0 0 0 1558.35 1423.31 0 0 0 0 0 0 0 0 0 0 0 0 0 0 0 0 -1556.22 0 0 0 0 0 0 0 0 -719.703 373.318 437.407 0 0 -2060.69 0 0 0.07 0 0 0 0 0 0 0 0 0 0 -868.175 0 0 0 
714.667 0 0 1854.23 0 0 0 0 0 0 0 0 0 0 0 -273.98 0 0 0 0 0 1239.89 0 0 0 0 0 0 0 2409.05 0 0 0 0 0 0 0 0 0 0 0 0 0 0 0 0.06 0 0 585.269 0 0 0 0 0 0 0 0 0 0 
647.832 -1226.62 0 0 0 0 0 0 0 0 1546.91 0 0 0 0 0 0 0 0 0 0 0 0 0 0 876.72 0 0 0 0 0 0 0 0 0 0 0 0 0 0 0 0 0 1012.07 0 0 0.05 0 0 0 0 0 0 0 2408.75 0 0 0 0 
0 0 0 0 0 0 0 0 -681.86 0 0 0 0 0 0 0 0 0 1661.5 0 0 0 0 0 0 1475.49 0 559.175 0 0 0 0 0 0 0 0 0 0 0 0 0 0 0 0 0 0 0 0.02 0 0 0 0 0 0 0 0 0 2126.76 0 
0 0 0 0 0 0 0 0 0 0 913.953 0 0 0 0 0 0 0 0 0 0 0 0 0 -2370.91 0 0 0 0 0 1094.16 0 0 0 0 0 0 0 0 0 -2035.05 -645.238 879.467 0 0 2186.27 0 0 0.01 0 0 0 0 -361.568 0 0 0 0 0 
0 0 0 0 0 0 0 0 0 0 0 0 0 0 0 0 0 0 0 0 2190.24 660.497 -317.621 0 0 0 0 0 0 0 0 0 0 2103.56 0 0 0 0 0 0 0 1877.12 0 0 0 0 0 0 0 0.06 0 0 0 0 0 0 0 0 0 
0 0 0 0 0 0 0 1945.94 0 0 0 0 0 0 0 0 0 -812.784 0 0 0 0 1789.83 0 0 0 -8.62148 0 0 0 0 0 0 0 0 0 0 0 0 0 0 0 0 -4.95926 0 0 0 0 0 0 0.02 0 0 0 0 0 0 0 0 
784.707 -890.149 0 0 0 -2375.79 2182 -367.519 0 1434.14 0 0 0 0 0 0 0 0 0 0 2413.94 0 0 0 0 0 0 0 0 0 0 0 0 0 0 0 0 0 0 1917.86 -1010.24 0 0 0 0 0 0 0 0 0 0 0.07 0 0 0 842.845 -1996.29 0 0 
1930.52 0 0 0 0 0 112.842 0 0 0 0 2014.45 182.882 0 0 -87.9696 1832.87 0 0 0 0 0 0 0 0 0 0 0 -33.0363 0 0 0 0 0 0 0 0 -1895.12 0 0 0 0 0 0 0 0 0 0 0 0 0 0 0.07 0 0 0 0 0 0 
0 0 0 0 0 0 0 -1520.66 0 0 0 0 0 0 0 -256.584 0 0 0 0 2460.63 0 -1253.32 0 0 0 1703.01 0 0 0 0 0 0 0 0 0 -1306.42 0 0 0 0 0 0 0 0 0 0 0 -299.31 0 0 0 0 0.03 0 0 0 0 0 
0 0 0 0 0 0 0 0 0 0 0 0 0 0 0 0 -512.329 0 -1004.75 0 0 0 0 0 0 0 0 0 0 0 1505.25 0 0 0 2002.85 0 0 0 0 0 0 0 0 0 0 0 -2435.61 0 0 0 0 0 0 0 0.06 0 0 0 0 
0 0 0 0 0 0 0 0 0 0 0 -2470.7 1977.52 0 0 0 -958.052 0 0 0 0 0 0 0 0 0 0 0 0 0 0 0 0 589.541 0 0 0 0 0 0 0 0 0 0 1945.94 0 0 0 0 0 0 67.8274 0 0 0 0.08 0 0 0 
0 1222.95 0 0 0 0 0 0 -1514.86 0 0 0 0 0 0 0 0 0 0 0 0 0 -983.993 -1109.27 0 0 0 0 0 0 2083.88 0 0 0 0 1383.02 0 0 0 0 0 0 0 -1828.29 0 0 0 0 0 0 0 854.289 0 0 0 0 0.05 0 0 
0 0 0 0 0 0 392.392 0 0 0 0 0 0 0 0 0 0 0 -490.814 0 0 0 0 0 0 0 0 0 1094.93 0 0 1908.55 0 1582 0 0 0 0 0 0 0 0 0 0 0 0 0 621.586 0 0 0 0 0 0 0 0 0 0.03 0 
0 0 0 0 0 0 0 0 0 0 0 0 284.967 0 0 -988.418 708.563 0 0 -212.485 0 0 0 0 112.842 0 0 0 0 0 0 0 0 0 0 0 0 0 0 0 0 0 0 0 0 0 0 0 0 0 0 0 0 0 0 0 0 0 0.06 
