*Vertices 84
*Matrix 
0.08 0 904.95 1200.22 330.439 0 -1025.5 -865.276 0 0 955.916 2387.84 0 0 0 0 0 0 0 649.358 0 614.109 1106.68 0 0 0 0 0 0 -1574.68 0 0 0 0 0 0 0 -1168.94 0 0 1158.86 0 0 0 0 0 1397.06 0 -1419.03 1479 -1585.67 0 -542.085 0 0 0 0 0 0 0 0 0 0 0 0 0 0 0 0 0 0 -1617.25 2199.85 0 0 0 0 0 0 1483.43 0 0 0 0 
0 0 -1756.11 0 0 0 0 0 627.689 0 0 1833.78 2324.21 0 -127.491 0 1341.82 0 0 0 0 -1864.15 0 0 0 0 0 0 0 0 0 0 -82.3237 0 0 0 0 565.584 0 0 0 0 -72.5578 0 0 0 0 0 2063.74 0 0 0 0 0 0 275.658 0 0 0 0 0 -1925.79 0 0 0 0 1549.96 0 318.842 0 0 0 -738.929 0 0 0 0 0 0 0 2340.69 0 0 0 
-160.909 1635.56 0.01 0 -1742.99 -841.319 2115.16 0 0 805.307 2127.83 0 0 0 0 0 0 0 0 0 0 2042.68 0 0 1134.45 0 2335.2 0 1908.55 0 -281.152 0 0 -390.103 0 0 0 0 901.898 0 0 1837.29 0 0 702.155 -267.571 -2069.38 0 0 0 0 0 0 0 0 0 0 0 1361.96 0 0 0 0 0 0 0 0 0 0 0 0 0 0 0 0 626.011 0 0 -769.448 0 0 0 0 0 
-1084.7 0 0 0.01 0 0 0 0 0 0 0 2176.81 -1313.59 -770.669 -1929 0 0 0 0 0 0 -1307.95 0 918.989 0 2490.54 2062.97 0 0 0 0 0 1590.7 885.571 0 0 0 0 0 0 1708.2 -2037.49 0 2463.84 0 0 0 0 -2360.68 0 0 0 0 0 0 0 0 0 0 -441.527 1625.34 0 2337.49 0 0 0 0 0 0 0 0 0 0 0 0 0 0 0 0 0 0 -2223.81 -915.784 0 
1574.22 0 -1283.99 0 0.01 0 0 552.156 0 0 0 0 2380.98 0 0 0 1135.36 0 0 0 -1429.72 0 -2009.87 0 0 0 0 1049.76 0 0 0 0 0 0 0 1054.19 0 0 0 0 -11.6733 0 0 0 0 0 0 -796.304 0 1474.73 337.153 0 0 0 0 0 0 0 0 0 0 0 0 0 0 0 0 0 0 0 0 0 0 1908.4 2012.62 0 0 1991.41 0 0 0 0 0 683.081 
0 0 1791.21 0 0 0.03 0 2372.59 0 0 0 743.202 0 -1688.82 2364.65 -1424.53 0 0 0 0 -1621.68 0 0 0 0 -2119.74 2112.11 652.409 0 0 0 0 1193.96 493.713 0 0 0 0 1289.03 2118.98 0 0 -749.458 0 0 0 0 -509.125 0 0 1251.18 0 2444.3 814.463 0 0 0 0 0 0 0 0 -2449.95 0 0 0 0 0 0 0 0 0 0 0 0 0 917.463 0 432.524 0 0 0 0 -1082.87 
-1123.62 0 1656.93 0 0 0 0.01 0 0 0 0 0 0 0 0 0 0 0 0 0 2006.52 0 0 0 0 -260.399 0 0 0 2191.31 0 0 0 0 0 0 0 1026.87 -138.478 0 2433.16 0 0 -811.716 0 0 -487.762 0 247.276 2241.05 0 -974.532 0 0 0 0 0 0 0 -2213.89 0 0 0 1094.47 0 0 0 -825.144 0 -2345.27 0 0 0 0 0 0 0 0 0 0 0 -1504.94 0 0 
491.577 0 0 0 565.279 -1128.5 0 0.09 0 0 0 0 0 0 1222.19 2432.55 0 -1808.6 0 -1850.41 0 357.295 0 1618.78 0 0 0 0 2285 0 0 0 0 1715.98 0 -658.513 -1821.12 0 0 0 2281.79 0 0 1549.5 0 845.592 -1863.54 2091.81 0 2142.93 0 2125.23 -2069.54 0 0 0 0 0 2111.19 0 0 0 0 1813.33 0 0 -1814.1 0 0 0 -713.141 -1262.17 0 0 0 0 0 1954.18 0 0 0 0 0 0 
0 -2475.13 0 0 0 0 0 0 0.06 0 0 0 536.134 0 0 0 0 0 0 0 0 -1157.49 0 0 -604.953 -398.953 2304.07 0 0 0 0 1348.38 0 0 699.866 0 0 0 0 0 0 0 0 0 1608.4 894.421 0 2001.63 0 0 0 0 0 2290.03 0 0 0 -459.227 0 -207.602 0 -2101.43 -688.726 0 2188.71 0 0 -1180.53 0 588.321 0 0 0 0 1237.14 0 -1417.2 0 0 0 0 0 0 -2053.67 
0 0 246.971 0 0 0 0 0 0 0.09 0 0 1748.94 0 0 715.888 -2054.58 0 1715.83 0 797.22 0 0 2360.84 -1123.16 0 0 0 0 0 0 0 2389.68 0 0 -1273.77 0 0 0 0 0 0 0 0 0 0 -1603.06 0 0 0 0 0 0 1645.02 0 0 0 -297.327 0 0 0 0 0 0 0 0 -977.737 0 0 0 0 0 0 0 -489.288 0 0 0 0 0 -1168.48 0 0 0 
-17.777 0 983.23 0 0 0 0 0 0 0 0 0 1145.44 0 0 0 1974.78 0 1800.97 1337.86 0 0 0 0 -1980.12 138.02 189.596 0 0 0 0 1231.04 0 0 -1256.52 431.913 0 -1489.23 0 1190.76 0 0 2417.91 0 0 0 719.855 -2034.9 0 0 -1437.19 -2248.22 0 0 0 -1694.01 0 -566.958 0 0 2287.29 0 0 0 0 0 0 0 0 0 0 1441.16 0 0 0 0 0 0 0 0 0 0 1322.6 0 
750.832 153.279 0 -491.882 0 505.921 0 0 0 0 0 0.07 0 0 0 0 762.429 0 0 0 0 -9.38444 -2161.7 0 0 0 0 0 0 0 0 0 -86.4437 0 0 0 0 0 0 0 0 0 0 0 1579.41 1954.94 0 0 1437.04 0 2282.4 0 0 0 0 0 0 0 0 0 0 -2380.52 0 0 0 0 -1913.89 0 2055.35 0 0 0 0 0 0 0 0 0 0 0 0 0 0 0 
0 1945.78 0 1358.3 -656.072 0 0 0 2200.61 2223.04 -226.829 0 0.01 0 -338.374 1505.25 0 -1916.49 0 0 0 0 0 0 1413.39 0 -2280.88 0 2021.47 0 0 0 -2399.29 -2046.95 2420.96 0 0 0 0 1808.76 0 0 0 0 0 0 2133.78 439.085 0 121.998 0 0 0 0 119.709 0 0 0 0 0 -418.027 -1645.02 0 0 0 0 0 0 0 0 616.092 0 1124.07 0 0 0 -1821.73 0 0 1356.78 0 0 0 0 
0 0 0 1488.62 0 1715.98 0 0 0 0 0 0 0 0.05 0 0 0 0 0 0 0 0 0 0 0 0 0 0 0 0 0 -2040.7 0 0 0 0 0 0 -1418.88 0 0 0 0 0 0 0 0 0 0 0 -679.724 0 2356.11 0 -320.063 0 0 0 0 0 0 0 0 0 0 0 0 0 0 0 0 0 0 0 0 0 0 0 0 0 0 0 0 0 
0 1002 0 1550.87 0 1174.12 0 -557.955 0 0 0 0 -673.009 0 0.04 0 0 0 -95.4466 0 0 0 491.424 0 0 0 0 -1998.73 0 0 0 0 0 -308.618 0 0 0 1662.88 0 0 0 177.541 0 0 0 0 1724.52 1534.09 -899.457 1189.54 0 -1981.03 -2283.93 0 0 0 0 0 0 0 0 0 0 0 475.555 0 0 0 0 0 0 0 0 0 0 0 0 0 0 0 0 -1356.47 0 0 
0 0 0 0 0 1290.7 0 1130.94 0 2164.14 0 0 2464.6 0 0 0.04 1356.78 0 0 1893.6 0 0 0 0 0 0 0 0 0 0 0 0 0 0 0 0 -1511.81 0 0 0 2062.52 0 0 0 -668.279 0 0 0 0 -309.229 0 0 0 0 0 0 -999.557 0 0 0 -1093.25 0 0 0 2119.13 533.692 0 0 -61.1133 0 0 1493.8 0 0 638.523 0 0 0 0 1906.87 0 0 0 0 
0 -1085.01 0 0 1467.86 0 0 0 0 -332.575 2096.55 -1590.09 0 0 0 839.488 0.01 0 0 0 0 0 0 0 0 0 0 0 0 0 0 0 -94.8363 0 0 0 -592.135 0 0 -903.577 -1451.08 -580.386 0 0 0 0 0 0 0 0 0 0 0 0 0 0 0 3.73852 2412.72 414.823 0 0 0 0 0 0 0 0 0 0 0 0 0 2247 0 -380.184 0 0 2180.17 0 0 0 0 0 
0 0 0 0 0 0 0 -378.964 0 0 0 0 -754.341 0 0 0 0 0.05 -1095.54 0 0 499.512 0 1593.6 0 0 0 0 0 0 0 616.245 0 0 0 0 0 0 1352.66 0 0 0 2212.06 0 -511.719 0 0 0 0 0 0 0 0 0 0 0 0 -891.522 0 0 0 0 0 -99.5666 0 0 0 0 0 0 0 0 -974.075 2423.4 0 0 0 0 0 0 0 0 0 -1413.54 
0 0 0 0 0 0 0 0 0 2216.79 -375.149 0 0 0 659.124 0 0 2060.69 0.09 0 -1134.3 0 0 2266.38 0 0 2272.03 0 1002.76 0 0 0 0 0 772.5 0 -979.72 0 -98.8037 0 0 0 0 2050.16 0 0 0 0 1996.9 -196.463 0 0 1969.59 0 0 0 0 1059.53 0 1869.18 98.0407 0 1450.47 0 0 0 0 0 0 0 2269.74 0 -892.743 -1658.6 513.092 0 0 0 0 0 0 0 0 0 
338.527 0 0 0 0 0 0 1348.54 0 0 -641.881 0 0 0 0 764.107 0 0 0 0.05 0 826.518 353.328 0 0 2418.52 -1005.36 2328.03 0 0 0 0 0 1954.79 0 0 0 -791.116 327.845 0 0 0 0 0 1366.85 0 0 0 0 -502.411 -1016.65 0 0 0 0 0 0 0 0 0 -2492.83 0 0 0 0 0 2411.65 0 599.46 0 0 0 2344.81 0 0 0 0 0 0 0 0 0 0 0 
0 0 0 0 631.809 1072.19 -2437.13 0 0 -244.987 0 0 0 0 0 0 0 0 1494.87 0 0.08 -2.82296 0 0 0 -2264.55 0 0 0 418.027 -2319.33 0 1338.31 0 0 0 0 0 0 0 1992.78 2338.25 -97.8881 0 0 0 0 0 0 2035.97 286.035 -1060.14 0 0 1391.42 -917.92 0 0 0 0 0 0 0 0 2382.96 -2007.74 0 0 0 0 0 0 0 0 0 -1297.42 0 0 0 0 0 0 0 815.683 
66.9118 -505.463 -930.586 2376.25 0 0 0 -1800.36 -137.715 0 0 948.592 0 0 0 0 0 -581.607 0 427.793 1736.58 0.03 1111.71 0 0 0 0 0 0 0 0 0 0 0 0 0 0 2236.17 0 0 0 0 0 2111.19 0 0 0 0 0 0 0 -2011.4 0 0 2117.15 0 0 0 2402.49 0 0 0 1964.25 0 0 0 0 0 0 0 0 0 0 0 0 2120.35 0 0 0 0 0 0 45.7015 0 
-675.756 0 0 0 1372.95 0 0 0 0 0 0 2469.48 0 0 1693.4 0 0 0 0 -1433.23 0 -1096.91 0.01 0 0 2071.21 53.6363 0 0 0 0 0 0 1416.29 0 0 0 0 1095.23 0 715.278 0 -1234.86 0 0 0 0 0 0 -1783.88 0 1889.17 0 0 2393.34 0 0 -921.888 0 0 0 0 0 0 0 1717.66 -809.122 0 0 0 0 742.439 0 0 0 0 0 0 0 0 0 0 466.399 0 
0 0 0 -2367.85 0 0 0 1172.44 0 2013.84 0 0 0 0 0 0 0 -1484.04 2376.09 0 0 0 0 0.04 0 0 0 0 78.814 0 0 0 -173.421 0 1507.08 0 2113.18 0 0 -230.033 0 0 878.704 861.461 0 0 0 -599.155 0 -1951.43 0 0 1399.2 0 0 0 0 0 0 0 0 0 0 0 0 0 0 0 0 0 0 0 0 0 0 0 0 0 0 0 0 0 0 0 
0 0 2165.36 0 0 0 0 0 2491.61 2032.61 -82.0185 0 516.755 0 0 0 0 0 0 0 0 0 0 0 0.04 0 -1465.27 0 0 0 2019.33 -430.235 0 0 -602.512 2464.14 0 -1258.81 0 1042.28 2291.41 0 0 0 0 -1505.1 0 -2064.5 0 0 0 1017.87 0 0 0 0 1722.54 0 0 0 0 0 0 0 0 0 0 0 -648.442 0 0 0 0 0 0 0 0 0 0 1594.67 0 0 0 0 
0 0 0 895.642 0 1769.69 -1653.42 0 500.58 0 -1140.25 0 0 0 0 0 0 0 0 1248.89 2093.95 0 1475.04 0 0 0.02 156.941 0 0 0 0 0 0 0 0 0 0 0 -821.177 0 0 0 0 2169.94 0 0 0 997.116 0 0 0 0 0 0 0 0 0 0 0 0 0 0 0 0 0 0 0 0 0 0 0 0 0 0 0 0 0 0 2293.85 0 0 0 0 0 
0 0 274.743 -1540.5 0 2307.73 0 0 2369.53 0 1149.25 0 -1162.53 0 0 0 0 0 -1094.47 1431.85 0 0 2463.38 0 1437.8 -1526.15 0.03 0 0 0 0 0 447.02 2030.63 1331.75 0 634.861 1981.49 0 0 0 594.729 0 0 0 0 2119.74 1352.2 0 0 0 -2222.89 0 0 0 0 0 0 -269.555 1287.04 0 0 0 0 0 0 0 0 510.498 0 0 0 0 0 0 0 0 0 0 0 0 0 0 0 
0 0 0 0 -576.266 579.623 0 0 0 0 0 0 0 0 1554.54 0 0 0 0 2254.78 0 0 0 0 0 0 0 0.07 743.355 24.0333 2272.94 0 0 -160.756 1878.03 0 -286.645 0 0 0 0 0 0 0 -279.931 0 2366.33 -1039.54 0 0 1665.93 0 0 490.661 0 0 2131.34 0 326.624 -102.313 0 0 0 0 0 -400.327 0 0 0 0 1165.12 0 0 0 0 0 0 537.812 0 -1721.78 0 0 1529.51 0 
0 0 1862.16 0 0 0 0 -2184.59 0 0 0 0 2369.38 0 0 0 0 0 -34.4096 0 0 0 0 1294.67 0 0 0 -1179.16 0 0 677.282 0 0 456.175 0 2213.43 0 0 0 -1577.27 0 0 0 0 -303.583 -1777.32 0 919.599 0 0 2306.82 0 0 0 0 -1290.09 0 0 0 0 0 0 0 0 0 0 0 0 0 -344.325 0 0 0 0 0 0 0 1158.56 0 0 0 0 -806.68 0 
2382.5 0 0 0 0 0 -302.82 0 0 0 0 0 0 0 0 0 0 0 0 0 1862.77 0 0 0 0 0 0 1593.45 0 0.03 0 763.497 0 0 0 0 0 0 0 0 0 0 0 0 1648.84 0 0 2120.81 0 0 516.755 1751.53 0 0 0 -1365.93 0 0 937.3 0 0 0 0 0 0 934.248 0 0 0 0 0 -1876.2 -1258.2 0 0 0 0 0 0 0 0 0 -1045.64 0 
0 0 627.842 0 0 0 0 0 0 0 0 0 0 0 0 0 0 0 0 0 2457.27 0 0 0 -1999.5 0 0 136.494 397.58 0 0.03 0 1037.4 0 0 0 0 0 0 0 -489.593 0 0 349.055 1135.06 0 -905.56 0 0 1797.46 0 0 0 0 2359.46 -397.732 0 0 0 0 0 0 0 0 0 0 0 -1139.33 0 0 0 0 0 0 0 0 0 0 0 0 0 0 0 0 
0 0 0 0 0 0 0 0 -2369.23 0 -155.721 0 0 1182.82 0 0 0 940.809 0 0 0 0 0 0 2067.55 0 0 0 0 1426.66 0 0.02 2186.73 0 1539.58 0 0 0 0 0 0 203.33 0 -2398.07 0 -543.611 -1253.93 0 0 0 0 2092.43 0 0 0 0 1045.03 0 0 0 2199.85 0 0 0 -472.808 0 0 0 -2114.4 0 0 0 0 0 0 0 0 0 0 0 0 0 0 0 
0 1645.02 0 625.553 0 -1510.59 0 0 0 1005.36 0 -434.965 2295.07 0 0 0 2304.53 0 0 0 1130.18 0 0 2485.05 0 0 -1077.07 0 0 0 -955.611 99.2615 0.06 0 0 0 0 0 0 0 0 1807.23 0 2456.66 1661.96 403.531 0 0 319.147 0 -1098.59 0 0 0 0 0 0 0 0 1275.6 0 0 0 0 0 0 0 0 220.573 0 0 0 -745.338 2217.86 0 0 0 0 0 0 0 0 2193.9 0 
0 0 -823.923 2308.65 0 1676.76 0 -650.121 0 0 0 0 -326.167 0 1427.73 0 0 0 0 115.894 0 0 -1150.93 0 0 0 -1931.44 249.718 766.701 0 0 0 0 0.01 0 0 1307.79 -398.953 0 0 0 0 -924.482 0 0 633.641 0 0 0 0 0 2160.02 0 0 -957.442 0 0 0 0 0 2293.85 0 0 0 0 -145.65 0 0 0 0 0 0 0 0 0 0 0 0 0 0 0 2278.13 0 0 
0 0 0 0 0 0 0 0 2077.01 0 1021.53 0 -1945.02 0 0 0 0 0 -2422.18 0 0 0 0 1768.62 937.147 0 -1796.55 2288.81 0 0 0 1260.19 0 0 0.04 0 -609.989 0 1628.7 -330.592 0 0 1885.66 0 0 0 -2433.32 0 0 0 2496.34 0 -1143.6 0 0 0 0 0 0 0 0 0 0 45.8541 0 -94.6837 0 0 0 0 -1717.81 0 0 0 -1162.83 0 0 0 0 0 0 0 1828.59 0 
0 0 0 0 785.623 0 0 -830.332 0 1722.39 885.266 0 0 0 0 0 0 0 0 0 0 0 0 0 -2175.74 0 0 0 -2005.29 0 0 0 0 0 0 0.05 0 0 1147.72 0 0 0 0 0 1441.31 0 1259.88 -1336.79 1555.91 483.795 1762.98 0 1667.91 0 554.598 -1815.62 0 0 0 1220.82 0 0 0 0 2388.15 0 0 0 0 0 0 -742.897 0 0 0 642.949 1927.17 0 0 1516.08 0 0 0 0 
0 0 0 0 0 0 0 -597.476 0 0 0 0 0 0 0 -2086.02 1789.68 0 1765.57 0 0 0 0 -1777.17 0 0 2386.32 -830.332 0 0 0 0 0 -256.89 -711.005 0 0.05 2070.3 0 328.455 0 0 0 -2402.95 0 0 0 0 0 0 0 1871.93 -616.245 0 0 0 0 0 0 0 0 0 0 1741.31 0 0 0 0 0 0 0 0 0 0 0 0 0 0 -935.469 0 0 -691.778 0 0 
-2379.6 -1929.91 0 0 0 0 -1839.73 0 0 0 2422.79 0 0 0 1862.62 0 0 0 0 2059.77 0 1289.94 0 0 1407.13 0 -2116.53 0 0 0 0 0 0 1326.72 0 0 1895.58 0.01 0 0 0 2444.61 0 0 0 0 1609.01 1800.97 0 0 0 920.362 0 0 0 0 0 -1445.43 0 -1371.58 1606.42 -274.59 0 0 0 0 0 0 0 2161.09 0 0 0 0 0 0 0 0 0 0 0 0 -1403.01 603.732 
0 0 -134.663 0 0 2032.91 -1511.96 0 0 0 0 0 0 534.913 0 0 0 2015.82 693.457 -137.562 0 0 1314.66 0 0 1800.06 0 0 0 0 0 0 0 0 1957.53 2323.6 0 0 0.05 -457.091 0 0 2136.68 0 0 0 0 0 0 0 0 1738.72 0 2012.77 0 0 0 0 0 0 0 0 0 0 0 0 0 0 0 0 0 0 0 0 0 0 0 -763.802 0 0 0 0 0 0 
0 0 0 0 0 -700.018 0 0 0 0 1239.28 0 -1313.44 0 0 0 -1755.2 0 0 0 0 0 0 2224.11 -1512.12 0 0 0 1622.44 0 0 0 0 0 -1323.82 0 2228.69 0 1511.05 0.01 0 1920.91 0 803.934 2123.55 0 -2401.27 0 0 0 0 0 0 0 123.676 0 0 0 0 0 0 0 0 0 0 0 0 0 0 695.898 1164.51 0 0 0 0 0 0 0 0 0 0 0 2281.49 0 
1220.36 0 0 1184.19 2164.6 0 -1178.09 2107.99 0 0 0 0 0 0 0 1808.6 1597.57 0 0 0 -873.669 0 70.5741 0 -230.796 0 0 0 0 0 -1576.51 0 0 0 0 0 0 0 0 0 0.03 0 0 0 0 0 0 0 0 0 2228.39 0 0 0 1854.84 0 0 -66.9118 0 0 0 0 1661.2 2164.45 1813.33 0 0 1760.69 0 0 0 0 0 0 0 0 1325.5 0 0 0 0 0 0 0 
0 0 -789.438 1723.61 0 0 0 0 0 0 0 0 0 0 631.809 0 692.694 0 0 0 -717.566 0 0 0 0 0 -1663.95 0 0 0 0 -36.6985 -800.424 0 0 0 0 1180.53 0 1571.47 0 0.02 0 -1128.35 0 1184.8 0 0 0 0 0 0 306.787 0 0 1481.9 0 0 0 0 0 0 0 0 0 0 0 0 -148.854 2124.77 0 0 0 0 0 -728.095 0 425.047 237.358 0 1107.29 0 0 0 
0 1548.28 0 0 0 1088.37 0 0 0 0 -568.789 0 0 0 0 0 0 -102.618 0 0 -1717.81 0 2216.48 -1404.39 0 0 0 0 0 0 0 0 0 52.8733 937.605 0 0 0 1549.65 0 0 0 0.05 0 0 0 0 0 0 0 0 -151.906 0 0 0 0 0 0 0 0 0 0 0 0 0 2417.14 0 0 0 0 1675.08 100.024 0 0 0 0 0 -806.68 0 0 0 -43.8704 0 0 
0 0 0 -394.223 0 0 1260.95 101.703 0 0 0 0 0 0 0 0 0 0 437.559 0 0 1424.83 0 -2210.84 0 926.771 0 0 0 0 1915.11 -782.571 1416.9 0 0 0 -930.738 0 0 -1836.22 0 902.356 0 0.06 0 1996.44 0 914.563 0 -1847.36 0 0 0 0 0 0 0 1265.53 -1486.94 0 0 0 0 0 0 0 0 0 0 0 0 0 0 0 0 0 1208.3 0 0 0 0 0 1185.26 0 
0 0 1814.4 0 0 0 0 0 -1639.23 0 0 571.688 0 0 0 -13.657 0 -848.338 0 -824.534 0 0 0 0 0 0 0 1370.97 156.789 -1365.17 2.21259 0 1440.7 0 0 -1056.32 0 0 0 1119.19 0 0 0 0 0.05 0 0 2269.13 875.5 0 0 2343.75 0 0 0 0 0 0 0 0 0 0 0 0 0 -48.6007 0 0 0 0 0 0 -1322.44 0 0 0 0 0 302.667 0 0 0 -736.793 1409.88 
0 0 299.158 0 0 0 0 1526.46 -439.085 0 0 2273.71 0 0 0 0 0 0 0 0 0 0 0 0 2334.74 0 0 0 2326.04 0 0 -1572.7 -1565.22 1479.46 0 0 0 0 0 0 0 1841.56 0 1923.96 0 0 -275.353 0 0 73.7785 0 546.815 0 0 0 0 0 0 0 0 114.978 0 0 0 0 0 720.771 0 0 0 0 0 0 0 0 0 0 0 0 0 0 0 0 0 
147.328 0 1444.06 0 0 0 1103.78 1134.91 0 2048.94 -2490.08 0 -1624.12 0 1697.36 0 0 0 0 0 0 0 0 0 0 0 2366.63 -1681.65 0 0 2036.42 -135.884 0 0 -1946.85 -1236.23 0 82.7815 0 -1538.51 0 0 0 0 0 -2245.32 0.08 0 2479.55 1922.9 0 1007.03 0 0 0 7.09555 0 0 0 2225.03 0 0 0 0 0 781.503 0 0 0 0 0 0 0 0 136.494 0 -1984.08 0 -1129.26 0 0 0 0 0 
0 0 0 0 415.128 -1514.71 0 1234.7 1657.38 0 1854.23 0 1481.9 0 -1206.02 0 0 0 0 0 0 0 0 -459.685 2498.63 646.916 -257.653 2067.4 2064.2 1255.15 0 0 0 0 0 -2180.32 0 -1743.6 0 0 0 0 0 27.8481 1948.07 0 0 0.03 0 0 0 1935.1 -1311.15 -521.943 0 0 0 2488.1 1697.21 0 0 0 0 0 1507.69 0 2399.44 0 0 2314.6 0 0 0 0 0 0 0 0 512.787 0 0 0 0 0 
1370.2 -2386.47 0 -1186.79 0 0 1753.06 0 0 0 0 1028.24 0 0 2042.07 0 0 0 2317.35 0 0 0 0 0 0 0 0 0 0 0 0 0 -5.56963 0 0 1782.82 0 0 0 0 0 0 0 0 -1435.36 0 957.747 0 0.08 0 0 0 0 0 0 0 0 0 0 0 0 0 0 0 0 0 0 0 0 0 0 0 -2035.51 0 0 0 0 0 0 0 0 0 0 0 
2389.68 0 0 0 1588.26 0 1593.6 356.075 0 0 0 0 755.104 0 -2060.53 202.109 0 0 1694.77 1918.01 1095.84 0 -268.487 -1899.55 0 0 0 0 0 0 2440.79 0 0 0 0 1106.98 0 0 0 0 0 0 0 -1559.27 0 507.447 71.6422 0 0 0.06 0 0 0 0 -235.527 0 0 0 0 0 0 0 0 0 0 0 0 -688.269 0 0 0 0 0 0 0 0 0 0 0 -1760.54 0 0 0 0 
2184.59 0 0 0 336.085 -356.533 0 0 0 0 -2413.79 169.454 0 -2141.41 0 0 0 0 0 744.118 -208.975 0 0 0 0 0 0 -1699.65 -2137.59 -1594.52 0 0 1025.5 0 1389.74 1080.13 0 0 0 0 2376.71 0 0 0 0 0 0 0 0 0 0.03 2426.91 0 0 1334.5 0 0 0 0 0 0 0 -1365.32 0 0 0 0 0 0 0 0 0 0 0 0 0 0 0 0 0 0 0 0 0 
0 0 0 0 0 0 2320.09 -2285.3 0 0 -1976 0 0 0 1817 0 0 0 0 0 -856.578 24.4911 1737.19 0 1531.19 0 -2228.39 0 0 -2205.5 0 -884.503 0 -250.481 0 0 769.601 1161.15 1325.8 0 0 0 -188.986 0 -491.424 625.401 -186.087 1341.67 0 0 2230.67 0.05 1893.75 0 0 0 0 0 0 0 0 0 -2085.71 0 0 1775.49 -2194.36 0 0 0 0 -2146.29 0 0 0 0 0 0 0 0 0 0 0 0 
2422.03 0 0 0 0 526.215 0 -98.0407 0 0 0 0 0 2121.11 1640.14 0 0 0 34.257 0 0 0 0 -1432.92 0 0 0 0 0 0 0 0 0 0 1795.33 2441.1 1708.81 0 0 0 0 -356.685 0 0 0 0 0 -1400.27 0 0 0 -914.563 0.04 0 0 0 -2232.96 0 -520.875 0 0 1247.52 0 0 0 0 0 0 0 0 0 0 0 0 0 0 0 0 1710.33 0 0 0 0 0 
0 0 0 0 0 -812.632 0 0 -2187.03 2252.34 0 0 0 0 0 0 0 0 0 0 0 0 0 0 0 0 0 1409.57 0 0 0 0 0 0 0 0 0 0 1490.91 0 0 0 0 0 0 0 0 530.03 0 0 0 0 0 0.06 0 0 1898.63 0 0 0 0 0 0 0 0 0 0 495.239 0 0 0 24.6437 0 636.845 0 0 0 0 0 0 115.741 0 0 0 
0 0 0 0 0 0 0 0 0 0 0 0 1943.04 1280.02 0 0 0 0 0 0 -96.9726 230.644 766.396 0 0 0 0 0 0 0 1624.73 0 0 1229.21 0 -2444.3 0 0 0 -436.644 1080.74 0 0 0 0 0 0 0 0 990.402 809.275 0 0 0 0.04 0 0 0 0 0 0 0 0 0 0 0 0 0 2015.21 1434.45 0 0 0 0 0 1296.04 0 0 0 2084.49 0 0 0 0 
0 269.707 0 0 0 0 0 0 0 0 1868.88 0 0 0 0 0 0 0 0 0 -1876.35 0 0 0 0 0 0 0 2031.69 693.304 2466.43 0 0 0 0 -630.741 0 0 0 0 0 -1851.94 0 0 0 0 1579.56 0 0 0 0 0 0 0 0 0.06 0 0 0 0 0 0 0 191.58 0 0 0 0 0 0 0 0 0 0 0 1556.06 0 -789.285 -1850.26 1563.69 0 0 -162.435 0 
0 0 0 0 0 0 0 0 0 0 0 0 0 0 0 1037.71 0 0 0 0 0 0 0 0 1181.3 0 0 378.201 0 0 0 1191.37 0 0 0 0 0 0 0 0 0 0 0 0 0 0 0 0 0 0 0 0 -714.209 -2080.83 0 0 0.06 0 1691.11 0 0 0 702.612 0 0 -188.833 0 0 1629.61 0 0 0 0 0 0 0 0 0 0 0 -87.5118 0 0 0 
0 0 0 0 0 0 0 0 1201.13 572.756 -41.1237 0 0 0 0 0 -1050.07 -1441.31 -137.257 0 0 0 642.338 0 0 0 0 0 0 0 0 0 0 0 0 0 0 1160.7 0 0 2010.18 0 0 559.328 0 0 0 1193.5 0 0 0 0 0 0 0 0 0 0.03 0 0 0 0 0 -1675.7 0 0 0 0 0 0 0 2108.45 -1667.15 0 0 0 -425.504 0 0 0 0 0 0 0 
0 0 -2187.95 0 0 0 0 -183.493 0 0 0 0 0 0 0 0 -1298.64 0 0 0 0 1689.73 0 0 0 0 1484.5 -2132.71 0 1554.38 0 0 0 0 0 0 0 0 0 0 0 0 0 -1715.37 0 0 0 2362.82 0 0 0 0 -330.287 0 0 0 1317.56 0 0.06 0 0 0 0 0 1836.53 0 0 0 0 0 0 0 0 2001.33 0 0 0 0 0 0 0 0 0 0 
0 0 0 1485.87 0 0 686.438 0 1032.82 0 0 0 0 0 0 0 -2363.89 0 2209.62 0 0 0 0 0 0 0 -142.75 -1647.01 0 0 0 0 -638.829 0 0 2198.32 0 2218.47 0 0 0 0 0 0 0 0 2401.27 0 0 0 0 0 0 0 0 0 0 0 0 0.07 0 0 1219.44 0 0 0 680.029 0 0 0 33.4941 0 0 0 0 0 -872.295 0 0 0 0 0 0 2030.63 
0 0 0 1760.38 0 0 0 0 0 0 114.826 0 2.82296 0 0 453.429 0 0 251.701 1441.31 0 0 0 0 0 0 0 0 0 0 0 -2057.79 0 2007.89 0 0 0 1564.61 0 0 0 0 0 0 0 -816.141 0 0 0 0 0 0 0 0 0 0 0 0 0 0 0.05 -2120.04 0 0 0 0 0 0 0 0 0 0 0 1168.94 0 0 0 0 0 -673.467 568.178 0 0 0 
0 -1323.36 0 0 0 0 0 0 -459.532 0 0 1592.53 -6.48518 0 0 0 0 0 0 0 0 0 0 0 0 0 0 0 0 0 0 0 0 0 0 0 0 626.926 0 0 0 0 0 0 0 0 0 0 0 0 0 0 2334.74 0 0 0 0 0 0 0 598.392 0.06 0 0 0 0 0 0 -167.928 0 0 0 0 0 0 0 0 0 0 0 1246.76 0 0 1693.85 
0 0 0 2183.52 0 992.691 0 0 -1719.18 0 0 0 0 0 0 0 0 0 958.205 0 0 181.967 0 0 0 0 0 0 0 0 0 0 0 0 0 0 0 0 0 0 -54.2467 0 0 0 0 0 0 0 0 0 -1009.63 -730.842 0 0 0 0 -480.59 0 0 2138.2 0 0 0 0 0 0 0 1021.84 0 0 0 0 0 0 0 0 0 0 0 0 0 0 0 0 
0 0 0 0 0 0 -1247.83 -1963.33 0 0 0 0 0 0 0 0 0 -319.452 0 0 0 0 0 0 0 0 0 0 0 0 0 0 0 0 2381.59 0 -937.758 0 0 0 900.83 0 0 0 0 0 0 0 0 0 0 0 0 0 0 1614.05 0 2366.18 0 0 0 0 0 0.04 0 0 0 0 0 0 0 0 -1497.62 0 0 0 2145.83 0 0 0 0 0 0 0 
0 0 0 0 0 0 0 0 1074.02 0 0 0 0 0 1556.83 -1408.81 0 0 0 0 648.9 0 0 0 0 0 0 0 0 0 0 1230.89 0 0 0 1215.63 0 0 0 0 1376 0 0 0 0 0 0 2059.92 0 0 0 0 0 0 0 0 0 0 -679.418 0 0 0 0 0 0.06 0 -1325.04 0 0 -1863.84 0 0 0 1236.69 0 0 0 1385.01 0 0 0 0 0 0 
0 0 0 0 0 0 0 0 0 0 0 0 0 0 0 -284.661 0 0 0 0 1763.89 0 -188.986 0 0 0 0 -2425.84 0 1687.14 0 0 0 401.547 1736.58 0 0 0 0 0 0 0 1495.18 0 1533.17 0 2085.1 0 0 0 0 -1639.84 0 0 0 0 2358.39 0 0 0 0 0 0 0 0 0.09 0 0 0 0 0 0 354.854 0 0 0 -607.547 0 0 0 0 -1351.89 0 0 
0 -818.125 0 0 0 0 0 -285.73 0 -359.127 0 -1313.44 0 0 0 0 0 0 0 982.315 0 0 -817.667 0 0 0 0 0 0 0 0 0 0 0 0 0 0 0 0 0 0 0 0 0 0 1963.33 0 -1304.74 0 0 0 327.082 0 0 0 0 0 0 0 2024.52 0 0 0 0 2451.02 0 0.06 0 0 0 0 0 0 0 0 0 0 0 0 0 0 0 0 0 
0 0 0 0 0 0 1539.28 0 938.063 0 0 0 0 0 0 0 0 0 0 0 0 0 0 0 0 0 0 0 0 0 2104.18 0 0 0 0 0 0 0 0 0 878.552 0 0 0 0 0 0 0 0 -1430.17 0 0 0 1522.03 0 0 0 0 0 0 0 0 -249.718 0 0 0 0 0.01 0 0 0 -2031.85 0 0 0 0 0 0 0 -753.426 1057.54 0 0 0 
0 2314.14 0 0 0 0 0 0 0 0 0 -483.947 0 0 0 1101.03 0 0 0 252.617 0 0 0 0 85.0703 0 1043.05 0 0 0 0 -75.6096 859.935 0 0 0 0 0 0 0 0 -2086.78 0 0 0 0 0 0 0 0 0 0 0 0 2392.73 0 -253.38 0 0 0 0 1189.38 0 0 0 0 0 0 0 0 0 0 0 0 0 0 0 0 0 -1066.09 0 0 0 0 
0 0 0 0 0 0 1184.04 0 -933.332 0 0 0 0 0 0 0 0 0 0 0 0 0 0 0 0 0 0 0 915.784 0 0 0 0 0 0 0 0 2153.16 0 870.006 0 -1921.67 0 0 0 0 0 -796.304 0 0 0 0 0 0 1221.73 0 0 0 0 0 0 0 0 0 72.8629 0 0 0 0 0.01 -1350.98 0 0 0 0 0 0 0 0 313.501 0 1594.36 0 0 
0 0 0 0 0 0 0 -415.128 0 0 0 0 2493.29 0 0 0 0 0 -1480.99 0 0 0 0 0 0 0 0 700.323 0 0 0 0 0 0 1159.63 0 0 0 0 1582.77 0 0 117.573 0 0 0 0 0 0 0 0 0 0 0 0 0 0 0 0 1220.66 0 0 0 0 0 0 0 0 0 -1412.17 0.03 0 0 0 0 81.7133 0 0 0 0 0 859.172 945.54 0 
1276.67 0 0 0 0 0 0 1203.27 0 0 888.012 0 0 0 0 1368.98 0 0 0 0 0 0 -837.199 0 0 0 0 0 0 2427.82 0 0 0 0 0 -1669.9 0 0 0 0 0 0 125.965 0 0 0 0 0 0 0 0 706.885 0 2467.8 0 0 0 -1921.83 0 0 0 0 0 0 0 0 0 -477.996 0 0 0 0 0 0 -2100.67 0 0 -2396.69 481.353 0 0 0 0 0 
-1338.31 -1486.79 0 0 0 0 0 0 0 0 0 0 2000.26 0 0 0 0 1876.81 1874.52 -58.2141 0 0 0 0 0 0 0 0 0 -1224.78 0 0 -603.885 0 0 0 0 0 0 0 0 0 0 0 1866.89 0 0 0 -957.9 0 0 0 0 0 0 0 0 1677.68 0 0 0 0 0 1787.39 0 -239.952 0 0 0 0 0 0 0.03 0 0 1496.4 0 -879.467 0 0 0 -2246.24 0 0 
0 0 0 0 2229.15 0 0 0 0 0 0 0 0 0 0 0 1387.45 536.439 1304.13 0 0 0 0 0 0 0 0 0 0 0 0 0 265.282 0 0 0 0 0 0 0 0 0 0 0 0 0 0 0 0 0 0 0 0 -2071.67 0 0 0 0 -398.648 0 -511.719 0 0 0 -1749.09 0 0 0 0 0 0 0 0 0.03 0 -205.466 0 0 0 0 0 0 0 0 
0 0 0 0 982.009 0 0 0 1113.54 1434.6 0 0 0 0 0 1329 0 0 -670.415 0 0 0 0 0 0 0 0 0 0 0 0 0 0 0 73.0155 0 0 0 0 0 0 0 0 0 0 0 -2085.86 0 0 0 0 0 0 0 0 0 0 0 0 0 0 0 0 0 0 0 0 0 0 0 0 -30.2896 0 0 0.03 0 0 0 0 0 0 0 0 0 
0 0 1793.5 0 0 0 0 0 0 0 0 0 0 0 0 0 1340.91 0 0 0 888.318 2265.92 0 0 0 0 0 0 0 0 0 0 0 0 0 -434.355 0 0 0 0 0 1310.54 0 0 0 0 0 0 0 0 0 0 0 0 -454.65 600.07 0 0 0 0 0 0 0 0 0 0 0 0 0 0 -268.792 0 807.596 -2036.27 0 0.08 1800.52 0 0 0 0 0 0 0 
0 0 0 0 0 -823.161 0 0 -866.497 0 0 0 -1230.74 0 0 0 0 0 0 0 0 0 0 0 0 0 0 0 0 0 0 0 0 0 0 -691.168 0 0 0 0 1406.67 0 0 -1034.2 0 0 2185.2 0 0 0 0 0 0 0 0 0 0 1978.9 0 539.949 0 0 0 1672.03 0 1659.83 0 0 0 0 0 0 0 0 0 1795.79 0.01 0 0 0 1760.99 0 0 0 
0 0 0 0 -2241.97 0 0 1259.42 0 0 0 0 0 0 0 0 0 0 0 0 0 0 0 0 0 0 0 56.3829 1785.87 0 0 0 0 0 0 0 0 0 -2033.52 0 0 1079.97 1217 0 0 0 0 0 0 0 0 0 0 0 0 118.641 0 0 0 0 0 0 0 0 2303.61 0 0 0 0 0 0 1750.62 2097.61 0 0 0 0 0.03 0 0 0 1851.79 0 0 
0 0 1846.9 0 0 2164.3 0 0 0 0 0 0 0 0 0 0 737.251 0 0 0 0 0 0 0 0 1992.02 0 0 0 0 0 0 0 0 0 0 1639.68 0 0 0 0 260.552 0 0 734.199 0 2177.88 2401.12 0 0 0 0 138.63 0 0 304.498 0 0 0 0 0 0 0 0 0 0 0 0 0 0 0 445.952 0 0 0 0 0 0 0.04 0 0 0 0 0 
2042.22 0 0 0 0 0 0 0 0 0 0 0 -2175.44 0 0 518.738 0 0 0 0 0 0 0 0 1659.52 0 0 1867.05 0 0 0 0 0 0 0 205.008 0 0 0 0 0 0 0 0 0 0 0 0 0 788.522 0 0 0 0 1439.33 346.614 0 0 0 0 116.504 0 0 0 0 0 0 -373.47 -595.035 2209.16 0 0 0 0 0 0 0 0 0 0.08 0 0 0 0 
0 2480.32 0 0 0 0 0 0 0 2330.93 0 0 0 0 0 0 0 0 0 0 0 0 0 0 0 0 0 0 0 0 0 0 0 0 0 0 0 0 0 0 0 344.783 0 0 0 0 0 0 0 0 0 0 0 149.007 0 0 1026.11 0 0 0 -448.088 -2410.58 0 0 0 0 0 918.531 0 0 0 0 0 0 0 0 353.023 0 0 0 0.02 270.47 0 0 
0 0 0 -401.547 0 0 -1040.15 0 0 0 0 0 0 0 -1739.33 0 0 0 0 0 0 0 0 0 0 0 0 0 0 0 0 0 0 934.553 0 0 -2336.57 0 0 0 0 0 968.734 0 0 0 0 0 0 0 0 0 0 0 0 0 0 0 0 0 0 0 0 0 0 -2175.44 0 0 0 1386.84 1839.88 0 1694.77 0 0 0 0 -478.149 0 0 2013.23 0.01 0 0 
0 0 0 -1861.55 0 0 0 0 0 0 2288.05 0 0 0 0 0 0 0 0 0 0 1325.95 -704.443 0 0 0 0 1016.19 1701.64 672.552 0 0 2124.62 0 -720.466 0 0 1224.48 0 2013.99 0 0 0 -1883.53 -1749.7 0 0 0 0 0 0 0 0 0 0 -95.4466 0 0 0 0 0 0 0 0 0 0 0 0 0 0 -748.39 0 0 0 0 0 0 0 0 0 0 0 0.06 0 
0 0 0 0 2398.37 -320.368 0 0 -900.067 0 0 0 0 0 0 0 0 2481.84 0 0 1637.55 0 0 0 0 0 0 0 0 0 0 0 0 0 0 0 0 17.0141 0 0 0 0 0 0 -1704.69 0 0 0 0 0 0 0 0 0 0 0 0 0 0 -2460.48 0 1250.72 0 0 0 0 0 0 0 0 0 0 0 0 0 0 0 0 0 0 0 0 0 0.03 
