*Vertices 48
*Matrix 
0.01 0 0 0 454.039 0 2493.29 618.229 0 0 0 0 1030.53 2000.56 1983.02 0 0 0 0 954.695 0 0 0 0 -954.237 0 0 0 0 0 0 0 0 58.0615 0 0 0 0 0 2330.32 -1511.35 2355.04 1517 0 0 0 0 0 
0 0.04 13.0467 1420.26 0 0 2156.21 0 0 0 0 0 -1143.91 0 0 0 0 0 0 -594.119 0 0 0 0 0 1251.95 0 0 0 0 0 0 0 -601.596 -2335.2 1817 1773.96 1733.38 1511.81 1363.03 1104.85 0 0 0 0 0 0 0 
0 1403.01 0.05 0 0 0 0 0 1848.58 0 0 0 0 0 0 -1255.61 0 0 2246.54 0 2371.67 0 0 0 -744.27 -82.9341 0 943.251 -931.043 -941.42 1678.29 -803.476 0 1030.99 0 0 0 0 424.741 0 0 0 1009.78 0 2470.85 0 11.063 0 
0 1974.93 0 0.08 -773.415 0 0 0 1313.44 -1316.03 0 0 0 -927.839 0 0 0 1247.67 1803.26 1539.28 1637.85 0 -1720.1 0 749.306 0 0 0 0 0 0 0 0 0 0 0 1090.2 0 0 0 1798.38 1586.73 -1923.96 0 0 0 0 0 
-1521.42 0 0 -378.811 0.07 0 0 0 0 -1044.27 -892.285 1503.42 0 0 2308.8 0 1762.06 0 0 0 0 0 0 -571.383 771.126 -357.906 0 0 1311 0 0 0 -391.781 0 0 0 2020.55 0 1827.22 0 0 0 1531.65 0 0 0 0 0 
0 0 0 0 0 0.04 0 -863.14 0 0 822.245 0 434.049 0 0 -1002.91 0 0 0 -1324.73 0 0 0 0 0 920.82 0 0 0 0 1722.39 0 0 0 0 0 0 0 0 0 1741.46 1849.19 0 0 0 0 0 0 
-520.417 2378.23 0 0 0 0 0.01 -1568.42 -1547.67 0 0 0 0 0 0 0 0 0 2027.57 0 0 0 0 0 0 0 -739.998 1934.49 1487.09 0 0 0 -2322.99 0 0 1215.93 1412.93 0 0 0 0 448.698 0 0 0 0 0 0 
2462.61 0 0 0 0 -876.263 -46.1592 0.05 928.755 0 142.598 0 0 0 2233.12 0 -1801.74 -2038.87 -2430.11 0 0 0 0 0 0 0 0 0 0 1578.95 -1758.86 1884.14 1725.9 0 0 1598.94 0 2487.95 0 0 0 -1373.1 0 0 0 0 0 0 
0 0 1637.24 1050.98 0 0 2063.13 -1467.86 0.05 0 0 0 0 0 0 0 0 0 0 0 -1132.92 0 0 0 0 0 0 0 1682.26 0 0 0 0 0 0 0 0 0 0 977.584 0 0 618.076 0 0 0 0 0 
0 0 0 364.162 1158.71 0 0 0 0 0.01 0 600.986 0 0 280.999 0 1600.31 0 704.291 0 2204.73 0 0 0 0 0 -1571.93 259.026 1457.95 -87.817 0 0 0 0 1480.68 0 0 0 0 0 824.229 -1800.06 0 0 0 0 0 433.592 
0 0 0 0 -213.095 1095.69 0 1941.21 0 0 0.03 0 0 0 0 -2177.72 -1340.14 0 0 2349.24 0 0 0 0 1764.35 0 0 0 0 1726.81 -880.383 0 0 0 0 0 702.612 0 0 0 0 0 0 1883.22 0 597.171 0 0 
0 0 0 0 949.202 0 0 0 0 1708.66 0 0.01 0 0 0 0 0 0 0 -1352.35 1535.62 0 0 0 1480.83 0 -244.987 0 0 0 2453 0 -507.599 0 0 1664.56 0 0 0 1303.37 0 0 0 0 0 440.001 0 789.132 
441.527 2149.49 0 0 0 -491.577 0 0 0 0 0 0 0 0 0 0 0 0 0 0 0 0 0 0 -1077.23 487.304 0 0 0 0 0 0 0 0 0 0 0 -52.4155 0 -514.161 0 0 1226.77 0 546.205 19.9133 0 0 
540.864 0 0 798.135 0 0 0 0 0 0 0 0 0 0.08 0 0 445.647 0 0 0 0 0 0 2344.05 0 -760.445 -829.417 0 0 -1320.15 0 0 0 0 0 0 1056.93 0 0 0 0 0 2191.61 0 -555.971 0 2345.58 1517.91 
594.729 0 0 0 1478.24 0 0 1054.34 0 -861.614 0 0 0 0 0 0 0 0 0 0 0 -2294.92 0 0 0 604.343 2186.42 140.461 0 0 0 0 0 1644.57 -2447.36 0 0 0 0 592.898 0 1017.56 -2228.23 0 0 -541.322 0 0 
0 0 2045.12 0 0 -1238.52 0 0 0 0 1959.36 0 0 0 0 0.03 483.032 0 0 -1629 0 0 -62.1815 -1205.25 0 0 0 0 0 0 0 -438.78 0 0 0 0 353.786 0 0 -663.854 422.3 0 2224.57 0 0 0 0 0 
0 0 0 0 1993.85 0 0 2158.35 0 2357.94 -936.842 0 0 427.335 0 2438.2 0.04 0 0 0 0 0 0 0 1029.77 0 -2070.6 1827.22 0 0 0 -1648.38 409.024 -973.006 2103.26 593.509 0 0 1700.42 0 0 0 0 0 0 0 0 -1945.63 
0 0 0 278.863 0 0 0 116.199 0 0 0 0 0 0 0 0 0 0.05 0 -2209.62 2091.05 0 0 0 0 0 1456.57 0 -520.417 -289.087 0 0 0 0 -2128.9 0 2284.08 -23.423 2055.65 0 -1468.47 -1646.4 0 0 0 0 0 0 
0 0 -1781.14 -206.839 0 0 -813.395 -422.3 0 2307.89 0 0 0 0 0 0 0 0 0.01 2409.36 0 0 0 736.03 0 0 0 0 287.408 0 1211.81 -160.909 0 0 0 0 0 0 0 0 0 0 0 0 0 0 0 0 
1822.03 1125.45 0 -354.701 0 905.255 0 0 0 0 1135.67 -674.23 0 0 0 1274.83 0 642.796 -394.375 0.08 1731.7 0 0 0 0 0 0 0 0 0 0 1207.24 0 0 0 0 0 0 0 0 0 0 0 0 0 -1308.56 0 0 
0 0 1482.06 2438.81 0 0 0 0 1672.34 -1788 0 1062.88 0 0 0 0 0 -166.555 0 397.58 0.08 2164.91 0 -995.59 0 0 0 2217.86 0 0 0 0 0 0 0 0 0 0 0 0 0 0 0 0 0 0 0 0 
0 0 0 0 0 0 0 0 0 0 0 0 0 0 -734.504 0 0 0 0 0 -864.513 0.03 0 1072.8 22.0496 0 0 50.737 0 0 1742.84 0 0 0 0 0 496.765 1868.57 0 0 0 1100.12 0 0 0 0 0 0 
0 0 0 345.546 0 0 0 0 0 0 0 0 0 0 0 -2126.15 0 0 0 0 0 0 0.06 0 1796.85 0 0 0 0 0 0 0 0 0 0 2360.07 -8.92666 915.632 0 0 0 0 0 0 0 1679.82 0 0 
0 0 0 0 -1309.63 0 0 0 0 0 0 0 0 -1506.47 0 203.787 0 0 2436.83 0 -108.875 876.72 0 0.07 0 0 -717.872 0 0 1317.71 2425.84 111.621 681.707 0 2346.49 0 0 0 0 0 -1623.36 0 0 -1889.63 1229.36 0 0 0 
606.174 0 2250.36 -1519.44 -2107.23 0 0 0 0 0 -139.241 -1353.88 1384.85 0 0 0 1167.26 0 0 0 0 1815.62 -917.31 0 0.06 -2253.56 152.821 0 1538.06 0 0 0 0 2007.89 0 0 0 0 0 930.28 0 0 0 -2473.14 0 0 0 0 
0 1349.6 -48.7533 0 -594.729 319.91 0 0 0 0 0 0 253.075 -212.18 -1656.01 0 0 0 0 0 0 0 0 0 -2026.05 0.04 0 0 0 -368.74 0 0 0 2383.11 -78.0511 0 0 0 0 2149.19 0 0 0 0 0 0 348.14 -1042.28 
0 0 0 0 0 0 1911.45 0 0 -987.96 0 685.827 0 -1647.77 176.931 0 -2329.25 -1258.66 0 0 0 0 0 1795.18 1174.43 0 0.06 0 0 0 0 0 -1994.61 0 1222.34 0 677.435 0 0 0 0 0 0 1901.38 0 0 0 0 
0 0 1953.41 0 0 0 -2397.61 0 0 1733.53 0 0 0 0 1995.07 0 159.078 0 0 0 1976.15 1109.73 0 0 0 0 0 0.01 0 0 0 0 0 0 0 1192.28 0 -369.655 0 0 0 0 0 0 0 0 0 -1855.6 
0 0 2206.41 0 -474.639 0 -2458.95 0 -501.038 2390.13 0 0 0 0 0 0 0 -797.22 1011 0 0 0 0 0 1714 0 0 0 0.06 0 0 306.33 0 0 0 0 0 1018.33 0 0 -1039.38 0 0 227.134 1311.3 0 0 0 
0 0 -2357.02 0 0 0 0 -2250.36 0 1975.84 2125.69 0 0 -2357.94 0 0 0 2341.15 0 0 0 0 0 548.036 0 2280.88 0 0 0 0.07 0 0 0 0 0 0 0 0 0 2424.92 -774.941 0 -1418.12 0 1694.92 0 0 0 
0 0 406.43 0 0 1052.35 0 1456.88 0 0 -361.873 1296.66 0 0 0 0 0 0 388.73 0 0 -2371.52 0 189.749 0 0 0 0 0 0 0.04 0 0 0 -2236.47 1674.78 0 0 -1782.2 0 0 0 2053.97 0 1279.87 203.482 0 0 
0 0 1937.39 0 0 0 0 -309.534 0 0 0 0 0 0 0 94.8363 980.483 0 -1490.14 843.15 0 0 0 94.2259 0 0 0 0 -312.586 0 0 0.08 -1092.79 0 0 0 0 0 0 0 0 0 -247.276 1240.35 2035.66 0 0 0 
0 0 0 0 -1166.04 0 1695.84 -312.128 0 0 0 404.752 0 0 0 0 1639.68 0 0 0 0 0 0 2426.6 0 0 -773.263 0 0 0 0 1261.71 0 0 1269.95 0 0 41.5815 0 0 0 837.962 0 291.833 0 0 0 0 
1284.3 -2054.43 31.3578 0 0 0 0 0 0 0 0 0 0 0 -77.2881 0 -84.46 0 0 0 0 0 0 0 1883.53 1463.9 0 0 0 0 0 0 0 0.02 0 0 0 0 1967.76 -929.518 -481.506 0 0 0 2047.41 0 0 0 
0 -2440.49 0 0 0 0 0 0 0 364.01 0 0 0 0 1750.47 0 2259.82 1595.74 0 0 0 0 0 1195.03 0 2479.09 294.427 0 0 0 1693.09 0 2034.75 0 0.05 1213.49 1163.59 0 0 0 0 0 1092.64 1231.65 0 0 0 0 
0 1827.07 0 0 0 0 1735.05 2170.25 0 0 0 -786.843 0 0 0 0 -266.35 0 0 0 0 0 59.1296 0 0 0 0 -387.509 0 0 -1062.43 0 0 0 -283.288 0.01 0 668.889 0 607.242 0 2158.96 0 1350.67 23.8807 0 0 0 
0 -1860.48 0 1214.41 1820.35 0 -548.799 0 0 0 2091.66 0 0 1564.3 0 -2497.71 0 1501.43 0 0 0 -1706.37 1856.36 0 0 0 361.873 0 0 0 0 0 0 0 461.516 0 0.05 925.703 1636.63 0 0 0 0 -653.478 0 0 0 0 
0 1005.97 0 0 0 0 0 1523.26 0 0 0 0 1942.73 0 0 0 0 2341.61 0 0 0 -354.701 177.541 0 0 0 0 -664.006 273.217 0 0 0 758.766 0 0 791.116 -966.903 0.01 0 -859.63 0 0 0 0 0 0 0 0 
0 2418.06 1479.46 0 430.387 0 0 0 0 0 0 0 0 0 0 0 654.393 608.31 0 0 0 0 0 0 0 0 0 0 0 0 -2271.11 0 0 377.59 0 0 -812.326 0 0.06 290.307 0 1533.02 0 0 0 -259.026 0 0 
-1658.76 356.838 0 0 0 0 0 0 1909.01 0 0 1799.6 -365.841 0 1068.68 1157.64 0 0 0 0 0 0 0 0 1722.08 -627.842 0 0 0 -1748.48 0 0 0 1602.91 0 -2063.59 0 1823.56 1945.48 0.07 2384.03 0 0 0 0 0 0 0 
-709.632 571.23 0 2125.08 0 610.294 0 0 0 171.59 0 0 0 0 0 1152.76 0 2442.32 0 0 0 0 0 -1114 0 0 0 0 556.429 -880.383 0 0 0 -1058.76 0 0 0 0 0 -768.075 0 0 0 0 0 0 0 0 
2341 0 0 1664.86 0 261.925 -1379.67 -1749.7 0 2069.23 0 0 0 0 2424.62 0 0 1295.13 0 0 0 -2275.69 0 0 0 0 0 0 0 0 0 0 -74.2363 0 0 2428.43 0 0 286.645 0 0 0.05 556.581 1589.02 -851.695 0 0 758.766 
779.061 0 1490.6 -1012.53 1790.9 0 0 0 -199.667 0 0 0 134.358 2224.88 -1027.48 -309.381 0 0 0 0 0 0 0 0 0 0 0 0 0 -1361.05 -700.934 1051.9 0 0 -1286.43 0 0 0 0 0 0 -637.455 0.07 0 2257.23 1798.07 0 0 
0 0 0 0 0 0 0 0 0 0 883.435 0 0 0 0 0 0 0 0 0 0 0 0 -1235.77 2374.72 0 2276.3 0 1953.72 0 0 -1355.86 1688.97 0 1748.48 156.789 -1704.08 0 0 0 0 2064.81 0 0.07 1708.35 0 0 0 
0 0 1159.63 0 0 0 0 0 0 0 0 0 -1676.31 1345.03 0 0 0 0 0 0 0 0 0 232.627 0 0 0 0 2489.93 699.561 188.07 278.863 0 2114.25 0 1815.32 0 0 0 0 0 -966.903 1023.82 -2253.87 0.02 1610.08 0 0 
0 0 0 0 0 0 0 0 0 0 -268.181 1984.54 834.605 0 1918.78 0 0 0 0 -660.344 0 0 -1279.11 0 0 0 0 0 0 0 -754.494 0 0 0 0 0 0 0 1161.31 0 0 0 239.341 0 2497.86 0.03 0 0 
0 0 -1254.23 0 0 0 0 0 0 0 0 0 0 1448.48 0 0 0 0 0 0 0 0 0 0 0 2274.01 0 0 0 0 0 0 0 0 0 0 0 0 0 0 0 0 0 0 0 0 0.06 0 
0 0 0 0 0 0 0 0 0 -1303.37 0 2129.81 0 2309.26 0 0 -1465.12 0 0 0 0 0 0 0 0 198.141 0 -1800.52 0 0 0 0 0 0 0 0 0 0 0 0 0 458.617 0 0 0 0 0 0.04 
