*Network. Lake Texoma, Texus No 46
*Vertices 19
   1 "Small phytoplankton"
   2 "medium Phytoplankton"
   3 "large phytoplankton"
   4 "algal"
   5 "submergent vascular plants"
   6 "emergent vasular plants"
   7 "animal carcasses"
   8 "small zooplankton"
   9 "herbivorous vertebrate harvesters"
   10 "turtles"
   11 "medium zooplankton"
   12 "suspension-feeding invertebrates"
   13 "fish larvae"
   14 "invertebrate predators"
   15 "fingerling fish"
   16 "filter feeding fishes"
   17 "bottom feeding fishes"
   18 "carnivorous fishes"
   19 "carnivorous vertebrate harvesters"
*Matrix
0 0 0 0 0 0 0 1 0 0 0 1 1 0 1 1 1 0 0
0 0 0 0 0 0 0 0 0 0 1 0 1 0 1 1 1 0 0
0 0 0 0 0 0 0 0 0 0 0 0 1 0 1 1 1 0 0
0 0 0 0 0 0 0 0 1 1 0 0 1 0 1 1 1 1 0
0 0 0 0 0 0 0 0 1 1 0 0 1 0 1 1 1 1 0
0 0 0 0 0 0 0 0 1 1 0 0 0 0 0 0 0 0 0
0 0 0 0 0 0 0 0 0 1 0 0 0 0 0 0 0 0 0
0 0 0 0 0 0 0 0 0 0 1 1 1 1 1 1 1 1 0
0 0 0 0 0 0 0 0 0 0 0 0 0 0 0 0 0 0 0
0 0 0 0 0 0 0 0 0 0 0 0 0 0 0 0 0 1 0
0 0 0 0 0 0 0 0 0 0 0 0 1 1 1 1 1 0 0
0 0 0 0 0 0 0 0 0 0 0 0 0 0 1 1 1 1 1
0 0 0 0 0 0 0 0 0 0 0 0 0 1 1 1 1 1 0
0 0 0 0 0 0 0 0 0 0 0 0 0 0 1 1 1 1 1
0 0 0 0 0 0 0 0 0 0 0 0 0 0 0 1 1 1 0
0 0 0 0 0 0 0 0 0 0 0 0 0 0 0 0 0 1 1
0 0 0 0 0 0 0 0 0 0 0 0 0 0 0 0 0 1 1
0 0 0 0 0 0 0 0 0 0 0 0 0 0 0 0 0 0 1
0 0 0 0 0 0 0 0 0 0 0 0 0 0 0 0 0 0 0