*Vertices 62
*Matrix 
0.04 0 0 0 0 0 0 0 0 1500.67 0 0 0 0 604.801 0 0 -2352.44 0 0 0 0 0 0 1406.67 0 1932.36 0 0 0 667.974 0 0 0 0 0 0 0 0 0 0 0 0 0 0 0 0 0 0 0 0 0 0 1610.69 0 0 0 0 0 0 0 0 
0 0.07 0 0 0 0 0 0 0 0 1318.02 2039.48 0 0 0 0 0 0 0 0 0 -209.586 0 0 0 -1428.19 0 0 0 0 0 0 0 0 0 996.353 0 0 0 0 0 0 532.014 0 0 0 1902.3 0 0 0 0 0 951.643 0 0 0 0 0 0 0 0 0 
0 0 0.03 0 0 0 0 0 0 1887.34 0 565.889 0 0 0 0 0 0 0 1801.13 0 0 500.275 0 0 0 0 0 0 0 0 -1979.66 0 1727.27 -586.337 0 -452.513 0 0 0 0 0 -1267.2 0 1007.95 0 0 0 0 0 0 0 0 0 0 0 0 0 0 0 0 0 
0 0 0 0.03 0 0 0 -2042.99 1652.2 0 0 0 0 0 0 1500.67 0 0 0 0 1834.54 0 0 0 0 0 0 0 0 0 0 0 0 0 0 -2440.95 0 548.799 0 0 0 0 0 1739.78 0 0 1926.1 0 0 0 0 2170.86 -1839.88 0 -89.4955 0 0 0 0 0 0 0 
0 0 0 0 0.04 0 0 0 1242.18 0 0 0 0 0 0 0 0 0 0 0 0 0 0 0 0 0 0 0 0 0 0 0 0 0 0 0 2238.46 0 0 0 202.872 553.835 0 0 -1650.82 0 580.386 0 0 0 0 0 2210.07 0 0 0 -143.208 -1721.63 0 0 0 0 
0 0 0 0 0 0.09 0 0 0 0 0 0 0 1574.53 0 0 0 0 0 956.984 0 0 0 0 0 -207.144 0 0 1789.83 0 0 0 1467.41 0 0 0 0 0 0 0 0 -2061.6 0 0 0 0 0 0 0 0 0 731.758 0 480.895 0 0 0 0 0 0 0 0 
0 0 0 0 0 0 0.01 -431.455 0 2490.84 0 0 0 770.669 0 0 0 0 -1661.81 0 2147.66 0 0 0 0 1980.42 0 0 0 2393.95 0 0 0 1823.86 1649.3 0 -2032.76 0 0 0 0 0 0 0 0 -775.399 0 0 0 0 0 1852.7 0 0 0 0 0 0 0 0 0 0 
0 0 0 1521.58 0 0 1517.15 0.06 0 0 0 0 0 0 0 0 0 0 1463.59 0 0 0 0 0 0 0 0 -368.282 0 0 0 0 0 0 0 0 0 -290.613 0 0 0 0 0 0 0 0 0 0 0 0 0 -1535.46 848.796 0 0 0 746.254 0 1383.63 0 0 0 
0 0 0 1698.74 1506.47 0 0 0 0.06 2222.74 0 0 0 0 -615.329 0 0 0 0 0 0 0 0 0 0 0 0 0 -2045.12 0 2171.47 0 0 0 0 -1710.79 0 0 0 2423.55 0 0 0 0 0 0 -1486.48 -1470.76 0 0 0 0 0 0 0 0 0 0 0 0 0 0 
368.435 0 359.279 0 0 0 1236.38 0 117.573 0.02 0 0 0 0 0 0 0 0 0 0 0 0 -1992.78 0 0 0 1849.96 0 0 0 0 0 1038.47 0 0 0 0 0 0 0 0 0 -2159.11 0 2461.7 0 0 0 2481.23 -1014.21 0 0 0 0 0 0 0 0 0 0 0 0 
0 -267.418 0 0 0 0 0 0 0 0 0.08 0 1418.58 0 0 0 1381.5 0 0 0 0 2057.18 0 0 0 0 0 0 0 0 0 0 -1081.35 -198.904 0 0 0 0 0 -138.173 0 0 0 0 0 0 0 0 0 0 0 0 0 0 0 166.86 0 -632.878 0 0 0 0 
0 -352.107 -490.204 0 0 0 0 0 0 0 0 0.09 0 0 2046.8 0 0 913.648 0 0 0 0 0 1022.29 0 0 0 0 0 0 0 0 0 1625.34 0 0 -799.203 0 0 0 0 0 0 0 0 -158.01 0 0 0 0 0 0 0 0 -1852.24 0 0 2463.38 0 0 0 0 
0 0 0 0 0 0 0 0 0 0 2252.49 0 0.06 0 0 0 0 0 0 0 0 2143.09 410.092 0 0 0 0 0 0 0 0 0 0 0 1058.46 0 2367.24 0 0 0 0 -2107.53 0 0 0 0 0 569.094 0 0 0 0 918.683 0 -813.852 0 0 0 0 0 0 0 
0 0 0 0 0 566.347 976.821 0 0 0 0 0 0 0.05 0 0 0 0 0 0 0 0 0 0 0 0 0 0 0 0 1944.87 0 0 0 732.215 0 0 0 0 0 0 889.843 0 0 0 0 0 0 0 0 0 -763.802 0 0 0 0 0 0 0 0 1319.09 0 
-85.6807 0 0 0 0 0 0 0 872.295 0 0 1985.31 0 0 0.08 0 0 0 0 0 0 0 0 0 0 0 0 0 0 0 0 0 0 0 0 0 0 0 0 0 0 0 0 0 0 0 120.319 0 0 1524.93 0 -1997.51 -1818.22 0 0 0 0 -319.452 0 0 0 905.408 
0 0 0 2179.71 0 0 0 0 0 0 0 0 0 0 0 0.02 0 0 0 899.457 0 0 388.577 0 0 -2092.58 0 0 0 0 0 0 0 0 0 913.495 0 -1131.7 0 0 0 0 0 917.463 0 999.71 0 -1204.95 0 0 0 0 0 0 2123.71 1842.17 0 0 0 0 0 0 
0 0 0 0 0 0 0 0 0 0 2378.23 0 0 0 0 0 0.03 729.774 228.202 0 0 -0.839259 0 0 1316.34 0 0 0 0 0 0 0 2322.23 0 0 0 0 0 0 0 0 0 0 0 0 0 0 0 0 0 0 0 0 0 -1915.27 0 0 2305.44 0 0 0 0 
-881.451 0 0 0 0 0 0 0 0 0 0 2076.1 0 0 0 0 1721.47 0.01 -456.023 0 -18.2348 0 0 -40.6659 0 1211.2 0 0 0 2378.23 60.0452 0 0 2237.54 0 0 0 0 -385.525 0 0 0 0 0 0 0 0 0 0 0 1473.2 0 0 0 0 0 0 0 0 0 0 0 
0 0 0 0 0 0 -193.258 1290.55 0 0 0 0 0 0 0 0 -360.958 1928.54 0.03 0 0 0 0 0 0 0 1048.23 0 0 0 0 0 0 1609.47 0 0 0 0 0 0 0 0 0 0 0 0 0 0 1605.35 0 1134.45 1527.83 0 0 0 0 0 0 0 0 0 0 
0 0 -751.442 0 0 1873 0 0 0 0 0 0 0 0 0 2298.12 0 0 0 0.08 0 0 0 219.962 0 0 0 0 778.909 2166.43 1426.66 -556.734 0 0 0 2319.79 0 0 0 0 0 0 0 0 0 465.331 0 0 0 0 0 0 0 0 0 0 0 0 0 0 0 0 
0 0 0 2063.13 0 0 1205.86 0 0 0 0 0 0 0 0 0 0 -902.661 0 0 0 -578.707 0 0 0 0 0 0 0 2458.49 -1071.58 0 -402.31 0 0 0 0 0 0 0 -1952.19 985.824 0 0 0 2474.97 -1322.75 0 0 0 0 0 0 0 0 0 0 343.867 0 0 0 0 
0 2158.35 0 0 0 0 0 0 0 0 893.811 0 409.635 0 0 0 1246.6 0 0 0 -680.334 0.07 -1486.18 0 0 0 0 382.626 0 0 0 0 0 0 0 953.169 0 472.045 -642.949 0 0 0 0 0 0 0 0 1822.95 0 0 0 0 0 1403.47 0 0 0 0 0 0 0 0 
0 0 2327.42 0 0 0 0 0 0 -584.048 0 0 2319.64 0 0 -1542.33 0 0 0 0 0 -1607.79 0.09 0 0 0 0 0 0 0 0 0 67.8274 0 0 0 0 1023.67 0 0 0 0 0 0 0 0 0 0 0 0 0 0 0 0 0 0 0 0 0 0 0 0 
0 0 0 0 0 0 0 0 0 0 0 -217.368 0 0 0 0 0 1950.21 0 1660.44 0 0 0 0.07 1644.72 0 0 0 0 0 0 0 0 0 1770.3 0 0 0 0 0 -1090.2 1226.62 0 -1599.4 0 0 -1572.08 0 0 0 0 0 0 0 0 0 0 0 0 0 0 0 
-1141.77 0 0 0 0 0 0 0 0 0 0 0 0 0 0 0 1074.94 0 0 0 0 0 0 1888.71 0.02 0 0 0 0 0 0 0 0 0 0 -724.281 0 0 0 0 0 0 0 0 0 0 0 0 0 0 0 0 174.795 0 0 0 0 0 0 0 0 0 
0 1934.03 0 0 0 978.042 1110.03 0 0 0 0 0 0 0 0 574.129 0 -0.381481 0 0 0 0 0 0 0 0.03 0 0 0 0 0 0 0 0 0 0 0 2258.6 867.412 0 0 0 0 0 2059.16 0 0 0 0 0 0 0 -730.842 0 0 0 0 0 0 0 0 0 
1523.26 0 0 0 0 0 0 0 0 -730.232 0 0 0 0 0 0 0 0 2089.83 0 0 0 0 0 0 0 0.06 2039.63 0 0 0 0 0 687.964 224.387 0 0 0 0 0 0 0 0 -746.254 0 0 0 -683.081 0 0 0 0 0 0 0 0 0 0 0 0 0 0 
0 0 0 0 0 0 0 1617.56 0 0 0 0 0 0 0 0 0 0 0 0 0 1696.6 0 0 0 0 432.066 0 0 0 1640.6 0 0 0 0 0 0 0 0 0 0 0 -1179.92 0 0 -1454.28 0 0 0 0 0 0 0 0 0 0 1487.24 0 0 0 0 0 
0 0 0 0 0 -1067.61 0 0 1331.14 0 0 0 0 0 0 0 0 0 0 69.0481 0 0 0 0 0 0 0 0 0.07 0 0 -684.149 0 0 0 0 0 0 0 0 740.303 0 -530.946 0 0 0 0 0 0 0 0 0 0 0 0 0 0 2087.08 0 0 0 0 
0 0 0 0 0 0 -1036.79 0 0 0 0 0 0 0 0 0 0 1056.78 0 2287.29 -35.9355 0 0 0 0 0 0 0 0 0.02 0 0 794.168 -1490.75 0 0 0 0 0 0 0 0 0 0 0 0 0 2476.65 0 0 0 0 -1423.61 -881.451 0 0 0 0 0 0 0 0 
-163.503 0 0 0 0 0 0 0 -857.646 0 0 0 0 730.079 0 0 0 -969.802 0 2133.78 1980.73 0 0 0 0 0 0 -1160.24 0 0 0.06 0 0 0 0 0 1548.74 0 -243.919 -1255.3 0 0 0 0 0 0 0 0 0 -833.232 0 0 0 0 0 -1245.23 0 0 0 0 0 0 
0 0 1811.81 0 0 0 0 0 0 0 0 0 0 0 0 0 0 0 0 -1457.49 0 0 0 0 0 0 0 0 -201.956 0 0 0.06 0 0 0 0 0 0 0 0 0 0 -1758.71 816.904 0 0 0 0 2442.63 0 0 0 1848.43 0 0 0 0 0 0 0 0 0 
0 0 0 0 0 1637.55 0 0 0 -1617.71 1648.23 0 0 0 0 0 1895.28 0 0 0 477.844 0 2344.51 0 0 0 0 0 0 -1709.72 0 0 0 0 -784.707 0 0 0 0 2451.93 0 0 0 0 0 0 0 363.094 0 0 0 0 0 0 0 0 0 0 0 0 0 0 
0 0 708.563 0 0 0 -2110.74 0 0 0 -277.032 1673.41 0 0 0 0 0 1713.84 1997.82 0 0 0 0 0 0 0 -1200.37 0 0 1972.33 0 0 0 0.07 0 0 0 0 -2152.39 0 0 0 0 0 0 0 2227.16 1909.62 0 0 -2094.41 0 0 0 0 0 0 0 0 0 0 0 
0 0 960.799 0 0 0 2027.88 0 0 0 0 0 1652.5 714.515 0 0 0 0 0 0 0 0 0 1633.88 0 0 369.808 0 0 0 0 0 2297.51 0 0.09 0 0 -624.485 414.06 0 0 0 0 0 0 0 0 0 0 0 0 0 0 0 0 0 0 0 0 1590.4 0 0 
0 248.65 0 -56.5355 0 0 0 0 -37.6141 0 0 0 0 0 0 1638.92 0 0 0 833.689 0 -2062.36 0 0 1728.49 0 0 0 0 0 0 0 0 0 0 0.07 0 0 0 0 -256.737 0 2418.82 0 0 0 0 0 0 0 0 536.286 0 0 0 0 0 0 0 0 0 0 
0 0 774.789 0 1539.28 0 1349.6 0 0 0 0 -1671.27 1655.55 0 0 0 0 0 0 0 0 0 0 0 0 0 0 0 0 0 1950.21 0 0 0 0 0 0.08 0 0 1009.78 0 0 0 0 0 0 0 0 0 0 0 0 0 0 0 0 0 2091.97 0 0 0 0 
0 0 0 2351.68 0 0 0 -28.7637 0 0 0 0 0 0 0 -1764.96 0 0 0 0 0 747.78 2263.48 0 0 -1603.52 0 0 0 0 0 0 0 0 2289.88 0 0 0.05 0 0 0 0 0 0 0 0 0 0 0 0 0 0 0 0 0 0 0 -2415.31 0 0 0 0 
0 0 0 0 0 0 0 0 0 0 0 0 0 0 0 0 0 1742.99 0 0 0 -711.768 0 0 0 -335.017 0 0 0 0 119.098 0 0 2089.22 -1321.22 0 0 0 0.05 0 0 0 0 1898.48 0 -1367.61 -1667.3 0 0 0 0 0 0 0 0 0 0 0 0 0 0 0 
0 0 0 0 0 0 0 0 -415.738 0 -161.977 0 0 0 0 0 0 0 0 0 0 0 0 0 0 0 0 0 0 0 1055.25 0 2418.52 0 0 0 2333.22 0 0 0.08 0 0 0 0 0 0 0 0 0 0 917.31 0 0 0 0 0 0 0 0 0 0 0 
0 0 0 0 1646.7 0 0 0 0 0 0 0 0 0 0 0 0 0 0 0 -148.396 0 0 -2255.24 0 0 0 0 -462.127 0 0 0 0 0 0 426.572 0 0 0 0 0.09 556.886 0 2486.27 0 1148.79 0 0 0 0 0 1448.03 0 0 0 0 0 0 0 0 0 0 
0 0 0 0 -1100.57 1200.98 0 0 0 0 0 0 1442.23 2044.05 0 0 0 0 0 0 -963.851 0 0 -1714.3 0 0 0 0 0 0 0 0 0 0 0 0 0 0 0 0 1431.39 0.06 306.635 1856.36 1626.41 0 0 0 0 0 0 0 0 0 0 0 0 0 0 0 0 0 
0 384.762 -1017.87 0 0 0 0 0 0 -158.162 0 0 0 0 0 0 0 0 0 0 0 0 0 0 0 0 0 2447.51 1239.59 0 0 964.003 0 0 0 1441.92 0 0 0 0 0 -1474.27 0 2319.79 0 0 0 0 0 0 0 0 0 0 0 0 0 0 0 0 0 0 
0 0 0 2232.81 0 0 0 0 0 0 0 0 0 0 0 2001.63 0 0 0 0 0 0 0 -750.069 0 0 1715.67 0 0 0 0 -163.045 0 0 0 0 0 0 914.716 0 -1050.52 1540.96 -1120.41 0 0 0 0 0 0 0 0 0 0 0 0 0 0 0 0 0 0 0 
0 0 -713.141 0 2023.45 0 0 0 0 -1703.01 0 0 0 0 0 0 0 0 0 0 0 0 0 0 0 1198.39 0 0 0 0 0 0 0 0 0 0 0 0 0 0 0 1465.58 0 0 0.04 0 0 0 0 0 1317.71 1121.63 0 0 0 0 0 0 0 0 0 0 
0 0 0 0 0 0 448.393 0 0 0 0 1737.04 0 0 0 -451.903 0 0 0 695.593 1837.9 0 0 0 0 0 0 -1365.63 0 0 0 0 0 0 0 0 0 0 -1748.63 0 1752.45 0 0 0 0 0 0 0 0 -2268.67 0 0 0 0 0 0 0 0 -1418.88 0 0 0 
0 2251.12 0 -659.124 1358 0 0 0 648.595 0 0 0 0 0 -540.101 0 0 0 0 0 665.075 0 0 485.931 0 0 0 0 0 0 0 0 0 1791.82 0 0 0 0 331.812 0 0 0 0 0 0 0 0.01 -2267.14 0 0 0 602.359 0 0 0 0 0 0 0 0 0 0 
0 0 0 0 0 0 0 0 125.813 0 0 0 463.805 0 0 383.084 0 0 0 0 0 1143.91 0 0 0 0 2118.82 0 0 2454.68 0 0 37.9192 560.396 0 0 0 0 0 0 0 0 0 0 0 0 2088.76 0.05 0 0 0 0 0 0 0 0 0 0 0 0 0 0 
0 0 0 0 0 0 0 0 0 148.396 0 0 0 0 0 0 0 0 2093.34 0 0 0 0 0 0 0 0 0 0 0 0 956.679 0 0 0 0 0 0 0 0 0 0 0 0 0 0 0 0 0.01 0 0 0 -939.131 0 0 0 0 0 0 0 0 0 
0 0 0 0 0 0 0 0 0 -242.851 0 0 0 0 588.168 0 0 0 0 0 0 0 0 0 0 0 0 0 0 0 2077.32 0 0 0 0 0 0 0 0 0 0 0 0 0 0 880.535 0 0 0 0.07 0 0 0 0 0 0 2312.01 0 0 0 0 0 
0 0 0 0 0 0 0 0 0 0 0 0 0 0 0 0 0 2171.01 1626.26 0 0 0 0 0 0 0 0 0 0 0 0 0 0 1897.56 0 0 0 0 0 -2202.14 0 0 0 0 1811.35 0 0 0 0 0 0.05 1460.39 0 32.2733 0 0 0 228.355 0 0 0 0 
0 0 0 -112.537 0 1681.8 945.387 810.953 0 0 0 0 0 2168.26 1167.1 0 0 0 891.675 0 0 0 0 0 0 0 0 0 0 0 0 0 0 0 0 614.414 0 0 0 0 2467.19 0 0 0 1066.09 0 -738.777 0 0 0 -1592.07 0.06 0 0 0 0 0 0 0 0 0 0 
0 1345.79 0 -2359 -491.119 0 0 632.878 0 0 0 0 1421.78 0 1230.28 0 0 0 0 0 0 0 0 0 910.596 640.355 0 0 0 751.595 0 950.27 0 0 0 0 0 0 0 0 0 0 0 0 0 0 0 0 1374.48 0 0 0 0.04 -133.747 0 0 0 0 0 0 0 0 
2090.9 0 0 0 0 1607.64 0 0 0 0 0 0 0 0 0 0 0 0 0 0 0 1477.63 0 0 0 0 0 0 0 1494.57 0 0 0 0 0 0 0 0 0 0 0 0 0 0 0 0 0 0 0 0 -876.263 0 -1702.86 0 0 0 -1090.66 0 0 0 0 0 
0 0 0 2151.63 0 0 0 0 0 0 0 1491.36 816.446 0 0 563.448 -1331.9 0 0 0 0 0 0 0 0 0 0 0 0 0 0 0 0 0 0 0 0 0 0 0 0 0 0 0 0 0 0 0 0 0 0 0 0 0 0.07 0 0 0 0 0 0 0 
0 0 0 0 0 0 0 0 0 0 1611.45 0 0 0 0 2467.65 0 0 0 0 0 0 0 0 0 0 0 0 0 0 2426.45 0 0 0 0 0 0 0 0 0 0 0 0 0 0 0 0 0 0 0 0 0 0 0 0 0.03 0 1119.8 0 0 0 0 
0 0 0 0 2321.92 0 0 -314.722 0 0 0 0 0 0 0 0 0 0 0 0 0 0 0 0 0 0 0 1430.63 0 0 0 0 0 0 0 0 0 0 0 0 0 0 0 0 0 0 0 0 0 2066.64 0 0 0 1517.3 0 0 0 -347.377 0 0 0 0 
0 0 0 0 2054.89 0 0 0 0 0 1134.3 821.787 0 0 2342.52 0 1897.72 0 0 0 836.131 0 0 0 0 0 0 0 860.393 0 0 0 0 0 0 0 2056.87 1512.42 0 0 0 0 0 0 0 0 0 0 0 0 844.523 0 0 0 0 -209.738 -1989.27 0.09 -2144.46 0 0 0 
0 0 0 0 0 0 0 1010.39 0 0 0 0 0 0 0 0 0 0 0 0 0 0 0 0 0 0 0 0 0 0 0 0 0 0 0 0 0 0 0 0 0 0 0 0 0 -477.081 0 0 0 0 0 0 0 0 0 0 0 1898.18 0.08 0 0 0 
0 0 0 0 0 0 0 0 0 0 0 0 0 0 0 0 0 0 0 0 0 0 0 0 0 0 0 0 0 0 0 0 0 0 1281.7 0 0 0 0 0 0 0 0 0 0 0 0 0 0 0 0 0 0 0 0 0 0 0 0 0.07 0 0 
0 0 0 0 0 0 0 0 0 0 0 0 0 725.654 0 0 0 0 0 0 0 0 0 0 0 0 0 0 0 0 0 0 0 0 0 0 0 0 0 0 0 0 0 0 0 0 0 0 0 0 0 0 0 0 0 0 0 0 0 0 0.04 0 
0 0 0 0 0 0 0 0 0 0 0 0 0 0 972.243 0 0 0 0 0 0 0 0 0 0 0 0 0 0 0 0 0 0 0 0 0 0 0 0 0 0 0 0 0 0 0 0 0 0 0 0 0 0 0 0 0 0 0 0 0 0 0.09 
