*Vertices 63
*Matrix 
0.03 0 0 2139.73 0 -84.9178 0 0 0 0 0 0 1346.25 263.451 846.812 0 0 -1283.53 0 -1535.46 0 0 0 0 -1672.95 2220.76 0 0 0 -2148.12 2351.53 0 0 2346.49 0 0 2439.42 0 0 -1885.66 -1030.08 1215.02 0 -281.304 0 0 0 0 1670.66 -41.1237 0 0 0 0 -1416.75 0 0 1383.48 -782.876 0 0 0 1303.98 
0 0 0 0 0 -2449.64 1362.73 1925.64 869.549 0 0 2391.05 0 0 -776.467 0 0 0 0 -614.719 0 0 0 0 0 1784.8 2295.22 0 0 0 0 0 0 -1104.69 0 981.094 0 0 0 327.845 -920.362 0 0 0 0 -2028.95 0 -268.639 0 0 2315.06 0 0 -1826.91 -1350.98 -1159.02 0 0 0 0 0 0 -1168.02 
0 0 0.07 2235.25 1661.5 0 0 0 0 0 0 -2160.48 0 0 0 0 0 0 0 0 -1207.54 0 0 0 0 0 0 0 0 46.7696 0 0 0 0 0 0 0 0 0 317.469 0 0 0 0 0 0 0 0 0 0 0 0 0 0 2013.38 0 -729.164 0 -1832.71 0 0 2058.09 0 
1351.44 0 2.36518 0.05 0 0 -2156.21 0 0 0 0 0 0 0 0 0 -446.867 0 -1492.89 -739.692 602.054 1886.73 0 0 -1098.59 0 0 0 0 1471.37 0 0 0 0 0 0 -562.38 -371.029 0 0 0 2186.88 -1323.05 0 1234.24 2130.27 0 1845.99 0 0 0 0 0 0 0 0 0 0 2400.66 0 0 -1310.08 0 
0 0 -305.872 0 0.04 -648.747 0 0 -1312.98 0 0 0 0 0 1332.82 0 1780.68 0 0 0 0 0 0 0 0 0 0 0 0 0 0 1010.24 0 0 0 0 0 0 0 0 0 0 0 0 0 0 0 0 306.635 0 0 0 0 0 0 0 0 0 2204.12 0 2291.71 0 0 
693.609 326.167 0 0 -524.689 0.08 0 0 0 0 0 -1329 1280.02 0 0 0 0 -1061.36 0 -537.355 0 0 0 0 1305.51 0 0 0 2165.97 0 2290.03 0 0 0 -623.264 0 0 0 0 0 0 0 383.389 1737.34 0 0 1567.81 0 -29.2215 0 0 0 0 236.747 1871.32 0 0 0 0 0 0 0 0 
0 -808.664 0 -2430.72 0 0 0.04 0 0 0 0 0 0 0 0 1202.2 0 1804.64 0 0 2128.9 0 0 0 0 0 0 -1099.05 2492.83 0 2481.54 0 1174.43 0 0 0 -46.7696 0 -516.602 1694.92 0 -978.957 0 0 -2344.66 0 1047.93 -1485.56 0 0 2263.63 -687.811 663.854 0 0 0 -832.163 0 0 0 0 0 0 
0 -347.682 0 0 0 0 0 0.01 0 0 0 0 0 0 0 136.952 0 0 0 0 0 1349.6 1259.12 1426.36 0 590.609 0 0 0 0 667.669 0 2480.32 0 -375.149 1220.97 -1397.98 0 1719.34 0 -524.384 0 0 0 -1917.86 0 0 1841.87 0 -823.161 0 0 -1217.76 0 1668.68 -533.387 0 0 0 0 2203.21 0 0 
0 2052.14 0 0 2247.76 0 0 0 0.09 0 0 0 2028.03 0 0 0 434.355 0 0 0 0 11.5207 0 0 0 0 0 0 0 0 0 0 0 0 0 1281.24 2454.99 0 0 0 1283.84 0 0 1352.35 0 0 0 0 0 0 0 0 -259.331 2333.83 1241.87 1818.22 0 0 0 0 0 0 0 
0 0 0 0 0 0 0 0 0 0.03 0 1750.31 2466.12 0 0 0 0 1279.87 883.892 450.072 0 0 0 0 -475.097 0 0 -1876.96 0 383.236 0 0 840.861 0 -1012.68 0 0 2403.71 0 87.054 0 0 653.935 1348.54 0 0 0 0 1884.29 0 2026.96 0 342.799 0 -1326.87 -445.036 0 0 0 0 -49.8215 0 0 
0 0 0 0 0 0 0 0 0 0 0.07 0 2250.97 0 -239.189 0 0 0 0 0 0 0 0 0 0 844.066 -1310.54 0 0 0 0 0 1615.88 0 0 0 0 0 0 0 0 1647.47 -2193.44 0 2452.24 0 0 2475.74 1081.35 0 0 0 0 0 0 0 2016.28 411.618 0 -1679.36 0 0 0 
0 -2073.5 -2487.49 0 0 -151.448 0 0 0 2112.72 0 0.08 -951.949 337.916 2415.92 0 0 0 1759.01 1342.74 442.289 0 -451.14 0 2489.17 0 1018.33 0 0 -1200.98 -1311.15 0 0 775.094 0 511.109 2380.37 0 0 0 2388.3 0 0 0 0 0 0 582.522 0 0 2317.8 0 1412.93 0 0 0 1624.12 0 1399.35 0 0 0 0 
-1886.12 0 0 0 0 39.4452 0 0 -915.784 562.075 1837.29 1038.32 0.05 0 854.442 0 0 -1467.1 0 1806.01 1571.47 0 0 0 0 1298.33 0 2352.75 1062.43 0 0 0 0 0 0 0 0 -131.458 0 0 0 0 0 0 1837.44 0 0 0 0 -304.193 0 0 0 0 0 -971.328 186.087 0 -1557.44 0 -77.5933 1806.47 0 
647.374 0 0 0 0 0 0 0 0 0 0 706.732 0 0.02 331.355 -882.214 1613.13 0 -889.386 0 -1415.68 0 0 -535.218 0 1543.86 510.346 0 0 1675.7 0 0 0 -202.261 0 608.158 0 1209.68 -2373.96 0 -1159.02 397.275 0 0 0 0 0 0 0 0 284.661 0 0 0 0 0 0 0 0 2052.75 0 0 -2470.24 
1566.29 -1646.24 0 0 -794.32 0 0 0 0 0 1113.09 -1648.84 1200.22 -167.013 0.09 1610.84 0 1152 0 0 0 0 1974.47 0 0 0 0 0 0 0 0 0 -2271.87 0 0 -576.876 0 2355.04 -48.2955 -2129.35 0 734.046 0 -696.356 2445.98 656.072 0 0 0 0 0 0 0 0 0 0 0 0 0 -446.715 0 2234.64 0 
0 0 0 0 0 0 85.8333 -237.205 0 0 0 0 0 -1931.44 280.694 0.08 -139.088 130.238 0 0 741.523 0 0 0 0 0 2425.53 0 1522.19 0 0 0 0 0 0 0 0 0 0 340.968 474.487 0 -2455.6 0 0 0 1259.58 0 0 0 0 0 1217.46 0 0 0 0 0 0 0 0 1904.74 0 
0 0 0 2187.64 1692.48 0 0 0 -1310.69 0 0 0 0 1630.22 0 857.494 0.07 0 2216.48 -313.654 0 0 0 0 0 0 0 -490.661 0 0 0 0 0 -522.706 0 0 0 0 0 2473.6 0 0 2161.85 0 0 0 0 16.8615 763.344 0 0 0 -2046.95 2237.08 0 0 -1195.49 -364.62 1153.83 -362.331 0 0 0 
1746.5 0 0 0 0 -1450.16 1540.5 0 0 -622.959 0 0 -143.971 0 927.076 -176.626 0 0.05 0 1790.14 0 0 0 1162.68 0 0 808.054 0 0 0 0 0 0 0 0 0 0 1462.07 0 0 1476.26 1414 2425.99 0 0 0 0 -2459.72 0 0 0 0 0 0 0 0 1052.96 -2153.16 0 0 0 0 0 
0 0 0 1985.15 0 0 0 0 0 -784.402 0 1872.84 0 -417.264 0 0 -1311.61 0 0.04 387.204 0 0 0 1988.05 0 0 0 0 -138.325 -437.101 0 -1115.83 0 0 -1291.47 0 0 0 0 0 1449.86 0 -1623.2 0 0 0 -143.208 0 0 0 0 0 1859.42 0 0 0 0 1054.34 0 0 0 0 0 
902.509 1637.24 0 -1436.89 0 -2288.66 0 0 0 1729.1 0 -1133.23 2490.84 0 0 0 1863.54 2092.43 1943.8 0.06 0 0 0 0 0 -1850.72 0 0 0 0 -1988.81 0 0 0 0 2102.34 0 0 0 -837.809 0 0 147.938 0 0 0 926.16 0 2119.28 -2030.32 0 0 632.267 2014.76 0 475.86 0 0 -3.43333 0 0 0 0 
0 0 1479 508.667 0 0 -1266.29 0 0 0 0 1375.55 -523.164 1119.5 0 -2002.85 0 0 0 0 0.01 0 0 0 -1054.19 0 1114.15 0 0 0 1311.61 0 0 0 -45.2437 0 0 0 0 0 0 -617.618 841.166 0 0 0 0 0 1207.08 0 0 1953.41 0 0 0 0 0 0 0 0 0 0 0 
0 0 0 1443.14 0 0 0 -1706.06 -980.178 0 0 0 0 0 0 0 0 0 0 0 0 0.09 0 0 0 0 0 0 0 0 0 0 1995.38 0 0 0 0 0 0 0 0 0 0 0 0 0 0 0 0 0 0 -678.808 -947.981 2377.32 863.445 2398.98 0 -803.781 0 0 0 0 0 
0 0 0 0 0 0 0 -1175.95 0 0 0 914.106 0 0 2347.71 0 0 0 0 0 0 0 0.08 -2257.07 0 0 0 -1242.79 1872.54 0 0 0 0 0 0 0 0 0 1972.64 0 0 0 -459.99 0 758.003 0 0 0 2397.46 0 0 2293.39 0 0 -2255.7 -260.857 0 0 -1747.72 0 0 0 0 
0 0 0 0 0 0 0 556.886 0 0 0 0 0 194.327 0 0 0 1009.78 1343.5 0 0 0 2067.55 0.03 0 0 -567.263 0 -2212.36 0 0 1352.66 0 0 0 2249.6 0 0 713.752 510.804 0 0 0 2079.45 2205.95 0 0 0 -1164.36 0 0 0 0 0 1972.18 1705.76 0 0 0 2096.24 0 0 0 
-1440.86 0 0 -818.278 0 2489.93 0 0 0 -1076.92 0 1488.62 0 0 0 0 0 0 0 0 377.743 0 0 0 0.05 0 0 0 -1245.54 0 -1116.9 -1094.62 1239.74 0 0 216.605 0 0 454.344 0 0 0 1130.18 1895.58 0 0 0 0 0 0 0 0 0 0 -227.287 0 1180.99 0 0 0 0 1061.36 0 
-980.941 -2220.15 0 0 0 0 0 246.208 0 0 -687.964 0 2017.81 2350.46 0 0 0 0 0 55.9252 0 0 0 0 0 0.09 0 445.494 0 0 0 0 0 -783.944 0 0 -1646.24 0 0 0 -187.918 0 0 0 0 2040.24 0 0 0 0 0 0 0 0 262.841 1103.17 0 0 0 0 0 1775.49 0 
0 -205.008 0 0 0 0 0 0 0 0 1154.44 492.492 0 1060.75 0 2221.52 0 -1804.79 0 0 -447.172 0 0 -109.333 0 0 0 0 0 0 0 -759.224 0 0 0 -290.765 0 0 0 0 0 0 0 0 -588.778 0 0 1015.58 0 0 -338.984 0 0 0 0 0 -1748.33 0 0 0 1741.31 0 0 
0 0 0 0 0 0 2269.28 0 0 2225.94 0 0 -124.744 0 0 0 -247.581 0 0 0 0 0 -2255.85 0 0 -322.81 0 0.02 0 -1517.76 2230.67 0 -1389.43 0 277.795 0 0 0 0 0 2415.16 915.937 0 0 0 0 0 0 -391.018 0 0 991.623 0 1990.49 0 0 0 0 0 1783.27 576.418 1169.24 0 
0 0 0 0 0 -2243.64 1803.42 0 0 0 0 0 2156.82 0 0 544.679 0 0 -1886.12 0 0 0 1947.77 2495.27 2264.55 0 0 0 0.09 1206.02 0 0 0 686.895 0 0 0 638.218 -328.761 -1096.3 0 0 0 0 1318.17 1150.62 -1641.21 2363.28 0 0 0 0 -308.618 0 0 0 0 0 0 -2283.62 -1851.63 0 0 
1781.75 0 1177.94 1812.57 0 0 0 0 0 -321.284 0 -458.007 0 18.9978 0 0 0 0 576.571 0 0 0 0 0 0 0 0 -140.156 494.781 0.06 0 0 0 0 0 0 0 0 0 0 0 521.027 0 -79.577 0 0 0 -297.327 0 0 0 0 0 -994.217 0 -1300.32 0 0 0 0 0 0 0 
2374.11 0 0 0 0 2112.26 -534.15 1903.06 0 0 0 -541.932 0 0 0 0 0 0 0 -673.467 1353.57 0 0 0 693.762 0 0 1640.45 0 0 0.09 0 0 0 0 0 0 0 -867.26 0 0 0 0 1480.22 0 0 0 0 647.832 0 0 0 0 0 0 1426.97 88.7326 0 0 0 0 -338.984 0 
0 0 0 0 -675.909 0 0 0 0 0 0 0 0 0 0 0 0 0 1698.13 0 0 0 0 978.5 -883.74 0 -2265.31 0 0 0 0 0.07 0 1139.03 0 0 1563.54 0 -159.383 0 0 -1019.24 0 2240.44 0 0 -1402.4 0 0 1324.58 0 0 0 220.725 644.017 0 0 0 1147.57 -1962.26 0 0 -35.02 
0 0 0 0 0 0 1097.22 -2092.58 0 2446.29 -2446.13 0 0 0 -230.186 0 0 0 0 0 0 98.1933 0 0 2042.83 0 0 -1123.31 0 0 0 0 0.04 959.883 0 0 0 -1009.32 0 0 0 0 0 0 0 -2478.48 0 2192.07 0 0 0 167.013 0 0 0 0 517.212 0 2211.6 0 0 0 0 
-2268.82 -1272.7 0 0 0 0 0 0 0 0 0 -1031.6 0 298.395 0 0 1396.45 0 0 0 0 0 0 0 0 2149.49 0 0 799.661 0 0 -1576.36 1130.02 0.01 -161.061 0 0 0 0 1484.34 0 0 0 0 0 0 1287.35 0 0 0 897.168 0 0 0 0 0 0 0 0 0 0 0 0 
0 0 0 0 0 1052.05 0 786.691 0 1391.42 0 0 0 0 0 0 0 0 -1437.19 0 1481.44 0 0 0 0 0 0 995.59 0 0 0 0 0 -99.1089 0.05 0 0 1252.71 0 0 0 -2037.95 0 0 0 1199 0 992.386 0 0 0 0 0 0 0 0 0 0 0 -812.479 2382.2 0 0 
0 546.815 0 0 0 0 0 -815.683 1063.19 0 0 -1253.62 0 2228.39 -1996.14 0 0 0 0 1344.57 0 0 0 1250.27 -1001.24 0 1245.84 0 0 0 0 0 0 0 0 0.01 -1241.11 0 0 0 -951.338 0 0 0 0 0 0 0 0 0 0 0 0 0 0 -1312.52 0 0 0 0 0 0 0 
992.233 0 0 32.7311 0 0 1787.39 -1560.18 2113.64 0 0 1534.55 0 0 0 0 0 0 0 0 0 0 0 0 0 1680.43 0 0 0 0 0 2422.79 0 0 0 -813.547 0.01 0 0 1826.61 0 0 29.8318 0 0 2482.76 0 0 0 0 634.709 1692.63 -1158.41 0 0 0 0 0 2268.06 0 -1883.98 0 0 
0 0 0 1242.94 0 0 0 0 0 1632.82 0 0 2264.09 1329 1906.57 0 0 2307.43 0 0 0 0 0 0 0 0 0 0 787.454 0 0 0 1220.97 0 -1188.77 0 0 0.05 0 732.521 -1539.28 -13.3518 0 0 0 0 442.137 0 -2263.48 0 0 0 -2488.4 0 -167.928 0 0 0 0 0 0 34.7148 0 
0 0 0 0 0 0 -2171.77 -1523.1 0 0 0 0 0 1798.84 1769.39 0 0 0 0 0 0 0 -1840.65 -665.685 -1005.81 0 0 0 -1905.04 0 1435.06 1639.68 0 0 0 0 0 0 0.04 -931.349 0 0 0 0 952.254 2137.59 0 1818.52 0 0 0 0 0 0 0 0 557.802 -1139.94 0 0 0 0 930.433 
1820.51 1111.26 1840.19 0 0 0 689.337 0 0 -2192.53 0 0 0 0 259.331 -2374.57 888.318 0 0 626.774 0 0 0 1690.95 0 0 0 0 -525.452 0 0 0 0 -992.996 0 0 -153.279 -163.35 -289.85 0.08 0 0 0 0 -1814.25 0 0 0 0 0 0 929.823 1267.36 0 0 398.953 2051.07 349.666 1372.65 0 2069.23 0 0 
-912.275 -1542.18 0 0 0 0 0 594.272 1203.42 0 0 1374.94 0 1868.11 0 422.3 0 -981.857 1758.86 0 0 0 0 0 0 1212.12 0 -2086.47 0 0 0 0 0 0 0 -1461.15 0 2030.47 0 0 0.04 0 0 -1065.17 0 1932.51 0 0 0 0 185.934 0 -1986.22 0 0 0 -370.724 0 0 -373.318 0 0 0 
1142.84 0 0 -1683.48 0 0 441.527 0 0 0 1142.99 0 0 992.08 758.614 0 0 1176.11 0 0 167.623 0 0 0 0 0 0 -423.978 0 -396.664 0 926.771 0 0 -2093.19 0 0 934.4 0 0 0 0.09 0 0 0 0 0 -1036.18 0 0 0 0 0 0 0 0 0 0 0 0 0 0 0 
0 0 0 -1806.16 0 246.361 0 0 0 -1659.37 1503.42 0 0 0 0 830.943 -715.278 -259.636 2161.09 2379.91 1263.54 0 2487.95 0 -110.401 0 0 0 0 0 0 0 0 0 0 0 255.821 0 0 0 0 0 0.08 0 0 0 0 0 0 0 0 0 0 0 0 0 0 0 0 0 0 -1703.01 0 
303.583 0 0 0 0 -2413.02 0 0 459.075 1592.38 0 0 0 0 -1490.45 0 0 0 0 0 0 0 0 -1454.13 2079 0 0 0 0 1658.45 343.562 1560.18 0 0 0 0 0 0 0 0 97.8881 0 0 0.09 1735.36 440.764 571.688 0 1302.45 909.375 454.039 0 0 -1623.05 -1566.13 -1992.78 0 1398.28 1348.38 0 1920.15 0 0 
0 0 0 -1232.26 0 0 1692.79 828.654 0 0 -807.291 0 -2407.68 0 1802.5 0 0 0 0 0 0 0 2483.52 -2261.5 0 0 -113.758 0 2031.24 0 0 0 0 0 0 0 0 0 636.082 2473.14 0 0 0 2447.66 0 0 -664.312 0 0 0 0 0 0 0 1661.05 0 0 0 2044.66 0 433.897 0 0 
0 2225.79 0 1014.82 0 0 0 0 0 0 0 0 0 0 -136.647 0 0 0 0 0 0 0 0 0 0 -1894.51 0 0 -123.524 0 0 0 2377.77 0 1971.11 0 -1639.68 0 -2031.08 0 -44.9385 0 0 587.1 0 0.06 0 1406.06 0 0 0 2243.64 0 0 0 0 0 0 0 0 0 553.987 0 
0 0 0 0 0 528.199 2261.8 0 0 0 0 0 0 0 0 1802.96 0 0 546.815 -851.238 0 0 0 0 0 0 0 0 -364.772 0 0 -51.5 0 1384.7 0 0 0 514.618 0 0 0 0 0 1532.26 -1994.77 0 0.07 0 0 2321.01 0 418.332 0 0 0 -2430.27 0 0 0 0 650.121 -1403.78 0 
0 2188.25 0 -127.033 0 0 -1620.46 -1000.78 0 0 1898.33 -770.516 0 0 0 0 -251.396 2319.18 0 0 0 0 0 0 0 0 548.494 0 1538.82 -1125.75 0 0 1663.49 0 -180.135 0 0 0 -1482.82 0 0 776.467 0 0 0 2019.79 0 0.02 0 -1427.27 0 0 1411.1 0 0 -377.59 1680.12 0 0 0 0 0 0 
-413.449 0 0 0 74.2363 1001.24 0 0 0 1963.48 2337.18 0 0 0 0 0 -1994.77 0 0 415.281 -412.534 0 1601.99 2.97555 0 0 0 1308.86 0 0 -1570.71 0 0 0 0 0 0 1494.11 0 0 0 0 0 -2339.93 0 0 0 0 0.01 1616.18 0 0 0 2493.29 0 -1564.46 0 0 0 0 0 0 0 
-1489.99 0 0 0 0 0 0 1005.97 0 0 0 0 -982.162 0 0 0 0 0 0 1085.01 0 0 0 0 0 0 0 0 0 0 0 -1982.1 0 0 0 0 0 0 0 0 0 0 0 509.278 0 0 1632.51 -924.177 824.686 0.04 0 0 0 0 -1564.61 1469.08 0 0 889.996 2141.56 0 0 0 
0 2167.5 0 0 0 0 435.881 0 0 1711.1 0 1231.35 0 2108.91 0 0 0 0 0 0 0 0 0 0 0 0 -324.946 0 0 0 0 0 0 716.193 0 0 1990.49 0 0 0 483.795 0 0 603.885 0 0 0 0 0 0 0.05 0 0 521.332 -2190.24 0 -1929.46 0 0 0 0 -2028.34 0 
0 0 0 0 0 0 -2162.16 0 0 0 0 0 0 0 0 0 0 0 0 0 2149.65 294.58 -79.1192 0 0 0 0 -1277.43 0 0 0 0 2202.44 0 0 0 2080.37 0 0 1837.29 0 0 0 0 0 1223.26 -1879.56 0 0 0 0 0.06 0 0 0 0 0 0 0 1612.37 0 0 0 
0 0 0 0 0 0 2418.21 -729.164 719.398 -664.159 0 -1122.24 0 0 0 -690.863 -810.648 0 -590.609 707.343 0 2432.55 0 0 0 0 0 0 943.556 0 0 0 0 0 0 0 1647.62 -1966.69 0 -615.94 -518.891 0 0 0 0 0 0 1578.8 0 0 0 0 0.05 0 0 0 0 0 -1626.1 0 0 0 334.101 
0 1772.74 0 0 0 229.881 0 0 1691.11 0 0 0 0 0 0 0 -1946.09 0 0 -1360.13 0 2154.84 0 0 0 0 0 406.735 0 770.363 0 -2248.53 0 0 0 0 0 0 0 0 0 0 0 -1612.52 0 0 0 0 328.15 0 -1833.63 0 0 0.01 2259.97 0 0 0 0 0 -1210.9 1635.41 -445.189 
-2152.39 -236.442 1430.33 0 0 1874.52 0 -949.812 -1113.7 2404.78 0 0 0 0 0 0 0 0 0 0 0 1099.35 -1435.36 -2135.15 -1442.99 -1485.26 0 0 0 0 0 -1437.04 0 0 0 0 0 -120.167 0 0 0 0 0 2324.82 1418.12 0 0 0 0 -188.833 2197.71 0 0 2338.25 0.05 1188.31 0 65.0807 0 1311.61 0 0 0 
0 2345.42 0 0 0 0 0 -240.867 -2213.28 1295.59 0 0 485.015 0 0 0 0 0 0 1324.12 0 -320.978 -1340.45 2438.35 0 -1400.88 0 0 0 -1416.59 2003.46 0 0 0 0 257.958 0 0 0 1504.33 0 0 0 2308.95 0 0 2002.85 -850.78 867.107 323.42 0 0 0 0 2117.76 0.04 0 0 0 2207.79 0 0 0 
0 0 844.218 0 0 0 -2017.2 0 0 0 -1527.22 333.491 1238.98 0 0 0 -489.746 -1918.93 0 0 0 0 0 0 -593.051 0 -140.004 0 0 0 1217.61 0 1524.02 0 0 0 0 0 -2369.69 -2272.48 2473.14 0 0 0 0 0 0 2058.7 0 0 1724.52 0 0 0 0 0 0.08 0 0 0 744.575 2220.15 0 
-368.74 0 0 0 0 0 0 0 0 0 -1842.48 0 0 0 0 0 393.307 147.023 2486.42 0 0 1062.12 0 0 0 0 0 0 0 0 0 0 0 0 0 0 0 0 -2379.6 1614.81 0 0 0 -551.698 0 0 0 0 0 0 0 0 0 0 1781.44 0 0 0.01 0 0 0 0 0 
403.836 0 -533.692 1031.3 1784.34 0 0 0 0 0 0 -1086.99 -541.475 0 0 0 1917.1 0 0 -2122.49 0 0 2075.95 0 0 0 0 0 0 0 0 878.704 2476.65 0 0 0 1402.4 0 0 1694.46 0 0 0 512.482 -536.897 0 0 0 0 621.738 0 0 -1737.04 0 0 0 0 0 0.01 0 0 1800.67 0 
0 0 0 0 0 0 0 0 0 0 1743.14 0 0 790.048 -1961.81 0 -6.79037 0 0 0 0 0 0 2012.31 0 0 0 2406.77 -829.417 0 0 1789.68 0 0 2021.47 0 0 0 0 0 1495.33 0 0 0 0 0 0 0 0 772.347 0 -1403.93 0 0 1073.72 -1911.15 0 0 0 0 -507.141 0 0 
0 0 0 0 2229.61 0 0 1877.27 0 1726.2 0 0 -2023.61 0 0 0 0 0 0 0 0 0 0 0 0 0 -118.641 2338.25 2425.08 0 0 0 0 0 1916.18 0 1633.27 0 0 923.872 0 0 0 -130.39 104.297 0 -1341.21 0 0 0 0 0 0 -1137.81 0 0 298.547 0 0 -736.335 0.04 0 0 
0 0 602.359 794.32 0 0 0 0 0 0 0 0 2179.1 0 1338.47 -683.691 0 0 0 0 0 0 0 0 -2462.31 1239.13 0 -1161.92 0 0 1731.85 0 0 0 0 0 0 410.092 0 0 0 0 -36.0881 0 0 1256.68 -844.981 0 0 0 -1569.95 0 0 456.481 0 0 1764.35 0 -449.309 0 0 0.09 0 
-1255.91 1282.31 0 0 0 0 0 0 0 0 0 0 0 -152.364 0 0 0 0 0 0 0 0 0 0 0 0 0 0 0 0 0 613.193 0 0 0 0 0 0 -283.746 0 0 0 0 0 0 0 0 0 0 0 0 0 -596.255 2446.9 0 0 0 0 0 0 0 0 0.09 
