*Vertices 59
*Matrix 
0.03 428.404 0 0 0 0 -556.581 -1755.2 0 0 0 0 0 0 0 0 0 0 0 1621.52 0 1314.05 0 0 -308.466 -56.3829 0 0 0 -2156.82 0 0 -2476.35 0 1275.75 0 0 0 1809.82 224.387 0 -1277.89 0 -2082.2 770.669 0 1813.79 0 0 0 0 0 0 1740.39 0 1867.96 0 0 0 
-191.58 0 1334.8 0 0 2131.64 0 -260.247 0 0 -793.252 0 0 -1737.8 0 0 1344.26 2457.43 777.841 0 0 2009.72 0 0 -477.844 0 1657.23 0 2164.91 0 -546.205 0 0 -1979.66 2346.8 0 0 0 0 2024.37 0 0 0 -1145.13 -1655.55 0 0 0 -691.321 0 -1945.63 0 0 -2092.43 0 -267.724 0 0 0 
0 -1615.27 0 0 0 0 0 0 1041.98 0 0 1624.12 1964.86 0 0 0 0 0 0 0 0 0 0 0 0 0 385.983 0 0 0 0 0 0 0 0 0 0 0 0 -2167.35 0 2463.23 0 0 149.007 0 0 0 0 0 -398.953 0 0 0 0 0 0 1792.43 0 
0 0 0 0.09 0 130.085 0 0 0 0 0 0 1530.43 821.177 0 0 0 -829.112 0 0 -290.307 1373.56 0 0 0 0 0 0 0 0 492.798 1332.36 0 0 0 541.169 0 0 550.172 0 0 0 -429.472 0 0 0 0 0 0 0 0 -1185.11 0 1549.81 0 1573.92 420.927 1133.53 0 
0 0 0 0 0.03 -710.395 1686.22 0 1210.14 0 -371.029 0 0 0 0 0 1303.06 1468.32 0 0 0 0 0 0 808.359 0 -370.724 0 1443.14 0 543.611 -1776.25 0 2235.25 0 0 -1365.32 0 0 0 0 -188.986 430.692 0 0 336.238 -1292.54 -2475.89 0 -1600.62 0 0 0 0 656.987 0 0 2350.15 916.242 
0 -1622.14 0 241.02 462.432 0.03 0 0 0 0 -1381.34 0 0 0 0 0 0 0 0 1109.27 0 826.365 0 789.743 0 0 911.206 0 0 0 0 1187.7 0 0 0 0 0 1365.47 0 0 0 0 1365.78 0 0 0 0 0 -1344.72 0 0 -1911.76 0 -761.208 168.386 0 -375.454 1075.7 2085.56 
703.07 0 0 0 899.762 0 0.03 0 0 0 -741.981 0 0 0 961.104 0 0 1197.32 0 0 0 1449.86 -2472.53 1471.83 0 0 0 -859.478 0 0 0 0 0 0 1835.92 0 0 2052.75 1387.45 0 0 0 537.812 -1239.89 0 0 0 0 -636.692 0 0 0 0 0 0 0 0 0 0 
-697.272 1124.99 0 0 0 0 0 0.06 -655.461 0 0 0 0 0 0 0 0 0 0 0 0 1604.59 0 1501.59 0 0 0 0 0 0 -428.404 0 0 0 1546.45 0 -1896.95 1969.74 0 110.248 0 1864.6 0 1534.39 0 0 0 -1531.8 0 0 0 2275.08 -279.778 0 -2097.46 0 1920.61 0 0 
0 0 2466.12 0 2221.06 0 0 1621.22 0 0 2044.21 0 2459.26 0 0 2108.6 542.085 0 0 0 0 0 0 0 0 0 0 -1683.17 0 0 0 -926.618 0 0 0 0 0 -2483.37 0 -2108.6 0 0 -912.122 0 0 0 1340.75 0 0 -1624.12 0 0 0 0 0 0 0 0 0 
0 0 0 0 0 0 0 0 0 0.04 0 -201.651 0 -2125.23 2099.44 0 0 0 0 0 0 0 0 0 -754.799 0 -208.06 0 0 0 0 0 1047.32 0 0 2301.93 0 0 0 0 0 0 0 1693.7 924.635 0 0 0 0 0 0 0 0 1722.08 0 2286.98 1848.28 -1762.52 0 
0 -327.845 0 0 -1480.07 -1681.49 1809.67 0 -1685.31 0 0 -955.916 0 0 0 -327.998 1566.9 0 -2207.02 2332.3 0 -708.411 0 1023.06 2040.85 1135.67 1600.77 1865.83 0 0 902.509 0 0 0 -2077.17 0 1016.65 0 0 0 0 234.001 21.5918 547.578 0 1941.21 0 152.669 1388.52 0 0 167.013 953.78 0 -203.787 0 0 0 -33.6467 
0 0 1561.56 0 0 0 0 0 0 353.328 1078.3 0.05 0 247.429 0 0 0 0 0 0 0 0 -209.433 -1581.24 1904.43 0 0 0 0 0 0 0 0 0 1648.69 0 0 -1219.6 -1642.28 0 898.999 0 0 0 1254.39 0 0 0 0 2380.21 0 0 -2125.39 0 0 0 0 0 0 
0 0 443.205 -2111.96 0 0 0 0 2180.32 0 0 0 0.08 0 -293.054 -58.5192 1208.15 0 2196.19 0 -517.06 0 0 0 1448.64 0 0 0 -986.74 0 183.95 0 0 0 1791.51 0 0 -1565.98 621.281 0 0 0 0 0 0 0 0 0 0 0 0 -1014.97 2438.2 0 0 1247.98 0 0 0 
0 736.946 0 -82.4763 0 0 0 0 0 543.764 0 -2314.6 0 0.09 1780.98 0 0 0 0 0 0 429.014 0 0 0 1749.24 0 310.45 1313.59 0 -2301.78 1942.12 -1093.71 -1303.37 1523.41 0 0 0 2216.18 0 0 0 0 0 -2324.67 1211.51 0 0 0 0 0 0 0 0 0 0 0 20.8289 0 
0 0 0 0 0 0 550.63 0 0 1141.16 0 0 36.0881 -593.509 0.06 0 0 -2393.95 0 0 0 0 0 0 856.426 1826.3 2454.83 0 0 0 1016.65 466.704 0 0 0 0 0 0 0 -294.58 0 0 0 2450.41 0 0 821.177 0 -1312.52 730.995 0 0 0 0 0 0 0 -2371.67 0 
0 0 0 0 0 0 0 0 2417.6 0 1761.6 0 -1016.65 0 0 0.06 1213.49 0 0 0 0 0 385.372 0 0 0 0 0 0 -670.263 0 0 709.632 0 0 2328.79 -823.008 1316.34 0 0 238.578 0 0 -343.257 -463.805 -294.733 0 0 -364.62 1458.86 -2494.35 0 0 0 0 -1469.54 2220.15 0 0 
0 2380.98 0 0 -1315.27 0 0 0 -1265.53 0 2283.93 0 403.073 0 0 1886.43 0.06 0 -1663.95 0 1494.57 0 0 0 0 2446.13 2000.87 0 0 0 0 1691.11 -1983.02 0 0 0 0 0 0 0 1393.7 0 1425.29 0 0 0 -680.486 0 0 0 0 0 -2333.98 1001.24 0 0 0 0 0 
0 2202.75 0 -240.715 684.149 0 2373.04 0 0 0 0 0 0 0 1706.06 0 0 0.01 0 -1093.86 0 0 194.632 0 0 0 0 0 0 -41.8867 0 1054.64 1268.12 0 0 0 0 0 -1219.44 0 1905.5 0 847.423 0 0 0 163.045 0 0 0 0 0 0 0 0 0 0 2473.14 0 
0 788.369 0 0 0 0 0 0 0 0 2277.21 0 2421.72 0 0 0 1292.99 0 0 1268.88 -420.927 0 0 0 0 1381.5 0 0 -594.729 0 0 0 -1894.82 0 1723.15 0 0 0 0 0 626.316 0 -2193.59 0 0 0 0 0 0 0 0 0 1817.91 0 0 0 0 0 0 
-1063.65 0 0 0 0 251.701 0 0 0 0 -1360.59 0 0 0 0 0 0 774.636 324.183 0.06 2074.88 0 0 -2089.98 0 0 0 0 0 0 0 0 1412.93 0 -27.6955 0 0 89.9533 0 0 0 0 0 0 0 0 0 0 2170.4 0 0 -1189.99 0 195.242 0 0 0 0 0 
0 0 0 -2361.45 0 0 0 0 0 0 0 0 203.94 0 0 0 723.365 0 1271.78 -703.07 0 0 0 0 0 -1444.06 919.752 -954.237 0 0 0 -1883.53 0 0 0 0 0 0 1011.46 0 0 0 0 0 0 0 -171.285 0 0 0 0 1688.21 0 0 0 0 2205.65 1620.76 0 
-1353.57 -443.815 0 -1385.77 0 1909.47 610.904 -1995.68 0 0 2298.73 0 0 1909.77 0 0 0 0 0 0 0 0.07 720.923 0 0 0 0 0 0 0 0 0 1477.32 0 1358 0 0 0 420.469 -1984.39 0 0 -2097.77 0 0 301.294 2246.85 0 0 0 -363.857 0 0 2398.22 731.758 0 0 833.232 0 
0 0 0 0 0 0 -1737.65 0 0 0 0 1618.32 0 0 0 536.592 0 -1703.47 0 0 0 -1607.79 0.09 0 1241.72 506.684 0 0 2431.18 1027.33 0 0 0 1317.71 0 0 -1167.56 2381.89 0 0 0 0 0 0 0 0 0 0 172.658 2087.24 0 0 0 -185.476 0 -399.258 0 0 0 
0 0 0 0 0 -952.712 1176.41 1410.03 0 0 -1732.46 -956.526 0 0 0 0 0 0 0 1242.18 0 0 0 0.03 187.155 0 0 0 -279.931 0 0 0 0 0 0 1554.08 0 0 0 0 0 -1406.22 2309.87 0 0 0 94.8363 0 0 0 0 2467.65 0 0 0 799.661 0 0 0 
-1277.58 -1305.2 0 0 1615.42 0 0 0 0 1022.75 314.57 2084.8 -2240.75 0 -236.595 0 0 0 0 0 0 0 1125.14 -337.306 0.02 0 0 0 0 0 0 0 0 -218.131 1384.7 0 2487.03 2476.65 0 0 0 0 0 0 0 0 0 -159.383 -74.0837 2326.5 0 -18.54 0 2226.4 0 0 0 0 0 
-16.2511 0 0 0 0 0 0 0 0 0 667.669 0 0 782.876 -245.598 0 -784.555 0 495.392 0 2029.71 0 1491.21 0 0 0.03 0 0 0 0 0 0 0 136.036 -1128.5 0 -2011.4 0 0 1271.94 0 0 0 0 849.101 0 0 0 -459.227 0 0 510.956 -1352.05 -1347.16 0 0 0 0 0 
0 -2212.06 -856.273 0 1771.98 1365.02 0 0 0 1961.04 -18.0822 0 0 0 931.349 0 -281.915 0 0 0 1464.35 0 0 0 0 0 0.06 0 -1241.72 0 -1272.85 0 0 0 1758.86 0 0 0 0 -299.463 2203.36 0 0 0 47.38 0 0 1605.81 839.946 0 -1857.28 0 -1244.01 0 0 786.691 -2222.28 0 0 
0 0 0 0 0 0 1837.75 0 160.146 0 949.355 0 0 -157.552 0 0 0 0 0 0 343.867 0 0 0 0 0 0 0.05 0 0 0 1358.3 0 0 152.211 0 1204.64 0 1199.91 930.128 0 0 0 0 0 0 0 -786.081 0 0 0 0 620.212 0 0 0 0 0 0 
0 -173.727 0 0 -1817.15 0 0 0 0 0 0 0 775.399 -959.12 0 0 0 0 1064.71 0 0 0 -1798.53 1096.91 0 0 1020 0 0.03 0 0 0 0 0 0 0 0 0 0 0 2288.05 0 0 0 0 -74.6941 0 1369.59 0 0 0 0 -1427.88 0 0 0 0 0 0 
1344.72 0 0 0 0 0 0 0 0 0 0 0 0 0 0 -2033.83 0 1922.9 0 0 0 0 -1884.59 0 0 0 0 0 0 0.06 664.922 685.98 0 1241.42 0 0 0 0 2126 -1021.53 0 -108.722 0 0 805.918 0 0 0 1824.02 -2469.18 -2152.55 0 0 0 261.62 0 0 1800.06 0 
0 -1288.26 0 -2151.63 1779.46 0 0 364.315 0 0 -747.322 0 1901.23 -234.306 -1004.29 0 0 0 0 0 0 0 0 0 0 0 -1779.92 0 0 1684.55 0 0 0 0 0 0 1945.63 -1730.48 0 0 560.701 1780.37 0 0 0 0 0 758.766 0 2306.05 -1758.86 0 0 0 2444.3 -261.01 1476.41 0 0 
0 0 0 233.543 -346.309 1273.61 0 0 1585.51 0 0 0 0 1807.23 1874.83 0 -2338.1 854.137 0 0 1644.41 0 0 0 0 0 0 -1006.42 0 -1208.3 0 0.05 39.7504 0 -1465.58 1648.23 0 0 0 0 0 0 1280.63 0 0 0 0 0 0 0 0 0 0 0 0 733.589 0 0 545.747 
2223.65 0 0 0 0 0 0 0 0 1922.44 0 0 0 -88.8852 0 1350.37 -975.906 2281.95 611.057 1790.6 0 2081.74 0 0 0 0 0 0 0 0 0 746.712 0.05 0 0 0 0 -1759.62 0 204.093 0 0 0 0 0 0 0 0 0 0 0 0 0 0 0 537.507 0 0 0 
0 1151.84 0 0 -1130.94 0 0 0 0 0 0 0 0 340.663 0 0 0 0 0 0 0 0 410.092 0 1767.71 1157.95 0 0 0 2119.13 0 0 0 0.04 -840.556 -489.288 -2306.82 0 0 0 1088.98 -805.002 0 0 0 0 0 -1562.01 0 0 0 0 0 1608.1 2467.04 0 0 0 0 
1124.84 1466.49 0 0 0 0 2063.74 1134.6 0 0 1365.47 -1259.12 -1169.09 -1718.57 0 0 0 0 2117.3 -1723.46 0 -1950.67 0 0 1053.27 2112.26 -572.146 -1100.57 0 0 0 -939.741 0 -437.407 0.05 0 168.386 0 0 0 0 0 0 0 0 0 0 0 0 0 0 -710.7 0 0 0 2439.73 0 0 0 
0 0 0 1274.07 0 0 0 0 0 702.918 0 0 0 0 0 823.313 0 0 0 0 0 0 0 -773.873 0 0 0 0 0 0 0 -876.72 0 1701.48 0 0.07 0 0 -476.775 0 0 0 0 0 1165.88 0 0 0 720.618 0 -613.041 0 0 0 2438.35 0 0 0 0 
0 0 0 0 304.956 0 0 -816.599 0 0 2340.24 0 0 0 0 1594.52 0 0 0 0 0 0 -2279.5 0 -1229.21 -465.941 0 -2053.51 0 0 1433.84 0 0 245.903 -707.19 0 0.04 0 0 0 -389.95 0 2264.7 0 0 0 0 1058.92 -2302.24 0 1025.8 0 0 801.95 2361.75 0 0 0 0 
0 0 0 0 0 -2086.47 1041.83 634.709 1835.61 0 0 -972.243 1439.02 0 0 1808.6 0 0 0 -646.153 0 0 2451.63 0 -1736.73 0 0 0 0 0 931.806 0 862.072 0 0 0 0 0.08 2215.11 0 0 0 -893.201 0 0 0 0 0 0 1542.63 0 587.863 0 -1860.79 -1271.78 0 1840.34 0 0 
327.387 0 0 168.538 0 0 2220.15 0 0 0 0 2412.87 596.866 94.3785 0 0 0 1302 0 0 881.603 -102.313 0 0 0 0 0 461.516 0 2290.64 0 0 0 0 0 -780.74 0 -1221.88 0.02 0 265.587 1133.99 -1395.08 0 2258.6 0 0 0 -1645.33 0 1860.64 0 0 0 0 0 0 0 0 
2218.62 1304.9 -1620.3 0 0 0 0 1941.05 739.235 0 0 0 0 0 302.21 0 0 0 0 0 0 -1669.13 0 0 0 979.11 1574.07 1809.82 0 1798.68 0 0 963.393 0 0 0 0 0 0 0.08 2005.91 888.775 289.544 289.392 -924.177 1399.5 0 0 0 0 0 389.34 1384.24 1628.7 -605.106 0 0 0 0 
0 0 0 0 0 0 0 0 0 0 0 -399.411 0 0 0 -2343.59 1636.02 672.399 -611.362 0 0 0 0 0 0 0 -1936.78 0 2328.49 0 2000.11 0 0 2264.4 0 0 1577.12 0 -659.429 -1530.27 0.04 0 -2093.04 0 0 0 0 0 -326.167 155.263 0 1794.11 1323.05 1693.55 0 0 0 0 0 
-2415.01 0 953.78 0 153.89 0 0 -2345.12 0 0 353.938 0 0 0 0 0 0 0 0 0 0 0 0 698.645 0 0 0 0 0 354.396 -2378.69 0 0 1115.83 0 0 0 0 -663.396 183.95 0 0.09 1716.13 0 0 1710.79 0 0 2042.22 -2062.21 -19.303 0 0 0 0 0 0 691.321 0 
0 0 0 848.033 842.997 434.202 -2155.14 0 72.5578 0 279.778 0 0 0 0 0 1847.21 1280.33 2234.64 0 0 2274.16 0 -2157.89 0 0 0 0 0 0 0 -1383.18 0 0 0 0 2001.02 1217.46 -421.384 -326.624 -822.092 438.322 0.08 -2351.07 0 0 0 -2472.99 0 1856.67 0 0 1993.55 0 548.341 0 -156.636 0 0 
284.204 -1360.29 0 0 0 0 -328.761 -1543.7 0 -1580.17 2266.23 0 0 0 1745.43 854.595 0 0 0 0 0 0 0 0 0 0 0 0 0 0 0 0 0 0 0 0 0 0 0 -255.821 0 0 2473.75 0.08 -812.937 1799.45 634.556 0 2303.77 1143.3 -2459.41 0 0 0 0 0 0 0 0 
30.5948 -417.264 -1576.97 0 0 0 0 0 0 -1153.98 0 -348.445 0 2275.54 0 928.449 0 0 0 0 0 0 0 0 0 2055.19 2345.27 0 0 -828.349 0 0 0 0 0 2499.85 0 0 2404.93 854.747 0 0 0 -1597.57 0.08 30.9 0 0 0 0 -2185.96 0 0 681.555 -907.697 2209.01 0 0 0 
0 0 0 0 886.029 0 0 0 0 0 1538.21 0 0 -2163.23 0 2298.88 0 0 0 0 0 578.555 0 0 0 0 0 0 2005.45 0 0 0 0 0 0 0 0 0 0 636.235 0 1502.96 0 -1031.45 -2196.8 0.04 0 0 0 0 -2425.23 0 0 0 0 0 1419.49 0 0 
1525.09 0 0 0 77.5933 0 0 0 2475.89 0 0 0 0 0 1218.38 0 2228.84 1225.24 0 0 -785.47 1067.77 0 1280.48 0 0 0 0 0 0 0 0 0 0 0 0 0 0 0 0 0 0 0 2424.16 0 0 0.08 609.531 0 -2359.61 0 -1506.78 0 0 0 0 0 0 0 
0 0 0 0 2362.06 0 0 -453.734 0 0 94.6837 0 0 0 0 0 0 0 0 0 0 0 0 0 769.143 0 2237.69 -2267.45 1109.27 0 -947.523 0 0 1221.12 0 0 -261.62 0 0 0 0 0 1293.76 0 0 0 813.089 0.09 0 0 -1739.78 0 1290.7 -1362.12 0 0 -32.2733 784.86 0 
0 1270.87 0 0 0 -2279.35 1705.3 0 0 0 1804.18 0 0 0 -2277.06 1182.06 0 0 0 -427.335 0 0 2339.78 0 -2318.11 -886.029 -1129.11 0 0 1402.25 0 0 0 0 0 -1462.98 32.5785 0 1455.05 0 1053.73 957.9 0 -1340.45 0 0 0 0 0.03 916.547 172.964 0 0 234.458 0 0 0 0 0 
0 0 0 0 2063.13 0 0 0 20.0659 0 0 1465.58 0 0 951.033 -120.777 0 0 0 0 0 0 -499.969 0 -1994.46 0 0 0 0 -159.993 2037.8 0 0 0 0 0 0 636.082 0 0 1987.29 -572.604 -1252.1 2144.31 0 0 -845.286 0 1783.12 0.05 0 -1186.48 0 0 0 0 0 0 0 
0 -2467.65 806.986 0 0 0 0 0 0 0 0 0 0 0 0 -74.5415 0 0 0 0 0 -1178.7 0 0 0 0 674.688 0 0 2340.54 -1024.12 0 0 0 0 2242.88 655.766 0 -641.728 0 0 -1432.46 0 384.762 -2228.69 186.697 0 1837.9 -1792.12 0 0.01 0 1862.93 0 -1924.42 0 2468.11 0 0 
0 0 0 -1317.26 0 1724.07 0 -569.094 0 0 787.606 0 1157.34 0 0 0 0 0 0 1415.37 342.799 0 0 1639.53 -2107.68 1049.15 0 0 0 0 0 0 0 0 1173.67 0 0 181.356 0 899.304 140.309 0 0 0 0 0 -1073.72 0 0 767.922 0 0.01 0 2073.05 0 0 0 0 0 
0 0 0 0 0 0 0 1464.96 0 0 1742.68 -2232.35 1040.6 0 0 0 524.537 0 1737.8 0 0 0 0 0 0 314.722 -544.069 1780.98 2046.04 0 0 0 0 0 0 0 0 0 0 -2098.99 -2084.49 0 214.316 0 0 0 0 888.775 0 0 -2362.97 0 0.03 0 13.8096 1611.76 0 0 0 
1782.97 -1324.88 0 2043.6 0 2496.34 0 0 0 748.39 0 0 0 0 0 0 -794.626 0 0 -1984.69 0 991.775 862.987 0 597.629 959.731 0 0 0 0 0 0 0 -1102.56 0 0 2183.98 831.858 0 -587.863 268.792 0 0 0 -388.272 0 0 2445.22 113.3 0 0 1554.69 0 0.04 0 0 0 1327.02 0 
0 0 0 0 -316.401 -747.322 0 662.023 0 0 -578.402 0 0 0 0 0 0 0 0 0 0 -2174.21 0 0 0 0 0 0 0 -1880.78 703.833 0 0 1700.57 0 -694.678 1217.92 2067.86 0 35.1726 0 0 569.399 0 1943.34 0 0 0 0 0 -35.783 0 -281.61 0 0.09 0 0 958.052 0 
2362.82 146.87 0 -1053.73 0 0 0 0 0 -922.498 0 0 -1772.74 0 0 -904.035 0 0 0 0 0 0 -803.323 2295.53 0 0 2303.46 0 0 0 2415.46 -1641.67 498.596 0 1237.91 0 0 0 0 0 0 0 0 0 -1554.99 0 0 0 0 0 0 0 2392.57 0 0 0.03 0 2248.83 0 
0 0 0 2023.61 0 -2337.95 0 715.888 0 70.4215 0 0 0 0 0 -878.094 0 0 0 0 -1966.69 0 0 0 0 0 934.095 0 0 0 484.1 0 0 0 0 0 0 -463.195 0 0 0 0 455.565 0 0 1268.12 0 2377.93 0 0 2314.14 0 0 0 0 0 0.06 0 2213.13 
0 0 -1190.91 1665.17 805.307 516.144 0 0 0 -1208.15 0 0 0 1236.99 2055.8 0 0 -1131.7 0 0 -123.371 1872.08 0 0 0 0 0 0 0 1745.89 0 0 0 0 0 0 0 0 0 0 0 -794.931 0 0 0 0 0 -832.163 0 0 0 0 0 1892.99 -488.067 981.857 0 0.08 0 
0 0 0 0 1665.01 2268.67 0 0 0 0 345.851 0 0 0 0 0 0 0 0 0 0 0 0 0 0 0 0 0 0 0 0 -284.967 0 0 0 0 0 0 0 0 0 0 0 0 0 0 0 0 0 0 0 0 0 0 0 0 -223.472 0 0.03 
