*Vertices 56
*Matrix 
0.04 0 0 0 0 0 0 0 0 2283.01 -9.68963 0 0 40.2081 0 0 983.535 0 0 0 0 387.204 0 0 -993.149 1964.71 0 -803.781 -1601.99 0 705.664 0 0 0 0 0 0 0 0 0 0 0 0 0 0 0 0 0 0 0 0 0 0 0 0 0 
0 0.09 0 2198.63 0 0 0 1533.78 0 0 1261.56 0 0 918.531 0 -172.658 0 -1649.6 0 0 2371.21 0 0 0 0 0 0 0 0 0 509.278 0 0 0 -1625.03 0 -2171.62 1497.92 0 0 0 0 0 0 0 1110.95 0 0 0 0 0 0 0 0 0 0 
0 0 0 0 -679.418 0 0 0 0 2111.35 0 2411.8 0 -702.765 -884.045 0 0 1203.57 -1109.88 2225.79 2349.39 2041.31 0 0 1411.25 -1067.92 0 0 -2278.59 0 0 -88.7326 0 0 0 0 0 0 260.552 0 0 0 1146.35 0 0 0 0 0 0 1948.99 0 0 365.078 0 2118.37 0 
0 967.055 0 0.05 0 0 0 0 0 0 -662.633 0 0 866.344 1792.12 0 0 1314.36 0 0 0 0 0 -2238 2467.8 0 1427.58 1289.64 0 0 0 0 464.568 0 0 0 0 0 0 0 0 0 0 0 0 0 -362.941 0 0 0 0 0 0 0 0 0 
0 0 1690.19 0 0.02 0 1766.95 0 935.621 0 1027.02 0 2362.21 0 1486.48 0 0 0 0 0 0 0 0 0 0 0 0 0 0 -580.691 0 1251.49 0 0 0 0 0 0 1937.24 0 0 0 0 0 0 0 0 0 0 0 0 0 0 0 0 0 
0 0 0 0 0 0.02 0 1661.66 0 0 0 0 0 0 0 0 -786.843 0 -2019.79 0 0 -132.221 0 1163.44 0 0 2367.24 0 1342.89 0 0 0 -1213.95 0 0 0 0 0 0 -80.9503 0 -478.454 0 0 0 0 0 0 0 0 0 0 0 0 0 0 
0 0 0 0 1314.51 0 0 0 0 2010.79 0 0 0 0 0 0 0 0 0 0 0 0 0 0 0 441.832 0 0 0 0 0 1723.3 1727.42 1251.64 0 0 0 0 0 0 0 0 0 0 0 0 0 0 0 0 0 0 -2300.87 0 0 0 
0 324.946 0 0 0 1348.23 0 0.09 0 1139.18 0 0 1200.37 0 2444.91 -2027.57 0 998.794 0 0 0 -1114.15 172.964 0 0 2208.55 0 1651.74 0 201.956 0 0 0 0 0 1624.73 0 0 0 0 0 0 0 0 0 0 2102.95 0 0 0 0 0 0 0 0 0 
0 0 0 0 -1377.83 0 0 0 0.05 621.738 1553.77 2475.43 0 0 0 0 -821.482 0 0 0 0 1356.62 0 -1214.56 0 628.452 0 0 2208.24 0 0 0 0 0 -2059.16 0 0 0 0 0 0 0 0 0 0 0 0 0 0 0 0 0 0 0 0 -1104.54 
956.374 0 588.015 0 0 0 2401.73 -697.119 -1892.07 0.04 0 -275.048 -502.716 0 0 0 1022.9 0 0 0 0 0 0 0 0 0 -243.309 0 0 0 0 0 0 0 0 0 0 0 0 0 0 0 0 0 0 0 0 1371.43 0 0 -1161.61 0 0 0 0 0 
-1307.95 -1273.31 0 312.891 369.045 0 0 0 549.257 0 0.09 0 0 0 0 0 939.894 0 0 1407.13 0 0 1300.47 -1870.56 0 -253.227 0 0 0 0 1651.89 0 0 0 0 1967.6 0 0 0 0 0 0 0 0 0 0 0 0 0 0 0 0 0 17.4718 0 0 
0 0 -1950.51 0 0 0 0 0 1725.14 170.675 0 0.08 2243.64 0 0 0 0 0 2314.29 849.712 0 0 0 0 0 0 0 0 0 0 0 0 -341.884 0 0 0 0 0 0 0 1079.36 0 1028.4 0 0 104.755 0 2251.88 -398.038 0 0 0 0 0 0 0 
0 0 0 0 1822.34 0 0 1536.68 0 2236.32 0 654.241 0.06 0 0 374.386 0 0 0 926.923 -1190.45 0 0 0 0 634.404 0 0 -1344.87 0 1653.42 0 0 431.455 0 0 0 0 2383.88 0 0 -188.833 0 0 0 0 0 0 0 0 0 -2196.95 0 0 0 0 
1129.72 1474.43 1923.51 41.4289 0 0 0 0 0 0 0 0 0 0.07 826.67 0 0 2195.43 0 993.912 969.039 0 0 0 0 0 0 0 114.521 0 590.609 382.321 0 0 0 0 1426.36 0 0 0 0 0 0 0 0 0 0 0 0 0 532.167 0 0 0 0 0 
0 0 1679.51 349.208 319.147 0 0 159.383 0 0 0 0 0 2248.22 0.06 -2192.37 0 2313.38 2346.49 0 0 0 0 0 -2169.64 2461.39 0 0 0 0 62.3341 0 0 0 1771.07 2207.33 0 0 0 0 0 0 0 0 0 0 0 0 0 0 -64.6229 0 729.621 0 0 0 
0 1645.79 0 0 0 0 0 1855.14 0 0 0 0 1319.54 0 -1698.13 0.03 0 -77.7459 0 2300.1 1171.38 0 0 0 -710.242 0 0 0 0 0 0 0 54.3992 0 0 0 0 0 0 0 0 0 0 0 0 0 0 0 0 0 0 0 0 0 0 -1309.93 
902.051 0 0 0 0 1978.9 0 0 2175.89 246.666 -295.038 0 0 0 0 0 0.08 0 0 0 0 0 0 981.552 403.836 -1519.29 0 0 0 0 0 0 0 0 0 0 0 0 0 -2123.71 0 -99.2615 0 0 0 0 0 433.592 0 0 0 0 0 0 0 0 
0 2072.89 17.9296 758.156 0 0 0 1447.87 0 0 0 0 0 -1453.06 973.769 -665.075 0 0.03 0 -1776.25 0 0 0 2031.85 0 0 0 0 0 -1432 0 0 0 0 0 0 702.307 0 0 2274.93 -2070.15 0 0 0 0 0 0 0 0 0 0 0 0 0 0 0 
0 0 1136.89 0 0 450.682 0 0 0 0 0 308.008 0 0 1969.28 0 0 0 0.04 0 0 0 2207.48 0 0 -1615.12 0 2415.62 0 831.858 0 571.993 0 0 0 0 -1452.76 0 0 0 0 0 1632.66 0 0 0 0 0 -2056.72 0 0 0 0 0 0 0 
0 0 924.329 0 0 0 0 0 0 0 397.885 257.653 388.424 -427.488 0 -2101.73 0 1836.99 0 0.01 0 1237.6 0 0 0 0 0 1548.13 1121.17 1213.95 0 0 0 0 0 0 0 0 0 0 0 0 -783.944 0 0 0 0 965.377 0 0 0 0 0 0 0 0 
0 2435.15 1628.54 0 0 0 0 0 0 0 0 0 -1163.14 -2033.07 0 186.239 0 0 0 0 0.06 995.285 0 0 0 0 0 -802.255 0 0 0 0 0 0 0 0 0 0 0 0 0 0 0 0 1012.68 0 0 -1281.7 0 0 0 0 0 0 0 0 
400.174 0 -636.692 0 0 1702.7 0 -648.137 -615.94 0 0 0 0 0 0 0 0 0 0 -1694.16 2277.37 0.09 0 0 0 2057.48 1492.43 0 0 2111.96 0 0 0 0 0 0 0 0 0 0 0 -407.193 0 0 0 0 0 0 -2037.64 0 0 0 0 0 0 0 
0 0 0 0 0 0 0 1461.76 0 0 2149.95 0 0 0 0 0 0 0 -2180.01 0 0 0 0.01 1660.13 0 0 0 0 0 -93.0052 0 0 0 0 0 0 -847.575 0 0 0 0 0 0 0 0 0 1311.15 0 0 0 0 0 0 0 0 0 
0 0 0 334.712 0 -320.215 0 0 862.072 0 15.3356 0 0 0 0 0 288.324 778.146 0 0 0 0 2225.64 0 0 0 0 0 0 2167.5 0 1010.39 0 0 280.084 0 0 -682.928 0 0 0 0 0 0 0 -831.706 0 0 0 0 0 0 -393.307 0 0 0 
-95.9044 0 1823.86 1922.59 0 0 0 0 0 0 0 0 0 0 2274.01 -1449.86 -872.6 0 0 0 0 0 0 0 0.04 0 1375.39 0 6.63778 0 0 0 -1947.92 0 0 0 0 0 0 0 0 157.399 0 0 0 0 0 0 0 0 0 0 0 0 -482.116 0 
-928.755 0 -1008.87 0 0 0 86.9015 -852.306 -352.87 0 677.129 0 1750.62 0 1686.38 0 467.315 0 -2360.84 0 0 -771.737 0 0 0 0.02 0 1443.3 0 0 1482.67 0 0 0 0 0 -1461.46 0 0 491.729 0 0 -567.721 1593.75 0 0 0 0 0 0 0 0 0 0 0 0 
0 0 0 1862.01 0 1475.49 0 0 0 -2112.72 0 0 0 0 0 0 0 0 0 0 0 1476.87 0 0 1477.17 0 0 -1321.38 1497.01 0 0 0 0 0 0 0 0 0 0 0 0 0 0 0 0 1156.12 0 0 0 0 0 0 0 0 0 0 
-1488.46 0 0 1017.41 0 0 0 -1631.75 0 0 0 0 0 0 0 0 0 0 2036.58 2200.16 817.82 0 0 0 0 -458.159 546.205 0.01 0 0 703.223 0 0 -1060.44 0 0 0 0 0 0 2039.63 0 0 0 0 0 0 0 0 0 0 0 0 0 0 -1216.09 
938.368 0 820.719 0 0 -1533.17 0 0 1029.77 0 0 0 1842.48 2486.72 0 0 0 0 0 -1461.46 0 0 0 0 543.306 0 1344.42 0 0.04 -1045.03 0 0 0 0 0 0 0 0 0 0 0 0 0 -1510.28 0 749.001 0 0 0 0 1412.63 0 -1418.12 0 0 0 
0 0 0 0 -1819.9 0 0 -437.101 0 0 0 0 0 0 0 0 0 -1441.92 914.716 -1611 0 -187.155 1780.37 2456.66 0 0 0 0 2276.76 0.03 0 0 0 113.91 0 0 0 0 0 0 0 0 0 0 0 0 0 0 0 0 0 0 0 0 0 0 
2427.37 1319.7 0 0 0 0 0 0 0 0 -324.03 0 116.047 273.98 -2353.21 0 0 0 0 0 0 0 0 0 0 -120.472 0 1120.41 0 0 0.08 0 0 0 0 0 0 0 0 0 0 0 0 0 0 0 -893.963 0 0 0 0 0 0 0 0 2438.05 
0 0 1509.98 0 960.036 0 1500.82 0 0 0 0 0 0 -570.009 0 0 0 0 1093.4 0 0 0 0 -1028.7 0 0 0 0 0 0 0 0.05 0 0 0 0 0 0 0 1907.79 0 0 0 0 0 0 0 0 0 -1085.77 0 0 0 0 0 0 
0 0 0 1833.17 0 2117.6 -511.414 0 0 0 0 -550.02 0 0 0 234.916 0 0 0 0 0 0 0 0 1669.29 0 0 0 0 0 0 0 0.07 0 0 490.814 0 0 0 0 0 0 0 986.892 -165.334 0 0 0 -1064.56 0 0 0 0 0 0 0 
0 0 0 0 0 0 -27.0852 0 0 0 0 0 1469.7 0 0 0 0 0 0 0 0 0 0 0 0 0 0 2219.84 0 1153.83 0 0 0 0.09 0 121.235 0 -30.7474 0 0 0 -1882.46 0 0 0 0 0 0 843.608 0 -347.682 0 0 0 0 0 
0 -1182.52 0 0 0 0 0 0 1336.33 0 0 0 0 0 -870.312 0 0 0 0 0 0 0 0 1560.79 0 0 0 0 0 0 0 0 0 0 0.04 0 0 0 1012.68 2057.79 0 0 0 0 0 0 -748.238 0 0 -561.617 0 1695.68 0 -1435.67 -1382.72 0 
0 0 0 0 0 0 0 1688.51 0 0 1895.12 0 0 0 -2312.31 0 0 0 0 0 0 0 0 0 0 0 0 0 0 0 0 0 584.353 -978.957 0 0.08 0 0 0 0 0 0 0 0 0 0 0 2382.2 0 0 0 0 2247.31 0 0 0 
0 -627.995 0 0 0 0 0 0 0 0 0 0 0 -360.042 0 0 0 2423.7 1409.88 0 0 0 2201.07 0 0 2144.31 0 0 0 0 0 0 0 0 0 0 0.01 0 0 0 0 0 0 -2454.68 0 0 0 0 0 2453.15 0 0 0 0 0 0 
0 -708.563 0 0 0 0 0 0 0 0 0 0 0 0 0 0 0 0 0 0 0 0 0 453.887 0 0 0 0 0 0 0 0 0 1568.58 0 0 0 0 0 0 0 0 0 0 0 0 0 0 0 0 2400.97 659.886 0 0 0 0 
0 0 1964.55 0 2301.02 0 0 0 0 0 0 0 1372.8 0 0 0 0 0 0 0 0 0 0 0 0 0 0 0 0 0 0 0 0 0 -87.9696 0 0 0 0.04 0 0 0 0 0 0 0 -711.615 53.1785 0 2142.63 0 0 0 -103.687 0 0 
0 0 0 0 0 118.488 0 0 0 0 0 0 0 0 0 0 307.398 343.257 0 0 0 0 0 0 0 -891.827 0 0 0 0 0 2429.96 0 0 2109.52 0 0 0 0 0.01 0 0 0 0 0 0 0 0 0 0 0 -1677.68 0 -2239.68 0 0 
0 0 0 0 0 0 0 0 0 0 0 1673.86 0 0 0 0 0 -657.598 0 0 0 0 0 0 0 0 0 1103.17 0 0 0 0 0 0 0 0 0 0 0 0 0.09 0 0 0 1246.45 0 0 0 -573.061 0 -1071.12 0 0 0 0 0 
0 0 0 0 0 -127.491 0 0 0 0 0 0 -79.8822 0 0 0 -2126.15 0 0 0 0 1743.75 0 0 -539.033 0 0 0 0 0 0 0 0 1703.16 0 0 0 0 0 0 0 0.02 0 0 0 0 146.413 0 0 0 0 0 0 0 0 0 
0 0 1568.12 0 0 0 0 0 0 0 0 562.075 0 0 0 0 0 0 2024.06 2365.57 0 0 0 0 0 1194.42 0 0 0 0 0 0 0 0 0 0 0 0 0 0 0 0 0.04 0 0 0 0 0 0 0 0 0 0 -2351.07 0 0 
0 0 0 0 0 0 0 0 0 0 0 0 0 0 0 0 0 0 0 0 0 0 0 0 0 2244.1 0 0 2477.72 0 0 0 -1165.88 0 0 0 -36.5459 0 0 0 0 0 0 0.01 0 0 0 0 712.836 0 -1722.08 0 0 0 0 0 
0 0 0 0 0 0 0 0 0 0 0 0 0 0 0 0 0 0 0 0 1952.65 0 0 0 0 0 0 0 0 0 0 0 1979.96 0 0 0 0 0 0 0 -858.409 0 0 0 0.08 0 0 0 0 0 0 0 0 0 0 0 
0 1807.23 0 0 0 0 0 0 0 0 0 -1539.58 0 0 0 0 0 0 0 0 0 0 0 75.7622 0 0 1594.67 0 889.081 0 0 0 0 0 0 0 0 0 0 0 0 0 0 0 0 0.09 0 0 0 0 0 0 0 1885.51 1826 0 
0 0 0 1654.33 0 0 0 298.7 0 0 0 0 0 0 0 0 0 0 0 0 0 0 -1348.84 0 0 0 0 0 0 0 323.573 0 0 0 1363.8 0 0 0 2160.48 0 0 1676.76 0 0 0 0 0.01 0 0 0 0 0 0 0 0 223.93 
0 0 0 0 0 0 0 0 0 1583.53 0 388.272 0 0 0 0 -235.679 0 0 793.252 -756.478 0 0 0 0 0 0 0 0 0 0 0 0 0 0 2404.17 0 0 -1872.23 0 0 0 0 0 0 0 0 0.01 0 0 0 0 0 0 0 0 
0 0 0 0 0 0 0 0 0 0 0 682.775 0 0 0 0 0 0 -630.284 0 0 57.9089 0 0 0 0 0 0 0 0 0 0 -2159.41 258.415 0 0 0 0 0 0 2114.7 0 0 2354.58 0 0 0 0 0.06 0 0 -901.746 -394.375 -1647.16 0 1061.05 
0 0 -525.91 0 0 0 0 0 0 0 0 0 0 0 0 0 0 0 0 0 0 0 0 0 0 0 0 0 0 0 0 1144.22 0 0 2118.67 0 1257.13 0 -1433.68 0 0 0 0 0 0 0 0 0 0 0.02 0 0 -1009.17 0 0 0 
0 0 0 0 0 0 0 0 0 -498.444 0 0 0 2407.22 1530.58 0 0 0 0 0 0 0 0 0 0 0 0 0 1133.84 0 0 0 0 1327.33 0 0 0 1806.31 0 0 -2088.31 0 0 362.331 0 0 0 0 0 0 0.04 0 0 0 0 0 
0 0 0 0 0 0 0 0 0 0 0 0 -1235.16 0 0 0 0 0 0 0 0 0 0 0 0 0 0 0 0 0 0 0 0 0 1840.04 0 0 -806.375 0 1418.58 0 0 0 0 0 0 0 0 1000.32 0 0 0.08 0 0 0 0 
0 0 1290.7 0 0 0 -231.407 0 0 0 0 0 0 0 1375.24 0 0 0 0 0 0 0 0 553.682 0 0 0 0 1950.06 0 0 0 0 0 0 -2248.68 0 0 0 0 0 0 0 0 0 0 0 0 1152.3 1147.27 0 0 0.09 0 0 0 
0 0 0 0 0 0 0 0 0 0 804.544 0 0 0 0 0 0 0 0 0 0 0 0 0 0 0 0 0 0 0 0 0 0 0 1257.59 0 0 0 -2380.21 -2453.31 0 0 2166.59 0 0 1596.8 0 0 1184.19 0 0 0 0 0.05 0 0 
0 0 1292.69 0 0 0 0 0 0 0 0 0 0 0 0 0 0 0 0 0 0 0 0 0 2344.97 0 0 0 0 0 0 0 0 0 1604.43 0 0 0 0 0 0 0 0 0 0 -738.929 0 0 0 0 0 0 0 0 0.02 0 
0 0 0 0 0 0 0 0 -1073.26 0 0 0 0 0 0 883.892 0 0 0 0 0 0 0 0 0 0 0 -368.435 0 0 1633.27 0 0 0 0 0 0 0 0 0 0 0 0 0 0 0 1368.68 0 -118.03 0 0 0 0 0 0 0 
