*Vertices 45
*Matrix 
0.08 0 0 1077.23 0 0 1760.84 -2456.51 549.867 0 0 1934.95 0 -1845.07 0 0 0 0 44.0229 0 2085.41 0 2318.26 104.907 0 0 1664.1 0 123.981 0 0 0 0 0 0 0 0 0 0 0 0 1251.49 0 0 0 
0 0.02 0 0 0 0 -1815.32 0 0 0 0 111.774 0 0 0 0 0 0 0 1882.61 0 0 0 0 0 1230.28 0 220.42 0 0 1618.02 2329.25 0 0 0 0 0 -2386.01 0 0 0 0 0 0 0 
0 0 0.05 0 0 0 -83.5444 0 -657.14 595.645 0 0 0 0 0 0 0 0 1126.82 0 0 0 0 -1931.14 0 0 0 0 0 0 1819.44 0 0 0 2474.06 0 -1439.18 0 1335.11 0 0 -661.718 1679.36 0 497.528 
621.586 0 0 0.01 2438.51 0 1634.95 0 0 0 0 864.208 0 0 0 0 0 -276.421 0 0 0 918.226 0 2288.51 0 0 0 0 0 0 0 0 0 0 0 0 -612.125 0 0 0 0 2059.16 0 0 0 
0 0 0 1356.01 0.04 0 0 0 0 0 508.362 0 2451.32 0 1046.25 0 0 2224.11 0 0 0 0 0 -1939.68 0 0 0 0 555.818 0 935.316 0 0 0 -398.038 0 -107.349 -1196.4 0 0 -1036.94 0 0 0 0 
0 0 0 0 0 0.03 0 1126.67 0 0 0 0 983.078 0 -209.738 2081.29 0 0 -1802.8 0 0 0 0 0 0 0 0 2414.85 0 0 0 0 2408.29 0 1140.71 1285.36 0 1844.61 0 1847.21 0 0 0 -522.095 0 
1488.31 -643.406 1456.72 2191.15 0 0 0.08 0 0 0 0 0 0 0 1132.16 0 0 0 -2038.41 0 0 0 0 0 0 1009.02 0 0 0 -281.762 0 -2090.14 496.612 0 0 0 0 0 1990.8 0 0 2136.52 -1510.59 0 0 
-2018.11 0 0 0 0 -1370.2 0 0.01 0 0 2399.75 0 0 0 0 0 -1006.58 0 -387.967 0 844.066 0 -105.67 0 1192.13 0 0 0 0 0 0 1665.01 0 1010.7 438.322 1705.45 0 0 0 0 0 0 0 0 545.289 
2340.08 0 209.281 0 0 0 0 0 0.06 -499.817 1560.64 -1030.99 603.275 1586.12 0 -64.1652 1489.23 0 0 0 0 759.377 0 0 1642.43 -1516.85 -812.479 0 0 -16.0985 -2324.82 1570.25 0 0 0 0 0 0 0 1221.73 0 0 0 0 0 
0 0 1583.99 0 0 0 0 0 -41.8867 0.03 -1480.99 0 0 0 65.0807 1824.47 0 0 168.386 326.014 0 0 0 0 0 2004.99 0 -266.503 693.762 0 0 0 0 0 814.768 0 -437.864 0 -102.161 0 321.894 0 0 1471.83 0 
0 0 0 0 -1437.04 0 0 629.368 555.818 1764.2 0.03 0 0 0 0 0 -2291.56 0 0 0 0 202.719 0 2030.02 0 0 0 0 854.595 0 0 0 0 1495.48 0 0 0 -58.8244 -20.0659 -1677.68 0 -330.134 0 0 0 
-1209.98 -689.184 0 -945.082 0 0 0 0 1774.58 0 0 0.08 0 1119.8 673.162 363.094 0 449.461 0 -500.275 0 0 2328.94 0 0 0 0 1596.35 0 -2454.68 0 0 -64.0126 0 0 0 0 0 -276.574 0 0 898.236 0 0 0 
0 0 0 0 2286.98 245.903 0 0 1555.3 0 0 0 0.05 -1761.3 0 0 0 0 -676.214 0 0 15.0304 0 0 0 0 0 0 0 0 0 -1827.98 0 0 0 0 715.278 0 0 0 0 -199.362 0 0 0 
1235.62 0 0 0 0 0 0 0 -517.06 0 0 -2453.92 646.916 0.08 0 1358.76 0 0 1968.21 0 0 0 -10.1474 0 -1709.88 0 0 0 2120.04 0 641.881 1246.15 0 306.94 0 0 0 0 -1211.2 0 -2193.29 2287.74 0 -1393.25 0 
0 0 0 0 -1845.38 -2097.92 2423.25 0 0 1487.09 0 -1572.08 0 0 0.05 0 0 0 0 0 0 0 0 0 0 0 0 0 0 0 0 0 788.675 0 0 0 -2234.95 0 0 1959.06 2163.38 0 630.284 0 0 
0 0 0 0 0 90.4111 0 0 1134.14 2424.16 0 -965.377 0 1795.79 0 0.04 0 1692.79 -62.9444 0 0 0 0 0 0 0 2285.45 -1342.28 0 0 0 -927.076 0 1426.82 2444.15 0 0 0 0 -1052.35 1308.56 467.315 0 0 -215.842 
0 0 0 0 0 0 0 1341.21 -1550.42 0 1549.5 0 0 0 0 0 0.05 0 0 0 0 0 0 1640.14 1367.31 0 0 0 0 0 0 0 0 2196.34 0 0 0 0 646.458 0 0 -1726.2 0 0 0 
0 0 0 1893.14 1899.85 0 0 0 0 0 0 1936.48 0 0 0 808.206 0 0.04 0 0 0 1815.16 0 1672.8 1995.22 0 0 0 0 0 0 0 -652.715 0 0 310.144 0 -723.365 0 -1193.35 0 0 0 0 0 
-322.657 0 -362.789 0 0 2023.91 2007.13 2348.02 0 -949.355 0 0 1555.6 -522.858 0 603.58 0 0 0 0 0 0 0 687.964 0 0 0 0 0 0 0 0 -1265.07 249.26 0 -1084.55 0 0 -2157.89 0 0 0 0 0 0 
0 1565.07 0 0 0 0 0 0 0 1557.44 0 2443.54 0 0 0 0 0 0 0 0 2298.12 0 0 0 0 0 241.478 0 0 0 0 -810.953 830.943 0 2010.64 0 0 0 -395.138 0 -2066.64 0 0 0 1731.09 
1954.02 0 0 0 0 0 0 -88.2748 0 0 0 0 0 0 0 0 0 0 0 1599.7 0.03 0 1065.63 0 788.217 0 0 0 0 0 1822.95 0 0 -1883.53 -1088.21 515.229 -1071.12 0 0 0 1486.33 0 145.802 0 0 
0 0 0 -1297.88 0 0 0 0 2285.91 0 899.304 0 1422.09 0 0 0 0 2402.8 0 0 0 0.03 0 0 0 0 0 0 343.867 0 0 0 0 0 0 0 0 917.31 0 0 0 0 0 0 0 
1326.87 0 0 0 0 0 0 192.648 0 0 0 1669.44 0 2475.28 0 0 0 0 0 0 -9.23185 0 0.04 2365.26 0 0 0 0 1894.97 0 1650.98 1016.8 0 0 0 2075.79 0 0 0 -1907.03 0 0 0 181.967 0 
-559.633 0 431.15 246.208 1758.86 0 0 0 0 0 1930.68 0 0 0 0 0 2471.77 -1658.76 867.412 0 0 0 77.8985 0.01 0 1798.84 0 0 0 0 0 -839.03 0 0 0 0 0 0 1948.99 0 0 0 0 0 0 
0 0 0 0 0 0 0 2040.09 -718.177 0 0 0 0 -1950.82 0 0 1589.18 2473.91 0 0 -1559.27 0 0 0 0.04 0 839.488 0 0 0 -2154.07 1134.3 250.786 0 0 -765.023 0 0 989.944 0 0 0 0 0 0 
0 -454.802 0 0 0 0 -88.4274 0 177.236 1576.2 0 0 0 0 0 0 0 0 0 0 0 0 0 -1758.55 0 0.04 0 2400.97 0 0 1941.21 0 0 0 1833.78 1821.27 0 0 0 0 0 -572.146 0 0 0 
1182.06 0 0 0 0 0 0 0 -1661.05 0 0 0 0 0 0 1952.04 0 0 0 -55.7726 0 0 0 0 507.294 0 0.03 -848.643 0 0 0 2233.12 0 -1257.9 0 2423.55 2162.47 0 8.31629 0 483.947 -1447.26 1858.2 0 0 
0 1389.13 0 0 0 -1055.41 0 0 0 -1970.96 0 1564.3 0 0 0 298.242 0 0 0 0 0 0 0 0 0 513.855 -2158.65 0.04 299.615 0 338.984 -205.771 1488.62 1231.35 0 0 1244.32 0 2334.74 2026.51 -2400.36 0 1115.99 0 0 
-490.967 0 0 0 -46.7696 0 0 0 0 -1065.48 -1339.99 0 0 133.595 0 0 0 0 0 0 0 2300.41 116.047 0 0 0 0 1113.7 0.05 1948.84 0 0 0 0 31.0526 0 0 0 0 0 0 0 0 0 0 
0 0 0 0 0 0 1448.33 0 1986.22 0 0 1582.77 0 0 0 0 0 0 0 0 0 0 0 0 0 0 0 0 192.19 0.02 -2075.03 945.997 2315.21 0 -1987.14 0 0 0 0 0 0 0 0 0 0 
0 -1056.17 -1762.67 0 310.45 0 0 0 575.198 0 0 0 0 1855.3 0 0 0 0 0 0 1086.38 0 349.055 0 1581.09 1338.77 0 -1169.39 0 -1939.38 0.04 0 0 0 0 -326.014 1235.92 961.562 0 0 0 0 -1923.51 0 0 
0 2223.65 0 0 0 0 1044.11 -2067.55 -2346.19 0 0 0 2333.83 -402.615 0 938.978 0 0 0 -1182.21 0 0 1050.98 1242.18 234.458 0 1451.54 1901.07 0 -2219.53 0 0.03 0 1292.99 1012.53 0 0 0 0 0 0 0 0 0 0 
0 0 0 0 0 868.938 -2484.13 0 0 0 0 1913.59 0 0 -500.58 0 0 714.667 28.9163 -935.011 0 0 0 0 -2190.85 0 0 933.79 0 2083.42 0 0 0.01 2063.13 -1420.41 2483.98 0 299.463 -797.678 0 0 0 0 0 0 
0 0 0 0 0 0 0 471.282 0 0 761.208 0 0 1453.67 0 -2362.67 -1816.23 0 -1954.48 0 2489.93 0 0 0 0 0 -597.324 513.092 0 0 0 -15.7933 2487.79 0.06 0 -1957.38 0 0 0 976.363 2406.16 0 0 0 0 
0 0 -548.036 0 738.319 1013.6 0 -642.643 0 -440.764 0 0 0 0 0 -2378.84 0 0 0 1463.74 368.282 0 0 0 0 -2405.7 0 0 -10.3 157.399 0 2204.89 2409.51 0 0.09 0 1455.66 0 2494.66 1234.09 0 0 0 0 0 
0 0 0 0 0 883.129 0 -2374.57 0 0 0 0 0 0 0 0 0 -163.198 -1074.94 0 -582.064 0 -844.371 0 -728.095 -234.764 935.163 0 0 0 1928.85 0 1414.76 608.921 0 0.01 0 0 0 0 0 1708.96 0 0 0 
0 0 -992.233 -597.476 -1019.09 0 0 0 0 1163.29 0 0 1157.34 0 1217.92 0 0 0 0 0 -383.694 0 0 0 0 0 835.215 1411.25 0 0 1031.3 0 0 0 1702.4 0 0 0 85.0703 -808.512 0 532.319 0 1157.8 58.2141 
0 1678.9 0 0 1376.31 413.144 0 0 0 0 465.178 0 0 0 0 0 0 1300.78 0 0 0 -2212.21 0 0 0 0 0 0 0 0 2445.37 0 -1482.06 0 0 0 0 0.01 0 -1791.67 0 2244.87 0 0 0 
0 0 -1518.98 0 0 0 1639.68 0 0 -108.112 -3.58592 -964.003 0 2459.11 0 0 1798.23 0 -383.389 -1750.47 0 0 0 356.227 -507.294 0 1232.11 -195.547 0 0 0 0 1048.39 0 1288.11 0 1446.81 0 0.02 0 -1569.19 0 0 0 0 
0 0 0 0 0 1603.67 0 0 -2336.57 0 -2448.27 0 0 0 1001.54 -179.525 0 754.189 0 0 0 0 -2092.88 0 0 0 0 2451.32 0 0 0 0 0 1690.34 1488.77 0 -1733.99 2470.7 0 0.07 0 363.704 0 0 0 
0 0 0 0 262.535 0 0 0 0 1490.75 0 0 0 -1183.13 2309.87 -854.747 0 0 0 1824.47 -1793.34 0 0 0 0 0 -1786.48 903.729 0 0 0 0 0 144.429 0 0 0 0 1200.06 0 0.04 0 0 0 0 
-2071.52 0 -1529.82 -195.395 0 0 -1930.07 0 0 0 -1325.5 2208.24 968.429 -1190.6 0 2084.64 2120.81 0 0 0 0 0 0 0 0 1439.18 1875.74 0 0 0 0 0 0 0 0 -857.952 271.386 1659.67 0 1393.55 0 0.04 0 0 0 
0 0 -1600.16 0 0 0 1813.33 0 0 0 0 0 0 0 1093.25 0 0 0 0 0 -217.368 0 0 0 0 0 -341.426 2464.45 0 0 1114.46 0 0 0 0 0 0 0 0 0 0 0 0.05 0 0 
0 0 0 0 0 277.032 0 0 0 1836.99 0 0 0 -972.243 0 0 0 0 0 0 0 0 2261.5 0 0 0 0 0 0 0 0 0 0 0 0 0 -107.654 0 0 0 0 0 0 0.05 -280.541 
0 0 73.9311 0 0 0 0 -1906.72 0 0 0 0 0 0 0 2299.49 0 0 0 -1360.13 0 0 0 0 0 0 0 0 0 0 0 0 0 0 0 0 2048.78 0 0 0 0 0 0 -1153.22 0.02 
