*Vertices 49
*Matrix 
0.04 0 0 -890.454 0 0 0 1169.24 0 0 0 0 959.731 840.098 0 -120.472 0 0 0 575.503 0 0 0 0 0 0 0 2385.71 0 0 0 0 0 0 1334.35 0 751.595 0 0 0 0 0 0 0 0 1686.38 -2430.88 0 0 
0 0.06 1609.32 -399.411 0 8.31629 0 0 0 1896.95 0 131.916 -918.836 0 0 0 -2292.02 0 0 871.227 0 0 0 0 0 0 1569.34 0 2177.72 1180.99 0 0 0 0 0 0 0 0 0 0 0 -329.676 0 1620.46 1925.18 0 0 0 0 
0 1213.19 0.02 0 0 0 0 1197.93 0 2369.84 0 0 -376.827 0 0 0 -860.698 0 0 0 0 0 -2113.03 0 633.183 0 0 0 0 0 0 0 0 -2363.12 0 0 0 0 0 0 0 0 0 0 0 0 0 0 0 
1077.84 -274.895 0 0.01 -302.973 0 -1407.59 0 0 0 1527.38 0 1385.62 0 -2475.89 0 0 1623.36 0 0 0 0 0 0 0 0 0 0 -1010.09 1094.78 0 0 2370.6 0 0 0 0 0 -2126.61 0 0 0 0 0 0 0 0 0 -808.054 
0 0 0 493.103 0.06 11.063 0 0 1160.7 0 0 0 0 0 0 0 0 180.898 0 0 0 0 0 0 0 -1171.99 0 0 559.175 -647.832 2393.49 0 0 0 0 -155.568 0 0 0 0 0 0 330.744 0 0 0 0 0 0 
0 580.081 0 0 702.918 0.05 323.42 0 2215.26 0 0 0 0 0 0 0 0 0 0 -108.417 0 0 0 727.18 0 -329.676 0 0 0 0 0 0 0 0 0 0 0 0 824.686 0 0 0 -1727.12 -2214.8 0 0 0 2350.61 0 
0 0 0 -1710.79 0 1775.49 0.01 0 0 0 0 0 769.295 0 0 0 0 0 1491.36 0 0 0 0 0 0 1480.83 0 0 0 0 0 0 0 0 0 0 0 0 0 0 0 0 0 0 0 0 0 1414.61 0 
2023.3 0 -1050.68 0 0 0 0 0.06 0 391.934 0 148.091 1361.35 0 1219.9 0 2391.96 0 0 1013.6 0 0 2151.94 1792.58 0 0 0 0 0 0 0 0 0 1007.64 0 0 0 0 0 0 0 0 0 0 0 -1013.44 0 0 0 
0 0 0 0 588.931 2042.68 0 0 0.05 0 0 -1319.85 0 0 0 0 0 0 0 0 2445.98 0 0 0 0 0 1251.79 0 0 0 0 0 1656.77 0 0 0 0 0 0 0 1522.03 0 0 0 0 0 0 0 0 
0 -2107.07 145.802 0 0 0 0 2335.2 0 0.08 -1138.57 0 1053.27 -1876.05 0 0 512.94 0 0 0 0 0 0 0 0 0 0 0 0 0 0 1674.78 0 0 0 0 0 0 0 0 0 0 0 -685.369 0 0 0 0 1498.99 
0 0 0 -150.533 0 0 0 0 0 880.688 0.06 -609.989 0 1360.74 0 0 0 0 2271.57 0 0 1148.49 0 -1161.76 0 -554.75 0 0 0 0 0 260.094 0 0 0 -1811.35 0 0 0 0 0 0 0 0 0 0 0 -1173.67 0 
0 -2142.63 0 0 0 0 0 1563.39 1303.52 0 2425.99 0.07 -1178.4 0 0 0 0 0 2126 712.073 0 0 0 0 0 0 1052.51 0 0 1964.71 0 0 0 0 0 0 0 0 0 0 0 0 187.765 726.875 0 0 0 0 0 
1283.07 1989.43 1042.89 2468.26 0 0 603.732 2228.23 0 746.864 0 1055.56 0.08 -2472.99 -2010.03 0 0 0 767.617 -209.738 0 0 0 0 0 0 0 0 0 0 0 0 0 0 0 0 0 0 0 0 0 0 0 0 0 463.805 2283.32 0 0 
2337.64 0 0 0 0 0 0 0 0 1711.55 764.107 0 352.107 0.02 -778.146 0 0 0 0 1073.26 0 0 0 0 0 0 0 0 0 0 0 0 0 0 0 0 -1323.97 0 -412.992 0 0 0 553.377 0 -1957.69 0 0 0 0 
0 0 0 237.51 0 0 0 1763.28 0 0 0 0 -417.264 -1128.35 0.09 0 0 1831.64 0 0 0 0 0 0 0 0 436.033 0 0 0 0 0 -327.998 2228.23 0 0 0 -736.335 990.249 774.636 0 0 0 0 0 0 0 0 0 
2333.37 0 0 0 0 0 0 0 0 0 0 0 0 0 0 0 -573.214 0 0 0 0 0 0 0 0 0 0 0 0 0 0 1743.45 0 0 0 0 0 0 0 0 0 0 0 0 0 0 0 0 0 
0 1436.74 2006.36 0 0 0 0 1645.02 0 2464.6 0 0 0 0 0 -1806.77 0.06 2443.54 0 0 0 0 0 1843.09 0 0 0 0 0 0 0 0 0 -1372.95 0 2180.17 0 0 0 0 0 0 0 2308.8 0 0 700.781 0 0 
0 0 0 920.667 818.888 0 0 0 0 0 0 0 0 0 -1963.33 0 2289.27 0 2231.44 970.717 0 0 0 0 0 0 0 0 0 0 0 0 0 868.48 0 0 0 0 -2130.42 -54.0941 0 0 0 0 0 0 0 2234.49 0 
0 0 0 0 0 0 758.461 0 0 0 1379.36 1368.68 -443.968 0 0 0 0 1761.3 0.09 0 0 0 0 0 0 0 0 0 0 0 0 0 1143.91 0 0 55.62 0 0 0 0 0 0 0 0 0 0 0 0 0 
2106.16 -879.925 0 0 0 2220.45 0 -275.811 0 0 0 585.116 -483.489 1983.17 0 0 0 -1337.4 0 0.01 2147.66 -2181.39 0 0 -511.872 -1522.03 0 0 0 0 1486.02 0 0 0 0 1319.54 0 0 0 0 0 0 0 0 -860.24 0 0 0 0 
0 0 0 0 0 0 0 0 -273.064 0 0 0 0 0 0 0 0 0 0 861.309 0.08 0 0 0 0 0 0 0 0 0 324.488 0 0 0 0 0 0 0 0 0 0 0 0 0 0 0 0 0 0 
0 0 0 0 0 0 0 0 0 0 1466.95 0 0 0 0 0 0 0 0 415.586 0 0.05 -318.232 0 0 0 0 0 0 0 0 0 0 0 0 0 0 0 0 0 0 1789.83 0 2474.06 0 0 0 0 0 
0 0 2329.1 0 0 0 0 1533.94 0 0 0 0 0 0 0 0 0 0 0 0 0 729.011 0.02 0 0 0 0 0 -478.912 0 -502.564 0 0 0 0 0 0 0 0 0 0 0 0 0 0 0 0 0 0 
0 0 0 0 0 -1014.66 0 1725.29 0 0 2123.55 0 0 0 0 0 1242.03 0 0 0 0 0 0 0.04 0 0 0 -1974.78 0 0 0 0 0 1233.18 705.359 0 0 -2480.62 0 0 0 0 0 0 0 2413.79 0 0 0 
0 0 2466.73 0 0 0 0 0 0 0 0 0 0 0 0 0 0 0 0 1500.52 0 0 0 0 0.09 0 0 0 0 0 0 0 0 0 0 -307.703 0 0 0 0 0 0 0 0 0 0 2008.96 0 0 
0 0 0 0 2309.41 -1901.38 1728.64 0 0 0 637.913 0 0 0 0 0 0 0 0 -667.364 0 0 0 0 0 0.02 0 0 0 0 0 0 0 0 0 0 0 0 0 0 0 0 0 419.858 0 0 0 1939.99 0 
0 -621.891 0 0 0 0 0 0 774.941 0 0 1167.56 0 0 1849.35 0 0 0 0 0 0 0 0 0 0 0 0.02 0 0 0 0 0 0 0 0 0 0 0 0 0 0 673.925 0 0 1467.41 -293.512 0 0 0 
-684.606 0 0 0 0 0 0 0 0 0 0 0 0 0 0 0 0 0 0 0 0 0 0 1856.97 0 0 0 0 0 0 286.798 0 0 0 0 0 0 0 0 0 0 623.264 0 0 0 312.433 0 0 0 
0 957.137 0 -716.346 2191.46 0 0 0 0 0 0 0 0 0 0 0 0 0 0 0 0 0 -431.303 0 0 0 0 0 0.09 0 0 0 0 0 0 0 0 0 0 0 0 0 0 0 0 0 0 0 0 
0 2132.86 0 436.491 483.947 0 0 0 0 0 0 1358.3 0 0 0 0 0 0 0 0 0 0 0 0 0 0 0 0 0 0.07 0 0 0 0 0 0 -1495.64 0 0 0 339.9 0 0 0 0 0 0 0 -1904.89 
0 0 0 0 2423.55 0 0 0 0 0 0 0 0 0 0 0 0 0 0 2146.75 -526.673 0 -743.202 0 0 0 0 -1858.96 0 0 0.05 0 0 0 0 0 0 1989.58 0 0 0 0 0 -2150.72 0 0 0 0 0 
0 0 0 0 0 0 0 0 0 396.817 561.922 0 0 0 0 246.818 0 0 0 0 0 0 0 0 0 0 0 0 0 0 0 0.03 0 0 1641.06 0 0 0 0 0 0 0 0 0 0 -2272.48 0 113.147 0 
0 0 0 2321.47 0 0 0 0 1808.6 0 0 0 0 0 144.734 0 0 0 -1196.55 0 0 0 0 0 0 0 0 0 0 0 0 0 0.04 0 0 0 0 0 0 0 0 0 0 0 0 0 0 0 0 
0 0 1579.41 0 0 0 0 1953.26 0 0 0 0 0 0 1517.46 0 -1466.49 -1549.04 0 0 0 0 0 2225.33 0 0 0 0 0 0 0 0 0 0.08 0 0 2302.09 0 0 0 0 0 0 0 0 0 562.99 0 -2072.44 
2411.19 0 0 0 0 0 0 0 0 0 0 0 0 0 0 0 0 0 0 0 0 0 0 1336.02 0 0 0 0 0 0 0 -502.564 0 0 0.09 0 0 0 0 240.715 0 0 0 0 0 0 0 0 0 
0 0 0 0 278.405 0 0 0 0 0 -1570.41 0 0 0 0 0 -193.869 0 1861.55 1361.35 0 0 0 0 2325.28 0 0 0 0 0 0 0 0 0 0 0.05 0 0 0 0 1781.29 0 0 0 2288.05 0 0 0 0 
2018.88 0 0 0 0 0 0 0 0 0 0 0 0 -2124.93 0 0 0 0 0 0 0 0 0 0 0 0 0 0 0 1874.98 0 0 0 1384.24 0 0 0.06 0 1575.29 0 0 0 0 0 0 -29.8318 0 0 0 
0 0 0 0 0 0 0 0 0 0 0 0 0 0 2208.4 0 0 0 0 0 0 0 0 1470.15 0 0 0 0 0 0 1103.78 0 0 0 0 0 0 0.09 0 0 -2267.75 0 0 0 0 2209.46 0 0 0 
0 0 0 -114.978 0 656.224 0 0 0 0 0 0 0 2144 2393.95 0 0 -1169.09 0 0 0 0 0 0 0 0 0 0 0 0 0 0 0 0 0 0 1095.84 0 0.03 2095.78 0 0 0 0 0 0 0 0 0 
0 0 0 0 0 0 0 0 0 0 0 0 0 0 615.635 0 0 207.755 0 0 0 0 0 0 0 0 0 0 0 0 0 0 0 0 1359.98 0 0 0 -1274.07 0.07 0 0 0 0 -1105.61 0 0 0 0 
0 0 0 0 0 0 0 0 163.961 0 0 0 0 0 0 0 0 0 0 0 0 0 0 0 0 0 0 0 0 1711.55 0 0 0 0 0 -538.575 0 -943.556 0 0 0.05 0 0 0 0 0 0 0 0 
0 2352.44 0 0 0 0 0 0 0 0 0 0 0 0 0 0 0 0 0 0 0 1587.65 0 0 0 0 259.484 -979.873 0 0 0 0 0 0 0 0 0 0 0 0 0 0.02 0 0 0 0 0 0 0 
0 0 0 0 577.639 2049.7 0 0 0 0 0 1678.29 0 1430.63 0 0 0 0 0 0 0 0 0 0 0 0 0 0 0 0 0 0 0 0 0 0 0 0 0 0 0 0 0.07 0 0 0 0 0 0 
0 553.529 0 0 0 674.078 0 0 0 -1204.34 0 1835.76 0 0 0 0 -2478.03 0 0 0 0 1212.58 0 0 0 982.467 0 0 0 0 -731.147 0 0 0 0 0 0 0 0 0 0 0 0 0.08 0 0 0 0 0 
0 283.593 0 0 0 0 0 0 0 0 0 0 0 -738.929 0 0 0 0 0 377.438 0 0 0 0 0 0 2078.84 0 0 0 0 0 0 0 0 164.876 0 0 0 -1129.87 0 0 0 0 0.09 0 0 0 0 
-349.055 0 0 0 0 0 0 1966.99 0 0 0 0 956.221 0 0 0 0 0 0 0 0 0 0 -1386.23 0 0 -1284.6 2198.02 0 0 0 1592.53 0 0 0 0 -1193.66 1724.68 0 0 0 0 0 0 0 0 48.4481 0 0 
-1325.95 0 0 0 0 0 0 0 0 0 0 0 701.544 0 0 0 606.937 0 0 0 0 0 0 0 2026.35 0 0 0 0 0 0 0 0 257.653 0 0 0 0 0 0 0 0 0 0 0 953.475 0.06 0 0 
0 0 0 0 0 -1376.92 832.469 0 0 0 1978.9 0 0 0 0 0 0 418.943 0 0 0 0 0 0 0 -2271.87 0 0 0 0 0 853.679 0 0 0 0 0 0 0 0 0 0 0 0 0 0 0 0.08 0 
0 0 0 2312.92 0 0 0 0 0 2430.27 0 0 0 0 0 0 0 0 0 0 0 0 0 0 0 0 0 0 0 2277.06 0 0 0 2393.34 0 0 0 0 0 0 0 0 0 0 0 0 0 0 0.05 
