*Vertices 77
*Matrix 
0.05 0 0 0 0 0 0 0 0 0 0 0 0 0 0 1710.79 1383.63 2356.72 323.725 0 0 0 669.652 0 1843.85 0 1250.57 0 0 669.958 0 0 0 0 2217.25 0 0 0 0 0 0 0 -1268.43 626.621 -833.537 -1955.4 0 0 0 0 0 0 0 0 0 0 0 0 0 0 0 0 -2178.79 0 0 0 0 0 154.805 -1016.95 0 0 0 0 0 0 0 
0 0.08 0 0 532.472 2139.12 2164.6 0 904.95 -2490.69 0 0 0 2451.02 0 905.408 0 0 0 0 0 0 0 0 0 0 0 -2438.96 0 -66.3015 0 0 43.8704 0 2474.06 0 0 -1263.24 0 0 2368.92 0 0 -1979.81 0 -1403.62 0 0 0 0 0 0 0 0 0 0 0 1392.48 0 0 454.65 0 0 0 0 0 0 1614.81 0 0 0 0 0 0 0 0 0 
0 0 0.05 0 0 0 0 -728.401 0 0 0 0 0 -1524.48 1679.05 -1749.4 0 0 0 99.8718 0 -2366.63 0 1473.2 0 0 2425.69 -1643.19 0 0 0 -505.31 0 0 886.486 0 0 374.844 0 2394.86 0 296.411 2240.44 0 1595.28 0 2146.29 0 0 0 0 0 1384.24 0 0 0 0 1345.18 0 0 0 0 0 0 0 0 1158.41 0 0 0 0 2151.02 0 0 0 0 0 
0 0 0 0.03 0 -2017.5 -105.213 0 0 0 0 0 1094.62 0 0 1762.83 1428.65 0 716.803 0 0 0 0 0 0 0 0 0 2480.77 0 0 0 -381.863 0 0 0 0 -570.009 0 0 0 0 0 0 1187.7 -199.515 0 1973.25 0 0 0 0 0 -1666.54 0 1965.32 0 0 0 0 0 0 2447.81 0 0 0 -526.063 -950.27 0 0 0 -1386.84 0 0 0 0 0 
0 -1112.63 0 0 0.05 0 -1927.02 676.366 0 0 0 0 0 2113.33 0 0 0 0 0 0 1999.5 -1051.13 0 0 0 0 0 0 0 1310.39 0 0 811.411 0 0 0 0 1464.35 0 -594.272 2260.58 0 443.205 0 0 0 -13.9622 -1443.6 0 0 0 0 0 0 0 0 1577.73 0 0 0 0 0 0 0 0 0 0 0 0 0 0 0 0 0 0 0 -1585.67 
0 1242.48 0 1629.61 0 0.02 652.562 0 446.257 0 0 0 0 2361.14 0 9.38444 -1948.07 645.238 0 -594.272 0 0 0 0 0 147.176 0 0 0 0 997.421 0 0 -1102.1 0 0 0 0 0 0 2496.03 0 0 0 0 0 0 0 0 0 1533.17 0 0 0 0 0 0 0 -1507.39 0 0 0 0 0 0 0 0 0 0 0 -908.765 0 0 0 0 0 0 
0 2491.3 0 -2219.69 -1879.1 234.153 0.09 -153.279 -1353.42 440.153 -748.238 0 0 443.815 0 -741.676 0 0 0 0 2465.06 0 0 0 0 -219.352 -430.082 0 1849.8 -340.51 -1784.34 0 0 -975.143 0 0 0 0 1526.76 0 350.276 0 0 0 428.098 0 0 0 0 977.889 0 0 0 0 0 0 1050.37 0 1493.04 0 0 0 0 0 0 0 0 0 0 0 0 0 0 0 0 0 0 
0 0 -2479.86 0 1659.67 0 2387.39 0.03 0 0 0 1415.83 1915.11 0 0 0 0 0 0 -2118.67 0 553.224 0 0 0 -1903.82 0 0 0 0 0 0 0 0 1097.06 -2368.62 0 1279.26 -1831.95 0 0 0 1526.61 0 0 0 0 0 0 0 0 0 0 0 0 0 0 0 0 0 0 0 0 0 0 0 0 0 0 0 -808.969 0 0 816.141 0 0 0 
0 798.898 0 0 0 -239.189 -295.495 0 0.07 0 -1860.48 0 1444.52 0 0 0 0 0 0 -131.458 0 2465.06 0 0 0 0 0 0 0 0 2336.73 0 0 0 0 0 0 0 0 0 1314.81 0 0 0 0 0 0 0 0 0 0 0 0 0 0 0 0 0 0 0 0 2193.75 1403.47 0 0 0 0 0 0 0 0 0 0 0 0 252.922 0 
0 1865.67 0 0 0 0 1684.24 0 0 0.03 -2243.49 0 2027.12 0 0 0 -1437.8 0 0 752.663 2470.4 2006.67 0 0 0 0 0 0 0 0 2479.25 0 -744.423 674.078 0 0 0 0 -174.032 0 0 -1029.92 0 -952.864 0 0 0 0 0 0 0 0 0 0 0 -828.196 0 0 0 0 0 0 0 0 0 0 0 -377.743 0 0 0 0 0 0 0 0 0 
0 0 0 0 0 0 1025.65 0 2225.18 1779.92 0.08 -1762.52 2040.85 0 2255.39 0 0 -1267.2 0 0 0 0 0 0 0 0 0 0 -2451.63 0 0 0 0 0 0 0 142.75 0 0 0 0 0 0 0 0 0 0 432.676 0 0 0 0 0 0 0 0 0 0 0 0 0 0 0 0 0 0 0 0 0 2472.08 0 0 0 0 0 0 0 
0 0 0 0 0 0 0 2023.76 0 0 1718.73 0.07 0 0 0 0 0 -1642.89 0 -1656.47 0 1942.88 0 0 0 0 0 0 0 0 0 0 0 -2055.8 0 0 2408.14 0 0 0 0 0 1640.6 883.892 0 0 0 369.503 0 0 0 0 0 0 2045.27 0 0 0 0 0 0 0 0 -998.337 0 0 0 0 0 0 0 -399.106 0 0 426.267 0 0 
0 0 0 -581.454 0 0 0 745.033 90.4111 281.915 2357.02 0 0.01 0 1818.52 0 0 2054.89 0 -418.79 0 0 0 0 0 0 -1636.94 0 0 0 0 0 0 0 -693.152 1216.39 0 245.903 0 0 0 -748.543 633.793 0 1390.04 0 0 0 0 0 0 0 0 0 0 0 0 0 0 1732.15 0 0 0 0 -412.076 0 0 0 0 0 0 0 0 0 -2178.18 0 0 
0 -374.538 1331.45 0 2223.2 2281.33 2254.17 0 0 0 0 0 0 0.08 0 0 0 0 -680.181 0 0 0 0 0 0 1889.32 -806.833 887.097 850.932 0 0 0 0 0 0 0 0 0 0 0 0 -192.648 0 -859.325 0 0 0 0 903.882 0 0 0 480.438 0 0 0 0 0 0 0 0 0 0 0 0 0 -976.363 0 0 0 0 0 0 0 0 0 0 
0 0 32.4259 0 0 0 0 0 0 0 2082.51 0 -1212.73 0 0.02 0 0 0 0 2410.73 -430.692 0 -617.313 0 -243.004 0 0 0 0 0 0 -525.147 2339.47 0 1160.24 0 0 730.842 0 0 1321.99 0 0 0 2205.04 0 -181.356 -2457.58 1442.99 0 0 0 0 0 0 0 0 0 0 0 0 0 0 0 777.078 1737.49 0 0 0 0 0 0 0 0 0 0 0 
276.574 2360.38 -2132.25 1252.4 0 -679.266 -198.904 0 0 0 0 0 0 0 0 0.06 0 0 1256.68 0 -884.655 1320.46 0 0 909.833 0 1169.55 0 -358.058 0 0 0 0 -1393.86 0 0 0 0 0 0 0 0 1831.8 -546.815 0 0 0 0 0 0 0 0 0 1150.47 0 0 0 0 0 0 730.689 0 0 0 0 0 0 0 434.66 0 0 0 0 0 0 0 0 
2471.31 0 0 2413.17 0 1164.66 0 0 0 -961.409 0 0 0 0 0 0 0.06 0 0 0 0 -1108.2 0 2161.55 0 0 0 -2211.91 0 0 0 0 0 0 -1694.31 0 0 0 0 1616.64 -759.529 0 0 0 0 0 0 0 0 0 0 0 0 0 -2017.96 0 0 0 0 0 0 0 0 0 0 0 0 0 0 0 0 0 0 0 0 0 0 
-2422.79 0 0 0 0 -1320.61 0 0 0 0 -227.134 221.183 2304.83 0 0 0 0 0.08 0 0 0 0 0 0 0 0 0 0 0 0 0 0 0 0 0 0 0 0 106.128 0 511.872 0 1834.09 2358.09 0 0 0 0 0 0 0 0 0 0 0 0 2371.52 0 0 0 0 0 0 -2265.01 0 0 0 0 -664.617 0 0 0 0 -2191.92 0 0 0 
-717.414 0 0 -1477.17 0 0 0 0 0 0 0 0 0 1407.74 0 2482.15 0 0 0.07 0 0 0 0 0 0 0 -435.27 0 0 598.239 2195.73 1313.44 0 0 0 1322.44 0 0 1235.77 0 0 -593.509 0 1451.38 0 0 2420.65 0 0 -129.017 -2010.18 1392.79 0 0 0 0 0 0 1390.5 0 0 942.488 0 -2367.24 0 0 820.872 0 0 0 207.297 0 0 0 0 0 0 
0 0 -501.648 0 0 2337.95 0 1162.22 -553.835 -196.615 0 1641.06 -2006.82 0 2198.48 0 0 0 0 0.06 0 0 0 0 0 0 0 0 0 -640.965 0 1036.33 0 0 0 -2337.49 0 0 0 0 0 0 0 0 816.446 1205.25 0 0 0 -1606.11 0 0 0 0 0 0 0 -213.248 0 0 1791.06 0 0 0 0 -1338.47 0 0 0 0 0 0 0 0 0 0 0 
0 0 0 0 -1690.19 0 569.399 0 0 2165.97 0 0 0 0 -1818.52 1932.81 0 0 0 0 0.01 -773.11 0 0 0 0 -1312.52 0 0 73.0155 0 1897.41 162.74 2451.93 307.855 2443.24 -2457.58 0 0 0 0 -1636.17 0 0 1493.8 2471.01 0 0 819.041 -1695.07 0 2101.28 0 0 0 0 0 624.638 0 0 1041.22 -1582.16 0 470.977 0 0 0 0 0 0 0 -884.808 -1793.34 0 0 0 0 
0 0 1891 0 2025.89 0 0 -472.503 1590.24 -138.325 0 894.574 0 0 0 -1746.35 -515.229 0 0 0 -1544.62 0.05 2364.35 0 0 1597.57 0 0 17.4718 0 -737.556 1251.95 0 0 0 0 0 0 829.875 0 0 0 2482.3 0 0 2375.48 0 0 0 0 0 0 0 0 0 1883.68 0 0 0 0 0 0 0 0 -111.164 0 0 0 -1528.9 0 0 0 0 0 0 0 0 
-1175.04 0 0 0 0 0 0 0 0 0 0 0 0 0 677.892 0 0 0 0 0 0 993.454 0.07 0 0 0 -1461.91 0 0 0 -2392.42 0 0 2409.67 -677.587 -178.152 2024.37 0 0 0 2420.8 -658.055 0 -1383.79 0 2447.81 0 0 0 0 0 0 0 0 0 0 2006.67 -616.245 0 -1936.48 0 0 0 0 208.213 2113.33 0 0 0 0 0 0 -1925.95 0 0 0 0 
0 0 1514.56 0 0 0 0 0 0 0 0 0 0 0 0 0 1009.63 0 0 0 0 0 0 0.02 0 2364.04 0 0 1249.81 0 0 0 0 0 0 -1184.8 66.1489 0 -1781.75 1905.96 0 0 0 0 0 0 0 0 0 0 1600.16 -2087.39 64.4704 0 0 0 -1399.04 953.322 0 0 0 0 0 0 0 0 0 0 0 0 100.787 0 0 0 0 0 0 
705.817 0 0 0 0 0 0 0 0 0 0 0 0 0 -411.618 1904.58 0 0 0 0 0 0 0 0 0.01 0 0 -1508.91 0 21.4393 0 0 0 0 0 0 881.298 0 0 0 0 0 0 0 0 0 0 0 383.999 0 0 0 0 0 0 0 0 0 0 0 0 0 0 0 0 0 0 0 790.048 0 0 0 0 0 0 2245.32 -1836.83 
0 0 0 0 0 2201.22 395.444 2207.48 0 0 0 0 0 1749.85 0 0 0 0 0 0 0 -1759.32 0 -1202.2 0 0 1244.93 0 0 0 0 0 0 0 0 0 0 0 0 2480.77 0 785.012 0 0 0 0 1863.69 0 0 0 0 0 0 0 0 0 0 0 0 0 0 0 2191.46 0 0 0 0 0 0 0 0 0 0 0 0 0 0 
649.205 0 1902.14 0 0 0 2402.19 0 0 0 0 0 -2042.22 1828.75 0 2181.84 0 0 807.138 0 -1306.57 0 474.029 0 0 -2064.96 0 0 0 0 0 0 0 0 -1648.69 0 0 0 0 0 0 0 0 0 -1936.48 0 0 0 0 0 0 0 0 0 0 0 0 0 0 0 0 694.372 764.718 -713.752 0 0 0 0 1980.12 1846.45 0 0 0 1809.67 0 0 0 
0 -930.891 1449.25 0 0 0 0 0 0 0 0 0 0 767.312 0 0 1039.84 0 0 0 0 0 0 0 464.721 0 0 0.09 0 0 0 0 0 0 0 0 0 0 0 1956.92 774.789 -937.3 0 0 0 0 0 0 0 0 0 0 -251.549 0 0 0 0 0 -755.409 0 0 0 0 0 0 0 0 0 0 0 0 0 0 0 0 0 0 
0 0 0 996.658 0 0 2166.59 0 0 0 671.789 0 0 932.112 0 1392.03 0 0 0 0 0 2158.5 0 -2315.82 0 0 0 0 0.01 477.081 0 0 0 0 0 0 -1190.45 0 61.1133 2000.26 0 -606.937 0 652.257 0 0 0 0 -911.664 0 0 0 -1977.22 1786.17 0 -1740.7 0 0 0 0 0 2251.88 0 0 812.174 0 -104.144 0 0 0 0 0 682.623 0 0 0 0 
75.6096 80.7978 0 0 474.792 0 -1612.06 0 0 0 0 0 0 0 0 0 0 0 -1984.54 1854.69 1232.11 0 0 0 -1041.83 0 0 0 52.8733 0.05 2318.87 0 0 0 0 -726.264 0 0 0 0 -1085.92 -287.713 0 691.015 0 2288.66 1204.95 0 0 0 0 0 752.815 0 -620.06 0 1393.55 0 0 0 0 0 0 709.174 0 0 0 0 0 0 0 0 0 0 0 0 0 
0 0 0 0 0 -695.898 1726.97 0 1380.12 532.624 0 0 0 0 0 0 0 0 2387.23 0 0 1082.72 -1744.97 0 0 0 0 0 0 2421.57 0.02 1455.2 0 0 0 0 0 0 0 0 0 0 -2391.35 0 0 0 0 0 0 0 0 0 0 0 0 0 0 0 0 0 0 0 0 -261.162 -2346.64 0 0 0 0 0 0 0 0 0 0 0 0 
0 0 1716.44 0 0 0 0 0 0 0 0 0 0 0 667.669 0 0 0 -193.564 462.889 1863.84 -2086.47 0 0 0 0 0 0 0 0 1958.45 0.05 0 0 2352.6 0 0 0 0 -693.609 0 1897.26 0 0 1380.43 0 0 0 0 0 0 0 504.242 0 0 0 0 0 742.439 0 0 0 0 0 0 843.608 -692.694 0 0 0 0 0 0 0 0 0 0 
0 2284.39 0 1747.11 46.7696 0 0 0 0 1086.99 0 0 0 0 793.558 0 0 0 0 0 -379.727 0 0 0 0 0 0 0 0 0 0 0 0.03 1547.98 0 0 0 0 0 0 0 0 0 0 0 0 0 0 0 2060.53 0 0 0 -12.2837 0 0 0 0 0 786.538 0 566.805 0 0 0 0 0 0 2439.73 0 425.657 0 0 0 0 0 0 
0 0 0 0 0 2499.54 220.725 0 0 -1204.03 0 -735.725 0 0 0 569.704 0 0 0 0 1312.68 0 859.325 0 0 0 0 0 0 0 0 0 1684.55 0.08 0 0 0 738.929 -1463.59 0 1120.72 0 -292.596 0 0 0 0 0 0 0 0 0 0 0 0 0 0 0 0 0 0 -1349.3 0 0 -993.149 0 0 0 540.254 0 0 0 0 0 0 0 0 
-1744.21 1436.89 -1457.95 0 0 0 0 1412.47 0 0 0 0 1056.02 0 229.27 0 -453.276 0 0 0 1803.26 0 2498.93 0 0 0 2376.09 0 0 0 0 870.922 0 0 0.06 0 0 0 0 0 502.564 2221.06 411.466 0 0 2067.71 0 0 0 0 0 0 1209.68 0 0 0 0 0 0 2462 0 0 0 0 0 0 0 0 0 0 0 0 0 0 0 0 0 
0 0 0 0 0 0 0 -589.999 0 0 0 0 1276.21 0 0 0 0 0 -110.248 895.337 -226.066 0 -1394.92 39.14 0 0 0 0 0 1042.44 0 0 0 0 0 0.06 0 0 0 0 -889.081 0 0 1569.03 0 2017.65 0 0 0 0 0 0 0 0 1914.5 -2190.54 0 0 0 0 0 -1375.85 0 0 0 0 0 0 0 0 0 0 0 0 0 0 0 
0 0 0 0 0 0 0 0 0 0 -9.23185 824.992 0 0 0 0 0 0 0 0 1876.05 0 1601.54 243.156 2456.05 0 0 0 2413.33 0 0 0 0 0 0 0 0.03 0 2247.31 0 0 0 0 0 -980.026 0 0 0 0 0 0 0 -1765.11 0 0 -1492.89 0 -1759.01 1937.39 0 0 0 2384.64 0 0 -110.096 0 0 0 570.772 0 0 -851.238 1472.75 0 0 0 
0 -519.196 1361.05 53.1785 2489.47 0 0 1097.22 0 0 0 0 543.001 0 -451.14 0 0 0 0 0 0 0 0 0 0 0 0 0 0 0 0 0 0 218.589 0 0 0 0 0 1475.65 0 1495.79 0 0 0 0 2368.47 0 0 0 0 0 0 0 0 0 0 0 0 0 0 0 0 0 0 0 0 0 0 0 0 0 0 0 0 0 0 
0 0 0 0 0 0 -963.24 -1767.1 0 2005.14 0 0 0 0 0 0 0 -964.766 2113.03 0 0 2290.8 0 -125.507 0 0 0 0 271.233 0 0 0 0 709.174 0 0 47.2274 0 0 0 0 0 0 0 0 0 1217.46 0 0 0 0 0 0 0 -1704.08 0 1267.51 0 0 0 0 0 -740.76 0 0 0 0 289.087 -2119.59 0 0 0 0 0 0 0 0 
0 0 1288.72 0 2492.07 0 0 0 0 0 0 0 0 0 0 0 2403.71 0 0 0 0 0 0 889.386 0 2403.41 0 -536.134 -1719.49 0 0 1385.46 0 0 0 0 0 -1390.96 0 0.04 0 0 2100.05 -42.1918 519.654 0 364.62 0 2465.67 0 0 0 1894.36 0 0 0 0 0 0 603.58 0 0 0 0 0 0 0 0 0 0 0 0 0 0 0 0 0 
0 396.054 0 0 690.863 673.62 -866.955 0 1354.79 0 0 0 0 0 -182.119 0 408.872 -1911.6 0 0 0 0 1494.11 0 0 0 0 1109.27 0 1003.07 0 0 0 -309.992 1034.96 480.438 0 0 0 0 0.05 0 -1957.84 -1323.21 1785.56 0 1989.73 0 0 0 0 0 0 0 0 0 0 -375.759 0 0 0 0 1749.55 0 0 0 42.6496 0 0 0 0 0 0 0 0 0 0 
0 0 -1676 0 0 0 0 0 0 -1410.64 0 0 26.9326 2359.46 0 0 0 0 1390.5 0 -375.149 0 202.719 0 0 1763.74 0 -551.546 431.15 1513.64 0 -1393.86 0 0 -801.492 0 0 1885.36 0 0 0 0.01 515.229 1536.84 1178.09 0 266.961 0 -80.9503 0 0 0 0 0 0 0 0 0 0 0 0 0 0 0 0 -550.172 0 0 0 0 0 810.343 834.452 0 0 -908.612 -1433.53 
1804.79 0 2246.54 0 -709.326 0 0 -469.146 0 0 0 1401.79 -723.212 0 0 -130.543 0 2440.34 0 0 0 -688.116 0 0 0 0 0 0 0 0 -1072.65 0 0 1287.5 2058.55 0 0 0 0 1470.31 -1205.56 2233.73 0.07 0 0 0 0 0 0 0 0 0 0 -1188.16 1779 0 -1476.71 0 0 0 0 0 0 0 0 0 0 0 -2283.93 -706.427 -341.273 0 0 -828.501 0 1473.66 0 
1231.04 -1072.5 0 0 0 0 0 0 0 -165.944 0 1624.42 0 1935.56 0 2218.92 0 -567.873 -1385.92 0 0 0 2059.47 0 0 0 0 0 -774.483 2024.52 0 0 0 0 0 2172.23 0 0 0 -216.91 -1394.01 2430.72 0 0.03 0 2391.2 0 0 0 0 1574.07 0 0 0 0 0 -2102.8 0 0 0 0 0 0 0 0 0 0 0 0 0 0 0 0 0 0 0 -181.661 
-2275.69 0 100.024 1476.56 0 0 1340.14 0 0 0 0 0 1250.27 0 -217.368 0 0 0 0 790.506 606.632 0 0 0 0 0 -1741.61 0 0 0 0 29.3741 0 0 0 0 -223.472 0 0 -106.433 -1564.46 -68.5903 0 0 0.08 0 0 0 0 -68.2852 -50.1267 1826.76 750.679 0 0 0 0 0 0 0 0 0 994.98 0 0 0 0 0 0 0 0 0 0 0 0 0 0 
2347.41 -2426.91 0 1866.74 0 0 0 0 0 0 0 0 0 0 0 0 0 0 0 1283.23 790.963 -1320.76 205.466 0 0 0 0 0 0 -1774.27 0 0 0 0 406.43 1811.66 0 0 0 0 0 0 0 299.768 0 0 0 0 0 0 0 0 0 0 0 0 0 0 0 0 0 0 0 0 0 0 0 0 0 0 0 -200.583 0 0 0 0 0 
0 0 -307.245 0 -1306.27 0 0 0 0 0 0 0 0 0 -578.86 0 0 0 2200.31 0 0 0 0 0 0 -1190.3 0 0 0 1009.78 0 0 0 0 0 0 0 -243.614 -61.5711 -306.024 1643.8 2313.23 0 0 0 0 0.01 0 0 2203.51 0 0 0 374.386 0 0 0 0 0 0 0 339.29 0 0 0 0 0 0 0 0 0 0 0 0 0 0 0 
0 0 0 1139.79 1307.49 0 0 0 0 0 17.3193 -1167.1 0 0 271.844 0 0 0 0 0 0 0 0 0 0 0 0 0 0 0 0 0 0 0 0 0 0 0 0 0 0 0 0 0 0 0 0 0.01 0 0 0 0 0 0 0 0 0 -1228.14 0 0 0 0 0 0 0 0 0 0 0 0 0 0 0 995.743 0 0 0 
0 0 0 0 0 0 0 0 0 0 0 0 0 1448.64 1096.61 0 0 0 0 0 1710.03 0 0 0 -1808.76 0 0 0 1926.56 0 0 0 0 0 0 0 0 0 0 -204.398 0 -439.543 0 0 0 0 0 0 0.05 0 0 0 0 0 2004.53 0 0 0 0 0 0 0 0 0 0 0 -1720.25 181.356 0 0 0 0 0 0 0 -1032.67 0 
0 0 0 0 0 0 -2350.76 0 0 0 0 0 0 0 0 0 0 0 1318.17 -690.1 -2030.32 0 0 0 0 0 0 0 0 0 0 0 1616.18 0 0 0 0 0 0 0 0 0 0 0 1956.16 0 2015.82 0 0 0.09 1364.25 0 0 1153.68 -1044.72 0 0 0 0 24.4911 0 0 0 0 0 0 0 -846.66 0 2402.04 0 0 0 0 0 0 0 
0 0 0 0 0 153.432 0 0 0 0 0 0 0 0 0 0 0 0 2473.6 0 0 0 0 1209.07 0 0 0 0 0 0 0 0 0 0 0 0 0 0 0 0 0 0 0 2189.47 2433.01 0 0 0 0 -8.77407 0.02 0 0 0 0 0 0 0 0 0 0 0 0 0 0 0 0 0 0 0 0 0 0 0 0 0 0 
0 0 0 0 0 0 0 0 0 0 0 0 0 0 0 0 0 0 1777.17 0 1367.31 0 0 655.766 0 0 0 0 0 0 0 0 0 0 0 0 0 0 0 0 0 0 0 0 1137.81 0 0 0 0 0 0 0.06 0 0 0 0 0 0 489.593 1137.96 0 0 0 0 0 0 0 -93.3103 0 0 0 0 0 -119.556 0 0 0 
0 0 2493.9 0 0 0 0 0 0 0 0 0 0 276.727 0 0 0 0 0 0 0 0 0 464.568 0 0 0 1865.83 938.826 427.641 0 -1784.95 0 0 -693.457 0 397.122 0 0 312.433 0 0 0 0 1892.53 0 0 0 0 0 0 0 0.03 0 0 0 0 0 0 0 0 0 0 0 -1265.68 0 860.088 0 0 0 0 0 -1867.2 0 0 0 0 
0 0 0 935.774 0 0 0 0 0 0 0 0 0 0 0 222.556 0 0 0 0 0 0 0 0 0 0 0 0 1311.46 0 0 0 538.881 0 0 0 0 0 0 0 0 0 -387.661 0 0 0 1648.23 0 0 1524.32 0 0 0 0.06 0 0 0 0 -2192.37 0 0 0 -438.475 0 0 0 0 0 0 0 -767.617 0 0 0 0 0 0 
0 0 0 0 0 0 0 0 0 0 0 1666.54 0 0 0 0 -1342.43 0 0 0 0 0 0 0 0 0 0 0 0 642.033 0 0 0 0 0 1850.57 0 0 2355.04 0 0 0 42.9548 0 0 0 0 0 2465.36 -1864.91 0 0 0 0 0.01 0 0 0 0 0 1349.91 0 0 -591.525 0 0 0 0 0 -1032.06 0 0 0 0 -561.464 0 0 
0 0 0 803.018 0 0 0 0 0 1355.1 0 0 0 0 0 0 0 0 0 0 0 630.741 0 0 0 0 0 0 449.767 0 0 0 0 0 0 -425.047 2239.22 0 0 0 0 0 0 0 0 0 0 0 0 0 0 0 0 0 0 0.01 0 0 0 0 0 0 0 0 0 0 0 476.928 0 0 0 0 0 -2419.74 0 0 0 
0 0 0 0 -1466.03 0 2008.96 0 0 0 0 0 0 0 0 0 0 -467.925 0 0 0 0 730.079 -1489.84 0 0 0 0 0 1147.11 0 0 0 0 0 0 0 0 1277.12 0 0 0 1522.8 -325.861 0 0 0 0 0 0 0 0 0 0 0 0 0.08 0 0 0 0 0 0 0 0 -1259.88 0 0 0 0 0 1621.83 0 0 0 0 0 
0 2055.19 673.62 0 0 0 0 0 0 0 0 0 0 0 0 0 0 0 0 -2460.02 -1578.34 0 1158.1 314.417 0 0 0 0 0 0 0 0 0 0 0 0 454.497 0 0 0 1178.7 0 0 0 0 0 0 -683.233 0 0 0 0 0 0 0 0 0 0.05 0 0 0 0 0 51.0422 0 0 0 0 0 0 0 0 -451.75 0 0 0 0 
0 0 0 0 0 278.405 2395.32 0 0 0 0 0 0 0 0 0 0 0 -143.971 0 0 0 0 0 0 0 0 -220.267 0 0 0 -2013.84 0 0 0 0 2286.22 0 0 0 0 0 0 0 0 0 0 0 0 0 0 607.7 0 1080.89 0 0 0 0 0 0 0 0 0 0 0 0 0 0 0 0 -371.181 0 812.174 0 1806.01 0 526.368 
0 0 0 0 0 0 0 0 0 0 0 0 -354.091 0 0 0 0 0 0 0 0 0 1969.28 0 0 0 0 0 0 0 0 0 -1448.94 0 -54.2467 0 0 0 0 2469.33 0 0 0 0 0 0 0 0 0 2402.49 0 -1964.55 0 0 0 0 0 0 0 0.09 0 0 0 0 395.444 0 0 0 0 0 0 0 0 0 0 0 0 
0 2313.07 0 0 0 0 0 0 0 0 0 0 0 0 0 745.491 0 0 0 1345.64 -504.395 0 0 0 0 0 0 0 0 0 0 0 0 0 0 0 0 0 0 0 0 0 0 0 0 0 0 0 0 0 0 0 0 0 1675.54 0 0 0 0 0 0.06 0 0 0 0 -1923.81 0 0 0 0 108.417 0 0 0 -78.9666 0 0 
0 0 0 0 0 0 0 0 -279.931 0 0 0 0 0 0 0 0 0 -522.248 0 725.196 0 0 0 0 0 2018.88 0 973.464 0 0 0 464.873 -534.455 0 -2281.03 0 0 0 0 0 0 0 0 0 0 -123.524 0 0 0 0 0 0 0 0 0 0 0 0 0 0 0.06 0 0 871.227 0 0 0 0 0 0 0 0 1347.47 0 0 0 
1219.9 0 0 253.99 0 0 0 0 1622.44 0 0 0 0 0 0 0 0 0 0 0 0 0 0 0 0 2421.57 2461.24 0 0 0 0 0 0 0 0 0 1200.83 0 -1029.16 0 915.021 0 0 0 -203.787 0 0 0 0 0 0 0 0 -1311.61 0 0 0 0 0 0 0 0 0.08 0 0 -2474.97 0 0 0 0 0 0 0 0 0 0 0 
0 0 0 0 0 0 0 0 0 0 0 1876.35 0 0 0 0 0 2273.86 2490.69 0 978.195 0 0 0 0 0 -736.03 0 0 1282.92 -2228.84 0 0 0 0 0 0 0 0 0 0 0 0 0 0 0 0 0 0 0 0 0 0 0 1034.81 0 0 -1814.71 0 0 0 0 0 0.06 0 0 0 405.362 0 0 751.442 0 0 0 638.829 0 1388.67 
0 0 0 0 0 0 0 0 0 0 0 0 1625.34 0 -2124.93 0 0 0 0 0 0 -499.664 1949.6 0 0 0 0 0 1536.23 0 1039.54 0 0 -1036.79 0 0 0 0 0 0 0 0 0 0 0 0 0 0 0 0 0 0 1374.94 0 0 0 0 0 0 -2147.51 0 463.195 0 0 0.09 0 0 0 0 0 0 0 0 0 0 0 0 
0 0 0 0 0 0 0 0 0 0 0 0 0 0 -656.835 0 0 0 0 -1827.07 0 0 1091.11 0 0 0 0 0 0 0 0 -1325.95 0 0 0 0 -8.31629 0 0 0 0 -299.615 0 0 0 0 0 0 0 0 0 0 0 0 0 0 1374.48 0 0 0 1025.35 0 516.602 0 0 0.07 0 0 0 0 0 0 0 0 1543.55 -552.004 0 
0 0 2224.27 129.933 0 0 0 0 0 0 0 0 0 2384.49 0 0 0 0 -601.901 0 0 0 0 0 0 0 0 0 -2020.1 0 0 874.584 0 0 0 0 0 0 0 0 -21.4393 0 0 0 0 0 0 0 776.467 0 0 0 701.697 0 0 0 0 0 0 0 0 0 0 0 0 0 0.07 0 0 0 0 0 0 0 0 0 0 
0 627.689 0 2050 0 0 0 0 0 1441.01 0 0 0 0 0 0 0 0 0 0 0 0 0 0 0 0 0 0 0 0 0 0 0 0 0 0 0 0 1978.74 0 0 0 0 0 0 0 0 0 -1823.71 1944.11 0 949.355 0 0 0 127.796 0 0 0 0 0 0 0 1861.4 0 0 0 0.04 0 0 0 -1261.56 0 0 0 2360.23 0 
-1713.39 0 0 0 0 0 0 0 0 0 0 0 0 0 0 1430.17 0 190.512 0 0 0 103.229 0 0 2215.41 0 572.909 0 0 0 0 0 898.541 1010.09 0 0 0 0 985.519 0 0 0 -1445.43 0 0 0 0 0 0 0 0 0 0 0 0 0 0 0 0 0 0 0 0 0 0 0 0 0 0.03 0 1015.43 0 0 0 0 0 0 
2260.89 0 0 0 0 0 0 0 0 0 829.264 0 0 0 0 0 0 0 0 0 0 0 0 0 0 0 -2058.7 0 0 0 0 0 0 0 0 0 -2144 0 0 0 0 0 1643.8 0 0 0 0 0 0 -123.981 0 0 0 0 1031.14 0 0 0 0 0 0 0 0 0 0 0 0 0 0 0.01 0 0 0 0 0 0 0 
0 0 0 0 0 412.076 0 2370.14 0 0 0 0 0 0 0 0 0 0 95.294 0 0 0 0 1785.71 0 0 0 0 0 0 0 0 754.494 0 0 0 0 0 0 0 0 0 2188.1 0 0 0 0 0 0 0 0 0 0 1777.32 0 0 0 0 -1887.65 0 2412.87 0 0 -1112.63 0 0 0 0 -1721.47 0 0.03 0 0 0 0 0 0 
0 0 1261.41 1273.77 0 0 0 0 0 0 0 553.377 0 0 0 0 0 0 0 0 -221.488 0 0 0 0 0 0 0 0 0 0 0 0 0 0 0 0 0 0 0 0 -497.986 0 0 0 1328.24 0 0 0 0 0 0 0 0 0 0 1390.8 0 0 0 0 0 0 0 0 0 0 -1684.09 0 0 0 0.03 -1497.62 0 0 0 0 
0 0 0 0 0 0 0 0 0 0 0 0 0 0 0 0 0 0 0 0 -2458.19 0 -2285.91 0 0 0 0 0 2444 0 0 0 0 0 0 0 1872.54 0 0 0 0 1985.61 0 0 0 0 0 0 0 0 0 0 1736.88 0 0 0 0 1699.35 732.063 0 0 0 0 0 0 0 0 0 0 0 0 -480.132 0.03 0 0 0 0 
0 0 0 0 0 0 0 -1874.07 0 0 0 0 0 0 0 0 0 320.521 0 0 0 0 0 0 0 0 -1830.88 0 0 0 0 0 0 0 0 0 1241.42 0 0 0 0 0 490.356 0 0 0 0 -253.075 0 0 0 1203.73 0 0 0 2366.63 0 0 0 0 0 -772.042 0 0 0 0 0 0 0 0 0 0 0 0.04 0 0 0 
0 0 0 0 0 0 0 0 0 0 0 -557.192 1257.9 0 0 0 0 0 0 0 0 0 0 0 0 0 0 0 0 0 0 0 0 0 0 0 0 0 0 0 0 0 0 0 0 0 0 0 0 0 0 0 0 0 2387.54 0 0 0 2370.75 0 -2089.07 0 0 -2177.88 0 175.863 0 0 0 0 0 0 0 0 0.08 0 0 
0 0 0 0 0 0 0 0 2499.39 0 0 0 0 0 0 0 0 0 0 0 0 0 0 0 -1508 0 0 0 0 0 0 0 0 0 0 0 0 0 0 0 0 1500.52 1187.4 0 0 0 0 0 2166.43 0 0 0 0 0 0 0 0 0 0 0 0 0 0 0 0 -1705.91 0 -294.427 0 0 0 0 0 0 0 0.03 0 
0 0 0 0 910.749 0 0 0 0 0 0 0 0 0 0 0 0 0 0 0 0 0 0 0 684.149 0 0 0 0 0 0 0 0 0 0 0 0 0 0 0 0 64.0126 0 2459.87 0 0 0 0 0 0 0 0 0 0 0 0 0 0 567.415 0 0 0 0 -2290.64 0 0 0 0 0 0 0 0 0 0 0 0 0.03 
