*Vertices 63
*Matrix 
0.06 1326.41 0 0 801.187 0 0 0 0 -272.607 0 0 0 0 0 0 517.518 0 0 0 0 0 1369.29 -31.0526 0 -1192.74 0 0 0 0 0 930.28 -867.87 0 0 0 0 0 -2208.55 0 0 1893.9 0 0 0 0 0 0 0 0 0 0 0 0 0 52.1104 0 0 0 0 0 0 0 
-1699.35 0.04 68.7429 0 0 0 1797.92 0 0 0 0 0 -1179.46 0 0 0 0 1273 0 0 0 0 0 2359.31 0 -1406.83 0 0 0 1150.78 0 0 0 0 0 -484.863 0 0 0 -349.361 49.2111 0 1101.79 0 0 0 -635.014 0 0 0 0 0 0 0 0 0 0 -660.497 0 0 0 0 0 
0 1746.5 0.03 0 0 0 0 0 -393.46 1902.45 0 0 0 0 0 0 0 0 0 0 0 0 0 1595.89 0 0 0 0 0 0 0 0 0 0 0 -805.155 0 0 0 -741.066 0 0 1066.24 0 0 0 0 0 0 0 0 0 0 0 0 0 0 0 0 0 0 0 0 
0 0 0 0.06 0 0 0 0 0 0 0 0 0 0 0 0 0 0 0 0 0 0 0 0 0 0 0 0 1712.47 0 0 0 0 0 1793.34 0 0 0 -2174.06 0 0 1592.68 1490.14 -250.175 0 0 0 0 1374.48 0 0 2221.67 0 0 0 0 0 0 0 0 0 0 0 
2103.41 0 0 0 0.03 0 0 1031.6 0 0 0 -907.239 0 0 0 0 0 0 0 0 0 0 0 0 0 0 0 0 0 0 0 0 0 0 0 -1814.25 0 0 -675.909 0 0 1920.3 0 0 -594.272 0 0 1037.1 0 0 0 0 182.73 0 0 0 0 0 0 0 0 0 0 
0 0 0 0 0 0.09 0 0 0 0 0 0 0 0 0 0 0 0 -1545.53 -1165.73 432.524 0 0 0 0 0 0 2434.23 2232.96 0 0 -132.984 0 0 0 0 0 0 0 0 0 0 0 0 0 0 0 1645.94 0 0 0 0 0 -133.442 0 0 0 0 0 0 0 0 988.723 
0 -165.181 0 0 0 0 0.01 0 0 0 0 0 0 0 0 0 0 1692.18 0 0 0 0 0 940.352 0 0 0 0 0 0 0 0 1492.74 0 0 0 0 0 0 0 0 -382.626 0 0 0 -736.641 0 0 0 0 -535.066 0 0 0 0 0 0 0 442.137 0 0 0 0 
0 0 0 0 634.404 0 0 0.07 0 0 198.447 0 0 0 0 0 0 0 0 0 0 0 -1929.76 0 2034.29 1558.96 0 0 0 0 0 0 0 0 0 0 0 0 0 0 1809.82 0 0 0 -992.233 0 0 0 0 0 0 0 0 275.201 2069.84 0 0 0 0 0 0 0 0 
0 0 -1041.37 0 0 0 0 0 0.04 0 0 0 0 0 0 0 0 1734.29 0 0 0 -366.451 0 0 0 0 0 -1420.1 1226.46 0 0 0 0 0 0 0 0 0 0 0 0 0 0 0 0 0 0 0 0 0 0 0 0 976.516 0 2378.38 0 0 0 0 0 0 0 
1120.87 0 -715.583 0 0 0 0 0 0 0.08 0 0 2203.67 0 2183.37 0 254.448 0 -534.913 0 0 0 0 0 0 1609.01 0 0 0 0 1846.45 0 0 0 0 0 0 -693.304 0 0 0 0 0 0 0 1604.28 0 0 0 0 0 0 0 0 0 0 0 0 0 0 0 0 0 
0 0 0 0 0 0 0 1444.67 0 0 0.08 0 0 0 0 1677.07 912.427 1017.87 0 0 0 -1927.78 0 0 0 0 849.712 0 0 0 0 0 0 0 -1275.44 0 -2006.06 1358.3 0 0 0 0 0 0 0 0 2010.64 0 0 -222.404 0 -483.947 0 0 0 0 0 0 0 0 1411.25 0 0 
0 0 0 0 2054.73 0 0 0 0 0 0 0 0 0 0 0 0 0 0 0 0 0 0 0 0 0 0 0 0 0 0 0 0 0 0 2368.47 0 965.682 0 0 0 -1858.96 0 0 1821.73 0 0 0 0 0 -513.398 0 0 0 233.238 0 0 0 0 0 0 0 0 
0 1416.75 0 0 0 0 0 0 0 1253.01 0 0 0.04 0 0 0 0 0 0 0 0 0 0 -968.886 0 2048.33 0 0 0 1428.5 0 0 0 0 0 0 0 0 0 0 0 0 0 0 759.529 0 0 0 0 0 0 0 0 0 -1186.48 0 0 2138.36 0 0 0 0 0 
0 0 0 0 0 0 0 0 0 0 0 0 0 0.03 0 0 0 1110.64 0 0 0 0 0 0 -409.024 0 -345.698 0 0 0 0 -219.047 0 0 0 1818.52 1760.69 0 0 0 0 0 0 0 0 -813.852 0 0 0 0 0 0 0 0 0 0 0 0 0 2259.21 0 0 0 
0 0 0 0 0 0 0 0 0 1721.93 0 0 0 0 0.06 -2222.43 0 0 0 0 0 0 1004.59 0 2167.35 0 0 0 0 0 0 0 0 0 0 0 0 0 0 0 -950.575 0 0 0 0 0 0 0 0 0 0 0 0 0 -2239.98 2146.6 0 0 0 0 0 0 0 
0 0 0 0 0 0 0 0 0 0 -969.955 0 0 0 983.23 0.08 0 1373.41 0 0 0 0 0 0 0 0 0 0 0 0 0 0 0 0 0 0 0 0 0 0 0 0 0 0 1068.22 0 0 0 0 0 0 0 0 0 0 0 0 0 0 0 0 0 0 
1941.66 0 0 0 0 0 0 0 0 -879.467 -757.851 0 0 0 0 0 0.08 0 0 684.606 -1551.79 1322.75 -147.328 0 0 -953.475 0 0 0 0 0 0 0 0 0 0 0 0 0 0 1791.97 0 0 0 0 0 0 0 0 2020.71 0 0 0 0 0 0 0 -1444.21 -1873.91 0 0 0 0 
0 227.744 0 0 0 0 493.103 0 -862.224 0 990.097 0 0 1517.61 0 177.084 0 0.04 0 0 0 0 0 0 0 0 0 1944.87 0 0 -647.679 0 0 0 0 0 0 0 0 0 189.596 0 0 0 0 0 0 0 0 0 0 0 0 0 0 0 0 0 0 0 0 0 0 
0 0 0 0 0 -718.177 0 0 0 -2062.52 0 0 0 0 0 0 0 0 0.07 0 0 0 0 0 0 0 0 1471.37 0 0 -978.805 0 0 0 0 0 0 0 0 0 0 1054.49 0 0 0 0 1435.82 0 0 939.589 0 0 0 0 0 0 0 0 0 0 0 0 0 
0 0 0 0 0 -2130.88 0 0 0 0 0 0 0 0 0 0 -1034.96 0 0 0.02 0 0 0 0 0 0 0 0 0 0 0 795.541 0 0 0 0 0 -395.444 0 0 -2465.51 1771.83 0 0 0 1690.34 0 0 522.706 1090.66 0 0 0 0 0 158.162 0 0 0 0 0 0 0 
0 0 0 0 0 2309.26 0 0 0 0 0 0 0 0 0 0 2116.23 0 0 0 0.05 0 0 0 0 0 0 0 0 791.879 0 0 -784.86 0 787.454 0 0 0 0 0 -2173.15 0 0 0 0 2360.38 0 0 0 0 0 0 -2211.75 0 0 0 0 0 0 0 0 0 0 
0 0 0 0 0 0 0 0 257.805 0 333.491 0 0 0 0 0 723.823 0 0 0 0 0.05 0 0 0 0 0 0 0 0 0 659.581 -677.435 0 0 0 0 0 1985.92 -1982.25 0 0 0 0 0 0 0 0 0 0 1648.08 0 0 0 0 0 0 0 0 0 0 0 0 
-1837.29 0 0 0 0 0 0 -318.69 0 0 0 0 0 0 721.229 0 993.301 0 0 0 0 0 0.06 0 0 0 0 860.546 0 0 0 0 0 0 0 2006.97 0 0 0 0 0 0 0 0 0 0 0 0 0 0 0 0 -935.774 0 0 0 0 0 0 0 0 0 0 
1531.65 -1791.97 2298.88 0 0 0 -1510.74 0 0 0 0 0 582.675 0 0 0 0 0 0 0 0 0 0 0.05 0 0 0 0 0 0 -1672.49 0 0 0 0 0 -1341.21 0 0 0 0 0 0 0 0 1742.38 0 1867.66 0 0 -925.55 2171.16 -2162.01 0 0 0 0 0 0 0 0 0 0 
0 0 0 0 0 0 0 1505.71 0 0 0 0 0 514.466 -422.3 0 0 0 0 0 0 0 0 0 0.09 0 2248.22 0 -2016.43 -576.266 0 0 0 0 2328.03 0 0 0 0 0 0 0 -2464.6 0 0 0 0 0 1914.04 0 0 0 0 0 0 -1609.01 0 0 0 0 0 0 0 
576.571 2163.99 0 0 0 0 0 -458.617 0 -1483.12 0 0 -919.904 0 0 0 2120.2 0 0 0 0 0 0 0 0 0.08 0 0 0 0 247.276 0 0 0 0 399.716 0 0 0 0 0 1066.39 0 0 0 -311.975 0 0 0 0 -2394.41 0 0 0 0 0 0 0 0 0 0 0 0 
0 0 0 0 0 0 0 0 0 0 -437.559 0 0 1358.3 0 0 0 0 0 0 0 0 0 0 -806.375 0 0.03 189.444 953.169 0 0 1032.98 0 0 0 0 0 0 0 0 0 0 0 0 0 0 0 0 0 0 0 1628.24 0 0 0 0 0 0 0 0 0 0 0 
0 0 0 0 0 1703.62 0 0 2253.72 0 0 0 0 0 0 0 0 -1637.55 1576.82 0 0 0 398.495 0 0 0 1723.61 0.05 0 0 0 0 0 0 0 -2273.55 0 0 0 0 0 0 0 787.759 0 0 0 0 0 0 0 -2428.74 0 1920.76 0 0 0 0 -989.486 0 0 0 0 
0 0 0 1630.07 0 -268.334 0 0 -1167.56 0 0 0 0 0 0 0 0 0 0 0 0 0 0 0 1643.8 0 2092.27 0 0.02 0 0 0 0 0 0 0 0 0 0 0 0 0 0 0 -1456.88 0 0 0 0 0 0 0 0 0 0 0 0 0 0 0 0 0 0 
0 -1640.29 0 0 0 0 0 0 0 0 0 0 1595.89 0 0 0 0 0 0 0 -1191.67 0 0 0 1557.89 0 0 0 0 0.06 0 0 0 0 -937.758 0 0 0 0 0 0 0 0 0 1492.58 0 0 0 1367 0 0 0 0 0 2122.94 0 0 0 0 0 0 0 0 
0 0 0 0 0 0 0 0 0 776.467 0 0 0 0 0 0 0 -496.612 -125.202 0 0 0 0 1244.01 0 309.687 0 0 0 0 0.01 0 0 -2129.96 1773.66 0 0 0 0 0 0 912.275 0 0 0 1434.6 0 0 0 0 0 0 0 154.347 0 0 811.411 0 0 0 0 0 0 
2445.68 0 0 0 0 1265.53 0 0 0 0 0 0 0 1312.07 0 0 0 0 0 547.121 0 831.401 0 0 0 0 -1975.08 0 0 0 0 0.08 0 0 0 0 0 0 0 0 0 0 0 0 0 0 0 1049.3 0 0 0 0 0 0 0 0 588.168 0 -1118.43 0 0 0 0 
2081.29 0 0 0 0 0 -1046.86 0 0 0 0 0 0 0 0 0 0 0 0 0 1945.17 77.5933 0 0 0 0 0 0 0 0 0 0 0.05 0 0 0 0 0 0 0 0 0 0 0 0 -1195.18 0 0 0 0 0 -436.033 0 0 0 0 0 0 0 0 0 0 0 
0 0 0 0 0 0 0 0 0 0 0 0 0 0 0 0 0 0 0 0 0 0 0 0 0 0 0 0 0 0 -758.309 0 0 0.03 -79.8822 0 0 0 1944.56 0 0 0 -1335.72 0 0 0 0 0 0 0 0 0 0 0 2318.87 0 0 0 0 0 0 0 0 
0 0 0 -471.74 0 0 0 0 0 0 1221.58 0 0 0 0 0 0 0 0 0 1423.46 0 0 0 1694.31 0 0 0 0 1852.85 -2179.56 0 0 -2487.64 0.01 0 -1245.08 0 1215.32 0 1016.34 0 0 0 1880.32 0 0 0 0 0 0 0 171.743 0 0 0 0 0 0 0 0 0 0 
0 -1979.51 -297.174 0 324.488 0 0 0 0 0 0 496.918 0 2336.12 0 0 0 0 0 0 0 0 2005.29 0 0 -1675.85 0 2217.7 0 0 0 0 0 0 0 0.04 0 0 0 0 0 0 0 0 0 0 0 2376.71 670.415 1212.58 0 0 0 0 0 0 0 -366.756 0 0 0 0 0 
0 0 0 0 0 0 0 0 0 0 1718.73 0 0 1058.76 0 0 0 0 0 0 0 0 0 -2401.73 0 0 0 0 0 0 0 0 0 0 1193.66 0 0.01 0 0 0 0 0 0 0 0 0 0 0 0 0 0 0 0 0 0 0 0 0 0 0 0 0 0 
0 0 0 0 0 0 0 0 0 -164.113 1628.7 192.19 0 0 0 0 0 0 0 -1416.9 0 0 0 0 0 0 0 0 0 0 0 0 0 0 0 0 0 0.06 827.586 0 0 0 0 -424.589 0 0 1035.87 0 621.281 0 0 0 -1008.87 0 2220.76 0 0 0 0 0 0 0 0 
1744.51 0 0 2442.32 1013.14 0 0 0 0 0 0 0 0 0 0 0 0 0 0 0 0 -1239.74 0 0 0 0 0 0 0 0 0 0 0 736.488 814.615 0 0 870.006 0.01 0 0 0 0 0 0 -2405.7 0 2091.97 0 0 0 0 0 0 -2392.73 0 0 0 0 0 0 0 0 
0 -1704.54 2157.58 0 0 0 0 0 0 0 0 0 0 0 0 0 0 0 0 0 0 -2306.82 0 0 0 0 0 0 0 0 0 0 0 0 0 0 0 0 0 0.09 2199.09 0 -163.961 0 0 0 0 0 0 0 0 2482.15 0 0 0 0 0 0 965.987 0 0 0 0 
0 2050.46 0 0 0 0 0 2476.96 0 0 0 0 0 0 -2050.31 0 -173.116 1892.22 0 1414.15 1523.71 0 0 0 0 0 0 0 0 0 0 0 0 0 -496.765 0 0 0 0 -1239.28 0.01 0 0 0 0 0 1793.65 0 0 0 1858.65 0 0 0 0 0 0 0 0 0 0 0 0 
-1951.73 0 0 -821.024 24.1859 0 -918.989 0 0 0 0 -457.396 0 0 0 0 0 0 1990.19 860.851 0 0 0 0 0 -1149.25 0 0 0 0 1701.64 0 0 0 0 0 0 0 0 0 0 0.06 2292.17 0 0 0 0 0 0 0 0 0 100.33 0 0 0 0 0 0 0 0 0 0 
0 -125.813 -384.457 2287.29 0 0 0 0 0 0 0 0 0 0 0 0 0 0 0 0 0 0 0 0 -160.604 0 0 0 0 0 0 0 0 1503.88 0 0 0 0 0 2458.04 0 -2125.23 0.08 0 0 0 0 0 0 0 0 0 0 0 0 0 2165.67 0 0 0 0 0 0 
0 0 0 1901.38 0 0 0 0 0 0 0 0 0 0 0 0 0 0 0 0 0 0 0 0 0 0 0 705.206 0 0 0 0 0 0 0 0 0 -281.61 0 0 0 0 0 0.04 0 0 0 0 0 0 0 0 0 0 0 0 2395.17 0 0 0 0 0 0 
0 0 0 0 -437.864 0 0 -2268.67 0 0 0 1471.68 934.858 0 0 -224.387 0 0 0 0 0 0 0 0 0 0 0 0 -1852.85 -359.127 0 0 0 0 930.433 0 0 0 0 0 0 0 0 0 0 0 0 0 0 0 0 -272.301 0 0 2006.67 0 2021.93 0 0 0 0 0 0 
0 0 0 0 0 0 -1786.78 0 0 842.082 0 0 0 -163.808 0 0 0 0 0 -221.335 -364.315 0 0 1917.25 0 997.269 0 0 0 0 974.38 0 346.614 0 0 0 0 0 197.836 0 0 0 0 0 0 0.03 0 0 -1351.44 0 566.5 0 0 0 0 0 0 0 0 0 0 0 0 
0 -739.998 0 0 0 0 0 0 0 0 -697.577 0 0 0 0 0 0 0 397.732 0 0 0 0 0 0 0 0 0 0 0 0 0 0 0 0 0 0 948.439 0 0 1473.82 0 0 0 0 0 0.07 0 0 0 0 925.245 0 0 0 0 0 2196.8 0 0 0 -1185.72 0 
0 0 0 0 2487.33 2315.52 0 0 0 0 0 0 0 0 0 0 0 0 0 0 0 0 0 663.701 0 0 0 0 0 0 0 2402.19 0 0 0 -1198.08 0 0 2371.97 0 0 0 0 0 0 0 0 0.05 0 0 -1435.06 0 0 0 0 0 0 0 0 0 0 0 0 
0 0 0 1026.57 0 0 0 0 0 0 0 0 0 0 0 0 0 0 0 1166.04 0 0 0 0 1257.74 0 0 0 0 1550.87 0 0 0 0 0 2052.45 0 292.138 0 0 0 0 0 0 0 -1537.75 0 0 0.02 0 0 0 0 0 0 -1245.69 0 0 0 0 0 0 0 
0 0 0 0 0 0 0 0 0 0 -1432.16 0 0 0 0 0 1015.43 0 1048.54 -2072.13 0 0 0 0 0 0 0 0 0 0 0 0 0 0 0 1358.46 0 0 0 0 0 0 0 0 0 0 0 0 0 0.09 1909.62 0 0 0 0 0 0 0 0 0 0 0 0 
0 0 0 0 0 0 -1347.77 0 0 0 0 1518.22 0 0 0 0 0 0 0 0 0 1280.18 0 506.989 0 -1067.46 0 0 0 0 0 0 0 0 0 0 0 0 0 0 2318.11 0 0 0 0 1082.26 0 -524.384 0 471.129 0.09 0 0 0 0 0 0 0 0 0 0 0 0 
0 0 0 -887.402 0 0 0 0 0 0 1065.02 0 0 0 0 0 0 0 0 0 0 0 0 -1824.78 0 0 1971.27 1664.71 0 0 0 0 1813.18 0 0 0 0 0 0 358.364 0 0 0 0 100.177 0 129.475 0 0 0 0 0.09 0 0 2174.06 2475.59 2369.23 0 0 0 0 0 0 
0 0 0 0 -700.629 0 0 0 0 0 0 0 0 0 0 0 0 0 0 0 2442.32 0 2033.37 -83.697 0 0 0 0 0 0 0 0 0 0 -24.6437 0 0 1729.87 0 0 0 -1661.96 0 0 0 0 0 0 0 0 0 0 0.08 0 0 0 0 0 224.387 0 0 0 0 
0 0 0 0 0 -284.661 0 -250.328 1635.41 0 0 0 0 0 0 0 0 0 0 0 0 0 0 0 0 0 0 2448.73 0 0 2357.94 0 0 0 0 0 0 0 0 0 0 0 0 0 0 0 0 0 0 0 0 0 0 0.01 0 0 0 0 0 0 0 0 0 
0 0 0 0 0 0 0 -199.057 0 0 0 -1105.76 1061.66 0 1565.37 0 0 0 0 0 0 0 0 0 0 0 0 0 0 2449.49 0 0 0 1966.08 0 0 0 1533.33 1989.27 0 0 0 0 0 2109.06 0 0 0 0 0 0 1908.4 0 0 0 0 0 0 0 0 0 0 0 
-284.356 0 0 0 0 0 0 0 -1048.69 0 0 0 0 0 211.417 0 0 0 0 -2132.1 0 0 0 0 2395.17 0 0 0 0 0 0 0 0 0 0 0 0 0 0 0 0 0 0 0 0 0 0 0 906.018 0 0 741.981 0 0 0 0.05 0 0 0 0 0 0 0 
0 0 0 0 0 0 0 0 0 0 0 0 0 0 0 0 0 0 0 0 0 0 0 0 0 0 0 0 0 0 1382.72 673.62 0 0 0 0 0 0 0 0 0 0 1471.83 1546.6 29.9844 0 0 0 0 0 0 -701.392 0 0 0 0 0.06 0 0 0 0 0 0 
0 2164.3 0 0 0 0 0 0 0 0 0 0 1754.28 0 0 0 440.001 0 0 0 0 0 0 0 0 0 0 0 0 0 0 0 0 0 0 -1162.07 0 0 0 0 0 0 0 0 0 0 -270.623 0 0 0 0 0 0 0 0 0 0 0.07 2111.5 0 0 0 0 
0 0 0 0 0 0 2216.48 0 0 0 0 0 0 0 0 0 305.261 0 0 0 0 0 0 0 0 0 0 2305.14 0 0 0 339.9 0 0 0 0 0 0 0 -699.713 0 0 0 0 0 0 0 0 0 0 0 0 749.611 0 0 0 0 -515.839 0.05 0 0 0 0 
0 0 0 0 0 0 0 0 0 0 0 0 0 578.402 0 0 0 0 0 0 0 0 0 0 0 0 0 0 0 0 0 0 0 0 0 0 0 0 0 0 0 0 0 0 0 0 0 0 0 0 0 0 0 0 0 0 0 0 0 0.09 0 0 0 
0 0 0 0 0 0 0 0 0 0 1782.97 0 0 0 0 0 0 0 0 0 0 0 0 0 0 0 0 0 0 0 0 0 0 0 0 0 0 0 0 0 0 0 0 0 0 0 0 0 0 0 0 0 0 0 0 0 0 0 0 0 0.03 0 0 
0 0 0 0 0 0 0 0 0 0 0 0 0 0 0 0 0 0 0 0 0 0 0 0 0 0 0 0 0 0 0 0 0 0 0 0 0 0 0 0 0 0 0 0 0 0 264.519 0 0 0 0 0 0 0 0 0 0 0 0 0 0 0 0 
0 0 0 0 0 585.269 0 0 0 0 0 0 0 0 0 0 0 0 0 0 0 0 0 0 0 0 0 0 0 0 0 0 0 0 0 0 0 0 0 0 0 0 0 0 0 0 0 0 0 0 0 0 0 0 0 0 0 0 0 0 0 0 0.05 
