*Vertices 49
*Matrix 
0.07 0 0 0 0 0 0 0 0 0 786.081 0 0 0 0 0 0 0 0 0 0 0 -1931.44 0 0 0 0 0 0 0 2218.47 0 0 0 0 0 1984.69 0 0 0 0 0 0 0 0 0 0 0 0 
0 0.03 0 0 0 0 0 0 0 0 -1741.92 0 380.49 0 0 0 0 0 1288.26 -2315.82 0 0 0 -632.42 -186.544 0 0 0 0 0 0 0 0 1840.95 567.873 0 0 0 2427.52 0 0 0 0 0 0 0 0 0 0 
0 0 0.07 0 0 0 0 0 0 0 0 0 0 -1133.38 0 0 1481.29 0 0 0 0 0 2226.25 0 0 0 0 0 0 0 0 0 0 0 0 1027.79 0 0 0 0 0 0 0 0 0 0 0 -1488.77 0 
0 0 0 0.02 0 0 0 0 0 0 0 -314.722 0 0 0 0 0 0 0 0 0 -1311 0 248.802 0 0 0 0 0 0 0 678.961 0 0 0 1686.68 0 0 0 0 0 0 0 0 0 0 0 0 0 
0 0 0 0 0.09 0 0 1945.48 0 0 0 0 0 0 0 1090.04 -1112.17 1384.4 0 0 0 0 0 0 0 0 0 0 1352.81 0 0 0 1922.28 851.085 0 0 0 1023.36 0 0 0 0 0 0 0 0 0 0 0 
0 0 0 0 0 0.06 1937.54 0 553.377 0 0 0 0 0 0 0 0 0 0 0 2461.7 0 1482.51 0 0 0 0 0 0 0 0 -1739.17 0 0 0 0 0 0 0 0 0 0 0 0 0 0 0 0 0 
0 0 0 0 0 -410.855 0.05 0 0 0 0 0 0 0 145.039 0 0 0 0 0 0 0 0 0 0 0 0 0 0 0 0 0 0 0 0 0 0 849.864 0 0 0 0 0 0 0 0 2176.35 0 0 
0 0 0 0 1749.55 0 0 0.04 0 0 -794.015 0 0 0 0 0 -39.14 0 0 0 0 0 0 0 0 0 0 0 0 0 0 0 0 0 0 0 0 0 0 0 0 0 0 0 0 0 0 0 0 
0 0 0 0 0 -2372.43 0 0 0.08 -1044.57 0 0 0 0 0 0 0 0 0 0 0 0 1996.29 0 2134.69 2478.03 0 0 0 1381.95 -2312.16 0 0 1389.74 0 0 0 0 0 0 0 0 0 0 0 0 0 0 0 
0 0 0 0 0 0 0 0 1969.74 0.01 0 0 0 0 11.063 0 0 0 0 0 0 -1991.71 0 0 995.743 -1539.28 2318.26 0 0 0 0 0 -1518.52 0 0 0 0 1324.73 0 0 0 0 0 0 0 0 0 0 0 
1974.62 555.818 0 0 0 0 0 188.833 0 0 0.05 0 -271.996 205.008 0 0 0 -1123.31 0 0 0 0 0 0 -1002.3 0 0 0 0 0 2493.29 0 -480.59 0 0 0 0 0 0 0 0 0 0 0 0 0 0 0 0 
0 0 0 64.9281 0 0 0 0 0 0 0 0.09 2367.85 0 0 0 0 0 0 0 0 0 0 2495.27 0 0 0 -1585.06 0 0 0 0 958.205 -1871.47 0 0 0 0 0 0 0 0 0 0 0 0 0 0 0 
0 2338.56 0 0 0 0 0 0 0 0 -2306.97 -1847.67 0.08 2209.92 0 0 0 0 0 0 0 1485.11 0 0 0 0 0 1074.18 0 0 0 0 0 -1572.39 0 0 0 0 0 0 0 0 0 0 0 0 0 0 0 
0 0 1079.06 0 0 0 0 0 0 0 471.129 0 -61.1133 0.07 0 0 0 0 0 0 0 0 311.518 0 2027.12 0 0 0 0 0 0 2111.19 0 0 0 1088.21 0 0 1635.41 0 -1807.54 0 0 0 0 0 0 0 0 
0 0 0 0 0 0 2295.83 0 0 1558.96 0 0 0 0 0 0 -1372.04 27.543 0 0 0 848.949 0 0 0 0 0 0 0 0 0 0 0 0 0 0 -1192.89 0 0 0 0 0 -1278.04 0 0 0 0 0 0 
0 0 0 0 1681.65 0 0 0 0 0 0 0 0 0 0 0.04 0 0 0 0 311.518 0 0 1393.25 0 865.734 625.095 0 0 0 0 0 0 0 0 0 0 0 0 0 0 0 0 0 0 0 0 0 0 
0 0 2032 0 726.569 0 0 1962.87 0 0 0 0 0 0 1515.93 0 0.01 0 0 0 1577.88 0 0 -2253.11 0 1826 0 0 0 0 0 0 0 0 0 0 1194.57 0 0 0 0 0 0 0 0 0 0 0 0 
0 0 0 0 2120.35 0 0 0 0 0 1362.42 0 0 0 1561.4 0 0 0.05 0 0 0 0 0 0 0 1770 0 0 0 0 0 0 0 0 0 0 0 0 1070.97 0 0 0 0 0 0 0 0 0 0 
0 -2482.15 0 0 0 0 0 0 0 0 0 0 0 0 0 0 0 0 0.04 0 2100.36 0 0 0 0 0 0 0 0 0 921.583 0 0 0 0 2009.57 0 0 0 0 0 0 0 0 0 0 0 0 1075.4 
0 -1084.55 0 0 0 0 0 0 0 0 0 0 0 0 0 0 0 0 0 0.01 0 0 0 1740.39 1769.54 -591.372 0 0 0 60.1978 0 0 0 0 1072.34 0 0 0 0 757.088 0 0 0 0 0 0 0 0 0 
0 0 0 0 0 788.522 0 0 0 0 0 0 0 0 0 1465.73 2433.16 0 2270.5 0 0.07 0 0 0 0 0 0 0 0 0 0 0 0 0 0 0 0 0 0 0 0 0 0 0 0 0 0 0 0 
0 0 0 -1285.06 0 0 0 0 0 1157.49 0 0 -2181.08 0 1025.19 0 0 0 0 0 0 0.06 0 0 0 2257.53 0 0 0 0 0 0 0 0 2073.2 0 0 0 383.999 0 0 0 0 0 0 0 0 0 0 
1183.13 0 -364.772 0 0 1403.01 0 0 947.218 0 0 0 0 -1161.15 0 0 0 0 0 0 0 0 0.02 0 0 0 0 0 0 -1062.88 0 0 0 0 0 877.636 0 0 0 0 0 0 0 0 0 0 0 0 0 
0 2162.31 0 2436.83 0 0 0 0 0 0 0 2166.43 0 0 0 1089.43 2391.2 0 0 -840.251 0 0 0 0.05 0 0 0 0 1534.24 0 0 0 0 0 0 -2474.67 1262.32 0 0 0 0 0 0 0 0 0 0 0 0 
0 2477.87 0 0 0 0 0 0 1007.95 -2027.27 -1478.24 0 0 1572.54 0 0 0 0 0 1560.18 0 0 0 0 0.06 -228.202 427.183 0 -639.134 0 -2087.24 0 0 0 0 0 0 0 0 0 0 0 0 0 0 0 0 0 0 
0 0 0 0 0 0 0 0 329.981 1064.41 0 0 0 0 0 -1312.83 -246.971 1833.93 0 -884.503 0 -240.867 0 0 1217 0.01 0 0 1358.91 0 0 0 0 0 0 0 0 0 0 2481.23 0 0 0 0 0 0 0 0 0 
0 0 0 0 0 0 0 0 0 -592.898 0 0 0 0 0 2238.76 0 0 0 0 0 0 0 0 436.491 0 0.03 0 0 0 0 0 0 0 0 0 0 0 0 0 0 0 0 0 0 0 0 0 0 
0 0 0 0 0 0 0 0 0 0 0 737.861 2300.1 0 0 0 0 0 0 0 0 0 0 0 0 0 0 0.01 0 0 0 -535.371 0 0 0 0 0 0 0 0 0 0 0 0 0 0 0 0 0 
0 0 0 0 1480.83 0 0 0 0 0 0 0 0 0 0 0 0 0 0 0 0 0 0 -604.801 -1932.2 -1375.85 0 0 0.06 0 1064.71 0 1301.69 0 0 2482.76 0 0 0 0 0 0 0 0 0 -37.9192 0 0 0 
0 0 0 0 0 0 0 0 1287.04 0 0 0 0 0 0 0 0 0 0 -608.005 0 0 1152.76 0 0 0 0 0 0 0 0 0 2381.28 0 0 0 0 0 0 0 0 852.916 0 0 0 0 0 0 0 
879.925 0 0 0 0 0 0 0 -29.3741 0 1756.42 0 0 0 0 0 0 0 -2471.16 0 0 0 0 0 979.11 0 0 0 1968.37 0 0 0 0 2458.95 0 0 0 -1304.44 0 0 0 0 0 0 0 0 0 0 0 
0 0 0 2304.53 0 -712.378 0 0 0 0 0 0 0 1948.38 0 0 0 0 0 0 0 0 0 0 0 0 0 2128.44 0 0 0 0.07 0 0 0 0 0 0 0 0 0 0 0 0 0 0 0 0 0 
0 0 0 0 -275.506 0 0 0 0 1451.23 -224.998 -736.183 0 0 0 0 0 0 0 0 0 0 0 0 0 0 0 0 1958.45 -915.937 0 0 0.02 0 0 0 0 816.752 0 0 0 0 0 0 0 0 0 0 0 
0 1143.3 0 0 1797.92 0 0 0 486.999 0 0 -145.65 -41.4289 0 0 0 0 0 0 0 0 0 0 0 0 0 0 0 0 0 -1426.51 0 0 0.06 0 0 0 0 1594.21 0 0 0 0 0 0 0 0 0 0 
0 1970.5 0 0 0 0 0 0 0 0 0 0 0 0 0 0 0 0 0 829.722 0 -2097 0 0 0 0 0 0 0 0 0 0 0 0 0.03 0 0 0 0 0 0 0 0 0 0 0 0 0 0 
0 0 422.605 871.532 0 0 0 0 0 0 0 0 0 2073.5 0 0 0 0 1439.63 0 0 0 -2138.66 1459.17 0 0 0 0 -1719.49 0 0 0 0 0 0 0.03 0 0 0 0 0 0 0 0 -742.897 0 0 0 0 
1279.87 0 0 0 0 0 0 0 0 0 0 0 0 0 1382.72 0 776.315 0 0 0 0 0 0 -1231.96 0 0 0 0 0 0 0 0 0 0 0 0 0.07 -396.054 0 57.1459 0 0 0 0 0 0 0 0 0 
0 0 0 0 366.298 0 464.873 0 0 2098.99 0 0 0 0 0 0 0 0 0 0 0 0 0 0 0 0 0 0 0 0 2436.06 0 1076.62 0 0 0 -131.458 0.05 0 -1397.52 0 0 0 0 0 0 0 0 0 
0 1786.94 0 0 0 0 0 0 0 0 0 0 0 2056.87 0 0 0 701.239 0 0 0 1673.41 0 0 0 0 0 0 0 0 0 0 0 333.644 0 0 0 0 0.05 0 0 0 0 0 0 0 0 0 0 
0 0 0 0 0 0 0 0 0 0 0 0 0 0 0 0 0 0 0 -289.392 0 0 0 0 0 109.638 0 0 0 0 0 0 0 0 0 0 57.6037 2482.3 0 0.03 0 0 0 0 0 0 0 0 0 
0 0 0 0 0 0 0 0 0 0 0 0 0 1495.79 0 0 0 0 0 0 0 0 0 0 0 0 0 0 0 0 0 0 0 0 0 0 0 0 0 0 0.03 0 0 0 0 0 0 0 0 
0 0 0 0 0 0 0 0 0 0 0 0 0 0 0 0 0 0 0 0 0 0 0 0 0 0 0 0 0 1175.34 0 0 0 0 0 0 0 0 0 0 0 0.05 0 920.82 0 0 0 0 0 
0 0 0 0 0 0 0 0 0 0 0 0 0 0 622.959 0 0 0 0 0 0 0 0 0 0 0 0 0 0 0 0 0 0 0 0 0 0 0 0 0 0 0 0.07 0 0 0 0 0 0 
0 0 0 0 0 0 0 0 0 0 0 0 0 0 0 0 0 0 0 0 0 0 0 0 0 0 0 0 0 0 0 0 0 0 0 0 0 0 0 0 0 686.438 0 0.08 0 0 0 0 0 
0 0 0 0 0 0 0 0 0 0 0 0 0 0 0 0 0 0 0 0 0 0 0 0 0 0 0 0 0 0 0 0 0 0 0 716.651 0 0 0 0 0 0 0 0 0.07 0 0 0 0 
0 0 0 0 0 0 0 0 0 0 0 0 0 0 0 0 0 0 0 0 0 0 0 0 0 0 0 0 2012.47 0 0 0 0 0 0 0 0 0 0 0 0 0 0 0 0 0.04 0 0 0 
0 0 0 0 0 0 1441.92 0 0 0 0 0 0 0 0 0 0 0 0 0 0 0 0 0 0 0 0 0 0 0 0 0 0 0 0 0 0 0 0 0 0 0 0 0 0 0 0.04 0 0 
0 0 1405.61 0 0 0 0 0 0 0 0 0 0 0 0 0 0 0 0 0 0 0 0 0 0 0 0 0 0 0 0 0 0 0 0 0 0 0 0 0 0 0 0 0 0 0 0 0.02 0 
0 0 0 0 0 0 0 0 0 0 0 0 0 0 0 0 0 0 1255.91 0 0 0 0 0 0 0 0 0 0 0 0 0 0 0 0 0 0 0 0 0 0 0 0 0 0 0 0 0 0.03 
