*Vertices 51
*Matrix 
0.08 0 -228.355 0 -2034.29 2412.72 0 0 0 0 0 0 1993.24 0 1762.98 0 0 0 0 0 0 1835.92 0 0 0 0 0 -977.889 -752.51 984.451 2081.9 0 0 -1104.54 0 0 -1214.41 0 0 0 0 0 0 0 0 0 0 0 0 0 0 
0 0 0 2461.55 -1485.26 0 2365.57 0 0 0 0 -955.611 0 0 0 -1152.46 0 0 0 0 0 0 0 0 1296.66 0 0 -1077.84 0 147.023 624.638 0 0 0 0 0 1379.51 0 0 0 0 0 0 509.735 0 0 0 0 0 0 0 
1741.46 0 0.09 2069.99 0 0 791.116 0 0 0 962.783 0 0 1530.88 0 -2069.69 0 0 0 0 -645.695 0 0 0 0 1730.93 -1016.95 0 0 0 0 0 0 0 -191.427 373.775 0 0 0 0 0 0 0 0 0 0 0 0 0 0 0 
0 2153.61 2230.37 0.09 0 0 -1428.8 0 2381.74 0 0 0 0 0 0 0 0 1294.82 0 0 1012.07 0 0 0 0 0 0 0 0 0 0 2181.54 2068.16 0 0 0 0 -600.833 -774.789 0 -837.046 0 -1140.86 0 0 -166.097 0 1234.86 0 2440.03 -1626.1 
-76.22 -1174.73 0 0 0.02 0 0 -1542.63 0 0 0 0 0 0 0 0 0 0 0 0 -1458.1 448.698 0 0 0 0 -922.651 0 0 -206.992 0 0 0 1808.45 0 2401.58 0 0 0 0 0 0 0 0 0 -24.7963 0 0 0 0 0 
2268.06 0 0 0 0 0.03 0 0 0 0 0 0 1718.12 426.267 0 2044.21 0 337.153 0 0 0 0 0 2179.56 0 0 0 0 0 0 0 -1134.6 0 0 0 -987.503 2412.72 0 0 -1792.12 0 0 0 0 0 0 0 -2413.02 0 894.116 -606.174 
0 1624.73 992.386 -1137.65 0 0 0 0 0 0 -202.719 0 -1817.61 0 153.127 0 0 0 0 0 0 0 0 0 0 0 0 848.338 0 0 934.095 0 0 0 0 261.62 0 0 0 0 0 0 0 205.313 0 0 0 0 0 0 0 
0 0 0 0 323.115 0 0 0.06 0 0 0 0 0 1324.27 0 265.435 2113.33 2197.1 0 0 0 -1534.24 0 0 0 2192.07 0 0 0 0 0 0 0 0 -2443.39 0 452.971 -1358 0 0 0 0 0 0 0 0 -821.177 0 0 0 0 
0 0 0 974.075 0 0 0 0 0.03 1364.41 0 0 0 0 0 0 0 0 655.614 0 0 0 0 -2182.3 0 0 0 0 -1119.34 0 0 0 0 0 652.867 1113.39 0 0 0 0 -1605.66 144.124 0 0 0 0 0 0 0 0 0 
0 0 0 0 0 0 0 0 1416.44 0.09 0 0 0 0 0 0 0 0 0 0 1774.12 0 0 0 0 0 1368.68 0 0 0 0 0 998.794 0 0 -1251.34 0 0 1346.86 0 0 0 0 0 0 0 0 0 0 0 0 
0 0 2442.17 0 0 0 -82.1711 0 0 0 0.06 1408.96 0 0 0 0 77.2881 158.467 0 0 1064.1 0 0 -815.531 0 0 0 -411.924 1106.52 0 945.54 -190.207 0 0 0 0 2286.22 -1358.61 0 0 0 -232.475 0 0 0 0 0 0 0 0 0 
0 -2117.15 0 0 0 0 0 0 0 0 1024.28 0.09 0 0 -395.138 0 0 0 2477.11 0 0 0 -1052.05 2495.12 0 1174.12 0 0 0 0 0 0 0 0 -1298.49 0 -1308.4 1573.61 1281.4 0 2285.91 0 0 0 0 0 0 0 0 0 0 
2210.53 0 0 0 0 225.761 184.103 0 0 0 0 0 0.08 0 0 0 0 0 0 359.432 0 2415.62 0 1125.9 873.821 0 0 -1040.3 0 0 0 -711.768 0 0 0 0 0 0 0 0 0 0 1577.88 0 0 0 0 0 0 0 0 
0 0 17.777 0 0 2397.46 0 1678.14 0 0 0 0 0 0.04 0 0 0 0 0 0 0 0 0 0 -1684.85 0 -44.1755 504.852 0 -956.069 0 0 1789.38 -333.033 0 0 0 0 0 0 0 0 740.76 0 0 1684.09 937.758 0 0 0 0 
-1609.93 0 0 0 0 0 -1299.1 0 0 0 0 1101.79 0 0 0.08 -2376.09 0 0 -416.196 0 0 0 -193.716 985.672 2096.85 0 0 0 -650.273 2334.13 0 -15.6407 0 0 0 0 0 0 0 0 0 0 -262.993 0 0 0 0 0 0 0 0 
0 456.023 1749.09 0 0 1937.85 0 1489.07 0 0 0 0 0 0 862.224 0.06 0 0 -398.19 0 1605.04 1659.83 0 0 0 0 0 0 0 0 0 0 0 -29.2215 0 0 0 0 526.673 0 0 0 0 0 0 0 0 0 0 0 0 
0 0 0 0 0 0 0 493.408 0 0 -1144.06 0 0 0 0 0 0.03 0 0 0 0 0 0 0 0 0 0 0 0 0 0 0 0 0 -723.67 0 0 0 1709.88 -509.43 0 1020.46 1227.53 0 0 0 0 0 -742.439 0 0 
0 0 0 1794.11 0 -2355.95 0 1706.67 0 0 1900.46 0 0 0 0 0 0 0 0 -1850.26 0 0 0 0 1992.48 0 0 0 1282.16 0 0 0 0 0 647.984 0 0 0 0 -2487.49 2397 0 0 0 0 0 -1170.16 0 0 0 0 
0 0 0 0 0 0 0 0 801.798 0 0 654.088 0 0 1952.5 433.287 0 0 0.04 0 0 0 0 1999.19 1084.4 -2423.4 0 2310.48 0 -738.319 0 2237.08 1100.12 652.104 0 0 0 0 0 -2035.36 0 0 0 0 0 0 0 0 0 0 0 
0 0 0 0 0 0 0 0 0 0 0 0 -117.42 0 0 0 0 -55.9252 0 0.02 0 0 -583.438 0 0 0 0 0 1599.55 -1038.16 0 0 0 -2333.06 0 0 2404.32 0 2467.96 0 0 0 0 0 0 0 0 0 0 0 0 
0 0 1247.52 -192.495 2021.32 0 0 0 0 -1141.16 -513.092 0 0 0 0 -2473.45 0 0 0 0 0 2253.72 0 0 1451.99 0 0 0 1891.46 0 0 0 0 0 0 0 0 2362.82 198.294 0 -645.848 0 0 0 -443.052 0 0 0 0 0 0 
-1808.3 0 0 0 1991.87 0 0 -1018.48 0 0 0 0 2172.08 0 0 1815.32 0 0 0 0 1187.7 0.08 0 0 0 913.495 0 0 0 0 0 0 0 0 0 0 0 0 0 0 0 0 0 0 0 0 0 0 0 0 0 
0 0 0 0 0 0 0 0 0 0 0 1792.28 0 0 -734.962 0 0 0 0 2286.07 0 0 0.04 0 0 0 0 2397.15 0 0 -702.918 -745.643 0 0 0 0 0 -1214.1 0 0 0 0 -493.561 0 0 0 0 0 0 0 0 
0 0 0 0 0 1974.78 0 0 1243.86 0 421.842 1572.24 -572.604 0 1569.64 0 0 0 230.491 0 0 0 0 0.01 -857.341 522.553 0 0 0 0 276.574 1947.16 2148.27 0 -2138.2 0 0 0 -1263.08 0 0 0 0 0 0 0 0 0 -821.024 908.46 -271.081 
0 -31.663 0 0 0 0 0 0 0 0 0 0 2096.09 -1798.07 1712.78 0 0 35.02 1534.24 0 1106.37 0 0 -2010.03 0.09 0 0 340.052 0 0 0 843.303 0 0 -1274.68 1505.55 0 0 0 0 177.999 0 2356.56 -350.887 -1744.36 0 0 0 65.5385 0 0 
0 0 1513.79 0 0 0 0 398.343 0 0 0 -762.734 0 0 0 0 0 0 504.852 0 0 -131.153 0 2013.08 0 0.04 0 0 -1523.87 1768.62 0 0 492.798 0 0 1858.65 -1871.17 0 0 0 0 0 0 0 0 0 0 0 0 -2450.1 0 
0 0 749.611 0 -2475.59 0 0 0 0 928.602 0 0 0 280.694 0 0 0 0 0 0 0 0 0 0 0 0 0.05 266.808 2150.26 0 0 0 0 936.537 0 1863.54 0 -440.611 111.316 0 0 0 0 0 0 0 0 0 0 0 0 
-2312.31 -870.922 0 0 0 0 -1216.24 0 0 0 2304.22 0 -1540.65 1982.86 0 0 0 0 -456.633 0 0 0 -539.338 0 1058.15 0 -1932.05 0.03 0 2258.45 0 0 1340.91 0 0 0 0 0 -1058.61 0 2030.93 0 0 0 0 0 0 0 0 0 0 
1365.17 0 0 0 0 0 0 0 -1277.28 0 -260.552 0 0 0 -2367.85 0 0 -504.547 0 -190.97 1337.7 0 0 0 0 2384.64 484.252 0 0.06 0 2463.07 0 0 0 0 1566.74 57.7563 0 0 0 0 -658.055 0 0 1212.12 0 0 0 0 0 0 
2105.7 -901.593 0 0 -402.768 0 0 0 0 0 0 0 0 1665.32 -540.406 0 0 0 2482.91 -1889.17 0 0 0 0 0 -1211.05 0 2417.6 0 0.05 909.07 0 0 0 0 13.0467 0 0 0 0 0 0 0 0 0 -319.3 -1016.04 0 0 497.681 1682.56 
623.112 2180.32 0 0 0 0 1217.76 0 0 0 555.361 0 0 0 0 0 0 0 0 0 0 0 1040.6 2472.38 0 0 0 0 -1652.96 531.251 0.07 0 0 0 0 0 -1143.45 -181.967 0 0 0 0 0 0 0 0 0 0 0 0 0 
0 0 0 -2003.62 0 579.928 0 0 0 0 33.7992 0 1686.99 0 756.172 0 0 0 -2389.68 0 0 0 2099.14 1737.04 -236.29 0 0 0 0 0 0 0.09 2074.27 2327.72 -1472.9 0 0 1019.24 0 0 0 0 -1420.71 1155.66 0 0 0 0 0 0 0 
0 0 0 218.131 0 0 0 0 0 1808.6 0 0 0 2096.55 0 0 0 0 2072.89 0 0 0 0 1725.44 0 -2068.77 0 1785.71 0 0 0 1913.43 0.08 0 0 0 0 -537.66 0 -904.492 0 0 1800.52 0 0 0 0 0 0 0 0 
-1129.87 0 0 0 2172.99 0 0 0 0 0 0 0 0 1141.62 0 619.755 0 0 -1390.04 307.092 0 0 0 0 0 0 -1473.66 0 0 0 0 2478.03 0 0.02 0 0 0 0 1429.11 0 0 -1753.52 0 0 0 0 0 0 0 0 0 
0 0 -527.894 0 0 0 0 879.772 -240.715 0 0 2130.57 0 0 0 0 -2175.59 -728.248 0 0 0 0 0 1274.07 2242.27 0 0 0 0 0 0 -306.33 0 0 0.07 1228.9 -1393.55 0 0 0 0 0 1225.39 -1729.1 0 0 0 0 0 0 -1847.82 
0 0 -189.444 0 1175.8 20.2185 1609.78 0 416.959 -735.115 0 0 0 0 0 0 0 0 0 0 0 0 0 0 2332.15 1135.36 187.307 0 1151.84 -1887.8 0 0 0 0 1350.06 0.04 0 -978.652 0 0 0 0 0 0 348.292 0 0 -33.6467 0 0 0 
-1653.57 2181.23 0 0 0 2109.36 0 1942.58 0 0 1494.57 751.747 0 0 0 0 0 0 0 -271.386 0 0 0 0 0 -1678.9 0 0 -1467.1 0 1296.2 0 0 0 338.679 0 0.07 367.214 245.903 0 0 0 0 0 0 0 0 0 0 0 0 
0 0 0 1908.55 0 0 0 -445.799 0 0 1644.11 -2120.35 0 0 0 0 0 0 0 0 1157.03 0 1361.2 0 0 0 2101.28 0 0 0 701.086 -2337.64 1938.76 0 0 -908.46 1066.85 0.06 0 0 2102.65 0 0 0 0 0 -188.376 -1142.38 0 0 0 
0 0 0 1581.7 0 0 0 0 0 -2154.53 0 -2436.67 0 0 0 2299.34 1339.99 0 0 1906.87 -883.587 0 0 -49.9741 0 0 110.096 -1123.16 0 0 0 0 0 2156.51 0 0 371.334 0 0.04 -347.53 0 0 0 156.941 0 1542.33 0 0 0 0 0 
0 0 0 0 0 -460.906 0 0 0 0 0 0 0 0 0 0 1673.86 37.1563 2072.89 0 0 0 0 0 0 0 0 0 0 0 0 0 1513.79 0 0 0 0 0 1382.72 0 -380.49 0 0 0 0 0 0 -677.129 0 0 0 
0 0 0 -686.895 0 0 0 0 -1987.9 0 0 1866.13 0 0 0 0 0 2037.03 0 0 -358.516 0 0 0 -165.944 0 0 1792.58 0 0 0 0 0 0 0 0 0 332.423 0 556.276 0.08 0 0 0 -1248.74 0 0 0 0 0 0 
0 0 0 0 0 0 0 0 2013.99 0 1673.86 0 0 0 0 0 -1222.65 0 0 0 0 0 0 0 0 0 0 0 2438.35 0 0 0 0 -829.264 0 0 0 0 0 0 0 0.08 1297.27 0 0 0 0 0 0 0 -355.007 
0 0 0 2429.81 0 0 0 0 0 0 0 0 -2027.88 277.184 -1138.57 0 242.088 0 0 0 0 0 1240.5 0 2041.15 0 0 0 0 0 0 -871.532 -2086.63 0 -746.406 0 0 0 0 0 0 2316.89 0.04 0 0 0 0 -1547.98 0 0 0 
0 2319.48 0 0 0 0 -470.672 0 0 0 0 0 0 0 0 0 0 0 0 0 0 0 0 0 2455.29 0 0 0 0 0 0 -2234.49 0 0 1274.68 0 0 0 1103.78 0 0 0 0 0.01 0 0 0 0 0 1051.59 0 
0 0 0 0 0 0 0 0 0 0 0 0 0 0 0 0 0 0 0 0 2037.34 0 0 0 850.78 0 0 0 113.91 0 0 0 0 0 0 1956.62 0 0 0 0 -526.978 0 0 0 0.02 0 0 -1820.51 0 0 0 
0 0 0 -1741.16 828.196 0 0 0 0 0 0 0 0 172.201 0 0 0 0 0 0 0 0 0 0 0 0 0 0 0 33.1889 0 0 0 0 0 0 0 0 2283.17 0 0 0 0 0 0 0.09 0 0 0 0 0 
0 0 0 0 0 0 0 2101.12 0 0 0 0 0 1220.82 0 0 0 2122.94 0 0 0 0 0 0 0 0 0 0 0 -528.962 0 0 0 0 0 0 0 89.4955 0 0 0 0 0 0 0 0 0.01 577.487 0 0 0 
0 0 0 -689.795 0 1997.51 0 0 0 0 0 0 0 0 0 0 0 0 0 0 0 0 0 0 0 0 0 0 0 0 0 0 0 0 0 1813.49 0 1074.48 0 86.1385 0 0 -2257.38 0 1647.92 0 681.097 0.06 -951.949 0 0 
0 0 0 0 0 0 0 0 0 0 0 0 0 0 0 0 498.901 0 0 0 0 0 0 1772.9 -740.455 0 0 0 0 0 0 0 0 0 0 0 0 0 0 0 0 0 0 0 0 0 0 -998.032 0.01 0 0 
0 0 0 -14.8778 0 -758.919 0 0 0 0 0 0 0 0 0 0 0 0 0 0 0 0 0 2089.07 0 1249.96 0 0 0 2468.87 0 0 0 0 0 0 0 0 0 0 0 0 0 877.331 0 0 0 0 0 0.01 0 
0 0 0 1445.43 0 1521.42 0 0 0 0 0 0 0 0 0 0 0 0 0 0 0 0 0 -1622.29 0 0 0 0 0 -1319.39 0 0 0 0 -777.688 0 0 0 0 0 0 2014.76 0 0 0 0 0 0 0 0 0.06 
