*Vertices 56
*Matrix 
0 0 0 -2427.37 0 -1628.85 0 0 0 -706.427 2162.01 0 0 0 0 -1394.92 0 0 0 0 0 0 0 0 0 0 1742.38 0 0 0 1604.89 0 -769.295 0 0 859.478 0 0 0 0 0 0 -812.937 0 0 361.568 0 2404.48 0 0 0 0 0 0 0 0 
0 0 1579.41 0 0 -1522.95 0 0 0 657.598 391.781 -2157.12 0 0 0 0 0 0 0 2012.47 -1660.74 -865.886 -2021.93 0 967.208 0 0 0 0 0 0 0 0 0 0 0 0 0 0 0 0 0 1638.62 0 0 0 0 0 1452.91 0 0 0 0 0 0 0 
0 1929.46 0.07 0 0 0 243.919 0 1304.59 0 0 0 0 0 0 -990.707 0 0 334.101 0 0 0 -988.723 0 70.2689 853.832 43.5652 0 0 1387.6 0 0 0 0 0 -916.547 0 0 2261.5 0 0 0 -1641.21 0 0 0 0 0 -310.297 0 0 1776.1 0 0 0 0 
303.125 0 0 0.07 -2417.75 0 0 -1450.01 2044.97 0 949.66 -614.719 0 -2040.54 -1539.89 -902.509 2306.51 0 0 0 0 0 2244.1 0 0 85.8333 0 48.2955 1393.25 2096.24 0 -113.758 0 1219.14 87.6644 777.23 0 0 0 0 0 1156.42 0 1695.84 -532.167 0 0 0 0 0 0 648.442 0 0 0 0 
0 0 0 -853.526 0.07 -213.706 -699.866 0 0 -1997.05 0 0 0 1742.07 1714.15 411.771 0 0 0 1698.43 0 0 980.026 1771.37 0 1000.32 0 -2063.59 -1280.18 0 0 0 0 0 -370.113 -961.257 -1885.2 0 1362.73 0 0 -2271.57 1951.28 -370.724 1849.5 0 0 -2214.35 -74.0837 0 0 0 0 0 0 0 
1550.11 2243.64 0 0 -645.543 0.03 800.729 263.756 0 381.71 0 0 1413.85 572.909 0 1838.51 0 0 0 -1352.5 0 206.076 0 0 0 0 282.22 -2305.14 -2256.77 2152.7 0 0 -253.838 184.713 0 0 323.878 0 0 0 0 379.116 0 0 0 0 0 0 1469.08 0 0 0 0 0 0 0 
0 0 2240.14 0 -2192.22 979.415 0.07 -1166.8 0 0 -533.235 0 -2374.42 0 0 -674.078 -1354.03 768.99 2347.41 0 0 0 1821.88 0 -1401.64 1859.72 0 763.649 0 348.903 0 1329.16 0 2120.66 0 0 0 -1684.55 0 1435.36 0 -1548.13 0 0 1049.91 0 0 1457.18 1792.12 0 134.968 -1201.59 0 0 0 0 
0 0 0 654.088 0 336.085 -211.875 0.06 0 0 0 0 0 1562.17 0 0 0 0 0 0 0 1027.63 0 0 0 0 0 0 0 0 1650.36 0 0 -1057.85 0 0 0 0 0 0 0 1327.94 0 -1760.99 2131.79 0 0 0 -2134.85 -1313.44 0 0 0 0 0 -1820.66 
0 0 816.294 -274.895 0 0 0 0 0.05 -561.007 0 0 0 0 0 -1402.4 0 0 2053.21 1749.09 0 2243.64 -908.002 0 0 0 0 0 0 0 0 2353.66 -1797.77 0 0 1668.98 2034.29 0 0 0 0 0 0 0 1724.83 0 1502.35 0 0 -1842.94 0 0 -1479.46 0 0 0 
-1456.72 2078.69 0 0 2119.28 515.229 0 0 2298.73 0.07 0 0 0 0 0 0 0 0 0 600.681 0 1124.23 0 0 0 0 888.318 0 0 -1473.66 0 -479.675 0 0 0 0 0 0 0 2430.88 0 695.746 0 0 0 0 0 -2389.07 0 0 0 0 0 0 0 0 
-644.78 -126.728 0 -472.503 0 0 -1512.88 0 0 0 0.09 1524.17 -1337.4 0 0 0 0 0 0 0 2308.19 0 0 0 1674.63 0 2392.57 1644.72 462.279 0 0 0 0 0 -128.254 0 0 0 0 950.575 0 0 0 0 -71.7948 0 0 0 0 0 464.721 -2030.02 0 0 0 1390.5 
0 1780.53 0 -1962.72 0 0 0 0 0 0 2398.68 0.04 746.712 0 -2285.76 0 0 0 0 0 0 0 882.977 0 -1878.03 0 -1418.27 0 0 -1231.04 0 0 0 2443.08 0 1002.76 1356.32 0 0 -2100.36 2254.48 0 0 0 0 -1789.07 0 1701.18 0 0 0 -407.804 0 0 0 0 
0 0 0 0 0 -254.601 2149.49 0 0 0 2261.5 1735.36 0.07 0 461.058 0 1586.28 0 0 0 0 0 0 0 0 758.614 1009.02 0 0 -123.218 0 206.687 0 1795.48 0 0 -2393.34 0 0 0 -1507.54 0 0 0 0 0 -862.377 1702.25 0 0 2427.37 0 0 0 0 0 
0 0 0 -407.956 1569.64 -896.405 0 1197.47 0 0 0 0 0 0.09 797.83 0 0 0 0 46.4644 132.832 0 0 1785.1 0 2443.69 212.333 0 1373.87 0 -794.473 0 0 0 0 0 0 0 1933.27 0 0 0 0 0 0 656.987 0 0 0 -844.981 0 0 0 0 0 0 
0 0 0 -1330.07 1924.73 0 0 0 0 0 0 -1944.56 -2381.28 -1438.72 0.02 0 0 0 0 1591.46 20.3711 0 2194.51 0 0 0 0 0 2498.78 0 -593.814 978.042 0 0 1972.79 0 -1308.56 1700.11 1812.57 243.156 0 0 0 0 467.925 0 0 1441.92 1403.47 -2406 2050.46 0 1175.95 0 -2463.84 0 
236.442 0 -632.267 -992.691 2355.95 1465.88 546.358 0 -342.647 0 0 0 0 0 0 0.05 0 0 0 0 0 1216.09 0 2168.87 0 -2003.16 0 0 1486.02 0 0 0 1062.27 0 0 0 0 0 0 0 0 140.156 0 0 0 -1844.31 0 0 -1612.37 -942.03 2102.04 -861.461 -1410.03 0 0 1901.53 
0 0 0 1123.62 0 0 174.947 0 0 0 0 0 2081.74 0 0 0 0 0 0 0 113.605 2216.33 0 -400.937 0 0 611.667 0 0 0 0 -913.19 -691.931 0 0 0 -899.609 1059.68 0 0 0 2185.05 0 0 984.146 0 0 0 0 -2403.87 0 2477.72 0 0 0 0 
0 0 0 0 0 0 2210.53 0 0 0 0 0 0 0 0 0 0 0.05 0 0 0 0 0 1555.6 -387.661 651.646 0 -1241.26 0 0 0 0 0 0 2140.64 0 0 0 0 0 0 0 -1953.41 0 0 0 0 32.5785 0 0 0 0 0 0 0 0 
0 0 357.753 0 0 0 2129.51 0 1912.52 0 0 0 0 0 0 0 0 0 0.05 0 -292.138 761.666 1640.29 0 463.042 0 0 -678.045 -2168.57 504.852 1647.77 0 0 0 0 0 0 -823.618 0 0 0 0 0 1997.67 0 0 865.734 0 0 -1314.97 0 0 0 0 0 0 
0 -362.178 0 0 1971.57 -934.248 0 0 -1961.81 -793.1 0 0 0 -1824.47 2122.64 0 0 0 0 0 0 0 0 0 0 -397.427 0 0 1917.4 0 -80.4926 0 0 0 0 -988.418 0 -2337.34 0 0 0 2019.79 0 -12.2837 2047.56 0 1927.93 -1626.41 2324.21 0 2312.46 2041.46 0 0 0 1954.02 
0 1703.47 0 0 0 0 0 0 0 0 1219.29 0 0 1539.74 2033.68 0 -1363.8 0 -2400.66 0 0.03 0 0 -384.762 0 0 320.215 593.509 0 -1469.08 0 0 -982.925 0 969.039 0 0 0 0 -258.415 0 -778.909 0 0 -597.476 0 0 0 493.713 0 0 0 0 0 0 0 
0 784.707 0 0 0 1416.29 0 2430.11 2083.88 619.449 0 0 0 0 0 2085.25 2256.77 0 -2345.58 0 0 0.07 0 1181.75 0 1257.13 0 0 0 0 0 0 0 -407.041 -1464.2 2282.86 0 0 2399.29 0 0 0 0 0 -1652.65 266.045 0 0 -1346.25 0 0 0 0 0 0 0 
0 -1731.24 2187.49 453.734 1509.67 0 -2141.41 0 -1702.7 0 0 1513.64 0 0 602.206 0 0 0 1726.05 0 0 0 0.01 0 952.864 0 0 0 0 0 0 0 0 0 0 0 0 0 0 -1629.15 0 0 0 0 0 0 0 0 0 591.22 0 1068.22 0 0 0 0 
0 0 0 0 697.882 0 0 0 0 0 0 0 0 2224.27 0 1288.87 323.725 -1861.55 0 0 -132.527 1885.05 0 0.05 2388 -781.503 -1173.97 0 0 0 1108.97 -203.787 -701.392 -1947.77 0 949.812 0 0 0 0 620.212 0 -2378.54 0 0 0 0 0 0 -417.264 0 0 0 0 0 0 
0 246.361 -22.0496 0 0 0 1604.43 0 0 0 1779 -427.335 0 0 0 0 0 -1835 -910.291 0 0 0 429.472 561.769 0.08 0 0 0 -283.593 0 2168.11 0 0 0 0 268.944 0 0 -1347.32 0 0 0 0 0 0 0 0 1709.42 -2384.03 0 0 0 0 -1063.49 0 0 
0 0 1317.26 1856.36 -2007.89 0 458.007 0 0 0 0 0 1528.6 -666.143 0 1025.35 0 2315.06 0 -869.701 0 786.081 0 -1981.03 0 0.06 0 1038.47 -1580.17 1131.55 0 2337.49 0 0 0 -660.955 0 -4.34889 -1365.93 0 908.307 528.504 0 0 0 0 0 0 0 0 -526.521 0 0 0 0 0 
1180.23 0 2272.79 0 0 808.664 0 0 0 1224.17 -993.759 -1708.5 -660.955 -1528.9 0 0 -1437.96 0 0 0 -673.467 0 0 -267.113 0 0 0.06 0 0 0 1297.27 0 0 0 -1414.91 0 -610.446 0 0 -1877.88 0 0 0 0 2172.38 1610.23 382.015 1383.02 0 -1183.89 1025.8 0 0 0 653.172 0 
0 0 0 1134.6 -1838.51 1559.57 1172.29 0 0 0 559.633 0 0 0 0 0 0 1167.71 -452.818 0 1471.83 0 0 0 0 1576.82 0 0.06 0 -1537.6 0 0 0 0 0 0 -1352.81 0 887.402 -992.233 -951.338 0 0 0 0 0 0 0 0 0 0 0 -208.365 0 0 0 
0 0 0 93.7681 248.955 1468.93 0 0 0 0 806.68 0 0 1451.54 -1096.91 1120.72 0 0 1001.08 -317.011 0 0 0 0 1630.38 1681.95 0 0 0.09 0 0 0 1649.14 0 1886.27 0 0 0 201.041 0 -2244.56 0 0 1461 745.033 0 0 0 0 973.159 0 0 0 0 0 0 
0 0 1510.28 -565.432 0 -1798.68 2297.05 0 0 -2219.53 0 -395.596 2.51778 0 0 0 0 0 1338.47 0 -912.58 0 0 0 0 1063.04 0 209.738 0 0.09 0 0 0 0 0 0 0 0 0 0 0 -485.168 -706.58 1896.34 0 -136.341 0 210.959 0 0 0 920.362 0 0 0 0 
444.121 0 0 0 0 0 0 -1903.21 0 0 0 0 0 2212.21 497.528 0 0 0 -1221.27 2134.69 0 0 0 2101.12 2258.45 0 -1128.19 0 0 0 0.07 0 0 0 -1530.27 890.301 0 0 0 0 0 0 0 -2456.66 2415.92 0 0 -2042.83 0 0 0 0 0 0 0 0 
0 0 0 754.036 0 0 549.715 0 -636.845 367.367 0 0 2152.55 0 2311.24 0 2448.27 0 0 0 0 0 0 2406.46 0 -2300.41 0 0 0 0 0 0 0 0 0 1959.97 0 0 0 0 0 0 0 0 -628.758 0 -1782.05 2011.86 0 0 -1884.59 2218.16 -1588.41 0 -1455.5 0 
-639.439 0 0 0 0 -2122.18 0 0 1782.05 0 0 0 0 0 0 1899.4 192.495 0 0 0 -1023.67 0 0 1990.34 0 0 0 0 110.553 0 0 0 0.07 0 0 0 -599.155 0 0 0 -1107.75 0 0 0 0 2144.92 0 0 0 -1049 1349.76 0 0 0 0 0 
0 0 0 668.584 0 1350.37 1755.96 2312.77 0 0 0 1424.38 1565.37 0 0 0 0 0 0 0 0 -1241.72 0 871.838 0 0 0 0 0 0 0 0 0 0.05 1010.7 -1161.76 0 0 0 0 0 0 0 0 0 -1324.88 -1477.63 0 0 0 0 0 0 0 -1888.26 0 
0 0 0 2130.12 -1306.12 0 0 0 0 0 -202.109 0 0 0 -441.374 0 0 899.762 0 0 -1614.81 1433.07 0 0 0 0 688.116 0 -149.159 0 -345.851 0 0 500.122 0.03 1739.63 0 0 406.125 1505.86 0 111.774 0 -105.518 0 0 0 0 0 0 1179.92 0 0 0 0 -1072.65 
-1757.48 0 1567.2 -904.035 1003.22 0 0 0 -369.503 0 0 1837.75 0 0 0 0 0 0 0 2026.2 0 -1867.96 0 1268.27 -872.753 1418.88 0 0 0 0 2140.95 228.05 0 1189.99 -2287.29 0.04 0 0 0 0 1631.14 0 0 -1724.37 0 0 0 980.789 0 1124.38 0 1896.65 0 -2095.78 0 0 
0 0 0 0 557.955 1670.51 0 0 983.993 0 0 -2197.26 -1192.13 0 394.223 0 944.472 0 0 0 0 0 0 0 0 0 -2450.56 -1281.55 0 0 0 0 2173.45 0 0 0 0.08 0 1049.61 0 0 0 0 2181.84 0 0 2116.99 2398.37 0 0 0 0 1891.16 0 0 0 
0 0 0 0 0 0 2292.17 0 0 0 0 0 0 0 -607.242 0 -695.288 0 -2195.43 1758.55 0 0 0 0 0 1923.66 0 0 0 0 0 0 0 0 0 0 0 0.05 0 -167.776 159.383 -696.356 0 0 0 0 2291.41 0 2153 0 -789.132 0 0 0 0 0 
0 0 -611.057 0 1550.42 0 0 0 0 0 0 0 0 -1399.66 2156.06 0 0 0 0 0 0 -1883.07 0 0 -1119.34 26.3222 0 -992.996 654.546 0 0 0 0 0 -1678.9 0 -1255.76 0 0.05 0 0 1351.13 0 0 0 0 2452.7 0 0 590.152 1419.64 0 0 0 0 0 
0 0 0 0 0 0 1021.53 0 0 838.267 1451.69 -887.555 0 0 1894.51 0 0 0 0 0 703.223 0 2194.36 0 0 0 801.95 -1501.28 0 0 0 0 0 0 -178.457 0 0 -1878.03 0 0.07 0 -2175.59 0 0 0 0 -199.362 263.604 0 0 0 2489.78 -2037.19 0 0 0 
0 0 0 0 0 0 0 0 0 0 0 985.214 570.925 0 0 0 0 0 0 0 0 0 0 387.204 0 -1170.46 0 803.018 799.509 0 0 0 1841.11 0 0 -1719.03 0 -656.377 0 0 0.09 1317.87 0 1702.4 0 1474.88 0 0 0 0 0 0 0 -701.239 0 0 
0 0 0 799.814 1797.46 -2315.36 1759.16 556.124 0 -17.777 0 0 0 0 0 -1061.36 -403.378 0 0 -732.368 1916.03 0 0 0 0 -46.9222 0 0 0 -343.562 0 0 0 0 355.159 0 0 1801.13 -2429.04 1864.6 1927.63 0.01 0 -1057.24 0 1765.72 0 0 0 1626.56 0 154.958 0 0 -338.679 0 
-251.549 44.0229 -264.824 0 -453.276 0 0 0 0 0 0 0 0 0 0 0 0 1321.07 0 0 0 0 0 2278.74 0 0 0 0 0 2281.33 0 0 0 0 0 0 0 0 0 0 0 0 0.05 -1217.76 0 0 0 0 646.763 0 1528.29 0 0 -1758.25 0 0 
0 0 0 -2357.78 2425.69 0 0 386.593 0 0 0 0 0 0 0 0 0 0 1294.21 -906.171 0 0 0 0 0 0 0 0 1124.38 2352.6 819.346 0 0 0 660.344 184.866 1050.22 0 0 0 863.445 -1926.71 -942.488 0.08 0 -1964.4 0 0 0 0 1760.08 0 0 0 0 0 
0 0 0 2205.5 2092.27 0 560.396 -2390.74 -285.424 0 1942.58 0 0 0 -1482.21 0 -1016.65 0 0 1781.59 1516.69 -1609.47 0 0 0 0 -338.679 0 1112.17 0 -1358.15 112.079 0 0 0 0 0 0 0 0 0 0 0 0 0.02 0 0 0 0 0 0 0 0 0 0 0 
-604.343 0 0 0 0 0 0 0 0 0 0 -1513.95 0 1900.62 0 -123.524 0 0 0 0 0 1855.91 0 0 0 0 2248.07 0 0 -432.981 0 0 -401.242 -2286.37 0 0 0 0 0 0 -37.7667 2444.61 0 1659.22 0 0.05 -1062.27 -1971.27 -1285.67 869.396 0 0 0 0 0 0 
0 0 0 0 0 0 0 0 29.9844 0 0 0 329.066 0 0 0 0 0 2467.5 1737.8 0 0 0 0 0 0 1690.95 0 0 0 0 755.562 0 -390.255 0 0 -247.581 2313.68 -1957.99 376.37 0 0 0 0 0 -93.1578 0.04 0 0 0 0 48.2955 0 0 0 0 
2177.72 0 0 0 2083.12 0 -1063.65 0 0 1818.06 0 -254.448 2119.74 0 290.307 0 0 -221.03 0 1306.12 0 0 0 0 -599.765 0 -267.266 0 0 -1164.66 1211.81 221.641 0 0 0 1082.26 1412.78 0 0 385.983 0 0 0 0 0 2022.23 0 0.05 -1143.45 0 -1460.23 584.506 0 0 0 2252.34 
0 -1418.42 -37.0037 0 -964.156 1218.07 1720.4 -657.598 0 0 0 0 0 0 2068.16 -253.38 0 0 0 289.697 -1677.68 1881.69 0 0 1779 0 0 0 0 0 0 0 0 0 0 0 0 963.24 0 0 0 0 -1253.17 0 0 -2279.81 0 126.576 0.02 0 0 0 0 0 371.487 2003.92 
0 0 0 0 0 0 0 -1047.78 1541.87 0 0 0 0 878.857 347.53 -1654.48 -779.214 0 2424.92 0 0 0 -1395.99 -733.894 0 0 -2498.63 0 1182.21 0 0 0 2171.62 0 0 -2351.83 0 0 1505.55 0 0 145.802 0 0 0 1570.56 0 0 0 0.07 0 0 2290.19 0 0 0 
0 0 0 0 0 0 -45.7015 0 0 0 -1129.87 0 969.344 0 -218.741 539.796 0 0 0 1278.8 0 0 0 0 0 871.99 -1869.18 0 0 0 0 2406.46 2316.74 0 245.14 0 0 -1890.24 1933.88 0 0 0 1883.83 2456.66 0 0 0 1446.81 0 0 0.06 0 0 0 0 0 
0 0 -1674.63 -258.415 0 0 2208.55 0 0 0 -1697.52 450.377 0 0 0 1412.78 -1912.06 0 0 453.581 0 0 664.617 0 0 0 0 0 0 535.981 0 1370.97 0 0 0 1611.45 0 0 0 775.094 0 164.876 0 0 0 0 2242.88 -1476.87 0 0 0 0.06 0 0 -740.303 0 
0 0 0 0 0 0 0 0 -297.479 0 0 0 0 0 -944.319 1638.16 0 0 0 0 0 0 0 0 0 0 0 1127.43 0 0 0 1045.64 0 0 0 0 840.403 0 0 1423.46 0 0 0 0 0 0 0 0 0 -1249.81 0 0 0.08 -1401.94 0 0 
0 0 0 0 0 0 0 0 0 0 0 0 0 0 0 0 0 0 0 0 0 0 0 0 1226.31 0 0 0 0 0 0 0 0 0 0 1976.76 0 0 0 0 1738.26 0 -1972.79 0 0 0 0 0 0 0 0 0 1307.79 0.03 0 0 
0 0 0 0 0 0 0 0 0 0 0 0 0 0 632.725 0 0 0 0 0 0 0 0 0 0 0 797.983 0 0 0 0 499.207 0 2258.14 0 0 0 0 0 0 0 2456.21 0 0 0 0 0 0 1629.46 0 0 -259.026 0 0 0.03 0 
0 0 0 0 0 0 0 -823.313 0 0 -1150.01 0 0 0 0 753.883 0 0 0 20.3711 0 0 0 0 0 0 0 0 0 0 0 0 0 0 1251.64 0 0 0 0 0 0 0 0 0 0 0 0 -1099.35 1826.61 0 0 0 0 0 0 0 
