*Vertices 51
*Matrix 
0.07 0 0 0 0 0 0 0 55.0096 0 0 0 0 0 1835.46 0 0 0 0 1587.34 0 0 0 0 0 0 0 152.364 0 351.497 0 0 0 0 0 0 0 0 1876.81 -1158.1 0 -1489.99 0 0 0 0 -1140.4 0 0 0 -85.5281 
0 0.02 1169.85 0 0 1438.26 0 2454.99 2140.49 0 0 0 0 0 -994.369 -1038.93 0 0 -2039.78 0 0 -891.98 0 0 0 0 1509.98 0 0 1256.22 0 0 0 0 173.269 0 0 2383.72 0 0 0 0 0 0 429.014 -510.651 0 0 0 0 0 
0 2426.45 0.08 0 0 -80.34 0 615.329 947.829 0 2022.39 -674.535 0 2087.85 0 2341.46 0 0 2357.17 1965.62 0 0 0 0 0 1999.8 0 0 0 766.854 0 0 0 0 0 2219.23 -2337.18 0 0 867.718 0 0 0 0 0 -541.169 0 0 0 0 0 
0 0 0 0.01 17.3193 0 0 554.14 0 0 0 2024.06 0 1494.26 1158.25 0 -1528.9 0 0 0 1731.85 0 0 0 0 0 0 0 0 0 337.306 0 0 1533.63 0 0 0 703.833 0 0 0 0 0 -2029.1 0 0 0 0 0 0 0 
0 0 0 -595.95 0.06 1683.48 0 0 0 0 0 0 1593.75 0 -754.036 0 0 0 0 2111.8 0 0 0 0 -721.229 1850.87 0 0 0 0 0 0 0 230.644 612.888 0 0 0 0 0 0 0 0 0 0 0 0 -885.876 0 0 0 
0 1520.51 1442.84 0 1428.19 0.06 0 -210.501 0 2166.28 0 0 0 0 1785.56 0 0 2184.74 0 -2189.93 0 1000.63 0 0 -22.5074 2316.28 0 0 0 0 0 0 0 482.879 -664.922 2118.37 0 0 0 0 0 0 0 0 0 0 1804.94 0 0 0 0 
0 0 0 0 0 0 0.06 86.4437 0 0 0 0 0 2176.66 0 0 2406.92 0 0 0 0 -2017.81 0 2374.26 0 431.913 -15.7933 0 0 0 0 0 1111.41 2249.9 0 0 994.98 0 0 0 361.415 0 0 213.706 0 0 2080.07 0 0 0 0 
0 1731.85 1233.79 -2079 0 170.827 936.995 0.01 0 0 241.478 0 2200.61 0 153.127 -415.891 0 0 0 0 0 0 0 0 0 1953.26 803.171 -1205.25 0 0 0 0 0 0 0 0 -673.62 0 0 1786.32 0 0 2194.81 0 882.977 0 0 -1077.38 0 980.026 0 
-267.113 -819.956 -264.519 0 0 0 0 0 0.04 0 2118.21 -263.451 0 0 0 0 0 -1865.21 0 0 0 0 0 -797.067 304.193 0 0 0 0 0 2443.54 2408.9 879.009 0 0 0 0 -1435.67 0 0 0 0 1649.91 0 1448.79 -1110.03 0 -754.189 0 0 0 
0 0 0 0 0 -1183.13 0 0 0 0.04 0 0 0 -254.143 1056.78 0 0 0 0 0 2287.9 0 0 0 0 0 0 0 0 274.743 0 0 0 -715.735 0 0 1516.24 0 0 0 0 0 0 0 -2329.86 1526.15 0 0 0 -2084.03 0 
0 0 1543.09 0 0 0 0 1176.11 916.395 0 0.05 0 0 1450.47 0 0 0 0 0 0 0 0 0 0 -1160.24 0 2446.59 0 0 -558.718 0 0 0 0 0 0 0 817.515 0 0 -2045.73 2098.68 0 0 0 892.895 0 0 0 0 0 
0 0 -1414.61 -1780.07 0 0 0 0 1986.98 0 0 0.07 0 0 49.3637 1774.88 0 0 0 1.44963 0 1807.23 0 0 0 0 0 0 0 2221.21 0 0 500.427 -1548.28 0 0 0 0 0 0 -48.9059 0 0 0 0 0 1833.02 0 0 0 0 
0 0 0 0 -1984.54 0 0 2498.47 0 0 0 0 0.08 0 1702.7 0 1721.02 0 0 0 0 0 0 0 0 0 817.667 0 -1536.38 0 0 0 2000.56 0 0 -1152.3 0 0 0 -579.165 -1977.98 0 0 0 -146.718 0 -1543.55 2015.37 0 0 0 
0 0 108.57 1002.3 0 0 2366.63 0 0 597.476 1714.15 0 0 0.03 2205.04 0 0 0 -839.641 -1775.19 1476.56 0 0 0 0 0 611.362 0 0 0 0 1374.17 0 0 0 0 0 -1753.36 0 0 0 0 0 0 0 0 0 0 -1294.21 0 0 
17.6244 1677.68 0 -954.695 -2319.33 -2424.16 0 228.813 0 1646.55 0 -2011.7 92.8526 2495.42 0.08 677.129 0 -44.4807 0 0 0 0 0 1485.26 0 0 1380.12 0 1494.87 -2489.47 0 0 0 0 0 0 0 0 636.54 2380.52 1220.36 1621.07 0 0 0 0 0 0 0 0 0 
0 746.559 420.927 0 0 0 0 425.504 0 0 0 -1800.67 0 0 599.765 0.02 0 0 0 0 -388.73 0 0 1700.57 0 0 0 1583.07 0 0 0 -2477.87 2279.81 0 2442.17 0 0 0 0 0 0 0 0 257.805 0 -1429.87 0 504.395 0 92.3948 0 
0 0 0 1873.61 0 0 1701.33 0 0 0 0 0 -1277.73 0 0 0 0.01 2444.61 0 0 0 0 0 -328.761 0 0 -1993.85 0 0 0 0 0 0 -2020.86 0 35.3252 0 0 0 0 1577.12 -1387.91 0 0 -695.898 0 0 0 0 1133.38 0 
0 0 0 0 0 -2028.34 0 0 2017.96 0 0 0 0 0 239.952 0 -53.4837 0.07 -35.02 -123.981 -396.359 0 1305.96 0 0 0 0 0 0 0 0 0 0 0 0 0 0 0 0 1093.4 0 0 0 0 0 0 2489.01 0 0 0 0 
0 2195.73 -2216.64 0 0 0 0 0 0 0 0 0 0 -1536.38 0 0 0 1910.84 0.08 0 0 0 0 0 0 0 0 0 0 0 1828.9 0 0 449.919 0 725.196 0 0 0 0 -1412.17 0 0 0 -902.356 0 0 1427.12 0 0 0 
-394.223 0 1298.94 0 -627.232 -306.787 0 0 0 0 0 527.131 0 160.604 0 0 0 2165.82 0 0.04 0 0 0 0 0 1952.35 -672.552 0 0 0 0 0 0 0 0 -799.966 0 1827.98 0 -1955.7 43.8704 0 0 0 -1011.15 0 -328.761 0 0 248.65 -563.143 
0 0 0 -874.737 0 0 0 0 0 249.413 0 0 0 -2200.61 0 -1797.46 0 1849.35 0 0 0.01 1056.32 1822.95 -165.487 1989.27 0 580.081 0 0 0 2084.8 0 0 0 0 0 0 0 0 0 0 0 0 0 0 0 0 0 -1722.24 0 0 
0 -202.414 0 0 0 1532.87 -1264.31 0 0 0 0 246.208 0 0 0 0 0 0 0 0 1736.58 0.07 -678.045 533.998 0 0 0 0 0 0 -1121.94 0 0 0 0 0 72.4052 0 0 0 11.3681 1975.39 0 0 0 0 0 0 0 0 0 
0 0 0 0 0 0 0 0 0 0 0 0 0 0 0 0 0 959.883 0 0 1264.46 2141.87 0.02 0 0 1824.78 0 0 -2013.38 0 0 0 0 0 -792.032 0 0 0 952.254 0 0 0 0 0 0 404.141 215.842 0 -1230.74 0 0 
0 0 0 0 0 0 1251.18 0 1701.18 0 0 0 0 0 1698.28 1258.81 1957.84 0 0 0 1599.55 -248.802 0 0.09 0 208.975 0 0 0 0 0 0 0 0 0 250.633 404.904 0 0 0 0 0 0 163.045 2162.01 0 0 -724.738 0 0 0 
0 0 0 0 2412.26 1217 0 0 -1807.54 0 1780.07 0 0 0 0 0 0 0 0 0 955.153 0 0 0 0.05 1956.01 0 0 0 0 0 -1487.09 0 0 0 0 1179.31 0 0 0 0 0 0 0 0 0 -1916.03 0 0 0 0 
0 0 -984.756 0 -981.094 933.332 -1448.18 1389.43 0 0 0 0 0 0 0 0 0 0 0 1688.67 0 0 150.075 -1394.31 683.844 0.06 0 0 0 0 0 0 0 0 -1319.39 0 0 1045.79 1049.15 0 0 0 0 0 0 0 2267.14 0 0 886.334 0 
0 1381.65 0 0 0 0 -2317.19 1726.36 0 0 1773.05 0 -164.113 969.955 1684.55 0 2212.82 0 0 -1192.89 -716.041 0 0 0 0 0 0 0 2073.35 0 0 0 171.59 0 0 0 0 0 0 0 1816.08 0 0 0 0 2174.21 1140.71 0 0 0 0 
-848.033 0 0 0 0 0 0 -283.898 0 0 0 0 0 0 0 1494.87 0 0 0 0 0 0 0 0 0 0 0 0.07 -2131.95 0 1855.75 1867.96 0 0 0 0 0 0 0 0 0 0 -1226 0 0 2099.9 0 0 0 0 0 
0 0 0 0 0 0 0 0 0 0 0 0 2113.18 0 1775.8 0 0 0 0 0 0 0 620.365 0 0 0 -501.038 -898.389 0.01 0 0 2253.72 0 0 0 0 0 0 0 0 0 -889.081 2027.88 -342.952 0 0 0 2022.23 0 0 1921.52 
552.461 -1721.63 1296.2 0 0 0 0 0 0 700.629 29.9844 1371.58 0 0 72.5578 0 0 0 0 0 0 0 0 0 0 0 0 0 0 0 -271.538 0 317.316 0 1244.47 1238.06 0 0 0 0 155.873 2118.67 0 0 0 0 -1349.45 1334.8 0 0 0 
0 0 0 269.402 0 0 0 0 -179.678 0 0 0 0 0 0 0 0 0 1104.85 0 73.7785 1909.92 0 0 0 0 0 -726.569 0 2001.48 0.07 0 0 -2147.21 0 -2214.35 -2285.3 -2333.52 2279.81 2423.4 -555.666 1018.94 0 1145.74 0 2017.04 1803.42 0 0 0 0 
0 0 0 0 0 0 0 0 671.178 0 0 0 0 -535.524 0 815.836 0 0 0 0 0 0 0 0 -76.6778 0 0 1823.1 812.937 0 0 0.03 0 29.3741 212.333 0 401.395 0 0 0 0 0 0 0 0 0 0 307.855 0 0 0 
0 0 0 0 0 0 1845.68 0 433.744 0 0 -1276.67 746.406 0 0 183.187 0 0 0 0 0 0 0 0 0 0 -1426.21 0 0 316.706 0 0 0.03 0 0 -586.184 0 0 2039.78 0 0 2420.19 0 0 1870.56 1064.71 0 0 0 0 2440.03 
0 0 0 1336.33 785.928 -1081.8 2494.96 0 0 2166.59 0 2147.66 0 0 0 0 2163.99 0 -1442.23 0 0 0 0 0 0 0 0 0 0 0 -1124.07 323.42 0 0.07 0 -333.949 0 0 1342.74 0 0 0 0 0 -2308.19 0 0 0 0 0 0 
0 -1261.86 0 0 2376.86 -589.541 0 0 0 0 0 0 0 0 0 566.195 0 0 0 0 0 0 2389.22 0 0 -1520.2 0 0 0 -700.934 0 1188.62 0 0 0.06 0 0 0 0 0 0 2122.64 0 0 -110.706 0 1050.52 0 0 0 0 
0 0 -313.807 0 0 1098.44 0 0 0 0 0 0 2113.94 0 0 0 -978.195 0 366.146 1464.96 0 0 0 2107.07 0 0 0 0 0 -344.172 -1432.62 0 148.549 -835.978 0 0.09 0 0 0 0 0 0 0 0 2290.03 0 0 0 1226 0 0 
0 0 905.866 0 0 0 1201.74 962.325 0 -1804.33 0 0 0 0 0 0 0 0 0 0 0 -1118.12 0 1497.62 695.898 0 0 0 0 0 124.592 1966.54 0 0 0 0 0.08 -1329.62 1068.38 1464.05 0 0 0 0 0 0 0 0 -2112.72 -883.435 0 
0 -1886.43 0 88.7326 0 0 0 0 1418.88 0 -1972.18 0 0 470.061 0 0 0 0 0 2039.17 0 0 0 0 0 1377.68 0 0 0 0 310.144 0 0 0 0 0 -879.772 0.08 0 927.839 -1334.5 0 1915.88 2343.13 0 -2334.44 0 0 0 0 0 
-231.712 0 0 0 0 0 0 0 0 0 0 0 0 0 1204.95 0 0 0 0 0 0 0 661.107 0 0 328.761 0 0 0 0 -2028.64 0 -1828.29 38.9874 0 0 -1781.9 0 0.01 0 0 0 2442.01 0 1235.31 0 0 1922.9 0 0 0 
-9.38444 0 -72.7104 0 0 0 0 -740.455 0 0 0 0 2026.2 0 -227.592 0 0 1681.34 0 -515.229 0 0 0 0 0 0 0 0 0 0 957.442 0 0 0 0 0 -1446.81 -1949.6 0 0.06 2015.37 0 2391.81 0 0 0 116.047 0 0 0 0 
0 0 0 0 0 0 -770.516 0 0 0 191.58 2398.98 1775.64 0 67.0644 0 2323.15 0 -1853.77 -1545.53 0 127.796 0 0 0 0 -11.3681 0 0 1576.05 -1693.85 0 0 0 0 0 0 -415.128 0 -1517.76 0.06 0 0 1358.3 0 0 0 0 0 0 0 
106.891 0 0 0 0 0 0 0 0 0 436.186 0 0 0 -1016.04 0 -1970.5 0 0 0 0 -1753.67 0 0 0 0 0 0 978.042 -172.658 381.1 0 1308.56 0 261.162 0 0 0 0 0 0 0.01 1985.31 97.1252 0 0 0 2315.67 0 0 0 
0 0 0 0 0 0 0 1938 1610.84 0 0 0 0 0 0 0 0 0 0 0 0 0 0 0 0 0 0 243.004 1407.59 0 0 0 0 0 0 0 0 2301.93 1710.94 1990.34 0 1000.17 0 0 0 2157.58 801.187 0 0 777.078 1907.18 
0 0 0 1400.88 0 0 6.79037 0 0 0 0 0 0 0 0 -1440.7 0 0 0 0 0 0 0 1297.42 0 0 0 0 -147.633 0 -737.404 0 0 0 0 0 0 2482.91 0 0 -2198.02 943.403 0 0.03 0 223.624 0 0 0 0 0 
0 -411.618 0 0 0 0 0 2275.69 -569.704 1054.8 0 0 1046.1 0 0 0 1681.8 0 2212.06 -2287.59 0 0 0 -2036.88 0 0 0 0 0 0 0 0 1647.77 1853.01 -478.301 20.3711 0 0 486.847 0 0 0 0 0 0.09 0 0 136.647 -754.036 0 -661.87 
0 2012.62 2351.83 0 0 0 0 0 234.611 2425.23 -1587.34 0 0 0 0 2450.25 0 0 0 0 0 0 -96.057 0 0 0 -1994.46 -454.344 0 0 511.567 0 -2042.07 0 0 0 0 2456.51 0 0 0 0 1994.16 2118.21 0 0.07 778.146 2223.65 0 0 0 
961.409 0 0 0 0 2007.13 112.842 0 0 0 0 -685.827 1295.89 0 0 0 0 1091.27 0 1471.53 0 0 -1610.39 0 -538.423 2455.29 834.758 0 0 -1043.5 1611.45 0 0 0 -119.861 0 0 0 0 1122.09 0 0 -1122.09 0 0 -1247.37 0.07 0 0 0 0 
0 0 0 0 1458.25 0 0 -1835.61 -902.814 0 0 0 -497.223 0 0 -172.658 0 0 2312.01 0 0 0 0 358.974 0 0 0 0 442.747 -1324.27 0 -20.5237 0 0 0 0 0 0 1236.38 0 0 -1112.17 0 0 2383.27 1804.79 0 0.01 0 0 0 
0 0 0 0 0 0 0 0 0 0 0 0 0 -314.57 0 0 0 0 0 0 1185.11 0 893.201 0 0 0 0 0 0 0 0 0 0 0 0 -1130.48 -876.263 0 0 0 0 0 0 0 541.322 0 0 0 0.06 0 0 
0 0 0 0 0 0 0 1285.06 0 -537.66 0 0 0 0 0 -279.473 715.888 0 0 515.687 0 0 0 0 0 1828.14 0 0 0 0 0 0 0 0 0 0 -1277.28 0 0 0 0 0 1172.9 0 0 0 0 0 0 0.02 0 
-799.051 0 0 0 0 0 0 0 0 0 0 0 0 0 0 0 0 0 0 869.396 0 0 0 0 0 0 0 0 -1127.28 0 0 0 1585.21 0 0 0 0 0 0 0 0 0 2008.04 0 434.507 0 0 0 0 0 0.02 
