*Vertices 60
*Matrix 
0.05 0 0 0 0 0 694.372 0 0 0 -1272.55 -1594.67 0 2027.12 1629.46 2021.62 0 -1675.24 0 0 461.364 0 0 0 1172.6 0 1149.1 -857.036 0 0 0 0 0 0 0 0 0 0 -746.101 0 0 0 0 0 0 1253.17 0 0 0 0 0 209.891 0 416.959 0 0 0 0 0 0 
0 0.05 0 0 -5.72222 0 0 0 701.849 984.909 -1083.33 0 0 0 0 -170.064 0 0 2133.32 0 -53.7889 0 0 -652.104 -664.159 -1714.15 1987.75 0 0 0 1625.03 0 0 0 0 0 0 0 0 0 0 0 0 0 0 0 0 0 0 0 0 531.098 0 0 0 0 0 0 0 0 
0 0 0.02 0 0 0 0 0 0 0 0 0 200.278 0 -207.755 0 2424.77 1196.4 0 0 1923.51 975.906 0 0 0 0 0 0 0 0 0 2498.78 0 0 0 1027.94 2211.29 0 0 1549.96 0 0 0 0 0 0 0 0 0 0 0 0 0 0 0 0 -2351.68 0 0 0 
0 0 0 0.08 0 2362.51 2080.68 -844.981 0 0 0 0 1590.55 0 -2068.93 0 0 -1252.86 0 -301.141 0 626.621 -1793.19 1531.04 0 0 0 0 1963.03 0 -123.676 0 0 0 0 641.881 0 -520.417 0 -1209.07 0 0 0 0 0 0 0 1459.32 0 0 0 0 0 0 0 0 0 2425.38 0 0 
0 1507.39 0 0 0.09 1725.75 753.883 -1919.23 0 1151.54 0 0 2348.02 0 0 0 1573.31 0 0 0 0 0 0 0 0 0 2294.31 985.977 727.79 2242.27 0 1519.9 0 0 0 0 -1564.91 0 0 0 2062.21 0 0 0 0 0 0 0 0 0 2328.49 0 0 0 0 2344.2 0 0 0 0 
0 0 0 2478.64 1531.5 0.08 0 0 0 0 0 1208.15 0 -2102.19 0 0 0 -1021.99 0 438.169 0 0 0 0 1914.66 0 -522.553 0 0 0 2021.62 0 0 0 0 0 0 0 0 0 0 0 1343.96 0 0 0 0 0 0 0 0 0 0 177.236 0 -716.498 0 0 0 0 
361.568 0 0 -2044.36 1748.02 0 0.05 952.101 0 0 2294.46 0 0 0 -1354.95 1074.02 -922.04 0 0 1831.34 0 637.15 1805.09 0 0 0 0 0 0 0 0 0 0 0 0 0 0 0 0 0 0 0 0 0 0 0 -413.602 0 0 0 0 0 0 0 0 0 1622.29 0 0 0 
0 0 0 -690.863 1714.15 0 385.83 0.05 0 0 0 478.149 0 -542.39 2273.4 -361.568 0 0 0 0 -2145.07 1444.06 0 1490.91 0 0 0 1070.06 0 1317.56 0 0 0 0 0 0 0 0 0 0 0 646.153 -336.848 0 0 0 0 0 0 0 -1715.83 0 0 0 0 0 -1853.77 0 0 0 
0 -1095.23 0 0 0 0 0 0 0.09 623.112 1047.93 0 -701.086 0 2172.84 0 0 0 1238.67 2074.88 0 0 0 -306.024 0 0 0 0 0 0 -565.127 0 0 0 -2255.7 0 0 49.5163 0 0 0 3.12815 2365.87 0 0 -945.692 0 0 934.553 0 0 0 0 1931.59 0 0 0 2186.88 0 0 
0 2277.06 0 0 -981.094 0 0 0 -507.141 0 19.7607 0 0 -609.989 0 0 892.59 1319.85 191.427 365.078 0 0 0 0 0 0 622.044 0 2144.76 0 0 0 0 0 0 0 0 0 0 0 0 -98.6511 0 -1478.7 0 0 1752.75 0 2027.57 0 0 0 0 0 0 0 0 0 0 491.729 
1851.18 -2411.65 0 0 0 0 653.478 0 -304.956 481.506 0 0 2384.79 0 0 0 0 1099.66 0 0 0 1528.9 1160.08 0 1236.99 0 0 0 -9.84222 1915.11 1859.57 73.6259 0 0 0 0 0 0 2435 0 0 0 -542.695 0 0 0 0 1768.62 0 0 0 -87.054 0 -1406.67 0 0 0 0 -708.411 0 
1641.67 0 0 0 0 2214.65 0 1831.95 0 0 0 0.09 0 1822.49 -937.147 0 0 0 0 0 0 -1121.63 0 0 -1905.96 0 0 1136.89 2090.75 0 -2385.56 0 0 0 0 0 0 0 -1710.03 0 -850.475 0 0 0 0 0 0 0 0 0 0 736.793 0 0 0 0 0 915.632 0 1346.55 
0 0 2259.51 -322.81 -143.666 0 0 0 1327.02 0 -27.543 0 0.02 0 0 0 0 -173.116 0 0 1392.03 0 0 -1214.41 0 0 0 700.934 0 0 0 0 0 0 0 0 0 2150.72 -2497.71 0 0 0 0 0 0 0 0 0 0 0 1758.25 0 -505.463 0 0 0 0 0 0 0 
1624.58 0 0 0 0 -121.54 0 1460.69 0 2310.79 0 1783.12 0 0.08 0 0 605.716 0 0 0 0 0 0 -1813.79 0 0 0 -998.184 815.226 -2458.65 1831.64 0 0 0 0 0 0 0 0 0 0 65.5385 0 0 0 0 0 0 0 0 0 0 0 0 0 0 0 0 0 0 
1353.11 0 1400.88 310.297 0 0 -760.598 1272.24 -661.565 0 0 316.401 0 0 0.01 0 -550.478 603.122 0 0 0 0 0 0 1997.82 0 0 900.372 0 0 0 0 0 0 0 0 0 0 0 0 0 0 0 0 0 0 0 1168.02 0 0 0 0 0 0 0 1830.88 0 0 0 0 
440.458 -1771.22 0 0 0 0 702.46 1451.54 0 0 0 0 0 0 0 0.07 0 0 0 -1484.65 -273.675 784.707 0 0 0 0 0 0 0 0 1378.29 0 0 0 -844.523 0 0 0 0 0 0 0 0 0 0 0 0 0 459.532 0 1471.68 0 200.125 0 0 0 0 0 0 0 
0 0 1535.31 0 -1297.88 0 -750.526 0 0 2187.03 0 0 0 2285.91 1601.08 0 0.05 0 0 0 0 0 0 0 0 0 0 1631.14 0 0 0 0 0 1729.56 0 0 0 0 0 0 1224.02 0 0 -83.8496 0 0 0 0 0 0 0 0 0 0 0 0 0 0 0 -2220.15 
1525.54 0 578.249 1904.43 0 -1896.04 0 0 0 2364.8 -951.949 0 12.1311 0 -2355.19 0 0 0.03 0 0 0 0 163.503 0 0 963.393 0 0 0 382.015 0 0 0 0 0 0 0 0 899.304 0 0 0 0 0 0 0 0 0 0 0 0 0 700.781 0 0 0 0 0 0 0 
0 1507.23 0 0 0 0 0 0 -934.706 42.3444 0 0 0 0 0 0 0 0 0.07 2152.7 0 -1242.03 1246.45 1347.01 0 0 844.981 1412.93 0 0 0 0 0 0 0 0 0 90.1059 0 0 0 0 0 0 0 -2275.54 193.869 0 0 0 0 2058.7 -2291.86 0 0 0 0 0 0 0 
0 0 0 1513.34 0 937.147 1459.01 0 1814.4 -607.395 0 0 0 0 0 -2211.75 0 0 687.658 0.02 0 0 0 1.14444 -155.873 0 0 0 0 0 0 0 0 0 0 -418.485 0 -507.752 0 0 0 0 0 0 609.378 0 0 0 0 0 0 0 0 0 1363.95 0 -412.534 0 0 0 
741.218 1847.36 -2228.84 0 0 0 0 246.818 0 0 0 0 1204.03 0 0 -1639.68 0 0 0 0 0.03 0 1502.81 0 0 0 0 2404.48 1681.49 0 0 0 2234.34 0 0 0 0 0 0 0 0 0 0 0 0 0 1753.36 0 0 0 0 0 0 0 0 0 0 0 0 0 
0 0 1643.96 567.873 0 0 1826.15 -1353.72 0 0 2214.35 1262.47 0 0 0 2192.53 0 0 -458.922 0 0 0.02 -1398.28 0 939.131 0 0 -1006.27 0 0 0 0 0 0 0 0 0 0 0 0 0 0 0 0 0 0 0 2246.39 0 0 0 1130.48 0 -1673.71 -1371.43 0 0 0 0 0 
0 0 0 934.4 0 0 1327.94 0 0 0 -2412.56 0 0 0 0 0 0 1208.3 1180.38 0 -296.106 546.968 0.06 0 0 2498.78 1925.18 0 0 0 0 1541.87 0 0 0 0 0 0 0 0 0 0 0 0 0 -2370.75 0 0 0 0 0 0 0 0 0 0 0 0 -1382.11 0 
0 2252.95 0 -2205.19 0 0 0 2022.69 -2185.81 0 0 0 -51.6526 1431.85 0 0 0 0 256.89 1466.64 0 0 0 0.03 0 0 1024.58 2352.9 1693.85 0 0 0 0 0 0 -645.085 0 0 0 0 0 0 0 1305.81 0 0 0 0 0 0 0 -1489.38 0 0 0 0 0 0 0 -1284.75 
2124.16 2006.52 0 0 0 -975.6 0 0 0 0 698.492 1416.59 0 0 2299.04 0 0 0 0 307.55 0 -615.635 0 0 0.06 0 1785.41 0 0 0 0 0 0 940.352 -610.446 0 0 0 0 0 0 0 0 0 1663.49 0 0 0 -1114.92 0 0 0 1713.69 0 1871.17 0 0 -157.399 0 0 
0 877.331 0 0 0 0 0 0 0 0 0 0 0 0 0 0 0 1530.43 0 0 0 0 1854.53 0 0 0.06 0 1402.71 0 0 0 0 0 0 0 0 0 0 0 0 0 0 0 0 0 0 -2003.16 0 0 0 0 0 0 0 0 0 0 0 3.58592 0 
2154.38 -1501.28 0 0 2004.68 -1320.76 0 0 0 778.451 0 0 0 0 0 0 0 0 53.4837 0 0 0 -1940.14 869.854 2304.99 0 0.02 0 0 0 1052.05 0 0 -979.415 0 0 1456.57 0 0 0 -973.312 2367.4 0 0 0 0 0 0 0 0 0 -2474.21 0 0 2243.49 0 0 0 0 0 
1546.3 0 0 0 2319.48 0 0 -1392.64 0 0 0 1598.33 -1403.93 -966.75 -209.433 0 932.875 0 2354.12 0 2025.74 2381.74 0 -1082.26 0 -1509.06 0 0.08 0 134.968 -1499.6 0 0 0 0 0 0 0 0 0 0 0 0 0 0 0 0 -12.5889 0 0 0 0 0 0 0 0 0 0 0 0 
0 0 0 1303.67 2478.03 0 0 0 0 1359.22 -625.706 1392.64 0 -1418.58 0 0 0 0 0 0 -1596.04 0 0 1903.82 0 0 0 0 0.06 47.9904 0 0 0 0 0 0 0 0 0 0 0 0 0 0 0 0 2064.96 0 0 0 0 449.461 -573.824 0 1006.58 0 0 0 0 805.155 
0 0 0 0 2037.03 0 0 -848.491 0 0 2239.37 0 0 -251.396 0 0 0 1905.19 0 0 0 0 0 0 0 0 0 1042.28 -1698.58 0.04 0 0 1750.92 0 0 1745.28 0 0 1435.36 0 0 0 0 -1996.14 2310.48 0 0 0 0 0 0 0 -1108.81 1343.81 0 0 0 0 0 0 
0 2427.52 0 1286.74 0 -798.593 0 0 -2228.54 0 631.504 1851.79 0 2350.92 0 2081.59 0 0 0 0 0 0 0 0 0 0 -753.121 -2471.92 0 0 0.03 0 -133.137 0 2272.18 0 0 0 0 -1446.65 0 0 0 0 0 0 0 0 0 0 0 0 0 0 0 0 0 0 0 0 
0 0 1935.87 0 -1391.87 0 0 0 0 0 391.324 0 0 0 0 0 0 0 0 0 0 0 1436.58 0 0 0 0 0 0 0 0 0.06 0 0 0 2094.87 0 0 0 0 0 1945.48 0 0 211.875 0 0 0 0 -2425.69 0 0 0 0 0 192.19 0 0 0 0 
0 0 0 0 0 0 0 0 0 0 0 0 0 0 0 0 0 0 0 0 1481.6 0 0 0 0 0 0 0 0 -403.989 -784.402 0 0 0 0 0 1432.92 0 0 0 0 0 0 0 0 0 0 0 0 0 0 0 0 0 0 0 0 1994.16 0 0 
0 0 0 0 0 0 0 0 0 0 0 0 0 0 0 0 2135.15 0 0 0 0 0 0 0 2482.91 0 1227.53 0 0 0 0 0 0 0.07 0 0 0 0 0 0 0 0 0 0 0 0 -244.682 -1316.19 0 0 0 0 0 0 300.226 0 -1383.94 0 0 0 
0 0 0 0 0 0 0 0 -1092.49 0 0 0 0 0 0 -966.903 0 0 0 0 0 0 0 0 1724.22 0 0 0 0 0 995.743 0 0 0 0.09 0 0 0 0 0 0 0 870.159 0 0 0 0 0 0 0 0 0 0 689.337 0 0 0 0 -452.361 0 
0 0 -2427.98 1284.91 0 0 0 0 0 0 0 0 0 0 0 0 0 0 0 698.035 0 0 0 1231.04 0 0 0 0 0 2104.48 0 -998.489 0 0 0 0.03 0 0 0 0 0 0 0 0 -126.728 0 0 0 0 0 0 0 0 0 0 0 0 0 0 814.463 
0 0 633.03 0 618.229 0 0 0 0 0 0 0 0 0 0 0 0 0 0 0 0 0 0 0 0 0 1777.78 0 0 0 0 0 606.632 0 0 0 0.01 0 0 0 0 0 0 0 0 0 0 0 0 0 0 0 0 0 0 0 0 0 0 0 
0 0 0 1952.35 0 0 0 0 -826.212 0 0 0 899.304 0 0 0 0 0 564.516 5.72222 0 0 0 0 0 0 0 0 0 0 0 0 0 0 0 0 0 0.06 0 0 0 0 0 0 0 0 0 0 1947.46 0 0 0 0 0 0 2491.45 2365.41 247.276 0 0 
-662.786 0 0 0 0 0 0 0 0 0 2067.86 373.012 -671.026 0 0 0 0 1137.96 0 0 0 0 0 0 0 0 0 0 0 619.755 0 0 0 0 0 0 0 0 0.04 0 0 1761.15 -2146.29 0 0 0 1798.84 0 2397.76 466.399 0 0 0 0 0 834.3 0 0 0 0 
0 0 1835 505.615 0 0 0 0 0 0 0 0 0 0 0 0 0 0 0 0 0 0 0 0 0 0 0 0 0 0 1434.45 0 0 0 0 0 0 0 0 0 2429.04 0 0 1102.71 -1758.86 0 0 0 -980.026 -415.281 0 0 0 0 0 0 0 0 0 0 
0 0 0 0 1627.17 0 0 0 0 0 0 2433.16 0 0 0 0 285.882 0 0 0 0 0 0 0 0 0 1566.29 0 0 0 0 0 0 0 0 0 0 0 0 -218.741 0.05 0 0 0 0 0 0 136.799 0 0 -1536.68 0 0 1809.67 0 0 1387.14 0 0 -212.79 
0 0 0 0 0 0 0 959.578 2362.82 317.469 0 0 0 165.029 0 0 0 0 0 0 0 0 0 0 0 0 733.589 0 0 0 0 1694.01 0 0 0 0 0 0 1352.96 0 0 0.08 0 0 0 0 0 0 0 0 0 0 0 0 0 0 0 0 0 0 
0 0 0 0 0 559.481 0 -1254.54 -914.106 0 672.857 0 0 0 0 0 0 0 0 0 0 0 0 0 0 0 0 0 0 0 0 0 0 0 -2214.19 0 0 0 1727.12 0 0 0 0.01 0 0 0 0 0 1357.69 2373.04 2072.44 0 0 0 0 0 0 0 0 0 
0 0 0 0 0 0 0 0 0 -9.23185 0 0 0 0 0 0 2189.02 0 0 0 0 0 0 1264.61 0 0 0 0 0 -1768.47 0 0 0 0 0 0 0 0 0 2016.74 0 0 0 0.02 0 0 0 0 0 0 0 0 0 0 0 0 0 0 -2157.89 0 
0 0 0 0 0 0 0 0 0 0 0 0 0 0 0 0 0 0 0 506.073 0 0 0 0 -463.195 0 0 0 0 -934.248 0 530.183 0 0 0 1678.9 0 0 0 -2252.65 0 0 0 0 0 0 2150.56 0 0 0 2448.27 0 1990.65 0 0 0 0 0 1247.98 0 
1883.83 0 0 0 0 0 0 0 -848.338 0 0 0 0 0 0 0 0 0 584.506 0 0 0 1187.55 0 0 0 0 0 0 0 0 0 0 0 0 0 0 0 0 0 0 0 0 0 0 0.07 0 0 0 0 0 0 0 0 0 0 0 0 0 2324.06 
0 0 0 0 0 0 -338.221 0 0 721.229 0 0 0 0 0 0 0 0 -151.906 0 808.054 0 0 0 0 -1338.62 0 0 -2400.05 0 0 0 0 1959.06 0 0 0 0 1329 0 0 0 0 0 127.033 0 0.09 2187.19 0 0 2404.48 0 0 0 0 0 0 0 0 0 
0 0 0 1459.47 0 0 0 0 0 0 499.054 0 0 0 -461.974 0 0 0 0 0 0 807.596 0 0 0 0 0 -2428.74 0 0 0 0 0 1622.14 0 0 0 0 0 0 1613.9 0 0 0 0 0 935.774 0.01 0 0 0 0 0 0 0 0 693.915 0 0 0 
0 0 0 0 0 0 0 0 -2457.43 2375.33 0 0 0 0 0 350.581 0 0 0 0 0 0 0 0 416.349 0 0 0 0 0 0 0 0 0 0 0 0 1541.87 -1021.99 2332.45 0 0 -1809.21 0 0 0 0 0 0.06 0 0 0 0 0 0 0 0 0 0 0 
0 0 0 0 0 0 0 0 0 0 0 0 0 0 0 0 0 0 0 0 0 0 0 0 0 0 0 0 0 0 0 619.449 0 0 0 0 0 0 950.88 -256.584 0 0 1886.58 0 0 0 0 0 0 0.03 0 -1558.05 0 0 0 0 0 0 0 0 
0 0 0 0 -1722.54 0 0 1171.68 0 0 0 0 684.149 0 0 1397.37 0 0 0 0 0 0 0 0 0 0 0 0 0 0 0 0 0 0 0 0 0 0 0 0 -1119.19 0 727.332 0 1618.17 0 -282.678 0 0 0 0.03 0 0 0 0 0 0 0 0 0 
-1313.59 -183.34 0 0 0 0 0 0 0 0 119.709 -1170.92 0 0 0 0 0 0 -1261.25 0 0 9.84222 0 2341.3 0 0 2301.63 0 2145.68 0 0 0 0 0 0 0 0 0 0 0 0 0 0 0 0 0 0 0 0 10.1474 0 0 0 -162.13 0 0 0 -1626.87 0 0 
0 0 0 0 0 0 0 0 0 0 0 0 2083.27 0 0 807.749 0 1538.97 114.826 0 0 0 0 0 2015.98 0 0 0 -1935.71 1096 0 0 0 0 0 0 0 0 0 0 0 0 0 0 1456.11 0 0 0 0 0 0 0 0.01 0 0 0 0 203.33 0 0 
1300.32 0 0 0 0 -1307.49 0 0 1950.21 0 248.039 0 0 0 0 0 0 0 0 0 0 1912.98 0 0 0 0 0 0 0 1083.18 0 0 0 0 1012.22 0 0 0 0 0 -2125.23 0 0 0 0 0 0 0 0 0 0 -187.002 0 0.08 0 0 0 0 0 0 
0 0 0 0 0 0 0 0 0 0 0 0 0 0 0 0 0 0 0 2297.36 0 -1566.44 0 0 1843.09 0 -612.735 0 1682.71 0 0 0 0 464.263 0 0 0 0 0 0 0 0 0 0 0 0 0 0 0 0 0 0 0 0 0.03 0 0 1890.7 0 0 
0 0 0 0 -424.741 1348.54 0 0 0 0 0 0 0 0 202.261 0 0 0 0 0 0 0 0 0 0 0 0 0 0 0 0 -586.489 0 0 0 0 0 2091.05 -182.119 0 0 0 0 0 0 0 0 0 0 0 0 0 0 0 0 0.07 0 0 0 0 
0 0 1845.68 0 0 0 -2449.19 1142.38 0 0 0 0 0 0 0 0 0 0 0 1886.27 0 0 0 0 0 0 0 0 0 0 0 0 0 -1226.92 0 0 0 2167.2 0 0 1896.5 0 0 0 0 0 0 782.723 0 0 0 0 0 0 0 0 0.08 0 0 0 
0 0 0 -1618.47 0 0 0 0 -478.149 0 0 698.34 0 0 0 0 0 0 0 0 0 0 0 0 1502.66 0 0 0 0 0 0 0 397.122 0 0 0 0 -2457.27 0 0 0 0 0 0 0 0 0 0 0 0 0 908.612 839.335 0 1277.89 0 0 0.08 0 0 
0 0 0 0 0 0 0 0 0 0 2120.35 0 0 0 0 0 0 0 0 0 0 0 1773.51 0 0 892.895 0 0 0 0 0 0 0 0 1670.35 0 0 0 0 0 0 0 0 2176.35 -1263.24 0 0 0 0 0 0 0 0 0 0 0 0 0 0.09 0 
0 0 0 0 0 0 0 0 0 649.358 0 -1435.67 0 0 0 0 1554.38 0 0 0 0 0 0 -1202.66 0 0 0 0 169.454 0 0 0 0 0 0 1305.35 0 0 0 0 2404.02 0 0 0 0 -104.907 0 0 0 0 0 0 0 0 0 0 0 0 0 0.02 
