*Vertices 72
*Matrix 
0 0 0 0 -2099.14 0 476.165 0 0 0 2024.83 0 0 2426.3 0 1048.08 -4.80667 2062.82 0 0 0 0 -286.035 1852.7 0 -242.546 0 0 0 714.82 0 0 0 0 0 0 0 0 0 0 0 -2317.8 0 0 2034.29 233.238 -2165.06 0 806.833 1496.7 0 0 0 0 0 0 0 0 0 0 0 0 0 0 0 0 0 2446.29 0 0 0 0 
0 0.01 0 0 0 0 -2006.36 0 -231.407 0 0 0 0 -1049.91 0 -1025.19 0 1742.23 764.565 0 906.018 0 0 0 0 -1550.11 0 0 836.894 0 0 -195.7 0 0 0 -988.113 0 2446.75 0 0 0 1196.4 0 0 0 0 0 0 0 0 0 0 0 0 0 0 0 1302.61 0 0 0 0 0 0 0 0 0 0 0 0 0 0 
0 0 0 0 0 0 1023.06 0 -1515.78 0 0 -1037.86 1139.18 0 0 -282.83 0 0 0 879.162 0 0 0 0 0 0 0 0 0 0 0 738.777 2332.45 -193.564 0 269.707 0 416.044 0 0 0 0 654.241 0 0 0 -227.134 0 0 2318.72 0 0 0 0 0 0 0 0 0 -37.6141 0 0 0 0 0 0 0 0 0 0 0 0 
0 0 0 0.05 0 1271.78 0 0 0 0 0 0 0 0 2097.46 0 2069.99 540.101 57.6037 0 0 0 0 0 -1082.87 0 0 0 0 0 0 0 -776.315 0 1053.27 0 1222.04 0 0 1423.61 0 0 1663.49 0 0 0 -2208.55 0 0 0 0 0 0 0 0 0 0 1134.14 0 1437.65 -333.338 0 0 0 -251.549 -617.008 0 0 0 0 0 0 
1434.29 0 0 0 0 -1111.56 0 1456.11 0 0 0 0 0 0 0 0 0 0 0 2367.7 0 -2319.18 762.123 0 0 1684.39 0 2153.31 0 -1010.24 0 -735.878 0 1069.75 0 0 0 -1062.58 0 0 0 0 0 0 0 0 0 0 -338.984 0 0 0 0 0 0 0 0 0 0 0 0 -1296.35 0 1075.24 0 0 1849.04 0 0 0 0 0 
0 0 0 1618.47 -2491.3 0.03 1041.83 0 0 -553.224 0 -2128.9 0 0 -81.8659 0 0 0 0 2039.02 0 0 225.15 0 0 0 0 1641.97 0 0 0 -447.935 -703.833 0 0 0 38.377 0 2065.72 0 2415.01 0 4.80667 0 0 0 0 0 0 0 0 -1724.07 0 0 0 54.0941 0 0 0 0 0 0 0 0 73.4733 516.907 0 0 0 0 0 0 
-804.544 1429.41 1697.97 0 0 -1629.61 0.03 0 0 0 1423.92 0 0 0 0 0 416.349 0 -31.8155 0 -1298.03 -679.113 0 2353.82 0 0 0 1562.17 0 0 0 -1954.63 0 0 0 -1286.28 0 1934.95 -588.015 0 0 0 0 2439.12 0 542.695 0 0 0 0 0 0 -141.987 0 0 0 0 0 0 0 0 0 0 0 0 0 0 0 0 0 0 0 
0 0 0 0 989.181 0 0 0.08 0 1603.21 0 903.729 64.9281 0 0 0 2060.53 320.826 2029.4 0 -1747.41 2319.18 1772.74 1846.14 0 -1731.54 0 1682.71 0 0 0 0 1292.99 0 -266.961 0 0 0 0 433.744 -2477.11 1462.07 0 1449.86 0 2047.41 0 0 -1408.35 0 0 0 0 0 0 0 0 0 0 0 -2425.08 0 0 0 0 0 0 0 944.624 0 0 0 
0 -1262.17 1008.56 0 0 0 0 0 0.09 0 0 2233.57 0 0 0 0 0 868.633 0 2372.74 -550.478 0 0 0 0 -1686.99 0 0 2008.96 -328.455 0 0 0 1960.13 0 0 0 -1742.68 2050.92 0 1729.41 0 0 0 0 0 1825.39 -659.124 0 0 -1807.99 0 0 0 0 0 0 0 0 0 0 0 0 0 0 0 632.725 0 0 0 0 0 
0 0 0 0 0 415.433 0 1047.47 0 0.03 0 0 0 0 0 0 0 0 0 0 0 0 0 0 0 0 339.29 454.802 1050.68 0 0 0 -90.4111 0 1905.65 1831.19 0 0 0 0 0 0 0 0 0 0 2067.09 1092.03 0 -1130.63 0 0 1395.54 0 0 0 0 0 0 0 0 0 0 0 0 0 0 0 0 0 0 1039.23 
681.86 0 0 0 0 0 1508 0 0 0 0.04 0 0 103.992 0 999.557 0 0 0 1355.1 0 0 0 0 0 0 0 1858.96 2106.77 0 0 0 -2248.83 0 0 -86.2911 0 0 0 0 0 0 0 0 -994.827 -953.932 -1861.71 0 2480.62 0 -976.669 0 0 0 1255.61 0 0 0 0 0 0 0 0 0 0 0 448.241 0 0 0 0 0 
0 0 845.286 0 0 -607.242 0 -942.64 2203.36 0 0 0.06 1.60222 -2024.67 0 833.537 879.925 0 467.162 2198.48 -239.341 -2217.09 0 0 0 0 989.029 0 -2320.55 -2281.95 1929.3 0 0 0 0 1886.58 0 0 0 766.549 0 0 0 0 1636.78 0 415.433 0 0 0 0 -1500.06 0 0 0 0 0 0 0 0 0 0 0 0 0 0 0 0 0 0 0 0 
0 0 2274.16 0 0 0 0 -1713.69 0 0 0 2099.14 0.08 0 588.015 0 -1485.72 665.38 0 0 0 0 0 0 0 0 0 -2139.58 0 1217.92 0 0 0 0 0 0 295.19 1451.69 0 2366.33 0 0 0 0 0 468.23 0 -91.6318 0 0 0 0 0 -2087.54 0 0 1094.01 565.584 0 0 0 0 0 0 0 0 0 0 0 0 0 0 
-1026.26 250.786 0 0 0 0 0 0 0 0 1889.17 -403.531 0 0.09 -2003.01 1618.63 0 0 0 0 1088.52 0 0 2349.7 0 0 2166.13 0 0 0 0 -211.264 192.953 0 0 0 0 0 1380.28 -78.9666 1806.31 0 0 0 1512.57 0 0 0 1355.71 0 0 0 0 0 0 0 0 0 0 0 0 0 0 0 0 0 0 0 0 0 0 1492.28 
0 0 0 815.226 0 26.4748 0 0 0 0 0 0 -329.066 1789.38 0.07 0 0 0 0 0 0 0 0 0 0 1289.94 -2241.81 -431.608 0 2352.29 -755.409 1684.24 0 -1404.84 0 0 0 0 0 0 0 0 0 0 0 174.184 0 0 0 0 1862.93 0 2034.75 0 0 0 0 0 0 0 1507.84 0 0 0 0 0 0 0 0 0 0 0 
1114.76 -2093.95 -60.6555 0 0 0 0 0 0 0 63.86 -514.924 0 2453.61 0 0.05 -48.2955 0 -651.189 0 1423.46 1931.75 0 0 0 0 0 0 0 0 2468.11 0 0 0 0 0 0 0 0 0 -2156.97 -888.165 0 2291.56 0 0 -1183.43 1037.1 0 -2069.69 1537.6 0 0 0 0 0 0 0 0 0 2230.37 0 -1203.88 0 0 0 0 0 0 0 0 0 
1908.09 0 0 950.423 0 0 -1011.46 1631.14 0 0 0 2362.06 1951.28 0 0 -1723.76 0.07 553.224 0 0 0 0 0 0 0 0 0 0 0 0 0 0 1591.31 0 0 -247.734 0 0 0 0 -1141.32 0 58.6718 0 731.3 1109.27 0 0 0 0 3.12815 0 0 0 -2278.59 0 -2299.19 0 1548.28 0 0 0 0 0 0 0 0 0 0 0 -1217.76 0 
-1753.82 1462.83 0 1134.14 0 0 0 -2325.13 1221.12 0 0 0 219.352 0 0 0 -224.845 0.08 0 0 0 0 0 0 0 0 1712.32 0 -1605.81 0 0 0 0 0 0 0 0 0 889.691 0 0 0 1414.76 0 0 2377.62 0 2484.59 0 0 -1310.54 0 0 0 1574.22 0 615.482 0 0 0 0 0 0 1030.53 -2374.11 0 0 0 -440.611 0 0 0 
0 861.309 0 -1942.88 0 0 2174.67 1701.48 0 0 0 1930.37 0 0 0 1094.32 0 0 0.01 692.389 0 -1870.1 1869.49 -436.033 0 0 0 0 1782.36 -1194.27 0 0 -1727.42 0 0 -640.507 -404.447 2276.6 0 0 1189.23 0 0 0 1643.19 0 0 0 0 -1142.99 0 0 0 0 0 0 0 0 0 0 0 -1463.13 0 0 0 0 0 0 0 0 0 0 
0 0 -1868.27 0 -1944.26 1397.37 0 0 -287.408 0 -950.27 1965.93 0 0 0 0 0 0 1746.19 0.03 0 0 0 0 0 0 0 0 0 0 1363.64 0 0 251.701 0 1138.26 2124.47 0 0 -1757.48 -1981.95 990.555 0 0 0 1245.69 0 0 824.839 2337.34 0 0 -2341 220.878 0 0 0 1560.64 0 0 0 0 0 0 0 0 0 0 0 0 0 0 
0 -2376.71 0 0 0 0 2085.71 2179.1 8.77407 0 0 -97.7355 0 11.8259 0 -462.584 0 0 0 0 0.06 1370.51 0 1620.3 0 0 1735.51 0 -2071.98 0 0 0 0 0 0 1025.8 0 0 0 268.334 0 0 0 0 43.26 0 0 0 0 1154.9 468.993 0 0 0 0 0 0 0 0 0 0 0 0 0 0 0 0 0 0 0 0 0 
0 0 0 0 -1333.74 0 2336.27 -2493.74 0 0 0 1635.87 0 0 0 525.758 0 0 677.74 0 517.67 0.05 1283.38 -1797.31 0 0 0 2175.13 2033.68 0 0 0 0 1919.39 0 0 0 0 0 1177.79 -2349.39 0 0 812.937 0 522.401 0 0 0 0 0 0 0 395.901 0 0 0 0 0 0 -833.842 0 0 0 0 0 0 0 0 0 0 -1107.29 
928.602 0 0 0 1971.42 482.421 0 2325.13 0 0 0 0 0 0 0 0 0 0 -1344.26 0 0 -1483.28 0.05 0 0 0 0 1870.71 0 -1887.65 0 0 1909.62 0 0 0 0 -1049 0 -332.27 1569.19 0 0 0 0 0 0 0 0 0 2460.02 0 0 0 -1482.21 0 0 -1249.5 0 0 0 0 0 0 0 -1314.2 0 0 0 0 0 757.393 
2313.53 0 0 0 0 0 2109.97 1765.57 0 0 0 0 0 1915.42 0 0 0 0 -1424.68 0 1172.29 1080.13 0 0.09 0 0 0 -852 0 0 0 0 0 0 0 -1665.78 0 0 0 0 1844.46 1795.94 0 -2365.41 0 -232.322 0 0 0 -2070.6 0 1890.7 0 0 0 0 -1337.55 0 0 0 0 0 -2101.89 0 0 0 0 470.367 0 0 0 0 
0 0 0 796.915 0 0 0 0 0 0 0 0 0 0 0 0 0 0 0 0 0 0 0 0 0.02 -1030.08 1370.51 0 622.806 0 0 0 0 0 0 0 0 2296.59 0 1161.92 0 59.1296 0 0 0 0 0 0 0 0 875.5 0 0 0 0 0 0 0 0 0 0 0 0 0 0 0 0 0 0 0 0 0 
-704.749 202.261 0 0 -128.712 0 0 2356.11 1627.63 0 0 0 0 0 2129.35 0 0 0 0 0 0 0 0 0 900.983 0.05 0 0 0 0 0 0 0 0 0 0 0 -609.378 -183.645 0 -1143.3 0 1898.94 0 2371.82 0 0 0 0 -2387.54 68.8955 0 706.275 527.589 0 0 0 0 0 0 0 1065.32 2361.9 0 0 0 0 0 0 0 0 0 
0 0 0 0 0 0 0 0 0 958.205 0 297.021 0 125.355 1473.2 0 0 44.4807 0 0 226.981 0 0 0 901.593 0 0.04 0 0 -835.215 0 0 0 0 0 0 0 0 0 -1668.37 0 0 0 0 0 0 -496.307 -273.827 0 0 0 0 0 0 0 1556.83 0 2345.58 0 0 0 0 0 2340.54 -1848.89 0 0 0 0 0 0 0 
0 0 0 0 943.251 -775.246 -71.1844 -1777.02 0 1007.03 2326.96 0 -1940.6 0 -2440.79 0 0 0 0 0 0 -1362.73 1808.45 1670.51 0 0 0 0.01 0 2095.78 0 0 0 0 0 0 -1476.1 851.39 494.476 0 0 0 1603.52 2244.41 0 0 -488.678 -1016.04 0 0 0 0 194.021 1708.2 0 0 0 0 0 0 0 2209.92 -95.4466 0 0 0 0 0 0 2492.07 0 0 
0 -331.355 0 0 0 0 0 0 1870.1 81.7133 -1294.67 798.593 0 0 0 0 0 -2331.08 -425.199 0 -1822.49 -2010.94 0 0 2038.26 0 0 0 0.08 105.213 0 0 2428.43 0 0 0 0 0 0 746.712 1774.12 0 0 0 0 0 2313.07 2286.52 0 0 1741.77 0 0 0 0 0 0 0 0 0 -2465.51 0 1347.32 0 0 0 0 -431.608 0 0 0 0 
385.067 0 0 0 -1519.59 0 0 0 -2080.07 0 0 -1242.94 -1503.27 0 818.43 0 0 0 2430.11 0 0 0 2343.29 0 0 0 1343.5 1046.71 925.398 0 2147.66 0 0 0 0 0 0 0 735.878 0 0 0 -354.701 247.429 0 0 0 0 1816.23 0 0 0 0 0 0 -1533.94 0 0 0 0 0 0 0 0 480.438 0 0 -1054.95 0 268.181 0 0 
0 0 0 0 0 0 0 0 0 0 0 973.464 0 0 1765.27 -928.602 0 0 0 -48.9059 0 0 0 0 0 0 0 0 0 392.392 0.06 0 0 0 805.307 -2400.66 2447.05 833.842 1154.9 -677.892 910.596 0 0 0 0 0 0 932.264 -172.048 906.781 0 0 0 0 0 0 0 0 0 0 0 0 0 0 0 0 -1725.14 0 0 0 0 0 
0 1610.23 1603.06 0 -1368.83 1960.28 1309.02 0 0 0 0 0 0 -1855.91 273.675 0 0 0 0 0 0 0 0 0 0 0 0 0 0 0 0 0.07 0 0 0 0 0 0 0 0 0 0 0 0 0 0 2082.81 974.075 0 0 0 0 0 0 0 0 -1992.17 0 0 0 0 0 0 0 0 0 0 0 0 0 0 0 
0 0 780.74 1062.43 0 -1711.25 0 1987.75 0 1145.13 297.327 0 0 1993.55 0 0 887.402 0 -1268.88 0 0 0 1680.88 0 0 0 0 0 -797.983 0 0 0 0.08 1264.76 1725.14 0 659.581 0 0 0 0 -2432.1 0 0 0 0 0 0 0 0 0 0 0 0 0 0 0 0 0 0 0 0 0 0 0 -1511.66 0 0 0 0 -670.568 0 
0 0 -83.8496 0 -1231.96 0 0 0 -2372.43 0 0 0 0 0 -700.629 0 0 0 0 1681.04 0 1695.23 0 0 0 0 0 0 0 0 0 0 -765.938 0.05 0 0 0 1019.09 -78.2037 0 0 970.565 0 0 0 2409.67 0 0 -524.537 0 0 0 0 0 0 0 2248.07 0 -221.488 0 0 0 0 0 0 2032.91 1077.38 0 0 0 0 0 
0 0 0 -1280.02 0 0 0 1718.42 0 -1963.64 0 0 0 0 0 0 0 0 0 0 0 0 0 0 0 0 0 0 0 0 2160.33 0 1023.67 0 0.09 0 1875.44 0 -1671.88 2123.4 990.707 0 0 0 0 1948.53 0 -276.116 0 0 0 0 0 -618.992 571.23 0 0 0 -1294.21 -2200.16 0 0 0 0 0 0 0 0 0 0 0 2423.25 
0 -613.651 2400.66 0 0 0 2010.48 0 0 1555.45 -1073.26 -1115.83 0 0 0 0 2203.67 0 -1539.89 -1359.98 -241.325 0 0 1373.41 0 0 0 0 0 0 -2089.98 0 0 0 0 0.06 0 950.27 0 0 161.977 0 0 0 0 0 0 0 0 0 0 2107.84 0 761.361 0 0 0 0 0 0 0 0 0 0 0 0 0 0 0 0 0 -100.33 
0 0 0 1608.4 0 1722.39 0 0 0 0 0 0 1875.44 0 0 0 0 0 -1588.11 -1696.14 0 0 0 0 0 0 0 1259.88 0 0 2398.07 0 -438.169 0 384.915 0 0 842.082 -178.915 0 0 0 1968.83 955.611 0 0 0 0 0 0 1158.56 0 0 0 0 -1153.07 0 0 0 0 0 0 0 0 2024.52 0 0 -2213.13 0 0 0 0 
0 58.3666 1797.31 0 1620.61 0 2282.86 0 2047.41 0 0 0 880.535 0 0 0 0 0 -1958.14 0 0 0 1822.79 0 816.752 93.6155 0 -593.966 0 0 -757.241 0 0 476.928 0 -2436.06 1789.68 0.07 0 1262.17 0 0 0 -215.842 0 455.412 778.603 0 0 0 1575.14 0 0 0 -322.352 0 -352.87 -1682.1 0 0 -1609.16 0 1180.84 0 786.081 0 0 0 0 0 0 0 
0 0 0 0 0 -597.476 2205.19 0 1688.21 0 0 0 0 -148.854 0 0 0 1894.82 0 0 0 0 0 0 0 1740.39 0 -99.5666 0 1856.82 -1153.07 0 0 920.972 -2441.56 0 -1452.91 0 0.05 -2205.04 0 0 0 0 841.777 0 0 0 0 0 0 0 0 0 0 0 0 0 0 0 0 -1025.8 0 0 0 0 1263.24 0 0 0 0 0 
0 0 0 1226 0 0 0 -2048.78 0 0 0 1995.83 1698.43 -1639.99 0 0 0 0 0 2259.21 2429.2 -2125.23 -1211.66 0 1361.96 0 -1514.4 0 1764.05 0 313.654 0 0 0 1636.94 0 0 1640.9 -2335.51 0.01 0 0 490.967 629.368 0 0 -874.737 0 669.5 0 0 0 0 0 0 0 0 0 0 0 0 0 0 -2258.9 0 0 0 0 0 1555.6 -1451.54 0 
0 0 0 0 0 -49.2111 0 785.775 -572.909 0 0 0 0 -1950.82 0 2252.34 1962.11 0 655.461 1141.16 0 1372.65 -2435.91 -1062.58 0 1273.77 0 0 -1531.19 0 1065.32 0 0 0 -1349.3 635.014 0 0 0 0 0 0 0 0 1627.02 0 0 -1914.96 0 0 0 0 0 0 312.281 0 0 0 838.115 0 0 0 0 0 0 0 0 0 0 0 0 0 
220.725 816.446 0 0 0 0 0 712.531 0 0 0 0 0 0 0 -743.049 0 0 0 1413.54 0 0 0 709.021 2306.82 0 0 0 0 0 0 0 2061.3 -2418.97 0 0 0 0 0 0 0 0.01 0 0 0 0 -921.583 0 0 2311.85 0 0 0 0 0 0 0 0 0 0 0 0 0 0 0 0 0 0 0 -285.424 0 0 
0 0 -972.701 1498.08 0 -2338.1 0 0 0 0 0 0 0 0 0 0 1728.64 122.15 0 0 0 0 0 0 0 1524.17 0 84.1548 0 -2415.01 0 0 0 0 0 0 -253.38 0 0 -719.245 0 0 0.07 0 0 0 2183.22 1283.84 0 0 0 0 0 0 0 -1757.03 0 -2277.52 1691.72 0 0 0 0 0 0 0 0 0 0 0 1913.89 2332.61 
0 0 0 0 0 0 -589.694 -799.356 0 0 0 0 0 0 0 2303 0 0 0 0 0 1891.31 0 1884.9 0 0 0 -1915.27 0 2015.37 0 0 0 0 0 0 2225.49 159.536 0 -1223.41 0 0 0 0.02 0 0 0 0 0 0 0 0 0 0 0 1620.76 0 0 0 0 0 0 0 -425.504 0 0 0 1396.91 0 -416.349 499.207 0 
2093.65 0 0 0 0 0 0 0 0 0 1687.14 2499.39 0 -481.353 0 0 -1977.52 0 -1701.33 0 1023.36 0 0 0 0 -1209.68 0 0 0 0 0 0 0 0 0 0 0 0 625.553 0 -1793.8 0 0 0 0.01 0 1863.54 1824.93 0 0 0 0 0 0 0 0 0 0 -1128.96 0 0 0 0 0 1282.62 0 -1635.87 0 0 0 0 0 
1982.56 0 0 0 0 0 544.984 -447.783 0 0 2298.58 0 1525.39 0 -1126.51 0 2092.12 1888.41 0 -437.864 0 1041.06 0 -519.959 0 0 0 0 0 0 0 0 0 734.657 -1597.11 0 0 -2402.04 0 0 0 0 0 0 0 0.05 0 0 645.848 0 0 -2375.18 0 0 0 0 0 0 0 0 0 -1538.06 0 0 0 0 2370.14 0 0 0 -304.346 0 
-1707.13 0 -2140.8 -932.417 0 0 0 0 446.409 2269.28 995.285 1306.88 0 0 0 -378.353 0 0 0 0 0 0 0 0 0 0 1764.66 2379.76 2118.52 0 0 2102.8 0 0 0 0 0 1681.19 0 -199.057 0 -125.202 459.38 0 1935.87 0 0 2333.06 -2474.67 0 0 0 0 0 0 0 0 0 0 0 0 0 0 -1740.24 0 0 0 0 0 0 -476.165 0 
0 0 0 0 0 0 0 0 -1522.8 2166.13 0 0 140.156 0 0 640.355 0 -1408.66 0 0 0 0 0 0 0 0 1875.29 -1294.52 -295.495 0 1407.59 -1773.66 0 0 1817.3 0 0 0 0 0 163.961 0 2406.77 0 -2027.88 0 2027.42 0.01 2006.82 0 0 0 0 0 0 0 0 0 1224.78 0 0 0 0 0 0 0 0 0 217.063 0 0 0 
2186.27 0 0 0 1021.38 0 0 701.849 0 0 2210.53 0 0 -826.212 0 0 0 0 0 1115.99 0 0 0 0 0 0 0 0 0 484.252 141.377 0 0 1806.62 0 0 0 0 0 1961.96 0 0 0 0 0 -2333.83 -832.469 2486.27 0.03 -1168.48 0 0 0 0 0 0 0 2073.35 0 0 0 404.294 0 0 0 0 0 0 0 0 0 0 
1571.02 0 455.718 0 0 0 0 0 0 1829.36 0 0 0 0 0 1058 0 0 571.23 1705.6 1457.34 0 0 872.753 0 1041.06 0 0 0 0 -1267.51 0 0 0 0 0 0 0 0 0 0 -1156.58 0 0 0 0 0 0 1970.96 0.03 0 0 0 0 0 -1163.75 0 0 0 0 0 0 0 242.546 0 0 0 0 0 0 0 -362.026 
0 0 0 0 0 0 0 0 1821.12 0 2248.53 0 0 0 -602.206 -550.325 -593.661 240.41 0 0 -1143.45 0 -1418.73 0 -73.9311 -37.0037 0 0 537.202 0 0 0 0 0 0 0 591.372 1066.85 0 0 0 0 0 0 0 0 0 0 0 0 0.03 0 0 0 437.559 0 0 0 0 558.26 0 0 -2123.55 0 0 0 0 0 0 0 0 0 
0 0 0 0 0 1959.67 0 0 0 0 0 -2156.51 0 0 0 0 0 0 0 0 0 0 0 1374.02 0 0 0 0 0 0 0 0 0 0 0 1120.11 0 0 0 0 0 0 0 0 0 2063.43 0 0 0 0 0 0.08 0 -1694.77 0 0 0 0 0 2142.32 1750.77 0 0 0 0 0 0 0 0 -113.605 0 0 
0 0 0 0 0 0 279.321 0 0 1911.3 0 0 0 0 -690.863 0 0 0 0 1894.51 0 0 0 0 0 1436.89 0 1579.26 0 0 0 0 0 0 0 0 0 0 0 0 0 0 0 0 0 0 0 0 0 0 0 0 0.06 0 -1191.52 0 -1514.25 0 0 0 0 0 0 0 0 0 0 0 0 0 0 0 
0 0 0 0 0 0 0 0 0 0 0 0 12.4363 0 0 0 0 0 0 1068.68 0 2413.94 0 0 0 1958.6 0 -331.66 0 0 0 0 0 0 565.584 -2394.41 0 0 0 0 0 0 0 0 0 0 0 0 0 0 0 -237.205 0 0 0 0 0 0 0 0 0 0 0 0 0 0 0 0 0 0 -2291.56 0 
0 0 0 0 0 0 0 0 0 0 2190.24 0 0 0 0 0 1995.99 1255 0 0 0 0 439.695 0 0 0 0 0 0 0 0 0 0 0 -1064.71 0 0 -1761.76 0 0 1627.63 0 0 0 0 0 0 0 0 0 -2040.7 0 -162.282 0 0 -1635.87 2035.05 0 0 0 0 0 66.3015 -1269.95 0 -1051.29 0 0 0 0 797.83 0 
0 0 0 0 0 -198.447 0 0 0 0 0 0 0 0 0 0 0 0 0 0 0 0 0 0 0 0 -1663.03 0 0 616.245 0 0 0 0 0 0 -124.439 0 0 0 0 0 1351.28 37.3089 0 0 0 0 0 -1216.7 0 0 0 0 1054.03 0.08 -153.127 0 0 2248.83 0 0 0 0 1730.63 0 285.272 0 1783.73 0 0 0 
0 0 0 0 0 0 0 0 0 0 0 0 2467.65 0 0 0 -709.937 1317.41 0 0 0 0 0 746.406 0 0 0 0 0 0 0 1415.07 0 -2498.47 0 0 0 1365.93 0 0 0 0 0 0 0 0 0 0 0 0 0 0 -1195.49 0 -716.956 764.412 0.07 -99.7192 0 0 0 0 261.315 0 0 -1519.44 0 0 0 0 0 0 
0 -115.894 0 1850.26 0 0 0 0 0 0 0 0 -343.257 0 0 0 0 0 0 -1517 0 0 1804.48 0 0 0 478.149 0 0 0 0 0 0 0 0 0 0 430.082 0 0 0 0 -2423.55 0 0 0 0 0 1396.6 0 0 0 0 0 0 0 2496.19 0.01 -1041.22 0 0 0 0 0 0 0 0 0 0 0 0 0 
0 0 0 0 0 0 0 0 0 0 0 0 0 0 0 0 1964.25 0 0 0 0 0 0 0 0 0 0 0 0 0 0 0 0 -1262.17 1779.92 0 0 0 0 0 -89.4955 0 -484.252 0 -712.226 0 0 1733.07 0 0 0 0 0 0 0 0 0 2007.58 0.06 0 0 0 0 0 0 0 0 -2209.92 0 0 0 0 
0 0 55.0096 -22.66 0 0 0 0 0 0 0 0 0 0 0 0 0 0 0 0 0 0 0 0 0 0 0 0 0 0 0 0 0 0 1342.89 0 0 0 0 0 0 0 0 0 0 0 0 0 0 0 651.036 1248.44 0 0 0 -2361.75 0 0 0 0.08 306.787 0 1817.3 0 0 0 0 0 0 0 -1471.98 0 
0 0 0 2421.87 0 0 0 -1616.79 0 0 0 0 0 0 -453.276 777.078 0 0 0 0 0 687.353 0 0 0 0 0 0 -1042.89 0 0 0 0 0 0 0 0 -571.993 0 0 0 0 0 0 0 0 0 0 0 0 0 566.958 0 0 0 0 0 0 0 -440.153 0.08 0 0 0 0 0 -264.519 0 1056.93 0 0 0 
0 0 0 0 2041.31 0 0 0 0 0 0 0 0 0 0 0 0 0 1090.5 0 0 0 0 0 0 2124.47 0 2256.77 0 0 0 0 0 0 0 0 0 0 143.666 0 0 0 0 0 0 1773.2 0 0 663.549 0 0 0 0 0 0 0 0 0 0 0 0 0.08 0 0 0 0 0 0 0 0 0 -1963.79 
0 0 0 0 0 0 0 0 0 0 0 0 0 0 0 771.279 0 0 0 0 0 0 0 1064.56 0 -2390.29 0 2020.71 2096.09 0 0 0 0 0 0 0 0 1272.39 0 0 0 0 0 0 0 0 0 0 0 0 1777.32 0 0 0 1620 0 -1911.15 0 0 -2475.89 0 0 0.08 0 0 0 953.169 1555.15 840.098 0 2366.94 0 
0 0 0 0 -1168.78 0 0 0 0 0 0 0 0 0 0 0 0 2274.16 0 0 0 0 0 0 0 0 -1380.58 0 0 0 0 0 0 0 0 0 0 0 0 858.562 0 0 0 339.9 0 0 260.399 0 0 -529.878 0 0 0 0 935.774 0 0 0 0 0 0 0 0 0.05 512.329 0 0 0 0 0 0 0 
0 0 0 219.657 0 -1893.29 0 0 0 0 0 0 0 0 0 0 0 1007.8 0 0 0 0 0 0 0 0 -2173.15 0 0 1242.33 0 0 0 0 0 0 -1240.5 2092.43 0 0 0 0 0 0 2059.31 0 0 0 0 0 0 0 0 0 0 -1029.31 0 0 0 0 0 0 0 1006.42 0.09 0 0 0 -453.734 0 0 0 
0 0 0 856.12 0 1591.01 0 0 0 0 0 0 0 0 0 0 0 0 0 0 0 0 -2148.27 0 0 0 0 0 0 0 0 0 2330.01 759.529 0 0 0 0 0 0 0 0 0 0 0 0 0 0 0 0 0 0 0 0 940.504 0 -1325.8 0 0 0 0 0 0 0 0 0.06 1775.8 1823.4 0 0 0 0 
0 0 0 0 -82.4763 0 0 0 582.217 0 1823.56 0 0 0 0 0 0 0 0 0 0 0 0 0 0 0 0 0 0 0 -1977.68 0 0 1624.73 0 0 0 0 1066.85 0 0 0 0 0 -2034.75 2137.75 0 0 0 0 0 0 0 0 0 -626.621 0 0 0 0 -247.124 0 -1947.16 0 0 -437.254 0.03 0 -697.119 0 0 0 
-345.393 0 0 0 0 0 0 0 0 0 0 0 0 0 0 0 0 0 0 0 0 0 0 1319.54 0 0 0 0 1508.61 1216.85 0 0 0 0 0 0 879.62 0 0 0 0 0 0 1643.65 0 0 0 0 0 0 0 0 0 0 0 0 0 0 -1835.92 0 0 0 219.657 0 0 -59.8926 0 0.02 0 782.723 0 0 
0 0 0 0 0 0 0 -2362.06 0 0 0 0 0 0 0 0 0 1602.15 0 0 0 0 0 0 0 0 0 0 0 0 0 0 0 0 0 0 0 0 0 0 0 0 0 0 0 0 0 -15.9459 0 0 0 0 0 0 0 951.949 0 0 0 0 -1355.56 0 1514.1 0 545.442 0 814.463 0 0.04 0 0 0 
0 0 0 0 0 0 0 0 0 0 0 0 0 0 0 0 0 0 0 0 0 0 0 0 0 0 0 1936.63 0 -1233.02 0 0 0 0 0 0 0 0 0 2394.25 0 -1187.4 0 377.438 0 0 0 0 0 0 0 1956.62 0 0 0 0 0 0 0 0 0 0 0 0 0 0 0 -480.132 0 0.06 -1774.12 0 
0 0 0 0 0 0 0 0 0 0 0 0 0 0 0 0 2337.18 0 0 0 0 0 0 0 0 0 0 0 0 0 0 0 -1156.27 0 0 0 0 0 0 182.272 0 0 1722.85 425.047 0 -31.8155 852.153 0 0 0 0 0 0 2129.96 -1855.91 0 0 0 0 1226.92 0 0 2251.43 0 0 0 0 0 0 -2027.12 0.07 1713.39 
0 0 0 0 0 0 0 0 0 427.641 0 0 0 -1110.19 0 0 0 0 0 0 0 63.2496 -1828.75 0 0 0 0 0 0 0 0 0 0 0 418.79 903.119 0 0 0 0 0 0 739.082 0 0 0 0 0 0 2098.68 0 0 0 0 0 0 0 0 0 0 0 2373.96 0 0 0 0 0 0 0 0 -1076.92 0 
