*Vertices 58
*Matrix 
0.09 0 1196.25 0 0 513.245 0 0 0 -905.103 0 989.486 -367.672 0 0 672.857 0 0 0 0 0 0 0 0 0 0 0 0 0 18.8452 0 0 0 0 -1932.51 0 0 -260.857 0 0 0 0 0 0 0 0 0 0 0 0 1140.71 0 0 0 0 0 0 0 
0 0.06 0 0 1120.41 0 0 0 1306.42 0 0 0 0 0 0 0 0 0 0 -461.211 0 0 0 0 0 0 0 0 0 0 0 0 1908.55 0 0 0 0 0 0 0 0 0 0 306.94 0 0 0 2372.13 0 0 0 0 0 0 0 0 0 0 
161.214 0 0.01 0 0 0 0 0 0 0 0 0 0 0 0 0 0 0 0 0 0 0 0 0 0 0 0 0 0 0 0 0 0 0 0 0 68.7429 0 0 0 0 0 0 0 0 0 0 0 0 0 0 0 0 0 0 0 0 0 
0 0 0 0.04 0 0 0 0 2086.32 0 0 0 0 0 0 0 0 730.232 0 1766.49 0 0 0 2001.17 0 0 -2014.76 0 0 0 891.217 0 0 0 0 1175.34 0 0 0 0 0 0 2004.07 0 0 0 0 0 0 0 0 0 0 0 0 0 0 0 
0 2004.68 0 0 0.02 0 0 -1582.77 0 0 0 0 143.056 0 2048.33 0 0 0 0 0 0 0 0 0 0 2127.98 0 0 0 0 0 0 0 0 0 0 0 0 0 0 226.218 -1407.44 0 0 0 0 551.546 0 0 0 0 -2481.99 0 0 0 0 0 0 
-1567.51 0 0 0 0 0.07 0 0 0 0 0 0 0 0 2102.8 0 1242.03 0 1830.42 0 0 0 2478.03 -1270.26 -1101.95 0 0 0 0 0 0 0 0 0 0 0 0 0 1898.79 0 0 0 -1115.68 0 0 0 0 0 0 0 1331.9 0 0 0 0 0 0 0 
0 0 0 0 0 0 0.09 0 0 0 0 0 0 0 0 0 0 0 0 0 0 0 0 0 0 0 338.221 0 0 0 0 0 0 0 0 0 0 0 0 0 0 0 0 0 0 0 0 0 0 0 0 0 0 0 0 0 0 0 
0 0 0 0 -1743.75 0 0 0.03 0 0 0 0 0 0 908.765 0 0 0 662.633 0 0 0 0 0 0 -254.753 0 0 0 0 0 0 0 0 0 -153.127 0 0 0 0 0 0 2323.91 0 0 0 0 0 0 0 0 0 0 0 0 0 0 -566.5 
0 656.682 0 1332.21 0 0 0 0 0.09 0 0 -58.6718 -127.338 499.969 0 0 0 0 0 -482.574 0 0 0 0 0 0 0 0 0 2172.38 0 0 0 0 0 0 0 0 1621.37 -1248.74 0 0 0 0 0 0 0 0 -900.525 0 0 505.768 0 0 0 0 0 0 
549.257 0 0 0 0 0 0 0 0 0.02 0 0 0 1346.25 0 2061.91 0 0 0 -1694.77 0 0 0 1833.93 0 2284.69 0 0 0 1060.59 1186.94 0 0 0 0 0 0 0 0 0 0 0 -2357.94 0 0 0 1151.08 0 0 0 0 1270.41 0 0 0 0 0 0 
0 0 0 0 0 0 0 0 0 0 0.05 0 0 2255.7 0 -2214.35 0 0 0 0 2246.85 0 0 0 0 0 0 0 0 0 0 0 0 0 0 0 0 0 0 0 0 0 2459.72 0 0 0 0 0 0 0 0 0 0 0 0 0 0 0 
1942.43 0 0 0 0 0 0 0 1561.1 0 0 0.05 0 0 0 -471.74 0 0 -315.332 0 0 1837.14 0 0 -2220.91 0 0 0 0 0 0 1381.65 57.1459 0 0 0 0 -793.558 631.809 0 0 0 0 0 0 275.811 0 0 -1784.65 0 0 0 0 0 0 0 0 0 
-2339.32 0 0 0 2456.36 0 0 0 816.904 0 0 0 0.04 0 0 1939.99 0 0 0 0 0 0 0 0 0 0 0 0 0 0 0 470.519 0 0 0 0 0 -29.9844 0 0 -1336.48 0 0 0 0 0 0 0 0 0 0 0 0 0 0 0 0 0 
0 0 0 0 0 0 0 0 820.109 1297.72 896.405 0 0 0.01 1942.12 0 0 0 0 0 0 0 2442.93 0 0 0 -205.466 0 0 0 0 0 0 0 0 1665.01 1538.67 2460.78 0 0 0 0 0 0 0 0 0 0 0 0 0 0 0 0 0 0 0 0 
0 0 0 0 809.122 -644.627 0 1869.18 0 0 0 0 0 -1498.54 0 0 -1773.66 2285.76 0 0 0 0 0 0 0 0 0 0 0 0 0 0 0 0 1070.97 0 0 0 2358.85 0 -1288.87 0 0 0 0 -1306.42 0 0 0 0 0 0 0 0 0 0 0 0 
2180.17 0 0 0 0 0 0 0 0 1010.85 -1071.58 -1759.32 -40.0555 0 0 0.01 0 0 0 0 0 0 0 0 0 0 0 0 1328.09 0 0 0 0 918.683 0 0 0 0 0 0 0 0 0 0 0 0 0 0 1466.95 0 0 0 0 0 0 0 0 0 
0 0 0 0 0 736.183 0 0 0 0 0 0 0 0 1091.27 0 0.07 0 0 0 0 0 0 0 -518.586 0 0 0 0 0 0 0 0 -1102.56 0 0 0 2147.36 0 0 0 -2373.96 0 0 0 1611.91 0 1249.35 0 0 0 0 0 0 0 0 0 0 
0 0 0 -413.755 0 0 0 0 0 0 0 0 0 0 1597.42 0 0 0.06 0 0 0 0 0 0 0 0 0 0 0 0 0 0 -1514.4 0 125.202 0 0 0 0 0 0 0 0 0 0 0 0 0 0 0 0 0 376.827 0 0 0 0 0 
0 0 0 0 0 -966.292 0 -982.315 0 0 0 -1113.85 0 0 0 0 0 0 0.09 0 0 0 0 0 0 0 0 0 0 2432.86 986.282 0 0 0 0 0 0 1653.11 0 0 0 0 0 0 0 0 0 0 0 0 0 -1365.02 0 0 0 0 0 0 
0 2388.3 0 -830.027 0 0 0 0 382.168 774.331 0 0 0 0 0 0 0 0 0 0.01 -1358.76 995.743 0 1927.17 0 0 0 0 0 0 0 0 0 0 0 0 0 0 0 796.152 0 0 1634.8 0 0 0 -1893.14 0 0 -2137.14 0 0 0 0 0 0 0 0 
0 0 0 0 0 0 0 0 0 0 1521.27 0 0 0 0 0 0 0 0 1970.5 0.04 0 0 0 0 0 0 1720.86 0 0 0 0 0 2332.76 0 0 0 0 0 0 0 0 0 0 0 0 0 0 0 0 0 0 -1187.7 0 0 0 0 0 
0 0 0 0 0 0 0 0 0 0 0 -1434.14 0 0 0 0 0 0 0 799.203 0 0.09 0 0 0 2211.91 0 0 0 0 0 -1214.26 0 0 0 0 0 0 0 0 -88.4274 1258.05 0 1333.28 0 0 0 2284.08 0 0 0 335.017 0 0 0 0 0 0 
0 0 0 0 0 -1869.64 0 0 0 0 0 0 0 -1470.31 0 0 0 0 0 0 0 0 0 0 0 0 0 0 0 0 0 0 2191.46 0 0 1516.24 0 0 1034.35 0 1121.17 0 0 0 0 0 0 0 0 0 0 0 0 0 0 0 0 0 
0 0 0 1413.08 0 -429.167 0 0 0 2225.49 0 0 0 0 0 0 0 0 0 -712.073 0 0 0 0.01 -2294.92 0 1110.03 0 0 0 0 0 0 -1966.08 -1743.6 0 0 1076.62 0 0 0 0 0 0 0 0 0 0 0 0 0 1170.31 0 0 0 0 0 0 
0 0 0 0 0 875.042 0 0 0 0 0 2231.13 0 0 0 0 -659.886 0 0 0 0 0 0 -84.46 0.05 0 0 0 0 0 1224.78 0 0 0 0 0 0 0 0 0 0 0 0 0 0 0 944.929 0 0 0 0 -1084.7 1799.3 0 0 0 0 0 
0 0 0 0 1479.31 0 0 -677.282 0 -1032.21 0 0 0 0 0 0 0 0 0 0 0 815.073 0 0 0 0.08 0 -24.7963 0 0 0 0 0 0 0 0 0 0 -1833.78 0 0 0 0 1068.38 0 1115.38 0 0 0 0 0 0 0 0 0 0 0 0 
0 0 0 -1899.85 0 0 1075.09 0 0 0 0 0 0 -36.8511 0 0 0 0 0 0 0 0 0 2059.77 0 0 0.07 0 -2089.98 0 0 0 0 0 2055.35 0 0 0 0 0 0 1871.47 1688.97 0 -1126.06 0 0 0 0 0 0 0 0 0 0 0 0 0 
0 0 0 0 0 0 0 0 0 0 0 0 0 0 0 0 0 0 0 0 -391.018 0 0 0 0 2477.57 0 0.09 0 0 0 2215.26 0 0 0 0 1455.2 0 -290.918 0 0 0 1748.33 0 0 0 -823.161 0 0 0 0 0 -2093.34 0 0 0 0 0 
0 0 0 0 0 0 0 0 0 0 0 0 0 0 0 -252.922 0 0 0 0 0 0 0 0 0 0 -727.79 0 0.01 0 0 0 0 0 0 0 2284.08 0 0 0 1739.48 0 0 0 0 0 1373.71 0 0 0 -1548.13 1935.56 0 0 0 0 0 0 
2471.77 0 0 0 0 0 0 0 -920.82 -1820.81 0 0 0 0 0 0 0 0 2370.14 0 0 0 0 0 0 0 0 0 0 0 0 0 0 -2162.47 0 0 1587.5 0 460.448 0 2357.63 0 0 1886.27 0 0 0 0 0 0 0 0 0 0 0 0 0 0 
0 0 0 -872.295 0 0 0 0 0 875.042 0 0 0 0 0 0 0 0 -240.257 0 0 0 0 0 -234.306 0 0 0 0 0 0.03 0 0 0 0 0 0 1301.69 0 2491.15 0 0 0 0 -2183.22 -1450.93 0 1726.97 0 1791.51 0 0 1883.83 0 0 0 0 0 
0 0 0 0 0 0 0 0 0 0 0 1826.91 -2444.76 0 0 0 0 0 0 0 0 -232.78 0 0 0 0 0 1627.32 0 0 0 0.03 0 0 0 0 0 0 0 0 0 -155.721 0 0 -1600.77 0 0 0 0 0 1856.52 0 0 0 0 0 0 0 
0 -18.54 0 0 0 0 0 0 0 0 0 203.482 0 0 0 0 0 2064.81 0 0 0 0 2243.49 0 0 0 0 0 0 0 0 0 0.04 0 0 0 0 0 0 0 0 0 762.886 0 0 0 0 0 0 0 0 0 0 0 0 0 0 0 
0 0 0 0 0 0 0 0 0 0 0 0 0 0 0 1406.22 1193.5 0 0 0 1782.66 0 0 -1316.34 0 0 0 0 0 191.275 0 0 0 0.05 0 0 0 0 0 0 -102.161 0 0 0 1206.93 -267.266 -2291.56 0 0 0 0 0 0 0 0 0 0 0 
974.38 0 0 0 0 0 0 0 0 0 0 0 0 0 185.781 0 0 -2036.27 0 0 0 0 0 834.147 0 0 791.269 0 0 0 0 0 0 0 0.05 0 0 0 0 0 1657.84 0 0 0 0 0 0 2113.33 812.326 1435.67 0 0 0 0 0 0 0 0 
0 0 0 2081.13 0 0 0 2176.81 0 0 0 0 0 -1168.17 0 0 0 0 0 0 0 0 278.863 0 0 0 0 0 0 0 0 0 0 0 0 0.05 0 0 0 379.727 0 0 117.725 0 0 740.913 0 0 562.99 0 0 -1999.19 0 0 0 0 0 0 
0 0 233.543 0 0 0 0 0 0 0 0 0 0 1921.22 0 0 0 0 0 0 0 0 0 0 0 0 0 550.02 -27.8481 599.002 0 0 0 0 0 0 0.09 -1772.44 0 0 0 0 0 0 0 0 0 0 0 0 0 0 0 0 0 0 0 0 
290.002 0 0 0 0 0 0 0 0 0 0 -366.756 -194.021 -1739.33 0 0 -13.5044 0 796.152 0 0 0 0 607.852 0 0 0 0 0 0 1953.41 0 0 0 0 0 -623.112 0.04 0 0 531.098 0 0 0 610.752 0 0 0 0 0 0 0 2232.2 0 0 0 0 0 
0 0 0 0 0 -2076.56 0 0 -1435.82 0 0 27.543 0 0 1490.6 0 0 0 0 0 0 0 2203.36 0 0 580.844 0 1301.08 0 1989.88 0 0 0 0 0 0 0 0 0.09 0 -1893.9 0 0 0 1168.02 0 -105.976 0 0 0 0 0 0 0 0 0 0 0 
0 0 0 0 0 0 0 0 1542.94 0 0 0 0 0 0 0 0 0 0 2366.48 0 0 0 0 0 0 0 0 0 0 2377.47 0 0 0 0 1162.22 0 0 0 0 0 1883.98 0 0 0 0 0 -620.06 0 0 -908.155 0 0 0 0 0 0 0 
0 0 0 0 -2360.23 0 0 0 0 0 0 0 2291.1 0 895.184 0 0 0 0 0 0 1332.21 1926.25 0 0 0 0 0 2442.32 -1737.19 0 0 0 -1594.21 1379.36 0 0 -1778.54 -493.713 0 0.03 0 0 0 0 0 0 0 0 0 0 0 0 0 0 0 0 0 
0 0 0 0 -867.565 0 0 0 0 0 0 0 0 0 0 0 1038.47 0 0 0 0 1496.7 0 0 0 0 1774.27 0 0 0 0 1761.6 0 0 0 0 0 0 0 1817.61 0 0.07 0 0 0 0 376.217 1759.01 0 0 0 0 0 0 844.981 0 0 0 
0 0 0 820.414 0 1936.02 0 -2286.37 0 2147.66 -1316.95 0 0 0 0 0 0 0 0 287.255 0 0 0 0 0 0 2021.47 1548.59 0 0 0 0 -1248.59 0 0 -2130.73 0 0 0 0 0 0 0.03 -246.666 0 0 0 0 0 0 0 0 0 0 0 0 -1397.98 0 
0 -1065.17 0 0 0 0 0 0 0 0 0 0 0 0 0 0 0 0 0 0 0 1434.14 0 0 0 2068.32 0 0 0 742.439 0 0 0 0 0 0 0 0 0 0 0 0 -1595.58 0.08 0 0 1294.67 0 0 0 2491.45 -2425.69 0 -656.987 0 0 0 0 
0 0 0 0 0 0 0 0 0 0 0 0 0 0 0 0 0 0 0 0 0 0 0 0 0 0 2133.63 0 0 0 -1099.81 -1674.93 0 1890.7 0 0 0 1123.77 1897.56 0 0 0 0 0 0.04 0 0 0 0 0 0 0 0 0 0 0 0 0 
0 0 0 0 0 0 0 0 0 0 0 -367.519 0 0 424.589 0 -26.4748 0 0 0 0 0 0 0 0 -1736.27 0 0 0 0 2130.42 0 0 -153.127 0 1808.45 0 0 0 0 0 0 0 0 0 0 177.999 0 0 0 0 0 0 0 0 0 0 0 
0 0 0 0 1386.53 0 0 0 0 1295.13 0 0 0 0 0 0 0 0 0 580.386 0 0 0 0 936.384 0 0 1830.73 1175.95 0 0 0 0 461.821 0 0 0 0 -1094.93 0 0 962.783 0 -1032.98 0 1634.19 0.07 0 0 2164.14 2303.77 0 1542.94 0 0 0 0 0 
0 -134.205 0 0 0 0 0 0 0 0 0 0 0 0 0 0 -1610.08 0 0 0 0 -2048.02 0 0 0 0 0 0 0 0 2172.69 0 0 0 571.993 0 0 0 0 2027.57 0 -52.2629 0 0 0 0 0 0.05 0 0 0 0 0 0 0 1974.17 0 0 
0 0 0 0 0 0 0 0 1185.11 0 0 1197.01 0 0 0 2371.21 0 0 0 0 0 0 0 0 0 0 0 0 0 0 0 0 0 0 -357.753 -830.18 0 0 0 0 0 0 0 0 0 0 0 0 0.05 0 0 1117.97 0 0 0 0 0 0 
0 0 0 0 0 0 0 0 0 0 0 0 0 0 0 0 0 0 0 -559.328 0 0 0 0 0 0 0 0 0 0 176.473 0 0 0 2125.69 0 0 0 0 0 0 0 0 0 0 0 2186.73 0 0 0.01 0 0 0 0 0 0 0 0 
1981.34 0 0 0 0 1862.32 0 0 0 0 0 0 0 0 0 0 0 0 0 0 0 0 0 0 0 0 0 0 330.897 0 0 255.669 0 0 0 0 0 0 0 -84.0022 0 0 0 -1853.01 0 0 363.399 0 0 0 0.07 0 0 0 0 0 0 0 
0 0 0 0 -1113.85 0 0 0 -1364.71 1610.84 0 0 0 0 0 0 0 0 2449.03 0 0 542.543 0 1890.7 1339.53 0 0 0 -988.876 0 0 0 0 0 0 895.032 0 0 0 0 0 0 0 1077.68 0 0 0 0 -1196.1 0 0 0.08 0 0 0 0 0 0 
0 0 0 0 0 0 0 0 0 0 0 0 0 0 0 0 0 1505.1 0 0 882.214 0 0 0 -507.904 0 0 221.488 0 0 -546.052 0 0 0 0 0 0 1529.82 0 0 0 0 0 0 0 0 -489.593 0 0 0 0 0 0.05 0 0 0 0 0 
0 0 0 0 0 0 0 0 0 0 0 0 0 0 0 0 0 0 0 0 0 0 0 0 0 0 0 0 0 0 0 0 0 0 0 0 0 0 0 0 0 0 0 1305.96 0 0 0 0 0 0 0 0 0 0.02 0 0 0 0 
0 0 0 0 0 0 0 0 0 0 0 0 0 0 0 0 0 0 0 0 0 0 0 0 0 0 0 0 0 0 0 0 0 0 0 0 0 0 0 0 0 1403.93 0 0 0 0 0 0 0 0 0 0 0 0 0.01 0 0 0 
0 0 0 0 0 0 0 0 0 0 0 0 0 0 0 0 0 0 0 0 0 0 0 0 0 0 0 0 0 0 0 0 0 0 0 0 0 0 0 0 0 0 0 0 0 0 0 145.192 0 0 0 0 0 0 0 0.06 0 0 
0 0 0 0 0 0 0 0 0 0 0 0 0 0 0 0 0 0 0 0 0 0 0 0 0 0 0 0 0 0 0 0 0 0 0 0 0 0 0 0 0 0 853.374 0 0 0 0 0 0 0 0 0 0 0 0 0 0.05 0 
0 0 0 0 0 0 0 192.343 0 0 0 0 0 0 0 0 0 0 0 0 0 0 0 0 0 0 0 0 0 0 0 0 0 0 0 0 0 0 0 0 0 0 0 0 0 0 0 0 0 0 0 0 0 0 0 0 0 0.02 
