*Vertices 82
*Matrix 
0.04 0 2012.16 0 0 -1865.67 0 2326.65 0 0 -1220.05 0 -863.75 247.581 0 0 0 0 0 403.073 173.116 -618.381 0 0 2319.79 1049.61 1536.07 0 0 0 -1400.57 0 0 0 1814.4 0 2418.97 0 0 0 2206.11 0 0 0 0 0 1360.29 0 0 1932.36 0 0 1147.72 0 0 0 0 0 0 0 0 0 0 0 0 0 0 0 0 0 0 421.842 0 0 0 0 1327.33 1276.06 0 0 0 0 
0 0 0 2051.23 0 -1510.44 0 0 0 174.184 -2003.92 1974.93 0 0 0 0 1959.82 0 1619.85 0 0 1097.98 433.744 0 428.556 0 1412.93 0 -843.303 0 0 0 0 0 0 0 0 0 0 190.207 -2006.97 0 0 2337.34 -2372.13 0 0 0 0 0 0 0 0 0 0 0 0 0 0 0 0 0 0 1676.15 0 0 638.676 0 0 0 0 0 0 0 230.796 0 0 0 0 -344.63 0 0 
1064.71 0 0.02 -2091.05 -223.319 0 0 0 0 567.568 0 2479.4 0 -22.9652 0 0 0 -475.555 0 0 2293.39 0 0 0 0 0 616.398 0 0 0 0 1259.73 0 0 0 0 0 0 0 0 0 0 0 0 0 -371.334 0 0 0 0 0 0 0 0 -774.331 0 0 0 0 0 0 0 0 0 0 0 0 0 0 0 -464.415 0 395.138 0 0 234.458 0 0 0 0 0 0 
0 2458.65 -1852.24 0.08 0 0 0 0 1895.28 0 0 0 -1403.16 0 1143.91 0 2392.12 0 0 0 0 -1044.27 1227.84 0 0 0 0 0 0 0 0 2354.12 0 0 0 0 0 1531.5 463.5 0 0 0 -2324.37 722.602 0 0 2272.03 0 0 0 -1791.36 0 0 0 0 0 0 0 0 0 0 0 0 0 0 0 0 0 -382.168 0 0 0 0 0 0 0 -259.484 0 0 1290.09 0 0 
0 0 2157.43 0 0.01 0 1555.76 0 0 0 0 0 0 0 226.371 -902.509 0 0 0 0 0 391.629 -131.764 363.857 0 534.455 0 0 138.478 0 0 0 955 2027.27 704.596 -499.359 0 0 -2335.05 0 0 -1269.19 0 0 2023.45 0 0 0 0 0 0 513.245 0 0 0 0 0 435.423 0 0 0 -1514.56 0 0 -2378.84 -1936.93 0 0 0 0 0 0 1109.58 0 0 0 0 0 0 0 0 0 
-433.287 2243.34 0 0 0 0.06 0 0 2140.49 0 0 0 978.347 0 0 0 0 1392.33 0 0 0 0 329.371 0 1208.76 0 0 0 0 0 0 0 0 0 0 0 -344.172 0 1036.48 0 1155.96 0 -2323.76 0 0 0 1619.85 0 0 0 0 -398.038 0 0 0 0 -2272.94 -227.439 0 0 0 0 0 19.9133 0 0 0 1449.1 0 0 0 0 0 0 0 0 0 0 0 0 0 0 
0 0 0 0 -1581.55 0 0.01 0 0 0 0 0 0 0 0 0 2319.33 511.872 0 2498.32 0 0 0 0 0 0 0 170.827 0 0 0 2235.56 0 0 0 2456.82 0 0 0 0 0 0 0 0 0 0 0 0 0 0 1926.56 0 -2324.98 0 0 0 0 0 0 0 0 0 0 0 0 0 0 0 0 0 1374.02 0 0 0 0 494.018 0 0 0 0 0 0 
-1152.3 0 0 0 0 0 0 0.02 1551.03 -846.812 0 0 0 0 1547.67 0 0 0 0 0 426.267 0 0 0 0 0 0 2093.8 -425.657 0 0 0 0 0 1474.73 1300.01 0 0 -856.273 0 0 0 0 0 0 -2473.3 667.211 0 -1268.43 0 0 0 0 0 0 0 0 0 0 0 0 0 0 0 0 0 1779.76 562.99 -1305.66 1601.99 1227.68 0 0 0 0 0 0 0 0 -1143.6 0 0 
0 0 0 516.449 0 1370.36 0 -638.676 0.06 2082.66 0 0 0 -2008.04 0 0 0 0 0 0 0 0 0 0 0 2388 0 -224.54 0 0 0 0 0 0 -611.515 0 0 631.962 0 0 0 0 1273.61 0 0 0 0 0 2292.78 0 0 0 0 0 0 111.011 0 0 1591.62 0 0 1743.29 -230.338 0 0 0 0 0 0 0 0 0 1701.18 0 -2322.23 0 0 0 0 0 0 0 
0 1643.8 -1562.47 0 0 0 0 -1760.69 1639.07 0.08 0 0 0 0 0 2342.07 -853.984 2169.48 1310.54 -1354.18 0 -1782.97 0 0 0 1885.36 2166.89 0 0 0 2170.55 0 0 0 0 -872.143 1180.53 0 0 0 0 0 0 0 0 0 0 0 0 0 0 0 0 0 -511.414 0 0 1174.28 1423 0 0 0 0 0 0 0 0 0 0 0 0 0 820.414 0 237.358 0 -902.203 0 0 0 21.7444 0 
-301.141 1279.11 0 0 0 0 0 0 0 0 0.06 0 0 728.401 0 294.885 623.569 0 1623.97 993.606 84.3074 0 0 0 0 -564.821 0 0 0 0 0 0 0 0 0 0 0 620.67 0 0 -1542.18 0 0 -678.198 0 0 0 -705.969 0 0 0 0 1094.47 0 -1482.51 0 0 0 0 747.475 0 0 0 -416.501 0 0 -1081.8 0 933.332 0 0 0 0 0 0 0 0 0 0 0 0 0 
0 169.607 1672.03 0 0 0 0 0 0 0 0 0.08 0 0 0 0 0 -443.052 0 0 770.974 0 0 0 0 0 0 0 0 0 0 263.146 2412.26 0 324.641 0 0 -2428.74 0 954.848 0 982.467 0 0 0 0 0 0 0 2353.21 0 0 2142.17 0 0 0 0 0 0 0 0 1647.01 0 0 0 0 263.604 0 0 0 0 0 0 0 0 0 -254.448 1731.85 1993.55 0 0 0 
-2411.19 0 0 1863.99 0 1016.04 0 0 0 0 0 0 0.03 0 0 0 0 0 0 0 1247.67 0 1843.39 0 131.001 0 0 0 0 0 811.563 2363.28 0 0 0 0 0 0 0 0 0 0 -1225.39 0 0 0 0 -2187.8 0 0 -351.802 0 2093.49 0 0 0 0 0 0 0 0 0 0 0 0 0 0 0 0 1236.99 0 0 2389.52 0 633.03 0 0 0 0 0 0 0 
142.598 0 -960.189 0 0 0 0 0 -442.289 0 310.602 0 0 0.04 0 0 0 0 0 0 0 0 0 0 0 2486.42 945.997 0 0 0 0 0 0 0 2359.77 0 0 0 1637.39 -2020.55 2143.09 0 0 0 0 0 0 0 0 0 0 0 0 2225.49 0 0 0 0 0 0 0 0 -771.432 0 0 0 0 0 -1647.62 0 0 0 0 0 0 0 0 -542.238 0 0 0 0 
0 0 0 684.759 1323.97 0 0 2117.91 0 0 0 0 0 0 0 0 0 0 0 0 965.987 1899.4 0 0 0 0 2492.68 0 0 0 -1735.66 1642.28 0 1005.97 0 0 0 2242.58 0 1251.95 0 0 0 853.679 0 0 0 0 0 0 0 0 0 0 0 0 -2375.64 0 0 0 1280.33 0 -1587.19 0 0 0 0 0 0 0 0 0 0 -2214.5 0 0 0 0 0 0 0 0 
0 0 0 0 -2156.21 0 0 0 0 1597.42 -1092.49 0 0 0 0 0.06 1659.52 0 0 0 0 0 1053.12 0 1081.8 1520.81 0 0 0 0 0 -1508 0 0 0 667.058 1632.21 0 1146.5 -1619.85 0 0 0 0 0 0 0 0 0 0 0 0 0 0 0 0 0 0 1994 0 0 0 0 0 0 -932.722 0 0 0 0 0 0 0 0 0 0 0 0 0 0 0 0 
0 685.369 0 2440.64 0 0 2233.88 0 0 115.284 599.307 0 0 0 0 -301.447 0.01 562.075 -2349.85 0 0 0 0 0 0 787.301 0 0 0 0 -538.728 0 165.334 0 0 0 0 0 0 0 0 0 1889.02 0 -2357.17 0 0 0 0 0 0 0 0 0 0 0 0 0 0 0 0 0 0 1290.4 0 0 0 0 0 0 0 0 0 0 0 0 0 0 0 0 0 0 
0 0 1894.67 0 0 1906.57 802.103 0 0 1686.99 0 -2456.82 0 0 0 0 2049.24 0.01 0 1323.21 0 0 -1760.69 0 0 0 0 2134.39 0 0 0 1340.45 0 0 1823.71 0 -324.03 0 890.606 1353.27 -1769.54 0 0 0 1521.12 0 0 0 0 0 0 0 0 0 0 -2308.8 -824.076 0 -1003.52 0 0 0 2324.82 0 0 0 0 0 0 2036.42 0 0 0 0 0 0 0 0 0 0 0 2098.83 
0 -2333.06 0 0 0 0 0 0 0 1837.29 2215.26 0 0 0 0 0 320.826 0 0.02 0 0 0 2417.29 0 0 0 0 -2066.79 0 0 0 0 1729.71 0 847.423 0 2305.44 0 0 0 0 0 0 1142.38 0 0 0 0 0 0 0 0 0 370.266 -457.854 0 0 0 0 -2356.56 0 0 0 0 0 0 0 0 0 0 0 0 0 0 0 0 0 0 0 0 0 0 
1737.49 0 0 0 0 0 45.5489 0 0 -680.792 -695.898 0 0 0 0 0 0 968.429 0 0.02 0 2260.89 0 236.595 2131.34 0 1979.2 0 0 0 607.7 0 0 0 0 0 0 0 0 0 0 0 0 -1829.2 0 2392.73 0 0 0 0 0 0 0 0 0 0 0 0 0 2316.74 0 0 0 0 0 0 -919.294 0 0 0 0 0 0 0 2337.18 0 0 0 0 0 -108.264 0 
-210.196 0 945.692 0 0 0 0 1350.83 0 0 1772.44 -2240.14 2427.52 0 1008.26 0 0 0 0 0 0.08 0 0 -844.523 0 0 0 -321.131 0 0 0 0 1291.47 0 0 0 0 0 0 0 0 0 -1059.53 0 0 0 539.338 0 0 0 0 0 0 0 0 0 0 0 0 0 0 0 0 0 0 0 237.663 0 0 -1896.95 0 0 698.798 582.522 0 0 0 0 0 -837.809 0 0 
861.919 -1342.28 0 1939.83 1573.46 0 0 0 0 -1585.67 0 0 0 0 -245.598 0 0 0 0 964.461 0 0.07 0 0 0 0 0 0 1918.47 0 -384.304 0 0 -67.217 0 219.962 0 2403.87 -357.753 2004.84 0 0 0 0 -1491.67 0 0 0 0 0 0 0 478.759 0 0 0 0 0 0 0 0 0 0 0 0 -837.504 0 0 0 0 1952.65 0 -1383.48 0 0 0 0 0 0 -2258.9 0 11.063 
0 2451.48 0 -1674.93 -1698.89 1190.76 0 0 0 0 0 0 1168.78 0 0 1625.19 0 -751.442 766.854 0 0 0 0.04 -1980.73 0 0 0 0 0 0 0 0 0 0 -2375.33 0 0 -1940.75 2405.39 0 0 1277.89 -707.19 1721.47 0 0 0 0 0 0 0 0 0 0 0 0 0 0 0 0 0 0 0 0 0 0 0 0 0 0 0 0 0 0 -39.7504 0 847.423 2445.83 641.27 0 767.312 0 
0 0 0 0 122.608 0 0 0 0 0 0 0 0 0 0 0 0 0 0 -1566.13 655.156 0 989.029 0.06 2059.16 -429.624 0 0 0 0 0 0 0 0 0 2248.99 755.409 1123.92 0 0 0 0 0 803.629 0 0 0 0 0 0 0 0 0 0 0 0 -571.993 0 -463.042 -1233.33 0 0 0 0 0 0 0 0 0 0 0 0 17.1667 0 0 0 -262.23 0 0 0 -2230.22 0 
381.71 2384.03 0 0 0 1457.79 0 0 0 0 0 0 462.127 0 0 -390.255 0 0 0 2283.01 0 0 0 -2492.98 0.09 0 -1948.68 0 0 0 0 0 0 2138.05 0 0 0 0 0 -1067.61 0 0 0 -780.282 0 -2165.97 0 0 0 1508.3 0 0 -326.93 0 0 0 0 0 0 0 0 0 0 0 0 0 0 0 0 0 0 0 -226.829 0 0 0 0 0 0 0 0 0 
1270.87 0 0 0 1965.77 0 0 0 -2468.87 1775.8 2464.29 0 0 -2022.39 0 -621.586 955.306 0 0 0 0 0 0 1355.1 0 0.04 0 0 943.556 0 0 0 0 0 0 0 0 2124.47 -2045.88 0 0 0 0 0 0 0 0 0 0 0 0 0 0 0 0 0 0 0 0 0 0 0 0 0 0 0 0 0 0 0 0 0 0 0 -427.793 1214.71 0 0 0 0 0 0 
1729.26 -1865.37 2229.15 0 0 0 0 0 0 93.0052 0 0 0 -183.035 -867.87 0 0 0 0 356.227 0 0 0 0 2118.37 0 0.03 288.934 0 0 0 0 0 629.063 59.4348 868.328 2473.6 0 0 0 0 0 0 0 0 0 0 732.978 0 0 0 0 0 1146.66 0 0 -1977.98 194.784 -1049 0 0 0 0 0 0 1022.45 0 0 -1495.79 0 0 0 0 -1640.45 0 0 0 0 0 0 0 -1922.44 
0 0 0 0 0 0 1513.03 -760.292 1700.72 0 0 0 0 0 0 0 0 1879.86 989.486 0 11.8259 0 0 0 0 0 471.282 0.05 0 1511.81 0 -2265.47 0 0 -1035.72 -352.718 523.927 0 0 0 -1516.24 0 0 0 0 0 0 0 -1800.97 0 0 0 0 0 0 0 1901.07 0 0 0 0 0 0 0 0 0 0 260.247 0 645.39 0 0 0 0 -1354.18 0 0 0 -1888.56 0 0 0 
0 1281.09 0 0 -410.855 0 0 587.1 0 0 0 0 0 0 0 0 0 0 0 0 0 -3.43333 0 0 0 -1552.71 0 0 0.08 0 0 -384.915 0 0 0 0 0 -552.614 0 0 -395.138 0 1634.04 0 0 0 1576.66 -1932.97 0 0 1793.5 0 0 0 0 0 0 0 0 0 0 0 2030.32 720.771 0 0 0 0 0 0 0 0 0 0 0 0 0 2356.56 0 676.824 0 0 
0 0 0 0 0 0 0 0 0 0 0 0 0 0 0 0 0 0 0 0 0 0 0 0 0 0 0 1814.25 0 0.02 0 0 0 0 0 930.738 -438.475 1356.78 0 0 0 0 401.547 1210.75 0 0 0 0 0 0 0 0 406.43 0 0 0 0 0 0 -422.605 -983.23 0 0 0 0 0 0 0 0 0 0 1314.05 0 0 0 0 0 0 0 -1682.41 2413.63 0 
856.426 0 0 0 0 0 0 0 0 859.63 0 0 1396.15 0 1651.74 0 -539.033 0 0 -742.744 0 -2471.01 0 0 0 0 0 0 0 0 0.01 2123.55 -238.884 0 0 668.584 0 2219.38 0 0 0 0 -732.978 330.439 0 0 0 0 -2190.69 0 0 557.802 0 0 0 0 0 -1424.68 0 0 0 0 0 0 0 0 0 -1687.6 0 0 0 0 2001.33 0 0 0 0 0 0 0 0 0 
0 0 -2203.36 911.664 0 0 -95.7518 0 0 0 0 1901.23 -345.698 0 2242.73 2234.03 0 2174.37 0 0 0 0 0 0 0 0 0 -327.082 -656.529 0 286.95 0.06 -134.358 -230.033 0 0 0 0 -1484.04 0 0 0 0 0 0 0 0 0 0 0 0 -1305.2 0 0 -1199.15 0 -455.718 0 0 0 0 0 0 0 0 0 0 0 0 0 0 0 0 0 0 0 0 0 0 0 0 0 
0 0 0 0 635.167 0 0 0 0 0 0 517.365 0 0 0 0 1517.61 0 740.455 0 -1054.8 0 0 0 0 0 0 0 0 0 2014.45 -1148.95 0.06 0 1822.79 0 0 0 -850.475 -661.87 0 0 0 0 0 0 0 0 0 0 0 0 0 0 0 -367.977 0 0 0 0 0 -1486.94 -1542.18 0 0 0 0 0 0 0 0 0 0 0 0 0 0 0 0 0 0 0 
0 0 0 0 1698.89 0 0 0 0 0 0 0 0 0 1797.92 0 0 0 0 0 0 2062.52 0 0 505.158 0 -1605.81 0 0 0 0 -623.417 0 0.04 0 926.923 0 0 1398.43 0 0 361.568 0 0 0 0 0 0 0 -1371.88 0 0 0 0 0 0 0 0 0 0 0 0 0 0 0 0 0 0 0 0 0 0 0 0 0 0 0 0 0 0 0 0 
1947.46 0 0 0 1439.79 0 0 -59.74 1163.59 0 0 -2454.68 0 168.844 0 0 0 2373.35 -940.504 0 0 0 1452.45 0 0 0 1022.6 1796.85 0 0 0 0 5.56963 0 0.01 0 0 0 -2082.66 0 0 0 0 0 0 0 0 0 0 0 873.363 0 0 0 0 0 0 0 0 0 0 0 0 0 0 0 0 2293.08 -2096.7 0 0 0 0 0 0 0 0 0 0 0 0 0 
0 0 0 0 1166.34 0 929.365 478.149 0 1550.72 0 0 0 0 0 -270.928 0 0 0 0 0 -1163.75 0 162.282 0 0 -286.798 2134.39 0 2427.98 94.0733 0 0 -2087.24 0 0.05 0 0 0 0 0 -2290.03 2289.12 0 0 0 2336.12 0 0 0 0 0 0 0 0 0 0 0 0 0 0 0 0 0 0 0 0 0 0 0 0 0 0 0 0 0 0 0 0 0 0 0 
1699.8 0 0 0 0 1480.38 0 0 0 -240.562 0 0 0 0 0 -1041.06 0 2427.82 629.521 0 0 0 0 1662.11 0 0 -2333.67 730.232 0 2284.69 0 0 0 0 0 0 0.06 0 0 0 0 -1533.78 0 0 0 0 0 -1102.71 0 0 0 0 -579.012 0 0 0 0 0 72.1 0 0 0 0 0 0 0 0 0 0 0 0 764.718 0 1008.87 0 0 0 0 1026.87 449.767 0 0 
0 0 0 1839.27 0 0 0 0 1969.13 0 88.8852 -2435.15 0 0 1997.67 0 0 0 0 0 0 1129.41 352.565 708.258 0 -78.6615 0 0 -617.618 939.131 -1577.73 0 0 0 0 0 0 0.05 0 0 0 2470.09 0 0 0 1544.62 0 0 0 0 0 0 0 0 0 0 0 0 0 0 0 0 1592.68 0 0 0 -290.307 0 0 0 0 1186.18 0 1292.84 0 0 -2232.05 0 0 0 -698.34 -7.55333 
0 0 0 1830.27 -425.81 646.916 0 993.454 0 0 0 0 0 -420.774 0 -920.972 0 2250.51 0 0 0 1033.89 -1194.72 0 0 1618.47 0 0 0 0 0 -2233.88 -358.364 -1974.17 1431.39 0 0 0 0.04 0 0 0 0 0 6.79037 0 0 0 2427.82 0 0 -1453.37 0 0 0 0 0 0 0 0 0 0 0 0 0 0 0 0 0 0 -1170.16 0 0 0 0 0 0 0 0 0 0 1119.34 
0 1747.41 0 0 0 0 0 0 0 0 0 -60.8081 0 1197.32 1174.28 69.3533 0 -985.214 0 0 0 868.48 0 0 -2116.08 0 0 0 0 0 0 0 1547.52 0 0 0 0 0 0 0.05 0 -1745.58 2188.86 0 0 0 0 0 0 0 0 0 0 0 0 0 0 0 0 0 0 1160.85 0 0 474.029 0 0 0 0 0 0 0 0 0 0 0 0 0 0 0 0 2223.2 
1227.23 -229.423 0 0 0 109.18 0 0 0 0 -1626.56 0 0 2383.42 0 0 0 1324.88 0 0 0 0 0 0 0 0 0 616.55 801.187 0 0 0 0 0 0 0 0 0 0 0 0.09 0 0 0 -75.6096 0 0 0 0 -33.4941 0 0 0 -1928.24 0 0 -319.605 0 0 0 0 0 0 1885.2 0 -2006.21 360.5 0 -247.734 2320.86 0 0 0 0 0 998.032 190.97 0 0 0 0 0 
0 0 0 0 1497.77 0 0 0 0 0 0 910.138 0 0 0 0 0 0 0 0 0 0 2459.72 0 0 0 0 0 0 0 0 0 0 2240.44 0 2318.57 1257.59 723.67 0 1456.42 0 0.06 -748.543 0 0 0 0 0 0 0 0 0 0 0 0 0 0 0 0 0 0 868.023 0 1153.68 0 0 0 0 0 0 0 -2058.85 0 0 0 0 0 0 0 0 0 0 
0 0 0 1457.18 0 312.891 0 0 -642.033 0 0 0 1291.01 0 0 0 2259.51 0 0 0 -1771.37 0 -1024.74 0 0 0 0 0 -1485.41 1275.6 1390.96 0 0 0 0 1856.36 0 0 0 -994.98 0 2314.91 0.02 966.292 0 0 0 0 1452.6 0 -536.286 0 0 0 0 0 0 0 0 0 0 0 0 0 0 0 1235.16 0 0 0 0 0 -186.697 0 0 0 0 0 0 0 0 0 
0 -2441.25 0 1530.58 0 0 0 0 0 0 -880.993 0 0 0 8.46889 0 0 0 1788.31 -1687.6 0 0 2331.84 876.873 383.541 0 0 0 0 -1403.32 2000.41 0 0 0 0 0 0 0 0 0 0 0 1377.99 0.06 0 0 0 0 0 0 0 0 0 0 0 0 0 0 0 0 0 0 1915.42 0 -542.543 0 0 0 0 0 0 0 0 0 0 0 0 1953.72 0 0 0 0 
0 2020.25 0 0 502.564 0 0 0 0 0 0 0 0 0 0 0 1574.53 -735.115 0 0 0 -673.315 0 0 0 0 0 0 0 0 0 0 0 0 0 0 0 0 1902.14 0 -164.266 0 0 0 0.06 0 -571.078 0 0 0 0 0 0 0 0 0 0 0 0 0 0 0 0 0 0 0 0 0 0 0 1641.67 0 0 -2266.99 0 0 0 0 0 0 0 0 
0 0 -238.731 0 0 0 0 854.9 0 0 0 0 0 0 0 0 0 0 0 1660.44 0 0 0 0 2058.7 0 0 0 0 0 0 0 0 0 0 0 0 -2042.38 0 0 0 0 0 0 0 0.03 0 0 0 0 0 0 0 0 0 0 0 -1109.27 0 0 0 0 0 0 0 -559.175 0 0 0 0 0 0 0 0 0 0 0 0 0 0 0 0 
2102.5 0 0 -591.983 0 210.044 0 -2069.54 0 0 0 0 0 0 0 0 0 0 0 0 616.245 0 0 0 0 0 0 0 40.0555 0 0 0 0 0 0 1866.44 0 0 0 0 0 0 0 0 2238 0 0.04 0 0 0 1649.3 0 1713.39 0 1722.08 0 0 0 1982.86 0 0 0 0 0 0 0 0 0 0 0 5.72222 -489.288 0 0 0 0 0 0 0 0 0 0 
0 0 0 0 0 0 0 0 0 0 2118.37 0 1119.19 0 0 0 0 0 0 0 0 0 0 0 0 0 1316.64 0 2376.71 0 0 0 0 0 0 0 -155.873 0 0 0 0 0 0 0 0 0 0 0.01 0 0 0 0 132.984 0 1064.71 0 0 0 0 0 0 0 0 0 0 0 0 0 0 1566.59 0 0 0 0 0 0 0 -1698.43 0 0 0 -454.344 
0 0 0 0 0 0 0 1854.38 2318.26 0 0 0 0 0 0 0 0 0 0 0 0 0 0 0 0 0 0 5.87481 0 0 1653.72 0 0 0 0 0 0 0 1287.19 0 0 0 2075.33 0 0 0 0 0 0.08 0 0 774.941 0 0 0 0 -1148.79 0 1840.34 0 -1788.77 0 0 0 0 0 0 0 2363.28 0 0 0 0 -1159.02 0 0 0 0 0 226.218 0 -912.275 
-426.725 0 0 0 0 0 0 0 0 0 0 2396.54 0 0 0 0 0 0 0 0 0 0 0 0 -689.642 0 0 0 0 0 0 0 0 -724.586 0 0 0 0 0 0 1786.32 0 0 0 0 0 0 0 0 0.09 0 0 0 0 0 0 0 0 0 0 0 0 0 0 1595.28 0 0 0 0 0 0 0 0 0 0 0 0 0 0 0 0 0 
0 0 0 1747.72 0 0 -1806.77 0 0 0 0 0 2090.14 0 0 0 0 0 0 0 0 0 0 0 0 0 0 0 2088.61 0 0 0 0 0 2123.86 0 0 0 0 0 0 0 -1042.74 0 0 0 -308.008 0 0 0 0.06 0 0 0 0 -876.568 0 0 0 0 0 0 0 2222.74 0 0 0 0 0 0 1699.65 0 0 0 0 0 0 1253.01 761.208 0 0 0 
0 0 0 0 1286.13 1910.38 0 0 0 0 0 0 0 0 0 0 0 0 0 0 0 0 0 0 0 0 0 0 0 0 210.807 673.772 0 0 0 0 0 0 -2027.12 0 0 0 0 0 0 0 0 0 2342.22 0 0 0.03 0 0 431.455 0 0 2079.61 0 2400.66 0 0 0 0 0 96.3622 -679.571 0 0 0 0 0 0 0 0 0 0 0 0 0 0 0 
-776.925 0 0 0 0 0 781.503 0 0 0 -424.284 984.603 2270.96 0 0 0 0 0 0 0 0 1129.11 0 0 109.638 0 0 0 0 -914.563 0 0 0 0 0 0 396.207 0 0 0 0 0 0 0 0 0 2086.47 -685.522 0 0 0 0 0.06 0 0 0 0 0 0 -1195.49 0 -1926.56 0 0 0 1612.83 0 0 0 0 0 0 0 0 0 0 0 0 0 0 93.7681 0 
0 0 0 0 0 0 0 0 0 0 0 0 0 -1521.12 0 0 0 0 193.106 0 0 0 0 0 0 0 2418.82 0 0 0 0 0 0 0 0 0 0 0 0 0 342.189 0 0 0 0 0 0 0 0 0 0 0 0 0.05 0 0 0 502.258 0 0 0 0 0 0 0 0 0 0 0 0 0 0 -999.557 2211.29 0 0 0 0 0 0 2220.76 0 
0 0 1290.55 0 0 0 0 0 0 -526.215 -1400.27 0 0 0 0 0 0 0 -485.321 0 0 0 0 0 0 0 0 0 0 0 0 2037.64 0 0 0 0 0 0 0 0 0 0 0 0 0 0 1456.42 1026.26 0 0 0 -1862.16 0 0 0.08 0 0 0 0 0 0 0 0 0 0 0 0 0 0 0 0 0 0 -978.195 0 0 0 0 0 0 0 0 
0 0 0 0 0 0 0 0 41.5815 0 0 0 0 0 0 0 0 1860.64 0 0 0 0 0 0 0 0 0 0 0 0 0 0 -682.47 0 0 0 0 0 0 0 0 0 0 0 0 0 0 0 0 0 -899.457 0 0 0 0 0.01 0 0 0 0 0 918.378 1648.53 0 1625.34 0 0 1409.73 -2405.7 0 0 0 0 0 0 0 0 0 0 0 0 0 
0 0 0 0 0 888.623 0 0 0 0 0 0 0 0 2407.22 0 0 2004.23 0 0 0 0 0 -2234.34 0 0 -1416.44 -1742.38 0 0 0 2181.54 0 0 0 0 0 0 0 0 1985.46 0 0 0 0 0 0 0 2248.22 0 0 0 0 0 0 0 0.02 488.067 0 0 0 0 0 0 0 0 0 0 -1924.57 -1054.49 0 0 0 0 0 0 0 0 0 0 0 0 
0 0 0 0 566.805 -974.837 0 0 0 2244.41 0 0 0 0 0 0 0 0 0 0 0 0 0 0 0 0 1343.5 0 0 0 -647.374 0 0 0 0 0 0 0 0 0 0 0 0 0 0 2469.63 0 0 0 0 0 -324.183 0 4.80667 0 0 -580.386 0 0 0 0 0 0 0 0 -417.57 0 0 0 0 0 345.546 0 0 2284.23 0 0 72.5578 0 0 -1753.06 0 
0 0 0 0 0 0 0 0 1945.94 -24.9489 0 0 0 0 0 2422.33 0 -1630.22 0 0 0 0 0 -36.6985 0 0 736.946 0 0 0 0 0 0 0 0 0 -336.238 0 0 0 0 0 0 0 0 0 1761.15 0 276.574 0 0 0 0 0 0 0 0 0 0.04 0 0 0 0 0 0 0 0 0 0 0 0 0 0 0 0 0 0 0 0 0 0 0 
0 0 0 0 0 0 0 0 0 0 2083.42 0 0 0 0 0 0 0 -1370.97 1882.61 0 0 0 -861.461 0 0 0 0 0 -1396.15 0 0 0 0 0 0 0 0 0 0 0 0 0 0 0 0 0 0 0 0 0 781.655 2386.47 0 0 0 0 0 0 0.05 -2418.36 0 2278.28 0 0 0 0 0 0 0 0 0 0 0 0 -1728.49 0 0 0 0 0 0 
0 0 0 0 0 0 0 0 0 0 0 0 0 0 1143.3 0 0 0 0 0 0 0 0 0 0 0 0 0 0 2023 0 0 0 0 0 0 0 0 0 0 0 0 0 0 0 0 0 0 1175.8 0 0 0 0 0 0 0 0 0 0 -1891.31 0.09 0 0 0 0 0 0 1401.49 0 -2267.6 0 0 0 0 0 0 0 0 0 0 502.106 0 
0 0 0 0 613.346 0 0 0 -2423.55 0 0 1791.36 0 0 0 0 0 0 0 0 0 0 0 0 0 0 0 0 0 0 0 0 -1889.48 0 0 0 0 0 0 1862.62 0 442.442 0 0 0 0 0 0 0 0 0 0 -1151.84 0 0 2198.63 0 0 0 0 0 0.02 0 0 0 0 0 0 0 593.509 0 0 0 0 0 964.309 0 0 0 0 0 -1988.97 
0 0 0 0 0 0 0 0 1438.87 0 0 0 0 2093.34 865.429 0 0 582.064 0 0 0 0 0 0 0 0 0 0 1726.66 0 0 0 920.972 0 0 0 0 1764.35 0 0 0 0 0 -1507.54 0 0 0 0 0 0 0 0 0 0 0 -2126.61 0 0 0 -1909.31 0 0 0.01 0 980.789 0 0 0 0 0 0 -594.577 0 0 0 0 0 -1769.23 2250.97 0 0 0 
0 -2016.89 0 0 0 1826.76 0 0 0 0 1055.71 0 0 0 0 0 2182 0 0 0 0 0 0 0 0 0 0 0 1819.9 0 0 0 0 0 0 0 0 0 0 0 2322.23 589.846 0 0 0 0 0 0 0 0 -784.402 0 0 0 0 0 0 0 0 0 0 0 0 0.03 0 0 0 0 0 0 1442.99 0 0 1827.98 0 0 0 0 0 0 0 0 
0 0 0 0 -1483.58 0 0 0 0 0 0 0 0 0 0 0 0 0 0 0 0 0 0 0 0 0 0 0 0 0 0 0 0 0 0 0 0 0 0 1733.68 0 0 0 2073.35 0 0 0 0 0 2422.94 0 0 0 0 0 -167.165 0 0 0 0 0 0 -78.0511 0 0.05 0 0 -2228.54 0 0 0 0 -1922.9 0 0 0 0 0 0 0 0 0 
0 0 0 0 1303.98 0 0 0 0 0 0 0 0 0 0 -250.633 0 0 0 0 0 892.285 0 0 0 0 1754.59 0 0 0 0 0 0 0 0 0 0 0 0 0 -884.655 0 0 0 0 398.343 0 0 0 0 0 -210.044 1658.15 0 0 0 0 -1508.76 0 0 0 0 0 0 0 0.03 0 0 0 0 0 -388.119 0 0 0 0 0 0 0 0 0 0 
0 -1397.21 0 0 0 0 0 2419.13 0 0 2109.36 2474.52 0 0 0 0 0 0 0 1046.56 1762.67 0 0 0 0 0 0 0 0 0 0 0 0 0 0 0 0 -1080.58 0 0 -955.458 0 -345.241 0 0 0 0 0 0 0 0 1204.49 0 0 0 0 0 0 0 0 0 0 0 0 0 0 0.08 0 0 0 -2104.94 0 0 0 0 0 0 -1619.69 0 0 0 0 
0 0 0 0 0 1335.87 0 575.503 0 0 0 0 0 0 0 0 0 0 0 0 0 0 0 0 0 0 0 1431.09 0 0 1054.49 0 0 0 -585.421 0 0 0 0 0 0 0 0 0 0 0 0 0 0 0 0 0 0 0 0 -1750.31 0 0 0 0 2331.39 0 0 0 -1043.5 0 0 0.02 0 -1581.39 0 854.595 0 0 0 -950.728 0 0 0 0 0 1129.11 
0 0 0 1882.76 0 0 0 445.036 0 0 -335.017 0 0 -1322.29 0 0 0 0 0 0 0 0 0 0 0 0 928.297 0 0 0 0 0 0 0 921.43 0 0 0 0 0 -1728.49 0 0 0 0 0 0 0 1732.76 0 0 0 0 0 0 2479.4 -327.235 0 0 0 0 0 0 0 0 0 0 0 0.02 20.3711 0 458.922 0 0 0 0 0 1193.35 0 0 -2005.75 0 
0 0 0 0 0 0 0 623.722 0 0 0 0 -2323.91 0 0 0 0 -1285.52 0 0 720.313 0 0 0 0 0 0 2456.21 0 0 0 0 0 0 0 0 0 0 0 0 759.377 0 0 0 0 0 0 -1940.9 0 0 0 0 0 0 0 0 428.861 0 0 0 336.695 165.181 0 0 0 0 0 1645.94 2172.69 0.09 0 0 0 592.135 0 0 -876.415 -1397.98 0 0 0 0 
0 0 -585.421 0 0 0 2083.12 1031.75 0 0 0 0 0 0 0 0 0 0 0 0 0 1218.99 0 0 0 0 0 0 0 0 0 0 0 0 0 0 0 0 807.138 0 0 0 0 0 2100.82 0 -500.732 0 0 0 -1669.9 0 0 0 0 0 0 0 0 0 0 0 0 -347.53 0 0 -2431.64 0 0 0 0.06 0 0 0 0 0 0 0 0 0 0 0 
-1743.75 0 0 0 0 0 0 0 0 0 0 0 0 0 0 0 0 0 0 0 0 0 0 0 0 0 0 0 0 1156.12 0 0 0 0 0 0 1203.73 -1045.64 0 0 0 1025.5 0 0 0 0 -865.276 0 0 0 0 0 0 0 0 0 0 -47.38 0 0 0 0 2315.21 0 0 -1793.65 0 864.971 -792.795 0 0 0 0 0 0 0 0 -342.647 0 0 0 0 
0 0 2089.07 0 235.984 0 0 0 -529.878 -1669.9 0 0 -391.171 0 0 0 0 0 0 0 191.122 1824.02 0 586.489 -573.519 0 0 0 0 0 -595.187 0 0 0 0 0 0 0 0 0 0 0 124.134 0 0 0 0 0 0 0 0 0 0 617.618 0 0 0 0 0 0 0 0 0 0 233.39 0 0 0 0 0 0 0 0.07 0 0 2266.99 0 0 -282.983 0 0 0 
0 0 0 0 0 0 0 0 0 0 0 0 0 0 150.075 0 0 0 0 0 267.876 0 0 0 0 0 -1562.01 0 0 0 0 0 0 0 0 0 2192.22 -929.518 0 0 0 0 0 0 -619.755 0 0 0 1949.75 0 0 0 0 -1441.01 420.164 0 0 0 0 0 0 0 0 1676.46 0 0 0 0 0 2373.04 0 0 0 0.04 0 0 0 0 0 1791.21 0 0 
0 1927.93 0 0 0 0 0 0 1125.75 -333.644 0 0 -2401.88 0 0 0 0 0 0 1796.85 0 0 1721.63 0 0 -715.43 0 2467.35 0 0 0 0 0 0 0 0 0 0 0 0 0 0 0 0 0 0 0 0 0 0 0 0 0 0 0 0 0 659.886 0 0 0 0 0 0 0 0 0 0 0 0 0 0 0 0 0.03 0 0 0 0 0 0 0 
0 0 2213.58 0 0 0 -818.278 0 0 0 0 0 0 0 0 0 0 0 0 0 0 0 0 0 0 1447.42 0 0 0 0 0 0 0 0 0 0 0 0 0 0 763.344 0 0 0 0 0 0 0 0 0 0 0 0 0 0 0 0 0 0 1510.28 0 1716.28 0 0 0 0 0 2066.94 0 0 0 0 -2008.04 0 0 0.07 0 0 0 0 0 0 
1027.18 0 0 1972.03 0 0 0 0 0 2013.69 0 1070.82 0 0 0 0 0 0 0 0 0 0 -1160.08 -1588.41 0 0 0 0 0 0 0 0 0 0 0 0 0 2254.48 0 0 -2452.24 0 0 0 0 0 0 0 0 0 0 0 0 0 0 0 0 0 0 0 0 0 0 0 0 0 0 0 0 1707.59 0 0 0 0 0 0 0.06 0 0 0 1297.42 0 
2362.21 0 0 0 0 0 0 0 0 0 0 2147.51 0 338.832 0 0 0 0 0 0 0 0 868.938 0 0 0 0 0 -466.247 0 0 0 0 0 0 0 0 0 0 0 0 0 0 337.306 0 0 0 1133.84 0 0 -193.411 0 0 0 0 0 0 -1703.31 0 0 0 0 620.518 0 0 0 2321.77 0 -1161.46 189.596 0 -449.919 0 0 0 0 0 0.01 0 0 0 2455.29 
0 0 0 0 0 0 0 0 0 0 0 -317.774 0 0 0 0 0 0 0 0 0 0 128.712 0 0 0 0 -20.9815 0 0 0 0 0 0 0 0 -85.9859 0 0 0 0 0 0 0 0 0 0 0 0 0 1677.22 0 0 0 0 0 0 0 0 0 0 0 1609.62 0 0 0 0 0 0 0 0 0 -1695.23 0 0 0 0 0 0.05 0 523.469 0 
0 859.02 0 2362.97 0 0 0 1445.28 0 0 0 0 0 0 0 0 0 0 0 0 532.167 705.512 0 0 0 0 0 0 -168.996 -1716.28 0 0 0 0 0 0 1466.03 0 0 0 0 0 0 0 0 0 0 0 1188.92 0 0 0 0 0 0 0 0 0 0 0 0 0 0 0 0 0 0 0 0 0 0 0 0 2293.24 0 0 0 0 0 0.09 0 -629.368 
0 0 0 0 0 0 0 0 0 -1951.73 0 0 0 0 0 0 0 0 0 -2065.72 0 0 -555.208 2043.29 0 0 0 0 0 654.088 0 0 0 0 0 0 0 1711.4 0 0 0 0 0 0 0 0 0 0 0 0 0 0 977.584 531.861 0 0 0 -433.592 0 0 -904.95 0 0 0 0 0 0 0 -1219.14 0 0 0 0 0 0 0 1240.5 0 2011.25 0 0.07 0 
0 0 0 0 0 0 0 0 0 0 0 0 0 0 0 0 0 -884.808 0 0 0 1332.36 0 0 0 0 1112.02 0 0 0 0 0 0 0 0 0 0 176.626 -669.805 351.192 0 0 0 0 0 0 0 1935.87 1862.01 0 0 0 0 0 0 0 0 0 0 0 0 0.0762963 0 0 0 0 0 -2191 0 0 0 0 0 0 0 0 0 2384.95 0 -2268.21 0 0.08 
