*Vertices 42
*Matrix 
0.04 0 0 0 0 0 0 0 0 0 0 1653.42 0 0 0 0 0 0 0 0 0 1952.5 455.26 0 0 1692.33 2346.34 0 275.201 0 0 0 0 0 0 0 0 0 0 0 0 0 
0 0.02 772.652 0 0 -557.192 0 0 0 0 0 0 0 0 1159.02 0 0 0 0 702.765 0 0 0 0 0 0 0 0 0 0 0 0 0 2291.1 1430.94 0 0 0 0 0 -646.611 0 
0 -334.101 0.03 0 0 0 2042.99 0 502.411 -1662.72 0 0 0 -570.467 2342.22 0 0 0 0 0 0 -1788.77 0 0 0 0 0 0 899.915 0 0 0 0 0 0 0 0 0 0 0 0 0 
0 0 0 0.03 0 0 0 0 0 0 0 0 0 0 0 625.095 0 0 0 1574.98 0 0 0 0 0 463.5 0 0 0 0 0 0 0 0 0 -1238.06 0 0 0 0 0 0 
0 0 0 0 0 0 0 153.127 0 -694.525 0 0 1123 0 1919.69 0 -1217.31 0 -1163.9 0 0 0 0 0 0 1765.11 0 0 0 0 0 0 0 0 0 0 0 0 0 0 0 0 
0 -949.507 0 0 0 0.06 0 0 0 1113.39 0 -1548.89 0 0 0 1168.63 0 -39.4452 0 0 0 0 0 0 0 0 0 0 0 0 0 0 0 0 0 0 0 0 0 0 0 0 
0 0 1496.86 0 0 0 0.01 0 0 0 0 0 0 0 0 2407.38 0 0 0 0 0 0 0 0 0 0 1037.55 779.061 2479.71 0 -1968.98 0 1873.76 0 0 0 0 0 0 0 0 0 
0 0 0 0 -454.65 0 0 0.06 0 0 -909.07 1156.42 0 0 0 0 0 0 0 0 2238.3 0 0 1292.54 0 0 0 0 0 0 0 0 0 -2474.52 2413.94 0 0 0 0 0 0 0 
0 0 1787.7 0 0 0 0 0 0.04 0 0 0 0 0 0 0 0 0 0 -1788 0 0 0 0 0 0 0 1026.57 0 -35.783 2179.71 0 0 0 0 649.51 0 806.833 0 0 0 0 
0 0 1702.25 0 1722.54 -767.769 0 0 0 0.01 0 0 0 0 0 0 -886.944 0 0 1424.83 0 0 0 0 0 0 0 0 0 -2092.12 0 0 0 0 0 0 0 0 0 0 0 0 
0 0 0 0 0 0 0 625.706 0 0 0.02 0 0 840.861 0 0 0 0 1322.14 0 0 0 0 0 0 0 0 0 0 0 0 0 0 1864.6 0 -968.429 0 0 0 0 0 0 
740.455 0 0 0 0 -1699.96 0 1719.64 0 0 0 0.04 425.504 0 0 0 2275.54 0 -2274.47 0 1804.33 1488.46 0 -155.568 728.553 0 0 426.725 0 0 -1508.45 0 0 0 0 0 0 0 0 0 0 0 
0 0 0 0 -78.5089 0 0 0 0 0 0 2298.12 0.03 0 0 0 0 0 0 0 2444.46 0 0 0 0 0 -124.134 0 0 2463.38 0 0 0 0 0 -1706.37 0 0 0 0 0 0 
0 0 2069.69 0 0 0 0 0 0 0 579.47 0 0 0.01 0 0 0 0 0 0 0 0 -746.712 0 663.701 0 0 0 0 785.47 0 0 0 0 0 0 0 0 0 0 0 0 
0 1390.19 1818.06 0 -248.497 0 0 0 0 0 0 0 0 0 0 0 0 0 0 0 0 683.081 0 0 0 0 0 0 0 0 0 0 0 0 0 0 0 0 0 0 0 0 
0 0 0 -1593.14 0 -1909.77 1386.68 0 0 0 0 0 0 0 0 0.03 0 2422.33 2188.41 0 1294.67 0 -2403.71 0 0 0 0 0 0 0 0 28.7637 0 0 2260.28 0 2045.88 0 0 0 0 0 
0 0 0 0 1053.42 0 0 0 0 2167.81 0 1038.32 0 0 0 0 0 0 0 0 0 0 0 0 0 0 0 0 0 0 0 -1358 0 0 0 0 0 0 0 0 0 0 
0 0 0 0 0 1126.67 0 0 0 0 0 0 0 0 0 1869.49 0 0.04 0 0 0 0 0 0 1396.3 0 0 0 0 0 0 0 0 0 0 0 -126.728 0 0 0 0 0 
0 0 0 0 2212.21 0 0 0 0 0 1938.92 1748.18 0 0 0 1920.45 0 0 0.01 0 0 0 0 0 0 0 0 0 0 0 0 0 -1645.33 0 0 0 -2002.85 0 0 0 0 0 
0 -184.408 0 2210.99 0 0 0 0 1442.84 -1075.24 0 0 0 0 0 0 0 0 0 0 0 0 0 0 0 611.057 0 0 0 0 0 0 0 0 0 0 0 0 0 0 0 0 
0 0 0 0 0 0 0 2296.44 0 0 0 575.655 333.338 0 0 456.175 0 0 0 0 0.01 0 0 -1977.22 0 0 0 0 0 -983.23 0 0 0 0 0 0 0 0 0 0 0 0 
986.282 0 2070.45 0 0 0 0 0 0 0 0 1725.9 0 0 -179.525 0 0 0 0 0 0 0.08 0 0 0 -1009.32 0 0 0 0 0 -941.878 0 0 0 0 0 0 0 1515.02 0 0 
1821.27 0 0 0 0 0 0 0 0 0 0 0 0 1085.62 0 -1979.51 0 0 0 0 0 0 0 -617.313 0 0 2336.27 0 0 0 0 0 0 0 0 0 0 0 0 0 0 0 
0 0 0 0 0 0 0 -798.288 0 0 0 -472.198 0 0 0 0 0 0 0 0 2099.29 0 2409.82 0.07 0 0 0 0 0 0 0 0 0 1511.35 0 0 0 0 0 0 0 0 
0 0 0 0 0 0 0 0 0 0 0 2358.55 0 -1370.05 0 0 0 1808.6 0 0 0 0 0 0 0 0 0 0 0 0 0 363.857 0 0 0 470.672 0 0 0 0 0 0 
-779.214 0 0 -1465.73 903.729 0 0 0 0 0 0 0 0 0 0 0 0 0 0 -1077.99 0 -200.735 0 0 0 0.02 0 1631.29 0 0 0 0 670.263 933.638 0 0 0 0 0 0 0 0 
1828.29 0 0 0 0 0 2147.05 0 0 0 0 0 1240.04 0 0 0 0 0 0 0 0 0 -2056.57 0 0 0 0.03 0 0 0 0 0 0 0 0 0 0 0 0 0 0 0 
0 0 0 0 0 0 -1790.29 0 2168.11 0 0 229.423 0 0 0 0 0 0 0 0 0 0 0 0 0 -724.738 0 0.02 0 0 0 0 0 0 0 0 0 0 0 0 0 0 
828.043 0 -920.972 0 0 0 2464.29 0 0 0 0 0 0 0 0 0 0 0 0 0 0 0 0 0 0 0 0 0 0.06 1647.62 0 0 2206.87 0 275.353 0 0 0 0 0 0 0 
0 0 0 0 0 0 0 0 -245.75 -1266.9 0 0 1067.61 459.075 0 0 0 0 0 0 2255.7 0 0 0 0 0 0 0 -235.221 0.09 0 0 0 -553.529 1360.44 0 0 0 -2219.38 0 0 0 
0 0 0 0 0 0 223.93 0 1984.69 0 0 -668.432 0 0 0 0 0 0 0 0 0 0 0 0 0 0 0 0 0 0 0.03 0 0 819.346 0 0 834.3 0 0 0 0 0 
0 0 0 0 0 0 0 0 0 0 0 0 0 0 0 164.876 2455.14 0 0 0 0 -1363.03 0 0 -1487.24 0 0 0 0 0 0 0.02 0 1866.28 0 0 -1573.92 0 0 0 0 0 
0 0 0 0 0 0 -1767.1 0 0 0 0 0 0 0 0 0 0 0 -1803.87 0 0 0 0 0 0 1780.37 0 0 -443.663 0 0 0 0.02 2446.13 0 0 0 0 0 0 0 0 
0 944.777 0 0 0 0 0 -1436.43 0 0 101.703 0 0 0 0 0 0 0 0 0 0 0 0 -1313.75 0 2240.44 0 0 0 2437.13 933.79 306.024 33.6467 0.06 0 0 0 0 0 0 0 1381.65 
0 1054.19 0 0 0 0 0 600.986 0 0 0 0 0 0 0 655.919 0 0 0 0 0 0 0 0 0 0 0 0 97.1252 -435.423 0 0 0 0 0.05 0 -1839.58 0 0 0 0 0 
0 0 0 69.3533 0 0 0 0 2497.71 0 -143.818 0 663.549 0 0 0 0 0 0 0 0 0 0 0 -1262.63 0 0 0 0 0 0 0 0 0 0 0.09 0 0 0 0 0 0 
0 0 0 0 0 0 0 0 0 0 0 0 0 0 0 -1784.19 0 -1746.96 2263.18 0 0 0 0 0 0 0 0 0 0 0 2367.24 -23.423 0 0 1596.96 0 0.08 0 0 0 0 0 
0 0 0 0 0 0 0 0 414.67 0 0 0 0 0 0 0 0 0 0 0 0 0 0 0 0 0 0 0 0 0 0 0 0 0 0 0 0 0.05 0 0 0 0 
0 0 0 0 0 0 0 0 0 0 0 0 0 0 0 0 0 0 0 0 0 0 0 0 0 0 0 0 0 2399.59 0 0 0 0 0 0 0 0 0 0 0 0 
0 0 0 0 0 0 0 0 0 0 0 0 0 0 0 0 0 0 0 0 0 1776.41 0 0 0 0 0 0 0 0 0 0 0 0 0 0 0 0 0 0.02 0 0 
0 154.5 0 0 0 0 0 0 0 0 0 0 0 0 0 0 0 0 0 0 0 0 0 0 0 0 0 0 0 0 0 0 0 0 0 0 0 0 0 0 0.06 0 
0 0 0 0 0 0 0 0 0 0 0 0 0 0 0 0 0 0 0 0 0 0 0 0 0 0 0 0 0 0 0 0 0 703.833 0 0 0 0 0 0 0 0.03 
