*Vertices 53
*Matrix 
0 0 -131.306 0 -1576.97 1469.08 962.63 0 0 0 1862.77 0 309.076 1425.6 0 0 0 872.143 -989.639 2342.52 0 1207.24 1548.89 0 0 -259.484 739.235 0 0 0 -625.858 0 0 0 0 0 0 0 0 0 -1683.17 0 0 0 112.384 1868.72 -2194.66 0 0 0 0 0 0 
0 0.08 0 0 345.851 0 2043.6 0 0 216.453 0 0 0 0 0 1437.8 0 0 0 0 0 1632.97 0 1336.79 0 0 0 0 0 225.455 0 1628.85 0 127.491 0 0 0 0 0 0 0 0 0 0 0 0 0 0 0 0 0 0 0 
-353.328 0 0.01 463.347 0 -2171.01 0 0 0 1442.23 0 1678.59 0 2269.74 0 0 2376.25 0 0 0 0 0 0 0 0 0 1150.78 0 0 0 0 0 0 1825.85 0 0 0 -650.883 0 0 1843.55 0 0 0 -1948.38 -487.304 0 0 0 0 0 0 -1570.71 
0 0 -734.199 0.01 1200.67 0 0 1973.25 0 0 0 2176.81 1749.4 -1577.88 1011.61 0 0 0 1452.76 0 0 0 0 0 1259.42 230.033 0 0 0 0 0 0 -1981.49 0 0 0 0 0 0 0 0 0 0 0 0 0 0 0 426.572 0 0 0 -1523.41 
2067.09 -815.836 0 -110.706 0 0 0 0 0 0 0 -429.167 0 0 1775.8 1660.89 -807.291 1602.6 0 0 1385.01 0 0 0 1500.21 0 0 0 0 0 0 -1142.84 0 0 -633.641 -1405.91 1935.56 0 0 63.2496 0 0 2107.53 0 0 0 0 -1742.07 0 0 0 2469.63 0 
1921.22 0 1492.28 0 0 0.09 -1072.04 0 0 0 2272.33 0 280.541 -111.469 -1885.05 0 -557.802 0 0 0 0 0 2272.03 0 0 0 0 162.13 0 0 781.198 0 0 0 0 0 0 0 0 0 0 0 0 0 0 1498.69 0 0 0 0 0 0 0 
-599.002 2485.81 0 0 0 1374.78 0.02 -2400.05 0 0 0 0 0 0 0 0 2086.32 1749.24 0 0 0 0 -1229.51 2280.57 0 0 0 651.189 0 -138.173 0 0 0 0 0 0 0 0 0 0 0 0 985.061 0 0 0 0 0 0 0 0 -775.399 2334.59 
0 0 0 1584.9 0 0 1365.17 0 0 0 -2014.45 0 0 0 0 0 0 -570.925 2443.69 0 1336.63 0 0 0 0 -488.983 0 0 2364.96 -1955.24 -1293.76 0 0 -1757.79 0 0 0 1468.02 0 0 0 0 0 -1364.1 0 0 0 0 0 0 0 0 0 
0 0 0 0 0 0 0 0 0.06 0 -871.838 1899.7 -590.457 2392.12 0 0 1072.34 0 0 0 0 0 0 0 815.531 0 0 0 0 -772.5 -697.882 0 0 0 0 0 0 0 0 0 -930.738 0 0 0 0 0 0 0 0 0 0 2061.6 0 
0 2221.37 -487.762 0 0 0 0 0 0 0.01 0 0 742.744 0 0 0 0 1641.21 248.344 0 0 0 0 0 510.651 0 0 0 0 0 1883.68 0 0 0 0 0 0 0 2282.1 0 0 156.178 0 0 0 633.793 0 0 0 0 0 0 0 
1062.58 0 0 0 0 1041.37 0 2119.74 -1918.32 0 0.04 1640.45 0 0 0 0 -465.026 2141.71 0 0 6.94296 0 0 0 0 0 1390.8 0 -1338.92 0 0 0 0 1002.61 0 0 0 0 0 2182.15 0 0 0 0 0 0 0 0 0 0 0 0 0 
0 0 1784.34 1622.14 -659.429 0 0 0 -1086.54 0 1341.82 0 920.82 189.596 37.4615 0 0 0 0 0 0 0 0 0 0 0 0 -304.804 0 1241.57 0 0 0 0 0 0 0 0 0 155.721 0 0 0 0 0 0 0 0 0 0 0 0 0 
1839.73 0 0 923.261 0 -1799.6 0 0 -875.958 2328.94 0 2108.29 0.08 0 0 1362.73 0 2137.59 0 788.064 0 0 0 -952.559 0 0 0 0 0 0 0 1071.89 2020.55 0 2442.78 0 0 0 0 0 0 0 0 0 0 0 0 0 0 0 1278.65 0 0 
-800.577 0 1802.35 256.89 0 1753.21 0 0 -1334.5 0 0 -2066.48 0 0.04 0 0 0 1284.14 2060.69 -1391.42 844.829 0 1297.88 0 0 0 1187.4 0 0 1135.36 0 0 0 0 0 0 0 0 0 0 0 0 0 0 0 0 0 -1822.34 0 0 0 0 942.64 
0 0 0 -2021.77 -663.244 -1225.85 0 0 0 0 0 2287.29 0 0 0.01 -1609.93 888.928 0 -731.3 1433.68 0 0 0 551.851 0 0 0 2188.41 0 0 0 0 0 0 0 0 0 0 0 0 0 0 0 0 617.924 0 0 0 0 0 0 0 0 
0 -1041.52 0 0 -1135.67 0 0 0 0 0 0 0 2451.02 0 898.236 0 0 0 -309.687 0 0 0 0 2497.71 -932.417 0 0 0 0 -1377.38 0 0 0 0 0 0 0 0 1070.67 0 696.509 2130.27 0 0 0 0 0 0 0 0 0 1207.54 0 
0 0 -1161.92 0 -2457.58 2441.71 105.365 0 2393.95 0 2385.56 0 0 0 921.278 0 0.03 1600.47 0 0 0 0 0 0 0 0 0 0 0 0 0 0 0 0 392.697 0 0 0 0 0 -727.638 0 730.537 0 0 0 0 0 0 0 0 0 0 
1898.94 0 0 0 2194.36 0 -2194.51 -1139.33 0 -447.935 -1394.47 0 -1935.87 1502.35 0 0 -1375.39 0.05 0 0 0 0 0 0 0 0 206.534 0 0 -2245.48 1314.36 1784.19 0 0 0 1807.69 0 0 0 0 0 0 0 598.849 0 0 0 0 0 0 0 -245.293 0 
1634.04 0 0 1840.95 0 0 0 942.946 0 -0.839259 0 0 0 -136.189 1556.22 1116.14 0 0 0.07 0 0 0 0 0 518.281 0 0 0 0 0 0 0 0 0 -397.275 0 0 0 0 0 0 0 0 0 0 1170.46 0 0 0 0 0 0 0 
1500.98 0 0 0 0 0 0 0 0 0 0 0 2314.29 1394.62 -2093.19 0 0 0 0 0.08 0 0 0 0 0 0 0 0 -397.427 1787.55 0 0 0 -1486.79 0 0 0 0 0 0 0 45.2437 0 0 0 0 0 0 0 0 0 0 0 
0 0 0 0 1616.64 0 0 -1103.02 0 0 243.919 0 0 -1945.33 0 0 0 0 0 0 0.06 755.867 0 1470.15 0 0 0 0 -1422.24 2213.74 0 0 0 0 0 0 0 0 0 0 0 0 0 0 0 0 0 0 0 0 0 0 0 
608.463 1542.94 0 0 0 0 0 0 0 0 0 0 0 0 0 0 0 0 0 0 1313.75 0.09 0 0 0 -887.097 0 0 0 -31.5104 0 0 0 0 0 0 0 0 0 0 0 0 0 -1223.26 0 0 0 0 0 0 0 -890.149 0 
1678.29 0 0 0 0 -1328.7 1696.75 0 0 0 0 0 0 2278.28 0 0 0 0 0 0 0 0 0.06 0 0 -2299.49 -705.206 0 0 620.212 491.424 0 0 0 0 -1013.75 0 0 1488.77 0 0 0 0 0 0 0 0 0 0 0 -1231.35 0 0 
0 1370.36 0 0 0 0 2365.26 0 0 0 0 0 -1608.1 0 -1185.72 311.365 0 0 0 0 1158.1 0 0 0.02 -1586.28 0 0 0 -1796.09 0 896.863 1629.46 0 338.069 535.676 0 0 0 0 0 0 0 0 0 1616.18 0 711.31 0 0 0 0 0 0 
0 0 0 -1251.34 878.399 0 0 0 1375.09 -1372.04 0 0 0 0 0 1169.24 0 0 1150.47 0 0 0 0 600.07 0.02 461.211 0 0 0 2483.21 -1472.75 0 0 0 0 0 0 0 0 -1551.33 0 0 0 0 0 0 0 -252.312 0 0 0 0 648.595 
-1705.45 0 0 2316.74 0 0 0 -2198.17 0 0 0 0 0 0 0 0 0 0 0 0 0 605.258 1016.04 0 362.941 0.04 0 730.689 0 -1446.65 0 0 0 0 0 0 0 0 0 0 0 0 0 0 0 0 0 0 0 0 0 0 0 
73.0155 0 770.363 0 0 0 0 0 0 0 -119.251 0 0 2081.74 0 0 0 960.189 0 0 0 0 1905.19 0 0 0 0.06 0 0 0 0 1256.22 0 0 0 0 0 0 0 0 0 0 0 0 0 0 0 0 0 1731.85 1886.43 388.73 0 
0 0 0 0 0 2092.88 2355.49 0 0 0 0 1394.31 0 0 2479.71 0 0 0 0 0 0 0 0 0 0 569.704 0 0.07 0 0 0 -1814.71 0 0 0 0 0 0 0 0 0 976.363 0 0 229.881 0 0 0 0 2200.61 0 0 0 
0 0 0 0 0 0 0 1544.47 0 0 537.812 0 0 0 0 0 0 0 0 1479 -603.885 0 0 384.915 0 0 0 0 0.09 405.057 0 0 0 0 0 -370.876 725.196 0 0 0 0 0 0 0 0 0 0 1919.54 0 0 0 0 2072.13 
0 -2103.11 0 0 0 0 564.058 1045.64 1226.16 0 0 109.027 0 1066.85 0 702.765 0 -1925.34 0 1209.52 -1424.83 266.045 1525.7 0 1278.95 -697.424 0 0 2444.46 0.03 0 0 0 0 0 0 0 0 1417.36 0 0 0 0 1282.46 0 0 -1309.78 0 0 0 0 0 0 
1653.26 0 0 0 0 -105.06 0 1412.63 2459.56 469.604 0 0 0 0 0 0 0 1791.67 0 0 0 0 868.175 -1808.15 348.445 0 0 0 0 0 0.01 0 0 0 0 0 -1199.15 0 0 0 0 0 -473.876 996.963 0 0 0 0 0 1185.72 0 0 0 
0 503.021 0 0 -565.432 0 0 0 0 0 0 0 1634.34 0 0 0 0 2145.83 0 0 0 0 0 520.569 0 0 -771.737 1668.22 0 0 0 0.07 0 0 0 2067.09 0 0 0 2076.25 0 0 0 0 0 0 -2077.93 0 0 0 0 0 0 
0 0 0 -46.617 0 0 0 0 0 0 0 0 -411.771 0 0 0 0 0 0 0 0 0 0 0 0 0 0 0 0 0 0 0 0.06 0 0 0 0 947.829 0 0 0 0 0 0 0 0 0 0 0 0 0 0 0 
0 824.076 650.426 0 0 0 0 421.842 0 0 929.67 0 0 0 0 0 0 0 0 1559.88 0 0 0 -307.092 0 0 0 0 0 0 0 0 0 0.05 0 0 0 0 0 0 0 0 0 0 1659.06 0 0 0 0 0 0 0 0 
0 0 0 0 1204.79 0 0 0 0 0 0 0 2334.89 0 0 0 1725.75 0 -1955.24 0 0 0 0 831.095 0 0 0 0 0 0 0 0 0 0 0.02 0 0 0 2055.65 0 0 0 0 0 0 0 -383.847 2258.29 0 0 0 0 0 
0 0 0 0 -304.346 0 0 0 0 0 0 0 0 0 0 0 0 1356.93 0 0 0 0 2171.47 0 0 0 0 0 1201.28 0 0 -237.968 0 0 0 0.04 0 0 0 -1381.8 0 0 0 0 0 0 0 0 0 0 2206.11 0 0 
0 0 0 0 555.361 0 0 0 0 0 0 0 0 0 0 0 0 0 0 0 0 0 0 0 0 0 0 0 545.442 0 2144.76 0 0 0 0 0 0.01 0 270.47 0 0 0 0 0 0 0 0 0 0 0 0 0 0 
0 0 2349.09 0 0 0 0 525.452 0 0 0 0 0 0 0 0 0 0 0 0 0 0 0 0 0 0 0 0 0 0 0 0 -926.618 0 0 0 0 0.03 0 1498.23 0 0 0 0 0 0 0 0 0 0 0 0 0 
0 0 0 0 0 0 0 0 0 -309.839 0 0 0 0 0 2240.9 0 0 0 0 0 0 1081.8 0 0 0 0 0 0 400.021 0 0 0 0 -2377.16 0 2115.16 0 0.04 0 0 0 0 0 1443.3 0 0 0 0 0 0 0 0 
0 0 0 0 -631.657 0 0 0 0 0 970.26 1166.04 0 0 0 0 0 0 0 0 0 0 0 0 954.085 0 0 0 0 0 0 -277.032 0 0 0 2290.34 0 -1851.79 0 0.05 0 1032.82 0 302.667 0 0 0 0 2094.1 2481.99 0 0 0 
1032.36 0 1090.2 0 0 0 0 0 -2469.33 0 0 0 0 0 0 589.541 1346.25 0 0 0 0 0 0 0 0 0 0 0 0 0 0 0 0 0 0 0 0 0 0 0 0.05 0 0 0 0 0 0 0 0 -1298.94 0 2198.48 0 
0 0 0 0 0 0 0 0 0 -1976.76 0 0 0 0 0 2060.99 0 0 0 2364.35 0 0 0 0 0 0 0 914.258 0 0 0 0 0 0 0 0 0 0 0 1267.51 0 0 0 220.878 0 1691.72 0 0 0 2447.2 0 0 0 
0 0 0 0 1684.55 0 858.409 0 0 0 0 0 0 0 0 0 2187.64 0 0 0 0 0 0 0 0 0 0 0 0 0 2237.69 0 0 0 0 0 0 0 0 0 0 0 0 0 0 0 0 0 0 175.558 0 0 0 
0 0 0 0 0 0 0 1842.17 0 0 0 0 0 0 0 0 0 -1408.96 0 0 0 1743.14 0 0 0 0 0 0 0 628.91 -1892.38 0 0 0 0 0 0 0 0 2068.62 0 -1138.26 0 0.09 0 0 0 0 0 0 0 0 0 
1337.24 0 -412.839 0 0 0 0 0 0 0 0 0 0 0 -1107.75 0 0 0 0 0 0 0 0 1755.65 0 0 0 1443.3 0 0 0 0 0 -135.273 0 0 0 0 2446.29 0 0 0 0 0 0.04 0 0 0 894.116 0 493.408 0 0 
642.643 0 -2499.54 0 0 112.69 0 0 0 2046.95 0 0 0 0 0 0 0 0 563.295 0 0 0 0 0 0 0 0 0 0 0 0 0 0 0 0 0 0 0 0 0 0 2485.5 0 0 0 0.09 0 0 0 0 0 0 0 
-282.22 0 0 0 0 0 0 0 0 0 0 0 0 0 0 0 0 0 0 0 0 0 0 403.531 0 0 0 0 0 -156.331 0 1278.65 0 0 2209.62 0 0 0 0 0 0 0 0 0 0 0 0.03 0 0 0 0 0 -1935.41 
0 0 0 0 1139.48 0 0 0 0 0 0 0 0 198.904 0 0 0 0 0 0 0 0 0 0 497.528 0 0 0 -2074.88 0 0 0 0 0 2492.07 0 0 0 0 0 0 0 0 0 0 0 0 0.05 0 0 -2035.97 0 0 
0 0 0 1422.09 0 0 0 0 0 0 0 0 0 0 0 0 0 0 0 0 0 0 0 0 0 0 0 0 0 0 0 0 0 0 0 0 0 0 0 943.098 0 0 0 0 -1816.08 0 0 0 0.08 0 0 0 0 
0 0 0 0 0 0 0 0 0 0 0 0 0 0 0 0 0 0 0 0 0 0 0 0 0 0 1897.26 2414.24 0 0 1167.71 0 0 0 0 0 0 0 0 736.641 2441.71 -2456.51 -1882 0 0 0 0 0 0 0.01 0 0 0 
0 0 0 0 0 0 0 0 0 0 0 0 -1088.21 0 0 0 0 0 0 0 0 0 2132.71 0 0 0 -247.887 0 0 0 0 0 0 0 0 -1303.67 0 0 0 0 0 0 0 0 1711.25 0 0 2220.15 0 0 0.03 0 0 
0 0 0 0 1464.81 0 606.784 0 2124.01 0 0 0 0 0 0 389.645 0 1957.53 0 0 0 1416.59 0 0 0 0 963.698 0 0 0 0 0 0 0 0 0 0 0 0 0 -377.895 0 0 0 0 0 0 0 0 0 0 0.07 0 
0 0 767.159 728.095 0 0 524.384 0 0 0 0 0 0 -1850.87 0 0 0 0 0 0 0 0 0 0 -1954.18 0 0 0 1524.02 0 0 0 0 0 0 0 0 0 0 0 0 0 0 0 0 0 2195.73 0 0 0 0 0 0.09 
