*Vertices 84
*Matrix 
0.07 -817.209 0 0 0 0 0 1158.71 0 0 0 0 -413.602 2037.19 0 0 -160.756 0 0 -2076.86 0 0 0 0 0 1697.06 0 0 0 0 -1156.88 0 0 0 2355.65 0 0 0 0 0 0 0 -118.336 -1230.28 0 0 0 -1941.51 0 0 -2062.82 0 0 563.906 1742.99 0 0 565.432 0 384.915 0 0 0 -366.909 0 0 164.418 0 41.7341 1945.17 0 0 0 0 0 982.162 0 0 0 0 0 0 0 0 
2010.03 0.04 0 1232.87 0 -2003.46 0 0 0 2410.12 0 0 0 -79.2718 0 0 0 0 1752.6 -2387.69 0 0 -1524.63 1979.81 0 0 0 -2071.83 0 2430.72 0 0 0 0 0 0 0 0 0 0 0 0 0 0 1701.03 0 0 0 0 0 0 0 0 0 82.3237 0 0 0 0 0 0 0 0 0 0 0 0 -1445.74 0 0 0 -246.818 0 0 500.732 0 0 0 0 0 2020.1 0 0 0 
0 0 0.05 0 577.029 0 0 0 0 0 0 0 0 0 0 0 0 0 0 0 1180.99 0 -2411.95 964.003 0 0 567.721 0 0 1120.41 0 0 0 2331.39 1602.91 0 0 0 0 -179.83 0 0 0 0 0 556.581 0 0 0 0 0 0 0 -1411.4 -181.814 0 2025.13 0 0 0 191.122 0 0 0 0 0 0 0 0 0 0 0 0 0 1850.11 0 0 -1608.71 0 2166.13 1091.72 0 0 0 
0 1626.87 0 0 424.131 0 0 0 0 0 0 1102.4 -902.051 0 0 0 31.0526 974.38 1850.11 -1939.99 -2079.76 0 0 0 0 0 311.365 0 0 2362.21 -539.796 0 0 0 0 552.004 0 0 0 0 -1339.08 0 0 2205.95 0 0 0 0 0 0 0 0 0 0 0 0 -443.052 0 0 0 0 -95.4466 0 0 -563.906 0 0 0 0 0 0 0 0 0 0 0 0 0 0 0 0 1981.64 0 0 
0 0 166.707 2073.66 0.03 0 -93.7681 0 0 0 0 0 2362.97 0 -92.2422 -1988.97 0 0 608.615 0 0 -1385.46 0 0 1483.12 652.257 0 0 0 0 0 0 0 0 0 -475.249 0 -1536.53 0 0 0 0 0 0 0 0 0 0 1248.13 0 1230.28 0 0 0 0 0 2177.57 0 0 0 0 2092.58 0 0 0 0 0 0 0 -1049.15 0 0 0 0 0 0 0 0 0 0 0 0 0 0 
0 1917.71 0 0 0 0.09 0 0 251.396 963.546 0 0 0 0 2351.68 0 0 0 0 0 0 0 0 0 0 0 0 0 0 0 0 0 0 -1603.06 0 0 0 0 0 0 -2216.94 0 -1460.39 0 -2329.55 0 0 0 0 0 0 0 -89.9533 0 0 0 0 0 -168.233 0 1982.41 0 0 0 -298.242 2075.64 0 0 0 0 -22.0496 0 0 0 0 0 0 0 0 0 0 0 0 -1195.03 
0 0 0 0 -1503.88 0 0.09 1750.01 0 0 0 1242.18 -1746.19 0 0 0 0 0 -545.595 0 0 0 0 0 2169.18 -1935.56 -2086.17 0 0 0 0 2088.92 624.18 0 0 0 0 0 -2198.02 0 0 298.547 0 0 0 0 0 0 0 0 0 0 2474.36 0 0 0 1009.63 0 0 -178.915 0 0 0 0 0 0 0 1082.11 0 0 0 0 0 0 0 0 0 611.515 0 0 0 0 -1273.31 0 
1213.19 0 0 0 0 0 -2437.44 0.01 -529.572 0 0 0 0 2007.58 -232.475 0 0 0 2003.16 0 0 0 0 0 0 -797.678 -1340.45 0 0 0 0 0 1803.72 0 0 0 223.319 0 0 675.451 0 0 107.196 0 0 0 0 0 0 2020.4 -413.297 0 0 0 2090.75 0 0 0 0 -2212.67 0 2471.92 0 0 0 0 0 0 0 0 0 -365.841 0 1080.89 0 0 0 0 0 -578.402 0 0 0 0 
0 0 0 0 0 647.984 0 -2371.97 0.02 0 0 0 0 0 0 0 0 -1964.25 0 0 208.823 0 1628.54 0 0 0 0 0 0 0 0 -1724.83 0 0 0 2249.9 0 0 703.375 -1402.1 -42.8022 0 13.9622 0 -394.986 0 0 0 896.71 0 1705.91 0 0 1866.74 1854.69 0 332.27 0 0 1951.43 0 219.199 0 0 0 -591.067 0 0 -951.338 0 0 0 0 0 0 0 1695.84 0 641.575 0 0 0 0 0 
0 1150.78 0 0 0 -252.617 0 0 0 0.07 2144.46 -1922.74 0 2179.1 -1742.68 0 0 0 0 0 2126.76 0 0 0 0 -290.613 -169.301 0 1682.26 0 0 0 2323.6 0 0 2281.18 0 0 0 0 -841.319 0 0 0 1088.82 530.03 0 -637.761 0 0 1037.1 0 0 0 0 368.74 0 0 0 0 0 0 0 0 0 0 0 0 0 0 0 0 0 0 0 0 0 0 0 0 0 0 0 0 
0 0 0 0 0 0 0 0 0 -1520.66 0.04 0 0 -1407.28 0 0 0 0 0 2464.45 -555.971 0 0 2496.8 -1844.77 0 281.915 0 0 1007.03 0 -1309.47 0 0 0 0 0 0 0 2250.21 626.621 0 -1210.44 0 0 0 0 0 0 0 0 0 0 0 0 0 0 0 0 0 0 0 2319.64 0 0 -442.137 0 0 0 0 0 0 0 0 0 0 0 0 0 0 0 0 0 0 
0 0 0 1884.29 0 0 1193.35 0 0 532.014 0 0.02 -525.605 0 0 -770.058 0 0 0 823.466 0 0 0 -1293.76 0 0 0 0 0 0 1217.15 0 0 0 0 0 0 0 0 0 0 0 -2016.28 0 0 0 0 0 0 0 0 2391.51 541.78 1681.65 0 0 0 0 0 0 0 0 0 0 0 0 0 0 0 0 0 0 0 0 0 0 0 0 0 0 237.51 0 0 0 
881.756 0 0 1748.18 2142.32 0 1166.65 0 0 0 0 2395.32 0 0 0 0 -624.485 0 457.244 0 0 0 0 0 0 0 0 0 499.207 0 0 0 0 0 0 0 0 0 0 0 0 0 0 2473.91 0 0 0 0 0 0 0 0 0 0 0 0 2483.98 0 0 0 0 0 0 2341.61 -402.31 0 0 2264.55 0 0 1494.42 0 0 0 0 6.02741 0 0 0 0 0 0 0 0 
1633.43 256.737 0 0 0 0 0 1466.8 0 -2044.05 203.024 0 0 0.01 1205.56 0 0 1222.95 0 -177.694 -514.008 0 0 0 0 1782.97 0 0 0 0 0 1361.96 0 0 0 94.9889 0 0 1159.78 2279.2 0 -252.464 0 0 0 0 0 2491.45 0 0 0 0 0 0 -290.765 929.975 0 0 -392.239 0 0 0 0 0 0 0 0 0 0 1515.32 -126.881 2464.14 0 0 -2494.2 0 0 0 0 0 0 0 0 0 
0 0 0 0 -900.677 1399.04 0 2159.26 0 548.494 0 0 0 324.488 0 0 0 0 0 0 0 0 0 -1090.35 0 0 0 0 0 0 0 0 0 -489.593 0 0 0 881.146 0 2465.97 0 -878.094 0 0 0 0 0 0 0 0 0 0 0 0 0 0 0 -1018.63 0 0 0 2354.73 0 0 0 0 0 0 0 0 0 0 0 0 0 -2213.43 -1468.02 0 0 0 1367.76 -1261.1 2351.53 0 
0 0 0 0 247.124 0 0 0 0 0 0 -2216.94 0 0 0 0.01 0 0 2055.19 0 0 0 0 205.008 0 0 0 0 0 0 0 0 0 1318.78 2230.37 0 320.978 1983.02 0 0 0 344.02 852.458 0 0 0 0 0 0 0 0 0 0 0 2243.64 0 0 0 -118.488 0 0 -57.2985 0 0 0 0 0 0 0 0 0 0 0 0 0 0 0 0 0 2028.18 0 0 0 0 
-1430.17 0 0 600.986 0 0 0 0 0 0 0 0 1337.24 0 0 0 0.04 1994.92 0 0 0 0 0 0 -1224.63 0 0 0 -217.063 0 1921.52 0 0 0 0 0 -1967.76 703.681 0 0 0 0 -800.882 0 0 0 317.621 541.627 0 0 0 -484.252 0 0 0 0 0 0 -948.439 2043.9 0 0 0 0 0 2150.11 0 0 0 -2150.87 0 0 0 0 0 0 0 0 0 0 0 0 0 0 
0 0 0 -702.002 0 0 0 0 2112.87 0 0 0 0 918.378 0 0 768.685 0.03 0 2153.31 0 0 783.639 0 0 0 543.764 0 0 0 1162.22 562.075 628.147 0 -1745.28 -2162.47 0 0 8.77407 0 2214.65 -742.134 0 0 0 0 -1879.25 0 0 997.726 0 1366.24 0 0 0 0 0 0 0 0 0 0 0 0 0 0 0 -2141.56 0 0 0 0 0 0 0 0 0 0 0 0 0 2403.71 97.8881 0 
0 -2081.74 0 1282.92 2041.61 0 -2446.44 24.0333 0 0 0 0 1813.64 0 0 2449.19 0 0 0.03 0 0 0 0 0 0 1708.81 0 2437.74 0 0 0 1841.56 0 0 0 320.368 0 0 0 0 -2049.39 1556.67 0 0 2453.92 0 0 0 0 0 0 0 0 0 0 0 298.395 1994.61 0 0 0 0 0 0 0 0 0 0 0 0 1228.29 0 0 0 176.321 0 0 0 0 0 0 0 1680.88 0 
-2034.14 349.055 0 2470.4 0 0 0 0 0 0 -1675.54 0.228889 0 1421.48 0 0 0 285.882 0 0.06 0 1673.25 0 0 0 1121.33 0 0 0 -523.316 0 0 0 -2379.3 0 2344.66 0 0 0 0 0 2227.47 312.586 0 0 0 0 0 0 0 0 0 0 0 -1711.25 -960.646 0 587.558 847.27 1695.38 2473.3 861.309 1038.62 0 0 0 0 0 0 0 0 0 0 0 0 0 656.682 0 0 -1945.02 0 0 0 0 
0 0 -2404.63 -1853.31 0 0 0 0 510.498 1343.65 2226.71 0 0 -117.725 0 0 0 0 0 0 0.04 2402.19 0 0 0 0 0 -2466.58 0 0 0 0 0 0 783.181 712.836 0 0 0 0 -1369.75 -1612.37 0 0 0 -798.746 1854.53 0 0 0 0 1912.67 1732.15 387.204 0 0 0 1977.83 1420.1 0 0 0 0 0 0 2069.69 0 0 0 0 0 0 0 0 0 0 0 0 2103.26 0 0 0 -1409.42 0 
0 0 0 0 1442.84 0 0 0 0 0 0 0 0 0 0 0 0 0 0 551.393 -595.035 0.09 1074.33 0 -1495.64 2123.1 0 384.152 0 2262.87 0 -512.024 0 0 0 -2364.04 0 0 0 0 0 0 0 0 0 -1861.4 -2441.71 0 0 0 0 0 0 2355.34 0 0 0 -945.387 0 0 2374.87 -821.329 0 0 0 0 1821.27 0 0 0 0 0 -628.605 0 0 0 0 0 0 1155.35 0 0 0 0 
0 2259.06 1971.42 0 0 0 0 0 2254.48 0 0 0 0 0 0 0 0 1384.7 0 0 0 1868.88 0.07 0 -2180.62 0 -91.174 727.18 -1457.18 0 0 0 845.439 0 146.87 0 0 -55.9252 0 0 -264.519 0 0 0 -42.9548 0 -864.818 1044.72 0 -924.94 0 0 0 0 0 1227.07 2002.09 -1845.84 0 -449.309 0 0 2058.55 0 0 0 0 0 0 0 0 0 0 0 0 0 -1646.7 0 0 0 -673.62 0 0 -1236.38 
0 108.264 1865.67 0 0 0 0 0 0 0 -1491.36 1588.56 0 0 -990.097 1444.82 0 0 0 0 0 0 0 0.01 -1283.23 -1268.88 -1038.77 -333.644 0 -1490.45 0 656.072 -684.606 1560.34 0 2132.86 0 0 -1199.61 37.3089 0 0 0 0 0 0 1484.65 0 916.547 0 0 -721.229 0 0 242.851 -46.3118 0 0 1114.61 0 0 0 0 1141.62 -811.106 0 0 0 0 0 0 0 0 0 0 0 0 0 0 0 0 -941.878 0 0 
0 0 0 0 795.846 0 -2297.66 0 0 0 -288.018 0 0 0 0 0 1583.22 0 0 0 0 2321.01 1284.3 1575.9 0.07 570.467 0 0 -414.365 0 0 0 0 702.002 0 2039.02 -1249.96 0 0 0 -1034.35 0 0 -681.555 0 -554.75 0 0 0 1000.32 0 0 0 0 0 825.602 1665.32 0 0 0 0 0 0 0 0 0 0 0 0 0 0 0 0 0 -2493.9 0 0 -1181.91 0 0 0 0 2239.07 0 
1041.06 0 0 0 2186.12 0 799.356 1707.59 0 -1816.84 0 0 0 2442.47 0 0 0 0 -1016.5 926.008 0 692.083 0 -1589.63 -866.497 0.01 0 -1203.73 0 0 1381.95 0 0 0 0 0 -1344.87 1967.91 -2493.74 0 -463.042 2034.59 0 1645.63 1738.11 0 0 0 -2217.86 0 0 30.137 0 0 -1033.74 0 0 0 1877.42 0 2055.19 0 0 0 0 0 0 0 0 0 0 0 0 0 0 -1236.53 0 0 0 0 0 0 0 0 
0 0 1429.11 1886.12 0 0 -574.435 1804.64 0 1142.84 298.547 0 0 0 0 0 0 -520.875 0 0 0 0 -2052.29 1621.37 0 0 0.06 0 1319.54 0 0 617.466 -424.131 1259.88 0 1428.5 0 0 0 710.852 0 1621.98 0 0 0 0 2124.01 0 0 0 0 1820.2 851.543 0 410.398 0 0 0 0 -395.749 0 0 0 0 0 0 0 0 -286.187 -1585.51 0 0 0 0 0 0 0 0 0 -545.289 0 0 -491.119 1956.77 
0 -1105.61 0 0 0 0 0 0 0 0 0 0 0 0 0 0 0 0 358.974 0 1517 -3.73852 -423.826 -1379.82 0 808.664 0 0.01 -2422.64 0 1562.47 -1138.72 0 0 2158.19 1559.42 0 0 -1304.44 0 -420.774 2446.13 0 0 1314.51 0 0 0 0 0 -741.066 0 1423.15 1812.88 1510.9 0 41.1237 1195.03 0 0 0 0 0 -2465.36 0 0 0 0 0 0 0 0 2399.14 0 0 0 0 0 0 0 0 0 193.869 0 
0 0 0 0 0 0 0 0 0 787.759 0 0 1237.14 0 0 0 1147.57 0 0 0 0 0 1221.88 0 -685.827 0 -1483.43 -53.3311 0.09 0 0 0 1221.43 1903.67 0 19.1504 -93.7681 0 0 1822.64 0 -499.054 0 1219.29 0 0 0 -716.803 0 0 1933.42 1856.97 -2152.24 -552.766 1467.56 0 0 0 0 0 0 0 0 0 0 0 0 0 0 0 0 0 0 0 0 0 0 0 0 0 0 0 0 0 
0 629.215 2223.04 2040.09 0 0 0 0 0 0 2275.99 0 0 0 0 0 0 0 0 -954.085 0 -120.319 0 752.663 0 0 0 0 0 0.03 -1316.03 0 0 0 1282.62 0 0 0 0 2234.49 0 0 -1008.87 0 0 2291.25 0 0 0 794.778 114.216 0 0 179.525 914.411 0 0 0 0 -1742.68 118.641 -385.525 0 0 1993.24 1033.89 0 906.781 -874.279 0 0 0 0 506.378 0 0 0 0 0 0 -1763.59 0 0 0 
571.993 0 0 1939.07 0 0 0 0 0 0 0 -2105.09 0 0 0 0 -1024.12 896.252 0 0 0 0 0 0 0 768.38 0 2363.58 0 339.137 0.02 0 781.045 0 0 0 0 0 -2010.18 0 1471.37 0 1178.85 283.135 0 0 0 0 0 253.533 0 0 2000.72 0 -2200.46 0 0 0 0 0 565.279 0 0 1017.26 0 0 0 0 -637.303 0 0 0 2241.51 0 0 0 0 0 -1199 0 0 0 0 0 
0 0 0 0 0 0 2435.61 0 1509.37 0 86.7489 0 0 940.352 0 0 0 2339.93 -1511.35 0 0 -972.701 0 861.309 0 0 -136.799 -1216.85 0 0 0 0.06 0 0 473.571 0 740.913 0 0 0 -632.115 0 0 0 0 -2452.85 0 0 0 1138.42 -2262.72 0 1300.78 0 0 0 0 0 0 -64.0126 0 0 0 0 0 0 0 0 0 0 0 0 0 1770.76 1160.24 0 0 0 1370.51 0 0 0 0 0 
0 0 0 0 0 0 -543.916 626.926 0 -2020.71 0 0 0 0 0 0 0 -2114.09 0 0 0 0 1235.31 967.208 0 0 2272.79 0 -763.649 0 -1258.66 0 0.09 0 0 0 2227.77 870.006 1877.57 0 -2388.15 0 231.864 0 0 283.288 329.981 0 349.971 0 0 0 0 0 2454.99 0 1085.92 0 0 0 0 0 0 0 0 1939.83 248.344 0 0 -822.245 0 -790.658 2244.1 1245.54 0 692.541 0 0 0 0 0 0 0 0 
0 0 1326.11 0 0 -338.832 0 0 0 0 0 0 0 0 -216.605 2474.67 0 0 0 65.0807 0 0 0 1065.48 649.358 0 -656.377 0 -1069.6 0 0 0 0 0.09 0 -1738.72 0 0 0 0 0 0 0 0 -373.47 721.992 0 0 0 2382.2 0 0 0 0 0 1066.39 0 0 0 -340.51 0 0 0 0 0 2197.87 0 0 0 -428.556 0 0 0 0 0 0 0 0 707.953 0 541.322 0 0 0 
-2312.31 0 2419.74 0 0 0 0 0 0 0 0 0 0 0 0 1051.59 0 1505.25 0 0 -399.869 0 -130.085 0 0 0 0 480.438 0 2006.52 0 1848.12 0 0 0.01 0 0 0 0 -323.42 0 -1680.27 0 0 0 -1842.78 0 0 1961.5 -254.143 0 0 2463.84 1300.47 0 0 0 0 0 0 0 0 0 0 0 0 0 0 0 0 0 0 0 0 0 0 0 0 0 0 0 0 0 0 
0 0 0 -1247.37 1057.54 0 0 0 -1170.16 1096.91 0 0 0 2214.5 0 0 0 1859.11 1526.92 696.356 -400.479 -1825.39 0 -154.347 622.654 0 -706.122 -2229.61 729.469 0 0 0 0 1059.07 0 0.08 -924.329 0 0 -899.762 1017.11 294.427 0 0 -655.309 0 0 -304.346 0 0 0 0 0 0 537.355 1844.46 0 0 0 0 0 0 0 0 0 2437.59 0 0 0 0 0 0 -2069.84 1800.06 0 0 0 0 0 0 0 2199.55 0 0 
0 0 0 0 0 0 0 1901.68 0 0 0 0 0 0 0 1767.4 552.461 0 0 0 0 0 0 0 279.778 -2173.76 0 0 2222.89 0 0 100.482 53.1785 0 0 1930.22 0.06 0 0 -2212.06 0 -1036.03 0 0 0 0 0 0 0 0 0 0 0 -58.3666 0 0 0 0 0 0 0 0 0 -1518.37 0 0 0 0 0 0 0 0 2111.19 0 0 -1929.61 0 0 0 0 0 0 0 0 
0 0 0 0 -983.078 0 0 0 0 0 0 0 0 0 1756.87 240.41 2000.41 0 0 0 0 0 801.798 0 0 -710.547 0 0 0 0 0 0 -2257.84 0 0 0 0 0.08 2149.19 0 0 0 0 0 0 0 0 0 0 -603.885 0 2253.11 -2256.61 0 2356.72 -753.273 0 0 0 0 1035.11 0 0 0 0 -456.481 0 0 0 0 -2302.24 0 0 0 -1222.5 0 0 0 0 0 0 0 2032.15 0 
0 0 0 0 0 0 611.82 0 174.184 0 0 0 0 -2283.01 0 0 0 364.772 0 0 0 0 0 1096.76 0 987.808 0 -917.615 0 0 1346.25 0 2111.35 0 0 0 0 928.602 0.09 0 0 0 0 0 0 0 -1699.35 0 0 -2264.24 0 2184.44 0 0 0 0 307.092 2285.76 0 0 0 -123.524 0 0 0 0 0 1540.5 0 0 0 0 0 0 0 0 0 0 0 0 0 0 0 0 
0 0 1421.93 0 0 0 0 -2456.97 1638.31 0 419.706 0 0 1660.13 1209.98 0 0 0 0 0 0 0 0 -1811.35 0 0 1480.53 0 1959.21 35.9355 0 0 0 0 8.77407 -1111.41 1680.73 0 0 0.09 0 0 0 -2473.14 703.375 0 0 0 2134.54 0 0 785.165 0 0 -1299.71 0 0 0 0 0 0 0 0 0 1370.97 0 0 0 0 0 0 0 0 -1297.11 0 0 0 0 0 0 0 0 0 0 
0 0 0 -1329 0 -1178.4 0 0 1131.09 1113.54 2348.78 0 0 0 0 0 0 -782.876 -1446.96 0 1470.31 0 1393.7 0 1898.79 74.6941 0 1903.21 0 0 2178.18 2381.89 2305.14 0 0 -216.91 0 0 0 0 0.04 0 0 642.643 -1262.93 0 0 -1929.3 344.478 0 0 2339.78 0 0 0 0 0 0 0 -1741.31 0 49.3637 0 0 0 0 0 -321.589 0 0 1578.95 0 0 0 0 0 0 0 0 0 -493.866 0 0 -1638 
0 0 0 0 0 0 -862.835 0 0 0 0 0 0 -164.571 -913.343 -946.455 0 115.589 -353.175 1415.52 1965.93 0 0 0 0 -921.125 1399.96 -1695.99 1513.34 0 0 0 0 0 -1668.98 2234.49 405.82 0 0 0 0 0 0 0 0 1327.17 0 1684.39 0 -1446.81 0 0 0 0 0 0 1270.87 0 0 0 -1795.33 0 0 0 0 0 0 0 0 0 1034.81 0 0 0 0 0 0 0 0 0 0 0 0 0 
-883.892 0 0 0 0 -541.017 0 -382.778 305.414 0 -362.636 1817.61 0 0 0 529.267 652.104 0 0 912.122 0 0 0 0 0 0 0 0 0 -228.66 2380.83 0 183.34 0 0 0 0 0 0 0 0 0 0.02 0 -670.263 0 0 0 2302.7 -1323.36 -1451.54 0 0 0 0 0 0 0 0 1040.45 0 1269.49 0 0 1955.85 0 0 0 0 0 0 -1658.3 0 0 0 0 0 0 0 0 0 1747.11 -2052.29 0 
1435.21 0 0 -524.232 0 0 0 0 0 0 0 0 335.627 0 0 0 0 0 0 0 0 0 0 0 2454.22 -223.624 0 0 1954.94 0 -2046.04 0 0 0 0 0 0 0 0 -2030.63 -1793.34 0 0 0.02 0 0 0 -361.11 0 0 0 1587.65 0 1581.09 1168.17 0 0 0 0 0 0 0 -1051.59 0 2052.9 -1179.46 0 0 0 0 0 0 0 -983.688 0 0 0 0 0 0 0 0 1384.24 0 
0 116.504 0 0 0 1557.74 0 0 -40.5133 -1963.48 0 0 0 0 0 0 0 0 -737.251 0 0 0 417.112 0 0 -1868.42 0 2496.34 0 0 0 0 0 779.061 0 234.764 0 0 0 917.005 -461.364 0 1066.85 0 0 -2188.25 2461.55 -7.70592 -1882.15 0 0 0 0 0 0 0 0 -1049.46 0 0 962.477 0 0 0 0 0 0 0 0 -897.778 0 0 0 0 0 0 0 0 0 0 0 0 0 0 
0 0 1680.27 0 0 0 0 0 0 2444.91 0 0 0 0 0 0 0 0 0 0 1018.33 2058.24 0 0 142.293 0 0 0 0 1664.4 0 -1373.56 -1121.02 -1121.17 1337.55 0 0 0 0 0 0 -571.535 0 0 2063.89 0.07 0 0 0 0 0 0 -945.235 0 0 0 725.044 0 1990.95 1009.02 -639.592 0 0 0 0 0 0 2163.23 0 1478.09 0 0 0 0 0 0 0 0 1118.88 0 -1714 0 0 0 
0 0 0 0 0 0 0 0 0 0 0 0 0 0 0 0 2099.9 734.046 0 0 1508.91 526.673 165.029 -2173.91 0 0 2416.53 0 0 0 0 0 1613.9 0 0 0 0 0 -1192.43 0 0 0 0 0 119.709 0 0.07 0 0 -28.3059 0 0 0 0 0 0 0 0 0 0 -1433.53 0 0 0 0 0 0 804.239 0 0 0 0 0 0 0 0 0 0 1395.99 0 0 0 0 -2092.73 
-5.56963 0 0 0 0 0 0 0 0 764.107 0 0 0 2259.67 0 0 2433.47 0 0 0 0 0 1720.71 0 0 0 0 0 -794.32 0 0 0 0 0 0 -258.263 0 0 0 0 -1786.94 -334.712 0 422.147 1509.22 0 0 0.08 -874.126 0 0 0 0 0 1809.37 -2107.68 716.651 -862.987 -2365.72 0 0 0 0 -2183.98 0 0 -126.118 0 0 0 622.654 0 0 0 0 0 0 0 0 0 0 0 0 0 
0 0 0 0 428.709 0 0 0 -1400.11 0 0 0 0 0 0 0 0 0 0 0 0 0 0 2398.98 0 1500.21 0 0 0 0 0 0 2020.25 0 -1791.51 0 0 0 0 2315.97 260.094 0 602.206 0 -1656.01 0 0 394.528 0.04 0 0 0 -48.7533 1593.6 0 0 -107.349 1876.51 0 0 0 0 -580.691 0 0 0 0 0 0 0 0 0 0 0 0 -265.587 0 0 0 0 0 0 0 0 
0 0 0 0 0 0 0 -503.937 0 0 0 0 0 0 0 0 0 819.956 0 0 0 0 1192.13 0 685.827 0 0 0 0 -694.372 -1798.68 1251.49 0 5.87481 2099.44 0 0 -1999.65 -1267.97 0 0 -1150.47 1242.48 0 0 0 2242.88 0 0 0 0 0 -815.378 0 1992.32 0 0 0 0 0 0 0 0 0 0 0 0 0 0 0 0 0 1133.38 0 0 -1154.29 0 0 0 0 0 0 0 550.478 
1670.2 0 0 0 534.913 0 0 -1831.8 -747.017 2204.28 0 0 0 0 0 0 0 0 0 0 0 0 0 0 0 0 0 213.858 555.513 577.181 0 1739.02 0 0 0 0 0 0 0 0 0 0 879.162 0 0 0 0 0 0 0 0.04 0 0 -525.3 0 -914.106 0 0 1182.82 0 0 327.693 0 0 0 0 988.113 0 0 0 0 0 0 0 -1816.54 0 0 0 0 0 0 0 0 0 
0 0 0 0 0 0 0 0 0 0 0 -14.1148 0 0 0 0 1817.76 -1005.05 0 0 1764.05 0 0 114.063 0 -1219.29 46.9222 0 964.156 0 0 0 0 0 0 0 0 -786.843 364.162 2099.9 -2192.07 0 0 -1632.05 0 0 0 0 0 0 0 0.07 0 0 0 0 2158.04 -1445.89 -463.5 1809.82 0 0 0 0 0 0 0 0 387.814 0 0 0 0 0 0 0 0 0 0 0 -2306.05 0 0 0 
0 0 0 0 0 -898.999 -1123 0 0 0 0 -924.787 0 0 0 0 0 0 0 0 2316.13 0 0 0 0 0 -678.045 1196.55 2011.25 0 691.321 -886.181 0 0 2332.61 0 0 1859.72 0 0 0 0 0 0 0 2263.33 0 0 -1017.56 -1820.96 0 0 0.08 -1525.85 1382.72 0 0 0 0 2401.27 0 0 0 0 0 0 0 0 0 0 0 0 -1633.58 0 0 0 0 0 0 0 0 0 0 0 
1411.25 0 1661.81 0 0 0 0 0 238.426 0 0 1560.03 0 0 0 0 0 0 0 0 -1372.8 111.621 0 0 0 0 0 1956.77 1788 -382.778 0 0 0 0 1226.31 0 1530.88 0 0 0 0 0 0 -1171.99 0 0 0 0 -1152.15 0 173.269 0 857.646 0 800.729 0 -731.758 0 0 0 0 0 0 0 0 0 -1461.15 0 0 0 0 0 0 0 0 0 481.201 0 0 0 0 0 0 0 
1381.8 -879.62 450.987 0 0 0 0 347.987 1998.58 0 0 0 0 452.513 0 2320.86 0 0 0 -840.251 0 0 0 1089.59 0 1734.14 1901.68 1627.17 1566.74 -1565.22 510.804 0 479.98 0 0 807.901 0 -1070.67 0 1734.9 0 0 0 338.221 0 0 0 -386.593 0 2070.45 0 0 -988.571 1761.91 0.07 0 -2462 2160.18 -915.784 -2490.69 0 0 -1407.9 0 0 0 800.729 0 0 1818.98 0 0 -706.275 0 0 0 0 0 0 0 0 -1915.72 0 0 
0 0 0 0 0 0 0 0 0 -1112.02 0 0 0 -414.823 0 0 0 0 0 573.519 0 0 2288.66 1533.33 96.057 0 0 0 0 0 0 0 0 1490.6 0 -1564.76 0 -1406.06 0 0 0 0 0 0 0 0 0 -2357.17 0 0 1078.45 0 0 0 0 0.01 2194.05 1785.56 0 0 0 0 0 0 0 -301.294 0 2423.09 0 0 -1225.55 0 0 0 0 0 0 0 0 -1968.83 0 0 2368.01 0 
0 0 1110.49 1659.83 1669.9 0 1050.68 0 2494.81 0 0 0 1354.03 0 0 0 0 0 1132.16 0 0 0 2365.26 0 2257.07 0 0 -1603.21 0 0 0 0 -375.607 0 0 0 0 0 1860.18 0 0 -2160.02 0 0 0 -2294.92 0 174.642 1453.52 0 0 -898.389 0 -1695.07 -1351.13 2385.71 0.04 0 1093.55 0 0 1068.38 1054.34 0 648.9 0 0 0 0 138.63 0 0 0 0 0 0 0 0 1767.71 0 190.054 0 0 0 
-1229.97 0 0 0 0 0 0 0 0 0 0 0 0 0 1447.11 0 0 0 -1327.48 -1670.81 -1715.52 -826.365 1531.95 0 0 0 0 2118.67 0 0 0 0 0 0 0 0 0 0 -1038.62 0 0 0 0 0 -1681.8 0 0 2127.37 2040.85 0 0 929.518 0 0 2370.14 592.135 0 0.07 501.19 -2215.26 2471.47 0 -523.621 0 -1369.9 0 1871.47 0 0 0 0 0 -596.255 0 0 -1105.76 0 0 0 0 0 0 0 0 
0 0 0 0 0 783.792 0 0 0 0 0 0 0 -781.961 0 2356.41 1273.61 0 0 193.716 1809.52 0 0 -536.592 0 562.38 0 0 0 0 0 0 0 0 0 0 0 0 0 0 0 0 0 0 0 -2236.93 0 950.728 0 0 2116.84 693.457 0 0 2270.81 0 -24.6437 -1227.53 0 0 -913.953 0 -1895.89 0 0 0 0 0 0 0 88.4274 0 0 0 1991.26 0 0 0 0 0 0 0 0 358.516 
-1575.59 0 0 0 0 0 1813.18 1419.34 -1382.26 0 0 0 0 0 0 0 -2444.15 0 0 119.709 0 0 -319.605 0 0 0 -1320.92 0 0 1581.09 0 -752.663 0 -1293.76 0 0 0 0 0 0 517.365 0 2285.3 0 0 1151.23 0 0 0 0 0 207.602 -680.944 0 -1278.95 0 0 1575.44 0 0.04 0 2485.66 0 0 882.519 0 0 631.352 0 0 0 1265.07 0 0 0 0 0 0 -1079.21 2062.52 0 0 0 0 
0 0 -832.926 0 0 592.135 0 0 0 0 0 0 0 0 0 0 0 0 0 487.915 0 623.112 0 0 0 785.318 0 0 0 1011.76 68.7429 0 0 0 0 0 0 1519.75 0 0 0 1532.41 0 0 479.064 -1934.34 -145.344 0 0 0 0 0 0 0 0 0 0 1790.6 -2264.09 0 0.01 1094.62 0 0 0 -85.8333 0 0 0 0 1611 0 1992.32 0 0 0 0 1306.42 0 0 0 0 0 0 
0 0 0 1356.93 -1541.87 0 0 1039.69 2173.6 0 0 0 0 0 -1694.46 498.749 0 0 0 387.814 0 2215.26 0 0 0 0 0 0 0 -1635.26 0 0 0 0 0 0 0 0 2066.94 0 -1470.61 0 -310.907 0 0 0 0 0 0 0 1887.34 0 0 0 0 0 555.208 0 0 -405.972 782.266 0.09 0 990.249 0 0 0 0 0 0 0 0 0 0 0 0 0 -1525.09 0 0 0 0 0 0 
0 0 0 0 0 0 0 0 0 0 2416.99 0 0 0 0 0 0 0 0 1273.61 0 0 1396.6 0 0 0 0 0 0 0 0 0 0 0 0 0 0 0 0 0 0 0 0 1655.71 0 0 0 0 -2317.35 0 0 0 0 0 -455.26 0 -1212.88 2378.54 -2484.89 0 0 0 0.05 1612.98 0 0 0 0 0 0 1913.74 0 0 0 0 0 0 0 -161.977 0 0 -1977.07 0 1557.44 
2340.24 0 0 0 0 0 0 0 0 0 0 0 520.264 0 0 0 0 0 0 0 0 0 0 -2340.08 0 0 0 283.135 0 0 630.131 0 0 0 0 0 -66.7592 0 0 0 0 0 0 0 0 0 0 1891.77 0 0 0 0 0 0 0 0 0 0 0 0 0 934.706 449.156 0.02 0 0 0 0 0 -1316.95 0 0 0 0 0 0 0 0 0 0 -715.125 0 0 0 
0 0 0 30.9 0 710.547 0 0 0 0 0 0 880.84 0 0 0 0 0 0 0 0 0 0 -2091.51 0 0 0 0 0 2350.31 0 0 0 0 0 0 0 0 0 2485.96 0 0 1174.43 -448.851 0 0 0 0 0 0 0 0 0 0 0 0 149.464 -446.562 0 269.25 0 0 0 0 0.08 0 0 0 0 0 0 0 0 0 0 0 0 0 0 0 0 0 0 0 
0 0 0 0 0 -1509.22 0 0 1534.85 0 996.811 0 0 0 0 0 971.175 0 0 0 1132.92 0 0 0 0 0 0 0 0 -1343.5 0 0 2053.06 -114.978 0 -2137.59 0 1018.78 0 0 0 0 0 590.304 0 0 0 0 0 0 0 0 0 0 0 -1299.4 0 0 0 0 737.709 0 0 0 0 0.04 0 0 0 0 1237.45 0 0 0 0 0 0 0 0 0 0 0 0 0 
1746.5 0 0 0 0 0 0 0 0 0 0 0 0 0 0 0 0 0 0 0 0 -897.931 0 0 0 0 0 0 0 0 0 0 -67.5222 0 0 0 0 0 0 0 0 0 0 0 0 0 0 -792.795 0 0 1247.83 0 0 -2435.15 1107.14 0 0 1914.81 0 0 0 0 0 0 0 0 0.02 0 0 0 0 0 0 2117.76 0 0 0 0 0 1985.15 0 0 0 0 
0 2042.68 0 0 0 0 -2461.39 0 0 0 0 0 96.82 0 0 0 0 1648.84 0 0 0 0 0 0 0 0 0 0 0 1633.88 0 0 0 0 0 0 0 0 1811.2 0 824.381 0 0 0 0 389.34 1847.21 0 0 0 0 0 0 0 0 853.832 0 0 0 545.289 0 0 0 0 0 0 0 0.02 0 0 0 0 0 0 -524.689 0 0 0 0 0 0 0 0 870.006 
484.1 0 0 0 0 0 0 0 1730.17 0 0 0 0 0 0 0 0 0 0 0 0 0 0 0 0 0 1177.63 0 0 -528.047 -2470.09 0 0 0 0 0 0 0 0 0 0 0 0 0 0 0 0 0 0 0 0 2438.35 0 0 0 0 0 0 0 0 0 0 0 0 0 0 0 0 0.07 0 0 -321.436 2201.22 0 0 0 0 0 -1464.96 0 -979.873 0 0 0 
1217.61 0 0 0 636.082 0 0 0 0 0 0 0 0 -1092.18 0 0 -782.723 0 0 0 0 0 0 0 0 0 2023.45 0 0 0 0 0 1885.66 -291.223 0 0 0 0 0 0 0 0 0 0 -438.627 -2284.84 0 0 0 0 0 0 0 0 -1505.71 0 1738.11 0 0 0 0 0 0 346.767 0 0 0 0 0 0.02 0 0 0 0 0 0 0 0 0 0 0 0 0 983.993 
0 0 0 0 0 -1925.03 0 0 0 0 0 0 -1480.38 -1111.56 0 0 0 0 -249.87 0 0 0 0 0 0 0 0 0 0 0 0 0 0 0 0 0 0 1262.02 0 0 -695.441 839.793 0 0 0 0 0 -539.033 0 0 0 0 0 0 0 -63.2496 0 0 1750.62 0 2207.17 0 2228.54 0 0 352.26 0 0 0 0 0.09 -617.008 0 0 0 0 853.374 1426.05 0 0 0 0 0 0 
0 -2025.59 0 0 0 0 0 2078.84 0 0 0 0 0 2066.64 0 0 0 0 0 0 0 0 0 0 0 0 0 0 0 0 0 0 653.935 0 0 0 0 0 0 0 0 0 -530.03 0 0 0 0 0 0 0 0 0 0 0 0 0 0 0 0 584.658 0 0 0 0 0 0 0 0 45.3963 0 440.458 0.01 0 0 0 0 0 0 0 -1336.94 39.2926 0 0 0 
0 0 0 0 0 0 0 0 0 0 0 0 0 0 0 0 0 0 0 0 0 -2254.48 0 0 0 0 0 656.987 0 0 -2188.25 0 2264.7 0 0 2021.77 277.49 0 0 0 0 0 0 0 0 0 0 0 0 1853.62 0 0 -844.829 0 -1300.01 0 0 2256.46 0 0 663.854 0 0 0 0 0 0 0 -723.518 0 0 0 0 0 0 0 0 1795.18 0 0 -1353.42 0 0 0 
0 0 0 0 0 0 0 -1558.2 0 0 0 0 0 0 0 0 0 0 0 0 0 0 0 0 0 0 0 0 0 -1174.28 0 -167.47 1735.51 0 0 -886.792 0 0 0 1530.88 0 0 0 1808.76 0 0 0 0 0 0 0 0 0 0 0 0 0 0 0 0 0 0 0 0 0 0 -93.7681 0 0 0 0 0 0 0.03 0 0 0 0 0 0 0 0 0 0 
0 252.007 1513.79 0 0 0 0 0 0 0 0 0 0 98.1933 0 0 0 0 -400.937 0 0 0 0 0 2114.25 0 0 0 0 0 0 963.546 0 0 0 0 0 -436.949 0 0 0 0 0 0 0 0 0 0 0 0 -1107.29 0 0 0 0 0 0 0 2455.75 0 0 0 0 0 0 0 0 267.113 0 0 0 0 0 0 0.07 0 0 -1118.43 0 0 0 0 -172.658 0 
-1746.04 0 0 0 0 0 0 0 0 0 0 0 926.16 0 1169.09 0 0 0 0 0 0 0 0 0 0 1013.29 0 0 0 0 0 0 -757.241 0 0 0 859.02 0 0 0 0 0 0 0 0 0 0 0 408.261 172.658 0 0 0 0 0 0 0 1202.51 0 0 0 0 0 0 0 0 0 0 0 0 0 0 0 0 0 0.05 0 -741.218 0 0 0 0 0 0 
0 0 0 0 0 0 0 0 2207.33 0 0 0 0 0 935.163 0 0 0 0 -133.595 0 0 -397.275 0 0 0 0 0 0 0 0 0 0 0 0 0 0 0 0 0 0 0 0 0 0 0 0 0 0 0 0 0 0 486.999 0 0 0 0 0 0 0 0 0 0 0 0 0 0 0 0 1603.82 0 0 0 0 0 0.03 1227.68 -1119.5 0 0 0 0 0 
0 0 2066.33 0 0 0 -231.101 0 0 0 0 0 0 0 0 0 0 0 0 0 0 0 0 0 718.635 0 0 0 0 0 0 0 0 0 0 0 0 0 0 0 0 0 0 0 0 0 0 0 0 0 0 0 0 0 0 0 0 0 0 0 -416.349 -2025.74 0 0 0 0 0 0 0 0 1938.92 0 1226.62 0 1853.31 1650.06 -2057.33 0.05 0 0 0 0 0 0 
0 0 0 0 0 0 0 0 -1131.55 0 0 0 0 0 0 0 0 0 0 0 1096.76 0 0 0 0 0 0 0 0 0 35.02 1425.44 0 1963.79 0 0 0 0 0 0 0 0 0 0 0 -1860.03 65.2333 0 0 0 0 0 0 0 0 0 -694.678 0 0 -335.17 0 0 -1813.64 0 0 0 0 0 1105.76 0 0 0 0 0 0 0 1728.03 0 0.02 0 0 0 0 0 
0 0 2233.88 0 0 0 0 305.109 0 0 0 0 0 0 0 1209.07 0 0 0 -875.958 0 -1806.47 0 0 0 0 -2084.03 0 0 0 0 0 0 0 0 0 0 0 0 0 0 0 0 0 0 0 0 0 0 0 0 0 0 0 0 -843.303 0 0 0 2136.52 0 0 0 0 0 0 1155.81 0 0 0 0 2290.03 0 0 0 0 0 0 0 0.03 0 0 0 0 
0 158.315 -1497.16 0 0 0 0 0 0 0 0 2346.03 0 0 -2335.96 0 0 0 0 0 0 0 2469.33 0 0 0 0 0 0 2324.82 0 0 0 637.15 0 0 0 0 0 0 -1030.53 0 0 0 0 -313.196 0 0 0 0 0 1667 0 0 0 0 1633.88 0 0 0 0 0 0 1215.17 0 0 0 0 -613.498 0 0 2181.69 -1959.52 0 0 0 0 0 0 0 0.07 1523.87 -18.54 -890.454 
0 0 0 1797.92 0 0 0 0 0 0 0 0 0 0 1397.82 0 0 933.18 0 0 0 0 0 -2445.22 0 0 0 0 0 0 0 0 0 0 0 1784.04 0 0 0 0 0 0 -1306.57 0 0 0 0 0 0 0 0 0 0 0 1133.99 0 0 0 0 0 0 0 1934.03 0 0 0 0 0 0 0 0 0 0 0 0 0 0 0 0 0 520.112 0.07 0 0 
0 0 0 0 0 0 605.411 0 0 0 0 0 0 0 258.11 0 0 1733.38 -2381.59 0 1098.74 0 0 0 747.322 0 479.98 -2222.74 0 0 0 0 0 0 0 0 0 -895.184 0 0 0 0 1997.82 -710.852 0 0 0 0 0 0 0 0 0 0 0 -367.519 0 0 0 0 0 0 0 0 0 0 0 0 0 0 0 0 0 0 1851.79 0 0 0 0 0 2465.36 0 0.07 0 
0 0 0 0 0 -2186.12 0 0 0 0 0 0 0 0 0 0 0 0 0 0 0 0 684.454 0 0 0 1275.44 0 0 0 0 0 0 0 0 0 0 0 0 0 1195.33 0 0 0 0 0 -835.215 0 0 -1229.51 0 0 0 0 0 0 0 0 713.141 0 0 0 -2073.05 0 0 0 0 -2374.87 0 1567.66 0 0 0 0 0 0 0 0 0 0 2456.51 0 0 0.08 
