*Vertices 45
*Matrix 
0.08 0 0 0 0 0 -141.53 0 0 0 2129.81 0 0 -1405.15 0 0 0 0 0 -132.069 0 -844.371 0 0 -1145.13 0 1697.97 0 0 0 2438.05 741.523 0 0 0 0 0 -1997.97 0 1915.27 0 0 -864.055 0 0 
0 0.02 0 0 0 0 1834.54 0 1661.5 0 1633.88 0 -2120.5 0 0 0 0 0 0 -559.938 0 0 0 0 0 0 0 0 0 -1110.19 0 0 0 0 0 0 1190.91 0 838.572 1949.75 0 399.869 0 0 0 
0 0 0.06 0 0 -1809.21 0 0 1193.04 0 0 0 0 -547.731 0 2017.96 1861.55 0 0 0 1593.91 0 -524.995 2021.77 0 1501.28 0 0 0 0 0 -1795.48 0 0 704.443 0 0 0 0 0 1776.56 0 0 0 0 
0 0 0 0.06 0 -1558.81 0 2284.54 0 0 0 0 0 1811.81 0 0 -490.204 0 1685.61 0 0 -1785.41 0 -1570.86 0 0 1278.34 0 0 0 0 -2310.48 0 2162.01 991.318 0 1863.54 -1205.25 1225.85 0 0 0 0 0 922.346 
0 0 0 0 0.08 0 0 0 0 0 1307.64 418.18 0 1437.35 0 -1047.17 -1421.93 0 -2025.28 0 1493.8 0 0 -333.338 0 0 0 0 0 0 0 1961.35 0 0 0 0 0 0 0 1730.32 0 0 0 0 0 
0 0 638.523 1911.91 0 0.08 0 0 2172.38 1827.07 0 0 0 0 0 319.605 -526.368 258.873 0 -1140.55 -632.878 -11.5207 -64.7755 0 0 -191.275 0 1484.8 0 0 0 0 0 0 0 0 0 0 0 2443.39 0 2443.24 0 0 0 
-646.306 2486.27 0 0 0 0 0.01 -2055.19 -753.121 1230.28 962.02 0 0 792.489 0 -962.02 0 0 2275.54 0 0 0 0 -1921.22 420.469 0 -1213.34 0 0 0 0 0 0 0 0 0 1487.7 0 0 0 -840.556 1711.25 0 0 0 
0 0 0 919.141 0 0 648.137 0.03 -1626.71 0 0 546.358 0 0 0 0 0 0 0 0 0 0 1653.11 -685.98 0 0 0 0 0 0 0 -598.239 0 0 0 0 0 0 0 0 0 0 0 0 0 
0 2388.91 -961.104 0 0 877.941 2336.57 449.156 0.01 0 0 0 0 0 0 0 0 0 1201.13 1458.71 0 210.501 0 0 1745.58 1464.35 0 0 0 0 -1992.02 0 0 0 0 0 0 -733.284 0 0 0 0 0 0 0 
0 0 0 0 0 2176.05 -2440.49 0 0 0 1244.32 0 0 0 1897.56 0 0 2469.48 0 0 0 2149.19 1247.98 0 0 2250.21 0 0 0 0 0 0 0 0 0 0 -741.371 1940.6 0 0 0 0 0 0 0 
-682.623 537.965 0 0 2213.89 0 -1339.38 0 0 2143.85 0.06 0 0 0 -1422.54 -911.664 0 0 0 0 0 0 1291.92 2330.32 -769.448 0 0 0 754.646 0 0 0 0 0 2288.96 0 0 -1041.22 158.773 0 0 0 0 0 761.818 
0 0 0 0 550.325 0 0 1965.47 0 0 0 0.05 0 0 0 0 0 2353.66 795.389 0 0 0 0 0 0 -522.095 2240.9 1160.08 0 0 -970.26 430.082 0 -529.572 0 24.3385 0 0 0 0 0 0 0 0 0 
0 -2075.95 0 0 0 0 0 0 0 0 0 0 0.03 0 0 0 0 0 0 0 0 978.195 0 0 0 0 0 0 0 0 0 0 2061.14 0 0 0 0 436.949 0 0 0 0 0 0 0 
1389.58 0 2391.05 -747.78 908.002 0 -2381.44 0 0 0 0 0 0 0.04 0 0 -791.421 0 -930.891 0 2476.81 0 0 576.724 -213.401 0 2453.46 0 0 0 0 0 0 0 0 -667.058 0 0 0 2362.36 0 24.1859 0 0 0 
0 0 0 0 0 0 0 0 0 727.485 2233.73 0 0 0 0.06 1378.14 0 0 0 -1652.5 2256.92 2367.09 0 0 0 0 0 0 0 0 0 0 0 0 -250.633 0 0 2308.8 0 -1043.81 0 0 0 0 0 
0 0 334.101 0 1910.99 1587.65 -1847.51 0 0 0 1642.74 0 0 0 -1001.69 0.03 -2327.88 0 -767.006 0 0 1510.28 0 -955.306 0 433.287 0 -1222.04 0 804.392 0 1978.44 0 0 613.346 0 1042.74 839.03 0 25.2541 0 0 -901.135 755.715 0 
0 0 -1243.71 2393.19 1056.17 916.089 0 0 0 0 0 0 0 515.229 0 2239.52 0.07 0 1767.1 0 -2210.38 821.94 1162.53 1905.65 0 0 0 0 0 0 0 0 0 1147.11 0 0 0 0 0 0 331.202 0 0 0 0 
0 0 0 0 0 2233.27 0 0 0 1029.01 0 -1585.36 0 0 0 0 0 0.05 0 602.817 0 0 0 2329.86 -669.195 -101.856 0 -529.115 864.36 0 2060.99 0 0 1356.32 1715.37 0 0 0 0 0 0 0 0 0 0 
0 0 0 -941.42 -1855.6 0 199.362 0 1935.56 0 0 1684.7 0 1078.3 0 614.261 228.202 0 0.02 0 1845.84 629.215 31.8155 2496.49 -1673.1 0 1840.95 0 0 0 0 278.405 -1732.61 0 0 693.915 0 0 -596.255 0 0 0 0 0 0 
1493.65 697.882 0 0 0 -2173.3 0 0 -318.995 0 0 0 0 0 -210.959 0 0 1110.34 0 0.06 0 -1320.15 0 0 0 1549.81 0 1781.9 0 0 0 0 0 0 0 0 2254.02 0 0 309.687 1206.02 0 0 -1343.2 0 
0 0 -2366.33 0 889.386 -238.121 0 0 0 0 0 0 0 1432 -1443.14 0 -1632.51 0 1109.12 0 0.09 1911.91 0 0 -1272.7 0 0 0 -58.5192 2367.55 0 0 0 0 1794.41 0 962.325 0 0 0 0 0 0 0 0 
426.115 0 0 484.863 0 1369.29 0 0 2074.27 330.592 0 0 1475.49 0 -1849.35 1816.84 278.405 0 2269.43 -532.624 1675.85 0.03 0 1543.55 0 0 0 0 0 -2303.46 0 2120.66 0 -124.134 -1881.24 0 -2157.43 0 694.83 0 -456.023 0 0 0 0 
0 0 1691.41 0 0 -2318.87 0 1094.32 0 171.285 -2186.57 0 0 0 0 0 -326.624 0 2219.84 0 0 0 0.05 -687.811 0 0 0 0 0 0 0 0 0 0 0 666.295 0 0 0 2149.65 0 0 0 0 0 
0 0 2134.85 596.255 -266.198 0 -279.321 -771.126 0 0 1350.52 0 0 873.211 0 503.327 -250.633 1067.92 1799.91 0 0 643.406 -84.1548 0.09 0 0 0 0 0 0 0 0 0 -2202.14 1014.51 0 0 0 0 0 0 0 0 0 0 
2059.47 0 0 0 0 0 -1158.86 0 1804.79 0 -1250.57 0 0 762.734 0 0 0 1517.46 -1058.15 0 -1356.32 0 0 0 0.05 0 1866.28 0 0 0 483.795 0 0 0 655.766 0 0 -1192.13 0 -1966.54 0 0 0 0 0 
0 0 1717.35 0 0 -301.141 0 0 986.74 -1505.71 0 307.855 0 0 0 -147.176 0 730.537 0 1891 0 0 0 0 0 0.02 0 1382.56 0 1170.77 498.444 0 0 0 0 0 1916.79 2216.03 -1997.36 0 0 0 -1012.38 1788.77 0 
425.199 0 0 2257.53 0 0 962.477 0 0 0 0 2428.13 0 -125.202 0 0 0 0 77.8985 0 0 0 0 0 -184.561 0 0.08 275.811 -1613.13 0 2166.59 0 -1488.92 0 0 0 0 -800.577 0 0 0 0 0 0 0 
0 0 0 0 0 2394.71 0 0 0 0 0 46.7696 0 0 0 401.7 0 260.552 0 -1313.9 0 0 0 0 0 931.959 -1343.04 0.04 2093.34 0 1250.42 0 0 0 0 -1660.13 1450.32 1460.23 -872.753 0 0 0 0 251.549 0 
0 0 0 0 0 0 0 0 0 0 1411.1 0 0 0 0 0 0 1139.94 0 0 1440.86 0 0 0 0 0 987.503 -1818.67 0.01 0 0 -778.451 0 0 1440.09 0 -1614.2 0 0 0 2009.41 0 0 0 0 
0 474.639 0 0 0 0 0 0 0 0 0 0 0 0 0 1124.84 0 0 0 0 96.2096 -485.626 0 0 0 463.347 0 0 0 0.03 1647.77 0 0 0 -91.937 0 0 2415.46 -2498.17 0 0 -227.439 -1238.06 0 0 
1094.16 0 0 0 0 0 0 0 222.556 0 0 2221.52 0 0 0 0 0 -2167.96 0 0 0 0 0 0 -1425.14 1562.62 1466.49 -2358.7 0 148.396 0.04 -2370.3 0 0 0 0 0 2481.38 0 2449.03 0 0 0 0 0 
1075.85 0 1006.12 1168.94 -295.343 0 0 1394.16 0 0 0 521.332 0 0 0 -1587.19 0 0 -1945.48 0 0 1826.76 0 0 0 0 0 0 2260.12 0 470.367 0.08 0 0 0 0 0 0 0 0 0 0 0 -1698.13 0 
0 0 0 0 0 0 0 0 0 0 0 0 1039.08 0 0 0 0 0 -634.709 0 0 0 0 0 0 0 2448.27 0 0 0 0 0 0.09 0 0 0 0 2025.89 0 0 0 2314.91 0 0 0 
0 0 0 1043.05 0 0 0 0 0 0 0 1445.43 0 0 0 0 1768.78 -1632.82 0 0 0 -1823.86 0 1169.24 0 0 0 0 0 0 0 0 0 0.07 0 0 0 0 0 -2398.53 185.324 980.331 0 0 0 
0 0 560.549 -1821.57 0 0 0 0 0 0 827.738 0 0 0 -796.152 -982.62 0 -927.076 0 0 2412.11 -1558.35 0 1125.6 813.852 0 0 0 869.701 2018.42 0 0 0 0 0 0 0 0 0 0 0 1965.77 0 0 0 
0 0 0 0 0 0 0 0 0 0 0 1528.29 0 1296.81 0 0 0 0 2369.08 0 0 0 1930.83 0 0 0 0 1688.67 0 0 0 0 0 0 0 0.07 -1288.57 0 45.0911 1531.65 280.236 0 0 0 0 
0 -1146.35 0 1885.66 0 0 2008.96 0 0 1374.94 0 0 0 0 0 2049.39 0 0 0 -359.584 1791.06 -213.858 0 0 0 1662.88 0 2111.19 -596.713 0 0 0 0 0 0 -1739.63 0 0 0 0 0 0 0 0 0 
-856.883 0 0 -1764.05 0 0 0 0 1456.42 -652.104 2362.06 0 174.795 0 -739.082 -2404.63 0 0 0 0 0 0 0 0 1682.1 1749.24 1810.59 -289.85 0 -723.975 2031.85 0 -1554.38 0 0 0 0 0.05 0 0 0 0 0 0 -1120.87 
0 741.523 0 -1980.42 0 0 0 0 0 0 -1889.78 0 0 0 0 0 0 0 2483.67 0 0 910.596 0 0 0 1524.17 0 -1230.89 0 -577.792 0 0 0 0 0 -519.654 0 0 0.09 0 1732.61 0 0 0 0 
-435.881 585.727 0 0 2100.05 -2253.87 0 0 0 0 0 0 0 -578.707 2153.46 2433.16 0 0 0 -79.7296 0 0 1298.79 0 458.159 0 0 0 0 0 -1455.66 0 0 1849.65 0 2030.63 0 0 0 0 0 0 0 0 0 
0 0 2433.32 0 0 0 376.522 0 0 0 0 0 0 0 0 0 -519.044 0 0 -1833.93 0 -1407.13 0 0 0 0 0 0 2489.93 0 0 0 0 1357.23 0 1627.02 0 0 -943.556 0 0 0 0 0 -409.177 
0 2150.26 0 0 0 -17.3193 399.564 0 0 0 0 0 0 -681.402 0 0 0 0 0 0 0 0 0 0 0 0 0 0 0 -56.5355 0 0 1703.62 -1178.4 1845.68 0 0 0 0 0 0 0.06 0 0 0 
513.855 0 0 0 0 0 0 0 0 0 0 0 0 0 0 -2350.76 0 0 0 0 0 0 0 0 0 912.885 0 0 0 1634.04 0 0 0 0 0 0 0 0 0 0 0 0 0.05 0 -370.724 
0 0 0 0 0 0 0 0 0 0 0 0 0 0 0 1744.51 0 0 0 492.798 0 0 0 0 0 -530.793 0 474.944 0 0 0 1429.72 0 0 0 0 0 0 0 0 0 0 0 0.01 0 
0 0 0 2444.46 0 0 0 0 0 0 -2469.79 0 0 0 0 0 0 0 0 0 0 0 0 0 0 0 0 0 0 0 0 0 0 0 0 0 0 -1063.8 0 0 2029.4 0 1190.91 0 0.01 
