*Vertices 62
*Matrix 
0.08 0 0 0 0 0 0 0 0 0 -1872.23 1938.31 0 0 0 0 0 948.439 0 0 0 0 0 357.601 958.052 0 0 -260.857 0 0 0 0 1397.21 0 0 0 0 0 109.79 0 0 1545.84 0 0 0 421.995 0 0 0 0 0 -481.658 -560.091 0 0 0 0 0 0 0 0 0 
0 0.09 -2272.03 0 0 0 0 0 2140.8 0 381.1 0 0 0 0 0 456.175 0 0 0 1406.52 0 0 -2059.31 0 0 0 0 0 0 0 -129.933 0 0 2203.51 698.95 0 0 0 0 0 0 1291.47 0 0 -633.641 -2433.01 0 0 143.208 0 0 0 0 0 0 0 0 0 0 0 2089.68 
0 55.9252 0 0 1142.38 0 0 0 0 -334.101 0 640.202 0 0 0 1192.89 0 0 0 1419.8 0 0 0 0 0 0 0 0 0 0 0 0 -2435.45 0 0 0 0 0 0 0 0 2339.93 0 0 0 0 0 0 0 -1053.27 0 0 0 0 214.469 0 0 0 0 0 0 0 
0 0 0 0 0 0 0 -555.208 0 0 0 0 0 0 258.11 0 2241.36 0 0 0 -1665.93 0 0 0 1118.12 0 0 0 -675.451 0 0 -204.245 0 0 1084.86 0 0 0 2208.24 0 2134.54 0 0 0 0 662.175 171.59 -1229.97 0 0 0 0 0 1537.9 0 0 0 -2284.23 0 0 0 0 
0 0 -75.6096 0 0.02 0 0 705.817 2150.72 0 0 -2291.56 0 0 0 0 -1933.73 2083.12 0 -183.187 1874.07 0 0 1604.43 0 0 0 0 0 0 0 1808.15 0 0 0 -209.128 0 0 1335.87 0 -543.611 -393.612 0 0 0 0 2154.99 0 0 0 0 0 0 -1856.97 0 1263.39 2081.9 140.461 0 0 0 0 
0 0 0 0 0 0.01 0 0 0 2025.13 535.524 0 0 0 -8.92666 -701.697 0 0 0 0 0 0 0 1751.38 0 0 0 0 2366.48 0 0 0 823.008 0 110.553 0 -424.436 0 0 1172.6 0 0 0 0 0 0 0 0 0 0 0 0 0 -2315.36 0 -972.243 0 0 0 417.264 0 0 
0 0 0 0 0 0 0.07 -1525.39 0 1729.26 0 512.635 0 1230.89 0 0 0 0 1965.62 0 -326.777 748.695 2208.7 0 0 0 0 0 -1174.58 0 0 2247.15 0 0 0 0 0 369.961 0 1610.54 2458.95 0 0 250.633 0 0 0 0 1637.55 42.0392 0 0 0 0 0 0 0 0 0 0 0 0 
0 0 0 2066.18 1581.24 0 -2425.84 0.02 -1386.68 2192.07 -626.469 -2317.65 -1096.91 0 0 0 0 2080.68 0 617.771 0 0 0 0 0 1473.66 0 0 704.138 0 0 0 0 0 0 0 1508.3 0 0 0 -2178.03 1423.46 1986.83 0 -489.746 0 0 0 0 0 0 0 -620.365 0 107.196 0 0 0 0 0 0 0 
0 2428.59 0 0 1102.1 0 0 2115.47 0.02 0 0 0 0 0 0 0 0 0 0 135.884 492.035 2083.73 0 0 0 -968.123 2065.57 -2423.4 231.101 0 0 379.879 0 0 0 0 0 0 -2061.91 -378.048 0 0 0 0 1089.28 0 0 2426.15 0 0 0 2291.41 0 0 0 0 0 0 -1142.84 0 0 0 
0 0 1976.3 0 0 262.23 -1214.41 -432.981 0 0.09 0 0 1668.22 0 0 -1163.59 0 -1034.5 0 0 0 0 0 0 0 2026.35 2030.78 0 0 0 0 0 0 0 0 0 0 65.9963 0 -2248.99 0 2061.14 0 0 0 0 0 0 459.227 1789.68 0 0 0 160.604 0 0 0 0 0 2412.41 36.5459 -1492.58 
162.74 2181.84 0 0 0 1837.9 0 971.938 0 0 0.01 -519.349 0 2178.18 0 -1571.02 0 0 0 0 0 155.11 0 0 0 -1625.64 0 1932.05 0 1565.83 0 0 0 0 -1772.59 0 0 0 2009.72 1132.47 0 0 0 0 0 0 0 80.0348 -1139.79 0 0 0 0 1278.5 0 0 0 0 0 0 -1450.01 0 
747.627 0 734.809 0 -2151.78 0 -2356.56 2332.3 0 0 -296.869 0.02 0 2407.38 0 0 203.635 0 0 0 0 2077.01 0 0 0 0 0 0 0 0 0 0 0 797.22 0 0 0 1945.94 450.53 0 0 0 0 0 0 0 0 0 0 1278.95 0 0 0 1853.77 2074.27 0 0 0 0 -1077.53 0 0 
0 0 0 0 0 0 0 472.35 0 1179.77 0 0 0.02 0 0 0 0 0 0 0 0 0 0 0 0 1974.32 -735.115 1801.43 0 -398.495 672.552 0 0 0 1203.73 1586.43 0 1522.34 0 -105.976 0 0 0 -2206.11 0 0 382.015 2119.74 0 0 0 1646.55 0 0 0 1349.3 -1152.3 0 -606.174 0 0 0 
0 0 0 0 0 0 933.332 0 0 0 -28.4585 1603.67 0 0.08 0 0 0 0 0 0 1694.01 0 0 0 1746.19 0 -1107.59 0 0 0 0 -1802.19 0 0 0 0 -49.6689 0 0 0 0 1534.09 0 0 0 0 583.59 0 0 0 -1569.64 0 0 0 0 0 0 0 63.5548 2097.16 0 0 
0 0 0 2072.59 0 -158.62 0 0 0 0 0 0 0 0 0.09 0 0 0 1930.52 1433.07 0 0 -284.509 0 0 831.248 0 0 0 0 1506.62 0 899.304 0 0 0 0 94.5311 1972.03 0 0 -689.184 -1744.67 0 -1960.43 0 0 0 -1802.5 0 0 0 0 0 -1363.8 -1434.45 0 0 0 0 0 0 
0 0 -725.501 0 0 -393.918 0 0 0 -2067.71 2091.81 0 0 0 0 0.08 0 1532.26 302.82 -378.964 0 0 1942.58 0 0 0 0 -1180.07 809.122 -581.759 0 0 0 0 0 -154.347 0 342.036 0 -1942.58 -157.552 0 0 0 0 166.097 0 0 0 0 0 0 0 1592.23 0 0 0 0 0 -298.547 0 0 
0 1298.49 0 -762.581 715.125 0 0 0 0 0 0 -1503.57 0 0 0 0 0 2113.79 2145.83 1348.38 -1953.72 0 0 0 -2283.32 2494.96 505.463 2171.93 96.057 0 0 0 -987.655 0 0 0 0 0 436.949 0 0 0 0 98.4985 642.186 0 0 1096.3 0 0 0 0 445.189 -554.598 0 -963.546 0 0 312.128 0 0 611.057 
-1730.17 0 0 0 -1850.26 0 0 -1909.62 0 652.715 0 0 0 0 0 -315.638 1623.97 0.06 487.762 0 -516.602 0 0 1234.86 1556.83 0 0 0 0 857.646 0 0 2417.14 0 0 0 1237.45 0 0 846.507 0 0 0 -1839.73 0 0 418.79 -1992.48 0 722.297 -1249.2 0 1857.89 1085.77 0 0 0 2431.18 0 0 0 0 
0 0 0 0 0 0 750.984 0 0 0 0 0 0 0 557.497 -2223.96 -82.4763 909.07 0.02 -26.9326 0 0 0 -497.07 2127.98 743.812 0 0 0 0 739.692 0 0 738.624 -2188.56 -1089.13 -344.325 0 0 105.823 1360.59 -1071.28 0 1630.83 0 0 0 2010.79 0 0 0 0 0 580.233 0 0 0 0 0 0 0 0 
0 0 -31.0526 0 -1118.88 0 0 -629.673 1953.87 0 0 0 0 0 -1669.13 -1083.03 1566.44 0 -2304.83 0.03 0 0 0 0 0 2201.83 2428.13 0 1700.87 0 0 0 0 0 0 0 0 -1070.82 0 0 0 0 0 822.703 -1481.44 0 2159.11 0 0 0 0 1264.76 41.1237 0 -908.917 0 0 0 0 329.218 0 0 
0 -2150.72 0 485.015 2436.22 0 1673.41 0 1568.88 0 0 0 0 -642.338 0 0 2471.62 2467.35 0 0 0.07 0 0 0 0 0 0 0 1069.6 0 0 0 0 0 0 0 0 0 0 0 0 1357.39 0 1122.85 0 0 0 0 0 0 2040.24 0 426.725 0 0 0 0 0 0 0 0 0 
0 0 0 0 0 0 96.9726 0 1901.68 0 728.401 349.666 0 0 0 0 0 0 0 0 0 0.08 0 1274.53 0 0 0 0 1446.5 0 0 0 1433.53 0 0 0 0 0 0 0 0 0 0 0 0 0 0 0 0 0 0 1444.06 -2210.38 0 0 0 0 0 0 0 0 0 
0 0 0 0 0 0 545.9 0 0 0 0 0 0 0 796.762 -833.079 0 0 0 0 0 0 0 0 0 0 0 0 0 -1215.78 0 0 -1511.66 0 0 0 0 0 1903.21 0 0 0 0 0 0 0 0 0 0 0 0 0 -1478.09 0 2353.82 0 2258.45 0 0 0 0 0 
-1895.73 848.796 0 0 -774.178 1959.67 0 0 0 0 0 0 0 0 0 0 0 1547.98 700.323 0 0 -1349.6 0 0 -611.667 0 0 0 0 0 -903.272 0 0 2056.26 0 0 0 0 -719.55 0 0 -811.563 0 0 0 0 0 0 0 1770.76 0 0 -1078.3 0 0 2302.7 0 2188.71 74.3889 0 0 0 
-1021.99 0 0 -233.085 0 0 0 0 0 0 0 0 0 -2215.41 0 0 2215.11 676.519 1501.28 0 0 0 0 2016.89 0.02 0 0 0 0 -669.5 0 0 -72.4052 0 0 2039.32 0 0 467.467 0 38.377 0 0 0 0 -604.495 0 308.771 0 0 0 0 0 0 0 0 0 -1802.19 0 0 0 0 
0 0 0 0 0 0 0 1555.15 2285.3 260.857 276.879 0 1050.07 0 -1418.88 0 1235.92 0 2481.23 -1507.84 0 0 0 0 0 0 0 1490.6 362.941 -2369.99 1331.14 0 0 0 0 0 0 0 -366.451 0 0 0 0 0 0 0 178.762 -281.915 0 0 0 -40.9711 0 1454.13 0 0 0 0 0 0 -792.489 -819.956 
0 0 0 0 0 0 0 0 1228.6 -1182.67 0 0 -2062.82 -2263.02 0 0 293.054 0 0 2471.77 0 0 0 0 0 0 0.03 0 0 653.935 0 0 -820.719 0 0 1672.95 0 0 358.669 0 0 0 1821.57 0 0 -518.891 0 0 -504.242 0 0 0 -898.694 0 0 2432.71 0 -88.1222 2338.25 0 0 0 
1793.34 0 0 0 0 0 0 0 616.092 0 1708.96 0 1285.36 0 0 -571.841 -873.669 0 0 0 0 0 0 0 0 496.002 0 0.03 0 0 0 0 1444.67 0 0 0 0 383.999 0 0 0 0 -399.716 0 0 0 0 688.726 0 0 0 -234.001 -571.078 0 0 0 0 0 0 -901.135 630.741 238.731 
0 0 0 -2271.42 0 2470.4 202.719 -1639.07 1928.69 0 0 0 0 0 0 1703.31 -2273.71 0 0 -1500.52 2163.53 484.252 0 0 0 -1766.79 0 0 0.03 0 0 0 0 0 1040.76 265.13 724.281 517.06 0 0 0 0 0 1701.79 0 0 1793.5 0 -207.297 1098.9 0 0 0 1036.48 0 0 0 -876.72 766.091 0 0 0 
0 0 0 0 0 0 0 0 0 0 102.313 0 799.661 0 0 -2366.48 0 2427.21 0 0 0 0 -495.392 0 -934.553 1123.46 1978.44 0 0 0.02 1847.67 1887.19 0 0 0 685.369 0 0 0 0 1394.31 0 0 -1556.83 0 -2010.33 -1002 0 0 -1906.87 0 752.51 1071.89 462.889 1679.05 0 -1673.1 2418.82 0 0 0 0 
0 0 0 0 0 0 0 0 0 0 0 0 -542.695 0 1848.89 0 0 0 235.374 0 0 0 0 567.721 0 2360.84 0 0 0 2144.31 0.09 -1404.69 0 0 0 0 1146.2 0 0 0 1450.32 0 1448.79 0 0 0 0 0 0 0 537.66 0 0 0 0 105.976 0 0 2174.37 -1950.51 -1841.41 0 
0 -1631.75 0 2064.35 1329.92 0 159.078 0 786.386 0 0 0 0 -2044.82 0 0 0 0 0 0 0 0 0 0 0 0 0 0 0 2371.21 2420.5 0.08 0 0 0 0 0 0 0 1375.7 0 2366.94 0 0 -2421.11 1671.12 566.958 1563.84 0 -1947.61 0 -880.535 -1466.03 -31.9681 0 1695.38 0 -2008.35 0 2409.51 0 0 
2293.54 0 -573.672 0 0 530.183 0 0 0 0 0 0 0 0 1033.43 0 428.098 -983.535 0 0 0 1202.96 -2128.28 0 1583.83 0 1429.72 2120.66 0 0 0 0 0 0 0 0 0 0 2492.22 242.393 0 0 0 0 0 0 0 0 -855.815 0 0 2124.93 0 0 116.962 0 0 0 1800.97 -834.758 95.4466 0 
0 0 0 0 0 0 0 0 0 0 0 127.186 0 0 0 0 0 0 989.944 0 0 0 0 1419.49 0 0 0 0 0 0 0 0 0 0.05 0 -2032.15 0 0 0 0 0 0 0 443.51 0 1840.65 0 -468.078 0 0 0 0 0 0 0 0 0 0 80.7978 0 1310.54 -2093.04 
0 -1108.51 0 2337.95 0 1513.49 0 0 0 0 960.494 0 -674.078 0 0 0 0 0 1369.14 0 0 0 0 0 0 0 0 0 -376.98 0 0 0 0 0 0.09 -693.762 0 0 122.608 2230.67 0 1885.51 1199 1920.91 -2135.15 0 -803.934 0 0 1918.16 0 0 1018.94 0 0 0 -1439.33 -507.599 0 0 0 0 
0 -65.2333 0 0 -1703.31 0 0 0 0 0 0 0 -110.858 0 0 406.43 0 0 435.881 0 0 0 0 0 -1185.11 0 1809.21 0 -1418.88 1041.37 0 0 0 2044.51 -28.0007 0 0 -170.675 0 0 1857.43 0 0 0 0 0 0 0 0 0 0 0 0 0 0 0 0 0 0 0 0 -1329.62 
0 0 0 0 0 -507.447 0 -2434.39 0 0 0 0 0 -87.054 0 0 0 1928.08 969.497 0 0 0 0 0 0 0 0 0 1471.22 0 -450.072 0 0 0 0 0 0.07 0 2355.34 0 0 0 0 0 1522.49 0 0 0 0 0 2303.46 2015.98 1394.16 -684.454 -1257.74 0 0 0 0 -2384.95 2497.1 0 
0 0 0 0 0 0 2352.29 0 0 311.212 0 2482.6 342.494 0 -25.8644 -1464.96 0 0 0 74.2363 0 0 0 0 0 0 0 -519.196 -495.239 0 0 0 0 0 0 957.9 0 0.03 217.063 2132.71 -1592.38 0 0 2445.22 -472.045 0 0 931.043 0 0 0 0 1180.53 0 0 0 2459.72 -1586.28 1852.85 0 0 721.534 
1957.99 0 0 2089.68 2111.5 0 0 0 -2279.35 0 263.604 -746.864 0 0 1263.24 0 1876.35 0 0 0 0 0 -917.92 879.467 1858.96 434.507 464.263 0 0 0 0 0 1945.02 0 -290.002 0 -2161.55 -144.887 0.04 0 -535.066 0 0 1464.81 645.543 0 2135.3 0 -1511.35 0 0 0 0 0 835.063 -2026.05 0 0 0 0 325.098 -347.835 
0 0 0 0 0 -2452.7 503.784 0 1523.87 911.969 1961.2 0 -691.168 0 0 1733.83 0 125.66 -820.261 0 0 0 0 0 0 0 0 0 0 0 0 1269.04 -2493.44 0 1619.08 0 0 829.569 0 0.05 0 0 0 0 1844.31 0 0 0 0 0 -1909.31 0 0 0 0 0 0 0 0 0 0 -339.137 
0 0 0 535.524 -2116.99 0 90.5637 -594.729 0 0 0 0 0 0 0 -2376.09 0 0 -864.818 0 0 0 0 0 641.27 0 0 0 0 1690.19 2437.74 0 0 0 0 1540.19 0 1611.3 1445.59 0 0.02 38.2244 -302.057 0 0 0 0 0 702.307 0 0 0 1082.72 0 0 0 0 0 0 0 0 0 
2188.86 0 -1454.59 0 45.2437 0 0 -666.601 0 1041.52 0 0 0 1452.3 2328.18 0 0 0 -2407.83 0 307.855 0 0 -833.537 0 0 0 0 0 0 0 2200.61 0 0 1290.09 0 0 0 0 0 2112.87 0 0 0 817.209 -1142.08 0 0 -773.263 0 0 1990.65 0 0 2302.09 0 0 1813.49 0 1709.88 0 0 
0 -1797.77 0 0 0 0 0 1498.38 0 0 0 0 0 0 -1214.41 0 0 0 0 0 0 0 0 0 0 0 1123.92 375.759 0 0 1503.42 0 0 0 397.427 0 0 0 0 0 1976.76 0 0.02 0 0 0 362.484 0 0 2339.93 0 0 0 0 0 0 0 0 0 0 0 0 
0 0 0 0 0 0 272.301 0 0 0 0 0 -2109.97 0 0 0 1584.75 1244.16 -770.669 -1285.82 -459.99 0 0 0 0 0 0 0 -2131.34 -1159.02 0 0 0 -978.347 2321.47 0 0 992.691 409.787 0 0 0 0 0 976.669 0 0 0 0 0 0 0 2266.23 41.4289 0 2399.75 0 2274.01 0 0 0 0 
0 0 0 0 0 0 0 -69.6585 1229.21 0 0 0 0 0 -63.86 0 -1912.21 0 0 1390.5 0 0 0 0 0 0 0 0 0 0 0 -1558.66 0 0 1377.22 0 975.143 -467.009 2343.44 1182.82 0 -2138.51 0 496.765 0.03 2423.55 297.327 0 0 0 -1336.48 2438.05 -214.316 -1477.63 0 -1545.23 0 0 0 2486.42 2478.94 0 
982.162 1859.11 0 697.272 0 0 0 0 0 0 0 0 0 0 0 -1519.14 0 0 0 0 0 0 0 0 -822.245 0 -786.386 0 0 -1969.74 0 1559.57 0 -336.238 0 0 0 0 0 0 0 1718.57 0 0 -871.685 0.09 0 0 0 0 0 0 0 0 0 0 0 0 0 0 0 0 
0 -149.617 0 -1785.87 -1867.96 0 0 0 0 0 0 0 -1709.42 -926.771 0 0 0 1912.52 0 -663.854 0 0 0 0 0 2150.56 0 0 1477.78 -1636.94 0 -1765.27 0 0 1481.14 0 0 0 1477.32 0 0 0 2050.16 0 723.06 0 0.05 946.76 0 0 0 0 -2174.98 0 0 0 -271.233 0 2208.85 0 0 0 
0 0 0 830.485 0 0 0 0 1917.4 0 256.737 0 1805.25 0 0 0 1637.7 1345.79 -895.489 0 0 0 0 0 -647.221 -80.0348 0 -1039.99 0 0 0 2469.63 0 2497.56 0 0 0 -1762.83 0 0 0 0 0 0 0 0 357.295 0.01 0 0 0 0 -1039.38 0 0 -1169.55 0 0 0 2087.85 1249.05 -435.423 
0 0 0 0 0 0 1377.38 0 0 1528.29 -1771.22 0 0 0 1579.1 0 0 0 0 0 0 0 0 0 0 0 -364.62 0 1949.14 0 0 0 619.755 0 0 0 0 0 -572.756 0 1316.64 502.411 0 0 0 0 0 0 0.01 0 2483.67 0 -20.0659 783.486 0 0 -597.171 0 0 0 0 0 
0 1139.03 1674.02 0 0 0 1219.6 0 0 -636.54 0 -1910.84 0 0 0 0 0 2392.88 0 0 0 0 0 1095.54 0 0 0 0 106.281 1168.94 0 -559.328 0 0 1961.81 0 0 0 0 0 0 0 465.331 0 0 0 0 0 0 0.06 0 0 0 0 0 0 -1466.49 0 0 0 -1476.1 0 
0 0 0 0 0 0 0 0 0 0 0 0 0 33.9518 0 0 0 -760.14 0 0 1950.21 0 0 0 0 0 0 0 0 0 -165.639 0 0 0 0 0 1698.74 0 0 1616.03 0 0 0 0 -1573.15 0 0 0 -1846.45 0 0.06 0 0 0 410.245 2416.23 0 0 0 0 0 0 
92.0896 0 0 0 0 0 0 0 1173.36 0 0 0 269.86 0 0 0 0 0 0 -1521.58 0 400.174 0 0 0 714.362 0 1045.34 0 1521.58 0 627.995 -990.249 0 0 0 -1462.22 0 0 0 0 2471.62 0 0 -1395.99 0 0 0 0 0 0 0.02 -1229.82 0 0 0 0 0 0 0 0 0 
-1296.66 0 0 0 0 0 0 791.574 0 0 0 0 0 0 0 0 1211.97 275.048 0 -588.168 -1599.4 -100.177 1848.12 1337.7 0 0 1402.55 -2491.91 0 1689.73 0 -1126.67 0 0 -2069.38 0 -41.8867 -269.402 0 0 926.466 0 0 936.384 -1866.89 0 1108.36 649.052 1582.61 0 0 923.414 0.03 0 144.581 770.974 0 -1363.19 0 -4.0437 0 0 
0 0 0 971.023 -1204.95 168.996 0 0 0 47.9904 1715.67 1965.01 0 0 0 626.316 2177.42 1805.09 -906.629 0 0 0 0 0 0 -1590.7 0 0 1457.18 -274.285 0 -762.886 0 0 0 0 -2094.26 0 0 0 0 0 0 -970.565 332.881 0 0 0 418.332 0 0 0 0 0.05 0 0 0 0 0 1979.35 557.344 0 
0 0 725.349 0 0 0 0 77.4407 0 0 0 1742.99 0 0 36.8511 0 0 0 0 95.5992 0 0 2343.29 0 0 0 0 0 0 -1999.95 0 0 2165.52 0 0 0 2357.48 0 430.082 0 0 1154.59 0 0 0 0 0 0 0 0 -1991.71 0 471.892 0 0.01 0 0 0 0 0 0 0 
0 0 0 0 242.546 1670.35 0 0 0 0 0 0 -655.156 0 1117.05 0 -2001.94 0 0 0 0 0 0 1912.52 0 0 2309.87 0 0 0 -1022.75 -817.362 0 0 0 0 0 0 1569.03 0 0 0 0 -2181.23 736.335 0 0 -196.463 0 0 1218.53 0 2150.87 0 0 0.05 0 0 0 975.753 653.935 0 
0 0 0 0 664.922 0 0 0 0 0 0 0 -604.953 0 0 0 0 0 0 0 0 0 472.045 0 0 0 0 0 0 -1136.43 0 0 0 0 1973.1 0 0 -1173.97 0 0 0 0 0 0 0 0 -726.417 0 18.6926 -458.617 0 0 0 0 0 0 0.03 0 2173.76 0 0 0 
0 0 0 -476.012 -480.743 0 0 0 0 0 0 0 0 0 0 0 0 -963.698 0 0 0 0 0 1117.97 2383.42 0 1823.25 0 2360.99 50.2792 0 1830.58 0 0 -223.624 0 0 672.704 0 0 0 -716.956 0 23.1178 0 0 0 0 0 0 0 0 -1286.13 0 0 0 0 0.08 0 0 0 0 
0 0 0 0 0 0 0 0 916.547 0 0 0 -777.23 697.577 0 0 -1947.61 0 0 0 0 0 0 788.522 0 0 643.864 0 -2129.2 0 -751.442 0 -445.189 1584.9 0 0 0 1255 0 0 0 0 0 0 0 0 -2321.31 0 0 0 0 0 0 0 0 0 1912.82 0 0.06 2344.05 0 0 
0 0 0 0 0 1185.42 0 0 0 263.451 0 1482.06 0 -411.466 0 2305.9 0 0 0 2005.6 0 0 0 0 0 0 0 -2251.27 0 0 2117.3 2245.17 -1583.22 0 0 0 -569.399 0 0 0 0 2.51778 0 0 385.83 0 0 -1590.7 0 0 0 0 1117.36 602.664 0 129.78 0 0 1053.58 0.01 1822.49 0 
0 0 0 0 0 0 0 0 0 -2239.22 1689.89 0 0 0 0 0 0 0 0 0 0 0 0 0 0 -147.328 0 2091.51 0 0 998.032 0 777.078 2482.15 0 0 -1796.55 0 -670.721 0 0 0 0 0 159.993 0 0 1707.89 0 1172.14 0 0 0 -202.567 0 1388.21 0 0 0 2018.42 0.09 0 
0 1816.39 0 0 0 0 0 0 0 1824.17 0 0 0 0 0 0 2137.9 0 0 0 0 0 0 0 0 1384.4 0 1187.55 0 0 0 0 0 -722.144 0 -1404.54 0 -11.9785 -2166.43 583.285 0 0 0 0 0 0 0 1560.95 0 0 0 0 0 0 0 0 0 0 0 0 0 0.05 
