*Vertices 57
*Matrix 
0.03 1063.65 0 0 0 0 0 -801.95 0 0 702.002 0 0 0 0 0 0 0 -261.925 1407.59 0 1057.54 0 0 0 0 0 0 0 0 0 0 0 0 0 0 0 1584.6 0 2308.95 0 0 -748.085 0 241.478 0 0 0 0 0 0 0 0 0 0 0 0 
1132.16 0.07 0 0 0 0 -522.095 0 1897.87 1306.57 409.177 2093.04 0 0 0 0 0 0 0 0 0 0 0 1854.99 0 0 0 0 0 0 2396.54 0 0 -1381.19 2254.02 0 -436.644 0 654.698 -21.2867 1285.82 0 0 0 0 0 0 0 -715.43 0 0 0 0 0 0 -1642.74 0 
0 0 0.07 0 999.252 0 0 0 0 0 0 0 130.238 0 0 2057.18 0 0 0 0 1733.99 0 0 0 -378.506 0 0 -1959.52 0 0 0 1877.27 0 626.316 0 0 1739.02 1883.07 2112.57 0 -362.484 0 0 0 0 -180.135 0 1800.36 0 0 0 0 0 0 0 0 0 
0 0 0 0.08 0 -271.844 0 0 0 0 0 0 0 699.561 -914.716 0 0 0 0 0 0 0 2203.97 0 0 -1759.93 0 0 0 0 1379.36 0 -1173.67 0 2388.45 0 0 0 1940.9 0 0 0 0 0 0 0 2216.94 0 -1005.2 0 0 0 0 0 0 0 0 
0 0 2458.95 0 0.06 0 0 0 -744.728 0 0 1164.36 1860.18 1648.08 0 831.858 562.685 0 0 0 0 1962.72 0 0 0 0 0 0 0 1929.76 0 0 0 0 0 -391.324 0 0 0 0 0 0 0 0 0 0 0 0 0 0 0 1343.04 0 0 0 0 0 
0 0 0 -688.116 0 0.01 0 2462.77 0 1921.37 0 0 0 0 0 0 0 2313.68 0 0 0 214.316 0 0 1684.7 0 2438.2 0 0 0 0 0 0 1537.9 0 0 0 0 0 0 0 1217.92 -1194.88 0 0 0 0 0 0 0 0 0 0 0 0 -2086.17 0 
0 -920.82 0 0 0 0 0.02 2395.47 0 0 0 0 0 0 -392.392 0 0 0 0 0 0 0 0 0 0 454.039 0 0 1954.94 1732.31 0 0 0 0 0 0 -144.429 236.137 -76.0674 0 0 0 0 0 0 0 0 0 0 0 1440.55 0 0 0 0 0 0 
1486.48 0 0 0 0 -839.641 1419.03 0.09 0 0 0 0 893.658 488.372 0 0 0 0 0 0 0 0 -2392.27 -2054.12 0 2216.33 0 0 0 0 0 0 0 0 0 0 0 1498.54 1100.88 0 0 0 0 0 625.858 0 0 0 0 0 0 0 -1151.69 0 0 0 0 
0 1104.54 0 0 2447.66 0 0 0 0.01 862.072 753.273 0 0 0 1328.55 0 0 0 -224.998 0 0 0 88.7326 2275.69 0 -860.088 0 0 0 0 0 0 0 0 0 0 0 0 0 0 2149.95 0 0 0 0 0 1946.09 0 0 0 0 0 0 0 0 0 0 
0 790.048 0 0 0 48.9059 0 0 1345.18 0.08 0 0 0 243.919 0 -2245.78 302.21 1363.49 1215.32 0 -162.435 0 233.39 1026.57 0 0 0 0 -752.968 0 0 0 0 0 -1460.23 0 0 0 0 0 1449.71 0 0 0 1719.18 0 0 0 0 0 0 0 0 0 0 0 0 
1524.48 -1393.4 0 0 0 0 0 0 1876.81 0 0.08 0 0 0 0 0 0 0 0 0 1952.35 2446.75 0 2417.45 0 0 0 0 0 0 0 0 2174.37 0 -701.239 0 -1838.66 0 -156.789 0 -535.829 0 -1102.71 -349.208 0 0 -2341.46 0 0 0 1451.99 0 0 -908.155 0 0 0 
0 -657.903 0 0 15.0304 0 0 0 0 0 0 0.01 0 0 0 0 -2202.75 0 0 0 0 1621.52 0 0 0 0 0 0 0 1564 0 2427.37 1892.38 1067.31 0 584.048 0 -283.441 0 -1344.26 0 0 0 0 0 0 0 0 0 0 0 0 0 0 0 0 0 
0 0 1013.44 0 1987.44 0 0 740.76 0 0 0 0 0 0 1212.42 0 0 0 0 0 2300.41 0 0 0 0 0 0 -1729.26 0 0 0 1093.55 0 0 341.731 -2067.09 0 1234.09 0 0 0 0 0 0 1098.74 0 0 0 0 0 0 0 0 0 0 0 0 
0 0 0 1120.72 2042.22 0 0 -1993.24 0 -1753.82 0 0 0 0.07 505.921 0 0 0 0 1359.22 0 0 0 0 457.244 0 0 0 1916.03 -575.503 2359.31 -142.598 0 0 0 2111.19 0 631.352 0 0 -2311.24 724.586 0 253.533 0 0 0 0 1168.48 0 0 0 0 0 0 0 0 
0 0 0 1850.87 0 0 1631.14 0 141.224 0 0 0 -1538.51 533.845 0.05 -491.272 -1611.61 376.522 0 0 0 66.1489 846.507 -1225.7 0 0 0 0 0 976.211 0 0 1323.21 1918.01 0 0 0 0 0 0 0 0 0 -953.78 0 0 0 0 0 0 0 -303.43 462.127 0 0 0 0 
0 0 -120.777 0 821.787 0 0 0 0 -493.866 0 0 0 0 2435.3 0.04 1663.34 0 0 0 0 0 0 1264.61 0 0 0 0 0 156.636 0 0 0 0 0 0 0 0 0 1297.72 0 0 0 0 0 0 0 0 0 0 0 0 0 0 0 0 0 
0 0 0 0 2317.96 0 0 0 0 1689.28 0 1802.35 0 0 1306.73 1654.33 0.03 744.423 0 -1885.2 0 0 2276.6 0 -2156.67 0 0 0 0 0 -823.923 -179.525 0 0 0 -2132.1 0 0 1639.68 0 0 0 0 0 0 0 0 0 0 0 -1685.92 -1708.81 0 0 0 0 2164.14 
0 0 0 0 0 -616.855 0 0 0 -1445.28 0 0 0 0 2485.96 0 -658.818 0.04 0 0 0 -120.777 0 0 0 0 0 0 0 0 0 1166.19 0 354.396 0 0 0 0 1827.83 494.934 0 0 0 0 0 0 0 0 0 0 0 0 537.355 0 0 0 -1841.26 
1580.78 0 0 0 0 0 0 0 65.8437 2067.71 0 0 0 0 0 0 0 0 0.02 0 0 0 0 0 0 -47.6852 0 0 0 0 1391.26 0 0 0 2367.7 983.688 0 0 0 0 0 0 0 0 0 0 0 2317.04 0 0 0 0 0 -1656.32 -2386.62 0 -320.063 
2084.34 0 0 0 0 0 0 0 0 0 0 0 0 1424.68 0 0 1143.6 0 0 0.05 0 0 1193.04 0 0 0 0 0 0 0 0 -1138.42 0 0 0 0 0 0 0 0 1296.5 0 0 0 0 0 0 0 0 682.318 -1872.84 0 0 0 0 0 0 
0 0 1765.72 0 0 0 0 0 0 2353.66 -947.523 0 -1024.28 0 0 0 0 0 0 0 0.09 0 0 0 0 -891.369 1377.83 0 2343.59 0 0 0 0 0 0 0 0 0 0 0 -416.959 904.797 0 0 0 1931.44 0 0 0 0 0 0 0 0 0 0 0 
951.949 0 0 0 2005.91 1820.51 0 0 0 0 349.513 -2378.23 0 0 1568.12 0 0 -1786.02 0 0 0 0.08 620.212 0 0 -2081.9 0 2360.38 0 0 0 0 0 0 0 0 0 0 0 0 0 0 0 0 1810.89 0 0 0 0 0 0 0 0 0 -271.081 0 0 
0 0 0 -95.9044 0 0 0 -1964.4 2018.57 524.537 0 0 0 0 1168.48 0 -441.984 0 0 1661.96 0 1096.15 0.06 0 -1238.67 0 0 0 -1964.55 0 1374.32 0 0 0 0 0 -165.792 0 -459.227 0 0 0 0 0 0 0 0 0 0 0 0 0 0 0 0 0 0 
0 -108.875 0 0 0 0 0 1547.67 600.375 2000.56 1747.41 0 0 0 77.4407 -2485.81 0 0 0 0 0 0 0 0.09 0 -379.879 0 0 0 -1000.93 0 0 0 0 0 0 -2182 0 0 190.054 0 0 0 0 0 0 0 0 0 2450.87 0 0 0 0 0 0 -271.996 
0 0 1609.78 0 0 -1735.21 0 0 0 0 0 0 0 1714.61 0 0 631.962 0 0 0 0 0 -826.67 0 0.09 0 2407.68 0 0 0 0 0 0 -878.094 0 0 0 0 682.47 0 0 0 1583.68 -1500.21 0 0 0 0 0 0 0 0 0 0 0 0 0 
0 0 0 546.815 0 0 -302.667 -1381.04 2203.36 0 0 0 0 0 0 0 0 0 -1717.96 0 -2359.92 -2424.16 0 2192.53 0 0.04 0 0 0 0 0 0 0 0 2220.15 0 1683.02 1642.28 0 0 0 0 0 0 22.66 435.118 0 0 0 0 0 0 0 0 0 0 0 
0 0 0 0 0 -392.239 0 0 0 0 0 0 0 0 0 0 0 0 0 0 497.986 0 0 0 2226.71 0 0.02 0 0 0 -467.772 -1299.71 0 0 2417.91 0 354.854 0 0 0 0 0 -2008.8 0 -472.35 0 0 0 0 0 0 0 0 0 0 0 0 
0 0 2295.53 0 0 0 0 0 0 0 0 0 688.574 0 0 0 0 0 0 0 0 379.727 0 0 0 0 0 0.05 0 0 2109.67 0 0 2351.22 479.369 0 0 0 0 0 -190.817 0 0 0 0 0 0 -2473.6 0 0 0 0 0 0 0 0 0 
0 0 0 0 0 0 477.844 0 0 -1309.78 0 0 0 -1137.81 0 0 0 0 0 0 -887.402 0 -425.504 0 0 0 0 0 0 1116.75 0 0 1695.68 0 0 2109.36 0 0 -1187.55 0 0 0 283.898 0 2417.6 0 0 0 0 0 0 0 0 -977.126 0 0 0 
0 0 0 0 1589.48 0 462.737 0 0 0 0 -1830.12 0 -529.572 2285.3 1288.26 0 0 0 0 0 0 0 -417.112 0 0 0 0 -899.304 0 0 1430.78 0 0 1623.05 0 -2329.55 0 0 0 1585.36 0 0 0 0 0 0 0 0 0 0 0 0 0 0 711.31 0 
0 930.28 0 2078.54 0 0 0 0 0 0 0 0 0 -252.922 0 0 -840.556 0 197.226 0 0 0 1433.53 0 0 0 -1141.01 195.242 0 0 0.05 0 0 721.381 0 0 0 986.282 0 0 0 0 1256.52 -1592.84 0 0 0 0 0 0 1496.7 0 0 847.575 0 0 -1104.54 
0 0 -248.344 0 0 0 0 0 0 0 0 23.8807 2054.43 277.337 0 0 2000.41 -767.617 0 1752.6 0 0 0 0 0 0 -2066.48 0 0 -2127.98 0 0 0 0 0 1967.45 0 0 -699.103 0 0 0 0 0 0 -328.608 0 0 942.183 0 0 0 0 417.112 0 0 0 
0 0 0 2462.16 0 0 0 0 0 0 441.221 2101.43 0 0 -1618.93 0 0 0 0 0 0 0 0 0 0 0 0 0 -1474.88 0 0 0 0.08 0 0 0 0 0 0 0 0 1762.06 0 0 0 0 0 0 0 0 0 -1759.16 0 0 0 0 0 
0 679.571 1854.08 0 0 2013.53 0 0 0 0 0 -2260.12 0 0 -1742.23 0 0 1457.18 0 0 0 0 0 0 -671.941 0 0 661.26 0 0 634.556 0 0 0.01 0 0 0 0 0 0 0 0 0 0 0 0 0 0 0 0 0 0 0 1719.18 0 0 0 
0 923.414 0 601.138 0 0 0 0 0 1948.68 -394.223 0 2425.08 0 0 0 0 0 -1361.51 0 0 0 0 0 0 437.254 -2104.18 2261.04 0 -257.195 0 0 0 0 0.06 0 0 0 0 1291.01 0 0 0 0 0 0 0 0 0 0 -54.7044 0 0 0 0 0 0 
0 0 0 0 -1664.56 0 0 0 0 0 0 -1086.23 678.655 523.774 0 0 591.372 0 1667.3 0 0 0 0 0 0 0 0 0 -2362.51 0 0 -799.661 0 0 0 0.06 1296.35 559.481 0 1806.92 1590.09 0 0 0 0 0 0 0 0 0 0 0 0 0 0 0 969.649 
0 -1149.4 2207.33 0 0 0 2495.57 0 0 0 1700.42 0 0 0 0 0 0 0 0 0 0 0 -458.77 -517.212 0 -1532.72 1089.13 0 0 1506.01 0 0 0 0 0 1964.4 0 0 0 1101.95 0 0 0 0 0 0 0 -1880.47 0 0 0 0 0 0 0 0 0 
1220.36 0 -414.518 0 0 0 438.78 -1653.57 0 0 0 405.972 1440.86 1684.39 0 0 0 0 0 0 0 0 0 0 0 -600.375 0 0 0 0 -136.799 0 0 0 0 1745.73 0 0.04 0 0 0 0 0 0 -2343.9 0 0 0 0 -890.301 0 0 0 0 0 0 0 
0 -745.186 -978.805 675.756 0 0 1893.75 278.1 0 0 -1790.6 0 0 0 0 0 596.561 -162.435 0 0 0 0 1858.96 0 666.295 0 0 0 1514.4 0 0 1996.9 0 0 0 0 0 0 0.01 860.851 0 0 1514.71 0 0 0 0 0 0 0 2164.91 1943.19 0 0 0 0 0 
-1196.1 -1885.97 0 0 0 0 0 0 0 0 0 -1151.84 0 0 0 1105.61 0 2372.43 0 0 0 0 0 902.966 0 0 0 0 0 0 0 0 0 0 1319.39 355.617 1050.68 0 1350.22 0.02 0 0 1234.86 0 0 0 0 0 2360.07 0 -2429.81 -2287.59 -2206.41 0 0 0 0 
0 2428.43 460.295 0 0 0 0 0 1969.89 265.893 -2414.09 0 0 -1189.84 0 0 0 0 0 491.577 1672.64 0 0 0 0 0 0 -1332.51 0 -2039.02 0 0 0 0 0 1031.14 0 0 0 0 0.03 0 0 0 0 0 2180.01 0 0 0 0 0 0 0 0 0 0 
0 0 0 0 0 1853.47 0 0 0 0 0 0 0 -15.9459 0 0 0 0 0 0 535.524 0 0 0 0 0 0 0 0 0 0 0 -100.33 0 0 0 0 0 0 0 0 0.03 0 0 0 0 0 0 0 779.824 0 0 0 0 -2349.85 431.761 0 
-995.743 0 0 0 0 1786.94 0 0 0 0 2253.11 0 0 0 0 0 0 0 0 0 0 0 0 0 -1521.88 0 1119.34 0 242.241 0 -2133.63 0 0 0 0 0 0 0 -345.851 -1898.33 0 0 0 1490.45 0 0 0 0 0 0 0 0 2278.28 0 -546.815 0 0 
0 0 0 0 0 0 0 0 0 0 -707.19 0 0 -2097.61 1703.16 0 0 0 0 0 0 0 0 0 1209.22 0 0 0 0 0 1336.94 0 0 0 0 0 0 0 0 0 0 0 1144.37 0.08 0 0 0 0 0 0 2094.1 0 0 0 0 0 0 
2111.19 0 0 0 0 0 0 427.335 0 10.6052 0 0 -122.303 0 0 0 0 0 0 0 0 286.492 0 0 0 1483.73 -487.457 0 513.092 0 0 0 0 0 0 0 0 -525.605 0 0 0 0 0 0 0.06 0 0 0 0 0 0 0 0 0 0 0 0 
0 0 1542.02 0 0 0 0 0 0 0 0 0 0 0 0 0 0 0 0 0 374.996 0 0 0 0 754.036 0 0 0 0 0 832.469 0 0 0 0 0 0 0 0 0 0 0 0 0 0.07 0 0 0 0 0 0 0 0 0 1504.18 0 
0 0 0 2096.39 0 0 0 0 1596.96 0 -410.703 0 0 0 0 0 0 0 0 0 0 0 0 0 0 0 0 0 0 0 0 0 0 0 0 0 0 0 0 0 1719.95 0 0 0 0 0 0.07 -2310.33 0 0 0 0 0 1062.27 0 0 0 
0 0 -1142.38 0 0 0 0 0 0 0 0 0 0 0 0 0 0 0 1843.55 0 0 0 0 0 0 0 0 -1432 0 0 0 0 0 0 0 0 1843.39 0 0 0 0 0 0 0 0 0 -1736.88 0.03 0 0 0 0 0 0 0 0 0 
0 2032.3 0 1621.83 0 0 0 0 0 0 0 0 0 -2406.46 0 0 0 0 0 0 0 0 0 0 0 0 0 0 0 0 0 1955.09 0 0 0 0 0 0 0 1537.6 0 0 0 0 0 0 0 0 0.06 980.789 0 0 0 0 0 0 0 
0 0 0 0 0 0 0 0 0 0 0 0 0 0 0 0 0 0 0 -1014.51 0 0 0 651.341 0 0 0 0 0 0 0 0 0 0 0 0 0 1470.46 0 0 0 1624.42 0 0 0 0 0 0 -302.82 0.09 0 0 0 0 0 0 0 
0 0 0 0 0 0 160.909 0 0 0 -1.44963 0 0 0 0 0 1768.01 0 0 2257.38 0 0 0 0 0 0 0 0 0 0 1618.93 0 0 0 -2026.35 0 0 0 1359.52 501.648 0 0 0 -95.7518 0 0 0 0 0 0 0.04 0 0 0 0 0 0 
0 0 0 0 -1164.66 0 0 0 0 0 0 0 0 0 1956.77 0 2397.76 0 0 0 0 0 0 0 0 0 0 0 0 0 0 0 -272.912 0 0 0 0 0 -756.783 1736.88 0 0 0 0 0 0 0 0 0 0 0 0.04 0 0 0 0 0 
0 0 0 0 0 0 0 2270.81 0 0 0 0 0 0 128.712 0 0 1735.66 0 0 0 0 0 0 0 0 0 0 0 0 0 0 0 0 0 0 0 0 0 -486.541 0 0 1136.89 0 0 0 0 0 0 0 0 0 0.04 0 1583.07 0 0 
0 0 0 0 0 0 0 0 0 0 2266.53 0 0 0 0 0 0 0 2403.41 0 0 0 0 0 0 0 0 0 -80.6452 0 -1132.47 2481.84 0 -612.888 0 0 0 0 0 0 0 0 0 0 0 0 690.252 0 0 0 0 0 0 0.01 0 0 0 
0 0 0 0 0 0 0 0 0 0 0 0 0 0 0 0 0 0 963.088 0 0 2110.58 0 0 0 0 0 0 0 0 0 0 0 0 0 0 0 0 0 0 0 -1607.64 227.439 0 0 0 0 0 0 0 0 0 2008.5 0 0.01 0 0 
0 195.547 0 0 0 -1263.24 0 0 0 0 0 0 0 0 0 0 0 0 0 0 0 0 0 0 0 0 0 0 0 -20.6763 0 0 0 0 0 0 0 0 0 0 0 1515.78 0 0 0 787.759 0 0 0 0 0 0 0 0 0 0 1526.15 
0 0 0 0 0 0 0 0 0 0 0 0 0 0 0 0 -243.461 1304.13 -1105 0 0 0 0 286.95 0 0 0 0 0 0 1624.73 0 0 0 0 946.303 0 0 0 0 0 0 0 0 0 0 0 0 0 0 0 0 0 0 0 1996.75 0.05 
