*Vertices 58
*Matrix 
0.08 0 0 0 0 0 0 505.463 0 0 0 0 0 0 0 0 0 0 0 0 0 0 2386.17 0 0 0 0 0 0 0 0 0 0 0 0 0 0 0 804.697 0 0 1818.06 0 0 0 -1892.53 0 0 0 0 0 -2218.31 0 0 0 0 0 0 
0 0.09 0 0 0 -1687.44 0 0 0 0 0 0 0 0 0 0 0 0 1166.8 0 0 0 0 0 0 265.282 0 0 0 0 0 0 0 0 0 0 0 0 0 0 0 0 0 0 0 0 0 475.86 0 0 0 1430.94 0 0 0 0 0 0 
0 0 0.02 0 0 0 0 0 0 0 0 0 0 0 0 0 0 0 0 0 0 0 -1858.96 0 0 0 895.184 0 0 0 0 0 0 0 2003.01 0 0 0 0 0 0 0 0 1399.04 0 0 0 0 0 0 1380.43 0 0 0 0 0 0 0 
0 0 0 0.07 0 2480.77 0 1098.74 0 1690.04 0 2118.06 0 0 0 0 0 0 -1110.8 0 0 0 0 0 0 0 -467.009 0 0 0 0 0 0 0 1091.88 0 0 0 0 -740.455 0 0 0 0 -2164.75 0 0 2158.96 0 0 0 0 0 0 0 0 0 0 
0 0 0 0 0.02 0 0 0 0 0 0 0 0 0 839.641 0 0 0 0 0 0 0 0 0 0 0 0 0 0 0 0 0 0 338.832 230.491 0 0 0 0 0 -1538.36 0 0 0 0 0 0 0 1659.83 0 0 0 0 0 0 0 0 0 
0 -2433.16 0 2382.81 0 0.07 0 0 0 0 0 0 0 0 0 2448.73 0 0 0 0 0 -1739.02 0 0 0 0 0 0 0 0 0 0 0 0 0 0 0 0 0 0 270.928 0 0 0 0 0 0 0 1135.98 -890.149 0 0 -539.186 0 0 0 0 0 
0 0 0 0 0 0 0.03 0 0 0 0 0 0 0 0 0 0 0 0 0 0 0 0 0 0 0 0 0 -142.293 0 0 0 0 0 0 0 0 0 0 635.014 0 0 0 0 0 0 0 0 0 0 0 0 2005.75 0 0 0 0 0 
399.106 0 0 -1831.64 0 0 0 0.06 0 0 0 235.221 0 0 1800.21 0 0 0 2416.38 0 1818.37 0 0 -2325.59 0 0 52.2629 0 0 1404.69 0 0 0 0 0 0 0 0 0 0 0 171.285 0 0 0 0 759.072 0 0 0 0 0 0 0 0 0 0 0 
0 0 0 0 0 0 0 0 0.05 0 1434.29 0 0 0 0 0 0 0 -1824.93 0 0 2264.55 0 0 0 0 -503.784 0 0 -1146.66 0 0 0 0 0 0 1752.14 0 0 1638.62 0 0 0 0 0 0 0 0 0 -2140.49 0 0 0 0 0 0 1194.42 0 
0 0 0 1960.89 0 0 0 0 0 0.08 0 0 0 0 0 0 0 0 639.744 0 0 0 0 0 -1817.3 0 0 0 0 0 0 0 2441.1 0 0 0 0 97.5829 0 -241.173 0 0 338.069 0 0 0 0 0 0 0 0 815.683 0 0 0 0 -111.164 0 
0 0 0 0 0 0 0 0 844.523 0 0.02 0 0 0 13.5044 0 0 0 0 0 0 0 0 0 0 -1044.72 0 0 0 0 0 0 0 0 0 0 0 0 0 0 1644.57 0 0 0 0 0 0 0 -2415.16 0 0 -176.016 0 0 0 781.655 1412.47 0 
0 0 0 806.986 0 0 0 2176.96 0 0 0 0.07 0 0 0 0 0 0 2196.34 255.211 0 0 0 0 -1992.63 0 0 0 2265.77 546.205 0 0 0 0 0 0 0 0 0 0 0 0 0 0 0 0 -389.492 0 -2132.4 0 0 0 0 0 0 0 0 0 
0 0 0 0 0 0 0 0 0 0 0 0 0.06 0 0 2259.97 0 0 0 0 0 0 0 0 0 0 0 0 0 0 0 1874.83 0 0 0 0 0 0 0 0 0 0 0 0 0 1351.28 0 0 0 0 0 0 0 0 0 0 0 0 
0 0 0 0 0 0 0 0 0 0 0 0 0 0.02 0 0 0 0 0 0 0 0 1532.11 0 0 0 0 0 0 0 0 2317.04 0 0 0 0 0 0 0 0 0 0 0 0 0 0 0 0 0 0 861.003 0 0 0 0 0 0 0 
0 0 0 0 1996.29 0 0 1129.57 0 0 -1089.28 0 0 0 0.02 0 0 0 0 -1512.57 0 0 0 0 1767.71 0 0 0 0 0 0 0 0 -805.918 0 0 1186.79 0 0 0 0 0 0 1500.98 0 0 -66.6066 0 0 0 -42.1918 937.91 0 0 0 0 0 0 
0 0 0 0 0 -2391.2 0 0 0 0 0 0 1094.62 0 0 0.04 0 0 0 0 0 0 0 0 2323.3 1797.31 0 0 -699.408 0 0 -2372.74 0 0 0 0 0 0 0 0 0 0 -194.174 0 -355.312 0 835.673 0 0 0 0 0 0 0 0 0 0 0 
0 0 0 0 0 0 0 0 0 0 0 0 0 0 0 0 0.07 0 0 0 0 0 0 0 0 0 0 -119.098 2342.83 -1512.27 0 0 0 0 0 0 0 1538.67 0 0 0 0 0 0 0 1292.69 0 0 0 0 0 0 0 0 0 0 0 0 
0 0 0 0 0 0 0 0 0 0 0 0 0 0 0 0 0 0.09 0 0 2459.41 0 67.3696 0 0 0 0 0 -88.7326 0 0 0 0 0 0 0 0 0 0 -354.396 0 0 0 0 0 894.116 0 0 0 0 1269.49 0 0 0 0 0 0 0 
0 1827.07 0 -141.987 0 0 0 2276.3 507.599 -437.864 0 -449.614 0 0 0 0 0 0 0.05 0 0 0 0 1995.68 0 0 0 0 0 0 0 0 0 0 0 0 0 0 0 0 0 -1408.96 -1611.76 0 0 0 0 0 0 2098.38 0 0 0 0 0 0 0 0 
0 0 0 0 0 0 0 0 0 0 0 -602.969 0 0 2276.76 0 0 0 0 0.08 0 0 0 0 0 0 0 0 0 -1840.65 1807.84 0 0 0 0 0 0 0 0 0 -146.107 0 1504.94 0 0 0 0 0 0 0 0 0 1655.25 0 0 0 0 0 
0 0 0 0 0 0 0 -1181.75 0 0 0 0 0 0 0 0 0 2059.92 0 0 0.09 0 1311.46 0 159.993 0 -2313.23 0 0 0 0 0 0 0 0 0 0 0 0 0 0 0 0 0 0 0 0 0 0 0 0 0 0 0 0 0 0 969.039 
0 0 0 0 0 -923.109 0 0 827.586 0 0 0 0 0 0 0 0 0 0 0 0 0.01 0 0 0 0 0 0 0 1517.91 0 0 680.181 0 0 0 0 0 0 0 0 1572.24 0 -1512.12 0 1982.86 0 0 1319.09 0 0 0 0 0 0 0 0 0 
1420.71 0 202.872 0 0 0 0 0 0 0 0 0 0 1779.76 0 0 0 -1123.31 0 0 312.433 0 0.02 1595.43 0 678.35 0 0 0 0 0 -1917.25 0 0 -1936.78 0 0 0 693.152 0 58.5192 0 0 0 2286.37 0 0 0 0 0 0 528.504 -434.049 0 0 0 0 0 
0 0 0 0 0 0 0 -234.916 0 0 0 0 0 0 0 0 0 0 1233.48 0 0 0 2080.07 0.06 0 0 0 0 0 0 -1571.32 0 0 0 2099.14 0 2463.68 0 0 0 0 0 0 0 0 1698.13 -2091.36 0 2122.18 0 0 0 0 0 0 0 0 0 
0 0 0 0 0 0 0 0 0 -1989.12 0 -113.453 0 0 -184.561 454.344 0 0 0 0 -269.555 0 0 0 0.05 1297.57 0 0 2024.06 0 0 0 0 0 0 0 0 0 0 0 689.184 0 0 0 0 0 0 0 0 0 1294.21 0 0 0 0 0 0 0 
0 2358.09 0 0 0 0 0 0 0 0 735.267 0 0 0 0 1005.51 0 0 0 0 0 0 -402.463 0 -1801.43 0.01 0 0 0 0 0 0 0 0 0 0 0 0 0 0 0 0 0 0 0 0 0 0 0 0 0 0 0 0 0 0 0 0 
0 0 -402.463 2430.72 0 0 0 1913.28 2112.72 0 0 0 0 0 0 0 0 0 0 0 1330.23 0 0 0 0 0 0.02 0 0 0 0 0 0 0 0 0 0 414.212 0 0 550.783 0 0 0 0 0 2191.46 0 0 0 0 0 0 0 0 0 0 0 
0 0 0 0 0 0 0 0 0 0 0 0 0 0 0 0 1285.06 0 0 0 0 0 0 0 0 0 0 0.07 0 0 0 0 0 0 0 0 0 0 0 0 0 0 -1231.04 0 0 0 0 0 0 0 0 0 0 0 0 0 0 0 
0 0 0 0 0 0 -2485.66 0 0 0 0 1728.03 0 0 0 -977.432 187.307 2352.75 0 0 0 0 0 0 1745.28 0 0 0 0.08 0 0 0 0 0 0 0 0 0 0 0 0 0 0 0 0 0 1775.03 0 0 0 0 0 0 0 0 0 0 0 
0 0 0 0 0 0 0 1544.16 1575.29 0 0 845.744 0 0 0 0 -1551.33 0 0 912.885 0 -2117.91 0 0 0 0 0 0 0 0.06 0 0 0 0 -988.266 0 0 0 1099.05 -368.587 0 -15.7933 0 0 2162.16 0 0 0 0 0 0 -669.5 0 0 0 0 0 0 
0 0 0 0 0 0 0 0 0 0 0 0 0 0 0 0 0 0 0 -1145.44 0 0 0 -330.287 0 0 0 0 0 0 0.02 0 0 291.223 0 0 0 0 0 1354.03 1198.84 0 0 0 0 0 0 0 0 0 0 0 0 0 2490.23 0 0 0 
0 0 0 0 0 0 0 0 0 0 0 0 -142.14 1744.82 0 102.618 0 0 0 0 0 0 973.464 0 0 0 0 0 0 0 0 0.05 0 0 0 0 0 0 0 -1099.05 0 0 0 0 0 1637.24 0 -1735.97 0 0 0 0 0 0 0 0 0 0 
0 0 0 0 0 0 0 0 0 776.925 0 0 0 0 0 0 0 0 0 0 0 820.872 0 0 0 0 0 0 0 0 0 0 0 0 0 0 0 0 0 0 0 0 0 0 0 1868.42 0 0 0 0 0 0 0 0 0 0 0 0 
0 0 0 0 2197.1 0 0 0 0 0 0 0 0 0 -35.4778 0 0 0 0 0 0 0 0 0 0 0 0 0 0 0 1433.38 0 0 0.02 0 0 0 0 0 0 0 0 0 0 0 0 0 0 0 0 0 1214.26 -496.612 0 0 0 0 0 
0 0 744.88 -1624.58 2155.29 0 0 0 0 0 0 0 0 0 0 0 0 0 0 0 0 0 577.944 1775.64 0 0 0 0 0 1452.6 0 0 0 0 0.04 0 0 0 0 0 0 0 0 0 0 0 0 0 0 0 0 -240.41 -2300.26 0 0 0 0 0 
0 0 0 0 0 0 0 0 0 0 0 0 0 0 0 0 0 0 0 0 0 0 0 0 0 0 0 0 0 0 0 0 0 0 0 0.04 0 0 0 0 0 0 0 0 371.944 323.725 0 0 0 0 1019.09 0 0 0 0 0 0 0 
0 0 0 0 0 0 0 0 2097.77 0 0 0 0 0 -2.82296 0 0 0 0 0 0 0 0 -1244.77 0 0 0 0 0 0 0 0 0 0 0 0 0.06 0 0 0 0 0 0 1256.22 0 0 0 0 0 0 0 0 0 0 0 0 0 0 
0 0 0 0 0 0 0 0 0 1325.65 0 0 0 0 0 0 -489.135 0 0 0 0 0 0 0 0 0 459.838 0 0 0 0 0 0 0 0 0 0 0.04 0 0 0 0 0 0 0 0 0 0 0 2236.17 0 0 0 0 0 0 0 0 
2465.82 0 0 0 0 0 0 0 0 0 0 0 0 0 0 0 0 0 0 0 0 0 1163.14 0 0 0 0 0 0 567.873 0 0 0 0 0 0 0 0 0.02 732.826 0 0 0 0 0 0 2215.41 0 -2066.94 0 -1533.17 0 0 0 0 0 0 0 
0 0 0 2366.94 0 0 1841.56 0 142.75 -2271.42 0 0 0 0 0 0 0 2293.54 0 0 0 0 0 0 0 0 0 0 0 -902.814 -1520.81 2001.33 0 0 0 0 0 0 1185.87 0.07 0 0 0 0 0 0 0 0 0 2298.88 0 0 0 0 0 0 0 0 
0 0 0 0 1243.4 385.067 0 0 0 0 680.944 0 0 0 0 0 0 0 0 781.655 0 0 801.492 0 -2217.09 0 852 0 0 0 -318.995 0 0 0 0 0 0 0 0 0 0 0 0 -399.869 0 208.06 0 0 0 0 0 0 -459.685 0 0 0 0 0 
-1419.95 0 0 0 0 0 0 2111.35 0 0 0 0 0 0 0 0 0 0 2027.42 0 0 -712.226 0 0 0 0 0 0 0 172.353 0 0 0 0 0 0 0 0 0 0 0 0.07 0 0 0 0 0 -30.9 0 0 0 0 0 0 0 0 0 0 
0 0 0 0 0 0 0 0 0 -298.09 0 0 0 0 0 1816.08 0 0 1423 203.024 0 0 0 0 0 0 0 974.075 0 0 0 0 0 0 0 0 0 0 0 0 0 0 0.03 0 0 0 0 0 0 0 0 0 0 2424.16 0 0 0 0 
0 0 76.8303 0 0 0 0 0 0 0 0 0 0 0 2497.1 0 0 0 0 0 0 -1468.63 0 0 0 0 0 0 0 0 0 0 0 0 0 0 1841.41 0 0 0 -1112.93 0 0 0.02 0 436.644 0 0 0 0 0 0 0 0 0 0 0 0 
0 0 0 -666.448 0 0 0 0 0 0 0 0 0 0 0 1906.72 0 0 0 0 0 0 -859.935 0 0 0 0 0 0 59.5874 0 0 0 0 0 1262.32 0 0 0 0 0 0 0 0 0.08 0 0 0 0 0 0 0 0 0 0 0 0 0 
2022.69 0 0 0 0 0 0 0 0 0 0 0 -2420.19 0 0 0 2408.29 1086.84 0 0 0 453.887 0 -327.235 0 0 0 0 0 0 0 1638.16 -1141.32 0 0 44.6333 0 0 0 0 -2473.6 0 0 823.923 0 0.03 0 2272.33 1765.27 0 -2331.23 0 0 0 0 0 0 0 
0 0 0 0 0 0 0 1182.97 0 0 0 1247.67 0 0 2056.26 -1214.41 0 0 0 0 0 0 0 -2041.61 0 0 1221.12 0 -1133.38 0 0 0 0 0 0 0 0 0 -1587.04 0 0 0 0 0 0 0 0.03 0 0 0 0 0 0 0 0 0 0 0 
0 -1517.15 0 1632.82 0 0 0 0 0 0 0 0 0 0 0 0 0 0 0 0 0 0 0 0 0 0 0 0 0 0 0 101.093 0 0 0 0 0 0 0 0 0 1248.89 0 0 0 -1659.83 0 0.09 0 0 0 0 0 0 0 0 0 0 
0 0 0 0 986.74 863.445 0 0 0 0 1648.23 2369.99 0 0 0 0 0 0 0 0 0 1289.64 0 -2332.91 0 0 0 0 0 0 0 0 0 0 0 0 0 0 1916.79 0 0 0 0 0 0 5.72222 0 0 0.06 0 0 646.611 -2145.22 0 0 0 0 0 
0 0 0 0 0 2007.28 0 0 -474.792 0 0 0 0 0 0 0 0 0 2268.21 0 0 0 0 0 0 0 0 0 0 0 0 0 0 0 0 0 0 -297.479 0 36.2407 0 0 0 0 0 0 0 0 0 0.08 1950.51 0 0 0 0 0 0 0 
0 0 1985.15 0 0 0 0 0 0 0 0 0 0 -1200.98 36.5459 0 0 826.518 0 0 0 0 0 0 58.977 0 0 0 0 0 0 0 0 0 0 1603.21 0 0 2438.2 0 0 0 0 0 0 1938.76 0 0 0 -14.1148 0.06 0 0 0 0 0 0 0 
1665.01 2300.1 0 0 0 0 0 0 0 -344.02 1671.42 0 0 0 -1701.64 0 0 0 0 0 0 0 650.883 0 0 0 0 0 0 868.328 0 0 0 -527.894 -2325.59 0 0 0 0 0 0 0 0 0 0 0 0 0 -703.375 0 0 0.09 0 0 0 0 0 0 
0 0 0 0 0 1898.94 1738.56 0 0 0 0 0 0 0 0 0 0 0 0 -225.303 0 0 337.611 0 0 0 0 0 0 0 0 0 0 -1551.94 245.75 0 0 0 0 0 -1757.03 0 0 0 0 0 0 0 2127.67 0 0 0 0.05 0 0 0 0 0 
0 0 0 0 0 0 0 0 0 0 0 0 0 0 0 0 0 0 0 0 0 0 0 0 0 0 0 0 0 0 0 0 0 0 0 0 0 0 0 0 0 0 2475.43 0 0 0 0 0 0 0 0 0 0 0.05 0 0 0 0 
0 0 0 0 0 0 0 0 0 0 0 0 0 0 0 0 0 0 0 0 0 0 0 0 0 0 0 0 0 0 2275.69 0 0 0 0 0 0 0 0 0 0 0 0 0 0 0 0 0 0 0 0 0 0 0 0.03 0 0 0 
0 0 0 0 0 0 0 0 0 0 2095.02 0 0 0 0 0 0 0 0 0 0 0 0 0 0 0 0 0 0 0 0 0 0 0 0 0 0 0 0 0 0 0 0 0 0 0 0 0 0 0 0 0 0 0 0 0.09 0 0 
0 0 0 0 0 0 0 0 2470.24 -1342.43 558.565 0 0 0 0 0 0 0 0 0 0 0 0 0 0 0 0 0 0 0 0 0 0 0 0 0 0 0 0 0 0 0 0 0 0 0 0 0 0 0 0 0 0 0 0 0 0.06 0 
0 0 0 0 0 0 0 0 0 0 0 0 0 0 0 0 0 0 0 0 1234.7 0 0 0 0 0 0 0 0 0 0 0 0 0 0 0 0 0 0 0 0 0 0 0 0 0 0 0 0 0 0 0 0 0 0 0 0 0 
