*Vertices 52
*Matrix 
0.08 0 0 0 0 0 -526.063 0 -8.77407 0 168.386 1441.92 0 0 0 0 0 0 0 1218.99 0 0 0 1278.5 0 0 0 0 0 1467.71 0 1981.49 684.759 1609.62 -1470 0 -2312.31 0 0 0 0 0 0 0 0 0 0 0 0 0 0 0 
0 0.05 0 755.104 0 0 0 2047.87 0 0 -1390.19 0 0 0 0 0 0 827.281 608.31 2260.73 1849.65 0 0 -476.165 0 1601.08 0 -314.722 0 -2363.28 0 2261.5 0 0 191.885 -1580.02 0 0 0 0 0 0 0 0 0 0 0 0 0 0 1482.21 0 
0 0 0.06 0 0 0 0 0 0 -1302.3 1015.12 0 -1536.38 102.161 0 0 2129.96 0 2254.48 1598.18 1160.54 0 0 0 0 0 0 0 0 0 0 0 0 0 0 0 0 -2406.31 0 0 0 -344.783 0 0 0 0 -85.8333 0 2092.88 0 0 0 
0 872.753 0 0 0 1880.02 0 0 0 0 0 0 -549.409 0 0 0 0 -788.98 0 0 0 1828.75 0 0 0 0 0 0 0 0 1777.02 1629.31 0 0 0 2108.45 0 0 0 0 0 0 0 0 0 0 0 0 0 0 0 0 
0 0 0 0 0.08 0 0 2205.34 0 0 1848.43 0 0 0 0 0 0 0 -2302.85 1397.06 -1239.43 1882.61 -434.965 1886.27 0 0 0 0 0 -1860.03 0 0 0 -2194.05 0 0 0 1211.36 0 0 0 0 -1245.08 1636.48 0 0 0 0 0 0 0 0 
0 0 0 -325.556 0 0.04 0 1289.33 0 0 2471.01 64.0126 0 1898.94 0 0 0 0 -468.535 -751.442 0 0 0 0 0 0 0 0 0 0 0 -1002.3 0 0 0 0 0 0 0 1057.7 0 0 0 0 0 0 0 0 0 0 0 0 
1321.38 0 0 0 0 0 0.08 0 0 0 0 1706.21 0 1083.79 0 0 0 0 0 0 -344.02 0 2465.82 0 0 2103.56 -1599.86 -2346.64 0 0 0 0 0 1852.55 0 0 0 0 0 0 0 0 0 0 483.032 1403.01 0 0 0 1856.36 0 0 
0 2115.31 0 0 2375.03 1644.41 0 0.04 0 0 0 0 0 0 0 0 -701.086 -1761.76 99.2615 0 0 0 0 0 0 0 0 -1710.49 0 0 0 0 0 0 0 0 0 0 0 1458.25 750.221 2254.94 0 0 0 0 866.955 0 0 1326.87 -1762.22 2065.42 
2313.68 0 0 0 0 0 0 0 0.03 -1337.55 2157.73 0 0 0 0 1207.24 0 0 1228.45 0 0 -2324.52 795.236 0 0 0 31.2052 700.476 0 0 0 0 0 1955.09 0 0 0 0 0 1971.57 0 0 0 -1498.69 0 0 0 0 0 0 0 0 
0 0 575.808 0 0 0 0 0 990.402 0.03 0 0 0 1471.68 1641.36 0 1454.28 0 0 0 1787.55 0 0 0 0 -613.346 0 0 0 0 0 0 2290.19 2328.64 1914.35 0 0 0 2085.71 -945.997 0 0 2383.11 0 0 0 0 -768.227 0 0 0 0 
-1132.62 -504.089 -254.753 0 145.955 1289.18 0 0 46.9222 0 0 0 -20.2185 0 0 0 0 0 0 0 0 0 0 0 0 0 1386.07 0 -149.464 1829.97 -373.623 0 0 0 -300.684 -1042.74 0 0 0 0 0 842.54 -1091.57 575.655 0 0 0 0 0 0 2405.55 0 
867.87 0 0 0 0 983.535 -2214.19 0 0 0 0 0.09 0 0 0 1155.66 1971.72 0 1437.96 0 0 0 -1996.29 0 80.1874 0 0 1416.59 0 0 0 0 0 0 0 -635.777 2159.72 0 0 -1978.59 1869.03 0 2084.03 -1.60222 0 0 0 0 0 0 0 0 
0 0 -2064.96 969.955 0 0 0 0 0 0 736.335 0 0 0 0 0 0 0 0 0 1545.84 0 0 0 0 0 0 0 0 1327.33 2280.57 0 0 1309.32 0 -2351.68 1189.54 0 0 0 923.109 0 1713.23 0 0 0 0 0 0 0 0 0 
0 0 -1708.96 0 0 1096.91 -1494.87 0 0 1781.75 0 0 0 0.08 0 -1813.03 0 863.903 0 0 0 2249.29 0 0 -1621.83 0 0 0 1859.11 0 167.776 1962.42 63.7074 0 1166.04 0 0 -1500.67 0 0 0 95.294 -1833.48 0 0 0 0 0 0 0 0 0 
0 0 0 0 0 0 0 0 0 -1941.97 0 0 0 0 0 0 0 -2364.19 0 -1811.66 0 1123.92 0 1606.57 2420.5 2023.91 0 788.675 0 0 0 0 0 0 0 0 -2489.32 0 0 0 1869.33 0 0 1713.69 0 0 0 0 0 0 0 69.3533 
0 0 0 0 0 0 0 0 -465.026 0 0 1104.69 0 -42.3444 0 0.02 0 0 0 0 -203.177 1546.45 0 0 0 0 0 0 0 0 0 0 -979.263 1471.53 0 1435.97 0 0 0 -2420.35 -1580.48 777.841 0 0 0 0 0 0 0 0 0 1665.32 
0 0 2215.57 0 0 0 0 414.518 0 2471.62 0 276.421 0 0 0 0 0.04 1600.47 0 1705.15 0 0 0 0 780.892 0 1839.12 0 0 1658.6 0 0 0 1130.94 2215.72 0 -597.934 0 0 0 0 0 -2444 0 0 0 0 0 0 0 0 0 
0 384.152 0 1075.55 0 0 0 -1031.75 0 0 0 0 0 2327.57 -592.593 0 2403.1 0.04 0 0 0 -36.2407 2043.44 0 0 -2135.61 0 0 0 1330.84 0 0 0 -369.961 0 0 0 0 0 0 0 -1582.31 161.214 0 0 0 0 0 -1115.22 0 0 0 
0 -772.195 2455.44 0 1976.15 535.371 0 1337.09 2148.88 0 0 2442.32 0 0 0 0 0 0 0.02 0 0 -337.458 0 1248.59 0 -437.407 0 0 0 0 33.7992 0 0 0 0 0 0 0 0 0 -35.9355 0 0 2100.21 1293.76 0 0 0 0 0 0 0 
-1582.61 1792.73 1755.96 0 -155.568 556.734 0 0 0 0 0 0 0 0 -187.765 0 102.008 0 0 0.06 0 0 0 2395.63 0 0 0 -853.526 583.59 0 0 0 0 0 0 0 0 -231.712 0 2342.22 -962.477 0 0 0 0 0 0 0 0 0 0 0 
0 1594.52 -393.307 0 618.686 0 1899.7 0 0 1793.95 0 0 -128.407 0 0 -1760.38 0 0 0 0 0.04 -1164.05 0 -1262.47 0 0 0 0 -789.285 0 0 0 0 0 0 0 0 1834.54 0 0 1653.26 -1378.44 0 -85.2229 0 549.562 0 0 0 -1039.38 0 0 
0 0 0 1691.56 -237.51 0 0 0 1808.15 0 0 0 0 1828.14 1068.68 1986.07 0 -479.217 -2077.93 0 -1014.36 0.04 0 -974.685 0 0 -69.6585 0 -504.547 0 1687.44 0 0 0 139.393 0 0 -2038.1 0 0 -1719.95 1876.05 0 0 0 0 0 0 0 0 0 0 
0 0 0 0 -181.967 0 494.324 0 546.358 0 0 905.56 0 0 0 0 0 1318.93 0 0 0 0 0.06 2466.28 0 0 524.384 0 0 0 0 0 0 0 2330.01 0 0 0 -2396.39 -702.002 1000.63 0 0 0 0 0 0 0 0 0 0 0 
408.261 1962.26 0 0 257.195 0 0 0 0 0 0 0 0 0 536.286 0 0 0 1942.73 -413.297 -2347.87 -619.907 1272.39 0.09 -274.743 0 0 -460.753 -2217.25 0 0 0 -329.371 2229.3 0 0 1729.26 0 0 0 865.123 2368.62 0 0 0 0 0 0 0 0 0 0 
0 0 0 0 0 0 0 0 0 0 0 -1447.11 0 1251.49 2209.01 0 -452.513 0 0 0 0 0 0 -233.238 0.01 0 688.726 0 0 0 0 0 1242.03 0 -2312.46 1976.15 0 853.526 0 0 1047.01 0 1870.71 2007.58 0 0 0 0 0 0 0 0 
0 -1880.17 0 0 0 0 2157.73 0 0 466.094 0 0 0 0 1103.63 0 0 1491.06 1459.62 0 0 0 0 0 0 0.03 0 0 1450.01 0 0 0 0 0 914.258 0 0 0 -136.036 1402.55 0 0 0 0 0 0 -936.079 -386.288 0 0 0 0 
0 0 0 0 0 0 -2100.82 0 928.755 0 884.96 0 0 0 0 0 -819.041 0 0 0 0 -2023.76 726.569 0 84.46 0 0.08 1661.35 0 0 0 780.282 0 2289.88 -1903.52 381.405 0 0 0 -382.931 0 2380.37 -668.584 0 0 0 641.575 0 0 0 0 0 
0 2115.77 0 0 0 0 2288.81 -1241.87 347.072 0 0 660.039 0 0 1347.32 0 0 0 0 -2191.76 0 0 0 -2199.09 0 0 2275.38 0.02 0 -345.851 0 0 0 0 0 0 0 0 0 0 0 0 0 0 0 0 0 0 1592.53 0 0 0 
0 0 0 0 0 0 0 0 0 0 -2474.21 0 0 -681.86 0 0 0 0 0 1305.05 1920 722.755 0 1977.52 0 1706.06 0 0 0.07 0 0 0 1720.56 0 0 417.57 0 2032.61 0 0 1956.01 0 0 -118.946 0 0 0 0 0 0 0 0 
-2337.64 1240.96 0 0 -1847.67 0 0 0 0 0 1870.71 0 -1931.75 0 0 0 1696.45 1345.79 0 0 0 0 0 0 0 0 0 2316.89 0 0.07 -1054.49 0 0 0 0 0 0 0 0 0 0 0 0 0 0 0 0 -787.912 1626.87 -738.014 0 828.349 
0 0 0 244.987 0 0 0 0 0 0 2309.26 0 190.97 -182.119 0 0 0 0 -470.824 0 0 1957.38 0 0 0 0 0 0 0 -749.916 0.09 0 0 0 0 0 0 0 0 0 0 -2207.48 0 0 0 0 0 0 2106.31 0 0 0 
-699.561 2179.25 0 -2460.63 0 508.667 0 0 0 0 0 0 0 2001.33 0 0 0 0 0 0 0 0 0 0 0 0 -925.55 0 0 0 0 0.08 0 0 0 0 0 0 0 -766.549 0 -490.204 0 1745.73 0 0 0 0 1797.16 0 -890.606 0 
2211.45 0 0 0 0 0 0 0 0 -1438.72 0 0 0 330.592 0 503.021 0 0 0 0 0 0 0 2469.33 -1381.04 0 0 0 -615.329 0 0 0 0.06 0 196.615 1724.68 0 0 0 0 0 0 0 0 0 0 0 -1310.08 0 0 0 0 
-1130.48 0 0 0 -1077.84 0 -663.549 0 89.4955 -2.06 0 0 -156.941 0 0 -774.331 1348.99 116.962 0 0 0 0 0 514.466 0 0 582.369 0 0 0 0 0 0 0.08 0 0 2141.56 2073.35 0 0 0 0 0 0 0 0 0 0 -1263.85 0 0 0 
-1810.43 -1304.9 0 0 0 0 0 0 0 2445.22 106.433 0 0 1216.39 0 0 -958.51 0 0 0 0 -368.435 2228.39 0 2479.09 2066.64 1397.82 0 0 0 0 0 2453.46 0 0.09 0 0 0 30.4422 0 0 -926.008 0 0 0 0 0 0 0 0 0 0 
0 1935.71 0 1017.41 0 0 0 0 0 0 -1296.2 1137.96 1612.37 0 0 -2464.14 0 0 0 0 0 0 0 0 1557.59 0 -696.356 0 2056.72 0 0 0 -1498.99 0 0 0.09 2192.98 0 0 0 0 1117.36 0 2211.75 0 0 441.374 0 0 0 0 0 
1230.58 0 0 0 0 0 0 0 0 0 0 934.095 1259.73 0 -1777.63 0 1595.28 0 0 0 0 0 0 2209.01 0 0 0 0 0 0 0 0 0 891.064 0 656.224 0.05 0 0 -317.164 0 0 0 0 0 0 0 0 0 0 0 0 
0 0 2022.69 0 -138.63 0 0 0 0 0 0 0 0 1566.9 0 0 0 0 0 -2303.92 -413.449 1300.16 0 0 802.255 0 0 0 1915.27 0 0 0 0 556.581 0 0 0 0.06 1931.14 953.017 0 0 0 1527.38 0 0 0 0 281.457 0 0 -2371.06 
0 0 0 0 0 0 0 0 0 1765.72 0 0 0 0 0 0 0 0 0 0 0 0 -221.335 0 0 1637.09 0 0 0 0 0 0 0 0 869.243 0 0 -336.848 0.03 0 -1462.22 -551.241 0 1907.18 0 0 0 0 0 0 0 -1001.08 
0 0 0 0 0 608.31 0 -631.809 1824.02 2266.08 0 -654.088 0 0 0 1114.76 0 0 0 790.353 0 0 -1732.76 0 0 1996.29 -607.852 0 0 0 0 -1055.86 0 0 0 0 -1074.79 -126.728 0 0.05 0 0 0 0 0 0 0 0 0 -1249.2 -130.848 0 
0 0 0 0 0 0 0 746.712 0 0 0 175.1 113.758 0 1098.9 -917.92 0 0 341.426 -1453.52 -2296.14 -1929.3 989.792 1861.71 2335.66 0 0 0 1422.39 0 0 0 0 0 0 0 0 0 2080.22 0 0.08 0 -2269.89 0 0 0 -861.614 0 0 0 0 0 
0 0 -886.639 0 0 0 0 2339.01 0 0 115.284 0 0 -210.959 0 1704.69 0 1455.35 0 0 1794.56 -1821.73 0 -1739.78 0 0 1813.64 0 0 0 390.103 660.649 0 0 -1941.66 2338.71 0 0 -1933.73 0 0 0.09 0 -925.245 0 716.041 0 0 0 0 0 0 
0 0 0 0 -118.946 0 0 0 0 298.395 -1255.3 -752.205 2149.95 94.0733 0 0 1638.46 -1186.03 0 0 0 0 0 0 779.366 0 1801.74 0 0 0 0 0 0 0 0 0 0 0 0 0 -1362.12 0 0.06 0 -614.719 232.475 0 0 0 0 0 0 
0 0 0 0 2029.56 0 0 0 1121.02 0 -999.557 698.187 0 0 1573.76 0 0 0 2368.47 0 -412.534 0 0 0 -1616.03 0 0 0 -1305.96 0 0 1096.61 0 0 0 2188.56 0 224.998 -865.734 0 0 -380.337 0 0.04 -1224.48 0 0 0 0 0 0 0 
0 0 0 0 0 0 -2117.3 0 0 0 0 0 0 0 0 0 0 0 2247.15 0 0 0 0 0 0 0 0 0 0 0 0 0 0 0 0 0 0 0 0 0 0 0 2450.41 54.3992 0.04 0 0 0 0 0 0 0 
0 0 0 0 0 0 1561.86 0 0 0 0 0 0 0 0 0 0 0 0 0 -967.818 0 0 0 0 0 0 0 0 0 0 0 0 0 0 0 0 0 0 0 0 513.245 2182.15 0 0 0.06 0 0 0 0 0 0 
0 0 1191.98 0 0 0 0 -666.143 0 0 0 0 0 0 0 0 0 0 0 0 0 0 0 0 0 -393.612 -1139.18 0 0 0 0 0 0 0 0 993.606 0 0 0 0 2204.12 0 0 0 0 0 0.07 -831.553 0 0 0 0 
0 0 0 0 0 0 0 0 0 -1585.51 0 0 0 0 0 0 0 0 0 0 0 0 0 0 0 1433.07 0 0 0 1959.82 0 0 -500.58 0 0 0 0 0 0 0 0 0 0 0 0 0 1736.73 0.09 0 -815.226 0 0 
0 0 1661.96 0 0 0 0 0 0 0 0 0 0 0 0 0 0 -293.512 0 0 0 0 0 0 0 0 0 652.409 0 -1052.96 674.23 -659.276 0 1568.42 0 0 0 2168.11 0 0 0 0 0 0 0 0 0 0 0.01 0 0 -1072.95 
0 0 0 0 0 0 1559.88 -39.4452 0 0 0 0 0 0 0 0 0 0 0 0 2093.34 0 0 0 0 0 0 0 0 -597.934 0 0 0 0 0 0 0 0 0 2091.51 0 0 0 0 0 0 0 2294.15 0 0.02 0 1760.99 
0 715.125 0 0 0 0 0 703.681 0 0 2356.11 0 0 0 0 0 0 0 0 0 0 0 0 0 0 0 0 0 0 0 0 2038.71 0 0 0 0 0 0 0 -771.889 0 0 0 0 0 0 0 0 0 0 0.07 0 
0 0 0 0 0 0 0 -1306.27 0 0 0 0 0 0 1814.55 87.2066 0 0 0 0 0 0 0 0 0 0 0 0 0 732.063 0 0 0 0 0 0 0 1475.19 -1459.93 0 0 0 0 0 0 0 0 0 216.453 798.135 0 0.08 
