*Vertices 68
*Matrix 
0.08 240.562 0 0 0 0 0 0 0 0 0 0 -1134.75 0 -1325.04 2001.02 0 2279.5 0 -2219.08 0 0 0 980.941 0 0 0 0 0 1871.93 0 0 0 1322.75 0 0 -802.103 0 1339.38 1154.44 0 0 0 0 0 0 0 1447.42 0 0 0 0 0 0 -1343.65 0 0 0 0 0 0 -1287.19 0 0 0 0 0 0 
325.556 0.07 0 0 0 0 0 0 -2104.18 0 0 0 0 0 0 0 0 0 2057.48 0 2360.68 0 0 0 -2482.6 0 0 0 -35.3252 1989.73 0 566.805 0 -1541.41 2209.62 -2288.96 1132.16 -1956.62 -857.952 0 879.467 0 0 0 0 0 0 2272.94 0 0 0 -103.076 0 0 0 -2498.32 0 0 0 0 0 0 2345.73 0 0 2163.23 0 -2069.38 
0 0 0.06 0 0 0 0 0 2022.08 0 0 126.118 226.218 0 0 0 0 0 1650.21 2127.98 0 0 0 1815.47 0 0 -1125.29 511.567 -334.712 0 0 1426.51 0 -111.316 0 0 0 0 0 -525.452 0 0 313.196 0 0 0 0 0 0 0 0 0 0 0 0 976.516 0 0 0 702.46 -371.334 2077.62 0 0 23.5755 0 0 0 
0 0 0 0.03 1258.66 0 1754.59 0 0 471.435 178.152 0 0 -809.427 1483.89 382.168 -1566.29 -1630.83 0 0 -395.901 0 0 0 -348.292 0 1681.49 0 0 0 0 0 -2172.23 0 917.768 0 0 0 -1111.1 2032.46 1868.42 0 824.076 0 0 0 0 0 0 0 0 0 0 0 0 0 0 0 0 0 0 0 0 0 0 0 0 0 
0 0 0 312.128 0 0 0 0 0 -241.325 0 0 0 762.581 0 -1938.61 0 0 0 0 0 0 1634.8 0 0 848.949 0 0 -1101.03 0 0 0 -152.821 0 0 0 0 0 0 1471.98 0 2407.99 0 0 0 0 645.39 0 2242.88 0 0 0 0 0 0 0 458.77 0 0 0 0 0 0 0 0 0 0 0 
0 0 0 0 0 0.02 746.864 0 792.489 0 -1250.72 -1128.65 0 0 0 315.638 -390.561 0 -479.369 1588.11 0 0 2445.52 0 0 0 0 -641.575 0 0 0 -6.18 0 0 0 0 0 0 0 0 2106.46 0 380.337 0 0 0 0 0 0 0 0 0 -722.907 0 0 0 0 0 0 -820.872 0 0 0 0 0 0 0 0 
0 0 0 927.076 0 81.2555 0.09 0 0 0 2488.4 0 0 0 0 -456.786 0 1685.31 1173.82 0 0 0 0 2120.04 0 0 0 0 284.204 -2241.36 0 0 -299.921 0 0 0 0 -1504.18 2302.55 0 0 0 0 0 0 0 0 0 0 0 0 0 0 0 0 0 0 0 0 -1547.21 0 0 0 0 0 0 0 0 
0 0 0 0 0 0 0 0.04 1832.26 0 -469.604 0 1969.74 1473.05 -429.472 0 0 507.141 0 0 0 1602.45 0 0 0 490.356 0 0 0 0 0 0 0 0 0 0 169.759 1150.93 1399.66 0 0 -948.439 0 -784.707 0 0 0 0 0 0 0 0 2196.04 0 0 0 0 996.963 0 0 0 0 0 0 0 -661.26 0 0 
0 1907.48 -1275.75 0 0 -727.027 0 -2062.36 0 0 0 -1221.27 1771.22 0 0 0 0 1693.85 0 0 0 0 0 0 374.386 0 0 -1295.74 0 0 0 0 1724.07 0 2135.76 0 0 2227.93 0 -1853.16 0 0 0 0 0 -1703.47 0 0 0 0 0 0 0 0 0 0 1915.72 0 630.894 0 0 0 0 0 0 0 0 0 
0 0 0 472.961 2054.28 0 0 0 0 0.05 0 -1973.1 0 0 1863.84 -814.615 1627.02 0 0 0 0 1510.74 -2113.03 0 0 0 0 0 0 0 0 0 -1008.71 1435.82 0 0 2082.51 2249.9 -1367.46 0 0 0 0 472.961 0 0 0 2098.53 0 0 0 373.165 0 0 0 0 0 0 -1914.96 0 0 0 0 50.1267 0 0 0 0 
0 0 0 869.091 0 1446.96 797.678 -1099.05 0 0 0.08 0 0 0 0 0 0 0 0 0 1215.48 1322.6 0 0 1036.64 0 0 0 -648.137 1176.41 0 0 0 -1889.93 0 0 -261.773 1660.89 0 0 0 473.876 0 0 0 305.719 0 0 -261.01 0 0 0 0 0 0 0 0 0 0 -2028.79 0 0 0 614.414 0 2089.68 61.4185 -333.033 
0 0 1451.69 0 0 2492.98 0 0 1235.77 55.3148 0 0.06 0 0 0 0 0 0 0 0 0 0 0 0 0 0 0 0 0 -1654.33 0 0 0 -746.864 0 28.9163 0 0 1452.6 0 0 2028.34 0 0 0 0 0 0 0 0 0 0 1926.56 0 0 0 0 0 0 0 66.1489 0 0 0 2264.85 0 0 0 
-2375.03 0 1513.49 0 0 0 0 753.273 747.475 0 0 0 0.02 644.627 0 0 0 0 0 -555.055 0 1910.08 0 -1075.4 2105.55 0 -2107.68 1576.82 0 0 0 0 0 0 0 0 0 0 0 147.786 0 1469.24 985.824 0 0 0 0 0 0 0 0 0 184.256 0 0 0 0 0 0 0 0 0 0 0 -2265.31 0 0 0 
0 0 0 -1053.58 1414.15 0 0 -222.251 0 0 0 0 1183.13 0.05 0 -219.504 -726.722 0 0 0 0 0 0 1151.69 0 0 0 0 0 0 0 0 2032 0 0 0 -88.4274 0 -2324.98 0 0 0 2194.97 0 0 0 0 0 0 0 0 0 0 0 -2193.9 0 0 0 0 0 0 0 0 0 0 0 249.718 0 
2224.57 0 0 1534.24 0 0 0 1559.57 0 2077.17 0 0 0 0 0.06 0 0 0 0 0 0 0 0 691.168 1174.73 0 0 0 0 0 0 0 -1693.85 0 0 0 0 0 0 -2334.74 0 0 0 0 0 2030.47 0 0 0 0 0 0 0 2118.06 0 0 0 0 0 0 0 1976.45 0 0 0 0 0 0 
-191.427 0 0 1980.88 -1157.49 -75.1518 765.328 0 0 38.8348 0 0 0 -1932.51 0 0.08 0 0 0 0 0 0 -2221.82 2287.29 0 2111.04 0 316.095 0 475.86 -1178.24 0 0 -1386.07 0 1790.14 0 0 0 0 0 1250.72 -1228.14 548.646 0 0 0 0 0 0 226.981 0 0 0 0 0 0 0 0 0 0 0 0 0 0 0 2026.51 0 
0 0 0 250.328 0 -679.266 0 0 0 -874.432 0 0 0 1483.89 0 0 0.03 -1840.19 1646.86 2056.87 0 1623.81 2461.39 1794.72 0 1839.12 0 0 -850.322 0 0 0 0 0 1987.75 -865.123 0 0 106.281 0 0 -2213.43 -2069.23 0 0 0 748.543 0 0 -1995.68 0 187.46 0 0 0 -348.903 0 -1358.61 629.368 0 0 0 0 0 0 2244.71 0 0 
-2322.38 0 0 1062.12 0 0 2429.2 -264.672 1087.45 0 0 0 0 0 0 0 2055.19 0.04 -569.399 0 0 0 0 0 0 0 0 1341.67 0 0 2096.24 0 0 0 0 932.264 0 2048.63 0 729.926 0 0 0 -967.36 0 0 0 0 0 0 0 303.888 0 170.064 0 0 0 -2238.46 0 0 0 0 0 0 0 0 0 0 
0 374.538 2106.92 0 0 1444.36 2287.74 0 0 0 0 0 0 0 0 0 2423.4 2001.63 0.03 1197.32 0 0 -1744.51 0 0 0 0 1030.53 0 0 0 0 0 0 0 -1458.1 0 2477.87 0 0 0 -98.4985 -2195.12 0 0 0 2469.18 0 358.516 0 0 0 514.008 0 34.7148 0 0 0 0 0 -2420.8 0 0 0 0 0 0 0 
1854.08 0 -772.805 0 0 1173.97 0 0 0 0 0 0 -1101.34 0 0 0 -894.879 0 -818.278 0.04 829.417 1579.41 0 0 -886.792 -1269.65 2045.88 0 0 0 0 0 0 0 0 0 1040.6 0 0 0 0 0 1285.97 834.605 0 0 -1106.52 0 0 0 0 0 -945.235 0 0 0 0 1104.85 2149.8 2081.59 0 0 488.22 0 0 0 0 0 
0 -2122.03 0 2429.35 0 0 0 0 0 0 1882.61 0 0 0 0 0 0 0 0 805.307 0.04 0 -1906.87 0 0 1448.94 0 0 -145.955 0 821.635 -554.75 0 0 0 0 441.374 0 722.755 0 0 0 0 0 0 0 0 0 0 2263.02 0 0 0 0 0 0 0 0 0 0 0 973.312 0 0 0 0 0 0 
0 0 0 0 0 0 0 -372.707 0 715.125 2172.99 0 898.999 0 0 0 -1646.86 0 0 710.7 0 0.05 0 0 0 -1284.14 1827.98 0 0 0 58.6718 1514.86 0 0 0 0 0 0 0 -223.93 -20.3711 1774.12 0 0 0 0 0 0 0 0 0 0 0 0 0 0 0 0 0 0 0 0 -2413.17 0 0 0 0 0 
0 0 0 0 -1733.99 1181.14 0 0 0 1476.71 0 0 0 0 0 692.694 -777.078 0 -1518.07 0 2429.5 0 0.08 0 0 2160.63 0 0 -2292.78 2088.46 985.672 0 1366.54 0 0 645.695 0 0 0 0 0 0 0 0 835.215 0 964.919 0 0 0 950.27 0 0 2247 0 0 0 0 0 0 0 0 0 0 0 0 0 0 
-96.82 0 1785.71 0 0 0 2311.09 0 0 0 0 0 1507.54 -876.11 637.15 -67.5222 2005.75 0 0 0 0 0 0 0.07 0 0 -729.164 -2040.39 1913.43 0 0 0 1497.47 -1252.4 2072.89 -810.953 -1564.91 -1494.42 0 0 0 0 1432.46 0 205.008 0 0 0 0 0 0 0 0 0 0 0 0 0 0 0 0 0 0 2259.21 0 0 0 0 
0 2021.62 0 2286.37 0 0 0 0 2295.83 0 -1732.61 0 -1379.06 0 2149.34 0 0 0 0 2083.73 0 0 0 0 0.01 -1380.43 0 0 557.344 0 2463.84 0 1642.74 1485.11 0 -529.572 0 0 -435.728 -2052.9 0 -1139.03 0 0 0 0 0 0 0 0 0 0 0 -1047.01 -1392.94 863.14 1430.48 0 0 -1608.71 0 0 0 0 0 0 0 0 
0 0 0 0 1012.07 0 0 683.538 0 0 0 0 0 0 0 726.417 -598.849 0 0 103.381 -369.35 2499.54 2282.56 0 382.015 0.04 832.316 0 940.046 0 0 -947.523 -543.153 -1010.24 0 0 0 1447.57 0 0 0 0 0 0 291.375 0 0 -884.503 0 0 0 0 0 0 0 0 0 0 1334.65 0 -1453.06 0 0 0 0 0 0 0 
0 0 -538.575 81.5607 0 0 0 0 0 0 0 0 406.278 0 0 0 0 0 0 134.968 0 -1455.35 0 1074.48 0 1789.83 0.02 0 0 0 -568.636 0 0 0 29.8318 0 0 1081.04 0 505.768 0 0 0 0 935.011 0 0 0 0 0 0 0 0 0 0 0 0 0 0 0 0 0 -1752.75 0 0 0 0 0 
0 0 187.613 0 0 2113.18 0 0 73.4733 0 0 0 -665.99 0 0 1642.28 0 -585.116 2419.13 0 0 0 0 1342.13 0 0 0 0 0 0 0 -2171.01 0 0 0 0 1725.59 1645.63 0 0 0 0 0 -2204.43 1202.2 0 -1271.02 -369.503 0 0 -2370.14 0 0 0 0 0 0 -207.602 0 0 0 0 0 0 0 0 0 0 
0 2493.44 -229.881 0 -782.266 0 814.92 0 0 0 170.217 0 0 0 0 0 2271.57 0 0 0 -2150.56 0 1518.07 2211.29 -2126.15 2191.46 0 0 0.07 1179.62 0 -1818.98 0 0 0 0 0 0 0 1786.78 -1619.08 -39.903 0 0 0 -167.318 0 0 0 0 0 1479 0 0 0 0 0 0 0 0 0 0 0 0 0 0 0 0 
1275.75 -557.192 0 0 0 0 1356.32 0 0 0 1946.09 23.7281 0 0 0 1570.71 0 0 0 0 0 0 1021.23 0 0 0 0 0 182.73 0.03 0 0 0 0 -898.846 1807.23 0 0 1834.09 0 0 0 0 241.63 0 0 0 0 0 0 0 0 0 0 0 0 0 0 0 0 0 0 0 0 0 608.463 0 0 
0 0 0 0 0 0 0 0 0 0 0 0 0 0 0 -801.798 0 2000.11 0 0 -465.026 1041.22 1936.78 0 540.406 0 425.657 0 0 0 0.05 0 -2465.97 -124.897 0 0 0 2351.99 0 2473.6 0 0 0 1158.56 0 0 0 0 0 0 0 0 311.975 0 0 0 0 -1007.8 0 0 0 0 0 0 0 0 0 0 
0 -2111.8 1147.27 0 0 -275.201 0 0 0 0 0 0 0 0 0 0 0 0 0 0 -313.196 1362.88 0 0 0 1920.45 0 -663.854 1347.01 0 0 0.03 1757.79 -2129.51 0 0 0 0 0 0 1855.3 1184.96 0 0 0 -149.922 0 0 0 0 0 0 0 -532.472 0 0 0 0 0 0 0 0 0 0 0 0 0 0 
0 0 0 -1025.8 2196.8 0 1305.96 0 2239.98 2400.66 0 0 0 -931.654 -1035.72 0 0 0 0 0 0 0 2171.77 221.488 -361.11 -2024.52 0 0 0 0 2203.21 -686.59 0.06 0 -2141.1 0 0 1268.12 0 -827.586 1320.76 0 0 -2093.8 0 0 0 0 0 0 0 0 0 0 0 -27.0852 0 0 0 0 0 0 0 0 0 0 0 0 
32.7311 1852.55 -1553.77 0 0 0 0 0 0 -733.284 482.421 1113.24 0 0 0 -553.224 0 0 0 0 0 0 0 -907.392 2341.15 687.658 0 0 0 0 1679.2 -1149.86 0 0.05 0 0 2000.72 0 1744.06 0 -1272.55 0 0 0 0 0 -1273.77 0 0 0 0 0 0 0 0 0 0 0 0 0 0 0 0 0 0 0 866.955 -1762.06 
0 449.156 0 2055.5 0 0 0 0 -2454.07 0 0 0 0 0 0 0 -507.752 0 0 0 0 0 0 992.538 0 0 1978.29 0 0 2230.98 0 0 -1681.49 0 0.04 2357.02 436.338 0 0 1189.38 0 0 -1831.64 -516.755 1995.53 0 0 0 0 -2460.33 1162.83 0 0 0 0 203.94 0 0 177.694 0 0 0 0 0 -2177.42 0 0 0 
0 -1626.71 0 0 0 0 0 0 0 0 0 -2322.84 0 0 0 -1127.89 629.978 1190.6 29.9844 0 0 0 1884.44 1958.91 1571.32 0 0 0 0 429.472 0 0 0 0 278.558 0.05 0 1151.08 0 0 0 -1156.27 0 0 666.448 0 0 0 102.771 0 0 0 0 0 0 0 0 0 0 -1172.14 0 0 0 1470.15 0 0 0 0 
2156.67 152.516 0 0 0 0 0 1590.24 0 -759.224 -944.929 0 0 -1529.05 0 0 0 0 0 1077.84 -705.359 0 0 -11.8259 0 0 0 735.878 0 0 0 0 0 -492.798 -486.847 0 0.04 0 0 2013.69 0 0 0 0 0 -362.789 0 1810.28 0 0 -1560.18 0 0 0 0 0 385.22 -1681.65 0 -1324.73 0 0 0 0 0 0 0 0 
0 37.1563 0 0 0 0 -2286.98 231.101 1803.57 -1661.2 69.0481 0 0 0 0 0 0 2038.87 1008.26 0 0 0 0 2316.13 0 1610.39 -1131.86 123.371 0 0 -1819.9 0 888.928 0 0 2007.89 0 0.02 0 0 0 823.923 0 0 0 0 0 0 1446.81 0 0 -250.938 0 0 1327.33 0 0 0 0 0 0 0 0 0 0 0 0 0 
-1533.63 980.636 0 2305.29 0 0 -837.962 -730.079 0 1125.45 0 -1291.31 0 401.7 0 0 2441.25 0 0 0 1014.51 0 0 0 1145.28 0 0 0 0 126.728 0 0 0 -547.884 0 0 0 0 0.08 567.415 0 0 1538.97 0 0 0 -128.407 0 0 -548.646 1120.72 0 0 0 0 0 0 -886.792 0 0 0 0 0 0 0 0 0 0 
1269.04 0 -14.8778 1481.75 -1719.03 0 0 0 795.236 0 0 0 -1995.53 0 1863.69 0 0 -52.2629 0 0 0 2145.22 0 0 626.469 0 -2370.3 0 373.47 0 859.63 0 -88.7326 0 1905.8 0 71.7948 0 969.192 0.02 0 0 0 2164.75 0 0 0 0 0 0 0 0 1927.63 0 0 0 0 0 0 0 0 0 0 0 0 1567.96 0 -379.116 
0 -1115.53 0 1542.18 0 -266.961 0 0 0 0 0 0 0 0 0 0 0 0 0 0 0 967.818 0 0 0 0 0 0 2093.65 0 0 -15.4881 1167.1 2055.19 0 0 0 0 0 0 0.04 0 1475.49 0 0 0 0 0 0 0 0 0 0 0 0 0 0 0 0 0 0 0 0 0 0 0 0 0 
0 0 0 0 -1966.23 0 0 -160.298 0 0 799.356 91.6318 378.964 0 0 1601.23 1436.12 0 1105 0 0 -1191.37 0 0 460.906 0 0 0 299.768 0 0 608.158 0 0 0 2008.35 0 1039.84 0 0 0 0.06 0 0 0 0 0 0 2210.53 0 0 0 0 -707.343 0 0 0 0 0 -2109.21 0 0 0 0 0 0 0 0 
0 0 1683.32 -2273.09 0 1857.43 0 0 0 0 0 0 1646.4 2295.07 0 -290.307 1041.98 0 -1581.39 -35.02 0 0 0 -1408.05 0 0 0 0 0 0 0 0 0 0 1678.14 0 0 0 1114.31 0 1569.95 0 0.01 0 0 -702.612 0 0 0 0 0 0 0 1885.36 0 0 0 0 0 0 0 0 0 0 0 0 1752.3 776.009 
0 0 0 0 0 0 0 1777.93 0 -722.907 0 0 0 0 0 -436.491 0 45.3963 0 1675.85 0 0 0 0 0 0 0 -2186.88 0 2002.24 887.86 0 1739.94 0 -391.476 0 0 0 0 1262.17 0 0 0 0 0 0 0 0 0 0 0 0 0 0 0 0 0 0 0 0 415.586 -1969.89 0 0 0 0 0 0 
0 0 0 0 0 0 0 0 0 0 0 0 0 0 0 0 0 0 0 0 0 0 -256.737 -139.241 0 -1631.9 1473.97 2100.97 0 0 0 0 0 0 1264.15 2328.94 0 0 0 0 0 0 0 0 0.08 0 0 -1617.71 1153.52 0 0 0 0 527.284 0 0 2450.41 0 -106.433 0 0 0 0 2382.2 0 0 0 0 
0 0 0 0 0 0 0 0 514.313 0 -1867.5 0 0 0 2192.22 0 0 0 0 0 0 0 0 0 0 0 0 0 723.975 0 0 1975.08 0 0 0 0 -2342.37 0 0 0 0 0 296.564 0 0 0.01 0 1497.01 0 -220.573 0 0 0 0 0 0 0 0 0 0 0 0 0 -1108.36 0 547.884 0 0 
0 0 0 0 2048.17 0 0 0 0 0 0 0 0 0 0 0 310.45 0 1380.28 -1631.44 0 0 1545.84 0 0 0 0 2077.01 0 0 0 0 0 150.838 0 0 0 0 409.787 0 0 0 0 0 0 0 0.07 0 0 0 0 0 0 0 0 -159.536 0 2290.8 -607.089 0 0 0 0 0 0 0 0 0 
2066.64 -1364.86 0 0 0 0 0 0 0 1497.16 0 0 0 0 0 0 0 0 0 0 0 0 0 0 0 -406.125 0 2117.15 0 0 0 0 0 0 0 0 540.254 0 0 0 0 0 0 0 -1988.51 754.494 0 0.01 0 0 0 0 0 0 0 0 0 0 0 0 770.821 0 0 2225.94 0 0 0 0 
0 0 0 0 513.398 0 0 0 0 0 1138.26 0 0 0 0 0 0 0 -216.605 0 0 0 0 0 0 0 0 0 0 0 0 0 0 0 0 1249.2 0 -22.8126 0 0 0 1428.5 0 0 -264.977 0 0 0 0 0 0 0 -1898.94 0 0 0 0 0 0 0 0 0 0 0 0 0 0 0 
0 0 0 0 0 0 0 0 0 0 0 0 0 0 0 0 -2222.28 0 0 0 1555.6 0 0 0 0 0 0 0 0 0 0 0 0 0 -85.9859 0 0 0 2046.65 0 0 0 0 0 0 2153.61 0 0 0 0.08 0 0 0 0 0 0 0 0 0 0 0 0 0 -95.4466 0 0 0 0 
0 0 0 0 0 0 0 0 0 0 0 0 0 0 0 2165.36 0 0 0 0 0 0 2313.68 0 0 0 0 534.303 0 0 0 0 0 0 -573.519 0 -1883.07 0 669.195 0 0 0 0 0 0 0 0 0 0 0 0.01 0 0 0 0 0 0 0 101.245 0 984.603 -1900.62 0 0 403.531 -32.1207 0 0 
0 934.248 0 0 0 0 0 0 0 -1537.6 0 0 0 0 0 0 1870.71 1908.7 0 0 0 0 0 0 0 0 0 0 29.5267 0 0 0 0 0 0 0 0 -858.409 0 0 0 0 0 0 0 0 0 0 0 0 0 0.04 0 0 0 0 0 0 0 0 0 0 1439.18 0 0 -1950.36 0 0 
0 0 0 0 0 -367.367 0 1807.38 0 0 0 -419.858 723.365 0 0 0 0 0 1523.71 1935.71 0 0 0 0 0 0 0 0 0 0 1334.19 0 0 0 0 0 0 0 0 -1036.18 0 0 0 0 0 0 0 0 -2143.85 0 0 0 0.03 0 0 0 0 0 0 -1461.3 0 0 0 0 0 0 0 0 
0 0 0 0 0 0 0 0 0 0 0 0 0 0 2406 0 0 2002.7 0 0 0 0 -1735.82 0 -2102.04 0 0 0 0 0 0 2252.8 0 0 0 0 0 0 0 0 0 -2342.68 1055.86 0 1728.64 0 0 0 0 0 0 0 0 0.09 0 -174.184 0 0 0 0 0 0 0 0 0 0 0 0 
793.558 0 0 0 0 0 0 0 0 0 0 0 0 -265.282 0 0 0 0 2309.26 0 0 0 0 0 488.983 0 0 0 0 0 0 0 0 0 0 0 0 251.549 0 0 0 0 0 0 0 0 0 0 0 0 0 0 0 0 0.03 0 -1784.34 -592.593 0 0 0 0 0 0 -903.729 0 0 0 
0 2304.83 50.737 0 0 0 0 0 0 0 0 0 0 0 0 0 -1053.27 0 0 0 0 0 0 0 -918.378 0 0 0 0 0 0 0 1751.69 0 -644.169 0 0 0 0 0 0 0 0 0 0 0 -1352.2 0 0 0 0 0 0 1681.95 0 0.09 0 0 0 0 0 0 0 0 0 0 0 215.384 
0 0 0 0 1037.4 0 0 0 -1437.04 0 0 0 0 0 0 0 0 0 0 0 0 0 0 0 -1078.6 0 0 0 0 0 0 0 0 0 0 0 -168.081 0 0 0 0 0 0 0 2075.95 0 0 0 0 0 0 0 0 0 -278.863 0 0.05 0 0 0 0 0 0 0 0 0 17.9296 0 
0 0 0 0 0 0 0 1271.32 0 0 0 0 0 0 0 0 540.559 1573.46 0 915.174 0 0 0 0 0 0 0 -696.356 0 0 1179.46 0 0 0 0 0 1332.21 0 -177.847 0 0 0 0 0 0 0 -1229.36 0 0 0 0 0 0 0 1488.31 0 0 0.01 0 0 0 0 0 0 0 0 0 0 
0 0 0 0 0 0 0 0 1993.24 -640.049 0 0 0 0 0 0 -1653.87 0 0 2144 0 0 0 0 0 1555.91 0 0 0 0 0 0 0 0 1556.37 0 0 0 0 0 0 0 0 0 -342.799 0 1098.59 0 0 0 1675.39 0 0 0 0 0 0 0 0 0 0 0 0 0 0 0 0 0 
0 0 -607.242 0 0 1404.23 2278.44 0 0 0 2124.93 0 0 0 0 0 0 0 0 1360.74 0 0 0 0 -2128.28 0 0 0 0 0 0 0 0 0 0 -1178.85 -1362.58 0 0 0 0 1001.85 0 0 0 0 0 0 0 0 0 0 -881.603 0 0 0 0 0 0 0.09 0 0 0 2209.77 0 0 0 0 
0 0 1530.88 0 0 0 0 0 0 0 0 1494.26 0 0 0 0 0 0 -123.066 0 0 0 0 0 0 -2088.92 0 0 0 0 0 0 0 0 0 0 0 0 0 0 0 0 0 -2381.89 0 0 0 2222.28 0 0 1337.7 0 0 0 0 0 0 0 0 0 0.03 0 85.3755 0 0 2464.29 0 0 
1967.6 0 381.558 0 0 0 0 0 0 0 0 0 0 0 -731.605 0 0 0 0 0 -667.058 0 0 0 0 0 0 0 0 0 0 0 0 0 0 0 0 0 0 0 0 0 0 -464.263 0 0 0 0 0 0 -11.6733 0 0 0 0 0 0 0 0 0 0 0.07 0 1581.55 0 0 0 0 
0 1531.95 0 0 0 0 0 0 0 0 0 0 0 0 0 0 0 0 0 1625.34 0 918.836 0 0 0 0 348.75 0 0 0 0 0 0 0 0 0 0 0 0 0 0 0 0 0 0 0 0 0 0 0 0 362.026 0 0 0 0 0 0 0 0 -2096.85 0 0.01 0 0 0 0 0 
0 0 0 0 0 0 0 0 0 2479.86 -423.826 0 0 0 0 0 0 0 0 0 0 0 0 -2118.06 0 0 0 0 0 0 0 0 0 0 0 1860.18 0 0 0 0 0 0 0 0 2216.03 314.875 0 900.525 0 2239.98 0 0 0 0 0 0 0 0 0 578.555 0 2108.45 0 0.04 0 0 0 0 
0 0 1298.49 0 0 0 0 0 0 0 0 2250.97 1537.29 0 0 0 0 0 0 0 0 0 0 0 0 0 0 0 0 0 0 0 0 0 1882.61 0 0 0 0 0 0 0 0 0 0 0 0 0 0 0 -166.25 0 0 0 -1233.79 0 0 0 0 0 0 0 0 0 0.08 0 0 0 
0 2103.11 0 0 0 0 0 884.045 0 0 1324.73 0 0 0 0 0 -357.143 0 0 0 0 0 0 0 0 0 0 0 0 -1701.94 0 0 0 0 0 0 0 0 0 -174.337 0 0 0 0 0 2326.96 0 0 0 0 -1385.77 2418.82 0 0 0 0 0 0 0 0 -1780.83 0 0 0 0 0 -1749.09 0 
0 0 0 0 0 0 0 0 0 0 2443.54 0 0 560.854 0 2285 0 0 0 0 0 0 0 0 0 0 0 0 0 0 0 0 0 -1481.75 0 0 0 0 0 0 0 0 1208.15 0 0 0 0 0 0 0 0 0 0 0 0 0 -1428.95 0 0 0 0 0 0 0 0 -326.319 0.03 0 
0 -313.044 0 0 0 0 0 0 0 0 1475.8 0 0 0 0 0 0 0 0 0 0 0 0 0 0 0 0 0 0 0 0 0 0 1958.45 0 0 0 0 0 197.073 0 0 1199.15 0 0 0 0 0 0 0 0 0 0 0 0 2031.08 0 0 0 0 0 0 0 0 0 0 0 0.04 
