*Vertices 64
*Matrix 
0.08 0 0 0 0 0 0 0 0 0 0 -387.661 0 -997.726 0 0 -210.044 0 0 0 0.228889 1280.63 -284.814 527.284 0 0 0 0 0 0 0 0 0 0 0 0 0 0 0 0 0 1780.37 0 0 0 0 0 0 0 0 1240.35 974.532 0 -728.248 0 737.251 0 465.484 0 0 0 0 0 0 
0 0.01 0 0 0 0 0 0 1578.65 0 0 0 760.903 2238.76 0 -1217.76 0 0 0 0 2369.23 0 0 0 -2413.17 0 1692.94 0 -646.306 13.1993 0 2298.88 0 0 0 0 2107.84 0 -1861.55 -70.8792 0 0 0 0 0 0 468.688 0 2319.64 0 0 -2458.49 0 0 -1913.74 0 0 0 0 0 0 177.541 -611.515 0 
0 0 0 0 0 0 0 0 0 0 0 1058.61 0 629.978 0 0 0 0 434.049 361.721 928.907 972.091 0 0 0 0 0 -1478.85 0 0 0 0 1438.72 0 0 -729.164 -2295.53 -2437.59 -1965.01 0 -1220.51 0 0 0 0 0 0 1904.28 2409.82 0 0 0 1372.34 0 1199 0 0 0 998.184 0 0 0 0 0 
0 0 0 0.06 0 -1574.83 0 0 0 0 0 0 0 0 1459.01 0 0 22.8126 0 0 0 0 -460.295 0 0 0 603.122 0 0 518.128 0 0 688.726 2478.94 443.358 0 -1567.81 0 0 -1903.21 1213.8 0 1017.26 0 0 0 0 2432.1 0 0 0 0 0 1013.44 -2342.22 0 0 2474.52 0 0 0 0 2215.26 0 
0 0 0 0 0 0 0 0 -1617.25 0 0 1339.38 0 0 0 2172.84 -477.233 0 0 0 0 0 0 0 0 0 0 0 0 0 0 0 0 0 -98.1933 0 0 0 0 0 0 0 -272.149 0 0 -1239.59 0 0 1219.14 -9.99481 -841.166 0 0 0 0 0 0 2482.91 787.759 0 0 134.51 0 73.6259 
0 0 0 2223.2 0 0.07 0 -1601.38 0 2465.36 0 0 0 0 0 0 -374.538 503.632 0 1092.03 0 0 0 0 -164.113 0 0 0 0 0 0 0 0 -1965.32 0 1087.3 204.398 -1704.08 0 0 0 0 0 0 688.574 0 0 0 0 0 0 0 0 0 0 0 0 0 0 0 0 1199.61 0 0 
0 0 0 0 0 0 0.09 0 0 0 0 0 0 0 0 1438.41 0 0 1171.99 0 0 0 0 0 0 467.772 0 -2380.83 0 -1286.89 1837.75 0 319.452 0 0 0 -2166.13 0 0 1053.88 0 -740.455 0 1543.55 0 2435 0 0 0 0 0 -254.448 -1235.62 0 2228.23 -2296.44 0 0 0 0 0 0 0 -1263.08 
0 0 0 0 0 -1329.31 0 0.08 0 395.291 1339.99 0 0 1107.59 -2253.41 0 1402.1 2057.94 0 2057.48 0 0 -1996.9 0 2185.81 0 -1384.4 1076.92 0 0 1638.92 -1685.46 0 726.875 895.795 0 -1701.18 -421.537 0 1122.85 0 0 0 -2097.92 0 0 2042.99 0 -1829.36 0 0 0 0 0 0 0 0 0 0 -899.304 0 0 0 0 
0 1334.65 0 0 -332.118 0 0 0 0.01 0 0 2047.11 -162.282 -2465.06 -760.292 0 -360.805 2005.45 0 -1818.67 -608.615 0 0 47.0748 1496.7 0 0 0 0 89.8007 1651.74 0 1812.42 0 0 0 0 0 0 0 0 0 0 0 0 1735.66 1436.28 0 0 0 0 2308.95 0 0 0 0 -2308.65 0 0 0 0 0 0 0 
0 0 0 0 0 -973.006 0 -549.715 0 0.05 0 0 1983.47 -212.333 0 0 0 0 0 -1161.76 0 0 -1593.45 0 -1495.48 0 0 0 0 0 0 0 0 0 -550.325 0 0 0 0 1744.06 408.414 0 0 820.566 0 0 0 -688.116 0 0 0 1098.74 2377.01 0 0 0 0 0 0 0 0 -1407.74 0 0 
0 0 0 0 0 0 0 -1061.51 0 0 0.09 0 720.466 0 0 0 1530.12 0 0 0 0 0 0 0 -1703.77 0 0 0 0 0 0 0 0 399.411 0 0 0 0 0 0 1809.67 2065.11 0 0 0 0 0 0 0 0 0 0 0 0 505.005 -1492.13 0 0 -1949.9 0 0 0 0 0 
-1863.23 0 -2077.01 0 1504.33 0 0 0 -283.593 0 0 0.04 -24.0333 0 0 0 0 0 934.553 569.247 0 0 0 0 2095.02 0 1894.21 0 0 -73.1681 0 0 -94.2259 0 -748.39 2438.81 0 0 0 0 0 0 0 0 0 -2003.01 329.676 1784.49 0 0 1998.73 0 1950.67 0 0 0 2345.12 188.833 -2420.19 0 0 0 0 0 
0 -2079.76 0 0 0 0 0 0 1254.23 890.149 953.78 967.971 0.01 0 40.6659 0 -1163.14 1284.91 -506.378 0 0 1241.42 0 0 0 0 -2393.19 318.69 0 0 1996.14 0 0 0 0 0 0 0 2138.36 2088.92 -443.663 0 0 0 0 0 0 0 0 0 1453.22 1850.57 0 -1814.1 2212.52 0 0 0 0 0 0 0 0 901.288 
-853.832 612.125 1389.58 0 0 0 0 5.87481 204.855 -1670.51 0 0 0 0.01 0 0 0 0 0 0 0 0 661.87 0 0 0 1741 -266.655 0 0 0 0 0 0 1779.46 0 0 2339.78 0 0 0 0 0 0 0 0 0 0 0 0 0 0 -1831.49 -1482.67 -1205.71 0 0 0 0 2406.31 0 0 0 0 
0 0 0 2372.59 0 0 0 -2072.44 2243.64 0 0 0 1887.19 0 0.09 2103.56 0 0 -1443.91 0 -1380.43 0 0 0 0 622.654 0 0 0 0 0 0 -810.495 0 0 0 157.247 0 -1328.39 0 -1743.45 0 0 1263.39 0 0 0 -1278.5 0 0 0 1978.29 0 -1608.4 1487.4 0 1277.89 0 0 0 0 0 0 0 
0 -32.4259 0 0 -1433.07 0 -181.814 0 0 0 0 0 0 0 1544.31 0.03 0 -633.03 -550.172 2139.73 2236.01 194.021 0 0 0 -175.405 0 0 0 0 0 2110.89 0 0 1193.2 -2060.84 0 0 2163.84 0 2030.63 0 -973.006 0 0 0 72.7104 0 0 2065.42 0 0 0 0 0 0 0 0 0 0 -704.443 0 0 0 
2475.43 0 0 0 -1022.6 1289.79 0 -1424.53 1496.4 0 2135.61 0 82.6289 0 0 0 0 0 2447.66 1463.9 0 0 0 0 0 0 0 0 1037.55 0 0 0 0 1364.56 0 0 0 0 0 1533.63 1736.58 0 0 0 0 -268.487 0 0 0 0 1786.32 0 0 -933.485 0 -1222.95 0 0 0 0 0 0 0 0 
0 0 0 1628.54 0 2379.3 0 -1207.39 -2313.68 0 0 0 -1708.5 0 0 2433.62 0 0.05 0 0 -1530.27 0 0 -2056.87 0 0 0 989.029 1237.3 0 0 0 0 0 0 1873.76 0 1897.72 -517.975 0 0 -111.469 -968.581 0 971.633 -1436.89 805.765 0 0 1618.63 0 0 0 881.909 0 0 0 0 0 1257.74 0 0 -675.909 0 
0 0 1606.11 0 0 0 326.014 0 0 0 0 2068.77 -272.607 0 1602.6 -2062.21 -1139.03 0 0.06 -867.565 -1183.89 0 0 0 0 0 389.34 0 0 0 0 897.473 0 0 0 931.043 -858.257 0 1735.66 0 320.673 0 0 0 0 0 0 0 0 0 0 0 -1567.96 0 1200.83 0 0 -119.556 -350.276 0 0 0 0 0 
0 0 1339.23 0 0 -2255.24 0 1003.22 1420.1 279.778 0 -2112.11 0 0 0 -423.521 -121.387 0 -1795.33 0.07 0 -947.218 832.621 2321.92 0 0 1677.98 0 -1324.58 0 -584.506 0 0 0 0 0 2047.41 -2354.43 156.789 0 0 127.644 -1044.57 0 0 1228.14 2453.46 0 0 840.861 0 0 0 -793.1 0 0 1460.69 0 0 0 0 0 0 0 
-221.335 2388 2406.16 0 0 0 0 0 -860.546 0 0 0 0 0 93.0052 -799.966 0 519.959 -419.706 0 0.06 0 0 578.097 0 0 787.606 0 -767.464 0 0 0 0 0 0 1420.26 0 0 0 0 -2035.97 0 0 0 -1558.66 0 0 -479.369 0 -438.169 2386.01 0 0 0 0 0 0 0 0 742.897 0 299.768 0 0 
1278.19 0 3.73852 0 0 0 0 0 0 0 0 0 875.5 0 0 543.153 0 0 0 1887.95 0 0.08 289.087 0 -232.933 -1350.83 0 1953.26 0 0 -794.931 -1346.25 0 0 0 1419.49 67.217 1460.39 -2266.08 -252.922 0 -12.8941 -179.373 284.051 0 0 0 0 0 0 0 0 -1733.83 0 -1072.34 0 0 1314.97 2487.18 1329.46 0 0 0 0 
1980.42 0 0 1076.16 0 0 0 127.644 0 2497.71 0 0 0 1118.27 0 0 0 0 0 844.523 0 1411.25 0.01 1041.37 0 0 1660.28 0 -1953.11 0 0 0 -983.84 -1532.72 0 0 0 693.609 -171.285 -1713.08 0 -761.818 -1776.41 0 0 0 0 0 -493.408 0 2299.65 0 0 0 0 0 0 0 0 0 1131.55 -993.149 0 0 
1981.34 0 0 0 0 0 0 0 145.192 0 0 0 0 0 0 0 0 -1769.39 0 -1964.25 -167.318 0 627.842 0.01 0 -1896.19 0 0 0 0 0 0 0 0 0 0 0 287.866 1317.71 1859.11 0 0 0 0 0 169.301 2141.41 1394.16 0 0 0 303.43 0 757.241 0 0 -824.686 0 0 0 -1706.98 0 0 0 
0 2388.91 0 0 0 519.044 0 -2417.14 1925.03 -815.073 1793.04 -400.174 0 0 0 0 0 0 0 0 0 1031.6 0 0 0.03 0 0 0 0 0 0 0 -1130.63 1628.09 -1196.1 0 0 0 -2152.39 -826.06 0 1860.94 0 0 0 0 0 5.41704 0 2473.75 0 2332.3 0 1662.72 0 347.53 0 0 0 0 0 0 -2169.03 0 
0 0 0 0 0 0 454.192 0 0 0 0 0 0 0 1518.83 -886.944 0 0 0 0 0 -1742.53 0 2027.88 0 0.02 0 0 0 0 0 0 -1277.12 0 121.845 -53.7889 0 0 0 0 0 0 0 0 -1759.47 0 579.47 0 -1345.33 681.555 0 0 230.796 683.844 0 1745.43 -662.938 0 0 0 0 816.141 0 0 
0 2413.79 0 2458.8 0 0 0 -708.563 0 0 0 1072.65 -1303.22 1058.31 0 0 0 0 193.564 -1746.04 1685.92 0 2267.45 0 0 0 0.09 -1531.95 0 0 0 0 0 0 0 0 0 0 0 -1149.4 0 -2128.74 -1847.97 -964.156 -463.042 0 733.284 1849.04 -596.408 0 0 0 0 0 -340.205 0 -955.611 0 0 0 0 1623.05 0 0 
0 0 2256.92 0 0 0 -482.727 -2240.14 0 0 0 0 817.972 -668.737 0 0 0 300.684 0 0 0 -1180.84 0 0 0 0 2407.07 0.03 0 -1395.23 0 0 2483.67 0 362.331 1942.73 0 0 0 -1676.46 0 0 0 0 0 0 0 0 1257.29 0 -1886.58 0 0 2318.72 0 0 0 0 0 1570.41 0 0 0 0 
0 -936.079 0 0 0 0 0 0 0 0 0 0 0 0 0 0 1305.51 201.041 0 749.001 -268.944 0 2488.56 0 0 0 0 0 0.09 0 0 358.669 240.867 0 0 0 1164.97 0 1519.29 0 0 0 0 0 0 0 638.523 1504.18 0 0 1604.59 0 0 0 0 -1453.67 1785.41 0 0 0 0 507.599 0 0 
0 -1610.54 0 -2429.04 0 0 733.741 0 1363.03 0 0 2366.02 0 0 0 0 0 0 0 0 0 0 0 0 0 0 0 2448.42 0 0.04 883.435 0 -376.217 1907.64 0 0 0 0 -483.642 0 0 0 0 1577.73 -488.525 -1401.79 0 0 1478.7 0 0 0 0 0 569.552 0 1223.41 0 -856.273 0 -1323.97 0 0 0 
0 0 0 0 0 0 660.344 -477.081 -1541.26 0 0 0 -672.399 0 0 0 0 0 0 2213.89 0 1665.62 0 0 0 0 0 0 0 342.189 0.08 0 0 -2312.77 0 0 892.285 0 0 1182.52 952.712 0 0 0 -1626.71 2044.21 0 1469.54 0 -1084.7 0 0 0 0 -1967.91 2436.22 649.51 0 0 0 1634.34 0 0 0 
0 1660.74 0 0 0 0 0 731.3 0 0 0 0 0 0 0 1556.52 0 0 1467.41 0 0 561.312 0 0 0 0 0 0 -2348.32 0 0 0.03 -277.49 2140.03 -343.867 0 0 2335.81 0 -2337.49 1827.52 0 -29.2215 2095.78 0 22.9652 -2173.91 0 0 0 0 0 0 0 0 1075.85 2456.51 -670.263 0 0 0 0 0 0 
0 0 607.089 -210.654 0 0 -466.552 0 107.807 0 0 -409.94 0 0 -805.765 0 0 0 0 0 0 0 2015.52 0 -326.624 -765.938 0 2002.7 -2037.8 1604.28 0 741.829 0.09 1298.64 0 0 0 -1295.28 0 0 0 1808.3 0 0 0 0 -221.335 2359.46 -40.2081 0 1454.28 0 0 0 0 0 0 0 0 0 2053.97 1500.98 0 0 
0 0 0 1743.14 0 1352.05 0 -1349.6 0 0 -945.387 0 0 0 0 0 -991.47 0 0 0 0 0 -1952.35 0 2382.81 0 0 0 0 1474.12 58.8244 1714.76 -824.534 0.09 0 0 801.798 0 0 0 943.098 0 0 0 0 0 0 0 0 -1137.81 0 0 389.645 -1784.49 0 0 0 -976.516 0 292.444 2327.42 2081.59 1267.2 0 
0 0 0 1239.59 1789.53 0 0 -2059.92 0 2463.23 0 1751.99 0 -1157.19 0 683.844 0 0 0 0 0 0 0 0 1260.03 20.9815 0 635.167 0 0 0 -1500.82 0 0 0.05 0 1936.32 435.881 0 0 1374.32 0 0 873.516 0 0 0 -59.2822 -509.735 983.688 0 0 0 0 0 0 -898.694 0 0 -613.193 0 0 0 0 
0 0 -2337.34 0 0 -1872.54 0 0 0 0 0 640.202 0 0 0 1212.88 0 977.432 350.124 0 2391.51 612.735 0 0 0 1467.86 0 1153.68 0 0 0 0 0 0 0 0.06 0 -378.506 0 0 0 -1994.77 0 0 0 0 0 0 0 0 1140.4 -979.72 0 0 2034.44 0 0 0 0 0 0 0 0 0 
0 1144.98 412.687 -675.146 0 2439.42 -1066.7 1736.12 0 0 0 0 0 0 1173.06 0 0 0 1305.51 581.301 0 1546.45 0 0 0 0 0 0 2170.4 0 -1459.93 0 0 -265.435 2300.1 0 0.06 -1428.19 0 0 0 2039.48 0 0 0 0 0 0 0 0 2070.91 0 0 0 0 0 0 0 1414.61 0 0 -502.411 0 0 
0 0 -816.294 0 0 1941.82 0 -832.011 0 0 0 0 0 1877.73 0 0 0 -1951.58 0 1060.44 0 1373.41 1993.24 2372.43 0 0 0 0 0 0 0 1843.39 -2284.23 0 670.263 462.432 1208.91 0.08 0 0 -1373.41 0 0 -1860.64 0 0 0 0 -735.878 0 2410.12 0 0 0 -1321.22 0 0 0 0 0 0 -2271.72 642.186 0 
0 525.147 465.026 0 0 0 0 0 0 0 0 0 -2178.64 0 1251.03 -1869.95 0 -644.169 -942.793 2313.38 0 1462.83 1430.33 1493.35 1157.64 0 0 0 1883.98 1829.66 0 0 0 0 0 0 0 0 0.04 0 0 0 -1601.08 0 0 1333.28 0 0 0 0 1888.87 0 0 0 1860.48 0 2268.21 -1614.81 0 0 0 0 0 0 
0 961.867 0 746.559 0 0 705.664 2364.04 0 309.839 0 0 -398.648 0 0 0 1849.8 0 0 0 0 -2323.76 2083.88 -2103.56 822.855 0 1948.07 -2493.44 0 0 2169.18 2287.74 0 0 0 0 0 0 0 0.07 0 0 2438.2 2048.94 0 2102.34 -2101.58 0 0 -2348.02 0 0 0 0 -1468.78 0 0 1703.77 0 0 -1681.95 -1013.6 0 0 
0 0 295.495 1363.19 0 0 0 0 0 1705.76 -997.116 0 -2285.61 0 -416.501 -1686.07 1929.91 0 -667.058 0 -1441.92 0 0 0 0 0 0 0 0 0 607.089 722.449 0 2215.87 1064.71 0 0 1056.02 0 0 0 2385.1 0 0 0 0 1140.1 0 -1888.56 0 2272.18 0 0 1343.96 0 0 0 0 0 0 0 0 0 0 
1894.06 0 0 0 0 0 1263.24 0 0 0 878.094 0 0 0 0 0 0 -1686.99 0 695.898 0 72.7104 2309.26 0 1808.6 0 826.518 0 0 0 0 0 1503.57 0 0 445.036 961.409 0 0 0 509.278 0.01 0 0 0 0 0 0 0 0 -1818.06 0 0 0 0 0 0 1841.56 0 0 -2029.25 969.192 0 0 
0 0 0 2393.19 -765.633 0 0 0 0 0 0 0 0 0 0 -514.008 0 1633.27 0 1448.33 0 -78.9666 -1474.27 0 0 0 1108.36 0 0 0 0 2046.95 0 0 0 0 0 0 303.735 687.506 0 0 0.01 0 0 0 0 -1960.28 0 2497.56 1417.51 0 0 0 0 0 2406.77 0 0 0 499.664 0 0 -179.83 
0 0 0 0 0 0 1149.71 -402.615 0 169.149 0 0 0 0 896.71 0 0 0 0 0 0 1662.11 0 0 0 0 -1918.01 0 0 -265.74 0 2227.01 0 0 170.217 0 0 -89.4955 0 82.7815 0 0 0 0.07 0 0 0 1986.53 0 0 0 -766.243 0 0 0 0 -1622.59 0 0 0 0 0 0 0 
0 0 0 0 0 248.497 0 0 0 0 0 0 0 0 0 0 0 631.809 0 0 1147.27 0 0 0 0 2106.92 -535.218 0 0 -2307.12 44.3281 0 0 0 0 0 0 0 0 0 0 0 0 0 0.09 0 0 0 0 -1721.17 0 1844.31 0 2278.59 0 0 0 2479.25 0 0 0 0 0 0 
0 0 0 0 620.518 0 -903.272 0 1840.8 0 0 2175.28 0 0 0 0 -2471.01 1292.54 0 -399.411 0 0 0 1897.11 0 0 0 0 0 2227.32 49.2111 -844.676 0 0 0 0 0 0 -870.006 1676 0 0 0 0 0 0.05 0 0 1970.66 0 -1202.35 0 1391.11 0 0 360.958 -2386.78 0 -1959.36 0 -1297.11 0 0 922.04 
0 2004.07 0 0 0 0 0 -589.236 -1233.18 0 0 -797.983 0 0 0 1865.37 0 2150.56 0 -490.356 0 0 0 96.6674 0 -1090.04 -582.369 0 133.747 0 0 758.309 422.3 0 0 0 0 0 0 57.2985 -1648.69 0 0 0 0 0 0.08 0 0 0 0 0 -41.5815 829.264 0 0 1735.36 0 0 0 1405.76 63.097 5.11185 -1620.76 
0 0 2093.8 1830.42 0 0 0 0 0 1158.1 0 -651.341 0 0 1735.97 0 0 0 0 0 2134.08 0 0 -662.786 -1838.36 0 -904.492 0 -2364.8 0 -288.324 0 996.658 0 1941.21 0 0 0 0 0 0 0 1681.8 1853.47 0 0 0 0.02 0 0 0 1665.78 0 -692.236 -1455.5 -733.741 -284.204 -597.018 0 0 2179.1 305.719 0 0 
0 433.744 -557.955 0 1585.51 0 0 2466.12 0 0 0 0 0 0 0 0 0 0 0 0 0 0 -1359.83 0 0 2124.47 -18.9978 1102.25 0 1692.18 0 0 -844.066 0 -1202.35 0 0 521.18 0 0 -853.374 0 0 0 0 -2482.76 0 0 0.07 17.777 0 673.925 0 0 1626.71 0 0 0 0 0 0 0 0 0 
0 0 0 0 -1636.48 0 0 0 0 0 0 0 0 0 0 228.813 0 -477.996 0 253.227 -1691.72 0 0 0 593.509 -1997.36 0 0 0 0 -914.869 0 0 1350.22 240.562 0 0 0 0 983.383 0 0 911.206 0 1535.46 0 0 0 -1182.67 0.09 0 1081.96 0 416.044 0 0 0 -994.827 0 0 1556.98 382.626 0 0 
2042.68 0 0 0 445.952 0 0 0 0 0 0 422.147 1754.74 0 0 0 -2041.31 0 0 0 1371.88 0 -154.195 0 0 0 0 1578.04 1924.42 0 0 0 2269.28 0 0 1189.84 -1421.93 693.915 -1085.77 0 -2106.01 1721.02 2172.08 0 0 808.664 0 0 0 0 0.08 0 0 0 912.58 0 0 0 0 0 1759.62 0 0 0 
2458.34 -259.636 0 0 0 0 -1868.11 0 1143.3 2290.03 0 0 745.796 0 -1960.74 0 0 0 0 0 0 0 0 945.387 -20.3711 0 0 0 0 0 0 0 0 0 0 -2488.4 0 0 0 0 0 0 0 1680.27 1704.99 0 0 -299.615 929.365 -1568.58 0 0.06 0 38.9874 0 0 0 0 0 0 0 1011.61 -50.1267 0 
0 0 -2342.07 0 0 0 -532.929 0 0 -234.153 0 199.21 0 1210.59 0 0 0 0 2149.19 0 0 1172.14 0 0 0 1370.66 0 0 0 0 0 0 0 1030.08 0 0 0 0 0 0 0 0 0 0 0 634.098 571.535 0 0 0 0 0 0.09 1986.37 -290.918 -662.633 0 0 -1897.11 -312.586 0 625.553 0 0 
-1410.79 0 0 -1141.47 0 0 0 0 0 0 0 0 2012.31 1103.02 -113.3 0 -1250.88 1152 0 2207.63 0 0 0 1507.54 1904.28 -2051.07 0 -2177.57 0 0 0 0 0 -1106.68 0 0 0 0 0 0 660.955 0 0 0 1446.5 0 1640.14 548.646 0 319.91 0 1985.92 -498.901 0.06 -8.77407 2014.91 0 0 0 0 0 0 1375.24 0 
0 845.286 1584.9 -1654.79 0 0 2341.46 0 0 0 -1958.14 0 1206.78 1689.58 1865.21 0 0 0 2401.12 0 0 -123.218 0 0 0 0 365.688 0 0 -1019.7 721.534 0 0 0 0 -934.706 0 -2117.91 2092.88 1180.68 0 0 0 0 0 0 0 -1980.88 2211.45 0 -84.9178 0 718.635 2305.14 0.08 0 1163.29 0 0 772.042 0 0 0 0 
83.5444 0 0 0 0 0 1395.69 0 0 0 -199.973 0 0 0 0 0 658.208 0 0 0 0 0 0 0 654.088 1531.19 0 0 2088.15 0 615.787 -2167.65 0 0 0 0 0 0 0 0 0 0 0 0 0 143.666 0 -93.4629 0 0 0 0 405.515 -1607.49 0 0.01 0 0 2032.76 0 0 0 0 0 
0 0 0 0 0 0 0 0 -773.263 0 0 2200.46 0 0 495.697 0 0 0 0 447.478 0 0 0 695.441 0 2449.8 1159.32 0 341.884 -1262.02 -585.421 -1032.82 0 0 -1129.11 0 0 0 2477.26 0 0 0 2454.83 1491.82 0 1663.34 -1818.52 -1056.93 0 0 0 0 0 0 -1468.17 0 0 0 0 0 2493.74 0 0 0 
1785.26 0 0 -2234.03 -141.53 0 0 0 0 0 0 573.824 0 0 0 0 0 0 2124.47 0 0 1760.08 0 0 0 0 0 0 0 0 0 1842.48 0 2105.4 0 0 0 0 -725.654 2401.12 0 -1368.37 0 0 693.609 0 0 -1650.21 0 -562.38 0 0 0 0 0 0 0 0.01 -550.783 0 0 0 0 0 
0 0 -1327.48 0 2021.62 0 0 0 0 0 2064.2 -1811.66 0 0 0 0 0 0 2346.95 0 0 1119.19 0 0 0 0 0 0 0 -2448.12 0 0 0 0 0 0 -1127.43 0 0 0 0 0 0 0 0 1182.06 0 0 0 0 0 0 -1631.14 0 0 -250.175 0 1660.59 0.03 0 0 0 0 0 
0 0 0 0 0 0 0 -1773.2 0 0 0 0 0 1772.9 0 0 0 -1157.49 0 0 2436.22 -479.827 0 0 0 0 0 -2237.54 0 0 0 0 0 161.061 2313.68 0 0 0 0 0 0 0 0 0 0 0 0 0 0 0 0 0 -366.146 0 1166.49 0 0 0 0 0.04 2095.63 0 0 0 
0 0 0 0 0 0 0 0 0 0 0 0 0 0 0 -997.269 0 0 0 0 0 0 2351.68 -2491.76 0 0 0 0 0 -832.011 717.566 0 1171.53 -604.953 0 0 0 0 0 -666.753 0 1863.23 520.264 0 0 2460.63 -1406.67 -524.384 0 1066.85 482.116 0 0 0 0 0 -1747.72 0 0 1935.1 0.01 0 0 0 
0 -713.446 0 0 -2235.56 710.395 0 0 0 222.709 0 0 0 0 0 0 0 0 0 0 685.98 0 1232.26 0 0 54.3992 -1057.7 0 -474.029 0 0 0 1685.16 -2009.26 0 0 988.266 145.802 0 1553.01 0 467.772 0 0 0 0 -1554.38 1406.37 0 919.141 0 111.164 2409.97 0 0 0 0 0 0 0 0 0 0 0 
0 -382.626 0 -2078.84 0 0 0 0 0 0 0 0 0 0 0 0 0 235.832 0 0 0 0 0 0 1313.29 0 0 0 0 0 0 0 0 -889.081 0 0 0 -316.248 0 0 0 0 0 0 0 0 -241.173 0 0 0 0 1826.61 0 644.169 0 0 0 0 0 0 0 0 0.02 0 
0 0 0 0 1900.46 0 1277.73 0 0 0 0 0 -2182.3 0 0 0 0 0 0 0 0 0 0 0 0 0 0 0 0 0 0 0 0 0 0 0 0 0 0 0 0 0 1165.43 0 0 644.322 1800.36 0 0 0 0 0 0 0 0 0 0 0 0 0 0 0 0 0.04 
