*Vertices 46
*Matrix 
0.06 0 186.239 0 0 0 0 0 0 0 1976.76 0 0 0 0 0 619.449 0 0 0 813.395 0 -290.918 0 -1399.96 0 222.098 0 0 2170.86 2103.11 0 0 143.666 0 0 0 -1882.76 0 0 0 0 0 0 0 0 
0 0.03 2315.52 0 0 0 0 0 0 0 0 0 0 0 0 0 0 0 0 0 0 -597.324 0 0 0 0 0 0 2056.72 0 0 1934.19 0 0 0 0 0 0 0 0 0 0 0 0 742.439 0 
-1457.79 165.029 0.05 0 0 0 0 0 0 1867.2 0 0 0 0 0 0 0 0 0 0 0 0 0 0 0 0 0 0 947.066 0 0 0 0 0 0 0 0 0 0 0 926.618 0 -945.082 0 0 0 
0 0 0 0.03 -413.449 0 0 0 0 0 0 0 -392.087 0 2060.99 0 0 0 0 0 0 0 0 0 0 0 0 0 0 328.913 0 0 -339.137 0 0 0 0 0 0 0 0 1007.19 -1926.56 0 2484.44 0 
0 0 0 1939.38 0.07 0 0 0 0 0 0 0 0 0 0 0 0 0 0 0 0 0 0 0 0 0 0 0 0 0 559.023 0 0 -450.53 0 0 0 0 0 901.746 0 0 0 0 0 0 
0 0 0 0 0 0.05 0 0 0 0 0 0 0 877.178 0 0 -476.318 0 0 0 1521.88 -280.389 -403.531 0 0 0 0 -733.284 0 1539.58 0 -189.444 0 0 0 0 0 0 0 0 0 2264.7 0 0 0 0 
0 0 0 0 0 0 0.07 1205.71 0 0 1477.94 1291.62 1330.53 700.323 0 1530.12 0 0 0 0 0 0 0 0 0 0 0 -1280.94 -35.783 0 2355.49 0 0 0 -2288.51 0 0 0 0 40.5133 0 0 0 0 0 0 
0 0 0 0 0 0 186.544 0.07 0 2064.2 -1298.79 0 0 0 0 -52.5681 0 0 0 1713.23 0 0 0 0 268.487 1631.14 0 0 0 0 0 0 0 0 1356.62 0 0 0 0 0 -557.497 0 0 0 0 0 
0 0 0 0 0 0 0 0 0.04 0 0 0 0 0 0 0 0 0 0 858.409 0 0 0 103.381 0 0 0 0 0 0 0 0 0 0 0 1723.15 0 0 0 0 0 0 0 0 0 0 
0 0 1742.53 0 0 0 0 840.709 0 0.04 0 0 0 0 0 0 0 0 0 0 819.346 0 0 0 0 0 0 2368.77 0 0 0 0 0 0 0 0 0 0 0 0 0 0 0 895.184 1928.85 892.59 
-1534.09 0 0 0 0 0 1779.76 835.978 0 0 0 0 0 0 0 0 0 -2108.91 0 0 0 0 0 0 0 0 0 0 0 0 0 0 1766.79 0 0 0 0 469.909 0 0 0 0 0 0 2360.84 0 
0 0 0 0 0 0 2153.61 0 0 0 0 0.04 0 0 0 0 0 120.777 0 1012.22 0 1169.7 0 0 0 0 0 0 0 0 0 0 -751.9 0 0 0 0 1774.73 0 0 0 -787.149 0 0 0 0 
0 0 0 1392.33 0 0 -711.31 0 0 0 0 0 0.02 0 0 0 0 0 1912.82 0 0 0 0 0 0 0 0 1278.5 0 0 0 1281.09 0 0 0 0 0 0 0 0 0 0 0 0 0 0 
0 0 0 0 0 592.746 592.746 0 0 0 0 0 0 0.08 0 1736.88 0 0 0 0 0 0 0 0 0 0 0 0 0 0 0 0 0 0 0 0 0 0 0 0 0 0 0 0 0 0 
0 0 0 817.972 0 0 0 0 0 0 0 0 0 0 0.04 0 0 0 0 0 0 0 0 0 0 0 0 953.475 0 0 0 0 0 0 0 0 0 0 0 2021.16 0 0 0 1110.03 0 0 
0 0 0 0 0 0 -2247.61 -1401.33 0 0 0 0 0 255.516 0 0.06 0 0 0 0 0 0 1300.01 -1029.92 0 -176.321 0 2238 0 0 0 0 0 0 0 833.995 0 0 0 1800.52 0 0 0 0 0 0 
-2118.37 0 0 0 0 411.618 0 0 0 0 0 0 0 0 0 0 0.01 0 0 0 0 0 0 0 0 0 0 0 0 0 0 0 0 0 366.756 2497.86 0 0 0 0 0 0 0 0 0 0 
0 0 0 0 0 0 0 0 0 0 -1188.16 2286.98 0 0 0 0 0 0 0 0 0 0 0 0 0 0 0 0 -385.983 0 0 0 0 0 0 0 0 0 0 0 0 2205.65 0 0 -6.63778 0 
0 0 0 0 0 0 0 0 0 0 0 0 2379.6 0 0 0 0 0 0.09 0 0 0 -192.038 1056.02 0 0 0 -2112.42 0 0 0 0 0 0 0 0 -938.673 2395.47 0 0 0 0 0 0 -2394.1 0 
0 0 0 0 0 0 0 -596.561 52.1104 0 0 636.387 0 0 0 0 0 0 0 0.04 0 0 1721.78 0 0 1525.24 0 725.044 0 0 0 0 0 1923.66 0 -2110.13 0 0 0 0 -653.783 0 0 550.783 0 0 
2264.7 0 0 0 0 1207.69 0 0 0 232.017 0 0 0 0 0 0 0 0 0 0 0.08 0 0 0 -706.885 297.632 1059.98 0 0 0 0 0 0 0 -856.12 0 0 0 0 0 0 0 0 0 -1607.64 0 
0 666.295 0 0 0 -2.97555 0 0 0 0 0 1808.76 0 0 0 0 0 0 0 0 0 0.03 0 0 0 0 0 892.59 0 0 0 0 0 0 0 0 0 0 0 0 0 1189.69 0 0 0 0 
-2002.24 0 0 0 0 -759.835 0 0 0 0 0 0 0 0 0 2414.4 0 0 58.8244 2407.83 0 0 0.05 2279.2 0 0 0 0 0 2142.93 0 0 0 0 0 0 0 1815.78 0 0 0 0 0 0 0 0 
0 0 0 0 0 0 0 0 513.55 0 0 0 0 0 0 -639.439 0 0 -2055.04 0 0 0 371.029 0.01 0 0 1503.27 0 0 0 0 0 0 -484.405 0 0 0 0 0 0 0 0 0 0 2469.02 0 
1744.06 0 0 0 0 0 0 -2297.81 0 0 0 0 0 0 0 0 0 0 0 0 335.627 0 0 0 0.04 0 0 0 0 0 0 0 0 0 0 0 0 0 1612.83 0 -221.335 0 0 0 0 0 
0 0 0 0 0 0 0 -490.661 0 0 0 0 0 0 0 1130.02 0 0 0 -1381.8 2477.42 0 0 0 0 0.02 0 -540.406 0 0 -486.389 1560.34 1605.66 0 0 0 2136.22 0 0 -2303 0 0 0 366.756 0 0 
2302.24 0 0 0 0 0 0 0 0 0 0 0 0 0 0 0 0 0 0 0 1926.86 0 0 -411.466 0 0 0.03 0 0 0 0 -136.952 0 0 -590.457 0 0 0 0 0 0 0 0 0 0 0 
0 0 0 0 0 -1432 1429.72 0 0 1485.41 0 0 231.712 0 -292.596 552.919 0 0 1808.45 -2302.7 0 2349.7 0 0 0 1689.28 0 0.07 0 0 0 0 -711.31 0 0 1839.58 0 0 0 0 0 0 0 -670.873 0 0 
0 -222.709 1491.82 0 0 0 -2437.28 0 0 0 0 0 0 0 0 0 0 1142.99 0 0 0 0 0 0 0 0 0 0 0.08 0 0 0 0 1473.2 0 1977.07 0 0 0 0 0 0 0 0 0 0 
-353.175 0 0 2152.09 0 -827.891 0 0 0 0 0 0 0 0 0 0 0 0 0 0 0 0 363.552 0 0 0 0 0 0 0.08 0 0 -747.475 0 0 0 0 0 0 0 0 0 0 0 0 0 
1947.61 0 0 0 2280.88 0 2075.33 0 0 0 0 0 0 0 0 0 0 0 0 0 0 0 0 0 0 -1319.7 0 0 0 0 0.04 0 0 0 0 0 0 173.879 0 0 0 1641.67 0 0 0 0 
0 1777.02 0 0 0 2358.85 0 0 0 0 0 0 -863.903 0 0 0 0 0 0 0 0 0 0 0 0 -1680.27 -2108.6 0 0 0 0 0.07 0 0 0 0 0 -146.565 0 0 0 0 2037.8 0 0 0 
0 0 0 202.261 0 0 0 0 0 0 1483.28 1630.22 0 0 0 0 0 0 0 0 0 0 0 0 0 -402.31 0 544.069 0 -851.238 0 0 0.02 0 0 0 0 0 0 0 0 0 178.152 0 0 0 
2027.42 0 0 0 -566.652 0 0 0 0 0 0 0 0 0 0 0 0 0 0 266.808 0 0 0 1530.43 0 0 0 0 -2180.17 0 0 0 0 0.09 0 0 1263.85 0 0 0 0 0 0 0 0 0 
0 0 0 0 0 0 -614.261 1576.36 0 0 0 0 0 0 0 0 -2145.38 0 0 0 1872.39 0 0 0 0 0 1075.4 0 0 0 0 0 0 0 0.06 0 0 -1542.48 0 0 0 184.713 0 0 0 0 
0 0 0 0 0 0 0 0 669.805 0 0 0 0 0 0 1039.38 52.8733 0 0 -2438.2 0 0 0 0 0 0 0 2319.48 -1529.36 0 0 0 0 0 0 0.07 0 0 0 0 0 0 0 0 0 0 
0 0 0 0 0 0 0 0 0 0 0 0 0 0 0 0 0 0 -295.953 0 0 0 0 0 0 930.128 0 0 0 0 0 0 0 2442.78 0 0 0.03 1992.32 0 0 -645.238 0 0 0 138.936 0 
-1397.82 0 0 0 0 0 0 0 0 0 -430.082 2038.87 0 0 0 0 0 0 241.478 0 0 0 1053.58 0 0 0 0 0 0 0 -716.346 -1636.78 0 0 1142.69 0 1551.94 0.04 0 0 0 0 0 1282.77 0 0 
0 0 0 0 0 0 0 0 0 0 0 0 0 0 0 0 0 0 0 0 0 0 0 0 2163.84 0 0 0 0 0 0 0 0 0 0 0 0 0 0.04 0 0 0 0 0 0 0 
0 0 0 0 878.246 0 63.4022 0 0 0 0 0 0 0 2355.95 1577.73 0 0 0 0 0 0 0 0 0 2236.17 0 0 0 0 0 0 0 0 0 0 0 0 0 0.05 0 0 515.839 0 0 0 
0 0 -1317.1 0 0 0 0 1515.47 0 0 0 0 0 0 0 0 0 0 0 791.269 0 0 0 0 44.1755 0 0 0 0 0 0 0 0 0 0 0 -1704.38 0 0 0 0.01 0 0 0 1904.74 0 
0 0 0 73.6259 0 1348.54 0 0 0 0 0 571.535 0 0 0 0 0 -2306.82 0 0 0 2011.4 0 0 0 0 0 0 0 0 -1367.46 0 0 0 1938 0 0 0 0 0 0 0.09 0 0 2130.57 0 
0 0 857.036 2081.59 0 0 0 0 0 0 0 0 0 0 0 0 0 0 0 0 0 0 0 0 0 0 0 0 0 0 0 542.085 -1139.94 0 0 0 0 0 0 -323.878 0 0 0.05 0 0 0 
0 0 0 0 0 0 0 0 0 -2285.45 0 0 0 0 1760.69 0 0 0 0 474.792 0 0 0 0 0 941.267 0 1372.49 0 0 0 0 0 0 0 0 0 -1141.62 0 0 0 0 0 0.02 0 0 
0 -584.048 0 970.565 0 0 0 0 0 1223.26 1701.79 0 0 0 0 0 0 -1451.08 -1082.11 0 853.832 0 0 -1109.12 0 0 0 0 0 0 0 0 0 0 0 0 2379.15 0 0 0 1865.67 -1763.89 0 0 0 0 
0 0 0 0 0 0 0 0 0 2002.7 0 0 0 0 0 0 0 0 0 0 0 0 0 0 0 0 0 0 0 0 0 0 0 0 0 0 0 0 0 0 0 0 0 0 0 0.08 
