*Vertices 57
*Matrix 
0.04 0 2288.51 1304.74 0 0 0 0 0 0 706.732 0 0 2109.36 680.792 0 -1380.12 0 0 -1946.39 171.743 0 0 -1043.81 1612.06 -2333.06 143.666 1732.15 1439.79 0 0 0 0 0 -635.472 1405.15 0 869.091 0 0 0 0 1946.85 0 0 0 0 0 0 0 0 0 0 0 0 0 254.601 
0 0.02 0 60.5029 0 0 0 0 0 0 0 0 2449.95 0 0 0 -1430.78 0 0 0 0 0 727.18 -2198.32 2497.41 0 1421.63 1231.35 0 0 2131.18 0 0 0 0 0 0 0 0 0 -2385.56 0 -1159.17 0 0 -1592.38 0 1027.48 0 0 -853.984 0 0 0 -207.602 0 0 
2190.39 0 0.08 0 2262.26 0 0 0 -1137.04 0 0 0 0 0 -248.802 0 0 0 0 -1016.65 0 0 1599.86 0 0 0 -160.756 0 2102.8 0 0 0 181.509 0 0 0 0 0 0 -632.115 0 0 838.878 0 0 0 0 0 0 1916.64 0 1158.86 0 0 0 0 -898.694 
541.017 2354.27 0 0.03 -1932.2 2256.16 0 0 -364.467 0 2418.06 0 0 540.101 0 0 -145.497 475.86 0 0 939.436 0 1382.26 0 -1088.82 0 1142.08 0 -958.205 0 0 0 1225.7 1846.29 -1105.15 0 0 0 0 0 0 0 0 0 0 0 0 0 1506.16 -507.904 0 -1362.58 0 0 0 0 0 
0 0 2382.96 -410.855 0.03 0 0 0 0 0 0 0 484.1 0 0 0 0 2213.13 1404.69 0 0 0 1151.23 961.257 0 0 0 0 2297.97 0 0 0 323.725 0 0 0 0 1683.63 -391.781 0 0 0 -427.335 899.915 0 0 0 0 0 0 0 0 0 0 0 0 0 
0 0 0 1898.79 0 0.01 0 0 0 1323.66 0 305.261 0 2089.37 -1576.97 0 0 2155.14 0 0 0 597.476 0 0 0 0 0 -239.952 0 1764.05 0 2183.37 -615.177 0 0 0 0 -722.602 0 780.587 0 302.667 2352.75 -1145.28 0 0 -1515.17 0 0 -384.304 0 0 0 -1553.01 0 0 0 
0 0 0 0 0 0 0.05 0 0 0 0 0 0 0 0 0 300.684 34.8674 2012.77 0 0 1630.68 0 1632.82 1988.05 0 -2224.11 0 0 -1666.39 0 136.952 0 -1134.3 0 1848.43 0 0 0 0 0 0 0 -613.804 0 0 -1163.14 0 0 0 -798.593 1021.84 0 0 0 0 0 
0 0 0 0 0 0 0 0.07 785.165 0 0 0 0 0 0 0 0 0 0 0 1279.11 0 0 0 0 0 0 -1735.82 0 787.301 462.737 19.9133 -972.091 0 0 -834.3 2422.48 1621.83 0 1678.59 0 0 -125.202 0 0 -151.296 0 0 0 -1424.22 2447.81 0 1153.22 1466.49 0 0 1159.02 
0 0 427.641 1350.37 0 0 0 -193.869 0.01 -2018.27 0 0 0 0 0 0 0 0 509.735 -2429.2 430.998 0 -1324.12 0 203.177 0 0 -127.796 0 193.106 0 0 0 0 0 0 0 1947 -235.069 0 0 -2333.67 0 2132.56 2232.66 0 0 0 0 0 0 0 0 0 0 0 0 
0 0 0 0 0 927.076 0 0 180.593 0.02 0 0 0 0 0 365.841 1402.55 0 1614.35 0 0 617.618 -1807.54 -2068.32 0 0 0 0 0 0 0 0 0 0 0 1993.24 0 -2443.85 0 -146.107 2438.35 0 0 0 1238.67 0 0 302.667 0 -183.035 -875.652 575.35 0 401.395 2437.13 0 0 
2414.7 0 0 -2480.32 0 0 0 0 0 0 0.06 0 0 -2337.49 0 0 0 -187.002 0 -669.042 0 -1795.48 0 -596.561 0 0 0 0 0 0 0 0 0 0 0 0 0 -146.107 0 0 0 2372.28 0 0 0 0 1875.29 639.897 0 1280.48 0 2005.29 2051.23 -1141.32 0 0 0 
0 0 0 0 0 -1475.34 0 0 0 0 0 0 0 0 1900.46 0 0 0 0 0 -276.116 0 0 1438.87 0 0 0 0 -381.1 0 0 -558.412 0 -903.272 0 0 0 893.048 0 1300.93 0 0 0 0 0 0 0 0 0 2455.6 0 1610.08 0 0 0 0 1401.79 
0 2184.44 0 0 291.528 0 0 0 0 0 0 0 0.01 0 0 0 0 1913.59 1480.07 0 758.003 0 0 0 0 0 0 0 0 0 -1224.63 893.811 0 1088.98 0 15.6407 353.328 0 0 0 -65.3859 1031.91 0 0 1491.82 1914.35 0 0 0 0 0 0 0 2262.87 0 0 0 
2129.05 0 0 1903.97 0 -619.755 0 0 0 0 -962.477 0 0 0 1820.51 0 0 -668.432 2434.54 0 0 0 0 0 938.215 0 -1805.09 0 0 0 0 0 0 0 0 1170.16 993.454 1519.9 1972.95 0 278.558 -1126.06 0 0 0 0 0 0 -1924.57 0 0 928.297 0 0 0 2053.97 0 
-788.522 0 -835.063 0 0 -611.82 0 0 0 0 0 1148.79 0 1430.02 0.05 0 2264.09 0 0 0 0 0 2082.51 0 0 -1488.62 0 0 0 0 0 0 0 0 1600.92 0 0 0 -935.163 0 0 0 1926.25 0 535.066 -2496.8 0 0 0 0 0 0 0 981.857 0 0 0 
0 0 0 0 0 0 0 0 0 1748.63 0 0 0 0 0 0.04 0 0 0 0 0 2225.33 -678.808 0 0 -100.635 0 -50.5844 0 0 -1682.71 0 0 0 0 0 0 0 0 0 909.375 1254.84 0 0 0 0 0 0 0 0 0 0 491.729 0 0 0 0 
-391.324 1832.87 0 477.233 0 0 -1004.75 0 0 1810.59 0 0 0 0 1972.64 0 0.04 0 0 -1388.52 -1932.51 0 0 0 0 0 0 0 0 -1310.69 0 351.039 215.232 1003.52 0 0 0 0 0 0 0 0 1954.02 0 0 0 0 0 -1178.24 0 -1296.35 0 0 0 0 0 0 
0 0 0 1161.76 2079.76 -226.829 68.4378 0 0 0 2361.9 0 1166.8 742.439 0 0 0 0.05 0 537.507 0 0 0 0 0 1065.02 0 0 243.156 -37.3089 1095.69 0 0 0 0 0 1126.51 0 -996.2 0 489.135 0 0 0 0 0 0 610.141 0 0 0 0 0 0 0 -573.824 0 
0 0 0 0 1541.57 0 -1691.26 0 643.406 -1852.4 0 0 306.177 -1531.34 0 0 0 0 0.06 0 1784.65 0 2194.97 0 0 0 0 -1157.03 0 -239.799 0 0 0 0 0 0 0 0 0 -332.575 0 0 334.864 -756.935 0 -2090.29 0 2411.04 0 0 2184.44 0 0 0 1295.13 0 0 
2399.75 0 2222.28 0 0 0 0 0 1786.94 0 438.017 0 0 0 0 0 46.617 644.322 0 0.04 0 0 0 0 0 0 0 -2423.4 0 0 440.764 0 0 0 0 0 -1814.4 0 0 0 0 0 816.599 0 0 0 1551.18 1321.68 0 -280.541 -1515.78 0 0 0 0 0 0 
-987.503 0 0 -1716.59 0 0 0 -1234.86 2215.11 0 0 1406.52 -1681.19 0 0 0 1734.75 0 529.267 0 0.06 0 0 0 -1190.15 0 0 0 0 0 0 0 74.8466 1764.2 0 0 0 0 664.922 966.597 0 0 -1583.07 0 0 626.469 0 853.679 1603.67 0 0 0 0 -304.193 0 0 0 
0 0 0 0 0 -1773.66 2458.19 0 0 509.583 -1517.3 0 0 0 0 -320.521 0 0 0 0 0 0.04 0 2260.89 0 0 0 0 0 2174.21 -2433.62 0 843.913 0 0 0 -1589.02 0 0 0 0 0 1980.42 0 365.535 253.075 0 0 2004.68 -2166.43 0 0 2223.5 -1289.94 -2393.49 0 0 
0 -2079.3 -729.469 -1457.64 -1800.67 0 0 0 2142.32 946.76 0 0 0 0 558.412 -2062.21 0 0 811.106 0 0 0 0.08 0 0 1321.53 0 0 -214.164 0 0 857.494 0 782.418 0 0 0 0 0 0 0 0 0 0 0 0 0 0 0 0 0 0 1012.22 890.912 0 0 0 
-1681.65 783.181 0 0 -521.027 0 1548.89 0 0 322.962 -1234.24 -1311.61 0 0 0 0 0 0 0 0 0 -725.654 0 0.03 0 601.138 0 1146.2 1024.28 1910.23 0 0 0 0 0 0 0 0 0 0 0 0 0 0 0 -2395.02 0 0 -1303.98 1695.38 0 0 0 0 2401.27 0 0 
-2335.66 960.799 0 1261.25 0 0 974.685 0 1706.37 0 0 0 0 617.161 0 0 0 0 0 0 295.343 0 0 0 0.08 0 1447.87 1709.11 92.0896 0 0 0 890.912 0 0 0 0 0 0 0 0 0 702.002 109.18 0 0 0 0 1076.77 0 1336.94 0 0 468.841 0 0 0 
-689.489 0 0 0 0 0 0 0 0 0 0 0 0 0 1718.27 2312.46 0 -676.977 0 0 0 0 2476.81 2171.32 0 0.02 0 279.778 0 0 0 0 0 0 -176.626 0 0 0 1834.7 0 -1283.23 0 0 0 0 0 0 0 2222.59 0 0 0 0 0 683.386 2412.87 0 
565.127 -2217.55 2057.79 1871.93 0 0 2149.34 0 0 0 0 0 0 -603.58 0 0 0 0 0 0 0 0 0 0 1150.17 0 0.09 2186.73 514.008 0 0 0 0 0 0 -1374.02 0 0 0 0 -152.516 0 0 0 1697.82 0 0 -1636.33 0 0 0 0 0 -512.329 0 0 0 
-1275.6 -512.635 0 0 0 358.974 0 30.2896 -1592.53 0 0 0 0 0 0 1939.83 0 0 1112.78 -504.242 0 0 0 -651.189 2228.39 -965.224 1932.51 0.09 0 0 0 -1312.37 933.18 -760.75 0 514.161 0 0 0 0 -1254.69 0 0 -92.2422 0 0 0 -2325.43 1781.29 0 0 0 1345.94 0 0 1788.46 0 
-504.7 0 -1100.27 -1099.2 1095.54 0 0 0 0 0 0 743.66 0 0 0 0 0 -2250.97 0 0 0 0 -1088.06 -216.453 898.083 0 -2463.38 0 0.08 0 0 0 0 0 0 -295.801 974.532 0 0 0 0 0 2019.33 0 0 0 0 1193.96 1238.67 0 0 0 0 1901.68 1610.84 0 0 
0 0 0 0 0 2230.98 -649.205 1265.83 1992.02 0 0 0 0 0 0 0 -2284.84 235.527 67.8274 0 0 -549.562 0 2435.45 0 0 0 0 0 0.05 -667.974 0 0 0 0 0 0 0 0 0 -180.135 -21.2867 1593.45 0 0 0 0 0 0 2213.89 0 0 0 -235.221 0 0 0 
0 -233.085 0 0 0 0 0 -1356.62 0 0 0 0 762.429 0 0 1745.12 0 1418.27 0 2287.29 0 -1874.22 0 0 0 0 0 0 0 -1726.97 0.05 -760.445 2312.46 0 0 1742.38 0 759.987 -2442.32 0 0 2008.96 -709.021 0 -1447.72 0 -970.107 178.152 0 0 0 2009.57 0 0 0 2149.19 0 
0 0 0 0 0 1625.8 -2490.84 485.473 0 0 0 1018.48 1651.74 0 0 0 2222.43 0 0 0 0 0 1158.56 0 0 0 0 2369.69 0 0 -870.617 0.07 0 0 -2015.98 0 -1809.67 0 0 1403.32 0 0 0 0 234.153 0 -663.244 -1752.3 0 0 1529.21 -1357.08 0 0 0 0 0 
0 0 -861.614 1943.04 -1020.77 1761.6 0 1036.64 0 0 0 0 0 0 0 0 2281.95 0 0 0 1748.18 -1933.27 0 0 -55.1622 0 0 1403.01 0 0 -343.104 0 0.08 0 0 0 0 0 0 0 0 2243.34 -1750.31 0 0 -1110.8 100.635 0 0 0 0 0 -2277.21 0 0 -1361.2 0 
0 0 0 1213.19 0 0 602.512 0 0 0 0 2290.8 2273.55 0 0 0 2024.37 0 0 0 949.507 0 1744.36 0 0 0 0 1309.93 0 0 0 0 0 0.04 0 0 0 0 0 187.918 0 0 596.103 0 0 0 0 -2023.15 720.161 0 0 0 0 0 0 0 0 
2301.17 0 0 2352.75 0 0 0 0 0 0 0 0 0 0 212.485 0 0 0 0 0 0 0 0 0 0 1639.23 0 0 0 0 0 1118.58 0 0 0.09 0 198.447 155.873 0 -403.531 500.732 130.848 0 0 1972.18 0 0 0 0 0 1377.68 -497.833 832.621 0 0 0 0 
-1967.6 0 0 0 0 0 2198.48 8.92666 0 2220.91 0 0 -2308.19 1772.9 0 0 0 0 0 0 0 0 0 0 0 0 1161.31 479.064 -2100.36 0 383.389 0 0 0 0 0.01 -94.8363 -2472.08 1.90741 0 0 0 1966.23 0 0 0 0 2026.51 0 2091.66 0 0 0 0 0 0 0 
0 0 0 0 0 0 0 -2313.99 0 0 0 0 1548.89 2265.01 0 0 0 1448.48 0 1802.96 0 276.421 0 0 0 0 0 0 -1969.89 0 0 2455.75 0 0 348.75 1694.16 0.03 -1162.98 0 1488.46 1695.99 0 0 0 -217.978 0 0 0 0 0 0 0 0 0 605.564 0 0 
1936.93 0 0 0 1724.98 -1416.14 0 540.712 -1862.16 1770.61 1996.14 2172.54 0 -2122.18 0 0 0 0 0 0 0 0 0 0 0 0 0 0 0 0 64.7755 0 0 0 338.679 -504.547 828.349 0.09 558.718 0 0 0 0 0 0 0 1629.92 0 -2207.63 -336.085 -618.839 0 1975.84 0 0 -2427.37 -1459.78 
0 0 0 0 639.439 0 0 0 2262.41 0 0 0 0 1040.91 1284.75 0 0 -1321.99 0 0 2216.18 0 0 0 0 1135.82 0 0 0 0 -1625.64 0 0 0 0 2010.03 0 76.0674 0.01 0 0 -1430.48 0 0 357.906 0 0 0 0 -412.534 0 -1659.37 0 0 0 -1500.67 0 
0 0 2070.45 0 0 1651.74 0 1637.39 0 -1477.17 0 1646.86 0 0 0 0 0 0 1046.25 0 -2054.89 0 0 0 0 0 0 0 0 0 0 2150.72 0 340.51 852.916 0 2350.61 0 0 0.01 0 0 0 0 0 1169.85 190.512 36.6985 -1715.06 0 0 0 0 0 0 0 0 
0 1564.61 0 0 0 0 0 0 0 771.279 0 0 -853.374 -478.149 0 1953.11 0 -1291.77 0 0 0 0 0 0 0 -2138.36 533.845 264.824 0 -1130.48 0 0 0 0 -1292.38 0 1734.75 0 0 0 0.04 0 0 -546.968 0 1718.12 -1472.14 0 0 0 0 0 0 2478.64 -1312.37 0 0 
0 0 0 0 0 223.167 0 0 1944.41 0 1609.62 0 -1730.32 -1148.79 0 2198.17 0 0 0 0 0 0 0 0 0 0 0 0 0 -1073.41 1223.87 0 -140.919 0 2071.37 0 0 0 -1911.76 0 0 0.07 0 0 0 -1361.81 0 2499.54 -139.393 0 0 0 2136.98 0 2291.71 -806.223 0 
244.682 1878.8 -2442.78 0 852.611 333.491 0 -760.598 0 0 0 0 0 0 1748.94 0 -2484.74 0 1690.19 1438.57 1979.81 -1278.5 0 0 1012.38 0 0 0 1128.5 -276.116 2411.04 0 -734.657 1301.39 0 106.586 0 0 0 0 0 0 0.01 0 0 0 0 0 976.058 0 0 0 0 -2180.62 0 0 0 
0 0 0 0 2402.8 2269.13 -1591.01 0 -1044.11 0 0 0 0 0 0 0 0 0 -453.887 0 0 0 0 0 1824.78 0 0 952.406 0 0 0 0 0 0 0 0 0 0 0 0 2317.96 0 0 0.09 0 0 1696.6 0 0 0 0 0 0 0 0 0 0 
0 0 0 0 0 0 0 0 -1885.97 1474.43 0 0 1855.91 0 2133.63 0 0 0 0 0 0 -23.5755 0 0 0 0 1835.31 0 0 0 1503.88 -1291.01 0 0 -2485.2 0 -1835.76 0 -1753.67 0 0 0 0 0 0.01 2294.15 0 0 2390.13 -1823.25 0 2368.01 0 107.501 -1118.88 0 0 
0 1524.63 0 0 0 0 0 -2338.25 0 0 0 0 2256.31 0 -350.887 0 0 0 1756.11 0 2374.87 1015.88 0 -942.03 0 0 0 0 0 0 0 0 1454.44 0 0 0 0 0 0 212.333 -2098.68 -579.47 0 0 1041.52 0.05 -1324.88 0 0 0 -646.611 0 0 0 0 0 0 
0 0 0 0 0 1498.08 -1920.91 0 0 0 -763.192 0 0 0 0 0 0 0 0 1723.76 0 0 0 0 0 0 0 0 0 0 1570.71 869.091 2459.87 0 0 0 0 -1488.31 0 2214.5 355.159 0 0 844.981 0 -1097.83 0.08 0 0 0 0 -89.9533 0 828.806 0 110.553 0 
0 1029.62 0 0 0 0 0 0 0 -788.369 -99.1089 0 0 0 0 0 0 -1534.7 1769.08 2030.93 1712.78 0 0 0 0 0 1701.79 -1238.06 -72.8629 0 1130.18 -13.657 0 -749.458 0 987.808 0 0 0 -752.205 0 -1727.42 0 0 0 0 0 0.08 0 0 0 0 -1118.88 0 0 0 960.494 
0 0 0 -1148.03 0 0 0 0 0 0 0 0 0 1268.58 0 0 1188.92 0 0 0 1635.87 -288.018 0 1002.15 414.823 -352.565 0 2059.77 -1801.43 0 0 0 0 -1541.57 0 0 0 1096.76 0 1245.69 0 967.818 -1484.34 0 780.587 0 0 0 0.02 1403.16 0 0 0 0 382.778 0 0 
0 0 -177.541 1002.76 0 2049.55 0 2123.1 0 -1703.92 517.518 1955.85 0 0 0 0 0 0 0 -2097.77 0 1136.89 0 -183.645 0 0 0 0 0 2305.44 0 0 0 0 0 -2365.72 0 -953.78 -1630.07 0 0 0 0 0 1461.3 0 0 0 -1246.76 0.06 0 0 0 0 0 0 0 
0 2069.84 0 0 0 0 -1648.84 -369.503 0 -558.26 0 0 0 0 0 0 2131.03 0 219.047 -1559.57 0 0 0 0 -2129.51 0 0 0 0 0 0 -385.372 0 0 1141.32 0 0 -1039.23 0 0 0 0 0 0 0 1797.92 0 0 0 0 0.09 0 1142.08 0 0 0 0 
0 0 1521.42 1275.9 0 0 -833.689 0 0 2477.87 300.073 998.184 0 -57.7563 0 0 0 0 0 0 0 0 0 0 0 0 0 0 0 0 1799.75 382.321 0 0 1049.76 0 0 0 -452.513 0 0 0 0 0 2014.6 0 -421.384 0 0 0 0 0.08 0 0 0 1516.54 1112.93 
0 0 0 0 0 0 0 459.532 0 0 1840.34 0 0 0 0 2414.24 0 0 0 0 0 783.792 -278.558 0 0 0 0 -912.732 0 0 0 0 1576.36 0 867.26 0 0 -652.409 0 0 0 -746.559 0 0 0 0 0 2296.44 0 0 -2315.97 0 0.05 888.623 0 0 0 
0 0 0 0 0 -1647.77 0 -134.51 0 -538.728 2039.63 0 783.029 0 -2328.18 0 0 0 0 0 2324.67 2421.11 -1627.93 0 -712.226 0 1660.44 0 2144.76 696.814 0 0 0 0 0 0 0 0 0 0 -1665.47 0 1221.73 0 1342.74 0 -424.284 0 0 0 0 0 2177.88 0.08 0 0 0 
0 -1027.33 0 0 0 0 0 0 0 1246.3 0 0 0 0 0 0 0 0 -83.5444 0 0 -980.331 0 2496.19 0 997.574 0 0 -674.383 0 0 0 0 0 0 0 1338.47 0 0 0 -627.689 2144 0 0 66.9118 0 0 0 977.126 0 0 0 0 0 0 0 0 
0 0 0 0 0 0 0 0 0 0 0 0 0 1289.18 0 0 0 1845.99 0 0 0 0 0 0 0 -855.358 0 2006.67 0 0 1071.28 0 262.078 0 0 0 0 -1130.63 -434.202 0 0 -2490.08 0 0 0 0 -1451.69 0 0 0 0 -499.817 0 0 0 0.08 0 
70.4215 0 -714.515 0 0 0 0 1581.09 0 0 0 -2454.68 0 0 0 0 0 0 0 0 0 0 0 0 0 0 0 0 0 0 0 0 0 0 0 0 0 -2037.03 0 0 0 0 0 0 0 0 0 2164.3 0 0 0 1731.24 0 0 0 0 0.01 
