*Vertices 48
*Matrix 
0.02 0 -1827.98 0 418.638 0 703.833 0 -1829.2 0 0 0 0 0 0 919.599 1277.12 2258.9 0 0 0 0 2279.96 0 0 0 0 0 0 0 0 0 0 0 0 -2106.16 0 0 0 0 0 0 0 -1475.49 0 2337.18 0 0 
0 0.07 0 0 -16.5563 0 728.858 0 -256.127 0 2165.97 0 0 -1654.33 0 0 0 0 0 0 0 2425.69 -472.35 1954.18 0 0 0 0 0 0 0 0 0 0 0 0 721.839 -790.048 0 1418.27 0 0 0 0 0 0 0 0 
-1485.26 0 0.04 -1707.43 0 -11.2156 0 0 2055.65 -2216.33 0 505.768 0 -144.734 0 1891.46 0 0 84.1548 0 358.211 0 1059.68 450.377 0 0 0 0 0 0 0 0 0 0 0 0 0 0 0 2173.15 0 0 0 0 0 -1306.88 0 0 
0 0 384.457 0 0 0 1256.68 0 2265.77 0 1968.06 0 -1538.36 0 0 0 0 0 191.275 -620.212 0 0 2163.53 -1895.12 0 0 0 0 0 0 0 0 0 0 -924.787 1024.89 0 1442.99 0 0 0 0 0 0 0 0 0 0 
-1732.31 2108.6 0 0 0.04 0 0 -1633.27 0 0 1602.45 0 0 0 307.398 1780.37 0 202.567 0 0 0 1956.31 0 0 0 0 0 0 0 0 0 0 0 0 -1515.47 0 0 0 0 0 0 0 0 0 0 -1533.33 2429.2 0 
0 0 2235.4 0 0 0.09 91.4792 0 1712.47 -2497.25 170.827 1552.25 0 0 1905.8 0 0 0 -183.95 0 0 0 0 0 0 0 0 0 0 0 1832.56 0 0 0 0 0 0 0 0 0 0 0 0 0 0 0 0 0 
286.645 389.798 0 474.029 0 1436.43 0.03 0 0 0 2488.56 -322.657 0 0 1799.75 -442.9 0 370.418 0 0 0 -1954.48 0 -14.8778 0 0 -387.814 0 0 0 0 0 0 0 0 0 0 0 0 0 0 0 1255.15 0 0 0 0 0 
0 0 0 0 1497.31 0 0 0.03 0 0 0 0 0 2085.56 494.629 1540.65 0 0 -501.495 0 0 0 1170.61 433.897 0 0 0 0 -1276.21 0 0 0 0 1181.75 0 0 0 0 0 0 0 0 0 0 0 0 0 0 
-219.657 -1440.86 990.555 2324.52 0 -1055.25 0 0 0.02 0 0 0 0 0 0 0 0 0 0 2010.79 0 2281.95 0 143.513 0 0 0 397.58 0 0 0 0 0 0 -2112.72 0 0 0 0 0 2373.81 0 0 0 0 0 0 0 
0 0 927.381 0 0 -1961.96 0 0 0 0.08 0 92.3948 1607.03 0 378.964 460.295 -1020 0 -197.531 0 0 1500.37 0 2185.2 0 0 0 0 0 0 0 0 0 0 0 0 0 0 0 0 0 0 0 0 -844.371 0 0 -1557.89 
0 -396.512 0 1752.14 -1268.12 233.695 -639.439 0 0 0 0.08 0 0 0 0 0 0 0 1818.22 0 -895.947 0 1762.22 0 0 0 0 0 0 0 0 0 0 0 0 0 0 0 0 0 537.202 0 0 0 0 0 0 0 
0 0 -1904.43 0 0 -1670.2 -1947.16 0 0 1289.64 0 0 0 0 2138.05 0 0 0 0 2434.69 1420.56 0 0 0 0 0 0 0 0 0 0 0 0 0 0 0 0 0 0 0 0 0 0 0 0 0 0 0 
0 0 0 1114.31 0 0 0 0 0 2434.39 0 0 0.07 0 0 -232.78 0 0 0 2356.56 0 0 0 0 0 0 0 0 0 -1447.42 0 0 0 0 0 0 0 880.383 0 0 0 0 0 0 0 0 0 0 
0 -1461.61 1554.54 0 0 0 0 2445.37 0 0 0 0 0 0.05 0 0 -774.331 0 0 0 0 0 0 2265.77 0 0 0 0 1800.52 0 0 0 0 0 -1914.04 1458.25 0 0 0 -639.744 0 0 0 0 0 0 0 0 
0 0 0 0 1327.48 493.103 149.464 2021.77 0 317.927 0 -927.686 0 0 0 -171.133 0 0 0 0 2324.67 0 0 0 2295.37 0 0 0 -1127.74 0 117.42 0 0 0 0 0 0 0 0 -1910.23 0 0 0 0 0 0 0 0 
178.762 0 -2299.49 0 1639.07 0 914.411 628.758 0 1102.4 0 0 -709.326 0 1862.62 0.09 0 1234.4 0 0 0 0 0 0 0 -1164.36 0 0 0 0 1736.88 906.781 0 0 0 0 0 0 2005.14 0 630.741 418.79 0 -474.944 0 0 0 0 
2429.5 0 0 0 0 0 0 0 0 -1170.46 0 0 0 2305.29 0 0 0.02 0 0 -1233.18 0 0 -1561.71 931.654 0 0 0 0 0 0 0 -4.95926 0 0 0 0 0 0 0 0 -1728.64 0 0 0 0 2400.36 0 0 
1246.15 0 0 0 769.143 0 1877.12 0 0 0 0 0 0 0 0 -1447.11 0 0.05 0 0 813.395 0 0 2160.63 0 -768.38 0 0 0 -704.749 0 1538.82 0 0 0 0 0 0 0 0 0 0 0 0 0 0 0 0 
0 0 -1016.95 1955.09 0 -195.242 0 2153.92 0 2121.88 -2336.42 0 0 0 0 0 0 0 0.06 0 0 -2225.49 0 0 -232.627 1304.59 1295.43 0 0 0 0 0 2026.51 0 -1114.76 0 0 0 0 0 0 0 0 0 -2480.01 0 0 0 
0 0 0 741.066 0 0 0 0 2295.68 0 0 719.092 -1680.43 0 0 0 1143.76 0 0 0.05 0 0 200.43 1268.58 0 0 -1256.52 0 0 0 0 0 0 0 0 0 0 0 0 0 0 0 0 0 0 0 956.679 0 
0 0 2041.15 0 0 0 0 0 0 0 80.9503 -482.727 0 0 278.71 0 0 2460.02 0 0 0.04 1936.48 -95.1415 0 0 0 0 0 0 0 1939.38 0 0 1688.06 0 0 0 0 0 0 0 0 694.525 0 0 0 0 0 
0 339.9 0 0 7.24815 0 161.824 0 1238.82 1383.02 0 0 0 0 0 0 0 0 1975.54 0 1234.7 0.04 0 0 0 0 0 0 374.538 0 0 0 0 0 -826.06 0 0 0 0 0 0 -1312.83 0 0 0 -2432.1 0 0 
1183.89 1712.93 -870.464 1699.35 0 0 0 -761.971 0 0 -1049.46 0 0 0 0 0 792.947 0 0 -1391.11 -160.298 0 0.09 0 0 0 0 0 0 1320.15 0 0 -2328.79 0 0 0 0 0 0 0 1765.57 0 0 0 0 0 0 0 
0 1319.7 -1207.85 2446.59 0 0 865.581 2327.27 2340.08 838.572 0 0 0 -1419.95 0 0 -13.8096 -1376.92 0 -1998.73 0 0 0 0 0 0 0 0 0 0 0 0 0 0 0 0 0 1493.04 0 0 0 0 0 0 0 0 0 0 
0 0 0 0 0 0 0 0 0 0 0 0 0 0 1626.87 0 0 0 163.961 0 0 0 0 0 0.04 2032.3 0 898.389 0 0 0 0 1082.11 0 0 2201.38 0 0 737.251 0 0 414.518 -1233.94 0 632.572 0 0 0 
0 0 0 0 0 0 0 0 0 0 0 0 0 0 0 -96.3622 0 1597.26 2263.18 0 0 0 0 0 -480.285 0.05 0 0 0 1090.04 0 0 0 -2115.47 0 0 0 0 0 0 0 0 0 0 0 0 0 0 
0 0 0 0 0 0 1910.99 0 0 0 0 0 0 0 0 0 0 0 2057.18 1150.17 0 0 0 0 0 0 0.06 0 1534.85 0 0 0 0 0 0 0 0 500.885 0 0 0 0 0 0 0 0 -270.013 0 
0 0 0 0 0 0 0 0 -1111.26 0 0 0 0 0 0 0 0 0 0 0 0 0 0 0 1922.59 0 0 0.03 0 0 0 0 0 0 0 0 0 0 0 0 0 0 0 0 0 0 0 1586.43 
0 0 0 0 0 0 0 -1442.84 0 0 0 0 0 1000.32 1868.42 0 0 0 0 0 0 1843.85 0 0 0 0 2008.5 0 0.07 0 0 0 0 0 0 0 0 -1739.02 1070.82 0 0 0 0 -2300.41 0 0 0 0 
0 0 0 0 0 0 0 0 0 0 0 0 1782.51 0 0 0 0 1641.67 0 0 0 0 637.303 0 0 -896.405 0 0 0 0.02 -734.962 0 0 1524.02 0 0 0 0 0 1259.73 0 0 0 0 0 0 0 0 
0 0 0 0 0 36.5459 0 0 0 0 0 0 0 0 -1466.64 689.489 0 0 0 0 -467.925 0 0 0 0 0 0 0 0 358.058 0 0 1258.66 0 0 0 0 0 0 0 0 0 73.7785 0 0 0 0 0 
0 0 0 0 0 0 0 0 0 0 0 0 0 0 0 -443.052 391.629 2203.51 0 0 0 0 0 0 0 0 0 0 0 0 0 0.08 0 0 0 0 0 0 0 0 0 0 0 0 0 0 0 0 
0 0 0 0 0 0 0 0 0 0 0 0 0 0 0 0 0 0 -570.925 0 0 0 1603.21 0 1346.4 0 0 0 0 0 -326.472 0 0.01 0 0 0 0 0 0 0 -2282.86 0 0 0 0 0 1584.6 0 
0 0 0 0 0 0 0 2473.14 0 0 0 0 0 0 0 0 0 0 0 0 842.997 0 0 0 0 2201.53 0 0 0 -803.018 0 0 0 0.01 0 0 0 0 -2244.41 1788.61 0 0 121.235 0 0 -2332.91 0 0 
0 0 0 2404.02 -18.3874 0 0 0 533.692 0 0 0 0 1865.52 0 0 0 0 1441.77 0 0 -95.294 0 0 0 0 0 0 0 0 0 0 0 0 0.01 0 0 0 1714.91 0 2235.86 0 0 0 0 0 0 917.615 
2240.14 0 0 1458.1 0 0 0 0 0 0 0 0 0 -1844.92 0 0 0 0 0 0 0 0 0 0 836.283 0 0 0 0 0 0 0 0 0 0 0.01 2298.73 0 0 0 0 0 0 0 0 0 0 -501.801 
0 2334.74 0 0 0 0 0 0 0 0 0 0 0 0 0 0 0 0 0 0 0 0 0 0 0 0 0 0 0 0 0 0 0 0 0 805.46 0.02 0 0 0 0 0 0 1374.78 -1152.76 0 0 0 
0 -681.707 0 852 0 0 0 0 0 0 0 0 2033.07 0 0 0 0 0 0 0 0 0 0 -341.121 0 0 1944.72 0 2241.66 0 0 0 0 0 0 0 0 0.06 0 1368.07 0 0 0 0 0 0 0 0 
0 0 0 0 0 0 0 0 0 0 0 0 0 0 0 408.719 0 0 0 0 0 0 0 0 648.595 0 0 0 -35.3252 0 0 0 0 335.932 21.4393 0 0 0 0.02 0 0 0 0 0 0 0 0 0 
0 -857.494 2143.85 0 0 0 0 0 0 0 0 0 0 -2473.3 1263.54 0 0 0 0 0 0 0 0 0 0 0 0 0 0 1394.62 0 0 0 920.972 0 0 0 1433.99 0 0.01 0 0 0 0 0 0 0 0 
0 0 0 0 0 0 0 0 2468.87 0 1215.78 0 0 0 0 -1984.24 -997.116 0 0 0 0 0 1437.96 0 0 0 0 0 0 0 0 0 1543.24 0 722.144 0 0 0 0 0 0.07 0 0 961.867 -366.756 0 0 0 
0 0 0 0 0 0 0 0 0 0 0 0 0 0 0 2307.89 0 0 0 0 0 1726.81 0 0 1736.12 0 0 0 0 0 0 0 0 0 0 0 0 0 0 0 0 0.08 0 0 0 0 0 0 
0 0 0 0 0 0 2458.04 0 0 0 0 0 0 0 0 0 0 0 0 0 2271.72 0 0 0 -750.984 0 0 0 0 0 1048.08 0 0 -515.076 0 0 0 0 0 0 0 0 0.02 1303.22 0 -752.968 0 0 
-1487.24 0 0 0 0 0 0 0 0 0 0 0 0 0 0 1426.36 0 0 0 0 0 0 0 0 0 0 0 0 -1385.92 0 0 0 0 0 0 0 2461.09 0 0 0 67.8274 0 2176.2 0.02 0 0 0 0 
0 0 0 0 0 0 0 0 0 1030.08 0 0 0 0 0 0 0 0 256.584 0 0 0 0 0 1070.06 0 0 0 0 0 0 0 0 0 0 0 392.697 0 0 0 -1637.7 0 0 0 0.05 0 0 0 
1879.41 0 -505.463 0 2419.89 0 0 0 0 0 0 0 0 0 0 0 -783.639 0 0 0 0 -2227.47 0 0 0 0 0 0 0 0 0 0 0 1330.07 0 0 0 0 0 0 0 0 1010.24 0 0 0.06 0 0 
0 0 0 0 1032.82 0 0 0 0 0 0 0 0 0 0 0 0 0 0 1214.71 0 0 0 0 0 0 2149.8 0 0 0 0 0 409.635 0 0 0 0 0 0 0 0 0 0 0 0 0 0.04 -2149.65 
0 0 0 0 0 0 0 0 0 -1151.69 0 0 0 0 0 0 0 0 0 0 0 0 0 0 0 0 0 -484.558 0 0 0 0 0 0 551.088 2098.22 0 0 0 0 0 0 0 0 0 0 750.679 0.05 
