*Vertices 59
*Matrix 
0.08 0 0 1400.72 0 633.03 0 0 0 0 0 0 0 0 1967.91 0 0 0 -386.746 0 0 1077.84 0 288.934 0 2341.76 -14.5726 0 1692.94 0 0 0 0 1854.69 0 0 0 0 0 0 1327.63 0 0 0 0 0 0 0 0 0 -324.793 0 0 0 -1247.98 0 0 0 0 
0 0.05 0 0 0 0 1594.21 0 0 0 0 0 0 0 0 0 0 0 128.864 0 0 128.407 0 0 0 0 0 0 0 0 0 0 0 0 0 0 1724.07 0 0 0 0 0 0 0 0 0 0 0 0 0 0 0 0 0 0 -553.529 0 0 0 
0 0 0.03 0 0 0 0 0 572.604 0 0 0 0 0 0 0 1550.87 0 0 0 0 -1899.85 0 -782.418 -363.552 0 0 -931.349 0 0 0 0 0 0 0 0 0 0 0 0 0 0 0 0 0 787.301 0 2407.68 0 0 0 0 0 0 0 1335.72 -1910.08 0 0 
2076.86 0 0 0.02 1483.58 -2232.35 0 0 0 0 0 0 0 0 0 0 0 0 0 0 0 0 0 2238.15 0 709.937 1780.07 0 0 0 0 0 81.4081 0 0 0 0 0 0 0 0 0 0 0 2197.87 0 0 0 0 0 0 0 0 0 0 0 0 0 0 
0 0 0 667.669 0.03 0 0 0 0 0 0 2281.33 111.469 0 0 0 0 0 0 0 0 0 0 1471.68 0 0 0 0 0 0 216.91 0 1744.51 0 -2474.97 0 0 0 0 0 0 0 0 0 0 0 0 0 0 0 0 0 0 0 0 -2159.57 0 0 0 
2422.33 0 0 550.02 0 0.07 0 0 0 0 0 0 0 0 0 0 0 0 0 -607.852 0 0 -1170.92 0 1893.6 1910.08 0 0 0 532.014 0 0 0 0 0 -902.814 0 0 0 0 0 0 0 0 0 0 0 0 0 0 415.281 0 0 0 0 0 0 0 0 
0 636.998 0 0 0 0 0.03 0 1315.42 0 0 -623.875 0 0 0 0 0 1144.06 0 0 0 -1076.46 0 0 0 0 0 0 0 0 0 0 0 0 -2302.24 -668.737 0 1204.49 0 0 0 0 0 0 2424.01 0 0 0 0 0 0 0 0 0 0 281.152 2318.87 0 0 
0 0 0 0 0 0 0 0.03 0 0 0 0 0 1381.34 2033.98 0 0 0 0 0 898.389 0 0 0 1350.67 0 0 0 -1649.3 0 0 0 0 1338.92 0 0 0 -1076.16 0 0 0 1358.76 0 -859.478 91.174 0 0 0 0 1749.85 0 0 0 0 2222.13 88.7326 0 0 0 
0 0 1858.35 0 0 0 636.54 0 0.02 0 0 0 0 0 0 0 0 0 0 1743.14 0 0 0 0 0 0 0 0 0 0 0 0 0 0 -1647.01 0 0 0 -2456.51 0 0 0 0 0 0 0 0 0 0 1133.38 0 0 0 0 0 0 0 0 0 
0 0 0 0 0 0 0 0 0 0.08 0 0 0 0 0 0 0 0 0 0 0 0 0 0 873.974 0 0 0 0 1043.96 -797.83 0 0 0 0 0 0 2349.54 0 0 0 0 0 0 1570.1 0 0 0 0 0 0 0 0 0 1635.26 0 0 0 330.744 
0 0 0 0 0 0 0 0 0 0 0.07 0 0 2242.27 0 0 0 0 0 0 0 0 0 1131.55 -1654.79 0 0 0 0 0 0 0 0 0 0 0 0 0 0 0 0 -718.94 0 2429.5 0 0 0 0 0 -288.324 0 0 0 0 0 0 0 0 0 
0 0 0 0 1957.84 0 60.5029 0 0 0 0 0.01 0 0 0 0 0 0 0 0 0 0 0 0 -207.602 0 0 0 0 0 0 0 0 0 0 0 0 0 0 0 1446.2 0 0 0 0 0 2325.13 0 0 0 -1372.49 0 0 0 0 0 0 0 0 
0 0 0 0 120.472 0 0 0 0 0 0 0 0.08 0 0 0 0 0 0 0 0 0 0 0 0 0 0 0 0 0 0 0 0 0 0 2150.11 0 0 0 0 0 -2271.72 0 0 0 0 0 0 0 0 0 0 0 0 0 0 0 0 0 
0 0 0 0 0 0 0 703.07 0 0 1683.94 0 0 0.08 0 0 0 0 0 0 0 0 0 0 0 0 0 0 0 0 0 0 0 -218.894 0 0 0 0 0 0 0 0 0 0 0 -2257.84 0 0 0 0 0 0 0 0 0 0 0 0 0 
536.439 0 0 0 0 0 0 228.813 0 0 0 0 0 0 0.03 0 0 1934.95 136.494 0 0 0 0 1182.52 0 0 -1050.68 0 0 0 0 0 0 0 0 0 -1010.39 0 0 1894.97 -2246.54 0 2375.18 0 0 0 0 1725.14 0 0 0 0 0 0 1927.02 0 0 0 0 
0 0 0 0 0 0 0 0 0 0 0 0 0 0 0 0 0 0 0 0 0 0 0 0 0 931.501 963.088 0 0 0 0 0 0 0 0 0 0 0 0 0 0 0 0 0 0 0 0 0 0 0 0 0 0 0 0 0 0 0 0 
0 0 816.904 0 0 0 0 0 0 0 0 0 0 0 0 0 0.07 0 0 0 0 0 0 0 0 0 0 0 0 0 0 0 0 1034.5 0 0 0 0 2403.41 0 -288.324 0 0 0 461.974 0 0 0 0 0 0 0 -704.443 0 0 0 0 0 0 
0 0 0 0 0 0 852.611 0 0 0 0 0 0 0 2422.33 0 0 0.02 0 0 0 0 0 0 0 0 0 0 0 0 0 0 0 0 0 0 0 0 0 0 0 0 0 0 0 928.907 0 -1897.41 0 0 0 2375.33 0 2318.26 0 0 0 0 0 
1339.23 -1842.33 0 0 0 0 0 0 0 0 0 0 0 0 -94.8363 0 0 0 0.07 0 0 0 0 0 0 0 0 0 0 0 1785.87 0 0 0 0 0 0 0 0 0 0 0 0 0 0 0 2333.83 0 0 0 0 0 0 0 0 0 0 0 0 
0 0 0 0 0 284.967 0 0 1354.03 0 0 0 0 0 0 0 0 0 0 0.09 0 0 0 0 0 0 0 -932.264 0 0 0 0 0 0 0 0 0 1800.06 0 0 0 0 0 20.8289 0 0 0 0 435.575 0 0 0 0 0 0 0 -665.685 0 0 
0 0 0 0 0 0 0 1201.44 0 0 0 0 0 0 0 0 0 0 0 0 0.05 0 0 0 1938 0 0 80.0348 0 0 0 1557.44 0 0 0 0 0 0 0 -1246.76 0 0 0 -821.94 0 0 0 0 0 0 0 0 0 0 0 0 0 0 0 
-1749.24 744.118 748.085 0 0 0 1369.9 0 0 0 0 0 0 0 0 0 0 0 0 0 0 0.03 0 0 0 0 0 0 0 0 0 0 0 0 0 8.01111 0 0 0 0 0 0 0 1239.74 0 0 0 0 0 0 -1055.1 0 0 0 1663.34 0 0 0 0 
0 0 0 0 0 324.183 0 0 0 0 0 0 0 0 0 0 0 0 0 0 0 0 0.04 0 0 0 0 0 0 0 0 0 0 0 0 0 0 0 0 0 0 0 0 0 0 44.3281 0 0 -1974.62 0 663.244 0 0 0 0 2330.01 0 0 0 
-157.247 0 2263.18 -1198.23 1182.21 0 0 0 0 0 -414.518 0 0 0 771.889 0 0 0 0 0 0 0 0 0.06 0 0 0 0 0 0 0 0 0 0 0 0 0 0 0 0 0 0 0 0 0 0 0 449.767 -1332.36 0 0 2193.59 0 0 0 0 448.546 0 0 
0 0 284.204 0 0 1355.4 0 927.686 0 -683.386 -1198.69 492.95 0 0 0 0 0 0 0 0 -1816.84 0 0 0 0.02 0 0 0 1038.01 0 0 1890.39 0 0 0 0 0 0 0 0 0 -686.743 0 1152.76 0 0 -101.703 -259.789 0 39.2926 0 0 958.052 0 0 0 0 0 0 
1169.7 0 0 -852.611 0 347.072 0 0 0 0 0 0 0 0 0 318.537 0 0 0 0 0 0 0 0 0 0.07 0 -472.808 0 0 0 0 0 2169.94 0 0 0 0 0 0 0 0 0 0 -678.808 0 0 0 0 0 0 0 1121.48 0 0 0 0 0 0 
1772.29 0 0 2294 0 0 0 0 0 0 0 0 0 0 2053.97 -2028.79 0 0 0 0 0 0 0 0 0 0 0.03 0 0 0 0 1194.11 0 0 0 0 0 0 2111.96 0 0 0 0 0 0 0 798.288 0 0 1281.24 0 0 0 0 0 0 0 0 0 
0 0 -563.906 0 0 0 0 0 0 0 0 0 0 0 0 0 0 0 0 -373.318 2470.24 0 0 0 0 1260.8 0 0.07 0 0 0 0 0 0 0 0 1450.01 0 0 0 0 0 0 0 0 0 0 0 -218.894 0 0 0 0 0 825.449 0 0 0 0 
1566.59 0 0 0 0 0 0 -218.436 0 0 0 0 0 0 0 0 0 0 0 0 0 0 0 0 1357.23 0 0 0 0.06 0 0 -1148.03 0 0 0 -368.587 0 0 0 0 1932.51 0 0 0 0 0 0 0 0 0 0 0 0 0 0 0 0 0 0 
0 0 0 0 0 1492.74 0 0 0 504.7 0 0 0 0 0 0 0 0 0 0 0 0 0 0 0 0 0 0 0 0.09 1431.09 0 0 0 1097.52 0 0 0 0 0 0 0 0 0 0 0 0 0 0 0 0 0 0 0 0 0 0 0 0 
0 0 0 0 579.318 0 0 0 0 700.781 0 0 0 0 0 0 0 0 -2168.57 0 0 0 0 0 0 0 0 0 0 2327.88 0.06 797.678 0 0 0 0 0 0 0 0 0 0 0 0 0 0 0 920.972 0 0 0 2263.33 2180.47 0 0 -315.638 0 0 0 
0 0 0 0 0 0 0 0 0 0 0 0 0 0 0 0 0 0 0 0 -1602.91 0 0 0 -1140.71 0 -409.177 0 1101.95 0 2211.14 0.05 -672.704 0 0 0 0 1150.78 2176.2 0 0 -460.448 0 0 0 788.064 -684.454 0 327.235 0 0 0 -582.369 0 0 0 0 0 0 
0 0 0 -685.522 -1781.29 0 0 0 0 0 0 0 0 0 0 0 0 0 0 0 0 0 0 0 0 0 0 0 0 0 0 2081.13 0.01 0 0 0 0 0 0 0 0 0 0 0 0 499.817 2401.58 0 0 0 0 0 0 0 -1641.67 0 0 0 0 
2408.44 0 0 0 0 0 0 272.454 0 0 0 0 0 -1217 0 0 -1794.41 0 0 0 0 0 0 0 0 1076.92 0 0 0 0 0 0 0 0 0 0 0 0 0 0 1619.08 0 0 0 0 238.884 0 0 0 565.127 -1212.58 0 2417.75 0 0 0 0 0 0 
0 0 0 0 83.3918 0 -1947.46 0 -544.679 0 0 0 0 0 0 0 0 0 0 0 0 0 0 0 0 0 0 0 0 448.088 0 0 0 0 0.01 0 0 0 0 0 0 0 0 0 0 0 0 0 -914.106 0 0 2051.07 0 2331.39 0 0 1849.04 0 0 
0 0 0 0 0 1169.09 893.811 0 0 0 0 0 -197.378 0 0 0 0 0 0 0 0 -354.549 0 0 0 0 0 0 -795.236 0 0 0 0 0 0 0.06 0 0 0 1096.91 0 0 0 0 0 0 0 -2480.77 0 0 0 0 2238.46 0 0 0 0 0 0 
0 -464.415 0 0 0 0 0 0 0 0 0 0 0 0 2335.2 0 0 0 0 0 0 0 0 0 0 0 0 1140.55 0 0 0 0 0 0 0 0 0.03 0 0 0 0 0 0 0 0 0 0 0 0 0 0 0 2325.43 0 181.814 0 -416.807 0 0 
0 0 0 0 0 0 -921.43 -578.249 0 1258.35 0 0 0 0 0 0 0 0 0 -1174.12 0 0 0 0 0 0 0 0 0 0 0 724.281 0 0 0 0 0 0.05 0 0 0 0 -269.097 0 0 0 0 0 0 1341.06 0 0 0 0 0 149.159 0 0 0 
0 0 0 0 0 0 0 0 761.818 0 0 0 0 0 0 0 471.435 0 0 0 0 0 0 0 0 0 -155.568 0 0 0 0 2190.69 0 0 0 0 0 0 0.02 0 0 0 0 0 -2144 0 0 0 0 2195.58 0 -1512.73 0 0 0 0 0 0 0 
0 0 0 0 0 0 0 0 0 0 0 0 0 0 -172.506 0 0 0 0 0 415.891 0 0 0 0 0 0 0 0 0 0 0 0 0 0 -406.43 0 0 0 0.02 0 79.8822 0 -35.02 0 0 0 0 1407.9 0 0 0 0 465.026 -1491.97 0 0 0 0 
-144.429 0 0 0 0 0 0 0 0 0 0 -38.2244 0 0 -956.679 0 2008.35 0 0 0 0 0 0 0 0 0 0 0 1329.46 0 0 0 0 2179.56 0 0 0 0 0 0 0.08 -1715.37 -732.368 0 0 0 0 0 0 0 0 0 1510.9 0 0 0 0 0 0 
0 0 0 0 0 0 0 2024.37 0 0 1742.23 0 1099.66 0 0 0 0 0 0 0 0 0 0 0 1841.11 0 0 0 0 0 0 2023.15 0 0 0 0 0 0 0 854.9 63.4022 0.08 0 0 -30.2896 0 0 1620.76 0 0 0 0 0 0 0 0 0 0 0 
0 0 0 0 0 0 0 0 0 0 0 0 0 0 -1928.69 0 0 0 0 0 0 0 0 0 0 0 0 0 0 0 0 0 0 0 0 0 0 2360.53 0 0 169.607 0 0.09 0 -248.802 834.91 0 0 0 0 0 0 0 424.131 0 0 0 0 0 
0 0 0 0 0 0 0 285.119 0 0 2053.97 0 0 0 0 0 0 0 0 -2262.11 -1282.92 1955.7 0 0 1127.58 0 0 0 0 0 0 0 0 0 0 0 0 0 0 908.155 0 0 0 0.03 0 0 0 1947.61 -213.095 0 0 0 0 0 0 0 0 0 0 
0 0 0 2297.36 0 0 -1974.17 411.161 0 42.8022 0 0 0 0 0 0 -909.833 0 0 0 0 0 0 0 0 2339.17 0 0 0 0 0 0 0 0 0 0 0 0 325.556 0 0 1633.73 1406.52 0 0 -247.734 0 1926.56 0 0 0 0 0 0 0 968.734 0 0 0 
0 0 1342.74 0 0 0 0 0 0 0 0 0 0 -128.101 0 0 0 -841.472 0 0 0 0 2016.43 0 0 0 0 0 0 0 0 1906.87 -2254.94 -391.629 0 0 0 0 0 0 0 0 -248.344 0 614.414 0.06 0 0 0 -906.476 0 0 0 0 0 0 0 0 0 
0 0 0 0 0 0 0 0 0 0 0 -2169.94 0 0 0 0 0 0 521.943 0 0 0 0 0 -1486.33 0 244.224 0 0 0 0 1663.34 1510.74 0 0 0 0 0 0 0 0 0 0 0 0 0 0.07 0 914.106 0 0 0 0 0 0 0 0 0 0 
0 0 2259.51 0 0 0 0 0 0 0 0 0 0 0 1562.47 0 0 -2395.32 0 0 0 0 0 -897.473 -1755.5 0 0 0 0 0 -1421.02 0 0 0 0 2461.09 0 0 0 0 0 -1391.57 0 -503.479 2081.29 0 0 0.09 0 0 0 2223.96 0 0 0 0 0 0 0 
0 0 0 0 0 0 0 0 0 0 0 0 0 0 0 0 0 0 0 -1826.91 0 0 1762.06 -297.937 0 0 0 2404.17 0 0 0 2117.15 0 0 722.144 0 0 0 0 -605.869 0 0 0 -1665.01 0 0 2328.49 0 0.04 0 -222.251 0 0 0 0 249.718 0 0 0 
0 0 0 0 0 0 0 1839.12 -1394.77 0 1273 0 0 0 0 0 0 0 0 0 0 0 0 0 1927.63 0 -2221.37 0 0 0 0 0 0 -1469.08 0 0 0 2255.7 1028.86 0 0 0 0 0 0 2271.72 0 0 0 0.07 0 0 0 0 0 0 0 0 0 
-396.817 0 0 0 0 2037.95 0 0 0 0 0 2316.13 0 0 0 0 0 0 0 0 0 -1120.26 -654.546 0 0 0 0 0 0 0 0 0 0 1897.26 0 0 0 0 0 0 0 0 0 0 0 0 0 0 -2340.85 0 0.09 0 0 0 0 0 1543.7 0 0 
0 0 0 0 0 0 0 0 0 0 0 0 0 0 0 0 0 -106.433 0 0 0 0 0 -736.03 0 0 0 0 0 0 1823.71 0 0 0 1547.98 0 0 0 2273.09 0 0 0 0 0 0 0 0 -2366.63 0 0 0 0.09 0 0 0 1169.39 0 0 0 
0 0 0 0 0 0 0 0 0 0 0 0 0 0 0 0 2018.72 0 0 0 0 0 0 0 -1773.35 -76.5252 0 0 0 0 1009.32 465.789 0 1755.04 0 971.48 250.023 0 0 0 523.469 0 0 0 0 0 0 0 0 0 0 0 0.04 0 0 0 0 0 0 
0 0 0 0 0 0 0 0 0 0 0 0 0 0 0 0 0 -1109.27 0 0 0 0 0 0 0 0 0 0 0 0 0 0 0 0 2287.29 0 0 0 0 -2102.04 0 0 2434.08 0 0 0 0 0 0 0 0 0 0 0.03 0 0 0 0 0 
726.112 0 0 0 0 0 0 -994.217 0 2432.4 0 0 0 0 515.381 0 0 0 0 0 0 -307.092 0 0 0 0 0 2188.41 0 0 0 0 454.192 0 0 0 1089.89 0 0 5.11185 0 0 0 0 0 0 0 0 0 0 0 0 0 0 0.05 0 130.848 319.91 0 
0 -1676.46 26.4748 0 1642.89 0 1171.83 -96.2096 0 0 0 0 0 0 0 0 0 0 0 0 0 0 2303.92 0 0 0 0 0 0 0 -280.541 0 0 0 0 0 0 965.529 0 0 0 0 0 0 1937.09 0 0 0 -2105.24 0 0 -31.8155 0 0 0 0.03 0 0 0 
0 0 -1045.03 0 0 0 -1860.03 0 0 0 0 0 0 0 0 0 0 0 0 -2076.86 0 0 0 1457.49 0 0 0 0 0 0 0 0 0 0 400.479 0 2272.94 0 0 0 0 0 0 0 0 0 0 0 0 0 -746.101 0 0 0 1793.95 0 0.04 0 0 
0 0 0 0 0 0 0 0 0 0 0 0 0 0 0 0 0 0 0 0 0 0 0 0 0 0 0 0 0 0 0 0 0 0 0 0 0 0 0 0 0 0 0 0 0 0 0 0 0 0 0 0 0 0 82.3237 0 0 0.01 0 
0 0 0 0 0 0 0 0 0 55.7726 0 0 0 0 0 0 0 0 0 0 0 0 0 0 0 0 0 0 0 0 0 0 0 0 0 0 0 0 0 0 0 0 0 0 0 0 0 0 0 0 0 0 0 0 0 0 0 0 0.04 
