*Vertices 56
*Matrix 
0.05 -752.51 0 -769.448 0 0 0 0 0 949.965 0 1860.48 0 0 0 0 0 946.15 0 0 1497.92 0 241.935 0 639.744 0 0 0 0 0 -1063.8 0 0 0 0 0 0 1168.94 0 -1860.18 0 0 0 0 0 0 0 0 0 0 0 -32.1207 0 -1584.44 0 0 
1704.38 0.01 2297.66 2065.57 0 0 0 0 0 0 0 0 1578.8 0 0 0 0 0 0 0 0 -142.293 0 -1602.6 785.47 401.242 0 0 0 0 0 0 0 0 0 0 0 0 0 0 0 0 0 0 0 0 0 0 0 0 0 0 0 0 0 0 
0 1242.48 0.09 0 0 0 0 0 2283.62 0 0 0 0 1230.12 0 1441.31 1654.33 0 -877.789 1005.51 1999.95 0 1673.1 -1080.13 0 0 0 0 0 -1542.18 324.488 0 0 0 0 0 0 0 -255.669 0 0 0 0 0 0 -1307.34 -59.8926 0 0 0 0 0 -1200.37 0 0 0 
96.5148 1907.79 0 0.04 0 1867.5 0 0 0 0 0 0 0 829.417 0 0 -777.383 0 0 0 0 0 0 0 0 0 0 0 0 0 0 0 0 0 0 0 0 0 0 0 0 0 0 0 0 0 0 0 0 0 0 0 0 0 0 0 
0 0 0 0 0.05 0 0 0 0 0 2031.39 164.418 0 0 0 0 0 0 0 1867.2 0 0 1404.23 0 0 0 2383.72 0 0 0 0 0 0 0 0 0 0 0 0 0 0 0 0 0 0 0 0 0 0 0 0 0 0 0 -2480.16 0 
0 0 0 1063.49 0 0.06 -161.977 0 2329.55 0 0 0 0 -304.041 0 1808.3 0 2347.71 0 0 0 0 2123.4 0 0 0 1609.32 0 0 0 0 -1974.78 0 0 0 533.082 0 0 0 0 0 -949.355 0 0 0 0 0 0 0 0 0 0 0 0 0 0 
0 0 0 0 0 1773.96 0.01 0 0 0 0 1778.39 0 2495.88 -1891.77 0 999.252 0 0 1510.59 0 -953.932 0 -679.876 0 0 0 0 0 0 0 0 0 0 0 2081.44 0 0 0 0 0 0 0 1688.06 0 0 0 0 0 0 0 0 0 0 0 0 
0 0 0 0 0 0 0 0.01 0 0 0 0 0 2280.57 0 0 0 0 0 0 0 0 0 0 0 2392.27 2200 -485.931 0 0 -1505.55 0 0 0 0 0 0 -568.789 0 0 0 0 0 0 0 0 0 0 0 0 0 0 -1055.71 0 0 0 
0 0 1842.02 0 0 585.421 0 0 0.04 0 0 0 0 0 -508.82 1080.28 0 0 0 0 0 0 1446.35 0 0 0 -1654.18 0 0 405.667 0 0 392.544 0 0 2039.17 0 0 0 0 0 0 0 0 0 0 0 0 0 0 0 0 0 0 0 0 
2110.43 0 0 0 0 0 0 0 0 0.08 0 0 0 0 0 0 0 -1088.52 0 0 0 -360.5 2036.73 0 0 0 0 0 0 0 0 881.603 1097.37 0 0 0 0 0 0 0 0 0 0 0 0 0 0 -741.371 0 0 0 800.577 0 0 0 0 
0 0 0 0 -1686.22 0 0 0 0 0 0.09 0 0 0 0 0 1945.33 0 1930.98 0 -1042.44 0 1232.57 0 0 0 0 0 0 -1809.37 0 0 912.885 0 0 0 0 0 0 0 -1430.94 0 613.804 0 1642.43 0 0 0 0 0 0 0 0 0 -935.316 0 
1818.98 0 0 0 2473.6 0 114.673 0 0 0 0 0.08 0 0 0 0 1343.96 0 0 0 1040.15 0 0 0 0 -953.169 0 0 163.808 0 0 0 0 0 0 0 0 0 0 0 0 -507.599 0 0 0 0 0 0 0 0 0 0 0 -957.442 0 209.281 
0 301.599 0 0 0 0 0 0 0 0 0 0 0.05 1180.38 -579.165 0 0 0 2174.83 0 0 0 0 0 0 0 0 0 0 0 2167.04 0 0 0 0 0 0 1621.07 0 0 1155.2 0 0 0 2411.5 0 -915.021 0 0 0 0 0 2219.99 0 0 0 
0 0 -379.116 1539.43 0 -676.977 1404.39 -812.937 0 0 0 0 -1681.19 0.02 -25.7118 0 0 0 0 0 0 -367.824 0 0 639.744 0 2276.91 0 80.1874 0 479.98 0 0 0 0 0 0 0 0 0 0 0 0 0 0 0 0 0 0 0 0 0 0 0 0 0 
0 0 0 0 0 0 -408.261 0 771.126 0 0 0 -72.7104 1986.53 0.09 0 293.054 0 0 0 -1912.52 2335.2 -314.875 0 0 0 0 0 0 0 0 1420.71 1959.97 0 0 0 0 0 0 2475.74 0 0 0 -999.1 0 0 0 0 0 0 0 -2429.96 0 0 0 0 
0 0 -1694.31 0 0 -113.453 0 0 1850.87 0 0 0 0 0 0 0.05 0 2002.55 0 0 0 0 0 2187.34 -968.276 0 0 0 0 -2361.29 0 1248.74 0 842.235 0 0 0 0 -915.174 0 0 1657.69 0 0 0 0 -1104.08 1256.52 0 0 0 0 0 0 0 0 
0 0 -1741.16 1871.32 0 0 1165.58 0 0 0 464.263 486.236 0 0 2217.55 0 0.03 0 0 0 0 0 -2459.41 0 1606.57 0 0 0 0 -161.519 -529.267 0 1334.65 0 0 0 0 0 -602.969 -2217.7 0 0 0 0 0 1504.33 0 1127.28 0 0 0 0 0 0 0 0 
17.3193 0 0 0 0 -477.081 0 0 0 2400.66 0 0 0 0 0 1550.26 0 0.05 0 1561.25 0 0 0 0 0 0 0 0 556.581 0 0 -1961.2 0 0 0 0 2376.25 0 0 0 -284.509 0 0 0 0 0 0 0 0 0 0 0 0 0 -1006.58 0 
0 0 1821.12 0 0 0 0 0 0 0 -71.1844 0 -1633.27 0 0 0 0 0 0.09 2231.74 98.8037 0 0 0 0 -145.039 0 0 0 0 0 0 0 1390.96 0 0 0 0 0 0 0 0 0 0 0 0 2170.86 0 0 0 0 0 0 0 0 0 
0 0 2465.36 0 2459.87 0 1405 0 0 0 0 0 0 0 0 0 0 799.814 -490.051 0.08 0 0 1314.05 0 0 0 0 0 0 0 0 0 0 0 0 0 0 0 0 0 0 0 0 0 0 0 0 0 0 0 0 0 0 0 0 0 
1587.95 0 289.239 0 0 0 0 0 0 0 743.355 1250.88 0 0 346.614 0 0 0 2109.36 0 0 0 -6.48518 0 0 1742.53 -167.928 -169.912 -461.364 0 0 1506.16 -329.524 0 0 0 0 0 -1841.11 0 0 0 0 0 0 0 0 -2250.51 1321.22 699.103 0 0 0 0 0 0 
0 1072.65 0 0 0 0 994.827 0 0 -1783.12 0 0 0 -1240.35 -1759.62 0 0 0 0 0 0 0.07 1154.13 0 0 0 0 0 2375.94 0 0 0 0 0 0 0 0 0 0 0 0 393.612 0 0 0 0 0 0 0 2130.12 0 0 0 0 0 -441.374 
614.872 0 -177.694 0 2244.25 1763.74 0 0 -1116.44 246.666 646.001 0 0 0 1278.34 0 2042.07 0 0 1820.81 -2276.6 1198.69 0.08 -2413.33 0 0 0 0 -364.467 0 -1017.87 0 0 0 0 0 -2215.11 0 0 0 0 0 0 0 0 0 0 -132.527 0 1763.13 0 -2355.04 0 0 0 0 
0 1246.45 -1578.65 0 0 0 1191.67 0 0 0 0 0 0 0 0 -794.473 0 0 0 0 0 0 1842.17 0.01 1109.73 1711.25 0 143.818 0 0 0 1798.84 0 0 0 0 0 -2326.04 0 1811.2 0 0 0 0 0 0 0 0 -1081.35 0 -1257.74 0 0 0 976.821 0 
612.583 -606.937 0 0 0 0 0 0 0 0 0 0 0 -1039.54 0 1213.49 2014.76 0 0 0 0 0 0 -768.532 0.06 -386.898 1588.56 379.116 -213.401 0 0 2237.08 0 0 -1556.83 0 240.257 0 0 0 54.2467 -641.423 -1500.21 0 0 0 2472.08 0 0 0 -874.737 -2055.04 0 0 0 0 
0 -411.466 0 0 0 0 0 2030.78 0 0 0 1299.4 0 0 0 0 0 0 723.975 0 -251.396 0 0 356.075 1275.75 0.07 -578.86 0 894.726 0 0 0 0 0 -498.596 0 0 1165.88 0 0 0 0 0 0 0 0 0 0 0 0 2434.39 0 0 0 2205.34 0 
0 0 0 0 1943.8 -1829.05 0 1638.77 1688.51 0 0 0 0 1558.05 0 0 0 0 0 0 564.974 0 0 0 -1771.22 1047.78 0 0 0 0 -1181.14 0 0 0 2265.47 0 0 0 0 0 0 0 0 0 0 0 0 0 0 0 0 0 0 0 0 0 
0 0 0 0 0 0 0 852 0 0 0 0 0 0 0 0 0 0 0 0 1616.79 0 0 -1614.81 2231.89 0 0 0.01 0 1982.86 0 2100.82 0 0 0 0 0 0 0 0 0 0 -2269.13 0 -826.975 0 0 0 0 958.052 0 0 0 0 0 -328.15 
0 0 0 0 0 0 0 0 0 0 0 1638.77 0 1171.83 0 0 0 2242.88 0 0 2198.78 1189.08 -921.888 0 -2096.39 -2228.39 0 0 0.01 343.562 0 0 0 -1059.98 0 0 0 -1960.89 1464.35 0 0 0 0 0 0 0 0 0 0 0 0 0 0 0 0 0 
0 0 -66.3015 0 0 0 0 0 1081.96 0 -959.883 0 0 0 0 1717.81 1533.48 0 0 0 0 0 0 0 0 0 0 461.516 225.761 0.01 0 0 0 2415.16 -1047.32 0 0 -261.773 0 0 0 0 0 0 0 0 0 -1857.89 0 0 0 -498.901 0 0 0 0 
1031.91 0 1090.96 0 0 0 0 2139.27 0 0 0 0 -1916.33 1538.51 0 0 2457.43 0 0 0 0 0 -1984.08 0 0 0 345.088 0 0 0 0.05 -1096.45 0 1303.22 0 0 1029.77 0 0 0 0 0 0 0 0 -824.992 0 0 0 0 0 0 0 0 0 0 
0 0 0 0 0 -1434.6 0 0 0 2365.26 0 0 0 0 758.156 -1183.89 0 1829.51 0 0 -1973.71 0 0 1242.03 2027.73 0 0 2480.32 0 0 801.95 0.01 0 0 0 0 0 0 -443.663 0 0 0 0 0 0 0 0 0 0 0 0 0 0 0 0 0 
0 0 0 0 0 0 0 0 2265.77 758.766 -2199.39 0 0 0 -161.824 0 -1019.55 0 0 0 1000.17 0 0 0 0 0 0 0 0 0 0 0 0.01 0 0 0 0 0 0 0 784.097 0 0 0 0 0 0 0 0 0 -54.7044 -2429.2 332.881 0 0 0 
0 0 0 0 0 0 0 0 0 0 0 0 0 0 0 1745.43 0 0 -948.744 0 0 0 0 0 0 0 0 0 1469.85 -2481.69 2100.05 0 0 0.04 0 0 0 0 0 0 0 0 1489.99 0 0 0 0 0 0 0 1675.39 0 0 -824.229 0 0 
0 0 0 0 0 0 0 0 0 0 0 0 0 0 0 0 0 0 0 0 0 0 0 0 -1111.26 1409.88 718.94 0 0 185.324 0 0 0 0 0.03 0 0 0 0 0 0 0 0 1637.24 0 0 0 0 137.41 0 0 0 467.315 -1707.13 1387.91 0 
0 0 0 0 0 1251.64 2344.97 0 -122.913 0 0 0 0 0 0 0 0 0 0 0 0 0 0 0 0 0 0 0 0 0 0 0 0 0 0 0.09 0 0 0 0 0 0 0 0 0 0 0 0 0 1770.15 1047.93 0 0 0 0 0 
0 0 0 0 0 0 0 0 0 0 0 0 0 0 0 0 0 771.432 0 0 0 0 1931.59 0 1221.73 0 0 0 0 0 -957.289 0 0 0 0 0 0.09 0 1889.63 0 -1272.55 0 0 -743.66 0 0 0 0 0 0 0 0 0 0 0 0 
89.3429 0 0 0 0 0 0 904.95 0 0 0 0 -166.25 0 0 0 0 0 0 0 0 0 0 983.078 0 985.977 0 0 1506.32 630.741 0 0 0 0 0 0 0 0.05 2263.02 0 0 0 0 0 0 -1110.19 0 0 0 0 0 0 0 -1695.53 0 0 
0 0 -12.8941 0 0 0 0 0 0 0 0 0 0 0 0 768.075 -1677.07 0 0 0 688.574 0 0 0 0 0 0 0 -1726.97 0 0 849.254 0 0 0 0 -1005.36 2320.7 0.02 0 0 0 0 0 0 0 0 0 0 0 0 0 0 0 0 0 
273.98 0 0 0 0 0 0 0 0 0 0 0 0 0 510.956 0 296.716 0 0 0 0 0 0 1512.12 0 0 0 0 0 0 0 0 0 0 0 0 0 0 0 0.03 0 0 0 0 0 0 0 0 0 0 0 0 0 0 0 0 
0 0 0 0 0 0 0 0 0 0 -1079.36 0 1778.7 0 0 0 0 1950.21 0 0 0 0 0 0 1815.16 0 0 0 0 0 0 0 1970.2 0 0 0 -100.94 0 0 0 0.07 807.291 -1894.67 0 0 0 1088.21 0 0 0 0 0 0 -1760.69 0 -2194.05 
0 0 0 0 0 1433.53 0 0 0 0 0 847.27 0 0 0 -1268.12 0 0 0 0 0 658.055 0 0 1269.04 0 0 0 0 0 0 0 0 0 0 0 0 0 0 0 1746.8 0.08 0 0 0 0 0 0 0 0 0 0 0 0 0 0 
0 0 0 0 0 0 0 0 0 0 543.306 0 0 0 0 0 0 0 0 0 0 0 0 0 1506.93 0 0 1998.73 0 0 0 0 0 1575.14 0 0 0 0 0 0 206.076 0 0.04 0 0 0 0 0 522.248 0 0 0 2425.69 0 0 0 
0 0 0 0 0 0 1287.04 0 0 0 0 0 0 0 -1256.37 0 0 0 0 0 0 0 0 0 0 0 0 0 0 0 0 0 0 0 -475.249 0 2414.4 0 0 0 0 0 0 0 0 0 0 0 0 0 0 2073.05 0 0 0 0 
0 0 0 0 0 0 0 0 0 0 -543.764 0 1954.63 0 0 0 0 0 0 0 0 0 0 0 0 0 0 -252.007 0 0 0 0 0 0 0 0 0 0 0 0 0 0 0 0 0 0 425.81 0 0 0 0 0 0 0 0 2315.36 
0 0 2096.24 0 0 0 0 0 0 0 0 0 0 0 0 0 1126.36 0 0 0 0 0 0 0 0 0 0 0 0 0 463.958 0 0 0 0 0 0 656.072 0 0 0 0 0 0 0 0.03 -1841.56 0 0 0 0 0 0 0 0 0 
0 0 1580.17 0 0 0 0 0 0 0 0 0 423.826 0 0 1218.53 0 0 -2265.16 0 0 0 0 0 -537.66 0 0 0 0 0 0 0 0 0 0 0 0 0 0 0 2224.27 0 0 0 2211.6 -817.667 0.03 0 0 0 0 0 0 0 0 0 
0 0 0 0 0 0 0 0 0 -364.01 0 0 0 0 0 357.906 898.541 0 0 0 1733.68 0 1876.05 0 0 0 0 0 0 1972.03 0 0 0 0 0 0 0 0 0 0 0 0 0 0 0 0 0 0.09 -1340.91 0 1047.47 0 0 0 0 0 
0 0 0 0 0 0 0 0 0 0 0 0 0 0 0 0 0 0 0 0 1744.51 0 0 -584.506 0 0 0 0 0 0 0 0 0 0 -186.697 0 0 0 0 0 0 0 541.627 0 0 0 0 581.149 0.07 0 0 0 0 1804.79 0 0 
0 0 0 0 0 0 0 0 0 0 0 0 0 0 0 0 0 0 0 0 1450.32 2058.24 -1891.31 0 0 0 0 1574.53 0 0 0 0 0 0 0 2411.5 0 0 0 0 0 0 0 0 0 0 0 0 0 0.03 0 2236.17 0 0 0 0 
0 0 0 0 0 0 0 0 0 0 0 0 0 0 0 0 0 0 0 0 0 0 0 1234.86 -198.904 950.423 0 0 0 0 0 0 -884.808 -845.439 0 908.002 0 0 0 0 0 0 0 0 0 0 0 2124.47 0 0 0.04 0 0 0 0 0 
-474.181 0 0 0 0 0 0 0 0 1231.5 0 0 0 0 -1050.98 0 0 0 0 0 0 0 -1113.7 0 -216.91 0 0 0 0 810.19 0 0 2483.37 0 0 0 0 0 0 0 0 0 0 -2100.97 0 0 0 0 0 1498.84 0 0.04 0 1879.71 0 1067.46 
0 0 -1238.52 0 0 0 0 2171.16 0 0 0 0 1020.92 0 0 0 0 0 0 0 0 0 0 0 0 0 0 0 0 0 0 0 2477.87 0 -2009.57 0 0 0 0 0 0 0 922.498 0 0 0 0 0 0 0 0 0 0.03 795.846 -90.4111 0 
1377.07 0 0 0 0 0 0 0 0 0 0 -387.661 0 0 0 0 0 0 0 0 0 0 0 0 0 0 0 0 0 0 0 0 0 -2201.07 342.189 0 0 1347.77 0 0 2311.85 0 0 0 0 0 0 0 1445.59 0 0 -2139.88 1146.66 0.05 0 0 
0 0 0 0 2220.15 0 0 0 0 0 -2110.89 0 0 0 0 0 0 2090.59 0 0 0 0 0 -1128.5 0 378.048 0 0 0 0 0 0 0 0 85.8333 0 0 0 0 0 0 0 0 0 0 0 0 0 0 0 0 0 2184.29 0 0.02 0 
0 0 0 0 0 0 0 0 0 0 0 1242.94 0 0 0 0 0 0 0 0 0 322.047 0 0 0 0 0 -306.33 0 0 0 0 0 0 0 0 0 0 0 0 267.266 0 0 0 739.387 0 0 0 0 0 0 2337.79 0 0 0 0.05 
