*Vertices 61
*Matrix 
0.09 0 0 1985.46 0 0 0 0 0 0 0 0 452.513 2294 0 0 0 0 0 0 0 0 0 0 0 0 0 0 0 0 1065.94 0 -196.463 0 0 0 628.605 0 0 0 -733.131 0 0 0 0 0 0 0 0 0 0 0 0 0 0 0 0 0 0 0 0 
0 0.01 0 0 -2090.59 489.288 0 0 0 0 -1189.99 0 0 0 -642.643 0 0 0 0 0 1962.87 0 0 2056.11 0 0 0 0 0 0 0 -1621.98 0 0 0 0 0 0 0 0 2481.23 161.672 0 0 0 0 0 0 0 0 0 0 0 0 0 0 0 0 0 0 898.236 
0 0 0 0 0 0 0 0 0 0 1537.14 0 1992.93 0 -1698.28 0 0 0 1115.68 0 -1859.26 0 0 2469.48 -1912.82 0 0 0 0 17.777 0 0 0 0 0 0 -310.602 0 0 0 0 0 1577.27 0 0 0 0 0 1139.18 954.39 0 0 0 0 0 0 0 0 0 0 0 
-125.202 0 0 0 0 0 0 0 0 0 0 0 0 0 0 0 0 0 0 184.561 0 0 0 0 0 0 0 0 986.435 0 2419.58 0 0 0 -2204.12 0 0 -1797.16 0 0 0 0 0 1560.95 0 0 -1457.79 0 2177.42 632.572 0 0 0 0 0 0 0 0 0 0 656.377 
0 23.1178 0 0 0.04 2299.49 912.58 0 0 0 0 0 0 0 2234.03 0 0 0 0 0 0 0 0 0 0 0 0 0 0 0 0 0 0 0 0 0 0 0 0 0 0 0 0 0 0 -714.057 0 0 0 0 0 0 0 0 0 0 0 0 1719.03 2264.4 0 
0 -824.534 0 0 1067.46 0.08 0 0 2353.51 1005.81 0 0 0 0 0 0 0 0 0 0 0 0 0 0 0 0 0 0 0 0 0 2298.58 0 -779.672 853.221 -44.1755 0 0 0 0 0 0 0 0 0 0 0 0 0 0 0 0 0 0 0 0 0 0 0 0 748.848 
0 0 0 0 840.709 0 0.06 0 0 0 166.707 0 0 0 0 1330.38 0 0 0 0 0 0 0 0 0 0 0 0 0 0 0 0 0 -1884.9 0 0 0 0 0 0 0 1227.23 0 0 0 0 0 0 0 1165.27 0 495.087 -259.636 0 0 0 -2256.31 0 0 0 0 
0 0 0 0 0 0 0 0.05 0 0 0 0 0 0 0 2004.23 0 0 0 0 1987.59 0 0 0 0 0 419.706 2422.33 0 0 0 0 0 0 0 0 699.866 0 0 0 0 0 0 0 0 0 0 0 0 0 0 0 0 0 0 0 0 0 0 0 0 
0 0 0 0 0 -2151.48 0 0 0.07 0 0 0 0 0 0 0 0 0 1654.64 0 0 0 0 0 0 0 0 0 0 0 0 0 0 0 0 0 1947.46 0 0 -237.663 0 0 0 0 0 0 0 0 1457.95 204.855 0 0 0 0 0 0 0 0 0 0 0 
0 0 0 0 0 -1045.18 0 0 0 0.04 0 0 0 -1939.22 0 0 0 0 0 0 2479.55 0 0 0 0 0 0 0 1831.64 0 0 0 0 0 2471.62 0 0 0 1522.03 0 0 0 0 -2461.85 0 0 0 0 0 63.2496 0 0 0 0 -2408.14 0 0 0 0 -1558.2 0 
0 -1443.91 2293.69 0 0 0 -1385.46 0 0 0 0.07 0 0 -730.537 0 0 0 0 0 0 0 0 0 0 0 0 0 0 0 951.949 0 0 0 0 0 0 0 1529.51 0 0 0 0 496.765 0 0 1455.05 0 1232.57 0 0 0 0 0 0 0 0 0 0 0 0 0 
0 0 0 0 0 0 0 0 0 0 0 0.08 0 0 0 0 -2343.44 0 0 0 0 0 0 -9.84222 0 0 0 0 0 -133.442 1784.95 0 1448.94 0 0 0 0 0 0 0 0 0 0 0 0 0 0 -952.406 0 0 0 0 0 0 0 0 0 0 -734.962 1595.28 0 
1565.37 0 -258.721 0 0 0 0 0 0 0 0 0 0.09 0 0 0 0 0 0 0 0 1998.43 0 0 0 0 0 301.141 1750.77 0 0 -251.244 -269.25 0 0 2412.41 0 0 0 0 0 0 0 0 204.703 0 1489.84 -2252.04 0 0 0 0 0 0 0 0 0 0 0 0 594.577 
580.691 0 0 0 0 0 0 0 0 2475.89 -1593.6 0 0 0.03 0 0 0 0 0 0 0 0 0 0 297.784 0 0 0 0 2051.53 0 0 -2470.85 0 0 0 2337.49 1044.11 2256 0 0 0 0 0 0 1236.08 0 0 0 0 554.14 552.309 0 2397.76 0 0 0 0 0 0 0 
0 361.11 356.38 0 1068.07 0 0 0 0 0 0 0 0 0 0.05 -1804.79 0 0 0 0 0 0 0 0 0 0 0 0 0 0 0 1620.91 0 0 0 0 0 0 -2173.76 0 0 1156.42 0 -1708.81 0 0 0 0 0 0 2323.45 0 0 0 -840.556 0 0 0 0 0 0 
0 0 0 0 0 0 -1126.97 -325.556 0 0 0 0 0 0 2416.84 0.06 0 0 0 0 0 0 0 0 0 1157.49 -878.246 2363.43 0 0 0 0 0 0 0 0 0 0 0 -1090.04 0 0 0 0 0 0 0 0 0 0 0 -877.636 2025.59 0 0 0 0 0 0 0 0 
0 0 0 0 0 0 0 0 0 0 0 -240.562 0 0 0 0 0.03 1592.38 851.695 0 0 0 0 0 -300.073 0 0 0 0 880.383 0 -1369.29 0 0 1488.77 0 0 0 0 1268.88 0 0 0 0 0 0 0 0 0 0 0 0 0 0 0 0 -1009.48 0 0 0 0 
0 0 0 0 0 0 0 0 0 0 0 0 0 0 0 0 -448.393 0.06 0 0 0 0 -2052.75 0 0 0 0 0 -264.672 0 0 0 0 0 0 0 0 0 0 0 0 0 0 716.346 1934.03 0 1411.4 0 0 0 0 0 0 1698.58 0 0 0 0 1039.38 0 0 
0 0 2302.39 0 0 0 0 0 -1564.46 0 0 0 0 0 0 0 344.935 0 0 0 0 0 0 0 0 1797.16 0 0 0 1534.55 0 0 0 0 0 0 0 0 765.175 -520.875 1286.43 0 342.952 0 0 0 0 0 0 0 0 0 0 0 -2474.36 0 0 0 0 0 0 
0 0 0 2183.07 0 0 0 0 0 0 0 0 0 0 0 0 0 0 0 0.07 0 0 0 0 0 0 0 0 0 0 0 0 0 0 0 0 692.541 0 0 790.963 0 -2469.63 0 0 0 0 0 647.832 0 0 1265.83 679.571 0 1539.28 0 0 0 0 0 0 0 
0 1871.93 -2246.7 0 0 0 0 -1831.49 0 2066.03 0 0 0 0 0 0 0 0 0 0 0.04 0 1638.16 0 0 0 0 0 0 0 0 0 0 0 0 0 0 0 0 0 0 0 0 0 0 1920.3 0 499.359 0 0 0 0 0 0 0 2283.78 0 0 0 0 0 
0 0 0 0 0 0 0 0 0 0 0 0 1863.99 0 0 0 0 0 0 0 0 0.07 0 0 -1638 0 0 1107.9 0 0 0 0 0 0 0 0 0 0 0 0 2290.19 0 0 0 0 0 0 0 0 0 0 0 0 0 0 0 0 0 0 0 0 
0 0 0 0 0 0 0 0 0 0 0 0 0 0 0 0 0 1976.3 0 0 1016.19 0 0.02 1577.43 0 0 0 0 0 0 0 0 0 0 0 0 0 0 0 1868.27 0 0 0 0 0 0 0 0 0 2454.83 0 2358.7 0 0 0 0 0 2406.46 0 -111.774 0 
0 1415.68 212.18 0 0 0 0 0 0 0 0 -1628.7 0 0 0 0 0 0 0 0 0 0 2002.85 0.05 0 0 0 0 0 0 0 0 0 0 0 0 0 0 0 -60.1978 0 0 0 143.056 0 0 0 1839.58 0 0 1201.9 0 0 0 0 0 0 0 0 0 0 
0 0 1468.32 0 0 0 0 0 0 0 0 0 0 912.885 0 0 -198.904 0 0 0 0 -1717.96 0 0 0.01 778.451 0 0 0 0 0 0 0 0 0 0 0 0 0 1685.77 0 0 0 0 0 0 0 0 0 0 0 0 -1501.89 0 0 0 1793.04 0 0 0 0 
0 0 0 0 0 0 0 0 0 0 0 0 0 0 0 -6.02741 0 0 -2482.76 0 0 0 0 0 851.238 0.08 1744.82 0 0 0 0 0 0 0 0 0 -747.169 0 0 2347.1 0 0 478.912 2184.9 0 0 0 -379.574 0 0 0 0 0 0 0 0 0 0 0 0 0 
0 0 0 0 0 0 0 1679.36 0 0 0 0 0 0 0 -1387.14 0 0 0 0 0 0 0 0 0 1636.78 0.06 0 2362.06 0 0 0 0 0 0 0 0 0 -1130.63 0 0 0 0 0 0 0 0 0 0 0 0 0 0 0 0 0 0 0 0 0 1438.72 
0 0 0 0 0 0 0 -1094.16 0 0 0 0 399.258 0 0 437.559 0 0 0 0 0 2056.87 0 0 0 0 0 0.04 -859.325 0 0 0 0 0 0 0 1501.59 1673.41 0 0 0 0 1558.35 0 0 0 0 0 0 0 0 0 0 0 0 0 0 0 0 904.492 0 
0 0 0 542.39 0 0 0 0 0 1514.1 0 0 655.614 0 0 0 0 744.575 0 0 0 0 0 0 0 0 1220.66 2107.23 0.04 0 0 0 0 -1169.39 0 0 0 -1354.79 0 0 1234.7 0 0 0 0 0 0 1748.18 -1501.13 0 0 0 0 0 0 0 0 0 0 0 0 
0 0 -1561.86 0 0 0 0 0 0 0 11.2156 1231.5 0 -219.962 0 0 908.917 0 2022.69 0 0 0 0 0 0 0 0 0 0 0.06 -1536.38 0 0 0 0 0 0 0 0 0 0 1703.77 0 0 0 0 0 0 0 0 0 0 0 0 -2068.62 0 0 -299.005 0 0 761.361 
-1510.13 0 0 2072.74 0 0 0 0 0 0 0 730.232 0 0 0 0 0 0 0 0 0 0 0 0 0 0 0 0 0 1814.4 0.05 0 0 0 0 -387.661 0 0 0 0 0 0 0 0 1415.68 0 0 0 0 0 0 1199.76 0 0 0 0 0 0 0 0 0 
0 437.864 0 0 0 2381.74 0 0 0 0 0 0 -576.724 0 913.343 0 1620.3 0 0 0 0 0 0 0 0 0 0 0 0 0 0 0.01 0 0 0 -669.805 0 0 -1313.9 0 0 0 0 0 1257.59 0 0 0 0 0 0 0 939.589 0 0 -246.513 191.733 0 0 0 0 
1182.97 0 0 0 0 0 0 0 0 0 0 1127.12 624.027 1507.84 0 0 0 0 0 0 0 0 0 0 0 0 0 0 0 0 0 0 0.02 0 0 0 0 0 0 0 0 0 0 0 0 0 0 0 0 0 0 0 0 0 0 -2286.22 0 0 0 0 0 
0 0 0 0 0 -1375.55 667.669 0 0 0 0 0 0 0 0 0 0 0 0 0 0 0 0 0 0 0 0 0 -657.292 0 0 0 0 0 0 -2288.51 0 0 0 0 0 0 2471.47 0 0 0 1317.41 0 0 0 0 300.073 0 0 0 0 0 0 0 1458.86 0 
0 0 0 548.189 0 616.55 0 0 0 -37.7667 0 0 0 0 0 0 795.694 0 0 0 0 0 0 0 0 0 0 0 0 0 0 0 0 0 0.05 0 0 0 0 0 -2090.29 0 -2116.08 0 0 0 2313.38 0 0 0 0 0 0 976.669 0 0 0 0 -751.9 0 166.402 
0 0 0 0 0 1961.81 0 0 0 0 0 0 -1438.87 0 0 0 0 0 0 0 0 0 0 0 0 0 0 0 0 0 2254.63 2038.1 0 534.455 0 0.05 0 0 0 0 0 0 0 0 0 -1631.44 -2080.37 0 0 0 0 0 -1832.56 0 0 0 0 0 620.212 2296.75 0 
1176.72 0 -449.919 0 0 0 0 -20.2185 -1201.13 0 0 0 0 1867.05 0 0 0 0 0 775.857 0 0 0 0 0 -41.1237 0 872.295 0 0 0 0 0 0 0 0 0.07 0 0 0 0 0 0 0 0 761.666 0 0 0 0 0 0 -1412.32 0 0 0 0 -438.78 0 0 0 
0 0 0 2271.57 0 0 0 0 0 0 -900.372 0 0 66.9118 0 0 0 0 0 0 0 0 0 0 0 0 0 -805.918 1132.16 0 0 0 0 0 0 0 0 0.03 0 0 0 0 0 0 0 0 -2232.35 0 0 0 0 0 0 0 2196.19 0 1397.82 0 0 0 0 
0 0 0 0 0 0 0 0 0 551.546 0 0 0 -619.907 -286.798 0 0 0 2397.92 0 0 0 0 0 0 0 1678.44 0 0 0 0 1592.68 0 0 0 0 0 0 0.04 0 0 0 0 926.008 0 1656.32 0 99.5666 1231.04 380.337 -1005.81 0 0 -1154.74 0 0 0 0 0 0 0 
0 0 0 0 0 0 0 0 1115.53 0 0 0 0 0 0 158.162 755.257 0 75.457 -467.925 0 0 922.04 575.35 23.5755 1365.32 0 0 0 0 0 0 0 0 0 0 0 0 0 0.06 0 0 2094.26 0 0 0 0 0 1052.96 0 0 417.264 0 0 0 0 689.947 0 0 0 0 
1657.69 792.795 0 0 0 0 0 0 0 0 0 0 0 0 0 0 0 0 1004.59 0 0 667.516 0 0 0 0 0 0 1517.46 0 0 0 0 0 1675.85 0 0 0 0 0 0.05 0 1713.84 0 0 0 0 0 0 0 0 0 0 0 0 0 0 0 0 0 -67.217 
0 979.415 0 0 0 0 -600.07 0 0 0 0 0 0 0 1319.7 0 0 0 0 -1511.05 0 0 0 0 0 0 0 0 0 2235.56 0 0 0 0 0 0 0 0 0 0 0 0.08 665.685 0 0 0 0 0 0 0 0 0 0 0 0 0 0 0 0 0 0 
0 0 -362.484 0 0 0 0 0 0 0 1445.28 0 0 0 0 0 0 0 -2334.13 0 0 0 0 0 0 1148.34 0 1190.3 0 0 0 0 0 2049.55 2033.83 0 0 0 0 1745.73 196.158 248.344 0.02 0 0 0 0 0 0 0 0 2078.84 0 0 -558.26 0 0 0 0 0 0 
0 0 0 -1340.14 0 0 0 0 0 -1047.78 0 0 0 0 618.686 0 0 1711.71 0 0 0 0 0 2009.72 0 2147.36 0 0 0 0 0 0 0 0 0 0 0 0 1350.83 0 0 0 0 0.08 0 0 0 0 0 0 -1681.04 0 0 0 0 0 0 0 0 0 0 
0 0 0 0 0 0 0 0 0 0 0 0 -531.404 0 0 0 0 -1813.79 0 0 0 0 0 0 0 0 0 0 0 0 1539.58 -164.418 0 0 0 0 0 0 0 0 0 0 0 0 0.05 0 0 0 1068.38 0 1473.05 0 0 0 0 0 0 0 2077.17 0 0 
0 0 0 0 1891.77 0 0 0 0 0 1030.69 0 0 -1927.17 0 0 0 0 0 0 277.184 0 0 0 0 0 0 0 0 0 0 0 0 0 0 39.903 1846.14 0 1415.07 0 0 0 0 0 0 0.08 0 0 0 0 1341.67 0 0 0 0 0 -1296.81 0 0 0 0 
0 0 0 2380.21 0 0 0 0 0 0 0 0 2385.56 0 0 0 0 -1850.41 0 0 0 0 0 0 0 0 0 0 0 0 0 0 0 -3.43333 -1205.25 2232.81 0 -2058.55 0 0 0 0 0 0 0 0 0.06 0 0 0 0 0 0 0 0 0 0 0 0 0 -2210.99 
0 0 0 0 0 0 0 0 0 0 -2041.76 1868.27 828.959 0 0 0 0 0 0 402.921 2433.32 0 0 2409.67 0 -968.734 0 0 -1191.06 0 0 0 0 0 0 0 0 0 764.718 0 0 0 0 0 0 0 0 0.04 2427.21 0 0 0 0 0 0 0 0 -212.943 0 1210.59 0 
0 0 1792.12 -2196.65 0 0 0 0 519.654 0 0 0 0 0 0 0 0 0 0 0 0 0 0 0 0 0 0 0 953.78 0 0 0 0 0 0 0 0 0 55.0096 96.2096 0 0 0 0 1386.53 0 0 480.895 0.07 0 0 0 0 0 0 0 0 0 0 0 -1256.68 
0 0 1821.73 -73.7785 0 0 528.047 0 -79.4244 -2281.33 0 0 0 0 0 0 0 0 0 0 0 0 695.593 0 0 0 0 0 0 0 0 0 0 0 0 0 0 0 1561.71 0 0 0 0 0 0 0 0 0 0 0.06 0 0 0 0 0 0 0 0 1261.41 0 -863.75 
0 0 0 0 0 0 0 0 0 0 0 0 0 1678.14 1482.67 0 0 0 0 1598.03 0 0 0 433.744 0 0 0 0 0 0 0 0 0 0 0 0 0 0 429.167 0 0 0 0 582.064 1811.04 -2273.25 0 0 0 0 0 0 311.518 0 0 0 0 0 0 0 -81.5607 
0 0 0 0 0 0 171.438 0 0 0 0 0 0 1331.6 0 -1377.53 0 0 0 2416.23 0 0 1620.15 0 0 0 0 0 0 0 2392.12 0 0 -1299.71 0 0 0 0 0 -1660.89 0 0 1880.17 0 0 0 0 0 0 0 0 0.06 0 0 1767.86 0 0 25.8644 0 440.001 -2316.13 
0 0 0 0 0 0 2243.34 0 0 0 0 0 0 0 0 627.079 0 0 0 0 0 0 0 0 1972.64 0 0 0 0 0 0 -1038.32 0 0 0 2012.77 -643.559 0 0 0 0 0 0 0 0 0 0 0 0 0 -1704.23 0 0.08 0 0 793.252 0 0 0 0 0 
0 0 0 0 0 0 0 0 0 0 0 0 0 1382.56 0 0 0 -988.571 0 1934.03 0 0 0 0 0 0 0 0 0 0 0 0 0 0 891.98 0 0 0 -434.202 0 0 0 0 0 0 0 0 0 0 0 0 0 0 0.07 0 0 0 0 0 -661.26 0 
0 0 0 0 0 0 0 0 0 1828.75 0 0 0 0 142.75 0 0 0 -1656.93 0 0 0 0 0 0 0 0 0 0 718.94 0 0 0 0 0 0 0 1411.1 0 0 0 0 -1483.12 0 0 0 0 0 0 0 0 1651.74 0 0 0.01 0 -1600.47 0 0 0 270.318 
0 0 0 0 0 0 0 0 0 0 0 0 0 0 0 0 0 0 0 0 -1376.92 0 0 0 0 0 0 0 0 0 0 818.125 2361.14 0 0 0 0 0 0 0 0 0 0 0 0 0 0 0 0 0 0 0 1621.22 0 0 0.06 0 0 0 0 0 
0 0 0 0 0 0 2009.72 0 0 0 0 0 0 0 0 0 -1469.7 0 0 0 0 0 0 0 -1573 0 0 0 0 0 0 -856.12 0 0 0 0 0 2436.83 0 639.897 0 0 0 0 0 250.938 0 0 0 0 0 0 0 0 -579.623 0 0.03 0 0 0 0 
0 0 0 0 0 0 0 0 0 0 0 0 0 0 0 0 0 0 0 0 0 0 894.574 0 0 0 0 0 0 -620.975 0 0 0 0 0 0 2249.14 0 0 0 0 0 0 0 0 0 0 531.709 0 0 0 2108.6 0 0 0 0 0 0.09 0 0 0 
0 0 0 0 -2212.06 0 0 0 0 0 0 -401.09 0 0 0 0 0 1234.7 0 0 0 0 0 0 0 0 0 0 0 0 0 0 0 0 310.297 834.91 0 0 0 0 0 0 0 0 -324.335 0 0 0 0 2426.15 0 0 0 0 0 0 0 0 0.04 0 0 
0 0 0 0 1132.31 0 0 0 0 378.201 0 -1247.98 0 0 0 0 0 0 0 0 0 0 554.75 0 0 0 0 699.561 0 0 0 0 0 -85.6807 0 734.199 0 0 0 0 0 0 0 0 0 0 0 -996.506 0 0 0 -1453.37 0 1191.67 0 0 0 0 0 0.08 0 
0 336.39 0 1629.46 0 1700.42 0 0 0 0 0 0 722.297 0 0 0 0 0 0 0 0 0 0 0 0 0 2397.46 0 0 244.072 0 0 0 0 -487.457 0 0 0 0 0 465.941 0 0 0 0 0 2280.11 0 718.94 1016.04 -595.34 -2149.95 0 0 1046.4 0 0 0 0 0 0.02 
