*Vertices 54
*Matrix 
0.08 0 788.827 0 -52.2629 0 -615.329 566.347 0 0 0 0 1259.12 739.998 904.035 0 0 0 0 0 0 295.343 0 0 0 0 1950.67 0 0 0 0 0 0 0 0 0 0 0 1699.65 0 0 0 0 0 0 0 1804.03 0 0 0 0 0 0 0 
0 0.08 0 -641.423 -515.839 -1167.71 55.3148 0 0 0 0 0 0 0 0 0 633.946 0 0 2130.12 1956.92 392.392 0 1730.63 0 -2472.08 -1009.93 0 0 0 -841.166 -517.518 0 0 0 0 -200.43 0 -2243.03 0 0 0 0 0 1986.53 0 0 0 0 0 1857.28 0 2059.01 0 
2157.89 0 0.02 -1787.7 0 0 0 0 0 0 0 0 -1323.66 0 0 0 0 0 0 0 0 0 0 0 0 0 0 0 -2400.97 0 0 0 0 0 2191.92 0 0 0 0 0 1180.38 2321.62 2023.45 1724.83 0 0 0 -2448.73 1353.27 0 -92.5474 -412.229 0 1425.9 
0 -1329.77 -670.873 0.07 2320.25 0 0 0 -758.003 0 0 0 0 0 0 0 0 0 0 0 2359 0 -859.63 0 0 0 0 0 0 2456.21 0 0 -429.93 0 0 0 -653.478 0 0 0 0 0 0 0 0 200.278 0 0 0 0 0 0 0 0 
1467.86 699.561 0 -1084.09 0 886.639 2477.87 892.285 0 -1232.87 0 0 -1926.86 0 0 0 0 0 1025.96 0 -2361.29 0 0 0 0 0 1651.59 0 0 0 -784.555 0 -316.553 0 0 0 0 0 823.313 -1436.58 0 934.553 0 0 0 130.696 1434.75 0 0 0 0 984.756 0 0 
0 723.67 0 0 2361.14 0.03 0 0 0 0 0 0 0 1324.43 2129.51 -30.9 0 0 0 0 0 -1254.54 0 0 0 0 0 0 0 -2219.53 0 0 0 -74.9992 0 0 0 -356.685 -215.537 0 1076.16 0 0 0 0 0 0 -508.362 -1985 0 0 1878.34 0 0 
1699.19 -1970.05 0 0 961.104 0 0.06 0 0 0 0 1640.6 0 0 0 0 0 1199.45 0 853.526 0 0 0 0 0 0 0 0 0 -1256.83 -32.1207 0 0 0 0 0 0 -1188.92 0 0 0 0 -1318.78 0 0 0 0 0 0 2499.24 0 0 0 0 
693.762 0 0 0 374.233 0 0 0.08 0 0 0 0 0 0 0 0 0 0 0 2383.88 0 0 0 0 0 0 0 669.195 0 0 -1251.34 -102.924 1773.96 0 0 0 1720.71 0 0 0 0 0 0 0 0 0 -1978.44 0 0 1292.99 0 0 0 0 
0 0 0 722.449 0 0 0 0 0.06 -933.638 0 0 0 0 0 0 850.017 0 0 1976.15 0 0 0 2294.76 0 0 0 0 0 0 0 0 0 0 -37.3089 0 0 0 898.083 0 0 1030.23 0 0 1127.12 0 0 0 0 0 0 0 0 500.427 
0 0 0 0 1399.81 0 0 0 1698.74 0.04 0 0 0 0 -1885.97 0 0 0 0 1987.9 0 0 0 1670.66 0 0 0 0 1137.65 -592.441 0 0 0 0 -141.682 0 0 2378.54 -1799.75 0 0 0 0 -794.931 0 0 0 1303.52 0 0 0 2410.73 0 0 
0 0 0 0 0 0 0 0 0 0 0.02 2192.83 832.163 0 0 0 0 0 0 -2313.23 0 0 1255.46 860.851 2467.35 0 -39.2926 0 0 0 1265.07 2170.4 1723.76 0 0 0 0 0 1689.28 0 0 2168.87 -609.378 0 0 0 0 0 0 -1818.52 0 0 0 0 
0 0 0 0 0 0 -1677.98 0 0 0 1923.05 0.01 -378.353 0 0 0 0 -511.261 0 0 0 0 1680.58 -1609.16 0 -1488.62 0 0 0 0 0 0 464.11 0 0 -2217.09 0 0 1864.3 0 0 2260.73 0 0 0 0 1174.58 0 -2308.19 0 1988.51 0 0 0 
-2003.16 0 -855.052 0 2327.42 0 0 0 0 0 307.55 2327.11 0.08 0 351.344 0 0 0 0 0 0 0 0 -22.2022 0 0 0 0 0 0 0 0 0 1172.14 0 815.836 1393.09 0 0 0 0 0 1649.75 0 0 0 0 0 0 0 0 -1748.48 0 0 
1976.3 0 0 0 0 -1692.94 0 0 0 0 0 0 0 0.05 0 0 0 0 -1343.81 36.3933 267.876 -2041.61 2309.11 0 1549.81 0 0 1180.53 -2191.46 0 -689.337 1236.69 0 0 0 0 0 0 0 0 0 0 0 2320.7 0 0 0 0 2382.66 1417.97 0 0 0 0 
-78.2037 0 0 0 0 -1133.84 0 0 0 1538.36 0 0 288.781 0 0.09 0 0 0 0 562.838 0 -564.211 0 0 0 0 0 0 0 0 0 2227.93 1548.43 777.841 0 0 0 1817.61 -1373.26 0 0 -652.867 0 0 0 862.682 0 0 49.9741 -381.405 0 0 0 0 
0 0 0 0 0 -1690.8 0 0 0 0 0 0 0 0 0 0.03 0 1748.79 0 1669.13 0 0 0 -355.922 0 0 0 0 0 0 0 0 0 -404.599 -389.645 2074.11 0 0 0 0 0 0 0 -1021.53 0 2426.76 0 0 0 1645.33 0 0 0 0 
0 894.879 0 0 0 0 0 0 2078.08 0 0 0 0 0 0 0 0.03 0 0 0 0 0 0 0 0 0 0 1394.62 0 0 0 -2485.5 0 2441.86 0 0 0 0 0 0 0 0 0 558.87 2199.85 0 0 0 0 0 0 0 0 0 
0 0 0 0 0 0 2206.87 0 0 0 0 -1000.78 0 0 0 770.211 0 0.01 661.718 0 0 -626.164 0 0 0 0 0 0 0 0 0 640.355 0 2093.19 -1506.32 0 0 0 0 0 0 494.324 0 0 1421.48 0 2071.67 0 242.851 2395.47 2339.93 2422.18 0 1959.67 
0 0 0 0 -48.7533 0 0 0 0 0 0 0 0 958.663 0 0 0 389.035 0.08 -1226.77 0 0 0 0 0 1534.85 2358.85 -722.755 0 986.435 0 0 0 1546.45 0 1139.18 -1376.61 0 -1497.77 0 0 2478.48 -1742.68 0 0 -553.377 0 0 0 0 0 0 0 0 
0 1404.08 0 0 0 0 -1649.91 -1293.45 1940.75 1586.28 0.228889 0 0 855.51 -896.405 2436.52 0 0 -896.863 0.04 0 1865.98 0 17.9296 0 2262.72 0 1597.11 2118.21 1666.08 0 0 0 0 0 -2494.2 0 0 0 0 1854.53 0 0 -784.707 0 -167.47 0 0 0 0 1392.48 -790.353 0 0 
0 2100.67 0 -274.438 1442.53 0 0 0 0 0 0 0 0 885.266 0 0 0 0 0 0 0.01 0 0 0 0 0 500.732 0 0 0 0 0 2353.66 347.072 1464.96 0 510.193 41.8867 0 0 0 0 0 0 0 0 100.94 1542.02 -1441.01 0 0 479.827 0 -1076.16 
-2238.61 1981.8 0 0 0 465.331 0 0 0 0 0 0 0 -1411.25 989.181 0 0 -736.641 0 176.321 0 0.08 0 0 -1509.98 -244.682 0 2436.52 1920 0 0 -2241.97 0 0 299.31 0 -2436.37 -541.932 0 0 2208.55 0 0 0 1771.07 -606.632 2371.97 0 0 0 0 0 0 0 
0 0 0 2200.46 0 0 0 0 0 0 -996.963 1205.71 0 -671.178 0 0 0 0 0 0 0 0 0.09 0 -1999.8 0 -86.5963 1009.78 0 187.918 0 0 155.568 0 2338.1 0 0 1694.31 -2027.42 0 1787.09 -470.214 0 0 0 0 0 0 0 0 0 -244.987 0 0 
0 242.698 0 0 0 0 0 0 -120.93 321.284 2214.35 39.4452 -2058.4 0 0 1028.7 0 0 0 -1158.86 0 0 0 0.07 0 -538.728 0 0 1766.49 0 423.826 2248.38 0 1219.44 0 1584.9 -689.947 1623.36 -1419.19 -1885.2 0 -579.47 0 0 0 0 1313.44 0 0 0 -1962.42 0 0 0 
0 0 0 0 0 0 0 0 0 0 -320.063 0 0 1498.38 0 0 0 0 0 0 0 1793.04 1987.59 0 0.09 -498.138 0 0 0 0 0 0 0 0 0 659.429 0 -1961.81 1039.54 -2379.76 0 1671.88 -243.919 1064.87 0 0 0 1718.57 0 0 0 777.23 0 0 
0 2241.81 0 0 0 0 0 0 0 0 0 173.421 0 0 0 0 0 0 2180.47 2020.71 0 1198.39 0 994.98 -1857.59 0.04 0 0 0 0 0 849.712 0 0 0 2354.73 0 0 0 1573.76 0 -171.59 -2201.07 -1619.08 0 1509.06 2061.6 0 0 0 0 0 0 0 
1886.58 821.482 0 0 487.457 0 0 0 0 0 1086.23 0 0 0 0 0 0 0 -2001.02 0 1578.34 0 224.693 0 0 0 0.01 0 0 0 0 0 0 0 0 0 2358.09 0 0 -1872.39 0 -2442.47 0 0 -452.971 0 0 0 -1797.31 0 0 2002.09 0 0 
0 0 0 0 0 0 0 1529.66 0 0 0 0 0 604.495 0 0 2217.86 0 1874.98 2305.75 0 1749.09 2253.56 0 0 0 0 0.02 0 1107.29 0 0 0 0 -1090.35 544.984 301.447 -373.928 0 0 0 0 1314.05 0 0 0 0 0 0 0 0 0 0 0 
0 0 -861.919 0 0 0 0 0 0 2290.19 0 0 0 2485.5 0 0 0 0 0 491.119 0 2259.67 0 -106.738 0 0 0 0 0.02 0 1840.65 815.378 0 0 -2424.62 0 0 0 0 0 0 -1327.17 1560.49 0 0 0 1141.01 0 0 0 -2485.2 0 0 0 
0 0 0 862.377 0 2031.54 -1557.44 0 0 1907.03 0 0 0 0 0 0 0 0 2381.13 -386.593 0 0 293.512 0 0 0 0 1345.64 0 0.07 -2330.62 0 0 1040.6 0 -1475.95 0 0 0 0 0 0 870.769 349.513 0 0 -779.214 0 873.516 1435.06 0 0 0 -2152.24 
0 539.796 0 0 -2100.51 0 1965.62 -2281.79 0 0 122.913 0 0 1157.64 0 0 0 0 0 0 0 0 0 1857.43 0 0 0 0 1227.38 45.5489 0.07 0 0 0 0 0 0 0 1612.22 0 0 0 1885.36 0 -830.485 0 0 0 2099.9 0 0 2249.14 0 0 
0 2461.39 0 0 0 0 0 2033.07 0 0 -1145.59 0 0 -1246.76 1509.83 0 -1110.95 2475.13 0 0 0 749.153 0 865.734 0 -2164.45 0 0 -1581.85 0 0 0.06 981.704 -294.275 0 0 2493.13 0 0 0 1654.18 2031.69 0 0 -1475.34 0 0 0 0 0 0 0 1602.3 0 
0 0 0 1948.84 1545.69 0 0 2432.71 0 0 1127.12 -2285.3 0 0 1943.8 0 0 0 0 0 1016.34 0 -1200.37 0 0 0 0 0 0 0 0 -1981.49 0.03 1137.5 0 0 0 0 0 0 2257.68 0 0 1388.52 0 1823.56 0 2345.58 0 0 0 -1209.07 0 0 
0 0 0 0 0 192.19 0 0 0 0 0 0 1578.19 0 1563.84 -1284.45 2263.18 1503.27 1212.58 0 165.029 0 0 -1404.23 0 0 0 0 0 -803.476 0 2410.89 1371.73 0.03 0 0 0 0 0 0 -2100.67 0 -398.343 0 0 0 0 0 0 0 0 -749.611 0 0 
0 0 -301.752 0 0 0 0 0 -423.826 204.398 0 0 0 0 0 2300.41 0 601.444 0 0 -987.503 -571.993 760.445 0 0 0 0 1370.2 1395.69 0 0 0 0 0 0.08 0 0 0 0 0 -1546.45 0 0 0 0 0 0 0 1502.04 -420.469 0 0 0 0 
0 0 0 0 0 0 0 0 0 0 0 1587.95 -985.061 0 0 1874.37 0 0 -1027.33 815.378 0 0 0 -388.882 1661.35 1768.17 0 148.549 0 -2350.31 0 0 0 0 0 0.06 416.654 0 0 1907.64 0 0 0 111.469 0 0 -1281.4 0 0 0 0 -1472.29 -123.829 0 
0 1052.05 0 1030.08 0 0 0 1592.53 0 0 0 0 1945.63 0 0 0 0 0 185.324 0 -578.249 -548.036 0 1543.86 0 0 -1642.58 2411.5 0 0 0 445.647 0 0 0 -1018.63 0.08 0 0 635.167 1471.98 -1386.38 0 1435.67 0 0 0 0 0 -2279.66 0 -456.481 0 0 
0 0 0 0 0 960.341 1397.37 0 0 -1012.53 0 0 0 0 2074.72 0 0 0 0 0 -1258.35 -595.798 -1842.94 2136.52 -1617.71 0 0 1069.75 0 0 0 0 0 0 0 0 0 0.06 1421.17 0 0 0 0 0 0 0 725.349 2310.33 0 0 2077.62 -1764.05 0 0 
-2382.81 1755.96 0 0 2462.92 49.5163 0 0 -1270.56 1811.04 -703.375 1388.82 0 0 184.713 0 0 0 981.552 0 0 0 -57.7563 -341.273 237.968 0 0 0 0 0 1379.51 0 0 0 0 0 0 -1086.08 0.03 0 -988.418 0 0 1901.07 0 -227.439 0 0 2074.27 0 0 1659.37 0 2262.41 
0 0 0 0 1223.72 0 0 0 0 0 0 0 0 0 0 0 0 0 0 0 0 0 0 -183.645 2262.11 -1670.81 1018.63 0 0 0 0 0 0 0 0 -1336.63 -1456.42 0 0 0.08 0 1567.35 0 0 2405.85 0 0 0 202.109 1585.97 0 0 0 0 
0 0 -313.044 0 0 21.4393 0 0 0 0 0 0 0 0 0 0 0 0 0 -847.423 0 -297.937 1952.8 0 0 0 0 0 0 0 0 -1352.05 970.26 1040.76 709.632 0 2065.57 0 -99.2615 0 0.02 0 -213.401 0 0 0 0 0 0 -2421.11 0 1340.75 0 0 
0 0 -1162.53 0 1721.17 0 0 0 -1829.2 0 2182.91 -973.159 0 0 -1463.9 0 0 -2111.8 207.45 0 0 0 1544.16 -1151.08 2005.14 112.537 1914.04 0 1909.16 0 0 -1108.51 0 0 0 0 -812.326 0 0 -2401.27 0 0.03 0 0 557.802 2112.57 0 0 -343.867 936.384 0 1448.48 0 0 
0 0 -1805.86 0 0 0 -2220.91 0 0 0 1302.15 0 2172.69 0 0 0 0 0 -573.519 0 0 0 0 0 1494.72 -2359.31 0 -1496.25 869.396 -1938.31 2218.16 0 0 2325.28 0 0 0 0 0 0 -616.398 0 0.02 0 1528.75 0 0 -1573.15 0 1399.66 0 0 0 0 
0 0 -577.639 0 0 0 0 0 0 -1478.09 0 0 0 654.088 0 685.217 1428.34 0 0 2249.14 0 0 0 0 2295.22 -1396.76 0 0 0 -225.608 0 0 -292.291 0 0 -271.844 1537.14 0 -2465.36 0 0 0 0 0.06 138.783 1331.29 0 1370.51 0 0 0 0 0 0 
0 1999.34 0 0 0 0 0 0 1055.86 0 0 0 0 0 0 0 -2491.61 2250.21 0 0 0 2078.69 0 0 0 0 2106.01 0 0 0 -27.3904 971.175 0 0 0 0 0 0 0 1741.31 0 -2168.11 -2449.34 -1946.39 0.05 0 0 0 1417.81 1713.69 0 0 0 0 
0 0 0 -2141.25 1349.91 0 0 0 0 0 0 0 0 0 -1889.78 329.371 0 0 1751.84 -630.284 0 -161.214 0 0 0 249.718 0 0 0 0 0 0 2118.98 0 0 0 0 0 -656.072 0 0 -2109.06 0 1904.89 0 0.01 0 0 0 228.965 1561.4 0 0 0 
-2166.89 0 0 0 586.947 0 0 482.116 0 0 0 -36.2407 0 0 0 0 0 2378.08 0 0 2145.07 1969.13 0 1946.24 0 1297.11 0 0 158.162 1887.19 0 0 0 0 0 -2352.14 0 2140.64 0 0 0 0 0 0 0 0 0.05 0 0 -1598.33 1812.72 -753.883 0 0 
0 0 1074.79 0 0 1709.72 0 0 0 402.768 0 0 0 0 0 0 0 0 0 0 -189.596 0 0 0 1278.19 0 0 0 0 0 0 0 324.183 0 0 0 0 190.359 0 0 0 0 426.878 -645.238 0 0 0 0.09 1958.14 -842.54 0 -734.809 0 0 
0 0 2146.44 0 0 1692.48 0 0 0 0 0 1099.66 0 -1479.77 1349.91 0 0 402.31 0 0 1440.86 0 0 0 0 0 496.918 0 0 2237.39 156.789 0 0 0 2247.15 0 0 0 543.001 -2011.86 0 269.402 0 0 -1367 0 0 406.888 0.09 -325.251 0 0 0 0 
0 0 0 0 0 0 333.949 -2343.59 0 0 1687.6 0 0 665.227 514.466 -212.333 0 -566.5 0 0 0 0 0 0 0 0 0 0 0 993.454 0 0 0 0 1182.97 0 -1168.48 0 0 2286.22 1417.97 246.818 152.211 0 1012.68 1275.14 1186.03 -923.414 675.909 0.05 0 0 0 0 
0 1794.41 1439.48 0 0 0 0 0 0 0 0 -1238.21 0 0 0 0 0 1649.45 0 -1820.2 0 0 0 2087.08 0 0 0 0 2392.88 0 0 0 0 0 0 0 0 -1358.91 0 0 0 0 0 0 0 2427.06 7.70592 0 0 0 0.07 0 0 0 
0 0 -1937.54 0 457.091 1658.3 0 0 0 25.5593 0 0 2471.16 0 0 0 0 432.371 0 895.337 1454.13 0 2370.3 0 -1478.09 0 1947 0 0 0 -1388.06 0 -980.789 15.4881 0 819.041 -1525.39 1475.19 -92.8526 0 557.955 1941.97 0 0 0 0 644.932 -1576.66 0 0 0 0.02 0 0 
0 2354.58 0 0 0 0 0 0 0 0 0 0 0 0 0 0 0 0 0 0 0 0 0 0 0 0 0 0 0 0 0 2188.25 0 0 0 931.196 0 0 0 0 0 0 0 0 0 0 0 0 0 0 0 0 0.01 2209.46 
0 0 1978.9 0 0 0 0 0 1920.3 0 0 0 0 0 0 0 0 1950.51 0 0 -1144.83 0 0 0 0 0 0 0 0 38.2244 0 0 0 0 0 0 0 0 -2047.41 0 0 0 0 0 0 0 0 0 0 0 0 0 -1812.27 0.07 
