*Vertices 52
*Matrix 
0 0 0 0 0 0 0 0 0 0 0 0 0 0 0 0 0 0 0 1715.67 0 0 0 0 -82.4763 0 0 0 2498.47 0 0 0 0 0 0 0 0 0 0 0 0 0 0 0 0 0 0 0 0 0 0 0 
0 0.02 0 875.195 0 0 -1901.68 0 0 2361.6 1065.02 0 -98.4985 0 0 0 0 0 0 0 0 0 0 0 0 0 0 0 0 0 0 0 0 1375.09 0 0 1609.47 0 -1981.19 -2111.19 0 0 0 0 0 0 0 0 0 240.41 -307.703 1730.32 
0 0 0.03 0 0 0 1933.58 2419.74 0 0 0 0 0 0 0 0 1.44963 0 0 0 -2365.87 52.4155 0 0 0 0 0 0 1083.48 0 2195.58 0 0 0 0 0 0 292.138 0 0 994.674 0 0 161.061 0 0 0 0 0 0 0 0 
0 -1717.81 0 0.02 0 0 2227.62 0 0 0 0 0 0 0 0 2048.63 0 1209.83 -797.372 0 0 0 0 0 0 0 0 0 0 1772.9 0 0 0 0 0 0 0 0 0 1099.66 0 0 0 0 0 0 0 0 0 -2188.86 0 0 
0 0 0 0 0.04 0 0 0 2394.25 0 0 0 1451.99 0 0 0 0 663.244 0 0 41.4289 0 0 414.67 0 -662.633 0 2021.77 0 0 0 0 0 832.163 0 0 0 0 0 0 0 0 0 -1244.01 -683.386 0 0 0 0 0 0 0 
0 0 0 0 0 0 0 0 0 0 2384.64 0 0 0 666.753 0 0 2374.11 0 0 0 0 0 0 0 0 0 0 0 0 0 0 0 0 0 -2120.81 0 0 0 0 0 0 0 0 0 0 0 0 0 0 0 0 
0 4.65407 -219.047 -929.212 0 0 0 0 0 0 0 0 0 0 0 0 0 0 0 0 0 0 0 1905.35 0 0 0 -1187.55 0 0 0 0 0 2339.47 25.4067 0 0 0 1015.73 1779.31 0 0 -504.395 0 0 0 0 0 0 0 0 0 
0 0 -2418.97 0 0 0 0 0.06 0 0 0 0 328.913 0 0 0 0 0 0 149.007 0 2086.93 0 0 0 0 0 0 0 0 0 0 1993.85 0 -932.112 0 0 0 0 0 0 0 0 0 149.617 0 0 0 2386.01 -1802.19 0 0 
0 0 0 0 1015.58 0 0 0 0.03 1804.03 0 0 0 0 0 0 0 0 0 0 0 1437.5 0 0 0 0 0 0 0 0 0 0 0 -2261.8 0 1695.68 0 0 0 0 0 0 -1482.06 0 0 0 0 0 0 0 0 0 
0 641.575 0 0 0 0 0 0 -1741.16 0.03 0 0 0 1972.79 0 0 0 934.095 0 -2226.55 0 0 0 0 0 0 0 0 0 0 1739.48 0 0 0 0 0 0 0 0 0 0 0 0 0 0 0 0 0 0 0 0 0 
0 -1621.98 0 0 0 2182 0 0 0 0 0.03 0 0 0 2256.61 0 0 0 0 0 0 0 -1065.78 0 0 2491.61 0 -1505.1 -2459.87 0 0 0 0 0 0 0 0 0 0 1991.71 0 0 0 0 2156.06 0 0 0 0 0 0 0 
0 0 0 0 0 0 0 0 0 0 0 0.02 0 0 0 0 0 2237.54 0 0 0 0 0 0 0 0 1829.97 0 0 0 0 0 0 0 0 0 0 0 0 0 0 0 -560.549 0 0 0 0 0 0 0 0 0 
0 2057.94 0 0 -740.608 0 0 742.744 0 0 0 0 0.04 0 0 0 -1813.94 0 0 0 0 0 0 0 0 1770 0 -48.4481 0 0 0 0 0 2254.17 0 0 0 0 0 -1317.56 0 0 0 0 0 0 0 0 0 0 692.694 0 
0 0 0 0 0 0 0 0 0 82.9341 0 0 0 0.06 -434.049 0 0 0 0 0 0 0 0 0 0 0 0 1314.81 -103.992 0 0 0 0 0 0 0 0 0 0 0 0 0 0 0 0 0 406.125 0 0 1957.69 447.63 0 
0 0 0 0 0 790.506 0 0 0 0 1965.16 0 0 -1448.18 0.05 1346.1 0 0 0 633.488 0 0 0 0 0 0 0 0 0 0 0 0 0 0 0 0 0 0 757.088 0 0 2172.84 0 0 2055.35 0 0 794.015 -25.8644 0 0 0 
0 0 0 1484.04 0 0 0 0 0 0 0 0 0 0 -43.5652 0.01 2182.15 -1303.83 0 0 0 0 987.35 0 0 0 0 0 0 0 0 0 0 49.9741 0 -1427.12 0 0 0 0 0 0 0 2469.94 0 0 -2257.07 0 0 0 662.938 1780.22 
0 0 1741.31 0 0 0 0 0 0 0 0 0 56.3829 0 0 -353.023 0.04 0 714.515 0 0 0 0 0 0 1213.34 0 0 0 0 0 0 0 0 0 2162.01 0 0 0 0 0 0 0 0 2468.87 0 0 0 0 0 0 0 
0 0 0 -103.229 2071.83 924.635 0 0 0 -188.986 0 1638 0 0 0 1885.51 0 0.05 0 0 0 0 0 335.627 0 0 -796.915 0 0 0 0 0 0 0 0 0 0 0 0 0 0 0 0 0 0 0 0 0 0 0 0 0 
0 0 0 268.792 0 0 0 0 0 0 0 0 0 0 0 0 -1050.37 0 0.05 0 0 0 0 0 0 0 0 0 0 0 -1246.76 0 0 2462.77 0 0 0 -106.891 0 0 0 0 0 0 0 0 0 0 856.273 0 0 0 
-1472.75 0 0 0 0 0 0 189.291 0 2388.3 0 0 0 0 1669.9 0 0 0 0 0.09 0 0 0 0 0 -1723.91 0 1060.75 0 0 2224.57 0 0 1415.07 0 0 0 0 0 0 1352.5 0 0 0 0 0 0 -996.811 0 0 0 0 
0 0 -815.073 0 1875.74 0 0 0 0 0 0 0 0 0 0 0 0 0 0 0 0.02 0 0 0 0 0 0 0 0 0 70.5741 125.965 0 0 0 1831.49 0 0 0 0 0 0 1901.23 0 0 0 0 0 0 0 829.569 0 
0 0 -1568.42 0 0 0 0 1248.13 2498.93 0 0 0 0 0 0 0 0 0 0 0 0 0 0 0 0 0 0 0 0 60.0452 0 -69.2007 0 0 -2361.9 0 0 0 0 0 0 0 0 0 0 1569.64 0 0 0 0 0 0 
0 0 0 0 0 0 0 0 0 0 2029.86 0 0 0 0 -615.024 0 0 0 0 0 0 0.03 1325.04 0 1988.51 0 0 0 0 0 0 0 0 0 0 0 0 0 0 0 0 0 0 0 0 -1055.86 0 0 0 0 0 
0 0 0 0 2226.71 0 2043.75 0 0 0 0 0 0 0 0 0 0 2332.3 0 0 0 0 -1743.75 0.03 0 -1690.04 0 0 0 0 0 0 0 496.918 0 0 0 0 0 1262.32 0 0 0 0 0 0 0 0 0 0 -1590.24 0 
-1029.16 0 0 0 0 0 0 0 0 0 0 0 0 0 0 0 0 0 0 0 0 0 0 0 0.04 0 0 0 0 0 0 0 0 0 0 1564.46 0 869.549 0 0 1640.6 0 0 0 0 0 -1663.64 0 0 0 0 0 
0 0 0 0 2233.27 0 0 0 0 0 886.181 0 1801.58 0 0 0 584.048 0 0 1947.61 0 0 79.577 -832.316 0 0.01 0 0 0 0 0 0 0 0 0 0 0 0 0 0 0 0 0 0 0 0 0 0 0 0 0 0 
0 0 0 0 0 0 0 0 0 0 0 1406.06 0 0 0 0 0 571.383 0 0 0 0 0 0 0 0 0.05 0 0 0 0 0 0 0 0 0 0 -1243.71 2306.05 0 0 0 0 0 0 -1352.66 0 0 0 0 1530.88 1606.72 
0 0 0 0 1568.88 0 -39.903 0 0 0 -1367.92 0 1379.97 462.127 0 0 0 0 0 1686.07 0 0 0 0 0 0 0 0 0 0 0 0 0 0 0 1107.29 0 0 0 0 0 0 -590.152 0 0 0 0 0 622.044 0 0 0 
-1001.85 0 -1290.4 0 0 0 0 0 0 0 1203.57 0 0 875.5 0 0 0 0 0 0 0 0 0 0 0 0 0 0 0.02 0 0 0 -911.359 0 0 0 0 2214.65 0 0 0 0 0 0 0 0 0 0 0 0 2205.65 0 
0 0 0 454.65 0 0 0 0 0 0 0 0 0 0 0 0 0 0 0 0 0 243.767 0 0 0 0 0 0 0 0.07 1902.75 0 -1398.89 -652.562 0 0 0 0 0 0 492.798 2001.02 0 1618.32 0 0 0 -532.929 0 0 0 0 
0 0 790.048 0 0 0 0 0 0 -597.781 0 0 0 0 0 0 0 0 333.186 1213.19 446.867 0 0 0 0 0 0 0 0 -1342.59 0.01 0 0 1486.33 0 -1717.81 51.8052 0 0 0 0 -375.149 0 0 2465.36 0 0 0 0 1161.46 0 0 
0 0 0 0 0 0 0 0 0 0 0 0 0 0 0 0 0 0 0 0 274.438 2069.08 0 0 0 0 0 0 0 0 0 0.07 0 0 0 0 0 0 0 2085.71 0 0 0 -2483.37 2496.19 0 0 0 0 0 0 0 
0 0 0 0 0 0 0 531.556 0 0 0 0 0 0 0 0 0 0 0 0 0 0 0 0 0 0 0 0 2381.13 353.023 0 0 0.09 0 0 0 0 0 0 0 0 0 0 0 0 1057.7 2451.48 0 0 0 0 -300.684 
0 -2372.13 0 0 1722.24 0 1565.83 0 1157.03 0 0 0 -1451.54 0 0 2401.73 0 0 -1771.07 -222.556 0 0 0 393.307 0 0 0 0 0 1395.54 586.489 0 0 0.02 -308.466 0 0 0 0 0 0 858.562 0 0 2490.23 0 0 0 0 0 0 0 
0 0 0 0 0 0 1943.8 -436.949 0 0 0 0 0 0 0 0 0 0 0 0 0 2452.85 0 0 0 0 0 0 0 0 0 0 0 1493.8 0.07 -1108.81 0 0 0 0 0 1490.6 1024.89 0 0 0 0 0 0 0 0 0 
0 0 0 0 0 -2406.31 0 0 1696.14 0 0 0 0 0 0 1233.94 2179.25 0 0 0 254.753 0 0 0 -2410.89 0 0 -1392.48 0 0 2251.73 0 0 0 961.257 0.03 -1166.19 0 0 390.561 -423.521 0 0 0 726.417 0 0 0 2198.63 0 0 0 
0 2055.96 0 0 0 0 0 0 0 0 0 0 0 0 0 0 0 0 0 0 0 0 0 0 0 0 0 0 0 0 -2231.89 0 0 0 0 -239.647 0.08 0 0 0 0 2245.63 0 1588.26 0 0 0 0 0 0 0 0 
0 0 452.361 0 0 0 0 0 0 0 0 0 0 0 0 0 0 0 623.264 0 0 0 0 0 2310.94 0 2363.73 0 971.023 0 0 0 0 0 0 0 0 0.05 0 0 0 0 0 0 0 -1483.73 0 0 408.109 0 0 2153.46 
0 -471.435 0 0 0 0 65.9963 0 0 0 0 0 0 0 -215.842 0 0 0 0 0 0 0 0 0 0 0 2207.94 0 0 0 0 0 0 0 0 0 0 0 0.03 1427.88 0 0 0 0 0 0 0 0 2069.38 0 0 0 
0 -2313.68 0 1473.66 0 0 1508.61 0 0 0 -2281.03 0 1751.99 0 0 0 0 0 0 0 0 0 0 343.257 0 0 0 0 0 0 0 1899.09 0 0 0 -529.572 0 0 560.549 0.05 0 0 0 0 0 0 0 0 0 1844.31 0 0 
0 0 2352.6 0 0 0 0 0 0 0 0 0 0 0 0 0 0 0 0 -1298.79 0 0 0 0 -2397.46 0 0 0 0 2058.7 0 0 0 0 0 1307.18 0 0 0 0 0.06 0 0 228.05 0 0 0 0 0 0 0 0 
0 0 0 0 0 0 0 0 0 0 0 0 0 0 2432.86 0 0 0 0 0 0 0 0 0 0 0 0 0 0 -2167.81 154.653 0 0 594.272 860.24 0 -436.033 0 0 0 0 0.08 0 0 0 0 0 0 0 0 0 0 
0 0 0 0 0 0 661.87 0 940.352 0 0 -2154.53 0 0 0 0 0 0 0 0 812.479 0 0 0 0 0 0 -510.346 0 0 0 0 0 0 2172.38 0 0 0 0 0 0 0 0.06 0 0 841.166 1811.35 0 0 0 0 0 
0 0 -1093.4 0 2460.33 0 0 0 0 0 0 0 0 0 0 1569.19 0 0 0 0 0 0 0 0 0 0 0 0 0 -606.326 0 -657.598 0 0 0 0 1990.49 0 0 0 271.538 0 0 0.05 0 0 877.789 0 0 0 0 65.9963 
0 0 0 0 -411.161 0 0 1175.5 0 0 2041.76 0 0 0 1998.28 0 60.5029 0 0 0 0 0 0 0 0 0 0 0 0 0 1684.24 -2247.31 0 1164.2 0 2119.13 0 0 0 0 0 0 0 0 0.08 0 0 0 0 0 0 0 
0 0 0 0 0 0 0 0 0 0 0 0 0 0 0 0 0 0 0 0 0 -1274.38 0 0 0 0 -1180.38 0 0 0 0 0 1296.66 0 0 0 0 901.746 0 0 0 0 380.032 0 0 0.08 0 0 0 -1813.94 0 2260.43 
0 0 0 0 0 0 0 0 0 0 0 0 0 1372.04 0 -1672.03 0 0 0 0 0 0 -725.044 0 346.919 0 0 0 0 0 0 0 1300.32 0 0 0 0 0 0 0 0 0 -895.337 947.523 0 0 0.03 0 0 0 0 0 
0 0 0 0 0 0 0 0 0 0 0 0 0 0 -648.442 0 0 0 0 2464.14 0 0 0 0 0 0 0 0 0 1036.33 0 0 0 0 0 0 0 0 0 0 0 0 0 0 0 0 0 0.02 0 0 0 0 
0 0 0 0 0 0 0 587.863 0 0 0 0 0 0 -1054.34 0 0 0 1762.67 0 0 0 0 0 0 0 0 2433.77 0 0 0 0 0 0 0 1154.29 0 -668.889 2001.33 0 0 0 0 0 0 0 0 0 0.08 -1575.9 0 0 
0 783.944 0 1698.28 0 0 0 -1554.54 0 0 0 0 0 786.843 0 0 0 0 0 0 0 0 0 0 0 0 0 0 0 0 -15.3356 0 0 0 0 0 0 0 0 1775.64 0 0 0 0 0 475.707 0 0 561.769 0.01 0 0 
0 -1235.62 0 0 0 0 0 0 0 0 0 0 755.104 -1541.11 0 1562.01 0 0 0 0 1717.35 0 0 -846.507 0 0 1287.5 0 -126.728 0 0 0 0 0 0 0 0 0 0 0 0 0 0 0 0 0 0 0 0 0 0.02 0 
0 558.412 0 0 0 0 0 0 0 0 0 0 0 0 0 -365.688 0 0 0 0 0 0 0 0 0 0 1562.78 0 0 0 0 0 1783.12 0 0 0 0 -1795.02 0 0 0 0 0 1735.36 0 1188.47 0 0 0 0 0 0.05 
