*Vertices 50
*Matrix 
0.02 0 0 -1335.72 0 -2398.98 1188.62 0 -746.559 0 -1068.22 0 0 -1508 0 0 0 0 2070.15 0 0 0 2326.2 -187.46 0 0 911.664 1137.04 2322.08 -1102.1 0 0 0 0 -714.209 416.807 999.405 0 0 0 0 0 241.783 0 0 0 0 0 -227.287 0 
0 0.04 0 0 0 0 1887.95 0 -2358.55 0 0 0 0 0 0 635.777 0 0 0 0 0 0 267.571 0 0 0 0 0 0 0 1947.16 -950.423 0 1983.17 0 0 0 0 0 0 0 634.404 -418.332 0 289.087 0 0 0 0 0 
0 0 0.06 -1793.19 308.313 0 0 2490.08 1776.1 0 0 0 1523.87 0 -1410.79 0 1497.31 -711.768 0 0 0 0 0 623.569 0 0 -1988.97 0 0 -1923.2 0 838.572 362.636 -891.98 -1264.92 0 0 2119.59 -1650.67 0 0 824.534 0 2304.07 -850.475 2328.79 0 0 0 0 
1230.74 0 -2008.04 0.05 0 0 1872.39 0 0 0 0 0 0 0 0 0 0 0 0 0 0 0 0 0 0 0 1040.15 0 0 0 0 0 -279.931 0 0 0 1844.77 0 0 0 -1241.87 0 0 0 0 0 0 0 0 0 
0 0 1687.29 0 0.09 -212.79 0 -1140.4 2477.42 0 0 0 0 -783.334 -966.292 0 0 0 -147.786 0 0 0 0 177.084 0 -357.448 0 963.851 0 0 0 90.7163 389.798 303.583 0 0 0 0 0 -496.612 2017.65 0 0 0 1159.78 0 0 0 0 -603.122 
614.414 0 0 0 624.485 0.01 0 -1603.06 0 174.947 0 0 184.408 0 2188.56 0 0 0 0 0 0 0 823.008 0 0 0 0 0 0 0 0 0 1384.55 1414.91 -1439.33 0 0 0 0 0 0 0 0 0 0 0 0 0 0 0 
0.686666 -652.257 0 801.34 0 0 0.09 0 0 0 0 0 0 880.993 0 2162.92 0 0 0 0 0 -566.347 0 -1818.52 0 228.813 0 0 1727.42 0 1334.35 0 0 0 0 0 0 0 0 849.101 0 1904.58 2473.3 0 0 0 2361.75 -453.887 1750.16 0 
0 0 640.812 0 -367.061 -247.581 0 0.02 0 0 0 1876.66 0 443.51 0 0 0 0 0 0 0 -128.254 294.58 0 0 0 0 0 0 0 -178.61 378.048 0 1244.47 1999.34 29.3741 0 0 1451.23 0 0 0 0 0 -53.4837 0 0 0 0 0 
2394.86 -534.303 -2269.13 0 625.401 0 0 0 0 0 -1013.29 -1194.11 0 2376.71 0 0 -715.125 0 0 0 0 692.999 0 0 1766.18 0 1610.84 0 -2431.94 0 0 0 0 0 0 -2115.62 -1824.17 0 0 0 1806.01 0 2459.56 1664.25 0 0 0 2299.95 0 0 
0 0 0 0 0 2473.3 0 0 0 0.04 0 0 0 0 0 0 0 -2480.01 599.46 -212.333 0 -2493.74 -1446.04 0 0 0 0 2075.64 0 0 0 0 318.69 766.701 0 1205.4 -1218.53 0 1725.75 0 0 0 0 0 0 0 0 0 0 0 
-1370.97 0 0 0 0 0 0 0 2393.34 0 0.05 0 1313.59 0 0 0 0 0 2176.66 -1350.22 -795.389 0 0 0 0 0 0 0 2001.48 0 0 0 0 0 0 -1925.18 1189.23 0 0 -633.335 0 1005.51 0 0 -166.86 0 0 2230.22 0 0 
0 0 0 0 0 0 0 501.19 1667.46 0 0 0.02 0 0 0 -1101.49 0 0 0 -2107.23 0 0 1849.96 1100.12 0 1660.44 2085.71 0 0 0 0 0 0 0 -792.795 0 0 0 0 1721.17 0 0 0 0 0 0 0 0 0 0 
0 0 -128.254 0 0 -1978.29 0 0 0 0 -750.069 0 0.07 0 0 0 0 1539.58 0 0 918.226 0 0 0 0 0 0 0 1796.85 0 0 506.226 0 1425.14 0 0 0 2139.12 0 0 241.783 0 0 0 0 0 0 0 0 0 
-128.864 0 0 0 2256.77 0 2327.27 745.643 56.3829 0 0 0 0 0.07 1822.03 0 -2152.7 0 0 -59.74 0 0 0 2012.16 0 0 0 0 0 0 -867.26 41.8867 0 0 0 0 0 0 0 0 0 0 0 0 -708.258 0 0 0 0 0 
0 0 -799.051 0 2024.37 -410.703 0 0 0 0 0 0 0 1079.82 0.02 0 0 0 -1349.3 0 0 0 -536.897 0 0 0 976.211 -1998.28 0 0 0 1871.93 1033.43 0 344.325 0 0 0 1100.12 -137.41 0 0 -245.903 0 0 0 0 0 0 0 
0 -780.74 0 0 0 0 -762.123 0 0 0 0 -783.181 0 0 0 0.08 1296.35 0 31.2052 0 0 -273.675 0 0 0 0 0 0 0 0 0 0 0 0 0 0 1341.98 0 0 0 0 0 352.107 0 0 0 0 0 0 1720.4 
0 0 1806.77 0 0 0 0 0 2485.05 0 0 0 0 -2399.9 0 2313.99 0.04 955.611 0 0 0 0 1239.43 736.335 1360.44 0 0 0 147.633 0 1443.3 0 0 0 1557.13 0 0 0 0 0 0 0 0 1939.99 0 33.9518 -1816.23 1670.51 0 0 
0 0 2258.6 0 0 0 0 0 0 1805.7 0 0 1622.75 0 0 0 767.769 0.08 0 -913.038 0 0 0 0 0 0 0 0 0 0 0 0 0 0 0 0 0 1997.97 0 0 0 0 0 -2236.01 0 0 0 0 0 0 
192.038 0 0 0 -1193.5 0 0 0 0 2074.11 2370.14 0 0 0 2026.35 -705.512 0 0 0 0 -191.122 0 2011.86 0 0 0 0 0 0 -2.36518 2029.4 0 0 0 0 0 0 0 0 1998.73 1262.17 0 0 0 0 0 0 0 0 0 
0 0 0 0 0 0 0 0 0 -2049.39 -482.727 -921.735 0 9.07926 0 0 0 1365.02 0 0.02 0 1217.31 2007.74 0 0 0 0 0 0 0 0 0 0 0 2242.88 2446.59 0 0 0 0 0 0 0 0 0 0 -767.159 727.485 0 0 
0 0 0 0 0 0 0 0 0 0 -1968.21 0 2236.32 0 0 0 0 0 -1674.63 0 0.07 0 0 -2180.47 0 0 0 0 0 0 -460.601 0 2396.08 0 2337.64 673.162 0 0 0 1455.81 0 1531.5 0 -1647.92 -2170.25 1413.69 0 0 0 0 
0 0 0 0 0 0 -2181.54 -258.11 2178.64 -2255.55 0 0 0 0 0 840.556 0 0 0 756.478 0 0.08 0 867.565 0 0 -1349.15 -1470.15 0 17.1667 0 2264.55 0 0 0 0 195.242 0 0 0 0 -1488.92 2209.31 0 0 0 0 0 0 0 
-1998.89 589.236 0 0 0 -1896.34 0 378.964 0 -1385.01 0 1729.1 0 0 1849.65 0 2358.55 0 -596.103 -1440.7 0 0 0.02 -593.509 0 0 0 0 1467.1 0 0 857.189 0 0 0 238.426 1143.15 0 1491.97 0 0 0 -2170.4 0 0 0 0 0 1332.97 0 
1626.56 0 1102.25 0 1067.46 0 406.888 0 0 0 0 -906.476 0 -1010.54 0 0 -2065.11 0 0 0 -995.285 76.0674 -1983.17 0 245.293 0 0 0 0 -2289.12 1215.02 0 0 0 0 -918.989 235.984 273.217 0 0 1954.94 0 0 1691.87 1720.86 2282.1 0 -944.319 0 2157.28 
0 0 0 0 0 0 0 0 -1590.24 0 0 0 0 0 0 0 2489.62 0 0 0 0 0 0 -1996.14 0 409.94 0 0 0 0 -398.038 0 0 0 0 0 2298.73 0 0 0 0 0 0 430.387 0 0 0 0 0 0 
0 0 0 0 -1345.33 0 2381.89 0 0 0 0 -973.769 0 0 0 0 0 0 0 0 0 0 0 0 596.561 0.02 0 607.852 0 0 0 1519.9 0 0 0 0 0 0 2021.62 760.598 0 0 0 0 0 1427.27 657.292 0 0 0 
2312.62 0 1449.55 1304.74 0 0 0 0 -2355.49 0 0 1937.85 0 0 -1631.44 0 0 0 0 0 0 287.408 0 0 0 0 0.09 0 1432.77 0 0 -819.498 0 2307.73 0 -1614.05 2003.62 0 0 -1432.46 0 0 0 0 2030.02 0 0 0 0 0 
-1642.58 0 0 0 -1450.01 0 0 0 0 1103.93 0 0 0 0 2339.01 0 0 0 0 0 0 -2398.83 0 0 0 2252.34 0 0.03 0 296.106 0 0 0 2010.03 1412.47 0 0 0 0 0 0 -1105.15 0 0 0 0 0 0 0 0 
653.63 0 0 0 0 0 -1015.43 0 -1227.07 0 -704.291 0 620.823 0 0 0 -1116.29 0 0 0 0 0 -570.467 0 0 0 1690.04 0 0.08 -331.66 0 0 0 -1011.31 0 698.492 0 0 0 0 1015.27 0 1885.05 0 2434.69 1741 0 0 0 0 
821.177 0 -1642.89 0 0 0 0 0 0 0 0 0 0 0 0 0 0 0 73.4733 0 0 1211.66 0 -2357.02 0 0 0 -998.489 -1797.31 0.09 0 0 0 0 493.561 1378.9 0 -2305.9 0 0 1587.19 1821.88 148.091 2361.6 0 0 0 0 0 0 
0 1172.14 0 0 0 0 -856.273 -2385.25 0 0 0 0 0 -1872.23 0 0 1222.04 0 1727.27 0 836.283 0 0 1415.37 -173.421 0 0 0 0 0 0.07 0 0 0 -1275.75 0 0 0 -1929.61 0 0 0 0 0 2145.83 0 0 585.879 0 0 
0 -1692.94 2414.09 0 1533.48 0 0 1963.79 0 0 0 0 813.7 -781.045 -1172.14 0 0 0 0 0 0 2425.38 -237.053 0 0 753.578 -9.53703 0 0 0 0 0.01 0 -1296.04 1975.39 844.676 -1517.15 0 -1659.83 0 0 0 0 0 2.67037 0 1809.98 1638.77 0 0 
0 0 1896.19 463.042 -378.048 -916.7 0 0 0 1503.27 0 0 0 0 1369.14 0 0 0 0 0 -9.38444 0 0 0 0 0 0 0 0 0 0 0 0.02 0 0 0 0 0 0 0 0 -1458.71 352.107 0 -864.818 0 0 0 0 0 
0 1088.52 -1156.58 0 1298.94 1012.07 0 -1780.68 0 2372.89 0 0 665.38 0 0 0 0 0 0 0 0 0 0 0 0 0 667.516 -547.121 -1014.97 0 0 1075.55 0 0.01 0 0 0 0 1113.39 -1970.5 0 0 580.386 0 1682.41 0 0 -1346.55 0 0 
1452.91 0 -1143.91 0 0 -414.67 0 -94.9889 0 0 0 -689.184 0 0 1928.69 0 -2171.93 0 0 -2110.43 -266.045 0 0 0 0 0 0 1729.1 0 -197.226 1763.74 2162.01 0 0 0.01 0 0 365.23 0 0 0 0 0 0 0 0 536.744 0 0 0 
1965.16 0 0 0 0 0 0 134.816 2449.95 963.698 -812.632 0 0 0 0 0 0 0 0 69.0481 -1678.9 0 -696.966 -225.913 0 0 222.861 0 1580.94 10.4526 0 1455.2 0 0 0 0.05 0 0 0 0 -603.885 0 0 0 0 0 0 0 0 0 
-2245.02 0 0 2078.69 0 0 0 0 1862.32 -869.396 1655.1 0 0 0 0 2050 0 0 0 0 0 -429.167 80.7978 410.092 864.36 0 -1343.65 0 0 0 0 -2085.41 0 0 0 0 0.01 -1650.21 0 0 2150.11 0 1589.48 0 0 0 0 0 0 0 
0 0 780.892 0 0 0 0 0 0 0 0 0 -1626.56 0 0 0 0 -876.568 0 0 0 0 0 287.713 0 0 0 0 0 1932.51 0 0 0 0 2480.62 0 -2257.38 0.04 0 0 653.783 2335.81 0 561.159 0 0 -2369.69 0 0 1378.75 
0 0 -1264.31 0 0 0 0 742.592 0 -971.48 0 0 0 0 1119.5 0 0 0 0 0 0 0 921.735 0 0 339.442 0 0 0 0 1536.38 1087.3 0 40.0555 0 0 0 0 0.07 0 0 0 0 0 0 0 0 0 0 0 
0 0 0 0 587.405 0 -2398.53 0 0 0 2211.45 -304.804 0 0 557.192 0 0 0 1657.99 0 -339.29 0 0 0 0 2020.86 -652.409 0 0 0 0 0 0 1596.19 0 0 0 0 0 0.03 0 0 0 -2166.59 1701.33 0 0 0 0 0 
0 0 0 850.932 325.251 0 0 0 971.938 0 0 0 1850.57 0 0 0 0 0 -2091.51 0 0 0 0 74.0837 0 0 0 0 -508.057 1082.87 0 0 0 0 0 1665.01 1015.27 305.261 0 0 0.02 0 0 0 388.882 0 -2380.37 0 0 -1250.42 
0 1079.36 -515.229 0 0 0 -47.5326 0 0 0 113.147 0 0 0 0 0 0 0 0 0 -1343.81 1957.84 0 0 0 0 0 1247.06 0 1863.99 0 0 72.7104 0 0 0 0 -1801.13 0 0 0 0.08 0 0 0 1584.14 0 0 0 0 
1018.78 1132.92 0 0 0 0 168.538 0 1227.07 0 0 0 0 0 554.598 557.955 0 0 0 0 0 -2403.26 -484.252 0 0 0 0 0 1994 214.011 0 0 -879.925 1852.24 0 0 -1020 0 0 0 0 0 0.03 0 0 0 1515.93 0 0 0 
0 0 -1192.43 0 0 0 0 0 -707.038 0 0 0 0 0 0 0 428.556 2422.03 0 0 306.787 0 0 312.738 253.685 0 0 0 0 815.531 0 0 0 0 0 0 0 1222.95 0 2323.15 0 0 0 0.07 -307.55 1102.56 0 0 0 0 
0 -1010.39 -1580.78 0 1340.75 0 0 -577.334 0 0 1436.74 0 0 -620.518 0 0 0 0 0 0 2311.09 0 0 -1832.41 0 0 681.707 0 -317.164 0 145.497 1907.03 -1164.82 -568.026 0 0 0 0 0 1377.22 220.725 0 0 2274.77 0.09 0 0 -2350 0 0 
0 0 361.11 0 0 0 0 0 0 0 0 0 0 0 0 0 2281.03 0 0 0 2209.46 0 0 -474.792 0 -2101.89 0 0 1149.4 0 0 0 0 0 0 0 0 0 0 0 0 244.682 0 2240.14 0 0.06 0 0 -602.817 0 
0 0 0 0 0 0 1216.09 0 0 0 0 0 0 0 0 0 138.63 0 0 -349.055 0 0 0 0 0 -1628.24 0 0 0 0 0 2337.95 0 0 -1474.88 0 0 2487.18 0 0 -771.432 0 1781.59 0 0 0 0.06 0 0 0 
0 0 0 0 0 0 56.3829 0 -2079.3 0 1720.1 0 0 0 0 0 2461.39 0 0 644.475 0 0 0 1813.33 0 0 0 0 0 0 -1854.08 -399.716 0 2136.83 0 0 0 0 0 0 0 0 0 0 1292.23 0 0 0.07 0 0 
1090.96 0 0 0 0 0 -2348.32 0 0 0 0 0 0 0 0 0 0 0 0 0 0 0 1859.26 0 0 0 0 0 0 0 0 0 0 0 0 0 0 0 0 0 0 0 0 0 0 1744.97 0 0 0.06 0 
0 0 0 0 585.421 0 0 0 0 0 0 0 0 0 0 870.617 0 0 0 0 0 0 0 365.993 0 0 0 0 0 0 0 0 0 0 0 0 0 -261.925 0 0 663.549 0 0 0 0 0 0 0 0 0.07 
