*Network. Ross Sea Web No 21.
*Vertices 10
   1 "Ice Algae"
   2 "Phytoplankton"
   3 "Detritus"
   4 "Ice Invertabrates"
   5 "Zooplankton"
   6 "Fish"
   7 "Cephalopods"
   8 "Penguins"
   9 "Seals"
   10 "Whales"
*Matrix
0 0 0 1 1 0 0 0 0 0
0 0 0 0 1 0 0 0 0 0
0 0 0 0 1 0 0 0 0 0
0 0 0 0 1 1 0 0 0 0
0 0 0 1 0 1 1 1 1 1
0 0 0 0 0 0 1 1 1 1
0 0 0 0 0 0 0 1 1 1
0 0 0 0 0 0 0 0 1 0
0 0 0 0 0 0 0 0 0 1
0 0 0 0 0 0 0 0 0 0