*Vertices 38
*Matrix 
0.04 -745.949 0 0 133.137 0 2192.98 0 0 0 0 0 0 0 0 0 0 1469.08 0 0 0 0 0 0 0 0 -155.873 0 0 0 -1001.54 0 -453.734 0 0 -1948.07 844.066 0 
1579.1 0.05 1020.16 0 0 0 0 0 1683.78 -1011.31 0 -1452.15 0 0 0 0 0 -2141.41 0 0 0 0 0 1867.5 0 0 0 0 0 0 0 0 0 0 0 1438.72 0 0 
0 1050.07 0.07 0 0 0 0 1813.33 0 -2292.78 -1084.09 0 967.055 2335.51 0 0 0 0 0 0 0 0 0 0 0 0 1859.11 1035.42 0 -2494.35 0 -105.213 0 44.0229 0 1787.7 2347.25 0 
0 0 0 0.03 0 -481.964 0 0 0 2438.96 0 0 0 0 0 0 37.0037 0 2275.99 -2284.23 0 0 -1564.91 1377.07 0 0 0 0 0 664.006 0 0 0 0 1421.63 -241.935 0 1052.05 
-1347.62 0 0 0 0.07 -641.575 0 0 0 0 0 0 0 0 0 811.563 -985.214 1103.63 0 503.479 856.883 -779.977 0 0 1071.58 2304.22 0 0 0 593.966 0 0 -1284.91 288.171 0 -785.47 0 2488.4 
0 0 0 -1327.17 440.764 0 2325.28 860.546 2274.01 0 0 0 0 0 0 0 1502.96 0 1122.85 0 615.635 0 1820.66 0 -1524.48 0 0 0 0 0 0 0 0 0 -479.522 0 0 0 
778.603 0 0 0 0 1280.94 0.07 0 0 0 1028.24 2208.24 0 2311.24 0 0 -2044.05 0 0 237.663 622.349 0 -1431.09 2462.92 0 2341.61 -2086.63 720.161 0 -54.7044 1866.28 1306.88 0 0 0 0 0 12.4363 
0 0 286.645 0 0 -341.731 0 0.02 2217.86 382.626 0 0 0 0 1980.27 289.85 0 0 0 0 0 -2218.47 0 0 0 0 0 0 0 0 0 0 0 0 -676.519 0 2133.17 0 
0 667.669 0 0 0 1760.08 0 266.503 0.03 0 0 0 0 -2366.33 0 1891.92 0 0 964.766 0 0 591.067 0 0 0 0 338.527 0 0 0 -1580.94 0 2449.95 0 0 0 0 0 
0 779.061 -2108.14 -433.439 0 0 0 -215.537 0 0.07 0 0 0 0 0 0 2139.58 2241.81 0 0 -422.91 0 0 0 0 0 -310.907 299.158 0 0 -2093.34 2458.34 0 2269.74 0 -1795.48 454.955 0 
0 0 -2122.18 0 0 0 646.763 0 0 0 0.04 1300.01 1121.48 0 1861.09 0 0 0 801.492 0 0 0 -1277.58 0 0 1999.34 1313.44 0 0 0 0 0 0 0 0 0 -1861.71 0 
0 -640.202 0 0 0 0 701.544 0 0 0 1246.15 0.02 0 -1195.33 0 0 0 0 1160.85 0 -1706.06 0 -342.494 1081.35 0 0 0 0 924.482 711.463 0 58.977 0 0 0 0 0 775.857 
0 0 59.8926 0 0 0 0 0 0 0 -829.417 0 0.07 -86.7489 0 256.127 1156.12 0 703.375 0 0 -123.524 0 0 0 -2354.88 0 286.035 0 0 1676 676.061 0 0 0 1942.88 0 0 
0 0 282.678 0 0 0 -569.857 0 1855.75 0 0 48.9059 1298.64 0.07 982.009 0 -1413.85 0 1313.9 2076.25 -2330.77 264.672 1585.51 0 0 0 0 0 0 1603.98 0 0 0 0 0 0 0 0 
0 0 0 0 0 0 0 1285.36 0 0 -1447.87 0 0 134.663 0.04 0 0 0 0 1272.24 0 618.229 0 -1078.75 835.673 -875.347 776.009 1880.47 0 0 0 0 0 0 -1083.33 0 0 0 
0 0 0 0 2147.66 0 0 1896.95 1745.43 0 0 0 2357.78 0 0 0.08 0 0 0 0 0 0 0 0 0 -771.737 0 0 1911.15 759.072 0 -646.001 0 0 0 0 0 0 
0 0 0 670.721 1243.25 1267.51 1508.45 0 0 -286.798 0 0 1617.71 2217.25 0 0 0.03 0 0 -195.242 2075.64 24.3385 -78.9666 -1651.74 0 0 0 0 -1131.09 -1433.23 381.405 1259.73 0 0 -1068.68 0 0 0 
251.244 212.333 0 0 -74.0837 0 0 0 0 1552.4 0 0 0 0 0 0 0 0.05 1802.5 0 0 0 0 0 649.358 0 0 0 0 0 0 0 869.091 0 0 0 0 0 
0 0 0 -1356.01 0 1945.48 0 0 2124.01 0 1068.83 -354.701 -832.469 1820.05 0 0 0 1323.82 0.01 1401.03 0 0 0 0 0 0 2249.29 0 -484.558 1811.81 0 2294.31 0 0 0 0 0 0 
0 0 0 1811.2 -1395.99 0 2296.14 0 0 0 0 0 0 1956.77 -444.884 0 -1924.12 0 397.885 0.06 -1763.44 0 0 -356.685 2290.49 0 0 0 0 0 0 0 0 -156.178 0 0 0 2159.72 
0 0 0 0 -1704.99 2500 -95.294 0 0 182.119 0 1528.29 0 1304.13 0 0 -85.9859 0 0 405.21 0 0 0 0 0 0 0 0 0 0 -1125.14 -490.814 0 0 0 0 0 0 
0 0 0 0 1710.33 0 0 2441.56 -1686.83 0 0 0 340.968 -1989.88 -29.3741 0 504.089 0 0 0 0 0.02 0 0 0 0 0 1152.46 0 0 0 0 0 2380.21 0 768.685 0 -2389.37 
0 0 0 -1849.65 0 -2012.16 964.614 0 0 0 -360.805 2033.83 0 -70.7266 0 0 1442.69 0 0 0 0 0 0.01 0 0 0 0 0 0 0 1148.64 0 0 0 0 -248.497 0 0 
0 -812.937 0 -392.544 0 0 1815.78 0 0 0 0 1271.32 0 0 1197.62 0 -1123.16 0 0 1171.38 0 0 0 0.04 0 0 0 0 0 0 0 0 -663.396 0 0 0 0 0 
0 0 0 0 786.233 990.86 0 0 0 0 0 0 0 0 -92.2422 0 0 -1632.51 0 464.263 0 0 0 0 0.01 -55.9252 0 -471.587 0 -693.609 0 0 0 921.278 0 0 37.6141 0 
0 0 0 0 1596.96 0 -461.516 0 0 0 1740.24 0 1695.53 0 -2131.64 -1896.19 0 0 0 0 0 0 0 0 2040.09 0.01 0 0 0 0 -212.485 0 1277.28 0 -1477.32 0 0 -367.672 
-1626.1 0 677.282 0 0 0 1459.01 0 401.09 2306.82 2468.11 0 0 0 1959.67 0 0 0 -348.75 0 0 0 0 0 0 0 0.06 0 0 0 0 0 -123.676 0 -1672.64 0 -1388.67 0 
0 0 -1162.53 0 0 0 2063.28 0 0 -86.9015 0 0 -352.565 0 2263.33 0 0 0 0 0 0 -1456.72 0 0 -837.046 0 0 0.01 0 0 0 0 0 1203.42 0 0 0 0 
0 0 0 0 0 0 0 0 0 0 0 2305.44 0 0 0 -474.944 419.706 0 -2346.8 0 0 0 0 0 0 0 0 0 0.05 0 0 0 0 0 0 0 0 0 
0 0 2163.53 -2014.15 1555.91 0 -285.272 0 0 0 0 1979.81 0 740.608 0 -1403.78 -1614.96 0 2206.41 0 0 0 0 0 2054.43 0 0 0 0 0.09 0 1422.54 0 0 -1112.02 0 884.045 0 
-815.989 0 0 0 0 0 2160.18 0 576.571 1406.83 0 0 331.05 0 0 0 -544.984 0 0 0 -882.061 0 350.887 0 0 -166.555 0 0 0 0 0.09 -1281.55 1491.67 0 0 -12.5889 0 0 
0 0 1622.59 0 0 0 1041.37 0 0 2416.38 0 846.507 -1498.69 0 0 753.121 -1557.74 0 583.59 0 -2292.93 0 0 0 0 0 0 0 0 1990.65 940.657 0.04 0 0 -1405.15 0 0 0 
1887.49 0 0 0 -796.762 0 0 0 1471.07 0 0 0 0 0 0 0 0 -124.134 0 0 0 0 0 268.944 0 1388.21 2444.3 0 0 0 -1070.06 0 0 -1242.33 -1404.23 0 0 2138.51 
0 0 -831.401 0 -2152.24 0 0 0 0 819.803 0 0 0 0 0 0 0 0 0 1686.83 0 1802.96 0 0 2090.44 0 0 -833.689 0 0 0 0 643.254 0.07 0 0 2340.85 -1531.34 
0 0 0 998.794 0 2316.74 0 1519.44 0 0 0 0 0 0 1126.97 0 -4.50148 0 0 0 0 0 0 0 0 -267.571 451.292 0 0 -63.5548 0 1082.26 -97.8881 0 0.06 -1437.04 0 0 
-2451.02 1942.88 -769.143 2219.23 -305.872 0 0 0 0 1138.42 0 0 1754.59 0 0 0 0 0 0 0 0 1994.92 1621.98 0 0 0 0 0 0 0 -944.777 0 0 0 2410.73 0 -1587.19 1031.6 
1347.01 0 -74.5415 0 0 0 0 530.793 0 1256.22 -1081.5 0 0 0 0 0 0 0 0 0 0 0 0 0 -911.664 0 464.415 0 0 544.984 0 0 0 657.903 0 1336.33 0.05 1404.08 
0 0 0 -1045.18 1427.12 0 -1677.68 0 0 0 0 1273.92 0 0 0 0 0 0 0 -23.423 0 -109.027 0 0 0 -1035.72 0 0 0 0 0 0 2107.84 -1137.5 0 2199.24 -449.919 0.03 
