*Vertices 60
*Matrix 
0.06 0 0 0 -2236.63 0 0 0 480.895 275.048 0 0 0 0 0 2411.8 235.374 0 0 0 1394.92 -697.272 0 954.085 160.298 0 0 0 0 882.061 0 0 0 0 0 763.192 0 0 1248.59 0 0 0 0 0 0 1086.08 -1400.57 0 95.294 0 0 0 0 2288.66 -1238.82 0 0 0 -2351.22 0 
0 0 0 134.663 -1644.26 0 0 0 0 0 0 0 0 2016.89 1560.34 0 0 0 0 299.615 0 777.383 0 615.024 0 -309.229 0 0 0 0 963.698 2204.73 0 0 -611.82 0 0 0 0 -1605.96 1938.92 0 0 0 -868.633 0 -33.3415 0 0 0 0 0 0 0 0 0 0 0 0 0 
0 0 0.03 0 0 0 0 0 -516.297 0 0 0 0 1982.25 0 2171.16 0 0 0 1433.84 -1891.46 108.722 0 0 0 0 0 1044.27 0 0 0 0 342.647 0 0 0 0 0 -194.632 0 559.328 0 0 0 0 0 0 0 -638.371 0 0 -1475.8 0 0 1224.02 0 0 170.675 0 0 
0 1907.33 0 0.03 0 33.1889 0 0 0 0 0 0 0 -2475.89 0 0 99.7192 0 0 0 0 0 0 0 0 313.349 0 1631.75 0 0 0 0 0 2046.49 0 0 2249.44 0 0 0 0 0 0 0 0 0 1305.35 0 0 0 0 1991.1 -1322.14 0 309.381 0 0 0 0 -1201.13 
998.642 342.494 0 0 0.01 -1602.3 0 0 0 0 1930.83 0 0 0 0 0 0 0 0 0 0 0 0 0 0 0 0 0 0 0 0 0 -908.46 -452.208 1767.56 0 884.96 0 757.698 0 0 0 0 0 0 0 0 0 0 2220.76 0 0 0 2397.31 0 0 0 223.777 0 0 
0 0 0 1933.12 -833.079 0.04 0 2318.87 0 0 0 0 168.386 0 973.617 0 0 0 -1096.3 0 0 0 0 0 0 0 0 -1119.8 0 0 0 0 0 0 -313.501 0 1310.24 0 0 0 0 0 2273.25 0 0 1596.8 0 0 -815.378 0 -1682.41 0 0 0 0 1722.69 884.655 0 0 364.162 
0 0 0 0 0 0 0.01 0 0 0 0 2040.24 0 0 1858.35 -2036.42 1208.15 0 0 0 1219.75 0 1258.81 -2360.84 0 0 0 0 0 0 0 0 0 0 0 0 0 496.612 0 0 81.5607 0 0 0 0 0 0 0 669.5 -859.325 0 0 0 0 -2072.44 0 0 0 0 0 
0 0 0 0 0 -917.768 0 0.07 0 0 0 0 214.621 0 0 0 0 2057.63 -921.43 0 308.771 1045.18 2149.95 0 0 0 0 1733.99 -205.161 -1536.84 1651.89 0 0 0 0 -1964.55 0 0 0 -1385.92 0 0 0 0 0 0 400.632 0 2228.08 0 0 1315.88 0 -21.5918 -331.812 0 0 0 0 0 
8.01111 0 66.6066 0 0 0 0 0 0.07 0 1735.82 0 0 0 0 0 0 1992.78 1968.37 0 0 0 0 -526.826 0 1061.82 0 0 0 1777.78 0 -658.971 2398.37 0 -1004.59 0 0 0 -1022.9 0 0 0 -448.393 0 0 0 0 1421.78 1346.86 0 0 0 -1600.62 0 0 -1794.87 0 0 0 0 
-734.809 0 0 0 0 0 0 0 0 0.04 0 0 1271.02 1696.45 -1055.86 -766.701 0 0 0 0 556.124 0 1623.36 0 0 0 0 0 0 -1983.78 -2033.37 0 -53.9415 0 2107.53 0 0 1711.55 -1945.94 0 0 0 0 0 0 0 0 620.67 0 0 0 1049.15 25.4067 0 0 0 0 0 0 0 
0 0 0 0 -1613.74 0 0 0 2261.8 0 0.08 0 0 0 0 0 -906.323 0 2156.06 0 0 0 0 0 194.632 0 0 0 0 0 -1215.93 -691.321 717.261 2038.1 380.947 0 0 0 0 0 0 0 0 0 0 0 0 2285.91 0 0 0 0 0 1616.34 -68.1326 -820.719 0 -2284.23 0 0 
0 0 0 0 0 0 -2181.08 0 0 0 0 0.08 -320.063 0 0 0 0 0 0 2338.4 1513.18 -442.747 -959.578 0 526.826 0 966.75 0 660.802 0 0 0 0 723.67 0 0 0 0 0 0 0 0 0 0 0 0 0 0 2100.82 0 0 1730.02 929.06 0 0 0 0 0 0 0 
0 0 0 0 0 1830.27 0 1302.61 0 1695.84 0 -2342.52 0.06 799.661 734.046 1473.82 0 0 0 2377.01 1674.78 1977.22 0 -1570.71 0 0 353.786 0 0 745.949 0 0 -2071.67 777.993 0 0 0 0 -143.666 0 0 0 0 157.247 1208.76 0 0 0 -755.257 0 0 0 888.165 0 -2358.85 0 1244.47 0 0 0 
0 -1421.48 -318.232 761.055 0 0 0 0 0 2282.1 0 0 2025.59 0.03 0 0 2222.13 0 0 -770.058 0 0 0 -982.315 0 0 0 -317.469 0 -187.46 0 0 0 1531.5 0 0 -2378.38 0 0 0 0 1107.29 -721.839 0 0 0 0 1709.88 851.848 0 0 -480.743 -1695.68 0 0 0 0 0 0 0 
0 -1462.98 0 0 0 -236.442 261.773 0 0 -1136.28 0 0 2221.21 0 0.03 0 1811.5 282.067 0 0 0 0 0 0 0 0 0 0 442.137 436.338 933.332 0 0 0 -1463.29 0 0 0 0 0 0 0 0 0 2309.56 0 1697.67 0 0 0 0 0 0 0 1699.5 2053.06 0 2391.51 0 0 
-967.818 0 678.045 0 0 0 87.6644 0 0 2493.74 0 0 -604.953 0 0 0.07 0 0 0 1794.87 0 0 0 -550.172 0 0 0 0 0 0 0 1070.36 0 0 0 0 1364.86 0 0 0 0 89.8007 -1141.93 0 1295.43 0 0 -1359.52 0 0 0 0 0 0 0 0 0 0 0 0 
1435.21 0 0 1551.18 0 0 -1053.88 0 0 0 1685.46 0 0 -158.925 222.709 0 0.07 0 0 429.93 0 0 1088.52 1115.38 0 0 429.472 0 0 0 728.706 0 0 0 0 0 0 2198.32 907.239 1654.33 0 0 0 0 0 0 2039.63 0 0 0 0 1228.9 0 0 1230.74 698.187 0 0 0 0 
0 0 0 0 0 0 0 1589.02 2215.87 0 0 0 0 0 -1129.41 0 0 0.08 -201.956 0 2397.61 0 0 -396.207 0 0 0 1515.02 0 0 0 1056.63 1416.44 0 0 0 0 0 1403.32 0 0 0 0 0 0 0 2477.11 0 0 0 -1502.35 0 0 0 0 2427.21 -1885.51 0 0 0 
0 0 0 0 0 1126.06 0 2104.79 -441.374 0 115.284 0 0 0 0 0 0 -676.519 0.08 0 2210.84 0 0 0 -1460.39 0 0 0 1566.9 0 0 -1818.83 0 1185.57 0 0 0 0 0 0 0 0 0 0 904.187 0 0 0 0 -2363.89 0 0 0 1873 0 -59.1296 0 0 0 0 
0 1887.34 -2346.03 0 0 0 0 0 0 0 0 -1542.63 948.286 -50.5844 0 850.475 -1761.3 0 0 0.02 0 -946.303 0 0 0 0 0 0 0 0 0 -1121.48 0 0 0 0 0 977.889 0 2312.62 1603.52 0 0 0 0 0 0 463.195 0 0 0 921.125 0 0 1983.47 0 0 0 1235.01 0 
-2452.39 0 -457.244 0 0 0 650.121 1665.62 0 1242.03 0 1720.56 521.79 0 0 0 0 1015.58 1771.07 0 0.08 0 0 1486.63 2310.33 1898.79 0 0 0 0 0 0 0 0 0 0 0 0 415.128 0 0 1434.9 0 -1475.65 -2374.57 0 2439.42 0 -278.405 1561.56 0 0 0 -1525.39 0 -2389.98 0 0 0 0 
1997.36 -2025.59 1987.29 0 0 0 0 -1534.39 0 0 0 685.827 1765.11 0 0 0 0 0 0 -1251.34 0 0.02 0 497.681 1363.34 134.816 0 1821.12 0 0 0 -2256.46 -1840.04 -1378.75 0 1433.99 0 0 0 799.051 -2022.23 0 0 0 0 0 2229 0 0 0 0 0 0 0 0 721.992 0 0 0 0 
0 0 0 0 0 0 -476.165 -1244.16 0 66.6066 0 -1596.19 0 0 0 0 2200 0 0 0 0 0 0.04 0 0 -1509.67 1242.33 -1425.14 0 0 0 0 1326.26 0 0 0 0 0 0 1136.28 2088 0 1243.1 0 0 0 0 2283.62 0 0 0 0 0 0 0 0 0 0 0 0 
-2019.18 -2358.55 0 0 0 0 316.858 0 37.4615 0 0 0 696.966 176.473 0 -588.168 -40.3607 2135.61 0 0 2366.94 2281.95 0 0.01 0 1221.27 0 0 -439.39 0 1176.11 0 0 0 179.983 0 0 -2054.73 0 0 0 0 0 0 0 -158.925 0 0 0 0 0 0 0 0 -8.1637 0 0 0 0 0 
-239.647 0 0 0 0 0 0 0 0 0 2405.7 2320.25 0 0 0 0 0 0 -1918.01 0 2159.41 -2236.93 0 0 0.09 1690.8 0 0 -1781.9 1237.91 0 0 0 0 0 0 0 0 0 0 0 0 0 0 -450.072 0 0 925.855 0 -1217 0 0 1000.02 0 0 0 0 0 -35.9355 0 
0 -1528.14 0 2485.66 0 0 0 0 -645.848 0 0 0 0 0 0 0 0 0 0 0 2127.52 2436.98 1725.75 139.393 -273.37 0.07 -931.501 0 0 0 1970.66 0 -67.3696 0 0 0 0 1192.13 1497.16 1351.74 0 0 0 0 0 0 0 0 0 0 0 0 1110.49 1778.39 0 0 0 0 0 0 
0 0 0 0 0 0 0 0 0 0 0 1336.79 1360.44 0 0 0 1896.19 0 0 0 0 0 786.691 0 0 1114.61 0.03 0 0 855.205 2042.22 0 -1185.11 0 0 1012.83 0 0 0 0 0 0 0 0 1816.84 0 0 0 0 -1889.93 0 0 0 2130.73 0 0 0 0 0 0 
0 0 621.586 813.547 0 1154.13 0 156.941 0 0 0 0 0 -1347.93 0 0 0 887.097 0 0 0 264.519 -814.768 0 0 0 0 0.07 0 -2212.67 0 1113.09 841.319 1683.63 -1737.34 -1903.21 943.861 -76.9829 0 0 1252.25 0 0 -721.839 -764.412 0 0 0 0 0 0 -474.639 0 0 2406.46 0 0 0 0 0 
0 0 0 0 0 0 0 -2360.07 0 0 0 1711.25 0 0 -2388.45 0 0 0 2110.13 0 0 0 0 -218.741 -32.8837 0 0 0 0.02 0 0 0 0 0 0 0 0 -1175.5 0 0 -1456.42 0 0 0 -391.934 -261.315 811.411 -234.306 2137.9 1292.08 0 0 1034.65 0 1554.54 0 0 0 2347.1 0 
-377.895 0 0 0 0 0 0 -1336.02 -1216.39 1712.78 0 0 597.018 -617.771 -851.085 0 0 0 0 0 0 0 0 0 2011.55 0 -2189.78 2008.65 0 0.08 0 0 0 0 0 1705.6 0 0 0 0 1445.43 0 0 0 1451.38 0 825.144 0 0 -1205.25 0 427.335 0 0 0 0 0 0 0 0 
0 711.005 0 0 0 0 0 947.981 0 -1161.61 363.399 0 0 0 1566.13 0 1399.66 0 0 0 0 0 0 434.049 0 -638.523 -2483.67 0 0 0 0.07 0 0 379.116 0 0 0 -267.113 -1020.92 0 0 0 0 -539.033 1677.98 710.395 0 0 2431.79 0 0 0 0 0 0 0 0 0 0 -2245.78 
0 2451.93 0 0 0 0 0 0 2218.92 0 -1660.44 0 0 0 0 2010.94 0 169.912 371.181 910.138 0 1529.97 0 0 0 0 0 1593.6 0 0 0 0.08 592.288 0 0 0 0 0 0 0 0 0 0 0 0 0 0 0 0 0 0 739.54 0 0 0 -1915.88 0 0 1911.3 948.592 
0 0 469.298 0 -1448.64 0 0 0 875.195 -990.555 643.254 0 747.322 0 0 0 0 893.963 0 0 0 -1627.63 -303.278 0 0 2.06 1200.52 1786.17 0 0 0 -2205.19 0.07 -755.257 -1321.68 -278.558 892.743 0 0 0 0 0 -223.93 0 0 0 1457.79 0 1713.23 0 0 0 0 0 0 0 -1732.92 0 0 0 
0 0 0 846.812 -1579.71 0 0 0 0 0 -1770.3 1578.8 390.561 -727.18 0 0 0 0 1992.17 0 0 1093.86 0 0 0 0 0 167.165 0 0 1136.28 0 2424.62 0 0 0 0 2328.79 0 0 0 0 -404.447 1640.45 0 0 0 0 0 -2193.44 -403.836 0 0 1514.86 0 0 0 -2011.55 -362.331 0 
0 2214.35 0 0 -1107.59 2074.27 0 0 1865.37 -1301.39 -1745.73 0 0 0 1754.28 0 0 0 0 0 0 0 0 633.183 0 0 0 1865.21 0 0 0 0 -629.673 0 0.08 0 0 1203.27 0 2268.67 0 0 0 0 0 0 0 -1110.34 1358.3 0 812.937 0 0 1721.63 0 0 0 337.306 0 0 
1765.57 0 0 0 0 0 0 2012.92 0 0 0 0 0 0 0 0 0 0 0 0 0 523.469 0 0 0 0 664.922 848.796 0 -891.98 0 0 -511.719 0 0 0.08 0 0 0 0 -1054.8 0 0 0 0 -829.722 0 2350.15 0 0 0 0 0 0 -1427.12 0 0 0 0 1191.67 
0 0 0 -135.884 -1756.26 2040.7 0 0 0 0 0 0 0 652.715 0 2352.6 0 0 0 0 0 0 0 0 0 0 0 2415.31 0 0 0 0 -1893.14 0 0 0 0.08 0 0 0 0 0 0 -2024.37 0 0 0 -1962.87 1672.95 0 0 0 1479.61 0 0 0 0 0 0 1929.15 
0 0 0 0 0 0 -433.744 0 0 -598.544 0 0 0 0 0 0 2404.32 0 0 2343.9 0 0 0 882.672 0 -89.0378 0 1082.57 -2333.98 0 781.808 0 0 2207.17 -1197.01 0 0 0.09 0 224.998 0 0 0 -282.983 0 0 0 0 0 0 0 0 -360.958 142.445 0 0 0 0 0 0 
2113.79 0 1992.48 0 623.569 0 0 0 885.266 -1779.31 0 0 -1817.3 0 0 0 -2219.53 -1818.67 0 0 -1218.07 0 0 0 0 2083.57 0 0 0 0 -243.156 0 0 0 0 0 0 0 0.01 552.309 0 0 0 433.287 0 2384.79 0 0 1169.09 0 0 0 0 0 0 0 0 0 -1137.04 0 
0 1444.36 0 0 0 0 0 -82.9341 0 0 0 0 0 0 0 0 -1676.15 0 0 1446.35 0 1266.29 1769.39 0 0 1001.69 0 0 0 0 0 0 0 0 348.445 0 0 2309.41 -2287.9 0.06 0 1576.51 0 0 0 0 0 0 0 0 0 666.295 0 964.766 612.735 0 0 0 0 0 
0 1157.03 -133.747 0 0 0 1601.54 0 0 0 0 0 0 0 0 0 0 0 0 1924.42 0 -2259.36 -1052.2 0 0 0 0 2369.08 636.845 -1991.26 0 0 0 0 0 -899.762 0 0 0 0 0.07 -2128.28 0 0 0 1333.58 1413.54 0 0 0 0 288.171 0 0 460.906 0 0 0 0 0 
0 0 0 0 0 0 0 0 0 0 0 0 0 1107.59 0 1689.43 0 0 0 0 -757.698 0 0 0 0 0 0 0 0 0 0 0 0 0 0 0 0 0 0 243.309 1254.54 0.06 1528.6 0 0 1986.53 0 0 0 1642.43 0 123.371 0 828.196 0 0 0 0 0 0 
0 0 0 0 0 2162.16 0 0 1548.43 0 0 0 0 1766.64 0 1631.9 0 0 0 0 0 0 892.743 0 0 0 0 0 0 0 0 0 42.497 -1075.09 0 0 0 0 0 0 0 2021.47 0.01 0 0 0 -896.1 0 0 0 0 0 1826.91 0 0 0 0 0 0 -1338.01 
0 0 0 0 0 0 0 0 0 0 0 0 2386.17 0 0 0 0 0 0 0 131.306 0 0 0 0 0 0 863.903 0 0 2049.55 0 0 -2351.07 0 0 1613.28 93.4629 329.218 0 0 0 0 0.08 0 0 0 972.701 0 0 0 -1768.47 1901.84 793.1 0 0 0 0 0 0 
0 712.989 0 0 0 0 0 0 0 0 0 0 309.992 0 599.155 1563.84 0 0 220.878 0 830.027 0 0 0 1517 0 1542.94 2202.75 -2300.71 -307.55 -1464.66 0 0 0 0 0 0 0 0 0 0 0 0 0 0.09 766.091 0 137.41 0 0 -892.895 0 0 0 499.817 0 0 640.66 0 -841.014 
2343.13 0 0 0 0 -203.635 0 0 0 0 0 0 0 0 0 0 0 0 0 0 0 0 0 -29.3741 0 0 0 0 -698.34 0 1287.5 0 0 0 0 2455.29 0 0 -1021.38 0 -1770.91 552.461 0 0 -2380.52 0.04 -200.888 0 0 56.5355 934.4 2079.3 -1681.49 0 0 0 0 0 0 0 
1023.21 1467.25 0 2257.53 0 0 0 -284.204 0 0 0 0 0 0 2473.91 0 -213.248 -1021.53 0 0 889.996 -474.487 0 0 0 0 0 0 -1013.14 517.67 0 0 -181.356 0 0 0 0 0 0 0 2322.69 0 -1237.75 0 0 -32.4259 0.05 0 0 0 0 0 0 0 1197.78 0 0 0 0 0 
0 0 0 0 0 0 0 0 1405.45 -2020.4 871.227 0 0 1319.39 0 22.9652 0 0 0 993.912 0 0 -667.058 0 -378.506 0 0 0 -330.592 0 0 0 0 0 740.608 1259.12 1775.8 0 0 0 0 0 0 1465.27 2200.92 0 0 0.01 0 0 0 0 0 327.235 0 2481.84 1216.24 0 0 0 
527.436 0 868.786 0 0 751.595 865.886 -613.193 -1797.16 0 0 949.049 -737.251 1948.38 0 0 0 0 0 0 636.692 0 0 0 0 0 0 0 1772.59 0 -393.307 0 1195.79 0 737.556 0 -698.645 0 -1092.03 0 0 0 0 0 0 0 0 0 0.04 0 389.492 0 0 0 0 0 0 -841.777 0 0 
0 0 0 0 -877.178 0 1168.02 0 0 0 0 0 0 0 0 0 0 0 -1119.65 0 1280.33 0 0 0 -2023.3 0 -1704.54 0 703.528 -1524.63 0 0 0 -1791.97 0 0 0 0 0 0 0 911.512 0 0 0 1851.33 0 0 0 0.04 0 1228.29 2004.38 0 2427.37 -2214.35 0 0 0 0 
0 0 0 0 0 836.436 0 0 0 0 0 0 0 0 0 0 0 -1033.28 0 0 0 0 0 0 0 0 0 0 0 0 0 0 0 1312.83 2381.13 0 0 0 0 0 0 0 0 0 1667.76 730.689 0 0 690.1 0 0.06 0 0 2315.97 0 0 0 -1287.04 0 1974.32 
0 0 -2470.09 2436.37 0 0 0 120.624 0 1893.14 0 -1678.29 0 -1226 0 0 2185.66 0 0 515.229 0 0 0 0 0 0 0 -2388 0 2180.17 0 583.132 0 0 0 0 0 0 0 1291.62 2101.28 -2215.41 0 2031.69 0 -609.989 0 0 0 -342.036 0 0.06 34.1044 0 693.915 0 0 0 0 0 
0 0 0 -660.955 0 0 0 0 2189.32 -478.759 0 618.534 -437.559 2370.3 0 0 0 0 0 0 0 0 0 0 81.1029 -165.181 0 0 768.685 0 0 0 0 0 0 0 342.647 598.544 0 0 0 0 1416.29 1363.8 0 1567.05 0 0 0 -285.424 0 2283.62 0.08 0 0 0 0 0 0 0 
1747.41 0 0 0 -71.337 0 0 -2087.85 0 0 -1912.82 0 0 0 0 0 0 0 1116.9 0 -2218.47 0 0 0 0 1358.76 2197.26 0 0 0 0 0 0 2239.22 -1741.61 0 0 -25.5593 0 2425.38 0 267.876 0 772.958 0 0 0 771.889 0 0 -78.5089 0 0 0 1024.58 -749.153 0 0 0 0 
-653.783 0 1357.08 -592.441 0 0 2355.95 -1965.93 0 0 -2286.07 0 2010.48 0 2008.96 0 1376.92 0 0 -1607.03 0 0 0 1475.19 0 0 0 1133.53 -112.079 0 0 0 0 0 0 1756.42 0 0 0 327.387 101.093 0 0 0 -1878.8 0 1692.48 0 0 1605.2 0 -1295.28 0 2215.11 0.03 0 0 0 0 0 
0 0 0 0 0 472.045 0 0 2314.29 0 -2015.06 0 0 0 136.189 0 -728.248 2088.76 -379.421 0 1357.84 -99.2615 0 0 0 0 0 0 0 0 0 -2294.76 0 0 0 0 0 0 0 0 0 0 0 0 0 0 0 -1190.76 0 977.737 0 0 0 665.38 0 0.04 0 0 0 0 
0 0 0 0 0 -1435.06 0 0 0 0 0 0 -384.762 0 0 0 0 1682.1 0 0 0 0 0 0 0 0 0 0 0 0 0 0 1211.2 0 0 0 0 0 0 0 0 0 0 0 0 0 0 -365.23 0 0 0 0 0 0 0 0 0.02 0 0 0 
0 0 -2301.48 0 1688.67 0 0 0 0 0 1152.15 0 0 0 -225.761 0 0 0 0 0 0 0 0 0 0 0 0 0 0 0 0 0 0 894.421 1522.64 0 0 0 0 0 0 0 0 0 2497.25 0 0 0 2360.53 0 -1412.02 0 0 0 0 0 0 0.06 -175.405 -811.716 
-1767.56 0 0 0 0 0 0 0 0 0 0 0 0 0 0 0 0 0 0 2171.16 0 0 0 0 2103.72 0 0 0 2004.07 0 0 -2326.5 0 1487.55 0 0 0 0 1660.44 0 0 0 0 0 0 0 0 0 0 0 0 0 0 0 0 0 0 293.817 0.05 0 
0 0 0 2091.97 0 1709.88 0 0 0 0 0 0 0 0 0 0 0 0 0 0 0 0 0 0 0 0 0 0 0 0 -1706.52 1859.42 0 0 0 1218.22 -1545.38 0 0 0 0 0 -762.581 0 460.143 0 0 0 0 0 506.073 0 0 0 0 0 0 -2284.54 0 0.05 
