*Vertices 40
*Matrix 
0.08 0 0 0 0 -1545.08 0 989.944 0 0 0 0 0 0 0 0 2312.62 -982.467 0 0 0 0 0 0 0 0 2431.33 443.663 0 0 2430.72 0 -855.968 1470.31 0 0 0 0 0 0 
0 0.08 1412.63 0 0 0 0 0 2081.74 0 0 0 0 0 0 0 0 0 0 0 0 0 -453.124 699.255 2175.89 0 0 0 0 0 -1435.82 0 0 1970.96 0 0 -321.741 0 0 0 
0 858.409 0.07 0 -633.946 0 0 -1350.83 0 -260.704 0 1886.58 0 0 0 0 0 0 0 0 0 0 0 0 797.983 0 0 0 -1067.46 0 0 6.33259 0 0 0 0 0 0 0 0 
0 0 0 0.02 0 546.358 0 -26.4748 0 0 0 0 0 -1735.97 0 0 0 1107.9 0 0 0 -1034.5 -327.387 1422.24 2216.18 0 0 2044.97 110.096 0 2134.24 0 0 0 -384.762 0 0 0 0 0 
0 0 -1442.69 0 0.05 0 0 0 451.903 0 0 0 0 -494.476 0 235.984 0 -668.279 0 1267.97 0 0 -1350.22 0 0 0 -285.577 1566.13 0 0 1726.51 0 0 0 2194.2 0 1681.34 0 2207.79 627.079 
-1220.66 0 0 -210.654 0 0.04 427.488 0 494.934 0 0 196.005 0 1831.49 0 0 -701.239 0 2246.85 0 0 -1478.09 0 0 0 2359.46 0 1663.64 -4.1963 -1126.82 0 0 0 298.395 0 0 587.405 0 0 0 
0 0 0 0 0 501.343 0.09 0 -1161.92 0 2163.08 0 0 2182.91 0 0 0 0 0 0 0 0 0 2037.03 2177.42 0 -2141.25 2091.51 -2042.68 0 0 0 0 0 0 0 0 -1347.47 0 0 
-2257.38 0 512.329 1685.77 0 0 0 0.07 0 0 0 0 0 0 0 0 0 0 0 1245.08 1207.08 0 -808.512 -1939.22 -59.8926 0 0 -555.513 0 0 0 2272.03 0 0 0 0 0 0 0 2068.32 
0 -1529.97 0 0 167.928 -160.298 -1591.77 0 0.08 0 871.227 0 -2495.57 2445.68 0 1919.69 0 52.2629 0 -2207.02 1797.77 0 0 0 0 1363.49 0 -2017.5 0 2208.85 0 2152.39 0 0 0 0 0 0 0 0 
0 0 1136.43 0 0 0 0 0 0 0.09 0 0 59.5874 848.491 0 0 0 0 0 918.226 0 0 -735.725 586.795 -1543.55 965.987 0 0 0 0 1842.78 -230.644 0 0 0 0 -1106.98 0 0 0 
0 0 0 0 0 0 -495.849 0 -2065.26 0 0.03 0 0 188.833 0 0 2285.3 0 1342.13 1110.03 0 0 0 1458.1 463.347 -155.568 -1162.68 0 0 857.341 2338.25 0 0 0 0 0 0 0 0 2006.97 
0 0 -1911.45 0 0 1635.87 0 0 0 0 0 0.01 0 -1181.91 0 0 0 2277.06 1664.86 0 0 0 0 0 1889.02 -197.836 0 446.715 0 0 0 2092.27 0 2183.83 0 0 0 0 0 0 
0 0 0 0 0 0 0 0 851.238 48.4481 0 0 0.08 0 0 0 0 0 0 -401.09 0 0 0 0 0 0 -707.495 0 370.571 0 1268.88 0 0 0 0 0 0 0 0 0 
0 0 0 913.038 454.802 1618.32 -1125.9 0 865.734 -1330.84 -875.042 -1499.91 0 0.09 0 0 2271.11 0 -2002.85 0 1484.5 -1477.94 0 153.737 0 1213.95 1720.1 -120.319 0 352.107 0 2488.71 0 0 0 0 0 0 -1932.36 0 
0 0 0 0 0 0 0 0 0 0 0 0 0 0 0.02 0 -450.377 0 0 0 0 0 -1046.56 127.338 132.832 1978.44 0 2256.92 0 0 0 139.241 0 0 0 0 0 0 0 0 
0 0 0 0 1438.87 0 0 0 2314.75 0 0 0 0 0 0 0.08 0 0 0 341.273 0 0 0 0 2229.61 0 902.814 0 -328.303 0 655.919 0 0 0 803.323 0 0 0 0 0 
-760.292 0 0 0 0 1696.75 0 0 0 0 933.485 0 0 -1457.64 834.147 0 0.02 1029.47 102.618 0 568.636 -2135.46 0 0 0 1528.29 -1054.64 0 0 0 2059.62 0 0 0 1976.76 0 0 -1055.86 0 0 
-445.647 0 0 1540.04 1674.63 0 0 0 2064.35 0 0 -1079.06 0 0 0 0 -1108.51 0.09 0 1291.31 0 0 897.778 0 0 0 1128.65 0 -987.045 -1460.08 1443.91 -2426.45 0 0 0 0 0 0 0 0 
0 0 0 0 0 332.881 0 0 0 0 -338.679 981.704 0 -1296.35 0 0 2281.64 0 0.09 0 0 0 1947.31 0 0 0 0 0 0 0 0 0 -1855.91 0 0 0 0 0 0 0 
0 0 0 0 -648.442 0 0 720.008 -677.435 -2190.08 -641.118 0 -143.208 0 0 2281.79 0 1244.93 0 0.05 -1678.9 0 0 0 -1317.26 0 0 0 2315.52 1402.25 0 2164.3 -431.608 0 0 0 0 0 0 0 
0 0 0 0 0 0 0 901.746 -642.338 0 0 0 0 343.257 0 0 -1199.61 0 0 -395.749 0.08 2259.67 885.571 0 -1436.12 0 648.442 -782.876 0 797.83 0 0 0 0 0 1349.91 0 867.87 0 0 
0 0 0 1041.98 0 1152.91 0 0 0 0 0 0 0 -2112.87 0 0 1094.47 0 0 0 -1275.75 0.01 -1450.01 0 0 0 629.978 0 0 0 -1238.82 2452.24 2160.33 0 0 0 0 0 0 0 
0 -90.2585 0 -2066.79 1795.02 0 0 233.238 0 1153.68 0 0 0 0 586.489 0 0 1587.5 1877.57 0 241.783 -2304.07 0.09 0 0 0 1352.2 0 0 0 0 0 0 0 0 0 0 0 0 0 
0 1505.86 0 -853.221 0 0 -1611.61 759.224 0 1418.88 2229.15 0 0 -1231.96 2300.1 0 0 0 0 0 0 0 0 0.09 -167.013 0 0 0 -1840.65 315.332 0 0 0 0 0 0 0 0 0 0 
0 -1182.82 717.261 634.251 0 0 693.152 -780.74 0 1168.48 -799.814 2296.44 0 0 1409.27 -2362.21 0 0 0 -1642.74 1211.05 0 0 -647.221 0.04 -1950.36 1968.52 0 0 1114.46 0 0 0 0 0 0 0 0 0 0 
0 0 0 0 0 -1072.04 0 0 173.116 1779.46 724.128 979.263 0 -1035.57 2136.37 0 928.449 0 0 0 0 0 0 0 1794.11 0.07 0 0 0 2204.43 0 0 0 0 0 0 0 0 0 0 
-1297.11 0 0 0 -1387.45 0 -1447.42 0 0 0 981.399 0 2191.31 1314.51 0 -1152.61 562.99 2008.19 0 0 1997.82 2004.07 2447.66 0 1175.04 0 0.06 -965.682 0 0 2306.36 0 0 0 0 0 0 0 1772.74 0 
68.1326 0 0 239.341 951.033 -1074.48 1667.76 -2239.83 847.27 0 0 410.245 0 -2353.66 729.621 0 0 0 0 0 1477.94 0 0 0 0 0 -345.546 0.05 1635.41 0 0 0 0 0 706.732 2192.68 0 -429.93 0 -1287.8 
0 0 1296.04 1596.65 0 586.795 701.239 0 0 0 0 0 562.38 0 0 898.846 0 -255.211 0 2239.98 0 0 0 1701.64 0 0 0 -499.359 0.05 -1605.66 1495.33 0 0 0 0 0 0 0 0 0 
0 0 0 0 0 251.854 0 0 2486.11 0 415.128 0 0 2348.78 0 0 0 -1876.81 0 71.9474 1566.13 0 0 -1024.12 844.218 400.327 0 0 19.7607 0.03 0 0 0 0 0 0 0 0 -1161.31 0 
1256.98 -1445.59 0 819.346 881.603 0 0 0 0 78.814 -1965.62 0 -778.298 0 0 452.818 1465.12 1965.32 0 0 0 1304.13 0 0 0 0 1450.32 0 -1798.84 0 0.02 0 0 0 0 0 0 0 0 0 
0 0 1739.48 0 0 0 0 1247.67 -686.59 -416.654 0 1650.52 0 741.523 2197.26 0 0 -1339.38 0 -184.408 0 1454.89 0 0 0 0 0 0 0 0 0 0.06 0 0 0 0 1339.99 0 0 0 
-930.128 0 0 0 0 0 0 0 0 0 0 0 0 0 0 0 0 0 1719.95 1101.34 0 222.709 0 0 0 0 0 0 0 0 0 0 0.03 0 0 -942.946 0 0 1978.44 0 
-35.4778 1330.07 0 0 0 -1341.52 0 0 0 0 0 1895.43 0 0 0 0 0 0 0 0 0 0 0 0 0 0 0 0 0 0 0 0 0 0.02 0 0 1121.33 0 0 0 
0 0 0 -583.132 1665.32 0 0 0 0 0 0 0 0 0 0 1781.59 -355.464 0 0 0 0 0 0 0 0 0 0 1755.35 0 0 0 0 0 0 0.06 0 0 0 0 0 
0 0 0 0 0 0 0 0 0 0 0 0 0 0 0 0 0 0 0 0 -1150.01 0 0 0 0 0 0 2364.96 0 0 0 0 1698.89 0 0 0.03 0 0 0 0 
0 905.866 0 0 -1060.29 2270.35 0 0 0 919.599 0 0 0 0 0 0 0 0 0 0 0 0 0 0 0 0 0 0 0 0 0 -574.587 0 1562.93 0 0 0.09 0 0 0 
0 0 0 0 0 0 2231.44 0 0 0 0 0 0 0 0 0 2144.92 0 0 0 -670.568 0 0 0 0 0 0 -2030.63 0 0 0 0 0 0 0 0 0 0.03 0 -1502.35 
0 0 0 0 126.881 0 0 0 0 0 0 0 0 713.752 0 0 0 0 0 0 0 0 0 0 0 0 581.759 0 0 24.9489 0 0 1139.48 0 0 0 0 0 0.03 0 
0 0 0 0 -1444.21 0 0 -145.192 0 0 -2098.38 0 0 0 0 0 0 0 0 0 0 0 0 0 0 0 0 1435.06 0 0 0 0 0 0 0 0 0 2147.66 0 0.03 
