*Vertices 48
*Matrix 
0 0 0 0 0 0 0 1721.17 0 0 0 0 0 0 0 -32.8837 0 0 0 1028.24 0 0 0 0 950.728 0 0 0 0 0 1115.99 0 0 0 -165.639 0 0 0 0 0 0 0 0 0 0 0 0 0 
0 0.02 0 0 0 0 0 2472.84 0 0 0 0 -1855.91 0 0 0 0 0 996.963 -128.101 0 0 0 1339.84 0 1735.82 0 0 0 -186.087 0 0 0 0 0 0 0 -178.152 0 0 0 0 1103.17 0 0 -2117.91 0 0 
0 0 0.09 -1224.48 0 0 0 0 0 0 0 462.127 1416.59 0 0 0 0 0 1382.87 0 0 0 0 0 0 0 0 0 1543.24 0 0 0 980.331 0 0 0 0 0 0 0 0 0 0 1408.35 0 0 0 0 
0 0 -767.006 0.05 -2299.49 0 0 0 0 0 0 0 0 0 0 2115.47 0 0 883.435 0 0 0 1734.14 0 2017.04 0 0 0 0 2070.15 0 0 0 0 0 0 2354.58 0 0 0 0 0 2387.84 -496.307 0 0 0 737.556 
0 0 0 2041.46 0.08 0 0 0 0 0 0 0 0 -1995.22 0 0 0 0 585.269 0 0 0 1602.6 0 0 0 0 0 0 0 -1068.07 0 0 0 0 0 0 0 0 0 0 1782.82 0 0 0 0 0 0 
0 0 0 0 0 0.02 0 0 -1216.54 0 1540.96 0 -600.375 0 977.279 0 0 0 0 -377.895 0 0 2357.94 0 0 0 0 1646.4 0 0 0 0 0 0 0 0 0 0 0 0 356.075 0 0 0 0 267.266 0 1054.64 
0 0 0 0 0 0 0 0 0 0 0 0 0 0 0 0 0 0 0 0 0 0 700.476 0 0 0 0 0 0 0 0 0 0 0 0 0 0 0 0 0 0 0 0 0 0 -633.03 0 0 
284.509 -2068.32 0 0 0 0 0 0.03 0 1826.91 0 0 0 0 0 0 0 0 0 -1620.76 1513.95 0 0 0 0 0 0 0 0 0 0 0 0 0 0 0 0 0 0 0 1845.38 0 138.63 0 2349.7 0 0 0 
0 0 0 0 0 803.323 0 0 0 0 0 0 0 0 0 0 0 0 0 0 0 -899.609 950.575 0 0 0 1765.42 0 0 0 0 0 0 0 1856.97 0 0 0 0 0 0 0 0 0 0 0 0 0 
0 0 0 0 0 0 0 -369.045 0 0.07 0 0 0 2424.31 0 0 651.494 0 0 582.217 0 0 0 0 0 0 0 1705.3 1510.9 0 0 0 0 0 0 0 0 0 -1765.27 -1229.06 0 2390.13 -2071.83 0 0 0 0 0 
0 0 0 0 0 778.146 0 0 0 0 0.07 0 0 0 0 0 0 0 0 0 0 2072.13 0 0 0 0 0 2437.89 0 0 0 0 1278.34 0 0 0 0 0 0 0 0 0 0 0 0 0 0 0 
0 0 -1573.46 0 0 0 0 0 0 0 0 0.08 0 0 2151.63 0 0 0 0 0 -10.1474 0 0 0 0 1309.47 0 228.05 0 0 0 0 0 0 0 0 0 0 0 0 1499.76 0 0 0 0 0 0 0 
0 1154.13 -2349.24 0 0 1921.22 0 0 0 0 0 0 0.06 0 0 0 0 0 0 0 0 0 0 0 1968.06 2120.96 0 0 0 0 0 0 0 0 0 0 0 0 0 0 0 0 0 2190.85 -243.461 703.833 0 0 
0 0 0 0 2295.53 0 0 0 0 -1962.87 0 0 0 0.06 0 2312.77 0 0 0 0 0 0 0 0 0 0 0 0 1305.05 0 0 0 0 0 0 803.781 0 1190.6 0 0 0 0 0 0 1345.94 0 0 310.907 
0 0 0 0 0 -2485.96 0 0 0 0 0 772.805 0 0 0.03 469.451 0 2270.81 0 0 1713.39 0 0 0 0 0 0 0 0 -1217.46 0 0 0 0 -478.912 0 0 0 0 0 0 0 0 0 0 0 0 0 
-1214.56 0 0 599.918 0 0 0 0 0 0 0 0 0 345.088 2192.07 0.02 0 0 0 0 0 0 0 0 0 0 0 0 0 0 0 0 0 0 0 0 0 0 0 0 0 0 0 0 116.047 0 0 0 
0 0 0 0 0 0 0 0 0 229.881 0 0 0 0 0 0 0.08 0 893.201 0 0 0 0 0 0 0 0 0 0 0 1528.9 0 0 0 0 0 0 0 0 0 0 0 862.529 0 -1654.64 0 0 0 
0 0 0 0 0 0 0 0 0 0 0 0 0 0 2270.2 0 0 0.08 0 0 213.553 0 0 0 0 0 0 0 0 0 0 0 0 0 0 0 0 -826.67 0 0 0 0 0 0 0 0 0 0 
0 -279.778 2039.93 2216.33 1902.75 0 0 0 0 0 0 0 0 0 0 0 58.2141 0 0.09 0 -944.319 0 0 0 0 0 0 0 0 0 -885.418 0 0 0 0 0 0 -9.07926 0 0 0 0 0 0 0 0 0 2218.47 
1434.6 -1570.56 0 0 0 -1398.43 0 -1824.32 0 1004.9 0 0 0 0 0 0 0 0 0 0.08 1113.85 0 0 0 0 0 0 313.654 885.876 0 0 0 0 0 0 0 0 653.63 0 0 0 0 1463.29 0 0 0 0 0 
0 0 0 0 0 0 0 2363.28 0 0 0 246.361 0 0 2462.46 0 0 -1719.49 1182.36 -2484.59 0.05 0 0 0 0 0 0 0 0 687.658 0 1906.26 0 0 0 0 0 0 0 0 0 0 0 0 0 385.372 0 0 
0 0 0 0 0 0 0 0 -1378.9 0 1436.43 0 0 0 0 0 0 0 0 0 0 0.05 0 1445.43 0 0 0 0 0 0 0 0 0 538.728 0 -1037.55 0 0 0 -1143.3 0 0 1949.9 0 0 0 0 0 
0 0 0 -776.467 2101.28 199.667 -603.885 0 1863.84 0 0 0 0 0 0 0 0 0 0 0 0 0 0.03 0 1874.98 0 0 0 0 0 0 0 0 0 0 0 0 436.491 0 0 0 0 0 0 0 0 0 0 
0 -205.466 0 0 0 0 0 0 0 0 0 0 0 0 0 0 0 0 0 0 0 929.823 0 0.02 0 0 0 0 0 0 0 0 272.912 0 0 -430.998 0 0 0 0 0 0 0 0 0 0 0 0 
90.4111 0 0 1287.04 0 0 0 0 0 0 0 0 -56.5355 0 0 0 0 0 0 0 0 0 736.335 0 0.04 0 0 0 0 0 0 0 0 0 0 0 0 0 -731.3 -714.972 0 0 0 0 0 0 0 0 
0 -1660.28 0 0 0 0 0 0 0 0 0 -1126.36 1358.76 0 0 0 0 0 0 0 0 0 0 0 0 0.06 0 0 0 0 0 0 0 0 0 0 0 0 0 0 0 807.901 0 0 0 0 0 2311.24 
0 0 0 0 0 0 0 0 -25.2541 0 0 0 0 0 0 0 0 0 0 0 0 0 0 0 0 0 0.04 0 0 0 566.652 0 0 0 907.849 0 0 0 0 0 199.21 0 0 0 2359.92 0 0 0 
0 0 0 0 0 -293.359 0 0 0 1653.72 117.115 -2258.45 0 0 0 0 0 0 0 1605.66 0 0 0 0 0 0 0 0.08 0 0 0 0 0 -2388.45 0 0 0 0 611.209 0 0 0 0 0 2392.42 1107.59 0 0 
0 0 607.242 0 0 0 0 0 0 1957.69 0 0 0 -1048.69 0 0 0 0 0 2011.4 0 0 0 0 0 0 0 0 0.02 0 0 0 0 0 0 0 0 0 0 -1912.06 0 0 0 0 0 0 0 0 
0 432.371 0 -400.632 0 0 0 0 0 0 0 0 0 0 1614.51 0 0 0 0 0 -732.215 0 0 0 0 0 0 0 0 0 0 0 0 913.038 0 0 2399.29 0 0 0 0 0 0 0 0 0 0 0 
2053.97 0 0 0 -1339.99 0 0 0 0 0 0 0 0 0 0 0 1832.71 0 108.264 0 0 0 0 0 0 0 -1124.68 0 0 0 0.06 0 0 0 0 0 0 0 0 0 0 0 0 0 0 0 0 0 
0 0 0 0 0 0 0 0 0 0 0 0 0 0 0 0 0 0 0 0 1827.22 0 0 0 0 0 0 0 0 0 0 0.02 0 0 0 1357.69 0 0 1274.38 0 -406.278 0 0 0 0 -1285.21 0 0 
0 0 1072.8 0 0 0 0 0 0 0 1491.36 0 0 0 0 0 0 0 0 0 0 0 0 1619.08 0 0 0 0 0 0 0 0 0.05 0 0 0 0 0 0 0 0 0 0 0 0 -64.7755 0 0 
0 0 0 0 0 0 0 0 0 0 0 0 0 0 0 0 0 0 0 0 0 -143.818 0 0 0 0 0 -257.5 0 1639.68 0 0 0 0.06 0 1405.15 0 194.174 0 -971.633 0 0 -2009.41 0 1054.8 0 0 2071.98 
2380.21 0 0 0 0 0 0 0 -1179.46 0 0 0 0 0 -990.402 0 0 0 0 0 0 0 0 0 0 0 -195.09 0 0 0 0 0 0 0 0.02 0 0 0 0 0 0 0 0 140.919 0 864.36 0 0 
0 0 0 0 0 0 0 0 0 0 0 0 0 2451.32 0 0 0 0 0 0 0 1764.2 0 -2225.64 0 0 0 0 0 0 0 2383.88 0 2407.38 0 0.06 0 0 0 0 0 0 0 0 0 0 0 0 
0 0 0 1168.32 0 0 0 0 0 0 0 0 0 0 0 0 0 0 0 0 0 0 0 0 0 0 0 0 0 -596.255 0 0 0 0 0 0 0.09 1834.09 0 0 -190.359 0 0 0 0 0 0 0 
0 -571.993 0 0 0 0 0 0 0 0 0 0 0 1776.41 0 0 0 -785.47 1826.15 -1497.92 0 0 1079.52 0 0 0 0 0 0 0 0 0 0 -1780.53 0 0 -883.282 0.06 0 0 0 1593.91 0 0 0 0 0 0 
0 0 0 0 0 0 0 0 0 -589.846 0 0 0 0 0 0 0 0 0 0 0 0 0 0 2127.67 0 0 1130.33 0 0 0 -517.06 0 0 0 0 0 0 0.06 0 0 1144.37 0 2010.33 0 0 0 0 
0 0 0 0 0 0 0 0 0 848.338 0 0 0 0 0 0 0 0 0 0 0 -2026.51 0 0 2390.29 0 0 0 1955.24 0 0 0 0 -1123.62 0 0 0 0 0 0.03 0 0 2085.41 0 -1090.04 0 0 0 
0 0 0 0 0 1971.72 0 -1618.02 0 0 0 -269.707 0 0 0 0 0 0 0 0 0 0 0 0 0 0 1456.57 0 0 0 0 -291.833 0 0 0 0 1496.7 0 0 0 0 0 0 -2250.36 1978.59 0 0 0 
0 0 0 0 2412.26 0 0 0 0 -1611.3 0 0 0 0 0 0 0 0 0 0 0 0 0 0 0 574.282 0 0 0 0 0 0 0 0 0 0 0 942.335 1634.04 0 0 0 0 0 0 0 0 0 
0 2060.84 0 1316.03 0 0 0 -2192.68 0 2212.36 0 0 0 0 0 0 1248.28 0 0 -200.278 0 -972.854 0 0 0 0 0 0 0 0 0 0 0 1404.23 0 0 0 0 0 1701.03 0 0 0.09 0 0 0 0 2393.19 
0 0 1839.58 586.795 0 0 0 0 0 0 0 0 1710.33 0 0 0 0 0 0 0 0 0 0 0 0 0 0 0 0 0 0 0 0 0 1637.7 0 0 0 1131.24 0 2147.51 0 0 0 0 0 362.941 0 
0 0 0 0 0 0 0 -284.051 0 0 0 0 277.49 886.181 0 -1286.74 2064.81 0 0 0 0 0 0 0 0 0 1272.7 -2296.59 0 0 0 0 0 -2418.52 0 0 0 0 0 1125.14 2346.8 0 0 0 0.07 0 0 0 
0 995.285 0 0 0 -2428.43 2349.85 0 0 0 0 0 -2232.05 0 0 0 0 0 0 0 897.168 0 0 0 0 0 0 1162.37 0 0 0 -53.4837 1385.01 0 817.209 0 0 0 0 0 0 0 0 0 0 0.04 0 -874.737 
0 0 0 0 0 0 0 0 0 0 0 0 0 0 0 0 0 0 0 0 0 0 0 0 0 0 0 0 0 0 0 0 0 0 0 0 0 0 0 0 0 0 0 99.7192 0 0 0.05 0 
0 0 0 1873.91 0 -2091.51 0 0 0 0 0 0 0 1867.96 0 0 0 0 2097.46 0 0 0 0 0 0 833.232 0 0 0 0 0 0 0 -1721.78 0 0 0 0 0 0 0 0 -2405.09 0 0 993.912 0 0.07 
