*Vertices 64
*Matrix 
0.07 1467.71 0 0 1942.58 0 0 0 0 0 1784.19 0 0 0 0 -1833.17 0 0 0 0 0 0 1842.48 0 0 -1579.41 0 0 0 0 0 2346.64 0 358.211 0 0 0 1297.57 0 0 0 0 0 0 -1966.69 0 840.251 0 0 396.97 0 0 0 2486.88 -509.888 0 0 0 1031.6 0 0 -634.251 0 0 
2431.03 0.05 2294 0 1206.47 -204.093 0 -723.975 0 0 0 0 0 795.389 0 0 239.647 0 -1254.69 715.278 0 0 0 0 0 0 -375.301 -495.087 0 0 0 0 0 0 2250.97 -209.128 0 0 2086.02 0 0 0 0 0 0 0 0 0 0 0 0 1821.73 0 -1322.9 0 -919.446 0 0 0 0 0 0 0 0 
0 2355.95 0.06 0 2294.92 0 0 0 0 0 0 0 0 -278.71 0 0 0 0 0 0 0 0 0 0 0 0 0 773.721 0 0 0 0 0 2379.6 0 0 0 0 0 0 0 -377.59 -1982.25 0 0 0 0 0 -1189.69 0 0 -1658.45 -397.732 0 0 193.411 0 0 0 0 0 0 0 0 
0 0 0 0.06 0 0 0 0 -545.9 0 0 0 0 -108.722 0 0 0 0 0 0 0 0 0 0 0 -1208.15 0 0 2090.59 0 962.172 0 0 0 2235.86 2453.46 0 0 184.713 0 -1553.93 0 0 0 0 0 0 0 0 2424.01 0 0 0 0 0 0 0 0 1213.64 0 0 0 1447.11 2087.54 
1711.25 -152.974 -2311.24 0 0.03 0 75.3044 0 211.417 80.34 271.691 0 0 0 0 0 0 534.15 1037.55 0 0 -1478.09 0 0 0 0 1030.99 -474.639 0 2471.62 0 0 0 -1652.5 0 0 0 -390.866 0 134.51 0 1723.91 0 0 0 0 0 0 0 0 748.39 0 0 0 -1371.58 0 0 0 778.146 0 0 1019.7 1263.39 1814.86 
0 152.669 0 0 0 0.02 1519.75 0 0 0 0 0 0 0 975.143 2034.75 1683.02 -896.863 0 0 -1722.24 0 0 0 0 0 0 0 2460.17 0 0 0 0 -1192.89 0 228.507 0 -474.334 0 0 0 0 0 0 0 0 -2286.52 0 0 0 -427.03 0 0 1657.84 -573.519 0 643.254 0 0 0 0 0 0 0 
0 0 0 0 597.324 -938.52 0.08 0 0 0 0 0 0 1869.18 0 1921.67 0 0 0 0 2182.91 0 1634.95 0 0 0 0 -1786.78 0 0 0 -707.495 0 -1197.47 0 -494.171 0 0 1784.34 2125.08 0 0 0 480.438 0 1601.99 0 -2397.31 885.113 0 0 0 0 0 0 0 2452.7 0 0 0 0 -11.2156 0 0 
0 1908.7 0 0 0 0 0 0.01 0 0 0 2107.53 -2134.54 0 0 983.535 0 2168.72 0 0 0 0 1855.3 0 0 0 -389.798 0 0 -2192.98 -1619.24 0 0 2439.57 -1621.52 0 106.433 -287.866 0 1887.34 0 0 0 1435.51 0 -1636.17 -2115.77 -1141.32 0 0 -1919.23 0 0 2199.55 0 0 0 0 736.946 844.523 1160.54 0 0 0 
0 0 0 -867.565 -167.013 0 0 0 0.03 1101.49 0 991.775 0 -1279.11 0 0 0 0 1621.83 0 1936.78 760.445 0 0 0 0 0 697.272 -1890.55 0 0 1899.85 0 0 0 0 162.282 0 0 0 0 689.947 664.159 0 650.578 0 0 0 0 0 0 0 1280.48 0 0 -45.7015 0 0 0 -2388.15 0 0 2287.9 0 
0 0 0 0 -461.211 0 0 0 1372.34 0.01 2131.95 0 1611.76 0 0 0 0 905.103 0 0 2035.97 1993.7 0 0 0 522.401 0 0 0 0 0 0 1696.3 0 0 0 0 0 0 0 0 0 -2047.87 0 1101.18 0 0 0 0 0 0 0 0 0 0 0 0 0 0 0 0 0 0 0 
929.823 0 0 0 2241.97 0 0 0 0 317.164 0.03 0 -1908.7 0 0 0 0 0 0 0 232.627 0 -282.83 35.02 -1287.35 0 0 0 0 1315.88 -1174.43 0 878.552 0 516.297 0 1589.18 0 0 0 0 837.809 0 1847.67 0 -1961.96 0 0 0 2418.97 0 -2436.37 -1785.87 0 1168.02 0 608.158 0 0 0 0 0 0 0 
0 0 0 0 0 0 0 1701.33 -1093.86 0 0 0.01 2015.67 -2111.96 -214.927 0 0 0 0 0 0 1362.12 0 0 0 880.535 0 0 0 0 0 0 971.633 -913.343 0 0 0 0 0 952.406 0 0 596.713 -66.9118 -1529.97 0 0 0 0 0 0 -1006.27 1090.04 0 0 -550.63 0 0 0 -1279.87 2326.2 0 0 0 
0 0 0 0 0 0 0 32.8837 0 1541.26 1351.28 2447.97 0 0 0 0 0 1110.19 0 0 0 0 0 1181.75 -723.823 0 0 0 0 1419.64 0 0 -1209.68 0 0 0 -2476.2 0 359.89 0 0 0 1356.78 0 0 0 0 -1639.07 0 0 0 0 0 0 0 0 0 0 0 0 -153.584 0 -260.704 0 
0 888.318 2307.89 2161.7 0 0 315.027 0 2283.78 0 0 -221.335 0 0.01 977.432 0 0 0 0 371.639 0 -2439.12 0 0 0 -2468.11 -600.07 0 0 0 0 0 0 0 0 0 0 0 0 0 0 0 -151.296 0 0 0 0 0 196.158 0 0 0 0 215.842 0 1406.52 -696.203 0 -76.9829 2177.88 -551.088 -1984.24 0 0 
0 0 0 0 0 1233.94 0 0 0 0 0 709.021 0 -1885.81 0.02 0 0 0 0 1393.55 0 0 0 820.566 0 1298.49 1423.46 0 1629.31 0 0 0 0 -1097.52 0 0 0 0 0 0 0 -43.5652 0 0 0 0 0 0 0 0 0 0 -555.513 0 0 -909.986 0 0 2171.62 0 940.962 0 0 0 
2013.53 0 0 0 0 51.1948 1153.98 835.368 0 0 0 0 0 0 0 0.02 1403.78 0 0 664.159 0 0 0 0 0 0 0 -1597.57 0 0 166.097 -1439.33 -1078.91 0 0 -1032.52 0 0 0 1270.56 0 -606.479 0 0 0 0 2419.43 0 0 0 0 0 0 396.817 0 0 353.175 0 0 0 0 0 876.11 0 
0 1659.22 0 0 0 -1379.21 0 0 0 0 0 0 0 0 0 699.255 0.08 0 0 -96.6674 0 0 0 0 0 0 0 0 179.525 851.695 -1919.23 0 0 1401.18 0 0 0 0 1704.99 0 0 0 0 0 0 0 0 0 0 0 0 2267.3 0 -531.861 0 1760.84 0 998.947 -2401.88 -70.5741 0 0 0 0 
0 0 0 0 383.084 -819.498 0 -1838.21 0 1234.24 0 0 1226.16 0 0 0 0 0.01 0 0 2435.15 -1610.39 -1831.03 0 0 0 0 0 0 0 0 0 0 2346.8 1321.07 0 0 -513.55 0 0 0 259.484 0 0 2009.72 0 0 328.913 0 0 0 0 0 0 0 0 -1982.86 0 -2453.92 0 1388.52 0 1901.99 0 
0 232.475 0 0 -1916.18 0 0 0 2065.72 0 0 0 0 0 0 0 0 0 0.03 0 0 2181.08 0 0 2199.09 0 0 0 0 0 0 0 0 0 0 0 -1190.76 922.651 0 0 0 1883.37 0 0 632.878 0 0 1442.53 0 0 0 0 0 557.955 0 0 0 0 0 0 -204.855 0 0 0 
0 209.433 0 0 0 0 0 0 0 0 0 0 0 2269.89 623.112 -1592.53 -2054.89 0 0 0.05 0 0 0 0 0 0 0 0 0 0 0 0 0 0 0 0 2478.79 1425.75 -142.293 -2436.06 0 0 -1215.17 712.378 0 0 0 1177.63 0 0 0 0 -1224.94 -422.3 0 0 1950.97 0 0 0 0 1642.74 0 0 
0 0 0 0 0 1893.75 -1155.35 0 1811.81 -376.064 1802.96 0 0 0 0 0 0 1842.33 0 0 0 0 -2423.55 0 0 1256.68 2491.61 0 0 0 0 2041.76 0 0 0 0 649.358 855.358 0 0 -1618.93 0 0 332.575 0 0 2115.92 0 0 0 0 0 -1835 0 1735.36 2079 0 -854.442 0 0 1392.18 2188.56 -573.824 0 
0 0 0 0 2059.01 0 0 0 294.122 1410.03 0 1616.49 0 -2154.99 0 0 0 -2425.53 -325.861 0 0 0.07 -1553.32 0 0 399.106 0 0 200.888 1979.05 0 0 0 0 2324.21 0 0 -765.481 0 0 0 0 -771.889 0 0 0 0 0 -1731.54 -610.599 0 -23.8807 0 -994.369 0 0 0 0 0 0 201.956 1681.49 0 0 
-1937.54 0 0 0 0 0 1513.34 -1184.8 0 0 2283.62 0 0 0 0 0 0 531.709 0 0 -1933.12 949.202 0.04 0 0 0 -626.469 0 1881.85 0 0 961.562 0 0 0 0 1132.16 0 0 0 0 871.227 0 0 0 0 0 0 0 0 -1631.6 1258.51 221.03 0 0 2335.35 0 0 0 0 0 0 0 0 
0 0 0 0 0 0 0 0 0 0 1466.64 0 2200.31 0 2210.68 0 0 0 0 0 0 0 0 0.08 0 0 0 0 0 0 0 0 0 0 -878.399 0 0 0 0 1075.55 0 0 0 -2127.83 0 0 0 0 0 0 0 0 0 0 0 0 0 -802.408 0 0 0 -2114.25 2100.97 0 
0 0 0 0 0 0 0 0 0 0 1979.2 0 1251.79 0 0 0 0 0 -279.778 0 0 0 0 0 0.06 0 0 0 0 -2113.94 0 0 0 0 0 1828.9 0 -1137.81 0 0 0 0 150.838 850.475 2410.28 0 0 0 0 0 0 0 0 0 0 994.827 0 0 1289.48 -1102.71 0 -279.778 0 0 
1048.54 0 0 -257.653 0 0 0 0 0 1320.61 0 -2212.97 0 71.4896 1359.07 0 0 0 0 0 1562.47 2177.27 0 0 0 0.04 0 0 0 0 0 0 0 0 0 0 0 1848.43 0 0 0 0 0 0 0 0 0 0 0 0 0 0 0 1331.75 0 0 0 2464.6 0 0 -478.301 0 0 0 
0 2440.03 0 0 -1527.99 0 0 2042.53 0 0 0 0 0 2383.57 2308.19 0 0 0 0 0 -1182.36 0 1406.22 0 0 0 0 0 1074.33 0 2165.82 0 0 0 0 0 1232.87 223.777 -1930.52 2489.78 0 0 0 0 0 1294.67 0 0 0 0 0 0 0 -2376.4 0 2060.53 -1829.81 0 0 0 417.57 203.33 0 0 
0 -819.498 -1907.94 0 -382.321 0 -1133.69 0 -445.189 0 0 0 0 0 0 -909.528 0 0 0 0 0 0 0 0 0 0 0 0 0 0 0 0 0 0 0 -574.74 2098.07 0 0 0 0 0 0 1649.45 0 0 0 0 1119.34 0 0 0 0 949.812 0 -2397.46 442.137 1955.4 0 1989.58 729.621 0 0 0 
0 0 0 1644.72 0 1833.02 0 0 -989.029 0 0 0 0 0 1111.26 0 2409.21 0 0 0 0 -631.962 -1596.5 0 0 0 -365.841 0 0.02 2175.74 0 0 0 0 -1057.54 0 0 0 0 -24.7963 0 -1625.34 0 0 0 0 0 0 394.528 0 0 0 0 0 0 0 0 0 0 0 0 957.137 0 500.885 
0 0 0 0 -427.793 0 0 -548.341 0 0 2007.58 0 1503.27 0 0 0 372.86 0 0 0 0 -824.992 0 0 -961.257 0 0 0 2200.31 0 0 -170.98 0 0 0 0 0 0 -1039.38 0 0 0 2183.37 -1395.08 -1580.63 0 -448.851 0 0 1590.7 0 909.833 0 0 0 1453.83 0 0 469.451 893.201 -186.239 0 0 0 
0 0 0 865.886 0 0 0 2125.69 0 0 80.6452 0 0 0 0 -11.2156 70.2689 0 0 0 0 0 0 0 0 0 222.709 0 0 0 0.04 0 0 0 0 0 0 0 0 0 2197.26 0 0 0 0 0 0 0 0 81.1029 0 -682.775 0 0 0 1302.45 0 0 0 -1165.43 0 0 0 0 
1448.48 0 0 0 0 0 -565.584 0 -1031.75 0 0 0 0 0 0 1637.24 0 0 0 0 553.224 0 -64.1652 0 0 0 0 0 0 -2041.76 0 0.02 0 0 2401.88 0 0 0 0 0 -2185.35 0 0 0 2283.32 0 0 1315.58 0 0 0 0 -617.161 0 0 0 -1304.28 -2266.08 0 214.316 0 337.001 0 0 
0 0 0 0 0 0 0 0 0 1497.16 810.038 959.273 692.999 0 0 -151.448 0 0 0 0 0 0 0 0 0 0 0 0 0 0 0 0 0.05 0 0 2441.1 0 0 0 0 -796.915 0 0 1440.7 1146.81 -1292.54 2239.22 0 -1118.88 -1967.15 0 0 -325.404 0 0 0 0 0 0 0 -1448.79 -711.921 0 0 
-106.586 0 1243.71 0 -2086.02 -1255.3 -1565.07 1442.53 0 0 0 695.288 0 0 -1321.68 0 1063.65 549.409 0 0 0 0 0 0 0 0 0 0 0 0 0 0 0 0.09 0 0 0 1487.4 0 0 1992.78 0 335.322 0 0 -1568.42 0 70.2689 0 0 0 993.912 0 775.246 0 0 0 -678.961 1350.22 -1199.76 0 0 1446.96 0 
0 1011.92 0 284.814 0 0 0 -2331.39 0 0 2199.85 0 0 0 0 0 0 -112.537 0 0 0 -610.446 0 2280.11 0 0 0 0 1029.16 0 0 2103.26 0 0 0.06 0 0 0 0 -1152.3 1138.57 0 -141.224 0 476.623 0 0 0 1799.75 758.766 0 0 0 0 0 0 1035.87 0 -2267.6 944.472 0 581.759 0 0 
0 210.807 0 -141.224 0 698.95 -754.494 0 0 0 0 0 0 0 0 -1585.67 0 0 0 0 0 0 0 0 -477.844 0 0 1995.83 0 0 0 0 172.353 0 0 0.06 0 0 0 0 0 0 0 0 0 1154.44 0 0 115.284 1999.65 -1017.26 0 0 1212.58 -2221.06 0 0 1135.82 1571.63 0 0 0 0 1545.38 
0 0 0 0 0 0 0 1855.91 1005.36 0 1588.26 0 -1609.47 0 0 0 0 0 -2127.67 864.971 2421.57 0 1065.63 0 0 0 19.1504 172.658 0 0 0 0 0 0 0 0 0.04 1804.33 0 0 2470.7 0 -2191.61 1718.12 -2378.54 0 0 1767.25 0 0 0 0 0 -404.294 0 0 0 0 -613.956 -2270.04 0 0 0 0 
1817.91 0 0 0 1652.04 1705.6 0 -1153.68 0 0 0 0 0 0 0 0 0 357.143 2022.39 -2091.81 -1639.38 -1238.98 0 0 -1022.14 721.686 2170.71 0 0 0 0 0 0 -160.146 0 0 -51.3474 0.06 0 0 282.83 0 0 0 0 0 0 0 0 0 0 0 0 1986.07 0 1809.06 342.189 0 0 -937.147 1065.63 0 0 0 
0 1580.17 0 1961.5 0 0 929.67 0 0 0 0 0 2407.53 0 0 0 1708.35 0 0 1852.09 0 0 0 0 0 0 -1991.1 0 0 -459.075 0 0 0 0 0 0 0 0 0.05 0 826.67 0 0 0 0 0 0 215.079 0 2173.91 0 1970.2 0 0 0 0 0 0 -358.821 0 0 0 0 0 
0 0 0 0 2434.23 0 -1718.12 -551.851 0 0 0 2151.17 0 0 0 1598.64 0 0 0 -156.331 0 0 0 -609.684 0 0 -98.6511 0 1885.2 0 0 0 0 0 2271.72 0 0 0 0 0.07 0 0 0 0 637.15 0 0 0 1264.92 0 -409.94 0 0 0 1691.41 2459.56 0 -1146.2 0 -1303.98 0 0 0 0 
0 0 0 1098.28 0 0 0 0 0 0 0 0 0 0 0 0 0 0 0 0 -341.426 0 0 0 0 0 0 0 0 0 -2237.24 822.245 353.938 1922.44 1096.76 0 -949.66 113.147 -780.435 0 0.03 1877.42 0 2488.25 0 0 0 0 0 0 0 0 0 0 598.392 -2153 1680.12 0 0 0 0 0 0 0 
0 0 648.9 0 597.324 0 0 0 1901.84 0 1975.23 0 0 0 2149.34 1707.28 0 1901.68 303.43 0 0 0 1162.83 0 0 0 0 0 -364.467 0 0 0 0 0 0 0 0 0 0 0 -149.922 0.07 -669.958 0 0 2378.69 -1018.78 0 0 0 0 0 2391.96 926.16 -687.964 1319.24 0 0 41.7341 122.608 0 0 0 0 
0 0 -863.598 0 0 0 0 0 812.479 -1972.64 0 -396.054 -1221.43 -1322.9 0 0 0 0 0 1906.11 0 -1382.72 0 0 2338.4 0 0 0 0 -1877.73 0 0 0 -929.67 2365.72 0 1371.43 0 0 0 0 -753.883 0 0 0 0 0 0 0 0 2033.52 -564.364 2483.37 0 0 0 0 0 -1490.45 2459.26 -1012.83 0 0 0 
0 0 0 0 0 0 221.946 2238.46 0 0 -796.915 2064.81 0 0 0 0 0 0 0 -669.5 -1986.53 0 0 623.875 644.169 0 0 -2296.44 0 1707.74 0 0 -459.99 0 0 0 -175.863 0 0 0 426.115 0 0 0.05 0 0 0 1117.66 1562.32 -1035.57 0 356.838 -557.039 0 -56.0778 0 0 0 1398.89 0 1985.92 0 0 0 
-2056.72 0 0 0 0 0 0 0 2006.52 -214.774 0 -189.749 0 0 0 0 0 -1084.7 991.47 0 0 0 0 0 1516.08 0 0 0 0 -1115.68 0 629.063 671.026 0 327.693 0 627.995 0 0 -2211.45 0 0 0 0 0 -1646.86 0 0 0 0 1457.79 0 0 -1753.36 -386.288 0 0 0 2280.42 1739.02 1494.42 0 -1132.01 0 
0 0 0 0 0 0 -1598.64 1953.26 0 0 2025.59 0 0 0 0 0 0 0 0 0 0 0 0 0 0 0 -1422.7 0 0 0 0 0 1955.4 2089.07 0 1143.3 0 0 0 0 0 -1231.65 0 0 485.626 0.03 1607.18 -883.74 0 -390.561 0 0 2218.47 0 0 0 -1479.77 0 0 0 0 0 0 0 
817.057 0 0 0 0 -1965.93 0 1353.57 0 0 0 0 0 0 0 -220.573 0 0 0 0 1086.54 0 0 0 0 0 0 0 0 -2048.78 0 0 2281.18 0 0 0 0 0 0 0 0 -353.786 0 0 0 923.109 0.02 -396.97 0 0 0 924.94 0 0 0 -128.254 0 -392.697 0 67.8274 0 0 0 0 
0 0 0 0 0 0 488.83 1390.35 0 0 0 0 159.23 0 0 0 0 -107.959 -1546.6 2054.73 0 0 0 0 0 0 0 0 0 0 0 1347.47 0 -691.473 0 0 -29.5267 0 2410.58 0 0 0 0 -698.645 0 1899.7 1547.36 0.05 0 -1131.4 0 0 0 0 1172.6 0 -1754.28 0 0 0 2144.46 322.962 0 0 
0 0 -213.095 0 0 0 2147.82 0 0 0 0 0 0 2160.94 0 0 0 0 0 0 0 11.5207 0 0 0 0 0 -1565.22 -1394.31 0 0 0 2069.38 0 1180.38 2498.17 0 0 0 719.855 0 0 0 2175.44 0 0 0 0 0.09 0 0 770.669 0 0 0 0 0 0 0 0 0 1030.99 0 0 
218.589 0 0 -94.0733 0 0 0 0 0 0 1484.04 0 0 0 0 0 0 0 0 0 0 -2483.52 0 0 0 0 0 0 0 2058.55 -47.8378 0 1398.13 0 -2397 1644.26 0 0 717.872 0 0 0 0 1486.02 0 -1009.93 0 -285.73 0 0.04 2027.27 0 373.318 0 -333.033 0 2219.69 0 0 604.343 0 -1854.23 0 0 
0 0 0 0 1665.17 1221.43 0 -1054.34 0 0 0 0 0 0 0 0 0 0 0 0 0 0 -829.875 0 0 0 0 0 0 0 0 0 0 0 0 1835.92 0 0 0 2228.23 0 0 1543.86 0 -181.204 0 0 0 0 -1276.06 0.07 0 593.509 0 0 0 0 0 0 0 -1896.95 0 0 0 
0 2469.94 -1634.04 0 0 0 0 0 0 0 -1362.88 759.377 0 0 0 0 211.57 0 0 0 0 2194.97 -53.1785 0 0 0 0 0 0 1371.88 -1153.22 0 0 107.349 0 0 0 0 -595.035 0 0 0 526.215 -2345.42 0 0 971.175 0 2429.65 0 0 0.09 0 2010.33 0 433.744 891.369 0 0 0 0 0 28.3059 0 
0 0 1439.94 0 0 0 0 0 -1358.61 0 274.133 1766.49 0 0 1846.9 0 0 0 0 -1346.55 962.935 0 -966.292 0 0 0 0 0 0 0 0 -862.377 926.618 0 0 0 0 0 0 0 0 873.669 891.827 1487.7 0 700.629 0 0 0 1269.8 1707.59 0 0.03 0 0 -1864.45 -260.094 1236.53 -597.018 0 0 0 0 0 
-1965.93 -1715.83 0 0 0 20.0659 0 652.409 0 0 0 0 0 2221.82 0 -81.8659 -1893.29 0 2025.44 -1423 0 972.549 0 0 0 -754.952 1927.17 2205.5 0 0 0 0 0 -2433.62 0 2475.28 1086.69 1605.96 0 0 0 -386.288 0 0 1707.89 0 0 0 0 0 0 2011.4 0 0 0 0 0 -555.208 0 17.6244 -1192.74 2177.42 0 0 
-2036.58 0 0 0 235.069 635.319 0 0 0 0 1976.15 0 0 0 0 0 0 0 0 0 1613.74 0 0 0 0 0 0 0 0 0 0 0 0 0 0 -344.478 0 0 0 -2173.91 -2179.71 -2134.54 0 2203.21 -860.698 0 0 1215.63 0 -1559.11 0 0 0 0 0.07 0 0 0 0 -1681.95 2229.61 1679.05 0 0 
0 -2274.01 -64.9281 0 0 0 0 0 14.7252 0 0 2179.71 0 -2411.5 1173.51 0 2274.01 0 0 0 -1641.67 0 -318.537 0 1447.11 0 -1140.25 -361.568 0 -1800.06 2379.91 0 0 0 0 0 0 1221.27 0 -171.133 -1956.16 961.257 0 0 0 0 1885.51 0 0 0 0 -205.466 299.158 0 0 0 1672.95 0 0 0 0 826.365 0 0 
0 0 0 0 0 638.676 2097.46 0 0 0 2227.47 0 0 922.498 0 206.839 0 683.081 0 561.464 0 0 0 0 0 0 -387.204 -640.66 0 0 0 -955.458 0 0 2227.93 0 0 529.267 0 0 670.263 0 0 0 0 2202.75 0 540.101 0 644.932 0 -521.638 657.598 0 0 421.079 0.08 -416.501 0 0 0 -961.104 0 131.153 
0 0 0 0 0 0 0 0 0 0 0 0 0 0 0 0 -1860.79 0 0 0 648.289 0 0 129.475 0 2339.47 0 -258.873 0 0 0 1729.26 0 -1501.74 0 1337.55 0 0 0 -2107.23 0 0 0 0 0 0 1933.27 0 0 0 0 0 1785.26 2015.21 0 0 -1872.84 0.06 0 0 0 0 0 0 
1155.96 0 0 -2340.39 2165.67 0 0 -1470.92 0 0 0 0 0 2050.46 -346.461 0 824.839 2390.74 0 0 0 0 0 0 2035.66 0 0 0 0 1454.59 0 0 0 2118.67 1524.48 2132.4 2041.46 0 -718.635 0 0 535.524 -1159.78 188.07 52.4155 0 0 0 0 0 0 0 -88.1222 0 0 0 0 0 0.02 0 0 0 0 0 
0 0 0 0 0 0 0 940.504 80.7978 0 0 -24.0333 0 230.186 0 0 273.675 0 0 0 0 0 0 0 1911.45 0 0 -447.478 0 2157.73 -672.857 -1007.03 0 1826.91 -909.528 0 2456.82 2459.11 0 564.364 0 283.593 404.599 0 235.984 0 1386.53 0 0 -20.6763 0 0 0 1729.1 1761.91 0 0 0 0 0.06 315.638 0 -1179.62 -537.965 
0 0 0 0 0 0 0 -290.613 0 0 0 -1571.32 1069.14 532.777 -2236.47 0 0 1727.73 1585.06 0 -2265.01 -848.796 0 0 0 24.7963 650.121 616.398 0 2077.62 0 0 1086.99 0 0 0 0 2110.74 0 0 0 0 2221.52 -1052.66 26.9326 0 0 1715.06 0 0 539.644 0 0 -841.777 1816.39 0 0 0 0 2264.85 0 0 0 0 
-1197.32 0 0 0 2477.87 0 1786.94 0 0 0 0 0 0 -1704.38 0 0 0 0 0 1158.41 2216.18 595.34 0 -2485.96 -1222.34 0 -2348.48 0 2170.09 0 0 1387.91 -1634.65 0 2256 0 0 0 0 0 0 0 0 0 0 0 0 -1334.96 -50.1267 -2471.01 0 0 0 2239.68 1663.34 -719.703 2165.06 0 0 0 0 0.03 0 0 
0 0 0 -752.205 2086.63 0 0 0 -2078.39 0 0 0 1917.4 0 0 1963.79 0 1654.79 0 0 641.575 0 0 213.248 0 0 0 0 0 0 0 0 0 -49.6689 0 0 0 0 0 0 0 0 0 0 2426.3 0 0 0 0 0 0 923.109 0 0 0 0 0 0 0 -1501.74 0 0 0.06 806.986 
0 0 0 147.023 2351.53 0 0 0 0 0 0 0 0 0 0 0 0 0 0 0 0 0 0 0 0 0 0 0 2271.26 0 0 0 0 0 0 1913.89 0 0 0 0 0 0 0 0 0 0 0 0 0 0 0 0 0 0 0 0 -1602.76 0 0 -276.727 0 0 1825.39 0 
