*Vertices 63
*Matrix 
0.08 0 2352.6 1299.1 0 0 486.694 0 0 0 104.297 0 -1903.21 907.849 1490.14 0 0 0 0 0 0 1300.93 0 163.503 0 0 2122.49 0 -244.072 -285.577 0 2150.26 0 0 0 0 0 0 0 0 0 0 0 0 0 0 0 0 0 0 0 -620.212 0 0 0 0 0 0 0 0 721.381 0 0 
0 0.01 1058.15 0 0 0 0 0 945.692 0 -2322.99 0 720.161 845.897 0 0 0 0 0 -336.848 0 0 2058.24 2319.33 0 0 0 0 0 0 0 -1378.75 0 0 0 0 0 0 0 0 0 0 0 0 0 0 0 0 -1969.28 0 0 0 0 0 0 934.553 0 0 0 0 0 0 0 
1576.97 -2238.91 0.09 0 0 1271.17 0 -1646.55 0 912.275 0 0 0 0 0 0 0 0 0 0 1685.92 0 0 2000.72 0 0 0 0 0 247.581 0 0 0 1238.52 0 0 0 0 0 0 701.086 0 0 0 0 -958.51 0 0 0 0 0 -1747.72 0 0 0 0 0 0 0 0 0 0 0 
2069.38 0 0 0.03 0 0 -691.473 0 1523.87 0 0 0 0 0 0 0 0 0 0 0 0 0 0 0 0 0 0 1353.11 0 0 2192.83 0 0 0 0 0 0 0 0 0 0 0 1354.64 0 0 0 0 0 -500.275 0 0 0 0 0 0 0 0 -60.8081 0 0 0 0 -1602.91 
0 0 0 0 0.05 660.039 0 0 1433.68 0 1758.1 -2191 0 -1157.03 1298.18 0 0 658.208 0 2465.21 0 0 637.455 0 0 0 0 0 1158.41 0 0 0 0 0 0 0 0 0 0 -2251.73 0 -1597.57 0 -1162.98 0 0 0 0 0 0 0 0 0 0 0 0 0 0 0 0 0 0 0 
0 0 -696.814 0 1477.48 0.06 0 0 0 0 0 0 0 0 -1731.85 0 0 0 0 0 0 0 0 0 0 2280.72 0 23.7281 0 0 0 0 0 0 0 0 0 0 0 0 0 0 0 0 0 -390.408 0 0 0 1939.53 0 0 0 0 0 0 0 -138.63 0 0 0 0 0 
1165.88 0 0 1207.39 0 0 0.04 0 0 0 0 0 0 2339.17 1656.32 -605.716 0 1609.93 -1269.65 0 0 0 0 1107.14 0 0 700.476 1262.17 0 -1432.16 0 0 0 0 0 0 0 0 0 1717.96 -692.541 -1202.05 0 0 0 0 0 0 0 0 -2152.85 0 0 0 0 0 0 0 -1265.07 0 0 0 0 
0 0 1909.77 0 0 0 0 0.02 0 515.381 0 0 0 0 0 -2.67037 0 801.187 0 0 -1625.03 0 0 0 0 0 0 0 0 1624.12 0 0 0 0 0 0 -1322.44 0 0 -326.319 0 286.645 0 0 0 0 1818.83 1531.8 0 0 0 0 0 0 -1868.72 0 1653.42 -2228.69 0 0 0 0 0 
0 -275.201 0 1651.59 2089.68 0 0 0 0.06 0 1527.38 -371.944 618.992 0 0 0 0 0 0 0 0 0 0 2095.32 -2275.84 985.366 0 0 570.925 0 2296.29 0 -1732.76 0 0 0 0 0 0 0 0 0 0 0 0 0 0 0 0 0 0 0 0 0 0 0 0 0 0 0 0 0 0 
0 0 1900.77 0 0 0 0 -648.289 0 0 -2153.16 0 588.473 0 0 0 0 2497.25 0 0 1565.07 -804.849 0 0 -1252.4 0 -1037.4 2388.3 0 -235.374 0 0 1375.24 1071.89 0 0 0 0 0 0 0 0 2370.75 2021.01 0 0 0 0 -74.9992 0 0 0 0 -446.257 0 0 0 0 0 0 0 1379.51 0 
-1523.26 1131.24 0 0 1888.71 0 0 0 2003.31 -518.281 0.01 0 821.94 2456.05 0 0 0 0 0 0 0 -116.657 0 -2181.54 0 2148.43 1897.41 1250.72 0 440.458 0 0 -2257.07 0 0 0 0 0 0 0 0 0 0 0 224.235 0 0 0 0 0 0 0 0 0 0 1839.73 -2076.71 0 2077.47 0 0 0 0 
0 0 0 0 2433.47 0 0 0 -529.725 0 0 0.05 0 0 0 2042.38 0 0 0 0 0 0 0 -2197.26 0 0 0 0 0 0 0 409.482 -1323.82 175.863 0 0 0 0 0 0 0 0 0 0 0 0 0 0 0 -845.897 0 0 0 0 0 1908.25 0 0 1744.06 0 0 0 0 
-237.205 1194.57 0 0 0 0 0 0 1187.09 -2288.05 928.297 0 0.02 0 0 0 0 1051.74 1874.22 0 0 0 0 0 -1615.88 0 -667.058 1356.01 1353.27 924.635 0 0 0 0 0 0 0 0 961.409 0 0 0 0 -2287.59 0 0 0 0 0 1925.64 695.135 0 0 0 0 0 0 0 0 0 0 -2149.19 0 
1046.4 1542.63 0 0 2432.55 0 -100.33 0 0 0 2057.63 0 0 0.08 0 0 0 0 0 2101.28 0 0 792.337 0 0 0 0 -463.805 0 -173.879 0 0 84.9178 0 0 0 0 0 0 0 0 0 1513.95 0 0 0 0 0 0 0 0 0 0 0 0 0 0 0 0 0 0 0 314.57 
-2476.2 0 0 0 2431.03 779.061 1614.96 0 0 0 0 0 0 0 0 0 0 0 0 1260.64 0 0 0 0 -48.1429 0 0 0 0 0 0 0 1619.24 -445.189 0 0 0 1784.19 0 0 0 0 0 0 0 0 0 0 0 0 0 -978.347 0 0 0 0 0 -1028.7 0 -998.337 0 0 0 
0 0 0 0 0 0 2342.22 657.903 0 0 0 -196.921 0 0 0 0.07 0 0 634.098 0 1247.22 930.738 0 0 -144.429 2371.36 0 0 0 -1584.29 0 0 0 0 0 2063.89 0 0 0 0 0 0 0 304.346 0 0 0 0 0 0 0 0 165.487 0 0 0 0 0 0 0 0 0 0 
0 0 0 0 0 0 0 0 0 0 0 0 0 0 0 0 0.02 0 2408.14 0 0 0 247.124 0 0 790.658 0 2466.58 -2332.45 882.519 0 0 0 0 0 0 0 0 0 0 -1531.95 0 0 0 0 0 0 0 0 0 0 0 0 0 -396.359 0 0 0 0 0 0 0 0 
0 0 0 0 -876.415 0 1296.66 -1413.54 0 1459.78 0 0 929.975 0 0 0 0 0.02 192.343 2130.42 0 575.35 0 0 0 841.166 0 1573 0 0 1773.35 0 0 0 0 0 0 0 0 0 0 0 0 0 0 -984.603 0 0 1647.62 0 0 0 0 0 0 0 0 0 0 0 -1956.77 0 0 
0 0 0 0 0 0 2049.24 0 0 0 0 0 1747.72 0 0 2027.73 -1546.14 1404.69 0.07 0 0 2406.61 0 0 0 1801.43 0 0 0 0 0 0 0 -2303.31 0 0 0 -50.737 0 0 0 0 0 0 0 0 0 0 0 -1242.64 0 -1580.94 0 0 0 0 -1540.04 0 2278.89 0 0 0 0 
0 963.24 0 0 471.129 0 0 0 0 0 0 0 0 -183.34 -1021.07 0 0 1365.47 0 0.04 0 2201.22 0 1718.27 0 0 0 0 483.795 0 0 0 0 0 0 0 0 -1615.12 0 0 0 -2139.73 0 0 0 1167.87 0 0 71.9474 0 1260.8 0 0 0 0 0 0 0 2130.42 0 0 0 1645.18 
0 0 1707.28 0 0 0 0 -2464.75 0 2134.54 0 0 0 0 0 2397.61 0 0 0 0 0.03 0 0 0 643.406 800.729 -739.54 0 0 0 0 196.31 1130.48 0 1459.17 0 0 0 0 0 0 0 0 0 -1633.58 0 944.014 2023.45 0 0 0 0 0 0 0 0 0 0 0 0 0 0 0 
-902.203 0 0 0 0 0 0 0 0 2359.16 -1703.62 0 0 0 0 1332.82 0 -994.98 1377.53 832.621 0 0.08 0 1684.39 776.315 498.138 0 0 0 0 0 0 0 0 0 0 0 0 0 0 0 0 0 890.454 0 0 -2068.47 0 -424.894 0 416.196 0 0 0 0 0 0 0 0 0 0 206.687 0 
0 364.467 0 0 1187.7 0 0 0 0 0 0 0 0 -960.646 0 0 -34.1044 0 0 0 0 0 0.09 0 0 1069.29 0 0 2421.87 0 -1116.14 0 0 0 0 0 279.168 0 0 0 0 0 0 0 0 0 2264.55 0 0 0 0 0 0 0 0 0 0 0 0 0 0 0 0 
166.097 1679.36 541.169 0 0 0 1488.92 0 1690.04 0 -559.175 2230.52 0 0 0 0 0 0 0 -243.767 0 1616.49 0 0.08 0 0 0 0 0 0 0 0 0 0 0 0 0 -2089.07 0 0 0 0 0 0 0 0 0 0 0 1370.66 0 0 0 0 5.87481 0 -715.735 0 0 0 0 0 0 
0 0 0 0 0 0 0 0 -795.541 2437.89 0 0 -404.752 0 758.766 2005.14 0 0 0 0 2476.96 2437.13 0 0 0.05 0 0 0 0 0 0 -2367.4 -1547.98 -1483.73 0 0 0 0 0 0 0 0 1023.51 0 0 0 0 0 0 -1969.44 0 0 0 0 0 0 2366.63 0 0 533.54 0 0 0 
0 0 0 0 0 235.984 0 0 852.611 0 1151.08 0 0 0 0 -1315.12 1350.83 -689.947 2154.68 0 1613.28 -1966.99 -309.076 0 0 0.04 0 0 0 0 0 0 1205.56 0 0 0 0 0 0 0 0 0 0 0 0 0 0 0 0 0 0 0 0 906.018 0 0 0 0 0 -363.704 0 0 0 
-35.3252 0 0 0 0 0 41.4289 0 0 223.167 723.975 0 1664.1 0 0 0 0 0 0 0 -1119.5 0 0 0 0 0 0.04 0 -376.675 0 463.195 0 0 1831.19 0 0 0 0 0 0 0 0 0 1627.32 0 0 0 0 0 0 0 0 0 0 0 0 0 0 0 0 0 0 0 
0 0 0 -835.826 0 660.955 309.381 0 0 -1877.12 2075.03 0 -241.935 -822.398 0 0 1197.47 2354.58 0 0 0 0 0 0 0 0 0 0.09 0 0 0 -80.6452 0 -315.332 0 0 0 0 0 0 0 0 0 0 0 0 0 0 0 0 0 0 0 0 -566.5 0 0 0 0 0 0 0 0 
-11.2156 0 0 0 -971.786 0 0 0 1304.13 0 0 0 2099.9 0 0 0 638.066 0 0 1603.82 0 0 -373.47 0 0 0 1866.28 0 0.04 0 0 0 1418.58 1132.47 0 1820.2 0 0 0 0 0 0 0 0 0 0 0 0 0 0 0 0 -1014.21 0 0 0 0 -246.971 0 0 0 -355.312 0 
-265.587 0 1219.44 0 0 0 914.716 530.641 0 -1892.22 2215.26 0 1139.48 2098.22 0 2316.89 -2473.14 0 0 0 0 0 0 0 0 0 0 0 0 0.08 0 -11.2156 0 1378.75 0 0 1307.03 0 -467.162 0 0 -673.925 0 0 -2355.34 0 709.937 -429.624 0 0 0 0 -1301.84 -1186.48 0 0 0 0 0 0 0 -1459.93 0 
0 0 0 614.719 0 0 0 0 -2390.59 0 0 0 0 0 0 0 0 -127.186 0 0 0 0 1808.3 0 0 0 1011.15 0 0 0 0.02 0 0 0 0 0 0 0 -1318.63 0 2314.75 0 0 0 0 0 0 0 0 -849.406 0 0 1372.34 0 0 0 0 -219.047 0 0 0 0 0 
539.338 714.209 0 0 0 0 0 0 0 0 0 -370.266 0 0 0 0 0 0 0 0 -1126.06 0 0 0 1134.14 0 0 2100.67 0 -1187.55 0 0 0 0 0 0 0 0 0 0 0 0 0 0 0 1742.99 1837.6 0 0 0 0 0 0 0 0 0 0 0 0 0 0 0 0 
0 0 0 0 0 0 0 0 565.432 -404.752 1032.82 921.888 0 1907.64 438.322 0 0 0 0 0 214.927 0 0 0 488.525 204.55 0 0 1939.83 0 0 0 0.04 0 0 -906.323 0 0 0 0 0 0 0 0 -2277.98 0 0 0 0 0 0 0 1065.94 0 0 274.438 0 0 0 0 1403.93 0 0 
0 0 1163.29 0 0 0 0 0 0 716.956 0 14.1148 0 0 997.879 0 0 0 2122.03 0 0 0 0 0 -470.061 0 940.352 -861.919 2355.04 709.021 0 0 0 0.02 0 0 0 0 0 0 0 0 0 0 0 0 0 0 0 0 0 0 0 0 0 0 0 0 0 0 0 0 0 
0 0 0 0 0 0 0 0 0 0 0 0 0 0 0 0 0 0 0 0 1779.92 0 0 0 0 0 0 0 0 0 0 0 0 0 0.01 581.301 0 0 0 0 0 0 0 0 0 0 0 0 0 0 0 0 0 0 0 0 0 0 0 0 0 0 0 
0 0 0 0 0 0 0 0 0 0 0 0 0 0 0 -659.124 0 0 0 0 0 0 0 0 0 0 0 0 1918.01 0 0 0 1886.12 0 2496.19 0.07 0 0 -368.282 0 0 0 399.716 0 0 -1281.09 2418.82 0 0 0 0 -325.556 0 0 0 0 -1214.41 0 -952.101 0 0 0 0 
0 0 0 0 0 0 0 -1059.83 0 0 0 0 0 0 0 0 0 0 0 0 0 0 2194.36 0 0 0 0 0 0 766.701 0 0 0 0 0 0 0.02 1263.54 0 0 0 0 0 0 0 0 0 0 0 0 0 0 0 0 0 -673.62 0 0 0 0 0 0 0 
0 0 0 0 0 0 0 0 0 0 0 0 0 0 2137.44 0 0 0 1168.32 613.346 0 0 0 -210.959 0 0 0 0 0 0 0 0 0 0 0 0 -2049.09 0.03 0 0 0 0 0 0 0 0 0 0 0 0 0 0 0 0 0 0 0 0 0 0 0 0 0 
0 0 0 0 0 0 0 0 0 0 0 0 834.91 0 0 0 0 0 0 0 0 0 0 0 0 0 0 0 0 331.965 -732.521 0 0 0 0 -99.8718 0 0 0.04 0 0 0 0 0 0 0 0 1818.37 0 0 0 0 0 0 0 0 0 0 0 904.34 0 0 0 
0 0 0 0 1676.61 0 -346.004 1593.6 0 0 0 0 0 0 0 0 0 0 0 0 0 0 0 0 0 0 0 0 0 0 0 0 0 0 0 0 0 0 0 0.09 0 0 0 0 1417.66 0 0 0 -2467.65 0 0 0 0 0 0 0 0 0 0 0 0 0 0 
0 0 -1063.04 0 0 0 -1221.43 0 0 0 0 0 0 0 0 0 1545.84 0 0 0 0 0 0 0 0 0 0 0 0 0 657.445 0 0 0 0 0 0 0 0 0 0.09 1845.53 1325.19 0 0 423.521 1080.43 0 0 0 0 0 0 0 0 0 0 0 429.319 0 0 721.076 0 
0 0 0 0 2033.83 0 2282.1 448.088 0 0 0 0 0 0 0 0 0 0 0 -1931.75 0 0 0 0 0 0 0 0 0 -92.5474 0 0 0 0 0 0 0 0 0 0 432.218 0.01 0 0 0 0 0 0 0 0 0 0 0 0 0 0 0 0 0 893.048 0 0 0 
0 0 0 -922.193 0 0 0 0 0 -144.276 0 0 0 1906.57 0 0 0 0 0 0 0 0 0 0 927.839 0 0 0 0 0 0 0 0 0 0 684.301 0 0 0 0 2264.85 0 0.07 0 0 0 -1631.14 -185.629 0 0 0 1308.25 0 0 2133.32 0 0 0 0 0 0 0 0 
0 0 0 0 1278.8 0 0 0 0 2196.19 0 0 2235.71 0 0 1958.91 0 0 0 0 0 -1767.4 0 0 0 0 -2005.14 0 0 0 0 0 0 0 0 0 0 0 0 0 0 0 0 0 0 0 0 646.001 0 0 0 0 0 0 0 0 0 1060.9 0 0 -103.687 0 0 
0 0 0 0 0 0 0 0 0 0 2212.67 0 0 0 0 0 0 0 0 0 959.578 0 0 0 0 0 0 0 0 -1274.07 0 0 62.7918 0 0 0 0 0 0 -98.1933 0 0 0 0 0.02 0 0 0 0 0 1771.98 -734.352 0 0 1598.33 0 0 0 0 0 0 0 0 
0 0 -1612.83 0 0 1735.66 0 0 0 0 0 0 0 0 0 0 0 2153.31 0 2275.23 0 0 0 0 0 0 0 0 0 0 0 2042.99 0 0 0 -682.623 0 0 0 0 611.972 0 0 0 0 0.02 0 0 0 0 1434.75 -465.331 0 0 0 0 0 0 0 0 0 0 2362.67 
0 0 0 0 0 0 0 2146.9 0 0 0 0 0 0 0 0 0 0 0 0 1619.54 -1025.96 -1049.46 0 0 0 0 0 0 2071.98 0 795.236 0 0 0 -2149.95 0 0 0 0 -2405.24 0 1766.64 0 0 0 0.05 0 -461.669 0 2259.82 0 0 -1062.73 0 0 0 0 0 0 0 0 0 
0 0 0 0 0 0 0 -1455.35 0 0 0 0 0 0 0 0 0 0 0 0 1654.79 0 0 0 0 0 0 0 0 457.091 0 0 0 0 0 0 0 0 -1288.42 0 0 0 586.184 2280.42 0 0 0 0.07 0 0 0 0 0 0 0 0 0 0 0 292.596 -91.174 0 0 
0 2467.8 0 -1976.15 0 0 0 0 0 1634.5 0 0 0 0 0 0 0 689.184 0 -255.516 0 -1714.91 0 0 0 0 0 0 0 0 0 0 0 0 0 0 0 0 0 -746.559 0 0 0 0 0 0 481.201 0 0.06 0 0 0 0 0 0 0 0 0 0 2366.02 0 0 0 
0 0 0 0 0 1118.12 0 0 0 0 0 457.091 2144.76 0 0 0 0 0 1901.38 0 0 0 0 -921.735 1803.87 0 0 0 0 0 -1647.77 0 0 0 0 0 0 0 0 0 0 0 0 0 0 0 0 0 0 0.03 0 0 -2331.69 0 0 0 0 0 0 0 0 0 0 
0 0 0 0 0 0 2128.13 0 0 0 0 0 2467.96 0 0 0 0 0 0 -1083.48 0 784.249 0 0 0 0 0 0 0 0 0 0 0 0 0 0 0 0 0 0 0 0 0 0 -375.607 1396.91 -271.691 0 0 0 0.02 -2280.57 0 -2387.39 0 0 0 0 0 0 0 0 0 
830.638 0 -1278.65 0 0 0 0 0 0 0 0 0 0 0 2377.32 0 0 0 -2204.28 0 0 0 0 0 0 0 0 0 0 0 0 0 0 0 0 1339.08 0 0 0 0 0 0 677.587 0 -1538.97 -884.808 0 0 0 0 2074.27 0.04 0 0 0 0 0 0 0 0 0 0 0 
0 0 0 0 0 0 0 0 0 0 0 0 0 0 0 2200 0 0 0 0 0 0 0 0 0 0 0 0 2106.46 523.774 43.7178 0 429.472 0 0 0 0 0 0 0 0 0 0 0 0 0 0 0 0 923.261 0 0 0.07 0 0 0 0 0 0 0 0 0 0 
0 0 0 0 0 0 0 0 0 -1009.63 0 0 0 0 0 0 0 0 0 0 0 0 0 0 0 988.571 0 0 0 -31.3578 0 0 0 0 0 0 0 0 0 0 0 0 0 0 0 0 -174.642 0 0 0 2454.83 0 0 0.06 0 0 0 0 0 0 0 0 0 
0 0 0 0 0 0 0 1644.87 0 0 0 0 0 0 0 0 -890.606 0 0 0 0 0 0 1968.52 0 0 0 1348.38 0 0 0 0 0 0 0 0 0 0 0 0 0 0 775.704 0 259.026 0 0 0 0 0 0 0 0 0 0.02 0 0 0 0 0 0 0 0 
0 -704.749 0 0 0 0 0 0 0 0 -2050.16 2306.97 0 0 0 0 0 0 0 0 0 0 0 0 0 0 0 0 0 0 0 0 2101.58 0 0 0 -819.956 0 0 0 0 0 0 0 0 0 0 0 0 0 0 0 0 0 0 0.02 0 0 0 2092.27 0 0 0 
0 0 0 0 0 0 0 1906.57 0 0 -1620.76 0 0 0 0 0 0 0 -165.639 0 0 0 0 2271.57 372.555 0 0 0 0 0 0 0 0 0 0 174.947 0 0 0 0 0 0 0 0 0 0 0 0 0 0 0 0 0 0 0 0 0.07 0 0 0 0 0 0 
0 0 0 -917.92 0 -387.661 0 234.306 0 0 0 0 0 0 1188.16 0 0 0 0 0 0 0 0 0 0 0 0 0 1521.88 0 138.478 0 0 0 0 0 0 0 0 0 0 0 0 688.269 0 0 0 0 0 0 0 0 0 0 0 0 0 0.09 0 0 1440.7 0 0 
0 0 0 0 0 0 -483.642 0 0 0 2490.69 -1387.6 0 0 0 0 0 0 2133.78 191.885 0 0 0 0 0 0 0 0 0 0 0 0 0 0 0 372.86 0 0 0 0 1458.71 0 0 0 0 0 0 0 0 0 0 0 0 0 0 0 0 0 0.08 0 -1757.48 0 0 
0 0 0 0 0 0 0 0 0 0 0 0 0 0 1157.95 0 0 0 0 0 0 0 0 0 -404.904 2457.12 0 0 0 0 0 0 0 0 0 0 0 0 287.408 0 0 -2041 0 0 0 0 0 -1446.96 1918.16 0 0 0 0 0 0 2236.78 0 0 0 0.09 0 -1369.9 0 
-323.878 0 0 0 0 0 0 0 0 0 0 0 0 0 0 0 0 1193.66 0 0 0 0 0 0 0 0 0 0 0 0 0 0 -1130.02 0 0 0 0 0 0 0 0 0 0 1575.59 0 0 0 367.519 0 0 0 0 0 0 0 0 0 1679.66 710.089 0 0 180.746 -818.888 
0 0 0 0 0 0 0 0 0 -785.318 0 0 1663.95 0 0 0 0 0 0 0 0 2138.2 0 0 0 0 0 0 2191.76 1601.54 0 0 0 0 0 0 0 0 0 0 -1978.9 0 0 0 0 0 0 0 0 0 0 0 0 0 0 0 0 0 0 765.175 -2113.94 0.02 0 
0 0 0 -211.112 0 0 0 0 0 0 0 0 0 -745.643 0 0 0 0 0 340.052 0 0 0 0 0 0 0 0 0 0 0 0 0 0 0 0 0 0 0 0 0 0 0 0 0 1420.41 0 0 0 0 0 0 0 0 0 0 0 0 0 0 -515.534 0 0.03 
