*Vertices 65
*Matrix 
0.06 0 0 0 0 0 0 0 0 0 1202.51 0 0 0 0 2239.22 0 795.389 0 0 0 0 0 0 0 0 0 0 1404.69 0 0 0 0 0 0 0 0 2402.65 0 0 0 0 0 0 0 0 0 0 0 0 0 2327.88 0 0 0 0 0 0 0 0 0 0 0 0 0 
0 0.07 0 0 0 227.287 0 0 0 1553.77 0 1660.44 0 0 0 0 0 0 0 0 0 -1342.74 488.525 0 0 -1050.07 0 1888.71 0 0 0 0 0 0 0 -1296.04 0 0 -995.743 0 0 0 0 1787.09 0 0 0 0 0 30.4422 0 0 0 0 0 0 0 0 0 0 0 0 0 0 0 
0 0 0.08 0 0 0 0 0 0 0 0 0 0 0 0 0 0 0 0 0 -1314.05 0 0 0 0 0 0 0 0 0 0 0 0 0 0 0 0 0 0 0 81.2555 0 0 0 0 0 0 1364.41 1816.08 0 0 0 0 0 0 0 0 0 0 0 0 0 0 0 0 
0 0 0 0 0 0 0 0 0 0 0 0 0 0 0 0 0 0 2041.46 0 0 0 0 0 0 0 0 -814.31 1383.18 0 2076.71 0 0 0 0 796.152 0 0 0 0 0 0 0 0 0 0 0 0 0 0 0 0 0 0 0 0 0 0 0 0 0 0 0 0 0 
0 0 0 0 0.08 0 0 1478.39 0 0 0 0 0 0 0 0 0 2421.57 0 0 922.346 0 -2268.67 0 0 0 0 0 0 0 0 -2112.42 0 0 0 0 0 0 0 0 0 0 0 0 0 0 0 0 0 0 371.181 0 0 2342.52 0 0 0 0 0 0 0 0 0 0 0 
0 -163.35 0 0 0 0.02 1648.23 0 0 0 0 0 0 0 0 0 0 1604.74 0 1947.61 0 0 0 0 0 0 0 1150.47 0 0 -766.701 0 0 -19.1504 550.63 0 0 0 0 0 0 0 0 0 0 -1441.31 -617.771 2177.27 0 0 0 0 0 0 0 0 0 0 0 0 0 0 0 0 0 
0 0 0 0 0 290.46 0.05 0 0 0 0 0 0 -1021.99 0 0 0 0 0 0 0 0 0 0 0 0 0 0 0 0 -1852.24 2481.54 0 0 0 0 0 0 0 0 0 0 0 0 0 0 0 0 0 0 0 0 0 0 0 0 0 0 0 0 0 0 0 0 0 
0 0 0 0 -934.553 0 0 0.03 0 0 0 0 0 0 0 0 0 0 0 0 0 0 0 0 -1298.49 0 0 -2066.03 -213.706 0 0 0 -1969.59 0 0 0 0 0 2174.37 0 0 -36.3933 0 0 1222.19 0 0 -391.476 1775.03 0 2012.92 0 0 0 0 0 0 0 0 0 0 0 0 0 0 
0 0 0 0 0 0 0 0 0.06 0 0 0 0 613.041 0 0 0 0 0 0 0 0 0 1985.15 0 0 2033.07 0 0 0 0 0 0 51.3474 255.669 0 0 0 0 0 0 0 0 530.641 0 1931.59 0 -1672.34 0 -1838.36 0 0 0 2495.42 0 0 0 -1087.15 0 0 0 0 0 0 0 
0 -240.867 0 0 0 0 0 0 0 0.06 0 0 -2117.91 0 0 0 0 0 0 0 2073.5 0 0 0 -430.845 0 0 0 0 0 0 0 0 636.845 0 0 0 0 0 0 0 0 0 0 0 0 1757.18 0 0 0 0 0 0 0 0 0 0 0 0 0 0 0 0 0 -953.475 
1452.45 0 0 0 0 0 0 0 0 0 0.04 242.241 1348.08 0 0 0 0 0 0 0 0 0 0 0 0 0 0 0 -1243.1 0 0 0 0 0 0 0 0 0 0 349.818 0 1489.68 0 0 0 0 0 0 0 0 0 0 0 -2039.32 0 0 0 0 0 0 0 0 0 0 0 
0 1815.32 0 0 0 0 0 0 0 0 700.476 0.06 0 707.648 0 0 0 0 0 0 2066.64 0 0 0 0 0 0 1705.91 0 0 0 93.9207 0 450.377 0 0 0 0 0 0 0 0 -1564.61 609.836 0 0 0 0 0 0 0 0 2347.56 0 0 0 0 0 0 0 0 0 0 0 0 
0 0 0 0 0 0 0 0 0 -1862.01 -381.558 0 0.08 0 0 0 246.971 0 0 0 2281.18 0 0 0 0 0 0 0 0 0 1505.71 0 0 0 0 0 0 0 0 0 0 0 0 0 0 0 127.796 0 0 0 0 0 161.367 0 0 0 0 0 0 0 0 0 0 0 0 
0 0 0 0 0 0 -70.7266 0 -1260.49 0 0 1303.22 0 0 0 0 0 0 0 1079.82 0 0 0 0 0 0 0 0 0 1235.31 1506.62 0 0 -951.643 0 589.846 0 0 0 0 0 0 0 0 0 -12.7415 0 0 0 0 0 0 -1442.69 0 0 0 0 0 0 0 0 0 0 0 0 
0 0 0 0 0 0 0 0 0 0 0 0 0 0 0.07 0 0 0 -1376 0 0 0 427.488 0 0 2385.1 2115.31 0 0 0 0 0 0 0 0 0 0 0 0 0 0 0 0 0 -855.968 0 0 0 0 0 0 1640.75 0 0 0 0 0 0 0 0 0 0 0 0 0 
2201.53 0 0 0 0 0 0 0 0 0 0 0 0 0 0 0.08 1866.74 0 0 0 0 0 1538.97 0 0 0 0 0 0 0 0 0 0 0 0 0 0 0 0 0 0 0 0 0 573.061 0 0 -2386.47 0 -101.703 0 0 0 0 0 0 0 0 0 0 0 0 0 0 0 
0 0 0 0 0 0 0 0 0 0 0 0 288.476 0 0 500.275 0.09 0 2465.21 0 0 743.507 0 0 0 0 0 0 0 0 0 1007.95 0 0 0 0 0 0 0 0 0 0 0 0 0 0 -1543.09 0 0 0 0 0 0 -781.961 0 0 0 0 0 -13.5044 0 0 0 0 0 
-1634.95 0 0 0 771.737 -1321.53 0 0 0 0 0 0 0 0 0 0 0 0.06 0 1323.82 0 0 0 0 0 0 0 0 0 0 0 0 0 0 877.789 0 0 0 0 0 0 0 0 0 0 2446.9 0 0 0 0 0 0 0 0 0 0 0 0 0 0 0 0 0 0 0 
0 0 0 -1434.6 0 0 0 0 0 0 0 0 0 0 -205.466 0 1948.38 0 0.06 0 0 0 0 0 0 0 0 0 0 0 622.501 0 0 2260.58 0 0 0 0 0 0 0 0 -1018.02 0 0 1283.07 0 0 0 -2194.97 1816.54 0 0 0 0 0 0 0 0 0 0 0 0 0 0 
0 0 0 0 0 2252.04 0 0 0 0 0 0 0 -264.519 0 0 0 2392.27 0 0.03 0 0 -1819.44 0 0 0 0 0 -558.718 0 0 0 0 0 2219.23 293.97 -1298.33 0 0 0 0 0 0 0 0 0 0 1514.86 0 0 0 0 0 -1952.65 0 -336.39 0 0 0 0 0 0 0 0 0 
0 0 -975.906 0 1351.44 0 0 0 0 1374.94 0 -1513.03 2362.51 0 0 0 0 0 0 0 0.08 0 0 0 141.53 0 0 0 0 0 0 0 239.494 0 0 0 1566.9 0 0 0 0 0 0 0 0 1596.35 0 -1372.95 0 0 0 0 0 0 0 0 0 0 0 0 0 0 0 0 0 
0 294.122 0 0 0 0 0 0 0 0 0 0 0 0 0 0 253.838 0 0 0 0 0.07 0 0 0 0 0 0 0 0 0 0 0 0 -2099.9 0 0 0 0 0 0 0 2334.13 -101.245 0 0 0 0 0 0 0 0 0 0 0 0 0 0 0 0 0 0 0 0 0 
0 -327.082 0 0 1758.4 0 0 0 0 0 0 0 0 0 -696.661 -1465.42 0 0 0 -1601.69 0 0 0.07 1979.05 0 0 0 0 0 0 0 0 0 0 0 0 0 0 0 0 0 0 0 0 0 0 0 0 0 0 0 0 0 0 0 0 0 0 0 0 0 0 0 0 0 
0 0 0 0 0 0 0 0 -899.915 0 0 0 0 0 0 0 0 0 0 0 0 0 -40.3607 0.07 0 735.267 1417.36 0 0 0 0 0 0 494.018 0 2383.11 0 0 0 0 0 0 0 0 0 0 0 0 0 2107.68 0 0 0 0 0 0 0 0 0 0 0 0 0 0 0 
0 0 0 0 0 0 0 -885.266 0 981.552 0 0 0 0 0 0 0 0 0 0 192.343 0 0 0 0.03 2389.07 0 0 0 0 0 1693.7 -2231.13 0 0 0 0 0 0 0 0 -943.709 0 0 0 0 2153 0 0 0 0 0 0 0 0 0 0 0 0 0 0 0 0 0 0 
0 -897.778 0 0 0 0 0 0 0 0 0 0 0 0 2063.28 0 0 0 0 0 0 0 0 724.433 621.738 0.04 0 0 0 473.113 0 0 0 0 0 0 224.54 0 -81.4081 0 0 0 -1503.88 0 2430.42 0 0 0 0 0 0 0 0 0 0 0 0 0 0 0 0 0 0 0 0 
0 0 0 0 0 0 0 0 2490.54 0 0 0 0 0 618.839 0 0 0 0 0 0 0 0 2058.24 0 0 0.05 0 0 0 0 0 0 0 0 0 0 0 0 0 0 0 0 0 0 0 1397.67 0 0 0 0 0 0 -722.449 0 0 0 0 0 0 0 0 0 0 0 
0 1418.42 0 617.771 0 -974.227 0 827.586 0 0 0 2068.77 0 0 0 0 0 0 0 0 0 0 0 0 0 0 0 0.09 -1453.06 0 0 0 0 -593.051 0 0 -567.11 0 0 0 0 0 563.448 0 0 1834.7 0 0 0 0 0 0 0 0 0 0 0 0 0 0 0 0 0 498.138 0 
1903.97 0 0 -1601.38 0 0 0 -761.666 0 0 -1199.45 0 0 0 0 0 0 0 0 1136.74 0 0 0 0 0 0 0 -363.857 0.03 0 0 0 2353.51 0 0 0 0 165.639 0 0 1810.74 0 0 0 0 0 0 0 0 0 1023.51 0 -1580.48 0 0 0 0 0 0 0 0 0 0 0 0 
0 0 0 0 0 0 0 0 0 0 0 0 0 -520.264 0 0 0 0 0 0 0 0 0 0 0 2137.59 0 0 0 0.01 0 0 0 0 0 0 1327.94 -159.383 0 0 0 0 0 0 0 0 0 -545.442 300.226 1197.93 0 0 0 561.312 0 0 0 0 0 0 0 0 0 0 0 
0 0 0 988.723 0 -2322.99 1275.44 0 0 0 0 0 570.925 2442.01 0 0 0 0 2193.75 0 0 0 0 0 0 0 0 0 0 0 0.09 -962.63 0 0 0 0 0 1513.03 0 0 606.174 165.029 0 -909.07 0 0 0 0 0 0 0 -2431.64 0 0 0 0 0 0 0 0 0 0 0 0 -2295.53 
0 0 0 0 123.829 0 -1169.09 0 0 0 0 -87.5118 0 0 0 0 2289.42 0 0 0 0 0 0 0 -1403.78 0 0 0 0 0 2313.23 0.01 0 0 0 0 0 0 2241.36 0 0 0 0 0 0 0 0 0 0 0 0 0 -487.915 1041.67 0 0 0 0 1137.35 0 0 0 0 0 0 
0 0 0 0 0 0 0 453.887 0 0 0 0 0 0 0 0 0 0 0 0 -363.704 0 0 0 944.319 0 0 0 -270.775 0 0 0 0.09 0 383.236 0 0 0 0 0 0 0 0 0 0 1544.47 0 0 0 0 0 951.796 0 -294.275 1902.75 0 0 0 0 0 0 0 0 0 -834.605 
0 0 0 0 0 2440.79 0 0 657.292 1049.3 0 951.796 0 1638 0 0 0 0 51.5 0 0 0 0 2078.23 0 0 0 713.141 0 0 0 0 0 0.01 0 -363.857 -2077.17 0 0 -2437.89 0 0 0 0 0 0 0 0 -469.451 0 0 0 -1.75481 0 0 0 0 0 0 0 0 0 720.618 0 0 
0 0 0 0 0 390.561 0 0 -1270.26 0 0 0 0 0 0 0 0 1132.77 0 2068.01 0 1792.43 0 0 0 0 0 0 0 0 0 0 2313.07 0 0.01 0 0 0 0 0 0 -1469.54 0 0 -211.112 0 0 0 0 0 0 0 0 1929.3 0 0 0 0 0 0 0 0 0 0 0 
0 1305.35 0 -2105.7 0 0 0 0 0 0 0 0 0 1597.42 0 0 0 0 0 -1078.45 0 0 0 -355.617 0 0 0 0 0 0 0 0 0 262.078 0 0.02 0 0 0 0 0 0 0 0 960.799 0 0 0 0 0 0 0 0 0 0 0 0 0 0 0 0 0 0 0 0 
0 0 0 0 0 0 0 0 0 0 0 0 0 0 0 0 0 0 0 -655.919 -469.298 0 0 0 0 1555.45 0 537.049 0 -717.566 0 0 0 1694.16 0 0 0.04 0 0 0 0 0 -852.153 0 0 2254.78 0 0 0 0 0 0 0 0 0 0 0 0 0 0 0 0 -2156.36 0 0 
2404.02 0 0 0 0 0 0 0 0 0 0 0 0 0 0 0 0 0 0 0 0 0 0 0 0 0 0 0 501.495 20.6763 -620.518 0 0 0 0 0 0 0.08 0 0 0 0 0 0 0 0 0 0 0 0 0 0 0 0 0 0 0 0 0 0 0 0 0 0 0 
0 2388.3 0 0 0 0 0 -2088.92 0 0 0 0 0 0 0 0 0 0 0 0 0 0 0 0 0 392.239 0 0 0 0 0 1437.04 0 0 0 0 0 0 0.09 0 0 0 0 507.294 0 0 0 0 0 0 0 0 1071.43 0 -633.335 0 0 0 0 0 0 0 0 0 0 
0 0 0 0 0 0 0 0 0 0 1804.03 0 0 0 0 0 0 0 0 0 0 0 0 0 0 0 0 0 0 0 0 0 0 418.485 0 0 0 0 0 0.08 2285.76 0 0 1457.18 0 0 0 0 0 0 0 0 0 0 0 0 0 0 0 0 0 0 0 0 0 
0 0 -643.406 0 0 0 0 0 0 0 0 0 0 0 0 0 0 0 0 0 0 0 0 0 0 0 0 0 -356.685 0 -39.903 0 0 0 0 0 0 0 0 2010.64 0.09 0 0 0 -2195.27 0 0 0 0 0 0 1773.35 0 0 0 0 0 0 0 0 0 0 0 0 0 
0 0 0 0 0 0 0 -826.67 0 0 1469.54 0 0 0 0 0 0 0 0 0 0 0 0 0 -892.59 0 0 0 0 0 1657.23 0 0 0 2351.68 0 0 0 0 0 0 0.02 0 0 0 -980.331 -1152.15 0 0 0 0 515.076 0 0 2367.4 0 0 0 0 0 0 0 0 0 0 
0 0 0 0 0 0 0 0 0 0 0 -639.592 0 0 0 0 0 0 1807.69 0 0 1416.14 0 0 0 968.276 0 652.409 0 0 0 0 0 0 0 0 1102.25 0 0 0 0 0 0.08 0 0 0 0 -750.374 0 0 0 0 0 1403.32 0 0 0 0 0 0 -2394.25 0 0 0 0 
0 2182.91 0 0 0 0 0 0 -1052.05 0 0 1564.91 0 0 0 0 0 0 0 0 0 1976.15 0 0 0 0 0 0 0 0 -1753.82 0 0 0 0 0 0 0 252.77 -2301.17 0 0 0 0.04 0 0 0 0 0 1282.46 0 0 0 0 -343.104 0 0 0 0 0 0 0 0 0 0 
0 0 0 0 0 0 0 2348.93 0 0 0 0 0 0 -365.993 2398.37 0 0 0 0 0 0 0 0 0 2433.93 0 0 0 0 0 0 0 0 436.949 419.095 0 0 0 0 1458.1 0 0 0 0.07 0 673.467 0 0 0 0 0 0 0 0 0 0 0 0 0 0 0 0 0 0 
0 0 0 0 0 -352.87 0 0 1077.68 0 0 0 0 589.084 0 0 0 1219.29 2233.12 0 224.387 0 0 0 0 0 0 -444.273 0 0 0 0 -1202.66 0 0 0 140.156 0 0 0 0 -845.439 0 0 0 0.05 0 385.22 0 0 0 0 0 0 0 0 -1345.48 0 0 0 0 0 0 0 0 
0 0 0 0 0 1601.08 0 0 0 1286.89 0 0 -2030.32 0 0 0 -1940.9 0 0 0 0 0 0 0 -193.411 0 -1464.2 0 0 0 0 0 0 0 0 0 0 0 0 0 0 -392.239 0 0 116.199 0 0.05 0 0 0 1692.33 1938.31 0 1298.79 0 0 0 0 0 0 0 0 0 0 0 
0 0 -1152.15 0 0 614.566 0 491.272 1420.87 0 0 0 0 0 0 -1817.76 0 0 0 -2268.97 1994.16 0 0 0 0 0 0 0 0 2273.86 0 0 0 0 0 0 0 0 0 0 0 0 2240.59 0 0 816.599 0 0.06 0 -84.3074 0 0 0 0 0 2359.77 0 0 0 0 0 0 0 0 0 
0 0 -1590.4 0 0 0 0 -1182.06 0 0 0 0 0 0 0 0 0 0 0 0 0 0 0 0 0 0 0 0 0 1832.71 0 0 0 2111.19 0 0 0 0 0 0 0 0 0 0 0 0 0 0 0.03 666.601 0 0 0 0 0 0 0 0 0 0 0 0 0 0 0 
0 469.756 0 0 0 0 0 0 -1924.73 0 0 0 0 0 0 -1927.93 0 0 2404.32 0 0 0 0 -1087.15 0 0 0 0 0 1509.67 0 0 0 0 0 0 0 0 0 0 0 0 0 687.964 0 0 0 352.107 -1062.27 0.01 0 0 0 0 0 0 0 0 0 0 0 0 0 0 0 
0 0 0 0 842.387 0 0 1534.39 0 0 0 0 0 0 0 0 0 0 1969.44 0 0 0 0 0 0 0 0 0 -761.513 0 0 0 0 0 0 0 0 0 0 0 0 0 0 0 0 0 2125.23 0 0 0 0.07 0 0 -1355.56 0 0 0 0 0 0 0 0 0 0 0 
2306.97 0 0 0 0 0 0 0 0 0 0 0 0 0 -849.101 0 0 0 0 0 0 0 0 0 0 0 0 0 0 0 1686.22 0 53.4837 0 0 0 0 0 0 0 524.079 974.837 0 0 0 0 315.638 0 0 0 0 0.05 0 0 0 0 0 0 0 0 0 0 0 0 0 
0 0 0 0 0 0 0 0 0 0 0 1935.56 -1648.53 2413.48 0 0 0 0 0 0 0 0 0 0 0 0 0 0 -822.703 0 0 424.741 0 245.75 0 0 0 0 2253.11 0 0 0 0 0 0 0 0 0 0 0 0 0 0.01 0 0 0 0 0 0 0 0 0 0 0 0 
0 0 0 0 2151.33 0 0 0 1686.22 0 1643.5 0 0 0 0 0 -273.98 0 0 -433.287 0 0 0 0 0 0 1081.04 0 0 -262.23 0 973.769 2273.71 0 -2076.4 0 0 0 0 0 0 0 -1059.22 0 0 0 1778.08 0 0 0 676.214 0 0 0.08 0 0 0 0 0 0 0 1767.1 0 0 0 
0 0 0 0 0 0 0 0 0 0 0 0 0 0 0 0 0 0 0 0 0 0 0 0 0 0 0 0 0 0 0 0 1818.52 0 0 0 0 0 1093.1 0 0 -1313.9 0 2057.48 0 0 0 0 0 0 0 0 0 0 0.06 0 0 0 0 0 0 0 0 0 0 
0 0 0 0 0 0 0 0 0 0 0 0 0 0 0 0 0 0 0 2496.03 0 0 0 0 0 0 0 0 0 0 0 0 0 0 0 0 0 0 0 0 0 0 0 0 0 0 0 -954.085 0 0 0 0 0 0 0 0 0 0 0 0 0 0 0 0 0 
0 0 0 0 0 0 0 0 0 0 0 0 0 0 0 0 0 0 0 0 0 0 0 0 0 0 0 0 0 0 0 0 0 0 0 0 0 0 0 0 0 0 0 0 0 86.2911 0 0 0 0 0 0 0 0 0 0 0.07 0 0 0 0 0 0 0 0 
0 0 0 0 0 0 0 0 1243.25 0 0 0 0 0 0 0 0 0 0 0 0 0 0 0 0 0 0 0 0 0 0 0 0 0 0 0 0 0 0 0 0 0 0 0 0 0 0 0 0 0 0 0 0 0 0 0 0 0.09 0 0 0 0 0 0 0 
0 0 0 0 0 0 0 0 0 0 0 0 0 0 0 0 0 0 0 0 0 0 0 0 0 0 0 0 0 0 0 2282.71 0 0 0 0 0 0 0 0 0 0 0 0 0 0 0 0 0 0 0 0 0 0 0 0 0 0 0.01 0 0 0 0 0 0 
0 0 0 0 0 0 0 0 0 0 0 0 0 0 0 0 1396.76 0 0 0 0 0 0 0 0 0 0 0 0 0 0 0 0 0 0 0 0 0 0 0 0 0 0 0 0 0 0 0 0 0 0 0 0 0 0 0 0 0 0 0.09 0 0 0 0 0 
0 0 0 0 0 0 0 0 0 0 0 0 0 0 0 0 0 0 0 0 0 0 0 0 0 0 0 0 0 0 0 0 0 0 0 0 0 0 0 0 0 0 672.094 0 0 0 0 0 0 0 0 0 0 0 0 0 0 0 0 0 0.08 2310.79 0 0 0 
0 0 0 0 0 0 0 0 0 0 0 0 0 0 0 0 0 0 0 0 0 0 0 0 0 0 0 0 0 0 0 0 0 0 0 0 0 0 0 0 0 0 0 0 0 0 0 0 0 0 0 0 0 16.7089 0 0 0 0 0 0 2264.85 0.09 0 0 0 
0 0 0 0 0 0 0 0 0 0 0 0 0 0 0 0 0 0 0 0 0 0 0 0 0 0 0 0 0 0 0 0 0 777.993 0 0 2251.12 0 0 0 0 0 0 0 0 0 0 0 0 0 0 0 0 0 0 0 0 0 0 0 0 0 0.02 0 0 
0 0 0 0 0 0 0 0 0 0 0 0 0 0 0 0 0 0 0 0 0 0 0 0 0 0 0 2323.45 0 0 0 0 0 0 0 0 0 0 0 0 0 0 0 0 0 0 0 0 0 0 0 0 0 0 0 0 0 0 0 0 0 0 0 0.08 0 
0 0 0 0 0 0 0 0 0 1708.5 0 0 0 0 0 0 0 0 0 0 0 0 0 0 0 0 0 0 0 0 -77.1355 0 2039.32 0 0 0 0 0 0 0 0 0 0 0 0 0 0 0 0 0 0 0 0 0 0 0 0 0 0 0 0 0 0 0 0.01 
