*Vertices 50
*Matrix 
0.05 765.328 0 0 0 0 0 0 0 433.134 1706.21 0 0 0 0 0 0 0 0 0 0 0 1689.28 0 0 2140.34 -1298.64 0 0 0 0 0 0 0 0 0 0 0 0 0 0 0 0 0 0 0 0 0 0 0 
609.989 0.07 0 2027.42 0 688.116 0 0 0 0 0 -292.138 0 562.227 0 0 252.312 1607.18 0 0 232.627 105.823 0 0 0 0 0 -2203.36 0 -1591.92 0 0 0 0 339.137 0 1188.47 0 0 0 0 0 0 0 -1768.47 0 0 0 0 0 
0 0 0.02 2108.14 0 0 0 0 0 0 0 0 532.319 0 0 0 0 0 -1621.37 1694.31 0 335.322 -86.4437 0 0 1874.98 0 0 1437.35 0 -926.771 0 0 1293.15 960.494 0 0 0 -277.795 0 0 0 0 -2110.13 0 0 0 0 0 0 
0 174.947 -304.346 0.04 -2066.33 0 0 0 0 0 0 0 -260.857 1054.03 -1051.29 1412.32 0 0 0 0 947.981 1385.31 0 0 2427.82 1660.13 0 0 0 0 0 2230.22 0 550.02 -791.574 0 0 0 0 0 0 0 0 0 0 0 371.639 0 -1168.63 0 
0 0 0 1435.21 0.01 92.8526 0 0 1395.99 -1127.28 0 0 0 0 0 -1924.42 885.876 0 0 0 0 0 0 0 0 1631.75 -1948.38 0 0 0 397.427 1986.98 18.6926 0 0 1419.19 0 1912.06 0 0 0 0 0 0 0 0 0 0 0 0 
0 448.241 0 0 2086.17 0.06 0 0 1699.5 0 0 0 0 0 0 630.436 1060.44 0 -2199.7 0 0 0 0 0 722.907 0 -1891.92 -2332.91 0 105.976 -712.531 837.962 801.035 0 922.498 0 0 0 0 0 0 0 0 0 0 0 0 -1996.29 0 0 
0 0 0 0 0 0 0.06 -2058.55 0 0 0 0 0 0 0 0 0 0 0 224.387 0 297.937 0 0 0 -1078.91 0 1219.44 0 -566.347 0 0 0 0 0 0 0 1762.06 1772.13 0 0 0 0 0 0 0 0 0 0 2463.07 
0 0 0 0 0 0 1589.33 0.05 0 0 0 0 0 0 0 -1672.19 0 0 1228.75 0 0 370.418 -1589.02 0 0 0 0 0 54.2467 0 0 0 0 930.586 0 1414 0 1744.06 0 0 0 0 0 0 0 0 0 0 0 0 
0 0 0 0 -907.392 -1312.68 0 0 0.09 0 0 0 453.124 0 0 0 0 0 0 0 0 0 0 0 1329.62 0 1562.01 0 0 0 0 0 0 2284.08 0 1954.63 0 0 0 0 0 0 0 0 0 0 1328.7 0 1696.14 -735.267 
326.777 0 0 0 1433.99 0 0 0 0 0.05 0 0 0 0 0 0 0 0 0 2257.68 0 0 -245.75 0 -284.204 0 0 0 -1610.54 0 -123.524 0 0 0 0 0 1641.51 0 0 0 0 0 0 0 0 0 0 0 -254.448 0 
-619.297 0 0 0 0 0 0 0 0 0 0.07 0 0 0 0 0 0 0 0 0 720.313 0 0 0 2129.66 0 0 0 0 0 713.752 546.358 0 0 0 0 0 0 134.053 0 0 0 -1895.58 0 0 0 0 0 0 0 
0 1231.65 0 0 0 0 0 0 0 0 0 0.06 2160.63 0 0 0 2283.32 0 0 999.71 0 0 0 0 1119.04 0 0 0 0 0 0 0 1844.61 0 0 0 1208.61 305.261 1878.03 0 0 0 0 0 0 0 2499.08 0 0 0 
0 0 -1937.09 1726.66 0 0 0 0 -253.99 0 0 1836.83 0.02 0 -334.254 0 1106.22 0 0 0 0 -2140.34 0 0 -681.86 1556.67 750.221 0 1014.66 0 0 0 0 0 0 0 0 0 0 0 0 1686.22 0 0 0 0 -1243.1 0 0 0 
0 2096.55 0 -1809.82 0 0 0 0 0 0 0 0 0 0.04 1619.54 0 0 0 0 666.295 0 0 0 0 0 0 2147.05 0 -1398.43 0 1821.42 0 0 0 0 0 0 0 2205.65 1526.46 0 0 664.312 -1790.6 0 0 0 0 0 0 
0 0 0 -1167.87 0 0 0 0 0 0 0 0 2244.1 1284.91 0.06 0 -1654.79 -1616.49 0 0 0 0 -1673.1 0 0 0 0 0 2104.63 1092.49 0 0 2377.93 275.353 0 0 0 -457.396 0 0 0 0 -1472.9 0 0 0 0 0 -1155.35 0 
0 0 0 -1135.36 1360.13 -92.5474 0 1445.89 0 0 0 0 0 0 0 0.02 -1587.65 0 0 1178.55 851.238 0 0 0 0 0 0 0 0 1888.1 -474.029 0 0 0 -711.463 0 0 0 2402.95 0 0 0 0 -836.589 1947 0 0 0 0 0 
0 -1027.02 0 0 -1305.2 1388.67 0 0 0 0 0 2208.55 1180.84 0 1634.8 1129.87 0.07 0 719.092 1349.3 0 910.443 0 0 0 0 0 0 0 0 0 0 -943.861 0 0 0 0 0 2190.85 0 -2449.95 0 0 0 0 0 0 0 0 0 
0 -646.153 0 0 0 0 0 0 0 0 0 0 0 0 -515.076 0 0 0.08 0 209.281 0 0 0 0 0 0 0 -1469.85 0 0 0 0 0 0 1058 983.535 1983.17 2201.68 0 0 0 0 0 -2030.47 0 0 0 0 0 0 
0 0 -2066.18 0 0 1151.08 0 -58.977 0 0 0 0 0 0 0 0 873.363 0 0.08 0 0 0 0 0 0 0 0 842.845 0 0 0 0 973.617 0 0 0 0 -50.2792 0 1782.66 0 0 0 0 0 0 0 0 0 0 
0 0 -1914.5 0 0 0 58.5192 0 0 85.9859 0 -461.974 0 1904.74 0 2387.39 -37.3089 -976.363 0 0 -221.641 348.75 0 0 0 0 -101.398 0 0 0 0 0 0 0 0 1707.89 0 0 0 0 0 0 0 0 0 1809.21 0 0 0 0 
0 317.469 0 1314.51 0 0 0 0 0 0 1749.55 0 0 0 0 224.998 0 0 0 1061.36 0 -411.618 2395.93 1706.37 0 0 0 -2167.2 0 0 -1699.35 -1695.84 0 0 0 0 0 940.199 0 0 -1561.25 -1345.03 0 0 0 0 0 0 0 0 
0 1519.29 -366.604 -429.472 0 0 -33.0363 1441.01 0 0 0 0 267.876 0 0 0 983.383 0 0 -418.332 1954.63 0.06 0 0 -517.365 0 -1143.45 0 0 0 0 0 0 0 0 494.476 0 0 0 0 0 0 0 0 0 0 0 0 0 0 
1769.84 0 611.057 0 0 0 0 -1329.62 0 -1737.8 0 0 0 0 858.104 0 0 0 0 0 -1079.82 0 0.03 2406.31 0 0 803.476 2308.19 -1802.5 0 0 0 0 0 0 0 0 0 0 0 0 -949.355 -792.032 0 0 -265.587 0 0 0 0 
0 0 0 0 0 0 0 0 0 0 0 0 0 0 0 0 0 0 0 0 2182.3 0 320.215 0.07 0 0 2185.51 0 0 0 0 0 695.898 0 0 0 0 0 0 168.996 0 0 0 0 0 0 0 0 0 0 
0 0 0 454.344 0 2451.17 0 0 -1665.78 -1969.44 -607.089 2335.51 -1863.69 0 0 0 0 0 0 0 0 1932.81 0 0 0.05 1801.13 0 0 -842.387 0 0 0 400.479 0 0 -54.0941 -1519.14 835.215 0 0 0 0 0 0 0 0 0 0 0 0 
1945.63 0 -752.205 -1941.21 -2213.74 0 -748.39 0 0 0 0 0 1968.98 0 0 0 0 0 0 0 0 0 0 0 1869.49 0 0 1600.01 0 2143.09 0 -2012.62 0 0 0 1217.76 -1030.53 0 -936.384 0 0 0 0 0 0 0 0 0 0 0 
566.652 0 0 0 428.251 -2155.9 0 0 1859.87 0 0 0 -939.894 1745.73 0 0 0 0 0 2459.41 0 1726.36 -1644.72 1193.66 0 0 0 93.0052 2399.44 0 0 0 0 791.879 0 0 0 0 0 -10.9104 0 0 0 0 0 0 0 0 0 0 
0 1488.16 0 0 0 -704.749 1403.01 0 0 0 0 0 0 0 0 0 0 1186.03 -1453.22 0 1500.82 0 1978.44 0 0 2083.12 2040.54 0.08 0 0 0 0 0 0 0 0 0 0 0 2432.1 2219.84 0 0 0 0 0 0 0 0 0 
0 0 -1455.05 0 0 0 0 1368.83 0 1521.88 0 0 1752.3 115.284 1657.08 0 0 0 0 0 0 0 206.229 0 1770.46 0 672.704 0 0.04 0 0 0 0 0 0 2340.54 -1732.92 0 0 0 2179.56 0 0 0 0 0 0 2147.66 0 -140.309 
0 -1428.19 0 0 0 -826.212 1773.66 0 0 0 0 0 0 0 1693.55 2015.67 0 0 0 0 0 0 0 0 0 966.903 0 0 0 0.06 0 0 0 0 0 1954.48 0 0 2495.27 0 0 0 0 0 0 0 0 0 0 0 
0 0 -775.246 0 -204.245 100.024 0 0 0 384.762 -1840.8 0 0 811.563 0 1189.54 0 0 0 0 -1546.14 0 0 0 0 0 0 0 0 0 0.04 0 2009.41 0 -1085.92 0 0 -1104.39 0 -107.044 2039.78 0 0 903.729 0 0 0 0 0 0 
0 0 0 -280.084 1547.52 2164.75 0 0 0 0 -371.487 0 0 0 0 0 0 0 0 0 -1442.84 0 0 0 0 -1345.79 0 0 0 0 0 0.07 0 2107.38 -1926.25 0 -268.487 0 0 0 0 0 0 0 0 0 0 0 0 0 
0 0 0 0 -311.365 563.601 0 0 0 0 0 1498.08 0 0 1956.47 0 -1892.38 0 1664.71 0 0 0 0 2250.82 -73.1681 0 0 0 0 0 1067.31 0 0.07 790.811 0 0 0 0 0 0 -728.401 0 0 0 -810.343 0 0 0 0 0 
0 0 2487.03 -986.129 0 0 0 190.207 1173.97 0 0 0 0 0 1218.38 0 0 0 0 0 0 0 0 0 0 0 2236.17 0 0 0 0 800.119 1280.63 0.01 0 0 0 0 0 0 0 0 0 0 0 0 0 0 0 0 
0 2137.75 -1945.33 849.406 0 1806.92 0 0 0 0 0 0 0 0 0 158.01 0 -2367.24 0 0 0 0 0 0 0 0 0 0 0 0 -790.201 1368.07 0 0 0.05 505.31 35.6304 0 790.201 0 0 0 0 0 234.611 0 0 0 -223.624 0 
0 0 0 0 2312.31 0 0 1860.94 -1787.09 0 0 0 0 0 0 0 0 2275.08 0 1236.69 0 1354.34 0 0 -1400.57 876.263 0 0 253.99 2426.91 0 0 0 0 1030.69 0.03 0 0 0 0 0 0 0 0 0 0 0 0 0 0 
0 2074.42 0 0 0 0 0 0 0 1358.3 0 1392.03 0 0 0 0 0 -841.929 0 0 0 0 0 0 1975.54 1694.01 0 0 2036.73 0 0 1221.12 0 0 -1911.3 0 0.01 0 0 0 0 -707.648 0 0 0 0 0 0 0 0 
0 0 0 0 266.198 0 -346.004 151.143 0 0 0 1886.73 0 0 550.783 0 0 1014.97 624.18 0 -1392.18 0 0 0 -1749.24 0 0 0 0 0 1117.21 0 0 0 0 0 0 0.03 0 0 0 0 0 0 0 0 0 0 0 0 
0 0 -762.581 0 0 0 1137.81 0 0 0 -840.709 1743.6 0 970.717 0 1849.04 1819.28 0 0 0 0 0 0 0 0 1367.15 0 0 0 -705.969 0 0 0 0 -169.607 0 0 0 0.02 0 0 0 -1265.53 0 0 0 0 0 0 1708.5 
0 0 0 0 0 0 0 0 0 0 0 0 0 2416.53 0 0 0 0 2088.15 0 0 0 0 -1457.34 0 0 856.731 -2355.34 0 0 993.912 0 0 0 0 0 0 0 0 0.08 0 0 0 0 0 0 0 1682.56 0 1336.02 
0 0 0 0 0 0 0 0 0 0 0 0 0 0 0 0 2115.01 0 0 0 2077.62 0 0 0 0 0 0 72.5578 734.809 0 1452.76 0 2372.74 0 0 0 0 0 0 0 0.04 0 0 0 0 0 0 0 776.62 0 
0 0 0 0 0 0 0 0 0 0 0 0 1112.32 0 0 0 0 0 0 0 821.024 0 516.144 0 0 0 0 0 0 0 0 0 0 0 0 0 -606.632 0 0 0 0 0.03 0 0 0 0 0 0 0 1201.9 
0 0 0 0 0 0 0 0 0 0 1661.81 0 0 809.885 809.427 0 0 0 0 0 0 0 1127.74 0 0 0 0 0 0 0 0 0 0 0 0 0 0 0 502.716 0 0 0 0.08 0 0 1037.4 0 0 0 0 
0 0 -782.266 0 0 0 0 0 0 0 0 0 0 -62.1815 0 1339.69 0 799.356 0 0 0 0 0 0 0 0 0 0 0 0 -1112.48 0 0 0 0 0 0 0 0 0 0 0 0 0.01 0 2133.47 0 0 -2117.15 0 
0 -484.71 0 0 0 0 0 0 0 0 0 0 0 0 0 2302.24 0 0 0 0 0 0 0 0 0 0 0 0 0 0 0 0 926.16 0 1812.42 0 0 0 0 0 0 0 0 0 0.05 0 0 -267.876 0 0 
0 0 0 0 0 0 0 0 0 0 0 0 0 0 0 0 0 0 0 -155.721 0 0 1119.95 0 0 0 0 0 0 0 0 0 0 0 0 0 0 0 0 0 0 0 1423 762.429 0 0.09 0 0 0 0 
0 0 0 977.432 0 0 0 0 400.021 0 0 207.297 -19.4555 0 0 0 0 0 0 0 0 0 0 0 0 0 0 0 0 0 0 0 0 0 0 0 0 0 0 0 0 0 0 0 0 0 0.08 0 0 0 
0 0 0 0 0 -862.529 0 0 0 0 0 0 0 0 0 0 0 0 0 0 0 0 0 0 0 0 0 0 2498.32 0 0 0 0 0 0 0 0 0 0 859.783 0 0 0 0 -1623.81 0 0 0.02 0 0 
0 0 0 -1091.27 0 0 0 0 2191 -1307.49 0 0 0 0 2429.5 0 0 0 0 0 0 0 0 0 0 0 0 0 0 0 0 0 0 0 -1654.33 0 0 0 0 0 2171.16 0 0 1835 0 0 0 0 0 0 
0 0 0 0 0 0 1593.45 0 953.475 0 0 0 0 0 0 0 0 0 0 0 0 0 0 0 0 0 0 0 1118.73 0 0 0 0 0 0 0 0 0 -1180.68 200.583 0 -2219.53 0 0 0 0 0 0 0 0.05 
