*Vertices 46
*Matrix 
0.08 0 0 0 0 1908.86 0 -2310.02 1455.66 0 -1384.24 -1275.9 835.215 0 0 1510.9 351.497 -17.3193 1877.73 0 0 0 -1296.96 0 -1821.27 0 0 0 848.643 0 0 0 0 0 2297.66 -378.506 0 0 0 -1791.97 0 0 1108.2 350.429 0 0 
0 0.04 -1474.27 0 -648.137 0 0 0 0 0 0 0 1274.22 0 1789.99 70.5741 1446.04 0 0 0 0 0 0 -149.312 0 1473.66 0 356.075 0 0 0 0 0 0 0 0 0 0 0 0 0 0 0 0 0 0 
0 -1334.19 0.04 0 0 -82.9341 0 0 0 -598.392 2266.08 1445.74 0 0 -991.318 -431.455 0 1811.66 0 0 0 -129.017 -2409.05 -2313.07 -727.943 -323.725 0 -578.86 0 211.112 1752.6 0 0 0 0 0 0 0 711.615 -1576.51 2139.12 0 1932.97 0 0 0 
0 0 0 0 0 0 0 871.532 -112.69 0 0 0 -982.925 0 0 2343.59 0 -1773.2 0 887.86 0 2376.71 0 758.003 0 0 922.956 0 0 0 0 555.208 -350.887 0 0 0 726.264 0 0 -309.076 0 0 0 0 2023.3 0 
0 1464.81 0 0 0.01 0 0 -1670.96 0 0 0 0 0 0 0 0 0 0 0 765.175 0 0 0 0 0 -49.3637 2406.61 0 0 0 0 0 -2010.03 0 0 0 0 0 0 0 1795.79 0 0 0 -1793.65 0 
-959.12 0 -348.75 0 0 0.08 0 0 0 0 0 0 0 0 0 0 166.707 -1710.79 0 -494.781 0 0 0 0 1799.45 0 -1844.92 -1152.15 1682.26 2334.44 0 0 0 0 1561.86 2081.59 0 0 0 0 0 0 0 0 0 0 
0 0 0 0 0 0 0.04 0 0 -1224.94 0 2089.83 0 0 -62.3341 0 0 0 0 0 0 0 1259.88 0 0 0 0 352.107 0 717.414 2153.31 0 0 -1761.45 0 0 0 0 0 0 0 -1416.75 0 2216.03 0 -257.347 
2426.45 0 0 -2306.82 1050.68 0 0 0.02 2161.7 0 0 0 0 -541.322 1233.94 0 -2102.65 2191 0 0 0 1112.93 0 0 0 -1234.86 0 712.226 2373.04 0 2176.35 0 0 0 238.426 0 0 0 0 0 0 1291.31 0 0 -1599.7 0 
1825.08 0 0 -1633.58 0 0 0 33.0363 0.02 0 0 0 0 0 0 771.889 1271.32 0 954.085 2184.9 0 1584.75 967.971 0 0 -2445.52 0 0 0 0 0 0 0 0 -128.864 0 -1583.07 2312.31 0 0 0 0 0 0 0 -55.0096 
0 0 1541.11 0 0 0 1281.55 0 0 0.03 0 0 0 0 0 -1852.7 0 0 1259.73 0 0 1961.96 0 0 0 0 0 0 -1498.38 0 750.526 0 1066.39 0 0 0 0 0 0 0 0 665.532 0 0 0 0 
1644.57 0 2052.29 0 0 0 0 0 0 0 0 0 0 0 0 0 -673.467 0 0 0 -32.7311 1726.51 0 -1317.56 0 2065.72 0 0 0 970.26 0 0 0 -528.962 -1943.49 0 0 0 1916.94 0 0 848.338 0 0 0 1077.68 
-993.454 0 260.094 0 0 0 -752.205 0 0 0 0 0.02 1103.02 -1733.07 0 0 0 0 0 0 0 0 0 2465.21 0 0 0 0 0 0 0 0 0 0 0 0 0 0 0 0 0 0 0 0 0 0 
1336.94 1372.8 0 -1495.48 0 0 0 0 0 0 0 1747.87 0.04 0 0 0 0 0 0 0 0 2151.02 0 0 2220.3 -902.356 0 0 0 0 0 0 0 0 0 0 0 0 0 0 -915.021 0 0 0 -314.264 0 
0 0 0 0 0 0 0 2041.76 0 0 0 282.83 0 0.03 0 1960.59 0 1000.63 0 0 0 432.829 2176.2 0 -2182.45 1076.62 0 -1868.11 -671.178 0 0 0 0 0 0 0 -70.1163 0 -1809.37 915.021 0 2159.57 -1551.64 0 0 0 
0 1098.28 -2241.51 0 0 0 1019.24 791.421 0 0 0 0 0 0 0.06 2347.25 863.903 -499.664 0 0 0 0 0 815.531 0 0 0 0 0 -1761.45 0 0 -1975.23 0 1551.94 0 0 0 0 -1999.19 -953.017 0 2368.01 0 0 1092.79 
-2410.73 1922.74 1431.55 1767.1 0 0 0 0 -1279.26 -1742.84 0 0 0 310.144 1028.86 0.07 0 1599.09 695.746 0 0 0 0 418.027 0 -1629.92 0 0 0 -1553.47 -755.562 0 0 0 2022.23 0 0 0 0 -1033.43 1588.41 0 0 0 -1842.02 0 
1439.79 1543.55 0 0 0 2488.56 0 2109.82 -2103.41 0 579.47 0 0 0 1153.37 0 0.03 0 0 1578.34 0 0 0 0 0 0 0 1931.75 0 0 -1778.08 652.867 0 0 0 0 0 -1575.75 0 0 -1252.4 0 -1676.61 0 0 0 
-828.654 0 -393.46 792.795 0 1935.41 0 -1651.74 0 0 0 0 0 1200.37 945.082 -688.879 0 0.05 0 0 0 0 0 0 0 -241.173 0 0 0 0 0 1414.91 0 0 0 0 1495.33 0 0 -1060.29 0 -1227.84 0 503.479 0 0 
1204.95 0 0 0 0 0 0 0 556.429 1703.92 0 0 0 0 0 -1172.29 0 0 0.03 0 0 0 0 0 2267.75 0 611.057 0 0 0 0 1009.17 0 0 0 0 0 0 0 0 0 0 0 0 -525.605 0 
0 0 0 -591.372 1085.92 54.3992 0 0 2184.59 0 0 0 0 0 0 0 -21.2867 0 0 0.01 0 -1785.56 0 1709.88 0 0 0 76.9829 0 2189.47 0 0 1965.47 0 0 1517.15 1199.91 0 0 0 1601.84 0 0 0 0 0 
0 0 0 0 0 0 0 0 0 0 418.485 0 0 0 0 0 0 0 0 0 0.03 0 0 -1281.24 0 0 903.119 1186.18 0 0 0 0 0 0 0 0 0 2002.09 2366.18 0 0 0 0 0 0 0 
0 0 2098.68 -1728.19 0 0 0 -2222.59 1485.41 -165.944 1442.84 0 -2405.85 -1991.87 0 0 0 0 0 -710.089 0 0 -820.261 0 0 0 1632.05 -909.528 0 0 0 -928.449 0 970.412 0 0 0 -77.5933 0 1470.31 0 1397.98 192.343 0 2167.65 0 
1289.18 0 1493.96 0 0 0 894.726 0 2387.08 0 0 0 0 2347.41 0 0 0 0 0 0 0 731.758 0.04 0 0 -436.491 0 0 0 0 0 2130.88 0 0 0 0 0 0 0 1669.59 0 0 0 0 0 0 
0 682.623 -1238.21 -2384.18 0 0 0 0 0 0 1696.6 -2092.73 0 0 1011.61 -1656.01 0 0 0 1459.32 2440.95 0 0 0.06 0 0 0 1309.32 -487.762 1863.84 0 -1418.42 0 0 -1018.33 0 -121.845 1132.31 0 0 0 0 2490.39 0 0 0 
-2117.15 0 -562.685 0 0 -2220.91 0 0 0 0 0 0 -712.226 1666.08 0 0 0 0 -574.587 0 0 0 0 0 0.05 1867.35 0 0 0 0 0 0 0 0 0 0 0 2129.35 2431.64 0 0 0 0 493.103 0 0 
0 -53.3311 176.321 0 1900.92 0 0 796.609 -69.5059 0 -450.224 0 -511.872 1960.43 0 -2114.86 0 208.975 0 0 0 0 -2261.19 0 -1382.41 0 0 0 1125.45 -841.014 0 0 0 -2304.38 2073.81 0 1880.47 0 0 0 0 0 -223.167 0 0 854.747 
0 0 0 -1829.05 2060.53 1547.67 0 0 0 0 0 0 0 0 0 0 0 0 1197.32 0 -2332.91 1436.28 0 0 0 0 0.01 0 0 -1439.48 0 0 -125.507 78.5089 0 1169.85 0 0 0 0 0 0 0 -1283.38 0 0 
0 2361.45 -1237.14 0 0 615.635 1753.06 12.2837 0 0 0 0 0 1485.11 0 0 -1805.4 0 0 -1640.45 1105.91 -121.845 0 2125.23 0 0 0 0.01 0 1799.6 0 0 914.411 0 0 0 0 -1756.57 1885.2 0 0 2201.38 0 0 0 0 
-1258.81 0 0 0 0 1152.46 0 1686.07 0 -210.196 0 0 0 1341.06 0 0 0 0 0 0 0 0 0 494.171 0 700.476 0 0 0.08 0 0 -356.227 0 0 0 0 0 0 2398.37 0 0 0 0 -223.777 0 0 
0 0 298.242 0 0 -1541.26 1096.91 0 0 0 -563.753 0 0 0 850.932 1497.31 0 0 0 1963.64 0 0 0 1936.63 0 -228.66 -1993.55 -34.4096 0 0.09 0 0 0 0 0 0 0 0 0 1448.64 0 0 0 0 0 0 
0 0 2233.12 0 0 0 914.411 455.87 0 -55.3148 0 0 0 0 0 159.383 1115.38 0 0 0 0 0 0 0 0 0 0 0 0 0 0.09 0 0 0 0 1290.86 0 284.356 0 -1073.87 773.11 0 0 0 0 -2151.02 
0 0 0 2189.63 0 0 0 0 0 0 0 0 0 0 0 0 -2141.1 -57.9089 -2133.47 0 0 -990.86 2326.5 1426.82 0 0 0 0 2464.45 0 0 0 0 0 0 0 0 2350.76 0 0 0 0 0 0 1792.43 0 
0 0 0 -76.6778 1353.42 0 0 0 0 2423.09 0 0 0 0 -1385.92 0 0 0 0 252.77 0 0 0 0 0 0 1785.87 1853.01 0 0 0 0 0.01 0 0 0 0 -1629.76 0 0 0 0 0 0 970.412 0 
0 0 0 0 0 0 1524.78 0 0 0 -621.281 0 0 0 0 0 0 0 0 0 0 -839.183 0 0 0 1980.42 -895.795 0 0 0 0 0 0 0.09 0 0 0 0 0 0 -688.116 0 0 0 0 0 
-1238.67 0 0 0 0 837.962 0 1332.67 294.427 0 1370.97 0 0 0 -2447.05 121.693 0 0 0 0 0 0 0 1704.69 0 -1898.02 0 0 0 0 0 0 0 0 0.03 0 1450.16 1758.71 0 542.543 1009.48 0 0 0 0 0 
1843.39 0 0 0 0 1140.25 0 0 0 0 0 0 0 0 0 0 0 0 0 18.0822 0 0 0 0 0 0 1343.96 0 0 0 -168.844 0 0 0 0 0.04 0 0 0 0 0 0 0 0 0 0 
0 0 0 -399.258 0 0 0 0 2485.96 0 0 0 0 1995.68 0 0 0 1241.42 0 -1023.97 0 0 0 1056.78 0 -51.0422 0 0 0 0 0 0 0 0 -1011.31 0 0.02 0 -2231.44 0 0 0 -843.455 0 0 0 
0 0 0 0 0 0 0 0 864.818 0 0 0 0 0 0 0 1218.99 0 0 0 173.269 -1714.15 0 1953.57 189.749 0 0 993.454 0 0 4.50148 -1250.11 -282.678 0 2384.79 0 0 0.09 0 1371.43 0 862.377 0 0 500.58 0 
0 0 -322.504 0 0 0 0 0 0 0 -158.162 0 0 -955.916 0 0 0 0 0 0 -1665.62 0 0 0 -2463.23 0 0 1872.08 2304.07 0 0 0 0 0 0 0 1790.44 0 0.08 0 484.405 -1516.39 2127.83 0 -625.095 -1246.91 
1781.59 0 1715.22 1870.25 0 0 0 0 0 0 0 0 0 1915.57 1358.76 -1137.81 0 1265.98 0 0 0 1274.22 2084.34 0 0 0 0 0 0 719.55 -1323.36 0 0 0 907.697 0 0 -176.626 0 0 0 1209.68 0 0 0 1794.72 
0 0 -674.688 0 400.937 0 0 0 0 0 0 0 -929.212 0 80.6452 44.0229 2197.41 0 0 1206.63 0 0 0 0 0 0 0 0 0 0 928.907 0 0 -642.796 370.724 0 0 0 -853.526 0 0.03 0 0 1154.44 0 0 
0 0 0 0 0 0 -954.085 736.946 0 -1690.65 2383.42 0 0 -2409.21 0 0 0 1391.11 0 0 0 1205.56 0 0 0 0 0 1900.92 0 0 0 0 0 0 0 0 0 669.805 2136.98 386.593 0 0.05 0 0 -696.661 -1495.03 
1706.82 0 -2072.44 0 0 0 0 0 0 0 0 0 0 1326.11 -1576.51 0 2392.73 0 0 0 0 2186.42 0 993.301 0 1450.77 0 0 0 0 0 0 0 0 0 0 257.042 0 1793.5 0 0 0 0.02 0 0 0 
-1842.63 0 0 0 0 0 647.374 0 0 0 0 0 0 0 0 0 0 -437.559 0 0 0 0 0 0 1179.62 0 138.478 0 1880.47 0 0 0 0 0 0 0 0 0 0 0 2369.53 0 0 0.05 0 0 
0 0 0 -2112.72 -1543.24 0 0 2467.96 0 0 0 0 -1027.02 0 0 -2192.53 0 0 2004.23 0 0 449.309 0 0 0 0 0 0 0 0 0 -691.778 718.94 0 0 0 0 1188.16 2214.04 0 0 922.04 0 0 0.04 -1919.84 
0 0 0 0 0 0 1898.33 0 -570.467 0 2310.02 0 0 0 -1168.78 0 0 0 0 0 0 0 0 0 0 -197.226 0 0 0 0 1162.53 0 0 0 0 0 0 0 1854.23 2185.05 0 667.821 0 0 386.593 0.06 
