*Vertices 50
*Matrix 
0 0 0 0 0 0 0 0 0 0 0 1945.02 0 0 0 0 0 0 0 0 0 0 0 0 0 0 0 0 0 0 0 0 0 0 0 0 0 0 0 0 0 -331.05 0 0 0 0 0 0 0 0 
0 0.01 0 0 0 0 0 0 0 0 0 0 0 0 1122.85 0 0 2397.15 0 0 0 0 0 -540.406 -505.615 0 0 0 0 -2173.45 0 0 0 0 1257.74 0 0 -1212.12 0 0 0 -559.175 0 578.555 0 964.309 0 0 0 0 
0 0 0.06 0 0 0 0 0 0 0 0 -2099.14 0 0 0 0 0 2430.11 0 0 0 0 0 0 0 -831.401 0 2414.24 0 0 -1682.26 0 0 0 0 0 0 0 0 0 0 0 0 -1417.97 0 2415.77 0 0 0 233.848 
0 0 0 0.09 0 0 0 0 0 0 0 0 0 0 0 1490.14 1851.18 0 0 0 0 0 0 0 0 0 0 0 0 0 0 0 1186.94 0 461.058 0 0 0 0 0 0 0 0 0 0 0 815.378 0 0 0 
0 0 0 0 0.09 0 0 0 0 0 0 0 0 1883.68 0 0 0 0 0 0 0 0 0 0 0 -2086.93 959.883 1858.35 1555.6 0 0 0 0 0 0 0 -204.093 0 0 0 0 0 0 0 802.103 0 0 0 0 0 
0 0 0 0 0 0.05 0 0 0 0 0 0 1394.31 0 0 0 0 -2323.3 0 0 0 0 1705.15 0 0 0 0 0 0 0 0 0 0 0 0 0 0 0 0 0 0 0 0 0 0 0 1012.83 0 1596.96 0 
0 0 0 0 0 0 0.08 0 0 0 1133.99 0 0 106.433 0 0 0 0 0 0 0 0 0 0 1198.23 0 0 -65.2333 0 0 0 0 0 -1777.93 0 0 194.327 0 0 0 0 0 0 2299.95 0 0 0 -166.707 0 0 
0 0 0 0 0 0 0 0.04 0 0 0 0 0 1090.04 0 0 0 1398.74 0 0 0 -1631.75 0 0 0 0 0 -1109.73 436.949 0 0 0 0 0 0 1496.55 0 1054.19 0 0 -1788.61 0 0 0 1957.08 0 0 0 0 0 
0 0 0 0 0 0 0 0 0.08 0 702.612 0 0 0 0 0 0 0 0 0 0 0 0 0 1721.17 0 0 0 0 0 0 -1465.27 0 0 0 0 0 0 0 0 0 0 -302.515 0 0 0 0 0 0 0 
0 0 0 0 0 0 0 0 0 0.03 0 1705.6 0 0 0 0 0 0 0 977.279 0 -598.849 0 396.97 0 0 0 0 0 0 0 0 0 0 0 0 0 0 0 0 0 0 1689.58 -109.027 0 0 0 0 0 0 
0 0 0 0 0 0 1162.53 0 -596.255 0 0.09 0 0 0 1146.2 0 0 1896.34 0 0 0 0 0 -590.457 0 -689.947 0 -249.718 0 0 0 0 0 0 0 0 0 0 0 0 0 0 0 0 0 0 0 0 0 0 
177.389 0 1874.83 0 0 0 0 0 0 2435.3 0 0.01 0 0 116.657 0 0 0 -1620.3 0 0 1738.11 381.863 0 0 0 0 0 0 0 648.9 0 0 0 0 0 0 0 0 0 0 0 0 0 0 0 0 0 0 0 
0 0 0 0 0 -1615.57 0 0 0 0 0 0 0.01 1626.41 0 1029.92 0 0 0 0 0 0 0 0 0 0 0 0 0 -97.7355 0 1824.93 994.369 0 0 0 -1407.9 0 0 0 0 0 0 0 0 0 0 0 0 0 
0 0 0 0 1521.42 0 104.602 1738.26 0 0 0 0 2253.72 0.07 0 0 0 -1647.16 0 0 0 0 898.083 0 0 0 0 0 0 0 0 -278.405 0 0 0 0 0 0 -1990.34 0 0 0 -581.912 0 0 0 0 0 0 481.811 
0 1621.22 0 0 0 0 0 0 0 0 -902.966 2147.66 0 0 0 0 0 0 0 -1274.22 0 0 0 0 0 0 0 0 0 0 0 0 0 0 440.916 289.239 0 0 0 0 0 0 0 0 0 0 0 0 563.295 0 
0 0 0 147.938 0 0 0 0 0 0 0 0 1694.62 0 0 0.04 -2493.44 0 0 0 0 759.987 0 0 0 0 0 0 0 0 0 0 0 976.669 0 0 0 -1095.39 0 -1633.12 0 532.014 0 0 0 0 1976.3 0 0 0 
0 0 0 1827.22 0 0 0 0 0 0 0 0 0 0 0 1549.35 0.07 0 0 0 0 869.091 0 1599.86 0 0 0 0 0 1852.24 0 0 0 0 0 1331.9 1523.41 0 0 2352.29 -953.627 0 0 -2030.32 1707.13 2143.24 0 0 0 0 
0 -2248.07 1129.72 0 0 -1336.94 0 -1892.99 0 0 1674.63 0 0 1799.6 0 0 0 0.09 0 0 0 0 0 0 0 0 0 0 0 0 0 1817.61 0 0 0 -248.497 2307.12 -2147.36 0 0 520.569 0 0 0 0 0 -259.636 0 0 0 
0 0 0 0 0 0 0 0 0 0 0 -2050.92 0 0 0 0 0 0 0.06 0 1947.46 -707.801 0 0 0 0 474.944 0 0 0 0 0 0 0 2444.3 0 0 0 0 0 0 0 -1831.95 732.215 0 0 0 0 0 0 
0 0 0 0 0 0 0 0 0 1603.98 0 0 0 0 1070.97 0 0 0 0 0 0 0 0 0 -1932.36 0 -405.362 0 0 0 0 0 0 0 0 0 941.878 0 0 0 0 1130.79 0 0 0 0 0 0 0 0 
0 0 0 0 0 0 0 0 0 0 0 0 0 0 0 0 0 0 -620.212 0 0.09 0 0 0 0 0 0 0 0 0 0 0 0 0 0 0 2038.26 0 0 0 0 0 0 0 0 0 0 0 747.932 0 
0 0 0 0 0 0 0 -1893.29 0 -2155.6 0 -2300.56 0 0 0 2389.37 1552.4 0 165.792 0 0 0.07 0 0 0 0 0 1851.63 -756.63 0 0 0 0 0 0 0 0 0 0 0 0 0 -1359.68 -1577.12 0 0 2466.43 0 1735.21 0 
0 0 0 0 0 -664.769 0 0 0 0 0 2351.37 0 -2038.56 0 0 0 0 0 0 0 0 0.04 0 0 1655.4 0 0 0 0 0 0 0 0 0 0 0 -2216.18 0 1246.15 0 605.106 0 0 0 0 0 0 0 0 
0 -565.737 0 0 0 0 0 0 0 1043.81 -514.008 0 0 0 0 0 -465.026 0 0 0 0 0 0 0.01 0 0 0 0 0 -434.049 0 0 0 0 0 0 1386.38 0 0 0 0 -2157.73 0 0 0 0 2407.38 0 512.482 681.707 
0 1614.05 0 0 0 0 1787.85 0 1198.23 0 0 0 0 0 0 0 0 0 0 -969.955 0 0 0 0 0 0 0 0 0 0 -920.209 0 0 0 0 0 1801.43 0 0 0 0 0 0 0 0 0 0 0 0 0 
0 0 -1215.78 0 1569.95 0 0 0 0 0 1585.51 0 0 0 0 0 0 0 0 0 0 0 -407.804 0 0 0 0 0 0 0 1623.05 -1806.31 -2158.35 0 2025.89 0 0 0 0 0 0 0 0 0 0 0 0 0 0 0 
0 0 0 0 2344.05 0 0 0 0 0 0 0 0 0 0 0 0 0 -1460.23 1245.99 0 0 0 0 0 0 0.09 0 0 -610.141 0 0 -2379.76 0 0 0 0 0 0 0 0 0 0 0 1415.83 0 0 0 0 0 
0 0 -2284.39 0 795.694 0 -669.347 1732.76 0 0 1205.56 0 0 0 0 0 0 0 0 0 0 1657.08 0 0 0 0 0 0.03 1448.79 0 2059.47 0 0 0 0 0 -861.309 0 0 0 0 0 0 0 0 0 0 0 0 0 
0 0 0 0 915.174 0 0 -1106.83 0 0 0 0 0 0 0 0 0 0 0 0 0 2182.45 0 0 0 0 0 1085.47 0.06 0 0 0 0 0 0 0 63.2496 0 0 0 1649.75 0 0 0 0 0 0 0 0 0 
0 1914.81 0 0 0 0 0 0 0 0 0 0 -1615.57 0 0 0 743.355 0 0 0 0 0 0 -779.214 0 0 1734.44 0 0 0.08 0 0 0 0 0 0 169.759 0 0 0 0 0 0 0 0 0 0 2262.72 0 0 
0 0 856.731 0 0 0 0 0 0 0 0 786.538 0 0 0 0 0 0 0 0 0 0 0 0 391.781 564.211 0 2299.8 0 0 0.02 0 0 0 444.731 0 0 0 0 0 0 0 0 0 0 0 0 0 282.83 0 
0 0 0 0 0 0 0 0 1514.56 0 0 0 1830.12 1213.64 0 0 0 764.565 0 0 0 0 0 0 0 2088.76 0 0 0 0 0 0.04 1531.04 0 0 0 0 0 0 0 0 750.679 0 1006.58 0 0 0 0 0 0 
0 0 0 -1322.44 0 0 0 0 0 0 0 0 2331.54 0 0 0 0 0 0 0 0 0 0 0 0 1935.71 -2401.43 0 0 0 0 -421.995 0.06 0 0 0 0 0 0 2301.48 0 0 0 0 0 0 824.076 0 0 0 
0 0 0 0 0 0 -609.684 0 0 0 0 0 0 0 0 1068.53 0 0 0 0 0 0 0 0 0 0 0 0 0 0 0 0 0 0.05 0 0 0 -988.876 1391.87 0 0 2078.08 0 0 0 0 0 0 0 0 
0 -414.06 0 -408.872 0 0 0 0 0 0 0 0 0 0 1661.66 0 0 0 -1773.51 0 0 0 0 0 0 998.489 0 0 0 0 2458.19 0 0 0 0.01 0 -2025.13 0 0 0 0 0 0 2022.54 0 0 1539.28 0 0 0 
0 0 0 0 0 0 0 -39.2926 0 0 0 0 0 0 -312.891 0 2282.1 -1699.65 0 0 0 0 0 0 0 0 0 0 0 0 0 0 0 0 0 0.01 0 0 0 487.609 0 0 0 0 0 0 0 0 0 0 
0 0 0 0 2041.76 0 1328.24 0 0 0 0 0 199.057 0 0 0 -310.755 -2134.69 0 -2147.21 442.9 0 0 1653.26 2218.62 0 0 1512.73 2241.51 1585.21 0 0 0 0 -509.125 0 0.01 0 0 0 0 0 0 0 0 0 0 0 0 0 
0 2488.1 0 0 0 0 0 -1474.27 0 0 0 0 0 0 0 393.46 0 1227.23 0 0 0 0 -366.604 0 0 0 0 0 0 0 0 0 0 938.368 0 0 0 0.02 0 0 1563.39 0 1438.72 0 0 0 0 -2340.54 0 2286.07 
0 0 0 0 0 0 0 0 0 0 0 0 0 2377.01 0 0 0 0 0 0 0 0 0 0 0 0 0 0 0 0 0 0 0 -670.415 0 0 0 0 0.04 1074.63 0 0 0 0 0 0 0 0 0 1149.71 
0 0 0 0 0 0 0 0 0 0 0 0 0 0 0 -1718.57 2047.87 0 0 0 0 0 -749.001 0 0 0 0 0 0 0 0 0 1243.25 0 0 -1062.58 0 0 1500.06 0.08 0 0 0 2466.28 0 0 0 1419.8 0 0 
0 0 0 0 0 0 0 862.835 0 0 0 0 0 0 0 0 1621.83 2327.27 0 0 0 0 0 0 0 0 0 0 1609.32 0 0 0 0 0 0 0 0 2188.86 0 0 0.08 0 -729.316 0 0 0 0 0 0 0 
392.544 202.261 0 0 0 0 0 0 0 0 0 0 0 0 0 2356.87 0 0 0 -1285.36 0 0 -2144 -180.593 0 0 0 0 0 0 0 772.347 0 -445.036 0 0 0 0 0 0 0 0.02 0 0 0 0 0 0 0 1873.15 
0 0 0 0 0 0 0 0 1730.02 1367.61 0 0 0 -25.4067 0 0 0 0 364.162 0 0 2388.15 0 0 0 0 0 0 0 0 0 0 0 0 0 0 0 219.504 0 0 -1470 0 0.07 0 0 0 0 0 0 0 
0 934.858 -1207.08 0 0 0 681.097 0 0 1056.63 0 0 0 0 0 0 1498.08 0 493.255 0 0 -917.463 0 0 0 0 0 0 0 0 0 1502.5 0 0 1575.29 0 0 0 0 -1860.94 0 0 0 0.06 0 0 0 0 0 0 
0 0 0 0 1454.13 0 0 477.233 0 0 0 0 0 0 0 0 1715.22 0 0 0 0 0 0 0 0 0 2270.04 0 0 0 0 0 0 0 0 0 0 0 0 0 0 0 0 0 0.01 0 0 -16.2511 0 0 
0 1204.03 1761.45 0 0 0 0 0 0 0 0 0 0 0 0 0 2408.6 0 0 0 0 0 0 0 0 0 0 0 0 0 0 0 0 0 0 0 0 0 0 0 0 0 0 0 0 0.03 0 1173.36 0 0 
0 0 0 2348.48 0 2040.85 0 0 0 0 0 0 0 0 0 -1217.61 0 86.5963 0 0 0 1296.66 0 -1801.43 0 0 0 0 0 0 0 0 -269.097 0 534.15 0 0 0 0 0 0 0 0 0 0 0 0.07 0 0 -360.347 
0 0 0 0 0 0 2478.94 0 0 0 0 0 0 0 0 0 0 0 0 0 0 0 0 0 0 0 0 0 0 402.463 0 0 0 0 0 0 0 2059.62 0 -83.2392 0 0 0 0 703.986 1584.29 0 0.05 0 0 
0 0 0 0 0 -449.614 0 0 0 0 0 0 0 0 -1499.91 0 0 0 0 0 1376.46 689.032 0 506.226 0 0 0 0 0 0 1849.35 0 0 0 0 0 0 0 0 0 0 0 0 0 0 0 0 0 0.03 0 
0 0 -1937.85 0 0 0 0 0 0 0 0 0 0 -117.878 0 0 0 0 0 0 0 0 0 1892.22 0 0 0 0 0 0 0 0 0 0 0 0 0 -943.556 -236.442 0 0 2037.95 0 0 0 0 1183.28 0 0 0.05 
