*Vertices 60
*Matrix 
0.09 -321.436 781.198 0 0 0 0 1349.76 0 0 0 0 1347.01 0 -1690.65 -477.996 0 -310.755 0 0 0 0 0 0 0 0 2351.07 0 0 0 0 0 0 0 0 0 0 2395.63 0 0 0 0 -1771.83 0 0 0 0 0 383.236 223.472 0 0 0 0 0 0 0 781.808 0 -259.636 
-213.706 0.06 0 -1060.29 0 0 0 2008.96 0 0 0 1734.29 -1513.79 0 2318.26 0 0 0 0 0 0 -636.54 0 42.8022 0 -1256.83 1224.17 0 0 0 0 0 0 0 2196.95 0 1415.22 0 0 0 211.722 0 0 0 0 0 0 0 0 0 0 0 384.457 0 -579.318 0 1820.81 -2283.01 0 0 
1682.71 0 0.08 1442.99 0 1221.88 0 0 -1121.33 0 0 0 0 0 0 -1479.16 0 0 0 0 0 0 0 1043.05 -582.217 2155.9 0 0 2498.02 0 0 0 0 0 0 0 0 0 0 -195.7 0 0 0 1436.74 0 0 0 0 0 0 0 0 0 0 0 0 0 0 0 0 
0 636.235 1965.16 0.08 0 -1869.18 0 -400.479 1174.58 -77.1355 0 0 0 0 0 0 0 31.0526 0 0 0 -256.584 1060.29 0 706.58 0 786.996 0 0 0 0 0 0 0 0 0 1432.31 0 0 0 0 0 0 -1177.79 0 1571.17 -1849.8 0 0 0 1653.26 0 0 0 0 0 0 0 0 -2049.7 
0 0 0 0 0.08 0 447.63 1808.6 0 1428.65 0 736.03 0 0 0 0 1665.78 0 0 0 0 0 0 -1147.11 0 0 0 2077.32 0 0 0 0 0 0 0 0 0 0 0 0 0 0 0 0 0 0 0 0 0 0 0 0 0 1971.42 0 0 0 0 0 0 
0 0 2084.95 -1818.67 0 0.04 0 0 0 0 0 0 0 0 0 -1461.46 0 1939.07 0 0 -443.663 0 1159.47 0 0 0 0 2422.18 0 0 0 0 1543.24 0 0 0 0 0 0 0 0 -364.162 0 -1800.06 1078.6 0 0 0 0 0 0 2083.27 0 0 0 0 0 0 0 0 
0 0 0 0 2238.46 0 0.06 0 0 0 0 0 0 1633.12 0 1292.08 0 1659.67 0 0 0 0 -1703.62 0 1265.22 0 0 0 766.091 0 -903.424 0 0 0 0 0 0 0 0 0 0 0 0 0 2245.48 0 0 0 0 0 0 0 0 0 427.946 329.524 0 0 0 0 
273.217 1334.19 0 -329.676 1311.76 0 0 0.05 -205.313 0 0 0 0 0 0 1591.92 0 0 -703.528 0 506.989 0 2083.27 1171.68 0 -1825.54 0 2182.15 0 0 -332.118 0 430.54 0 0 0 0 0 0 0 0 0 0 0 0 0 0 0 0 0 0 0 0 -1818.22 0 0 0 0 0 0 
0 0 -803.171 2465.21 0 0 0 -208.67 0.09 0 -500.427 0 0 2170.71 0 0 0 1130.02 0 0 -2418.21 0 0 0 0 0 1840.8 0 0 0 0 0 0 0 0 0 0 0 0 0 -1385.92 0 0 0 0 0 1020.16 0 -1370.51 -1259.73 0 0 -0.839259 0 0 0 0 0 0 0 
0 0 0 2468.41 -1774.73 0 0 0 0 0.01 988.723 0 0 0 0 706.58 0 0 1801.28 0 -1105.61 0 0 0 0 -1836.99 0 0 983.688 0 0 0 0 0 0 0 0 0 0 0 0 0 0 0 896.252 0 0 0 0 0 0 0 0 0 0 0 380.49 -2454.07 1081.19 0 
0 0 0 0 0 0 0 0 1964.86 -39.7504 0.08 0 0 0 1035.72 0 0 0 0 0 0 1537.29 0 0 0 0 0 2102.8 985.519 0 0 0 0 0 0 0 938.368 0 -189.291 0 0 0 0 0 0 0 0 -22.8126 370.418 0 0 0 0 0 0 0 0 0 0 0 
0 -309.076 0 0 2104.48 0 0 0 0 0 0 0 0 0 0 0 1384.4 0 0 1824.02 0 0 0 -261.62 0 2214.5 0 0 -2331.39 0 0 0 0 0 0 0 0 0 0 0 0 0 0 0 0 0 0 0 1580.94 0 0 0 0 -2427.21 0 0 0 0 0 0 
1647.92 560.701 0 0 0 0 0 0 0 0 0 0 0.07 0 0 0 0 -1531.65 0 -1113.7 0 0 0 0 1391.26 1468.93 0 0 0 0 0 0 0 0 0 0 0 0 0 0 0 0 0 0 507.141 0 0 0 0 0 0 0 0 0 0 0 0 0 0 0 
0 0 0 0 0 0 -897.473 0 1269.19 0 0 0 0 0.08 0 0 1381.19 -329.676 0 -150.38 0 0 2108.6 0 0 0 0 -272.759 0 0 0 -822.245 0 0 0 0 1118.88 0 0 0 0 0 0 0 0 0 0 0 0 0 0 0 0 0 0 0 1431.24 0 0 0 
-2461.7 1741.16 0 0 0 0 0 0 0 0 -1541.11 0 0 0 0.01 1321.07 0 0 0 0 0 0 0 2321.01 1381.34 0 0 0 0 0 0 0 0 0 2327.57 0 0 0 0 0 0 0 2439.57 0 0 0 0 0 0 0 0 0 0 0 0 0 0 0 0 0 
-732.673 0 -2448.58 0 0 1838.51 2201.68 -495.087 0 743.355 0 0 0 0 1083.18 0.02 0 0 0 0 0 0 -2222.74 0 0 0 1517.61 0 1987.44 0 0 0 0 -1329.62 0 0 0 0 0 0 0 0 0 0 0 0 0 743.202 0 0 0 378.658 0 0 0 0 0 0 -2083.57 0 
0 0 0 0 -385.22 0 0 0 0 0 0 1947.16 0 -221.641 0 0 0.03 -2351.99 0 334.101 0 0 0 0 0 0 0 0 0 0 0 0 0 0 0 0 0 2443.85 0 0 0 0 0 0 0 0 0 0 0 0 -30.9 0 0 0 0 0 0 0 0 0 
843.913 0 0 -1175.5 0 1921.83 -200.735 0 -1870.71 0 0 0 -251.549 2289.27 0 0 571.23 0.09 0 1239.13 0 2390.74 0 0 1443.45 0 0 1964.4 0 -1073.41 -1162.53 -1981.19 0 0 0 0 0 -795.999 1712.01 0 0 0 0 0 0 0 0 0 0 0 0 0 1037.1 0 0 0 0 0 0 0 
0 0 0 0 0 0 0 -1889.48 0 2110.28 0 0 0 0 0 0 0 0 0.05 0 0 1184.19 0 0 -2241.51 0 1025.19 0 1434.75 -75.7622 -2375.94 867.26 0 0 0 0 460.143 0 -584.201 0 0 0 0 0 0 1887.49 0 0 0 -952.712 0 0 2109.97 0 0 0 0 0 0 0 
0 0 0 0 0 0 0 0 0 0 0 554.75 599.002 2026.66 0 0 737.861 -506.378 0 0.09 0 2310.02 0 0 0 0 0 0 1917.25 0 1221.43 0 0 0 0 0 0 -712.531 0 0 0 420.011 0 0 0 0 0 0 0 -2402.8 0 0 0 0 0 0 -1077.84 0 0 0 
0 0 0 0 0 937.147 0 2480.47 1477.48 2449.64 0 0 0 0 0 0 0 0 0 0 0.04 0 0 0 0 -2475.13 0 1739.94 603.885 -1569.34 0 0 0 0 1510.13 0 0 0 291.223 0 0 517.518 0 0 0 0 0 0 0 0 0 0 0 -2287.13 0 0 0 0 0 0 
0 2229.76 0 -76.8303 0 0 0 0 0 0 1123 0 0 0 0 0 0 1450.01 158.62 1337.86 0 0.06 0 0 0 0 0 0 0 0 0 0 0 0 0 0 0 0 -1914.81 0 0 0 0 0 0 0 0 0 572.298 0 0 0 1591.46 0 0 0 0 0 0 0 
0 0 0 -2100.21 0 1003.68 1645.79 -2067.86 0 0 0 0 0 1749.85 0 1647.77 0 0 0 0 0 0 0.06 2470.55 0 -2283.17 0 1184.19 0 0 0 0 0 0 0 0 0 0 0 0 0 0 0 0 0 0 0 0 0 0 0 0 0 0 0 0 0 0 0 0 
0 1552.25 -2273.4 0 1577.58 0 0 263.146 0 0 0 2480.93 0 0 -1250.11 0 0 0 0 0 0 0 2024.67 0.05 1980.88 0 0 2098.99 0 0 0 0 0 0 0 2323.45 0 0 0 0 0 0 0 0 0 0 0 0 0 18.54 0 0 0 0 0 0 -1484.8 0 0 0 
0 0 1152 143.513 0 0 -2114.55 0 0 0 0 0 2233.88 0 2178.79 0 0 2370.6 -63.7074 0 0 0 0 284.814 0.06 -1454.89 0 0 0 0 0 0 0 0 -2476.04 0 0 2171.32 0 0 0 0 899.304 0 0 0 0 0 0 0 0 0 0 0 141.987 0 0 103.687 0 1769.08 
0 -1873.3 456.328 0 0 0 0 1078.14 0 1986.37 0 638.981 787.301 0 0 0 0 0 0 0 2428.59 0 922.498 0 -2238.3 0.02 1825.69 -591.372 -1156.58 0 0 0 0 0 0 0 0 165.029 0 0 268.334 0 0 0 0 0 0 0 1411.1 1577.43 0 0 0 0 0 0 0 1053.42 -2382.81 0 
501.495 293.512 0 1942.58 0 0 0 0 2093.34 0 0 0 0 0 0 1260.49 0 0 -119.861 0 0 0 0 0 0 2346.49 0.06 0 0 0 0 0 0 0 0 224.693 0 0 0 2056.26 0 0 0 0 0 0 0 0 0 0 0 0 0 0 0 0 0 0 0 0 
0 0 0 0 218.436 -323.725 0 -1394.77 0 0 -510.498 0 0 -1846.45 0 0 0 2337.34 0 0 2022.08 0 1038.01 1113.24 0 1096.91 0 0.09 1574.22 0 0 0 0 0 0 0 0 0 0 0 80.9503 0 0 0 0 0 0 0 0 0 0 0 0 0 0 0 0 0 0 680.639 
0 0 534.761 0 0 0 847.27 0 0 1909.77 -1061.05 -2441.56 0 0 0 -2278.89 0 0 1146.5 2173.76 2464.9 0 0 0 0 527.131 0 1612.37 0.05 0 1969.59 0 0 0 0 0 0 0 0 0 0 0 -463.5 0 0 0 0 711.31 2250.05 0 0 0 0 0 0 0 0 0 -2480.62 0 
0 0 0 0 0 0 0 0 0 0 0 0 0 0 0 0 0 1511.05 -91.4792 0 327.845 0 0 0 0 0 0 0 0 0.02 0 0 0 0 0 0 0 0 0 0 1412.02 0 0 0 0 0 0 0 0 0 0 883.282 0 0 0 -157.094 403.226 0 0 0 
0 0 0 0 0 0 2256.77 -1983.02 0 0 0 0 0 0 0 0 0 892.285 146.413 2453.61 0 0 0 0 0 0 0 0 -2163.08 0 0.05 0 0 0 0 0 0 0 0 0 0 0 0 0 0 0 0 0 0 0 0 0 0 0 0 0 0 0 610.752 0 
0 0 0 0 0 0 0 0 0 0 0 0 0 854.9 0 0 0 1488.77 1910.38 0 0 0 0 0 0 0 0 0 0 0 0 0.09 -1732.15 0 0 0 0 0 0 0 0 0 0 0 374.691 0 0 258.568 0 0 -2032.46 0 0 0 0 0 0 0 0 0 
0 0 0 0 0 1902.91 0 1089.59 0 0 0 0 0 0 0 0 0 0 0 0 0 0 0 0 0 0 0 0 0 0 0 456.023 0.09 0 0 0 0 0 0 0 -2213.28 0 0 0 0 0 0 0 0 0 0 0 0 0 0 0 0 0 0 0 
0 0 0 0 0 0 0 0 0 0 0 0 0 0 0 623.569 0 0 0 0 0 0 0 0 0 0 0 0 0 0 0 0 0 0.07 786.081 489.441 0 0 0 0 0 0 0 0 1287.65 0 0 0 0 0 0 -1251.34 0 0 0 0 0 0 0 0 
0 2290.95 0 0 0 0 0 0 0 0 0 0 0 0 1128.5 0 0 0 0 0 517.518 0 0 0 1510.59 0 0 0 0 0 0 0 0 -2256.16 0.08 0 0 0 0 0 0 0 0 0 0 0 0 0 0 -565.737 0 0 0 0 1937.54 -487.152 0 0 0 0 
0 0 0 0 0 0 0 0 0 0 0 0 0 0 0 0 0 0 0 0 0 0 0 -2125.08 0 0 1764.81 0 0 0 0 0 0 2056.41 0 0.04 1628.39 0 0 -2164.75 0 0 0 0 0 0 0 0 0 0 0 0 0 0 0 0 0 0 0 0 
0 2418.52 0 -529.878 0 0 0 0 0 0 964.003 0 0 -2385.25 0 0 0 0 1409.88 0 0 0 0 0 0 0 0 0 0 0 0 0 0 0 0 1985.76 0 -152.058 0 0 0 0 0 0 -287.408 0 -603.427 0 0 0 0 -243.004 0 0 -436.796 1046.4 0 0 0 0 
2381.44 0 0 0 0 0 0 0 0 0 0 0 0 0 0 0 -116.199 1054.64 0 -623.417 0 0 0 0 -151.906 1146.35 0 0 0 0 0 0 0 0 0 0 1180.38 0 0 0 0 0 -479.217 0 0 0 0 0 0 0 0 0 0 0 0 0 0 0 0 0 
0 0 0 0 0 0 0 0 0 0 2059.92 0 0 0 0 0 0 681.86 -181.661 0 490.967 316.706 0 0 0 0 0 0 0 0 0 0 0 0 0 0 0 0 0.03 0 0 0 0 0 0 0 -2234.95 0 0 0 650.883 0 0 0 0 0 0 0 0 -1617.4 
0 0 -2156.36 0 0 0 0 0 0 0 0 0 0 0 0 0 0 0 0 0 0 0 0 0 0 0 2122.49 0 0 0 0 0 0 0 0 1101.95 0 0 0 0.04 0 0 0 0 0 0 0 0 0 0 0 1612.98 -1762.37 0 0 0 0 0 0 1078.91 
0 2148.73 0 0 0 0 0 0 2141.41 0 0 0 0 0 0 0 0 0 0 0 0 0 0 0 0 869.854 0 -533.692 0 1416.75 0 0 -2137.14 0 0 0 0 0 0 0 0.04 0 0 0 0 0 0 0 0 0 0 0 0 0 0 0 0 0 0 0 
0 0 0 0 0 711.158 0 0 0 0 0 0 0 0 0 0 0 0 0 1749.7 1193.35 0 0 0 0 0 0 0 0 0 0 0 0 0 0 0 0 0 0 0 0 0.04 0 0 0 0 0 0 0 0 0 0 0 0 0 0 0 0 0 0 
2226.1 0 0 0 0 0 0 0 0 0 0 0 0 0 755.104 0 0 0 0 0 0 0 0 0 -846.507 0 0 0 2144 0 0 0 0 0 0 0 0 767.922 0 0 0 0 0 0 0 -1490.45 0 0 0 0 0 0 0 0 0 0 0 0 -62.9444 0 
0 0 2194.36 -2361.75 0 1104.39 0 0 0 0 0 0 0 0 0 0 0 0 0 0 0 0 0 0 0 0 0 0 0 0 0 0 0 0 0 0 0 0 0 0 0 0 0 0 0 0 0 0 0 0 1965.47 0 0 0 0 0 0 0 0 1444.52 
0 0 0 0 0 -280.084 -1313.59 0 0 1437.96 0 0 -239.189 0 0 0 0 0 0 0 0 0 0 0 0 0 0 0 0 0 0 1284.45 0 -629.063 0 0 -60.6555 0 0 0 0 0 0 0 0.09 0 999.71 0 0 0 0 0 0 0 0 0 0 0 0 0 
0 0 0 368.435 0 0 0 0 0 0 0 0 0 0 0 0 0 0 262.383 0 0 0 0 0 0 0 0 0 0 0 0 0 0 0 0 0 0 0 0 0 0 0 2095.93 0 0 0.06 0 0 0 0 0 0 0 0 0 0 0 0 0 0 
0 0 0 560.854 0 0 0 0 451.445 0 0 0 0 0 0 0 0 0 0 0 0 0 0 0 0 0 0 0 0 0 0 0 0 0 0 0 -1459.01 0 1689.28 0 0 0 0 0 671.789 0 0.08 1632.21 0 0 0 0 0 0 0 0 0 0 -1605.04 0 
0 0 0 0 0 0 0 0 0 0 191.885 0 0 0 0 -109.18 0 0 0 0 0 0 0 0 0 0 0 0 273.827 0 0 2258.45 0 0 0 0 0 0 0 0 0 0 0 0 0 0 -142.14 0.03 0 0 0 0 0 419.248 0 0 0 0 0 0 
1981.49 0 0 0 0 0 0 0 2009.41 0 -2021.01 -96.057 0 0 0 0 0 0 0 0 0 871.685 0 0 0 -199.21 0 0 386.135 0 0 0 0 0 0 0 0 0 0 0 0 0 0 0 0 0 0 0 0.06 0 0 0 0 0 0 0 -1787.24 0 0 0 
14.42 0 0 0 0 0 0 0 747.78 0 0 0 0 0 0 0 0 0 852.458 1699.96 0 0 0 2070.76 0 -640.507 0 0 0 0 0 0 0 0 -1231.96 0 0 0 0 0 0 0 0 0 0 0 0 0 0 0.04 0 0 0 0 -1508.15 0 0 0 0 935.469 
0 0 0 1915.72 0 0 0 0 0 0 0 0 0 0 0 0 -1838.66 0 0 0 0 0 0 0 0 0 0 0 0 0 0 156.178 0 0 0 0 0 0 1124.38 0 0 0 0 1458.86 0 0 0 0 0 0 0.09 0 0 0 687.506 0 0 0 0 1304.13 
0 0 0 0 0 1234.09 0 0 0 0 0 0 0 0 0 -1474.12 0 0 0 0 0 0 0 0 0 0 0 0 0 463.195 0 0 0 1826.61 0 0 964.309 0 0 889.691 0 0 0 0 0 0 0 0 0 0 0 0.09 0 0 0 0 0 1692.33 0 0 
0 -1827.22 0 0 0 0 0 0 376.827 0 0 0 0 0 0 0 0 379.116 1912.06 0 0 1396.91 0 0 0 0 0 0 0 0 0 0 0 0 0 0 0 0 0 -924.94 0 0 0 0 0 0 0 0 0 0 0 0 0.06 0 0 0 0 1526 0 0 
0 0 0 0 2274.77 0 0 -1833.78 0 0 0 1631.9 0 0 0 0 0 0 0 0 -417.57 0 0 0 0 0 0 0 0 0 0 0 0 0 0 0 0 0 0 0 0 0 0 0 0 0 0 395.291 0 0 0 0 0 0.08 0 0 0 1893.75 0 0 
0 1735.66 0 0 0 0 -1474.12 0 0 0 0 0 0 0 0 0 0 0 0 0 0 0 0 0 -1056.63 0 0 0 0 0 0 0 0 0 -917.158 0 2274.62 0 0 0 0 0 0 0 0 0 0 0 0 -1115.68 2409.67 0 0 0 0.03 0 0 0 0 -694.372 
0 0 0 0 0 0 718.177 0 0 0 0 0 0 0 0 0 0 0 0 0 0 0 0 0 0 0 0 0 0 102.771 0 0 0 0 1776.25 0 -2170.86 0 0 0 0 0 0 0 0 0 0 0 0 0 0 0 0 0 0 0.05 0 0 0 0 
0 1944.72 0 0 0 0 0 0 0 -871.685 0 0 0 842.997 0 0 0 0 0 1752.6 0 0 0 1923.96 0 0 0 0 0 -358.516 0 0 0 0 0 0 0 0 0 0 0 0 0 0 0 0 0 0 -1829.66 0 0 0 0 0 0 0 0.05 0 1602.76 0 
-203.024 2016.74 0 0 0 0 0 0 0 249.413 0 0 0 0 0 0 0 0 0 0 0 0 0 0 2207.33 1534.7 0 0 0 0 0 0 0 0 0 0 0 0 0 0 0 0 0 0 0 0 0 0 0 0 0 1653.57 -1331.6 1997.36 0 0 0 0.01 0 0 
0 0 0 0 0 0 0 0 0 987.503 0 0 0 0 0 -1123.92 0 0 0 0 0 0 0 0 0 42.1918 0 0 829.417 0 -1302.15 0 0 0 0 0 0 0 0 0 0 0 -596.408 0 0 0 2094.71 0 0 0 0 0 0 0 0 0 1855.75 0 0.01 0 
1477.63 0 0 -1705.3 0 0 0 0 0 0 0 0 0 0 0 0 0 0 0 0 0 0 0 0 -1633.43 0 0 1667.76 0 0 0 0 0 0 0 0 0 0 1128.96 -1945.63 0 0 0 2403.71 0 0 0 0 0 -1457.34 2309.26 0 0 0 338.374 0 0 0 0 0.07 
