*Vertices 77
*Matrix 
0.06 0 0 0 0 0 0 0 0 862.377 0 0 0 0 0 0 0 0 0 -1119.19 1733.53 0 0 709.021 0 907.392 0 0 0 0 0 0 0 1715.22 0 0 0 -952.712 0 0 0 0 0 0 0 0 856.426 0 0 1462.07 0 0 0 0 1021.99 -1626.41 0 0 0 0 0 0 0 0 0 0 0 0 0 0 0 0 0 0 0 0 0 
0 0.02 0 1339.84 -2003.16 0 0 0 0 0 0 0 560.549 1279.11 0 0 0 0 0 0 0 0 -308.161 0 0 0 278.405 0 0 0 1444.52 0 -1380.12 0 0 0 0 0 0 0 0 0 2071.37 0 0 0 0 0 0 605.411 0 0 0 0 0 0 0 0 0 0 0 0 0 0 0 0 0 0 0 10.9104 0 0 0 0 0 0 0 
0 0 0.02 0 0 -555.971 0 0 1744.51 365.993 0 0 2334.44 906.323 -373.012 0 0 0 -2039.02 0 0 0 1189.23 957.289 0 843.15 0 0 0 -1451.54 0 1645.18 0 0 0 1022.29 -183.34 0 0 0 1123 0 0 0 0 -1700.57 1503.88 0 -1583.22 0 0 0 0 0 609.531 0 0 0 0 0 0 0 0 0 -1144.22 0 0 0 0 0 0 0 0 0 0 -673.772 0 
0 1313.29 0 0.08 827.281 0 0 0 0 0 0 0 0 952.254 0 0 0 0 0 0 0 0 0 -1383.63 25.7118 0 0 0 0 0 153.737 0 0 0 -118.183 0 0 1405 0 0 0 0 0 0 -1589.02 0 884.808 0 0 2433.77 0 -905.713 2172.69 0 0 0 0 -2005.91 0 1673.56 1690.5 0 0 -727.18 0 0 0 0 0 0 0 0 0 0 0 0 1320.92 
0 1884.75 0 1045.79 0.04 0 0 2009.87 0 -135.121 0 0 0 0 0 0 0 0 0 0 0 0 0 0 0 0 271.233 0 0 0 0 0 0 2497.25 0 0 0 0 0 -438.932 -1021.07 1550.72 -647.679 2254.94 0 0 -822.245 0 0 0 0 0 0 -1310.08 -1631.29 0 1278.19 -1187.7 0 -803.629 0 0 0 0 0 0 0 0 0 0 0 0 0 0 0 0 0 
0 0 2013.84 0 0 0.05 0 0 0 0 1508.61 0 0 0 0 1981.19 0 0 0 0 587.558 0 0 0 0 0 0 0 0 0 -874.584 0 0 0 0 0 0 0 574.74 0 0 848.491 0 0 0 0 0 0 0 1280.33 0 0 1799.3 0 0 0 0 0 0 0 532.472 0 0 878.094 0 0 1022.75 1868.11 -368.435 0 0 0 0 0 0 0 0 
0 0 0 0 0 0 0 227.287 0 0 1750.47 1873.45 0 0 0 0 0 -639.134 0 0 2272.64 0 0 0 -639.439 277.947 0 0 0 0 1863.54 0 1769.69 0 0 0 -1178.24 0 649.51 0 -373.623 0 -1132.31 0 1405.76 0 0 0 1757.18 0 0 0 0 0 0 0 0 0 0 0 0 0 1777.63 0 0 0 0 0 0 0 0 0 0 0 0 0 0 
0 0 0 0 -46.4644 0 622.806 0.04 -716.346 0 258.263 0 0 -1029.01 0 0 1382.11 0 0 -1217.15 0 0 0 0 0 0 0 0 0 1844.77 0 0 0 0 0 0 0 580.233 0 0 0 0 0 0 0 0 0 0 2371.36 1345.64 906.323 2486.57 0 0 0 -1437.35 0 0 -1038.62 0 0 0 0 -2247.31 0 0 0 0 0 2374.26 0 0 0 0 0 0 0 
0 0 2483.21 0 0 0 0 -2401.88 0.07 0 1026.87 -452.971 1084.55 2195.43 0 0 2459.11 0 0 0 0 0 0 0 -2464.9 0 0 0 720.618 0 0 0 0 0 0 2069.84 -2174.67 612.43 0 1705.91 -2345.73 0 0 0 0 861.309 0 -1287.5 0 1564.46 0 0 0 0 0 -734.809 -2064.65 0 0 0 0 0 0 0 0 0 0 0 0 0 0 0 146.565 0 0 0 0 
-1504.49 0 -1348.84 0 -692.846 0 0 0 0 0.09 0 -1262.17 0 0 0 0 0 1447.72 0 0 0 -1360.59 -123.066 0 0 -827.738 969.344 0 0 0 0 0 0 0 -1223.87 0 0 0 0 985.519 0 0 0 0 0 820.719 -1163.44 1314.2 0 1311.61 1940.44 0 0 0 1811.35 0 0 0 2223.81 -2231.59 0 1599.09 0 0 0 0 0 0 0 0 0 0 0 0 0 -2139.73 0 
0 0 0 0 0 -303.125 2169.64 -1381.34 -545.442 0 0 0 1696.91 0 0 0 1701.64 0 0 452.208 0 0 0 0 0 0 0 0 0 0 0 0 0 0 0 2041.46 0 0 -556.429 -2427.82 0 888.775 0 0 0 0 950.27 0 0 0 0 1435.36 0 0 0 0 0 0 0 0 0 -2454.99 0 0 0 0 0 0 -1627.32 0 0 0 0 0 0 0 0 
0 0 0 0 0 0 2251.12 0 -1572.24 85.3755 0 0.04 -511.567 2266.69 -753.731 -945.387 0 0 0 0 0 2204.43 323.267 0 -112.842 0 0 0 0 0 0 0 0 -2125.39 0 1262.02 0 1673.41 1197.16 0 0 1888.87 -277.947 0 0 0 0 0 0 0 0 0 0 0 0 0 0 0 0 0 0 0 0 0 0 2431.33 0 0 0 2302.85 0 26.9326 0 0 0 0 0 
0 -511.109 370.876 0 0 0 0 0 1833.02 0 1794.11 -480.895 0.09 1237.75 624.18 -1994 0 0 0 143.056 845.592 309.839 0 85.2229 0 409.94 0 0 0 0 0 0 0 -634.556 0 0 1358.91 0 0 1279.87 0 293.359 0 0 0 0 0 0 -1148.03 0 140.461 0 1889.17 0 0 0 0 0 -634.098 0 0 0 0 0 0 -302.362 0 0 0 -1098.74 0 0 -1701.94 0 0 0 0 
0 2310.33 1631.14 -2015.37 0 0 0 -326.167 304.498 0 0 2138.51 1480.07 0.06 0 0 0 -462.889 0 0 -46.4644 0 0 0 1419.34 0 0 0 0 0 0 0 0 0 0 -538.881 -462.889 -801.798 0 0 0 0 -646.153 0 0 0 0 0 0 0 0 2305.44 0 1659.06 0 0 0 0 0 0 1713.54 0 0 0 0 0 0 0 0 0 -2151.63 0 0 0 -2375.79 0 -540.101 
0 0 -511.872 0 0 0 0 0 0 0 0 2259.21 1866.59 0 0.06 0 0 0 0 0 0 0 0 0 500.58 -1331.75 0 0 -1270.87 0 0 0 0 1781.29 0 0 0 -654.393 0 -1538.06 -418.943 0 636.692 0 0 1127.58 0 697.424 0 0 0 346.309 0 0 0 0 0 0 785.928 0 0 0 0 0 0 1999.19 -579.47 0 0 0 0 154.195 0 0 0 0 0 
0 0 0 0 0 -1938.61 0 0 0 0 0 2485.35 446.409 0 0 0.08 0 0 0 0 411.618 1164.05 0 -636.54 0 0 0 993.454 0 0 0 0 683.538 0 0 0 0 -497.833 0 0 0 0 0 0 0 0 0 -1265.98 0 2228.08 0 0 0 0 0 0 0 0 0 0 0 0 -1839.73 0 0 0 0 0 0 0 0 0 0 0 0 0 -1260.95 
0 0 0 0 0 0 0 1149.1 1957.38 0 -616.55 0 0 0 0 0 0.03 0 0 0 235.527 0 -1603.98 2299.65 0 0 0 0 0 1799.6 0 0 0 0 0 0 2148.43 0 0 2311.85 482.116 0 268.029 0 0 0 0 0 0 0 0 392.239 0 0 0 0 0 510.956 1813.33 0 0 0 0 0 0 0 0 0 0 0 0 0 0 0 0 0 0 
0 0 0 0 0 0 1734.6 0 0 1816.23 0 0 0 2084.49 0 0 0 0.08 0 1132.31 0 984.451 -981.399 0 0 0 0 837.504 0 168.386 -738.014 0 0 0 0 0 0 0 0 1515.32 0 0 0 0 0 0 0 -2476.5 0 0 0 0 -456.023 0 0 0 0 1794.26 0 0 0 0 -1918.01 0 2100.82 0 0 0 0 0 0 -466.704 0 0 0 0 0 
0 0 1428.04 0 0 0 0 0 0 0 0 0 0 0 0 0 0 0 0.09 0 0 0 1848.73 1481.29 0 0 0 0 0 0 0 851.085 -1142.69 0 0 0 0 0 582.369 639.744 -600.375 0 0 1608.25 -248.497 -42.9548 2080.83 0 0 0 0 0 0 0 0 0 0 0 0 0 0 476.928 0 0 1916.18 0 0 0 0 0 0 0 0 -598.697 0 0 0 
-531.251 0 0 0 0 0 0 -1878.49 0 0 1102.4 0 1407.28 0 0 0 0 1475.8 0 0.05 0 0 0 0 0 0 0 0 560.396 0 0 0 1244.93 1605.04 -526.521 0 -2473.14 0 1538.36 0 0 -1483.28 0 0 1240.04 2111.8 0 0 0 0 -189.138 -768.532 0 0 0 0 0 0 0 0 0 0 0 0 0 0 0 0 0 0 0 0 0 0 0 0 0 
-960.341 0 0 0 0 -70.4215 -1213.49 0 0 0 0 0 2013.69 1895.73 0 -1659.06 -2404.02 0 0 0 0.06 -22.5074 0 0 1884.75 446.867 0 0 0 0 2088 -2127.37 0 0 0 2116.53 0 0 0 0 2397.76 0 0 0 0 334.101 -1071.58 0 1670.05 0 0 0 0 0 0 0 2003.31 2129.96 0 604.343 0 0 0 0 0 0 0 0 0 -2281.03 0 0 0 0 0 0 0 
0 0 0 0 0 0 0 0 0 592.288 0 1699.19 1952.04 0 0 2478.79 0 215.384 0 0 -1457.18 0.01 0 0 0 0 0 0 0 0 0 0 0 978.195 0 -1470.31 0 1379.67 0 0 -800.119 0 0 0 0 0 0 0 0 0 -1765.57 0 1453.06 0 0 0 0 0 0 0 1191.67 0 0 0 0 0 453.734 0 0 0 0 0 0 101.398 0 0 0 
0 371.334 1827.07 0 0 0 0 0 0 -1667.3 0 998.947 0 0 0 0 -2429.96 -771.584 1697.97 0 0 0 0.07 0 1506.32 -725.044 -510.651 0 0 0 0 0 -816.752 0 0 0 0 103.992 1310.69 -2196.65 0 0 1912.82 0 -783.029 0 0 0 0 0 1884.9 0 0 0 0 0 0 0 1725.44 0 0 0 0 0 0 0 0 0 0 0 0 0 0 0 0 0 0 
440.916 0 1750.31 -1191.67 0 0 0 0 0 0 0 0 708.563 0 0 -627.384 1839.73 0 61.8763 0 0 0 0 0.08 0 0 0 -1481.9 0 0 -2316.58 0 0 0 0 2486.27 0 0 0 0 -147.023 0 0 0 0 0 0 1167.56 0 0 0 0 0 0 0 0 0 0 0 0 0 0 0 0 0 0 0 0 0 354.091 -1738.26 0 0 0 0 0 0 
0 0 0 -331.66 0 0 -1790.9 0 -2115.47 0 0 -1130.79 0 2332.91 958.968 0 0 0 0 0 2356.11 0 1448.79 0 0.09 0 0 0 0 0 0 0 -1380.28 0 0 -1213.03 0 0 0 1926.56 0 0 0 0 0 872.753 1898.18 -66.6066 0 0 -147.786 0 0 2460.02 0 0 0 0 -1447.87 0 592.441 693.915 0 0 0 0 0 0 0 0 0 0 0 -576.724 0 0 0 
-850.932 0 228.355 0 0 0 366.451 0 0 -836.589 0 0 1363.19 0 2383.72 0 0 0 0 0 -1159.78 0 2297.66 0 0 0.01 0 0 2431.79 0 -2465.21 0 0 0 0 0 -2237.69 0 0 1045.34 0 -1800.67 0 0 0 0 0 0 0 245.75 0 -1226.16 0 0 0 0 0 0 0 0 0 0 0 0 0 0 0 0 0 0 0 0 628.147 1266.14 0 0 2212.06 
0 628.147 0 0 1713.08 0 0 0 0 -422.605 0 0 0 0 0 0 0 0 0 0 0 0 2060.84 0 0 0 0.09 -1282.31 -1679.2 0 0 0 -1015.88 2292.32 0 0 -2370.6 0 0 0 755.104 1800.52 276.116 0 -316.553 0 2409.97 0 0 0 0 0 0 0 0 0 0 0 0 0 0 0 0 0 0 0 0 0 0 0 0 0 0 0 0 0 0 
0 0 0 0 0 0 0 0 0 0 0 0 0 0 0 -1788.61 0 1852.24 0 0 0 0 0 2161.09 0 0 -1856.36 0.09 0 1158.1 1769.23 0 -2291.41 919.904 0 0 -1107.14 0 0 1743.75 0 0 0 0 0 0 -2299.34 1857.28 0 0 0 0 0 0 0 0 0 0 0 0 0 0 0 0 0 1623.66 0 0 -545.9 0 0 1276.36 0 0 0 0 0 
0 0 0 0 0 0 0 0 -1129.11 0 0 0 0 0 1412.32 0 0 0 0 832.621 0 0 0 0 0 360.347 -221.183 0 0.07 1405.91 0 -612.278 2007.43 0 0 0 1314.51 -1275.75 0 0 0 0 729.926 0 137.867 0 0 0 0 0 0 0 0 0 0 2453.92 0 0 0 0 0 -490.509 0 0 0 0 0 0 0 0 0 0 0 0 0 -11.5207 0 
0 0 -897.473 0 0 0 0 -557.802 0 0 0 0 0 0 0 0 272.149 2391.2 0 0 0 0 0 0 0 0 0 2006.82 2003.01 0.01 360.958 -883.282 -122.15 0 0 0 -95.9044 0 0 -1496.4 -703.681 0 -879.315 1546.91 0 -1294.21 1656.32 0 0 0 0 1773.96 148.091 0 0 0 0 -2420.5 0 0 0 0 0 -2498.93 0 2234.49 0 0 0 0 0 0 0 0 0 0 0 
0 -279.931 0 -2073.96 0 1968.83 2158.04 0 0 0 0 0 0 0 0 0 0 -791.421 0 0 -1462.07 0 0 -680.792 0 1715.83 0 2453 0 1682.41 0.06 0 0 0 0 -20.5237 0 0 0 0 0 0 0 0 0 0 0 0 0 0 0 0 0 665.838 0 0 0 0 0 0 0 0 -1261.71 0 0 1286.13 0 0 0 0 0 0 361.721 0 0 0 0 
0 0 338.527 0 0 0 0 0 0 0 0 0 0 0 0 0 0 0 1831.49 0 2168.57 0 0 0 0 0 0 0 -251.701 396.97 0 0.08 1715.22 0 -1797.01 1183.74 -1755.35 56.3829 633.488 0 0 728.095 867.718 0 0 0 0 0 0 0 0 216.3 0 0 0 0 0 -1522.19 0 0 0 0 0 0 960.341 0 -141.224 218.894 0 0 0 0 0 0 1522.8 0 -1157.95 
0 330.287 0 0 0 0 -1695.23 0 0 0 0 0 0 0 0 647.679 0 0 -142.445 -579.928 0 0 -254.906 0 2185.35 0 -1757.94 1879.56 448.851 2237.39 0 134.968 0.04 2481.08 0 0 0 0 0 0 0 0 0 0 0 0 802.713 0 0 0 1311.76 2127.83 0 0 -2028.64 -411.008 0 0 1061.66 0 0 0 1711.25 0 0 0 0 0 0 0 0 0 0 0 0 0 0 
685.675 0 0 0 -549.562 0 0 0 0 0 0 756.325 1982.56 0 879.315 0 0 0 0 -683.538 0 -519.044 0 0 0 0 -339.442 -1686.53 0 0 0 0 1690.5 0 0 624.638 -28.6111 0 0 0 0 833.842 0 0 0 0 0 1016.34 1446.5 0 0 -513.855 -844.981 0 1365.93 1148.49 0 -1227.68 0 0 0 0 0 0 0 -2375.79 0 0 0 1465.27 0 0 0 326.319 0 0 -1211.66 
0 0 0 2309.56 0 0 0 0 0 -515.839 0 0 0 0 0 0 0 0 0 1037.86 0 0 0 0 0 0 0 0 0 0 0 1809.82 0 0 0.02 526.063 0 0 0 0 0 0 0 -573.672 0 0 0 0 0 0 2373.81 0 0 0 0 0 -119.861 0 0 0 -1399.04 0 0 0 0 0 0 0 0 0 0 0 0 0 0 -207.144 0 
0 0 1666.23 0 0 0 0 0 2193.59 0 -1160.7 -2107.23 0 -780.892 0 0 0 0 0 0 -611.362 -1431.85 0 964.003 920.057 0 0 0 0 0 -1603.52 2056.57 0 2073.5 844.981 0.06 0 0 0 0 0 0 0 0 0 0 0 0 0 0 0 0 0 0 0 0 0 0 0 0 0 0 0 0 0 0 0 0 0 0 0 0 0 0 0 0 0 
0 0 1221.43 0 0 0 6.79037 0 948.134 0 0 0 2445.22 1796.24 0 0 992.538 0 0 -427.488 0 0 0 0 0 -910.901 1557.28 -1933.73 1834.24 1911.45 0 -2289.73 0 -2440.79 0 0 0.06 -1609.78 0 -403.073 0 0 2428.59 0 0 0 0 0 1141.62 0 0 0 362.178 0 0 0 0 0 0 0 771.889 0 0 -662.175 1427.12 0 0 0 2125.08 0 0 0 0 0 395.749 0 0 
1435.97 0 0 -208.518 0 0 0 763.649 -1847.51 0 0 -129.475 0 1729.71 1254.23 -533.845 0 0 0 0 0 -1707.59 410.55 0 0 0 0 0 -89.8007 0 0 2476.96 0 0 0 0 1925.79 0 0 0 0 0 0 0 2193.14 2412.26 0 0 0 0 0 -1053.42 -2088.76 0 0 1515.17 0 0 0 0 0 0 0 0 0 0 0 0 -798.593 0 0 0 0 0 0 0 0 
0 0 0 0 0 -2213.43 50.2792 0 0 0 2012.47 1637.85 0 0 0 0 0 0 -972.243 2154.23 0 0 -30.7474 0 0 0 0 0 0 0 0 1497.47 0 0 0 0 0 0 0.03 -2408.75 0 0 0 0 -1358.3 0 0 0 0 0 0 1637.09 1655.71 0 0 0 2453 -1914.81 0 0 0 0 0 0 0 0 0 0 1562.32 -22.9652 0 0 0 0 0 0 0 
0 0 0 0 -2390.59 0 0 0 1660.28 -587.558 -1159.47 0 -650.121 0 1703.16 0 -557.955 1328.85 1204.79 0 0 0 36.8511 0 1733.22 1294.98 0 -23.1178 0 1469.54 0 0 0 0 0 0 726.112 0 -2225.79 0.09 1152.46 0 0 0 0 0 2209.92 0 564.821 0 0 0 0 0 0 0 0 0 0 0 0 0 0 0 0 0 0 -273.98 0 0 0 0 0 0 0 0 0 
0 0 957.747 0 -1807.54 0 -170.675 0 691.168 0 0 0 0 0 750.374 0 -649.51 0 -793.863 0 -943.861 1563.08 0 -1215.17 0 0 1250.72 0 0 2327.27 0 0 0 0 0 0 0 0 0 -788.369 0.07 0 -1101.79 0 1818.22 0 1735.97 -1781.29 0 0 0 0 0 -1187.86 0 0 1341.82 0 0 0 0 551.546 0 0 0 0 -965.529 0 0 0 0 0 0 0 0 -998.184 0 
0 0 0 0 -1677.22 1605.35 0 0 0 0 804.697 1155.81 -37.7667 0 0 0 0 0 0 1279.56 0 0 0 0 0 -1978.13 2391.81 0 0 0 0 262.383 0 -430.387 0 0 0 0 0 0 0 0.08 0 0 0 0 272.607 -192.038 0 0 0 0 0 370.876 0 0 0 0 0 0 0 0 0 0 0 0 0 0 0 0 0 0 0 0 0 0 2073.81 
0 -1788.16 0 0 -594.882 0 -151.448 0 0 0 0 1387.91 0 -398.801 -932.417 0 2286.52 0 0 0 0 0 -1192.13 0 0 0 639.592 0 1105.91 817.667 0 946.303 0 0 0 0 680.181 0 0 0 1567.81 0 0.06 0 0 0 2210.53 1568.88 0 -381.1 1273.92 0 1788 0 0 0 1742.68 0 0 0 0 0 0 0 0 0 0 0 0 0 -1734.29 0 0 0 0 0 0 
0 0 0 0 -338.832 0 0 0 0 0 0 0 0 0 0 0 0 0 618.534 0 0 0 0 0 0 0 0 0 0 -517.06 0 0 0 0 2447.2 0 0 0 0 0 0 0 0 0.06 0 0 168.538 0 1976.45 724.128 0 -978.652 0 0 0 0 0 0 0 0 0 0 0 0 -1237.3 0 0 0 0 0 2012.62 0 0 0 0 0 0 
0 0 0 -1440.55 0 0 1383.79 0 0 0 0 0 0 0 0 0 0 0 664.769 424.741 0 0 1139.48 0 0 0 1863.08 0 -943.403 0 0 0 0 0 0 0 0 40.3607 1089.74 0 102.618 0 0 0 0.03 0 0 0 0 0 0 0 -1961.04 0 1831.03 0 0 0 0 0 0 0 -457.549 0 0 0 0 0 0 0 0 0 0 0 0 0 0 
0 0 -1619.24 0 0 0 0 0 2152.09 275.048 0 0 0 0 2157.43 0 0 0 1856.36 1933.12 -1785.56 0 0 0 -550.478 0 0 0 0 369.35 0 0 0 0 0 0 0 -54.857 0 0 0 0 0 0 0 0.04 0 0 0 0 0 1134.45 -2350.92 0 0 0 0 0 0 0 0 1165.88 0 0 0 0 0 -1103.32 0 0 0 0 0 0 0 0 0 
82.3237 0 351.955 1273.92 1116.6 0 0 0 0 2033.68 -40.5133 0 0 0 0 0 0 0 -435.728 0 -1405.45 0 0 0 470.214 0 -2360.99 109.638 0 1943.49 0 0 53.9415 0 0 0 0 0 0 -468.23 1368.68 -1578.65 1401.49 1716.44 0 0 0 0 0 0 942.64 0 0 0 0 0 0 0 0 0 0 0 0 0 1089.28 0 0 0 0 0 1299.4 0 0 0 1248.44 0 0 
0 0 0 0 0 0 0 0 1699.04 1480.38 0 0 0 0 147.023 -2232.35 0 -2324.21 0 0 0 0 0 770.211 949.049 0 0 955.611 0 0 0 0 0 1874.83 0 0 0 0 0 0 886.334 2214.96 1663.34 0 0 0 0 0.08 0 -150.38 0 0 0 0 0 0 0 0 0 0 0 0 -114.826 0 0 0 0 0 0 0 0 0 434.965 0 0 0 0 
0 0 2329.25 0 0 0 1339.08 2216.94 0 0 0 0 -306.482 0 0 0 0 0 0 0 2319.03 0 0 0 0 0 0 0 0 0 0 0 0 2344.2 0 0 -567.11 0 0 -649.358 0 0 0 -1462.83 0 0 0 0 0.08 0 0 1926.71 0 0 0 0 0 0 0 0 0 0 0 0 0 0 207.602 0 953.627 0 182.577 -1520.05 0 0 0 0 0 
1390.8 -394.375 0 681.555 0 1297.27 0 946.303 -282.22 -2389.98 0 0 0 0 0 2053.51 0 0 0 0 0 0 0 0 0 854.595 0 0 0 0 0 0 0 0 0 0 0 0 0 0 0 0 -579.47 272.301 0 0 0 477.386 0 0.09 0 0 0 0 0 0 0 0 0 0 108.57 0 0 0 0 1482.21 316.248 1332.97 0 0 0 0 -1162.98 0 0 0 0 
0 0 0 0 0 0 0 1620.3 0 107.196 0 0 1757.79 0 0 0 0 0 0 -668.737 0 1565.52 860.24 0 1304.13 0 0 0 0 0 0 0 -540.406 0 938.063 0 0 0 0 0 0 0 222.098 0 0 0 2006.52 0 0 0 0.09 0 -1717.51 0 0 0 0 -839.946 0 0 0 0 0 0 0 0 0 0 0 0 0 0 0 0 0 0 0 
0 0 0 463.347 0 0 0 -1294.82 0 0 1629 0 0 -727.943 -179.22 0 247.581 0 0 -650.578 0 0 0 0 0 666.601 0 0 0 1349.6 0 133.9 -656.072 -586.184 0 0 0 1362.73 107.654 0 0 0 0 744.423 0 754.646 0 0 1359.83 0 0 0.05 0 0 0 0 0 0 0 0 0 0 0 0 0 0 -908.917 0 0 0 0 0 0 0 0 0 2036.27 
0 0 0 -1782.36 0 235.527 0 0 0 0 0 0 187.613 0 0 0 0 912.732 0 0 0 326.014 0 0 0 0 0 0 0 6.48518 0 0 0 -131.611 0 0 1724.83 868.175 1162.83 0 0 0 9.84222 0 880.84 442.747 0 0 0 0 2162.62 0 0 0 0 0 0 0 0 -465.026 0 0 0 0 0 0 0 0 0 0 0 0 0 0 0 0 0 
0 0 0 0 2023.91 0 0 0 0 0 0 0 0 265.435 0 0 0 0 0 0 0 0 0 0 -482.574 0 0 0 0 0 2211.29 0 0 0 0 0 0 0 0 0 -1854.99 -724.586 0 0 0 0 0 0 0 0 0 0 0 0.09 0 0 0 0 0 0 0 0 0 0 0 0 0 0 0 0 0 0 0 0 0 0 0 
-908.155 0 283.746 0 -959.12 0 0 0 0 1790.14 0 0 0 0 0 0 0 0 0 0 0 0 0 0 0 0 0 0 0 0 0 0 2069.99 2460.63 0 0 0 0 0 0 0 0 0 0 -1577.88 0 0 0 0 0 0 0 0 0 0 0 0 0 0 0 0 0 0 0 0 0 0 935.926 0 0 0 0 -2341 0 0 0 1189.38 
-2437.74 0 0 0 0 0 0 2067.55 -198.447 0 0 0 0 0 0 0 0 0 0 0 0 0 0 0 0 0 0 0 295.801 0 0 0 -1348.08 1994.61 0 0 0 2140.03 0 0 0 0 0 0 0 0 0 0 0 0 0 0 0 0 0 0.02 0 0 0 0 0 0 0 0 0 0 0 396.817 -931.349 0 0 0 0 -331.355 885.266 0 0 
0 0 0 0 2156.67 0 0 0 44.6333 0 0 0 0 0 0 0 0 0 0 0 -223.014 0 0 0 0 0 0 0 0 0 0 0 0 0 -85.6807 0 0 0 1527.38 0 -1619.69 0 997.116 0 0 0 0 0 0 0 0 0 0 0 0 0 0 0 -969.802 0 0 0 0 0 0 0 2162.62 0 0 188.986 0 0 0 0 0 -358.821 0 
0 0 0 1842.17 -314.417 0 0 0 0 0 0 0 0 0 0 0 2081.9 1796.85 0 0 2127.37 0 0 0 0 0 0 0 0 1656.93 0 -1292.99 0 2213.89 0 0 0 0 -1877.27 0 0 0 0 0 0 0 0 0 0 0 205.771 0 0 0 0 0 0 0.09 0 0 0 0 0 0 0 0 -919.141 0 0 2312.31 0 0 0 -1445.13 1345.18 0 0 
0 0 0 0 0 0 0 2160.18 0 -2437.13 0 0 1989.73 0 1898.48 0 1784.19 0 0 0 0 0 1417.81 0 -2021.16 0 0 0 0 0 0 0 -1420.56 0 0 0 0 0 0 0 0 0 0 0 0 0 0 0 0 0 0 0 0 0 0 0 -303.583 0 0.02 0 -439.695 0 0 0 0 0 1113.7 0 0 0 0 0 0 0 0 0 0 
0 0 0 -1669.29 -77.7459 0 0 0 0 -517.518 0 0 0 0 0 0 0 0 0 0 1456.11 0 0 0 0 0 0 0 0 0 0 0 0 0 0 0 0 0 0 0 0 0 0 0 0 0 0 0 0 0 0 0 1756.57 0 0 0 0 0 0 0.07 0 0 0 0 832.316 288.018 0 0 0 0 0 0 0 0 0 0 0 
0 0 0 1791.06 0 1787.24 0 0 0 0 0 0 0 2274.47 0 0 0 0 0 0 0 270.623 0 0 1621.37 0 0 0 0 0 0 0 0 0 -1994.16 0 -611.667 0 0 0 0 0 0 0 0 0 0 0 0 1790.14 0 0 0 0 0 0 0 0 201.804 0 0.04 0 0 0 0 -540.559 0 0 0 1169.7 0 1978.9 0 0 0 1979.05 0 
0 0 0 0 0 0 0 0 0 -456.328 -408.261 0 0 0 0 0 0 0 -1079.21 0 0 0 0 0 835.063 0 0 0 1481.44 0 0 0 0 0 0 0 0 0 0 0 675.604 0 0 0 0 -339.9 0 0 0 0 0 0 0 0 0 0 0 0 0 0 0 0.01 0 575.045 0 0 0 0 0 0 2379.3 0 0 0 0 0 0 
0 0 0 0 0 0 -498.596 0 0 0 0 0 0 0 0 1804.48 0 1774.58 0 0 0 0 0 0 0 0 0 0 0 0 155.873 0 -2075.49 0 0 0 0 0 0 0 0 0 0 0 2030.47 0 0 869.549 0 0 0 0 0 0 0 0 0 0 0 0 0 0 0.06 0 0 0 0 0 725.349 0 0 0 0 -631.962 0 -1199.45 0 
0 0 0 -596.713 0 1038.47 0 -785.318 0 0 0 0 0 0 0 0 0 0 0 0 0 0 0 0 0 0 0 0 0 2006.82 0 0 0 0 0 0 1629 0 0 0 0 0 0 0 0 0 0 0 0 0 0 0 0 0 0 0 0 0 0 0 0 908.307 0 0.08 0 0 2341.61 0 0 0 0 0 0 -2304.07 0 2463.07 0 
0 0 -1534.09 0 0 0 0 0 0 0 0 0 0 0 0 0 0 1059.98 1856.67 0 0 0 0 0 0 0 0 0 0 0 0 2138.05 0 0 0 0 2487.64 0 0 0 0 0 0 -901.746 0 0 -579.775 0 0 0 0 0 0 0 0 0 0 0 0 347.682 0 0 0 0 0.01 0 0 0 0 0 0 808.359 0 0 0 0 0 
0 0 0 0 0 0 0 0 0 0 0 591.372 2281.33 0 -2219.69 0 0 0 0 0 0 0 0 0 0 0 0 -1026.72 0 -113.3 -1879.86 0 0 889.538 0 0 0 0 0 0 0 0 0 0 0 0 0 0 0 -1470 0 0 0 0 0 0 0 0 0 843.608 632.572 0 0 0 0 0.05 0 0 1908.25 0 0 2433.01 -300.531 0 0 1095.69 -1033.59 
0 0 0 0 0 -1338.16 0 0 0 0 0 0 0 0 -474.334 0 0 0 0 0 0 -196.921 0 0 0 0 0 0 0 0 0 -2254.48 0 0 0 0 0 0 0 0 2344.2 0 0 0 0 0 0 0 -359.737 1940.9 0 525.605 0 0 0 0 1103.32 951.796 -1343.2 0 0 0 0 582.217 0 0 0.03 0 -487.152 0 866.802 0 0 0 0 0 0 
0 0 0 0 0 1237.6 0 0 0 0 0 0 0 0 0 0 0 0 0 0 0 0 0 0 0 0 0 0 0 0 0 98.4985 0 0 0 0 0 0 0 1261.1 0 0 0 0 0 1953.72 0 0 0 -1780.07 0 0 0 0 748.39 -870.464 0 0 0 0 0 0 0 0 0 0 0 0.01 0 -707.038 0 0 0 -1676.15 0 0 0 
0 0 0 0 0 485.168 0 0 0 0 -1716.59 0 0 0 0 0 0 0 0 0 0 0 0 0 0 0 0 1338.77 0 0 0 0 0 0 0 0 -330.439 783.639 -386.593 0 0 0 0 0 0 0 0 0 270.775 0 0 0 0 0 0 -1820.81 0 0 0 0 0 0 1289.03 0 0 1637.09 -1098.13 0 0.04 0 1926.25 0 0 -1504.03 0 0 0 
0 1885.51 0 0 0 0 0 814.92 0 0 0 1573.76 1634.8 0 0 0 0 0 0 0 811.258 0 0 -134.816 0 0 0 0 0 0 0 0 0 -1460.69 0 0 0 0 -2157.12 0 0 0 0 0 0 0 0 0 0 0 0 0 0 0 0 0 -814.005 -1463.29 0 0 -560.396 0 0 0 0 0 0 1089.28 0 0.08 2475.89 0 0 0 0 -1962.87 0 
0 0 0 0 0 0 0 0 0 0 0 0 0 2335.96 0 0 0 0 0 0 0 0 0 2060.84 0 0 0 0 0 0 0 0 0 0 0 0 0 0 0 0 0 0 -116.657 1508.15 0 0 -630.589 0 -2476.04 0 0 0 0 0 0 0 0 0 0 0 0 2393.8 0 0 0 0 -2410.43 0 1530.27 -2315.67 0.07 0 0 0 0 684.759 0 
0 0 0 0 0 0 0 0 0 0 0 -1533.63 0 0 2235.71 0 0 1596.04 0 0 0 0 0 0 0 0 0 -2130.88 0 0 0 0 0 0 0 0 0 0 0 0 0 0 0 0 0 0 0 0 -1958.45 0 0 0 0 0 0 0 0 0 0 0 -1345.64 0 0 0 2163.84 1830.12 0 0 0 0 0 0.07 0 1842.33 0 0 -1123.46 
0 0 0 0 0 0 0 0 1105.46 0 0 0 1942.73 0 0 0 0 0 0 0 0 0 0 0 0 389.34 0 0 0 0 1097.98 0 0 0 0 0 0 0 0 0 0 0 0 0 0 0 0 824.839 0 1280.02 0 0 0 0 -451.445 0 0 0 0 0 0 0 0 0 0 -2484.74 0 0 0 0 0 0 0.05 0 2352.9 0 1741.92 
0 0 0 0 0 0 0 0 0 0 0 0 0 0 0 0 0 0 632.725 0 0 1838.05 0 0 2405.55 -2020.1 0 0 0 0 0 0 0 -567.721 0 0 0 0 0 0 0 0 0 0 0 0 0 0 0 0 0 0 0 0 0 2117.3 0 904.645 0 0 0 0 -212.18 -2379.15 0 0 0 1702.86 -51.0422 0 0 1234.7 0 0.05 0 0 0 
0 0 0 0 0 0 0 0 0 0 0 0 0 517.823 0 0 0 0 0 0 0 0 0 0 0 0 0 0 0 0 0 1901.38 0 0 0 0 25.4067 0 0 0 0 0 0 0 0 0 -1503.11 0 0 0 0 0 0 0 0 122.608 0 1968.98 0 0 0 0 0 0 0 0 0 0 0 0 0 0 -365.535 0 0.07 0 0 
0 0 -1460.54 0 0 0 0 0 0 143.361 0 0 0 0 0 0 0 0 0 0 0 0 0 0 0 0 0 0 2131.49 0 0 0 0 0 -2187.34 0 0 0 0 0 -1036.18 0 0 0 0 0 0 0 0 0 0 0 0 0 0 0 -631.962 0 0 0 1992.32 0 1618.17 -787.454 0 -1046.56 0 0 0 2127.67 1806.31 0 0 0 0 0 0 
0 0 0 -1040.6 0 0 0 0 0 0 0 0 0 1897.11 0 -1749.85 0 0 0 0 0 0 0 0 0 1766.49 0 0 0 0 0 26.78 0 1724.07 0 0 0 0 0 0 0 1107.14 0 0 0 0 0 0 0 0 0 849.254 0 0 -2048.33 0 0 0 0 0 0 0 0 0 0 511.109 0 0 0 0 0 1213.49 1633.12 0 0 0 0.05 
