*Vertices 66
*Matrix 
0.05 2191.92 0 0 0 0 0 0 0 0 0 0 0 0 0 0 0 0 0 0 0 0 0 0 0 0 0 0 0 0 0 0 0 0 0 0 0 0 0 0 0 0 0 0 0 2013.08 -631.047 1962.87 0 0 0 0 0 0 0 0 0 0 0 0 0 0 0 0 0 0 
-486.847 0.04 264.214 0 0 0 0 0 0 0 0 0 0 -1689.28 0 0 0 0 0 0 0 0 0 0 0 0 0 0 526.673 0 0 0 0 0 0 317.774 0 0 716.041 0 0 0 0 872.906 0 0 0 1728.19 0 0 0 0 0 0 0 -2025.28 0 0 0 0 0 0 0 0 0 0 
0 174.795 0.01 0 0 0 0 0 0 0 0 -77.7459 0 0 0 0 1944.26 0 0 0 0 0 0 0 0 0 0 0 0 0 1242.79 0 0 0 1367.15 0 577.792 0 0 0 0 0 0 0 0 0 0 0 0 637.15 -1480.22 0 -1403.93 0 0 0 0 0 0 0 0 0 0 0 0 0 
0 0 0 0.04 0 0 0 0 0 0 0 0 1511.2 0 0 0 0 0 0 0 0 0 0 0 0 0 0 0 0 0 0 0 0 0 829.875 0 0 0 0 0 0 545.137 0 0 0 0 861.003 0 0 0 0 0 0 0 0 0 0 0 0 0 0 0 0 0 0 0 
0 0 0 0 0.07 0 0 0 0 0 0 261.467 0 0 0 1658.15 -1127.74 0 526.673 0 0 133.747 -1782.97 0 0 0 0 0 0 0 0 872.906 0 0 1777.78 0 0 0 0 0 0 0 0 0 0 0 0 -86.1385 -778.451 0 0 0 0 0 0 0 0 0 0 0 0 0 0 0 0 0 
0 0 0 0 0 0 0 0 0 0 0 0 0 0 0 0 0 0 0 0 0 0 0 0 -2266.08 -1208.3 2288.35 -1833.02 0 0 0 1580.94 0 1369.29 0 0 0 0 0 1957.84 0 0 0 0 0 0 0 -33.4941 0 0 0 0 1018.17 0 0 0 0 0 0 0 0 0 0 0 0 0 
0 0 0 0 0 0 0.09 0 0 0 913.343 0 875.347 -1932.36 0 971.786 0 0 0 0 0 0 0 0 0 0 626.469 435.423 0 0 0 0 0 0 0 0 0 0 0 0 0 0 0 0 0 0 495.697 0 0 0 0 0 0 0 0 0 0 0 0 0 0 0 0 2085.25 0 0 
0 0 0 0 0 0 0 0.04 0 0 0 0 0 0 0 0 0 0 0 0 0 0 0 0 0 1533.63 0 0 0 0 0 0 1404.69 0 0 0 0 0 0 995.438 0 0 0 0 2461.85 0 0 0 1065.32 0 0 634.251 0 0 0 0 0 0 0 0 0 0 0 0 0 0 
0 0 0 0 0 0 0 0 0 0 0 0 -1022.6 0 0 0 -454.955 0 0 0 0 0 0 0 0 0 0 0 0 0 0 0 0 0 1014.82 1207.85 0 0 322.962 0 0 0 527.436 -1295.13 583.438 0 2119.89 920.82 0 0 0 0 0 0 0 0 0 0 0 0 0 0 0 0 0 0 
0 0 0 0 0 0 0 0 0 0.05 0 0 0 0 1300.78 0 2480.47 0 0 0 0 0 1638.92 0 0 1979.05 -404.141 -445.647 0 0 0 0 0 0 -174.032 0 0 0 0 0 0 0 0 0 0 0 0 0 0 0 0 1823.4 0 0 0 0 0 0 0 0 0 0 0 0 0 0 
0 0 0 0 0 0 -660.039 0 0 0 0.04 0 0 0 0 0 0 0 0 0 1771.68 0 0 0 1825.54 0 0 0 0 0 0 0 0 0 2422.48 -167.165 0 0 0 0 0 0 912.58 0 0 0 0 1808.15 0 0 0 0 0 0 0 0 0 0 0 0 0 0 0 0 0 0 
0 0 1836.07 0 1357.84 0 0 0 0 0 0 0.06 0 1903.36 0 0 -2396.69 1549.81 0 1080.43 0 0 0 0 0 0 0 0 0 -221.335 0 0 0 1262.93 0 0 0 0 -2284.54 0 0 0 0 0 0 2404.63 0 0 784.097 0 -447.783 0 0 0 0 0 0 0 0 0 0 0 0 0 0 0 
0 0 0 1723 0 0 1942.58 0 -1118.27 0 0 0 0.09 1633.73 0 0 0 0 0 0 0 0 0 0 0 0 0 2472.53 0 0 0 2262.41 0 0 0 0 0 0 794.931 0 0 1952.19 0 0 -1586.89 0 0 0 -1676.92 -1347.01 0 0 -2254.02 0 0 0 0 0 0 0 736.793 0 0 0 0 0 
0 2216.48 0 0 0 0 1380.58 0 0 0 0 -119.404 -89.1903 0.02 0 0 0 0 0 0 -2333.06 0 -959.273 0 0 0 0 0 0 0 0 2222.89 0 0 0 0 0 0 0 0 0 0 954.085 0 0 0 0 1741.61 0 0 0 0 0 0 0 0 0 0 0 0 0 0 0 0 0 0 
0 0 0 0 0 0 0 0 0 -181.814 0 0 0 0 0.04 0 0 1594.06 0 0 0 0 0 0 0 0 0 2196.19 0 -1330.84 0 0 0 0 0 2183.83 0 0 0 0 0 772.958 1529.21 0 0 0 2210.84 0 -4.80667 2436.06 0 0 0 0 0 0 0 0 0 0 0 0 0 0 0 0 
0 0 0 0 1007.95 0 616.55 0 0 0 0 0 0 0 0 0.05 0 0 0 0 1930.07 0 0 0 1080.43 0 0 0 -404.141 0 0 0 0 0 0 0 0 0 0 0 0 0 0 0 0 0 0 0 0 2424.62 0 0 0 0 0 0 0 0 0 0 0 0 0 0 0 0 
0 0 -1163.75 0 -255.669 0 0 0 1779.61 1895.12 0 -557.039 0 0 0 0 0.03 0 0 0 0 0 0 0 0 0 0 0 0 0 0 0 0 0 -475.402 0 0 0 507.752 0 0 0 1154.9 0 0 0 -564.974 0 151.296 0 0 0 -1152.91 0 0 0 0 0 0 0 0 0 0 0 0 0 
0 0 0 0 0 0 0 0 0 0 0 -356.533 0 0 2086.17 0 0 0.04 0 0 0 0 0 0 0 0 0 2125.54 1399.04 0 0 0 0 0 0 0 0 0 0 0 0 0 -556.124 0 0 0 0 0 0 0 0 0 0 0 0 0 0 0 0 0 0 0 0 0 0 0 
0 0 0 0 -3.28074 0 0 0 0 0 0 0 0 0 0 0 0 0 0.02 0 0 0 0 0 0 1757.03 0 0 -2411.65 0 0 0 0 0 0 0 -1482.21 0 0 0 0 0 571.993 0 0 0 0 1865.83 0 0 0 0 657.903 0 0 0 0 0 0 0 0 0 1289.03 0 0 0 
0 0 0 0 0 0 0 0 0 0 0 2326.35 0 0 0 0 0 0 0 0.04 0 0 0 0 0 0 0 0 0 0 0 0 0 0 0 -1761.3 0 0 0 0 0 0 0 0 0 0 0 0 0 0 0 0 0 0 0 0 0 0 0 0 0 0 0 0 0 0 
0 0 0 0 0 0 0 0 0 0 934.4 0 0 663.396 0 -327.235 0 0 0 0 0.02 0 0 0 0 0 0 2198.48 0 0 0 0 0 0 0 0 0 1350.06 -1464.2 0 0 0 2131.49 0 0 0 -1271.02 -582.369 0 0 0 0 0 0 0 0 0 0 1761.45 0 0 0 0 0 0 0 
0 0 0 0 1413.39 0 0 0 0 0 0 0 0 0 0 0 0 0 0 0 0 0.02 0 0 -726.569 0 0 0 0 0 0 0 877.483 0 0 0 0 0 0 0 0 0 0 0 0 0 0 0 0 0 0 0 1801.89 0 0 0 0 0 0 0 0 0 0 0 0 0 
0 0 0 0 1892.22 0 0 0 0 813.852 0 0 0 -170.064 0 0 0 0 0 0 0 0 0.03 0 0 0 0 0 0 0 0 0 0 0 0 0 2342.83 0 0 0 0 0 0 0 0 0 0 0 0 0 -2446.29 0 0 0 0 0 0 0 0 0 0 0 0 0 0 0 
0 0 0 0 0 0 0 0 0 0 0 0 0 0 0 0 0 0 0 0 0 0 0 0.05 694.983 0 0 0 0 0 0 0 0 0 0 0 0 0 0 0 0 0 0 0 0 0 0 2351.99 0 0 0 0 -2270.96 0 0 0 0 0 0 0 0 0 0 0 0 0 
0 0 0 0 0 2267.6 0 0 0 0 -969.039 0 0 0 0 2486.11 0 0 0 0 0 -1968.06 0 2279.96 0.05 0 0 0 0 0 0 0 0 0 0 1254.39 0 0 0 0 0 0 0 0 0 0 0 0 0 0 0 -1503.88 0 0 0 0 0 1190.91 0 0 0 0 0 0 0 0 
0 0 0 0 0 987.655 0 1209.52 0 -2041 0 0 0 0 0 0 0 0 231.559 0 0 0 0 0 0 0 0 0 0 505.768 0 0 0 0 0 0 0 1369.14 0 1260.19 0 -890.759 0 1086.23 0 0 0 0 0 0 0 0 0 0 0 0 0 0 0 0 0 -1041.83 0 0 0 0 
0 0 0 0 0 -2149.34 -1063.95 0 0 1600.77 0 0 0 0 0 0 0 0 0 0 0 0 0 0 0 0 0.03 0 -1037.25 0 0 0 0 0 0 0 0 0 0 0 0 0 2451.48 0 0 0 0 0 0 958.968 0 0 0 0 0 0 0 0 0 0 0 0 0 0 0 0 
0 0 0 0 0 471.129 228.507 0 0 -886.944 0 0 -1084.25 0 1840.34 0 0 2191 0 0 1077.53 0 0 0 0 0 0 0.08 1910.38 0 -1378.44 0 0 0 0 0 0 0 0 0 0 0 0 0 0 0 0 0 0 2320.25 0 0 1469.39 0 1560.64 0 0 0 0 0 0 0 0 0 0 0 
0 2015.06 0 0 0 0 0 0 0 0 0 0 0 0 0 -801.187 0 908.307 2046.04 0 0 0 0 0 0 0 -1354.64 1037.25 0.01 0 0 0 0 0 0 1671.42 0 0 0 0 0 -2481.08 0 0 0 1926.1 1460.84 0 1757.79 0 0 0 0 0 0 0 1405.3 0 0 0 0 0 0 0 0 0 
0 0 0 0 0 0 0 0 0 0 0 1920.91 0 0 740.76 0 0 0 0 0 0 0 0 0 0 1270.87 0 0 0 0.05 -897.32 0 0 -1235.62 164.876 0 0 0 -768.99 0 345.241 1999.5 1392.94 0 0 0 0 0 0 0 943.861 0 0 0 0 0 0 0 0 0 0 0 0 0 0 0 
0 0 -1986.68 0 0 0 0 0 0 0 0 0 0 0 0 0 0 0 0 0 0 0 0 0 0 0 0 2154.84 0 689.489 0.04 0 0 -483.795 0 0 0 0 0 0 0 0 0 0 2464.6 0 0 0 0 0 0 1312.83 256.89 0 0 0 0 0 0 0 0 0 0 0 0 0 
0 0 0 0 -2008.96 947.981 0 0 0 0 0 0 2419.28 -1360.29 0 0 0 0 0 0 0 0 0 0 0 0 0 0 0 0 0 0.05 0 0 0 1326.87 0 0 1014.51 0 371.029 0 0 0 0 -809.275 0 0 0 0 0 0 0 0 0 0 0 0 0 0 0 0 0 0 0 0 
0 0 0 0 0 0 0 -323.573 0 0 0 0 0 0 0 0 0 0 0 0 0 1978.9 0 0 0 0 0 0 0 0 0 0 0.05 0 0 0 0 0 0 0 0 0 0 0 0 1365.78 0 0 0 0 0 307.55 0 0 0 0 0 0 0 0 0 0 0 0 0 0 
0 0 0 0 0 1641.51 0 0 0 0 0 -1329.46 0 0 0 0 0 0 0 0 0 0 0 0 0 0 0 0 0 -1445.43 1428.04 0 0 0.04 0 2093.95 0 0 -558.87 0 0 0 0 855.51 0 0 0 1380.43 0 0 0 0 0 0 0 0 0 0 0 0 0 0 0 0 0 0 
0 0 1687.75 -1327.48 -2212.06 0 0 0 1998.43 2336.42 -1854.69 0 0 0 0 0 -1465.88 0 0 0 0 0 0 0 0 0 0 0 0 -1501.13 0 0 0 0 0.07 2497.86 1799.45 0 0 0 0 670.721 0 2389.22 0 0 0 0 0 0 0 0 0 0 0 0 0 0 0 0 0 0 0 0 0 0 
0 -25.1015 0 0 0 0 0 0 2062.97 0 1858.81 0 0 0 -1833.78 0 0 0 0 295.801 0 0 0 0 -536.439 0 0 0 2425.23 0 0 -228.355 0 770.058 -1942.43 0.07 0 0 -17.0141 0 0 0 1110.95 0 0 0 -203.33 0 0 0 0 0 1654.33 0 0 0 0 0 0 0 0 0 0 0 0 0 
0 0 -1845.53 0 0 0 0 0 0 0 0 0 0 0 0 0 0 0 2286.07 0 0 0 2296.14 0 0 0 0 0 0 0 0 0 0 0 1625.95 0 0.06 0 0 0 0 0 0 0 0 0 0 0 0 0 0 0 0 0 0 0 0 0 0 0 0 0 0 0 0 -734.199 
0 0 0 0 0 0 0 0 0 0 0 0 0 0 0 0 0 0 0 0 -1660.89 0 0 0 0 1408.81 0 0 0 0 0 0 0 0 0 0 0 0.02 0 0 0 0 0 0 0 0 0 0 2387.08 0 0 0 0 0 0 0 0 0 0 0 0 0 0 0 0 0 
0 -658.971 0 0 0 0 0 0 1737.65 0 0 41.1237 525.605 0 0 0 2283.47 0 0 0 473.418 0 0 0 0 0 0 0 0 2416.53 0 2241.2 0 637.608 0 -910.749 0 0 0.01 0 0 0 0 0 768.075 0 0 0 0 0 0 0 0 -33.9518 0 0 0 0 0 0 0 0 0 0 0 0 
0 0 0 0 0 2048.02 0 -1847.36 0 0 0 0 0 0 0 0 0 0 0 0 0 0 0 0 0 2288.2 0 0 0 0 0 0 0 0 0 0 0 0 0 0.01 0 0 0 2273.09 0 0 0 0 0 0 0 0 0 0 0 0 0 0 0 -533.082 0 0 0 0 0 0 
0 0 0 0 0 0 0 0 0 0 0 0 0 0 0 0 0 0 0 0 0 0 0 0 0 0 0 0 0 622.196 0 -546.663 0 0 0 0 0 0 0 0 0.09 0 468.383 0 0 0 0 2023.15 1493.19 0 0 0 0 -601.901 0 0 0 0 0 0 0 0 0 0 0 0 
0 0 0 -1905.35 0 0 0 0 0 0 0 0 1916.49 0 -1518.52 0 0 0 0 0 0 0 0 0 0 -1526.15 0 0 165.181 -993.606 0 0 0 0 2299.34 0 0 0 0 0 0 0.03 0 0 0 1135.06 0 0 0 0 0 0 0 0 0 0 0 0 0 0 0 0 0 0 0 0 
0 0 0 0 0 0 0 0 -2220.6 0 318.232 0 0 219.352 48.9059 0 -1886.12 1111.56 711.615 0 -1933.73 0 0 0 0 0 956.526 0 0 1851.63 0 0 0 0 0 2283.01 0 0 0 0 -308.924 0 0.04 0 0 0 0 0 0 0 0 0 0 0 0 0 0 0 0 0 0 0 0 0 0 0 
0 -305.567 0 0 0 0 0 0 190.664 0 0 0 0 0 0 0 0 0 0 0 0 0 0 0 0 195.242 0 0 0 0 0 0 0 1757.03 1721.47 0 0 0 0 -1943.19 0 0 0 0.02 0 0 0 0 0 0 0 0 0 0 0 0 0 0 0 0 0 0 0 0 0 0 
0 0 0 0 0 0 0 1839.88 2480.01 0 0 0 1299.1 0 0 0 0 0 0 0 0 0 0 0 0 0 0 0 0 0 1498.99 0 0 0 0 0 0 0 -647.832 0 0 0 0 0 0.09 0 -966.14 0 0 0 1912.06 0 0 0 0 0 0 0 0 0 0 0 0 0 0 0 
1006.42 0 0 0 0 0 0 0 0 0 0 -1867.81 0 0 0 0 0 0 0 0 0 0 0 0 0 0 0 0 1661.2 0 0 1812.11 283.898 0 0 0 0 0 0 0 0 -36.0881 0 0 0 0.09 0 0 0 0 742.744 0 1175.19 0 0 0 0 0 0 0 0 0 0 0 0 0 
765.633 0 0 -2148.58 0 0 2436.67 0 -35.1726 0 0 0 0 0 -1499.91 0 -411.161 0 0 0 -389.645 0 0 0 0 0 0 0 1463.59 0 0 0 0 0 0 -801.95 0 0 0 0 0 0 0 0 2406.92 0 0 0 0 2012.31 0 0 0 0 0 0 0 0 0 0 0 0 0 0 0 0 
-528.352 -256.127 0 0 -307.398 -1402.1 0 0 1788.61 0 1246.45 0 0 -1394.92 0 0 0 0 2171.62 0 2223.35 0 0 -344.935 0 0 0 0 0 0 0 0 0 -629.063 0 0 0 0 0 0 1843.24 0 0 0 0 0 0 0.08 0 0 0 0 0 0 0 0 0 0 0 0 0 0 0 0 0 0 
0 0 0 0 -1289.03 0 0 398.801 0 0 0 1726.05 1855.6 0 1481.14 0 -538.118 0 0 0 0 0 0 0 0 0 0 0 133.137 0 0 0 0 0 0 0 0 1724.37 0 0 -990.097 0 0 0 0 0 0 0 0.07 0 0 0 0 0 0 0 0 0 0 0 0 0 0 0 0 0 
0 0 2375.03 0 0 0 0 0 0 0 0 0 2160.33 0 2279.05 -2209.01 0 0 0 0 0 0 0 0 0 0 -822.703 252.922 0 0 0 0 0 0 0 0 0 0 0 0 0 0 0 0 0 0 1512.73 0 0 0.07 0 0 0 0 0 0 0 0 0 0 0 0 0 0 -1780.22 0 
0 0 1228.29 0 0 0 0 0 0 0 0 60.6555 0 0 0 0 0 0 0 0 0 0 2112.57 0 0 0 0 0 0 -2071.21 0 0 0 0 0 0 0 0 0 0 0 0 0 0 1274.22 1858.5 0 0 0 0 0.05 2288.66 0 0 0 0 0 0 0 0 0 0 0 0 -2277.83 0 
0 0 0 0 0 0 0 -157.857 0 1463.59 0 0 0 0 0 0 0 0 0 0 0 0 0 0 -2092.43 0 0 0 0 0 431.913 0 2229.3 0 0 0 0 0 0 0 0 0 0 0 0 0 0 0 0 0 1450.93 0.04 0 0 0 0 0 0 0 0 0 0 0 0 0 0 
0 0 176.321 0 0 439.238 0 0 0 0 0 0 1781.14 0 0 0 991.47 0 103.381 0 0 530.335 0 -157.094 0 0 0 390.255 0 0 1635.72 0 0 0 0 -1430.02 0 0 0 0 0 0 0 0 0 1730.63 0 0 0 0 0 0 0.07 0 0 0 0 0 0 0 0 0 0 0 0 0 
0 0 0 0 0 0 0 0 0 0 0 0 0 0 0 0 0 0 0 0 0 0 0 0 0 0 0 0 0 0 0 0 0 0 0 0 0 0 -1594.67 0 2349.7 0 0 0 0 0 0 0 0 0 0 0 0 0.09 0 0 0 0 0 0 0 0 0 0 0 0 
0 0 0 0 0 0 0 0 0 0 0 0 0 0 0 0 0 0 0 0 0 0 0 0 0 0 0 500.732 0 0 0 0 0 0 0 0 0 0 0 0 0 0 0 0 0 0 0 0 0 0 0 0 0 0 0.01 0 0 0 0 0 0 0 0 0 0 0 
0 1571.02 0 0 0 0 0 0 0 0 0 0 0 0 0 0 0 0 0 0 0 0 0 0 0 0 0 0 0 0 0 0 0 0 0 0 0 0 0 0 0 0 0 0 0 0 0 0 0 0 0 0 0 0 0 0.04 0 0 0 0 0 0 0 0 0 0 
0 0 0 0 0 0 0 0 0 0 0 0 0 0 0 0 0 0 0 0 0 0 0 0 0 0 0 0 1533.02 0 0 0 0 0 0 0 0 0 0 0 0 0 0 0 0 0 0 0 0 0 0 0 0 0 0 0 0.05 0 0 0 0 0 0 0 0 0 
0 0 0 0 0 0 0 0 0 0 0 0 0 0 0 0 0 0 0 0 0 0 0 0 1130.94 0 0 0 0 0 0 0 0 0 0 0 0 0 0 0 0 0 0 0 0 0 0 0 0 0 0 0 0 0 0 0 0 0 0 0 0 0 0 0 0 0 
0 0 0 0 0 0 0 0 0 0 0 0 0 0 0 0 0 0 0 0 1558.5 0 0 0 0 0 0 0 0 0 0 0 0 0 0 0 0 0 0 0 0 0 0 0 0 0 0 0 0 0 0 0 0 0 0 0 0 0 0.06 0 0 0 0 0 0 0 
0 0 0 0 0 0 0 0 0 0 0 0 0 0 0 0 0 0 0 0 0 0 0 0 0 0 0 0 0 0 0 0 0 0 0 0 0 0 0 1259.73 0 0 0 0 0 0 0 0 0 0 0 0 0 0 0 0 0 0 0 0.05 0 0 0 0 0 0 
0 0 0 0 0 0 0 0 0 0 0 0 1785.71 0 0 0 0 0 0 0 0 0 0 0 0 0 0 0 0 0 0 0 0 0 0 0 0 0 0 0 0 0 0 0 0 0 0 0 0 0 0 0 0 0 0 0 0 0 0 0 0.04 0 0 0 0 0 
0 0 0 0 0 0 0 0 0 0 0 0 0 0 0 0 0 0 0 0 0 0 0 0 0 837.504 0 0 0 0 0 0 0 0 0 0 0 0 0 0 0 0 0 0 0 0 0 0 0 0 0 0 0 0 0 0 0 0 0 0 0 0.02 0 0 0 0 
0 0 0 0 0 0 0 0 0 0 0 0 0 0 0 0 0 0 2075.95 0 0 0 0 0 0 0 0 0 0 0 0 0 0 0 0 0 0 0 0 0 0 0 0 0 0 0 0 0 0 0 0 0 0 0 0 0 0 0 0 0 0 0 0.04 0 0 0 
0 0 0 0 0 0 1144.67 0 0 0 0 0 0 0 0 0 0 0 0 0 0 0 0 0 0 0 0 0 0 0 0 0 0 0 0 0 0 0 0 0 0 0 0 0 0 0 0 0 0 0 0 0 0 0 0 0 0 0 0 0 0 0 0 0.06 0 0 
0 0 0 0 0 0 0 0 0 0 0 0 0 0 0 0 0 0 0 0 0 0 0 0 0 0 0 0 0 0 0 0 0 0 0 0 0 0 0 0 0 0 0 0 0 0 0 0 0 716.803 -215.079 0 0 0 0 0 0 0 0 0 0 0 0 0 0.06 0 
0 0 0 0 0 0 0 0 0 0 0 0 0 0 0 0 0 0 0 0 0 0 0 0 0 0 0 0 0 0 0 0 0 0 0 0 1476.56 0 0 0 0 0 0 0 0 0 0 0 0 0 0 0 0 0 0 0 0 0 0 0 0 0 0 0 0 0.04 
