*Vertices 52
*Matrix 
0.06 0 0 0 0 0 0 0 0 0 0 0 0 0 0 0 0 0 0 2344.81 0 0 0 0 -1452.15 0 0 0 0 0 1109.12 0 0 0 0 0 0 -228.507 1438.41 365.383 0 0 0 0 183.645 0 0 0 0 0 0 0 
0 0.02 0 0 0 0 947.066 0 0 0 0 0 0 0 0 0 0 0 0 -555.666 0 0 0 0 0 0 0 -1611.61 956.526 1028.4 0 0 0 0 0 0 0 0 0 0 0 0 1261.86 0 517.67 0 0 0 0 0 0 0 
0 0 0.08 0 1818.67 2098.07 0 0 0 0 0 0 0 0 0 0 1219.44 0 0 0 0 0 0 0 0 0 0 0 0 0 0 0 0 513.245 0 0 0 0 0 -296.564 -924.024 0 0 0 0 0 1510.59 0 0 0 1359.37 0 
0 0 0 0.01 0 -1018.48 0 0 0 0 0 0 0 0 0 0 0 0 0 0 0 0 2281.49 0 0 0 0 0 519.349 0 0 0 0 0 -1512.57 1624.12 -837.962 0 0 0 0 0 0 0 0 0 0 0 0 0 0 0 
0 0 -1879.71 0 0.02 0 0 0 0 1885.97 0 0 0 0 -2208.85 0 0 0 0 2157.73 1178.4 2022.54 0 0 0 0 0 1056.02 0 0 0 0 0 0 -2415.01 0 0 -1355.25 0 0 0 0 0 0 2098.22 0 2435 0 0 0 0 0 
0 0 -1569.49 227.744 0 0.02 2071.21 0 0 2002.85 0 0 0 0 0 0 0 0 0 -2446.29 0 0 0 0 0 0 0 0 0 0 0 0 0 0 0 0 0 0 0 0 0 0 0 0 0 0 2348.17 0 0 0 0 0 
0 343.104 0 0 0 2171.93 0 0 0 0 0 0 -1367.92 0 0 -1270.87 0 0 0 0 0 0 2138.97 0 -550.478 0 101.093 0 1588.11 0 0 0 0 0 453.124 0 0 0 0 0 948.897 0 0 0 -1021.99 0 0 0 0 0 0 0 
0 0 0 0 0 0 0 0.08 0 0 0 0 0 0 0 0 0 0 0 0 0 0 -956.526 33.0363 0 0 0 0 0 0 -150.838 0 0 0 1835.61 0 1813.94 0 0 0 0 0 0 0 0 0 0 0 0 0 0 0 
0 0 0 0 0 0 0 0 0 0 0 -610.141 2361.14 0 0 0 0 0 0 0 0 0 0 0 0 2305.29 0 0 0 0 0 0 0 0 0 0 0 0 0 0 0 0 0 0 0 0 0 0 0 0 0 0 
0 0 0 0 1219.9 564.974 0 0 0 0.03 0 0 0 675.909 0 0 0 0 0 0 421.384 0 0 0 0 0 0 0 0 0 0 0 0 0 0 0 0 0 0 0 0 0 0 0 0 0 0 0 0 0 0 0 
0 0 0 0 0 0 0 0 0 0 0.06 0 0 0 0 -360.652 0 1593.45 0 0 0 0 0 0 0 0 2163.69 1023.06 0 0 0 1374.48 0 0 1479.31 -1164.66 0 0 0 0 0 997.269 0 770.516 0 0 -2122.18 0 0 1661.66 0 0 
0 0 0 0 0 0 0 0 1552.71 0 0 0.06 0 -1002 0 1215.93 677.892 0 0 1525.39 0 0 0 0 0 0 0 0 0 0 0 0 0 0 0.381481 1978.13 0 0 0 0 0 0 0 0 994.217 0 0 0 0 0 0 0 
0 0 0 0 0 0 1539.74 0 1698.74 0 0 0 0.02 538.27 0 0 0 0 0 0 0 0 0 0 -351.344 0 0 0 0 0 0 0 0 0 0 0 0 0 0 0 0 0 0 0 0 -955.458 0 0 0 0 0 0 
0 0 0 0 0 0 0 0 0 1700.57 0 1427.43 -228.66 0.04 0 550.935 0 0 0 0 0 -161.061 0 0 0 0 0 0 0 0 0 0 0 0 0 0 0 0 0 0 0 0 0 0 0 0 0 0 0 0 0 0 
0 0 0 0 -956.526 0 0 0 0 0 0 0 0 0 0.09 0 0 0 0 924.787 -1659.67 0 0 0 2117.6 0 0 2299.8 0 0 0 0 0 0 0 -434.965 0 0 -1493.19 0 0 0 0 0 0 0 0 0 0 0 0 0 
0 0 0 0 0 0 -1323.36 0 0 0 -241.783 1650.98 0 -257.653 0 0.03 0 200.43 0 0 0 0 0 0 0 0 602.054 0 0 0 0 0 0 1451.38 0 0 0 0 0 0 0 0 0 0 2426.91 0 -2196.04 0 0 0 0 0 
0 0 -993.759 0 0 0 0 0 0 0 0 -2264.24 0 0 0 0 0.02 0 -592.135 0 0 0 0 0 0 0 0 0 2207.94 0 0 0 0 0 817.209 0 0 0 0 0 0 1168.78 0 0 0 0 0 0 0 0 0 0 
0 0 0 0 0 0 0 0 0 0 2161.55 0 0 0 0 152.516 0 0 0 590.457 0 245.445 0 601.901 0 0 1261.25 0 0 0 0 0 0 0 0 0 0 0 0 0 745.491 0 0 0 0 0 1240.35 0 0 0 0 0 
0 0 0 0 0 0 0 0 0 0 0 0 0 0 0 0 1712.62 0 0.04 0 0 0 0 0 0 0 0 0 0 0 1162.98 0 0 0 -752.358 0 0 0 0 0 0 0 0 1397.67 0 265.435 0 0 0 0 0 0 
2434.39 1167.41 0 0 1229.51 2278.44 0 0 0 0 0 596.408 0 0 458.922 0 0 316.858 0 0.06 0 0 0 0 0 0 0 641.27 0 0 0 0 0 0 0 0 0 -1840.34 0 0 0 0 0 0 0 0 0 0 0 0 0 0 
0 0 0 0 2461.85 0 0 0 0 2002.55 0 0 0 0 -1332.21 0 0 0 0 0 0.03 0 0 0 0 0 0 0 0 0 0 0 0 2136.83 899.915 0 0 0 0 531.404 0 0 0 0 0 0 0 0 0 0 0 0 
0 0 0 0 2245.63 0 0 0 0 0 0 0 0 1161.46 0 0 0 2192.07 0 0 0 0.05 0 0 0 0 0 0 0 0 2114.09 0 0 0 0 0 0 0 0 0 0 0 0 0 2112.87 0 0 0 0 0 0 1560.64 
0 0 0 1489.23 0 0 726.569 1843.39 0 0 0 0 0 0 0 0 0 0 0 0 0 0 0.02 0 0 0 0 0 0 1050.83 613.041 0 0 0 0 0 -2145.68 1264 -864.818 0 0 0 0 0 0 0 0 0 0 0 0 0 
0 0 0 0 0 0 0 1246.3 0 0 0 0 0 0 0 0 0 -935.926 0 0 0 0 0 0.06 0 -1135.67 0 370.266 0 0 0 0 1663.34 -1193.96 -248.65 0 0 0 0 0 0 2133.32 0 0 0 0 0 0 0 0 0 0 
-232.627 0 0 0 0 0 559.938 0 0 0 0 0 2129.05 0 -185.476 0 0 0 0 0 0 0 0 0 0.04 0 0 0 0 0 179.983 0 0 0 0 0 0 0 565.432 0 0 0 0 0 0 0 0 0 0 0 0 0 
0 0 0 0 0 0 0 0 -932.569 0 0 0 0 0 0 0 0 0 0 0 0 0 0 116.962 0 0.09 0 0 0 0 0 0 1629 0 739.54 0 0 0 0 0 0 0 0 0 0 0 0 0 0 0 0 0 
0 0 0 0 0 0 2336.73 0 0 0 1958.45 0 0 0 0 -319.605 0 439.085 0 0 0 0 0 0 0 0 0.06 0 -2079 0 0 1902.75 0 0 -2064.35 0 0 0 0 0 0 0 0 1677.53 0 0 0 -948.134 0 0 0 0 
0 -609.989 0 0 -1978.13 0 0 0 0 0 639.744 0 0 0 755.409 0 0 0 0 -1802.35 0 0 0 1757.33 0 0 0 0.01 0 0 0 0 0 0 0 0 0 0 0 2206.41 0 0 0 0 0 0 0 0 0 0 0 0 
0 -1580.32 0 1271.48 0 0 611.667 0 0 0 0 0 0 0 0 0 -683.081 0 0 0 0 0 0 0 0 0 882.214 0 0.07 0 0 0 0 0 0 0 0 0 2446.44 0 0 -840.709 0 0 0 0 0 0 0 0 0 0 
0 1901.53 0 0 0 0 0 0 0 0 0 0 0 0 0 0 0 0 0 0 0 0 1495.18 0 0 0 0 0 0 0.06 0 1013.44 -1645.63 0 533.235 0 0 0 0 0 0 0 0 0 0 1241.11 0 0 -489.441 0 0 0 
2001.02 0 0 0 0 0 0 -30.9 0 0 0 0 0 0 0 0 0 0 2027.12 0 0 180.746 1464.66 0 -1186.64 0 0 0 0 0 0.08 0 0 0 0 0 0 0 0 0 0 0 0 0 0 0 0 0 0 0 0 0 
0 0 0 0 0 0 0 0 0 0 1295.13 0 0 0 0 0 0 0 0 0 0 0 0 0 0 0 458.922 0 0 -1594.21 0 0.06 0 0 0 1533.63 0 0 0 693.304 0 0 0 0 531.556 0 0 0 0 0 0 0 
0 0 0 0 0 0 0 0 0 0 0 0 0 0 0 0 0 0 0 0 0 0 0 486.694 0 2083.73 0 0 0 446.104 0 0 0.08 0 0 0 0 0 0 0 817.82 0 0 0 0 0 0 0 0 0 0 0 
0 0 -1227.23 0 0 0 0 0 0 0 0 0 0 0 0 589.236 0 0 0 0 161.977 0 0 1595.13 0 0 0 0 0 0 0 0 0 0.06 0 -295.801 0 0 0 0 0 0 0 676.519 2270.96 0 0 0 0 0 0 0 
0 0 0 -740.15 1944.26 0 -486.389 2267.14 0 0 -710.547 -1047.93 0 0 0 0 286.798 0 -965.835 0 -354.854 0 0 761.971 0 1942.88 1552.55 0 0 -160.756 0 0 0 0 0.05 0 0 0 0 0 0 0 0 0 0 0 0 0 0 0 0 0 
0 0 0 720.771 0 0 0 0 0 0 1586.73 2148.73 0 0 1799.75 0 0 0 0 0 0 0 0 0 0 0 0 0 0 0 0 346.767 0 1806.77 0 0.02 0 0 0 0 0 0 0 0 0 0 0 0 0 0 0 0 
0 0 0 2299.49 0 0 0 -370.876 0 0 0 0 0 0 0 0 0 0 0 0 0 0 2238.61 0 0 0 0 0 0 0 0 0 0 0 0 0 0.07 0 -208.365 0 0 0 0 0 0 -1319.85 0 0 0 0 0 0 
2243.34 0 0 0 1200.06 0 0 0 0 0 0 0 0 0 0 0 0 0 0 2245.78 0 0 1632.51 0 0 0 0 0 0 0 0 0 0 0 0 0 0 0.09 0 -2173.45 -99.414 -1326.87 353.023 0 0 0 0 0 0 0 0 0 
353.481 0 0 0 0 0 0 0 0 0 0 0 0 0 -1035.11 0 0 0 0 0 0 0 328.913 0 24.6437 0 0 0 558.718 0 0 0 0 0 0 0 2047.26 0 0.01 0 0 0 0 0 0 0 0 0 0 0 0 0 
364.01 0 -595.95 0 0 0 0 0 0 0 0 0 0 0 0 0 0 0 0 0 1718.73 0 0 0 0 0 0 -1415.68 0 0 0 454.802 0 0 0 0 0 1900.16 0 0.07 0 0 0 0 0 0 0 0 0 0 0 0 
0 0 2056.11 0 0 0 2093.65 0 0 0 0 0 0 0 0 0 0 1181.3 0 0 0 0 0 0 0 0 0 0 0 0 0 0 774.789 0 0 0 0 1713.08 0 0 0.07 312.891 2059.62 0 0 0 0 0 0 0 0 0 
0 0 0 0 0 0 0 0 0 0 1263.7 0 0 0 0 0 -1501.59 0 0 0 0 0 0 2309.11 0 0 0 0 2044.51 0 0 0 0 0 0 0 0 767.617 0 0 -1685.16 0.02 1462.07 0 0 0 0 0 0 0 0 0 
0 -1106.68 0 0 0 0 0 0 0 0 0 0 0 0 0 0 0 0 0 0 0 0 0 0 0 0 0 0 0 0 0 0 0 0 0 0 0 981.094 0 0 -1800.67 485.931 0.07 0 0 1440.4 0 0 0 0 0 0 
0 0 0 0 0 0 0 0 0 0 624.18 0 0 0 0 0 0 0 -1786.63 0 0 0 0 0 0 0 1995.53 0 0 0 0 0 0 193.411 0 0 0 0 0 0 0 0 0 0.01 0 31.3578 0 0 0 0 0 0 
171.896 1635.26 0 0 1115.22 0 2351.68 0 0 0 0 244.835 0 0 0 -1758.86 0 0 0 0 0 2386.32 0 0 0 0 0 0 0 0 0 2232.2 0 1115.99 0 0 0 0 0 0 0 0 0 0 0.03 0 0 0 0 0 0 0 
0 0 0 0 0 0 0 0 0 0 0 0 -2403.26 0 0 0 0 0 1330.38 0 0 0 0 0 0 0 0 0 0 2316.58 0 0 0 0 0 0 -588.931 0 0 0 0 0 2400.66 2486.72 0 0.01 0 0 0 0 0 0 
0 0 873.669 0 2122.94 -879.62 0 0 0 0 373.47 0 0 0 0 2056.26 0 308.924 0 0 0 0 0 0 0 0 0 0 0 0 0 0 0 0 0 0 0 0 0 0 0 0 0 0 0 0 0.09 0 0 0 0 0 
0 0 0 0 0 0 0 0 0 0 0 0 0 0 0 0 0 0 0 0 0 0 0 0 0 0 1592.84 0 0 0 0 0 0 0 0 0 0 0 0 0 0 0 0 0 0 0 0 0.03 0 0 0 0 
0 0 0 0 0 0 0 0 0 0 0 0 0 0 0 0 0 0 0 0 0 0 0 0 0 0 0 0 0 1105.46 0 0 0 0 0 0 0 0 0 0 0 0 0 0 0 0 0 0 0.02 0 0 0 
0 0 0 0 0 0 0 0 0 0 2207.79 0 0 0 0 0 0 0 0 0 0 0 0 0 0 0 0 0 0 0 0 0 0 0 0 0 0 0 0 0 0 0 0 0 0 0 0 0 0 0.05 0 0 
0 0 588.015 0 0 0 0 0 0 0 0 0 0 0 0 0 0 0 0 0 0 0 0 0 0 0 0 0 0 0 0 0 0 0 0 0 0 0 0 0 0 0 0 0 0 0 0 0 0 0 0.06 0 
0 0 0 0 0 0 0 0 0 0 0 0 0 0 0 0 0 0 0 0 0 745.338 0 0 0 0 0 0 0 0 0 0 0 0 0 0 0 0 0 0 0 0 0 0 0 0 0 0 0 0 0 0.07 
