*Vertices 80
*Matrix 
0.06 0 527.894 -1929.46 0 1918.78 0 0 0 0 0 0 0 0 0 403.378 0 0 0 0 0 2108.6 0 496.155 -363.552 0 0 0 1570.86 0 0 0 134.816 0 0 0 -1760.99 689.947 0 -251.854 0 0 0 -2339.32 0 0 0 1312.37 0 0 0 -54.5518 0 0 0 0 -1292.99 0 1692.63 0 0 0 0 0 0 0 0 0 0 0 0 0 0 0 0 0 0 0 0 0 
0 0 0 0 0 -771.889 0 0 0 0 0 0 0 1329.16 0 1816.54 0 0 336.238 0 0 0 0 1545.08 0 0 -1905.19 0 0 0 308.161 0 0 0 1999.04 0 0 0 0 1447.42 -631.199 0 0 0 0 0 0 0 0 0 0 0 0 0 0 0 0 0 0 0 0 18.9978 0 0 0 0 0 0 0 0 0 0 0 0 0 99.5666 0 0 0 0 
477.538 0 0.05 0 0 648.289 0 902.509 0 547.731 0 0 0 0 1781.29 0 1136.43 0 0 0 0 0 0 -2237.24 0 0 2429.5 0 0 518.891 -1262.47 -37.3089 -988.876 853.374 0 -530.641 -1502.2 0 -580.996 0 1840.95 0 -2151.94 0 0 0 0 0 1167.26 0 0 0 0 0 0 -264.061 0 0 -2243.19 663.701 0 0 0 0 0 0 0 0 0 0 0 0 0 -2353.66 0 0 0 978.805 0 0 
1102.4 0 0 0.04 -92.3948 0 0 0 0 -112.232 -1433.99 0 0 0 -71.1844 0 0 0 0 0 932.722 0 0 0 0 247.734 0 0 0 0 2427.82 323.42 0 0 0 2225.03 0 0 0 0 0 640.66 0 0 2050.92 0 0 0 2350.76 -12.8941 0 0 0 0 0 0 0 0 0 2117.91 0 0 0 0 0 0 0 0 -1642.43 0 0 0 0 1649.14 0 0 0 2338.86 0 1194.42 
0 0 0 2472.69 0.06 0 0 0 0 0 1398.74 0 1962.11 0 0 0 0 1285.82 0 0 0 0 0 0 0 0 -2158.35 0 1174.58 0 0 435.728 0 0 0 0 0 0 0 0 0 1079.97 0 0 0 0 0 0 0 0 0 0 0 -2280.88 0 0 0 -1536.53 0 0 0 0 0 0 0 0 2028.34 0 0 1247.37 0 0 1665.01 0 0 0 0 -1373.87 0 1425.44 
969.955 2075.49 -666.753 0 0 0.09 2359.92 0 0 2103.26 0 0 -41.5815 0 0 0 0 0 0 0 -2371.67 0 0 682.012 0 -2485.66 0 0 1485.72 0 0 -40.5133 1590.4 0 0 0 0 0 0 0 1985.61 0 0 739.845 0 0 0 0 0 0 1595.89 0 0 -19.6081 0 167.165 -1268.58 0 0 0 -1217.61 0 0 0 0 0 0 0 0 0 0 0 0 0 -914.106 0 0 0 0 0 
0 0 0 0 0 -2043.9 0.03 -501.343 -2268.67 0 0 0 0 0 0 0 2245.17 -1689.43 0 0 -1410.34 996.048 2105.24 0 -1180.07 0 0 0 0 0 0 0 0 0 0 -1228.6 1296.35 25.2541 0 1078.14 0 354.091 0 0 0 0 2369.53 0 1311.46 0 0 0 0 0 889.843 0 0 1832.26 -376.064 0 0 0 0 482.269 0 0 0 -2051.53 1838.05 0 0 0 0 0 0 0 0 0 0 0 
0 0 428.251 0 0 0 1165.43 0.03 0 0 0 839.946 0 1381.19 -205.313 -288.781 0 0 0 0 0 0 0 0 0 0 0 0 -1997.67 -1307.95 0 0 0 0 -496.765 892.438 47.8378 0 -1786.63 0 0 210.654 0 0 0 0 0 -1585.97 0 0 0 0 1997.51 2422.18 1371.12 0 0 -1172.29 0 109.333 0 0 0 0 0 399.411 0 0 0 0 0 0 0 0 0 1802.8 0 0 0 0 
0 0 0 0 0 0 1037.86 0 0.01 274.438 0 0 483.947 771.126 0 0 0 0 0 0 0 0 0 0 2314.45 2472.69 0 0 0 0 0 0 0 0 0 0 0 -245.598 -1822.79 0 0 0 0 -2429.81 -1550.42 1034.2 1926.4 -1040.45 0 -1119.95 0 0 0 -1894.67 0 0 1182.21 1263.85 2172.99 1972.79 1106.22 0 0 0 0 0 0 0 0 0 0 0 0 0 0 0 0 0 0 0 
0 0 -465.941 -2448.58 0 1769.08 0 0 2145.38 0 0 750.221 0 0 0 512.177 0 0 1628.09 0 0 0 0 0 1707.59 -2449.34 0 1458.71 0 0 0 -469.146 0 -2442.01 604.953 194.327 0 0 0 0 -2051.38 0 0 0 0 0 0 133.442 0 0 1735.66 0 -440.001 0 0 0 0 0 2174.98 0 0 0 0 0 0 0 -178.457 0 0 0 0 0 0 0 0 0 0 0 0 -1862.62 
0 0 0 1334.35 2272.94 0 0 0 0 0 0.02 0 0 973.159 0 0 0 0 0 0 0 0 0 0 0 0 -2207.79 -1762.83 0 0 0 0 0 0 629.673 0 0 0 0 0 0 0 -1745.43 0 0 0 1753.82 0 0 0 147.328 -84.3074 0 0 -2160.63 818.888 0 -89.8007 -530.183 0 2475.74 0 0 0 0 -179.525 0 821.635 0 638.218 0 0 0 0 0 -759.835 0 0 0 0 
0 0 0 0 0 0 0 -624.332 0 1535.77 0 0 0 0 0 -2162.92 2245.78 0 -128.712 -273.522 0 -1354.34 -2300.71 0 666.295 0 0 0 0 0 956.832 0 0 2215.57 0 0 0 0 0 0 1151.54 0 0 1890.09 0 0 0 0 0 0 0 0 0 -1949.14 0 1493.65 0 0 0 1493.5 0 0 0 0 0 0 0 2097.61 0 0 1701.33 0 0 0 0 0 0 2321.92 0 0 
0 0 0 0 2493.9 1170.61 0 0 -767.617 0 0 0 0.03 0 -1078.14 0 0 0 1668.22 -1164.82 0 -2279.5 0 0 0 0 0 0 0 0 0 1954.18 0 300.378 859.63 0 0 1566.59 0 0 -696.509 0 0 0 1337.4 0 94.3785 0 0 0 0 0 0 0 0 0 0 312.738 -893.353 0 0 0 0 0 0 0 0 0 0 0 -472.503 -2298.27 0 0 0 0 0 0 0 0 
0 1698.28 0 0 0 0 0 106.738 1665.62 0 -253.227 0 0 0.09 -2469.94 0 0 340.51 0 0 0 0 1067 0 0 0 0 0 0 1365.32 0 0 1335.11 0 0 0 1751.53 0 0 -975.143 1657.08 0 0 0 0 413.144 -384.762 0 0 2440.95 119.709 0 0 0 0 0 -2487.03 0 0 0 1809.52 0 0 0 0 0 1765.88 0 0 0 -1737.8 0 0 0 0 0 0 0 0 0 
0 0 -23.2704 775.857 0 0 0 -1104.54 0 0 0 0 610.904 693.609 0.02 -1135.06 -233.085 0 0 0 0 1880.47 0 0 0 0 0 0 0 0 0 2424.92 0 0 -1348.23 0 -661.718 0 -1659.98 2254.94 1259.73 -1699.35 184.408 0 0 0 0 1199.76 0 0 0 0 0 -2232.96 0 0 922.803 0 0 2089.53 0 0 0 0 0 0 0 0 0 -1996.44 0 0 0 0 0 0 0 918.989 0 0 
2064.35 -889.538 0 0 0 0 0 2091.51 0 -1455.5 0 -1196.25 0 0 1887.8 0.02 0 0 0 2063.13 0 0 -2360.68 -2294.61 2157.58 1969.13 0 1634.95 0 0 -1569.95 0 0 0 0 0 0 0 -1401.33 0 0 -784.249 0 0 0 2108.29 0 0 1098.59 0 0 0 0 0 0 0 0 0 0 0 566.805 -1408.51 0 0 -1533.33 0 0 0 0 0 -209.128 0 -1071.89 0 0 0 0 0 0 0 
0 0 -205.313 0 0 0 1521.42 0 0 0 0 2206.11 0 0 -450.987 0 0.02 0 0 0 0 0 0 0 0 583.285 -2400.36 0 0 0 0 0 -1978.59 0 0 0 0 1018.78 0 0 1053.88 0 0 0 0 0 0 0 0 0 0 0 -525.3 0 0 0 0 717.872 0 0 0 0 0 0 0 0 0 0 0 0 0 1037.71 0 0 0 0 0 0 -1439.48 1566.74 
0 0 0 0 783.486 0 1085.77 0 0 0 0 0 0 2310.17 0 0 0 0.08 0 0 0 0 475.86 0 0 1905.04 0 -908.155 0 0 -246.055 0 0 622.044 0 0 0 715.735 0 167.318 0 -335.322 0 0 0 0 -1714.76 0 0 0 0 0 0 -1422.09 0 0 0 2083.12 -64.3178 -77.1355 0 0 270.165 -1780.07 0 0 0 0 0 0 0 0 0 0 0 0 0 0 1153.68 2448.88 
0 -1733.53 0 0 0 0 0 0 0 624.638 0 522.858 1493.8 0 0 0 0 0 0.04 0 0 0 0 0 0 0 2399.44 727.027 0 0 0 0 0 0 2264.4 0 0 815.531 1316.03 1423.61 0 0 0 685.522 0 0 0 0 0 0 0 0 0 0 0 1969.89 0 306.177 235.527 0 0 0 0 2282.25 0 218.131 0 0 0 0 0 0 0 0 0 0 0 0 0 0 
0 0 0 0 0 0 0 0 0 0 0 -1090.2 1813.79 0 0 1057.7 0 0 0 0.02 0 0 0 0 -19.9133 0 0 0 602.817 0 1903.52 2005.91 0 0 231.712 0 0 0 0 0 -78.2037 2251.12 0 0 -601.901 1534.24 0 0 -2031.08 0 0 0 0 0 1210.44 0 0 1540.04 0 -120.93 -1843.09 0 0 0 0 -1722.85 0 -1098.9 0 0 1614.81 0 0 0 0 0 0 0 0 0 
0 0 0 -1547.98 0 -1338.31 -2315.82 0 0 0 0 0 0 0 0 0 0 0 0 0 0 0 0 0 0 0 0 0 0 0 1389.58 0 0 0 1085.92 0 0 0 1734.14 0 0 0 0 0 1478.24 0 0 480.743 0 0 0 0 1420.56 890.454 0 2339.17 -2472.53 -2237.54 0 -954.085 1875.59 0 0 0 0 0 0 0 0 -18.54 605.106 0 0 0 0 300.226 0 0 0 0 
129.475 0 0 0 0 0 1770.15 0 0 0 0 -2166.89 1836.38 0 1339.23 0 0 0 0 0 0 0.06 2475.43 0 0 -1169.85 0 0 0 1153.07 -1053.88 -2389.83 0 0 0 0 0 -1997.82 -2444.61 213.401 2447.05 97.1252 0 0 -1577.27 0 0 0 2256.16 1257.29 0 0 2336.73 0 1763.89 0 0 1362.58 0 0 1873.91 0 0 0 0 0 0 0 2382.81 0 0 0 -2325.13 0 0 0 0 0 0 0 
0 0 0 0 0 0 115.589 0 0 0 0 -1432 0 -243.461 0 421.69 0 570.925 0 0 0 941.572 0.09 0 0 0 0 -1347.16 0 0 0 1010.54 0 0 0 0 1535.46 1130.94 2113.33 0 0 0 0 0 0 0 0 0 -1557.89 1657.08 0 -2470.7 -276.574 -1590.85 1634.04 2104.48 0 0 0 1924.73 0 0 -2379.91 0 0 0 0 0 -2111.5 0 0 0 0 0 1764.81 0 0 0 0 0 
787.606 1269.95 3.28074 0 0 -1716.44 0 0 0 0 0 0 0 0 0 1228.29 0 0 0 0 0 0 0 0 0 0 0 -1243.25 0 0 -1702.09 0 0 0 2417.29 0 0 0 0 -1487.7 0 0 0 -1222.65 0 0 1019.24 0 0 0 0 0 829.417 0 0 697.272 0 0 2480.77 0 0 0 0 0 0 0 0 0 0 0 0 0 0 0 0 0 0 0 0 0 
-1961.35 0 0 0 0 0 1194.27 0 -555.055 -685.217 0 -2341.76 0 0 0 -860.851 0 0 0 244.987 0 0 0 0 0.05 1990.34 0 0 0 0 0 0 0 0 -156.178 0 1546.14 -346.461 1678.14 0 936.689 0 0 0 0 0 0 0 0 0 0 2390.29 0 0 -1546.3 0 1358 0 0 0 0 0 0 0 0 -1410.34 0 0 0 0 0 0 0 0 2375.48 0 0 0 1009.63 0 
0 0 0 -2077.01 0 1635.26 0 0 2413.02 1823.71 0 0 0 0 0 -428.404 1509.37 523.469 0 0 0 -1957.38 0 0 1135.52 0.01 0 -863.75 0 0 0 2398.53 0 1849.04 0 0 0 0 -1976.45 0 0 0 0 0 0 0 0 0 -2315.52 0 0 0 0 0 0 0 0 0 1933.12 2194.97 0 0 0 0 0 0 269.097 0 0 0 0 0 0 0 0 0 0 0 0 0 
0 2498.32 1980.57 0 1871.78 0 0 0 0 0 -1490.3 0 0 0 0 0 1220.21 0 507.752 0 0 0 0 0 0 0 0.03 0 0 -1529.21 0 2294.15 0 0 0 2121.42 0 2400.36 0 0 0 0 -858.257 0 0 0 0 -884.35 0 0 0 0 0 0 0 0 0 0 0 0 0 0 0 0 0 0 0 0 0 0 0 0 0 1863.08 0 0 0 0 0 0 
0 0 0 0 0 0 0 0 0 -2390.74 1943.19 0 0 0 0 -902.356 0 155.721 1148.64 0 0 0 888.47 -246.361 0 464.11 0 0.02 905.56 0 0 0 0 0 1556.06 -865.429 0 0 0 0 0 1043.35 0 0 0 0 0 0 0 793.863 413.449 0 0 0 0 0 0 0 0 -420.316 0 1800.67 0 1028.86 1579.56 -1417.81 0 -567.568 0 0 972.243 1050.07 0 0 0 0 2282.4 0 0 0 
2292.93 0 0 0 61.7237 1903.06 0 968.886 0 0 0 0 0 0 0 0 0 0 0 -522.248 0 0 0 0 0 0 0 1266.14 0 0 0 0 0 0 0 0 0 0 -1793.04 617.008 0 0 0 0 -1180.23 0 0 0 0 0 0 0 0 1751.23 1444.36 1928.08 0 0 0 0 -1481.29 0 -225.608 0 0 0 0 0 0 0 0 0 0 0 1472.29 0 0 0 0 0 
0 0 1785.87 0 0 0 0 901.135 0 0 0 0 0 1637.55 0 0 0 0 0 0 0 -2405.24 0 0 0 0 -1941.97 0 0 0.05 0 0 0 0 0 -574.892 1876.05 0 0 -2039.17 0 0 0 1714.15 0 0 0 0 0 0 0 0 0 2183.22 0 -601.444 0 0 0 0 -228.507 0 0 0 0 0 0 648.137 0 0 0 0 0 0 -2132.1 0 0 0 0 0 
0 1916.03 766.854 847.88 0 0 0 0 0 0 0 1357.84 0 0 0 1770.15 0 2123.25 0 2297.05 1312.83 -2158.35 0 1110.34 0 0 0 0 0 0 0.03 0 0 0 0 0 0 0 0 -2171.01 0 0 1228.45 0 0 2036.42 0 0 0 0 0 0 0 0 0 -1474.12 0 0 0 0 0 0 1171.83 2173.91 0 0 -819.041 0 0 0 0 -830.332 0 0 0 0 0 -745.796 0 0 
0 0 740.15 2337.64 1841.87 -119.861 0 0 0 1976.76 0 0 1683.48 0 -1573.61 0 0 0 0 -772.652 0 1415.98 873.821 0 0 382.015 413.297 0 0 0 0 0.08 1423.61 0 0 0 0 1168.48 0 0 -734.352 2315.97 0 0 -1169.7 -41.8867 0 0 572.298 0 0 -966.597 0 -2006.21 0 0 0 0 0 0 0 1124.68 0 0 0 0 0 0 0 0 0 1478.7 0 0 0 -1685.92 0 0 0 0 
2230.06 0 -274.133 0 0 1178.4 0 0 0 0 0 0 0 647.984 0 0 2234.03 0 0 0 0 0 0 0 0 0 0 0 0 0 0 -405.21 0.02 0 0 -422.452 0 0 2433.16 1280.63 237.51 0 0 0 0 0 0 0 0 0 0 0 0 -1979.05 2477.72 0 0 0 0 1809.21 0 -812.479 0 0 0 0 0 0 0 0 0 0 0 0 0 0 0 0 -535.218 0 
0 0 1253.47 0 0 0 0 0 0 1955.4 0 1275.44 1284.75 0 0 0 0 636.387 0 0 0 0 0 0 0 2176.96 0 0 0 0 0 0 0 0.06 -2466.58 0 0 1853.92 0 0 0 0 0 0 0 2495.57 0 0 0 -1264.61 0 0 0 0 0 0 554.75 0 0 0 0 0 0 0 0 0 0 0 0 0 0 0 0 0 1932.36 0 0 0 0 0 
0 1965.62 0 0 0 0 0 -921.43 0 961.715 696.509 0 2382.5 0 2030.78 0 0 0 -1750.16 68.4378 -2455.9 0 0 1938.31 2182.76 0 0 1105.15 0 0 0 0 0 -1571.17 0.05 0 -203.024 0 0 0 -1657.54 -1438.41 0 0 -2425.84 0 43.7178 0 1514.56 0 -503.784 0 0 0 0 0 2003.62 0 0 0 0 0 0 0 0 0 0 0 0 0 0 -1300.16 0 -1622.14 0 0 0 0 0 0 
0 0 726.264 1458.86 0 0 1816.39 197.378 0 1125.9 0 0 0 0 0 0 0 0 0 0 0 0 0 0 0 0 1407.74 -1385.77 0 608.005 0 0 -1447.42 0 0 0.09 0 0 -427.946 0 0 0 0 0 0 0 0 -1027.18 0 -1676.31 1184.65 1559.27 -148.091 -184.103 0 0 0 0 0 0 1916.18 0 0 0 0 0 0 0 0 0 0 0 0 0 0 0 0 0 0 0 
1186.48 0 1449.55 0 0 0 -110.706 2401.43 0 0 0 0 0 -592.288 1148.03 0 0 0 0 0 0 0 2140.8 0 2188.86 0 0 0 0 934.4 0 0 0 0 -1664.25 0 0.01 946.303 -979.568 0 0 0 0 2213.13 0 0 1251.34 0 0 0 2125.69 -729.011 0 -228.355 0 0 0 0 0 -1562.93 0 0 0 0 0 0 0 0 0 0 0 -1702.09 0 0 0 0 0 0 0 0 
915.021 0 0 0 0 0 373.165 0 -1557.89 0 0 0 -1193.96 0 0 0 -2132.25 207.144 393.002 0 0 2140.49 -1219.14 0 66.3015 0 -894.269 0 0 0 0 -1379.97 0 2020.25 0 0 1100.73 0.09 0 0 0 1159.63 2175.28 0 172.048 0 0 -2359 0 0 0 442.289 389.645 2161.09 0 0 0 0 0 0 0 0 0 0 0 0 0 0 0 1159.63 -882.214 0 0 0 0 0 -1470.76 0 0 0 
0 0 1682.1 0 0 0 0 -2492.07 1201.59 0 0 0 0 0 -1466.8 2407.83 0 0 -1506.93 0 -308.618 544.526 953.169 0 1444.52 -2166.13 0 0 798.746 0 0 0 363.399 0 0 712.836 6.02741 0 0.05 733.741 0 0 0 646.916 0 0 2042.99 -669.5 0 0 0 0 0 761.971 0 0 0 0 0 0 0 0 0 0 0 0 0 -1037.1 0 0 0 0 0 0 0 0 0 0 0 0 
1296.35 255.669 0 0 0 0 1751.23 0 0 0 0 0 0 -1595.58 -168.996 0 0 -212.18 1860.94 0 0 434.812 0 1034.04 0 0 0 0 -2263.94 -2211.75 809.275 0 1016.04 0 0 0 0 0 1537.29 0.07 0 0 0 207.45 0 0 0 0 0 -1573 2441.4 0 0 0 0 0 0 0 0 0 0 0 0 0 0 0 0 211.57 0 0 0 0 0 0 0 1730.93 -425.657 -987.655 -1581.85 0 
0 -1616.95 -806.833 0 0 -453.734 0 0 0 2281.95 0 976.974 2288.66 2041.76 -711.31 0 401.852 0 0 -1427.12 0 2019.64 0 0 1893.14 0 0 0 0 0 0 747.322 76.5252 0 -50.5844 0 0 0 0 0 0.05 0 0 0 0 1480.38 0 0 0 0 1959.97 947.218 0 0 0 535.371 0 0 0 -230.949 0 0 0 0 0 0 0 0 234.458 0 0 0 0 1207.39 0 2031.39 0 0 1048.84 0 
0 0 0 -1919.69 1794.26 0 -1357.39 -2095.78 0 0 0 0 0 0 468.23 949.202 0 -1327.63 0 -99.5666 0 2087.39 0 0 0 0 0 11.8259 0 0 0 -1382.26 0 0 312.738 0 0 2145.07 0 0 0 0.01 0 -83.0866 426.572 -8.46889 0 2204.58 0 0 0 456.786 0 2244.56 0 0 0 687.658 0 -500.122 0 -1708.96 0 0 0 0 0 0 1534.55 0 0 0 0 0 0 0 0 0 0 0 
0 0 -2308.95 0 0 0 0 0 0 0 1225.55 0 0 0 1253.93 0 0 0 0 0 0 0 0 0 0 0 -438.017 0 0 0 1320.46 0 0 0 0 0 0 1721.17 0 0 0 0 0.08 1415.68 0 0 0 669.958 0 0 2479.55 0 0 -500.732 0 0 0 0 0 530.183 0 0 -2044.21 0 0 0 0 0 0 -773.873 0 0 0 0 0 0 0 0 -1981.19 0 
855.815 0 0 0 0 1202.51 0 0 -431.608 0 0 919.904 0 0 0 0 0 0 1866.28 0 0 0 0 1477.02 0 0 0 0 0 -358.211 0 0 0 0 0 0 1831.19 0 796.609 800.424 0 -1584.75 -539.033 0.02 0 1082.26 0 0 836.741 0 739.235 0 -681.707 0 0 0 0 0 0 0 -1654.18 0 0 2131.64 0 0 0 -1107.59 -1799.91 0 0 0 0 0 0 0 0 0 0 0 
0 0 0 -1385.62 0 0 0 0 2408.75 0 0 0 1301.69 0 0 0 0 0 0 2491.45 577.639 -1402.86 0 0 0 0 0 0 -2122.18 0 0 -60.5029 0 0 2482.45 0 0 -308.618 0 0 0 -1651.89 0 0 0 0 -1050.07 0 0 0 0 1222.34 0 0 0 1077.99 0 0 1041.67 0 1506.01 0 0 -412.381 0 0 -568.484 0 0 0 -727.027 2225.03 0 0 0 0 -1929.15 0 0 0 
0 0 0 0 0 0 0 0 790.353 0 0 0 0 -1350.67 0 -839.183 0 0 0 2036.73 0 0 0 0 0 0 0 0 0 0 795.541 1426.36 0 -753.273 0 0 0 0 0 0 -194.479 876.11 0 2449.64 0 0.01 0 -2072.59 0 22.5074 0 0 0 0 0 2088.15 0 0 0 0 0 0 0 0 0 0 0 0 -723.06 0 0 0 0 0 1193.2 0 0 0 0 0 
0 0 0 0 0 0 2476.65 0 1020.62 0 -125.813 0 2209.77 526.673 0 0 0 263.298 0 0 0 0 0 -1220.05 0 0 0 0 0 0 0 0 0 0 -661.26 0 1000.02 0 -149.617 0 0 0 0 0 1557.13 0 0.07 0 2421.72 0 0 0 0 0 0 0 569.704 0 0 -1181.91 0 -1278.8 0 0 0 0 0 0 0 0 0 0 0 0 0 0 0 0 0 0 
1953.72 0 0 0 0 0 0 1329.62 2416.38 -12.2837 0 0 0 0 2027.42 0 0 0 0 0 407.498 0 0 0 0 0 2319.64 0 0 0 0 0 0 0 0 -1620 0 -1951.89 -2296.14 0 0 1499.3 -514.161 0 0 678.655 0 0.09 0 0 0 0 1688.82 0 0 -2273.09 0 0 0 0 1655.86 0 0 0 0 0 0 0 0 0 0 0 0 0 0 0 -860.088 -30.7474 0 843.608 
0 0 1154.74 1977.37 0 0 -57.1459 0 0 0 0 0 0 0 0 1589.33 0 0 0 -1973.25 0 895.184 1616.64 0 0 -1689.43 0 0 0 0 0 -236.595 0 0 1427.73 0 0 0 0 0 0 0 0 807.138 0 0 -1298.49 0 0.04 -1574.53 2308.8 0 -174.642 0 0 0 0 -398.953 537.507 0 2461.85 -1129.72 0 0 0 0 0 0 0 0 0 0 0 0 0 0 2222.89 0 0 0 
0 0 0 1485.41 0 0 0 0 1102.71 0 0 0 0 -1305.05 0 0 0 0 0 0 0 -1021.99 316.706 0 0 0 0 1955.09 0 0 0 0 0 356.075 0 2012.77 0 0 0 -441.527 0 0 0 0 0 -692.083 0 0 -775.704 0.08 0 0 0 815.378 0 1845.99 0 0 0 0 0 0 0 -379.116 749.916 0 0 0 0 0 0 0 -177.541 0 0 0 0 0 0 0 
0 0 0 0 0 992.996 0 0 0 1003.52 -419.095 0 0 -953.932 0 0 0 0 0 0 0 0 0 0 0 0 0 1609.47 0 0 0 0 0 0 589.236 -2228.54 841.014 0 0 2289.42 2000.41 0 -76.6778 1991.71 0 0 0 0 -1225.39 0 0.05 0 2301.17 0 0 0 -1616.95 0 1847.21 0 -327.998 0 739.235 0 0 0 0 0 0 0 0 0 2209.77 0 0 0 0 0 0 0 
1632.51 0 0 0 0 0 0 0 0 0 -1384.55 0 0 0 0 0 0 0 0 0 0 0 826.823 0 164.418 0 0 0 0 0 0 -1699.19 0 0 0 -452.361 501.495 -1283.53 0 0 1322.29 2307.89 0 0 2423.4 0 0 0 0 0 0 0.04 0 -1714.3 0 0 0 0 0 1135.82 1940.9 0 0 0 0 0 0 -954.085 0 0 0 0 0 0 0 0 2441.1 0 217.978 0 
0 0 0 0 0 0 0 145.65 0 1299.86 0 0 0 0 0 0 -317.927 0 0 0 960.494 513.398 1121.33 -1067.77 0 0 0 0 0 0 0 0 0 0 0 1008.26 0 -334.407 0 0 0 0 0 1010.54 0 0 0 -497.681 2024.67 0 293.512 0 0.09 -1975.54 0 0 0 -2071.83 -1261.41 0 1303.83 0 0 0 0 -514.161 0 0 -1131.09 0 0 0 0 0 0 0 0 0 -13.1993 -1031.45 
0 0 0 0 -305.261 1604.13 0 -671.636 -1367.76 0 0 -2266.99 0 0 1272.39 0 0 -2348.32 0 0 2353.21 0 -2078.84 0 0 0 0 0 -692.389 -772.958 0 -671.484 -1928.08 0 0 2290.03 2465.36 1138.26 138.325 0 0 -877.636 779.977 0 0 0 0 0 0 -277.795 0 2079.45 2240.75 0.07 0 0 0 1231.04 0 0 0 0 0 884.655 0 0 0 0 0 0 0 0 0 0 390.561 0 634.556 0 0 0 
0 0 0 0 0 0 1966.23 -1427.58 0 0 291.528 0 0 0 0 0 0 0 0 1316.64 0 2297.51 -1247.22 0 -517.212 0 0 0 293.359 0 0 0 2082.05 0 0 0 0 0 0 0 0 0 0 0 0 0 0 0 0 0 0 0 0 0 0.02 0 0 0 0 0 0 729.469 0 -1372.19 0 0 0 0 0 0 0 0 0 2079 0 1982.1 0 0 0 0 
0 0 101.245 0 0 1053.73 0 0 0 0 -1018.17 -2450.25 0 0 0 0 0 0 -114.368 0 2395.17 0 186.239 -2294 0 0 0 0 2347.56 1579.87 967.971 0 0 0 0 0 0 0 0 0 1158.56 0 0 0 -650.273 2433.16 0 -487.762 0 1537.45 0 0 0 0 0 0.04 0 0 0 0 0 0 0 0 0 2353.66 0 0 0 0 0 0 0 0 0 0 891.064 0 0 0 
-1382.26 0 0 0 0 -275.048 0 0 2131.95 0 0 0 0 453.581 -38.377 0 0 0 0 0 257.805 0 0 0 2450.56 0 0 0 0 0 0 0 0 -59.5874 -2046.95 0 0 0 0 0 0 0 0 0 0 0 921.888 0 0 0 2357.48 0 0 0 0 0 0.05 -913.8 0 0 0 -1594.52 0 0 0 0 0 0 0 0 0 0 0 0 0 0 0 0 -230.491 0 
0 0 0 0 -1920.61 0 -1243.25 -145.802 2240.59 0 2248.07 0 368.435 0 0 0 -354.091 897.015 1892.68 967.208 1458.86 -767.617 0 0 0 0 0 0 0 0 0 0 0 0 0 0 0 0 0 0 0 1974.47 0 0 0 0 0 0 -80.9503 0 0 0 -969.039 728.706 0 0 1574.83 0.07 0 -823.466 1556.67 0 0 0 0 0 -1493.5 -1925.18 -1908.4 0 0 0 2298.73 0 0 0 270.013 0 0 0 
2286.07 0 -537.202 0 0 0 664.006 0 30.137 1602.15 -760.903 0 997.269 0 0 0 0 -1383.48 1988.05 0 0 0 0 1895.43 0 848.949 0 0 0 0 0 0 0 0 0 0 0 0 0 0 0 0 0 0 197.989 0 0 0 654.393 0 -1227.07 0 -287.103 0 0 0 0 0 0 0 0 0 0 0 0 0 0 0 0 0 0 0 -2068.47 -1208.76 0 0 0 -2436.52 0 0 
0 0 303.125 1900.01 0 0 0 -2182.61 1813.33 0 0 -1525.39 0 0 -1380.43 0 0 -848.186 0 -817.362 1330.38 0 -881.756 0 0 1344.57 0 -1676.61 0 0 0 0 2365.11 0 0 0 -1119.95 0 0 0 833.232 -1343.35 2386.47 0 0 0 2427.98 0 0 0 0 -1434.14 0 0 0 0 0 1573.46 0 0.08 0 0 0 2269.59 0 0 0 0 0 0 0 0 0 0 2029.1 0 -1354.49 0 0 0 
0 0 0 0 0 -2320.86 0 0 777.688 0 -88.2748 0 0 1564.91 0 -195.395 0 0 0 468.993 -2170.25 -483.795 0 0 0 0 0 0 2220.91 1860.79 0 0 0 0 0 -1280.33 0 0 0 0 0 0 0 2424.31 1692.79 0 0 -1692.18 224.693 0 -2120.2 2405.09 -1907.18 0 0 0 0 -125.202 0 0 0.04 0 0 0 0 0 0 0 0 0 0 0 0 0 0 2368.47 0 0 0 0 
0 -255.821 0 0 0 0 0 0 0 0 0 0 0 0 0 -2289.57 0 0 0 0 0 0 0 0 0 0 0 2151.48 0 0 0 2279.35 2371.21 0 0 0 0 0 0 0 0 -2145.83 0 0 0 0 -1045.03 0 2022.23 0 0 0 0 0 1093.4 0 765.633 0 0 0 0 0.04 0 0 0 0 0 0 0 0 0 0 0 0 2100.05 0 0 0 0 0 
0 0 0 0 0 0 0 0 0 0 0 0 0 0 0 0 0 2174.37 0 0 0 0 -1683.02 0 0 0 0 0 1730.93 0 -160.298 0 0 0 0 0 0 0 0 0 0 0 1952.5 0 0 0 0 0 0 0 -793.405 0 0 0 0 0 0 0 0 0 0 0 0 0 0 0 1201.44 0 0 0 0 0 0 0 0 0 0 0 0 0 
0 0 0 0 0 0 -1550.26 0 0 0 0 0 0 0 0 0 0 -18.8452 -2032 0 0 0 0 0 0 0 0 -479.98 0 0 -1396.6 0 0 0 0 0 0 0 0 0 0 0 0 2252.19 2140.95 0 0 0 0 2111.96 0 0 0 2147.05 -2075.49 0 0 0 0 1803.26 0 0 0 0.07 2221.37 -1953.87 -2132.71 0 0 0 0 -1382.26 0 -681.249 0 0 0 0 0 0 
0 0 0 0 0 0 0 0 0 0 0 0 0 0 0 2444.76 0 0 0 0 0 0 0 0 0 0 0 326.319 0 0 0 0 0 0 0 0 0 0 0 0 0 0 0 0 0 0 0 0 0 -170.98 0 0 0 0 0 0 0 0 0 0 0 0 0 1515.78 0.08 0 0 0 0 0 -1874.52 0 0 0 0 -270.928 0 0 0 0 
0 0 0 0 0 0 0 1370.82 0 0 -727.027 0 0 0 0 0 0 0 -607.242 -1864.3 0 0 0 0 2287.44 0 0 1720.71 0 0 0 0 0 0 0 0 0 0 0 0 0 0 0 0 0 0 0 0 0 0 0 0 -1207.08 0 0 1427.88 0 0 0 0 0 0 0 986.74 0 0.05 0 0 0 0 0 0 0 0 0 0 0 0 0 0 
0 0 0 0 1880.63 0 0 0 0 1212.27 0 0 0 325.251 0 0 0 0 0 0 0 0 0 0 0 -1512.12 0 0 0 0 -2104.02 0 0 0 0 0 0 0 0 0 0 0 0 0 240.867 0 0 0 0 0 0 0 0 0 0 0 0 225.303 0 0 0 0 685.064 30.137 0 0 0.04 0 0 -544.221 0 0 0 938.215 0 0 0 0 0 0 
0 0 0 0 0 0 1047.01 0 0 0 1053.88 1782.51 0 0 0 0 0 0 0 -1942.88 0 0 0 0 0 0 0 645.085 0 628.147 0 0 0 0 0 0 0 0 -1682.1 -720.313 0 0 0 613.956 0 0 0 0 0 0 0 -149.312 0 0 0 0 0 1337.4 0 0 0 0 0 0 0 0 0 0.08 0 0 0 0 0 0 0 0 0 0 0 0 
0 0 0 2012.62 0 0 -50.737 0 0 0 0 0 0 0 0 0 0 0 0 0 0 1337.7 1041.37 0 0 0 0 0 0 0 0 0 0 0 0 0 0 0 0 0 2493.59 1663.79 0 35.6304 0 -2407.68 0 0 0 0 0 0 2493.74 0 0 0 0 -2241.2 0 0 0 0 0 0 0 0 0 0 0.03 0 0 0 0 0 0 0 252.77 0 0 0 
0 0 0 0 2362.36 0 0 0 0 0 -784.555 0 0 0 1139.94 0 0 0 0 0 -1464.81 0 0 0 0 0 0 0 0 0 0 0 0 0 0 0 0 -1739.78 0 0 0 0 2262.11 0 0 0 0 0 0 0 0 0 0 0 0 0 0 0 0 0 0 0 0 0 0 0 -1041.98 0 0 0.09 -383.084 0 0 0 0 0 0 0 0 0 
0 0 0 0 0 0 0 0 0 0 0 -26.9326 -231.407 487.304 0 609.226 0 0 0 -1448.79 754.646 0 0 0 0 0 0 388.272 0 0 0 0 0 0 0 0 0 571.383 0 0 0 0 0 0 1678.44 0 0 0 0 0 0 0 0 0 0 0 0 0 0 0 0 0 0 0 -1873.3 0 0 0 0 -72.7104 0.03 0 0 0 0 0 0 0 -331.355 0 
0 0 0 0 0 0 0 0 0 0 0 0 633.793 0 0 0 657.445 0 0 0 0 0 0 0 0 0 0 -988.266 0 0 1030.08 385.067 0 0 1243.1 0 -2126.45 0 0 0 0 0 0 0 1813.18 0 0 0 0 0 0 0 0 0 0 0 0 0 0 0 0 0 0 -280.847 0 0 0 0 0 0 0 0.09 746.559 0 0 0 -1126.97 0 0 0 
0 0 0 0 -1303.98 0 0 0 0 0 0 0 0 0 0 2025.28 0 0 0 0 0 -1311.91 0 0 0 0 0 0 0 0 0 0 0 0 0 0 0 0 0 0 0 0 0 0 0 0 0 0 0 1806.31 -1851.63 0 0 0 0 0 0 2338.86 1382.72 0 0 0 0 0 0 0 0 0 0 0 0 2054.58 0.09 0 0 0 0 0 0 1321.53 
0 0 -1279.87 -2127.83 0 0 0 0 0 0 0 0 0 0 0 0 0 0 0 0 0 0 0 0 0 0 1978.44 0 0 0 0 0 0 0 469.909 0 0 0 0 0 240.562 0 0 0 0 0 0 0 0 0 0 0 0 0 1307.34 0 0 0 1304.9 0 0 0 0 1838.51 0 0 -1188.62 0 0 0 0 0 0 0.01 0 0 0 0 0 0 
0 0 0 0 0 973.006 0 0 0 0 0 0 0 0 0 0 0 0 0 0 0 0 2478.79 0 984.451 0 0 0 1185.26 356.99 0 0 0 -1894.21 0 0 0 0 0 0 0 0 0 0 0 1885.36 0 0 0 0 0 0 0 -1074.18 0 0 0 0 0 -1101.95 0 -1518.22 0 0 0 0 0 0 0 0 0 0 0 0 0.08 0 0 0 0 0 
0 2300.41 0 0 0 0 0 488.983 0 0 -2174.37 0 0 0 0 0 0 0 0 0 -1517.61 0 0 0 0 0 0 0 0 0 0 671.941 0 0 0 0 0 0 0 -454.039 959.883 0 0 0 0 0 0 0 0 0 0 0 0 0 983.535 0 0 0 0 0 635.929 0 0 0 2035.51 0 0 0 0 0 0 0 0 0 0 0.08 0 0 0 0 
0 0 0 0 0 0 0 0 0 0 0 0 0 0 0 0 0 0 0 0 0 0 0 0 0 0 0 -1037.4 0 0 0 0 0 0 0 0 0 1597.42 0 120.319 0 0 0 0 1758.71 0 0 -1061.36 812.021 0 0 337.153 0 936.232 0 1395.84 0 -258.873 0 2396.24 0 0 0 0 0 0 0 0 -109.638 0 0 -1365.78 0 0 0 0 0.07 0 0 0 
0 0 646.001 -1674.78 253.227 0 0 0 0 0 0 1608.55 0 0 1459.78 0 0 0 0 0 0 0 0 0 0 0 0 0 0 0 1242.33 0 0 0 0 0 0 0 0 191.885 0 0 0 0 0 0 0 2065.11 0 0 0 0 0 0 0 0 0 0 543.764 0 0 0 0 0 0 0 0 0 0 0 0 0 0 0 0 0 0 0 0 0 
0 0 0 0 0 0 0 0 0 0 0 0 0 0 0 0 1601.23 51.3474 0 0 0 0 0 0 174.795 0 0 0 0 0 0 0 1529.05 0 0 0 0 0 0 1837.75 25.8644 0 -798.593 0 0 0 0 0 0 0 0 122.608 1395.99 0 0 0 2176.66 0 0 0 0 0 0 0 0 0 0 0 0 0 -2135.46 0 0 0 0 0 0 0 0.08 1344.87 
0 0 0 -1480.22 2452.09 0 0 0 0 1280.02 0 0 0 0 0 0 -2077.62 1772.59 0 0 0 0 0 0 0 0 0 0 0 0 0 0 0 0 0 0 0 0 0 0 0 0 0 0 0 0 0 2373.65 0 0 0 0 2272.33 0 0 0 0 0 0 0 0 0 0 0 0 0 0 0 0 0 0 0 -578.86 0 0 0 0 0 420.011 0.05 
