*Vertices 45
*Matrix 
0.06 0 0 0 0 151.753 0 0 2420.19 0 707.343 0 0 0 0 0 0 -2062.21 0 -849.559 0 0 1851.79 0 -360.652 0 0 0 0 505.005 1610.84 0 0 0 0 0 0 0 0 0 0 0 0 0 0 
0 0.06 0 0 0 0 -1450.77 0 0 -2111.5 -1631.14 0 1489.99 -606.784 0 0 0 1665.47 0 2204.43 0 0 0 222.709 0 0 1114.31 0 -2279.05 0 0 0 1701.03 0 0 0 0 0 0 0 0 532.929 0 0 0 
0 0 0.03 0 0 535.829 -378.658 1631.75 0 0 0 0 -2082.96 0 140.767 0 0 0 0 2244.1 0 1509.22 0 2329.4 0 0 0 -1624.73 730.689 0 438.78 0 0 837.962 0 1773.66 0 0 0 0 1930.83 0 0 0 0 
0 0 0 0.04 0 248.192 0 0 0 1485.56 -1608.1 0 0 0 0 946.76 0 0 259.026 0 0 2170.86 0 -1771.98 0 0 0 0 0 0 0 0 0 0 0 0 0 0 0 0 0 0 0 0 0 
0 0 0 0 0.05 2466.73 2102.8 0 1459.78 0 0 0 -2171.47 0 0 0 0 2035.66 0 0 0 0 0 0 2212.52 859.63 0 -1130.48 0 2220.6 0 0 0 0 0 0 620.518 0 0 0 0 0 0 0 0 
-889.996 0 852.611 -1319.24 -1133.53 0.07 0 0 2257.38 0 0 0 0 0 0 0 0 0 0 131.916 583.285 0 0 0 0 0 1438.72 1180.38 0 1708.2 0 0 0 0 0 0 0 -1874.52 1662.27 0 0 0 0 0 0 
0 -1532.41 243.767 0 -627.079 0 0.04 0 0 98.1933 0 0 -388.577 0 0 -221.793 0 0 0 2131.79 0 0 0 1441.31 0 0 0 104.602 -1907.94 2295.22 0 0 -1757.94 0 0 0 0 2355.65 0 815.989 0 1622.75 0 0 0 
0 0 -929.975 0 0 0 0 0.08 -1117.21 0 0 486.694 0 0 1082.42 566.5 -811.258 0 0 0 0 0 0 1804.79 0 0 1813.79 339.442 0 312.586 0 0 461.821 0 2282.56 430.235 1762.22 291.986 0 -2043.44 0 2168.57 0 0 0 
-2029.4 0 0 0 819.498 2365.11 0 816.294 0.03 0 0 0 0 0 0 -2358.55 2150.87 0 0 0 -1828.14 0 0 0 0 0 110.401 2405.55 0 1508.45 1510.13 0 0 1410.03 0 0 0 1728.03 2147.97 747.932 0 0 0 0 0 
0 -9.84222 0 2289.73 0 0 -1841.56 0 0 0.04 604.495 1492.58 1680.58 0 -250.786 0 0 0 0 0 0 0 0 56.5355 -1142.54 0 -753.426 0 2365.26 -93.9207 2296.29 0 0 0 -114.521 0 -934.706 0 -1977.52 0 0 403.836 0 0 -148.396 
-2017.81 1672.64 0 -186.392 0 0 0 0 0 2185.51 0 -1695.99 0 0 0 -355.77 0 0 2128.44 0 0 0 0 0 0 0 1792.28 0 -1643.35 728.553 1202.05 0 0 0 0 2114.09 356.838 0 264.367 0 -197.226 0 0 0 0 
0 0 0 0 0 0 0 534.455 0 -1042.89 1630.83 0.08 0 -1228.45 0 0 2498.02 0 0 0 0 1326.26 0 0 2000.41 0 0 0 0 0 1979.66 2109.67 0 -1224.78 0 -830.79 587.863 0 -1180.07 0 -1699.96 2354.43 -1524.48 0 0 
0 -1943.34 -1359.68 0 2499.54 0 544.374 0 0 2150.87 0 0 0.09 0 2266.38 0 -2046.04 0 0 -192.648 0 0 35.1726 0 0 936.079 0 0 0 0 2245.93 0 0 746.864 0 0 0 0 0 0 -64.3178 -1600.47 1101.34 0 0 
0 1549.65 0 0 0 0 0 0 0 0 0 -1747.26 0 0 -236.29 1428.19 0 0 -340.052 0 1224.02 0 -426.42 0 0 0 2019.79 1320.92 897.473 0 0 0 0 -757.698 0 -1363.95 0 1211.05 0 0 0 0 0 0 0 
0 0 2449.64 0 0 0 0 -113.453 0 2148.12 0 0 -897.473 2488.56 0.08 0 0 681.249 1994.31 711.005 0 0 0 -276.879 0 -878.857 0 0 461.364 0 0 0 0 0 2484.13 0 1095.39 -494.171 0 0 0 0 796.609 0 0 
0 0 0 -532.472 0 0 1076.92 1643.19 -1399.04 0 -582.369 0 0 1768.01 0 0.07 0 -2184.59 2412.87 0 -2293.24 0 0 0 0 2429.2 0 0 0 0 0 -1485.26 0 0 0 -1964.71 1173.06 0 0 1398.74 0 -18.6926 0 0 0 
0 0 0 0 0 0 0 1272.55 606.174 0 0 801.035 -1414.46 0 0 0 0.03 0 0 0 0 -646.763 1944.41 0 -790.506 0 2488.56 0 59.5874 0 0 0 0 0 0 0 2409.21 0 0 550.478 0 0 -207.144 0 0 
1636.02 1889.02 0 0 654.851 0 0 0 0 0 0 0 0 0 -2187.03 -845.744 0 0.03 1968.67 0 1268.58 0 0 0 0 640.812 1539.43 -1699.96 0 0 0 0 0 0 0 -1523.1 0 0 0 0 0 0 1086.23 2166.28 0 
0 0 0 1036.48 0 0 0 0 0 0 532.014 0 0 -1829.66 181.509 2370.45 0 2369.99 0.09 0 2343.13 0 852.153 1253.62 0 0 0 -1889.78 2066.03 1518.37 -1268.27 0 381.863 439.085 -1623.81 2432.4 0 0 -352.565 0 0 0 -831.706 0 0 
-477.233 219.199 -413.907 0 0 1735.05 -270.928 0 0 0 0 0 1309.63 0 -1482.82 0 0 0 0 0 0 2058.4 0 0 0 0 -14.7252 0 0 0 -806.68 0 0 0 0 -1180.53 0 0 0 0 0 -536.897 0 0 0 
0 0 0 0 0 -1788.31 0 0 -1868.11 0 0 0 0 1285.06 0 -1656.93 0 445.647 -872.6 0 0.04 0 0 0 0 0 0 0 0 1398.89 2364.96 0 0 0 0 -104.144 1734.9 0 0 0 0 0 0 0 0 
0 0 538.881 -697.424 0 0 0 0 0 0 0 -2080.83 0 0 0 0 2173.76 0 0 1361.2 0 0.04 1495.48 1192.13 0 0 0 0 0 0 0 1862.16 -1613.9 0 0 0 0 0 -267.876 0 0 1704.54 0 0 0 
2051.99 0 0 0 0 0 0 0 0 0 0 0 2131.49 -2060.53 0 0 -1469.7 0 2359 0 0 1132.01 0.03 0 0 -373.012 0 0 2191.76 0 0 0 0 -168.081 0 2001.17 0 0 -297.479 0 0 0 0 0 704.138 
0 -734.504 2341.15 -18.0822 0 0 2442.63 -236.442 0 1709.27 0 0 0 0 2173.15 0 0 0 -754.494 0 0 1176.56 0 0.08 2131.03 0 0 0 0 0 0 0 0 0 0 0 0 1829.2 -1615.88 649.663 49.8215 0 0 0 0 
2187.64 0 0 0 106.586 0 0 0 0 1192.89 0 1685.61 0 0 0 0 765.633 0 0 0 0 0 0 -684.606 0.05 0 -591.067 0 0 0 0 0 0 0 0 0 0 2489.32 0 0 0 0 1643.8 0 0 
0 0 0 0 1541.87 0 0 0 0 0 0 0 1834.7 0 1378.29 -2022.69 0 -1333.89 0 0 0 0 92.7 0 0 0.08 0 0 0 0 0 0 0 0 0 -859.63 0 0 0 0 1606.27 0 0 0 860.393 
0 -2379.76 0 0 0 608.768 0 2152.55 -2391.35 -2227.62 -560.854 0 0 2304.07 0 0 1224.17 797.83 0 2416.38 0 0 0 0 1336.79 0 0.08 0 0 0 0 1763.89 871.227 0 0 0 -1075.7 0 0 0 0 2275.08 0 0 0 
0 0 1016.19 0 -349.666 -484.71 2005.29 -355.617 987.503 0 0 0 0 -1572.7 0 0 0 725.044 1856.36 0 0 0 0 0 0 0 0 0.01 0 0 0 0 0 0 0 2400.05 0 2166.43 0 0 0 0 0 0 0 
0 185.934 1524.32 0 0 0 -436.949 0 0 2172.99 87.3592 0 0 404.447 1509.83 0 2268.52 0 1484.34 0 0 0 1574.07 0 0 0 0 0 0.03 0 0 0 431.913 0 0 0 0 30.137 0 0 0 0 0 0 0 
-59.2822 0 0 0 314.722 1927.63 384.762 122.15 1023.36 995.743 1848.12 0 0 0 0 0 0 0 5.11185 0 1007.03 0 0 0 0 0 0 0 0 0.02 0 0 0 0 0 -1384.4 0 0 0 0 0 0 0 0 -2408.6 
1918.78 0 2378.84 0 0 0 0 0 645.848 -18.2348 -1581.55 -414.518 2109.67 0 0 0 0 0 1576.05 470.214 2323.45 0 0 0 0 0 0 0 0 0 0 0 192.953 0 0 0 0 0 0 0 0 0 1475.49 0 -2219.23 
0 0 0 0 0 0 0 0 0 0 0 2140.8 0 0 0 -224.54 0 0 0 0 0 2062.67 0 0 0 0 -120.624 0 0 0 0 0 0 0 0 0 0 0 0 0 0 0 0 81.4081 0 
0 239.189 0 0 0 0 1093.4 150.685 0 0 0 0 0 0 0 0 0 0 -1228.14 0 0 -1321.83 0 0 0 0 1834.85 0 2208.85 0 507.599 0 0.01 0 2378.69 -535.066 0 -2319.94 1108.2 0 0 0 0 0 0 
0 0 -1539.58 0 0 0 0 0 2182.45 0 0 -1096.3 1934.19 -1092.18 0 0 0 0 1523.56 0 0 0 -79.577 0 0 0 0 0 0 0 0 0 0 0.02 -513.092 1146.66 0 0 0 0 0 0 1938.46 28.9163 0 
0 0 0 0 0 0 0 -413.297 0 1816.54 0 0 0 0 2119.89 0 0 0 1528.9 0 0 0 0 0 0 0 0 0 0 0 0 0 -929.518 -1100.27 0.01 490.509 612.43 0 0 0 2176.35 -1935.41 0 0 0 
0 0 -461.058 0 0 0 0 -275.048 0 0 349.971 431.303 0 -1930.22 0 -18.54 0 1529.51 2253.26 1266.9 2077.47 0 -787.454 0 0 -2126.3 0 -1806.47 0 -1162.22 0 0 1432.77 1008.56 1213.8 0.06 134.663 -436.644 0 0 0 0 0 0 0 
0 0 0 0 -1618.63 0 0 -2374.11 0 293.664 937.605 1890.24 0 0 1394.01 335.322 1263.39 0 0 0 1015.27 0 0 0 0 0 -2431.64 0 0 0 0 0 0 0 -230.033 2449.03 0.02 0 29.5267 -1266.59 0 0 0 0 0 
0 0 0 0 0 -1113.39 -1104.54 2181.84 -1318.48 0 0 0 0 -702.612 -1595.74 0 0 0 0 0 0 0 0 -477.233 1687.75 0 0 837.352 167.47 0 0 0 1793.34 0 0 1698.43 0 0.03 0 2445.22 1183.43 0 0 0 0 
0 0 0 0 0 1258.05 0 0 154.958 596.408 1333.12 -505.463 0 0 0 0 0 0 -780.282 0 0 -2078.08 -116.657 1499.15 0 0 0 0 0 0 0 0 -1010.7 0 0 0 -221.335 0 0.09 0 0 0 477.538 0 0 
0 0 0 0 0 0 1939.53 -425.657 1844.61 0 0 0 0 0 0 701.239 465.484 0 0 0 0 0 0 1662.57 0 0 0 0 0 0 0 0 0 0 0 0 -1158.71 -1832.71 0 0.05 0 2073.35 0 0 0 
0 0 -188.528 0 0 0 0 0 0 0 1309.63 -2341.91 1994.61 0 0 0 0 0 0 0 0 0 0 -123.829 0 733.284 0 0 0 0 0 0 0 0 67.5222 0 0 1816.39 0 0 0.03 800.729 0 0 0 
0 137.562 0 0 0 0 -71.7948 -829.417 0 -1540.8 0 1220.97 959.426 0 0 -1178.7 0 0 0 200.125 0 425.352 0 0 0 0 2203.51 0 0 0 0 0 0 0 1484.19 0 0 0 0 2425.23 -1287.8 0.03 -853.526 0 0 
0 0 0 0 0 0 0 0 0 0 0 -1525.54 -2357.63 0 -1471.07 0 1917.1 751.9 -74.8466 0 0 0 0 0 -631.047 0 0 0 0 0 2264.85 0 0 2009.72 0 0 0 0 1572.39 0 0 -16.4037 0.08 248.65 0 
0 0 0 0 0 0 0 0 0 0 0 0 0 0 0 0 0 2234.18 0 0 0 0 0 0 0 0 0 0 0 0 0 2059.16 0 213.706 0 0 0 0 0 0 0 0 -760.598 0.08 0 
0 0 0 0 0 0 0 0 0 2353.97 0 0 0 0 0 0 0 0 0 0 0 0 1074.02 0 0 -490.509 0 0 0 163.045 810.648 0 0 0 0 0 0 0 0 0 0 0 0 0 0.05 
