*Vertices 81
*Matrix 
0.01 0 1078.6 0 689.337 0 0 143.971 0 -484.863 0 0 0 0 1691.11 0 959.273 0 0 0 249.565 -756.935 -820.719 0 0 0 0 0 0 0 0 -555.361 0 0 0 1148.34 0 0 0 0 0 0 0 0 0 939.589 0 0 -883.587 0 0 0 0 0 0 0 0 0 0 0 -1349.3 0 0 0 0 0 0 0 0 0 0 0 0 0 0 0 0 0 0 0 0 
0 0.02 0 1320.76 0 2210.07 0 0 0 0 0 0 0 -1020.16 0 0 2180.62 -117.115 0 0 0 0 0 0 2402.95 0 2082.81 0 0 -374.081 0 -545.442 0 0 0 -2001.94 0 0 0 0 -1186.64 0 1962.87 -1133.99 0 0 0 0 0 0 0 0 0 -1804.48 0 0 0 0 0 0 2389.52 0 0 0 0 0 0 0 0 0 0 0 0 0 0 0 0 0 0 0 0 
2045.73 0 0.06 0 1022.9 6.94296 1922.74 0 0 326.624 0 0 0 -995.438 864.666 0 2227.77 0 0 0 0 0 0 2265.62 0 0 0 0 0 0 0 0 0 0 0 0 0 0 0 0 -845.439 0 0 0 0 0 2424.16 0 0 0 0 0 0 0 425.962 0 -1553.47 991.012 0 0 -2468.57 0 0 0 0 0 623.569 0 0 0 0 0 0 0 0 0 0 0 0 0 0 
0 997.269 0 0.05 0 0 0 0 447.63 0 -2054.43 0 0 0 0 411.161 0 0 0 -974.837 0 0 0 0 2022.54 0 0 0 0 0 0 0 0 0 0 1835.31 -809.275 0 0 220.725 0 2427.37 1031.6 0 0 0 660.192 0 0 0 0 2376.09 0 -209.891 0 0 -1100.42 0 0 0 0 0 0 2145.68 0 0 0 0 0 0 0 0 0 -1617.71 -234.764 0 0 0 0 0 1523.71 
-857.036 0 -2286.37 0 0.06 2053.82 0 0 2158.8 0 0 0 0 1391.11 0 0 0 0 463.652 2121.42 0 0 0 1161.76 1778.08 0 0 0 85.8333 0 0 0 0 946.15 0 0 0 0 0 0 0 0 0 1289.03 0 0 0 0 0 -1769.39 0 0 0 964.156 0 0 0 -2184.74 0 0 0 857.341 0 0 0 -1209.37 0 0 0 0 0 -1015.73 0 0 0 0 2087.24 0 0 406.583 0 
0 439.238 -338.984 0 1508.76 0.06 -962.325 0 -1938.46 -172.201 0 0 0 1756.57 1742.38 1732.76 0 0 0 0 0 0 0 0 0 0 0 0 0 0 0 -1781.9 -1382.26 0 1197.01 0 0 0 0 0 1734.75 0 2235.56 0 0 0 0 2349.39 0 1655.25 0 0 0 0 0 0 0 0 0 0 0 0 0 0 0 396.207 -2066.33 0 0 0 0 0 0 0 0 0 -281.915 0 0 1487.85 0 
0 0 1697.82 0 0 1468.17 0.01 0 0 1976 -2491.76 0 0 0 0 0 0 0 0 0 0 0 0 0 0 -477.081 0 0 0 1964.25 0 0 0 0 -622.044 0 0 -671.789 0 0 0 -1768.93 -1215.78 0 0 0 0 0 0 0 0 0 0 0 0 0 0 0 1194.11 -71.9474 0 0 0 0 0 0 0 0 0 0 0 0 0 0 0 0 0 0 0 0 0 
1314.66 0 0 0 0 0 0 0.09 0 868.328 0 0 0 1851.94 0 0 0 0 0 0 -1417.97 0 0 0 0 0 0 807.749 2208.85 0 0 2475.74 0 0 0 0 1900.46 0 0 -1356.32 0 0 0 -1918.78 0 0 0 0 1146.05 0 0 2424.31 0 0 0 0 0 0 0 0 0 0 2047.26 0 0 0 0 0 0 0 0 0 0 0 0 0 0 0 0 0 0 
0 0 0 1952.04 564.516 1457.95 0 0 0.05 0 0 0 0 531.251 2446.44 0 0 0 -1096.45 632.115 0 -1535.92 -1802.96 2495.88 55.1622 0 0 0 0 0 0 0 0 0 0 0 0 0 0 -17.4718 0 2335.05 -685.064 -2131.95 0 0 0 0 0 0 1757.33 0 0 0 0 0 -1558.35 0 -816.294 0 0 1718.73 0 0 0 0 981.552 0 -1915.11 0 2275.69 0 0 0 0 0 0 0 1848.58 0 -470.824 
607.852 0 371.792 0 0 971.633 -1827.52 2055.35 0 0.03 0 1957.53 0 0 0 0 0 0 0 1707.13 -1662.11 0 0 0 0 0 1992.63 1151.39 0 0 2482.76 -548.494 0 0 0 0 402.768 -447.935 0 0 0 0 0 0 0 0 0 0 -2385.25 0 1880.78 0 0 0 0 -366.756 0 0 0 0 0 0 0 0 0 0 0 1765.88 -2140.95 -2097.92 0 0 0 0 0 0 0 1698.89 0 0 0 
0 0 0 -2398.22 0 0 765.786 0 0 0 0 0 0 0 0 0 0 0 0 0 0 0 0 0 0 0 0 0 0 -1649.14 -339.9 -282.678 755.867 1916.94 0 0 0 0 0 0 0 0 0 0 0 0 0 0 0 0 0 0 0 0 1606.27 0 0 0 0 1539.74 0 0 0 0 0 0 0 0 0 0 0 0 0 0 0 0 0 0 0 0 0 
0 0 0 0 0 0 0 0 0 781.808 0 0.08 1983.32 0 -997.879 1092.79 0 0 -1598.48 0 0 133.29 0 0 0 2363.89 1329.77 0 0 0 0 626.316 0 0 0 139.088 0 0 1085.62 0 0 0 0 0 0 0 0 0 0 2209.01 0 0 0 0 0 95.294 0 0 0 0 0 0 0 0 0 0 1620.61 0 0 0 0 0 0 0 0 0 628.91 0 0 0 0 
0 0 0 0 0 0 0 0 0 0 0 -225.913 0.09 0 0 664.769 0 0 0 0 -321.131 718.177 -817.362 0 -723.67 1657.38 993.454 1864.91 0 0 -2014.15 0 0 0 0 0 0 0 2303.31 0 0 0 0 2101.28 2353.21 -1501.59 0 0 0 0 0 0 0 0 0 0 0 0 0 1032.36 0 0 -1204.34 0 0 565.127 0 0 0 0 0 0 1106.37 0 0 0 0 -1383.33 0 0 0 
0 1124.53 1108.97 0 1199.15 1071.73 0 618.992 1359.37 0 0 0 0 0.06 0 0 0 0 0 1773.05 0 -2062.36 0 0 0 0 411.924 0 0 0 -161.061 -531.098 0 0 0 0 0 0 0 -1770.76 0 0 1409.88 0 0 -773.263 0 0 0 0 0 0 0 -102.161 0 0 -2005.91 0 0 0 0 0 0 0 0 0 0 0 1201.74 0 0 0 0 0 0 0 0 0 0 0 0 
2295.98 0 2.82296 0 0 1631.14 0 0 -1675.39 0 0 978.805 0 0 0 26.017 0 1246.76 0 0 0 0 0 0 -563.753 0 0 0 0 0 0 -64.1652 0 0 1426.97 0 0 0 0 -2162.92 0 1497.01 0 1324.88 0 0 0 0 1166.34 0 0 -33.3415 -122.15 0 0 0 0 0 0 0 0 0 0 0 0 0 0 0 0 1063.04 2446.9 0 0 0 0 0 0 0 0 0 0 
0 0 0 -1914.96 0 1203.73 0 0 0 0 0 -30.9 1939.99 0 2232.81 0.08 0 0 0 0 1188.92 0 0 0 0 -2351.99 -873.058 0 0 1424.38 432.218 -503.479 1633.73 0 0 0 0 0 0 0 0 114.673 0 0 0 0 0 0 448.546 0 0 0 0 0 0 -539.796 0 1008.71 1803.42 2175.74 0 0 0 0 0 0 -340.358 0 -2096.39 0 0 0 0 0 0 0 0 0 0 0 472.808 
891.064 -1888.26 -1110.64 0 0 0 0 0 0 0 0 0 0 0 0 0 0.03 0 0 0 0 0 -674.841 0 0 1196.25 0 436.033 0 1675.85 0 0 0 1328.85 0 0 0 0 0 0 0 0 0 0 0 0 0 0 0 0 0 0 0 0 0 -384.762 0 0 -673.62 0 -1828.44 0 0 0 0 0 2151.48 0 0 0 0 0 0 0 0 0 0 0 0 0 0 
0 1907.48 0 0 0 0 0 0 0 0 0 0 0 0 481.964 0 0 0.07 -1580.48 1832.1 0 0 0 -433.439 1256.83 -1230.28 0 0 2044.66 1761.45 0 658.513 -267.724 0 0 0 1485.72 0 0 0 0 0 0 2035.66 0 0 0 0 0 0 824.534 0 0 0 0 0 0 0 0 0 0 0 0 0 820.566 841.014 0 0 0 0 0 0 0 0 0 0 0 0 0 0 0 
0 0 0 0 2227.62 0 0 0 481.201 0 0 -2205.34 0 0 0 0 0 1102.71 0.04 0 0 0 0 0 0 0 0 0 0 0 0 -1519.29 0 -1384.85 0 0 0 0 0 650.121 0 0 0 2255.39 -13.8096 0 0 0 0 0 0 0 0 0 0 0 0 0 0 0 0 0 0 0 0 0 0 0 0 0 0 0 0 1915.11 0 0 0 2084.49 0 0 0 
0 0 0 -966.14 -887.249 0 0 0 2403.56 2008.96 0 0 0 301.599 0 0 0 611.667 0 0.08 0 0 2426.15 883.892 0 0 0 0 0 0 1749.7 720.771 0 0 0 1610.69 0 0 0 0 0 0 0 0 0 0 435.27 0 1530.43 0 0 543.306 0 0 0 0 0 0 0 0 0 0 0 130.543 0 0 0 0 0 0 0 0 0 0 0 0 0 0 -433.744 0 -168.081 
1410.64 0 0 0 0 0 0 570.162 0 545.595 0 0 1657.54 0 0 1896.95 0 0 0 0 0.02 2408.6 93.1578 2396.24 0 0 -1877.42 -1267.97 429.167 1542.48 0 735.878 0 0 0 0 0 0 1450.62 825.755 0 0 0 0 0 0 -142.445 0 0 0 0 0 0 0 0 0 0 2190.08 1472.59 0 0 0 0 0 0 0 0 0 0 0 0 0 0 0 0 0 0 0 2310.63 0 0 
-1506.32 0 0 0 0 0 0 0 1341.21 0 0 1077.07 -1319.7 -1220.05 0 0 0 0 0 0 2343.13 0.04 0 0 0 0 0 0 0 0 0 1878.8 0 0 0 0 0 0 391.934 -1912.21 1968.98 0 0 0 563.906 0 0 0 0 0 0 0 927.534 0 0 0 0 0 0 0 0 0 -266.808 0 0 0 2155.14 0 0 0 0 0 -1258.2 212.027 0 -937.147 0 0 0 0 0 
368.892 0 0 0 0 0 0 0 38.6822 0 0 0 -47.38 0 0 0 1887.65 0 0 1130.33 1577.27 0 0.06 -1042.28 0 0 0 0 0 0 0 0 1610.84 0 0 0 0 956.679 -92.3948 0 0 0 0 2221.37 0 0 0 0 0 0 0 0 0 -2129.51 0 0 0 0 0 0 -638.981 0 0 0 0 0 0 0 0 0 0 0 0 0 0 0 0 0 0 0 0 
0 0 1850.87 0 2135 0 0 0 -1171.68 0 0 0 0 0 0 0 0 1426.66 0 870.006 -1340.75 0 2449.64 0.02 0 0 0 0 0 0 0 0 0 -486.236 0 0 0 0 1967.3 0 0 0 1002.46 0 -1183.28 2238 0 0 0 -2426.3 0 0 -234.306 347.377 0 0 0 0 0 0 -1601.84 0 0 0 0 0 0 0 0 0 -2367.24 0 0 1770.15 0 -2434.84 0 0 0 0 0 
0 269.25 0 -2126.61 1064.1 0 0 0 2360.68 0 0 0 -8.1637 0 1703.77 0 0 461.821 0 0 0 0 0 0 0.02 0 0 0 0 0 0 1122.39 0 0 0 0 0 0 0 0 0 0 0 0 837.046 0 0 0 0 -1630.53 0 0 0 2143.85 0 0 0 0 0 0 0 0 0 1828.14 0 0 0 2139.73 0 0 0 0 0 -1952.65 0 0 1324.12 0 0 0 0 
0 0 0 0 0 0 -901.593 0 0 0 0 1820.81 -284.967 0 0 245.14 2415.31 -1898.63 0 0 0 0 0 0 0 0.09 0 0 0 0 -667.516 0 0 1331.75 0 0 0 0 0 0 2200 0 2050.77 0 544.832 0 -1859.11 0 0 0 0 0 -1111.1 0 0 0 0 0 0 0 0 418.943 0 521.638 0 0 0 0 -468.383 0 0 0 0 0 -632.267 0 0 0 0 0 0 
0 2025.59 0 0 0 0 0 0 0 1215.17 0 -1556.22 635.472 469.298 0 1829.81 0 0 0 0 373.012 0 0 0 0 0 0.07 0 0 -432.066 0 0 0 0 0 -831.401 0 0 0 0 0 0 0 0 0 0 0 0 0 0 0 0 0 0 0 0 0 0 0 0 2440.95 0 0 0 0 0 0 0 0 0 0 0 0 0 0 2484.28 0 0 0 0 0 
0 0 0 0 0 0 0 1364.25 0 360.195 0 0 -486.541 0 0 0 2423.86 0 0 0 900.372 0 0 0 0 0 0 0.03 0 0 0 -1019.09 0 0 0 2297.36 0 -2046.65 0 0 0 0 0 -2213.13 0 0 571.23 0 -2159.26 0 0 0 0 0 665.532 0 0 0 0 0 0 0 2424.92 0 0 0 0 0 0 0 0 0 0 0 219.199 0 0 0 -1894.51 0 0 
0 0 0 0 665.99 0 0 2138.97 0 0 0 0 0 0 0 0 0 233.085 0 0 -232.475 0 0 0 0 0 0 0 0 1291.31 0 0 0 0 0 0 0 0 -1331.45 0 -1525.85 0 0 0 0 0 0 1405.45 0 0 0 0 0 0 0 0 0 0 0 0 0 0 0 0 0 0 0 0 0 0 0 0 0 0 0 479.217 0 0 0 0 -2448.12 
0 2213.13 0 0 0 0 1389.13 0 0 0 1206.02 0 0 0 0 772.5 903.577 1574.07 0 0 1158.56 0 0 0 0 0 1780.98 0 -726.417 0.04 1152.76 -1163.59 -274.59 0 0 0 0 0 321.894 -881.298 0 0 0 0 -3.28074 0 0 0 736.946 0 0 0 0 0 595.035 0 0 0 -2009.87 0 0 0 0 0 0 0 0 -1097.52 0 0 -1510.9 0 0 0 0 24.1859 -370.876 0 -67.5222 0 0 
0 0 0 0 0 0 0 0 0 -863.903 -852.611 0 993.454 -2349.39 0 -1614.51 0 0 0 1920 0 0 0 0 0 -1709.88 0 0 0 1495.33 0.01 0 0 0 1409.57 0 0 471.435 0 1253.47 0 878.094 0 0 1395.23 0 0 0 0 -615.482 0 0 0 0 0 0 0 0 0 0 0 0 0 0 0 0 0 0 782.266 0 0 0 0 0 0 0 0 0 0 0 0 
1032.06 -647.679 0 0 0 2027.12 0 499.817 0 2239.68 2437.28 -806.68 0 1392.79 745.796 -1316.8 0 500.885 -217.368 1061.66 1373.71 552.461 0 0 1172.9 0 0 1126.82 0 -399.106 0 0.07 555.513 0 0 -1639.38 0 0 0 -709.937 0 -323.267 -1897.41 0 0 0 -941.42 0 0 0 2131.34 0 -2118.52 0 0 0 0 0 1294.82 0 0 2135.76 0 0 0 625.401 0 0 0 0 0 0 0 0 -871.99 0 0 0 0 0 0 
0 0 0 0 0 -234.306 0 0 0 0 -469.146 0 0 0 0 8.77407 0 2196.34 0 0 0 0 2239.98 0 0 0 0 0 0 -640.965 0 71.0318 0.08 0 0 0 0 -293.512 0 1967.91 -1103.47 0 -1000.32 0 -823.771 0 0 0 0 0 1697.82 0 0 0 0 0 0 2463.68 0 0 0 0 0 0 0 0 0 0 0 893.506 0 0 0 0 0 536.744 0 0 0 -480.438 -1156.73 
0 0 0 0 698.187 0 0 0 0 0 -148.396 0 0 0 0 0 -469.756 0 1093.86 0 0 0 0 -503.021 0 1233.33 0 0 0 0 0 0 0 0.03 0 0 567.873 1511.05 0 0 0 0 0 0 0 0 0 0 0 -27.3904 0 2432.71 0 0 -932.417 0 0 0 0 0 0 0 0 0 1233.33 -983.688 0 0 0 0 0 0 0 -1605.5 0 0 0 0 0 0 0 
0 0 0 0 0 1045.03 647.679 0 0 0 0 0 0 0 488.22 0 0 0 0 0 0 0 0 0 0 0 0 0 0 0 2405.85 0 0 0 0.04 0 142.598 0 0 0 0 0 0 2261.65 0 0 0 -983.535 0 1656.01 0 0 0 0 355.464 0 0 0 0 2081.9 0 0 0 0 0 0 0 0 0 0 0 -768.838 0 0 0 1280.33 0 0 0 0 0 
1690.19 996.963 0 785.012 0 0 0 0 0 0 0 366.298 0 0 0 0 0 0 0 -1559.42 0 0 0 0 0 0 -956.069 819.041 0 0 0 1460.69 0 0 0 0.01 0 0 0 0 1548.59 -462.737 2480.93 0 0 0 0 0 0 0 0 -817.972 0 219.962 0 0 0 0 1987.9 0 296.564 0 1489.84 326.624 0 0 0 0 0 0 0 0 0 0 0 0 0 0 0 0 0 
0 0 0 677.892 0 0 0 -1656.16 0 1459.47 0 0 0 0 0 0 0 405.057 0 0 0 0 0 0 0 0 0 0 0 0 0 0 0 -1294.82 1959.97 0 0.08 -296.106 1414.76 0 0 0 0 0 0 0 0 0 -442.9 0 0 0 0 0 0 0 0 0 0 0 0 0 740.303 0 0 0 0 0 0 0 0 0 0 0 0 0 0 0 0 0 0 
0 0 0 0 0 0 1404.84 0 0 -821.94 0 0 0 0 0 0 0 0 0 0 0 0 1179.62 0 0 0 0 -492.645 0 0 2486.11 0 1127.58 -521.027 0 0 3.12815 0.04 0 0 0 0 1856.06 -495.392 0 0 -753.426 0 1763.59 0 0 0 0 0 0 0 0 -969.955 0 1800.52 0 0 0 0 0 0 0 0 0 0 0 -1982.25 0 0 0 0 0 0 0 0 0 
0 0 0 0 0 0 0 0 0 0 0 1520.2 -2076.56 0 0 0 0 0 0 0 985.672 -2276.15 244.377 -442.289 0 0 0 0 1410.49 1151.39 0 0 0 0 0 0 402.158 0 0.05 0 0 0 0 0 0 0 0 0 0 0 0 -324.793 0 0 0 0 0 0 2216.79 0 0 2021.16 0 0 0 -2100.51 -192.953 1282.46 0 0 -1830.58 0 0 0 0 0 0 0 0 0 0 
0 0 0 -1376.16 0 0 0 -72.7104 1483.89 0 0 0 0 2372.74 -1516.69 0 0 0 2324.82 0 716.803 523.011 0 0 0 0 0 0 0 1246.15 -1845.84 -468.23 1321.99 0 0 0 0 0 0 0.07 0 0 1148.49 -1871.01 0 0 0 0 0 0 0 0 0 0 0 0 0 2376.71 0 0 0 0 0 0 0 295.495 0 0 0 0 0 0 -2121.57 0 0 0 0 0 1769.23 330.592 0 
0 1444.82 454.039 0 0 2439.57 0 0 0 0 0 0 0 0 0 0 0 0 0 0 0 744.27 0 0 0 -713.141 0 0 -781.961 0 0 0 760.598 0 0 2184.59 0 0 0 0 0 0 0 0 0 -579.165 0 0 0 0 0 0 0 0 0 0 0 0 0 0 0 0 0 0 0 0 0 0 0 0 0 -1067.31 0 0 0 0 0 0 0 0 2365.11 
0 0 0 2072.44 0 0 -168.538 0 -828.349 0 0 0 0 0 -1473.36 1366.7 0 0 0 0 0 0 0 0 0 0 0 0 0 0 2237.08 941.267 0 0 0 616.398 0 0 0 0 0 0.06 0 0 0 624.638 0 0 0 0 0 0 -821.787 0 -91.174 0 0 0 0 0 0 0 0 0 0 0 0 2.21259 0 -639.897 0 -377.59 0 0 0 0 0 0 0 0 0 
0 1871.01 0 1223.87 0 559.481 1957.23 0 -2151.78 0 0 0 0 748.238 0 0 0 0 0 0 0 0 0 1271.48 0 1792.28 0 0 0 0 0 -1328.24 2179.4 0 0 -346.309 0 1920.76 0 1084.55 0 0 0.03 0 0 0 0 855.358 0 0 0 1482.97 0 0 0 0 0 0 0 0 0 0 0 0 0 0 0 0 0 0 0 0 0 0 0 0 0 0 0 0 0 
0 2148.73 0 0 -1343.35 0 0 -255.974 -473.876 0 0 0 -175.71 0 581.912 0 0 1005.66 1231.19 0 0 0 -2444 0 0 0 0 2181.08 0 0 0 0 0 0 -1894.21 0 0 1856.52 0 2289.73 0 0 0 0.08 0 0 0 0 -1587.8 0 0 0 0 0 0 -16.5563 0 0 0 0 489.135 0 0 0 0 0 0 0 0 0 0 0 0 0 0 0 0 0 0 0 0 
0 0 0 0 0 0 0 0 0 0 0 0 -834.452 0 0 0 0 0 -1442.69 0 0 340.663 0 2310.63 -261.773 262.993 0 0 0 1719.79 188.223 0 2008.19 0 0 0 0 0 0 0 0 0 0 0 0 0 0 -785.165 0 0 0 0 916.395 0 0 0 0 0 -682.623 0 0 0 0 -723.67 449.614 0 0 0 0 0 0 0 0 1228.75 0 0 -2292.02 0 0 0 0 
1606.42 0 0 0 0 0 0 0 0 0 0 0 -873.669 -302.362 0 0 0 0 0 0 0 0 0 2185.05 0 0 0 0 0 0 0 0 0 0 0 0 0 0 0 0 1371.27 1162.83 0 0 0 0.07 0 0 0 -494.324 0 0 1282.92 1343.81 0 0 0 0 0 0 823.923 883.587 0 0 0 0 0 0 0 0 0 0 0 0 0 0 0 0 0 0 0 
0 0 2247.61 -1367.76 0 0 0 0 0 0 0 0 0 0 0 0 0 0 0 1222.19 -690.1 0 0 0 0 -1413.85 0 2125.08 0 0 0 -2010.79 0 0 0 0 0 1924.12 0 0 0 0 0 0 0 0 0.04 0 0 0 2066.48 0 0 0 0 0 0 0 0 1404.23 0 0 1621.22 0 0 0 0 0 0 0 0 0 0 0 0 0 0 0 0 0 0 
0 0 0 0 0 621.586 0 0 0 0 0 0 0 0 0 0 0 0 0 0 0 0 0 0 0 0 0 0 -994.217 0 0 0 0 0 1281.24 0 0 0 0 0 0 0 -635.777 0 1824.32 0 0 0.03 0 0 0 24.0333 0 0 640.965 0 0 0 0 0 0 0 0 0 0 0 0 0 0 0 0 0 -623.722 0 0 0 0 0 0 0 0 
1311.91 0 0 0 0 0 0 -121.693 0 2272.64 0 0 0 0 2154.53 -2067.55 0 0 0 1.44963 0 0 0 0 0 0 0 -510.651 0 -2245.48 0 0 0 0 0 0 -356.99 2461.39 0 0 0 0 0 2242.73 0 0 0 0 0.09 0 0 0 0 0 0 0 0 0 0 0 0 0 0 0 0 0 0 0 0 0 0 0 0 0 0 0 0 597.934 0 0 0 
0 0 0 0 1465.42 2289.42 0 0 0 0 0 -1216.54 0 0 0 0 0 0 0 0 0 0 0 -1328.09 -1066.39 0 0 0 0 0 -1121.94 0 0 852 2111.04 0 0 0 0 0 0 0 0 0 0 1789.38 0 0 0 0.01 2003.92 0 0 0 0 1322.29 0 0 0 0 0 0 0 0 0 0 0 0 1601.08 0 0 0 0 0 0 0 0 0 0 0 0 
0 0 0 0 0 0 0 0 -2038.56 2288.81 0 0 0 0 0 0 0 1265.37 0 0 0 0 0 0 0 0 0 0 0 0 0 2385.71 -404.447 0 0 0 0 0 0 0 0 0 0 0 0 0 570.009 0 0 -1624.12 0.06 0 0 0 0 0 0 0 0 0 0 0 0 1301.69 0 0 1235.62 0 0 0 0 0 0 0 0 2437.74 -2293.08 0 0 0 0 
0 0 0 -1648.69 0 0 0 2364.96 0 0 0 0 0 0 2473.45 0 0 0 0 -212.638 0 0 0 0 0 0 0 0 0 0 0 0 0 499.969 0 -762.581 0 0 562.075 0 0 0 2171.16 0 0 0 0 -2176.35 0 0 0 0.09 0 0 0 0 0 0 0 0 0 0 0 0 1191.37 0 0 0 0 0 0 2392.42 -1698.13 0 0 0 0 0 0 0 0 
0 0 0 0 0 0 0 0 0 0 0 0 0 0 1327.63 0 0 0 0 0 0 243.614 0 -783.029 0 -1596.19 0 0 0 0 0 89.9533 0 0 0 0 0 0 0 0 0 157.094 0 0 2420.96 654.698 0 0 0 0 0 0 0.09 0 0 0 0 0 0 0 0 0 0 0 0 153.432 0 0 1711.86 0 0 0 0 0 -908.307 0 0 0 0 0 0 
0 -1460.69 0 2326.35 752.968 0 0 0 0 0 0 0 0 1448.94 0 0 0 0 0 0 0 0 -358.364 1450.01 1532.56 0 0 0 0 0 0 0 0 0 0 -1639.38 0 0 0 0 0 0 0 0 0 -325.251 0 0 0 0 0 0 0 0.09 0 1396.15 -1942.27 0 0 0 0 0 0 0 0 0 0 0 0 0 0 0 -902.051 0 0 0 0 0 0 0 0 
0 0 630.284 0 0 0 0 0 0 0 1820.35 0 0 0 0 0 0 0 0 0 0 0 0 0 0 0 0 2367.4 0 739.998 0 0 0 -1752.45 1974.62 0 0 0 0 0 0 975.448 0 0 0 0 0 -1161.46 0 0 0 0 0 0 0.05 0 0 0 0 0 0 0 0 0 1011.31 0 0 0 0 0 -1508.91 0 0 -548.799 0 0 0 0 0 0 0 
0 0 0 0 0 0 0 0 0 1931.44 0 2281.33 0 0 0 -776.315 1920.3 0 0 0 0 0 0 0 0 0 0 0 0 0 0 0 0 0 0 0 0 0 0 0 0 0 0 1804.94 0 0 0 0 0 -1847.97 0 0 0 -327.693 0 0.02 0 0 0 0 0 0 0 0 0 0 -1069.29 0 0 0 0 0 0 0 883.892 -467.467 0 0 0 0 0 
0 0 -1138.87 799.661 0 0 0 0 259.331 0 0 0 0 712.683 0 0 0 0 0 0 0 0 0 0 0 0 0 0 0 0 0 0 0 0 0 0 0 0 0 0 0 0 0 0 0 0 0 0 0 0 0 0 0 976.211 0 0 0.08 0 0 0 0 0 0 0 0 0 0 0 0 0 0 589.999 0 0 0 0 0 0 0 0 0 
0 0 688.726 0 1057.39 0 0 0 0 0 0 0 0 0 0 743.202 0 0 0 0 831.706 0 0 0 0 0 0 0 0 0 0 0 -1582.31 0 0 0 0 2171.01 0 1903.97 0 0 0 0 0 0 0 0 0 0 0 0 0 0 0 0 0 0.08 0 0 0 0 0 0 0 0 0 0 0 -1120.72 0 0 0 0 0 0 0 0 0 -2052.29 0 
0 0 0 0 0 0 791.269 0 -203.33 0 0 0 0 0 0 1618.32 1603.98 0 0 0 1096.15 0 0 0 0 0 0 0 0 2307.43 0 1918.47 0 0 0 1840.8 0 0 -1557.74 0 0 0 0 0 916.089 0 0 0 0 0 0 0 0 0 0 0 0 0 0.04 0 -93.1578 -1462.52 0 0 0 0 0 0 0 0 0 0 0 0 1501.74 0 0 0 -2159.72 0 0 
0 0 0 0 0 0 1885.66 0 0 0 1293.6 0 886.792 0 0 -792.795 0 0 0 0 0 0 0 0 0 0 0 0 0 0 0 0 0 0 2153.61 0 0 1089.89 0 0 0 0 0 0 0 0 1777.63 0 0 0 0 0 0 0 0 0 0 0 0 0.09 0 0 126.576 0 0 0 0 0 0 0 0 0 0 0 0 0 0 0 0 0 0 
-2378.99 1670.96 1511.81 0 0 0 0 0 0 0 0 0 0 0 0 0 1170.77 0 0 0 0 0 -2293.85 1834.54 0 0 -582.064 0 0 0 0 0 0 0 0 -1855.75 0 0 0 0 0 0 0 2230.83 0 1795.02 0 0 0 0 0 0 0 0 0 0 0 0 2382.2 0 0 0 0 0 0 0 0 0 0 0 0 0 0 0 0 0 0 0 0 0 0 
0 0 0 0 -772.195 0 0 0 1271.02 0 0 0 0 0 0 0 0 0 0 0 0 0 0 0 0 2435 0 0 0 0 0 -2097.46 0 0 0 0 0 0 1369.29 0 0 0 0 0 0 -1273.31 0 0 0 0 0 0 0 0 0 0 0 0 1119.8 0 0 0.04 0 0 0 0 -1445.13 -1200.67 0 0 0 0 0 0 0 0 0 0 0 0 0 
0 0 0 0 0 0 0 -2350.15 0 0 0 0 2108.29 0 0 0 0 0 0 0 0 1269.95 0 0 0 0 0 1210.29 0 0 0 0 0 0 0 759.377 2415.46 0 0 0 0 0 0 0 0 0 -814.768 0 0 0 0 0 0 0 0 0 0 0 0 -728.248 0 0 0.09 0 0 0 0 0 0 0 0 0 0 0 0 0 0 0 0 0 0 
0 0 0 529.572 0 0 0 0 0 0 0 0 0 0 0 0 0 0 0 1022.9 0 0 0 0 2248.22 897.015 0 0 0 0 0 0 0 0 0 -299.615 0 0 0 0 0 0 0 0 853.679 0 0 0 0 0 -1406.06 0 0 0 0 0 0 0 0 0 0 0 0 0.01 0 -481.506 -1484.65 0 0 0 0 0 0 0 0 0 0 0 0 1386.99 0 
0 0 0 0 0 0 0 0 0 0 0 0 0 0 0 0 0 -1368.37 0 0 0 0 0 0 0 0 0 0 0 0 0 0 0 1957.38 0 0 0 0 0 0 0 0 0 0 -137.867 0 0 0 0 0 0 -792.642 0 0 2498.02 0 0 0 0 0 0 0 0 0 0.04 0 0 0 0 0 0 0 0 0 0 -2276.6 0 392.697 0 0 0 
0 0 0 0 1090.81 -2413.33 0 0 0 0 0 0 581.759 0 0 0 0 -1469.08 0 0 0 0 0 0 0 0 0 0 0 0 0 649.205 0 2255.39 0 0 0 0 1348.99 1687.14 0 0 0 0 0 0 0 0 0 0 0 0 1996.75 0 0 0 0 0 0 0 0 0 0 1265.37 0 0.07 0 0 0 0 0 0 0 0 0 0 0 0 0 0 0 
0 0 -1778.24 0 0 1814.25 0 0 -2007.58 0 0 345.088 0 0 0 1701.48 1950.97 0 0 0 0 1323.97 0 0 0 0 0 0 0 0 0 0 0 0 0 0 0 0 -1777.63 0 0 0 0 0 0 0 0 0 0 0 2305.44 0 0 0 0 671.331 0 0 0 0 0 1264.15 0 1598.64 0 0 0.03 0 0 0 0 0 0 0 0 0 0 0 0 0 0 
0 0 0 0 0 0 0 0 0 855.205 0 0 0 0 0 0 0 0 0 0 0 0 0 0 -621.586 0 0 0 0 224.387 0 0 0 0 0 0 0 0 568.178 0 0 686.895 0 0 0 0 0 0 0 0 0 0 0 0 0 0 0 0 0 0 0 1138.72 0 0 0 0 0 0.04 0 0 0 0 0 0 0 0 0 806.528 0 0 539.033 
0 0 0 0 0 0 0 0 52.7207 -1534.55 0 0 0 -1054.34 0 1243.25 0 0 0 0 0 0 0 0 0 193.411 0 0 0 0 1468.63 0 0 0 0 0 0 0 0 0 0 0 0 0 0 0 0 0 0 1514.86 0 0 2046.19 0 0 0 0 0 0 0 0 0 0 0 0 0 0 0 0 0 0 0 0 0 0 0 0 0 0 0 0 
0 0 0 0 0 0 0 0 0 1923.05 0 0 0 0 985.214 0 0 0 0 0 0 0 0 0 0 0 0 0 0 0 0 0 -141.377 0 0 0 0 0 0 0 0 1943.19 0 0 0 0 0 0 0 0 0 0 0 0 0 0 0 -1264.31 0 0 0 0 0 0 0 0 0 0 0 0 0 0 1822.64 0 0 0 0 0 0 0 0 
0 0 0 0 0 0 0 0 2275.08 0 0 0 0 0 1731.24 0 0 0 0 0 0 0 0 -726.417 0 0 0 0 0 -1938.15 0 0 0 0 0 0 0 0 2378.08 0 0 0 0 0 0 0 0 0 0 0 0 0 0 0 1918.78 0 0 0 0 0 0 0 0 0 0 0 0 0 0 0 0.09 0 0 -421.995 0 0 0 0 0 0 2267.14 
0 0 0 0 297.327 0 0 0 0 0 0 0 0 0 0 0 0 0 0 0 0 0 0 0 0 0 0 0 0 0 0 0 0 0 -917.158 0 0 123.218 0 0 -1280.48 72.1 0 0 0 0 0 0 0 0 0 889.386 0 0 0 0 1974.01 0 0 0 0 0 0 0 0 0 0 0 0 0 0 0.07 0 0 0 0 0 0 0 0 0 
0 0 0 0 0 0 0 0 0 0 0 0 2282.25 0 0 0 0 0 0 0 0 91.4792 0 0 0 0 0 0 0 0 0 0 0 0 0 0 0 0 0 2427.06 0 0 0 0 0 0 0 357.906 0 0 0 -1533.48 0 -2448.88 0 0 0 0 0 0 0 0 0 0 0 0 0 0 0 1191.21 0 0 0.08 0 0 0 0 0 0 0 0 
0 0 0 -2450.25 0 0 0 0 0 0 0 0 0 0 0 0 0 0 -1718.88 0 0 1643.04 0 2303.46 90.1059 0 0 0 0 0 0 0 0 1772.29 0 0 0 0 0 0 0 0 0 0 854.595 0 0 0 0 0 0 0 0 0 1984.39 0 0 0 0 0 0 0 0 0 0 0 0 0 0 0 146.718 0 0 0.02 0 0 0 0 0 0 0 
0 0 0 -725.959 0 0 0 0 0 0 0 0 0 0 0 0 0 0 0 0 0 0 0 0 0 1048.39 0 1284.91 0 0 0 648.137 0 0 0 0 0 0 0 0 0 0 0 0 0 0 0 0 0 0 0 0 1803.26 0 0 -1562.62 0 0 -182.424 0 0 0 0 0 0 0 0 0 0 0 0 0 0 0 0.09 0 2453.92 0 0 150.533 0 
0 0 0 0 0 0 0 0 0 0 0 0 0 0 0 0 0 0 0 0 0 861.003 0 1187.7 0 0 -100.482 0 -308.466 2103.72 0 0 -856.578 0 -129.78 0 0 0 0 0 0 0 0 0 0 0 0 0 0 0 2293.24 0 0 0 0 -1476.1 0 0 0 0 0 0 0 0 1062.88 0 0 0 0 0 0 0 0 0 0 0.07 0 -1675.39 0 0 0 
0 0 0 0 -1133.23 1403.93 0 0 0 0 0 2059.62 0 0 0 0 0 0 0 0 0 0 0 0 2254.48 0 0 0 0 1784.19 0 0 0 0 0 0 0 0 0 0 0 0 0 0 -2350.61 0 0 0 0 0 -380.49 0 0 0 0 0 0 0 0 0 0 0 0 0 0 0 0 0 0 0 0 0 0 0 -2023 0 0.01 0 0 0 0 
0 0 0 0 0 0 0 0 0 -2084.49 0 0 2489.62 0 0 0 0 0 1080.74 0 0 0 0 0 0 0 0 0 0 0 0 0 0 0 0 0 0 0 0 0 0 0 0 0 0 0 0 0 1133.23 0 0 0 0 0 0 0 0 0 0 0 0 0 0 0 1401.18 0 0 437.559 0 0 0 0 0 0 0 861.309 0 0 0 0 0 
0 0 0 0 0 0 0 0 324.183 0 0 0 0 0 0 0 0 0 0 -789.285 215.995 0 0 0 0 0 0 -1276.67 0 2093.8 0 0 0 0 0 0 0 0 0 -833.842 0 0 0 0 0 0 0 0 0 0 0 0 0 0 0 0 0 0 1288.87 0 0 0 0 0 0 0 0 0 0 0 0 0 0 0 0 0 0 0 0.03 0 0 
0 0 0 0 1033.43 -2329.55 0 0 0 0 0 0 0 0 0 0 0 0 0 0 0 0 0 0 0 0 0 0 0 0 0 0 -561.769 0 0 0 0 0 0 1287.19 0 0 0 0 0 0 0 0 0 0 0 0 0 0 0 0 0 2477.11 0 0 0 0 0 1462.07 0 0 0 0 0 0 0 0 0 0 -973.617 0 0 0 0 0.08 1018.78 
0 0 0 -1005.66 0 0 0 0 131.764 0 0 0 0 0 0 1214.87 0 0 0 -863.445 0 0 0 0 0 0 0 0 366.604 0 0 0 1034.2 0 0 0 0 0 0 0 994.522 0 0 0 0 0 0 0 0 0 0 0 0 0 0 0 0 0 0 0 0 0 0 0 0 0 0 243.614 0 0 -1077.38 0 0 0 0 0 0 0 0 -432.218 0.02 
