*Vertices 52
*Matrix 
0 0 -2036.27 0 -1382.56 0 0 0 0 0 0 0 0 0 0 567.11 0 0 0 0 0 0 0 0 0 0 0 0 0 2361.29 0 0 0 0 56.6881 0 0 0 1453.22 0 -2268.21 0 0 0 449.461 0 0 0 0 0 0 1456.11 
0 0.04 -496.307 0 0 0 0 0 0 0 1080.43 0 -1230.12 0 0 0 0 0 0 0 0 2393.8 0 0 0 0 0 0 0 0 0 0 2351.37 0 0 0 0 -1708.2 0 0 0 0 0 574.74 -2202.6 0 0 -86.7489 0 2122.03 522.401 0 
-428.404 856.426 0 0 0 0 199.667 0 0 0 0 0 0 0 -1545.38 0 917.463 0 0 0 -1803.57 2043.75 0 0 0 0 0 -42.3444 0 0 0 0 0 0 0 0 0 0 0 0 0 0 0 0 0 -594.424 0 0 2156.36 0 0 -71.7948 
0 0 0 0.02 0 0 0 1042.89 0 0 0 0 0 0 0 0 0 0 0 0 -895.184 0 1083.64 2442.63 0 0 0 0 0 0 0 0 0 0 0 0 0 0 0 0 0 0 0 0 0 -1255.76 0 0 0 0 0 0 
-2149.49 0 0 0 0 0 0 0 0 0 1059.37 0 0 0 0 0 0 -1770.61 2102.65 0 0 0 0 0 0 0 0 0 0 0 0 0 0 0 1676 815.378 0 0 0 0 0 0 0 0 0 0 0 0 0 0 0 0 
0 0 0 0 0 0.01 185.324 0 0 0 0 0 0 0 0 0 0 0 0 0 0 0 0 0 0 0 0 -597.781 0 2096.39 0 0 -85.8333 0 0 0 0 0 0 0 0 0 0 0 0 0 1263.24 0 0 0 0 0 
0 0 865.581 0 0 2359.46 0.01 0 0 0 0 0 0 1505.25 0 0 0 0 0 0 0 0 0 0 2198.78 0 0 0 -1620.61 0 0 1906.57 0 0 -942.946 0 0 -11.8259 -397.58 0 0 0 0 -197.226 0 0 0 0 0 0 0 0 
0 0 0 -1065.48 0 0 0 0.04 217.826 0 0 0 0 0 0 0 0 0 0 0 -1281.09 0 0 0 0 0 0 0 0 0 0 0 0 0 0 0 0 0 1817 0 0 0 0 1179.46 0 0 0 0 1054.49 0 0 0 
0 0 0 0 0 0 0 1443.75 0.01 0 -2219.08 0 0 0 0 0 0 0 0 0 0 0 0 0 0 0 0 0 0 0 0 0 0 0 0 0 0 0 0 2455.75 0 0 0 0 0 0 0 0 0 0 0 0 
0 0 0 0 0 0 0 0 0 0 0 0 0 0 0 0 0 0 0 0 0 0 0 0 0 0 0 -1436.43 0 0 858.867 0 0 0 0 0 0 857.341 0 0 0 -1834.85 0 0 0 0 0 0 0 0 0 0 
0 2335.51 0 0 -1566.9 0 0 0 610.752 0 0.01 0 1606.57 0 0 0 1718.12 -403.684 0 0 0 0 0 0 0 0 0 0 -2047.26 0 0 0 -870.769 0 0 0 0 0 1081.5 -1937.24 0 0.228889 0 0 0 0 0 0 0 2416.23 0 0 
0 0 0 0 0 0 0 0 0 0 0 0.09 0 0 0 1570.86 -1089.28 0 0 0 0 0 0 0 2127.83 2416.23 0 0 -1838.66 0 0 0 0 0 0 0 0 0 1538.67 0 0 0 0 -943.098 -2298.43 0 0 0 0 0 1968.67 0 
0 404.447 0 0 0 0 0 0 0 0 1088.37 0 0.01 0 0 0 0 0 0 0 0 1936.17 0 0 0 0 0 0 0 0 0 0 0 0 0 0 0 0 0 0 0 0 0 -429.624 0 0 -82.0185 0 0 0 0 0 
0 0 0 0 0 0 2472.84 0 0 0 0 0 0 0.01 0 0 0 0 -478.759 0 0 0 0 0 0 0 0 0 0 -797.525 0 0 0 0 0 0 0 0 0 0 0 -1986.37 0 2144.76 0 0 0 0 -1480.22 0 0 0 
0 0 2275.84 0 0 0 0 0 0 0 0 0 0 0 0.07 0 0 0 0 0 0 -1679.82 0 0 0 0 0 0 0 0 0 0 0 0 0 0 0 2089.53 0 0 0 0 247.887 0 0 0 0 0 0 0 1558.35 0 
2352.44 0 0 0 0 0 0 0 0 0 0 -1772.13 0 0 0 0.03 0 785.012 0 0 0 0 0 0 0 529.267 0 -686.895 0 0 0 0 0 1706.52 185.781 0 0 0 0 0 0 0 1024.89 0 0 0 0 0 0 0 2230.67 0 
0 0 -1530.88 0 0 0 0 0 0 0 -28.7637 2124.62 0 0 0 0 0.07 0 -2165.36 1126.51 0 0 0 0 0 0 0 0 0 2221.06 0 0 0 0 0 176.626 0 0 0 0 0 0 0 0 0 2300.56 -852.458 2271.11 -342.036 0 0 0 
0 0 0 0 -1554.54 0 0 0 0 0 2239.68 0 0 0 0 1596.5 0 0.09 0 0 0 0 2404.78 0 0 0 0 0 0 0 0 765.175 0 0 -1274.22 0 0 0 0 0 0 0 0 0 0 0 970.717 0 0 1124.99 0 0 
0 0 0 0 -591.983 0 0 0 0 0 0 0 0 -263.146 0 0 1022.45 0 0.09 0 0 0 0 0 552.461 0 0 0 0 0 0 0 0 0 0 0 0 0 0 1904.13 0 0 0 0 0 0 -1607.33 0 0 -407.193 0 0 
0 0 0 0 0 0 0 0 0 0 0 0 0 0 0 0 2419.43 0 0 0.06 0 -843.455 -2092.27 0 1101.64 0 0 0 1682.26 0 0 0 0 0 715.735 0 0 0 0 0 227.897 1836.38 0 0 0 0 0 0 0 106.128 0 0 
0 0 1922.74 -2036.58 0 0 0 486.389 0 0 0 0 0 0 0 0 0 0 0 0 0.04 0 0 0 0 0 0 0 0 0 0 2388.3 0 -1554.08 2059.92 0 0 0 0 0 0 0 -1352.5 0 0 0 0 691.931 0 0 0 0 
0 -596.103 634.556 0 0 0 0 0 0 0 0 0 806.833 0 -1268.27 0 0 0 0 932.112 0 0.08 0 0 0 2166.28 0 0 0 0 0 0 0 0 0 0 0 0 0 0 0 0 0 0 0 0 0 2464.14 0 0 0 0 
0 0 0 -725.654 0 0 0 0 0 0 0 0 0 0 0 0 0 2097.92 0 -477.691 0 0 0.05 0 0 -1108.81 0 0 0 0 1457.34 0 0 0 0 0 0 0 0 0 0 0 0 0 0 0 0 0 0 2160.18 0 0 
0 0 0 -1574.37 0 0 0 0 0 0 0 0 0 0 0 0 0 0 0 0 0 0 0 0 0 0 0 0 -892.59 0 -1433.84 2335.96 0 0 0 -528.047 0 0 0 0 0 2231.74 0 112.232 0 1933.73 0 0 0 0 0 0 
0 0 0 0 0 0 -420.774 0 0 0 0 -723.975 0 0 0 0 0 0 166.86 -2254.94 0 0 0 0 0.05 0 0 0 0 0 0 0 0 0 0 489.441 0 0 904.492 0 0 0 0 0 0 0 2270.96 0 0 0 1694.46 0 
0 0 0 0 0 0 0 0 0 0 0 1511.66 0 0 0 2335.81 0 0 0 0 0 2469.63 302.362 0 0 0.01 78.3563 0 -381.1 0 0 0 0 0 1142.08 0 0 0 0 0 1671.12 -65.3859 0 0 1250.11 0 0 0 0 0 0 0 
0 0 0 0 0 0 0 0 0 0 0 0 0 0 0 0 0 0 0 0 0 0 0 0 0 2236.47 0.09 0 0 0 0 0 0 0 0 -1520.2 0 1827.98 0 1875.13 0 0 0 744.575 0 0 960.494 0 0 0 0 2015.06 
0 0 794.626 0 0 1807.38 0 0 0 -1595.89 0 0 0 0 0 -2377.77 0 0 0 0 0 0 0 0 0 0 0 0.08 0 0 0 0 0 0 0 0 -683.538 0 0 0 0 0 1382.72 0 0 0 0 2288.66 0 0 0 0 
0 0 0 0 0 0 1510.13 0 0 0 2414.55 439.238 0 0 0 0 0 0 0 -2474.82 0 0 0 228.507 0 -178.61 0 0 0.04 0 0 0 0 0 0 0 0 0 2355.65 0 0 -1889.78 0 0 0 -1029.01 0 0 0 0 0 0 
2466.73 0 0 0 0 1159.02 0 0 0 0 0 0 0 877.941 0 0 -1549.04 0 0 0 0 0 0 0 0 0 0 0 0 0.04 -1448.94 0 0 0 0 0 0 0 0 0 0 0 0 0 665.685 2366.79 1147.57 0 0 0 0 700.171 
0 0 0 0 0 0 0 0 0 1570.41 0 0 0 0 0 0 0 0 0 0 0 0 2464.6 -2362.36 0 0 0 0 0 343.867 0.03 113.758 9.84222 0 0 0 0 0 0 383.084 0 0 0 0 379.421 0 0 0 0 0 0 0 
0 0 0 0 0 0 0.686666 0 0 0 0 0 0 0 0 0 0 1985 0 0 -643.254 0 0 1090.04 0 0 0 0 0 0 -325.404 0.02 0 0 0 0 0 0 0 0 0 0 1810.74 0 0 0 0 0 2044.36 0 0 0 
0 -2339.78 0 0 0 1219.75 0 0 0 0 -720.008 0 0 0 0 0 0 0 0 0 0 0 0 0 0 0 0 0 0 0 324.183 0 0.09 0 364.467 0 0 437.254 0 0 0 0 938.368 0 0 377.285 0 0 0 0 0 0 
0 0 0 0 0 0 0 0 0 0 0 0 0 0 0 1938.76 0 0 0 0 2399.9 0 0 0 0 0 0 0 0 0 0 0 0 0.06 0 0 1645.48 2385.86 1633.43 0 0 0 0 0 0 0 -1544.92 -995.285 0 0 0 0 
38.5296 0 0 0 863.75 0 2106.62 0 0 0 0 0 0 0 0 1293.45 0 -1865.37 0 2314.91 1407.13 0 0 0 0 359.279 0 0 0 0 0 0 504.7 0 0.03 -2002.7 0 0 0 0 0 0 0 -1981.19 0 0 0 0 0 0 0 0 
0 0 0 0 2389.98 0 0 0 0 0 0 0 0 0 0 0 -600.681 0 0 0 0 0 0 483.642 -912.58 0 -2337.34 0 0 0 0 0 0 0 2277.37 0.04 0 -78.814 0 0 0 0 0 0 0 0 0 0 -427.793 0 0 0 
0 0 0 0 0 0 0 0 0 0 0 0 0 0 0 0 0 0 0 0 0 0 0 0 0 0 0 2467.96 0 0 0 0 0 -1483.28 0 0 0.05 0 0 0 -618.992 0 0 0 0 0 0 0 0 0 0 0 
0 930.433 0 0 0 0 785.623 0 0 1113.39 0 0 0 0 -1094.62 0 0 0 0 0 0 0 0 0 0 0 964.461 0 0 0 0 0 1088.37 2418.52 0 -1467.86 0 0.01 0 0 0 0 0 0 0 0 0 0 0 0 0 0 
2451.02 0 0 0 0 0 2332.61 -78.5089 0 0 232.475 -519.349 0 0 0 0 0 0 0 0 0 0 0 0 2403.87 0 0 0 -234.764 0 0 0 0 -126.27 0 0 0 0 0.01 0 0 0 0 0 0 0 1048.84 0 0 0 -1990.19 0 
0 0 0 0 0 0 0 0 815.378 0 1798.07 0 0 0 0 0 0 0 2447.36 0 0 0 0 0 0 0 2213.13 0 0 0 857.189 0 0 0 0 0 0 0 0 0.06 0 0 0 0 0 2090.59 0 0 0 0 0 0 
-2120.81 0 0 0 0 0 0 0 0 0 0 0 0 0 0 0 0 0 0 -964.461 0 0 0 0 0 1977.52 0 0 0 0 0 0 0 0 0 0 2064.2 0 0 0 0.05 0 0 0 0 0 0 0 0 0 0 0 
0 0 0 0 0 0 0 0 0 1035.57 2467.65 0 0 -2342.52 0 0 0 0 0 674.535 0 0 0 1097.83 0 148.244 0 0 956.526 0 0 0 0 0 0 0 0 0 0 0 0 0.04 0 0 0 0 0 0 0 0 0 0 
0 0 0 0 0 0 0 0 0 0 0 0 0 0 2146.44 -1049 0 0 0 0 961.867 0 0 0 0 0 0 425.504 0 0 0 -1574.22 984.603 0 0 0 0 0 0 0 0 0 0.04 0 0 0 177.694 0 0 0 0 0 
0 -872.448 0 0 0 0 2238.91 1279.26 0 0 0 -1868.11 1474.12 -56.0778 0 0 0 0 0 0 0 0 0 -1936.17 0 0 -527.284 0 0 0 0 0 0 0 1097.37 0 0 0 0 0 0 0 0 0 0 0 0 0 0 0 0 0 
-964.156 797.372 0 0 0 0 0 0 0 0 0 -1078.3 0 0 0 0 0 0 0 0 0 0 0 0 0 1480.68 0 0 0 2107.53 790.963 0 0 0 0 0 0 0 0 0 0 0 0 0 0.08 0 1432.77 0 0 0 0 0 
0 0 939.436 -1114.61 0 0 0 0 0 0 0 0 0 0 0 0 1309.47 0 0 0 0 0 0 844.981 0 0 0 0 2463.38 1986.53 0 0 1429.26 0 0 0 0 0 0 -79.577 0 0 0 0 0 0.08 0 0 0 0 0 0 
0 0 0 0 0 1487.4 0 0 0 0 0 0 2360.53 0 0 0 1482.82 411.924 -290.765 0 0 0 0 0 2474.97 0 -461.821 0 0 272.301 0 0 0 -2456.05 0 0 0 0 630.894 0 0 0 2423.09 0 -1506.62 0 0.07 -1944.41 0 0 0 0 
0 1106.98 0 0 0 0 0 0 0 0 0 0 0 0 0 0 1677.22 0 0 0 1924.57 1969.13 0 0 0 0 0 -1844.92 0 0 0 0 0 -1087.91 0 0 0 0 0 0 0 0 0 0 0 0 1894.67 0.01 0 0 0 0 
0 0 352.26 0 0 0 0 2235.71 0 0 0 0 0 1633.27 0 0 -666.143 0 0 0 0 0 0 0 0 0 0 0 0 0 0 1498.54 0 0 0 188.376 0 0 0 0 0 0 0 0 0 0 0 0 0.08 0 0 0 
0 1465.58 0 0 0 0 0 0 0 0 554.14 0 0 0 0 0 0 -1186.03 1606.88 1269.65 0 0 -257.5 0 0 0 0 0 0 0 0 0 0 0 0 0 0 0 0 0 0 0 0 0 0 0 0 0 0 0.07 0 0 
0 647.984 0 0 0 0 0 0 0 0 0 420.621 0 0 877.331 1751.53 0 0 0 0 0 0 0 0 1228.75 0 0 0 0 0 0 0 0 0 0 0 0 0 -1757.94 0 0 0 0 0 0 0 0 0 0 0 0.03 0 
-541.78 0 296.716 0 0 0 0 0 0 0 0 0 0 0 0 0 0 0 0 0 0 0 0 0 0 0 -817.972 0 0 1492.74 0 0 0 0 0 0 0 0 0 0 0 0 0 0 0 0 0 0 0 0 0 0 
