*Vertices 61
*Matrix 
0.04 0 0 0 -2056.72 0 0 762.123 0 588.931 0 0 0 0 0 0 0 0 1091.72 0 0 0 0 0 508.362 0 0 0 0 0 0 -1382.26 0 0 94.6837 0 -1116.6 2120.96 0 -296.564 1684.7 1601.99 0 0 0 0 0 -517.212 0 0 0 0 0 0 0 0 256.737 877.026 0 0 0 
0 0.05 0 1615.57 0 0 0 0 0 0 82.6289 -2352.44 0 0 1012.99 0 -1445.74 0 0 -1408.96 2496.34 0 0 0 0 0 0 1513.95 2390.59 0 0 0 0 0 0 0 0 0 -1486.79 -1751.23 1812.27 0 1455.2 0 0 0 0 0 0 0 0 0 0 0 0 0 0 0 0 0 0 
0 0 0.02 0 2178.18 0 2102.5 0 0 286.34 0 0 -560.091 -718.024 0 0 0 0 -404.599 0 0 0 -426.267 0 0 0 -32.2733 0 0 0 0 1326.41 0 0 0 0 0 1967.15 2416.53 1504.49 0 0 0 0 0 0 0 -2161.4 327.845 0 2096.85 0 0 0 0 0 1282.31 0 0 0 -2213.43 
0 -999.71 0 0.04 0 0 15.4881 0 0 0 0 2238.46 1959.06 0 0 0 1449.71 747.627 0 0 0 0 0 0 0 0 0 0 0 0 0 0 0 0 -1971.27 0 -2184.44 0 1256.37 0 -170.217 0 0 0 0 0 0 0 0 0 0 0 0 0 249.565 0 0 0 0 0 0 
636.692 0 1931.44 0 0.03 -1705.15 2068.77 0 0 0 1140.55 0 -1200.67 0 0 0 -587.558 0 0 661.565 0 0 0 0 0 0 0 2205.5 0 1410.18 0 0 0 0 2426.76 -1284.6 0 0 0 750.374 0 0 0 0 0 0 -4.65407 0 -1487.09 0 0 0 0 0 0 0 0 0 1547.67 0 0 
0 0 0 0 1425.29 0.03 1219.75 0 957.595 0 0 0 0 0 153.432 -1249.81 0 0 0 0 0 0 -906.629 0 1698.13 0 -842.235 0 0 0 2325.59 0 0 0 0 1574.37 0 -362.331 0 0 0 -2147.82 1071.43 0 0 0 772.5 0 0 0 0 0 -2480.01 0 1328.55 1687.29 0 0 0 0 -606.632 
0 0 -563.601 1297.72 1156.27 -932.569 0.06 0 0 0 0 0 0 0 0 0 0 0 2169.48 0 0 0 0 58.3666 0 0 0 0 0 2474.97 0 0 0 -2448.58 0 0 0 2229.61 0 557.344 0 0 0 0 259.941 0 0 0 0 0 0 0 0 0 0 0 0 0 410.092 0 0 
82.1711 0 0 0 0 0 0 0.09 0 0 0 0 0 0 0 0 0 -333.491 0 1505.4 -805.46 0 0 617.618 1493.04 0 1392.33 1326.26 952.864 0 0 0 0 -2477.72 0 1566.13 204.398 0 -591.372 0 0 0 0 0 2021.93 0 0 0 0 0 0 0 0 0 0 244.072 0 469.298 0 0 0 
0 0 0 0 0 -1061.66 0 0 0.03 1312.52 0 0 0 1842.63 0 0 -324.183 -1467.56 0 0 0 0 0 1675.39 2.21259 0 0 1913.28 0 0 0 0 -196.463 0 0 0 0 -987.655 0 0 0 0 0 0 0 0 0 0 0 0 0 0 0 0 0 0 0 0 0 0 0 
-1817.76 0 1964.4 0 0 0 0 0 -1065.78 0.09 457.091 0 1808.3 0 79.7296 0 0 0 0 1433.38 0 361.11 0 -172.353 2374.42 0 0 1164.2 0 0 2113.79 0 0 1627.93 0 0 0 0 0 0 0 0 0 0 0 0 0 0 -1616.34 1482.97 0 -647.374 -1856.36 0 0 0 0 0 0 0 0 
0 323.42 0 0 1509.22 0 0 0 0 -266.961 0.09 0 1370.2 0 0 0 0 0 0 0 0 733.131 0 0 0 1324.58 0 0 0 1690.19 0 0 0 0 0 0 1030.23 -2085.1 0 0 -110.401 -784.249 0 -1597.42 0 0 0 0 0 0 0 0 0 0 0 0 0 0 0 0 0 
0 2095.63 0 2399.9 0 0 0 0 0 0 0 0.03 0 0 2427.37 0 0 0 2389.52 0 0 0 0 0 0 1467.71 0 0 65.6911 0 0 0 0 0 0 0 -441.069 0 0 0 0 611.515 0 0 0 0 0 0 0 0 0 0 0 -2248.07 0 0 0 0 0 2309.11 0 
0 0 2303.77 2221.37 -649.663 0 0 0 0 1742.38 2479.71 0 0.05 0 0 1543.7 0 0 0 0 0 0 0 98.6511 -1927.63 0 -60.6555 0 0 0 0 0 0 0 0 0 0 0 0 0 0 1701.48 0 0 0 0 0 0 0 0 0 0 0 0 -194.174 0 0 0 0 0 0 
0 0 -355.617 0 0 0 0 0 1085.92 0 0 0 0 0.08 0 0 0 0 0 680.639 0 0 0 0 0 0 0 0 0 0 490.509 0 0 0 -210.807 0 0 1084.7 0 0 0 0 0 0 0 0 0 0 0 0 0 0 -1765.11 0 0 0 0 0 0 0 0 
0 -1746.35 0 0 0 -1194.11 0 0 0 -2241.66 0 -423.826 0 0 0.02 0 0 0 1200.06 530.946 0 1204.03 1200.22 0 0 0 2461.7 1638.16 0 0 0 0 0 0 0 0 0 0 1932.97 0 0 0 2270.5 0 0 0 -760.14 0 0 0 0 0 0 0 0 0 0 0 0 0 0 
0 0 0 0 0 1681.04 0 0 0 0 0 0 2158.65 0 0 0.06 0 0 0 0 -373.775 0 0 0 0 0 0 0 1898.63 0 0 0 0 140.614 1864.91 461.211 0 0 0 1375.55 0 -2092.43 0 0 0 0 0 0 0 0 0 0 0 0 0 0 0 0 0 0 -732.215 
0 596.255 0 2279.81 -2142.78 0 0 0 1846.45 0 0 0 0 0 0 0 0.08 1844.46 0 0 0 0 0 1058.76 0 1519.59 0 0 0 0 121.082 0 0 -1980.27 524.384 0 0 0 0 0 -553.529 -1255.61 0 -141.987 0 0 0 0 0 0 0 0 0 0 -1888.56 0 0 0 0 0 0 
0 0 0 1901.38 0 0 0 162.74 -2402.95 0 0 0 0 0 0 0 356.99 0.08 0 0 0 0 0 0 0 0 0 0 2219.99 0 0 0 0 -618.686 0 0 507.141 0 962.477 0 0 2197.87 0 0 0 -587.252 0 0 0 -242.088 0 0 0 0 0 0 0 0 0 0 0 
484.1 0 -827.891 0 0 0 -713.752 0 0 0 0 -796.609 0 0 1438.57 0 0 0 0.01 0 0 -539.644 0 0 0 0 0 0 0 0 -43.7178 0 0 2129.05 1955.55 0 0 0 860.546 0 0 0 0 0 0 0 0 0 0 0 0 0 0 0 0 0 0 0 0 0 0 
0 -1422.7 0 0 -1843.24 0 0 -981.704 0 635.624 0 0 0 -522.095 647.832 0 0 0 0 0.09 0 0 2353.05 0 0 0 0 0 0 906.629 -466.094 0 0 0 2476.81 0 1369.9 -771.737 2427.37 -1680.43 1081.65 0 0 0 0 0 0 0 0 -842.845 0 0 0 0 0 0 0 0 0 0 0 
0 -2407.53 0 0 0 0 0 65.9963 0 0 0 0 0 0 0 56.6881 0 0 0 0 0.06 0 0 -1109.27 0 2156.97 559.786 0 0 1365.93 0 0 0 0 0 -1603.06 0 2474.82 0 0 0 0 0 0 0 0 0 0 0 0 0 0 0 0 0 0 0 0 0 0 0 
0 0 0 0 0 0 0 0 0 -2120.66 337.001 0 0 0 735.267 0 0 0 1106.52 0 0 0.04 0 877.636 0 0 0 2225.79 0 0 0 0 0 0 -2446.75 0 0 1943.49 0 0 0 0 0 0 0 0 0 0 0 0 2245.02 0 0 0 500.885 0 0 0 0 0 0 
0 0 -1024.12 0 0 459.227 0 0 0 0 0 0 0 0 450.835 0 0 0 0 201.498 0 0 0.04 0 0 1992.48 0 0 0 0 0 488.83 -639.439 0 0 0 0 0 0 0 0 1969.44 0 0 0 0 0 0 0 0 0 0 0 0 0 0 -1425.14 0 0 0 0 
0 0 0 0 0 0 1180.84 1078.75 2103.72 -1439.63 0 0 -1868.57 0 0 0 1526.31 0 0 0 -1999.34 916.089 0 0.08 -1137.35 -337.458 0 0 949.507 923.261 0 2177.72 0 0 0 0 0 986.282 0 -516.755 0 0 0 0 0 0 0 0 0 993.912 0 0 0 0 0 0 1713.39 0 0 0 0 
2012.31 0 0 0 0 1812.57 0 1856.97 1002 274.743 0 0 -1126.21 0 0 0 0 0 0 0 0 0 0 1524.93 0.07 0 0 0 0 0 0 0 0 0 0 0 -2377.93 2393.8 0 -1853.16 -754.189 0 -1358.46 0 0 0 0 0 0 0 0 0 0 0 0 0 0 0 0 0 0 
0 0 0 0 0 0 0 0 0 0 -348.292 1085.16 0 0 0 0 491.272 0 0 0 1274.53 0 2010.18 2126.61 0 0.07 0 0 0 0 0 -1910.69 -1356.93 0 0 1000.32 0 -1705.45 0 589.846 0 0 0 0 0 0 0 0 0 0 0 0 0 0 0 0 0 0 0 0 0 
0 0 1479.77 0 0 614.109 0 -1062.27 0 0 0 0 -141.987 0 -770.363 0 0 0 0 0 1587.95 0 0 0 0 0 0 0 0 0 0 1812.42 -1641.06 0 0 0 -2397.92 2420.19 0 -2004.53 327.387 100.635 1551.03 0 0 0 0 577.792 0 0 0 0 0 0 0 0 0 0 0 0 0 
0 -2448.58 0 0 1213.95 0 0 2354.58 1520.36 -2417.91 0 0 0 0 -2241.97 0 0 0 0 0 0 2463.23 0 0 0 0 0 0.04 0 951.491 0 2230.22 0 0 1211.97 0 0 1362.42 0 1397.82 0 0 0 0 0 0 0 0 0 0 0 -239.952 0 0 0 0 0 0 0 0 0 
0 402.768 0 0 0 0 0 554.292 0 0 0 517.67 0 0 0 960.036 0 -130.543 0 0 0 0 0 -803.629 0 0 0 0 0.01 0 0 75.7622 0 2105.24 0 -1901.99 0 835.826 0 0 739.235 0 -819.651 0 0 0 0 0 -62.1815 1180.84 0 0 0 0 0 0 0 0 0 0 0 
0 0 0 0 1545.99 0 1597.42 0 0 0 1941.05 0 0 0 0 0 0 0 0 998.032 1460.54 0 0 1056.78 0 0 0 2300.1 0 0.04 0 -143.056 0 0 0 0 0 0 0 0 0 0 413.755 0 -1603.37 0 0 0 0 0 0 0 0 0 0 0 0 0 0 0 0 
0 0 0 0 0 605.564 0 0 0 1692.48 0 0 0 2305.29 0 0 2238.15 0 120.472 -2244.56 0 0 0 0 0 0 0 0 0 0 0.06 -1211.51 0 0 2149.95 810.343 0 0 0 341.884 0 0 0 0 0 0 0 0 0 0 0 0 0 0 0 0 0 -2120.04 0 0 0 
-1538.06 0 2490.69 0 0 0 0 0 0 0 0 0 0 0 0 0 0 0 0 0 0 0 2400.81 1646.55 0 668.126 1925.95 -127.491 322.352 2185.81 1252.56 0 0 -2127.98 0 0 0 0 -1828.29 1678.75 0 0 0 0 0 0 0 2253.87 1917.25 0 0 0 0 0 0 0 0 0 618.992 0 0 
0 0 0 0 0 0 0 0 1513.64 0 0 0 0 0 0 0 0 0 0 0 0 0 1783.12 0 0 -881.756 -424.741 0 0 0 0 0 0.04 0 0 1399.81 0 0 1320.46 0 0 0 0 351.65 1800.21 0 0 0 -485.473 0 202.719 1254.69 0 0 0 0 0 -1368.98 0 1909.77 753.578 
0 0 0 0 0 0 2313.84 -546.51 0 -449.309 0 0 0 0 0 759.224 -2307.12 440.764 885.723 0 0 0 0 0 0 0 0 0 1383.33 0 0 860.698 0 0.06 0 0 1898.63 0 0 358.516 0 206.534 0 0 0 0 0 0 0 0 0 0 0 0 0 0 0 680.792 0 -2334.89 0 
2201.07 0 0 -248.955 -1343.65 0 0 0 0 0 0 0 0 1412.47 0 1003.98 -2031.69 0 1334.8 -1101.03 0 -1085.16 0 0 0 0 0 -448.851 0 0 -311.67 0 0 0 0.04 0 2333.98 2421.26 529.115 -27.2378 125.965 -671.331 -1359.83 0 0 0 0 0 0 0 0 0 -2010.79 0 0 0 0 0 0 0 0 
0 0 0 0 2016.28 121.998 0 -1682.87 0 0 0 0 0 0 0 1303.98 0 0 0 0 1148.18 0 0 0 0 1440.24 0 0 807.901 0 2027.12 0 -215.69 0 0 0.01 1084.55 0 0 0 0 -1347.32 0 0 0 1930.83 0 0 0 0 0 0 0 0 0 0 -1326.11 0 0 -393.765 0 
668.737 0 0 -1131.7 0 0 0 -750.679 0 0 -1795.48 580.538 0 0 0 0 0 983.993 0 1891.46 0 0 0 0 -199.21 0 446.257 0 0 0 0 0 0 -385.067 2366.79 -863.445 0.08 -499.359 0 0 180.441 0 0 0 0 0 0 0 0 740.913 0 0 0 0 0 0 0 0 739.54 0 0 
1326.72 0 1963.18 0 0 1408.96 2351.22 0 2037.03 0 1954.18 0 0 1086.54 0 0 0 0 0 -2433.01 -1411.1 565.889 0 -703.986 -1129.72 952.101 -539.186 1036.18 -1883.22 0 0 0 0 0 -644.627 0 1430.94 0.08 -12.4363 0 0 0 0 834.758 0 0 0 0 0 0 0 0 0 1810.13 -1556.83 0 0 0 0 0 0 
0 1276.06 2149.34 2487.95 0 0 0 -169.454 0 0 0 0 0 0 -1690.19 0 0 1652.35 1820.2 -737.404 0 0 0 0 0 0 0 0 0 0 0 2228.08 -1673.56 0 -46.3118 0 0 1787.85 0.07 0 0 0 0 -1603.67 0 0 0 0 0 0 0 0 0 0 0 1094.32 0 0 0 0 0 
-7.70592 2268.82 1665.17 0 1643.19 0 2029.1 0 0 0 0 0 0 0 0 1794.72 0 0 0 19.7607 0 0 0 915.784 -2292.17 1123.62 1883.37 659.734 0 0 -823.008 1194.57 0 1136.74 -1966.23 0 0 0 0 0.09 2291.56 0 866.649 0 0 0 0 0 0 0 0 0 0 0 0 0 0 -1126.36 0 0 0 
1636.94 328.15 0 710.242 0 0 0 0 0 0 575.045 0 0 0 0 0 2158.96 0 0 -2235.56 0 0 0 0 -1284.91 0 1565.52 0 656.835 0 0 0 0 0 -117.573 0 2322.99 0 0 2299.95 0.01 -810.648 0 0 0 0 1998.43 0 0 0 0 0 0 0 0 -2342.68 0 0 -1107.29 0 1781.75 
-1150.78 0 0 0 0 1371.58 0 0 0 0 -301.447 187.307 -1131.86 0 0 722.755 1443.6 -1815.47 0 0 0 0 2426.91 0 0 0 -1958.6 0 0 0 0 0 0 513.245 872.448 -169.149 0 0 0 0 1691.56 0 0 0 0 0 0 0 0 0 0 0 -1468.32 0 0 0 -1093.55 0 0 0 2363.58 
0 2222.13 0 0 0 1729.87 0 0 0 0 0 0 0 0 2078.39 0 0 0 0 0 0 0 0 0 -1226.62 0 2326.96 0 523.621 -805.612 0 0 0 0 -1699.35 0 0 0 0 2288.35 0 0 0.08 2276.76 0 0 0 0 0 833.537 0 0 0 0 0 0 653.478 0 0 0 0 
0 0 0 0 0 0 0 0 0 0 225.15 0 0 0 0 0 2331.84 0 0 0 0 0 0 0 0 0 0 0 0 0 0 0 0.839259 0 0 0 0 -1129.11 1605.2 0 0 0 2365.87 0.09 0 -133.595 0 0 -2060.38 0 0 0 0 0 0 0 0 -520.875 0 0 0 
0 0 0 0 0 0 2114.25 -70.7266 0 0 0 0 0 0 0 0 0 0 0 0 0 0 0 0 0 0 0 0 0 1379.06 0 0 -0.381481 0 0 0 0 0 0 0 0 0 0 0 0.06 0 729.469 0 0 0 0 0 0 0 0 0 0 18.2348 0 0 1855.14 
0 0 0 0 0 0 0 0 0 0 0 0 0 0 0 0 0 180.898 0 0 0 0 0 0 0 0 0 0 0 0 0 0 0 0 0 918.226 0 0 0 0 0 0 0 296.106 0 0 0 0 2177.88 0 1399.66 0 0 0 0 0 2032 0 0 0 0 
0 0 0 0 1612.22 1053.58 0 0 0 0 0 0 0 0 385.372 0 0 0 0 0 0 0 0 0 0 0 0 0 0 0 0 0 0 0 0 0 0 0 0 0 1909.77 0 0 0 -777.078 0 0.05 0 0 2076.86 0 0 0 0 0 0 0 0 0 0 0 
1267.05 0 2074.72 0 0 0 0 0 0 0 0 0 0 0 0 0 0 0 0 0 0 0 0 0 0 0 -931.043 0 0 0 0 1430.63 0 0 0 0 0 0 0 0 0 0 0 0 0 0 0 0.04 0 0 -335.17 0 -1016.95 0 0 0 0 0 0 1715.22 0 
0 0 1626.1 0 -966.292 0 0 0 0 -409.787 0 0 0 0 0 0 0 0 0 0 0 0 0 0 0 0 0 0 1115.38 0 0 2427.06 -933.027 0 0 0 0 0 0 0 0 0 0 -575.503 0 -148.396 0 0 0.06 0 0 -1092.49 0 0 0 0 0 0 0 2000.56 0 
0 0 0 0 0 0 0 0 0 2015.06 0 0 0 0 0 0 0 -1993.39 0 886.792 0 0 0 -1531.04 0 0 0 0 1184.19 0 0 0 0 0 0 0 258.721 0 0 0 0 0 830.943 0 0 0 2013.69 0 0 0.09 0 0 0 0 0 0 0 0 0 0 0 
0 0 2051.53 0 0 0 0 0 0 0 0 0 0 0 0 0 0 0 0 0 0 354.091 0 0 0 0 0 0 0 0 0 0 2280.27 0 0 0 0 0 0 0 0 0 0 0 0 1458.1 0 730.995 0 0 0.07 0 0 -593.509 0 517.518 0 0 0 0 0 
0 0 0 0 0 0 0 0 0 961.562 0 0 0 0 0 0 0 0 0 0 0 0 0 0 0 0 0 1588.87 0 0 0 0 193.564 0 0 0 0 0 0 0 0 0 0 0 0 0 0 0 1004.59 0 0 0.09 0 0 0 0 0 0 0 69.0481 0 
0 0 0 0 0 167.776 0 0 0 595.492 0 0 0 1821.42 0 0 0 0 0 0 0 0 0 0 0 0 0 0 0 0 0 0 0 0 1661.2 0 0 0 0 0 0 -1193.66 0 0 0 0 0 -249.26 0 0 0 0 0.09 0 0 0 0 0 0 0 0 
0 0 0 0 0 0 0 0 0 0 0 1896.8 0 0 0 0 0 0 0 0 0 0 0 0 0 0 0 0 0 0 0 0 0 0 0 0 0 -10.1474 0 0 0 0 0 0 0 0 0 0 0 0 334.407 0 0 0.05 0 0 0 -1795.33 0 0 0 
0 0 0 2048.63 0 1317.71 0 0 0 0 0 0 -1926.4 0 0 0 2475.28 0 0 0 0 -419.858 0 0 0 0 0 0 0 0 0 0 0 0 0 0 0 -2422.18 0 0 0 0 0 0 0 0 0 0 0 0 0 0 0 0 0.08 0 0 2230.67 0 0 0 
0 0 0 0 0 1027.33 0 1452.15 0 0 0 0 0 0 0 0 0 0 0 0 0 0 0 0 0 0 0 0 0 0 0 0 0 0 0 0 0 0 -132.527 0 193.564 0 0 0 0 0 0 0 0 0 -307.703 0 0 0 0 0.08 0 0 0 0 0 
1598.48 0 2154.99 0 0 0 0 0 0 0 0 0 0 0 0 0 0 0 0 0 0 0 1934.19 -2121.42 0 0 0 0 0 0 0 0 0 0 0 1001.24 0 0 0 0 0 -2452.24 363.094 0 0 -34.8674 0 0 0 0 0 0 0 0 0 0 0.02 0 0 0 0 
-1054.49 0 0 0 0 0 0 675.451 0 0 0 0 0 0 0 0 0 0 0 0 0 0 0 0 0 0 0 0 0 0 -1364.25 0 -1448.64 961.104 0 0 0 0 0 2096.09 0 0 0 661.412 2348.32 0 0 0 0 0 0 0 0 705.512 -722.297 0 0 0.03 -1030.23 0 2005.14 
0 0 0 0 2454.07 0 239.494 0 0 0 0 0 0 0 0 0 0 0 0 0 0 0 0 0 0 0 0 0 0 0 0 1723.76 0 0 0 0 1133.84 0 0 0 -2016.89 0 0 0 0 0 0 0 0 0 0 0 0 0 0 0 0 395.749 0.08 0 -832.926 
0 0 0 0 0 0 0 0 0 0 0 -1077.68 0 0 0 0 0 0 0 0 0 0 0 0 0 0 0 0 0 0 0 0 1113.85 1696.75 0 1643.96 0 0 0 0 0 0 0 0 0 0 0 2498.32 -1777.02 0 0 1894.82 0 0 0 0 0 0 0 0.02 0 
0 0 -438.475 0 0 1585.82 0 0 0 0 0 0 0 0 0 -2408.75 0 0 0 0 0 0 0 0 0 0 0 0 0 0 0 0 -185.629 0 0 0 0 0 0 0 2419.13 -246.208 0 0 555.208 0 0 0 0 0 0 0 0 0 0 0 0 2075.49 947.981 0 0.07 
