*Vertices 59
*Matrix 
0.02 0 0 -635.319 0 84.46 0 0 0 410.855 0 0 0 0 0 0 0 0 0 0 1833.02 0 0 0 0 0 0 0 0 1279.11 0 0 0 0 0 0 0 0 0 0 0 0 2454.53 919.904 0 0 0 0 0 0 2408.29 0 -2023.15 0 0 0 0 0 0 
0 0.02 0 0 1104.24 0 0 439.085 0 1566.44 0 1997.67 0 0 0 0 0 0 2425.53 2138.05 1820.35 0 0 -416.807 0 0 0 0 2295.68 0 0 0 0 0 0 0 0 0 0 0 0 0 0 0 0 0 0 0 834.3 0 0 0 0 457.549 1328.7 0 0 0 0 
0 0 0.07 1673.25 0 0 0 -2369.53 -2055.65 663.701 0 0 0 -1077.68 0 0 0 0 0 0 0 2430.57 0 0 0 0 0 1974.32 0 0 0 0 0 0 0 0 0 0 0 0 0 0 0 0 0 0 0 0 0 0 0 0 0 0 0 0 0 0 0 
-1811.66 0 -289.85 0.06 0 0 2194.97 0 -1269.65 0 0 -896.71 0 0 577.792 2250.21 0 0 0 28.1533 -312.738 0 0 0 0 0 0 730.995 0 0 0 0 0 0 0 0 0 -2084.34 -398.038 0 2043.9 1248.28 0 0 0 0 0 0 0 0 0 0 0 0 0 0 0 0 0 
0 490.509 0 0 0.06 0 0 0 0 0 0 1037.25 1439.63 -1885.66 2020.1 0 0 0 0 0 0 0 0 -599.612 -267.876 0 0 0 -1555.45 0 1995.07 0 0 0 0 0 0 0 0 0 0 0 0 2170.55 2239.52 -2077.62 0 0 0 0 0 0 0 0 0 0 0 0 -23.8807 
194.327 0 0 0 0 0.04 0 0 0 0 0 163.045 0 0 2382.2 -308.771 0 0 -143.361 0 -417.722 -714.362 2334.13 0 1655.55 0 0 0 401.242 -812.021 0 1419.49 0 0 0 0 0 0 0 -676.519 0 0 0 0 0 0 0 0 0 1765.72 0 0 0 0 0 0 0 0 0 
0 0 0 363.552 0 0 0.09 1333.28 -803.323 0 0 -1653.11 0 0 0 0 0 0 0 -416.501 0 2118.67 0 0 0 0 1080.74 2183.22 0 0 0 0 0 0 0 0 0 0 0 0 0 0 546.205 -981.094 0 454.65 0 0 0 1861.09 0 0 0 0 0 0 0 0 0 
0 -1544.92 -1331.14 0 0 0 -491.119 0.08 0 617.618 943.556 0 1737.8 2471.16 0 0 0 0 0 0 0 0 0 0 0 0 0 0 2005.6 0 0 0 0 0 0 0 0 0 0 0 0 0 0 0 0 0 0 0 0 0 -2373.65 0 0 0 0 -944.929 0 0 0 
0 0 2101.28 -472.198 0 0 1661.5 0 0.05 0 0 0 0 0 0 2252.04 1021.53 0 943.861 0 1353.27 0 -2270.5 0 0 0 1452.3 -2019.49 0 0 0 0 -59.2822 0 0 0 0 0 0 0 0 2416.99 0 2220.91 0 0 0 0 951.949 0 0 0 0 0 0 0 324.488 112.232 0 
-614.719 2456.51 2491.45 0 0 0 0 -999.405 0 0.06 0 0 0 2316.43 -668.889 0 0 0 0 585.727 0 0 0 0 0 0 0 0 0 0 0 0 0 0 -66.1489 0 0 0 0 0 -1090.2 0 2411.5 0 0 0 0 2478.03 0 0 0 -436.644 2495.12 0 0 0 0 0 0 
0 0 0 0 0 0 0 1562.17 0 0 0.09 0 0 0 0 1073.56 0 1078.6 0 0 0 0 0 0 0 0 -225.913 0 0 0 0 0 0 0 1871.93 0 0 0 0 0 0 0 0 0 0 0 -464.263 0 0 0 0 0 0 270.47 0 0 0 0 0 
0 -1485.41 0 -2416.07 2427.06 93.1578 2092.73 0 0 0 0 0.01 0 679.266 0 0 0 0 544.374 0 0 0 0 0 0 0 0 0 0 0 0 0 0 0 0 0 0 0 0 0 0 0 2357.17 0 0 0 0 0 0 0 0 0 0 0 0 0 2049.7 -1450.93 0 
0 0 0 0 -2082.51 0 0 437.101 0 0 0 0 0.09 0 2422.18 0 0 0 0 378.964 0 0 0 0 0 0 0 0 0 0 0 0 0 0 0 0 1638.16 0 0 222.098 0 0 0 0 0 0 -2323.3 0 -157.094 0 0 0 0 0 0 0 0 0 0 
0 0 1054.95 0 810.19 0 0 1446.04 0 2401.12 0 1050.98 0 0 1070.67 0 -65.8437 -316.706 0 2420.5 0 0 0 1949.45 -2330.32 0 0 0 0 0 1652.2 0 0 0 0 0 0 1398.74 -124.897 0 0 0 0 0 0 0 0 0 0 0 0 0 0 0 0 0 160.298 0 0 
0 0 0 -14.42 -348.75 962.325 0 0 0 2081.9 0 0 -2345.12 1610.84 0.03 0 0 1403.78 377.285 0 0 1571.32 1933.58 0 0 0 0 0 -2176.66 0 0 0 0 364.315 0 0 0 -775.399 0 0 0 0 0 0 0 0 0 0 0 0 0 0 0 0 0 0 0 0 0 
0 0 0 -358.974 0 2391.2 0 0 2109.52 0 2280.57 0 0 0 0 0.06 0 0 489.288 0 0 0 0 -84.3074 -485.015 -563.753 0 0 0 0 0 0 0 0 0 0 0 0 0 0 0 0 0 0 0 -1725.14 0 0 0 0 0 0 -270.775 0 0 0 0 0 0 
0 0 0 0 0 0 0 0 959.731 0 0 0 0 159.993 0 0 0.07 0 0 0 0 983.688 -1270.87 0 0 597.476 0 0 0 0 0 0 0 0 0 2033.98 0 0 -1032.06 0 0 0 0 0 0 0 40.0555 0 0 0 0 1232.87 0 781.808 0 1736.58 0 0 0 
0 0 0 0 0 0 0 0 0 0 119.556 0 0 1712.93 412.229 0 0 0.07 0 0 0 0 0 0 0 0 0 0 0 0 0 0 0 -2208.09 0 0 0 0 0 0 0 0 313.501 1652.5 0 0 0 0 -677.435 0 0 0 1692.02 0 -690.1 0 0 -94.5311 0 
0 -355.007 0 0 0 2096.09 0 0 539.644 0 0 -972.854 0 0 -1924.12 -55.1622 0 0 0.01 0 0 0 0 0 2155.14 0 0 -644.169 0 -1216.7 0 0 0 1452.3 478.149 0 -353.175 1182.21 0 0 0 0 0 0 0 0 0 -736.641 0 0 0 0 0 0 0 0 0 0 0 
0 1192.74 0 297.021 0 0 2475.89 0 0 -1289.18 0 0 75.7622 1645.63 0 0 0 0 0 0.01 0 1703.16 0 0 -2119.43 0 0 0 0 0 0 0 0 0 0 1284.6 0 0 0 0 0 -1451.38 0 0 -331.965 0 0 0 0 0 1418.73 0 0 0 -868.938 0 0 0 0 
-89.8007 727.027 0 1385.16 0 1093.4 0 0 2196.34 0 0 0 0 0 0 0 0 0 0 0 0.09 0 0 0 0 1735.21 0 0 0 0 0 0 0 -240.562 0 0 0 0 0 0 0 0 0 0 0 67.217 0 0 0 0 0 1790.9 -579.775 0 0 0 0 2298.73 0 
0 0 -508.057 0 0 814.31 2082.35 0 0 0 0 0 0 0 1588.41 0 297.479 0 0 1817.45 0 0.01 -847.88 520.875 0 0 0 0 0 2126.45 0 0 0 0 0 0 0 0 0 0 0 -1161.61 0 0 0 0 0 0 0 0 -1085.77 0 0 921.735 0 0 0 0 0 
0 0 0 0 0 -464.415 0 0 2355.95 0 0 0 0 0 -1244.16 0 2304.22 0 0 0 0 1487.09 0.04 0 0 0 0 0 0 -68.1326 0 2306.97 0 0 0 0 0 0 0 0 0 0 0 0 0 0 0 0 0 0 0 0 0 0 0 0 0 -2329.25 0 
0 2411.34 0 0 -534.761 0 0 0 0 0 0 0 0 -661.87 0 2015.82 0 0 0 0 0 1562.62 0 0.05 0 0 0 0 0 0 0 0 0 0 0 0 0 0 0 0 -1748.48 0 0 0 0 0 0 0 0 0 0 0 0 0 0 0 0 0 -1021.38 
0 0 0 0 1147.27 676.061 0 0 0 0 0 0 0 1116.75 0 2332.91 0 0 1526 -415.281 0 0 0 0 0.04 0 0 0 216.605 0 0 0 0 444.426 0 0 1260.19 0 0 0 0 0 0 0 -1141.62 0 0 1568.88 0 0 -835.215 0 0 0 -1552.4 0 0 0 0 
0 0 0 0 0 0 0 0 0 0 0 0 0 0 0 576.418 224.998 0 0 0 1432.16 0 0 0 0 0.02 0 -495.239 0 0 0 0 0 0 0 0 0 0 0 0 0 0 -2155.9 0 0 0 1941.51 0 0 0 -1064.26 0 0 0 0 0 1887.49 0 -1805.86 
0 0 0 0 0 0 1936.48 0 -770.058 0 2296.59 0 0 0 0 0 0 0 0 0 0 0 0 0 0 0 0.05 0 0 -2068.32 0 0 -36.8511 0 0 0 0 0 0 0 0 0 0 0 0 0 0 0 0 1351.74 0 1862.47 0 0 0 0 0 0 -1128.19 
0 0 -918.683 1133.99 0 0 2133.63 0 1065.63 0 0 0 0 0 0 0 0 0 836.894 0 0 0 0 0 0 1303.06 0 0.04 0 0 0 0 0 0 0 0 -2177.42 0 1610.69 0 0 0 0 0 0 0 0 0 0 0 0 0 0 0 168.996 0 0 0 0 
0 2248.53 0 0 1739.02 -439.848 0 -1930.68 0 0 0 0 0 0 603.58 0 0 0 0 0 0 0 0 0 1496.09 0 0 0 0.07 1712.16 0 0 0 0 -982.162 1081.8 992.843 0 0 0 0 0 0 0 -2213.58 0 0 0 0 0 0 0 0 0 0 0 0 0 0 
1897.56 0 0 0 0 -864.208 0 0 0 0 0 0 0 0 0 0 0 0 1848.89 0 0 -1728.19 -1808.6 0 0 0 611.972 0 1139.03 0.06 1721.17 0 0 0 0 1356.47 0 0 0 0 0 0 0 0 0 0 0 0 0 1107.59 0 0 0 -576.113 2113.79 0 0 0 0 
0 0 0 0 1694.16 0 0 0 0 0 0 0 0 2141.41 0 0 0 0 0 0 0 0 0 0 0 0 0 0 0 334.101 0.07 0 -2085.25 0 0 0 0 2354.43 0 0 0 0 0 0 -1740.7 0 0 0 0 0 -1125.6 0 0 0 0 0 0 0 0 
0 0 0 0 0 -348.903 0 0 0 0 0 0 0 0 0 0 0 0 0 0 0 0 2151.94 0 0 0 0 0 0 0 0 0.04 0 0 0 0 0 0 0 2085.1 0 0 0 0 0 0 0 0 0 1199.15 0 -785.623 1799.6 0 0 0 -1559.57 0 0 
0 0 0 0 0 0 0 0 781.808 0 0 0 0 0 0 0 0 0 0 0 0 0 0 0 0 0 -400.937 0 0 0 1983.63 0 0.08 0 0 0 0 0 -615.329 0 0 0 2254.94 0 0 0 0 0 0 0 0 0 0 0 0 0 1206.47 0 0 
0 0 0 0 0 0 0 0 0 0 0 0 0 0 2276.3 0 0 -11.8259 -1035.87 0 2298.88 0 0 0 -1023.51 0 0 0 0 0 0 0 0 0.09 0 0 2326.65 0 0 0 0 0 0 0 0 -2085.86 0 0 0 0 0 0 0 204.398 0 0 0 0 0 
0 0 0 0 0 0 0 0 0 1310.08 526.978 0 0 0 0 0 0 0 1848.43 0 0 0 0 0 0 0 0 0 708.106 0 0 0 0 0 0.05 0 0 0 0 0 0 0 0 0 0 0 0 0 -1788.61 0 0 0 0 0 0 0 0 0 0 
0 0 0 0 0 0 0 0 0 0 0 0 0 0 0 0 1028.86 0 0 1706.21 0 0 0 0 0 0 0 0 1094.01 1785.26 0 0 0 0 0 0.05 0 0 0 0 0 0 0 0 0 0 0 0 0 0 0 0 0 0 0 0 0 0 0 
0 0 0 0 0 0 0 0 0 0 0 0 -2008.19 0 0 0 0 0 960.036 0 0 0 0 0 837.809 0 0 650.273 -1782.82 0 0 0 0 1804.48 0 0 0.07 0 0 0 0 0 0 0 0 0 0 0 0 0 0 0 0 0 0 0 0 0 0 
0 0 0 2414.4 0 0 0 0 0 0 0 0 0 1257.13 1381.04 0 0 0 111.927 0 0 0 0 0 0 0 0 0 0 0 2023 0 0 0 0 0 0 0.04 0 0 0 0 0 0 0 0 0 0 0 0 -1603.82 0 0 0 0 0 0 0 0 
0 0 0 1000.63 0 0 0 0 0 0 0 0 0 -110.706 0 0 -2040.24 0 0 0 0 0 0 0 0 0 0 2310.17 0 0 0 0 1610.54 0 0 0 0 0 0.02 0 0 0 0 0 0 0 0 0 0 -1453.83 0 0 0 0 0 0 0 0 0 
0 0 0 0 0 974.837 0 0 0 0 0 0 1483.73 0 0 0 0 0 0 0 0 0 0 0 0 0 0 0 0 0 0 -68.7429 0 0 0 0 0 0 0 0.09 0 0 0 0 -1001.69 0 0 2089.07 0 -1776.25 0 0 0 0 0 0 0 0 1647.16 
0 0 0 2057.02 0 0 0 0 0 1198.23 0 0 0 0 0 0 0 0 0 0 0 0 0 -1962.87 0 0 0 0 0 0 0 0 0 0 0 0 0 0 0 0 0.02 0 0 0 0 0 0 0 0 0 0 -801.34 0 0 0 1447.72 0 0 0 
0 0 0 2058.4 0 0 0 0 2451.78 0 0 0 0 0 0 0 0 0 0 2438.51 0 799.051 0 0 0 0 0 0 0 0 0 0 0 0 0 0 0 0 0 0 0 0.02 0 0 0 0 0 0 0 0 0 2433.47 0 227.744 0 0 0 0 0 
-502.564 0 0 0 0 0 350.581 0 0 -581.149 0 1750.01 0 0 0 0 0 1518.83 0 0 0 0 0 0 0 2424.01 0 0 0 0 0 0 -967.971 0 0 0 0 0 0 0 0 0 0.02 -1389.28 0 0 0 0 151.906 1748.48 0 0 -711.615 0 0 0 0 0 0 
1064.1 0 0 0 1771.22 0 -180.135 0 1338.01 0 0 0 0 0 0 0 0 -387.967 0 0 0 0 0 0 0 0 0 0 0 0 0 0 0 0 0 0 0 0 0 0 0 0 553.682 0.01 0 0 0 0 0 0 0 0 0 0 0 0 0 0 0 
0 0 0 0 -731.605 0 0 0 0 0 0 0 0 0 0 0 0 0 0 -1414.91 0 0 0 0 1350.98 0 0 0 830.485 0 669.5 0 0 0 0 0 0 0 0 955 0 0 0 0 0.03 0 0 0 0 0 0 0 0 0 0 0 326.014 0 0 
0 0 0 0 1875.13 0 868.328 0 0 0 0 0 0 0 0 146.565 0 0 0 0 525.605 0 0 0 0 0 0 0 0 0 0 0 0 1077.68 0 0 0 0 0 0 0 0 0 0 0 0.03 0 0 0 0 0 0 0 0 0 0 2303 0 0 
0 0 0 0 0 0 0 0 0 0 1328.39 0 660.039 0 0 0 -1543.55 0 0 0 0 0 0 0 0 2178.33 0 0 0 0 0 0 0 0 0 0 0 0 0 0 0 0 0 0 0 0 0.06 0 0 0 0 1302.45 0 0 0 0 0 1964.25 0 
0 0 0 0 0 0 0 0 0 -667.058 0 0 0 0 0 0 0 0 1928.39 0 0 0 0 0 670.721 0 0 0 0 0 0 0 0 0 0 0 0 0 0 969.497 0 0 0 0 0 0 0 0.06 0 1041.83 0 355.159 0 0 0 0 0 0 0 
0 1623.05 0 0 0 0 0 0 1512.42 0 0 0 420.011 0 0 0 0 -2218.16 0 0 0 0 0 0 0 0 0 0 0 0 0 0 0 0 1699.5 0 0 0 0 0 0 0 1350.06 0 0 0 0 0 0.07 0 0 0 0 0 0 0 0 0 0 
0 0 0 0 0 -567.568 1107.59 0 0 0 0 0 0 0 0 0 0 0 0 0 0 0 0 0 0 0 1393.4 0 0 -451.75 0 690.863 0 0 0 0 0 0 276.574 -432.981 0 0 1188.01 0 0 0 0 -1387.6 0 0.07 0 0 0 0 0 0 0 0 0 
618.229 0 0 0 0 0 0 -1792.73 0 0 0 0 0 0 0 0 0 0 0 2336.88 0 -2383.11 0 0 771.279 659.429 0 0 0 0 1919.84 0 0 0 0 0 0 740.76 0 0 0 0 0 0 0 0 0 0 0 0 0.02 0 0 0 0 0 0 0 0 
0 0 0 0 0 0 0 0 0 1928.54 0 0 0 0 0 0 2408.29 0 0 0 2215.87 0 0 0 0 0 -141.682 0 0 0 0 -1996.9 0 0 0 0 0 0 0 0 -1715.98 -1182.97 0 0 0 0 138.02 2207.48 0 0 0 0.01 0 477.996 0 1910.54 0 0 0 
-175.71 0 0 0 0 0 0 0 0 585.879 0 0 0 0 0 1992.32 0 -542.543 0 0 1971.72 0 0 0 0 0 0 0 0 0 0 1122.7 0 0 0 0 0 0 0 0 0 0 -1946.09 0 0 0 0 0 0 0 0 0 0.01 0 0 0 0 0 -2401.43 
0 2085.25 0 0 0 0 0 0 0 0 -1193.96 0 0 0 0 0 320.063 0 0 0 0 -1518.37 0 0 0 0 0 0 0 1328.85 0 0 0 180.593 0 0 0 0 0 0 0 1234.86 0 0 0 0 0 0 0 0 0 1757.94 0 0.06 -856.578 0 0 0 0 
0 2045.27 0 0 0 0 0 0 0 0 0 0 0 0 0 0 0 -401.09 0 936.842 0 0 0 0 2381.89 0 0 5.72222 0 1161.76 0 0 0 0 0 0 0 0 0 0 0 0 0 0 0 0 0 0 0 0 0 0 0 1553.01 0.09 0 0 0 0 
0 0 0 0 0 0 0 284.814 0 0 0 0 0 0 0 0 773.11 0 0 0 0 0 0 0 0 0 0 0 0 0 0 0 0 0 0 0 0 0 0 0 848.186 0 0 0 0 0 0 0 0 0 0 2207.02 0 0 0 0.09 0 0 0 
0 0 0 0 0 0 0 0 -1180.99 0 0 -1458.56 0 -1934.19 0 0 0 0 0 0 0 0 0 0 0 1843.09 0 0 0 0 0 1210.14 1093.71 0 0 0 0 0 0 0 0 0 0 0 1005.66 788.98 0 0 0 0 0 0 0 0 0 0 0.02 0 0 
0 0 0 0 0 0 0 0 2168.72 0 0 518.128 0 0 0 0 0 -613.804 0 0 2117.15 0 406.583 0 0 0 0 0 0 0 0 0 0 0 0 0 0 0 0 0 0 0 0 0 0 0 2117.91 0 0 0 0 0 0 0 0 0 0 0 0 
0 0 0 0 1994 0 0 0 0 0 0 0 0 0 0 0 0 0 0 0 0 0 0 2315.97 0 1368.98 -1034.04 0 0 0 0 0 0 0 0 0 0 0 0 2197.26 0 0 0 0 0 0 0 0 0 0 0 0 158.62 0 0 0 0 0 0.01 
