*Vertices 60
*Matrix 
0.07 0 0 0 0 0 0 -805.307 2495.27 2351.22 0 0 0 0 0 0 1948.23 0 -2393.8 0 -813.395 0 0 0 0 0 0 0 0 0 0 0 0 0 -417.112 0 0 1346.4 0 0 0 1663.34 -2086.32 0 815.378 1445.89 0 -1752.3 0 0 0 0 0 0 0 0 0 -1751.99 0 0 
0 0.08 0 0 115.741 0 0 0 0 0 -688.116 0 0 0 0 0 1098.44 0 0 0 0 0 0 0 0 -1071.89 0 0 0 1928.54 0 0 0 0 0 1201.13 100.635 0 1954.79 655.004 0 0 0 1577.12 -210.807 0 0 0 0 0 0 0 0 334.254 0 0 0 0 0 0 
0 0 0.01 0 0 0 0 942.946 0 0 0 2446.75 603.427 0 0 0 2473.3 0 0 0 951.643 0 0 0 0 -2255.85 1447.11 -26.3222 0 0 25.1015 1325.95 0 0 562.838 2118.52 0 0 0 0 43.26 0 0 0 2088.15 0 1395.84 0 0 -2155.6 0 0 1624.58 0 0 0 0 0 0 0 
0 0 0 0.02 0 0 -30.7474 0 0 0 0 2062.06 0 1114.46 -745.643 0 0 -1915.42 0 0 0 0 0 0 0 0 0 0 0 0 0 716.346 0 0 0 0 278.558 0 0 0 -1260.34 0 0 0 368.892 0 0 0 1195.18 -1008.1 0 887.555 0 0 0 0 0 0 0 0 
0 -1988.51 0 0 0.02 -679.571 386.746 2433.77 -273.522 0 0 -656.987 0 0 -580.538 0 0 0 0 0 -2348.63 0 888.47 1160.24 0 0 1664.4 0 0 0 134.663 0 1927.32 0 0 0 0 0 1120.56 0 0 -1738.11 0 0 199.973 0 510.956 0 0 0 -552.156 0 51.3474 0 0 0 0 0 0 0 
0 0 0 0 632.572 0.03 -1908.09 0 0 1466.95 0 0 1730.63 0 1250.27 0 1895.73 0 0 0 0 0 -2342.83 1890.24 0 0 2351.07 -1091.27 0 -645.238 0 0 0 0 0 0 0 0 0 0 1051.9 0 0 0 0 0 -288.934 619.297 -2223.2 0 0 0 0 0 0 0 0 0 -1995.83 622.044 
0 0 0 -1801.89 961.104 1266.29 0 0 1839.73 -5.41704 0 0 0 0 1239.59 0 0 0 0 400.174 0 0 0 928.297 0 0 0 2058.85 0 -1882.31 0 21.897 0 0 0 0 0 0 855.968 0 0 -2487.33 0 0 0 0 0 0 0 -456.481 0 2281.79 0 0 0 0 0 0 -1892.22 -1872.08 
1494.26 0 -289.85 0 1571.02 0 0 0.01 0 0 0 814.158 0 831.095 0 -2.67037 0 0 0 0 0 0 0 0 0 0 0 0 0 0 0 1032.67 1503.72 0 606.174 0 0 0 0 0 0 0 633.793 0 -1370.36 0 0 2349.85 0 0 0 0 0 0 0 0 0 0 0 0 
1500.82 0 0 0 467.315 0 1237.6 0 0.06 0 724.738 0 0 0 -240.104 0 0 0 368.282 0 0 0 0 0 -2401.12 0 0 0 0 1802.04 0 0 0 0 0 0 0 0 0 -390.408 0 1559.57 -1797.77 0 1126.51 2232.35 0 1301.23 0 1296.35 1222.8 99.7192 0 0 0 0 -155.11 0 0 0 
757.393 0 0 0 0 551.088 1560.34 0 0 0.04 0 0 0 0 0 -1594.82 0 0 0 0 0 0 0 0 0 2183.22 0 0 0 -2288.81 0 0 463.042 -2412.26 0 0 1458.71 -1199.15 0 1454.89 0 0 1538.36 0 187.46 0 0 0 0 0 0 0 -1183.58 287.103 0 0 0 0 0 0 
0 876.72 0 0 0 0 0 0 1488.46 0 0.07 0 0 0 0 561.922 0 0 0 421.995 0 0 -1432.92 2037.49 0 0 -2165.21 0 1990.95 0 438.78 0 0 0 0 1414.3 0 0 0 -2331.39 0 455.87 0 0 886.944 1988.36 869.091 394.833 0 0 0 0 0 0 0 0 0 2441.1 0 0 
0 0 555.208 -741.371 -1167.41 0 0 -194.937 0 0 0 0.09 1880.17 0 0 0 0 0 0 1923.35 2029.25 0 0 0 465.636 0 647.069 2326.2 1669.74 0 0 1275.29 0 0 0 786.843 0 0 0 0 0 0 0 369.961 0 0 0 0 0 -114.521 -889.843 0 0 0 0 0 0 0 0 0 
0 0 -1804.48 0 0 1047.32 0 0 0 0 0 -1172.6 0.09 0 0 1485.87 0 0 0 0 0 0 2056.87 -1686.53 0 0 2340.69 340.052 0 -276.574 1980.57 2205.95 0 1914.2 2381.28 0 0 0 0 0 0 -1893.44 0 1721.17 0 0 0 0 0 0 0 0 0 -1676.46 -656.835 -853.526 336.848 0 0 0 
0 0 0 1223.41 0 0 0 1949.29 0 0 0 0 0 0.01 20.5237 0 393.612 0 0 0 -1554.69 -1820.96 -533.845 0 0 1566.74 0 0 0 0 0 0 0 0 0 0 0 279.626 0 0 0 0 0 -2077.47 404.904 0 0 2162.01 1623.05 -1833.93 1760.08 2442.47 -927.686 0 0 0 0 0 0 0 
0 0 0 -1068.07 2023.76 465.789 -174.947 0 907.849 0 0 0 0 2207.33 0.06 0 2407.22 0 0 235.832 2059.62 0 0 0 0 0 0 0 0 0 0 0 1138.87 0 0 0 0 0 2266.69 0 0 0 0 324.335 0 0 -872.143 0 0 0 -552.004 0 0 -1324.88 0 0 0 0 0 0 
0 0 0 0 0 0 0 -732.368 0 1961.65 1048.69 0 -778.909 0 0 0 0 0 0 0 0 0 0 0 1206.47 0 0 0 0 0 0 0 0 0 488.83 0 -1892.07 0 0 0 1152 0 0 0 0 0 0 0 0 2094.56 0 0 0 1639.99 0 0 0 0 0 0 
1288.11 2324.37 -2179.1 0 0 -423.215 0 0 0 0 0 0 0 -207.45 -2114.4 0 0.07 0 341.578 0 -2456.82 1208.91 -1775.49 0 0 0 0 0 -1091.27 -254.295 718.94 0 0 0 0 0 0 0 0 0 2391.2 0 2158.04 659.581 1606.11 0 -1162.83 0 1938.15 0 0 0 0 0 0 0 0 0 0 0 
0 0 0 127.949 0 0 0 0 0 0 0 0 0 0 0 0 0 0.08 0 0 0 0 0 0 1851.94 0 0 -1709.42 -30.7474 0 0 0 0 0 -185.324 0 0 0 0 0 1916.49 0 0 0 -149.007 115.131 0 0 0 0 0 0 833.995 0 0 0 0 0 0 0 
2076.1 0 0 0 0 0 0 0 2357.78 0 0 0 0 0 0 0 1764.66 0 0.04 0 0 0 1450.16 0 -1084.4 0 0 0 0 0 651.646 0 0 0 0 0 0 0 0 0 0 0 2499.85 0 0 0 -569.094 0 0 0 0 0 -1609.47 0 0 0 0 0 0 1531.95 
0 0 0 0 0 0 2013.08 0 0 0 746.254 434.049 0 0 17.1667 0 0 0 0 0.08 0 864.513 0 0 0 0 1384.55 -953.475 -1199.91 0 0 0 537.049 0 0 0 0 0 0 0 0 -2311.55 0 -2141.25 0 0 0 0 0 2196.8 0 0 0 0 0 0 908.155 0 0 0 
1288.57 0 2366.48 0 -1721.47 0 0 0 0 0 0 0.991852 0 -964.309 531.404 0 -1766.03 0 0 0 0.02 0 1810.13 0 0 0 0 0 0 0 0 0 0 0 917.615 1180.38 -2175.13 0 0 -254.753 0 415.128 0 0 0 0 0 1750.01 0 0 -1821.88 0 726.112 1666.69 0 0 0 0 0 0 
0 0 0 0 0 0 0 0 0 0 0 0 0 -1785.71 0 0 381.558 0 0 -1326.87 0 0.05 0 0 0 0 0 0 0 0 1715.52 0 0 0 0 0 0 2021.93 0 0 0 0 1781.59 0 0 1392.79 -361.568 0 0 -1136.28 0 0 117.42 0 0 0 0 0 0 2025.89 
0 0 0 0 -802.103 -1642.74 0 0 0 0 311.975 0 783.181 215.842 0 0 -445.341 0 2166.13 0 2237.85 0 0 -2273.86 0 53.9415 -1914.04 0 0 0 0 1990.95 0 2044.97 289.392 0 0 -821.482 0 0 0 0 0 -1715.22 2030.93 -539.338 0 0 -1140.71 0 -1573.31 2001.02 705.054 1023.67 0 0 0 0 0 0 
0 0 0 0 -21.7444 417.57 1908.09 0 0 0 390.408 0 -282.83 0 0 0 0 0 0 0 0 0 2334.13 0.08 -386.898 -1451.08 0 0 0 0 0 0 294.733 0 0 0 0 0 0 0 0 0 -677.129 1165.88 0 0 0 0 0 0 0 0 0 2209.77 -253.533 0 0 0 0 0 
0 0 0 0 0 0 0 0 2362.06 0 0 -119.709 0 0 0 -215.232 0 -858.257 2352.6 0 0 0 0 -1907.64 0 0 -2222.43 0 0 0 0 0 0 0 -1463.13 0 0 0 0 0 810.038 1113.7 -668.126 139.241 0 637.913 0 0 0 0 -2122.79 1545.08 0 2465.21 0 2060.69 0 0 0 1514.1 
0 -1291.77 1662.72 0 0 0 0 0 0 370.876 0 0 0 -1132.62 0 0 0 0 0 0 0 0 -1322.9 -897.626 0 0.05 -47.0748 0 0 0 0 0 0 0 0 0 711.158 116.657 0 1506.62 -195.547 0 0 0 0 0 997.726 0 0 0 0 2357.48 0 0 0 0 0 0 406.278 0 
0 0 187.002 0 -1417.81 898.846 0 0 0 0 2434.84 1796.09 -1096.15 0 0 0 0 0 0 120.167 0 0 -138.936 0 -508.362 -1936.48 0.07 1908.86 -1236.99 0 -2257.84 0 0 0 -329.981 1714.61 0 0 0 -579.928 0 1832.56 907.239 0 0 0 1802.96 645.085 1176.72 0 0 0 -392.85 0 -1944.41 0 0 0 0 0 
0 0 1127.43 0 0 1984.69 -2119.13 0 0 0 0 2110.58 1468.02 0 0 0 0 2224.88 0 -224.082 0 0 0 0 0 0 -570.772 0 0 0 -1585.36 0 1943.8 0 0 764.107 0 0 0 0 0 0 -46.0067 0 0 0 0 0 -1640.6 -1348.38 0 0 -683.081 2153.46 966.445 749.001 0 0 0 0 
0 0 0 0 0 0 0 0 0 0 -298.395 -1105.46 0 0 0 0 1989.88 1870.4 0 1618.32 0 0 0 0 0 0 1418.12 0 0.01 0 -722.755 0 0 -1091.88 0 -544.374 2364.5 0 -220.573 2076.4 0 0 0 -2261.5 -502.411 0 1088.82 1378.75 0 0 0 0 0 816.752 0 0 -2494.96 0 0 0 
0 1342.28 0 0 0 688.116 -680.792 0 1766.18 1142.84 0 0 1933.58 0 0 0 -895.337 0 0 0 0 0 0 0 0 0 0 0 0 0.06 0 -927.534 0 0 0 0 0 0 0 0 132.984 0 0 1461.46 0 0 0 -1189.38 0 0 809.427 0 0 -1833.02 0 0 0 0 0 0 
0 0 -1443.6 0 2038.87 0 0 0 0 0 1362.42 0 764.87 0 0 0 -1401.18 0 1656.32 0 0 -376.217 0 0 0 0 2059.77 -329.981 1996.14 0 0.04 0 0 882.519 0 0 0 0 0 0 0 1932.51 0 0 326.014 0 2091.2 0 0 31.3578 0 0 0 0 0 -724.281 0 0 -2137.44 0 
0 0 -1542.48 2078.69 0 0 -1676.76 1689.28 0 0 0 1813.94 687.048 0 0 0 0 0 0 0 0 0 1934.19 0 0 0 0 0 0 2021.01 0 0.06 0 0 2497.71 2239.07 0 0 0 0 0 0 0 -548.646 0 0 0 0 0 0 0 0 0 0 0 2129.2 -966.597 0 560.091 0 
0 0 0 0 -706.427 0 0 -1644.72 0 -364.162 0 0 0 0 1788 0 0 0 0 1367 0 0 0 1365.17 0 0 0 565.279 0 0 0 0 0.06 0 0 525.758 0 0 0 0 0 1375.39 0 0 0 -246.208 0 0 0 1347.77 0 0 0 0 0 0 0 0 2009.26 0 
0 0 0 0 0 0 0 0 0 557.802 0 0 2344.81 0 0 0 0 0 0 0 0 0 -2073.96 0 0 0 0 0 -1082.42 0 -876.415 0 0 0 878.246 0 0 0 0 0 -2489.47 0 0 0 1100.12 0 0 0 0 2253.87 1677.53 1769.54 0 0 0 0 0 0 0 0 
-1774.88 0 -847.118 0 0 0 0 1349.91 0 0 0 0 -1320.46 0 0 -1799.3 0 14.1148 0 0 1012.07 0 -94.3785 0 1061.51 0 -879.62 0 0 0 0 2222.13 0 1670.35 0 1684.24 1783.27 0 0 0 -2226.25 0 0 0 0 0 0 0 0 1627.02 1039.69 0 0 0 0 294.427 0 -973.312 0 0 
0 -2468.41 -1830.42 0 0 0 0 0 0 0 135.884 -1270.1 0 0 0 0 0 0 0 0 1043.66 0 0 0 0 0 751.595 586.489 1804.03 0 0 2035.51 918.226 0 977.584 0.08 0 0 0 1034.2 -2018.42 0 2470.24 0 0 2040.54 57.9089 0 0 -2106.31 0 0 0 0 0 0 0 0 0 0 
0 -88.4274 0 -1389.13 0 0 0 0 0 1595.89 0 0 0 0 0 -182.119 0 0 0 0 -500.58 0 0 0 0 -313.654 0 0 -995.59 0 0 0 0 0 -1608.25 0 0 78.6615 -445.647 0 1993.7 0 0 0 -1150.17 0 0 0 0 0 2175.28 0 2122.18 0 -519.959 0 0 -727.485 0 0 
-228.05 0 0 0 0 0 0 0 0 -840.098 0 0 0 -806.833 0 0 0 0 0 0 0 -298.547 2331.84 0 0 653.935 0 0 0 0 0 0 0 0 0 0 2013.08 0.03 0 0 0 0 0 0 0 -319.3 0 0 0 0 197.684 0 0 -1615.12 0 0 0 0 0 2238.76 
0 -424.284 0 0 -1413.54 0 2120.81 0 0 0 0 0 0 0 288.476 0 0 0 0 0 0 0 0 0 0 0 0 0 1195.64 0 0 0 0 0 0 0 -715.125 0 0.01 0 0 0 138.478 0 0 1555.6 0 0 0 0 1282.77 0 2191 0 2453.92 0 0 80.4926 0 0 
0 1050.68 0 0 0 0 0 0 2360.38 -608.463 377.59 0 0 0 0 0 0 0 0 0 1746.65 0 0 0 0 2086.32 1608.4 0 1875.59 0 0 0 0 0 0 1927.63 0 0 0 0.02 2463.38 0 0 0 597.324 0 516.449 -1262.63 -1268.27 0 -814.005 0 0 0 0 0 0 0 525.605 0 
0 0 392.85 1757.94 0 -387.509 0 0 0 0 0 0 0 0 0 1970.96 -1445.89 1155.35 0 0 0 0 0 0 2176.2 -1838.05 0 0 0 775.094 0 0 0 -2490.08 -11.6733 2032.61 2140.95 0 0 2312.62 0.02 1528.75 848.491 0 0 -1102.56 2068.77 0 -1054.95 0 0 0 0 0 870.617 0 -1970.66 0 -2418.21 -1153.37 
319.758 0 0 0 1216.09 0 -2495.27 0 -1175.19 0 454.039 0 -2219.53 0 0 0 0 0 0 -1771.37 -2054.28 0 0 0 1318.32 0 404.141 0 0 0 1766.64 0 1294.21 0 0 0 0 0 0 0 317.621 0.04 1370.36 0 1921.37 -905.866 304.041 0 922.651 0 0 0 0 0 0 0 0 0 0 0 
227.134 0 0 0 0 0 0 1007.49 435.881 883.129 0 0 0 0 0 0 1170.31 0 2294.31 0 0 2258.45 0 -2104.33 1567.96 0 -354.701 -2295.83 0 0 0 0 0 0 0 869.701 0 0 -713.599 0 464.873 -147.328 0.07 582.369 0 0 0 0 640.812 0 0 40.8185 0 0 0 0 0 0 0 0 
0 1425.44 0 0 0 0 0 0 0 0 0 2228.84 1186.48 1394.47 -1964.86 0 -1512.27 0 0 1180.99 0 0 -2107.53 658.208 1005.81 0 0 0 -247.581 2222.59 0 1930.68 0 0 0 0 0 0 0 0 0 0 -582.827 0.04 0 0 0 0 0 720.618 106.128 0 0 -589.541 0 0 0 0 0 0 
994.522 235.679 -680.639 1424.53 -2161.4 0 0 -1220.66 1710.49 -690.863 995.132 0 0 -2231.59 0 0 1602.76 827.891 0 0 0 0 528.657 0 0 0 0 0 -2093.19 0 -2189.02 0 0 2283.32 0 0 662.938 0 0 -1997.97 0 2003.77 0 0 0.08 737.556 0 0 0 0 0 0 0 0 0 0 0 0 0 0 
-1623.81 0 0 0 0 0 0 0 1362.42 0 1242.79 0 0 0 0 0 0 2426.3 0 0 0 -819.041 667.364 0 -468.383 0 0 0 0 0 0 0 2291.25 0 0 -1286.89 0 870.769 -608.768 0 1228.9 1692.79 0 0 535.524 0.06 0 -2150.72 0 0 0 0 0 0 0 0 0 0 0 -317.927 
0 0 -1016.34 0 264.367 165.181 0 0 0 0 1901.23 0 0 0 2339.93 0 1680.27 0 2048.63 0 0 -839.183 0 0 0 474.944 926.771 0 986.129 0 -493.713 0 0 0 0 1113.54 0 0 0 -37.0037 -909.528 2286.07 0 0 0 0 0.06 -19.7607 -1300.16 0 0 0 0 0 0 0 0 0 0 0 
537.66 0 0 0 0 1916.03 0 2473.45 -815.836 0 -1357.54 0 0 786.538 0 0 0 0 0 0 1145.44 0 0 0 0 0 1398.59 0 -937.452 -1522.34 0 0 0 0 0 0 0 0 0 1920.61 0 0 0 0 0 1231.35 -1706.37 0.06 0 -1277.89 0 0 0 0 0 0 0 0 0 0 
0 0 0 1261.71 0 1617.4 0 0 0 0 0 0 0 2050 0 0 -2080.83 0 0 0 0 0 -97.5829 0 0 0 -13.8096 -1526.46 0 0 0 0 0 0 0 0 0 0 0 -739.082 -297.174 2413.02 1904.43 0 0 0 771.737 0 0.02 2173.76 0 -778.603 0 0 0 0 0 0 0 935.316 
0 0 584.506 2475.59 0 0 2386.17 0 -2277.67 0 0 -56.3829 0 -453.276 0 845.286 0 0 0 1618.63 0 1166.95 0 0 0 0 0 231.254 0 0 1765.72 0 -1688.82 -1119.8 1428.34 1160.7 0 0 0 0 0 0 0 2067.25 0 0 0 781.808 2024.98 0 -1899.55 -1815.01 0 -2236.17 0 0 0 0 0 -238.884 
0 0 0 0 -1277.28 0 0 0 260.857 0 0 -2.51778 0 2002.55 1362.58 0 0 0 0 0 -2090.59 0 551.851 0 230.338 0 0 0 0 -761.513 0 0 0 1724.83 -1710.33 0 -16.4037 -1694.01 1995.68 2080.98 0 0 0 1928.69 0 0 0 0 0 2092.73 0.07 0 -208.823 0 0 0 0 0 0 0 
0 0 0 2313.23 0 0 770.211 0 1064.56 0 0 0 0 919.599 0 0 0 0 0 0 0 0 832.926 0 1613.44 1819.13 0 0 0 0 0 0 0 1707.28 0 0 0 0 0 0 0 0 1487.4 0 0 0 0 0 2224.72 2083.57 0 0.06 0 -732.521 0 0 0 0 0 0 
0 0 -850.475 0 -409.329 0 0 0 0 2156.97 0 0 0 2006.21 0 0 0 2084.49 52.7207 0 -52.2629 -1980.27 1477.32 0 0 0 -2243.34 -1500.82 0 0 0 0 0 0 0 0 2262.72 0 6.79037 0 0 0 0 0 0 0 0 0 0 0 2077.62 0 0.08 0 0 0 1261.41 0 0 0 
0 -2451.32 0 0 0 0 0 0 0 -1039.23 0 0 1368.53 0 -24.1859 -588.473 0 0 0 0 -466.552 0 481.506 42.8022 1329.46 0 0 576.418 665.075 -1115.38 0 0 0 0 0 0 0 862.072 0 0 0 0 0 2390.59 0 0 0 0 0 2206.26 0 1403.32 0 0 0 0 0 0 784.555 0 
0 0 0 0 0 0 0 0 0 0 0 0 -1154.9 0 0 0 0 0 0 0 0 0 0 1790.44 0 0 2282.25 565.737 0 0 0 0 0 0 0 0 1338.16 0 -1104.39 0 -552.614 0 0 0 0 0 0 0 0 0 0 0 0 0 0.02 -967.513 -1042.44 0 0 0 
0 0 0 0 0 0 0 0 0 0 0 0 1405.76 0 0 0 0 0 0 0 0 0 0 0 -2058.4 0 0 876.263 0 0 1940.75 1114 0 0 -1041.98 0 0 0 0 0 0 0 0 0 0 0 0 0 0 0 0 0 0 0 -1125.75 0.01 0 0 0 0 
0 0 0 0 0 0 0 0 1161.76 0 0 0 1307.79 0 0 0 0 0 0 1825.85 0 0 0 0 0 0 0 0 -179.373 0 0 -278.558 0 0 0 0 0 0 0 0 2223.5 0 0 0 0 0 0 0 0 0 0 0 -441.374 0 965.072 0 0.04 0 0 0 
1379.97 0 0 0 0 0 0 0 0 0 -1797.01 0 0 0 0 0 0 0 0 0 0 0 0 0 0 0 0 0 0 0 0 0 0 0 2343.9 0 16.0985 0 -549.104 0 0 0 0 0 0 0 0 0 0 0 0 0 0 0 0 0 0 0.01 0 0 
0 0 0 0 0 -657.75 1951.43 0 0 0 0 0 0 0 0 0 0 0 0 0 0 0 0 0 0 -251.549 0 0 0 0 -376.37 -2415.92 813.547 0 0 0 0 0 0 -857.952 1811.04 0 0 0 0 0 0 0 0 0 0 0 0 2135.3 0 0 0 0 0.06 0 
0 0 0 0 0 -106.738 -1738.87 0 0 0 0 0 0 0 0 0 0 0 2402.34 0 0 -1991.1 0 0 1007.34 0 0 0 0 0 0 0 0 0 0 0 0 -2132.1 0 0 1886.12 0 0 0 0 527.741 0 0 1114.46 -748.848 0 0 0 0 0 0 0 0 0 0 
