*Vertices 52
*Matrix 
0.06 0 0 0 -1715.06 0 0 0 1008.56 239.799 1792.43 0 0 0 0 0 0 -70.4215 0 0 0 0 0 -176.016 -2420.8 0 0 0 0 242.088 844.981 2244.25 0 0 0 0 1459.47 0 0 1494.26 -981.857 0 0 0 0 -1777.63 0 0 0 -1463.9 0 1383.79 
0 0.04 0 0 0 521.18 0 0 0 -1590.7 -2026.2 0 867.412 1122.09 0 0 -404.447 0 729.011 732.063 928.144 0 2044.51 -1422.54 0 2286.07 -686.743 0 0 813.852 1324.88 0 0 0 0 0 0 1962.11 1801.89 -496.765 -1622.75 -607.7 -313.044 0 -1269.34 0 0 1771.83 0 -2461.85 0 0 
0 0 0.06 587.863 0 0 1786.32 0 0 0 0 2321.31 0 0 0 585.574 -1700.87 0 0 0 0 0 0 0 0 0 0 0 265.435 0 -2278.74 0 0 1538.51 0 0 0 0 0 1538.36 0 0 0 -1812.27 0 0 0 0 0 0 2220.15 0 
0 0 127.033 0.05 0 0 0 0 0 0 -659.886 1681.8 0 0 0 0 0 2175.13 0 83.0866 0 58.8244 0 0 0 0 0 0 0 0 0 -2124.93 0 0 0 0 0 -1630.53 0 0 0 0 880.383 0 0 0 0 0 0 0 0 0 
2216.48 0 0 0 0.03 237.968 -1104.39 -553.072 293.359 0 -487.915 0 0 -450.377 0 1809.37 -705.206 0 0 0 -713.904 0 -421.69 1097.52 0 0 0 0 2250.36 0 0 0 0 0 0 0 0 0 0 0 0 0 0 766.854 0 0 0 0 0 0 1077.68 0 
0 -1927.17 0 0 -25.2541 0.07 0 0 0 0 0 64.9281 0 0 0 0 0 0 0 0 0 0 -9.99481 0 0 0 0 0 0 -101.55 0 -99.5666 0 0 0 0 0 1747.87 0 0 1893.75 0 0 0 0 0 0 2330.77 1555.91 0 839.335 0 
0 0 -1870.1 0 -141.377 0 0.05 64.4704 0 0 0 0 0 0 -282.067 0 0 2472.38 0 1895.28 0 0 0 0 0 0 0 85.8333 0 0 0 0 -1952.5 1341.06 0 0 0 0 0 0 0 1478.7 0 0 0 0 0 -2219.38 0 0 0 0 
0 0 0 0 1229.97 0 2166.59 0.07 0 0 -1042.89 0 0 577.334 0 0 -488.983 2251.43 0 0 0 0 0 -312.128 -1250.72 0 0 0 0 0 0 0 0 0 0 0 282.83 0 302.057 0 1750.01 0 -805.155 0 33.7992 393.612 0 0 0 1392.94 0 -244.987 
1889.32 0 0 0 -960.341 0 0 0 0.04 220.267 0 0 0 0 0 0 0 0 1942.27 0 0 0 0 0 0 0 0 0 -242.698 0 2176.81 1113.85 0 0 0 0 1601.99 0 0 0 0 0 0 0 -650.578 0 0 0 0 1574.53 -1525.09 0 
-1662.27 209.891 0 0 0 0 0 0 477.233 0.01 0 0 2481.23 0 1832.26 0 1987.29 0 0 203.177 0 2304.07 0 -634.556 0 0 0 0 0 0 0 0 0 -426.115 1152.15 1141.62 0 0 0 0 0 -944.929 0 665.532 0 0 698.492 0 0 -2171.16 0 0 
2209.77 304.346 0 2357.02 -698.798 0 0 -1894.51 0 0 0.05 2369.23 -458.617 0 0 0 0 0 0 -2452.85 0 0 355.922 0 0 657.14 0 152.058 0 0 0 192.19 0 0 0 -1708.2 0 1923.35 0 0 0 -2304.83 0 -1092.94 0 0 1410.64 0 -575.045 0 2390.9 0 
0 0 -1919.08 744.88 0 892.132 0 0 0 0 1068.22 0.07 0 0 0 0 2463.84 0 0 0 0 0 1321.68 0 0 0 0 1400.72 0 1764.35 0 0 0 0 0 0 2325.89 0 0 0 0 0 0 -840.861 0 0 0 -690.558 1289.48 1222.5 0 0 
0 96.3622 0 0 0 0 0 0 0 329.066 -483.489 0 0.09 1574.98 0 0 0 2055.65 0 0 1293.3 0 0 0 0 0 690.863 0 0 0 0 0 0 0 0 0 0 0 632.42 0 0 0 0 0 -1728.34 -1341.52 0 0 -1553.01 0 646.001 0 
0 -636.082 0 0 389.492 0 0 1267.51 0 0 0 0 1920.45 0.07 0 0 1401.03 0 0 0 -1933.88 0 0 0 0 224.693 0 0 0 -731.605 0 0 0 0 0 0 0 0 0 0 0 0 0 0 0 -585.116 0 0 -2033.07 2035.2 0 0 
0 0 0 0 0 0 304.498 0 0 -998.947 0 0 0 0 0.03 0 1575.29 0 0 0 0 0 0 0 0 0 0 2153.46 0 0 0 0 0 -61.7237 572.756 0 0 0 19.4555 0 0 0 0 0 0 0 2248.22 0 0 0 0 0 
0 0 2087.39 0 399.258 0 0 0 0 0 0 0 0 0 0 0.07 0 0 0 0 0 0 0 2260.43 -2348.93 1569.49 0 0 0 0 -1146.05 0 265.893 0 -1310.85 0 0 1154.13 -970.412 0 737.098 0 0 0 0 0 965.987 -791.116 0 0 0 0 
0 699.866 150.38 0 2342.37 0 0 254.143 0 2358.85 0 2057.18 0 -921.583 119.861 0 0 1954.94 0 0 0 0 0 0 0 0 0 0 0 0 -1683.78 0 0 -1242.79 0 0 0 0 -1176.72 0 0 0 344.325 0 0 0 1755.35 0 0 0 0 2180.78 
357.601 0 0 1285.97 0 0 1108.66 1449.71 0 0 0 0 1047.93 0 0 0 1091.57 0.07 0 0 0 0 0 0 0 0 0 0 0 562.532 0 0 -1702.4 1316.19 0 0 0 0 0 0 0 -591.22 0 0 0 0 0 0 0 1032.67 2366.18 764.87 
0 1127.12 0 0 0 0 0 0 -70.8792 0 0 0 0 0 0 0 0 0 0.09 0 0 0 0 0 -336.848 0 -1217.31 -1619.24 0 0 0 0 0 0 0 0 0 0 0 0 0 0 0 0 0 0 139.698 0 1258.05 962.477 0 -837.352 
0 2478.33 0 558.412 0 0 -1542.18 0 0 -2338.86 -1296.81 0 0 0 0 0 0 0 0 0.01 -1058.15 0 670.721 0 -2093.95 1330.38 0 1071.73 0 0 -200.43 0 0 -90.1059 0 0 0 0 0 0 0 0 2360.84 0 0 0 0 0 1464.35 0 0 0 
0 -87.9696 0 0 929.823 0 0 0 0 0 0 0 2007.28 580.233 0 0 0 0 0 2002.85 0.06 0 0 0 0 0 0 0 0 0 798.44 859.02 26.78 0 0 0 2420.96 0 0 0 0 0 -429.014 401.09 -2499.24 0 0 0 1995.07 0 0 1712.93 
0 0 0 -1138.57 0 0 0 0 0 203.024 0 0 0 0 0 0 0 0 0 0 0 0.03 0 0 973.464 0 396.97 0 2217.4 0 0 0 0 0 0 0 235.832 0 0 0 0 0 0 0 0 0 1035.26 0 0 0 1877.88 0 
0 -1042.44 0 0 1593.75 507.599 0 0 0 0 1293.3 1477.02 0 0 0 0 0 0 0 -2006.97 0 0 0.08 0 0 1937.85 0 0 1823.1 0 0 0 0 0 1108.05 1363.49 0 0 0 0 0 0 0 0 -2403.56 0 0 0 230.338 -84.1548 0 0 
1014.82 602.664 0 0 1079.06 0 0 2322.99 0 1979.81 0 0 0 0 0 -1222.8 0 0 0 0 0 0 0 0.05 0 -166.707 0 0 0 0 0 0 0 0 0 0 0 0 -158.467 0 0 0 0 0 -1176.41 0 1073.11 0 0 0 -203.94 -1791.67 
1417.05 0 0 0 0 0 0 1838.05 0 0 0 0 0 0 0 -2112.26 0 0 -1046.1 611.667 0 -1727.27 0 0 0.08 1923.66 0 298.395 0 0 0 1561.25 0 2309.11 2258.45 0 2128.74 0 0 0 2080.83 0 0 0 0 0 0 -1026.87 0 0 1071.73 -1514.86 
0 1830.58 0 0 0 0 0 0 0 0 1197.62 0 0 1639.38 0 721.992 0 0 0 -51.1948 0 0 -2353.66 454.955 2113.48 0.08 0 436.644 2464.29 0 0 0 0 0 0 0 0 0 0 0 0 0 1602.3 -1162.68 0 0 0 0 0 -2454.83 -2351.22 0 
0 1766.64 0 0 0 0 0 0 0 0 0 0 1343.35 0 0 0 0 0 -1289.79 0 0 2380.52 0 0 0 0 0.01 0 1012.99 0 0 2065.72 0 0 0 0 1323.82 0 0 0 0 1417.81 0 0 1374.02 0 1830.12 -1835 -2365.11 0 0 0 
0 0 0 0 0 0 1160.85 0 0 0 1431.55 -1200.83 0 0 -563.753 0 0 0 2182.3 1487.09 0 0 0 0 -2124.62 -781.961 0 0.01 1430.94 -1404.08 0 0 0 851.543 0 2121.42 0 -1494.26 0 0 0 0 2353.36 -2292.17 0 0 1991.87 0 0 0 -2386.78 0 
0 0 817.972 0 1722.54 0 0 0 1236.38 0 0 0 0 0 0 0 0 0 0 0 0 975.753 -1278.65 0 0 1613.59 1629 2030.63 0.09 0 785.012 2076.56 0 2151.48 0 0 0 1600.77 0 0 0 0 0 0 0 -1476.87 0 0 -2034.29 2046.04 0 0 
-827.891 1862.77 0 0 0 -1068.22 0 0 0 0 0 574.74 0 815.989 0 0 0 1282.92 0 0 0 0 0 0 0 0 0 -1789.83 0 0.04 0 1331.45 2344.05 0 0 0 0 -338.069 0 0 0 0 0 0 0 -1209.07 0 0 0 0 0 0 
-2271.57 1769.54 -2176.35 0 0 0 0 0 -859.935 0 0 0 0 0 0 2303 1.90741 0 0 -2364.8 1624.42 0 0 0 0 0 0 0 1820.66 0 0.03 1786.78 0 1085.62 0 -277.49 248.497 0 0 0 0 -728.858 0 1902.75 0 912.275 -33.9518 2277.98 0 0 -2032 0 
2024.37 0 0 -438.322 0 1768.62 0 0 -768.227 0 2466.58 0 0 0 0 0 0 0 0 0 -1326.11 0 0 0 2204.89 0 -1585.82 0 -1498.38 821.329 2431.03 0.03 -2498.47 0 0 0 0 0 0 373.623 0 0 0 0 2387.54 0 0 0 0 -13.3518 0 0 
0 0 0 0 0 0 1353.11 0 0 0 0 0 0 0 0 2209.31 0 -1781.75 0 0 1892.68 0 0 0 0 0 0 0 0 269.707 0 1462.98 0.03 0 -352.87 -501.19 0 0 -29.2215 0 0 0 2353.05 0 0 0 0 941.572 0 0 -1670.96 -463.805 
0 0 617.924 0 0 0 2046.19 0 0 1558.2 0 0 0 0 -421.537 0 2185.81 -773.263 0 1745.28 0 0 0 0 1267.82 0 0 1127.43 -453.734 0 966.75 0 0 0.01 0 0 0 0 2445.07 0 0 0 0 -1442.84 0 0 0 0 0 0 -511.872 0 
0 0 0 0 0 0 0 0 0 2314.29 0 0 0 0 44.0229 -994.674 0 0 0 0 0 0 2433.32 0 1294.06 0 0 0 0 0 0 0 1851.63 0 0.01 0 0 0 0 0 0 0 0 0 0 0 0 0 0 0 0 0 
0 0 0 0 0 0 0 0 0 -1851.63 1369.75 0 0 0 0 0 0 0 0 0 0 0 -2450.56 0 0 0 0 1616.34 0 0 697.577 0 2091.36 0 0 0.04 0 0 0 0 434.812 0 0 0 -961.562 0 0 0 1699.5 0 0 0 
-631.657 0 0 0 0 0 0 551.851 437.407 0 0 2350.76 0 0 0 0 0 0 0 0 425.352 2019.18 0 0 481.964 0 1369.75 0 0 0 -2222.13 0 0 0 0 0 0.02 0 0 -1529.05 0 0 0 0 0 0 0 0 1171.83 0 0 0 
0 -2329.25 0 -221.946 0 330.744 0 0 0 0 1069.6 0 0 0 0 -1264.15 0 0 0 0 0 0 0 0 0 0 0 2493.74 1980.12 1454.74 0 0 0 0 0 0 0 0.06 0 0 -1112.48 0 652.715 2210.99 0 0 0 0 0 0 0 0 
0 790.201 0 0 0 0 0 -656.682 0 0 0 0 2376.25 0 -748.848 2376.09 1649.91 0 0 0 0 0 0 -552.614 0 0 0 0 0 0 0 0 2325.89 217.673 0 0 0 0 0.04 0 0 0 1900.16 0 0 -1607.18 0 0 0 0 0 0 
1135.06 1644.11 1364.1 0 0 0 0 0 0 0 0 0 0 0 0 0 0 0 0 0 0 0 0 0 0 0 0 0 0 0 0 1859.87 0 0 0 0 378.964 0 0 0.06 0 0 0 0 0 0 93.1578 0 -2304.07 0 1417.05 0 
1174.73 -154.5 0 0 0 1269.04 0 180.898 0 0 0 0 0 0 0 2190.85 0 0 0 0 0 0 0 0 490.051 0 0 0 0 0 0 0 0 0 0 -1170.61 0 -1051.29 0 0 0.07 2470.24 0 0 0 0 -394.681 0 135.884 0 1168.94 906.171 
0 651.952 0 0 0 0 -49.8215 0 0 -2420.8 2476.65 0 0 0 0 0 0 2129.05 0 0 0 0 0 0 0 0 494.629 0 0 0 1346.25 0 0 0 0 0 0 0 0 0 853.526 0.05 -151.601 1773.2 0 0 0 404.752 0 0 -2054.28 0 
0 -224.845 0 397.122 0 0 0 -1476.56 0 0 0 0 0 0 0 0 -1771.83 0 0 421.079 96.3622 0 0 0 0 2366.18 0 2158.19 0 0 0 0 -484.252 0 0 0 0 200.125 2421.87 0 0 2314.14 0 0 -953.017 -653.02 0 0 0 1043.5 -2049.09 0 
0 0 -608.768 0 1804.79 0 0 0 0 -1189.38 634.251 -450.53 0 0 0 0 0 0 0 0 701.849 0 0 0 0 406.43 0 1884.9 0 0 1762.98 0 0 -255.821 0 0 0 -2013.08 0 0 0 2044.21 0 0.04 0 0 0 0 1411.71 0 2386.78 2012.31 
0 -1065.02 0 0 0 0 0 1836.07 1375.55 0 0 0 189.901 0 0 0 0 0 0 0 -950.575 0 2224.57 272.759 0 0 2001.33 0 0 0 0 -2175.28 0 0 0 -332.728 0 0 0 0 0 0 -1475.49 0 0.06 0 1730.48 0 0 -2452.85 1385.46 0 
2001.48 0 0 0 0 0 0 -2213.89 0 0 0 0 -1222.5 1724.83 0 0 0 0 0 0 0 0 0 0 0 0 0 0 6.79037 1363.19 578.097 0 0 0 0 0 0 0 1246.3 0 0 0 -1848.89 0 0 0 0 1719.79 0 0 0 0 
0 0 0 0 0 0 0 0 0 -219.352 -1842.78 0 0 0 2216.33 2182.61 -1255.3 0 -1809.21 0 0 2170.86 0 2219.23 0 0 1272.7 1689.28 0 0 -507.904 0 0 0 0 0 0 0 0 1302.3 -969.802 0 0 0 2179.71 0 0.04 0 -1943.04 2083.27 0 0 
0 1910.23 0 0 0 2058.4 -75.6096 0 0 0 0 1984.24 0 0 0 -1407.13 0 0 0 0 0 0 0 0 30.5948 0 1672.64 0 0 0 314.722 0 1667.3 0 0 0 0 0 0 0 0 1278.8 0 0 0 -1519.44 0 0.07 1175.34 0 0 0 
0 0 0 0 0 656.072 0 0 0 0 48.4481 -903.577 2281.18 538.881 0 0 0 0 -2202.6 1788.16 -2086.63 0 1273.46 0 0 0 383.541 0 -2207.33 0 0 0 0 0 0 1746.65 1525.85 0 0 2124.16 -844.218 0 0 -73.6259 0 0 -1766.03 -1890.7 0.09 0 0 0 
-2227.77 926.618 0 0 0 0 0 -434.355 -1182.82 2041.46 0 -1027.94 0 2373.2 0 0 0 -798.135 506.684 0 0 0 -935.163 0 0 678.961 0 0 1470 0 0 876.11 0 0 0 0 0 0 0 0 0 0 2498.32 0 2263.33 0 937.91 0 0 0 -427.183 0 
0 0 -564.516 0 358.058 -452.208 0 0 -1188.47 0 1512.42 0 -536.286 0 0 0 0 2448.12 0 0 0 -466.399 0 346.614 718.329 -2106.16 0 -461.364 0 0 1069.75 0 -1145.44 166.707 0 0 0 0 0 2209.16 1630.38 837.657 1865.06 2163.23 2053.06 0 0 0 0 1692.18 0.06 0 
696.356 0 0 0 0 0 0 1334.5 0 0 0 0 0 0 0 0 415.281 -2029.4 182.577 0 -245.293 0 0 1997.67 1057.7 0 0 0 0 0 0 0 622.501 0 0 0 0 0 0 0 404.294 0 0 1076.46 0 0 0 0 0 0 0 0.09 
