*Vertices 51
*Matrix 
0 0 0 0 0 0 0 -960.189 0 0 1920.45 0 0 0 1349.3 0 0 0 0 0 0 0 0 0 0 0 0 0 0 0 1056.32 0 0 1136.59 0 0 0 0 0 2086.63 0 0 0 0 0 0 0 0 0 0 0 
0 0.04 0 0 0 0 0 0 1749.24 0 0 0 0 -2454.99 0 966.903 1571.32 0 0 0 0 0 0 0 0 0 0 0 0 0 0 1350.83 0 0 0 0 0 0 0 2478.64 879.925 0 0 0 0 0 0 0 0 0 0 
0 0 0 0 0 0 0 0 0 0 -1660.13 1748.18 0 1001.69 0 0 0 1439.33 0 475.402 0 0 0 0 0 0 0 0 0 0 0 0 0 0 0 0 2430.42 0 0 1536.84 -627.995 0 0 0 0 0 0 0 0 0 0 
0 0 0 0.01 0 0 0 0 0 0 0 0 0 0 0 0 0 -947.981 0 0 0 0 0 0 0 1032.36 0 0 0 0 0 0 0 0 0 0 0 0 0 0 0 0 0 0 0 0 0 0 0 0 0 
0 0 0 0 0.04 0 0 1192.28 0 0 0 0 0 212.485 -1081.19 0 0 0 0 0 0 0 0 0 0 0 0 0 0 0 0 0 0 0 0 0 0 0 0 0 0 0 0 0 0 0 0 0 0 0 0 
0 0 0 0 0 0 0 0 0 -82.4763 0 0 2054.12 0 0 0 -689.184 0 0 0 0 0 0 0 1738.72 0 0 0 -1614.66 0 0 0 0 0 154.958 0 0 0 0 0 0 0 0 0 0 0 0 0 0 0 0 
0 0 0 0 0 0 0.02 0 0 0 0 0 0 0 0 -515.381 0 -62.0289 0 0 0 0 0 0 0 0 1674.47 0 2303.16 0 0 0 0 0 1671.42 0 0 0 0 0 0 0 0 0 0 0 0 0 0 0 0 
710.242 0 0 0 -1645.48 0 0 0.08 0 0 0 0 0 0 0 713.141 0 0 2013.84 0 -674.23 0 0 0 0 0 0 0 -2319.79 1439.63 0 0 1829.97 0 2356.11 0 0 0 0 0 0 0 0 0 0 0 0 0 0 0 0 
0 2396.54 0 0 0 0 0 0 0 251.396 0 0 0 0 0 0 0 0 0 0 0 0 0 0 0 0 0 0 0 0 0 0 0 0 0 2479.09 0 0 0 0 0 659.734 0 -83.5444 0 1921.52 0 0 0 0 0 
0 0 0 0 0 2442.01 0 0 1437.65 0 0 0 644.017 0 0 -1425.9 0 0 0 0 0 0 0 0 0 0 0 0 0 0 -661.26 0 0 0 0 0 0 0 0 0 0 0 0 0 1868.27 0 0 0 0 0 0 
1629.61 0 -143.056 0 0 0 0 0 0 0 0 0 0 0 552.614 0 0 0 0 0 2077.93 -234.916 0 1691.41 0 0 0 0 0 -694.83 0 0 0 915.784 0 0 0 0 0 0 0 36.5459 0 0 0 0 0 0 0 0 0 
0 0 -1417.51 0 0 0 0 0 0 0 0 0.09 0 0 -959.578 0 0 0 0 0 0 0 0 0 0 0 0 0 0 0 0 0 0 0 0 -1256.22 2335.35 0 0 0 0 0 0 0 1856.52 1493.04 0 0 0 0 0 
0 0 0 0 0 69.3533 0 0 0 180.746 0 0 0.03 0 0 0 0 0 0 0 0 0 0 0 0 0 0 0 0 0 604.953 795.083 -682.775 1710.18 0 -1673.41 0 1614.81 0 0 0 0 0 0 0 0 0 0 0 0 0 
0 2261.65 1297.72 0 -1651.28 0 0 0 0 0 0 0 0 0.07 0 0 0 -1172.75 0 0 0 0 0 0 0 0 0 1779.31 0 0 0 0 0 380.947 0 0 0 0 0 0 0 0 0 0 0 0 0 0 0 0 0 
-173.574 0 0 0 1216.7 0 0 0 0 0 -1597.11 -1524.02 0 0 0.05 0 0 0 0 0 0 24.9489 0 1239.13 0 0 0 0 0 0 0 0 0 0 0 0 0 0 1560.03 0 0 0 0 0 0 2479.25 0 0 0 0 0 
0 441.679 0 0 0 0 641.575 1072.04 0 -24.9489 0 0 0 0 0 0.02 0 0 0 2353.66 -284.204 1253.32 0 0 0 0 0 0 763.192 733.284 0 0 0 0 0 0 0 0 0 0 0 0 0 0 0 0 0 0 -978.042 0 0 
0 2327.72 0 0 0 617.466 0 0 0 0 0 0 0 0 0 0 0.02 0 0 0 0 0 2040.09 0 859.478 0 0 0 0 -172.811 0 0 0 0 0 0 0 0 0 0 0 0 13.9622 0 2130.73 0 0 0 0 0 0 
0 0 -505.005 -2216.18 0 0 2421.57 0 0 0 0 0 0 1185.57 0 0 0 0.07 0 0 -336.543 0 0 2473.75 -1804.33 0 0 1891.46 0 0 -1146.05 0 0 0 0 0 2332 0 0 0 0 0 0 0 0 0 0 0 0 0 0 
0 0 0 0 0 0 0 -1600.31 0 0 0 0 0 0 0 0 0 0 0.06 -555.513 0 0 0 -2333.52 0 0 0 1307.79 0 0 0 1437.35 0 0 0 0 0 0 0 0 0 0 1281.09 -1061.2 2152.55 0 0 0 0 0 0 
0 0 -666.753 0 0 0 0 0 0 0 0 0 0 0 0 -600.375 0 0 1072.34 0.07 0 0 0 0 0 0 0 2206.87 0 0 0 0 0 0 0 0 0 2013.69 0 0 0 0 0 2390.29 0 0 0 0 0 0 0 
0 0 0 0 0 0 0 -356.533 0 0 -87.6644 0 0 0 0 46.617 0 1270.26 0 0 0.06 0 0 0 0 0 0 0 1053.73 0 0 0 0 0 2185.35 0 0 726.264 -2164.3 0 2493.29 0 0 0 0 0 0 0 0 0 0 
0 0 0 0 0 0 0 0 0 0 949.049 0 0 0 -454.344 -337.764 0 0 0 0 0 0.08 0 0 0 781.35 0 0 0 0 0 0 1616.18 0 0 0 0 0 0 -432.218 0 0 1025.35 0 -178.61 0 0 0 0 0 0 
0 0 0 0 0 0 0 0 0 0 0 0 0 0 0 0 537.049 0 0 0 0 0 0.04 0 0 1697.52 0 0 1400.11 0 0 0 -1068.53 0 0 0 0 33.4941 0 0 0 0 0 0 0 0 0 0 0 2049.7 0 
0 0 0 0 0 0 0 0 0 0 554.903 0 0 0 -555.055 0 0 580.233 1770.61 0 0 0 0 0.09 0 0 0 0 0 0 0 0 0 -313.654 0 0 0 0 0 -521.943 0 0 0 0 0 0 0 0 0 0 0 
0 0 0 0 0 -796.762 0 0 0 0 0 0 0 0 0 0 239.189 2011.7 0 0 0 0 0 0 0.09 0 0 -2217.7 0 0 0 2476.65 0 0 0 0 0 0 0 0 1524.32 0 0 0 0 0 0 0 0 0 0 
0 0 0 1418.73 0 0 0 0 0 0 0 0 0 0 0 0 0 0 0 0 0 2321.62 -1160.54 0 0 0.04 2280.88 0 0 0 0 0 0 0 0 0 0 0 0 0 0 0 0 0 0 0 0 0 0 0 0 
0 0 0 0 0 0 -120.319 0 0 0 0 0 0 0 0 0 0 0 0 0 0 0 0 0 0 -1245.54 0 0 0 0 0 0 0 0 0 0 0 0 -318.384 0 0 0 2437.44 0 1789.83 0 0 0 0 0 0 
0 0 0 0 0 0 0 0 0 0 0 0 0 -411.618 0 0 0 -2180.17 1717.35 -969.192 0 0 0 0 158.925 0 0 0.06 0 0 0 0 1894.21 1401.18 0 0 1416.9 0 0 0 0 0 1672.8 0 0 0 0 0 0 0 0 
0 0 0 0 0 -631.047 1875.13 -1284.91 0 0 0 0 0 0 0 -1490.6 0 0 0 0 1275.14 0 2023 0 0 0 0 0 0.02 264.977 0 0 0 0 0 0 0 0 0 0 0 0 0 0 0 0 0 0 0 0 0 
0 0 0 0 0 0 0 246.055 0 0 -485.931 0 0 0 0 -1143.45 1528.14 0 0 0 0 0 0 0 0 0 0 0 1519.29 0.03 0 0 0 0 0 0 0 0 0 0 0 0 0 0 0 0 0 0 0 0 0 
612.888 0 0 0 0 0 0 0 0 449.156 0 0 894.269 0 0 0 0 1427.88 0 0 0 0 0 0 0 0 0 0 0 0 0.05 0 0 0 0 0 -350.581 0 0 0 0 0 0 -734.657 0 0 0 0 0 0 0 
0 -1275.44 0 0 0 0 0 0 0 0 0 0 -789.59 0 0 0 0 0 2011.86 0 0 0 0 0 712.683 0 0 0 0 0 0 0.04 0 0 0 0 0 0 0 591.983 0 0 0 0 0 0 0 0 0 0 0 
0 0 0 0 0 0 0 2103.72 0 0 0 0 1692.48 0 0 0 0 0 0 0 0 1629.76 1676.76 0 0 0 0 -1452.45 0 0 0 0 0.02 0 0 0 0 1379.97 0 0 0 0 0 0 0 1197.62 0 0 0 0 1076.62 
124.134 0 0 0 0 0 0 0 0 0 -2023.15 0 -1110.64 309.381 0 0 0 0 0 0 0 0 0 2470.7 0 0 0 1077.68 0 0 0 0 0 0.06 0 1698.43 0 0 1334.65 0 110.248 0 0 0 0 0 0 0 0 0 0 
0 0 0 0 0 1736.27 1226.92 1810.13 0 0 0 0 0 0 0 0 0 0 0 0 1248.89 0 0 0 0 0 0 0 0 0 0 0 0 0 0.08 0 -1596.35 0 -2424.92 0 0 0 0 0 1944.26 0 0 2169.03 0 0 0 
0 0 0 0 0 0 0 0 -212.027 0 0 -275.658 727.332 0 0 0 0 0 0 0 0 0 0 0 0 0 0 0 0 0 0 0 0 -1241.26 0 0.05 1766.79 0 0 0 0 0 0 0 0 0 -103.381 0 0 0 0 
0 0 1589.48 0 0 0 0 0 0 0 0 1814.86 0 0 0 0 0 2027.57 0 0 0 0 0 0 0 0 0 2392.42 0 0 -284.051 0 0 0 2414.55 59.1296 0.08 0 1952.5 0 0 1525.24 0 0 0 0 0 0 0 0 0 
0 0 0 0 0 0 0 0 0 0 0 0 1435.67 0 0 0 0 0 0 2429.04 -154.195 0 -436.949 0 0 0 0 0 0 0 0 0 -161.519 0 0 0 0 0.05 0 0 435.881 0 0 968.429 0 0 0 0 0 0 0 
0 0 0 0 0 0 0 0 0 0 0 0 0 0 1370.66 0 0 0 0 0 319.147 0 0 0 0 0 632.725 0 0 0 0 0 0 1521.42 2038.41 0 1503.27 0 0.04 -1720.25 0 0 0 0 0 0 0 0 0 0 0 
-2341.3 1226.16 989.486 0 0 0 0 0 0 0 0 0 0 0 0 0 0 0 0 0 0 2151.94 0 -1498.23 0 0 0 0 0 0 0 850.169 0 0 0 0 0 0 -21.897 0.09 0 0 2118.82 -1733.53 0 0 0 0 0 0 0 
0 1991.71 -1957.99 0 0 0 0 0 0 0 0 0 0 0 0 0 0 0 0 0 -2028.34 0 0 0 433.287 0 0 0 0 0 0 0 0 961.257 0 0 0 1966.99 0 0 0.01 0 0 -511.109 0 0 0 0 0 0 0 
0 0 0 0 0 0 0 0 -1361.51 0 1802.19 0 0 0 0 0 0 0 0 0 0 0 0 0 0 0 0 0 0 0 0 0 0 0 0 0 503.327 0 0 0 0 0.08 0 0 0 0 0 0 0 0 0 
0 0 0 0 0 0 0 0 0 0 0 0 0 0 0 0 2208.85 0 909.68 0 0 -286.492 0 0 0 0 2036.27 -1186.48 0 0 0 0 0 0 0 0 0 0 0 -659.886 0 0 0.02 0 83.0866 0 0 0 0 0 0 
0 0 0 0 0 0 0 0 -671.484 0 0 0 0 0 0 0 0 0 -477.996 -1099.35 0 0 0 0 0 0 0 0 0 0 1064.41 0 0 0 0 0 0 2123.71 0 1171.22 1234.4 0 0 0.04 0 0 0 0 0 0 0 
0 0 0 0 0 0 0 0 0 -1685.92 0 1036.33 0 0 0 0 1559.42 0 1412.32 0 0 -755.104 0 0 0 0 1507.54 0 0 0 0 0 0 0 1340.75 0 0 0 0 0 0 0 1414.3 0 0.09 0 0 0 0 0 0 
0 0 0 0 0 0 0 0 1860.48 0 0 145.65 0 0 1576.66 0 0 0 0 0 0 0 0 0 0 0 0 0 0 0 0 0 -2468.87 0 0 0 0 0 0 0 0 0 0 0 0 0.01 0 0 0 0 0 
0 0 0 0 0 0 0 0 0 0 0 0 0 0 0 0 0 0 0 0 0 0 0 0 0 0 0 0 0 0 0 0 0 0 0 1395.99 0 0 0 0 0 0 0 0 0 0 0.09 0 0 0 0 
0 0 0 0 0 0 0 0 0 0 0 0 0 0 0 0 0 0 0 0 0 0 0 0 0 0 0 0 0 0 0 0 0 0 1916.94 0 0 0 0 0 0 0 0 0 0 0 0 0.07 0 0 0 
0 0 0 0 0 0 0 0 0 0 0 0 0 0 0 1665.93 0 0 0 0 0 0 0 0 0 0 0 0 0 0 0 0 0 0 0 0 0 0 0 0 0 0 0 0 0 0 0 0 0.05 0 0 
0 0 0 0 0 0 0 0 0 0 0 0 0 0 0 0 0 0 0 0 0 0 892.743 0 0 0 0 0 0 0 0 0 0 0 0 0 0 0 0 0 0 0 0 0 0 0 0 0 0 0.04 0 
0 0 0 0 0 0 0 0 0 0 0 0 0 0 0 0 0 0 0 0 0 0 0 0 0 0 0 0 0 0 0 0 1508.45 0 0 0 0 0 0 0 0 0 0 0 0 0 0 0 0 0 0.05 
