*Vertices 60
*Matrix 
0.02 0 0 0 0 0 0 0 0 0 0 0 0 0 0 0 0 0 0 0 0 0 0 -1571.63 0 0 0 0 0 0 0 0 0 0 0 0 1819.44 0 0 0 0 1998.12 0 0 0 -32.2733 0 0 2204.58 0 0 0 0 0 0 0 0 0 0 0 
0 0.04 0 0 0 0 0 0 0 0 0 911.969 0 0 0 0 0 0 0 0 0 0 0 0 0 0 0 0 2260.28 0 0 0 0 0 0 0 0 0 0 0 0 0 0 0 0 0 0 0 0 0 2315.21 0 0 0 0 0 2180.32 0 0 0 
0 0 0.02 0 985.214 0 0 0 0 0 0 0 0 0 0 0 0 0 0 2325.74 0 0 0 0 0 0 0 0 -1131.7 0 0 0 0 0 0 0 0 0 0 0 0 0 0 0 0 0 0 0 0 0 0 0 0 0 0 0 0 0 0 0 
0 0 0 0.03 0 0 0 0 0 0 185.171 0 0 -1731.7 0 0 0 0 0 -207.297 0 0 0 1333.28 0 0 980.789 0 2424.77 0 0 0 0 0 0 0 0 2021.62 0 0 0 0 0 0 0 1588.26 0 0 0 0 0 0 0 0 0 0 0 -1728.8 0 0 
0 0 -792.337 0 0.04 0 0 440.916 0 0 0 0 0 0 0 0 0 0 0 0 0 0 0 0 0 0 0 0 0 0 0 0 0 0 0 0 1575.44 0 0 1399.35 314.112 0 0 0 0 0 0 0 0 1810.28 0 0 0 0 0 0 0 0 0 0 
0 0 0 0 0 0.07 0 0 0 0 0 0 0 0 0 0 0 1744.82 0 0 0 0 -120.624 0 0 0 0 0 0 0 0 83.3918 -1956.01 0 0 0 0 0 0 343.562 0 0 0 0 299.005 0 2018.57 0 0 0 0 0 0 0 0 0 0 0 0 0 
0 0 0 0 0 0 0.04 0 0 0 0 0 0 0 0 0 0 0 0 0 0 0 0 0 0 0 -705.512 0 0 0 0 0 0 0 0 0 0 0 0 0 0 0 0 0 1132.77 0 0 0 0 1577.43 0 0 0 0 0 0 0 0 0 0 
0 0 0 0 -1380.43 0 0 0.03 0 0 0 0 0 0 754.189 0 0 1547.82 0 0 0 0 0 0 0 0 0 0 0 0 0 0 0 0 0 0 0 0 0 0 0 2439.42 0 0 0 0 0 0 543.001 0 0 0 0 0 0 0 0 0 0 0 
0 0 0 0 0 0 0 0 0.07 0 0 0 0 0 0 0 0 0 0 0 0 0 0 0 0 0 0 0 0 0 0 0 -5.56963 0 0 -29.0689 0 2035.36 0 955.458 0 0 0 0 0 0 0 0 0 0 0 0 0 2045.88 0 0 0 0 0 0 
0 0 0 0 0 0 0 0 0 0.05 0 -2230.52 0 0 0 0 0 0 0 0 0 0 0 0 0 0 0 0 0 1921.22 0 0 0 0 0 0 0 0 0 0 0 -325.251 0 1458.25 0 0 0 0 0 1385.62 0 0 0 0 0 0 0 0 0 -1582.92 
0 0 0 1819.13 0 0 0 0 0 0 0.04 0 0 0 0 0 0 0 0 -856.731 0 0 0 0 0 0 0 0 0 0 0 -951.491 0 0 0 2059.77 0 0 0 0 0 0 0 0 0 0 0 0 0 0 0 0 0 0 0 0 0 0 0 0 
0 -918.836 0 0 0 0 0 0 0 -66.3015 0 0.03 0 0 434.965 0 0 354.244 0 0 0 0 0 0 0 2456.66 0 0 0 1938.92 0 0 0 0 0 0 0 0 0 0 -2076.86 -1222.5 0 0 0 -486.389 0 0 885.266 0 0 0 0 0 0 0 0 0 0 0 
0 0 0 0 0 0 0 0 0 0 0 0 0.01 0 0 0 0 1383.79 0 0 0 0 0 2335.35 0 0 0 0 275.964 0 0 2212.67 0 0 0 0 0 0 0 0 0 0 0 -458.159 953.322 0 0 196.768 0 0 0 0 0 0 0 0 0 0 0 0 
0 0 0 1681.34 0 0 0 0 0 0 0 0 0 0.05 0 0 0 0 0 136.647 0 0 0 0 0 0 0 604.343 0 0 0 0 642.186 0 0 0 0 0 1432.62 0 0 0 -343.41 0 0 0 0 0 1221.27 304.804 0 0 0 0 -2312.16 0 0 0 0 0 
0 0 0 0 0 0 0 2115.62 0 0 0 1858.5 0 0 0.09 0 0 0 0 0 0 2411.34 0 0 0 0 0 -214.469 0 0 0 0 0 0 0 0 0 0 0 1754.28 0 0 0 0 0 0 0 0 1819.44 0 0 0 0 0 0 0 0 0 0 0 
0 0 0 0 0 0 0 0 0 0 0 0 0 0 0 0.03 0 0 0 0 0 0 0 0 0 0 0 0 0 0 0 0 0 0 0 -123.676 280.389 0 0 0 0 0 0 0 0 0 0 0 0 0 0 0 0 0 0 0 0 0 0 0 
0 0 0 0 0 0 0 0 0 0 0 0 0 0 0 0 0.01 0 0 0 0 0 0 0 0 0 0 0 0 0 2414.55 0 0 202.872 0 1461.3 0 0 0 0 0 0 854.442 0 -706.732 0 0 0 0 0 0 0 0 0 0 0 0 0 0 0 
0 0 0 0 0 1269.65 0 -55.0096 0 0 0 1470.61 -583.132 0 0 0 0 0.03 962.783 1993.39 0 0 0 0 0 0 0 0 0 0 0 0 0 0 0 1332.36 0 0 1517.3 0 0 0 0 0 0 0 0 0 0 0 0 0 0 0 0 0 0 0 0 0 
0 0 0 0 0 0 0 0 0 0 0 0 0 0 0 0 0 1620.15 0.06 0 0 1603.98 0 0 0 0 0 33.9518 0 0 0 0 0 0 1508.45 440.153 0 0 0 0 0 0 0 -1694.16 0 0 0 0 0 0 0 0 0 0 0 0 0 0 0 0 
0 0 -119.098 296.258 0 0 0 0 0 0 2489.78 0 0 -796.609 0 0 0 1833.78 0 0.09 0 0 0 0 0 0 0 0 0 0 0 530.183 0 0 0 0 0 0 0 0 0 0 539.186 0 0 0 0 -709.326 0 0 0 0 0 0 0 0 0 0 2402.04 0 
0 0 0 0 0 0 0 0 0 0 0 0 0 0 0 0 0 0 0 0 0.01 0 0 0 0 0 0 0 0 0 0 0 0 0 0 0 1915.88 0 0 0 0 0 0 0 0 0 0 0 0 0 0 0 0 0 0 0 0 0 0 0 
0 0 0 0 0 0 0 0 0 0 0 0 0 0 -1433.07 0 0 0 -1880.32 0 0 0.09 0 0 0 -366.756 2308.95 0 0 0 0 581.149 0 0 0 2192.53 0 0 0 0 0 0 0 0 0 -830.943 0 0 2364.8 0 0 0 0 0 0 0 0 0 0 0 
0 0 0 0 0 1111.1 0 0 0 0 0 0 0 0 0 0 0 0 0 0 0 0 0.01 0 0 0 -2488.86 -1528.14 0 0 0 0 0 0 0 0 0 0 0 1688.36 -616.245 0 0 0 0 0 0 0 0 1732.76 0 0 0 0 0 0 0 0 0 0 
2342.07 0 0 2360.99 0 0 0 0 0 0 0 0 -2193.9 0 0 0 0 0 0 0 0 0 0 0.06 2087.69 0 0 0 0 0 0 0 0 1188.47 0 -1631.6 0 0 0 0 0 0 -1316.19 0 1249.96 0 0 -800.119 0 0 0 0 0 0 0 0 0 0 0 0 
0 0 0 0 0 0 0 0 0 0 0 0 0 0 0 0 0 0 0 0 0 0 0 2189.93 0.01 0 0 0 0 0 0 0 0 0 0 -384.304 0 -941.878 0 0 0 0 0 0 0 0 -155.416 0 0 0 0 0 0 0 0 0 0 0 0 0 
0 0 0 0 0 0 0 0 0 0 0 156.026 0 0 0 0 0 0 0 0 0 2270.35 0 0 0 0.03 0 2106.46 0 0 0 0 0 0 0 0 0 0 0 2127.22 0 0 0 0 -1260.95 0 0 0 0 0 410.855 0 0 0 0 0 0 0 0 0 
0 0 0 302.667 0 0 324.488 0 0 0 0 0 0 0 0 0 0 0 0 0 0 291.986 1140.1 0 0 0 0.02 0 0 -2253.41 0 0 0 310.297 0 0 0 0 0 0 922.193 0 0 2201.83 0 0 0 0 0 0 0 0 0 0 0 0 0 0 0 0 
0 0 0 0 0 0 0 0 0 0 0 0 0 -197.378 1082.26 0 0 0 2165.21 0 0 0 2017.5 0 0 1259.12 0 0.09 1370.05 1304.44 -1396.91 -902.509 0 0 0 0 0 0 0 0 0 0 -1216.54 0 0 0 0 0 931.043 0 0 0 0 0 0 0 0 0 0 0 
0 -1763.89 930.128 1326.87 0 0 0 0 0 0 0 0 2147.66 0 0 0 0 0 0 0 0 0 0 0 0 0 0 2359.77 0.09 0 0 0 0 -570.467 0 1434.6 0 0 0 0 0 0 0 0 1531.65 0 0 0 64.0126 -883.587 0 0 0 0 0 0 0 0 0 0 
0 0 0 0 0 0 0 0 0 53.3311 0 1115.38 0 0 0 0 0 0 0 0 0 0 0 0 0 0 -534.455 1415.98 0 0.01 0 0 0 0 0 0 0 0 0 0 0 0 -68.5903 0 0 0 1404.23 0 0 0 0 0 0 0 0 0 0 0 0 0 
0 0 0 0 0 0 0 0 0 0 0 0 0 0 0 0 455.718 0 0 0 0 0 0 0 0 0 0 1519.29 0 0 0.04 0 0 0 0 0 0 526.215 0 0 -180.288 -1743.75 -1515.47 2179.25 0 0 0 0 -1736.12 0 0 0 0 0 0 0 0 0 0 0 
0 0 0 0 0 -1171.07 0 0 0 0 1437.04 0 549.562 0 0 0 0 0 0 1718.88 0 -554.598 0 0 0 0 0 -947.829 0 0 0 0.05 0 -1640.45 0 836.589 2262.72 0 0 0 0 0 0 0 0 0 0 0 0 0 0 0 0 0 0 0 0 0 0 0 
0 0 0 0 0 -204.398 0 0 757.698 0 0 0 0 -1056.02 0 0 0 0 0 0 0 0 0 0 0 0 0 0 0 0 0 0 0.03 0 2430.42 0 0 0 0 0 0 0 0 0 0 0 0 0 0 0 0 -1358.76 0 0 0 0 0 0 0 0 
0 0 0 0 0 0 0 0 0 0 0 0 0 0 0 0 1919.23 0 0 0 0 0 0 -2105.4 0 0 437.864 0 458.617 0 0 1885.05 0 0 -414.518 0 0 0 0 0 -1703.01 958.815 1646.55 0 0 0 0 0 0 0 0 0 0 0 0 0 0 0 0 0 
0 0 0 0 0 0 0 0 0 0 0 0 0 0 0 0 0 0 1723.76 0 0 0 0 0 0 0 0 0 0 0 0 0 2191.76 -3.89111 0.01 0 0 0 0 1958.45 0 0 0 0 0 0 0 -179.983 0 -644.017 0 0 0 0 0 0 0 0 0 0 
0 0 0 0 0 0 0 0 2219.53 0 -355.007 0 0 0 0 -526.826 1421.48 -691.473 -2098.22 0 0 2057.18 0 1400.57 1917.4 0 0 0 -875.347 0 0 930.433 0 0 0 0.08 0 0 0 -2008.8 0 0 0 0 0 0 0 0 0 0 0 0 0 0 0 -1447.72 0 0 0 0 
-2250.66 0 0 0 1489.53 0 0 0 0 0 0 0 0 0 0 -653.02 0 0 0 0 927.534 0 0 0 0 0 0 0 0 0 0 649.815 0 0 0 0 0.03 0 0 0 387.356 0 0 0 0 0 0 0 0 0 0 0 0 0 0 0 0 0 0 0 
0 0 0 -540.559 0 0 0 0 1799.75 0 0 0 0 0 0 0 0 0 0 0 0 0 0 0 1854.23 0 0 0 0 0 1554.69 0 0 0 0 0 0 0.08 0 0 0 0 192.801 0 0 -2494.81 0 0 2186.57 0 0 0 0 0 0 0 0 0 0 0 
0 0 0 0 0 0 0 0 0 0 0 0 0 -139.393 0 0 0 1551.48 0 0 0 0 0 0 0 0 0 0 0 0 0 0 0 0 0 0 0 0 0.09 0 0 0 0 0 0 1193.04 0 0 0 0 0 0 0 0 0 0 0 0 0 0 
0 0 0 0 2221.82 -1181.6 0 0 -1138.11 0 0 0 0 0 -462.127 0 0 0 0 0 0 0 998.337 0 0 349.361 0 0 0 0 0 0 0 0 1660.28 1748.94 0 0 0 0.08 0 0 0 -244.224 0 0 2105.09 0 0 0 0 0 0 0 0 0 0 0 0 0 
0 0 0 0 942.03 0 0 0 0 0 0 785.47 0 0 0 0 0 0 0 0 0 0 -1291.16 0 0 0 1505.1 0 0 0 951.186 0 0 437.864 0 0 2215.57 0 0 0 0.08 0 0 0 0 0 0 0 0 0 0 0 -1599.25 0 0 0 0 0 0 0 
2080.07 0 0 0 0 0 0 1323.21 0 -1700.26 0 1477.63 0 0 0 0 0 0 0 0 0 0 0 0 0 0 0 0 0 0 1855.14 0 0 2073.96 0 0 0 0 0 0 0 0.04 0 0 0 0 0 0 1367.76 0 0 0 0 0 0 0 0 0 0 0 
0 0 0 0 0 0 0 0 0 0 0 0 0 2344.81 0 0 2238 0 0 1723.61 0 0 0 -933.485 0 0 0 2335.66 0 -6.48518 -1325.95 0 0 -2044.51 0 0 0 2477.72 0 0 0 0 0.03 0 0 0 0 0 0 0 1205.4 0 0 0 0 0 0 0 0 0 
0 0 0 0 0 0 0 0 0 2306.21 0 0 1730.17 0 0 0 0 0 279.473 0 0 0 0 0 0 0 -1896.5 0 0 0 -85.2229 0 0 0 0 0 0 0 0 -950.423 0 0 0 0.09 0 0 2168.57 0 0 0 0 0 0 0 0 0 0 0 0 0 
0 0 0 0 0 907.697 1157.8 0 0 0 0 0 -730.079 0 0 0 1567.66 0 0 0 0 0 0 2159.57 0 -715.278 0 0 -9.84222 0 0 0 0 0 0 0 0 0 0 0 0 0 0 0 0.05 0 0 0 0 0 0 0 0 0 0 0 0 0 0 0 
-193.411 0 0 -1324.58 0 0 0 0 0 0 0 1066.85 0 0 0 0 0 0 0 0 0 2380.52 0 0 0 0 0 0 0 0 0 0 0 0 0 0 0 1597.11 -168.081 0 0 0 0 0 0 0.09 0 0 0 0 0 0 0 0 0 0 0 0 0 0 
0 0 0 0 0 -104.45 0 0 0 0 0 0 0 0 0 0 0 0 0 0 0 0 0 0 913.8 0 0 0 0 2091.51 0 0 0 0 0 0 0 0 0 -958.205 0 0 0 -2116.99 0 0 0.09 0 0 1910.69 0 0 0 0 0 0 0 0 0 0 
0 0 0 0 0 0 0 0 0 0 0 0 1777.17 0 0 0 0 0 0 -1965.62 0 0 0 1414.61 0 0 0 0 0 0 0 0 0 0 257.042 0 0 0 0 0 0 0 0 0 0 0 0 0.06 -2061.6 0 0 0 0 0 0 0 0 0 0 0 
1265.37 0 0 0 0 0 0 1786.32 0 0 0 -825.907 0 -1122.85 610.294 0 0 0 0 0 0 -638.218 0 0 0 0 0 1030.84 2277.06 0 2317.04 0 0 0 0 0 0 785.012 0 0 0 868.938 0 0 0 0 0 -405.362 0 0 1815.62 0 0 0 0 0 0 0 0 0 
0 0 0 0 -1513.64 0 1398.89 0 0 1850.11 0 0 0 1101.18 0 0 0 0 0 0 0 0 -1609.01 0 0 0 0 0 -1493.5 0 0 0 0 0 1718.88 0 0 0 0 0 0 0 0 0 0 0 2216.03 0 0 0.07 0 0 0 0 0 0 0 0 0 0 
0 364.772 0 0 0 0 0 0 0 0 0 0 0 0 0 0 0 0 0 0 0 0 0 0 0 504.852 0 0 0 0 0 0 0 0 0 0 0 0 0 0 0 0 -1181.91 0 0 0 0 0 288.934 0 0.08 0 0 0 0 0 0 0 0 0 
0 0 0 0 0 0 0 0 0 0 0 0 0 0 0 0 0 0 0 0 0 0 0 0 0 0 0 0 0 0 0 0 437.254 0 0 0 0 0 0 0 0 0 0 0 0 0 0 0 0 0 0 0.02 0 0 0 0 0 0 0 0 
0 0 0 0 0 0 0 0 0 0 0 0 0 0 0 0 0 0 0 0 0 0 0 0 0 0 0 0 0 0 0 0 0 0 0 0 0 0 0 0 257.958 0 0 0 0 0 0 0 0 0 0 0 0.03 0 0 0 0 0 0 0 
0 0 0 0 0 0 0 0 985.672 0 0 0 0 0 0 0 0 0 0 0 0 0 0 0 0 0 0 0 0 0 0 0 0 0 0 0 0 0 0 0 0 0 0 0 0 0 0 0 0 0 0 0 0 0.03 0 0 0 0 0 0 
0 0 0 0 0 0 0 0 0 0 0 0 0 2393.95 0 0 0 0 0 0 0 0 0 0 0 0 0 0 0 0 0 0 0 0 0 0 0 0 0 0 0 0 0 0 0 0 0 0 0 0 0 0 0 0 0.07 0 0 0 0 0 
0 0 0 0 0 0 0 0 0 0 0 0 0 0 0 0 0 0 0 0 0 0 0 0 0 0 0 0 0 0 0 0 0 0 0 882.977 0 0 0 0 0 0 0 0 0 0 0 0 0 0 0 0 0 0 0 0.06 0 0 0 0 
0 710.852 0 0 0 0 0 0 0 0 0 0 0 0 0 0 0 0 0 0 0 0 0 0 0 0 0 0 0 0 0 0 0 0 0 0 0 0 0 0 0 0 0 0 0 0 0 0 0 0 0 0 0 0 0 0 0.05 0 0 0 
0 0 0 293.97 0 0 0 0 0 0 0 0 0 0 0 0 0 0 0 0 0 0 0 0 0 0 0 0 0 0 0 0 0 0 0 0 0 0 0 0 0 0 0 0 0 0 0 0 0 0 0 0 0 0 0 0 0 0.03 0 0 
0 0 0 0 0 0 0 0 0 0 0 0 0 0 0 0 0 0 0 2093.19 0 0 0 0 0 0 0 0 0 0 0 0 0 0 0 0 0 0 0 0 0 0 0 0 0 0 0 0 0 0 0 0 0 0 0 0 0 0 0.02 0 
0 0 0 0 0 0 0 0 0 434.965 0 0 0 0 0 0 0 0 0 0 0 0 0 0 0 0 0 0 0 0 0 0 0 0 0 0 0 0 0 0 0 0 0 0 0 0 0 0 0 0 0 0 0 0 0 0 0 0 0 0.08 
