*Vertices 67
*Matrix 
0.07 0 938.52 0 -1965.93 -1044.11 0 0 0 0 0 1381.34 0 0 0 0 0 0 0 1316.34 0 0 0 2048.78 0 0 0 0 -1011.15 0 0 2440.18 -840.556 0 0 2099.75 0 1620.3 0 124.134 -2038.71 1603.98 0 2314.14 0 -1278.5 0 0 0 -221.183 0 -1098.13 0 0 0 -1315.88 0 0 0 0 0 0 1845.38 1961.2 0 0 0 
0 0.06 0 0 0 0 0 0 1124.07 0 0 0 0 -435.27 -1857.59 0 0 0 739.692 0 0 0 0 0 175.253 -1742.84 2158.19 0 0 0 0 793.405 0 0 -298.09 0 1597.87 0 0 0 0 0 0 0 1468.78 1850.41 0 -1724.83 0 0 0 -194.632 0 -1486.02 0 0 0 0 0 -1086.23 0 0 0 0 1349.3 0 0 
389.95 0 0.05 1161.76 0 0 0 2118.21 0 0 -599.612 -1263.08 2412.72 -2484.28 -54.7044 322.657 0 866.192 0 0 0 0 -2272.33 0 0 0 0 0 0 1183.13 -1316.64 -2340.08 -860.393 -2458.04 0 0 425.047 -713.294 0 1807.54 2077.01 702.46 -1933.73 1703.01 1271.78 0 0 0 0 0 0 0 0 -1832.1 0 0 2131.79 1866.13 -1308.4 600.07 0 0 0 0 0 0 0 
0 0 -837.962 0.04 0 0 2317.35 -1467.86 1012.07 0 542.848 0 -1578.49 0 0 -299.463 1199.91 -616.55 0 0 0 0 0 2383.88 0 0 -909.833 0 0 0 0 0 2190.69 -1258.51 0 986.282 -448.393 0 0 0 0 0 0 0 451.903 0 0 0 0 0 0 0 0 1400.72 -285.73 0 0 0 0 0 0 0 0 0 -302.515 0 0 
-590.457 0 0 0 0.06 0 0 0 0 0 0 0 454.497 2461.85 0 -857.341 1246.3 0 0 0 0 0 0 2119.74 0 0 0 0 0 0 45.2437 0 0 0 0 0 0 0 0 0 0 0 0 0 0 0 0 -36.3933 -621.128 1269.34 0 -721.381 0 0 0 0 0 0 -18.0822 0 0 0 0 0 0 0 0 
2406.16 0 0 0 0 0.08 0 0 0 0 0 0 1446.81 0 0 1684.7 0 0 0 -1209.68 0 0 0 0 0 0 0 783.181 -2172.38 0 -74.6941 0 0 0 0 0 0 0 0 0 0 0 0 873.211 0 0 0 2219.69 0 0 0 0 0 1307.03 0 1866.89 0 1452.76 1808.91 0 0 0 0 0 0 0 0 
0 0 0 -471.587 0 0 0.09 1271.48 0 -2089.53 0 -1892.07 0 0 0 0 0 0 -774.636 0 0 0 0 0 0 1503.27 0 0 0 0 0 0 -309.687 0 0 0 0 156.941 144.734 0 0 0 0 0 1296.35 915.937 0 566.5 0 0 0 0 0 0 -298.242 2256.61 1340.3 1931.14 0 -2384.03 0 0 0 0 0 0 0 
0 0 1316.95 1134.91 0 0 -2199.55 0 0 -1706.52 0 0 0 0 0 0 0 -2223.5 0 0 0 -1427.27 0 0 0 0 -1169.7 0 0 -2278.44 0 -152.821 1614.51 0 20.9815 0 0 975.753 0 1691.26 0 0 0 -15.3356 1326.26 0 0 2285.91 0 0 0 0 1896.5 0 0 0 0 0 -611.667 0 0 0 0 2358.39 2251.73 0 0 
0 -1544.77 0 287.866 0 0 0 0 0.06 0 0 0 0 -1405.45 0 0 0 345.241 0 0 -1840.65 1555.15 0 0 0 2432.1 0 0 0 0 0 293.817 0 0 1020.16 0 0 0 0 0 0 0 0 0 2161.55 -2419.13 0 2052.75 0 -1908.25 0 -2153.31 0 0 0 0 0 0 0 -1104.08 2307.28 0 0 0 0 0 0 
0 0 0 0 0 0 1239.89 980.483 0 0.07 0 0 0 -153.279 0 2059.47 0 0 773.11 1630.07 -1011.15 0 0 -991.775 952.101 -610.904 0 0 0 0 2330.47 1461.46 0 0 0 0 0 -1291.77 0 507.752 0 0 2335.2 -350.429 0 0 0 0 0 0 0 0 0 0 0 1868.88 0 923.261 0 637.761 0 0 0 0 0 0 0 
0 0 1223.72 241.325 0 0 0 0 0 0 0.02 2040.24 0 0 0 0 -93.6155 1493.5 -1413.54 2354.12 0 0 -458.312 0 0 0 0 0 -1168.32 395.444 0 0 0 0 -1331.29 1366.08 0 0 1330.68 0 2122.18 0 0 0 0 0 -1571.17 0 0 0 0 2089.37 0 0 0 632.42 0 0 0 197.378 0 0 0 185.781 0 0 0 
1681.8 0 1131.24 0 0 0 -625.858 0 0 0 -2382.2 0.02 0 0 0 0 0 0 0 0 0 -1153.98 0 0 0 2330.01 0 0 500.732 0 0 -1667.91 1607.64 0 0 0 0 0 0 0 0 -1162.53 0 2415.77 0 0 0 0 0 -1272.55 10.1474 -845.134 0 1773.35 0 0 0 0 2064.81 -1393.25 0 0 0 1867.05 0 0 0 
0 0 959.883 1488.46 -2137.44 2317.5 0 0 0 0 0 0 0.08 0 0 2094.71 0 0 0 0 0 0 0 0 0 0 -1823.86 2282.25 952.864 0 0 1176.41 0 0 2295.53 854.442 0 -2222.59 0 0 0 609.073 0 0 0 0 0 1183.58 0 0 0 1032.21 -1509.22 0 0 0 -1775.8 0 0 0 0 0 0 0 0 0 0 
0 1863.84 -1318.63 0 976.516 0 0 0 -2302.55 -1518.52 0 0 0 0.09 0 738.166 0 0 0 0 0 2056.26 1042.74 -1787.24 0 0 0 825.907 2497.56 -631.199 0 0 0 -1482.67 -772.195 -1168.48 0 0 1901.68 0 0 0 1206.02 0 0 1275.29 0 -1719.95 0 1089.59 0 0 1081.5 0 0 0 0 0 2498.17 0 365.383 0 0 0 0 0 0 
0 862.377 -1802.65 0 0 0 0 0 0 0 0 0 0 0 0.09 0 0 -1996.75 0 1309.78 0 0 -1086.54 0 0 0 -912.122 -1115.99 2041.76 0 0 0 1523.1 0 0 0 0 0 0 0 0 0 953.475 1560.34 0 596.866 0 0 -1046.86 0 -1598.79 0 1291.77 0 0 0 0 -1455.66 0 2193.29 0 0 0 0 0 0 0 
0 0 1997.67 -1724.68 859.63 -1469.54 0 0 0 -1136.43 0 0 -1396.15 176.321 0 0.06 0 0 0 0 629.978 0 0 -152.364 0 0 1889.63 0 0 0 0 0 0 0 2011.7 0 0 0 -155.263 0 0 1764.35 0 0 0 0 0 0 -1088.06 0 0 0 2456.21 0 0 0 0 0 0 0 0 0 0 0 0 1854.53 0 
0 0 0 1428.19 -2247.15 0 0 0 0 0 831.858 0 0 0 0 0 0.02 0 0 0 0 0 2103.56 0 -83.2392 0 2138.51 0 1553.16 0 -1.29704 0 0 777.383 0 0 0 -1294.37 0 -888.775 -924.482 -1784.49 0 0 0 701.239 0 300.378 0 768.227 0 0 -57.7563 0 0 -300.226 1072.65 0 0 0 0 0 0 0 0 0 647.832 
0 0 -1205.1 -2272.94 0 0 0 -925.55 -2086.02 0 1075.55 0 0 0 1952.65 0 0 0 0 0 -1626.26 0 0 0 0 -733.894 0 0 0 0 0 0 665.838 0 0 2067.71 0 0 2265.47 0 0 0 1090.81 302.973 0 0 0 0 0 0 0 0 0 2321.16 0 0 0 0 0 2197.56 0 0 -1759.77 1757.33 0 0 0 
0 -1643.8 0 0 0 0 -634.098 0 0 1619.24 1968.52 0 0 0 0 0 0 0 0.02 0 0 0 1330.53 0 0 0 0 0 -2029.56 0 0 0 0 -2217.4 0 730.995 1292.54 0 0 1625.49 0 0 0 0 654.393 0 -990.097 0 0 -1189.54 0 2219.53 0 0 0 751.9 -2249.6 0 0 0 0 0 0 0 0 0 0 
1560.95 0 0 0 0 -1136.89 0 0 0 -223.014 2071.37 0 0 0 773.568 0 0 0 0 0.02 0 0 0 -960.189 0 0 0 -1279.41 0 0 0 0 0 0 1865.37 0 -657.445 1075.09 0 0 -353.633 0 1543.4 -1413.85 0 830.18 -855.358 0 0 0 0 0 0 0 102.466 0 0 0 0 0 0 0 0 0 271.691 0 0 
0 0 0 0 0 0 0 0 -995.895 2173.45 0 0 0 0 0 -2497.71 0 1191.52 0 0 0.05 1506.01 1032.21 0 0 -1233.79 0 -2077.17 -1535.62 0 0 0 0 0 -384.61 -1063.04 1552.25 0 -529.267 0 264.824 0 945.54 0 779.824 -487.609 0 0 -1135.82 1753.21 1918.62 0 0 0 0 0 0 0 1857.43 0 0 0 0 0 0 0 0 
0 0 0 0 0 0 0 -466.857 1843.09 0 0 872.143 0 -1322.9 0 0 0 0 0 0 -2435 0.02 -310.144 0 0 0 2080.68 2285.45 -875.805 0 0 0 0 0 0 0 0 0 0 0 0 0 0 0 0 0 2332.76 0 -1244.01 927.992 839.03 0 0 0 0 0 0 0 0 926.008 0 0 0 0 0 0 0 
0 0 -956.526 0 0 0 0 0 0 0 -1720.4 0 0 91.6318 -831.553 0 1809.98 0 768.532 0 1183.13 2234.34 0.07 0 0 2275.69 2053.67 -396.359 0 0 1501.59 0 0 0 1484.65 1010.7 -2227.47 0 0 0 -2377.01 40.2081 0 0 0 0 0 0 0 0 0 0 0 0 819.651 0 0 0 0 0 0 0 0 0 0 0 -377.59 
1752.6 0 0 24.0333 -35.6304 0 0 0 0 -1522.64 0 0 0 1685.31 0 -2295.07 0 0 0 -851.39 0 0 0 0.06 -2147.21 0 0 0 2397 0 0 0 -1474.43 0 0 2044.36 0 0 0 0 0 2283.32 0 0 0 0 0 0 0 1429.11 0 0 0 -1895.12 0 0 0 0 0 0 0 260.094 338.221 0 0 0 0 
0 -306.94 0 0 0 0 0 0 0 323.878 0 0 0 0 0 0 -484.71 0 0 0 0 0 0 1797.16 0.03 0 0 0 0 0 0 0 0 0 0 0 0 -847.118 0 0 771.279 0 1778.54 2480.62 0 0 0 0 0 0 0 0 -2082.96 -2304.53 0 899.915 0 51.9578 0 0 0 0 0 0 0 -1788.46 0 
0 2135.3 0 0 0 0 -2422.03 0 379.574 443.358 0 1431.24 0 0 0 0 0 -521.332 0 0 909.223 0 -689.489 0 0 0.05 -1453.67 1408.51 0 0 0 394.223 0 0 0 0 0 0 0 1873.61 0 0 0 0 0 0 2290.03 0 0 -250.786 0 -1669.13 0 0 0 0 8.46889 0 0 189.901 0 0 0 0 0 -2467.5 0 
0 -324.946 0 -2437.74 0 0 0 1345.33 0 0 0 0 884.198 0 -197.684 1266.44 2142.93 0 0 0 0 1107.29 343.257 0 0 1027.18 0.09 0 1650.06 0 0 0 -1308.1 -2070.76 -1680.27 0 0 0 278.405 1995.68 0 0 2391.05 0 0 0 0 1179.46 -1281.7 0 0 0 0 0 1118.27 -1731.85 0 0 0 -1245.84 0 0 0 -1626.71 0 0 0 
0 0 0 0 0 307.55 0 0 0 0 0 0 -1194.27 525.605 691.626 0 0 0 0 404.294 400.327 389.645 1214.41 0 0 -111.164 0 0.02 0 7.55333 0 0 -229.728 522.858 0 1353.57 0 897.015 0 0 -1728.64 0 0 0 0 0 0 0 0 0 0 0 0 0 0 -282.983 0 0 0 1394.16 0 -1353.27 0 0 0 0 -544.679 
1719.64 0 0 0 0 -66.1489 0 0 0 0 1809.67 2417.75 -1531.95 -2043.6 1993.85 0 -1695.53 0 923.414 0 2139.12 1463.9 0 -2084.03 0 0 2247.46 0 0.05 0 482.269 0 115.284 0 0 0 0 0 0 0 0 0 0 0 0 0 0 0 0 0 0 0 1639.23 2132.56 1056.78 0 0 578.249 0 0 0 0 0 0 2054.12 0 0 
0 0 1825.24 0 0 0 0 -404.904 0 0 2081.29 0 0 -2378.54 0 0 0 0 0 0 0 0 0 0 0 0 0 295.495 0 0.02 0 -1286.43 0 2452.39 0 0 2366.48 0 0 0 0 1445.43 0 0 0 0 0 0 0 -1403.78 1738.41 -1853.47 -1610.69 0 0 -1137.35 2483.67 0 74.5415 -1307.95 0 0 0 0 0 0 0 
0 0 1022.9 0 -1632.36 1231.04 0 0 0 839.03 0 0 0 0 0 0 -1258.96 0 0 0 0 0 -2447.81 0 0 0 0 0 1989.73 0 0.02 -1889.48 0 0 0 0 0 0 0 2340.54 0 0 0 0 0 1648.23 0 0 1598.64 0 0 0 0 0 0 74.0837 2466.43 0 0 0 -162.893 -230.186 0 0 0 0 0 
768.227 -1336.33 1885.36 0 0 0 0 -766.243 2289.42 1258.51 0 -455.718 2456.82 0 0 0 0 0 0 0 0 0 0 0 0 1497.92 0 0 0 -1057.39 -1458.71 0.05 75.457 1449.86 0 0 -680.334 2120.66 0 0 0 0 -404.447 0 0 1656.62 1490.91 0 0 0 0 1344.72 0 0 -1020 0 2066.18 0 1466.64 1755.65 0 0 0 0 0 0 0 
-1834.24 0 -2405.09 1495.79 0 0 1292.23 550.935 0 0 0 2181.54 0 0 -690.558 0 0 877.331 0 0 0 0 0 1404.54 0 0 1825.24 486.389 -2465.67 0 0 1501.43 0.05 0 649.205 -343.562 0 0 0 -1042.74 -1707.13 -781.961 0 0 0 0 0 376.217 0 0 0 -2125.23 217.521 0 0 0 0 0 0 0 2261.35 0 0 0 0 0 2172.84 
0 0 335.932 -880.078 0 0 0 0 0 0 0 0 0 -1045.64 0 0 1890.09 0 -191.733 0 0 0 0 0 0 0 -1296.04 1424.07 0 -1722.24 0 1925.03 0 0.09 0 0 0 0 0 235.984 0 1676 0 1776.25 0 0 0 0 0 2443.39 0 0 413.449 0 0 1271.02 0 0 0 0 0 0 0 0 0 432.524 0 
0 -188.07 0 0 0 0 0 -954.237 -39.7504 0 2323.45 0 1858.81 1539.28 0 1634.04 0 0 0 -2142.63 1868.42 0 -308.466 0 0 0 -1900.62 0 0 0 0 0 -781.655 0 0.06 0 0 0 0 376.064 0 0 1812.11 0 0 2416.84 -2447.66 0 0 0 2284.54 0 0 -834.91 -392.087 -79.8822 104.755 927.992 0 0 0 -1519.44 0 0 0 0 0 
-1206.47 0 0 -262.383 0 0 0 0 0 0 283.746 0 1504.64 -1222.65 0 0 0 -783.334 751.595 0 -394.528 0 2180.62 1092.64 0 0 0 1776.56 0 0 0 0 704.443 0 0 0.01 0 0 0 0 0 -194.632 0 0 0 0 0 0 469.909 0 0 0 1258.81 0 0 852 0 -1399.96 0 0 0 0 0 -2372.74 2173.91 0 0 
0 845.744 -236.9 1380.43 0 0 0 0 0 0 0 0 0 0 0 0 0 0 -634.098 -865.886 2073.66 0 1792.58 0 0 0 0 0 0 -1112.93 0 103.229 0 0 0 0 0.08 0 0 0 0 -689.032 686.438 0 0 2337.18 0 0 2049.24 0 0 0 0 0 0 0 2131.49 0 0 0 0 0 0 0 0 1990.8 0 
-2409.05 0 1429.41 0 0 0 1476.56 1752.45 0 863.14 0 0 -261.01 0 0 0 1459.78 0 0 1814.71 0 0 0 0 -442.137 0 0 913.8 0 0 0 -532.929 0 0 0 0 0 0 -1192.43 0 0 -1148.03 0 0 2292.17 -550.783 2418.82 0 0 0 0 0 0 -40.5133 0 226.981 0 -1667.91 0 -656.682 0 0 0 0 0 0 0 
0 0 0 0 0 0 -391.018 0 0 0 -1149.56 0 0 970.26 0 1475.19 0 522.553 0 0 -2381.44 0 0 0 0 0 1526.61 0 0 0 0 0 0 0 0 0 0 -1353.11 0.02 0 0 0 1723.15 0 100.024 2341 0 0 0 0 121.54 0 0 0 0 0 802.866 0 0 0 0 0 913.495 0 0 0 0 
-2364.5 0 -1134.6 0 0 0 0 2257.68 0 2171.62 0 0 0 0 0 0 2310.17 0 1951.73 0 0 0 0 0 0 1986.22 1329 0 0 0 214.469 0 -1041.98 -2161.7 -2191.15 0 0 0 0 0.07 629.978 -9.84222 0 0 0 -592.135 -717.719 0 0 611.667 0 1066.24 -1634.5 0 0 0 0 0 0 0 0 74.0837 0 0 -1745.43 -1197.16 0 
1328.7 0 2119.89 0 0 0 0 0 0 0 -1432 0 0 0 0 0 2452.09 0 0 1686.53 -1014.82 0 -1516.08 0 1609.93 0 0 845.134 0 0 0 0 -431.761 0 0 0 0 0 0 -2081.9 0.03 0 1601.99 -356.685 1893.9 1440.55 2286.98 0 -363.399 0 0 0 0 0 0 1583.99 1208.76 0 0 0 0 -155.11 0 1688.21 0 0 0 
-1168.94 0 953.322 0 0 0 0 0 0 0 0 51.0422 -472.198 0 0 -1205.4 1532.72 0 0 0 0 0 -1747.57 1958.3 0 0 0 0 0 101.245 0 0 2192.37 2498.17 0 1569.19 -1564.76 1374.94 0 1535.77 0 0 573.672 0 0 0 0 0 0 0 1195.03 0 0 0 0 0 0 0 0 0 0 1844.92 0 0 0 0 0 
0 0 2256.61 0 0 0 0 0 0 -44.9385 0 0 0 -191.58 2010.33 0 0 358.821 0 -1372.49 -2270.04 0 0 0 -1278.34 0 -595.645 0 0 0 0 -1526 0 0 611.667 0 908.917 0 2483.67 0 898.083 2411.5 0.07 0 0 1789.38 0 0 0 -1885.2 182.73 383.847 0 2188.56 867.87 -2104.63 2019.33 0 0 -1948.53 0 0 0 0 0 0 0 
-1042.28 0 1536.99 0 0 1837.44 0 1323.51 0 1370.51 0 -184.103 0 0 1411.71 0 0 -1479 0 -454.802 0 0 0 0 -2375.94 0 0 0 0 0 0 0 0 -1796.85 0 0 0 0 0 0 866.955 0 0 0.09 0 0 0 0 0 0 0 0 0 0 0 0 0 0 0 0 0 -491.119 0 0 0 0 0 
0 1367.76 -2127.98 -123.371 0 0 -270.623 -447.325 -245.75 0 0 0 0 0 0 0 0 0 599.002 0 1615.12 0 0 0 0 0 0 0 0 0 0 0 0 0 0 0 0 1918.32 920.362 0 721.839 0 0 0 0.05 0 -1008.26 0 0 0 0 0 337.458 772.5 0 0 0 0 0 0 0 0 0 0 0 0 0 
-15.0304 2312.62 0 0 0 0 -616.55 0 1390.04 0 0 0 0 2379.6 559.481 0 2454.07 0 0 -781.35 -82.4763 0 0 0 0 0 0 0 0 0 -1893.75 32.4259 0 0 269.402 0 2257.23 162.74 513.092 265.13 -1397.06 0 356.533 0 0 0 0 -2394.56 0 0 0 0 0 0 0 0 0 0 0 0 0 0 -1909.47 0 -549.715 0 0 
0 0 0 0 0 0 0 0 0 0 1857.89 0 0 0 0 0 0 0 -2345.58 -1838.21 0 1254.23 0 0 0 1962.42 0 0 0 0 0 -2001.33 0 0 -59.74 0 0 615.177 0 1403.01 964.461 0 0 0 1692.79 0 0.07 0 414.975 141.072 23.8807 0 2306.21 0 0 0 0 0 0 0 0 0 0 0 0 2308.19 -1156.42 
0 -1246.6 0 0 -1962.42 -105.67 506.684 413.449 -1004.44 0 0 0 -353.786 1762.52 0 0 230.949 0 0 0 0 0 0 0 0 0 1428.04 0 0 0 0 0 -1475.04 0 0 0 0 0 0 0 0 0 0 0 0 535.829 0 0 0 0 0 0 0 0 1997.51 -169.912 0 0 0 0 0 0 0 0 0 0 0 
0 0 0 0 -10.3 0 0 0 0 0 0 0 0 0 -671.484 -823.008 0 0 0 0 1754.43 284.661 0 0 0 0 1296.96 0 0 0 1449.4 0 0 0 0 116.81 -48.7533 0 0 0 2022.08 0 0 0 0 0 -2143.24 0 0.06 0 0 0 0 1995.83 2485.35 0 13.5044 0 -1711.1 0 0 0 0 0 0 0 0 
-799.661 0 0 0 506.226 0 0 0 559.938 0 0 893.506 0 -2171.77 0 0 2301.93 0 -1776.25 0 -2117.6 -2298.27 0 -182.577 0 2475.74 0 0 0 1181.14 0 0 0 2158.96 0 0 0 0 0 -802.408 0 0 2059.92 0 0 0 -596.103 0 0 0.06 0 0 0 0 0 0 -130.238 0 1923.05 2412.41 0 0 359.737 -2248.22 0 0 -483.184 
0 0 0 0 0 0 0 0 0 0 0 1577.88 0 0 -150.227 0 0 0 0 0 2101.89 -1313.59 0 0 0 0 0 0 0 896.405 0 0 0 0 -2466.73 0 0 0 2182.76 0 0 1947.77 -1265.98 0 0 0 900.525 0 0 0 0.06 0 0 0 0 0 0 0 0 0 0 0 -2221.37 0 0 0 0 
773.263 -250.481 0 0 456.938 0 0 0 -1302.45 0 2180.47 1916.64 -593.204 0 0 0 0 0 650.883 0 0 0 0 0 0 2006.52 0 0 0 143.666 0 -1170.92 -986.587 0 0 0 0 0 0 -609.073 0 0 559.328 0 0 0 0 0 0 0 0 0.02 0 -1086.38 0 1584.44 0 0 0 0 -738.319 0 0 0 0 0 0 
0 0 0 0 0 0 0 1272.55 0 0 0 0 1590.24 1199 -707.648 -1377.38 -126.728 0 0 0 0 0 0 0 568.178 0 0 0 2281.79 -884.045 0 0 2043.14 1627.78 0 2257.07 0 0 0 1437.35 0 0 0 0 -1210.9 0 1428.34 0 0 0 0 0 0.03 0 0 0 0 0 0 0 2044.97 0 -657.598 0 0 1922.44 0 
0 -476.623 -662.481 203.482 0 -1149.25 0 0 0 0 0 2178.64 0 0 0 0 0 1795.94 0 0 0 0 0 2230.98 -1162.37 0 0 0 859.478 0 0 0 0 0 -2295.98 0 0 2003.31 0 0 0 0 1075.24 0 416.349 0 0 0 -1031.45 0 0 1279.11 0 0.09 0 60.1978 19.6081 0 0 0 0 0 0 0 0 0 -1827.22 
0 0 0 -1396.91 0 0 -1067.92 0 0 0 0 0 0 0 0 0 0 0 0 618.229 0 0 1952.19 0 0 0 2073.96 0 2080.07 0 0 481.964 0 0 2265.16 0 0 0 0 0 0 0 579.47 0 0 0 0 -739.235 2207.79 0 0 0 0 0 0.01 0 -55.7726 0 0 0 0 694.372 0 0 -722.297 0 0 
1526.61 0 0 0 0 -1090.96 244.682 0 0 -203.787 -1703.77 0 0 0 0 0 -1154.13 0 1783.58 0 0 0 0 0 1712.16 0 952.559 443.205 0 -53.1785 -1444.98 0 0 -226.676 2234.95 -1323.21 0 1464.96 0 0 1726.97 0 578.86 0 0 0 0 -403.073 0 0 0 -931.959 0 2261.65 0 0.06 0 0 942.793 0 0 0 -1980.57 0 0 0 0 
0 0 2475.89 0 0 0 610.294 0 0 0 0 0 291.528 0 0 0 -1975.84 0 2257.68 0 0 0 0 0 0 2164.3 0 0 0 499.664 1269.19 -1193.35 0 0 -207.144 0 2335.51 0 -1297.57 0 874.889 0 1595.28 0 0 0 0 0 1201.28 -1289.79 0 0 0 -2006.97 -1194.88 0 0.04 0 0 0 0 0 0 0 0 0 0 
0 0 881.756 0 0 1676 -1226 0 0 1050.83 0 0 0 0 -770.821 0 0 0 0 0 0 0 0 0 1000.78 0 0 0 -483.795 0 0 0 0 0 325.709 1783.88 0 -1641.06 0 0 0 0 0 0 0 0 0 0 0 0 0 0 0 0 0 0 0 0.08 0 0 0 -420.316 0 0 0 0 0 
0 0 934.706 0 1724.22 976.669 0 -506.378 0 0 0 -1988.81 0 2047.41 0 0 0 0 0 0 699.255 0 0 0 0 0 0 0 0 -1461.76 0 2254.17 0 0 0 0 0 0 0 0 0 0 0 0 0 0 0 0 898.236 29.5267 0 0 0 0 0 20.8289 0 0 0.08 -451.903 -2315.97 0 0 0 -1911.76 0 0 
0 2290.8 -424.741 0 0 0 1647.47 0 1441.92 -688.574 55.3148 1476.87 0 0 2187.49 0 0 -1865.37 0 0 0 -743.66 0 0 0 -481.048 1759.93 -1894.06 0 2493.44 0 -1142.38 0 0 0 0 0 792.795 0 0 0 0 -371.181 0 0 0 0 0 0 1916.94 0 0 0 0 0 0 0 0 -711.158 0.02 0 0 0 0 0 0 0 
0 0 0 0 0 0 0 0 -816.752 0 0 0 0 -1079.36 0 0 0 0 0 0 0 0 0 0 0 0 0 0 0 0 772.042 0 2474.21 0 0 0 0 0 0 0 0 0 0 0 0 0 0 0 0 0 0 -102.924 560.549 0 0 0 0 0 173.879 0 0 0 0 0 0 -494.171 0 
0 0 0 0 0 0 0 0 0 0 0 0 0 0 0 0 0 0 0 0 0 0 0 1782.82 0 0 0 -341.426 0 0 1499.3 0 0 0 -1315.88 0 0 0 0 1396.3 1189.38 1504.18 0 -1925.95 0 0 0 0 0 0 0 0 0 0 -478.912 0 0 1360.9 0 0 0 0.09 0 0 0 0 0 
-351.955 0 0 0 0 0 0 0 0 0 0 0 0 0 0 0 0 290.307 0 0 0 0 0 2286.83 0 0 0 0 0 0 0 0 0 0 0 0 0 0 -1713.54 0 0 0 0 0 0 -619.907 0 0 0 -1229.06 375.759 0 1972.95 0 0 829.417 0 0 0 0 0 0 0.01 0 -533.235 0 0 
940.504 0 0 0 0 0 0 -1249.35 0 0 1743.75 -33.4941 0 0 0 0 0 88.4274 0 0 0 0 0 0 0 0 533.387 0 0 0 0 0 0 0 0 2191.15 0 0 0 0 -2140.49 0 0 0 0 0 0 0 0 -198.904 0 0 0 0 0 0 0 0 0 0 0 0 0 0.09 0 0 0 
0 -1739.02 0 866.192 0 0 0 -2458.04 0 0 0 0 0 0 0 0 0 0 0 -1534.24 0 0 0 0 0 0 0 0 -1531.19 0 0 0 0 0 0 1656.62 0 0 0 2360.38 0 0 0 0 0 2008.65 0 0 0 0 0 0 0 0 1192.89 0 0 0 2218.01 0 0 0 -410.855 0 0.05 0 0 
0 0 0 0 0 0 0 0 0 0 0 0 0 0 0 2347.25 0 0 0 0 0 0 0 0 707.038 1871.32 0 0 0 0 0 0 0 1334.35 0 0 1684.55 0 0 671.178 0 0 0 0 0 0 -2181.84 0 0 0 0 0 -751.289 0 0 0 0 0 0 0 -790.811 0 0 0 0 0.05 0 
0 0 0 0 0 0 0 0 0 0 0 0 0 0 0 0 -498.749 0 0 0 0 0 -1756.42 0 0 0 0 2082.2 0 0 0 0 -60.1978 0 0 0 0 0 0 0 0 0 0 0 0 0 2039.32 0 0 1287.04 0 0 0 -2404.32 0 0 0 0 0 0 0 0 0 0 0 0 0.05 
