*Vertices 41
*Matrix 
0.08 0 2454.53 0 0 0 0 0 0 0 0 0 0 0 0 0 -118.03 0 0 0 0 0 0 0 0 0 0 -2190.85 0 0 0 0 0 0 0 0 0 0 0 0 0 
0 0.01 775.246 2409.82 0 0 0 0 0 0 0 0 0 0 -1452.76 -371.029 1827.22 0 0 0 0 0 0 0 0 0 0 -1110.8 0 0 0 0 0 0 0 508.515 0 0 0 0 0 
2133.78 472.045 0.05 0 0 0 0 0 0 0 0 0 0 1439.33 0 0 0 0 0 0 0 0 0 1017.87 0 0 0 -1216.39 0 1031.3 915.021 1668.98 0 0 0 0 0 0 0 -2432.55 0 
0 -927.076 0 0.01 0 0 0 0 0 0 0 0 0 0 0 0 0 0 0 0 0 0 -1033.43 0 0 0 0 0 1816.23 0 0 1741.16 0 0 0 0 0 150.838 0 0 0 
0 0 0 0 0.03 0 0 1395.38 0 0 0 931.959 0 0 978.805 0 0 0 917.615 0 0 0 0 2471.77 0 0 0 0 0 0 0 0 0 0 0 0 0 0 0 0 0 
0 0 0 0 0 0.08 2226.86 0 1375.7 0 0 0 0 0 0 0 0 0 0 0 0 0 0 0 0 -481.048 0 0 0 0 0 0 0 0 0 0 0 0 0 0 0 
0 0 0 0 0 1297.11 0.07 0 0 0 0 0 0 -1726.2 0 0 0 0 0 0 0 0 0 0 0 0 0 0 0 0 0 0 0 0 0 0 0 0 2465.97 0 0 
0 0 0 0 1401.64 0 0 0.09 0 1458.86 0 0 1607.79 0 0 -767.769 0 0 0 0 0 0 -2084.95 0 0 0 0 0 1282.92 0 0 0 0 0 0 0 0 0 0 0 0 
0 0 0 0 0 304.804 0 0 0.07 0 0 0 0 0 0 0 0 0 0 0 374.386 0 0 0 0 0 0 0 0 0 961.715 0 0 -811.258 0 0 0 0 0 0 0 
0 0 0 0 0 0 0 -378.506 0 0.01 0 0 0 0 0 -167.623 0 0 0 -575.198 0 0 0 0 0 0 1725.59 0 0 0 0 0 0 0 0 0 495.392 0 0 0 0 
0 0 0 0 0 0 0 0 0 0 0.03 0 0 0 0 -1090.04 0 0 0 0 0 0 0 0 0 0 0 0 736.946 0 0 0 1724.52 0 0 0 0 0 0 0 0 
0 0 0 0 929.212 0 0 0 0 0 0 0.04 0 0 1392.03 0 0 0 0 0 0 0 0 0 0 -285.424 0 0 0 0 0 0 0 0 0 0 0 190.359 -979.415 0 0 
0 0 0 0 0 0 0 -2043.14 0 0 0 0 0.01 0 0 0 0 0 1952.04 -414.975 0 0 0 0 0 0 0 1283.23 0 79.4244 0 -404.141 0 0 0 0 0 0 779.366 0 0 
0 0 2029.1 0 0 0 1921.22 0 0 0 0 0 0 0.02 0 0 0 0 0 0 258.873 0 0 0 0 0 0 0 0 0 0 0 0 0 0 0 0 0 0 0 0 
0 -300.989 0 0 2041.92 0 0 0 0 0 0 -149.464 0 0 0.06 301.294 0 0 0 0 0 0 0 0 2420.96 0 0 0 0 0 0 0 0 0 1231.96 0 0 0 902.661 0 1410.03 
0 -1762.37 0 0 0 0 0 1723.91 0 1055.1 793.252 0 0 0 2090.9 0.06 0 0 0 0 0 0 0 0 0 284.814 0 0 0 0 0 1591.16 0 0 0 435.423 0 0 -1408.51 0 0 
435.27 -1217.76 0 0 0 0 0 0 0 0 0 0 0 0 0 0 0 0 0 0 0 0 0 0 0 0 0 0 1403.62 0 0 0 0 0 0 2071.37 1191.37 0 0 0 -527.131 
0 0 0 0 0 0 0 0 0 0 0 0 0 0 0 0 0 0.03 0 0 0 0 0 0 0 0 0 0 0 2398.22 0 0 0 -1962.57 0 0 0 0 1218.38 0 0 
0 0 0 0 2037.95 0 0 0 0 0 0 0 -1440.55 0 0 0 0 0 0 0 0 0 0 1271.17 0 0 0 0 0 0 0 0 0 1097.98 0 0 0 0 0 0 0 
0 0 0 0 0 0 0 0 0 226.829 0 0 1486.94 0 0 0 0 0 0 0.04 0 0 -567.873 0 0 0 0 0 0 0 0 2417.75 0 0 0 0 0 0 0 -409.787 0 
0 0 0 0 0 0 0 0 -2294.92 0 0 0 0 -33.4941 0 0 0 0 0 0 0.05 0 0 0 0 0 0 0 0 0 0 0 2444.3 0 0 1677.68 1119.04 0 0 0 0 
0 0 0 0 0 0 0 0 0 0 0 0 0 0 0 0 0 0 0 0 0 0.08 0 0 0 0 0 1042.28 0 -2046.19 2323.45 0 0 0 0 0 0 0 2461.39 0 0 
0 0 0 1810.43 0 0 0 1186.48 0 0 0 0 0 0 0 0 0 0 0 -408.261 0 0 0.04 0 2361.45 -2290.64 -832.163 0 0 0 0 0 0 0 0 0 0 0 0 0 -845.897 
0 0 756.783 0 -1221.73 0 0 0 0 0 0 0 0 0 0 0 0 0 1008.71 0 0 0 0 0.01 0 0 0 0 0 1779.76 0 0 0 0 0 0 0 0 0 0 438.78 
0 0 0 0 0 0 0 0 0 0 0 0 0 0 -2081.29 0 0 0 0 0 0 0 1593.14 0 0.08 0 0 0 0 0 1423.92 0 -240.715 0 0 0 0 0 1202.66 0 716.193 
0 0 0 0 0 -727.332 0 0 0 0 0 1669.74 0 0 0 960.646 0 0 0 0 0 0 1846.45 0 0 0.08 0 0 -495.392 0 2278.28 0 0 0 -900.677 0 0 0 0 0 0 
0 0 0 0 0 0 0 0 0 427.183 0 0 0 0 0 0 0 0 0 0 0 0 2031.08 0 0 0 0.02 0 0 0 0 0 0 0 0 556.581 0 0 0 0 -1220.66 
1071.28 2188.71 2317.5 0 0 0 0 0 0 0 0 0 -1094.16 0 0 0 0 0 0 0 0 -1242.48 0 0 0 0 0 0 0 0 0 0 0 0 0 -1464.2 0 0 0 0 0 
0 0 0 2007.58 0 0 0 1998.12 0 0 2329.71 0 0 0 0 0 -1345.48 0 0 0 0 0 0 0 0 469.756 0 0 0.02 0 1881.24 0 0 1003.37 1264.31 0 0 0 0 -1636.33 0 
0 0 1988.36 0 0 0 0 0 0 0 0 0 2240.59 0 0 0 0 1968.06 0 0 0 2456.36 0 83.3918 0 0 0 0 0 0.05 0 0 0 180.135 0 0 0 0 0 0 -49.3637 
0 0 663.854 0 0 0 0 0 -362.026 0 0 0 0 0 0 0 0 0 0 0 0 -544.984 0 0 1578.8 -786.996 0 0 839.488 0 0.07 0 0 0 0 0 0 0 0 0 0 
0 0 -1616.49 -2248.68 0 0 0 0 0 0 0 0 2327.57 0 0 2133.78 0 0 0 361.415 0 0 0 0 0 0 0 0 0 0 0 0.03 0 0 0 0 0 0 0 2134.85 0 
0 0 0 0 0 0 0 0 0 0 1025.96 0 0 0 0 0 0 0 0 0 1373.1 0 0 0 -385.372 0 0 0 0 0 0 0 0.08 0 0 0 0 0 0 0 0 
0 0 0 0 0 0 0 0 -1169.24 0 0 0 0 0 0 0 0 2278.59 1646.4 0 0 0 0 0 0 0 0 0 1610.23 -1759.01 0 0 0 0.07 0 0 0 0 0 0 0 
0 0 0 0 0 0 0 0 0 0 0 0 0 0 -206.839 0 0 0 0 0 0 0 0 0 0 -355.464 0 0 1955.09 0 0 0 0 0 0 0 0 0 0 0 0 
0 147.481 0 0 0 0 0 0 0 0 0 0 0 0 0 830.79 -600.375 0 0 0 -48.7533 0 0 0 0 0 -861.461 704.596 0 0 0 0 0 0 0 0.09 0 0 0 468.383 205.466 
0 0 0 0 0 0 0 0 0 -2310.48 0 0 0 0 0 0 2385.4 0 0 0 806.07 0 0 0 0 0 0 0 0 0 0 0 0 0 0 0 0 0 1742.23 0 0 
0 0 0 1414.61 0 0 0 0 0 0 0 1712.01 0 0 0 0 0 0 0 0 0 0 0 0 0 0 0 0 0 0 0 0 0 0 0 0 0 0 0 0 0 
0 0 0 0 0 0 -1540.65 0 0 0 0 -1756.26 -238.273 0 1652.96 -506.684 0 1943.8 0 0 0 1660.13 0 0 -1038.16 0 0 0 0 0 0 0 0 0 0 0 764.87 0 0.02 0 0 
0 0 239.341 0 0 0 0 0 0 0 0 0 0 0 0 0 0 0 0 2027.57 0 0 0 0 0 0 0 0 1680.43 0 0 2077.17 0 0 0 -2059.01 0 0 0 0.01 0 
0 0 0 0 0 0 0 0 0 0 0 0 0 0 -224.082 0 -1194.27 0 0 0 0 0 1448.64 1319.39 1431.24 0 54.3992 0 0 1086.38 0 0 0 0 0 704.749 0 0 0 0 0.04 
