*Vertices 52
*Matrix 
0.01 1916.33 0 -1767.86 0 438.627 2459.87 1996.29 1004.9 0 0 0 2329.4 0 0 0 0 0 0 -860.393 598.544 0 0 0 -2073.66 0 0 0 0 0 0 343.562 1061.82 0 -1196.1 0 1558.96 0 0 0 0 0 0 0 0 301.141 0 0 0 0 0 0 
2338.86 0.08 0 0 0 -828.959 0 2160.02 0 1766.49 0 0 1351.89 0 0 14.8778 0 0 0 0 0 0 0 905.103 0 0 0 0 -2432.25 0 0 0 0 0 -180.441 0 0 0 -1319.7 2229.91 0 0 0 0 0 0 961.257 0 0 -1267.66 0 0 
0 0 0.06 2126.91 0 2125.54 -2017.81 -204.245 0 0 -292.596 -1256.52 0 0 0 0 0 0 0 621.738 -1645.94 0 1965.47 -245.75 0 0 0 0 0 0 -153.89 0 0 997.116 1744.67 0 0 0 710.395 0 0 0 1759.47 0 -2466.89 0 0 0 0 0 0 0 
1780.22 0 -1655.4 0.03 0 0 51.9578 713.599 0 0 0 0 1524.93 0 0 0 0 0 0 0 2324.06 -1869.49 -390.103 0 0 0 0 0 0 0 0 -1461 0 0 0 0 357.753 522.401 0 429.014 0 -1860.33 0 0 0 0 0 0 0 0 0 0 
0 0 0 0 0 1587.65 0 1755.5 0 0 0 788.98 0 0 0 0 0 0 0 -1374.63 0 2294.31 0 0 0 0 0 329.218 0 -69.2007 0 0 0 0 0 2061.14 0 0 0 0 0 0 -2132.86 0 0 1592.99 0 0 0 0 0 0 
571.23 -2062.36 -485.931 0 2467.35 0.05 0 1887.04 0 0 0 0 0 0 0 374.081 2300.71 -536.286 917.92 0 -2412.41 1327.78 0 0 0 -940.199 0 0 0 0 0 0 0 0 -1247.37 -1922.59 2046.49 1453.22 0 -2128.59 0 -516.907 -178.915 0 0 0 0 0 0 0 0 0 
-1712.01 0 -98.3459 1952.19 0 0 0.07 0 0 0 195.09 0 0 0 0 354.091 0 0 1054.34 0 0 423.978 2243.19 0 0 0 0 0 0 0 1384.55 0 0 0 0 2217.55 0 0 2350 -1485.87 0 0 0 -383.389 0 -2174.83 0 0 0 0 -2455.75 0 
1907.64 -656.072 -1622.9 2240.75 -135.731 -311.518 0 0.07 -2116.69 0 0 0 0 0 0 0 0 640.812 0 0 0 0 0 -1164.51 0 0 0 0 0 1422.39 1605.66 0 0 0 2346.34 0 0 1015.27 0 0 0 0 1325.95 0 0 0 0 0 0 1472.44 0 0 
-1918.32 0 0 0 0 0 0 562.685 0.09 0 -1997.67 0 1327.17 0 0 0 0 0 0 0 0 0 0 0 547.426 600.223 0 0 0 0 0 -113.147 0 0 0 1938.92 577.639 0 2034.59 286.492 0 0 8.77407 1182.52 625.706 0 0 0 0 738.319 0 0 
0 1214.26 0 0 0 0 0 0 0 0.09 0 2358.85 0 0 0 463.958 -25.1015 0 -1743.14 -1070.21 0 0 0 0 953.017 -1002 0 0 0 0 0 0 2194.81 0 359.279 0 0 -184.408 0 -830.027 0 -383.236 -2324.82 648.9 0 -206.076 0 0 0 0 0 0 
0 0 843.608 0 0 0 1939.53 0 375.759 0 0.03 0 -1947 1034.35 0 0 0 0 0 0 0 0 0 -1916.64 0 0 0 1033.89 0 0 0 0 1578.8 1847.36 0 0 -1965.62 0 2051.38 0 0 385.372 1508.45 -2336.57 0 0 0 0 0 0 0 0 
0 0 337.306 0 -1802.19 0 0 0 0 1283.84 0 0.01 0 0 0 1672.34 0 0 1450.93 0 -335.017 0 0 0 0 0 0 0 1403.47 0 2106.31 0 0 0 2314.91 0 1665.93 1421.02 -1206.78 0 450.835 0 0 0 0 0 17.0141 0 -2212.21 0 0 0 
1560.03 -924.177 0 -1680.73 0 0 0 0 1498.38 0 236.29 0 0.06 0 2047.56 1809.52 0 0 0 0 0 0 0 1003.52 0 0 0 0 0 0 0 0 0 -1448.79 0 0 0 0 252.464 0 0 0 0 0 0 -540.559 0 0 0 0 -746.559 0 
0 0 0 0 0 0 0 0 0 0 918.378 0 0 0.03 -889.538 0 -561.922 0 114.673 0 -1727.42 0 2245.78 0 1732.15 -93.6155 0 -1744.82 0 1585.82 0 0 0 0 -974.99 0 0 0 866.344 0 1917.4 0 0 176.016 0 0 0 0 -736.335 0 0 0 
0 0 0 0 0 0 0 0 0 0 0 0 -147.328 2326.96 0.01 -921.583 216.147 0 0 0 -1949.9 0 0 2083.27 2131.79 0 2449.49 0 0 0 0 0 733.741 0 -1422.39 -702.765 -725.806 0 0 2244.1 0 0 0 0 -1657.99 -2027.27 0 0 0 0 0 0 
0 1509.52 0 0 0 -1177.79 -1677.37 0 0 2322.08 0 2325.59 187.765 0 -1914.5 0.09 0 0 0 2301.78 0 0 0 0 350.887 0 0 0 762.886 0 0 2424.77 0 -696.966 1616.64 0 0 0 0 0 0 0 -239.799 0 0 702.155 0 0 0 0 0 0 
0 0 0 0 0 1334.04 0 0 0 -862.835 0 0 0 1642.89 -568.484 0 0.05 0 0 0 0 0 0 -1028.7 -1879.71 0 30.9 0 0 0 0 0 0 0 1350.52 0 0 494.018 670.11 0 0 0 257.5 0 517.212 0 0 -1718.73 0 0 0 0 
0 0 0 0 0 -20.9815 0 -1643.5 0 0 0 0 0 0 0 0 0 0.01 0 0 0 0 752.51 0 0 -2008.5 0 0 278.558 0 0 1899.09 0 0 1835.15 0 0 0 1792.58 1762.37 2468.41 0 2327.72 0 0 -2172.84 0 0 0 0 0 0 
0 0 0 0 0 678.961 -1685.31 0 0 -2107.68 0 -2410.12 0 411.313 0 0 0 0 0.01 0 0 0 1661.81 -1446.35 980.941 0 0 0 0 2141.87 1725.75 0 0 487.457 2431.18 0 0 0 0 587.558 0 -463.652 0 0 0 0 0 0 0 0 0 0 
532.624 0 -444.578 0 -607.547 0 0 0 0 -718.024 0 0 0 0 0 724.891 0 0 0 0 -660.497 2250.51 0 2416.68 -543.916 1816.23 0 0 2347.56 0 1248.28 0 0 0 0 0 0 -577.944 -420.011 0 0 0 -162.893 -2014.3 0 0 0 0 0 0 0 0 
136.799 0 -966.445 1410.64 0 940.962 0 0 0 0 0 -2138.05 0 2283.78 -1958.45 0 0 0 0 -786.691 0.08 -810.495 611.82 0 0 0 0 0 0 0 0 0 0 2250.51 0 0 0 0 0 0 0 510.804 0 0 2089.68 0 -2209.01 0 0 0 0 2103.56 
0 0 0 1082.42 -1533.17 161.824 -112.69 0 0 0 0 0 0 0 0 0 0 0 0 410.855 -29.2215 0.08 0 2180.32 0 1854.23 0 759.682 0 0 0 0 0 0 -1724.52 -1905.8 0 2219.38 0 -318.995 0 0 0 0 1924.57 0 0 0 0 0 0 0 
0 0 2298.27 -1190.76 0 0 -2039.32 0 0 0 0 0 0 1134.91 0 0 0 2281.03 -135.121 0 -374.386 0 0.03 -1526 -888.928 0 0 0 0 1938.92 0 0 2172.99 57.2985 2174.52 0 0 0 0 0 0 0 2105.7 0 -1446.04 0 0 0 0 0 0 0 
0 1983.02 884.503 0 0 0 0 1041.52 0 0 -1876.66 0 470.672 0 -2442.63 0 2073.35 0 -1690.04 -2236.78 0 2356.11 -514.161 0.01 0 0 0 0 0 0 0 0 2099.44 2137.14 0 0 0 0 0 0 0 0 0 -922.498 1624.27 0 2189.17 -2045.73 0 0 0 -2258.9 
-333.491 0 0 0 0 0 0 0 2497.86 1729.71 0 0 0 2131.34 994.827 1931.44 -284.051 0 -389.34 414.212 0 0 -1544.77 0 0.01 0 0 0 0 2408.29 0 0 0 0 1415.83 -1416.44 -1525.09 0 0 -628.91 0 0 0 0 0 -420.164 0 0 0 0 0 0 
0 0 0 0 0 1427.12 0 0 -910.443 461.211 0 0 0 2051.53 0 0 0 886.944 0 780.587 0 -208.06 0 0 0 0.06 0 -951.186 -117.42 0 1526.92 0 0 0 0 0 0 0 0 0 1335.26 2000.11 -2388.15 0 0 0 0 1689.43 0 0 -1663.95 0 
0 0 0 0 0 0 0 0 0 0 0 0 0 0 1411.86 0 -1365.17 0 0 0 0 0 0 0 0 0 0 0 0 0 0 0 0 0 0 -300.378 0 0 0 0 0 0 0 0 1205.4 1556.37 0 0 0 0 0 0 
0 0 0 0 1690.95 0 0 0 0 0 -1543.24 0 0 1781.44 0 0 0 0 0 0 0 -255.974 0 0 0 -436.796 0 0.08 2279.05 0 1132.92 0 939.589 0 0 0 0 0 0 0 -958.205 0 0 0 0 0 0 0 0 0 0 0 
0 1938.15 0 0 0 0 0 0 0 0 0 2441.56 0 0 0 -1263.39 0 -555.971 0 -1860.79 0 0 0 0 0 2436.37 0 -1023.82 0.06 -2456.21 0 0 0 0 0 0 0 2442.63 0 0 0 0 0 0 0 1582 0 0 228.507 0 0 0 
0 0 0 0 -1715.06 0 0 676.519 0 0 0 0 0 -617.466 0 0 0 0 1800.82 0 0 0 109.638 0 2238.91 0 0 0 -1901.38 0 494.476 0 0 1060.44 0 0 -2017.96 0 0 0 0 0 1935.87 0 0 0 -1481.14 0 0 0 0 0 
0 0 -1364.41 0 0 0 593.204 -1334.35 0 0 0 1774.73 0 0 0 0 0 0 572.298 2164.91 0 0 0 0 0 1216.39 0 768.227 0 2067.55 0 -235.679 2156.51 0 0 0 0 -572.146 1234.55 1033.28 2044.05 0 836.589 0 0 0 0 0 -540.559 0 0 0 
302.515 0 0 1008.87 0 0 0 0 2418.67 0 0 0 0 0 0 -456.175 0 1013.9 0 0 0 0 0 0 0 0 0 0 0 0 1464.96 0.08 0 0 0 0 0 0 463.5 0 -2238.15 2457.12 0 -1160.85 2023.61 -1611.61 0 0 0 812.174 0 0 
2200.31 0 0 0 0 0 0 0 0 2398.83 1433.23 0 0 0 -1400.11 0 0 0 0 0 0 0 638.523 2272.79 0 0 0 1190.15 0 0 2248.22 0 0.02 153.89 87.9696 0 0 -320.978 0 0 0 0 0 250.175 0 2367.55 0 217.673 0 0 0 0 
0 0 1958.91 0 0 0 0 0 0 0 1128.04 0 679.724 0 0 346.614 0 0 1684.55 0 -649.052 0 2381.13 -1843.85 0 0 0 0 0 2007.28 0 0 -966.597 0 667.364 0 0 -1405.61 0 1596.96 0 0 0 0 -339.29 2232.2 0 0 0 -604.343 0 0 
1279.41 1501.74 1973.4 0 0 1180.23 0 1381.65 0 96.82 0 1664.86 0 929.67 1280.02 863.14 815.683 -459.838 -1953.57 0 0 -720.008 -2094.1 0 2057.18 0 0 0 0 0 0 0 466.704 -2126.45 0.04 -2304.22 0 0 -975.6 0 -1783.88 0 0 0 -1328.24 0 0 0 0 0 0 1418.27 
0 0 0 0 -2444 884.655 2080.22 0 377.132 0 0 0 0 0 -2486.57 0 0 0 0 0 0 2220.6 0 0 1993.09 0 1974.32 0 0 0 0 0 0 0 1486.63 0.04 -2261.04 0 0 312.891 0 2303 0 0 0 0 0 1237.45 2392.12 0 0 -1002.76 
1076.31 0 0 45.3963 0 -1078.75 0 0 37.7667 0 150.685 2104.18 0 0 1267.05 0 0 0 0 0 0 0 0 0 1403.16 0 0 0 0 -1101.79 0 0 0 0 0 1477.94 0.04 0 0 1319.85 1617.25 0 0 1561.25 0 0 0 0 0 0 0 0 
0 0 0 -1651.43 0 1823.56 0 -1559.57 0 1800.06 0 747.932 0 0 0 0 -1389.13 0 0 2303.46 0 1600.16 0 0 0 0 0 0 -338.679 0 1807.08 0 1790.9 446.715 0 0 0 0.01 0 250.175 0 63.2496 0 0 1162.53 0 0 0 0 -1724.52 0 0 
0 2469.48 -223.624 0 0 0 -2253.26 0 2258.6 0 1053.58 761.818 1798.84 1235.31 0 0 -874.279 823.466 0 708.563 0 0 0 0 0 0 0 0 0 0 1788.77 2467.65 0 0 793.405 0 0 0 0.02 1436.43 -1795.94 0 1459.32 0 0 0 440.764 0 0 0 0 0 
0 1268.73 0 -1167.41 0 29.3741 2409.36 0 1611.15 2454.99 0 0 0 0 -2181.39 0 0 -2206.56 2015.37 0 0 1131.24 0 0 969.955 0 0 0 0 0 -1033.43 0 0 891.827 0 1938.31 1610.69 1653.57 2260.73 0.08 0 -2467.5 0 659.276 0 0 0 2364.35 0 0 0 -1667.15 
0 0 0 0 0 0 0 0 0 0 0 315.79 0 -474.181 0 0 0 1868.27 0 0 0 0 0 0 0 1339.99 0 -2411.5 0 0 1285.21 -215.995 0 0 1616.34 0 -1611.61 0 -1687.75 0 0.01 0 0 0 0 0 0 978.957 0 0 -1446.35 0 
0 0 0 584.048 0 -341.121 0 0 0 2113.64 1887.65 0 0 0 0 0 0 0 2182.91 0 919.599 0 0 0 0 767.464 0 0 0 0 0 -774.178 0 0 0 2159.87 0 1218.07 0 -2269.59 0 0.07 -23.7281 0 0 0 0 0 0 0 0 0 
0 0 1747.41 0 529.42 -1924.88 0 -515.687 924.787 -782.723 1099.66 0 0 0 0 1839.43 -609.073 1824.78 0 -563.906 0 0 1089.59 0 0 -1585.97 0 0 0 -1029.31 2369.08 0 0 0 0 0 0 0 -476.47 0 0 -850.475 0.01 -311.975 0 0 0 0 0 0 0 0 
0 0 0 0 0 0 981.094 0 1840.19 2044.36 -1426.21 0 0 1806.62 0 0 0 0 0 1883.83 0 0 0 193.411 0 0 0 0 0 0 0 149.312 -867.565 0 0 0 943.098 0 0 2310.17 0 0 202.109 0.04 0 0 0 0 0 0 0 0 
0 0 -2337.95 0 0 0 0 0 991.165 0 0 0 0 0 38.8348 0 2247.76 0 0 0 -1835.92 2231.74 1025.65 -2279.5 0 0 1074.48 0 0 0 0 2118.98 0 764.565 2493.44 0 0 703.986 0 0 0 0 0 0 0.02 -501.953 -508.972 0 0 574.587 0 0 
2392.88 0 0 0 -275.201 0 2238.46 0 0 753.578 0 0 375.149 0 280.084 2467.65 0 1103.78 0 0 0 0 0 0 -291.375 0 1780.22 0 -2054.28 0 0 721.686 222.098 1628.24 0 0 0 0 0 0 0 0 0 0 1323.66 0.06 0 0 0 0 1850.72 0 
0 2124.47 0 0 0 0 0 0 0 0 0 1806.77 0 0 0 0 0 0 0 0 2327.11 0 0 1276.21 0 0 0 0 0 827.738 0 0 0 0 0 0 0 0 1773.66 0 0 0 0 0 849.864 0 0.04 0 0 0 0 0 
0 0 0 0 0 0 0 0 0 0 0 0 0 0 0 0 759.072 0 0 0 0 0 0 -1222.04 0 -1063.04 0 0 0 0 0 0 -27.3904 0 0 790.048 0 0 0 968.581 2174.52 0 0 0 0 0 0 0.02 0 0 0 0 
0 0 0 0 0 0 0 0 0 0 0 -768.38 0 2226.1 0 0 0 0 0 0 0 0 0 0 0 0 0 0 2096.85 0 97.1252 0 0 0 0 1468.47 0 0 0 0 0 0 0 0 0 0 0 0 0.03 -201.498 0 0 
0 750.526 0 0 0 0 0 2404.17 -308.466 0 0 0 0 0 0 0 0 0 0 0 0 0 0 0 0 0 0 0 0 0 0 2367.24 0 -1580.02 0 0 0 302.667 0 0 0 0 0 0 -1139.33 0 0 0 -70.7266 0.05 0 0 
0 0 0 0 0 0 1807.84 0 0 0 0 0 -988.418 0 0 0 0 0 0 0 0 0 0 0 0 2386.78 0 0 0 0 0 0 0 0 0 0 0 0 0 0 -407.498 0 0 0 0 1212.73 0 0 0 0 0 0 
0 0 0 0 0 0 0 0 0 0 0 0 0 0 0 0 0 0 0 0 650.731 0 0 1879.56 0 0 0 0 0 0 0 0 0 0 -470.672 -1006.12 0 0 0 920.362 0 0 0 0 0 0 0 0 0 0 0 0.02 
