*Vertices 56
*Matrix 
0.07 0 0 0 0 0 0 0 0 2233.88 0 0 0 0 0 0 0 0 0 0 0 0 0 0 0 0 1609.62 0 0 0 1407.44 0 0 0 0 0 0 0 0 0 0 0 0 0 -501.038 0 -440.153 0 1213.49 0 -2010.03 0 0 0 -2098.53 0 
0 0.08 0 0 0 2077.93 0 0 0 0 -885.418 0 0 0 0 0 0 0 0 0 0 0 0 774.331 0 0 685.369 -552.766 -1218.99 0 0 0 0 0 0 0 0 0 0 1664.25 0 0 0 0 0 0 0 606.021 0 0 0 0 0 0 1336.02 -1010.54 
0 0 0.05 0 0 0 -2417.6 561.922 0 0 0 0 0 0 0 0 0 0 -1118.73 0 0 0 0 2203.05 0 0 0 1111.41 0 0 0 0 0 0 0 0 2468.72 0 447.02 0 0 0 0 0 0 0 0 0 196.31 0 0 0 -805.46 0 0 0 
0 0 0 0.06 0 0 0 0 0 0 0 0 0 0 0 0 0 0 0 0 0 22.0496 -2195.27 0 0 0 0 0 0 746.406 0 -744.88 0 0 0 412.381 0 0 0 0 -851.543 0 0 2238.76 0 0 0 0 1974.32 0 0 0 0 0 0 0 
0 0 0 0 0.07 0 0 0 0 0 -2243.19 0 0 0 0 0 0 0 0 0 0 0 0 0 0 0 332.27 0 0 0 0 0 0 0 1732.76 1395.38 0 0 0 0 0 0 0 0 0 0 0 271.996 -859.325 0 0 0 0 0 0 0 
0 2173.3 0 0 0 0.02 0 1175.8 0 0 0 0 207.907 0 0 0 0 0 0 0 0 0 -1111.41 0 0 1856.52 0 0 0 0 0 0 0 0 0 0 -1556.37 0 0 0 0 0 0 0 0 0 0 0 0 0 0 -445.189 0 0 0 0 
0 0 -1105.76 0 0 0 0.08 0 0 0 0 0 0 0 1872.54 0 0 0 0 0 -1021.68 2065.57 0 0 1636.17 -2316.58 0 428.404 0 0 0 0 0 1866.89 0 0 0 1875.9 0 0 0 0 0 0 -1461.61 0 0 0 0 0 0 0 0 -2063.28 0 0 
0 0 -1041.22 0 0 1319.85 0 0.03 0 0 0 0 0 920.515 0 0 0 0 0 0 0 0 0 0 0 0 0 1763.13 1085.77 0 -1347.16 -937.147 0 0 0 0 0 0 0 0 0 0 0 0 0 0 0 0 0 0 0 0 0 0 2176.66 0 
0 0 0 0 0 0 0 0 0 0 -566.347 0 0 0 0 0 0 0 0 0 0 0 0 0 1804.33 0 0 0 0 0 0 0 0 0 0 44.0229 0 0 0 0 1733.53 0 0 0 0 0 0 0 0 0 0 0 0 0 0 611.972 
1783.73 0 0 0 0 0 0 0 0 0.08 0 0 0 0 0 0 683.996 0 0 0 0 1783.88 0 0 0 0 0 0 0 2112.26 0 -1029.16 0 0 0 0 0 0 0 0 0 0 0 -495.849 0 0 0 0 0 0 0 0 0 0 0 0 
0 -757.393 0 0 -184.866 0 0 0 756.63 0 0.04 0 0 0 0 1736.43 0 210.196 0 0 0 0 0 0 0 0 0 0 0 0 0 0 0 0 0 0 0 0 0 0 0 0 0 0 0 0 -1484.8 0 2346.19 0 0 0 0 0 -1920.3 0 
0 0 0 0 0 0 0 0 0 0 0 0.01 0 0 0 793.558 0 0 0 0 0 0 0 0 0 0 0 0 0 0 0 0 0 0 0 0 0 0 0 0 0 0 0 0 0 0 0 0 1607.49 0 0 0 0 0 1540.8 0 
0 0 0 0 0 871.075 0 0 0 0 0 0 0.09 0 1595.89 1512.42 0 2140.19 0 0 0 0 0 0 0 0 0 0 0 0 0 0 0 233.848 0 0 0 0 0 0 1823.1 0 0 0 1368.83 125.813 290.002 0 0 0 0 0 0 0 0 0 
0 0 0 0 0 0 0 1748.48 0 0 0 0 0 0.07 731.452 0 0 0 0 0 0 0 -429.319 0 -959.426 0 2240.44 0 0 0 0 0 0 0 0 0 0 1285.67 0 0 0 0 0 65.0807 0 0 0 -1798.53 0 0 0 0 0 0 0 0 
0 0 0 0 0 0 1809.21 0 0 0 0 0 1195.64 1680.73 0 0 -1999.04 0 0 0 0 0 0 0 0 0 0 0 1933.27 0 0 0 0 1925.79 0 0 0 0 0 0 0 1125.29 0 0 0 0 0 0 0 0 0 0 0 0 0 0 
0 0 0 0 0 0 0 0 0 0 1800.36 406.43 2427.98 0 0 0 0 -126.118 0 0 0 0 0 0 -1608.71 1832.26 0 0 0 0 0 0 0 -1575.9 2261.8 0 0 0 0 0 0 0 0 -1101.03 0 0 0 0 0 152.211 0 0 0 0 0 0 
0 0 0 0 0 0 0 0 0 -1828.14 0 0 0 0 1789.53 0 0.09 0 0 0 0 0 0 0 0 0 0 0 0 0 0 91.3266 0 1231.65 0 0 0 0 0 0 1831.95 0 0 0 0 0 0 -2202.75 0 0 0 1042.59 0 0 0 259.178 
0 0 0 0 0 0 0 0 0 0 -428.404 0 537.507 0 0 1717.2 0 0.01 0 0 0 0 0 0 0 1110.03 -2110.13 0 0 0 0 0 0 0 0 0 0 0 -1650.52 1461.3 0 0 0 0 0 0 0 0 0 0 0 0 0 0 864.818 631.199 
0 0 1236.38 0 0 0 0 0 0 0 0 0 0 0 0 0 0 0 0.01 0 0 0 0 2241.36 0 0 0 1611.61 0 0 0 -1707.74 0 0 0 -753.883 0 0 0 0 0 -932.569 0 0 0 0 0 0 0 0 0 0 0 0 0 0 
0 0 0 0 0 0 0 0 0 0 0 0 0 0 0 0 0 0 0 0.08 0 0 0 0 0 0 0 0 0 0 0 0 0 0 0 0 0 0 0 0 0 0 0 0 0 995.895 0 0 0 0 0 0 0 -539.186 0 0 
0 0 0 0 0 0 -1630.22 0 0 0 0 0 0 0 0 0 0 0 0 0 0.06 0 0 0 0 1149.25 0 0 0 0 0 0 0 0 0 0 0 0 0 863.292 1910.84 0 0 0 0 0 1445.59 0 0 0 0 1839.12 659.581 0 0 0 
0 0 0 166.555 0 0 2038.1 0 0 -1418.58 0 0 0 0 0 0 0 0 0 0 0 0.06 0 0 0 0 0 0 0 0 0 2078.08 0 0 0 0 0 0 0 0 0 0 0 818.43 1989.27 0 0 0 1893.6 2422.18 0 0 0 0 0 2308.34 
0 0 0 -842.845 0 -1084.4 0 0 0 0 0 0 0 673.62 0 0 0 0 0 0 0 0 0.07 0 0 0 0 0 0 0 0 0 0 0 307.55 0 0 0 0 799.509 713.294 0 1725.29 0 0 0 2138.2 0 0 0 0 1618.47 0 0 0 0 
0 2385.86 1527.83 0 0 0 0 0 0 0 0 0 0 0 0 0 0 0 1166.8 0 0 0 0 0.07 0 0 0 0 0 0 0 0 0 0 0 0 0 0 0 0 0 0 0 309.839 0 0 0 -2497.71 1097.37 0 0 0 0 0 0 0 
0 0 0 0 0 0 -1015.58 0 1908.4 0 0 0 0 1360.29 0 1556.37 0 0 0 0 0 0 0 0 0.02 0 -2325.89 0 0 0 0 0 0 0 0 0 0 0 0 -546.968 0 0 0 0 1685.46 0 0 0 1333.12 0 0 0 0 0 0 0 
0 0 0 0 0 442.442 1020.46 0 0 0 0 0 0 0 0 473.113 0 767.464 0 0 1956.62 0 0 0 0 0.05 0 0 0 0 0 2367.4 0 1755.65 0 0 0 0 0 0 0 0 0 0 0 0 0 0 0 -908.917 157.857 0 0 0 0 0 
1514.4 -1301.23 0 0 1750.77 0 0 0 0 0 0 0 0 877.331 0 0 0 1893.29 0 0 0 0 0 0 -20.8289 0 0.07 0 0 0 0 0 1756.11 0 0 0 0 -1663.34 0 -2134.39 0 0 0 0 0 0 0 0 1071.89 672.094 0 0 0 -2408.75 0 0 
0 334.864 -476.623 0 0 0 -424.894 2041.31 0 0 0 0 0 0 0 0 0 0 -91.937 0 0 0 0 0 0 0 0 0.05 0 0 0 2040.39 0 0 0 0 0 0 0 0 0 0 0 0 0 0 0 0 0 0 0 0 0 595.492 0 0 
0 694.983 0 0 0 0 0 1506.16 0 0 0 0 0 0 1270.41 0 0 0 0 0 0 0 0 0 0 0 0 0 0 0 0 0 0 0 0 0 0 0 -1376.61 0 0 -1925.64 0 0 0 0 0 0 0 0 0 0 1018.48 1254.08 0 0 
0 0 0 443.052 0 0 0 0 0 1809.06 0 0 0 0 0 0 0 0 0 0 0 0 0 0 0 0 0 0 0 0.08 0 0 0 0 2351.07 0 0 -106.128 0 0 545.747 0 0 0 0 0 0 0 0 0 0 0 0 2415.31 0 0 
297.021 0 0 0 0 0 0 324.488 0 0 0 0 0 0 0 0 0 0 0 0 0 0 0 0 0 0 0 0 0 0 0.09 0 0 0 0 0 0 0 0 0 0 0 0 0 0 1513.49 0 0 0 0 0 1174.58 0 0 0 0 
0 0 0 647.069 0 0 0 89.0378 0 1824.47 0 0 0 0 0 0 -468.688 0 2203.21 0 0 -1104.54 0 0 0 1104.08 0 1036.94 0 0 0 0.08 0 1064.1 0 0 0 0 0 0 0 0 0 0 0 0 0 0 0 0 0 1458.4 0 0 0 0 
0 0 0 0 0 0 0 0 0 0 0 0 0 0 0 0 0 0 0 0 0 0 0 0 0 0 -56.3829 0 0 0 0 0 0.09 0 0 2261.65 0 0 0 0 0 0 -467.315 0 0 0 0 0 0 0 0 0 0 0 0 0 
0 0 0 0 0 0 762.123 0 0 0 0 0 1300.62 0 -1462.22 2126.15 -1317.71 0 0 0 0 0 0 0 0 1939.99 0 0 0 0 0 1020.16 0 0.08 0 2086.17 0 0 0 0 0 -2212.36 0 0 0 0 0 0 0 0 0 0 0 0 0 0 
0 0 0 0 1228.9 0 0 0 0 0 0 0 0 0 0 -199.82 0 0 0 0 0 0 1200.98 0 0 0 0 0 0 -1074.63 0 0 0 0 0.05 0 0 0 -1662.72 0 0 0 0 0 0 0 0 0 0 1217.46 0 0 0 0 0 0 
0 0 0 -832.469 1703.01 0 0 0 1940.29 0 0 0 0 0 0 0 0 0 -1462.52 0 0 0 0 0 0 0 0 0 0 0 0 0 1787.55 161.367 0 0.09 0 0 0 0 0 0 0 -617.313 0 0 0 1641.21 0 0 0 0 0 0 978.042 0 
0 0 1641.51 0 0 375.607 0 0 0 0 0 0 0 0 0 0 0 0 0 0 0 0 0 0 0 0 0 0 0 0 0 0 0 0 0 0 0.06 0 0 0 0 0 0 -1072.19 822.398 0 2204.12 0 0 0 0 0 0 1971.57 0 0 
0 0 0 0 0 0 791.574 0 0 0 0 0 0 806.986 0 0 0 0 0 0 0 0 0 0 0 0 150.227 0 0 -1965.62 0 0 0 0 0 0 0 0 0 0 0 0 -451.598 0 0 0 0 0 0 0 0 0 0 2225.18 0 992.233 
0 0 2359.16 0 0 0 0 0 0 0 0 0 0 0 0 0 0 501.953 0 0 0 0 0 0 0 0 0 0 -432.676 0 0 0 0 0 -1617.4 0 0 0 0.09 0 0 0 0 0 0 0 0 0 0 0 0 0 0 0 0 0 
0 -1867.35 0 0 0 0 0 0 0 0 0 0 0 0 0 0 0 -162.893 0 0 -759.529 0 -54.0941 0 291.07 0 -2344.51 0 0 0 0 0 0 0 0 0 0 0 0 0.03 0 1202.35 0 1730.93 0 0 0 0 0 0 0 0 2060.53 0 0 0 
0 0 0 989.944 0 0 0 0 -1457.03 0 0 0 2125.69 0 0 0 2216.94 0 0 0 -490.967 0 755.104 0 0 0 0 0 0 1976.15 0 0 0 0 0 0 0 0 0 0 0.01 0 0 0 0 0 0 0 0 0 0 0 0 0 2249.75 0 
0 0 0 0 0 0 0 0 0 0 0 0 0 0 692.389 0 0 0 1351.28 0 0 0 0 0 0 0 0 0 1640.14 0 0 0 0 -1723.61 0 0 0 0 0 -1787.24 0 0 0 0 0 0 0 0 1330.84 0 0 0 0 -1724.37 416.196 0 
0 0 0 0 0 0 0 0 0 0 0 0 0 0 0 0 0 0 0 0 0 0 1054.95 0 0 0 0 0 0 0 0 0 -1798.99 0 0 0 0 1544.62 0 0 0 0 0.01 2008.04 0 0 703.223 0 0 0 0 0 0 0 0 0 
0 0 0 -272.454 0 0 0 0 0 -35.6304 0 0 0 -526.215 0 1873.15 0 0 0 0 0 1249.05 0 -910.749 0 0 0 0 0 0 0 0 0 0 0 -1163.14 -2071.83 0 0 -1562.17 0 0 804.086 0.05 1917.1 -2051.99 0 0 623.569 0 0 2241.51 0 0 1422.24 0 
2384.33 0 0 0 0 0 1465.73 0 0 0 0 0 -2445.83 0 0 0 0 0 0 0 0 1070.36 0 0 -638.371 0 0 0 0 0 0 0 0 0 0 0 344.02 0 0 0 0 0 0 -544.069 0.06 0 0 0 0 0 1979.05 0 0 0 0 0 
0 0 0 0 0 0 0 0 0 0 0 0 1748.02 0 0 0 0 0 0 773.11 0 0 0 0 0 0 0 0 0 0 1858.2 0 0 0 0 0 0 0 0 0 0 0 0 2165.82 0 0.09 0 0 -1514.86 0 0 771.432 0 -2420.8 0 0 
1246.76 0 0 0 0 0 0 0 0 0 743.355 0 2050.16 0 0 0 0 0 0 0 -791.269 0 2482.15 0 0 0 0 0 0 0 0 0 0 0 0 0 204.703 0 0 0 0 0 -1207.08 0 0 0 0.04 0 0 0 0 0 0 0 0 0 
0 1410.49 0 0 1690.34 0 0 0 0 0 0 0 0 1499.3 0 0 2445.52 0 0 0 0 0 0 2090.9 0 0 0 0 0 0 0 0 0 0 0 1195.18 0 0 0 0 0 0 0 0 0 0 0 0.02 0 0 0 0 1324.58 0 0 0 
1628.39 0 2120.35 2176.81 1529.21 0 0 0 0 0 -1716.74 417.57 0 0 0 0 0 0 0 0 0 -2495.12 0 -389.035 1408.2 0 2263.02 0 0 0 0 0 0 0 0 0 0 0 0 0 0 606.326 0 -1603.21 0 1353.27 0 0 0.06 0 0 0 0 0 0 0 
0 0 0 0 0 0 0 0 0 0 0 0 0 0 0 21.7444 0 0 0 0 0 1580.32 0 0 0 -462.127 -2069.23 0 0 0 0 0 0 0 433.592 0 0 0 0 0 0 0 0 0 0 0 0 0 0 0.07 873.669 0 550.478 0 0 0 
1117.82 0 0 0 0 0 0 0 0 0 0 0 0 0 0 0 0 0 0 0 0 0 0 0 0 2445.07 0 0 0 0 0 0 0 0 0 0 0 0 0 0 0 0 0 0 662.175 0 0 0 0 -667.516 0.05 0 0 -1527.68 0 0 
0 0 0 0 0 411.771 0 0 0 0 0 0 0 0 0 0 807.749 0 0 0 1325.19 0 1624.12 0 0 0 0 0 0 0 980.941 2353.97 0 0 0 0 0 0 0 0 0 0 0 -2003.31 0 -834.91 0 0 0 0 0 0.08 0 -1502.81 -2207.48 0 
0 0 480.743 0 0 0 0 0 0 0 0 0 0 0 0 0 0 0 0 0 90.5637 0 0 0 0 0 0 0 1930.52 0 0 0 0 0 0 0 0 0 0 2398.22 0 0 0 0 0 0 0 1523.71 0 -1395.99 0 0 0.04 0 -2113.64 0 
0 0 0 0 0 0 747.627 0 0 0 0 0 0 0 0 0 0 0 0 1414.3 0 0 0 0 0 0 1688.36 -366.298 1841.72 -246.818 0 0 0 0 0 0 2463.99 1198.84 0 0 0 -2123.1 0 0 0 -263.604 0 0 0 0 1010.85 -500.122 0 0.03 0 0 
2487.33 -2480.47 0 0 0 0 0 713.141 0 0 -1736.43 -219.199 0 0 0 0 0 760.903 0 0 0 0 0 0 0 0 0 0 0 0 0 0 0 0 0 1600.31 0 0 0 0 1708.2 1338.01 0 204.093 0 0 0 0 0 0 0 555.055 1337.7 0 0.08 0 
0 844.981 0 0 0 0 0 0 1693.4 0 0 0 0 0 0 0 1106.98 2060.84 0 0 0 1311.3 0 0 0 0 0 0 0 0 0 0 0 0 0 0 0 2012.77 0 0 0 0 0 0 0 0 0 0 0 0 0 0 0 0 0 0.04 
