*Vertices 66
*Matrix 
0.01 0 41.4289 0 -1274.22 0 0 0 0 1030.53 0 0 1347.62 0 0 0 0 0 -1772.74 0 2454.22 -715.43 0 0 0 0 0 0 0 0 0 0 -583.895 0 -1629.76 0 0 0 0 1562.17 -1862.01 0 402.615 0 -2085.71 0 0 0 0 1755.35 0 0 0 0 952.101 0 0 1508.3 0 1749.4 2390.29 0 0 0 0 0 
0 0.09 178.915 0 -283.898 0 0 0 0 0 -1188.31 0 919.446 -1494.57 0 0 0 0 0 0 0 0 0 0 -485.473 0 0 0 0 -831.553 0 0 0 361.11 0 0 0 0 0 0 0 0 0 0 0 0 -765.481 0 0 0 0 0 0 207.602 1823.1 349.208 0 0 0 0 0 0 0 0 0 2414.55 
2327.42 1691.41 0.05 0 -813.395 0 0 0 1860.33 0 0 0 0 1007.8 0 0 0 0 0 1749.4 0 0 0 0 0 0 0 1018.33 0 0 1735.36 0 0 0 0 0 0 0 0 0 0 0 0 0 0 0 -980.483 2077.47 0 0 0 -1729.1 -2049.85 1130.18 0 2346.34 0 0 0 0 -2499.69 0 0 0 0 0 
0 0 0 0.08 0 -2349.39 787.912 0 0 0 0 -1863.08 2433.16 170.064 0 0 0 0 0 0 -1766.18 0 0 0 0 0 0 0 2423.86 0 0 0 0 1599.86 0 0 0 1889.78 0 0 0 0 0 1313.59 0 0 -314.112 0 0 -2384.18 0 0 2261.8 0 0 0 0 0 0 0 0 0 0 0 0 0 
1664.56 2398.22 1194.88 0 0.04 0 0 0 0 2462.31 -1515.47 0 0 2425.23 0 1088.82 1161.61 0 0 150.227 0 0 0 818.43 0 -992.996 0 0 0 0 0 0 0 0 0 1406.37 -1892.99 2218.31 0 0 0 667.211 0 0 1219.29 0 0 1255.15 -151.906 0 0 0 0 2213.74 0 -378.506 0 565.889 0 0 0 0 -1770.46 1354.79 2372.59 0 
0 0 0 1448.33 0 0 0 -1625.03 111.011 0 0 0 -480.438 2343.9 0 641.728 0 0 0 0 61.8763 0 0 0 0 -1141.32 0 1910.23 2356.41 -2337.64 1350.06 0 0 0 0 0 0 0 0 0 0 0 0 -276.879 711.463 0 316.401 0 0 1632.21 745.338 0 0 0 0 0 0 -672.704 0 0 0 0 0 -919.752 0 0 
0 0 0 1756.26 0 0 0 2461.24 -97.5829 0 0 0 884.503 0 0 0 0 -2091.66 0 0 0 0 0 0 0 -1159.32 467.772 0 0 0 0 0 0 0 1490.91 0 0 0 0 0 0 0 0 0 0 -1338.01 0 0 0 0 0 0 0 0 0 1082.26 1370.82 0 0 -286.95 0 0 0 0 -40.6659 0 
0 0 0 0 0 -950.117 881.298 0.09 987.198 0 -571.078 0 0 0 0 -2097.31 0 1266.9 0 2288.35 0 0 0 0 0 162.893 0 0 0 -2213.28 0 0 0 0 0 -699.713 0 645.238 0 0 0 0 0 1650.36 1644.57 0 1138.42 0 2054.43 233.238 -1815.47 0 0 0 -2339.78 0 0 2195.58 0 0 0 2155.14 0 0 -2445.52 0 
0 0 -905.866 0 0 -1087.91 704.291 178.152 0.02 0 0 0 0 680.792 1708.35 0 -1988.66 0 0 0 0 0 1384.4 -570.162 0 0 0 0 89.6481 0 0 0 1184.96 0 0 0 -618.992 0 0 0 0 45.7015 925.398 0 0 0 0 0 1015.73 -102.466 0 0 0 508.362 1093.25 0 -4.0437 0 776.467 0 0 0 0 496.918 0 0 
-648.137 0 0 0 1457.64 0 0 0 0 0.04 0 0 0 0 0 2026.81 0 0 0 0 990.097 0 0 0 0 0 99.5666 0 -2240.44 0 1081.04 0 0 0 0 0 2053.21 0 0 0 0 0 0 0 0 0 0 0 0 0 0 78.9666 0 0 0 0 -4.65407 0 0 0 0 0 0 0 0 1673.25 
0 249.107 0 0 1917.1 0 0 2024.83 0 0 0.06 0 0 0 -426.115 0 0 0 0 452.666 0 0 0 0 0 0 0 -2300.41 923.109 0 0 1614.81 0 0 0 0 0 0 0 -1311.91 0 0 0 0 -980.789 0 0 0 0 0 0 0 -992.691 -289.087 0 0 0 0 0 2076.56 -1612.37 659.124 0 0 0 0 
0 0 0 2304.99 0 0 0 0 0 0 0 0.07 0 0 0 0 0 0 0 0 0 0 0 1956.01 -1578.65 0 -2192.68 0 -1317.71 0 0 2211.75 0 0 496.307 0 -1286.74 -807.138 0 0 0 -1731.54 -63.2496 0 2237.24 0 2447.81 0 0 0 0 0 0 0 0 0 0 0 1153.98 0 0 0 0 0 -1635.87 0 
-1261.25 -186.697 0 -736.641 0 973.159 -2382.2 0 0 0 0 0 0.07 0 -1908.09 0 0 10.6052 0 0 0 0 0 0 1475.8 0 0 0 0 0 0 1487.85 0 0 -1533.33 1366.85 0 0 0 565.279 0 1511.2 0 2321.47 0 0 0 0 1808.3 0 0 0 0 0 2328.03 2005.75 -440.001 0 0 539.186 0 0 0 0 0 0 
0 1804.94 -428.861 2042.07 992.843 2313.84 0 0 -2094.56 0 0 0 0 0.02 0 0 0 0 0 1553.77 0 -1506.47 0 0 0 -507.294 1708.81 0 0 0 2442.63 0 0 1707.89 0 0 0 0 0 0 0 0 -340.358 0 -1624.73 1475.19 0 0 2409.05 0 -173.574 1858.35 0 0 -106.586 6.79037 1469.08 0 0 0 0 0 0 0 0 0 
0 0 0 0 0 0 0 0 2111.8 0 -2141.41 0 563.906 0 0.09 0 0 0 0 0 0 -1136.74 0 2481.23 0 -161.061 0 0 0 0 0 0 0 -2472.38 0 0 0 0 0 0 0 0 0 0 0 0 1948.68 0 0 0 0 0 0 0 0 0 0 0 494.324 699.408 0 -979.568 0 0 1897.72 0 
0 0 0 0 1984.54 -1587.04 0 -1866.13 0 2213.74 0 0 0 0 0 0 0 0 0 -1089.89 0 0 0 0 0 0 -517.67 0 0 0 0 -1632.36 0 0 1422.85 1247.22 1906.72 0 0 -109.485 0 0 0 0 0 0 25.5593 0 281.304 0 0 0 0 0 0 0 0 0 0 0 0 0 0 -956.069 1078.91 0 
0 0 0 0 -1707.89 0 0 0 1924.88 0 0 0 0 0 0 0 0.09 0 0 0 0 0 0 0 0 0 0 0 0 0 0 0 0 0 -317.011 2234.79 0 0 0 0 -115.741 0 0 0 1282.92 2195.27 838.572 0 0 730.079 -1938.76 0 0 0 0 0 0 0 0 -1295.13 712.073 0 0 0 0 0 
0 0 0 0 0 0 2301.78 66.4541 0 0 0 0 1525.09 0 0 0 0 0.05 0 0 0 0 -675.298 0 0 0 0 -1202.2 0 0 0 0 0 0 0 0 0 0 0 0 0 0 0 0 0 0 0 0 0 -2387.84 -1643.65 0 1748.02 0 0 -134.51 0 0 2279.96 0 0 0 0 0 1014.05 0 
1273.46 0 0 0 0 0 0 0 0 0 0 0 0 0 0 0 0 0 0.06 1850.87 0 0 0 0 0 0 0 212.79 789.895 0 0 631.962 0 0 0 0 173.421 0 0 0 439.695 0 0 0 155.416 0 119.709 284.661 0 0 -26.3222 0 0 788.369 0 -761.361 0 0 2213.13 1633.58 0 0 2436.67 0 -605.869 0 
0 0 2319.18 0 803.781 0 0 1048.39 0 0 -264.367 0 0 2221.06 0 1529.82 0 0 -2331.23 0.01 0 0 0 1035.87 0 0 2023.3 0 0 -906.629 814.768 0 0 1992.48 2109.36 0 0 -982.315 0 0 0 0 0 0 -2081.74 0 1955.85 0 0 0 0 0 0 -1422.54 0 2438.96 0 0 0 0 0 -1449.71 0 0 0 0 
-1471.83 0 0 -1532.11 0 1683.02 0 0 0 -231.864 0 0 0 0 0 0 0 0 0 0 0.08 0 0 0 0 0 1956.62 0 0 -667.058 2443.39 0 0 127.033 0 0 0 0 -582.827 0 1496.7 -769.601 0 0 0 0 0 0 1121.02 0 0 0 0 -1072.34 0 0 0 1877.88 -819.803 0 -1472.29 -1835.76 199.362 0 0 0 
648.9 0 0 0 0 0 0 0 0 0 0 0 0 -2329.86 927.839 0 0 0 0 0 0 0 0 -1808.6 0 0 1015.73 -500.885 0 0 -408.567 -1441.92 0 0 0 0 1205.86 0 0 0 383.084 0 0 0 0 -33.4941 0 0 0 0 0 1336.94 0 0 0 0 0 2207.79 0 0 0 0 0 0 0 638.829 
0 0 0 0 0 0 0 0 1096.61 0 0 0 0 0 0 0 0 -389.34 0 0 0 0 0.08 0 435.575 -870.769 0 83.0866 0 557.497 1733.83 0 0 0 0 0 67.5222 0 0 404.599 0 0 0 0 0 1589.63 0 0 0 501.648 0 -203.482 -1697.97 0 -603.732 0 0 0 0 -1745.89 0 0 1054.64 0 0 0 
0 0 0 0 2411.04 0 0 0 321.741 0 0 1920.3 0 0 -651.189 0 0 0 0 2206.41 0 -2445.83 0 0.08 0 0 0 0 -622.044 0 0 0 2234.64 0 0 0 0 0 0 1835.76 0 0 0 0 0 0 0 1516.85 0 0 1618.78 0 1116.9 -2238.46 -1729.56 0 0 0 0 2177.27 0 -253.533 0 1610.84 0 0 
0 -362.178 0 0 0 0 0 0 0 0 0 721.381 1494.11 0 0 0 0 0 0 0 0 0 -776.315 0 0.01 -248.65 0 0 0 714.057 2017.35 0 0 0 0 0 0 0 0 0 0 0 -2489.47 0 0 0 0 0 2429.35 0 0 0 0 -401.852 0 -160.756 0 0 0 0 0 0 0 0 0 0 
0 0 0 0 2202.44 -33.9518 1014.51 605.258 0 0 0 0 0 664.159 232.78 0 0 0 0 0 0 0 1719.95 0 -79.8822 0 0 0 0 -207.755 0 0 -2280.88 0 0 0 -969.649 -2055.35 0 0 0 0 0 1271.78 -241.63 0 0 0 -206.839 0 156.636 0 -65.9963 0 0 0 -494.934 0 -691.626 0 0 0 0 0 0 0 
0 0 0 0 0 0 -460.143 0 0 2000.41 0 2334.59 0 2150.87 0 -1783.27 0 0 0 2287.44 -1711.86 502.564 0 0 0 0 0.04 0 0 0 0 0 -386.441 0 0 0 0 0 0 -932.875 0 0 0 0 0 0 0 0 0 0 0 0 0 890.149 0 0 0 0 0 0 0 0 0 0 2271.11 0 
0 0 -2414.4 0 0 -697.119 0 0 0 0 2100.21 0 0 0 0 0 0 1358.76 -1957.08 0 0 1947 -518.738 0 0 0 0 0.03 1967.3 919.904 0 -596.713 0 0 0 0 0 2028.18 0 0 0 -382.015 0 260.247 0 0 0 1784.95 0 0 -541.627 -431.761 0 0 0 0 0 0 0 635.777 0 0 0 0 0 -63.4022 
0 0 0 8.46889 0 559.175 0 0 -548.799 770.211 2469.33 2064.96 0 0 0 0 0 0 1347.47 0 0 0 0 -2355.65 0 0 0 1008.1 0.07 0 0 -2116.84 0 1082.11 0 0 0 0 -386.898 0 1213.8 0 1046.1 0 0 0 0 0 0 0 0 -153.127 0 0 0 0 0 0 0 838.572 0 0 0 0 0 -1749.7 
0 -654.088 0 0 0 -1091.88 0 1739.78 0 0 0 0 0 0 0 0 0 0 0 527.131 1645.33 0 -622.196 0 656.224 1553.32 0 -239.494 0 0.02 0 0 0 0 0 0 0 0 0 0 0 0 0 0 0 0 0 0 0 0 0 0 0 0 872.448 0 0 0 0 0 762.581 0 0 0 0 0 
0 0 -1449.1 0 0 -343.257 0 0 0 -1926.56 0 0 0 2319.94 0 0 0 0 0 -244.224 41.1237 1353.88 775.094 0 -683.538 0 0 0 0 0 0.03 -494.171 0 0 1632.36 1523.1 0 0 0 0 -1778.54 642.949 0 0 0 0 0 -1600.77 0 0 1885.36 0 0 0 0 0 0 0 0 0 2369.69 0 0 0 125.813 0 
0 0 0 0 0 0 0 0 0 0 825.602 1145.59 -173.421 0 0 -509.583 0 0 1017.26 0 0 -1649.14 0 0 0 0 0 1990.8 -986.282 0 292.596 0.05 0 0 0 0 0 0 0 0 0 0 0 0 0 1578.8 1977.22 1496.7 0 0 0 -1519.75 0 1308.71 0 1131.7 0 0 0 0 0 0 -2164.45 0 0 0 
2144.76 0 0 0 0 0 0 0 -2482.15 0 0 0 0 0 0 0 0 0 0 0 0 0 0 2222.28 0 -2243.64 -1558.35 0 0 0 0 0 0.02 0 0 0 0 733.741 1071.28 -769.906 0 0 0 0 0 0 1984.85 -2457.27 0 0 603.58 0 0 0 751.595 0 0 659.429 0 -386.898 0 0 0 0 0 1703.01 
0 -78.3563 0 2373.65 0 0 0 0 0 0 0 0 0 1215.02 32.5785 0 0 0 0 315.943 1385.77 0 0 0 0 0 0 0 512.635 0 0 0 0 0.07 425.504 -1766.34 -1921.06 0 0 -1949.45 0 1388.21 2116.53 0 0 0 0 0 0 114.216 0 1722.24 0 0 0 0 1976.3 0 -1907.03 2484.89 0 0 1958.6 34.4096 -853.069 0 
1329 0 0 0 0 0 -151.906 0 0 0 0 928.602 -2367.24 0 0 1951.43 -1996.29 0 0 2095.02 0 0 0 0 0 0 0 0 0 0 -898.999 0 0 1344.26 0.07 0 0 0 0 0 0 0 1630.07 0 -114.063 0 0 0 1416.59 821.94 0 -1560.03 0 0 0 0 0 0 0 0 0 0 896.252 -718.329 0 -826.823 
0 0 0 0 -1663.95 0 0 1640.9 0 0 0 0 2410.43 0 0 -2182.76 1333.28 0 0 0 0 0 0 0 0 0 0 0 0 0 692.541 0 0 -1029.77 0 0.04 0 2204.43 560.854 1924.73 0 0 0 0 0 0 0 -2489.17 -934.095 0 0 0 0 0 0 380.337 -1071.73 0 0 0 0 0 -578.707 0 1869.18 -2362.67 
0 0 0 0 1044.57 0 0 0 1988.05 -1145.44 0 1648.08 0 0 0 -1086.08 0 0 1137.2 0 0 1276.36 -1860.79 0 0 -181.814 0 0 0 0 0 0 0 -750.221 0 0 0.06 0 0 1448.79 0 0 0 0 1021.23 0 869.091 0 0 0 0 -315.027 0 0 0 0 707.495 1937.7 -1775.19 0 0 0 0 0 0 0 
0 0 0 1732.76 2153.61 0 0 -131.764 0 0 0 503.784 0 0 0 0 0 0 0 -676.214 0 0 0 0 0 -242.546 0 2493.29 0 0 0 0 149.159 0 0 1165.43 0 0.05 0 -2239.37 0 38.6822 2008.35 0 0 0 0 -1200.22 -935.316 0 0 0 629.826 0 1787.09 0 2279.2 0 0 0 0 1258.66 0 0 0 0 
0 0 0 0 0 0 0 0 0 0 0 0 0 0 0 0 0 0 0 0 1541.72 0 0 0 0 0 0 0 -735.878 0 0 0 -62.3341 0 0 1683.32 0 0 0 0 0 0 0 0 0 0 0 0 0 -1995.53 0 1362.88 887.86 0 0 -90.8689 0 550.172 0 0 0 -1874.37 -43.26 0 0 0 
1643.65 0 0 0 0 0 0 0 0 0 -963.546 0 -1110.03 0 0 2355.34 0 0 0 0 0 0 950.423 1995.22 0 0 1992.78 0 0 0 0 0 1400.57 2230.67 0 1347.32 -1804.48 128.864 0 0 -607.395 0 -2096.24 0 0 1737.49 1365.17 0 -955.763 0 1702.09 0 0 1050.07 0 0 0 0 -47.2274 -2199.7 0 -2111.35 0 0 0 0 
921.583 0 0 0 0 0 0 0 0 0 0 0 0 0 0 0 -336.695 0 690.558 0 197.378 1623.36 0 0 0 0 0 0 1960.59 0 -190.664 0 0 0 0 0 0 0 0 -1993.85 0.06 0 1893.9 0 0 0 0 0 0 0 0 0 0 0 0 0 0 0 2183.07 0 0 0 -2157.43 0 533.845 0 
0 0 0 0 1489.99 0 0 0 -663.396 0 0 738.624 1694.01 0 0 0 0 0 0 0 -765.786 0 0 0 0 0 0 1049.61 0 0 -1714.61 0 0 1920.45 0 0 0 -1592.99 0 0 0 0.03 956.526 0 151.296 0 -1504.49 0 0 2067.09 0 2128.9 0 0 0 0 577.487 2265.01 0 0 0 0 0 0 0 0 
1895.73 0 0 0 0 0 0 0 -1208 0 0 218.894 0 -980.636 0 0 0 0 0 0 0 0 0 0 1780.22 0 0 0 1638 0 0 0 0 -1874.68 888.928 0 0 47.38 0 1398.43 -1448.48 2376.09 0.02 0 0 -1970.66 -2046.65 0 0 0 0 0 0 0 0 0 0 2145.99 0 0 0 0 1430.17 1122.7 0 0 
0 0 0 -1763.44 0 -998.184 0 1829.51 0 0 0 0 273.217 0 0 0 0 0 0 0 0 0 0 0 0 2446.29 0 747.932 0 0 0 0 0 0 0 0 0 0 0 0 0 0 0 0.09 0 0 0 0 2442.93 0 -690.863 0 0 1199.45 0 0 0 0 0 0 -2109.36 -121.54 0 -385.372 0 0 
2385.56 0 0 0 -2266.08 -285.424 0 211.112 0 0 2292.32 280.236 0 1597.11 0 0 -789.438 0 -615.94 951.949 0 0 0 0 0 -234.764 0 0 0 0 0 0 0 0 -1477.94 0 2092.43 0 0 0 0 -1192.74 0 0 0.01 0 0 0 284.509 0 0 0 2343.59 0 0 0 1190.15 1789.22 -733.131 0 -1742.68 0 433.897 2028.49 0 0 
0 0 0 0 0 0 1672.8 0 0 0 0 0 0 1766.64 0 0 1320.76 0 0 0 0 -281.304 -2364.19 0 0 0 0 0 0 0 0 -1662.11 0 0 0 0 0 0 0 1728.03 0 0 1088.98 0 0 0.05 542.848 1871.32 0 0 1182.67 0 2490.54 0 -878.857 0 0 0 1929.15 0 2461.7 0 -1651.74 0 0 0 
0 -1453.67 2315.52 -843.913 0 1858.2 0 -803.018 0 0 0 -976.363 0 0 -840.251 1750.01 2254.48 0 1426.05 207.907 0 0 0 0 0 0 0 0 0 0 0 2077.01 972.243 0 0 0 -209.891 0 0 1833.17 0 1239.13 -1093.55 0 0 621.128 0.05 0 482.269 0 0 0 0 0 0 1961.5 2173.45 0 0 0 1863.69 -2447.36 0 0 0 0 
0 0 1285.21 0 898.999 0 0 0 0 0 0 0 0 0 0 0 0 0 -1420.87 0 0 0 0 -1237.75 0 0 0 -1518.37 0 0 508.972 -48.7533 1433.84 0 0 -1615.88 0 1814.4 0 0 0 0 0 0 0 1415.83 0 0.04 631.047 0 0 0 0 672.552 0 2095.78 0 0 0 0 418.027 0 0 0 0 0 
0 0 0 0 1771.07 0 0 2319.64 -1247.52 0 0 0 -1540.04 -48.2955 0 -125.965 0 0 0 0 54.7044 0 0 0 2440.18 1909.16 0 0 0 0 0 0 0 0 1330.38 1651.43 0 1653.11 0 -2026.05 0 0 0 -1150.17 -1874.52 0 2163.99 1091.88 0.04 0 0 0 531.098 -1469.54 0 0 0 0 0 0 0 0 -1126.51 0 0 -1513.79 
368.13 0 0 156.178 0 2094.26 0 -2161.55 2258.75 0 0 0 0 0 0 0 692.236 2306.67 0 0 0 0 -2382.96 0 0 0 0 0 0 0 0 0 0 -2497.41 -644.78 0 0 0 2068.93 0 0 -2279.96 0 0 0 0 0 0 0 0.02 0 -2278.28 0 0 2486.11 0 0 0 0 0 0 0 872.6 0 0 0 
0 0 0 0 0 1273.77 0 1594.82 0 0 0 0 0 -1692.18 0 0 -1073.41 273.827 1974.78 0 0 0 0 707.648 0 1817.15 0 -99.1089 0 0 1751.08 0 -504.089 0 0 0 0 0 0 -2334.13 0 0 0 1341.06 0 135.884 0 0 0 0 0.07 0 1267.82 0 -1055.71 0 1969.44 0 0 0 0 0 0 0 0 -1036.48 
0 0 158.773 0 0 0 0 0 0 -755.409 0 0 0 780.74 0 0 0 0 0 0 0 1879.71 815.989 0 0 0 0 557.955 -1619.69 0 0 -151.906 0 1083.79 874.432 0 -2286.22 0 -2200.31 0 0 1824.78 0 0 0 0 0 0 0 2280.42 0 0.04 0 0 0 0 -2090.29 1603.52 0 1864.91 0 0 1922.13 1582.46 0 0 
0 0 870.006 -1811.04 0 0 0 0 0 0 258.721 0 0 0 0 0 0 -98.1933 0 0 0 0 365.993 2002.55 0 1745.12 0 0 0 0 0 0 0 0 0 0 0 1810.89 448.698 0 0 0 0 0 1934.19 6.48518 0 0 -2254.33 0 -1163.59 0 0.08 0 0 0 556.124 0 0 0 0 0 0 1347.16 0 0 
0 106.891 -429.93 0 422.147 0 0 0 364.315 0 2144.15 0 0 0 0 0 0 0 2137.29 820.566 153.127 0 0 -556.581 -194.327 0 1923.96 0 0 0 0 -1767.56 0 0 0 0 0 0 0 -2232.05 0 0 0 -894.269 0 0 0 1191.52 -2313.07 0 0 0 0 0 0 0 0 1201.13 0 0 0 0 881.146 714.667 0 0 
-1554.69 1962.26 0 0 0 0 0 886.334 -26.017 0 0 0 -2468.57 2149.04 0 0 0 0 0 0 0 0 2394.86 -600.833 0 0 0 0 0 -18.54 0 0 1656.47 0 0 0 0 885.876 0 0 0 0 0 0 0 -38.9874 0 0 0 1849.65 -864.208 0 0 0 0.01 0 1161.15 0 2469.33 1250.88 0 0 0 0 -2088.15 0 
0 1688.06 -2273.4 0 -1542.48 0 567.873 0 0 0 0 0 227.287 1239.28 0 0 0 442.595 -1790.9 -2089.98 0 0 0 0 2172.38 0 0 0 0 0 0 -1707.89 0 0 0 -2210.38 0 0 2323.6 0 0 0 0 0 0 0 1861.25 1755.65 0 0 0 0 0 0 0 0.07 0 0 1605.2 2057.02 0 0 0 888.165 -977.584 1830.73 
0 0 0 0 0 0 462.889 0 1880.32 2306.51 0 0 1433.07 679.113 0 0 0 0 0 0 0 0 0 0 0 899.609 0 0 0 0 0 0 0 -22.2022 0 -132.679 524.079 1239.59 0 0 0 2114.86 0 0 -2419.58 0 1071.28 0 0 0 -1840.34 -1403.78 875.805 0 -1702.4 0 0.04 -2327.72 -1353.72 0 1077.53 0 0 0 0 0 
-784.402 0 0 0 -1593.14 -1919.08 0 -365.078 0 0 0 0 0 0 0 0 0 0 0 0 625.706 -2170.71 0 0 0 0 0 0 0 0 0 0 523.927 0 0 0 -2498.17 0 1163.9 0 0 -1591.62 1944.41 0 2467.96 0 0 0 0 0 0 1721.47 0 -192.495 0 0 136.799 0.05 2242.42 825.144 0 0 0 0 2209.16 0 
0 0 0 0 0 0 0 0 915.326 0 0 770.058 0 0 792.947 0 0 -3.89111 1924.73 0 600.07 0 0 0 0 -1112.17 0 0 0 0 0 0 0 1447.42 0 0 423.521 0 0 -1516.08 2062.36 0 0 0 -1761.3 1736.58 0 0 0 0 0 0 0 0 -1997.51 498.596 -574.129 1959.36 0.05 -2138.05 0 1269.65 0 0 0 0 
-1019.24 0 0 0 0 0 -2022.08 0 0 0 -2499.54 0 -423.673 0 -638.676 0 -1300.16 0 595.798 0 0 0 353.633 1477.32 0 0 0 669.042 2225.64 0 0 0 -694.678 -1182.06 0 0 0 0 0 1483.73 0 0 0 0 0 0 0 0 0 0 0 2267.14 0 0 792.032 343.715 0 -1956.01 2113.18 0.08 0 0 0 0 0 0 
1206.47 0 -31.3578 0 0 0 0 0 0 0 517.212 0 0 0 0 0 1745.58 0 0 0 -134.205 0 0 0 0 0 0 0 0 2121.42 536.286 0 0 0 0 0 0 0 0 0 0 0 0 1809.21 613.346 245.445 640.965 -1992.93 0 0 0 0 0 0 0 0 -1319.09 0 0 0 0.08 0 0 -208.975 -852.916 0 
0 0 0 0 0 0 0 1243.4 0 0 362.484 0 0 0 1356.47 0 0 0 0 2173.15 -1805.4 0 0 -1930.07 0 0 0 0 0 0 0 0 0 0 0 0 0 564.821 -314.417 -550.172 0 0 0 585.116 0 0 1010.39 0 0 0 0 0 0 0 0 0 0 0 -1275.44 0 0 0.05 0 0 0 0 
0 0 0 0 -596.866 0 0 0 0 0 0 0 0 0 0 0 0 0 2406.77 0 398.19 0 367.824 0 0 0 0 0 0 0 0 1471.07 0 -765.481 1388.82 129.78 0 0 -225.913 0 -287.713 0 -2366.02 0 -568.484 1525.54 0 0 2427.52 -2070.3 0 -1922.9 0 471.435 0 0 0 0 0 0 0 0 0.08 0 1882.31 0 
0 0 0 0 601.291 -1315.27 0 0 -729.164 0 0 0 0 0 0 375.607 0 0 0 0 0 0 0 -2133.47 0 0 0 0 0 0 0 0 0 1895.43 -238.731 0 0 0 0 0 0 0 -2060.23 -795.846 2492.52 0 0 0 0 0 0 1855.45 1940.29 -257.958 0 1714.3 0 0 0 0 1701.79 0 0 0.08 0 0 
0 0 0 0 2125.69 0 1433.99 742.286 0 0 0 -1493.65 0 0 -216.147 -1613.74 0 1622.75 -369.503 0 0 0 0 0 0 0 -67.8274 0 0 0 -1002.91 0 0 -1513.95 0 1947.16 0 0 0 0 -728.401 0 0 0 0 0 0 0 0 0 0 0 0 0 1967.6 1003.22 0 1608.1 0 0 -373.623 0 452.361 0 0 -866.802 
0 852.916 0 0 0 0 0 0 0 -551.241 0 0 0 0 0 0 0 0 0 0 0 150.38 0 0 0 0 0 365.383 1251.95 0 0 0 -1290.25 0 1082.57 1423.31 0 0 0 0 0 0 0 0 0 0 0 0 2157.12 0 -2047.56 0 0 0 0 -1799.91 0 0 0 0 0 0 0 0 -685.98 0.09 
