*Vertices 59
*Matrix 
0.03 0 1291.01 962.172 2076.4 0 -1278.19 0 0 0 0 98.0407 0 1524.32 1782.82 0 0 0 0 0 0 0 -1265.68 -2494.2 0 0 0 0 0 0 0 1568.42 2039.48 -515.839 917.463 1692.02 -704.138 0 0 0 863.75 -304.804 0 0 0 0 0 0 -2149.8 0 0 -1296.35 978.805 812.632 0 0 0 0 0 
0 0.02 0 0 0 0 0 0 0 0 0 0 1373.87 0 764.718 0 0 0 -122.608 0 0 0 -1740.39 0 0 0 748.085 14.7252 0 0 -1243.86 0 0 0 0 1841.87 0 616.703 0 0 0 0 0 0 0 -1772.13 -1392.79 841.624 0 0 0 0 0 1371.12 -1178.4 0 0 0 0 
-404.752 0 0 0 0 0 1108.66 0 0 0 1114.76 0 0 0 0 2100.51 0 0 0 0 0 273.064 0 895.032 0 0 0 0 760.903 0 2353.82 0 0 0 0 0 0 0 0 1029.31 0 0 0 0 0 0 0 0 0 0 0 -425.81 0 0 0 0 0 0 0 
-1191.52 0 0 0.07 0 2317.35 -1987.14 218.284 0 0 -770.821 0 0 -1831.03 647.221 2150.26 0 0 0 2306.82 0 0 0 0 0 666.295 -2478.64 -457.549 0 0 0 -423.215 1321.53 0 0 0 1983.47 0 0 0 0 -244.835 0 0 -2170.25 1846.9 0 1149.56 1243.86 0 0 318.384 0 0 0 0 0 0 0 
1047.32 0 0 0 0.01 2120.96 -994.674 1335.41 0 0 0 -2225.94 0 0 129.627 0 0 2214.5 0 1073.41 2458.34 0 0 0 0 -195.7 0 0 0 118.183 0 0 0 0 0 301.141 0 0 0 0 0 0 342.494 0 0 0 0 0 1697.82 0 0 0 0 0 0 364.01 0 0 0 
0 0 0 738.166 227.592 0.02 1648.08 318.69 -8.62148 0 0 -438.017 0 0 0 1999.95 0 0 0 0 0 0 0 0 0 0 0 282.372 0 0 0 0 0 -1952.19 140.156 0 0 0 0 -177.999 0 -410.703 0 1845.84 0 0 0 0 0 0 -904.797 0 -2383.72 0 0 0 0 0 0 
-1265.22 0 1126.97 -394.223 422.147 1887.95 0.09 0 -664.617 0 0 0 0 -2392.73 0 0 -131.458 1289.79 0 -112.537 0 0 243.461 1285.21 0 -1907.94 0 0 0 0 0 -688.116 0 0 -1608.86 0 2120.66 0 0 2246.24 0 0 0 0 0 0 0 0 1802.35 0 -1268.12 0 0 0 0 0 0 0 0 
0 0 0 1640.14 -864.971 2147.97 0 0.04 0 0 0 1109.58 0 0 0 -2229 0 0 0 0 512.177 0 1691.87 0 0 1254.08 1453.98 0 0 0 0 0 0 0 0 0 0 0 0 0 -1903.21 1769.54 1415.37 1857.89 0 2066.79 0 0 0 0 -265.13 0 0 -122.303 0 0 0 0 0 
0 0 0 0 0 264.824 2448.12 0 0.05 0 0 0 1706.37 0 0 708.411 0 1048.08 0 -1813.03 -2402.34 607.395 0 0 0 0 -323.42 0 0 645.848 0 0 953.017 1198.23 0 -51.1948 0 1360.59 1617.25 2208.4 0 0 0 602.817 0 0 -17.777 0 -1103.63 1607.33 0 0 0 140.461 1572.39 0 0 0 0 
0 0 0 0 0 0 0 0 0 0.01 0 0 0 0 0 -841.624 0 1210.75 0 -1849.5 0 0 0 0 0 0 0 2369.23 0 107.196 0 0 1173.97 0 -1478.55 0 0 0 -479.064 2001.79 0 0 0 0 0 0 0 0 0 0 0 0 1368.53 0 1590.24 0 0 0 -2244.1 
0 0 -815.836 96.5148 0 0 0 0 0 0 0 0 0 0 0 0 -1276.82 2120.2 0 0 -2338.56 0 0 519.654 0.839259 0 0 1865.21 0 0 0 0 0 0 0 0 0 0 501.801 0 0 0 652.409 0 0 930.433 0 401.242 0 0 0 1025.5 0 -2089.98 0 0 0 0 0 
763.344 0 0 0 406.735 -1366.85 0 1660.44 0 0 0 0.06 0 0 0 454.65 51.9578 0 0 0 826.823 0 549.104 0 50.8896 0 0 0 0 -2167.5 0 788.217 2355.34 -2218.92 0 0 2258.29 0 0 1877.27 0 0 0 -110.706 0 0 0 0 0 -2107.53 0 1119.8 0 0 -2419.74 0 0 0 0 
0 678.655 0 0 0 0 0 0 -198.294 0 0 0 0.02 0 0 0 0 0 0 0 0 0 2068.01 0 0 0 0 0 0 0 0 0 0 0 0 0 0 0 0 0 0 0 0 0 -2017.5 0 0 0 0 0 0 1126.82 0 0 1025.96 0 0 0 67.6748 
2354.88 0 0 1750.77 0 0 1878.03 0 0 0 0 0 0 0.07 -2495.27 -1434.9 0 0 0 0 712.683 -1808.3 0 0 0 0 2253.41 0 0 0 0 0 0 0 0 0 0 0 -994.522 561.464 -2100.51 683.386 0 0 0 0 1252.4 0 -1105.91 0 0 0 0 0 0 0 0 0 0 
712.378 -767.922 0 -487.152 1067 0 0 0 0 0 0 0 0 -2338.1 0.07 -866.039 0 761.818 22.66 1595.89 116.962 0 2064.96 1762.22 0 0 1462.98 0 1407.59 -1371.73 0 0 0 0 2391.35 0 0 0 0 0 0 0 0 0 1600.16 0 0 0 0 0 0 0 0 0 0 0 0 762.276 0 
0 0 1975.08 1927.47 0 -309.687 0 -1773.2 -2393.34 -555.513 0 -863.75 0 -1973.4 -838.572 0 0 0 0 0 100.787 1387.45 840.098 2148.73 0 0 0 0 0 0 -1786.48 0 0 926.923 0 0 2227.47 0 1429.72 639.286 0 0 0 1061.36 -1103.78 0 0 704.138 0 0 0 0 0 0 0 0 0 0 0 
0 0 0 0 0 0 2467.04 0 0 0 -423.368 528.809 0 0 0 0 0.03 0 0 0 -1249.2 0 4.50148 -1997.97 0 0 0 1730.17 0 -617.924 687.964 0 0 631.199 0 0 0 0 0 2205.95 -2056.72 0 0 0 0 0 -504.089 1080.74 -618.992 2468.72 0 1120.56 -2027.12 0 0 0 0 0 0 
0 0 0 0 2425.84 0 563.295 0 2337.95 -916.089 1866.74 0 0 0 -2356.26 0 0 0.08 0 0 2267.14 0 0 0 0 -2044.21 0 0 0 819.346 0 -1697.97 -1886.27 0 0 0 2074.42 0 -45.7015 0 -1896.8 0 0 -367.367 421.842 1296.66 0 -1612.98 843.455 0 1600.16 411.466 0 0 0 -563.143 2385.71 -2451.17 2146.6 
0 545.442 0 0 0 0 0 0 0 0 0 0 0 0 808.512 0 0 0 0.02 0 -1738.41 0 0 0 0 0 0 608.768 108.57 1431.7 390.561 -302.362 0 0 0 0 0 0 -2431.79 0 134.968 2132.25 0 1787.39 0 -503.937 0 -1711.1 611.209 0 0 0 0 0 0 0 0 0 0 
0 0 0 -141.53 874.279 0 1980.42 0 -1478.39 364.315 0 0 0 0 2292.63 0 0 0 0 0.08 1713.69 0 0 0 214.164 0 0 1430.17 0 -1090.96 0 0 0 -2483.37 0 0 0 0 0 0 0 0 0 0 0 0 148.549 -558.718 0 0 0 -19.7607 0 0 0 0 0 0 0 
0 0 0 0 1206.47 0 0 606.937 -1218.99 0 669.347 1090.04 0 -810.038 2432.55 -1268.43 -562.685 356.075 -2080.98 -1152.15 0.01 0 1118.12 0 -1506.32 0 0 0 1352.2 0 2294.92 678.35 0 0 0 0 0 0 0 0 0 0 0 0 0 0 917.31 0 720.313 0 0 126.118 0 0 0 -129.627 0 0 0 
0 0 -1006.58 0 0 0 0 0 1470.92 0 0 0 0 -676.672 0 -2025.44 0 0 0 0 0 0.02 0 0 881.146 2115.01 2005.6 0 -1564.91 0 2443.69 0 0 2046.19 1989.12 0 -2187.34 0 -545.137 1152.91 2103.72 0 0 0 0 701.239 0 0 0 0 0 0 0 1098.59 0 0 0 0 0 
427.335 1936.63 0 0 0 0 599.307 536.897 0 0 0 1339.38 699.103 0 1669.9 -647.526 -770.821 0 0 0 -1048.39 0 0.07 0 0 0 0 0 0 -77.4407 -1025.8 1358.61 0 1056.47 2161.55 0 0 0 0 0 0 1241.87 0 2184.9 2041 0 -2060.69 0 0 2152.24 0 0 0 0 0 0 0 -899.304 0 
734.199 0 1102.71 0 0 0 765.481 0 0 0 454.802 0 0 0 441.069 512.177 560.701 0 0 0 0 0 0 0.09 0 0 1295.89 0 0 833.842 0 0 1250.11 0 -1364.41 0 0 1832.87 0 -1389.28 0 0 0 0 0 0 -380.947 0 0 0 -988.113 0 0 0 0 1300.47 0 0 0 
0 0 0 0 0 0 0 0 0 0 811.411 -18.9978 0 0 0 0 0 0 0 1222.95 -841.777 2132.56 0 0 0.03 0 0 0 0 0 -417.417 1465.88 2002.7 127.033 0 0 2159.41 -464.568 0 0 0 0 0 -306.94 -215.537 1369.44 0 -1133.08 0 0 0 -572.909 0 -1445.43 0 0 0 0 0 
0 0 0 1109.73 -369.045 0 -79.7296 2015.67 0 0 0 0 0 0 0 0 0 1940.14 0 0 0 -519.654 0 0 0 0.03 0 0 0 2203.05 794.626 0 0 0 -2202.14 0 0 0 0 0 0 2234.03 0 0 1756.72 0 1107.59 0 0 0 -2355.34 0 832.774 0 0 0 0 0 0 
0 455.87 0 2478.64 0 0 0 310.144 -449.614 0 0 0 0 1132.92 1715.37 0 0 0 0 0 0 908.002 0 -1087.91 0 0 0.02 1640.6 0 0 0 1861.25 0 0 0 0 0 877.331 2409.36 0 0 0 0 0 0 0 0 1509.06 0 0 0 0 0 0 0 0 0 0 0 
0 881.603 0 1392.33 0 781.655 0 0 0 -784.707 1120.11 0 0 0 0 0 2344.66 0 -1039.84 -2187.64 0 0 0 0 0 0 -2020.86 0.01 1128.35 0 -899.762 2086.63 0 0 0 0 0 0 0 622.196 0 0 0 0 798.135 0 0 0 0 0 -747.932 0 0 0 0 0 0 485.931 0 
0 0 208.06 0 0 0 0 0 0 0 0 0 0 0 2030.17 0 0 0 240.257 0 516.297 1063.34 0 0 0 0 0 1389.28 0.04 0 0 -1009.78 1985.92 0 0 0 2047.87 824.839 0 -2494.81 0 0 0 -131.611 0 0 0 -1374.17 0 0 435.881 409.177 0 0 0 0 0 -1641.36 0 
0 0 0 0 2186.73 0 0 0 -2360.07 499.817 0 2003.92 0 0 142.445 0 -2304.38 -669.195 1686.68 2413.63 0 0 -1118.73 2097.31 0 1964.09 0 0 0 0.07 0 0 0 -1220.51 -1089.28 -1136.89 0 0 0 0 0 0 -838.267 -1683.78 688.116 -181.661 1139.94 78.9666 0 0 1694.77 1120.72 0 0 0 0 0 0 -153.279 
0 1995.38 2061.75 0 0 0 0 0 0 0 0 0 0 0 0 1923.05 -1926.71 0 -42.1918 0 -2337.79 1030.53 2418.82 0 -1795.94 215.995 0 1677.68 0 0 0.02 0 0.0762963 0 0 0 0 0 0 0 0 0 0 0 704.901 0 0 0 0 0 0 0 0 0 0 0 0 -1034.2 0 
-843.455 0 0 162.74 0 0 -438.475 0 0 0 0 -886.639 0 0 0 0 0 2288.2 2495.88 0 -2204.89 0 1279.26 0 1764.5 0 -1352.66 227.439 1577.43 0 0 0.07 0 0 0 0 0 0 2230.67 0 0 1012.53 0 0 1406.67 1438.41 0 -1753.36 0 0 0 1204.95 0 0 0 0 0 0 -1334.5 
-1995.07 0 0 931.043 0 0 0 0 1161.92 1683.94 0 1003.37 0 0 0 0 0 -138.325 0 0 0 0 0 462.737 -530.793 0 0 0 894.116 0 -1257.59 0 0.06 0 0 -812.937 966.445 0 -957.9 0 0 947.523 0 0 0 0 739.082 0 0 0 -538.118 0 0 0 -2306.67 0 0 0 0 
-813.852 0 0 0 0 582.98 0 0 1519.9 0 0 1964.4 0 0 0 473.724 1204.34 0 0 -1327.78 0 -1941.21 1977.07 0 -1756.42 0 0 0 0 843.608 0 0 0 0.04 0 0 0 0 0 0 -1223.11 0 0 0 0 0 0 0 0 0 0 1466.8 0 0 0 0 0 0 0 
-1742.84 0 0 0 0 1280.48 -244.53 0 0 -1628.54 0 0 0 0 -2457.88 0 0 0 0 0 0 -1820.96 -181.509 2018.27 0 -948.744 0 0 0 1484.04 0 0 0 0 0.02 0 0 977.126 1608.86 0 0 0 0 1963.79 0 0 15.6407 0 1697.21 0 0 0 0 0 0 0 -890.454 0 0 
1492.13 -72.5578 0 0 699.866 0 0 0 2137.9 0 0 0 0 0 0 0 0 0 0 0 0 0 0 0 0 0 0 0 0 -62.9444 0 0 1395.84 0 0 0.08 0 0 0 0 2141.1 374.233 0 0 1275.6 -1557.89 -1368.53 0 0 1395.54 -713.752 0 0 -239.494 0 0 0 0 0 
-1574.37 0 0 798.135 0 0 2085.25 0 0 0 0 1274.53 0 0 0 -1248.44 0 -1921.67 0 0 0 776.009 0 0 543.153 0 0 0 506.836 0 0 0 1196.86 0 0 0 0.07 1273.92 0 2118.98 0 0 0 0 -156.484 0 0 0 0 0 0 -764.565 0 0 0 0 0 0 0 
0 -504.7 0 0 0 0 0 0 2470.85 0 0 0 0 0 0 0 0 0 0 0 0 0 0 -1089.74 -472.503 0 1347.93 0 2201.07 0 0 0 0 0 180.593 0 1985.61 0.02 1579.26 -1440.09 0 0 1811.04 1367.76 0 0 -1583.53 0 0 0 -634.404 0 0 -475.707 0 0 0 0 -1375.85 
0 0 0 0 0 0 0 0 -918.683 -2375.79 398.038 0 0 2459.72 0 -2487.49 0 2111.19 2248.07 0 0 464.721 0 0 0 0 1902.75 0 0 0 0 -1699.96 53.6363 0 1134.3 0 0 2414.24 0.04 0 1970.96 0 0 0 -1545.84 144.734 0 0 0 0 1769.84 0 0 0 -499.817 2007.58 0 0 0 
0 0 2437.59 0 0 1009.32 -1713.08 0 232.322 -137.715 0 2190.24 0 -1677.07 0 2362.06 -944.014 0 0 0 0 836.894 0 -2289.27 0 0 0 -1342.89 1090.04 0 0 0 0 0 0 0 1242.48 -672.399 0 0.07 1350.37 0 0 0 2118.21 0 0 0 0 0 0 0 -515.687 0 0 0 0 0 0 
2022.69 0 0 0 0 0 0 556.429 0 0 0 0 0 2091.66 0 0 1887.95 1804.18 -195.853 0 0 266.655 0 0 0 0 0 0 0 0 0 0 0 -189.901 0 567.263 0 0 -2192.37 2020.4 0.08 2311.09 0 0 0 0 -2341 0 0 -1351.89 -383.541 712.989 -2461.7 0 0 0 0 0 0 
1523.26 0 0 2209.62 0 1177.18 0 1884.59 0 0 0 0 0 638.371 0 0 0 0 1881.08 0 0 0 1542.02 0 0 268.181 0 0 0 0 0 -833.384 2347.1 0 0 -1958.45 0 0 0 0 32.8837 0.05 0 0 0 0 -1152.15 0 0 0 -547.578 -2194.97 0 0 0 0 0 0 0 
0 0 0 0 1717.35 0 0 -2048.02 0 0 -514.618 0 0 0 0 0 0 0 0 0 0 0 0 0 0 0 0 0 0 1999.95 0 0 0 0 0 0 0 391.171 0 0 0 0 0 -2319.79 0 1822.49 0 0 0 1305.66 1701.94 0 0 0 927.076 0 0 0 0 
0 0 0 0 0 661.26 0 -625.401 75.457 0 0 249.26 0 0 0 1859.42 0 574.587 2034.59 0 0 0 -1742.84 0 978.195 0 0 0 2087.39 -362.941 0 0 0 0 -326.167 0 0 -758.309 0 0 0 0 625.706 0.07 0 -133.137 0 -499.817 0 -421.079 -2498.32 0 0 0 0 0 0 0 0 
0 0 0 -2135.46 0 0 0 0 0 0 0 0 -2322.99 0 -726.875 -969.802 0 279.778 0 0 0 0 709.937 0 -1583.22 1074.94 0 501.801 0 2346.03 1046.1 2203.51 0 0 0 2470.09 2190.54 0 1459.93 862.224 0 0 0 0 0.02 0 0 0 0 -1070.21 2126.15 0 0 -1278.04 0 1016.95 795.999 0 857.341 
0 351.65 0 -2104.33 0 0 0 884.35 0 0 1744.51 0 0 0 0 0 0 1947.61 2305.14 0 0 2227.47 0 0 -1873.61 0 0 0 0 -1932.97 0 2027.57 0 0 0 2350.92 0 0 336.085 0 0 0 -2483.98 760.14 0 0.04 1218.99 0 0 0 720.923 0 614.261 297.479 0 0 0 0 0 
0 773.11 0 0 0 0 0 0 -1247.22 0 0 0 0 -1411.25 0 0 -2002.55 0 0 484.558 2178.33 0 -1147.88 2151.02 0 1679.66 0 0 0 -2282.56 0 0 -1706.67 0 775.399 2273.25 0 2287.13 0 0 1664.25 657.292 0 0 0 -51.3474 0.08 0 -2191.46 0 0 1796.85 0 0 0 0 0 0 0 
0 -2099.75 0 1163.75 0 0 0 0 0 0 -1775.95 0 0 0 0 1855.75 2412.11 2463.99 -950.423 1162.07 0 0 0 0 1308.25 0 -1795.94 0 -1885.51 -762.734 0 64.3178 0 0 0 0 0 0 0 0 0 0 0 723.365 0 0 0 0.03 375.759 0 0 0 1922.13 0 0 0 0 0 0 
161.672 0 0 -400.021 -131.764 0 656.987 0 1750.31 0 0 0 0 1923.35 0 0 -1053.58 1832.26 -2441.25 0 1822.03 0 0 0 0 0 0 0 0 0 0 0 0 0 704.901 0 0 0 0 0 0 0 0 0 0 0 -861.156 -458.617 0.03 0 334.101 0 0 0 0 0 0 0 656.987 
0 0 0 0 0 0 0 0 -2148.12 0 0 142.903 0 0 0 0 2450.71 0 0 0 0 0 -25.2541 0 0 0 0 0 0 0 0 0 0 0 0 741.676 0 0 0 0 -692.236 0 1687.44 1693.7 927.229 0 0 0 0 0 0 1333.58 0 0 0 0 -1533.48 0 0 
0 0 0 0 0 -1142.84 1235.01 -1090.96 0 0 0 0 0 0 0 0 0 2154.23 0 0 0 0 0 1753.82 0 -1237.75 0 -754.189 1358.15 1755.2 0 0 2371.36 0 0 2453.61 0 -1608.55 -658.361 0 -1624.73 -699.713 2176.96 -575.655 1181.91 -2209.16 0 0 -591.372 0 0.08 1874.37 0 1324.12 0 0 0 0 0 
-460.753 0 2493.74 1531.8 0 0 0 0 0 0 826.365 -413.602 4.95926 0 0 0 2283.78 2318.41 0 2104.33 715.888 0 0 0 -2437.28 0 0 0 -1434.14 638.981 0 -496.155 0 -1520.81 0 0 -37.7667 0 0 0 -474.792 2103.11 0 0 0 0 -1624.58 0 0 -1763.89 -103.992 0.09 0 0 0 0 -132.984 0 0 
1803.42 0 0 0 0 788.522 0 0 0 175.1 0 0 0 0 0 0 1078.6 0 0 0 0 0 0 0 0 1490.91 0 0 0 0 0 0 0 0 0 0 0 0 0 1597.26 61.4185 0 0 0 0 2149.04 0 508.209 0 0 0 0 0.02 0 0 0 0 0 0 
-1357.08 -533.692 0 0 0 0 0 2041.92 1693.85 0 -595.035 0 0 0 0 0 0 0 0 0 0 -1025.8 0 0 862.682 0 0 0 0 0 0 0 0 0 0 2451.48 0 253.38 0 0 0 0 0 0 -1016.34 -1397.06 0 0 0 0 622.044 0 0 0.01 0 0 0 0 0 
0 -632.725 0 0 0 0 0 0 -1439.94 2185.51 0 2075.95 59.2822 0 0 0 0 0 0 0 0 0 0 0 0 0 0 0 0 0 0 0 -512.94 0 0 0 0 0 2315.21 0 0 0 -1927.02 0 0 0 0 0 0 0 0 0 0 0 0.03 0 0 0 0 
0 0 0 0 1237.14 0 0 0 0 0 0 0 0 0 0 0 0 2395.32 0 0 1621.22 0 0 716.803 0 0 0 0 0 0 0 0 0 0 0 0 0 0 -1484.04 0 0 0 0 0 -1108.81 0 0 0 0 0 0 0 0 0 0 0.01 -2459.72 0 0 
0 0 0 0 0 0 0 0 0 0 0 0 0 0 0 0 0 533.845 0 0 0 0 0 0 0 0 0 0 0 0 0 0 0 0 -503.174 0 0 0 0 0 0 0 0 0 -1690.04 0 0 0 0 1203.57 0 231.712 0 0 0 1105.91 0.01 0 0 
0 0 0 0 0 0 0 0 0 0 0 0 0 0 525.758 0 0 -1643.8 0 0 0 0 -135.273 0 0 0 0 1582.46 2269.43 0 118.946 0 0 0 0 0 0 0 0 0 0 0 0 0 0 0 0 0 0 0 0 0 0 0 0 0 0 0.08 0 
0 0 0 0 0 0 0 0 0 210.196 0 0 -100.33 0 0 0 0 1333.89 0 0 0 0 0 0 0 0 0 0 0 -630.436 0 -36.6985 0 0 0 0 0 1048.69 0 0 0 0 0 0 -1231.19 0 0 0 1614.96 0 0 0 0 0 0 0 0 0 0.04 
