*Vertices 58
*Matrix 
0.02 -1790.29 0 0 0 0 0 0 0 0 0 0 0 2387.39 0 0 0 0 0 0 -52.1104 0 0 0 0 0 2403.56 0 0 0 351.65 0 0 664.464 0 0 810.8 0 0 0 0 0 0 0 0 0 0 0 0 0 -590.457 1467.71 0 -1152.46 1459.78 0 0 0 
773.568 0.06 0 0 0 0 0 2354.58 240.104 0 0 0 2230.06 2351.53 0 0 0 0 0 -755.257 0 0 0 0 266.198 0 0 0 372.25 -2344.81 0 0 0 0 0 0 0 0 0 436.491 0 1971.11 0 0 0 0 0 0 0 0 0 0 0 -766.549 0 0 0 0 
0 0 0.06 0 0 0 0 2459.11 0 0 0 0 0 -576.418 0 0 1088.67 0 -1795.94 0 0 0 0 0 0 0 0 1769.23 0 610.446 0 1664.25 0 0 0 296.411 0 0 0 -1896.34 0 -861.309 0 0 0 0 0 -1741.77 0 0 0 0 0 0 0 0 0 0 
0 0 0 0.06 1361.81 0 0 0 0 0 0 0 0 0 -1949.9 0 0 0 0 0 0 0 0 0 0 0 0 595.035 0 2057.94 0 0 0 0 0 337.001 0 0 0 0 1401.03 0 0 0 0 0 0 0 0 0 0 0 0 0 2248.68 0 0 0 
0 0 0 100.177 0.08 0 0 0 0 0 0 0 0 0 0 0 0 0 2120.96 0 0 0 0 0 0 0 0 0 0 0 -855.358 0 0 0 0 0 1942.88 0 0 0 0 -2298.27 0 0 -922.651 0 387.814 0 0 0 0 0 0 0 0 0 0 0 
0 0 0 0 0 0.02 0 0 0 0 0 0 0 0 0 0 0 789.285 0 0 0 0 0 0 0 0 0 0 0 0 1435.06 0 0 0 -1811.2 0 0 -308.771 0 0 0 0 0 0 0 0 0 0 2399.14 0 0 0 0 0 0 0 0 0 
0 0 0 0 0 0 0.03 0 1775.34 0 0 0 -693.457 0 0 0 0 0 0 0 0 0 -776.467 186.239 -2226.55 0 0 0 0 0 0 0 0 0 0 0 634.556 0 0 0 847.728 0 0 1467.71 -2128.13 0 0 0 0 0 0 2380.52 0 0 0 0 0 0 
0 -1029.92 960.799 0 0 0 0 0.04 0 0 0 0 0 0 0 0 0 2404.17 0 1849.96 0 0 0 0 0 0 0 0 0 0 0 0 0 0 0 0 0 0 0 1250.11 0 0 0 0 0 1360.59 0 0 0 0 0 0 0 0 0 -290.46 0 0 
0 1604.43 0 0 0 0 2134.39 0 0.02 0 0 0 0 0 0 1544.01 0 0 0 0 0 0 1959.97 0 0 0 0 0 0 2296.75 0 0 0 0 0 0 0 841.319 0 0 0 0 0 0 0 0 0 0 0 0 0 0 0 0 0 0 0 0 
0 0 0 0 0 0 0 0 0 0.02 315.027 0 0 0 0 0 0 900.677 0 0 0 0 0 0 -60.8081 0 0 0 457.854 0 -130.238 0 0 0 0 0 0 0 -444.273 0 0 0 0 0 0 0 2216.18 0 0 0 0 0 0 0 0 -59.74 2423.25 0 
0 0 0 0 0 0 0 0 0 -590.762 0.07 0 0 0 0 0 0 0 0 0 0 0 0 0 0 0 0 573.824 0 0 0 0 0 0 0 0 0 2253.72 0 0 0 0 0 0 0 1848.28 0 -991.928 0 0 0 0 0 0 0 0 0 0 
0 0 0 0 0 0 0 0 0 0 0 0.04 0 0 0 0 0 0 0 0 0 0 0 0 0 0 0 0 0 0 0 0 0 0 0 0 0 0 0 0 2260.58 0 0 997.269 0 -493.561 -1037.86 0 0 0 0 0 0 1170 0 1394.16 0 0 
0 -2362.36 0 0 0 0 2209.16 0 0 0 0 0 0 0 0 502.411 0 0 0 0 0 0 0 0 0 0 0 0 0 0 0 0 0 0 0 0 0 0 0 0 0 0 0 0 -1746.65 0 0 2303.92 0 0 0 0 0 -565.127 0 0 0 0 
-690.71 -16.5563 2150.87 0 0 0 0 0 0 0 0 0 0 0.05 0 0 0 0 0 0 0 0 0 0 958.663 0 0 0 0 -1938.46 -215.995 0 0 0 0 0 -823.771 0 0 0 0 1222.8 618.534 0 0 0 0 0 0 0 0 -937.147 0 -1032.98 2376.4 0 0 0 
0 0 0 2378.23 0 0 0 0 0 0 0 0 0 0 0.07 0 0 0 485.626 0 0 2472.99 0 0 0 0 0 0 0 0 0 0 0 0 -1923.05 0 0 0 0 0 -30.137 -174.642 0 0 0 0 0 -343.562 0 0 0 0 0 0 0 0 0 0 
0 0 0 0 0 0 0 0 441.221 0 0 0 -748.695 0 0 0.06 0 0 0 0 0 0 0 1083.48 0 0 0 -1377.38 0 0 0 0 0 0 0 -1103.47 0 0 0 0 0 0 0 0 0 0 0 0 0 0 0 0 0 1645.79 0 0 0 0 
0 0 2017.2 0 0 0 0 0 0 0 0 0 0 0 0 0 0.08 0 -1106.07 753.426 0 0 0 0 0 0 0 0 0 1009.02 0 0 0 0 0 0 0 0 0 0 0 0 0 0 0 0 0 0 0 1775.8 0 0 0 -951.338 0 0 0 0 
0 0 0 0 0 1551.33 0 -1550.57 0 -371.029 0 0 0 0 0 0 0 0.09 0 0 0 0 0 0 0 0 -1315.88 0 0 -832.316 0 0 0 0 0 0 0 0 0 0 2245.93 0 0 11.3681 0 0 0 0 0 0 1542.33 0 1233.48 1665.78 0 0 326.624 0 
0 0 -1181.91 0 1184.19 0 0 0 0 0 0 0 0 0 1069.14 0 2007.89 0 0 0 0 0 0 0 0 0 1764.05 0 0 0 0 0 0 0 0 0 0 0 0 0 0 0 0 0 0 0 1994.31 0 0 0 589.999 0 0 0 0 0 0 0 
0 1642.74 0 0 0 0 0 -1846.45 0 0 0 0 0 0 0 0 85.8333 0 0 0.01 0 0 0 0 1459.47 0 0 0 1483.73 1668.68 0 0 0 0 0 0 0 0 0 0 0 0 0 0 0 0 1591.01 0 0 0 0 0 213.401 0 0 0 0 0 
-1427.12 0 0 0 0 0 0 0 0 0 0 0 0 0 0 0 0 0 0 0 0.04 -2404.78 0 0 0 2271.26 0 0 0 0 0 1537.75 0 0 0 0 0 0 0 0 0 0 0 2484.28 0 0 0 0 0 0 0 1912.37 0 0 0 0 0 0 
0 0 0 0 0 0 0 0 0 0 0 0 0 0 898.236 0 0 0 0 0 2302.24 0.02 0 0 0 0 0 0 0 0 0 0 0 0 0 0 0 0 -101.093 0 0 0 0 0 0 0 0 -1295.43 745.338 0 0 0 0 -359.584 0 -47.0748 0 0 
0 0 0 0 0 0 642.796 0 -387.814 0 0 0 0 0 0 0 0 0 0 0 0 0 0.07 0 0 521.485 0 0 0 0 0 0 0 0 -1435.51 0 0 0 0 1463.13 689.184 0 0 0 0 -282.83 0 0 0 0 0 0 0 0 0 746.101 0 0 
0 0 0 0 0 0 2059.77 0 0 0 0 0 0 0 0 2199.09 0 0 0 0 0 0 0 0.08 0 0 0 0 0 0 0 0 0 0 0 0 0 0 0 998.489 0 0 0 0 0 0 0 0 -664.769 0 0 1441.47 -1083.33 0 0 0 0 0 
0 1686.07 0 0 0 0 146.26 0 0 865.276 0 0 0 2473.3 0 0 0 0 0 73.6259 0 0 0 0 0 0 0 0 0 0 0 0 0 0 1021.99 0 0 0 0 0 0 0 0 2183.37 0 0 0 0 0 0 0 0 0 0 1903.36 0 0 0 
0 0 0 0 0 0 0 0 0 0 0 0 0 0 0 0 0 0 0 0 -702.765 0 1644.87 0 0 0.06 1242.64 0 0 -2228.84 0 0 0 0 0 0 0 0 0 1174.58 -513.092 -171.743 0 0 0 0 0 1582.16 0 0 0 0 0 0 0 0 0 0 
-365.993 0 0 0 0 0 0 0 0 0 0 0 0 0 0 0 0 -64.4704 1122.85 0 0 0 0 0 0 -488.983 0.06 0 0 0 0 0 0 -2273.09 0 0 2443.69 0 0 744.118 0 0 0 0 257.653 0 0 0 0 0 0 0 0 0 0 0 0 0 
0 0 2233.88 1975.69 0 0 0 0 0 0 1217.92 0 0 0 0 -2021.47 0 0 0 0 0 0 0 0 0 0 0 0 0 0 1014.51 0 0 0 0 0 0 0 0 0 0 0 0 -658.818 0 0 0 0 0 -577.181 0 0 0 0 0 0 0 0 
0 1559.72 0 0 0 0 0 0 0 1075.4 0 0 0 0 0 0 0 0 0 -1268.73 0 0 0 0 0 0 0 0 0.07 0 0 -1316.64 0 0 0 0 0 0 0 0 316.858 2091.51 0 1940.6 0 0 0 0 0 892.743 0 0 0 0 0 0 0 0 
0 -107.044 -250.328 2211.6 0 0 0 0 2215.41 0 0 0 0 -611.209 0 0 1042.44 -546.052 0 -524.842 0 0 0 0 0 -1960.89 0 0 0 0.07 0 0 0 0 0 1158.71 0 1118.12 0 0 0 0 0 0 0 722.755 0 0 0 0 -1458.4 0 0 0 0 0 0 0 
-1150.78 0 0 0 2361.9 900.525 0 0 0 2192.53 0 0 0 1668.22 0 0 0 0 0 0 0 0 0 0 0 0 0 2206.87 0 0 0.04 0 0 0 0 0 482.879 0 0 0 0 0 0 0 0 0 0 0 0 0 0 0 0 0 0 0 0 0 
0 0 -676.061 0 0 0 0 0 0 0 0 0 0 0 0 0 0 0 0 0 1831.03 0 0 0 0 0 0 0 2225.18 0 0 0.06 0 0 1803.26 0 0 0 0 0 0 0 0 0 126.728 0 0 0 0 0 0 0 0 0 0 0 0 0 
0 0 0 0 0 0 0 0 0 0 0 0 0 0 0 0 0 0 0 0 0 0 0 0 0 0 0 0 0 0 0 0 0.04 944.472 0 0 0 0 0 0 0 0 0 0 0 0 0 0 0 0 0 0 0 0 0 0 0 0 
1420.71 0 0 0 0 0 0 0 0 0 0 0 0 0 0 0 0 0 0 0 0 0 0 0 0 0 66.4541 0 0 0 0 0 454.344 0 0 0 1495.64 0 0 0 0 0 0 0 0 0 0 0 0 0 0 0 0 0 0 0 0 0 
0 0 0 0 0 2232.96 0 0 0 0 0 0 0 0 -52.5681 0 0 0 0 0 0 0 -2183.83 0 1654.94 0 0 0 0 0 0 -2420.5 0 0 0.08 0 0 0 -2165.06 0 0 691.473 0 0 0 0 0 1612.98 0 0 0 0 0 0 0 0 0 0 
0 0 834.147 785.928 0 0 0 0 0 0 0 0 0 0 0 2121.88 0 0 0 0 0 0 0 0 0 0 0 0 0 104.144 0 0 0 0 0 0 0 0 0 0 0 0 0 0 -2308.34 0 0 0 0 0 980.483 0 0 0 0 0 0 -651.952 
1962.42 0 0 0 -147.328 0 1098.74 0 0 0 0 0 0 -331.66 0 0 0 0 0 0 0 0 0 0 0 0 -556.886 0 0 0 1721.32 0 0 -70.8792 0 0 0.07 0 405.972 0 -741.981 0 0 0 -2423.7 0 0 0 0 0 0 0 0 -892.132 0 0 0 0 
0 0 0 0 0 1649.45 0 0 525.147 0 -1930.98 0 0 0 0 0 0 0 0 0 0 0 0 0 0 0 0 0 0 471.587 0 0 0 0 0 0 0 0.06 0 0 0 0 0 0 0 0 0 0 0 0 0 0 0 0 0 668.737 0 0 
0 0 0 0 0 0 0 0 0 -1243.86 0 0 0 0 0 0 0 0 0 0 0 1507.54 0 0 0 0 0 0 0 0 0 0 0 0 2259.97 0 66.9118 0 0.08 0 0 0 0 0 0 0 0 0 0 0 0 0 0 0 0 0 0 0 
0 -985.214 -222.098 0 0 0 0 1398.13 0 0 0 0 0 0 0 0 0 0 0 0 0 0 1524.32 399.106 0 -554.903 -1051.29 0 0 0 0 0 0 0 0 0 0 0 0 0.05 0 0 0 0 0 0 0 0 0 0 0 0 0 0 0 0 0 0 
0 0 0 1109.58 0 0 545.9 0 0 0 0 944.472 0 0 633.488 0 0 957.137 0 0 0 0 -2306.82 0 0 1803.57 0 0 1260.95 0 0 0 0 0 0 0 -122.303 0 0 0 0.03 0 0 0 0 0 0 0 0 0 0 0 0 0 2493.74 0 0 0 
0 -393.155 -1150.32 0 -1014.21 0 0 0 0 0 0 0 0 1712.32 -650.121 0 0 0 0 0 0 0 0 0 0 1514.86 0 0 -1204.95 0 0 0 0 0 1950.97 0 0 0 0 0 0 0.04 0 -864.971 0 0 0 0 1509.06 0 0 900.067 0 2152.85 0 0 0 0 
0 0 0 0 0 0 0 0 0 0 0 0 0 1986.22 0 0 0 0 0 0 0 0 0 0 0 0 0 0 0 0 0 0 0 0 0 0 0 0 0 0 0 0 0.07 0 0 0 -600.833 0 0 448.698 0 0 0 0 0 0 0 0 
0 0 0 0 0 0 1462.98 0 0 0 0 2468.11 0 0 0 0 0 -2471.77 0 0 1837.44 0 0 0 32.8837 0 0 -1190.45 -614.566 0 0 0 0 0 0 0 0 0 0 0 0 1696.3 0 0.03 -2218.16 0 0 0 0 0 0 2067.55 0 0 0 0 0 0 
0 0 0 0 899.457 0 2373.35 0 0 0 0 0 137.257 0 0 0 0 0 0 0 0 0 0 0 0 0 -615.635 0 0 0 0 -2098.99 0 0 0 2208.4 -2393.19 0 0 0 0 0 0 2033.98 0.06 0 0 0 0 0 0 0 0 -933.638 0 0 0 0 
0 0 0 0 0 0 0 1354.64 0 0 1113.39 -936.384 0 0 0 0 0 0 0 0 0 0 2096.09 0 0 0 0 0 0 -234.916 0 0 0 0 0 0 0 0 0 0 0 0 0 0 0 0.01 0 0 0 0 0 0 0 984.756 2087.08 0 -1871.32 0 
0 0 0 0 1057.7 0 0 0 0 2340.85 0 37.1563 0 0 0 0 0 0 1158.71 -1822.03 0 0 0 0 0 0 0 0 0 0 0 0 0 0 0 0 0 0 0 0 0 0 -1303.37 0 0 0 0.01 0 0 0 0 0 0 0 0 0 0 0 
0 0 2339.78 0 0 0 0 0 0 0 591.678 0 -248.955 0 2367.7 0 0 0 0 0 0 -1566.74 0 0 0 -22.3548 0 0 0 0 0 0 0 0 2085.1 0 0 0 0 0 0 0 0 0 0 0 0 0 0 0 0 0 0 0 1417.2 0 0 0 
0 0 0 0 0 1721.78 0 0 0 0 0 0 0 0 0 0 0 0 0 0 0 337.764 0 -1342.59 0 0 0 0 0 0 0 0 0 0 0 0 0 0 0 0 0 959.273 0 0 0 0 0 0 0.03 0 0 770.669 0 0 0 0 0 0 
0 0 0 0 0 0 0 0 0 0 0 0 0 0 0 0 2491.91 0 0 0 0 0 0 0 0 0 0 1057.24 2039.17 0 0 0 0 0 0 0 0 0 0 0 0 0 -1352.96 0 0 0 0 0 0 0.03 0 0 0 0 0 0 0 0 
-203.635 0 0 0 0 0 0 0 0 0 0 0 0 0 0 0 0 2234.79 -1310.85 0 0 0 0 0 0 0 0 0 0 -475.402 0 0 0 0 0 822.398 0 0 0 0 0 0 0 0 0 0 0 0 0 0 0.05 1849.8 0 0 0 0 0 0 
1103.78 0 0 0 0 0 44.3281 0 0 0 0 0 0 1759.32 0 0 0 0 0 0 -759.682 0 0 710.395 0 0 0 0 0 0 0 0 0 0 0 0 0 0 0 0 0 1131.4 0 -82.1711 0 0 0 0 -589.694 0 462.584 0.05 0 0 0 0 0 0 
0 0 0 0 0 0 0 0 0 0 0 0 0 0 0 0 0 -1550.11 0 1715.83 0 0 0 1104.85 0 0 0 0 0 0 0 0 0 0 0 0 0 0 0 0 0 0 0 0 0 0 0 0 0 0 0 0 0.06 0 0 0 0 0 
1335.26 -764.26 0 0 0 0 0 0 0 0 0 1013.75 1065.32 662.786 0 231.712 -613.804 723.823 0 0 0 -2017.81 0 0 0 0 0 0 0 0 0 0 0 0 0 0 -1045.49 0 0 0 0 326.167 0 0 1617.71 -143.971 0 0 0 0 0 0 0 0.03 0 0 0 0 
153.432 0 0 -1494.42 0 0 0 0 0 0 0 0 0 786.691 0 0 0 0 0 0 0 0 0 0 1211.81 0 0 0 0 0 0 0 0 0 0 0 0 0 0 0 1143.3 0 0 0 0 1958.6 0 1601.54 0 0 0 0 0 0 0.09 0 0 0 
0 0 0 0 0 0 0 1847.21 0 -1418.73 0 -1155.2 0 0 0 0 0 0 0 0 0 232.78 842.082 0 0 0 0 0 0 0 0 0 0 0 0 0 0 421.384 0 0 0 0 0 0 0 0 0 0 0 0 0 0 0 0 0 0.09 0 0 
0 0 0 0 0 0 0 0 0 -1043.81 0 0 0 0 0 0 0 911.817 0 0 0 0 0 0 0 0 0 0 0 0 0 0 0 0 0 0 0 0 0 0 0 0 0 0 0 478.454 0 0 0 0 0 0 0 0 0 0 0.03 0 
0 0 0 0 0 0 0 0 0 0 0 0 0 0 0 0 0 0 0 0 0 0 0 0 0 0 0 0 0 0 0 0 0 0 0 2092.73 0 0 0 0 0 0 0 0 0 0 0 0 0 0 0 0 0 0 0 0 0 0 
