*Vertices 53
*Matrix 
0.08 -1749.09 0 -2333.06 0 -1442.99 -68.7429 0 0 0 1451.08 1033.28 2329.25 2131.03 0 -101.703 0 0 -11.6733 -81.4081 0 0 0 0 0 529.572 0 0 1630.38 0 0 0 0 0 -1151.84 0 0 0 0 0 0 0 0 0 0 0 0 0 0 0 0 0 0 
-2063.43 0.08 0 1717.96 1810.43 0 2171.77 0 0 499.359 0 0 0 -2044.66 0 0 0 0 1282.31 -624.943 0 0 133.747 0 2318.72 -378.353 0 0 0 1968.83 0 0 -157.094 0 0 0 0 0 0 0 861.614 0 0 0 1653.42 0 0 0 0 0 0 0 0 
0 0 0 622.501 0 2217.86 0 0 0 0 0 0 0 0 1032.82 0 0 0 0 0 0 0 -54.5518 0 0 0 0 0 -1773.96 -1549.2 0 0 0 0 0 2136.37 0 0 0 2357.02 0 0 0 0 0 0 0 0 0 0 0 0 0 
1852.4 210.501 975.753 0.04 1541.41 0 0 0 0 0 0 0 0 0 0 -489.746 0 0 0 0 0 0 459.075 0 0 1696.6 0 0 0 0 0 0 1415.22 1661.35 0 -2085.71 0 0 0 0 0 0 0 0 0 0 0 953.169 -1870.86 0 270.623 0 0 
0 -2136.37 0 2446.9 0.01 0 1551.03 0 1239.59 0 0 0 0 1359.83 0 0 0 -1612.06 0 2424.47 0 0 0 535.524 663.854 -610.446 -1093.4 461.058 0 0 0 0 0 0 -1777.17 1039.38 0 0 0 0 0 0 0 0 0 0 -440.611 0 0 0 0 0 0 
-273.37 0 -209.433 0 0 0 0 0 0 -2105.09 -2018.11 0 0 0 -397.427 0 0 0 0 0 0 0 721.839 0 0 0 1727.42 2298.58 1536.68 805.612 0 0 0 0 0 0 0 0 0 0 0 0 0 0 0 -1744.67 0 0 0 0 0 -556.124 0 
111.774 295.648 0 0 2271.11 0 0.02 -1437.35 2438.05 0 0 0 0 -63.097 1923.35 -1871.01 0 0 0 -106.128 0 0 1504.18 -625.706 0 -1071.89 0 0 -1322.6 0 -1621.22 1600.92 -418.332 0 0 0 0 -800.119 0 0 -1689.28 0 0 -20.6763 0 0 0 0 0 0 0 0 0 
0 0 0 0 0 0 -1636.94 0.07 0 0 0 0 644.169 0 2499.39 0 -2299.49 0 0 0 777.23 0 0 0 0 978.195 2077.78 0 0 -465.178 0 0 0 0 0 799.661 0 0 0 0 0 0 0 2320.4 0 -837.352 0 2221.06 1849.04 0 0 0 0 
0 0 0 0 -489.593 0 -168.844 0 0.09 0 0 0 0 0 0 -217.215 0 0 -1298.03 0 0 0 0 0 -30.137 0 0 0 -465.636 0 0 0 0 2366.18 0 2476.2 0 0 0 0 0 0 0 0 0 1536.53 0 0 1816.08 0 0 -1632.05 0 
0 -1.90741 0 0 0 968.581 0 0 0 0.01 0 300.226 0 0 0 0 0 0 1334.65 938.368 0 0 0 0 0 -857.799 0 0 946.455 0 0 0 0 0 774.636 -1619.24 1374.17 0 0 -1409.88 0 132.527 -712.073 0 0 0 0 0 0 0 -2259.67 0 0 
1092.79 0 0 0 0 -913.953 0 0 0 0 0.07 0 0 0 1305.51 0 0 0 0 0 1904.58 0 0 0 680.639 2449.95 785.47 0 0 0 0 1160.85 0 0 0 0 0 0 2027.42 0 0 0 0 0 0 -1611 0 0 0 -246.361 0 0 0 
175.1 0 0 0 0 0 0 0 0 -1247.06 0 0.08 0 0 -1427.58 0 -1523.26 0 0 0 2485.35 0 0 0 0 0 0 0 0 1271.32 0 0 0 0 -886.181 0 0 0 0 0 0 0 0 0 0 0 0 0 0 2437.59 0 1612.06 0 
-1570.25 0 0 0 0 0 0 436.644 0 0 0 0 0.07 -1522.8 0 0 -26.3222 0 0 0 0 0 2211.75 0 0 -1505.4 256.127 -597.476 1559.88 0 2236.32 -280.847 0 -327.387 0 0 0 0 0 0 0 0 0 0 0 0 0 0 0 -77.4407 0 0 0 
-1456.11 1901.38 0 0 -1090.66 0 1224.17 0 0 0 0 0 1479.31 0.02 370.876 1219.75 1662.88 0 0 0 0 0 0 0 2416.38 0 0 0 0 0 -1176.41 1666.08 0 2363.58 -604.343 0 0 0 0 449.309 0 2097.31 0 0 0 0 0 0 0 0 0 0 0 
0 0 1499.76 0 0 -76.5252 -1489.38 248.802 0 0 -2055.19 914.106 0 2089.07 0.08 0 0 0 0 0 0 2272.18 81.1029 843.15 -60.1978 0 0 0 0 1539.28 -1737.04 0 0 0 0 0 0 0 0 0 994.674 0 0 0 0 0 0 0 0 0 1262.17 0 0 
-1256.68 0 0 772.5 0 0 1918.93 0 731.91 0 0 0 0 1721.93 0 0.05 -29.8318 0 0 0 0 0 1512.12 -1825.69 -352.718 0 0 0 0 0 0 0 0 0 1078.75 -1729.87 0 -1047.17 0 0 0 0 0 0 0 0 0 0 0 0 0 0 0 
0 0 0 0 0 0 0 -1087.15 0 0 0 1128.5 2007.13 567.263 0 -992.233 0.08 0 0 0 -1515.17 0 1218.53 0 0 0 0 1824.02 0 -1040.3 0 0 0 0 2106.62 0 461.669 0 1100.73 0 0 0 0 0 0 -831.401 0 0 0 0 0 0 0 
0 0 0 0 -995.59 0 0 0 0 0 0 0 0 0 0 0 0 0.08 0 0 0 0 0 0 2303.61 0 0 0 0 2490.84 0 0 0 -283.746 0 0 1687.14 0 0 0 0 783.486 0 -1518.98 0 0 -1409.27 0 0 0 0 0 0 
217.521 191.885 0 0 0 0 0 0 -2498.93 2284.39 0 0 0 0 0 0 0 0 0.01 0 0 1331.14 175.863 0 0 0 0 -1554.69 -294.275 439.39 1969.28 0 0 1409.12 852.916 1820.35 0 0 0 0 -626.011 -1648.08 889.691 0 0 0 0 2165.82 0 0 0 0 0 
151.143 134.816 0 0 2180.32 0 632.42 0 0 1157.64 0 0 0 0 0 0 0 0 0 0.03 0 0 0 0 0 600.528 -65.2333 0 0 482.574 0 0 0 0 0 0 0 0 0 0 669.042 -8.77407 0 0 0 0 0 0 0 0 0 0 0 
0 0 0 0 0 0 0 782.876 0 0 -1402.86 -1705.3 0 0 0 0 -1145.74 0 0 0 0.03 0 0 0 0 1445.59 1568.88 -264.824 0 0 0 0 0 1791.97 0 0 0 0 0 0 0 0 0 0 0 0 0 0 0 0 0 0 -1294.52 
0 0 0 0 0 0 0 0 0 0 0 0 0 0 295.038 0 0 0 1207.85 0 0 0.07 0 -454.497 0 2275.69 445.799 0 -315.18 0 0 1294.67 0 0 2387.23 0 -1091.57 0 0 0 0 0 0 0 0 0 0 0 0 0 0 0 0 
0 2107.38 362.178 -1720.25 0 -1539.89 -134.663 0 0 0 0 0 577.334 0 1261.71 -566.5 -775.552 0 502.869 0 0 0 0 0 0 0 0 0 0 571.383 0 528.962 0 0 0 0 0 247.124 0 0 0 0 0 0 0 0 0 0 822.55 0 0 0 524.232 
0 0 0 0 1470.46 0 1594.52 0 0 0 0 0 0 0 -721.992 -76.3726 0 0 0 0 0 2047.41 0 0 0 0 0 -2345.42 0 0 0 0 0 2113.18 0 0 1339.99 965.529 0 0 0 0 -903.577 0 0 0 0 0 0 0 0 0 0 
0 215.537 0 0 340.052 0 0 0 987.35 0 1190.6 0 0 1781.59 -1866.13 -270.318 0 534.761 0 0 0 0 0 0 0.05 -377.895 2283.17 1519.75 0 0 0 0 0 0 -688.726 0 0 1125.75 0 0 0 707.953 0 0 -1093.4 0 0 2017.35 0 0 0 0 -828.959 
-1295.43 1215.32 0 1899.4 768.99 0 -1636.48 -1357.23 0 981.094 -727.943 0 529.725 0 0 0 0 0 0 764.718 413.907 139.698 0 0 1575.59 0.09 0 0 0 0 0 0 0 2272.94 1811.2 0 0 962.02 0 0 0 0 0 0 0 0 -1140.71 0 0 0 0 0 0 
0 0 0 0 1021.38 1762.22 0 60.9607 0 0 1026.57 0 1762.67 0 0 0 0 0 0 1804.33 2254.02 -1210.59 0 0 -938.673 0 0.03 938.215 0 0 0 -852.916 -593.966 0 1499.76 0 -807.596 0 -2327.11 0 0 0 0 0 1390.5 0 -2162.92 0 0 0 0 -2494.51 0 
0 0 0 0 -294.58 -1120.41 0 0 0 0 0 0 1879.1 0 0 0 1270.26 0 1234.55 0 1174.12 0 0 -520.417 -2029.25 0 2062.36 0.07 0 0 1780.98 0 855.663 1783.88 308.008 0 0 -550.478 0 0 0 0 0 0 0 0 0 0 0 0 0 0 0 
191.122 0 2371.21 0 0 777.688 -1736.12 0 224.54 -275.048 0 0 1186.48 0 0 0 0 0 -699.103 0 0 1580.63 0 0 0 0 0 0 0.02 1867.5 0 0 0 1311.76 0 0 0 -713.446 202.261 175.405 0 0 0 0 0 0 0 0 0 0 0 0 0 
0 2247.15 -2271.11 0 0 -957.747 0 1313.9 0 0 0 896.405 0 0 -2182 0 -1495.64 -2379.76 -1012.83 2419.74 0 0 -187.46 0 0 0 0 0 -653.63 0.02 0 0 0 0 0 0 2495.42 1464.96 0 0 -565.432 -1693.4 0 0 0 0 1216.7 0 1869.79 0 0 0 -789.438 
0 0 0 0 0 0 -1006.88 0 0 0 0 0 -327.082 1166.34 -383.236 0 0 0 1392.33 0 0 0 0 0 0 0 0 -2069.38 0 0 0.01 1983.63 0 444.578 0 0 0 0 -20.6763 0 -2126.61 0 0 0 0 2254.94 0 0 0 0 0 0 0 
0 0 0 0 0 0 -632.878 0 0 0 -438.169 0 646.458 1452.45 0 0 0 0 0 0 0 1615.88 -196.615 0 0 0 -631.962 0 0 0 -657.903 0.08 0 0 0 0 2167.04 0 1701.48 -2310.79 0 349.818 -824.229 0 1064.71 0 0 0 0 0 0 -134.358 0 
0 -6.02741 0 2106.31 0 0 1877.27 0 0 0 0 0 0 0 0 0 0 0 0 0 0 0 0 0 0 0 -600.986 518.281 0 0 0 0 0.07 0 2362.21 2203.51 -605.258 0 0 0 0 0 0 0 0 0 0 0 0 0 0 0 0 
0 0 0 2180.32 0 0 0 0 -1487.24 0 0 0 1533.94 1364.86 0 0 0 1114.92 -1496.25 0 -2343.59 0 0 2050.46 0 586.184 0 -1040.3 2166.89 0 574.587 0 0 0.04 -1167.87 0 0 0 0 0 -527.436 0 0 0 0 1285.21 0 0 -1984.85 0 0 0 0 
-2483.52 0 0 0 198.752 0 0 0 0 1656.62 0 483.795 0 1979.96 0 2443.85 -2253.87 0 1230.74 0 0 -486.541 0 0 -166.097 -1383.48 1437.65 -1553.77 0 0 0 0 518.891 -463.652 0.07 0 -69.9637 0 2447.81 1473.36 0 0 -125.355 0 0 0 0 0 0 0 0 0 0 
0 0 751.289 1334.35 -239.494 0 0 587.71 -1875.59 1929.91 0 0 0 0 0 1558.05 0 0 1996.29 0 0 0 0 0 0 0 0 0 0 0 0 0 1130.79 0 0 0.05 0 732.521 0 0 0 925.092 2347.1 -1498.99 0 0 0 -217.826 0 0 0 0 0 
0 0 0 0 0 0 0 0 0 1204.18 0 0 0 0 0 0 611.362 114.978 0 0 0 1817.61 0 1457.95 0 0 1491.52 0 0 239.341 0 -504.242 633.793 0 -1533.02 0 0 0 0 0 0 0 0 0 0 0 0 0 0 0 0 0 0 
0 0 0 0 0 0 1375.55 0 0 0 0 0 0 0 0 -1590.55 0 0 0 0 0 0 2224.72 2430.42 1057.08 -1172.29 0 1001.54 -2350.76 739.387 0 0 0 0 0 -1121.33 0 0.06 -1585.51 0 0 2255.24 0 0 0 0 -929.06 -68.5903 0 0 0 0 293.97 
0 0 0 0 0 0 0 0 0 0 -1420.26 0 0 0 0 0 1651.74 0 0 0 0 0 0 0 0 0 -1732.46 0 -1435.97 0 1655.1 2039.93 0 0 1378.29 0 0 -30.9 0.04 0 567.873 0 0 0 0 0 0 0 0 -1843.85 -461.974 0 2156.36 
0 0 723.67 0 0 0 0 0 0 -60.5029 0 0 0 226.524 0 0 0 0 0 0 0 0 0 0 0 0 0 0 -885.418 0 0 1811.5 0 0 2498.78 0 0 0 0 0.06 0 0 0 -253.99 0 0 0 0 0 0 0 2362.82 0 
0 1435.67 0 0 0 0 2370.75 0 0 0 0 0 0 0 -1168.63 0 0 0 1825.69 1390.8 0 0 0 0 0 0 0 0 0 1952.35 631.657 0 0 300.073 0 0 0 0 -2274.01 0 0.08 1720.71 0 0 0 0 0 0 0 0 -1278.34 -1935.56 0 
0 0 0 0 0 0 0 0 0 1808.15 0 0 0 2353.36 0 0 0 -571.383 2195.58 -510.956 0 0 0 0 645.085 0 0 0 0 -512.787 0 770.974 0 0 0 2493.29 0 -107.959 0 0 -1239.74 0.03 0 0 0 0 0 0 0 0 0 0 0 
0 0 0 0 0 0 0 0 0 894.726 0 0 0 0 0 0 0 0 758.614 0 0 0 0 2404.17 0 0 0 0 0 0 0 -1303.83 0 0 -1571.47 2202.75 0 0 0 0 0 0 0.09 0 0 0 0 0 0 0 2337.34 0 0 
0 0 0 0 0 0 106.128 2019.33 0 0 0 0 0 0 0 0 0 -1257.59 0 0 0 0 0 0 0 0 0 0 0 0 0 0 0 0 0 -1690.8 0 0 0 1977.22 0 0 0 0.01 0 0 0 0 0 0 0 0 0 
0 53.4837 0 0 0 0 0 0 0 0 0 0 0 0 0 0 0 0 0 0 0 0 0 0 906.018 0 2151.78 0 0 0 0 -370.571 0 0 0 0 0 0 0 0 0 0 0 0 0.02 0 0 0 -111.316 0 0 0 0 
0 0 0 0 0 899.457 0 -1003.37 1673.86 0 -1771.52 0 0 0 0 0 2308.34 0 0 0 0 0 0 0 0 0 0 0 0 0 585.116 0 0 -1372.04 0 0 0 0 0 0 0 0 0 0 0 0.08 0 134.51 0 -507.294 0 683.538 0 
0 0 0 0 48.9059 0 0 0 0 0 0 0 0 0 0 0 0 -520.569 0 0 0 0 0 0 0 525.605 2125.39 0 0 -2498.02 0 0 0 0 0 0 0 1464.96 0 0 0 0 0 0 0 0 0.09 0 0 0 0 0 0 
0 0 0 2177.72 0 0 0 -2126.45 0 0 0 0 0 0 0 0 0 0 1760.23 0 0 0 0 0 1696.3 0 0 0 0 0 0 0 0 0 0 2095.02 0 414.975 0 0 0 0 0 0 0 2379.15 0 0.08 0 0 0 0 0 
0 0 0 -97.7355 0 0 0 1606.11 2290.49 0 0 0 0 0 0 0 0 0 0 0 0 0 2044.97 0 0 0 0 0 0 1877.57 0 0 0 1070.97 0 0 0 0 0 0 0 0 0 0 777.688 0 0 0 0.05 0 0 0 0 
0 0 0 0 0 0 0 0 0 0 2433.01 -2104.18 2221.82 0 0 0 0 0 0 0 0 0 0 0 0 0 0 0 0 0 0 0 0 0 0 0 0 0 -1715.37 0 0 0 0 0 0 1082.87 0 0 0 0.01 -2010.94 0 0 
0 0 0 2001.17 0 0 0 0 0 -2407.38 0 0 0 0 -9.68963 0 0 0 0 0 0 0 0 0 0 0 0 0 0 0 0 0 0 0 0 0 0 0 1221.88 0 2400.05 0 1691.56 0 0 0 0 0 0 1621.83 0.09 0 0 
0 0 0 0 0 2378.08 0 0 -403.226 0 0 201.041 0 0 0 0 0 0 0 0 0 0 0 0 0 0 1596.19 0 0 0 0 -131.001 0 0 0 0 0 0 0 -299.615 1426.97 0 0 0 0 2025.44 0 0 0 0 0 0.05 0 
0 0 0 0 0 0 0 0 0 0 0 0 0 0 0 0 0 0 0 0 727.943 0 1482.82 0 -2403.87 0 0 0 0 1064.26 0 0 0 0 0 0 0 -1231.8 2326.96 0 0 0 0 0 0 0 0 0 0 0 0 0 0.06 
