*Vertices 62
*Matrix 
0.01 -936.537 0 0 0 0 0 0 0 0 0 -116.962 0 0 0 0 0 0 2279.81 0 0 0 0 0 62.9444 -262.383 0 -1196.55 0 0 0 1517.15 1808.45 0 566.195 0 0 0 0 0 1701.33 0 0 0 0 0 0 0 1790.6 0 0 0 0 0 0 -46.3118 0 0 0 0 1077.99 1934.19 
-921.735 0.09 -2348.78 0 0 684.912 768.227 0 0 0 934.095 0 2136.37 -2264.09 2298.88 0 -1707.59 317.927 0 0 0 0 0 0 0 904.797 0 1674.02 0 0 0 0 0 0 -14.2674 144.124 0 0 0 0 1288.42 1618.17 176.321 -1100.57 0 0 -2402.65 2348.32 0 -557.497 -1255.76 0 0 0 0 0 0 2261.5 2164.14 0 0 0 
0 -509.43 0.09 0 0 0 0 0 0 102.771 0 0 233.543 0 0 1773.66 0 0 0 0 0 0 -2283.93 0 0 0 0 0 0 0 0 1665.62 0 1179.62 0 647.221 0 0 0 -1257.74 0 0 0 0 0 0 0 0 0 783.181 0 0 0 0 0 -60.6555 0 0 0 0 0 0 
0 0 0 0.01 0 0 0 0 -1603.67 0 -2245.78 0 0 -1139.18 778.603 0 0 0 -936.384 0 0 0 -1895.73 0 0 2146.44 0 0 0 0 0 0 0 0 2413.94 0 2183.37 1104.08 2027.27 0 0 0 0 0 0 0 0 0 0 0 0 0 0 0 0 0 0 0 0 2451.93 257.5 0 
0 0 0 0 0.09 -104.755 0 1641.21 1163.14 -436.491 0 0 2232.2 -1729.26 0 0 0 2368.92 0 0 -778.756 0 0 0 -661.565 1576.82 0 2289.88 0 0 0 0 0 -37.9192 0 0 0 0 0 0 0 0 0 2369.69 0 -2431.33 0 0 0 0 -1460.54 0 1283.68 0 0 614.719 0 0 0 0 0 0 
0 -1597.57 0 0 2324.06 0.08 0 0 0 178.304 0 0 0 -892.895 0 0 0 0 -1100.88 0 1312.68 0 0 0 776.772 0 1618.63 2237.85 0 0 1220.97 1870.86 0 0 0 0 -1837.9 0 0 0 0 0 1166.49 -775.246 0 0 13.8096 0 0 0 0 0 -1098.28 0 0 -1981.19 -1703.92 0 -2462.31 0 0 1961.81 
0 -1806.01 0 0 0 0 0.02 0 1311.3 0 0 0 0 1577.12 0 0 1772.74 0 0 0 0 0 -181.204 0 0 0 -1805.4 1545.69 0 0 0 397.427 0 1455.81 0 1582.31 -1322.6 0 0 0 0 0 0 0 0 0 1103.47 0 -2077.17 0 -927.381 0 0 1918.47 314.875 -2131.18 0 0 0 0 0 0 
0 0 0 0 1636.17 0 0 0.03 -1421.63 0 0 0 0 1112.17 0 -318.995 -2266.84 0 0 0 0 136.494 0 0 0 0 0 0 0 0 1691.72 2474.67 0 0 1540.65 0 0 0 0 0 0 1635.11 816.294 -721.839 -1746.04 1831.03 -1600.16 0 0 2336.12 1263.85 0 -35.9355 0 0 0 -1306.12 0 0 0 0 0 
0 0 0 485.321 -44.1755 0 -48.9059 2202.9 0.07 0 0 114.368 0 0 1985.61 0 0 0 691.778 0 0 0 0 0 0 -758.766 0 0 0 0 2149.19 0 0 -109.943 0 0 0 0 1284.45 0 0 0 0 0 0 0 0 0 0 0 0 0 56.3829 0 2079.91 0 79.1192 0 0 1876.66 379.269 1646.4 
0 0 1051.29 0 2291.1 2145.53 0 0 0 0.01 0 0 0 0 0 -17.6244 0 -733.436 -1447.42 0 -11.5207 0 0 -1127.89 0 0 0 0 0 0 0 0 0 0 922.803 -1424.07 0 0 0 0 0 0 0 0 0 0 0 2337.79 0 -1209.07 0 1341.67 2383.11 0 803.018 0 0 -1195.64 -1891.46 2250.82 0 0 
0 -1665.01 0 1247.52 0 0 0 0 0 0 0.09 1391.42 0 1888.26 0 0 -1149.56 0 -405.057 0 -954.237 0 0 0 2417.29 2160.18 0 352.565 1579.71 0 0 0 0 0 -851.085 0 0 0 0 783.029 2232.96 0 0 -340.358 1256.07 0 -2020.86 0 0 1504.94 0 37.9192 0 0 0 0 2450.41 0 0 877.331 0 -1621.07 
819.956 0 0 0 0 0 0 0 -743.355 0 -974.532 0.04 -1206.17 0 0 0 0 0 0 0 580.538 0 0 0 1388.97 0 0 0 0 0 0 0 0 -1938.46 0 0 1203.12 0 0 2320.25 2275.08 2250.82 0 0 0 0 0 0 332.27 0 -1830.58 0 596.561 0 0 0 0 0 0 0 0 2021.77 
0 2302.24 -1596.5 0 1020.31 0 0 0 0 0 0 2091.51 0.04 0 0 0 0 1553.62 0 0 -1957.69 0 0 0 0 0 0 0 -186.087 0 857.952 0 0 0 -1596.04 420.011 0 0 -104.755 0 0 0 0 0 0 0 0 0 0 -1053.42 0 0 0 0 0 0 0 0 0 0 1981.64 507.294 
0 294.885 0 -2393.95 1881.08 1243.55 1984.69 2472.38 0 0 -1821.42 0 0 0.02 0 -1464.51 236.747 1807.99 428.861 0 0 0 0 0 0 0 0 -1098.44 0 2497.41 0 0 1662.72 0 0 0 0 0 0 -1251.64 0 0 0 0 2443.24 0 0 0 0 0 0 -2456.51 0 -1292.08 0 0 -256.89 0 1705.6 0 -141.987 -1359.83 
0 -662.175 0 2141.87 0 0 0 0 1355.86 0 0 0 0 0 0.07 0 0 0 0 0 0 1177.94 0 0 -1315.58 0 0 -834.3 0 0 1127.12 0 0 0 0 1821.27 0 1562.62 0 0 0 0 0 0 0 0 -1408.81 0 0 -712.531 1163.29 -2093.49 0 0 0 -1955.55 0 0 0 0 0 2371.52 
0 0 992.538 0 0 0 0 55.4674 0 1448.18 0 0 0 -672.704 0 0.08 674.993 0 -958.51 775.704 0 45.2437 0 0 0 0 -170.98 0 -685.675 1981.64 0 0 0 0 0 -243.004 0 0 0 0 0 0 -459.99 0 0 -15.9459 0 608.768 0 0 0 -2363.43 0 0 0 0 0 0 0 0 0 0 
0 -962.477 0 0 0 0 1238.52 1780.53 0 0 1732.61 0 0 1551.03 0 -834.758 0.06 0 0 0 0 0 2257.99 0 160.604 0 0 0 804.239 -1597.26 1791.21 0 0 0 0 0 0 0 0 0 0 0 0 0 0 0 0 0 893.811 0 -1901.99 0 0 2047.41 0 0 0 2413.17 0 0 0 0 
0 1858.35 0 0 -880.383 0 0 0 0 2309.87 0 0 -1296.2 1398.13 0 0 0 0.02 376.98 0 -844.218 0 -636.54 0 -2295.22 0 0 -1154.59 0 0 0 316.401 0 0 1065.48 0 0 -237.663 0 0 0 0 2180.78 -1363.64 4.95926 0 232.933 -980.483 0 0 0 349.361 0 0 0 0 0 0 0 0 0 0 
221.946 0 0 -192.648 0 -654.851 0 0 1623.81 43.26 1085.92 0 0 2163.38 0 673.315 0 -1619.39 0.01 0 0 0 0 0 0 -800.882 0 0 0 445.341 548.646 -1785.41 0 -1488.46 2178.64 0 0 0 0 0 0 0 0 0 0 0 0 1141.93 0 0 0 0 0 0 0 0 0 1884.29 0 -2395.93 2483.37 -434.202 
0 0 0 0 0 0 0 0 0 0 0 0 0 0 0 -662.023 0 0 0 0 0 0 0 -2157.58 0 0 0 0 547.273 0 0 0 658.208 0 0 0 1499.76 0 0 0 0 0 1540.65 0 0 0 0 2093.34 0 2368.31 2165.82 0 -958.968 -1114.92 0 0 0 0 -2231.44 -20.5237 0 0 
0 0 0 0 854.137 -1742.53 0 0 0 299.615 2386.78 2460.94 711.158 0 0 0 0 -664.006 0 0 0.02 0 0 0 0 632.42 0 -2277.06 0 0 0 0 -1195.03 0 0 1231.65 1768.62 0 -492.492 2055.19 0 0 -1164.51 201.956 0 -2283.78 0 367.977 0 762.734 1702.4 0 0 2347.1 0 0 0 0 0 0 0 0 
0 0 0 0 0 0 0 64.3178 0 0 0 0 0 0 -1983.17 844.523 0 0 0 0 0 0.08 0 -1182.21 0 0 0 0 0 0 -1567.05 1517.76 0 0 0 0 0 0 -1059.98 2151.17 2174.67 294.58 854.442 0 1289.64 0 0 0 0 0 0 0 0 0 0 0 0 -255.821 0 0 782.723 0 
0 0 2441.71 1400.57 0 0 2443.54 0 0 0 0 0 0 0 0 0 -829.722 -912.122 0 0 0 0 0.08 0 0 0 0 0 0 0 0 0 1894.36 0 0 0 0 0 0 0 0 0 0 0 0 0 0 0 0 0 0 0 -721.381 0 0 0 1574.37 0 0 0 -2354.88 1234.55 
0 0 0 0 0 0 0 0 0 -1567.35 0 0 0 0 0 0 0 0 0 1116.14 0 1232.72 0 0.06 624.79 384.457 -418.79 -1500.67 0 1334.65 0 490.661 0 0 0 0 1201.9 0 0 0 0 0 0 2333.06 0 402.921 1287.8 -1104.69 0 0 0 1878.64 0 0 0 0 0 1305.2 0 0 0 -1688.82 
-1338.77 0 0 0 -878.094 1114.92 0 0 0 0 -461.821 -328.608 0 0 2489.62 0 -559.786 1614.81 0 0 0 0 0 1395.99 0.04 0 146.718 0 0 0 0 1301.69 0 0 0 0 1508.76 -110.096 0 0 0 2359.46 0 -667.058 0 0 2092.43 0 0 0 0 -24.3385 1773.05 0 0 0 0 0 0 0 0 2237.24 
-1997.36 2309.72 0 1644.72 1107.29 0 0 0 2165.36 0 -555.818 0 0 0 0 0 0 0 -318.842 0 -533.998 0 0 -2081.59 0 0.02 0 0 1933.42 0 0 0 0 -606.479 0 1951.58 2374.42 0 0 0 0 0 1164.66 0 0 0 0 0 0 1409.27 -1991.71 0 0 0 0 0 256.279 0 0 0 0 0 
0 0 0 0 0 1201.59 -524.232 0 0 0 0 0 0 0 0 -442.442 0 0 0 0 0 0 0 1553.77 49.9741 0 0.08 -776.315 0 0 0 -2074.88 0 0 -693.152 1416.59 2257.23 -2141.71 -315.332 487.457 0 0 0 0 0 76.8303 0 0 0 0 1613.44 0 0 0 0 0 -30.9 2009.57 0 0 0 679.724 
1145.74 -167.776 0 0 1577.43 894.269 -854.9 0 0 0 -1984.08 0 0 -1406.83 2425.38 0 0 -6.94296 0 0 1715.06 0 0 1034.35 0 0 -1895.73 0.02 -916.852 0 2327.88 0 0 1684.7 985.214 -2032.3 0 0 0 0 0 0 0 2340.08 0 0 0 0 0 1855.45 0 0 0 690.863 0 0 0 219.81 0 0 0 0 
0 0 0 0 0 0 0 0 0 0 1054.8 0 1416.44 0 0 504.089 1976.15 0 0 2422.48 0 0 0 0 0 -821.787 0 -101.55 0.04 0 0 1562.93 0 0 0 0 0 2052.14 0 0 0 0 -639.897 -1490.45 -1856.52 0 0 0 0 1591.31 0 -2452.39 0 0 2087.24 0 0 0 655.156 0 0 674.535 
0 0 0 0 0 0 0 0 0 0 0 0 0 1072.5 0 403.531 1615.27 0 1020.31 0 0 0 0 -598.849 0 0 0 0 0 0.02 -224.387 0 0 0 2304.68 0 -1008.71 2090.75 338.832 0 588.473 0 1826 0 0 0 0 0 0 -520.112 0 0 0 0 0 281.762 1336.33 0 0 0 0 568.178 
0 0 0 0 0 -622.349 0 2108.14 177.236 0 0 0 -975.753 0 2138.2 0 -921.43 0 634.251 0 0 1387.3 0 0 0 0 0 -998.184 0 2431.49 0.03 -1481.75 0 -1430.78 0 0 288.781 0 0 0 0 0 0 -924.635 -903.577 0 0 1881.85 0 0 0 1113.7 1375.24 0 0 0 0 -2225.79 0 0 0 0 
-231.559 0 250.786 0 0 1968.06 1425.14 1341.82 0 0 0 0 0 0 0 0 0 -2347.87 1179.31 0 0 1843.55 0 1590.55 -842.845 0 499.817 0 561.007 0 -2219.53 0.01 0 0 0 1161.15 471.282 0 0 0 -303.125 0 -608.768 179.525 -229.728 0 -48.2955 1296.5 0 -883.435 0 0 -870.617 0 -840.556 1802.35 0 -2037.95 0 192.801 0 0 
-210.349 0 0 0 0 0 0 0 0 0 0 0 0 -1056.02 0 0 0 0 0 1424.68 2071.98 0 241.173 0 0 0 0 0 0 0 0 0 0.09 0 0 0 0 645.085 2298.27 0 0 0 0 1823.86 0 -720.161 1372.95 0 5.72222 -2439.27 0 0 0 -2470.24 0 0 0 1480.53 1432.77 0 0 0 
0 0 1573.92 0 -2059.01 0 577.944 0 -715.735 0 0 1864.15 0 0 0 0 0 0 -1783.43 0 0 0 0 0 0 1133.08 0 1291.47 0 0 2135.15 0 0 0.08 -1364.86 0 0 2069.54 1005.66 0 0 0 1245.84 0 -640.049 0 0 574.587 0 0 1235.77 -677.892 2078.23 0 1510.9 0 -78.6615 0 0 0 0 0 
1405.45 -1465.27 0 -372.707 0 0 0 -315.79 0 -1304.44 2233.27 0 -264.214 0 0 0 0 -1892.22 1689.89 0 0 0 0 0 0 0 2186.42 -1971.57 0 -1205.4 0 0 0 -246.055 0.05 449.461 2062.67 0 0 0 -117.267 383.236 -2077.17 0 18.0822 0 0 0 0 0 0 0 1624.27 -255.516 1926.4 387.204 0 0 -241.935 0 0 0 
0 1407.59 616.245 0 0 0 2235.4 0 0 32.2733 0 0 1974.01 0 -2085.56 490.967 0 0 0 0 2329.71 0 0 0 0 -2202.14 -72.5578 -722.449 0 0 0 -250.328 0 0 -528.352 0.05 0 0 0 -2306.67 0 0 -522.858 0 0 0 0 -826.67 0 0 2185.35 0 0 99.7192 0 0 0 0 0 0 0 0 
0 0 0 1412.32 0 -846.507 1366.39 0 0 0 0 1685.92 0 0 0 0 0 0 0 -1082.42 -210.807 0 0 -78.0511 -1747.41 129.627 -2095.93 0 0 794.473 128.559 1514.71 0 0 -960.494 0 0 0 803.018 -737.098 0 0 -1261.41 1077.38 0 0 0 0 -970.107 0 0 0 0 0 0 1279.87 0 1408.81 0 0 0 0 
0 0 0 1627.17 0 0 0 0 0 0 0 0 0 0 -778.603 0 0 -1283.53 0 0 0 0 0 0 2400.51 0 2330.01 0 -830.027 1607.94 0 0 2003.62 646.306 0 0 0 0 0 0 1260.03 0 0 0 1919.84 0 0 0 0 0 -869.396 0 0 0 0 0 1410.95 -2218.77 0 0 0 681.402 
0 0 0 -2264.55 0 0 0 0 1730.17 0 0 0 222.404 0 0 0 0 0 0 0 -756.172 1847.21 0 0 0 0 185.934 0 0 2251.88 0 0 979.263 2013.69 0 0 -1608.86 0 0.05 0 0 934.553 0 -1034.96 0 0 0 0 0 0 0 0 0 0 0 0 0 -1291.01 0 0 0 0 
0 0 -1047.32 0 0 0 0 0 0 0 2098.53 480.132 0 1187.55 0 0 0 0 0 0 -1542.33 2062.52 0 0 0 0 2142.17 0 0 0 0 0 0 0 0 1533.02 -2014.45 0 0 0.02 0 2478.18 0 0 0 -1527.22 0 0 0 1326.72 0 0 0 423.978 979.263 0 0 302.973 212.027 -818.43 0 0 
445.341 2440.18 0 0 0 0 0 0 0 0 -1311.15 1856.67 0 0 0 0 0 0 0 0 0 251.244 0 0 0 0 0 0 0 -1684.39 0 1311.61 0 0 -1808.91 0 0 -934.858 0 0 0.08 0 0 0 0 0 0 0 -371.944 0 1524.02 0 0 1929.3 0 0 0 1952.5 771.889 0 0 0 
0 44.9385 0 0 0 0 0 1059.68 0 0 0 2411.34 0 0 0 0 0 0 0 0 0 1000.02 0 0 1393.25 0 0 0 0 0 0 0 0 0 1452.45 0 0 0 1298.03 1321.22 0 0.07 0 0 0 0 0 0 0 0 -1401.64 0 -399.258 0 0 0 0 2243.95 0 1282.31 0 237.663 
0 -1848.89 0 0 0 1724.37 0 2140.95 0 0 0 0 0 0 0 871.838 0 447.478 0 -160.909 1052.51 -1509.52 0 0 0 -2414.09 0 0 2288.66 1167.87 0 -1748.63 0 1468.93 199.973 -654.088 -404.904 0 0 0 0 0 0.06 1623.81 0 0 0 0 0 0 -1452.45 0 0 0 508.667 0 0 0 0 0 -1109.12 0 
0 -2397.15 0 0 1383.48 919.294 0 1536.53 0 0 179.678 0 0 0 0 0 0 1430.63 0 0 754.646 0 0 -1583.53 822.855 0 0 2075.03 1280.33 0 2490.39 -1195.94 2275.08 0 0 0 311.06 0 1677.22 0 0 0 65.6911 0.07 -510.956 0 0 0 0 -950.728 0 0 -2018.88 0 0 0 1190.76 0 0 0 1150.47 0 
0 0 0 0 0 0 0 485.931 0 0 -416.196 0 0 1783.58 0 0 0 908.002 0 0 0 -990.097 0 0 0 0 0 0 -1689.89 0 -793.405 -985.824 0 -152.669 -1329.16 0 0 -1727.12 0 0 0 0 0 2398.37 0.08 0 0 0 0 0 0 0 -543.764 0 -221.183 1756.87 0 0 1672.19 0 0 0 
0 0 0 0 -1584.6 0 0 1469.39 0 0 0 0 0 0 0 1027.02 0 0 0 0 1375.09 0 0 1084.86 0 0 249.87 0 0 0 0 0 1918.62 0 0 0 0 0 0 873.974 0 0 0 0 0 0.01 0 1150.93 0 0 0 0 0 739.387 0 0 0 0 -648.9 0 0 0 
0 1661.05 0 0 0 -116.657 1511.35 -1791.06 0 0 900.067 0 0 0 271.844 0 0 867.26 0 0 0 0 0 2304.38 39.7504 0 0 0 0 0 0 2035.51 -789.895 0 0 0 0 0 0 0 0 0 0 0 0 0 0.02 0 -1963.33 -2355.8 2454.53 0 0 -26.017 0 0 0 0 0 0 1207.24 0 
0 439.695 0 0 0 0 0 0 0 569.704 0 0 0 0 0 -934.706 0 2242.58 1709.11 424.589 1569.49 0 0 -1056.93 0 0 0 0 0 0 -259.178 1742.68 0 614.414 0 -2466.58 0 0 0 0 0 0 0 0 0 121.54 0 0.08 972.396 0 0 0 0 0 -1229.97 0 0 0 0 0 0 0 
126.728 0 0 0 0 0 2306.36 0 0 0 0 609.073 0 0 0 0 -865.734 0 0 0 0 0 0 0 0 0 0 0 0 0 0 0 -1198.84 0 0 0 854.137 0 0 0 1416.59 0 0 0 0 0 872.448 -1422.85 0.05 0 -2280.72 1607.18 0 0 0 700.934 574.282 1755.65 0 0 750.221 0 
0 1857.28 60.1978 0 0 0 0 654.088 0 665.227 2026.66 0 523.011 0 472.655 0 0 0 0 -1443.14 2306.97 0 0 0 0 556.429 0 1709.27 2119.59 1737.19 0 126.27 1210.75 0 0 0 0 0 0 -1208.3 0 0 0 1843.24 0 0 2135.15 0 0 0.02 -41.2763 0 0 0 0 1586.43 0 0 0 0 0 1042.59 
0 1059.83 0 0 827.128 0 2457.27 -933.638 0 0 0 714.362 0 0 -922.651 0 2118.06 0 0 1640.75 -1834.85 0 0 0 0 -1339.53 1322.44 0 0 0 0 0 0 1114.76 0 199.515 0 -1506.93 0 0 315.027 350.429 1143.91 0 0 0 134.968 0 2377.16 2066.64 0.05 0 0 0 0 0 566.042 0 0 0 0 -376.37 
0 0 0 0 0 0 0 0 0 1674.78 2132.71 0 0 1318.17 2414.85 649.663 0 -412.534 0 0 0 0 0 -1409.57 479.675 0 0 0 903.577 0 887.249 0 0 1045.03 0 0 0 0 0 0 0 0 0 0 0 0 0 0 1598.64 0 0 0.06 0 302.82 2341.91 0 579.012 467.772 0 -779.366 0 0 
0 0 0 0 -1879.71 -1320.46 0 966.445 -956.832 935.774 0 -92.7 0 0 0 0 0 0 0 -727.943 0 0 1583.68 0 68.7429 0 0 0 0 0 472.655 -1317.87 0 1327.02 1424.83 0 0 0 0 0 0 -1962.57 0 2196.04 -661.718 0 0 0 0 0 0 0 0.03 1506.62 0 0 0 909.375 0 0 -688.421 0 
0 0 0 0 0 0 -2411.8 0 0 0 0 0 0 2439.57 0 0 1027.63 0 0 855.205 -2134.08 0 0 0 0 0 0 1527.53 0 0 0 0 1404.39 0 421.842 1219.44 0 0 0 2344.36 -566.958 0 0 0 0 -2304.83 -649.358 0 0 0 0 -497.681 168.844 0.03 0 1274.99 2121.72 0 0 0 512.635 0 
0 0 0 0 0 0 1404.69 0 51.6526 33.7992 0 0 0 0 0 0 0 0 0 0 0 0 0 0 0 0 0 0 2127.67 0 0 1254.54 0 846.965 491.729 0 0 0 0 1762.52 0 0 2130.12 0 -61.5711 0 0 404.904 0 0 0 -514.771 0 0 0 0 -1708.96 0 0 1214.87 -1684.7 0 
1256.22 0 -1476.41 0 2008.35 -1948.07 1644.72 0 0 0 0 0 0 0 2330.01 0 0 0 0 0 0 0 0 0 0 0 0 0 0 2398.83 0 9.84222 0 0 2196.65 0 1886.43 0 0 0 0 0 0 0 -563.906 0 0 0 -823.313 -1114.15 0 0 0 -280.847 0 0.09 0 0 0 0 0 0 
0 0 0 0 0 -1292.69 0 2285.45 1465.27 0 377.285 0 0 519.501 0 0 0 0 0 0 0 0 1252.4 0 0 695.441 1538.06 0 0 2384.33 0 0 0 2412.41 0 0 0 2044.82 0 0 0 0 0 -1645.48 0 0 0 0 1679.82 0 -2011.86 1995.99 0 -312.281 1242.48 0 0.02 0 0 1562.01 0 -2287.74 
0 1670.96 0 0 0 0 0 0 0 1345.48 0 0 0 0 0 0 -768.075 0 -1798.68 0 0 2451.63 0 706.427 0 0 -2327.72 1835.15 0 0 606.174 1556.22 1663.64 0 0 0 692.083 -609.226 13.9622 -1756.26 -1564 1425.9 0 0 0 0 0 0 455.718 0 0 1688.21 -533.692 0 0 0 0 0.06 0 0 0 0 
0 2033.52 0 0 0 -1817 0 0 0 1162.83 0 0 0 -1162.22 0 0 0 0 0 1786.02 0 0 0 0 0 0 0 0 2486.42 0 0 0 -1228.14 0 -2243.64 0 0 0 0 2231.59 -977.737 0 0 0 448.851 -2218.47 0 0 0 0 0 0 0 0 0 0 0 0 0.04 621.128 1660.89 0 
0 0 0 333.644 0 0 0 0 2277.67 1925.95 -1910.84 0 0 0 0 0 0 0 -1421.63 786.996 0 0 0 0 0 0 0 0 0 0 0 -2070.6 0 0 0 0 0 0 0 1574.53 0 130.543 0 0 0 0 0 0 0 0 0 -2398.98 0 0 2268.06 0 2270.81 0 -953.627 0.08 0 0 
-2045.27 0 0 2111.5 0 0 0 0 2210.38 0 0 0 -45.5489 1775.95 0 0 0 0 1702.25 0 0 -283.288 657.903 0 0 0 0 0 0 0 0 0 0 0 0 0 0 0 0 0 0 0 -1995.83 -1813.94 0 0 2138.81 0 978.195 0 0 0 423.826 1835.46 -2153.92 0 0 0 897.168 0 0.07 -1144.98 
243.767 0 0 0 0 -416.044 0 0 2182.61 0 1886.27 -1693.85 -1358.15 661.565 1359.22 0 0 0 1413.54 0 0 0 -1772.29 -344.325 -882.824 0 -704.138 0 -80.1874 -248.802 0 0 0 0 0 0 0 348.75 0 0 0 2490.69 0 0 0 0 0 0 0 1133.23 226.066 0 0 0 0 0 546.052 0 0 0 -210.654 0.08 
