*Vertices 56
*Matrix 
0.06 0 1990.95 111.469 0 0 1523.1 0 0 0 0 972.701 0 0 0 1815.01 2046.19 -1775.34 0 0 0 0 0 355.007 0 0 0 0 0 0 0 0 0 1416.14 0 0 0 0 0 0 0 0 -1922.59 0 -239.189 0 0 0 0 0 1946.55 732.978 1370.97 0 0 0 
0 0.04 0 0 0 -2171.93 0 1448.79 0 -2421.57 0 -38.377 0 0 0 0 0 0 2264.55 -1299.55 -66.6066 0 0 1536.53 0 312.891 0 0 0 0 0 0 0 0 0 0 0 -2368.31 0 0 0 0 1636.78 573.977 0 0 0 586.337 0 2356.56 0 0 0 0 0 0 
1116.75 0 0.04 0 0 0 0 1570.41 0 0 2208.85 0 0 0 1884.44 144.887 -1029.31 0 0 0 0 0 0 215.69 0 0 0 0 2256.61 0 0 0 0 0 0 0 0 2357.17 0 0 1088.37 0 0 964.614 0 -1295.89 0 0 0 0 -1726.66 0 0 0 0 0 
1457.79 0 0 0.03 0 0 1934.19 0 0 1798.53 -1995.53 0 0 0 -2202.6 0 0 0 -1240.81 0 0 0 0 2171.01 0 -1213.95 1307.79 0 0 0 0 0 0 0 0 0 1439.63 0 -1979.66 0 0 0 0 0 -1001.24 0 0 0 0 0 1741.46 2223.35 0 0 0 0 
0 0 0 0 0.05 0 0 0 0 0 0 0 0 2315.82 2087.54 0 0 0 0 0 0 -885.571 -1025.35 592.593 0 0 1735.66 0 1432.62 0 0 0 0 972.396 0 0 351.955 0 442.137 0 0 0 0 0 1860.03 72.7104 0 -1689.58 1359.07 0 0 0 0 0 0 0 
0 1576.66 0 0 0 0.03 0 0 86.7489 0 0 2189.32 2192.07 0 0 2375.94 0 0 -1135.98 0 80.4926 -2092.43 -2009.26 0 0 0 0 -312.586 1491.36 0 0 865.886 0 0 0 0 -1948.38 -1060.75 2076.25 0 -1857.43 0 49.0585 0 0 0 0 0 -1544.01 0 0 1119.8 0 -805.155 0 0 
-1871.62 0 0 -463.805 0 0 0.02 0 0 0 0 2082.51 -909.68 0 0 0 0 0 -494.324 0 0 0 0 -654.851 -167.318 -1763.28 666.143 0 0 0 0 0 0 752.205 0 0 0 -1051.44 0 0 0 0 2483.67 0 0 0 0 0 0 289.544 530.488 0 0 980.789 0 0 
0 2176.66 -621.586 0 0 0 0 0.08 105.823 0 81.1029 2098.53 -1555.76 0 0 0 0 0 2191.15 0 1537.45 0 1147.88 201.651 1745.12 0 0 0 0 0 -1714.91 0 340.815 -148.854 2433.77 0 0 0 0 1626.1 0 0 0 0 0 0 0 -1756.42 0 0 0 0 0 0 0 732.978 
0 0 0 0 0 670.11 0 86.5963 0 0 0 0 0 0 0 0 1950.67 0 0 0 1051.44 0 0 -2289.73 0 0 -187.765 0 0 -707.648 0 0 0 0 0 0 472.503 0 0 0 0 0 0 0 0 2484.44 0 0 0 0 0 0 0 0 -636.998 0 
0 581.912 0 -1137.35 0 0 0 0 0 0.03 0 1633.58 -2022.69 -1490.14 0 776.162 -2370.6 0 0 0 -470.824 -1092.79 483.184 0 0 0 0 0 0 0 0 0 0 -695.593 172.658 0 1108.51 0 721.229 844.523 800.424 0 0 0 0 0 0 2409.21 14.7252 0 0 0 0 0 0 0 
0 0 -393.155 249.107 0 0 0 -2499.85 0 0 0.05 0 2224.27 0 0 0 251.854 0 0 0 0 1940.9 0 0 -2269.89 0 0 465.484 0 0 0 0 0 0 0 0 0 0 52.2629 0 0 1270.56 2121.27 0 -835.978 0 0 0 0 938.368 0 0 1912.52 0 0 0 
-509.43 -45.2437 0 0 0 2359.92 666.295 -1553.32 0 1801.13 0 0.05 0 0 0 0 982.772 0 -2202.44 0 -2285.61 1121.48 0 -1720.71 0 0 0 -627.232 0 -982.162 2239.68 1523.71 0 0 2283.93 1603.37 0 0 1667.91 0 0 0 1699.35 1765.42 0 880.688 0 0 0 0 892.132 0 0 0 0 0 
0 0 0 0 0 -2209.92 610.294 -946.913 0 1897.72 -1553.16 0 0.02 0 0 1498.54 0 0 2031.69 2443.85 0 -808.359 0 0 0 1007.49 494.171 0 2425.08 430.082 0 0 0 0 0 0 2289.42 0 -1681.04 0 -832.774 -2040.7 0 1894.36 0 0 586.032 0 0 0 0 -1852.85 0 0 0 0 
0 0 0 0 493.255 0 0 0 0 -2129.81 0 0 0 0.04 0 -914.106 0 0 0 1895.28 0 0 0 0 0 0 0 0 1826.61 0 184.103 0 0 0 0 -1593.45 -1132.01 0 0 0 403.836 1534.7 0 -2279.2 223.624 0 111.469 1302.91 2039.17 2052.6 0 -2454.07 1366.08 0 0 0 
0 0 -240.41 -2246.54 615.482 0 0 0 0 0 0 0 0 0 0.07 485.931 0 970.717 2119.13 0 0 0 0 0 0 0 0 0 852.916 0 0 -2071.06 0 0 0 0 0 0 0 0 0 0 0 1525.85 0 0 0 0 1319.85 1276.51 0 0 0 0 0 0 
949.66 0 2132.56 0 0 2304.38 0 0 0 288.171 0 0 -491.729 2196.49 -1282.46 0.01 0 0 0 0 0 0 2059.01 0 0 0 0 0 0 0 168.691 0 2072.28 0 0 0 770.516 0 0 513.245 0 0 0 0 0 0 1478.85 1422.7 1717.2 0 0 0 0 0 0 0 
2265.62 0 975.448 0 0 0 0 0 2464.29 -276.727 2352.29 -1370.82 0 0 0 0 0.07 0 0 0 0 0 0 0 0 0 1172.14 0 0 0 0 127.186 0 0 0 0 -236.137 0 0 0 0 2309.72 0 817.362 0 0 0 0 0 0 365.688 -2466.73 0 0 0 0 
1204.18 0 0 0 0 0 0 0 0 0 0 0 0 0 1244.01 0 0 0.02 0 -2143.7 0 830.027 -2083.12 0 0 0 0 -230.186 0 0 0 0 0 0 0 -129.627 0 0 0 1821.88 2328.49 0 0 0 0 0 0 0 0 0 -1144.22 0 0 0 -712.989 0 
0 2077.47 0 -2109.82 0 2329.71 -1698.58 -548.494 0 0 0 2074.11 437.101 0 -2214.5 0 0 0 0.02 0 0 0 0 1042.59 0 1174.12 0 0 0 -1012.83 -1869.03 0 0 -516.755 2489.17 0 0 0 -2167.96 0 0 0 0 0 0 0 0 0 0 0 2244.87 0 0 0 0 -785.775 
0 -2480.32 0 0 0 0 0 0 0 0 0 0 -1137.65 2065.26 0 0 0 -420.164 0 0.05 0 1066.24 0 0 -1127.43 1549.04 0 0 0 -959.273 1587.65 -1908.25 0 0 0 0 0 0 0 0 0 2397.31 0 0 0 0 991.928 0 0 0 0 0 0 0 0 0 
0 -1361.66 0 0 0 2333.22 0 -1486.33 1883.37 1291.01 0 511.261 0 0 0 0 0 0 0 0 0.08 0 -759.682 0 0 0 -2048.02 1993.39 2410.43 0 0 0 -802.408 -277.184 635.014 -2496.64 0 0 819.803 0 0 -2320.09 0 0 0 0 0 0 1730.17 2263.94 0 -812.632 0 0 0 0 
0 0 0 0 -520.417 1937.24 0 0 0 1179.01 -418.79 1030.38 1538.06 0 0 0 0 -1923.51 0 -1368.98 0 0.08 0 0 0 0 0 0 660.192 0 0 0 0 0 0 0 0 0 0 332.575 0 -802.408 0 1757.48 0 -1552.25 0 1409.12 1516.69 0 0 0 0 0 90.7163 0 
0 0 0 0 -716.193 2289.57 0 1889.93 0 1086.38 0 0 0 0 0 -935.011 0 669.195 0 0 1179.92 0 0.08 1488.16 0 0 0 0 -2240.14 0 132.527 2254.78 0 0 0 0 0 0 1921.22 79.4244 0 0 0 1911.15 0 0 -2194.66 0 0 0 0 0 0 0 -1974.47 0 
2445.37 -153.584 479.217 -1679.51 708.258 0 557.192 1143.3 1702.7 0 0 1995.68 0 0 0 0 0 0 807.596 0 0 0 838.725 0.06 0 0 0 -2373.5 -780.282 0 0 0 0 -348.292 0 0 1833.78 0 0 0 0 0 0 981.246 0 0 0 0 -1489.23 1693.09 -977.126 0 0 0 0 0 
0 0 0 0 0 0 1830.12 78.2037 0 0 981.857 0 0 0 0 0 0 0 0 -1327.94 0 0 0 0 0.08 0 1101.49 0 0 0 -257.042 0 0 0 0 1477.48 0 392.697 0 0 0 0 0 0 -2304.22 -590.152 0 0 0 0 0 0 0 0 0 0 
0 111.621 0 -2467.19 0 0 -781.045 0 0 0 0 0 1555.76 0 0 0 0 0 1775.34 1259.58 0 0 0 0 0 0 0 0 0 0 0 0 194.327 0 0 0 0 0 2080.37 1543.4 0 -820.566 0 0 0 0 -2314.75 0 0 2139.88 0 0 0 0 0 0 
0 0 0 774.789 1558.96 0 1629.92 0 1086.54 0 0 0 -498.444 0 0 0 2403.87 0 0 0 1919.84 0 0 0 1699.19 0 0.06 0 0 0 0 0 -640.965 0 -1808.76 1757.18 0 2094.71 1712.16 0 0 0 0 1781.59 -2269.28 0 0 0 0 0 0 0 1779.92 0 0 0 
0 0 0 0 0 -106.281 0 0 0 0 1910.54 -48.6007 0 0 0 0 0 -733.894 0 0 150.685 0 0 -1380.89 0 0 0 0.02 0 0 638.676 2402.34 2007.89 -1178.55 75.1518 0 1024.12 0 0 -237.358 -2390.44 -297.479 0 -1719.49 0 1361.2 0 685.369 0 0 0 0 0 0 0 0 
0 0 901.288 0 2432.86 1123.77 0 0 0 0 0 0 2161.09 859.325 2328.18 0 0 0 0 0 -1962.72 2110.43 537.049 895.489 0 0 0 0 0.09 0 0 -1312.52 2239.83 0 0 0 0 0 0 0 0 0 0 0 0 0 0 0 1285.36 0 0 0 0 0 0 0 
0 0 0 0 0 0 0 0 -1511.2 0 0 2419.43 1035.26 0 0 0 0 0 -1986.22 652.104 0 0 0 0 0 0 0 0 0 0.04 1123 0 0 0 0 0 -559.633 -1018.33 -1829.36 0 0 0 0 0 1676 2035.2 0 0 0 -439.085 0 0 0 0 0 0 
0 0 0 0 0 0 0 356.533 0 0 0 -1374.48 0 1652.5 0 295.038 0 0 422.147 -689.032 0 0 -637.761 0 1930.22 0 0 -382.168 0 -1973.71 0.09 0 0 0 2326.96 0 -777.688 0 -939.436 0 1126.67 0 0 -1691.11 2066.48 0 165.487 -632.42 0 0 2475.43 0 -1474.88 0 0 0 
0 0 0 0 0 -2212.36 0 0 0 0 0 -1433.23 0 0 371.944 0 2346.03 0 0 2099.9 0 0 2214.35 0 0 0 0 -1350.98 611.515 0 0 0.01 2130.88 0 0 -491.272 0 0 0 0 0 7.70592 0 0 0 2422.03 590.457 -251.854 693.152 0 0 0 0 -105.67 0 0 
0 0 0 0 0 0 0 2008.35 0 0 0 0 0 0 0 1796.55 0 0 0 0 -421.079 0 0 0 0 -748.39 1338.62 -614.719 -180.593 0 0 -1893.44 0.09 0 642.491 0 0 0 1065.48 0 0 0 0 0 0 0 0 0 0 0 940.809 0 0 0 0 -637.303 
-1647.16 0 0 0 -698.34 0 912.732 -7.40074 0 1709.27 0 0 0 0 0 0 0 0 -86.1385 0 -2179.56 0 0 1381.65 0 0 0 2409.67 0 0 0 0 0 0.05 -2302.39 0 0 -2199.7 0 1421.63 -338.221 0 0 0 0 997.116 1995.07 0 1054.8 -243.156 0 0 0 0 0 0 
0 0 0 0 0 0 0 1481.75 0 1888.26 0 -52.8733 0 0 0 0 0 0 -384.762 0 881.451 0 0 0 0 0 1542.79 -1994.16 0 0 2000.11 0 1935.71 2088.61 0.07 -1686.68 0 0 0 0 0 0 0 0 -1490.14 0 -571.535 0 2419.89 1734.29 1105.61 0 0 0 63.4022 0 
0 0 0 0 0 0 0 0 0 0 0 -160.604 0 2421.41 0 0 0 694.678 0 0 2014.15 0 0 0 -1133.38 0 2130.12 0 0 0 0 423.673 0 0 1282.92 0.08 1463.74 0 0 0 0 507.599 0 -305.719 0 0 0 -759.529 0 0 2146.29 0 0 -2100.51 1759.77 0 
0 0 0 -166.707 814.31 950.728 0 0 -177.847 -1671.88 0 0 833.842 1223.26 0 1810.28 976.058 0 0 0 0 0 0 1751.53 0 0 0 -2324.52 0 1475.04 1381.5 0 0 0 0 110.706 0.07 -1713.84 -961.715 719.092 0 2425.99 0 0 2129.66 192.801 0 0 0 0 0 0 0 0 0 0 
0 722.755 -543.611 0 0 1378.44 2245.48 0 0 0 0 0 0 0 0 0 0 0 0 0 0 0 0 0 2307.28 0 -804.239 0 0 45.8541 0 0 0 217.521 0 0 521.18 0 -1481.29 0 0 0 2413.63 0 0 0 0 0 0 0 0 0 0 357.295 0 0 
0 0 0 1519.75 2395.02 926.16 0 0 0 -289.697 570.62 2128.74 -193.106 0 0 0 0 0 2314.91 0 1991.87 0 531.098 0 0 -1708.5 -385.983 0 0 1708.96 -1856.36 0 765.633 0 0 0 1100.88 868.633 0.02 0 0 0 0 1114.31 0 0 0 0 465.026 0 0 0 0 0 0 0 
0 0 0 0 0 0 0 2400.2 0 1744.21 0 0 0 0 0 1008.87 0 -2116.38 0 0 0 2439.12 755.562 0 0 1828.75 0 -2374.42 0 0 0 0 0 2442.78 0 0 -419.706 0 0 0.02 0 2401.12 0 0 -1174.89 0 0 0 0 0 0 0 0 0 0 -1364.41 
0 0 961.562 0 0 -692.999 0 0 0 342.036 0 0 -1532.56 -479.369 0 0 0 2197.56 0 0 0 0 0 0 0 0 0 1259.73 0 0 458.617 0 0 102.618 0 0 0 0 0 0 0.07 0 0 0 0 0 2064.5 2300.26 0 0 0 0 0 0 0 0 
0 0 0 0 0 0 0 0 0 0 -323.878 0 337.611 1125.14 0 0 -560.701 0 0 336.085 -790.963 849.101 0 0 0 1723.15 0 -2379.45 0 0 0 1301.08 0 0 0 1535.92 1101.34 0 0 127.186 0 0.03 0 0 0 -950.117 0 0 -1393.7 0 0 0 0 0 0 0 
-1885.51 -1618.78 0 0 0 2288.96 534.761 0 0 0 1324.12 1268.73 0 0 0 0 0 0 0 0 0 0 0 0 0 0 0 0 0 0 0 0 0 0 0 0 0 -1218.83 0 0 0 0 0.04 0 1405.15 0 0 0 0 0 0 0 0 0 0 0 
0 1474.43 1670.81 0 0 0 0 0 0 0 0 -1365.63 -1950.06 98.3459 1311.46 0 -270.165 0 0 0 0 -1083.79 1907.48 -837.046 0 0 2184.13 -204.245 0 0 2192.53 0 0 0 0 734.504 0 0 1405.76 0 0 0 0 0.09 0 0 -58.5192 0 0 1253.32 0 0 0 359.89 0 0 
1923.66 0 0 1524.78 1930.22 0 0 0 0 0 -944.624 0 0 -976.516 0 0 0 0 0 0 0 0 0 0 -1366.85 0 -644.78 0 0 438.475 1889.63 0 0 0 -2017.96 0 -493.103 0 0 103.076 0 0 1586.73 0 0.05 2421.26 0 0 0 0 0 0 0 0 0 2289.27 
0 0 1748.48 0 -1373.56 0 0 0 1063.95 0 0 -664.159 0 0 0 0 0 0 0 0 0 -1027.94 0 0 56.0778 0 0 -834.147 0 2282.1 0 2002.55 0 -1340.75 0 0 1810.28 0 0 0 0 1839.88 0 0 1755.35 0.02 0 0 0 0 0 0 0 0 0 0 
0 0 0 0 0 0 0 0 0 0 0 0 -361.11 -54.3992 0 11.3681 0 0 0 863.903 0 0 -1268.58 0 0 1237.14 0 0 0 0 2176.35 -682.623 0 2380.52 591.983 0 0 0 0 0 1437.19 0 0 1555.91 0 0 0.08 0 54.5518 0 0 0 0 0 0 0 
0 1780.83 0 0 -278.863 0 0 1990.49 0 2077.01 0 0 0 -1300.78 0 196.463 0 0 0 0 0 -1093.55 0 0 0 0 0 -1396.15 0 0 2471.47 1268.88 0 0 0 1437.19 0 0 0 0 -552.461 0 0 0 0 0 0 0 0 0 0 0 0 0 0 0 
0 0 0 0 2291.56 1934.95 0 0 0 1115.99 0 0 0 -1522.64 612.735 2087.08 0 0 0 0 1907.94 -2184.9 0 2247.92 0 0 0 0 -706.427 0 0 466.704 0 -1495.03 72.1 0 0 0 -2106.01 0 0 -362.178 0 0 0 0 890.759 0 0.07 0 0 0 0 -1732.92 0 0 
0 730.842 0 0 0 0 1423.61 0 0 0 1454.59 0 0 -1672.49 1941.36 0 0 0 0 0 -1693.09 0 0 2034.9 0 1227.38 0 0 0 2486.88 0 0 0 935.011 -236.137 0 0 0 0 0 0 0 0 1392.79 0 0 0 0 0 0.04 0 0 0 0 0 1076.46 
2201.83 0 -1118.27 -755.867 0 0 911.206 0 0 0 0 2147.21 0 0 0 0 891.98 -2260.89 -2.51778 0 0 0 0 1842.78 0 0 0 0 0 0 -2035.2 0 1911.91 0 2472.23 2325.13 0 0 0 0 0 0 0 0 0 0 0 0 0 0 0.08 0 0 0 0 0 
161.824 0 0 1970.2 0 2494.05 0 0 0 0 0 0 205.313 -568.178 0 0 774.636 0 0 0 -1200.67 0 0 0 0 0 0 0 0 0 0 0 0 0 0 0 0 0 0 0 0 0 0 0 0 0 0 0 0 0 0 0.02 0 0 0 0 
-959.12 0 0 0 0 0 0 0 0 0 2319.18 0 0 408.872 0 0 0 0 0 0 0 0 0 0 0 0 1511.81 0 0 0 -358.364 0 0 0 0 0 0 0 0 0 0 0 0 0 0 0 0 0 0 0 0 0 0.08 1505.1 292.596 0 
0 0 0 0 0 -1923.05 1545.38 0 0 0 0 0 0 0 0 0 0 0 0 0 0 0 0 0 0 0 0 0 0 0 0 -1516.24 0 0 0 -1152.61 0 2059.31 0 0 0 0 0 -1769.84 0 0 0 0 2392.88 0 0 0 2346.03 0.06 0 0 
0 0 0 0 0 0 0 0 2250.36 0 0 0 0 0 0 0 0 -2137.44 0 0 0 903.882 -107.654 0 0 0 0 0 0 0 0 0 0 0 2090.29 399.258 0 0 0 0 0 0 0 0 0 0 0 0 0 0 0 0 1989.73 0 0.01 0 
0 0 0 0 0 0 0 -542.39 0 0 0 0 0 0 0 0 0 0 298.242 0 0 0 0 0 0 0 0 0 0 0 0 0 1122.39 0 0 0 0 0 0 -580.844 0 0 0 0 -1418.88 0 0 0 0 2018.27 0 0 0 0 0 0 
