*Vertices 61
*Matrix 
0.05 -1892.07 2077.93 0 0 0 0 -1170.77 0 0 0 2176.5 587.1 0 0 0 0 0 -210.501 0 0 0 0 0 2264.85 0 0 0 0 0 0 0 0 0 0 0 0 -373.928 0 329.371 0 0 0 0 0 0 -1580.63 0 0 0 0 0 -1120.56 0 0 0 0 0 0 0 0 
5.11185 0.04 0 0 0 0 0 0 0 0 0 0 955.306 0 0 0 0 0 0 0 0 0 0 0 0 0 0 0 0 -110.096 0 0 0 0 0 0 0 0 0 0 0 -2046.95 0 0 0 869.549 0 0 0 0 1435.82 0 0 0 0 0 0 0 0 0 0 
205.466 0 0.04 0 0 0 0 0 0 0 0 0 0 0 -2210.84 0 0 0 256.432 0 0 0 0 0 0 0 0 0 0 0 0 0 0 0 0 0 0 0 0 0 0 0 0 0 0 1140.71 0 0 0 1836.38 0 0 0 0 0 0 0 0 0 0 0 
0 0 0 0.01 0 -266.503 0 0 0 0 0 0 0 0 1908.7 0 0 0 0 0 0 0 0 0 0 1615.57 0 0 0 0 0 0 0 0 0 1268.12 0 0 0 0 0 0 0 0 0 0 0 0 0 0 0 0 0 0 0 0 0 0 0 0 0 
0 0 0 0 0.08 0 -1398.59 0 0 0 0 0 0 0 0 0 0 0 0 0 0 -1578.8 0 0 -419.248 0 1735.66 0 -624.943 0 238.426 0 0 0 0 1261.1 -1713.54 768.99 0 0 0 0 0 0 0 0 0 2228.23 416.807 -916.547 0 2029.71 0 -2104.79 0 0 0 0 0 0 0 
0 0 0 -1095.23 0 0.07 0 0 0 0 0 0 707.953 0 0 0 0 0 0 -607.242 0 221.946 -517.823 0 2097.31 0 0 0 -1264.31 0 0 0 695.441 0 0 0 0 0 0 0 0 0 1472.29 0 0 0 0 0 0 0 0 0 0 0 0 0 0 0 0 0 0 
0 0 0 0 1419.8 0 0.05 0 0 0 0 0 0 0 0 1209.98 0 747.78 0 2406.92 0 -356.227 0 0 0 0 0 0 0 0 0 0 0 0 837.199 0 0 0 0 0 0 0 0 0 0 0 0 0 0 0 0 0 0 0 0 0 0 0 0 0 0 
-1439.94 0 0 0 0 0 0 0.04 0 0 0 0 0 0 0 0 0 0 0 0 0 0 0 1137.96 0 0 0 0 0 0 2189.17 -1901.99 0 0 0 0 0 0 848.491 0 0 1244.47 1872.23 0 0 0 0 0 0 0 0 0 -2086.63 0 0 0 0 0 0 0 0 
0 0 0 0 0 0 0 0 0.01 0 0 0 0 0 0 0 1950.36 0 791.421 0 0 0 0 0 0 0 0 0 0 0 0 0 0 0 0 0 0 0 568.941 0 0 0 0 0 0 0 0 0 0 0 0 0 0 -2261.5 0 0 0 0 0 0 0 
0 0 0 0 0 0 0 0 0 0 0 1825.85 0 0 0 1964.55 0 0 0 0 0 0 0 0 0 0 0 0 0 0 0 1588.26 0 0 739.387 0 0 1579.26 0 0 0 1386.23 0 -2417.14 0 0 0 0 0 -1484.8 0 -1526.31 0 0 0 0 0 0 0 0 0 
0 0 0 0 0 0 0 0 0 0 0.07 0 0 0 0 8.92666 0 0 0 0 0 0 2445.83 0 928.144 0 0 0 0 0 0 0 0 2498.32 0 0 0 0 0 0 686.132 0 0 459.838 0 0 0 0 -61.4185 0 0 0 0 0 0 0 0 0 0 0 0 
238.273 0 0 0 0 0 0 0 0 889.691 0 0.07 0 0 1457.49 0 0 2379.15 0 0 0 0 0 0 0 0 0 11.3681 0 0 0 0 0 0 0 0 0 0 0 0 0 0 0 0 0 0 0 450.53 1725.59 0 0 0 0 0 0 0 0 0 0 0 0 
2439.42 2295.83 0 0 0 1807.54 0 0 0 0 0 0 0.03 0 0 2064.65 0 0 0 0 0 -2038.26 0 0 0 0 0 0 0 0 0 0 0 0 0 0 0 0 0 0 0 0 0 0 -862.682 0 0 2456.36 0 0 932.569 0 0 0 0 0 0 0 0 0 0 
0 0 0 0 0 0 0 0 0 0 0 0 0 0.09 0 0 0 0 1463.59 0 0 0 0 0 0 0 0 2156.21 0 0 0 0 0 0 0 0 0 0 0 2138.05 -2143.7 0 0 0 0 0 0 0 0 1456.88 0 0 0 -2341.3 0 0 0 0 0 0 0 
0 0 -8.62148 2372.13 0 0 0 0 0 0 0 -1026.57 0 0 0.06 0 0 0 0 0 805.002 0 0 475.402 0 -2128.59 0 0 0 0 0 0 0 0 0 0 0 2015.82 0 0 0 0 0 0 0 0 0 0 0 0 0 0 0 0 0 0 0 0 0 0 0 
0 0 0 0 0 0 27.8481 0 0 318.842 1067 0 -745.491 0 0 0.08 0 0 0 0 0 0 0 0 0 0 0 0 0 0 0 0 0 0 0 801.492 1713.84 0 0 0 0 0 0 0 0 0 0 0 0 1155.05 1761.45 0 0 0 0 0 0 0 0 0 0 
0 0 0 0 0 0 0 0 -2063.59 0 0 0 0 0 0 0 0 0 -219.657 0 481.964 -1830.58 0 0 0 0 0 0 0 0 0 2274.77 0 0 0 0 0 0 0 0 0 0 0 0 2388.15 0 0 0 0 0 0 0 1042.59 0 0 0 0 0 0 0 0 
0 0 0 0 0 0 -271.691 0 0 0 0 1003.52 0 0 0 0 0 0.05 0 0 0 0 2468.11 1971.88 0 0 878.552 0 2001.48 1953.87 0 0 2353.82 0 0 0 0 0 0 0 0 0 1365.47 0 0 0 0 0 -579.928 0 0 0 0 2005.6 0 0 0 0 0 0 0 
-105.67 0 -283.746 0 0 0 0 0 -388.272 0 0 0 0 1304.28 0 0 -1786.48 0 0.06 0 0 1902.75 0 0 1876.2 0 0 0 0 0 0 0 0 0 0 0 0 0 0 0 0 0 0 0 0 0 0 0 -521.79 0 0 0 0 0 0 0 0 0 0 0 0 
0 0 0 0 0 1166.49 1928.24 0 0 0 0 0 0 0 0 0 0 0 0 0.08 0 0 0 0 0 0 0 0 0 0 0 0 0 0 0 0 0 0 0 0 0 0 0 0 0 0 0 0 0 0 0 0 0 0 0 0 0 0 0 0 0 
0 0 0 0 0 0 0 0 0 0 0 0 0 0 -141.835 0 1459.93 0 0 0 0.04 0 0 0 0 0 2356.87 0 0 0 0 0 0 0 0 0 0 0 0 -2048.94 0 0 1930.37 0 2057.02 0 0 0 0 0 0 0 0 0 0 0 0 0 0 0 0 
0 0 0 0 1840.8 1073.26 1167.56 0 0 0 0 0 1542.02 0 0 0 1222.04 0 1538.82 0 0 0.07 0 0 1816.54 0 0 0 0 0 0 0 0 0 0 0 -1629.46 0 0 0 0 0 0 0 2497.25 -220.725 0 1323.51 51.9578 0 0 0 0 377.895 0 0 0 0 0 0 0 
0 0 0 0 0 359.737 0 0 0 0 -670.568 0 0 0 0 0 0 -563.143 0 0 0 0 0.04 0 0 0 0 0 0 777.688 0 0 0 0 0 0 0 0 0 1747.72 0 0 1259.73 0 0 0 0 0 0 0 0 0 0 0 0 0 0 0 0 0 0 
0 0 0 0 0 0 0 -874.737 0 0 0 0 0 0 1188.01 0 0 2451.02 0 0 0 0 0 0.01 0 0 0 0 0 0 0 0 0 0 2321.47 0 0 0 0 0 1704.84 0 0 0 0 0 696.051 0 0 0 2422.33 0 0 -521.943 0 0 0 0 0 0 0 
-1851.02 0 0 0 -324.335 2339.01 0 0 0 0 1374.02 0 0 0 0 0 0 0 130.238 0 0 889.691 0 0 0.06 -975.6 0 -50.4318 1349.15 0 0 0 0 0 0 -1480.22 1809.98 -1976.45 0 -394.375 0 0 0 0 0 0 0 0 -701.849 0 0 0 0 2247.15 0 0 0 0 0 0 0 
0 0 0 2263.33 0 0 0 0 0 0 0 0 0 0 2066.64 0 0 0 0 0 0 0 0 0 -2076.71 0.09 0 0 0 0 0 -820.719 0 0 0 0 0 0 0 0 0 0 0 0 0 0 0 0 2002.09 0 0 0 0 0 0 0 0 0 0 0 0 
0 0 0 0 1064.87 0 0 0 0 0 0 0 0 0 0 0 0 1766.49 0 0 786.691 0 0 0 0 0 0.05 0 0 0 0 0 0 0 0 0 0 -1735.51 0 0 0 0 0 0 0 0 0 0 0 0 0 0 0 0 0 0 0 0 0 0 0 
0 0 0 0 0 0 0 0 0 0 0 -34.257 0 -97.7355 0 0 0 0 0 0 0 0 0 0 -1636.63 0 0 0.06 0 0 0 0 0 0 0 0 0 1471.22 0 2207.02 0 -97.1252 0 0 0 0 1634.65 0 0 0 0 0 0 1865.06 0 0 0 0 0 0 0 
0 0 0 0 813.395 -105.823 0 0 0 0 0 0 0 0 0 0 0 535.829 0 0 0 0 0 0 2291.56 0 0 0 0.01 0 0 -2184.13 0 0 0 0 0 0 0 0 0 0 0 0 0 0 1138.57 0 0 0 0 0 2400.05 0 0 0 0 0 0 0 0 
0 -1654.33 0 0 0 0 0 0 0 0 0 0 0 0 0 0 0 977.279 0 0 0 0 1450.62 0 0 0 0 0 0 0.02 2347.1 0 1415.52 0 0 0 -1945.17 0 0 0 0 0 1731.7 0 0 179.22 0 939.131 0 0 0 -347.072 0 0 0 0 0 0 0 0 0 
0 0 0 0 1167.87 0 0 -5.72222 0 0 0 0 0 0 0 0 0 0 0 0 0 0 0 0 0 0 0 0 0 -864.971 0.04 2350.61 0 0 0 0 0 0 1352.2 0 0 0 0 0 1447.42 0 0 0 0 0 0 0 0 0 0 0 0 0 0 0 0 
0 0 0 0 0 0 0 1012.53 0 2459.26 0 0 0 0 0 0 2029.1 0 0 0 0 0 0 0 0 -2273.25 0 0 -833.537 0 -898.541 0.07 0 0 0 -1174.28 0 0 0 2237.69 0 0 0 1875.59 0 0 0 0 0 0 0 0 -1479.61 -300.531 0 -469.909 0 0 0 0 0 
0 0 0 0 0 -2190.85 0 0 0 0 0 0 0 0 0 0 0 72.2526 0 0 0 0 0 0 0 0 0 0 0 1436.28 0 0 0.06 0 0 0 679.266 0 0 0 0 0 0 0 2491.3 0 0 0 0 0 0 0 0 0 0 0 0 0 0 0 0 
0 0 0 0 0 0 0 0 0 0 -1357.39 0 0 0 0 0 0 0 0 0 0 0 0 0 0 0 0 0 0 0 0 0 0 0.06 0 0 0 0 0 0 0 0 0 0 1035.42 0 0 885.113 0 0 0 1210.29 2147.21 0 0 0 0 0 0 0 0 
0 0 0 0 0 0 813.547 0 0 1704.08 0 0 0 0 0 0 0 0 0 0 0 0 0 43.8704 0 0 0 0 0 0 0 0 0 0 0.08 0 0 0 0 0 0 0 0 0 0 0 0 -510.651 0 0 0 0 0 0 0 0 0 0 0 0 0 
0 0 0 -144.887 2480.47 0 0 0 0 0 0 0 0 0 0 797.983 0 0 0 0 0 0 0 0 1575.44 0 0 0 0 0 0 2091.66 0 0 0 0.09 -1833.93 0 0 0 0 0 0 0 0 0 0 124.744 0 0 0 0 0 0 0 0 0 0 0 0 0 
0 0 0 0 -2494.81 0 0 0 0 0 0 0 0 0 0 2131.64 0 0 0 0 0 1750.77 0 0 -352.565 0 0 0 0 -1208.61 0 0 1706.82 0 0 -1814.55 0.07 0 47.2274 0 0 671.026 0 0 0 0 0 0 0 0 0 -637.913 0 0 0 0 0 0 0 0 0 
235.069 0 0 0 -1844.92 0 0 0 0 1590.24 0 0 0 0 -35.783 0 0 0 0 0 0 0 0 0 1134.14 0 -322.962 391.629 0 0 0 0 0 0 0 0 0 0.09 0 0 0 0 2133.93 0 0 0 0 0 -942.03 0 0 0 0 0 0 0 0 0 130.696 0 0 
0 0 0 0 0 0 0 2130.12 839.793 0 0 0 0 0 0 0 0 0 0 0 0 0 0 0 0 0 0 0 0 0 1434.9 0 0 0 0 0 -1283.38 0 0.04 0 0 0 0 0 2467.19 0 0 2380.98 0 0 0 1577.12 1518.37 0 0 0 0 0 0 0 0 
1434.45 0 0 0 0 0 0 0 0 0 0 0 0 -1786.78 0 0 0 0 0 0 1089.43 0 333.186 0 1329.46 0 0 -1723.3 0 0 0 2345.58 0 0 0 0 0 0 0 0 2482.45 0 0 0 1879.86 0 0 0 0 -1707.28 0 0 0 1721.47 0 0 1098.74 0 0 0 0 
0 0 0 0 0 0 0 0 0 0 -753.578 0 0 1837.44 0 0 0 0 0 0 0 0 0 770.669 0 0 0 0 0 0 0 0 0 0 0 0 0 0 0 2190.24 0.03 0 -1385.46 0 0 1695.68 1552.4 0 0 0 0 0 0 0 0 0 0 223.777 0 0 0 
0 -1644.26 0 0 0 0 0 2294.76 0 690.252 0 0 0 0 0 0 0 0 0 0 0 0 0 0 0 0 0 2323.15 0 0 0 0 0 0 0 0 1227.68 0 0 0 0 0.01 0 0 0 0 0 0 0 0 0 0 0 0 0 0 0 0 0 0 0 
0 0 0 0 0 -2433.77 0 -1012.83 0 0 0 0 0 0 0 0 0 2363.12 0 0 506.836 0 -307.855 0 0 0 0 0 0 -1718.57 0 0 0 0 0 0 0 2039.93 0 0 -1027.94 0 0.04 0 0 0 0 2471.47 0 0 0 0 0 0 0 0 0 0 0 0 0 
0 0 0 0 0 0 0 0 0 -599.612 -987.35 0 0 0 0 0 0 0 0 0 0 0 0 0 0 0 0 0 0 0 0 1241.42 0 0 0 0 0 0 0 0 0 0 0 0.09 0 466.704 0 0 0 -948.286 0 2271.57 0 0 0 0 0 0 0 0 0 
0 0 0 0 0 0 0 0 0 0 0 0 -1150.17 0 0 0 -2162.01 0 0 0 21.4393 1901.84 0 0 0 0 0 0 0 0 2275.84 0 -133.442 1057.08 0 0 0 0 1740.24 2169.03 0 0 0 0 0 0 0 -1283.53 0 0 0 -1220.82 0 325.251 0 0 0 0 0 0 0 
0 1164.2 2325.74 0 0 0 0 0 0 0 0 0 0 0 0 0 0 0 0 0 0 1157.19 0 0 0 0 0 0 0 -1926.86 0 0 0 0 0 0 0 0 0 0 1606.11 0 0 -1505.4 0 0.08 0 0 0 0 0 0 0 0 2435.76 0 0 0 0 0 0 
20.2185 0 0 0 0 0 0 0 0 0 0 0 0 0 0 0 0 0 0 0 0 0 0 -2375.48 0 0 0 -484.405 2261.96 0 0 0 0 0 0 0 0 0 0 0 -562.38 0 0 0 0 0 0.03 1850.11 0 0 0 0 0 0 0 0 0 0 0 0 0 
0 0 0 0 -1795.02 0 0 0 0 0 0 1150.01 2328.94 0 0 0 0 0 0 0 0 1397.82 0 0 0 0 0 0 0 -0.839259 0 0 0 1848.12 -1771.98 2410.28 0 0 391.324 0 0 0 190.664 0 89.4955 0 -853.679 0.03 -1078.75 0 0 1617.25 0 0 0 0 0 0 0 0 0 
0 0 0 0 -1904.74 0 0 0 0 0 17.3193 2189.78 0 0 0 0 0 -2273.71 -415.128 0 0 -391.324 0 0 2142.93 2344.97 0 0 0 0 0 0 0 0 0 0 0 1465.58 0 0 0 0 0 0 0 0 0 497.833 0.07 0 0 0 0 0 0 0 0 0 0 0 0 
0 0 1784.04 0 -872.295 0 0 0 0 54.5518 0 0 0 2287.9 0 -2197.87 0 0 0 0 0 0 0 0 0 0 0 0 0 0 0 0 0 0 0 0 0 0 0 210.501 0 0 0 595.492 0 0 0 0 0 0.09 0 0 0 0 0 0 0 0 0 0 0 
0 372.707 0 0 0 0 0 0 0 0 0 0 306.024 0 0 445.952 0 0 0 0 0 0 0 910.596 0 0 0 0 0 0 0 0 0 0 0 0 0 0 0 0 0 0 0 0 0 0 0 0 0 0 0.08 0 0 0 0 0 0 0 0 0 0 
0 0 0 0 -1390.96 0 0 0 0 492.645 0 0 0 0 0 0 0 0 0 0 0 0 0 0 0 0 0 0 0 -1123.62 0 0 0 258.263 0 0 841.014 0 450.072 0 0 0 0 474.639 533.235 0 0 -280.389 0 0 0 0.05 0 0 0 0 0 0 0 0 0 
-1371.43 0 0 0 0 0 0 2161.7 0 0 0 0 0 0 0 0 -37.9192 0 0 0 0 0 0 0 0 0 0 0 -1441.47 0 0 2450.1 0 539.949 0 0 0 0 1840.8 0 0 0 0 0 0 0 0 0 0 0 0 0 0.02 0 0 0 0 0 0 -1170.77 0 
0 0 0 0 513.398 0 0 0 -348.292 0 0 0 0 -1801.28 0 0 0 2310.17 0 0 0 1611.91 0 1030.23 444.426 0 0 -70.7266 0 0 0 -1233.79 0 0 0 0 0 0 0 -566.958 0 0 0 0 534.913 0 0 0 0 0 0 0 0 0.05 0 0 0 0 0 0 1682.87 
0 0 0 0 0 0 0 0 0 0 0 0 0 0 0 0 0 0 0 0 0 0 0 0 0 0 0 0 0 0 0 0 0 0 0 0 0 0 0 0 0 0 0 0 0 137.715 0 0 0 0 0 0 0 0 0.08 0 0 0 0 0 0 
0 0 0 0 0 0 0 0 0 0 0 0 0 0 0 0 0 0 0 0 0 0 0 0 0 0 0 0 0 0 0 2393.64 0 0 0 0 0 0 0 0 0 0 0 0 0 0 0 0 0 0 0 0 0 0 0 0.09 0 0 0 0 0 
0 0 0 0 0 0 0 0 0 0 0 0 0 0 0 0 0 0 0 0 0 0 0 0 0 0 0 0 0 0 0 0 0 0 0 0 0 0 0 612.583 0 0 0 0 0 0 0 0 0 0 0 0 0 0 0 0 0.05 0 0 0 0 
0 0 0 0 0 0 0 0 0 0 0 0 0 0 0 0 0 0 0 0 0 0 0 0 0 0 0 0 0 0 0 0 0 0 0 0 0 0 0 0 414.212 0 0 0 0 0 0 0 0 0 0 0 0 0 0 0 0 0.07 0 0 0 
0 0 0 0 0 0 0 0 0 0 0 0 0 0 0 0 0 0 0 0 0 0 0 0 0 0 0 0 0 0 0 0 0 0 0 0 0 1852.09 0 0 0 0 0 0 0 0 0 0 0 0 0 0 0 0 0 0 0 0 0.04 0 0 
0 0 0 0 0 0 0 0 0 0 0 0 0 0 0 0 0 0 0 0 0 0 0 0 0 0 0 0 0 0 0 0 0 0 0 0 0 0 0 0 0 0 0 0 0 0 0 0 0 0 0 0 687.811 0 0 0 0 0 0 0.08 0 
0 0 0 0 0 0 0 0 0 0 0 0 0 0 0 0 0 0 0 0 0 0 0 0 0 0 0 0 0 0 0 0 0 0 0 0 0 0 0 0 0 0 0 0 0 0 0 0 0 0 0 0 0 673.009 0 0 0 0 0 0 0.05 
