*Vertices 56
*Matrix 
0 0 -816.904 0 0 0 0 0 0 272.607 0 0 0 245.75 -2295.53 0 1273.92 0 0 -2496.03 0 0 -1088.37 0 2124.32 0 0 0 0 -833.842 0 0 0 -902.814 1535 0 1633.88 0 0 -1224.94 0 0 0 0 0 0 0 164.266 0 1842.33 0 0 1337.55 0 0 0 
0 0.06 0 0 2342.52 0 0 0 1678.29 0 0 0 0 -769.143 0 0 2133.93 0 -2056.72 1203.27 0 0 0 0 0 0 2150.56 2421.72 -2355.8 0 0 0 -1264.15 0 0 0 0 0 0 0 0 0 0 0 1269.49 0 0 0 -2083.27 0 0 -86.2911 3.89111 0 -1379.06 0 
-1152.76 0 0.01 0 317.774 5.26444 0 0 0 1637.85 0 0 0 0 0 0 0 0 -2199.39 0 0 -486.389 -1291.01 0 0 0 1810.59 -1931.14 1551.03 0 1686.07 0 0 0 -935.774 0 2356.72 1499.76 0 2283.01 -263.146 0 0 2354.12 0 0 0 0 0 0 0 0 -1184.65 0 102.161 0 
0 0 0 0 1965.01 0 0 0 0 0 787.606 764.412 -720.008 0 0 1426.36 0 254.601 0 0 0 0 0 0 0 1841.56 -1825.54 2252.34 0 0 0 0 0 0 0 0 0 0 0 1008.56 0 0 -485.778 1494.42 0 0 -1476.1 0 141.072 0 0 0 0 -2254.63 0 0 
0 129.017 -352.26 1932.36 0.01 0 0 0 0 0 -599.46 0 0 0 0 0 -1461.46 0 -2418.06 0 0 0 0 0 0 1009.78 0 1082.42 -1290.55 0 2301.63 0 0 0 0 0 0 0 0 0 0 563.143 0 0 0 0 0 -2184.9 0 0 1182.06 0 0 0 0 0 
0 0 -448.088 0 0 0 0 -2052.75 0 2121.57 1835.46 0 0 0 2442.01 -2176.2 1122.7 0 0 622.349 0 -1822.64 0 -1441.16 0 0 0 0 0 0 0 0 0 0 0 0 656.987 0 2171.32 0 -2132.56 0 -813.089 0 0 0 0 1671.42 0 0 0 0 0 0 0 0 
0 0 0 0 0 0 0.04 0 -1043.2 0 0 0 0 2111.35 0 0 0 -2488.56 771.279 0 0 -1793.5 0 231.407 0 -1717.2 0 886.181 1885.51 0 0 438.475 0 0 0 0 0 0 2300.87 0 0 0 0 0 0 0 0 0 0 0 0 1279.41 0 0 0 0 
0 0 0 0 0 -2295.68 0 0.08 0 0 0 1562.32 0 2405.24 2099.9 0 1802.5 2313.07 0 0 0 0 0 -1758.4 -988.418 -1805.55 0 0 1567.05 0 0 1226.62 0 0 0 0 0 0 2430.57 0 0 -185.781 0 0 0 0 0 0 613.956 0 0 0 0 0 952.101 0 
0 -2481.23 0 0 0 0 -1469.24 0 0.08 0 0 0 0 0 0 0 0 0 1989.73 0 -419.858 0 0 0 0 0 0 0 0 1446.5 814.615 0 0 0 0 0 2282.25 0 0 1395.84 0 0 1941.51 0 0 0 67.98 0 1962.11 0 1306.73 664.159 0 0 0 -1413.39 
2021.47 0 1377.22 0 0 1536.99 0 0 0 0.08 0 0 0 0 0 0 -1415.07 0 313.349 0 0 0 0 1611.15 -1111.71 -1735.51 0 0 0 0 -1672.64 0 0 0 0 0 0 0 0 0 2176.66 0 -123.218 1574.22 0 0 1153.83 0 0 0 1026.57 0 0 0 0 0 
0 0 0 -2232.96 -1415.52 -337.916 0 0 0 0 0.05 1773.2 1085.31 0 1776.41 0 0 -900.525 283.898 2445.52 0 0 0 0 0 2379.45 985.977 2204.28 0 0 0 0 0 0 0 0 0 0 0 0 0 0 0 304.346 0 0 460.601 0 0 0 0 -1892.68 0 0 0 0 
0 0 0 1465.42 0 0 0 1425.9 0 0 621.128 0.09 0 1491.67 0 0 -1028.24 0 0 0 0 -1272.85 0 -329.981 0 0 0 0 0 290.613 0 0 0 -561.922 0 0 -1501.13 0 -1836.38 1766.49 0 0 0 -414.975 -1041.22 0 -962.477 0 0 2040.24 0 0 0 -567.568 0 0 
0 0 0 -402.463 0 0 0 0 0 0 1416.9 0 0.05 1436.12 2180.17 -2459.87 0 0 0 0 2046.65 0 0 0 0 0 0 0 0 0 0 0 1648.38 0 0 0 2041.76 0 0 0 1761.45 0 0 0 0 -1325.8 -1885.36 351.497 0 217.826 0 0 0 0 0 0 
2240.14 -2188.25 0 0 0 0 -1422.85 -532.319 0 0 0 1471.53 1104.39 0.08 0 1137.35 0 0 0 0 0 0 0 0 0 0 0 0 0 0 -1748.48 0 1618.32 0 0 0 2347.56 0 1752.14 0 0 0 0 0 0 0 1437.5 -403.378 -518.281 922.651 0 0 0 0 0 0 
491.272 0 0 0 0 2173.45 0 2304.68 0 0 2169.03 0 1347.93 0 0 0 0 753.578 1692.48 0 0 2157.12 0 0 0 0 0 0 0 0 1092.79 0 0 -1560.03 -2115.47 252.007 0 0 -1646.7 0 0 0 0 0 -786.691 -1484.8 0 0 -2499.69 0 1381.8 0 0 0 0 0 
0 0 0 1068.38 0 1877.73 0 0 0 0 0 0 -65.9963 -883.74 0 0.03 0 0 0 0 0 -1480.99 0 0 0 1989.27 334.712 0 0 0 74.0837 1105.76 0 0 0 0 0 -1619.69 0 0 0 0 0 0 0 0 0 0 0 0 0 1601.08 2330.62 0 0 0 
-54.2467 -1280.79 0 0 2155.6 1714.91 0 1635.41 0 2472.69 0 1730.93 0 0 0 0 0.04 0 0 0 0 0 0 -2475.13 0 -1013.14 0 0 -1542.33 0 1043.2 0 0 0 0 0 0 0 -1672.95 1494.87 0 0 -135.731 0 0 0 -1218.53 0 0 1470.15 0 1664.71 0 0 0 0 
0 0 0 1379.82 0 0 594.729 -837.657 0 0 1649.3 0 0 0 -534.303 0 0 0.03 0 1630.38 0 0 0 0 0 -1716.44 -357.143 2327.57 0 0 1385.46 1478.09 -87.817 0 0 0 526.978 0 58.8244 2070.45 0 0 -1435.97 0 -1855.75 -335.322 0 0 0 0 0 0 0 0 0 0 
0 1528.29 684.606 0 -535.371 0 2073.96 0 -1821.88 -1701.64 -1093.1 0 0 0 -314.417 0 0 0 0.09 0 0 0 2341 0 0 0 0 0 0 0 0 0 2024.22 0 0 0 0 0 1561.56 0 0 -1180.84 0 0 0 -277.642 0 0 0 0 -644.627 -447.783 0 0 0 0 
1729.87 2070.76 0 0 0 431.761 0 0 0 0 -2310.02 0 0 0 0 0 0 2246.7 0 0.02 0 -324.641 -2415.16 0 0 1441.01 0 -1083.94 0 0 -2198.78 741.066 0 0 0 0 0 0 2274.62 0 0 0 0 -511.872 0 0 -37.9192 0 1991.56 0 0 0 -1166.8 0 944.319 0 
0 0 0 0 0 0 0 0 -2450.1 0 0 0 1569.8 0 0 0 0 0 0 0 0.06 0 0 0 0 2010.64 0 1156.58 0 0 0 0 0 0 0 0 -1787.55 0 0 0 0 0 0 0 0 0 1609.01 0 898.846 0 0 0 1737.8 -2038.1 0 0 
0 0 -65.0807 0 0 -2152.7 -277.795 0 0 0 0 -1131.4 0 0 321.894 1691.56 0 0 0 -2403.1 0 0 812.021 0 0 0 0 2361.29 0 0 0 0 -1296.35 1763.74 0 1352.66 0 0 0 0 0 0 1003.98 0 0 0 0 0 0 0 0 712.378 1519.44 0 0 0 
-1361.2 0 -939.283 0 0 0 0 0 0 0 0 0 0 0 0 0 0 0 2268.97 2044.97 0 -1371.88 0.01 0 0 0 1922.44 0 0 -1124.38 -419.401 695.288 0 1876.81 0 0 1335.87 0 0 -786.233 0 0 -1845.38 1639.38 0 0 158.62 1209.52 -311.823 0 0 0 -1695.23 0 0 0 
0 0 0 0 0 1869.79 -1681.34 -719.55 0 2418.06 0 -817.972 0 0 0 0 2322.08 0 0 0 0 0 0 0.07 -2270.2 -71.4896 1834.09 0 1676.76 0 0 0 0 0 2097.77 0 72.7104 0 0 0 0 0 0 0 1477.32 0 0 0 0 0 1530.43 0 0 0 0 0 
-2018.11 0 0 0 0 0 0 1699.5 0 449.919 0 0 0 0 0 0 0 0 0 0 0 0 0 607.852 0 0 2454.99 0 0 0 0 -1629 1278.65 -1867.05 0 0 0 0 0 0 0 -1222.95 -710.395 0 0 344.172 -470.214 0 0 2157.89 0 0 0 0 0 -1395.08 
0 0 0 -1620.46 2018.57 0 1907.18 1771.07 0 2089.98 -807.291 0 0 0 0 -609.073 1656.93 1251.49 0 -1193.96 -1534.55 0 0 1524.17 0 0.08 0 0 0 0 -508.82 0 0 0 874.889 108.722 0 0 509.735 0 -2034.14 0 1781.14 0 362.484 0 0 -2035.66 -1092.64 0 -2241.81 0 0 0 0 0 
0 280.541 1367.92 1364.1 0 0 0 0 0 0 249.565 0 0 0 0 -288.018 0 2366.48 0 0 0 0 -1817.61 -303.888 -1331.29 0 0.07 0 2495.27 0 0 867.718 0 1014.66 0 0 0 0 0 0 0 0 0 65.8437 0 0 0 0 0 4.95926 0 1298.18 0 0 0 0 
0 -196.158 1688.36 -978.195 -1423.31 0 1788.61 0 0 0 -746.254 0 0 0 0 0 0 264.977 0 2282.71 1014.82 -1377.68 0 0 0 0 0 0.02 0 0 0 0 1519.59 -425.81 0 0 0 0 0 1685.16 0 0 0 0 -2370.14 0 -1717.51 0 0 0 0 152.058 0 1042.59 0 0 
0 -511.567 687.658 0 1998.89 0 1087.15 -587.252 0 0 0 0 0 0 0 0 1390.35 0 0 0 0 0 0 1209.83 0 0 1728.34 0 0.06 0 0 0 352.26 0 0 0 0 -2098.38 0 0 0 0 0 1741.46 0 0 0 1194.11 0 0 0 0 0 0 -2488.86 -1566.59 
-838.115 0 0 0 0 0 0 0 1510.74 0 0 998.642 0 0 0 0 0 0 0 0 0 0 1466.34 0 0 0 0 0 0 0 0 0 1665.47 1399.2 0 0 -2114.55 0 -1280.79 0 0 0 0 914.258 0 0 0 0 0 1794.56 -452.818 0 -1389.13 0 0 0 
0 0 -859.935 0 2297.05 0 0 0 2212.97 -1563.23 0 0 0 440.611 796.152 -1647.77 1341.21 606.174 0 -2210.23 0 0 -931.959 0 0 -323.878 0 0 0 0 0.02 0 512.787 0 0 0 0 0 0 0 0 0 1548.13 0 0 0 0 0 0 0 -2022.84 0 0 0 0 0 
0 0 0 0 0 0 1591.77 -920.515 0 0 0 0 0 0 0 -2104.79 0 1664.1 0 -1005.51 0 0 720.008 0 1009.78 0 1251.95 0 0 0 0 0.05 0 486.236 0 0 0 0 951.491 0 814.92 0 0 0 0 0 -2426.91 2383.57 446.104 -362.484 0 0 0 0 0 1896.04 
0 -529.115 0 0 0 0 0 0 0 0 0 0 2053.06 1981.8 0 0 0 -2136.22 -525.147 0 0 2115.47 0 0 -332.728 0 0 872.906 1303.52 -1055.71 -1781.9 0 0.06 0 0 0 0 0 0 109.18 0 0 0 0 0 -2178.79 0 -155.416 0 0 0 0 1344.57 0 0 0 
431.15 0 0 0 0 0 0 0 0 0 0 1361.66 0 0 358.821 0 0 0 0 0 0 2044.36 -1077.68 0 1496.55 0 -1856.06 897.168 0 2378.38 0 1486.33 0 0.03 -1770.46 0 -236.137 0 0 0 -1479.77 0 0 0 0 0 -859.63 0 0 0 0 0 -1719.95 0 0 0 
-1035.26 0 2219.84 0 0 0 0 0 0 0 0 0 0 0 -848.186 0 0 0 0 0 0 0 0 2039.78 0 1204.95 0 0 0 0 0 0 0 -1725.14 0.04 0 0 -373.318 0 0 1435.51 0 0 0 0 0 0 0 0 0 -2376.55 305.261 0 0 2423.7 0 
0 0 0 0 0 0 0 0 0 0 0 0 0 0 2180.62 0 0 0 0 0 0 795.083 0 0 0 -1652.04 0 0 0 0 0 0 0 0 0 0.09 -721.534 0 0 0 0 0 1706.06 0 0 2136.52 0 -2432.4 0 971.48 0 -2179.1 0 540.559 0 -22.0496 
509.888 0 -509.735 0 0 -477.844 0 0 -1552.55 0 0 1572.39 427.335 -193.106 0 0 0 1791.21 0 0 -1929.46 0 2234.95 168.538 0 0 0 0 0 -958.51 0 0 0 1894.06 0 -708.258 0.08 0 0 0 0 2279.5 688.574 0 -1293.76 0 0 0 0 0 0 0 0 0 0 0 
0 0 1417.05 0 0 0 0 0 0 0 0 0 0 0 0 649.815 0 0 0 0 0 0 0 0 0 0 0 0 1316.8 0 0 0 0 0 1046.56 0 0 0.03 0 956.984 0 0 0 0 532.624 0 0 0 -863.292 0 0 -309.229 0 0 0 0 
0 0 0 0 0 -746.254 -1613.74 1285.21 0 0 0 2208.7 0 328.913 -1477.32 0 35.9355 2209.77 -189.901 -996.506 0 0 0 0 0 1496.7 0 0 0 66.3015 0 1620.15 0 0 0 0 0 0 0.09 0 0 0 0 1283.07 0 0 0 0 0 0 0 -454.039 0 -176.473 587.863 0 
2149.34 0 689.032 1457.95 0 0 0 0 -74.0837 0 0 1739.17 0 0 0 0 -1057.08 2030.17 0 0 0 0 2026.51 0 0 0 0 285.73 0 0 0 0 1023.82 0 0 0 0 1270.41 0 0.08 0 0 0 0 1262.32 1240.65 0 2317.8 -818.888 0 0 0 0 0 0 0 
0 0 -381.1 0 0 -1139.48 0 0 0 -1557.89 0 0 917.31 0 0 0 0 0 0 0 0 0 0 0 0 1287.8 0 0 0 0 0 1359.83 0 2167.5 1010.24 0 0 0 0 0 0.06 0 1419.64 1239.74 2351.53 0 0 0 1108.51 0 0 0 518.891 0 0 0 
0 0 0 0 -367.061 0 0 2400.97 0 0 0 0 0 0 0 0 0 0 1871.01 0 0 0 0 0 1443.6 0 0 0 0 0 0 0 0 0 0 0 2185.81 0 0 0 0 0.09 0 0 0 0 38.377 -794.168 1477.32 64.0126 -1380.89 -1639.84 -1527.38 0 0 1661.2 
0 0 0 -295.801 0 -2194.97 0 0 1914.2 -21.2867 0 0 0 0 0 0 -2331.69 -2455.6 0 0 0 -1006.58 -219.657 0 482.269 1781.29 0 0 0 0 1735.51 0 0 0 0 -1569.8 1129.57 0 0 0 1223.87 0 0.01 -669.958 0 2269.13 0 2036.12 2157.73 2172.84 0 0 0 0 0 0 
0 0 -353.786 30.2896 0 0 0 0 0 416.501 1148.34 -205.466 0 0 0 0 0 0 0 -1720.71 0 0 1658.91 0 0 0 1813.49 0 -310.907 1337.55 0 0 0 0 0 0 0 0 -628.3 0 364.162 0 1842.33 0.04 0 0 0 1061.05 0 -388.272 0 0 0 0 0 24.9489 
0 2442.01 0 0 0 0 0 0 0 0 0 -1790.75 0 0 671.484 0 0 -369.503 0 0 0 0 0 2055.35 0 348.14 0 1607.79 0 0 0 0 0 0 0 0 -10.3 657.598 0 170.827 -49.8215 0 0 0 0.05 0 2474.52 1854.38 0 0 0 1136.28 0 0 0 0 
0 0 0 0 0 0 0 0 0 0 0 0 1827.07 0 1860.48 0 0 2121.57 1578.95 0 0 0 0 0 -1956.62 0 0 0 0 0 0 0 -2126.91 0 0 -1377.99 0 0 0 -4.1963 0 0 1101.03 0 0 0.02 -1350.83 1017.41 0 0 0 -417.264 1853.77 0 0 0 
0 0 0 312.891 0 0 0 0 137.257 -1775.19 996.048 -1614.35 1247.83 55.0096 0 0 2149.04 0 0 769.448 192.648 0 1661.96 0 -2090.75 0 0 828.349 0 0 0 -2417.29 0 483.184 0 0 0 0 0 0 0 307.703 0 0 2476.04 -544.526 0.05 0 0 0 0 0 2374.26 0 0 0 
-492.492 0 0 0 -462.127 -243.767 0 0 0 0 0 0 1259.58 721.686 0 0 0 0 0 0 0 0 1052.05 0 0 1127.58 0 0 1688.67 0 0 -818.125 1713.23 0 0 1907.64 0 0 0 -428.251 0 -1174.58 343.41 335.017 2152.85 -1269.04 0 0.01 0 0 -2051.07 0 0 0 0 0 
0 738.166 0 784.097 0 0 0 -73.6259 -42.1918 0 0 0 0 935.774 1272.55 0 0 0 0 -206.381 692.694 0 1836.53 0 0 469.756 0 0 0 0 0 1050.52 0 0 0 0 0 -425.81 0 1672.49 -1511.96 -530.793 -144.124 0 0 0 0 0 0 0 0 0 0 0 0 0 
-1330.23 0 0 0 0 0 0 0 0 0 0 2173.3 1906.87 960.494 0 0 -130.543 0 0 0 0 0 0 0 665.838 0 -1094.93 0 0 1522.8 0 -356.227 0 0 0 -43.4126 0 0 0 0 0 -1297.42 2444.15 377.285 0 0 0 0 0 0.08 0 0 566.958 0 0 0 
0 0 0 0 1788.92 0 0 0 -478.301 -586.642 0 0 0 0 214.774 0 0 0 667.211 0 0 0 0 313.501 0 1263.08 0 0 0 569.247 1718.73 0 0 0 -1742.99 0 0 0 0 0 0 -64.7755 0 0 0 0 0 1797.01 0 0 0 0 0 0 0 0 
0 -2440.95 0 0 0 0 -404.752 0 1371.73 0 1742.53 0 0 0 0 2252.49 -1774.88 0 -2476.5 0 0 -618.534 0 0 0 0 -983.993 2267.45 0 0 0 0 0 0 470.367 1984.54 0 2403.71 1499.45 0 0 1424.07 0 0 1855.6 -1300.01 0 0 0 0 0 0.06 0 0 0 0 
1680.58 423.826 -405.21 0 0 0 0 0 0 0 0 0 0 0 0 1351.59 0 0 0 -2307.73 2027.27 -2063.28 2074.72 0 0 0 0 0 0 1741.61 0 0 572.451 -12.8941 0 0 0 0 0 0 -1885.05 -1808.91 0 0 0 1102.56 -968.734 0 0 2490.08 0 0 0.07 0 0 0 
0 0 0 -468.993 0 0 0 0 0 0 0 -105.976 0 0 0 0 0 0 0 0 -1166.8 0 0 0 0 0 0 1960.43 0 0 0 0 0 0 0 -991.47 0 0 1528.75 0 0 0 0 0 0 0 0 0 0 0 0 0 0 0.01 0 0 
0 396.817 446.715 0 0 0 0 -1396.76 0 0 0 0 0 0 0 0 0 0 0 41.1237 0 0 0 0 0 0 0 0 -853.221 0 0 0 0 0 2370.75 0 0 0 263.298 0 0 0 0 0 0 0 0 0 0 0 0 0 0 0 0.07 0 
0 0 0 0 0 0 0 0 537.202 0 0 0 0 0 0 0 0 0 0 0 0 0 0 0 767.159 0 0 0 2245.93 0 0 -1423.31 0 0 0 1102.25 0 0 0 0 0 -892.438 0 -1388.82 0 0 0 0 0 0 0 0 0 0 0 0.01 
