*Vertices 56
*Matrix 
0.04 0 0 0 0 0 0 0 0 -226.524 0 0 0 0 796.152 0 0 1614.81 0 0 0 0 0 1893.29 0 0 0 0 0 0 -257.958 0 0 0 0 0 0 0 2299.65 -28.7637 0 0 0 0 0 0 0 0 0 1688.21 0 2176.2 0 0 0 0 
0 0.02 -63.2496 0 1879.41 0 0 0 913.953 0 -1777.32 0 1943.8 0 -881.451 0 -873.363 0 0 0 -545.595 0 0 0 0 0 0 1184.04 0 -228.507 0 0 0 453.429 0 0 0 535.066 0 0 0 0 0 0 0 -557.344 0 0 0 0 0 0 2303.77 0 0 -47.2274 
0 -59.1296 0.07 0 0 0 -338.527 0 2052.6 0 0 0 0 0 0 1889.17 0 0 0 0 0 0 0 0 0 0 0 0 0 0 1279.56 0 0 1511.96 0 0 -17.4718 1583.83 -2186.42 0 0 0 0 0 219.962 0 0 0 0 0 0 0 0 0 0 0 
0 0 0 0.05 0 238.578 0 0 0 0 2291.25 662.328 0 447.63 0 0 0 2068.93 0 356.075 0 0 0 0 0 0 0 0 0 0 0 0 0 0 2098.07 0 0 1868.11 0 0 44.3281 0 0 0 0 0 0 0 0 0 0 0 0 0 810.343 0 
0 667.974 0 0 0.07 2351.22 0 0 0 0 0 0 0 1955.09 0 0 435.728 0 0 -298.7 0 -481.201 0 0 0 0 0 -1666.08 0 2483.83 0 0 1264.31 0 0 0 0 0 0 0 0 0 0 0 0 826.518 0 104.755 0 0 0 0 1785.71 0 0 0 
0 0 0 913.8 -1865.21 0.09 0 0 0 0 0 1615.27 0 0 -895.032 2387.39 -1807.69 -165.792 0 0 0 1531.5 2375.94 0 0 0 0 0 0 0 2449.95 0 -878.094 0 0 0 0 0 0 0 0 0 0 0 0 0 0 0 0 0 0 -794.473 0 0 0 27.0852 
0 0 1846.9 0 0 0 0.06 0 0 2181.69 0 988.571 0 0 -1986.37 0 0 0 901.593 0 0 -161.061 0 0 0 1808.76 1764.2 0 973.922 0 1948.53 0 2243.49 203.024 0 1168.94 0 0 -621.281 2325.59 0 0 0 763.192 0 0 0 0 0 0 -1463.13 0 0 0 0 0 
0 0 0 0 0 0 0 0.06 0 0 -1815.62 0 0 1628.54 0 0 0 0 0 0 1998.43 0 0 0 0 0 -1570.86 -987.96 -1956.62 1884.14 -2313.07 0 -2273.09 0 0 0 1568.27 445.341 444.884 2079.91 0 1746.04 -2341 0 1506.32 0 0 0 0 0 0 481.506 0 0 0 -309.076 
0 2019.18 1144.22 0 0 0 0 0 0.02 0 -993.301 1329.31 0 0 0 1937.39 0 0 0 0 0 0 713.904 996.658 -2017.04 0 0 0 0 0 0 0 0 0 0 0 0 817.82 -1019.09 0 0 0 0 0 0 0 0 0 0 0 0 0 0 0 -533.998 0 
1072.95 0 0 0 0 0 2248.22 0 0 0.01 0 0 0 0 263.298 0 608.31 -1021.38 0 0 1794.72 0 0 0 0 2222.59 0 0 0 0 0 0 0 0 0 0 0 0 -73.1681 1692.33 0 0 -268.181 0 0 0 0 0 0 0 0 0 0 0 0 0 
0 1035.42 0 -876.263 0 0 0 -704.291 885.266 0 0.09 0 0 0 0 0 0 0 0 0 0 -13.0467 0 0 0 0 0 531.861 0 -1352.5 0 0 0 0 0 1664.4 0 0 0 0 0 0 1336.63 0 0 0 0 0 0 0 0 0 0 -866.802 0 0 
0 0 0 446.562 0 -920.82 2218.01 0 -1598.03 0 0 0 0 0 2487.64 -2091.05 -325.251 -450.224 -84.9178 0 2022.84 0 -1812.42 0 2292.32 1347.77 0 0 0 0 0 1993.85 0 0 0 0 0 1066.55 0 -1449.25 0 0 0 0 0 -1813.03 620.823 0 0 0 0 0 0 0 0 0 
0 -263.604 0 0 0 0 0 0 0 0 0 0 0.01 -1831.34 0 0 1861.86 0 2204.28 -748.543 0 0 0 0 0 0 0 0 2120.2 0 0 -436.033 0 -1432.92 924.329 -706.58 0 -154.958 0 0 0 0 0 0 -1183.28 0 1244.01 0 0 0 0 0 0 0 0 0 
0 0 0 -359.737 168.081 0 0 -1578.65 0 0 0 0 2196.65 0.07 0 0 0 17.4718 0 0 0 0 0 0 -2409.36 516.449 0 0 0 2022.54 2392.42 0 2332.76 -894.269 0 0 0 0 0 2114.55 0 0 0 0 0 0 1333.12 2058.85 0 0 0 0 -1602.76 0 0 0 
382.168 146.565 0 0 0 -1379.21 -1445.74 0 0 493.713 0 1084.4 0 0 0.02 0 1587.8 0 0 1561.1 0 0 400.174 0 0 0 -424.894 0 0 0 0 2492.07 0 0 0 994.064 -383.999 391.324 0 0 0 -975.906 0 0 1351.89 0 0 0 0 0 0 -320.978 0 0 0 0 
0 0 -49.9741 0 0 -2340.24 0 0 861.766 0 0 -929.06 0 0 0 0.08 0 0 -634.098 0 0 0 -2052.6 -178.304 1862.47 1004.75 -1231.65 0 0 0 1915.42 0 0 0 0 1426.05 0 1174.43 0 0 0 1769.39 -276.879 1283.68 0 1382.87 0 -126.576 0 1573.76 0 0 0 0 0 0 
0 2189.78 0 0 973.922 1567.96 0 0 0 -1311.46 0 -442.442 1976.15 0 758.156 0 0.02 945.082 729.926 0 0 1351.59 -923.719 0 -961.715 0 220.573 0 0 0 0 0 0 0 -1303.06 0 0 0 0 0 0 0 0 0 -1188.16 0 0 0 0 0 0 0 0 0 0 0 
2228.39 0 0 654.241 0 -1568.27 0 0 0 -639.592 0 1444.06 0 991.47 0 0 -1979.35 0.07 0 0 0 0 0 1333.89 0 0 0 0 0 0 1461.91 0 0 0 0 0 0 0 1189.08 0 0 0 0 0 0 0 0 -283.898 721.686 0 0 -2252.49 0 0 0 0 
0 0 0 0 0 0 2485.66 0 0 0 0 1808.45 88.8852 0 0 -1370.82 1984.54 0 0.05 0 0 0 -1250.42 -1436.12 0 0 0 0 981.399 -418.943 0 633.641 0 359.279 1036.79 -980.941 0 0 0 0 0 0 0 0 0 0 0 0 823.618 0 0 0 0 0 0 0 
0 0 0 450.224 901.746 0 0 0 0 0 0 0 1396.15 0 1763.28 0 0 0 0 0.05 0 0 0 0 0 -1880.02 0 0 -919.446 0 0 0 0 1699.5 0 0 -2261.19 0 0 0 0 905.255 0 0 0 0 0 0 0 0 0 0 0 0 0 0 
0 808.359 0 0 0 0 0 1879.86 0 -1747.11 0 1951.89 0 0 0 0 0 0 0 0 0.06 0 0 -1078.14 0 0 0 0 571.993 0 0 0 0 0 642.796 0 0 0 0 0 0 0 0 0 0 0 0 0 0 -843.608 0 750.374 0 1048.84 0 0 
0 0 0 0 -796.457 -1351.44 798.135 0 0 0 2331.84 0 0 0 0 0 -527.741 0 0 0 0 0.04 0 0 2477.57 0 0 0 0 0 0 0 1298.49 0 0 0 68.1326 0 -58.6718 -823.923 0 0 0 0 0 0 0 -664.769 0 0 0 0 -2196.8 0 1460.54 0 
0 0 0 0 0 409.635 0 0 1846.45 0 0 954.543 0 0 1374.32 1564.61 -819.803 0 1719.95 0 0 0 0.01 0 0 0 0 0 0 0 0 0 0 0 1253.47 0 0 -505.615 0 0 0 0 0 0 0 0 0 0 0 0 0 0 -678.655 0 0 0 
2499.69 0 0 0 0 0 0 0 959.883 0 0 0 0 0 0 2474.21 0 384.61 -1870.4 0 -1637.39 0 0 0.03 0 0 0 2129.35 0 1284.45 70.8792 0 0 2066.33 -2376.25 2472.53 0 0 0 0 0 0 0 0 0 0 0 0 2297.97 0 1770.46 0 0 0 -2465.67 0 
0 0 0 0 0 0 0 0 -137.562 0 0 -1556.67 0 -1639.99 0 2290.19 -1786.78 0 0 0 0 2417.14 0 0 0.08 0 0 0 2441.86 0 2037.95 0 0 0 0 0 0 0 0 0 0 0 0 0 0 0 0 0 0 0 0 0 0 0 0 0 
0 0 0 0 0 0 -747.017 0 0 -700.323 0 189.138 0 2474.82 0 1772.9 0 0 0 -1260.64 0 0 0 0 0 0.01 0 0 0 0 0 446.257 0 0 0 0 473.876 1955.09 1008.26 -611.362 0 0 0 0 0 0 -847.88 0 0 0 0 0 0 -1539.12 0 0 
0 0 0 0 0 0 871.99 392.239 0 0 0 0 0 0 -1583.68 1966.54 -878.552 0 0 0 0 0 0 0 0 0 0 0 0 617.924 0 0 0 0 0 1775.34 968.734 0 0 95.4466 0 0 0 0 0 0 0 0 0 0 0 0 0 0 0 1544.16 
0 1488.77 0 0 1929 0 0 1516.24 0 0 905.408 0 0 0 0 0 0 0 0 0 0 0 0 1995.68 0 0 0 0.04 -608.31 -2200.31 1834.24 0 0 0 0 228.05 0 222.556 1111.1 0 0 0 0 0 0 0 0 0 0 -1592.68 -1645.48 0 0 0 0 0 
0 0 0 0 0 0 389.187 -486.084 0 0 0 0 1064.41 0 0 0 0 0 666.448 2309.41 -30.9 0 0 0 -94.8363 0 0 2421.11 0.09 0 1679.2 0 0 0 0 -206.381 0 -1226.77 0 0 -709.174 0 0 0 0 0 -279.473 743.507 0 0 -1323.97 0 0 1639.68 0 0 
0 1863.84 0 0 1208.46 0 0 -1974.62 0 0 -1148.79 0 0 718.787 0 0 0 0 -43.7178 0 0 0 0 1972.95 0 0 -729.469 1607.33 0 0.05 1688.82 2442.63 2353.21 0 0 0 0 0 0 0 0 0 0 0 0 0 0 0 0 0 0 0 0 0 0 0 
2376.25 0 -1784.49 0 0 1171.07 -84.1548 2205.65 0 0 0 0 0 2371.82 0 815.989 0 -2350.31 0 0 0 0 0 380.642 686.895 0 0 542.848 1651.43 -1169.24 0.02 0 0 670.11 2064.04 0 0 0 0 146.718 0 0 0 0 0 0 0 0 0 0 0 0 0 0 0 0 
0 0 0 0 0 0 0 0 0 0 0 1025.65 416.349 0 -1464.96 0 0 0 2315.06 0 0 0 0 0 0 -2017.81 0 0 0 2192.83 0 0.06 0 0 0 0 -1329.16 1850.72 0 -1157.95 0 0 1733.68 0 0 0 0 0 0 0 0 0 -2478.64 0 0 0 
0 0 0 0 -326.93 297.327 1326.26 1586.73 0 0 0 0 0 622.196 0 0 0 0 0 0 0 1904.13 0 0 0 0 0 0 0 159.23 0 0 0.02 -212.18 0 0 0 0 0 0 1724.52 0 0 0 0 0 0 0 0 0 0 0 0 0 0 0 
0 2050.31 2464.14 0 0 0 -2259.51 0 0 0 0 0 1036.18 1443.3 0 0 0 0 1948.68 -468.841 0 0 0 -1568.73 0 0 0 0 0 0 -1234.24 0 1164.82 0.01 0 -1872.84 0 1792.43 0 550.325 2073.81 0 0 0 0 0 0 0 0 0 0 0 0 0 0 0 
0 0 0 62.0289 0 0 0 0 0 0 0 0 110.553 0 0 0 -216.453 0 285.73 0 847.88 0 1550.72 -270.013 0 0 0 0 0 0 171.133 0 0 0 0.09 0 0 0 0 0 0 0 0 0 0 0 0 1045.64 -1057.24 0 0 1396.45 0 0 456.481 0 
0 0 0 0 0 0 1573.31 0 0 0 528.809 0 1212.12 0 100.024 -1923.66 0 0 100.482 0 0 0 0 -1262.17 0 0 751.442 2407.07 -563.295 0 0 0 0 1691.72 0 0.02 0 0 0 0 0 -1546.91 0 0 0 0 0 0 0 -1042.59 0 0 0 0 1917.4 0 
0 0 -958.052 0 0 0 0 -38.6822 0 0 0 0 0 0 393.918 0 0 0 0 1533.63 0 201.041 0 0 0 1623.81 2447.97 0 0 0 0 1000.47 0 0 0 0 0.02 0 682.47 -677.435 0 0 0 0 0 0 0 0 0 -2360.23 -1495.64 0 0 0 0 2426.3 
0 -399.411 1843.09 -2036.12 0 0 0 2066.03 1507.54 0 0 -300.226 -18.6926 0 2202.75 -248.039 0 0 0 0 0 0 -676.824 0 0 622.959 0 -864.818 1975.39 0 0 -1349.3 0 621.891 0 0 0 0.01 0 632.725 1878.64 0 0 0 0 0 -66.4541 0 -365.688 0 0 0 325.251 0 0 0 
480.285 0 -1974.62 0 0 0 977.126 319.3 -538.881 -1363.03 0 0 0 0 0 0 0 2326.65 0 0 0 -1098.9 0 0 0 2319.03 0 1739.17 0 0 0 0 0 0 0 0 759.377 0 0.06 0 0 -1322.9 506.836 -1054.49 0 0 0 391.324 0 0 0 0 0 0 0 0 
1964.86 0 0 0 0 0 1486.79 -1415.68 0 1553.16 0 -1386.99 0 -2268.21 0 0 0 0 0 0 0 720.161 0 0 0 2.06 -213.706 0 0 0 2450.71 1234.4 0 2429.5 0 0 2468.72 2187.19 0 0.02 0 0 0 0 0 0 0 0 0 0 0 0 -674.23 0 0 0 
0 0 0 1938 0 0 0 0 0 0 0 0 0 0 0 0 0 0 0 0 0 0 0 0 0 0 0 0 2269.13 0 0 0 1238.21 -2343.44 0 0 0 -330.744 0 0 0.03 0 0 0 0 0 0 0 0 0 0 0 0 0 0 0 
0 0 0 0 0 0 0 629.826 0 0 0 0 0 0 129.17 1034.35 0 0 0 952.406 0 0 0 0 0 0 0 0 0 0 0 0 0 0 0 72.2526 0 0 1356.93 0 0 0.06 0 0 -408.414 0 0 0 0 0 0 0 0 0 0 0 
0 0 0 0 0 0 0 -1309.78 0 2044.66 1520.05 0 0 0 0 -681.86 0 0 0 0 0 0 0 0 0 0 0 0 0 0 0 1658.45 0 0 0 0 0 0 -511.261 0 0 0 0.05 0 0 -173.421 0 0 0 0 0 1228.45 0 0 991.165 0 
0 0 0 0 0 0 1705.45 0 0 0 0 0 0 0 0 -1145.89 0 0 0 0 0 0 0 0 0 0 0 0 0 0 0 0 0 0 0 0 0 0 1650.21 0 0 0 0 0.03 0 0 0 0 0 0 0 0 0 0 0 0 
0 0 1754.13 0 0 0 0 2424.77 0 0 0 0 1532.87 0 -1098.28 0 2440.49 0 0 0 0 0 0 0 0 0 0 0 0 0 0 0 0 0 0 0 0 0 0 0 0 1275.29 0 0 0.02 1502.35 0 0 0 0 -94.5311 0 0 0 0 0 
0 -2254.33 0 0 163.503 0 0 0 0 0 0 2399.14 0 0 0 1215.02 0 0 0 0 0 0 0 0 0 0 0 0 0 0 0 0 0 0 0 0 0 0 0 0 0 0 1463.59 0 2197.41 0.08 0 0 0 0 0 0 0 0 0 -1520.2 
0 0 0 0 0 0 0 0 0 0 0 1440.7 523.316 528.199 0 0 0 0 0 0 0 0 0 0 0 -2114.7 0 0 -0.228889 0 0 0 0 0 0 0 0 2081.44 0 0 0 0 0 0 0 0 0.07 0 0 0 0 0 0 0 0 0 
0 0 0 0 -266.655 0 0 0 0 0 0 0 0 1082.42 0 2274.62 0 1041.37 0 0 0 -164.113 0 0 0 0 0 0 1859.57 0 0 0 0 0 -1073.56 0 0 0 1654.18 0 0 0 0 0 0 0 0 0.05 0 0 0 0 0 0 0 0 
0 0 0 0 0 0 0 0 0 0 0 0 0 0 0 0 0 1299.86 488.067 0 0 0 0 2088.61 0 0 0 0 0 0 0 0 0 0 -905.255 0 0 -924.94 0 0 0 0 0 0 0 0 0 0 0.01 0 1128.35 0 -1175.65 0 0 0 
71.6422 0 0 0 0 0 0 0 0 0 0 0 0 0 0 1514.1 0 0 0 0 -2087.08 0 0 0 0 0 0 1699.8 0 0 0 0 0 0 0 1203.27 -1918.78 0 0 0 0 0 0 0 0 0 0 0 0 0.02 0 0 0 1130.02 0 0 
0 0 0 0 0 0 349.208 0 0 0 0 0 0 0 0 0 0 0 0 0 0 0 0 -2446.44 0 0 0 524.689 2149.34 0 0 0 0 0 0 0 1605.5 0 0 0 0 0 0 0 2311.4 0 0 0 136.799 0 0.06 0 0 0 0 0 
2441.71 0 0 0 0 251.396 0 1684.09 0 0 0 0 0 0 -1294.82 0 0 -753.578 0 0 255.516 0 0 0 0 0 0 0 0 0 0 0 0 0 -1102.71 0 0 0 0 0 0 0 -820.261 0 0 0 0 0 0 0 0 0.04 0 0 0 1913.13 
0 2374.57 0 0 -775.399 0 0 0 0 0 0 0 0 1867.96 0 0 0 0 0 0 0 1264.46 -1867.96 0 0 0 0 0 0 0 0 618.534 0 0 0 0 0 2161.4 0 460.448 0 0 0 0 0 0 0 0 1155.51 0 0 0 0 0 0 0 
0 0 0 0 0 0 0 0 0 0 -1.14444 0 0 0 0 0 0 0 0 0 -1958.3 0 0 0 0 2187.64 0 0 -912.427 0 0 0 0 0 0 0 0 0 0 0 0 0 0 0 0 0 0 0 0 1242.64 0 0 0 0.04 0 0 
0 0 0 2421.41 0 0 0 0 -1768.47 0 0 0 0 0 0 0 0 0 0 0 0 1499.3 0 -1287.35 0 0 0 0 0 0 0 0 0 0 1488.46 1387.91 0 0 0 0 0 0 -650.426 0 0 0 0 0 0 0 0 0 0 0 0.01 0 
0 -2051.53 0 0 0 -1028.09 0 944.319 0 0 0 0 0 0 0 0 0 0 0 0 0 0 0 0 0 0 1858.2 0 0 0 0 0 0 0 0 0 1399.35 0 0 0 0 0 0 0 0 968.123 0 0 0 0 0 244.835 0 0 0 0.05 
