*Vertices 57
*Matrix 
0.05 -702.612 0 0 0 0 0 0 0 0 0 -24.3385 0 0 0 2138.2 0 0 0 954.695 0 -1939.83 0 0 1850.57 -1323.97 0 0 -538.118 1887.8 2420.65 0 0 1389.58 1218.83 638.218 2193.75 -1942.43 0 0 0 0 0 0 0 0 0 -1917.4 0 1784.34 -527.741 -1252.71 0 -2483.67 0 0 0 
-649.968 0 2418.36 1898.33 0 0 2171.77 0 -2102.04 1570.86 0 323.267 -722.602 0 0 -2228.23 0 0 0 0 0 0 0 1350.06 0 0 0 0 0 0 0 1655.71 -1548.28 0 0 0 0 -1499.91 0 124.134 0 0 -2054.73 0 0 0 1880.32 0 0 0 0 0 0 0 0 0 0 
0 60.8081 0.03 2415.77 2360.38 0 0 0 278.1 0 0 0 1946.7 -2024.06 0 4.0437 224.998 0 2322.23 0 0 0 0 0 0 0 0 0 -313.349 0 0 2078.54 0 0 0 0 0 -2300.1 1695.07 0 0 0 0 0 1796.4 0 321.894 108.112 0 -123.524 208.975 0 0 0 0 0 0 
0 1600.77 2465.21 0.04 -1450.62 0 0 0 -627.689 614.414 1116.14 0 0 0 2422.33 -508.972 0 -238.273 0 0 0 0 0 0 0 0 -2190.39 0 0 -1681.19 0 0 0 0 0 0 0 961.562 0 -1721.63 0 1300.47 0 0 -2402.04 0 0 -32.1207 0 -19.7607 1814.25 -479.522 0 0 2.06 0 0 
0 0 285.272 -1836.83 0.04 0 -1468.02 0 0 0 0 0 0 0 0 1957.08 2375.48 651.189 0 0 0 -2185.51 0 -2410.89 0 0 -1092.49 0 0 0 2464.45 2482.76 0 0 0 -67.3696 0 0 0 0 0 0 0 0 0 0 1068.68 0 0 0 813.7 0 0 -1267.51 -608.615 0 527.436 
0 0 0 0 0 0.06 2032.15 749.458 0 0 0 -177.999 0 -2295.83 0 0 0 0 2414.85 -811.258 1560.03 0 0 -660.649 0 0 0 0 0 0 1110.95 1405.3 0 0 -1505.86 0 0 0 0 0 0 -492.798 1235.01 0 0 -137.715 0 0 0 -1493.04 0 0 -466.857 0 0 1583.99 0 
0 -1876.05 0 0 1452.3 1312.52 0.03 0 -361.568 -924.024 0 0 684.759 0 0 0 -1023.36 186.544 0 1602.15 160.909 287.408 2403.56 0 0 0 0 0 2203.97 -0.228889 -1526.61 0 0 -1392.48 0 0 0 0 0 0 0 0 0 -1069.9 0 0 0 0 0 0 0 0 1621.83 0 0 0 -1438.57 
0 0 0 0 0 1887.65 0 0.08 109.638 290.613 -493.103 0 -1912.98 228.66 0 0 0 0 0 0 0 0 -1974.01 0 0 0 0 2059.01 0 0 1678.29 0 0 0 0 0 0 0 478.149 0 0 0 0 0 -339.29 893.048 0 2236.93 512.787 0 0 -1428.95 0 0 0 0 -127.796 
0 1269.8 -904.035 2239.83 0 0 -1259.27 2196.95 0.03 0 0 2013.08 0 0 965.224 1298.79 0 0 0 0 0 0 0 -2173.6 1983.78 213.553 0 0 0 0 0.534074 0 0 -303.735 1733.83 0 0 0 1154.44 0 0 0 -811.869 0 0 593.661 0 0 0 0 0 0 0 0 0 0 0 
0 1134.45 0 238.121 0 0 96.82 1686.83 0 0.07 0 0 0 0 0 0 0 0 0 -652.562 0 0 43.5652 0 0 0 -492.34 0 0 0 805.155 0 0 -99.7192 0 0 0 0 0 4.80667 0 0 948.439 0 0 0 0 0 0 0 0 0 1401.49 0 0 0 0 
0 0 0 2131.03 0 0 0 2440.03 0 0 0.09 0 1874.37 2146.9 539.491 0 0 2185.51 0 0 1630.07 0 -1235.62 0 0 164.418 0 0 -1050.22 -2333.83 0 0 -1789.22 0 0 0 -1192.13 -539.491 0 0 939.894 1065.78 0 0 402.158 -1711.1 0 0 -1184.65 0 0 0 0 0 0 0 0 
2174.06 2221.67 0 0 0 -434.507 0 0 1931.59 0 0 0.04 0 0 2214.8 0 880.23 0 0 0 0 0 0 0 0 0 0 0 0 0 0 0 1667.91 0 0 0 0 0 0 0 -103.687 0 0 0 1528.14 -1237.14 0 0 0 0 0 1690.19 0 0 0 0 0 
0 2491.91 1317.41 0 0 0 -544.679 1585.06 0 0 -1936.32 0 0.04 0 0 2428.74 -2381.89 -808.206 0 0 0 2050.31 995.132 -1446.65 -2113.03 0 -1601.69 956.374 181.356 1591.31 0 0 0 -1503.57 0 0 2210.84 2312.62 0 -1027.18 0 0 0 0 1392.48 -798.44 89.8007 0 0 0 0 0 0 0 0 0 0 
0 0 2260.28 0 0 2279.81 0 542.39 0 0 794.626 0 0 0.05 0 0 0 0 0 -2178.49 1716.74 0 0 0 0 51.3474 0 0 0 0 0 0 0 0 0 2214.8 0 0 0 0 0 0 -1530.27 0 0 0 0 -2058.85 0 1809.52 0 733.741 0 0 0 0 0 
0 0 0 614.719 0 0 0 0 -9.07926 0 -377.895 1372.65 0 0 0.04 33.7992 0 0 0 -2176.81 1791.36 2221.37 0 0 2184.13 0 0 0 1611.15 0 0 -407.804 0 0 0 0 1525.39 0 0 0 -2065.26 0 0 0 0 0 1378.44 0 -426.878 0 0 0 0 0 -708.258 0 0 
145.192 -2382.96 -1607.94 1814.1 602.206 0 0 0 2084.34 0 0 0 1412.32 0 569.094 0.09 1678.14 0 0 2048.02 0 0 0 0 0 1980.42 -2280.27 0 1518.68 0 40.2081 -1389.89 0 0 -10.7578 -243.919 0 0 0 -1407.28 2219.08 781.198 -771.889 2209.01 0 0 0 -1388.67 358.058 2465.82 -1091.57 0 0 660.802 0 0 0 
0 0 2117.45 0 793.558 0 260.704 0 0 0 0 -1288.42 759.072 0 0 1384.09 0.04 0 0 0 0 0 0 0 2455.75 0 0 1083.94 0 0 -1185.72 0 0 0 0 0 0 0 0 0 0 0 0 2128.44 0 0 0 0 2305.14 1140.55 -2146.14 99.2615 0 0 0 0 0 
0 0 0 2452.7 921.43 0 -933.18 0 0 0 1493.65 0 847.423 0 0 0 0 0.04 0 -880.993 0 480.438 0 0 0 1162.53 0 -1875.29 0 0 0 0 0 1839.27 0 0 2100.21 0 0 -2062.52 0 0 0 0 0 0 -884.045 695.593 0 1582.16 0 0 0 0 0 -1637.09 0 
0 0 -694.678 0 0 209.128 0 0 0 0 0 0 0 0 0 0 0 0 0.06 0 942.793 0 0 2362.51 0 0 0 -1798.68 0 0 0 -794.473 0 0 0 0 0 1835.61 2439.42 0 0 2328.64 0 2366.79 0 0 2391.96 0 0 0 0 0 0 0 0 0 0 
-1355.4 0 0 0 0 1435.36 -822.855 0 0 -155.416 0 0 0 1170.46 486.541 1739.94 0 1987.44 0 0.08 0 0 535.371 0 0 -2351.99 0 0 0 -1208.46 0 0 0 0 800.424 0 0 0 730.689 1206.32 1335.41 0 -1171.68 0 0 -1985.92 0 -1942.58 0 0 0 0 0 0 0 0 0 
0 0 0 0 0 -2327.11 1621.52 0 0 0 2396.54 0 0 871.838 303.43 0 0 0 2140.03 0 0.05 0 0 0 0 0 0 34.4096 0 0 0 0 0 -879.162 0 0 0 0 1069.29 -1001.24 985.977 0 0 0 1376.92 0 1484.19 0 0 0 0 0 0 0 -121.387 0 0 
1247.37 0 0 0 2339.93 0 -670.415 0 0 0 0 0 -1006.73 0 -874.279 0 0 2284.84 0 0 0 0.03 0 0 1865.37 0 0 0 0 0 -1027.48 588.473 0 0 0 -569.094 0 0 0 0 0 0 0 0 0 0 0 0 106.128 1865.06 0 0 0 0 -692.389 1240.2 0 
0 0 0 0 0 0 -2305.75 -1272.24 0 -158.315 634.556 0 569.094 0 0 0 0 0 0 1533.78 0 0 0.08 0 0 0 0 841.777 0 1416.29 0 0 0 0 0 0 0 0 904.035 -1588.26 0 0 0 0 0 0 439.848 1695.84 0 0 2424.31 0 0 0 0 0 0 
0 2068.77 0 0 -1007.19 -2035.36 0 0 188.376 0 0 0 479.064 0 0 0 0 0 1497.47 0 0 0 0 0.03 0 0 -192.801 0 0 0 0 -1241.87 0 -63.2496 0 1725.9 2347.87 -2283.78 614.872 0 -393.765 0 0 -2330.77 1099.96 374.844 1580.63 0 0 0 0 0 0 0 0 0 -2015.37 
339.595 0 0 0 0 0 0 0 -476.775 0 0 0 1998.73 0 307.55 0 -28.7637 0 0 0 0 704.596 0 0 0.07 0 0 0 0 0 -364.62 0 1568.12 0 0 0 0 0 0 0 0 0 0 0 0 0 0 0 0 0 0 0 0 1179.46 0 1527.83 0 
638.676 0 0 0 0 0 0 0 583.285 0 -302.515 0 0 322.657 0 138.325 0 2263.48 0 -1876.51 0 0 0 0 0 0.05 0 0 0 0 0 0 655.461 -739.692 0 0 757.088 1818.06 0 0 0 0 0 0 0 0 0 0 0 0 1238.67 1351.59 0 0 0 0 863.598 
0 0 0 -1882.76 2264.09 0 0 0 0 2414.7 0 0 1220.97 0 0 656.224 0 0 0 0 0 0 0 1990.8 0 0 0.01 0 0 0 0 0 0 0 0 0 0 0 0 0 0 0 0 0 0 0 0 0 0 0 0 0 0 0 0 0 0 
0 0 0 0 0 0 0 -671.331 0 0 0 0 474.792 0 0 0 -1376 2094.56 1737.8 0 1451.69 0 1243.1 0 0 0 0 0 0 0 0 196.615 0 0 0 0 -856.578 2478.64 0 0 0 0 2176.2 0 0 0 0 -1462.22 0 0 -1226.62 0 -2026.2 0 0 0 0 
1868.27 0 1645.94 0 0 0 -356.38 0 0 0 2240.75 0 57.7563 0 460.143 1864.3 0 0 0 0 0 0 0 0 0 0 0 0 0.01 0 0 0 -2128.28 2465.06 0 0 322.962 0 0 -566.195 -741.218 0 69.5059 1703.77 0 0 0 0 0 0 0 0 0 0 0 0 0 
421.079 0 0 2205.8 0 0 1776.56 0 0 0 413.907 0 2162.31 0 0 0 0 0 0 462.889 0 0 -1245.08 0 0 0 0 0 0 0.03 0 -822.55 1098.44 0 0 0 0 1253.62 982.772 0 0 0 837.199 0 0 0 0 515.076 0 -2266.53 639.744 0 0 0 0 2158.5 0 
1188.62 0 0 0 2488.25 -714.515 -958.357 2060.23 2183.68 -2462.46 0 0 0 0 0 1622.44 -2234.03 0 0 0 0 -1828.44 0 0 1303.67 0 0 0 0 0 0.05 0 0 0 802.866 -721.076 0 0 0 0 0 0 1195.33 0 833.232 0 2166.28 -1154.9 0 1639.23 0 0 0 0 0 0 0 
0 -231.407 2145.22 0 2186.42 1021.23 0 0 0 0 0 0 0 0 -1651.28 -1432.31 0 0 543.764 0 0 -1494.11 0 -827.586 0 0 0 1233.33 0 2399.75 0 0.07 0 -242.698 0 -1486.33 1798.23 0 0 -2197.1 0 0 0 0 0 -1521.27 414.975 -1235.31 2410.58 -893.506 0 0 0 615.024 0 0 0 
0 547.578 0 0 0 0 0 0 0 0 1162.22 -681.707 0 0 0 0 0 0 0 0 0 0 0 0 -2209.46 501.495 0 0 2448.12 -1275.9 0 0 0.05 0 0 0 0 1236.53 0 -1616.95 0 0 0 0 0 1924.73 0 0 0 0 2417.91 2305.75 721.076 0 0 0 0 
1854.69 0 0 0 0 0 587.252 0 -1209.07 -1529.21 0 0 1772.74 0 0 0 0 1210.9 0 0 1850.87 0 0 1213.8 0 -1385.92 0 0 2131.18 0 0 1815.93 0 0.03 0 0 265.435 789.743 1651.59 0 0 0 0 0 -146.413 -1797.92 0 -2213.28 0 0 0 0 0 0 0 0 0 
2380.52 0 0 0 0 2070.15 0 0 -1408.05 0 0 0 0 0 0 247.276 0 0 0 1696.3 0 0 0 0 0 0 0 0 0 0 1584.6 0 0 0 0.01 0 -747.322 0 0 0 1608.71 0 0 992.996 0 0 -2451.32 0 0 0 0 -958.052 0 0 0 0 0 
9.99481 0 0 0 -2072.59 0 0 0 0 0 0 0 0 734.657 0 934.095 0 0 0 0 0 2051.84 0 -2187.03 0 0 0 0 0 0 2021.93 -437.254 0 0 0 0.03 0 0 -497.681 0 2204.28 0 0 0 0 0 0 1891.61 2138.66 0 0 0 1948.07 0 0 0 0 
992.233 0 0 0 0 0 0 0 0 0 -1101.49 0 869.243 0 1758.4 0 0 -2382.05 0 0 0 0 0 125.813 0 871.685 0 999.1 1413.39 0 0 624.79 0 584.201 1609.62 0 0.08 -1048.08 0 0 419.401 0 0 0 1628.24 0 0 1515.32 -2088 -853.984 -1503.72 0 0 0 0 0 0 
1337.24 751.747 2090.59 1666.08 0 0 0 0 0 0 679.113 0 1188.62 0 0 0 0 0 499.207 0 0 0 0 -886.334 0 2377.01 0 2248.68 0 -1783.58 0 0 2466.12 647.679 0 0 -2131.79 0 1287.8 0 -905.103 0 0 0 0 0 0 -1188.16 0 0 0 0 0 0 0 0 1843.24 
0 0 -2463.84 0 0 0 0 -2244.56 1862.32 0 0 0 0 0 0 0 0 0 -229.423 1641.82 297.327 0 2308.8 -683.844 0 0 0 0 0 2248.68 0 0 0 525.605 0 1879.86 0 1573.76 0.02 -1774.12 1942.58 2266.38 -1654.03 0 0 0 0 0 -1411.1 0 0 0 0 0 2456.82 0 2306.82 
0 1313.14 0 754.036 0 0 0 0 0 -2412.87 0 0 1796.09 0 0 1574.07 0 707.495 0 1962.57 -1666.54 0 2171.62 0 0 0 0 0 -1685.92 0 0 1082.72 2472.38 0 0 0 0 0 375.454 0.08 0 0 0 0 0 0 0 0 0 0 -382.931 0 0 2326.04 0 -366.756 0 
0 0 0 0 0 0 0 0 0 0 80.6452 2084.8 0 0 -2028.64 -1318.32 0 0 0 781.045 638.218 0 0 -347.835 0 0 0 0 -2153.61 0 0 0 0 0 1450.62 1796.7 322.81 -1850.11 584.353 0 0.09 0 1759.01 0 -98.8037 0 0 0 998.794 0 2293.39 0 0 0 0 0 0 
0 0 0 -1897.41 0 2301.02 0 0 0 0 5.72222 0 0 0 0 470.977 0 0 1065.94 0 0 0 0 0 0 0 0 0 0 0 0 0 0 0 0 0 0 0 -205.618 0 0 0.02 0 0 2380.21 1200.06 0 2055.19 0 -1793.5 681.555 0 0 0 0 0 0 
0 1759.01 0 0 0 748.695 0 0 -363.247 1735.82 0 0 0 306.177 0 -521.638 0 0 0 1474.27 0 0 0 0 0 0 0 -1517.46 -1873.45 1983.63 1916.49 0 0 0 0 0 0 0 406.125 0 -1399.35 0 0.04 0 0 0 0 0 0 0 0 0 0 0 -1446.2 0 0 
0 0 0 0 0 0 1751.53 0 0 0 0 0 0 0 0 -1436.12 1737.95 0 -1921.37 0 0 0 0 2011.86 0 0 0 0 2288.96 0 0 0 0 0 -1874.37 0 0 0 0 0 0 0 0 0.09 0 0 0 0 2023.3 0 0 -476.012 0 0 0 0 0 
0 0 -915.632 2393.34 0 0 0 1855.91 0 0 -1107.29 -490.967 107.654 0 0 0 0 0 0 0 -1340.6 0 0 2144.61 0 0 0 0 0 0 -1606.57 0 0 1216.85 0 0 1582.31 0 0 0 -1087.91 242.698 0 0 0.06 0 0 0 0 0 0 483.184 0 0 0 0 0 
0 0 0 0 0 1420.41 0 1415.22 -231.712 0 1742.23 -1163.44 -414.365 0 0 0 0 0 0 999.252 0 0 0 -1385.46 0 0 0 0 0 0 0 -452.666 1469.7 560.396 0 0 0 0 0 0 0 -568.484 0 0 0 0.06 0 0 0 2278.89 0 0 0 0 0 -1899.7 0 
0 -35.02 671.484 0 2227.77 0 0 0 0 0 0 0 1368.98 0 1968.52 0 0 -123.981 1387.75 0 39.5978 0 -1655.86 1242.03 0 0 0 0 0 0 948.592 -908.307 0 0 -174.49 0 0 0 0 0 0 0 0 0 0 0 0.07 1897.11 0 0 0 0 0 0 2492.83 0 0 
-2102.04 0 28.0007 1793.8 0 0 0 2242.12 0 0 0 0 0 -290.307 0 -1096.15 0 2346.95 0 1106.83 0 0 -1768.47 0 0 0 0 2324.21 0 77.4407 537.66 -1934.19 0 214.621 0 1989.58 768.532 157.399 0 0 0 -800.729 0 0 0 0 454.802 0.06 0 0 0 0 0 0 0 0 0 
0 0 0 0 0 0 0 -1719.79 0 0 1885.36 0 0 0 -764.412 -1011.92 -1318.63 0 0 0 0 369.655 0 0 0 0 0 0 0 0 0 1406.06 0 0 0 2369.08 1694.31 0 1715.83 0 1881.54 0 0 1914.96 0 0 0 0 0.08 -1393.09 0 0 0 0 0 0 0 
-1677.53 0 2013.84 -692.083 0 1645.94 0 0 0 0 0 0 0 1897.87 0 -1438.26 -1424.07 781.045 0 0 0 2248.99 0 0 0 0 0 0 0 -494.476 -786.691 1505.55 0 0 0 0 2191 0 0 0 0 -1066.09 0 0 0 477.996 0 0 574.587 0.02 0 0 0 0 0 0 0 
1132.77 0 -1516.24 1702.09 -259.636 0 0 0 0 0 0 0 0 0 0 -1590.85 237.968 0 0 0 0 0 1692.63 0 0 -393.918 0 170.827 0 783.029 0 0 1062.43 0 0 0 -1735.97 0 0 2477.26 -2369.38 26.017 0 0 0 0 0 0 0 0 0.09 0 0 0 0 0 0 
1395.08 0 0 1038.47 0 0 0 -414.212 0 0 0 987.503 0 2123.4 0 0 -243.614 0 0 0 0 0 0 0 0 -834.91 0 0 0 0 0 0 2335.2 0 -1716.28 0 0 0 0 0 0 0 0 315.332 595.95 0 0 0 0 0 0 0.05 0 204.093 0 0 0 
0 0 0 0 0 -774.026 2219.53 0 0 939.283 0 0 0 0 0 0 0 0 0 0 0 0 0 0 0 0 0 -1953.87 0 0 0 0 1018.94 0 0 1484.5 0 0 0 0 0 0 0 0 0 0 0 0 0 0 0 0 0.09 0 0 0 0 
1059.83 0 0 0 2216.64 0 0 0 0 0 0 0 0 0 0 -118.641 0 0 0 0 0 0 0 0 850.017 0 0 0 0 0 0 -2398.83 0 0 0 0 0 0 0 540.406 0 0 0 0 0 0 0 0 0 0 0 1367.46 0 0.07 0 0 0 
0 0 0 1778.7 -1089.28 0 0 0 0 0 0 0 0 0 -1584.44 0 0 0 0 0 634.251 2010.79 0 0 0 0 0 0 0 0 0 0 0 0 0 0 0 0 1143.45 0 0 0 -1428.8 0 0 0 -1515.32 0 0 0 0 0 0 0 0.04 0 0 
0 0 0 0 0 432.981 0 0 0 0 0 0 0 0 0 0 0 99.8718 0 0 0 -2186.73 0 0 1303.98 0 0 0 0 1371.88 0 0 0 0 0 0 0 0 0 423.063 0 0 0 0 0 -80.6452 0 0 0 0 0 0 0 0 0 0.04 2018.11 
0 0 0 0 875.652 0 -207.907 671.941 0 0 0 0 0 0 0 0 0 0 0 0 0 0 0 1112.48 0 2387.54 0 0 0 0 0 0 0 0 0 0 0 2111.8 -1714.61 0 0 0 0 0 0 0 0 0 0 0 0 0 0 0 0 2177.27 0.01 
