*Vertices 57
*Matrix 
0.09 0 0 0 1607.03 0 0 0 0 0 0 0 0 0 0 0 0 0 51.5 2102.04 0 0 1366.7 0 0 0 0 1690.19 0 0 0 0 0 0 0 -2319.64 0 0 29.5267 1483.28 0 0 0 0 0 -1536.07 0 0 0 0 2135.46 0 -1990.19 0 0 0 0 
0 0 0 0 0 0 0 0 2278.28 0 0 0 0 0 0 0 0 0 0 0 0 0 0 0 0 0 0 0 0 0 0 0 0 0 0 0 907.086 2178.79 0 0 0 0 0 0 0 0 0 0 0 0 -2000.56 0 0 0 264.824 0 0 
0 0 0.09 0 2482.15 0 0 0 0 0 0 0 0 0 0 1580.48 0 0 0 0 2107.07 0 0 -1773.05 0 0 -1508 0 0 0 0 0 1361.05 0 860.24 2174.52 0 0 0 0 0 0 0 0 0 0 0 0 0 0 0 0 2172.84 0 0 0 0 
0 0 0 0.07 0 0 0 0 0 0 0 0 0 -1620.3 0 0 0 0 0 0 0 0 0 0 0 0 0 0 0 1314.36 0 0 0 0 0 0 0 -315.18 0 0 0 0 1755.2 -57.6037 0 0 0 0 0 1157.34 0 0 0 0 -841.929 0 0 
-174.032 0 1788.77 0 0.03 0 0 0 0 0 -277.642 0 0 0 0 0 0 1167.71 0 0 -1880.02 0 0 0 -1415.68 0 0 0 0 1533.78 0 0 1879.25 -137.715 0 0 1017.87 0 0 0 0 0 0 0 0 0 0 0 0 0 0 0 0 0 0 0 0 
0 0 0 0 0 0.06 0 0 0 0 0 0 2074.42 0 0 0 0 0 1600.47 1030.53 0 -795.236 0 0 0 0 0 0 0 0 0 0 0 0 0 0 624.79 0 0 -137.562 0 0 0 0 0 0 527.589 0 0 0 2107.23 0 -1582.92 1951.58 0 -49.3637 0 
0 0 0 0 0 0 0.02 0 0 0 0 0 0 0 0 0 0 0 0 0 0 0 0 0 -1034.2 0 0 0 0 0 282.678 0 0 0 1602.15 0 0 0 0 0 0 0 0 2467.5 0 0 0 0 0 531.709 0 0 0 0 0 0 0 
0 0 0 0 0 0 0 0.03 0 0 0 0 0 0 0 0 0 1656.62 0 0 0 0 0 0 0 0 0 0 2438.96 0 0 0 0 0 0 -459.99 0 0 0 0 0 0 0 0 0 0 -1094.32 -145.039 -1160.08 0 0 0 0 0 0 0 0 
0 -496.46 0 0 0 0 0 0 0.04 0 0 0 553.224 0 -256.737 695.593 0 0 0 0 0 0 0 0 814.768 2072.89 0 0 0 0 0 0 932.722 0 0 0 0 0 0 0 0 0 0 0 0 0 0 0 0 0 0 0 0 0 0 0 0 
0 0 0 0 0 0 0 0 0 0.03 0 0 0 -139.851 0 0 0 0 0 0 0 0 0 0 0 0 0 0 0 0 0 0 0 0 1673.71 0 0 0 0 0 0 0 811.563 0 1617.1 0 0 0 0 0 0 0 0 0 0 0 -2289.12 
0 0 0 0 561.769 0 0 0 0 0 0.03 0 0 0 0 0 0 0 0 0 0 0 0 0 0 0 0 0 669.042 0 0 0 0 0 0 0 0 0 0 0 0 -423.368 0 0 0 0 0 0 0 0 0 -1345.94 0 2265.47 1729.87 0 0 
0 0 0 0 0 0 0 0 0 0 0 0.08 0 0 0 0 0 0 0 0 5.56963 -219.962 0 0 0 0 0 0 0 0 0 0 0 0 2307.58 0 0 725.806 0 0 0 0 0 0 0 0 0 898.846 0 0 -697.424 0 0 0 595.187 0 0 
0 0 0 0 0 508.209 0 0 1849.04 0 0 0 0.06 0 0 0 0 0 1929 0 0 0 0 1136.13 1623.66 0 0 0 0 553.835 0 0 0 2069.69 0 0 0 -314.264 0 0 1091.27 0 0 0 -1882 0 0 0 0 0 -1405.91 0 0 0 0 0 0 
0 0 0 1754.28 0 0 0 0 0 2293.69 0 0 0 0.04 0 0 0 0 0 0 -568.789 0 0 0 427.183 0 0 0 0 0 0 0 0 184.408 0 0 0 0 0 0 0 0 0 0 0 -1214.56 0 0 0 0 0 0 338.069 0 0 0 0 
0 0 0 0 0 0 0 0 -1517.61 0 0 0 0 0 0.02 0 2057.48 0 0 0 0 0 1119.04 0 0 0 0 0 0 0 0 0 0 0 0 0 1754.89 0 0 0 0 42.497 0 0 0 -950.423 0 0 0 0 -397.122 0 0 0 0 0 0 
0 0 2296.44 0 0 0 0 0 -506.836 0 0 0 0 0 0 0.08 0 0 0 0 0 0 0 0 0 0 0 0 513.245 0 0 0 0 0 0 -1071.12 0 0 0 1955.24 0 1456.11 0 0 0 0 0 250.938 0 0 0 0 0 0 0 0 0 
0 0 0 0 0 0 0 0 0 0 0 0 0 0 -1278.04 0 0.07 0 0 0 0 0 417.264 0 0 0 2243.49 0 0 503.784 1243.25 0 -546.052 0 0 0 0 2088 0 0 947.523 0 0 0 0 0 0 0 0 0 0 0 0 0 0 0 0 
0 0 0 0 2453.46 0 0 1814.1 0 0 0 0 0 0 0 0 0 0.09 1042.44 0 0 0 0 0 -1127.58 0 0 0 0 0 0 0 0 0 0 0 0 0 -1689.58 0 0 0 0 2323.15 0 0 0 -1646.7 0 0 0 1222.19 0 0 0 0 0 
-1689.28 0 0 0 0 1250.42 0 0 0 0 0 0 -957.289 0 0 0 0 1076.01 0.06 0 -1021.84 0 0 0 0 0 -2349.24 -589.999 1159.78 0 0 0 0 0 0 0 0 0 0 1590.85 1587.65 0 0 0 0 967.666 0 0 0 0 0 0 0 1899.55 0 0 0 
1182.36 0 0 0 0 926.923 0 0 0 0 0 0 0 0 0 0 0 0 0 0.06 0 0 0 0 -78.0511 0 0 0 0 0 0 0 0 0 356.075 0 0 0 0 -674.23 0 0 0 1613.28 0 0 0 0 0 0 0 0 1218.38 0 0 0 0 
0 0 -1403.78 0 -843.76 0 0 0 0 0 0 2128.44 0 1828.9 0 0 0 0 -1169.24 0 0.09 0 1426.66 0 0 0 0 0 0 0 0 0 0 0 0 -754.646 0 0 1696.14 0 0 0 0 0 0 0 -1612.98 0 1346.71 0 0 0 0 0 0 0 0 
0 0 0 0 0 -281.457 0 0 0 0 0 1604.28 0 0 0 0 0 0 0 0 0 0.05 0 0 0 0 0 1086.69 -141.987 0 0 0 0 0 -1006.42 0 0 0 0 0 0 0 0 0 0 -416.501 0 0 0 0 0 0 0 0 0 0 0 
-1617.86 0 0 0 0 0 0 0 0 0 0 0 0 0 1511.2 0 -60.1978 0 0 0 1062.73 0 0.09 1234.86 1753.21 0 0 0 0 0 0 2058.4 -203.787 0 0 0 0 0 0 0 0 0 0 0 0 0 0 0 2486.57 0 0 0 0 -190.817 0 0 0 
0 0 1907.03 0 0 0 0 0 0 0 0 0 -1844.77 0 0 0 0 0 0 0 0 0 1016.5 0.07 208.975 1165.43 0 0 0 0 0 0 0 2426.45 1500.98 0 0 -872.906 -696.814 0 0 0 0 0 0 0 0 0 0 0 0 0 -1472.14 358.974 0 0 1699.19 
0 0 0 0 1908.4 0 -2289.57 0 -1297.57 0 0 0 718.787 -1855.45 0 0 0 -1200.83 0 -253.38 0 0 1775.8 1449.25 0.04 0 0 0 0 0 0 0 2124.01 729.621 0 0 0 0 0 0 0 0 -111.011 0 0 0 0 0 0 0 -192.801 0 0 0 0 0 0 
0 0 0 0 0 0 0 0 1709.72 0 0 0 0 0 0 0 0 0 0 0 0 0 0 -2425.38 0 0.03 0 1412.63 0 0 0 0 0 0 0 0 0 -2384.18 0 0 0 0 2305.9 2292.78 0 0 0 0 0 0 0 0 1946.24 0 0 0 0 
0 0 -2024.52 0 0 0 0 0 0 0 0 0 0 0 0 0 1584.75 0 354.396 0 0 0 0 0 0 0 0.08 0 0 0 0 526.826 1769.23 0 0 0 0 0 0 0 2244.56 0 0 0 0 0 -231.712 0 0 -145.344 0 0 0 0 0 0 0 
1535.46 0 0 0 0 0 0 0 0 0 0 0 0 0 0 0 0 0 1711.1 0 0 824.686 0 0 0 -726.569 0 0.04 0 0 0 -1682.87 0 2288.81 0 0 0 1449.25 0 0 0 0 1809.52 0 0 -2269.28 1858.65 0 -1659.98 0 0 0 0 0 0 0 0 
0 0 0 0 0 0 0 1234.7 0 0 2489.01 0 0 0 0 1449.71 0 0 1043.81 0 0 -405.057 0 0 0 0 0 0 0.09 0 0 0 0 0 0 -2294.61 0 0 0 0 0 0 0 0 0 398.648 0 0 0 0 0 0 0 0 0 0 0 
0 0 0 1681.04 2480.62 0 0 0 0 0 0 0 2183.52 0 0 0 -1103.47 0 0 0 0 0 0 0 0 0 0 0 0 0.01 0 0 0 0 0 0 1313.44 -214.621 0 0 0 0 0 0 0 0 0 0 -1014.97 1889.32 0 0 -830.638 0 552.766 0 0 
0 0 0 0 0 0 1479.46 0 0 0 0 0 0 0 0 0 -700.171 0 0 0 0 0 0 0 0 0 0 0 0 0 0.08 0 0 0 0 0 0 0 -2394.25 0 1733.38 0 0 -193.106 1262.17 0 0 0 0 0 0 0 0 0 0 0 0 
0 0 0 0 0 0 0 0 0 0 0 0 0 0 0 0 0 0 0 0 0 0 2246.09 0 0 0 1090.2 -957.747 0 0 0 0.01 0 0 0 0 0 0 0 0 0 -1639.53 0 0 0 0 1476.56 0 0 0 1298.49 0 556.886 0 0 0 0 
0 0 1296.04 0 129.475 0 0 0 1936.63 0 0 0 0 0 0 0 358.058 0 0 0 0 0 -814.158 0 1197.47 0 -1922.59 0 0 0 0 0 0.08 0 0 0 0 0 0 0 0 0 0 0 0 0 0 0 0 0 0 904.95 0 0 0 0 0 
0 0 0 0 1203.57 0 0 0 0 0 0 0 1274.83 -2401.27 0 0 0 0 0 0 0 0 0 -1658.91 -2017.04 0 0 1251.95 0 0 0 0 0 0.09 678.961 0 0 0 0 0 0 2285 0 0 0 1229.36 0.991852 0 -47.2274 0 0 0 0 0 0 0 0 
0 0 2236.01 0 0 0 -193.564 0 0 -944.166 0 136.189 0 0 0 0 0 0 0 -1703.01 0 -210.196 0 1181.3 0 0 0 0 0 0 0 0 0 1147.57 0.05 0 0 -2336.57 0 0 0 0 0 0 0 0 0 0 0 0 2286.98 0 1208.76 1488.16 0 0 0 
1748.94 0 1969.13 0 0 0 0 639.134 0 0 0 0 0 0 0 -1184.35 0 0 0 0 1444.52 0 0 0 0 0 0 0 742.439 0 0 0 0 0 0 0.02 2011.7 0 0 566.958 0 0 0 0 0 0 0 0 0 0 0 0 0 0 0 0 0 
0 460.143 0 0 -901.44 111.011 0 0 0 0 0 0 0 0 87.5118 0 0 0 0 0 0 0 0 0 0 0 0 0 0 1589.48 0 0 0 0 0 1252.86 0.03 0 0 0 2133.93 -2415.31 -2322.69 0 0 0 0 0 0 0 0 0 0 0 580.844 0 0 
0 1879.25 0 -1901.53 0 0 0 0 0 0 0 -880.535 1752.14 0 0 0 -77.7459 0 0 0 0 0 0 -2011.4 0 524.079 0 500.275 0 1642.28 0 0 0 0 2421.11 0 0 0 0 0 0 0 0 0 0 0 0 0 0 0 -2425.84 0 0 0 0 0 0 
-448.241 0 0 0 0 0 0 0 0 0 0 0 0 0 0 0 0 2362.21 0 0 367.214 0 0 2393.95 0 0 0 0 0 0 212.485 0 0 0 0 0 0 0 0.06 0 0 0 783.029 0 -1456.27 0 0 -2182.91 0 0 0 0 0 0 0 0 0 
-2275.08 0 0 0 0 -1525.09 0 0 0 0 0 0 0 0 0 380.49 0 0 2384.18 942.64 0 0 0 0 0 0 0 0 0 0 0 0 0 0 0 2326.35 0 0 0 0.01 0 0 0 0 0 0 0 0 0 0 -1189.38 0 0 0 0 0 0 
0 0 0 0 0 0 0 0 0 0 0 0 1593.3 0 0 0 -2200.16 0 2026.05 0 0 0 0 0 0 0 -1089.28 0 0 0 -2236.78 0 0 0 0 0 1484.8 0 0 0 0.03 0 0 -1532.41 0 0 0 0 2396.08 0 0 0 0 0 0 0 0 
0 0 0 0 0 0 0 0 0 0 -1667.91 0 0 0 2006.52 118.03 0 0 0 0 0 0 0 0 0 0 0 0 0 0 0 -1518.52 0 1248.74 0 0 2480.47 0 0 0 0 0.08 0 0 0 0 0 0 556.429 0 0 0 0 0 0 0 0 
0 0 0 1755.81 0 0 0 0 0 744.27 0 0 0 0 0 0 0 0 0 0 0 0 0 0 433.134 924.94 0 -1572.08 0 0 0 0 0 0 0 0 216.147 0 1129.26 0 0 0 0.05 0 0 2178.79 0 0 0 0 -2144.76 0 0 0 0 0 0 
0 0 0 281.762 0 0 2172.69 0 0 0 0 0 0 0 0 0 0 -1267.51 0 362.026 0 0 0 0 0 -128.712 0 0 0 0 -1670.05 0 0 0 0 0 0 0 0 0 1123.46 0 0 0.05 0 0 0 -1258.05 0 0 0 0 0 0 556.276 0 0 
0 0 0 0 0 0 0 0 0 2281.03 0 0 1629.46 0 0 0 0 0 0 0 0 0 0 0 0 0 0 0 0 0 724.433 0 0 0 0 0 0 0 -496.46 0 0 0 0 0 0.08 0 0 0 0 0 0 0 0 0 0 0 0 
1671.27 0 0 0 0 0 0 0 0 0 0 0 0 -934.553 1989.58 0 0 0 1301.23 0 0 -1375.85 0 0 0 0 0 -799.051 748.848 0 0 0 0 2169.03 0 0 0 0 0 0 0 0 906.629 0 0 0.05 0 0 0 0 0 0 0 0 -1077.99 0 0 
0 0 0 0 0 1622.44 0 2270.96 0 0 0 0 0 0 0 0 0 0 0 0 -1237.91 0 0 0 0 0 394.223 1404.08 0 0 0 -2356.41 0 513.245 0 0 0 0 0 0 0 0 0 0 0 0 0.09 0 0 0 0 419.248 0 0 0 0 0 
0 0 0 0 0 0 0 980.026 0 0 0 -573.977 0 0 0 -2147.82 0 2115.47 0 0 0 0 0 0 0 0 0 0 0 0 0 0 0 0 0 0 0 0 1715.52 0 0 0 0 685.522 0 0 0 0.06 0 0 0 0 0 0 0 0 0 
0 0 0 0 0 0 0 74.5415 0 0 0 0 0 0 0 0 0 0 0 0 -1153.68 0 2346.19 0 0 0 0 1189.54 0 828.806 0 0 0 -2425.08 0 0 0 0 0 0 -2365.72 2021.16 0 0 0 0 0 0 0.08 2150.11 1403.01 0 0 0 0 0 0 
0 0 0 -2478.03 0 0 848.491 0 0 0 0 0 0 0 0 0 0 0 0 0 0 0 0 0 0 0 743.507 0 0 1912.82 0 0 0 0 0 0 0 0 0 0 0 0 0 0 0 0 0 0 358.364 0.03 0 0 0 0 -1542.48 1528.75 0 
1866.28 1826.3 0 0 0 1902.45 0 0 0 0 0 -2498.63 -967.513 0 -1032.21 0 0 0 0 0 0 0 0 0 604.953 0 0 0 0 0 0 -1741.16 0 0 2089.37 0 0 -1581.09 0 588.168 0 0 691.626 0 0 0 0 0 -647.069 0 0.05 0 0 0 0 0 0 
0 0 0 0 0 0 0 0 0 0 -309.076 0 0 0 0 0 0 2099.44 0 0 0 0 0 0 0 0 0 0 0 0 0 0 228.66 0 0 0 0 0 0 0 0 0 0 0 0 0 -1645.18 0 0 0 0 0 0 0 0 823.771 0 
733.589 0 1331.75 0 0 -450.835 0 0 0 0 0 0 0 1274.99 0 0 0 0 0 729.164 0 0 0 -1307.34 0 974.532 0 0 0 -1578.34 0 534.455 0 0 1212.73 0 0 0 0 0 0 0 0 0 0 0 0 0 0 0 0 0 0.03 0 0 0 0 
0 0 0 0 0 1437.96 0 0 0 0 1752.75 0 0 0 0 0 0 0 -2445.68 0 0 0 -1451.54 -1063.04 0 0 0 0 0 0 0 0 0 0 112.995 0 0 0 0 0 0 0 0 0 0 0 0 0 0 0 0 0 0 0.08 1284.3 0 0 
0 -1445.89 0 2093.19 0 0 0 0 0 0 -240.257 2168.72 0 0 0 0 0 0 0 0 0 0 0 0 0 0 0 0 0 2172.08 0 0 0 0 0 0 -160.756 0 0 0 0 0 0 187.918 0 1176.72 0 0 0 382.321 0 0 0 -522.095 0.03 0 0 
0 0 0 0 0 2233.88 0 0 0 0 0 0 0 0 0 0 0 0 0 0 0 0 0 0 0 0 0 0 0 0 0 0 0 0 0 0 0 0 0 0 0 0 0 0 0 0 0 0 0 1635.26 0 907.849 0 0 0 0.08 0 
0 0 0 0 0 0 0 0 0 735.572 0 0 0 0 0 0 0 0 0 0 0 0 0 1435.36 0 0 0 0 0 0 0 0 0 0 0 0 0 0 0 0 0 0 0 0 0 0 0 0 0 0 0 0 0 0 0 0 0.08 
