*Vertices 75
*Matrix 
0.07 2123.4 1842.17 0 0 0 0 0 0 -1653.72 0 0 0 0 0 0 0 0 0 0 0 0 0 0 0 0 0 0 0 0 -608.463 0 0 0 0 0 0 0 0 0 0 0 -1600.92 0 0 0 0 0 0 -2232.05 0 0 0 2255.24 0 1726.05 0 0 0 0 0 0 0 0 0 851.543 0 0 0 0 -383.084 0 0 0 0 
-1836.68 0.05 0 0 0 0 0 0 0 2122.79 0 0 0 0 0 0 0 0 0 0 0 0 2376.09 0 0 0 420.011 0 -112.537 0 2418.67 0 186.239 114.521 0 0 0 0 0 0 0 0 0 0 0 0 -1473.36 0 0 0 0 0 0 0 0 0 0 0 0 0 -105.365 0 0 0 -2127.52 0 -1053.27 0 0 0 0 0 0 0 0 
1535.92 0 0.04 -1042.89 0 0 0 1447.42 0 0 0 0 -2285.91 0 0 0 0 0 0 0 0 0 0 0 0 0 1346.86 0 0 0 0 0 0 0 0 0 0 0 0 0 904.797 0 0 0 0 -300.531 0 0 0 0 0 -44.7859 1185.42 0 0 0 0 0 0 0 0 0 0 0 0 0 0 0 0 0 0 0 0 0 0 
0 0 -1661.5 0.03 1963.94 140.309 0 0 2113.33 0 0 0 0 0 1358 1442.99 0 0 0 0 0 0 0 0 0 0 0 0 0 0 0 0 0 0 0 0 0 0 0 0 0 0 0 0 0 0 0 0 0 0 0 0 0 -652.104 0 0 0 1736.88 0 0 0 0 0 0 0 738.472 0 -1171.53 1284.6 0 0 0 0 0 0 
0 0 0 -717.872 0.01 0 0 0 0 0 0 0 2087.24 0 0 0 0 0 0 750.221 -108.112 0 0 0 0 -908.612 0 0 0 0 0 0 0 0 0 0 0 0 0 0 0 0 0 876.72 0 0 78.0511 0 0 0 0 0 1296.35 0 0 0 0 0 0 0 0 0 1372.19 0 0 0 0 0 0 0 0 0 0 -1905.5 0 
0 0 0 1325.04 0 0.07 0 0 0 0 0 0 0 0 0 491.424 0 -1605.2 0 268.029 0 0 0 0 0 0 0 0 0 0 0 0 0 0 672.399 0 0 0 0 0 0 0 0 0 0 0 0 0 0 0 0 0 -435.728 0 0 0 0 0 0 2065.11 0 0 0 0 0 0 0 0 0 0 0 0 0 0 0 
0 0 0 0 0 0 0.06 0 -1676 1663.18 0 -1950.21 0 0 0 0 0 0 0 0 0 0 0 0 0 0 0 0 0 0 0 0 0 0 0 0 0 0 0 0 0 0 0 0 0 0 0 0 0 0 0 135.578 0 0 268.792 0 0 1431.85 40.5133 0 -605.716 0 0 0 0 0 406.735 0 725.959 0 318.995 0 0 0 0 
0 0 172.658 0 0 0 0 0.03 324.03 0 0 0 0 0 0 0 0 0 0 0 0 0 0 0 0 1487.24 2369.53 1332.06 0 0 0 0 -533.692 0 2123.71 0 0 0 0 0 0 0 358.974 0 0 0 0 0 0 0 0 0 797.372 0 -1461.76 0 531.861 0 0 0 0 0 0 0 0 0 -14.5726 0 0 0 0 0 0 0 0 
0 0 0 -264.672 0 0 906.018 -92.0896 0.06 0 0 0 0 0 0 0 0 -1307.95 0 0 321.589 0 0 -1200.67 0 0 0 0 0 0 0 0 0 0 0 0 0 0 0 0 0 1019.55 0 0 0 0 0 0 0 0 0 0 0 0 2081.9 0 0 0 0 1347.01 0 0 0 0 -1620 0 0 0 0 0 0 0 0 0 0 
1905.35 2292.93 0 0 0 0 -302.82 0 0 0.05 0 0 -1315.42 -792.184 0 0 1727.58 0 0 0 0 0 0 0 0 2382.81 0 0 0 0 -504.852 0 0 0 0 -304.498 0 0 0 -948.897 0 0 0 0 0 -1253.17 0 0 0 0 0 0 0 0 0 0 0 0 0 0 0 0 0 0 0 0 639.134 0 0 0 0 0 0 0 0 
0 0 0 0 0 0 0 0 0 0 0.04 0 1735.21 0 0 0 0 0 0 0 0 0 0 0 0 0 0 136.341 1688.06 0 0 -227.287 0 0 0 0 0 0 0 0 0 0 0 1102.56 0 0 0 0 0 0 0 407.651 0 0 0 0 0 0 0 0 0 0 0 931.654 0 0 0 0 -1251.79 1598.94 0 0 0 0 0 
0 0 0 0 0 0 -83.697 0 0 0 0 0.09 -1081.5 0 0 -2091.36 0 0 1025.35 2121.88 0 0 0 0 549.257 0 0 0 0 0 0 0 0 0 0 2216.64 0 0 0 0 0 0 0 0 0 0 0 0 0 2427.21 0 0 0 0 0 0 0 0 0 0 0 1464.05 0 0 0 0 0 0 0 0 0 0 0 0 0 
0 0 951.338 0 1005.66 0 0 0 0 1335.87 2369.99 -1155.81 0.03 1304.13 0 0 0 0 0 0 0 0 1184.19 0 0 0 1169.39 0 0 -1551.33 0 0 0 0 0 0 0 0 0 0 -765.023 0 0 0 0 2146.44 2376.71 1659.67 0 0 0 -1007.34 0 0 0 0 0 0 0 0 0 0 0 0 0 0 0 0 0 0 0 0 0 0 0 
0 0 0 0 0 0 0 0 0 1499.6 0 0 1506.47 0.07 0 0 0 0 0 0 0 0 0 0 0 0 0 0 0 0 0 0 651.646 0 0 0 0 290.918 0 0 0 0 0 0 0 0 0 0 0 0 0 0 0 0 -1498.38 0 0 0 1328.55 0 1946.85 0 -327.998 0 0 0 0 0 -1812.42 0 0 0 0 0 0 
0 0 0 2348.32 0 0 0 0 0 0 0 0 0 0 0.05 0 0 0 -1197.32 0 0 0 1275.44 0 0 0 0 0 0 0 0 1786.02 0 0 0 0 0 0 0 0 65.9963 0 0 0 994.827 0 0 0 0 0 0 0 0 0 0 0 -962.783 0 0 0 0 0 0 0 0 0 0 0 0 0 0 0 0 0 0 
0 0 0 1938.76 0 -2144.31 0 0 0 0 0 -1139.33 0 0 0 0.09 0 0 0 0 0 0 0 0 1063.49 0 0 0 0 0 0 0 0 0 0 0 0 2046.8 0 0 213.095 0 0 -2395.32 0 0 0 0 0 0 0 0 0 698.492 0 0 -413.602 0 2123.55 0 0 0 0 0 0 0 0 -199.21 0 44.7859 0 0 0 0 0 
0 0 0 0 0 0 0 0 0 1616.64 0 0 0 0 0 0 0.08 0 2117.91 0 1578.49 0 0 0 0 0 0 -381.863 0 0 0 794.32 0 -83.2392 0 0 268.639 0 0 0 -1805.25 0 0 0 0 0 1294.21 0 0 0 0 0 0 0 1291.31 0 -1142.99 0 0 0 375.149 0 0 0 0 0 0 0 0 0 -1549.04 0 0 0 0 
0 0 0 0 0 2214.5 0 0 -320.215 0 0 0 0 0 0 0 0 0.05 0 0 0 406.125 0 869.396 0 0 0 -2134.54 0 0 0 0 0 0 0 0 0 0 0 0 0 0 0 0 0 0 0 0 0 1447.26 0 0 -599.918 0 2488.86 0 0 0 0 0 0 0 0 0 0 0 0 0 0 0 0 0 0 0 0 
0 0 0 0 0 0 0 0 0 0 0 -1668.37 0 0 2044.05 0 517.06 0 0 0 0 2278.89 0 0 0 0 0 0 0 0 47.9904 0 0 0 0 0 0 0 0 2172.54 0 0 0 0 0 0 0 0 0 0 -620.06 109.333 0 0 0 -1260.64 0 0 0 0 0 0 561.159 0 -2182.61 0 1669.59 0 0 1155.66 0 0 0 -481.964 0 
0 0 0 0 674.535 -526.063 0 0 0 0 0 2185.05 0 0 0 0 0 0 0 0.01 0 0 0 0 0 0 0 -1025.96 0 706.275 0 2368.01 0 0 0 0 0 0 489.593 0 0 -43.5652 -1705.91 0 1260.64 0 0 0 0 0 0 0 0 0 0 0 0 0 0 0 0 0 0 0 0 0 0 2005.45 0 0 0 0 0 0 0 
0 0 0 0 1949.45 0 0 0 1723.15 0 0 0 0 0 0 0 -1004.59 0 0 0 0.02 0 0 0 0 0 0 0 0 0 0 2364.96 1540.35 0 0 0 0 0 0 0 0 0 0 2242.12 0 1631.6 0 0 0 0 0 0 0 0 0 0 0 0 0 0 0 1821.57 0 0 1896.04 0 0 0 0 1227.99 0 0 0 0 0 
0 0 0 0 0 0 0 0 0 0 0 0 0 0 0 0 0 373.775 -504.242 0 0 0.03 0 273.37 0 0 0 0 0 0 1765.42 0 0 0 2022.54 0 0 0 0 0 0 0 0 0 0 1160.7 0 317.774 0 0 0 0 2455.44 0 0 0 0 0 -2197.71 0 762.123 0 0 0 -1962.87 0 1914.96 0 0 0 -1687.44 0 0 0 0 
0 2237.69 0 0 0 0 0 0 0 0 0 0 1440.7 0 -1204.64 0 0 0 0 0 0 0 0.02 0 0 0 0 0 0 0 0 0 1416.29 0 0 0 1847.82 0 0 0 0 2178.33 0 0 0 0 0 0 0 0 0 0 0 0 0 0 0 0 0 0 0 0 0 0 0 0 0 0 0 0 -1221.73 0 0 0 0 
0 0 0 0 0 0 0 0 2343.59 0 0 0 0 0 0 0 0 -2288.66 0 0 0 70.1163 0 0.08 0 0 0 0 0 0 958.205 0 0 -200.888 0 1736.27 0 0 0 0 0 0 0 0 -1448.33 0 0 0 0 0 0 0 321.894 0 0 0 725.349 0 0 0 0 2099.75 0 0 0 0 0 0 0 0 0 0 0 0 0 
0 0 0 0 0 0 0 0 0 0 0 -854.137 0 0 0 -1848.12 0 0 0 0 0 0 0 0 0.09 1906.42 0 0 0 0 0 0 0 0 0 0 0 482.116 0 0 0 0 0 0 0 0 0 0 1280.63 0 0 580.081 0 0 0 0 0 0 0 -2169.18 0 0 0 0 0 0 0 0 2053.97 151.906 0 0 0 0 0 
0 0 0 0 -1016.65 0 0 -665.38 0 785.623 0 0 0 0 0 0 0 0 0 0 0 0 0 0 1278.8 0.05 0 0 0 0 0 0 2461.55 0 0 0 0 0 0 0 0 0 0 0 0 0 0 0 0 0 0 0 -1375.85 -656.529 0 0 0 0 -1376.61 0 272.301 0 0 1092.03 0 0 0 0 0 0 0 0 0 0 0 
0 -799.509 -114.673 0 0 0 0 -1359.98 0 0 0 0 1771.68 0 0 0 0 0 0 0 0 0 0 0 0 0 0.08 0 0 2072.59 0 -861.156 0 0 0 0 0 -1603.67 547.426 2012.62 0 0 0 0 -1045.34 0 0 1326.56 0 0 0 0 0 0 0 0 -2368.31 0 0 0 0 0 1730.93 0 0 -1564.61 0 0 181.204 0 0 0 0 0 0 
0 0 0 0 0 0 0 101.245 0 0 572.146 0 0 0 0 0 -339.137 2024.98 0 713.294 0 0 0 0 0 0 0 0.05 0 0 0 0 0 280.541 0 0 0 2123.4 0 0 1549.81 0 0 0 0 0 0 0 0 0 0 0 -509.888 2334.28 0 0 0 0 0 0 0 0 0 0 0 0 -1944.11 0 0 -1847.97 0 0 0 0 0 
0 1293.91 0 0 0 0 0 0 0 0 1602.91 0 0 0 0 0 0 0 0 0 0 0 0 0 0 0 0 0 0.02 0 1501.89 0 0 0 0 0 0 0 0 0 0 0 0 1556.22 0 0 0 0 0 0 0 0 0 0 0 0 0 0 0 0 0 0 0 0 0 0 0 1306.88 0 0 0 0 0 0 0 
0 0 0 0 0 0 0 0 0 0 0 0 -147.176 0 0 0 0 0 0 -227.287 0 0 0 0 0 0 158.773 0 0 0.01 0 0 0 0 0 326.93 0 0 1774.27 0 0 0 0 0 0 1138.87 0 -1999.5 0 0 0 0 0 -1957.69 0 575.503 0 0 0 0 0 0 0 0 0 0 0 0 0 0 0 0 0 0 0 
1366.7 -1292.54 0 0 0 0 0 0 0 -322.657 0 0 0 0 0 0 0 0 -898.236 0 0 2386.47 0 708.106 0 0 0 0 530.335 0 0.07 0 0 0 209.891 0 0 0 0 0 0 0 0 0 1506.78 0 0 0 0 0 0 0 0 0 0 0 0 0 0 0 0 0 0 0 0 0 0 0 0 0 0 0 0 0 0 
0 0 0 0 0 0 0 0 0 0 495.697 0 0 0 1897.11 0 1824.78 0 0 994.674 -2126.91 0 0 0 0 0 1798.84 0 0 0 0 0.02 0 1953.11 0 0 0 0 0 0 0 -140.156 0 -1716.28 0 0 0 0 0 0 -64.3178 0 0 0 0 0 0 0 0 0 0 0 0 0 0 0 0 0 0 0 0 -627.995 0 0 0 
0 -1278.95 0 0 0 0 0 2158.35 0 0 0 0 0 1266.75 0 0 0 0 0 0 6.02741 0 1734.6 0 0 906.018 0 0 0 0 0 0 0 0 0 0 0 0 -805.002 0 0 0 0 0 0 0 0 0 2431.49 -1889.93 0 0 0 0 0 1405 -802.56 0 0 0 51.9578 0 0 0 0 2183.98 0 0 0 0 0 0 -785.012 0 0 
0 -343.867 0 0 0 0 0 0 0 0 0 0 0 0 0 0 -1315.42 0 0 0 0 0 0 1938.76 0 0 0 -520.417 0 0 0 1666.69 0 0.05 0 0 0 0 0 0 0 0 0 0 0 0 0 0 0 0 0 0 0 0 0 0 0 0 0 1130.94 0 0 -1590.55 0 0 0 0 1038.32 0 -1923.81 0 0 0 0 0 
0 0 0 0 0 -1238.21 0 773.11 0 0 0 0 0 0 0 0 0 0 0 0 0 1493.35 0 0 0 0 0 0 0 0 733.131 0 0 0 0.04 0 -885.876 0 0 0 0 310.755 0 0 0 0 0 0 0 0 0 0 0 0 0 0 0 0 742.286 0 0 0 0 0 574.587 0 0 0 0 0 0 0 0 0 0 
0 0 0 0 0 0 0 0 0 443.358 0 526.215 0 0 0 0 0 0 0 0 0 0 0 228.507 0 0 0 0 0 1778.85 0 0 0 0 0 0.03 0 2302.55 0 0 0 0 0 0 0 0 -1269.65 0 0 2460.78 0 0 -1214.26 -657.14 0 0 0 0 0 0 0 0 0 0 0 0 0 0 0 0 0 0 0 0 0 
0 0 0 0 0 0 0 0 0 0 0 0 0 0 0 0 2352.9 0 0 0 0 0 2187.34 0 0 0 0 0 0 0 0 0 0 0 2120.5 0 0 0 0 0 0 0 0 0 0 0 0 0 0 0 0 0 0 0 0 0 1230.43 0 0 0 0 1854.23 0 -2312.16 0 -2279.2 0 0 0 913.343 0 0 0 0 0 
0 0 0 0 0 0 0 0 0 0 0 0 0 1812.72 0 2162.16 0 0 0 0 0 0 0 0 1963.33 0 1977.68 1182.67 0 0 0 0 0 0 0 1339.23 0 0.06 -974.685 0 1744.82 0 0 0 0 -2351.68 0 0 0 0 0 0 0 0 0 0 0 0 0 0 -80.34 0 0 0 0 0 0 0 0 0 1296.04 0 0 0 0 
0 0 0 0 0 0 0 0 0 0 0 0 0 0 0 0 0 0 0 -455.565 0 0 0 0 0 0 665.532 0 0 -367.519 0 0 1825.69 0 0 0 0 -2211.6 0 0 0 0 0 0 0 0 1648.53 0 308.161 0 0 0 2154.23 0 0 0 656.224 0 0 0 0 266.503 1348.38 0 0 0 1782.97 0 0 0 0 0 0 0 0 
0 0 0 0 0 0 0 0 0 2061.75 0 0 0 0 0 0 0 0 -1301.23 0 0 0 0 0 0 0 1619.69 0 0 0 0 0 0 0 0 0 0 0 0 0.02 0 0 0 0 0 0 0 0 0 174.947 1266.59 0 0 0 0 0 0 0 0 0 0 0 0 0 0 987.198 0 0 0 0 0 0 0 0 0 
0 0 1968.52 0 0 0 0 0 0 0 0 0 1749.7 0 329.066 738.472 -378.811 0 0 0 0 0 0 0 0 0 0 -1091.88 0 0 0 0 0 0 0 0 0 -647.221 0 0 0.05 0 0 -943.556 2071.21 0 0 0 0 0 0 0 0 -23.7281 0 0 0 0 0 0 1824.78 0 -1579.71 0 0 0 0 0 2371.52 0 0 0 0 0 0 
0 0 0 0 0 0 0 0 -70.2689 0 0 0 0 0 0 0 0 0 0 -1604.13 0 0 2292.02 0 0 0 0 0 0 0 0 -1763.59 0 0 2319.48 0 0 0 0 0 0 0.06 0 -716.346 0 0 0 0 0 0 0 0 0 0 0 0 -674.078 0 0 0 0 1666.69 -886.334 0 0 0 0 0 0 0 0 0 0 0 0 
1307.49 0 0 0 0 0 0 -1372.8 0 0 0 0 0 0 0 0 0 0 0 156.178 0 0 0 0 0 0 0 0 0 0 0 0 0 0 0 0 0 0 0 0 0 0 0.07 0 0 0 0 0 1812.72 0 0 0 0 0 0 -330.897 0 0 0 0 0 497.375 0 0 0 0 0 0 0 0 0 0 0 0 0 
0 0 0 0 1847.51 0 0 0 0 0 -142.14 0 0 0 0 258.415 0 0 0 0 1624.27 0 0 0 0 0 0 0 1472.9 0 0 280.541 0 0 0 0 0 0 0 0 -524.384 -294.275 0 0.05 2013.99 0 0 0 656.987 0 0 0 0 0 0 0 0 919.904 0 0 0 0 0 0 0 2309.87 0 280.847 0 0 0 0 0 0 0 
0 0 0 0 0 0 0 0 0 0 0 0 0 0 128.254 0 0 0 0 -2096.7 0 0 0 1211.97 0 0 2443.24 0 0 0 -1701.48 0 0 0 0 0 0 0 0 0 2425.69 0 0 -1480.07 0.05 553.377 0 0 0 -2491.91 0 0 0 0 0 0 0 0 0 0 1782.97 0 0 1175.65 0 48.4481 1158.41 0 0 -430.235 0 0 0 0 0 
0 0 1144.83 0 0 0 0 0 0 1357.84 0 0 324.335 0 0 0 0 0 0 0 557.955 -748.238 0 0 0 0 0 0 0 -2082.35 0 0 0 0 0 0 0 2242.27 0 0 0 0 0 0 375.912 0.07 0 0 0 0 0 0 0 0 0 0 0 1043.96 0 0 0 0 0 0 0 0 0 0 0 0 0 0 0 0 0 
0 -203.177 0 0 -1932.2 0 0 0 0 0 0 0 653.172 0 0 0 2490.08 0 0 0 0 0 0 0 0 0 0 0 0 0 0 0 0 0 0 -2423.7 0 0 -1780.37 0 0 0 0 0 0 0 0.01 0 0 0 0 1908.09 0 0 0 0 0 0 886.792 0 0 0 0 0 0 0 926.313 0 0 0 0 0 0 0 0 
0 0 0 0 0 0 0 0 0 0 0 0 -1287.8 0 0 0 0 0 0 0 0 2125.08 0 0 0 0 1828.29 0 0 -1139.03 0 0 0 0 0 0 0 0 0 0 0 0 0 0 0 0 0 0.03 0 0 0 0 0 -2121.88 0 2034.29 0 -109.79 0 -1300.16 1944.26 0 -2157.89 2109.21 0 0 0 0 0 0 327.998 0 0 0 0 
0 0 0 0 0 0 0 0 0 0 0 0 0 0 0 0 0 0 0 0 0 0 0 0 40.2081 0 0 0 0 0 0 0 2140.03 0 0 0 0 0 -1765.72 0 0 0 -86.9015 1559.42 0 0 0 0 0.06 0 0 0 0 0 0 0 0 0 0 522.706 0 0 0 0 -1891.46 0 1163.29 0 657.75 0 0 0 0 0 0 
-1235.16 0 0 0 0 0 0 0 0 0 0 643.559 0 0 0 0 0 2054.12 0 0 0 0 0 0 0 0 0 0 0 0 0 0 1488.46 0 0 1441.01 0 0 0 349.361 0 0 0 0 1315.27 0 0 0 0 0 0 0 0 0 0 0 0 0 0 0 0 0 0 -1326.41 0 0 0 0 0 0 -1222.65 0 0 0 0 
0 0 0 0 0 0 0 0 0 0 0 0 0 0 0 0 0 0 156.331 0 0 0 0 0 0 0 0 0 0 0 0 849.254 0 0 0 0 0 0 0 -39.7504 0 0 0 0 0 0 0 0 0 0 0.04 0 0 0 0 0 0 0 0 0 0 2110.58 0 0 0 0 1672.03 0 2429.96 0 0 0 0 0 0 
0 0 555.055 0 0 0 -286.798 0 0 0 572.451 0 -325.861 0 0 0 0 0 2004.53 0 0 0 0 0 1925.03 0 0 0 0 0 0 0 0 0 0 0 0 0 0 0 0 0 0 0 0 0 2360.53 0 0 0 0 0.09 0 0 0 -131.153 0 0 0 0 0 0 0 0 335.322 0 0 0 0 0 0 0 0 0 0 
0 0 2140.03 0 -24.0333 2389.52 0 452.513 0 0 0 0 0 0 0 0 0 2073.96 0 0 0 2060.99 0 -1480.07 0 1165.43 0 -685.827 0 0 0 0 0 0 0 801.035 0 0 1409.57 0 0 0 0 0 0 0 0 0 0 0 0 0 0.01 0 0 0 0 0 0 0 0 0 0 0 -230.796 665.075 0 -1075.85 0 0 0 0 0 0 0 
1034.2 0 0 -1788.77 0 0 0 0 0 0 0 0 0 0 0 756.172 0 0 0 0 0 0 0 0 0 681.707 0 2107.99 0 111.316 0 0 0 0 0 173.727 0 0 0 0 673.62 0 0 0 0 0 0 -2139.73 0 0 0 0 0 0.07 0 0 0 0 0 0 0 2137.44 1152.46 0 0 0 0 -1336.33 0 0 0 0 0 0 0 
0 0 0 0 0 0 -2415.31 466.399 1968.21 0 0 0 0 2213.13 0 0 2361.14 224.998 0 0 0 0 0 0 0 0 0 0 0 0 0 0 0 0 0 0 0 0 0 0 0 0 0 0 0 0 0 0 0 0 0 0 0 0 0.05 0 0 0 -2188.1 0 0 0 0 0 0 -132.069 2468.41 0 2284.84 0 0 0 0 0 0 
1138.42 0 0 0 0 0 0 0 0 0 0 0 0 0 0 0 0 0 178.61 0 0 0 0 0 0 0 0 0 0 -649.815 0 0 -998.489 0 0 0 0 0 0 0 0 0 -566.195 0 0 0 0 1156.27 0 0 0 2077.78 0 0 0 0.08 0 0 0 0 -542.543 0 0 0 0 0 0 0 1473.97 1042.13 0 0 0 0 0 
0 0 0 0 0 0 0 65.3859 0 0 0 0 0 0 1937.24 281.457 -589.846 0 0 0 0 0 0 -712.073 0 0 -880.23 0 0 0 0 0 2108.29 0 0 0 -1799.6 0 1023.97 0 0 947.523 0 0 0 0 0 0 0 0 0 0 0 0 0 0 0.01 1680.58 0 0 0 0 306.94 0 0 0 0 0 0 0 0 0 0 0 0 
0 0 0 550.783 0 0 -223.777 0 0 0 0 0 0 0 0 0 0 0 0 0 0 0 0 0 0 0 0 0 0 0 0 0 0 0 0 0 0 0 0 0 0 0 0 -2037.95 0 1434.14 0 -129.78 0 0 0 0 0 0 0 0 72.7104 0.07 0 0 1482.36 0 0 0 176.321 -1940.75 0 0 0 1835.31 0 0 0 0 0 
0 0 0 0 0 0 1770.15 0 0 0 0 0 0 1579.41 0 2257.38 0 0 0 0 0 -1388.36 0 0 0 -578.86 0 0 0 0 0 0 0 0 1823.71 0 0 0 0 0 0 0 0 0 0 0 -1623.51 0 0 0 0 0 0 0 1468.02 0 0 0 0.04 292.901 1059.37 0 0 0 0 0 0 0 -1260.8 0 0 0 0 0 0 
0 0 0 0 0 1648.99 0 0 1254.84 0 0 0 0 0 0 0 0 0 0 0 0 0 0 0 -660.497 0 0 0 0 0 0 0 0 2348.93 0 0 0 0 0 0 0 0 0 0 0 0 0 -1087.3 -62.6392 0 0 0 0 0 0 0 0 0 -162.282 0.03 0 0 0 0 0 0 0 0 0 0 0 0 0 0 -364.925 
0 1610.08 0 0 0 0 826.67 0 0 0 0 0 0 945.082 0 0 2325.13 0 0 0 0 2272.48 0 0 0 1083.18 0 0 0 0 0 0 423.521 0 0 0 0 301.294 0 0 1818.83 0 0 0 889.386 0 0 -1621.98 0 0 0 0 0 0 0 -302.515 0 -167.928 1737.34 0 0.06 0 0 0 -1912.06 0 0 0 2297.66 0 512.635 0 0 0 0 
0 0 0 0 0 0 0 0 0 0 0 1669.74 0 0 0 0 0 0 0 0 -631.047 0 0 35.02 0 0 0 0 0 0 0 0 0 0 0 0 -137.104 0 -1054.95 0 0 2190.24 -326.319 0 0 0 0 0 0 0 2422.03 0 0 1623.2 0 0 0 0 0 0 0 0.05 0 0 -994.217 0 0 0 -1034.96 0 0 0 -1233.02 0 0 
0 0 0 0 2375.94 0 0 0 0 0 0 0 0 -2272.33 0 0 0 0 -784.097 0 0 0 0 0 0 0 282.525 0 0 0 0 0 0 -946.608 0 0 0 0 21.4393 0 1853.92 -1514.56 0 0 0 0 0 2259.67 0 0 0 0 0 873.058 0 0 1414.46 0 0 0 0 0 0.08 0 0 0 0 0 0 0 0 0 0 0 0 
0 0 0 0 0 0 0 0 0 0 687.964 0 0 0 0 0 0 0 0 0 0 0 0 0 0 -82.4763 0 0 0 0 0 0 0 0 0 0 1308.1 0 0 0 0 0 0 0 2327.72 0 0 1127.58 0 -141.682 0 0 0 0 0 0 0 0 0 0 0 0 0 0.08 0 0 0 0 0 0 1122.7 0 0 0 0 
0 -2349.7 0 0 0 0 0 0 -85.8333 0 0 0 0 0 0 0 0 0 -734.046 0 -2458.8 1135.98 0 0 0 0 0 0 0 0 0 0 0 0 2469.48 0 0 0 0 0 0 0 0 0 0 0 0 0 433.744 0 0 -2422.79 907.697 0 0 0 0 1031.91 0 0 2168.57 2361.45 0 0 0.08 0 0 873.669 0 0 0 0 0 0 0 
2467.35 0 0 -1785.26 0 0 0 0 0 0 0 0 0 0 0 0 0 0 0 0 0 0 0 0 0 0 2210.84 0 0 0 0 0 237.51 0 0 0 -2266.23 0 0 699.561 0 0 0 2077.93 665.075 0 0 0 0 0 0 0 -2437.59 0 2322.08 0 0 -1154.44 0 0 0 0 0 0 0 0.06 0 0 0 0 0 0 0 0 0 
0 5.26444 0 0 0 0 226.524 1331.75 0 -44.3281 0 0 0 0 0 0 0 0 -881.909 0 0 -987.96 0 0 0 0 0 180.135 0 0 0 0 0 0 0 0 0 0 2259.06 0 0 0 0 0 1805.4 0 -1246.91 0 -633.641 0 1652.2 0 0 0 -1395.69 0 0 0 0 0 0 0 0 0 0 0 0.09 0 -60.0452 0 0 0 0 0 0 
0 0 0 35.6304 0 0 0 0 0 0 0 0 0 0 0 -1769.69 0 0 0 2403.41 0 0 0 0 0 0 0 0 -357.601 0 0 0 0 -2486.11 0 0 0 0 0 0 0 0 0 -362.484 0 0 0 0 0 0 0 0 1541.87 273.217 0 0 0 0 0 0 0 0 0 0 2359.46 0 0 0.07 0 948.897 1596.65 0 0 0 0 
0 0 0 -282.22 0 0 2107.23 0 0 0 -757.851 0 0 1075.85 0 0 0 0 0 0 0 0 0 0 1719.03 0 1067.16 0 0 0 0 0 0 0 0 0 0 0 0 0 205.618 0 0 0 0 0 0 0 -2194.36 0 4.0437 0 0 0 361.873 -2089.37 0 0 1235.92 0 -1909.16 10.3 0 0 0 0 -523.316 0 0 0 0 0 0 0 0 
0 0 0 0 0 0 0 0 0 0 -782.876 0 0 0 0 540.406 0 0 1103.02 0 -1812.27 0 0 0 -474.181 0 0 2089.98 0 0 0 0 0 464.263 0 0 -190.664 0 0 0 0 0 0 0 741.981 0 0 0 0 0 0 0 0 0 0 -771.279 0 1451.38 0 0 0 0 0 0 0 0 0 2254.94 0 0.06 0 0 0 0 0 
-1933.58 0 0 0 0 0 988.876 0 0 0 0 0 0 0 0 0 1253.32 0 0 0 0 -1546.6 -867.26 0 0 0 0 0 0 0 0 0 0 0 0 0 0 2031.54 0 0 0 0 0 0 0 0 0 1993.7 0 1405.15 0 0 0 0 0 0 0 0 0 0 -2018.42 0 0 166.707 0 0 0 1765.72 0 0 0.01 0 0 0 0 
0 0 0 0 0 0 0 0 0 0 0 0 0 0 0 0 0 0 0 0 0 0 0 0 0 0 0 0 0 0 0 1319.24 0 0 0 0 0 0 0 0 0 0 0 0 0 0 0 0 0 0 0 0 0 0 0 0 0 0 0 0 0 0 0 0 0 0 0 0 0 0 0 0.08 0 0 2332.91 
0 0 0 0 0 0 0 0 0 0 0 0 0 0 0 0 0 0 0 0 0 0 0 0 0 0 0 0 0 0 0 0 -1220.51 0 0 0 0 0 0 0 0 0 0 0 0 0 0 0 0 0 0 0 0 0 0 0 0 0 0 0 0 2227.93 0 0 0 0 0 0 0 0 0 0 0.06 0 0 
0 0 0 0 338.527 0 0 0 0 0 0 0 0 0 0 0 0 0 1131.55 0 0 0 0 0 0 0 0 0 0 0 0 0 0 0 0 0 0 0 0 0 0 0 0 0 0 0 0 0 0 0 0 0 0 0 0 0 0 0 0 0 0 0 0 0 0 0 0 0 0 0 0 0 0 0.09 0 
0 0 0 0 0 0 0 0 0 0 0 0 0 0 0 0 0 0 0 0 0 0 0 0 0 0 0 0 0 0 0 0 0 0 0 0 0 0 0 0 0 0 0 0 0 0 0 0 0 0 0 0 0 0 0 0 0 0 0 -353.938 0 0 0 0 0 0 0 0 0 0 0 2193.59 0 0 0.03 
