*Vertices 75
*Matrix 
0.09 0 0 0 0 0 0 0 0 0 0 0 0 0 0 0 0 0 0 0 0 0 0 0 0 0 0 0 0 0 0 0 0 0 0 0 -1762.67 0 0 908.46 0 0 0 0 0 0 0 0 0 0 -2344.36 0 0 544.374 1767.4 933.332 0 0 0 0 0 0 1920.91 0 0 0 0 0 0 0 0 0 0 0 0 
0 0.05 0 -980.941 0 0 2310.79 0 0 0 0 0 0 0 0 -908.765 0 0 0 -1846.14 0 0 0 0 0 0 0 0 0 0 0 0 0 0 0 0 0 0 0 0 0 0 0 0 0 0 0 0 0 2081.13 1822.64 0 -195.853 0 0 0 0 1727.42 0 282.22 0 0 0 0 0 0 0 1244.77 0 0 0 0 0 0 0 
0 0 0 0 0 0 -133.442 0 0 0 0 0 -63.86 0 2280.72 0 0 0 0 0 0 0 0 0 913.953 0 0 0 0 0 0 0 0 0 0 0 0 0 0 0 0 0 -1126.06 0 0 0 0 386.135 0 0 0 0 0 0 0 0 0 0 0 0 0 0 0 0 0 0 0 0 0 0 0 0 0 0 0 
0 1688.21 0 0.05 1081.96 0 0 0 1700.42 0 0 0 0 0 -2043.75 0 0 0 0 0 0 0 0 0 0 0 0 0 0 -1573.61 0 0 2315.06 0 0 0 0 0 0 0 0 0 652.867 0 0 0 -1346.4 0 0 0 0 1083.64 0 0 0 0 0 0 0 0 0 0 0 0 0 0 0 -1855.14 0 0 0 0 0 0 0 
0 0 0 -1705.91 0.01 0 0 0 0 0 0 0 0 0 0 0 0 0 0 0 1035.26 0 0 0 0 0 0 0 0 0 0 0 0 0 0 35.1726 0 0 0 0 0 0 0 0 0 0 0 0 0 0 0 0 0 0 -1610.54 765.481 0 0 2483.21 0 0 0 401.7 0 0 0 0 0 0 0 0 0 0 0 0 
0 0 0 0 0 0.05 0 0 0 0 0 0 0 -2465.82 0 0 1370.36 236.9 0 0 0 0 0 -1539.43 0 1654.18 0 0 0 0 0 0 1256.68 227.744 0 0 0 0 0 0 0 0 0 0 0 0 0 0 0 0 -522.095 0 0 0 0 0 0 0 0 2184.13 0 0 0 0 0 0 0 0 0 0 0 0 0 0 0 
0 -552.766 -1872.08 0 0 0 0.09 0 0 0 0 0 0 0 2447.66 0 0 0 0 0 0 0 0 0 0 0 0 0 0 0 0 0 685.827 2176.81 0 0 0 0 0 0 0 0 0 0 0 0 0 0 0 0 0 0 0 0 0 7.24815 0 0 1378.75 0 0 0 0 0 0 0 0 0 0 0 0 0 0 0 0 
0 0 0 0 0 0 0 0.06 0 0 0 0 0 1515.78 1595.89 -591.83 0 0 0 0 0 0 0 0 0 0 0 0 0 0 0 0 0 1776.86 0 0 0 -1818.83 0 -248.192 0 0 0 0 0 0 0 0 0 0 0 0 0 0 0 0 0 783.029 0 0 2340.08 0 0 0 0 0 0 0 0 0 0 0 1946.39 0 0 
0 0 0 2265.62 0 0 0 0 0.01 0 0 0 0 0 0 2063.59 0 0 0 1648.84 0 0 0 1811.35 0 0 0 0 0 0 1294.21 0 0 1540.04 0 0 0 0 0 1754.59 0 0 0 0 0 0 0 0 0 0 0 0 0 0 0 1223.26 0 1781.44 0 452.818 0 0 0 0 0 0 0 0 0 0 0 0 0 0 0 
0 0 0 0 0 0 0 0 0 0.03 0 0 0 0 0 0 2108.75 0 0 0 0 0 1909.92 0 0 0 0 0 0 0 0 2145.83 0 0 0 2340.54 0 0 0 0 0 -877.941 0 0 0 0 1641.21 0 -854.747 -2154.07 0 0 0 2186.27 578.707 1719.79 0 0 -734.352 0 0 0 0 0 0 0 0 0 0 0 0 0 0 0 0 
0 0 0 0 0 0 0 0 0 0 0.04 0 930.891 0 0 951.186 0 0 0 0 0 -1948.84 -129.627 0 0 0 0 0 0 0 0 0 0 0 0 0 0 0 0 0 1213.03 0 0 0 0 0 0 732.826 0 0 0 0 -872.906 0 0 1966.54 0 0 0 0 0 580.081 0 0 0 0 0 0 0 0 0 0 0 0 0 
0 0 0 0 0 0 0 0 0 0 0 0.04 0 0 0 0 0 0 0 0 0 0 0 0 0 0 1932.2 -688.116 -1574.22 0 0 0 0 0 0 0 773.415 0 0 0 0 0 0 0 0 -1120.41 0 0 0 0 0 0 0 0 -109.79 0 0 0 1606.72 0 0 0 0 0 0 0 0 0 0 0 0 0 0 0 0 
0 0 -231.712 0 0 0 0 0 0 0 1080.89 0 0.08 0 0 0 0 59.74 0 0 0 0 0 0 0 0 -416.654 0 2183.83 0 0 0 0 0 0 215.995 0 289.392 0 0 0 0 0 0 0 0 1860.64 0 0 -2120.04 0 0 0 0 0 0 0 0 0 0 0 -1974.62 0 1962.72 0 0 0 0 0 0 0 0 0 0 0 
0 0 0 0 0 193.869 0 -552.309 0 0 0 0 0 0.02 -1667.46 0 476.775 0 0 0 0 0 0 0 412.992 0 0 0 0 328.761 0 0 538.27 0 0 0 0 1681.65 0 0 0 0 2447.97 0 0 -295.953 0 0 0 -2245.93 0 0 0 0 0 0 0 0 0 0 1675.85 0 -1952.65 0 0 -920.362 0 0 528.504 0 0 0 0 0 0 
0 0 -255.821 -297.174 0 0 -656.682 701.392 0 0 0 0 0 2137.14 0.01 0 0 0 0 0 0 0 609.378 0 0 0 0 2069.84 0 0 0 0 0 0 0 0 0 0 0 -1509.06 0 0 0 0 0 0 0 0 0 0 -749.153 1591.62 0 677.282 -1266.59 0 0 0 0 0 0 1209.83 0 0 0 0 0 0 0 0 0 0 0 0 0 
0 2356.56 0 0 0 0 0 2291.25 -2080.98 0 -464.873 0 0 0 0 0.09 0 0 0 839.335 0 0 0 0 1792.58 0 0 0 0 0 0 0 0 0 0 0 0 0 0 0 0 0 0 0 0 0 0 0 0 0 0 0 0 0 0 0 0 1449.86 0 0 0 0 0 0 0 0 0 0 0 0 0 0 0 0 0 
0 0 0 0 0 -1107.29 0 0 0 2088.92 0 0 0 -708.563 0 0 0.07 0 0 0 0 0 0 0 0 0 0 0 0 0 0 0 0 582.217 1571.93 0 337.001 0 0 -1403.93 0 0 0 0 0 0 0 0 0 0 0 0 0 0 0 0 0 0 0 1483.12 0 0 0 0 0 1281.24 0 0 0 0 0 0 0 0 0 
0 0 0 0 0 2088.76 0 0 0 0 0 0 1920.3 0 0 0 0 0.02 0 0 2408.75 0 0 0 1483.73 0 0 0 0 0 0 0 0 0 0 0 0 -1845.99 0 0 0 0 -144.734 0 0 0 0 0 0 0 475.249 0 0 0 0 0 0 0 0 0 0 0 0 0 0 0 574.435 0 0 0 2077.17 0 0 0 0 
0 0 0 0 0 0 0 0 0 0 0 0 0 0 0 0 0 0 0.08 0 0 0 0 0 0 -1976 1646.86 0 0 373.165 0 0 0 1923.35 -1547.21 0 0 0 0 0 0 0 0 0 87.3592 0 0 0 0 0 0 0 0 0 0 2238 -870.312 0 1787.09 0 0 0 -46.9222 0 0 0 0 0 0 0 0 0 624.943 0 0 
0 -604.953 0 0 0 0 0 0 -1309.78 0 0 0 0 0 0 26.3222 0 0 0 0.06 0 -1472.75 0 0 0 0 0 0 0 0 0 0 255.821 0 0 0 2075.33 0 0 0 0 0 0 0 0 0 0 0 0 0 0 0 0 0 0 1176.56 0 0 0 0 0 0 0 0 0 0 0 0 0 0 0 0 0 0 0 
0 0 0 0 1915.42 0 0 0 0 0 0 0 0 0 0 0 0 1605.96 0 0 0.01 0 -761.055 0 0 0 -1179.92 0 0 0 0 1684.24 0 0 0 0 0 0 0 0 0 0 0 -767.769 1521.12 0 0 0 1855.3 0 0 0 0 0 0 0 0 0 0 0 0 0 363.247 0 0 0 0 0 0 0 0 0 0 0 0 
0 0 0 0 0 0 0 0 0 0 183.493 0 0 0 0 0 0 0 0 1411.25 0 0.09 0 0 0 0 0 0 375.454 0 0 0 0 0 469.756 0 0 2077.47 0 0 0 0 0 0 0 0 0 0 1951.73 0 0 0 1433.23 0 0 1983.63 51.9578 0 0 -966.445 0 0 0 0 0 0 0 0 0 0 0 0 0 0 0 
0 0 0 0 0 0 0 0 0 2154.38 -2080.68 0 0 0 -494.018 0 0 0 0 0 725.654 0 0.07 0 0 2350.46 0 0 0 0 0 0 0 0 0 -806.68 0 0 0 0 423.063 2299.34 0 0 0 0 0 0 0 1087.45 0 0 -320.368 0 0 -1765.42 0 0 0 0 0 0 0 0 0 0 0 0 0 0 0 0 0 0 0 
0 0 0 0 0 1020.46 0 0 2400.2 0 0 0 0 0 0 0 0 0 0 0 0 0 0 0 -1135.67 0 1514.86 0 0 0 0 0 0 0 0 0 0 0 0 -2315.97 0 0 0 -962.935 0 0 0 0 -1746.04 0 1240.35 0 0 0 0 0 0 615.635 0 0 0 0 0 0 0 0 0 0 0 0 0 0 0 0 0 
0 0 -1213.8 0 0 0 0 0 0 0 0 0 0 239.036 0 -104.144 0 1650.21 0 0 0 0 0 1240.35 0.03 0 0 0 0 0 0 0 0 0 0 0 0 0 0 0 0 -577.181 0 0 2074.57 0 0 0 0 0 0 0 0 0 472.198 0 0 0 0 0 0 0 0 0 -1375.55 0 0 0 0 0 0 0 0 0 0 
0 0 0 0 0 896.71 0 0 0 0 0 0 0 0 0 0 0 0 -183.187 0 0 0 1624.88 0 0 0.04 1655.4 0 0 1635.56 0 0 0 0 0 0 0 0 0 0 0 0 0 0 0 0 0 1263.7 0 365.535 0 0 0 0 -159.23 0 0 0 0 0 1218.99 2133.78 0 0 0 0 0 0 0 0 0 2346.19 0 0 0 
0 0 0 0 0 0 0 0 0 0 0 -515.839 537.049 0 0 0 0 0 2266.99 0 1729.1 0 0 1548.74 0 -623.569 0.07 0 0 0 0 0 0 0 0 0 -1385.46 0 0 0 0 -1043.35 0 988.113 0 0 -1909.92 0 0 0 0 0 0 0 0 0 0 0 0 0 0 -1415.37 0 0 0 0 0 0 0 0 0 0 0 0 0 
0 0 0 0 0 0 0 0 0 0 0 1872.54 0 0 -379.574 0 0 0 0 0 0 0 0 0 0 0 0 0.07 0 0 0 1001.08 0 0 0 0 0 0 0 0 2290.49 0 0 1504.49 445.036 0 -916.395 0 0 0 0 0 1223.11 0 0 0 0 -81.7133 -522.706 0 0 0 0 0 0 0 0 0 0 0 0 0 0 2226.25 0 
0 0 0 0 0 0 0 0 0 0 0 284.051 466.857 0 0 0 0 0 0 0 0 2301.02 0 0 0 0 0 0 0.06 0 0 0 0 -1209.37 0 0 0 0 0 0 0 -2177.72 0 0 0 0 839.946 0 779.519 0 -2024.67 -475.707 0 0 0 1871.62 0 0 0 0 0 0 0 0 0 0 0 0 0 0 0 0 0 0 0 
0 0 0 773.721 0 0 0 0 0 0 0 0 0 1054.34 0 0 0 0 2157.12 0 0 0 0 0 0 1649.75 0 0 0 0.09 0 0 0 0 0 0 0 0 0 1429.87 0 0 0 0 1314.2 -255.974 0 0 0 0 0 0 0 0 0 0 0 0 0 0 0 0 0 0 0 0 0 0 0 0 0 0 0 0 0 
0 0 0 0 0 0 0 0 2013.69 0 0 0 0 0 0 0 0 0 0 0 0 0 0 0 0 0 0 0 0 0 0.03 0 0 0 0 0 0 0 0 0 0 0 0 0 0 0 0 0 0 0 0 0 0 0 0 0 0 446.104 0 0 -222.251 2234.18 0 0 0 0 0 0 0 0 0 0 0 0 0 
0 0 0 0 0 0 0 0 0 509.43 0 0 0 0 0 0 0 0 0 0 2342.83 0 0 0 0 0 0 -484.863 0 0 0 0.04 0 0 -1046.4 0 0 0 0 0 0 0 0 0 0 0 0 0 0 0 0 162.282 1886.88 0 0 0 0 0 0 0 0 0 0 0 0 0 0 0 0 0 0 0 0 0 0 
0 0 0 2273.71 0 1615.42 -2080.37 0 0 0 0 0 0 2069.84 0 0 0 0 0 2346.49 0 0 0 0 0 0 0 0 0 0 0 0 0.04 0 0 0 0 0 1527.53 0 0 0 0 0 0 -720.923 0 854.747 0 0 0 0 690.252 0 582.522 0 0 0 0 0 0 0 0 0 0 0 0 0 0 -1578.8 0 0 0 0 0 
0 0 0 0 0 2450.56 -336.543 2243.95 -999.71 0 0 0 0 0 0 0 2095.48 0 -212.79 0 0 0 0 0 0 0 0 0 1451.99 0 0 0 0 0.08 0 0 0 825.297 0 0 0 0 0 0 0 0 0 0 0 0 0 0 0 0 157.704 0 0 0 0 -1578.8 0 0 0 0 0 0 0 0 0 0 0 0 0 0 0 
0 0 0 0 0 0 0 0 0 0 0 0 0 0 0 0 -2064.96 0 2133.32 0 0 1914.81 0 0 0 0 0 0 0 0 0 2167.96 0 0 0.02 0 0 0 0 628.605 0 0 0 0 1732.15 0 0 0 0 0 0 0 0 0 0 0 0 0 0 0 0 -2255.39 -536.744 0 0 0 0 0 0 0 0 0 0 0 0 
0 0 0 0 -196.158 0 0 0 0 869.549 0 0 -2115.01 0 0 0 0 0 0 0 0 0 -1193.2 0 0 0 0 0 0 0 0 0 0 0 0 0.09 0 2325.59 0 0 -1208.61 -546.815 0 0 0 0 0 0 0 0 0 0 0 2313.84 0 0 2089.68 0 0 0 1643.19 0 0 0 0 0 0 0 0 0 0 0 0 0 0 
213.706 0 0 0 0 0 0 0 0 0 0 -1094.93 0 0 0 0 -2359.92 0 0 2467.8 0 0 0 0 0 0 2137.75 0 0 0 0 0 0 0 0 0 0.03 0 0 0 0 0 0 0 0 0 0 0 0 0 0 0 0 0 0 1560.95 0 0 0 -842.387 0 0 0 0 0 0 712.226 0 2394.1 0 0 0 0 0 0 
0 0 0 0 0 0 0 -213.553 0 0 0 0 -1685.46 -1673.86 0 0 0 2001.33 0 0 0 1607.18 0 0 0 0 0 0 0 0 0 0 0 460.906 0 212.79 0 0.05 0 0 0 0 0 0 0 0 0 0 0 1257.44 0 0 0 0 0 0 0 0 0 0 0 0 2077.17 0 0 0 0 0 0 0 0 1671.12 0 0 0 
0 0 0 0 0 0 0 0 0 0 0 0 0 0 0 0 0 0 0 0 0 0 0 0 0 0 0 0 0 0 0 0 341.731 0 0 0 0 0 0.01 0 0 0 0 0 0 0 0 0 0 0 0 0 0 0 0 0 0 0 0 915.784 1721.17 0 0 0 0 0 0 0 0 0 0 0 0 0 0 
-1442.38 0 0 0 0 0 0 -2105.24 -964.003 0 0 0 0 0 -2231.59 0 1509.83 0 0 0 0 0 0 -598.849 0 0 0 0 0 2478.48 0 0 0 0 499.359 0 0 0 0 0.02 0 0 0 0 0 0 1869.79 0 1672.95 0 0 1371.58 581.301 0 0 0 0 0 0 0 2460.94 0 0 0 0 0 0 0 0 0 0 0 0 0 0 
0 0 0 0 0 0 0 0 0 0 1529.36 0 0 0 0 0 0 0 0 0 0 0 2192.22 0 0 0 0 1462.07 0 0 0 0 0 0 0 1235.77 0 0 0 0 0.05 0 0 0 0 0 0 1358 0 0 -1353.27 0 0 1996.44 0 0 0 0 0 0 0 -1736.43 0 0 0 0 0 0 0 0 0 0 0 0 0 
0 0 0 0 0 0 0 0 0 2476.81 0 0 0 0 0 0 0 0 0 0 0 0 14.42 0 -856.12 0 -860.546 0 1316.49 0 0 0 0 0 0 30.5948 0 0 0 0 0 0.02 2395.32 0 -2315.97 0 0 260.552 0 0 0 0 0 0 1512.57 0 0 2446.13 -2272.03 0 0 0 0 0 0 0 0 0 0 0 0 0 0 0 0 
0 0 -643.406 2277.52 0 0 0 0 0 0 0 0 0 -1698.58 0 0 0 1999.19 0 0 0 0 0 0 0 0 0 0 0 0 0 0 0 0 0 0 0 0 0 0 0 2335.66 0 0 0 0 0 0 0 1859.57 0 0 0 0 0 0 0 0 0 0 0 0 0 0 0 0 0 0 0 0 0 0 0 0 0 
0 0 0 0 0 0 0 0 0 0 0 0 0 0 0 0 0 0 0 0 -206.534 0 0 277.49 0 0 1832.1 -123.981 0 0 0 0 0 0 0 0 0 0 0 0 0 0 0 0.02 0 0 0 -1429.87 0 0 0 0 0 0 0 0 0 0 0 0 0 0 0 0 0 0 0 0 0 0 0 0 0 0 0 
0 0 0 0 0 0 0 0 0 0 0 0 0 0 0 0 0 0 1165.12 0 2441.56 0 0 0 355.617 0 0 2369.23 0 2130.12 0 0 0 0 2490.84 0 0 0 0 0 0 -2344.97 0 0 0.05 0 0 0 0 -2090.29 0 0 0 0 0 -511.109 0 0 0 0 0 0 0 0 0 0 0 0 0 0 0 0 0 0 0 
0 0 0 0 0 0 0 0 0 0 0 1658.15 0 1432.92 0 0 0 0 0 0 0 0 0 0 0 0 0 0 0 -2498.63 0 0 -5.56963 0 0 0 0 0 0 0 0 0 0 0 0 0.07 0 0 0 -210.501 0 0 0 0 0 0 2499.39 0 0 0 0 0 721.992 0 0 0 0 0 0 0 0 0 0 0 0 
0 0 0 994.674 0 0 0 0 0 1064.56 0 0 -1824.78 0 0 0 0 0 0 0 0 0 0 0 0 0 -17.777 -273.217 -2058.4 0 0 0 0 0 0 0 0 0 0 514.924 0 0 0 0 0 0 0.01 0 0 0 0 0 0 2460.33 0 0 764.107 1483.43 0 0 2300.71 -158.162 819.193 0 0 0 0 0 0 0 0 0 0 0 0 
0 0 2167.2 0 0 0 0 0 0 0 -1344.87 0 0 0 0 0 0 0 0 0 0 0 0 0 0 374.844 0 0 0 0 0 0 1054.64 0 0 0 0 0 0 0 -505.31 1577.43 0 -1679.82 0 0 0 0.01 0 0 0 0 0 0 0 0 0 0 2179.25 0 0 0 2266.84 0 0 0 0 0 0 0 0 0 0 0 0 
0 0 0 0 0 0 0 0 0 -366.298 0 0 0 0 0 0 0 0 0 0 -1419.8 -734.809 0 -1743.45 0 0 0 0 2055.35 0 0 0 0 0 0 0 0 0 0 1718.88 0 0 0 0 0 0 0 0 0.02 0 0 0 0 0 0 0 0 0 0 1126.06 0 0 0 0 0 0 740.15 0 0 0 0 0 0 -641.575 0 
0 -1978.29 0 0 0 0 0 0 0 38.2244 0 0 -207.602 2415.01 0 0 0 0 0 0 0 0 2164.6 0 0 -1560.95 0 0 0 0 0 0 0 0 0 0 0 1435.21 0 0 0 0 -1610.23 0 600.681 2429.04 0 0 0 0.09 0 1045.95 0 0 -1949.9 0 0 2078.08 0 0 0 0 0 0 0 0 0 0 0 0 0 0 0 0 0 
993.912 -1033.89 0 0 0 1762.22 0 0 0 0 0 0 0 0 1632.21 0 0 252.617 0 0 0 0 0 1.75481 0 0 0 0 1750.92 0 0 0 0 0 0 0 0 0 0 0 329.218 0 0 0 0 0 0 0 0 0 0 0 0 0 0 0 0 -1122.24 0 0 0 0 0 0 0 0 0 0 0 -2376.25 0 0 0 0 0 
0 0 0 1985.46 0 0 0 0 0 0 0 0 0 0 893.201 0 0 0 0 0 0 0 0 0 0 0 0 0 1584.9 0 0 -1965.77 0 0 0 0 0 0 0 1091.27 0 0 0 0 0 0 0 0 0 133.442 0 0.09 730.689 0 0 0 0 0 0 0 0 0 0 0 0 0 0 0 0 0 0 0 0 0 0 
0 -1728.34 0 0 0 0 0 0 0 0 -1388.82 0 0 0 0 0 0 0 0 0 0 1297.42 -940.504 0 0 0 0 2059.92 0 0 0 1290.4 1846.14 0 0 0 0 0 0 395.291 0 0 0 0 0 0 0 0 0 0 0 2042.38 0.03 0 0 0 0 0 0 0 0 0 0 0 0 0 0 0 0 0 0 0 0 0 0 
508.362 0 0 0 0 0 0 0 0 2167.2 0 0 0 0 590.915 0 0 0 0 0 0 0 0 0 0 0 0 0 0 0 0 0 0 0 0 1439.63 0 0 0 0 -990.555 0 0 0 0 0 527.284 0 0 0 0 0 0 0.08 0 0 0 0 0 0 0 0 0 0 0 0 0 0 0 0 0 0 0 0 0 
557.039 0 0 0 1339.23 0 0 0 0 798.44 0 1632.05 0 0 2190.54 0 0 0 0 0 0 0 0 0 1156.58 261.62 0 0 0 0 0 0 -1245.08 1461.91 0 0 0 0 0 0 0 767.464 0 0 0 0 0 0 0 -1343.65 0 0 0 0 0.03 0 0 0 0 0 0 0 0 0 0 0 0 0 0 0 0 0 0 0 0 
1696.75 0 0 0 1221.88 0 1103.78 0 -800.882 -2209.01 1204.18 0 0 0 0 0 0 0 -1742.23 2460.78 0 -1254.69 -1647.77 0 0 0 0 0 1641.97 0 0 0 0 0 0 0 -791.421 0 0 0 0 0 0 0 2274.32 0 0 0 0 0 0 0 0 0 0 0.06 0 0 0 0 0 0 0 0 0 0 0 0 0 0 0 0 0 0 0 
0 0 0 0 0 0 0 0 0 0 0 0 0 0 0 0 0 0 1940.44 0 0 2105.09 0 0 0 0 0 0 0 0 0 0 0 0 0 -941.572 0 0 0 0 0 0 0 0 0 1238.67 -2045.73 0 0 0 0 0 0 0 0 0 0.09 0 1067.31 0 0 1063.65 0 0 0 0 0 0 0 0 0 0 0 0 0 
0 17.0141 0 0 0 0 0 1392.94 -1670.2 0 0 0 0 0 0 -617.618 0 0 0 0 0 0 0 -1155.05 0 0 0 966.14 0 0 1900.77 0 0 0 0 0 0 0 0 0 0 215.995 0 0 0 0 -256.584 0 0 2359.31 2048.63 0 0 0 0 0 0 0 0 0 0 0 0 0 0 0 0 0 -1050.98 0 0 0 0 1551.79 0 
0 0 0 0 1279.11 0 330.134 0 0 1050.83 0 -537.049 0 0 0 0 0 0 481.201 0 0 0 0 0 0 0 0 469.604 0 0 0 0 0 0 0 0 0 0 0 0 0 600.986 0 0 0 0 0 1706.21 0 0 0 0 0 0 0 0 -293.207 0 0.04 0 0 0 0 0 0 0 0 0 0 0 0 0 0 0 0 
0 1444.06 0 0 0 -1036.64 0 0 512.482 0 0 0 0 0 0 0 492.645 0 0 0 0 -1731.39 0 0 0 0 0 0 0 0 0 0 0 1685.16 0 0 -441.221 0 209.128 0 0 0 0 0 0 0 0 0 -794.32 0 0 0 0 0 0 0 0 0 0 0.08 0 0 890.606 0 0 0 0 0 0 0 0 0 0 0 0 
0 0 0 0 0 0 0 550.02 0 0 0 0 0 269.707 0 0 0 0 0 0 0 0 0 0 0 1735.05 0 0 0 0 698.645 0 0 0 0 -2093.34 0 0 -669.5 2218.62 0 0 0 0 0 0 2348.78 0 0 0 0 0 0 0 0 0 0 0 0 0 0.08 0 0 0 0 0 0 0 0 0 0 0 0 0 -2396.69 
0 0 0 0 0 0 0 0 0 0 788.675 0 -2380.67 0 -2403.87 0 0 0 0 0 0 0 0 0 0 673.925 1334.65 0 0 0 2499.54 0 0 0 -160.146 0 0 0 0 0 112.384 0 0 0 0 0 -88.4274 0 0 0 0 0 0 0 0 0 -1448.94 0 0 0 0 0.07 0 0 0 0 0 0 0 0 0 0 0 0 451.598 
-163.198 0 0 0 -941.725 0 0 0 0 0 0 0 0 1680.12 0 0 0 0 -1029.16 0 2373.5 0 0 0 0 0 0 0 0 0 0 0 0 0 -708.258 0 0 -147.938 0 0 0 0 0 0 0 1728.8 -1784.95 585.574 0 0 0 0 0 0 0 0 0 0 0 115.589 0 0 0.03 0 0 0 0 0 0 0 0 0 0 0 0 
0 0 0 0 0 0 0 0 0 0 0 0 1346.4 0 0 0 0 0 0 0 0 0 0 0 0 0 0 0 0 0 0 0 0 0 0 0 0 0 0 0 0 0 0 0 0 0 0 0 0 0 0 0 0 0 0 0 0 0 0 0 0 0 0 0.05 0 -519.654 0 0 0 0 0 0 0 0 0 
0 0 0 0 0 0 0 0 0 0 0 0 0 0 0 0 0 0 0 0 0 0 0 0 1389.28 0 0 0 0 0 0 0 0 0 0 0 0 0 0 0 0 0 0 0 0 0 0 0 0 0 0 0 0 0 0 0 0 0 0 0 0 0 0 0 0 0 0 0 0 0 0 0 2393.49 0 0 
0 0 0 0 0 0 0 0 0 0 0 0 0 1953.87 0 0 -257.805 0 0 0 0 0 0 0 0 0 0 0 0 0 0 0 0 0 0 0 0 0 0 0 0 0 0 0 0 0 0 0 0 0 0 0 0 0 0 0 0 0 0 0 0 0 0 2262.87 0 0.01 0 1431.09 0 0 2473.75 0 0 0 0 
0 0 0 0 0 0 0 0 0 0 0 0 0 0 0 0 0 1452.6 0 0 0 0 0 0 0 0 0 0 0 0 0 0 0 0 0 0 2336.88 0 0 0 0 0 0 0 0 0 0 0 -428.861 0 0 0 0 0 0 0 0 0 0 0 0 0 0 0 0 0 0 0 0 0 0 0 0 0 0 
0 -1961.81 0 2409.36 0 0 0 0 0 0 0 0 0 0 0 0 0 0 0 0 0 0 0 0 0 0 0 0 0 0 0 0 0 0 0 0 0 0 0 0 0 0 0 0 0 0 0 0 0 0 0 0 0 0 0 0 0 0 0 0 0 0 0 0 0 1615.27 0 0.07 0 0 0 0 0 0 0 
0 0 0 0 0 0 0 0 0 0 0 0 0 -4.65407 0 0 0 0 0 0 0 0 0 0 0 0 0 0 0 0 0 0 0 0 0 0 -719.55 0 0 0 0 0 0 0 0 0 0 0 0 0 0 0 0 0 0 0 0 1362.12 0 0 0 0 0 0 0 0 0 0 0.04 0 0 0 0 0 0 
0 0 0 0 0 0 0 0 0 0 0 0 0 0 0 0 0 0 0 0 0 0 0 0 0 0 0 0 0 0 0 0 -79.2718 0 0 0 0 0 0 0 0 0 0 0 0 0 0 0 0 0 865.734 0 0 0 0 0 0 0 0 0 0 0 0 0 0 0 0 0 0 0.02 0 0 0 0 0 
0 0 0 0 0 0 0 0 0 0 0 0 0 0 0 0 0 1238.67 0 0 0 0 0 0 0 0 0 0 0 0 0 0 0 0 0 0 0 0 0 0 0 0 0 0 0 0 0 0 0 0 0 0 0 0 0 0 0 0 0 0 0 0 0 0 0 1684.39 0 0 0 0 0.02 0 0 0 0 
0 0 0 0 0 0 0 0 0 0 0 0 0 0 0 0 0 0 0 0 0 0 0 0 0 -383.541 0 0 0 0 0 0 0 0 0 0 0 2164.3 0 0 0 0 0 0 0 0 0 0 0 0 0 0 0 0 0 0 0 0 0 0 0 0 0 0 0 0 0 0 0 0 0 0.09 0 0 0 
0 0 0 0 0 0 0 1075.24 0 0 0 0 0 0 0 0 0 0 2409.36 0 0 0 0 0 0 0 0 0 0 0 0 0 0 0 0 0 0 0 0 0 0 0 0 0 0 0 0 0 0 0 0 0 0 0 0 0 0 0 0 0 0 0 0 0 2382.2 0 0 0 0 0 0 0 0.07 0 0 
0 0 0 0 0 0 0 0 0 0 0 0 0 0 0 0 0 0 0 0 0 0 0 0 0 0 0 978.5 0 0 0 0 0 0 0 0 0 0 0 0 0 0 0 0 0 0 0 0 410.398 0 0 0 0 0 0 0 0 -512.024 0 0 0 0 0 0 0 0 0 0 0 0 0 0 0 0.08 0 
0 0 0 0 0 0 0 0 0 0 0 0 0 0 0 0 0 0 0 0 0 0 0 0 0 0 0 0 0 0 0 0 0 0 0 0 0 0 0 0 0 0 0 0 0 0 0 0 0 0 0 0 0 0 0 0 0 0 0 0 1645.48 -1498.99 0 0 0 0 0 0 0 0 0 0 0 0 0.06 
