*Vertices 64
*Matrix 
0.04 0 0 0 0 0 0 0 0 0 0 0 0 0 0 0 0 0 0 0 0 0 0 0 0 0 0 0 0 0 0 0 -851.238 0 0 0 -556.429 0 0 0 0 0 0 0 0 0 0 0 0 -1910.08 0 0 1424.22 0 2314.45 0 0 0 0 0 0 0 0 0 
0 0.02 0 480.132 159.688 0 0 0 0 0 0 0 0 -612.735 -1426.66 0 0 0 0 -823.923 0 0 0 0 0 0 0 0 0 0 0 0 0 0 0 1899.24 1601.84 0 0 0 0 0 0 0 0 0 0 0 2466.58 0 0 0 -1068.07 0 -1467.25 0 0 1601.84 0 0 0 0 0 0 
0 0 0.02 0 0 0 -1036.33 0 0 0 0 0 0 0 0 0 0 0 0 0 0 0 0 0 0 0 0 -1369.29 0 0 0 0 0 0 0 0 0 0 0 0 0 0 0 0 357.295 0 0 2062.97 0 0 -1525.54 0 0 2055.65 0 0 0 0 0 2410.43 0 0 0 0 
0 246.818 0 0 0 0 0 0 0 0 0 0 0 1132.16 0 0 0 0 0 0 -2213.28 0 0 0 0 0 0 0 0 0 0 -534.15 0 0 0 0 0 1977.98 0 0 990.249 0 0 0 0 0 0 0 0 0 -325.404 0 0 0 0 0 1750.47 0 0 0 0 0 0 0 
0 2275.23 0 0 0.01 1392.64 687.658 0 0 0 0 0 0 0 0 0 0 0 0 0 0 0 0 0 0 0 0 0 -372.25 601.596 0 0 -128.101 0 0 0 0 1030.69 0 0 0 0 0 -1527.99 0 0 0 158.467 0 0 0 0 0 0 0 0 0 0 0 0 0 0 0 0 
0 0 0 0 -182.577 0.09 0 0 1098.59 0 0 0 1659.83 0 0 0 0 0 0 0 0 0 0 0 0 0 0 0 0 0 0 0 0 0 0 0 0 0 0 46.3118 0 -519.196 1206.32 0 0 0 0 0 0 0 -396.207 -11.5207 0 0 0 0 0 0 0 0 0 0 0 0 
0 0 -399.564 0 184.408 0 0.07 0 0 0 0 0 0 0 0 0 0 2458.49 0 0 0 2058.24 0 0 0 0 0 2492.52 2137.59 0 -1172.14 0 0 0 0 0 0 0 0 0 0 759.529 0 -1814.71 0 0 226.066 590.152 0 0 0 0 0 542.39 0 0 -1948.99 0 -1271.17 0 0 0 0 0 
0 0 0 0 0 0 0 0.08 0 0 0 0 0 0 0 0 0 0 -537.507 0 0 0 0 0 0 -2417.29 0 0 1665.78 0 0 2187.03 0 0 0 0 0 0 0 0 0 0 0 0 1475.19 0 -2482.3 0 0 0 0 0 231.407 0 0 0 1433.53 0 0 0 0 0 0 0 
0 0 0 0 0 -429.319 0 0 0.08 0 0 2043.29 0 408.414 0 1422.54 0 0 0 0 0 0 1672.95 0 0 0 0 -1898.79 -1426.36 0 0 0 0 0 0 0 0 0 0 0 0 0 0 0 0 -1217.46 1403.62 0 0 0 0 0 0 0 0 0 0 0 0 0 0 0 0 0 
0 0 0 0 0 0 0 0 0 0 0 881.909 0 1148.79 0 0 0 0 436.491 0 0 0 0 720.923 0 463.958 0 0 0 0 0 0 0 0 0 0 0 0 0 0 0 0 0 0 0 -219.047 0 0 0 0 0 0 0 0 0 0 2445.22 0 0 2311.55 0 0 0 150.838 
0 0 0 0 0 0 0 0 0 0 0.01 0 0 0 0 0 0 0 0 0 0 0 0 0 0 0 0 -328.15 0 0 1283.23 0 0 0 0 0 0 -281.762 725.959 0 0 0 0 0 0 0 0 0 0 1754.89 0 0 0 0 0 0 0 0 0 0 -984.756 0 0 0 
0 0 0 0 0 0 0 0 1029.62 2348.02 0 0.06 0 0 0 0 0 0 2112.11 0 0 0 0 0 0 0 0 0 0 0 1195.49 0 0 2181.23 0 0 0 0 0 0 0 860.393 -1016.34 0 0 0 0 0 0 0 0 0 0 -651.036 0 0 0 0 0 1655.4 0 -2149.65 0 0 
0 0 0 0 0 1417.36 0 0 0 0 0 0 0 0 1998.28 0 0 0 0 0 0 1635.26 0 0 0 0 0 0 0 0 0 0 0 0 0 -1140.71 0 0 0 0 0 -1079.97 0 0 0 0 0 0 1114.92 0 0 0 1176.11 0 0 0 0 -368.282 -561.007 867.107 -1194.27 0 0 0 
0 -2273.86 0 1298.94 0 0 0 0 -487.457 1138.26 0 0 0 0.05 0 0 0 0 0 0 0 0 0 0 -315.332 0 0 0 0 0 0 0 0 0 0 0 0 0 0 0 0 0 0 0 0 -445.189 0 2288.96 0 0 0 676.519 0 0 0 0 0 0 0 0 1678.75 0 -167.013 0 
0 938.215 0 0 0 0 0 0 0 0 0 0 1431.55 0 0.01 0 0 0 0 0 0 0 0 0 0 0 0 0 0 0 0 0 0 0 0 0 -805.46 -517.975 0 0 0 0 0 0 0 0 0 0 0 0 0 -1608.86 417.264 -2494.81 0 866.344 1978.9 0 0 0 0 0 0 0 
0 0 0 0 0 0 0 0 498.138 0 0 0 0 0 0 0.07 0 0 0 0 0 0 0 0 0 0 0 -420.774 699.561 0 0 0 0 0 0 0 0 0 0 1966.38 0 0 829.417 0 0 0 0 0 0 0 0 0 1688.51 0 0 0 0 0 0 0 0 0 0 0 
0 0 0 0 0 0 0 0 0 0 0 0 0 0 0 0 0.04 0 0 0 0 0 0 0 0 0 0 0 0 0 0 0 0 0 197.684 0 570.315 0 0 0 0 0 0 0 1357.69 0 0 0 0 0 196.31 0 0 0 0 0 1356.78 0 0 0 0 0 0 0 
0 0 0 0 0 0 901.288 0 0 0 0 0 0 0 0 0 0 0.08 0 0 -243.004 0 0 0 0 0 0 0 0 0 0 906.476 0 0 0 -547.578 0 1550.11 0 0 0 0 0 0 0 0 0 0 0 1783.73 0 0 0 0 0 0 -1682.1 0 0 0 0 0 0 0 
0 0 0 0 0 0 0 -2496.8 0 578.555 0 -295.038 0 0 0 0 0 0 0.05 -967.818 0 1028.55 0 0 0 0 0 0 0 0 0 0 0 0 0 0 0 0 0 0 0 0 0 0 0 0 0 0 0 2140.49 0 0 0 0 0 0 0 -380.032 2002.85 0 0 0 0 0 
0 2232.81 0 0 0 0 0 0 0 0 0 0 0 0 0 0 0 0 655.919 0.03 0 0 -44.3281 0 0 0 0 -401.242 0 0 -956.832 0 -543.306 0 -725.501 0 0 0 0 0 0 0 0 0 0 1995.07 0 -254.448 0 0 1603.82 0 0 -1697.06 0 0 0 1776.86 0 -1124.23 0 0 0 0 
0 0 0 439.848 0 0 0 0 0 0 0 0 0 0 0 0 0 1711.25 0 0 0.08 0 -1417.97 0 0 0 0 0 1255.15 0 0 0 0 0 0 0 0 0 0 0 0 0 0 0 0 0 0 1290.4 832.316 0 0 0 0 0 0 0 0 0 0 0 0 0 0 0 
0 0 0 0 0 0 55.62 0 0 0 0 0 2495.27 0 0 0 0 0 -2241.36 0 0 0.06 0 0 -1061.2 0 0 0 0 0 0 0 0 0 0 0 -219.81 0 0 0 0 0 0 0 0 0 1357.08 0 0 0 -378.201 0 160.756 0 0 0 0 0 0 0 0 0 0 0 
0 0 0 0 0 0 0 0 -1636.78 0 0 0 0 0 0 0 0 0 0 291.833 -440.153 0 0.06 0 0 0 0 0 0 0 0 0 0 0 0 0 0 0 0 0 0 2489.01 0 0 0 0 48.2955 0 0 0 0 0 0 0 0 0 0 0 -1660.44 0 2091.81 0 0 0 
0 0 0 0 0 0 0 0 0 -996.506 0 0 0 0 0 0 0 0 0 0 0 0 0 0.02 0 1355.71 0 0 0 1811.5 0 0 0 0 0 0 0 0 0 -1781.44 0 0 0 0 0 0 0 0 0 1876.51 0 0 0 0 -1573.46 0 0 0 0 0 0 0 0 0 
0 0 0 0 0 0 0 0 0 0 0 0 0 818.278 0 0 0 0 0 0 0 2200 0 0 0.01 0 0 0 0 0 0 0 0 0 0 0 0 0 0 0 -1694.01 2460.78 0 0 0 0 0 0 0 0 0 0 0 0 0 0 506.836 0 0 0 0 0 0 0 
0 0 0 0 0 0 0 1348.23 0 512.329 0 0 0 0 0 0 0 0 0 0 0 0 0 2352.9 0 0.09 0 0 0 0 0 577.639 0 0 0 0 0 0 0 0 0 0 0 0 0 0 0 0 1942.58 0 0 0 0 0 0 0 0 0 -62.4866 0 0 0 0 0 
0 0 0 0 0 0 0 0 0 0 0 0 0 0 0 0 0 0 0 0 0 0 0 0 0 0 0.09 -1188.62 0 -126.576 0 0 0 0 0 0 0 0 0 0 0 0 1093.55 0 1165.88 0 0 0 0 0 0 0 1870.86 0 0 0 0 0 0 1905.65 0 0 0 0 
0 0 -549.409 0 0 0 1629.15 0 1984.24 0 -2134.08 0 0 0 0 2406.46 0 0 0 -131.611 0 0 0 0 0 0 -1609.47 0 0 0 0 0 0 0 0 0 0 0 -2473.14 0 0 -1714 0 0 0 0 0 0 893.506 0 0 0 0 -855.663 1700.11 0 0 0 0 0 0 0 0 0 
0 0 0 0 1977.83 0 -1972.33 909.07 788.369 0 0 0 0 0 0 -1244.47 0 0 0 0 1704.08 0 0 0 0 0 0 0 0.02 0 0 0 0 0 0 0 0 -350.276 0 0 0 0 0 2210.07 0 0 0 1031.6 0 0 0 0 0 0 0 0 0 0 0 0 0 0 0 0 
0 0 0 0 2149.8 0 0 0 0 0 0 0 0 0 0 0 0 0 0 0 0 0 0 -1698.28 0 0 -431.455 0 0 0 0 0 0 0 0 0 917.463 0 0 0 0 0 -801.95 0 0 0 1661.2 0 0 1320.92 0 0 0 0 0 0 1170 0 0 0 0 0 0 0 
0 0 0 0 0 0 -1786.48 0 0 0 -458.312 370.418 0 0 0 0 0 0 0 1355.25 0 0 0 0 0 0 0 0 0 0 0.02 0 0 0 2243.8 0 0 0 0 0 0 0 0 -711.463 0 0 0 0 0 0 0 0 0 0 0 0 0 0 2483.37 0 0 0 0 0 
0 0 0 44.9385 0 0 0 157.094 0 0 0 0 0 0 0 0 0 504.395 0 0 0 0 0 0 0 -964.309 0 0 0 0 0 0.08 0 0 0 0 0 626.164 47.5326 0 0 1598.79 1586.73 0 0 0 0 0 0 0 0 0 0 0 0 0 0 0 0 0 0 0 0 0 
-2236.63 0 0 0 1389.43 0 0 0 0 0 0 0 0 0 0 0 0 0 0 -98.3459 0 0 0 0 0 0 0 0 0 0 0 0 0.04 1133.38 0 0 0 0 0 0 0 0 -89.4955 0 -537.049 0 0 0 0 0 0 0 1102.56 0 0 0 0 0 0 0 0 0 0 0 
0 0 0 0 0 0 0 0 0 0 0 -1189.23 0 0 0 0 0 0 0 0 0 0 0 0 0 0 0 0 0 0 0 0 2294 0.01 0 0 0 0 -1467.86 2253.87 0 2459.41 0 0 0 0 0 0 0 0 0 0 0 0 -2085.86 0 0 0 0 0 0 0 0 0 
0 0 0 0 0 0 0 0 0 0 0 0 0 0 0 0 1046.86 0 0 1811.2 0 0 0 0 0 0 0 0 0 0 369.198 0 0 0 0.07 0 0 0 0 0 0 0 0 -1889.78 0 0 0 0 0 -8.92666 0 0 0 0 0 0 -746.254 0 2467.19 0 0 0 0 0 
0 -251.091 0 0 0 0 0 0 0 0 0 0 3.73852 0 0 0 0 2405.39 0 0 0 0 0 0 0 0 0 0 0 0 0 0 0 0 0 0.02 0 0 0 0 0 0 0 0 0 0 0 0 107.501 0 0 0 0 0 0 0 0 0 356.227 2409.21 -670.11 0 0 0 
-1684.55 1887.49 0 0 0 0 0 0 0 0 0 0 0 0 -1644.87 0 -755.562 0 0 0 0 268.029 0 0 0 0 0 0 0 1908.55 0 0 0 0 0 0 0.09 0 -303.278 0 0 291.375 0 1939.07 168.691 0 0 0 0 0 0 0 2063.28 0 0 1918.32 0 0 0 0 0 0 0 0 
0 0 0 480.438 2267.3 0 0 0 0 0 -41.1237 0 0 0 616.703 0 0 71.0318 0 0 0 0 0 0 0 0 0 0 -205.008 0 0 2290.03 0 0 0 0 0 0.09 1473.36 0 0 0 -905.56 0 0 0 0 0 0 0 0 0 0 0 0 0 0 0 0 0 0 0 0 0 
0 0 0 0 0 0 0 0 0 0 1926.25 0 0 0 0 0 0 0 0 0 0 0 0 0 0 0 0 427.641 0 0 0 26.9326 0 2346.03 0 0 2314.14 172.964 0.01 0 0 2277.37 0 0 0 0 0 0 0 0 0 1206.47 2484.44 0 0 0 0 0 0 0 -1159.47 0 0 0 
0 0 0 0 0 2289.73 0 0 0 0 0 0 0 0 0 -2060.53 0 0 0 0 0 0 0 1793.8 0 0 0 0 0 0 0 0 0 184.561 0 0 0 0 0 0.08 0 -786.996 0 0 0 -2463.99 0 0 0 903.272 0 2212.67 0 0 0 0 0 0 0 0 0 0 0 0 
0 0 0 1430.33 0 0 0 0 0 0 0 0 0 0 0 0 0 0 0 0 0 0 0 0 880.23 0 0 0 0 0 0 0 0 0 0 0 0 0 0 0 0.02 550.172 -2379.6 0 0 0 684.759 0 0 1180.99 0 0 -113.3 0 0 0 0 0 0 0 0 0 0 0 
0 0 0 0 0 -1405.45 1641.51 0 0 0 0 1605.96 -2057.18 0 0 0 0 0 0 0 0 0 2343.9 0 -215.69 0 0 2435.76 0 0 0 1159.63 0 -964.003 0 0 655.004 0 1055.41 992.233 999.1 0.04 0 0 701.544 0 0 0 0 -1728.95 0 0 0 0 0 0 0 1715.22 2274.47 0 0 0 0 0 
0 0 0 0 0 -1680.27 0 0 0 0 0 1718.42 0 0 0 235.679 0 0 0 0 0 0 0 0 0 0 -1943.49 0 0 -433.744 0 1786.63 2497.56 0 0 0 0 2121.11 0 0 972.854 0 0.02 0 0 0 0 0 0 0 0 0 -1022.75 0 0 487.609 0 0 0 -1009.63 0 0 0 0 
0 0 0 0 -339.595 0 827.586 0 0 0 0 0 0 0 0 0 0 0 0 0 0 0 0 0 0 0 0 0 954.085 0 -895.032 0 0 0 -1174.28 0 1138.26 0 0 0 0 0 0 0.02 0 0 0 0 0 1752.3 0 0 0 0 0 0 0 0 0 1698.43 0 0 0 0 
0 0 -783.792 0 0 0 0 -334.559 0 0 0 0 0 0 0 0 -1657.84 0 0 0 0 0 0 0 0 0 1096.76 0 0 0 0 0 -487.304 0 0 0 1753.67 0 0 0 0 186.392 0 0 0.08 0 0 0 0 857.952 0 0 1145.89 0 0 0 1804.33 0 0 0 0 1711.4 0 0 
0 0 0 0 0 0 0 0 2072.13 2088.76 0 0 0 -128.254 0 0 0 0 0 -259.026 0 0 0 0 0 0 0 0 0 0 0 0 0 0 0 0 0 0 0 -884.655 0 0 0 0 0 0.03 0 0 0 0 -2149.19 0 0 0 0 0 0 0 0 0 0 0 0 0 
0 0 0 0 0 0 -979.11 290.918 1544.62 0 0 0 0 0 0 0 0 0 0 0 0 -554.598 -2385.86 0 0 0 0 0 0 -847.88 0 0 0 0 0 0 0 0 0 0 1849.19 0 0 0 0 0 0.07 0 0 0 0 0 0 1453.37 355.007 0 0 0 0 0 0 361.721 0 0 
0 0 729.316 0 -1795.33 0 1750.01 0 0 0 0 0 0 1678.29 0 0 0 0 0 -797.372 1139.03 0 0 0 0 0 0 0 1739.78 0 0 0 0 0 0 0 0 0 0 0 0 0 0 0 0 0 0 0.09 0 0 0 1506.32 0 0 0 0 0 0 0 0 0 0 0 0 
0 578.402 0 0 0 0 0 0 0 0 0 0 3.28074 0 0 0 0 0 0 0 313.501 0 0 0 0 995.438 0 -1095.08 0 0 0 0 0 0 0 -1098.59 0 0 0 0 0 0 0 0 0 0 0 0 0.02 0 0 0 2231.13 0 0 -1283.99 0 0 0 0 0 0 0 0 
701.544 0 0 0 0 0 0 0 0 0 2186.12 0 0 0 0 0 0 758.461 -1544.16 0 0 0 0 -671.331 0 0 0 0 0 1093.71 0 0 0 0 618.534 0 0 0 0 -2227.01 -444.121 1759.93 0 577.639 232.322 0 0 0 0 0.04 0 0 0 0 0 0 0 0 0 0 0 0 0 0 
0 0 910.596 633.641 0 -972.396 0 0 0 0 0 0 0 0 0 0 1835.61 0 0 1243.55 0 2135.61 0 0 0 0 0 0 0 0 0 0 0 0 0 0 0 0 0 0 0 0 0 0 0 -2336.27 0 0 0 0 0.02 0 0 273.217 1580.02 0 0 0 0 0 0 857.494 0 0 
0 0 0 0 0 608.005 0 0 0 0 0 0 0 -1671.58 765.633 0 0 0 0 0 0 0 0 0 0 0 0 0 0 0 0 0 0 0 0 0 0 0 -662.786 321.131 0 0 0 0 0 0 0 1973.1 0 0 0 0.08 0 0 0 1811.2 0 0 0 0 0 0 0 0 
-2499.24 537.812 0 0 0 0 0 -1061.05 0 0 0 0 2119.59 0 1544.77 1584.75 0 0 0 0 0 1899.85 0 0 0 0 1310.54 0 0 0 0 0 -642.186 0 0 0 1501.89 0 -349.208 0 -32.1207 0 1245.23 0 -1794.72 0 0 0 1523.56 0 0 0 0.03 -1838.36 -247.581 0 0 -1498.23 0 0 0 0 0 0 
0 0 2305.6 0 0 0 -5.56963 0 0 0 0 1940.75 0 0 1745.43 0 0 0 0 68.2852 0 0 0 0 0 0 0 650.578 0 0 0 0 0 0 0 0 0 0 0 0 0 0 0 0 0 0 -2411.34 0 0 0 -1990.19 0 -81.2555 0.02 1244.16 0 0 0 0 0 0 0 0 0 
1378.44 -1822.49 0 0 0 0 0 0 0 0 0 0 0 0 0 0 0 0 0 0 0 0 0 1510.44 0 0 0 2096.55 0 0 0 0 0 2255.85 0 0 0 0 0 0 0 0 0 0 0 0 2395.02 0 0 0 2317.5 0 1314.51 -2124.32 0.04 0 0 0 0 0 0 0 0 0 
0 0 0 0 0 0 0 0 0 0 0 0 0 0 -2229.91 0 0 0 0 0 0 0 0 0 0 0 0 0 0 0 0 0 0 0 0 0 437.864 0 0 0 0 0 -518.433 0 0 0 0 0 1748.48 0 0 1015.43 0 0 0 0.09 0 0 0 0 0 0 0 0 
0 0 0 170.98 0 0 -170.98 1907.18 0 -507.752 0 0 0 0 -2151.33 0 -260.552 1099.96 0 0 0 0 0 0 2489.32 0 0 0 0 2106.31 0 0 0 0 -1474.12 0 0 0 0 0 0 0 0 0 -240.867 0 0 0 0 0 0 0 0 0 0 0 0.06 0 0 0 0 0 0 0 
0 -834.91 0 0 0 0 0 0 0 0 0 0 880.84 0 0 0 0 0 -976.058 1645.94 0 0 0 0 0 0 0 0 0 0 0 0 0 0 0 0 0 0 0 0 0 1523.1 0 0 0 0 0 0 0 0 0 0 1648.38 0 0 0 0 0.09 0 -2087.39 -1222.8 0 0 0 
0 0 0 0 0 0 1274.83 0 0 0 0 0 1155.66 0 0 0 0 0 -2372.89 0 0 0 2228.54 0 0 -1829.05 0 0 0 0 1762.83 0 0 0 2225.94 -256.584 0 0 0 0 0 1309.02 0 0 0 0 0 0 0 0 0 0 0 0 0 0 0 0 0.04 1732.46 0 0 0 0 
0 0 -1085.62 0 0 0 0 0 0 677.129 0 1183.43 1555.6 0 0 0 0 0 0 1926.4 0 0 0 0 0 0 -2198.48 0 0 0 0 0 0 0 0 1835.92 0 0 0 0 0 0 -1299.55 1341.82 0 0 0 0 0 0 0 0 0 0 0 0 0 -593.051 -2161.09 0.04 0 0 0 0 
0 0 0 0 0 0 0 0 0 0 364.772 0 -1029.77 2166.89 0 0 0 0 0 0 0 0 2077.62 0 0 0 0 0 0 0 0 0 0 0 0 -1392.48 0 0 897.168 0 0 0 0 0 0 0 0 0 0 0 0 0 0 0 0 0 0 325.404 0 0 0.05 0 0 0 
0 0 0 0 0 0 0 0 0 0 0 -1192.28 0 0 0 0 0 0 0 0 0 0 0 0 0 0 0 0 0 0 0 0 0 0 0 0 0 0 0 0 0 0 0 0 1749.09 0 324.946 0 0 0 1503.11 0 0 0 0 0 0 0 0 0 0 0.07 0 0 
0 0 0 0 0 0 0 0 0 0 0 0 0 950.117 0 0 0 0 0 0 0 0 0 0 0 0 0 0 0 0 0 0 0 0 0 0 0 0 0 0 0 0 0 0 0 0 0 0 0 0 0 0 0 0 0 0 0 0 0 0 0 0 0.08 0 
0 0 0 0 0 0 0 0 0 1826.61 0 0 0 0 0 0 0 0 0 0 0 0 0 0 0 0 0 0 0 0 0 0 0 0 0 0 0 0 0 0 0 0 0 0 0 0 0 0 0 0 0 0 0 0 0 0 0 0 0 0 0 0 0 0.03 
