*Vertices 78
*Matrix 
0.07 0 2433.77 0 0 0 -356.99 0 0 0 0 0 -2251.27 0 2008.35 -2326.81 0 0 0 0 -873.669 -2364.5 0 951.643 1735.82 0 35.6304 0 823.771 0 1595.28 2275.23 0 1133.99 0 0 0 0 0 0 360.347 0 0 0 -1480.38 736.183 0 0 -791.116 0 0 2264.85 0 0 0 0 0 0 1381.04 0 1314.97 0 0 0 0 0 0 0 0 0 0 0 0 0 0 0 0 0 
0 0.04 0 0 0 0 -555.971 0 0 0 0 0 0 0 0 0 0 0 0 0 0 0 -1623.2 -1873.91 0 1121.02 0 1140.1 2409.97 0 0 0 0 0 0 829.264 -880.993 0 0 0 0 1283.68 0 0 0 -1190.76 0 0 -1068.07 549.257 2040.39 0 0 0 0 1556.83 0 0 0 0 0 0 0 0 0 694.525 0 0 0 0 1284.75 0 0 -2020.71 0 0 0 0 
1169.85 0 0.04 -2233.57 -251.549 523.621 0 0 -538.118 0 -1730.63 0 0 -321.436 -1791.67 0 0 0 0 -1594.97 0 0 2340.85 0 0 0 0 0 0 0 0 0 0 0 0 0 0 0 0 0 0 662.938 0 0 0 1844 0 0 0 0 0 0 1675.7 0 0 1982.1 0 0 2393.03 0 0 0 0 0 0 0 -1397.06 0 0 0 0 0 0 0 0 0 0 0 
0 0 703.375 0.02 0 -1284.45 0 0 0 0 944.777 -1592.23 1948.38 -1676.31 0 0 0 0 0 0 0 1680.43 0 -1995.07 0 0 0 0 0 -506.073 0 0 0 0 1381.19 2421.57 0 0 0 0 -304.041 1325.5 0 2016.28 0 1862.93 0 0 0 -726.875 0 1382.87 1889.17 0 0 0 0 0 0 0 0 0 0 0 0 759.987 0 0 0 0 0 0 0 -255.058 0 0 0 0 
0 0 -2480.47 0 0.02 0 0 579.012 -737.556 1085.47 0 0 0 -712.683 1845.38 634.251 1998.58 2302.55 -2445.83 0 -357.906 2187.95 0 0 2137.29 0 0 0 -1413.85 0 1218.83 0 0 0 -359.737 0 0 712.226 0 1575.29 0 374.538 0 0 0 -82.0185 0 -1246.3 0 0 0 0 0 0 0 0 -2206.11 0 420.011 0 0 0 0 -1771.98 0 0 0 1575.75 0 0 0 0 0 0 0 0 0 0 
0 0 -595.035 2023.3 0 0.05 0 0 0 127.796 0 0 0 0 -687.964 1562.62 0 0 0 0 0 -1025.04 0 0 0 0 0 0 1930.98 0 0 1059.37 0 0 6.94296 0 0 0 -120.014 -866.649 0 0 0 0 0 0 0 0 0 1383.63 0 0 0 0 0 0 0 0 -246.361 0 226.371 0 0 0 -1151.23 0 -2152.39 0 0 0 0 0 0 0 1799.45 0 0 0 
1395.23 364.315 0 0 0 0 0.05 -1172.29 0 0 -214.011 -73.0155 0 2205.19 0 0 0 -2311.55 -2034.29 375.759 0 0 0 0 814.31 1655.55 717.872 0 0 0 0 2179.56 0 0 0 0 0 942.03 0 2101.73 0 2498.78 0 0 0 1472.75 0 0 0 0 0 2356.41 0 0 0 345.546 437.864 0 0 0 0 0 1621.07 0 -2101.58 0 0 2083.42 0 219.352 0 0 0 0 0 -2164.91 0 0 
0 0 0 0 -1383.79 0 1130.63 0 0 0 0 0 1212.88 0 0 0 0 0 0 0 0 2166.13 -1590.24 0 -194.479 1229.21 0 0 0 0 -1914.2 0 0 0 1210.59 0 0 0 -928.907 0 1973.1 0 923.414 0 0 0 0 0 0 0 0 286.645 441.221 0 0 0 0 2152.7 0 0 -1624.27 1504.03 0 -1458.25 0 0 1312.07 0 0 0 0 0 0 1697.36 0 0 0 0 
0 0 975.906 0 1525.7 0 0 0 0.07 1195.03 0 0 0 2354.27 0 0 -878.704 0 -2147.66 0 0 2086.47 0 0 0 0 0 -1523.71 0 0 0 0 1043.05 614.872 0 1659.22 -2444.46 -697.272 0 0 2250.05 1520.2 0 0 0 0 279.778 0 0 0 0 -773.568 0 1435.97 0 0 0 235.984 0 1951.43 0 0 0 0 0 0 0 0 0 0 0 0 0 0 0 -1533.48 0 0 
0 0 0 0 1885.05 1567.35 0 0 -1305.96 0.07 0 0 0 0 0 447.325 0 0 0 0 -867.87 0 0 0 0 0 0 2340.24 0 0 0 0 0 0 0 259.941 0 0 0 0 0 0 0 0 0 -1033.59 -609.226 0 480.132 0 0 0 13.1993 0 1530.58 0 0 0 -547.426 0 -1483.12 0 0 0 0 0 0 0 0 0 0 0 0 839.488 0 0 0 0 
0 0 2277.98 1412.78 0 0 -2488.71 0 0 0 0.04 0 0 1661.2 686.438 0 0 0 0 0 1402.1 0 0 0 0 9.38444 0 0 0 0 0 0 0 -190.97 0 0 0 0 997.879 0 1376.16 0 221.183 0 0 599.765 1910.99 -1382.56 0 -2267.75 0 -2495.57 1343.5 1746.19 0 0 889.691 0 0 0 0 0 0 657.75 0 0 0 0 0 -1653.26 0 0 0 0 0 0 438.475 0 
0 0 0 1014.05 0 0 -1749.4 0 0 0 0 0.01 0 0 0 0 -2160.79 0 0 133.137 0 -1730.48 1933.12 0 1598.64 0 -558.718 0 0 0 0 0 0 0 -68.1326 852.916 -155.11 0 0 0 116.657 1899.55 0 0 0 675.146 0 0 1110.8 0 0 0 0 0 0 0 2142.48 1420.71 0 0 0 947.523 926.466 0 -757.698 781.655 0 0 0 0 -1343.5 0 0 0 0 0 0 0 
2444.15 0 0 145.802 0 0 0 -314.722 0 0 0 0 0.03 2284.69 0 0 -2249.44 0 0 -2324.21 0 0 533.845 0 861.919 115.741 1250.11 0 1085.16 0 0 0 0 787.759 0 0 -1082.11 0 0 0 1901.53 0 294.733 0 0 0 0 0 0 0 1141.01 0 7.09555 0 0 0 -2342.98 0 0 0 0 0 2349.39 0 0 0 0 0 0 0 0 -138.02 0 0 0 -720.923 -2399.9 0 
0 0 1712.16 463.5 1495.48 0 -1032.52 0 1009.93 0 1923.81 0 2071.98 0.05 0 -90.1059 0 -1168.48 -51.5 0 0 0 1421.17 1709.27 2242.42 0 -682.165 1.75481 0 0 2053.06 0 0 -929.975 0 0 -237.968 0 0 192.801 -384.61 0 0 0 0 0 0 0 0 0 0 0 0 -598.849 0 -943.556 453.276 0 0 0 0 0 0 0 0 0 0 0 0 0 0 -619.449 0 0 0 0 0 1681.49 
1894.82 0 1010.39 0 1348.38 832.774 0 0 0 0 790.658 0 0 0 0.03 0 0 0 1395.69 0 2473.3 0 -2087.39 0 0 1936.63 2324.21 0 0 0 0 0 0 0 0 568.331 0 0 -2250.05 0 0 1634.65 0 1650.82 -2182.91 0 -640.507 0 0 0 0 0 0 0 0 0 1851.48 0 0 0 0 0 542.39 0 0 0 0 0 0 0 0 0 0 0 0 0 0 0 
-1161.76 0 0 0 907.239 2018.72 0 0 0 -528.657 0 0 0 479.522 0 0.02 0 -1825.85 0 -1120.41 0 0 0 0 1536.99 0 0 0 0 -2284.84 694.525 0 72.2526 0 0 825.602 0 1430.94 -1712.01 0 0 2195.58 0 0 0 0 0 0 2042.68 0 0 0 -792.489 2115.31 0 -795.083 0 0 0 0 0 0 0 0 0 0 -592.898 0 0 0 0 0 0 0 956.221 0 1639.07 0 
0 0 0 0 1758.25 0 0 0 -935.011 0 0 443.51 839.946 0 0 0 0.03 0 -558.26 0 0 0 0 0 0 -713.294 494.934 0 2434.69 0 0 0 -1532.26 -352.565 0 0 0 0 0 0 0 0 0 0 2195.88 0 0 755.104 1060.59 0 579.623 0 0 -986.892 417.875 0 0 0 0 0 0 0 0 0 1576.97 0 0 -2130.27 0 0 0 -2134.39 0 0 0 0 1071.28 0 
0 0 0 0 1729.1 0 -2276.91 0 0 0 0 0 0 -858.409 0 -1007.34 0 0.04 0 0 0 0 -1926.71 0 0 0 2141.71 0 0 0 0 1370.51 0 0 1623.05 0 2486.11 131.306 0 0 0 0 0 0 96.057 73.4733 1770.46 0 898.083 0 -1536.38 0 0 0 0 0 0 240.867 0 0 0 0 1279.26 522.401 0 0 0 0 980.941 0 0 -1137.5 0 0 0 -1891.31 0 0 
0 0 0 0 2190.69 0 -203.635 0 1775.34 0 0 0 0 -2437.59 1683.78 0 -1489.23 0 0.02 0 0 0 0 1316.8 634.861 0 0 -793.1 -747.017 0 0 0 0 -299.31 0 0 0 0 0 0 -385.83 0 0 0 0 0 0 0 2025.89 -1876.81 0 0 0 0 0 0 1238.98 334.559 0 0 0 -43.5652 0 0 0 0 0 0 0 -270.623 0 0 0 0 2261.8 0 0 0 
0 0 1737.65 0 0 0 1537.29 0 0 0 0 -518.128 59.2822 0 0 2198.78 0 0 0 0.02 0 0 0 0 0 0 0 0 0 0 0 0 0 2091.2 -2382.35 0 0 0 0 0 0 -522.095 0 0 0 1162.68 0 978.042 0 0 0 -1551.48 0 378.201 17.3193 0 -1426.82 1253.93 0 0 -354.396 0 0 0 0 0 0 0 0 0 -1845.99 0 0 0 0 0 0 0 
2419.43 0 0 0 -1976.15 0 0 0 0 745.338 2143.09 0 0 0 1110.34 0 0 0 0 0 0.09 0 1920.3 1820.66 0 0 1173.21 0 -2019.64 0 0 2375.48 0 0 0 -2006.21 0 0 0 0 0 0 0 0 0 0 -371.487 0 0 0 0 0 0 0 0 0 0 0 0 0 -2274.01 0 0 0 0 0 0 0 0 0 0 0 -1787.7 64.1652 1473.66 -1983.93 0 0 
1195.33 0 0 1759.93 -536.439 -833.842 0 752.052 -605.869 0 0 735.725 0 0 0 0 0 0 0 0 0 0.01 0 -418.638 0 0 0 0 0 0 0 0 0 0 0 0 0 2113.79 0 0 0 -578.402 841.014 0 15.183 1242.33 -1153.98 1862.93 0 0 0 0 203.33 0 882.519 0 1042.89 0 0 0 0 0 0 0 0 0 0 0 0 0 0 0 0 0 822.245 0 -435.27 0 
0 2200.46 1548.89 0 0 0 0 2237.85 0 0 0 716.193 1236.53 -207.144 1455.66 0 0 1883.07 0 0 -715.583 0 0.07 0 0 -491.424 1197.78 0 0 -1730.32 0 -1769.23 0 -974.685 0 0 0 529.878 0 0 0 0 0 0 0 0 0 0 0 0 -2027.42 0 0 1164.66 0 0 0 0 0 0 0 0 0 0 0 0 0 0 0 0 0 0 0 0 0 0 0 0 
-1287.35 2299.65 0 993.454 0 0 0 0 0 0 0 0 0 -544.374 0 0 0 0 -1213.49 0 178.152 2426.6 0 0.09 0 0 758.614 0 0 0 0 0 0 0 0 0 0 0 0 1648.53 0 0 0 0 -1470.92 0 0 0 0 1060.75 1813.33 0 0 0 0 0 0 0 0 -2252.49 0 1990.49 0 0 -968.123 0 0 0 0 0 0 0 0 0 0 2039.48 0 0 
2114.55 0 0 0 -1671.27 0 1016.8 -452.666 0 0 0 -2465.36 2250.97 2315.82 0 770.974 0 0 78.3563 0 0 0 0 0 0.06 0 0 2496.8 0 0 1703.31 0 0 0 0 0 0 841.929 0 0 0 0 -1077.68 2223.5 0 0 0 0 0 0 566.5 729.621 0 -1697.97 0 0 459.838 0 0 0 0 -1093.1 0 0 0 0 0 0 0 0 0 0 0 0 0 0 0 0 
0 1102.56 0 0 0 0 1921.22 2442.63 0 0 -487.915 0 -360.042 0 -325.098 0 845.134 0 0 0 0 0 1180.23 0 0 0.01 2376.25 0 -1186.48 0 0 998.642 0 0 0 0 0 -2020.55 -403.531 1906.11 0 0 -491.882 0 0 -1274.68 -301.752 0 0 -2231.89 323.725 0 0 524.232 857.646 1751.53 0 0 2238.46 0 0 697.119 0 0 0 0 0 0 0 1213.64 -1208.91 0 0 0 0 -873.363 -2049.39 0 
1288.26 0 0 0 0 0 -2122.79 0 0 0 0 -2168.87 2384.18 2489.01 2266.53 0 -1846.29 1081.04 0 0 2282.4 0 1801.13 2255.55 0 32.5785 0.08 0 0 0 0 0 0 0 0 -2112.42 1811.81 0 0 1854.38 0 -575.35 439.39 0 -533.387 1155.05 0 0 0 0 0 0 0 2198.17 0 0 0 1670.2 0 0 0 0 0 0 0 0 0 0 0 -674.841 0 0 0 0 0 0 0 0 
0 1060.29 0 0 0 0 0 0 -1285.52 -858.715 0 0 0 1662.42 0 0 0 0 2372.43 0 0 0 0 0 -621.586 0 0 0.07 0 0 0 0 0 0 -1444.82 0 2023.3 0 0 0 0 0 0 0 0 1422.7 2128.13 1841.87 1965.16 0 0 0 0 1698.89 0 2284.69 -410.245 0 0 0 0 0 0 0 0 0 0 0 0 0 0 0 0 0 0 0 0 0 
-461.516 348.598 0 0 -194.174 1875.74 0 0 0 0 0 0 1121.78 0 0 0 105.213 0 -1227.38 0 196.158 0 0 0 0 -1561.56 0 0 0.09 0 0 59.2822 0 1474.88 -864.36 0 0 0 0 2131.49 0 0 0 1083.94 0 0 0 974.685 0 1363.19 0 0 0 515.534 0 0 0 0 0 233.543 0 0 0 0 0 0 0 0 0 0 0 -513.55 2053.21 0 0 0 0 0 
0 0 0 2270.96 0 0 0 0 0 0 0 0 0 0 0 -429.472 0 0 0 0 0 0 663.549 0 0 0 0 0 0 0.08 0 0 0 0 877.331 -2469.94 0 -934.706 -1847.97 0 0 -293.512 0 0 0 0 1564.76 0 -65.2333 0 2468.87 0 0 0 0 0 819.651 0 0 -483.795 0 0 0 0 0 0 0 0 13.1993 0 0 0 0 0 0 0 0 0 
1074.33 0 0 0 1171.99 0 0 -1870.56 0 0 0 0 0 2062.06 0 2457.73 0 0 0 0 0 0 0 0 1631.29 0 0 0 0 0 0.02 0 0 0 0 0 0 0 0 -1821.12 2106.62 0 0 0 0 0 0 0 -352.87 0 0 0 -258.873 0 0 0 0 0 0 0 0 0 0 0 0 0 0 0 1990.65 0 0 0 0 0 0 0 0 0 
-442.747 0 0 0 0 669.805 365.535 0 0 0 0 0 0 0 0 0 0 -1991.41 0 0 -1031.45 0 274.743 0 0 400.174 0 0 -239.036 0 0 0.06 0 0 0 1991.26 0 0 -259.636 0 2056.72 -1736.43 2384.95 1866.59 0 -1308.71 -2127.83 0 0 0 -931.806 0 427.641 0 0 0 0 1614.05 0 0 2359.16 0 0 0 0 0 0 0 190.97 0 0 0 0 0 0 0 0 0 
0 0 0 0 0 0 0 0 -1770.91 0 0 0 0 0 0 2046.49 1624.12 0 0 0 0 0 0 0 0 0 0 0 0 0 0 0 0.02 0 0 0 0 0 0 0 -1592.23 -2294.15 0 1506.16 0 -611.057 2443.54 0 0 1049.61 0 1880.02 0 0 0 0 0 0 0 0 1901.53 0 0 0 0 0 0 0 0 0 0 -1429.26 0 1410.03 0 0 0 -2071.52 
-2418.82 0 0 0 0 0 0 0 -2360.68 0 53.0259 0 224.845 1241.11 0 0 1713.23 0 691.321 -2145.53 0 0 1530.73 0 0 0 0 0 -626.774 0 0 0 0 0.05 0 0 2396.54 0 0 0 -1297.72 0 2120.5 0 0 0 2299.95 0 761.818 2342.37 0 79.577 0 -441.984 -20.2185 0 0 0 0 0 0 0 0 0 0 0 0 -1813.64 0 0 0 0 0 2283.62 0 0 0 0 
0 0 0 2450.56 2151.17 740.303 0 89.0378 0 0 0 -364.772 0 0 0 0 0 1736.27 0 147.481 0 0 0 0 0 0 0 1357.23 337.611 1889.63 0 0 0 0 0.01 1145.28 0 -1799.75 -1712.62 0 -2240.59 0 2302.09 0 0 -1055.86 0 0 0 -1080.13 0 -525.605 0 0 0 0 0 2465.21 0 0 0 0 0 0 0 0 0 0 0 0 1831.64 0 0 0 0 0 0 0 
0 -1326.26 0 1415.37 0 0 0 0 -1397.37 192.953 0 -2055.8 0 0 -2107.38 680.334 0 0 0 0 -227.134 0 0 0 0 0 2491.91 0 0 -1186.94 0 2269.28 0 0 -910.596 0.01 2344.05 0 1338.01 0 626.011 0 0 0 0 0 0 0 0 0 0 0 458.922 0 0 -154.347 574.74 0 0 0 0 0 0 0 0 0 0 0 814.463 0 0 0 0 0 0 0 0 0 
0 -1217.15 0 0 0 0 0 0 1396.3 0 0 -831.095 948.134 1177.94 0 0 0 760.903 0 0 0 0 0 0 0 0 2082.2 1405.3 0 0 0 0 0 1435.97 0 1676.15 0.01 0 0 0 124.134 0 0 -2037.49 0 0 -397.885 1197.01 0 -893.658 0 0 -1609.78 0 0 1077.84 0 0 0 0 0 0 0 0 0 0 209.281 0 0 0 0 0 0 0 0 0 0 0 
0 0 0 0 1079.67 0 2473.6 0 941.267 0 0 0 0 0 0 -2349.54 0 -1074.18 0 0 0 2430.88 -638.981 0 81.4081 1558.35 0 0 0 -1374.17 0 0 0 0 2356.41 0 0 0 0 0 0 0 0 0 0 0 0 0 0 0 0 0 0 0 1494.42 1660.59 -1751.69 0 0 0 0 -854.442 0 0 0 0 0 0 0 0 0 0 1556.06 0 -1054.95 0 0 0 
0 0 0 0 0 363.857 0 33.6467 0 0 -1110.34 0 0 0 1988.66 26.78 0 0 0 0 0 0 0 0 0 -2445.37 0 0 0 666.448 0 -1359.68 0 0 596.255 -267.876 0 0 0.04 0 0 0 0 1785.56 0 0 0 0 0 0 0 0 0 0 -148.549 0 0 514.161 0 0 0 0 0 0 0 0 0 0 1301.84 0 0 0 266.961 0 16.7089 0 -468.23 0 
0 0 0 0 -245.75 2200.46 622.806 0 0 0 0 0 0 -698.34 0 0 0 0 0 0 0 0 0 -2193.14 0 71.0318 543.458 0 -257.805 0 2415.62 0 0 0 0 0 0 0 0 0.08 1982.1 0 0 0 0 0 1314.97 -160.909 0 0 0 0 0 1490.6 0 0 0 0 0 0 0 0 0 338.527 0 0 0 0 0 0 0 0 0 0 0 0 0 0 
117.267 0 0 -905.255 0 0 0 1827.83 2053.82 0 1601.08 -432.981 -561.922 735.267 0 0 0 0 1372.49 0 0 0 0 0 0 0 0 0 0 0 -49.0585 2077.78 -235.984 229.423 2472.69 1412.93 -28.0007 0 0 -1021.07 0.06 0 2293.08 0 0 952.254 0 0 0 0 1309.93 0 0 0 0 0 529.115 0 0 0 0 0 -2277.21 0 0 0 0 0 0 0 0 0 0 0 0 0 0 0 
0 1312.52 2077.62 -295.495 1905.65 0 925.703 0 1655.4 0 0 1894.97 0 0 1755.35 835.978 0 0 0 -2477.72 0 -57.2985 0 0 0 0 -2134.69 0 0 792.032 0 1725.59 1572.7 0 0 0 0 0 0 0 0 0.05 2114.09 751.9 0 0 0 0 0 0 0 -832.011 0 2306.05 -564.364 0 0 671.484 123.981 0 0 0 0 0 0 0 0 0 0 0 0 0 -2032.61 0 0 0 0 0 
0 0 0 0 0 0 0 1195.33 0 0 2453.15 0 -1556.37 0 0 0 0 0 0 0 0 2024.98 0 0 2207.48 1204.03 629.063 0 0 0 0 -1029.47 0 1323.51 1520.05 0 0 0 0 0 1054.64 2249.14 0.03 -2019.49 -474.792 0 0 0 0 0 -324.335 0 670.568 0 -770.363 0 0 -1387.91 0 0 0 604.343 0 0 0 0 0 1504.18 0 0 970.107 0 0 0 573.672 0 0 1098.28 
0 0 0 -487.915 0 0 0 0 0 0 0 0 0 0 561.464 0 0 0 0 0 0 0 0 0 1203.88 0 0 0 1803.26 0 0 2042.07 2159.87 0 0 0 837.962 0 -1487.4 0 0 41.5815 358.364 0.08 0 592.135 0 0 0 0 -1302.15 0 0 0 0 0 0 0 0 0 0 0 0 0 0 0 0 -1421.02 -469.451 -121.54 0 0 0 0 0 177.389 0 403.684 
-1150.32 0 0 0 0 0 0 0 0 0 0 0 0 0 1460.84 0 -859.325 -1493.5 0 0 0 572.604 0 239.494 0 0 2448.58 0 0 0 0 0 0 0 0 0 0 0 0 0 0 0 -453.429 0 0.08 0 464.11 0 0 0 0 0 0 0 0 1775.49 0 0 0 0 0 0 0 0 0 0 0 0 0 0 0 0 -1598.03 0 0 0 0 0 
863.75 -1943.19 -275.811 -2115.77 2238.76 0 916.242 0 0 570.009 391.324 1962.57 0 0 0 0 0 455.87 0 2142.93 0 691.015 0 0 0 -2215.57 -386.135 -1068.68 0 0 0 -798.288 -372.86 0 1435.21 0 0 0 0 0 -1885.36 0 0 326.93 0 0.02 0 0 0 0 0 0 0 28.4585 2217.7 0 1641.06 0 0 0 0 547.884 0 0 0 0 -690.558 0 0 1163.9 0 0 0 0 0 0 0 0 
0 0 0 0 0 0 0 0 1772.29 -2194.81 -881.451 0 0 0 -579.012 0 0 -1593.45 0 0 1261.56 -880.23 0 0 0 1690.04 0 1438.26 0 -504.547 0 797.678 2329.55 2407.83 0 0 974.837 0 0 1193.96 0 0 0 0 1210.59 0 0.05 0 0 1135.82 -2011.25 0 0 0 0 0 0 0 0 0 0 0 0 0 0 -712.531 0 0 0 0 0 0 0 0 -975.448 0 0 0 
0 0 0 0 -1200.37 0 0 0 0 0 1079.97 0 0 0 0 0 -790.811 0 0 -2225.49 0 -21.7444 0 0 0 0 0 -1251.95 2464.29 0 0 0 0 0 0 0 -484.71 0 0 1680.58 0 0 0 0 0 0 0 0.05 0 0 1710.79 0 2046.65 0 0 1000.78 0 0 0 0 0 0 0 0 0 0 784.555 0 0 0 -1283.38 0 0 0 0 0 0 0 
945.845 2049.39 0 0 0 0 0 0 0 -1923.35 0 2450.1 0 0 0 185.171 -413.449 1367.46 -2466.43 0 0 0 0 0 0 0 0 -713.752 0 -2498.78 1037.71 0 0 2378.38 0 0 0 0 0 0 0 0 0 0 0 0 0 0 0 0 -1765.27 0 -747.932 0 0 -264.977 1351.89 0 1791.97 0 0 0 0 -542.695 0 0 0 0 0 0 0 0 1207.24 0 0 0 0 0 
0 1630.22 0 2481.08 0 1185.57 0 0 0 0 -692.694 0 0 0 0 0 0 0 1674.93 0 0 0 0 874.584 0 -246.666 0 0 96.9726 0 0 0 95.5992 -69.8111 2030.47 0 2196.34 0 0 0 0 0 0 0 0 0 917.158 0 0 0.09 0 0 587.558 1987.29 2101.58 0 0 0 0 0 0 0 0 0 0 0 0 0 -1032.82 -513.398 0 0 0 -1238.67 0 0 0 0 
0 -942.64 0 0 0 0 0 0 0 0 0 0 804.086 0 0 0 -1515.78 1177.33 0 0 0 0 76.3726 -1675.08 1739.94 -870.922 0 0 0 -1478.55 0 339.595 0 0 0 0 0 0 0 0 1485.11 0 1110.8 1671.88 0 0 896.405 1551.18 -1552.1 0 0 0 -2003.46 1492.28 0 1902.45 0 0 0 0 0 0 0 0 0 0 909.223 0 0 0 0 0 0 0 0 0 0 0 
-190.97 0 0 977.889 0 0 221.335 -1407.44 547.731 0 2392.27 0 0 0 0 0 0 0 0 38.8348 0 0 0 0 -864.513 0 0 0 0 0 0 0 56.8407 1110.34 1729.71 0 0 0 0 0 0 82.4763 0 0 0 0 0 0 0 0 0 0.09 0 0 0 0 2271.42 0 0 0 0 0 0 0 0 0 0 0 0 0 0 -400.632 0 0 0 0 0 854.595 
0 0 1970.35 982.009 0 0 0 -927.534 0 -2332.61 -2496.03 0 918.226 0 0 2003.31 0 0 0 0 0 2164.75 0 0 0 0 0 0 0 0 -472.503 1808.15 0 0 0 1775.64 1714.91 0 0 0 0 0 806.223 0 0 0 0 1154.13 1551.03 -1396.76 -1083.33 0 0.07 1182.36 0 0 0 0 811.563 0 0 0 0 0 0 0 0 -1834.39 0 0 0 0 0 0 0 0 1325.95 0 
0 0 0 0 0 0 0 0 -1038.16 0 801.798 0 0 -761.971 0 770.516 2201.53 0 0 2370.75 0 0 143.513 0 577.639 -1971.27 2369.38 -1357.54 1653.26 0 0 0 0 846.812 0 0 0 0 0 904.95 0 1641.97 0 0 0 -1820.96 0 0 0 1257.9 1705.91 0 -817.667 0.01 0 -2200.92 0 0 0 1934.49 0 0 0 0 0 -101.245 0 0 0 0 0 0 0 0 0 0 0 0 
0 0 0 0 0 0 0 0 0 -1493.19 0 0 0 0 0 0 449.767 0 0 427.946 0 830.485 0 0 0 -281.152 0 0 0 0 0 0 0 -2155.75 0 0 0 123.066 290.613 0 0 17.9296 1607.94 0 0 221.488 0 0 0 -1410.03 0 0 0 0 0.09 2056.72 0 0 0 0 2442.47 0 -1058.31 0 0 0 0 0 0 0 -154.5 1815.16 0 -1482.06 0 0 0 0 
0 -2228.08 -449.004 0 0 0 1192.13 0 0 0 0 0 0 910.901 0 992.996 0 0 0 0 0 0 0 0 0 -863.598 0 1465.58 0 0 0 0 0 0 0 1502.2 890.149 2183.68 0 0 0 0 0 0 828.806 0 0 -812.174 2295.53 0 1001.08 0 0 -683.386 1723.76 0.09 1630.38 0 0 0 0 0 0 0 0 0 0 0 0 0 0 -1682.56 0 -1148.18 0 0 0 0 
0 0 0 0 2382.66 0 1471.83 0 0 0 -78.9666 -729.011 2449.49 -889.538 -23.5755 0 0 0 -1630.07 -2431.03 0 720.466 0 0 -1933.12 0 0 561.159 0 1374.78 0 0 0 0 0 306.787 0 852.763 0 0 808.664 0 0 0 0 1236.53 0 0 -404.294 0 0 -1627.02 0 0 0 714.667 0 274.743 0 0 0 0 0 0 0 0 0 1155.2 1186.79 0 0 0 0 0 -2329.86 0 0 0 
0 0 0 0 0 0 0 -875.195 382.626 0 0 613.346 0 0 0 0 0 1527.22 1001.08 1278.65 0 0 0 0 0 0 1326.26 0 0 0 0 2274.62 0 0 -1767.25 0 0 0 2498.47 0 0 -1129.41 1415.07 0 0 0 0 0 0 0 0 0 0 0 0 0 -798.898 0.09 0 1413.08 0 0 -1325.04 0 1236.08 0 0 0 0 -1777.93 0 0 0 0 0 0 0 0 
1464.66 0 -2270.65 0 -148.244 7.55333 0 0 0 1422.24 0 0 0 0 0 0 0 0 0 0 0 0 0 0 0 -72.1 0 0 0 0 0 0 0 0 0 0 0 0 0 0 0 -2499.24 0 0 0 0 0 0 1819.13 0 0 0 2133.32 0 0 0 0 0 0.05 0 0 0 0 1038.77 0 1531.65 0 0 0 0 0 0 0 0 0 0 1810.43 0 
0 0 0 0 0 0 0 0 -1871.78 0 0 0 0 0 0 0 0 0 0 0 0 0 0 590.762 0 0 0 0 1718.27 1458.56 0 0 0 0 0 0 0 0 0 0 0 0 0 0 0 0 0 0 0 0 0 0 0 2429.2 0 0 0 1550.87 0 0.05 0 0 0 0 0 0 0 0 0 0 0 0 0 0 0 0 0 0 
-851.238 0 0 0 0 1888.71 0 2162.31 0 -783.029 0 0 0 0 0 0 0 0 0 2047.56 544.679 0 0 0 0 0 0 0 0 0 0 577.487 -367.214 0 0 0 0 0 0 0 0 0 0 0 0 0 0 0 0 0 0 0 0 0 2499.24 0 0 0 0 0 0.01 0 0 950.575 0 0 0 0 0 0 0 0 -1167.56 0 -1835.31 0 -2361.29 0 
0 0 0 0 0 0 0 2380.37 0 0 0 1224.94 0 0 0 0 0 0 2326.65 0 0 0 0 -60.9607 2188.71 816.752 0 0 0 0 0 0 0 0 0 0 0 122.761 0 0 0 0 1721.78 0 0 1327.63 0 0 0 0 0 0 0 0 0 0 0 0 0 0 0 0.01 -913.343 -2194.36 0 0 0 -100.33 0 0 0 0 0 0 0 0 0 0 
0 0 0 0 0 0 -2105.7 0 0 0 0 -793.71 443.968 0 1821.88 0 0 -920.972 0 0 0 0 0 0 0 0 0 0 0 0 0 0 0 0 0 0 0 0 0 0 1600.47 0 0 0 0 0 0 0 0 0 0 0 0 0 1883.68 0 0 -2052.9 0 0 0 430.082 0.05 -1066.24 0 0 0 0 1098.59 0 0 0 0 0 0 1791.51 0 -1646.24 
0 0 0 0 1267.66 0 0 1455.2 0 0 972.701 0 0 0 0 0 0 347.377 0 0 0 0 0 0 0 0 0 0 0 0 0 0 0 0 0 0 0 0 0 548.036 0 0 0 0 0 0 0 0 1449.55 0 0 0 0 0 0 0 0 0 1821.88 0 474.792 1867.5 -529.878 0.01 0 0 0 0 0 0 -1156.58 0 0 0 0 0 0 0 
0 0 0 0 0 271.386 -1586.43 0 0 0 0 23.423 0 0 0 0 456.023 0 0 0 0 0 0 1258.66 0 0 0 0 0 0 0 0 0 0 0 0 0 0 0 0 0 0 0 0 0 0 0 0 0 0 0 0 0 0 0 0 0 -344.02 0 0 0 0 0 0 0.01 1998.43 0 0 0 0 0 0 0 0 -643.101 0 0 0 
0 -1855.75 0 1821.88 0 0 0 0 0 0 0 387.814 0 0 0 0 0 0 0 0 0 0 0 0 0 0 0 0 0 0 0 0 0 0 0 0 0 0 0 0 0 0 0 0 0 0 1801.13 0 0 0 0 0 0 -1289.79 0 0 0 0 -494.324 0 0 0 0 0 -646.001 0.08 0 0 1665.17 0 0 0 -1222.34 0 0 0 0 0 
0 0 -1133.84 0 0 -427.03 0 -1112.02 0 0 0 0 0 0 0 1720.1 0 0 0 0 0 0 0 0 0 0 0 0 0 0 0 0 0 0 0 0 1899.24 0 0 0 0 0 0 0 0 -347.072 0 2257.68 0 0 530.946 0 0 0 0 0 0 0 0 0 0 0 0 0 0 0 0.09 0 0 0 0 0 0 0 0 0 0 0 
0 0 0 0 -422.452 0 2319.03 0 0 0 0 0 0 0 0 0 -163.045 0 0 0 0 0 0 0 0 0 0 0 0 0 0 0 0 1108.81 0 0 0 0 0 0 0 0 -1687.44 225.15 0 0 0 0 0 0 0 0 -228.965 0 0 0 2221.21 0 0 0 0 -606.784 0 0 0 0 0 0.03 0 0 0 0 0 0 0 0 0 0 
0 0 0 0 0 0 0 0 0 0 0 0 0 0 0 0 0 -347.987 0 0 0 0 0 0 0 0 0 0 0 -584.506 607.242 689.184 0 0 0 99.1089 0 0 1645.94 0 0 0 0 675.909 0 0 0 0 0 2054.73 0 0 0 0 0 0 280.389 0 0 0 0 0 -990.555 0 0 1074.02 0 0 0.04 0 0 0 0 0 2464.9 -1440.4 42.1918 2205.65 
0 0 0 0 0 0 -427.03 0 0 0 -723.06 0 0 0 0 0 0 0 2194.81 0 0 0 0 0 0 583.743 1602.91 0 0 0 0 0 0 0 0 0 0 0 0 0 0 0 0 1980.12 0 1748.18 0 0 0 459.685 0 0 0 0 0 0 0 15.0304 0 0 0 0 0 0 0 0 0 0 0 0.04 0 -2003.92 -2029.1 0 0 0 0 0 
0 958.815 0 0 0 0 0 0 0 0 0 -74.3889 0 0 0 0 0 0 0 2106.31 0 0 0 0 0 355.312 0 0 0 0 0 0 0 0 -1408.05 0 0 0 0 0 0 0 1600.01 0 0 0 0 -1197.47 0 0 0 0 0 0 2418.36 0 0 0 0 0 0 0 0 1525.09 0 0 0 0 0 0 0.01 0 0 0 0 0 0 0 
0 0 0 0 0 0 0 0 0 0 0 0 586.184 -152.211 0 0 237.358 620.975 0 0 0 0 0 0 0 0 0 0 -2155.14 0 0 0 1928.08 0 0 0 0 0 0 0 0 0 0 0 0 0 0 0 0 0 0 820.109 0 0 1112.02 -766.549 0 0 0 0 0 0 0 0 0 0 0 0 0 2236.78 0 0.07 0 0 0 0 0 0 
0 0 0 0 0 0 0 0 0 0 0 0 0 0 0 0 0 0 0 0 1805.09 0 0 0 0 0 0 0 -2123.25 0 0 0 0 0 0 0 0 -2194.97 527.284 0 0 1296.2 0 0 -612.583 0 0 0 1735.82 0 0 0 0 0 0 0 0 0 0 0 -777.383 0 0 0 0 801.798 0 0 0 918.378 0 0 0.02 0 0 0 0 0 
0 827.891 0 619.602 0 0 0 1528.9 0 -1482.21 0 0 0 0 0 0 0 0 0 0 -2020.71 0 0 0 0 0 0 0 0 0 0 0 1746.65 2081.59 0 0 0 0 0 0 0 0 0 0 0 0 0 0 0 -1224.02 0 0 0 0 2265.16 -760.903 0 0 0 0 0 0 0 0 0 0 0 0 0 0 0 0 0 0.03 0 0 0 0 
0 0 0 0 0 -2407.99 0 0 0 0 0 0 0 0 0 945.54 0 0 956.679 0 1274.68 1700.11 0 0 0 0 0 0 0 0 0 0 0 0 0 0 0 1672.49 262.841 0 0 0 291.833 0 0 0 442.747 0 0 0 0 0 0 0 0 0 -1663.18 0 0 0 -73.0155 0 0 0 -813.395 0 0 0 1108.05 0 0 0 0 0 0.02 0 0 0 
0 0 0 0 0 0 1217.31 0 -23.8807 0 0 0 1824.17 0 0 0 0 1940.6 0 0 -401.395 0 0 -364.01 0 344.478 0 0 0 0 0 0 0 0 0 0 0 0 0 0 0 0 0 -1242.64 0 0 0 0 0 0 0 0 0 0 0 0 0 0 0 0 0 0 -259.484 0 0 0 0 0 1000.02 0 0 0 0 0 0 0.03 112.69 0 
0 0 0 0 0 0 0 0 0 0 69.2007 0 1863.69 0 0 -410.245 1621.83 0 0 0 0 -1451.08 0 0 0 -1847.67 0 0 0 0 0 0 0 0 0 0 0 0 611.667 0 0 0 0 0 0 0 0 0 0 0 0 0 -1269.95 0 0 0 0 0 43.7178 0 356.38 0 0 0 0 0 0 0 618.381 0 0 0 0 0 0 1699.04 0.09 0 
0 0 0 0 0 0 0 0 0 0 0 0 0 1214.26 0 0 0 0 0 0 0 0 0 0 0 0 0 0 0 0 0 0 -1662.72 0 0 0 0 0 0 0 0 0 -1356.01 783.944 0 0 0 0 0 0 0 -527.131 0 0 0 0 0 0 0 0 0 0 1715.22 0 0 0 0 0 389.035 0 0 0 0 0 0 0 0 0.08 
