*Vertices 65
*Matrix 
0.01 0 0 0 469.604 0 0 0 0 0 0 0 -113.605 -181.356 0 0 0 1945.94 0 2074.57 0 -743.355 -893.658 0 1999.19 341.121 0 0 0 0 0 0 -1291.47 0 0 0 0 0 0 0 0 0 0 0 0 0 1210.75 0 0 0 0 0 0 0 0 0 0 0 0 1645.48 0 -2302.39 0 0 0 
0 0.06 0 2169.79 0 0 0 0 0 0 0 1994.31 0 0 0 0 392.544 0 0 0 0 0 0 0 0 922.956 0 0 -221.488 0 0 0 0 0 1835.46 0 0 0 0 0 0 0 0 0 0 0 0 0 0 -490.967 0 -934.706 0 0 0 0 0 0 0 0 0 0 0 0 -337.458 
0 0 0.09 -2184.13 1030.23 0 0 0 0 0 1680.27 0 0 0 0 0 0 2388.15 0 -1455.96 1788.77 0 0 0 383.236 0 0 0 2351.07 0 0 0 0 0 0 0 0 -1034.65 0 0 0 0 0 0 0 0 0 0 0 0 0 0 0 0 -1903.67 0 -1605.81 0 0 -1366.54 0 0 0 0 0 
0 397.427 1874.83 0.03 -1149.1 0 0 1310.85 0 0 0 0 0 0 -1418.73 0 0 0 0 0 0 0 0 0 2303.92 0 979.11 0 -1066.09 108.264 0 0 0 0 0 996.963 0 0 0 0 0 0 0 0 0 0 0 0 0 0 -2129.66 0 0 0 0 0 0 0 0 0 0 0 0 0 0 
-1347.77 0 1019.85 2208.24 0 0 0 0 0 711.158 0 0 -1118.58 0 0 0 0 0 0 0 0 0 1541.72 0 -746.254 0 0 0 0 0 1823.25 0 0 0 0 0 0 0 0 0 0 -219.504 0 -1978.59 0 0 0 0 0 0 0 0 0 0 0 -694.525 0 0 0 0 0 0 0 0 0 
0 0 0 0 0 0.03 0 0 1588.56 0 0 337.611 0 451.445 0 0 0 2478.94 0 0 0 -317.164 -2384.33 991.012 0 0 0 0 0 1417.05 0 0 2101.28 0 932.569 -887.249 0 0 0 0 0 -198.141 0 0 0 0 -1016.5 0 0 0 0 0 0 -2369.08 0 0 0 0 0 0 0 0 1669.74 0 0 
0 0 0 0 0 0 0.01 0 2307.89 0 -189.138 0 0 0 0 0 0 1748.79 -886.792 0 1210.75 0 0 0 1472.75 -1673.25 0 0 0 0 0 0 0 0 0 0 0 0 0 0 0 0 0 0 -812.632 0 0 0 0 0 0 93.9207 -1488.92 0 0 0 0 0 0 0 0 0 2263.02 0 0 
0 0 0 1547.52 0 0 0 0.01 0 103.992 0 625.401 0 0 0 0 0 0 0 1500.98 0 0 0 889.386 0 0 0 0 719.55 1828.14 0 0 0 0 0 0 -1065.02 0 0 0 -1686.68 0 0 0 0 0 0 0 0 0 0 0 -1971.57 0 0 0 0 -11.5207 0 0 796.609 0 0 0 -718.024 
0 0 0 0 0 1452.6 1741.46 0 0.04 0 2246.85 0 0 0 0 0 0 0 0 -1576.36 0 0 0 0 0 283.593 0 0 1686.83 0 0 0 -2336.12 0 0 0 0 0 0 0 0 0 0 0 0 0 0 1133.69 0 0 0 0 0 0 0 0 0 0 0 0 0 -1376.31 0 0 0 
0 0 0 0 667.669 0 0 -1243.55 0 0.05 0 -980.483 -640.202 2270.81 0 0 0 0 2365.11 0 0 0 0 0 -1949.6 0 2094.56 0 0 0 0 0 0 0 0 0 0 0 0 0 0 0 0 0 0 0 1587.65 0 0 0 0 0 0 0 0 0 0 0 0 0 0 0 0 0 0 
0 0 1770.76 0 0 0 -2490.69 0 1459.62 0 0.07 0 0 0 0 0 0 0 0 0 0 0 1030.69 0 0 0 -689.337 0 0 0 0 0 0 0 0 0 0 0 2485.35 0 0 -876.72 0 0 0 0 0 0 0 0 0 0 985.672 0 0 0 0 0 0 0 0 0 0 1450.93 0 
0 1609.16 0 0 0 -1463.9 0 -1317.56 0 624.332 0 0.04 1165.27 1234.7 0 0 0 2350.76 0 0 0 0 0 0 0 0 0 526.826 0 0 0 -2265.01 0 0 0 0 0 1941.51 0 0 0 0 0 0 0 0 0 0 0 0 0 0 0 0 0 0 0 749.153 0 1333.89 0 0 0 0 0 
-79.8822 0 0 0 -569.704 0 0 0 0 758.919 0 -912.122 0.02 0 0 0 0 338.221 2278.89 0 0 1191.52 0 0 0 -253.227 1401.18 0 0 0 0 0 0 0 0 0 0 0 0 0 0 0 0 0 -146.565 0 0 0 0 364.162 0 0 0 0 0 0 0 0 0 0 0 0 0 0 0 
945.387 0 0 0 0 1257.29 0 0 0 2163.08 0 -779.214 0 0 -1253.47 1832.56 2307.12 0 -211.264 0 0 0 1929.46 0 1358.91 0 -2124.01 0 0 0 0 0 0 0 0 0 905.713 0 0 0 0 0 2200 0 0 0 0 0 0 0 0 0 0 0 0 0 -1671.12 0 0 0 0 0 0 0 0 
0 0 0 1687.14 0 0 0 0 0 0 0 0 0 2192.37 0.08 0 0 0 986.435 0 0 0 0 0 0 1977.37 0 0 0 0 -560.549 0 0 0 0 0 0 0 0 0 0 0 0 0 0 1271.78 0 0 0 0 0 0 0 -291.833 0 0 0 0 0 0 0 0 0 0 962.63 
0 0 0 0 0 0 0 0 0 0 0 0 0 971.023 0 0.06 -1642.28 0 0 0 0 0 0 0 0 0 2362.97 1273.61 0 2346.34 -1508.91 0 0 0 0 0 0 0 -947.676 0 0 0 0 0 -1054.64 1291.62 0 0 0 0 0 -1714.15 0 0 0 0 0 0 0 0 0 0 0 0 0 
0 1547.52 0 0 0 0 0 0 0 0 0 0 0 1891.16 0 1014.21 0.03 0 0 1515.17 2263.02 0 0 -1352.81 1808.45 0 0 -1844.46 -3.12815 0 0 0 0 0 0 0 0 -449.614 0 0 0 0 0 0 0 0 0 0 0 0 0 -2032.76 0 0 0 1067.31 0 0 0 180.135 0 0 0 0 0 
-688.269 0 1080.13 0 0 2170.86 1180.07 0 0 0 0 -235.832 -1500.21 0 0 0 0 0.08 0 0 -263.298 0 -1455.5 0 0 460.906 1147.88 0 0 0 0 0 1840.04 0 -1204.49 0 0 0 191.122 0 0 0 1046.4 0 0 -2447.51 0 0 0 0 0 0 0 0 0 0 0 0 0 0 0 0 0 0 0 
0 0 0 0 0 0 361.721 0 0 -463.805 0 0 27.2378 1123.92 2491.61 0 0 0 0.02 217.368 0 -501.495 0 0 0 0 122.15 0 0 0 0 0 0 0 0 0 0 0 0 0 0 0 0 -464.873 0 0 0 0 0 0 0 0 0 0 0 0 -1813.33 0 0 0 2349.24 0 0 0 0 
1801.89 0 996.963 0 0 0 0 1622.44 -2033.22 0 0 0 0 0 0 0 1737.19 0 975.906 0.08 363.399 0 0 0 0 0 0 0 -845.897 0 1643.19 0 0 0 0 0 2404.32 0 0 0 0 0 0 0 0 0 -1962.72 971.48 0 0 0 0 0 0 0 0 0 0 0 -1466.95 0 0 0 0 0 
0 0 2005.6 0 0 0 886.792 0 0 0 0 0 0 0 0 0 -319.758 1772.29 0 41.5815 0.04 113.3 0 0 0 -2211.29 0 0 0 1218.83 0 0 0 0 0 0 471.892 0 0 1900.92 0 0 0 0 0 0 756.783 0 0 0 0 0 0 0 212.18 0 0 0 0 0 0 0 0 0 0 
2334.13 0 0 0 0 -1358.76 0 0 0 0 0 0 61.8763 0 0 0 0 0 1644.41 0 575.198 0.06 0 -532.624 2214.04 -952.101 1915.57 0 1631.6 0 0 0 -919.904 0 0 390.713 0 0 0 -1279.11 0 1160.7 0 758.919 0 0 0 0 0 0 0 0 0 0 0 0 0 0 0 0 -882.977 0 -2227.32 0 0 
1706.37 0 0 0 518.891 -1432.62 0 0 0 0 -725.959 0 0 473.724 0 0 0 2344.81 0 0 0 0 0.05 0 340.205 0 2159.72 0 0 0 0 -1649.75 0 0 0 0 553.835 0 0 0 0 0 0 -2236.47 0 0 0 0 2023.61 401.09 0 0 0 0 0 0 0 0 0 0 0 0 0 0 0 
0 0 0 0 0 784.86 0 -384.61 0 0 0 0 0 0 0 0 1956.47 0 0 0 0 706.58 0 0.08 0 2173.6 0 1635.26 0 0 0 0 0 0 0 0 0 0 0 0 0 0 0 0 0 -691.015 -52.7207 -1266.59 0 -1348.84 0 0 0 0 0 -662.023 0 0 0 0 0 166.402 0 0 0 
1539.58 0 1670.66 1624.73 1748.48 0 -1734.44 0 0 -1475.19 0 0 0 -2018.57 0 0 1321.38 0 0 0 0 1132.92 1649.45 0 0.01 2336.12 1784.04 0 0 0 -1004.44 0 0 -2390.29 0 0 0 0 0 0 0 0 0 0 0 0 0 0 0 0 0 0 0 0 0 0 0 0 0 0 0 0 1399.5 -1539.12 0 
1510.44 1288.11 0 0 0 0 1861.4 0 655.919 0 0 0 1299.25 0 -941.267 0 0 1242.48 0 0 -901.288 1323.51 0 -531.251 606.479 0.08 0 0 0 0 0 0 0 0 0 0 -2259.97 0 0 0 0 0 -1567.66 0 0 0 0 0 0 0 0 0 0 0 0 0 -539.033 513.398 0 0 0 0 0 0 0 
0 0 0 -26.6274 0 0 0 0 0 2077.62 964.766 0 865.581 548.494 0 814.31 0 2355.04 2068.77 0 0 717.414 1966.23 0 349.055 0 0.06 0 0 0 0 0 0 0 0 0 0 0 0 0 0 0 -2199.55 0 0 0 1231.35 0 0 0 0 0 -1800.36 0 0 0 0 0 0 0 0 0 0 0 -462.432 
0 0 0 0 0 0 0 0 0 0 0 836.436 0 0 0 -38.5296 -751.289 0 0 0 0 0 0 2004.23 0 0 0 0.04 0 0 0 0 0 0 -1981.8 0 0 0 0 0 0 1971.11 0 0 0 0 0 0 0 0 0 0 0 841.014 -1542.63 0 -726.112 0 0 0 0 0 0 0 0 
0 -78.3563 1648.99 -112.537 0 0 0 2175.28 224.693 0 0 0 0 0 0 0 -1047.01 0 0 -1245.69 0 593.356 0 0 0 0 0 0 0 0 0 0 0 0 0 0 0 0 0 1749.4 0 0 0 0 0 0 0 0 0 0 0 0 -1970.35 0 0 0 0 0 1616.95 0 0 0 0 0 0 
0 0 0 671.178 0 2299.8 0 1290.25 0 0 0 0 0 0 0 -438.475 0 0 0 0 -922.04 0 0 0 0 0 0 0 0 0.07 0 0 0 -38.2244 0 0 0 -1278.04 0 0 0 0 0 0 0 0 0 1500.52 -880.993 0 0 0 0 0 0 0 0 0 1183.28 0 0 209.891 0 0 0 
0 0 0 0 -1311.61 0 0 0 0 0 0 0 0 0 480.895 2203.05 0 0 0 255.974 0 0 0 0 -1085.62 0 0 0 0 0 0.03 0 0 0 0 0 0 0 0 0 0 0 0 2238.46 0 0 0 0 0 0 0 0 0 0 0 0 0 0 0 0 0 0 0 0 0 
0 0 0 0 0 0 0 0 0 0 0 -1378.44 0 0 0 0 0 0 0 0 0 0 1963.64 0 0 0 0 0 0 0 0 0.09 0 0 0 0 0 0 1266.9 0 0 0 0 0 0 0 0 1430.17 0 0 0 0 0 0 0 0 0 0 0 0 0 0 0 0 -2313.68 
1008.41 0 0 0 0 -110.096 0 0 1101.03 0 0 0 0 0 0 0 0 1492.58 0 0 0 -6.79037 0 0 0 0 0 0 0 0 0 0 0.06 0 0 -1216.85 0 0 0 0 0 0 0 0 0 0 0 0 0 0 0 0 0 0 0 0 -1251.49 0 0 0 0 0 -846.355 0 0 
0 0 0 0 0 0 0 0 0 0 0 0 0 0 0 0 0 0 0 0 0 0 0 0 33.0363 0 0 0 0 497.833 0 0 0 0.09 0 0 0 0 350.124 2312.16 0 0 0 -228.66 0 0 0 0 0 0 0 0 0 1383.63 0 0 0 0 0 0 0 0 0 0 0 
0 1820.05 0 0 0 2319.79 0 0 0 0 0 0 0 0 0 0 0 1795.02 0 0 0 0 0 0 0 0 0 -1222.5 0 0 0 0 0 0 0.08 0 0 0 0 0 2079.15 0 0 0 -600.986 0 0 0 -1485.11 0 0 0 0 0 0 0 0 0 0 0 0 0 0 -630.589 0 
0 0 0 546.51 0 -67.98 0 0 0 0 0 0 0 0 0 0 0 0 0 0 0 408.719 0 0 0 0 0 0 0 0 0 0 1469.85 0 0 0.04 0 0 0 0 0 0 0 0 -89.9533 0 119.098 0 0 0 0 0 0 0 0 0 0 0 0 0 0 0 0 0 0 
0 0 0 0 0 0 0 -901.898 0 0 0 0 0 -1129.11 0 0 0 0 0 1972.95 -255.974 0 2026.2 0 0 2410.43 0 0 0 0 0 0 0 0 0 0 0.04 0 0 0 0 -322.047 0 0 -1914.96 0 0 11.9785 0 0 0 0 0 0 0 0 306.482 0 0 1418.27 2210.68 1882.46 0 0 412.687 
0 0 843.913 0 0 0 0 0 0 0 0 1261.1 0 0 0 0 -1173.51 0 0 0 0 0 0 0 0 0 0 0 0 2210.23 0 0 0 0 0 0 0 0.03 0 0 0 0 0 0 310.755 0 0 0 0 0 -2157.89 0 358.058 1948.68 0 0 0 -1056.63 0 0 0 0 0 0 0 
0 0 0 0 0 0 0 0 0 0 -736.03 0 0 0 0 -134.205 0 639.286 0 0 0 0 0 0 0 0 0 0 0 0 0 1865.67 0 1041.67 0 0 0 0 0 0 0 0 0 0 0 0 0 0 0 0 0 0 0 0 0 0 0 0 984.451 0 0 0 0 0 -781.808 
0 0 0 0 0 0 0 0 0 0 0 0 0 0 0 0 0 0 0 0 1521.27 1427.12 0 0 0 0 0 0 411.466 0 0 0 0 -2285.61 0 0 0 0 0 0 1383.79 0 0 0 0 0 0 0 0 0 0 0 0 0 0 0 0 0 0 0 0 0 1779.76 0 0 
0 0 0 0 0 0 0 318.537 0 0 0 0 0 0 0 0 0 0 0 0 0 0 0 0 0 0 0 0 0 0 0 0 0 0 878.704 0 0 0 0 1396.76 0.02 0 0 -81.8659 0 0 1396.6 0 0 -160.604 0 0 0 0 0 0 0 1972.95 0 0 0 0 0 861.309 0 
0 0 0 0 -695.288 766.243 0 0 0 0 1974.62 0 0 0 0 0 0 0 0 0 0 -1639.23 0 0 0 0 0 1483.28 0 0 0 0 0 0 0 0 -1433.84 0 0 0 0 0.03 -920.972 0 0 0 0 0 0 0 0 0 525.91 0 0 0 0 0 1122.39 0 0 0 0 0 0 
0 0 0 0 0 0 0 0 0 0 0 0 0 1291.62 0 0 0 1144.52 0 0 0 0 0 0 0 1424.22 941.42 0 0 0 0 0 0 0 0 0 0 0 0 0 0 187.46 0.08 0 0 0 0 0 -1203.73 0 0 0 0 0 0 0 0 0 0 0 0 0 0 0 0 
0 0 0 0 2342.52 0 0 0 0 0 0 0 0 0 0 0 0 0 1933.73 0 0 1938.61 2209.92 0 0 0 0 0 0 0 195.242 0 0 2024.67 0 0 0 0 0 0 1010.39 0 0 0.08 0 0 0 0 0 -63.5548 0 0 93.0052 0 0 0 0 0 0 0 0 0 34.4096 0 0 
0 0 0 0 0 0 1251.64 0 0 0 0 0 -2159.11 0 0 1896.8 0 0 0 0 0 0 0 0 0 0 0 0 0 0 0 0 0 0 1965.16 -485.321 -1533.33 2254.48 0 0 0 0 0 0 0 0 0 0 0 0 0 0 0 0 -633.488 365.535 0 -1350.67 0 0 1692.33 0 0 0 0 
0 0 0 0 0 0 0 0 0 0 0 0 0 0 615.787 1163.75 0 991.775 0 0 0 0 0 1392.33 0 0 0 0 0 0 0 0 0 0 0 0 0 0 0 0 0 0 0 0 0 0.01 0 0 0 1966.69 0 -328.608 0 0 0 0 0 0 1744.36 2161.55 0 0 0 0 1941.82 
-1365.47 0 0 0 0 2492.68 0 0 0 1859.26 0 0 0 0 0 0 0 0 0 -2293.54 844.066 0 0 -1406.67 0 0 1383.48 0 0 0 0 0 0 0 0 -2011.25 0 0 0 0 1223.56 0 0 0 0 0 0.08 0 0 0 -797.525 0 0 0 436.644 0 0 0 0 0 0 0 0 0 0 
0 0 0 0 0 0 0 0 1117.97 0 0 0 0 0 0 0 0 0 0 -411.313 0 0 0 1123.62 0 0 0 0 0 2189.17 0 -941.267 0 0 0 0 -1316.64 0 0 0 0 0 0 0 0 0 0 0.07 0 0 0 0 0 -152.821 0 -299.921 0 0 0 0 1960.43 1276.97 0 1303.98 0 
0 0 0 0 0 0 0 0 0 0 0 0 0 0 0 0 0 0 0 0 0 0 1672.8 0 0 0 0 0 0 856.731 0 0 0 0 -792.795 0 0 0 0 0 0 0 710.547 0 0 0 0 0 0.09 0 0 0 0 0 0 0 600.528 0 1632.66 0 0 0 0 0 0 
0 2369.08 0 0 0 0 0 0 0 0 0 0 -1747.57 0 0 0 0 0 0 0 0 0 1792.12 -1800.97 0 0 0 0 0 0 0 0 0 0 0 0 0 0 0 0 1887.65 0 0 -1220.51 0 723.975 0 0 0 0.06 0 0 1847.67 0 0 0 0 0 617.313 0 0 0 0 -900.22 0 
0 0 0 662.786 0 0 0 0 0 0 0 0 0 0 0 0 0 0 0 0 0 0 0 0 0 0 0 0 0 0 0 0 0 0 0 0 0 2141.87 0 0 0 0 0 0 0 0 -1291.31 0 0 0 0.07 0 0 2121.88 -525.758 0 0 0 0 -1255 1956.77 0 0 0 791.421 
0 -1846.9 0 0 0 0 -709.021 0 0 0 0 0 0 0 0 1476.41 -233.238 0 0 0 0 0 0 0 0 0 0 0 0 0 0 0 0 0 0 0 0 0 0 0 0 0 0 0 0 2461.24 0 0 0 0 0 0.08 0 0 0 0 0 0 0 0 0 0 -397.275 0 0 
0 0 0 0 0 0 1254.69 1282.77 0 0 75.6096 0 0 0 0 0 0 0 0 0 0 0 0 0 0 0 -1559.11 0 494.781 0 0 0 0 0 0 0 0 262.993 0 0 0 -392.239 0 1006.42 0 0 0 0 0 2214.65 0 0 0.01 0 0 0 0 0 0 0 0 0 0 0 -953.78 
0 0 0 0 0 889.538 0 0 0 0 0 0 0 0 1486.63 0 0 0 0 0 0 0 0 0 0 0 0 2218.77 0 0 0 0 0 -1552.86 0 0 0 533.998 0 0 0 0 0 0 0 0 0 -2174.06 0 0 1885.51 0 0 0.01 0 0 0 0 0 0 0 -910.443 0 0 0 
0 0 1031.6 0 0 0 0 0 0 0 0 0 0 0 0 0 0 0 0 0 1451.99 0 0 0 0 0 0 902.356 0 0 0 0 0 0 0 0 0 0 0 0 0 0 0 0 2310.79 0 2471.16 0 0 0 1331.14 0 0 0 0.02 0 0 0 0 0 2000.72 0 0 -2240.14 0 
0 0 0 0 -783.792 0 0 0 0 0 0 0 0 0 0 0 2015.67 0 0 0 0 0 0 2462 0 0 0 0 0 0 0 0 0 0 0 0 0 0 0 0 0 0 0 0 4.50148 0 0 -1863.99 0 0 0 0 0 0 0 0.01 0 0 0 0 0 0 0 0 0 
0 0 279.015 0 0 0 0 0 0 0 0 0 0 -1243.86 0 0 0 0 1658.6 0 0 0 0 0 0 813.7 0 1170.16 0 0 0 0 1195.33 0 0 0 -1653.72 0 0 0 0 0 0 0 0 0 0 0 2190.39 0 0 0 0 0 0 0 0.07 0 1145.89 0 0 -1604.74 0 0 0 
0 0 0 0 0 0 0 1940.29 0 0 0 2319.03 0 0 0 0 0 0 0 0 0 0 0 0 0 2214.96 0 0 0 0 0 0 0 0 0 0 0 1474.73 0 0 677.587 0 0 0 -455.565 0 0 0 0 0 0 0 0 0 0 0 0 0.06 0 -1407.9 1558.5 0 0 1456.27 0 
0 0 0 0 0 0 0 0 0 0 0 0 0 0 0 0 0 0 0 0 0 0 0 0 0 0 0 0 760.75 2035.81 0 0 0 0 0 0 0 0 -1376.16 0 0 410.245 0 0 0 1574.07 0 0 70.8792 1718.88 0 0 0 0 0 0 -2143.85 0 0.01 -1977.07 0 0 0 0 0 
439.085 0 1350.98 0 0 0 0 0 0 0 0 -402.921 0 0 0 0 -215.842 0 0 1099.35 0 0 0 0 0 0 0 0 0 0 0 0 0 0 0 0 -1936.48 0 0 0 0 0 0 0 0 1148.95 0 0 0 0 -517.67 0 0 0 0 0 0 957.289 1332.21 0.01 0 0 0 0 0 
0 0 0 0 0 0 0 2200.16 0 0 0 0 0 0 0 0 0 0 1395.54 0 0 1512.88 0 0 0 0 0 0 0 0 0 0 0 0 0 0 2028.64 0 0 0 0 0 0 0 1618.93 0 0 534.15 0 0 109.18 0 0 0 -2498.47 0 0 -1200.67 0 0 0.04 0 0 0 0 
-2457.27 0 0 0 0 0 0 0 1251.79 0 0 0 0 0 0 0 0 0 0 0 0 0 0 1013.29 0 0 0 0 0 2246.85 0 0 0 0 0 0 -533.235 0 0 0 0 0 0 0 0 0 0 -1787.24 0 0 0 0 0 1455.5 0 0 1091.42 0 0 0 0 0.09 0 0 0 
0 0 0 0 0 1578.8 -582.522 0 0 0 0 0 0 0 0 0 0 0 0 0 0 982.009 0 0 1150.93 0 0 0 0 0 0 0 893.201 0 0 0 0 0 0 1444.06 0 0 0 -1122.39 0 0 0 0 0 0 0 -1478.39 0 0 0 0 0 0 0 0 0 0 0.08 0 0 
0 0 0 0 0 0 0 0 0 0 1337.24 0 0 0 0 0 0 0 0 0 0 0 0 0 -239.799 0 0 0 0 0 0 0 0 0 -1001.69 0 0 0 0 0 1016.65 0 0 0 0 0 0 1642.74 0 -1827.68 0 0 0 0 -1408.2 0 0 1900.01 0 0 0 0 0 0.08 0 
0 -2216.18 0 0 0 0 0 415.128 0 0 0 0 0 0 -269.25 0 0 0 0 0 0 0 0 0 0 0 -2417.14 0 0 0 0 1842.78 0 0 0 0 -310.45 0 2071.06 0 0 0 0 0 0 -2045.58 0 0 0 0 1312.37 0 2414.24 0 0 0 0 0 0 0 0 0 0 0 0.08 
