*Vertices 75
*Matrix 
0.03 0 0 0 0 1071.12 0 0 -355.007 0 -1467.86 168.081 0 0 0 0 2398.68 388.424 0 0 0 0 0 0 0 0 1040.45 -1029.16 67.8274 0 0 0 0 1016.34 1618.17 0 0 0 904.797 0 0 0 0 0 0 0 0 0 961.715 -669.195 0 0 0 0 0 0 0 0 2084.8 0 83.5444 247.276 0 0 0 0 0 0 0 0 -303.888 0 0 0 0 
0 0.01 0 0 0 0 0 0 0 0 0 0 0 0 0 1590.24 0 0 0 0 -1598.03 -2393.95 0 1231.35 0 2051.38 322.047 0 -699.561 0 0 0 1162.68 2163.99 0 0 0 2485.81 0 0 0 0 0 89.3429 0 -451.292 0 0 0 -501.038 -1205.86 1824.32 0 0 0 0 0 0 0 0 0 0 0 0 939.741 0 0 0 0 0 442.595 0 0 0 0 
0 0 0.04 2151.94 0 0 1787.39 0 0 0 0 0 1056.32 0 0 1342.28 0 2249.29 -645.39 -506.836 0 755.715 0 0 0 -1203.12 1293.3 1399.35 0 0 -720.161 0 0 0 2303 0 2488.86 0 0 0 0 0 0 0 2147.21 -160.909 37.7667 -25.2541 0 67.8274 91.0215 0 0 0 0 0 0 0 -1086.84 0 -2146.44 0 -31.9681 -2353.05 0 0 0 0 0 0 0 0 0 0 0 
0 0 827.891 0.08 0 2071.67 0 0 0 0 0 0 0 0 -391.476 0 0 0 602.206 -1162.83 0 0 0 0 0 0 0 0 0 0 0 1643.96 0 0 0 174.032 0 -2487.03 -600.681 0 0 1833.02 1693.09 0 -422.3 0 0 0 1236.69 0 0 1033.74 0 0 0 0 0 2167.5 0 0 0 0 0 0 0 0 0 0 0 0 -2186.73 0 0 0 0 
0 0 0 0 0.04 0 0 0 487.152 1760.08 513.703 0 0 0 0 0 2362.97 -1466.03 -2100.67 0 0 0 0 0 0 0 0 0 0 0 -2019.33 0 2095.17 0 0 408.414 0 -1561.1 0 0 0 0 0 0 0 0 0 0 0 0 0 0 0 0 -1181.14 0 0 0 1737.95 0 -1676.31 1621.83 0 0 0 0 0 0 0 0 0 0 0 0 -2112.72 
-1236.53 0 0 958.51 0 0.04 0 -739.387 1502.66 0 45.2437 0 0 0 0 724.128 -148.549 0 0 0 0 0 2242.88 0 0 0 0 0 -1441.16 0 0 0 -790.963 529.572 0 0 1473.36 0 0 0 0 0 0 0 0 2471.16 0 -2033.52 0 0 0 0 1366.7 -2061.6 1298.18 0 0 0 0 910.291 314.57 0 0 0 0 0 0 0 0 0 0 0 0 0 0 
0 0 -960.189 0 0 0 0.06 -744.118 0 0 0 0 0 0 -242.393 0 0 0 0 0 0 0 0 -2305.6 0 0 1781.75 0 0 0 0 2042.68 0 935.926 0 0 969.802 0 0 0 2054.28 -2185.2 1002.76 0 -1694.62 0 1985.92 585.269 0 0 1611.91 0 -926.466 0 0 1016.5 -1253.47 0 1686.83 0 0 1946.39 0 0 0 0 0 0 0 0 0 -849.712 0 0 0 
0 0 0 0 0 2063.13 1687.29 0.05 0 0 -432.981 200.735 2049.85 0 0 0 2083.42 0 0 0 -2001.02 0 0 -815.226 310.755 0 0 0 -671.636 0 0 0 0 -64.9281 0 0 0 0 0 0 1061.05 0 0 0 0 2435 0 0 0 -187.918 0 2288.05 0 -1551.94 273.37 0 0 0 -1423.61 -2346.34 0 2286.52 1180.84 0 0 0 0 0 304.804 -2156.21 0 0 0 0 0 
2437.13 0 0 0 2219.69 -2207.33 0 0 0.06 0 -2062.52 0 0 -1585.21 0 -1261.25 0 -938.978 0 -695.135 0 0 0 0 0 0 0 0 2163.23 0 0 0 0 0 -2432.25 0 0 1448.33 0 1719.95 0 0 -48.1429 -866.649 1923.81 0 0 0 0 0 -311.365 2295.37 0 -833.842 0 0 0 -556.581 0 1538.51 0 0 0 0 0 0 0 0 0 0 1387.14 0 0 0 0 
0 0 0 0 -91.4792 0 0 0 0 0 0 2275.99 0 0 95.5992 0 2123.86 0 1676.31 0 1616.03 0 -1140.4 0 0 0 0 0 0 103.839 -2115.16 0 0 0 0 0 -422.91 1382.56 0 0 0 0 0 0 0 1581.55 1798.68 1673.71 0 -2351.68 0 0 0 0 0 0 -1223.56 0 0 0 0 0 0 0 1371.88 0 0 0 0 0 1614.66 0 0 0 0 
-2041.46 0 0 0 1014.51 726.722 0 -179.983 -1094.01 0 0.07 0 0 0 1775.95 0 -1741.46 0 0 0 0 0 677.129 0 -2096.09 -1567.2 0 0 0 0 0 2395.02 -1274.99 0 0 0 0 0 0 0 0 0 0 1871.47 0 0 508.972 0 641.728 -792.795 2067.55 0 0 0 103.534 0 -1611.76 0 2191.92 0 0 721.992 1980.12 0 0 0 0 0 0 0 0 0 0 0 0 
-963.24 0 0 0 0 0 0 2280.27 0 2054.43 0 0.07 0 0 0 -2049.09 1952.8 0 0 0 0 0 0 0 0 -399.564 0 0 0 0 0 -440.916 0 0 0 0 0 0 0 0 0 2254.78 0 0 0 0 0 0 629.521 -455.718 0 0 0 0 0 0 0 -2485.2 1389.28 0 0 0 0 0 0 -593.814 0 0 47.0748 555.513 0 2030.78 0 63.4022 0 
0 0 2067.86 0 0 0 0 1972.64 0 0 0 0 0.03 0 0 0 1570.1 0 0 -1487.24 0 0 0 1409.12 0 -792.337 0 105.823 0 1660.74 0 0 0 0 0 1691.26 338.832 0 0 0 820.566 0 333.949 1647.77 0 0 2006.06 -1887.04 0 0 0 0 -1216.54 0 0 -237.358 0 0 0 1598.03 0 0 0 0 0 0 0 0 0 0 0 0 0 0 0 
0 0 0 0 0 0 0 0 -1302 0 0 0 0 0.07 1450.77 0 0 -2232.05 -1002.46 0 0 0 0 0 -668.126 1794.56 0 0 0 0 0 0 0 1051.44 0 0 0 0 1743.75 0 -861.156 1272.85 -608.463 0 0 0 0 0 0 1701.64 0 0 794.778 -368.587 2421.87 -853.984 0 0 -1535.62 0 2240.29 0 0 0 0 0 0 0 0 0 0 0 0 0 0 
0 0 0 -713.904 0 0 1114.61 0 0 174.337 -1586.58 0 0 2459.87 0.06 -1988.97 1466.03 0 0 0 0 0 0 0 0 0 0 0 0 0 -596.255 0 0 498.291 2452.54 0 0 144.734 0 0 0 56.2304 0 0 0 0 0 1922.9 0 1904.58 -1750.01 0 0 1126.67 -2221.98 0 2340.69 0 0 0 0 0 -361.11 0 0 0 0 0 0 0 0 0 0 0 0 
0 -1148.95 1101.64 0 0 1920.61 0 0 -1776.41 0 0 1519.44 0 0 -1272.7 0.06 0 1140.71 578.707 0 0 0 0 0 -1985.46 0 2411.04 1175.5 0 0 0 -1561.4 0 0 0 0 0 0 731.3 0 0 2496.19 -1490.14 0 0 0 0 0 0 0 0 0 0 -199.362 0 2169.03 0 0 0 0 1480.99 0 0 882.824 0 0 0 24.1859 0 0 0 0 0 0 0 
147.786 0 0 0 -2433.77 -1419.49 0 509.735 0 644.627 -1359.68 1515.93 -18.2348 0 819.193 0 0.04 -1477.48 0 0 0 0 261.315 0 0 0 0 0 0 1862.16 0 0 0 0 0 0 0 0 0 0 1810.43 0 2080.37 0 474.639 0 0 -620.06 -626.469 0 0 -250.481 0 0 0 0 0 0 0 0 0 141.072 -828.349 0 0 0 0 0 0 0 0 0 0 0 0 
223.777 0 626.011 0 1064.26 0 0 0 713.904 0 0 0 0 1324.12 0 -2435.45 -2362.67 0.03 0 0 0 0 0 0 -1120.72 0 0 0 0 0 0 2348.02 0 0 0 579.775 0 336.848 0 0 0 1910.23 0 0 0 0 952.559 0 0 -1972.79 20.8289 0 0 0 0 0 0 -323.573 0 0 166.555 0 573.977 -246.208 149.77 0 0 0 0 0 0 0 0 0 0 
0 0 267.876 438.169 -1468.93 0 0 0 0 1138.26 0 0 0 1465.73 0 772.958 0 0 0.01 0 0 0 0 0 0 -90.1059 0 275.353 0 0 -325.404 0 0 792.032 0 0 0 0 0 2113.64 0 0 2223.81 518.586 778.756 0 0 0 -2390.13 -2013.08 1318.63 -2268.36 0 0 -2127.98 1865.37 0 0 0 0 1655.86 -597.629 0 663.549 0 0 0 0 0 -2028.34 1774.27 0 0 0 0 
0 0 -357.295 351.192 0 0 0 0 1483.58 0 0 0 -338.374 0 0 0 0 0 0 0.02 0 0 0 0 0 0 0 0 0 0 0 0 0 0 0 2294.15 0 0 0 936.995 0 0 0 0 0 430.082 0 0 0 0 0 0 0 0 0 0 2035.81 0 -499.207 1839.12 835.063 0 0 0 0 0 0 0 708.258 1929.3 -767.312 0 0 0 0 
0 690.1 0 0 0 0 0 -961.867 0 978.957 0 0 0 0 0 0 0 0 0 0 0.01 0 0 0 199.973 0 389.34 2313.84 2276.45 0 0 0 1277.58 0 0 0 0 0 -998.794 -1940.29 -23.2704 1737.95 0 0 595.95 -2364.8 0 1778.08 -2229.61 -1917.86 -1653.72 0 0 0 804.697 0 0 0 2498.02 0 0 1358.76 0 0 0 0 0 -367.672 0 0 0 0 -717.261 1152.61 0 
0 -2025.13 1612.83 0 0 0 0 0 0 0 0 0 0 0 0 0 0 0 0 0 0 0 0 895.642 0 0 -965.682 0 2456.51 -709.174 0 0 -494.781 0 -22.9652 0 2009.87 0 0 0 0 -2345.42 1313.75 0 658.971 0 -1048.23 0 0 0 0 0 0 0 0 0 0 0 0 0 0 0 0 0 0 2344.36 0 0 0 0 0 1183.89 0 -1206.47 0 
0 0 0 0 0 807.138 0 0 0 1789.38 847.575 0 0 0 0 0 1594.06 0 0 0 0 0 0.04 0 0 0 0 0 0 0 0 0 0 -1862.62 0 0 0 1186.64 409.024 0 0 0 0 0 0 0 0 -34.257 -1160.39 1687.29 219.352 0 0 0 0 -1544.01 0 0 0 0 0 0 0 0 906.323 0 0 0 0 0 0 0 0 -1046.4 0 
0 -793.863 0 0 0 0 -20.0659 2325.43 0 0 0 0 1700.42 0 0 0 0 0 0 0 0 1414.15 0 0.05 0 0 0 0 2083.88 0 -352.26 0 0 745.186 0 0 0 0 1914.5 0 0 0 2301.93 0 1835 0 0 0 0 788.369 0 931.501 0 0 -2059.92 0 0 0 0 0 0 0 0 1368.53 0 0 0 0 0 0 0 0 -1181.91 0 0 
0 0 0 0 0 0 0 -1255.91 0 0 -1236.08 0 0 -580.996 0 128.407 0 1695.84 0 0 -337.611 0 0 0 0.07 0 -916.7 412.076 2145.99 0 0 0 -1004.29 0 0 0 0 0 0 0 0 0 543.153 1550.57 0 0 0 0 0 1860.03 0 0 0 0 0 0 0 0 0 0 1317.26 0 0 0 0 0 0 0 0 -1561.56 0 0 0 0 0 
0 -938.063 -107.044 0 0 0 0 0 0 0 186.087 1908.7 926.313 569.399 0 0 0 0 1868.42 0 0 0 0 0 0 0.07 0 0 0 0 0 -608.005 0 11.3681 0 1989.58 0 396.664 2180.93 0 -2401.27 0 1484.34 0 899.457 0 -2409.51 0 0 362.636 0 0 -1389.13 0 0 0 0 0 0 0 -1028.09 -2340.24 360.958 0 0 0 619.144 0 0 0 0 0 0 0 0 
-2284.23 -1069.6 1278.19 0 0 0 1901.68 0 0 0 0 0 0 0 0 1149.25 0 0 0 0 -646.153 1996.14 0 0 1289.64 0 0.07 0 0 0 932.569 0 0 0 -150.075 0 0 0 0 0 0 0 0 0 0 1367.46 0 0 0 0 0 0 0 0 -711.768 0 0 0 0 564.974 0 1891.92 0 0 0 0 0 0 0 0 0 0 0 2355.04 0 
2046.04 0 -1227.68 0 0 0 0 0 0 0 0 0 -652.715 0 0 -877.789 0 0 -566.347 0 2162.31 0 0 0 817.82 0 0 0.04 275.964 0 0 0 -692.694 0 1817.3 -2495.27 0 0 947.676 -490.814 1041.98 0 0 0 0 0 -1477.32 0 446.104 0 0 0 0 0 0 0 0 0 0 0 -1124.99 0 0 0 0 0 0 0 0 0 -195.853 0 0 0 0 
-35.6304 2015.98 0 0 0 -1899.7 0 1243.4 -1998.43 0 0 0 0 0 0 0 0 0 0 0 -181.051 116.352 0 -202.109 1303.52 0 0 1336.79 0.05 1950.21 0 2061.6 0 -633.183 0 1857.43 0 0 0 1055.56 0 1684.24 -2121.88 0 711.31 0 0 0 968.276 -9.07926 -563.601 0 0 0 0 -406.583 -2268.82 0 0 0 0 1856.52 0 0 0 0 0 -930.586 0 0 0 0 0 0 0 
0 0 0 0 0 0 0 0 0 -393.918 0 0 614.109 0 0 0 2255.39 0 0 0 0 2079.15 0 0 0 0 0 0 545.747 0 0 0 0 0 0 0 0 0 0 0 0 0 0 0 0 0 0 0 1746.04 0 0 0 -145.344 0 0 0 0 0 0 0 0 0 0 0 0 0 0 0 0 0 0 0 0 0 0 
0 0 1443.6 0 1089.28 0 0 0 0 -879.772 0 0 0 0 1978.9 0 0 0 289.697 0 0 0 0 441.679 0 0 -445.036 0 0 0 0.03 -1085.01 0 0 -174.184 0 -344.783 0 0 0 1405.61 0 0 0 0 0 0 0 2276.6 0 -1831.95 2367.09 0 0 0 0 0 699.866 0 0 0 0 266.503 0 -1034.65 0 0 0 0 0 0 0 0 0 0 
0 0 0 -469.909 0 0 -1223.72 0 0 0 364.925 2174.52 0 0 0 1881.08 0 1478.24 0 0 0 0 0 0 0 -901.593 0 0 298.547 0 2357.63 0.01 0 0 0 0 0 0 0 0 155.263 0 0 0 0 -1467.1 -1201.13 0 -1852.4 0 0 0 0 1908.4 0 0 0 0 0 0 0 0 0 0 0 0 0 0 0 0 0 0 0 0 0 
0 654.393 0 0 2019.03 1762.37 0 0 0 0 1985.15 0 0 0 0 0 0 0 0 0 -2049.55 -366.146 0 0 2375.33 0 0 1892.68 0 0 0 0 0.06 0 0 -1494.11 -1224.78 -2166.28 0 0 -1595.28 1268.58 1494.72 0 0 0 0 0 344.02 0 -715.583 1485.56 -860.088 0 908.765 0 0 0 -523.469 0 1294.37 -1067.46 0 0 0 0 0 0 0 0 0 0 0 0 -1452.15 
868.175 1442.53 0 0 0 -1181.3 -280.389 2187.03 0 0 0 0 0 -367.824 68.4378 0 0 0 -2211.91 0 0 0 2170.09 -693.304 0 135.121 0 0 799.814 0 0 0 0 0 0 -709.632 0 0 2406 0 619.297 0 0 -2483.98 0 2040.24 2481.08 -2052.14 1289.18 0 133.137 0 0 0 0 0 0 0 -1878.34 0 0 0 844.523 0 2229.15 431.761 0 0 0 1013.44 0 0 0 0 0 
-1603.82 0 -467.925 0 0 0 0 0 321.741 0 0 0 0 0 12.8941 0 0 0 0 0 0 -2398.53 0 0 0 0 355.312 1011.46 0 0 -554.445 0 0 0 0.06 0 0 0 0 0 0 164.113 0 0 0 2497.56 2302.85 0 0 0 1340.6 0 0 0 0 0 2335.66 0 -37.7667 0 0 955.611 -2224.42 0 0 0 0 0 0 0 0 0 0 0 0 
0 0 0 1597.11 1005.66 0 0 0 0 0 0 0 -1767.1 0 0 0 0 2294.92 0 -2323.3 0 0 0 0 0 -1280.79 0 1583.83 -890.912 0 0 0 27.3904 162.13 0 0.07 0 0 0 0 640.049 0 0 1205.4 0 0 0 0 1286.43 0 1072.04 0 0 1598.03 0 0 0 2078.08 1718.27 0 0 0 0 0 0 0 0 0 0 0 0 0 0 0 0 
0 0 2154.68 0 0 537.049 2048.78 0 0 1260.03 0 0 -673.467 0 0 0 0 0 0 0 0 1888.1 0 0 0 0 0 0 0 0 1551.64 0 -14.7252 0 0 0 0.09 -1852.85 0 -6.48518 0 166.097 0 2484.44 0 -536.744 -840.403 0 -151.906 -594.577 1583.38 0 0 2174.52 0 -1890.24 0 -554.445 0 1702.55 0 0 0 0 0 1264 0 0 0 0 0 0 -512.024 0 0 
0 -1049.61 0 -1272.09 -475.249 0 0 0 1025.65 1480.53 0 0 0 0 1254.69 0 0 2373.04 0 0 0 0 1184.8 0 0 -508.972 0 0 0 0 0 0 -2281.03 0 0 0 1481.6 0.09 210.501 0 0 0 0 0 0 0 0 0 -2231.59 0 2261.5 0 0 1826.46 0 0 0 0 -677.435 0 0 2022.54 -2263.18 0 0 -111.774 0 -412.381 0 0 0 0 0 0 -337.306 
-1406.52 0 0 -497.681 0 0 0 0 0 0 0 0 0 237.205 0 1517.61 0 0 0 0 -602.817 0 2077.17 -2211.91 0 -576.418 0 1604.43 0 0 0 0 0 1887.95 0 0 0 1190.15 0.02 496.155 0 0 0 0 787.912 0 -497.833 0 0 0 0 0 0 782.113 402.005 0 0 -1812.57 0 0 0 0 0 0 -1990.8 0 0 0 0 0 0 0 0 -985.366 0 
0 0 0 0 0 0 0 0 1487.09 0 0 0 0 0 0 0 0 0 722.602 -1732.61 338.679 0 0 0 0 0 0 -2061.91 -2450.71 0 0 0 0 0 0 0 1596.19 0 1362.12 0.07 0 0 0 0 0 0 0 0 455.107 2384.95 0 0 1751.84 2203.67 1883.98 2189.63 0 2012.62 -2155.29 2024.06 0 0 0 0 0 0 0 0 0 0 0 394.375 0 0 0 
0 0 0 0 0 0 2141.71 -261.773 0 0 0 0 312.891 564.516 0 0 -2277.37 0 0 0 -1564.61 0 0 0 0 -975.6 0 2215.11 0 0 -2371.06 1865.21 -330.744 2463.38 0 514.313 0 0 0 0 0.01 0 0 0 0 -83.5444 2404.63 513.398 801.95 0 0 2497.1 -1081.19 0 0 0 382.321 0 0 1217.61 -347.682 1681.95 -1177.18 1028.86 0 0 -907.392 0 0 0 0 129.017 0 0 0 
0 0 0 2310.02 0 0 -125.507 0 0 0 0 2364.65 0 -1004.14 -2141.87 1662.72 0 1279.56 0 0 -1074.33 -1863.38 0 0 0 0 0 0 -1315.73 0 0 0 2272.48 0 -471.892 0 -1726.97 0 0 0 0 0.03 -372.097 0 2342.37 0 -856.426 0 0 2030.17 -1812.42 0 0 0 0 0 0 0 0 0 626.774 0 0 0 0 0 0 0 0 0 0 0 0 -2259.97 0 
0 0 0 -27.3904 0 0 1526 0 492.492 0 0 0 1890.55 -114.826 0 663.244 1309.63 0 114.216 0 0 751.289 0 1280.94 -2069.69 -1742.53 0 0 -438.169 0 0 0 1705.45 0 0 0 0 0 0 0 0 -1665.47 0.07 0 0 -2179.86 -1680.27 0 0 0 0 808.969 1493.04 0 0 1155.66 0 0 0 0 0 0 0 0 -417.875 0 0 2093.65 0 0 0 0 0 166.86 464.11 
0 2476.5 0 0 0 0 0 0 168.691 0 2271.72 0 711.005 0 0 0 0 0 -321.131 0 0 0 0 0 -357.143 0 0 0 0 0 0 0 0 1038.32 0 2395.17 -1062.88 0 0 0 0 0 0 0.06 483.642 0 -1708.04 0 -1920.91 0 0 2176.5 0 993.606 0 1510.74 0 0 -1246.6 -2194.36 0 0 -574.892 0 0 0 0 0 0 0 0 0 -1487.4 1395.84 0 
0 0 -1166.04 1075.85 0 0 -1392.94 0 -452.055 0 0 0 0 0 0 0 1764.81 0 -24.6437 0 1220.21 -1180.53 0 285.882 0 1441.92 0 0 2147.36 0 0 0 0 0 0 0 0 0 797.83 0 0 -2073.96 0 -104.907 0.05 0 0 0 0 0 -2162.31 0 0 1802.96 0 0 2148.88 2364.04 0 1222.8 -1352.35 1783.88 0 548.952 2052.14 0 0 0 0 0 0 0 2262.72 -1512.12 1772.44 
0 894.726 764.565 0 0 2449.03 0 712.531 0 242.851 0 0 0 0 0 0 0 0 0 271.538 1193.04 0 0 0 0 0 -630.284 0 0 0 0 -1167.87 0 -57.1459 503.174 0 1015.73 0 0 0 1030.53 0 -126.728 0 0 0.05 0 2399.14 0 0 0 2114.25 0 0 0 2255.7 0 -1670.66 0 1466.03 0 0 0 0 0 0 0 0 0 0 487.915 0 0 0 -1463.13 
0 0 262.688 0 0 0 -628.452 0 0 1427.43 1125.29 0 -1021.99 0 0 0 0 1015.27 0 0 0 1682.56 0 0 0 398.343 0 627.079 0 0 0 228.355 0 -585.879 -1912.21 0 -135.884 0 -270.318 0 -889.691 -984.451 521.027 370.418 0 0 0.07 1734.6 0 -599.612 0 0 0 2083.42 0 -295.343 0 0 -731.147 2142.48 0 673.772 0 0 0 30.4422 0 0 0 0 0 0 0 1539.74 0 
0 0 2462 0 0 -756.172 561.922 0 0 -597.934 0 0 -377.438 0 546.663 0 -2030.47 0 0 0 -197.226 0 -2230.98 0 0 0 0 0 0 0 0 0 0 2190.54 0 0 0 0 0 0 702.307 0 0 0 0 1002.15 2207.17 0.02 0 0 0 0 0 0 0 0 0 0 0 1899.09 0 0 0 0 0 0 0 0 0 0 0 0 0 0 0 
-527.131 0 0 -2144 0 0 0 0 0 0 -128.712 -1103.47 0 0 0 0 -649.663 0 -1098.9 0 408.261 0 -181.204 0 0 0 0 2371.82 130.543 486.541 -914.563 -2332 378.353 1528.14 0 -82.4763 1096.76 -785.928 0 2036.73 1408.81 0 0 1524.63 0 0 0 0 0 0 0 0 1723.76 0 0 0 0 0 0 0 0 0 -304.041 0 0 0 0 0 -1227.23 0 0 0 0 0 -443.052 
-1041.52 -2129.05 -211.264 0 0 0 0 1527.99 0 892.743 2248.53 934.095 0 2391.05 -1082.72 0 0 -1309.47 817.82 0 961.715 0 896.405 855.815 521.79 580.386 0 0 93.0052 0 0 0 0 0 0 0 1535.77 0 0 -1761.45 0 -2332.45 0 0 0 0 -933.027 0 0 0.01 518.128 806.528 0 -89.8007 0 0 0 -47.6852 0 0 0 -1983.47 0 0 0 -845.134 1562.78 0 0 0 0 -1923.51 0 0 -559.633 
0 1634.5 -1623.81 0 0 0 423.368 0 174.184 0 -2043.9 0 0 0 -1460.69 0 0 1566.59 185.629 0 -546.052 0 2196.04 0 0 0 0 0 147.786 0 599.765 0 1145.89 590.152 -373.165 -1748.02 1874.37 315.332 0 0 0 1606.72 0 0 2255.55 0 0 0 0 -2197.41 0.02 -1861.4 0 1571.47 -2169.18 0 0 1358.46 0 0 0 -1173.82 0 0 0 0 0 0 0 0 0 0 -102.466 0 0 
0 1888.56 0 1760.99 0 0 0 -707.495 573.824 0 0 0 0 0 0 0 -144.887 0 1714.3 0 0 0 0 -2161.24 0 0 0 0 0 0 1281.85 0 -689.489 0 0 0 0 0 0 0 -589.999 0 155.873 1949.29 0 1968.83 0 0 0 -891.369 -1963.94 0.07 1831.19 -411.618 70.2689 0 -1199.45 0 0 0 0 0 0 0 0 0 0 0 0 0 0 0 1307.95 1543.09 0 
0 0 0 0 0 -757.546 -1325.8 0 0 0 0 0 665.38 2417.14 0 0 0 0 0 0 0 0 0 0 0 1049.46 0 0 0 -1118.73 0 0 1576.82 0 0 0 0 0 0 2140.95 -1693.85 0 -759.529 0 0 0 0 0 1708.35 0 0 754.341 0.04 2476.5 924.482 0 0 0 -111.316 0 0 2015.06 0 0 0 0 0 0 0 0 0 0 0 0 1005.81 
0 0 0 0 0 2371.97 0 -88.7326 -1908.7 0 0 0 0 1120.26 1037.4 -789.743 0 0 0 0 0 0 0 0 0 0 0 0 0 0 0 2003.16 0 0 0 -2017.81 -820.566 -1386.84 -2448.73 1776.25 0 0 0 -1093.1 -1285.82 0 2473.45 0 0 1243.86 -499.054 953.322 960.952 0.04 0 0 0 380.337 0 0 -1139.79 0 0 0 0 0 0 1462.22 0 0 656.224 0 0 0 -1009.02 
0 0 0 0 -888.623 2223.65 0 2185.81 0 0 -541.017 0 0 -112.384 -1908.86 0 0 0 119.098 0 2156.06 0 0 -231.559 0 0 2285.91 0 0 0 0 0 1811.2 0 0 0 0 0 -896.557 35.9355 0 0 0 0 0 0 0 0 0 0 1043.35 99.5666 -279.931 0 0.04 0 0 644.322 -683.538 0 0 0 0 0 0 0 0 0 0 0 0 -940.199 0 0 0 
0 0 0 0 0 0 458.77 0 0 0 0 0 2115.62 2304.99 0 904.34 0 0 -333.186 0 0 0 -167.47 0 0 0 0 0 -1907.18 0 0 0 0 0 0 0 110.248 0 0 1426.66 0 0 351.192 -1363.19 0 -2335.35 1531.04 0 0 0 0 0 0 0 0 0.07 0 0 0 0 0 2285.45 0 -264.519 0 0 0 0 0 0 0 0 0 0 0 
0 0 0 0 0 0 -1266.44 0 0 -856.426 562.685 0 0 0 -221.488 0 0 0 0 -419.248 0 0 0 0 0 0 0 0 -2441.71 0 0 0 0 0 1239.13 0 0 0 0 0 1799.6 0 0 0 -832.926 0 0 0 0 0 0 -158.162 0 0 0 0 0.04 1099.81 309.229 0 2060.99 0 564.669 0 0 0 0 0 0 0 0 0 0 0 0 
0 0 0 -2277.21 0 0 0 0 -976.211 0 0 -1664.56 0 0 0 0 0 2080.52 0 0 0 0 0 0 0 0 0 0 0 0 1035.42 0 0 0 0 -694.678 496.155 0 1604.59 -473.724 0 0 0 0 -20.5237 1093.25 0 0 0 -1580.17 -1805.86 0 0 -470.672 2299.19 0 -415.433 0.08 0 0 -870.617 0 2093.65 1746.35 0 -144.734 0 0 0 0 0 0 0 0 0 
44.9385 0 2248.38 0 2492.98 0 2337.64 702.918 0 0 -2296.9 1824.32 0 557.039 0 0 0 0 0 -1992.93 -2375.64 0 0 0 0 0 0 0 0 0 0 0 557.344 1386.99 -1799.14 216.453 0 1788.92 0 1994 0 0 0 -657.292 0 0 -82.4763 0 0 0 0 0 -493.103 0 1934.49 0 -1379.67 0 0.06 0 0 0 0 0 0 0 0 0 0 0 -373.47 0 0 -862.224 0 
0 0 0 0 0 1724.37 0 -116.504 1729.56 0 0 0 -71.7948 0 0 0 0 0 0 1845.07 0 0 0 0 0 0 -532.014 0 0 0 0 0 0 0 0 0 743.355 0 0 124.287 2433.77 0 0 -254.143 -1192.28 920.667 -1953.57 679.724 0 0 0 0 0 0 0 0 0 0 0 0.09 0 0 186.85 0 0 0 -1453.52 0 -168.233 0 0 681.86 0 0 -1459.78 
-2059.47 0 -1287.04 0 1629.31 230.186 0 0 0 0 0 0 0 571.688 0 2044.82 0 2035.2 -2219.84 1088.21 0 0 0 0 -687.506 854.9 0 -1752.6 0 0 0 0 -571.078 0 0 0 0 0 0 0 -450.377 1870.86 0 0 -905.56 0 0 0 0 0 0 0 0 -1370.2 0 0 -1376.61 2049.39 0 0 0.05 0 2216.33 0 0 0 0 0 0 0 0 0 0 0 0 
-844.981 0 0 0 2476.35 0 -81.4081 -252.922 0 0 -1025.19 0 0 0 0 0 -1936.93 0 -1249.66 0 2429.35 0 0 0 0 -325.556 -1101.64 0 797.067 0 0 0 2260.43 0 2220.3 0 0 966.597 0 0 -2017.5 0 0 0 1824.63 0 1786.78 0 0 1065.17 -2134.69 0 -1994.92 0 0 1586.28 0 0 0 0 0 0.01 0 0 0 0 0 0 0 0 0 0 0 0 0 
0 0 783.029 0 0 0 0 -30.7474 0 0 2038.87 0 0 0 2464.75 0 354.549 -621.433 0 0 0 0 0 0 0 1097.06 0 0 0 0 -600.681 0 0 -285.577 753.426 0 0 -2312.16 0 0 -919.294 0 0 -784.402 0 0 0 0 2161.4 0 0 0 0 0 0 0 2079.91 -810.038 0 2080.52 1041.67 0 0.03 0 0 0 0 0 0 0 -1929.76 -939.436 0 0 0 
0 0 -1182.67 0 0 0 0 0 0 0 0 0 0 0 0 959.426 0 995.59 1695.38 0 0 0 0 -1517.61 0 0 0 0 0 0 0 0 0 0 0 0 0 0 0 0 1240.81 0 0 0 -13.1993 0 0 0 0 0 0 0 0 0 0 25.2541 0 1887.65 0 0 0 0 0 0.08 0 0 0 0 0 1452.91 0 0 0 0 0 
0 -1510.74 0 0 0 0 0 0 0 1892.68 0 0 0 0 0 0 0 -811.258 0 0 0 0 -903.119 0 0 0 0 0 0 0 759.224 0 0 941.115 0 0 0 0 515.839 0 0 0 2365.26 0 2471.31 0 0 0 0 0 0 0 0 0 0 0 0 0 0 0 0 0 0 0 0 0 0 0 -699.866 0 0 0 0 0 0 
0 0 0 0 0 0 0 0 0 0 0 -1803.26 0 0 0 0 0 0 0 0 0 1548.28 0 0 0 0 0 0 0 0 0 0 0 -917.615 0 0 1683.94 -167.013 0 0 0 0 0 0 0 0 -1475.49 0 0 2497.86 0 0 0 0 0 0 0 -1392.64 0 0 0 0 0 0 0 0.07 0 1275.29 0 0 0 0 0 0 0 
0 0 0 0 0 0 0 0 0 0 0 0 0 0 0 0 0 0 0 0 0 0 0 0 0 2420.04 0 0 0 0 0 0 0 0 0 0 0 0 0 0 323.115 0 0 0 0 0 0 0 0 1908.7 0 0 0 0 0 0 0 0 0 1656.01 0 0 0 0 0 0 0.01 0 0 0 0 0 0 0 0 
0 0 0 0 0 0 0 0 0 0 0 0 0 0 0 1009.48 0 0 0 0 230.644 0 0 0 0 0 0 0 911.817 0 0 0 0 0 0 0 0 -189.596 0 0 0 0 -37.1563 0 0 0 0 0 0 0 0 0 0 -523.164 0 0 0 0 0 0 0 0 0 0 0 1050.52 0 0.02 0 509.735 0 0 0 0 0 
0 0 0 0 0 0 0 -922.498 0 0 0 1430.48 0 0 0 0 0 0 0 1321.38 0 0 0 0 0 0 0 0 0 0 0 0 0 0 0 0 0 0 0 0 0 0 0 0 0 0 0 0 -1164.66 0 0 0 0 0 0 0 0 0 0 1066.39 0 0 0 0 2431.18 0 0 0 0.01 0 0 0 -886.792 0 0 
0 0 0 0 0 0 0 1637.55 0 0 0 -1094.47 0 0 0 0 0 0 1288.72 624.943 0 0 0 0 624.332 0 0 0 0 0 0 0 0 -43.7178 0 0 0 0 0 0 0 0 0 0 0 0 0 0 0 0 0 0 0 0 0 0 0 0 0 0 0 0 0 2397.92 0 0 0 641.575 0 0.04 0 0 0 0 0 
1108.05 -2218.31 0 2154.53 0 0 0 0 712.836 -753.426 0 0 0 0 0 0 0 0 -974.837 2415.46 0 0 0 0 0 0 0 1874.37 0 0 0 0 0 0 0 0 0 0 0 0 0 0 0 0 0 2163.08 0 0 0 0 0 0 0 510.346 0 0 0 0 1639.07 0 0 0 -1133.69 0 0 0 0 0 0 0 0.05 0 0 0 0 
0 0 0 0 0 0 1225.09 0 0 0 0 1945.02 0 0 0 0 0 0 0 0 0 -595.645 0 0 0 0 0 0 0 0 0 0 0 0 0 0 0 0 0 1442.23 -381.405 0 0 0 0 0 0 0 0 -229.423 0 0 0 0 -2002.85 0 0 0 0 -711.31 0 0 1020.31 0 0 0 0 0 0 0 0 0.03 0 0 0 
0 0 0 0 0 0 0 0 0 0 0 0 0 0 0 0 0 0 0 0 -637.455 0 0 2030.47 0 0 0 0 0 0 0 0 0 0 0 0 1594.52 0 0 0 0 0 0 2242.12 -1354.64 0 0 0 0 0 120.777 2413.63 0 0 0 0 0 0 0 0 0 0 0 0 0 0 0 0 1837.6 0 0 0 0.02 0 0 
0 0 0 0 0 0 0 0 0 0 0 2315.21 0 0 0 0 0 0 0 0 829.112 -1822.64 -276.421 0 0 0 1797.92 0 0 0 0 0 0 0 0 0 0 0 1422.24 0 0 -413.755 -1407.44 1682.26 802.56 0 -338.069 0 0 0 0 2342.37 0 0 0 0 0 0 1052.05 0 0 0 0 0 0 0 0 0 0 0 0 0 0 0.06 0 
0 0 0 0 679.876 0 0 0 0 0 0 0 0 0 0 0 0 0 0 0 0 0 0 0 0 0 0 0 0 0 0 0 2480.16 0 0 0 0 -847.88 0 0 0 0 2023.15 0 1410.49 153.89 0 0 -1555.6 -1963.64 0 0 -1783.58 1082.11 0 0 0 0 0 736.183 0 0 0 0 0 0 0 0 0 0 0 0 0 0 0.03 
