*Vertices 36
*Matrix 
0.03 0 0 0 0 0 0 0 0 0 0 0 0 0 0 2212.67 0 0 1836.99 -62.0289 0 0 0 0 0 1900.16 0 0 0 0 0 254.448 0 0 259.636 0 
0 0.03 2112.87 0 0 0 0 0 0 0 0 0 0 0 1703.31 0 0 0 1861.4 -122.303 0 0 0 0 0 0 0 0 0 0 0 0 992.691 0 0 0 
0 669.042 0.03 0 -1470.15 0 0 0 668.126 0 0 0 0 0 0 0 0 0 0 0 0 0 0 0 0 0 0 237.968 0 0 0 421.384 0 0 -1186.18 1048.84 
0 0 0 0.02 0 0 0 0 0 0 0 0 0 0 0 0 0 0 0 0 0 0 0 0 0 0 0 1211.36 0 0 0 0 0 0 0 1378.6 
0 0 1808.6 0 0.05 0 0 1000.63 0 0 0 0 1064.87 0 0 2194.36 1377.07 0 0 0 0 0 0 0 0 0 0 2399.14 862.529 1517.3 0 0 0 -1603.21 0 0 
0 0 0 0 0 0.06 0 0 0 0 0 0 2145.83 0 0 0 0 1727.58 0 0 0 0 1616.95 0 0 0 0 0 0 0 0 0 0 0 0 0 
0 0 0 0 0 0 0.05 0 0 0 -1139.64 0 0 0 0 0 0 0 0 0 0 0 0 -910.596 0 220.115 0 0 0 0 0 0 0 0 2489.17 0 
0 0 0 0 1972.79 0 0 0.08 1344.26 0 0 0 0 0 0 0 0 1884.9 -1235.47 0 0 0 475.402 0 0 0 0 0 0 0 0 0 0 0 0 260.094 
0 0 2417.6 0 0 0 0 1338.31 0.06 0 0 0 0 0 0 0 0 0 0 0 2169.79 0 0 0 0 0 0 0 0 0 0 0 -1223.87 0 1843.55 0 
0 0 0 0 0 0 0 0 0 0.05 0 -115.284 0 0 0 304.804 0 0 0 0 0 0 0 0 0 0 0 673.62 -1246.15 0 0 2193.59 0 0 0 0 
0 0 0 0 0 0 544.679 0 0 0 0.09 0 0 0 0 0 0 0 0 0 0 0 0 0 0 0 0 0 0 0 676.519 0 0 0 0 0 
0 0 0 0 0 0 0 0 0 1161.31 0 0.08 0 2190.85 0 0 0 0 0 0 0 0 0 1370.82 0 0 0 0 -2142.02 0 0 0 500.732 0 0 0 
0 0 0 0 -597.171 611.209 0 0 0 0 0 0 0.03 0 0 0 0 0 0 0 0 303.43 0 0 0 0 0 2217.86 240.104 0 0 -1044.27 0 0 0 0 
0 0 0 0 0 0 0 0 0 0 0 2345.58 0 0.08 0 -2077.78 0 0 0 0 1374.02 0 0 0 0 0 0 0 0 1697.97 252.922 0 0 0 1147.42 0 
0 -39.4452 0 0 0 0 0 0 0 0 0 0 0 0 0.03 0 0 0 0 0 0 0 0 0 0 -265.587 0 0 0 0 0 968.581 0 0 1297.11 0 
1813.33 0 0 0 1005.66 0 0 0 0 -1426.51 0 0 0 1304.13 0 0.06 0 0 1094.78 0 -2225.03 0 0 0 0 0 0 0 0 0 0 0 0 -1684.39 0 0 
0 0 0 0 -1077.07 0 0 0 0 0 0 0 0 0 0 0 0.05 0 317.621 0 0 0 2427.52 0 474.029 0 0 0 0 2002.7 0 -872.6 0 0 0 0 
0 0 0 0 0 1190.6 0 1003.22 0 0 0 0 0 0 0 0 0 0.03 0 0 341.884 0 0 258.568 0 0 573.672 0 0 0 0 0 0 0 0 0 
-1674.78 -94.2259 0 0 0 0 0 2060.99 0 0 0 0 0 0 0 -1343.35 -289.239 0 0.02 0 1084.7 0 0 0 549.257 1913.28 0 0 0 0 0 0 0 0 0 0 
-1259.58 1138.11 0 0 0 0 0 0 0 0 0 0 0 0 0 0 0 0 0 0.07 0 -214.621 0 0 0 0 0 0 0 0 2380.83 0 0 0 0 0 
0 0 0 0 0 0 0 0 813.7 0 0 0 0 -151.143 0 -866.497 0 1957.84 976.974 0 0 0 0 0 0 0 0 0 0 0 0 0 0 0 0 0 
0 0 0 0 0 0 0 0 0 0 0 0 2058.24 0 0 0 0 0 0 -82.4763 0 0 1659.98 0 0 0 0 2489.17 0 0 0 0 0 0 0 -911.969 
0 0 0 0 0 2448.27 0 -549.409 0 0 0 0 0 0 0 0 11.3681 0 0 0 0 2149.95 0 0 0 -2105.7 0 0 0 0 0 0 1412.47 0 0 0 
0 0 0 0 0 0 2066.64 0 0 0 0 1956.47 0 0 0 0 0 193.716 0 0 0 0 0 0 0 0 0 0 0 0 0 0 0 0 0 0 
0 0 0 0 0 0 0 0 0 0 0 0 0 0 0 0 -343.562 0 1513.49 0 0 0 0 0 0.03 0 0 0 0 0 0 0 0 1322.29 0 0 
619.602 0 0 0 0 0 2107.99 0 0 0 0 0 0 0 2071.83 0 0 0 869.243 0 0 0 2122.49 0 0 0.03 0 0 0 0 0 0 -243.614 0 0 0 
0 0 0 0 0 0 0 0 0 0 0 0 0 0 0 0 0 1490.75 0 0 0 0 0 0 0 0 0 0 0 0 0 0 0 0 0 0 
0 0 2207.79 1915.11 2003.16 0 0 0 0 865.734 0 0 1633.43 0 0 0 0 0 0 0 0 -568.178 0 0 0 0 0 0.07 0 0 0 0 0 0 0 0 
0 0 0 0 2199.55 0 0 0 0 1103.32 0 -603.885 -180.746 0 0 0 0 0 0 0 0 0 0 0 0 0 0 0 0.09 0 0 0 0 0 0 0 
0 0 0 0 -47.5326 0 0 0 0 0 0 0 0 -1519.75 0 0 273.37 0 0 0 0 0 0 0 0 0 0 0 0 0.02 0 68.8955 0 0 2407.83 -297.327 
0 0 0 0 0 0 0 0 0 0 296.716 0 0 1105.46 0 0 0 0 0 73.7785 0 0 0 0 0 0 0 0 0 0 0.09 0 0 0 0 0 
-932.417 0 893.048 0 0 0 0 0 0 173.879 0 0 2292.17 0 2133.78 0 1892.22 0 0 0 0 0 0 0 0 0 0 0 0 993.454 0 0.04 0 0 0 0 
0 812.937 0 0 0 0 0 0 -1567.81 0 0 -168.538 0 0 0 0 0 0 0 0 0 0 -2434.23 0 0 2082.35 0 0 0 0 0 0 0.01 2351.22 0 0 
0 0 0 0 -1068.38 0 0 0 0 0 0 0 0 0 0 -136.189 0 0 0 0 0 0 0 0 1931.59 0 0 0 0 0 0 0 760.445 0.01 0 0 
1410.03 0 -1626.26 0 0 0 1961.81 0 2233.12 0 0 0 0 2134.08 2239.37 0 0 0 0 0 0 0 0 0 0 0 0 0 0 2216.33 0 0 0 0 0.04 0 
0 0 -2282.71 1667.3 0 0 0 340.052 0 0 0 0 0 0 0 0 0 0 0 0 0 2111.96 0 0 0 0 0 0 0 269.25 0 0 0 0 0 0.08 
