*Vertices 60
*Matrix 
0.01 0 0 0 0 0 0 324.641 0 0 0 0 0 0 0 0 0 0 1360.29 0 0 0 0 0 0 0 -1066.55 1139.79 0 0 0 0 0 0 0 0 0 715.735 0 -1089.74 0 0 0 0 0 0 0 0 0 0 0 0 0 0 0 0 0 0 0 0 
0 0.06 0 0 0 0 0 0 -1738.72 0 0 0 0 0 0 0 0 2390.59 0 776.467 0 0 0 1546.75 0 0 0 0 0 0 0 0 0 0 0 0 0 0 0 0 0 0 0 0 0 0 0 0 0 0 0 0 0 0 0 0 0 0 0 0 
0 0 0.08 1393.55 0 -1797.01 0 0 0 0 0 0 0 171.133 0 0 0 0 2407.83 0 0 0 1966.54 0 0 0 0 0 0 0 0 0 0 0 -465.636 0 -2186.88 0 -2006.36 0 0 0 0 0 1931.29 0 0 0 0 0 0 0 0 0 0 0 0 0 0 0 
0 0 -1658.91 0.05 0 0 0 0 1586.12 0 0 0 0 0 0 1945.17 0 0 0 0 0 0 0 0 0 0 0 1743.14 0 419.248 0 0 0 0 0 0 0 0 0 0 0 0 -1538.97 0 -1848.89 0 409.177 0 0 0 0 0 0 0 0 0 0 0 0 574.435 
0 0 0 0 0.07 0 0 0 0 0 0 0 0 0 0 0 0 764.87 0 524.232 0 -369.198 0 0 0 0 0 0 0 0 0 0 0 0 0 0 0 0 0 0 0 0 -646.306 0 0 961.867 0 0 0 0 0 0 0 0 0 0 0 0 0 0 
0 0 33.7992 0 0 0.08 0 0 0 0 0 0 0 0 0 0 0 0 0 0 0 0 0 0 1373.41 0 0 0 0 0 1473.66 0 0 -52.1104 0 0 0 0 0 0 0 0 0 0 0 0 0 -1346.71 1967.45 0 0 0 0 0 0 0 0 0 0 0 
0 0 0 0 0 0 0.09 0 0 0 0 0 0 0 0 0 0 0 0 467.62 0 0 0 32.1207 0 0 0 1930.83 0 0 0 0 0 0 0 0 0 -1038.77 0 0 0 1302.45 -1087.45 0 0 958.968 2045.12 0 0 0 0 -1621.83 0 0 0 0 0 0 0 0 
1851.79 0 0 0 0 0 0 0.05 0 0 0 0 0 0 0 0 1253.01 0 0 0 0 0 0 -1403.47 0 -1068.83 812.632 0 0 0 0 2043.14 0 0 0 0 0 0 0 0 -2244.71 0 0 0 0 1082.26 0 0 0 0 0 0 0 0 0 0 0 0 0 0 
0 657.292 0 -1906.26 0 0 0 0 0.04 0 0 0 0 0 0 0 0 0 0 0 0 2392.27 1848.58 0 0 0 0 0 0 0 0 0 0 0 0 0 269.402 0 0 0 0 0 0 0 0 0 0 0 0 0 0 0 0 0 0 0 0 0 0 0 
0 0 0 0 0 0 0 0 0 0.09 0 0 0 0 0 0 0 0 0 0 0 0 0 0 0 0 0 0 0 0 0 0 0 0 0 0 0 0 0 1118.43 0 0 0 0 0 0 0 2260.43 0 0 0 0 0 0 0 0 0 0 0 0 
0 0 0 0 0 0 0 0 0 0 0.09 0 -1760.84 0 2393.03 0 0 0 0 0 1818.98 0 0 0 0 0 1788 0 0 0 0 0 1954.63 0 0 0 2453.76 0 0 0 0 0 0 0 0 -2349.85 0 0 0 0 0 0 0 0 0 0 0 0 0 0 
0 0 0 0 0 0 0 0 0 0 0 0 0 0 0 -74.6941 2213.89 0 0 0 0 0 0 0 0 0 0 0 0 0 0 0 0 0 28.1533 0 0 0 0 0 0 0 0 0 0 0 0 0 0 0 0 0 0 1488.46 0 0 0 0 0 0 
0 0 0 0 0 0 0 0 0 0 -2449.03 0 0.08 1381.95 0 -252.464 0 0 0 0 0 0 0 0 0 0 0 0 0 0 -399.716 0 0 1549.04 0 0 0 0 0 0 0 0 0 0 0 0 0 0 0 0 0 0 0 0 771.737 0 0 0 0 0 
0 0 925.55 0 0 0 0 0 0 0 0 0 2015.21 0 0 0 0 0 0 0 0 0 0 1252.25 0 0 0 0 0 0 2147.21 0 0 1328.55 0 0 0 0 0 0 0 0 0 430.387 0 0 0 0 0 0 0 0 0 0 0 0 0 0 0 0 
0 0 0 0 0 0 0 0 0 0 1488.31 0 0 0 0.05 0 0 0 0 0 -1461.46 0 0 0 0 1932.05 0 0 0 0 -1475.34 0 0 0 1420.1 0 0 0 0 0 0 1054.64 0 0 0 0 1728.64 0 0 0 635.014 0 0 0 0 0 0 0 0 0 
0 0 0 1831.19 0 0 0 0 0 0 0 2255.24 -188.681 0 0 0.09 0 0 0 0 0 -905.713 0 0 0 0 0 0 0 63.7074 0 0 -1119.95 0 0 0 0 0 0 0 0 0 -2195.43 0 868.633 0 0 0 0 0 0 0 0 0 0 0 0 0 0 0 
0 0 0 0 0 0 0 2308.65 0 0 0 888.623 0 0 0 0 0.02 0 0 0 0 0 0 0 0 0 0 -1733.22 0 0 0 761.361 0 0 0 0 0 0 -1615.73 0 -68.2852 0 0 986.129 0 0 2163.53 0 0 0 0 0 0 0 0 0 0 0 0 0 
0 1266.44 0 0 1130.63 0 0 0 0 0 0 0 0 0 0 0 0 0.05 0 0 0 0 0 0 0 0 0 0 0 0 1504.03 0 0 0 2182.76 0 0 -920.515 0 -2074.72 0 0 0 0 0 0 0 -1777.63 0 0 0 0 0 0 0 0 0 0 0 0 
802.866 0 1283.23 0 0 0 0 0 0 0 0 0 0 0 0 0 0 0 0.06 0 0 1725.14 0 0 0 1433.99 0 0 0 0 0 0 0 0 -348.75 0 0 0 0 0 0 0 0 -1797.01 0 0 0 0 0 0 0 0 0 0 0 0 0 0 0 0 
0 1859.87 0 0 -1670.2 0 1387.3 0 0 0 0 0 0 0 0 0 0 0 0 0.06 0 0 0 0 0 -1876.96 0 0 0 0 0 0 0 0 0 0 0 0 0 0 2372.28 0 1578.65 0 0 242.698 0 0 0 0 0 0 0 0 0 0 0 0 0 0 
0 0 0 0 0 0 0 0 0 0 -1973.25 0 0 0 -115.436 0 0 0 0 0 0.06 0 0 0 0 0 0 0 1572.08 0 0 0 0 0 0 0 0 0 0 0 0 0 0 0 0 0 0 0 0 0 0 0 0 0 0 0 0 0 0 0 
0 0 0 0 2325.28 0 0 0 486.694 0 0 0 0 0 0 -790.353 0 0 -1889.93 0 0 0 0 0 449.767 0 0 0 0 0 -72.2526 0 939.283 0 0 2477.72 0 2322.23 0 2297.05 0 0 0 0 1928.54 0 0 0 0 0 0 0 0 0 0 0 0 0 0 0 
0 0 2124.77 0 0 0 0 0 2119.43 0 0 0 0 0 0 0 0 0 0 0 0 0 0.06 0 0 0 0 0 193.716 2118.06 0 0 0 0 0 -378.964 0 0 0 -782.723 0 0 0 0 0 0 0 0 0 0 0 0 0 0 0 0 0 0 0 0 
0 801.187 0 0 0 0 2102.5 1685.92 0 0 0 0 0 2295.83 0 0 0 0 0 0 0 0 0 0 0 0 0 0 0 0 0 0 604.038 -849.864 2477.72 0 0 0 0 0 0 0 0 0 -2132.1 0 0 0 0 0 0 0 0 0 0 0 0 0 0 0 
0 0 0 0 0 1654.03 0 0 0 0 0 0 0 0 0 0 0 0 0 0 0 930.28 0 0 0.06 0 0 0 0 0 0 2374.11 0 0 0 0 -273.064 0 -1786.02 0 0 0 0 0 2039.48 0 0 -339.747 0 0 0 0 0 0 0 0 0 0 0 0 
0 0 0 0 0 0 0 1324.58 0 0 0 0 0 0 -1280.18 0 0 0 933.638 2239.07 0 0 0 0 0 0 0 0 0 0 0 0 0 974.227 0 0 0 0 0 0 2465.82 2489.62 0 0 0 0 0 0 0 0 0 0 0 0 0 0 0 0 0 0 
-1977.52 0 0 0 0 0 0 -1672.19 0 0 140.004 0 0 0 0 0 0 0 0 0 0 0 0 0 0 0 0 0 0 0 0 0 0 0 0 0 959.12 0 0 0 0 1706.82 -1278.04 0 2382.2 0 0 0 0 0 0 0 0 0 0 0 0 -859.02 0 0 
2238.76 0 0 1376.61 0 0 -1945.48 0 0 0 0 0 0 0 0 0 -2251.43 0 0 0 0 0 0 0 0 0 0 0 0 0 0 0 0 0 2152.7 1742.84 0 0 0 0 0 664.464 0 879.467 0 0 0 0 0 0 0 0 0 0 0 0 0 0 0 0 
0 0 0 0 0 0 0 0 0 0 0 0 0 0 0 0 0 0 0 0 396.664 0 -42.6496 0 0 0 0 0 0.07 0 1968.37 0 0 0 0 0 240.867 0 0 0 0 0 0 0 0 0 -2099.9 0 0 0 0 0 0 0 0 0 0 0 0 0 
0 0 0 2087.54 0 0 0 0 0 0 0 0 0 0 0 1430.63 0 0 0 0 0 0 1721.93 0 0 0 0 0 0 0.04 0 0 0 0 0 0 0 0 0 0 0 1440.55 0 0 0 0 0 0 0 0 0 0 0 0 0 0 0 0 0 0 
0 0 0 0 0 1884.29 0 0 0 0 0 0 1179.31 -1346.25 1820.81 0 0 -1019.7 0 0 0 1594.21 0 0 0 0 0 0 -1504.18 0 0.03 0 957.137 0 1428.8 0 0 -957.289 0 0 0 0 0 0 1417.81 0 0 0 0 0 0 0 0 0 0 0 0 0 0 0 
0 0 0 0 0 0 0 401.547 0 0 0 0 0 0 0 0 1966.38 0 0 0 0 0 0 0 -662.481 0 0 0 0 0 0 0.04 0 0 2123.55 1934.95 0 0 0 0 0 0 9.38444 0 1464.96 0 -2172.99 0 0 0 0 0 0 0 0 0 0 0 0 0 
0 0 0 0 0 0 0 0 0 0 2197.41 0 0 0 0 701.392 0 0 0 0 0 1310.54 0 830.943 0 0 0 0 0 0 -1714.45 0 0.01 0 0 0 0 -593.661 0 0 2027.57 0 0 0 0 0 0 0 0 0 0 0 0 0 0 0 0 0 0 0 
0 0 0 0 0 2445.07 0 0 0 0 0 0 1003.52 648.747 0 0 0 0 0 0 0 0 0 449.309 0 2401.73 0 0 0 0 0 0 0 0.06 0 0 0 0 0 0 0 0 0 0 2308.65 2229 0 0 -2419.74 0 0 0 0 0 0 0 0 0 0 0 
0 0 -841.624 0 0 0 0 0 0 0 0 1444.82 0 0 1971.42 0 0 -1086.54 506.989 0 0 0 0 2436.83 0 0 0 2015.52 0 0 1792.73 -2328.33 0 0 0.09 0 0 0 0 0 0 -22.66 0 0 0 0 0 0 0 0 0 0 0 0 0 0 0 0 0 0 
0 0 0 0 0 0 0 0 0 0 0 0 0 0 0 0 0 0 0 0 0 1040.3 2451.48 0 0 0 0 1603.37 0 0 0 1477.32 0 0 0 0.05 -2011.55 0 0 0 -43.1074 143.818 1396.76 0 -721.381 0 0 -765.786 0 0 0 0 0 0 0 0 0 0 0 0 
0 0 -545.442 0 0 0 0 0 996.506 0 555.818 0 0 0 0 0 0 0 0 0 0 0 0 0 346.614 0 1740.55 0 -1546.91 0 0 0 0 0 0 1547.06 0 0 0 0 0 0 0 0 484.863 0 0 0 0 0 0 0 0 0 0 0 0 0 0 0 
59.8926 0 0 0 0 0 1227.38 0 0 0 0 0 0 0 0 0 0 -589.236 0 0 0 1514.56 0 0 0 0 0 0 0 0 1986.98 0 527.284 0 0 0 0 0.02 0 0 0 0 0 0 0 0 0 0 0 0 0 0 0 0 0 0 0 0 0 0 
0 0 16.7089 0 0 0 0 0 0 0 0 0 0 0 0 0 755.867 0 0 0 0 0 0 0 2016.28 0 0 0 0 0 0 0 0 0 0 0 0 0 0.05 0 0 0 0 0 0 0 0 0 0 1128.35 0 0 0 0 0 1826.3 0 0 0 0 
1865.06 0 0 0 0 0 0 0 0 459.99 0 0 0 0 0 0 0 2345.58 0 0 0 807.443 -845.897 0 0 0 0 0 0 0 0 0 0 0 0 0 0 0 0 0.07 0 0 0 0 0 0 0 0 -1435.21 0 0 0 0 0 0 0 0 0 0 0 
0 0 0 0 0 0 0 1645.63 0 0 0 0 0 0 0 0 665.532 0 0 289.85 0 0 0 0 0 139.241 0 0 0 0 0 0 236.9 0 0 784.86 0 0 0 0 0.07 0 0 0 0 0 358.211 0 0 0 0 0 0 0 0 0 0 0 0 0 
0 0 0 0 0 0 -1170 0 0 0 0 0 0 0 -2077.78 0 0 0 0 0 0 0 0 0 0 2194.66 -49.9741 899.915 0 1388.21 0 0 0 0 2214.35 2335.2 0 0 0 0 0 0.02 0 0 0 0 1505.71 0 0 0 0 0 0 0 0 0 0 0 0 0 
0 0 0 -274.895 -1308.86 0 -1783.88 0 0 0 0 0 0 0 0 2460.33 0 0 0 2433.01 0 0 0 0 0 0 -1862.01 0 0 0 0 659.886 0 0 0 676.672 0 0 0 0 0 0 0 -1410.03 1857.13 0 0 0 0 0 0 0 0 0 0 0 0 0 0 0 
0 0 0 0 0 0 0 0 0 0 0 0 0 -1866.13 0 0 -389.492 0 1596.19 0 0 0 0 0 0 0 0 2174.67 0 0 0 0 0 0 0 0 0 0 0 0 0 0 1072.8 0.08 0 0 0 0 0 0 0 0 0 0 0 0 0 0 0 0 
0 0 1304.74 1484.5 0 0 0 0 0 0 0 0 0 0 0 -91.937 0 0 0 0 0 1561.71 0 -1151.08 2367.24 0 -1850.11 0 0 0 -365.383 1548.13 0 1137.35 0 1881.69 -1217.46 0 0 0 0 0 -295.343 0 0.04 0 0 0 0 0 0 0 0 0 0 0 0 0 0 0 
0 0 0 0 1656.47 0 2089.37 761.208 0 0 -859.63 0 0 0 0 0 0 0 0 -910.138 0 0 0 0 0 0 0 0 0 0 0 0 0 1608.86 0 0 0 0 0 0 0 0 0 0 0 0.07 0 0 0 0 0 0 0 0 0 0 0 0 0 0 
0 0 0 1261.86 0 0 1143.6 0 0 0 0 0 0 0 2355.65 0 449.614 0 0 0 0 0 0 0 0 0 0 0 914.563 0 0 1336.33 0 0 0 0 0 0 0 0 -1083.64 2458.8 0 0 0 0 0.03 0 0 0 0 0 0 0 0 0 -1108.81 0 0 0 
0 0 0 0 0 1998.12 0 0 0 922.803 0 0 0 0 0 0 0 -595.95 0 0 0 0 0 0 -2084.8 0 0 0 0 0 0 0 0 0 0 2266.84 0 0 0 0 0 0 0 0 0 0 0 0.04 0 0 0 0 751.9 0 0 0 0 0 0 0 
0 0 0 0 0 711.158 0 0 0 0 0 0 0 0 0 0 0 0 0 0 0 0 0 0 0 0 0 0 0 0 0 0 0 565.127 0 0 0 0 0 1238.98 0 0 0 0 0 0 0 0 0.05 0 0 0 0 0 0 0 0 0 0 0 
0 0 0 0 0 0 0 0 0 0 0 0 0 0 0 0 0 0 0 0 0 0 0 0 0 0 0 0 0 0 0 0 0 0 0 0 0 0 2052.75 0 0 0 0 0 0 0 0 0 0 0.05 0 0 0 0 0 0 0 0 0 0 
0 0 0 0 0 0 0 0 0 0 0 0 0 0 852.458 0 0 0 0 0 0 0 0 0 0 0 0 0 0 0 0 0 0 0 0 0 0 0 0 0 0 0 0 0 0 0 0 0 0 0 0.01 0 0 0 0 0 0 0 0 0 
0 0 0 0 0 0 423.826 0 0 0 0 0 0 0 0 0 0 0 0 0 0 0 0 0 0 0 0 0 0 0 0 0 0 0 0 0 0 0 0 0 0 0 0 0 0 0 0 0 0 0 0 0.04 0 0 0 0 0 0 0 0 
0 0 0 0 0 0 0 0 0 0 0 0 0 0 0 0 0 0 0 0 0 0 0 0 0 0 0 0 0 0 0 0 0 0 0 0 0 0 0 0 0 0 0 0 0 0 0 1414.91 0 0 0 0 0.02 0 0 0 0 0 0 0 
0 0 0 0 0 0 0 0 0 0 0 1668.07 0 0 0 0 0 0 0 0 0 0 0 0 0 0 0 0 0 0 0 0 0 0 0 0 0 0 0 0 0 0 0 0 0 0 0 0 0 0 0 0 0 0.04 0 0 0 0 1871.93 0 
0 0 0 0 0 0 0 0 0 0 0 0 1534.55 0 0 0 0 0 0 0 0 0 0 0 0 0 0 0 0 0 0 0 0 0 0 0 0 0 0 0 0 0 0 0 0 0 0 0 0 0 0 0 0 0 0.06 0 0 0 0 0 
0 0 0 0 0 0 0 0 0 0 0 0 0 0 0 0 0 0 0 0 0 0 0 0 0 0 0 0 0 0 0 0 0 0 0 0 0 0 2382.2 0 0 0 0 0 0 0 0 0 0 0 0 0 0 0 0 0.06 0 0 0 0 
0 0 0 0 0 0 0 0 0 0 0 0 0 0 0 0 0 0 0 0 0 0 0 0 0 0 0 0 0 0 0 0 0 0 0 0 0 0 0 0 0 0 0 0 0 0 768.38 0 0 0 0 0 0 0 0 0 0.08 0 0 0 
0 0 0 0 0 0 0 0 0 0 0 0 0 0 0 0 0 0 0 0 0 0 0 0 0 0 2412.87 0 0 0 0 0 0 0 0 0 0 0 0 0 0 0 0 0 0 0 0 0 0 0 0 0 0 0 0 0 0 0.06 0 0 
0 0 0 0 0 0 0 0 0 0 0 0 0 0 0 0 0 0 0 0 0 0 0 0 0 0 0 0 0 0 0 0 0 0 0 0 0 0 0 0 0 0 0 0 0 0 0 0 0 0 0 0 0 540.864 0 0 0 0 0.01 0 
0 0 0 895.795 0 0 0 0 0 0 0 0 0 0 0 0 0 0 0 0 0 0 0 0 0 0 0 0 0 0 0 0 0 0 0 0 0 0 0 0 0 0 0 0 0 0 0 0 0 0 0 0 0 0 0 0 0 0 0 0.08 
