*Vertices 54
*Matrix 
0.05 0 1322.6 0 0 0 0 2249.29 -489.135 0 0 -854.289 0 0 -1358.76 0 0 2407.38 0 0 0 0 0 0 0 1627.02 0 0 0 0 0 0 0 0 0 0 0 1072.04 0 0 1027.94 0 0 0 0 0 0 0 0 629.673 1269.19 0 0 0 
0 0.08 0 0 0 0 0 0 0 0 0 0 0 0 0 0 -1137.96 0 409.635 1906.26 0 0 -2400.97 0 0 1536.99 0 0 0 0 0 0 -167.165 0 0 0 0 0 0 1516.24 737.709 0 0 1949.29 0 0 0 0 0 0 0 0 0 1872.54 
2166.28 0 0.02 2497.56 0 0 -705.969 0 0 0 0 0 0 0 0 -1579.71 0 0 0 464.873 0 0 0 0 0 1149.25 0 973.617 0 911.206 723.06 1847.82 0 0 0 0 404.599 0 0 0 0 1855.91 0 0 0 2149.8 1186.79 -602.817 97.8881 0 -1453.52 0 0 0 
0 0 -1772.13 0.08 0 0 0 0 1773.35 0 1903.21 0 -584.964 0 0 0 1708.5 0 -1207.54 0 0 0 0 0 0 0 0 0 1691.41 0 0 0 0 0 0 0 586.489 124.744 0 -743.507 0 0 436.338 -1607.18 0 0 -398.801 1649.75 0 458.007 0 2348.63 0 0 
0 0 0 0 0.03 0 0 0 0 0 0 -460.143 0 0 883.435 0 -634.556 0 0 0 0 0 0 0 0 2017.35 0 0 2069.23 0 -2416.38 -759.377 0 -573.061 322.352 0 151.448 2299.8 0 860.393 2037.64 0 0 -2174.67 0 0 0 2463.84 0 0 -1884.29 0 0 0 
0 0 0 0 0 0.01 1271.02 -1493.19 0 0 0 0 0 1482.97 0 0 0 -549.257 0 -1310.85 -2457.27 0 526.521 2237.08 0 0 0 0 0 0 0 489.135 0 0 0 0 0 0 -329.981 0 0 2023.45 0 2339.47 0 0 0 0 814.615 0 864.818 0 2153 0 
0 0 -192.801 0 0 -293.97 0.04 1900.31 0 0 0 0 0 -1788.16 0 0 0 0 -219.962 -472.655 0 0 0 0 0 -1722.54 0 0 -355.464 1268.73 1027.63 0 0 975.906 0 0 0 400.632 0 0 0 0 0 1171.68 1160.08 0 1563.08 0 -71.0318 0 0 -1278.8 1736.43 0 
-1568.42 0 0 0 0 1814.1 516.602 0.01 0 0 0 0 1369.14 217.215 0 0 0 0 1712.78 0 0 0 0 0 0 0 0 0 0 0 0 0 0 0 624.485 0 -2178.18 -1202.81 2449.49 0 0 0 0 1410.79 2286.68 0 -624.332 0 0 2395.17 0 0 0 0 
2167.5 0 0 -668.889 0 0 0 0 0.08 1223.87 0 0 -153.279 0 2144 -2449.19 0 152.364 0 0 0 -2393.95 1759.01 0 0 0 0 0 0 2459.56 0 0 0 0 -506.531 -127.796 0 0 0 0 0 674.23 -325.709 0 0 0 -808.206 0 0 421.995 -506.378 0 2247.31 0 
0 0 0 0 0 0 0 0 -968.886 0.09 0 0 0 0 0 0 0 0 0 0 784.097 0 0 0 0 0 0 0 0 0 0 1613.59 0 0 0 0 0 0 1693.55 0 0 0 -297.327 -2069.23 0 0 0 0 -1155.35 -2084.03 0 0 2150.56 1260.03 
0 0 0 306.024 0 0 0 0 0 0 0.04 0 0 0 -529.115 -2286.68 0 0 0 0 0 0 0 600.223 0 0 0 0 -1742.23 0 0 0 0 2066.48 0 0 0 0 0 1075.09 0 0 -174.337 0 0 1862.47 0 0 0 -1267.66 0 0 0 0 
1754.13 0 0 0 1063.8 0 0 0 0 0 0 0.03 0 0 0 0 -2162.47 0 0 0 -45.0911 0 101.55 0 1544.16 0 0 0 2137.59 0 -2333.37 0 2331.69 0 0 -394.223 0 143.513 0 854.595 0 1413.08 706.885 0 -1524.93 0 -30.5948 0 0 0 0 0 0 0 
0 0 0 -121.54 0 0 0 765.023 -187.46 0 0 0 0 0 0 0 0 0 0 2477.57 255.211 0 2089.98 0 0 0 597.018 0 0 0 -1450.47 0 845.286 0 0 0 0 0 0 0 0 0 0 872.6 0 0 0 808.817 0 0 1956.47 0 0 0 
0 0 0 0 0 1969.44 751.442 399.411 0 0 0 0 0 0.05 0 0 -2256.16 0 -282.067 0 0 0 0 306.94 0 2264.4 0 0 1339.99 0 0 979.11 0 0 0 0 -368.892 0 0 0 393.765 0 0 0 -2167.5 0 0 0 2086.32 0 0 717.566 80.9503 -176.931 
794.015 0 0 0 1409.57 0 0 0 1750.92 0 629.978 0 0 0 0.06 0 0 1130.48 0 0 0 0 0 0 0 0 0 1372.34 -2052.6 0 1007.49 0 0 0 0 0 0 -2373.96 -1874.68 0 0 0 0 0 0 0 0 0 0 0 0 1416.14 0 0 
0 0 -472.35 0 0 0 0 0 -29.9844 0 2063.28 0 0 0 0 0.09 0 0 0 0 1686.99 0 0 0 1156.88 609.226 0 111.316 0 0 1570.25 1487.55 0 0 0 0 0 1516.24 0 0 0 0 0 0 -575.198 0 0 0 0 0 0 0 0 0 
0 -2343.44 0 682.012 -927.076 0 0 0 0 0 0 635.014 0 -110.858 0 0 0.04 0 0 -910.596 0 0 66.9118 1173.67 0 0 0 0 -2353.21 -765.786 0 0 0 0 0 0 0 0 1346.25 0 0 0 0 0 0 0 0 0 1308.1 0 0 1805.55 0 0 
1193.81 0 0 0 0 -1137.5 0 0 -1140.86 0 0 0 0 0 807.443 0 0 0.08 0 0 0 2033.07 -1123.16 0 -295.343 2374.72 0 0 0 1190.15 0 0 -1540.35 0 0 0 0 0 559.938 0 0 0 0 1219.9 0 0 -648.289 0 0 0 -1900.77 0 0 0 
0 1178.4 0 -38.2244 0 0 1260.8 2043.9 0 0 0 0 0 53.3311 0 0 0 0 0.01 0 0 0 0 0 0 0 0 0 -123.524 819.346 0 -402.005 0 853.984 0 0 -901.746 1436.58 0 0 0 0 0 0 0 2178.64 0 0 0 0 -805.155 -2276.91 0 0 
0 2042.68 1991.71 0 0 -1174.73 -1822.95 0 0 0 0 0 1029.16 0 0 0 -1652.2 0 0 0.02 0 0 0 351.955 0 0 0 0 0 0 0 0 2272.94 0 1325.65 -984.909 -806.68 0 2027.73 0 -2276.45 0 0 0 1776.25 0 -1143.6 1867.35 0 0 0 1994.31 0 0 
0 0 0 0 0 1087.3 0 0 0 1371.12 0 1760.08 721.076 0 0 -2095.17 0 0 0 0 0.02 0 0 98.0407 0 1393.55 2413.17 0 0 -1759.16 468.23 0 0 0 0 0 0 0 0 0 0 0 0 0 0 0 0 0 0 0 0 0 0 0 
0 0 0 0 0 0 0 0 2005.29 0 0 0 0 0 0 0 0 -1010.09 0 0 0 0.04 0 0 0 0 0 0 -752.205 2497.1 0 -512.482 0 0 0 0 0 -1539.28 0 0 1504.03 0 1239.28 2124.93 0 0 0 0 0 1664.86 0 548.799 0 0 
0 1271.63 0 0 0 1805.55 0 0 929.06 0 0 -1910.84 434.507 0 0 0 -2442.32 -2258.75 0 0 0 0 0.06 0 0 0 0 -1628.39 0 -148.854 0 -1245.84 0 0 2460.48 0 1038.32 0 779.824 0 2253.56 0 0 0 0 0 0 2072.28 -1946.55 0 0 0 0 0 
0 0 0 0 0 -1199.91 0 0 0 0 1414.61 0 0 1131.09 0 0 -488.983 0 0 -1014.05 -468.688 0 0 0.05 2230.67 1899.85 1771.98 0 2115.77 0 0 -396.054 618.534 0 0 824.992 0 637.15 -294.733 0 0 0 0 1762.98 0 66.3015 0 0 0 -1718.27 0 2152.55 0 -1399.04 
0 0 0 0 0 0 0 0 0 0 0 -77.5933 0 0 0 1487.4 0 451.292 0 0 0 0 0 161.214 0.01 0 0 0 0 0 0 0 2002.4 0 0 0 2400.36 0 0 0 0 0 -450.224 0 0 0 0 -1631.14 0 234.611 0 0 -550.172 0 
888.012 -703.375 145.497 0 -1025.04 0 762.886 0 0 0 0 0 0 1821.42 0 1318.48 0 823.618 0 0 -889.386 0 0 -2076.86 0 0.06 0 0 0 0 0 0 1461 0 0 150.838 0 -895.642 0 0 165.792 0 0 0 0 1908.7 0 0 0 0 0 0 427.03 0 
0 0 0 0 0 0 0 0 0 0 0 0 1164.66 0 0 0 0 0 0 0 -2259.97 0 0 -8.1637 0 0 0.02 0 0 970.87 0 0 0 0 0 1115.68 0 0 0 0 0 846.66 0 0 0 0 0 0 515.076 0 0 1773.05 0 0 
0 0 968.429 0 0 0 0 0 0 0 0 0 0 0 906.781 405.057 0 0 0 0 0 0 907.086 0 0 0 0 0 0 0 2141.41 -599.46 461.974 -1565.52 0 0 0 0 0 0 -504.242 0 -1815.01 0 0 0 -1772.44 0 0 857.189 1470 839.793 0 0 
0 0 0 -127.033 -492.035 0 1999.34 0 0 0 2111.8 -815.378 0 1675.85 -651.036 0 2152.24 0 -783.792 0 0 -1283.99 0 -2159.26 0 0 0 0 0.09 0 2261.65 1758.4 0 1714 0 0 0 1597.57 0 0 0 180.135 0 0 0 0 0 0 0 0 0 0 0 0 
0 0 -1782.82 0 0 0 -1487.09 0 -53.7889 0 0 0 0 0 0 0 -469.298 921.125 2049.55 0 -490.356 1300.47 2214.35 0 0 0 181.661 0 0 0.06 2480.16 2319.03 0 2454.53 -467.315 0 0 158.62 0 2235.86 0 0 0 0 0 1582.61 0 0 0 0 0 0 0 0 
0 0 -611.972 0 870.769 0 762.581 0 0 0 0 1441.92 739.387 0 1048.54 527.894 0 0 0 0 -664.312 0 0 0 0 0 0 138.173 -1785.41 -711.005 0.08 570.772 0 0 0 0 0 0 886.639 0 1652.5 0 0 0 0 0 1040.6 -2225.18 -1701.79 -1383.02 0 0 1235.16 0 
0 0 1898.48 0 620.212 -376.064 0 0 0 2424.31 0 0 0 -2064.2 0 -1830.12 0 0 644.932 0 0 754.799 830.485 2428.43 0 0 0 429.167 -1209.07 -820.872 2411.04 0.03 0 0 0 -573.214 499.664 0 0 293.207 0 0 260.247 -1992.02 782.113 0 1339.69 -1729.41 2449.8 1306.42 0 0 0 1558.96 
0 1150.01 0 0 0 0 0 0 0 0 0 2326.5 1865.21 0 0 0 0 -138.173 0 -396.664 0 0 0 -625.553 -1985.46 732.368 0 1335.72 0 0 0 0 0.06 0 0 0 0 0 0 0 0 0 0 -1348.69 0 0 817.057 0 0 0 0 2332.3 0 -538.728 
0 0 0 0 1184.8 0 -1504.33 0 0 0 1954.48 0 0 0 0 0 0 0 -993.149 0 0 0 0 0 0 0 0 440.153 -1094.16 -2218.01 0 0 0 0.03 1879.86 0 -174.642 0 674.841 2176.5 0 0 0 0 -172.811 -2261.96 0 172.353 0 1887.34 0 0 0 0 
0 0 0 0 1730.17 0 0 895.184 -2069.08 0 0 0 0 0 0 0 0 0 0 1422.85 0 0 1069.44 0 0 0 0 0 0 -1413.85 0 0 0 -1634.65 0.02 2428.43 0 0 0 0 0 0 0 0 0 0 0 0 0 0 0 0 0 0 
0 0 0 0 0 0 0 0 -2329.25 0 0 -235.374 0 0 0 0 0 0 0 -724.281 0 0 0 -423.215 0 2153.92 -1264.92 0 0 0 0 445.952 0 0 1987.75 0.07 0 2116.38 0 0 -2068.16 2089.53 0 0 0 1128.8 0 0 0 0 -753.273 0 0 0 
0 0 960.189 1997.05 1430.48 0 0 -2095.48 0 0 0 0 0 -1492.58 0 0 0 0 147.786 747.475 0 0 1252.71 0 -2220.3 0 0 0 0 0 0 -2375.03 0 694.678 0 0 0 0 2194.66 0 643.712 0 1615.73 2321.77 1509.06 1194.11 -551.546 1856.06 0 -403.684 0 0 0 0 
1034.65 0 0 2279.96 -69.0481 0 -712.226 81.2555 0 0 0 2358.24 0 0 1302.91 1096 0 0 1766.95 0 0 71.4896 0 -139.851 0 -2386.01 0 0 1602.45 -1275.14 0 0 0 0 0 209.128 0 0.07 0 0 -107.654 -1516.24 47.2274 0 0 0 0 936.384 0 0 0 0 0 0 
0 0 0 0 0 -1237.3 0 -1494.42 0 2404.63 0 0 0 0 1585.97 0 -2333.98 27.543 0 1750.01 0 0 -2246.7 775.857 0 0 0 0 0 0 1838.66 0 0 1755.2 0 0 2226.1 0 0.02 -1375.09 0 0 0 0 0 0 0 0 0 0 0 0 0 0 
0 1151.69 0 824.381 -308.618 0 0 0 0 0 1223.56 -194.937 0 0 0 0 0 0 0 0 0 0 0 0 0 0 0 0 0 304.804 0 161.672 0 -1770 0 0 0 0 -480.132 0.04 0 0 0 1997.51 0 0 0 1197.16 0 0 0 0 2499.24 0 
-1658.45 1745.28 0 0 2284.08 0 0 0 0 0 0 0 0 -946.15 0 0 0 0 0 -6.18 0 2353.05 186.392 0 0 1299.25 0 -1259.27 0 0 1084.4 0 0 0 0 -1218.83 1988.05 -170.675 0 0 0.07 -2276.6 0 0 0 0 0 0 0 0 0 -347.224 0 0 
0 0 194.479 0 0 1660.89 0 0 -996.353 0 0 -2205.34 0 0 0 0 0 0 0 0 0 0 0 0 0 0 641.118 0 768.227 0 0 0 0 0 0 2228.39 0 -392.697 0 0 2006.52 0.09 1698.74 0 2311.09 0 -2001.63 0 0 0 0 0 0 0 
0 0 0 -1786.78 0 0 0 0 -425.81 2203.51 -632.725 2055.04 0 0 0 0 0 0 0 0 0 642.033 0 0 1385.16 0 0 -369.35 0 0 0 33.4941 0 0 0 0 -1366.85 2229.15 0 0 0 984.146 0.09 0 0 0 0 0 0 0 0 0 0 -77.7459 
0 1054.95 0 918.836 -933.943 792.642 2153.77 -1255.3 0 404.752 0 0 1989.58 0 0 0 0 295.953 0 0 0 250.481 0 503.021 0 0 0 0 0 0 0 1247.98 -888.928 0 0 0 255.669 0 0 -380.49 0 0 0 0 1794.72 -212.027 0 0 0 0 -866.955 0 0 0 
0 0 0 0 0 0 2130.73 2278.13 0 0 0 1764.35 0 -2190.39 0 389.035 0 0 0 763.497 0 0 0 0 0 0 0 0 0 0 0 -682.47 0 -2394.71 0 0 1345.64 0 0 0 0 -2061.45 0 703.986 0.04 1355.4 0 0 -1257.29 0 -1567.05 0 0 0 
0 0 -2167.04 0 0 0 0 0 0 0 2112.42 0 0 0 0 0 0 0 -1917.25 0 0 0 0 376.217 0 1586.89 0 0 0 346.614 0 0 0 -1939.38 0 -1840.8 1602.6 0 0 0 0 0 0 945.082 -1171.38 0.05 926.008 2291.25 0 0 320.826 0 0 0 
0 0 561.464 1160.7 0 0 -281.152 599.002 2354.43 0 0 -129.933 0 0 0 0 0 -2335.96 0 -425.047 0 0 0 0 0 0 0 -1672.49 0 0 2142.17 -44.3281 482.421 0 0 0 1553.93 0 0 0 0 -1582.92 0 0 0 1651.43 0.06 0 1881.24 0 0 0 0 2409.05 
0 0 2306.97 -1373.41 -1744.67 0 0 0 0 0 0 0 1567.96 0 0 0 0 0 0 1706.52 0 0 2216.64 0 301.599 0 0 0 0 0 1502.66 2374.11 0 -333.491 0 0 -1182.52 276.727 0 -1421.78 0 0 0 0 0 -2435.45 0 0.08 -772.195 0 0 1640.75 0 0 
0 0 788.827 0 0 2478.33 654.698 0 0 -2404.63 0 0 0 -1300.32 0 0 -340.205 0 0 0 0 0 1717.51 0 0 0 2423.09 0 0 0 495.087 2023.45 0 0 0 0 0 0 0 0 0 0 0 0 1536.68 0 5.87481 -822.092 0 1456.11 0 1851.63 -1025.35 0 
1194.88 0 0 1958.91 0 0 0 -1627.78 2353.66 -2193.14 -1326.87 0 0 0 0 0 0 0 0 0 0 2447.51 0 -1760.84 2161.4 0 0 -2372.89 0 0 1243.71 1933.73 0 -1155.35 0 0 1953.11 0 0 0 0 0 0 0 0 0 0 0 765.023 0.05 0 0 2024.06 -1037.86 
-1925.03 0 -611.82 0 -1657.38 1159.93 0 0 1095.23 0 0 0 -1338.62 0 0 0 0 1797.62 2269.28 0 0 0 0 0 0 0 0 1451.54 0 0 0 0 0 0 0 -361.415 0 0 0 0 0 0 0 162.893 -468.383 1656.16 0 0 0 0 0.02 2418.21 0 0 
0 0 0 1742.68 0 0 -1662.27 0 0 0 0 0 0 2059.16 -647.832 0 748.695 0 505.005 -1464.96 0 942.946 0 -566.805 0 0 -9.68963 1231.96 0 0 0 0 -1284.45 0 0 0 0 0 0 0 1381.5 0 0 0 0 0 0 -1571.93 2112.57 0 1331.75 0.08 0 0 
0 0 0 0 0 -1402.86 760.903 0 1636.33 -568.789 0 0 0 1373.56 0 0 0 0 0 0 0 0 0 0 2081.44 545.747 0 0 0 0 2295.98 0 0 0 0 0 0 0 0 -1338.01 0 0 0 0 0 0 0 0 1078.6 2305.14 0 0 0.07 -863.292 
0 215.537 0 0 0 0 0 0 0 718.635 0 0 0 654.698 0 0 0 0 0 0 0 0 0 420.774 0 0 0 0 0 0 0 -128.101 -566.195 0 0 0 0 0 0 0 0 0 2037.34 0 0 0 1164.97 0 0 -981.857 0 0 70.4215 0.06 
