*Vertices 47
*Matrix 
0.06 1501.43 -475.555 0 0 0 591.22 0 0 1205.56 0 0 0 0 0 0 0 0 0 0 0 0 0 0 1237.75 0 0 0 0 0 0 0 0 0 0 0 0 0 0 -546.51 0 0 0 2093.34 0 0 0 
1621.83 0 0 0 0 0 0 0 1351.89 0 2179.1 0 0 0 0 0 0 0 0 -46.4644 0 0 2422.03 770.211 0 0 0 0 0 0 0 0 0 0 298.853 -1464.96 -1057.85 0 0 0 -2012.92 1081.04 0 0 0 0 0 
410.092 0 0.01 0 0 0 0 0 0 15.183 0 1841.26 2099.9 0 1045.64 0 579.318 0 0 0 0 0 0 0 2276.76 0 0 0 0 0 0 0 0 0 0 0 0 1316.64 0 0 0 -416.959 0 0 0 0 0 
0 0 0 0.04 0 1987.9 641.27 0 0 0 0 0 0 0 0 0 0 0 0 2102.19 826.365 0 0 0 0 0 0 -186.087 0 0 0 -1776.56 0 0 0 0 0 1465.58 0 0 2093.95 2229.91 0 0 0 0 0 
0 0 0 0 0.04 0 0 0 0 0 0 0 0 0 0 0 0 0 0 0 0 0 0 0 0 2397.46 405.362 0 1250.72 0 177.999 0 0 0 0 1680.27 0 0 1454.13 0 0 0 203.177 0 0 0 0 
0 0 0 1338.31 0 0.05 0 0 0 -1001.54 0 2025.44 1582.77 0 0 0 0 0 0 -423.368 0 0 0 1419.95 0 0 0 0 1279.56 0 0 0 0 283.898 0 0 2151.33 0 0 0 0 0 0 0 0 0 -400.784 
49.5163 0 0 167.013 0 0 0.07 0 0 -2367.24 0 0 0 0 0 0 0 0 0 0 0 1886.58 0 0 0 0 0 0 0 0 0 2210.23 0 0 0 0 1925.79 0 0 0 0 0 0 1323.21 0 0 0 
0 0 0 0 0 0 0 0.03 0 0 0 0 0 2446.13 0 0 0 0 0 0 0 0 0 176.626 0 0 0 0 0 0 0 0 0 0 0 -1378.14 0 0 0 0 0 1350.67 0 0 0 0 0 
0 250.481 0 0 0 0 0 0 0.02 0 0 0 0 0 0 0 2118.82 0 -600.375 0 0 1323.82 0 0 0 0 0 2154.84 0 0 0 -777.841 0 0 0 0 0 0 0 0 -1279.56 0 0 0 0 0 0 
-2122.94 0 -824.534 0 0 1070.36 2330.47 0 0 0.09 0 0 463.347 0 0 0 0 -1185.87 0 0 0 504.547 0 0 0 0 0 0 0 0 0 0 0 0 0 373.318 0 0 0 0 0 -244.377 0 0 0 0 0 
0 851.695 0 0 0 0 0 0 0 0 0.07 0 1029.77 0 0 0 0 0 0 0 2143.54 0 0 0 0 0 0 0 0 0 782.266 0 1361.2 0 0 0 0 1057.39 0 22.66 0 0 0 0 0 0 0 
0 0 2475.13 0 0 209.891 0 0 0 0 0 0.08 0 0 0 0 -1558.5 0 1150.62 0 0 0 87.5118 0 0 0 1642.74 0 0 0 0 1952.5 0 0 0 0 1198.39 0 0 -355.007 0 1234.24 0 0 0 0 0 
0 0 -195.242 0 0 715.43 0 0 0 76.8303 786.233 0 0.08 645.543 1345.64 -491.729 -472.198 0 0 0 0 0 0 0 0 0 0 0 0 0 0 1850.26 0 -1110.8 0 2281.49 0 0 0 0 0 0 0 0 0 0 0 
0 0 0 0 0 0 0 1784.65 0 0 0 0 -1038.62 0.04 0 0 0 0 0 0 0 0 0 -1645.02 0 0 0 0 0 0 0 0 0 0 0 2192.07 0 0 0 0 0 0 0 0 0 0 0 
0 0 -2357.33 0 0 0 0 0 0 0 0 0 2279.5 0 0.03 -1238.98 2222.74 0 0 0 0 2467.8 0 1347.32 0 0 0 0 -714.362 0 1289.03 0 0 0 0 0 0 0 0 0 0 0 0 0 0 0 0 
0 0 0 0 0 0 0 0 0 0 0 0 118.488 0 2379.15 0.05 0 0 0 0 0 0 -649.663 0 0 0 0 0 0 0 0 0 0 0 0 -194.327 0 0 0 0 0 0 0 0 0 0 0 
0 0 -96.9726 0 0 0 0 0 -179.067 0 0 1855.45 -71.0318 0 1624.12 0 0 0 0 0 -565.432 0 0 0 1036.94 680.639 0 0 0 1110.49 0 0 0 0 0 0 2197.56 0 0 -2045.58 0 0 0 0 0 0 0 
0 0 0 0 0 0 0 0 0 -1000.47 0 0 0 0 0 0 0 0.02 0 2234.95 0 176.626 0 0 0 808.512 0 0 1555.3 0 0 2059.92 0 0 0 0 -1176.56 0 0 0 0 0 0 -388.272 0 0 0 
0 0 0 0 0 0 0 0 -838.42 0 0 1002.46 0 0 0 0 0 0 0.09 0 0 0 0 0 0 -356.38 0 0 0 0 0 0 56.8407 0 0 0 0 0 0 0 0 0 0 2285.3 -664.769 0 0 
0 -517.518 0 1186.18 0 2432.25 0 0 0 0 0 0 0 0 0 0 0 892.895 0 0.09 0 0 0 0 0 0 0 0 0 1226.46 0 0 0 0 0 1820.35 0 0 0 0 0 0 0 0 0 0 0 
0 0 0 347.835 0 0 0 0 0 0 967.513 0 0 0 0 0 1631.44 0 0 0 0.09 0 0 0 0 1542.02 0 0 0 0 0 0 0 0 0 0 0 626.926 0 0 0 0 0 0 0 0 0 
0 0 0 0 0 0 -1169.85 0 1177.94 -1042.13 0 0 0 0 -97.5829 0 0 586.489 0 0 0 0.09 0 0 0 0 0 0 0 0 0 0 0 0 0 0 418.638 2485.2 -2400.81 0 0 0 0 1526 0 0 0 
0 1316.8 0 0 0 0 0 0 0 0 0 -2298.12 0 0 0 -1600.92 0 0 0 0 0 0 0.05 1158.71 0 0 0 -32.2733 0 0 894.116 -1888.71 1845.23 0 0 0 0 0 0 236.9 0 0 0 0 0 0 0 
0 1329.46 0 0 0 2089.22 0 2457.73 0 0 0 0 0 -2225.33 2055.35 0 0 0 0 0 0 0 -1512.12 0.04 1422.54 0 0 0 0 0 0 0 -229.118 0 0 0 0 0 0 -2037.19 0 -2222.28 0 0 0 0 0 
1156.42 0 793.1 0 0 0 0 0 0 0 0 0 0 0 0 0 1960.74 0 0 0 0 0 0 1430.63 0.09 0 36.2407 0 0 0 0 0 2323.45 0 0 0 0 0 0 0 0 459.38 0 0 0 0 0 
0 0 0 0 335.017 0 0 0 0 0 0 0 0 0 0 0 2332.45 1102.86 1761.91 0 528.809 0 0 0 0 0.03 0 0 -709.937 0 0 2220.6 0 0 0 0 0 565.889 0 0 0 0 848.338 0 0 0 0 
0 0 0 0 1550.42 0 0 0 0 0 0 1872.84 0 0 0 0 0 0 0 0 0 0 0 0 -2204.73 0 0.09 0 0 0 0 0 0 0 0 15.0304 1038.32 0 0 0 0 0 0 0 0 0 0 
0 0 0 1572.24 0 0 0 0 -1910.69 0 0 0 0 0 0 0 0 0 0 0 0 0 889.996 0 0 0 0 0.05 0 0 0 210.349 0 0 -377.743 0 0 1649.45 0 0 1839.58 0 0 186.392 0 0 0 
0 0 0 0 2303.61 -500.732 0 0 0 0 0 0 0 0 793.558 0 0 1725.9 0 0 0 0 0 0 0 -1164.05 0 0 0.07 512.94 0 0 0 0 0 0 0 0 0 0 0 0 0 0 0 0 0 
0 0 0 0 0 0 0 0 0 0 0 0 0 0 0 0 -1026.87 0 0 2196.34 0 0 0 0 0 0 0 0 276.879 0.04 0 0 1395.38 0 0 0 0 0 761.208 0 0 2003.01 0 0 0 0 0 
0 0 0 0 -1561.25 0 0 0 0 0 1659.22 0 0 0 1001.24 0 0 0 0 0 0 0 1163.75 0 0 0 0 0 0 0 0.09 0 -1753.82 0 1058.31 0 0 0 0 0 0 0 0 0 0 0 0 
0 0 0 656.377 0 0 1062.58 0 -2295.68 0 0 1463.9 -2422.48 0 0 0 0 2105.24 0 0 0 0 1343.65 0 0 -277.337 0 1907.03 0 0 0 0.05 0 0 0 0 0 0 0 0 0 0 0 -1023.82 0 0 0 
0 0 0 0 0 0 0 0 0 0 1695.99 0 0 0 0 0 0 0 -127.796 0 0 0 585.269 -268.792 2415.92 0 0 0 0 -1529.05 -878.552 0 0.02 0 0 0 0 0 0 0 0 0 0 0 0 0 0 
0 0 0 0 0 -156.484 0 0 0 0 0 0 -257.042 0 0 0 0 0 0 0 0 0 0 0 0 0 0 0 0 0 0 0 0 0.03 0 0 0 2046.04 0 361.873 0 0 0 0 0 0 0 
0 -258.873 0 0 0 0 0 0 0 0 0 0 0 0 0 0 0 0 0 0 0 0 0 0 0 0 0 1957.08 0 0 -1372.04 0 0 0 0.05 0 0 0 0 0 0 0 0 0 0 0 0 
0 1474.88 0 0 1552.71 0 0 -1430.02 0 -1256.52 0 0 1756.26 784.86 0 1407.9 0 0 0 1506.01 0 0 0 0 0 0 2473.14 0 0 0 0 0 0 0 0 0.05 -673.467 165.029 0 0 0 0 0 0 0 0 0 
0 1583.38 0 0 0 1950.36 1933.88 0 0 0 0 -360.805 0 0 0 0 -1259.27 1376.16 0 0 0 1396.15 0 0 0 0 -2172.69 0 0 0 0 0 0 0 0 1918.93 0.08 0 2086.17 0 0 0 0 0 0 0 0 
0 0 -677.892 -514.161 0 0 0 0 0 0 1990.04 0 0 0 0 0 0 0 0 0 3.43333 -1002.15 0 0 0 2324.98 0 -188.528 0 0 0 0 0 91.4792 0 602.512 0 0.01 0 0 0 0 0 0 0 0 0 
0 0 0 0 -1625.64 0 0 0 0 0 0 0 0 0 0 0 0 0 0 0 0 1589.94 0 0 0 0 0 0 0 629.215 0 0 0 0 0 0 553.529 0 0.07 -148.549 0 0 0 0 0 0 0 
2246.39 0 0 0 0 0 0 0 0 0 -618.076 -232.627 0 0 0 0 1441.62 0 0 0 0 0 1892.99 1877.88 0 0 0 0 0 0 0 0 0 574.435 0 0 0 0 -1645.33 0.03 0 0 0 0 0 0 0 
0 -1409.57 0 289.85 0 0 0 0 311.67 0 0 0 0 0 0 0 0 0 0 0 0 0 0 0 0 0 0 1728.49 0 0 0 0 0 0 0 0 0 0 0 0 0.02 0 0 0 0 0 0 
0 885.113 -138.783 1910.84 0 0 0 -458.007 0 -2398.83 0 87.3592 0 0 0 0 0 0 0 0 0 0 0 930.586 -1634.04 0 0 0 0 1913.43 0 0 0 0 0 0 0 0 0 0 0 0.02 0 0 0 0 0 
0 0 0 0 997.269 0 0 0 0 0 0 0 0 0 0 0 0 0 0 0 0 0 0 0 0 693.457 0 0 0 0 0 0 0 0 0 0 0 0 0 0 0 0 0.03 0 0 99.2615 0 
812.174 0 0 0 0 0 780.74 0 0 0 0 0 0 0 0 0 0 669.958 1149.56 0 0 181.051 0 0 0 0 0 -1047.47 0 0 0 1503.72 0 0 0 0 0 0 0 0 0 0 0 0 0 0 0 
0 0 0 0 0 0 0 0 0 0 0 0 0 0 0 0 0 0 1715.06 0 0 0 0 0 0 0 0 0 0 0 0 0 0 0 0 0 0 0 0 0 0 0 0 0 0 0 0 
0 0 0 0 0 0 0 0 0 0 0 0 0 0 0 0 0 0 0 0 0 0 0 0 0 0 0 0 0 0 0 0 0 0 0 0 0 0 0 0 0 0 394.07 0 0 0.07 0 
0 0 0 0 0 2210.38 0 0 0 0 0 0 0 0 0 0 0 0 0 0 0 0 0 0 0 0 0 0 0 0 0 0 0 0 0 0 0 0 0 0 0 0 0 0 0 0 0.03 
