*Vertices 59
*Matrix 
0.08 0 0 0 0 0 1271.17 0 0 0 0 0 0 0 0 0 -486.694 0 0 0 0 2483.67 0 0 0 0 0 0 0 0 0 0 1271.48 0 -7.24815 1576.66 0 0 0 0 0 0 0 0 0 1925.49 0 0 0 0 0 0 0 0 0 0 0 0 0 
0 0.07 0 0 0 0 184.103 0 -864.971 -109.485 0 2349.54 1630.53 0 0 0 0 0 0 0 0 0 0 0 251.396 0 0 0 0 0 0 0 0 0 0 0 0 0 2213.74 0 0 0 0 1240.96 0 0 0 0 0 0 0 0 0 0 0 0 0 0 -2431.79 
0 0 0.09 0 0 0 1462.52 0 0 0 1658.15 0 0 0 0 0 0 0 0 0 0 0 0 0 0 0 0 0 0 0 0 0 0 0 0 0 0 0 0 0 0 0 0 0 0 0 2305.29 0 0 0 0 0 0 0 0 0 0 0 0 
0 0 0 0.09 0 0 0 0 0 0 0 0 87.3592 -1968.37 0 0 0 0 0 0 0 -34.257 -1604.89 0 0 0 1791.67 0 0 0 0 0 0 0 0 0 0 0 0 0 0 -519.959 0 0 2115.62 0 268.792 0 0 0 0 0 0 0 0 0 0 0 0 
0 0 0 0 0.01 0 0 0 0 0 0 0 0 0 19.303 0 0 -1730.93 0 -336.695 0 0 0 0 0 2420.65 1896.5 0 0 0 0 0 0 0 0 0 0 0 0 315.943 0 0 -2046.8 0 0 0 0 0 0 0 0 0 0 0 0 0 0 0 0 
0 0 0 0 0 0.01 1008.41 0 0 2481.69 0 0 981.704 0 0 0 2036.73 0 -2203.97 0 0 0 0 0 0 0 -525.91 0 0 0 0 0 0 0 0 0 0 0 0 0 0 0 0 0 0 0 2043.29 0 0 0 0 0 0 0 0 0 0 0 0 
1208.15 1958.3 2215.26 0 0 1932.97 0.06 0 0 0 0 0 0 0 0 0 0 0 0 0 1408.66 0 0 0 -878.399 0 0 1546.45 0 -949.507 0 0 0 0 0 0 -187.613 0 -1331.75 0 0 -1731.39 2241.05 0 0 0 0 0 0 0 0 0 0 0 0 0 0 0 0 
0 0 0 0 0 0 0 0.01 0 0 0 0 0 0 0 0 0 0 0 0 0 0 0 0 0 0 -785.165 0 0 0 0 0 0 0 920.972 0 0 0 0 -280.084 0 0 1840.8 0 0 0 0 0 0 0 0 0 0 0 0 0 0 0 0 
0 -694.22 0 0 0 0 0 0 0.07 0 0 0 0 0 0 0 0 0 0 0 -789.59 2259.97 0 0 0 0 0 0 0 0 0 0 0 0 0 0 0 0 0 1998.43 0 0 0 0 0 0 -2173.45 0 0 0 0 0 0 0 0 0 917.31 0 0 
0 990.402 0 0 0 7.55333 0 0 0 0.07 0 0 0 0 0 0 0 0 0 0 0 0 0 1937.09 0 0 0 0 0 0 0 0 0 0 0 0 0 0 0 0 0 1751.99 0 0 0 0 0 0 2229.91 0 0 0 0 0 0 0 0 0 0 
0 0 -2067.09 0 0 0 0 0 0 0 0.03 0 0 0 0 0 0 0 0 0 0 425.352 0 0 0 0 0 0 0 2013.38 0 0 0 0 0 0 0 0 0 0 0 0 0 0 0 0 0 0 0 0 0 0 0 0 0 0 0 0 0 
0 1753.52 0 0 0 0 0 0 0 0 0 0.03 0 0 0 0 0 0 0 0 0 0 0 0 -1899.4 0 0 0 0 0 0 0 0 0 1252.71 0 0 0 0 0 2326.65 1253.17 0 0 0 0 1787.85 0 0 0 0 0 0 0 0 0 0 0 0 
0 -2457.43 0 1394.31 0 -55.1622 0 0 0 0 0 0 0.01 0 0 368.282 1321.53 0 1274.68 0 0 0 0 0 0 0 0 0 0 472.808 0 0 1856.67 0 0 0 0 0 0 0 0 0 2338.56 0 0 0 0 0 0 0 0 0 0 0 0 0 0 0 0 
0 0 0 1586.89 0 0 0 0 0 0 0 0 0 0.05 0 0 0 0 0 0 0 0 0 0 0 0 0 0 0 0 0 0 0 0 0 0 0 0 0 0 0 0 0 0 0 0 0 0 0 0 0 0 0 0 0 0 0 0 0 
0 0 0 0 -1782.82 0 0 0 0 0 0 0 0 0 0.02 0 0 0 0 0 0 0 0 0 -89.1903 0 0 0 0 0 0 0 0 -438.627 0 0 2184.59 0 1605.04 1505.86 0 0 0 0 577.334 0 0 0 0 0 0 0 0 0 0 0 0 0 0 
0 0 0 0 0 0 0 0 0 0 0 0 -2019.03 0 0 0.06 0 0 0 0 -1909.01 0 0 238.121 0 0 0 0 0 0 0 0 0 0 0 524.232 0 2399.9 0 1971.27 238.273 2207.94 0 0 0 1051.13 0 0 0 0 0 0 0 0 0 -1815.47 0 0 0 
-165.181 0 0 0 0 1654.94 0 0 0 0 0 0 -346.004 0 0 0 0 181.661 0 0 0 0 0 0 0 0 0 0 0 0 853.374 0 0 0 0 0 0 0 0 0 0 2335.66 0 0 0 0 0 0 0 -89.0378 0 0 0 0 0 0 0 0 0 
0 0 0 0 69.6585 0 0 0 0 0 0 0 0 0 0 0 155.568 0.09 0 1846.6 0 0 0 -2383.42 0 0 0 0 0 0 -70.4215 0 0 0 0 2366.48 0 0 0 0 0 0 666.295 0 1882.61 0 0 0 0 0 0 0 0 0 0 0 0 0 0 
0 0 0 0 0 -1280.94 0 0 0 0 0 0 -242.698 0 0 0 0 0 0.09 2114.09 0 0 0 0 0 0 0 647.069 1979.81 0 0 0 0 0 0 0 0 0 0 2255.85 0 0 0 0 0 0 0 0 0 0 0 0 0 0 0 0 0 0 0 
0 0 0 0 -331.66 0 0 0 0 0 0 0 0 0 0 0 0 1939.38 2146.6 0.09 0 0 0 0 0 0 0 0 0 0 2288.05 0 0 33.7992 0 0 0 0 0 2455.29 0 -1842.33 0 1558.2 0 0 0 0 0 0 0 0 0 0 0 0 0 0 0 
0 0 0 0 0 0 -449.614 0 1676.31 0 0 0 0 0 0 1795.18 0 0 0 0 0 0 0 0 -1664.71 0 -2038.41 0 0 0 0 0 0 0 0 0 0 0 0 0 2453 0 0 0 94.6837 0 0 0 0 0 0 0 0 0 0 0 0 0 0 
977.889 0 0 -710.852 0 0 0 0 -1199 0 381.252 0 0 0 0 0 0 0 0 0 0 0 0 969.649 0 0 0 0 0 1908.09 0 0 0 0 0 0 0 0 0 0 0 0 0 0 0 1137.81 0 0 0 0 0 0 0 0 0 0 0 0 0 
0 0 0 1370.36 0 0 0 0 0 0 0 0 0 0 0 0 0 0 0 0 0 0 0.05 1770.3 0 0 0 0 0 179.678 0 0 2119.59 0 0 0 0 0 2341.61 0 0 0 0 0 0 0 0 -514.313 0 0 0 0 0 0 0 0 0 0 0 
0 0 0 0 0 0 0 0 0 605.258 0 0 0 0 0 1968.98 0 -364.62 0 0 0 -1521.12 1850.72 0.04 0 0 -2189.47 0 0 0 1227.38 0 0 0 -440.611 0 0 0 0 0 0 1068.83 1781.59 0 0 0 0 0 0 0 0 0 0 0 0 0 0 0 0 
0 -709.021 0 0 0 0 -827.738 0 0 0 0 1755.5 0 0 1301.23 0 0 0 0 0 2205.19 0 0 0 0.08 0 0 658.208 0 -579.928 0 0 0 0 0 0 0 0 0 0 0 0 0 0 0 0 0 0 0 0 0 0 0 0 0 0 0 0 0 
0 0 0 0 -481.353 0 0 0 0 0 0 0 0 0 0 0 0 0 0 0 0 0 0 0 0 0.06 -215.842 0 2416.99 0 0 0 0 0 0 0 0 2298.27 0 0 0 0 0 0 0 0 0 0 0 0 0 0 0 0 0 0 0 667.821 0 
0 0 0 -1382.26 1627.32 70.1163 0 -690.863 0 0 0 0 0 0 0 0 0 0 0 0 1375.55 0 0 -649.968 0 -526.215 0.02 2457.27 0 0 2421.41 0 0 0 0 0 2176.81 0 0 1355.4 0 0 0 0 0 0 0 0 0 0 0 0 0 0 0 0 0 0 0 
0 0 0 0 0 0 1808.76 0 0 0 0 0 0 0 0 0 0 0 -1685.92 0 0 0 0 0 -1981.64 0 914.411 0.04 1150.01 0 0 0 0 0 0 1693.7 1594.36 0 0 0 0 0 0 0 0 0 1427.43 0 0 0 0 0 0 0 0 0 0 0 0 
0 0 0 0 0 0 0 0 0 0 0 0 0 0 0 0 0 0 828.959 0 0 0 0 0 0 -200.278 0 1263.85 0.04 0 0 0 0 0 1080.28 0 0 0 0 0 0 0 0 0 0 0 0 0 0 0 0 0 0 0 2285.15 0 0 0 0 
0 0 0 0 0 0 644.017 0 0 0 -1137.5 0 1199.91 0 0 0 0 0 0 0 0 1369.9 1256.37 0 1884.9 0 0 0 0 0.06 0 152.211 448.851 0 0 0 0 -1572.24 0 0 0 0 0 0 0 0 0 0 0 0 0 0 0 0 0 0 0 0 0 
0 0 0 0 0 0 0 0 0 0 0 0 0 0 0 0 1850.26 -1340.75 0 -339.29 0 0 0 362.178 0 0 1616.95 0 0 0 0 0 0 0 582.369 0 2331.69 -2384.79 0 0 0 0 0 1468.63 -817.362 0 -533.082 0 0 0 0 0 0 0 0 0 0 0 0 
0 0 0 0 0 0 0 0 0 0 0 0 0 0 0 0 0 0 0 0 0 0 0 0 0 0 0 0 0 1565.98 0 0.08 0 0 0 0 0 2245.32 0 0 0 -1959.67 0 0 0 0 0 0 0 0 0 0 0 -1923.51 0 0 0 0 0 
2062.06 0 0 0 0 0 0 0 0 0 0 0 1447.42 0 0 0 0 0 0 0 0 0 1766.95 0 0 0 0 0 0 2328.33 0 0 0.04 0 0 -2094.56 0 -564.211 -1689.73 0 0 0 0 0 0 0 0 0 0 0 0 0 0 0 0 0 0 0 0 
0 0 0 0 0 0 0 0 0 0 0 0 0 0 -2408.29 0 0 0 0 -1885.66 0 0 0 0 0 0 0 0 0 0 0 0 0 0 0 0 2429.35 0 0 2114.86 0 2137.75 0 0 0 0 0 0 0 0 0 0 0 0 0 0 0 0 0 
926.923 0 0 0 0 0 0 1126.82 0 0 0 612.125 0 0 0 0 0 0 0 0 0 0 0 310.45 0 0 0 0 -645.39 0 -1394.92 0 0 0 0.01 0 0 1304.59 0 0 0 0 0 0 0 2427.98 0 0 0 0 0 -814.31 0 0 0 0 0 0 0 
-372.402 0 0 0 0 0 0 0 0 0 0 0 0 0 0 2336.73 0 -2145.07 0 0 0 0 0 0 0 0 0 722.755 0 0 0 0 -1219.9 0 0 0 1862.62 1768.01 0 0 0 0 0 897.32 0 0 0 0 0 0 0 0 2188.56 0 0 0 0 0 0 
0 0 0 0 0 0 -198.447 0 0 0 0 0 0 0 -97.7355 0 0 0 0 0 0 0 0 0 0 0 1681.8 -1108.36 0 0 1328.55 0 0 -1012.83 0 2363.43 0.07 0 0 0 1630.07 0 0 0 0 0 0 0 0 0 0 0 0 0 0 0 0 0 0 
0 0 0 0 0 0 0 0 0 0 0 0 0 0 0 813.089 0 0 0 0 0 0 0 0 0 1770.46 0 0 0 -717.414 1032.36 -1101.95 726.112 0 1365.02 2375.18 0 0.09 0 0 0 0 -2277.21 0 0 0 0 0 0 0 0 0 0 0 0 0 0 0 0 
0 1529.82 0 0 0 0 627.079 0 0 0 0 0 0 0 990.402 0 0 0 0 0 0 0 99.8718 0 0 0 0 0 0 0 0 0 403.378 0 0 0 0 0 0.05 0 0 -2225.94 0 -545.289 0 445.952 0 0 0 0 0 0 0 0 0 0 0 0 0 
0 0 0 0 1160.7 0 0 425.199 244.224 0 0 0 0 0 2275.23 12.1311 0 0 -1858.81 -2129.35 0 0 0 0 0 0 989.944 0 0 0 0 0 0 2486.27 0 0 0 0 0 0.01 0 0 0 0 0 0 0 0 0 0 -2044.05 0 0 0 0 0 0 0 0 
0 0 0 0 0 0 0 0 0 0 0 1369.29 0 0 0 1352.66 0 0 0 0 -1188.31 0 0 0 0 0 0 0 0 0 0 0 0 0 0 0 2402.04 0 0 0 0 0 0 0 -2247.46 0 0 0 0 0 0 0 0 0 0 0 0 0 0 
0 0 0 905.866 0 0 108.875 0 0 2354.88 0 1951.12 0 0 0 255.364 -2057.18 0 0 -104.45 0 0 0 -383.084 0 0 0 0 0 0 0 1950.06 0 -734.046 0 0 0 0 271.081 0 0 0.07 0 0 1138.26 0 0 0 0 0 0 0 0 0 0 0 0 0 0 
0 0 0 0 1554.38 0 2083.42 -2307.43 0 0 0 0 -1426.51 0 0 0 0 -1240.04 0 0 0 0 0 1501.59 0 0 0 0 0 0 0 0 0 0 0 0 0 529.725 0 0 0 0 0.09 0 0 0 0 0 0 0 0 0 0 0 0 0 0 0 0 
0 1352.66 0 0 0 0 0 0 0 0 0 0 0 0 0 0 0 0 0 233.695 0 0 0 0 0 0 0 0 0 0 1639.07 0 0 0 0 -359.127 0 0 1382.72 0 0 0 0 0.08 0 0 0 0 0 0 0 0 0 0 0 0 0 0 0 
0 0 0 987.35 0 0 0 0 0 0 0 0 0 0 2192.53 0 0 2492.37 0 0 2079.15 0 0 0 0 0 0 0 0 0 1162.53 0 0 0 0 0 0 0 0 0 -2266.53 836.741 0 0 0.09 0 -2159.57 0 0 0 0 0 0 0 0 0 0 0 0 
541.322 0 0 0 0 0 0 0 0 0 0 0 0 0 0 2498.32 0 0 0 0 0 1695.68 0 0 0 0 0 0 0 0 0 0 0 0 1544.47 0 0 0 -1012.53 0 0 0 0 0 0 0.02 1906.72 0 0 0 0 0 0 0 0 0 0 0 0 
0 0 736.488 244.682 0 2142.93 0 0 1528.9 0 0 441.069 0 0 0 0 0 0 0 0 0 0 0 0 0 0 0 -168.538 0 0 -453.429 0 0 0 0 0 0 0 0 0 0 0 0 0 94.0733 -737.251 0.01 0 0 0 0 0 0 0 0 0 0 0 0 
0 0 0 0 0 0 0 0 0 0 0 0 0 0 0 0 0 0 0 0 0 0 1675.54 0 0 0 0 0 0 0 0 0 0 0 0 0 0 0 0 0 0 0 0 0 0 0 0 0.06 0 0 0 0 0 0 0 0 0 0 0 
0 0 0 0 0 0 0 0 0 2275.99 0 0 0 0 0 0 0 0 0 0 0 0 0 0 0 0 0 0 0 0 0 0 0 0 0 0 0 0 0 0 0 0 0 0 0 0 0 0 0.07 0 0 0 0 0 0 0 0 0 0 
0 0 0 0 0 0 0 0 0 0 0 0 0 0 0 0 533.54 0 0 0 0 0 0 0 0 0 0 0 0 0 0 0 0 0 0 0 0 0 0 0 0 0 0 0 0 0 0 0 0 0.03 0 0 0 0 0 0 0 0 0 
0 0 0 0 0 0 0 0 0 0 0 0 0 0 0 0 0 0 0 0 0 0 0 0 0 0 0 0 0 0 0 0 0 0 0 0 0 0 0 1137.04 0 0 0 0 0 0 0 0 0 0 0.03 0 0 0 0 0 0 0 0 
0 0 0 0 0 0 0 0 0 0 0 0 0 0 0 0 0 0 0 0 0 0 0 0 0 0 0 0 0 0 0 0 0 0 2033.37 0 0 0 0 0 0 0 0 0 0 0 0 0 0 0 0 0 0 0 0 0 0 0 0 
0 0 0 0 0 0 0 0 0 0 0 0 0 0 0 0 0 0 0 0 0 0 0 0 0 0 0 0 0 0 0 0 0 0 0 2068.77 0 0 0 0 0 0 0 0 0 0 0 0 0 0 0 0 0 0 0 0 0 0 0 
0 0 0 0 0 0 0 0 0 0 0 0 0 0 0 0 0 0 0 0 0 0 0 0 0 0 0 0 0 0 0 2128.59 0 0 0 0 0 0 0 0 0 0 0 0 0 0 0 0 0 0 0 0 0 0.03 0 0 0 0 0 
0 0 0 0 0 0 0 0 0 0 0 0 0 0 0 0 0 0 0 0 0 0 0 0 0 0 0 0 603.732 0 0 0 0 0 0 0 0 0 0 0 0 0 0 0 0 0 0 0 0 0 0 0 0 0 0.07 0 0 0 0 
0 0 0 0 0 0 0 0 0 0 0 0 0 0 0 1094.47 0 0 0 0 0 0 0 0 0 0 0 0 0 0 0 0 0 0 0 0 0 0 0 0 0 0 0 0 0 0 0 0 0 0 0 0 0 0 0 0.07 0 0 0 
0 0 0 0 0 0 0 0 896.405 0 0 0 0 0 0 0 0 0 0 0 0 0 0 0 0 0 0 0 0 0 0 0 0 0 0 0 0 0 0 0 0 0 0 0 0 0 0 0 0 0 0 0 0 0 0 0 0.02 0 0 
0 0 0 0 0 0 0 0 0 0 0 0 0 0 0 0 0 0 0 0 0 0 0 0 0 562.075 0 0 0 0 0 0 0 0 0 0 0 0 0 0 0 0 0 0 0 0 0 0 0 0 0 0 0 0 0 0 0 0.09 0 
0 868.328 0 0 0 0 0 0 0 0 0 0 0 0 0 0 0 0 0 0 0 0 0 0 0 0 0 0 0 0 0 0 0 0 0 0 0 0 0 0 0 0 0 0 0 0 0 0 0 0 0 0 0 0 0 0 0 0 0.07 
