*Vertices 50
*Matrix 
0.03 1999.95 2144.46 -978.347 0 0 0 -866.192 0 -329.066 0 0 0 -377.59 0 0 0 -90.8689 0 0 0 0 0 0 0 0 1946.39 -448.393 0 0 0 0 2185.05 0 723.365 2181.84 0 0 0 0 0 0 0 0 0 -355.312 2000.41 0 0 0 
700.476 0.02 241.02 0 0 1615.88 0 0 2082.05 -1661.5 697.119 0 0 0 0 -453.276 0 0 2069.38 -2237.85 -491.119 0 -1363.49 0 164.724 0 0 -1343.81 0 -81.7133 2115.16 0 -156.789 -1245.23 0 2168.11 0 0 0 0 0 0 1596.65 0 0 0 0 0 0 0 
2031.85 -1297.57 0.03 0 1995.53 0 1067.16 1592.68 0 0 -281.457 -938.826 0 0 0 0 2183.37 0 0 0 0 0 -634.098 0 0 0 1170.77 0 792.642 71.1844 0 1146.05 0 0 -1445.89 0 -2388.15 -1034.04 0 0 0 0 1820.51 0 0 0 0 0 0 0 
1161.31 0 0 0.04 -1164.82 247.887 0 2275.69 0 0 0 0 0 0 0 0 0 0 0 0 0 0 0 0 0 0 0 1213.95 2093.49 2498.02 0 -2339.17 0 0 0 0 0 0 0 0 0 0 0 0 0 0 0 0 0 0 
0 0 2139.58 1342.43 0.09 0 1855.14 0 0 0 -2346.19 0 0 -2392.27 0 0 0 0 0 0 944.929 0 0 0 0 0 0 0 0 0 0 620.212 -384.61 0 0 2368.01 0 0 0 0 0 0 0 0 0 0 0 0 0 0 
0 80.1874 0 188.376 0 0.04 0 0 0 0 -180.135 0 0 0 0 0 1858.81 0 0 0 0 -398.648 0 0 1624.27 2443.24 0 0 -1000.02 0 1254.08 0 0 134.816 738.624 0 -1191.21 0 0 0 0 0 0 -347.53 0 0 0 -2239.83 0 0 
0 0 10.3 0 617.466 0 0.01 1737.34 1555.45 0 1271.48 0 0 0 0 -305.109 618.686 0 0 1297.57 0 0 0 0 0 0 1575.59 0 -2498.02 0 0 0 0 -669.652 0 0 0 0 0 0 0 0 1585.67 0 0 0 0 0 0 0 
-756.172 0 2479.86 -748.695 0 0 -793.71 0.03 0 121.235 0 0 0 0 0 0 944.777 0 0 -2498.02 0 0 0 984.298 0 0 1696.14 0 0 0 0 506.989 0 0 182.73 0 0 -1017.11 0 0 0 1337.09 0 0 0 0 0 0 0 319.147 
0 1439.33 0 0 0 0 783.334 0 0.02 0 0 -1107.14 0 0 0 1595.58 0 0 0 443.358 0 0 0 2322.53 0 -2450.87 0 0 1971.72 0 0 0 0 0 0 0 0 0 0 0 0 121.998 0 0 0 0 0 -1268.58 0 0 
-69.8111 1391.72 0 0 0 0 0 -830.638 0 0.05 0 0 0 0 0 0 216.91 0 -215.69 0 0 0 0 0 0 0 0 221.335 0 452.971 1535 0 188.681 0 0 0 511.414 0 0 0 0 0 0 0 0 0 0 0 0 0 
0 -221.335 -505.005 0 797.372 -1553.93 1914.35 0 0 0 0.02 0 0 0 0 0 1646.24 1223.72 0 0 0 0 865.581 0 0 0 0 2206.56 0 0 0 0 0 0 0 0 0 0 0 0 0 0 1199.3 0 0 0 0 0 0 0 
0 0 -899.915 0 0 0 0 0 -893.963 0 0 0.05 1405.61 2455.75 0 0 -968.734 0 0 0 2170.55 0 0 0 2217.25 0 0 0 0 2261.35 0 0 0 0 0 0 0 0 0 0 0 0 0 0 0 0 1213.34 0 1403.93 0 
0 0 0 0 0 0 0 0 0 0 0 564.211 0.09 0 0 0 0 312.738 0 0 0 0 0 -641.881 0 1437.19 -950.117 0 0 0 0 1952.35 0 0 0 0 0 0 0 0 0 963.24 0 591.678 1223.56 0 0 0 0 0 
1368.53 0 0 0 -1107.75 0 0 0 0 0 0 2236.17 0 0.01 0 0 0 0 0 0 0 0 862.835 0 0 2444 0 0 0 0 0 0 0 0 0 0 -2388 0 0 0 0 0 0 0 607.089 0 1232.11 0 0 0 
0 0 0 0 0 0 0 0 0 0 0 0 0 0 0 0 0 1974.93 0 0 0 0 -1404.69 0 0 0 944.777 1587.95 0 0 0 0 0 1298.94 0 0 0 0 -1673.41 0 0 0 0 0 0 0 0 0 0 0 
0 1723.15 0 0 0 0 1578.65 0 770.058 0 0 0 0 0 0 0.07 0 0 0 0 0 0 0 432.676 0 0 0 0 1217.61 0 -2178.33 0 0 143.208 1596.35 0 0 0 567.415 0 0 0 0 0 0 0 0 0 0 0 
0 0 -425.047 0 0 2048.17 -1759.93 -1508.45 0 -2452.39 1380.89 942.488 0 0 0 0 0.06 1747.72 0 1863.08 0 0 0 0 1037.4 0 1371.12 0 0 2375.03 0 1704.69 0 0 0 1069.14 -827.586 0 0 0 0 0 0 0 0 0 0 0 0 0 
-1641.21 0 0 0 0 0 0 0 0 0 1552.1 0 443.815 0 2100.21 0 1138.57 0.03 -1417.36 0 537.66 0 0 0 0 0 0 649.358 0 0 0 0 0 1975.08 0 -650.273 0 0 0 0 0 0 0 0 0 0 0 0 0 0 
0 -227.744 0 0 0 0 0 0 0 93.3103 0 0 0 0 0 0 0 113.91 0.01 0 0 526.215 0 0 0 0 0 0 0 0 0 0 394.986 923.261 0 2303.77 2272.64 -812.937 -1330.68 0 236.137 0 0 0 0 0 0 -1529.05 0 0 
0 405.82 0 0 0 0 666.448 -451.14 1618.02 0 0 0 0 0 0 0 -1588.87 0 0 0.04 -274.438 0 -337.764 7.40074 0 343.104 2406 0 0 0 0 0 0 0 0 825.297 0 0 0 0 0 -780.587 0 0 0 -108.264 0 0 0 0 
0 2070.15 0 0 1891.77 0 0 0 0 0 0 -1804.33 0 0 0 0 0 103.839 0 -92.5474 0 188.681 0 0 0 0 2106.31 0 0 1537.14 0 0 553.682 0 -1123.92 0 0 0 0 0 0 0 0 2198.48 0 0 0 -464.721 259.178 0 
0 0 0 0 0 1630.99 0 0 0 0 0 0 0 0 0 0 0 0 2364.19 0 471.587 0.06 0 0 0 -483.489 0 0 -1920.61 0 1880.47 0 0 0 0 1618.17 0 0 0 0 0 0 0 0 0 0 0 0 0 0 
0 -955.458 -2356.11 0 0 0 0 0 0 0 -533.387 0 0 2319.33 607.547 0 0 0 0 -705.817 0 0 0.01 1687.14 1047.78 0 0 0 0 1009.78 1802.04 0 -181.967 0 2076.56 2362.82 -408.567 0 0 -203.635 0 0 0 0 0 0 0 0 0 0 
0 0 0 0 0 0 0 -360.958 2246.24 0 0 0 2345.73 0 0 1440.4 0 0 0 -1967.76 0 0 2136.37 0.07 0 0 0 0 0 0 0 0 -1022.9 0 0 1103.32 0 0 0 -897.32 0 0 0 0 0 0 0 0 0 472.198 
0 1194.27 0 0 0 -521.027 0 0 0 0 0 845.439 0 0 0 0 2239.83 0 0 0 0 0 -837.046 0 0.07 0 0 0 0 0 -662.633 -793.252 0 0 0 0 0 0 1283.38 0 0 0 -1394.16 0 0 0 0 0 0 532.777 
0 0 0 0 0 1886.12 0 0 1807.99 0 0 0 2411.04 -2191.61 0 0 0 0 0 1959.21 0 1092.94 0 0 0 0.05 0 0 -2362.51 0 0 0 0 0 0 0 0 0 0 0 0 -1714.15 0 0 0 -1484.8 0 0 0 0 
2009.11 0 1462.68 0 0 0 2440.79 961.867 0 0 0 0 -814.615 0 -2163.69 0 -1741.77 0 0 2244.25 413.449 0 0 0 0 0 0.05 0 2098.53 0 475.249 0 0 0 0 0 0 0 0 -1578.95 0 0 0 0 0 0 0 0 0 1451.38 
594.729 794.473 0 -715.125 0 0 0 0 0 1441.31 741.371 0 0 0 1566.44 0 0 -144.887 0 0 0 0 0 0 0 0 0 0.06 1502.66 -1104.39 0 0 -714.057 0 2160.18 0 0 0 0 0 0 0 0 0 0 0 1927.17 0 -859.478 0 
0 0 -1671.88 1046.71 0 -216.147 1038.62 0 1478.55 0 0 0 0 0 0 2209.01 0 0 0 0 0 -1484.65 0 0 0 2104.63 1003.52 1935.71 0.07 0 0 0 0 -2218.16 0 0 0 0 0 0 322.047 -125.355 0 0 2461.39 0 0 0 0 0 
0 923.261 1191.67 2407.68 0 0 0 0 0 -662.633 0 -1840.95 0 0 0 0 275.811 0 0 0 -1575.9 0 -1613.44 0 0 0 0 -524.842 0 0.09 2027.42 0 0 1811.66 0 0 0 0 0 0 0 0 0 0 0 0 0 0 0 0 
0 1361.96 0 0 0 2346.19 0 0 0 1211.66 0 0 0 0 0 -446.257 0 0 0 0 0 -605.106 1635.87 0 -1441.47 0 -671.331 0 0 481.048 0.04 0 0 1656.16 1006.73 0 -847.118 0 534.455 0 0 0 0 288.934 0 0 0 0 -427.03 0 
0 0 -1433.68 2045.27 941.725 0 0 786.996 0 0 0 0 -1090.2 0 0 0 -629.826 0 0 0 0 0 0 0 1504.18 0 0 0 0 0 0 0.06 0 0 -774.331 0 0 0 0 0 0 0 0 0 0 0 0 0 0 0 
-862.682 656.224 0 0 939.283 0 0 0 0 514.466 0 0 0 0 0 0 0 0 -1968.67 0 -1101.64 0 1538.21 2166.13 0 0 0 16.5563 0 0 0 0 0.06 0 0 0 0 0 0 0 72.5578 0 0 0 0 0 0 0 0 0 
0 -2249.14 0 0 0 1583.99 2327.88 0 0 0 0 0 0 0 1484.5 2375.33 0 -2068.01 -633.946 0 0 0 0 0 0 0 0 0 -1001.24 1623.81 1070.97 0 0 0 69.8111 0 0 0 0 0 0 0 0 1986.22 0 0 0 0 0 0 
175.253 0 1365.02 0 0 -2198.02 0 644.322 0 0 0 0 0 0 0 1934.34 0 0 0 0 446.104 0 -926.923 0 0 0 0 -1163.29 0 0 2322.99 2390.59 0 254.143 0.04 0 -1706.82 -1703.92 0 0 0 0 0 0 2322.23 771.126 0 0 0 0 
1572.24 957.137 0 0 1896.34 0 0 0 0 0 0 0 0 0 0 0 -1534.09 2043.9 -2212.97 613.804 0 1430.63 -1716.13 1051.9 0 0 0 0 0 0 0 0 0 0 0 0.06 0 0 0 0 0 0 0 0 0 0 0 1947.92 0 0 
0 0 746.864 0 0 383.694 0 0 0 564.974 0 0 0 284.509 0 0 -1049.15 0 545.747 0 0 0 906.018 0 0 0 0 0 0 0 1837.14 0 0 0 712.683 0 0.03 0 0 0 0 0 0 0 0 0 0 0 0 0 
0 0 2049.09 0 0 0 0 -1557.89 0 0 0 0 0 0 0 0 0 0 1596.04 0 0 0 0 0 0 0 0 0 0 0 0 0 0 0 1682.41 0 0 0.07 1286.58 -2144.31 1662.72 0 0 0 0 0 0 0 0 0 
0 0 0 0 0 0 0 0 0 0 0 0 0 0 1067.77 325.861 0 0 2309.87 0 0 0 0 0 -1625.49 0 0 0 0 0 -565.889 0 0 0 0 0 0 2204.43 0.01 0 0 0 0 0 -1869.64 0 0 0 0 0 
0 0 0 0 0 0 0 0 0 0 0 0 0 0 0 0 0 0 0 0 0 0 1829.05 -2040.54 0 0 -461.516 0 0 0 0 0 0 0 0 0 0 2300.26 0 0.06 1053.58 0 -1504.64 0 0 0 0 0 561.617 0 
0 0 0 0 0 0 0 0 0 0 0 0 0 0 0 0 0 0 778.298 0 0 0 0 0 0 0 0 0 -1995.83 0 0 0 -247.734 0 0 0 0 1427.43 0 1393.86 0.09 0 0 0 0 0 0 0 0 0 
0 0 0 0 0 0 0 811.716 2104.94 0 0 0 -2253.87 0 0 0 0 0 0 1005.97 0 0 0 0 0 2460.17 0 0 -1820.66 0 0 0 0 0 0 0 0 0 0 0 0 0.02 0 0 -2035.51 0 0 0 0 2410.73 
0 301.447 455.565 0 0 0 -307.55 0 0 0 2026.66 0 0 0 0 0 0 0 0 0 0 0 0 0 -566.195 0 0 0 0 0 0 0 0 0 0 0 0 0 0 1808.6 0 0 0.06 0 0 0 0 0 0 0 
0 0 0 0 0 1802.19 0 0 0 0 0 0 1425.75 0 0 0 0 0 0 0 752.358 0 0 0 0 0 0 0 0 0 1523.71 0 0 2008.5 0 0 0 0 0 0 0 0 0 0 -613.651 421.842 0 0 0 0 
0 0 0 0 0 0 0 0 0 0 0 0 -400.021 1130.18 0 0 0 0 0 0 0 0 0 0 0 0 0 0 1168.48 0 0 0 0 0 -2068.01 0 0 0 696.051 0 0 -1606.42 0 2110.43 0.02 0 0 0 0 0 
-2062.97 0 0 0 0 0 0 0 0 0 0 0 0 0 0 0 0 0 0 514.161 0 0 0 0 0 2144 0 0 0 0 0 0 0 0 507.752 0 0 0 0 0 0 0 0 2132.4 0 0.02 -707.19 0 0 0 
835.215 0 0 0 0 0 0 0 0 0 0 1266.44 0 226.829 0 0 0 0 0 0 0 0 0 0 0 0 0 1647.62 0 0 0 0 0 0 0 0 0 0 0 0 0 0 0 0 0 980.331 0.04 0 1435.06 0 
0 0 0 0 0 -894.116 0 0 1061.51 0 0 0 0 0 0 0 0 0 -1081.35 0 2468.87 0 0 0 0 0 0 0 0 0 0 0 0 0 0 403.836 0 0 0 0 0 0 0 0 0 0 0 0.05 0 0 
0 0 0 0 0 0 0 0 0 0 0 1522.03 0 0 0 0 0 0 0 0 -1911.15 0 0 0 0 0 0 1388.36 0 0 1503.27 0 0 0 0 0 0 0 0 -1185.57 0 0 0 0 0 0 -1290.4 0 0.05 0 
0 0 0 0 0 0 0 2386.62 0 0 0 0 0 0 0 0 0 0 0 0 0 0 0 -72.1 -46.7696 0 449.919 0 0 0 0 0 0 0 0 0 0 0 0 0 0 315.79 0 0 0 0 0 0 0 0.01 
