*Vertices 61
*Matrix 
0.07 -2486.88 0 0 0 -656.377 0 0 0 0 0 0 0 0 2080.83 0 0 0 0 0 -12.5889 0 0 0 0 1967.6 0 0 0 1719.79 0 41.2763 1136.28 0 0 0 0 0 0 0 -1138.11 0 0 0 -1332.21 0 0 1595.74 -294.427 -991.623 0 0 981.094 0 -360.805 0 0 0 1205.71 0 0 
-2068.01 0.09 883.74 0 0 0 0 0 -1488.31 0 -2180.01 0 -206.839 -338.374 0 0 2450.56 0 0 0 0 0 0 0 0 0 0 0 0 0 0 0 0 0 -962.477 773.415 0 0 0 -983.84 1810.43 0 0 0 0 0 0 0 0 0 0 0 0 0 0 0 2097.16 0 0 2052.6 1198.84 
0 -359.432 0.01 11.063 0 0 0 0 1135.21 0 1142.99 0 0 0 0 0 -1523.26 0 0 0 -248.802 0 0 0 0 -2311.09 0 0 0 0 0 0 -795.083 0 0 0 0 0 0 0 1424.53 -340.968 299.615 0 0 0 0 0 0 2344.81 0 0 0 0 0 678.808 0 0 0 0 -809.58 
0 0 2181.84 0.01 -99.5666 656.987 0 1854.53 0 463.958 0 0 0 0 0 0 0 0 -2115.31 0 0 0 0 0 0 0 0 0 0 0 0 0 0 0 0 631.352 0 0 0 0 0 0 0 0 0 0 0 0 -1408.51 -2097.46 0 0 0 0 0 0 0 0 0 945.845 219.352 
0 0 0 984.756 0.06 0 0 0 462.432 2131.18 0 -2293.85 18.3874 0 0 1266.9 0 0 1491.97 2297.51 0 0 0 0 0 0 2482.76 0 0 0 2410.89 -491.119 0 0 0 0 -1570.56 453.124 0 0 -407.651 0 0 0 0 0 0 -1035.42 0 -455.565 0 0 0 -271.386 0 1452.91 902.051 0 0 0 -1916.94 
-9.68963 0 0 -1172.14 0 0.03 0 0 0 1165.27 0 656.072 0 1410.49 0 0 -2320.09 0 608.921 0 0 0 -1173.67 0 0 0 0 0 847.423 0 0 0 1771.68 0 0 0 0 0 0 0 2294.31 2159.87 0 -1365.32 2010.64 0 0 833.995 0 0 0 0 -1917.1 0 -136.952 55.0096 -973.769 2381.89 -1158.71 0 -1146.05 
0 0 0 0 0 0 0.06 0 0 0 0 0 0 0 0 0 0 0 0 -241.935 1453.52 0 -2125.84 0 0 2127.06 0 1931.9 0 0 1500.06 0 0 1044.27 2293.39 0 0 0 -763.039 0 0 0 0 0 0 0 0 0 0 0 1197.78 0 0 0 -77.4407 0 0 0 0 -1676.15 0 
0 0 0 -2483.21 0 0 0 0.09 0 699.561 0 2376.55 0 -2312.16 0 2464.9 0 103.076 -1399.35 0 0 0 0 16.5563 0 116.504 0 0 0 0 0 -416.807 0 0 0 0 0 2354.43 0 0 665.685 0 0 -2224.88 0 0 0 243.461 282.525 1688.06 0 0 -416.959 0 0 0 196.463 0 0 0 0 
0 -175.1 501.343 0 742.897 0 0 0 0.07 1919.54 1796.09 0 0 1544.92 0 0 1618.63 1947.92 1888.56 0 0 0 0 0 0 0 570.772 0 732.368 899.609 0 0 -1447.42 812.632 0 0 0 2476.2 0 0 0 0 0 0 0 0 -585.421 0 0 0 2491.45 0 0 1796.7 962.935 0 0 0 0 0 0 
0 0 0 -968.276 1986.53 1378.6 0 -1237.75 -38.0718 0.04 0 0 0 0 -898.541 -518.738 0 0 0 0 0 0 0 0 0 824.229 1553.32 -1159.17 1338.31 614.872 0 0 1755.2 2442.17 0 2436.83 0 2494.35 0 0 0 0 0 530.793 0 0 0 0 -2090.59 0 -440.306 0 0 0 0 1002.3 0 1795.18 1926.86 301.752 0 
0 -291.986 269.707 0 0 0 0 0 2119.13 0 0.05 0 0 0 0 0 0 0 0 0 781.045 0 0 0 2110.43 0 0 0 0 0 0 0 0 0 0 0 0 0 0 0 0 0 0 0 0 0 0 0 0 0 -380.49 0 0 0 58.2141 -562.227 0 0 0 0 0 
0 0 0 0 198.294 -2090.75 0 2276.15 0 0 0 0.08 1303.83 0 0 953.932 1875.44 -901.593 -2230.98 0 0 1935.1 0 0 0 0 0 0 -216.91 0 0 -1314.66 0 0 -282.22 0 0 0 2116.99 0 1305.66 0 0 0 0 -1657.69 0 0 0 424.741 0 0 0 0 0 0 0 -1231.96 1626.26 0 0 
0 -1482.67 0 0 -1227.68 0 0 0 0 0 0 322.352 0.01 1626.41 0 0 0 0 -18.9978 0 425.352 0 -186.697 860.546 1536.99 0 0 0 -793.863 288.018 0 -658.818 0 0 0 0 0 0 1896.65 861.919 0 0 0 1423.46 -1469.7 0 1457.03 0 0 282.983 0 0 0 0 2350.61 0 0 0 0 0 -1943.65 
0 1524.93 0 0 0 -139.851 0 -649.815 2051.84 0 0 0 395.749 0.09 -462.889 0 0 0 2133.17 -1790.29 0 0 0 1048.23 0 0 0 0 0 1702.86 0 0 -1484.19 0 0 0 0 0 1500.98 0 -1892.22 0 0 0 0 1478.09 -1897.56 -1540.04 0 0 0 0 0 0 0 0 0 0 0 1440.55 1075.85 
1979.35 0 0 0 0 0 0 0 0 2225.64 0 0 0 -1724.22 0.01 317.927 0 689.642 0 0 515.534 0 0 1069.44 -571.535 -2401.88 1566.29 684.759 0 1818.52 -2336.27 0 0 0 0 0 1049.46 0 0 0 -1777.47 0 0 0 0 0 0 0 0 0 2220.45 0 1932.97 0 177.084 0 -445.647 0 0 0 1362.88 
0 0 0 0 513.703 0 0 2094.87 0 1064.71 0 -952.559 0 0 505.158 0.02 0 0 -2091.36 0 0 0 0 0 -2341.3 0 0 0 0 0 1873 -1645.02 0 0 -492.492 2375.03 0 1453.06 2380.67 -1917.1 0 0 0 0 0 0 0 -262.993 2116.38 0 1444.36 0 697.729 -168.386 1503.27 0 0 0 0 680.029 -564.058 
0 -454.955 912.885 0 0 1488.77 0 0 16.0985 0 0 -624.79 0 0 0 0 0.09 0 0 0 0 0 0 0 0 0 0 0 1064.26 0 0 0 0 0 1543.86 0 0 0 0 0 0 0 1331.9 0 2377.93 -929.823 0 850.932 0 2417.75 0 0 0 -489.441 1054.8 2331.23 0 0 0 0 1737.49 
0 0 0 0 0 0 0 2039.93 -971.48 0 0 -449.004 0 0 -695.441 0 0 0.09 1884.44 924.329 1770.46 0 1652.04 0 0 0 0 0 0 0 0 -723.823 0 0 0 0 0 0 0 -1630.07 0 -1808.45 0 0 0 0 0 0 0 618.992 0 0 1934.8 0 0 -2288.2 0 0 0 0 0 
0 0 0 2490.39 -260.704 245.598 0 -265.282 -315.027 0 0 2462.31 1815.93 886.639 0 1406.37 0 -2161.09 0.04 0 1596.65 0 0 -1085.92 -1364.86 0 483.184 0 0 0 0 0 0 0 0 0 0 0 2317.19 -1348.54 0 312.128 -1197.01 0 -1335.57 0 -633.641 0 1938.46 0 -711.463 0 426.572 -2223.81 2472.38 0 0 1877.12 0 0 0 
0 0 0 0 -1881.39 0 1310.69 0 0 0 0 0 0 -434.812 0 0 0 259.178 0 0.01 0 19.4555 0 0 0 0 0 1120.87 0 0 -1192.74 0 0 0 0 363.399 0 0 -846.355 0 0 0 2146.44 0 0 0 0 2484.89 0 0 -385.372 0 1003.52 0 0 1419.19 0 0 0 0 1735.66 
611.972 0 -1197.93 0 0 0 273.522 0 0 0 665.838 0 186.087 0 -1889.48 0 0 -1705.6 1757.18 0 0.05 1041.83 0 -1742.23 0 1875.13 0 0 -1360.59 0 2363.12 0 0 0 0 0 0 -263.756 0 0 0 1948.07 0 0 -2399.44 1613.28 0 0 0 0 0 0 0 0 913.343 420.164 0 0 0 0 0 
0 0 0 0 0 0 0 0 0 0 0 759.987 0 0 0 0 0 0 0 1984.39 121.54 0.02 0 0 -520.112 2498.93 0 0 0 0 -2098.83 -2096.24 0 1406.06 0 0 0 0 0 0 0 1911.76 2332.91 0 0 0 832.163 -912.122 0 0 0 0 0 0 0 0 0 0 582.675 746.712 0 
0 0 0 0 0 434.965 2094.71 0 0 0 0 0 -1356.01 0 0 0 0 -2494.35 0 0 0 0 0.01 0 0 0 -811.258 0 0 0 0 0 0 0 0 2270.81 0 0 1795.02 0 0 0 0 0 0 0 2100.82 0 0 2229.3 0 0 0 0 0 0 0 0 181.814 0 -1659.22 
0 0 0 0 0 0 0 1583.83 0 0 0 0 499.054 2456.05 766.396 0 0 0 681.707 0 -758.003 0 0 0.02 2172.54 -444.731 0 0 0 0 0 0 0 0 0 0 0 0 0 0 760.445 0 288.018 0 2180.93 735.572 0 0 0 0 0 0 -1840.49 0 0 1366.08 0 0 0 0 0 
0 0 0 0 0 0 0 0 0 0 -1580.94 0 1755.5 0 1894.97 2124.47 0 0 -1084.7 0 0 -1274.07 0 552.614 0.06 1355.56 0 0 0 -2490.23 0 0 -392.392 -524.384 0 0 0 0 0 0 0 0 0 0 -1623.66 0 0 0 0 1824.78 0 0 2366.18 0 1084.86 0 0 -1833.17 0 0 0 
649.358 0 1115.22 0 0 0 1847.97 189.901 0 1698.58 0 0 0 0 -911.054 0 0 0 0 0 1620.3 -986.129 0 1514.25 -2168.26 0.02 0 0 0 -1811.66 -1429.56 837.504 0 0 -1885.81 0 0 0 2103.26 0 0 0 -1755.81 0 0 0 0 0 1039.69 1589.79 0 0 1181.3 258.11 1543.4 270.623 2167.96 -291.833 -788.522 0 0 
0 0 0 0 -1074.02 0 0 0 1477.02 2462.46 0 0 0 0 -109.18 0 0 0 -579.165 0 0 0 1045.49 0 0 0 0.09 0 0 0 0 966.903 0 0 0 0 0 0 0 -1381.34 0 202.109 -1498.84 0 0 1589.63 -770.516 0 0 0 0 0 0 -928.602 -105.06 0 0 687.964 0 0 0 
0 0 0 0 0 0 -1375.85 0 0 -488.678 0 0 0 0 -198.141 0 0 0 0 -1630.68 0 0 0 0 0 0 0 0.07 -1383.63 0 0 0 0 2086.32 1508.76 -353.786 0 0 0 0 118.03 0 0 1758.55 141.224 0 1211.36 1707.59 0 0 0 0 0 0 0 0 1501.59 -468.383 0 -1640.6 0 
0 0 0 0 0 2385.86 0 0 2079.76 -584.811 0 -572.146 746.406 0 0 0 -1522.64 0 0 0 1564.91 0 0 0 0 0 0 -186.392 0.06 446.257 0 2258.9 0 675.298 1327.94 0 1074.63 0 0 260.704 -2030.63 1743.6 2196.65 0 0 0 0 0 0 -301.752 -699.103 0 -891.827 0 0 0 0 0 0 0 0 
-467.315 0 0 0 0 0 0 0 1482.36 2313.23 0 0 350.276 -1862.32 613.651 0 0 0 0 0 0 0 0 0 -2124.32 2113.03 0 0 273.064 0 0 0 355.159 1044.27 0 0 0 0 1831.03 -1958.75 0 0 0 0 -265.74 0 0 299.921 0 0 -430.235 0 0 0 0 0 0 -2310.33 2257.99 0 0 
0 0 0 0 959.731 0 1942.43 0 0 0 0 0 0 0 1927.63 2212.06 0 0 0 -1999.04 1137.5 -1710.03 0 0 0 -2262.72 0 0 0 0 0.02 0 0 0 0 0 2450.71 0 1704.69 0 0 0 -417.264 0 0 0 1573.15 0 -2470.09 0 0 0 0 0 0 2041.61 0 967.513 0 0 0 
723.518 0 0 0 -877.026 0 0 1887.34 0 0 0 1194.72 719.398 0 0 907.086 0 -238.273 0 0 0 -951.338 0 0 0 1504.94 -1266.29 0 -1734.44 0 0 0.09 0 -993.759 0 0 136.189 0 0 0 1794.56 0 0 0 0 0 -1781.75 0 895.947 115.284 0 682.47 0 0 1949.6 -1127.28 0 425.81 0 0 0 
93.4629 0 -336.543 0 0 2193.75 0 0 1303.22 1563.08 0 0 0 2145.07 0 0 0 0 0 0 0 0 0 0 394.833 0 0 0 0 1089.28 0 0 0.02 -406.278 0 0 0 0 -549.257 2302.39 858.409 0 1151.08 886.334 -2052.14 0 0 -1215.32 0 0 0 0 530.335 0 0 529.42 0 -1133.23 0 0 0 
0 0 0 0 0 0 652.562 0 1309.32 324.03 0 0 0 0 0 0 0 0 0 0 0 -2116.99 0 0 2002.7 0 0 -1066.7 1029.16 -1550.57 0 952.406 1432.92 0.09 -1876.96 0 0 0 -78.3563 0 0 0 0 2377.62 0 0 -406.43 0 0 0 0 0 0 0 -1964.25 0 0 0 0 1981.34 0 
0 2033.37 0 0 0 0 2059.92 0 0 0 0 1083.33 0 0 0 1674.47 312.128 0 0 0 0 0 0 0 0 -915.326 0 -2311.85 1419.03 0 0 0 0 2423.4 0.02 234.153 0 0 0 0 0 0 0 0 0 0 0 0 0 0 0 0 0 -469.298 0 0 0 0 0 0 0 
0 2114.09 0 -1343.35 0 0 0 0 0 2295.37 0 0 0 0 0 -2319.03 0 0 0 1482.67 0 0 1626.71 0 0 0 0 -501.343 0 0 0 0 0 0 1829.05 0.06 1478.39 0 0 0 0 0 0 0 628.758 460.753 870.464 -1147.42 0 0 0 0 0 -734.962 2160.18 0 0 0 0 0 0 
0 0 0 0 1324.73 0 0 0 0 0 0 0 0 0 1962.57 0 0 0 0 0 0 0 0 0 0 0 0 0 516.297 0 1796.09 -682.623 0 0 0 1032.21 0.02 0 0 0 263.909 -2232.81 380.49 0 0 -501.19 0 664.617 0 0 0 0 0 0 0 0 0 0 0 -106.433 0 
0 0 0 0 1976.91 0 0 -195.853 1538.97 -146.413 0 0 0 0 0 582.064 0 0 0 0 -376.217 0 0 0 0 0 0 0 0 0 0 0 0 0 0 0 0 0.03 -499.054 0 0 0 0 0 0 0 610.599 -844.066 0 0 0 -2028.79 0 1971.72 0 0 0 0 -415.281 2057.63 0 
0 0 0 0 0 0 193.716 0 0 0 0 1551.79 111.621 -1166.95 0 365.993 0 0 1687.44 -1728.19 0 0 -1012.07 0 0 981.704 0 0 0 -270.928 -2106.92 0 -456.481 2055.19 0 0 0 606.784 0.02 0 0 207.602 2111.65 0 -1422.24 447.325 0 0 0 0 0 0 -210.349 293.512 0 0 2411.04 0 0 0 0 
0 -213.553 0 0 0 0 0 0 0 0 0 0 961.562 0 0 -1414.91 0 -203.787 1600.47 0 0 0 0 0 0 0 -393.002 0 1794.72 -627.537 0 0 2448.42 0 0 0 0 0 0 0.08 0 0 -79.7296 0 0 0 0 0 0 -2356.11 2268.67 0 0 0 0 1961.35 0 0 0 0 0 
1475.8 2131.95 2344.05 0 2098.22 -922.346 0 -252.617 0 0 0 -1287.35 0 -87.817 285.119 0 0 0 0 0 0 0 0 1538.06 0 0 0 1264.92 -1823.56 0 0 1960.59 -2293.08 0 0 0 406.43 0 0 0 0.01 0 0 0 2325.59 0 0 0 0 0 0 0 1059.98 1989.88 0 0 0 -2232.81 0 -468.23 1507.39 
0 0 2304.99 0 0 -2312.77 0 0 0 0 0 0 0 0 0 0 0 161.367 -2238.3 0 764.412 1248.59 0 0 0 0 587.252 0 -2054.58 0 0 0 0 0 0 0 -2120.04 0 2295.83 0 0 0.01 -250.786 0 0 380.184 0 0 0 0 2419.13 0 0 1783.73 0 -2238.91 0 0 0 0 0 
0 0 316.858 0 0 0 0 0 0 0 0 0 0 0 0 0 265.435 0 503.784 -301.447 0 1156.42 0 -2028.64 0 125.05 -731.3 0 -228.507 0 1907.48 0 2350.15 0 0 0 2080.68 0 -1643.04 -727.943 0 -1259.42 0.07 0 0 0 0 0 0 1533.48 0 0 0 0 0 -437.864 0 0 0 0 -1437.19 
0 0 0 0 0 -1421.02 0 617.008 0 2090.44 0 0 668.737 0 0 0 0 0 0 0 0 0 0 0 0 0 0 -1775.19 0 0 0 0 1654.33 1406.98 0 0 0 0 0 0 0 0 0 0.08 0 0 0 0 0 -666.143 0 0 0 -1414.3 0 0 0 2037.64 0 0 0 
-609.073 0 0 0 0 -442.289 0 0 0 0 0 0 711.005 0 0 0 2375.64 0 941.725 0 2276.3 0 0 2366.48 700.323 0 0 2350 0 1426.05 0 0 999.71 0 0 717.566 0 0 -751.442 0 1242.03 0 0 0 0 0 0 0 0 0 -1099.35 2175.74 0 0 -270.47 0 0 0 0 0 -62.4866 
0 0 0 0 0 0 0 0 0 0 0 1065.17 0 1934.64 0 0 1060.14 0 0 0 231.864 0 0 884.96 0 0 1308.86 0 0 0 0 0 0 0 0 -300.836 -1732 0 268.944 0 0 -58.3666 0 0 0 0.01 0 0 188.223 -237.358 0 1194.72 0 0 0 0 1838.97 -1004.14 0 0 -1512.88 
0 0 0 0 0 0 0 0 2284.84 0 0 0 2273.09 -781.808 0 0 0 0 -1282.01 0 0 1946.09 1761.76 0 0 0 -1298.03 -557.649 0 0 -142.903 2191.92 0 -1063.8 0 -1101.64 0 1344.42 0 0 0 0 0 0 0 0 0.09 -1228.9 1156.88 932.264 1430.78 0 0 113.3 701.544 0 0 0 -432.981 1288.42 0 
-1569.49 0 0 0 451.75 411.313 0 -181.204 0 0 0 0 0 -1641.82 0 2084.34 1876.05 0 0 -2312.92 0 -955.763 0 0 0 0 0 -1887.04 0 361.568 0 0 1480.83 0 0 2404.02 2049.7 1245.84 0 0 0 0 0 0 0 0 1996.29 0.09 0 0 0 0 -720.923 0 0 0 0 -1204.03 245.445 0 0 
1003.83 0 0 291.833 0 0 0 1679.2 0 -1626.56 0 0 0 0 0 1037.25 0 0 -644.627 0 0 0 0 0 0 -81.5607 0 0 0 0 -374.996 -2305.6 0 0 0 0 0 0 0 0 0 0 0 0 0 922.651 -555.055 0 0.06 0 2274.77 1991.56 0 0 0 1341.98 0 1749.09 0 0 0 
2281.03 0 524.232 -80.1874 88.4274 0 0 1170.92 0 0 0 -2133.47 -279.778 0 0 0 925.092 121.693 0 0 0 0 2429.2 0 129.017 1982.56 0 0 -1845.99 0 0 -416.959 0 0 0 0 0 0 0 1499.3 0 0 2001.79 2083.27 0 1259.27 1851.33 0 0 0.09 0 0 1372.95 -243.004 0 0 424.741 0 635.929 0 520.417 
0 0 0 0 0 0 536.286 0 -2026.35 2446.29 2395.32 0 0 0 1609.16 -1427.43 0 0 2364.04 -1571.47 0 0 0 0 0 0 0 0 1557.59 765.481 0 0 0 0 0 0 0 0 0 -1386.53 0 310.755 0 0 1945.33 0 686.285 0 464.873 0 0.05 0 0 0 0 0 0 0 0 0 0 
0 0 0 0 0 0 0 0 0 0 0 0 0 0 0 0 0 0 0 0 0 0 0 0 0 0 0 0 0 0 0 -2183.37 0 0 0 0 0 213.248 0 0 0 0 0 0 1954.33 1536.99 0 0 -1711.86 0 0 0.05 -327.387 -1.44963 0 0 2348.02 446.715 0 0 0 
-552.004 0 0 0 0 -2377.77 0 561.617 0 0 0 0 0 0 1912.98 -1524.63 0 1831.34 2351.83 1867.66 0 0 0 1200.83 -8.77407 735.725 0 0 142.903 0 0 0 -2301.48 0 0 0 0 0 967.36 0 2197.71 0 0 0 0 0 0 2151.63 0 1686.68 0 -178.457 0.01 0 1641.36 0 0 -960.341 0 0 0 
0 0 0 0 1585.97 0 0 0 1372.65 0 0 0 0 0 0 -2274.01 -1956.77 0 -2131.49 0 0 0 0 0 0 -386.441 513.703 0 0 0 0 0 0 0 2440.64 1114.15 0 115.284 1891.61 0 -2247.31 1379.36 0 -546.815 0 0 2077.01 0 0 2385.1 0 1212.12 0 0.08 0 0 0 0 0 0 1865.37 
-1460.69 0 0 0 0 -398.038 2270.96 0 1858.65 0 -1437.96 0 2189.93 0 -2478.33 548.189 2045.27 0 2265.31 0 2172.54 0 0 0 545.595 -2161.55 2037.49 0 0 0 0 -2131.18 0 -2281.33 0 143.513 0 0 0 0 0 0 0 0 878.094 0 1426.05 0 0 0 0 0 1705.45 0 0 0 1923.96 0 -378.811 0 0 
0 0 2199.24 0 508.515 1580.17 0 0 0 307.245 -832.011 0 0 0 0 0 2357.94 2.82296 0 640.202 -2265.16 0 0 601.138 0 -1782.51 0 0 0 0 -1716.59 -1325.95 510.346 0 0 0 0 0 0 -1030.23 0 -28.3059 2020.1 0 0 0 0 0 222.404 0 0 0 0 0 0 0.07 0 750.374 0 -118.488 1167.1 
0 -1568.88 0 0 2227.62 2175.28 0 1370.97 0 0 0 0 0 0 -1075.24 0 0 0 0 0 0 0 0 0 0 1023.97 0 189.138 0 0 0 0 0 0 0 0 0 0 1831.8 0 0 0 0 0 0 534.913 0 0 0 -2217.4 0 -1199.91 0 0 658.055 0 0.02 0 0 1024.58 0 
0 0 0 0 0 1265.68 0 0 0 1356.62 0 -1415.07 0 0 0 0 0 0 102.008 0 0 0 0 0 -2178.33 987.198 1268.58 -535.218 0 -201.498 481.353 2058.4 -1981.95 0 0 0 0 0 0 0 2498.47 0 0 350.429 0 -1828.44 0 2201.83 439.085 0 0 1887.19 -874.126 0 0 1198.23 0 0.06 0 1073.41 1863.23 
2156.51 0 0 0 0 422.91 0 0 0 -1707.74 0 -2235.86 0 0 0 0 0 0 0 0 0 2400.81 411.313 0 0 -2464.9 0 0 0 2067.86 0 0 0 0 0 0 0 -1566.44 0 0 0 0 0 0 0 0 2210.68 1610.84 0 1345.64 0 0 0 0 -2187.19 0 0 0 0 0 0 
0 759.377 0 2385.4 0 0 1928.69 0 0 -1364.86 0 0 0 -1899.7 0 2392.57 0 0 0 0 0 1564.76 0 0 0 0 0 -2214.8 0 0 0 0 0 -2478.33 0 0 772.042 -342.952 0 0 1382.56 0 0 0 0 0 1977.52 0 0 0 0 0 0 0 0 -1569.64 1957.69 -1295.59 0 0.07 0 
0 -1730.63 -1445.89 2172.23 -269.86 755.562 0 0 0 0 0 0 1431.85 -485.168 1049 1029.62 919.294 0 0 1188.62 0 0 2417.29 0 0 0 0 0 0 0 0 0 0 0 0 0 0 0 0 0 -901.44 0 -2050.16 0 1636.33 -489.288 0 0 0 -307.703 0 0 0 88.8852 0 931.349 0 702.307 0 0 0 
