*Vertices 47
*Matrix 
0.04 950.88 0 0 1977.52 0 -88.58 0 0 0 1925.64 -1781.14 0 0 0 0 0 0 152.364 0 0 0 0 0 0 0 0 0 0 0 0 0 0 0 0 0 0 -1848.73 0 1421.17 0 0 0 0 -1757.03 2350 0 
-65.3859 0 0 1078.14 0 0 0 0 0 0 0 0 0 0 53.1785 1147.57 0 0 2097.16 1974.47 0 0 0 0 0 0 0 0 0 0 0 0 0 0 0 0 0 0 0 0 0 0 0 0 0 0 0 
0 0 0.05 0 437.864 0 0 -760.903 944.472 0 0 492.95 0 -756.63 2070.3 0 0 0 0 608.615 0 0 0 0 0 0 0 0 1671.27 0 0 0 -935.469 0 954.543 0 0 0 0 0 0 0 0 125.355 0 0 240.867 
0 1315.58 0 0.05 0 1826.76 974.685 0 0 2320.09 0 0 0 0 0 0 0 0 0 1703.77 142.445 0 0 0 0 0 0 106.586 1187.09 0 0 0 0 -373.165 0 0 0 0 0 0 2140.8 1312.52 0 0 0 0 0 
269.555 0 -1153.98 0 0.04 0 0 0 0 0 0 1516.08 2203.82 0 0 0 0 1620.46 0 1769.54 0 0 0 0 0 0 0 0 0 0 -93.4629 0 -1944.11 0 0 0 0 0 1046.86 -1629.76 0 0 0 0 0 0 0 
0 0 0 -388.882 0 0.08 0 0 0 0 0 0 0 0 0 1620.46 0 0 0 0 1799.91 0 0 0 0 0 0 0 0 0 0 0 0 0 0 0 0 0 0 786.996 0 0 -834.147 -1930.22 0 0 0 
2054.28 0 0 -156.484 0 0 0.08 0 1732.61 0 259.178 0 0 0 0 0 0 0 0 0 0 2403.26 0 0 0 405.057 0 1238.98 0 0 0 0 0 0 0 0 52.5681 -324.641 0 0 0 0 0 0 0 0 0 
0 0 -1072.19 0 0 0 0 0.07 -428.709 0 -1040.6 0 0 0 0 0 -142.445 2453.15 1553.77 1794.41 0 0 0 263.756 0 0 0 0 0 0 106.891 0 0 0 0 0 0 0 500.275 0 0 0 0 0 -2325.28 472.198 0 
0 0 -1732 0 0 0 788.369 1141.47 0.03 0 -296.716 0 2345.73 0 0 0 1239.89 0 0 0 0 -2032.91 0 0 0 0 0 0 0 0 0 0 0 0 0 0 0 -810.953 0 0 0 0 0 158.467 0 0 0 
0 0 0 -751.137 0 0 0 0 0 0.08 0 0 0 0 0 2381.44 0 0 140.767 -1590.09 546.51 0 0 0 0 0 1274.99 -573.519 0 0 0 0 0 1918.32 0 0 0 0 0 0 0 0 0 0 494.934 0 0 
-1361.05 0 0 0 0 0 1700.57 1429.26 1481.9 0 0.08 1804.03 937.452 988.113 0 0 397.58 2154.23 0 0 0 0 0 0 808.054 0 0 0 0 0 0 0 0 0 0 0 0 646.001 1363.64 0 0 0 0 0 0 0 0 
-1514.71 0 134.816 0 1470.61 0 0 0 0 0 1713.39 0.01 0 0 -266.198 2372.43 0 -2477.26 0 0 0 0 1824.93 0 0 0 0 0 850.169 0 0 0 0 0 0 0 829.417 0 2235.71 0 0 0 0 0 -1551.94 0 -743.66 
0 0 0 0 794.015 0 0 0 -847.728 0 2084.34 0 0.04 0 0 2057.48 1694.16 0 -960.952 0 0 0 0 0 0 0 0 0 -491.272 0 0 0 0 1884.9 0 0 0 0 0 187.765 0 0 0 0 0 0 0 
0 0 1772.74 0 0 0 0 0 0 0 336.238 0 0 0.04 0 0 -1780.68 0 1749.24 0 0 1853.92 0 0 0 0 0 0 0 0 0 0 -2499.69 -412.992 1576.82 0 0 0 0 0 0 0 0 0 0 0 0 
0 -696.051 901.135 0 0 0 0 0 0 0 0 1148.18 0 0 0.06 1024.89 899.152 0 0 0 0 0 0 0 0 0 0 0 0 1406.22 0 0 0 0 0 -935.316 0 0 0 0 -2123.4 0 0 0 2062.97 0 -2315.82 
0 -203.177 0 0 0 -693.762 0 0 0 1060.9 0 112.384 -1083.18 0 -981.857 0.07 -261.62 1615.88 0 0 -192.953 0 0 0 2133.93 0 0 0 0 0 0 0 0 0 1776.25 -1766.64 0 0 0 0 0 0 0 0 0 0 0 
0 0 0 0 0 0 0 -1018.63 738.624 0 642.338 0 2124.32 1893.9 419.706 1474.12 0.08 0 2480.62 0 0 0 0 0 0 1631.6 0 -2353.97 0 0 0 0 0 0 0 0 0 0 2380.98 0 0 0 0 0 0 0 -487.915 
0 0 0 0 -151.906 0 0 1413.08 0 0 1986.68 1958.3 0 0 0 1194.88 0 0.06 0 -925.398 0 0 0 0 0 0 0 0 0 -862.377 1770.15 0 0 0 0 -1201.13 0 0 0 0 0 0 0 -2452.24 0 0 0 
1338.62 -494.781 0 0 0 0 0 2236.17 0 2393.8 0 0 2041.31 -202.567 0 0 -1204.79 0 0.06 0 0 0 1443.3 0 0 0 0 0 0 0 170.827 0 0 0 0 0 0 1272.09 0 0 0 0 0 0 0 0 0 
0 487.609 1611.91 -1284.3 -2164.14 0 0 337.611 0 -1813.03 0 0 0 0 0 0 0 2277.52 0 0.04 0 1308.56 0 0 1831.49 0 0 0 0 0 437.864 0 0 0 0 0 -129.627 549.257 1323.21 -1028.55 1145.28 0 0 0 0 0 0 
0 0 0 2172.69 0 -237.663 0 0 0 1017.11 0 0 0 0 0 614.719 0 0 0 0 0.01 646.458 1849.8 -1132.47 0 0 0 0 0 0 0 0 0 0 0 0 0 0 0 0 0 -1347.93 0 0 0 0 0 
0 0 0 0 0 0 853.069 0 -893.201 0 0 0 0 1899.4 0 0 0 0 0 1919.54 2049.09 0.04 -1859.72 0 0 0 812.326 0 0 0 0 0 0 0 0 1838.97 0 0 1178.09 0 824.686 0 370.418 0 0 0 0 
0 0 0 0 0 0 0 0 0 0 0 1597.26 0 0 0 0 0 0 1407.13 0 928.297 -595.645 0.02 1447.72 0 0 0 0 0 0 0 0 -88.4274 0 0 0 0 0 0 0 0 0 0 0 0 0 0 
0 0 0 0 0 0 0 -1423.31 0 0 0 0 0 0 0 0 0 0 0 0 1399.81 0 471.587 0.07 0 0 0 0 0 0 0 0 0 0 0 0 0 0 0 0 0 0 0 0 0 0 0 
0 0 0 0 0 0 0 0 0 0 520.264 0 0 0 0 39.14 0 0 0 1407.13 0 0 0 0 0.05 1635.72 0 0 0 0 0 933.027 0 0 676.061 0 0 0 0 0 0 0 -945.845 -1820.05 0 2428.43 0 
0 0 0 0 0 0 23.1178 0 0 0 0 0 0 0 0 0 1342.89 0 0 0 0 0 0 0 -964.766 0.04 652.104 0 0 0 0 0 0 0 0 0 0 0 0 0 0 0 0 0 0 355.922 0 
0 0 0 0 0 0 0 0 0 -985.061 0 0 0 0 0 0 0 0 0 0 0 412.992 0 0 0 1314.81 0.01 0 0 0 678.045 0 0 0 0 0 0 0 0 0 0 0 0 0 0 0 0 
0 0 0 105.976 0 0 1043.2 0 0 -587.405 0 0 0 0 0 0 1189.23 0 0 0 0 0 0 0 0 0 0 0.01 0 1160.24 371.334 1463.59 0 0 2406.31 0 -2163.99 0 0 0 1982.41 0 0 0 0 0 0 
0 0 394.07 1872.39 0 0 0 0 0 0 0 1662.72 1792.12 0 0 0 0 0 0 0 0 0 0 0 0 0 0 0 0.05 0 0 -2305.29 0 0 0 1784.04 0 0 0 0 0 0 0 0 0 0 0 
0 0 0 0 0 0 0 0 0 0 0 0 0 0 2243.49 0 0 -900.067 0 0 0 0 0 0 0 0 0 2194.05 0 0.06 0 0 0 0 0 0 -860.24 0 0 0 0 0 0 0 1395.23 0 0 
0 0 0 0 1261.1 0 0 -196.158 0 0 0 0 0 0 0 0 0 -87.5118 416.654 1025.96 0 0 0 0 0 0 1948.38 -2064.04 0 0 0.01 0 0 0 -1055.86 0 0 0 0 0 0 0 0 0 0 503.174 0 
0 0 0 0 0 0 0 0 0 0 0 0 0 0 0 0 0 0 0 0 0 0 0 0 611.362 0 0 581.454 2155.45 0 0 0.06 0 0 0 0 0 0 0 0 0 0 0 0 0 0 -1957.08 
0 0 1528.9 0 688.879 0 0 0 0 0 0 0 0 881.451 0 0 0 0 0 0 0 0 1766.34 0 0 0 0 0 0 0 0 0 0.06 0 0 0 0 0 0 0 0 0 0 -602.054 0 0 0 
0 0 0 663.396 0 0 0 0 0 -734.199 0 0 323.878 1946.39 0 0 0 0 0 0 0 0 0 0 0 0 0 0 0 0 0 0 0 0.01 0 0 0 0 0 -207.907 0 0 -1983.78 0 0 0 -58.8244 
0 0 -1680.12 0 0 0 0 0 0 0 0 0 0 992.08 0 993.301 0 0 0 0 0 0 0 0 1145.13 0 0 225.913 0 0 176.473 0 0 0 0.09 0 0 997.269 0 0 0 0 0 0 0 0 0 
0 0 0 0 0 0 0 0 0 0 0 0 0 0 2411.95 -31.2052 0 1756.26 0 0 0 130.085 0 0 0 0 0 0 -1519.9 0 0 0 0 0 0 0.03 0 0 0 0 1604.59 0 0 0 0 -600.07 0 
0 0 0 0 0 0 -1295.59 0 0 0 0 1000.78 0 0 0 0 0 0 0 534.303 0 0 0 0 0 0 0 684.301 0 2208.7 0 0 0 0 0 0 0.09 0 0 -1611.76 0 -1128.96 0 0 0 0 0 
1729.26 0 0 0 0 0 -239.189 0 1844.16 0 1158.56 0 0 0 0 0 0 0 -1464.66 667.821 0 0 0 0 0 0 0 0 0 0 0 0 0 0 1751.99 0 0 0.08 0 0 0 0 0 0 0 0 0 
0 0 0 0 -1631.6 0 0 -802.255 0 0 1759.93 2335.81 0 0 0 0 1212.12 0 0 -407.193 0 -1125.75 0 0 0 0 0 0 0 0 0 0 0 0 0 0 0 0 0.07 1616.18 0 0 0 0 0 0 0 
-833.689 0 0 0 2052.75 -1811.81 0 0 0 0 0 0 1741.46 0 0 0 0 0 0 -111.621 0 0 0 0 0 0 0 0 0 0 0 0 0 2160.94 0 0 2051.23 0 2270.65 0.07 0 0 0 0 0 -1305.51 0 
0 0 0 870.617 0 0 0 0 0 0 0 0 0 0 -824.992 0 0 0 0 2205.19 0 1522.64 0 0 0 0 0 -1137.96 0 0 0 0 0 0 0 234.764 0 0 0 0 0.07 0 0 0 0 0 0 
0 0 0 608.615 0 0 0 0 0 0 0 0 0 0 0 0 0 0 0 0 1770.15 0 0 0 0 0 0 0 0 0 0 0 0 0 0 0 1869.64 0 0 0 0 0.01 0 0 0 0 0 
0 0 0 0 0 1234.24 0 0 0 0 0 0 0 0 0 0 0 0 0 0 0 2494.2 0 0 2122.49 0 0 0 0 0 0 0 0 -1056.78 0 0 0 0 0 0 0 0 0 1151.08 0 0 0 
0 0 176.626 0 0 565.279 0 0 1815.47 0 0 0 0 0 0 0 0 856.578 0 0 0 0 0 0 740.303 0 0 0 0 0 0 0 2416.07 0 0 0 0 0 0 0 0 0 -1762.52 0.03 0 0 0 
-176.626 0 0 0 0 0 0 -312.433 0 179.983 0 1974.47 0 0 1929.61 0 0 0 0 0 0 0 0 0 0 0 0 0 0 -179.525 0 0 0 0 0 0 0 0 0 0 0 0 0 0 0.03 0 0 
1889.78 0 0 0 0 0 0 -1835.15 0 0 0 0 0 0 0 0 0 0 0 0 0 0 0 0 1487.09 1788.46 0 0 0 0 1345.18 0 0 0 0 -1276.67 0 0 0 -1694.62 0 0 0 0 0 0.08 0 
0 0 2349.54 0 0 0 0 0 0 0 0 1224.17 0 0 2164.3 0 40.6659 0 0 0 0 0 0 0 0 0 0 0 0 0 0 -38.8348 0 250.328 0 0 0 0 0 0 0 0 0 0 0 0 0 
