*Vertices 64
*Matrix 
0.04 0 0 0 0 0 0 0 0 0 0 0 0 0 718.787 0 0 0 0 -1411.56 0 0 0 0 0 0 0 0 0 0 0 0 0 0 0 0 0 0 0 0 0 0 0 0 0 0 0 0 0 1368.98 2001.02 0 1300.93 0 0 0 0 0 0 0 0 0 0 0 
0 0.07 0 0 523.469 860.393 0 0 0 0 0 0 0 -1862.77 0 0 0 0 0 0 0 566.652 0 0 0 0 0 539.491 0 0 -571.383 0 0 51.5 0 0 0 0 0 0 0 0 0 681.097 0 0 2470.55 0 43.1074 0 0 0 0 0 0 0 0 990.097 0 -632.115 -1797.62 0 0 0 
0 0 0.09 0 0 1130.94 0 0 0 0 0 409.329 -1763.59 900.983 0 2424.92 0 0 0 0 0 0 0 0 0 0 0 0 0 -1899.4 0 0 0 0 387.204 0 0 0 0 0 0 0 -460.295 0 0 0 0 0 0 0 0 0 0 1090.04 0 0 0 0 0 0 0 0 0 0 
0 0 0 0.02 0 0 0 0 0 0 0 14.42 0 0 0 0 0 0 0 0 0 0 0 2178.79 0 0 0 1155.96 0 0 0 0 0 0 0 0 0 0 0 0 0 0 372.25 0 0 191.275 0 0 0 0 0 -787.606 0 1171.22 -1294.98 0 0 0 0 0 0 0 0 0 
0 1794.56 0 0 0.01 0 0 530.335 -1643.35 626.469 1891 0 0 1747.26 0 0 457.549 0 0 1890.39 0 0 0 0 0 0 0 0 0 2331.54 0 0 46.1592 0 0 0 1588.72 0 0 0 0 1794.56 0 0 0 0 1744.36 0 0 0 0 0 0 0 0 0 0 0 0 0 0 0 0 0 
0 199.057 135.121 0 0 0 0 0 0 0 0 0 0 0 0 0 0 0 0 0 0 0 0 0 0 1617.56 0 0 0 0 0 0 0 0 0 0 0 0 0 0 0 0 0 0 335.475 -849.101 1087.91 -2275.99 0 0 0 0 0 0 0 0 0 0 0 0 0 0 0 0 
0 0 0 0 0 0 0.06 0 0 10.9104 0 0 0 0 0 0 1965.93 0 1962.72 -1787.7 0 0 0 0 0 0 0 0 0 0 0 0 0 0 0 0 0 0 0 0 0 0 0 0 0 88.2748 0 0 2204.73 -165.029 0 0 0 0 2403.1 0 0 0 0 0 0 0 0 0 
0 0 0 0 -320.063 0 0 0.09 -353.328 -37.4615 1475.04 0 0 0 0 0 0 -2182.76 0 0 0 0 0 0 0 0 0 0 0 -280.694 0 0 0 1836.68 0 0 0 0 1410.95 0 0 2181.84 0 0 0 0 -76.9829 0 0 0 0 0 1968.37 1863.84 0 0 0 0 0 0 0 0 0 0 
0 0 0 0 -503.784 0 0 -247.887 0.08 0 0 0 0 0 0 0 0 0 0 0 0 0 0 0 -3.12815 0 0 0 0 0 0 0 0 0 1694.31 0 0 2269.89 258.263 0 265.282 0 0 1116.75 0 0 0 0 0 0 0 0 0 0 0 0 0 0 0 0 0 0 0 0 
0 0 0 0 1338.01 0 910.138 -2210.38 0 0.03 1608.1 0 0 0 0 0.686666 0 0 0 0 0 0 63.097 0 0 0 0 0 0 0 0 0 0 1163.9 0 0 0 2170.71 0 0 0 0 0 0 0 2179.1 0 0 0 635.014 0 0 0 0 0 0 0 0 0 0 0 0 0 0 
0 0 0 0 -1584.75 0 0 777.383 0 -2486.88 0.05 0 1003.98 2339.32 0 0 0 -257.042 0 2156.67 0 -969.955 0 1061.2 0 0 0 0 0 -49.3637 0 0 0 232.475 0 0 0 0 0 0 0 0 0 1572.7 0 0 -287.713 0 0 0 2315.06 0 0 0 0 0 0 0 0 0 0 0 0 0 
0 0 -2143.39 752.663 0 0 0 0 0 0 0 0.03 0 0 0 0 0 1911.91 0 0 0 0 0 0 0 0 0 168.996 0 0 0 0 0 0 0 0 0 0 0 0 0 0 0 0 0 0 0 0 0 0 0 0 0 0 0 0 0 0 0 0 0 0 0 0 
0 0 413.907 0 0 0 0 0 0 0 2231.89 0 0.09 0 0 0 0 1145.13 398.19 0 0 0 0 0 0 0 0 0 0 0 0 0 0 0 0 0 0 0 0 0 0 0 0 0 220.267 0 0 0 0 -883.892 0 43.26 0 0 0 0 0 0 0 0 0 0 0 0 
0 2447.36 -1982.1 0 1416.14 0 0 0 0 0 826.212 0 0 0.09 0 0 0 0 0 1471.22 0 0 0 0 0 0 0 1990.34 0 0 0 0 0 0 0 -164.876 0 0 1770.76 0 0 0 1926.25 0 0 0 300.226 0 0 2435.91 0 0 0 0 0 0 0 0 0 0 0 0 0 0 
-149.922 0 0 0 0 0 0 0 0 0 0 0 0 0 0.02 0 0 0 2436.22 1503.88 0 0 589.236 0 0 0 0 0 0 0 0 0 0 0 0 0 0 0 0 0 0 -1080.13 0 0 0 0 0 0 0 0 0 0 0 1620.46 0 0 0 0 0 0 0 0 0 0 
0 0 -549.867 0 0 0 0 0 0 1996.14 0 0 0 0 0 0 0 0 0 0 596.713 0 0 0 0 0 0 0 0 0 0 0 0 0 0 -1664.86 0 0 0 0 0 0 0 0 0 0 0 0 0 1008.56 0 0 0 0 0 0 0 0 0 0 0 0 0 0 
0 0 0 0 -1273.61 0 189.901 0 0 0 0 0 0 0 0 0 0.09 554.75 0 0 2010.48 0 0 0 0 0 0 0 0 0 1269.8 0 0 0 0 2147.05 0 0 0 0 0 -1791.06 0 0 1836.99 0 0 -919.752 0 0 1918.47 0 0 0 0 0 0 0 0 0 0 0 0 0 
0 0 0 0 0 0 0 -427.183 0 0 1179.77 879.467 401.7 0 0 0 -869.243 0 0 0 0 0 0 0 0 0 0 0 0 0 0 0 0 2188.25 0 0 0 0 0 -1367.92 0 0 0 0 -58.6718 0 0 2279.81 -564.364 0 0 0 0 0 0 0 0 0 0 0 0 0 0 0 
0 0 0 0 0 0 -1552.71 0 0 0 0 0 2239.22 0 877.026 0 0 0 0.08 0 0 0 0 0 0 0 0 0 1043.2 1098.28 0 -460.601 0 0 0 0 0 0 0 0 0 0 0 -1417.2 0 -2251.12 0 0 0 0 2137.14 0 0 0 0 0 0 0 0 0 0 0 0 0 
-1407.44 0 0 0 1653.42 0 -2402.19 0 0 0 -1086.69 0 0 1154.9 5.26444 0 0 0 0 0.08 0 0 0 0 0 918.836 0 0 0 0 -842.235 0 86.1385 0 1797.92 0 0 0 0 0 0 0 0 0 0 0 -1076.16 0 1881.24 -1184.04 1771.22 0 0 -232.78 0 0 0 0 0 0 0 0 0 0 
0 0 0 0 0 0 0 0 0 0 0 0 0 0 0 1884.44 1885.97 0 0 0 0.01 0 0 0 0 0 0 0 0 0 0 0 0 0 0 0 0 0 0 0 0 0 0 0 0 0 0 0 818.125 0 0 0 1699.04 0 0 0 0 0 0 0 0 0 0 0 
0 2371.82 0 0 0 0 0 0 0 0 -945.54 0 0 0 0 0 0 0 0 0 0 0.08 0 0 -1416.29 0 0 0 0 0 0 0 1703.92 0 0 0 0 0 0 0 0 0 0 0 0 0 2424.47 0 0 0 0 0 0 0 0 0 0 0 0 0 0 0 0 0 
0 0 0 0 0 0 0 0 0 -1061.66 0 0 0 0 118.336 0 0 0 0 0 0 0 0 0 2143.85 2374.11 979.72 0 -712.226 0 -1137.04 0 0 2172.23 0 0 701.849 0 0 0 0 0 0 0 0 0 0 -233.238 0 612.125 0 0 0 0 810.19 0 0 0 0 0 0 0 0 0 
0 0 0 1470.92 0 0 0 0 0 0 -1492.43 0 0 0 0 0 0 0 0 0 0 0 0 0.09 0 0 0 0 0 -48.2955 0 0 0 0 2363.58 0 0 0 -910.138 0 0 0 0 0 -1550.11 0 948.134 0 0 0 0 0 0 1257.13 0 0 0 0 0 0 0 0 0 0 
0 0 0 0 0 0 0 0 -575.655 0 0 0 0 0 0 0 0 0 0 0 0 1225.55 894.726 0 0.08 0 0 0 0 0 0 0 0 0 0 -1367.92 0 0 0 0 0 1229.06 0 0 0 0 0 0 0 0 0 0 0 0 0 0 0 0 0 0 0 0 0 0 
0 0 0 0 0 -820.719 0 0 0 0 0 0 0 0 0 0 0 0 0 1793.5 0 0 2326.2 0 0 0.04 0 0 0 0 0 0 0 0 0 0 0 0 -1196.1 0 2369.38 0 2146.14 0 0 0 0 0 0 0 0 0 17.4718 0 0 0 0 0 0 0 0 0 0 0 
0 0 0 0 0 0 0 0 0 0 0 0 0 0 0 0 0 0 0 0 0 0 2398.68 0 0 0 0.06 0 0 0 0 -857.189 0 0 0 559.023 0 0 0 0 0 0 0 0 0 0 0 0 0 0 0 0 0 0 0 0 0 0 0 0 0 0 0 0 
0 186.087 0 1453.67 0 0 0 0 0 0 0 438.322 0 -115.741 0 0 0 0 0 0 0 0 0 0 0 0 0 0.07 24.4911 0 0 0 0 0 0 0 0 0 0 0 1773.35 0 0 0 0 0 0 0 1315.88 0 0 0 0 0 0 0 0 0 0 0 0 0 0 0 
0 0 0 0 0 0 0 0 0 0 0 0 0 0 0 0 0 0 1779.46 0 0 0 -171.743 0 0 0 0 499.817 0.01 0 0 0 0 0 0 0 0 0 0 2310.79 0 0 0 0 0 0 0 0 0 1137.81 0 0 0 0 0 0 0 0 0 0 0 0 2394.1 0 
0 0 2175.74 0 -376.217 0 0 873.821 0 0 -1832.26 0 0 0 0 0 0 0 -1206.63 0 0 0 0 578.707 0 0 0 0 0 0.02 0 0 0 0 0 925.855 1759.47 0 0 0 0 1954.18 0 0 0 0 -242.393 0 1833.02 0 0 0 0 0 0 0 -1285.52 0 0 0 0 0 0 0 
0 -1532.11 0 0 0 0 0 0 0 0 0 0 0 0 0 0 2361.29 0 0 1848.58 0 0 -1074.63 0 0 0 0 0 0 0 0.07 0 0 0 0 2380.98 0 0 0 0 0 -1778.54 0 0 1278.5 0 0 0 0 0 0 0 0 0 0 0 0 0 0 0 0 0 0 0 
0 0 0 0 0 0 0 0 0 0 0 0 0 0 0 0 0 0 2476.81 0 0 0 0 0 0 0 1035.72 0 0 0 0 0.01 0 0 0 0 0 0 0 0 315.943 0 0 0 0 0 0 0 0 0 0 0 0 0 1255.15 0 0 0 0 0 0 0 0 0 
0 0 0 0 345.698 0 0 0 0 0 0 0 0 0 0 0 0 0 0 1679.36 0 810.8 0 0 0 0 0 0 0 0 0 0 0.08 0 0 0 0 0 0 0 2257.84 0 0 0 0 0 -256.737 0 1736.88 0 0 0 0 0 1954.02 0 0 0 0 0 0 0 0 0 
0 2495.88 0 0 0 0 0 -1537.45 0 77.5933 2121.72 0 0 0 0 0 0 -1301.84 0 0 0 0 2468.72 0 0 0 0 0 0 0 0 0 0 0.01 0 0 0 0 0 0 0 0 -2297.51 0 0 0 0 0 0 0 0 0 0 0 0 0 0 0 981.094 0 0 0 0 0 
0 0 424.894 0 0 0 0 0 126.576 0 0 0 0 0 0 0 0 0 0 -925.55 0 0 0 2149.49 0 0 0 0 0 0 0 0 0 0 0.01 0 0 0 0 0 0 0 -1106.52 0 0 0 0 0 0 0 0 0 0 0 2086.02 0 0 0 0 0 0 0 0 0 
0 0 0 0 0 0 0 0 0 0 0 0 0 2346.19 0 381.1 1389.43 0 0 0 0 0 0 0 -1123.46 0 -1577.58 0 0 1788.92 1017.72 0 0 0 0 0.02 0 -1889.93 0 -2464.6 0 0 0 0 0 0 0 0 0 0 369.961 0 0 0 0 767.312 0 0 0 0 0 0 0 0 
0 0 0 0 -1497.01 0 0 0 0 0 0 0 0 0 0 0 0 0 0 0 0 0 2484.44 0 0 0 0 0 0 274.895 0 0 0 0 0 0 0.06 0 0 0 0 -441.527 0 0 0 0 0 0 0 0 0 0 0 0 2456.97 0 0 0 0 0 0 0 0 0 
0 0 0 0 0 0 0 0 -210.654 -891.827 0 0 0 0 0 0 0 0 0 0 0 0 0 0 0 0 0 0 0 0 0 0 0 0 0 1805.55 0 0.08 0 0 1806.62 0 0 0 2086.02 0 -1342.28 0 0 0 0 0 -679.266 0 0 0 0 0 0 0 0 0 0 0 
0 0 0 0 0 0 0 554.445 -256.584 0 0 0 0 1979.05 0 0 0 0 0 0 0 0 0 2468.26 0 -1707.43 0 0 0 0 0 0 0 0 0 0 0 0 0.07 0 0 0 -1663.64 0 2326.2 0 0 -927.534 672.704 87.6644 0 2196.95 0 0 0 0 0 0 0 0 0 0 0 0 
0 0 0 0 0 0 0 0 0 0 0 0 0 0 0 0 0 409.329 0 0 0 0 0 0 0 0 0 0 1773.81 0 0 0 0 0 0 767.006 0 0 0 0.01 0 0 0 0 0 -2035.51 0 0 0 0 -286.187 2206.41 0 973.159 0 0 0 0 0 0 0 0 0 0 
0 0 0 0 0 0 0 0 804.239 0 0 0 0 0 0 0 0 0 0 0 0 0 0 0 0 -134.51 0 1459.93 0 0 0 -1575.14 -66.1489 0 0 0 0 1245.69 0 0 0.07 0 0 0 -135.578 0 0 0 0 0 0 0 0 0 0 0 0 0 0 0 0 0 0 0 
0 0 0 0 2426.15 0 0 652.867 0 0 0 0 0 0 2415.01 0 982.009 0 0 0 0 0 0 0 2010.18 0 0 0 0 2036.73 278.253 0 0 0 0 0 1337.09 0 0 0 0 0 0 0 0 0 0 0 0 0 0 0 0 0 0 0 0 0 0 0 0 -1894.21 0 0 
0 0 -195.7 1724.37 0 0 0 0 0 0 0 0 0 -87.9696 0 0 0 0 0 0 0 0 0 0 0 -1094.01 0 0 0 0 0 0 0 956.526 -543.611 0 0 0 1596.5 0 0 0 0 0 0 0 0 0 0 0 0 0 0 0 0 -1606.27 0 0 0 0 0 0 0 0 
0 1037.71 0 0 0 0 0 0 2267.6 0 1325.65 0 0 0 0 0 0 0 -1411.1 0 0 0 0 0 0 0 0 0 0 0 0 0 0 0 0 0 0 0 0 0 0 0 0 0.05 0 0 0 0 0 0 0 0 0 0 0 0 0 0 0 0 0 0 0 0 
0 0 0 0 0 453.581 0 0 0 0 0 0 -563.295 0 0 0 -427.641 2.67037 0 0 0 0 0 516.602 0 0 0 0 0 0 2380.21 0 0 0 0 0 0 1446.04 -1547.98 0 221.946 0 0 0 0.01 0 0 -461.516 0 0 0 0 2190.69 0 0 0 0 0 0 0 0 0 0 0 
0 0 0 -147.176 0 2170.25 -2090.9 0 0 1199.45 0 0 0 0 0 0 0 0 876.873 0 0 0 0 0 0 0 0 0 0 0 0 0 0 0 0 0 0 0 0 1911.45 0 0 0 0 0 0.08 0 0 0 0 0 0 0 1898.33 0 0 0 0 0 0 0 0 0 0 
0 9.68963 0 0 -1058.76 221.641 0 -1059.53 0 0 1442.38 0 0 -985.366 0 0 0 0 0 -1035.87 0 -1273 0 1146.96 0 0 0 0 0 -477.844 0 0 -377.59 0 0 0 0 2147.82 0 0 0 0 0 0 0 0 0.05 0 0 1755.35 -1188.01 0 0 2270.04 0 0 0 0 0 0 0 0 0 0 
0 0 0 0 0 1221.12 0 0 0 0 0 0 0 0 0 0 16.4037 819.193 0 0 0 0 1656.47 0 0 0 0 0 0 0 0 0 0 0 0 0 0 0 -1426.51 0 0 0 0 0 1822.95 0 0 0 0 0 0 -2326.96 0 1827.52 0 0 0 0 0 0 0 0 0 0 
0 -1786.78 0 0 0 0 -1334.65 0 0 0 0 0 0 0 0 0 0 1081.35 0 2228.23 1280.02 0 0 0 0 0 0 797.678 0 2108.6 0 0 2479.09 0 0 0 0 0 854.442 0 0 0 0 0 0 0 0 0 0.07 -578.86 0 0 0 0 0 0 0 0 0 0 0 0 0 0 
1628.54 0 0 0 0 0 1142.84 0 0 -1127.28 0 0 -1544.16 1605.66 0 655.766 0 0 0 -1042.44 0 0 -1268.88 0 0 0 0 0 339.595 0 0 0 0 0 0 0 0 0 873.058 0 0 0 0 0 0 0 -626.926 0 1371.73 0.03 0 0 0 0 0 0 0 0 0 0 0 0 0 0 
1318.63 0 0 0 0 0 0 0 0 0 1670.51 0 0 0 0 0 -350.276 0 214.316 490.967 0 0 0 0 0 0 0 0 0 0 0 0 0 0 0 -1353.27 0 0 0 -1489.23 0 0 0 0 0 0 1654.18 0 0 0 0.07 0 -244.682 0 0 0 0 0 0 0 0 0 0 0 
0 0 0 1573.92 0 0 0 0 0 0 0 0 -726.722 0 0 0 0 0 0 0 0 0 0 0 0 0 0 0 0 0 0 0 0 0 0 0 0 0 262.535 1171.83 0 0 0 0 0 0 0 716.498 0 0 0 0.04 0 0 0 0 0 0 0 0 0 0 0 0 
1823.56 0 0 0 0 0 0 406.888 0 0 0 0 0 0 0 0 0 0 0 0 -1941.36 0 0 0 0 2287.9 0 0 0 0 0 0 0 0 0 0 0 -1744.36 0 0 0 0 0 0 981.857 0 0 0 0 0 155.11 0 0.01 0 0 0 0 0 0 0 0 0 0 0 
0 0 1987.29 27.3904 0 0 0 -2464.45 0 0 0 0 0 0 -1709.42 0 0 0 0 -1445.43 0 0 0 1386.99 0 0 0 0 0 0 0 0 0 0 0 0 0 0 0 -141.224 0 0 0 0 0 2028.18 748.848 2431.18 0 0 0 0 0 0.05 0 0 0 0 0 0 0 0 0 0 
0 0 0 -559.481 0 0 -143.513 0 0 0 0 0 0 0 0 0 0 0 0 0 0 0 830.943 0 0 0 0 0 0 0 0 2440.79 -208.823 0 -1396.3 0 2155.14 0 0 0 0 0 0 0 0 0 0 0 0 0 0 0 0 0 0 0 0 0 0 0 0 0 0 0 
0 0 0 0 0 0 0 0 0 0 0 0 0 0 0 0 0 0 0 0 0 0 0 0 0 0 0 0 0 0 0 0 0 0 0 2489.62 0 0 0 0 0 0 60.3504 0 0 0 0 0 0 0 0 0 0 0 0 0.01 0 0 0 0 0 0 0 0 
0 0 0 0 0 0 0 0 0 0 0 0 0 0 0 0 0 0 0 0 0 0 0 0 0 0 0 0 0 401.395 0 0 0 0 0 0 0 0 0 0 0 0 0 0 0 0 0 0 0 0 0 0 0 0 0 0 0.03 0 0 0 0 0 0 0 
0 1252.25 0 0 0 0 0 0 0 0 0 0 0 0 0 0 0 0 0 0 0 0 0 0 0 0 0 0 0 0 0 0 0 0 0 0 0 0 0 0 0 0 0 0 0 0 0 0 0 0 0 0 0 0 0 0 0 0.09 0 0 0 0 0 0 
0 0 0 0 0 0 0 0 0 0 0 0 0 0 0 0 0 0 0 0 0 0 0 0 0 0 0 0 0 0 0 0 0 2390.44 0 0 0 0 0 0 0 0 0 0 0 0 0 0 0 0 0 0 0 0 0 0 0 0 0.08 0 0 0 0 0 
0 771.584 0 0 0 0 0 0 0 0 0 0 0 0 0 0 0 0 0 0 0 0 0 0 0 0 0 0 0 0 0 0 0 0 0 0 0 0 0 0 0 0 0 0 0 0 0 0 0 0 0 0 0 0 0 0 0 0 0 0.04 0 0 0 0 
0 612.888 0 0 0 0 0 0 0 0 0 0 0 0 0 0 0 0 0 0 0 0 0 0 0 0 0 0 0 0 0 0 0 0 0 0 0 0 0 0 0 0 0 0 0 0 0 0 0 0 0 0 0 0 0 0 0 0 0 0 0 0 0 0 
0 0 0 0 0 0 0 0 0 0 0 0 0 0 0 0 0 0 0 0 0 0 0 0 0 0 0 0 0 0 0 0 0 0 0 0 0 0 0 0 0 2331.54 0 0 0 0 0 0 0 0 0 0 0 0 0 0 0 0 0 0 0 0.04 0 -1802.19 
0 0 0 0 0 0 0 0 0 0 0 0 0 0 0 0 0 0 0 0 0 0 0 0 0 0 0 0 1025.65 0 0 0 0 0 0 0 0 0 0 0 0 0 0 0 0 0 0 0 0 0 0 0 0 0 0 0 0 0 0 0 0 0 0.02 0 
0 0 0 0 0 0 0 0 0 0 0 0 0 0 0 0 0 0 0 0 0 0 0 0 0 0 0 0 0 0 0 0 0 0 0 0 0 0 0 0 0 0 0 0 0 0 0 0 0 0 0 0 0 0 0 0 0 0 0 0 0 1135.82 0 0.03 
