*Vertices 59
*Matrix 
0.07 -1933.73 0 0 0 0 1149.4 2039.93 -1234.86 317.011 0 0 0 -1240.2 0 1937.54 910.596 0 0 -163.198 132.221 0 1224.17 0 0 0 0 736.335 0 0 0 0 0 1199.45 1169.85 0 -776.315 0 0 0 0 0 0 0 1133.53 0 1139.79 0 0 0 0 0 0 -390.866 0 -334.864 0 0 0 
-2099.29 0 -320.673 0 2463.99 0 0 0 -559.328 0 0 0 0 0 0 433.287 0 -2254.78 185.018 0 2307.58 0 0 -354.549 0 0 868.786 -2178.33 0 0 0 0 0 652.409 943.098 -674.383 0 0 462.279 0 1440.7 0 0 0 0 0 0 0 0 0 0 0 0 0 2186.73 0 0 0 0 
0 -1458.4 0.01 2205.34 0 0 0 0 0 0 0 752.51 0 0 0 -1790.14 0 0 0 0 0 0 -2380.52 0 -23.5755 -1541.57 0 -1536.23 0 0 0 0 0 0 0 0 0 0 0 -897.778 1939.38 1340.3 1679.97 0 1266.29 0 2190.54 0 0 0 0 0 0 0 -716.651 0 0 0 -788.522 
0 0 1130.79 0.08 1039.84 0 0 0 0 0 0 0 0 452.055 0 0 0 0 0 0 546.815 0 0 0 0 0 0 0 1869.49 0 0 0 1423.76 -654.546 0 0 0 0 0 0 0 0 0 0 0 0 0 0 0 0 2306.51 200.583 1359.52 1946.24 0 0 0 0 0 
0 1681.49 0 675.146 0.02 0 -1308.71 1688.06 -460.295 0 0 0 0 0 0 7.40074 0 0 -626.774 0 0 822.245 0 0 0 2212.67 2363.12 0 0 0 0 0 401.242 0 0 0 -484.405 0 0 0 -747.169 0 0 0 0 0 0 0 0 -122.761 0 0 -2359.31 0 -1632.05 1114.46 0 0 0 
0 0 0 0 0 0.08 0 1755.5 0 0 0 635.167 0 -1373.87 0 0 5.72222 0 0 960.036 654.546 -1207.85 0 0 404.294 0 0 0 0 0 0 0 0 -887.707 1059.37 1685.61 0 0 0 0 2252.8 1164.66 0 0 0 1373.41 -2404.63 0 0 0 156.789 0 0 0 1367.61 0 1667 0 0 
-1234.55 0 0 0 1685.16 0 0.09 0 0 978.805 0 0 0 1712.01 0 -2161.7 0 0 0 0 0 -252.312 0 1639.38 0 0 0 0 776.467 0 0 0 0 0 0 0 2145.83 0 0 0 0 1522.49 0 664.159 0 0 1032.98 0 0 0 2296.44 0 0 2467.19 0 0 0 1158.41 0 
678.961 0 0 0 1004.75 -1743.6 0 0.07 0 110.096 0 0 0 0 -2241.97 -2407.07 0 0 0 0 0 0 0 0 0 0 0 0 0 0 0 901.593 0 0 0 0 273.522 0 1932.97 0 0 1962.42 0 0 0 2093.34 0 0 0 -575.503 0 0 0 705.969 0 0 0 0 0 
1286.74 -1770.46 0 0 1739.17 0 0 0 0.01 0 0 0 1659.37 -1973.86 0 0 -390.255 0 0 0 0 0 0 0 0 0 0 142.75 0 0 0 938.826 0 -2237.39 1403.78 0 0 1211.36 0 0 0 0 -2281.64 0 0 2397.76 0 1069.6 1379.97 0 0 0 0 0 0 325.098 0 0 1082.42 
-530.793 0 0 0 0 0 1924.57 960.189 0 0 -1149.86 0 0 657.75 393.002 0 0 0 0 0 0 -1720.25 0 1264.15 0 236.9 0 -998.642 2396.24 2481.38 0 0 0 2496.64 0 0 155.263 0 0 0 -2264.4 0 0 0 0 0 0 0 0 0 0 -498.291 0 0 0 998.642 -800.424 0 0 
0 0 0 0 0 0 0 0 0 1411.4 0.09 0 0 -2067.25 -918.378 0 0 1509.67 0 1555.6 0 -2191.15 -1461.46 0 0 0 0 0 0 0 0 0 0 0 185.629 1981.49 0 0 -589.846 0 0 0 0 0 0 0 0 0 0 322.504 0 0 0 2402.8 0 -1791.97 0 -62.7918 0 
0 0 1657.99 0 0 -1748.48 0 0 0 0 0 0.01 0 0 701.849 0 0 78.814 0 0 0 881.298 0 0 0 0 361.721 0 0 0 -19.4555 0 0 0 0 0 0 -2151.33 0 0 0 2377.62 575.961 0 0 0 0 0 0 0 0 0 0 0 523.927 0 0 0 0 
0 0 0 0 0 0 0 0 1582 0 0 0 0.04 0 0 -11.9785 0 957.747 0 0 0 721.229 0 0 2109.06 -709.937 0 1662.57 1937.24 0 0 -2127.67 0 0 -1441.77 0 -538.423 0 0 0 0 0 0 1395.54 2338.56 0 293.359 0 960.494 1470 0 2468.57 0 0 0 0 0 0 0 
1955.55 0 0 2462.46 0 -1304.59 491.424 0 953.627 -201.804 494.171 0 0 0.01 0 0 -824.076 0 0 0 0 0 0 0 0 1724.98 -182.272 0 0 1407.74 0 1857.59 1896.8 0 717.261 0 0 -781.35 -195.09 -1624.88 0 0 0 0 0 0 0 0 0 0 2148.88 0 0 0 0 0 0 0 0 
0 0 0 0 0 0 0 -1169.55 0 2297.81 -939.894 72.5578 0 0 0.05 0 2080.83 1309.93 0 0 0 -1250.42 0 0 -2487.49 0 1569.64 0 0 0 0 0 -1410.79 1049.15 0 372.707 -292.138 486.389 0 0 2011.25 0 0 633.183 0 0 2152.55 0 0 0 0 0 0 0 -709.174 0 0 0 0 
1741.46 -1641.06 -1176.72 0 -793.1 0 -1779.76 789.895 0 0 0 0 1257.9 0 0 0 0 853.832 0 0 0 0 1706.67 0 2220.76 0 0 1218.07 2036.88 0 0 0 0 1684.7 0 1230.28 0 0 0 0 -2232.2 0 269.097 0 0 0 0 1121.33 0 -2286.83 0 0 0 0 0 0 0 0 0 
33.4941 0 0 0 0 -1676.61 0 0 -1063.95 0 0 0 0 506.378 1350.67 0 0.03 1745.89 2269.89 0 -1632.82 -549.867 0 -1242.03 1259.27 0 0 0 0 1209.83 0 853.221 0 0 0 0 0 0 0 0 1065.32 0 0 0 0 -846.812 0 1266.29 0 0 2500 2106.77 0 0 0 0 0 0 0 
0 2114.55 0 0 0 0 0 0 0 0 2284.08 1114.46 1973.71 0 -44.9385 1688.36 -1286.89 0.04 0 -1601.38 0 0 0 0 0 0 0 0 0 0 0 0 2032.46 2253.87 0 0 -1309.47 0 10.3 0 0 0 -1323.97 -975.753 0 0 796.304 0 0 0 0 0 0 0 360.195 0 1181.3 0 0 
0 -914.411 0 0 -925.703 0 0 0 0 0 0 0 0 0 0 0 1506.93 0 0.04 0 0 0 0 0 0 -2483.98 0 0 2032.3 0 1894.36 0 0 0 0 -848.491 0 -1239.43 1548.13 0 0 0 0 0 0 0 0 0 0 -1029.01 1682.71 0 -1741.77 0 551.546 460.906 1285.82 0 0 
119.098 0 0 0 0 -2160.18 0 0 0 0 -15.3356 0 0 0 0 0 0 844.676 0 0.07 0 36.2407 0 -655.919 1416.14 0 0 0 122.456 1118.88 2264.24 0 1193.04 0 0 1425.14 0 0 0 190.359 -2293.85 0 1839.12 0 0 -715.888 -183.95 2163.38 1466.95 0 0 0 -1721.63 0 0 0 0 0 0 
58.2141 2255.7 0 1936.93 0 -2231.59 0 0 0 0 0 0 0 0 0 0 -541.322 0 0 0 0.01 372.707 0 0 0 0 0 1704.38 309.839 0 -1264.92 2414.09 1401.79 0 0 0 -152.669 0 -772.805 0 -2372.43 0 0 1725.44 0 0 928.755 0 0 -195.853 91.3266 0 0 420.469 0 0 0 0 0 
0 0 0 0 -2109.52 598.392 1381.34 0 0 -1028.55 353.481 -887.402 1881.69 0 -573.061 0 46.3118 0 0 -983.383 -1502.04 0.05 0 95.5992 891.675 -1807.38 0 0 0 621.128 0 1572.7 0 0 111.469 0 164.724 0 0 0 1176.72 0 0 0 0 0 0 0 2247 0 1586.43 -2171.32 0 0 0 0 0 0 191.122 
1825.69 0 1223.11 0 0 0 0 0 0 0 -1751.08 0 0 0 0 -377.743 0 0 0 0 0 0 0.04 0 0 0 0 0 0 2350.15 0 0 0 0 0 0 0 -1191.67 0 0 0 0 0 0 0 0 0 0 0 0 0 0 0 -1715.22 0 0 0 0 0 
0 663.701 0 0 0 0 1854.69 0 0 1498.38 0 0 0 0 0 0 -647.374 0 0 -579.928 0 -2483.21 0 0.01 395.901 2034.44 -290.918 0 -2045.27 0 0 0 0 0 0 0 0 0 0 0 0 0 0 1345.94 0 0 2441.25 0 2343.75 52.7207 -732.368 -990.86 2321.62 0 0 0 0 0 0 
0 0 -642.186 0 0 1424.83 0 0 0 0 0 0 1875.9 0 -1537.45 2037.64 2327.72 0 0 -987.808 0 1780.07 0 -192.495 0.06 0 0 -136.341 0 0 0 0 0 0 0 0 0 0 0 0 0 0 0 0 -765.481 0 -2088.92 0 0 0 0 0 0 0 -1598.18 -375.607 188.528 0 0 
0 0 958.205 0 -568.331 0 0 0 0 -396.054 0 0 1935.56 1081.96 0 0 0 0 2259.36 0 0 1372.8 0 783.029 0 0.02 0 0 0 62.1815 0 2115.92 -1540.8 0 2022.39 791.574 0 0 0 0 0 0 -2494.05 724.738 0 0 0 0 0 0 0 0 0 168.844 0 0 0 0 0 
0 -1338.47 0 0 1443.14 0 0 0 0 0 0 1673.86 0 -2184.9 -875.195 0 0 0 0 0 0 0 0 -1236.53 0 0 0.02 0 1937.09 0 0 0 0 0 0 0 0 2277.21 0 0 -1535.92 0 -182.577 0 0 0 1231.19 0 1772.29 0 0 658.055 0 0 0 0 0 0 -222.556 
950.27 380.795 709.021 0 0 0 0 0 -1402.86 2329.1 0 0 -1323.82 0 0 1351.74 0 0 0 0 -1648.99 0 0 0 1862.16 0 0 0.05 0 0 0 0 0 0 0 2407.07 0 0 -804.544 0 0 1430.17 -497.986 0 0 0 0 2115.62 0 0 0 0 0 0 0 0 0 0 0 
0 0 0 217.826 0 0 100.482 0 0 1820.96 0 0 2465.51 0 0 2467.96 0 0 -139.851 2242.12 -1528.6 0 0 1419.19 0 0 406.583 0 0.01 0 0 1971.11 317.469 0 0 0 0 0 -2170.4 2067.09 0 -1780.83 0 0 0 955.153 0 0 0 -1269.8 0 0 0 0 1126.67 0 0 0 0 
0 0 0 0 0 0 0 0 0 2409.21 0 0 0 1385.62 0 0 500.732 0 0 480.895 0 222.861 2133.63 0 0 -1449.25 0 0 0 0.03 0 0 0 0 -573.214 0 0 -785.47 0 0 0 314.875 0 0 0 0 0 0 0 0 0 1940.75 0 0 1213.64 0 0 0 0 
0 0 0 0 0 0 0 0 0 0 0 2115.01 0 0 0 0 0 0 1430.94 1168.17 -767.464 0 0 0 0 0 0 0 0 0 0.08 0 -300.684 0 0 0 0 0 0 0 0 1262.17 0 0 0 -1330.07 0 0 0 0 0 0 0 0 0 0 -1341.98 0 -452.666 
0 0 0 0 0 0 0 2324.06 -417.417 0 0 0 -306.482 -282.83 0 0 -901.288 0 0 0 2104.79 -39.903 0 0 0 2349.24 0 0 1980.88 0 0 0.09 0 0 -2443.85 0 0 0 0 -851.695 0 1643.8 0 0 0 0 0 0 0 -179.22 0 0 0 0 0 0 0 0 0 
0 0 0 87.2066 -2314.91 0 0 0 0 0 0 0 0 -771.126 -125.66 0 0 2204.73 0 1873.76 -51.8052 0 0 0 0 141.987 0 0 2291.71 0 2393.19 0 0.02 0 0 0 0 0 0 0 0 0 0 0 0 0 0 0 2437.89 0 0 -1439.48 0 0 838.267 0 0 0 0 
1828.14 -739.54 0 -176.626 0 222.709 0 0 -96.057 1929.91 0 0 0 0 976.516 624.027 0 1050.07 0 0 0 0 0 0 0 0 0 0 0 0 0 0 0 0 0 0 0 426.878 0 0 0 0 0 0 0 0 882.672 0 0 -2304.83 0 0 0 473.113 2357.78 1670.81 0 0 0 
-795.541 -1844 0 0 0 1212.12 0 0 1910.84 0 1294.67 0 -1152 1633.27 0 0 0 0 0 0 0 -2249.29 0 0 0 -231.559 0 0 0 2048.94 0 515.076 0 0 0.04 2030.47 0 0 0 0 0 0 0 1947.61 0 0 1883.07 -2363.73 1254.69 -2272.94 0 1971.57 1035.72 0 0 0 0 -1630.68 -2439.73 
0 1275.29 0 0 0 -787.759 0 0 0 0 -516.755 0 0 0 2409.51 190.207 0 0 -61.8763 -1853.01 0 0 0 0 0 2413.94 0 -467.009 0 0 0 0 0 0 1994.46 0 141.377 -555.513 0 0 2428.28 0 0 -2003.46 0 0 0 0 0 0 0 0 -523.011 0 0 0 0 -814.463 0 
226.829 0 0 0 1543.7 0 95.7518 -7.24815 0 -1170.31 0 0 1080.58 0 -347.377 0 0 1566.74 0 0 -580.233 -1367.46 0 0 0 0 0 0 0 0 0 0 0 0 0 711.005 0.02 0 0 0 1446.96 0 0 0 0 -698.645 0 0 -2340.08 1336.18 0 0 1889.32 0 0 -1386.68 0 0 0 
0 0 0 0 0 0 0 0 403.836 0 0 1892.38 0 -273.217 -1880.17 0 0 0 2479.86 0 0 0 -265.587 0 0 0 -86.7489 0 0 2451.63 0 0 0 -479.369 0 -702.765 0 0.09 1996.44 0 0 0 0 0 0 0 0 0 0 0 1186.33 0 0 -1802.5 0 0 0 0 0 
0 176.321 0 0 0 0 0 -300.226 0 0 -2171.32 0 0 -1184.5 0 0 0 2425.23 979.873 0 1206.02 0 0 0 0 0 0 -815.378 2409.51 0 0 0 0 0 0 0 0 1542.18 0.09 -203.787 0 0 1981.64 0 0 0 0 0 0 0 0 0 0 -1632.05 0 0 0 0 -985.061 
0 0 -1868.11 0 0 0 0 0 0 0 0 0 0 1747.72 0 0 0 0 0 -2176.2 0 0 0 0 0 0 0 0 -2192.53 0 0 2227.32 0 0 0 0 0 0 1313.9 0.08 0 0 0 0 -439.695 0 0 0 0 0 2219.99 0 1888.26 439.085 1450.32 -797.678 2429.2 0 0 
0 1591.77 -1066.85 0 -1892.83 1264.15 0 0 0 1901.07 0 0 0 0 -1445.28 -59.2822 2190.69 0 0 -567.873 -171.59 -964.919 0 0 0 0 1781.9 0 0 0 0 0 0 0 0 -942.183 1907.18 0 0 0 0.07 0 0 1560.03 0 0 0 0 0 0 0 0 0 0 0 989.334 0 0 0 
0 0 2439.57 0 0 213.858 -790.811 1603.37 0 0 0 1808.76 0 0 0 0 0 0 0 0 0 0 0 0 0 0 0 -1116.9 -257.805 253.99 2274.01 -129.475 0 0 0 0 0 0 0 0 0 0.01 0 0 0 0 857.952 0 0 -620.975 0 0 -2325.89 491.882 -839.946 0 0 0 0 
0 0 974.837 0 0 0 0 0 -1043.81 0 0 2158.35 0 0 0 603.427 0 1941.66 0 -2228.39 0 0 0 0 0 -2176.81 707.801 2217.09 0 0 0 0 0 0 0 0 0 0 1853.47 0 0 0 0.06 0 0 0 195.09 0 0 0 23.423 0 0 0 0 0 299.921 0 0 
0 0 0 0 0 0 -862.529 0 0 0 0 0 1175.34 0 2167.35 0 0 1902.3 0 0 -420.164 0 0 -938.673 0 -487.152 0 0 0 0 0 0 0 0 -671.178 -1376.61 0 0 0 0 1973.1 0 0 0 0 0 0 1447.87 0 -1408.96 0 0 0 -678.503 0 0 0 0 0 
1295.28 0 514.161 0 0 0 0 0 0 0 0 0 831.706 0 0 0 0 0 0 0 0 0 0 0 -1084.86 0 0 0 0 0 0 0 0 0 0 0 0 0 0 2218.16 0 0 0 0 0.05 2267.14 -1891.77 -181.204 0 491.424 0 0 -1491.52 0 0 0 0 0 0 
0 0 0 0 0 -2205.8 0 -425.352 1124.84 0 0 0 0 0 0 0 2254.94 0 0 744.423 0 0 0 0 0 0 0 0 354.244 0 -1396.76 0 0 0 0 0 2144.61 0 0 0 0 0 0 0 969.192 0 0 0 0 0 -2142.63 0 0 1511.51 0 0 0 0 0 
-128.407 0 1838.36 0 0 952.101 1606.11 0 0 0 0 0 469.604 0 -184.866 0 0 1440.86 0 -828.349 -1715.06 0 0 -2486.42 1996.6 0 1926.1 0 0 0 0 0 0 2029.71 2307.28 0 0 0 0 0 0 177.389 -197.073 0 -981.704 0 0.08 0 0 0 166.555 0 0 2388.91 -1803.57 0 0 1807.54 0 
0 0 0 0 0 0 0 0 1675.24 0 0 0 0 0 0 2150.87 671.331 0 0 -2421.57 0 0 0 0 0 0 0 431.15 0 0 0 0 0 0 1164.97 0 0 0 0 0 0 0 0 1073.11 -373.012 0 0 0.04 0 0 -730.842 0 0 0 0 0 0 0 0 
0 0 0 0 0 0 0 0 2155.9 0 0 0 764.26 0 0 0 0 0 0 2331.84 0 -1875.9 0 515.381 0 0 1499.76 0 0 0 0 0 2065.72 0 -2399.14 0 2241.51 0 0 0 0 0 0 0 0 0 0 0 0.09 0 0 -1868.88 0 886.181 0 0 0 -925.55 0 
0 0 0 0 -2356.72 0 0 1801.89 0 0 574.435 0 868.48 0 0 779.214 0 0 195.7 0 -1231.19 0 0 2144.61 0 0 0 0 -1265.22 0 0 1435.21 0 1681.19 145.192 0 -2328.03 0 0 0 0 -1034.2 0 -1243.1 2451.93 0 0 0 0 0.06 0 0 0 0 0 1696.75 0 0 0 
0 0 0 1533.02 0 1253.47 -1620 0 0 0 0 0 0 1825.08 0 0 797.678 0 -970.565 0 552.309 -1930.98 0 548.036 0 0 0 0 0 0 0 0 0 0 0 0 0 1605.66 0 281.304 0 0 -371.029 0 0 -1618.78 405.972 1588.87 0 0 0.02 0 0 0 0 0 0 0 0 
0 0 0 2151.48 0 0 0 0 0 1960.59 0 0 -2430.11 0 0 0 1038.47 0 0 0 0 1166.95 0 1844.61 0 0 -1056.93 0 0 2474.21 0 0 746.864 0 1846.9 0 0 0 0 0 0 0 0 0 0 0 0 0 606.326 0 0 0.08 0 -1196.71 -162.893 0 0 0 0 
0 0 0 -208.518 1661.2 0 0 0 0 0 0 0 0 0 0 0 0 0 2371.21 2177.72 0 0 0 -1017.11 0 0 0 0 0 0 0 0 0 0 857.952 -1514.86 433.287 0 0 -412.839 0 412.687 0 0 -1533.94 0 0 0 0 0 0 0 0.01 0 494.629 0 0 0 0 
1153.52 0 0 1814.1 0 0 2207.02 2243.34 0 0 -679.724 0 0 0 0 0 0 0 0 0 -1617.25 0 2210.38 0 0 83.8496 0 0 0 0 0 0 0 -2129.35 0 0 0 1382.26 2028.34 1533.33 0 -884.35 0 -33.9518 0 1719.79 -2197.1 0 1364.1 0 0 -1854.84 0 0.04 478.912 0 0 0 0 
0 -2422.03 197.378 0 2041.31 761.208 0 0 0 0 0 1422.85 0 0 1716.9 0 0 -836.436 1998.89 0 0 0 0 0 299.921 0 0 0 1241.26 -1257.29 0 0 1141.93 -2239.68 0 0 0 0 0 -2174.21 0 -1395.23 0 0 0 0 1331.45 0 0 0 0 -390.713 1031.91 937.147 0.08 0 -381.863 0 0 
2067.71 0 0 0 -1901.84 0 0 0 2460.94 517.365 -675.756 0 0 0 0 0 0 0 -669.958 0 0 0 0 0 1830.58 0 0 0 0 0 0 0 0 1848.43 0 0 -1171.83 0 0 -1303.98 2497.25 0 0 0 0 0 0 0 0 1463.44 0 0 0 0 0 0.04 0 0 0 
0 0 0 0 0 1981.49 0 0 0 1410.49 0 0 0 0 0 0 0 -1489.23 13.0467 0 0 0 0 0 1633.58 0 0 0 0 0 556.276 0 0 0 0 0 0 0 0 1349.15 0 0 2442.78 0 0 0 0 0 0 0 0 0 0 0 411.924 0 0 0 0 
0 0 0 0 0 0 1812.72 0 0 0 2323.45 0 0 0 0 0 0 0 0 0 0 0 0 0 0 0 0 0 0 0 0 0 0 0 -2299.8 852.458 0 0 0 0 0 0 0 0 0 0 560.396 0 2237.08 0 0 0 0 0 0 0 0 0.06 0 
0 0 771.279 0 0 0 0 0 1794.11 0 0 0 0 0 0 0 0 0 0 0 0 457.091 0 0 0 0 -415.281 0 0 0 1887.49 0 0 0 -1549.04 0 0 0 -771.126 0 0 0 0 0 0 0 0 0 0 0 0 0 0 0 0 0 0 0 0.02 
