*Vertices 52
*Matrix 
0.09 0 0 0 0 0 0 1066.39 0 0 0 0 0 2484.89 -377.132 0 0 0 0 0 0 0 0 0 0 0 0 -1340.3 2222.59 0 0 0 2032.46 0 0 0 683.996 0 0 0 0 0 0 2362.06 0 0 0 2170.55 0 0 0 0 
0 0.08 0 0 0 0 0 2099.44 -1169.85 0 0 0 0 0 0 0 0 0 0 0 0 0 0 1220.82 0 0 0 0 0 0 0 0 0 0 0 0 2253.26 0 0 0 0 0 0 0 0 0 0 221.335 0 0 0 0 
0 0 0.02 0 1967.76 0 0 0 0 -117.878 0 0 0 0 779.519 -1228.75 0 0 0 0 0 -234.001 -534.303 0 0 0 0 1289.48 0 0 0 0 0 461.516 0 0 0 0 0 0 0 0 0 0 0 0 0 0 0 0 0 0 
0 0 0 0.05 0 0 -1614.05 0 439.848 0 0 0 0 0 0 2047.41 0 0 0 0 -196.31 0 0 0 2220.76 0 1849.35 0 -1204.03 0 0 0 0 0 1451.38 0 0 0 0 0 0 0 0 0 0 0 0 0 0 0 0 0 
0 0 2271.72 0 0.07 1052.2 0 0 -1541.41 0 0 0 0 0 0 0 0 0 0 0 0 603.58 0 0 0 0 0 0 0 0 0 2059.92 0 -1457.79 0 0 0 0 964.156 0 0 0 0 0 0 0 0 0 0 0 0 0 
0 0 0 0 2198.32 0.06 -1193.96 -396.207 0 0 0 0 -1631.29 0 838.42 0 0 0 0 0 0 0 2240.44 0 0 0 0 0 0 -1428.19 0 0 1492.58 0 0 0 0 0 0 0 0 0 1184.5 0 0 0 0 0 0 0 0 0 
0 0 0 1446.65 0 1151.69 0.01 0 322.199 0 0 0 0 0 0 73.4733 0 0 0 0 0 0 0 0 0 0 0 0 0 0 2176.2 0 0 0 1575.59 0 0 0 0 0 0 0 0 0 0 0 0 0 0 0 0 0 
-1020.92 2151.78 0 0 0 -368.435 0 0.05 759.529 0 0 0 0 0 0 0 0 0 0 0 0 0 0 0 0 0 0 0 0 65.8437 0 0 0 0 0 0 0 487.304 0 0 0 0 0 0 0 781.808 0 -467.315 0 0 0 0 
0 -154.347 0 712.378 -1679.97 0 -563.143 -1361.96 0.07 1207.24 1967.45 884.96 0 0 0 0 1582.77 0 935.011 0 0 0 0 0 -1876.35 0 0 0 0 0 0 1480.07 0 0 0 0 0 0 0 0 0 0 0 0 1050.52 0 0 0 0 0 0 0 
0 0 -348.75 0 0 0 0 0 -879.772 0.09 0 0 181.814 0 0 0 0 0 0 2045.43 0 0 0 0 0 0 0 0 0 0 0 0 0 0 0 0 0 0 0 0 0 0 0 0 0 0 0 0 0 0 0 0 
0 0 0 0 0 0 0 0 -1596.65 0 0.07 0 0 0 0 0 1734.6 0 0 0 224.998 0 0 0 0 0 0 -1862.01 299.158 0 -255.821 1795.63 0 0 0 0 -430.082 0 0 2452.85 0 0 0 0 0 0 0 0 0 0 0 0 
0 0 0 0 0 0 0 0 1528.44 0 0 0 1664.71 0 0 0 0 0 0 0 2361.45 0 0 0 0 0 0 0 0 0 0 0 2389.98 0 0 -211.875 -12.7415 0 0 0 0 0 0 0 0 1546.45 -918.683 0 0 -2184.9 0 0 
0 0 0 0 0 901.288 0 0 0 -396.054 0 1762.67 0 1965.32 0 0 0 0 0 0 0 0 0 -759.224 0 0 0 0 0 0 0 0 0 0 0 0 0 0 0 0 0 0 0 2028.18 0 0 0 0 1160.08 0 0 0 
-610.446 0 0 0 0 0 0 0 0 0 0 0 1528.75 0 0 0 0 0 -1042.44 0 0 0 0 0 0 0 0 0 0 0 0 -1865.37 0 0 0 0 2175.13 0 0 0 0 1245.54 0 0 0 0 0 0 0 0 0 0 
895.795 0 2490.84 0 0 -425.657 0 0 0 0 0 0 0 0 0.04 0 0 0 0 0 0 0 0 0 969.955 0 0 0 0 0 0 0 0 0 1573.46 -685.217 0 0 0 0 0 0 0 0 0 0 0 0 0 0 0 0 
0 0 1134.75 -2030.63 0 0 -433.134 0 0 0 0 0 0 0 0 0.08 0 0 0 0 0 0 0 0 0 2322.08 0 0 0 0 0 0 0 0 0 0 0 0 0 0 1818.52 0 0 0 0 0 0 -1797.01 -1169.55 0 0 0 
0 0 0 0 0 0 0 0 -1593.91 0 1164.36 0 0 0 0 0 0.05 0 0 0 0 0 0 1055.86 0 0 0 0 0 1929.15 2022.23 0 0 0 0 0 0 0 0 0 0 0 0 0 0 0 0 0 0 0 0 0 
0 0 0 0 0 0 0 0 0 0 0 0 0 0 0 0 0 0.01 0 0 0 0 1633.27 0 0 0 0 0 0 2226.4 2026.35 0 0 0 0 0 0 0 -1017.56 0 0 0 -2420.35 0 0 -992.843 727.18 0 0 345.851 0 0 
0 0 0 0 0 0 0 0 521.332 0 0 0 0 313.654 0 0 0 0 0.05 0 0 0 0 -1707.74 0 -527.741 0 0 0 0 0 0 0 -595.798 0 481.201 0 0 0 0 0 0 1307.64 0 0 0 0 0 0 0 0 0 
0 0 0 0 0 0 0 0 0 -1623.81 0 0 0 0 0 0 0 0 0 0.06 2036.73 -1360.74 0 0 0 0 0 0 0 0 0 0 0 0 0 0 0 0 0 0 0 0 0 0 0 0 2010.94 0 0 0 0 0 
0 0 0 1325.34 0 0 0 0 0 0 1854.08 858.715 0 0 0 0 0 0 0 647.984 0.06 2030.78 0 0 -266.198 -2210.07 0 0 0 0 0 0 0 0 493.866 0 0 0 0 0 0 0 0 0 0 0 0 0 0 0 0 0 
0 0 -2285 0 619.144 0 0 0 0 0 0 0 0 0 0 0 0 0 0 -761.971 1535 0.02 0 0 0 0 0 0 0 0 0 0 0 0 0 0 0 -1791.06 0 0 0 2290.03 0 0 0 0 1093.25 0 0 0 0 0 
0 0 2123.4 0 0 19.7607 0 0 0 0 0 0 0 0 0 0 0 1900.77 0 0 0 0 0.04 0 0 0 0 0 1251.64 0 -1985.31 0 0 0 0 0 0 0 0 0 0 0 0 -2331.84 0 0 0 0 0 -121.845 0 0 
0 -1392.33 0 0 0 0 0 0 0 0 0 0 2093.8 0 0 0 2373.81 0 -150.227 0 0 0 0 0.05 2014.45 0 0 0 -929.975 0 1340.75 0 377.132 0 0 0 0 1050.22 -603.427 0 0 0 0 0 0 0 0 0 0 -221.03 0 0 
0 0 0 288.934 0 0 0 0 1058.92 0 0 0 0 0 867.107 0 0 0 0 0 1776.71 0 0 1345.03 0 0 1755.81 0 0 0 0 0 0 0 0 0 0 -383.694 0 0 270.623 0 0 0 0 0 0 548.646 0 0 0 0 
0 0 0 0 0 0 0 0 0 0 0 0 0 0 0 1860.48 0 0 1298.33 0 262.078 0 0 0 0 0.05 2422.48 0 0 0 0 0 0 0 0 0 0 0 0 0 0 0 0 0 0 0 0 0 0 0 0 0 
0 0 0 1410.18 0 0 0 0 0 0 0 0 0 0 0 0 0 0 0 0 0 0 0 0 1512.88 -2076.1 0.05 0 0 0 0 1360.59 0 0 0 0 0 0 0 0 0 0 0 0 0 0 0 0 0 0 0 0 
-1275.29 0 -602.054 0 0 0 0 0 0 0 -398.038 0 0 0 0 0 0 0 0 0 0 0 0 0 0 0 0 0.03 0 0 0 0 1422.24 0 0 0 0 0 0 2427.21 0 1470.92 0 0 0 0 1179.01 0 0 0 0 0 
-302.515 0 0 181.051 0 0 0 0 0 0 2269.43 0 0 0 0 0 0 0 0 0 0 0 -332.881 2325.59 0 0 0 0 0.06 0 1262.63 0 0 1828.9 0 0 0 0 0 0 0 0 -910.749 0 0 0 0 0 2298.88 0 0 0 
0 0 0 0 0 1954.63 0 -923.566 0 0 0 0 0 0 0 0 -628.758 2397.76 0 0 0 0 0 0 0 0 0 0 0 0.03 -1794.41 0 0 0 685.064 0 0 0 0 0 0 0 0 0 1448.48 0 0 0 0 0 -456.023 0 
0 0 0 0 0 0 1193.35 0 0 0 1855.75 0 0 0 0 0 -990.249 1846.14 0 0 0 0 705.359 1847.67 0 0 0 0 1898.02 31.9681 0.01 0 0 0 0 0 0 0 0 1884.44 0 0 0 2390.59 0 0 0 -170.98 0 0 -186.239 0 
0 0 0 0 333.796 0 0 0 -2282.56 0 1673.86 0 0 1601.08 0 0 0 0 0 0 0 0 0 0 0 0 136.952 0 0 0 0 0.09 0 0 0 2342.98 0 0 0 0 0 0 0 2037.49 1146.2 0 0 0 0 1163.44 0 0 
-438.932 0 0 0 0 1378.6 0 0 0 0 0 2213.43 0 0 0 0 0 0 0 0 0 0 0 2271.42 0 0 0 -1040.15 0 0 0 0 0.07 0 0 0 0 0 0 0 1052.05 0 0 0 0 0 0 -1320.92 0 0 0 0 
0 0 1721.47 0 885.876 0 0 0 0 0 0 0 0 0 0 0 0 0 -2311.85 0 0 0 0 0 0 0 0 0 1784.34 0 0 0 0 0.06 0 0 0 0 0 0 0 0 0 0 0 0 -1069.75 0 682.012 2065.26 0 0 
0 0 0 1712.32 0 0 -1150.32 0 0 0 0 0 0 0 -444.121 0 0 0 0 0 -68.2852 0 0 0 0 0 0 0 0 1159.47 0 0 0 0 0.05 0 0 0 0 0 0 0 0 0 0 0 1001.24 0 0 0 0 0 
0 0 0 0 0 0 0 0 0 0 0 390.713 0 0 388.882 0 0 0 -1.29704 0 0 0 0 0 0 0 0 0 0 0 0 833.995 0 0 0 0.02 0 0 0 0 0 0 0 0 0 0 0 0 0 0 0 0 
-917.158 -1145.74 0 0 0 0 0 0 0 0 -1538.82 -951.491 0 2120.66 0 0 0 0 0 0 0 0 0 0 0 0 0 0 0 0 0 0 0 0 0 0 0.06 0 0 2214.04 0 0 0 0 0 0 0 0 2350.31 0 0 0 
0 0 0 0 0 0 0 1912.98 0 0 0 0 0 0 0 0 0 0 0 0 0 -1574.83 0 -121.693 389.95 0 0 0 0 0 0 0 0 0 0 0 0 0.04 0 0 0 0 0 0 0 0 0 0 0 0 0 0 
0 0 0 0 511.109 0 0 0 0 0 0 0 0 0 0 0 0 -1491.21 0 0 0 0 0 2250.82 0 0 0 0 0 0 0 0 0 0 0 0 0 0 0.08 0 0 0 0 0 0 0 -1060.75 0 0 1771.37 0 0 
0 0 0 0 0 0 0 0 0 0 -1041.06 0 0 0 0 0 0 0 0 0 0 0 0 0 0 0 0 -1738.26 0 0 194.327 0 0 0 0 0 1908.86 0 0 0.03 1841.41 0 0 0 0 0 0 0 0 0 0 0 
0 0 0 0 0 0 0 0 0 0 0 0 0 0 0 1255 0 0 0 0 0 0 0 0 1407.44 0 0 0 0 0 0 0 2008.8 0 0 0 0 0 0 -2014.45 0.04 91.174 0 0 0 0 1349.3 0 0 1242.03 0 -2079 
0 0 0 0 0 0 0 0 0 0 0 0 0 619.297 0 0 0 0 0 0 0 -9.68963 0 0 0 0 0 411.008 0 0 0 0 0 0 0 0 0 0 0 0 2275.54 0 0 0 -11.8259 0 0 0 0 0 0 0 
0 0 0 0 0 414.212 0 0 0 0 0 0 0 0 0 0 0 1675.39 414.365 0 0 0 0 0 0 0 0 0 844.218 0 0 0 0 0 0 0 0 0 0 0 0 0 0.02 0 0 0 0 0 0 0 0 0 
1248.59 0 0 0 0 0 0 0 0 0 0 0 -1813.79 0 0 0 0 0 0 0 0 0 2020.1 0 0 0 0 0 0 0 799.051 1000.93 0 0 0 0 0 0 0 0 0 0 0 0.07 0 0 0 -131.458 0 0 0 0 
0 0 0 0 0 0 0 0 2407.22 0 0 0 0 0 0 0 0 0 0 0 0 0 0 0 0 0 0 0 0 -1836.99 0 1147.72 0 0 0 0 0 0 0 0 0 -791.726 0 0 0.04 0 0 0 0 0 0 0 
0 0 0 0 0 0 0 653.63 0 0 0 1922.44 0 0 0 0 0 1197.93 0 0 0 0 0 0 0 0 0 0 0 0 0 0 0 0 0 0 0 0 0 0 0 0 0 0 0 0.06 0 0 0 0 0 0 
0 0 0 0 0 0 0 0 0 0 0 559.633 0 0 0 0 0 2077.78 0 1663.34 0 -1115.07 0 0 0 0 0 1168.63 0 0 0 0 0 273.827 250.175 0 0 0 1020.62 0 2222.13 0 0 0 0 0 0.04 1593.91 0 0 0 0 
-412.534 416.044 0 0 0 0 0 2105.7 0 0 0 0 0 0 0 208.975 0 0 0 0 0 0 0 0 -1513.03 0 0 0 0 0 557.497 0 2368.16 0 0 0 0 0 0 0 0 0 0 2334.28 0 0 -2167.04 0.02 0 0 0 0 
0 0 0 0 0 0 0 0 0 0 0 0 -99.1089 0 0 -1437.19 0 0 0 0 0 0 0 0 0 0 0 0 557.344 0 0 0 0 1040.3 0 0 -133.9 0 0 0 0 0 0 0 0 0 0 0 0.05 0 2204.28 0 
0 0 0 0 0 0 0 0 0 0 0 1898.63 0 0 0 0 0 -1817.76 0 0 0 0 2377.77 1403.62 0 0 0 0 0 0 0 795.541 0 2311.24 0 0 0 0 1288.11 0 1379.97 0 0 0 0 0 0 0 0 0.02 0 0 
0 0 0 0 0 0 0 0 0 0 0 0 0 0 0 0 0 0 0 0 0 0 0 0 0 0 0 0 0 1084.55 1639.23 0 0 0 0 0 0 0 0 0 0 0 0 0 0 0 0 0 951.338 0 0.09 0 
0 0 0 0 0 0 0 0 0 0 0 0 0 0 0 0 0 0 0 0 0 0 0 0 0 0 0 0 0 0 0 0 0 0 0 0 0 0 0 0 2324.82 0 0 0 0 0 0 0 0 0 0 0 
