*Vertices 61
*Matrix 
0.08 0 0 0 0 0 0 -2264.85 0 0 0 0 0 0 0 0 1428.8 0 0 0 0 0 0 0 0 0 0 0 0 0 0 0 0 0 0 0 0 0 0 0 0 0 0 0 0 0 0 0 0 192.343 0 0 1342.59 0 0 0 0 0 0 0 0 
0 0.07 0 0 0 0 0 1405 0 -572.146 -478.454 0 0 0 0 0 1392.48 0 0 0 0 0 0 0 0 0 0 0 0 0 893.201 0 0 0 -171.133 0 -189.596 -381.558 2407.53 0 0 0 0 0 0 0 0 0 0 0 0 0 0 0 0 0 0 0 0 0 0 
0 0 0.02 0 0 1101.34 0 0 0 0 0 0 0 0 0 -930.28 0 0 0 0 0 0 0 -2219.23 0 0 0 0 -753.883 0 0 1761.76 0 0 0 0 0 0 0 0 0 0 0 0 0 0 0 0 2272.48 -1766.03 0 0 0 0 0 0 2434.23 0 0 0 0 
0 0 0 0.09 0 0 0 0 0 0 0 2058.09 2389.83 0 0 0 1279.26 0 0 1830.58 0 0 0 1294.06 0 1883.22 292.444 0 0 0 0 0 0 0 0 0 0 0 0 0 0 0 0 0 0 0 0 0 0 0 1524.93 2154.53 0 0 0 0 0 0 0 0 0 
0 0 0 0 0.09 0 0 0 0 0 -56.5355 0 0 0 0 1822.18 0 0 0 0 0 0 0 0 0 0 0 0 0 0 0 0 0 -2367.09 0 0 0 0 885.113 0 0 -629.521 0 1709.88 0 0 0 0 -1015.73 282.983 0 2156.97 0 0 0 0 0 0 0 0 609.989 
0 0 -1732.92 0 0 0.09 0 0 0 0 0 0 0 798.288 0 -1405.15 0 0 0 0 0 0 0 1542.79 1235.62 0 0 0 0 0 0 0 0 0 0 0 1102.56 0 0 0 0 0 0 0 0 0 0 0 0 0 750.221 0 0 0 0 0 0 0 0 0 0 
0 0 0 0 0 0 0.05 -633.335 0 0 0 0 0 0 0 0 0 0 0 0 0 0 0 0 0 0 0 0 -186.697 0 0 0 0 0 0 0 0 0 0 0 0 1502.96 -470.824 0 0 0 0 793.863 5.87481 0 0 0 0 0 0 0 0 0 0 0 0 
2109.97 632.725 0 0 0 0 1940.9 0 0 0 0 0 0 0 0 0 0 0 0 0 0 -1298.33 0 0 0 -1563.84 0 0 0 0 0 0 202.109 0 0 0 0 1719.03 -142.293 0 0 0 0 1715.52 -2254.63 0 0 0 0 0 0 0 0 0 0 310.297 0 0 0 0 0 
0 0 0 0 0 0 0 0 0.05 0 0 0 0 0 721.381 0 0 0 0 0 0 0 0 0 0 937.147 1928.39 -745.338 0 0 0 0 -1775.95 0 0 0 0 0 0 0 0 0 0 0 0 0 0 -1151.54 0 0 371.181 2114.86 0 0 0 0 0 0 0 0 0 
0 2094.56 0 0 0 0 0 0 0 0.02 0 0 0 0 0 0 0 0 0 0 0 397.427 0 0 0 0 0 0 0 0 0 0 0 0 68.2852 0 0 0 101.703 0 -750.221 0 0 0 -1935.87 0 2171.62 0 0 0 0 0 0 0 0 0 0 0 0 0 0 
0 1463.29 0 0 -761.055 0 0 0 0 0 0.03 0 2492.98 0 0 -2238 1586.89 0 0 0 0 0 0 0 0 0 280.694 0 0 739.998 1722.24 0 1913.43 0 0 1976.3 0 0 1652.96 0 0 0 0 0 -2470.24 0 0 0 -2107.68 0 0 0 0 0 0 0 0 0 0 -865.276 0 
0 0 0 730.995 0 0 0 0 0 0 0 0.04 0 0 0 0 0 0 0 0 -857.494 0 0 0 0 1916.03 0 0 0 0 0 0 0 0 0 2053.21 0 0 0 0 0 -1235.62 0 0 0 0 0 0 0 0 2415.16 0 0 0 0 0 0 0 0 0 0 
0 0 0 1701.48 0 0 0 0 0 0 1399.2 0 0.08 0 0 0 0 0 0 0 0 0 0 0 0 838.115 0 0 0 0 -2410.89 0 0 0 0 0 0 988.723 0 0 0 0 0 1173.67 0 0 0 0 0 0 0 0 0 0 -1105.91 0 2161.7 0 0 0 0 
0 0 0 0 0 1789.83 0 0 0 0 0 0 0 0.03 0 0 0 0 0 0 720.466 0 1518.22 0 0 0 0 0 2075.79 0 -335.322 0 0 0 0 0 -1877.73 0 0 0 0 0 0 0 0 0 0 0 0 0 0 0 0 0 0 0 0 0 0 0 0 
0 0 0 0 0 0 0 0 526.063 0 0 0 0 0 0.07 2123.86 0 0 0 0 0 0 0 0 0 0 0 0 0 0 0 0 0 0 0 -1876.2 0 0 0 1548.13 0 1364.71 0 0 0 0 0 1264.92 0 0 -1584.44 0 0 -664.312 0 0 0 0 0 0 0 
0 0 1740.24 0 -1487.4 -641.575 0 0 0 0 1164.05 0 0 0 -410.855 0.02 0 0 0 0 0 0 0 0 0 0 0 480.743 0 0 0 0 2054.89 0 0 0 0 1148.64 0 0 0 0 0 0 0 0 0 0 0 0 -1414.15 -529.572 0 0 0 0 0 0 0 0 0 
-2148.58 673.62 0 -1866.89 0 0 0 0 0 0 -1474.27 0 0 0 0 0 0.06 2130.42 0 919.904 0 0 0 0 0 0 2213.13 0 0 0 0 0 0 0 0 0 0 0 0 -324.488 0 0 0 0 0 0 0 0 1421.63 0 1328.85 0 0 592.135 0 1770.3 0 0 0 0 0 
0 0 0 0 0 0 0 0 0 0 0 0 0 0 0 0 980.331 0.05 1170.31 0 0 0 0 0 0 602.359 0 -1781.44 2378.54 0 0 0 0 0 359.89 0 0 0 0 0 0 0 275.964 0 1695.07 0 0 0 0 0 0 0 0 0 0 0 0 0 0 0 0 
0 0 0 0 0 0 0 0 0 0 0 0 0 0 0 0 0 -547.578 0.02 -1383.94 0 0 0 0 0 0 0 0 0 2072.28 0 0 0 0 0 -1418.27 0 0 0 0 0 0 0 0 0 0 0 0 0 0 1377.99 0 2400.97 0 0 0 0 0 0 0 0 
0 0 0 1454.74 0 0 0 0 0 0 0 0 0 0 0 0 652.715 0 1639.07 0.06 0 1821.42 0 0 0 0 0 0 0 0 0 0 0 0 -1628.39 0 0 0 2302.09 0 0 0 0 0 0 0 0 0 0 0 0 0 1260.95 0 0 537.049 0 0 0 0 0 
0 0 0 0 0 0 0 0 0 0 0 -1053.73 0 2236.17 0 0 0 0 0 0 0.08 0 0 0 0 0 0 0 0 -1938.76 0 0 0 0 970.412 0 0 0 0 0 2071.06 0 0 0 0 0 0 0 0 1940.44 0 0 0 0 0 0 0 0 0 0 0 
0 0 0 0 0 0 0 -1634.19 0 -903.119 0 0 0 0 0 0 0 0 0 629.521 0 0.08 2226.1 0 0 0 0 0 0 0 0 0 1631.6 0 0 0 0 2047.41 0 0 0 0 0 0 0 0 0 0 0 275.048 0 0 0 0 0 0 2487.95 0 0 0 0 
0 0 0 0 0 0 0 0 0 0 0 0 0 1403.47 0 0 0 0 0 0 0 1559.72 0.03 0 -1605.04 0 0 0 0 0 -1702.86 0 0 0 0 0 0 0 0 0 0 0 0 0 0 0 0 0 0 0 0 0 0 0 0 0 0 0 0 0 0 
0 0 646.306 107.807 0 1220.36 0 0 0 0 0 0 0 0 0 0 0 0 0 0 0 0 0 0.02 0 0 0 0 0 89.6481 0 0 0 0 0 0 0 0 0 0 1531.34 0 0 0 0 0 0 2050 0 0 0 0 0 0 0 0 0 0 0 0 0 
0 0 0 0 0 -657.292 0 0 0 0 0 0 0 0 0 0 0 0 0 0 0 0 545.747 0 0.09 0 -893.353 0 0 0 542.085 0 1775.19 0 0 0 2153.46 0 0 0 0 0 0 61.8763 0 0 0 0 206.839 0 0 0 0 0 0 0 0 0 0 0 0 
0 0 0 -798.288 0 0 0 1433.23 -686.285 0 0 2254.63 638.371 0 0 0 0 968.429 0 0 0 0 0 0 0 0.09 0 0 0 0 0 0 0 0 0 0 0 0 0 0 0 0 0 116.962 0 0 99.7192 0 0 0 0 0 0 0 711.463 0 0 0 0 0 0 
0 0 0 1719.64 0 0 0 0 -1308.71 0 2383.57 0 0 0 0 0 1903.67 0 0 0 0 0 0 0 374.538 0 0.06 0 0 0 0 0 0 0 0 0 0 -1812.88 -1385.46 1417.05 0 0 0 0 0 0 891.064 0 0 0 0 -613.651 0 0 2228.08 0 0 0 0 0 0 
0 0 0 0 0 0 0 0 2243.03 0 0 0 0 0 0 2313.07 0 -369.503 0 0 0 0 0 0 0 0 0 0.03 0 0 0 0 0 0 0 -722.907 -412.076 0 0 0 0 0 0 0 0 -945.845 0 0 0 0 0 0 0 1851.63 2186.73 0 0 0 0 0 0 
0 0 521.638 0 0 0 1655.86 0 0 0 0 0 0 -365.993 0 0 0 908.612 0 0 0 0 0 0 0 0 0 0 0.08 0 0 -1448.33 2404.17 0 0 0 -2143.7 0 0 0 0 0 0 0 0 0 0 0 -1061.82 0 0 144.429 0 0 0 0 0 0 0 0 0 
0 0 0 0 0 0 0 0 0 0 -1330.38 0 0 0 0 0 0 0 1387.45 0 346.156 0 0 1273.16 0 0 0 0 0 0.01 0 0 0 0 0 0 0 0 1271.48 0 0 0 0 0 0 0 0 0 0 0 0 0 0 0 0 0 0 0 0 0 0 
0 18.54 0 0 0 0 0 0 0 0 -1586.73 0 678.961 1576.66 0 0 0 0 0 0 0 0 2298.43 0 2201.38 0 0 0 0 0 0.09 0 0 0 1268.12 0 0 -967.971 0 0 0 0 2420.19 0 0 -2416.53 0 0 0 -591.83 0 0 0 0 0 0 0 0 0 0 0 
0 0 2201.22 0 0 0 0 0 0 0 0 0 0 0 0 0 0 0 0 0 0 0 0 0 0 0 0 0 865.429 0 0 0.01 -1472.9 0 0 651.646 0 -779.519 0 0 0 0 -267.571 0 -1087.3 0 0 0 0 2239.37 0 0 0 0 0 0 0 0 0 0 0 
0 0 0 0 0 0 0 -182.577 493.408 0 -293.054 0 0 0 0 716.498 0 0 0 0 0 -1600.01 0 0 -658.971 0 0 0 -885.571 0 0 1389.13 0.07 0 0 0 0 0 869.243 0 0 2293.24 0 0 0 0 0 -907.392 0 0 0 0 0 0 2172.99 0 1070.21 0 0 0 0 
0 0 0 0 -2247 0 0 0 0 0 0 0 0 0 0 0 0 0 0 0 0 0 0 0 0 0 0 0 0 0 0 0 0 0.08 0 0 0 2217.7 0 0 0 -448.393 0 0 0 0 0 1874.52 0 0 0 0 0 0 0 0 0 0 0 0 0 
0 2287.44 0 0 0 0 0 0 0 1090.5 0 0 0 0 0 0 0 66.7592 0 994.064 341.731 0 0 0 0 0 0 0 0 0 -994.98 0 0 0 0.05 0 -1826.91 2388.45 0 0 0 1177.94 0 835.063 1200.22 0 0 0 0 0 0 567.568 0 0 0 0 0 0 0 0 0 
0 0 0 0 0 0 0 0 0 0 -219.199 960.036 0 0 2393.19 0 0 0 604.038 0 0 0 0 0 0 0 0 -1188.77 0 0 0 1122.09 0 0 0 0.03 0 0 2175.59 0 0 0 -864.666 0 0 0 0 0 0 0 0 0 514.771 0 0 0 0 0 0 0 0 
0 1653.26 0 0 0 280.694 0 0 0 0 0 0 0 2344.97 0 0 0 0 0 0 0 0 0 0 1929.15 0 0 2161.85 111.621 0 0 0 0 0 -1054.64 0 0 0 0 0 0 632.725 0 0 0 0 0 0 0 0 0 0 0 295.801 0 0 0 0 0 0 0 
0 1065.02 0 0 0 0 0 513.245 0 0 0 0 -1500.98 0 0 1607.49 0 0 0 0 0 -1379.21 0 0 0 0 2186.57 0 0 0 1889.63 1520.81 0 1593.75 -1822.64 0 0 0.02 0 0 0 0 0 0 -733.894 0 2069.99 0 0 -517.518 0 0 0 0 0 0 0 0 0 0 0 
0 -1675.54 0 0 1673.86 0 0 708.106 0 -518.738 -32.2733 0 0 0 0 0 0 0 0 2214.8 0 0 0 0 0 0 2357.63 0 0 128.864 0 0 894.421 0 0 1123 0 0 0 0 0 0 -1277.58 0 0 0 0 0 0 0 0 0 0 0 0 0 0 0 0 0 0 
0 0 0 0 0 0 0 0 0 0 0 0 0 0 1551.03 0 1299.4 0 0 0 0 0 0 0 0 0 -1780.22 0 0 0 0 0 0 0 0 0 0 0 0 0.02 0 0 0 0 0 0 0 1721.93 0 0 -258.415 736.488 0 0 0 -2167.81 218.284 0 0 0 0 
0 0 0 0 0 0 0 0 0 1189.99 0 0 0 0 0 0 0 0 0 0 422.605 0 0 609.531 0 0 0 0 0 0 0 0 0 0 0 0 0 0 0 0 0 0 0 0 0 0 0 0 0 0 0 0 0 0 0 0 0 0 0 0 0 
0 0 0 0 -642.643 0 1.75481 0 0 0 0 2101.58 0 0 2026.66 0 0 0 0 0 0 0 0 0 0 0 0 0 0 0 0 0 55.4674 2051.38 727.943 0 352.718 0 0 0 0 0.07 157.704 -827.281 0 0 0 -2497.41 585.116 0 0 0 0 0 0 0 0 0 0 0 0 
0 0 0 0 0 0 925.092 0 0 0 0 0 0 0 0 0 0 -1909.62 0 0 0 0 0 0 0 0 0 0 0 0 1079.82 -761.208 0 0 0 1543.55 0 0 -1199.61 0 0 1610.84 0.09 0 0 0 926.771 0 0 0 -399.564 0 0 0 0 0 0 0 0 0 0 
0 0 0 0 -926.923 0 0 -394.833 0 0 0 0 334.559 0 0 0 0 0 0 0 0 0 0 0 637.761 440.458 0 0 0 0 0 0 0 0 1210.59 0 0 0 0 0 0 -422.3 0 0.07 0 0 0 0 0 0 0 358.364 0 0 0 0 0 0 0 0 0 
0 0 0 0 0 0 0 312.738 0 1197.62 901.746 0 0 0 0 0 0 2072.74 0 0 0 0 0 0 0 0 0 0 0 0 0 88.2748 0 0 1556.52 0 0 1146.81 0 0 0 0 0 0 0.05 0 0 0 0 0 0 0 0 0 0 0 0 0 0 0 0 
0 0 0 0 0 0 0 0 0 0 0 0 0 0 0 0 0 0 0 0 0 0 0 0 0 0 0 2377.47 0 0 2301.63 0 0 0 0 0 0 0 0 0 0 0 0 0 0 0 0 0 0 0 0 0 0 0 0 2395.63 0 0 0 0 0 
0 0 0 0 0 0 0 0 0 137.104 0 0 0 0 0 0 0 0 0 0 0 0 0 0 0 -16.5563 -1591.46 0 0 0 0 0 0 0 0 0 0 1818.83 0 0 0 0 558.107 0 0 0 0.05 491.119 0 0 0 0 0 0 0 0 0 0 0 0 0 
0 0 0 0 0 0 -544.832 0 -795.846 0 0 0 0 0 363.094 0 0 0 0 0 0 0 0 -407.651 0 0 0 0 0 0 0 0 110.858 515.076 0 0 0 0 0 1497.47 0 1789.53 0 0 0 0 639.439 0.03 1260.34 0 0 -234.458 0 0 0 0 -1353.88 0 0 0 0 
0 0 2273.4 0 -80.0348 0 -898.541 0 0 0 -1663.95 0 0 0 0 0 951.949 0 0 0 0 0 0 0 1466.64 0 0 0 788.369 0 0 0 0 0 0 0 0 0 0 0 0 2475.13 0 0 0 0 0 2422.03 0.06 0 705.512 0 0 0 0 0 0 0 0 0 0 
898.541 0 -197.531 0 1649.75 0 0 0 0 0 0 0 0 0 0 0 0 0 0 0 948.286 1121.33 0 0 0 0 0 0 0 0 -86.2911 931.501 0 0 0 0 0 178.457 0 0 0 0 0 0 0 0 0 0 0 0.08 0 0 0 0 0 0 0 0 0 0 0 
0 0 0 984.909 0 -449.461 0 0 1240.65 0 0 350.124 0 0 2292.32 25.4067 1054.19 0 1627.32 0 0 0 0 0 0 0 0 0 0 0 0 0 0 0 0 0 0 0 0 271.844 0 0 1000.02 0 0 0 0 0 -863.14 0 0.05 0 1151.54 0 0 420.774 0 0 0 0 0 
0 0 0 -1942.73 1851.63 0 0 0 2315.52 0 0 0 0 0 0 -500.885 0 0 0 0 0 0 0 0 0 0 2215.11 0 557.192 0 0 0 0 0 2443.54 0 0 0 0 449.767 0 0 0 -1208 0 0 0 -663.244 0 0 0 0.03 0 0 93.1578 0 0 0 0 0 0 
-120.93 0 0 0 0 0 0 0 0 0 0 0 0 0 0 0 0 0 943.098 1165.58 0 0 0 0 0 0 0 0 0 0 0 0 0 0 0 813.7 0 0 0 0 0 0 0 0 0 0 0 0 0 0 287.866 0 0.01 0 0 0 0 0 0 0 0 
0 0 0 0 0 0 0 0 0 0 0 0 0 0 2439.88 0 -1098.44 0 0 0 0 0 0 0 0 0 0 -1415.52 0 0 0 0 0 0 0 0 1183.13 0 0 0 0 0 0 0 0 0 0 0 0 0 0 0 0 0.07 0 0 0 0 0 0 0 
0 0 0 0 0 0 0 0 0 0 0 0 1612.06 0 0 0 0 0 0 0 0 0 0 0 0 -1343.5 2101.58 795.846 0 0 0 0 462.889 0 0 0 0 0 0 0 0 0 0 0 0 0 0 0 0 0 0 823.313 0 0 0.03 -2007.74 0 0 0 0 0 
0 0 0 0 0 0 0 -1923.96 0 0 0 0 0 0 0 0 2305.6 0 0 -1142.84 0 0 0 0 0 0 0 0 0 0 0 0 0 0 0 0 0 0 0 496.918 0 0 0 0 0 311.212 0 0 0 0 548.036 0 0 0 319.147 0.09 0 647.679 0 0 0 
0 0 355.159 0 0 0 0 0 0 0 0 0 2005.75 0 0 0 0 0 0 0 0 1174.28 0 0 0 0 0 0 0 0 0 0 2187.49 0 0 0 0 0 0 -608.158 0 0 0 0 0 0 0 1875.59 0 0 0 0 0 0 0 0 0 0 0 0 0 
0 0 0 0 0 0 0 0 0 0 0 0 0 0 0 0 0 0 0 0 0 0 0 0 0 0 0 0 0 0 0 0 0 0 0 0 0 0 0 0 0 0 0 0 0 0 0 0 0 0 0 0 0 0 0 1805.55 0 0.07 318.69 0 0 
0 0 0 0 0 0 0 0 0 0 0 0 0 0 0 0 0 0 0 0 0 0 0 0 0 0 0 0 0 0 0 0 0 0 0 0 0 0 0 0 0 0 0 0 0 0 0 0 0 0 0 0 0 0 0 0 0 500.427 0.07 0 0 
0 0 0 0 0 0 0 0 0 0 588.473 0 0 0 0 0 0 0 0 0 0 0 0 0 0 0 0 0 0 0 0 0 0 0 0 0 0 0 0 0 0 0 0 0 0 0 0 0 0 0 0 0 0 0 0 0 0 0 0 0.07 0 
0 0 0 0 538.423 0 0 0 0 0 0 0 0 0 0 0 0 0 0 0 0 0 0 0 0 0 0 0 0 0 0 0 0 0 0 0 0 0 0 0 0 0 0 0 0 0 0 0 0 0 0 0 0 0 0 0 0 0 0 0 0 
