*Vertices 43
*Matrix 
0.04 0 0 0 54.7044 0 0 0 0 0 0 0 0 0 0 0 0 0 0 0 0 0 0 0 0 0 0 0 0 0 1420.41 0 0 316.095 0 0 0 0 -90.2585 0 0 0 0 
0 0.06 0 0 0 0 0 0 0 0 0 0 1748.33 0 0 0 0 0 0 0 0 0 0 0 0 0 0 0 2326.04 0 2036.12 0 0 0 0 0 0 0 0 0 0 0 0 
0 0 0.04 -1941.51 0 0 0 0 0 0 0 0 0 0 0 0 0 -747.78 0 0 1660.13 0 1598.79 0 0 0 0 0 -1134.6 0 2054.12 0 0 2497.25 0 339.137 0 0 0 0 0 0 0 
0 0 -10.1474 0.03 1524.32 0 0 0 0 0 2163.23 690.558 0 0 790.963 0 0 0 0 0 0 0 0 -152.974 0 0 0 0 0 0 1968.21 0 0 0 -1177.79 0 0 0 0 0 0 0 0 
1711.86 0 0 -1992.93 0.08 0 0 0 0 1083.94 0 0 0 1330.53 0 0 0 2144 0 0 0 0 1749.4 0 -681.097 0 0 0 0 0 -1464.81 -1238.52 0 0 0 0 0 -824.534 -723.975 0 0 0 0 
0 0 0 0 0 0.08 0 0 -46.0067 0 1785.1 0 0 460.448 1911.45 0 0 0 -1216.09 0 0 0 0 0 0 -879.009 0 0 0 0 12.7415 0 0 0 0 0 0 -684.301 0 0 0 0 0 
0 0 0 0 0 0 0.04 0 0 0 0 0 0 0 0 0 1302.15 0 0 0 0 0 0 0 0 0 0 2137.75 0 0 0 0 0 0 0 0 0 0 0 0 0 0 0 
0 0 0 0 0 0 0 0.07 0 0 0 0 1951.89 0 0 0 0 0 -1184.19 0 0 2389.22 0 889.081 0 0 0 0 0 0 0 0 0 0 0 0 0 0 0 0 0 0 0 
0 0 0 0 0 6.94296 0 0 0.02 0 0 0 0 0 0 0 0 0 0 1833.02 0 0 0 0 -526.521 0 0 0 0 0 819.651 0 0 0 0 0 0 0 0 0 0 0 0 
0 0 0 0 1430.78 0 0 0 0 0.02 0 0 0 0 0 0 0 0 0 0 0 0 0 0 2000.26 0 0 -2407.53 2024.83 0 0 0 0 0 0 0 1835.61 0 -2223.35 0 0 0 0 
0 0 0 533.998 0 -2287.29 0 0 0 0 0.06 0 0 0 2136.68 894.726 0 0 0 0 0 0 0 0 1560.79 0 0 0 0 0 0 0 0 0 0 0 0 1288.57 0 0 0 0 0 
0 0 0 -443.052 0 0 0 0 0 0 0 0.05 0 0 0 0 0 0 -440.611 2012.47 0 0 766.243 0 2201.83 0 0 1490.91 0 0 0 0 0 0 0 0 0 0 0 0 0 0 0 
0 -1160.7 0 0 0 0 0 -819.193 0 0 0 0 0.06 0 0 1967.45 0 0 -2271.57 0 0 -654.851 0 0 0 0 0 0 0 0 0 -461.516 0 0 818.735 1968.21 0 0 0 0 0 1616.49 0 
0 0 0 0 915.174 510.498 0 0 0 0 0 0 0 0.06 0 0 0 0 0 0 0 0 0 0 0 -368.892 0 0 0 0 0 0 0 0 0 0 0 0 0 0 0 0 0 
0 0 0 -351.955 0 1450.47 0 0 0 0 -1125.9 0 0 0 0.09 0 0 0 -935.926 0 0 0 0 0 0 0 391.781 0 0 0 1869.79 0 0 0 0 0 0 0 0 0 0 0 0 
0 0 0 0 0 0 0 0 0 0 2372.74 0 1418.88 0 0 0.08 0 0 0 0 0 0 0 0 0 0 0 0 -1576.66 0 0 0 0 0 0 0 0 0 0 0 -1775.34 0 0 
0 0 0 0 0 0 2012.92 0 0 0 0 0 0 0 0 0 0.09 0 0 0 0 1136.74 0 0 0 -423.673 0 0 0 0 0 0 0 0 0 0 0 0 0 0 0 0 0 
0 0 -1518.07 0 2440.95 0 0 0 0 0 0 0 0 0 0 0 0 0.01 0 0 0 0 0 0 1933.73 1536.84 113.91 0 0 0 0 0 0 0 0 0 0 0 0 0 0 0 0 
0 0 0 0 0 1687.75 0 -1386.84 0 0 0 1648.08 -141.53 0 37.6141 0 0 0 0.02 0 0 0 0 0 0 0 0 1667 0 0 0 0 0 0 0 0 0 0 0 0 0 0 0 
0 0 0 0 0 0 0 0 867.26 0 0 726.417 0 0 0 0 0 0 0 0.08 0 0 0 0 0 0 2286.68 0 0 0 0 0 -90.7163 0 0 0 0 0 0 0 0 0 0 
0 0 1239.74 0 0 0 0 0 0 0 0 0 0 0 0 0 0 0 0 0 0.09 0 0 0 1784.04 0 -252.007 0 556.276 0 0 0 -1900.31 100.33 0 0 0 0 0 1764.5 0 0 0 
0 0 0 0 0 0 0 1287.04 0 0 0 0 -779.366 0 0 0 2320.09 0 0 0 0 0 0 0 0 0 0 0 0 0 0 0 0 0 0 0 1651.89 0 0 0 0 0 0 
0 0 1942.88 0 1193.96 0 0 0 0 0 0 2070.76 0 0 0 0 0 0 0 0 0 0 0.03 0 0 0 0 0 0 0 0 0 -2201.22 0 0 0 0 0 0 0 0 0 0 
0 0 0 -2357.17 0 0 0 1481.44 0 0 0 0 0 0 0 0 0 0 0 0 0 0 0 0.04 0 0 0 2078.69 0 0 0 0 1833.63 0 1254.84 0 0 421.537 -2051.99 0 0 0 0 
0 0 0 0 -2128.9 0 0 0 777.535 1276.67 1934.19 285.882 0 0 0 0 0 382.778 0 0 847.423 0 0 0 0.04 1448.79 0 0 0 0 0 1089.13 0 0 0 0 0 0 0 0 0 0 0 
0 0 0 0 0 847.728 0 0 0 0 0 0 0 -999.252 0 0 -305.261 1347.62 0 0 0 0 0 0 849.559 0.03 0 0 0 1762.22 0 0 0 296.869 0 -426.572 0 0 1521.88 0 0 0 0 
0 0 0 0 0 0 0 0 0 0 0 0 0 0 539.491 0 0 688.116 0 -1412.78 2196.8 0 0 0 0 0 0.06 0 1546.75 0 -569.552 0 0 0 0 0 0 0 0 0 0 0 0 
0 0 0 0 0 0 103.992 0 0 883.74 0 1952.04 0 0 0 0 0 0 96.3622 0 0 0 0 2109.06 0 0 0 0.07 55.0096 0 0 0 0 -1597.72 0 0 0 0 0 0 0 0 0 
0 -73.1681 1322.9 0 0 0 0 0 0 652.257 0 0 0 0 0 2069.69 0 0 0 0 2335.96 0 0 0 0 0 -758.766 -47.8378 0.02 2220.6 0 0 0 -1185.87 0 0 2355.19 0 0 0 0 0 0 
0 0 0 0 0 0 0 0 0 0 0 0 0 0 0 0 0 0 0 0 0 0 0 0 0 -829.569 0 0 -765.633 0.07 0 0 2294.61 1510.28 0 0 0 0 0 0 0 0 0 
1526.15 -1884.29 2114.55 1513.95 321.589 1067.92 0 0 287.103 0 0 0 0 0 -2230.22 0 0 0 0 0 0 0 0 0 0 0 -69.9637 0 0 0 0.05 0 1795.18 0 597.324 0 0 0 0 0 0 0 0 
0 0 0 0 1579.41 0 0 0 0 0 0 0 -1342.28 0 0 0 0 0 0 0 0 0 0 0 2334.74 0 0 0 0 0 0 0.09 0 0 0 -32.4259 0 0 0 0 0 0 0 
0 0 0 0 0 0 0 0 0 0 0 0 0 0 0 0 0 0 0 1441.16 2347.1 0 -137.715 750.984 0 0 0 0 0 -2084.95 -9.84222 0 0.01 0 2013.23 0 1128.04 0 0 0 0 0 -857.494 
-2494.05 0 598.392 0 0 0 0 0 0 0 0 0 0 0 0 0 0 0 0 0 2330.01 0 0 0 0 -2226.71 0 1905.04 -829.569 1611.76 0 0 0 0.08 0 0 2169.48 0 0 0 0 0 0 
0 0 0 2489.62 0 0 0 0 0 0 0 0 2101.73 0 0 0 0 0 0 0 0 0 0 265.435 0 0 0 0 0 0 -1568.73 0 1634.04 0 0.09 0 0 0 0 0 0 0 0 
0 0 -1798.84 0 0 0 0 0 0 0 0 0 2259.97 0 0 0 0 0 0 0 0 0 0 0 0 173.421 0 0 0 0 0 497.986 0 0 0 0.01 0 0 0 0 0 0 0 
0 0 0 0 0 0 0 0 0 -369.503 0 0 0 0 0 0 0 0 0 0 0 -431.761 0 0 0 0 0 0 262.993 0 0 0 1058.46 -218.436 0 0 0.07 0 0 0 0 0 0 
0 0 0 0 -579.012 2185.2 0 0 0 0 2098.83 0 0 0 0 0 0 0 0 0 0 0 0 1131.09 0 0 0 0 0 0 0 0 0 0 0 0 0 0.03 0 0 0 0 0 
1568.73 0 0 0 1943.34 0 0 0 0 601.596 0 0 0 0 0 0 0 0 0 0 0 0 0 883.129 0 907.544 0 0 0 0 0 0 0 0 0 0 0 0 0.07 0 0 0 0 
0 0 0 0 0 0 0 0 0 0 0 0 0 0 0 0 0 0 0 0 2099.14 0 0 0 0 0 0 0 0 0 0 0 0 0 0 0 0 0 0 0 0 0 0 
0 0 0 0 0 0 0 0 0 0 0 0 0 0 0 383.236 0 0 0 0 0 0 0 0 0 0 0 0 0 0 0 0 0 0 0 0 0 0 0 0 0.05 0 0 
0 0 0 0 0 0 0 0 0 0 0 0 1085.77 0 0 0 0 0 0 0 0 0 0 0 0 0 0 0 0 0 0 0 0 0 0 0 0 0 0 0 0 0.09 0 
0 0 0 0 0 0 0 0 0 0 0 0 0 0 0 0 0 0 0 0 0 0 0 0 0 0 0 0 0 0 0 0 149.007 0 0 0 0 0 0 0 0 0 0.02 
