*Vertices 45
*Matrix 
0.09 0 0 2424.92 0 2256.16 0 0 0 0 0 -41.7341 0 0 -1694.92 0 2423.86 0 0 0 0 -933.638 0 -1390.35 118.641 0 0 0 1400.57 0 0 -1729.71 0 0 0 829.112 -186.85 0 0 1880.32 0 0 0 1009.78 0 
0 0 0 0 974.685 0 0 -1714.76 0 0 367.367 0 0 1105.3 0 0 0 0 0 -2241.81 0 0 0 0 0 0 0 0 0 0 0 1791.51 0 603.275 1698.13 0 0 -603.885 0 1109.12 0 0 0 0 0 
0 0 0.03 0 -1076.92 0 2225.79 96.3622 0 0 1127.28 0 0 0 0 0 0 0 -1202.51 1648.38 0 -2400.05 2460.63 0 0 0 0 0 1442.84 0 0 0 -966.445 1024.58 0 -1484.19 0 0 -1920.45 1681.34 0 -321.741 0 0 0 
2104.94 0 0 0.08 0 0 0 0 0 0 1722.24 0 1141.62 0 0 0 -43.4126 0 0 2182 0 -2198.93 0 0 0 0 0 0 0 0 0 0 0 0 0 944.166 513.245 -323.725 0 0 0 0 -1923.81 0 0 
0 1304.13 630.436 0 0.06 0 0 -277.947 2479.4 -2001.17 0 0 2189.17 432.981 0 0 0 2258.29 0 1200.52 0 -2352.14 0 -467.315 0 0 0 0 0 0 0 0 247.124 0 0 0 0 -2308.04 0 0 -426.878 -793.405 977.584 2154.38 0 
-1747.87 0 0 0 0 0.05 0 0 1249.2 0 0 0 641.575 291.681 0 -1050.68 0 0 0 2071.67 2462.61 0 0 0 0 0 0 -344.325 943.403 0 -1788.46 0 0 0 0 0.228889 -1871.01 0 2484.28 1344.26 0 1906.11 0 0 0 
0 0 -1145.89 0 0 0 0.06 0 0 272.607 0 0 0 0 0 0 0 0 -505.005 0 0 0 -1390.04 0 0 0 0 0 0 0 -648.289 0 0 0 0 2055.8 2022.84 0 0 0 0 0 0 0 0 
0 -858.409 758.156 0 1236.53 0 0 0.01 -1546.6 0 280.541 1879.71 0 1614.66 0 363.857 0 0 0 0 0 0 0 145.344 0 0 2418.52 0 0 -689.184 0 0 0 1949.29 0 0 0 0 -2316.28 -693.609 0 0 -807.596 0 1473.05 
0 0 0 0 346.614 -1621.37 0 855.815 0.02 0 -1847.82 0 0 -2004.07 0 0 -686.59 309.229 0 0 -1044.11 0 0 0 -128.559 0 120.624 0 0 0 755.867 0 1351.44 2034.59 0 0 0 0 0 0 1583.07 0 0 1572.24 2429.96 
0 0 0 0 1909.77 0 588.626 0 0 0.04 0 0 -1547.52 1579.41 0 0 578.097 0 0 848.186 0 0 0 0 -320.826 -188.376 2142.17 0 1833.48 0 0 0 491.882 0 0 435.575 0 0 0 0 0 0 -1519.44 0 0 
0 -2391.2 -456.328 -294.58 0 0 0 496.612 1048.69 0 0.03 0 1995.68 0 1681.95 0 -2159.57 1267.97 0 -1028.4 0 0 574.587 0 0 0 0 0 2303.46 0 0 2407.83 -1741.61 0 0 438.475 0 2026.66 789.743 0 -2082.51 0 0 0 0 
1877.57 0 0 0 0 0 0 2404.17 0 0 0 0.05 -440.153 0 0 0 0 0 0 0 156.331 0 0 0 0 0 1472.75 -799.661 0 -3.89111 0 -1812.57 0 0 0 0 2362.97 0 -1775.64 0 0 1150.01 0 1883.83 -233.695 
0 0 0 1958.3 -702.765 1796.85 0 0 0 1446.96 -1503.27 1871.47 0.05 -349.361 0 0 0 0 0 0 -552.156 0 0 0 0 320.063 0 -1261.71 0 0 0 0 0 2481.84 952.101 0 0 0 2049.24 1913.28 0 0 0 0 -209.586 
0 -628.452 0 0 -94.9889 -44.3281 0 -458.007 246.971 677.282 0 0 -279.321 0.02 0 0 -739.082 0 0 2188.25 726.112 0 0 0 0 0 0 -1441.62 41.1237 0 0 0 0 -279.931 2119.59 0 0 0 0 0 0 1909.92 0 0 0 
523.316 0 0 0 0 0 0 0 0 0 -288.324 0 0 0 0.07 50.1267 0 -344.172 -1806.62 228.813 0 -1615.12 374.538 0 0 0 0 0 0 0 1517.91 1783.88 1784.8 0 983.688 0 0 0 396.97 0 2185.66 0 -2297.97 0 0 
0 0 0 0 0 1319.54 0 1907.03 0 0 0 0 0 0 -2216.94 0.04 0 0 0 -1415.98 0 2127.98 0 0 0 1849.19 0 2035.51 -427.488 0 0 1644.41 0 0 0 0 0 0 0 0 0 0 2359.92 0 0 
2220.76 0 0 -1038.77 0 0 0 0 -250.481 297.479 2219.23 0 0 -459.685 0 0 0.08 1187.4 -734.962 0 0 0 0 1054.49 0 0 1755.96 0 0 0 0 391.171 -160.756 0 0 0 0 0 -113.3 942.946 -1789.07 -866.039 0 0 0 
0 0 0 0 2491.91 0 0 0 -648.442 0 329.524 0 0 0 159.993 0 -98.6511 0.09 0 0 0 0 0 0 1393.25 0 0 0 0 0 -647.832 0 0 -1801.58 874.889 0 0 0 0 0 0 0 0 0 0 
0 0 437.407 0 0 0 2179.71 0 0 0 0 0 0 0 -427.946 0 1609.78 0 0.01 0 0 0 -393.155 0 1679.66 0 0 857.646 0 0 -2253.11 0 0 304.346 0 0 0 0 0 0 0 0 0 0 0 
0 484.252 -2052.6 -1158.1 174.49 -810.038 0 0 0 837.352 2257.38 0 0 1043.96 1314.97 325.098 0 0 0 0.05 0 0 0 0 0 0 0 2327.11 -151.906 0 0 0 1159.47 0 0 0 0 0 0 0 -1795.48 0 1290.7 0 -690.252 
0 0 0 0 0 2339.93 0 0 967.666 0 0 -577.487 21.4393 2436.22 0 0 0 0 0 0 0.08 1769.08 0 0 0 0 550.478 0 0 0 0 0 0 0 0 0 0 0 0 2475.28 0 0 0 0 0 
2281.03 0 -1164.82 -1916.49 -829.722 0 0 0 0 0 0 0 0 0 583.438 2258.29 0 0 0 0 834.91 0.03 0 0 0 0 492.798 0 398.038 0 0 0 1733.99 0 0 558.718 0 0 0 0 0 0 1221.73 0 281.457 
0 0 1400.72 0 0 0 323.267 0 0 0 121.845 0 0 0 662.633 0 0 0 -2005.91 0 0 0 0.04 0 0 0 0 0 -580.538 928.297 0 0 1745.43 -2125.23 1371.27 -644.932 0 778.146 0 1130.94 0 1825.54 0 0 0 
-1031.14 0 0 0 1009.78 0 0 -1475.8 0 0 0 0 0 0 0 0 2498.63 0 0 0 0 0 0 0.08 0 1440.24 0 1564.46 0 1933.27 0 -1457.64 0 1956.62 0 0 2201.68 0 0 -711.463 1528.29 0 -1794.87 0 0 
1719.18 0 0 0 0 0 0 0 -2306.36 -650.578 0 0 0 0 0 0 0 -249.107 2132.1 0 0 0 0 0 0 0 0 636.082 0 0 0 0 1004.59 -2377.93 0 0 0 0 1045.49 0 2087.08 1954.63 0 0 0 
0 0 0 0 0 0 0 0 0 1145.28 0 0 -656.072 0 0 1569.03 0 0 0 0 0 0 0 -1169.09 0 0.05 0 0 -2058.24 0 -82.6289 0 0 0 0 0 0 0 0 0 0 1194.88 0 0 0 
0 0 0 0 0 0 0 321.284 2080.98 -1208.15 0 -1776.41 0 0 0 0 -1542.94 0 0 0 1409.12 709.326 0 0 0 0 0.02 0 -213.401 0 0 -161.519 0 0 0 0 0 0 0 0 0 2453.76 0 0 0 
0 0 0 0 0 166.402 0 0 0 0 0 417.722 -1308.71 -2065.87 0 675.756 0 0 -155.721 1999.95 0 0 0 482.269 1813.03 0 0 0.05 -93.9207 0 0 0 0 0 0 -961.409 0 -257.195 0 0 0 0 447.935 0 0 
650.273 0 2336.57 0 0 671.484 0 0 0 -1460.69 1901.07 0 0 -382.168 0 396.97 0 0 0 -2100.97 0 1534.09 2322.08 0 0 -583.285 -1937.7 2290.34 0.04 0 0 0 -2310.33 0 1078.91 0 446.257 0 0 -67.0644 0 0 0 -870.159 -1193.81 
0 0 0 0 0 0 0 -357.601 0 0 0 1403.78 0 0 0 0 0 0 0 0 0 0 294.275 1953.11 0 0 0 0 0 0.06 0 0 0 0 0 0 0 1127.12 0 0 0 0 0 -166.097 0 
0 0 0 0 0 960.189 473.418 0 952.101 0 0 0 0 0 1614.66 0 0 -2423.55 -2334.13 0 0 0 0 0 0 2176.35 0 0 0 0 0.01 0 0 0 1026.41 0 0 0 0 -47.38 0 -1892.22 0 308.008 716.956 
-506.684 -717.719 0 0 0 0 0 0 0 0 1060.75 1373.26 0 0 1495.94 -2337.03 -2495.27 0 0 0 0 0 0 393.46 0 0 1812.42 0 0 0 0 0.09 0 0 0 -943.403 2141.41 0 0 851.39 0 0 0 0 0 
0 0 461.669 0 -1462.37 0 0 0 1949.6 751.442 -1547.67 0 0 0 2104.02 0 2292.02 0 0 -1197.01 0 885.418 -1401.94 0 2498.47 0 0 0 1544.92 0 0 0 0.09 0 0 0 0 0 0 0 0 0 1251.49 0 0 
0 -1233.94 1770 0 0 0 0 824.839 2028.34 0 0 0 2317.96 -321.284 0 0 0 1668.83 1732.92 0 0 0 -843.608 -1782.2 -1034.65 0 0 0 0 0 0 0 0 0.06 1934.64 0 -2231.59 0 0 0 0 0 0 -2114.4 -504.7 
0 -235.374 0 0 0 0 0 0 0 0 0 0 2422.79 1558.66 449.004 0 0 -418.485 0 0 0 0 1083.03 0 0 0 0 0 -624.027 0 645.085 0 0 768.227 0.01 -1688.82 0 0 0 0 -227.897 1733.99 0 0 0 
-1334.04 0 2488.86 -1123.16 0 919.904 1074.79 0 0 582.827 -695.288 0 0 0 0 0 0 0 0 0 0 1884.14 -2365.57 0 0 0 0 105.976 0 0 0 498.444 0 0 1163.59 0.06 0 0 0 0 0 0 0 0 -221.03 
1870.1 0 0 917.31 0 -2216.18 86.5963 0 0 0 0 -546.51 0 0 0 0 0 0 0 0 0 0 0 -1238.67 0 0 0 0 88.7326 0 0 -752.815 0 -1239.28 0 0 0 0 0 1407.59 1177.94 0 2413.79 0 0 
0 -1217.31 0 1513.34 -159.536 0 0 0 0 0 2256.92 0 0 0 0 0 0 0 0 0 0 0 1320.61 0 0 0 0 1697.82 0 -721.534 0 0 0 0 0 0 0 0.02 0 0 322.657 0 0 0 991.775 
0 0 807.138 0 0 1636.17 0 1007.64 0 0 1345.94 435.118 -2121.72 0 950.88 0 -739.235 0 0 0 0 0 0 0 792.795 0 0 0 0 0 0 0 0 0 0 0 0 0 0.09 -1048.39 0 0 1742.53 -2393.8 1386.38 
340.052 1587.8 1542.79 0 0 -2173.76 0 -1070.67 0 0 0 0 -2064.81 0 0 0 -1378.44 0 0 0 2398.83 0 -1145.13 705.664 0 0 0 0 -1734.6 0 870.922 12.7415 0 0 0 0 -1157.95 0 2326.2 0.06 0 1564.61 1317.41 -367.367 1807.08 
0 0 0 0 1407.59 0 0 0 2436.67 0 -632.725 0 0 0 2082.66 0 378.811 0 0 -1480.83 0 0 0 643.254 -2286.22 0 0 0 0 0 0 0 0 0 1774.27 0 -1154.44 -760.14 0 0 0.03 0 943.098 -1586.12 0 
0 0 1653.42 0 2152.09 1065.48 0 0 0 0 0 -153.432 0 514.161 0 0 2243.64 0 0 0 0 0 -647.679 0 1016.95 909.528 2422.94 0 0 0 -1322.75 0 0 0 -648.9 0 0 0 0 186.239 0 0.05 0 0 0 
0 0 0 2488.71 2146.6 0 0 -359.432 0 1601.69 0 0 0 0 597.476 2472.69 0 0 0 -1200.22 0 647.679 0 1378.44 0 0 0 1531.34 0 0 0 0 1684.09 0 0 0 747.017 0 167.013 -2086.02 -842.692 0 0.09 0 0 
-1457.34 0 0 0 662.175 0 0 0 2223.81 0 0 1559.88 0 0 0 0 0 0 0 0 0 0 0 0 0 0 0 0 303.735 767.312 -1213.34 0 0 1465.42 0 0 0 0 -821.177 -1242.18 441.221 0 0 0.09 0 
0 0 0 0 0 0 0 -1292.08 178.457 0 0 -1221.58 1724.83 0 0 0 0 0 0 2137.29 0 661.718 0 0 0 0 0 0 -1790.14 0 1956.77 0 0 -1039.69 0 502.411 0 2135.91 -400.632 981.399 0 0 0 0 0.08 
