*Vertices 54
*Matrix 
0.08 0 0 0 0 0 0 0 0 0 0 -1056.63 0 1478.7 0 0 0 0 0 -1535.92 0 0 1695.84 780.74 0 0 -744.27 0 0 -1450.32 0 0 0 0 0 0 0 -1831.64 1000.63 0 0 0 0 0 0 1176.87 0 1811.66 1393.09 -1576.36 0 774.941 0 0 
0 0 0 0 0 0 -641.118 0 0 0 0 2362.06 0 1124.53 0 -1548.43 -872.448 2363.12 -1793.04 0 -1230.58 0 -2271.72 0 0 0 0 963.24 0 0 0 0 0 -267.266 2314.29 0 0 0 0 0 -626.469 0 0 1739.17 0 -100.635 0 0 -857.036 0 0 0 0 0 
0 0 0.08 0 374.844 0 0 0 0 0 0 -1457.03 -1787.85 0 0 0 0 0 0 1463.9 0 0 -801.645 0 0 1555.3 0 0 0 0 0 0 -321.131 0 0 0 190.359 0 2082.96 0 0 0 0 0 0 0 0 0 0 0 0 0 0 0 
0 0 0 0.06 1396.91 0 0 -878.857 0 0 0 -1002.46 0 0 0 0 1515.02 -1092.49 1388.52 0 -1773.81 2246.54 0 0 -594.882 855.51 0 864.818 1105.3 0 1587.95 475.249 0 0 0 0 0 0 0 0 -253.533 0 -1353.11 2418.82 0 193.411 0 0 0 0 0 0 0 -769.753 
0 0 211.417 -108.875 0.06 -11.8259 0 0 0 106.891 0 -1737.95 0 0 0 -511.872 0 1722.08 0 817.362 288.476 0 0 0 2215.57 0 0 0 0 0 0 902.814 0 303.583 0 -1815.32 0 0 0 0 0 0 578.707 0 0 0 0 0 0 1308.71 1245.84 0 0 0 
0 0 0 0 -1581.55 0.03 0 0 2257.23 0 0 0 0 0 651.189 0 0 1488.46 -569.704 417.57 0 0 0 0 2270.5 0 0 0 -607.089 0 -861.919 694.525 0 0 0 0 -812.479 0 463.805 0 0 831.706 0 0 0 0 0 0 0 0 -226.981 0 0 0 
0 80.6452 0 0 0 0 0 0 0 1860.18 0 1733.99 -1875.29 0 0 0 0 2096.24 0 0 0 0 0 420.316 0 0 0 0 0 0 0 -2207.79 0 0 0 915.784 0 0 1323.21 0 0 1333.58 0 76.3726 0 0 0 0 0 0 13.9622 0 0 0 
0 0 0 -1823.71 0 0 0 0.09 0 -151.601 0 0 273.98 0 742.592 0 0 0 0 0 0 0 900.983 0 0 0 1921.98 0 0 0 0 0 0 0 1276.36 0 0 813.242 0 -1055.41 0 0 0 0 0 -1983.93 1623.51 0 0 0 0 0 0 0 
0 0 0 0 0 1569.95 0 0 0.02 0 0 0 1212.42 0 0 -2090.9 0 0 -122.761 0 0 0 0 0 0 0 0 0 1816.69 0 0 -1342.89 0 1994.46 0 0 0 0 0 0 -462.737 0 0 0 0 0 0 783.486 1274.53 0 0 0 0 0 
0 0 0 0 -1465.12 0 966.292 -2102.04 0 0.03 2328.33 -1242.18 0 0 0 0 0 0 0 0 0 0 0 1576.36 0 0 0 0 1495.64 0 0 0 0 0 0 1899.7 0 0 -2354.73 0 0 0 674.23 0 0 -278.1 2267.14 0 0 0 0 0 0 0 
0 0 0 0 0 0 0 0 0 1125.29 0.05 0 1274.53 0 -2472.53 0 0 1283.07 0 0 1991.41 0 868.175 0 0 0 0 0 0 0 0 0 0 0 0 2429.65 1336.48 0 0 0 0 0 0 -2076.4 0 1913.89 0 718.329 2487.79 0 576.113 0 0 0 
506.989 1929.91 407.041 860.851 1935.87 0 -2178.33 0 0 960.341 0 0 0 0 0 0 0 0 0 -485.778 0 0 0 0 0 0 0 0 0 0 0 0 0 0 1821.57 -2429.5 0 500.427 819.956 0 2395.63 2446.44 0 0 0 0 0 0 0 0 0 0 0 0 
0 0 2106.62 0 0 0 178.762 960.189 832.011 0 51.6526 0 0.05 937.91 0 0 0 0 0 267.113 0 0 0 0 0 1574.37 1456.11 0 0 0 0 0 0 0 0 0 0 0 0 0 0 0 2126.61 -949.049 0 0 -1069.75 0 0 0 0 0 0 0 
-79.8822 -42.3444 0 0 0 0 0 0 0 0 0 0 1780.98 0.08 0 0 0 949.965 0 0 1569.03 -1565.83 -52.5681 0 0 0 0 -1384.4 0 2232.05 0 0 -154.805 -537.812 0 0 0 0 -1813.03 -343.257 0 0 0 0 0 628.147 -698.95 0 0 0 0 1601.54 0 0 
0 0 0 0 0 -958.205 0 -2465.21 0 0 676.061 0 0 0 0.04 0 -30.5948 0 0 0 0 0 1581.7 0 0 0 -1782.82 0 0 0 0 0 0 0 2398.98 1983.02 0 0 0 0 670.263 0 0 0 0 0 0 0 0 0 0 0 -1427.88 0 
0 -206.229 0 0 2072.44 0 0 0 -1795.18 0 0 0 0 0 0 0.05 0 0 1828.59 1265.83 1770.76 0 0 344.63 0 0 0 0 0 0 0 0 0 0 0 0 0 0 0 0 0 0 0 0 0 0 0 -1901.07 -305.261 1140.1 0 0 0 0 
0 -1635.11 0 -694.83 0 0 0 0 0 0 0 0 0 0 -997.421 0 0.05 0 1715.83 1239.89 0 0 0 1177.94 101.703 0 0 -2051.38 0 0 0 0 0 0 1931.9 1315.73 0 0 -59.2822 0 0 346.004 0 506.073 2398.53 0 0 0 1937.24 0 0 0 0 0 
0 533.692 0 -63.2496 1636.48 268.181 -718.482 0 0 0 1580.63 0 0 -1315.73 0 0 0 0.08 -142.445 1424.38 0 0 0 -503.021 0 1936.63 0 1473.05 1222.95 0 0 0 0 0 -2167.96 -2321.01 0 2044.97 0 -397.885 0 0 -2139.88 0 0 0 0 0 0 0 0 0 0 0 
0 950.117 0 -1152.76 0 -2206.56 0 0 1151.54 0 0 0 0 0 0 1323.82 2293.85 272.607 0.04 0 0 0 0 0 0 2008.19 1257.74 -911.664 0 0 356.075 0 0 2483.52 -598.392 0 0 0 1724.83 0 0 709.632 0 0 0 -2499.69 0 0 0 0 0 0 0 0 
1449.25 0 -957.137 0 897.778 1649.3 0 0 0 0 0 2003.77 1891.46 0 0 -2053.36 476.928 -1468.63 0 0.05 0 1666.39 0 0 0 0 -2057.02 0 0 0 871.685 0 0 0 0 0 0 0 0 0 0 623.264 0 0 0 0 -2286.68 0 0 1711.86 0 0 0 0 
0 877.026 0 2357.94 1312.07 0 0 0 0 0 653.783 0 0 -1472.59 0 -447.172 0 0 0 0 0.08 1479 -1325.65 -984.756 0 0 0 0 0 2238.15 756.478 0 0 -1658.91 0 846.507 0 0 0 0 0 0 0 0 0 0 -1026.72 0 0 0 914.563 0 0 0 
0 0 0 156.026 0 0 0 0 0 0 0 0 0 2183.83 0 0 0 0 0 272.149 521.332 0.07 0 1810.13 0 0 0 -547.578 -978.652 0 0 0 0 0 0 0 0 0 -1675.08 0 0 0 -514.466 -5.41704 0 2404.32 0 0 0 0 0 0 0 -1196.55 
1464.96 2279.05 421.232 0 0 0 0 -898.999 0 0 -448.698 0 0 -1649.14 1238.06 0 0 0 0 0 158.315 0 0.09 0 -1376 0 0 676.824 915.174 0 2215.26 0 0 1027.18 0 20.8289 0 0 0 633.946 0 859.325 0 0 0 0 0 1740.55 0 0 -1105.46 0 -382.321 0 
-1740.24 0 0 0 0 0 -871.838 0 0 1029.47 0 0 0 0 0 -1751.84 -17.4718 -1790.29 0 0 686.132 717.719 0 0.05 2106.31 2058.09 0 1160.7 0 0 0 2346.8 0 -2284.39 -380.947 63.2496 0 0 1044.11 0 0 0 -963.24 0 26.017 0 1542.94 0 0 0 0 0 0 0 
0 0 0 1833.02 1008.26 1698.43 0 0 0 0 0 0 0 0 0 0 -2259.82 0 0 0 0 0 40.6659 1512.57 0.08 0 0 0 -186.544 0 0 -1439.94 0 1455.5 0 1711.25 0 -296.564 0 0 0 1980.42 -743.355 0 0 -1659.52 0 1782.36 0 -1642.58 0 0 -16.7089 0 
0 0 2485.05 2462.31 0 0 0 0 0 0 0 0 -1610.23 0 0 0 0 -1582.77 -1419.64 0 0 0 0 -484.1 0 0.05 0 180.898 0 0 0 0 0 0 0 0 0 0 0 0 0 0 0 0 -385.525 1956.62 0 -227.134 0 0 524.537 0 0 0 
903.119 0 0 0 0 0 0 1788.31 0 0 0 0 -73.4733 0 -895.489 0 0 0 2393.8 1794.41 0 0 0 0 0 0 0.04 0 43.26 2151.48 -1155.96 0 0 0 71.337 0 -2237.69 0 2035.66 52.5681 0 -253.838 2378.23 0 0 0 0 0 0 -194.021 0 0 0 0 
0 -681.249 0 -341.273 0 0 0 0 0 0 0 0 0 -1154.44 0 0 2484.59 2287.29 -1210.9 0 0 -724.586 -863.598 -1589.79 0 1500.98 0 0.07 0 1424.38 0 608.158 0 1447.11 0 0 0 0 0 0 0 2375.64 -705.512 0 0 1994.16 1454.28 -570.467 0 0 0 2248.07 0 0 
0 0 0 640.965 0 -1069.29 0 0 -105.823 -2470.55 0 0 0 0 0 0 0 -1852.09 0 0 0 1388.52 1909.47 0 1446.2 0 -348.598 0 0.02 -729.926 1543.7 2131.34 2288.96 0 0 2340.08 0 0 1001.54 0 0 0 0 0 0 1364.56 0 2011.4 0 0 0 0 0 0 
-2314.75 0 0 0 0 0 0 0 0 0 0 0 0 -411.771 0 0 0 0 0 0 2074.57 0 0 0 0 0 1536.99 -1694.01 974.075 0.02 2247.15 0 0 0 0 -385.22 0 0 0 0 0 0 241.63 0 0 0 0 0 -113.91 1395.99 0 0 0 0 
0 0 0 2246.85 0 -2021.01 0 0 0 0 0 0 0 0 0 0 0 0 844.829 -296.106 -1268.12 0 879.162 0 0 0 2447.05 0 2445.22 -1426.36 0.03 0 0 0 0 0 0 1462.83 -1048.69 0 0 0 0 464.263 0 1560.18 0 0 0 0 0 0 0 -389.34 
0 0 0 1951.73 -31.0526 377.895 -725.806 0 -1715.06 0 0 0 0 0 0 0 0 0 0 0 0 0 0 21.897 234.306 0 0 1370.82 296.869 0 0 0.08 0 0 1787.85 0 0 2389.83 -73.6259 2401.27 0 -975.448 0 2150.56 0 0 33.7992 0 0 0 0 0 0 0 
0 0 519.349 0 0 0 0 0 0 0 0 0 0 2215.26 0 0 0 0 0 0 0 0 0 0 0 0 0 0 1415.52 0 0 0 0.01 0 0 0 0 0 0 1869.79 -39.4452 0 0 0 0 2345.12 0 2428.89 0 0 0 0 292.901 0 
0 -2373.35 0 0 -461.974 0 0 0 -2341 0 0 0 0 -2088.61 0 0 0 0 1645.18 0 2446.13 0 2139.12 23.1178 1484.19 0 0 1914.2 0 0 0 0 0 0.06 0 0 0 -472.961 0 0 2164.75 -528.657 0 0 0 0 -366.298 1586.43 0 2119.74 0 0 0 0 
0 510.956 0 0 0 0 0 2399.14 0 0 0 -509.583 0 0 1789.53 0 1883.98 1260.49 -759.835 0 0 0 0 55.3148 0 0 1143.6 0 0 0 0 2341.15 0 0 0.09 0 0 0 -715.43 0 204.245 0 467.62 395.749 2119.43 1003.68 0 0 1619.08 0 -437.101 0 0 678.198 
0 0 0 0 -979.72 0 118.641 0 0 942.488 1626.1 -433.134 0 0 69.3533 0 2407.53 -2041.61 0 0 -1338.77 0 -1438.72 -1091.27 2206.56 0 0 0 581.301 -1499.91 0 0 0 0 0 0.06 0 0 0 -677.587 0 0 2079.76 1938.76 0 0 0 0 0 0 1874.98 0 0 0 
0 0 -1952.65 0 0 1441.62 0 0 0 0 1286.43 0 0 0 0 0 0 0 0 0 0 0 0 0 0 0 1284.75 0 0 0 0 0 0 0 0 0 0.08 0 0 0 272.759 0 2161.55 0 1973.86 0 0 0 0 0 0 0 0 0 
9.99481 0 0 0 0 0 0 265.587 0 0 0 1182.82 0 0 0 0 0 1585.82 0 0 0 0 0 0 -330.592 0 0 0 0 0 -2112.57 1518.68 0 -874.432 0 0 0 0 0 0 0 0 0 0 0 0 0 2005.75 -1358.61 0 1526.61 0 0 0 
-788.827 0 -490.204 0 0 -1513.79 1364.71 0 0 -1382.72 0 -1733.22 0 -1405 0 0 -1679.97 0 2403.1 0 0 50.4318 0 105.213 0 0 1070.67 0 2151.02 0 769.295 303.583 0 0 1976 0 0 0 0.01 0 0 0 0 0 0 0 0 0 290.002 0 0 0 -498.291 0 
0 0 0 0 0 0 0 -581.607 0 0 0 0 0 20.9815 0 0 0 2407.53 0 0 0 0 1934.49 0 0 0 647.374 0 0 0 0 959.12 -173.421 0 0 1051.44 0 0 0 0.01 1894.21 0 0 0 -962.477 -837.809 0 0 0 1390.19 0 0 -79.577 0 
0 2042.68 0 -509.43 0 0 0 0 -316.706 0 0 719.55 0 0 -1134.45 0 0 0 0 0 0 0 0 0 0 0 0 0 0 0 0 0 2202.29 66.9118 762.276 0 988.876 0 0 120.014 0.02 0 285.272 0 0 0 0 0 1791.21 0 2390.9 -2268.97 0 1780.68 
0 0 0 0 0 -1538.97 49.9741 0 0 0 0 1900.16 0 0 0 0 621.128 0 -2444.46 2170.4 0 0 1760.69 0 234.764 0 1162.22 1466.95 0 0 0 1473.51 0 1964.25 0 0 0 0 0 0 0 0.06 1668.37 -996.658 0 0 0 -2297.97 0 931.349 0 0 1293.6 0 
0 0 0 646.458 -670.568 0 0 0 0 2261.5 0 0 -769.906 0 0 0 0 -904.492 0 0 0 1619.08 0 -1037.71 1408.2 0 490.509 -872.6 0 -2029.1 0 0 0 0 1986.53 -1019.85 -1099.2 0 0 0 -50.5844 2207.63 0.04 0 0 0 2480.77 0 0 0 382.321 0 0 0 
0 2457.27 0 54.3992 0 0 2127.37 0 0 0 1995.99 0 1027.48 0 0 0 39.14 0 0 0 0 -423.978 0 0 0 0 0 0 0 0 1344.42 -2370.14 0 0 2342.22 1682.41 0 0 0 0 0 1303.98 0 0.07 0 0 0 -1660.13 -865.276 0 1175.65 0 0 1049.76 
0 0 0 0 0 0 0 0 0 0 0 0 0 0 0 0 -1255.15 0 0 0 0 0 0 2328.94 0 700.476 0 0 0 0 0 0 0 0 -1871.32 0 2376.55 0 0 388.577 0 0 0 0 0.08 0 0 0 0 -1581.09 1104.54 0 2369.23 145.039 
-1990.65 -347.53 0 -22.5074 0 0 0 764.87 0 -2426.91 -246.971 0 0 -1681.49 0 0 0 0 -25.4067 0 0 1723.3 0 0 -808.206 676.061 0 270.013 -1411.56 0 1271.48 0 1439.33 0 473.724 0 0 0 0 2263.79 0 0 0 0 0 0.06 0 0 0 -192.801 0 0 0 0 
0 0 0 0 0 0 0 -1961.5 0 499.664 0 0 1797.46 1489.38 0 0 0 0 0 1856.21 1933.58 0 0 -2490.84 0 0 0 -1312.52 0 0 0 1527.99 0 -908.612 0 0 0 0 0 0 0 0 2261.04 0 0 0 0.05 0 0 0 0 2169.18 0 0 
997.879 0 0 0 0 0 0 0 1670.96 0 -956.679 0 0 0 0 -479.98 0 0 0 0 0 0 2252.49 0 -1067 1562.17 0 -1153.52 1734.29 0 0 0 -1538.36 -1947 0 0 0 -1867.66 0 0 0 2474.21 0 2247.76 0 0 0 0.02 -1722.08 0 0 0 0 0 
337.306 -62.4866 0 0 0 0 0 0 115.894 0 259.026 0 0 0 0 -1144.67 2453.76 0 0 0 0 0 0 0 0 0 0 0 0 -952.864 0 0 0 0 346.614 0 0 -1471.83 2125.84 0 3.89111 0 0 1053.88 0 0 0 -2268.67 0.02 0 0 0 0 0 
1487.7 0 0 0 715.278 0 0 0 0 0 0 0 0 0 0 1299.55 0 0 0 554.75 0 0 0 0 -673.772 0 2233.73 0 0 -765.023 0 0 0 -449.309 0 0 0 0 0 1905.35 0 634.251 0 0 -1367.92 406.888 0 0 0 0.07 0 1661.66 0 0 
0 0 0 0 -711.463 1864.76 1477.17 0 0 0 2234.95 0 0 0 0 0 0 0 0 0 362.789 0 -1005.81 0 0 27.8481 0 0 0 0 0 0 0 0 -307.855 -2241.51 0 -2345.42 0 0 1298.33 0 836.741 2048.94 1824.63 0 0 0 0 0 0 0 0 0 
1219.6 0 0 0 0 0 0 0 0 0 0 0 0 1421.17 0 0 0 0 0 0 0 0 0 0 0 0 0 1241.11 0 0 0 0 0 0 0 0 0 0 0 0 1448.64 0 0 0 0 0 1190.91 0 0 -2093.04 0 0.03 0 0 
0 0 0 0 0 0 0 0 0 0 0 0 0 0 -281.61 0 0 0 0 0 0 0 -888.928 0 236.29 0 0 0 0 0 0 0 -1406.37 0 0 0 0 0 2077.01 82.4763 0 753.883 0 0 948.744 0 0 0 0 0 0 0 0.02 0 
0 0 0 240.715 0 0 0 0 0 0 0 0 0 0 0 0 0 0 0 0 0 1071.58 0 0 0 0 0 0 0 0 -123.066 0 0 0 -362.178 0 0 0 0 0 1335.11 0 0 1773.05 2056.11 0 0 0 0 0 0 0 0 0.04 
