*Vertices 51
*Matrix 
0.09 0 0 0 0 2154.23 0 0 1310.39 2001.33 0 0 1408.81 0 0 686.743 0 0 0 0 0 0 0 2248.07 0 0 0 0 1322.14 0 2481.84 0 0 0 -1557.44 146.718 0 -813.852 -967.36 0 0 0 0 1441.92 0 0 0 -1301.84 0 0 -346.461 
0 0.07 0 1361.81 0 0 0 0 0 0 1945.17 1138.11 0 0 0 0 0 0 0 0 0 0 -1426.05 0 66.4541 0 0 0 0 0 0 0 0 0 0 -441.984 2489.93 0 0 0 0 0 0 0 0 0 446.257 0 0 326.167 0 
0 0 0.06 0 -1515.63 0 -1722.85 1381.65 -584.201 1646.86 0 -1918.01 0 0 0 1879.25 426.115 0 1546.45 0 0 2257.99 0 0 0 0 0 826.06 0 0 0 0 0 0 0 0 0 0 170.217 0 0 0 0 -1780.98 0 0 0 0 0 0 0 
0 2093.65 0 0.09 0 0 0 0 0 0 0 0 0 1029.92 0 0 0 1010.24 1473.82 271.538 0 0 -1813.49 0 0 0 0 0 0 0 0 0 133.137 2105.24 -1409.12 0 0 0 0 0 0 0 0 0 0 0 0 0 0 0 0 
0 0 522.401 0 0 0 0 0 0 0 1770.61 0 0 0 0 0 2268.97 0 1605.04 0 0 -2174.98 0 0 0 -2249.29 0 -1645.94 0 0 0 0 0 0 1544.31 0 1752.3 0 0 0 0 1535.77 0 0 0 0 0 0 -2490.23 0 0 
1485.72 0 0 0 0 0.01 1045.64 0 0 0 0 0 0 0 0 0 0 0 0 0 801.95 -22.8126 0 0 0 0 0 0 0 0 0 0 0 0 0 0 0 0 -659.276 0 0 0 0 655.461 450.682 0 -1015.12 0 0 0 0 
0 0 2252.19 0 0 -920.82 0.04 0 0 0 1384.09 0 2219.99 0 209.433 0 0 0 0 0 0 -103.534 0 -2151.17 0 0 0 0 0 0 0 0 0 0 0 0 0 887.402 0 0 -591.983 0 0 0 0 0 0 0 0 0 0 
0 0 1042.44 0 0 0 0 0.01 268.334 0 0 0 0 -2039.32 677.435 0 0 0 0 0 2391.96 0 0 0 2286.98 0 0 0 0 0 0 0 0 0 0 0 0 0 -2066.94 897.015 0 0 0 0 0 0 0 0 0 0 0 
-2205.04 0 2085.25 0 0 0 0 1771.83 0.05 0 0 0 2061.6 0 0 1932.36 2179.1 0 0 0 990.707 0 0 0 0 0 0 0 0 0 0 0 0 0 0 0 0 0 -2376.4 0 0 -235.527 1495.94 0 0 0 0 0 0 0 0 
929.67 0 1755.81 0 0 0 0 0 0 0.05 0 0 0 95.1415 2233.27 0 0 0 0 0 0 0 0 0 0 0 0 0 0 0 -1964.25 -166.097 0 756.63 0 -722.602 0 0 0 0 0 0 0 0 0 0 0 0 0 -1504.18 1609.78 
0 1472.29 0 0 231.864 0 1964.4 0 0 0 0.09 1904.89 0 0 -1582 0 615.787 0 0 0 0 -2030.17 1558.81 0 2388.91 0 0 0 0 0 -2328.94 0 0 0 0 0 0 0 0 0 0 0 0 0 0 0 0 0 0 0 0 
0 956.832 -1283.53 0 0 0 0 0 0 0 -861.919 0.05 2369.84 0 0 0 0 0 1499.76 0 2282.56 1971.11 2447.81 0 0 0 1289.48 0 0 0 0 0 933.18 0 0 0 0 -25.8644 0 0 0 0 0 0 0 0 0 0 0 0 0 
2380.21 0 0 0 0 0 345.546 0 1490.45 0 0 -766.549 0.07 0 0 0 0 0 0 0 0 0 2107.68 0 0 0 0 0 0 0 0 0 0 0 0 0 -1029.92 0 0 0 0 0 0 1562.01 0 0 0 0 0 0 0 
0 0 0 1808.45 0 0 0 1629.61 0 -168.996 0 0 0 0.09 0 0 0 0 0 -1963.48 0 0 0 0 0 0 0 0 0 0 0 1179.01 0 0 0 0 1435.82 0 0 0 0 0 0 0 0 0 0 0 0 0 0 
0 0 0 0 0 0 1692.18 1599.55 0 1236.99 -2009.41 0 0 0 0.06 -941.725 0 0 0 0 0 0 1400.27 0 0 0 0 0 0 0 0 0 0 0 0 0 0 0 0 1890.09 0 0 0 0 0 0 449.919 0 0 0 0 
759.224 0 1655.86 0 0 0 0 0 -1358.46 0 0 0 0 0 -1039.69 0.07 1336.63 0 0 0 0 0 0 0 0 0 -2147.36 0 0 0 0 0 0 0 0 0 0 0 0 2014.45 0 0 0 0 0 0 0 0 0 0 0 
0 0 1199.91 0 -2011.4 0 0 0 2460.48 0 -385.525 0 0 0 0 1865.37 0.05 0 0 0 0 0 0 1972.33 0 0 0 0 1382.87 0 0 0 2443.24 0 0 0 0 0 0 0 0 0 0 0 0 0 -1570.25 0 0 0 0 
0 0 0 684.912 0 0 0 0 0 0 0 0 0 0 0 0 0 0.09 1806.47 0 1581.39 0 2161.4 0 0 0 0 0 0 2006.67 0 0 -1914.2 0 0 0 0 0 0 0 0 0 0 0 -1635.87 0 0 0 0 0 0 
0 0 60.8081 2318.11 -1124.53 0 0 0 0 0 0 87.2066 0 0 0 0 0 1936.63 0.05 0 736.793 0 1681.19 -2412.87 0 0 0 0 0 0 0 0 0 0 0 0 0 0 0 0 0 0 0 0 0 0 0 0 0 0 0 
0 0 0 1005.05 0 0 0 0 0 0 0 0 0 2308.8 0 0 0 0 0 0.04 0 0 0 0 0 0 0 0 0 0 0 0 0 0 1537.75 0 0 0 0 0 -1289.18 0 0 529.725 0 0 0 0 0 91.3266 0 
0 0 0 0 0 1311.61 0 -1941.05 1324.73 0 0 832.926 0 0 0 0 0 925.245 983.84 0 0.09 2463.07 0 0 0 0 1273 0 0 0 0 -116.504 0 0 0 1171.53 0 1836.99 0 0 480.743 0 0 0 0 0 0 0 0 0 266.35 
0 0 -1635.56 0 2474.36 1474.88 2037.34 0 0 0 -573.672 599.307 0 0 0 0 0 0 0 0 527.284 0.05 0 0 0 730.537 0 0 0 0 0 1284.75 1032.98 0 0 0 0 0 0 0 0 0 0 946.15 0 0 0 0 0 -616.855 0 
0 104.755 0 722.449 0 0 0 0 0 0 -188.681 1829.66 1894.36 0 80.7978 0 0 2302.7 -534.761 0 0 0 0 0 0 0 0 0 0 0 0 0 0 0 0 0 -552.461 0 0 0 0 -404.294 0 0 0 0 0 -774.789 0 0 0 
1299.86 0 0 0 0 0 -1398.74 0 0 0 0 0 0 0 0 0 2465.97 0 1462.68 0 0 0 0 0 0 0 0 0 0 0 0 0 0 0 0 0 0 816.141 0 653.63 197.226 0 0 0 0 0 0 0 0 -2439.73 2330.93 
0 -612.888 0 0 0 0 0 -640.202 0 0 48.1429 0 0 0 0 0 0 0 0 0 0 0 0 0 0.08 0 0 1205.71 0 0 0 0 0 0 0 0 0 927.534 273.827 619.907 0 0 0 0 0 0 0 0 0 0 0 
0 0 0 0 -1121.17 0 0 0 0 0 0 0 0 0 0 0 0 0 0 0 0 1602.3 0 0 0 0 0 153.737 0 0 0 0 0 0 0 0 0 0 0 0 0 0 0 0 0 0 0 0 -558.87 0 0 
0 0 0 0 0 0 0 0 0 0 0 -675.298 0 0 0 -50.737 0 0 0 0 1360.74 0 0 0 0 0 0.05 0 0 0 0 0 0 0 0 0 0 0 0 0 0 0 1401.94 0 -981.857 0 0 0 0 0 0 
0 0 452.818 0 -1482.06 0 0 0 0 0 0 0 0 0 0 0 0 0 0 0 0 0 0 0 2429.35 70.8792 0 0.02 0 0 0 0 0 0 0 0 0 0 929.67 0 0 0 0 0 2328.33 1313.59 2383.88 0 0 0 0 
-435.423 0 0 0 0 0 0 0 0 0 0 0 0 0 0 0 1539.12 0 0 0 0 0 0 0 0 0 0 0 0.05 1182.52 0 0 0 0 0 0 0 0 0 0 0 0 0 0 0 0 0 0 0 0 0 
0 0 0 0 0 0 0 0 0 0 0 0 0 0 0 0 0 1578.49 0 0 0 0 0 0 0 0 0 0 -876.72 0 0 0 0 0 0 0 0 0 0 0 1785.41 0 0 0 0 0 0 0 0 0 0 
-2274.62 0 0 0 0 0 0 0 0 2373.2 2389.37 0 0 0 0 0 0 0 0 0 0 0 0 0 0 0 0 0 0 0 0.04 0 0 0 0 0 0 0 0 0 0 0 0 0 0 0 0 0 453.124 0 233.543 
0 0 0 0 0 0 0 0 0 -61.1133 0 0 0 -1835.76 0 0 0 0 0 0 1782.05 326.472 0 0 0 0 0 0 0 0 0 0.03 0 0 0 -104.297 0 0 0 0 1565.98 0 0 0 0 0 569.704 0 0 0 1901.68 
0 0 0 -1009.32 0 0 0 0 0 0 0 854.289 0 0 0 0 -1162.68 2360.99 0 0 0 2234.34 0 0 0 0 0 0 0 0 0 0 0.06 0 0 0 0 0 0 0 0 0 0 0 0 0 0 0 -227.897 0 0 
0 0 0 2473.45 0 0 0 0 0 1327.94 0 0 0 0 0 0 0 0 0 0 0 0 0 0 0 0 0 0 0 0 0 0 0 0.04 -1636.33 0 0 0 0 -1439.94 0 0 -792.032 0 0 0 0 0 0 0 0 
2431.49 0 0 -207.907 -669.195 0 0 0 0 0 0 0 0 0 0 0 0 0 0 1438.26 0 0 0 0 0 0 0 0 0 0 0 0 0 887.555 0.09 0 0 0 0 0 1076.31 961.104 0 0 0 1197.01 0 0 0 0 -1339.99 
1397.67 1517.3 0 0 0 0 0 0 0 1431.39 0 0 0 0 0 0 0 0 0 0 486.999 0 0 0 0 0 0 0 0 0 0 2051.23 0 0 0 0.09 0 0 0 0 0 0 0 0 0 42.6496 0 0 0 720.771 0 
0 -2273.09 0 0 -664.464 0 0 0 0 0 0 0 2393.64 1997.82 0 0 0 0 0 0 0 0 562.838 0 0 0 0 0 0 0 0 0 0 0 0 0 0.09 0 0 0 0 0 0 0 0 714.667 0 0 0 0 0 
1699.96 0 0 0 0 0 -163.961 0 0 0 0 1327.78 0 0 0 0 0 0 0 0 1067.92 0 0 -1656.62 1620.91 0 0 0 0 0 0 0 0 0 0 0 0 0.08 0 0 385.83 0 0 0 0 0 0 -1780.07 0 0 0 
877.941 0 1937.09 0 0 -312.891 0 722.755 -1591.46 0 0 0 0 0 0 0 0 0 0 0 0 0 0 0 1026.87 0 0 -1115.99 0 0 0 0 0 0 0 0 0 0 0.08 0 1324.12 1647.92 -1740.7 0 0 0 0 0 0 0 0 
0 0 0 0 0 0 0 2496.19 0 0 0 0 0 0 -1641.51 2223.04 0 0 0 0 0 0 0 1563.39 -381.863 0 0 0 0 0 0 0 0 476.623 0 0 0 0 0 0.08 0 0 0 0 0 0 0 0 0 0 0 
0 0 0 0 0 0 762.886 0 0 0 0 0 0 0 0 0 0 0 0 915.784 846.507 0 0 -1107.9 0 0 0 0 0 380.184 0 1727.58 0 0 -148.854 0 0 2323.76 -1133.23 0 0.01 0 0 0 0 0 0 0 0 0 0 
0 0 0 0 73.3207 0 0 0 -1344.11 0 0 0 0 0 0 0 0 0 0 0 0 0 2469.79 0 0 0 0 0 0 0 0 0 0 0 -733.589 0 0 0 1953.41 0 0 0.09 0 0 0 0 0 0 0 0 0 
0 0 0 0 0 0 0 0 2459.56 0 0 0 0 0 0 0 0 0 0 0 0 0 0 0 0 0 136.494 0 0 0 0 0 0 -357.753 0 0 0 0 206.687 0 0 0 0.08 0 0 0 0 0 0 375.149 0 
1832.71 0 -1297.72 0 0 2093.04 0 0 0 0 0 0 -1190.3 0 0 0 0 0 0 1711.55 0 1978.13 0 0 0 0 0 0 0 0 0 0 0 0 0 0 0 0 0 0 0 0 0 0.09 0 0 851.543 0 1752.6 0 0 
0 0 0 0 0 2216.94 0 0 0 0 0 0 0 0 0 0 0 1076.01 0 0 0 0 0 0 0 0 -117.725 -1486.48 0 0 0 0 0 0 0 0 0 0 0 0 0 0 0 0 0.07 0 0 0 0 0 0 
0 0 0 0 0 0 0 0 0 0 0 0 0 0 0 0 0 0 0 0 0 0 0 0 0 0 0 439.543 0 0 0 0 0 0 1637.85 -561.007 1677.53 0 0 0 0 0 0 0 0 0 0 0 -1094.32 0 0 
0 2306.36 0 0 0 6.18 0 0 0 0 0 0 0 0 376.064 0 -503.479 0 0 0 0 0 0 0 0 0 0 1923.51 0 0 0 -12.1311 0 0 0 0 0 0 0 0 0 0 0 -110.858 0 0 0.08 0 0 0 0 
203.33 0 0 0 0 0 0 0 0 0 0 0 0 0 0 0 0 0 0 0 0 0 1977.98 0 0 0 0 0 0 0 0 0 0 0 0 0 0 589.084 0 0 0 0 0 0 0 0 0 0.08 0 0 0 
0 0 0 0 2152.55 0 0 0 0 0 0 0 0 0 0 0 0 0 0 0 0 0 0 0 0 -843.608 0 0 0 0 90.1059 0 2234.79 0 0 0 0 0 0 0 0 0 0 1620.91 0 1550.11 0 0 0.02 0 0 
0 194.021 0 0 0 0 0 0 0 -557.802 0 0 0 0 0 0 0 0 0 -2295.07 0 -259.789 0 922.803 0 0 0 0 0 0 0 0 0 0 0 2136.83 0 0 0 0 0 0 2488.56 0 0 0 0 0 0 0.09 0 
724.891 0 0 0 0 0 0 0 0 2337.79 0 0 0 0 0 0 0 0 0 0 2373.2 0 0 -2424.31 0 0 0 0 0 0 1099.96 -187.765 0 0 551.851 0 0 0 0 0 0 0 0 0 0 0 0 0 0 0 0 
