*Vertices 49
*Matrix 
0.08 0 0 0 0 0 0 0 1819.44 -1234.7 0 1630.07 0 0 0 0 0 0 0 0 0 1160.08 0 0 232.322 0 0 0 0 0 0 2220.76 0 0 0 -1229.36 -2201.53 0 2439.57 0 2069.23 0 0 0 0 2320.09 0 0 0 
0 0.06 53.9415 179.678 0 0 0 0 0 0 -74.5415 0 0 0 -551.698 0 0 0 1910.99 0 1885.97 0 1793.04 0 0 0 0 0 0 0 0 -1246.91 1888.56 0 0 729.011 0 0 0 -1324.27 0 0 -119.709 -842.387 -1258.81 0 0 0 0 
0 1461.76 0.09 -150.838 835.673 0 0 0 0 0 0 -961.715 0 0 0 0 0 0 0 0 0 0 0 0 0 -529.42 0 0 0 0 0 -275.811 2251.43 0 269.402 0 -310.907 0 0 0 0 2127.06 0 124.592 -2313.99 0 0 0 0 
0 -1816.69 1222.65 0 0 0 0 -1252.71 0 1400.57 0 0 0 0 49.6689 932.875 0 0 2293.24 0 0 0 0 0 0 0 0 0 0 0 2372.59 0 0 0 0 0 -1171.38 0 0 0 0 -1785.26 0 0 0 0 0 0 0 
0 0 -2119.28 0 0 845.134 1161.61 -1265.68 2167.65 0 0 0 -1480.99 0 143.818 0 0 0 0 0 0 2498.47 -815.989 0 0 2433.01 -1953.26 0 1418.12 0 0 2349.39 0 0 0 0 0 0 0 0 418.943 0 0 0 0 0 0 0 1191.52 
0 0 0 0 1151.69 0.04 0 -2257.84 0 0 0 0 0 -1488.16 866.802 0 0 0 0 0 -659.886 0 0 1781.59 0 0 0 396.664 -846.049 -863.292 591.525 0 0 0 1130.02 0 -1526.61 0 1826.46 0 1966.99 1313.59 0 0 0 0 2429.35 587.71 0 
0 0 0 0 -473.113 0 0.07 0 0 0 0 0 -1991.41 0 752.815 0 0 0 2340.69 0 2424.31 1034.04 0 -2446.13 0 625.401 0 0 0 0 0 0 0 1630.99 0 0 0 0 0 0 276.116 0 1916.33 0 -2491.61 0 0 -550.478 0 
0 0 0 1898.48 -400.327 641.575 0 0.02 1652.81 0 0 606.937 0 0 0 0 1048.39 0 0 0 0 0 0 0 0 0 0 0 0 -1811.2 0 0 0 0 0 0 2375.18 0 1782.2 0 0 -2372.13 763.802 0 0 0 0 0 0 
1533.02 0 0 0 1832.41 0 0 -588.473 0.06 0 -243.614 -934.248 0 0 816.294 0 0 2241.81 0 -1010.09 559.938 0 0 716.041 -846.965 0 120.167 0 0 -2324.67 0 -2375.94 0 2365.87 1030.53 1232.41 0 0 1836.53 0 0 0 0 0 0 0 0 0 0 
495.544 0 0 -2123.86 0 0 0 0 0 0.04 0 0 1103.78 0 0 0 0 0 0 0 0 0 0 0 0 0 0 0 0 0 0 1484.65 1338.77 0 0 0 0 0 0 0 0 0 0 0 -1817.15 0 0 0 0 
0 1238.36 0 0 0 0 0 0 1423.92 0 0.08 0 0 0 0 0 0 0 0 0 2491.61 0 0 0 0 0 -1621.98 0 0 0 0 0 0 0 -227.897 0 0 1170.92 0 0 0 0 0 0 0 825.297 0 0 0 
-2150.56 0 1962.26 0 0 0 0 -1021.53 1718.27 0 0 0.02 0 1205.25 0 0 0 0 -1508.3 0 0 0 0 0 0 0 0 0 0 0 0 0 0 0 0 0 56.0778 211.875 1915.11 602.512 0 0 2415.77 0 0 0 0 0 0 
0 0 0 0 36.0881 0 1805.09 0 0 2402.95 0 0 0.03 1867.66 0 -914.411 0 0 0 0 -998.794 0 0 0 123.829 0 0 0 0 0 -2002.4 -257.5 0 2207.48 0 0 0 0 0 2239.83 0 0 0 0 0 0 0 0 0 
0 0 0 0 0 752.51 0 0 0 0 0 2499.24 1590.09 0.06 0 0 0 0 0 -562.075 0 0 0 857.799 0 561.312 0 0 1653.11 24.9489 0 0 1746.04 0 1611.91 0 0 -1432.31 -463.042 0 0 -1542.33 0 0 0 0 0 0 0 
0 -1752.45 0 141.987 106.586 1576.05 166.707 0 1904.89 0 0 0 0 0 0.01 0 0 0 0 0 0 0 0 153.279 1843.39 -1543.4 0 1113.54 -2058.24 0 0 -225.303 751.137 0 0 0 0 -1677.37 0 0 -258.263 0 361.11 0 0 0 0 0 0 
0 0 0 -1122.24 0 0 0 0 0 0 0 0 2118.06 0 0 0.07 0 -1840.65 0 0 813.395 0 1667.46 0 0 0 1029.47 0 0 2023.76 0 0 -1487.7 0 0 0 0 0 0 0 0 0 0 0 0 0 0 0 -277.49 
0 0 0 0 0 0 0 -1379.21 0 0 0 0 0 0 0 0 0.08 0 0 1953.26 0 -1272.85 0 2274.47 0 0 -2153.61 0 1666.08 -14.2674 -1429.72 0 0 1797.62 0 0 0 0 1446.65 0 0 -2397.46 0 0 0 0 0 0 0 
0 0 0 0 0 0 0 0 -392.697 0 0 0 0 0 0 -386.441 0 0.05 0 0 0 0 0 -1873.45 0 250.023 998.032 -2018.11 0 0 0 777.383 0 0 0 2412.11 0 0 0 0 0 1747.72 0 0 0 0 0 0 0 
0 59.5874 0 2226.4 0 0 1621.83 0 0 0 0 2274.32 0 0 0 0 0 0 0.02 0 0 0 1679.82 0 0 0 0 0 -2008.19 0 0 0 0 0 0 0 0 0 0 0 222.098 0 0 0 0 0 0 0 0 
0 0 0 0 0 0 0 0 -1040.15 0 0 0 0 -125.507 0 0 1959.52 0 0 0 0 -67.5222 0 1698.13 0 -407.193 0 0 0 0 359.737 0 0 -2421.87 0 -1694.01 1090.81 0 2296.14 2287.29 0 0 0 0 0 867.412 1541.72 0 0 
0 1482.21 0 0 0 -2456.21 -25.7118 0 -1083.48 0 523.621 0 511.261 0 0 940.199 0 0 0 0 0 1223.87 0 0 0 -366.909 464.11 0 0 0 0 0 1632.66 1995.68 0 2117.6 0 556.124 2216.64 1753.06 0 2441.25 0 2395.02 0 919.904 0 0 -2390.29 
2088.76 0 0 0 2176.5 0 -1765.88 0 0 0 0 0 0 0 0 0 -424.741 0 0 2201.22 1838.21 0.05 0 -1817.15 0 0 0 0 0 0 0 1777.02 1470.61 201.498 0 0 0 0 0 -1101.03 0 0 0 0 2306.36 0 0 0 0 
0 -332.27 0 0 -533.54 0 0 0 0 0 0 0 0 0 0 2260.43 0 0 2029.71 0 0 0 0.07 0 -114.521 0 0 0 0 0 0 0 0 0 0 -394.528 0 0 0 0 0 0 0 0 0 0 0 2109.52 0 
0 0 0 0 0 458.922 1725.14 0 1147.27 0 0 0 0 1063.65 -997.879 0 290.002 -1636.33 0 953.627 0 586.032 0 0.06 0 0 2152.24 0 -87.6644 0 0 0 -1235.47 0 0 0 0 0 0 -1892.68 0 354.549 0 0 0 0 -619.755 0 0 
-1147.72 0 0 0 0 0 0 0 -682.928 0 0 0 -661.718 0 535.066 0 0 0 0 0 0 0 2179.71 0 0.08 1814.55 -1404.54 0 154.653 0 2399.9 0 0 1844.31 0 -627.689 0 0 0 2309.56 1064.56 10.3 0 640.355 0 0 0 0 0 
0 0 2078.23 0 1119.19 0 -728.706 0 0 0 0 0 0 341.426 -1007.95 0 0 777.688 0 2159.87 -1057.08 0 0 0 -2084.49 0.03 2464.75 0 0 2449.64 0 0 2160.79 0 0 0 0 0 0 0 0 0 0 -428.404 0 0 0 0 0 
0 0 0 0 731.758 0 0 0 15.6407 0 644.78 0 0 0 0 1227.68 1037.86 755.104 0 0 -789.438 0 0 1966.38 2192.68 216.453 0.09 0 0 0 0 588.168 0 0 0 0 0 0 0 1542.18 0 0 0 -575.503 0 0 0 -2356.72 0 
0 0 0 0 0 1039.38 0 0 0 0 0 0 0 0 1838.82 0 0 1377.99 0 0 0 0 0 0 0 0 0 0 1155.81 0 -2096.7 2153.77 0 0 0 0 0 0 0 71.6422 826.67 0 0 0 0 0 0 0 0 
0 0 0 0 -136.036 2225.64 0 0 0 0 0 0 0 -2070.3 1024.89 0 261.01 0 -2120.96 0 0 0 0 2219.69 -2482.15 0 0 -1966.38 0.08 1892.38 0 2411.34 0 0 0 335.627 0 0 0 0 173.421 0 0 0 0 0 0 0 0 
0 0 0 0 0 -1863.69 0 902.966 -2221.06 0 0 0 0 2208.09 0 262.688 117.725 0 0 0 0 0 0 0 0 2309.26 0 0 -1303.67 0.07 -718.329 -1019.85 0 0 135.426 -1185.72 0 0 865.581 0 2211.14 0 0 0 -159.993 0 1400.72 0 0 
0 0 0 873.363 0 914.106 0 0 0 0 0 0 926.618 0 0 0 -233.543 0 0 1112.32 0 0 0 0 -1778.54 0 0 1842.63 0 1278.65 0.05 0 0 0 0 0 0 0 233.39 732.673 0 2369.99 0 1185.11 0 0 0 0 -800.882 
526.978 -676.061 137.562 0 -1462.52 0 0 0 2432.25 2485.35 0 0 -2147.97 0 -346.767 0 0 322.657 0 0 0 -1082.26 0 0 0 0 -807.291 -983.078 -1801.13 1112.63 0 0.09 0 0 0 0 0 0 0 2193.29 0 -465.636 911.664 2172.54 458.159 0 0 0 533.54 
0 2458.49 2053.06 0 0 0 0 0 0 -24.4911 0 0 0 -1335.57 -188.681 134.663 0 0 0 0 -1090.66 248.497 0 500.732 0 1260.34 0 0 0 0 0 0 0 0 0 0 0 0 0 0 0 0 0 0 0 0 0 0 0 
0 0 0 0 0 0 1827.52 0 407.956 0 0 0 1565.68 0 0 0 -1519.75 0 0 975.753 -1785.41 -2117.6 0 0 -373.623 0 0 0 0 0 0 0 0 0.02 0 1785.1 0 0 0 0 0 1502.81 1551.94 2344.66 0 0 0 -1626.71 0 
0 0 -2378.23 0 0 1916.94 0 0 2298.73 0 -143.818 0 0 -1719.95 0 0 0 0 0 0 0 0 0 0 0 0 0 0 0 278.71 0 0 0 0 0 2248.07 0 181.356 0 0 0 -98.9563 1341.21 0 1906.72 0 0 0 0 
-1761.3 1203.73 0 0 0 0 0 0 -300.226 0 0 0 0 0 0 0 0 2165.06 0 1378.9 2159.87 0 292.901 0 -2320.7 0 0 0 577.944 -622.349 0 0 0 -799.509 850.169 0.01 -762.886 0 -526.063 1990.49 2045.43 0 0 0 -792.947 0 0 0 0 
-2260.28 0 -1129.57 373.775 0 1113.7 0 1131.7 0 0 0 66.6066 0 0 0 0 0 0 0 1385.01 0 0 0 0 0 0 0 0 0 0 0 0 0 0 0 320.215 0.05 0 0 0 0 1216.54 0 0 0 0 0 -993.454 0 
0 0 0 0 0 0 0 0 0 0 649.51 1953.72 0 1663.18 -1153.98 0 0 0 0 0 775.704 0 0 0 0 0 0 0 0 0 0 0 0 0 294.885 0 0 0.06 0 0 695.593 2304.68 -916.547 0 -1935.41 0 0 0 -904.035 
-539.796 0 0 0 0 -1443.91 0 810.495 500.275 0 0 834.3 0 -1095.08 0 0 -1399.66 0 0 304.651 269.25 0 0 0 0 0 0 0 0 2358.85 1594.67 0 0 0 0 2279.5 0 0 0 0 0 531.861 0 0 0 0 0 0 0 
0 1769.08 0 0 0 0 0 0 0 0 0 -1781.59 991.012 0 0 0 0 0 0 -832.469 2038.1 1114.61 0 -1697.36 -2255.7 0 2052.6 587.405 0 0 161.214 1267.66 0 0 0 -881.451 0 0 0 0.07 0 0 0 0 0 0 0 -1820.66 0 
-2470.09 0 0 0 -791.116 2338.71 -1961.81 0 0 0 0 0 0 0 2313.68 0 0 0 1439.18 0 0 0 0 0 519.196 0 0 -471.129 1143.15 905.713 0 0 0 0 0 1528.14 0 122.15 0 0 0 0 0 0 0 0 1728.95 0 0 
0 0 644.627 1476.26 0 1134.45 0 -1089.13 0 0 0 0 0 -22.2022 0 0 715.278 1640.9 0 0 279.473 0 0 1481.75 -295.495 0 0 0 0 0 2151.02 588.931 0 -1211.2 2034.44 0 -1263.08 -2033.37 -223.624 0 0 0.08 -22.2022 0 0 0 0 0 0 
0 1672.19 0 0 0 0 1745.58 1571.93 0 0 0 -1945.17 0 0 -2192.37 0 0 0 0 0 0 0 0 0 0 0 0 0 0 0 0 -257.653 0 2019.33 -1181.45 0 0 1807.84 0 0 0 -1206.78 0.03 850.169 0 0 0 0 0 
0 1623.81 -522.553 0 0 0 0 0 0 0 0 0 0 0 0 0 0 0 0 0 57.7563 0 0 0 -381.252 -2371.21 -2020.86 0 0 0 2116.08 2384.79 0 1357.54 0 0 0 0 0 0 0 0 1700.72 0.07 0 0 0 0 0 
0 2315.82 877.331 0 0 0 -2151.94 0 0 -2205.19 0 0 0 0 0 0 0 0 0 0 0 2147.66 0 0 0 0 0 0 0 -59.5874 0 2444.46 0 0 -1579.71 50.2792 0 -206.839 0 0 0 0 0 0 0.05 0 22.5074 0 0 
-713.599 0 0 0 0 0 0 0 0 0 1750.92 0 0 0 0 0 0 0 0 -1481.6 1282.31 0 0 0 0 0 0 0 0 0 0 0 0 0 0 0 0 0 0 0 0 0 0 0 0 0.05 -431.608 0 0 
0 0 0 0 0 2266.84 0 0 0 0 0 0 0 0 0 0 0 0 0 360.805 0 0 0 -1790.14 0 0 0 0 0 599.612 0 0 0 0 0 0 0 0 0 0 1707.74 0 0 0 192.495 2454.53 0.09 0 0 
0 0 0 0 0 -778.146 1433.99 0 0 0 0 0 0 0 0 0 0 0 0 0 0 0 2483.52 0 0 0 -188.07 0 0 0 0 0 0 1865.98 0 0 1817.3 0 0 1670.81 0 0 0 0 0 0 0 0.07 0 
0 0 0 0 18.54 0 0 0 0 0 0 0 0 0 0 935.621 0 0 0 0 -544.832 0 0 0 0 0 0 0 0 0 1457.95 793.71 0 0 0 0 0 -1453.52 0 0 0 0 0 0 0 0 0 0 0.02 
