*Vertices 41
*Matrix 
0.09 0 0 0 0 0 591.83 0 2493.9 0 0 711.921 0 0 0 0 0 0 0 0 0 1822.03 -305.109 -369.655 0 0 0 0 0 110.248 994.217 0 0 0 0 1462.52 0 0 1674.02 -1602.15 -1585.82 
0 0.02 0 0 0 0 0 2025.44 0 0 0 0 0 -1112.17 0 0 0 0 0 0 1350.52 0 0 0 0 0 -1353.42 0 0 -363.552 1689.28 0 0 1287.5 0 0 0 0 0 0 0 
0 0 0.05 0 0 0 428.251 0 0 0 0 0 0 0 -968.429 0 0 1608.4 -1215.78 0 0 0 -1404.84 507.752 -813.7 0 0 0 -88.7326 0 0 1596.96 0 645.543 0 0 1980.27 0 0 453.887 0 
0 0 0 0.04 1752.91 0 0 0 0 0 0 -199.21 859.63 0 -2194.66 0 0 -755.867 0 -93.1578 0 0 0 0 0 0 -1899.7 0 0 0 0 0 0 0 0 0 0 0 0 1870.71 1349.76 
0 0 0 1249.05 0.09 -1686.83 -389.95 0 0 0 0 -1781.75 494.018 0 0 1088.21 0 0 0 0 0 0 0 0 0 2234.79 0 -444.426 -1531.95 -1797.46 664.159 0 0 2351.22 0 528.657 -351.192 0 1575.44 0 1885.51 
0 0 0 0 -454.497 0.04 0 0 279.321 1400.42 2271.72 0 0 0 -316.095 2235.86 -2104.02 2180.47 0 0 0 0 0 1706.52 0 0 0 0 0 703.833 0 0 -1350.37 0 0 0 1681.95 0 0 0 1448.18 
2398.98 0 -241.325 0 -1865.21 0 0.08 0 0 0 0 0 0 0 0 -2471.92 0 -1635.87 0 0 0 2235.1 570.925 0 0 0 2457.43 0 0 0 0 0 0 0 0 0 0 0 0 0 0 
0 1716.44 0 0 0 0 0 0.01 0 0 0 0 0 0 0 0 -1369.29 0 0 1771.52 0 0 0 -877.636 0 0 0 0 1127.43 0 0 635.624 0 0 0 2123.55 -1272.39 0 0 0 197.073 
-1312.22 0 0 0 0 2002.85 0 0 0.04 0 0 0 440.001 0 2157.73 0 0 0 18.54 2424.16 0 0 -839.793 0 -606.021 512.482 0 1508.3 0 0 0 0 0 -568.178 0 0 0 0 0 0 0 
0 0 0 0 0 1765.11 0 0 0 0.06 0 0 0 0 -1144.22 0 0 0 0 0 0 0 0 0 0 1320 0 0 194.937 0 2372.74 0 789.895 0 0 0 1588.56 0 0 0 0 
0 0 0 0 0 629.368 0 0 0 0 0.07 0 1968.06 -281.61 0 0 856.578 0 0 0 0 0 0 0 898.389 0 670.415 0 0 0 0 0 0 0 1612.83 2404.48 0 0 0 0 0 
1380.73 0 0 1397.52 1404.69 0 0 0 0 0 0 0 0 0 0 0 2454.37 0 1417.51 0 0 -697.424 2344.97 0 0 0 0 0 -916.547 933.332 0 0 0 0 0 0 1330.53 0 0 -901.746 0 
0 0 0 -72.5578 935.621 0 0 0 -211.722 0 -2105.24 0 0.08 0 0 0 0 0 628.147 0 0 0 0 0 0 0 0 1054.19 0 0 0 1737.34 -115.894 -299.005 -539.644 357.601 1057.24 1951.58 2271.87 0 0 
0 821.482 0 0 0 0 0 0 0 0 -201.651 0 0 0.08 0 0 0 0 -2159.87 1914.2 1036.18 0 0 0 0 0 0 2107.07 0 0 561.464 -588.168 0 0 0 0 0 0 0 0 -47.6852 
0 0 2180.47 -1935.41 0 -2144.31 0 0 1421.93 1451.69 0 0 0 0 0.04 0 1569.95 0 0 -2149.34 -474.944 0 0 852.763 0 0 0 2152.7 0 0 81.1029 0 0 0 0 -958.052 0 0 0 0 0 
0 0 0 0 356.685 1326.72 1397.52 0 0 0 0 0 0 0 0 0.02 0 0 0 -1830.88 0 0 0 984.909 1237.91 -1015.12 1737.49 0 0 -2034.44 0 2477.57 5.56963 1939.07 0 -190.97 0 0 0 0 -1504.49 
0 0 0 0 0 2381.59 0 1929.15 0 0 -76.9829 573.061 0 0 1339.38 0 0.08 -2409.97 0 0 -318.079 0 1182.06 633.03 0 0 0 0 0 2378.54 0 0 -1123 2019.33 0 0 0 1485.26 -2486.42 0 -698.34 
0 0 -2121.57 -34.1044 0 2292.32 2420.19 0 0 0 0 0 0 0 0 0 1367.92 0.04 2341.3 0 -26.4748 0 2186.27 0 0 0 1255.46 -736.03 491.272 0 0 0 0 453.124 0 0 30.2896 -126.423 0 0 0 
0 0 1026.57 0 0 0 0 0 201.346 0 0 1697.06 -1808.3 2332.15 0 0 0 -751.9 0.03 2347.56 0 0 0 0 0 0 0 0 -2307.73 -1221.27 0 0 0 0 0 1741.46 0 0 0 0 0 
0 0 0 1345.18 0 0 0 -1560.64 -2280.42 0 0 0 0 2495.73 -665.38 1334.04 0 0 1779.76 0.06 0 0 721.992 -905.713 -298.853 0 0 2244.71 2291.71 -1639.53 0 0 0 1058.92 0 -1416.75 0 0 0 0 0 
0 1750.16 0 0 0 0 0 0 0 0 0 0 0 967.513 1617.1 0 2330.16 -1747.11 0 0 0.08 -521.943 0 0 0 0 831.401 0 0 1852.09 -1227.68 0 -1200.52 229.423 0 0 0 1690.8 0 0 0 
1171.07 0 0 0 0 0 -284.814 0 0 0 0 2296.14 0 0 0 0 0 0 0 0 2283.78 0.08 2124.32 0 0 -761.208 1685.31 0 2305.75 0 0 -2130.88 -1860.79 -1803.11 0 0 0 0 -692.236 0 0 
1566.59 0 -685.369 0 0 0 -1809.37 0 1699.35 0 0 1681.34 0 0 0 0 -2153.77 290.307 0 1086.23 0 -1485.87 0 0 0 0 953.627 0 0 0 0 -561.159 0 1893.75 -91.4792 0 401.395 0 0 0 0 
2132.71 0 -448.698 0 0 -1587.19 0 2252.8 0 0 0 0 0 0 -1126.97 2126.45 -1219.29 0 0 16.4037 0 0 0 0.05 -46.4644 0 -1612.98 2456.36 0 0 0 1072.19 -1159.32 0 0 0 0 0 2095.63 0 0 
0 0 2434.08 0 0 0 0 0 1706.21 0 -1466.03 0 0 0 0 961.562 0 0 0 -828.501 0 0 0 854.9 0.02 1222.04 0 0 0 0 0 0 -1696.3 289.85 2472.99 2094.1 0 -2325.28 0 691.321 0 
0 0 0 0 474.029 0 0 0 723.212 1745.43 0 0 0 0 0 -829.112 0 0 0 0 0 2030.63 0 0 -474.639 0.04 0 0 0 0 1913.13 -993.606 1517.61 0 0 0 0 0 -1352.5 0 0 
0 -787.912 0 -644.932 0 0 -987.96 0 0 0 668.584 0 0 0 0 256.737 0 225.608 0 0 -151.448 -1929.91 2322.69 1897.11 0 0 0.04 0 0 0 0 -1527.07 933.332 0 1161.61 0 0 0 0 0 1834.7 
0 0 0 0 1952.96 0 0 0 1070.21 0 0 0 -1776.25 -1046.56 1968.06 0 0 732.978 0 -2321.77 0 0 0 1831.95 0 0 0 0.05 0 0 1747.87 0 0 0 0 0 2254.17 0 1428.65 -1575.75 963.393 
0 0 2134.24 0 467.009 0 0 2471.92 0 -562.99 0 101.856 0 0 0 0 0 -2014.15 1943.34 866.192 0 -224.235 0 0 0 0 0 0 0.06 0 0 -2412.72 0 895.947 0 0 0 -183.95 1212.88 0 0 
188.07 -1417.66 0 0 873.669 -1986.22 0 0 0 0 0 -657.14 0 0 0 2261.8 967.971 0 1166.8 1325.34 2410.73 0 0 0 0 0 0 0 0 0.04 0 0 -2230.83 -295.801 0 0 0 0 0 0 0 
-325.098 421.079 0 0 -1788.61 0 0 0 0 1353.72 0 0 0 709.937 -1327.48 0 0 0 0 0 2324.98 0 0 0 0 2079.45 0 1274.38 0 0 0 0 0 0 255.058 -2024.98 -500.275 0 0 0 0 
0 0 651.799 0 0 0 0 1244.47 0 0 0 0 -559.481 68.1326 0 850.322 0 0 0 0 0 886.792 289.239 -695.441 0 -1807.69 -1008.41 0 2007.58 0 0 0.04 0 0 0 0 0 0 0 0 0 
0 0 0 0 0 1702.09 0 0 0 472.045 0 0 -1578.65 0 0 662.786 -1840.04 0 0 0 2251.27 1724.83 0 -1258.96 2303.92 2287.29 -540.254 0 0 -2399.14 0 0 0.09 0 1060.59 -2008.35 0 0 0 0 0 
0 1676.61 -586.337 0 2033.22 0 0 0 -2090.44 0 0 0 -4.0437 0 0 -1714.76 -373.318 -1931.9 0 -1039.08 -262.535 2471.31 327.693 0 1989.27 0 0 0 1923.96 -116.352 0 0 0 0.02 675.756 0 0 0 380.49 0 0 
0 0 0 0 0 0 0 0 0 0 1484.34 0 2297.66 0 0 0 0 0 0 0 0 0 766.701 0 656.987 0 777.383 0 0 0 1620.61 0 2248.07 1234.86 0.04 0 1604.74 0 0 0 0 
1957.38 0 0 0 325.404 0 0 2318.72 0 0 808.664 0 -1166.65 0 186.392 2232.51 0 0 -30.7474 -1086.08 0 0 0 0 109.18 0 0 0 0 0 -1194.42 0 1762.67 0 0 0.06 0 0 0 0 0 
0 0 1070.21 0 -783.334 234.153 0 -1714.76 0 2241.05 0 22.0496 -1199.61 0 0 0 0 655.919 0 0 0 0 2041.15 0 0 0 0 1712.62 0 0 1974.62 0 0 0 -1758.71 0 0.03 0 0 0 0 
0 0 0 0 0 0 0 0 0 0 0 0 2046.8 0 0 0 -440.153 -1386.38 0 0 -455.718 0 0 0 1804.48 0 0 0 377.285 0 0 0 0 0 0 0 0 0.09 0 0 0 
2128.9 0 0 0 83.0866 0 0 0 0 0 0 0 2441.86 0 0 0 321.741 0 0 0 0 -619.907 0 -2406.46 0 706.732 0 2360.38 -1392.94 0 0 0 0 1333.89 0 0 0 0 0.08 0 0 
1129.72 0 -1930.68 -811.411 0 0 0 0 0 0 0 1967.15 0 0 0 0 0 0 0 0 0 0 0 0 1401.94 0 0 -659.124 0 0 0 0 0 0 0 0 0 0 0 0.04 0 
979.873 0 0 -2009.26 1999.8 1733.07 0 1581.24 0 0 0 0 0 -1067.77 0 1715.83 2397 0 0 0 0 0 0 0 0 0 1077.07 -1767.71 0 0 0 0 0 0 0 0 0 0 0 0 0.08 
