*Vertices 68
*Matrix 
0.06 0 -741.371 -2409.36 1780.07 0 1249.2 0 1156.42 0 0 1709.27 0 0 0 0 1439.33 1037.1 0 1793.95 0 2281.79 0 0 0 0 0 384.762 0 0 0 -2286.37 1533.63 0 0 1894.06 0 0 -73.0155 0 0 0 0 0 0 0 0 -699.713 0 1676.15 0 0 0 0 0 -2480.93 0 0 0 0 0 0 0 0 0 0 0 0 
0 0.04 1423.31 2038.87 0 0 2467.35 0 -62.7918 0 0 0 0 0 0 -1079.06 0 1012.83 0 0 0 0 0 0 0 -185.934 0 0 0 0 -2401.88 1375.55 0 0 2351.53 0 0 1594.97 0 0 0 0 0 0 0 0 0 0 0 0 0 0 0 0 0 -74.9992 0 1432.77 0 0 0 0 0 -1474.73 2318.41 0 0 -199.362 
-2154.53 1202.05 0.07 0 0 84.0022 0 0 0 0 0 1667.76 111.469 0 0 822.092 869.091 0 0 0 -1207.69 2401.27 0 153.89 0 655.156 0 -1038.01 0 293.054 0 0 2366.48 0 0 1394.01 0 0 0 0 0 0 0 0 0 0 0 0 -941.725 1965.01 0 0 0 0 0 0 0 0 0 0 0 0 -2082.66 0 0 0 0 584.658 
1280.33 304.498 0 0.02 0 0 0 0 0 2426.15 0 0 190.97 0 1318.02 -971.48 0 0 0 0 -658.666 0 0 0 0 0 -1078.3 824.534 0 0 0 0 -1267.66 0 0 0 0 294.733 0 0 2241.36 0 0 0 0 0 0 0 0 0 0 0 0 936.995 0 0 714.667 981.552 0 0 0 398.648 0 0 0 0 0 0 
887.707 0 0 0 0 0 1154.44 0 -1178.09 0 0 0 0 0 0 0 975.143 0 0 0 0 0 0 0 0 0 601.596 0 0 0 0 2375.79 0 -1335.72 -974.38 2014.6 0 0 0 0 0 -351.039 0 0 0 0 0 0 0 0 0 0 0 0 0 0 0 0 0 0 0 0 0 -237.815 0 0 0 0 
0 0 671.636 0 0 0.01 0 0 0 0 0 2194.51 1319.7 0 0 0 0 743.812 0 803.018 2102.95 0 -1042.13 1299.86 0 -1651.28 0 -1028.7 0 2402.04 0 940.809 0 0 -1079.97 0 0 0 0 -1874.83 0 0 0 0 0 0 0 0 0 0 771.737 0 0 281.152 0 0 0 869.549 0 0 0 0 0 0 2002.4 0 0 1917.4 
-1488.77 15.4881 0 0 2471.92 0 0.07 0 0 0 0 0 0 -1324.12 0 0 0 -2253.87 1734.6 0 1908.55 0 -1733.22 0 0 2236.17 0 0 2090.29 0 0 -1541.26 0 0 0 0 -423.521 0 2411.19 0 0 0 -1256.98 1111.71 0 0 0 0 0 0 0 0 0 0 -1629.61 0 0 0 2096.7 0 0 1263.24 0 0 0 0 0 0 
0 0 0 0 0 0 0 0.07 947.371 0 0 0 0 0 0 -2003.62 1270.71 -1079.36 0 0 1777.63 497.833 0 0 0 0 0 0 20.9815 0 0 0 1113.54 0 0 0 0 0 0 0 51.9578 0 0 0 0 0 0 0 0 0 0 0 0 0 0 0 0 0 0 0 0 0 0 0 0 0 1198.39 0 
1220.05 2125.23 0 0 1592.84 0 0 -1677.68 0 0 0 0 -169.607 0 0 0 -525.3 -177.541 0 0 0 -349.361 0 0 0 0 0 -512.94 0 0 0 2259.67 0 -829.722 0 -145.65 474.639 0 0 0 0 0 0 0 0 0 0 0 0 -687.353 0 0 0 0 0 0 0 0 0 1616.95 0 0 0 0 0 0 0 0 
0 0 0 -2021.77 0 0 0 0 0 0.07 0 0 0 0 0 0 0 0 0 0 0 1165.73 127.338 1355.4 0 0 2379.6 2327.88 0 2179.86 0 0 0 0 0 0 0 0 0 0 0 0 0 0 0 0 0 0 0 0 0 0 0 0 0 0 0 0 0 26.6274 0 0 0 0 0 0 0 0 
0 0 0 0 0 0 0 0 0 0 0.07 0 0 -672.399 0 0 0 772.042 0 -1020.46 410.703 0 -594.424 1623.97 0 0 0 0 0 2342.52 0 0 0 2084.8 0 0 812.937 1849.96 0 0 0 0 0 0 0 0 966.14 0 0 0 0 0 0 0 0 0 0 0 0 -1236.08 0 0 0 0 0 0 0 0 
-1101.18 0 -271.081 0 0 209.433 0 0 0 0 0 0.09 1368.83 0 1614.05 0 0 0 0 0 2488.56 -1719.03 0 -1486.48 1463.9 0 -1496.4 0 0 2146.6 1493.8 0 0 0 0 -1430.02 0 0 0 0 0 0 0 0 -2043.44 0 0 0 0 0 0 0 474.792 0 0 0 585.727 0 0 0 0 0 0 0 0 0 0 0 
0 0 1915.88 -1208.91 0 2133.01 0 0 -541.78 0 0 -90.5637 0.02 0 0 0 0 2222.59 0 2152.09 -1139.33 0 0 2470.7 0 -1867.5 0 -1327.17 0 0 2102.34 2276.76 -2370.45 0 0 -778.298 0 1892.38 0 0 0 0 0 0 0 0 0 0 0 0 0 -2482.76 0 0 0 0 1013.44 0 0 0 0 0 0 0 0 0 0 0 
0 0 0 0 0 0 -223.624 0 0 0 798.288 0 0 0.04 210.044 802.56 0 0 0 -1017.26 0 0 0 0 1027.79 -1777.93 -1168.63 0 0 0 942.946 0 0 1425.44 -750.221 0 0 0 0 0 0 0 0 538.27 0 0 0 0 0 0 0 2451.17 0 0 0 0 0 0 0 0 0 0 0 0 0 0 0 0 
0 0 0 -96.6674 0 0 0 0 0 0 0 1027.79 0 595.34 0.01 0 0 2316.89 2217.25 0 0 0 0 0 -2460.33 0 0 0 1810.43 0 1478.55 0 0 0 0 -1945.78 0 0 -676.519 0 0 0 0 0 0 0 0 0 0 0 0 0 0 0 0 0 0 0 1396.3 0 0 0 0 0 0 0 0 0 
0 -1231.04 1946.24 -1549.65 0 0 0 -74.5415 0 0 0 0 0 422.91 0 0 0 0 0 0 0 0 0 0 0 0 1653.26 0 0 -444.578 0 0 0 2027.88 -1033.74 0 0 1263.85 0 1765.57 0 0 2060.69 0 0 0 -280.236 0 -151.753 0 0 0 0 0 0 0 0 -1288.72 0 0 0 0 1443.3 2456.21 0 0 0 -1210.59 
949.202 0 664.464 0 2388 0 0 -1592.07 -1435.36 0 0 0 0 0 0 0 0.04 0 0 0 0 0 0 0 0 0 0 0 971.023 -2311.24 0 0 1825.69 0 0 0 0 0 1600.92 0 0 0 0 0 0 0 0 0 0 0 0 0 0 0 0 0 0 0 0 0 0 0 0 0 0 0 0 0 
871.227 -1479.77 0 0 0 2065.26 2005.91 1187.4 888.012 0 995.132 0 2154.68 0 -820.719 0 0 0.05 0 0 0 0 0 0 0 -431.913 0 0 2238.46 317.316 0 0 0 0 0 0 0 0 0 0 0 0 0 0 -447.172 0 0 0 0 0 0 0 0 2289.42 0 0 0 0 0 0 0 0 0 -245.598 1611.76 0 0 0 
0 0 0 0 0 0 440.306 0 0 0 0 0 0 0 755.715 0 0 0 0.01 -658.513 0 0 -1881.69 0 0 830.638 0 0 2126.61 0 0 1331.45 0 -364.315 0 0 -2093.04 2280.57 1972.33 0 0 0 0 0 0 0 0 0 0 0 0 0 0 0 2157.73 0 0 0 0 0 -632.572 0 0 0 0 0 0 0 
-470.214 0 0 0 0 1594.82 0 0 0 0 -1415.83 0 496.002 565.584 0 0 0 0 1822.03 0.01 2015.82 0 1534.55 -2392.27 0 1301.69 0 0 -2258.6 0 0 0 0 0 2099.6 0 -438.627 0 0 0 0 0 0 0 0 -77.5933 0 0 0 0 0 0 0 0 0 0 0 0 0 0 0 0 -1782.97 0 883.74 0 0 0 
0 0 -680.944 1777.78 0 -1351.13 -91.0215 1493.65 0 0 1685.92 -455.107 2071.52 0 0 0 0 0 0 -1544.77 0.09 2137.14 0 0 -880.535 2063.74 2016.28 0 0 1088.06 0 0 0 0 2336.42 0 195.09 -1303.83 94.6837 0 0 0 0 2173.76 -495.392 0 0 0 0 0 0 0 0 0 0 0 -138.325 0 0 506.073 0 0 0 112.232 2385.25 0 0 0 
-2083.42 0 2323.3 0 0 0 0 2323.91 839.183 -102.161 0 270.47 0 0 0 0 0 0 0 0 1585.82 0.08 0 1457.49 0 2408.6 2398.22 0 0 0 0 -1606.57 0 0 0 0 0 0 0 0 0 0 0 0 1547.98 0 0 0 0 0 0 0 0 0 0 0 -2362.36 0 0 0 0 0 -1096 0 0 -955.763 0 0 
0 0 0 0 0 2444.46 1017.41 0 0 2226.86 2421.11 0 0 0 0 0 0 0 1061.05 2310.33 0 0 0.01 0 0 0 0 0 0 0 0 0 0 1583.53 -2286.68 -2453.46 0 0 -1309.47 0 0 0 0 0 0 0 0 0 0 0 0 0 -2179.4 0 0 0 0 0 0 -584.811 0 472.503 1953.26 0 0 0 0 0 
0 0 1650.67 0 0 338.069 0 0 0 -2497.41 2162.01 1904.43 1425.75 0 0 0 0 0 0 1035.11 0 1811.66 0 0.01 0 0 -2267.75 -145.039 675.909 -1839.73 -1529.05 -653.172 573.977 0 1936.17 0 0 0 1358.3 0 0 0 -541.169 0 0 0 0 0 0 0 0 0 0 0 0 0 0 57.1459 0 -84.6126 0 0 0 0 0 0 0 0 
0 0 0 0 0 0 0 0 0 0 0 1979.35 0 1690.19 1327.48 0 0 0 0 0 -2114.4 0 0 0 0.02 0 0 2117.15 658.971 0 0 0 0 0 -818.125 0 0 -1738.56 -739.998 0 0 0 0 0 0 0 -2110.28 0 0 0 1310.08 0 0 0 0 0 0 0 0 0 0 0 0 0 0 0 0 0 
0 1741 -1016.34 0 0 -819.956 -29.9844 0 0 0 0 0 1288.57 -2384.33 0 0 0 2016.74 1557.44 871.227 -1128.04 1916.64 0 0 0 0.07 0 0 0 0 0 0 2425.53 0 0 745.643 0 0 0 0 0 0 0 0 0 0 -2427.37 -2005.6 0 0 0 0 0 0 0 0 0 -187.918 0 0 0 0 0 1378.75 0 0 0 -1226 
0 0 0 1594.21 -336.085 0 0 0 0 143.208 0 430.845 0 1476.87 0 765.175 0 0 0 0 -30.7474 -1958.6 0 -1191.82 0 0 0.05 1622.29 1861.71 0 0 0 0 1470.46 0 2333.37 0 0 0 0 0 0 0 0 0 0 0 -560.091 0 0 0 0 0 0 2379.91 0 217.063 0 0 0 -268.487 0 0 0 0 0 0 0 
-345.393 0 1457.03 1707.89 0 -1869.03 0 0 -183.035 2068.77 0 0 -1055.71 0 0 0 0 0 0 0 0 0 0 -224.387 -1139.94 0 1824.17 0 0 0 -1270.1 2066.03 0 2192.83 0 -869.396 0 0 0 0 0 0 0 0 0 0 855.052 0 0 0 0 0 0 0 -1633.27 0 1185.11 0 0 0 0 0 0 0 -360.805 0 0 0 
0 0 0 0 0 0 -217.215 1103.63 0 0 0 0 0 0 163.961 0 -331.355 1547.06 2274.62 1232.57 0 0 0 -285.882 2288.2 0 -2200.92 0 0.09 -305.719 0 0 0 0 0 0 1018.63 0 0 0 -35.9355 0 0 0 0 0 0 0 0 0 0 0 256.89 -406.43 0 0 0 0 2088.31 -150.075 0 0 0 91.6318 -414.212 -2125.84 0 0 
0 0 157.399 0 0 591.372 0 0 0 -1966.08 753.121 1296.04 0 0 0 -2192.53 2229.76 1495.18 0 0 1701.48 0 0 -1119.04 0 0 0 0 1015.58 0.01 0 0 2489.93 0 0 -1989.88 0 -1443.75 2238.76 0 0 0 0 1334.8 0 0 0 0 0 0 -244.53 0 0 0 0 0 0 0 0 0 0 -1552.4 0 0 0 36.5459 0 0 
0 1518.37 0 0 0 0 0 0 0 0 0 195.242 791.879 -1573.15 2186.27 0 0 0 0 0 0 0 0 1326.87 0 0 0 4.65407 0 0 0.04 0 -964.309 0 2095.63 0 0 0 -1233.18 158.773 0 2229.45 0 0 0 2196.65 0 0 0 278.71 0 0 0 0 -1263.54 0 0 0 0 -2341.3 0 -387.661 0 0 0 0 0 0 
2246.39 -2305.6 0 0 1671.88 -169.607 1829.36 0 196.31 0 0 0 -757.393 0 0 0 0 0 -2315.67 0 0 1204.49 0 -448.698 0 0 0 2191.46 0 0 0 0.01 -1623.81 2319.33 2248.22 18.6926 0 2195.58 -467.009 0 0 -571.078 -793.405 -693.609 0 0 0 0 0 0 0 0 0 0 0 -1546.3 0 0 0 0 0 0 -1129.41 0 0 0 0 0 
-2043.14 0 366.298 1637.39 0 0 0 1674.47 0 0 0 0 79.8822 0 0 0 639.286 0 0 0 0 0 0 -53.1785 0 589.389 0 0 0 -704.749 2121.72 304.498 0.09 0 0 0 0 0 0 0 573.061 0 -1487.09 0 0 0 0 0 0 0 0 399.411 0 0 0 0 0 0 0 0 -1909.01 0 0 0 0 0 0 0 
0 0 0 0 880.84 0 0 0 585.116 0 1157.8 0 0 2360.68 0 2001.17 0 0 -1814.1 0 0 0 -2245.32 0 0 0 1247.06 619.144 0 0 0 1298.33 0 0.02 2478.94 0 0 0 0 0 0 0 0 0 -335.17 -74.5415 0 0 0 0 0 0 0 0 0 0 0 0 0 0 0 0 0 -2036.58 0 0 0 0 
0 1567.35 0 0 1072.8 53.4837 0 0 0 0 0 0 0 -19.9133 0 -2468.72 0 0 0 155.568 -1180.38 0 -2402.95 -1221.58 1606.72 0 0 0 0 0 790.811 80.0348 0 2442.32 0.06 0 0 1938.46 0 0 0 938.52 0 0 0 0 0 0 0 0 0 1133.69 0 0 0 0 0 0 0 0 0 0 0 0 0 966.903 0 0 
-218.131 0 739.692 0 257.195 0 0 0 -1894.82 0 0 -393.46 890.606 0 1367 0 0 0 0 0 0 0 -1345.64 0 0 2162.47 2131.49 746.864 0 2323.6 0 -580.538 0 0 0 0.04 0 211.112 0 0 0 0 0 0 0 0 0 0 0 596.561 0 0 0 0 0 0 0 0 0 0 0 2152.09 0 0 0 1382.26 0 0 
0 0 0 0 0 0 1375.7 0 2496.34 0 1766.18 0 0 0 0 0 0 0 724.128 478.912 960.494 0 0 0 0 0 0 0 2431.79 0 0 0 0 0 0 0 0.09 0 -1786.94 -310.144 0 0 0 506.226 0 0 0 0 0 0 0 0 0 0 0 0 0 -560.396 0 0 2272.94 0 0 0 0 0 0 0 
0 2107.38 0 -896.863 0 0 0 0 0 0 2445.52 0 -1681.19 0 0 -2243.19 0 0 1384.7 0 1906.42 0 0 0 464.415 0 0 0 0 -220.878 0 2131.18 0 0 -634.251 218.284 0 0.07 0 0 0 0 0 -444.273 1414.15 0 0 0 0 0 0 0 0 0 0 0 0 0 0 0 0 0 0 0 0 0 0 0 
1451.54 0 0 0 0 0 1643.8 0 0 0 0 0 0 0 -2218.92 0 1598.18 0 1404.54 0 -1067.61 0 1162.68 435.27 -1233.94 0 0 0 0 -1686.38 417.112 1116.75 0 0 0 0 1670.66 0 0.04 533.082 -396.359 0 0 0 0 0 0 0 0 281.61 0 0 0 0 0 1445.59 0 0 1161.15 0 1822.03 -344.02 0 0 0 0 0 0 
0 0 0 0 0 -775.704 0 0 0 0 0 0 0 0 0 298.242 0 0 0 0 0 0 0 0 0 0 0 0 0 0 1742.23 0 0 0 0 0 -915.937 0 1556.98 0.07 0 0 0 0 0 1272.7 0 0 0 0 1810.43 0 0 0 0 -199.667 0 0 0 -576.113 0 0 0 0 0 0 0 0 
0 0 0 -88.7326 0 0 0 795.083 0 0 0 0 0 0 0 0 0 0 0 0 0 0 0 0 0 0 0 0 89.6481 0 0 0 2380.98 0 0 0 0 0 1449.55 0 0.07 0 1888.87 0 0 0 0 0 1447.26 0 0 0 0 0 -1337.24 0 0 0 0 0 0 0 0 0 0 0 0 0 
0 0 0 0 1581.55 0 0 0 0 0 0 0 0 0 0 0 0 0 0 0 0 0 0 0 0 0 0 0 0 0 -2424.16 1518.52 0 0 216.147 0 0 0 0 0 0 0.01 0 0 -1.14444 0 0 1210.44 0 0 0 0 0 0 0 0 -1071.28 0 0 0 0 0 0 0 0 0 0 0 
0 0 0 0 0 0 1533.78 0 0 0 0 0 0 0 0 1685.77 0 0 0 0 0 0 0 1410.49 0 0 0 0 0 0 0 -2447.2 2056.57 0 0 0 0 0 0 0 1925.79 0 0 0 -125.507 0 0 2118.82 0 -934.4 0 0 0 0 0 0 0 0 0 0 0 0 0 0 0 0 0 0 
0 0 0 0 0 0 -461.364 0 0 0 0 0 0 329.676 0 0 0 0 0 0 -758.003 0 0 0 0 0 0 0 0 1298.33 0 139.546 0 0 0 0 275.201 952.101 0 0 0 0 0 0.02 0 0 0 0 -1628.09 0 2167.2 2445.83 1972.95 0 0 0 0 0 0 0 0 0 0 0 0 0 0 1870.4 
0 0 0 0 0 0 0 0 0 0 0 2092.43 0 0 0 0 0 1644.11 0 0 -596.713 2473.3 0 0 0 0 0 0 0 0 0 0 0 1571.47 0 0 0 -1289.79 0 0 0 -1097.83 -207.45 0 0 0 0 0 0 0 0 0 0 0 1000.02 0 0 0 0 0 0 0 0 0 0 0 0 0 
0 0 0 0 0 0 0 0 0 0 0 0 0 0 0 0 0 0 0 2010.48 0 0 0 0 0 0 0 0 0 0 1401.49 0 0 284.356 0 0 0 0 0 1757.94 0 0 0 0 0 0.03 0 0 1309.78 0 0 0 0 0 0 0 0 0 0 0 0 0 0 0 0 0 1209.37 -105.976 
0 0 0 0 0 0 0 0 0 0 2496.34 0 0 0 0 1258.05 0 0 0 0 0 0 0 0 -1800.97 2275.69 0 637.15 0 0 0 0 0 0 0 0 0 0 0 0 0 0 0 0 0 0 0.01 0 0 0 0 0 0 2298.88 0 209.586 0 0 0 0 0 0 0 0 0 0 813.547 0 
2332.3 0 0 0 0 0 0 0 0 0 0 0 0 0 0 0 0 0 0 0 0 0 0 0 0 -252.312 2395.63 0 0 0 0 0 0 0 0 0 0 0 0 0 0 759.377 1850.72 0 0 0 0 0 0 0 0 0 0 0 0 0 0 0 0 0 0 0 0 0 0 0 0 0 
0 0 1326.41 0 0 0 0 0 0 0 0 0 0 0 0 1631.75 0 0 0 0 0 0 0 0 0 0 0 0 0 0 0 0 0 0 0 0 0 0 0 0 -173.269 0 0 -817.057 0 795.236 0 0 0.05 2138.81 0 0 0 0 0 0 0 1757.33 0 0 -1252.86 0 0 0 0 0 0 -574.282 
-96.2096 0 541.78 0 0 0 0 0 -1782.66 0 0 0 0 0 0 0 0 0 0 0 0 0 0 0 0 0 0 0 0 0 -115.284 0 0 0 0 2153.31 0 0 -692.541 0 0 0 1488.31 0 0 0 0 0 846.049 0.06 854.137 -1589.18 0 0 0 0 0 0 -2236.63 544.984 0 0 0 0 0 0 0 0 
0 0 0 0 0 1507.69 0 0 0 0 0 0 0 0 0 0 0 0 0 0 0 0 0 0 -252.159 0 0 0 0 -1077.68 0 0 0 0 0 0 0 0 0 525.3 0 0 0 659.734 0 0 0 0 0 -1228.45 0.02 0 1746.65 0 -1441.77 0 0 0 0 0 0 0 0 0 0 0 0 0 
0 0 0 0 0 0 0 0 0 0 0 0 2296.44 2002.7 0 0 0 0 0 0 0 0 0 0 0 0 0 0 0 0 0 0 2308.5 0 489.593 0 0 0 0 0 0 0 0 488.22 0 0 0 0 0 2439.73 0 0.07 0 0 0 0 0 0 0 0 0 0 0 0 0 0 0 0 
0 0 0 0 0 0 0 0 0 0 0 1722.85 0 0 0 0 0 0 0 0 0 0 1.29704 0 0 0 0 0 1571.02 0 0 0 0 0 0 0 0 0 0 0 0 0 0 -224.693 0 0 0 0 0 0 -805.307 0 0 -585.574 0 0 0 0 0 0 0 0 0 0 0 0 0 0 
0 0 0 664.159 0 601.596 0 0 0 0 0 0 0 0 0 0 0 -1480.99 0 0 0 0 0 0 0 0 0 0 1492.13 0 0 0 0 0 0 0 0 0 0 0 0 0 0 0 0 0 184.103 0 0 0 0 0 704.291 0.03 0 0 0 0 0 0 2045.43 0 0 0 0 0 543.306 0 
0 0 0 0 0 0 2409.82 0 0 0 0 0 0 0 0 0 0 0 -1320.15 0 0 0 0 0 0 0 2284.84 -2124.32 0 0 2389.83 0 0 0 0 0 0 0 0 0 -1995.99 0 0 0 1473.36 0 0 0 0 0 1042.59 0 0 0 0.05 0 0 0 0 0 0 -328.455 0 0 0 0 0 0 
1495.48 -804.697 0 0 0 0 0 0 0 0 0 0 0 0 0 0 0 0 0 0 0 0 0 0 0 0 0 0 0 0 0 -1092.49 0 0 0 0 0 0 -696.356 342.952 0 0 0 0 0 0 1217.92 0 0 0 0 0 0 0 0 0 0 0 2435.91 0 0 0 0 0 0 0 1106.83 0 
0 0 0 1730.78 0 0 0 0 0 0 0 1428.8 2297.2 0 0 0 0 0 0 0 953.322 106.738 0 0 0 0 -704.443 509.888 0 0 0 0 0 0 0 0 0 0 0 0 0 486.999 0 0 0 0 0 0 0 0 0 0 0 0 0 0 0.08 0 0 0 2208.7 0 0 0 877.483 1621.98 0 0 
0 -1120.11 0 1940.9 0 940.352 0 0 0 0 0 0 0 0 0 1238.52 0 0 0 0 0 0 0 26.9326 0 466.857 0 0 0 0 0 0 0 0 0 0 889.233 0 0 0 0 0 0 0 0 0 0 0 -83.697 0 0 0 0 0 0 0 0 0.08 0 0 0 0 0 0 0 0 0 0 
0 0 0 0 0 0 954.695 0 0 0 0 0 0 0 -25.5593 0 0 0 0 0 0 0 0 0 0 0 0 0 1530.73 0 0 0 0 0 0 0 0 0 235.527 0 0 0 0 0 0 0 0 0 0 1220.36 0 0 0 0 0 435.575 0 0 0.08 0 0 1966.38 0 -1824.78 0 0 44.1755 1885.97 
0 0 0 0 0 0 0 0 1720.25 548.646 693.304 0 0 0 0 0 0 0 0 0 939.589 0 898.846 1741.92 0 0 0 0 1509.37 0 330.134 0 0 0 0 0 0 0 0 -186.087 0 0 0 0 0 0 0 0 0 1350.52 0 0 0 0 0 0 0 0 0 0.07 0 0 0 0 0 0 0 0 
0 0 0 0 0 0 0 0 0 0 0 0 0 0 0 0 0 0 -1929.61 0 0 0 0 0 0 0 13.0467 0 0 0 0 0 1593.45 0 0 0 1961.96 0 1134.91 0 0 0 0 0 0 0 0 0 -543.916 0 0 0 0 -150.533 0 0 924.329 0 0 0 0.08 0 0 0 0 0 0 0 
0 0 0 844.676 0 0 -330.439 0 0 0 0 0 0 0 0 0 0 0 0 0 0 0 662.175 0 0 0 0 0 0 -2084.64 -1225.85 0 0 0 0 778.756 0 0 633.793 0 0 0 0 0 0 0 0 0 0 0 0 0 0 0 685.98 0 0 0 281.304 0 0 0.04 0 0 0 0 0 0 
0 0 1901.68 0 0 0 0 0 0 0 0 0 0 0 0 2287.29 0 0 0 1251.18 0 1479.61 -397.427 0 0 0 0 0 0 0 0 1200.22 0 0 0 0 0 0 0 0 0 0 0 0 0 0 0 0 0 0 0 0 0 0 0 0 0 0 0 0 0 0 0.07 0 0 0 0 0 
0 364.467 0 0 -620.823 0 0 0 0 0 0 0 0 0 0 1749.09 0 1462.52 0 0 -518.891 0 0 0 0 -332.728 0 0 1880.63 0 0 0 0 -197.684 0 0 0 0 0 0 0 0 0 0 0 0 0 0 0 0 0 0 0 0 0 0 0 0 888.775 0 0 0 0 0.08 0 0 0 0 
0 537.202 0 0 0 -1086.08 0 0 0 0 0 0 0 0 0 0 0 1098.28 0 843.455 -831.553 0 0 0 0 0 0 836.283 1736.27 0 0 0 0 0 0 0 0 0 0 0 0 0 0 0 0 0 0 0 0 0 0 0 0 0 0 0 1981.64 0 0 0 0 0 0 0 0.05 0 0 0 
0 0 0 0 0 0 0 0 0 0 0 0 0 0 0 0 0 0 0 0 0 -474.792 0 0 0 0 0 0 260.399 1980.57 0 0 0 0 -367.824 736.03 0 0 0 0 0 0 0 0 0 0 0 0 0 0 0 0 0 0 0 0 2087.85 0 0 0 0 0 0 0 0 0.03 0 0 
0 0 0 0 0 0 0 1760.99 0 0 0 0 0 0 0 0 0 0 0 0 0 0 0 0 0 0 0 0 0 0 0 0 0 0 0 0 0 0 0 0 0 0 0 0 0 -983.23 1003.98 0 0 0 0 0 0 2435.15 0 -1672.19 0 0 2449.8 0 0 0 0 0 0 0 0.04 0 
0 2483.06 1545.53 0 0 -2390.44 0 0 0 0 0 0 0 0 0 -143.056 0 0 0 0 0 0 0 0 0 2232.96 0 0 0 0 0 0 0 0 0 0 0 0 0 0 0 0 0 -102.771 0 -10.4526 0 0 -1711.86 0 0 0 0 0 0 0 0 0 941.267 0 0 0 0 0 0 0 0 0.08 
