*Vertices 66
*Matrix 
0.08 854.289 544.069 0 0 -133.137 784.555 0 0 0 0 2086.63 0 1711.25 0 46.9222 -931.806 0 0 0 -685.064 176.626 -1984.39 0 0 0 0 1163.59 0 -358.821 -305.414 0 0 0 0 0 0 0 -1565.07 0 -1381.04 0 0 0 1576.82 -1663.03 0 0 1957.23 0 0 1328.55 0 0 0 0 0 0 -1724.68 2374.87 0 0 0 0 0 0 
968.276 0.01 0 -183.187 1358.91 0 0 0 0 -84.3074 0 -1618.93 0 0 0 0 659.886 0 0 1710.33 0 2402.49 0 0 1243.55 0 1903.21 505.158 -934.095 949.812 0 0 0 0 0 0 851.543 0 0 2114.09 0 0 0 0 1526.61 0 0 0 0 0 0 63.097 0 0 -2306.21 0 874.889 0 0 0 0 0 0 0 796.152 0 
2404.48 0 0 0 0 0 2490.69 0 -1187.86 2047.41 -325.709 0 -1484.19 0 1106.68 708.106 0 0 0 0 0 -30.5948 0 0 0 1075.7 -2172.84 403.836 0 0 0 0 -2065.57 0 221.03 0 0 1173.67 0 0 0 0 0 0 0 0 0 0 0 0 853.374 0 0 0 1009.63 0 0 1443.3 0 -2445.68 0 0 -2086.47 0 0 0 
0 1782.2 0 0.09 -558.107 0 0 0 337.458 0 0 0 0 -2345.88 0 -614.719 0 0 2013.38 1817.3 0 0 0 0 0 0 0 0 0 0 2308.5 0 1192.28 0 0 0 0 0 1556.37 487.915 0 0 -653.783 0 0 0 0 1787.24 0 -648.289 0 -1348.23 0 0 0 0 0 0 0 0 0 0 0 0 0 1748.48 
0 961.409 0 155.263 0.09 1265.07 -2202.9 0 901.746 0 0 0 0 0 0 0 0 2041.76 0 0 0 0 373.623 0 0 0 0 0 0 0 303.125 534.455 0 0 -1792.12 0 499.664 0 0 0 196.463 0 1501.59 0 1889.32 -1117.82 0 0 0 0 2295.22 -2387.39 0 0 0 0 0 0 0 -2120.5 0 0 0 0 0 0 
541.78 0 0 0 1485.11 0.01 -1445.28 0 -33.6467 0 365.688 0 -2181.84 0 0 1055.25 0 -719.398 0 995.743 0 0 0 1641.51 0 777.535 2440.79 0 0 0 516.755 0 0 2300.1 0 583.438 -1656.01 0 -512.329 0 0 0 0 1872.84 0 0 1759.62 0 1788.46 0 -981.399 -419.248 0 0 0 0 0 0 0 0 0 0 0 0 0 0 
658.513 0 1866.59 0 193.869 2380.98 0.07 0 0 0 0 0 0 0 0 0 1484.95 1708.35 0 0 0 0 0 0 0 0 0 -2425.38 0 0 0 0 0 0 -890.301 1580.94 0 2284.23 0 1370.82 -692.541 23.7281 1557.13 0 0 0 900.525 0 910.901 0 0 -1525.85 0 1138.72 0 1742.84 1216.24 0 0 0 0 0 0 0 0 0 
0 0 0 0 0 0 0 0.01 0 -1281.55 0 1510.74 0 1000.17 0 0 0 0 0 0 0 0 0 0 0 1160.08 0 0 431.761 0 0 0 -917.158 -1371.43 0 196.31 0 0 0 0 0 0 -2216.94 0 0 2371.36 0 0 0 0 0 0 0 1883.37 0 0 -2194.66 0 0 0 0 0 1027.18 0 0 0 
0 0 210.654 -1241.72 -1590.55 1664.86 0 0 0 -1602.3 0 0 -318.232 0 0 -1077.07 0 0 0 79.577 1276.82 0 0 1782.66 503.632 0 0 -1065.78 0 0 612.125 947.829 -1383.63 2249.9 0 409.787 0 0 0 0 0 0 2192.37 0 0 -2293.69 1815.47 0 0 0 0 0 0 831.401 0 0 0 2430.27 1931.29 0 0 0 0 0 1797.77 0 
0 1872.08 -270.47 0 0 0 0 1155.51 -2400.81 0.04 85.0703 0 0 0 0 0 -2384.18 0 0 0 617.771 0 -2093.49 0 0 0 0 0 0 0 0 0 0 1520.51 -1312.07 1117.05 0 357.295 0 0 0 0 0 0 0 1001.85 0 -705.206 1685.46 0 -515.992 402.158 1927.47 0 0 2282.1 0 0 -291.07 0 0 0 0 0 0 0 
0 0 2092.43 0 0 -1317.56 0 0 0 -2333.67 0.04 2272.48 649.205 0 0 0 0 0 0 0 0 0 0 0 0 0 -2115.77 0 1675.54 0 0 0 0 134.663 0 0 0 0 0 0 0 0 2449.8 -1451.08 1408.35 0 0 0 0 0 0 0 0 0 -136.036 0 448.851 0 0 0 455.107 0 0 0 0 0 
1159.02 804.239 0 0 0 0 0 -1624.88 0 0 1906.87 0.01 -2439.57 704.291 -1058.61 0 2012.01 1757.33 0 -271.844 0 0 -155.873 0 0 0 1078.91 0 0 1062.58 0 -1795.63 372.86 0 0 0 1158.56 0 1890.55 0 0 0 -2308.95 0 0 0 0 0 0 -1341.21 0 380.795 -307.245 0 0 1755.04 256.279 -982.62 165.487 0 0 0 0 0 0 -1145.28 
0 0 5.56963 0 0 984.756 0 0 921.125 0 747.627 -747.78 0.06 0 0 983.23 0 1380.12 0 0 0 0 0 0 0 0 0 0 911.054 0 2393.19 0 0 -2131.49 -2415.01 0 0 0 0 761.666 0 0 0 -1628.85 803.934 0 943.556 0 953.932 0 1963.18 1264.31 0 0 0 0 0 0 0 2483.67 0 0 0 0 0 0 
1098.13 0 0 404.752 0 0 0 -850.627 0 0 0 1005.81 0 0.09 1535.31 0 0 0 0 0 0 0 0 0 0 0 0 0 0 1955.7 0 0 0 0 0 1860.94 0 0 0 0 0 0 0 0 2293.85 0 0 0 0 1635.87 0 0 2219.53 0 -938.063 0 541.627 0 0 0 0 0 0 0 0 0 
0 0 -296.564 0 0 0 0 0 0 0 0 -1780.53 0 891.98 0.01 0 1802.35 0 0 0 0 0 0 0 1873.61 0 0 0 0 0 -1342.59 0 155.416 2281.79 0 1591.01 757.088 0 0 -1968.37 0 0 -2467.35 0 0 0 -1117.66 0 0 -982.925 651.036 0 0 0 0 1115.68 0 0 0 0 0 0 0 0 0 0 
-2312.16 0 -2116.08 -2376.71 0 1656.62 0 0 -1530.43 0 0 0 2008.35 0 0 0 0 0 0 0 1122.55 0 0 1241.11 0 0 0 491.882 0 0 0 0 0 0 0 -301.294 1294.37 0 0 0 0 0 1037.55 0 0 0 0 0 1171.83 0 0 0 0 0 0 0 -557.344 1578.34 0 0 0 0 0 0 0 0 
1639.53 -690.1 0 0 0 0 -120.777 0 0 676.214 0 -1875.59 0 0 2226.71 0 0.05 0 -1453.06 0 0 0 0 0 581.759 0 1235.92 0 -1023.97 0 0 0 -188.528 0 0 0 0 0 910.138 -1181.3 0 0 -1303.37 0 -1660.28 311.212 783.334 0 0 0 2144.61 0 0 0 0 1694.46 0 0 0 -1108.81 0 0 0 0 0 0 
0 0 0 0 97.7355 -7.24815 760.75 0 0 0 0 -1742.38 1825.08 0 0 0 0 0 -82.0185 0 0 0 1307.95 0 0 0 -1716.13 0 -1021.23 937.452 0 474.487 0 0 0 0 0 0 0 1971.42 647.069 -1909.16 0 0 0 0 0 0 0 0 0 1798.84 -1783.43 2283.47 0 0 -264.367 2443.54 0 0 0 0 -1907.33 0 0 0 
0 0 0 594.119 0 0 0 0 0 0 0 0 0 0 0 0 -743.202 -418.332 0.03 0 0 0 2277.67 0 0 0 0 1162.83 0 -337.001 0 512.94 0 0 0 0 0 -1803.57 -1995.53 0 0 0 0 0 0 -2417.45 0 0 0 0 0 0 0 0 2042.99 1281.4 1585.51 0 0 0 0 0 -2176.96 0 0 0 
0 1463.59 0 2471.92 0 -1020.31 0 0 -489.593 0 0 654.241 0 0 0 0 0 0 0 0.05 0 0 0 0 0 0 0 0 0 0 0 0 0 0 0 179.83 0 453.887 0 0 0 0 0 0 0 0 0 1634.95 2162.77 0 0 0 0 0 0 0 0 0 0 -828.654 0 0 0 0 0 0 
866.497 0 0 0 0 0 0 0 2166.74 -2386.01 0 0 0 0 0 -391.018 0 0 0 0 0 -884.655 0 -1126.97 0 0 -2456.05 0 0 1244.62 0 0 0 0 0 0 0 0 0 0 69.8111 0 0 0 0 0 0 2215.57 0 0 0 0 2383.42 0 -1029.77 1467.1 -351.65 1889.63 206.992 2118.67 0 0 0 0 0 0 
-1091.72 1352.05 -276.879 0 0 0 0 0 0 0 0 0 0 0 0 0 0 0 0 0 -24.3385 0.02 0 0 0 0 0 0 -495.849 0 0 0 0 0 0 0 728.858 2108.6 0 0 0 0 0 0 0 0 0 0 -903.577 0 2442.47 333.186 1618.63 0 0 0 0 -5.26444 343.715 -1080.28 0 -2279.35 0 2059.92 0 0 
-1767.1 0 0 0 -696.966 0 0 0 0 -99.5666 0 2115.47 0 0 0 0 0 1339.53 -290.613 0 0 0 0.09 0 0 0 1130.94 1262.93 0 0 1449.71 0 0 -546.205 1855.6 0 0 -345.546 1944.11 0 0 1725.44 0 0 0 0 0 -169.149 0 0 -474.334 0 0 0 0 0 0 262.23 -1603.52 1985.92 0 0 0 0 0 0 
0 0 0 0 0 1092.79 0 0 -213.248 0 0 0 0 0 0 784.86 0 0 0 0 -1459.17 0 0 0.02 0 0 0 0 0 -664.922 1389.43 0 0 0 1424.68 0 0 0 0 0 2057.79 0 0 0 0 -1041.52 0 0 0 0 0 0 0 2139.88 0 0 0 0 0 0 0 0 0 -1085.16 0 0 
0 1501.28 0 0 0 0 0 0 1335.26 0 0 0 0 0 1267.36 0 -80.9503 0 0 0 0 0 0 0 0.07 0 1807.69 0 0 -883.129 0 0 0 0 0 0 0 0 -2157.58 0 0 0 -1223.26 0 406.735 0 0 0 0 0 900.067 0 0 -1028.24 0 0 0 0 0 0 0 0 0 0 0 0 
0 0 2344.36 0 0 -1829.51 0 -1095.08 0 0 0 0 0 0 0 0 0 0 0 0 0 0 0 0 0 0.02 428.404 525.3 0 0 0 0 0 0 0 0 0 0 0 0 0 0 0 0 0 0 0 1673.86 0 0 0 0 0 0 0 0 0 0 0 0 0 0 0 0 0 0 
0 -2458.8 2237.69 0 0 1857.43 0 0 0 0 1645.18 -451.14 0 0 0 0 2035.81 1079.67 0 0 -1331.6 0 -377.285 0 2256.77 9.07926 0.08 0 0 0 0 0 0 0 0 0 -328.303 0 0 0 0 0 0 0 0 0 0 1790.44 0 0 0 1182.52 0 -1024.43 0 512.024 0 0 0 -262.841 0 0 0 0 0 0 
1684.24 2348.63 702.307 0 0 0 1107.75 0 -1696.91 0 0 0 0 0 0 2192.98 0 0 834.91 0 0 0 96.82 0 0 -970.565 0 0.05 0 0 0 -1255.15 -907.697 0 0 0 1354.95 0 0 0 0 0 0 -1049.3 0 0 2284.69 1210.75 0 1085.31 -2315.82 0 0 -1214.41 0 -1359.22 0 -301.294 2094.26 0 0 0 0 0 0 0 
0 2123.1 0 0 0 0 0 2333.37 0 0 2418.97 0 -2138.51 0 0 0 390.561 1344.87 0 0 0 304.804 0 0 0 0 0 0 0.08 0 0 0 2477.57 0 1571.32 2471.62 -2008.35 0 0 0 0 0 0 0 -480.132 -931.959 0 0 0 0 0 2225.49 0 0 0 0 -2321.77 1177.63 0 547.731 0 0 0 2207.17 0 -1103.17 
264.824 1393.7 0 0 0 0 0 0 0 0 0 1569.19 0 -547.578 0 0 0 820.719 755.409 0 -1874.52 0 0 -1975.84 -2035.2 0 0 0 0 0.08 -2379.45 0 0 0 2102.19 0 652.562 0 0 1022.6 0 0 0 0 0 0 0 0 0 0 0 0 0 0 0 0 0 0 0 0 0 0 0 0 0 0 
29.6793 0 0 1110.03 2056.41 -717.109 0 0 -964.461 0 0 0 2441.86 0 -801.95 0 0 0 0 0 0 0 -167.013 -2054.12 0 0 0 0 0 830.638 0.07 0 8.92666 0 0 0 0 0 0 362.331 220.115 2069.23 1954.02 0 0 0 1338.16 0 0 0 0 0 0 -1082.57 2463.23 0 0 0 0 0 0 0 0 0 0 0 
0 0 0 0 -1041.52 0 0 0 439.238 0 0 241.325 0 0 0 0 0 -1803.11 1871.17 0 0 0 0 0 0 0 0 926.16 0 0 0 0.05 0 0 0 0 0 -1715.98 0 2266.69 0 718.024 0 0 0 0 0 0 2172.38 0 0 2160.33 0 0 0 0 0 0 -1533.48 0 0 0 1965.47 0 0 0 
0 0 1972.18 734.504 0 0 0 1414 -1705.76 0 0 1919.39 0 0 288.629 0 701.697 0 0 0 0 0 0 0 0 0 0 655.004 -1725.29 0 1142.23 0 0.08 0 0 0 -103.534 -545.442 0 0 2380.98 -824.839 519.196 65.6911 0 0 0 0 401.7 -2089.83 288.781 0 0 0 0 0 0 -2085.56 0 0 1706.21 -1785.41 0 0 0 0 
0 0 0 0 0 38.6822 0 878.704 446.867 -1334.5 614.261 0 2371.06 0 1273 0 0 0 0 0 0 0 2489.17 0 0 0 0 0 0 0 0 0 0 0.08 180.746 1865.83 0 0 0 0 0 0 0 0 0 0 1297.88 2109.52 0 0 -1249.35 0 0 0 0 -20.9815 0 0 0 0 -2389.98 199.82 0 0 0 0 
0 0 284.661 0 2000.11 0 -718.177 0 0 1562.01 0 0 753.426 0 0 0 0 0 0 0 0 0 -1228.29 2087.39 0 0 0 0 -581.759 2257.84 0 0 0 1280.33 0.06 1961.65 0 0 0 0 0 -273.064 0 0 0 0 0 -525.758 635.777 0 -360.652 -1679.97 0 80.34 0 0 0 0 -2168.26 0 0 0 0 379.574 0 -632.267 
0 0 0 0 0 1592.38 98.1933 900.22 1045.34 1744.82 0 0 0 -1284.3 541.017 -1082.57 0 0 0 -853.679 0 0 0 0 0 0 0 0 1690.5 0 0 0 0 -1848.89 295.953 0.09 0 -531.861 0 0 0 0 2398.83 0 0 0 0 0 1311 500.58 0 0 0 0 0 0 0 0 0 0 -1583.22 0 -1521.12 -1739.48 0 0 
0 -615.787 0 0 1054.49 2176.5 0 0 0 0 0 -2485.5 0 0 -212.638 2457.73 0 0 0 0 0 1047.62 0 0 0 0 -477.844 1784.95 359.279 -1409.42 0 0 -1807.69 0 0 0 0.01 0 1574.98 855.663 0 0 0 0 1951.58 0 0 -1945.17 0 0 1271.94 0 0 0 2073.2 0 0 989.944 0 0 0 0 0 0 0 0 
0 0 2191.92 0 0 0 -1277.28 0 0 -1019.09 0 0 0 0 0 0 0 0 681.555 -223.624 0 2158.04 1607.18 0 0 0 0 0 0 0 0 87.3592 -1632.51 0 0 -2489.32 0 0.07 0 -2280.42 0 0 0 0 0 2426.91 0 0 0 -1573.31 0 1900.92 0 0 -513.398 2124.47 0 1911.6 0 0 0 0 0 0 0 0 
-694.678 0 0 843.608 0 -1431.85 0 0 0 0 0 -2288.96 0 0 0 0 1657.69 0 -2010.18 0 0 0 2192.98 0 130.543 0 0 0 0 0 0 0 0 0 0 0 -2179.86 0 0.02 0 1124.99 0 0 0 0 0 324.03 0 0 1451.38 0 0 0 0 0 0 1791.67 0 1737.49 0 0 0 0 0 1275.14 0 
0 711.921 0 1622.44 0 0 1179.62 0 0 0 0 0 1081.65 0 -525.452 0 795.846 -2400.51 0 0 0 0 0 0 0 0 0 0 0 753.273 2387.39 528.352 0 0 0 0 1645.94 -852 0 0.05 0 0 0 0 -1276.36 -932.569 0 0 2212.82 -263.146 981.857 0 613.956 0 0 0 0 0 0 0 0 0 0 0 0 0 
-849.101 0 0 0 -1592.99 0 -1145.89 0 0 0 0 0 0 0 0 0 0 1599.4 0 0 1887.04 0 0 1562.93 0 0 0 0 0 0 -581.607 0 1350.83 0 0 0 0 0 1916.03 0 0.03 0 0 0 0 0 0 0 1798.53 0 0 0 0 0 0 1838.05 0 0 0 0 0 -521.943 0 0 0 0 
0 0 0 0 0 0 -1343.96 0 0 0 0 0 0 0 0 0 0 401.09 0 0 0 0 -225.303 0 0 0 0 0 0 0 951.949 2393.03 -1377.38 0 1441.16 0 0 0 0 0 0 0.04 1041.98 0 0 0 0 1529.36 0 0 0 0 0 0 1197.47 0 0 0 0 1482.97 35.02 0 0 -9.23185 0 0 
0 0 0 -903.882 -1701.18 0 -461.516 -597.781 2382.05 0 -2014.6 710.547 0 0 -2064.65 1597.11 -7.09555 0 0 0 0 0 0 0 668.737 0 0 0 0 0 1797.31 0 -84.0022 0 0 2042.53 0 0 0 0 0 -35.4778 0.02 0 1982.56 858.715 0 0 2358.24 0 0 0 1628.85 0 -2431.49 320.063 0 589.694 0 0 0 0 0 0 0 0 
0 0 0 0 0 -693.762 0 0 0 0 -1800.52 0 -976.669 0 0 0 0 0 0 0 0 0 0 0 0 0 0 1329 0 0 0 0 1923.81 0 0 0 0 0 0 0 0 0 0 0.02 0 0 1098.9 0 0 0 0 0 0 0 0 0 -715.735 0 0 0 92.8526 0 0 0 0 0 
1122.09 789.132 0 0 660.192 0 0 0 0 0 -1265.83 0 394.223 -1495.33 0 0 1545.99 0 0 0 0 0 0 0 1204.03 0 0 0 743.202 0 0 0 0 0 0 0 734.199 0 0 1832.26 0 0 2167.5 0 0.03 0 0 0 1155.05 0 0 -395.749 0 0 0 0 0 -199.973 0 2314.45 0 0 0 0 0 0 
2051.68 0 0 0 694.067 0 0 -1965.77 -1430.94 2142.17 0 0 0 0 0 0 773.11 0 -277.032 0 0 0 0 1818.52 0 0 0 0 176.778 0 0 0 0 0 0 0 0 -1606.88 0 1561.1 0 0 -2258.45 0 0 0.07 0 0 0 0 0 1468.93 0 -481.506 0 0 0 0 0 0 0 0 0 0 0 -2156.67 
0 0 0 0 0 189.138 2101.73 0 -566.195 0 0 0 -520.875 0 2050.61 0 1233.18 0 0 0 0 0 0 0 0 0 0 546.052 0 0 -318.384 0 0 105.365 0 0 0 0 158.162 0 0 0 0 2043.29 0 0 0.09 -1175.19 0 0 598.239 -1660.44 0 0 0 0 2428.89 0 -2051.99 0 0 0 0 0 0 60.8081 
0 0 0 -121.693 0 0 0 0 0 312.891 0 0 0 0 0 0 0 0 0 288.171 1700.57 0 96.6674 0 0 1629.92 2406 1037.4 0 0 0 0 0 1095.69 -866.344 0 2406.61 0 0 0 0 199.82 0 0 0 0 -1039.54 0.02 0 261.773 -23.5755 0 2200 0 479.675 0 0 -1024.58 0 0 502.106 0 0 0 0 0 
-502.411 0 0 0 0 -2049.09 -2005.29 0 0 2336.88 0 0 1480.07 0 0 -465.636 0 0 0 -270.623 0 -2145.38 0 0 0 0 0 0 0 0 0 2195.73 905.103 0 -1830.12 -1572.54 0 0 0 196.005 1352.81 0 2454.68 0 2061.6 0 0 0 0.03 0 0 0 0 0 1610.54 0 -898.389 -226.066 0 0 -569.094 0 0 0 0 0 
0 0 0 1910.99 0 0 0 0 0 0 0 -160.146 0 1245.23 -843.913 0 0 0 0 0 0 0 0 0 0 0 0 -1408.66 0 0 0 0 540.712 0 0 2494.66 0 229.881 219.047 884.655 0 0 0 0 0 0 0 2017.35 0 0.02 0 0 0 0 0 -411.161 427.488 0 0 0 0 0 0 0 0 0 
0 0 1749.4 0 925.55 1807.84 0 0 0 -1207.69 0 0 -1674.17 0 -259.026 0 -443.052 0 0 0 0 -2196.49 -1138.11 0 2424.62 0 0 2156.21 0 0 0 0 -2391.81 -155.873 1245.84 0 1517.46 0 0 1237.75 0 0 0 0 0 0 1381.34 -2094.71 0 0 0.03 -1441.31 0 0 0 0 0 844.523 2368.62 0 338.984 0 0 0 0 0 
-159.23 1044.57 0 643.406 -2419.89 1798.53 -747.017 0 0 1777.63 0 2381.59 -2061.91 0 0 0 0 -1390.65 0 0 0 2147.82 0 0 0 0 943.861 0 1295.59 0 0 -14.42 0 0 1201.28 0 0 1452.6 0 0 0 0 0 0 -132.527 -2316.74 1396.3 0 0 0 2316.13 0.08 0 -2385.56 -1873.45 0 2381.13 -728.706 -1559.57 0 0 190.207 0 0 0 0 
0 0 0 0 0 0 0 0 0 2107.07 0 -650.883 0 -822.092 0 0 0 -438.932 0 0 1957.23 1876.51 0 0 0 0 0 0 0 0 0 0 0 0 0 0 0 0 0 -71.4896 0 0 -1239.59 0 0 0 0 826.823 0 0 0 0 0.06 1530.58 0 0 0 0 -2360.38 711.158 0 0 0 0 0 0 
0 0 0 0 0 0 1970.2 2463.99 724.738 0 0 0 0 0 0 0 0 -273.217 0 0 0 0 0 1889.17 -1812.57 0 -49.3637 -1017.87 0 0 2188.71 0 0 0 460.448 0 0 0 0 0 0 0 0 0 0 1113.39 0 0 0 0 0 -402.768 -1990.8 0.02 0 -521.943 0 0 0 -1665.17 -1722.24 0 0 0 0 0 
0 2082.2 -1921.98 0 0 0 0 0 0 0 -1508.3 0 0 -904.34 0 0 0 0 -394.833 0 -1022.75 0 0 0 0 0 0 0 0 0 734.504 0 0 0 0 0 663.396 1222.19 0 0 0 2447.97 -1251.64 0 0 0 0 1723.91 901.898 0 0 -191.275 0 0 0.05 0 -771.279 -218.436 0 0 0 0 0 0 0 0 
0 0 0 0 0 0 -300.684 0 0 -1199.15 0 2452.09 0 0 -1758.55 0 -461.974 0 1116.75 0 -541.932 0 0 0 0 0 870.006 -11.2156 0 0 0 0 0 1301.84 0 0 0 1633.73 0 0 916.547 0 -1639.07 0 0 0 0 0 0 2445.68 0 0 0 1843.7 0 0.08 462.432 0 0 0 0 0 0 -1725.9 -1497.47 0 
0 974.38 0 0 0 0 703.223 597.171 0 0 888.318 1269.34 0 670.568 0 2070.91 0 2266.69 -1745.28 0 -1493.5 0 0 0 0 0 0 0 488.372 0 0 0 0 0 0 0 0 0 -2194.66 0 0 0 0 -1269.34 0 0 -844.829 0 -2067.86 2314.75 0 417.112 0 0 1002 -2391.96 0.04 448.698 1780.07 0 -133.137 0 0 0 0 0 
0 0 793.1 0 0 0 0 0 2021.01 0 0 -2427.06 0 0 0 -337.764 0 2390.9 0 0 -1714.3 -207.602 144.429 0 0 0 0 -2432.55 -1041.37 0 0 0 -494.934 0 0 0 1218.22 -2297.81 0 0 0 0 2297.97 0 1442.38 0 0 2083.73 1456.42 0 724.128 -1285.06 0 0 -1778.54 0 918.531 0.07 0 2453.61 0 0 0 0 0 -1359.52 
1708.81 0 0 0 0 0 0 0 1318.48 -212.943 0 -900.22 0 0 0 0 0 0 0 0 2203.51 2024.37 -1905.65 0 0 0 0 -1096.45 0 0 0 1837.44 0 0 -1871.01 0 0 0 1815.16 0 0 0 0 0 0 0 1641.21 0 0 0 -418.18 1972.18 2445.52 0 0 0 -899.762 0 0.05 0 0 0 -9.23185 0 0 0 
2225.94 0 -1644.57 0 1784.95 0 0 0 0 0 0 0 -1187.7 0 0 0 -100.787 0 0 -2096.7 -507.752 -655.766 2187.95 0 0 0 1847.36 0 78.814 0 0 0 0 0 0 0 0 0 0 0 0 -172.353 0 0 -1759.32 0 0 0 0 0 0 0 1675.85 852 0 0 0 -370.113 0 0.06 0 0 0 0 0 0 
0 0 0 0 0 0 0 0 0 0 -699.561 0 0 0 0 0 0 0 0 0 0 0 0 0 0 0 0 0 0 0 0 0 771.432 163.656 0 1445.74 0 0 0 0 0 -941.267 0 -1111.87 0 0 0 1380.43 1662.42 0 1534.55 0 0 -291.833 0 0 -2068.47 0 0 0 0.02 0 0 0 0 0 
0 0 0 0 0 0 0 0 0 0 0 0 0 0 0 0 0 0 0 0 0 -631.199 0 0 0 0 0 0 0 0 0 0 1283.53 14.1148 0 0 0 0 0 0 -1171.99 0 0 0 0 0 0 0 0 0 0 1865.98 0 0 0 0 0 0 0 0 0 0.05 0 0 0 149.77 
0 0 -1885.97 0 0 0 0 795.999 0 0 0 0 0 0 0 0 0 1184.35 1600.77 0 0 0 0 0 0 0 0 0 0 0 0 -481.506 0 0 0 993.301 0 0 0 0 0 0 0 0 0 0 0 0 0 0 0 0 0 0 0 0 0 0 1939.83 0 0 0 0.08 -1388.36 0 0 
0 0 0 0 0 0 0 0 0 0 0 0 0 0 0 0 0 0 0 0 0 1867.66 0 1755.96 0 0 0 0 1796.55 0 0 0 0 0 676.824 1092.49 0 0 0 0 0 -1799.3 0 0 0 0 0 0 0 0 0 0 0 0 0 964.766 0 0 0 0 0 0 1585.97 0.02 0 0 
0 2458.04 0 0 0 0 0 0 2286.68 0 0 0 0 0 0 0 0 0 0 0 0 0 0 0 0 0 0 0 0 0 0 0 0 0 0 0 0 0 1752.6 0 0 0 0 0 0 0 0 0 0 0 0 0 0 0 0 1134.75 0 0 0 0 0 0 0 0 0.09 0 
0 0 0 11.5207 0 0 0 0 0 0 0 -735.42 0 0 0 0 0 0 0 0 0 0 0 0 0 0 0 0 -1294.37 0 0 0 0 0 2209.01 0 0 0 0 0 0 0 0 0 0 -2165.67 1703.01 0 0 0 0 0 0 0 0 0 0 2407.99 0 0 0 -9.53703 0 0 0 0.03 
