*Vertices 53
*Matrix 
0.06 0 0 0 0 0 0 0 0 0 0 0 691.626 0 0 0 0 0 0 0 0 0 0 0 0 0 -1481.9 0 0 0 156.789 0 0 0 0 0 -1733.68 0 0 0 1824.02 0 0 1548.89 0 0 0 0 0 0 0 0 0 
0 0.04 0 0 0 0 0 0 -2053.82 -1633.88 0 0 0 0 0 0 0 0 0 0 0 0 0 2311.85 0 0 0 -2081.44 198.752 0 0 0 2116.53 -265.74 0 0 1333.74 0 0 0 1042.13 0 0 0 0 0 0 0 0 0 1182.36 0 0 
0 0 0.01 0 0 0 0 0 0 0 0 0 0 673.772 0 0 0 0 958.663 -679.418 0 0 0 0 0 0 0 746.254 0 0 0 1285.21 0 0 0 -2243.34 1949.45 0 0 2478.48 0 0 0 0 0 0 0 0 -405.972 0 0 0 0 
0 0 0 0.05 0 1277.73 0 0 0 0 0 0 0 0 0 0 0 0 0 -2248.83 1978.44 -140.156 0 0 0 0 0 0 0 0 0 0 -2065.87 0 0 0 0 372.707 2494.66 0 -1152.61 0 0 160.604 -2.67037 0 0 0 0 0 0 0 0 
0 0 0 0 0.06 0 742.897 0 0 0 164.418 0 0 0 0 0 0 1920.61 0 0 0 0 0 -266.045 0 0 0 0 0 0 0 0 0 0 2030.63 0 0 0 0 0 -2075.03 0 -290.918 0 0 0 0 0 0 0 0 0 0 
0 0 0 -1903.67 0 0.01 0 0 0 0 0 -643.101 0 0 0 0 0 0 0 0 0 2283.78 0 0 0 -1755.2 0 0 2373.5 819.651 0 0 0 0 0 0 0 -617.618 0 0 0 0 0 0 0 1036.94 0 0 0 0 0 0 0 
0 0 0 0 -516.755 0 0.03 -1099.96 0 0 0 0 0 1967.15 0 0 0 0 0 0 0 0 0 0 0 0 755.715 2243.64 0 0 0 0 -1464.81 0 0 0 0 0 0 0 0 0 0 0 45.3963 0 0 0 0 0 0 0 0 
0 0 0 0 0 0 2364.04 0.06 0 0 0 0 0 0 0 -378.201 -1337.55 0 0 0 0 0 0 0 0 0 0 0 2471.92 0 0 0 2042.22 -787.912 0 0 0 0 0 0 2426.6 0 0 0 0 0 1130.94 -743.965 0 0 0 0 0 
0 -150.838 0 0 0 0 0 0 0.08 0 0 0 0 0 2404.02 0 0 0 0 0 0 0 0 0 0 0 1790.44 0 0 0 0 0 0 0 0 -1212.73 0 0 0 0 0 429.777 -651.494 339.595 0 0 0 0 0 0 0 0 0 
0 989.944 0 0 0 0 0 0 0 0.02 0 887.86 0 0 0 1798.99 0 0 0 0 0 0 0 0 0 0 0 0 861.156 0 0 0 0 0 0 0 0 0 0 0 0 0 0 0 -1434.6 0 0 1880.32 0 0 0 0 0 
0 0 0 0 -713.446 0 0 0 0 0 0.06 0 0 0 0 0 0 0 0 0 0 0 0 0 0 0 0 2202.9 0 0 0 0 0 0 -278.863 0 0 0 0 815.683 0 0 0 0 0 0 0 0 0 0 0 0 0 
0 0 0 0 0 975.6 0 0 0 1522.19 0 0.03 0 -57.2985 908.155 0 0 0 0 0 765.481 0 0 0 0 0 0 0 0 0 0 0 0 0 0 0 0 -824.534 0 0 -1588.87 0 0 0 0 0 0 0 0 0 0 0 0 
2282.56 0 0 0 0 0 0 0 0 0 0 0 0.06 0 0 0 0 0 0 0 0 0 0 0 0 0 0 0 0 0 0 0 0 0 0 0 0 0 0 0 0 0 0 0 -225.608 0 0 1868.42 0 0 0 0 1159.63 
0 0 -881.603 0 0 0 624.943 0 0 0 0 -354.701 0 0 0 0 0 1036.48 0 832.926 0 0 0 0 0 0 0 1149.1 1543.86 0 0 0 0 -737.404 0 -1757.79 1643.8 2024.83 0 0 0 0 0 0 0 0 0 0 0 0 0 0 0 
0 0 0 0 0 0 0 0 299.463 0 0 -1842.94 0 0 0.08 2050.77 2451.32 0 0 0 0 0 0 0 0 0 -1782.51 0 0 0 0 0 0 707.495 0 0 0 0 0 0 0 0 0 0 0 2037.03 0 0 0 2261.96 156.484 0 0 
0 0 0 0 0 0 0 -234.153 0 -601.291 0 0 0 0 736.793 0.02 -442.9 0 -811.716 0 0 1785.56 0 677.587 0 -1368.22 1865.67 0 0 0 0 0 0 0 -880.078 0 0 2458.49 0 0 0 0 0 994.064 0 0 0 0 2064.5 0 0 0 0 
0 0 0 0 0 0 0 2422.18 0 0 0 0 0 0 -1360.74 517.06 0.02 1950.97 1067.46 0 0 0 0 -806.833 1277.43 -1616.64 0 0 0 0 0 0 0 0 0 0 2365.72 0 0 0 0 0 0 0 1647.92 0 0 0 0 0 0 0 0 
0 0 0 0 2429.04 0 0 0 0 0 0 0 0 -554.445 0 0 -1746.8 0.05 0 0 0 0 0 0 0 2113.64 0 0 0 0 0 0 0 0 1555.45 0 0 0 0 0 0 0 0 0 0 0 0 0 -591.983 0 0 0 0 
0 0 961.409 0 0 0 0 0 0 0 0 0 0 0 0 1311.76 1765.57 0 0.09 0 0 0 1752.6 0 0 -2290.19 0 0 0 0 0 0 0 0 0 0 0 0 0 0 0 0 2491.76 0 0 0 0 0 0 0 0 0 0 
0 0 -1337.09 831.706 0 0 0 0 0 0 0 0 0 836.131 0 0 0 0 0 0.01 599.46 0 732.215 0 0 0 0 0 0 0 0 0 0 0 0 0 2274.47 2465.36 0 0 0 0 2293.39 0 0 0 0 0 0 0 84.0022 -2272.48 0 
0 0 0 2126.15 0 0 0 0 0 0 0 2213.74 0 0 0 0 0 0 0 896.1 0.04 0 0 0 2138.66 0 0 0 0 0 0 0 0 0 0 0 0 0 0 0 0 0 0 0 0 0 -492.035 -1577.58 0 1990.04 0 0 0 
0 0 0 -150.227 0 374.844 0 0 0 0 0 0 0 0 0 1329.46 0 0 0 0 0 0.04 0 0 0 0 0 0 0 0 0 0 0 0 0 0 0 0 0 0 0 0 0 981.094 0 0 0 0 370.418 0 0 0 0 
0 0 0 0 0 0 0 0 0 0 0 0 0 0 0 0 0 0 2075.95 937.147 0 0 0.09 0 -1575.75 0 1516.69 378.048 0 0 0 0 0 0 247.124 0 0 0 0 0 0 0 0 0 0 0 0 0 0 0 0 0 0 
0 781.808 0 0 -2315.21 0 0 0 0 0 0 0 0 0 0 443.51 -1173.67 0 0 0 0 0 0 0.05 1641.82 0 0 0 0 0 0 0 0 1343.5 2254.33 0 0 0 0 0 0 0 0 0 58.2141 0 0 0 0 0 -2486.27 0 0 
0 0 0 0 0 0 0 0 0 0 0 0 0 0 0 0 1753.67 0 0 0 2397 0 -29.5267 298.547 0.07 0 0 0 0 0 0 0 0 0 1296.96 0 0 0 0 -591.525 0 0 0 0 0 0 0 0 -1501.89 0 0 0 0 
0 0 0 0 0 1905.5 0 0 0 0 0 0 0 0 0 783.334 -1270.26 2419.13 2290.34 0 0 0 0 0 0 0.09 0 0 0 0 0 0 0 0 0 770.974 0 0 0 0 0 0 -2401.88 0 0 0 0 0 0 0 0 0 0 
-2344.66 0 0 0 0 0 1712.47 0 2298.73 0 0 0 0 0 2384.33 -407.804 0 0 0 0 0 0 1642.28 0 0 0 0.02 0 0 0 1672.49 0 0 0 0 0 0 0 0 0 0 0 0 507.752 0 -2013.53 0 -2443.39 0 0 0 0 0 
0 322.047 -1653.42 0 0 0 2373.04 0 0 0 404.294 0 0 -1589.79 0 0 0 0 0 0 0 0 1906.72 0 0 0 0 0.02 0 0 -1140.4 2438.51 0 0 0 0 0 0 0 0 0 0 0 0 0 -1362.42 0 0 0 0 0 0 0 
0 103.687 0 0 0 1141.16 0 2214.65 0 705.359 0 0 0 384.457 0 0 0 0 0 0 0 0 0 0 0 0 0 0 0.03 0 0 0 0 0 0 0 0 0 0 0 0 0 0 0 0 0 0 0 -1569.95 0 0 0 0 
0 0 0 0 0 448.088 0 0 0 0 0 0 0 0 0 0 0 0 0 0 0 0 0 0 0 0 0 0 0 0.05 0 0 0 0 0 0 0 1612.98 0 0 0 0 0 0 0 0 0 0 0 0 0 0 0 
356.227 0 0 0 0 0 0 0 0 0 0 0 0 0 0 0 0 0 0 0 0 0 0 0 0 0 403.226 147.938 0 0 0 0 0 0 0 0 0 0 0 0 0 0 0 675.298 0 0 746.559 0 0 0 0 0 0 
0 0 -7.24815 0 0 0 0 0 0 0 0 0 0 0 0 0 0 0 0 0 0 0 0 0 0 0 0 -1271.32 0 0 0 0.03 0 0 -182.882 0 0 0 0 1231.04 0 0 0 0 0 0 2199.55 0 0 0 0 0 0 
0 1376.77 0 -636.54 0 0 385.678 1782.05 0 0 0 0 0 0 0 0 0 0 0 0 0 0 0 0 0 0 0 0 0 0 0 0 0.06 0 0 0 0 0 0 0 0 0 0 0 0 0 0 1268.88 -2401.27 0 0 0 0 
0 184.866 0 0 0 0 0 -108.112 0 0 0 0 0 1680.88 1737.34 0 0 0 0 0 0 0 0 -94.3785 0 0 0 0 0 0 0 0 0 0.06 0 0 0 0 0 0 0 0 0 2129.05 0 0 0 0 -17.6244 0 387.509 0 0 
0 0 0 0 -721.229 0 0 0 0 0 1764.66 0 0 0 0 785.318 0 -1462.52 0 0 0 0 -1160.7 2350.46 1157.49 0 0 0 0 0 0 416.501 0 0 0.04 0 0 0 0 0 0 0 0 0 0 755.562 0 0 0 -660.802 0 0 0 
0 0 769.295 0 0 0 0 0 114.216 0 0 0 0 2299.04 0 0 0 0 0 0 0 0 0 0 0 1510.13 0 0 0 0 0 0 0 0 0 0.01 0 0 0 0 0 0 0 0 0 0 1385.77 0 0 0 0 0 0 
1894.67 1918.47 193.564 0 0 0 0 0 0 0 0 0 0 1859.72 0 0 2098.22 0 0 -1552.25 0 0 0 0 0 0 0 0 0 0 0 0 0 0 0 0 0.06 0 0 -1198.54 0 0 0 0 0 0 0 0 0 0 547.731 0 0 
0 0 0 -1677.07 0 1823.71 0 0 0 0 0 677.587 0 397.58 0 -1886.88 0 0 0 1889.63 0 0 0 0 0 0 0 0 0 -46.617 0 0 0 0 0 0 0 0.08 0 0 0 0 0 0 0 1812.57 0 0 0 2038.41 -0.686666 0 0 
0 0 0 -2192.98 0 0 0 0 0 0 0 0 0 0 0 0 0 0 0 0 0 0 0 0 0 0 0 0 0 0 0 0 0 0 0 0 0 0 0.05 0 0 1663.64 0 871.075 1813.79 0 0 0 0 0 0 0 0 
0 0 -989.486 0 0 0 0 0 0 0 691.778 0 0 0 0 0 0 0 0 0 0 0 0 0 1173.82 0 0 0 0 0 0 1825.39 0 0 0 0 2498.93 0 0 0.04 0 1059.22 0 0 0 0 0 0 0 0 0 0 0 
-1865.83 2435.3 0 1901.68 -2422.94 0 0 557.192 0 0 0 2445.68 0 0 0 0 0 0 0 0 0 0 0 0 0 0 0 0 0 0 0 0 0 0 0 0 0 0 0 0 0.06 0 0 0 0 0 0 0 0 0 -1487.85 0 0 
0 0 0 0 0 0 0 0 2300.1 0 0 0 0 0 0 0 0 0 0 0 0 0 0 0 0 0 0 0 0 0 0 0 0 0 0 0 0 0 2325.43 -2406 0 0.06 0 0 0 0 0 232.017 1950.51 0 -1904.74 0 0 
0 0 0 0 -2329.71 0 0 0 1598.48 0 0 0 0 0 0 0 0 0 1748.33 41.2763 0 0 0 0 0 -1426.97 0 0 0 0 0 0 0 0 0 0 0 0 0 0 0 0 0.03 1958.3 0 0 1987.29 0 0 0 0 0 0 
232.78 0 0 953.627 0 0 0 0 991.775 0 0 0 0 0 0 -1051.74 0 0 0 0 0 31.8155 0 0 0 0 286.187 0 0 0 1052.05 0 0 1042.74 0 0 0 0 -1074.02 0 0 0 2470.85 0.01 0 0 0 0 0 0 864.818 0 0 
0 0 0 2342.37 0 0 2345.73 0 0 -1139.18 0 0 1081.65 0 0 0 2373.81 0 0 0 0 0 0 1541.87 0 0 0 0 0 0 0 0 0 0 0 0 0 0 -1665.47 0 0 0 0 0 0 0 0 0 0 0 0 0 0 
0 0 0 0 0 2467.8 0 0 0 0 0 0 0 0 21.897 0 0 0 0 0 0 0 0 0 0 0 1454.28 1032.36 0 0 0 0 0 0 1879.1 0 0 -889.538 0 0 0 0 0 0 0 0.02 642.796 0 0 0 0 0 0 
0 0 0 0 0 0 0 2306.51 0 0 0 0 0 0 0 0 0 0 0 0 1967.6 0 0 0 0 0 0 0 0 0 611.209 2.82296 0 0 0 2450.1 0 0 0 0 0 0 1735.21 0 0 -2312.01 0.08 1959.52 0 0 -1518.68 0 0 
0 0 0 0 0 0 0 2467.65 0 -258.568 0 0 1467.41 0 0 0 0 0 0 0 -398.038 0 0 0 0 0 1464.05 0 0 0 0 0 787.606 0 0 0 0 0 0 0 0 248.344 0 0 0 0 2030.78 0.08 1949.6 0 0 0 0 
0 0 -1469.85 0 0 0 0 0 0 0 0 0 0 0 0 874.737 0 -753.121 0 0 0 1377.07 0 0 -562.99 0 0 0 1424.68 0 0 0 1359.83 -2398.53 0 0 0 0 0 0 0 933.638 0 0 0 0 0 582.827 0.09 0 0 0 0 
0 0 0 0 0 0 0 0 0 0 0 0 0 0 2042.38 0 0 0 0 0 811.106 0 0 0 0 0 0 0 0 0 0 0 0 0 -2101.28 0 0 575.808 0 0 0 0 0 0 0 0 0 0 0 0.06 0 0 0 
0 204.245 0 0 0 0 0 0 0 0 0 0 0 0 -423.826 0 0 0 0 2357.78 0 0 0 2386.78 0 0 0 0 0 0 0 0 0 829.569 0 0 2178.18 1214.26 0 0 1745.89 -288.781 0 -2022.84 0 0 2096.24 0 0 0 0.01 0 0 
0 0 0 0 0 0 0 0 0 0 0 0 0 0 0 0 0 0 0 868.175 0 0 0 0 0 0 0 0 0 0 0 0 0 0 0 0 0 0 0 0 0 0 0 0 0 0 0 0 0 0 0 0.04 0 
0 0 0 0 0 0 0 0 0 0 0 0 2222.13 0 0 0 0 0 0 0 0 0 0 0 0 0 0 0 0 0 0 0 0 0 0 0 0 0 0 0 0 0 0 0 0 0 0 0 0 0 0 0 0.01 
