*Vertices 66
*Matrix 
0.08 -251.091 0 2145.38 0 -300.989 0 -1080.43 0 0 -382.321 0 0 2316.28 0 0 0 0 0 0 0 0 771.889 0 0 0 0 0 0 0 0 0 0 -1120.41 913.343 0 0 0 0 0 0 0 0 0 0 0 0 0 0 0 0 0 0 0 0 0 0 0 0 0 0 0 0 0 -1957.53 0 
1637.24 0.06 0 0 2363.89 2007.13 0 0 -815.378 0 0 0 -1939.22 -350.734 0 0 1471.53 0 0 0 2341.76 0 0 834.452 0 0 0 0 0 0 0 0 0 0 0 0 0 0 0 2216.03 1010.7 0 -351.344 0 0 0 0 0 0 0 0 0 0 0 0 0 0 0 0 0 0 0 0 0 0 0 
0 0 0.05 0 -2232.66 0 0 0 -2464.14 0 0 0 0 0 0 0 0 0 -1630.99 0 2114.09 240.104 0 1718.57 -1805.25 2123.55 0 0 0 0 0 -235.679 0 926.618 0 0 0 2369.99 2085.86 0 0 0 0 0 0 0 0 0 995.743 0 0 0 0 0 0 0 0 0 -2119.59 836.589 0 0 0 0 0 0 
1617.1 0 0 0.04 0 0 0 0 0 -2198.63 0 0 2339.17 -65.9963 0 0 0 0 0 0 -1170.16 0 2129.05 1814.25 0 0 -166.555 0 0 0 0 0 0 0 0 0 0 0 0 0 0 0 -811.563 0 0 1700.72 2171.62 423.521 0 0 0 0 0 0 0 0 -50.4318 0 0 0 -952.254 0 0 0 0 0 
0 -263.451 1002.3 0 0.03 1845.38 -262.993 0 145.955 0 0 0 0 0 0 -1899.4 -392.239 -560.854 0 0 0 1157.03 2477.11 0 1970.66 -1389.43 0 0 0 0 0 2024.67 0 0 -2442.78 0 1842.94 0 0 -1279.72 0 0 0 0 0 0 0 0 0 0 0 0 0 0 -264.367 0 0 0 0 0 0 0 0 0 -295.038 0 
-362.941 -744.423 0 0 -277.795 0 0 2474.36 0 0 1475.04 -764.412 0 0 0 0 0 2216.18 0 -544.526 0 458.922 2425.84 0 -143.208 0 0 0 0 0 1735.82 0 0 0 -1543.55 0 0 0 0 0 0 0 0 0 0 0 0 0 2397.92 0 0 0 0 0 -1288.42 0 0 0 0 0 0 0 0 0 0 0 
0 0 0 0 -1193.2 0 0.08 0 325.861 0 0 0 1265.22 67.98 0 -435.881 0 0 0 0 0 0 1731.54 0 0 0 0 0 456.481 0 1675.7 0 875.195 0 0 0 0 0 0 -604.19 0 0 0 0 0 0 0 0 0 0 2017.65 0 0 0 -2334.59 0 0 0 0 0 0 0 0 0 0 0 
11.063 0 0 0 0 456.481 0 0.06 0 0 0 0 0 0 -1830.88 2212.82 0 -2042.83 649.968 0 2469.48 0 -194.784 -903.729 -1124.68 -162.893 0 -227.897 0 0 0 1625.03 0 2050.31 0 0 0 0 590.152 0 0 0 2468.26 826.06 0 0 0 0 0 0 -11.5207 0 0 0 0 0 0 0 0 0 0 0 0 0 0 0 
0 -1104.85 647.832 0 -284.814 0 665.227 0 0.06 0 0 0 0 0 0 0 0 0 0 0 0 -1411.71 1703.77 1941.21 1638.62 0 0 0 909.223 0 0 0 0 0 0 0 0 0 0 1517 0 0 0 0 0 0 0 0 0 0 0 167.47 0 0 0 0 -1545.84 0 0 0 0 0 -1259.42 0 0 0 
0 0 0 638.829 0 0 0 0 0 0 0 0 0 0 0 0 0 0 0 2270.5 0 2014.6 0 1889.32 0 0 798.593 0 0 0 0 0 0 0 0 0 0 306.177 0 0 0 0 0 0 0 0 -101.856 0 0 0 0 696.966 -2162.16 0 0 0 0 0 0 0 0 0 0 1784.8 1330.99 0 
2056.11 0 0 0 0 1603.67 0 0 0 0 0 -1911.45 690.1 2014.3 41.4289 0 872.906 0 2452.24 0 0 0 -264.672 0 0 0 0 0 0 0 2212.36 0 0 0 0 0 0 0 1289.33 -729.621 1390.5 0 -1953.26 0 0 0 -2393.8 0 0 0 0 0 0 865.581 0 0 0 0 1715.06 0 -905.713 0 0 0 0 0 
0 0 0 0 0 1927.78 0 0 0 0 -681.86 0.07 0 0 0 -1409.73 0 0 0 0 0 0 -80.34 1519.59 0 0 0 0 2288.51 0 0 1286.74 1770.91 0 0 0 1324.73 0 0 -696.661 0 0 0 0 1256.83 0 0 0 0 0 0 0 0 0 0 0 0 0 0 0 0 0 0 0 0 0 
0 -1508.91 0 -233.543 0 0 -1246.15 0 0 0 2048.94 0 0.06 0 0 -766.549 0 0 0 1663.18 0 0 0 0 0 93.6155 0 2462.46 -1093.4 0 0 0 2072.74 0 2038.26 557.039 1016.65 -683.081 451.14 0 0 0 0 0 0 0 0 0 0 0 0 0 0 0 0 0 0 0 402.005 2475.28 0 0 0 0 0 0 
2259.97 -1280.63 0 1321.99 0 0 1961.2 0 0 0 -1085.16 0 0 0.08 -1200.98 1905.19 2254.48 0 1726.36 0 0 1496.4 -2061.45 0 -1271.02 0 -1006.58 0 -474.029 0 -1421.02 0 -2056.87 0 2259.97 0 0 327.082 0 1819.44 0 0 0 0 0 0 0 0 0 0 0 0 0 0 0 -2012.77 1159.93 0 0 0 0 0 0 0 0 2380.06 
0 0 0 0 0 0 0 1014.82 0 0 786.233 0 0 -244.224 0.06 0 0 0 0 -65.0807 0 962.325 0 -448.698 0 -126.423 0 0 0 0 0 0 0 -1875.74 0 0 0 0 2342.37 0 0 0 0 0 0 0 0 0 0 0 0 988.571 0 0 0 0 0 -2410.73 0 0 0 1394.01 0 0 0 0 
0 0 0 0 812.632 0 503.632 735.42 0 0 0 479.675 1878.49 1038.01 0 0.06 1907.79 -1497.16 1403.93 0 0 -1517.61 0 768.532 0 0 0 0 0 2443.69 0 -1210.14 1658.76 0 0 136.799 0 1708.5 0 0 0 0 0 0 0 0 0 0 0 0 0 0 0 0 0 0 0 -1653.57 0 1067.46 0 0 0 0 0 0 
0 -1752.3 0 0 74.0837 0 0 0 0 0 -557.497 0 0 -1657.23 0 792.795 0.01 1221.12 0 -566.652 0 -1910.99 2023.91 2058.7 0 1998.28 0 0 0 -488.22 0 257.653 0 0 0 1043.81 0 0 0 2179.25 0 0 0 0 0 0 0 0 0 967.055 -1597.11 0 0 0 0 0 0 0 0 0 0 0 0 0 0 -1157.34 
0 0 0 0 2328.03 1601.38 0 824.534 0 0 0 0 0 0 0 1215.48 -1072.19 0.07 -1970.96 0 0 370.876 -821.94 0 0 -209.586 0 0 0 0 486.999 0 2273.25 -366.298 0 0 0 0 0 0 0 0 0 0 1950.51 0 0 0 0 0 0 0 0 0 0 0 0 -1548.43 0 0 0 0 0 0 0 0 
0 0 -1692.48 0 0 0 0 -2013.38 0 0 824.534 0 0 -2148.43 0 2161.7 0 -1432.31 0.02 1951.43 0 1438.41 419.553 0 -470.672 0 0 1969.74 122.608 924.482 0 0 1274.38 0 0 1307.18 0 0 2472.08 -1962.87 1996.9 -281.152 0 0 0 0 0 0 0 0 0 0 0 0 0 0 0 0 0 0 0 0 0 0 0 0 
0 0 0 0 0 -645.695 0 0 0 1654.64 0 0 101.55 0 1488.16 0 130.238 0 -749.153 0.04 0 734.504 0 288.324 0 0 2492.83 972.549 0 0 0 0 0 0 0 0 0 0 0 0 0 0 0 0 0 0 0 0 0 0 0 0 0 0 0 0 0 0 -420.774 0 0 0 0 0 0 0 
0 1564.3 -2359 -134.053 0 0 0 584.048 0 0 0 0 0 0 0 0 0 0 0 0 0.01 0 0 0 0 0 -1061.66 0 0 0 1324.58 0 0 137.715 0 0 0 0 0 2017.81 0 0 0 0 0 -971.023 1186.64 0 0 0 0 0 0 0 0 0 0 0 0 0 0 0 0 0 -181.356 0 
0 0 2156.21 0 -1463.9 -723.365 0 0 -1572.85 2453.76 0 0 0 2096.85 -385.83 1974.32 125.507 -499.359 1410.03 2109.21 0 0.05 0 1381.5 0 961.715 0 0 0 0 0 1881.39 0 385.22 0 0 0 102.771 0 -676.824 0 0 0 0 0 -1186.79 0 0 0 0 0 0 0 0 0 0 0 0 0 0 0 0 -1411.71 0 0 -2432.1 
-418.027 0 0 568.484 2328.33 1163.29 -1607.33 -68.5903 1851.33 0 305.109 735.725 0 1129.11 0 0 2091.66 -1044.88 2493.74 0 0 0 0.01 0 0 0 0 0 0 2278.74 0 -1692.02 0 0 0 0 1630.53 0 1574.22 29.2215 0 0 0 0 0 0 0 0 0 -867.26 0 0 0 0 -1831.8 0 0 0 0 0 0 0 0 0 0 0 
0 549.562 -1676.15 -472.808 0 0 0 2392.42 1566.74 715.888 0 -808.969 0 0 -2368.16 1963.48 62.7918 0 0 2458.04 0 1583.07 0 0.03 0 0 401.395 0 0 0 0 0 0 0 -2358.39 0 0 0 0 0 2391.96 0 0 0 0 0 0 0 508.972 0 0 0 0 0 0 2417.14 0 -940.046 0 0 0 0 0 1958.91 0 0 
0 0 1082.72 0 1945.33 11.8259 0 1546.14 50.737 0 0 0 0 900.067 0 0 0 0 1521.27 0 0 0 0 0 0 0 0 0 -24.1859 0 0 0 0 0 1157.03 0 0 0 0 -797.067 477.386 1413.24 0 0 0 0 0 0 0 0 628.452 0 456.023 0 0 0 0 0 0 0 0 0 -2441.1 0 0 0 
0 0 210.959 0 -1599.25 0 0 390.561 0 0 0 0 2154.84 0 512.94 0 -291.528 918.836 0 0 0 1105.3 0 0 0 0.07 0 0 0 0 0 0 0 388.577 2425.53 0 0 0 0 0 0 0 0 0 0 0 0 0 0 0 0 0 11.6733 1764.81 0 0 813.547 0 0 -1553.62 0 -2496.95 -375.301 0 0 0 
0 0 0 -768.227 0 0 0 0 0 927.534 0 0 0 1424.38 0 0 0 0 0 -461.211 -1865.52 0 0 2119.28 0 0 0.06 0 0 586.184 1845.38 -527.436 0 2165.36 0 0 0 2025.13 0 0 0 -965.377 0 0 0 -26.6274 2319.48 0 0 0 0 0 2359.77 0 0 0 0 0 0 0 0 0 1167.71 0 0 0 
0 0 0 0 0 0 0 2481.38 0 0 0 0 -1797.62 0 0 0 0 0 775.246 1631.14 0 0 0 0 0 0 0 0.06 1358.15 0 0 0 0 2177.42 0 1788.92 822.55 -880.383 0 1595.89 -783.029 0 1997.97 0 0 0 0 0 0 0 0 0 0 0 0 0 0 0 0 0 0 0 0 0 0 0 
0 0 0 0 0 0 1202.96 0 -27.2378 0 0 -602.969 -50.737 -263.451 0 0 0 0 -1384.85 0 0 0 0 0 1099.51 0 0 533.235 0.03 0 0 0 0 0 0 2433.01 0 2329.71 0 0 0 0 0 519.349 2442.63 0 0 0 0 -233.39 0 0 0 0 0 193.106 1767.86 220.267 0 0 1665.93 0 0 0 0 0 
0 0 0 0 0 0 0 0 0 0 0 0 0 0 0 2132.4 955.611 0 555.513 0 0 0 1975.08 0 0 0 -689.947 0 0 0.06 0 0 0 -1055.1 0 -412.687 1332.51 -2157.89 0 0 531.251 0 0 -737.098 0 0 0 0 0 0 0 2110.74 0 0 0 0 1444.52 0 0 0 -993.149 0 0 0 0 0 
0 0 0 0 0 1275.9 -52.8733 0 0 0 -184.866 0 0 1585.51 0 0 0 276.879 0 0 1410.64 0 0 0 0 0 2024.06 0 0 0 0.08 0 0 -676.061 0 0 0 0 0 0 0 0 0 -1183.28 0 0 0 0 917.92 0 0 0 0 0 0 -1971.27 0 0 0 0 0 0 0 0 0 2442.63 
0 0 1455.96 0 99.5666 0 0 -734.504 0 0 0 2281.33 0 0 0 -1752.3 -168.233 0 0 0 0 512.94 865.123 0 0 0 1871.78 0 0 0 0 0.02 0 0 0 0 0 0 0 0 0 0 0 0 0 1833.78 0 0 -873.516 0 0 0 0 427.641 -2340.54 0 0 0 -747.932 0 0 0 0 0 0 0 
0 0 0 0 0 0 1883.37 0 0 0 0 204.855 1677.68 1770.91 0 1687.14 0 2051.68 1919.69 0 0 0 0 0 0 0 0 0 0 0 0 0 0.06 0 0 0 0 0 754.646 0 0 0 0 0 0 0 0 0 0 0 55.0096 0 0 2094.56 0 0 0 0 0 0 0 1677.98 0 0 0 0 
1315.12 0 -1742.53 0 0 0 0 -1301.84 0 0 0 0 0 0 -242.698 0 0 1604.43 0 0 -886.639 663.396 0 0 0 2405.7 2312.92 1085.47 0 1579.71 -1134.45 0 0 0.05 0 -599.002 -594.424 1614.96 1420.87 0 -2400.51 0 0 0 0 0 0 1311.91 -458.007 0 0 0 2453.15 0 0 0 0 2351.07 0 0 0 0 0 0 0 0 
2103.41 0 0 0 -849.101 1727.88 0 0 0 0 0 0 1559.11 51.3474 0 0 0 0 0 0 0 0 0 -824.229 1838.66 1704.99 0 0 0 0 0 0 0 0 0.01 0 0 -650.731 -1819.74 0 0 0 0 0 0 0 0 0 0 0 0 0 0 -1499.15 0 0 0 0 0 0 0 0 0 0 0 0 
0 0 0 0 0 0 0 0 0 0 0 0 -2369.84 0 0 687.353 -1397.52 0 516.144 0 0 0 0 0 0 0 0 931.654 115.894 -2487.33 0 0 0 2051.53 0 0.04 0 0 0 1381.5 1799.45 0 1815.01 0 0 0 0 0 1618.17 0 1620.76 0 0 0 0 0 -1535.62 0 0 0 80.1874 0 0 0 0 0 
0 0 0 0 1422.39 0 0 0 0 0 0 -2238.46 2230.37 0 0 0 0 0 0 0 0 0 -688.574 0 0 0 0 1958.45 0 -1942.73 0 0 0 -379.727 0 0 0.08 0 582.827 0 0 0 0 0 0 0 0 0 0 0 0 0 0 0 0 0 0 0 0 0 0 2392.42 0 0 0 0 
0 0 -1649.91 0 0 0 0 0 0 -252.617 0 0 -191.275 1054.19 0 1506.93 0 0 0 0 0 2455.14 0 0 0 0 -242.698 2234.18 2478.94 473.266 0 0 0 -127.491 204.703 0 0 0.08 589.694 1368.68 0 0 0 0 657.75 -1936.78 0 0 0 70.1163 0 0 0 0 2285.15 0 0 0 0 0 0 0 0 0 0 0 
0 0 -1771.68 0 0 0 0 1728.03 0 0 2480.47 0 549.409 0 -506.836 0 0 0 1545.99 0 0 0 301.141 0 0 0 0 0 0 0 0 0 2216.94 -1758.55 720.161 0 1934.19 630.741 0.06 0 0 1831.64 0 0 989.029 0 0 0 0 0 0 0 -750.221 0 0 0 0 0 0 0 0 0 0 0 0 0 
0 2430.27 0 0 2371.36 0 -1470.15 0 1219.44 0 1921.98 1994.46 0 1876.96 0 0 1264.31 0 295.953 0 819.346 183.95 -108.722 0 509.43 0 0 770.516 0 0 0 0 0 0 0 -144.734 0 1837.29 0 0.05 0 0 0 0 0 0 0 0 0 0 0 0 0 0 0 -2371.21 0 0 0 0 634.556 0 0 0 0 0 
0 2009.72 0 0 0 0 0 0 0 0 -2433.47 0 0 0 0 0 0 0 1913.43 0 0 0 0 683.691 1705.3 0 0 -2228.23 0 2096.39 0 0 0 -491.882 0 915.326 0 0 0 0 0.01 0 0 0 0 0 0 2376.25 0 0 0 0 0 0 0 0 0 -2245.32 1723.15 0 0 0 0 0 0 0 
0 0 0 0 0 0 0 0 0 0 0 0 0 0 0 0 0 0 2057.94 0 0 0 0 0 2432.86 0 1400.72 0 0 0 0 0 0 0 0 0 0 0 1840.04 0 0 0.07 0 0 0 0 0 0 0 0 0 0 0 0 0 0 0 0 -1478.7 -1989.43 -1118.58 0 1269.8 0 0 0 
0 1070.21 0 2095.17 0 0 0 -876.72 0 0 -432.981 0 0 0 0 0 0 0 0 0 0 0 0 0 0 0 0 -1937.54 0 0 0 0 0 0 0 1710.64 0 0 0 0 0 0 0.01 1626.1 0 0 2277.67 0 0 0 0 0 0 0 0 0 0 528.047 0 0 0 0 554.292 0 0 0 
0 0 0 0 0 0 0 538.575 0 0 0 0 0 0 0 0 0 0 0 0 0 0 0 0 0 0 0 0 1745.89 1410.18 -1685.77 0 0 0 0 0 0 0 0 0 0 0 -1279.11 0.02 0 0 1068.83 -1988.97 0 0 0 0 0 0 1474.12 0 0 2102.19 0 0 0 0 0 0 0 0 
0 0 0 0 0 0 0 0 0 0 0 1932.81 0 0 0 0 0 1292.08 0 0 0 0 0 0 0 0 0 0 1633.58 0 0 0 0 0 0 0 0 1941.21 2120.96 0 0 0 0 0 0.06 1746.35 0 0 0 0 0 -2397.46 0 0 0 0 0 0 0 0 0 0 0 0 0 0 
0 0 0 -2127.52 0 0 0 0 0 0 0 0 0 0 0 0 0 0 0 0 -853.679 684.912 0 0 0 0 321.436 0 0 0 0 1509.22 0 0 0 0 0 1839.43 0 0 0 0 0 0 1211.2 0.03 0 0 0 0 0 0 0 0 0 0 0 1954.94 0 0 0 0 0 0 0 0 
0 0 0 -171.896 0 0 0 0 0 2218.16 37.7667 0 0 0 0 0 0 0 0 0 1438.11 0 0 0 0 0 351.344 0 0 0 0 0 0 0 0 0 0 0 0 0 0 0 230.186 1204.95 0 0 0.09 -2216.33 867.412 0 0 0 0 0 2308.8 0 0 0 0 0 0 0 0 0 0 0 
0 0 0 -1051.74 0 0 0 0 0 0 0 0 0 0 0 0 0 0 0 0 0 0 0 0 0 0 0 0 0 0 0 0 0 -893.811 0 0 0 0 0 0 927.686 0 0 -139.241 0 0 1927.63 0.03 0 0 0 798.288 1455.81 0 0 0 0 0 0 0 0 0 0 0 0 0 
0 0 -44.0229 0 0 -91.7844 0 0 0 0 0 0 0 0 0 0 0 0 0 0 0 0 0 2083.42 0 0 0 0 0 0 -1927.63 1691.72 0 1692.33 0 -2084.8 0 0 0 0 0 0 0 0 0 0 1207.08 0 0.09 2386.47 0 0 0 0 0 0 0 1805.09 0 0 0 0 0 0 -827.891 0 
0 0 0 0 0 0 0 0 0 0 0 0 0 0 0 0 -1263.39 0 0 0 0 0 438.169 0 0 0 0 0 -64.0126 0 0 0 0 0 0 0 0 1976.61 0 0 0 0 0 0 0 0 0 0 2387.69 0.01 0 0 0 0 0 0 0 0 0 0 0 0 0 0 0 0 
0 0 0 0 0 0 -1612.67 1524.32 0 0 0 0 0 0 0 0 -95.294 0 0 0 0 0 0 0 1297.27 0 0 0 0 0 0 0 -1090.66 0 0 1486.79 0 0 0 0 0 0 0 0 0 0 0 0 0 0 0.06 0 0 0 0 1202.2 0 0 0 101.398 0 0 0 -2159.87 0 0 
0 0 0 0 0 0 0 0 -828.806 1493.19 0 0 0 0 2014.6 0 0 0 0 0 0 0 0 0 0 0 0 0 0 1502.81 0 0 0 0 0 0 0 0 0 0 0 0 0 0 550.935 0 0 1769.23 0 0 0 0.04 0 1582.92 -1583.68 0 0 0 0 0 -151.448 0 0 0 0 510.651 
0 0 0 0 0 0 0 0 0 -1305.66 0 0 0 0 0 0 0 0 0 0 0 0 0 0 813.395 2238.46 -987.198 0 0 0 0 0 0 1583.68 0 0 0 0 -377.132 0 0 0 0 0 0 0 0 -201.804 0 0 0 0 0.03 0 0 0 490.051 0 0 0 0 699.103 0 0 0 0 
0 0 0 0 0 0 0 0 0 0 -1702.55 0 0 0 0 0 0 0 0 0 0 0 0 0 0 2416.99 0 0 0 0 0 -1537.6 1766.03 0 1638.62 0 0 0 0 0 0 0 0 0 0 0 0 0 0 0 0 1496.7 0 0 0 0 0 0 0 0 0 0 0 -702.155 0 0 
0 0 0 0 1974.78 1535.77 -1373.1 0 0 0 0 0 0 0 0 0 0 0 0 0 0 0 1493.96 0 0 0 0 0 0 0 0 -876.415 0 0 0 0 0 1315.27 0 0 0 0 0 664.617 0 0 818.43 0 0 0 0 149.922 0 0 0.02 0 0 0 2045.27 0 0 0 0 0 0 0 
0 0 0 0 0 0 0 0 0 0 0 0 0 481.658 0 0 0 0 0 0 0 0 0 -2295.07 0 0 0 0 416.349 0 1015.88 0 0 0 0 0 0 0 0 2033.07 0 0 0 0 0 0 0 0 0 0 820.719 0 0 0 0 0.06 0 0 0 0 0 0 0 0 915.937 -714.209 
0 0 0 2234.64 0 0 0 0 -945.997 0 0 0 0 200.278 0 0 0 0 0 0 0 0 0 0 0 2154.84 0 0 920.667 1232.87 0 0 0 0 0 2416.23 0 0 0 0 0 0 0 0 0 0 0 0 0 0 0 0 -1015.12 0 0 0 0.04 0 0 0 0 0 0 -1789.38 0 0 
0 0 0 0 0 0 0 0 0 0 0 0 0 0 1224.17 1688.06 0 -1401.94 0 0 0 0 0 2113.64 0 0 0 0 716.346 0 0 0 0 -1735.36 0 0 0 0 0 0 -1342.43 0 1691.72 1218.99 0 -177.541 0 0 1753.67 0 0 0 0 0 0 0 0 0.05 0 0 0 0 0 0 0 0 
0 0 -547.884 0 0 0 0 0 0 0 -303.278 0 1826 0 0 0 0 0 0 2195.27 0 0 0 0 0 0 0 0 0 0 0 -596.561 0 0 0 0 0 0 0 0 -156.178 1503.57 0 0 0 0 0 0 0 0 0 0 0 0 2010.18 0 0 0 0 0 0 1971.42 0 0 0 0 
0 0 251.244 0 0 0 0 0 0 0 0 0 1552.86 0 0 -1108.66 0 0 0 0 0 0 0 0 0 -1585.06 0 0 0 0 0 0 0 0 0 0 0 0 0 0 0 1169.39 0 0 0 0 0 0 0 0 795.694 0 0 0 0 0 0 0 0 0.03 -861.156 2048.17 0 0 -836.131 0 
0 0 0 296.564 0 0 0 0 0 0 2007.28 0 0 0 0 0 0 0 0 0 0 0 0 0 0 0 0 0 1181.6 -2012.01 0 0 0 0 0 2003.77 0 0 0 -2382.05 0 212.943 0 0 0 0 0 0 0 0 0 -278.71 0 0 0 0 0 0 0 2293.39 0.09 0 1128.04 0 0 0 
0 0 0 0 0 0 0 0 0 0 0 0 0 0 -1136.28 0 0 0 0 0 0 0 0 0 0 2463.99 0 0 0 0 0 0 -2072.89 0 0 0 -2177.88 0 0 0 0 0 0 0 0 0 0 0 0 0 0 0 2283.93 0 0 0 0 0 44.7859 1780.68 0 0.03 0 0 0 0 
0 0 0 0 0 0 0 0 -2105.24 0 0 0 0 0 0 0 0 0 0 0 0 2113.03 0 0 -523.774 -861.156 1095.23 0 0 0 0 0 0 0 0 0 0 0 0 0 0 1498.69 2321.62 0 0 0 0 0 0 0 0 0 0 0 0 0 0 0 0 0 1058 0 0.01 0 0 0 
0 0 0 0 0 0 0 0 0 1704.84 0 0 0 0 0 0 0 0 0 0 0 0 0 -556.276 0 0 0 0 0 0 0 0 0 0 0 0 0 0 0 0 0 0 0 0 0 0 0 0 0 0 2088.31 0 0 1891.46 0 0 -706.58 0 0 0 0 0 0 0.04 668.432 0 
1330.84 0 0 0 2413.79 0 0 0 0 1185.87 0 0 0 0 0 0 0 0 0 0 -385.983 0 0 0 0 0 0 0 0 0 0 0 0 0 0 0 0 0 0 0 0 0 0 0 0 0 0 0 -848.949 0 0 0 0 0 0 969.802 0 0 0 543.153 0 0 0 1278.95 0.05 0 
0 0 0 0 0 0 0 0 0 0 0 0 0 475.097 0 0 1275.75 0 0 0 0 -912.885 0 0 0 0 0 0 0 0 -317.011 0 0 0 0 0 0 0 0 0 0 0 0 0 0 0 0 0 0 0 0 802.713 0 0 0 1904.89 0 0 0 0 0 0 0 0 0 0.02 
