*Vertices 31
*Matrix 
0.09 -1734.6 1383.18 1391.87 0 0 0 2459.11 0 0 -1458.86 1086.99 0 1136.43 0 0 0 1109.88 -1126.97 2175.28 0 0 1262.93 0 0 0 0 0 573.824 0 0 
1664.4 0.03 0 0 0 0 0 0 0 -1247.67 -875.347 -2348.32 0 1749.7 -185.781 0 0 0 0 0 351.497 -323.42 1909.62 -1515.47 0 0 2121.11 0 0 0 0 
-2007.43 0 0.03 0 0 0 2126.91 0 1679.82 1060.59 0 0 0 0 0 1816.69 0 0 0 0 0 1365.47 -373.47 0 0 0 -2407.07 0 2248.38 0 0 
2241.51 0 0 0.08 0 -636.235 425.352 0 0 0 0 0 1122.55 1244.16 1214.41 2148.73 0 0 0 0 0 -2492.83 -1118.88 -1695.23 0 0 -10.3 0 0 0 0 
0 0 0 0 0.08 1037.4 0 0 0 0 0 0 -2260.58 0 0 0 1332.67 -838.42 0 0 0 0 0 0 -2093.49 0 1721.93 266.808 2388.91 0 0 
0 0 0 710.089 -861.003 0.08 0 0 0 0 0 0 1495.48 0 2201.99 1034.96 0 -1330.99 0 -1552.71 683.996 0 0 1865.06 0 0 2205.34 -651.341 0 0 0 
0 0 -2035.36 2419.89 0 0 0.01 0 1144.83 0 0 0 0 -1181.14 0 0 0 0 0 0 953.78 0 0 2123.55 0 496.612 0 0 -1036.03 -174.032 -1573.15 
-2035.97 0 0 0 0 0 0 0.05 0 0 760.75 0 0 0 0 0 0 0 0 2379.45 1206.78 0 0 304.193 0 0 -931.196 0 0 636.387 0 
0 0 1796.24 0 0 0 1284.14 0 0.08 0 0 0 0 0 0 0 0 0 0 0 0 0 1474.88 0 -572.909 0 -1566.29 0 0 0 0 
0 1595.58 2306.21 0 0 0 0 0 0 0 -1412.47 1111.56 1233.79 0 0 1120.26 -299.768 1803.11 0 0 222.251 0 0 0 0 0 0 0 0 521.943 0 
970.412 79.2718 0 0 0 0 0 1325.34 0 1493.04 0.04 0 0 0 0 -296.106 -1144.06 0 0 0 0 2351.68 0 0 0 0 -1981.03 0 0 0 0 
-39.5978 1265.37 0 0 0 0 0 0 0 1631.14 0 0.04 0 -575.045 0 0 0 23.7281 -405.972 0 0 0 0 0 -391.781 1526.92 0 0 0 0 273.98 
0 0 0 754.799 583.743 1961.96 0 0 0 32.5785 0 0 0.08 -66.3015 0 0 0 0 -402.463 61.7237 1606.27 2298.73 -961.715 0 0 0 92.0896 0 0 0 -536.439 
2462 332.423 0 -160.298 0 0 -791.726 0 0 0 0 -15.9459 1402.4 0 0 1853.16 0 0 2275.54 0 0 0 0 1961.2 0 1835.15 0 0 0 0 0 
0 546.815 0 -82.3237 0 -309.839 0 0 0 0 0 0 0 0 0.06 0 1603.98 0 1795.79 -73.3207 0 0 0 0 0 1847.67 0 0 0 -76.9829 0 
0 0 -470.672 -676.824 0 1287.19 0 0 0 580.081 363.857 0 0 1838.05 0 0.04 0 1731.09 0 0 0 0 -1328.7 0 0 0 0 2261.35 396.359 -1941.66 0 
0 0 0 0 2187.49 0 0 0 0 671.026 1540.04 0 0 0 -803.476 0 0.01 0 0 1353.72 0 0 0 0 0 766.396 0 0 0 0 0 
1155.81 0 0 0 -1292.54 1203.73 0 0 0 152.211 0 541.78 0 0 0 -1764.96 0 0.05 0 1057.24 1205.25 0 0 2455.9 -2422.03 0 0 2182.15 0 -163.961 0 
56.3829 0 0 0 0 0 0 0 0 0 0 -1911.45 2227.62 1928.39 2474.21 0 0 0 0.01 -919.599 0 0 0 0 0 0 2039.48 0 2142.78 0 -214.164 
852.153 0 0 0 0 253.99 0 642.033 0 0 0 0 2306.05 0 1716.28 0 541.475 113.758 2334.89 0.09 0 0 1596.35 -1459.17 0 0 1073.56 2462 0 0 0 
0 2211.14 0 0 0 2116.69 822.855 815.683 0 -941.878 0 0 1301.69 0 0 0 0 -813.089 0 0 0.02 0 2303.61 0 0 0 0 -2430.57 0 0 0 
0 676.366 2308.65 1490.75 0 0 0 0 0 0 -1929.46 0 476.318 0 0 0 0 0 0 0 0 0.08 -701.697 0 0 0 0 0 0 0 0 
1325.19 1039.08 1996.6 173.269 0 0 0 0 1566.74 0 0 0 -2030.47 0 0 965.224 0 0 0 1225.55 -2188.56 265.435 0.07 0 0 -1770 0 1805.86 1270.26 0 0 
0 1258.51 0 1013.44 0 1270.41 1254.69 -350.124 0 0 0 0 0 1577.12 0 0 0 920.362 0 2036.12 0 0 0 0.02 0 0 0 -1937.39 153.127 -97.2777 0 
0 0 0 0 1214.26 0 0 0 2117.91 0 0 2194.2 0 0 0 0 0 1694.46 0 0 0 0 0 0 0.09 0 -750.984 1506.93 2459.11 0 -645.848 
0 0 0 0 0 0 -74.6941 0 0 0 0 1990.49 0 304.346 -2347.87 0 -1053.73 0 0 0 0 0 -272.454 0 0 0.02 0 -268.792 0 2063.13 0 
0 -2444.15 1503.57 277.337 529.572 2443.08 0 852.611 865.886 0 -2458.19 0 2061.75 0 0 0 0 0 217.215 2024.06 0 0 0 0 1300.32 0 0.02 -2481.38 -2062.21 0 0 
0 0 0 0 1436.43 2405.55 0 0 0 0 0 0 0 0 0 -559.786 0 968.734 0 2142.17 2495.42 0 1781.44 1833.78 461.821 1402.71 1874.68 0.01 0 -32.7311 0 
287.255 0 1194.57 0 1878.34 0 2129.66 0 0 0 0 0 0 0 0 1977.68 0 0 1813.94 0 0 0 15.3356 -847.27 2497.25 0 215.537 0 0.07 2373.81 0 
0 0 0 0 0 0 -2454.07 9.53703 0 -2265.01 0 0 0 0 1427.43 1454.89 0 -1755.5 0 0 0 0 0 2084.34 0 336.695 0 2074.57 583.438 0.09 0 
0 0 0 0 0 0 -2217.7 0 0 0 0 370.418 1970.35 0 0 0 0 0 1688.97 0 0 0 0 0 823.008 0 0 0 0 0 0.05 
