*Vertices 61
*Matrix 
0.08 0 1510.28 0 0 0 859.935 0 0 0 0 0 0 0 0 0 0 0 0 -99.7192 0 0 0 0 0 346.614 0 0 0 0 -332.27 0 0 2042.53 0 0 0 64.7755 0 0 0 0 -1815.32 0 0 0 0 0 0 0 0 0 0 0 -581.454 0 0 0 0 0 0 
0 0.02 0 2113.33 1047.93 0 0 0 1879.56 0 0 0 0 0 0 0 0 0 0 2188.1 697.424 -1284.75 0 0 0 0 0 0 0 0 0 0 0 0 0 0 0 0 0 0 0 0 0 0 0 0 0 0 0 0 0 0 0 0 0 0 0 0 0 0 0 
-1759.32 0 0.02 801.95 0 0 0 0 0 1717.05 0 0 0 0 0 0 0 0 0 0 0 -38.377 0 0 0 0 2408.29 -1635.41 0 0 0 0 0 0 0 0 0 0 0 0 0 0 0 0 0 0 0 0 0 0 0 0 0 0 0 0 0 -199.667 0 0 0 
0 1966.38 -1236.53 0.01 0 0 -2039.02 0 0 2096.7 0 0 0 0 0 0 0 1993.55 0 860.24 0 1753.36 0 0 0 0 0 -2008.96 0 0 0 -48.2955 0 0 0 0 0 0 0 0 0 1663.49 0 2291.25 0 0 0 1888.71 0 0 0 0 0 0 0 -494.018 0 0 0 0 0 
0 166.25 0 0 0.05 0 0 -320.978 0 0 0 -342.189 0 0 0 1158.56 0 0 0 0 1344.11 0 0 0 0 -2279.96 237.663 1298.79 0 0 1208.46 0 0 0 0 0 0 0 0 0 0 0 0 0 0 0 0 0 0 1223.72 0 0 0 0 0 0 0 0 -40.8185 0 0 
0 0 0 0 0 0.04 0 0 0 0 0 0 0 0 0 0 0 0 0 0 0 -1500.52 0 0 0 0 0 0 2194.81 0 0 0 0 0 1925.95 0 0 0 0 0 0 0 0 669.805 0 0 0 0 0 -698.645 0 0 2487.64 0 470.977 0 0 1556.52 0 0 0 
2212.82 0 0 617.313 0 0 0.07 0 2357.33 0 0 0 0 0 0 0 0 0 0 0 0 0 0 0 0 0 -1475.19 0 0 1127.58 0 0 0 0 1987.29 0 0 774.483 0 0 -159.993 0 0 0 0 2350 0 0 0 0 0 0 253.838 0 0 0 0 0 0 0 0 
0 0 0 0 -1692.02 0 0 0.06 0 0 -38.8348 0 0 0 1618.63 0 0 -281.915 0 0 0 0 1780.83 0 0 0 -2237.08 0 1537.75 1377.99 0 0 0 0 0 0 0 0 0 0 0 0 0 0 0 0 0 -506.531 0 0 0 0 0 0 0 1964.86 0 0 0 0 0 
0 -1115.68 0 0 0 0 2195.88 0 0.08 0 -171.896 0 0 0 0 0 0 0 201.651 0 0 0 0 0 0 0 0 0 458.159 0 1377.07 0 0 0 154.5 0 0 0 -396.97 0 0 0 0 1814.1 0 0 0 0 0 0 0 990.097 -1278.5 0 0 0 0 0 0 0 0 
0 0 1790.29 63.86 0 0 0 0 0 0.07 0 0 0 752.052 0 453.429 0 0 -880.23 0 0 782.723 0 0 0 -888.47 0 0 0 0 0 0 0 0 0 0 0 0 0 0 0 0 0 0 0 0 0 0 0 0 0 0 0 0 0 0 0 0 0 0 0 
0 0 0 0 0 0 0 74.8466 765.023 0 0 0 0 0 0 0 0 0 0 0 0 1823.4 0 0 429.624 0 0 0 0 0 0 0 0 0 0 0 813.7 0 0 0 0 0 0 0 0 0 0 0 0 1442.23 0 0 0 2179.86 0 1543.24 0 -857.494 0 0 0 
0 0 0 0 404.752 0 0 0 0 0 0 0.01 0 0 0 0 0 0 0 0 1722.08 0 0 0 0 -381.558 0 0 0 0 0 2294.76 1459.78 0 93.9207 0 841.319 0 0 0 0 0 0 0 0 0 0 0 0 0 0 0 0 1292.99 0 0 2430.72 0 0 0 0 
0 0 0 0 0 0 0 0 0 0 0 0 0 0 1610.54 752.052 0 0 0 -661.412 0 0 0 0 0 0 0 0 0 0 0 0 0 0 0 0 0 0 2005.29 -1980.57 0 0 0 0 0 0 0 0 0 0 0 2304.53 0 0 0 0 0 0 0 0 0 
0 0 0 0 0 0 0 0 0 1911.45 0 0 0 0 0 0 1580.02 0 0 0 0 0 0 0 0 0 0 0 96.5148 0 0 0 0 0 0 -1110.03 0 -1514.4 0 0 0 0 0 0 0 447.783 0 0 0 0 0 0 -1157.95 0 0 0 0 0 0 0 0 
0 0 0 0 0 0 0 1905.65 0 0 0 0 1173.06 0 0.04 -1754.59 0 0 0 0 0 -1938.46 0 0 0 -285.424 0 1463.29 0 0 0 0 0 0 0 0 0 99.2615 0 0 0 0 0 0 0 0 0 0 0 0 1843.39 623.875 0 0 -1443.45 0 0 0 0 0 0 
0 0 0 0 903.424 0 0 0 0 -724.433 0 0 833.079 0 1347.77 0.01 0 0 637.455 0 0 0 0 0 0 0 0 0 0 0 2102.19 0 0 0 996.963 0 0 0 0 0 0 0 0 0 0 0 0 0 0 0 0 0 0 0 0 0 0 0 0 0 0 
0 0 0 0 0 0 0 0 0 0 0 0 0 2454.68 0 0 0.06 0 0 0 0 -1052.96 0 0 0 2093.95 0 0 0 0 0 0 0 0 0 1594.36 0 0 0 0 0 0 0 0 1037.25 0 0 0 1564.46 0 0 0 0 0 0 709.021 0 -2016.28 0 0 0 
0 0 0 1621.68 0 0 0 -870.312 0 0 0 0 0 0 0 0 0 0 0 0 0 0 0 2069.23 0 0 0 0 0 0 0 0 0 -362.636 0 0 0 0 0 0 0 0 0 0 0 0 0 0 0 0 1549.2 0 0 0 0 1880.17 0 1033.13 0 0 0 
0 0 0 0 0 0 0 0 1991.26 -1661.2 0 0 0 0 0 -1309.02 0 0 0.03 0 0 0 0 0 0 946.608 1191.06 -1316.49 0 0 0 0 0 0 0 0 1962.72 0 0 0 0 0 0 0 0 0 0 -17.9296 0 0 0 0 150.075 1801.74 0 0 0 0 0 0 0 
2254.63 322.352 0 1197.62 0 0 0 0 0 0 0 0 -472.808 0 0 0 0 0 0 0.02 0 0 0 0 0 0 0 0 0 0 0 0 1047.17 732.368 0 0 0 2360.38 0 0 0 0 0 0 0 0 0 0 0 0 0 0 0 0 2438.66 0 0 0 0 0 0 
0 1654.18 0 0 -1112.48 0 0 0 0 0 0 2478.33 0 0 0 0 0 0 0 0 0.02 0 0 2380.98 2051.07 0 0 0 0 0 0 0 0 0 0 1265.37 0 0 0 0 -897.931 0 0 -1980.12 0 0 0 0 744.728 0 0 0 0 0 0 0 0 0 0 0 0 
0 1048.54 1271.63 878.246 0 1322.29 0 0 0 -822.855 -542.39 0 0 0 -1475.95 0 2407.07 0 0 0 0 0.07 0 0 0 0 -1545.08 0 1810.89 0 1560.79 0 0 0 0 0 0 0 0 0 0 0 0 0 0 0 1838.66 0 0 0 0 0 0 0 -2297.97 0 0 0 0 0 0 
0 0 0 0 0 0 0 307.398 0 0 0 0 0 0 0 0 0 0 0 0 0 0 0 860.088 0 0 0 0 0 0 0 0 0 0 0 0 0 1866.74 0 0 0 0 0 0 0 0 0 0 0 0 0 0 0 2371.36 0 0 0 -55.9252 0 0 0 
0 0 0 0 0 0 0 0 0 0 0 0 0 0 0 0 0 1401.64 0 0 -290.002 0 889.843 0.08 0 0 0 0 0 1509.22 0 0 0 0 1302.61 0 -1484.65 0 0 0 0 0 0 1446.5 0 0 0 0 0 0 0 0 -2.21259 0 0 0 0 0 0 0 0 
0 0 0 0 0 0 0 0 0 0 2293.69 0 0 0 0 0 0 0 0 0 -214.011 0 0 0 0.01 0 0 2229.3 0 0 0 0 0 0 0 0 0 0 0 0 0 0 -1399.5 0 0 1712.16 0 0 0 0 0 0 0 0 0 1514.71 -1498.99 0 0 0 0 
1554.38 0 0 0 -1191.06 0 0 0 0 1800.36 0 1388.06 0 0 1880.47 0 1376.92 0 1067.92 0 0 0 0 0 0 0.02 0 826.365 0 0 0 -569.857 0 410.855 0 0 0 0 0 0 0 -193.716 0 0 0 0 1161.92 0 0 0 0 0 2220.76 0 0 0 0 0 0 0 0 
0 0 -203.482 0 1878.19 0 1274.07 72.7104 0 0 0 0 0 0 0 0 0 0 2453.31 0 0 284.204 0 0 0 0 0.02 939.741 0 0 0 0 0 0 0 0 0 0 0 0 0 0 0 0 0 0 0 0 -79.577 0 2018.27 0 0 0 0 1537.9 0 0 0 0 0 
0 0 55.7726 618.839 852.763 0 0 0 0 0 0 0 0 0 797.525 0 0 0 -2116.99 0 0 0 0 0 872.295 185.171 2028.34 0.03 0 0 0 838.725 0 0 0 0 0 1152 0 0 0 0 -121.54 0 0 0 -635.929 0 0 0 0 0 0 0 0 0 0 0 0 0 0 
0 0 0 0 0 -448.851 0 85.6807 -409.329 0 0 0 0 1425.29 0 0 0 0 0 0 0 -745.949 0 0 0 0 0 0 0.03 2452.24 0 0 0 0 0 0 0 0 0 0 0 1863.38 0 0 0 0 0 0 0 0 0 -1869.95 -2306.21 0 1413.85 0 856.578 0 0 0 0 
0 0 0 0 0 0 2189.32 940.199 0 0 0 0 0 0 0 0 0 0 0 0 0 0 0 1797.46 0 0 0 0 1142.69 0.04 -1792.73 -620.365 0 -1949.9 0 2022.54 0 0 0 0 0 0 0 0 0 0 0 0 0 0 0 0 0 0 -1799.75 -982.772 0 0 0 0 0 
1081.5 0 0 0 -911.359 0 0 0 705.969 0 0 0 0 0 0 -814.615 0 0 0 0 0 2344.36 0 0 0 0 0 0 0 -2351.99 0 -1115.07 0 0 0 0 0 0 0 0 1572.08 0 0 0 1342.59 0 0 0 0 0 0 0 373.775 0 0 -1397.52 0 0 0 0 0 
0 0 0 483.489 0 0 0 0 0 0 0 965.224 0 0 0 0 0 0 0 0 0 0 0 0 0 2103.56 0 -1406.52 0 -1247.52 1011.31 0.07 0 0 0 0 0 0 1664.25 0 0 0 0 0 0 0 0 0 0 0 -69.9637 1535.16 0 0 -416.349 0 0 0 0 0 0 
0 0 0 0 0 0 0 0 0 0 0 -2207.63 0 0 0 0 0 0 0 1212.58 0 0 0 0 0 0 0 0 0 0 0 0 0.07 0 2174.67 0 0 0 0 398.038 0 0 0 0 0 0 -706.885 0 0 1759.93 0 0 0 0 1921.37 0 -1570.71 0 0 0 0 
1627.02 0 0 0 0 0 0 0 0 0 0 0 0 0 0 0 0 -1642.89 0 1325.5 0 0 0 0 0 -2260.73 0 0 0 1746.19 0 0 0 0.02 0 0 1324.27 0 0 0 0 0 0 0 1776.56 2146.75 0 0 0 0 0 0 0 0 0 0 0 0 0 0 0 
0 0 0 0 0 1212.58 -1529.66 0 956.679 0 0 1977.52 0 0 0 -576.876 0 0 0 0 0 0 0 -899.762 0 0 0 0 0 0 0 0 1920 0 0.01 0 0 0 0 0 0 0 0 0 1164.66 0 0 0 0 0 0 0 0 0 0 0 0 0 0 0 0 
0 0 0 0 0 0 0 0 0 0 0 0 0 -2074.57 0 0 -371.944 0 0 0 198.141 0 0 0 0 0 0 0 0 1975.23 0 0 0 0 0 0.01 0 0 0 0 0 0 1551.33 0 444.731 0 0 0 0 0 0 0 0 0 -933.485 0 0 0 0 0 0 
0 0 0 0 0 0 0 0 0 0 399.258 1059.37 0 0 0 0 0 0 -394.986 0 0 0 0 1017.87 0 0 0 0 0 0 0 0 0 1008.41 0 0 0.05 0 0 0 0 0 979.873 0 0 0 0 0 0 0 0 225.455 0 2110.28 0 0 0 0 0 0 0 
789.285 0 0 0 0 0 -248.65 0 0 0 0 0 0 -1103.93 2319.03 0 0 0 0 741.523 0 0 1367.61 0 0 0 0 -1973.4 0 0 0 0 0 0 0 0 0 0.06 0 0 0 0 0 0 0 0 0 0 0 0 -1639.23 0 1073.11 0 0 0 0 0 0 0 0 
0 0 0 0 0 0 0 0 -261.925 0 0 0 2118.52 0 0 0 0 0 0 0 0 0 0 0 0 0 0 0 0 0 0 1499.91 0 0 0 0 0 0 0.08 0 0 0 0 0 0 0 2186.42 0 0 0 0 0 0 0 2338.56 0 0 0 0 0 0 
0 0 0 0 0 0 0 0 0 0 0 0 2280.72 0 0 0 0 0 0 0 0 0 0 0 0 0 0 0 0 0 0 0 -538.575 0 0 0 0 0 0 0.01 0 0 0 0 -868.328 0 0 0 0 0 0 0 283.593 1211.97 0 0 0 0 0 -1511.81 0 
0 0 0 0 0 0 -197.989 0 0 0 0 0 0 0 0 0 0 0 0 0 2219.08 0 0 0 0 0 0 0 0 0 1979.2 0 0 0 0 0 0 0 0 0 0 0 0 0 0 0 0 0 0 0 0 0 0 0 0 0 0 0 0 0 0 
0 0 0 592.593 0 0 0 0 0 0 0 0 0 0 0 0 0 0 0 0 0 0 0 0 0 1374.32 0 0 1580.48 0 0 0 0 0 0 0 0 0 0 0 0 0.06 0 -68.5903 0 0 0 0 0 0 0 1884.59 0 0 0 0 0 0 0 0 0 
2460.33 0 0 0 0 0 0 0 0 0 0 0 0 0 0 0 0 0 0 0 0 0 0 0 1527.83 0 0 2415.16 0 0 0 0 0 0 0 2000.56 -2073.35 0 0 0 0 0 0.03 0 -1990.8 0 0 0 -1843.39 0 0 0 0 0 0 0 0 0 0 0 0 
0 0 0 2194.2 0 1956.77 0 0 -601.444 0 0 0 0 0 0 0 0 0 0 0 -1971.72 0 0 -206.992 0 0 0 0 0 0 0 0 0 0 0 0 0 0 0 0 0 2215.11 0 0.08 0 0 0 0 0 0 0 -1598.94 0 0 0 0 0 0 0 0 0 
0 0 0 0 0 0 0 0 0 0 0 0 0 0 0 0 1822.49 0 0 0 0 0 0 0 0 0 0 0 0 0 351.344 0 0 -369.198 -253.685 2127.22 0 0 0 17.777 0 0 1005.51 0 0.04 0 0 0 0 0 0 0 0 0 0 0 0 0 0 0 0 
0 0 0 0 0 0 -53.4837 0 0 0 0 0 0 330.439 0 0 0 0 0 0 0 0 0 0 2281.18 0 0 0 0 0 0 0 0 1596.04 0 0 0 0 0 0 0 0 0 0 0 0.03 0 0 0 0 0 0 0 0 2019.49 -1433.07 0 0 0 0 0 
0 0 0 0 0 0 0 0 0 0 0 0 0 0 0 0 0 0 0 0 0 1395.54 0 0 0 -1556.22 0 483.337 0 0 0 0 1011.76 0 0 0 0 0 -1727.58 0 0 0 0 0 0 0 0 0 0 0 0 0 1904.89 0 0 0 0 0 0 0 0 
0 0 0 436.644 0 0 0 -1222.34 0 0 0 0 0 0 0 0 0 0 1790.29 0 0 0 0 0 0 0 0 0 0 0 0 0 0 0 0 0 0 0 0 0 0 0 0 0 0 0 0 0.07 0 1081.19 0 0 0 0 0 0 0 0 0 0 0 
0 0 0 0 0 0 0 0 0 0 0 0 0 0 0 0 1531.95 0 0 0 1575.75 0 0 0 0 0 -1015.73 0 0 0 0 0 0 0 0 0 0 0 0 0 0 0 709.784 0 0 0 0 0 0 0 0 0 0 0 0 0 0 0 0 0 0 
0 0 0 0 -1032.06 2302.7 0 0 0 0 -667.364 0 0 0 0 0 0 0 0 0 0 0 0 0 0 0 0 0 0 0 0 0 1419.19 0 0 0 0 0 0 0 0 0 0 0 0 0 0 369.655 0 0.05 0 0 0 -2163.38 0 0 0 0 0 0 0 
0 0 0 0 0 0 0 0 0 0 0 0 0 0 810.8 0 0 -881.146 0 0 0 0 0 0 0 0 -239.494 0 0 0 0 -1329.31 0 0 0 0 0 1725.9 0 0 0 0 0 0 0 0 0 0 0 0 0.09 0 0 777.993 0 0 -104.45 0 0 0 0 
0 0 0 0 0 0 0 0 -1519.59 0 0 0 1901.99 0 -962.783 0 0 0 0 0 0 0 0 0 0 0 0 0 1271.63 0 0 1766.18 0 0 0 0 556.429 0 0 0 0 1891.61 0 -1914.81 0 0 0 0 0 0 0 0.02 0 0 0 0 0 0 0 0 0 
0 0 0 0 0 -128.101 1209.98 0 929.975 0 0 0 0 -112.995 0 0 0 0 2147.36 0 0 0 0 1633.88 0 1711.4 0 0 -832.621 0 1133.38 0 0 0 0 0 0 -136.647 0 -2251.73 0 0 0 0 0 0 -245.75 0 0 0 0 0 0.02 0 -1086.84 0 0 0 0 0 0 
0 0 0 0 0 0 0 0 0 0 2368.47 92.8526 0 0 0 0 0 0 -812.174 0 0 0 926.008 0 0 0 0 0 0 0 0 0 0 0 0 0 -1869.03 0 0 1241.11 0 0 0 0 0 0 0 0 0 82.4763 1636.48 0 0 0.09 0 1588.56 0 0 0 0 0 
2144.61 0 0 0 0 -414.823 0 0 0 0 0 0 0 0 1703.47 0 0 0 0 1091.27 0 -840.098 0 0 0 0 0 0 1229.51 977.889 0 -813.242 -432.371 0 0 918.836 0 0 -1114.76 0 0 0 0 0 0 -741.829 0 0 0 0 0 0 1591.31 0 0 0 0 0 0 0 0 
0 0 0 2165.67 0 0 0 29.5267 0 0 -1712.01 0 0 0 0 0 2174.52 2190.69 0 0 0 0 0 0 -1162.37 0 1667.91 0 0 -1398.74 408.719 0 0 0 0 0 0 0 0 0 0 0 0 0 0 679.266 0 0 0 0 0 0 0 2128.9 0 0.06 0 0 0 0 0 
0 0 0 0 0 0 0 0 0 0 0 -1036.79 0 0 0 0 0 0 0 0 0 0 0 0 1975.84 0 0 0 -1371.58 0 0 0 2234.79 0 0 0 0 0 0 0 0 0 0 0 0 0 0 0 0 0 1129.11 0 0 0 0 0 0.02 0 0 0 0 
0 0 572.604 0 0 1489.38 0 0 0 0 2194.05 0 0 0 0 0 1875.44 -2413.63 0 0 0 0 2372.89 0 0 0 0 0 0 0 0 0 0 0 0 0 0 0 0 0 0 0 0 0 0 0 0 0 0 0 0 0 0 0 0 0 0 0.07 0 0 1929.3 
0 0 0 0 433.287 0 0 0 0 0 0 0 0 0 0 0 0 0 0 0 0 0 0 0 0 0 0 0 0 0 0 0 0 0 0 0 0 0 0 0 0 0 0 0 0 0 0 0 0 0 0 0 0 0 0 0 0 0 0.09 0 0 
0 0 0 0 0 0 0 0 0 0 0 0 0 0 0 0 0 0 0 0 0 0 0 0 0 0 0 0 0 0 0 0 0 0 0 0 0 0 0 2020.4 0 0 0 0 0 0 0 0 0 0 0 0 0 0 0 0 0 0 0 0.06 0 
0 0 0 0 0 0 0 0 0 0 0 0 0 0 0 0 0 0 0 0 0 0 0 0 0 0 0 0 0 0 0 0 0 0 0 0 0 0 0 0 0 0 0 0 0 0 0 0 0 0 0 0 0 0 0 0 0 656.835 0 0 0.01 
