*Vertices 68
*Matrix 
0.06 0 0 551.851 0 0 -754.494 0 0 0 0 0 -122.303 2217.25 0 -1966.08 615.329 1240.96 0 0 0 0 383.084 0 0 1060.75 -1103.17 0 0 0 0 -324.335 0 -227.592 996.963 0 0 0 0 1444.06 0 0 0 1837.14 72.7104 0 -321.589 0 0 0 0 0 0 0 0 414.06 0 0 0 2242.73 0 0 0 0 0 0 0 0 
0 0.02 0 0 184.866 0 0 0 0 0 0 0 0 0 0 0 0 -1159.63 0 0 0 -1574.68 0 0 0 0 0 -1006.27 1661.66 0 0 0 0 0 1728.34 0 0 0 0 0 0 0 2488.4 0 0 0 0 0 0 1762.06 0 0 0 0 0 1001.08 0 0 0 0 0 0 0 0 0 0 0 0 
0 0 0.04 0 0 827.128 0 0 0 0 0 0 0 -2014.91 0 1046.56 0 0 0 0 1961.65 0 0 0 0 0 -228.507 0 -985.672 2470.7 0 0 1528.75 0 2003.77 0 0 -1567.66 0 0 0 -1640.14 2115.62 0 0 0 0 0 0 0 0 0 0 0 0 0 0 0 0 0 0 0 298.547 319.147 0 0 0 0 
508.362 0 0 0.05 0 0 0 0 431.608 0 1443.75 0 0 0 0 0 0 0 0 0 0 1786.02 0 0 0 -2046.19 0 0 -925.398 0 0 0 -1082.87 0 661.718 1359.68 -1794.87 0 0 0 0 -436.338 1149.1 1743.29 0 0 0 122.456 -200.735 0 -1094.01 0 90.4111 0 0 0 0 0 0 0 -840.403 0 0 0 0 0 0 0 
0 636.54 0 0 0.08 0 0 0 0 0 1996.44 0 0 322.047 931.806 0 0 0 0 0 0 0 -1182.67 1668.83 0 0 0 0 0 0 0 -1554.54 0 2367.7 1689.43 0 0 0 -2016.28 0 1038.16 0 894.574 1158.25 0 0 0 0 0 0 0 0 0 0 0 0 0 0 0 0 0 0 0 0 524.537 0 0 0 
0 0 2174.37 0 0 0.02 0 974.227 348.292 0 0 0 -1208 2051.23 0 0 2042.07 0 2138.05 -2181.39 0 0 0 0 0 0 0 763.344 0 0 0 0 0 0 0 1987.14 0 1126.67 0 1865.21 -1115.68 0 89.1903 -733.131 0 0 -1577.88 0 0 0 0 0 0 0 0 0 0 0 0 0 0 0 0 0 0 -2066.48 0 0 
1911.6 0 0 0 0 0 0.04 0 0 0 0 0 0 2183.07 0 1177.94 0 0 0 0 0 0 0 0 0 472.198 332.423 0 0 0 0 0 1208.46 -546.205 0 0 0 31.3578 0 0 0 0 -2186.57 0 0 0 0 -2411.8 0 0 823.466 0 0 0 0 0 0 0 0 0 0 0 0 0 0 0 0 0 
0 0 0 0 0 2441.4 0 0 0 0 0 2304.99 -474.639 345.698 0 -1590.09 -998.642 0 702.765 1850.87 -2382.96 365.23 0 2453.46 0 0 0 0 -2217.7 0 -1818.52 0 0 2136.37 0 0 0 0 -959.731 1631.9 0 0 0 1415.52 0 0 0 0 0 0 0 0 0 784.097 0 0 0 0 160.298 0 0 0 0 0 0 0 0 0 
0 0 0 259.941 0 1175.5 0 0 0 0 0 1295.74 0 0 0 0 0 -1668.07 -1065.94 826.365 0 686.59 0 0 2391.2 1182.82 213.858 0 0 2288.35 987.045 0 0 0 363.399 86.9015 -302.82 -844.981 0 0 0 0 0 1891.31 -1373.1 0 0 2228.69 -654.393 -2014.91 0 0 0 0 -167.013 0 0 0 0 -729.164 0 0 0 0 1711.1 0 0 0 
0 0 0 0 0 0 0 0 0 0.02 0 2221.98 0 -1104.39 0 0 793.558 0 0 0 0 167.318 1921.37 0 0 0 -2245.78 -473.724 -384.304 0 672.857 0 0 0 0 1440.4 0 0 0 0 0 0 -934.248 0 0 0 0 0 0 0 0 2386.62 0 0 0 -249.413 0 0 0 -2447.97 0 0 0 0 0 0 -339.29 0 
0 0 0 1366.24 -350.124 0 0 0 0 0 0 0 1884.29 0 -1248.74 0 -359.89 1380.73 0 0 1516.24 0 0 0 -953.932 0 0 1486.48 0 0 0 0 0 0 0 1793.5 -1161.76 0 0 0 0 0 0 0 1041.37 0 0 0 0 0 0 0 0 0 0 0 0 0 0 1990.04 0 -905.713 0 0 0 0 -1668.98 1138.26 
0 0 0 0 0 0 0 1997.05 977.279 -1990.34 0 0.02 0 0 0 2127.22 0 0 -999.405 0 0 0 0 0 0 0 0 0 0 0 0 0 0 0 2499.69 0 0 0 0 0 -249.718 0 0 0 0 0 0 0 204.245 0 0 394.375 0 0 0 0 0 -346.767 0 0 0 0 0 0 0 0 0 0 
-787.912 0 0 0 0 -1516.54 0 -515.687 0 0 -9.84222 0 0.09 0 0 0 522.248 0 0 0 -1651.74 0 0 0 -79.4244 1436.43 0 0 0 2446.9 0 0 0 1596.35 0 -273.217 759.682 2274.77 0 0 0 -1696.6 0 0 0 0 0 0 0 0 0 0 0 0 0 0 1914.81 0 0 0 0 0 0 0 0 0 0 0 
-1516.24 0 434.66 0 998.947 2304.99 176.016 -293.817 0 -2441.25 0 0 0 0.07 -1669.29 0 0 0 0 2438.81 0 0 0 0 0 1801.13 0 419.706 1867.5 0 0 -153.279 0 691.321 1080.43 0 -2071.98 0 -1979.81 0 0 0 0 0 1900.01 0 -1433.84 0 0 0 0 0 0 0 0 0 -4.65407 0 -901.593 0 0 0 0 0 0 0 0 0 
0 0 0 0 1531.04 0 0 0 0 0 2157.28 0 0 -543.001 0.07 754.036 0 0 0 0 0 0 0 0 0 0 0 0 0 153.737 0 0 0 2344.97 0 0 1044.42 1547.36 2025.89 0 -1844.92 0 0 0 0 0 0 0 0 0 0 0 0 0 0 0 0 0 0 0 0 0 0 0 0 0 0 0 
1818.06 0 -564.364 0 0 0 1768.93 1159.63 0 0 0 2296.14 0 0 648.9 0.08 -2046.65 1930.22 0 0 0 0 0 -395.291 0 0 1658.91 1864.45 0 0 0 0 0 0 0 789.438 0 0 0 0 1716.28 0 -288.018 0 0 0 0 0 0 0 0 0 0 0 0 -175.863 0 0 0 0 0 0 0 -772.652 -1108.2 0 0 0 
1715.67 0 0 0 0 2138.05 0 -89.6481 0 -1365.02 -736.946 0 938.215 0 0 2246.39 0.05 1324.43 0 0 0 0 -2265.62 0 0 0 -763.802 0 0 0 0 0 0 0 -922.651 0 0 0 1753.06 0 -818.125 0 1404.54 1568.27 0 0 0 0 0 0 0 0 0 0 146.87 0 0 -1051.59 0 0 599.46 0 0 0 0 -1988.2 0 0 
1039.54 -288.934 0 0 0 0 0 0 269.707 0 1165.12 0 0 0 0 1885.51 -669.958 0.08 0 1514.86 0 0 0 741.829 0 0 0 0 0 0 0 -104.45 2393.64 0 0 0 1874.68 0 0 0 0 0 0 0 0 0 0 0 0 0 0 0 -1233.79 -349.971 0 0 -2428.13 0 0 0 -349.055 0 0 1838.21 0 0 0 0 
0 0 0 0 0 2453.15 0 922.193 -448.088 0 0 -1529.66 0 0 0 0 0 0 0.01 0 0 0 0 -1488.16 2119.59 0 1682.87 0 0 0 -2270.96 669.347 0 -880.993 -1012.83 0 838.267 0 0 0 0 0 -976.058 0 0 0 0 0 0 0 0 1082.11 0 0 0 2325.13 0 0 0 0 0 0 0 0 0 0 1465.73 0 
0 0 0 0 0 1247.37 0 234.764 851.238 0 0 0 0 1386.99 0 0 0 2356.11 0 0.02 0 2475.28 0 0 0 207.602 0 1384.24 0 0 -172.658 0 -1268.27 0 0 2490.39 0 0 -1189.08 0 0 677.74 0 0 0 0 0 0 0 0 0 0 0 0 0 0 1712.78 414.518 0 0 0 0 0 0 0 0 0 0 
0 0 857.799 0 0 0 0 -1463.29 0 0 1591.31 0 -2499.39 0 0 0 0 0 0 0 0.02 0 2297.36 0 0 -329.218 0 0 0 0 -2411.34 0 1611 0 -590.762 0 0 0 2083.42 0 0 0 1291.16 0 -809.122 0 0 1231.35 0 0 0 0 0 0 0 0 0 0 -442.747 0 0 0 0 0 0 0 0 0 
0 1134.3 0 1856.06 0 0 0 -349.055 1576.36 -276.269 0 0 0 0 0 0 0 0 0 1802.8 0 0.01 -1396.15 0 0 0 0 0 0 0 0 1648.38 0 0 0 0 0 0 0 1304.59 -189.291 0 2164.14 1401.33 0 0 2068.77 0 0 0 -435.27 0 0 0 0 0 0 0 0 0 0 1680.43 -2385.25 0 0 0 0 0 
2481.54 0 0 0 -210.196 0 0 0 0 710.242 0 0 0 0 0 0 769.601 0 0 0 2206.87 609.073 0.05 -702.765 348.903 0 0 -1402.55 0 0 0 0 0 0 0 0 0 629.368 0 -897.626 0 0 -2013.99 0 0 0 0 2287.13 0 1406.52 0 0 0 0 0 0 0 0 0 0 0 0 0 0 0 0 1854.84 0 
0 0 0 0 -1072.65 0 0 1717.66 0 0 0 0 0 0 0 2180.01 0 596.713 -430.845 0 0 0 -921.583 0 0 2474.36 0 0 0 0 0 0 1294.37 0 0 -931.196 1756.57 2390.29 0 0 1064.56 0 1104.08 0 0 0 0 0 0 0 2222.74 0 0 0 0 0 0 0 0 0 0 0 0 0 0 0 0 0 
0 0 0 0 0 0 0 0 -1204.18 0 -34.4096 0 1489.07 0 0 0 0 0 1394.16 0 0 0 2316.58 0 0.01 0 0 0 0 -1262.17 0 0 0 189.138 1234.24 0 0 0 0 2248.68 0 0 2376.25 1257.29 0 0 0 0 0 0 0 0 0 0 0 0 0 0 0 0 0 0 0 0 0 0 0 -2431.18 
766.243 0 0 1634.19 0 0 2461.85 0 -604.953 0 0 0 -1154.74 -2037.34 0 0 0 0 0 1899.7 111.164 0 0 1024.43 0 0.06 0 1135.36 0 0 0 0 0 2038.26 0 0 0 0 0 0 367.367 0 0 1132.77 0 0 -2477.11 0 -914.411 -589.999 0 0 0 0 0 0 0 0 1257.74 0 0 0 0 0 0 0 1481.6 -2328.79 
2418.21 0 912.885 0 0 0 722.602 0 -366.909 993.149 0 0 0 0 0 -2035.05 462.127 0 979.415 0 0 0 0 0 0 0 0.08 -837.199 0 0 0 0 0 0 -1841.72 0 1743.75 0 1592.68 0 0 0 0 0 0 0 0 0 -743.66 0 0 0 0 2304.99 -173.116 0 0 0 0 0 0 0 0 0 -2402.95 0 0 -1975.39 
0 1923.81 0 0 0 536.897 0 0 0 -143.666 928.144 0 0 286.187 0 -1069.44 0 0 0 2383.88 0 0 -916.547 0 0 332.881 -2040.85 0.03 -543.153 0 0 0 -1373.71 0 0 0 1225.85 0 0 -776.925 0 0 0 2387.69 0 2181.23 -1065.17 0 0 0 783.944 2222.89 0 0 0 0 0 0 0 0 0 0 0 -2147.21 0 0 0 0 
0 1895.43 1131.09 -2112.42 0 0 0 1020.92 0 1356.01 0 0 0 -842.082 0 0 0 0 0 0 0 0 0 0 0 0 0 -1304.13 0.08 1840.65 0 1324.27 0 0 0 0 0 0 0 0 0 2400.51 0 0 0 0 0 0 0 0 0 -527.436 0 0 0 0 0 0 0 0 0 0 0 0 0 0 0 0 
0 0 1940.14 0 0 0 0 0 1359.83 0 0 0 -2383.72 0 -2351.68 0 0 0 0 0 0 0 0 0 1380.12 0 0 0 -1506.78 0.06 1390.19 0 -1063.95 0 -450.835 -630.894 0 0 0 0 1072.8 0 0 1764.96 0 0 0 2176.2 0 0 0 0 0 0 2350 0 0 0 0 0 0 0 0 0 0 0 0 0 
0 0 0 0 0 0 0 -223.319 2353.51 449.919 0 0 0 0 0 0 0 0 -2129.05 606.021 1841.41 0 0 0 0 0 0 0 0 -143.513 0.02 0 880.23 -1216.24 0 0 -907.849 0 1100.12 0 -1058.46 0 0 0 1461.15 0 0 0 0 0 0 -1446.35 0 0 0 0 0 0 0 0 0 0 0 0 0 0 0 0 
-1732.76 0 0 0 -496.002 0 0 0 0 0 0 0 0 -1301.39 0 0 0 2373.81 2128.59 0 0 1765.11 0 0 0 0 0 0 2141.87 0 0 0.01 0 -144.276 0 0 0 0 0 0 0 0 0 0 0 0 0 0 0 1767.86 658.666 0 0 0 0 0 2284.84 0 0 0 0 0 0 0 0 0 0 0 
0 0 470.367 -19.1504 0 0 1035.42 0 0 0 0 0 0 0 0 0 0 -146.413 0 1517.46 -923.414 0 0 -263.756 0 0 0 -1690.5 0 2161.55 1064.56 0 0.03 0 0 0 0 0 668.584 0 0 0 0 -282.983 0 -571.383 0 0 0 0 0 0 0 0 0 0 0 685.675 0 0 0 0 0 0 0 0 0 0 
1900.62 0 0 0 1851.02 0 2358.55 1425.14 0 0 0 0 332.27 1255.91 1918.47 0 0 0 -1065.02 0 0 0 0 0 288.934 82.3237 0 0 0 0 -1412.63 -357.295 0 0.09 0 2170.71 0 0 623.722 0 0 0 1804.03 0 1891.16 0 0 0 0 0 0 0 0 -69.6585 0 0 0 0 0 0 0 0 0 1085.77 0 0 0 -1009.63 
-1187.7 2297.51 -1095.69 -2038.41 1043.66 0 0 0 1007.8 0 0 1909.16 0 925.398 0 0 -1291.92 0 2232.81 0 1602.45 0 0 0 -680.792 0 1761.6 0 0 -1382.26 0 0 0 0 0.08 0 0 0 -1720.25 0 0 0 0 0 0 1007.64 0 0 0 0 0 0 0 0 0 0 0 0 0 1543.86 0 0 0 0 0 -2404.02 0 0 
0 0 0 -1401.64 0 -1889.02 0 0 1347.77 1277.73 -487.457 0 2243.95 0 0 1062.58 0 0 0 625.858 0 0 0 2339.78 0 0 0 0 0 1326.56 0 0 0 -444.578 0 0.09 -603.732 0 1117.51 0 0 1974.78 0 0 -571.993 0 0 0 0 0 0 0 0 0 0 0 0 0 0 0 0 0 0 0 0 0 0 0 
0 0 0 -1617.86 0 0 0 0 -1083.03 0 -648.442 0 2226.1 -2065.72 1763.13 0 0 1555.15 1966.99 0 0 0 0 -133.442 0 0 679.571 -743.965 0 0 2234.79 0 0 0 0 -485.321 0.07 -1105.91 0 0 -560.244 0 0 0 -316.401 0 0 0 0 0 0 0 0 0 0 0 0 0 0 0 0 0 0 0 0 0 0 0 
0 0 1469.54 0 0 2063.89 601.749 0 1273.61 0 0 0 1420.26 0 170.522 0 0 0 0 0 0 0 -372.555 2404.78 0 0 0 0 0 0 0 0 0 0 0 0 -357.753 0.03 0 0 -1708.66 0 -2233.27 0 -1600.31 0 0 -870.617 0 0 0 0 0 0 0 0 0 0 540.864 0 1344.11 0 -190.97 0 0 0 0 0 
0 0 0 0 1927.63 0 0 -514.771 0 0 0 0 0 112.232 1531.95 0 1176.11 0 0 -223.167 -2380.83 0 0 0 0 0 576.724 0 0 0 -753.426 0 383.999 222.709 -1100.27 -743.965 0 0 0.09 0 1019.55 2056.72 0 0 0 0 0 0 0 0 0 0 0 0 0 0 0 0 0 0 0 0 0 -179.373 0 0 0 0 
-1316.8 0 0 0 0 945.387 0 -534.761 0 0 0 0 0 0 0 0 0 0 0 0 0 500.275 1215.78 0 1942.43 0 0 -952.254 0 0 0 0 0 0 0 0 0 0 0 0.02 -1161.76 1585.51 1087.91 0 0 0 0 0 0 0 0 0 0 0 0 1029.16 469.604 0 0 -1757.33 0 0 0 0 0 0 0 0 
0 0 0 0 944.777 1937.09 0 0 0 0 0 -560.244 0 0 372.402 2473.75 1332.06 0 0 0 0 2045.27 0 998.947 0 -1817.76 0 0 0 2110.13 -667.211 0 0 0 0 0 952.101 862.072 -2393.8 107.044 0 -2382.2 0 0 0 0 0 0 0 0 0 0 -1317.26 0 0 0 0 -2309.56 0 0 0 0 -102.313 0 0 2358.55 0 0 
0 0 -1335.11 -1422.54 0 0 0 0 0 0 0 0 -293.664 0 0 0 0 0 0 -1294.67 0 0 0 0 0 0 0 0 2278.28 0 0 0 0 0 0 2421.26 0 0 1769.84 -2448.42 2362.51 0.01 1733.38 1319.09 0 0 0 0 0 0 0 0 0 -2368.77 0 0 0 0 0 0 0 0 1065.48 0 0 0 0 0 
0 1511.81 -217.521 -1800.67 2207.94 1138.26 2251.58 0 0 -2450.71 0 0 0 0 0 1169.85 -879.62 0 2157.73 0 -296.258 782.418 519.654 2055.5 1560.95 0 0 0 0 0 0 0 0 -2276.15 0 0 0 -456.023 0 -79.8822 0 1888.1 0.07 0 1876.81 0 0 0 0 0 0 0 2108.14 0 0 0 0 0 0 0 2349.85 0 0 0 0 0 0 0 
162.13 0 0 1789.99 2433.47 -276.574 0 525.452 2029.1 0 0 0 0 0 0 0 598.086 0 0 0 0 -287.866 0 0 2472.38 -2480.32 0 -1059.53 0 1373.56 0 0 1767.56 0 0 0 0 0 0 0 0 1758.86 0 0.07 0 2188.25 0 0 0 0 0 0 0 0 0 0 0 0 0 0 0 1141.47 0 0 -1797.31 0 0 0 
-1200.83 0 0 0 0 0 0 0 1301.39 0 1633.12 0 0 -1725.59 0 0 0 0 0 0 1850.11 0 0 0 0 0 0 0 0 0 704.596 0 0 306.33 0 -98.6511 1721.02 1793.8 0 0 0 0 -2395.17 0 0.09 0 0 0 0 0 0 0 0 332.27 0 0 0 0 0 0 2486.42 -207.602 0 0 0 0 0 0 
0 0 0 0 0 0 0 0 0 0 0 0 0 0 0 0 0 0 0 0 0 0 0 0 0 0 0 2175.59 0 0 0 0 -349.971 0 2374.42 0 0 0 0 0 0 0 0 -992.996 0 0.07 0 -140.004 0 0 0 0 0 0 0 0 0 0 0 0 0 0 0 1593.6 0 0 0 0 
137.257 0 0 0 0 -1587.19 0 0 0 0 0 0 0 843.913 0 0 0 0 0 0 0 2197.26 0 0 0 953.017 0 249.718 0 0 0 0 0 0 0 0 0 0 0 0 0 0 0 0 0 0 0.06 0 0 0 0 0 0 0 0 0 0 0 0 0 0 0 0 -102.313 0 0 0 0 
0 0 0 1203.42 0 0 888.012 0 -443.205 0 0 0 0 0 0 0 0 0 0 0 1225.39 0 671.026 0 0 0 0 0 0 -317.164 0 0 0 0 0 0 0 2009.87 0 0 0 0 0 0 0 -2436.67 0 0 0 0 0 40.6659 0 0 0 0 -2115.77 0 2017.35 0 0 0 0 0 649.51 879.467 0 0 
0 0 0 1457.34 0 0 0 0 -2380.21 0 0 1950.82 0 0 0 0 0 0 0 0 0 0 0 0 0 1789.53 -426.267 0 0 0 0 0 0 0 0 0 0 0 0 0 0 0 0 0 0 0 0 0 0.08 0 1862.47 0 0 0 0 0 0 0 0 0 0 2129.05 0 0 0 0 0 0 
0 -1834.24 0 0 0 0 0 0 1398.89 0 0 0 0 0 0 0 0 0 0 0 0 0 -123.829 0 0 2384.33 0 0 0 0 0 1551.94 0 0 0 0 0 0 0 0 0 0 0 0 0 0 0 0 0 0.05 0 0 0 0 -388.577 0 0 0 0 -1045.03 0 0 0 0 0 0 -2221.82 0 
0 0 0 1871.32 0 0 2048.63 0 0 0 0 0 0 0 0 0 0 0 0 0 0 -2444.76 0 1791.82 0 0 0 2016.13 0 0 0 1889.48 0 0 0 0 0 0 0 0 0 0 0 0 0 0 0 0 -1778.7 0 0.06 0 0 0 0 0 0 0 0 576.113 -1425.75 0 0 0 0 0 0 0 
0 0 0 0 0 0 0 0 0 1312.22 0 1383.18 0 0 0 0 0 0 1429.72 0 0 0 0 0 0 0 0 -1957.84 1166.19 0 399.258 0 0 0 0 0 0 0 0 0 0 0 0 0 0 0 0 1298.18 0 0 0 0.02 0 0 0 0 2032.61 0 0 0 0 703.223 0 0 0 0 0 0 
0 0 0 688.116 0 0 0 0 0 0 0 0 0 0 0 0 0 2328.79 0 0 0 0 0 0 0 0 0 0 0 0 0 0 0 0 0 0 0 0 0 0 1288.57 0 501.953 0 0 0 0 0 0 0 0 0 0.03 0 0 0 0 0 0 0 0 0 0 0 0 0 0 0 
0 0 0 0 0 0 0 1446.5 0 0 0 0 0 0 0 0 0 1343.96 0 0 0 0 0 0 0 0 -2427.98 0 0 0 0 0 0 2457.58 0 0 0 0 0 0 0 2445.68 0 0 744.118 0 0 0 0 0 0 0 0 0 0 0 -907.392 0 0 -2262.11 0 0 0 0 0 0 0 0 
0 0 0 0 0 0 0 0 2064.5 0 0 0 0 0 0 0 -407.498 0 0 0 0 0 0 0 0 0 622.501 0 0 -1321.83 0 0 0 0 0 0 0 0 0 0 0 0 0 0 0 0 0 0 0 1218.53 0 0 0 0 0.04 -1363.95 -259.941 0 0 0 0 0 0 0 0 0 0 0 
2284.69 985.977 0 0 0 0 0 0 0 971.023 0 0 0 0 0 2142.63 0 0 1806.47 0 0 0 0 0 0 0 0 0 0 0 0 0 0 0 0 0 0 0 0 2087.08 0 0 0 0 0 0 0 0 0 0 0 0 0 0 -773.873 0.09 0 0 0 0 0 0 0 0 0 2029.25 0 0 
0 0 0 0 0 0 0 0 0 0 0 0 -1378.75 980.789 0 0 0 -646.916 0 -535.066 0 0 0 0 0 0 0 0 0 0 0 1489.23 0 0 0 0 0 0 0 -2144 0 0 0 0 0 0 0 11.9785 0 0 0 1527.22 0 354.549 745.949 0 0.04 1791.67 0 0 0 0 0 553.835 0 0 0 -1103.47 
0 0 0 0 0 0 0 0 0 0 0 -413.144 0 0 0 0 -127.186 0 0 655.766 0 0 0 0 0 0 0 0 0 0 0 0 2384.95 0 0 0 0 0 0 0 1784.8 0 0 0 0 0 0 0 0 0 0 0 0 0 0 0 -2210.84 0.09 0 0 0 0 0 0 0 0 0 0 
0 0 0 0 0 0 0 1008.56 0 0 0 0 0 -2396.85 0 0 0 0 0 0 1408.96 0 0 0 0 1548.43 0 0 0 0 0 0 0 0 0 0 0 383.236 0 0 0 0 0 0 0 0 0 2441.86 0 0 0 0 0 0 0 0 0 0 0.01 0 0 0 0 0 0 0 0 0 
138.173 0 0 0 0 0 0 0 1680.73 1286.89 -1.75481 0 0 0 0 0 0 0 0 0 0 0 0 0 0 0 0 0 0 0 0 0 0 0 -2418.36 0 0 0 0 625.553 0 0 0 0 0 0 0 0 0 2098.83 293.207 0 0 678.808 0 0 0 0 0 0.08 0 0 -2379.15 0 0 0 0 0 
0 0 0 2320.4 0 0 0 0 0 0 0 0 0 0 0 0 244.682 1719.18 0 0 0 0 0 0 0 0 0 0 0 0 0 0 0 0 0 0 0 -1879.41 0 0 0 0 723.212 0 -440.458 0 0 0 0 0 1887.8 0 0 0 0 0 0 0 0 0 0.06 0 0 1943.65 0 0 0 0 
0 0 0 0 0 0 0 0 0 0 1199 0 0 0 0 0 0 0 0 0 0 1529.51 0 0 0 0 0 0 0 0 0 0 0 0 0 0 0 0 0 0 0 0 0 260.552 1840.8 0 0 0 -1335.57 0 0 -1073.41 0 0 0 0 0 0 0 0 0 0.06 0 0 0 -1278.65 0 0 
0 0 -1467.86 0 0 0 0 0 0 0 0 0 0 0 0 0 0 0 0 0 0 1185.57 0 0 0 0 0 0 0 0 0 0 0 0 0 0 0 1813.64 0 0 305.567 835.826 0 0 0 0 0 0 0 0 0 0 0 0 0 0 0 0 0 -1177.02 0 0 0.04 0 0 0 0 0 
0 0 2197.26 0 0 0 0 0 0 0 0 0 0 0 0 -1587.5 0 2238.3 0 0 0 0 0 0 0 0 0 -1467.1 0 0 0 0 0 -1396.76 0 0 0 0 1177.02 0 0 0 0 0 0 -265.435 2381.74 0 0 0 0 0 0 0 0 0 1583.99 0 0 0 -298.547 0 0 0 0 0 0 0 
0 0 0 0 -2351.53 0 0 0 4.80667 0 0 0 0 0 0 1256.37 0 0 0 0 0 0 0 0 0 0 -843.303 0 0 0 0 0 0 0 0 0 0 0 0 0 0 0 0 2346.95 0 0 0 1951.12 0 0 0 0 0 0 0 0 0 0 0 0 0 0 0 0 0.07 0 0 0 
0 0 0 0 0 -2229.76 0 0 0 0 0 0 0 0 0 0 1256.22 0 0 0 0 0 0 0 0 0 0 0 0 0 0 0 0 0 -375.301 0 0 0 0 0 -1870.56 0 0 0 0 0 0 1905.35 0 0 0 0 0 0 0 2042.99 0 0 0 0 0 433.287 0 0 0 0.04 0 0 
0 0 0 0 0 0 0 0 0 1073.72 1873.3 0 0 0 0 0 0 0 -338.679 0 0 0 2221.21 0 0 1621.37 0 0 0 0 0 0 0 0 0 0 0 0 0 0 0 0 0 0 0 0 0 0 0 1727.27 0 0 0 0 0 0 0 0 0 0 0 0 0 0 0 0 0.07 0 
0 0 0 0 0 0 0 0 0 0 244.682 0 0 0 0 0 0 0 0 0 0 0 0 0 84.3074 2337.49 -1700.72 0 0 0 0 0 0 1132.31 0 0 0 0 0 0 0 0 0 0 0 0 0 0 0 0 0 0 0 0 0 0 -643.101 0 0 0 0 0 0 0 0 0 0 0.06 
