*Vertices 38
*Matrix 
0.02 0 0 0 0 345.698 0 422.605 0 0 0 0 0 0 0 0 0 0 0 0 0 0 -215.232 0 0 0 0 0 0 0 0 0 0 1591.62 0 -1348.99 0 0 
0 0.01 0 0 0 0 0 0 0 0 0 0 0 1743.29 0 0 1740.7 0 0 0 0 0 0 0 0 0 0 0 0 0 0 0 0 0 0 0 0 0 
0 0 0.01 0 0 0 0 0 0 0 0 0 0 0 0 0 0 0 0 1818.52 0 0 0 0 0 0 0 0 0 0 0 0 0 0 0 0 0 0 
0 0 0 0.02 0 -1069.9 0 0 -368.892 0 -1361.66 0 0 0 0 1643.65 -378.811 0 0 0 851.39 0 0 0 246.818 0 1356.93 0 0 0 0 0 0 0 0 -1501.89 0 0 
0 0 0 0 0 0 928.297 0 0 0 0 0 0 0 0 0 0 0 0 0 0 0 0 0 0 288.018 0 0 0 0 0 0 -552.461 0 0 0 0 0 
-64.6229 0 0 1260.03 0 0 0 1146.66 0 0 0 1491.06 0 0 0 0 0 0 0 773.721 0 0 0 0 0 0 0 0 524.689 0 2171.01 0 0 0 0 653.935 0 0 
0 0 0 0 -810.648 0 0.01 1088.21 0 0 0 0 0 1021.23 1573.92 1415.98 -91.3266 0 0 0 0 -487.762 0 0 0 0 0 0 0 0 0 0 0 0 0 0 0 0 
-539.033 0 0 0 0 -1725.29 1361.2 0.07 0 0 0 968.734 0 0 0 0 0 0 0 0 0 -1402.55 2109.36 0 858.257 0 0 0 -879.467 0 0 0 0 0 0 0 0 0 
0 0 0 -76.22 0 0 0 0 0.07 0 0 1223.72 0 0 0 0 0 1498.08 0 0 -1514.56 0 0 0 0 0 0 0 0 0 0 0 0 0 0 0 2260.73 0 
0 0 0 0 0 0 0 0 0 0.09 0 0 0 0 0 351.039 0 0 0 0 0 1092.18 0 0 0 0 0 0 0 0 0 0 273.217 0 0 0 0 0 
0 0 0 100.787 0 0 0 0 0 0 0.09 0 0 0 -1833.02 0 0 -722.449 0 0 0 0 0 0 0 0 0 0 0 0 1473.51 1649.91 0 0 0 0 0 0 
0 0 0 0 0 -1291.47 0 165.792 1953.41 0 0 0 0 0 0 2024.98 0 0 719.855 0 0 0 0 0 0 0 0 0 0 0 0 0 0 0 0 0 0 0 
0 0 0 0 0 0 0 0 0 0 0 0 0.06 0 0 0 0 597.781 0 836.741 0 0 0 -2049.09 0 0 0 0 0 0 0 0 -1636.02 0 1258.05 1508.61 0 0 
0 1038.93 0 0 0 0 402.768 0 0 0 0 0 0 0.04 0 0 0 0 0 0 0 0 0 0 0 0 0 0 0 0 0 0 0 0 0 0 0 0 
0 0 0 0 0 0 1732 0 0 0 2298.27 0 0 0 0.01 0 0 0 0 0 0 0 0 0 0 0 -1221.12 1192.43 0 0 0 0 347.377 1884.75 0 0 0 0 
0 0 0 981.246 0 0 -1129.41 0 0 396.97 0 1902.3 0 0 0 0.02 0 1411.56 989.792 0 0 225.303 0 0 0 0 0 0 0 0 0 0 0 449.156 0 0 0 0 
0 -1274.99 0 73.1681 0 0 -1750.47 0 0 0 0 0 0 0 0 0 0.01 2223.5 0 0 0 0 0 0 0 0 0 0 2209.31 0 0 1627.93 0 0 0 0 0 0 
0 0 0 0 0 0 0 0 1801.28 0 -1806.01 0 -164.724 0 0 2169.48 1692.79 0.08 0 1245.99 0 0 0 0 0 0 0 -385.678 0 0 0 0 0 1238.52 0 0 0 0 
0 0 0 0 0 0 0 0 0 0 0 821.177 0 0 0 -852.153 0 0 0.05 0 0 0 0 0 0 1048.84 0 0 1519.59 0 0 0 0 0 0 0 0 0 
0 0 756.172 0 0 30.5948 0 0 0 0 0 0 1372.95 0 0 0 0 1060.9 0 0.03 0 0 179.525 0 0 0 0 0 0 29.6793 0 -1170.61 0 0 0 0 0 0 
0 0 0 1848.12 0 0 0 0 2482.91 0 0 0 0 0 0 0 0 0 0 0 0.01 0 1692.79 0 1343.81 0 0 0 -1019.55 0 0 0 0 0 0 0 0 0 
0 0 0 0 0 0 605.716 916.089 0 1592.84 0 0 0 0 0 400.632 0 0 0 0 0 0.07 641.27 0 1301.69 0 0 0 0 0 0 0 0 0 0 0 0 0 
415.128 0 0 0 0 0 0 1780.83 0 0 0 0 0 0 0 0 0 0 0 1733.38 1094.32 -1312.83 0.02 0 0 0 0 0 0 0 0 0 0 0 0 0 0 -246.208 
0 0 0 0 0 0 0 0 0 0 0 0 -1290.09 0 0 0 0 0 0 0 0 0 0 0.07 0 0 0 0 1403.01 0 2453.76 0 0 0 0 -2474.36 0 0 
0 0 0 786.386 0 0 0 2389.22 0 0 0 0 0 0 0 0 0 0 0 0 1948.23 -2228.23 0 0 0.03 0 0 0 0 0 0 0 0 0 0 -565.584 0 0 
0 0 0 0 1702.55 0 0 0 0 0 0 0 0 0 0 0 0 0 -1226.62 0 0 0 0 0 0 0.08 0 0 0 0 0 0 0 0 0 0 0 0 
0 0 0 917.463 0 0 0 0 0 0 0 0 0 0 1321.68 0 0 0 0 0 0 0 0 0 0 0 0.06 0 0 1376.31 0 0 0 0 0 0 0 0 
0 0 0 0 0 0 0 0 0 0 0 0 0 0 1780.68 0 0 996.658 0 0 0 0 0 0 0 0 0 0.06 0 0 0 0 0 0 0 0 0 0 
0 0 0 0 0 642.033 0 1146.81 0 0 0 0 0 0 0 0 -375.607 0 -698.798 0 1289.64 0 0 -1085.62 0 0 0 0 0 0 2450.41 0 0 0 0 0 0 0 
0 0 0 0 0 0 0 0 0 0 0 0 0 0 0 0 0 0 0 2071.52 0 0 0 0 0 0 2005.6 0 0 0.06 0 0 0 0 -286.95 0 0 0 
0 0 0 0 0 -636.387 0 0 0 0 1019.7 0 0 0 0 0 0 0 0 0 0 0 0 2374.72 0 0 0 0 -555.666 0 0.08 0 1126.06 1509.06 0 969.955 0 0 
0 0 0 0 0 0 0 0 0 0 151.296 0 0 0 0 0 991.165 0 0 1571.32 0 0 0 0 0 0 0 0 0 0 0 0.04 0 0 0 2091.66 0 0 
0 0 0 0 1342.28 0 0 0 0 -434.965 0 0 -1887.65 0 1229.51 0 0 0 0 0 0 0 0 0 0 0 0 0 0 0 -1518.68 0 0.02 1367.76 1180.23 0 0 0 
66.4541 0 0 0 0 0 0 0 0 0 0 0 0 0 2448.42 -1637.55 0 2381.89 0 0 0 0 0 0 0 0 0 0 0 0 1418.12 0 -1130.63 0.05 0 0 0 0 
0 0 0 0 0 0 0 0 0 0 0 0 1094.32 0 0 0 0 0 0 0 0 0 0 0 0 0 0 0 0 -1737.49 0 0 1770.15 0 0.06 0 0 0 
-1339.53 0 0 -1630.68 0 2104.02 0 0 0 0 0 0 927.381 0 0 0 0 0 0 0 0 0 0 2436.67 -2078.39 0 0 0 0 0 1746.35 1660.89 0 0 0 0.06 0 0 
0 0 0 0 0 0 0 0 1352.2 0 0 0 0 0 0 0 0 0 0 0 0 0 0 0 0 0 0 0 0 0 0 0 0 0 0 0 0.04 0 
0 0 0 0 0 0 0 0 0 0 0 0 0 0 0 0 0 0 0 0 0 0 438.322 0 0 0 0 0 0 0 0 0 0 0 0 0 0 0.06 
