*Vertices 51
*Matrix 
0.05 0 2042.38 0 0 0 0 0 0 0 2198.93 0 0 0 0 0 0 0 0 0 0 0 0 0 0 0 0 0 664.617 0 0 0 0 0 0 0 0 0 0 0 0 0 331.66 0 0 0 0 0 0 0 0 
0 0.02 0 0 0 2194.97 0 0 0 0 0 -1623.66 0 0 0 1081.8 0 0 0 0 0 -2209.92 0 0 0 0 0 -142.598 -1800.06 0 0 0 0 0 0 0 0 0 0 0 0 0 0 2412.26 0 0 0 0 0 0 0 
-473.266 0 0.04 0 0 0 0 0 0 0 0 0 0 0 0 0 0 0 1054.95 0 -2209.16 0 0 1572.54 0 0 0 0 0 1613.9 0 1643.04 0 0 0 1870.56 0 0 0 0 0 0 0 0 0 0 0 0 0 0 0 
0 0 0 0.02 0 0 0 2414.24 1224.02 0 0 0 -1208.91 0 0 0 0 0 0 0 0 -2031.69 0 0 -54.3992 0 0 0 0 427.335 0 0 0 0 0 0 0 0 0 0 0 0 -2367.85 2227.01 0 1128.65 -1422.09 0 0 0 0 
0 0 0 0 0.06 0 0 0 0 0 0 0 0 0 -610.904 1525.54 0 0 0 0 0 0 0 -2185.81 0 0 0 0 1701.79 0 0 0 0 0 262.688 0 2115.92 -163.198 0 0 0 0 0 0 0 926.008 0 0 0 0 0 
0 -706.275 0 0 0 0.01 0 0 1738.56 0 0 -1495.79 0 0 0 1092.03 0 0 0 0 0 2069.38 0 0 1401.94 0 0 1360.29 0 0 1230.74 0 0 0 0 -526.521 0 0 0 0 986.74 0 0 0 -895.337 0 0 -808.054 0 0 0 
0 0 0 0 0 0 0.04 0 -1262.93 0 0 2289.57 0 0 0 0 1344.57 1765.88 0 0 0 0 0 0 -927.229 0 0 0 -674.078 0 0 0 0 0 0 0 1973.86 0 0 0 173.116 0 0 0 -59.8926 0 0 0 0 2061.45 0 
0 0 0 -1528.6 0 0 0 0.04 0 -394.223 0 0 0 0 0 0 0 0 0 557.955 0 398.495 0 0 0 0 0 0 0 1930.68 0 1906.72 0 0 0 0 0 0 0 0 0 0 -926.466 0 0 0 0 0 0 0 0 
0 0 0 -362.178 0 505.463 -1175.95 0 0.01 0 0 2422.79 0 0 0 0 0 0 0 0 0 0 0 0 1213.03 898.999 0 0 0 0 0 0 0 0 0 0 0 0 -851.543 0 0 0 -996.2 1111.87 1735.66 0 0 0 0 0 0 
0 0 0 0 0 0 0 1503.27 0 0.09 0 0 0 0 0 0 0 -2090.75 0 0 0 0 0 0 0 0 0 0 0 0 0 2454.07 1513.03 0 0 -366.909 0 0 0 0 0 0 0 0 0 0 1755.65 0 0 0 0 
-527.894 0 0 0 0 0 0 0 0 0 0.05 0 0 1752.91 0 -378.964 0 0 -581.607 0 0 0 0 0 0 0 0 0 0 2116.38 0 2469.63 0 1298.33 0 -656.987 -450.987 0 0 0 0 0 0 0 0 0 0 0 0 0 0 
0 -239.341 0 0 0 -1678.59 329.066 0 1517.15 0 0 0.01 0 0 0 0 499.969 0 0 0 0 0 650.578 1463.29 0 0 0 0 0 0 0 0 0 0 0 0 0 1560.64 0 0 -1629 0 0 0 0 0 -174.032 0 0 940.962 0 
0 0 0 587.863 0 0 0 0 0 0 0 0 0.02 0 0 0 0 0 0 0 0 0 0 0 0 0 0 0 0 0 0 0 0 0 0 0 0 0 -392.85 0 0 0 0 0 0 0 0 0 1371.58 0 0 
0 0 0 0 0 0 0 0 0 0 -1345.64 0 0 0.03 0 0 0 0 0 1836.22 0 0 0 0 0 -921.583 0 0 0 -2352.44 1048.69 2215.72 0 0 -937.452 0 0 0 0 2139.42 0 1697.21 31.9681 0 0 0 0 0 0 0 0 
0 0 0 0 -1174.58 0 0 0 0 0 0 0 0 0 0.03 0 0 0 0 0 0 0 0 0 0 0 0 -1218.07 0 0 0 2167.04 0 -1722.24 0 0 0 0 0 1659.83 0 0 0 2369.99 0 0 0 0 0 0 0 
0 292.291 0 0 1662.11 640.965 0 0 0 0 2237.54 0 0 0 0 0.08 1778.7 0 0 0 0 0 0 0 0 0 0 0 2412.26 0 0 0 0 0 292.138 -2200.16 0 0 0 0 0 0 0 0 0 0 0 0 0 0 0 
0 0 0 0 0 0 -2213.43 0 0 0 0 -561.769 0 0 0 -1302.61 0.08 704.749 0 0 0 0 1745.58 2279.5 0 0 0 0 0 0 0 0 0 -1078.75 0 0 0 0 0 2144.46 0 0 2002.55 0 0 0 0 0 0 2441.4 0 
0 0 0 0 0 0 1601.69 0 0 1011.92 0 0 0 0 0 0 1993.39 0.06 0 0 0 0 0 0 0 0 0 0 0 753.578 0 0 -1474.12 0 2490.39 0 0 1306.27 0 0 0 0 0 0 0 0 1226.16 0 0 0 0 
0 0 604.648 0 0 0 0 0 0 0 130.085 0 0 0 0 0 0 0 0.04 0 0 0 0 0 0 0 0 1031.91 0 0 0 0 -1706.06 1380.28 0 0 0 0 0 0 0 0 0 0 0 0 0 0 0 0 0 
0 0 0 0 0 0 0 2413.48 0 0 0 0 0 1771.22 0 0 0 0 0 0.09 0 0 0 -1663.49 2399.59 0 0 0 0 0 0 -2059.16 0 0 1992.02 0 0 0 0 0 0 0 0 0 0 0 0 0 0 0 0 
0 0 -1481.14 0 0 0 0 0 0 0 0 0 0 0 0 0 0 0 0 0 0.09 0 0 0 613.651 0 0 0 0 0 0 0 0 0 0 0 0 -310.297 0 0 1957.69 0 0 0 1785.41 0 0 23.423 0 -1357.08 0 
0 2193.9 0 -1378.6 0 2210.53 0 815.378 0 0 0 0 0 0 0 0 0 0 0 0 0 0.02 0 0 0 0 0 -960.952 0 0 0 0 0 0 0 1272.39 0 0 0 904.34 0 0 0 606.021 0 -2327.27 0 -814.463 0 0 0 
0 0 0 0 0 0 0 0 0 0 0 1221.12 0 0 0 0 2360.07 0 0 0 0 0 0.08 0 0 0 0 0 0 0 0 0 0 0 0 0 -837.046 0 0 0 0 2416.84 2219.08 0 0 0 0 0 0 0 0 
0 0 -1983.02 0 -266.655 0 0 0 0 0 0 -1422.54 0 0 0 0 1856.21 0 0 2386.62 0 0 0 0.07 0 0 0 0 0 529.572 0 0 0 -28.6111 0 0 0 0 -2339.93 0 377.132 0 0 375.759 0 0 0 0 0 1521.58 0 
0 0 0 253.227 0 53.3311 661.718 0 387.814 0 0 0 0 0 0 0 0 0 0 1845.84 582.217 0 0 0 0.07 0 0 2449.95 0 0 2092.58 0 0 0 0 0 0 0 0 0 0 -1388.97 0 0 0 0 0 0 0 0 0 
0 0 0 0 0 0 0 0 -1370.05 0 0 0 0 -1737.95 0 0 0 0 0 0 0 0 0 0 0 0.01 0 0 0 0 1895.58 0 0 0 0 0 494.629 0 0 0 0 0 0 378.048 2175.59 0 0 0 0 0 0 
0 0 0 0 0 0 0 0 0 0 0 0 0 0 0 0 0 0 0 0 0 0 0 0 0 0 0 0 -275.658 0 0 0 0 0 0 2303.16 1008.26 0 0 -667.669 0 256.127 0 0 0 0 0 0 0 0 0 
0 -947.066 0 0 0 1211.81 0 0 0 0 0 0 0 0 267.266 0 0 0 13.0467 0 0 1103.93 0 0 1481.9 0 0 0.04 0 0 0 0 0 0 0 311.518 -1142.23 0 959.731 0 0 0 0 1289.18 0 0 0 0 2274.93 0 0 
177.541 -1320 0 0 1899.09 0 -384.304 0 0 0 0 0 0 0 0 1522.8 0 0 0 0 0 0 0 0 0 0 2477.57 0 0.02 0 0 0 -1258.81 0 0 0 0 0 -2357.78 0 0 0 0 0 0 0 647.069 0 0 0 0 
0 0 834.147 -450.072 0 0 0 -780.74 0 0 80.7978 0 0 -1853.47 0 0 0 2460.33 0 0 0 0 0 1462.22 0 0 0 0 0 0.03 0 0 0 546.968 0 0 0 0 0 0 0 0 0 0 1471.98 -747.322 0 0 0 0 0 
0 0 0 0 0 -890.149 0 0 0 0 0 0 0 -975.143 0 0 0 0 0 0 0 0 0 0 894.726 -144.276 0 0 0 0 0.07 0 0 0 0 0 0 0 0 0 1048.69 658.055 577.639 0 0 -971.175 0 0 0 1330.23 0 
0 0 29.9844 0 0 0 0 2179.4 0 1499.15 2283.78 0 0 1795.79 -360.5 0 0 0 0 65.3859 0 0 0 0 0 0 0 0 0 0 0 0.08 0 0 0 0 0 0 0 0 0 0 0 0 0 0 0 0 1221.12 0 0 
0 0 0 0 0 0 0 0 0 1065.78 0 0 0 0 0 0 0 1691.11 -1712.32 0 0 0 0 0 0 0 0 0 -1496.4 0 0 0 0.04 0 0 0 0 0 2268.67 0 0 0 1086.99 0 0 0 0 0 0 0 0 
0 0 0 0 0 0 0 0 0 0 -1886.58 0 0 0 -723.975 0 480.285 0 -205.466 0 0 0 0 1477.94 0 0 0 0 0 2100.97 0 0 0 0.09 0 0 0 0 0 0 0 0 0 0 0 0 0 0 1561.25 0 0 
0 0 0 0 118.946 0 0 0 0 0 0 0 0 1915.27 0 536.439 0 2462 0 540.712 0 0 0 0 0 0 0 0 0 0 0 0 0 0 0.06 -1482.51 0 0 0 0 0 0 0 0 -183.34 0 0 0 0 0 0 
0 0 -1223.41 0 0 304.651 0 0 0 184.713 1694.31 0 0 0 0 2126.3 0 0 0 0 0 -1794.56 0 0 0 0 391.324 -911.206 0 0 0 0 0 0 2400.2 0.09 0 0 0 1607.33 0 0 0 0 0 0 0 0 0 0 0 
0 0 0 0 -543.611 0 -1568.73 0 0 0 -1424.68 0 0 0 0 0 0 0 0 0 0 0 1149.25 0 0 -1104.24 1191.82 2041.31 0 0 0 0 0 0 0 0 0.02 0 0 0 0 0 0 0 0 0 0 1630.83 0 0 0 
0 0 0 0 -1620 0 0 0 0 0 0 1697.67 0 0 0 0 0 -857.952 0 0 848.033 0 0 0 0 0 0 0 0 0 0 0 0 0 0 0 0 0.09 0 0 0 0 349.666 0 0 0 0 0 0 0 0 
0 0 0 0 0 0 0 0 156.178 0 0 0 -2429.65 0 0 0 0 0 0 0 0 0 0 1875.9 0 0 0 -1085.16 -472.045 0 0 0 1701.79 0 0 0 0 0 0.06 0 0 1299.86 0 0 0 1575.14 0 0 848.186 0 0 
0 0 0 0 0 0 0 0 0 0 0 0 0 512.635 814.768 0 -458.464 0 0 0 0 194.174 0 0 0 0 1681.19 0 0 0 0 0 0 0 0 -659.124 0 0 0 0.03 0 0 0 0 0 0 0 0 0 0 0 
0 0 0 0 0 1694.77 498.901 0 0 0 0 -1454.44 0 0 0 0 0 0 0 0 1888.1 0 0 1478.85 0 0 0 0 0 0 -1711.86 0 0 0 0 0 0 0 0 0 0.08 0 0 0 0 0 0 0 0 0 0 
0 0 0 0 0 0 0 0 0 0 0 0 0 503.021 0 0 0 0 0 0 0 0 993.301 0 411.313 0 -545.595 0 0 0 2024.22 0 0 0 0 0 0 0 474.334 0 0 0.04 1275.14 0 0 0 0 0 0 0 0 
1310.39 0 0 -291.223 0 0 0 232.627 -2451.32 0 0 0 0 -1551.33 0 0 1401.94 0 0 0 0 0 2153 0 0 0 0 0 0 0 1938.15 0 79.4244 0 0 0 0 1493.8 0 0 0 -1620 0.08 0 0 0 0 0 0 0 1526.61 
0 859.63 0 -97.8881 0 0 0 0 -564.516 0 0 0 0 0 -1031.14 0 0 0 0 0 0 1170.77 0 2020.71 0 -1156.73 0 -325.709 0 0 0 0 0 0 0 0 0 0 0 0 0 0 0 0.02 0 0 0 0 0 0 0 
0 0 0 0 0 1683.78 1481.75 0 258.263 0 0 0 0 0 0 0 0 0 0 0 137.715 0 0 0 0 1966.54 0 0 0 581.912 0 0 0 0 89.1903 0 0 0 0 0 0 0 0 0 0.01 0 397.58 0 0 0 0 
0 0 0 1054.19 1639.99 0 0 0 0 0 0 0 0 0 0 0 0 0 0 0 0 -1005.05 0 0 0 0 0 0 0 1828.9 1001.39 0 0 0 0 0 0 0 1253.62 0 0 0 0 0 0 0.05 0 0 0 0 0 
0 0 0 1842.94 0 0 0 0 0 -748.695 0 812.937 0 0 0 0 0 1663.49 0 0 0 0 0 0 0 0 0 0 -1098.28 0 0 0 0 0 0 0 0 0 0 0 0 0 0 0 1930.52 0 0.09 0 0 0 0 
0 0 0 0 0 2187.49 0 0 0 0 0 0 0 0 0 0 0 0 0 0 -1531.5 1954.02 0 0 0 0 0 0 0 0 0 0 0 0 0 0 -1344.11 0 0 0 0 0 0 0 0 0 0 0.08 0 0 0 
0 0 0 0 0 0 0 0 0 0 0 0 1127.89 0 0 0 0 0 0 0 0 0 0 0 0 0 0 260.704 0 0 0 375.454 0 -55.9252 0 0 0 0 1403.32 0 0 0 0 0 0 0 0 0 0.09 -2231.44 0 
0 0 0 0 0 0 331.202 0 0 0 0 2143.85 0 0 0 0 -1830.12 0 0 0 2494.35 0 0 705.512 0 0 0 0 0 0 2365.57 0 0 0 0 0 0 0 0 0 0 0 0 0 0 0 0 0 -1468.17 0.03 0 
0 0 0 0 0 0 0 0 0 0 0 0 0 0 0 0 0 0 0 0 0 0 0 0 0 0 0 0 0 0 0 0 0 0 0 0 0 0 0 0 0 0 1295.59 0 0 0 0 0 0 0 0.08 
