*Vertices 55
*Matrix 
0 -1874.68 0 0 0 0 0 0 0 0 0 323.878 0 0 0 0 0 0 0 0 -102.771 940.809 0 0 0 0 0 0 0 0 0 1963.33 0 1804.33 0 0 0 0 0 0 0 0 488.372 0 0 0 0 0 0 0 0 0 0 0 -427.946 
1682.26 0.03 0 0 310.602 5.41704 0 0 0 0 -630.589 0 0 0 0 0 0 0 1934.03 2495.57 2430.27 0 0 -1289.64 0 0 0 0 0 0 0 0 -1603.82 0 0 0 0 0 -921.583 0 0 0 2125.39 0 0 0 0 0 0 0 0 0 0 0 0 
0 0 0.03 0 0 0 0 0 0 0 0 0 0 0 0 0 0 0 0 0 0 0 0 0 0 0 0 1885.05 0 0 1881.39 0 0 0 0 0 0 0 0 0 0 0 0 1797.77 0 0 0 0 0 0 0 0 -1397.98 0 0 
0 0 0 0 0 0 0 0 0 0 0 -1256.07 0 2213.74 0 503.937 0 0 0 0 0 0 -317.469 0 0 0 0 0 0 0 1607.03 0 0 0 0 -698.492 0 0 1219.9 0 0 -1920.61 0 0 0 0 0 0 0 0 0 0 0 0 0 
0 739.082 0 0 0.09 0 0 0 0 0 0 0 0 0 0 0 0 0 0 0 0 0 0 -460.295 -514.618 0 0 0 1070.67 0 0 0 1665.93 0 0 0 0 0 846.202 0 0 0 0 0 0 0 0 0 0 0 0 0 0 0 0 
0 1619.08 0 0 0 0.05 0 0 0 0 0 0 0 0 0 2266.08 0 0 0 0 0 0 0 0 0 0 1142.54 0 0 0 0 0 0 0 0 0 851.848 0 0 0 0 0 0 0 0 0 0 0 0 0 0 0 0 0 0 
0 0 0 0 0 0 0.02 0 0 0 0 0 1843.39 0 0 551.851 0 0 0 0 0 0 0 0 0 0 0 0 0 0 -1701.48 0 0 0 0 2342.22 0 0 0 0 0 0 0 0 0 0 0 0 0 0 0 0 0 0 0 
0 0 0 0 0 0 0 0.07 0 0 0 0 0 0 0 0 0 2083.27 0 0 0 0 0 0 0 171.133 0 0 0 0 0 0 0 0 0 0 0 0 0 0 0 0 2008.35 0 -2118.98 0 0 0 0 0 0 0 0 0 0 
0 0 0 0 0 0 0 0 0.07 0 0 0 0 992.843 1836.22 0 0 0 0 0 0 1550.11 0 0 -1000.47 0 0 0 0 0 0 0 0 0 828.349 0 0 0 1961.96 0 0 0 0 0 0 0 0 0 0 0 0 0 0 0 0 
0 0 0 0 0 0 0 0 0 0.06 1799.75 0 0 0 1557.74 0 257.195 0 0 0 1388.06 0 0 0 0 0 0 0 0 0 0 0 0 0 0 0 0 0 0 0 0 0 0 0 0 0 0 0 0 0 0 0 0 0 0 
0 1825.39 0 0 0 0 0 0 0 1096.3 0.07 0 2179.4 0 0 0 0 0 0 0 0 298.242 0 1446.5 0 0 0 1869.33 0 0 0 -1550.11 0 0 0 0 -165.639 82.1711 0 0 0 0 0 0 0 0 0 0 0 0 0 0 0 0 0 
1246.15 0 0 -2160.48 0 0 0 0 0 0 0 0.03 0 0 0 0 0 0 0 0 0 101.245 0 0 0 0 0 0 0 0 0 0 0 0 0 1697.67 0 0 0 0 0 0 0 0 0 0 0 0 0 0 0 0 0 0 0 
0 0 0 0 0 0 -405.82 0 0 0 865.123 0 0 0 0 0 0 0 0 0 0 0 0 0 0 0 0 1561.4 0 0 0 0 -529.115 0 0 0 0 0 0 0 0 0 0 0 0 0 0 0 0 0 0 0 0 0 0 
0 0 0 -1383.79 0 0 0 0 1055.41 0 0 0 0 0.05 0 0 -1306.57 0 0 0 0 1884.75 0 0 0 0 0 0 0 0 0 0 0 0 0 0 0 239.799 0 2119.59 0 519.196 0 0 0 0 0 0 0 0 1457.34 0 0 0 0 
0 0 0 0 0 0 0 0 -183.798 570.772 0 0 0 0 0.01 -1640.14 0 0 1077.38 770.974 0 0 0 0 0 0 0 0 0 0 0 0 1554.08 0 0 0 0 0 0 0 0 0 0 761.208 0 0 0 874.584 0 0 0 0 0 0 0 
0 0 0 -781.35 0 1602.91 1624.42 0 0 0 0 0 0 0 -2233.88 0.06 0 0 0 0 0 0 0 0 0 -493.103 0 0 0 0 0 0 0 0 0 0 0 0 0 2286.22 0 0 0 0 0 0 0 0 0 0 0 0 0 0 0 
0 0 0 0 0 0 0 0 0 2080.68 0 0 0 2402.34 0 0 0.04 0 0 0 0 0 -722.297 -1872.23 2174.83 0 990.555 -1286.13 1878.64 0 0 0 0 0 0 0 0 0 0 0 0 0 0 0 0 0 0 0 0 0 0 2301.63 0 0 0 
0 0 0 0 0 0 0 -898.846 0 0 0 0 0 0 0 0 0 0.01 0 0 0 0 0 0 1887.04 0 1336.02 -1296.66 0 0 0 0 0 673.62 0 0 0 0 2435.3 0 1489.53 0 0 0 0 0 0 0 0 0 0 0 0 0 0 
0 1531.19 0 0 0 0 0 0 0 0 0 0 0 0 1728.34 0 0 0 0.04 0 0 0 0 0 0 0 0 0 0 0 0 437.407 0 936.537 0 0 0 0 0 0 0 0 0 0 0 0 0 0 0 0 0 0 0 0 0 
0 1751.53 0 0 0 0 0 0 0 0 0 0 0 0 -2059.92 0 0 0 0 0.03 0 0 0 0 0 0 0 1753.67 0 0 0 483.947 0 0 0 0 823.923 0 1117.82 0 960.189 0 0 0 0 0 -2252.65 0 0 0 0 0 0 0 0 
1296.96 2408.29 0 0 0 0 0 0 0 1405 0 0 0 0 0 0 0 0 0 0 0.06 0 0 0 0 1002.15 0 0 0 1256.37 -1587.5 0 -228.965 0 0 0 0 0 0 -1643.19 0 0 0 0 0 0 0 0 0 0 0 0 0 0 0 
-2358.55 0 0 0 0 0 0 0 559.938 0 958.968 799.203 0 2082.51 0 0 0 0 0 0 0 0.03 0 0 0 0 0 0 0 2194.2 0 0 0 0 0 0 2232.81 0 0 0 0 0 0 0 0 0 0 0 0 0 0 0 0 0 0 
0 0 0 2392.12 0 0 0 0 0 0 0 0 0 0 0 0 -861.003 0 0 0 0 0 0.02 1666.54 0 0 0 0 0 0 0 0 0 0 0 0 0 0 0 -2229.15 1518.98 0 0 0 0 0 0 0 0 0 0 0 0 0 0 
0 1138.57 0 0 1798.23 0 0 0 0 0 -2366.02 0 0 0 0 0 -60.0452 0 0 0 0 0 2390.13 0.05 0 0 0 0 0 0 0 0 0 0 1093.4 0 0 0 0 0 -715.735 2139.12 -278.863 0 0 0 0 0 0 0 0 0 0 0 0 
0 0 0 0 2488.4 0 0 0 2109.52 0 0 0 0 0 0 0 -1029.31 -1556.22 0 0 0 0 0 0 0.05 0 0 0 0 0 0 1227.38 0 0 0 0 0 0 0 0 0 0 0 0 0 0 0 0 0 0 0 0 0 0 0 
0 0 0 0 0 0 0 1822.03 0 0 0 0 0 0 0 -1365.32 0 0 0 0 2007.13 0 0 0 0 0.03 0 0 0 2449.34 0 0 0 0 -987.655 0 0 0 0 0 0 0 0 0 0 0 0 0 0 0 0 0 0 1656.77 0 
0 0 0 0 0 2169.33 0 0 0 0 0 0 0 0 0 0 -1439.18 1890.85 0 0 0 0 0 0 0 0 0.02 0 -1730.78 0 0 0 0 0 1520.2 0 0 0 0 0 0 385.067 -1051.13 0 0 0 0 0 0 0 0 0 0 0 0 
0 0 -1462.83 0 0 0 0 0 0 0 1820.66 0 -2456.66 0 0 0 1469.08 173.421 0 2472.99 0 0 0 0 0 0 0 0.03 0 0 0 0 0 0 0 940.504 0 0 0 0 0 0 0 -1600.31 0 0 0 0 -1991.41 0 0 0 0 0 0 
0 0 0 0 -2428.43 0 0 0 0 0 0 0 0 0 0 0 1514.1 0 0 0 0 0 0 0 0 0 2291.25 0 0.03 0 0 0 -554.292 0 0 0 0 1700.72 2196.19 0 0 0 0 0 0 0 0 0 0 0 0 0 0 0 0 
0 0 0 0 0 0 0 0 0 0 0 0 0 0 0 0 0 0 0 0 379.727 1001.24 0 0 0 -1180.53 0 0 0 0 0 0 0 0 0 0 0 0 2294.46 1877.27 0 0 -1823.1 0 0 0 0 0 0 0 0 0 0 0 0 
0 0 -891.369 2342.68 0 0 1765.57 0 0 0 0 0 0 0 0 0 0 0 0 0 1351.59 0 0 0 0 0 0 0 0 0 0.09 0 0 0 0 0 0 795.846 0 0 0 0 0 0 0 0 0 0 0 0 0 0 0 0 0 
1745.89 0 0 0 0 0 0 0 0 0 355.159 0 0 0 0 0 0 0 2118.37 1693.7 0 0 0 0 2446.29 0 0 0 0 0 0 0.04 0 0 0 0 0 0 0 0 0 0 0 366.451 0 0 0 0 0 0 0 0 0 0 0 
0 -1950.21 0 0 92.7 0 0 0 0 0 0 0 -78.814 0 -2021.77 0 0 0 0 0 2269.13 0 0 0 0 0 0 0 -2348.02 0 0 0 0.01 0 0 0 0 0 1804.48 2211.6 0 0 0 0 0 0 0 0 0 0 0 0 0 0 0 
1974.32 0 0 0 0 0 0 0 0 0 0 0 0 0 0 0 0 -1858.35 1145.89 0 0 0 0 0 0 0 0 0 0 0 0 0 0 0.03 0 0 0 0 0 0 1871.62 0 0 0 0 0 0 0 0 0 0 0 0 0 0 
0 0 0 0 0 0 0 0 1641.36 0 0 0 0 0 0 0 0 0 0 0 0 0 0 -1998.43 0 2035.97 -1413.08 0 0 0 0 0 0 0 0.01 0 0 0 1038.01 0 0 0 0 277.184 0 0 0 0 0 0 0 0 0 0 0 
0 0 0 -18.2348 0 0 799.966 0 0 0 0 -699.866 0 0 0 0 0 0 0 0 0 0 0 0 0 0 0 -417.875 0 0 0 0 0 0 0 0.08 0 0 0 0 0 0 1009.17 0 0 0 0 0 0 0 0 0 0 0 0 
0 0 0 0 0 207.755 0 0 0 0 1975.08 0 0 0 0 0 0 0 0 1182.21 0 -483.032 0 0 0 0 0 0 0 0 0 0 0 0 0 0 0.02 0 349.666 0 0 0 0 0 0 0 0 0 0 0 0 0 0 0 0 
0 0 0 0 0 0 0 0 0 0 -1952.19 0 0 1460.23 0 0 0 0 0 0 0 0 0 0 0 0 0 0 1726.2 0 1992.02 0 0 0 0 0 0 0.06 0 0 0 722.907 -679.113 -1060.44 0 0 0 0 0 0 0 0 0 0 0 
0 -2136.22 0 -2412.72 2038.56 0 0 0 1615.57 0 0 0 0 0 0 0 0 344.783 0 806.528 0 0 0 0 0 0 0 0 2288.51 313.349 0 0 2228.84 0 527.741 0 225.608 0 0.03 0 0 0 0 0 0 0 0 0 0 0 0 0 0 0 0 
0 0 0 0 0 0 0 0 0 0 0 0 0 1343.96 0 1376.16 0 0 0 0 -750.069 0 865.429 0 0 0 0 0 0 1152.61 0 0 1656.01 0 0 0 0 0 0 0.03 0 71.0318 -2494.2 -365.383 0 -2459.72 0 0 0 0 0 0 0 0 0 
0 0 0 0 0 0 0 0 0 0 0 0 0 0 0 0 0 1064.56 0 1828.9 0 0 532.624 2420.96 0 0 0 0 0 0 0 0 0 -2294.46 0 0 0 0 0 0 0.01 0 1418.27 1423.61 0 0 0 0 0 0 0 0 0 0 0 
0 0 0 1192.43 0 0 0 0 0 0 0 0 0 257.042 0 0 0 0 0 0 0 0 0 425.504 0 0 208.213 0 0 0 0 0 0 0 0 0 0 -258.721 0 -1247.98 0 0.04 0 0 0 0 0 0 0 0 0 0 0 0 0 
2289.73 -734.352 0 0 0 0 0 2433.62 0 0 0 0 0 0 0 0 0 0 0 0 0 0 0 -52.7207 0 0 -1866.13 0 0 2075.49 0 0 0 0 0 904.645 0 -1141.32 0 -1250.27 974.38 0 0.03 -644.169 0 0 0 0 0 0 0 0 0 0 0 
0 0 2168.72 0 0 0 0 0 0 0 0 0 0 0 -62.9444 0 0 0 0 0 0 0 0 0 0 0 0 1115.22 0 0 0 2103.56 0 0 -1941.21 0 0 -1614.96 0 2101.12 -1148.49 0 1414.15 0.03 0 0 0 0 0 0 0 0 0 0 0 
0 0 0 0 0 0 0 781.045 0 0 0 0 0 0 0 0 0 0 0 0 0 0 0 0 0 0 0 0 0 0 0 0 0 0 0 0 0 0 0 0 0 0 0 0 0.01 0 0 0 0 0 0 0 0 0 0 
0 0 0 0 0 0 0 0 0 0 0 0 0 0 0 0 0 0 0 0 0 0 0 0 0 0 0 0 0 0 0 0 0 0 0 0 0 0 0 2177.88 0 0 0 0 0 0 0 0 0 -2483.83 0 0 0 0 0 
0 0 0 0 0 0 0 0 0 0 0 0 0 0 0 0 0 0 0 1578.8 0 0 0 0 0 0 0 0 0 0 0 0 0 0 0 0 0 0 0 0 0 0 0 0 0 0 0.01 0 0 0 0 0 0 0 0 
0 0 0 0 0 0 0 0 0 0 0 0 0 0 326.93 0 0 0 0 0 0 0 0 0 0 0 0 0 0 0 0 0 0 0 0 0 0 0 0 0 0 0 0 0 0 0 0 0.03 0 0 0 0 0 0 0 
0 0 0 0 0 0 0 0 0 0 0 0 0 0 0 0 0 0 0 0 0 0 0 0 0 0 0 1255.61 0 0 0 0 0 0 0 0 0 0 0 0 0 0 0 0 0 0 0 0 0.04 0 0 0 0 0 0 
0 0 0 0 0 0 0 0 0 0 0 0 0 0 0 0 0 0 0 0 0 0 0 0 0 0 0 0 0 0 0 0 0 0 0 0 0 0 0 0 0 0 0 0 0 1526 0 0 0 0.09 0 0 0 0 0 
0 0 0 0 0 0 0 0 0 0 0 0 0 134.816 0 0 0 0 0 0 0 0 0 0 0 0 0 0 0 0 0 0 0 0 0 0 0 0 0 0 0 0 0 0 0 0 0 0 0 0 0.08 0 0 0 0 
0 0 0 0 0 0 0 0 0 0 0 0 0 0 0 0 1413.08 0 0 0 0 0 0 0 0 0 0 0 0 0 0 0 0 0 0 0 0 0 0 0 0 0 0 0 0 0 0 0 0 0 0 0.09 0 0 0 
0 0 248.192 0 0 0 0 0 0 0 0 0 0 0 0 0 0 0 0 0 0 0 0 0 0 0 0 0 0 0 0 0 0 0 0 0 0 0 0 0 0 0 0 0 0 0 0 0 0 0 0 0 0.03 0 0 
0 0 0 0 0 0 0 0 0 0 0 0 0 0 0 0 0 0 0 0 0 0 0 0 0 1923.96 0 0 0 0 0 0 0 0 0 0 0 0 0 0 0 0 0 0 0 0 0 0 0 0 0 0 0 0.08 0 
878.246 0 0 0 0 0 0 0 0 0 0 0 0 0 0 0 0 0 0 0 0 0 0 0 0 0 0 0 0 0 0 0 0 0 0 0 0 0 0 0 0 0 0 0 0 0 0 0 0 0 0 0 0 0 0.03 
