*Vertices 69
*Matrix 
0.05 0 640.049 0 0 0 0 0 0 0 0 0 0 0 0 0 1028.24 0 0 0 0 0 0 0 0 0 0 212.943 0 0 0 0 0 0 0 0 0 0 0 0 0 700.171 0 0 0 0 0 0 0 0 0 0 0 0 0 1680.58 1477.94 2307.89 0 1637.55 0 0 0 0 0 0 1775.64 0 0 
0 0.07 0 0 0 1436.58 0 0 1050.22 0 90.1059 0 0 39.4452 0 0 0 -1069.14 0 0 0 0 0 0 0 0 -13.9622 2470.24 0 0 0 0 0 0 0 0 0 0 0 0 0 0 0 0 0 0 -1464.35 -773.721 0 0 0 1762.22 0 0 0 0 2289.88 -2078.54 0 0 1990.04 0 0 0 0 0 0 0 0 
-1866.74 0 0.02 0 0 0 0 1511.05 0 0 0 0 0 0 0 0 0 0 0 0 0 0 0 1174.58 0 0 0 0 0 0 137.104 0 0 0 0 0 0 0 0 2225.03 0 0 -1854.38 0 0 0 0 0 0 0 0 -1286.74 0 0 0 0 0 0 0 0 0 0 1457.34 0 0 0 0 0 0 
0 0 0 0 -1988.81 0 0 0 0 0 0 0 1676.92 -530.183 0 0 1428.5 0 0 0 0 0 0 0 0 0 0 0 0 0 0 0 0 0 0 0 0 0 0 1090.2 0 0 0 0 0 -1105 0 0 0 0 0 0 0 0 0 0 0 0 0 0 0 0 0 0 0 0 0 0 0 
0 0 0 -423.215 0.08 0 0 0 0 0 0 0 0 0 0 0 0 1124.38 2283.93 0 0 0 0 0 0 0 0 0 -1549.96 0 0 0 0 0 0 0 0 1499.76 0 0 0 0 0 0 0 0 0 0 0 -730.384 0 0 0 0 0 0 0 0 0 0 0 0 0 1159.32 0 0 0 232.627 1452.3 
0 1890.39 0 0 0 0.05 2106.77 0 0 0 0 0 0 0 0 0 0 0 0 0 0 0 0 0 0 0 0 0 -1106.37 0 -1939.38 0 0 0 790.811 0 0 0 0 -1982.86 1387.14 0 0 0 0 0 0 0 0 2436.98 -604.953 0 0 0 0 0 0 0 0 0 0 0 0 0 0 0 1441.77 0 -478.454 
0 0 0 0 0 852.153 0.03 0 0 0 0 0 0 0 2097.46 0 0 0 0 0 0 0 0 0 0 0 0 0 0 0 0 0 0 0 0 0 0 0 0 0 0 0 0 0 0 0 0 0 0 0 0 0 0 0 0 0 0 0 0 0 0 0 0 0 0 1182.21 0 0 -1151.08 
0 0 1922.74 0 0 0 0 0.02 0 0 -1673.71 0 0 0 1443.3 0 0 0 0 0 0 0 0 0 0 0 0 0 0 0 0 0 78.0511 0 0 0 0 0 2297.2 0 0 0 0 0 0 0 -692.999 1839.88 0 0 0 0 0 0 0 0 0 0 0 0 0 0 0 0 2391.05 0 0 0 0 
0 1909.01 0 0 0 0 0 0 0 710.547 0 0 0 0 0 0 0 0 0 0 0 1340.14 0 0 0 0 0 0 0 0 0 1039.38 0 0 0 0 0 0 0 0 0 0 0 0 0 0 0 0 0 0 0 0 0 0 0 411.161 0 0 0 0 0 0 0 -1861.25 0 0 0 841.472 2152.7 
0 0 0 0 0 0 0 0 2271.57 0.05 0 0 1506.47 0 -1195.03 0 0 2105.09 0 0 0 0 0 0 0 0 0 1622.75 0 0 0 0 0 0 0 -2437.44 0 0 0 0 0 0 0 0 0 0 0 2382.66 0 0 0 0 1839.43 2425.53 -2055.19 0 0 0 0 0 0 0 0 0 0 0 0 -463.5 0 
0 -1804.64 0 0 0 0 0 2268.82 0 0 0.08 0 0 0 2352.75 0 0 0 -1800.82 0 0 0 0 0 0 0 854.595 0 0 0 361.873 1648.53 0 0 0 2349.39 0 0 0 0 0 0 0 0 0 0 0 0 0 0 1297.42 0 0 0 0 0 0 0 0 0 0 0 0 0 0 0 0 0 0 
0 0 0 0 0 0 0 0 0 0 0 0.07 0 0 0 0 0 0 0 0 0 0 0 0 0 0 398.648 0 0 2270.96 0 0 0 0 0 0 -1157.8 1989.88 0 0 0 0 0 0 0 0 0 -1444.67 0 0 0 0 0 0 0 0 0 0 0 0 0 0 0 0 0 0 0 0 0 
0 0 0 -423.521 0 0 0 0 0 2097.46 0 0 0.08 0 0 0 0 1520.05 -2200.31 0 2153 0 2336.73 0 0 0 0 0 0 0 0 0 1542.33 0 1828.9 1784.95 1657.08 1589.79 0 0 0 0 0 0 0 0 0 0 0 0 0 864.971 0 0 0 0 0 0 0 0 0 0 0 0 0 0 -1243.86 0 0 
0 -1277.28 0 2129.51 0 0 0 0 0 0 0 0 0 0.01 0 0 0 0 0 0 0 0 0 0 0 0 0 0 0 0 0 0 0 0 0 0 0 0 0 0 1244.93 0 0 0 2292.78 0 0 0 0 206.229 0 0 0 0 0 0 0 0 0 0 0 0 0 0 0 0 0 1109.42 0 
0 0 0 0 0 0 994.217 825.297 0 1092.64 -2280.11 0 0 0 0.09 0 -1361.96 0 0 0 0 1836.53 647.221 0 0 0 0 0 0 0 0 0 0 0 0 0 2366.33 0 0 0 635.624 0 0 0 0 0 0 -53.1785 0 1338.01 0 0 0 0 0 0 0 0 0 2048.63 0 0 0 0 0 0 0 0 0 
0 0 0 0 0 0 0 0 0 0 0 0 0 0 0 0.08 0 0 0 0 1934.95 0 0 -616.092 0 -171.743 0 0 0 0 0 0 0 0 0 0 0 0 2403.26 0 0 0 0 0 0 0 0 0 -2201.22 0 0 0 0 0 0 0 0 1166.19 0 0 0 0 0 0 0 0 -932.417 -713.141 0 
-902.509 0 0 -567.263 0 0 0 0 0 0 0 0 0 0 307.398 0 0.09 0 0 0 0 0 2203.82 0 120.472 0 0 0 -1492.89 879.925 0 0 0 0 0 0 0 0 0 0 0 -213.401 0 0 0 0 0 0 -677.435 0 0 0 0 1185.26 0 0 0 0 0 0 0 0 0 0 0 0 -66.9118 0 0 
0 1741.61 0 0 2488.71 0 0 0 0 2072.74 0 0 679.876 0 0 0 0 0.01 0 0 344.02 0 0 0 0 0 0 0 -1342.43 0 0 0 0 0 0 0 0 0 0 0 0 262.23 0 0 0 0 0 0 0 0 0 0 0 0 0 0 0 -234.458 2116.99 0 0 0 279.473 0 0 0 0 0 0 
0 0 0 0 1145.13 0 0 0 0 0 679.418 0 -1238.82 0 0 0 0 0 0.07 0 0 0 0 0 0 0 0 0 2141.71 0 0 0 0 0 2319.64 326.472 0 0 0 -902.509 1364.86 0 0 0 -1343.5 0 0 0 -568.484 0 0 2216.64 0 0 0 0 0 -1093.71 -674.383 809.122 0 0 0 0 0 0 0 0 0 
0 0 0 0 0 0 0 0 0 0 0 0 0 0 0 0 0 0 0 0.04 0 0 0 0 0 0 1933.42 0 0 0 0 0 0 0 0 0 0 136.189 -2435.3 0 0 0 0 0 0 0 0 0 0 0 0 0 0 0 0 0 0 0 0 0 0 0 465.636 0 0 0 -1238.21 1217 0 
0 0 0 0 0 0 0 0 0 0 0 0 843.455 0 0 2350.61 0 767.464 0 0 0.08 0 0 0 0 632.878 0 0 0 0 0 0 0 0 0 0 0 0 0 0 0 0 0 0 0 0 0 330.287 0 0 0 0 0 0 0 -1316.03 0 0 1390.5 0 0 0 -79.7296 0 0 0 0 0 0 
0 0 0 0 0 0 0 0 -1088.21 0 0 0 0 0 -1129.72 0 0 0 0 0 0 0.07 -13.3518 -779.824 0 0 0 0 0 0 0 0 0 0 0 0 0 0 0 0 0 0 0 0 0 0 1938.92 0 0 0 0 2099.14 0 0 0 0 0 0 0 0 1643.5 0 0 0 0 0 0 0 0 
0 0 0 0 0 0 0 0 0 0 0 0 -1215.93 0 2454.53 0 273.98 0 0 0 0 1861.25 0.06 0 0 429.014 0 0 0 0 0 0 0 0 0 0 398.495 0 0 0 0 0 0 0 0 2124.93 0 0 0 0 0 -852.306 -781.35 0 0 0 0 0 0 0 1357.54 1784.19 0 0 0 0 0 0 0 
0 0 -1326.26 0 0 0 0 0 0 0 0 0 0 0 0 813.395 0 0 0 0 0 447.935 0 0.05 0 0 0 0 0 0 0 -947.371 0 0 0 0 0 0 0 0 0 0 -1959.21 2006.67 0 0 38.9874 0 0 -8.01111 0 0 0 0 0 0 0 0 0 0 0 0 0 0 0 0 0 0 2122.64 
0 0 0 0 0 0 0 0 0 0 0 0 0 0 0 0 -69.8111 0 0 0 0 0 0 0 0.01 -2269.13 0 0 0 0 0 0 0 831.401 -1209.07 0 0 1600.62 0 0 0 0 0 0 -1615.12 0 0 0 0 0 0 2394.41 -1452.45 0 0 0 0 0 0 2369.69 0 0 0 0 0 0 0 0 0 
0 0 0 0 0 0 0 0 0 0 0 0 0 0 0 1801.43 0 0 0 0 2044.97 0 -1150.01 0 498.291 0.02 0 0 0 0 0 0 1398.28 0 0 0 -1135.98 0 0 0 0 0 0 1351.44 0 0 0 0 0 0 0 0 0 0 1768.17 0 0 0 0 0 -795.236 2309.87 0 -2382.05 0 0 0 0 0 
0 9.68963 0 0 0 0 0 0 0 0 198.294 -1933.12 0 0 0 0 0 0 0 -1244.16 0 0 0 0 0 0 0.03 0 0 0 0 0 0 948.897 0 -2090.59 0 0 0 0 0 0 0 160.451 0 0 0 0 0 0 0 0 0 1824.47 2355.19 0 0 0 0 0 0 1061.2 0 0 0 0 0 0 0 
-1756.72 2434.84 0 0 0 0 0 0 0 2304.38 0 0 0 0 0 0 0 0 0 0 0 0 0 0 0 0 0 0 0 0 -691.778 0 0 0 0 0 0 -864.818 0 0 0 0 0 -1585.51 0 0 -529.572 0 0 0 0 0 1318.93 0 0 0 0 0 0 0 0 0 0 0 0 -324.183 1904.13 0 0 
0 0 0 0 496.918 -1149.71 0 0 0 0 0 0 0 0 0 0 -1998.73 2159.87 -900.22 0 0 0 0 0 0 0 0 0 0.04 -1265.83 0 241.02 0 0 0 0 0 2290.03 1725.75 0 0 0 0 2382.35 -2312.92 0 0 0 1267.05 0 0 0 0 0 0 0 0 0 0 0 0 0 0 0 0 0 0 0 0 
0 0 0 0 0 0 0 0 0 0 0 1833.48 0 0 0 0 2458.49 0 0 0 0 0 0 0 0 0 0 0 -1626.87 0.05 1192.74 0 -271.538 0 0 2040.39 -2085.1 0 0 0 0 0 -840.251 0 0 0 -1539.28 0 0 0 0 0 0 0 0 0 0 171.438 0 0 0 0 -1455.81 0 0 0 1025.5 0 0 
0 0 -1945.17 0 0 -2263.18 0 0 0 0 -723.67 0 0 0 0 0 0 0 0 0 0 0 0 0 0 0 0 789.59 0 -755.104 0.08 0 0 0 0 0 0 0 0 0 1827.22 0 1520.36 0 -342.189 0 0 1881.08 0 0 1779.46 1859.42 0 0 0 -903.577 0 0 0 0 0 0 0 833.537 0 0 0 0 0 
0 0 0 0 0 0 0 0 337.916 0 1888.56 0 0 0 0 0 0 0 0 0 0 0 0 -1710.49 0 0 0 0 2266.23 0 0 0.01 0 -379.574 0 -1318.63 0 0 0 0 0 0 1206.93 0 0 0 0 0 -185.781 0 0 0 0 0 0 0 0 0 0 2277.67 0 1428.19 0 0 0 0 0 -1229.51 0 
0 0 0 0 0 0 0 -866.955 0 0 0 0 1422.85 0 0 0 0 0 0 0 0 0 0 0 0 2470.09 0 0 0 1727.88 0 0 0 0 0 0 0 0 0 0 0 0 0 0 0 0 0 0 0 0 0 0 0 0 0 0 -1534.85 0 0 0 0 0 0 0 0 0 0 0 0 
0 0 0 0 0 0 0 0 0 0 0 0 0 0 0 0 0 0 0 0 0 0 0 0 -578.555 0 1928.69 0 0 0 0 -357.448 0 0.09 0 0 0 0 0 0 0 0 842.692 0 -81.8659 0 0 0 0 0 0 1868.88 -754.189 0 0 0 0 0 0 0 0 0 0 0 0 0 0 2334.28 0 
0 0 0 0 0 438.169 0 0 0 0 0 0 -1325.8 0 0 0 0 0 449.919 0 0 0 0 0 2153.92 0 0 0 0 0 0 0 0 0 0.04 0 0 0 0 0 0 0 0 0 -434.355 0 0 0 0 0 0 0 0 0 0 0 -48.9059 1887.34 0 0 0 0 0 0 0 0 0 0 0 
0 0 0 0 0 0 0 0 0 -619.449 2228.69 0 -1438.41 0 0 0 0 0 2007.89 0 0 0 0 0 0 0 654.393 0 0 -940.504 0 -1011.46 0 0 0 0.04 0 0 0 0 0 -1231.35 0 0 0 0 2394.1 0 0 0 0 0 -75.457 0 0 0 0 0 0 0 0 0 0 0 0 0 0 0 0 
0 0 0 0 0 0 0 0 0 0 0 995.438 768.075 0 481.353 0 0 0 0 0 0 0 129.17 0 0 -1587.95 0 0 0 -2228.69 0 0 0 0 0 0 0.04 -2076.56 0 -248.802 0 0 0 0 0 0 0 16.5563 0 0 0 0 846.202 0 0 0 0 0 0 0 2297.51 0 1403.47 1359.98 0 -577.639 0 0 0 
0 0 0 0 2465.06 0 0 0 0 0 0 454.344 196.921 0 0 0 0 0 0 582.369 0 0 0 0 761.818 0 0 1146.2 698.34 0 0 0 0 0 0 0 553.224 0 0 0 0 1953.26 0 -425.199 0 0 0 0 -2047.26 1021.23 0 316.553 0 0 0 0 0 0 0 0 0 0 -1527.99 0 0 2045.73 0 0 0 
0 0 0 0 0 0 0 381.405 0 0 0 0 0 0 0 338.069 0 0 0 1291.01 0 0 0 0 0 0 0 0 1127.12 0 0 0 0 0 0 0 0 0 0.06 0 0 0 0 0 0 0 -2276.76 0 0 0 0 0 0 -517.212 0 2146.75 0 0 1994.16 0 0 0 0 1872.84 0 0 0 0 0 
0 0 -772.347 -80.6452 0 -148.549 0 0 0 0 0 0 0 0 0 0 0 0 373.928 0 0 0 0 0 0 0 0 0 0 0 0 0 0 0 0 0 -903.119 0 0 0.05 0 0 0 0 0 0 0 1912.21 0 0 0 0 0 -1153.07 0 -457.244 0 0 451.598 0 0 0 485.626 1501.13 0 0 0 0 0 
0 0 0 0 0 -512.787 0 0 0 0 0 0 0 -160.604 2273.55 0 0 0 1359.52 0 0 0 0 0 0 0 0 0 0 0 -1862.62 0 0 0 0 0 0 0 0 0 0.03 0 2209.31 0 0 0 0 -653.935 0 0 0 0 0 0 0 -1222.04 0 0 0 0 -1256.07 0 0 0 0 0 0 0 0 
-676.977 0 0 0 0 0 0 0 0 0 0 0 0 0 0 0 2091.36 1778.85 0 0 0 0 0 0 0 0 0 0 0 0 0 0 0 0 0 -987.198 0 768.532 0 0 0 0.08 0 0 1765.88 0 179.067 0 0 0 0 0 0 2145.68 0 0 0 -1085.01 0 0 -1989.27 0 0 0 0 0 0 0 0 
0 0 -861.309 0 0 0 0 0 0 0 0 0 0 0 0 0 0 0 0 0 0 0 0 388.577 0 0 0 0 0 -1212.88 -1565.68 -238.731 0 2004.38 0 0 0 0 0 0 1527.68 0 0.07 -2011.4 2223.81 2025.44 0 0 0 0 0 -949.202 0 0 0 0 0 0 0 0 0 0 0 0 0 0 0 0 0 
0 0 0 0 0 0 0 0 0 0 0 0 0 0 0 0 0 0 0 0 0 0 0 -896.252 0 1723.46 -1212.12 1731.24 -742.592 0 0 0 0 0 0 0 0 865.886 0 0 0 0 -1879.25 0.08 0 0 0 0 0 0 0 0 0 0 0 0 0 0 2110.28 0 0 0 0 0 0 1949.45 0 0 0 
0 0 0 0 0 0 0 0 0 0 0 0 0 -948.897 0 0 0 0 -293.97 0 0 0 0 0 662.938 0 0 0 1382.72 0 146.565 0 0 -2303.46 2478.18 0 0 0 0 0 0 -5.87481 2083.57 0 0.07 0 0 0 0 0 0 0 0 0 0 0 0 0 0 0 0 0 0 0 0 -700.171 0 0 0 
0 0 0 2351.37 0 0 0 0 0 0 0 0 0 0 0 0 0 0 0 0 0 0 -1302 0 0 0 0 0 0 0 0 0 0 0 0 0 0 0 0 0 0 0 -930.891 0 0 0.03 0 0 0 0 0 0 0 0 0 0 0 0 0 0 0 0 0 0 0 0 0 0 0 
0 -937.147 0 0 0 0 0 -2469.48 0 0 0 0 0 0 0 0 0 0 0 0 0 537.202 0 1496.7 0 0 0 1262.93 0 -1388.52 0 0 0 0 0 435.118 0 0 774.483 0 0 1447.87 0 0 0 0 0.01 0 0 0 0 0 0 0 0 0 -935.316 0 0 0 0 0 0 0 0 2093.19 0 0 0 
0 -2255.09 0 0 0 0 0 -297.174 0 -613.804 0 -483.032 0 0 2342.22 0 0 0 0 0 -348.14 0 0 0 0 0 0 0 0 0 913.343 0 0 0 0 0 1268.58 0 0 -361.11 1335.57 0 0 0 0 0 0 0.03 0 0 0 0 0 0 0 0 0 0 0 0 2374.72 0 0 0 0 0 1314.51 0 0 
0 0 0 0 0 0 0 0 0 0 0 0 0 0 0 -1304.9 -316.706 0 1806.01 0 0 0 0 0 0 0 0 0 859.478 0 0 2461.39 0 0 0 0 0 2433.16 0 0 0 0 0 0 0 0 0 0 0.05 0 0 0 0 0 0 0 0 0 0 0 0 0 0 0 0 0 0 0 0 
0 0 0 0 1355.1 1249.5 0 0 0 0 0 0 0 470.672 -1085.47 0 0 0 0 0 0 0 0 444.884 0 0 0 0 0 0 0 0 0 0 0 0 0 1223.87 0 0 0 0 0 0 0 0 0 0 0 0.07 0 792.947 0 0 0 0 0 0 0 0 -1605.5 0 0 0 0 0 0 0 0 
0 0 0 0 0 1135.67 0 0 0 0 2242.58 0 0 0 0 0 0 0 0 0 0 0 0 0 0 0 0 0 0 0 -2095.63 0 0 0 0 0 0 0 0 0 0 0 0 0 0 0 0 0 0 0 0.09 0 0 0 0 0 0 0 0 0 0 0 0 0 0 0 0 -193.564 0 
0 1518.07 757.088 0 0 0 0 0 0 0 0 0 1763.28 0 0 0 0 0 -191.122 0 0 1019.7 240.867 0 -678.503 0 0 0 0 0 1591.01 0 0 2265.47 0 0 0 -348.292 0 0 0 0 1582.92 0 0 0 0 0 0 1887.49 0 0.03 0 0 0 -51.6526 -1225.39 298.853 0 0 0 0 0 0 0 0 0 0 0 
0 0 0 0 0 0 0 0 0 1362.27 0 0 0 0 0 0 0 0 0 0 0 0 -1838.36 0 -583.132 0 0 -76.0674 0 0 0 0 0 2174.06 0 2155.75 222.709 0 0 0 0 0 0 0 0 0 0 0 0 0 0 0 0.07 0 0 0 -1644.72 0 0 0 0 0 -2267.14 1823.4 0 0 0 0 0 
0 0 0 0 0 0 0 0 0 -1667 0 0 0 0 0 0 -1262.47 0 0 0 0 0 0 0 0 0 1487.85 0 0 0 0 0 0 0 0 0 0 0 1489.68 1358.3 0 -654.241 0 0 0 0 0 0 0 0 0 0 0 0.09 886.792 0 0 0 0 1301.23 0 0 0 0 0 0 0 1721.47 0 
0 0 0 0 0 0 0 0 0 -1717.2 0 0 0 0 0 0 0 0 0 0 0 0 0 0 0 -2263.48 1374.48 0 0 0 0 0 0 0 0 0 0 0 0 0 0 0 0 0 0 0 0 0 0 0 0 0 0 1911.45 0.08 0 0 0 0 0 0 0 0 0 0 0 1351.89 0 0 
-206.839 0 0 0 0 0 0 0 -98.0407 0 0 0 0 0 0 0 0 0 0 0 1365.02 0 0 0 0 0 0 0 0 0 117.878 0 0 0 0 0 0 0 2149.8 -165.639 785.318 0 0 0 0 0 0 0 0 0 0 150.227 0 0 0 0.08 0 0 0 0 0 0 0 0 0 0 -2103.41 2312.62 -481.964 
1612.37 1431.85 0 0 0 0 0 0 0 0 0 0 0 0 0 0 0 0 0 0 0 0 0 0 0 0 0 0 0 0 0 0 -977.432 0 488.372 0 0 0 0 0 0 0 0 0 0 0 -1195.03 0 0 0 0 1811.81 985.672 0 0 0 0.08 0 0 0 0 0 0 0 0 0 0 0 0 
-679.724 2279.81 0 0 0 0 0 0 0 0 0 0 0 0 0 -149.464 0 211.875 215.69 0 0 0 0 0 0 0 0 0 0 1894.67 0 0 0 0 -76.6778 0 0 0 0 0 0 1124.53 0 0 0 0 0 0 0 0 0 825.144 0 0 0 0 0 0.05 0 0 0 0 0 0 0 432.066 0 -1921.67 0 
0 0 0 0 0 0 0 0 0 0 0 0 0 0 0 0 0 -1288.87 32.2733 0 2314.6 0 0 0 0 0 0 0 0 0 0 0 0 0 0 0 0 0 -2109.97 -832.774 0 0 0 2021.16 0 0 0 0 0 0 0 0 0 0 0 0 0 0 0.01 0 0 0 0 0 0 0 0 0 0 
400.174 0 0 0 0 0 0 0 0 0 0 0 0 0 1634.8 0 0 0 1394.92 0 0 0 0 0 1965.32 0 0 0 0 0 0 1664.1 0 0 0 0 0 0 0 0 0 0 0 0 0 0 0 0 0 0 0 0 0 -979.72 0 0 0 0 0 0.07 0 0 0 0 1217.15 0 0 0 375.759 
0 -1068.53 0 0 0 0 0 0 0 0 0 0 0 0 0 0 0 0 0 0 0 -1264.92 697.577 0 0 -424.131 0 0 0 0 0 0 0 0 0 0 2485.81 0 0 0 -165.792 -2366.79 0 0 0 0 0 1696.6 0 664.617 0 0 0 0 0 0 0 0 0 0 0 909.986 0 0 0 0 0 0 0 
0 0 0 0 0 0 0 0 0 0 0 0 0 0 0 0 0 0 0 0 0 0 2079.15 0 0 -1227.99 -401.547 0 0 0 0 555.818 0 0 0 0 0 0 0 0 0 0 0 0 0 0 0 0 0 0 0 0 0 0 0 0 0 0 0 0 2487.64 0.07 0 0 0 0 0 0 0 
0 0 1195.03 0 0 0 0 0 0 0 0 0 0 0 0 0 0 237.968 0 -1134.6 -395.596 0 0 0 0 0 0 0 0 1476.41 0 0 0 0 0 0 -109.18 -356.533 0 1826.46 0 0 0 0 0 0 0 0 0 0 0 0 -2103.41 0 0 0 0 0 0 0 0 0 0.07 0 0 2446.9 0 0 0 
0 0 0 0 2490.84 0 0 0 -946.15 0 0 0 0 0 0 0 0 0 0 0 0 0 0 0 0 579.47 0 0 0 0 109.333 0 0 0 0 0 241.173 0 1774.88 -2040.7 0 0 0 0 0 0 0 0 0 0 0 0 573.367 0 0 0 0 0 0 0 0 0 0 0.09 -892.285 0 0 -655.614 0 
0 0 0 0 0 0 0 489.441 0 0 0 0 0 0 0 0 0 0 0 0 0 0 0 0 0 0 0 0 0 0 0 0 0 0 0 0 0 0 0 0 0 0 0 0 0 0 0 0 0 0 0 0 0 0 0 0 0 0 0 -1150.78 0 0 0 1672.19 0.09 0 0 0 0 
0 0 0 0 0 0 -1063.95 0 0 0 0 0 0 0 0 0 0 0 0 0 0 0 0 0 0 0 0 1533.48 0 0 0 0 0 0 0 0 2415.62 1380.12 0 0 0 0 0 1105 -651.494 0 -353.786 0 0 0 0 0 0 0 0 0 0 -1200.98 0 0 0 0 -1714.3 0 0 0.07 0 0 0 
2076.1 0 0 0 0 -839.335 0 0 0 0 0 0 2463.38 0 0 369.655 378.353 0 0 -759.682 0 0 0 0 0 0 0 58.0615 0 -942.793 0 0 0 0 0 0 0 0 0 0 0 0 0 0 0 0 0 1721.63 0 0 0 0 0 0 2026.51 -1179.46 0 0 0 0 0 0 0 0 0 0 0.08 -496.307 0 
0 0 0 0 -606.479 0 0 0 -772.347 2045.27 0 0 0 213.553 0 2141.56 0 0 0 1389.43 0 0 0 0 0 0 0 0 0 0 0 -1633.73 0 -259.484 0 0 0 0 0 0 0 0 0 0 0 0 0 0 0 0 -23.2704 0 0 -61.4185 0 -1594.21 0 65.0807 0 0 0 0 0 1738.11 0 0 2075.79 0.02 0 
0 0 0 0 2108.75 -2415.01 -19.4555 0 1020.77 0 0 0 0 0 0 0 0 0 0 0 0 0 0 1182.52 0 0 0 0 0 0 0 0 0 0 0 0 0 0 0 0 0 0 0 0 0 0 0 0 0 0 0 0 0 0 0 1234.09 0 0 0 450.53 0 0 0 0 0 0 0 0 0.07 
