*Vertices 51
*Matrix 
0.02 0 0 1388.06 2122.03 278.71 0 -1756.42 0 1311 -414.67 0 425.657 -228.507 650.121 1458.1 0 -854.137 0 0 0 -414.518 63.097 0 0 0 0 0 0 0 1706.82 0 0 -1146.96 0 939.283 0 0 462.584 0 0 0 0 0 0 0 0 0 0 0 0 
0 0.02 0 0 0 0 1784.65 0 -567.263 0 0 0 0 0 2174.37 0 0 0 0 -918.226 0 -1422.09 1120.72 0 0 0 0 0 75.7622 0 0 0 0 0 0 0 0 0 0 0 0 0 0 0 441.069 -412.992 0 0 0 0 0 
0 0 0.07 2073.81 902.966 0 0 0 0 2100.36 0 406.735 0 -351.65 0 1855.14 0 -2303.31 1865.21 0 1386.84 0 0 0 0 -491.882 0 0 0 0 0 0 0 0 0 0 0 0 0 0 0 0 0 1727.12 0 0 0 0 0 0 -284.051 
2011.25 0 -477.538 0.02 0 0 0 0 0 413.755 0 0 1551.03 0 0 0 0 0 0 1988.05 0 0 0 0 0 0 0 0 0 0 0 0 0 0 0 0 0 0 0 -832.011 0 0 0 0 0 0 0 0 0 0 0 
1524.02 0 274.743 0 0.02 0 0 0 0 0 0 0 -761.818 0 0 -26.017 0 0 -634.098 0 0 334.101 0 0 0 0 0 0 0 0 0 0 0 0 0 0 1383.63 0 0 0 0 0 0 0 0 2150.56 0 0 0 0 0 
1866.44 0 0 0 0 0.09 0 0 0 0 -1822.79 0 0 0 2260.58 0 0 1357.39 0 -761.666 2326.65 0 0 0 0 0 0 0 0 0 0 0 0 0 0 0 -2375.18 0 0 0 650.273 0 0 0 0 0 0 0 822.092 0 0 
0 2122.79 0 0 0 0 0.06 0 0 0 0 0 0 0 0 0 -1426.36 0 0 0 0 1810.13 0 2144.76 0 0 0 0 0 0 0 0 0 0 -184.256 -183.493 0 -2260.89 0 0 0 0 0 0 0 0 0 0 0 0 0 
864.971 0 0 0 0 0 0 0.03 0 0 0 0 -2076.86 2118.21 0 0 0 0 0 0 0 0 0 0 2386.47 318.995 0 0 0 0 -1605.35 0 -356.685 0 0 0 0 0 0 0 0 0 0 415.891 0 -1007.64 0 0 0 0 0 
0 2494.35 0 0 0 0 0 0 0.04 2443.69 0 0 0 0 0 0 917.615 0 628.605 0 0 -0.991852 0 0 0 0 0 0 0 0 0 0 0 0 -1721.17 0 -1138.57 0 0 0 0 -1086.08 0 0 0 -1658.91 0 0 0 0 0 
-1.75481 0 -232.627 1254.39 0 0 0 0 1024.28 0.01 0 -1155.2 -1027.02 0 -583.438 0 0 748.543 0 0 0 0 -121.235 0 0 0 1993.09 0 0 0 0 0 0 0 0 0 0 0 0 0 0 0 0 0 -159.536 0 0 0 -2293.24 0 0 
1639.07 0 0 0 0 -1131.09 0 0 0 0 0.01 0 0 0 0 0 477.844 0 1876.81 0 2303.77 0 0 0 0 0 0 0 0 0 0 0 -1088.98 0 0 0 569.399 0 0 0 0 0 0 0 0 0 0 -1072.5 0 0 851.695 
0 0 -550.478 0 0 0 0 0 0 561.159 0 0.08 0 0 0 0 0 0 0 2048.17 0 0 2376.4 0 0 0 0 0 0 0 0 0 0 0 0 0 0 0 1054.34 0 2223.65 0 0 0 0 -1278.95 0 0 0 0 0 
-221.335 0 0 739.235 2340.69 0 0 -2379.91 0 1054.95 0 0 0 0 2210.07 0 0 0 0 1668.98 207.45 0 1716.28 0 -972.701 0 0 0 0 0 0 0 0 0 0 0 0 -736.641 0 1883.07 0 0 0 0 0 0 0 0 0 1199.3 0 
-1708.2 0 2195.58 0 0 0 0 -2354.43 0 0 0 0 0 0.06 1577.73 0 0 0 0 0 0 0 0 0 35.1726 2407.83 0 0 0 0 0 0 0 0 0 0 0 0 0 0 0 -1024.12 0 0 0 0 0 0 0 0 0 
1569.8 -1864.3 0 0 0 517.06 0 0 0 2162.92 0 0 698.34 775.399 0 0 0 0 0 0 0 0 0 86.9015 0 0 0 0 0 0 0 -1662.57 1658.76 0 -1418.58 0 0 0 0 0 0 0 -480.743 0 0 0 0 -486.389 0 0 0 
1206.47 0 194.174 0 340.205 0 0 0 0 0 0 0 0 0 0 0.04 0 -615.482 0 0 2075.49 0 0 0 0 0 1348.69 -1744.51 0 0 0 1611.61 0 0 0 0 0 0 0 0 0 0 2294.46 0 0 0 1612.67 0 0 0 0 
0 0 0 0 0 0 801.95 0 671.026 0 2227.32 0 0 0 0 0 0.06 0 0 1811.66 0 445.341 0 0 0 0 2136.07 -466.094 0 1460.08 0 0 0 0 0 0 0 0 452.055 -1949.29 0 0 0 0 0 0 0 -673.925 0 0 0 
1730.32 0 1912.37 0 0 2180.62 0 0 0 -346.767 0 0 0 0 0 776.315 0 0.02 0 2353.05 0 0 0 0 0 0 0 0 0 0 1681.19 0 0 0 0 0 0 0 0 0 1962.72 0 0 0 0 0 0 0 0 0 -540.406 
0 0 275.048 0 2193.75 0 0 0 1571.32 0 281.61 0 0 0 0 0 0 0 0.02 1256.07 2032 0 0 0 0 0 0 0 546.968 954.085 0 0 -942.335 0 0 0 0 -1571.93 0 0 1182.82 0 1449.25 600.223 0 0 0 0 -229.118 0 0 
0 -440.153 0 -83.3918 0 -2312.77 0 0 0 0 0 1190.76 1546.3 0 0 0 -212.027 2334.74 139.393 0 0 444.731 0 0 0 0 0 0 0 0 0 -1145.74 -1475.34 1827.22 0 0 0 0 0 0 0 0 0 0 0 0 0 0 0 0 0 
0 0 1919.84 0 0 257.042 0 0 0 0 812.632 0 700.018 0 0 -2387.84 0 0 -409.177 0 0.02 2299.49 0 0 0 0 0 0 0 0 0 0 0 0 0 0 287.713 0 0 0 0 0 0 0 0 0 0 0 0 0 0 
1159.63 1751.84 0 0 887.097 0 1549.5 0 1963.33 0 0 0 0 0 0 0 -1771.83 0 0 -364.772 1927.78 0.04 1957.08 0 0 0 0 0 0 0 0 0 0 -2454.68 0 410.398 0 0 0 0 0 0 0 0 0 0 0 0 0 0 2227.32 
-891.369 1683.63 0 0 0 0 0 0 0 938.215 0 2029.1 1642.28 0 0 0 0 0 0 0 0 -782.876 0 0 0 1912.06 0 -131.611 0 0 0 646.001 0 0 -1364.1 0 0 0 0 0 0 0 0 0 0 0 2073.66 38.2244 0 0 0 
0 0 0 0 0 0 2270.96 0 0 0 0 0 0 0 1591.77 0 0 0 0 0 0 0 0 0.01 0 0 0 0 0 0 0 0 0 0 0 0 0 0 0 1324.27 0 0 0 0 0 0 0 0 0 0 0 
0 0 0 0 0 0 0 157.399 0 0 0 0 -49.6689 -346.461 0 0 0 0 0 0 0 0 0 0 0.07 0 0 0 0 0 2045.43 0 0 0 0 0 0 0 0 -1846.9 0 0 0 0 0 0 2295.07 0 0 0 0 
0 0 -131.611 0 0 0 0 2247 0 0 0 0 0 23.5755 0 0 0 0 0 0 0 0 1251.79 0 0 0.09 0 0 0 -1077.07 0 0 0 -1079.82 0 353.175 0 0 1964.09 0 0 -1029.77 0 0 2208.7 0 0 0 0 567.568 0 
0 0 0 0 0 0 0 0 0 2212.52 0 0 0 0 0 344.935 229.423 0 0 0 0 0 0 0 0 0 0.06 0 0 0 0 0 0 0 0 0 0 0 0 0 0 0 0 0 1122.09 -538.118 0 1052.35 0 0 0 
0 0 0 0 0 0 0 0 0 0 0 0 0 0 0 161.367 2094.56 0 0 0 0 0 1169.24 0 0 0 0 0.07 0 0 0 0 0 0 0 0 0 0 0 -2408.29 0 0 0 0 1537.29 0 0 0 0 0 0 
0 362.636 0 0 0 0 0 0 0 0 0 0 0 0 0 0 0 0 401.547 0 0 0 0 0 0 0 0 0 0.01 1622.9 0 0 0 0 0 0 0 0 0 0 0 0 0 -857.799 0 0 445.647 0 0 0 0 
0 0 0 0 0 0 0 0 0 0 0 0 0 0 0 0 -206.076 0 2068.47 0 0 0 0 0 0 2120.5 0 0 -1345.03 0.06 0 0 0 0 0 0 0 0 0 0 0 0 0 2382.2 0 0 0 0 0 0 0 
28.9163 0 0 0 0 0 0 2210.23 0 0 0 0 0 0 0 0 0 2054.12 0 0 0 0 0 0 -868.023 0 0 0 0 0 0.08 0 0 0 0 0 0 0 0 -605.716 0 450.835 0 0 0 2293.08 0 0 0 1190.6 0 
0 0 0 0 0 0 0 0 0 0 0 0 0 0 -652.104 2436.83 0 0 0 -1992.63 0 0 1375.39 0 0 0 0 0 0 0 0 0.08 0 0 0 0 0 0 2112.11 0 0 0 0 0 0 0 0 0 0 0 0 
0 0 0 0 0 0 0 2066.33 0 0 -291.986 0 0 0 944.014 0 0 0 -1252.56 1512.27 0 0 0 0 0 0 0 0 0 0 0 0 0.07 0 0 0 0 0 0 0 0 0 0 0 0 0 0 0 0 0 0 
725.349 0 0 0 0 0 0 0 0 0 0 0 0 0 0 0 0 0 0 -119.098 0 668.584 0 0 0 -900.067 0 0 0 0 0 0 0 0.03 0 0 0 0 0 0 0 0 0 0 0 0 2075.95 0 0 0 0 
0 0 0 0 0 0 -288.171 0 1749.4 0 0 0 0 0 2309.87 0 0 0 0 0 0 0 -395.749 0 0 0 0 0 0 0 0 0 0 0 0.07 0 0 0 0 -1083.18 0 0 0 0 0 0 0 0 0 0 0 
330.744 0 0 0 0 0 1199.15 0 0 0 0 0 0 0 0 0 0 0 0 0 0 1260.8 0 0 0 1894.51 0 0 0 0 0 0 0 0 0 0.05 0 0 1051.9 0 2377.47 0 1307.79 0 0 0 0 0 0 0 0 
0 0 0 0 1354.18 1177.33 0 0 -826.365 0 171.59 0 0 0 0 0 0 0 0 0 1289.94 0 0 0 0 0 0 0 0 0 0 0 0 0 0 0 0 0 0 0 -1771.52 1822.34 0 0 0 0 0 0 0 0 0 
0 0 0 0 0 0 861.766 0 0 0 0 0 378.964 0 0 0 0 0 1997.82 0 0 0 0 0 0 0 0 0 0 0 0 0 0 0 0 0 0 0.08 0 0 0 -87.817 0 0 0 0 0 0 158.773 0 0 
2256.92 0 0 0 0 0 0 0 0 0 0 1415.83 0 0 0 0 -1295.13 0 0 0 0 0 0 0 0 -1640.45 0 0 0 0 0 2332.61 0 0 0 238.578 0 0 0.09 0 0 0 0 -686.132 1766.79 0 0 0 0 0 2016.59 
0 0 0 1815.16 0 0 0 0 0 0 0 0 29.3741 0 0 0 918.683 0 0 0 0 0 0 645.39 -1128.8 0 0 116.199 0 0 -1009.02 0 0 0 -1221.58 0 0 0 0 0 0 0 1058.61 0 0 0 0 0 0 0 0 
0 0 0 0 0 1047.78 0 0 0 0 0 -2125.23 0 0 0 0 0 1947.77 608.005 0 0 0 0 0 0 0 0 0 0 0 0 0 0 0 0 1676.15 2241.51 0 0 0 0 980.789 1176.56 0 0 1819.59 0 0 -1451.99 0 0 
0 0 0 0 0 0 0 0 836.894 0 0 0 0 2194.05 0 0 0 0 0 0 0 0 0 0 0 1440.09 0 0 0 0 1858.65 0 0 0 0 0 848.186 2288.96 0 0 2425.69 0.05 0 0 0 0 0 2004.68 0 0 842.845 
0 0 0 0 0 0 0 0 0 0 0 0 0 0 1968.52 810.8 0 0 1892.68 0 0 0 0 0 0 0 0 0 0 0 0 0 0 0 0 1292.99 0 0 0 -603.122 -20.9815 0 0.02 0 0 0 0 0 0 1000.32 0 
0 0 -137.562 0 0 0 0 2024.06 0 0 0 0 0 0 0 0 0 0 -30.4422 0 0 0 0 0 0 0 0 0 2078.54 -657.903 0 0 0 0 0 0 0 0 -827.586 0 0 0 0 0.09 0 0 0 2376.09 0 0 0 
0 1250.57 0 0 0 0 0 0 0 1627.32 0 0 0 0 0 0 0 0 0 0 0 0 0 0 0 264.519 -1865.21 1733.83 0 0 0 0 0 0 0 0 0 0 -678.655 0 0 0 0 0 0.05 0 0 0 0 -413.449 0 
0 334.254 0 0 2165.36 0 0 142.14 1792.89 0 0 479.064 0 0 0 0 0 0 0 0 0 0 0 0 0 0 2267.45 0 0 0 -1070.67 0 0 0 0 0 0 0 0 0 408.872 0 0 0 0 0.07 -1298.94 0 1618.78 0 0 
0 0 0 0 0 0 0 0 0 0 0 0 0 0 0 1788 0 0 0 0 0 0 -226.676 0 2018.72 0 0 0 -1506.62 0 0 0 0 2478.33 0 0 0 0 0 0 0 0 0 0 0 1305.51 0.03 0 0 0 0 
0 0 0 0 0 0 0 0 0 0 1253.47 0 0 0 1925.95 0 2297.66 0 0 0 0 0 487.762 0 0 0 700.781 0 0 0 0 0 0 0 0 0 0 0 0 0 0 -1108.51 0 -2192.07 0 0 0 0.01 0 -2387.69 0 
0 0 0 0 0 1434.14 0 0 0 126.27 0 0 0 0 0 0 0 0 -135.121 0 0 0 0 0 0 0 0 0 0 0 0 0 0 0 0 0 0 1647.77 0 0 1331.75 0 0 0 0 759.987 0 0 0.05 0 0 
0 0 0 0 0 0 0 0 0 0 0 0 848.643 0 0 0 0 0 0 0 0 0 0 0 0 2481.08 0 0 0 0 -2012.31 0 0 0 0 0 0 0 0 0 0 0 1999.34 0 2184.59 0 0 -1084.86 0 0 0 
0 0 1626.56 0 0 0 0 0 0 0 -1962.42 0 0 0 0 0 0 2310.17 0 0 0 2386.01 0 0 0 0 0 0 0 0 0 0 0 0 0 0 0 0 1736.88 0 0 -823.313 0 0 0 0 0 0 0 0 0.07 
