*Vertices 62
*Matrix 
0.06 94.2259 0 0 -1943.95 0 0 0 0 0 0 0 0 0 -2225.03 0 0 0 1488.92 0 1661.96 -1930.83 0 0 0 2405.7 215.842 0 0 0 871.99 -240.104 0 0 -2290.49 0 161.824 0 2237.69 0 0 0 0 0 0 0 0 0 0 0 0 0 0 0 0 0 0 0 0 0 0 0 
2377.47 0.07 0 0 0 0 0 0 0 -368.13 0 0 2068.93 0 0 0 0 0 0 0 -693.152 0 0 0 0 -1824.93 190.207 2365.57 0 1177.18 0 0 0 0 1961.2 0 0 0 0 0 0 0 0 0 0 0 560.854 1762.98 0 0 0 0 0 0 0 -1147.88 0 0 0 0 0 0 
0 0 0.04 -2294.92 1186.33 1200.52 0 0 -456.633 1527.68 -1543.09 -1685.61 0 0 0 0 797.983 0 0 0 0 0 0 0 0 0 0 0 0 908.917 1802.35 0 1196.71 0 0 0 0 0 0 0 -495.087 0 0 0 0 0 0 0 0 0 2487.49 0 0 0 924.635 0 0 0 0 0 443.663 0 
0 0 190.512 0.05 1548.13 -534.913 410.092 2492.37 0 -727.79 0 0 93.1578 0 0 2125.23 0 0 -1139.33 0 -1649.91 0 2292.32 0 0 275.353 0 0 -1293.15 0 0 0 -1544.62 0 0 0 -484.71 0 0 -213.248 0 0 0 0 0 0 0 0 0 0 0 0 0 0 0 0 0 0 0 0 0 0 
2010.94 0 2071.06 1858.2 0.06 0 0 0 226.829 0 -2292.32 0 0 0 -1225.85 -1941.51 0 0 0 0 0 0 0 0 0 0 22.66 0 270.013 0 2077.93 1425.14 0 0 0 1253.17 0 0 1435.21 0 0 0 -1600.92 0 -1891.77 0 -1326.87 2074.72 0 1733.22 0 0 0 0 -1125.29 0 0 0 0 0 0 0 
0 0 2097.31 -474.944 0 0 0 0 741.829 0 0 0 0 25.5593 0 0 0 2357.48 0 0 0 0 0 0 0 0 196.463 0 0 2093.49 2402.95 0 0 0 -2066.33 1817.15 0 31.0526 0 0 0 0 0 0 0 0 0 0 141.377 -525.605 0 0 0 0 0 0 0 0 0 274.895 0 0 
0 0 0 -2059.77 0 0 0 1666.39 0 0 0 0 0 0 2051.23 1062.88 1671.88 0 0 0 0 0 0 0 0 0 0 235.374 536.592 0 0 0 0 0 -481.506 0 0 0 0 0 0 0 0 0 0 0 -312.586 0 0 0 0 0 0 0 0 0 0 0 0 -1555.6 1509.67 0 
0 0 0 2142.02 0 0 1537.6 0.05 0 0 -246.513 908.917 0 1351.28 0 0 0 1162.98 0 0 0 0 -2429.2 0 0 0 0 0 1924.73 25.8644 0 0 -1202.81 0 0 297.632 0 0 0 0 279.321 0 0 0 0 0 0 0 0 0 1336.48 0 0 0 0 0 0 0 0 0 0 0 
0 0 -615.024 0 2449.8 1681.8 0 0 0.06 -1434.9 0 0 0 0 0 0 0 0 0 0 0 0 0 0 2155.14 0 -1097.52 -48.1429 0 -71.9474 0 -2083.42 221.183 0 0 0 0 0 2097.92 0 0 0 0 0 0 0 0 0 1640.14 0 0 0 0 0 0 0 0 0 -413.907 0 0 0 
0 2360.38 1591.01 -1390.65 0 0 0 0 109.638 0.06 0 0 1215.78 -145.65 0 2187.34 0 182.577 0 0 0 -1204.64 0 0 76.3726 0 0 0 -214.774 0 0 0 0 0 0 2156.06 0 0 0 0 0 0 0 0 0 0 0 0 0 0 0 0 0 0 0 0 0 0 0 0 0 0 
0 0 2456.97 0 1575.59 0 0 2419.58 0 0 0.07 0 1012.99 0 0 0 0 0 0 0 0 0 0 0 -183.645 0 0 0 0 0 0 1309.02 -1011.46 0 2251.27 0 0 0 0 0 0 0 0 0 0 -2048.78 404.752 0 0 0 -351.802 0 0 0 0 0 0 0 -1934.34 0 0 0 
0 0 1962.26 0 0 0 0 228.202 0 0 0 0.05 1819.13 0 0 0 0 0 0 0 0 0 0 0 0 -1960.74 0 0 0 0 -1316.64 0 0 0 0 0 1967.6 0 0 0 0 0 0 0 0 0 0 0 0 0 -17.4718 0 -100.94 0 0 0 0 0 0 -1675.39 0 0 
0 2064.65 0 -2134.85 0 0 0 0 0 1503.57 112.995 -326.319 0.03 -470.672 0 616.398 2168.87 0 0 -2436.06 0 0 0 0 1176.11 0 1867.81 733.436 649.358 0 0 0 0 0 0 0 0 0 -122.913 130.696 -1823.71 0 0 0 0 0 0 0 0 0 0 0 0 0 -1886.27 0 0 0 -776.772 0 0 0 
0 0 0 0 0 2373.04 0 495.087 0 -85.5281 0 0 -565.127 0.02 0 0 0 994.369 0 0 -575.961 0 0 0 -1911.15 0 0 -365.078 1209.83 0 0 1846.6 0 0 0 0 0 0 0 0 0 0 0 0 0 -60.3504 0 0 0 0 0 -1390.35 0 -4.80667 0 0 0 0 0 0 0 0 
-126.118 0 0 0 66.7592 0 2351.83 0 0 0 0 0 0 0 0.09 0 1905.8 0 0 854.137 0 0 0 0 0 1288.11 0 -1098.13 -1170.16 1811.2 0 0 1274.22 0 0 -1885.05 0 -1296.35 0 0 -1760.23 0 0 0 0 2219.38 0 0 0 -519.044 0 -18.2348 0 0 -666.448 0 0 0 0 0 0 0 
0 0 0 -1783.88 -1707.59 0 -660.649 0 0 1037.71 0 0 1731.54 0 0 0.07 0 0 1429.87 0 0 0 0 0 -1964.86 0 322.504 0 1116.6 0 -473.113 2369.23 0 0 0 0 0 0 0 996.811 0 0 0 0 0 0 0 0 0 0 0 -1346.86 26.017 0 0 0 0 -21.7444 0 0 0 0 
0 0 1521.58 0 0 0 -345.241 0 0 0 0 0 438.932 0 2145.22 0 0.05 0 843.455 0 0 2021.77 -1563.39 0 0 313.807 -959.578 -2256 882.214 2408.14 0 0 0 0 0 0 0 713.141 0 0 0 0 0 0 0 0 0 0 0 0 0 1961.04 0 0 0 0 0 0 0 0 0 0 
0 0 0 0 0 -497.528 0 -2129.51 0 -237.358 0 0 0 728.248 0 0 0 0.05 1483.28 0 0 0 1909.92 1271.17 0 0 1510.59 1767.25 0 337.001 0 0 0 0 0 0 0 0 1276.21 1578.19 0 0 0 0 0 0 2480.32 -1631.14 0 0 0 0 1178.4 0 0 0 0 -2021.47 0 272.301 0 0 
862.224 0 0 -2136.83 0 0 0 0 0 0 0 0 0 0 0 1418.88 -128.864 1217.76 0.03 0 0 0 0 0 0 0 1713.69 0 0 0 0 0 0 0 0 0 0 234.001 2208.09 0 0 0 0 2245.32 0 0 0 811.106 0 0 0 0 0 0 0 0 -1340.3 0 0 0 0 0 
0 0 0 0 0 0 0 0 0 0 0 0 1353.27 0 1789.07 0 0 0 0 0.09 0 2405.7 0 0 -405.057 0 0 0 0 0 0 0 352.565 0 0 0 0 0 0 1387.3 0 0 0 0 0 0 0 -218.589 0 0 0 0 0 0 -1024.74 0 0 0 0 0 0 0 
-2352.14 1714.15 0 -1065.94 0 0 0 0 0 0 0 0 0 1654.18 0 0 0 0 0 0 0.09 0 0 2136.83 0 2349.39 0 -1735.51 0 0 0 -1195.79 0 0 0 0 0 0 0 0 0 0 0 0 0 0 0 0 0 0 1421.48 1199.15 0 0 0 0 993.149 0 0 0 0 1336.48 
-1703.92 0 0 0 0 0 0 0 0 1871.17 0 0 0 0 0 0 -1303.98 0 0 2427.52 0 0.04 1105.3 0 0 0 0 2451.32 0 0 1615.27 0 331.507 0 651.189 142.14 0 0 0 0 0 0 0 0 0 0 0 0 0 0 0 0 0 0 0 0 0 0 0 0 -89.6481 0 
0 0 0 1524.93 0 0 0 -2363.58 0 0 0 0 0 0 0 0 779.519 -1028.4 0 0 0 1966.69 0.05 0 0 0 0 173.574 0 122.913 -2168.42 530.03 1440.4 0 0 0 0 0 0 2124.16 0 0 0 0 0 -976.058 0 0 0 0 0 1399.35 0 0 565.432 0 0 0 0 0 0 0 
0 0 0 0 0 0 0 0 0 0 0 0 0 0 0 0 0 759.072 0 0 630.436 0 0 0.07 0 0 0 0 2067.55 0 0 -1971.88 0 916.089 0 0 0 0 0 0 0 0 0 0 0 0 985.366 0 0 0 0 825.907 0 2255.85 0 0 0 0 0 0 0 0 
0 0 0 0 0 0 0 0 -440.916 423.063 1285.82 0 -1394.47 2102.34 0 -176.626 0 0 0 1632.66 0 0 0 0 0.05 0 0 1862.77 0 989.639 0 -943.709 0 643.254 0 0 0 0 0 0 0 0 0 0 0 0 0 0 0 0 0 0 0 369.503 0 0 0 0 0 0 -360.347 0 
-2380.21 373.165 0 -1568.73 0 0 0 0 0 0 0 1784.19 0 0 -1835.15 0 1519.44 0 0 0 64.1652 0 0 0 0 0.05 2342.37 0 0 0 0 0 0 2178.03 0 0 0 0 18.8452 0 0 0 0 0 0 0 0 0 0 0 0 0 0 0 0 0 0 0 0 0 0 0 
1829.36 -510.193 0 0 2236.32 2199.7 0 0 941.267 0 0 0 97.5829 0 0 -336.543 -1300.01 1500.98 -1047.01 0 0 0 0 0 0 -517.212 0.03 0 0 -850.169 0 -1161.76 0 -566.958 1326.11 1612.22 0 -281.61 0 0 0 0 0 0 0 0 0 0 -172.201 0 0 0 2108.91 0 0 0 0 0 0 0 1342.13 0 
0 132.832 0 0 0 0 661.26 0 367.519 0 0 0 -2122.49 2237.69 1874.98 0 498.444 865.123 0 0 2036.58 1793.8 2175.89 0 2021.77 0 0 0.07 0 0 267.113 0 0 -1708.66 -2355.34 0 0 -650.578 0 0 -691.321 0 0 0 1119.19 0 0 0 0 0 0 0 0 0 0 0 0 0 0 0 0 0 
0 0 0 2357.63 2005.6 0 158.773 -1123.77 0 -331.05 0 0 1859.26 2440.34 -2229.45 -1393.25 1666.84 0 0 0 0 0 0 1610.69 0 0 0 0 0.09 986.282 0 2130.57 0 0 0 0 2260.89 -1479 0 0 0 0 0 0 0 0 0 0 0 0 0 -1715.37 0 0 0 1692.94 0 -1428.04 0 0 0 0 
0 2235.71 -462.584 0 0 2303.77 0 -773.11 -1773.81 0 0 0 0 0 -903.272 0 1869.18 1332.82 0 0 0 0 769.906 0 27.543 0 1571.78 0 2139.27 0.09 -1128.96 2247.76 0.228889 0 2019.03 0 0 1598.79 0 -2248.99 0 0 0 0 0 0 0 0 0 0 0 0 -401.395 0 0 432.829 0 0 0 1357.54 0 0 
188.986 0 2083.73 0 910.291 -1633.88 0 0 0 0 0 -125.66 0 0 0 2299.49 0 0 0 0 0 -219.199 1307.03 0 0 0 0 -2020.4 0 -144.581 0.04 0 945.845 0 0 0 0 0 -281.915 0 0 -1875.44 -650.578 290.765 -469.146 0 0 2405.7 0 0 0 0 0 0 0 0 0 0 0 0 0 0 
1924.42 0 0 0 1976.3 0 0 0 384.304 0 -1095.08 0 0 1333.28 0 470.824 0 0 0 0 -343.257 0 1533.17 1316.49 2152.09 0 2335.35 0 2187.8 -1806.31 0 0.09 0 -839.793 0 0 0 0 0 0 0 0 2065.87 0 -18.9978 1564.61 0 0 0 0 0 0 0 0 2046.65 0 -1578.19 0 0 0 0 0 
0 0 2276.45 2337.18 0 0 0 2128.59 2408.9 0 -1766.95 0 0 0 -685.675 0 0 0 0 12.2837 0 -1571.47 687.048 0 0 0 0 0 0 1248.28 -637.303 0 0.02 245.598 0 0 0 0 -312.281 2291.1 0 0 -1630.83 0 1985.61 0 0 0 0 0 0 0 0 0 0 0 0 0 -1977.52 0 0 0 
0 0 0 0 0 0 0 0 0 0 0 0 0 0 0 0 0 0 0 0 0 0 0 -976.363 1687.6 2191.31 1594.82 1018.78 0 0 0 -916.852 2475.89 0.06 -1670.51 -670.263 948.897 0 0 0 0 0 0 154.042 0 0 0 -2385.4 0 0 0 0 0 0 0 0 0 0 0 0 0 0 
-627.689 -2165.21 0 0 0 1283.99 -433.592 0 0 0 276.269 0 0 0 0 0 0 0 0 0 0 1611 0 0 0 0 1041.37 -575.35 0 1380.58 0 0 0 830.943 0.06 0 0 0 0 2465.36 0 0 0 0 0 0 0 0 0 0 0 0 0 0 0 -1243.25 0 -1402.55 0 0 0 0 
0 0 0 0 1335.72 1409.27 0 -1175.34 0 -896.405 0 0 0 0 -469.451 0 0 0 0 0 0 -397.122 0 0 0 0 2112.87 0 0 0 0 0 0 1020.62 0 0.04 720.008 1616.95 0 0 0 0 0 0 0 0 0 0 0 0 0 0 0 0 0 0 0 0 0 -1553.77 0 0 
1311.46 0 0 1108.36 0 0 0 0 0 0 0 1430.48 0 0 0 0 0 0 0 0 0 0 0 0 0 0 0 0 -262.688 0 0 0 0 2324.21 0 787.912 0.07 -692.846 0 -759.072 0 0 0 0 0 0 0 0 0 0 0 0 0 0 0 0 0 -1787.09 0 0 1378.44 0 
0 0 0 0 0 487.457 0 0 0 0 0 0 0 0 476.47 0 1741.31 0 1967.15 0 0 0 0 0 0 0 1926.4 -1386.99 -463.195 -763.039 0 0 0 0 0 666.448 2256.61 0.06 0 0 0 -1511.66 0 0 0 0 -759.072 0 0 0 0 0 0 23.1178 0 0 0 0 0 0 0 0 
172.201 0 0 0 -780.282 0 0 0 -2407.22 0 0 0 1593.75 0 0 0 0 420.164 686.895 0 0 0 0 0 0 416.349 0 0 0 0 1048.39 0 373.775 0 0 0 0 0 0.09 0 0 0 0 0 0 0 0 0 0 0 -327.54 0 0 0 0 0 1284.75 -1766.49 0 0 -1025.35 441.221 
0 0 0 1977.68 0 0 0 0 0 0 0 0 1325.95 0 0 158.62 0 -338.832 0 -754.952 0 0 1918.93 0 0 0 0 0 0 1733.07 0 0 616.245 0 -374.538 0 8.46889 0 0 0.05 -740.15 0 0 0 0 0 0 -215.079 0 0 0 0 -67.8274 0 0 0 0 -911.664 0 0 0 0 
0 0 651.341 0 0 0 0 1371.27 0 0 0 0 -1276.67 0 2395.78 0 0 0 0 0 0 0 0 0 0 0 0 1889.93 0 0 0 0 0 0 0 0 0 0 0 165.029 0.03 -1243.4 0 0 0 0 0 -135.884 -2382.35 0 0 0 0 0 0 0 0 0 0 0 0 0 
0 0 0 0 0 0 0 0 0 0 0 0 0 0 0 0 0 0 0 0 0 0 0 0 0 0 0 0 0 0 -461.669 0 0 0 0 0 0 1950.21 0 0 345.698 0.07 0 0 0 0 0 0 1368.68 0 0 0 0 0 0 0 0 2328.03 1938.76 0 0 0 
0 0 0 0 -1693.85 0 0 0 0 0 0 0 0 0 0 0 0 0 0 0 0 0 0 0 0 0 0 0 0 0 726.417 755.409 2312.01 0 0 0 0 0 0 0 0 0 0.04 47.6852 0 0 0 0 0 176.931 0 0 0 0 0 -1490.14 0 0 0 0 0 0 
0 0 0 0 0 0 0 0 0 0 0 0 0 0 0 0 0 0 1224.78 0 0 0 0 0 0 0 0 0 0 0 -889.996 0 0 1325.34 0 0 0 0 0 0 0 0 1536.07 0.03 0 0 0 0 0 0 0 0 0 0 0 0 0 0 1670.96 0 0 0 
0 0 0 0 1289.94 0 0 0 0 0 0 0 0 0 0 0 0 0 0 0 0 0 0 0 0 0 0 118.336 0 0 -1414.46 -1328.7 2102.5 0 0 0 0 0 0 0 0 0 0 0 0.04 0 0 0 0 0 0 0 0 0 0 0 0 0 0 2420.8 0 0 
0 0 0 0 0 0 0 0 0 0 454.802 0 0 1510.28 118.183 0 0 0 0 0 0 0 2126.15 0 0 0 0 0 0 0 0 2058.09 0 0 0 0 0 0 0 0 0 0 0 0 0 0.02 0 0 0 0 1363.34 0 0 0 583.895 0 0 0 0 0 0 0 
0 858.409 0 0 1771.98 0 38.8348 0 0 0 1041.52 0 0 0 0 0 0 1379.97 0 0 0 0 0 -1679.82 0 0 0 0 0 0 0 0 0 0 0 0 0 -93.7681 0 0 0 0 0 0 0 0 0 0 0 0 0 0 -1343.65 0 0 0 0 0 0 0 0 0 
0 -2103.41 0 0 438.475 0 0 0 0 0 0 0 0 0 0 0 0 -1240.65 1561.4 750.069 0 0 0 0 0 0 0 0 0 0 -2326.96 0 0 2024.98 0 0 0 0 0 2424.77 1197.32 0 0 0 0 0 0 0.04 0 0 0 0 2325.43 -1047.01 0 0 -1084.7 0 0 -1089.74 0 0 
0 0 0 0 0 681.402 0 0 110.553 0 0 0 0 0 0 0 0 0 0 0 0 0 0 0 0 0 1249.5 0 0 0 0 0 0 0 0 0 0 0 0 0 1584.9 1774.42 0 0 0 0 0 0 0 0 0 0 0 0 -93.4629 0 0 0 -2126.76 0 0 0 
0 0 0 0 1926.71 2091.81 0 0 0 0 0 0 0 0 -888.318 0 0 0 0 0 0 0 0 0 0 0 0 0 0 0 0 0 0 0 0 0 0 0 0 0 0 0 52.4155 0 0 0 0 0 0 0.04 0 0 0 -756.478 0 0 0 0 0 0 0 1225.39 
0 0 1440.86 0 0 0 0 2225.79 0 0 977.584 425.657 0 0 0 0 0 0 0 0 -2231.44 0 0 0 0 0 0 0 0 0 0 0 0 0 0 0 0 0 -2336.73 0 0 0 0 0 0 98.9563 0 0 0 0 0.04 0 0 0 0 0 832.316 -764.565 0 0 0 0 
0 0 0 0 0 0 0 0 0 0 0 0 0 -2498.02 1587.8 959.731 2358.85 0 0 0 -306.635 0 -2491.3 -1456.57 0 0 0 0 2305.6 0 0 0 0 0 0 0 0 0 0 0 0 0 0 0 0 0 0 0 0 0 0 0.03 0 0 0 0 0 0 0 0 0 0 
0 0 0 0 0 0 0 0 0 0 0 -9.23185 0 0 0 -295.343 0 1799.45 0 0 0 0 0 0 0 0 1129.26 0 0 -1347.62 0 0 0 0 0 0 0 0 0 1455.81 0 0 0 0 0 0 16.2511 1746.35 0 0 0 0 0.03 1762.22 0 0 0 0 0 0 -1990.95 0 
0 0 0 0 0 0 0 0 0 0 0 0 0 2196.8 0 0 0 0 0 0 0 0 0 2485.66 682.775 0 0 0 0 0 0 0 0 0 0 0 0 -1387.91 0 0 0 0 0 0 0 0 0 7.70592 0 2232.35 0 0 1136.28 0.02 0 0 0 0 0 0 0 0 
0 0 -965.529 0 -1464.2 0 0 0 0 0 0 0 400.632 0 1421.32 0 0 0 0 1206.17 0 0 1048.69 0 0 0 0 0 0 0 0 1099.2 0 0 0 0 0 0 0 0 0 0 0 0 0 1409.57 0 0 -2488.86 0 0 0 0 0 0.07 318.079 0 0 0 0 0 0 
0 -1141.32 0 0 0 0 0 0 0 0 0 0 0 0 0 0 0 0 0 0 0 0 0 0 0 0 0 0 -1071.73 1941.21 0 0 0 0 838.267 0 0 0 0 0 0 0 98.3459 0 0 0 0 0 0 0 0 0 0 0 -35.6304 0.09 0 0 0 0 0 0 
0 0 0 0 0 0 0 0 0 0 0 0 0 0 0 0 0 0 456.328 0 1348.38 0 0 0 0 0 0 0 0 0 0 2280.11 0 0 0 0 0 0 -257.347 0 0 0 0 0 0 0 0 2351.53 0 0 -312.433 0 0 0 0 0 0.06 0 0 0 0 -183.035 
0 0 0 0 0 0 0 0 0 0 0 0 0 0 0 812.479 0 -1524.17 0 0 0 0 0 0 0 0 0 0 741.371 0 0 0 0 0 -1951.89 0 393.307 0 1806.16 1096.3 0 -532.777 0 0 0 0 0 0 0 0 -300.989 0 0 0 0 0 0 0.02 0 0 0 2431.79 
0 0 0 0 0 0 0 0 978.805 0 1394.01 0 198.599 0 0 0 0 0 0 0 0 0 0 0 0 0 0 0 0 0 0 0 2210.07 0 0 0 0 0 0 0 0 -2144.92 0 327.845 0 0 0 0 -192.495 0 0 0 0 0 0 0 0 0 0.06 0 0 0 
0 0 0 0 0 -316.248 860.851 0 0 0 0 -2045.12 0 0 0 0 0 1873.3 0 0 0 0 0 0 0 0 0 0 0 -945.235 0 0 0 0 0 -1814.71 0 0 0 0 0 0 0 0 2251.12 0 0 802.866 0 0 0 0 0 0 0 0 0 0 0 0 0 0 
0 0 -817.057 0 0 0 895.489 0 0 0 0 0 0 0 0 0 0 0 0 0 0 -1271.94 0 0 -1519.59 0 1850.87 0 0 0 0 0 0 0 0 0 2489.17 0 -2057.94 0 0 0 0 0 0 0 0 0 0 0 0 0 2467.96 0 0 0 0 0 0 0 0.07 0 
0 0 0 0 0 0 0 0 0 0 0 0 0 0 0 0 0 0 0 0 1790.75 0 0 0 0 0 0 0 0 0 0 0 0 0 0 0 0 0 1806.77 0 0 0 0 0 0 0 0 0 0 2239.68 0 0 0 0 0 0 1995.99 629.368 0 0 0 0.08 
