*Vertices 50
*Matrix 
0.04 0 0 0 0 0 0 0 0 -199.362 0 0 0 0 0 0 0 1544.01 0 0 -1896.95 0 -978.652 -1028.86 0 0 2055.04 0 0 0 0 1894.36 -143.208 0 0 151.906 0 0 2304.68 0 -123.066 0 0 0 0 0 0 0 0 0 
0 0.08 0 1229.67 0 0 0 0 -1558.2 0 0 -1739.48 0 -793.558 1065.17 0 1216.39 0 0 -2167.35 0 0 0 0 1387.3 0 0 0 -1978.9 0 1902.6 1576.66 0 0 0 1340.3 760.598 2239.22 2335.51 0 -584.658 0 -394.07 0 -1539.43 0 0 0 0 0 
0 0 0.04 0 0 0 -1998.28 1552.1 1985.92 0 0 0 0 0 0 0 -1018.17 2015.98 1800.36 0 -1665.93 0 0 0 0 0 0 0 0 2234.79 0 0 0 -2065.87 0 0 0 0 0 0 0 -768.685 0 0 3.12815 0 0 -1385.62 0 0 
0 99.7192 0 0.08 0 0 0 -23.2704 2486.27 -923.414 0 2023.91 423.826 560.396 0 0 0 0 0 -825.907 0 -408.567 2153.61 0 174.032 0 0 0 2026.2 0 0 0 0 0 1084.25 0 0 0 0 0 0 0 0 197.226 0 33.0363 0 0 0 0 
0 0 0 0 0.09 0 0 0 0 0 0 0 0 206.076 0 0 0 0 0 0 0 0 0 0 0 0 0 0 0 0 -702.765 -1025.96 -198.141 0 0 0 2402.95 0 0 0 0 0 0 0 0 0 0 0 0 0 
0 0 0 0 0 0.06 957.289 0 -788.827 1443.14 0 -2494.2 0 1238.36 0 -1913.89 0 0 0 0 335.17 0 0 1705.76 0 0 2209.16 -44.9385 0 0 2187.8 0 787.149 0 332.423 0 0 0 0 0 0 0 0 761.971 0 0 0 0 0 0 
0 0 2464.14 0 0 -474.944 0.02 0 0 -1169.7 0 0 0 -2142.78 0 0 0 0 0 936.079 0 0 0 0 0 0 0 0 0 0 0 0 1616.49 739.54 0 0 -884.655 0 0 0 0 0 0 0 0 0 0 0 15.4881 0 
0 0 1712.32 -220.115 0 0 0 0.02 1020 0 0 0 861.614 0 0 0 -962.325 0 1535.46 0 1975.69 0 2312.01 0 0 0 685.369 1952.19 0 0 -943.251 0 0 0 0 2236.17 0 0 -1674.93 -233.543 0 0 0 0 0 0 0 0 0 0 
0 -449.004 151.906 -1932.97 0 1837.44 0 -309.076 0.09 0 0 0 0 0 0 2313.23 0 0 -1425.9 0 0 0 0 1974.32 0 0 0 0 0 0 0 0 0 0 1566.9 0 0 0 0 0 0 0 0 0 0 0 0 -2329.86 0 0 
237.358 0 0 211.112 0 -2266.99 1096.45 0 0 0.07 0 0 0 -674.688 0 0 0 0 914.258 0 0 1430.78 0 0 1064.87 0 384.762 1872.54 0 0 -405.057 0 0 145.802 0 0 385.83 0 1410.95 0 0 0 861.461 0 0 0 0 0 0 -647.221 
0 0 0 0 0 0 0 0 0 0 0.01 1973.86 0 0 0 0 0 0 0 2046.49 486.389 0 0 1859.87 0 0 0 1297.42 2495.27 0 0 0 0 1742.23 -176.168 0 0 1282.77 0 0 0 0 -45.5489 0 0 0 0 0 0 -1562.47 
0 783.181 0 -1044.27 0 585.116 0 0 0 0 1312.68 0.02 0 933.18 0 0 0 0 0 0 0 0 0 1253.93 1788.77 0 -478.149 815.683 0 0 0 0 0 0 0 0 -948.744 0 0 0 0 0 0 0 0 0 0 0 1589.48 0 
0 0 0 1627.78 0 0 0 2048.94 0 0 0 0 0.09 0 0 0 0 0 0 0 0 0 0 0 0 0 0 0 0 0 0 2215.57 495.087 -806.375 0 0 0 0 2060.38 0 1210.59 1542.33 -2044.51 0 0 0 0 0 0 0 
0 -846.66 0 2360.99 -1286.74 -351.497 1918.32 0 0 -1442.23 0 1671.12 0 0.04 -471.74 0 0 2245.63 1465.58 -541.627 0 1892.99 0 0 0 0 0 0 0 -1405.15 0 0 1449.1 0 2452.39 0 0 2096.09 11.063 0 0 0 0 0 0 0 0 0 0 -2303.61 
0 461.669 0 0 0 0 0 0 0 0 0 0 0 -1044.88 0.08 0 0 0 0 0 795.541 0 0 2051.23 0 1009.63 864.055 352.107 0 0 1848.89 0 0 0 -1454.89 -657.903 1116.75 0 0 1940.44 0 0 0 0 0 0 0 0 0 0 
0 0 0 0 0 1965.62 0 0 1509.37 0 0 0 0 0 0 0.03 0 -680.792 0 0 0 0 0 0 -1772.44 0 -542.39 0 0 0 0 1484.04 -2010.03 0 1791.21 0 1804.33 0 0 0 0 0 0 0 0 0 -2375.64 0 0 2386.32 
0 -2425.69 -2343.29 0 0 0 0 2388.45 0 0 0 0 0 0 0 0 0.01 0 0 0 0 2491.61 0 0 0 0 2161.55 0 0 1749.55 0 0 0 -1376.61 0 0 0 2183.68 -2496.8 0 0 0 0 0 0 -2034.14 0 0 0 0 
1086.38 0 -295.343 0 0 0 0 0 0 0 0 0 0 -2497.25 0 2058.24 0 0.09 0 0 2070.15 0 0 1686.83 -1178.24 0 110.553 1306.12 0 0 0 0 0 0 0 0 0 1648.53 0 0 2281.64 0 0 0 0 0 0 0 0 0 
0 0 1555.15 0 0 0 0 2172.08 -1762.06 2391.51 0 0 0 187.918 0 0 0 0 0.07 0 0 0 808.969 0 1092.79 0 0 0 1110.95 0 0 0 0 0 0 0 0 0 0 462.889 0 0 0 0 0 0 0 0 0 0 
0 2321.62 0 -1311.76 0 0 -602.512 0 0 0 -1767.4 0 0 -2286.07 0 0 0 0 0 0.02 0 0 0 0 0 652.562 0 0 0 310.602 0 0 -1426.51 0 892.285 1382.41 0 0 2465.06 0 0 0 0 0 0 0 0 0 0 0 
1536.23 0 -1049 0 0 -2062.52 0 301.294 0 0 -1527.68 0 0 0 2016.28 0 0 1986.37 0 0 0.05 0 0 0 0 0 -287.103 964.461 0 0 0 0 0 89.9533 0 0 59.5874 0 461.058 1078.45 0 0 0 0 0 0 0 -642.033 0 0 
0 0 0 -94.8363 0 0 0 0 0 2109.67 0 0 0 -2378.99 0 0 -1242.79 0 0 0 0 0 1746.19 0 0 2236.78 994.674 0 0 0 0 0 0 0 0 0 0 -1431.55 0 0 -47.38 0 0 0 0 0 1807.08 0 0 0 
-2083.88 0 0 -129.322 0 0 0 414.975 0 0 0 0 0 0 0 0 0 0 1504.03 0 0 -735.572 0.02 0 1512.88 0 0 0 1336.48 0 0 1983.93 0 -492.34 8.77407 -1048.39 0 0 0 0 0 0 0 0 0 0 1851.94 0 0 0 
50.4318 0 0 0 0 1907.03 0 0 -1571.47 0 -902.966 2143.85 0 0 -292.901 0 0 2429.04 0 0 0 0 0 0.08 0 2219.08 0 0 0 1701.18 -1051.9 0 0 0 0 0 225.303 -2083.73 0 0 0 0 0 0 0 0 0 0 0 0 
0 1215.02 0 682.928 0 0 0 0 0 -812.021 0 2424.31 0 0 0 197.684 0 -670.873 136.494 0 0 0 1242.03 0 0.07 0 1256.68 -2081.74 -2098.07 0 0 -110.706 0 1984.85 0 0 0 1135.67 0 0 0 0 0 0 -667.364 0 0 -925.855 0 0 
0 0 0 0 0 0 0 0 0 0 0 0 0 0 -623.875 0 0 0 0 2330.62 0 -723.823 0 2122.49 0 0.06 0 0 0 508.667 0 -1568.42 0 0 0 0 0 0 366.756 0 0 0 0 0 0 0 0 0 0 0 
-570.162 0 0 0 0 1052.2 0 928.602 0 73.9311 0 1786.63 0 0 -784.86 -957.442 13.0467 1973.4 0 0 999.1 1664.71 0 0 -2218.01 0 0.08 0 0 0 0 0 1292.08 0 2175.89 2246.7 0 1714.3 0 0 0 0 0 0 0 -498.901 0 0 -1989.88 0 
0 0 0 0 0 -1654.18 0 1100.57 0 483.184 790.963 -2431.18 0 0 444.426 0 0 -680.639 0 0 1320.31 0 0 0 -1765.27 0 0 0.09 0 2436.22 0 0 0 0 0 0 0 653.172 0 0 0 0 0 0 0 0 0 0 0 0 
0 2204.12 0 805.46 0 0 0 0 0 0 -593.204 0 0 0 0 0 0 0 1277.89 0 0 0 1019.55 0 883.892 0 0 0 0.07 0 1832.41 0 -1068.53 0 0 0 0 658.208 0 0 0 0 0 0 0 0 750.374 0 0 0 
0 0 2328.79 0 0 0 0 0 0 0 0 0 0 934.248 0 0 -2360.07 0 0 1711.71 0 0 0 1915.11 0 900.677 0 1248.89 0 0.08 0 0 0 1803.26 0 0 0 -1793.95 0 0 0 0 0 -2317.04 0 0 0 542.543 0 0 
0 2247.92 0 0 675.604 841.929 0 -1881.08 0 -1549.5 0 0 0 0 -558.107 0 0 0 0 0 0 0 0 1617.25 0 0 0 0 1993.55 0 0.04 0 640.355 0 0 0 0 0 0 0 0 0 0 0 0 0 0 0 0 -720.923 
1748.63 1175.5 0 0 818.43 0 0 0 0 0 0 0 1726.81 0 0 -489.135 0 0 0 0 0 0 836.436 0 -1894.21 2072.74 0 0 0 0 0 0.06 0 0 0 0 0 0 0 0 0 0 0 0 0 0 0 0 0 0 
375.759 0 0 0 1652.2 2387.08 989.181 0 0 0 0 0 -980.331 1067.61 0 1751.23 0 0 0 -1825.39 0 0 0 0 0 0 2259.67 0 116.199 0 408.261 0 0.09 0 0 0 0 0 0 2452.09 0 0 0 0 -805.765 0 0 0 -2460.94 1077.84 
0 0 222.861 0 0 0 1595.28 0 0 -1160.85 1317.87 0 -251.396 0 0 0 -311.06 0 0 0 -972.396 0 2413.02 0 1169.24 0 0 0 0 2058.55 0 0 0 0 648.9 0 0 -715.278 0 0 0 0 0 0 2252.65 0 0 0 0 0 
0 0 0 -1469.08 0 1984.24 0 0 -2293.54 0 2302.55 0 0 -1523.26 -90.1059 1125.6 0 0 0 2407.22 0 0 2333.52 0 0 0 1570.41 0 0 0 0 0 0 2119.28 0.08 0 0 0 459.99 0 0 0 0 0 0 -134.816 0 0 0 0 
-1562.47 -2161.55 0 0 0 0 0 2034.9 0 0 0 0 0 0 1615.42 0 0 0 0 -334.712 0 0 1656.77 0 0 0 -2218.92 0 0 0 0 0 0 0 0 0 -14.42 0 0 162.282 1074.18 -961.715 0 0 0 0 0 0 0 0 
0 1807.69 0 0 2333.52 0 1336.48 0 0 1225.24 0 -22.3548 0 0 -1609.47 -1435.82 0 0 0 0 -601.901 0 0 -812.326 0 0 0 0 0 0 0 0 0 0 0 868.938 0.06 0 -584.658 0 0 938.368 0 0 0 0 0 0 0 0 
0 2199.09 0 0 0 0 0 0 0 0 1870.71 0 0 882.977 0 0 1764.66 1921.22 0 0 0 1211.51 0 -1393.25 753.121 0 1003.83 275.201 2248.83 -1024.58 0 0 0 2169.18 0 0 0 0.05 0 0 0 0 0 0 1520.51 0 0 1913.13 0 0 
-2488.25 -1885.51 0 0 0 0 0 2337.49 0 -217.521 0 0 2081.29 1893.14 0 0 -1372.8 0 0 2333.52 -13.9622 0 0 0 0 -443.358 0 0 0 0 0 0 0 0 -915.021 0 -10.6052 0 0.09 905.713 957.442 944.014 0 0 0 0 0 0 -2162.77 0 
0 0 0 0 0 0 0 -2363.12 0 0 0 0 0 0 619.144 0 0 0 -171.743 0 -299.463 0 0 0 0 0 0 0 0 0 0 0 1016.95 0 0 497.528 0 0 1262.32 0.06 0 0 0 0 0 0 0 0 0 1311.15 
1237.91 -931.806 0 0 0 0 0 0 0 0 0 0 604.343 0 0 0 0 117.267 0 0 0 1208.61 0 0 0 0 0 0 0 0 0 0 0 0 0 -2270.04 0 0 445.799 0 0.05 0 0 0 -449.614 0 0 0 0 0 
0 0 1445.59 0 0 0 0 0 0 0 0 0 504.242 0 0 0 0 0 0 0 0 0 0 0 0 0 0 0 0 0 0 0 0 0 0 1197.62 1453.52 0 -978.5 0 0 0.08 0 0 0 0 0 0 0 0 
0 -1454.28 0 0 0 0 0 0 0 2111.8 1746.04 0 1565.22 0 0 0 0 0 0 0 0 0 0 0 0 0 0 0 0 0 0 0 0 0 0 0 0 0 0 0 0 0 0.02 0 0 0 0 0 0 0 
0 0 0 1336.79 0 443.815 0 0 0 0 0 0 0 0 0 0 0 0 0 0 0 0 0 0 0 0 0 0 0 296.869 0 0 0 0 0 0 0 0 0 0 0 0 0 0.01 0 0 0 0 0 0 
0 2220.76 1475.95 0 0 0 0 0 0 0 0 0 0 0 0 0 0 0 0 0 0 0 0 0 2272.94 0 0 0 0 0 0 0 -1396.76 933.943 0 0 0 -1217.76 0 0 -1165.58 0 0 0 0.07 0 0 0 0 0 
0 0 0 1130.79 0 0 0 0 0 0 0 0 0 0 0 0 -15.6407 0 0 0 0 0 0 0 0 0 2315.06 0 0 0 0 0 0 0 868.328 0 0 0 0 0 0 0 0 0 0 0.07 0 -1988.66 0 0 
0 0 0 0 0 0 0 0 0 0 0 0 0 0 0 -136.036 0 0 0 0 0 1398.74 -1079.67 0 0 0 0 0 1441.92 0 0 0 0 0 0 0 0 0 0 0 0 0 0 0 0 0 0.02 0 1525.39 0 
0 0 1950.36 0 0 0 0 0 -384.762 0 0 0 0 0 0 0 0 0 0 0 2193.9 0 0 0 -1903.06 0 0 0 0 2117.6 0 0 0 0 0 0 0 -205.924 0 0 0 0 0 0 0 -79.4244 0 0.06 1887.34 0 
0 0 0 0 0 0 1922.74 0 0 0 0 200.278 0 0 0 0 0 0 0 0 0 0 0 0 0 0 -1981.03 0 0 0 0 0 -1734.44 0 0 0 0 0 539.796 0 0 0 0 0 0 0 11.5207 2107.84 0 0 
0 0 0 0 0 0 0 0 0 1582.16 709.021 0 0 1589.33 0 1695.07 0 0 0 0 0 0 0 0 0 0 0 0 0 0 763.649 0 -1442.99 0 0 0 0 0 0 2389.83 0 0 0 0 0 0 0 0 0 0.06 
