*Vertices 54
*Matrix 
0.02 1616.64 0 0 0 0 0 0 0 1363.8 0 0 1966.84 0 0 0 0 0 0 0 2232.2 0 0 0 0 0 -2189.47 -407.956 2247.92 0 1852.24 -2264.55 0 0 88.58 0 0 -2081.9 -2058.7 0 0 0 0 497.528 0 0 1032.36 0 0 376.217 0 0 0 0 
2028.49 0.06 0 0 -1595.43 0 0 -219.199 0 689.032 0 1878.03 0 0 1344.42 0 0 0 0 2238.91 0 1124.38 194.327 0 0 -866.039 0 0 0 0 0 1628.24 0 1737.95 0 0 0 0 -10.3 0 0 0 -2065.42 0 -338.221 -1830.58 0 1840.8 0 0 0 -2387.23 0 0 
0 0 0.02 -2135.76 0 2016.89 0 1117.51 0 -1913.28 0 0 0 0 0 0 0 0 0 0 0 0 -2160.48 0 -671.941 0 0 0 664.312 0 0 1710.79 0 0 0 0 0 0 0 0 0 2438.96 0 471.282 0 0 0 0 455.718 2055.35 0 0 0 0 
0 0 1945.02 0 0 1767.1 0 0 862.835 0 0 -110.401 411.008 0 0 -575.045 0 -519.349 0 0 2076.71 0 0 0 0 0 0 0 714.667 0 0 0 0 -1769.84 270.165 0 0 668.279 0 2460.78 0 0 0 0 0 -855.205 0 1722.39 0 0 0 1976.3 0 0 
0 2317.19 0 0 0.09 0 0 0 -1891.92 0 2417.29 0 0 -2366.48 0 0 0 0 0 1364.1 0 0 0 0 0 0 0 0 0 0 0 1693.09 0 -1248.59 1369.29 1875.74 -1573 -1695.84 0 -80.4926 0 0 1869.18 864.208 1761.45 630.131 0 0 995.132 0 -534.913 2407.07 0 0 
0 0 676.824 -541.932 0 0.08 -494.781 0 0 1790.44 1030.23 2030.17 0 2309.26 0 0 0 -877.483 0 1407.59 0 0 0 839.793 0 0 0 0 0 0 0 0 2461.09 0 0 0 0 471.435 0 0 0 0 0 0 0 0 0 -204.855 0 0 0 0 -1332.67 0 
0 0 0 0 0 979.72 0.04 -1999.65 0 0 0 0 0 0 0 0 1116.9 0 0 -2346.34 0 0 0 -1244.32 2306.05 1660.28 0 0 0 0 0 1599.55 0 -1294.52 -1045.64 841.624 1177.79 837.046 0 0 -430.845 0 0 0 0 0 0 0 0 0 1666.69 -570.62 0 0 
0 944.929 -411.771 0 0 0 851.085 0.04 1500.98 387.204 -612.43 0 0 0 -719.398 0 0 2301.63 2057.33 2217.25 0 0 0 0 0 0 1737.04 0 0 25.2541 -382.778 0 -399.869 -1594.06 546.815 0 0 -544.679 0 0 0 0 0 0 0 0 0 1961.81 0 -813.395 722.144 0 0 0 
0 0 0 1731.09 -2407.99 0 0 -1077.23 0.09 0 0 0 1028.86 192.19 0 913.953 0 0 0 496.46 0 0 0 0 0 2350.61 0 0 0 0 0 0 -872.753 0 0 0 0 0 0 0 0 0 0 0 1465.73 0 0 0 -1352.05 0 0 0 0 0 
-1236.99 -1595.28 1009.17 0 0 278.1 0 -1002.61 0 0 0 0 313.044 353.175 339.595 1518.68 -1972.03 2379.6 0 732.673 0 0 -1765.27 0 0 1801.43 -558.412 0 0 0 0 -998.489 0 766.091 1463.29 0 2028.95 0 0 -1351.28 0 0 0 -997.116 -711.31 0 2196.34 0 0 0 0 0 0 0 
0 0 0 0 -5.26444 2172.23 0 -60.1978 0 0 0 0 0 0 0 -1521.27 1180.68 0 0 2109.82 0 0 0 0 0 0 0 0 0 869.091 0 -510.041 -2183.22 0 0 -1921.52 0 0 2296.9 0 0 0 0 -97.2777 0 0 0 0 0 0 -2306.51 0 1439.94 0 
0 718.787 0 1237.75 0 816.141 0 0 0 0 0 0.02 2169.48 0 0 0 0 0 0 0 0 0 0 0 0 0 0 0 0 0 0 0 0 0 0 1811.66 0 0 0 0 0 -1218.83 0 0 0 0 0 0 -2288.51 -2235.71 175.558 0 2290.34 0 
979.873 0 0 -1395.23 0 0 0 0 -840.556 -597.018 0 -489.898 0.07 -2282.1 0 0 1068.53 706.885 0 -2076.71 0 0 0 0 0 0 0 288.324 0 0 2200.16 661.565 0 0 0 0 0 2134.54 0 0 0 -125.813 -1087.15 0 0 0 0 0 2294.61 0 0 0 62.9444 0 
0 0 0 0 371.639 -1461.3 0 0 -2176.5 407.346 0 0 919.752 0.05 0 0 1103.17 0 0 0 0 0 0 0 1348.69 -1434.75 0 1054.95 0 0 0 0 2026.35 0 0 0 0 0 0 -2003.16 1867.05 0 -502.564 0 0 2041.31 0 0 1823.1 0 2389.37 722.602 275.048 0 
0 2358.09 0 0 0 0 0 2020.4 0 -1995.38 0 0 0 0 0.09 0 363.857 1749.09 0 0 441.069 0 0 -1718.73 0 0 0 0 0 0 0 0 309.687 0 0 1131.4 0 0 0 0 0 0 0 0 0 0 0 0 -293.512 891.217 2176.05 1480.07 0 0 
0 0 0 1504.49 0 0 0 0 593.204 1077.07 2093.49 0 0 0 0 0.05 0 0 0 0 -1284.91 0 0 0 0 0 0 0 0 -1799.91 0 0 -178.762 880.078 0 0 0 0 0 0 0 -3.58592 0 297.327 0 0 0 0 0 0 0 0 0 -1546.14 
0 0 0 0 0 0 1662.88 0 0 1650.36 -1530.27 0 1940.14 -106.281 -707.19 0 0.01 -1175.04 0 0 0 -2016.28 438.169 -1318.93 0 0 0 0 0 2301.78 1195.49 1593.6 0 0 0 0 0 1558.35 0 0 0 -979.415 0 1439.02 0 0 2255.7 0 0 0 0 0 -1372.19 0 
0 0 0 -1627.48 0 1833.93 0 1222.5 0 571.078 0 0 2114.09 0 259.789 0 -52.4155 0.03 0 0 1554.08 0 2243.64 0 -106.281 1695.99 261.315 2044.66 0 0 0 159.841 0 592.898 0 0 0 0 0 1462.07 0 0 0 -170.98 -2303.46 488.678 0 144.276 -553.529 532.167 0 0 -710.852 0 
0 0 0 0 0 0 0 809.732 0 0 0 0 0 0 0 0 0 0 0 0 2293.54 0 0 0 0 0 0 0 0 0 -2472.08 0 422.758 0 0 0 962.325 0 0 0 0 0 0 0 -334.864 0 -1345.18 0 0 0 0 0 0 0 
0 1800.21 0 0 526.063 2132.25 -2487.18 1620.3 -32.5785 -1175.34 1714.91 0 -960.341 0 0 0 0 0 0 0.08 0 0 1208.3 0 0 1674.63 0 0 0 0 0 0 0 0 0 0 390.408 -2063.28 0 0 0 0 0 0 0 0 1569.03 0 1270.26 0 0 0 0 0 
2276.3 0 0 2007.74 0 0 0 0 0 0 0 0 0 0 -310.755 -1425.14 0 -825.449 2229.76 0 0.05 0 -727.18 0 0 0 0 0 0 0 0 0 2415.31 0 259.178 0 0 0 0 0 0 -1788.46 0 1594.36 741.829 338.527 275.964 968.429 0 0 0 0 0 -2052.14 
0 75.457 0 0 0 0 0 0 0 0 0 0 0 0 0 0 2161.4 0 0 0 0 0.09 480.895 0 0 0 366.909 931.654 0 -1927.63 0 0 0 1318.32 0 0 87.5118 0 0 -721.381 0 0 0 0 0 0 0 1719.64 0 0 0 -1120.41 0 0 
0 -2198.17 -2131.03 0 0 0 0 0 0 -890.606 0 0 0 0 0 0 818.735 -2468.26 0 1418.12 -2256.46 -1663.03 0 2421.26 0 0 0 0 -419.401 2480.62 0 0 0 0 0 0 0 0 0 356.838 177.236 0 0 0 0 0 0 1958.91 0 0 2460.78 0 0 0 
0 0 0 0 0 -1265.07 1854.99 0 0 0 0 0 0 0 -0.991852 0 -121.235 0 0 0 0 0 -2492.98 0.08 0 -1283.23 0 0 0 0 0 0 0 0 0 2202.75 0 0 0 0 0 -111.316 0 -1798.99 0 771.126 0 0 0 2009.87 0 0 0 0 
0 0 266.045 0 0 0 -867.26 0 0 0 0 0 0 -448.546 0 0 0 904.187 0 0 0 0 0 0 0.07 2462.16 0 1031.45 0 -1657.84 0 0 0 1786.02 0 0 0 1845.84 0 1933.58 0 0 0 2432.1 2441.56 0 0 0 325.251 0 0 -2256.92 0 0 
0 1371.12 0 0 0 0 -612.125 0 782.113 133.137 0 0 0 -805.612 0 0 0 2494.2 0 577.029 0 0 0 2302.39 1661.81 0.04 1303.67 0 0 0 -815.073 0 0 0 0 0 0 0 0 0 -1297.11 0 771.432 0 51.6526 0 0 754.952 649.968 -639.592 0 -954.543 0 0 
1176.26 0 0 0 0 0 0 1851.94 0 -763.344 0 0 0 0 0 0 0 -2002.85 0 0 0 -1228.9 0 0 0 516.602 0.04 0 543.764 0 0 0 0 0 -821.94 0 0 0 0 2108.29 0 0 0 0 2151.02 -577.944 1685 1459.01 0 0 0 0 0 0 
2144.31 0 0 0 0 0 0 0 0 0 0 0 -723.975 1948.68 0 0 0 -1642.58 0 0 0 -27.2378 0 0 2089.98 0 0 0.05 0 -825.449 2185.35 -2290.19 738.624 573.061 0 0 0 -2071.37 1780.83 0 2435 0 -2126.91 1354.79 0 0 -1505.71 -961.104 -496.46 136.647 0 0 -93.4629 0 
-1482.82 0 1147.88 -274.133 0 0 0 0 0 0 0 0 0 0 0 0 0 0 0 0 0 0 629.215 0 0 0 -2036.27 0 0.03 0 2227.77 0 0 0 2062.06 0 2106.62 0 0 214.316 0 0 1953.57 0 0 0 0 0 0 -1422.24 0 0 -2413.17 0 
0 0 0 0 0 0 0 -1586.89 0 0 2491 0 0 0 0 1173.36 -900.067 0 0 0 0 1228.9 806.833 0 909.833 0 0 1825.69 0 0.08 0 0 0 0 0 0 0 0 0 0 0 0 0 786.996 -1560.95 -2291.25 0 0 0 0 1352.5 0 1623.97 514.771 
482.421 0 0 0 0 0 0 -1205.4 0 0 0 0 665.838 0 0 0 2083.12 0 848.033 0 0 0 0 0 0 1071.43 0 -1897.26 1369.59 0 0.02 0 0 0 0 0 0 0 0 1165.27 0 0 0 0 0 1658.15 0 0 1224.94 438.322 0 709.174 -925.092 -1915.88 
677.282 961.715 -641.423 0 -482.116 0 1984.24 0 0 2201.22 -1282.16 0 -464.873 0 0 0 1263.39 500.122 0 0 0 0 0 0 0 0 0 1643.65 0 0 0 0.01 0 195.7 0 -1108.05 0 0 0 -2102.8 0 0 352.26 414.212 0 2111.65 0 0 0 0 0 890.606 0 0 
0 0 0 0 0 -1394.77 0 1932.97 1536.84 0 -217.673 0 0 407.498 -716.346 2247.92 0 0 1431.09 0 889.996 0 0 0 0 0 0 -1794.41 0 0 0 0 0.04 0 0 0 0 0 0 2358.7 0 0 0 -2475.59 0 0 0 0 0 0 0 0 0 0 
0 269.25 0 -1697.67 289.697 0 -757.393 -1830.88 0 -1774.73 0 0 0 0 0 -278.1 0 1550.57 0 0 0 142.903 0 0 568.178 0 0 1513.49 0 0 0 1189.23 0 0.02 0 0 -146.413 0 301.599 0 0 0 366.604 0 2230.67 0 0 1840.8 0 0 0 0 2460.33 1648.53 
1662.72 0 0 2288.05 -857.341 0 1466.64 -2179.25 0 1348.99 0 0 0 0 0 0 0 0 0 0 -354.701 0 0 0 0 0 1668.07 0 -1285.06 0 0 0 0 0 0 1177.48 0 0 1414.76 -586.184 0 0 0 0 0 0 0 0 -2118.67 0 0 0 0 0 
0 0 0 0 1543.4 0 1588.87 0 0 0 -982.772 2318.72 0 0 0.686666 0 0 0 0 0 0 0 0 -1052.96 0 0 0 0 0 0 0 1536.23 0 0 2118.82 0.02 -2394.41 0 0 -1309.02 0 0 0 -2142.32 0 0 0 0 0 0 0 0 612.888 0 
0 0 0 0 854.9 0 64.1652 0 0 2454.68 0 0 0 0 0 0 0 0 -1294.52 42.1918 0 -1641.97 0 0 0 0 0 0 400.021 0 0 0 0 1442.99 0 762.581 0.02 0 0 0 0 0 2443.08 0 0 0 0 0 0 0 0 0 0 0 
-641.881 0 0 -248.039 1776.86 -1382.72 1641.82 -908.155 0 0 0 0 -1898.02 0 0 0 -235.527 0 0 -230.796 0 0 0 0 2461.85 0 0 1745.89 0 0 0 0 0 0 0 0 0 0.06 0 0 0 0 0 680.486 0 0 0 0 0 1756.42 0 0 0 0 
2490.84 -1878.95 0 0 0 0 0 0 0 0 -1093.55 0 0 0 0 0 0 0 0 0 0 0 0 0 0 0 0 -1701.48 0 0 0 0 0 1400.72 -708.411 0 0 0 0.06 0 -578.555 0 0 0 0 0 0 0 1651.89 350.429 1452.3 -51.9578 0 68.8955 
0 0 0 -1361.35 2207.79 0 0 0 0 442.595 0 0 0 470.977 0 0 0 -1532.87 0 0 0 1742.84 1350.98 0 -1468.17 0 -1896.34 0 2136.22 0 894.574 1824.17 -2224.57 0 1762.06 522.858 0 0 0 0.06 0 -1860.94 0 0 0 513.092 0 0 0 1002.61 0 208.365 0 0 
0 0 0 0 0 0 970.717 0 0 0 0 0 0 -1988.97 0 0 0 0 0 0 0 0 -1490.3 0 0 1852.55 0 2387.39 0 0 0 0 0 0 0 0 0 0 -1923.66 0 0.02 0 2047.11 0 0 -998.642 0 0 1358.91 0 0 -1137.04 0 0 
0 0 -534.303 0 0 0 0 0 0 0 0 187.918 2167.2 0 0 1439.48 903.272 0 0 0 1338.47 0 0 -12.8941 0 0 0 0 0 0 0 0 0 0 0 0 0 0 0 -1.44963 0 0.01 0 1587.65 -1601.84 0 0 0 -501.038 0 0 0 0 0 
0 -1855.91 0 0 905.103 0 0 0 0 0 0 0 340.052 1130.94 0 0 0 0 0 0 0 0 0 0 0 -194.937 0 2220.3 1849.8 0 0 -870.006 0 -1707.43 0 0 -2373.2 0 0 0 -1975.08 0 0.04 1159.63 1527.07 -1568.12 2103.26 0 0 0 0 0 0 0 
473.418 0 378.658 0 -969.039 0 0 0 0 2284.84 -279.626 0 0 0 0 829.112 308.771 1477.32 0 0 2351.99 0 0 659.124 491.424 0 0 -1611.91 0 1487.24 0 -2221.37 1412.17 0 0 1361.96 0 -2040.39 0 0 0 1437.04 2379.76 0.03 1506.32 1732.92 0 -86.9015 0 0 0 0 -1967.91 -462.279 
0 1873.3 0 0 1046.56 0 0 0 -1997.82 -852.306 0 0 0 0 0 0 0 1401.18 1594.52 0 2254.63 0 0 0 1526.46 -389.34 781.045 0 0 -577.181 0 0 0 1260.03 0 0 0 0 0 0 0 2068.32 470.214 -81.1029 0 994.827 0 0 0 0 0 2398.83 0 0 
0 1657.08 0 -1543.55 -1462.83 0 0 0 0 0 0 0 0 403.989 0 0 0 2396.54 0 0 -1947.61 0 0 967.055 0 0 1330.07 0 0 346.919 -544.832 -977.737 0 0 0 0 0 0 0 -1408.66 -950.88 0 1736.58 523.774 1314.2 0.02 0 0 0 0 544.984 0 0 0 
-1622.75 0 0 0 0 0 0 0 0 585.421 0 0 0 0 0 0 2481.69 0 156.178 -576.266 2375.48 0 0 0 0 0 -2027.27 674.841 0 0 0 0 0 0 0 0 0 0 0 0 0 0 988.418 0 0 0 0.01 0 907.544 0 0 0 0 1135.52 
0 -1586.89 0 1341.06 0 218.589 0 -1123.46 0 0 0 0 0 0 0 0 0 -57.7563 0 0 -682.623 1876.05 -2142.17 0 0 1598.94 2047.26 1477.94 0 0 0 0 0 -667.974 0 0 0 0 0 0 0 0 0 1138.87 0 0 0 0.09 0 0 0 0 2166.74 0 
0 0 -280.084 0 1857.43 0 0 0 1781.29 0 0 -69.3533 -2432.55 1149.71 -540.559 0 0 -656.224 0 -1856.97 0 0 0 0 1075.24 -821.177 0 2335.66 0 0 -1026.41 0 0 0 563.295 0 0 0 609.989 0 -2448.58 227.134 0 0 0 0 809.427 0 0.09 0 0 0 1607.18 0 
2376.25 0 -284.204 0 0 0 0 2145.53 0 0 0 1028.09 0 0 2438.35 0 0 -1372.34 0 0 0 0 0 2322.23 0 -251.701 0 1474.12 -2116.08 0 971.938 0 0 0 0 0 0 -285.73 -1991.71 1381.34 0 0 0 0 0 0 0 0 0 0.09 0 -2222.43 -341.578 0 
0 0 0 0 -1104.85 0 919.294 1158.56 0 0 -680.181 154.195 0 -810.648 1562.47 0 0 0 0 0 0 0 2355.04 0 0 0 0 0 0 47.0748 0 0 0 0 0 0 0 0 2143.7 0 0 0 0 0 0 -98.0407 0 0 0 0 0.04 0 0 0 
0 -1634.04 0 267.418 1067.77 0 -1119.34 0 0 0 0 0 0 868.633 912.885 0 0 0 0 0 0 -49.6689 0 0 1013.14 999.405 0 0 0 0 573.214 -1700.57 0 0 0 0 0 0 543.001 1656.77 2431.03 0 0 0 -1709.11 0 0 0 0 2210.38 0 0.09 465.484 0 
0 0 0 0 0 354.244 0 0 0 0 -1135.36 2456.97 2176.66 1311 0 0 62.7918 423.826 0 0 0 0 0 0 0 0 0 2462 1605.5 1008.71 15.4881 0 0 660.955 0 1927.63 0 0 0 0 0 0 0 417.264 0 0 0 -2240.59 815.683 -907.849 0 479.675 0.06 0 
0 0 0 0 0 0 0 0 0 0 0 0 0 0 0 2251.58 0 0 0 0 1609.16 0 0 0 0 0 0 0 0 1118.43 1503.27 0 0 1277.12 0 0 0 0 -2044.66 0 0 0 0 -276.574 0 0 -353.023 0 0 0 0 0 0 0.02 
