*Vertices 61
*Matrix 
0.04 0 0 0 0 0 0 0 0 0 -2260.73 0 0 -1999.19 2069.54 0 0 0 0 0 0 0 0 1651.89 0 1193.2 0 578.555 0 0 0 0 0 0 0 0 0 0 268.334 0 0 -459.838 0 0 0 0 0 0 -669.805 0 0 0 1622.14 0 0 0 0 0 0 0 0 
0 0 0 0 0 -1347.16 0 0 0 2481.99 0 0 0 0 0 0 0 0 0 0 0 0 0 0 0 0 0 0 0 0 0 0 0 0 -1199.76 0 905.408 0 0 0 0 0 0 0 0 0 0 2194.66 2108.75 0 327.235 0 0 0 0 0 0 0 0 0 0 
0 0 0.02 1621.52 0 0 0 0 0 -133.442 0 0 0 0 0 0 -997.269 1791.67 0 0 0 0 0 -1769.69 0 0 0 1448.03 0 0 0 -1082.11 0 0 0 0 0 0 259.941 0 0 0 0 0 0 0 0 2467.8 0 0 0 0 0 0 0 0 0 0 0 0 0 
0 0 -2486.42 0.09 0 983.688 0 2418.52 0 0 0 0 -1505.1 -1420.26 0 0 0 0 0 0 0 0 0 0 0 0 2018.11 0 0 733.131 -196.921 0 0 0 0 0 0 0 0 0 0 0 0 0 2209.16 0 2033.52 -1453.52 0 0 0 0 0 0 0 0 0 0 0 0 0 
0 0 0 0 0.03 0 0 0 0 0 570.009 0 0 0 0 0 0 0 0 0 0 0 0 0 0 0 0 0 160.451 0 0 0 0 0 0 -2313.38 0 0 0 0 0 0 0 0 313.959 0 -58.0615 0 0 0 2268.67 0 0 0 0 0 0 0 0 0 0 
0 1746.5 0 2113.33 0 0.04 0 0 0 1144.37 0 0 0 0 0 0 0 0 0 0 0 0 0 0 0 0 0 0 0 0 0 0 0 0 0 0 0 0 0 2220.45 0 0 0 0 0 0 0 0 0 0 0 0 0 0 0 0 0 0 0 0 0 
0 0 0 0 0 0 0.07 0 0 647.374 0 0 0 0 0 0 0 0 237.815 0 0 0 0 0 0 0 0 0 962.783 0 0 0 0 0 0 1039.08 0 0 0 0 0 119.251 1163.44 0 1395.23 0 0 0 0 0 0 0 0 0 0 0 0 0 0 0 0 
0 0 0 -100.024 0 0 0 0.09 0 0 0 0 0 266.045 0 0 0 0 0 1297.42 0 612.43 2246.24 0 0 0 0 996.506 0 0 0 0 0 0 0 0 0 1399.66 0 0 0 0 2058.7 0 1510.44 2145.99 0 0 0 0 0 0 -752.663 0 0 0 0 0 0 0 0 
0 0 0 0 0 0 0 0 0.08 1787.85 0 0 0 0 0 0 0 0 0 0 2453 0 0 0 450.835 -2338.56 0 0 0 0 0 0 0 -83.3918 0 0 0 0 0 0 0 0 0 0 2163.08 0 0 0 0 0 2335.35 0 0 0 0 0 0 0 0 0 0 
0 903.882 604.953 0 0 1280.18 1704.84 0 1541.72 0.06 0 0 0 0 0 -858.562 0 0 0 0 0 0 0 0 0 0 0 0 0 0 0 0 2360.38 0 -954.237 0 0 0 0 0 0 0 0 0 0 0 0 1691.72 0 0 1042.28 0 0 0 0 0 0 0 0 0 0 
287.866 0 0 0 1890.24 0 0 0 0 0 0.07 0 0 0 0 0 0 0 0 1969.28 0 0 0 0 0 1526.76 0 -408.109 0 0 0 0 0 0 0 0 2259.97 0 0 0 0 0 0 0 0 0 0 0 0 0 0 0 0 0 1848.89 0 0 0 0 0 0 
0 0 0 0 0 0 0 0 0 0 0 0.05 0 0 0 0 0 0 0 0 0 1396.45 0 0 0 0 0 0 1387.6 0 0 2204.12 0 0 0 0 0 0 0 0 2197.87 0 0 0 0 0 0 0 0 0 0 0 0 0 0 0 0 0 0 0 0 
0 0 0 -976.669 0 0 0 0 0 0 0 0 0.02 0 0 0 0 0 0 0 -433.897 0 0 0 0 819.498 -561.617 0 0 0 0 0 0 0 0 0 0 0 1762.83 0 0 0 0 0 0 0 0 0 0 0 0 0 1980.27 0 0 0 0 0 0 0 0 
658.055 0 0 -1179.16 0 0 0 -390.561 0 0 0 0 0 0 829.569 0 0 0 0 0 0 0 0 0 0 0 0 0 0 2376.25 0 0 0 0 0 1365.02 0 -686.743 0 0 0 0 0 0 0 0 0 0 0 0 0 0 0 0 0 512.635 0 0 0 0 0 
-673.467 0 0 0 0 0 0 0 0 0 0 0 0 -124.592 0.01 0 0 0 0 0 0 1247.83 0 0 2039.02 0 0 0 0 0 0 410.245 0 0 0 0 0 0 0 0 -2346.03 0 0 0 0 0 0 -174.184 0 0 0 0 0 0 0 0 0 0 0 0 0 
0 0 0 0 0 0 0 0 0 1313.59 0 0 0 0 0 0.02 0 0 0 0 0 -141.53 0 0 0 0 -777.688 0 0 1609.93 0 2296.14 0 0 0 0 0 0 1254.54 0 -699.255 0 0 0 0 0 0 0 1401.49 0 0 0 0 0 0 0 0 0 0 0 0 
0 0 2288.05 0 0 0 0 0 0 0 0 0 0 0 0 0 0.03 0 0 0 2006.52 0 0 0 0 0 0 0 0 0 0 0 0 1467.56 0 -812.174 0 -520.722 0 0 0 0 491.729 0 0 0 0 0 0 -1691.87 0 0 0 0 0 0 0 0 0 0 0 
0 0 252.617 0 0 0 0 0 0 0 0 0 0 0 0 0 0 0.07 0 0 0 0 1498.99 0 0 0 0 0 -666.295 0 0 0 0 2120.04 0 0 0 0 0 0 0 0 201.956 0 0 0 0 0 -2021.16 0 0 0 1164.05 0 0 0 0 0 0 0 0 
0 0 0 0 0 0 1982.71 0 0 0 0 0 0 0 0 0 0 0 0.04 -541.169 0 0 0 0 1730.48 0 1167.41 0 0 0 0 0 0 0 0 0 0 0 0 0 490.356 0 0 419.858 0 0 -1491.21 0 -310.907 0 0 831.248 0 0 0 0 0 0 0 0 0 
0 0 0 0 0 0 0 1080.43 0 0 2070.76 0 0 0 0 0 0 0 -287.866 0.04 0 0 0 0 658.361 0 0 1699.8 -2322.69 0 -1995.53 0 0 -1069.6 0 0 2266.08 1090.5 0 0 0 0 1000.63 0 0 0 0 0 0 0 0 0 1354.03 0 0 0 0 0 0 0 0 
0 0 0 0 0 0 0 0 -886.944 0 0 0 -478.454 0 0 0 759.987 0 0 0 0.02 0 0 0 0 0 0 1643.5 0 1102.4 0 0 0 0 0 0 0 0 0 0 507.294 0 0 0 0 0 0 0 0 0 0 0 0 0 0 0 0 0 0 0 0 
0 0 0 0 0 0 0 -746.712 0 0 0 1765.42 0 0 2445.68 1327.63 0 0 0 0 0 0.04 -337.916 0 720.923 0 0 0 0 0 0 0 0 0 0 0 0 0 0 0 0 0 0 0 2020.71 0 0 0 0 0 0 0 1920.76 0 0 0 0 0 0 0 0 
0 0 0 0 0 0 0 2271.57 0 0 0 0 0 0 0 0 0 -2145.38 0 0 0 1416.44 0.05 0 0 0 0 0 0 0 204.093 0 2032.15 0 0 -127.186 0 0 758.156 1019.24 0 0 -2298.88 2314.45 -70.2689 0 0 0 0 0 0 0 0 0 0 0 0 0 0 0 0 
-1229.06 0 1994.16 0 0 0 0 0 0 0 0 0 0 0 0 0 0 0 0 0 0 0 0 0 0 0 0 0 0 0 0 0 0 0 1549.65 0 0 0 0 0 0 0 0 1589.18 0 0 0 0 0 0 0 0 0 0 0 0 0 0 0 0 0 
0 0 0 0 0 0 0 0 1848.73 0 0 0 0 0 1840.34 0 0 0 -1540.35 234.306 0 1758.1 0 0 0.07 0 0 -852.611 0 0 0 0 0 0 0 0 0 0 0 0 0 -2131.03 0 0 0 -572.146 0 -316.248 0 0 0 0 0 0 0 0 0 0 0 0 0 
2064.2 0 0 0 0 0 0 0 1410.95 0 -1835.31 0 552.766 0 0 0 0 0 0 0 0 0 0 0 0 0.05 0 0 0 0 0 0 0 0 -186.392 1230.58 0 0 0 0 0 -2090.44 0 0 0 445.647 674.688 0 0 1173.97 1616.49 0 0 0 0 0 0 0 0 0 0 
0 0 0 1487.7 0 0 0 0 0 0 0 0 -901.746 0 0 1180.68 0 0 1032.21 0 0 0 0 0 0 0 0.08 0 0 0 0 0 0 0 0 0 0 0 0 0 0 0 0 0 0 0 0 0 0 0 12.1311 0 0 2194.05 0 0 0 0 0 0 0 
-1538.06 0 852 0 0 0 0 -95.5992 0 0 -1331.45 0 0 0 0 0 0 0 0 2274.93 -823.923 0 0 0 -942.335 0 0 0 1927.32 0 0 0 0 0 615.329 0 0 0 0 0 0 -1243.86 0 0 0 0 0 -897.778 0 2353.05 0 0 0 0 0 0 0 0 0 0 0 
0 0 0 0 1424.53 0 1883.22 0 0 0 0 79.1192 0 0 0 0 0 220.42 0 -589.846 0 0 0 0 0 0 0 -92.3948 0.01 0 0 0 0 0 0 1480.38 0 -1071.28 0 75.6096 0 0 0 0 0 0 0 0 0 0 0 -248.192 0 0 0 0 0 0 0 0 0 
0 0 0 1206.47 0 0 0 0 0 0 0 0 0 1572.08 0 -945.082 0 0 0 0 1843.39 0 0 0 0 0 0 0 0 0.07 0 0 0 0 0 0 0 0 0 0 0 0 0 0 0 0 0 0 0 0 0 0 0 0 0 0 -1665.93 0 0 0 0 
0 0 0 529.725 0 0 0 0 0 0 0 0 0 0 0 0 0 0 0 1404.23 0 0 -1526 0 0 0 0 0 0 0 0.01 0 0 0 0 0 0 0 0 0 0 0 0 0 0 0 0 0 0 0 0 0 0 0 0 0 0 0 0 0 0 
0 0 1764.81 0 0 0 0 0 0 0 0 1626.87 0 0 -854.137 -1185.26 0 0 0 0 0 0 0 0 0 0 0 0 0 0 0 0.09 0 0 0 0 0 0 0 0 1538.06 0 0 0 0 -2476.5 0 0 0 0 0 0 0 0 0 0 0 0 0 0 0 
0 0 0 0 0 0 0 0 0 1998.89 0 0 0 0 0 0 0 0 0 0 0 0 -777.23 0 0 0 0 0 0 0 0 0 0.03 0 0 0 0 0 0 0 0 0 0 0 0 0 0 0 0 0 0 0 0 0 0 0 0 0 0 0 0 
0 0 0 0 0 0 0 0 2455.6 0 0 0 0 0 0 0 2160.94 1929.46 0 1290.86 0 0 0 0 0 0 0 0 0 0 0 0 0 0.03 -2257.23 2418.52 0 0 0 -1912.06 0 0 0 0 0 0 -1046.25 0 0 0 0 0 0 0 0 0 0 0 0 0 0 
0 2435.15 0 0 0 0 0 0 0 1246.76 0 0 0 0 0 0 0 0 0 0 0 0 0 -800.424 0 2093.04 0 -51.8052 0 0 0 0 0 2451.78 0.04 0 0 0 0 0 0 0 0 0 0 0 -392.239 2136.68 0 0 0 0 -687.658 0 0 0 0 0 0 0 0 
0 0 0 0 144.276 0 -1489.53 0 0 0 0 0 0 1356.78 0 0 -79.577 0 0 0 0 0 -781.35 0 0 1334.5 0 0 -1520.81 0 0 0 0 2397 0 0.06 1726.36 927.229 0 0 0 0 0 0 -1974.62 0 0 0 0 0 0 0 0 0 0 0 0 0 0 0 0 
0 -2042.07 0 0 0 0 0 0 0 0 410.855 0 0 0 0 0 0 0 0 -37.0037 0 0 0 0 0 0 0 0 0 0 0 0 0 0 0 1284.91 0.08 0 2132.4 0 0 -1873.61 0 0 0 0 0 0 0 0 0 0 0 0 0 0 0 0 0 0 0 
0 0 0 0 0 0 0 -1057.85 0 0 0 0 0 -70.8792 0 0 1338.01 0 0 2176.05 0 0 0 0 0 0 0 0 -2328.94 0 0 0 0 0 0 619.602 0 0.02 1207.08 0 0 0 0 0 0 0 0 0 0 0 2474.52 -1313.75 0 0 0 0 0 0 0 0 0 
321.131 0 1740.85 0 0 0 0 0 0 0 0 0 -1716.9 0 0 1866.44 0 0 0 0 0 0 232.322 0 0 0 0 0 0 0 0 0 0 0 0 0 -1113.24 -705.206 0.05 0 -1842.94 0 1495.48 0 2485.66 0 0 0 0 0 0 0 0 0 0 0 0 0 0 0 0 
0 0 0 0 0 -544.832 0 0 0 0 0 0 0 0 0 0 0 0 0 0 0 0 1480.53 0 0 0 0 0 825.755 0 0 0 0 1738.87 0 0 0 0 0 0.03 0 0 0 0 0 0 0 0 0 0 128.407 0 0 0 0 0 0 0 0 0 0 
0 0 0 0 0 0 0 0 0 0 0 2016.13 0 0 -170.98 -1280.63 0 0 2179.71 0 2006.21 0 0 0 0 0 0 0 0 0 0 2333.67 0 0 0 0 0 0 -2464.14 0 0.02 0 0 0 0 0 0 0 0 0 0 0 0 0 0 0 0 0 0 0 0 
-343.867 0 0 0 0 0 1832.26 0 0 0 0 0 0 0 0 0 0 0 0 0 0 0 0 0 90.8689 -1285.52 0 -1137.5 0 0 0 0 0 0 0 0 2147.51 0 0 0 0 0.07 0 0 0 0 0 0 0 0 1217.15 0 0 0 0 0 0 0 0 0 0 
0 0 0 0 0 0 2163.99 528.962 0 0 0 0 0 0 0 0 1545.38 -973.617 0 418.485 0 0 798.746 0 0 0 0 0 0 0 0 0 0 0 0 0 0 0 114.216 0 0 0 0.03 0 0 0 0 0 0 -1956.01 0 0 0 0 0 0 0 151.143 0 0 0 
0 0 0 0 0 0 0 0 0 0 0 0 0 0 0 0 0 0 1607.18 0 0 0 1727.73 2485.35 0 0 0 0 0 0 0 0 0 0 0 0 0 0 0 0 0 0 0 0.03 0 0 -1673.41 0 0 0 0 0 0 0 0 0 0 0 0 0 0 
0 0 0 1766.03 -1414.91 0 -1625.34 38.377 2105.7 0 0 0 0 0 0 0 0 0 0 0 0 -1839.58 -2180.93 0 0 0 0 0 0 0 0 0 0 0 0 2289.12 0 0 2243.49 0 0 0 0 0 0.05 0 0 0 0 0 0 0 0 0 0 0 0 0 0 0 0 
0 0 0 0 0 0 0 1093.1 0 0 0 0 0 0 0 0 0 0 0 0 0 0 0 0 482.727 276.574 0 0 0 0 0 2048.63 0 0 0 0 0 0 0 0 0 0 0 0 0 0.02 0 0 0 47.5326 0 -2423.4 0 0 0 0 0 0 0 0 0 
0 0 0 410.398 -430.845 0 0 0 0 0 0 0 0 0 0 0 0 0 502.564 0 0 0 0 0 0 1841.41 0 0 0 0 0 0 0 -205.161 2362.67 0 0 0 0 0 0 0 0 -412.839 0 0 0.01 0 0 0 0 0 0 0 0 0 0 0 0 0 0 
0 2098.53 685.064 2073.5 0 0 0 0 0 -614.109 0 0 0 0 326.624 0 0 0 0 0 0 0 0 0 -2010.03 0 0 7.24815 0 0 0 0 0 0 670.11 0 0 0 0 0 0 0 0 0 0 0 0 0.02 0 0 -2237.85 0 1626.41 0 0 0 0 0 0 0 0 
2373.96 575.655 0 0 0 0 0 0 0 0 0 0 0 0 0 -244.53 0 2207.48 288.324 0 0 0 0 0 0 0 0 0 0 0 0 0 0 0 0 0 0 0 0 0 0 0 0 0 0 0 0 0 0.07 1203.88 0 -561.617 0 0 0 0 0 0 0 0 0 
0 0 0 0 0 0 0 0 0 0 0 0 0 0 0 0 -1756.11 0 0 0 0 0 0 0 0 -1457.34 0 972.549 0 0 0 0 0 0 0 0 0 0 0 0 0 0 1806.47 0 0 1983.17 0 0 -130.696 0.04 0 0 0 0 0 0 0 0 0 0 0 
0 2284.84 0 0 -513.092 0 0 0 -1982.71 -240.715 0 0 0 0 0 0 0 0 0 0 0 0 0 0 0 664.312 -1104.08 0 0 0 0 0 0 0 0 0 0 1988.51 0 -1308.86 0 2325.28 0 0 0 0 0 -1193.81 0 0 0.05 0 0 0 0 0 0 0 0 0 0 
0 0 0 0 0 0 0 0 0 0 0 0 0 0 0 0 0 0 -920.209 0 0 0 0 0 0 0 0 0 2184.59 0 0 0 0 0 0 0 0 -1482.36 0 0 0 0 0 0 0 -1224.94 0 0 2460.78 0 0 0.01 0 0 0 0 0 0 0 0 0 
-817.667 0 0 0 0 0 0 401.09 0 0 0 0 443.815 0 0 0 0 -976.211 0 2216.33 0 1578.65 0 0 0 0 0 0 0 0 0 0 0 0 1976 0 0 0 0 0 0 0 0 0 0 0 0 763.192 0 0 0 0 0.02 0 0 0 0 0 0 0 0 
0 0 0 0 0 0 0 0 0 0 0 0 0 0 0 0 0 0 0 0 0 0 0 0 0 0 606.174 0 0 0 0 0 0 0 0 0 0 0 0 0 0 0 0 0 0 0 0 0 0 0 0 0 0 0 0 0 0 0 0 738.777 0 
0 0 0 0 0 0 0 0 0 0 787.912 0 0 0 0 0 0 0 0 0 0 0 0 0 0 0 0 0 0 0 0 0 0 0 0 0 0 0 0 0 0 0 0 0 0 0 0 0 0 0 0 0 0 0 0.02 0 0 0 0 0 0 
0 0 0 0 0 0 0 0 0 0 0 0 0 987.96 0 0 0 0 0 0 0 0 0 0 0 0 0 0 0 0 0 0 0 0 0 0 0 0 0 0 0 0 0 0 0 0 0 0 0 0 0 0 0 0 0 0.08 0 0 0 0 0 
0 0 0 0 0 0 0 0 0 0 0 0 0 0 0 0 0 0 0 0 0 0 0 0 0 0 0 0 0 529.115 0 0 0 0 0 0 0 0 0 0 0 0 0 0 0 0 0 0 0 0 0 0 0 0 0 0 0 0 1528.14 0 0 
0 0 0 0 0 0 0 0 0 0 0 0 0 0 0 0 0 0 0 0 0 0 0 0 0 0 0 0 0 0 0 0 0 0 0 0 0 0 0 0 0 0 1527.68 0 0 0 0 0 0 0 0 0 0 0 0 0 0 0.08 0 0 0 
0 0 0 0 0 0 0 0 0 0 0 0 0 0 0 0 0 0 0 0 0 0 0 0 0 0 0 0 0 0 0 0 0 0 0 0 0 0 0 0 0 0 0 0 0 0 0 0 0 0 0 0 0 0 0 0 1017.26 0 0.08 0 0 
0 0 0 0 0 0 0 0 0 0 0 0 0 0 0 0 0 0 0 0 0 0 0 0 0 0 0 0 0 0 0 0 0 0 0 0 0 0 0 0 0 0 0 0 0 0 0 0 0 0 0 0 0 1747.72 0 0 0 0 0 0.04 287.255 
0 0 0 0 0 0 0 0 0 0 0 0 0 0 0 0 0 0 0 0 0 0 0 0 0 0 0 0 0 0 0 0 0 0 0 0 0 0 0 0 0 0 0 0 0 0 0 0 0 0 0 0 0 0 0 0 0 0 0 840.098 0.08 
