*Vertices 61
*Matrix 
0.03 0 -303.888 0 2281.03 0 109.638 0 0 0 -445.189 0 0 0 0 0 430.998 0 -1006.58 0 2127.06 0 0 0 0 -1175.19 0 0 0 0 2296.14 0 0 0 1409.88 -1307.64 0 0 2449.03 2483.21 0 0 0 0 0 1244.93 0 0 0 0 0 -711.768 0 -2167.2 0 -1446.65 0 0 0 1362.88 0 
0 0.06 0 0 1889.93 0 -2268.06 0 0 1827.07 0 1823.86 0 0 0 520.264 0 1179.62 1706.06 0 0 738.472 -193.716 0 2238.91 0 0 0 0 0 214.469 0 0 0 0 0 0 0 0 0 -1229.21 0 0 -860.698 -443.358 -507.447 0 0 0 -1444.52 0 -983.84 0 0 0 0 0 0 0 0 0 
-734.657 0 0.05 0 -354.396 0 0 0 0 0 0 0 0 0 0 0 1627.78 2246.09 0 -881.451 0 0 2288.2 592.288 119.709 0 0 0 0 0 0 1337.86 0 0 0 0 0 0 0 205.313 1811.5 0 0 0 0 0 0 0 -1169.55 0 0 0 0 -1242.94 2388.61 0 1850.26 1900.01 0 0 0 
0 0 0 0.09 0 0 0 0 455.718 0 633.183 -65.6911 0 -1311.46 0 0 0 0 0 -815.531 0 0 0 0 0 0 2100.36 0 0 0 1228.14 1833.02 0 1464.35 0 0 0 2369.99 0 0 0 0 142.445 0 0 948.134 0 0 0 0 0 0 0 0 0 -1209.83 0 0 0 0 0 
1004.29 1767.86 -242.546 0 0.08 -1845.53 436.186 0 0 0 0 0 0 -905.255 0 0 -144.887 0 0 0 2291.86 0 0 0 0 0 0 0 0 -2213.43 948.286 0 0 0 0 634.098 898.846 0 0 2421.26 0 0 1676.46 0 0 0 -1711.86 0 1699.04 0 0 1303.83 0 -842.082 -138.478 0 0 -646.306 -1629.61 0 0 
0 0 0 0 1128.8 0 0 0 0 0 -141.987 0 72.7104 0 134.51 2249.9 0 0 0 0 0 0 0 0 0 875.652 -1133.23 0 0 0 0 0 0 0 0 0 0 0 1156.12 0 0 0 2201.99 0 0 0 -1770 0 -1765.72 -642.643 0 0 0 -1571.17 0 0 -1770.46 0 -691.015 0 874.279 
1345.18 2186.88 0 0 1119.5 0 0.05 0 0 0 0 0 1699.35 0 0 0 0 0 0 44.7859 -1345.79 0 0 0 0 0 0 0 1898.33 0 0 0 0 2282.4 0 0 -2252.19 762.581 0 0 0 0 0 -182.424 0 0 1139.64 0 1576.36 0 0 0 0 0 -2033.22 0 -1242.33 0 -507.904 1291.92 0 
0 0 0 0 0 0 0 0.08 0 0 0 0 0 0 0 0 1363.03 0 -2489.78 0 0 0 0 910.901 0 0 0 2416.84 0 0 0 0 0 0 1354.79 0 0 0 0 0 0 0 0 0 0 0 319.3 0 0 0 0 0 0 -217.063 0 2171.16 0 0 0 2064.81 0 
0 0 0 -1169.55 0 0 0 0 0.01 0 0 0 1854.38 0 0 223.93 0 0 0 0 0 0 -475.86 1394.92 0 0 0 0 0 0 0 738.777 0 1596.19 -44.7859 -1257.59 2420.04 0 0 -575.655 1744.36 0 0 0 0 0 0 0 188.07 0 0 0 0 0 0 0 0 0 0 0 0 
0 -1273.61 0 0 0 0 0 0 0 0.06 0 0 0 0 0 0 0 0 0 0 0 0 -2471.31 -1394.62 0 2342.52 0 1589.48 0 0 0 0 0 0 0 0 2250.21 0 0 0 0 -2346.34 0 0 0 0 0 -530.641 485.321 0 1996.9 0 860.088 -1846.6 0 0 0 0 443.815 0 0 
-1113.39 0 0 2371.67 0 -891.827 0 0 0 0 0.03 0 -1159.47 -147.786 1179.16 0 0 0 0 386.135 0 0 0 0 0 0 0 2161.09 0 0 0 0 0 0 0 648.747 0 0 0 0 0 0 0 0 1364.56 0 0 0 0 -1866.13 1607.94 0 0 0 2070.3 0 0 -2330.16 0 0 0 
0 661.87 0 763.192 0 0 0 0 0 0 0 0.07 0 0 -288.171 0 0 0 0 0 0 0 1231.19 0 388.119 -867.87 -384.457 0 1961.2 0 71.0318 0 119.404 0 0 -1534.7 0 -833.689 -422.147 0 0 0 0 0 1548.74 0 0 0 0 0 0 0 -1402.25 0 0 0 1756.42 2280.57 0 0 0 
0 0 0 0 0 2373.81 306.024 0 1818.22 0 1611.91 0 0.02 0 1595.28 0 1576.82 0 0 0 -2419.74 0 0 0 0 0 210.044 0 0 1744.67 0 0 -509.735 0 0 0 0 1838.51 0 0 0 -1263.54 0 0 0 0 0 0 0 0 2056.26 0 0 -636.387 0 0 0 0 0 0 0 
0 0 0 -661.718 2253.41 0 0 0 0 0 720.008 0 0 0.07 0 0 0 0 0 0 975.906 -24.0333 0 0 891.369 -550.935 0 0 0 0 0 0 0 -72.8629 0 -1484.8 2104.48 0 0 0 0 0 0 0 -1931.29 0 -1579.1 0 0 0 0 0 0 1340.6 438.017 0 0 417.264 0 0 0 
0 0 0 0 0 467.925 0 0 0 0 2268.06 46.4644 1718.73 0 0.01 0 1588.41 0 0 -2434.39 0 0 0 0 0 316.706 0 0 0 0 0 -598.697 0 0 0 153.127 0 0 0 1845.07 0 0 267.876 0 0 476.928 0 0 0 0 0 0 0 0 -2445.52 0 0 0 0 0 0 
0 -775.857 0 0 0 -2322.38 0 0 -36.5459 0 0 0 0 0 0 0.03 0 0 0 0 0 0 0 2320.86 2239.22 0 0 24.9489 0 0 0 0 0 0 0 -2045.43 0 0 0 -61.5711 -1638.16 723.365 0 0 0 0 0 0 1561.56 0 0 0 0 0 0 0 0 -209.586 0 2035.97 0 
1933.12 0 1994.92 0 -1905.04 0 0 2046.95 0 0 0 0 1622.9 0 1029.31 0 0.04 0 -1761.45 0 0 1796.24 535.066 0 31.8155 0 0 0 0 0 0 0 0 1303.83 0 0 0 0 0 0 0 -561.312 0 0 0 0 0 0 942.64 -1614.66 0 0 0 0 0 0 0 0 0 0 2335.66 
0 1631.29 441.832 0 0 0 0 0 0 0 0 0 0 0 0 0 0 0.01 2376.71 0 0 0 0 0 0 0 0 0 1982.56 -884.045 0 0 0 0 0 2342.22 0 0 0 0 0 0 0 0 0 -646.611 -315.332 0 0 0 0 0 -435.881 700.323 -893.048 0 0 -2188.56 0 0 0 
17.0141 1619.08 0 0 0 0 0 373.012 0 0 0 0 0 0 0 0 221.793 2420.8 0.04 2330.16 0 0 2154.53 0 0 0 0 0 0 0 0 0 2221.98 189.901 394.223 -1568.58 0 0 -1820.05 0 554.598 -1166.04 0 0 -559.786 0 0 570.162 0 626.926 859.935 0 0 0 -1583.99 352.412 2042.38 0 0 0 0 
0 0 466.399 -318.079 0 0 -299.615 0 0 0 660.192 0 0 0 -470.367 0 0 0 2414.55 0.08 0 0 0 0 0 0 -1182.21 -2494.96 0 0 0 0 1789.38 676.672 -282.83 0 0 446.257 0 791.421 0 0 -841.777 0 0 0 0 0 0 0 0 0 0 0 0 -557.497 0 0 2163.23 0 0 
-331.507 0 0 0 1968.83 0 -1911.45 0 0 0 0 0 -1429.87 2393.49 0 0 0 0 0 0 0.06 0 0 252.617 -1907.48 0 -1425.14 -46.3118 -1298.03 0 0 0 0 0 0 105.823 0 0 0 0 0 -1994 0 0 0 0 954.695 0 0 0 0 306.177 2498.32 0 0 1897.26 1543.24 0 0 0 0 
0 -1570.41 0 0 0 0 0 0 0 0 0 0 0 230.491 0 0 -792.489 0 0 0 0 0 711.005 0 0 0 0 0 1358.61 0 989.334 0 0 0 1716.59 0 0 0 0 0 2131.18 0 0 0 0 0 0 0 -1762.67 -899.304 0 0 0 0 0 0 0 0 0 0 0 
0 820.719 -1186.03 0 0 0 0 0 -270.318 -937.91 0 820.719 0 0 0 0 892.743 0 127.491 0 0 -841.319 0.07 -562.227 0 2375.48 0 0 0 0 1595.13 1726.97 -2102.19 0 -730.842 1154.13 0 0 0 -76.22 0 0 -1142.99 1329.92 2454.37 0 0 0 0 -1236.38 0 1913.28 2247.46 0 0 0 0 0 0 0 0 
0 0 -1198.08 0 0 0 0 1333.58 -949.202 1263.08 0 0 0 0 0 1944.11 0 0 0 0 -957.442 0 835.978 0.06 0 1576.82 -1382.72 0 0 0 0 1264 0 0 -854.9 0 0 0 0 0 0 1063.34 0 0 0 0 0 1256.98 973.769 0 -866.497 0 0 0 -2062.36 0 0 0 0 0 0 
0 -96.057 2356.72 0 0 0 0 0 0 0 0 435.728 0 1621.22 0 -1296.35 -311.67 0 0 0 1424.53 0 0 0 0.05 0 0 0 0 0 0 0 0 0 0 1952.5 0 0 0 0 0 0 -2328.64 0 0 0 1989.58 0 0 0 0 0 0 0 0 0 0 0 -345.393 1327.48 0 
-1871.32 0 0 0 0 2102.34 0 0 0 -1050.68 0 1321.22 0 -1352.81 540.254 0 0 0 0 0 0 0 2363.43 -23.5755 0 0.02 0 1695.23 506.531 1707.28 0 0 0 0 0 0 -556.886 534.913 1638.77 0 0 0 0 0 832.316 -2338.56 0 1554.84 0 0 0 0 0 42.6496 2055.19 507.294 -1028.09 -177.084 0 0 0 
0 0 0 11.8259 0 -392.85 0 0 0 0 0 567.873 -1466.19 0 0 0 0 0 0 150.838 1077.84 0 0 831.858 0 0 0.02 0 0 1097.83 486.694 0 -1783.27 -727.332 0 0 0 0 -822.398 0 2021.93 929.823 0 0 0 0 1983.17 0 0 0 0 0 -603.58 0 0 0 509.888 0 0 0 0 
0 0 0 0 0 0 0 839.335 0 -297.937 -768.075 0 0 0 0 -35.6304 0 0 0 2196.65 403.378 0 0 0 0 -457.091 0 0.06 -1115.68 0 0 0 0 0 0 0 -551.241 0 2168.26 0 -1412.32 0 0 0 0 1269.34 0 0 1351.59 0 0 0 0 0 740.913 0 0 0 0 0 0 
0 0 0 0 0 0 -1431.55 0 0 0 0 -2307.58 0 0 0 0 0 72.1 0 0 294.122 2176.66 0 0 0 -2106.62 0 -1454.44 0.06 1134.14 0 0 0 165.181 0 0 1918.16 0 449.309 1422.39 0 0 0 0 0 0 0 0 1567.05 0 0 0 0 1609.01 0 843.303 0 2346.64 -1927.32 0 0 
0 0 0 0 149.007 0 0 0 0 0 0 0 904.34 0 0 0 0 1298.49 0 0 0 0 0 0 0 322.352 -1885.51 0 2254.94 0.05 1273.92 0 0 1994.61 -1652.2 -862.987 2195.43 0 0 0 -1423.15 0 0 866.192 0 -1310.39 0 0 0 -388.882 0 0 148.091 0 0 0 0 0 -539.949 0 0 
2344.97 463.652 0 2331.23 2270.2 0 0 0 0 0 0 -2391.35 0 0 0 0 0 0 0 0 0 2081.9 -1807.69 0 0 0 288.781 0 0 1009.17 0.08 -1132.31 0 0 0 33.7992 0 0 -2136.68 0 0 140.309 2401.73 0 674.841 0 0 0 0 0 0 1842.02 0 1729.56 0 0 0 0 0 -2451.48 0 
0 0 -1579.87 -192.038 0 0 0 0 1188.77 0 0 0 0 0 1706.52 0 0 0 0 0 0 0 -930.128 -731.3 0 0 0 0 0 0 1427.27 0.09 0 0 0 -222.861 0 -145.039 0 1053.58 0 1063.34 0 -1252.1 0 0 646.611 -2142.48 0 0 0 0 0 -37.0037 0 2232.05 2096.7 0 -152.364 0 0 
0 0 0 0 0 0 0 0 0 0 0 909.07 1020 0 0 0 0 0 2148.73 -66.4541 0 0 -217.368 0 0 0 -2418.36 0 0 0 0 0 0.01 0 855.51 0 0 0 0 0 0 0 0 0 0 0 0 1839.27 0 0 0 0 366.298 499.207 0 0 0 0 0 0 0 
0 0 0 -2418.36 0 0 2402.8 0 -1235.31 0 0 0 0 2110.13 0 0 -569.552 0 -2339.63 901.44 0 0 0 0 0 0 -1242.33 0 -310.144 1050.83 0 0 0 0.08 1954.63 2187.49 0 0 1489.68 -503.021 -788.675 0 -2468.57 0 -2171.47 0 1345.18 0 -279.321 0 1168.17 0 0 0 1636.17 0 0 1846.45 0 0 0 
704.138 0 0 0 0 0 0 -1739.33 2344.81 0 0 0 0 0 0 0 0 0 1427.73 1525.09 0 554.598 1380.28 7.70592 0 0 0 0 0 2073.5 0 0 2246.7 -2292.47 0.04 0 0 0 0 0 0 0 0 2306.51 0 -1249.05 0 -750.069 0 0 0 0 0 693.457 0 0 -1507.54 0 0 0 0 
-483.642 0 0 0 512.024 0 0 0 -915.479 0 -1348.23 -2200.61 0 2246.24 1315.73 -201.193 0 677.282 1451.69 0 1990.8 0 433.897 0 1329.31 0 0 0 0 1284.45 1858.35 -307.245 0 -1977.52 0 0.03 0 0 0 0 0 0 0 0 0 0 0 0 0 0 0 0 0 0 0 -1063.19 0 0 0 0 0 
0 0 0 0 1233.18 0 136.799 0 1946.55 -750.069 0 0 0 2211.14 0 0 0 0 0 0 0 0 0 0 0 2052.6 0 -641.728 383.694 30.5948 0 0 0 0 0 0 0.06 0 0 0 0 0 963.393 2097.31 0 0 -724.891 0 0 0 0 0 859.325 0 0 0 0 0 0 1990.34 0 
0 0 0 -805.46 0 0 -39.903 0 0 0 0 377.59 1268.43 0 0 0 0 0 0 902.814 0 0 0 0 0 1436.58 0 0 0 0 0 723.975 0 0 0 0 0 0.03 -290.155 -461.974 0 0 0 0 0 -1636.48 0 0 0 -2349.24 0 0 0 0 -53.3311 0 1852.55 0 0 0 1781.14 
-973.922 0 0 0 0 1621.68 0 0 0 0 0 -633.03 0 0 0 0 0 0 2211.14 0 0 0 0 0 0 -925.855 1462.07 2444.3 -2047.11 0 2377.01 0 0 1163.14 0 0 0 299.615 0.03 0 0 1181.45 0 56.6881 -681.402 0 0 -2472.08 0 0 0 -1765.11 0 0 0 0 0 0 0 0 154.195 
890.759 0 2250.97 0 1518.98 0 0 0 3.58592 0 0 0 0 0 1871.32 -2217.86 0 0 0 -2482.3 0 0 155.263 0 0 0 0 0 605.411 0 0 84.3074 0 1792.43 0 0 0 271.691 0 0.06 0 0 0 0 1383.79 0 1450.93 -1543.7 0 0 0 0 -2020.86 0 2102.8 0 2212.52 0 1946.7 0 -756.478 
0 1359.22 -884.198 0 0 0 0 0 -1930.68 0 0 0 0 0 0 2065.11 0 0 2177.57 0 0 -2067.09 0 0 0 0 2134.24 1920.76 0 1125.14 0 0 0 -1045.03 0 0 0 0 0 0 0.08 0 0 -1178.7 -28.6111 0 0 0 -2314.75 -616.703 0 1367.31 0 0 -1359.98 2113.03 0 0 0 0 0 
0 0 0 0 0 0 0 0 0 -1187.4 0 0 1247.06 0 0 -1375.24 2016.59 0 1976.91 0 -1974.17 0 0 1482.82 0 0 -1095.69 0 0 0 382.931 2331.08 0 0 0 0 0 0 1521.12 0 0 0.08 0 2165.67 0 985.519 0 0 1578.95 0 0 1749.85 0 0 1100.42 1672.95 0 0 0 0 0 
0 0 0 -273.37 2434.08 -1498.08 0 0 0 0 0 0 0 0 1138.87 0 0 0 0 1161.31 0 0 -1213.95 0 -366.909 0 0 0 0 0 -1926.1 0 0 612.888 0 0 -263.451 0 0 0 0 0 0.09 2004.99 0 1386.53 0 0 0 662.481 2487.18 924.94 0 0 0 0 0 0 0 0 0 
0 820.414 0 0 0 0 2481.08 0 0 0 0 0 0 0 0 0 0 0 0 0 0 0 1343.04 0 0 0 0 0 0 -446.867 0 -217.215 0 0 -1969.59 0 1363.8 0 1368.68 0 -442.9 154.042 1912.98 0.02 0 388.272 0 0 2083.73 0 0 0 0 0 1045.18 0 0 0 0 1765.57 0 
0 -296.869 0 0 0 0 0 0 0 0 2245.48 -547.578 0 -257.5 0 0 0 0 1969.74 0 0 0 852.763 0 0 -2282.4 0 0 0 0 264.672 0 0 721.534 0 0 0 0 2090.59 -1808.15 1357.84 0 0 0 0.03 0 0 0 0 0 0 0 0 0 0 0 0 -1973.86 0 0 0 
-632.267 600.681 0 -1063.95 0 0 0 0 0 0 0 0 0 0 2383.88 0 0 -1705.6 0 0 0 0 0 0 0 860.546 0 -1995.68 0 -1470.15 0 0 0 0 162.13 0 0 385.525 0 0 0 669.652 783.792 510.956 0 0.05 0 0 0 0 0 0 0 0 2177.11 724.738 8.31629 0 0 0 0 
0 0 0 0 1990.19 880.993 -757.546 -1119.19 0 0 0 0 0 1039.99 0 0 0 -2153.77 0 0 986.892 0 0 0 2125.08 0 721.076 0 0 0 0 2203.51 0 957.289 0 0 1436.89 0 0 2440.64 0 0 0 0 0 0 0.07 0 951.186 1358.91 0 0 -807.901 -1679.82 963.546 0 0 0 -593.204 -1070.06 0 
0 0 0 0 0 0 0 0 0 1062.43 0 0 0 0 0 0 0 0 1310.24 0 0 0 0 1443.75 0 -2208.55 0 0 0 0 0 567.873 2248.99 0 1644.11 0 0 0 1170.31 618.534 0 0 0 0 0 0 0 0.02 223.014 0 0 92.0896 0 0 0 0 0 0 0 -1105.3 0 
0 0 1422.24 0 -2365.72 -1282.92 -2018.57 0 2132.86 -412.381 0 0 0 0 0 -3.12815 487.915 0 0 0 0 1994.46 0 268.487 0 0 0 2074.88 -39.7504 0 0 0 0 1686.22 0 0 0 0 0 0 425.657 1349.45 0 993.759 0 0 -1904.89 467.925 0.09 0 357.601 2033.52 1247.22 998.489 0 -18.6926 0 1150.01 0 0 1647.62 
0 -2453.92 0 0 0 -133.9 0 0 0 0 1820.96 0 0 0 0 0 -1510.9 0 1792.58 0 0 273.37 -2389.52 0 0 0 0 0 0 1305.81 0 0 0 0 0 0 0 145.344 0 0 2359.31 0 2387.84 0 0 0 379.116 0 0 0 0 0 0 0 0 1114.76 0 0 0 -69.9637 0 
0 0 0 0 0 0 0 0 0 2198.48 1298.49 0 -2496.8 0 0 0 0 0 -1633.88 0 0 0 0 2041.92 0 0 0 0 0 0 0 0 0 -1741.46 0 0 0 0 0 0 0 0 -1938.46 0 0 0 0 0 1870.71 0 0.02 0 -1174.58 0 0 1488.31 0 2482.91 0 0 0 
2419.43 -1894.51 0 0 1071.43 0 0 0 0 0 0 0 0 0 0 0 0 0 0 0 -1597.42 0 2371.36 0 0 0 0 0 0 0 1341.82 0 0 0 0 0 0 0 -335.475 0 581.912 164.266 -1419.95 0 0 0 0 528.352 2390.9 0 0 0.03 0 0 0 0 -1513.79 1430.94 -812.174 0 0 
0 0 0 0 0 0 0 0 0 -2364.35 0 436.949 0 0 0 0 0 -1144.22 0 0 463.042 0 2030.02 0 0 0 2050.92 0 0 30.7474 0 0 -1665.32 0 0 0 -1723.91 0 0 402.463 0 0 0 0 0 0 -2130.27 0 1132.31 0 2100.05 0 0.09 0 0 434.049 0 0 0 2414.7 0 
1267.05 0 1097.98 0 -1181.6 -346.004 0 -274.438 0 -1771.98 0 0 -1330.99 -1790.9 0 0 0 1711.86 0 0 0 0 0 0 0 56.3829 0 0 277.337 0 -1417.36 585.879 2403.1 0 2299.8 0 0 0 0 0 0 0 0 0 0 0 966.292 0 1530.73 0 0 0 0 0 0 0 0 0 0 0 0 
0 0 1975.08 0 1128.96 0 2457.58 0 0 0 -1143.6 0 0 1981.49 1818.98 0 0 -671.178 -310.144 0 0 0 0 884.96 0 -554.292 0 1591.46 0 0 0 0 0 2228.39 0 0 0 1011.61 0 -448.088 1815.62 2112.11 0 1343.04 0 94.2259 1211.36 0 0 0 0 0 0 0 0.04 0 0 0 0 -183.95 898.083 
1798.23 0 0 -241.63 0 0 0 1899.7 0 0 0 0 0 0 0 0 0 0 -1597.87 760.445 2013.53 0 0 0 0 499.054 0 0 -1211.05 0 0 2008.04 0 0 0 176.473 0 0 0 0 849.559 1466.34 0 0 0 -1168.63 0 0 -2067.71 758.309 690.863 0 988.723 0 0 0.09 0 0 0 0 1162.22 
0 0 928.907 0 0 655.766 1820.05 0 0 0 0 2277.83 0 0 0 0 0 0 1665.78 0 -1374.32 0 0 0 0 -1139.03 705.664 0 0 0 0 2118.67 0 0 -639.592 0 0 -540.559 0 -1394.62 0 0 0 0 0 -2285.76 0 0 0 0 0 -2007.13 0 0 0 0 0.06 0 351.497 2157.43 0 
0 0 1373.41 0 2136.07 0 0 0 0 0 1547.82 -270.775 0 35.783 0 -1286.13 0 483.032 0 0 0 0 0 0 0 629.215 0 0 2195.88 0 0 0 0 1275.44 0 0 0 0 0 0 0 0 0 0 1157.49 0 0 0 -177.847 0 226.524 1209.07 0 0 0 0 0 0.07 0 0 0 
0 0 0 0 1842.02 1745.43 2010.48 0 0 -1554.84 0 0 0 0 0 0 0 0 0 2.36518 0 0 0 0 -947.066 0 0 0 2145.22 1627.48 0 1912.06 0 0 0 0 0 0 0 -208.975 0 0 0 0 0 0 2143.54 0 0 0 0 -2168.26 0 0 0 0 -727.485 0 0.03 0 0 
2116.84 0 0 0 0 0 -1432.62 -1763.74 0 0 0 0 0 0 0 1799.45 0 0 0 0 0 0 0 0 1901.68 0 0 0 0 0 -2225.79 0 0 0 0 0 1338.47 0 0 0 0 0 0 -519.044 0 0 714.209 1432.92 0 1197.16 0 0 -631.047 0 13.0467 0 2449.95 0 0 0 0 
0 0 0 0 0 -1684.55 0 0 0 0 0 0 0 0 0 0 2152.09 0 0 0 0 0 0 0 0 0 0 0 0 0 0 0 0 0 0 0 0 1442.84 1529.05 -2066.64 0 0 0 0 0 0 0 0 2155.29 0 0 0 0 0 -2082.81 1804.94 0 0 0 0 0.04 
