*Vertices 55
*Matrix 
0.06 0 0 0 1290.09 0 0 0 0 0 1501.89 1007.8 798.593 0 0 0 0 0 0 -66.1489 0 0 561.464 0 0 0 0 0 0 0 0 0 0 0 0 0 0 0 -2486.42 0 0 -57.6037 0 0 0 0 0 0 0 0 0 0 0 0 0 
0 0.03 0 2040.54 0 0 0 0 1675.08 0 0 0 1432.62 0 0 76.0674 0 0 0 -875.805 0 0 0 0 0 0 0 0 0 0 0 0 0 0 0 0 0 0 0 0 0 0 0 0 0 0 0 0 1960.74 924.329 0 0 0 0 0 
0 0 0.07 0 0 0 0 0 0 2110.28 0 0 0 0 0 0 0 0 0 0 0 0 0 0 0 0 0 0 0 0 0 0 0 531.098 0 0 0 0 0 0 0 0 1141.77 0 0 0 376.064 0 320.063 0 0 0 0 0 0 
0 1565.68 0 0 0 1280.63 0 0 0 0 0 0 0 0 0 0 0 0 0 0 0 0 0 0 0 0 2249.9 0 0 0 0 0 0 0 0 0 0 0 0 0 0 0 0 0 0 0 0 0 0 0 0 0 0 0 0 
-251.854 0 0 0 0.06 0 0 0 0 0 0 0 2243.03 336.238 0 1071.12 0 0 0 0 0 0 0 491.272 0 2333.83 0 0 0 0 0 0 0 -1919.69 0 0 0 0 0 0 0 0 0 0 0 0 0 0 0 0 0 0 0 0 0 
0 0 0 -915.784 0 0.06 0 0 0 0 1304.28 0 0 2317.65 0 0 0 0 0 0 0 0 0 1656.47 0 0 0 0 0 -2102.04 0 -135.273 0 0 0 0 1169.09 0 558.107 0 0 0 0 0 0 0 0 0 0 0 0 0 0 0 0 
0 0 0 0 0 0 0.03 1077.07 0 0 0 0 0 0 2035.36 0 0 0 0 0 0 0 0 0 -475.097 0 1354.64 827.738 0 0 0 0 0 0 0 0 0 0 0 0 0 0 0 0 0 0 0 2414.55 -217.215 0 0 0 0 0 0 
0 0 0 0 0 0 -1101.79 0.02 0 0 2479.4 0 0 0 0 0 0 2217.25 0 0 -2367.85 0 0 0 0 -1965.62 0 -549.257 0 0 0 0 831.401 0 0 0 0 -981.246 0 0 0 0 0 2278.44 0 0 0 0 0 0 0 0 0 0 0 
0 2286.37 0 0 0 0 0 0 0 0 0 -869.701 0 0 0 0 0 -616.55 0 0 0 0 0 0 1547.06 0 0 0 0 0 2188.1 0 0 0 0 0 0 0 0 0 0 0 0 0 821.787 0 0 2183.22 2148.88 0 0 0 0 0 0 
0 0 2494.66 0 0 0 0 0 0 0.02 0 0 -2153.92 0 0 0 0 859.478 0 0 0 0 0 1312.52 0 0 0 0 0 0 0 -1332.82 0 0 0 0 0 0 -850.78 0 0 0 0 403.531 281.61 0 0 0 0 0 0 0 0 259.026 0 
472.655 0 0 0 0 2187.95 0 2173.6 0 0 0.08 747.78 0 0 0 0 0 0 0 1950.97 0 -1782.51 0 0 0 2370.91 0 0 0 0 0 0 0 0 0 0 0 0 0 0 0 0 0 0 0 0 0 0 0 0 0 0 0 0 0 
-2361.9 0 0 0 0 0 0 0 -473.113 0 587.1 0.09 0 0 0 1215.93 0 0 0 0 0 1622.14 0 0 0 0 0 0 0 0 0 0 0 0 0 278.253 0 395.291 0 0 0 394.833 0 0 0 0 0 0 0 0 0 0 0 0 0 
2361.6 23.7281 0 0 2147.82 0 0 0 0 -2178.79 0 0 0.08 754.646 0 0 0 2462.31 0 -0.534074 0 -439.085 0 0 0 0 0 0 0 -1937.54 0 1485.11 0 0 0 0 0 -1036.18 0 0 0 0 0 2324.98 0 0 0 0 0 -1612.06 0 0 0 0 0 
0 0 0 0 -1471.98 1223.72 0 0 0 0 0 0 -332.118 0.09 0 0 1942.12 0 2198.63 0 0 567.721 0 0 0 0 0 0 80.7978 0 0 0 0 0 0 -544.679 0 0 0 0 0 0 0 0 0 -1035.11 1978.9 0 0 0 0 -1874.83 0 0 0 
0 0 0 0 0 0 1515.47 0 0 0 0 0 0 0 0.07 0 0 0 -2277.37 0 1739.17 0 0 0 0 0 0 1035.72 0 0 0 1220.97 0 0 716.346 0 2084.19 0 0 1153.52 0 0 0 0 0 0 2259.97 -961.104 0 0 0 0 0 0 0 
0 1975.39 0 0 744.575 0 0 0 0 0 0 1494.42 0 0 0 0.01 2056.87 0 0 1833.17 0 2280.57 0 0 311.975 0 0 0 -1000.32 0 0 0 0 0 0 0 0 0 0 0 0 0 0 0 0 0 0 0 1240.35 0 0 0 0 0 0 
0 0 0 0 0 0 0 0 0 0 0 0 0 2148.27 0 -1328.39 0.01 0 0 0 0 0 -653.783 0 0 0 0 0 0 0 0 0 0 0 0 0 44.9385 0 0 2454.68 0 0 0 0 0 0 0 0 2116.53 0 0 0 0 0 0 
0 0 0 0 0 0 0 -2139.12 1876.51 1638.46 0 0 -1184.65 0 0 0 0 0.03 0 0 0 0 0 0 334.407 0 0 0 0 0 0 0 1324.43 0 0 0 0 0 0 0 0 0 0 0 0 0 0 0 0 0 0 0 0 0 0 
0 0 0 0 0 0 0 0 0 0 0 0 0 2277.98 -1778.54 0 0 0 0.03 0 0 0 -71.6422 0 0 0 1712.16 0 0 -1866.59 0 0 0 0 0 1923.05 0 0 -1602.6 0 1061.36 0 1155.81 0 0 0 0 0 0 0 0 0 0 0 0 
1054.64 2078.84 0 0 0 0 0 0 0 0 -2283.62 0 700.476 0 0 628.3 0 0 0 0.03 0 0 0 0 0 0 0 647.221 0 0 0 0 0 0 0 466.857 0 0 0 2460.63 0 -689.184 0 0 0 0 0 -2444.76 0 0 0 0 0 0 0 
0 0 0 0 0 0 0 1811.04 0 0 0 0 0 0 -559.328 0 0 0 0 0 0.02 0 0 0 0 -2072.74 0 0 0 0 0 0 0 0 0 0 0 0 0 0 0 0 0 1521.42 0 0 0 0 0 1078.3 0 0 0 0 0 
0 0 0 0 0 0 0 0 0 0 2018.88 1568.12 928.907 -15.183 0 -1752.91 0 0 0 0 0 0.01 0 0 0 528.199 0 0 0 0 -538.728 0 0 0 0 0 0 0 0 0 0 0 0 0 -1336.48 0 0 0 0 0 0 0 0 0 0 
-1716.9 0 0 0 0 0 0 0 0 0 0 0 0 0 0 0 1277.89 0 -586.947 0 0 0 0.08 0 631.657 0 0 0 0 0 0 0 0 0 1039.99 1244.32 1638.62 0 0 0 0 0 0 0 -1597.87 0 1330.84 0 1162.83 0 0 0 0 0 0 
0 0 0 0 121.998 -140.614 0 0 0 -665.075 0 0 0 0 0 0 0 0 0 0 0 0 0 0.01 0 0 0 0 0 0 0 0 0 0 0 0 0 0 0 0 0 1931.9 0 0 0 0 0 0 265.587 0 0 0 0 0 0 
0 0 0 0 0 0 1901.99 0 -689.642 0 0 0 0 0 0 -728.248 0 2187.8 0 0 0 0 288.476 0 0.07 0 0 0 0 0 0 0 2137.44 0 385.372 2018.57 0 0 0 0 0 0 0 0 0 -1358.46 0 0 0 0 0 0 0 0 0 
0 0 0 0 -722.144 0 0 1080.13 0 0 1997.36 0 0 0 0 0 0 0 0 0 1657.84 77.5933 0 0 0 0.04 -1329.46 0 0 0 0 0 0 0 0 0 0 0 0 0 -1124.07 0 0 0 0 0 0 0 0 0 0 0 0 0 0 
0 0 0 -1197.47 0 0 1294.06 0 0 0 0 0 0 0 0 0 0 0 2312.62 0 0 0 0 0 0 1093.4 0.05 0 0 0 0 0 0 0 0 0 0 0 0 0 0 0 0 0 0 0 2447.97 0 0 -920.515 0 0 0 0 0 
0 0 0 0 0 0 686.438 1692.79 0 0 0 0 0 0 -1558.35 0 0 0 0 999.557 0 0 0 0 0 0 0 0.02 0 0 0 0 0 -381.1 0 0 0 640.355 0 781.655 0 0 0 0 0 0 0 -480.743 0 0 0 0 0 0 0 
0 0 0 0 0 0 0 0 0 0 0 0 0 580.538 0 417.57 0 0 0 0 0 0 0 0 0 0 0 0 0.06 0 0 0 -127.644 0 2411.95 0 0 0 1306.27 0 0 0 0 0 0 0 0 0 0 0 0 0 0 0 0 
0 0 0 0 0 2008.19 0 0 0 0 0 0 1667.46 0 0 0 0 0 725.654 0 0 0 0 0 0 0 0 0 0 0 0 0 0 0 -372.707 0 1084.4 0 0 0 0 0 0 190.512 0 0 0 0 0 0 0 0 0 0 0 
0 0 0 0 0 0 0 0 -685.217 0 0 0 0 0 0 0 0 0 0 0 0 -1032.98 0 0 0 0 0 0 0 0 0.03 0 18.6926 0 1908.7 0 0 0 0 0 0 0 0 0 0 1444.21 0 0 0 0 0 0 0 0 0 
0 0 0 0 0 1337.09 0 0 0 -2260.89 0 0 2191.15 0 722.907 0 0 0 0 0 0 0 0 0 0 0 0 0 0 0 0 0.08 0 0 659.886 0 0 0 1385.92 0 0 0 0 0 0 -1312.52 1672.95 0 -182.119 0 0 0 0 0 0 
0 0 0 0 0 0 0 2343.75 0 0 0 0 0 0 0 0 0 1618.17 0 0 0 0 0 0 1932.36 0 0 0 1648.38 0 -300.226 0 0.03 0 0 0 0 0 0 0 0 0 0 0 0 784.86 0 0 0 0 0 0 0 0 0 
0 0 2044.36 0 2207.79 0 0 0 0 0 0 0 0 0 0 0 0 0 0 0 0 0 0 0 0 0 0 -2479.86 0 0 0 0 0 0.06 0 0 0 -692.999 0 0 795.846 0 0 0 0 0 274.59 0 0 0 399.106 0 0 0 0 
0 0 0 0 0 0 0 0 0 0 0 0 0 0 913.343 0 0 0 0 0 0 0 -619.602 0 2419.43 0 0 0 -1253.32 255.669 2419.13 747.322 0 0 0.05 0 0 0 0 0 0 0 0 0 0 0 0 0 0 0 2367.4 0 0 0 0 
0 0 0 0 0 0 0 0 0 0 0 1175.65 0 -1139.79 0 0 0 0 262.078 1035.11 0 0 -322.962 0 -1603.21 0 0 0 0 0 0 0 0 0 0 0.01 0 0 0 0 0 0 0 0 0 1090.81 0 0 -1846.14 0 1989.58 0 0 0 2404.93 
0 0 0 0 0 1112.93 0 0 0 0 0 0 0 0 -711.921 0 630.894 0 0 0 0 0 923.109 0 0 0 0 0 0 1691.87 0 0 0 0 0 0 0.05 0 0 0 0 -708.411 753.426 0 0 0 0 0 0 0 0 0 357.753 0 0 
0 0 0 0 0 0 0 2304.68 0 0 0 -1853.31 -1501.28 0 0 0 0 0 0 0 0 0 0 0 0 0 0 1396.15 0 0 0 0 0 1324.27 0 0 0 0.01 0 0 0 0 0 0 0 0 0 0 0 -187.613 0 0 0 0 0 
776.009 0 0 0 0 -1510.9 0 0 0 2475.74 0 0 0 0 0 0 0 0 -1214.56 0 0 0 0 0 0 0 0 0 330.592 0 0 1045.64 0 0 0 0 0 0 0.05 2313.99 0 0 0 0 0 0 0 0 0 0 0 0 0 0 0 
0 0 0 0 0 0 0 0 0 0 0 0 0 0 1740.09 0 1076.46 0 0 1593.14 0 0 0 0 0 0 0 -487.304 0 0 0 0 0 0 0 0 0 0 1831.49 0.03 0 0 0 0 0 0 -516.907 0 0 0 0 0 0 0 0 
0 0 0 0 0 0 0 0 0 0 0 0 0 0 0 0 0 0 878.857 0 0 0 0 0 0 -1871.78 0 0 0 0 0 0 0 1138.26 0 0 0 0 0 0 0.03 0 0 0 0 0 -76.6778 0 952.864 0 0 0 0 0 0 
-2302.55 0 0 0 0 0 0 0 0 0 0 876.263 0 0 0 0 0 0 0 1047.93 0 0 0 994.369 0 0 0 0 0 0 0 0 0 0 0 0 2487.49 0 0 0 0 0.06 0 0 0 0 0 0 0 0 0 0 0 0 0 
0 0 1651.89 0 0 0 0 0 0 0 0 0 0 0 0 0 0 0 2172.08 0 0 0 0 0 0 0 0 0 0 0 0 0 0 0 0 0 1386.07 0 0 0 0 0 0.03 0 492.492 0 0 -2484.44 0 0 0 0 0 0 0 
0 0 0 0 0 0 0 -222.709 0 1479.31 0 0 -361.721 0 0 0 0 0 0 0 -246.666 0 0 0 0 0 0 0 0 2348.63 0 0 0 0 0 0 0 0 0 0 0 0 0 0.09 1988.97 0 0 0 0 0 0 0 0 0 0 
0 0 0 0 0 0 0 0 1879.86 1809.21 0 0 0 0 0 0 0 0 0 0 0 -301.294 -922.498 0 0 0 0 0 0 0 0 0 0 0 0 0 0 0 0 0 0 0 725.196 2290.49 0.01 0 0 1259.27 0 0 0 0 0 0 0 
0 0 0 0 0 0 0 0 0 0 0 0 0 -581.759 0 0 0 0 0 0 0 0 0 0 -497.223 0 0 0 0 0 -1574.68 2131.34 437.559 0 0 1694.92 0 0 0 0 0 0 0 0 0 0.05 0 0 0 0 0 0 0 0 0 
0 0 2086.93 0 0 0 0 0 0 0 0 0 0 -1222.65 -662.175 0 0 0 0 0 0 0 -984.451 0 0 0 -1435.97 0 0 0 0 141.072 0 1408.51 0 0 0 0 0 1067.46 2405.85 0 0 0 0 0 0.09 0 0 2287.9 0 0 0 0 0 
0 0 0 0 0 0 1669.13 0 404.599 0 0 0 0 0 -797.22 0 0 0 0 -2485.66 0 0 0 0 0 0 0 1797.92 0 0 0 0 0 0 0 0 0 0 0 0 0 0 987.503 0 -816.904 0 0 0 0 0 0 0 0 0 0 
0 1689.89 2288.66 0 0 0 2497.56 0 1168.78 0 0 0 0 0 0 -1589.18 396.512 0 0 0 0 0 -1422.7 2101.73 0 0 0 0 0 0 0 -269.25 0 0 0 -2384.64 0 0 0 0 2311.85 0 0 0 0 0 0 0 0.06 0 0 0 0 0 0 
0 38.6822 0 0 0 0 0 0 0 0 0 0 1621.68 0 0 0 0 0 0 0 24.3385 0 0 0 0 0 197.226 0 0 0 0 0 0 0 0 0 0 1368.83 0 0 0 0 0 0 0 0 1931.14 0 0 0.07 0 0 0 0 0 
0 0 0 0 0 0 0 0 0 0 0 0 0 0 0 0 0 0 0 0 0 0 0 0 0 0 0 0 0 0 0 0 0 2037.19 -492.95 -1665.62 0 0 0 0 0 0 0 0 0 0 0 0 0 0 0.01 0 0 0 0 
0 0 0 0 0 0 0 0 0 0 0 0 0 1553.16 0 0 0 0 0 0 0 0 0 0 0 0 0 0 0 0 0 0 0 0 0 0 0 0 0 0 0 0 0 0 0 0 0 0 0 0 0 0.08 0 0 0 
0 0 0 0 0 0 0 0 0 0 0 0 0 0 0 0 0 0 0 0 0 0 0 0 0 0 0 0 0 0 0 0 0 0 0 0 1444.21 0 0 0 0 0 0 0 0 0 0 0 0 0 0 0 0.05 0 0 
0 0 0 0 0 0 0 0 0 147.786 0 0 0 0 0 0 0 0 0 0 0 0 0 0 0 0 0 0 0 0 0 0 0 0 0 0 0 0 0 0 0 0 0 0 0 0 0 0 0 0 0 0 0 0.01 0 
0 0 0 0 0 0 0 0 0 0 0 0 0 0 0 0 0 0 0 0 0 0 0 0 0 0 0 0 0 0 0 0 0 0 0 1314.51 0 0 0 0 0 0 0 0 0 0 0 0 0 0 0 0 0 0 0.03 
