*Vertices 68
*Matrix 
0.03 0 0 0 1718.57 6.18 0 0 0 0 0 0 0 1891.61 -296.106 0 544.984 -1152.3 0 0 0 0 0 0 0 -1096.45 0 0 0 0 0 0 0 0 0 0 0 0 0 0 -86.9015 2301.17 0 0 0 0 331.507 0 0 0 0 0 0 0 0 -1791.36 0 0 0 0 0 0 0 0 0 -125.965 0 0 
0 0.06 2297.51 0 0 -1478.09 0 -22.0496 0 0 1732.15 0 370.266 0 0 1530.73 -1843.39 0 0 0 -787.149 0 0 0 0 -1584.75 0 0 0 0 154.805 0 0 2266.53 0 0 0 0 0 0 0 0 -1994.46 0 457.244 0 0 0 0 0 0 0 0 0 0 0 0 0 0 0 0 0 0 716.041 0 0 -1950.51 0 
0 543.458 0.01 0 0 0 0 0 0 0 572.451 0 0 1937.54 0 0 0 0 863.445 0 -142.903 0 -529.725 0 0 1522.8 0 0 -1407.9 0 0 0 0 0 0 0 0 0 0 0 0 0 0 0 0 0 0 0 0 939.436 2312.31 0 0 0 0 0 0 0 0 0 0 0 0 0 0 0 -877.178 0 
0 0 0 0.01 0 0 0 1264.92 1455.05 0 0 0 464.873 242.698 0 0 0 2081.9 0 0 -935.163 0 0 0 0 1960.59 462.279 0 0 0 1317.41 0 1600.47 0 0 0 0 0 0 0 0 0 0 0 2098.38 0 0 0 0 0 0 0 0 0 2011.25 0 0 0 0 0 0 0 0 0 0 0 0 0 
1519.9 0 0 0 0.03 0 118.641 1648.69 2144.31 0 0 0 0 0 0 1725.9 0 0 1388.67 0 2101.12 0 0 0 208.823 -1733.53 0 0 123.981 0 -1309.02 0 0 0 0 0 0 0 0 0 0 0 1732.46 0 0 0 0 0 0 0 0 0 0 0 -171.59 0 0 0 -441.832 0 457.701 0 0 -1686.07 0 0 1949.29 0 
2012.16 714.667 0 0 0 0.09 1368.07 0 -1733.53 -1237.75 0 0 0 0 0 0 0 0 0 0 1510.13 0 0 0 -1125.45 0 -343.867 0 -17.1667 -918.378 0 0 0 0 0 0 2393.03 0 0 0 0 0 0 0 2173.91 0 737.709 0 0 0 -1906.11 0 0 0 0 0 0 -1101.95 0 0 0 0 0 0 0 0 0 0 
0 0 0 0 150.838 1353.72 0 0 0 -1707.59 1351.13 0 0 0 0 0 0 -1066.09 0 0 0 0 0 0 0 0 0 0 0 0 0 0 0 0 0 1632.36 0 2107.23 0 0 0 0 0 2078.54 0 0 0 0 0 0 0 0 0 0 0 0 0 0 148.244 659.124 1511.96 0 0 0 0 0 0 0 
0 -557.192 0 561.159 -1733.83 0 0 0.03 1168.78 -1947.92 0 1803.26 0 0 1283.84 2002.4 0 0 0 0 0 0 0 0 -358.364 0 373.012 0 0 0 0 0 0 951.033 0 0 0 0 0 0 0 0 0 0 0 0 1940.75 0 0 0 0 0 0 0 0 0 0 0 0 0 0 0 0 0 0 -2463.07 -2497.25 0 
0 0 0 430.845 698.492 -2131.95 0 655.919 0.03 0 2244.87 -1625.95 0 0 0 0 0 0 0 0 0 0 722.602 -2111.5 0 0 1022.9 0 0 0 0 0 0 1880.32 0 2259.21 0 0 -2460.17 0 0 0 0 2044.51 0 1405 -2380.52 0 0 0 0 0 0 0 -635.167 0 0 0 152.364 -2245.02 0 0 0 0 0 0 0 0 
0 0 0 0 0 1491.52 2316.58 2494.2 0 0.08 0 0 0 0 0 -1400.57 0 0 -1810.89 0 0 0 1272.7 0 1717.66 -178.457 0 -252.464 0 0 0 2343.9 -223.777 0 0 0 0 0 778.603 0 0 0 0 0 0 1599.25 0 0 0 0 0 -2437.44 0 0 0 0 0 0 0 0 0 0 0 0 0 0 0 -1956.31 
0 1288.87 2492.68 0 0 0 1003.98 0 -2429.04 0 0.03 0 0 2136.22 0 0 2462.77 0 0 0 1496.09 0 0 0 1135.52 0 159.841 0 547.426 0 0 0 0 0 0 0 0 0 1970.05 0 -1626.71 0 0 0 0 0 0 0 0 0 0 0 -2412.11 -1153.22 0 0 0 0 0 -1680.12 1845.84 0 638.523 0 0 0 0 1104.69 
0 0 0 0 0 0 0 453.429 1630.99 0 0 0.07 -1939.07 0 0 0 0 1189.54 42.3444 0 0 0 0 0 0 0 0 0 0 0 0 0 0 0 2133.01 0 485.473 0 0 -1721.32 0 0 0 0 0 0 0 0 455.107 -910.138 2467.04 -2470.24 0 0 0 0 0 0 0 0 0 0 0 0 -176.321 0 0 0 
0 264.824 0 1128.96 0 0 0 0 0 0 0 1680.58 0.07 0 -1879.71 0 0 0 0 0 2176.66 0 0 0 2091.36 0 0 2067.25 0 0 -531.861 0 -1918.47 0 0 0 0 0 0 0 0 0 0 0 58.8244 0 0 0 -2310.63 0 0 0 0 0 0 0 0 0 0 0 0 -1163.9 0 0 0 -30.9 0 0 
458.922 0 406.583 -1904.58 0 0 0 0 0 0 1556.83 0 0 0.04 858.562 0 0 0 995.59 -536.134 0 0 0 0 0 1692.94 0 0 -1898.94 1840.34 -236.747 0 619.449 -392.392 0 0 1125.45 0 0 0 0 0 0 825.907 0 0 0 0 0 0 0 2160.33 0 0 0 434.812 0 154.5 0 0 0 -2368.16 0 0 0 0 0 334.559 
2028.03 0 0 0 0 0 0 -389.798 0 0 0 0 2235.1 2028.64 0.01 0 0 0 0 0 0 0 0 0 0 -1334.5 -1840.49 -754.036 0 0 0 0 0 1741.61 2233.57 0 792.337 0 0 476.318 -61.8763 0 0 0 0 0 0 0 0 0 0 0 0 2448.58 0 0 -2467.5 0 0 0 0 0 -2142.93 0 0 0 0 0 
0 917.005 0 0 -1132.16 0 0 835.978 0 439.695 0 0 0 0 0 0.01 0 0 0 -1440.7 0 0 0 0 0 0 0 0 -389.798 0 0 0 0 0 0 0 0 0 2162.62 0 0 0 0 0 0 0 0 0 0 0 0 0 -2319.18 0 0 0 1948.68 0 0 0 0 0 0 0 0 0 0 0 
-233.39 793.252 0 0 0 0 0 0 0 0 -1993.39 0 0 0 0 0 0.05 1629.15 0 0 0 0 0 1560.03 0 0 1922.9 2449.49 0 -2110.58 0 1140.71 0 454.039 0 0 0 0 0 0 0 0 0 0 0 2245.32 0 0 0 0 -2352.29 -1218.99 563.906 0 0 0 0 0 0 0 0 0 593.661 0 0 0 0 0 
-1643.65 0 0 83.697 0 0 495.239 0 0 0 0 370.113 0 0 0 0 2472.38 0.05 0 0 0 678.961 1195.79 0 -482.421 0 2118.82 0 0 0 0 0 0 0 0 0 0 0 0 0 0 0 0 0 0 0 0 0 143.513 0 0 0 -609.989 0 0 2402.8 0 0 0 -370.266 0 0 0 0 0 0 0 0 
0 0 -711.768 0 2156.06 0 0 0 0 1729.26 0 -1048.54 0 1149.25 0 0 0 0 0.04 1651.43 -678.961 0 1688.06 0 344.172 -374.386 0 0 0 0 0 -751.9 0 1090.81 0 0 0 0 0 0 0 0 0 0 0 0 0 0 0 0 0 0 0 0 0 0 2009.41 0 0 0 0 0 0 0 0 0 0 0 
0 0 0 0 0 0 0 0 0 0 0 0 0 2028.03 0 1172.14 0 0 -901.593 0.06 0 0 0 0 1430.33 0 0 0 2231.13 0 555.361 -2246.24 0 2059.62 0 0 0 2350.15 0 0 0 0 0 0 1253.17 0 0 0 0 0 0 0 0 0 0 0 0 0 0 0 0 0 0 0 0 0 0 0 
0 1843.85 1695.53 2069.99 534.761 1604.59 0 0 0 0 -1815.32 0 -2313.84 0 0 0 0 0 1517.61 0 0.08 -276.879 2087.54 1069.9 0 0 186.85 0 0 1089.43 -2277.21 0 0 0 0 0 0 0 0 0 0 584.201 0 853.526 0 0 0 0 0 -1673.71 1958.91 0 0 1855.91 0 0 0 0 0 0 0 0 0 0 0 0 0 0 
0 0 0 0 0 0 0 0 0 0 0 0 0 0 0 0 0 -2174.37 0 0 1644.87 0 0 0 0 0 0 0 0 0 0 -1596.8 0 -666.601 0 0 1600.77 0 0 0 0 0 0 0 0 0 0 0 1891.61 0 0 0 0 0 1963.64 0 2219.99 199.667 0 0 0 0 0 0 0 0 0 0 
0 0 1133.84 0 0 0 0 0 1744.51 -2017.96 0 0 0 0 0 0 0 844.676 -2184.74 0 1129.11 0 0.02 0 0 0 0 0 1976 0 0 0 0 0 0 0 0 1495.48 0 0 957.9 -215.384 0 0 0 0 0 908.612 0 0 0 0 0 0 0 0 0 0 2327.27 0 0 0 0 872.143 0 0 0 0 
0 0 0 0 0 0 0 0 1652.5 0 0 0 0 0 0 0 -665.838 0 0 0 -1389.43 0 0 0.03 0 0 0 591.83 -206.687 0 0 0 0 2309.56 0 0 0 4.65407 0 0 0 -430.845 0 0 1484.95 -2153.92 0 0 0 0 0 0 0 0 0 0 0 0 0 0 0 0 0 -854.137 1763.13 0 0 0 
0 0 0 0 -22.3548 719.55 0 1375.39 0 776.772 1044.57 0 -1998.89 0 0 0 0 2174.67 -1086.08 1435.67 0 0 0 0 0.05 0 0 0 0 -1054.95 0 0 707.343 0 0 0 0 0 0 0 0 0 0 0 0 0 0 0 0 0 0 0 0 0 0 0 0 0 794.778 0 0 0 0 0 0 0 0 0 
-1868.11 -1296.5 -1328.55 -276.116 -2388.3 0 0 0 0 -299.31 0 0 0 -391.781 1101.95 0 0 0 1699.04 0 0 0 0 0 0 0.02 0 0 2471.77 -1209.52 0 0 1328.55 0 0 0 0 0 0 0 0 0 0 1892.22 0 0 0 0 1840.19 -984.451 0 0 0 0 0 0 0 0 0 0 0 0 0 0 0 0 0 0 
0 0 0 2101.58 0 2207.48 0 -158.01 956.526 0 -2316.43 0 0 0 1527.22 0 1727.73 -2285.91 0 0 42.9548 0 0 0 0 0 0.05 -65.9963 -534.913 0 0 0 0 0 0 0 0 969.802 0 0 0 0 -1003.52 0 0 0 0 2142.63 0 862.835 0 0 0 0 0 0 0 0 1284.75 0 0 0 0 0 0 0 0 0 
0 0 0 0 0 0 0 0 0 2192.68 0 0 1596.8 0 -717.872 0 -670.263 0 0 0 0 0 0 2018.42 0 0 97.5829 0.08 0 0 0 0 0 0 0 0 0 0 0 0 0 0 0 0 -889.996 0 0 0 0 0 0 0 0 0 0 0 0 0 0 0 0 0 0 0 973.159 0 0 0 
0 0 2324.98 0 -1669.13 2296.29 0 0 0 0 584.506 0 0 1816.39 0 2417.45 0 0 0 1475.49 0 0 -1542.33 525.3 0 1998.89 1791.36 0 0.08 0 0 0 -969.955 0 0 0 0 0 0 0 0 0 1922.28 0 0 0 0 0 0 0 0 0 0 1919.54 0 0 0 344.63 -1304.13 0 -965.377 0 0 0 0 0 0 0 
0 0 0 0 0 1765.11 0 0 0 0 0 0 0 2199.7 0 0 1368.53 0 0 0 -1011.61 0 0 0 1892.99 1883.07 0 0 0 0.09 2091.66 0 0 -1184.96 536.592 0 0 0 0 0 0 0 0 0 2416.68 0 0 0 0 0 -1585.36 0 0 0 0 1956.47 0 0 0 0 0 0 0 50.737 0 0 0 0 
0 1153.52 0 523.621 1570.25 0 0 0 0 0 0 0 1303.98 399.106 0 0 0 0 0 1507.23 1446.35 0 0 0 0 0 0 0 0 1848.43 0.03 0 0 2422.64 0 0 0 0 0 0 0 -1956.92 0 0 0 0 0 0 0 0 -29.0689 0 0 0 0 0 148.701 0 0 0 0 0 -2220.15 -586.337 1912.82 0 0 0 
0 0 0 0 0 0 0 0 0 2086.47 0 0 0 0 0 0 2360.23 0 -899.304 2359 0 912.122 0 0 0 0 0 0 0 0 0 0.08 1992.32 1434.29 0 0 0 0 0 0 0 0 0 0 0 0 0 91.3266 0 0 0 0 0 0 1118.58 0 1699.65 0 -637.608 785.318 0 0 0 0 0 0 0 0 
0 0 0 922.498 0 0 0 0 0 2136.83 0 0 2293.85 -1540.65 0 0 0 0 0 0 0 0 0 0 -2243.64 -2058.7 0 0 321.131 0 0 -667.821 0.06 0 0 0 0 -12.1311 0 1965.32 0 0 0 0 0 0 0 0 0 0 0 0 0 1936.32 0 0 0 0 0 0 0 0 0 0 0 0 0 0 
0 -212.79 0 0 0 0 0 -2245.93 1603.06 0 0 0 0 842.54 2278.28 0 477.538 0 -1151.23 2091.05 0 2168.72 0 1419.49 0 0 0 0 0 2229.61 2399.44 1452.6 0 0.01 0 0 0 0 -1253.01 0 2284.23 0 0 0 0 -2433.77 0 0 0 0 0 0 0 0 1014.66 0 0 0 0 0 0 -299.158 0 0 0 0 0 0 
0 0 0 0 0 0 0 0 0 0 0 2244.41 0 0 -1714.3 0 0 0 0 0 0 0 0 0 0 0 0 0 0 721.992 0 0 0 0 0.02 0 0 0 -441.984 0 0 0 0 0 0 -1887.8 0 0 0 0 0 0 0 0 91.6318 0 0 2051.68 0 0 0 0 0 0 0 0 0 0 
0 0 0 0 0 0 2282.4 0 2227.01 0 0 0 0 0 0 0 0 0 0 0 0 0 0 0 0 0 0 0 0 0 0 0 0 0 0 0.06 0 0 0 0 0 0 0 0 0 0 1935.87 2312.01 0 1678.59 0 -1901.53 0 0 0 0 0 0 0 0 0 0 0 0 0 0 0 0 
0 0 0 0 0 -437.407 0 0 0 0 0 1475.19 0 1238.98 -418.18 0 0 0 0 0 0 2382.96 0 0 0 0 0 0 0 0 0 0 0 0 0 0 0.03 0 0 -2471.62 0 0 0 0 0 -1697.36 0 0 0 0 0 80.34 -204.855 0 0 0 0 0 0 1582.31 0 0 0 0 -152.974 0 0 -2172.23 
0 0 0 0 0 0 1304.9 0 0 0 0 0 0 0 0 0 0 0 0 2348.48 0 0 -2086.93 269.86 0 0 41.1237 0 0 0 0 0 -727.332 0 0 0 0 0.04 -1810.43 2051.38 0 0 0 0 0 0 62.4866 0 0 0 0 0 0 0 0 0 0 0 0 0 0 0 0 0 0 0 0 0 
0 0 0 0 0 0 0 0 2497.56 1201.44 1146.81 0 0 0 0 -535.676 0 0 0 0 0 0 0 0 0 0 0 0 0 0 0 0 0 2382.81 -93.7681 0 0 -910.443 0.02 0 0 0 0 0 0 0 0 0 0 0 0 0 0 0 0 0 0 0 0 0 0 0 0 0 0 0 0 0 
0 0 0 0 0 0 0 0 0 0 0 2250.36 0 0 2000.87 0 0 0 0 0 0 0 0 0 0 0 0 0 0 0 0 0 2010.64 0 0 0 1305.51 1261.86 0 0.04 0 0 0 0 0 0 0 0 0 0 0 0 0 0 0 0 0 0 0 0 -2098.22 0 534.455 0 0 0 0 0 
2104.48 0 0 0 0 0 0 0 0 0 740.455 0 0 0 1951.89 0 0 0 0 0 0 0 -1118.12 0 0 0 0 0 0 0 0 0 0 1542.94 0 0 0 0 0 0 0.04 0 0 0 0 0 0 0 0 0 864.971 0 0 0 0 0 0 0 0 0 0 -375.912 0 0 -1863.84 0 0 0 
2043.6 0 0 0 0 0 0 0 0 0 0 0 0 0 0 0 0 0 0 0 1449.86 0 1061.97 2267.45 0 0 0 0 0 0 262.23 0 0 0 0 0 0 0 0 0 0 0.09 0 0 -1126.97 0 0 0 0 0 0 144.887 0 -416.807 0 0 0 0 0 0 0 0 0 0 0 0 0 0 
0 1716.44 0 0 1825.39 0 0 0 0 0 0 0 0 0 0 0 0 0 0 0 0 0 0 0 0 0 1191.37 0 555.666 0 0 0 0 0 0 0 0 0 0 0 0 0 0.09 0 0 0 0 0 0 815.073 0 0 0 0 0 0 1623.66 0 1230.89 0 0 0 0 0 0 0 0 0 
0 0 0 0 0 0 -202.261 0 397.122 0 0 0 0 1873.76 0 0 0 0 0 0 2237.24 0 0 0 0 -849.712 0 0 0 0 0 0 0 0 0 0 0 0 0 0 0 0 0 0.03 0 0 2351.07 0 0 0 0 759.224 -369.198 0 0 0 0 0 0 0 0 0 0 0 0 0 0 0 
0 2439.12 0 1608.25 0 2310.79 0 0 0 0 0 0 -2453.15 0 0 0 0 0 0 1641.82 0 0 0 1931.14 0 0 0 1476.56 0 1050.68 0 0 0 0 0 0 0 0 0 0 0 -411.161 0 0 0.04 0 0 0 0 -832.469 0 0 0 0 0 -1391.26 -1398.43 0 0 0 0 2175.74 292.596 0 0 0 -1668.83 0 
0 0 0 0 0 0 0 0 -1806.47 2474.97 0 0 0 0 0 0 2080.98 0 0 0 0 0 0 1130.18 0 0 0 0 0 0 0 0 0 143.818 1863.84 0 -595.34 0 0 0 0 0 0 0 0 0.06 0 0 -604.343 0 0 0 0 0 0 -477.538 0 -1589.48 0 0 0 0 0 0 0 0 0 0 
1606.27 0 0 0 0 -1513.95 0 1134.3 -18.8452 0 0 0 0 0 0 0 0 0 0 0 0 0 0 0 0 0 0 0 0 0 0 0 0 0 0 796.457 0 196.005 0 0 0 0 0 1866.74 0 0 0.05 0 0 260.857 0 0 0 0 0 0 0 0 0 0 0 0 0 0 0 0 0 0 
0 0 0 0 0 0 0 0 0 0 0 0 0 0 0 0 0 0 0 0 0 0 86.2911 0 0 0 -264.061 0 0 0 0 1849.8 0 0 0 2433.16 0 0 0 0 0 0 0 0 0 0 0 0.03 1983.93 0 0 0 0 0 0 0 0 0 0 0 0 0 0 0 0 -831.553 0 0 
0 0 0 0 0 0 0 0 0 0 0 2135.91 731.3 0 0 0 0 635.167 0 0 0 1612.22 0 0 0 2150.26 0 0 0 0 0 0 0 0 0 0 0 0 0 0 0 0 0 0 0 -227.287 0 -535.371 0.08 0 0 0 0 0 0 0 0 0 0 0 0 0 0 0 0 0 -2241.05 0 
0 0 573.061 0 0 0 0 0 0 0 0 1751.69 0 0 0 0 0 0 0 0 552.156 0 0 0 0 2058.09 2163.99 0 0 0 0 0 0 0 0 -1497.47 0 0 0 0 0 0 569.094 0 2446.29 0 2210.23 0 0 0.05 0 0 0 0 0 0 0 0 0 0 0 0 -2158.19 0 0 0 0 0 
0 0 1120.87 0 0 1351.89 0 0 0 0 0 -1573.46 0 0 0 0 2238 0 0 0 1739.94 0 0 0 0 0 0 0 0 1359.83 1115.38 0 0 0 0 0 0 0 0 0 406.888 0 0 0 0 0 0 0 0 0 0 0 0 0 0 0 0 0 0 0 476.318 0 0 0 0 0 0 0 
0 0 0 0 0 0 0 0 0 -1030.23 0 2090.29 0 1952.35 0 0 449.309 0 0 0 0 0 0 0 0 0 0 0 0 0 0 0 0 0 0 1219.6 -1450.93 0 0 0 0 2088.31 0 -421.232 0 0 0 0 0 0 0 0.07 0 0 0 2023.61 0 0 0 0 0 134.205 0 0 0 0 0 0 
0 0 0 0 0 0 0 0 0 0 1971.11 0 0 0 0 261.315 -2422.03 -1242.03 0 0 0 0 0 0 0 0 0 0 0 0 0 0 0 0 0 0 444.273 0 0 0 0 0 0 1887.65 0 0 0 0 0 0 0 0 0.09 0 0 0 0 0 0 -885.876 0 0 0 0 0 0 0 0 
0 0 0 0 0 0 0 0 0 0 -1356.93 0 0 0 -456.481 0 0 0 0 0 197.378 0 0 0 0 0 0 0 1998.12 0 0 0 1592.38 0 0 0 0 0 0 0 0 455.718 0 0 0 0 0 0 0 0 0 0 0 0.06 1141.77 0 0 0 0 0 0 0 0 0 0 -665.38 0 -2334.13 
0 0 0 1556.52 -439.085 0 0 0 -204.55 0 0 0 0 0 0 0 0 0 0 0 0 2351.07 0 0 0 0 0 0 0 0 0 2177.72 0 -842.997 2256.31 0 0 0 0 0 0 0 0 0 0 0 0 0 0 0 0 0 0 -244.53 0.02 0 1067.46 0 0 0 0 0 0 0 0 0 252.007 0 
-1867.05 0 0 0 0 0 0 0 0 0 0 0 0 530.793 0 0 0 -1992.17 0 0 0 0 0 0 0 0 0 0 0 1092.33 0 0 0 0 0 0 0 0 0 0 0 0 0 0 2379.45 -1237.14 0 0 0 0 0 2323.91 0 0 0 0.02 0 0 0 0 0 0 0 814.615 0 0 0 -455.565 
0 0 0 0 0 0 0 0 0 0 0 0 0 0 2233.12 -2468.57 0 0 1164.66 0 0 -286.645 0 0 0 0 0 0 0 0 1631.29 1773.66 0 0 0 0 0 0 0 0 0 0 -1974.01 0 142.14 0 0 0 0 0 0 0 0 0 -2484.13 0 0.03 0 0 0 0 0 0 0 0 1732.76 0 0 
0 0 0 0 0 -2384.18 0 0 0 0 0 0 0 2314.75 0 0 0 0 0 0 0 2196.34 0 0 0 0 0 0 1307.95 0 0 0 0 0 2213.74 0 0 0 0 0 0 0 0 0 0 1907.79 0 0 0 0 0 0 0 0 0 0 0 0.06 0 -2141.25 0 0 0 0 0 0 0 0 
0 0 0 0 340.052 0 1.14444 0 883.282 0 0 0 0 0 0 0 0 0 0 0 0 0 -509.583 0 1577.12 0 218.741 0 -847.27 0 0 969.802 0 0 0 0 0 0 0 0 0 0 325.556 0 0 0 0 0 0 0 0 0 0 0 0 0 0 0 0.04 0 0 0 0 0 0 0 0 0 
0 0 0 0 0 0 854.442 0 290.46 0 -670.11 0 0 0 0 0 0 -1287.35 0 0 0 0 0 0 0 0 0 0 0 0 0 1575.14 0 0 0 0 -160.909 0 0 0 0 0 0 0 0 0 0 0 0 0 0 0 446.257 0 0 0 0 1937.24 0 0.08 -1398.43 0 0 0 0 0 0 0 
0 0 0 0 -560.701 0 1215.02 0 0 0 252.312 0 0 0 0 0 0 0 0 0 0 0 0 0 0 0 0 0 -211.417 0 0 0 0 0 0 0 0 0 0 359.432 0 0 0 0 0 0 0 0 0 0 -153.737 0 0 0 0 0 0 0 0 285.272 0.05 792.795 0 0 0 0 0 0 
0 0 0 0 0 0 0 0 0 0 0 0 1515.17 1781.59 0 0 0 0 0 0 0 0 0 0 0 0 0 0 0 0 0 0 0 -1445.13 0 0 0 0 0 0 2458.34 0 0 0 -1616.79 0 0 0 0 0 0 1799.3 0 0 0 0 0 0 0 0 1748.94 0.04 0 2035.97 0 0 0 0 
0 0 0 0 0 0 0 0 0 0 -239.647 0 0 0 1118.27 0 1329 0 0 0 0 0 0 0 0 0 0 0 0 0 1678.75 0 0 0 0 0 0 0 0 -977.279 0 0 0 0 216.758 0 0 0 0 -376.217 0 0 0 0 0 0 0 0 0 0 0 0 0.08 -1170.77 0 0 0 0 
0 808.206 0 0 1862.62 0 0 0 0 0 0 0 0 0 0 0 0 0 0 0 0 0 2223.65 427.335 0 0 0 0 0 596.255 -847.88 0 0 0 0 0 0 0 0 0 0 0 0 0 0 0 0 0 0 0 0 0 0 0 0 135.884 0 0 0 0 0 -2146.6 283.135 0.05 0 0 1691.11 0 
0 0 0 0 0 0 0 0 0 0 0 -584.964 0 0 0 0 0 0 0 0 0 0 0 1498.38 0 0 0 1291.62 0 0 767.769 0 0 0 0 0 -1364.1 0 0 0 1576.2 0 0 0 0 0 0 0 0 0 0 0 0 0 0 0 0 0 0 0 0 0 0 0 0.04 0 0 0 
-1502.96 0 0 0 0 0 0 -1819.9 0 0 0 0 725.806 0 0 0 0 0 0 0 0 0 0 0 0 0 0 0 0 0 0 0 0 0 0 0 0 0 0 0 0 0 0 0 0 0 0 2486.11 0 0 0 0 0 1818.52 0 0 705.969 0 0 0 0 0 0 0 0 0.05 0 0 
0 2204.73 444.578 0 408.414 0 0 1163.14 0 0 0 0 0 0 0 0 0 0 0 0 0 0 0 0 0 0 0 0 0 0 0 0 0 0 0 0 0 0 0 0 0 0 0 0 801.645 0 0 0 259.331 0 0 0 0 0 415.891 0 0 0 0 0 0 0 0 190.817 0 0 0.08 0 
0 0 0 0 0 0 0 0 0 -961.867 807.443 0 0 -56.9933 0 0 0 0 0 0 0 0 0 0 0 0 0 0 0 0 0 0 0 0 0 0 -1385.31 0 0 0 0 0 0 0 0 0 0 0 0 0 0 0 0 1713.84 0 674.383 0 0 0 0 0 0 0 0 0 0 0 0 
