*Vertices 42
*Matrix 
0.05 2191.15 0 0 0 1000.93 0 0 0 0 0 0 0 0 0 0 0 0 143.818 0 1104.69 0 0 1750.47 0 -790.048 0 1093.55 1148.95 0 -753.273 1062.88 0 0 0 -938.826 0 0 0 0 -1750.77 0 
951.186 0.02 0 0 0 0 0 -2044.97 0 0 0 2091.05 0 1052.35 0 0 0 0 -1415.68 -1651.13 0 0 0 0 0 0 0 -917.615 0 0 0 0 -323.878 0 0 1157.34 1227.38 0 0 0 0 559.786 
0 0 0.02 0 0 0 537.812 0 0 0 0 -2321.47 8.46889 0 0 0 0 0 0 0 0 374.386 0 -58.5192 0 0 0 2137.75 0 0 0 0 0 0 60.9607 0 0 0 0 0 0 0 
0 0 0 0.01 0 0 0 0 0 0 0 0 0 0 -1494.11 857.494 2406.61 0 -648.9 0 0 -130.39 0 0 0 2192.37 -1191.98 0 0 0 0 0 0 0 0 0 0 -472.198 0 1229.06 0 0 
0 0 0 0 0 0 494.018 0 0 0 -451.292 2380.37 0 0 0 0 0 2284.84 2340.54 0 1403.01 0 1694.01 0 0 0 -1164.2 0 0 0 0 0 0 0 0 0 0 0 0 0 0 0 
224.845 0 0 0 0 0.06 1534.85 0 0 0 0 0 -2042.68 0 0 0 0 0 0 0 1118.58 0 -976.211 0 499.969 783.944 0 -1062.73 0 0 1612.22 1341.67 0 -61.7237 0 0 0 0 0 1300.62 0 1848.12 
0 0 1635.41 0 1095.23 1697.82 0.03 -723.365 0 0 0 0 0 0 0 0 0 0 0 0 0 -2312.16 2079.15 0 -414.518 0 0 0 0 0 29.8318 0 0 0 387.356 0 0 0 0 0 667.364 0 
0 1804.33 0 0 0 0 -979.11 0.07 402.921 0 0 0 26.4748 0 0 0 1494.26 1983.78 0 0 0 0 0 0 644.475 0 0 -1699.35 0 0 0 -1908.4 0 0 2001.94 0 0 0 0 0 -1066.55 0 
0 0 0 0 0 0 0 -287.103 0.09 0 0 0 0 -664.159 0 289.239 447.02 0 2051.53 1446.2 0 0 0 -270.013 0 0 0 0 0 792.489 0 0 -848.643 0 0 0 -68.5903 -1169.7 -1180.07 0 0 0 
0 0 0 0 0 0 0 0 0 0.02 0 0 -2050.61 1087.15 0 611.972 0 0 0 0 0 0 0 0 0 -520.569 0 0 1929 -2113.64 2079.45 0 0 0 0 2138.51 0 0 0 -1840.95 0 0 
0 0 0 0 76.6778 0 0 0 0 0 0.04 0 0 762.123 0 -980.789 0 0 0 0 111.927 0 0 0 0 0 0 0 0 1494.57 0 617.466 -1857.43 0 0 0 0 0 934.858 0 0 0 
0 1902.6 1668.83 0 1207.54 0 0 0 0 0 0 0.07 0 0 795.083 0 0 0 377.285 0 0 0 -1033.89 1141.47 403.226 0 0 1878.8 0 0 0 0 0 0 0 0 0 0 0 0 0 0 
0 0 2174.52 0 0 35.9355 0 2332.45 0 1674.93 0 0 0 -844.981 -1365.32 -741.981 0 0 0 0 0 803.323 0 0 0 0 0 0 1264.31 0 0 0 0 0 0 0 0 0 0 0 0 0 
0 -201.956 0 0 0 0 0 0 916.547 288.476 -550.63 0 375.149 0.03 724.738 0 0 0 0 0 0 0 0 0 0 0 0 -2060.69 2476.2 0 -288.781 367.977 0 0 0 0 0 2015.52 0 457.244 0 0 
0 0 0 267.724 0 0 0 0 0 0 0 1744.82 367.824 579.318 0.06 0 0 0 -1273.77 1942.12 0 0 0 0 1548.74 0 0 0 0 0 0 -1079.67 0 0 0 0 0 0 0 0 0 0 
0 0 0 1149.25 0 0 0 0 -580.386 2254.78 -733.284 0 -357.295 0 0 0.03 -663.396 1348.84 1848.12 0 0 0 0 0 0 0 0 0 0 2205.95 0 0 0 0 0 0 1340.6 0 0 -1551.33 0 0 
0 0 0 1620 0 0 0 2105.24 -1738.56 0 0 0 0 0 0 210.349 0.05 0 0 0 183.798 0 0 0 503.327 0 0 0 0 2041.15 0 760.14 0 -297.632 0 0 0 0 0 0 -754.799 0 
0 0 0 0 2258.45 0 0 1919.39 0 0 0 0 0 0 0 -571.993 0 0.03 0 0 1673.1 -153.89 0 0 104.297 0 0 0 0 0 0 0 0 0 0 0 0 1409.42 0 0 0 0 
2479.55 -531.861 0 657.292 1945.94 0 0 0 -1160.24 0 0 -1042.13 0 0 481.353 -970.107 0 0 0 0 0 -2062.21 1926.71 0 0 0 0 0 0 0 0 0 0 0 0 0 2376.86 0 0 0 0 0 
0 -70.7266 0 0 0 0 0 0 -1401.79 0 0 0 0 0 1278.34 0 0 0 0 0.07 -123.371 610.752 660.344 0 1722.39 0 0 0 0 0 1705.3 0 0 0 0 0 0 0 1774.27 0 0 0 
1921.98 0 0 0 1590.85 -2245.78 0 0 0 0 117.267 0 0 0 0 0 -1618.17 103.839 0 1363.03 0.04 0 0 0 0 -2142.78 0 -155.416 0 -729.621 0 974.837 0 0 0 -608.921 0 641.575 0 0 0 0 
0 0 -1882.46 414.06 0 0 1679.82 0 0 0 0 0 2285.91 0 0 0 0 -779.824 224.998 2252.65 0 0.05 -951.491 0 0 1235.77 0 0 0 0 0 0 -480.743 0 0 1514.86 0 0 2470.7 -1594.06 0 0 
0 0 0 0 -935.316 -196.158 468.078 0 0 0 0 322.504 0 0 0 0 0 0 449.461 2344.81 0 -1455.2 0 0 0 554.598 0 0 0 0 0 0 1101.18 53.9415 0 0 0 0 0 0 0 0 
-1356.01 0 -1201.9 0 0 0 0 0 2300.26 0 0 -418.18 0 0 0 0 0 0 0 0 0 0 0 0.05 0 0 -1751.23 0 0 0 0 0 -63.86 2088.46 0 0 0 0 0 0 0 0 
0 0 0 0 0 -2480.16 1588.87 1808.15 0 0 0 353.175 0 0 -1396.91 0 43.8704 2095.02 0 1521.73 0 0 0 0 0.05 0 0 0 0 0 90.8689 2174.21 0 -2175.28 0 0 0 1465.12 0 0 0 0 
1538.21 0 0 1688.82 0 -215.232 0 0 0 1217.31 0 0 0 0 0 0 0 0 0 0 442.595 -647.984 924.024 0 0 0.08 -1188.16 0 0 0 0 -1914.35 0 0 0 0 0 920.209 0 0 -507.904 0 
0 0 0 1266.14 108.112 0 0 0 0 0 0 0 0 0 0 0 0 0 0 0 0 0 0 966.597 0 386.593 0.07 0 0 0 -141.987 0 0 1233.33 -702.002 0 0 0 -1609.32 1587.19 0 0 
1198.69 1290.25 321.894 0 0 2436.37 0 1830.58 0 0 0 762.734 0 -804.086 0 0 0 0 0 0 -2135.76 0 0 0 0 0 0 0.06 0 -46.1592 0 129.933 0 0 0 0 0 0 0 2484.28 2148.58 0 
2440.79 0 0 0 0 0 0 0 0 490.204 0 0 42.3444 654.546 0 0 0 0 0 0 0 0 0 0 0 0 0 0 0.04 0 0 0 0 0 0 0 113.147 -971.786 0 -393.918 0 0 
0 0 0 0 0 0 0 0 1840.49 2292.93 -734.962 0 0 0 0 1318.48 1230.43 0 0 0 -376.064 0 0 0 0 0 0 -581.301 0 0.05 0 0 0 0 1455.5 0 1772.44 0 0 0 0 0 
226.066 0 0 0 0 1862.16 1536.53 0 0 1149.71 0 0 0 -586.795 0 0 0 0 0 -2124.01 0 0 0 0 211.722 0 2167.35 0 0 0 0.07 0 546.968 0 0 0 0 0 945.997 0 0 0 
1431.55 0 0 0 0 1915.72 0 154.805 0 0 1784.34 0 0 -2260.43 1461.46 0 -1736.43 0 0 0 1380.12 0 0 0 -1973.4 39.4452 0 -42.8022 0 0 0 0.04 0 2342.98 1601.08 1362.42 0 0 0 0 0 -1818.98 
0 1947.31 0 0 0 0 0 0 1214.56 0 178.61 0 0 0 0 0 0 0 0 0 0 1666.54 427.335 339.595 0 0 0 0 0 0 -459.227 0 0.06 2181.69 0 0 2257.53 192.038 2195.27 761.818 0 0 
0 0 0 0 0 427.641 0 0 0 0 0 0 0 0 0 0 2274.16 0 0 0 0 0 687.658 -1769.69 2095.78 0 862.987 0 0 0 0 1634.5 212.18 0.09 0 26.017 1443.6 -1630.53 0 0 0 0 
0 0 2234.49 0 0 0 801.492 251.854 0 0 0 0 0 0 0 0 0 0 0 0 0 0 0 0 0 0 1347.32 0 0 1941.66 0 1667.76 0 0 0 0 2269.89 0 0 0 0 0 
-1654.94 -971.48 0 0 0 0 0 0 0 2376.86 0 0 0 0 0 0 0 0 0 0 1904.58 1291.31 0 0 0 0 0 0 0 0 0 -1260.19 0 1110.03 0 0.06 0 0 0 0 0 -1232.72 
0 1470.61 0 0 0 0 0 0 1153.22 0 0 0 0 0 0 2241.51 0 0 2122.33 0 0 0 0 0 0 0 0 0 -1736.88 2204.12 0 0 -990.249 -716.651 139.393 0 0.06 0 0 0 -1843.7 0 
0 0 0 1290.09 0 0 0 0 142.14 0 0 0 0 -22.9652 0 0 0 2217.7 0 0 2297.51 0 0 0 2276.76 -1378.9 0 0 2046.49 0 0 0 2056.72 -2258.14 0 0 0 0.04 2157.89 0 0 633.946 
0 0 0 0 0 0 0 0 920.362 0 1977.37 0 0 0 0 0 0 0 0 -1551.79 0 -1906.72 0 0 0 0 411.161 0 0 0 2317.35 0 889.233 0 0 0 0 -398.495 0.08 -1042.28 0 0 
0 0 0 1641.06 0 -972.243 0 0 0 -847.728 0 0 0 699.408 0 258.568 0 0 0 0 0 1538.36 0 0 0 0 1466.19 2028.03 28.1533 0 0 0 1856.21 0 0 0 0 0 1677.37 0.08 0 0 
-227.744 0 0 0 0 0 -216.605 -1142.54 0 0 0 0 0 0 0 0 1458.56 0 0 0 0 0 0 0 0 -1619.39 0 2398.37 0 0 0 0 0 0 0 0 458.464 0 0 0 0.05 0 
0 -13.1993 0 0 0 2422.48 0 0 0 0 0 0 0 0 0 0 0 0 0 0 0 0 0 0 0 0 0 0 0 0 0 -1279.56 0 0 0 1647.62 0 -2167.35 0 0 0 0 
