*Vertices 60
*Matrix 
0.07 0 0 737.861 0 0 0 0 0 0 1321.68 0 0 0 0 -40.8185 0 0 0 744.575 0 1740.09 0 -1027.63 0 0 -897.015 2114.86 0 0 0 0 0 0 0 0 0 0 0 0 0 0 0 0 0 0 0 0 0 0 0 0 0 0 0 0 0 0 0 0 
0 0.02 0 -351.192 -1177.18 0 0 0 0 0 0 0 0 0 1222.04 0 0 0 0 0 0 132.832 0 0 0 0 0 0 882.366 366.909 0 0 1850.11 0 0 0 0 0 0 -1419.95 -588.168 0 0 0 0 0 2223.35 0 0 0 0 0 0 0 0 0 0 2151.63 -516.907 0 
0 0 0.09 0 0 -1139.48 0 0 0 -1627.02 0 0 0 1778.39 1460.84 0 0 0 -558.718 0 0 -1323.51 0 0 1161.92 2460.02 0 0 2043.75 0 0 0 0 0 0 0 0 0 0 0 0 0 0 0 1971.11 0 0 0 0 0 0 0 0 -1850.57 0 0 0 0 0 0 
2416.68 1723.76 0 0.09 0 0 0 0 0 0 -1926.4 0 0 0 0 0 0 0 0 0 2265.62 0 0 243.614 0 0 0 0 0 0 0 0 0 0 287.561 2152.24 0 0 0 0 0 0 0 0 0 0 0 0 0 0 0 0 0 0 0 430.387 0 0 0 0 
0 -70.8792 0 0 0.06 0 1790.29 0 0 0 0 0 0 -322.047 -841.014 0 0 0 0 1396.76 0 0 1948.53 724.433 0 0 0 0 0 0 0 1772.9 -1765.57 0 0 0 0 0 0 0 0 588.168 0 0 0 0 0 -1112.78 346.919 0 0 0 172.048 0 0 0 0 0 -784.097 0 
0 0 1017.11 0 0 0.02 1971.42 0 0 0 0 0 0 0 0 0 0 0 0 590.609 0 1505.1 9.38444 2247.31 0 0 0 -1444.52 209.891 0 0 1016.5 880.383 -1128.65 0 0 0 0 0 0 0 1267.36 0 0 0 0 -2457.27 0 0 0 0 -1616.79 0 0 0 0 0 0 386.288 0 
0 0 0 0 2451.63 749.916 0.02 1674.47 0 0 0 111.469 745.796 0 1127.58 1562.01 0 41.5815 0 -864.971 0 0 0 0 0 0 -1918.93 701.392 0 1617.56 0 -369.045 0 0 0 0 0 0 0 0 0 0 0 149.77 0 0 0 0 1019.7 0 0 0 0 -608.921 0 0 0 0 0 -2199.85 
0 0 0 0 0 0 172.964 0.05 0 1895.73 0 0 0 0 1543.09 0 253.685 0 0 0 -1205.4 0 0 -295.19 0 2439.27 -1024.43 0 0 0 0 496.46 0 0 0 0 0 -2061.75 0 686.438 0 0 0 0 419.706 0 0 0 0 0 0 0 723.823 0 1974.93 0 0 0 0 -1527.68 
0 0 0 0 0 0 0 0 0.09 0 0 0 0 2451.32 0 2039.02 0 0 -124.134 0 0 1074.94 0 0 2479.86 0 0 0 0 0 0 0 0 0 0 18.9978 0 0 0 0 0 0 0 -205.924 0 0 0 0 0 0 0 0 0 0 0 0 0 -559.786 0 0 
0 0 1806.92 0 0 0 0 831.553 0 0 0 2026.05 2095.02 0 1983.32 0 0 0 -862.835 0 0 113.3 -293.97 0 0 0 415.738 0 0 203.94 1702.09 0 0 0 -2189.78 0 0 0 0 0 0 0 0 0 0 0 0 0 0 0 0 0 0 0 2299.65 0 0 0 0 0 
765.175 0 0 1534.55 0 0 0 0 0 0 0.09 478.912 590.152 0 0 0 0 0 0 0 1645.33 1327.48 -1133.38 0 0 0 556.276 0 0 0 2143.54 0 0 -1932.51 0 0 -805.002 -1359.07 0 0 0 0 0 -957.747 -801.34 0 -43.7178 0 761.208 -249.413 0 -133.9 0 0 0 0 0 0 0 -858.104 
0 0 0 0 0 0 2337.34 0 0 -35.783 919.294 0 0 -347.224 0 0 0 0 0 587.71 -629.826 0 0 0 0 0 1228.9 0 0 -996.811 0 0 0 0 0 0 0 0 528.199 0 0 0 0 0 0 0 0 0 0 0 -1978.74 0 0 2018.42 0 -2295.37 0 0 0 0 
0 0 0 0 0 0 -1524.32 0 0 1533.78 1380.43 0 0.06 266.655 0 0 1472.59 0 0 0 0 0 0 0 0 2114.55 0 -423.368 0 0 0 0 0 0 -710.242 0 -1712.32 0 0 0 0 250.633 0 0 0 0 0 0 0 52.5681 0 0 0 0 0 0 0 0 0 0 
0 0 1426.66 0 -838.725 0 0 0 612.125 0 0 304.804 -1175.5 0 0 1929.76 2422.03 0 0 0 0 0 -66.4541 0 0 0 -855.815 1800.67 0 0 0 -1218.53 674.383 2246.7 -2040.85 0 0 0 0 0 0 1361.96 0 0 0 0 0 0 0 0 0 0 0 0 0 0 0 0 0 0 
0 61.5711 -120.014 0 -1873.76 0 451.598 -458.007 0 1825.69 0 0 0 0 0.08 0 0 0 0 0 0 0 0 2389.68 0 0 0 28.3059 1838.05 0 0 0 313.959 0 626.164 0 0 66.6066 0 0 0 0 0 0 0 0 0 0 0 0 459.075 0 0 0 0 0 0 0 0 0 
21.5918 0 0 0 0 0 -1601.54 0 649.968 0 0 0 0 346.309 0 0.04 -593.356 0 0 0 0 1129.72 1579.26 0 0 0 -384.304 0 213.858 0 0 0 0 0 0 0 0 0 0 0 1548.74 0 0 0 0 0 0 0 0 0 0 0 0 0 0 0 0 0 0 0 
0 0 0 0 0 0 0 -2444.3 0 0 0 0 1156.73 -360.805 0 -2397.92 0.04 0 1704.38 0 0 2177.11 -1058 0 0 0 1948.84 -266.045 0 -2102.19 1695.99 1494.11 0 0 0 0 0 0 0 0 0 0 0 0 0 2052.6 0 0 0 0 0 1709.72 0 1597.42 0 0 -1245.84 0 0 0 
0 0 0 0 0 0 1546.6 0 0 0 0 0 0 0 0 0 0 0 0 0 0 1465.27 0 2336.73 -1137.5 0 0 0 -79.7296 386.135 0 2492.52 1436.43 0 0 0 0 0 0 0 0 0 0 0 0 0 693.609 1069.44 0 0 0 0 0 0 -154.958 0 0 0 0 0 
0 0 1216.09 0 0 0 0 0 231.101 2092.12 0 0 0 0 0 0 1884.9 0 0.09 0 1911.3 0 0 0 575.808 2476.35 0 0 0 0 1852.4 -79.1192 0 -206.687 0 0 0 0 0 0 0 0 -1044.27 0 0 0 0 0 0 0 0 0 -2142.48 0 0 0 0 0 0 0 
-52.7207 0 0 0 2112.26 1597.11 1756.11 0 0 0 0 -316.095 0 0 0 0 0 0 0 0.07 0 1287.35 464.568 2216.18 0 0 0 0 0 -1720.25 0 0 1476.1 -1319.39 0 0 0 0 0 0 0 0 -1152.15 0 0 0 0 0 0 0 0 0 -846.812 0 0 -347.835 -1672.8 0 0 0 
0 0 0 2205.5 0 0 0 1093.71 0 0 1693.24 145.65 0 0 0 0 0 0 2130.27 0 0.07 0 2047.11 878.552 0 0 0 0 0 0 1233.33 0 0 0 0 0 0 0 0 0 1004.75 0 0 0 0 0 0 0 0 0 0 0 0 0 0 0 0 0 0 0 
2260.89 1151.69 1681.65 0 0 2392.42 0 0 1383.79 978.195 -1346.86 0 0 0 0 -1781.14 -357.143 1597.72 0 364.162 0 0.05 0 0 0 310.45 0 0 642.338 0 0 1475.8 0 0 810.343 0 0 0 0 1516.69 0 0 2484.28 0 0 0 0 0 0 0 0 0 762.276 1455.5 653.478 0 0 0 0 0 
0 0 0 0 -1501.89 -145.497 0 0 0 -1827.22 1841.87 0 0 2157.89 0 565.279 -601.138 0 0 2117.3 -62.4866 0 0.06 -28.3059 0 0 0 2315.52 0 0 0 0 -646.306 0 1365.63 0 0 -1005.66 0 0 0 0 2462.92 0 0 0 0 0 0 0 0 0 0 0 -485.168 0 0 0 0 2189.63 
1097.37 0 0 1252.1 2234.49 -2305.29 0 1524.17 0 0 0 0 0 0 2048.17 0 0 1920.76 0 1737.65 222.404 0 345.546 0.05 -1376 0 0 -1768.32 0 0 0 0 0 0 0 0 0 0 0 0 0 0 0 -1058.46 0 -432.981 0 0 0 0 0 0 0 0 0 0 456.786 0 0 0 
0 0 1808.6 0 0 0 0 0 -1642.12 0 0 0 0 0 0 0 0 768.838 -1721.93 0 0 0 0 2471.47 0.03 0 1706.06 0 0 0 -1408.51 0 0 0 0 0 0 0 0 0 0 0 0 0 0 0 0 0 0 0 0 0 0 0 0 0 0 0 0 0 
0 0 739.54 0 0 0 0 1983.47 0 0 0 0 268.639 0 0 0 0 0 606.937 0 0 1550.57 0 0 0 0 0 0 -1824.17 367.977 0 0 0 0 0 2094.56 0 0 0 0 0 0 0 0 0 0 0 0 0 0 0 0 0 0 0 0 0 403.684 0 0 
-1774.73 0 0 0 0 0 2381.44 1284.3 0 -414.518 -186.239 2252.8 0 180.135 0 2266.53 1388.52 0 0 0 0 0 0 0 -1885.97 0 0.03 2112.42 833.689 -76.6778 0 -343.257 0 0 0 0 0 0 0 0 193.411 0 1709.11 0 -2494.81 0 0 0 0 131.611 0 0 0 0 0 -1862.47 0 0 0 0 
1557.13 0 0 0 0 1132.31 1888.71 0 0 0 0 0 1871.93 -1342.89 2172.99 0 -1810.28 0 0 0 0 0 1409.73 357.906 0 0 1100.57 0.07 1276.67 0 0 827.891 0 0 0 0 0 0 0 0 0 0 -1109.27 1160.7 0 0 0 0 0 0 0 -1066.09 0 598.697 0 0 0 0 0 933.18 
0 2494.05 345.546 0 0 2324.52 0 0 0 0 0 0 0 0 -861.309 -858.867 0 -1807.69 0 0 0 -828.043 0 0 0 44.0229 155.11 -1059.68 0 0 803.934 0 0 1382.56 2167.81 0 0 0 1511.05 0 0 0 0 0 1427.73 0 0 129.627 0 0 0 0 0 0 0 0 0 0 -1580.78 0 
0 2334.89 0 0 0 0 1713.08 0 0 1701.79 0 -458.312 0 0 0 0 1598.94 1375.7 0 -2057.02 0 0 0 0 0 1733.07 1234.4 0 0 0.06 0 0 0 0 -2288.05 0 0 0 0 0 0 0 0 0 0 0 0 0 0 0 0 1179.62 918.073 -1218.22 0 0 0 0 0 0 
0 0 0 0 0 0 0 0 0 1835.61 791.269 0 0 0 0 0 1689.12 0 -464.721 0 -119.251 0 0 0 1302 0 0 0 1729.26 0 0.03 2199.55 1715.06 0 0 -1700.42 0 0 0 0 0 2106.77 0 0 0 0 0 0 0 0 0 0 0 0 0 1492.13 0 0 0 0 
0 0 0 0 2436.67 2474.36 -174.795 331.965 0 0 0 0 0 697.119 0 0 -306.177 603.427 -2000.41 0 0 2340.24 0 0 0 0 1909.47 1913.89 0 0 -298.09 0.05 0 1932.97 -1171.99 0 0 0 0 0 0 -396.664 0 0 0 0 0 1171.68 1840.04 0 0 0 0 0 0 0 0 0 0 0 
0 2225.64 0 0 -508.82 1452.15 0 0 0 0 0 0 0 1949.9 1781.75 0 0 1762.52 0 1664.1 0 0 365.078 0 0 0 0 0 0 0 1501.13 0 0.09 956.374 0 0 0 0 0 0 0 0 0 0 0 0 334.101 0 0 0 -86.9015 0 0 0 0 0 0 -1943.34 0 0 
0 0 0 0 0 2360.99 0 0 0 0 -1201.44 0 0 2129.35 0 0 0 0 527.894 -268.944 0 0 0 0 0 0 0 0 1882.31 0 0 2288.96 -1246.45 0 0 0 0 0 0 0 0 1958.6 0 0 0 0 0 0 0 0 0 0 0 0 0 0 0 0 -1273.77 0 
0 0 0 -1847.06 0 0 0 0 0 82.9341 0 0 652.104 1667.15 1399.35 0 0 0 0 0 0 -494.476 413.144 0 0 0 0 0 -222.861 -271.844 0 -240.867 0 0 0.04 -2188.41 0 0 1591.31 0 0 0 0 0 0 0 0 0 1860.48 0 0 0 0 0 -1517 0 224.54 0 0 0 
0 0 0 -109.79 0 0 0 0 -2200.46 0 0 0 0 0 0 0 0 0 0 0 0 0 0 0 0 1133.23 0 0 0 0 2332 0 0 0 -244.835 0.08 0 1977.37 0 0 0 0 0 0 0 0 0 0 0 1156.27 0 1.29704 0 0 0 0 0 0 874.584 0 
0 0 0 0 0 0 0 0 0 0 1525.85 0 1449.4 0 0 0 0 0 0 0 0 0 0 0 0 0 0 0 0 0 0 0 0 0 0 0 0.02 0 0 0 0 0 1283.99 0 0 0 0 0 0 460.295 -775.704 0 0 0 0 0 2221.06 1555.6 0 0 
0 0 0 0 0 0 0 653.783 0 0 2268.82 0 0 0 2396.08 0 0 0 0 0 0 0 -635.777 0 0 0 0 0 0 0 0 0 0 0 0 -975.6 0 0 0 0 0 0 0 0 0 0 0 0 0 0 0 0 0 0 0 -184.866 0 0 0 0 
0 0 0 0 0 0 0 0 0 0 0 785.775 0 0 0 0 0 0 0 0 0 0 0 0 0 0 0 0 1285.82 0 0 0 0 0 -820.566 0 0 0 0.01 0 0 0 0 0 0 0 0 0 0 0 0 0 0 0 0 0 0 1479 -124.744 0 
0 1692.18 0 0 0 0 0 763.802 0 0 0 0 0 0 0 0 0 0 0 0 0 -515.076 0 0 0 0 0 0 0 0 0 0 0 0 0 0 0 0 0 0.09 0 0 0 0 0 0 0 0 0 0 0 0 0 0 0 0 0 0 0 0 
0 -2477.11 0 0 0 0 0 0 0 0 0 0 0 0 0 1940.75 0 0 0 0 1553.01 0 0 0 0 0 1438.87 0 0 0 0 0 0 0 0 0 0 0 0 0 0.05 0 0 0 0 0 0 0 0 0 0 0 0 0 0 0 0 1791.82 0 0 
0 0 0 0 -2210.23 1347.16 0 0 0 0 0 0 -1334.8 1781.44 0 0 0 0 0 0 0 0 0 0 0 0 0 0 0 0 909.375 2052.75 0 2160.02 0 0 0 0 0 0 0 0 0 0 -998.642 0 0 0 0 0 0 0 0 0 0 0 -734.809 317.927 -296.411 0 
0 0 0 0 0 0 0 0 0 0 0 0 0 0 0 0 0 0 427.488 1817.15 0 -356.685 257.195 0 0 0 1292.99 -1735.82 0 0 0 0 0 0 0 0 1909.31 0 0 0 0 0 0.04 0 0 0 0 0 0 0 0 0 0 0 0 912.427 0 0 0 0 
0 0 0 0 0 0 -1063.34 0 -1024.58 0 1890.55 0 0 0 0 0 0 0 0 0 0 0 0 1161.31 0 0 0 882.519 0 0 0 0 0 0 0 0 0 0 0 0 0 0 0 0.06 -1013.75 0 0 0 0 0 0 0 0 0 0 0 0 0 0 -250.175 
0 0 -564.516 0 0 0 0 362.178 0 0 487.304 0 0 0 0 0 0 0 0 0 0 0 0 0 0 0 2330.93 0 -111.164 0 0 0 0 0 0 0 0 0 0 0 0 2056.26 0 204.703 0.08 0 0 0 0 0 0 0 0 0 0 0 0 0 0 0 
0 0 0 0 0 0 0 0 0 0 0 0 0 0 0 0 723.975 0 0 0 0 0 0 -305.109 0 0 0 0 0 0 0 0 0 0 0 0 0 0 0 0 0 0 0 0 0 0.04 0 0 0 0 0 0 0 0 0 0 0 0 0 0 
0 1785.87 0 0 0 816.446 0 0 0 0 1917.4 0 0 0 0 0 0 2252.34 0 0 0 0 0 0 0 0 0 0 0 0 0 0 1509.22 0 0 0 0 0 0 0 0 0 0 0 0 0 0.01 0 0 0 0 1437.04 0 0 0 0 -178.762 0 0 0 
0 0 0 0 2339.78 0 0 0 0 0 0 0 0 0 0 0 0 2238.61 0 0 0 0 0 0 0 0 0 0 -1093.55 0 0 -1754.89 0 0 0 0 0 0 0 0 0 0 0 0 0 0 0 0.07 0 1445.74 0 0 0 0 -1979.2 0 0 0 0 0 
0 0 0 0 1352.81 0 -54.857 0 0 0 1173.97 0 0 0 0 0 0 0 0 0 0 0 0 0 0 0 0 0 0 0 0 2347.25 0 0 -1778.24 0 0 0 0 0 0 0 0 0 0 0 0 0 0.03 0 0 0 0 0 0 0 0 0 0 0 
0 0 0 0 0 0 0 0 0 0 1600.16 0 2482.15 0 0 0 0 0 0 0 0 0 0 0 0 0 -1460.54 0 0 0 0 0 0 0 0 -86.2911 488.83 0 0 0 0 0 0 0 0 0 0 417.264 0 0.01 2341.3 0 0 -2340.69 0 2413.94 0 0 0 0 
0 0 0 0 0 0 0 0 0 0 0 1890.7 0 0 -736.488 0 0 0 0 0 0 0 0 0 0 0 0 0 0 0 0 0 -1014.51 0 0 0 -266.35 0 0 0 0 0 0 0 0 0 0 0 0 1215.32 0.02 0 0 0 0 0 0 0 0 0 
0 0 0 0 0 -1979.96 0 0 0 0 1160.08 0 0 0 0 0 1297.11 0 0 0 0 0 0 0 0 0 0 282.067 0 -1760.23 0 0 0 0 0 -37.7667 0 0 0 0 0 0 0 0 0 0 907.697 0 0 0 0 0.06 1911.6 0 0 0 0 0 0 0 
0 0 0 0 -397.885 0 0 55.9252 0 0 0 0 0 0 0 0 0 0 -667.211 1217.76 0 -2368.01 0 0 0 0 0 0 0 2308.5 0 0 0 0 0 0 0 0 0 0 0 0 0 0 0 0 0 0 0 0 0 1033.89 0.09 0 0 0 0 0 0 0 
0 0 713.141 0 0 0 -641.728 0 0 0 0 -1127.89 0 0 0 0 -1113.85 0 0 0 0 145.955 0 0 0 0 0 -1411.1 0 1809.21 0 0 0 0 0 0 0 0 0 0 0 0 0 0 0 0 0 0 0 2477.26 0 0 0 0.08 341.578 0 0 0 67.3696 783.029 
0 0 0 0 0 0 0 218.589 0 1090.81 0 0 0 0 0 0 0 1908.7 0 0 0 -821.024 374.233 0 0 0 0 0 0 0 0 0 0 0 21.1341 0 0 0 0 0 0 0 0 0 0 0 0 -165.944 0 0 0 0 0 -1008.1 0 0 0 0 0 0 
0 0 0 -598.392 0 0 0 0 0 0 0 -728.401 0 0 0 0 0 0 0 1187.25 0 0 0 0 0 0 1022.9 0 0 0 1133.99 0 0 0 0 0 0 1176.11 0 0 0 0 1476.26 0 0 0 0 0 0 -1809.37 0 0 0 0 0 0.08 0 -1301.84 0 0 
0 0 0 0 0 0 0 0 0 0 0 0 0 0 0 0 -865.123 0 0 2291.25 0 0 0 2467.65 0 0 0 0 0 0 0 0 0 0 1588.26 0 -844.371 0 0 0 0 -1330.23 0 0 0 0 202.872 0 0 0 0 0 0 0 0 0 0.08 0 -1079.82 0 
0 1693.24 0 0 0 0 0 0 -1101.95 0 0 0 0 0 0 0 0 0 0 0 0 0 0 0 0 2013.38 0 0 0 0 0 0 -376.37 0 0 0 2084.19 0 532.472 0 2202.75 1460.69 0 0 0 0 0 0 0 0 0 0 0 0 0 -2285.76 0 0.03 0 0 
0 -1417.66 0 0 1804.79 1242.33 0 0 0 0 0 0 0 0 0 0 0 0 0 0 0 0 0 0 0 0 0 0 1385.01 0 0 0 0 -1994.31 0 538.118 0 0 -254.295 0 0 2077.01 0 0 0 0 0 0 0 0 0 0 0 -624.18 0 0 -1433.99 0 0.09 0 
0 0 0 0 0 0 1418.27 148.091 0 0 -1813.03 0 0 0 0 0 0 0 0 0 0 0 -2263.94 0 0 0 0 1774.27 0 0 0 0 0 0 0 0 0 0 0 0 0 0 0 151.601 0 0 0 0 0 0 0 0 0 2466.73 0 0 0 0 0 0.02 
