*Vertices 60
*Matrix 
0.01 2366.94 -2304.38 0 1965.01 0 0 2190.39 1289.18 0 0 2175.28 0 -1227.38 1594.06 0 0 -448.851 0 0 0 2006.06 0 0 -1076.16 1075.09 0 0 163.961 0 -1494.72 0 -2205.65 0 0 150.685 1930.98 0 0 0 0 0 0 0 0 0 0 0 0 0 0 0 0 0 0 0 0 0 0 2016.89 
-436.338 0.05 1311.15 0 745.491 0 0 0 0 0 0 0 0 2443.08 0 1796.09 2496.49 0 0 0 0 -1524.63 -1898.63 0 0 0 0 0 0 0 -284.967 0 0 0 0 1083.03 0 0 0 0 992.691 0 0 0 0 0 -928.602 0 0 0 0 0 -1443.6 0 0 0 -582.522 0 0 0 
2040.7 990.555 0.07 1397.82 0 -1782.51 0 1391.42 -1405.15 0 1231.65 0 0 1551.64 0 2086.93 843.913 0 0 1573.31 0 0 0 1219.14 0 0 -789.743 0 0 0 0 0 0 0 0 2078.69 0 -1698.28 0 0 0 0 0 0 0 1154.9 0 0 0 0 0 0 0 1687.9 0 0 0 0 0 0 
0 0 707.648 0.04 0 0 238.578 1327.02 0 0 2342.83 0 0 1264.61 0 1726.97 0 0 -311.823 0 0 0 0 0 0 -851.695 0 1863.23 0 0 0 0 0 0 1875.74 1194.88 366.909 0 0 0 0 0 0 0 0 0 1625.8 0 0 0 0 0 0 0 0 0 0 0 0 0 
1325.5 936.842 0 0 0.07 0 1930.68 0 0 0 0 0 -2110.58 1269.95 0 0 2181.54 0 0 0 0 0 0 0 -782.571 0 0 0 0 0 0 0 0 1616.95 0 578.707 0 0 -1014.66 0 839.183 0 0 0 0 0 0 0 0 0 -2073.2 0 0 2219.69 0 261.467 0 0 0 0 
0 0 -59.4348 0 0 0.08 0 0 0 0 0 2389.37 0 169.912 0 0 0 0 970.26 -538.27 0 1709.72 -1389.13 0 0 0 0 0 0 0 0 0 0 1371.73 882.061 -631.962 0 -1900.62 0 0 0 0 0 159.993 0 -1329.46 0 0 0 0 0 0 0 0 0 0 0 564.058 0 0 
0 0 0 -1127.12 646.458 0 0.09 1897.41 283.746 480.895 -347.682 1512.88 0 0 -201.498 0 0 0 0 0 -377.59 0 0 -1087.45 0 1513.18 0 -1423.61 852.763 0 0 0 2149.04 0 0 0 0 0 0 2448.42 0 0 0 0 0 0 0 0 0 1619.54 -1414.61 0 0 0 0 0 0 0 0 0 
-936.384 0 -1115.53 1856.82 0 0 -1819.74 0.07 0 0 1696.14 0 0 -1131.09 0 -1891.46 0 0 1751.99 -1053.58 0 0 0 1904.43 0 0 -699.561 2347.56 -1238.82 2280.27 0 0 -1674.93 1859.42 622.349 0 0 -376.522 1280.79 0 0 0 0 379.574 0 0 -2355.65 0 0 0 0 821.329 0 0 0 0 0 0 0 0 
1254.23 0 1228.14 0 0 0 -2430.72 0 0.02 0 951.338 2155.6 0 0 -1185.42 0 -562.99 0 0 0 0 0 0 0 0 0 0 0 0 0 0 0 0 0 2381.44 0 0 0 2246.85 0 -2149.65 0 0 0 -1004.14 0 0 0 -1091.88 0 0 0 0 0 0 0 0 0 0 0 
0 0 0 0 0 0 -1414.46 0 0 0.06 0 2019.64 0 0 2094.41 0 0 -286.187 -1038.77 2070.45 -1261.25 0 607.395 0 0 0 0 1910.08 0 0 0 0 0 264.824 0 0 0 0 1331.14 0 0 0 0 0 1979.2 49.3637 0 0 1381.34 0 0 0 0 0 -1858.96 0 53.3311 1201.28 0 0 
0 0 2274.93 -2237.85 0 0 621.128 -628.147 -1462.37 0 0.03 0 0 0 0 0 0 0 0 0 -417.57 0 0 0 0 0 995.743 2360.84 0 0 1428.19 0 0 0 0 0 0 0 0 1846.29 0 0 0 0 0 -506.226 0 0 498.901 2083.27 0 0 0 -903.577 0 2396.69 0 0 0 0 
2266.69 0 0 0 0 996.658 1065.32 0 1411.86 -2442.01 0 0.09 0 0 170.522 0 107.349 0 -625.095 0 0 0 0 0 -1725.59 0 0 0 0 0 0 1740.09 0 0 0 -2440.64 0 0 0 0 0 0 0 572.451 -56.0778 2290.95 1752.3 -955.916 0 0 0 0 0 0 0 0 0 -2404.17 0 1793.95 
0 0 0 0 126.576 0 0 0 0 0 0 0 0.06 1464.81 0 0 0 0 0 813.7 0 0 0 0 830.027 0 -1532.56 0 0 0 213.858 1890.39 0 1455.05 0 0 0 0 0 0 0 0 0 0 0 0 0 -1316.49 0 0 0 0 0 0 0 0 0 0 0 0 
1687.9 131.611 1375.24 -2290.19 1008.26 -2483.98 0 1116.9 0 0 0 0 468.535 0.07 1291.62 0 0 2399.29 0 0 0 -800.272 -1744.82 -123.981 0 0 0 0 0 707.953 0 0 0 0 0 0 0 -809.732 0 0 -272.149 0 476.928 0 0 0 0 0 0 0 0 0 0 0 0 0 0 0 0 0 
2249.6 0 0 0 0 0 -864.208 0 -1629.92 1103.47 0 1323.66 0 -210.807 0.08 647.526 -1041.37 0 913.495 197.378 0 0 -1064.1 1815.47 1359.83 0 0 0 0 0 2361.45 -1777.32 1658.3 0 -2084.49 0 0 0 0 0 0 0 0 -1523.26 0 0 0 0 0 0 0 0 0 0 -1904.43 1869.79 -499.664 0 0 0 
0 -2479.25 2465.06 -326.93 0 0 0 627.689 0 0 0 0 0 0 469.451 0.01 0 0 0 0 1855.75 -1712.16 -353.175 0 0 -445.952 0 0 0 0 0 0 0 2480.47 992.691 2491.3 2325.43 0 0 2373.96 0 0 -1435.97 1855.91 0 0 -693.152 0 0 0 0 0 0 0 0 0 0 -785.47 0 0 
0 -2091.36 809.885 0 1950.67 0 0 0 1010.7 0 0 -562.99 0 0 1803.57 0 0.03 -2068.01 0 0 0 0 0 0 0 0 0 0 0 0 1531.95 0 2183.22 0 0 0 -1068.68 1988.66 0 681.707 0 0 0 0 0 2454.22 0 0 2166.89 0 0 0 1461.3 0 0 0 0 0 0 0 
882.061 0 0 0 0 0 0 0 0 1998.73 0 0 0 91.3266 0 0 -869.549 0.05 0 -1016.19 2120.96 0 0 0 162.893 0 0 0 0 0 866.192 0 0 0 0 0 1125.14 0 0 0 0 0 0 0 0 0 0 0 0 0 1635.11 0 0 0 0 0 0 0 0 0 
0 0 0 -1361.96 0 -1197.93 0 -1568.27 0 930.891 0 -508.209 0 0 -1544.31 0 0 0 0.03 0 -1907.48 0 0 0 0 0 0 -117.42 2499.85 1500.06 0 699.713 1949.45 0 2352.14 1070.21 1112.93 0 0 0 0 0 0 0 0 0 0 0 1808.3 0 0 0 0 0 0 0 0 0 0 0 
0 0 8.92666 0 0 1574.07 0 1695.38 0 -2379.6 0 0 -809.732 0 785.928 0 0 -1467.41 0 0.08 0 1302.76 0 0 0 0 6.94296 0 0 -1502.2 0 0 0 1482.97 31.9681 2467.35 0 0 0 0 0 -28.4585 0 0 830.485 0 0 0 0 0 0 0 99.5666 0 1236.23 0 0 0 -1801.13 0 
0 0 0 0 0 0 2435.76 0 0 220.267 1540.8 0 0 0 0 1102.1 0 1805.86 40.6659 0 0.06 0 0 0 0 0 0 0 211.112 1094.47 0 0 0 0 -396.664 0 0 -416.807 0 0 0 0 0 0 0 0 0 443.51 0 0 0 -441.984 0 0 0 0 0 0 0 0 
-318.995 77.8985 0 0 0 868.938 0 0 0 0 0 0 0 -1788.16 0 -186.697 0 0 0 -1449.25 0 0.01 1541.11 -730.537 0 0 -293.054 1430.17 0 1583.53 0 0 0 0 1090.5 0 0 0 224.998 497.223 1354.64 1270.41 0 0 0 0 0 0 0 0 0 35.3252 0 0 0 0 0 0 -1000.17 0 
0 1007.64 0 0 0 868.48 0 0 0 -765.633 0 0 0 1760.54 -760.598 1010.24 0 0 0 0 0 -1337.55 0.04 0 0 0 0 -311.212 2099.6 0 0 2149.8 0 0 -402.005 1930.22 0 0 357.601 0 0 0 0 0 0 0 0 -640.355 0 0 0 0 1762.06 0 0 0 1812.27 0 0 1928.39 
0 0 2060.99 0 0 0 1813.18 -432.981 0 0 0 0 0 -675.146 1720.86 0 0 0 0 0 0 -176.931 0 0.02 0 0 0 0 0 -1983.63 190.207 0 2087.69 0 0 0 0 0 2465.36 0 0 0 0 0 0 0 0 0 0 0 0 -877.636 0 0 0 0 0 0 0 0 
1802.65 0 0 0 1690.5 0 0 0 0 0 0 2483.83 -34.7148 0 1858.04 0 0 877.331 0 0 0 0 0 0 0 0 0 0 0 0 0 609.073 0 0 0 0 0 0 0 0 0 0 0 0 0 0 0 0 0 0 0 0 0 0 0 0 0 0 0 0 
-1091.72 0 0 -534.761 0 0 2429.2 0 0 0 0 0 0 0 0 23.2704 0 0 0 0 0 0 0 0 0 0.05 0 2147.05 0 0 2464.29 0 0 396.054 0 0 0 0 0 0 0 0 -1498.69 0 0 0 0 0 -315.638 0 0 0 0 0 0 0 0 0 0 -569.704 
0 0 -456.786 0 0 0 0 -58.3666 0 0 2133.32 0 -704.443 0 0 0 0 0 0 -393.612 0 116.504 0 0 0 0 0.04 0 2397.92 0 0 -1895.73 0 0 0 1245.08 2282.71 -1293.3 1117.05 0 -1303.83 0 0 0 0 0 0 0 0 -325.251 0 0 0 0 0 0 0 0 0 0 
0 0 0 -224.845 0 0 1776.86 947.523 0 1402.55 -1838.82 0 0 0 0 0 0 0 2079.3 0 0 -1529.36 2143.54 0 0 2312.62 0 0.07 2399.44 1338.31 0 0 1233.79 0 536.134 0 2341.46 0 0 0 0 0 0 0 0 0 0 0 0 0 0 0 0 0 0 0 0 0 -1012.99 0 
1119.19 0 0 0 0 0 -2080.07 2366.33 0 0 0 0 0 0 0 0 0 0 -1794.72 0 -1546.14 0 2441.56 0 0 0 300.989 1842.48 0 0 1968.06 0 1697.67 0 1925.49 0 0 -2381.13 0 0 2150.41 0 0 0 0 0 0 1503.11 0 0 0 0 0 0 0 0 0 0 0 0 
0 0 0 0 0 0 0 -674.688 0 0 0 0 0 -47.0748 0 0 0 0 363.247 1236.99 2321.47 840.709 0 802.103 0 0 0 -1231.8 0 0.02 358.974 0 0 0 0 0 0 0 0 1444.52 0 305.261 0 0 0 0 0 0 -177.389 0 0 -1239.59 1203.57 319.758 0 1976.3 0 0 0 0 
1615.73 -302.057 0 0 0 0 0 0 0 0 939.741 0 -1917.86 0 -2241.05 0 -1702.55 1256.98 0 0 0 0 0 2231.13 0 -1096.91 0 0 534.913 -2342.68 0.06 0 0 0 1933.73 1082.87 0 0 978.5 0 0 0 -2051.38 0 0 0 0 0 0 0 0 0 0 0 1216.39 0 0 0 0 0 
0 0 0 0 0 0 0 0 0 0 0 2335.96 1182.21 0 -2103.26 0 0 0 -1016.8 0 0 0 618.381 0 65.8437 0 2082.05 0 0 0 0 0 0 0 0 0 1480.53 0 0 -1088.52 0 0 0 0 0 0 0 0 0 0 0 0 0 0 0 -2409.36 0 0 0 0 
1280.63 0 0 0 0 0 586.184 -395.596 0 0 0 0 0 0 -1590.4 0 -1747.41 0 -372.555 0 0 0 0 376.064 0 0 0 793.1 611.057 0 0 0 0.06 0 0 0 0 0 0 873.516 0 0 785.928 1620 261.315 0 0 0 0 0 0 0 2164.45 -1815.16 0 0 736.793 0 0 0 
0 0 0 0 -122.913 -693.762 0 1422.85 0 157.247 0 0 616.703 0 0 -35.02 0 0 0 -213.706 0 0 0 0 0 563.295 0 0 0 0 0 0 0 0.02 0 0 1054.34 0 0 0 0 0 0 0 0 0 1542.63 0 0 0 2385.1 0 0 0 0 0 0 0 0 0 
0 0 0 1814.71 0 1980.12 0 1837.14 791.726 0 0 0 0 0 2263.63 -2184.13 0 0 -1924.88 -877.331 857.952 376.064 -447.325 0 0 0 0 477.538 98.4985 0 -1.90741 0 0 0 0.08 2071.37 0 2136.83 0 0 0 0 0 0 0 0 0 -409.177 0 0 0 0 0 0 0 0 0 1175.95 0 -144.887 
1787.24 629.826 -197.531 804.849 -860.24 533.235 0 0 0 0 0 2395.93 0 0 0 -877.636 0 0 1631.14 -600.528 0 0 875.042 0 0 0 -2025.28 0 0 0 -687.658 0 0 0 2044.66 0.02 0 -12.8941 0 -929.212 0 0 0 0 0 0 0 0 0 0 0 0 0 0 0 -1502.96 0 0 0 0 
540.406 0 0 1823.56 0 0 0 0 0 0 0 0 0 0 0 -1460.08 -460.906 -22.2022 1503.72 0 0 0 0 0 0 0 -1530.43 1986.07 0 0 0 -939.131 0 -458.922 0 0 0.02 0 1280.33 0 0 0 0 0 0 0 0 0 0 0 0 0 0 0 0 0 0 0 0 0 
0 0 1680.12 0 0 949.66 0 1823.4 0 0 0 0 0 1007.19 0 0 2293.54 0 0 0 356.227 0 0 0 0 0 1411.71 0 -1795.94 0 0 0 0 0 543.458 1014.36 0 0 0 0 0 0 1882.61 0 0 -666.448 0 0 0 0 0 0 0 0 0 0 0 0 0 0 
0 0 0 0 -444.884 0 0 2302.7 2106.77 -591.22 0 0 0 0 0 0 0 0 0 0 0 -2382.35 1129.26 -1404.08 0 0 -894.116 0 0 0 500.58 0 0 0 0 0 1933.42 0 0.09 0 0 0 0 0 0 0 0 0 0 0 0 0 0 962.935 0 -2109.06 0 0 0 0 
0 0 0 0 0 0 -792.642 0 0 0 -946.608 0 0 0 0 -233.39 2120.04 0 0 0 0 1751.08 0 0 0 0 0 0 0 -566.347 0 1176.41 2304.99 0 0 -2146.9 0 0 0 0.01 702.155 0 2058.24 0 0 0 0 0 0 -1967.91 0 0 0 0 0 1353.27 0 0 0 -1703.77 
0 -1001.39 0 0 1846.29 0 0 0 -298.7 0 0 0 0 2052.6 0 0 0 0 0 0 0 554.14 0 0 0 0 2304.68 0 -1138.72 0 0 0 0 0 0 0 0 0 0 -1912.37 0.06 0 0 -647.526 0 0 0 0 0 0 0 0 0 1459.93 0 0 1098.28 0 0 0 
0 0 0 0 0 0 0 0 0 0 0 0 0 0 0 0 0 0 0 1239.43 0 539.796 0 0 0 0 0 0 0 507.904 0 0 0 0 0 0 0 0 0 0 0 0.08 0 0 0 -165.334 0 0 0 0 1548.74 0 0 0 -2009.87 0 0 0 0 0 
0 0 0 0 0 0 0 0 0 0 0 0 0 2167.81 0 2131.34 0 0 0 0 0 0 0 0 0 964.614 0 0 0 0 -559.023 0 1321.68 0 0 0 0 1636.63 0 -1868.57 0 0 0.02 0 0 0 0 0 0 -696.966 0 0 0 1533.48 0 0 0 0 0 0 
0 0 0 0 0 888.928 0 964.003 0 0 0 1524.78 0 0 1944.26 -32.7311 0 0 0 0 0 0 0 0 0 0 0 0 0 0 0 0 -1423.76 0 0 0 0 0 0 0 760.903 0 0 0.08 0 0 0 0 0 0 0 0 0 0 0 0 0 0 0 0 
0 0 0 0 0 0 0 0 1002.46 1582.77 0 -468.841 0 0 0 0 0 0 0 -669.5 0 0 0 0 0 0 0 0 0 0 0 0 718.635 0 0 0 0 0 0 0 0 0 0 0 0.08 0 0 0 0 0 0 0 0 0 0 0 0 0 -1615.27 0 
0 0 1927.32 0 0 1224.48 0 0 0 -2193.44 -2055.8 34.7148 0 0 0 0 1366.7 0 0 0 0 0 0 0 0 0 0 0 0 0 0 0 0 0 0 0 0 2271.57 0 0 0 1192.43 0 0 0 0.03 0 0 0 0 -52.4155 0 0 0 98.6511 0 0 0 -1729.26 0 
0 397.732 0 -1371.12 0 0 0 507.447 0 0 0 2469.33 0 0 0 1987.75 0 0 0 0 0 0 0 0 0 0 0 0 0 0 0 0 0 1087.76 0 0 0 0 0 0 0 0 0 0 0 0 0.08 0 0 0 0 0 0 0 0 0 0 835.673 0 -1039.99 
0 0 0 0 0 0 0 0 0 0 0 -99.7192 -185.171 0 0 0 0 0 0 0 2069.54 0 -760.598 0 0 0 0 0 891.369 0 0 0 0 0 2286.22 0 0 0 0 0 0 0 0 0 0 0 0 0.08 0 0 0 0 0 0 1901.68 0 0 0 0 0 
0 0 0 0 0 0 0 0 2053.06 2050.92 1416.29 0 0 0 0 0 2332.3 0 -1662.27 0 0 0 0 0 0 -2378.38 0 0 0 1281.09 0 0 0 0 0 0 0 0 0 0 0 0 0 0 0 0 0 0 0.09 0 0 0 0 2100.67 0 -1024.74 0 0 96.2096 0 
0 0 0 0 0 0 -668.279 0 0 0 -2377.16 0 0 0 0 0 0 0 0 0 0 0 0 0 0 0 795.694 0 0 0 0 0 0 0 0 0 0 0 0 558.412 0 0 2360.53 0 0 0 0 0 0 0.01 2155.14 0 -1012.99 0 0 0 0 0 0 0 
0 0 0 0 -813.242 0 1914.96 0 0 0 0 0 0 0 0 0 0 2410.73 0 0 0 0 0 0 0 0 0 0 0 0 0 0 0 -974.532 0 0 0 0 0 0 0 468.841 0 0 0 -1377.68 0 0 0 -202.719 0 0 0 0 0 0 0 0 0 0 
0 0 0 0 0 0 0 1605.5 0 0 0 0 0 0 0 0 0 0 0 0 503.784 1055.71 0 -132.527 0 0 0 0 0 1358.3 0 0 0 0 0 0 0 0 0 0 0 0 0 0 0 0 0 0 0 0 0 0.08 0 0 0 0 0 0 0 0 
0 1868.88 0 0 0 0 0 0 0 0 0 0 0 0 0 0 563.143 0 0 -180.593 0 0 2470.7 0 0 0 0 0 0 1507.39 0 0 -698.035 0 0 0 0 0 0 0 0 0 0 0 0 0 0 0 0 -1845.84 0 0 0.04 0 0 0 0 0 0 0 
0 0 -1429.11 0 1341.52 0 0 0 0 0 -217.215 0 0 0 0 0 0 0 0 0 0 0 0 0 0 0 0 0 0 -904.34 0 0 1280.18 0 0 0 0 0 -138.63 0 31.3578 0 1164.66 0 0 0 0 0 985.977 0 0 0 0 0.06 0 0 2225.94 0 0 -172.048 
0 0 0 0 0 0 0 0 0 563.906 0 0 0 0 -369.198 0 0 0 0 -2413.17 0 0 0 0 0 0 0 0 0 0 1601.23 0 0 0 0 0 0 0 0 0 0 315.485 0 0 0 2346.19 0 -757.546 0 0 0 0 0 0 0 0 0 0 0 0 
0 0 0 0 -1374.02 0 0 0 0 0 855.968 0 0 0 35.783 0 0 0 0 0 0 0 0 0 0 0 0 0 0 2425.69 0 -338.069 0 0 0 -2170.55 0 0 739.082 1888.87 0 0 0 0 0 0 0 0 1634.19 0 0 0 0 0 0 0.05 0 0 0 0 
0 914.563 0 0 0 0 0 0 0 -2156.82 0 0 0 0 1210.59 0 0 0 0 0 0 0 1812.27 0 0 0 0 0 0 0 0 0 -264.672 0 0 0 0 0 0 0 -765.938 0 0 0 0 0 0 0 0 0 0 0 0 558.107 0 0 0.08 1595.13 0 0 
0 0 0 0 0 -416.196 0 0 0 2498.47 0 -1892.22 0 0 0 2088 0 0 0 0 0 0 0 0 0 0 0 0 0 0 0 0 0 0 1767.86 0 0 0 0 0 0 0 0 0 0 0 -1701.79 0 0 0 0 0 0 0 0 0 802.408 0.09 0 0 
0 0 0 0 0 0 0 0 0 0 0 0 0 0 0 0 0 0 0 -975.143 0 482.116 0 0 0 0 0 93.3103 0 0 0 0 0 0 0 0 0 0 0 0 0 0 0 0 -20.3711 1226.16 0 0 1723.15 0 0 0 0 0 0 0 0 0 0.03 0 
2235.25 0 0 0 0 0 0 0 0 0 0 443.968 0 0 0 0 0 0 0 0 0 0 516.144 0 0 2186.73 0 0 0 0 0 0 0 0 -421.384 0 0 0 0 -1240.5 0 0 0 0 0 0 2299.95 0 0 0 0 0 0 -187.46 0 0 0 0 0 0.08 
