*Vertices 49
*Matrix 
0 0 1901.53 0 0 -77.4407 0 0 0 0 0 0 0 0 1778.39 1121.02 0 0 2347.41 0 0 0 0 0 0 0 -188.528 0 0 2321.47 -519.044 1116.14 0 0 0 0 0 0 0 0 0 1252.71 0 0 0 0 -2297.36 0 0 
0 0.06 -1000.93 577.792 0 0 0 0 -417.875 0 1705.15 0 901.288 0 0 0 0 0 0 0 659.886 0 1232.72 0 0 0 2193.29 0 918.836 0 2230.98 0 1706.21 1304.44 1045.64 0 0 0 784.86 0 775.857 0 0 0 0 0 0 0 0 
-2154.38 1934.19 0.01 0 0 0 0 0 0 2053.36 0 0 1199.45 0 0 0 0 0 522.401 0 0 0 0 0 0 0 1657.84 0 0 -1046.25 0 0 2166.89 0 0 0 0 0 -50.1267 0 0 -350.581 0 0 0 -2039.93 0 0 0 
0 -1869.33 0 0.03 0 0 0 2324.06 0 0 2357.02 0 0 -1097.52 1148.03 0 0 0 0 0 0 0 234.153 0 0 0 0 0 0 0 0 0 0 0 0 0 0 -985.824 0 0 955.611 0 0 0 0 0 0 0 0 
0 0 0 0 0.01 933.943 0 0 0 -1216.39 2375.18 -1204.95 0 632.878 0 0 0 1401.18 0 0 -325.556 0 483.795 0 0 0 0 0 -550.935 304.498 0 0 0 0 0 0 0 0 0 0 0 0 0 0 0 0 0 -2288.51 1713.69 
2413.63 0 0 0 1308.86 0.06 0 1373.26 0 0 0 0 0 0 0 0 965.682 0 -388.882 -1660.74 2437.59 0 1765.42 0 -1971.11 0 189.901 -892.285 0 0 0 0 0 0 0 0 2046.19 0 0 0 0 1320 0 0 0 0 1556.06 0 0 
0 0 0 0 0 0 0.02 0 0 0 0 1063.34 0 2486.42 2060.38 0 0 0 0 0 0 -2128.13 0 -1515.93 0 0 357.295 0 0 1340.6 -1197.47 0 -2169.64 0 2024.06 0 0 -1604.74 0 0 0 0 0 0 0 0 0 0 0 
0 0 0 -456.633 0 873.974 0 0.06 2218.77 0 377.285 1772.59 0 678.198 0 0 1084.25 0 0 0 0 0 0 0 0 0 0 0 1533.94 1184.19 1983.78 0 0 -49.0585 0 1674.32 0 0 0 0 -425.962 0 0 -1164.05 0 0 0 0 0 
0 1132.16 0 0 0 0 0 236.747 0 0 0 0 0 0 0 0 0 0 0 -1161.76 0 0 1220.36 0 0 1517 0 0 0 1270.71 1140.1 0 0 0 0 0 0 -1335.87 248.192 0 0 -2455.44 0 0 0 0 0 0 0 
0 0 -1360.44 0 -129.017 0 0 0 0 0.05 0 0 0 0 0 0 0 -97.7355 0 0 0 0 0 0 -2163.99 0 -1348.99 2013.23 0 2455.29 0 450.682 0 1024.58 0 1885.36 0 0 0 0 0 0 0 0 0 0 0 2138.97 0 
0 -237.358 0 25.2541 908.46 0 0 -1186.64 0 0 0.03 238.426 2050 0 2215.72 2240.9 0 0 0 0 -1360.74 704.901 0 0 0 0 525.91 0 0 0 0 -1334.5 -37.7667 0 964.003 0 1829.66 -848.949 2156.06 0 0 0 0 0 0 -1983.93 0 0 0 
0 0 0 0 623.875 0 -967.818 2213.89 0 0 -2211.14 0.03 0 1835.46 1897.87 -1677.22 0 0 0 0 2233.88 -86.7489 0 2406.61 0 0 0 -713.752 1550.57 1750.01 0 228.813 1725.29 0 0 0 0 -1994.31 -344.172 -1698.13 0 0 0 0 0 0 0 0 0 
0 1242.48 1547.52 0 0 0 0 0 0 0 -331.812 0 0.07 0 0 0 0 0 0 2265.77 0 0 0 0 1081.04 0 0 0 0 0 0 0 0 0 0 0 1722.85 0 0 2092.12 0 0 0 0 0 0 0 0 0 
0 0 0 839.03 926.313 0 1741.92 -142.75 0 0 0 -149.159 0 0 0 0 0 0 0 -35.9355 0 2196.95 0 0 -1030.08 0 -697.882 0 393.46 0 0 -408.567 0 0 0 0 0 1930.37 0 0 -2271.42 0 0 0 0 -1146.96 0 -697.119 0 
-1617.4 0 0 2065.57 0 0 1870.25 0 0 0 -498.291 827.891 0 0 0.05 0 0 0 0 0 0 0 0 0 0 0 0 0 0 0 574.587 625.858 0 -1789.68 0 0 0 2075.95 0 0 1307.34 2084.03 0 0 0 0 0 0 0 
-89.9533 0 0 0 0 0 0 0 0 0 1648.69 -1334.8 0 0 0 0.01 0 0 1613.74 0 659.886 0 2059.62 1211.51 -2008.8 0 83.0866 0 0 0 0 0 1552.25 0 -4.65407 0 0 0 0 2141.56 0 0 0 0 0 0 0 0 0 
0 0 0 0 0 1600.77 0 -1278.65 0 0 0 0 0 0 0 0 0.08 0 985.519 0 0 0 0 0 0 0 0 -703.833 0 -1656.16 0 838.42 0 0 639.592 0 0 0 0 0 0 864.666 0 0 0 0 146.87 0 0 
0 0 0 0 835.978 0 0 0 0 2197.26 0 0 0 0 0 0 0 0.04 -860.088 0 716.193 0 257.5 1668.68 0 1563.84 -1419.64 0 0 0 0 -2290.64 0 0 -1211.05 0 0 1897.11 0 1678.44 0 0 0 0 0 0 0 -1759.77 0 
-529.42 0 1779.61 0 0 2244.87 0 0 0 0 0 0 0 0 0 2014.15 -1253.17 -701.697 0.05 0 0 0 0 0 1036.64 0 2298.27 0 -2247.92 0 0 0 0 0 0 0 0 1320.61 0 0 0 0 0 0 0 0 0 -530.335 989.792 
0 0 0 0 0 1480.22 0 0 1322.6 0 0 0 1902.6 2079.3 0 0 0 0 0 0.02 0 0 0 0 0 0 0 0 0 0 2338.71 0 608.31 82.0185 0 -328.15 0 0 0 1262.63 0 0 0 0 0 0 0 0 0 
0 1050.37 0 0 -948.439 -683.996 0 0 0 0 1081.35 -1368.68 0 0 0 186.697 0 -663.244 0 0 0.05 0 0 0 0 0 0 0 2000.72 0 10.7578 2350.61 0 2331.39 0 0 1302.91 912.732 0 0 0 -2002.09 0 0 1471.98 -2404.17 0 0 0 
0 0 0 0 0 0 424.894 0 0 0 1076.01 -1824.93 0 1886.58 0 0 0 0 0 0 0 0.02 0 0 0 0 0 1415.07 0 0 0 0 0 1851.94 -323.267 0 0 0 0 0 0 0 0 2373.5 0 0 0 0 0 
0 2275.84 0 147.481 189.901 687.506 0 0 -2147.36 0 0 0 0 0 0 2481.08 0 1708.5 0 0 0 0 0.09 0 1423 0 0 0 1395.23 -577.029 0 -335.322 0 0 0 1789.99 0 1273.92 -492.492 0 0 0 0 0 1462.68 0 0 0 0 
0 0 0 0 0 0 -996.2 0 0 0 0 2161.24 0 0 0 -2452.85 0 -1306.12 0 0 0 0 0 0.06 -1076.16 1268.27 84.6126 0 -835.063 0 0 0 705.512 0 0 0 1874.52 0 0 0 0 2483.06 0 0 0 0 0 0 0 
0 0 0 0 0 433.897 0 0 0 1498.69 0 0 -1885.2 -1279.56 0 2246.54 0 0 2047.26 0 0 0 952.864 1113.85 0.03 2364.5 0 0 0 0 0 0 0 0 0 0 0 0 0 0 0 0 0 0 0 0 0 0 0 
0 0 0 0 0 0 0 0 81.5607 0 0 0 0 0 0 0 0 1930.52 0 0 0 0 0 2035.2 -140.767 0.03 0 2477.72 0 0 0 0 0 -87.054 0 0 0 0 0 0 0 0 0 0 0 0 0 0 0 
2019.64 -332.118 -856.12 0 0 2397 24.4911 0 0 164.876 2416.38 0 0 -521.332 0 2177.72 0 1744.36 1531.65 0 0 0 0 -40.0555 0 0 0.02 1845.53 0 0 0 1867.66 0 1112.78 0 -712.073 0 -729.316 0 0 -552.919 0 0 0 0 0 0 0 0 
0 0 0 0 0 -753.883 0 0 0 1213.95 0 1238.98 0 0 0 0 1661.66 0 0 0 0 -2292.32 0 0 0 -611.667 1783.58 0.08 2337.95 0 0 0 0 0 0 0 0 0 -1936.02 0 0 1292.69 0 0 0 0 0 0 0 
0 577.639 0 0 -872.295 0 0 1096.91 0 0 0 1605.35 0 -1823.1 0 0 0 0 372.555 0 -677.892 0 2381.44 -984.756 0 0 0 2289.73 0 0 0 0 0 0 616.245 0 0 -1465.42 0 0 819.651 0 0 0 0 0 0 0 0 
-956.526 0 986.74 0 927.992 0 1252.86 -14.2674 165.944 -268.334 0 -2304.83 0 0 0 0 212.485 0 0 0 0 0 -533.845 0 0 0 0 0 0 0 1096.91 0 0 0 0 0 0 0 0 1428.8 0 924.177 0 0 0 0 0 0 1045.49 
-1122.24 1200.06 0 0 0 0 1127.58 -881.451 -891.522 0 0 0 0 0 2323.76 0 0 0 0 582.217 -1367.76 0 0 0 0 0 0 0 0 201.498 0.03 2095.48 0 0 -290.46 0 0 0 0 0 0 0 0 1417.51 0 0 0 0 0 
161.061 0 0 0 0 0 0 0 0 1623.51 -1731.39 -889.538 0 -1122.39 -470.061 0 1180.99 -842.387 0 0 1161.15 0 1732.46 0 0 0 1002.15 0 0 0 1667.91 0 0 0 0 -2424.16 0 0 0 0 0 0 0 0 0 0 0 0 0 
0 -2059.77 -5.72222 0 0 0 -1234.4 0 0 0 1769.08 1183.43 0 0 0 2425.08 0 0 0 -9.38444 0 0 0 999.557 0 0 0 0 0 0 0 0 0.04 0 0 955 0 0 0 -1602.45 1413.85 1462.52 0 2304.22 0 0 0 0 0 
0 -1191.98 0 0 0 0 0 781.35 0 1410.03 0 0 0 0 770.058 0 0 0 0 822.092 -468.23 2213.58 0 0 0 -1007.03 1646.4 0 0 0 0 0 0 0.03 0 0 0 0 0 0 0 0 0 0 -1418.88 0 -1352.05 0 0 
0 1843.39 0 0 0 0 -1959.52 0 0 0 1848.28 0 0 0 0 938.978 1253.78 2017.04 0 0 0 -2058.4 0 0 0 0 0 0 464.568 0 1792.28 0 0 0 0.08 0 0 0 0 0 0 -993.454 0 0 0 0 0 27.3904 0 
0 0 0 0 0 0 0 389.492 0 -2358.55 0 0 0 0 0 0 0 0 0 11.9785 0 0 198.904 0 0 0 1727.42 0 0 0 0 -978.195 2013.99 0 0 0.09 2346.34 -1878.19 0 0 -1730.32 0 0 0 0 1880.93 1861.09 0 0 
0 0 0 0 0 -971.633 0 0 0 0 1024.43 0 2421.41 0 0 0 0 0 0 0 1293.6 0 0 -45.5489 0 0 0 0 0 0 0 0 0 0 0 -152.821 0.09 0 1038.93 0 1242.33 0 0 -18.3874 -2243.95 0 0 0 0 
0 0 0 287.408 0 0 1616.95 0 556.886 0 -704.291 2074.42 0 2426.45 1596.5 0 0 -1678.14 442.289 0 637.15 0 -1422.24 0 0 0 -1276.97 0 -18.0822 0 0 0 0 0 0 991.928 0 0.03 0 -278.405 0 0 1046.1 0 0 0 0 -1383.18 0 
0 -524.232 -1101.34 0 0 0 0 0 -774.178 0 -706.885 -998.489 0 0 0 0 0 0 0 0 0 0 1879.86 0 0 0 0 1983.02 0 0 0 0 0 0 0 0 717.261 0 0.07 0 1953.41 0 0 0 0 0 0 0 0 
0 0 0 0 0 0 0 0 0 0 0 -2256.92 2368.47 0 0 1424.07 0 -198.141 0 2014.6 0 0 0 0 0 0 0 0 0 309.687 0 0 -1259.27 0 0 0 0 1860.79 0 0.05 0 0 0 0 0 0 0 0 0 
0 -891.827 0 64.4704 0 0 0 1423.76 0 0 0 0 0 -745.033 1627.63 0 0 0 0 0 0 0 0 0 0 0 -1887.49 0 1448.03 0 0 0 434.965 0 0 735.572 2359.31 0 1523.1 0 0.03 0 -1331.14 0 0 0 0 0 0 
2392.27 0 1627.93 0 0 -154.653 0 0 -2385.71 0 0 0 0 0 -1586.73 0 475.86 0 0 0 2360.07 0 0 474.181 0 0 0 127.186 0 -1346.55 0 0 -11.2156 0 1948.84 0 0 0 0 0 0 0.04 0 0 0 0 0 0 0 
0 0 0 0 0 0 0 0 0 0 0 0 0 0 0 0 0 0 0 0 0 0 0 0 0 0 0 0 0 0 0 0 0 0 0 0 0 1459.62 0 0 -742.439 0 0.04 0 185.476 0 0 0 0 
0 0 0 0 0 0 0 -1380.43 0 0 0 0 0 0 0 0 0 0 0 0 0 2458.49 0 0 0 0 0 0 0 0 2235.71 0 748.39 0 0 0 -1394.47 0 0 0 0 0 0 0.01 0 584.201 2021.62 0 0 
0 0 0 0 0 0 0 0 0 0 0 0 0 0 0 0 0 0 0 0 -128.712 0 1839.27 0 0 0 0 0 0 0 0 0 0 1661.96 0 0 -2111.65 0 0 0 0 0 377.438 0 0 0 0 0 0 
0 0 541.017 0 0 0 0 0 0 0 2158.65 0 0 1341.21 0 0 0 0 0 0 -896.1 0 0 0 0 0 0 0 0 0 0 0 0 0 0 -2161.7 0 0 0 0 0 0 0 -582.675 0 0 0 0 0 
2242.88 0 0 0 0 1565.52 0 0 0 0 0 0 0 0 0 0 1159.93 0 0 0 0 0 0 0 0 0 0 0 0 0 0 0 0 -2043.75 0 -2269.59 0 0 0 0 0 0 0 1384.85 0 0 0.02 0 0 
0 0 0 0 487.304 0 0 0 0 -1226.77 0 0 0 343.715 0 0 0 2024.22 -2101.12 0 0 0 0 0 0 0 0 0 0 0 0 0 0 0 108.722 0 0 1013.14 0 0 0 0 0 0 0 0 0 0.07 963.393 
0 0 0 0 -1194.72 0 0 0 0 0 0 0 0 0 0 0 0 0 1025.65 0 0 0 0 0 0 0 0 0 0 -964.003 0 0 0 0 0 0 0 0 0 0 0 0 0 0 0 0 0 1983.02 0.09 
