*Vertices 72
*Matrix 
0 -448.393 0 0 0 2008.96 0 0 0 0 0 987.655 0 0 0 1430.17 -778.298 0 0 -1549.35 0 1449.4 -496.612 -1409.27 -8.92666 0 0 0 1178.85 0 0 -797.525 2488.86 0 0 0 0 0 0 0 0 0 0 0 1408.81 0 0 0 1840.8 0 0 0 133.442 0 -44.0229 0 0 0 858.715 1264.61 1344.57 0 0 0 0 0 0 0 0 0 0 0 
2266.08 0.09 1644.57 0 0 0 0 0 -647.221 0 0 0 -847.423 0 0 0 0 0 801.645 0 148.854 0 0 2365.87 0 -215.079 0 0 0 0 0 0 0 0 0 0 0 0 0 0 0 0 0 0 -540.864 -205.161 0 0 0 0 0 0 0 0 0 0 0 0 0 0 0 0 0 0 0 0 0 0 0 -2217.4 0 0 
0 261.773 0.08 0 0 0 1036.03 0 0 0 0 0 0 0 2132.4 0 1538.36 0 1000.32 -823.008 -414.975 0 0 1318.32 0 1669.59 -2207.79 0 0 0 0 -1940.75 -546.052 -1397.98 0 0 1408.05 0 0 -1079.52 554.292 0 0 -2076.4 0 868.938 -792.947 0 0 0 0 0 -1387.3 496.918 0 2129.35 17.1667 2359.77 0 -1252.4 2258.45 2448.88 0 0 0 0.534074 -1454.28 0 0 -405.515 0 0 
0 0 0 0.06 0 0 479.217 -2099.6 0 0 0 0 -2126.91 0 0 0 0 1461.46 0 1069.29 0 512.329 0 0 2478.33 0 751.137 1892.68 0 -469.146 0 0 0 1184.5 0 0 317.621 -1279.11 422.758 0 0 1608.4 0 0 0 0 0 0 0 0 0 0 -2131.95 2491.45 2429.04 872.295 2296.9 0 1859.72 -766.549 -1671.12 1104.24 0 0 0 0 0 0 0 0 0 0 
0 0 0 0 0.02 2361.75 0 0 0 0 2176.81 0 0 2288.96 0 0 0 -928.907 1179.62 0 2371.36 0 1829.66 -1552.1 -1847.82 0 1381.5 0 1863.38 0 0 -1596.5 0 -260.704 0 0 304.346 0 0 0 0 220.42 0 0 0 0 0 0 0 0 0 1634.8 0 0 0 1043.35 0 0 0 0 0 0 0 -203.94 0 0 0 0 0 0 0 0 
-1671.73 0 0 0 2075.64 0.03 0 0 -672.704 0 -2070.45 1503.42 -138.02 0 0 0 0 0 49.6689 0 0 0 0 969.649 0 0 0 446.562 0 0 2363.28 -1999.8 0 0 893.201 0 0 0 1120.87 0 0 0 0 0 669.042 0 0 0 0 0 0 171.285 2050.92 0 1870.1 -2368.01 401.242 1318.32 1213.03 0 0 0 0 0 0 0 0 0 -1574.22 141.377 0 0 
0 0 -1519.75 2161.85 0 0 0.02 0 -1091.42 -415.891 0 0 0 0 -448.546 1760.54 0 0 1920.91 -1794.11 0 0 -1818.06 0 0 -1006.73 -1366.85 0 616.55 0 0 2443.39 0 0 0 185.781 2044.82 665.227 -712.531 1359.83 0 0 0 0 0 -422.452 0 1569.03 0 0 0 0 0 2123.55 0 1526.15 0 0 0 0 0 0 0 -606.937 0 0 -456.633 0 0 0 0 1305.81 
0 0 0 1349.76 0 0 0 0.01 -1889.32 0 1970.05 0 0 0 0 0 0 0 144.581 1446.96 0 0 -996.2 0 0 0 0 -121.387 2349.24 0 0 0 0 0 1601.69 0 0 0 0 0 0 0 -2052.29 0 148.091 1929.3 0 0 0 1796.09 0 0 0 0 -1388.21 0 0 0 0 0 0 1335.26 -209.128 1773.51 0 0 0 0 -789.895 -2347.41 0 0 
0 792.337 0 0 0 1010.7 -1106.37 -1722.85 0.04 -909.07 0 0 0 0 0 1664.25 0 0 0 613.651 0 0 0 1853.01 0 0 0 0 0 0 0 0 0 0 0 -1130.94 0 0 0 0 0 0 0 0 0 2292.17 0 0 0 0 1785.41 0 0 0 2043.44 0 0 1181.14 0 0 0 0 1408.96 521.79 0 0 0 0 0 0 0 0 
0 0 0 0 0 0 -1797.62 0 960.646 0.09 2497.86 0 2198.48 0 0 0 -2308.19 0 0 0 0 0 0 -1686.53 1741 0 1888.87 0 2225.03 0 0 0 0 -230.338 0 0 1163.29 0 0 0 0 0 0 0 0 0 0 0 0 0 0 0 0 0 0 2251.58 0 0 -2274.62 0 0 1314.51 745.796 0 0 -1322.75 0 0 0 0 0 0 
0 0 0 0 -785.775 1679.2 0 2217.4 0 -881.603 0.09 0 1665.32 0 -1329.16 1553.77 0 0 0 1458.25 0 0 0 2048.48 1452.15 0 0 -739.235 0 0 0 0 0 -1355.56 2492.68 0 0 0 0 -607.089 0 0 0 0 -1031.75 0 1161.15 0 0 0 0 0 1597.57 0 0 0 364.925 -1466.49 -2359.31 0 0 0 2379.76 1758.71 0 0 0 0 0 0 0 1814.86 
648.747 0 0 0 0 525.3 0 0 0 0 0 0.01 0 0 -528.809 1859.87 0 0 269.555 0 2097.16 1782.36 0 1449.71 -1597.11 0 0 0 0 0 1442.38 212.638 -2343.44 0 0 -2481.38 0 0 -1874.68 0 0 0 0 0 0 2090.59 1836.99 0 0 -1977.22 0 0 0 0 155.263 0 0 0 -2431.49 0 0 0 1476.87 0 0 0 0 0 722.602 0 0 0 
0 -1531.8 0 1590.7 0 -1749.4 0 0 0 -2112.87 1591.46 0 0.04 0 -204.855 0 0 0 0 0 0 0 0 2299.65 -103.229 -465.636 0 0 0 0 -1178.7 0 0 0 2176.81 2449.34 -1743.14 -2397.31 0 0 0 0 0 0 0 2221.98 0 0 0 0 0 0 2477.11 667.211 0 -2378.99 0 0 0 0 1299.86 163.045 0 1161.15 1656.93 0 0 0 0 0 0 0 
0 0 0 0 -860.698 0 0 0 0 0 0 0 0 0 -871.685 0 2071.21 0 0 0 0 0 0 0 2394.56 0 1650.36 0 2072.28 0 0 0 0 0 -2154.84 0 0 0 0 0 0 0 0 0 0 0 0 0 0 0 0 -849.559 0 0 -917.005 0 787.149 -362.941 0 0 0 0 0 -2454.22 0 262.383 0 0 0 0 0 0 
0 0 1012.22 0 0 0 -1539.58 0 0 0 -2486.88 -461.974 2094.87 -1227.38 0.07 0 0 2376.4 -1719.34 776.162 0 0 859.478 0 0 0 0 0 1199.3 0 0 0 -691.473 0 0 1120.11 0 0 1782.82 0 121.082 0 0 0 0 888.012 -367.367 0 0 0 -1947.46 0 0 0 0 2016.28 0 0 0 0 201.651 1914.66 0 -375.912 0 0 0 0 0 0 0 0 
128.559 0 0 0 0 0 1283.07 0 1528.14 0 209.738 2133.78 0 0 0 0.03 0 1505.4 0 0 0 1267.51 -2206.11 0 0 -1476.1 1987.9 1205.71 -2272.03 0 -677.129 0 0 0 0 0 0 0 0 0 0 0 0 0 0 0 -796.915 0 1856.67 0 0 1192.13 0 0 0 0 910.291 0 0 0 0 0 0 0 0 0 1005.66 1123.62 -1660.59 0 0 640.202 
626.164 0 1385.92 0 0 0 0 0 0 -735.267 0 0 0 2129.51 0 0 0.07 0 0 0 0 0 0 0 0 0 0 0 0 0 0 -2100.05 -71.337 0 0 0 2357.02 0 749.001 0 0 -1435.36 0 1107.44 0 0 0 2301.78 2423.7 0 0 -1549.81 0 0 0 0 0 0 0 0 2371.97 0 0 -1616.18 -2082.2 0 0 0 0 0 0 0 
0 0 0 -1722.85 1954.18 0 0 0 0 0 0 0 0 0 1884.59 -1403.62 0 0.04 -1109.73 1547.52 0 0 -2069.69 2381.28 0 0 2301.32 0 0 413.602 0 -2445.22 2229.15 0 0 0 1205.86 0 -2094.26 0 0 0 0 0 824.839 0 0 0 1532.26 0 0 -1825.39 -1727.42 0 0 967.513 0 0 0 0 0 352.107 0 956.374 0 0 0 0 2187.95 0 -2338.1 0 
0 -1322.14 -957.442 0 551.546 -30.4422 -1209.83 2424.31 0 0 0 -1239.89 0 0 268.487 0 0 1418.73 0.05 0 0 0 1016.34 0 0 0 0 1391.72 0 0 0 0 0 0 0 1822.03 0 0 0 0 0 0 0 0 0 0 0 0 0 0 0 0 0 0 -1545.99 378.658 299.005 0 0 0 0 0 0 0 0 0 0 0 0 0 0 197.836 
-1817.3 0 -2322.84 1743.29 0 0 1250.11 1112.02 2153.61 0 2474.52 0 0 0 -1929 0 0 500.58 0 0.05 1803.26 0 0 1154.59 -1053.12 0 0 2239.22 0 0 -1995.99 -130.696 0 -787.606 0 0 -1023.06 0 0 0 0 2413.33 -2392.73 0 0 -34.257 1155.51 0 -854.137 0 0 0 0 1449.86 0 0 -506.073 0 0 1001.08 437.712 0 0 0 0 0 589.846 592.746 0 0 757.851 -1596.35 
0 -1592.99 1592.23 0 551.851 0 0 0 0 0 0 870.312 0 0 0 0 0 0 0 -548.646 0.09 0 0 0 0 0 0 0 0 0 0 0 0 0 0 0 1229.97 0 135.731 0 0 2472.99 -466.094 1951.28 0 0 0 0 0 1534.24 0 0 1931.14 0 0 0 2131.79 0 -589.389 0 0 0 0 0 0 0 0 0 0 0 -742.592 0 
2290.19 0 0 1276.06 0 0 0 0 0 0 0 1436.28 0 0 0 -2067.86 0 0 0 0 0 0.01 0 1348.99 0 0 0 0 0 0 0 0 0 1031.6 0 -1378.14 0 0 -475.707 -2175.74 0 0 0 -2401.88 0 0 -838.725 0 1925.79 -562.99 0 0 0 0 0 751.595 0 0 -192.495 0 0 -1999.19 1923.2 0 0 0 0 0 0 0 0 0 
957.747 0 0 0 656.529 0 969.344 -1464.96 0 0 0 0 0 0 957.289 2297.51 0 -723.975 612.43 0 0 0 0 0 0 0 0 0 0 0 0 0 470.061 0 0 -895.032 2387.23 0 0 0 0 -2500 0 0 0 0 0 0 0 0 0 0 0 0 0 0 0 0 0 0 0 0 131.001 0 0 0 0 0 0 0 0 0 
1192.43 -355.77 627.079 0 1296.66 -129.322 0 0 -1493.04 1812.27 2237.24 1721.32 -822.245 0 0 0 0 750.374 0 -326.167 0 899.457 0 0.07 0 0 -2406 0 -121.54 0 0 0 0 2113.48 0 0 2416.07 0 1182.36 0 -1086.08 0 0 0 0 0 0 0 0 -525.91 0 0 1216.54 1493.96 0 0 0 0 0 0 0 391.018 0 0 0 998.337 0 0 0 0 0 -213.095 
681.555 0 0 -1365.02 1847.51 0 0 0 0 1503.42 -1662.11 1520.81 -1959.06 -1184.04 0 0 0 0 0 -796.152 0 0 0 0 0.04 0 193.411 0 0 0 727.638 0 0 -8.77407 1198.69 2038.26 -254.143 0 0 -250.786 0 -702.918 0 0 0 0 0 0 2445.37 0 0 172.506 0 0 0 1225.85 1817.76 428.556 0 0 -869.854 -434.965 2223.65 0 0 0 2058.4 0 -1292.99 0 0 0 
0 -2397 559.175 0 0 0 1161.31 0 0 0 0 0 11.6733 0 0 1106.07 0 0 0 0 0 0 0 0 0 0.09 0 0 0 2219.99 0 -1825.39 0 0 0 0 0 0 27.3904 0 0 0 0 0 0 0 2149.19 0 0 394.986 1776.1 0 1641.67 0 0 -1649.75 0 0 -2256.31 0 -1495.03 0 1164.2 -507.904 0 0 0 0 0 0 0 0 
0 0 559.481 834.3 27.2378 0 60.9607 0 0 1703.47 0 0 0 -2187.64 0 825.449 0 698.035 0 0 0 0 0 -425.962 -2257.68 0 0.01 0 0 -1230.43 0 0 0 0 0 0 0 486.694 1591.77 0 0 0 0 0 -462.889 0 0 0 0 0 0 0 1435.36 0 0 0 0 0 1887.8 0 0 -799.661 0 764.87 0 0 0 0 803.629 0 -1724.52 0 
0 0 0 -1531.19 0 -1449.1 0 412.534 0 0 -244.224 0 0 0 0 314.722 0 0 2100.36 -330.439 0 0 0 0 0 0 0 0.07 0 0 0 -2409.97 0 0 0 242.546 -890.606 0 0 1774.42 0 0 0 0 1989.73 0 0 0 0 -1884.75 0 0 0 0 1846.75 0 0 1020.77 0 0 0 358.821 -1835.61 1936.48 0 0 0 0 0 0 0 0 
-309.076 0 0 0 1985.31 0 -1126.82 714.057 0 939.283 0 0 0 1882.92 -138.173 2120.96 0 0 0 0 0 0 0 2115.92 0 0 0 0 0.03 0 1363.8 2490.39 0 0 0 0 0 0 -376.98 0 0 2041.76 0 1360.13 0 0 0 1264.61 0 1475.49 -559.023 0 -1467.86 0 793.558 0 0 -1196.1 -2264.7 891.522 -997.726 -2046.95 0 0 0 0 0 0 0 2089.22 0 0 
0 0 0 1030.08 0 0 0 0 0 0 0 0 0 0 0 0 0 1242.33 0 0 0 0 0 0 0 1445.43 866.802 0 0 0.05 0 0 0 0 0 2147.05 0 0 1605.2 1840.19 0 0 -771.432 0 -2182.3 0 0 0 0 0 0 2180.62 0 0 0 0 0 0 0 0 0 0 -486.999 0 0 0 0 0 0 0 0 0 
0 0 0 0 0 -153.432 0 0 0 0 0 -1582.61 -852.916 0 0 -2.36518 0 0 0 1607.79 0 0 0 0 2027.88 0 0 0 -21.897 0 0.09 0 -582.217 0 0 0 0 0 0 0 283.135 976.669 0 0 0 -833.689 0 0 -1703.01 0 0 0 2358.09 0 0 0 0 912.58 1442.08 1902.3 0 0 0 0 0 0 0 0 0 0 1966.84 0 
-245.293 0 -1351.13 0 -1114.61 -577.487 -2226.4 0 0 0 0 -13.657 0 0 0 0 -1467.86 -2274.77 0 -876.11 0 0 0 0 0 2336.73 0 2133.93 1076.16 0 0 0.09 0 0 0 0 1861.25 1354.95 0 0 1706.67 0 0 0 0 0 0 0 874.126 1800.06 0 840.861 0 0 0 0 0 0 0 0 0 0 0 0 0 0 0 0 0 0 0 0 
633.793 0 2431.33 0 0 0 0 0 0 0 0 -1100.57 0 0 2153.31 0 316.706 -1498.99 0 0 0 0 -162.282 0 0 0 0 0 0 0 1197.62 0 0.01 0 0 0 0 0 0 0 0 1783.58 0 0 0 0 0 -2225.79 0 0 -90.4111 0 0 0 1024.74 846.66 0 0 0 0 1058 1077.99 856.12 0 0 0 0 -416.349 0 0 0 387.051 
0 0 2274.93 788.98 -1907.33 0 0 0 0 2256.77 1147.42 0 0 0 0 0 0 0 0 2248.53 0 2118.98 0 1506.93 -315.638 0 0 0 0 0 0 0 0 0.08 0 0 0 0 0 0 0 2042.83 0 0 0 0 0 0 0 0 0 0 0 0 0 0 1689.43 2055.35 0 278.863 0 0 0 0 0 0 0 0 0 0 0 0 
0 0 0 0 0 1514.25 0 1386.38 0 0 -342.647 0 -1698.28 1951.73 0 0 0 0 0 0 0 0 0 0 2303.77 0 0 0 0 0 0 0 0 0 0.01 0 0 0 0 0 0 0 0 0 0 -1943.49 2050 0 0 0 1329.31 726.875 0 0 0 -1177.18 0 0 941.115 820.719 0 0 0 1486.48 0 0 0 0 0 0 0 0 
0 0 0 0 0 0 -1918.93 0 -2177.42 0 0 1978.9 1076.01 0 -431.761 0 0 0 1435.67 0 0 101.55 -559.633 0 -520.569 0 0 -632.267 0 1767.86 0 0 0 0 0 0.03 0 0 -817.209 0 0 -124.134 0 -1584.29 2068.62 0 0 0 0 872.448 0 0 -407.346 0 0 0 0 0 0 0 1465.58 -1432.46 1037.86 2494.51 0 0 0 0 0 -1600.77 0 0 
0 0 -2261.96 2381.74 1770.46 0 -1061.2 0 0 855.51 0 0 305.414 0 0 0 273.064 -1588.11 0 -262.535 1795.02 0 910.138 1389.58 -716.803 0 0 -1011.31 0 0 0 -495.544 0 0 0 0 0.09 0 0 -622.501 0 0 0 -1882.15 0 0 -438.169 0 0 153.127 0 0 0 1431.39 0 -1698.58 1465.73 2317.96 0 0 0 0 0 0 -2368.47 2353.82 0 0 0 0 0 0 
0 0 0 2217.55 0 0 -575.045 0 0 0 0 0 911.054 0 0 0 0 0 0 0 0 0 0 0 0 0 1535 0 0 0 0 1951.73 0 0 0 0 0 0.01 -2361.75 0 0 -793.1 0 1705.6 -944.319 0 0 0 2497.41 0 0 1753.67 -1811.2 0 0 0 1031.91 1178.4 -540.559 0 0 -645.543 0 0 0 0 0 0 0 0 0 0 
0 0 0 -508.667 0 -1219.44 -969.955 0 0 0 0 -2340.69 0 0 -216.453 0 1358.76 829.264 0 0 -857.189 -1623.51 0 -619.755 0 -668.432 -1761.91 0 1493.5 2459.11 0 0 0 0 0 2342.68 0 888.47 0.02 0 -1010.39 0 -414.823 1386.68 0 0 1580.02 932.112 0 1458.86 0 0 0 0 -744.27 0 0 1810.74 260.704 0 1257.9 0 1996.75 1503.11 0 0 0 0 0 0 0 0 
0 0 -2118.06 0 0 0 1098.59 0 0 0 1036.18 0 0 0 0 0 0 0 0 0 0 -1643.96 0 0 -140.461 0 0 2231.59 0 1355.86 0 0 0 0 0 0 -367.519 0 0 0.08 262.078 0 0 0 -1373.87 0 0 0 -564.516 0 2351.83 0 0 0 1437.5 0 0 0 0 0 0 0 0 0 0 0 0 0 0 0 0 0 
0 0 -2326.2 0 0 0 0 0 0 0 0 0 0 0 403.836 0 0 0 0 0 0 0 0 -2365.87 0 0 0 0 0 0 -415.738 -294.733 0 0 0 0 0 0 1624.42 938.826 0.09 0 -536.897 0 2470.09 1801.28 -591.525 0 -1281.7 0 0 1168.02 0 0 1700.11 0 684.149 0 0 0 0 0 0 -680.639 0 0 0 0 -940.046 0 599.918 0 
0 0 0 -1487.4 2265.47 0 0 0 0 0 0 0 0 0 0 0 286.645 0 0 662.633 -1498.08 0 -408.109 0 279.626 0 0 0 -1518.52 0 1387.3 0 347.377 1607.94 0 -461.211 0 2442.47 0 0 0 0.06 -96.5148 0 1673.25 0 0 0 0 1432.31 0 -517.823 2312.46 0 0 0 0 0 0 0 0 0 0 0 0 0 887.86 0 0 0 0 0 
0 0 0 0 0 0 0 2411.19 0 0 0 0 0 0 0 0 0 0 0 1483.43 208.06 0 0 0 0 0 0 0 0 -2001.63 0 0 0 0 0 0 0 0 998.184 0 -268.792 2238.61 0.07 0 0 0 0 0 0 -1472.14 0 0 0 0 792.947 0 0 0 0 0 0 344.172 0 0 0 -710.547 0 0 0 0 0 0 
0 0 2107.23 0 0 0 0 0 0 0 0 0 0 0 0 0 1900.01 0 0 0 2186.12 1369.9 0 0 0 0 0 0 -1803.72 0 0 0 0 0 0 1596.65 1152.46 2435.15 -915.632 0 0 0 0 0 0 0 0 0 0 0 0 730.995 0 0 0 0 0 0 0 0 -1007.95 485.931 360.347 -2333.22 0 0 -398.038 0 -1480.83 0 0 0 
2362.06 -1608.25 0 0 0 -1228.45 0 1124.99 0 0 397.427 0 0 0 0 0 0 384.457 0 0 0 0 0 0 0 0 2249.75 899.762 0 1433.99 0 0 0 0 0 -282.983 0 -1254.23 0 -2018.57 190.359 1713.69 0 0 0.09 0 0 0 0 0 0 -2345.42 0 0 0 0 -320.826 1332.82 -1310.24 0 0 0 0 0 0 0 0 2469.63 0 0 0 1883.68 
0 2426.76 -2105.55 0 0 0 1211.66 -439.238 -837.657 0 0 1835.61 684.912 0 1489.84 0 0 0 0 -1144.37 0 0 0 0 0 0 0 0 0 0 -457.854 0 0 0 -190.664 0 0 0 0 0 -2456.97 0 0 0 0 0.01 0 0 1171.99 0 0 0 0 2393.64 0 0 -661.412 0 -188.223 0 0 1957.53 0 0 0 -1825.24 2039.93 254.601 0 -833.689 0 0 
0 0 1322.9 0 0 0 0 0 0 0 1151.54 1232.57 0 0 2471.92 1457.18 0 0 0 466.552 0 647.221 0 0 0 -340.205 0 0 0 0 0 0 0 0 2344.66 0 -0.381481 0 310.907 0 1931.59 0 0 0 0 0 0.02 -1726.05 0 2157.73 0 1207.39 0 0 0 0 0 0 0 0 0 -1593.3 0 -250.023 0 0 0 0 0 0 0 0 
0 0 0 0 0 0 38.6822 0 0 0 0 0 0 0 0 0 944.777 0 0 0 0 0 0 0 0 0 0 0 473.571 0 0 0 1306.12 0 0 0 0 0 1498.23 0 0 0 0 0 0 0 -336.848 0.09 2370.6 0 0 803.629 801.187 1888.41 0 0 12.8941 1236.38 2391.81 1670.81 2100.82 -1842.78 1827.52 2182.76 0 0 -1460.08 0 0 0 0 0 
-2023.91 0 0 0 0 0 0 0 0 0 0 0 0 0 0 -2202.29 -2481.54 1356.78 0 -1224.33 0 -258.721 0 0 -1998.73 0 0 0 0 0 -595.492 2430.11 0 0 0 0 0 2243.34 0 -1834.09 2014.15 0 0 0 0 1120.87 0 1645.94 0.05 968.429 0 0 0 0 2179.4 0 0 0 0 0 1923.66 0 0 0 0 0 0 0 0 0 0 0 
0 0 0 0 0 0 0 -495.239 0 0 0 1622.44 0 0 0 0 0 0 0 0 -750.221 -920.515 0 -2163.53 0 340.51 0 971.633 -1356.93 0 0 -695.746 0 0 0 1427.58 -291.833 0 478.759 0 0 -2397.31 -474.487 0 0 0 -861.461 0 526.673 0.05 0 505.768 2362.97 0 0 0 0 0 0 1871.93 0 0 0 1498.54 0 0 0 -477.538 0 0 0 -898.694 
0 0 0 0 0 0 0 0 682.928 0 0 0 0 0 2405.09 0 0 0 0 0 0 0 0 0 0 398.343 0 0 -2420.5 0 0 0 2011.25 0 -1856.36 0 0 0 0 1936.32 0 0 0 0 0 0 0 0 0 0 0.03 0 0 0 0 0 2416.68 0 -655.919 0 0 0 1455.5 0 -1996.29 0 0 0 0 0 0 0 
0 0 0 0 1451.99 1383.94 0 0 0 0 0 0 0 1323.66 0 -1224.17 -2295.83 -1533.48 0 0 0 0 0 0 1388.67 0 0 0 0 573.519 0 -2133.63 0 0 1725.75 0 0 245.445 0 0 -1025.35 -1992.48 0 91.174 -1313.59 0 2470.85 1993.55 0 1603.52 0 0.02 0 334.254 1589.79 1973.1 1679.05 0 -639.439 0 0 0 0 -2002.55 0 0 0 0 0 -578.707 -1140.1 0 
1144.22 0 1246.45 830.79 0 1475.04 0 0 0 0 -2152.7 0 1763.89 0 0 0 0 1189.54 0 0 -208.213 0 0 1225.85 0 -654.851 2012.92 0 1685.61 0 -1413.24 0 0 0 0 842.845 0 408.567 0 0 0 -614.872 0 0 0 0 0 -1087.91 0 1180.38 0 0 0.05 0 -1674.17 -660.802 0 -978.042 0 0 722.449 0 0 0 0 -872.295 0 0 0 0 0 0 
0 0 2351.68 1070.36 0 0 1816.84 0 0 0 0 0 534.761 0 0 0 0 0 0 -215.537 0 0 0 1133.08 0 0 0 0 0 0 0 0 0 0 0 0 -778.451 0 0 0 0 0 0 0 0 1196.1 0 2052.14 0 0 0 1423.61 0 0.03 0 873.058 0 0 0 0 -845.744 0 0 0 -1988.2 0 0 2004.99 0 0 -352.107 0 
-1452.76 0 0 1704.99 0 -1814.71 0 2125.23 -1648.23 0 0 877.636 0 -2324.37 0 0 0 0 185.476 0 0 0 0 0 0 0 0 1311.15 -417.875 0 0 0 -1839.27 0 0 0 0 0 2155.9 2132.56 -893.506 0 800.729 0 0 0 0 0 1109.88 0 0 1810.43 -2022.08 0 0 720.161 0 0 708.563 0 0 0 0 1802.19 0 0 0 2218.62 0 0 0 0 
0 0 -1453.22 -2392.73 1655.4 -1660.28 629.978 0 0 1922.44 0 0 599.612 0 -2228.69 0 0 -1856.82 1337.7 0 0 -9.53703 0 0 -292.444 -2126.15 0 0 0 0 0 0 700.171 0 2004.53 0 1851.63 0 0 0 0 0 0 0 0 0 0 0 0 0 0 -1944.11 -1327.78 2122.94 1760.23 0.03 0 0 0 0 0 0 2024.22 0 -2359.92 131.916 0 0 0 0 0 0 
0 0 -1455.35 1389.89 0 578.402 0 0 0 0 -1023.67 0 0 576.724 0 -795.389 0 0 -1240.81 888.928 444.731 0 0 0 203.94 0 0 0 0 0 0 0 0 1790.9 0 0 -805.002 2238.91 0 0 1614.2 0 0 0 -355.312 -1233.94 0 1753.21 0 0 -395.138 -1727.12 0 0 0 0 0.09 2280.27 1643.19 0 0 0 0 506.684 0 0 290.307 0 0 0 0 0 
0 0 774.636 0 0 938.673 0 0 676.519 0 568.484 0 0 1822.95 0 0 0 0 0 0 0 0 0 0 1370.66 0 0 1456.72 703.07 0 -1810.89 0 0 1399.04 0 0 1590.24 -430.082 -246.055 0 0 0 0 0 -1307.49 0 0 566.958 0 0 0 0 -2337.64 0 0 0 1572.54 0 0 0 0 0 1264 0 0 0 -458.464 0 0 0 -2236.17 0 
-527.436 0 0 521.638 0 1336.48 0 0 0 2026.66 1212.27 -50.2792 0 0 0 0 0 0 0 0 1079.67 567.568 0 0 0 -2075.33 1723.61 0 -821.177 0 -1270.26 0 0 0 2179.1 0 0 551.851 -1442.08 0 0 0 0 0 -1818.52 32.7311 0 -2207.63 0 0 123.676 27.8481 0 0 -1051.29 0 1875.74 0 0.06 939.741 0 0 0 0 0 0 0 0 0 0 0 0 
-1237.6 0 1179.46 1844.77 0 0 0 0 0 0 0 0 0 0 0 0 0 0 0 2126.76 0 0 0 0 0 0 0 0 1768.62 0 1845.84 0 0 1285.82 2470.55 0 0 0 0 0 0 0 0 0 0 0 0 1118.73 0 -455.107 0 0 0 0 0 0 0 0 -1488.16 0 157.399 0 0 0 0 0 0 0 0 0 0 0 
-814.92 0 1581.09 -515.381 0 0 0 0 0 0 0 0 1570.56 0 -1804.48 0 1542.63 0 0 1941.51 0 0 0 0 -1671.12 -1008.41 0 0 175.405 0 0 0 1149.86 0 0 236.747 0 0 1726.05 0 0 0 0 -110.096 0 0 0 2097.46 1217.61 0 0 0 -253.685 -1138.42 0 0 0 0 0 238.731 0.07 -791.269 0 2028.49 0 0 0 0 0 0 0 0 
0 0 -1927.47 -1721.63 0 0 0 -1975.08 0 252.617 0 0 784.097 0 391.629 0 0 1231.19 0 0 0 1789.83 0 -547.426 606.479 0 -88.4274 -841.166 -224.235 0 0 0 -580.691 0 0 1375.7 0 1017.72 0 0 0 0 463.652 -2457.12 0 645.695 1117.21 1361.51 0 0 0 0 0 0 0 0 0 0 0 0 1618.02 0.06 -868.023 0 0 0 0 0 0 0 0 0 
0 0 0 0 0 0 0 43.8704 -549.104 1836.22 286.187 1942.73 0 0 0 0 0 0 0 0 0 713.294 264.672 0 427.03 -1326.11 0 261.01 0 -1400.72 0 0 -1225.39 0 0 93.4629 0 0 386.441 0 0 0 0 1858.65 0 0 0 -749.763 0 0 1690.95 0 0 0 0 -1440.55 0 867.718 0 0 0 1984.69 0.09 0 -2021.93 0 0 2068.16 0 0 0 0 
0 0 0 0 1933.73 0 565.737 137.257 -1871.93 0 323.42 0 -356.38 774.026 307.398 0 -1358.46 1364.56 0 0 0 0 0 0 0 2243.64 2007.28 -1838.05 0 0 0 0 0 0 1842.78 -791.726 0 0 -1375.85 0 1651.43 0 0 1004.59 0 0 -33.9518 1422.7 0 2411.19 0 -2444 0 0 1920.91 0 -220.42 0 0 0 329.829 0 0 0.05 0 0 0 0 -482.116 0 0 0 
0 0 0 0 0 0 0 0 0 0 0 0 -1541.57 0 0 0 896.863 0 0 0 0 0 0 0 0 0 0 0 0 0 0 0 0 0 0 0 705.817 0 0 0 0 0 0 0 0 0 0 0 0 0 1848.73 0 0 -2218.92 0 -1422.24 0 0 0 0 0 0 2243.64 0 0.05 0 0 0 0 0 1722.39 0 
0 0 -1950.36 0 0 0 0 0 0 -417.264 0 0 0 1365.17 0 0 0 0 0 0 0 0 0 -740.303 0 0 0 0 0 0 0 0 0 0 0 0 1241.87 0 0 0 0 0 2491.91 0 0 1016.8 0 0 0 0 0 0 -1989.27 0 0 2138.05 0 0 0 0 0 0 0 0 0 0.08 0 0 0 -1905.8 0 0 
0 0 -973.769 0 0 0 2147.66 0 0 0 0 0 0 0 0 -985.977 0 0 0 2330.16 0 0 0 0 -780.587 0 0 0 0 0 0 0 0 0 0 0 0 0 0 0 0 1459.32 0 699.255 0 -2184.59 0 1427.12 0 0 0 0 0 0 0 0 1826.61 183.035 0 0 0 0 0 0 0 0 0.09 0 0 0 0 0 
0 0 0 0 0 0 0 0 0 0 0 0 0 0 0 4.50148 0 0 0 2123.55 0 0 0 0 0 0 0 0 0 0 0 0 2321.47 0 0 0 0 0 0 0 0 0 0 0 2324.67 -1674.78 0 0 0 33.4941 0 0 0 -1148.64 -360.347 0 0 0 0 0 0 0 1755.2 0 0 0 0 0.06 0 0 0 1632.05 
0 0 0 0 0 -2476.65 0 -357.753 0 0 0 -595.492 0 0 0 702.155 0 752.205 0 0 0 0 0 0 1084.86 0 -318.842 0 0 0 0 0 0 0 0 0 0 0 0 0 -1463.29 0 0 2392.73 0 0 0 0 0 0 0 0 0 0 0 0 0 0 0 0 0 0 0 2304.68 0 0 0 0 0.05 -347.53 104.45 0 
0 2349.39 -740.608 0 0 1652.96 0 -2347.1 0 0 0 0 0 0 0 0 0 0 0 0 0 0 0 0 0 0 0 0 -177.236 0 0 0 0 0 0 -109.485 0 0 0 0 0 0 0 0 0 1408.51 0 0 0 0 0 1628.54 0 0 0 0 0 0 0 0 0 0 0 0 0 -910.443 0 0 -283.898 0.03 -316.553 0 
0 0 0 0 0 0 0 0 0 0 0 0 0 0 0 0 0 1012.99 0 -153.432 -99.8718 0 0 0 0 0 -1995.07 0 0 0 1594.21 0 0 0 0 0 0 0 0 0 -50.4318 0 0 0 0 0 0 0 0 0 0 2324.82 0 -2273.71 0 0 0 1245.23 0 0 0 0 0 0 -1746.96 0 0 0 202.414 16.4037 0 235.221 
0 0 0 0 0 0 2082.66 0 0 0 -18.8452 0 0 0 0 1649.6 0 0 2005.14 -297.174 0 0 0 -92.0896 0 0 0 0 0 0 0 0 1072.04 0 0 0 0 0 0 0 0 0 0 0 1513.49 0 0 0 0 1430.33 0 0 0 0 0 0 0 0 0 0 0 0 0 0 0 0 0 -1322.14 0 0 -439.238 0.03 
