*Vertices 76
*Matrix 
0.06 573.367 608.463 -1765.88 0 608.921 0 0 0 0 0 0 0 0 0 0 0 0 0 0 0 0 0 1789.99 0 451.292 0 0 0 0 0 0 330.439 0 0 0 0 0 0 -414.823 0 0 0 0 0 0 0 2359.61 0 0 0 0 0 -1550.57 0 0 0 0 0 0 0 0 0 0 -940.657 0 0 0 0 -443.358 -884.503 0 0 0 0 0 
-2252.19 0.08 0 0 -553.987 0 0 0 0 0 0 0 0 0 0 0 0 0 771.126 0 0 0 0 0 0 0 0 0 0 0 0 0 0 0 0 0 0 2161.55 336.543 0 0 0 0 0 0 2364.19 1666.08 676.061 0 0 0 0 0 1763.74 0 0 0 0 0 0 0 0 2477.87 -43.4126 0 0 0 0 0 0 -1506.16 0 0 0 0 0 
-2060.99 0 0.06 0 0 0 0 0 0 0 0 0 0 0 0 0 0 0 2032.76 0 0 0 -1195.03 0 0 0 0 1910.23 0 0 0 0 0 0 0 0 0 0 0 0 0 0 0 0 0 1839.43 223.014 0 0 0 0 0 1018.94 0 0 0 0 0 0 2268.82 0 0 0 0 0 0 0 0 0 0 0 0 0 0 0 0 
-566.805 0 0 0 0 0 -1330.53 0 0 -847.423 0 0 0 0 0 0 0 0 0 0 0 0 0 0 1395.84 0 2169.79 0 0 0 0 0 0 0 0 0 0 0 0 2164.45 0 0 0 0 0 0 0 0 0 0 0 0 0 0 0 0 0 -1618.93 0 0 0 0 0 0 0 0 0 0 0 0 0 0 0 0 0 0 
0 -1795.18 0 0 0.03 0 0 0 0 0 0 0 0 0 334.559 0 1367.76 0 0 968.581 0 0 0 0 0 0 0 0 0 0 0 0 0 0 0 0 0 0 0 0 0 0 0 0 0 978.042 0 0 0 0 0 0 0 0 0 2051.07 509.125 783.944 0 0 0 0 0 0 0 0 0 0 0 0 0 0 0 0 0 0 
618.381 0 0 0 0 0.09 0 -974.075 1549.65 0 0 0 0 0 -170.522 0 1180.38 0 0 0 -1416.9 0 0 0 0 0 0 0 0 0 0 0 0 0 0 0 0 0 0 0 0 0 0 0 0 0 2446.75 -2375.03 0 0 0 0 -1186.64 0 1361.66 0 0 0 0 0 0 0 2389.07 0 0 0 0 0 0 0 0 0 0 0 0 0 
0 0 0 195.242 0 0 0.02 0 0 0 0 0 2240.44 0 0 0 788.522 141.072 0 -2109.82 0 0 0 0 0 1153.52 0 2336.42 0 0 0 0 0 0 0 0 0 0 0 0 0 0 0 0 0 0 0 0 0 -2239.83 0 -435.728 0 0 0 0 0 0 0 0 0 0 0 0 0 0 0 0 -604.19 0 0 0 0 0 0 0 
0 0 0 0 0 2359.31 0 0.05 0 -2308.19 0 0 343.104 0 0 0 0 0 0 0 0 0 0 0 0 0 0 0 0 0 0 -2134.39 0 0 1850.41 0 0 0 0 0 0 0 0 0 0 0 0 0 0 58.3666 1961.04 0 0 0 0 0 0 0 854.9 0 0 0 0 0 0 -350.124 -232.475 0 0 0 0 0 0 0 0 0 
0 0 0 0 0 534.303 0 0 0.04 0 0 0 0 0 0 0 0 0 0 0 0 0 0 0 2177.88 1082.26 0 -747.169 0 0 0 0 0 0 0 0 697.272 0 0 0 -1182.52 2305.75 0 0 2234.03 -2144 0 0 -1482.67 0 0 0 0 164.418 0 0 0 0 0 0 814.005 0 0 0 0 0 0 0 1613.13 0 0 0 0 0 0 0 
0 0 0 -1911.15 0 0 0 -1829.2 0 0 0 0 0 0 0 0 0 559.481 1831.64 0 0 0 0 0 0 0 1939.22 0 0 0 0 0 2106.92 1459.32 0 -1649.45 0 0 0 1641.21 0 0 -2281.79 0 0 0 2113.64 0 0 0 -208.213 0 0 0 0 0 0 0 2026.2 0 2434.39 -358.669 0 0 0 0 0 0 0 -1730.63 0 0 0 0 -389.95 0 
0 0 0 0 0 0 0 0 0 0 0.03 0 0 0 0 0 0 0 -317.316 0 0 -2489.32 0 0 0 702.46 0 0 0 0 2384.33 0 0 0 -180.288 0 0 0 1065.02 0 0 0 0 0 1134.91 0 0 0 0 0 0 0 0 2167.2 0 0 0 0 -1597.72 0 0 0 0 0 2288.05 -165.181 299.463 0 0 0 0 0 0 0 0 0 
0 0 0 0 0 0 0 0 0 0 0 0 0 0 0 0 0 0 0 0 2256.16 0 0 0 -2075.33 1387.91 0 0 0 0 0 0 0 0 1601.84 0 0 0 0 0 0 -1865.83 0 0 0 0 0 2191.31 0 0 0 0 0 0 0 239.494 0 0 0 0 0 0 0 0 0 0 0 1437.8 1403.62 0 0 0 0 0 0 0 
0 0 0 0 0 0 511.109 1946.24 0 0 0 0 0.09 0 0 0 0 0 0 0 0 0 0 803.934 758.461 0 0 0 2188.86 0 1593.45 0 0 0 1359.07 0 0 0 0 0 0 0 0 0 0 0 0 0 0 0 0 0 0 0 0 0 1830.88 0 -2344.05 0 1103.32 0 0 0 0 0 0 296.564 0 0 0 0 0 0 0 0 
0 0 0 0 0 0 0 0 0 0 0 0 0 0.07 0 0 0 0 0 1370.36 0 0 0 0 0 0 -2393.49 0 0 0 0 0 0 0 0 0 0 0 0 0 0 0 0 0 0 0 0 1751.84 0 0 0 0 0 0 0 0 0 0 0 0 0 0 -1334.65 0 496.765 0 0 0 0 0 0 0 0 0 0 2450.41 
0 0 0 0 1621.83 2206.41 0 0 0 0 0 0 0 0 0.07 0 0 0 0 0 0 0 0 0 0 0 0 0 1004.14 0 1855.3 0 -2264.55 0 -404.599 0 0 -1726.97 0 0 0 0 0 0 0 0 0 0 0 0 0 -277.49 0 76.9829 0 0 0 0 0 0 0 1252.71 0 0 0 0 0 0 0 0 0 0 0 0 0 0 
0 0 0 0 0 0 0 0 0 0 0 0 0 0 0 0.01 0 0 0 0 -237.815 0 0 -1208.46 0 0 0 0 0 0 0 0 0 0 0 0 0 0 0 0 0 0 0 0 0 907.239 0 0 0 0 0 958.968 0 0 0 -1876.81 0 0 0 -518.738 0 -410.703 0 0 929.975 0 0 0 2140.19 0 0 0 0 0 0 0 
0 0 0 0 -386.135 1119.65 183.493 0 0 0 0 0 0 0 0 0 0 1236.84 0 0 -2281.79 0 0 0 0 0 0 0 0 0 0 0 -185.781 0 0 0 0 0 0 1293.6 0 -490.661 -2275.99 0 0 0 0 0 615.329 0 0 0 1841.41 0 0 0 0 0 0 0 0 1165.27 0 0 0 0 0 0 0 0 0 0 0 0 0 0 
0 0 0 0 0 0 679.418 0 0 2401.12 0 0 0 0 0 0 -1937.39 0.05 0 0 0 0 0 0 -101.856 0 0 0 0 2203.51 0 0 0 0 0 0 0 -23.1178 0 0 0 0 0 0 0 0 0 0 0 0 0 0 0 0 0 0 0 738.319 0 243.156 0 0 0 0 0 0 0 0 0 0 0 0 0 0 0 0 
0 -569.094 -2102.95 0 0 0 0 0 0 510.346 -264.061 0 0 0 0 0 0 0 0.03 0 0 0 0 0 0 2363.73 1725.44 0 0 -1203.42 0 0 0 0 0 0 0 0 0 0 0 0 0 0 0 0 0 0 -1011.92 0 1410.79 0 1995.07 0 0 0 0 0 0 0 0 0 0 0 0 0 0 0 0 0 0 0 0 0 0 0 
0 0 0 0 -1306.73 0 -2486.88 0 0 0 0 0 0 2328.03 0 0 0 0 0 0.01 0 0 0 0 0 0 1305.2 1543.86 0 0 0 0 0 1991.26 0 0 0 0 -1538.21 0 0 0 0 0 0 0 0 0 0 1831.95 0 0 0 -784.249 0 0 0 0 -540.101 0 0 0 0 288.781 2086.47 0 0 0 0 0 0 0 0 0 0 0 
0 0 0 0 0 1257.13 0 0 0 0 0 971.328 0 0 0 -1903.52 1614.81 0 0 0 0.01 0 0 1569.95 0 -2108.6 0 0 0 0 2012.01 0 -245.293 0 0 0 0 0 0 380.795 0 0 0 -167.318 0 -2099.14 0 0 0 998.947 0 0 1874.22 0 0 0 0 -1311 0 0 -1190.45 0 0 0 0 0 2165.36 0 0 0 0 0 0 0 0 0 
0 0 0 0 0 0 0 0 0 0 750.374 0 0 0 0 0 0 0 0 0 0 0.04 0 0 0 0 0 0 -568.026 0 0 882.977 0 0 0 0 0 0 0 0 0 0 2103.72 0 0 0 0 0 0 0 0 0 0 0 0 0 0 0 0 0 0 0 0 -2195.27 0 0 0 1253.93 0 688.879 0 0 0 0 0 0 
0 0 -632.42 0 0 0 0 0 0 0 0 0 0 0 0 0 0 0 0 0 0 0 0.05 2277.37 0 0 0 0 1187.4 828.654 0 0 0 0 335.627 -1000.47 0 0 0 0 0 0 0 0 0 0 0 0 0 2094.41 0 0 0 0 0 0 0 0 0 0 0 0 0 0 0 0 0 0 0 0 0 0 0 0 0 0 
1979.66 0 0 0 0 0 0 0 0 0 0 0 1977.07 0 0 -943.403 0 0 0 0 2488.25 0 -1911.3 0.06 0 0 0 0 -1904.58 0 44.0229 0 0 0 0 0 0 0 0 0 0 0 0 0 0 0 1175.04 1803.11 1749.24 0 0 0 0 0 0 2255.85 0 0 0 0 810.495 0 0 0 0 -314.57 0 0 0 0 0 0 0 0 0 0 
0 0 0 -976.363 0 0 0 0 593.356 0 0 2350.76 1655.25 0 0 0 0 1323.05 0 0 0 0 0 0 0 0 0 0 0 0 0 0 996.658 0 0 0 0 0 0 0 0 0 0 0 0 0 0 0 0 0 0 0 0 0 0 0 0 0 -2360.23 1333.58 0 573.367 0 0 0 -1729.1 0 0 0 0 0 0 0 0 0 0 
1018.94 0 0 0 0 0 -2120.35 0 -297.632 0 327.082 1.14444 0 0 0 0 0 0 -389.035 0 1940.29 0 0 0 0 0 0 0 0 0 0 0 0 0 0 397.732 0 0 0 0 -459.38 0 0 0 0 0 0 0 0 1947.77 0 0 1351.74 0 2017.65 0 0 545.747 0 -2474.21 0 0 0 0 0 0 0 -71.7948 0 0 0 0 0 0 0 0 
0 0 0 -1950.97 0 0 0 0 0 2221.67 0 0 0 1401.94 0 0 0 0 2225.33 1717.66 0 0 0 0 0 0 0.08 0 2345.42 0 0 2115.92 0 0 0 0 0 -214.011 0 0 0 0 0 0 0 0 0 0 0 -240.715 191.733 0 0 0 2126.91 0 0 0 0 0 0 0 0 0 0 0 0 1490.45 0 0 0 0 0 0 0 0 
0 0 -417.264 0 0 0 1701.64 0 527.589 0 0 0 0 0 0 0 0 0 0 -707.038 0 0 0 0 0 0 0 0.02 0 0 -821.482 0 0 0 0 0 0 0 0 0 0 0 0 0 0 0 1618.47 0 0 224.235 0 0 1261.1 0 0 0 0 0 0 0 0 0 0 0 0 0 0 0 0 0 0 0 0 0 0 0 
0 0 0 0 0 0 0 0 0 0 0 0 -579.47 0 -1085.92 0 0 0 0 0 0 626.621 1873 -339.137 0 0 1330.38 0 0.02 0 0 0 0 0 0 0 0 -1878.64 0 0 0 0 0 0 0 0 0 0 1453.98 0 0 0 0 0 0 0 0 782.876 0 2388.15 0 0 0 0 0 0 0 0 0 0 0 0 0 0 0 0 
0 0 0 0 0 0 0 0 0 0 0 0 0 0 0 0 0 1376 -815.531 0 0 0 2123.55 0 0 0 0 0 0 0.05 0 0 0 959.578 0 0 0 0 0 0 -2017.04 0 0 0 0 0 0 0 -843.76 250.786 0 0 0 0 522.401 0 0 0 0 0 -8.31629 0 0 0 0 0 0 0 0 0 0 0 0 0 0 0 
0 0 0 0 0 0 0 0 0 0 -1053.12 0 2308.65 0 1293.45 0 0 0 0 0 -371.487 0 0 337.611 0 0 0 1815.16 0 0 0.09 0 1144.83 0 0 0 0 0 0 0 0 -955 0 0 2175.59 0 0 0 0 0 0 0 0 0 0 0 -2314.75 1853.62 0 0 0 0 0 543.153 0 2406.77 0 0 0 0 0 0 0 0 0 0 
0 0 0 0 0 0 0 445.189 0 0 0 0 0 0 0 0 0 0 0 0 0 847.728 0 0 0 0 1709.72 0 0 0 0 0.09 0 -967.666 0 0 -292.596 0 0 0 0 0 0 158.62 0 2044.82 0 0 0 -1720.86 0 0 660.192 0 0 0 0 0 0 0 0 0 0 0 0 0 0 0 0 0 0 0 0 0 0 0 
-505.158 0 0 0 0 0 0 0 0 938.978 0 0 0 0 -1795.33 0 -1359.68 0 0 0 186.85 0 0 0 2286.07 0 0 0 0 0 -391.934 0 0.04 0 0 0 -14.5726 0 -459.99 0 0 0 0 0 0 0 0 0 0 0 2061.91 1632.66 -644.475 0 0 0 0 0 0 617.313 0 1773.05 0 0 0 0 0 0 0 0 0 0 0 0 0 0 
0 0 0 0 0 0 0 0 0 2336.27 0 0 0 0 0 0 0 0 0 1007.64 0 0 0 0 0 0 0 0 0 82.9341 0 2351.53 0 0.04 0 0 251.244 0 995.59 0 0 0 0 0 0 0 0 0 0 0 0 0 0 0 0 0 0 0 0 0 0 0 0 0 643.559 -780.587 -111.621 0 0 -976.821 0 0 1941.21 0 0 0 
0 0 0 0 0 0 0 -2199.39 0 0 455.26 2408.44 1455.2 0 -384.61 0 0 0 0 0 0 0 1728.49 0 0 0 0 0 0 0 0 0 0 0 0.06 0 0 -1379.67 -2199.39 0 0 0 0 0 0 0 0 0 0 0 0 0 0 0 0 0 0 0 0 0 0 0 1426.05 1120.72 879.925 0 0 -233.238 0 0 0 2478.18 0 0 0 0 
0 0 0 0 0 0 0 0 0 1051.74 0 0 0 0 0 0 0 0 0 0 0 0 2048.02 0 0 -928.602 0 0 0 0 0 0 0 0 0 0 0 0 0 0 804.849 0 0 0 1563.84 0 0 0 -999.405 0 1364.25 0 0 965.835 0 0 0 0 1489.68 0 0 0 -568.941 0 0 0 0 0 0 0 0 0 0 0 0 0 
0 0 0 0 0 0 0 0 1030.38 0 0 0 0 0 0 0 0 0 0 0 0 0 0 0 0 0 0 0 0 0 0 966.903 1779.92 661.412 0 0 0 0 0 0 0 0 0 0 -1873.45 0 0 0 0 0 0 -19.4555 0 0 0 0 0 0 0 0 0 0 0 0 0 1091.57 0 -711.921 0 0 0 -1467.71 0 0 0 0 
0 -1701.94 0 0 0 0 0 0 0 0 0 0 0 0 2085.56 0 0 26.017 0 0 0 0 0 0 0 0 -646.306 0 -487.304 0 0 0 0 0 -1476.41 0 0 0.04 0 0 0 0 0 0 -752.815 0 0 0 0 0 2422.94 0 0 0 0 0 0 0 609.836 0 0 0 0 0 0 0 0 0 0 0 0 0 0 1802.35 0 0 
0 2194.36 0 0 0 0 0 0 0 0 491.424 0 0 0 0 0 0 0 0 -1638.92 0 0 0 0 0 0 0 0 0 0 0 0 2083.27 2348.78 2445.68 0 0 0 0.07 0 0 0 0 0 0 0 -793.252 0 0 0 121.082 1530.58 0 0 0 1053.42 0 0 0 0 757.698 325.861 0 0 0 0 0 0 0 0 0 0 0 0 0 0 
520.875 0 0 1902.75 0 0 0 0 0 -2309.56 0 0 0 0 0 0 -122.456 0 0 0 1840.34 0 0 0 0 0 0 0 0 0 0 0 0 0 0 0 0 0 0 0.09 0 0 836.436 0 0 0 -1547.98 0 2460.94 0 0 0 0 0 0 0 0 0 0 0 0 0 0 0 0 -608.921 0 0 1146.96 0 0 0 0 0 0 -1208.61 
0 0 0 0 0 0 0 0 2287.59 0 0 0 0 0 0 0 0 0 0 0 0 0 0 0 0 2174.37 0 0 0 151.296 0 0 0 0 0 1223.72 0 0 0 0 0.06 0 0 0 0 0 0 0 0 0 0 0 0 -1462.52 0 0 0 0 0 0 0 0 0 0 0 0 -512.177 0 -405.82 0 0 0 0 0 0 0 
0 0 0 0 0 0 0 0 -927.686 0 0 988.418 0 0 0 0 606.937 0 0 0 0 0 0 0 0 0 0 0 0 0 -2464.45 0 0 0 0 0 0 0 0 0 0 0.07 0 0 0 0 0 1392.33 0 0 1714.45 -761.361 0 0 0 0 0 0 0 1063.95 1079.67 -606.784 0 0 0 0 0 0 0 0 0 0 0 0 0 0 
0 0 0 0 0 0 0 0 0 -280.694 0 0 0 0 0 0 -1701.48 0 0 0 0 1825.85 0 0 0 0 0 0 0 0 0 0 0 0 0 0 0 0 0 131.611 0 0 0 0 0 2219.84 0 0 0 0 0 0 0 0 0 0 0 -638.066 0 0 0 0 0 0 0 -466.094 0 0 0 0 0 0 0 0 0 0 
0 0 0 0 0 0 0 0 0 0 0 0 0 0 0 0 0 0 0 0 434.507 0 0 0 0 0 0 0 0 0 0 2468.72 0 0 0 0 0 0 0 0 0 0 0 0.04 0 0 0 0 954.237 0 0 0 584.506 0 0 0 0 0 0 0 1762.06 0 0 1509.67 0 0 0 0 0 0 0 0 0 0 0 0 
0 0 0 0 0 0 0 0 -1991.56 0 52.8733 0 0 0 0 0 0 0 0 0 0 0 0 0 0 0 0 0 0 0 -1778.54 0 0 0 0 1451.38 2362.51 -229.423 0 0 0 0 0 0 0.09 0 -713.294 0 0 2450.87 0 0 0 0 0 0 0 2067.09 0 1806.47 0 0 0 0 0 -611.972 -1587.04 0 0 0 0 0 0 0 0 0 
0 2050.92 2493.29 0 1925.18 0 0 0 -1167.87 0 0 0 0 0 0 2014.15 0 0 0 0 -564.821 0 0 0 0 0 0 0 0 0 0 761.666 0 0 0 0 0 0 0 0 0 0 -2358.55 0 0 0.05 0 0 0 -308.313 0 0 0 0 -1417.66 0 0 0 0 0 0 0 0 -906.171 0 0 0 0 0 0 0 0 0 0 0 0 
0 -29.8318 351.039 0 0 1185.87 0 0 0 24.0333 0 0 0 0 0 0 0 0 0 0 0 0 0 989.029 0 0 0 1732.76 0 0 0 0 0 0 0 0 0 0 -292.749 -515.229 0 0 0 0 2195.43 0 0.05 0 0 0 0 -1525.7 0 0 0 0 2333.83 0 0 0 0 0 0 0 0 0 0 0 0 0 0 0 0 0 0 0 
1962.42 1337.4 0 0 0 -1354.03 0 0 0 0 0 716.193 0 -2210.23 0 0 0 0 0 0 0 0 0 2262.26 0 0 0 0 0 0 0 0 0 0 0 0 0 0 0 0 0 -2183.07 0 0 0 0 0 0.04 0 0 0 0 0 0 0 0 1008.26 0 0 0 0 0 0 0 0 0 0 1806.47 0 0 0 0 0 0 0 0 
0 0 0 0 0 0 0 0 566.195 0 0 0 0 0 0 0 389.34 0 -1621.52 0 0 0 0 1424.83 0 0 0 0 -164.113 782.418 0 0 0 0 0 1786.02 0 0 0 -2184.13 0 0 0 -808.817 0 0 0 0 0.09 1857.43 0 0 0 1831.95 0 0 0 0 0 2416.38 0 0 0 0 0 0 0 0 -1385.01 0 1170.92 0 0 0 0 0 
0 0 0 0 0 0 76.8303 1764.05 0 0 0 0 0 0 0 0 0 0 0 1790.14 2235.71 0 -1472.29 0 0 -2000.56 -2180.17 -497.986 0 -2112.87 0 2334.28 0 0 0 0 0 0 0 0 0 0 0 0 352.565 1875.29 0 0 1578.19 0.09 0 0 1373.56 0 0 0 0 0 0 -2096.09 0 0 0 0 0 0 0 0 0 0 0 0 0 0 0 0 
0 0 0 0 0 0 0 2174.67 0 191.122 0 0 0 0 0 0 0 0 -393.918 0 0 0 0 0 0 0 636.54 0 0 0 0 0 445.189 0 0 -1550.57 0 -1451.99 -2446.44 0 0 2239.37 0 0 0 0 0 0 0 0 0.06 1844.31 1371.88 0 0 0 -415.433 0 0 0 -635.319 0 0 0 0 0 0 0 0 0 0 0 0 0 0 0 
0 0 0 0 0 0 714.82 0 0 0 0 0 0 0 -789.285 1475.49 0 0 0 0 0 0 0 0 0 0 0 0 0 0 0 0 -2127.67 0 0 0 1811.2 0 441.984 0 0 2239.22 0 0 0 0 -1932.66 0 0 0 1658.15 0.06 703.986 0 0 0 0 0 0 0 0 0 0 0 0 0 0 0 0 0 0 0 0 0 0 0 
0 0 2187.8 0 0 1365.17 0 0 0 0 0 0 0 0 0 0 2223.96 0 1601.54 0 820.566 0 0 0 0 -1842.94 0 341.884 0 0 0 2092.73 753.273 0 0 0 0 0 0 0 0 0 0 -433.592 0 0 0 0 0 -66.1489 -1092.18 1157.64 0.02 0 0 0 0 0 0 0 0 0 0 0 0 0 0 0 0 0 0 0 0 0 0 0 
1509.98 2253.72 0 0 0 0 0 0 2169.64 0 -707.343 0 0 0 -2373.81 0 0 0 0 1077.23 0 0 0 0 0 0 0 0 0 0 0 0 0 0 0 523.164 0 0 0 0 -300.836 0 0 0 0 0 0 0 -800.882 0 0 0 0 0.01 0 0 0 0 0 0 0 0 0 0 0 0 0 0 2204.28 0 0 0 0 0 0 0 
0 0 0 0 0 -800.272 0 0 0 0 0 0 0 0 0 0 0 0 0 0 0 0 0 0 0 -548.494 1887.04 0 0 -251.396 0 0 0 0 0 0 0 0 0 0 0 0 0 0 0 2010.48 0 0 0 0 0 0 0 0 0 0 0 0 0 0 0 0 0 0 0 818.43 0 0 0 0 0 0 0 0 0 0 
0 0 0 0 1417.97 0 0 0 0 0 0 -1095.39 0 0 0 -1274.22 0 0 0 0 0 0 0 1500.37 0 0 0 0 0 0 0 0 0 0 0 0 0 0 1023.36 0 0 0 0 0 0 0 0 0 0 0 0 0 0 0 0 0 950.728 0 -1787.24 0 0 0 0 0 0 0 0 1737.34 0 0 0 0 0 0 0 0 
0 0 0 0 2348.32 0 0 0 0 0 0 0 -1773.35 0 0 0 0 0 0 0 0 0 0 0 0 0 0 0 0 0 1775.19 0 0 0 0 0 0 0 0 0 0 0 0 0 0 0 -796.915 -798.593 0 0 1532.41 0 0 0 0 836.894 0.07 0 0 335.017 0 2194.36 0 772.805 0 0 439.695 -2315.67 0 2106.46 0 352.107 0 0 2050.46 0 
0 0 0 2262.41 1375.7 0 0 0 0 0 0 0 0 0 0 0 0 988.113 0 0 -86.9015 0 0 0 0 -669.347 0 0 1874.68 0 1824.17 0 0 0 0 0 0 0 0 0 0 0 1674.32 0 -36.3933 0 0 0 0 0 0 0 0 0 0 0 0 0.01 -108.264 1902.91 0 0 0 0 0 -454.802 0 0 0 0 0 0 0 0 0 0 
0 0 0 0 0 0 0 1258.35 0 538.728 -1838.36 0 -1370.36 0 0 0 0 0 0 1951.58 0 0 0 0 2454.99 0 0 0 0 0 0 0 0 0 0 1739.48 0 1415.52 0 0 0 0 0 0 0 0 0 0 0 0 0 0 0 0 0 447.478 0 -669.347 0.08 0 0 895.184 0 0 0 0 0 0 0 -1535.16 0 0 0 0 0 0 
0 0 1978.44 0 0 0 0 0 0 0 0 0 0 0 0 2025.44 0 -2425.08 0 0 0 0 0 0 2156.97 2402.19 0 0 252.617 0 0 0 -737.709 0 0 0 0 0 0 0 0 1383.63 0 0 -502.869 0 0 0 1681.65 27.6955 0 0 0 0 0 0 719.55 -757.241 0 0.03 0 0 0 -1769.69 0 0 1563.84 0 0 0 0 0 0 0 0 0 
0 0 0 0 0 0 0 0 -2103.72 520.264 0 0 1611 0 0 0 0 0 0 0 -1271.48 0 0 -399.869 0 0 0 0 0 664.312 0 0 0 0 0 0 0 0 2370.14 0 0 911.969 0 1839.12 0 0 0 0 0 0 -1108.51 0 0 0 0 0 0 0 0 0 0.07 0 0 0 0 0 2280.11 0 0 -2446.13 0 0 0 0 0 0 
0 0 0 0 0 0 0 0 0 912.122 0 0 0 0 -1876.96 1568.58 739.998 0 0 0 0 0 0 0 1894.97 0 0 0 0 0 0 0 740.76 0 0 0 0 0 -80.4926 0 0 848.186 0 0 0 0 0 0 0 0 0 0 0 0 0 0 -600.986 0 2229.45 0 0 0.09 0 0 0 0 0 0 0 -438.169 0 0 0 0 0 0 
0 1700.72 0 0 0 328.15 0 0 0 0 0 0 0 -346.614 0 0 0 0 0 0 0 0 0 0 0 0 0 0 0 0 0 0 0 0 2156.21 1954.02 0 0 0 0 0 0 0 0 0 0 0 0 0 0 0 0 0 0 0 0 0 0 0 0 0 0 0.09 0 0 0 0 0 0 0 0 0 0 0 0 0 
0 1818.67 0 0 0 0 0 0 0 0 0 0 0 0 0 0 0 0 0 -319.605 0 1356.93 0 0 0 0 0 0 0 0 961.867 0 0 0 153.127 0 0 0 0 0 0 0 0 1535.77 0 2065.42 0 0 0 0 0 0 0 0 0 0 -138.783 0 0 368.587 0 0 0 0.06 0 0 0 0 0 0 0 0 0 1149.25 0 0 
-1861.09 0 0 0 0 0 0 0 0 0 -169.607 0 0 2475.74 0 1866.13 0 0 0 1538.21 0 0 0 0 0 0 0 0 0 0 0 0 0 1279.87 468.993 0 0 0 0 0 0 0 0 0 0 0 0 0 0 0 0 0 0 0 0 0 0 0 0 0 0 0 0 0 0.07 0 0 0 0 0 0 0 0 0 0 0 
0 0 0 0 0 0 0 72.1 0 0 -213.248 0 0 0 0 0 0 0 0 0 0 0 0 2113.33 553.072 0 0 0 0 0 2067.25 0 0 691.626 0 0 -2170.55 0 0 206.839 0 0 870.159 0 -1557.28 0 0 0 0 0 0 0 0 0 2442.17 0 0 626.469 0 0 0 0 0 0 0 0.02 0 0 7.24815 0 0 0 -969.497 0 0 0 
0 0 0 0 0 0 0 1557.59 0 0 36.6985 0 0 0 0 0 0 0 0 0 29.8318 0 0 0 0 0 0 0 0 0 0 0 0 -691.015 0 0 0 0 0 0 2130.73 0 0 0 1603.52 0 0 0 0 0 0 0 0 0 0 0 2082.51 0 0 1177.48 -1295.59 0 0 0 0 0 0.07 280.847 1879.86 -1825.08 0 0 0 0 0 0 
0 0 0 0 0 0 0 0 0 0 0 -2235.86 1289.48 0 0 0 0 0 0 0 0 -1823.86 0 0 0 1050.37 1942.27 0 0 0 0 0 0 0 1214.26 0 1957.08 0 0 0 0 0 0 0 0 0 0 672.094 0 0 0 0 0 0 0 -1334.96 1373.1 0 0 0 0 0 0 0 0 0 1192.89 0.06 0 0 0 0 0 0 0 0 
0 0 0 0 0 0 -137.41 0 653.325 0 0 978.195 0 0 0 -1459.93 0 0 0 0 0 0 0 0 0 0 0 0 0 0 0 0 0 0 0 0 0 0 0 2270.96 1684.55 0 0 0 0 0 0 0 718.024 0 0 0 0 2434.54 0 0 0 0 0 0 0 0 0 0 0 883.282 -37.1563 0 0 0 0 0 0 0 0 0 
1286.74 0 0 0 0 0 0 0 0 -1898.94 0 0 0 0 0 0 0 0 0 0 0 1783.58 0 0 0 0 0 0 0 0 0 0 0 -1554.08 0 0 0 0 0 0 0 0 0 0 0 0 0 0 0 0 0 0 0 0 0 0 -1492.89 0 2118.52 0 1087.76 -18.0822 0 0 0 0 1668.07 0 0 0.03 0 0 0 0 0 0 
1271.32 -490.967 0 0 0 0 0 0 0 0 0 0 0 0 0 0 0 0 0 0 0 0 0 0 0 0 0 0 0 0 0 0 0 0 0 0 0 0 0 0 0 0 0 0 0 0 0 0 2257.53 0 0 0 0 0 0 0 0 0 0 0 0 0 0 0 0 0 0 0 0 0 0.02 0 0 0 0 0 
0 0 0 0 0 0 0 0 0 0 0 0 0 0 0 0 0 0 0 0 0 0 0 0 0 0 0 0 0 0 0 0 0 0 601.444 0 583.438 0 0 0 0 0 0 0 0 0 0 0 0 0 0 0 0 0 0 0 -476.165 0 0 0 0 0 0 0 0 0 0 0 0 0 0 0.04 0 0 0 0 
0 0 0 0 0 0 0 0 0 0 0 0 0 0 0 0 0 0 0 0 0 0 0 0 0 0 0 0 0 0 0 0 0 -1697.67 0 0 0 0 0 0 0 0 0 0 0 0 0 0 0 0 0 0 0 0 0 0 0 0 0 0 0 0 0 0 0 2130.73 0 0 0 0 0 0 0.09 0 0 0 
0 0 0 0 0 0 0 0 0 0 0 0 0 0 0 0 0 0 0 0 0 0 0 0 0 0 0 0 0 0 0 0 0 0 0 0 0 2053.06 0 0 0 0 0 0 0 0 0 0 0 0 0 0 0 0 0 0 0 0 0 0 0 0 0 -1339.53 0 0 0 0 0 0 0 0 0 0.08 0 0 
0 0 0 0 0 0 0 0 0 1961.2 0 0 0 0 0 0 0 0 0 0 0 0 0 0 0 0 0 0 0 0 0 0 0 0 0 0 0 0 0 0 0 0 0 0 0 0 0 0 0 0 0 0 0 0 0 0 1002 0 0 0 0 0 0 0 0 0 0 0 0 0 0 0 0 0 0.06 0 
0 0 0 0 0 0 0 0 0 0 0 0 0 1897.56 0 0 0 0 0 0 0 0 0 0 0 0 0 0 0 0 0 0 0 0 0 0 0 0 0 920.972 0 0 0 0 0 0 0 0 0 0 0 0 0 0 0 0 0 0 0 0 0 0 0 0 0 0 0 0 0 0 0 0 0 0 0 0.06 
