*Vertices 32
*Matrix 
0.09 0 0 0 0 0 0 0 0 0 0 0 0 0 0 0 0 0 0 0 2292.02 0 0 0 0 0 0 1882 0 -1378.9 0 0 
0 0.04 0 0 0 0 0 0 0 0 0 0 0 0 5.56963 0 0 0 1450.77 0 0 0 0 0 0 0 0 0 0 0 0 0 
0 0 0.04 0 0 0 0 0 0 0 2176.96 0 0 0 0 2120.66 0 1320.31 0 0 0 0 0 2484.74 0 0 0 0 0 0 0 0 
0 0 0 0.07 0 2309.56 0 0 0 0 0 0 0 0 0 0 0 0 0 0 0 1416.44 0 -1790.9 0 0 -286.798 1377.99 0 0 0 0 
0 0 0 0 0.02 1858.96 0 0 -536.897 0 0 0 0 0 0 2015.98 0 1910.69 741.218 0 2097.46 0 0 0 0 0 0 793.558 0 0 0 0 
0 0 0 1721.47 2132.71 0.04 0 0 0 1240.35 0 0 0 0 0 0 0 0 0 0 0 0 0 2449.19 0 0 0 0 1519.44 0 0 0 
0 0 0 0 0 0 0.07 0 0 0 0 0 0 0 0 1781.59 2394.86 0 0 0 0 0 0 0 1857.74 0 0 -293.97 0 0 0 0 
0 0 0 0 0 0 0 0.01 1554.23 0 0 0 0 0 0 0 0 0 0 0 0 1553.32 0 0 0 0 -1399.81 0 0 0 0 0 
0 0 0 0 1012.22 0 0 -663.244 0.08 1655.55 1678.75 0 0 0 0 0 -277.49 0 0 0 0 0 0 0 0 0 0 0 101.856 0 0 0 
0 0 0 0 0 2369.69 0 0 1385.62 0.08 0 1584.6 0 0 0 468.841 0 0 0 0 0 0 0 0 0 0 0 0 0 0 0 0 
0 0 1623.2 0 0 0 0 0 1731.09 0 0 0 0 0 0 0 0 0 0 0 0 1911.3 0 0 0 0 0 0 0 81.5607 0 0 
0 0 0 0 0 0 0 0 0 -898.389 0 0.05 0 0 0 0 1299.4 0 0 0 0 977.432 0 1075.4 0 0 0 0 0 0 0 0 
0 0 0 0 0 0 0 0 0 0 0 0 0.07 0 0 0 0 0 0 0 1414 0 873.974 0 0 -529.878 0 -1983.17 2225.79 0 0 0 
0 0 0 0 0 0 0 0 0 0 0 0 0 0.08 0 0 0 0 0 2019.03 0 0 0 2308.5 0 -678.655 0 0 -423.826 0 0 0 
0 2298.12 0 0 0 0 0 0 0 0 0 0 0 0 0.09 0 0 0 0 0 28.9163 0 0 2000.26 0 0 0 0 0 0 -709.632 0 
0 0 1003.52 0 1595.13 0 66.1489 0 0 2386.78 0 0 0 0 0 0.02 0 0 0 0 -1353.42 0 0 0 -150.838 0 0 0 0 0 0 0 
0 0 0 0 0 0 -1531.8 0 968.581 0 0 1252.25 0 0 0 0 0.04 0 0 0 0 0 0 1022.75 0 1933.42 0 0 0 0 0 0 
0 0 1732.31 0 -50.2792 0 0 0 0 0 0 0 0 0 0 0 0 0.01 0 0 0 0 1194.88 0 0 0 1713.08 0 0 0 0 0 
0 -889.233 0 0 609.378 0 0 0 0 0 0 0 0 0 0 0 0 0 0.07 -2105.4 0 0 1019.55 1565.37 0 0 0 0 0 0 0 0 
0 0 0 0 0 0 0 0 0 0 0 0 0 1307.64 0 0 0 0 961.104 0.03 -745.033 0 0 0 2493.13 0 0 0 0 0 0 0 
-1449.55 0 0 0 -1976.15 0 0 0 0 0 0 0 894.269 0 2479.09 -1056.78 0 0 0 1367.76 0.07 0 0 2442.32 0 0 0 0 1926.25 0 0 -739.998 
0 0 0 -191.427 0 0 0 1378.75 0 0 1069.29 -103.534 0 0 0 0 0 0 0 0 0 0.08 -1063.8 0 1873.76 0 0 -2148.58 0 0 0 0 
0 0 0 0 0 0 0 0 0 0 0 0 561.617 0 0 0 0 1099.81 -312.281 0 0 541.932 0.07 0 0 0 0 0 0 0 0 0 
0 0 -390.866 1183.74 0 -198.447 0 0 0 0 0 -2185.51 0 619.907 -2390.44 0 -48.7533 0 2116.53 0 2203.82 0 0 0 0 1003.52 0 0 0 0 0 0 
0 0 0 0 0 0 2196.04 0 0 0 0 0 0 0 0 972.549 0 0 0 -1514.4 0 -758.919 0 0 0.05 0 0 0 0 0 0 0 
0 0 0 0 0 0 0 0 0 0 0 0 -548.189 1593.91 0 0 2348.02 0 0 0 0 0 0 -712.531 0 0.05 0 433.897 -690.252 0 0 0 
0 0 0 608.921 0 0 0 603.885 0 0 0 0 0 0 0 0 0 -402.31 0 0 0 0 0 0 0 0 0.03 0 0 0 0 0 
837.962 0 0 -728.248 1940.75 0 -869.854 0 0 0 0 0 -1248.74 0 0 0 0 0 0 0 0 -1691.41 0 0 0 2083.73 0 0.03 0 0 0 0 
0 0 0 0 0 631.657 0 0 1152.3 0 0 0 378.048 2489.47 0 0 0 0 0 0 1864.91 0 0 0 0 -514.161 0 0 0.05 0 0 0 
828.654 0 0 0 0 0 0 0 0 0 2483.98 0 0 0 0 0 0 0 0 0 0 0 0 0 0 0 0 0 0 0.08 0 0 
0 0 0 0 0 0 0 0 0 0 0 0 0 0 2385.56 0 0 0 0 0 0 0 0 0 0 0 0 0 0 0 0.09 0 
0 0 0 0 0 0 0 0 0 0 0 0 0 0 0 0 0 0 0 0 1327.94 0 0 0 0 0 0 0 0 0 0 0.04 
