*Vertices 37
*Matrix 
0.07 0 0 0 0 801.95 0 0 0 1347.62 1595.89 0 0 0 0 0 0 0 2371.21 0 0 0 0 0 654.088 0 0 0 0 0 0 0 0 0 0 0 0 
0 0.07 -358.669 1955.7 0 0 -1847.06 -1415.83 -796.915 0 0 606.632 2168.57 0 -1472.44 0 0 0 0 646.306 0 0 443.205 1923.51 0 0 2158.19 0 0 1007.95 -659.734 0 0 0 0 0 0 
0 2232.81 0.07 0 -1524.32 0 -409.024 0 0 0 0 0 0 0 0 0 0 704.749 0 0 969.192 0 -626.164 0 0 0 0 0 0 0 0 0 0 1123.46 0 0 0 
0 1126.97 0 0.01 0 1165.43 0 -1802.65 1771.22 0 2179.25 0 -765.633 0 0 0 -117.725 1532.56 0 -383.389 0 973.464 0 0 0 0 0 0 0 0 0 0 0 0 0 0 0 
0 0 474.639 0 0.09 0 0 0 -876.11 0 0 0 0 0 0 0 0 -155.416 -294.733 0 0 -1909.16 2223.96 1816.39 0 0 0 1672.49 0 0 1969.13 -1595.74 0 0 0 0 0 
911.817 0 0 -1602.76 0 0.07 2332.15 -2056.57 -775.857 0 1946.85 0 0 312.891 0 319.605 1227.68 0 0 1482.06 0 541.627 930.433 0 0 0 0 0 0 0 0 0 0 0 0 1715.06 0 
0 -1507.39 655.766 0 0 1246.6 0.02 0 1753.52 0 0 -222.098 0 1304.74 0 1891.46 0 1890.85 0 0 0 0 0 0 0 0 0 0 0 0 0 0 0 2126.76 0 0 0 
0 1990.8 0 547.578 0 -485.168 0 0 0 1355.71 2044.66 0 -1435.06 -1905.8 0 0 0 -960.341 0 0 0 1585.21 0 0 0 0 0 0 0 0 0 0 0 0 0 0 0 
0 571.383 0 1220.97 -771.584 2435 7.24815 0 0.01 0 0 0 -277.947 0 0 1665.62 0 -1049.15 0 0 0 0 0 1521.73 0 168.233 0 0 0 0 0 28.4585 1540.19 1184.65 0 0 0 
2218.77 0 0 0 0 0 0 2086.93 0 0.03 0 0 0 -1422.85 0 0 -819.956 57.6037 0 2039.63 0 2405.09 0 0 0 0 0 0 0 0 0 0 0 0 0 0 0 
991.318 0 0 -347.072 0 -1634.95 0 1504.64 0 0 0.07 0 0 0 2306.97 0 0 0 0 0 0 0 302.057 0 0 0 0 0 0 0 0 0 0 0 0 0 0 
0 147.633 0 0 0 0 -804.086 0 0 0 0 0.02 0 493.255 0 0 0 0 1938.61 -1744.97 0 -396.664 0 578.555 2289.12 0 0 -717.414 -1579.71 0 0 0 0 0 0 0 0 
0 2271.42 0 -447.478 0 0 0 2148.12 -1453.98 0 0 0 0.05 0 1075.55 0 0 0 0 2387.84 0 0 394.375 0 0 0 0 0 0 0 0 0 0 0 0 0 0 
0 0 0 0 0 2277.06 -1648.99 401.242 0 529.42 0 -70.5741 0 0.07 0 0 0 1515.02 2475.74 1291.01 0 0 -201.498 0 0 1406.83 0 0 0 0 0 0 0 0 0 0 0 
0 -1519.29 0 0 0 0 0 0 0 0 1717.05 0 933.943 0 0.05 0 552.156 820.719 0 0 162.13 0 0 0 -804.849 0 0 0 0 0 0 0 0 0 0 0 0 
0 0 0 0 0 -1217.15 2415.46 0 1320.31 0 0 0 0 0 0 0.07 0 0 0 -647.526 -1601.69 1428.04 0 0 -1837.6 0 0 0 0 1152.61 2373.81 0 0 0 0 0 0 
0 0 0 2380.83 0 -1433.53 0 0 0 801.34 0 0 0 0 1776.1 0 0.01 2213.74 -224.693 1758.55 0 0 1140.25 2278.13 0 0 2112.87 0 0 0 0 0 0 0 0 0 0 
0 0 -472.35 241.783 2253.72 0 2193.9 1697.67 -2020.1 -945.845 0 0 0 -790.658 997.269 0 -2133.17 0.07 2297.05 0 898.846 0 0 0 0 0 0 0 0 0 0 -2172.84 0 0 0 0 781.655 
1488.77 0 0 0 -1021.99 0 0 0 0 0 0 -829.569 0 2002.09 0 0 1618.47 -1806.62 0.09 0 0 0 0 0 0 0 0 0 828.806 0 0 0 0 0 0 0 0 
0 2136.83 0 2234.34 0 -1175.34 0 0 0 2140.19 0 1264.61 -1396.76 2036.27 0 1199 -226.218 0 0 0.08 2400.51 0 0 -1645.79 0 0 0 1287.65 0 0 0 0 0 0 0 -856.883 1917.4 
0 0 574.892 0 0 0 0 0 0 0 0 0 0 0 2191.92 -589.846 0 -779.061 0 167.318 0 1190.91 0 1612.98 0 0 0 0 0 0 0 0 0 0 0 0 0 
0 0 0 -862.072 -11.8259 984.909 0 -168.844 0 108.417 0 491.272 0 0 0 -1348.08 0 0 0 0 924.177 0.05 0 0 1790.14 0 0 -1547.21 0 1410.18 0 0 0 0 0 0 0 
0 -531.404 2211.91 0 2425.38 1144.22 0 0 0 0 -635.777 0 -660.039 2032.91 0 0 -1215.63 0 0 0 0 0 0.09 0 0 -658.666 0 0 0 0 0 0 2006.21 0 0 0 0 
0 445.036 0 0 985.214 0 0 0 2441.1 0 0 -263.298 0 0 0 0 588.015 0 0 2394.56 1177.02 0 0 0.08 0 0 0 0 0 0 2020.55 0 0 0 0 0 0 
-577.029 0 0 0 0 0 0 0 0 0 0 153.584 0 0 -1870.25 825.449 0 0 0 0 0 2408.6 0 0 0.03 0 0 0 0 0 0 0 604.19 0 0 0 0 
0 0 0 0 0 0 0 0 1128.35 0 0 0 0 1986.83 0 0 0 0 0 0 0 0 -100.94 0 0 0.05 -2020.1 0 0 0 0 0 0 0 0 0 0 
0 1427.58 0 0 0 0 0 0 0 0 0 0 0 0 0 0 -1266.44 0 0 0 0 0 0 0 0 1354.79 0.05 0 0 0 0 0 0 0 0 0 -798.746 
0 0 0 0 2163.84 0 0 0 0 0 0 -1535.31 0 0 0 0 0 0 0 -1967.6 0 994.369 0 0 0 0 0 0.05 0 0 0 0 0 0 0 0 0 
0 0 0 0 0 0 0 0 0 0 0 891.369 0 0 0 0 0 0 1187.25 0 0 0 0 0 0 0 0 0 0.02 0 0 0 0 0 0 0 -1681.8 
0 -425.81 0 0 0 0 0 0 0 0 0 0 0 0 0 1912.21 0 0 0 0 0 1701.33 0 0 0 0 0 0 0 0 0 0 0 0 0 0 0 
0 1746.35 0 0 1102.56 0 0 0 0 0 0 0 0 0 0 458.617 0 0 0 0 0 0 0 -1111.41 0 0 0 0 0 0 0.09 0 0 0 -527.436 -1182.82 0 
0 0 0 0 1793.34 0 0 0 2260.58 0 0 0 0 0 0 0 0 888.775 0 0 0 0 0 0 0 0 0 0 0 0 0 0.09 0 0 0 2437.44 0 
0 0 0 0 0 0 0 0 -751.442 0 0 0 0 0 0 0 0 0 0 0 0 0 1224.78 0 1865.67 0 0 0 0 0 0 0 0.05 0 0 0 0 
0 0 -718.177 0 0 0 2129.35 0 2116.53 0 0 0 0 0 0 0 0 0 0 0 0 0 0 0 0 0 0 0 0 0 0 0 0 0.05 0 0 0 
0 0 0 0 0 0 0 0 0 0 0 0 0 0 0 0 0 0 0 0 0 0 0 0 0 0 0 0 0 0 1151.23 0 0 0 0.04 0 0 
0 0 0 0 0 -402.768 0 0 0 0 0 0 0 0 0 0 0 0 0 1723.46 0 0 0 0 0 0 0 0 0 0 600.986 16.0985 0 0 0 0.02 0 
0 0 0 0 0 0 0 0 0 0 0 0 0 0 0 0 0 1596.65 0 1201.59 0 0 0 0 0 0 1206.93 0 1285.21 0 0 0 0 0 0 0 0.07 
