*Vertices 45
*Matrix 
0.03 0 0 -1771.07 -79.4244 -411.313 0 124.744 883.74 0 0 0 422.452 0 0 0 1903.52 954.695 0 0 0 0 0 0 0 0 0 0 785.318 0 0 0 0 0 0 0 0 67.5222 0 0 0 0 0 0 0 
0 0.05 0 0 1760.84 2155.6 0 0 0 0 1130.48 -1864.45 0 0 915.326 0 1959.36 0 0 -775.704 0 0 0 0 0 1484.19 0 0 1443.91 0 2164.75 0 0 0 0 0 2430.72 0 97.8881 -1597.87 0 0 0 805.765 0 
0 0 0.01 -1224.33 0 0 0 0 0 0 0 0 -222.709 0 1074.48 0 0 0 775.246 0 0 -1450.93 1250.27 0 0 -1030.84 0 0 0 0 1090.96 0 0 0 0 0 -953.932 0 -226.218 2222.74 0 0 0 2127.98 0 
2296.14 0 909.528 0.06 0 0 -566.5 0 0 0 544.984 2220.6 0 1276.97 0 0 2262.26 -606.784 0 0 0 0 0 0 0 0 0 0 0 0 117.725 0 2016.43 -205.313 0 0 0 2223.96 0 1809.67 0 0 0 0 0 
-2035.97 881.146 0 0 0.07 0 873.516 0 0 1765.72 0 0 0 0 0 0 0 0 0 0 0 0 0 0 0 0 0 0 0 0 0 0 0 0 -1225.55 0 0 0 1888.56 0 241.02 0 0 -52.7207 0 
1005.05 973.159 0 0 0 0.06 0 0 0 0 0 279.626 0 0 0 1416.29 1582.77 2064.04 0 0 0 0 499.512 0 0 -1676.61 2119.59 0 2069.69 0 0 1145.89 0 0 0 0 0 0 0 0 0 0 0 -373.012 0 
0 0 0 2187.8 -82.4763 0 0.01 0 0 0 0 0 0 0 0 0 0 -1314.81 0 0 133.137 0 1696.3 0 0 0 0 0 1600.92 0 0 0 0 -641.423 0 0 -579.623 596.561 0 1539.12 -2407.53 0 0 0 2163.53 
2286.83 0 0 0 0 0 0 0.04 1936.78 0 0 0 0 0 0 -1020.77 0 1408.51 0 0 1279.56 -2219.23 0 0 0 564.974 0 0 0 0 -1120.26 0 1659.37 0 0 -1569.34 0 -979.415 0 0 0 0 0 0 0 
-979.72 0 0 0 0 0 0 -457.854 0.09 0 0 0 0 0 0 0 0 0 0 0 0 -1070.51 2369.53 0 1787.85 0 0 0 0 0 1726.36 862.529 1296.2 0 0 0 0 -1397.06 -708.716 434.355 0 0 0 0 0 
0 0 0 0 839.946 0 0 0 0 0 0 0 0 0 1668.83 0 0 -770.516 104.907 0 0 0 0 0 575.198 1153.52 0 0 -1540.35 0 0 0 0 0 0 0 0 0 76.6778 0 0 0 0 0 0 
0 -766.701 0 -1911.91 0 0 0 0 0 0 0.07 0 0 911.359 -1986.98 0 0 0 0 0 0 2187.19 0 0 1058.92 0 0 0 2493.74 -28.6111 -1678.59 0 0 0 0 2416.23 0 0 1837.29 0 0 0 0 0 0 
0 1149.86 0 991.165 0 -2423.86 0 0 0 0 0 0.08 0 -805.307 1819.44 521.638 990.707 0 0 -185.476 -1303.98 0 0 0 0 0 0 0 0 0 0 2328.64 0 0 0 0 0 -1640.75 0 0 0 0 0 0 0 
2070.6 0 250.023 0 0 0 0 0 0 0 0 0 0 0 0 0 0 0 1670.81 0 -1282.01 0 1773.05 -2081.74 1088.37 0 0 0 0 76.22 0 0 0 0 0 0 0 0 -1243.25 1675.39 0 0 -2313.07 0 0 
0 0 0 -2224.42 0 0 0 0 0 0 2435.45 2094.26 0 0.02 0 0 0 0 0 0 0 0 0 0 -656.529 0 1515.78 380.184 2407.38 0 598.544 1556.52 0 0 0 -1474.12 0 0 0 1642.28 -1051.9 1786.17 1968.21 876.568 0 
0 -581.149 2248.38 0 0 0 0 0 0 -2136.83 -1681.49 -2159.11 0 0 0.08 0 0 0 0 0 1524.02 0 0 0 801.645 474.792 0 1726.97 94.9889 0 1788 0 0 0 0 1219.44 1876.05 0 0 0 0 0 0 0 0 
0 0 0 0 0 2158.35 0 -1636.78 0 0 0 2486.42 0 0 0 0.07 0 1069.44 0 -694.525 0 0 0 1952.65 0 -867.26 0 0 0 -3.58592 0 0 0 0 0 0 0 0 0 0 0 0 0 0 0 
2010.79 131.916 0 1314.97 0 1177.63 0 0 0 0 0 -1404.39 0 0 0 0 0.05 0 0 0 0 0 0 0 0 0 0 0 949.965 0 -2285 0 0 2374.57 0 0 0 0 0 0 0 0 0 0 0 
-1586.12 0 0 1934.95 0 -421.537 2138.97 1728.95 0 -22.5074 0 0 0 0 0 -1489.07 0 0.07 0 1960.28 0 -2425.23 0 995.743 2413.17 0 1998.28 0 0 1664.86 0 0 0 0 0 0 0 0 0 0 0 0 0 0 -1958.91 
0 0 -214.774 0 0 0 0 0 0 875.805 0 0 2474.67 0 0 0 0 0 0.01 -2123.25 0 0 0 0 0 0 0 0 -2110.13 0 -115.436 0 0 590.762 0 0 1184.8 0 0 0 0 0 0 0 0 
0 -1078.75 0 0 0 0 0 0 0 0 0 803.323 0 0 0 1644.41 0 1789.38 1073.56 0.09 0 0 0 0 0 -834.605 0 0 0 0 0 0 0 0 901.44 -1719.49 0 0 0 0 0 0 0 0 -1777.78 
0 0 0 0 0 0 -1191.21 -203.482 0 0 0 776.772 -1283.38 0 -15.6407 0 0 0 0 0 0.06 0 0 374.996 0 0 0 0 0 2201.83 2500 0 0 0 0 517.975 2317.04 0 0 0 0 0 0 0 0 
0 0 662.633 0 0 0 0 2039.17 -676.366 0 10.6052 0 0 0 0 0 0 1289.18 0 0 0 0.01 0 0 0 0 0 0 0 0 560.701 0 0 0 0 0 0 817.362 0 0 0 -99.5666 0 0 0 
0 0 -780.282 0 0 122.456 330.897 0 324.03 0 0 0 -660.192 0 0 0 0 0 0 0 0 0 0 732.978 0 0 2014.91 0 0 0 0 53.3311 0 -1511.2 -174.642 161.519 0 0 1374.32 0 0 0 0 0 0 
0 0 0 0 0 0 0 0 0 0 0 0 2369.08 0 0 320.826 0 2084.8 0 0 1965.93 0 1180.99 0.04 0 0 0 0 -540.712 -172.353 0 0 2032.3 0 -2210.99 0 0 0 14.7252 -1213.03 0 0 0 0 0 
0 0 0 0 0 0 0 0 2108.29 -1844.77 -140.767 0 1192.89 2380.83 299.463 0 0 2441.1 0 0 0 0 0 0 0.01 0 0 0 0 1988.66 0 0 0 0 -1752.91 0 0 808.817 -2396.39 0 0 0 0 0 0 
0 -2178.49 1818.83 0 0 -1779.15 0 -1127.74 0 1439.48 0 0 0 0 1544.47 1266.14 0 0 0 -732.063 0 0 0 0 0 0 -1093.25 -1332.51 0 0 0 761.971 1598.33 0 0 0 0 0 2301.17 0 0 0 0 0 0 
0 0 0 0 0 2213.89 0 0 0 0 0 0 0 -399.258 0 0 0 2088.92 0 0 0 0 1431.24 0 0 -2287.13 0.08 0 0 0 0 609.684 0 0 -1512.73 0 0 0 0 0 0 0 0 0 0 
0 0 0 0 0 0 0 0 0 0 0 0 0 1389.13 -727.18 0 0 0 0 0 0 0 0 0 0 2369.84 0 0.07 0 0 0 0 0 0 0 -1132.31 2226.55 0 0 1262.93 0 0 0 0 0 
1631.9 250.328 0 0 0 1653.42 -2066.79 0 0 -662.786 582.369 0 0 -447.935 -1333.58 0 -2071.98 0 2211.91 0 0 0 0 -2393.49 0 0 0 0 0.01 0 0 0 -1376.16 0 1874.83 -548.952 2387.84 0 0 1501.28 -544.679 0 0 0 0 
0 0 0 0 0 0 0 0 0 0 -649.815 0 -1626.71 0 0 1530.88 0 1423.46 0 0 1581.09 0 0 2272.64 11.6733 0 0 0 0 0 77.8985 0 0 0 0 685.522 0 1313.9 0 0 0 0 0 0 0 
0 890.606 1060.75 -2473.14 0 0 0 -1601.99 209.281 0 -1128.5 0 0 1284.75 -638.371 0 78.3563 0 1307.18 0 2287.74 1907.18 0 0 0 0 0 0 0 -1446.35 0.01 0 0 -511.261 2373.81 0 0 2446.59 0 0 226.829 1191.06 905.713 -130.39 0 
0 0 0 0 0 641.575 0 0 177.389 0 0 8.01111 0 -1090.5 0 0 0 0 0 0 0 0 -486.084 0 0 319.91 -461.821 0 0 0 0 0.07 0 0 0 995.59 1808.91 0 734.657 0 0 0 0 0 0 
0 0 0 -1055.71 0 0 0 1271.63 -1385.77 0 0 0 0 0 0 0 0 0 0 0 0 0 0 1350.22 0 -524.537 0 0 906.323 0 0 0 0 0 2292.63 0 0 0 0 0 1697.82 1946.09 2454.22 0 0 
0 0 0 -404.904 0 0 -512.635 0 0 0 0 0 0 0 0 0 2031.08 0 1732.61 0 0 0 186.544 0 0 0 0 0 0 0 747.932 0 0 0 0 0 0 0 0 0 0 0 0 0 0 
0 0 0 0 2277.98 0 0 0 0 0 0 0 0 0 0 0 0 0 0 -125.202 0 0 361.415 2007.74 -1151.69 0 1729.71 0 1833.93 0 -1559.27 0 -2106.01 0 0.04 0 0 0 0 0 0 0 0 0 0 
0 0 0 0 0 0 0 1453.98 0 0 2121.72 0 0 1121.63 472.045 0 0 0 0 2317.19 624.485 0 848.186 0 0 0 0 -847.575 1237.3 585.269 0 1320.46 0 0 0 0.04 0 0 0 0 0 0 0 29.5267 1933.27 
0 -2213.74 -891.369 0 0 0 1760.08 0 0 0 0 0 0 0 1847.51 0 0 0 -1467.56 0 2383.11 0 0 0 0 0 0 -1906.11 2245.48 0 0 1238.36 0 0 0 0 0.08 0 0 1142.99 0 0 0 0 0 
405.057 0 0 1578.19 0 0 -1260.34 755.257 -281.61 0 0 -810.495 0 0 0 0 0 0 0 0 0 1460.84 0 0 1247.83 0 0 0 0 1557.89 191.122 0 0 0 0 0 0 0.09 0 0 0 0 0 0 0 
0 -627.384 2180.78 0 -1766.18 0 0 0 2472.38 836.894 -1255 0 -1803.42 0 0 0 0 0 0 0 0 0 759.377 -701.392 707.801 726.875 0 0 0 0 0 2257.68 0 0 0 0 0 0 0.05 310.144 0 0 0 0 0 
0 -1420.26 1313.59 694.678 0 0 2269.28 0 -775.399 0 0 0 486.999 443.663 0 0 0 0 0 0 0 0 0 826.212 0 0 0 809.732 2291.71 0 0 0 0 0 0 0 1688.82 0 1829.66 0.02 0 0 0 0 0 
0 0 0 0 2489.01 0 -485.473 0 0 0 0 0 0 -1638.77 0 0 0 0 0 0 0 0 0 0 0 0 0 0 427.183 0 2472.53 0 -137.257 0 0 0 0 0 0 0 0.09 0 0 0 0 
0 0 0 0 0 0 0 0 0 0 0 0 0 847.575 0 0 0 0 0 0 0 2157.89 0 0 0 0 0 0 0 0 -2047.87 0 -391.781 0 0 0 0 0 0 0 0 0.05 1776.86 0 0 
0 0 0 0 0 0 0 0 0 0 0 0 -123.829 839.03 0 0 0 0 0 0 0 0 0 0 0 0 0 0 0 0 -1056.78 0 1975.23 0 0 0 0 0 0 0 0 1993.85 0.02 0 0 
0 2048.33 1403.62 0 -1341.98 1539.89 0 0 0 0 0 0 0 2172.38 0 0 0 0 0 0 0 0 0 0 0 0 0 0 0 0 -1797.16 0 0 0 0 2153.77 0 0 0 0 0 0 0 0.03 0 
0 0 0 0 0 0 2394.1 0 0 0 0 0 0 0 0 0 0 -150.533 0 2129.66 0 0 0 0 0 0 0 0 0 0 0 0 0 0 0 -1949.29 0 0 0 0 0 0 0 0 0.03 
