*Vertices 60
*Matrix 
0.05 0 -1920 1325.5 0 0 0 0 0 1551.18 -2021.01 0 0 0 0 0 0 0 1478.55 0 0 0 326.624 0 0 18.54 0 647.832 0 0 681.555 0 0 0 0 -2060.53 0 0 0 0 0 1561.25 -221.488 0 0 1810.59 0 0 0 0 0 0 0 0 691.931 0 0 0 0 -102.161 
0 0.02 0 0 0 0 898.846 0 0 0 0 1636.02 1452.6 0 -940.352 0 0 -2042.99 0 0 0 0 0 0 -1669.59 0 2162.47 0 -890.912 2281.18 0 0 994.369 0 -1722.85 0 475.249 -866.497 0 0 -779.977 0 0 0 0 -645.543 1542.02 884.35 0 0 0 0 0 0 0 0 0 0 537.812 0 
626.621 0 0.04 -58.977 0 0 0 -422.452 0 0 0 0 0 418.18 0 0 0 -2428.74 -822.398 660.649 0 0 0 0 0 0 -150.685 0 0 1161.76 1105.3 0 2174.37 1119.95 912.885 0 0 0 0 0 0 0 698.035 0 0 0 0 0 0 -466.552 0 0 0 0 -2156.21 0 0 0 0 0 
1894.21 0 794.626 0.06 -259.178 -666.448 0 0 0 0 -1283.84 0 0 0 0 0 0 -1128.04 -765.023 0 0 0 1645.02 0 0 -995.285 0 0 0 0 -83.8496 0 -1143.76 1583.68 0 0 0 0 0 1794.41 375.759 0 1122.85 1992.93 0 0 -1586.73 0 0 0 0 0 1931.29 0 -2448.88 0 -839.488 0 0 0 
0 0 0 2486.42 0.05 231.101 0 0 1275.29 0 0 0 0 0 1111.71 0 0 0 0 0 -914.563 0 1693.24 2403.1 0 1539.28 0 0 0 0 2110.28 0 488.22 617.771 0 0 0 0 0 0 1880.02 0 0 0 0 -2075.03 0 0 0 0 1402.86 0 0 445.494 0 2130.12 0 0 -1087.45 0 
0 0 0 -235.679 1670.51 0.04 0 0 0 0 0 0 0 1322.9 1994.46 0 0 0 0 0 0 0 0 0 0 -499.207 1591.31 0 0 0 0 0 -2189.93 0 2487.18 0 0 -882.519 0 0 1889.32 0 0 0 0 0 0 -1782.36 -1654.79 -183.798 0 0 2029.56 -617.161 0 0 0 0 0 0 
0 -1244.32 0 0 0 0 0.04 0 0 284.661 0 0 2213.28 0 2270.04 0 0 0 0 593.814 0 0 0 0 0 0 1571.17 2403.41 0 0 -2163.38 0 0 0 0 0 -210.501 0 0 0 0 0 208.213 0 880.078 0 0 -2226.25 0 0 0 0 0 0 -1758.4 851.085 -422.147 0 0 -798.746 
0 0 -394.833 0 0 0 0 0.06 0 -1679.36 -1486.79 0 0 81.7133 -735.725 801.187 0 0 -426.115 0 0 -204.55 1332.82 2291.86 0 0 0 0 729.316 0 0 0 -132.679 0 -864.666 0 0 2151.78 0 0 0 1193.35 0 1338.16 0 0 0 1742.07 -1310.08 0 0 0 0 0 0 0 0 0 0 0 
0 0 0 0 -550.325 0 0 0 0 0 0 0 0 0 0 0 2301.63 0 0 0 0 0 0 0 0 -879.772 0 0 0 0 0 0 0 0 2424.77 0 0 0 0 -925.55 0 -1885.51 0 0 868.633 0 0 2091.51 0 0 2274.47 0 0 0 -1427.58 -1430.48 0 0 0 0 
1705.76 0 0 0 0 0 -590.457 1884.14 0 0.06 -584.964 0 0 0 0 0 2407.68 0 0 0 -1230.74 0 0 2000.26 -970.717 0 0 0 0 -328.455 0 0 0 0 -2309.26 0 0 0 0 0 0 0 1350.06 0 2257.23 0 0 220.267 0 0 0 0 0 0 2120.66 0 2028.49 0 0 88.1222 
-818.735 0 0 360.5 0 0 0 1913.89 0 485.321 0.07 0 -1014.51 0 407.041 0 0 0 939.436 0 0 1916.79 0 1381.04 0 0 942.335 0 0 0 0 0 0 0 0 0 1165.27 0 0 0 0 0 0 0 0 0 0 0 0 -1338.47 0 -794.931 0 1771.37 0 0 0 0 0 0 
0 299.158 0 0 0 0 0 0 0 0 0 0 843.608 -750.679 0 0 0 978.652 0 0 -16.4037 0 0 0 0 0 1426.36 0 0 0 0 0 1676.31 0 0 0 0 -1927.78 0 0 -968.429 0 -760.445 0 -716.956 0 -557.497 1307.79 0 0 0 2031.54 0 0 0 0 0 0 -1070.21 0 
0 -599.612 0 0 0 0 -525.91 0 0 0 2287.59 2359.92 0.07 2279.81 -2254.78 0 1048.08 0 0 -1412.93 569.247 0 -390.408 0 -823.008 45.2437 0 0 0 0 0 0 0 1347.93 1940.14 -1128.04 0 -649.51 0 0 2307.89 0 94.8363 0 0 0 0 0 0 -36.0881 0 0 0 0 0 0 0 0 -1887.65 0 
0 0 643.254 0 0 770.363 0 2046.8 0 0 0 199.362 923.566 0.05 1368.53 0 0 0 0 -96.82 0 1525.39 0 0 0 2324.21 0 1699.96 0 -1033.13 0 0 0 0 0 0 0 0 0 2005.6 0 1269.95 0 0 0 0 0 0 0 0 0 0 0 0 0 0 0 0 0 0 
0 2093.34 0 0 1878.64 -2287.29 1213.19 -957.289 0 0 1754.59 0 751.289 971.175 0.07 -568.636 0 0 0 -569.247 0 0 0 0 0 2438.05 0 0 1315.88 0 0 0 0 626.621 0 0 0 550.935 -679.418 0 0 0 0 -2160.02 -110.096 0 0 -313.196 0 0 0 0 -1597.72 0 -1217.31 0 0 0 0 0 
0 0 0 0 0 0 0 370.418 0 0 0 0 0 0 1462.83 0 0 0 0 0 763.802 0 0 1331.9 0 0 0 0 0 1392.03 -946.455 0 0 0 -1076.92 0 0 1643.04 0 0 -801.035 0 0 1685 1708.96 0 0 -1643.35 -2308.65 0 0 0 0 0 0 0 0 0 0 0 
0 0 0 0 0 0 0 0 -787.606 -2176.05 0 0 1441.01 0 0 0 0.07 -2037.49 2389.68 -1450.62 0 0 0 0 0 1421.02 0 0 0 0 879.315 0 0 0 0 0 0 0 0 0 0 0 1511.35 0 0 0 0 0 3.28074 0 1835 0 0 0 -1591.31 -457.854 0 2088.46 0 0 
0 2357.17 1565.98 -270.775 0 0 0 0 0 0 0 859.325 0 0 0 0 614.566 0.02 0 0 0 0 933.027 0 0 0 902.966 0 0 0 0 -748.543 0 -1329.46 0 0 1603.98 0 0 0 0 -1447.11 0 0 0 0 0 0 0 0 0 0 0 0 349.361 0 0 0 0 1181.45 
-1959.97 0 1077.23 714.515 0 0 0 1180.07 0 0 -1625.95 0 0 0 0 0 62.6392 0 0.07 0 0 0 -2386.62 0 0 0 0 0 2021.93 0 0 0 1122.7 0 0 0 0 0 0 1046.71 0 0 0 0 0 521.638 0 2226.86 0 0 458.617 2434.39 0 0 -1719.95 0 -671.026 0 0 0 
0 0 2050.46 0 0 0 1821.27 0 0 0 0 0 -53.1785 -932.264 262.535 0 2464.75 0 0 0.06 0 0 0 0 0 1370.2 0 0 0 -1921.67 0 0 0 0 0 -1048.69 0 0 0 17.4718 0 2191 0 0 0 0 0 0 0 0 0 69.9637 0 0 0 0 0 0 -714.82 0 
0 0 0 0 1472.9 0 0 0 0 1078.3 0 -1664.71 -1909.62 0 0 1599.7 0 0 0 0 0.04 -582.064 0 0 0 0 0 2487.95 0 0 -2131.79 0 0 -1733.38 1482.21 1222.04 -817.209 0 0 0 0 0 -2407.53 2145.38 -1961.81 0 0 1771.52 0 2389.52 0 2396.69 0 0 0 0 0 0 0 0 
0 0 0 0 0 0 0 2297.66 0 0 1300.93 0 0 1253.93 0 0 0 0 0 0 882.672 0.06 670.263 709.632 -152.058 -1599.7 0 0 0 -460.143 1832.56 0 0 -1009.48 0 0 0 0 0 -485.015 0 0 1648.84 0 1652.04 -2326.5 0 -173.116 0 0 -2496.95 0 0 0 0 707.953 0 0 0 0 
-148.396 0 0 335.627 1275.75 0 0 -1073.56 0 0 0 0 -949.049 0 0 0 0 728.553 1066.09 0 0 1475.95 0.06 0 0 0 2075.79 588.321 0 -1272.85 1079.52 0 0 0 720.313 0 -796.304 0 0 469.909 0 1420.87 0 0 0 806.375 0 0 0 970.412 0 0 0 0 0 154.195 0 0 0 0 
0 0 0 0 -1084.4 0 0 -518.433 0 1851.48 770.058 0 0 0 0 1780.83 0 0 0 0 0 -2093.8 0 0.01 0 0 -1931.9 0 -1483.12 0 1948.84 0 0 2322.53 0 0 0 0 0 0 -2422.64 -759.987 0 0 190.664 0 0 0 0 0 0 -872.143 0 0 -87.5118 0 1718.57 0 0 0 
0 -893.963 0 0 0 0 0 0 0 1361.2 0 0 2331.69 0 0 0 0 0 0 0 0 1982.41 0 0 0.07 -2178.33 2421.41 0 -2245.02 0 0 0 0 0 0 0 0 0 0 0 0 440.611 0 1909.92 0 0 0 -1413.69 0 -694.525 271.996 0 0 0 0 0 1581.85 0 0 0 
-1076.31 0 0 2377.62 -1194.72 2425.84 0 0 2255.55 0 0 0 -1698.43 2207.33 -456.786 0 855.968 0 0 675.604 0 -1394.16 0 0 1871.47 0.09 0 0 0 0 325.556 0 0 -2228.23 0 2141.71 2088.61 0 0 0 0 0 0 1388.06 0 0 0 0 0 0 0 979.873 0 0 0 0 0 0 0 0 
0 -9.38444 2166.74 0 0 98.0407 1766.03 0 0 0 1280.94 2107.07 0 0 0 0 0 1574.22 0 0 0 0 -621.891 -1916.03 2367.09 0 0.04 0 1987.9 0 0 0 0 0 0 -1747.87 -529.115 0 46.4644 -205.466 0 -502.411 0 -2321.16 41.2763 14.2674 0 0 0 0 1169.39 0 1496.25 0 0 0 42.497 0 0 0 
-1645.02 0 0 0 0 0 -2427.21 0 0 0 0 0 0 216.758 0 0 0 0 0 0 2256.77 0 1725.14 0 0 0 0 0.09 -50.4318 0 0 0 0 -1245.54 1174.89 0 0 0 -576.266 0 0 0 0 0 0 0 0 2309.11 2175.13 0 0 0 0 0 525.758 0 0 0 0 -2331.54 
0 -1922.74 0 0 0 0 0 -183.035 0 0 0 0 0 0 -814.158 0 0 0 693.304 0 0 0 0 2060.99 2114.7 0 2448.88 -114.216 0.07 0 0 0 0 0 0 0 0 0 -948.286 0 0 0 0 1050.98 0 0 0 0 0 0 0 0 0 -231.407 0 0 38.9874 0 0 0 
0 1878.19 -1727.12 0 0 0 0 0 0 2020.71 0 0 0 -675.298 0 2116.08 0 0 0 -391.934 0 -521.79 718.329 0 0 0 0 0 0 0.07 -1495.03 0 0 -1111.41 1554.38 0 0 0 0 -118.183 0 0 -1142.38 0 0 0 2072.74 0 0 0 0 0 0 0 0 555.666 0 0 0 0 
-941.42 0 766.854 664.617 -1330.99 0 -730.995 0 0 0 0 0 0 0 0 -842.997 -339.29 0 0 0 407.193 -2243.49 291.528 451.14 0 2420.35 0 0 0 490.814 0.08 0 0 0 0 1631.44 0 0 0 0 0 0 603.885 0 630.284 -533.54 0 0 0 0 1829.81 0 0 0 0 0 960.799 0 0 0 
0 0 0 0 0 0 0 0 0 0 0 0 0 0 0 0 0 2156.51 0 0 0 0 0 0 0 0 0 0 0 0 0 0.06 0 0 0 -1112.02 0 0 1168.78 0 985.214 2122.03 194.632 0 0 0 0 1928.85 0 0 206.534 0 0 0 0 0 0 0 0 0 
0 1963.33 -130.39 -1368.37 -318.384 2436.06 0 1741.46 0 0 0 940.504 0 0 0 0 0 0 96.3622 0 0 0 0 0 0 0 0 0 0 0 0 0 0.05 0 590.915 0 0 -156.636 -1994.46 -1353.57 0 0 0 0 0 0 0 1098.74 0 0 0 0 2137.44 0 0 2340.08 0 0 1411.86 0 
0 0 1107.29 693.609 -296.716 0 0 0 0 0 0 0 803.018 0 -1329.77 0 0 288.324 0 0 898.083 2217.4 0 -1460.23 0 2074.27 0 545.595 0 290.155 0 0 0 0.02 -1091.57 0 0 0 0 0 0 0 0 -1904.43 0 0 0 0 0 0 0 0 -223.319 1408.51 2045.58 0 0 0 0 0 
0 -1385.92 -1414.3 0 0 907.392 0 454.955 1759.47 503.174 0 0 -72.8629 0 0 -2417.29 0 0 0 0 934.706 0 1783.58 0 0 0 0 1943.04 0 1466.64 0 0 1435.21 1752.91 0.09 0 1554.84 -2394.25 0 -1976 0 -1894.51 -296.258 0 0 0 0 1531.19 0 0 0 1962.87 0 0 888.012 0 0 0 0 0 
-553.224 0 0 0 0 0 0 0 0 0 0 0 -2320.86 0 0 0 0 0 0 1098.44 -594.577 0 0 0 0 -2026.96 1827.83 0 0 0 788.064 305.567 0 0 0 0.06 1941.21 0 -1416.75 0 0 0 0 0 1179.01 1901.53 0 0 2137.59 0 0 0 0 0 0 2048.78 0 0 1587.8 0 
0 1171.83 0 0 0 0 1931.75 0 0 0 -581.149 0 0 0 0 0 0 692.999 0 0 -86.9015 0 -1087.76 0 0 366.604 -1006.42 0 0 0 0 0 0 0 755.867 -486.236 0.08 0 -725.501 0 -770.363 0 -829.722 0 0 -1329.62 0 2185.05 1533.78 0 -1803.11 0 1667.61 0 0 0 0 0 0 0 
0 2225.79 0 0 0 -917.92 0 268.181 0 0 0 691.321 1332.21 0 2221.98 -50.2792 0 0 0 0 0 0 0 0 0 0 0 0 0 0 0 0 -1952.19 0 -1348.99 0 0 0.06 0 0 0 0 0 0 0 0 0 172.506 -728.248 0 -777.535 1236.38 0 0 0 0 252.77 0 0 0 
0 0 0 0 0 0 0 0 0 0 0 0 0 0 2358.85 0 0 0 0 0 0 0 0 0 0 0 -821.787 1712.93 1273.46 0 0 1831.8 -1202.66 0 0 662.938 1838.82 0 0.06 0 0 0 0 0 0 -2478.64 0 0 -812.174 1950.97 0 0 574.74 0 0 0 1470.92 0 0 0 
0 0 0 458.922 0 0 0 0 -1530.43 0 0 0 0 822.55 0 0 0 0 -1732.76 503.174 0 -426.572 -1560.18 0 0 0 620.67 0 0 2085.56 0 0 1338.01 0 -82.6289 0 0 0 0 0.04 0 0 0 1893.9 0 0 1144.83 0 0 0 -163.198 0 0 0 -126.27 409.94 608.158 0 0 0 
0 1028.09 0 -1682.41 -570.162 2098.22 0 0 0 0 0 1200.22 1314.81 0 0 1702.86 0 0 0 0 0 0 0 -541.932 0 0 0 0 0 0 0 -1667.46 0 0 0 0 -894.574 0 0 0 0.04 -688.879 0 0 2108.14 0 0 1927.78 0 -2366.33 0 0 0 0 0 0 0 0 0 0 
2315.52 0 0 0 0 0 0 -2495.73 -528.504 0 0 0 0 -1529.51 0 0 0 1075.7 0 -459.838 0 0 1840.65 783.029 986.435 0 1743.14 0 0 0 0 -1415.07 0 0 898.083 0 0 0 0 0 -64.9281 0.08 0 0 1817.45 0 312.281 1357.23 0 0 945.387 -2041.31 -2201.07 0 937.605 0 0 0 0 0 
1810.74 0 1299.1 1342.59 0 0 2234.03 0 0 1668.68 0 742.439 1788.31 0 0 0 -1516.69 0 0 0 1828.75 1577.12 0 0 0 0 0 0 0 508.362 -597.171 1545.99 0 0 2466.73 0 -1017.26 0 0 0 0 0 0.08 1941.36 0 0 -1083.03 0 0 0 0 0 0 1838.82 1067.61 0 0 0 0 0 
0 0 0 -176.168 0 0 0 -1411.71 0 0 0 0 0 0 -352.26 -902.509 0 0 0 0 -1144.52 0 0 0 1989.58 1019.09 -1414.76 0 48.1429 0 0 0 0 1084.55 0 0 0 0 0 56.6881 0 0 760.598 0.03 -876.263 0 -1988.66 0 1835.92 1761.91 0 1987.29 0 0 0 0 -870.617 0 0 1143.45 
0 0 0 0 0 0 13.9622 0 -1070.36 -368.74 0 -1881.08 0 0 270.623 -359.127 0 0 0 0 114.673 2149.65 0 -2331.23 0 0 1127.43 0 0 0 987.045 0 0 0 0 1242.79 0 0 0 0 -1444.82 1035.57 0 -963.24 0.08 131.306 0 0 990.555 2138.81 -870.769 131.611 0 0 0 0 0 0 0 1627.32 
949.202 2269.43 0 0 152.058 0 0 0 0 0 0 0 0 0 0 0 0 0 834.91 0 0 2068.32 826.975 0 0 0 596.255 0 0 0 792.184 0 0 0 0 -2325.43 1498.69 0 1311.76 0 0 0 0 0 -2418.21 0.02 0 0 0 0 0 0 2314.29 0 0 0 0 0 0 0 
0 68.7429 0 -512.787 0 0 0 0 0 0 0 1559.27 0 0 0 0 0 0 0 0 0 0 0 0 0 0 0 0 0 1573.92 0 0 0 0 0 0 0 0 0 2079.45 0 -1030.69 1160.7 1026.41 0 0 0.03 0 1736.73 0 -1943.8 0 -966.14 0 -579.165 0 451.75 0 -1803.72 0 
0 620.67 0 0 0 638.066 1669.29 -619.755 933.638 802.408 0 162.74 0 0 2003.01 1838.21 0 0 2073.35 0 -2290.8 -818.583 0 0 1677.83 0 0 669.042 0 0 0 744.423 -244.224 0 473.571 0 504.7 280.389 0 0 1918.47 -1742.07 0 0 0 0 0 0.05 0 0 0 766.701 -1502.2 0 0 0 0 0 0 0 
0 0 0 0 0 535.676 0 2345.12 0 0 0 0 0 0 0 598.392 2203.67 0 0 0 0 0 0 0 0 0 0 2192.37 0 0 0 0 0 0 0 2219.84 1147.88 -2306.05 -2470.55 0 0 0 0 -643.864 -2108.75 0 1878.34 0 0.08 0 -1172.29 -1919.69 1726.81 0 0 0 -1677.83 -211.264 0 0 
0 0 1182.21 0 0 2371.52 0 0 0 0 971.023 0 2253.41 0 0 0 0 0 0 0 -329.676 0 -1840.34 0 1021.99 0 0 0 0 0 0 0 0 0 0 0 0 0 -1787.7 0 215.995 0 0 -949.965 546.51 0 0 0 0 0.02 0 0 0 -1101.18 0 -10.3 -1045.18 0 0 0 
0 0 0 0 598.544 0 0 0 2225.49 0 0 0 0 0 0 0 -111.164 0 534.455 0 0 1961.04 0 0 2230.98 0 -158.925 0 0 0 1385.31 -413.297 0 0 0 0 -378.811 1983.32 0 466.247 0 1076.31 0 0 -2196.49 0 1454.74 0 -390.103 0 0.05 0 0 -509.278 0 0 0 -1036.03 0 0 
0 0 0 0 0 0 0 0 0 0 -1138.26 2123.55 0 0 0 0 0 0 469.756 446.867 1179.16 0 0 -476.928 0 -1726.97 0 0 0 0 0 0 0 0 1649.75 0 0 2182.3 0 0 0 -1827.83 0 -2422.94 44.7859 0 0 763.649 510.956 0 0 0.02 2018.57 1041.22 -1044.11 -1814.71 0 2286.37 0 -1525.7 
0 0 0 2109.21 0 -1374.94 0 0 0 0 0 0 0 0 1204.34 0 0 0 0 0 0 0 0 0 0 0 624.18 0 0 0 0 0 729.164 -2223.2 0 0 1710.03 0 2363.73 0 0 -694.678 0 0 0 213.858 -1323.05 2375.94 -1832.41 0 0 1851.33 0 0 0 0 0 0 0 0 
0 0 0 0 1206.02 -178.304 0 0 0 0 -180.593 0 0 0 0 0 0 0 0 0 0 0 0 0 0 0 0 0 -1258.35 0 0 0 0 1119.19 0 0 0 0 0 0 0 0 1653.26 0 0 0 0 0 0 573.672 -2075.64 1978.29 0 0.07 -1508.91 0 0 0 0 154.805 
2487.49 0 2132.86 -1278.8 0 0 -1532.41 0 572.146 -2133.32 0 0 0 0 2366.18 0 51.5 1099.2 -526.673 0 0 0 0 -946.455 0 0 0 971.023 0 0 0 0 0 -84.3074 555.818 0 0 0 0 1311.91 0 -2100.21 2476.96 0 0 0 374.538 0 0 0 0 1295.74 0 1700.72 0.04 -2045.88 0 -729.621 705.206 0 
0 0 0 0 1173.21 0 -1943.49 0 -778.756 0 0 0 0 0 0 0 -718.482 0 0 0 0 1412.47 -678.35 0 0 0 0 0 0 2298.73 0 0 -206.381 0 0 659.886 0 0 0 1780.83 0 0 0 0 0 0 0 0 0 1853.31 0 -340.358 0 0 -1502.04 0.04 0 0 0 0 
0 0 0 -403.531 0 0 1976.91 0 0 2209.77 0 0 0 0 0 0 0 0 -466.094 0 0 0 0 134.968 1900.16 0 -374.081 0 -1641.21 0 616.855 0 0 0 0 0 0 1696.14 -127.033 218.436 0 0 0 476.012 0 0 2167.96 0 -15.6407 -2368.47 0 0 0 0 0 0 0.05 0 0 -544.221 
0 0 0 0 0 0 0 0 0 0 0 0 0 0 0 0 1206.02 0 0 0 0 0 0 0 0 0 0 0 0 0 0 0 0 0 0 0 0 0 0 0 0 0 0 0 0 0 0 0 1591.62 0 -1753.52 -1793.95 0 0 1780.68 0 0 0.05 0 0 
0 -1834.09 0 0 1198.39 0 0 0 0 0 0 2412.72 1719.95 0 0 0 0 0 0 432.371 0 0 0 0 0 0 0 0 0 0 0 0 1786.02 0 0 2232.96 0 0 0 0 0 0 0 0 0 0 -1299.4 0 0 0 0 0 0 0 1859.26 0 0 0 0.04 0 
1090.81 0 0 0 0 0 1522.95 0 0 1206.93 0 0 0 0 0 0 0 -2449.49 0 0 0 0 0 0 0 0 0 -1774.42 0 0 0 0 0 0 0 0 0 0 0 0 0 0 0 -1878.34 2210.84 0 0 0 0 0 0 1041.67 0 -1845.99 0 0 1221.88 0 0 0.06 
