*Vertices 56
*Matrix 
0.02 0 0 0 0 0 0 0 0 0 0 0 0 0 0 0 0 0 0 2247.76 0 0 0 0 0 0 0 0 -1795.02 -1091.57 0 0 1057.08 0 0 0 0 0 0 0 0 0 0 0 0 0 0 1623.97 0 0 0 0 0 0 0 0 
0 0.05 -1733.07 0 0 459.227 0 0 0 0 0 0 0 0 0 0 302.057 0 0 0 0 0 813.089 0 1729.87 0 0 0 0 0 0 0 0 0 0 0 0 0 0 0 0 0 -275.201 0 0 0 0 2164.3 0 0 0 0 0 0 0 0 
0 -1773.81 0.07 0 912.275 0 0 -1103.93 0 0 0 0 0 0 0 -404.904 0 0 -413.907 0 0 0 -387.814 0 0 0 0 0 0 0 0 -1440.09 0 1858.65 0 0 702.765 0 0 0 0 0 1330.99 -28.1533 0 0 0 0 1049.3 0 909.986 2277.83 0 0 0 0 
0 0 0 0.06 0 0 2449.34 0 0 0 -93.6155 0 0 0 -2050.31 0 0 0 0 0 0 0 0 0 0 0 938.673 0 0 712.836 0 0 0 2237.08 0 0 0 0 0 0 -105.365 0 2304.68 0 0 0 1271.63 0 0 0 0 0 0 0 0 0 
0 0 357.906 0 0.08 0 0 0 0 0 0 1309.47 0 0 0 0 0 1674.78 0 0 1649.14 0 0 0 0 0 0 0 2179.4 517.823 0 0 0 0 0 0 0 0 0 0 1496.7 0 111.164 0 0 0 0 0 0 0 0 0 0 0 0 0 
0 -1422.39 0 0 0 0.09 0 214.621 0 0 -1237.91 0 0 -1101.03 0 0 0 0 0 1815.32 0 0 59.4348 0 0 0 1692.79 0 0 0 0 0 0 0 0 0 0 0 0 0 0 525.3 0 0 0 0 0 0 0 0 0 0 0 0 0 0 
0 0 0 1137.65 0 0 0.09 0 0 349.666 0 0 0 692.999 78.9666 0 -444.578 0 0 0 0 0 0 0 0 0 0 0 0 0 0 0 0 0 0 309.076 0 0 0 0 0 396.512 0 -1273.77 0 0 0 0 0 0 0 0 0 0 0 0 
0 0 1627.48 0 0 -602.512 0 0 0 0 1355.25 0 0 0 0 0 0 0 0 0 750.374 0 0 0 0 0 0 0 0 0 0 0 0 0 0 0 0 0 0 0 0 0 1192.43 0 0 1339.23 0 0 -1660.13 0 0 0 0 0 0 -457.701 
0 0 0 0 0 0 0 0 0.03 2361.29 0 0 0 0 -823.618 0 0 0 0 0 0 0 980.483 0 0 0 0 0 0 0 0 0 0 0 0 -1613.9 0 -144.429 0 0 0 0 0 -191.122 476.012 0 0 0 0 0 0 0 0 0 0 0 
0 0 0 0 0 0 1144.37 0 1400.27 0.08 0 -246.513 0 2107.99 0 0 0 0 0 0 0 0 0 0 0 579.012 0 0 0 0 0 0 0 0 0 -439.39 0 0 0 0 0 0 0 0 0 0 0 -2236.63 2266.84 0 2357.02 2141.87 0 0 0 0 
0 0 0 2174.98 0 20.6763 0 -645.085 0 0 0.06 74.6941 0 0 0 0 -377.285 0 0 0 0 0 0 0 0 0 1334.8 0 0 0 0 0 0 0 0 0 0 0 0 0 0 0 0 0 0 0 0 0 0 -210.196 0 0 0 0 0 0 
0 0 0 0 2225.94 0 0 0 0 -1608.1 1446.65 0.01 594.729 835.826 0 0 2408.29 0 0 0 0 0 0 0 0 0 0 1107.44 0 0 0 0 0 0 0 0 0 0 0 1771.22 0 0 0 0 0 0 0 0 -2131.79 -510.346 0 0 0 0.381481 -2130.42 0 
0 0 0 0 0 0 0 0 0 0 0 1931.75 0.07 0 0 0 0 2217.4 0 0 0 0 -229.728 2293.54 0 0 0 0 0 0 -2091.81 0 0 0 0 0 0 0 -707.801 0 0 0 424.894 0 0 0 0 0 0 -938.978 0 0 127.338 0 0 0 
0 0 0 0 0 1208.91 -1916.49 0 0 1878.95 0 718.482 0 0.01 0 0 0 0 0 0 0 0 0 0 0 0 0 0 0 0 0 0 0 0 0 0 0 0 0 0 0 0 0 0 0 0 2161.7 0 0 0 0 0 0 0 0 0 
0 0 0 -1990.04 0 0 908.46 0 1490.75 0 0 0 0 0 0.04 0 2351.99 0 1245.84 0 0 0 0 0 0 0 0 0 0 -1300.01 0 0 0 0 0 0 2154.53 0 0 0 0 0 0 0 0 0 0 0 0 0 0 0 0 0 0 0 
0 0 -205.771 0 0 0 0 0 0 0 0 0 0 0 0 0.01 0 0 0 0 0 0 0 0 0 0 0 0 0 0 0 0 0 0 0 0 0 0 0 0 0 0 0 0 0 0 0 1135.82 0 0 0 0 0 0 0 0 
0 1383.18 0 0 0 0 1372.34 0 0 0 1821.27 2021.77 0 0 1751.84 0 0.03 0 0 0 0 0 0 0 0 134.053 1159.17 0 0 0 0 0 0 0 0 0 0 0 0 -2382.96 0 0 0 0 0 0 0 409.94 0 0 0 0 890.301 0 0 0 
0 0 0 0 161.214 0 0 0 0 0 0 0 -1899.24 0 0 0 0 0.04 0 0 0 2383.57 0 0 0 0 0 2254.02 0 0 0 0 0 0 -1171.38 0 0 0 0 0 0 0 0 0 0 0 0 0 0 156.178 1395.08 0 0 0 0 0 
0 0 872.295 0 0 0 0 0 0 0 0 0 0 0 2197.1 0 0 0 0.03 0 738.319 0 0 0 0 0 0 855.51 0 0 0 0 0 0 0 0 0 0 0 0 0 0 0 0 583.285 517.06 0 0 0 0 0 0 0 0 0 0 
703.986 0 0 0 0 -297.479 0 0 0 0 0 0 0 0 0 0 0 0 0 0.06 0 0 0 0 0 0 0 0 626.164 0 0 0 0 1948.38 0 0 0 806.07 1417.05 0 0 -2020.25 -1728.19 0 0 0 0 0 0 1396.45 0 0 1664.4 0 0 0 
0 0 0 0 2082.05 0 0 1952.35 0 0 0 0 0 0 0 0 0 0 -1572.24 0 0.06 0 0 0 1452.76 0 0 0 0 0 0 0 0 0 0 0 0 0 0 0 0 0 0 0 0 0 0 0 0 0 0 0 1394.16 0 0 0 
0 0 0 0 0 0 0 0 0 0 0 0 0 0 0 0 0 2395.32 0 0 0 0.04 0 0 0 0 0 0 0 0 0 564.058 0 2391.35 0 0 0 0 0 0 1414 0 0 2281.95 0 0 -1952.8 0 1251.95 0 0 0 869.701 0 0 0 
0 -370.724 -83.3918 0 0 1171.83 0 0 1157.34 0 0 0 529.115 0 0 0 0 0 0 0 0 0 0.04 0 0 1410.49 -2261.35 0 0 0 0 -691.321 0 0 0 -1296.04 0 0 0 0 0 0 0 0 0 1879.41 0 0 0 -1827.98 2379.91 0 0 0 0 0 
0 0 0 0 0 0 0 0 0 0 0 0 273.675 0 0 0 0 0 0 0 0 0 0 0.08 2316.43 0 0 0 0 0 0 0 0 0 0 0 0 0 0 0 0 -1302.61 0 0 0 0 0 0 0 0 0 0 0 0 0 0 
0 -47.38 0 0 0 0 0 0 0 0 0 0 0 0 0 0 0 0 0 0 -382.778 0 0 1731.24 0 0 35.6304 0 0 0 0 0 0 0 1338.77 0 0 0 0 0 0 0 0 0 0 -2100.97 0 0 1512.73 0 0 0 0 0 0 0 
0 0 0 0 0 0 0 0 0 1794.11 0 0 0 0 0 0 2261.19 0 0 0 0 0 1877.27 0 0 0.03 0 0 0 0 1096.15 0 0 0 0 2490.08 0 0 0 -1557.89 0 0 0 0 0 0 0 0 0 0 0 0 0 0 0 0 
0 0 0 2033.98 0 844.371 0 0 0 0 1457.18 0 0 0 0 0 1733.53 0 0 0 0 0 2463.38 0 -791.726 0 0.06 0 0 0 0 0 0 0 0 0 0 0 0 0 0 0 0 0 0 0 0 0 0 0 0 0 0 0 0 0 
0 0 0 0 0 0 0 0 0 0 0 1485.11 0 0 0 0 0 -219.047 1012.99 0 0 0 0 0 0 0 0 0.03 0 0 0 0 0 0 0 0 0 0 0 0 0 2127.22 0 0 0 0 0 0 0 0 0 0 0 0 0 0 
-1470 0 0 0 2426.76 0 0 0 0 0 0 0 0 0 0 0 0 0 0 -2116.69 0 0 0 0 0 0 0 0 0.06 0 0 2098.68 424.894 0 0 0 0 0 1452.45 0 0 0 0 2422.48 -2325.74 0 0 0 0 0 0 0 0 0 0 0 
2377.77 0 0 958.052 -2488.71 0 0 0 0 0 0 0 0 0 2396.39 0 0 0 0 0 0 0 0 0 0 0 0 0 0 0.07 0 0 0 0 0 0 0 0 0 0 0 0 213.706 0 0 0 0 0 -1500.67 1465.12 0 0 0 0 0 0 
0 0 0 0 0 0 0 0 0 0 0 0 -2324.06 0 0 0 0 0 0 0 0 0 0 0 0 -1580.78 0 0 0 0 0.02 295.495 1361.35 0 0 0 0 0 0 0 0 0 347.377 0 0 0 2357.17 0 0 0 0 0 0 0 0 0 
0 0 2324.67 0 0 0 0 0 0 0 0 0 0 0 0 0 0 0 0 0 0 1284.14 -2437.89 0 0 0 0 0 1773.81 0 669.5 0.09 0 0 0 300.989 0 0 0 0 0 0 -868.48 0 0 0 0 0 1004.59 0 0 -173.727 0 0 0 0 
1279.11 0 0 0 0 0 0 0 0 0 0 0 0 0 0 0 0 0 0 0 0 0 0 0 0 0 0 0 -1622.59 0 -2480.77 0 0.02 0 0 1779.92 0 0 846.965 0 0 0 0 2273.25 0 0 0 0 0 0 2248.53 0 0 0 0 0 
0 0 1743.45 122.761 0 0 0 0 0 0 0 0 0 0 0 0 0 0 0 -37.0037 0 2120.66 0 0 0 0 0 0 0 0 0 0 0 0.03 0 0 0 0 -1846.29 0 0 0 0 -2369.53 0 0 0 0 0 0 0 0 0 0 0 0 
0 0 0 0 0 0 0 0 0 0 0 0 0 0 0 0 0 2233.73 0 0 0 0 0 0 -1444.67 0 0 0 0 0 0 0 0 0 0.01 0 0 0 0 -336.085 0 0 0 0 0 0 0 0 0 0 0 1058.15 -890.759 0 0 0 
0 0 0 0 0 0 2417.45 0 588.931 -1664.71 0 0 0 0 0 0 0 0 0 0 0 0 221.183 0 0 1655.4 0 0 0 0 0 -487.609 545.747 0 0 0.04 0 1731.7 0 0 0 0 0 0 0 487.457 -1845.53 0 0 0 0 0 0 0 0 0 
0 0 -743.507 0 0 0 0 0 0 0 0 0 0 0 2064.96 0 0 0 0 0 0 0 0 0 0 0 0 0 0 0 0 0 0 0 0 0 0.08 0 0 0 0 1144.98 0 2490.69 0 2348.32 0 0 0 0 0 0 0 0 0 0 
0 0 0 0 0 0 0 0 1186.79 0 0 0 0 0 0 0 0 0 0 2089.68 0 0 0 0 0 0 0 0 0 0 0 0 0 0 0 1604.13 0 0.02 0 -497.375 0 0 0 -1954.33 1448.79 -703.528 0 0 0 1703.16 0 0 0 0 0 0 
0 0 0 0 0 0 0 0 0 0 0 0 -1361.96 0 0 0 0 0 0 -669.652 0 0 0 0 0 0 0 0 1585.06 0 0 0 940.962 1969.89 0 0 0 0 0.02 0 0 0 0 0 0 0 0 0 0 0 0 0 0 0 0 0 
0 0 0 0 0 0 0 0 0 0 0 1926.1 0 0 0 0 374.081 0 0 0 0 0 0 0 0 528.504 0 0 0 0 0 0 0 0 1494.11 0 0 683.538 0 0.07 -653.478 0 0 0 0 0 0 0 0 -2226.25 0 0 0 0 0 0 
0 0 0 812.021 2477.11 0 0 0 0 0 0 0 0 0 0 0 0 0 0 0 0 1048.08 0 0 0 0 0 0 0 0 0 0 0 0 0 0 0 0 0 1292.69 0.07 0 294.275 0 0 0 0 0 71.9474 0 0 0 0 0 0 0 
0 0 0 0 0 -904.95 324.335 0 0 0 0 0 0 0 0 0 0 0 0 -1585.36 0 0 0 -1681.95 0 0 0 -21.4393 0 0 0 0 0 0 0 0 1812.88 0 0 0 0 0.04 0 0 0 0 -1711.71 2199.09 0 1841.72 0 0 0 0 0 0 
0 2489.78 883.129 810.648 -1602.3 0 0 904.34 0 0 0 0 2264.7 0 0 0 0 0 0 -1330.53 0 0 0 0 0 0 0 0 0 2212.97 2278.74 -867.107 0 0 0 0 0 0 0 0 -2447.36 0 0.01 0 0 0 0 0 0 0 0 0 0 0 0 0 
0 0 -1114.31 0 0 0 665.075 0 1261.71 0 0 0 0 0 0 0 0 0 0 0 0 1858.2 0 0 0 0 0 0 148.244 0 0 0 1634.19 1624.12 0 0 -1441.62 1905.5 0 0 0 0 0 0.03 0 0 0 0 0 0 -64.9281 0 0 0 0 0 
0 0 0 0 0 0 0 0 -323.878 0 0 0 0 0 0 0 0 0 -1270.26 0 0 0 0 0 0 0 0 0 -793.863 0 0 0 0 0 0 0 0 2436.98 0 0 0 0 0 0 0.08 0 1391.72 0 0 0 0 0 0 0 0 0 
0 0 0 0 0 0 0 1847.06 0 0 0 0 0 0 0 0 0 0 -1242.18 0 0 0 756.02 0 -1595.43 0 0 0 0 0 0 0 0 0 0 2018.27 -712.378 -1183.58 0 0 0 0 0 0 0 0.09 0 0 2077.62 0 0 0 0 0 0 0 
0 0 0 1728.49 0 0 0 0 0 0 0 0 0 697.882 0 0 0 0 0 0 0 2318.26 0 0 0 0 0 0 0 0 1513.18 0 0 0 0 2212.21 0 0 0 0 0 849.712 0 0 -828.043 0 0.04 0 0 0 0 0 0 0 0 0 
1095.39 -891.675 0 0 0 0 0 0 0 1688.82 0 0 0 0 0 -1029.47 -3.89111 0 0 0 0 0 0 0 0 0 0 0 0 0 0 0 0 0 0 0 0 0 0 0 0 638.829 0 0 0 0 0 0.08 0 0 0 -470.977 0 0 0 0 
0 0 2288.81 0 0 0 0 758.309 0 757.393 0 1500.82 0 0 0 0 0 0 0 0 0 -1095.08 0 0 1309.02 0 0 0 0 -1231.35 0 -1128.65 0 0 0 0 0 0 0 0 859.783 0 0 0 0 -2144 0 0 0 -69.3533 0 0 0 0 0 0 
0 0 0 0 0 0 0 0 0 0 1666.84 1226.31 -382.626 0 0 0 0 -904.492 0 1815.01 0 0 812.784 0 0 0 0 0 0 -983.23 0 0 0 0 0 0 0 2065.57 0 686.132 0 -1300.01 0 0 0 0 0 0 1247.06 0.09 -558.87 -2081.9 0 0 0 0 
0 0 2255.55 0 0 0 0 0 0 2147.97 0 0 0 0 0 0 0 -1295.43 0 0 0 0 -913.343 0 0 0 0 0 0 0 0 0 -1224.94 0 0 0 0 0 0 0 0 0 0 -1664.56 0 0 0 0 0 1154.29 0 0 0 0 0 0 
0 0 -1084.7 0 0 0 0 0 0 -363.704 0 0 0 0 0 0 0 0 0 0 0 0 0 0 0 0 0 0 0 0 0 797.83 0 0 812.479 0 0 0 0 0 0 0 0 0 0 0 0 -2267.91 0 2284.23 0 0.04 0 0 0 0 
0 0 0 0 0 0 0 0 0 0 0 0 -31.5104 0 0 0 -338.221 0 0 195.7 -75.7622 2295.22 0 0 0 0 0 0 0 0 0 0 0 0 -1348.23 0 0 0 0 0 0 0 0 0 0 0 0 0 0 0 0 0 0.01 0 0 0 
0 0 0 0 0 0 0 0 0 0 0 1135.06 0 0 0 0 0 0 0 0 0 0 0 0 0 0 0 0 0 0 0 0 0 0 0 0 0 0 0 0 0 0 0 0 0 0 0 0 0 0 0 0 0 0.05 0 0 
0 0 0 0 0 0 0 0 0 0 0 832.011 0 0 0 0 0 0 0 0 0 0 0 0 0 0 0 0 0 0 0 0 0 0 0 0 0 0 0 0 0 0 0 0 0 0 0 0 0 0 0 0 0 0 0.05 0 
0 0 0 0 0 0 0 1148.03 0 0 0 0 0 0 0 0 0 0 0 0 0 0 0 0 0 0 0 0 0 0 0 0 0 0 0 0 0 0 0 0 0 0 0 0 0 0 0 0 0 0 0 0 0 0 0 0.07 
