*Vertices 49
*Matrix 
0 0 1356.32 0 0 2190.85 1852.85 0 0 0 0 0 0 0 0 2383.72 -2007.89 0 0 1374.48 0 0 529.725 0 0 1918.01 1469.85 0 0 0 822.55 -1487.24 -475.707 0 0 -1984.85 0 2177.88 -1006.12 0 985.672 0 0 0 1905.04 1385.01 0 0 0 
0 0.09 0 0 0 0 0 0 1728.95 0 0 0 669.958 0 -1691.87 0 -1539.12 0 0 0 0 0 590.152 0 0 0 1507.23 0 0 0 0 0 -491.272 0 0 0 0 0 0 -8.92666 0 0 0 0 0 0 0 0 0 
-295.801 0 0.03 0 2119.89 0 1432 1631.75 0 -996.811 0 -1099.66 0 0 1410.95 -2110.28 -746.406 -456.633 1709.42 1218.38 1842.94 0 0 695.441 0 0 0 643.712 1661.96 -480.895 0 -689.032 0 0 2251.58 0 2458.65 806.68 851.238 0 0 0 0 0 -2074.57 0 0 -2410.12 0 
0 0 0 0.01 1856.36 0 0 0 0 0 0 -2168.42 0 620.365 0 0 0 0 0 0 0 0 0 629.521 625.095 0 0 0 0 0 1598.18 1508.15 -1735.82 0 0 -1649.91 966.903 0 0 0 0 0 0 623.569 0 0 0 0 0 
0 0 -1706.98 -44.4807 0.05 895.184 0 0 0 -1276.82 0 0 960.036 0 0 2444.3 0 0 0 -1503.88 0 0 0 0 0 0 0 1504.33 1754.28 -1032.82 0 0 0 0 560.549 0 0 0 0 -1239.13 0 1969.74 0 0 0 0 0 0 0 
-2019.33 0 0 0 141.835 0.02 0 2142.32 0 0 2318.72 -190.359 -685.675 0 1174.43 0 -1512.42 0 0 1158.56 0 0 0 -250.328 0 0 0 0 0 0 0 0 0 1643.8 0 0 0 1678.14 0 0 2300.71 0 1970.05 0 0 -69.6585 0 0 0 
1775.19 0 1120.72 0 0 0 0.04 0 0 0 628.605 -837.046 790.201 0 842.082 0 0 0 0 0 -2337.34 0 0 0 0 0 721.076 0 0 0 1698.58 0 0 0 1529.66 0 -1874.07 0 0 0 0 0 0 0 0 -2176.81 0 0 0 
0 0 1714 0 0 1455.66 0 0.08 0 0 0 0 0 0 0 0 0 0 -535.066 0 808.206 0 0 -997.116 0 0 0 0 0 0 0 0 0 1423.31 0 0 -1685.46 -150.227 -1028.7 0 0 0 0 1851.94 0 0 0 0 0 
0 684.149 0 0 0 0 0 0 0.09 0 0 2484.74 0 0 0 0 0 0 0 0 0 0 0 0 -67.98 0 0 0 0 -282.372 2208.7 -1369.44 0 1796.4 1612.06 0 0 0 0 0 0 0 -229.881 0 0 0 0 0 0 
0 0 -2331.69 0 -1965.01 0 0 0 0 0.05 1090.2 0 0 908.612 2163.23 0 1425.14 0 0 0 123.981 0 0 0 0 0 1767.56 83.8496 0 0 0 0 812.326 0 2144.92 2229.91 0 1153.98 1383.02 0 0 0 0 0 0 0 0 0 0 
0 0 0 0 0 2260.58 -33.4941 0 0 403.378 0.03 0 0 0 0 2349.24 -1474.73 0 0 0 0 0 0 -1837.14 -2020.71 0 0 2302.55 0 0 0 0 0 -1700.57 78.0511 0 0 0 0 0 185.781 0 0 724.433 0 0 0 0 0 
0 0 1243.1 2306.51 0 31.3578 -587.252 0 -409.177 0 0 0.01 0 0 0 0 0 0 0 0 0 2353.82 0 0 -695.898 0 0 0 0 0 0 0 0 0 0 0 0 -192.648 0 0 -842.082 0 0 0 0 0 0 0 0 
0 256.89 0 0 -1379.21 951.186 675.146 0 0 0 0 0 0.08 0 0 0 0 0 0 -2441.86 1647.47 2388.45 0 -1153.52 0 0 0 0 0 0 2144 0 0 0 2304.83 -279.321 0 0 -655.766 0 0 0 0 0 0 0 0 0 0 
0 0 0 -2107.38 0 0 0 0 0 1159.02 0 0 0 0.06 0 -509.125 0 0 0 719.245 0 2124.93 0 0 -671.026 0 1946.7 0 0 0 0 0 -1535 0 0 2187.03 0 697.729 0 0 0 0 0 0 -1686.83 0 0 0 0 
0 1382.26 -855.815 0 0 1418.73 1368.22 0 0 69.6585 0 0 0 0 0.01 0 0 0 0 0 0 0 0 0 0 100.635 2118.21 -777.078 0 0 -1146.5 2224.72 0 630.894 -2471.62 105.213 801.645 2016.74 0 0 0 0 0 1538.36 0 0 0 0 0 
2457.73 0 1621.98 0 -915.021 0 0 0 0 0 2102.19 0 0 364.162 0 0.06 0 162.893 0 -426.878 0 758.614 -1303.98 -2041 1012.38 0 0 1887.8 1024.43 0 0 -300.684 0 -895.337 1617.25 0 0 -2198.63 0 2123.25 -425.352 0 0 -616.703 1408.2 0 0 0 0 
1862.32 -1534.39 1607.64 0 0 2116.84 0 0 0 634.861 -104.602 0 0 0 0 0 0.09 0 -2255.7 0 0 -1657.08 2185.96 1909.92 0 572.909 0 0 0 0 0 365.841 0 0 0 0 2241.36 0 396.97 787.912 1796.09 0 0 0 0 0 0 0 0 
0 0 1709.57 0 0 0 0 0 0 0 0 0 0 0 0 2128.44 0 0.05 0 -582.675 2181.39 0 -1407.13 -1546.3 0 1329.46 0 0 0 0 842.997 0 0 -314.417 0 0 -2437.59 0 266.045 0 811.258 1940.9 0 0 0 0 0 0 0 
0 0 -68.7429 0 0 0 0 -853.221 0 0 0 0 0 0 0 0 2084.64 0 0.02 -1030.08 0 283.135 -532.472 0 0 984.756 0 0 0 0 0 0 2420.35 0 0 0 0 0 0 0 0 0 0 0 0 0 -1389.58 0 0 
1785.1 0 1304.74 0 2095.93 803.781 0 0 0 0 0 0 2085.1 2091.66 0 1025.65 0 -1052.35 -960.494 0 0 0 1483.43 0 0 0 0 0 0 0 0 0 0 0 2411.65 0 0 0 0 0 -1508.15 0 0 -2473.75 0 0 0 0 0 
0 0 1501.74 0 0 0 1557.59 2285 0 735.725 0 0 -318.079 0 0 0 0 1430.33 0 0 0.08 0 -190.97 0 1956.01 0 0 0 278.1 -847.27 0 0 609.073 0 0 865.886 0 0 0 0 0 0 0 0 0 0 -1945.02 0 993.454 
0 0 0 0 0 0 0 0 0 0 0 2064.81 416.044 462.584 0 2480.47 849.864 0 -818.125 0 0 0.03 0 -69.8111 0 297.479 0 889.691 0 0 2313.23 0 75.1518 16.5563 0 0 0 0 0 -1045.49 2365.87 0 0 0 944.777 0 0 0 0 
57.7563 2319.48 0 0 0 0 0 0 0 0 0 0 0 0 0 444.884 742.134 -402.921 -1275.44 2402.65 -1118.88 0 0.06 0 1339.69 0 217.673 0 0 0 0 0 0 1664.25 0 -394.375 0 0 0 0 0 0 0 0 0 0 0 0 0 
0 0 -237.663 565.432 0 -723.212 0 639.439 0 0 -367.977 0 1464.35 0 0 1554.08 945.082 612.125 0 0 0 2168.11 0 0.09 0 0 0 -645.848 494.629 0 0 0 -1654.79 0 -1207.08 0 0 0 0 0 0 0 0 0 0 0 0 0 0 
0 0 0 556.124 0 0 0 0 -151.753 0 2279.66 -11.3681 0 -1303.52 0 105.213 0 0 0 0 955.611 0 -2392.42 0 0.03 -1976.45 527.284 0 0 0 1804.94 0 2130.27 0 0 0 0 1159.78 0 0 0 0 0 0 0 0 2154.38 0 0 
-2184.29 0 0 0 0 0 0 0 0 0 0 0 0 0 1694.46 0 2337.34 -649.052 456.786 0 0 960.341 0 0 1811.66 0.05 0 0 0 -635.319 -1310.39 0 0 960.646 0 2041.15 0 0 0 0 0 0 -1823.56 -23.5755 0 0 0 0 0 
821.024 568.484 0 0 0 0 1755.2 0 0 881.146 0 0 0 -164.724 117.573 0 0 0 0 0 0 0 -332.27 0 -763.649 0 0.03 1097.22 -1119.8 0 -1307.34 0 0 0 0 257.653 0 2231.74 0 0 0 -388.882 0 0 0 0 -1924.73 0 0 
0 0 65.2333 0 1491.36 0 0 0 0 2043.14 -211.112 0 0 0 463.805 637.303 0 0 0 0 0 -9.53703 0 989.029 0 0 1712.32 0 0 -2353.36 0 0 0 0 0 0 -1729.56 -144.276 0 0 0 0 0 0 0 0 983.993 0 0 
0 0 -159.841 0 -40.8185 0 0 0 0 0 0 0 0 0 0 2256.31 0 0 0 0 -1724.52 0 0 302.515 0 0 1024.89 0 0.07 0 0 0 -2185.05 0 0 270.47 0 -186.239 2030.93 0 1498.23 0 0 0 0 2284.08 1778.54 0 2038.56 
0 0 2493.44 0 -1022.9 0 0 0 -1581.7 0 0 0 0 0 0 0 0 0 0 0 757.851 0 0 0 0 954.39 0 -193.411 0 0.09 0 0 -1716.28 0 0 0 0 -441.374 531.556 0 498.596 0 0 0 0 0 0 0 1517.76 
-1309.47 0 0 -1005.2 0 0 1265.68 0 2056.41 0 0 0 -753.578 0 2186.27 0 0 -503.174 0 0 0 -1071.12 0 0 -458.464 2389.52 728.401 0 0 0 0.03 0 0 0 0 2467.19 0 0 0 0 0 0 0 0 0 0 -1921.06 0 0 
1009.48 0 2400.05 1828.75 0 0 0 0 -1105.91 0 0 0 0 0 1596.35 -1830.27 174.49 0 0 0 0 0 0 0 0 0 0 0 0 0 0 0.06 0 0 0 0 0 37.9192 -1295.43 -1781.59 889.996 0 0 0 -1753.06 0 0 0 0 
-693.762 -1691.41 0 2257.23 0 0 0 0 0 -716.346 0 0 0 796.152 0 0 0 0 2343.59 0 -621.128 599.307 0 749.916 485.778 0 0 0 -1410.95 1156.58 0 0 0.05 0 0 0 0 -578.402 0 0 0 0 503.937 0 0 0 0 0 0 
0 0 0 0 0 1938.46 0 226.676 2363.89 0 184.103 0 0 0 -375.759 -677.892 0 2386.47 0 0 0 1197.16 1582.31 0 0 380.337 0 0 0 0 0 0 0 0.01 0 0 0 0 0 0 0 0 -260.857 0 0 0 -956.526 0 0 
0 0 2128.74 0 1613.28 0 -869.854 0 1932.81 -1976.76 -521.18 0 262.383 0 -387.204 -207.907 0 0 0 2218.31 0 0 0 -1420.1 0 0 0 0 0 0 0 0 0 0 0.04 0 0 -1245.99 0 -397.122 -398.495 0 0 0 0 0 0 0 0 
-391.934 0 0 1114.31 0 0 0 0 0 -1910.23 0 0 69.0481 2311.4 553.835 0 0 0 0 0 1995.68 0 1184.8 0 0 620.518 -1786.32 0 1925.18 0 798.135 0 0 0 0 0.04 0 0 0 1653.87 0 0 0 0 0 0 0 0 0 
0 0 597.018 225.608 0 0 -2167.96 2084.03 0 0 0 0 0 0 1574.53 0 -540.101 510.041 0 0 0 0 0 0 0 0 0 1419.03 0 0 0 0 0 0 0 0 0.08 0 1570.71 0 398.038 0 2488.25 0 0 0 0 0 0 
-1732 0 771.737 0 0 936.995 0 -1268.27 0 327.387 0 -2118.37 0 573.367 632.42 367.061 0 0 0 0 0 0 0 0 -1302.15 0 544.526 -670.263 1954.02 -600.681 0 -351.344 673.162 0 232.017 0 0 0.06 2490.23 0 0 0 0 0 0 485.931 0 0 -113.91 
-836.283 0 744.423 0 0 0 0 -940.962 0 -1324.58 0 0 1066.7 0 0 0 -986.129 917.92 0 0 0 0 0 0 0 0 0 0 2300.56 2055.35 0 -166.402 0 0 0 0 2043.6 399.411 0.07 0 -1132.16 0 0 0 0 0 0 0 0 
0 555.055 0 0 1850.41 0 0 0 0 0 0 0 0 0 0 1917.86 2187.95 0 0 0 0 252.159 0 0 0 0 0 0 0 0 0 2438.96 0 0 -2443.54 1295.89 0 0 0 0.09 0 0 0 0 0 0 0 1294.67 0 
2385.56 0 0 0 0 2191.46 0 0 0 0 2296.44 -1904.43 0 0 0 -627.232 702.155 -1599.4 0 2041.15 0 1391.57 0 0 0 0 0 0 2120.35 -982.315 0 2467.96 0 0 2479.55 0 1427.43 0 -1095.84 0 0.08 -768.075 0 0 0 0 0 616.855 0 
0 0 0 0 1742.99 0 0 0 0 0 0 0 0 0 0 0 0 -1972.79 0 0 0 0 0 0 0 0 -1684.39 0 0 0 0 0 0 0 0 0 0 0 0 0 1350.67 0.04 0 0 0 238.731 0 2189.17 0 
0 0 0 0 0 -425.504 0 0 274.285 0 0 0 0 0 0 0 0 0 0 0 0 0 0 0 0 1184.35 0 0 0 0 0 0 403.836 1203.88 0 0 1967.91 0 0 0 0 0 0.02 0 0 0 0 0 0 
0 0 0 -412.229 0 0 0 855.815 0 0 2002.7 0 0 0 1844.77 -927.686 0 0 0 1811.04 0 0 0 0 0 -1487.55 0 0 0 0 0 0 0 0 0 0 0 0 0 0 0 0 0 0.08 0 0 0 0 0 
2258.75 0 -1995.07 0 0 0 0 0 0 0 0 0 0 2185.81 0 1720.71 0 0 0 0 0 -842.692 0 0 0 0 0 0 0 0 0 2005.75 0 0 0 0 0 0 0 0 0 0 0 0 0.02 0 0 0 0 
276.421 0 0 0 0 2493.44 641.575 0 0 0 0 0 0 0 0 0 0 0 0 0 0 0 0 0 0 0 0 0 -1394.47 0 0 0 0 0 0 0 0 810.648 0 0 0 193.258 0 0 0 0.03 0 0 0 
0 0 0 0 0 0 0 0 0 0 0 0 0 0 0 0 0 0 -1724.83 0 928.907 0 0 0 1739.48 0 271.996 -1037.1 465.789 0 1196.71 0 0 1440.7 0 0 0 0 0 0 0 0 0 0 0 0 0.09 0 0 
0 0 682.165 0 0 0 0 0 0 0 0 0 0 0 0 0 0 0 0 0 0 0 0 0 0 0 0 0 0 0 0 0 0 0 0 0 0 0 0 284.051 1132.92 1238.06 0 0 0 0 0 0.07 0 
0 0 0 0 0 0 0 0 0 0 0 0 0 0 0 0 0 0 0 0 2116.84 0 0 0 0 0 0 0 853.374 2079.61 0 0 0 0 0 0 0 1620.15 0 0 0 0 0 0 0 0 0 0 0 
