*Vertices 59
*Matrix 
0.09 0 0 0 0 0 0 213.248 0 -2040.39 730.842 0 0 0 0 0 0 0 2154.84 1428.95 1798.84 0 0 0 0 -2134.08 0 0 0 0 0 0 2075.79 0 666.601 0 145.192 0 0 0 0 0 0 0 2285.3 -1028.55 0 0 2383.72 0 1883.07 0 0 0 0 0 0 1125.14 0 
0 0.07 0 2299.04 0 0 0 0 0 0 0 0 -642.949 0 0 0 0 0 0 0 0 0 1365.63 -921.278 0 -1944.41 0 0 464.263 0 1810.13 0 0 0 2044.66 0 0 0 0 0 0 633.335 0 1021.99 0 0 -1133.69 0 2215.41 0 0 0 0 0 0 -673.772 0 0 -842.845 
0 0 0.02 0 1872.23 -2299.49 0 0 0 0 0 180.288 0 0 0 0 0 0 0 0 1114.46 1598.79 0 0 1208 -2301.32 0 0 0 0 0 0 0 0 0 1022.9 0 1904.28 937.758 0 74.9992 0 920.972 0 0 0 0 -38.2244 0 0 0 634.861 385.067 0 1495.64 0 0 0 0 
0 -229.423 0 0.07 2442.78 0 0 0 718.94 0 1500.21 0 0 0 0 0 0 0 0 0 0 0 0 0 -777.535 -1984.54 0 2391.66 0 -709.632 -728.858 0 -1913.13 0 -380.49 0 0 0 1802.04 0 348.598 -902.814 0 1655.86 0 0 0 1314.97 0 0 0 -1058.76 0 0 0 0 2396.85 0 -98.8037 
0 0 -6.02741 2048.33 0.08 0 -44.3281 531.709 0 520.569 0 602.664 0 0 0 0 0 1527.99 0 0 0 0 0 0 0 -1288.11 0 0 0 0 0 0 0 0 0 525.605 0 0 0 1240.96 913.19 2013.69 -1814.4 0 0 -1311.61 0 0 0 0 0 0 0 0 0 -1643.8 0 0 0 
0 0 -1685.92 0 0 0.02 0 0 0 0 0 0 -883.435 0 0 0 0 0 0 -699.255 -1111.56 0 0 0 2358.24 0 1312.52 0 0 0 255.974 -285.424 1995.22 1915.72 -1607.18 0 0 -1329.16 0 0 0 0 330.134 0 2180.32 0 0 -290.307 0 0 0 0 0 1777.17 524.537 0 0 0 -230.186 
0 0 0 0 -1591.62 0 0.07 0 0 0 0 0 0 0 0 0 0 2223.35 0 0 0 0 0 1392.48 0 0 0 0 -914.258 0 153.89 -1621.37 0 0 1706.67 0 0 0 0 0 0 0 0 0 0 0 0 0 0 0 285.882 0 0 0 1022.9 0 0 0 2377.32 
-2199.55 0 0 0 1722.69 0 0 0.09 0 0 0 0 0 0 0 -582.217 0 -908.612 0 0 0 -25.5593 165.181 0 0 -1984.24 1572.24 0 0 -1441.77 1176.72 0 764.107 0 0 -742.592 0 1588.26 0 768.227 -308.008 0 1506.47 0 0 0 1761.6 0 0 -399.716 0 0 0 0 0 0 0 0 -976.974 
0 0 0 -1702.25 0 0 0 0 0.02 0 0 0 0 0 0 0 967.513 -2460.48 0 0 869.396 -1406.06 0 0 2030.63 0 0 0 2274.32 0 0 0 0 0 0 0 0 0 0 0 1211.05 -622.806 1018.48 0 1841.87 0 0 -1591.62 0 761.361 2114.25 -1281.09 -2449.95 0 305.567 0 0 0 69.9637 
-747.017 0 0 0 1879.71 0 0 0 0 0.01 0 2094.41 0 0 0 0 0 0 0 -2186.12 504.395 0 0 0 1365.02 0 0 0 0 0 0 0 0 0 0 0 0 0 0 0 0 377.895 1068.53 1457.79 0 0 -1580.32 0 2029.4 0 1278.34 0 0 1705.91 -527.741 1824.78 0 -2101.43 0 
-1974.01 0 0 1802.04 0 0 0 0 0 0 0.02 0 0 827.433 0 0 0 0 1109.12 0 0 0 103.534 1540.8 0 0 0 0 0 0 0 -529.878 0 0 0 0 0 0 0 384.61 982.467 -2074.57 1238.06 -1996.29 0 2281.64 0 -1965.01 -1415.37 0 0 0 0 0 0 358.058 0 0 0 
0 0 -483.032 0 -188.681 0 0 0 0 204.245 0 0.03 753.426 0 0 0 942.183 0 0 -849.406 0 0 0 0 0 0 0 0 0 -210.196 2024.98 0 0 1932.81 0 0 0 0 0 0 0 285.424 0 591.22 0 2046.49 0 -825.907 0 2329.25 0 0 -1689.28 0 0 0 0 0 0 
0 -530.335 0 0 0 -855.663 0 0 0 0 0 1948.07 0.08 0 0 -1616.95 0 0 1152.76 137.257 0 0 2281.03 0 0 0 0 0 0 -326.624 433.287 -1709.42 0 909.223 0 1725.14 -125.05 0 0 0 0 -755.867 0 0 0 0 1152 -1223.41 0 142.598 0 0 1279.11 0 38.6822 0 0 0 0 
0 0 0 0 0 0 0 0 0 0 1296.96 0 0 0.09 0 0 2343.44 0 0 0 0 0 1543.86 0 0 -124.134 -1305.35 0 633.946 1212.58 0 0 0 0 0 0 0 0 0 0 196.005 0 -578.249 0 0 0 1261.71 0 591.678 0 1854.23 0 0 -443.51 -151.906 0 0 0 0 
0 0 0 0 0 0 0 0 0 0 0 0 0 0 0.07 0 -1336.79 2161.4 -307.703 0 0 0 0 0 0 0 0 2070.6 2451.93 0 0 0 -971.328 0 0 -1789.83 0 0 1265.07 0 0 0 0 0 0 -1307.64 -1083.03 474.944 0 0 0 1979.81 0 0 0 0 0 0 0 
0 0 0 0 0 0 0 1236.99 0 0 0 0 -1032.36 0 0 0.01 0 0 2482.76 0 0 0 2181.39 0 0 0 0 0 1868.88 0 0 0 851.39 0 0 407.804 0 0 0 137.867 264.367 0 0 0 0 -1127.74 0 0 0 0 0 0 0 0 0 802.408 0 0 0 
0 0 0 0 0 0 0 0 -86.9015 0 0 -1191.52 0 -2067.86 200.278 0 0.03 0 0 0 0 0 0 0 0 1996.29 0 0 0 -2087.24 0 0 0 255.669 0 1613.28 1193.2 2129.81 0 0 -27.2378 0 1936.48 0 2008.04 0 0 0 1537.29 0 0 0 468.383 0 0 0 0 0 0 
0 0 0 0 -218.741 0 1780.07 -1520.66 1628.24 0 0 0 0 0 756.63 0 0 0 0 0 0 0 0 0 0 0 0 1634.65 -102.008 1475.95 2337.03 -1418.42 0 0 -542.085 0 0 0 0 0 0 0 0 0 0 -1377.07 0 -1019.09 -1320.31 0 0 0 0 0 1271.32 0 0 0 0 
-552.309 0 0 0 0 0 0 0 0 0 -264.061 0 2469.02 0 -2298.43 1748.94 0 0 0.07 0 -297.327 -561.769 0 841.319 2131.95 0 0 0 -1563.54 525.91 0 0 1659.83 0 -709.021 0 0 0 0 0 0 33.7992 -1530.12 -939.589 -704.596 0 1094.32 0 -568.941 0 377.132 0 0 0 0 788.369 0 0 0 
810.8 0 0 0 0 1811.35 0 0 0 1739.02 0 2055.5 -494.171 0 0 0 0 0 0 0.09 0 0 0 0 0 0 0 0 949.202 0 0 0 0 0 -1838.51 0 984.298 2067.55 0 0 0 123.066 -524.079 0 0 0 0 0 2201.68 76.3726 0 0 0 -92.0896 -561.159 -263.604 0 0 0 
1530.73 0 785.47 0 0 2330.93 0 0 -706.732 2307.89 0 0 0 0 0 0 0 0 992.843 0 0.06 750.069 0 0 0 0 -1481.6 1586.43 0 0 0 0 2195.88 2416.23 0 0 528.962 0 0 0 -2045.73 1214.71 1840.95 646.458 0 0 0 0 0 0 0 0 0 0 0 0 0 0 0 
0 0 -1547.06 0 0 0 0 -2225.64 135.121 0 0 0 0 0 0 0 0 0 2354.43 0 795.999 0.07 960.494 0 0 0 0 2234.49 2263.02 -1923.81 2010.33 0 0 0 0 0 0 0 -2495.88 0 0 1900.77 0 877.941 0 0 -1019.85 -727.027 0 0 -567.415 -1253.17 -2047.72 0 2086.63 -1558.96 0 0 0 
0 1441.31 0 0 0 0 0 916.089 0 0 667.821 0 -1111.41 -919.446 0 1283.07 0 0 0 0 0 2097 0.04 0 0 0 0 0 0 0 0 0 0 0 0 0 0 -2315.36 0 0 0 0 0 0 0 0 0 1893.75 0 0 0 0 1599.55 0 -2027.27 0 0 0 0 
0 -488.372 0 0 0 0 1173.82 0 0 0 2310.63 0 0 0 0 0 0 0 -370.266 0 0 0 0 0.06 0 2105.55 0 2097.92 -308.618 0 -1018.48 0 0 0 0 0 0 -1063.95 0 0 0 -430.845 0 766.549 1244.16 0 0 0 2135.46 1692.18 -2402.04 0 0 0 0 0 0 0 0 
0 0 1256.22 -2318.41 0 599.765 0 0 2037.95 -2239.37 0 0 0 0 0 0 0 0 256.279 0 0 0 0 0 0.02 0 0 -2185.81 487.762 1475.95 0 0 0 0 0 -821.787 2433.47 0 0 0 377.285 0 0 0 0 0 0 1595.74 -970.412 1542.79 0 1366.24 0 -190.97 0 0 0 0 0 
414.975 -614.414 -130.085 2391.66 -440.001 0 0 -1773.05 0 0 0 0 0 -1969.28 0 0 2297.51 0 0 0 0 0 0 -2434.23 0 0.07 0 0 0 0 0 2482.45 0 0 0 0 0 0 0 0 0 0 -756.172 0 -1139.18 1289.03 0 0 1781.29 0 0 0 0 0 0 686.59 0 0 0 
0 0 0 0 0 -163.656 0 -1096.76 0 0 0 0 0 1568.73 0 0 0 0 0 0 2281.64 0 0 0 0 0 0.08 0 0 0 0 0 0 0 0 1787.39 0 0 0 0 0 1529.66 1076.46 0 0 0 0 0 0 0 0 -617.771 2210.84 312.738 0 0 0 0 0 
0 0 0 376.675 0 0 0 0 0 0 0 0 0 0 -1668.68 0 0 297.174 0 0 -60.0452 -191.122 0 1273.61 1466.64 0 0 0.05 0 0 0 0 1378.9 0 0 0 0 716.651 0 0 0 1646.86 0 0 -2267.14 0 977.279 2182.61 -1182.97 0 0 0 -1497.77 0 -658.971 0 0 0 0 
0 -1707.43 0 0 0 0 1114.61 0 1224.48 0 0 0 0 -240.867 20.5237 2420.35 0 782.266 -318.842 785.165 0 1942.73 0 -1500.67 578.555 0 0 0 0.03 -229.575 0 -1409.12 0 -922.651 0 0 149.007 0 0 0 0 0 0 0 1225.09 1904.43 0 0 -482.879 0 0 0 0 0 0 0 0 0 0 
0 0 0 2271.72 0 0 0 2473.14 0 0 0 -1400.88 -2195.73 -2328.33 0 0 1645.18 1703.77 -981.552 0 0 2314.29 0 0 -1986.37 0 0 0 -428.709 0.03 0 -998.489 0 2171.93 0 -2329.55 0 0 0 0 0 0 0 0 0 0 0 0 0 0 0 0 819.193 0 0 0 0 0 0 
0 396.512 0 1518.22 0 -1140.1 2104.18 345.088 0 0 0 797.22 1977.68 0 0 0 0 -2005.91 0 0 0 1448.48 0 1888.87 0 0 0 0 0 0 0.08 0 861.156 0 989.639 0 0 0 -2474.52 -7.55333 0 0 0 0 0 0 0 -956.221 0 0 0 629.521 0 0 0 0 0 0 0 
0 0 0 0 0 672.552 -2084.49 0 0 0 2450.1 0 250.633 0 0 0 0 -1532.87 0 0 0 0 0 0 0 2372.43 0 0 2285.61 2399.59 0 0.08 1223.72 0 0 0 1622.75 0 0 0 1520.97 0 -189.749 0 0 0 0 0 0 110.248 2435.76 0 -1861.86 0 0 0 0 0 0 
1089.59 0 0 -1795.63 0 -747.475 0 -2186.57 0 0 0 0 0 0 1555.45 1771.98 0 0 1695.84 0 -1863.69 0 0 0 0 0 0 2441.71 0 0 1930.52 -421.232 0.06 0 1538.06 0 0 0 0 1976.76 0 -2447.66 0 0 0 0 1397.06 0 0 0 0 0 -1745.12 -1372.95 0 0 0 0 0 
0 0 0 0 0 -1602.6 0 0 0 0 0 -27.6955 2368.77 0 0 0 2325.43 0 0 0 -529.115 0 0 0 0 0 0 0 1897.87 -650.273 0 0 0 0.01 -2407.83 895.642 0 -147.938 249.718 0 1226.31 0 0 0 -1771.68 0 1411.86 0 0 73.9311 -633.03 0 0 0 639.439 0 0 0 2193.75 
2462.77 -1060.14 0 2467.96 0 923.872 2402.19 0 0 0 0 0 0 0 0 0 0 2117.6 -1562.01 2366.48 0 0 0 0 0 0 0 0 0 0 -545.442 0 -1903.36 1979.96 0.03 0 1226.77 -842.997 -461.211 0 0 -1587.19 0 -1522.49 -1745.28 1221.27 0 0 0 -837.657 -617.924 0 0 0 0 0 0 0 0 
0 0 965.224 0 12.7415 0 0 153.279 0 0 0 0 -1167.87 0 153.127 533.235 -1363.34 0 0 0 0 0 0 0 1215.93 0 102.771 0 0 1080.43 0 0 0 811.869 0 0.05 0 0 0 0 -2047.41 0 0 0 0 1333.74 1863.54 2471.92 2396.69 2348.93 0 0 0 468.23 0 0 -2010.18 0 0 
1516.39 0 0 0 0 0 0 0 0 0 0 0 226.066 0 0 0 -1760.54 0 0 -778.756 672.552 0 0 0 71.337 0 0 0 -1226.62 0 0 -652.104 0 0 2000.72 0 0.06 0 0 0 0 0 0 1312.83 -33.1889 0 0 -827.433 2377.93 0 0 0 0 0 0 -1701.33 0 0 0 
0 0 1527.53 0 0 418.332 0 742.744 0 0 0 0 0 0 0 0 2474.97 0 0 2070.91 0 0 1486.94 -1353.27 0 0 0 1219.9 0 0 0 0 0 1899.09 -1162.37 0 0 0.09 250.328 0 0 0 0 0 0 -1280.18 87.5118 0 0 662.938 2428.28 -2101.89 1020.92 0 -1276.06 0 0 0 0 
0 0 1615.27 2151.17 0 0 0 0 0 0 0 0 0 0 -922.346 0 0 0 0 0 0 -352.87 0 0 0 0 0 0 0 0 214.927 0 0 1903.82 -1756.11 0 0 -1043.2 0.06 0 0 0 -763.802 0 0 0 -1099.81 0 0 0 0 0 0 974.99 0 0 2198.48 0 0 
0 0 0 0 2474.52 0 0 2381.89 0 0 -834.3 0 0 0 0 438.475 0 0 0 0 0 0 0 0 0 0 0 0 0 0 -1797.01 0 1786.32 0 0 0 0 0 0 0.09 0 0 0 -116.504 0 0 0 -561.159 1458.25 0 2296.59 0 802.255 -1917.55 0 0 0 0 0 
0 0 -1031.91 2211.91 634.098 0 0 1690.19 1529.05 0 1125.29 0 0 -2155.75 0 -1895.58 1928.24 0 0 0 -1925.79 0 0 0 -1389.58 0 0 0 0 0 0 1103.63 0 776.009 0 2082.2 0 0 0 0 0.05 0 -2253.56 0 0 0 0 0 1535.62 0 0 370.876 0 0 0 0 0 0 0 
0 1554.54 0 1737.19 1795.94 0 0 0 317.316 452.361 1731.09 -2376.86 283.288 0 0 0 0 0 805.307 -484.863 -454.955 -1282.16 0 -1283.84 0 0 -2007.89 992.996 0 0 0 0 956.526 0 -1848.43 0 0 0 0 0 0 0.03 0 0 0 -584.353 1158.56 0 0 0 0 1782.36 0 0 0 0 0 896.405 0 
0 0 1274.53 0 -488.678 -2004.53 0 1406.37 -1377.38 1728.64 2305.75 0 0 2040.39 0 0 1923.51 0 203.177 1934.03 -2382.05 0 0 0 0 -2340.69 -2003.77 0 0 0 0 1544.77 0 0 0 0 0 0 -22.9652 0 1646.09 0 0.02 0 0 0 0 1485.87 0 0 0 0 0 0 0 0 0 0 0 
0 216.453 0 -242.851 0 0 0 0 0 559.175 -671.484 -2228.08 0 0 0 0 0 0 1400.72 0 -356.533 2000.56 0 2274.93 0 0 0 0 0 0 0 0 0 0 264.824 0 -1111.41 0 0 229.27 0 0 0 0.04 0 0 0 2151.02 0 0 0 0 0 1926.4 -1928.08 0 0 0 0 
-1309.93 0 0 0 0 1220.97 0 0 2079.3 0 0 0 0 0 0 0 -772.805 0 1366.7 0 0 0 0 -932.875 0 -2437.44 0 -1332.67 1123.46 0 0 0 0 -1401.18 1982.41 0 2248.38 0 0 0 0 0 0 0 0 0 0 384.762 0 0 0 0 0 0 -1063.19 0 1720.71 0 0 
480.59 0 0 0 1854.23 0 0 0 0 0 -1402.1 120.014 0 0 -1687.29 1110.19 0 1073.41 0 0 0 0 0 0 0 196.615 0 0 -1629.76 0 0 0 0 0 752.968 -466.094 0 -733.894 0 0 0 -715.888 0 0 0 0.05 0 0 0 0 0 0 0 1905.5 715.735 0 0 0 -563.906 
0 102.924 0 0 0 0 0 463.347 0 2006.67 0 0 1053.88 1651.13 1888.1 0 0 0 1081.19 0 0 -2283.32 0 0 0 0 0 2175.89 0 0 0 0 1777.63 -2145.53 0 -1044.42 0 -1978.29 -2321.01 0 0 1745.89 0 0 0 0 0.02 0 0 0 -1708.66 0 0 0 0 1109.12 0 0 0 
0 0 1281.4 2064.5 0 1369.9 0 0 -971.48 0 169.454 -1146.5 2178.64 0 -1747.26 0 0 -2081.44 0 0 0 1666.39 -603.732 0 -1025.8 0 0 71.1844 0 0 1206.02 0 0 0 0 -838.878 -1382.26 0 0 -1935.87 0 0 1565.07 -147.481 124.134 0 0 0.09 0 0 0 0 379.727 0 -751.595 0 0 0 0 
-1109.27 -305.719 0 0 0 0 0 0 0 -1307.34 1849.65 0 0 -904.95 0 0 1628.54 1302.76 -131.001 -1205.1 0 0 0 -2411.19 -577.792 1180.38 0 2425.38 2145.38 0 0 0 0 0 0 47.38 1085.62 0 0 -940.504 -743.812 0 0 0 0 0 0 0 0.04 1046.1 0 0 0 0 0 0 1789.68 -1733.83 0 
0 0 0 0 0 0 0 1195.18 1617.1 0 0 1865.52 1171.22 0 0 0 0 0 0 -2418.97 0 0 0 2324.67 -1780.83 0 0 0 0 0 0 1256.07 0 1658.15 1505.86 -398.648 0 -2437.28 0 0 0 0 0 0 0 0 0 0 -332.27 0.09 0 0 0 -286.95 0 -1560.79 0 0 1673.86 
60.5029 0 0 0 0 0 1568.42 0 1606.88 -1934.34 0 0 0 1919.08 0 0 0 0 2293.39 0 0 -960.799 0 -2305.29 0 0 0 0 0 0 0 1616.49 0 2147.97 2306.36 0 0 1383.94 0 1293.91 0 0 0 0 0 0 563.906 0 0 0 0.07 0 0 0 -184.713 -1928.39 0 0 0 
0 0 1711.86 2254.48 0 0 0 0 604.648 0 0 0 0 0 -607.7 0 0 0 0 0 0 1984.24 0 0 -1851.18 0 2175.44 0 0 0 -988.876 0 0 0 0 0 0 -1476.26 0 0 -1817.3 346.309 0 0 0 0 0 0 0 0 0 0.01 0 0 0 1494.57 -1227.38 0 0 
0 0 -1041.98 0 0 0 0 0 -617.313 0 0 -260.857 1197.78 0 0 0 1294.98 0 0 0 0 2230.22 2378.99 0 0 0 1.44963 -1741.46 0 -712.378 0 2269.43 -425.962 0 0 0 0 1834.7 0 -1423.76 0 0 0 0 0 0 0 1047.93 0 0 0 0 0.06 20.8289 0 2378.69 0 0 0 
0 0 0 0 0 2453.61 0 0 0 1161.61 0 0 0 703.07 0 0 0 0 0 34.4096 0 0 0 0 72.2526 0 237.968 0 0 0 0 0 -134.358 0 0 -2447.81 0 0 13.8096 1944.41 0 0 0 -412.381 0 457.244 0 0 0 1501.59 0 0 2076.25 0.02 0 430.845 0 0 0 
0 0 -918.073 0 0 1125.14 -128.559 0 687.811 1198.08 0 0 -1180.84 491.577 0 0 0 387.051 0 540.101 0 2053.06 2050.77 0 0 0 0 2149.65 0 0 0 0 0 -664.006 0 0 0 -580.233 0 0 0 0 0 -1300.01 69.0481 2126.91 0 -1330.53 0 0 -1611.45 0 0 0 0.07 0 0 0 0 
0 -1253.62 0 0 -150.685 0 0 0 0 1937.7 145.955 0 0 0 0 -259.941 0 0 2208.7 2252.65 0 -988.571 0 0 0 -1097.83 0 0 0 0 0 0 0 0 0 0 -1385.77 0 0 0 0 0 0 0 0 0 1796.09 0 0 2489.78 913.648 -2208.24 1487.85 1619.24 0 0 0 -813.089 0 
0 0 0 2322.23 0 0 0 0 0 0 0 0 0 0 0 0 0 0 0 0 0 0 0 0 0 0 0 0 0 0 0 0 0 0 0 -240.41 0 0 1636.33 0 0 0 0 0 -2104.33 0 0 0 2489.93 0 0 1710.03 0 0 0 0 0.09 0 0 
-1021.53 0 0 0 0 0 0 0 0 2456.51 0 0 0 0 0 0 0 0 0 0 0 0 0 0 0 0 0 0 0 0 0 0 0 0 0 0 0 0 0 0 0 -100.33 0 0 0 0 0 0 2375.03 0 0 0 0 0 0 675.451 0 0.05 0 
0 -1731.09 0 2221.67 0 -688.879 -601.596 -782.113 1387.14 0 0 0 0 0 0 0 0 0 0 0 0 0 0 0 0 0 0 0 0 0 0 0 0 2239.22 0 0 0 0 0 0 0 0 0 0 0 -1361.51 0 0 0 2078.39 0 0 0 0 0 0 0 0 0.08 
