*Vertices 44
*Matrix 
0.07 0 0 0 0 0 0 0 0 0 0 0 0 0 0 0 0 2458.65 0 -560.701 0 -161.214 1016.5 0 0 0 0 0 0 0 0 0 0 0 0 0 0 0 227.897 0 714.972 0 0 0 
0 0.08 0 0 0 41.8867 -856.883 0 0 0 0 0 0 0 2471.31 0 0 0 0 0 0 -1473.97 0 0 0 -775.704 0 0 0 0 1754.89 0 0 0 0 0 0 1633.73 0 0 0 0 0 0 
0 0 0.07 0 0 0 0 0 0 0 0 0 0 2233.73 0 0 0 -646.153 0 0 0 0 0 0 0 0 0 0 2019.03 0 0 1077.99 0 0 0 0 0 0 0 0 0 0 0 0 
0 0 0 0.08 0 0 0 1455.2 0 0 772.347 0 0 0 1635.56 2310.48 0 0 0 0 0 0 0 0 0 -1289.48 0 0 0 0 215.537 0 0 0 0 0 0 0 0 0 0 0 0 0 
0 0 0 0 0 0 0 0 2042.99 0 0 0 1452.15 0 0 0 0 0 1653.87 0 0 0 -566.195 0 0 0 0 0 0 0 0 0 0 0 0 0 0 2454.37 0 0 0 2402.8 0 0 
0 1643.8 0 0 0 0.03 0 0 0 0 0 0 -2357.78 0 0 0 189.138 0 0 0 0 1351.59 0 2385.56 0 0 0 0 457.854 0 -1106.98 0 0 0 0 0 0 0 0 0 0 0 0 0 
0 1358 0 0 0 0 0.08 0 1327.17 0 0 0 0 0 0 0 0 0 0 0 -305.719 0 0 0 0 655.614 0 0 0 0 0 2437.89 2328.18 1675.7 0 0 0 0 0 0 0 0 0 0 
0 0 0 1759.16 0 0 0 0.08 0 0 0 0 -283.898 0 0 0 0 0 0 0 -0.228889 0 347.224 0 0 0 0 0 0 1491.67 0 0 0 1266.29 51.3474 0 0 0 0 0 0 -564.974 0 0 
0 0 0 0 -1883.53 0 -918.073 0 0.04 0 0 0 0 0 0 0 0 0 722.602 0 2101.43 0 0 0 980.331 0 0 0 0 0 0 0 0 0 2001.33 972.549 0 -673.009 0 0 0 0 0 0 
0 0 0 0 0 0 0 0 0 0.08 0 0 0 1615.27 0 1219.14 0 0 0 0 0 0 0 0 0 0 0 0 1164.2 2476.81 0 1863.99 0 0 1144.52 0 0 0 0 0 0 -825.144 0 0 
0 0 0 1610.08 0 0 0 0 0 0 0.02 0 -377.132 0 0 0 0 0 0 0 0 0 0 0 0 0 0 0 0 0 0 0 0 0 0 0 0 0 0 0 0 -1665.78 0 0 
0 0 0 0 0 0 0 0 0 0 0 0.05 0 0 0 0 0 0 0 0 0 0 0 0 723.67 696.509 0 0 0 2213.43 0 0 0 0 0 0 0 0 0 0 1912.82 0 0 0 
0 0 0 0 1328.24 2392.42 0 -829.112 0 0 1158.71 0 0.03 0 -864.666 -271.081 0 0 0 0 0 0 1733.22 0 0 0 0 0 0 0 0 -712.073 -1393.09 0 0 0 0 0 0 1623.97 0 0 0 1920.76 
0 0 -2381.74 0 0 0 0 0 0 1159.17 0 0 0 0.05 0 2374.11 0 0 0 0 0 0 471.587 0 0 0 0 0 0 0 0 0 0 0 0 0 0 0 0 0 0 0 0 0 
0 598.086 0 2179.1 0 0 0 0 0 0 0 0 1675.54 0 0.07 0 0 0 0 0 0 0 0 681.097 0 0 0 -11.9785 0 0 0 0 0 0 0 0 0 0 0 0 0 0 0 0 
0 0 0 2318.87 0 0 0 0 0 -2440.79 0 0 1087.3 1373.71 0 0 0 0 0 0 0 0 0 0 0 0 0 1332.21 0 0 0 0 0 0 0 2060.08 0 -1820.66 0 0 0 0 0 0 
0 0 0 0 0 -2319.94 0 0 0 0 0 0 0 0 0 0 0.07 0 0 0 -269.25 0 0 839.641 0 1558.35 547.426 0 0 0 0 0 0 1000.93 0 0 0 0 0 0 0 0 0 0 
2037.19 0 750.832 0 0 0 0 0 0 0 0 0 0 0 0 0 0 0.09 559.481 0 -801.035 0 0 0 0 0 0 2045.12 0 0 0 0 0 0 0 -1760.69 0 0 1205.71 1983.17 0 0 -2391.96 0 
0 0 0 0 524.995 0 0 0 2187.19 0 0 0 0 0 0 0 0 1823.1 0.01 0 0 0 -2150.26 0 0 0 0 0 0 0 -403.684 0 0 0 0 -1690.95 0 0 0 0 1762.67 0 793.405 0 
-2131.03 0 0 0 0 0 0 0 0 0 0 0 0 0 0 0 0 0 0 0.07 2350.92 0 0 0 0 0 1520.05 0 0 0 0 0 0 0 0 0 0 0 0 -414.518 824.076 0 0 0 
0 0 0 0 0 0 165.487 -1250.57 -1483.73 0 0 0 0 0 0 0 1801.28 1828.75 0 -410.55 0.06 0 0 0 0 0 0 0 0 0 0 0 0 0 0 0 0 0 497.07 0 0 0 0 0 
2199.39 69.6585 0 0 0 2424.62 0 0 0 0 0 0 0 0 0 0 0 0 0 0 0 0.07 0 0 0 0 0 0 0 0 0 0 0 -1344.87 0 0 0 0 0 0 0 0 0 0 
1531.04 0 0 0 738.624 0 0 -1588.56 0 0 0 0 -429.93 1629.76 0 0 0 0 68.1326 0 0 0 0.09 0 0 0 0 0 0 0 0 0 1119.34 -1137.2 0 175.71 0 0 0 0 0 -136.341 0 0 
0 0 0 0 0 -1256.52 0 0 0 0 0 0 0 0 451.14 0 1544.92 0 0 0 0 0 0 0.09 0 0 0 1023.36 0 0 -14.5726 0 0 0 0 0 0 0 0 0 0 0 0 0 
0 0 0 0 0 0 0 0 918.989 0 0 2203.36 0 0 0 0 0 0 0 0 0 0 0 0 0.06 0 0 2317.19 0 0 0 0 0 0 -1433.84 0 0 0 0 0 0 0 0 0 
0 -976.821 0 -404.141 0 0 1095.23 0 0 0 0 -2210.53 0 0 0 0 2057.79 0 0 0 0 0 0 0 0 0.08 69.0481 0 113.605 0 0 0 0 0 0 0 1727.12 0 1100.12 0 1580.17 0 0 0 
0 0 0 0 0 0 0 0 0 0 0 0 0 0 0 0 662.633 0 0 -1689.89 0 0 0 0 0 222.251 0 0 0 0 0 1275.44 0 0 0 2241.97 -902.509 216.3 1780.98 0 0 -726.112 0 0 
0 0 0 0 0 0 0 0 0 0 0 0 0 0 1092.18 2336.57 0 1722.54 0 0 0 0 0 1018.78 953.017 0 0 0.07 0 -2314.29 0 0 589.389 0 0 1320 0 0 603.427 0 -1141.16 1353.72 0 0 
0 0 605.106 0 0 1365.02 0 0 0 1648.99 0 0 0 0 0 0 0 0 0 0 0 0 0 0 0 131.001 0 0 0.08 -702.612 0 0 0 0 0 1902.91 1557.28 0 0 0 0 0 0 0 
0 0 0 0 0 0 0 1612.22 0 -1715.52 0 1498.69 0 0 0 0 0 0 0 0 0 0 0 0 0 0 0 1682.41 2398.22 0.05 0 0 0 0 0 -1097.06 2422.18 0 0 0 0 0 0 0 
0 1012.83 0 -860.393 0 1980.73 0 0 0 0 0 0 0 0 0 0 0 0 -1568.73 0 0 0 0 2169.48 0 0 0 0 0 0 0.09 0 0 0 0 0 0 0 1861.4 0 0 0 1417.36 0 
0 0 1096.45 0 0 0 -1013.9 0 0 -394.833 0 0 1401.18 0 0 0 0 0 0 0 0 0 0 0 0 0 -780.892 0 0 0 0 0.04 0 0 0 0 2213.28 0 0 0 0 0 0 0 
0 0 0 0 0 0 -1074.94 0 0 0 0 0 -1418.42 0 0 0 0 0 0 0 0 0 1281.4 0 0 0 0 891.064 0 0 0 0 0.09 -568.789 0 1767.25 0 0 0 0 0 0 0 0 
0 0 0 0 0 0 -1713.39 -2162.92 0 0 0 0 0 0 0 0 795.999 0 0 0 0 1798.23 1685.16 0 0 0 0 0 0 0 0 0 -1372.34 0.04 0 0 0 0 2049.09 0 0 0 0 0 
0 0 0 0 0 0 0 -1152.15 1352.96 1592.38 0 0 0 0 0 0 0 0 0 0 0 0 0 0 -244.987 0 0 0 0 0 0 0 0 0 0.08 0 0 0 0 0 0 -671.026 0 0 
0 0 0 0 0 0 0 0 1412.93 0 0 0 0 0 0 168.081 0 -1073.72 1540.8 0 0 0 -1963.03 0 0 0 -1465.73 1618.93 1156.12 2420.8 0 0 895.642 0 0 0.01 0 0 0 0 2108.75 0 0 0 
0 0 0 0 0 0 0 0 0 0 0 0 0 0 0 0 0 0 0 0 0 0 0 0 0 471.282 925.245 0 -966.445 1268.58 0 2491.45 0 0 0 0 0.03 0 939.283 0 0 0 0 0 
0 -875.652 0 0 2192.68 0 0 0 1396.15 0 0 0 0 0 0 1313.14 0 0 0 0 0 0 0 0 0 0 -585.727 0 0 0 0 0 0 0 0 0 0 0.06 0 0 0 0 0 0 
-1496.09 0 0 0 0 0 0 0 0 0 0 0 0 0 0 0 0 2290.03 0 0 423.826 0 0 0 0 291.375 -49.3637 2478.03 0 0 55.9252 0 0 909.68 0 0 -2143.39 0 0.04 0 0 -1777.63 0 1339.84 
0 0 0 0 0 0 0 0 0 0 0 0 686.132 0 0 0 0 584.658 0 858.257 0 0 0 0 0 0 0 0 0 0 0 0 0 0 0 0 0 0 0 0.03 0 0 0 0 
8.01111 0 0 0 0 0 0 0 0 0 0 -516.144 0 0 0 0 0 0 1907.79 -1406.22 0 0 0 0 0 967.818 0 -1832.1 0 0 0 0 0 0 0 2002.24 0 0 0 0 0.06 0 0 0 
0 0 0 0 -632.572 0 0 -6.33259 0 393.002 1504.94 0 0 0 0 0 0 0 0 0 0 0 1077.23 0 0 0 1921.98 2262.41 0 0 0 0 0 0 -905.408 0 0 0 1024.43 0 0 0.09 0 0 
0 0 0 0 0 0 0 0 0 0 0 0 0 0 0 0 0 1622.29 -1759.77 0 0 0 0 0 0 0 0 0 0 0 1833.17 0 0 0 0 0 0 0 0 0 0 0 0.01 0 
0 0 0 0 0 0 0 0 0 0 0 0 214.469 0 0 0 0 0 0 0 0 0 0 0 0 0 0 0 0 0 0 0 0 0 0 0 0 0 1840.95 0 0 0 0 0.01 
