*Vertices 50
*Matrix 
0.06 0 0 0 1343.96 0 0 0 0 0 0 0 0 0 0 0 0 0 0 0 0 1838.82 0 0 0 0 0 0 0 0 1029.16 0 0 0 0 0 0 0 0 0 680.639 0 0 0 0 0 0 0 0 0 
0 0.04 0 0 0 0 0 0 0 0 0 0 0 0 768.532 1769.23 0 0 1594.67 0 0 0 0 0 0 0 0 0 0 0 -1963.33 0 0 0 0 0 0 -243.461 0 0 0 0 0 0 1236.08 0 678.198 0 1373.56 0 
0 0 0 0 0 0 0 0 0 0 0 0 0 0 0 0 0 0 0 0 0 1430.33 0 0 0 0 0 0 0 0 0 0 341.731 0 0 0 2150.72 0 0 0 0 0 0 -1094.93 0 0 0 0 0 0 
0 0 0 0.05 0 0 -577.029 0 0 0 0 0 0 0 0 0 0 0 0 0 0 0 0 0 0 -42.8022 0 0 0 0 0 0 0 0 2052.14 0 0 0 0 2358.7 0 0 0 0 0 0 0 0 -376.827 0 
-1361.66 0 0 0 0.07 0 0 0 0 0 0 0 1274.53 0 0 0 0 0 0 -1262.93 0 0 -2409.05 0 0 0 2412.26 0 0 0 0 0 0 0 367.977 0 0 0 0 0 0 0 774.636 0 0 0 0 0 0 0 
0 0 0 0 0 0 0 0 0 -1293.45 0 0 0 0 0 0 0 0 0 0 0 0 0 1530.88 0 0 0 2223.35 0 0 0 1583.53 0 0 0 0 0 0 0 0 1062.73 2298.88 0 0 0 0 1478.39 0 0 0 
0 0 0 1881.85 0 0 0.08 0 0 0 0 1372.19 0 0 -2423.09 0 0 0 0 -491.577 0 0 0 0 0 0 -300.378 0 2297.05 0 0 0 0 0 0 0 0 0 0 0 0 -104.907 0 0 0 0 0 0 702.612 0 
0 0 0 0 0 0 0 0.05 1067.31 0 0 0 0 0 0 2287.44 0 0 -574.282 0 -1035.11 0 0 0 0 0 0 -1946.24 0 122.15 0 0 0 0 0 0 0 0 0 1930.98 0 0 0 0 1189.54 0 0 0 0 0 
0 0 0 0 0 0 0 2130.88 0.06 1931.59 0 0 0 0 0 0 0 0 0 0 989.181 0 0 0 0 0 0 0 1327.17 0 0 0 0 0 0 -192.038 0 0 0 -479.064 0 0 0 0 0 0 0 0 0 0 
0 0 0 0 0 -2307.12 0 0 -479.98 0 0 0 0 0 0 0 0 0 -862.987 0 0 0 0 0 0 0 0 0 583.743 -524.842 987.35 0 0 0 0 2474.21 0 0 0 0 0 0 0 1815.16 0 0 0 0 0 1701.64 
0 0 0 0 0 0 0 0 0 0 0.06 0 0 480.285 0 0 0 0 0 0 0 1690.04 -1161.46 1313.59 0 0 0 0 0 0 0 0 0 0 0 0 0 0 0 -71.4896 0 0 0 0 0 0 0 0 0 0 
0 0 0 0 0 0 314.112 0 0 0 0 0.04 0 0 0 0 0 0 0 0 0 0 0 1874.22 0 0 0 0 0 0 0 0 0 0 0 0 0 0 0 0 0 0 -884.045 0 0 0 0 0 0 0 
0 0 0 0 -2049.24 0 0 0 0 0 0 0 0.01 1029.92 0 -2243.19 0 -41.2763 0 0 0 0 0 0 0 0 0 0 -1412.02 0 0 -557.039 0 0 2100.21 0 0 0 0 2348.48 0 0 0 0 0 2470.4 0 0 0 0 
0 0 0 0 0 0 0 0 0 0 1532.41 0 1158.1 0.08 0 -1108.05 0 0 0 0 0 -1383.94 0 0 0 1575.9 0 0 0 1858.81 0 1103.02 0 0 0 651.646 0 0 0 0 0 156.026 0 0 0 0 0 -653.935 0 0 
0 1566.9 0 0 0 0 1978.74 0 0 0 0 0 0 0 0.04 0 0 0 0 0 0 0 0 0 0 0 0 0 670.11 0 1266.44 0 -2043.29 0 0 0 0 0 0 0 0 0 0 0 -1905.5 0 0 2305.9 0 0 
0 774.941 0 0 0 0 0 1944.41 0 0 0 0 802.56 2453.15 0 0.08 -1397.21 0 0 0 0 0 0 0 0 0 -2004.23 0 -2136.37 0 0 0 0 0 0 0 0 0 0 344.325 0 0 0 0 0 0 0 0 0 0 
0 0 0 0 0 0 0 0 0 0 0 0 0 0 0 1748.33 0.08 0 330.592 0 0 0 0 0 2161.4 0 0 0 0 1668.68 0 0 0 0 0 1528.6 0 52.7207 0 0 0 0 0 0 0 0 0 0 0 0 
0 0 0 0 0 0 0 0 0 0 0 0 2093.19 0 0 0 0 0.03 0 0 0 0 0 0 0 0 0 114.673 0 0 0 0 0 0 0 0 -164.113 0 0 0 0 0 1791.21 0 0 0 0 0 296.716 2342.52 
0 -1547.06 0 0 0 0 0 2325.13 0 -2041.61 0 0 0 0 0 0 1402.55 0 0.04 1643.96 0 0 1390.96 0 0 0 0 0 0 0 0 0 0 0 0 0 0 0 0 0 0 0 0 0 0 0 -419.553 0 699.561 0 
0 0 0 0 -155.11 0 -358.211 0 0 0 0 0 0 0 0 0 0 0 1088.52 0.04 1259.73 0 -1744.21 0 0 0 0 0 0 0 0 0 0 0 0 0 2083.12 0 0 0 0 0 -1313.9 0 0 0 0 0 0 0 
0 0 0 0 0 0 0 1773.05 1836.68 0 0 0 0 0 0 0 0 0 0 1620 0.01 0 0 0 0 0 0 0 0 -915.021 0 985.977 0 0 0 0 0 0 0 0 0 0 0 0 0 -323.115 0 0 0 0 
1107.59 0 -338.679 0 0 0 0 0 0 0 1027.33 0 0 -1921.98 0 0 0 0 0 0 0 0.04 0 0 0 0 0 -495.392 1439.18 0 0 0 0 0 0 0 0 0 -255.364 0 0 0 0 0 945.692 0 0 0 0 0 
0 0 0 0 2371.67 0 0 0 0 0 2483.98 0 0 0 0 0 0 0 -1337.86 1104.39 0 0 0.09 0 0 0 0 0 0 0 1595.74 0 0 1320.15 0 0 0 0 1698.89 0 0 683.386 0 0 0 0 0 0 0 0 
0 0 0 0 0 -784.707 0 0 0 0 1597.42 2035.2 0 0 0 0 0 0 0 0 0 0 0 0.07 0 0 0 0 0 1831.95 0 0 0 0 -934.4 0 0 -710.547 0 0 0 0 0 0 0 0 0 0 0 0 
0 0 0 0 0 0 0 0 0 0 0 0 0 0 0 0 2167.65 0 0 0 0 0 0 0 0.03 0 0 1134.91 0 0 0 2032.91 0 0 0 0 0 1386.23 0 0 -1698.43 0 0 0 2321.92 0 0 0 0 -458.312 
0 0 0 -1659.98 0 0 0 0 0 0 0 0 0 2288.35 0 0 0 0 0 0 0 0 0 0 0 0.03 0 0 0 0 1214.26 0 0 0 0 0 0 0 0 0 0 0 0 0 0 0 0 0 0 0 
0 0 0 0 530.488 0 2139.12 0 0 0 0 0 0 0 0 -1678.14 0 0 0 0 0 0 0 0 0 0 0.06 0 0 0 -1330.99 0 0 0 0 0 0 0 0 0 0 0 0 1247.22 0 0 0 0 0 0 
0 0 0 0 0 -1328.39 0 793.863 0 0 0 0 0 0 0 0 0 -44.3281 0 0 0 1771.37 0 0 2347.56 0 0 0.02 -996.506 0 0 0 0 0 -987.655 0 0 0 0 0 0 0 0 0 0 941.572 0 -991.623 0 0 
0 0 0 0 0 0 1583.83 0 -1808.3 114.978 0 0 -1314.2 0 1596.65 945.692 0 0 0 0 0 2322.08 0 0 0 0 0 2323.6 0.02 0 0 0 0 0 0 0 0 0 0 0 0 0 0 2198.32 0 0 0 0 0 0 
0 0 0 0 0 0 0 -653.325 0 -1605.96 0 0 0 2130.73 0 0 -1876.2 0 0 0 1780.98 0 0 -123.981 0 0 0 0 0 0 0 0 0 1843.09 0 -118.946 0 0 0 0 0 0 0 0 0 0 853.374 0 0 0 
2084.19 -2081.74 0 0 0 0 0 0 0 2006.36 0 0 0 0 313.654 0 0 0 0 0 0 0 -1603.67 0 0 -530.793 2102.04 0 0 0 0.07 0 0 0 0 0 0 0 0 0 0 -630.589 2286.22 0 0 0 0 0 -1696.14 0 
0 0 0 0 0 1909.47 0 0 0 0 0 0 -1101.64 730.537 0 0 0 0 0 0 729.316 0 0 0 992.233 0 0 0 0 0 0 0.09 0 0 0 0 2060.84 0 0 0 0 0 0 0 0 0 0 0 2017.35 0 
0 0 -1408.66 0 0 0 0 0 0 0 0 0 0 0 -134.663 0 0 0 0 0 0 0 0 0 0 0 0 0 0 0 0 0 0.09 2220.3 617.008 0 1403.62 0 0 0 0 0 -1172.75 0 0 0 -257.195 33.3415 0 1128.8 
0 0 0 0 0 0 0 0 0 0 0 0 0 0 0 0 0 0 0 0 0 0 -1371.12 0 0 0 0 0 0 919.141 0 0 -1012.83 0.08 0 0 0 -1711.86 0 2279.35 0 1910.69 0 0 0 1459.78 -1384.55 0 0 0 
0 0 0 1239.89 248.344 0 0 0 0 0 0 0 1474.27 0 0 0 0 0 0 0 0 0 0 -1786.94 0 0 0 1703.62 0 0 0 0 -38.0718 0 0.04 0 0 0 0 0 0 1000.93 0 0 0 0 0 -1241.42 0 0 
0 0 0 0 0 0 0 0 -744.728 346.614 0 0 0 1928.24 0 0 1247.37 0 0 0 0 0 0 0 0 0 0 0 0 -1685.31 0 0 0 0 0 0.06 0 0 0 0 0 0 0 0 -37.0037 0 0 965.529 0 -1053.88 
0 0 2153.77 0 0 0 0 0 0 0 0 0 0 0 0 0 0 -355.007 0 2423.55 0 0 0 0 0 0 0 0 0 0 0 826.365 290.002 0 0 0 0 1618.17 -233.39 0 0 0 0 0 0 0 0 0 796.304 0 
0 343.41 0 0 0 0 0 0 0 0 0 0 0 0 0 0 262.993 0 0 0 0 0 0 -187.46 1200.98 0 0 0 0 0 0 0 0 1025.19 0 0 1644.72 0.04 0 0 0 0 0 401.7 0 0 0 0 0 0 
0 0 0 0 0 0 0 0 0 0 0 0 0 0 0 0 0 0 0 0 0 -1432.46 996.2 0 0 0 0 0 0 0 0 0 0 0 0 0 2079.15 0 0.02 0 0 0 0 0 0 0 0 0 557.497 0 
0 0 0 304.956 0 0 0 651.494 521.18 0 268.792 0 2417.45 0 0 1063.95 0 0 0 0 0 0 0 0 0 0 0 0 0 0 0 0 0 1054.8 0 0 0 0 0 0.08 0 1779.92 875.958 -2244.1 0 0 0 0 0 0 
1530.88 0 0 0 0 801.187 0 0 0 0 0 0 0 0 0 0 0 0 0 0 0 0 0 0 -297.784 0 0 0 0 0 0 0 0 0 0 0 0 0 0 0 0.07 0 -278.405 0 0 0 1967.76 0 0 0 
0 0 0 0 0 1825.39 713.446 0 0 0 0 0 0 1664.56 0 0 0 0 0 0 0 0 -761.666 0 0 0 0 0 0 0 12.1311 0 0 1772.13 1396.15 0 0 0 0 1641.36 0 0.09 0 0 0 0 0 -2218.47 0 0 
0 0 0 0 -2375.64 0 0 0 0 0 0 -919.141 0 0 0 0 0 -1839.73 0 1896.65 0 0 0 0 0 0 0 0 0 0 -396.359 0 1170.31 0 0 0 0 0 0 1893.75 235.679 0 0.04 0 -159.841 0 0 0 0 1318.17 
0 0 -138.325 0 0 0 0 0 0 2332.45 0 0 0 0 0 0 0 0 0 0 0 0 0 0 0 0 2336.88 0 503.479 0 0 0 0 0 0 0 0 2288.51 0 873.058 0 0 0 0.06 0 0 0 0 0 -1773.81 
0 2176.05 0 0 0 0 0 -1345.79 0 0 0 0 0 0 2384.79 0 0 0 0 0 0 -1486.79 0 0 -518.738 0 0 0 0 0 0 0 0 0 0 153.127 0 0 0 0 0 0 1351.44 0 0.01 0 0 0 0 0 
0 0 0 0 0 0 0 0 0 0 0 0 2363.12 0 0 0 0 0 0 0 685.522 0 0 0 0 0 0 713.141 0 0 0 0 0 -454.65 0 0 0 0 0 0 0 0 0 0 0 0.03 0 0 0 0 
0 -1167.41 0 0 0 2273.25 0 0 0 0 0 0 0 0 0 0 0 0 644.475 0 0 0 0 0 0 0 0 0 0 2356.72 0 0 -1482.67 74.8466 0 0 0 0 0 0 974.685 0 0 0 0 0 0.01 0 0 0 
0 0 0 0 0 0 0 0 0 0 0 0 0 2354.12 -880.993 0 0 0 0 0 0 0 0 0 0 0 0 -578.097 0 0 0 0 1138.26 0 -756.478 395.596 0 0 0 0 0 -562.38 0 0 0 0 0 0 1806.31 0 
0 -109.18 0 1580.94 0 0 2481.99 0 0 0 0 0 0 0 0 0 0 619.297 -1172.75 0 0 0 0 0 0 0 0 0 0 0 862.987 2370.75 0 0 0 0 -61.5711 0 -2114.09 0 0 0 0 0 0 0 0 812.784 0.06 0 
0 0 0 0 0 0 0 0 0 2490.54 0 0 0 0 0 0 0 2119.59 0 0 0 0 0 0 2310.94 0 0 0 0 0 0 0 374.233 0 0 -1556.67 0 0 0 0 0 0 -1489.23 292.291 0 0 0 0 0 0.03 
