*Vertices 44
*Matrix 
0.01 0 0 -1606.57 0 0 0 0 0 0 0 0 0 0 0 0 0 0 0 0 0 0 0 0 0 0 0 1956.47 0 0 0 0 0 0 0 2009.11 0 0 0 0 0 0 0 0 
0 0 2036.73 0 0 0 0 0 0 0 0 1870.4 0 0 0 0 0 0 0 0 0 -797.525 0 0 0 0 -1763.44 0 1059.53 0 0 0 0 0 0 0 0 0 0 0 0 0 0 0 
0 -1930.68 0.04 0 0 0 0 0 0 0 0 0 0 0 0 -1388.82 632.115 1353.72 0 0 0 -913.038 0 1132.92 0 0 0 0 0 0 0 0 0 0 1956.16 0 0 0 0 0 0 0 0 0 
-721.534 0 0 0.03 0 -690.71 0 0 1017.87 1581.39 0 0 0 0 0 0 0 0 0 0 0 0 0 0 0 0 0 396.207 1786.94 0 0 0 0 0 0 0 2411.19 0 0 0 0 0 0 0 
0 0 0 0 0.08 0 0 0 0 101.245 0 0 0 0 -295.19 0 0 0 0 0 0 0 0 0 0 0 0 0 0 0 0 1271.94 0 0 0 0 0 0 0 0 0 0 0 0 
0 0 0 380.642 0 0.08 0 0 0 752.815 0 0 -579.775 0 0 0 0 0 0 0 439.238 0 0 0 0 0 -1955.85 0 0 0 1461.46 0 0 0 0 0 1578.34 -2258.6 0 2282.86 0 0 0 0 
0 0 0 0 0 0 0.04 1985.61 2052.6 0 0 0 0 0 0 0 0 0 -824.686 -1124.84 0 0 0 1535.92 0 0 0 0 2391.35 -1902.91 0 0 0 0 0 0 0 0 0 0 0 0 0 0 
0 0 0 0 0 0 -913.343 0.07 0 1677.98 0 0 0 0 0 0 0 0 0 0 0 0 0 0 0 0 0 1421.48 0 0 0 0 0 0 0 1132.31 2379.3 0 0 -61.2659 0 0 0 0 
0 0 0 2253.72 0 0 1804.79 0 0.07 0 0 0 0 0 0 0 0 -2015.37 0 0 0 0 1105.91 0 -120.472 0 0 0 0 0 0 0 0 0 0 1146.05 0 0 0 0 0 0 0 0 
0 0 0 -183.95 233.848 244.377 0 4.34889 0 0 0 0 0 0 0 0 0 0 0 0 0 0 0 0 638.829 0 1527.53 0 0 0 1570.25 0 0 841.472 0 517.823 0 -526.215 0 0 0 0 0 0 
0 0 0 0 0 0 0 0 0 0 0.03 0 0 0 0 0 0 0 2477.42 0 1755.65 0 0 0 0 0 0 0 0 2290.95 0 0 0 0 302.973 0 556.581 0 0 0 0 0 0 0 
0 1679.2 0 0 0 0 0 0 0 0 0 0.06 829.417 0 0 0 0 0 0 -411.466 0 0 0 0 0 0 0 0 0 0 2252.65 0 0 0 0 -789.285 0 0 0 0 0 0 0 0 
0 0 0 0 0 1950.82 0 0 0 0 0 1799.3 0.05 0 0 0 0 -149.312 -1587.04 0 0 0 0 0 0 0 0 0 0 0 -1994.92 0 0 447.172 0 1182.67 0 0 0 0 0 0 0 0 
0 0 0 0 0 0 0 0 0 0 0 0 0 0.07 449.309 0 0 0 0 0 1389.58 0 0 2095.78 0 0 0 -995.895 0 0 0 0 0 0 0 0 0 0 0 0 0 0 0 0 
0 0 0 0 -1556.06 0 0 0 0 0 0 0 0 1489.99 0.02 0 0 0 0 -1391.11 0 0 0 -1975.84 0 0 1285.67 0 0 0 0 0 0 0 946.455 0 0 2077.01 0 0 0 0 0 0 
0 0 -1259.88 0 0 0 0 0 0 0 0 0 0 0 0 0.06 0 0 0 0 0 0 0 0 0 0 0 0 0 0 0 0 0 0 1382.26 0 0 0 0 0 1358.46 0 0 0 
0 0 1847.36 0 0 0 0 0 0 0 0 0 0 0 0 0 0.07 0 0 1179.31 0 0 0 0 0 0 0 0 -75.7622 0 0 0 0 0 0 0 0 0 0 0 0 0 0 0 
0 0 2043.44 0 0 0 0 0 -1467.25 0 0 0 -1795.48 0 0 0 0 0.08 0 163.808 0 0 0 0 0 0 0 0 0 0 0 0 0 2015.06 0 0 0 0 0 0 0 0 0 0 
0 0 0 0 0 0 1981.19 0 0 0 2077.01 0 -404.294 0 0 0 0 0 0.09 0 0 0 0 0 0 0 0 0 0 0 0 -1141.77 1302.45 0 -1308.56 0 0 0 0 0 0 0 0 0 
0 0 0 0 0 0 1625.95 0 0 0 0 527.131 0 0 -670.415 0 2411.19 1020.46 0 0.04 0 0 0 0 0 760.75 0 -603.275 -418.943 1986.53 1245.54 0 -694.678 0 0 0 0 0 0 0 0 0 -318.69 0 
0 0 0 0 0 2093.65 0 0 0 0 506.836 0 0 2120.81 0 0 0 0 0 0 0.04 0 0 0 0 0 0 0 0 0 0 0 -772.652 0 0 0 0 1316.95 0 0 0 0 0 0 
0 -719.703 -35.6304 0 0 0 0 0 0 0 0 0 0 0 0 0 0 0 0 0 0 0.01 0 0 0 0 0 0 0 0 0 0 1757.03 0 0 0 0 0 198.752 0 0 0 0 0 
0 0 0 0 0 0 0 0 1402.25 0 0 0 0 0 0 0 0 0 0 0 0 0 0.06 0 0 0 0 0 0 0 0 1052.35 0 0 0 0 -393.307 0 0 0 0 0 0 0 
0 0 1304.44 0 0 0 1402.71 0 0 0 0 0 0 -1246.3 -302.21 0 0 0 0 0 0 0 0 0.08 0 956.984 0 0 0 0 0 -1782.2 0 0 1371.73 0 0 0 -733.131 0 0 0 0 0 
0 0 0 0 0 0 0 0 1836.22 1916.03 0 0 0 0 0 0 0 0 0 0 0 0 0 0 0.02 0 0 0 0 0 0 0 0 0 0 0 0 0 0 0 0 0 0 0 
0 0 0 0 0 0 0 0 0 0 0 0 0 0 0 0 0 0 0 -1998.43 0 0 0 1577.27 0 0.02 2457.88 0 0 0 0 53.7889 -203.177 0 0 0 0 0 0 0 0 0 0 0 
0 29.6793 0 0 0 -2043.9 0 0 0 541.932 0 0 0 0 -177.084 0 0 0 0 0 0 0 0 0 0 2204.58 0.05 0 0 0 0 0 0 0 0 0 0 1460.39 0 0 0 0 0 0 
2226.71 0 0 -600.986 0 0 0 1014.36 0 0 0 0 0 -2299.34 0 0 0 0 0 1556.98 0 0 0 0 0 0 0 0.01 0 0 0 0 0 0 0 0 0 0 0 0 0 0 0 0 
0 416.807 0 -1753.06 0 0 2483.37 0 0 0 0 0 0 0 0 0 1747.57 0 0 -1089.28 0 0 0 0 0 0 0 0 0.04 1021.84 0 0 0 0 0 0 0 0 0 0 0 0 0 0 
0 0 0 0 0 0 -1297.57 0 0 0 2393.64 0 0 0 0 0 0 0 0 -1213.19 0 0 0 0 0 0 0 0 -1455.35 0.05 0 0 0 -349.666 2281.64 0 0 0 0 0 0 0 0 0 
0 0 0 0 0 939.131 0 0 0 438.627 0 -150.227 1970.05 0 0 0 0 0 0 -493.255 0 0 0 0 0 0 0 0 0 0 0.08 0 1857.28 -119.709 0 0 0 0 0 0 0 0 0 0 
0 0 0 0 2233.42 0 0 0 0 0 0 0 0 0 0 0 0 0 513.855 0 0 0 -2219.69 624.79 0 2402.04 0 0 0 0 0 0.06 0 -2234.18 0 0 0 0 0 0 0 0 0 0 
0 0 0 0 0 0 0 0 0 0 0 0 0 0 0 0 0 0 -7.70592 1805.09 626.926 1398.28 0 0 0 -2092.27 0 0 0 0 -1334.35 0 0.09 1830.27 866.497 0 0 0 0 0 0 0 0 0 
0 0 0 0 0 0 0 0 0 195.7 0 0 1893.6 0 0 0 0 2296.29 0 0 0 0 0 0 0 0 0 0 0 -812.784 781.045 1047.17 -2426.76 0.08 0 0 1594.52 0 0 0 0 0 0 0 
0 0 -1129.87 0 0 0 0 0 0 0 423.673 0 0 0 1698.74 690.252 0 0 2209.92 0 0 0 0 1977.98 0 0 0 0 0 1062.12 0 0 1119.34 0 0.01 0 0 0 23.8807 0 0 -205.466 0 0 
-1843.7 0 0 0 0 0 0 1288.26 2099.6 1836.83 0 1264.92 1947.16 0 0 0 0 0 0 0 0 0 0 0 0 0 0 0 0 0 0 0 0 0 0 0.02 0 -498.291 0 0 0 0 0 0 
0 0 0 1611 0 955 0 -566.805 0 0 -1396.91 0 0 0 0 0 0 0 0 0 0 0 966.75 0 0 0 0 0 0 0 0 0 0 -956.679 0 0 0.05 0 0 0 0 0 0 0 
0 0 0 0 0 125.813 0 0 0 1923.66 0 0 0 0 1449.1 0 0 0 0 0 -279.778 0 0 0 0 0 1833.93 0 0 0 0 0 0 0 0 -1725.29 0 0.01 0 0 0 0 0 0 
0 0 0 0 0 0 0 0 0 0 0 0 0 0 0 0 0 0 0 0 0 2165.82 0 1578.8 0 0 0 0 0 0 0 0 0 0 527.131 0 0 0 0.06 0 0 0 0 0 
0 0 0 0 0 292.596 0 2324.82 0 0 0 0 0 0 0 0 0 0 0 0 0 0 0 0 0 0 0 0 0 0 0 0 0 0 0 0 0 0 0 0.08 0 0 0 0 
0 0 0 0 0 0 0 0 0 0 0 0 0 0 0 853.221 0 0 0 0 0 0 0 0 0 0 0 0 0 0 0 0 0 0 0 0 0 0 0 0 0.04 0 0 0 
0 0 0 0 0 0 0 0 0 0 0 0 0 0 0 0 0 0 0 0 0 0 0 0 0 0 0 0 0 0 0 0 0 0 2195.88 0 0 0 0 0 0 0.06 0 0 
0 0 0 0 0 0 0 0 0 0 0 0 0 0 0 0 0 0 0 1373.26 0 0 0 0 0 0 0 0 0 0 0 0 0 0 0 0 0 0 0 0 0 0 0.02 924.787 
0 0 0 0 0 0 0 0 0 0 0 0 0 0 0 0 0 0 0 0 0 0 0 0 0 0 0 0 0 0 0 0 0 0 0 0 0 0 0 0 0 0 1176.72 0 
