*Vertices 47
*Matrix 
0.08 0 -2068.77 0 0 1580.32 0 1603.82 0 0 2086.32 0 0 0 2271.57 771.279 0 0 0 0 1064.56 0 -1181.45 716.651 0 0 0 0 2091.81 1247.83 0 2421.57 0 879.925 0 0 0 0 1184.04 -1348.54 111.927 0 0 0 0 391.781 0 
0 0.05 0 -1165.12 0 -2485.05 0 2160.02 0 0 0 0 1651.28 1939.53 -2175.74 0 0 193.869 0 685.369 0 -2022.08 0 0 0 0 0 1645.33 -1294.98 1795.94 0 0 0 0 -1238.98 804.086 0 0 0 0 0 2280.88 0 0 0 0 0 
1735.66 0 0.09 0 -1182.97 0 0 0 0 0 0 0 1676.92 0 0 -571.078 -1278.65 0 0 0 0 0 1376.16 0 0 0 2056.72 0 0 0 0 0 0 0 -1645.18 2146.9 0 0 0 0 0 0 0 0 0 0 0 
0 977.737 0 0.02 0 0 0 0 0 0 0 0 1093.71 1450.47 1058.15 0 1555.76 0 -758.766 1065.94 1020.46 0 2440.34 1507.39 -1292.84 0 0 0 0 0 0 0 1441.31 0 0 249.565 0 0 0 0 0 0 0 0 1954.18 0 0 
0 0 1531.19 0 0.07 0 0 0 552.156 0 0 0 0 0 0 0 0 0 0 0 0 1104.39 0 0 0 0 0 0 1734.44 -1581.85 0 0 0 65.6911 2408.14 0 -524.384 0 0 0 822.092 0 0 0 -656.529 0 0 
1342.28 -1274.53 0 0 0 0.09 2077.78 0 254.448 0 1836.22 611.82 0 0 0 0 0 0 0 2203.21 0 0 0 0 0 1644.72 1554.08 0 0 0 -1279.11 2318.26 0 0 0 0 0 0 -2148.12 0 0 -1764.96 0 0 0 0 2199.55 
0 0 0 0 0 -2297.05 0.06 2090.9 0 1597.57 0 0 0 0 0 1847.67 0 0 0 0 0 0 0 0 0 0 0 1492.89 -1403.47 0 0 0 767.006 0 0 1532.11 0 -1740.55 0 779.214 0 -40.8185 2227.62 0 -1486.79 1061.97 0 
1740.09 2261.96 0 0 0 0 2096.7 0.07 0 -252.464 -914.869 0 861.309 0 0 0 0 0 0 992.386 0 0 0 0 0 0 0 0 0 0 0 0 1459.62 0 0 0 0 0 0 0 0 0 1500.06 619.755 1735.66 1067.61 75.3044 
0 0 0 0 1690.65 -2198.78 0 0 0 0 2192.98 -1298.79 0 0 0 0 0 0 0 0 0 0 364.162 283.746 0 0 33.3415 -962.935 0 0 0 0 0 0 2257.84 0 -1942.58 0 0 0 147.633 0 2195.88 -1509.22 0 0 0 
0 0 0 0 0 0 -2353.82 1784.49 0 0.01 0 0 2402.8 0 0 -2132.56 1752.75 0 1242.03 0 202.414 560.244 0 0 2206.56 2039.78 2438.35 158.62 -1898.94 0 0 -138.325 2469.79 210.807 0 0 -829.722 0 0 0 0 0 0 0 0 0 0 
2101.28 0 0 0 0 2440.79 0 1577.88 -1638.62 0 0.06 1181.91 0 2383.72 -1903.36 0 0 0 0 0 0 0 0 0 1323.97 0 1591.62 0 0 0 0 0 500.275 0 0 0 0 0 0 -771.279 0 0 -299.463 0 0 0 0 
0 0 0 0 0 -681.402 0 0 2459.41 0 2060.84 0.09 0 1249.2 12.2837 0 0 0 971.023 0 0 0 0 -339.29 0 -2101.43 0 0 -927.686 267.266 0 0 -363.552 2066.64 0 0 2454.22 1045.79 0 0 0 0 0 -1295.74 0 -337.001 0 
0 1979.2 -2305.44 1660.74 0 0 0 -1919.39 0 921.43 0 0 0.04 0 0 0 0 2438.2 0 1342.28 0 0 0 0 0 0 0 0 0 0 0 0 0 2181.08 0 0 0 0 0 0 -777.841 0 -1295.28 0 0 1498.99 0 
0 2368.92 0 -792.489 0 0 0 0 0 0 -231.864 2016.28 0 0.05 0 0 0 0 2498.02 1348.84 0 0 0 0 0 0 0 0 0 0 0 0 0 2244.56 0 0 0 0 -1347.62 937.91 0 0 337.306 -410.855 -1634.5 0 0 
-776.925 1815.32 0 181.661 0 0 0 0 0 0 -11.6733 1788.16 0 0 0.09 0 0 0 0 0 0 -575.655 0 0 -118.183 0 0 0 1184.8 1485.26 -105.213 0 0 0 0 2496.64 0 0 1132.01 140.004 0 -1970.96 0 -1758.1 0 0 0 
2222.89 0 -1596.8 0 0 0 1681.34 0 0 -1102.1 0 0 0 0 0 0.03 0 0 0 0 0 0 -1974.47 2252.95 280.694 -1004.29 0 0 0 0 2410.12 0 0 295.953 0 2287.74 385.525 -1475.49 0 0 1164.51 0 -2277.52 2162.47 0 0 2178.03 
0 0 1900.16 -1965.93 0 0 0 0 0 -368.74 0 0 0 0 0 0 0.08 2131.79 1104.24 0 0 0 0 0 0 0 1530.58 533.692 0 0 0 0 -0.228889 0 -1619.69 0 0 0 0 0 0 598.392 0 0 510.956 1359.37 0 
0 -66.1489 0 0 0 0 0 0 0 0 0 0 -1253.62 0 0 0 1893.75 0.01 0 0 0 0 0 1237.14 0 0 0 0 1957.69 -2494.35 0 0 0 0 -1968.67 0 292.291 -745.796 543.611 0 1655.4 0 0 1662.11 0 0 0 
0 0 0 349.818 0 0 0 0 0 -197.989 0 1809.21 0 547.578 0 0 -1820.96 0 0 0 0 1451.84 1941.05 0 1620.91 0 0 543.458 -608.31 0 0 0 0 0 0 -551.241 0 0 0 0 0 0 251.701 -2356.72 391.781 -1902.45 0 
0 1872.23 0 -2209.46 0 1974.01 0 1062.43 0 0 0 0 639.134 923.566 0 0 0 0 0 0.05 0 588.015 0 0 -764.107 0 -633.641 0 -1637.39 272.454 -2054.28 0 0 0 0 0 1765.27 0 0 0 0 1801.13 2288.51 0 0 0 0 
2375.33 0 0 2200 0 0 0 0 0 -130.696 0 0 0 0 0 0 0 0 0 0 0.04 1908.09 0 1581.39 0 0 2261.96 -1370.82 0 0 0 0 -677.129 1926.56 -189.444 0 0 1399.96 0 2359.31 0 0 0 0 -2426.76 0 0 
0 2392.12 0 0 -1808.6 0 0 0 0 1050.83 0 0 0 0 2193.44 0 0 0 398.801 476.318 505.463 0.04 -382.168 0 0 0 0 -1869.49 0 0 715.43 2450.56 1379.67 0 0 0 0 0 1688.82 0 533.082 -826.67 0 -324.335 0 0 0 
197.073 0 -2344.36 1538.21 0 0 0 0 1504.33 0 0 0 0 0 0 337.153 0 0 1205.4 0 0 -610.752 0.02 0 0 0 -633.335 -775.399 0 -287.561 0 0 0 1597.26 0 2200 0 0 0 0 0 0 -153.737 1354.34 252.159 0 0 
-910.443 0 0 -292.444 0 0 0 0 2399.75 0 0 689.642 0 0 0 2323.76 0 1325.04 0 0 -2081.9 0 0 0.01 0 401.852 0 0 -1662.42 0 0 0 0 0 0 0 0 0 107.501 515.229 0 0 2165.36 164.266 0 -1686.68 0 
0 0 0 1759.01 0 0 0 0 0 16.2511 806.528 0 0 0 2024.22 1784.95 0 0 101.093 60.8081 0 0 0 0 0.06 0 0 0 0 0 2496.34 -736.793 0 -874.126 0 0 0 756.325 0 0 0 0 0 0 0 -407.804 0 
0 0 0 0 0 502.869 0 0 0 25.8644 0 -415.433 0 0 0 -239.189 0 0 0 0 0 0 0 2264.85 0 0.06 -411.924 0 0 0 0 0 0 0 -2313.38 0 0 0 0 0 0 0 0 0 0 1223.11 0 
0 0 -899.915 0 0 -29.0689 0 0 -302.515 43.5652 2133.17 0 0 0 0 0 2268.21 0 0 1087.45 1027.94 0 -336.848 0 0 -371.639 0.09 0 0 0 0 2175.28 0 0 0 0 1846.75 0 1283.38 0 0 0 0 0 0 0 0 
0 1811.35 0 0 0 0 2444.15 0 1765.57 1970.66 0 0 0 0 0 0 1318.93 0 -1200.37 0 -2199.85 1360.13 1233.79 0 0 0 0 0 855.51 1292.08 0 358.211 0 0 2275.38 0 0 0 0 0 0 1005.97 0 0 0 0 0 
866.497 2427.21 0 0 222.861 0 -1106.68 0 0 796.152 0 -655.614 0 0 2189.02 0 0 1564.61 1819.59 1823.1 0 0 0 1983.17 0 0 0 215.384 0.05 0 0 0 0 0 0 -2368.62 0 0 0 0 918.073 0 0 0 0 1466.64 0 
-1706.98 2054.73 0 0 -432.676 0 0 0 0 0 0 -1319.54 0 0 1824.02 0 0 2316.43 0 -903.577 0 0 1758.4 0 0 0 0 1956.01 0 0.08 0 0 -2468.57 1553.93 0 0 0 1725.75 0 0 0 0 0 0 0 0 0 
0 0 0 0 0 -57.1459 0 0 0 0 0 0 0 0 -1854.69 2485.05 0 0 0 2472.23 0 -870.006 0 0 887.86 0 0 0 0 0 0.03 -1578.34 336.39 1374.78 966.75 0 -880.078 0 0 0 1612.83 0 810.343 0 -976.974 0 0 
1810.59 0 0 0 0 1431.55 0 0 0 -33.3415 0 0 0 0 0 0 0 0 0 0 0 410.398 0 0 1301.69 0 -1171.68 1978.59 0 0 786.996 0.06 179.83 0 981.704 0 0 0 0 2151.17 0 1319.54 2496.03 -2448.58 0 1792.12 0 
0 0 0 -596.103 0 0 2423.25 -680.792 0 2028.64 -789.59 1872.54 0 0 0 0 -203.787 0 0 0 1653.57 -1175.95 0 0 0 0 0 0 0 1182.67 -748.543 -1439.79 0.01 0 0 0 0 0 0 0 0 0 2316.13 0 0 0 2232.35 
2308.19 0 0 0 1461.15 0 0 0 0 -153.737 0 -347.53 -2496.95 395.444 0 -107.807 0 0 0 0 2387.69 0 63.7074 0 1838.66 0 0 0 0 461.058 -874.126 0 0 0.05 0 0 0 0 0 0 0 0 0 0 0 -941.725 0 
0 -1033.89 403.378 0 298.09 0 0 0 1132.16 0 0 0 0 0 0 0 -1188.47 1423 0 0 -285.577 0 0 0 0 -710.089 0 1278.8 0 0 -575.655 755.257 0 0 0.02 2058.24 0 -2343.29 0 -2376.86 0 2483.37 0 0 1207.85 0 0 
0 -1083.03 2029.71 960.189 0 0 -564.516 0 0 0 0 0 0 0 896.863 1239.59 0 0 116.352 0 0 0 -661.412 0 0 0 0 0 -423.063 0 0 0 0 0 1423.76 0 0 0 0 0 0 1337.7 0 1688.06 0 0 0 
0 0 0 0 91.3266 0 0 0 -820.872 -1339.23 0 2404.48 0 0 0 6.48518 0 -1664.1 0 -851.695 0 0 0 0 0 0 1579.87 0 0 0 1137.5 0 0 0 0 0 0.03 0 0 0 0 0 0 0 0 866.344 0 
0 0 0 0 0 0 -105.213 0 0 0 0 2198.63 0 0 0 869.549 0 684.606 0 0 -2193.29 0 0 0 2323.6 0 0 0 0 -1946.09 0 0 0 0 -1616.64 0 0 0.05 0 794.015 1168.94 2374.87 0 -702.46 0 -2027.88 0 
-1645.48 0 0 0 0 1641.21 0 0 0 0 0 0 0 2409.21 2292.47 0 0 -709.174 0 0 0 -298.853 0 -1629.76 0 0 2265.62 0 0 0 0 0 0 0 0 0 0 0 0.06 0 0 0 0 -1004.14 0 0 0 
2080.07 0 0 0 0 0 605.869 0 0 0 1524.48 0 0 1534.85 -1606.57 0 0 0 0 0 311.823 0 0 -1941.97 0 0 0 0 0 0 0 503.174 0 0 -518.586 0 0 2425.23 0 0.08 -1362.73 -2489.32 -931.654 2387.84 0 0 0 
-2055.96 0 0 0 -121.54 0 0 0 1345.33 0 0 0 1716.74 0 0 -1322.9 0 1876.66 0 0 0 611.515 0 0 0 0 0 0 -1741.16 0 2042.68 0 0 0 0 0 0 1361.96 0 1769.08 0.08 1513.95 0 817.667 0 0 2278.59 
0 400.327 0 0 0 -1541.26 -1992.02 0 0 0 0 0 0 0 1038.62 0 2434.39 0 0 -491.424 0 -187.307 0 0 0 0 0 -5.56963 0 0 0 -263.146 0 0 1243.1 1642.58 0 2319.94 0 791.116 -162.74 0.06 -77.2881 0 0 0 -239.799 
0 0 0 0 0 0 -2190.08 -818.888 -1327.17 0 2059.92 0 1588.41 -1650.82 0 -64.6229 0 0 1597.42 -48.7533 0 0 2048.33 -2472.99 0 0 0 0 0 0 2187.34 1347.01 1219.75 0 0 0 0 0 0 -1258.66 0 1472.59 0.02 0 0 0 0 
0 0 0 0 0 0 0 2258.45 -198.904 0 0 -1637.55 0 -622.959 1586.89 2148.43 0 1741.61 1199.61 0 0 -1197.47 -195.853 -2413.02 0 0 0 0 0 0 0 -878.094 0 0 0 41.1237 0 -168.233 1315.58 566.958 1917.25 0 0 0.03 -466.247 0 0 
0 0 0 -1698.74 1993.55 0 898.846 855.052 0 0 0 0 0 2394.71 0 0 -2363.89 0 -1497.47 0 -1722.24 0 2327.11 0 0 0 0 0 0 0 2076.1 0 0 0 804.544 0 0 0 0 0 0 0 0 -1322.14 0.05 0 0 
1059.07 0 0 0 0 0 -1961.96 1117.97 0 0 0 1614.96 -745.338 0 0 0 -747.78 0 -525.3 0 0 0 0 -1900.01 2086.63 1608.1 0 0 1278.8 0 0 -119.556 0 -299.31 0 0 -1562.17 636.387 0 0 0 0 0 0 0 0.09 0 
0 0 0 0 0 -1435.36 0 2271.87 0 0 0 0 0 0 0 820.719 0 0 0 0 0 0 0 0 0 0 0 0 0 0 0 0 -37.1563 0 0 0 0 0 0 0 2458.34 -363.552 0 0 0 0 0.07 
