*Vertices 64
*Matrix 
0 0 0 0 2123.86 1178.09 0 0 0 0 -604.801 2249.6 0 0 -1076.46 2386.17 149.159 0 0 0 0 0 1296.81 -1378.29 0 0 -1659.83 0 0 0 0 -1592.38 0 0 0 0 0 0 2221.67 0 0 2219.38 -453.276 -1230.43 0 0 1114.61 0 2121.27 1693.4 0 0 0 0 0 0 0 -735.572 474.944 0 0 0 0 0 
0 0.09 -303.125 0 0 0 0 0 -105.365 0 0 0 0 0 2003.77 1174.58 0 0 0 0 0 0 0 0 -480.743 0 1002.3 0 0 0 6.94296 0 0 0 0 0 0 0 -1338.92 462.127 0 0 -969.802 0 0 -772.805 0 388.577 0 0 0 -1831.95 0 0 0 0 546.205 1168.48 1121.02 0 -791.421 0 0 0 
0 1462.37 0.03 0 0 -1394.92 0 0 0 1498.99 0 958.205 0 944.624 0 0 0 0 935.774 0 0 0 0 0 0 -1776.25 2041.61 0 0 0 0 0 0 466.247 0 0 -1856.36 0 0 0 0 0 -662.633 0 0 0 0 0 0 2286.22 744.118 0 -2290.34 0 -1611.76 0 0 1857.43 0 0 0 936.995 0 254.295 
0 0 0 0.05 0 0 0 0 931.043 0 0 0 0 0 -585.727 0 0 0 0 -2037.19 0 0 0 0 0 0 0 0 0 0 0 -452.208 -54.2467 0 -2447.51 1400.72 282.372 306.787 0 1230.12 -453.276 0 0 0 0 2225.79 0 0 0 1040.6 0 0 0 0 -1873.91 0 0 2161.55 0 2486.27 0 0 0 0 
989.944 0 0 0 0.02 0 0 0 0 0 484.252 -2366.48 0 620.212 -1802.96 0 0 774.789 785.928 0 0 0 1995.22 0 -1010.85 -915.326 0 1842.48 0 0 -1050.98 0 0 0 0 0 0 0 0 -483.947 0 0 0 2355.19 0 0 -910.443 0 0 0 0 0 0 0 0 0 0 0 0 0 0 0 0 0 
-2154.07 0 477.844 0 0 0.08 0 -2208.55 0 0 0 -1034.5 -1024.28 0 -2370.75 1847.82 0 0 0 0 0 0 1900.46 2143.54 0 0 -334.407 0 0 -624.18 1211.66 1714.91 0 1881.69 0 2410.58 0 2121.27 0 0 1632.21 0 -2168.87 0 0 0 0 1096.91 0 0 0 1346.4 -1882 0 0 -1146.5 0 0 1140.55 0 2334.28 0 15.3356 0 
0 0 0 0 0 0 0.08 0 0 805.155 -598.849 0 0 0 2046.19 1488.92 0 -1302.76 100.33 0 0 0 0 0 0 1341.82 0 0 0 2395.47 0 -673.009 0 0 -2475.89 0 0 -1757.64 318.842 0 -2006.36 0 1959.82 0 0 0 0 0 0 0 -2398.68 0 0 0 0 2247 0 1637.85 0 0 0 0 0 -283.746 
0 0 0 0 0 1703.16 0 0 0 1078.75 0 0 0 0 0 0 -1212.12 0 0 0 0 0 871.227 0 0 1086.99 0 2047.41 0 0 1032.06 -105.518 -1089.43 0 0 0 0 -1325.95 112.69 618.381 0 1063.34 0 0 93.6155 0 1439.63 0 -515.534 0 0 0 0 0 0 0 -1501.28 2262.11 0 0 0 1445.43 0 0 
0 1640.6 0 2171.47 0 0 0 0 0.03 0 0 0 0 1425.14 0 -464.263 889.538 0 0 0 -988.266 -174.032 0 -684.759 0 0 0 0 0 0 266.655 2144 -1295.28 0 0 1060.14 -1134.91 0 0 0 0 0 214.927 0 0 0 -1898.33 0 0 0 0 0 0 0 0 0 0 0 0 0 0 0 0 0 
0 0 -1509.98 0 0 0 1718.12 277.49 0 0.04 0 0 0 0 1547.36 2301.93 0 0 -625.858 0 0 0 0 0 798.135 0 -1244.01 586.795 -2172.99 0 0 0 -799.356 0 0 0 0 0 0 1865.83 0 0 -441.832 0 0 0 0 -1346.4 1833.93 0 1163.29 0 0 0 0 2427.67 0 0 -1814.25 -585.574 0 0 0 0 
1025.96 0 0 0 961.104 0 -73.4733 0 0 0 0.08 2222.74 0 0 1275.29 0 0 0 0 0 0 0 1706.37 0 0 0 0 0 0 2400.2 -152.669 0 0 0 -1233.63 0 0 2072.44 -1952.19 -2236.93 0 -1380.89 0 0 1346.4 1016.04 2209.01 0 0 0 138.783 0 0 0 0 0 0 0 0 0 0 0 0 0 
-827.891 0 630.436 0 1773.96 326.014 0 0 0 0 2403.41 0.08 0 0 0 0 0 0 0 94.2259 -1592.68 0 0 0 0 0 0 0 0 0 0 0 0 0 0 0 -1624.12 0 2116.69 -28.4585 0 0 0 -1155.81 0 0 -1481.44 2001.79 0 0 278.1 0 0 0 0 0 0 0 0 0 0 0 0 0 
0 0 0 0 0 -1278.65 0 0 0 0 0 0 0 0 -367.977 0 0 499.512 0 0 1708.04 -2044.97 0 -1386.23 -166.097 0 0 0 0 0 0 0 -254.448 0 0 0 1382.26 1237.91 564.364 0 1062.27 0 0 0 0 2060.23 0 0 -508.057 0 -1293.3 0 0 0 283.135 1582.46 2346.49 -1874.37 0 0 0 0 0 0 
0 0 306.33 0 -1280.33 0 0 0 -2294.76 0 0 0 0 0.03 0 0 1945.02 0 0 735.267 0 0 0 -96.6674 0 0 0 -1683.63 0 0 -923.566 0 0 0 0 990.097 -2373.35 0 -826.06 0 2427.37 0 0 0 965.682 1945.63 0 116.199 2214.35 0 0 0 2085.56 0 0 0 551.393 -1554.38 0 0 0 0 0 0 
58.977 1781.75 0 2155.75 -1722.69 -973.312 770.211 0 0 -419.095 -869.396 0 -1535 0 0.04 0 0 1499.91 0 0 0 0 0 0 0 0 0 1853.31 1334.65 -984.603 843.913 1565.68 0 0 2177.27 457.701 0 0 0 0 0 0 0 0 0 -741.218 0 0 0 0 0 -226.371 0 0 73.1681 -401.395 0 -656.682 0 0 0 0 2208.09 0 
2379.3 1965.93 0 0 0 1559.11 -1846.9 0 -1741.92 -787.301 0 0 0 0 0 0.08 -1165.88 0 0 0 0 1194.72 0 0 0 0 0 0 0 0 202.719 -365.993 0 2230.83 0 0 0 0 0 0 0 0 0 0 -2135.76 1915.27 -943.861 0 -2187.8 0 0 0 0 0 0 0 0 1142.54 0 808.206 189.138 994.369 0 0 
-1329.16 0 0 0 0 0 0 -776.925 1638 0 0 0 0 1786.78 0 2023.3 0.01 0 0 -274.743 0 0 -1204.34 0 1003.52 1994.46 0 2075.03 0 2261.19 0 0 -1609.32 0 -2197.56 179.983 302.667 0 0 0 -2348.78 0 0 0 0 0 0 0 0 0 0 0 0 -574.282 0 0 1497.92 0 0 1828.59 0 0 0 0 
0 0 0 0 -580.691 0 -1914.2 0 0 0 0 0 2160.48 0 2132.4 0 0 0.02 0 0 -2492.68 0 0 1971.88 0 -415.738 0 -1689.43 2107.68 0 0 0 0 1473.2 0 0 0 1118.73 341.884 0 -2458.95 2136.07 0 -762.886 0 0 0 0 0 0 0 0 -2043.75 0 -1247.52 0 0 0 0 0 0 1949.14 0 0 
0 0 -1070.36 0 951.643 0 -1.60222 0 0 2451.48 0 0 0 0 0 0 0 0 0.01 0 0 0 0 2290.64 0 0 0 1711.25 0 -113.453 0 -652.257 -359.432 0 0 1867.66 0 0 0 0 0 1584.14 0 0 0 0 0 2236.93 2128.74 0 362.636 0 0 433.744 0 0 0 0 0 0 0 0 0 0 
0 0 0 1830.27 0 0 0 0 0 0 0 459.38 0 1746.5 0 0 -120.014 0 0 0.06 509.735 -2168.87 0 0 0 0 0 0 0 0 0 0 0 0 0 -579.012 -1935.71 0 -1550.42 741.676 582.522 0 125.66 0 0 2331.54 0 0 0 0 0 -10.1474 0 0 107.044 0 -1586.12 0 0 2444.91 1652.5 0 0 0 
0 0 0 0 0 0 0 0 -127.338 0 0 -849.712 1553.93 0 0 0 0 -161.061 0 780.282 0.08 0 0 482.574 0 0 -843.15 2051.53 1298.33 0 0 78.2037 0 -145.955 0 -592.898 857.952 1249.5 0 0 0 0 0 0 0 0 0 45.8541 1975.23 0 0 0 0 -837.199 683.081 0 0 0 0 0 0 -832.011 -1867.5 0 
0 0 0 0 0 0 0 0 1230.12 0 0 0 1650.36 0 0 -1190.3 0 0 0 312.128 0 0.02 0 0 0 0 0 0 0 0 2244.71 0 0 0 2006.36 0 1550.57 -770.058 0 0 2040.54 0 0 0 -745.491 0 0 0 2400.97 0 0 0 0 0 0 0 589.846 0 0 0 0 0 0 0 
469.909 0 0 0 1479.31 473.876 0 -338.832 0 0 2047.26 0 0 0 0 0 -723.212 0 0 0 0 0 0.06 -1013.29 0 0 1380.58 0 0 0 -2129.51 0 18.2348 1171.07 0 -975.906 2047.41 0 965.529 0 0 0 0 0 0 0 -575.961 0 0 0 0 0 1645.94 0 2442.47 0 -255.211 866.344 0 0 -706.275 0 0 0 
1896.34 0 0 0 0 -534.761 0 0 2367.09 0 0 0 -324.946 1685.46 0 0 0 2231.44 2299.04 0 -1161.15 0 -1019.09 0.05 0 1092.33 0 0 0 0 0 0 1036.79 781.35 0 171.285 1624.12 0 0 -630.131 0 830.943 0 0 0 0 -369.961 0 0 0 0 0 -885.571 0 -1476.87 0 -589.084 0 0 0 0 1329 0 -1223.11 
0 -902.051 0 0 1031.6 0 0 0 0 -1888.1 0 0 1742.07 0 0 0 471.892 0 0 0 0 0 0 0 0.08 1178.55 0 0 1773.51 0 0 457.701 0 503.174 0 -1177.94 0 0 545.595 0 -76.22 0 0 0 0 -1414 -2374.26 0 0 0 0 -416.959 -460.448 0 0 0 0 0 0 1568.27 0 0 0 0 
0 0 -1919.39 0 -2059.01 0 2165.36 -4.80667 0 0 0 0 0 0 0 0 -1721.78 -1504.79 0 0 0 0 0 2096.39 1186.03 0.01 1151.39 0 850.627 0 0 2045.58 0 0 0 250.481 0 2419.28 0 0 0 0 1568.27 0 0 0 -643.254 2469.79 0 -723.212 0 -1833.48 1224.63 0 0 0 -232.322 0 0 0 2160.33 0 0 0 
916.7 557.192 851.39 0 0 -1820.35 0 0 0 -2279.66 0 0 0 0 0 0 0 0 0 0 367.214 0 1256.37 0 0 1376.61 0.07 0 0 0 0 0 -802.408 0 2101.58 0 2378.23 -1685.31 0 0 0 0 0 -166.25 0 2390.59 0 2333.06 0 1363.95 -73.9311 0 0 0 0 1470.61 -854.595 0 0 0 0 0 0 -2186.57 
0 0 0 0 -1467.86 0 0 -1012.53 0 35.1726 0 0 0 -1203.27 702.612 0 2401.88 1918.78 -1245.54 0 2394.1 0 0 0 0 0 0 0.05 2033.52 0 1953.41 -2265.16 378.201 -701.239 0 1840.19 0 0 0 0 541.169 1283.07 0 0 0 0 429.777 0 0 0 0 0 853.069 0 0 0 0 0 0 0 0 0 0 1901.53 
0 0 0 0 0 0 0 0 0 756.63 0 0 0 0 -987.503 0 0 2071.67 0 0 1635.56 0 0 0 -1684.55 362.026 0 176.626 0.09 0 0 -196.463 0 0 -2151.02 -1815.78 0 0 0 0 0 0 0 -232.627 2129.81 0 0 0 0 0 0 0 0 1119.5 0 0 0 0 0 0 0 2462.31 0 0 
0 0 0 0 0 2041.76 1989.12 0 0 0 2031.24 0 0 0 -6.33259 0 2472.99 0 -958.815 0 0 0 0 0 0 0 0 0 0 0.03 0 0 0 0 0 0 0 -762.581 0 0 305.414 0 0 0 -534.303 -664.769 0 0 0 0 0 2076.56 2411.5 0 1182.21 0 0 -2257.84 0 991.928 0 0 -689.947 159.993 
0 2187.34 0 0 1419.19 -804.697 0 2028.64 1842.48 0 -618.839 0 0 -458.464 2285.3 431.761 0 0 0 0 0 -1575.44 -1920.91 0 0 0 0 2044.51 0 0 0 0 0 0 0 -1154.9 0 -1215.48 0 1562.62 1039.08 0 597.018 1384.7 713.294 0 0 0 0 1765.57 0 0 0 0 0 0 1117.05 0 0 0 0 0 0 0 
2472.69 0 0 -1735.36 0 2323.91 -1426.21 2385.56 -295.038 0 0 0 0 0 -870.922 814.615 0 0 -1650.06 0 2494.81 0 0 0 706.275 849.406 0 -1245.69 -379.116 0 0 0.07 0 -154.347 -577.639 0 0 0 0 0 -1812.11 0 0 -1368.68 0 2095.78 0 -1165.73 2084.19 0 0 0 0 0 0 0 852.306 -365.383 0 0 -2038.41 0 0 0 
0 0 0 125.66 0 0 0 -249.413 1981.19 259.789 0 0 287.103 0 0 0 -2351.37 0 2402.04 0 0 0 2381.89 -404.294 0 0 -1657.08 -2041.92 0 0 0 0 0.03 0 0 0 0 0 0 0 0 2006.52 1561.1 0 2298.27 1634.5 0 0 -770.058 0 0 0 0 0 0 0 0 0 -623.264 0 0 0 0 0 
0 0 4.95926 0 0 -1366.7 0 0 0 0 0 0 0 0 0 2043.75 0 -1820.96 0 0 -1329 0 -1984.08 1389.28 1478.7 0 0 1418.73 0 0 0 -179.525 0 0.06 0 -1557.59 0 0 2274.01 0 0 1038.32 -974.532 0 0 0 0 0 0 0 1616.64 -162.13 0 0 -1031.3 0 0 0 912.58 0 0 0 2203.21 0 
0 0 0 -1381.8 0 0 2232.66 0 0 0 1368.37 0 0 0 1557.89 0 -761.666 0 0 0 0 1774.27 0 0 0 0 58.2141 0 1515.63 0 0 2444.61 0 0 0.05 903.577 -1430.17 0 0 0 -796.609 0 0 0 0 0 0 0 0 0 1448.94 0 2148.73 0 0 0 2117.6 1883.83 0 0 1802.96 0 0 0 
0 0 0 -601.138 0 588.473 0 0 877.178 0 0 0 0 1332.97 1668.52 0 -313.654 0 91.937 1676 27.2378 0 2070.15 2145.68 -1032.36 -461.058 0 134.358 -808.664 0 -1262.17 0 0 -1714.91 1669.59 0.03 0 0 0 0 0 0 0 0 1355.1 501.953 0 0 0 1228.29 0 0 1973.71 0 0 0 0 0 0 -1576.82 0 1222.19 -2382.05 0 
0 0 1450.01 -815.073 0 0 0 0 1835.76 0 0 -614.719 1360.9 1062.88 0 0 1054.03 0 0 -1072.04 -207.297 -886.792 2352.9 -2411.8 0 0 875.042 0 0 0 0 0 0 0 489.288 0 0.08 0 0 0 0 1580.02 0 1906.11 0 0 1923.2 0 0 0 0 593.966 1215.93 0 0 0 0 0 -1039.99 0 0 1692.48 0 0 
0 0 0 -1599.09 0 -1458.25 -481.353 2329.86 0 0 -1447.72 0 510.041 0 0 0 0 1504.94 0 0 299.005 2369.69 0 0 0 -1755.2 1632.51 0 0 -642.186 1380.28 0 0 0 0 0 0 0.04 0 0 0 0 0 -253.99 2079.61 -2484.89 0 0 0 0 0 0 0 2013.38 0 0 1874.83 0 0 0 -771.432 1411.4 -2492.07 0 
-1309.78 1573.46 0 0 0 0 2312.92 -175.253 0 0 426.267 790.353 -872.6 1510.28 0 0 0 2373.96 0 1461.91 0 0 -1822.49 0 -456.786 0 0 0 0 0 0 0 0 1364.41 0 0 0 0 0.09 0 0 0 0 -890.912 0 385.22 0 1056.47 865.734 0 0 0 0 0 0 0 0 0 0 0 0 0 0 0 
0 929.975 0 197.531 266.198 0 0 -889.386 0 501.648 1680.73 2335.66 0 0 0 0 0 0 0 -293.359 0 0 0 -1990.8 0 0 0 0 0 0 -1461.61 0 0 0 0 0 0 0 0 0.02 0 0 0 0 0 0 1915.42 0 0 115.284 0 -107.807 0 0 0 0 0 0 0 1160.24 0 0 0 0 
0 0 0 1044.27 0 399.869 -1511.35 0 0 0 0 0 1483.89 -274.133 0 0 -1009.48 661.107 0 1770.3 0 990.707 0 0 -2359 0 0 1623.51 0 2438.35 -778.603 -226.676 0 0 -1778.54 0 0 0 0 0 0.04 0 0 0 -254.448 0 0 0 0 0 2443.69 2321.16 0 352.26 0 0 0 -745.491 1349.76 -816.599 0 0 0 0 
-659.886 0 0 0 0 0 0 539.338 0 0 -1912.21 0 0 0 0 0 0 -2163.53 1900.92 0 0 0 0 -572.756 0 0 0 -1698.43 0 0 0 0 -1970.35 793.558 0 0 745.338 0 0 0 0 0.09 177.694 0 0 0 1697.36 0 0 1143.45 0 0 792.795 0 1324.88 0 0 0 0 1738.11 0 0 0 896.252 
-1294.67 -684.606 -2133.63 0 0 1614.2 328.913 0 570.925 1315.12 0 0 0 0 0 0 0 0 0 -327.693 0 0 0 0 0 2404.17 0 0 0 0 1383.79 0 2205.65 -1260.34 0 0 0 0 0 0 0 -1175.5 0.09 0 0 2323.91 0 0 0 0 0 0 -1249.05 0 0 0 0 0 0 0 0 0 0 0 
-1248.74 0 0 0 -1358.61 0 0 0 0 0 0 -1177.94 0 0 0 0 0 -1459.62 0 0 0 0 0 0 0 0 2222.43 0 -404.294 0 -1044.88 648.137 0 0 0 0 1139.64 855.968 1389.74 0 0 0 0 0.06 494.934 0 0 0 2148.12 1986.68 -1383.63 0 0 0 0 -1118.43 0 0 0 0 0 0 0 0 
0 0 0 0 0 0 0 1949.14 0 0 1406.37 0 0 -2059.77 0 1239.89 0 0 0 0 0 -298.7 0 0 0 0 0 0 -1294.06 1664.25 1338.62 0 490.661 0 0 2242.12 0 798.44 0 0 -1796.55 0 0 986.435 0.09 0 646.306 0 855.663 1394.31 0 0 0 0 2207.02 0 0 0 0 -657.445 1005.05 0 0 0 
0 2122.33 0 2369.23 0 0 0 0 0 0 980.026 0 2351.07 1386.53 751.137 -483.032 0 0 0 1554.84 0 0 0 0 1814.86 0 2412.87 0 0 1575.29 0 -304.651 -524.537 0 0 -332.27 0 1887.95 2489.62 0 0 0 -1777.17 0 0 0.08 -2219.84 0 0 0 2020.55 0 0 0 0 0 0 0 0 1171.68 0 0 0 0 
-1289.33 0 0 0 10.3 0 0 896.252 -772.5 0 335.322 375.759 0 0 0 1455.96 0 0 0 0 0 0 2157.43 1435.82 -2457.73 1927.63 0 405.057 0 0 0 0 0 0 0 0 -903.119 0 0 -1718.57 0 43.26 0 0 -238.578 1801.74 0.08 1140.71 0 0 0 0 1173.67 0 0 0 0 1567.66 0 0 0 -648.289 0 0 
0 674.078 0 0 0 1776.86 0 0 0 2058.55 0 -715.43 0 2223.96 0 0 0 0 -334.254 0 1934.8 0 0 0 0 343.104 2043.9 0 0 0 0 -1160.08 0 0 0 0 0 0 666.753 0 0 0 0 0 0 0 147.481 0 0 0 0 0 -2282.71 2331.08 0 0 0 0 0 0 0 0 0 0 
-194.784 0 0 0 0 0 0 -2391.2 0 1711.55 0 0 2441.1 -1871.93 0 -274.895 0 0 2233.12 0 -201.651 896.863 0 0 0 0 0 0 0 0 0 1541.11 -1239.89 0 0 0 0 0 1985.92 0 0 0 0 2112.87 1473.97 0 0 0 0.06 0 2035.05 0 0 0 0 0 -1503.72 1061.36 0 -576.266 -989.334 0 0 0 
-1669.59 0 -475.707 2243.19 0 0 0 0 0 0 0 0 0 0 0 0 0 0 0 0 0 0 0 0 0 895.642 2447.36 0 0 0 1017.56 0 0 0 0 -1024.74 0 0 0 2120.2 0 432.218 0 -2284.54 -2453.15 0 0 0 0 0.03 -742.897 -1253.93 751.747 0 1291.92 0 0 0 0 2396.24 0 0 0 0 
0 0 -1394.16 0 0 0 1100.73 0 0 1493.65 -0.686666 -2113.94 -108.875 0 0 0 0 0 2349.24 0 0 0 0 0 0 0 1574.68 0 0 0 0 0 0 -1242.33 684.301 0 0 0 0 0 699.713 0 0 1851.18 0 -2236.32 0 0 1874.68 7.55333 0.03 1992.02 -2266.99 -1051.29 0 0 0 1893.44 -2395.47 0 0 0 743.965 0 
0 2143.24 0 0 0 -2263.94 0 0 0 0 0 0 0 0 -1853.77 0 0 0 0 1130.33 0 0 0 0 -1039.69 865.123 0 0 0 1222.5 0 0 0 -1134.91 0 0 803.171 0 0 -1073.72 1569.03 0 0 0 0 0 0 0 0 680.639 2079.15 0.03 0 0 0 0 -2242.58 -85.2229 0 1948.99 0 0 0 0 
0 0 -335.932 0 0 214.469 0 0 0 0 0 0 0 -2314.14 0 0 0 791.116 0 0 0 0 1218.38 745.949 1235.92 1238.21 0 2382.96 0 944.319 0 0 0 0 124.897 -956.832 472.35 0 0 0 0 -2219.99 2033.98 0 0 0 636.082 2187.19 0 835.063 -2360.38 0 0.09 0 0 0 0 0 0 0 0 0 0 0 
0 0 0 0 0 0 0 0 0 0 0 0 0 0 0 0 1699.8 0 2302.09 0 2271.42 0 0 0 0 0 0 0 1982.25 0 0 0 0 0 0 0 0 1718.12 0 0 608.31 0 0 0 0 0 0 -1815.47 0 0 -1937.24 0 0 0.02 0 0 -284.814 0 0 0 0 0 0 0 
0 0 -947.066 1605.66 0 0 0 0 0 0 0 0 -2376.86 0 1525.7 0 0 -2128.28 0 1871.01 2323.45 0 840.403 -393.155 0 0 0 0 0 1145.28 0 0 0 56.3829 0 0 0 0 0 0 0 1721.63 0 0 -1557.74 0 0 0 0 -579.775 0 0 0 0 0.06 -2277.06 1552.55 0 475.097 0 1989.73 0 0 0 
0 0 0 0 0 590.609 -215.842 0 0 -1658.45 0 0 1649.14 0 2047.41 0 0 0 0 0 0 0 0 0 0 0 1791.67 0 0 0 0 0 0 0 0 0 0 0 0 0 0 0 0 -1451.54 0 0 0 0 0 0 0 0 0 0 2450.25 0.09 -490.509 0 0 0 0 2340.39 0 1549.81 
0 -2266.69 0 0 0 0 0 2386.32 0 0 0 0 -2281.64 37.0037 0 0 1577.12 0 0 766.854 0 2093.49 2401.73 2108.6 0 1771.37 850.78 0 0 0 1743.14 -1072.5 0 0 -669.805 0 0 -1559.72 0 0 0 0 0 0 0 0 0 0 2293.39 0 0 376.522 0 -266.045 -2251.58 480.743 0 1392.18 0 1595.13 -1190.15 0 0 0 
-877.483 -2044.36 1348.69 1278.95 0 0 1313.29 1872.69 0 0 0 0 1262.02 964.309 1629.31 -1424.38 0 0 0 0 0 0 2248.68 0 0 0 0 0 0 -449.767 0 -217.215 0 0 -529.42 0 0 0 0 0 1538.21 0 0 0 0 0 1081.65 0 1120.11 0 -480.438 1675.7 0 0 0 0 -2391.05 0 0 2405.24 0 -2234.64 0 0 
1070.67 -1566.74 0 0 0 -2214.04 0 0 0 -1908.86 0 0 0 0 0 0 0 0 0 0 0 0 0 0 0 0 0 0 0 0 0 0 1839.27 753.426 0 0 2113.48 0 0 0 644.475 0 0 0 0 0 0 0 0 0 1735.82 0 0 0 -546.968 0 0 0 0.03 0 0 0 0 0 
0 0 0 1890.24 0 0 0 0 0 1493.5 0 0 0 0 0 -528.962 -1473.66 0 0 1005.36 0 0 0 0 259.026 0 0 0 0 -1434.29 0 0 0 0 0 1733.68 0 0 0 -1176.72 469.298 1741.31 0 0 -1247.98 2117.6 0 0 -1408.51 -697.424 0 546.052 0 0 0 0 959.883 -1774.42 0 0.07 0 0 0 0 
0 -679.113 0 0 0 -690.405 0 0 0 0 0 0 0 0 0 -1949.9 0 0 0 1913.74 0 0 -602.817 0 0 2170.25 0 0 0 0 0 976.211 0 0 -806.833 0 0 1899.55 0 0 0 0 0 0 2364.96 0 0 0 777.078 0 0 0 0 0 -18.6926 0 1734.75 0 0 0 0.04 1254.08 0 0 
0 0 1657.38 0 0 0 0 268.334 0 0 0 0 0 0 0 -767.922 0 1065.02 0 0 -406.583 0 0 -1016.04 0 0 0 0 -2187.34 0 0 0 0 0 0 1016.95 -1471.07 2199.85 0 0 0 0 0 0 0 0 679.266 0 0 0 0 0 0 0 0 967.208 0 2201.53 0 0 -1214.26 0 0 0 
0 0 0 0 0 -1628.85 0 0 0 0 0 0 0 0 -2286.98 0 0 0 0 0 632.572 0 0 0 0 0 0 0 0 931.654 0 0 0 214.469 0 537.049 0 1814.86 0 0 0 0 0 0 0 0 0 0 0 0 1437.04 0 0 0 0 0 0 0 0 0 0 0 0.02 0 
0 0 -2099.6 0 0 0 -575.655 0 0 0 0 0 0 0 0 0 0 0 0 0 0 0 0 395.444 0 0 1726.2 -699.713 0 1846.6 0 0 0 0 0 0 0 0 0 0 0 -558.565 0 0 0 0 0 0 0 0 0 0 0 0 0 655.309 0 0 0 0 0 0 0 0.06 
