*Vertices 53
*Matrix 
0 904.492 0 0 0 0 0 0 0 0 0 0 -635.472 0 0 0 0 306.482 0 0 0 1810.59 0 0 -123.218 -854.137 0 1538.36 0 0 0 0 0 0 0 0 0 0 0 0 0 0 0 0 0 0 0 0 0 0 0 0 0 
525.605 0.05 0 0 0 590.152 0 0 0 0 0 0 0 0 0 1010.09 1699.5 0 0 0 0 0 540.101 0 1698.58 0 0 0 0 0 0 0 0 -1618.93 0 0 1847.51 1791.97 0 0 0 0 0 0 0 0 0 0 0 -1852.24 0 0 0 
0 0 0.02 0 0 0 -551.698 0 0 0 -1784.04 0 0 1960.43 0 0 0 0 0 0 0 0 0 0 0 0 -266.045 30.137 0 -50.1267 0 1909.92 0 2067.71 0 0 0 1139.64 0 0 0 0 0 0 0 0 0 0 0 0 0 0 0 
0 0 0 0.07 0 1184.96 0 1163.59 0 0 1338.62 0 0 0 0 0 0 0 0 0 0 0 0 0 -1097.22 0 -674.841 0 2414.4 0 0 0 0 0 0 0 0 0 0 2459.26 0 0 0 0 0 0 0 0 0 0 0 0 1894.97 
0 0 0 0 0.07 -210.654 0 0 0 0 0 0 0 1793.5 989.486 668.126 0 -342.799 0 0 0 -2037.8 0 0 1798.07 0 0 0 163.045 482.879 0 594.882 2122.33 0 -2217.25 2242.58 0 0 0 -1817.91 636.387 0 0 0 0 0 0 -44.6333 0 0 0 0 0 
0 -384.152 0 468.078 981.552 0 0 0 -783.792 0 0 978.195 2379.91 0 0 379.421 0 0 0 1083.94 0 0 0 0 0 0 0 0 -1470 1537.14 0 0 0 616.092 0 0 0 0 0 0 1799.91 0 -1909.77 0 0 0 0 0 0 0 0 0 0 
0 0 1635.26 0 0 0 0.05 0 0 0 1077.23 0 0 -1552.25 0 0 0 0 -2000.11 2179.1 0 0 0 414.67 514.618 0 0 -969.955 0 0 0 0 0 0 0 0 0 2480.62 0 1719.18 0 0 0 1010.54 -63.2496 0 0 0 0 0 0 0 0 
0 0 0 676.214 0 0 0 0 0 -2034.29 0 0 2051.99 -2144.46 0 1729.56 2438.96 0 2406.16 0 -1093.86 0 -705.969 0 -1170.16 0 0 0 -898.541 -539.796 0 0 0 0 0 0 0 0 0 0 0 0 0 0 0 0 0 0 0 0 0 0 0 
0 0 0 0 0 1292.69 0 0 0 0 0 0 0 0 0 0 -176.778 2052.75 0 0 0 0 -145.802 0 2306.05 0 0 0 0 1029.47 0 0 0 0 333.186 0 1688.51 0 0 0 0 0 0 2027.42 0 0 0 0 0 1714 1552.4 1089.59 0 
0 0 0 0 0 0 0 520.569 0 0.08 1984.85 0 0 0 0 0 -2339.93 0 0 1232.87 0 0 0 0 0 0 0 1690.19 0 0 0 0 0 0 0 0 0 0 0 0 -1561.56 0 0 0 0 0 0 0 0 0 0 0 0 
0 0 -950.88 394.986 0 0 1901.53 0 0 -1967.15 0.04 -688.726 0 0 0 0 -530.793 -664.006 0 0 2115.31 0 10.9104 0 0 0 0 0 342.647 0 0 0 0 0 0 2407.07 -928.907 1450.62 0 0 0 0 0 0 0 0 0 0 0 0 0 0 0 
0 0 0 0 0 1463.44 0 0 0 0 146.413 0.07 0 0 0 0 2118.21 0 0 0 0 1351.13 0 0 0 0 0 0 -21.4393 0 0 0 0 0 0 0 0 0 0 0 0 0 0 0 0 0 0 0 0 0 0 0 0 
-1592.23 0 0 0 0 2161.85 0 -209.586 0 0 0 0 0.07 0 0 0 0 0 0 0 0 2408.75 1818.67 0 2346.34 0 -1675.7 -1263.85 0 -2204.58 0 0 0 0 1584.14 1367.61 0 0 1171.68 0 0 0 0 0 0 1887.65 0 0 0 0 0 0 0 
0 0 2288.51 0 1969.89 0 2329.71 -1817.15 0 0 0 0 0 0 0 0 0 0 0 -1361.66 0 1092.03 0 745.949 0 0 0 0 0 0 0 440.153 0 0 2153.77 0 0 0 2075.33 0 0 0 0 961.409 0 0 0 -39.5978 0 0 2074.88 0 0 
0 0 0 0 1431.39 0 0 0 0 0 0 0 0 0 0.01 -555.208 0 0 0 0 0 0 2324.67 0 0 2418.52 0 0 -646.001 0 0 2459.87 2067.86 1987.59 0 437.254 0 -2172.69 0 0 0 -2095.17 0 0 0 -168.844 0 0 0 0 0 0 520.875 
0 152.211 0 0 -501.953 -3.89111 0 -892.438 0 0 0 0 0 0 1729.26 0.04 0 0 0 0 0 -11.2156 0 0 0 0 0 0 1965.62 0 2189.63 0 0 0 -2146.6 714.515 0 359.432 -1578.04 0 0 0 -1158.1 0 0 0 0 0 756.63 0 0 0 0 
0 -1736.58 0 0 0 0 0 2055.19 1568.42 483.795 901.44 -433.744 0 0 0 0 0.01 1399.35 -149.312 0 0 0 0 0 -962.935 0 233.085 0 -2371.82 0 0 0 0 0 0 0 0 0 -382.321 0 0 0 0 0 0 0 741.218 0 0 0 0 0 0 
493.408 0 0 0 1029.01 0 0 0 -2192.22 0 1168.94 0 0 0 0 0 2350.76 0.04 734.352 0 0 0 1624.73 0 0 0 0 -1648.84 0 0 0 0 1141.62 0 0 0 2243.19 0 0 2271.87 187.307 0 0 0 0 0 0 0 0 0 220.573 0 0 
0 0 0 0 0 0 1587.04 2003.77 0 0 0 0 0 0 0 0 675.909 -2129.2 0.09 -860.393 0 0 1983.78 0 1290.4 0 0 -1749.7 0 0 0 0 -801.187 -625.401 0 0 0 0 0 0 0 0 0 0 0 0 0 0 0 0 0 0 0 
0 0 0 0 0 1677.53 1068.68 0 0 -586.795 0 0 0 -488.678 0 0 0 0 -423.826 0.04 0 0 0 0 -1274.07 1745.28 0 0 0 0 887.86 0 0 0 0 0 0 2404.02 0 0 0 0 0 0 -2316.58 0 0 0 0 0 2383.88 0 0 
0 0 0 0 0 0 0 712.531 0 0 1781.75 0 0 0 0 0 0 0 0 0 0.06 0 -2232.05 0 0 111.469 0 0 0 1105.76 0 0 -207.144 -536.286 0 -1395.84 0 2399.29 0 0 0 0 0 0 0 932.112 0 0 -473.266 0 0 1094.32 0 
1038.01 0 0 0 228.813 0 0 0 0 0 0 832.316 -158.01 2029.56 0 1007.19 0 0 0 0 0 0.03 0 0 2063.13 0 0 0 1615.42 0 0 1792.58 0 0 -1952.96 0 0 0 -279.473 0 0 0 0 0 0 1906.42 0 0 0 0 0 0 0 
0 1024.74 0 0 0 0 0 892.285 1532.56 0 -952.559 0 1220.36 0 2076.71 0 0 1905.19 -1936.17 0 -1520.2 0 0.07 0 0 0 0 1506.32 0 0 0 0 0 0 0 0 0 0 0 0 -53.6363 0 2454.37 0 0 0 0 0 0 0 0 2062.67 0 
0 0 0 0 0 0 901.288 0 0 0 0 0 0 -1345.48 0 0 0 0 0 0 0 0 0 0.07 1758.25 0 0 0 0 0 0 0 0 0 0 0 0 474.487 -324.03 0 0 0 0 0 0 0 0 0 0 0 0 0 0 
2497.56 -775.094 0 -2353.97 -612.888 0 1450.62 1414.76 576.571 0 0 0 -2206.26 0 0 0 2415.77 0 -933.638 -994.98 0 2147.21 0 11.6733 0.01 1951.43 0 0 297.479 0 0 726.722 0 0 0 172.048 0 0 0 600.681 0 0 0 0 0 0 0 0 0 0 0 -2336.88 0 
769.295 0 0 0 0 0 0 0 0 0 0 0 0 0 -1081.19 0 0 0 0 206.534 -1697.52 0 0 0 2299.04 0.07 0 0 0 0 1425.29 0 0 0 1674.93 0 395.596 0 0 0 0 0 0 0 -881.298 0 0 0 0 0 0 0 0 
0 0 1312.22 1583.22 0 0 0 0 0 0 0 0 -1870.4 0 0 0 1816.23 0 0 0 0 0 0 0 0 0 0 -1952.19 0 1303.37 0 809.885 0 0 1862.01 0 0 0 0 -728.706 0 0 0 0 0 0 -367.061 0 0 0 0 1374.78 0 
-1102.1 0 -363.247 0 0 0 -773.263 0 0 767.769 0 0 2121.11 0 0 0 0 2413.33 962.325 0 0 0 16.4037 0 0 0 -260.247 0.07 767.922 744.728 0 0 0 0 0 0 0 0 0 -2100.82 0 0 0 0 -352.718 0 0 0 0 0 0 0 0 
0 0 0 -118.946 1708.04 498.138 0 -624.027 0 0 552.156 -2302.39 0 0 1201.44 2322.08 -917.463 0 0 0 0 2252.95 0 0 -361.568 0 0 2451.63 0.07 0 0 0 0 0 0 0 0 2382.81 -1193.5 0 0 826.67 0 0 0 -1531.04 0 0 0 -886.029 0 0 0 
0 0 2466.89 0 -615.177 2215.57 0 -302.057 1615.57 0 0 0 540.712 0 0 0 0 0 0 0 -1112.78 0 0 0 0 0 2316.28 -2303.31 0 0.02 2309.72 0 0 0 -1863.99 0 0 -493.866 0 0 0 0 0 0 0 0 0 -1859.26 0 0 -958.968 0 0 
0 0 0 0 0 0 0 0 0 0 0 0 0 0 0 -156.331 0 0 0 2240.59 0 0 0 0 0 405.362 0 0 0 1483.43 0.01 1382.56 0 0 0 0 0 43.4126 654.546 0 0 1616.64 986.435 2149.8 0 0 0 0 0 0 0 1520.81 0 
0 0 2186.73 0 -1851.94 0 0 0 0 0 0 0 0 2142.63 743.202 0 0 0 0 0 0 -833.079 0 0 128.712 0 1729.26 0 0 0 -1401.79 0 0 0 0 -1011.61 2297.66 0 0 0 0 0 0 0 0 0 0 -1906.57 0 0 0 0 0 
0 0 0 0 1140.71 0 0 0 0 0 0 0 0 0 2225.64 0 0 2062.21 1776.25 0 993.149 0 0 0 0 0 0 0 0 0 0 0 0.06 0 0 0 0 0 1727.58 0 0 0 0 0 0 0 0 0 0 -970.565 -2189.47 0 0 
0 2200.77 1403.93 0 0 -1364.86 0 0 0 0 0 0 0 0 1180.38 0 0 0 -946.455 0 1164.36 0 0 0 0 0 0 0 0 0 0 0 0 0.06 0 1367.61 0 0 -2192.07 1641.21 0 0 0 0 1247.06 0 0 0 0 0 0 0 0 
0 0 0 0 878.857 0 0 0 214.621 0 0 0 2250.05 2205.8 0 2028.79 0 0 0 0 0 -1361.81 0 0 0 2036.27 -1022.9 0 0 1702.86 0 0 0 0 0.04 0 0 0 0 0 0 0 0 0 0 0 0 0 0 0 0 0 0 
0 0 0 0 -469.756 0 0 0 0 0 -1555.3 0 518.128 0 968.581 1262.32 0 0 0 0 305.109 0 0 0 -880.84 0 0 0 0 0 0 2117.91 0 -797.067 0 0.06 0 -415.281 2031.85 0 0 2236.78 0 621.738 0 0 0 0 1558.05 2481.54 0 -2175.44 0 
0 1198.54 0 0 0 0 0 0 131.611 0 938.368 0 0 0 0 0 0 -2279.2 0 0 0 0 0 0 0 2263.18 0 0 0 0 0 841.624 0 0 0 0 0 0 0 1976.76 0 0 0 -1137.2 -723.06 630.589 0 0 0 -1933.88 0 0 0 
0 2473.91 1906.11 0 0 0 -1130.02 0 0 0 1373.1 0 0 0 498.749 -913.495 0 0 0 1561.86 1625.19 0 0 1299.55 0 0 0 0 844.523 -1289.18 -125.965 0 0 0 0 -2107.84 0 0.06 560.396 0 0 0 0 0 0 0 0 0 0 0 0 0 0 
0 0 0 0 0 0 0 0 0 0 0 0 -183.798 1017.26 0 1779.31 -1034.65 0 0 0 0 -1164.82 0 1647.62 0 0 0 0 1256.68 0 -550.935 0 -1274.38 -845.744 0 1740.85 0 2066.03 0.08 0 -2000.56 0 0 0 0 0 0 0 0 0 0 0 0 
0 0 0 -1748.79 2416.23 0 2023.45 0 0 0 0 0 0 0 0 0 0 -2224.27 0 0 0 0 0 0 184.561 0 947.523 -1508.91 0 0 0 0 0 506.989 0 0 1844.46 0 0 0.08 0 0 0 0 0 0 502.258 0 0 0 0 0 0 
0 0 0 0 -208.365 1401.49 0 0 0 293.817 0 0 0 0 0 0 0 676.214 0 0 0 0 -19.9133 0 0 0 0 0 0 0 0 0 0 0 0 0 0 0 -1003.37 0 0.07 0 0 -977.584 0 0 0 2320.7 0 0 0 0 0 
0 0 0 0 0 0 0 0 0 0 0 0 0 0 52.4155 0 0 0 0 0 0 0 0 0 0 0 0 0 -1129.57 0 1837.14 0 0 0 0 1394.31 0 0 0 0 0 0.08 0 0 0 0 -1477.94 0 0 0 0 0 -929.212 
0 0 0 0 0 -1535.62 0 0 0 0 0 0 0 0 0 -1975.08 0 0 0 0 0 0 2300.1 0 0 0 0 0 0 0 1833.32 0 0 0 0 0 0 0 0 0 0 0 0.03 0 0 0 1557.13 0 0 0 0 -1311.46 0 
0 0 0 0 0 0 -27.6955 0 -1074.63 0 0 0 0 -58.3666 0 0 0 0 0 0 0 0 0 0 0 0 0 0 0 0 1589.48 0 0 0 0 2133.01 -339.595 0 0 0 -781.35 0 0 0.04 0 0 0 0 0 0 0 0 0 
0 0 0 0 0 0 1033.13 0 0 0 0 0 0 0 0 0 0 0 0 -752.358 0 0 0 0 0 2114.4 0 1237.75 0 0 0 0 0 1419.34 0 0 2365.72 0 0 0 0 0 0 0 0.06 0 0 0 0 0 0 1687.44 0 
0 0 0 0 0 0 0 0 0 0 0 0 -1741.46 0 -665.99 0 0 0 0 0 2408.44 844.371 0 0 0 0 0 0 -361.11 0 0 0 0 0 0 0 2379.76 0 0 0 0 0 0 0 0 0.08 0 2043.9 0 0 0 0 2059.01 
0 0 0 0 0 0 0 0 0 0 0 0 0 0 0 0 1653.11 0 0 0 0 0 0 0 0 0 -166.402 0 0 0 0 0 0 0 0 0 0 0 0 -345.546 0 683.386 2247.92 0 0 0 0.06 0 375.149 0 0 0 2354.27 
0 0 0 0 -397.58 0 0 0 0 0 0 0 0 1653.72 0 0 0 0 0 0 0 0 0 0 0 0 0 0 0 -209.128 0 678.503 0 0 0 0 0 0 0 0 -776.925 0 0 0 0 1576.66 0 0.09 0 0 0 0 0 
0 0 0 0 0 0 0 0 0 0 0 0 0 0 0 2425.69 0 0 0 0 2413.48 0 0 0 0 0 0 0 0 0 0 0 0 0 0 -1028.7 0 0 0 0 0 0 0 0 0 0 -589.541 0 0.09 0 0 0 0 
0 707.343 0 0 0 0 0 0 578.555 0 0 0 0 0 0 0 0 0 0 0 0 0 0 0 0 0 0 0 1922.74 0 0 0 1648.38 0 0 1353.88 -1048.08 0 0 0 0 0 0 0 0 0 0 0 0 0.03 0 0 0 
0 0 0 0 0 0 0 0 -1989.12 0 0 0 0 1334.35 0 0 0 1164.36 0 1389.43 0 0 0 0 0 0 0 0 0 708.258 0 0 -1720.25 0 0 0 0 0 0 0 0 0 0 0 0 0 0 0 0 0 0.06 0 0 
0 0 0 0 0 0 0 0 1386.38 0 0 0 0 0 0 0 0 0 0 0 164.571 0 599.155 0 2238.91 0 -1575.9 0 0 0 993.454 0 0 0 0 1425.44 0 0 0 0 0 0 -2074.42 0 1490.91 0 0 0 0 0 0 0.05 0 
0 0 0 1126.97 0 0 0 0 0 0 0 0 0 0 765.481 0 0 0 0 0 0 0 0 0 0 0 0 0 0 0 0 0 0 0 0 0 0 0 0 0 0 808.664 0 0 0 2138.97 1213.19 0 0 0 0 0 0.03 
