*Vertices 79
*Matrix 
0.04 -1190.15 611.057 0 2021.93 0 0 0 0 0 0 0 0 0 0 0 0 0 0 0 -910.443 0 0 -221.183 0 0 0 1256.07 0 0 0 0 0 0 2279.05 0 0 -720.008 0 0 0 0 -1998.28 -83.5444 0 0 543.306 0 1619.85 -1282.31 0 0 1218.53 0 0 0 0 0 0 0 0 0 0 0 0 0 0 0 0 0 0 0 0 0 -2232.51 0 0 0 0 
2481.38 0.03 0 -1153.52 -1691.26 -1357.69 1783.58 0 0 0 0 72.1 0 0 0 0 0 -1477.32 51.9578 0 0 0 -317.011 721.839 0 0 2148.12 0 0 0 0 0 0 0 0 0 0 0 0 2172.84 0 0 0 0 0 1934.19 0 0 0 -647.679 -104.602 0 194.327 0 0 0 0 1371.88 2333.67 0 0 1329.31 0 0 -1591.62 0 -1133.84 0 0 1045.95 0 0 -578.86 424.741 0 -1202.96 0 0 0 
-337.001 0 0 932.264 0 0 0 0 0 0 -1872.08 0 0 0 -729.469 0 0 1888.56 0 0 0 -1024.58 0 -1509.67 0 -501.19 0 0 0 637.761 1523.1 -1178.85 0 0 -588.473 0 0 0 0 0 0 0 2472.99 0 0 0 1593.3 0 690.863 0 0 0 0 0 69.6585 0 0 0 0 2412.41 1427.58 0 0 0 0 0 2226.71 0 0 0 0 0 -991.165 0 -1061.51 0 -2467.8 0 -46.1592 
0 1732.61 1646.55 0.09 1006.73 0 0 0 0 -791.879 0 0 0 0 0 0 696.661 0 0 0 0 0 -295.801 0 0 -1147.27 0 0 0 2390.44 0 -2336.12 0 0 0 973.159 2429.65 1795.79 -1780.83 0 -2182 0 0 419.095 0 0 0 0 0 0 0 0 0 285.272 0 0 0 0 498.291 0 0 0 -2448.12 0 0 0 -1766.95 0 0 0 0 0 0 0 -474.181 0 1725.9 0 0 
2426.91 -2271.42 0 -764.107 0.07 0 -1009.78 0 -1252.56 0 0 346.156 0 0 0 0 0 0 0 0 0 0 0 2453.46 0 2146.29 0 560.701 1436.12 0 0 0 2204.12 0 2253.41 274.285 -1843.39 0 1442.53 0 0 0 0 -1179.92 0 0 1608.25 0 0 0 0 0 0 -621.738 0 0 0 0 0 0 0 0 0 0 0 0 0 0 0 0 0 -1012.83 0 0 0 0 0 0 -1947.46 
0 -406.888 0 0 0 0.09 966.597 1056.32 1835.61 0 1731.54 826.06 0 0 0 0 483.337 0 -182.73 0 940.504 0 0 0 1067.61 -78.814 0 781.045 -2098.68 0 0 0 0 1840.49 -2291.56 0 0 0 0 -617.466 870.617 1490.45 0 0 2253.72 0 1551.33 -1921.83 -847.575 0 0 0 -593.204 0 842.54 0 0 0 2447.2 0 0 -521.943 84.46 0 0 0 0 1523.56 0 0 0 0 0 0 0 0 0 0 1842.48 
0 2452.24 0 0 -1766.79 -1976.3 0.06 -94.0733 -285.119 0 0 0 1316.64 935.011 -1072.34 0 2296.9 -1326.72 0 0 2478.94 0 0 -766.396 2272.79 -432.066 1487.55 0 0 -2287.44 -1608.4 0 0 0 -466.704 0 0 0 0 0 0 0 1667.46 0 0 0 0 0 0 0 0 -413.907 2083.27 0 0 -558.107 0 0 0 -1029.16 0 2354.12 0 -2496.49 0 -1133.08 -1355.4 -150.533 0 0 0 0 2286.07 316.706 0 0 0 0 0 
0 0 0 0 0 -967.36 -1705.76 0.02 0 1751.84 634.556 0 1079.06 0 0 0 0 0 0 0 0 145.192 0 0 0 0 0 -385.678 1719.64 0 2062.67 -2327.42 0 0 0 759.987 0 0 0 0 0 0 0 0 0 0 0 0 0 0 0 0 0 0 1647.01 -1866.44 0 0 0 0 2072.13 1841.41 -130.848 0 0 0 0 0 0 0 1339.53 0 0 0 0 0 0 0 0 
0 0 0 0 -1047.93 782.266 -1471.37 0 0.03 -390.255 1331.6 0 0 0 0 0 0 0 0 0 0 0 -465.178 0 0 1072.65 0 0 0 -1590.24 2471.62 0 1063.8 -338.832 0 0 581.912 0 0 0 0 0 0 0 0 0 0 0 508.972 -1940.29 0 0 0 0 487.152 0 0 1831.49 -1209.37 0 -78.6615 0 0 0 0 0 1939.07 0 0 0 0 0 0 1400.88 0 0 0 0 0 
0 0 0 2228.08 0 0 0 -505.615 -157.399 0.02 0 0 0 486.847 2232.2 0 0 0 0 0 0 0 0 0 0 0 1394.77 0 0 0 0 -2448.12 1996.75 -1881.08 0 0 0 0 -1541.87 0 0 0 -2321.01 0 0 0 0 -1739.78 0 978.805 0 0 0 1672.03 -405.515 0 1109.88 0 0 1569.19 1165.58 0 0 -2464.45 443.358 0 0 0 0 0 0 0 0 0 0 0 0 0 0 
0 0 -1390.5 0 0 812.937 0 1011 -103.992 0 0.01 0 1824.78 913.495 1653.72 0 1559.72 0 0 0 0 1776.25 0 0 0 0 0 0 0 0 172.506 0 -1914.5 0 0 0 949.965 -2049.55 2304.99 0 0 0 0 0 0 1007.64 -914.869 0 0 430.235 -509.278 756.63 0 0 0 0 0 0 0 0 0 0 0 -2267.45 0 0 0 -1010.24 0 -861.766 0 0 0 1998.12 0 0 0 0 0 
0 -812.784 0 0 2128.59 -842.997 0 0 0 0 0 0.09 0 0 0 0 482.116 0 0 0 0 -1790.29 0 0 0 0 0 0 0 1659.83 0 0 0 416.501 0 0 0 0 1942.73 0 266.961 589.846 0 -819.956 0 0 0 1049.46 0 0 0 -2461.09 0 0 0 0 0 0 0 0 0 0 0 0 166.86 -2437.13 0 0 77.1355 0 0 0 2466.89 0 0 0 0 0 0 
0 0 0 0 0 0 -1166.8 -125.202 0 0 2183.68 0 0.02 2220.6 0 0 0 0 0 927.076 0 0 0 0 -1986.53 2026.96 0 0 0 1018.94 0 -161.672 0 -2204.28 717.719 0 0 670.263 0 0 0 1224.48 0 0 0 0 2445.52 0 941.572 0 -2289.57 0 0 -1055.41 0 0 0 0 0 0 260.857 793.405 -2157.89 0 0 0 0 2154.99 0 0 0 0 132.679 0 1621.83 2175.13 0 0 0 
0 0 0 0 0 0 -1059.37 0 0 -2077.78 1221.58 0 -2076.56 0.05 0 0 -527.131 0 2217.55 -1120.26 0 0 381.252 0 0 1886.12 0 0 0 0 0 0 0 0 0 0 0 560.091 0 0 -1845.07 0 0 0 -1442.23 261.315 0 2231.28 0 1669.29 0 0 0 2283.93 0 0 0 0 0 0 0 0 2090.29 0 -311.365 0 1729.87 -2209.46 2021.93 0 0 -1045.49 0 0 0 0 1568.88 0 0 
0 0 156.636 0 0 0 1507.08 0 0 -2476.35 1506.62 0 0 0 0.07 0 0 0 0 0 -47.8378 822.55 0 0 549.409 0 0 0 0 1479.61 -2465.06 0 0 471.74 0 0 0 0 0 0 2452.24 0 0 0 -611.515 1390.65 0 0 0 0 0 0 0 0 0 0 0 0 320.063 2399.75 0 1942.58 0 0 -414.365 0 -538.575 0 0 0 0 0 0 0 -2069.54 0 0 0 0 
0 0 0 0 0 0 0 0 0 0 0 0 0 0 0 0.06 0 0 0 0 0 0 2347.71 0 0 0 0 0 0 0 0 0 1454.59 0 -931.806 141.072 1921.37 1786.63 0 0 0 -1323.21 -1494.26 0 0 0 0 1675.24 0 0 0 0 1388.06 0 0 0 -57.9089 0 0 0 0 0 0 0 0 0 0 0 0 0 0 0 0 0 0 0 0 0 0 
0 0 0 1040.45 0 -1733.22 891.827 0 0 0 1306.88 455.26 0 -725.654 0 0 0.01 0 0 -1961.65 0 0 0 0 0 0 0 0 0 0 -402.005 0 0 0 0 2111.19 0 138.173 0 0 0 -1834.39 0 0 0 0 0 0 0 2439.57 0 0 1541.87 0 0 2335.51 0 0 0 0 0 0 0 0 0 0 -72.4052 -825.449 2397.61 1855.6 0 1804.94 0 0 0 0 0 0 0 
0 83.8496 1448.64 0 0 0 1428.34 0 0 0 0 0 0 0 0 0 0 0.05 0 0 0 0 0 1325.19 0 0 0 0 0 0 0 2401.43 -604.343 0 0 0 0 -1912.82 0 0 0 0 -541.322 0 0 0 -972.854 0 0 0 0 -0.381481 0 0 -1627.93 0 0 0 0 0 0 0 0 922.651 2145.99 0 0 0 0 2155.29 0 0 741.829 0 0 0 0 1517.3 0 
0 -942.488 0 0 0 1064.26 0 0 0 0 0 0 0 1734.75 0 0 0 0 0.04 0 0 0 0 -856.883 0 0 -1691.41 0 0 769.601 0 2340.08 0 143.361 0 0 0 0 0 0 602.664 1842.02 0 -1569.49 0 0 0 0 1037.86 1829.97 0 0 0 -2174.37 -69.0481 2460.63 0 0 0 0 -1327.94 -394.528 341.884 0 0 0 0 1356.62 1319.54 0 0 0 0 0 0 -961.257 0 0 0 
0 0 0 0 0 0 0 0 0 0 0 0 -657.292 59.2822 0 0 -2397.61 0 0 0.01 0 2285.76 0 0 0 0 0 1082.11 1255.3 0 0 0 -392.544 0 2055.35 0 1341.98 0 0 1434.45 0 0 0 1331.75 1922.59 0 0 502.869 -497.223 624.332 0 0 664.922 0 0 0 -1982.25 0 2015.82 2140.03 0 0 0 0 -2073.2 0 0 0 1088.82 1204.64 0 0 0 2208.4 0 0 0 0 1886.12 
-569.857 0 0 0 0 1397.21 2023.61 0 0 0 0 0 0 0 1350.22 0 0 0 0 0 0.06 0 0 0 -469.756 1910.08 0 -2441.86 0 1772.74 -470.824 2060.69 179.525 0 911.512 0 0 0 0 0 -1068.22 0 0 271.386 0 0 968.276 0 0 1367 0 1311 0 -2188.71 424.436 0 0 0 107.349 0 0 0 714.972 0 0 0 0 0 0 0 0 0 0 0 0 0 961.409 0 -158.01 
0 0 1052.2 0 0 0 0 -2182.61 0 0 1437.19 2287.13 0 0 573.672 0 0 0 0 269.097 0 0.02 724.281 0 0 0 2046.34 0 0 0 432.981 -2348.63 0 0 2448.88 0 0 0 0 -1496.09 0 0 841.014 0 0 0 0 0 0 0 0 -427.335 0 0 0 0 0 -239.189 -1666.23 0 0 0 0 -1388.06 1621.83 0 0 0 0 1334.35 0 0 0 740.76 0 0 0 -2197.26 0 
0 1022.14 0 1581.39 0 0 0 0 1007.19 0 0 0 0 421.537 0 -629.826 0 0 0 0 0 -1545.08 0.04 0 0 0 0 0 0 1085.16 0 777.535 0 0 1812.42 1288.87 -1140.4 2017.96 0 0 0 0 0 990.86 0 0 1434.45 1676.15 0 0 0 0 0 0 0 0 0 1377.38 0 2218.01 0 0 0 0 0 0 0 0 0 0 0 0 0 0 0 0 0 0 0 
-1910.38 -2179.1 -739.235 0 639.744 0 -1381.34 0 0 0 0 0 0 0 0 0 0 2442.93 -1616.79 0 0 0 0 0.02 256.127 0 0 1806.01 1511.51 340.815 0 -735.878 0 0 0 2236.93 0 -1293.3 0 0 0 0 0 0 0 0 -1613.28 1816.23 2049.09 0 0 0 0 0 0 124.287 0 0 0 1700.42 0 0 2434.54 0 1996.6 1811.35 0 0 1051.59 1209.37 -1272.39 1445.43 136.799 0 -2200.31 0 0 0 0 
0 0 0 0 0 930.28 -1067.31 0 0 0 0 0 2124.01 0 236.595 0 0 0 0 0 -297.174 0 0 1452.91 0.06 0 0 0 0 0 0 1526.76 -2156.36 2090.29 966.14 0 1287.35 0 -398.801 0 -2098.07 0 0 0 0 0 0 1740.85 0 2256.61 1896.95 0 0 0 0 -30.7474 0 -981.399 -2384.03 536.134 -126.118 568.178 1868.27 911.969 0 0 0 0 0 976.363 0 1837.44 0 0 0 0 -1380.73 2036.12 0 
0 0 -1304.74 -143.513 -1079.52 1338.47 1100.57 0 -2336.57 0 0 0 2277.06 -1213.19 0 0 0 0 0 0 2046.34 0 0 0 0 0.03 0 0 1766.95 0 0 0 1001.24 0 0 -1943.65 0 0 -2249.9 0 100.635 0 0 0 0 0 0 0 716.346 0 0 581.301 1419.34 0 0 0 1747.11 0 0 0 0 -385.525 0 0 1123.31 0 0 0 -1992.48 0 0 0 0 0 0 1341.06 0 0 0 
0 1127.43 0 0 0 0 1640.14 0 0 -1078.75 0 0 0 0 0 0 0 0 -1224.78 0 0 -2024.67 0 0 0 0 0.05 0 0 0 0 0 -718.94 0 2189.93 0 0 0 0 0 0 1622.29 0 0 0 0 0 0 0 0 0 0 0 0 2288.35 0 0 0 0 616.092 0 0 0 -2484.13 0 0 0 0 -1291.77 0 0 0 2173.91 1349.45 0 0 0 -1483.58 -1229.82 
2206.11 0 0 0 -2124.16 -1042.28 0 1379.36 0 0 0 0 0 0 0 0 0 0 0 -1409.12 1003.22 0 0 1461.15 0 0 0 0.02 0 0 959.12 0 0 0 0 -795.541 0 -1791.67 0 1704.84 0 -2245.63 0 99.8718 0 0 0 0 0 -532.777 0 0 1428.04 0 445.036 1068.22 0 0 0 0 0 0 0 0 0 0 0 0 0 0 0 1667.76 0 0 -448.546 0 0 0 0 
0 0 0 0 -2094.41 1420.1 0 2338.25 0 0 0 0 0 0 0 0 0 0 0 1976.45 0 0 0 -1354.34 0 568.178 0 0 0.03 2086.78 0 0 0 -129.017 1424.07 0 0 0 0 0 -2100.36 1018.78 0 833.232 -2171.32 0 0 0 -246.971 0 0 0 0 704.138 1440.7 0 0 0 -745.796 0 1892.83 0 0 0 2451.32 0 0 0 0 0 1956.01 -1021.68 0 0 0 0 0 0 0 
0 0 -376.37 2260.43 0 0 783.486 0 742.439 0 0 2445.98 -245.445 0 1860.64 0 0 0 -2048.78 0 -1147.11 0 2254.48 124.287 0 0 0 0 -965.835 0.02 0 2388 0 2243.64 0 0 0 0 -1130.79 0 0 0 -886.944 0 0 0 0 0 0 0 0 0 0 0 0 76.5252 1721.78 599.46 0 0 0 0 0 0 0 -1958.45 0 0 1927.17 0 0 0 0 0 0 2234.49 0 0 0 
0 0 -2344.51 0 0 0 -581.607 831.248 2362.82 0 -203.482 0 0 0 222.251 0 1004.59 0 0 0 1181.75 -1645.48 0 0 0 0 0 -1854.69 0 0 0.04 0 0 0 -584.506 -1190.91 2454.83 0 2407.53 0 0 690.71 0 0 1794.87 0 0 0 0 0 -1903.52 0 0 0 0 0 0 0 0 0 1383.94 718.177 0 0 0 0 0 0 0 0 0 -644.322 472.808 0 0 0 2346.95 0 0 
0 0 -1924.88 -1280.79 0 0 0 1337.4 0 1924.88 0 0 -297.327 0 0 0 0 -502.106 2295.83 0 -149.159 -264.519 -1583.99 -1109.58 1571.78 0 0 0 0 -1442.53 0 0.01 0 0 2117.76 0 0 0 0 0 0 2348.48 -2397.61 0 0 0 0 -298.395 0 0 0 1893.6 1121.33 0 -781.503 0 536.897 2479.4 0 0 0 0 0 0 2267.45 -1963.64 0 1599.25 0 0 0 0 0 702.918 0 0 0 0 0 
0 0 0 0 -1485.26 0 0 0 1502.5 -1079.52 1537.9 0 0 0 0 -124.592 0 2408.14 0 -2025.59 461.669 0 0 0 2345.42 -1418.42 993.301 0 0 0 0 0 0 0 -2259.51 0 2304.68 0 0 0 0 0 0 1094.62 0 0 1102.86 0 0 0 0 0 0 0 -859.478 0 0 0 0 0 -340.052 0 0 0 0 0 0 0 0 -474.639 0 -1032.82 0 0 253.533 -1049.15 0 0 0 
0 0 0 0 0 2199.09 0 0 -303.43 2219.23 0 1699.19 1533.48 0 -26.1696 0 0 0 -1139.48 0 0 0 0 0 237.205 0 0 0 370.724 -396.054 0 0 0 0.01 0 0 0 0 0 -1563.69 0 0 0 0 509.43 0 0 2162.92 0 0 0 1735.66 0 0 0 1228.6 0 0 0 0 0 1646.86 0 -879.62 0 0 0 0 0 0 0 0 0 0 0 1226.31 0 0 0 
-253.685 0 669.347 0 -1397.21 206.839 -290.155 0 0 0 0 0 -403.684 0 0 1829.36 0 0 0 -1884.14 141.377 2147.36 -2395.47 0 -129.627 0 545.442 0 1501.59 0 274.133 522.553 774.636 0 0 0 0 0 0 0 -884.655 0 2334.44 0 0 0 0 0 0 0 0 0 0 0 0 0 0 0 -1955.09 0 0 1394.31 0 0 0 909.375 0 0 0 0 913.648 -1092.64 0 0 0 0 0 0 0 
0 0 0 1593.14 -2155.75 0 0 112.995 0 0 0 0 0 0 0 1648.99 312.433 0 0 0 0 0 1394.47 -2244.25 0 716.956 0 797.22 0 0 1659.22 0 0 0 0 0.01 2257.68 0 353.938 0 0 0 0 0 0 0 0 0 0 0 0 -1463.13 931.959 0 0 0 0 -2071.83 0 1670.05 0 0 0 0 822.855 0 0 0 0 0 0 0 0 1331.9 0 0 0 0 0 
0 0 0 -857.494 2243.64 0 0 0 -2180.93 0 -1265.07 0 0 0 0 -336.39 0 0 0 -671.484 0 0 -1728.95 0 1707.28 0 0 0 0 0 -2238.46 0 -382.015 0 0 2131.49 0.07 0 0 0 1946.7 0 0 0 0 0 -1092.94 -43.1074 0 2096.39 385.678 0 39.4452 0 0 0 0 429.624 0 0 0 0 0 0 0 0 0 2079.61 2457.43 -70.7266 0 0 91.3266 0 0 0 0 0 0 
-1266.75 0 0 -1168.17 0 0 0 0 0 0 1602.91 0 2012.77 1110.03 0 -1865.83 2289.12 1662.42 0 0 0 0 1871.17 1356.78 0 0 0 1922.74 0 0 0 0 0 0 0 0 0 0.08 -27.3904 0 0 0 -1281.55 0 -2026.2 1865.83 394.528 0 0 0 0 0 0 0 0 0 0 214.927 446.409 0 0 0 -1097.98 774.331 0 0 0 0 0 1955.55 -352.412 0 0 0 0 0 0 0 0 
0 0 0 1748.79 662.633 0 0 0 0 301.752 -284.509 1244.32 0 0 0 0 0 0 0 0 0 0 0 0 -768.38 -167.165 0 0 0 1740.7 -224.54 0 0 0 0 1396.45 0 -1380.28 0.05 0 0 0 0 0 0 0 -925.245 2191.46 1323.21 1167.26 0 0 -223.167 0 0 0 -1847.36 0 546.815 0 0 0 0 0 0 0 0 0 0 0 0 0 0 0 1390.04 0 0 0 0 
0 461.669 0 0 0 865.429 0 0 0 0 0 0 0 0 0 0 0 0 0 1437.04 0 -106.433 0 0 0 0 0 -930.433 0 0 0 0 0 -51.9578 0 0 0 0 0 0.09 -638.371 1502.2 0 0 -123.524 1129.72 923.414 0 0 0 0 0 0 0 0 1334.04 0 -1767.71 0 0 1997.51 0 0 0 0 0 0 1517.91 0 0 0 0 0 0 0 0 0 0 0 
0 0 0 1290.25 0 -2123.1 0 0 0 0 0 -582.522 0 1769.23 315.638 0 0 0 -1190.15 0 2149.49 0 0 0 -2146.44 -2227.62 0 0 -445.799 0 0 0 0 0 1399.81 0 -1354.79 0 0 2045.27 0.06 1533.02 0 0 0 0 0 0 0 0 -799.661 0 328.303 2247.76 0 0 0 0 0 0 -1320 0 0 0 0 0 0 0 0 146.718 0 -1939.38 0 -294.733 0 0 424.741 0 0 
0 0 0 0 0 -252.617 0 0 0 0 0 2038.26 947.371 0 0 2460.33 -387.509 0 -1866.13 0 0 0 0 0 0 0 1070.06 928.449 -194.021 0 1713.08 1950.67 0 0 0 0 0 0 0 237.51 1920.3 0.03 0 0 456.481 0 0 0 0 -1755.35 0 0 0 1252.86 0 0 -583.59 0 0 0 0 81.5607 -1384.55 0 0 0 1284.45 0 1869.95 0 0 2031.08 2198.48 0 0 0 -2012.62 0 0 
-1252.86 0 1616.49 0 0 0 -712.989 0 0 2075.03 0 0 0 0 0 -445.036 0 -2424.31 0 0 0 2346.19 0 0 0 0 0 0 0 1772.44 0 1977.52 0 0 1766.18 0 0 1359.07 0 0 0 0 0 0 0 0 0 0 0 478.759 2456.05 0 0 -1879.25 0 0 0 0 0 1825.54 0 0 1754.74 0 -793.252 0 0 0 0 1391.26 0 0 0 0 0 0 0 0 0 
-165.944 0 0 1236.99 324.488 0 0 0 0 0 0 2275.23 0 0 0 0 0 0 73.3207 -757.851 -121.54 0 -2357.48 0 0 0 0 1448.33 2329.1 0 0 0 2056.26 0 0 0 0 0 0 0 0 0 0 0.01 -1871.78 0 0 0 0 0 2163.84 0 0 0 0 0 0 0 0 0 -2083.73 0 0 0 -2400.51 0 0 0 -463.347 0 -585.421 0 0 0 -894.726 0 0 0 0 
0 0 0 0 0 2368.01 0 0 0 0 0 0 0 677.282 -1555.45 0 0 0 0 2275.69 0 0 0 0 0 0 0 0 1313.9 0 -798.135 0 0 -1724.52 0 0 0 307.703 0 1724.83 0 -984.298 0 -371.487 0.05 -1930.68 0 887.097 0 0 0 0 0 0 0 0 0 0 0 0 0 -284.814 1629.61 0 696.814 0 0 0 0 0 0 0 -1495.64 0 0 2277.52 0 0 0 
0 -783.334 0 0 0 0 0 0 0 0 -1752.91 0 0 1582.92 1396.45 0 0 0 0 0 0 0 0 0 0 0 0 0 0 0 0 0 0 0 0 0 0 2355.95 0 -1765.42 0 0 0 0 39.14 0.06 0 0 0 0 1217 931.043 0 0 0 -767.006 0 0 0 0 0 -2363.12 0 0 1755.35 0 0 0 0 0 0 0 753.121 0 0 0 0 0 0 
1264.15 0 -2189.17 0 1031.14 999.405 0 0 0 0 276.727 0 -630.436 0 0 0 0 -1933.27 0 0 1803.57 0 1128.8 -642.186 0 0 0 0 0 0 0 0 558.87 0 0 0 263.604 -11.9785 2016.74 1485.26 0 0 0 0 0 0 0.04 0 0 0 0 116.962 0 0 0 -935.316 0 1234.86 0 0 0 0 912.275 0 -113.91 0 -1474.58 0 0 0 0 0 0 -2498.78 1920.61 0 0 0 0 
0 0 0 0 0 -1577.27 0 0 0 927.381 0 -123.524 0 -146.87 0 -2047.87 0 0 0 -448.241 0 0 1653.57 2106.77 1461.76 0 0 0 0 0 0 1683.63 0 203.024 0 0 1834.09 0 -1624.42 0 0 0 0 0 12.1311 0 0 0.08 0 0 -339.29 -1413.39 0 0 0 0 0 1432.92 0 0 0 2340.54 0 -689.337 -2366.18 0 0 0 0 0 0 0 -2177.88 653.325 0 0 0 0 0 
62.9444 0 2340.24 0 0 -2417.45 0 0 1041.83 0 0 0 1033.43 0 0 0 0 0 2334.89 88.4274 0 0 0 2002.4 0 640.355 0 0 1717.96 0 0 0 0 0 0 0 0 0 434.965 0 0 0 0 0 0 0 0 0 0.05 0 0 0 0 0 0 0 0 -551.393 0 1215.78 -1385.92 0 0 0 0 857.952 0 0 0 0 0 -893.811 0 0 0 0 0 2190.08 0 
-392.85 251.854 0 0 0 0 0 0 -1602.91 1893.14 -2016.13 0 0 2001.17 0 0 -1062.12 0 945.845 2309.87 262.078 0 0 0 -1618.93 0 0 -230.186 0 0 0 0 0 0 0 0 -2280.57 0 1410.64 0 0 36.3933 -332.118 0 0 0 0 0 0 0.03 0 0 0 0 0 0 0 0 0 0 0 0 1623.36 0 0 0 0 0 0 0 2030.32 0 221.183 0 0 0 0 0 0 
0 2006.06 0 0 0 0 0 0 0 0 -1029.16 0 1955.7 0 0 0 0 0 0 0 0 0 0 0 -1456.11 0 0 0 0 0 -1206.17 0 0 0 0 0 1272.39 0 0 0 -2280.72 0 156.178 1097.52 0 959.426 0 2159.57 0 0 0 0 0 -292.444 0 0 0 0 0 451.292 0 0 0 0 0 46.7696 0 0 0 0 0 881.298 2255.39 -193.869 0 -529.878 0 -2230.37 0 
0 0 0 0 0 0 -702.46 0 0 0 1493.5 72.2526 0 0 0 0 0 -908.307 0 0 -1892.38 770.974 0 0 0 -183.798 0 0 0 0 0 218.741 0 2091.36 0 1692.02 0 0 0 0 0 0 0 0 0 2156.06 1136.28 1297.57 0 0 0 0.07 0 0 466.247 -1956.31 0 0 256.89 0 0 0 0 0 0 0 2096.7 1951.28 0 0 0 0 0 0 0 0 0 0 0 
-1207.54 2319.64 0 0 0 -1684.55 -887.402 0 0 0 0 0 0 0 0 2308.95 1963.03 0 0 1159.47 0 0 0 0 0 928.144 0 -590.915 0 0 0 -787.606 0 0 0 2160.79 921.278 0 709.479 0 2199.55 0 0 0 0 0 0 0 0 0 0 0 0.04 0 -740.913 0 0 0 0 0 2460.33 0 1455.2 925.398 0 0 0 0 0 -1425.14 1774.12 0 741.371 0 0 0 0 0 -1754.43 
0 0 0 -789.59 2333.22 0 0 0 0 -2092.27 0 0 -1759.62 360.958 0 0 0 0 2138.66 0 2375.94 0 0 0 0 0 0 0 2141.56 0 0 0 0 0 0 0 0 0 0 0 457.549 -1466.8 1549.04 0 0 0 0 0 0 0 -514.618 0 0 0.05 0 0 0 0 0 0 0 1471.53 0 727.943 1932.81 0 0 0 0 0 0 1343.5 0 0 0 0 0 0 0 
0 0 -1970.96 0 0 -2227.01 0 1907.03 -535.371 1896.19 0 0 0 0 0 0 0 -898.999 1175.04 0 2476.96 0 0 0 0 0 2275.08 1459.01 932.722 0 0 -371.029 -1525.85 0 0 0 0 0 0 0 0 0 0 0 0 0 0 0 0 0 0 150.075 1200.22 0 0 0 0 0 0 0 0 2083.88 0 0 2319.64 0 0 -162.282 0 0 0 0 2369.23 0 0 0 0 0 769.143 
0 0 0 0 0 0 -550.172 1200.98 0 0 0 0 0 0 0 0 2063.43 0 -400.632 0 0 0 0 541.322 808.512 0 0 388.73 0 -1114.15 0 0 0 1463.44 0 0 0 0 0 -448.393 0 0 0 0 0 1382.56 -72.2526 0 0 0 0 -404.599 0 0 0 0.05 0 0 0 0 0 0 -1744.67 0 0 0 1871.17 0 541.169 745.491 0 -1530.12 0 0 0 0 0 0 0 
0 0 0 0 0 0 0 0 0 308.313 0 0 0 0 0 1524.78 0 0 0 886.181 0 0 0 0 0 -1561.25 0 0 0 -1585.97 0 -853.221 0 0 0 0 0 0 -1058.31 0 0 -1374.02 0 0 0 0 0 0 0 0 0 0 0 0 0 0 0.02 0 0 2128.59 0 0 0 1829.66 0 -752.205 0 0 1207.85 2083.57 0 0 0 0 0 0 0 551.393 0 
0 875.958 0 0 0 0 0 0 -11.8259 0 0 0 0 0 0 0 0 0 0 0 0 2156.06 1392.03 0 -544.221 0 0 0 0 844.218 0 1077.23 0 0 0 2189.63 1793.04 -1960.13 0 269.097 0 0 0 0 0 0 810.19 -620.975 -765.023 0 0 0 0 0 0 0 0 0.03 0 0 0 0 0 0 1656.32 -1236.53 -2226.1 -1607.03 962.783 0 0 0 0 349.208 0 0 0 -703.986 0 
0 -1815.47 0 180.593 0 1671.73 0 0 1128.96 0 0 0 0 0 1263.08 0 0 0 0 997.269 2396.85 1621.22 0 0 -1678.59 0 0 0 -2175.28 0 0 0 0 0 925.245 0 0 -1688.97 802.56 0 0 0 0 0 0 0 0 0 0 0 0 -1710.33 0 0 0 0 0 0 0.02 0 0 0 367.367 0 1294.06 0 0 0 0 0 0 417.875 0 154.5 0 0 0 0 2287.59 
0 0 1084.25 0 0 0 -125.813 0 0 -2385.71 0 0 0 0 1578.65 0 0 0 0 1567.05 0 0 1062.27 -707.19 839.03 0 1946.39 0 0 0 0 0 0 0 0 -1005.81 0 0 0 0 0 0 -1271.94 0 0 0 0 0 1798.07 0 -646.001 0 0 0 0 0 433.287 0 0 0 0 -2158.65 167.47 0 0 0 0 0 0 0 0 0 0 1373.26 0 0 0 0 0 
0 0 -363.857 0 0 0 0 2089.98 -136.189 1185.42 0 0 1975.54 0 0 0 0 0 427.183 0 0 0 0 0 -1902.3 0 0 0 -408.567 0 1404.23 0 1726.36 0 0 0 0 0 0 177.236 -589.694 0 0 -1126.97 0 0 0 0 1850.11 0 0 0 -945.54 0 0 0 0 0 0 0 0.01 0 0 -1964.25 0 0 -1119.8 0 0 0 0 1853.31 0 2100.21 0 -748.543 0 0 0 
0 1880.32 0 0 0 1797.01 -228.965 1903.52 0 0 0 0 66.9118 0 1780.37 0 0 0 -516.602 0 0 0 0 0 250.938 970.717 0 0 0 0 1681.49 0 0 -917.158 -1390.35 0 0 0 0 0 0 1152.3 0 0 -1038.77 1746.19 0 -1782.66 0 0 0 0 0 608.463 212.79 0 0 0 0 -407.041 0 0.09 0 0 -1070.21 0 0 699.255 0 1994.31 0 0 0 0 0 2487.64 -2414.09 0 0 
0 0 0 2019.33 0 1894.36 0 2235.71 0 0 0 0 1092.33 2470.85 0 0 0 0 1730.93 0 -877.483 0 0 1377.22 1991.26 0 0 0 0 0 0 0 0 0 0 0 0 -2174.37 0 0 0 2104.02 400.479 0 -827.738 0 1836.38 0 0 186.697 0 0 120.167 0 0 417.112 0 0 1463.13 934.858 0 0 0.04 1655.86 0 0 0 0 0 1160.08 0 -2296.9 0 0 0 0 0 0 0 
0 0 0 0 0 0 204.398 0 0 1447.11 1068.68 0 0 0 0 0 0 67.3696 0 0 0 -1952.8 0 0 -1813.03 0 497.681 0 0 0 0 0 0 -2122.64 0 0 0 -433.287 0 0 0 0 0 0 0 0 0 436.949 0 0 0 0 497.833 1681.65 0 0 -1956.77 0 0 0 2372.13 0 270.775 0 0 1901.68 0 0 1667.61 0 387.204 0 -1429.41 293.97 0 0 599.612 0 0 
0 491.729 0 0 0 0 0 0 0 618.686 0 -2308.95 0 -1077.23 -1006.12 0 0 -2096.24 0 -1691.26 0 2464.75 0 2014.76 0 -80.34 0 0 355.464 0 0 646.306 0 0 0 -2162.01 0 0 0 0 0 0 -2470.09 1422.39 1168.78 2291.71 2277.83 2145.07 0 0 0 0 0 -49.3637 -1605.66 0 0 2173.3 1700.26 0 0 1924.27 0 0 0.07 0 0 -1019.85 0 0 55.62 1336.63 0 633.946 0 0 0 1464.05 0 
0 0 0 0 0 0 970.717 0 0 0 0 -1599.25 0 0 0 0 0 0 0 0 0 0 0 -496.307 0 0 0 0 0 1216.39 0 1814.71 0 0 2367.7 0 0 0 0 0 0 0 0 0 0 0 0 0 1020.16 0 990.402 0 0 0 0 0 -1846.75 -552.614 0 0 0 0 0 -558.718 0 0.01 1500.67 0 0 1103.63 0 1612.98 -1874.22 0 0 0 0 0 0 
0 1179.77 -1137.2 -1218.38 0 0 1453.52 0 576.266 0 0 0 0 -1216.24 2347.87 0 244.53 0 0 0 0 0 0 0 0 0 0 0 0 0 0 0 0 0 0 0 0 0 0 0 0 -980.636 0 0 0 0 1397.98 0 0 0 0 714.972 0 0 0 -386.135 0 -253.38 0 0 -809.427 0 0 0 0 891.064 0.08 0 -962.325 54.857 0 0 2404.93 0 -1119.95 0 0 0 0 
0 0 0 0 0 1988.05 1602.91 0 0 0 2461.7 0 854.747 9.68963 0 0 -633.488 0 -469.451 0 0 0 0 0 0 0 0 0 0 0 0 1564.46 0 0 0 0 -609.073 0 0 1765.57 0 0 0 0 0 0 0 0 0 0 0 -6.33259 0 0 -98.6511 0 0 -16.7089 0 0 0 2338.4 0 0 1075.4 0 0 0.09 0 0 0 0 0 497.07 0 0 0 0 0 
0 0 0 0 0 0 0 0 0 0 0 870.464 0 157.857 0 0 1981.8 0 782.418 -1282.01 0 0 0 2294.15 0 -1164.51 1853.01 0 0 -1759.93 0 0 0 0 0 0 308.161 0 0 0 0 869.854 0 -904.95 0 0 0 0 0 0 0 0 0 0 0 2413.02 1396.15 -274.743 0 0 0 0 0 -1932.97 0 0 -631.199 0 0.01 0 0 0 0 0 0 0 0 0 0 
0 298.853 0 0 0 0 0 0 0 0 110.553 0 0 0 0 0 -1140.4 -1962.87 0 518.738 0 671.789 0 1322.6 -1441.62 0 0 0 0 0 0 0 1151.23 0 0 0 -2137.75 2169.33 0 0 1359.07 0 285.73 0 0 0 0 0 0 0 0 0 541.627 0 0 1962.26 822.092 0 0 0 0 -199.057 636.54 0 0 1066.09 1141.01 0 0 0.08 0 0 0 0 0 0 0 0 0 
0 0 0 0 0 0 0 1864.6 0 0 0 0 0 0 0 0 0 0 0 0 0 0 0 -362.331 0 0 0 0 -2463.07 0 0 0 0 0 1959.82 0 0 1318.48 0 0 0 0 0 786.233 0 0 0 0 0 361.721 0 0 693.762 0 0 0 0 0 0 0 0 0 0 1199.45 -465.331 0 0 0 0 0 0 0 0 0 -2195.27 0 1272.39 0 0 
0 0 0 0 -68.7429 0 0 0 0 0 0 0 0 1466.8 0 0 -1800.36 0 0 0 0 0 0 2013.84 -634.709 0 0 2406.46 2318.72 0 580.844 0 -1120.72 0 591.525 0 0 0 0 0 -937.91 1718.42 0 0 0 0 0 0 -999.252 0 436.491 0 0 -277.642 0 -1429.26 0 0 -780.74 0 -1926.56 0 -979.263 0 1443.3 40.2081 0 0 0 0 0 0.05 0 0 0 0 0 0 0 
0 1531.19 1416.75 0 0 0 1076.62 0 0 0 0 798.135 -2178.95 0 0 0 0 323.267 0 0 0 0 0 933.485 0 0 1959.97 0 0 0 -833.079 0 0 0 0 0 1846.14 0 0 0 0 -756.63 0 0 3.58592 -1027.79 0 -2432.86 0 -1405.45 580.691 0 -1734.6 0 373.165 0 0 0 0 0 0 0 0 660.344 0 -1416.9 796.304 0 0 0 0 0 0.09 0 0 0 0 0 0 
0 -735.572 0 0 0 0 -839.488 0 1499.15 0 -1303.98 0 0 0 0 0 0 0 0 2058.24 0 -1364.86 0 0 0 0 1452.45 0 0 0 0 1746.19 0 0 0 1443.3 0 0 0 0 1634.8 0 0 0 0 0 -782.418 -59.5874 0 0 502.411 0 0 0 0 0 0 1337.09 1977.68 1809.21 -2430.88 0 0 1872.54 2211.14 0 0 -110.706 0 0 0 0 0 0.02 0 0 0 0 0 
1168.32 0 -1429.41 -43.7178 0 0 0 0 0 0 0 0 1027.63 0 1435.97 0 0 0 0 0 0 0 0 1875.9 0 0 0 -2318.11 0 0 0 0 803.934 0 0 0 0 0 -1208.3 0 0 0 0 78.9666 0 0 2271.26 0 0 0 0 0 0 0 0 0 0 0 0 0 0 0 0 0 0 0 -2005.91 0 0 0 1004.75 0 0 0 0.02 0 0 0 0 
0 1997.82 0 0 0 0 0 0 0 0 0 0 -478.912 0 0 0 0 0 -1753.21 0 0 0 0 0 0 1264.15 0 0 0 1466.34 0 0 -380.49 443.968 0 0 0 0 0 0 0 0 0 0 -40.9711 0 0 0 0 0 1853.77 0 0 0 0 0 0 0 0 0 350.887 0.686666 0 0 0 0 0 0 0 0 0 0 0 0 0 0.08 0 0 0 
0 0 2048.48 2345.88 0 0 0 0 0 0 0 0 0 -107.501 0 0 0 0 0 0 -1202.51 0 0 0 -1076.46 0 0 0 0 0 -1470.92 0 0 0 0 0 0 0 0 0 1767.1 -2328.79 0 0 0 0 0 0 0 0 0 0 0 0 0 0 0 0 0 0 0 1686.99 0 -1308.1 0 0 0 0 0 0 1204.95 0 0 0 0 0 0.01 0 0 
0 0 0 0 0 0 0 0 0 0 0 0 0 0 0 0 0 734.046 0 0 0 2272.94 0 0 -267.876 0 1906.26 0 0 0 0 0 0 0 0 0 0 0 0 0 0 0 0 0 0 0 0 0 616.092 0 1004.44 0 0 0 0 0 -481.658 -1090.96 0 0 0 0 0 0 276.116 0 0 0 0 0 0 0 0 0 0 0 0 0.05 361.11 
0 0 1237.45 0 -137.257 -49.9741 0 0 0 0 0 0 0 0 0 0 0 0 0 -1782.82 264.367 0 0 0 0 0 -924.482 0 0 0 0 0 0 0 0 0 0 0 0 0 0 0 0 0 0 0 0 0 0 0 0 0 1252.25 0 -425.81 0 0 0 589.236 0 0 0 0 0 0 0 0 0 0 0 0 0 0 0 0 0 0 763.344 0 
