*Vertices 54
*Matrix 
0.01 2368.01 248.344 0 38.0718 0 0 0 0 0 0 796.915 0 0 0 0 0 632.267 0 0 -2035.97 0 0 0 0 -1963.03 0 0 1090.35 0 0 0 0 630.436 0 2156.36 0 0 341.121 1705.76 0 0 0 2110.28 -2427.21 0 0 0 0 0 0 0 0 0 
2422.79 0.04 0 0 0 0 0 0 1007.95 0 0 1177.63 0 0 0 886.181 0 -1245.38 -880.23 0 0 0 269.86 0 0 0 0 0 0 0 0 0 655.919 0 -508.82 1959.97 0 0 0 0 0 0 0 0 0 0 0 0 0 -1483.89 -1665.93 0 0 0 
11.3681 0 0 0 0 0 -1198.54 0 0 0 1283.99 0 -371.639 0 693.304 0 0 0 0 0 0 0 1837.6 0 -707.648 0 0 0 0 -1759.62 582.827 0 0 0 1333.89 0 0 0 0 0 0 0 0 0 0 781.503 0 0 0 0 0 0 0 0 
0 0 0 0.01 0 1711.71 0 1081.5 0 0 0 182.424 0 0 0 0 0 0 0 953.627 -706.427 0 1853.01 0 -300.989 146.87 0 0 0 0 0 0 0 0 0 0 0 0 0 0 0 0 805.155 0 0 0 0 0 0 0 0 0 0 0 
1099.81 0 0 0 0.01 0 0 0 0 836.131 -154.347 0 0 0 0 0 1681.49 0 0 0 -63.7074 -536.744 1867.81 0 570.009 0 0 0 -1885.66 0 1367 0 0 0 -169.149 0 0 0 -51.3474 0 0 0 0 0 0 -643.559 -159.383 0 0 2418.52 0 -1000.93 0 0 
0 0 0 -1826.15 0 0.06 0 -1704.84 0 0 0 370.418 0 0 2017.04 0 0 0 0 0 0 0 -1608.71 0 0 721.686 0 237.205 0 0 -1686.68 0 0 0 0 2465.82 0 0 0 1659.22 0 0 0 -1438.57 0 0 0 0 0 0 0 0 0 0 
0 0 1850.11 0 0 0 0.04 0 0 0 266.503 0 0 1456.88 2475.74 0 0 0 -1027.94 20.3711 0 875.195 -631.809 0 0 852.306 33.1889 -599.765 -1304.44 0 0 2389.83 0 0 -2474.52 0 0 -972.701 0 0 0 2261.35 0 -1146.5 0 0 0 0 0 0 0 2491.76 0 0 
0 0 0 2424.62 0 272.301 0 0.01 0 -679.418 1100.42 1950.51 0 0 0 0 0 0 1915.11 0 0 0 0 0 0 0 0 0 -243.309 0 0 -2312.92 0 0 1455.81 0 0 0 0 0 88.2748 -636.998 0 0 0 0 0 0 0 0 -2253.87 0 0 0 
0 -2225.18 0 0 0 0 0 0 0.08 0 0 0 0 0 0 0 0 0 0 0 -552.156 0 0 -713.752 1731.7 1276.51 0 0 0 767.769 -1041.22 0 0 0 1353.11 0 -202.872 0 0 1865.52 0 0 0 0 0 0 0 0 0 0 0 0 1089.13 0 
0 0 0 0 -1371.12 0 0 -407.193 0 0.08 2366.79 2193.44 0 0 1854.23 0 0 0 0 0 1073.72 0 0 0 2346.19 0 0 2014.15 0 0 922.651 0 0 0 -2032.46 15.7933 0 0 286.035 0 -1610.69 151.601 449.614 0 0 0 1111.71 0 0 -1130.94 0 242.241 0 -1739.33 
0 0 1982.25 0 -1014.05 0 2468.72 -258.873 0 -1097.37 0.07 1967.91 0 -518.433 2007.74 -835.978 0 0 0 0 0 0 -225.303 -196.158 0 0 0 0 0 0 0 0 0 -95.294 2279.96 0 0 0 0 -1210.14 0 0 0 0 0 0 107.654 0 0 0 0 0 0 0 
-488.372 2371.82 0 1165.12 0 1901.38 0 -1043.81 0 616.245 -2138.05 0.04 955.458 0 0 0 0 1803.26 0 0 -1073.26 -2491.61 -470.061 1390.5 0 2046.34 0 0 0 0 -1797.62 -2059.62 0 0 1728.03 0 -1071.58 -1389.74 0 0 0 0 0 1262.93 641.728 0 0 0 0 0 0 0 0 0 
0 0 -495.849 0 0 0 0 0 0 0 0 812.021 0 0 0 0 0 -1004.14 0 0 -974.837 0 0 0 0 0 72.4052 0 0 0 0 0 2410.73 0 0 0 1328.39 0 0 0 1695.07 0 0 0 330.134 0 0 593.661 -2266.53 0 0 0 0 0 
0 0 0 0 0 0 1395.23 0 0 0 1529.97 0 0 0.06 0 733.741 -679.571 0 0 1797.77 0 0 0 0 -1358.3 0 0 0 -440.153 0 0 0 0 0 -1826.61 170.522 0 0 0 0 0 676.366 0 0 0 0 0 0 354.244 0 0 0 0 1543.4 
0 0 90.8689 0 0 244.682 1990.19 0 0 -178.915 1441.62 0 0 0 0.09 2025.13 0 2036.73 -2204.73 0 0 0 0 0 1309.78 0 0 0 0 1558.35 594.729 0 799.203 0 0 -166.555 -565.432 0 0 -1772.9 0 -2423.86 0 0 0 0 0 0 0 1871.47 0 0 0 1578.95 
0 11.063 0 0 0 0 0 0 0 0 -1354.79 0 0 235.527 1372.34 0.03 0 1942.27 0 0 2078.54 0 0 2468.57 776.925 924.329 0 0 -955.611 0 0 -1540.35 0 0 0 -1523.41 0 0 0 0 0 646.611 2420.04 0 0 0 0 524.995 -1650.21 0 0 0 0 0 
0 0 0 0 1383.48 0 0 0 0 0 0 0 0 1019.55 0 0 0.02 0 0 1392.18 -1277.58 0 0 0 0 0 -2057.02 0 0 0 144.276 414.975 0 0 0 1039.54 0 -610.904 0 0 0 0 2163.99 186.85 0 0 0 0 -972.701 0 0 0 0 0 
2206.72 -497.528 0 0 0 0 0 0 0 0 0 -939.589 289.239 0 1878.8 -2414.85 0 0 0 -987.808 1056.17 0 1884.14 1353.72 0 0 0 0 0 558.718 0 0 1635.11 -196.005 0 0 0 2098.68 -585.269 2022.08 0 1133.38 690.1 0 0 0 0 0 0 0 0 508.667 0 0 
0 -49.2111 0 0 0 0 1684.09 -1447.57 0 0 0 0 0 0 -2408.14 0 0 0 0.02 0 0 1080.58 0 0 0 0 0 0 0 0 0 0 0 0 0 0 2212.67 0 1984.85 2136.07 -2306.67 716.803 549.715 1284.3 2389.52 0 375.759 0 0 0 0 0 0 861.309 
0 0 0 1698.28 0 0 -485.931 0 0 0 0 0 0 39.2926 0 0 -756.478 1169.7 0 0.06 0 0 0 0 1142.38 0 0 -2154.07 0 0 -79.4244 0 0 0 1179.46 0 -1150.93 0 2037.95 0 0 0 0 0 0 0 712.378 0 0 0 -11.6733 0 0 0 
-632.572 0 0 -1148.03 1398.28 0 0 0 1422.85 829.112 0 116.352 -2069.54 0 0 139.698 -2216.48 2196.04 0 0 0.01 2456.36 0 0 -2142.32 0 0 0 0 2109.97 0 0 0 1968.37 0 0 0 0 0 0 0 0 0 0 0 0 0 0 0 0 0 0 1410.79 0 
0 0 0 0 -88.8852 0 926.466 0 0 0 0 -788.217 0 0 0 0 0 0 1522.64 0 -2251.43 0.08 0 0 0 1801.13 0 307.55 0 0 0 0 0 1736.43 0 0 0 -2208.55 0 0 0 0 0 1892.83 0 0 0 -415.891 0 0 0 0 0 -811.411 
0 2005.91 2156.36 429.624 1384.24 -1205.1 2481.08 0 0 0 -1230.12 -1738.72 0 0 0 0 0 -573.672 0 0 0 0 0.06 0 -1407.13 0 2228.23 0 0 0 -976.821 0 0 0 0 1481.9 0 0 0 0 -593.356 111.164 0 0 -133.9 -931.043 0 0 2023.76 0 0 0 0 0 
0 0 0 0 0 0 0 0 1334.35 0 2205.34 1023.21 0 0 0 -139.851 0 1265.37 0 0 0 0 0 0.02 0 0 0 0 0 0 0 2140.64 0 0 762.276 -620.975 0 0 0 0 0 0 0 0 0 -793.71 0 0 0 -28.3059 0 0 0 0 
0 0 421.69 243.309 840.098 0 0 0 -6.94296 389.187 0 0 0 2222.28 -2309.87 1418.58 0 0 0 2082.96 849.559 0 -391.629 0 0.06 0 -2349.85 0 2049.24 0 -891.369 0 0 0 -1667.15 0 -23.1178 0 2157.58 0 0 0 0 -1722.24 -95.294 0 0 0 0 0 0 0 0 0 
-549.257 0 0 273.98 0 2146.9 1667.91 0 2425.69 0 0 1961.2 0 0 0 1322.14 0 0 0 0 0 -1017.56 0 0 0 0.01 0 0 1284.6 0 -1438.57 0 0 1357.84 2318.26 0 1812.42 0 518.281 0 0 -2196.49 0 2182.45 0 0 0 0 0 -1977.37 0 0 0 0 
0 0 0 0 0 0 -1306.12 0 0 0 0 0 1933.12 0 0 0 763.649 0 0 0 0 0 446.104 0 607.547 0 0.08 0 0 0 0 2250.82 0 743.812 0 -1771.52 1738.26 0 0 0 152.058 0 0 -145.65 0 0 0 0 0 0 0 0 0 0 
0 0 0 0 0 1183.74 -1543.24 0 0 -954.695 0 0 0 0 0 0 0 0 0 419.553 0 2042.83 0 0 0 0 0 0.06 0 -2259.67 0 -1312.83 0 0 0 -546.968 0 0 0 2222.28 0 0 1603.06 1322.6 0 907.086 0 0 0 0 0 0 0 0 
1909.62 0 0 0 -1217.92 0 1437.65 68.8955 0 0 0 0 0 -122.456 0 -1737.34 0 0 0 0 0 0 0 0 -665.38 338.679 0 0 0.04 -432.524 0 0 0 1570.86 0 0 0 368.13 2158.8 2041.15 -1670.2 -974.837 0 0 0 0 0 0 0 0 349.818 0 0 582.675 
0 0 1814.86 0 0 0 0 0 -1085.31 0 0 0 0 0 -800.424 0 0 437.712 0 0 -223.014 0 0 0 0 0 0 1914.2 1957.53 0.06 0 0 0 0 1746.8 1202.66 1519.44 0 0 2049.55 -1461.46 281.915 0 0 0 0 -1718.73 0 0 0 0 0 816.294 0 
0 0 1456.88 0 2265.62 356.685 0 0 2113.79 -2045.27 0 1513.95 0 0 2366.48 0 -1018.78 0 0 -2403.87 0 0 -2479.25 0 1139.18 -1127.89 0 0 0 0 0.04 0 0 0 0 2129.96 964.003 0 1772.44 0 284.356 0 0 0 1849.65 0 0 -2057.94 229.118 0 0 0 0 0 
0 0 0 0 0 0 2247.46 1878.49 0 0 0 59.2822 0 0 0 -603.427 -1634.95 0 0 0 0 0 0 339.747 0 0 1959.97 2455.44 0 0 0 0.08 1919.23 0 1394.47 -652.257 -847.728 0 0 -548.341 0 0 0 1054.64 0 -111.316 0 0 0 0 0 0 0 0 
0 -1801.89 0 0 0 0 0 0 0 0 0 0 -144.734 0 1063.49 0 0 -1320.76 0 0 0 0 0 0 0 0 0 0 0 0 0 -279.931 0.08 0 0 2185.51 0 0 2285.91 -266.961 -832.163 0 -46.3118 0 0 0 0 0 0 0 0 0 0 0 
-863.75 0 0 0 0 0 0 0 0 0 585.879 0 0 0 0 0 0 2121.72 0 0 2031.08 -1080.74 0 0 0 -511.567 9.68963 0 -1997.36 0 0 0 0 0.07 517.975 0 1095.54 0 0 1875.44 62.7918 0 0 0 0 0 0 0 0 0 0 0 0 -1178.7 
0 -385.525 2357.33 0 2322.23 0 -2106.31 767.922 869.854 619.449 -1383.02 -1284.3 0 -503.174 0 0 0 0 0 2333.37 0 0 0 1189.69 2226.25 -1009.02 0 0 0 811.869 0 2353.51 0 1509.83 0.01 0 -1899.85 0 -411.313 1555.76 0 -1697.52 0 0 0 326.624 0 0 1187.7 0 0 0 0 0 
-238.731 110.248 0 0 0 -57.1459 0 0 0 -2415.46 0 0 0 962.325 10.7578 -2455.6 1683.78 0 0 0 0 0 650.578 397.122 0 0 905.56 -2001.48 0 1798.23 -213.095 1319.39 -1445.59 0 0 0.04 0 2300.1 0 0 -273.37 0 0 -2277.06 1974.62 39.14 1847.36 0 -2331.08 0 0 0 0 0 
0 0 0 0 0 0 0 0 1568.88 0 0 841.319 2076.25 0 -1336.02 0 0 0 -2241.66 1300.62 0 0 0 0 -1035.87 619.602 -1895.89 0 0 -1589.18 970.107 1541.57 0 2251.88 197.378 0 0.04 0 0 0 0 0 0 0 0 0 1577.73 0 0 0 0 0 0 0 
0 0 0 0 0 0 1470.15 0 0 0 0 -2252.95 0 0 0 0 727.485 2373.35 0 0 0 -1030.23 0 0 0 0 0 0 1852.09 0 0 0 0 0 0 -774.331 0 0 1019.09 1659.22 0 0 0 372.86 0 -2184.59 0 0 0 0 0 0 0 0 
333.033 0 0 0 -494.629 0 0 0 0 83.8496 0 0 0 0 0 0 0 173.574 569.704 -335.322 0 0 0 0 -1799.45 2146.75 0 0 244.377 0 -251.854 0 85.6807 0 1854.84 0 0 -910.596 0.01 2310.48 0 0 428.709 0 0 0 369.655 0 0 -1697.52 0 0 0 -2248.38 
1004.44 0 0 0 0 -1135.52 0 0 155.263 0 -427.946 0 0 0 1766.03 0 0 -2103.11 -1977.68 0 0 0 0 0 0 0 0 -1708.81 1325.5 2140.95 0 2486.88 -1343.04 2324.52 1317.41 0 0 1506.78 -423.521 0.09 0 0 0 0 0 0 0 0 0 0 0 0 0 0 
0 0 0 0 0 0 0 350.276 0 358.821 0 0 -1818.52 0 0 0 0 0 -15.183 0 0 0 2192.83 0 0 0 -1473.82 0 2365.87 1699.8 -1000.47 0 -1960.13 -1058.31 0 -520.722 0 0 0 0 0.03 0 0 0 2141.87 968.734 0 0 0 0 0 0 -2487.64 0 
0 0 0 0 0 0 -1020.92 1791.97 0 1142.84 0 0 0 882.977 693.304 1415.83 0 -445.341 -737.556 0 0 0 1489.23 0 0 7.40074 0 0 2388.15 -1152 0 0 0 0 2204.89 0 0 0 0 0 0 0.08 0 0 0 -1388.82 0 0 0 0 0 0 0 0 
0 0 0 988.418 0 0 0 0 0 -666.143 0 0 0 0 0 880.078 -1661.5 1014.21 407.651 0 0 0 0 0 0 0 0 1612.06 0 0 0 0 606.021 0 0 0 0 0 1076.46 0 0 0 0.08 0 0 0 0 0 0 0 -1437.8 0 0 0 
-334.101 0 0 0 0 1682.41 1986.98 0 0 0 0 2424.47 0 0 0 0 -1804.33 0 -2189.17 0 0 1159.78 0 0 -1708.04 1663.79 -1273 -1763.74 0 0 0 686.743 0 0 0 2425.23 0 -328.455 0 0 0 0 0 0.02 -1873.45 0 0 0 0 0 0 0 0 0 
1844.46 0 0 0 0 0 0 0 0 0 0 91.6318 1295.89 0 0 0 0 0 1657.38 0 0 0 1468.17 0 2457.88 0 0 0 0 0 2404.32 0 0 0 0 1076.77 0 0 0 0 1881.24 0 0 239.494 0.07 0 0 0 0 0 1386.68 0 0 0 
0 0 78.3563 0 -600.528 0 0 0 0 0 0 0 0 0 0 0 0 0 0 0 0 0 -465.789 522.858 0 0 0 666.601 0 0 0 -2464.29 0 0 1379.82 582.98 0 734.809 0 0 1344.42 806.68 0 0 0 0.03 0 0 0 0 0 0 0 0 
0 0 0 0 1594.06 0 0 0 0 -650.273 1584.75 0 0 0 0 0 0 0 -1115.83 717.109 0 0 0 0 0 0 0 0 0 1429.87 0 0 0 0 0 -2032.61 -921.888 0 2441.4 0 0 0 0 0 0 0 0.03 0 0 0 2262.57 0 -203.177 0 
0 0 0 0 0 0 0 0 0 0 0 0 -374.233 0 0 540.712 0 0 0 0 0 276.421 0 0 0 0 0 0 0 0 617.008 0 0 0 0 0 0 0 0 0 0 0 0 0 0 0 0 0.07 0 0 0 0 0 0 
0 0 0 0 0 0 0 0 0 0 0 0 -1442.08 823.466 0 -1003.83 1884.29 0 0 0 0 0 51.5 0 0 0 0 0 0 0 1116.75 0 0 0 1126.97 -20.9815 0 0 0 0 0 0 0 0 0 0 0 0 0.07 0 0 608.31 0 0 
0 1792.43 0 0 1836.07 0 0 0 0 1207.39 0 0 0 0 1155.35 0 0 0 0 0 0 0 0 -971.633 0 -1966.69 0 0 0 0 0 0 0 0 0 0 0 0 1215.78 0 0 0 0 0 0 0 0 0 0 0.03 0 0 0 0 
0 -351.344 0 0 0 0 0 -2332.15 0 0 0 0 0 0 0 0 0 0 0 677.587 0 0 0 0 0 0 0 0 590.609 0 0 0 0 0 0 0 0 0 0 0 0 0 1960.43 0 1616.64 0 -1328.7 0 0 0 0.06 0 0 0 
0 0 0 0 -1334.35 0 2479.25 0 0 1276.82 0 0 0 0 0 0 0 443.663 0 0 0 0 0 0 0 0 0 0 0 0 0 0 0 0 0 0 0 0 0 0 0 0 0 0 0 0 0 0 -958.357 0 0 0.06 0 0 
0 0 0 0 0 0 0 0 1787.85 0 0 0 0 0 0 0 0 0 0 0 508.82 0 0 0 0 0 0 0 0 -165.334 0 0 0 0 0 0 0 0 0 0 -732.673 0 0 0 0 0 1003.68 0 0 0 0 0 0.05 0 
0 0 0 0 0 0 0 0 0 -1155.51 0 0 0 -662.328 -2065.42 0 0 0 1383.18 0 0 -1025.04 0 0 0 0 0 0 1901.38 0 0 0 0 2305.14 0 0 0 0 2036.12 0 0 0 0 0 0 0 0 0 0 0 0 0 0 0 
