*Vertices 56
*Matrix 
0.07 0 0 0 424.284 1556.67 -1553.47 0 0 0 2184.13 0 0 0 0 1905.5 0 0 0 -1457.03 0 -1965.16 0 0 0 0 0 0 0 0 0 0 716.193 0 0 0 0 0 0 0 0 0 0 0 0 0 0 0 0 0 0 0 0 -1522.19 0 0 
0 0.07 0 0 0 2429.35 746.864 2097 -2432.55 0 0 0 0 0 0 0 0 0 0 0 0 0 0 0 0 0 0 0 0 0 535.981 0 0 0 0 0 690.405 0 0 0 0 0 -1386.53 0 0 0 0 0 0 0 0 0 0 0 0 0 
0 0 0.08 1266.29 2448.88 0 -2094.56 -2078.54 2310.33 -827.128 0 0 0 0 716.803 0 0 0 0 2257.99 0 0 0 0 0 0 0 0 0 0 2437.13 0 0 40.8185 -2181.54 0 0 0 0 -1556.06 0 0 0 0 0 0 0 0 0 0 0 0 0 0 0 0 
0 0 -436.644 0.09 0 0 0 0 -887.707 1054.8 0 0 0 1922.13 0 0 0 0 0 0 0 0 0 -407.804 -1855.6 0 1794.11 0 0 0 0 0 -1704.08 0 0 0 0 0 0 0 0 0 0 0 0 0 0 0 0 0 2048.02 0 0 0 0 0 
1603.37 0 616.703 0 0 0 -1047.93 0 77.2881 2490.23 -1227.68 0 970.565 0 0 0 0 0 0 0 0 0 2396.54 0 0 0 0 0 953.627 0 0 0 0 0 0 0 0 0 0 0 0 0 0 -1276.67 0 0 0 0 0 0 0 701.392 0 0 0 0 
866.344 1838.21 0 0 0 0.05 982.62 0 0 55.4674 0 0 0 328.303 0 1000.17 0 0 0 0 0 0 0 0 0 0 0 -2103.11 0 0 0 0 0 551.851 0 0 0 0 0 -888.928 0 0 0 0 0 0 0 0 0 1368.98 0 0 0 0 0 0 
-2121.42 -1998.58 1052.51 0 1418.88 248.192 0.04 2006.82 -1241.87 0 -568.941 0 -298.853 0 691.931 1229.67 0 0 0 0 0 0 0 0 0 0 0 0 0 0 0 0 0 0 0 0 0 0 823.618 0 0 0 0 0 0 0 2322.23 0 0 0 0 0 0 0 0 0 
0 2404.63 1281.85 0 0 0 -525.452 0.04 0 -152.211 0 0 0 0 0 859.63 0 0 0 0 0 0 0 0 0 0 0 0 0 0 0 0 0 0 0 1266.59 0 0 0 0 0 0 0 0 0 0 0 1319.39 0 0 0 0 0 0 0 0 
0 1993.24 1612.06 1166.65 1453.06 0 -2035.51 0 0.09 0 0 0 0 0 0 -236.442 0 0 0 0 2455.14 0 0 1339.84 0 0 0 0 -1184.65 0 0 0 0 0 -1638.77 0 0 0 0 0 -12.8941 0 0 0 513.245 0 0 0 0 0 0 0 0 0 0 2138.2 
0 0 86.2911 -1667.61 2420.19 1965.93 0 2033.22 0 0.03 0 1985.46 0 -741.218 0 0 0 0 0 0 0 0 0 0 0 1389.58 0 0 0 0 -970.26 1536.07 0 0 0 0 0 0 -550.325 0 2035.05 0 0 0 0 0 0 0 0 0 0 0 1553.62 145.344 0 0 
1706.98 0 0 0 426.878 0 2184.13 0 0 0 0.09 0 -384.152 697.729 -146.26 0 0 -2086.78 0 0 0 967.513 -1272.24 0 0 0 0 0 0 0 0 0 0 0 0 0 0 0 0 0 0 0 0 0 0 0 0 0 0 0 0 0 0 0 0 0 
0 0 0 0 0 0 0 0 0 2368.47 0 0.06 0 0 1740.39 0 2030.17 0 0 1058.92 0 0 0 0 2350 2475.74 0 0 0 0 0 0 0 0 0 0 0 0 0 0 0 0 0 0 0 0 0 0 0 0 0 0 0 0 0 0 
0 0 0 0 1900.01 0 432.676 0 0 0 2445.37 0 0.01 0 2072.59 0 0 0 0 0 0 0 -1435.36 0 0 0 0 0 0 0 0 0 0 1326.26 0 0 0 0 0 0 0 0 1497.47 1877.12 0 0 1061.97 0 0 0 0 0 0 0 0 0 
0 0 0 543.153 0 -184.256 0 0 0 952.101 1039.69 0 0 0.06 0 0 0 0 1129.11 0 -1698.89 0 0 0 0 0 0 0 0 0 0 -177.084 678.198 0 2403.71 0 0 0 0 0 0 0 0 0 0 -76.0674 0 0 -283.898 0 0 0 0 -2275.84 0 0 
0 0 1260.03 0 0 0 2165.67 0 0 0 -1101.18 870.159 1060.75 0 0.09 0 0 531.098 0 0 0 0 0 0 0 0 864.055 0 0 -1819.59 0 0 0 0 0 0 0 0 0 0 0 -2208.7 1247.52 0 0 0 0 0 0 0 0 0 0 0 0 0 
-1335.72 0 0 0 0 -1676.31 469.146 1477.32 1827.52 0 0 0 0 0 0 0.01 0 0 0 0 0 0 0 0 1436.43 0 0 0 0 0 0 0 0 0 0 0 0 1007.49 0 0 0 0 0 0 0 0 174.184 0 0 0 517.212 0 0 0 0 0 
0 0 0 0 0 0 0 0 0 0 0 1622.59 0 0 0 0 0 0 0 0 0 0 203.024 0 0 0 0 0 -2215.11 0 0 0 0 0 0 0 0 0 0 0 -1078.45 0 0 0 2229.3 0 0 1207.85 0 0 0 0 0 0 0 0 
0 0 0 0 0 0 0 0 0 0 1501.13 0 0 0 -2102.19 0 0 0.01 0 0 0 0 1650.36 0 0 0 0 0 0 0 0 0 0 0 0 0 0 0 0 0 0 0 0 0 694.525 0 0 0 0 1671.27 0 0 0 0 0 0 
0 0 0 0 0 0 0 0 0 0 0 0 0 2168.11 0 0 0 0 0.04 0 0 2286.68 0 0 0 0 0 503.632 0 0 0 1595.28 0 0 0 0 -253.685 0 0 0 0 0 0 -2305.6 -1701.79 0 0 0 0 0 0 0 0 0 0 0 
1810.43 0 -1290.55 0 0 0 0 0 0 0 0 35.02 0 0 0 0 0 0 0 0.09 0 2386.62 0 0 0 -1538.36 0 0 0 0 0 0 0 0 0 0 0 0 0 430.235 0 0 0 0 0 0 0 0 0 -1645.63 0 0 0 0 0 0 
0 0 0 0 0 0 0 0 591.067 0 0 0 0 1946.39 0 0 0 0 0 0 0.07 0 0 0 0 0 0 0 0 0 0 -57.6037 0 0 0 0 0 0 0 0 0 0 0 0 0 1852.85 0 0 0 0 0 0 0 0 0 0 
374.538 0 0 0 0 0 0 0 0 0 1310.69 0 0 0 0 0 0 0 238.731 1654.33 0 0.04 0 0 0 969.955 1364.41 0 0 0 0 0 0 -855.052 0 0 0 0 0 2299.95 1742.68 0 0 0 0 0 0 0 0 0 0 0 0 0 0 0 
0 0 0 0 1632.36 0 0 0 0 0 1233.18 0 -808.969 0 0 0 1830.27 895.947 0 0 0 0 0.02 -141.53 0 0 0 0 0 0 0 0 1909.92 0 0 0 0 0 0 0 0 248.65 0 0 0 0 0 0 0 0 -438.169 0 332.118 962.172 0 0 
0 0 0 2157.58 0 0 0 0 1004.29 0 0 0 0 0 0 0 0 0 0 0 0 0 131.916 0.06 0 0 0 0 1914.81 0 0 0 -2379.45 0 0 0 0 -884.35 0 0 0 0 0 0 0 0 0 0 1885.2 0 0 0 0 0 0 0 
0 0 0 1144.06 0 0 0 0 0 0 0 -2488.86 0 0 0 1522.03 0 0 0 0 0 0 0 0 0.03 0 0 0 0 0 0 0 0 0 0 0 0 0 0 0 0 0 0 0 109.333 0 0 0 0 0 0 2166.43 0 0 0 0 
0 0 0 0 0 0 0 0 0 1428.04 0 1491.52 0 0 0 0 0 0 0 76.3726 0 2371.06 0 0 0 0.06 0 0 0 0 0 0 0 0 0 0 0 -325.709 0 849.101 0 0 -1265.68 0 0 0 0 0 0 0 0 0 0 0 0 0 
0 0 0 842.387 0 0 0 0 0 0 0 0 0 0 -670.568 0 0 0 0 0 0 1650.36 0 0 0 0 0.03 -555.361 0 0 0 0 0 0 0 0 0 0 0 0 0 0 0 0 0 0 0 0 0 0 0 0 983.383 0 0 0 
0 0 0 0 0 918.073 0 0 0 0 0 0 0 0 0 0 0 0 2181.69 0 0 0 0 0 0 0 1098.59 0.08 0 0 0 0 0 0 0 0 0 788.827 0 0 0 -442.747 -2309.41 0 0 1079.97 0 0 0 0 0 351.65 0 0 -2300.87 0 
0 0 0 0 1689.12 0 0 0 1572.24 0 0 0 0 0 0 0 14.8778 0 0 0 0 0 0 -319.3 0 0 0 0 0.03 0 0 0 0 -1489.38 0 0 0 0 973.006 0 0 0 0 1437.04 0 0 0 0 0 0 0 0 0 0 0 0 
0 0 0 0 0 0 0 0 0 0 0 0 0 0 739.845 0 0 0 0 0 0 0 0 0 0 0 0 0 0 0.02 0 0 0 0 0 0 399.564 0 0 0 0 0 1948.84 0 0 459.075 0 0 0 0 0 0 0 0 0 -1818.98 
0 2481.38 2337.34 0 0 0 0 0 0 -193.106 0 0 0 0 0 0 0 0 0 0 0 0 0 0 0 0 0 0 0 0 0.07 0 0 2105.4 0 0 0 0 0 0 1096.91 0 0 0 0 0 0 0 0 0 -2336.73 0 0 0 0 0 
0 0 0 0 0 0 0 0 0 829.722 0 0 0 619.144 0 0 0 0 2247.46 0 -368.74 0 0 0 0 0 0 0 0 0 0 0.03 0 0 0 1842.78 0 0 1623.05 0 0 0 0 0 -35.6304 815.073 0 0 0 0 -1109.27 0 0 0 -183.493 0 
2191.15 0 0 2427.21 0 0 0 0 0 0 0 0 0 1245.38 0 0 0 0 0 0 0 0 -1651.43 1075.85 0 0 0 0 0 0 0 0 0.07 0 -1240.35 0 0 0 0 0 0 430.845 0 0 0 0 0 0 0 0 0 0 0 0 0 0 
0 0 176.321 0 0 -2499.39 0 0 0 0 0 0 921.278 0 0 0 0 0 0 0 0 1139.33 0 0 0 0 0 0 1143.3 0 1437.96 0 0 0.07 0 0 0 -1098.74 0 0 0 -436.491 0 0 0 0 0 0 0 0 0 2018.42 -1406.37 0 0 0 
0 0 1980.88 0 0 0 0 0 1095.08 0 0 0 0 1498.38 0 0 0 0 0 0 0 0 0 0 0 0 0 0 0 0 0 0 585.269 0 0.08 1011.46 0 0 0 0 0 0 0 0 0 326.624 0 0 0 0 0 0 1255.61 0 0 0 
0 0 0 0 0 0 0 1245.69 0 0 0 0 0 0 0 0 0 0 0 0 0 0 0 0 0 0 0 0 0 0 0 1523.1 0 0 -1733.07 0.04 2289.57 0 -240.715 0 0 0 0 0 0 0 -73.7785 0 0 2003.62 0 0 0 0 -155.873 0 
0 -1816.54 0 0 0 0 0 0 0 0 0 0 0 0 0 0 0 0 1733.99 0 0 0 0 0 0 0 0 0 0 973.617 0 0 0 0 0 -843.76 0.06 0 0 0 0 1907.94 -1834.24 0 0 0 0 0 829.722 0 0 0 0 0 0 0 
0 0 0 0 0 0 0 0 0 0 0 0 0 0 0 813.395 0 0 0 0 0 0 0 582.827 0 2381.13 0 664.159 0 0 0 0 0 1820.35 0 0 0 0.02 0 0 708.716 0 0 -345.546 0 0 0 0 2425.84 0 0 0 0 0 -2277.67 0 
0 0 0 0 0 0 1308.56 0 0 -117.115 0 0 0 0 0 0 0 0 0 0 0 0 0 0 0 0 0 0 1554.08 0 0 -1523.41 0 0 0 582.369 0 0 0.06 0 0 0 1597.87 0 0 0 0 0 0 0 0 0 -696.051 223.167 0 0 
0 0 2212.97 0 0 1731.24 0 0 0 0 0 0 0 0 0 0 0 0 0 2177.57 0 -1263.85 0 0 0 -516.755 0 0 0 0 0 0 0 0 0 0 0 0 0 0.07 0 -453.734 0 0 0 0 0 656.377 -1673.1 0 -1809.21 0 0 0 0 0 
0 0 0 0 0 0 0 0 1495.03 17.9296 0 0 0 0 0 0 959.273 0 0 0 0 1062.73 0 0 0 0 0 0 0 0 -200.278 0 0 0 0 0 0 1689.89 0 0 0.05 0 0 0 0 0 -797.067 0 0 0 0 0 0 0 0 0 
0 0 0 0 0 0 0 0 0 0 0 0 0 0 574.129 0 0 0 0 0 0 0 1076.16 0 0 0 0 -1409.73 0 0 0 0 351.497 1139.48 0 0 1743.45 0 0 1530.73 0 0.07 0 0 0 0 0 0 0 1513.64 0 0 0 0 0 0 
0 -169.607 0 0 0 0 0 0 0 0 0 0 2399.59 0 2246.09 0 0 0 0 0 0 0 0 0 0 161.519 0 281.61 0 1975.08 0 0 0 0 0 0 2040.7 0 291.375 0 0 0 0.02 0 0 0 0 0 0 0 0 0 0 0 0 0 
0 0 0 0 159.23 0 0 0 0 0 0 0 -1611.76 0 0 0 0 0 2434.84 0 0 0 0 0 0 0 0 0 2003.46 0 0 0 0 0 0 0 0 -1248.89 0 0 0 0 0 0.06 0 0 0 0 584.201 0 0 1731.39 0 0 0 0 
0 0 0 0 0 0 0 0 1797.16 0 0 0 0 0 0 0 995.285 982.62 1772.9 0 0 0 0 0 1278.34 0 0 0 0 0 0 -2293.69 0 0 0 0 0 0 0 0 0 0 0 0 0.02 -2439.88 674.383 0 0 0 0 0 0 -2000.41 0 0 
0 0 0 0 0 0 0 0 0 0 0 0 0 2241.05 0 0 0 0 0 0 723.67 0 0 0 0 0 0 1206.32 0 -2048.02 0 430.387 0 0 867.26 0 0 0 0 0 0 0 0 0 2326.5 0.01 0 0 0 0 0 0 0 0 0 0 
0 0 0 0 0 0 432.218 0 0 0 0 0 1025.65 0 0 226.066 0 0 0 0 0 0 0 0 0 0 0 0 0 0 0 0 0 0 0 -2357.63 0 0 0 0 1914.5 0 0 0 1478.85 0 0.01 1809.37 -651.494 0 0 0 0 0 0 0 
0 0 0 0 0 0 0 -2086.78 0 0 0 0 0 0 0 0 88.8852 0 0 0 0 0 0 0 0 0 0 0 0 0 0 0 0 0 0 0 0 0 0 2244.56 0 0 0 0 0 0 851.695 0.02 0 0 0 0 0 0 0 0 
0 0 0 0 0 0 0 0 0 0 0 0 0 2290.8 0 0 0 0 0 0 0 0 0 -362.026 0 0 0 0 0 0 0 0 0 0 0 0 2093.19 2115.16 0 1441.92 0 0 0 2210.84 0 0 266.655 0 0.04 0 1612.67 0 0 0 0 0 
0 0 0 0 0 1109.12 0 0 0 0 0 0 0 0 0 0 0 -1721.02 0 1511.05 0 0 0 0 0 0 0 0 0 0 0 0 0 0 0 -2292.32 0 0 0 0 0 2483.83 0 0 0 0 0 0 0 0.03 0 0 -862.377 0 0 -488.525 
0 0 0 1568.12 0 0 0 0 0 0 0 0 0 0 0 -1181.91 0 0 0 0 0 0 2022.54 0 0 0 0 0 0 0 2406.92 948.897 0 0 0 0 0 0 0 87.054 0 0 0 0 0 0 0 0 -1389.74 0 0.02 0 0 0 2084.19 1043.05 
0 0 0 0 1846.75 0 0 0 0 0 0 0 0 0 0 0 0 0 0 0 0 0 0 0 940.962 0 0 -1616.79 0 0 0 0 0 1657.38 0 0 0 0 0 0 0 0 0 1096.15 0 0 0 0 0 0 0 0.08 0 0 0 517.67 
0 0 0 0 0 0 0 0 0 580.691 0 0 0 0 0 0 0 0 0 0 0 0 1420.71 0 0 0 -2025.28 0 0 0 0 0 0 1484.95 430.387 0 0 0 1854.69 0 0 0 0 0 0 0 0 0 0 1569.19 0 0 0.02 0 0 0 
1228.29 0 0 0 0 0 0 0 0 -823.771 0 0 0 1051.9 0 0 0 0 0 0 0 0 -2005.14 0 0 0 0 0 0 0 0 0 0 0 0 0 0 0 1094.47 0 0 0 0 0 2302.24 0 0 0 0 0 0 0 0 0.01 0 0 
0 0 0 0 0 0 0 0 0 0 0 0 0 0 0 0 0 0 0 0 0 0 0 0 0 0 0 -1923.05 0 0 0 1648.53 0 0 0 2408.44 0 898.694 0 0 0 0 0 0 0 0 0 0 0 0 -1266.29 0 0 0 0.09 0 
0 0 0 0 0 0 0 0 1159.17 0 0 0 0 0 0 0 0 0 0 0 0 0 0 0 0 0 0 0 0 953.169 0 0 0 0 0 0 0 0 0 0 0 0 0 0 0 0 0 0 0 -545.9 -2263.48 555.666 0 0 0 0.02 
