*Vertices 87
*Matrix 
0.08 0 698.187 0 0 -898.541 0 0 0 0 0 0 -986.587 0 1926.4 502.716 0 0 0 0 0 740.608 0 0 2420.8 -515.076 -250.328 0 0 1811.66 0 -1076.77 0 0 0 0 2047.11 0 0 0 -578.249 0 0 0 0 -115.436 137.257 0 0 0 -2302.85 0 0 0 0 0 -1478.09 0 0 0 0 0 0 -559.786 0 0 0 0 0 0 0 0 0 335.322 0 0 0 0 0 0 0 0 1015.43 0 0 0 0 
0 0.04 950.117 219.199 0 0 0 0 0 0 1244.32 -949.66 0 -738.472 0 0 0 0 0 -950.88 0 -114.978 0 0 0 694.067 0 629.673 0 0 0 0 2306.82 0 0 0 2460.02 1998.58 0 -218.589 0 -928.449 0 0 0 0 0 0 0 972.854 0 0 0 0 0 0 0 0 0 0 0 0 0 0 0 0 0 -7.09555 0 0 0 0 0 0 1038.93 1202.2 0 0 0 1278.19 0 -253.38 0 -1114.76 0 911.664 0 
1703.47 -152.058 0.03 0 0 2440.79 1484.8 -1963.03 -536.897 0 0 0 -200.735 2243.8 1321.53 0 0 0 0 0 0 0 0 0 -1213.95 400.632 0 0 0 0 2234.49 0 0 0 2295.53 0 0 0 -46.3118 -1991.41 1588.56 0 0 -1025.8 0 -148.854 0 0 -2418.97 0 -1564.15 0 0 0 0 0 0 0 0 0 0 0 0 0 0 0 0 0 -1785.41 0 0 0 -148.701 0 0 -275.811 0 0 0 0 0 0 0 -508.515 0 0 0 
0 -1960.59 0 0.02 519.501 0 0 0 0 0 0 0 0 0 0 0 0 0 0 0 0 0 0 1228.45 1378.75 0 0 0 0 0 0 0 1969.44 0 240.41 0 0 1243.25 2026.66 0 0 0 0 0 0 -410.398 0 0 0 0 0 -284.967 0 0 0 0 0 0 0 0 0 0 0 0 0 0 0 0 0 0 0 0 0 732.521 -1747.11 0 0 0 0 0 0 -419.248 0 0 0 0 0 
0 0 0 -2012.31 0.03 -2429.5 650.731 -518.433 0 2445.68 0 0 0 0 0 0 0 946.608 0 0 0 0 0 0 0 0 0 0 0 0 0 -881.756 -97.5829 0 0 0 1516.39 981.399 2086.78 1279.72 0 0 0 0 0 -308.313 0 0 0 0 -208.365 0 0 0 0 0 0 -93.1578 0 100.024 1569.64 0 0 0 0 0 0 0 1278.04 0 0 0 0 0 0 0 0 0 0 0 73.0155 0 0 0 -425.657 -1374.63 2208.7 
281.457 0 1275.6 0 580.691 0.04 0 0 0 0 0 0 0 0 0 0 0 0 -1106.22 0 0 0 1775.34 0 0 0 0 0 2307.89 0 74.6941 0 0 0 0 0 0 1210.59 0 0 0 0 0 1925.34 0 0 271.081 231.407 -2483.37 0 0 1942.12 0 0 0 0 0 0 0 0 0 0 0 0 0 0 0 0 0 1690.5 0 0 0 0 0 0 0 0 0 0 0 0 0 0 0 0 0 
0 0 2166.59 0 625.858 0 0.02 0 691.473 1685.46 0 1969.89 0 562.99 1600.16 0 0 -1138.11 0 0 0 0 0 -300.378 0 0 0 -2373.35 -1628.85 0 97.8881 2408.29 439.085 -2098.83 1557.74 0 1650.67 0 -1587.19 546.052 0 0 0 0 0 0 0 0 0 0 0 0 0 0 -1467.56 0 345.698 0 0 0 0 0 0 0 0 0 0 0 0 0 0 0 0 0 0 -11.8259 0 0 0 0 0 0 0 0 0 0 0 
0 0 722.449 0 -926.466 0 0 0.08 0 0 0 0 1677.83 0 0 0 0 0 0 0 0 2338.25 0 0 -1053.58 1715.22 0 -149.159 0 0 0 0 0 0 0 0 0 0 1156.12 0 0 -1380.28 0 0 0 -120.93 0 -2107.38 1261.71 -2165.82 0 0 0 0 0 0 0 0 0 2195.27 0 0 0 0 0 0 0 0 0 0 0 0 0 0 0 0 0 262.993 239.799 0 0 0 1733.22 0 0 0 0 
0 0 -25.4067 0 0 0 2215.26 0 0.07 0 0 0 0 0 1825.54 1022.75 0 0 0 1757.18 0 -38.6822 0 0 0 0 0 0 -953.322 0 0 0 0 0 498.291 2056.26 0 0 0 417.264 -835.826 -2160.48 0 0 971.328 200.888 -1549.2 0 0 0 0 0 30.2896 0 0 0 0 0 0 0 0 0 0 0 0 0 0 0 0 0 0 0 0 0 0 0 0 0 -2261.5 0 0 0 0 942.793 0 0 0 
0 0 0 0 1829.05 0 681.86 0 0 0.04 0 0 0 0 0 0 0 0 0 0 0 1215.78 0 1474.43 0 1049.46 -327.54 0 0 0 0 0 0 0 0 0 0 0 0 0 0 382.015 0 0 0 0 0 -2493.44 0 0 0 0 0 0 0 0 0 0 0 0 0 0 0 803.476 0 0 0 0 -1226 0 0 514.008 0 0 0 0 0 -861.614 0 0 0 673.925 0 0 0 0 0 
0 1421.63 0 0 0 0 0 0 0 0 0.09 0 0 -519.501 0 0 985.824 0 0 0 0 -1625.03 0 0 0 0 0 0 0 0 0 0 575.35 0 0 0 0 745.796 0 0 0 0 0 0 0 2486.42 0 1832.26 0 212.027 0 0 0 0 0 -1755.81 0 0 0 0 0 0 0 0 0 0 1919.54 0 0 0 0 0 0 0 0 0 0 0 0 0 0 0 0 0 0 -434.965 0 
0 2424.77 0 0 0 0 -982.467 0 0 0 0 0.02 0 0 -2031.54 0 0 -664.006 0 206.687 0 0 0 0 0 -1042.89 2235.56 0 0 1985 0 0 0 0 0 0 0 2073.35 -711.615 0 0 0 0 0 1143.3 0 0 0 0 958.663 0 0 0 0 0 0 0 0 0 0 0 0 -690.1 0 0 -1069.29 0 0 0 0 0 0 0 0 0 0 0 0 0 0 0 0 0 0 0 0 0 
1316.64 0 -1755.35 0 0 0 0 -291.07 0 0 0 0 0.07 698.645 0 0 0 0 0 237.968 0 0 0 -441.069 0 -1660.13 0 1805.09 0 2407.83 2205.8 2336.88 0 0 0 0 0 -817.972 161.061 0 0 -893.201 -642.491 0 0 0 -328.15 0 0 0 0 -1218.22 0 0 0 0 0 0 0 522.095 0 0 0 0 0 0 0 0 0 0 0 0 0 0 0 1443.3 0 0 0 0 0 0 2416.99 0 0 0 0 
0 1689.58 602.054 0 0 0 1610.54 0 0 0 -545.747 0 1200.37 0.07 0 0 -807.901 0 0 0 -2202.29 0 0 0 975.906 0 0 1763.28 2090.29 1416.14 0 -2453.61 0 -805.765 0 0 0 0 0 0 0 0 0 0 -2253.56 2464.29 0 0 0 0 0 0 1500.37 0 0 0 0 0 0 0 0 -1728.49 -2086.63 0 0 0 0 0 0 1092.03 0 0 -73.3207 -844.981 0 0 0 0 1943.8 0 -1714.3 0 0 0 0 0 0 
849.254 0 845.286 0 0 0 -637.303 0 1834.09 0 0 488.83 0 0 0.06 -970.26 1673.25 0 -2066.33 0 0 0 0 0 0 -427.946 -950.117 0 0 0 -1229.97 0 -1372.8 0 2022.54 0 0 1586.28 0 0 0 1387.45 0 -2466.89 -1739.94 0 765.633 1133.84 1603.21 2036.27 0 0 0 0 0 0 0 0 0 0 868.328 0 405.515 0 1640.45 0 0 0 0 -1536.23 593.509 0 0 0 0 0 -484.1 -801.645 0 0 0 0 462.127 0 0 0 0 
-2274.32 0 0 0 0 0 0 0 729.011 0 0 0 0 0 1364.71 0.08 1532.41 -801.035 2038.26 0 0 -1745.89 0 -2095.17 0 0 0 0 0 91.937 0 1990.34 605.258 -2314.6 0 843.608 -811.411 0 0 0 0 998.337 1504.64 0 0 0 1349.3 870.312 0 -2236.17 0 0 0 0 0 0 0 0 0 0 0 0 0 0 1603.67 0 0 0 0 0 0 0 0 0 0 0 0 0 0 0 0 0 455.107 0 0 0 0 
0 0 0 0 0 0 0 0 0 0 -583.895 0 0 189.138 1920.61 411.771 0.03 -972.091 0 0 1777.02 2428.74 0 1353.27 0 0 0 0 0 699.103 0 1843.39 0 0 -2248.99 0 -1320.61 0 0 617.924 0 0 0 0 0 0 0 0 -1268.43 2270.04 1124.99 0 0 0 0 0 0 0 0 0 0 0 -28.9163 2208.7 0 0 0 0 0 0 1480.83 0 0 -2354.73 0 0 0 0 0 0 0 0 0 2113.48 0 0 0 
0 0 0 0 -1531.65 0 1484.19 0 0 0 0 2186.73 0 0 0 1352.05 1694.77 0.04 0 0 0 0 0 -1504.33 0 0 0 0 0 0 -868.938 -1439.94 0 -681.249 1013.75 0 0 0 0 0 0 0 0 0 2322.53 0 0 0 0 0 0 0 0 861.766 0 0 -1963.79 -1445.13 722.907 0 0 0 0 0 -831.095 961.409 0 1842.02 0 0 0 0 0 0 0 0 0 -56.8407 -452.818 0 0 1765.11 -1158.56 -886.944 0 0 0 
0 0 0 0 0 1542.33 0 0 0 0 0 0 0 0 1021.53 -551.393 0 0 0.07 0 0 0 -904.34 0 0 -695.593 420.469 0 0 0 0 0 0 0 -936.232 0 0 0 0 1423.61 0 325.709 0 0 0 0 94.2259 1402.1 0 0 0 0 0 0 0 0 0 -345.393 0 0 0 0 0 0 0 0 0 0 0 0 0 0 0 0 0 0 0 0 0 0 0 0 0 0 0 0 0 
0 1630.99 0 0 0 0 0 0 -2490.39 0 0 2461.09 425.657 0 0 0 0 0 0 0.02 1359.98 0 0 0 0 0 0 0 0 0 0 0 0 0 0 1538.82 0 0 386.746 0 0 0 0 -2128.28 0 0 0 2164.75 0 -700.323 0 0 0 -57.6037 0 0 0 0 0 0 0 0 0 0 -982.62 0 0 0 0 0 0 0 0 -161.672 0 0 0 0 947.218 0 0 0 0 0 0 0 0 
0 0 0 0 0 0 0 0 0 0 0 0 0 856.883 0 0 987.503 0 0 2225.18 0.04 0 -720.466 0 0 0 1244.93 0 -1748.48 1510.28 0 0 0 0 0 0 2431.49 0 0 0 1929 0 -1615.27 161.061 531.556 0 0 0 697.882 0 -551.241 1557.74 -1526.61 0 0 -117.42 0 1075.24 0 0 0 0 0 0 0 0 0 -1912.21 0 0 0 0 -1451.38 0 0 0 0 1978.59 0 0 0 0 1551.94 0 0 0 0 
2481.99 -508.209 0 0 0 0 0 417.875 1368.53 1361.96 -541.627 0 0 0 0 -425.504 -284.814 0 0 0 0 0.08 2409.51 0 0 0 0 2235.25 0 1258.35 922.04 1290.25 0 0 0 0 0 0 -656.987 -422.3 0 -2135.91 0 0 0 0 0 0 0 0 0 0 0 0 -1590.85 629.368 -949.965 0 0 0 0 0 2323.91 0 0 0 0 0 0 0 0 0 1870.4 0 0 0 0 0 0 0 0 0 0 0 0 1276.67 0 
0 0 0 0 0 -105.06 0 0 0 0 0 0 0 0 0 0 0 0 -587.71 0 -962.172 823.923 0.07 0 0 0 -2087.39 0 890.912 0 0 86.2911 0 0 0 0 73.1681 0 0 2364.19 2307.73 0 0 0 0 0 0 -1930.68 0 0 1867.05 0 0 0 0 0 0 0 0 0 0 0 0 0 0 -1288.57 0 0 0 0 0 0 0 0 -403.684 0 0 0 0 0 0 0 0 0 0 0 0 
0 0 0 159.23 0 0 -1857.28 0 0 1920.3 0 0 1637.24 0 0 635.167 -255.669 -729.164 0 0 0 0 0 0.08 0 0 2432.86 -2284.69 0 0 1363.64 0 0 -901.593 0 0 0 0 0 352.26 741.981 0 1914.04 0 0 0 0 0 1939.68 0 852.306 0 0 0 0 0 0 0 0 2016.89 0 0 0 681.555 0 0 -1929.15 0 -1570.86 0 0 0 0 0 0 0 0 0 -1378.14 0 0 0 0 0 0 0 0 
2111.04 0 1858.81 -1431.55 0 0 0 -196.615 0 0 0 0 0 1729.1 0 0 0 0 0 0 0 0 0 0 0.01 -1056.02 0 2193.29 -765.328 -770.211 0 0 0 0 0 0 0 0 0 0 0 0 0 0 1890.55 0 0 0 1665.17 0 1951.58 0 0 0 0 0 0 0 1887.19 0 0 0 2469.18 0 0 0 0 989.181 0 0 0 0 0 0 0 0 0 0 0 0 0 0 0 0 -1704.84 0 0 
1277.89 1017.56 2101.43 0 0 0 0 981.552 0 -246.513 0 1614.05 1522.19 0 946.76 0 0 0 788.522 0 0 0 0 0 1082.87 0.09 947.829 0 0 -78.9666 0 0 -1186.18 0 -115.284 0 87.5118 0 0 871.685 0 0 0 0 0 0 0 735.267 0 1411.1 1741.46 2492.52 0 0 0 0 0 -217.826 0 -2445.98 0 0 0 0 0 -628.452 0 0 2017.96 0 0 -640.66 0 0 0 0 0 0 0 0 0 0 656.835 1111.41 0 0 0 
685.98 0 0 0 0 0 0 0 0 1325.04 0 2461.85 0 0 -1557.74 0 0 0 -2163.08 0 1601.23 0 2368.77 -233.543 0 1673.86 0.05 0 0 -595.645 0 0 0 0 0 0 0 165.334 0 -2441.25 0 0 -2434.69 0 0 0 0 0 0 -1795.02 0 0 0 0 0 -1010.24 0 0 0 0 0 0 0 0 1822.64 0 0 0 0 0 0 17.6244 912.427 1718.12 0 0 -484.252 0 0 0 0 0 0 0 0 0 0 
0 991.318 0 0 0 0 -635.319 -1110.64 0 0 0 0 911.664 -1699.04 0 0 0 0 0 0 0 1852.85 0 -454.955 1942.43 0 0 0.07 0 1159.32 0 0 0 0 0 0 0 0 0 1135.98 0 -558.565 2049.24 -1290.55 0 0 0 0 0 0 0 0 0 0 0 0 0 0 0 -1739.17 0 0 0 0 0 0 0 0 0 0 0 0 0 0 0 0 0 0 0 0 -326.624 0 0 0 0 0 1245.69 
0 0 0 0 0 -1473.2 1372.19 0 308.924 0 0 0 0 2286.37 0 0 0 0 0 0 -1101.03 0 2040.09 0 -1616.49 0 0 0 0.05 0 0 0 0 2439.42 0 0 309.229 0 405.972 0 0 0 167.47 0 0 2086.47 0 0 0 0 0 0 0 0 0 0 0 -2270.2 0 0 0 0 0 0 0 0 0 0 -9.99481 0 1349.3 0 0 0 0 0 0 0 0 0 0 -1286.89 0 0 0 0 0 
-1318.02 0 0 0 0 0 0 0 0 0 0 1993.7 2380.83 187.918 0 2497.86 1608.71 0 0 0 959.273 1571.17 0 0 1938 74.9992 724.586 692.999 0 0.08 1597.57 1749.4 0 -2018.42 0 2266.84 0 0 0 0 0 -1673.41 0 0 -1447.87 0 0 824.992 0 -35.1726 0 0 0 -2192.98 0 0 0 0 0 0 0 0 0 0 0 0 0 0 0 1335.87 0 0 0 -648.289 0 0 0 590.152 0 0 0 0 0 0 0 0 0 
0 0 720.923 0 0 2226.55 2223.65 0 0 0 0 0 1077.23 0 795.694 0 0 492.95 0 0 0 2149.95 0 1513.03 0 0 0 0 0 -176.168 0.06 0 0 0 0 0 1766.03 0 0 2389.07 -803.781 0 0 0 0 205.618 2377.16 0 0 0 481.658 0 0 0 0 0 380.49 0 617.161 0 0 0 0 0 0 -2114.4 2455.6 0 0 0 0 0 2095.93 0 0 0 0 0 0 0 0 0 424.589 0 -2167.35 0 -276.727 
-1577.73 0 0 0 2422.18 0 698.187 0 0 0 0 0 2464.14 2358.39 0 -691.778 1470.15 -1805.25 0 0 0 1603.98 1412.78 0 0 0 0 0 0 2397.76 0 0.07 0 -1052.35 0 0 0 0 0 0 0 680.944 0 0 0 0 -1905.35 0 -545.9 0 0 2345.73 0 0 0 0 0 0 0 0 0 0 0 0 0 0 0 0 0 0 0 0 0 0 0 2024.06 0 0 0 0 0 0 0 399.411 0 0 -2493.74 
0 1285.21 0 281.61 -311.975 0 2062.06 0 0 0 768.838 0 0 0 1084.86 1924.12 0 0 0 0 0 0 0 0 0 2307.89 0 0 0 0 0 0 0.09 1652.5 0 1503.72 0 0 0 0 -2254.63 0 0 -186.697 0 0 0 0 0 1916.18 -136.036 0 0 0 0 0 908.46 0 -305.261 -2430.42 0 0 0 0 0 0 0 0 0 0 0 0 0 -446.409 0 0 0 555.513 0 0 -376.827 0 0 0 0 -1790.9 0 
0 0 0 0 0 0 -1287.04 0 0 0 0 0 0 -1712.01 0 2362.82 0 1904.89 0 0 0 0 0 71.1844 0 0 0 0 -36.0881 -1524.17 0 1906.72 166.555 0.04 0 0 0 0 0 0 1325.34 0 0 0 0 0 0 0 2347.25 0 -340.358 0 0 0 2198.48 0 0 0 0 0 0 0 0 0 0 0 0 0 0 0 0 0 0 0 0 0 0 2263.63 0 1736.12 0 0 0 0 0 0 0 
0 0 651.952 1182.52 0 0 2244.41 0 -101.245 0 0 0 0 0 -222.098 0 -713.446 2172.38 -21.7444 0 0 0 0 0 0 -643.864 0 0 0 0 0 0 0 0 0.06 0 0 0 0 0 0 0 0 -1636.63 0 0 0 835.978 0 0 516.297 0 -563.906 0 -96.3622 0 0 0 0 0 0 0 0 0 -905.713 0 0 0 0 0 0 0 0 0 -237.815 0 0 0 0 0 0 0 0 0 0 0 -2017.96 
0 0 0 0 0 0 0 0 -2404.48 0 0 0 0 0 0 -2423.4 0 0 0 2113.48 0 0 0 0 0 0 0 0 0 -465.331 0 0 2010.79 0 0 0.03 2182.15 0 0 -54.5518 -1395.54 2203.82 0 0 2260.12 0 0 0 171.896 2098.53 0 0 0 0 0 0 0 0 0 0 0 1824.47 0 0 0 0 0 0 0 0 0 1166.19 0 0 0 0 0 0 0 0 -1775.95 -1548.89 0 0 0 -916.852 0 
-418.027 1352.35 0 0 -329.524 0 1400.88 0 0 0 0 0 0 0 0 1838.21 -1875.59 0 0 0 1394.92 0 -1543.7 0 0 2306.67 0 0 -994.98 0 1591.77 0 0 0 0 -2255.7 0.04 0 0 0 0 2201.22 0 0 2384.03 0 0 147.176 783.181 0 250.023 0 0 0 0 0 0 0 0 0 0 1800.06 0 2076.4 0 0 0 0 0 0 0 0 0 0 0 1780.22 1323.82 -2441.1 0 0 0 0 0 0 0 -855.358 0 
0 2174.52 0 135.731 -1332.97 -90.4111 0 0 0 0 -327.235 847.728 1790.6 0 -1562.32 0 0 0 0 0 0 0 0 0 0 0 395.749 0 0 0 0 0 0 0 0 0 0 0.04 0 0 -1979.96 486.084 1104.69 2283.93 0 0 2114.7 0 0 -2171.77 0 0 0 0 0 0 0 0 0 0 0 0 0 0 0 0 0 0 0 0 0 0 1055.71 272.607 0 0 0 0 0 -1460.69 0 0 0 0 0 0 0 
0 0 1358.91 1027.63 120.93 0 933.79 87.054 0 0 0 -1107.29 -739.845 0 0 0 0 0 0 1950.36 0 -1733.38 0 0 0 0 0 0 885.723 0 0 0 0 0 0 0 0 0 0.09 0 0 0 376.37 1161.61 215.384 1639.84 746.406 1759.32 1826.46 -107.501 607.7 -992.691 0 0 0 0 0 0 0 0 0 0 0 0 0 0 0 0 0 0 0 0 0 0 0 0 0 0 0 0 0 0 0 0 0 0 0 
0 239.036 1076.31 0 -463.347 0 673.925 0 1477.94 0 0 0 0 0 0 0 2216.64 0 162.893 0 0 88.58 2076.25 -190.664 0 916.547 1860.79 1732.31 0 0 -1021.99 0 0 0 0 -1102.1 0 0 0 0.06 2312.46 0 0 0 0 0 0 0 0 0 0 0 -1412.93 0 0 0 0 0 0 0 -290.765 0 0 0 0 0 0 0 0 0 0 -2458.34 0 0 0 0 0 0 0 0 0 0 0 420.011 0 0 0 
-251.396 0 -1233.48 0 0 0 0 0 1558.81 0 0 0 0 0 0 0 0 0 0 0 -260.857 0 -193.716 680.334 0 0 0 0 0 0 1315.73 0 -1742.53 2285 0 1126.21 0 2003.16 0 -348.445 0 0 0 0 0 0 0 1473.82 0 0 0 0 0 -1245.38 0 0 2162.47 0 0 0 0 1163.29 0 0 0 0 0 0 0 0 0 0 0 0 0 0 0 0 0 0 0 880.84 0 0 0 0 0 
0 2352.75 0 0 0 0 0 -2156.06 1181.14 550.63 0 0 2189.78 0 2144.92 2053.67 0 0 2270.65 0 0 -647.526 0 0 0 0 0 -1031.6 0 -1362.42 0 -1465.73 0 0 0 2336.73 2194.05 -2120.96 0 0 0 0.04 0 0 0 103.534 0 -830.943 0 0 0 0 0 0 0 0 0 0 0 0 0 0 0 0 0 0 0 0 0 385.372 0 -510.498 -1837.44 0 0 0 0 0 0 0 0 0 0 0 0 524.995 0 
0 0 0 0 0 0 0 0 0 0 0 0 1515.17 0 0 -587.252 0 0 0 0 2462.46 0 0 948.134 0 0 -1469.54 -1686.53 -1631.6 0 0 0 0 0 0 0 0 1313.75 -303.735 0 0 0 0.07 0 0 876.873 0 0 0 2281.95 -881.603 0 0 0 1665.93 0 0 1238.52 0 686.895 0 0 0 0 0 0 0 0 0 0 0 -360.958 0 0 0 0 0 0 0 0 0 -1835.92 0 0 0 -376.675 0 
0 0 -753.578 0 0 -775.246 0 0 0 0 0 0 0 0 -1588.26 0 0 0 0 1539.12 -2181.69 0 0 0 0 0 0 2356.41 0 0 0 0 541.322 0 -1128.19 0 0 1539.89 2363.89 0 0 0 0 0.01 0 0 0 924.482 0 -490.661 0 0 565.889 0 0 0 1291.01 0 0 0 0 0 0 0 2299.04 0 581.454 0 0 0 0 272.301 0 0 0 0 0 0 0 0 0 2366.48 0 0 0 0 526.521 
0 0 0 0 0 0 0 0 2338.86 0 0 -1842.63 0 808.817 -1947 0 0 -311.06 0 0 2039.93 0 0 0 2280.42 0 0 0 0 474.334 0 0 0 0 0 2135.3 -2198.78 0 -633.335 0 0 0 0 0 0.04 0 2341.3 939.283 0 1853.31 0 0 0 0 0 1933.58 0 10.3 0 0 0 0 0 -2025.74 0 0 0 96.6674 0 0 0 0 0 0 0 0 0 0 0 -2035.2 0 0 0 0 -2309.41 0 0 
2372.13 0 -1417.66 -696.966 -935.469 0 0 1187.55 1359.07 0 534.455 0 0 -442.137 0 0 0 0 0 0 0 0 0 0 0 0 0 0 2375.94 0 2054.43 0 0 0 0 0 0 0 953.932 0 0 -2404.32 -1665.01 0 0 0.04 -488.983 0 0 1262.17 0 0 0 0 0 0 0 0 0 0 0 0 0 0 0 0 0 0 0 444.578 -1980.42 0 0 0 0 0 1208.15 0 0 0 0 0 0 0 0 0 0 
2190.08 0 0 0 0 2088.31 0 0 692.999 0 0 0 -443.205 0 1835.76 2279.5 0 0 -290.155 0 0 0 0 0 0 0 0 0 0 0 1414.61 1362.88 0 0 0 0 0 1676.15 1524.78 0 0 0 0 0 665.685 -34.4096 0.02 -495.544 0 0 0 0 0 0 0 0 0 0 0 0 0 0 0 -1480.07 -1626.56 -2344.2 0 0 -549.562 0 0 0 0 0 0 0 0 0 0 0 0 0 0 0 0 0 -1181.91 
0 0 0 0 0 1224.78 0 -903.882 0 175.1 1230.58 0 0 0 1121.63 1743.9 0 0 2460.78 416.654 0 0 -1564.3 0 0 1987.59 0 0 0 -1228.45 0 0 0 0 -1804.79 0 2388.45 0 653.02 0 573.061 1449.55 0 -2221.67 -2337.03 0 2011.09 0.04 0 0 -1394.77 0 273.37 0 1065.32 1657.38 0 0 0 587.558 0 0 -924.329 0 0 0 0 0 0 0 0 1782.51 0 0 0 0 0 0 0 0 0 0 0 0 0 0 0 
0 0 -81.4081 0 0 -86.9015 0 -122.608 0 0 0 0 0 0 -1900.46 0 1118.27 0 0 0 -487.304 0 0 2233.27 -565.737 0 0 0 0 0 0 1464.51 0 -779.366 0 1731.09 -829.875 0 2197.56 0 0 0 0 0 0 0 0 0 0.06 0 -1151.23 0 -210.196 2436.52 0 -1446.04 0 0 2418.82 0 0 0 -1053.27 0 0 0 0 0 0 0 -832.774 0 0 0 -975.753 2313.38 0 0 0 0 0 0 0 0 0 0 0 
0 1345.94 0 0 0 0 0 2480.01 0 0 -1162.53 -850.017 0 0 2232.05 807.443 1274.07 0 0 -2336.57 0 0 0 0 0 325.251 1609.62 0 0 1201.44 0 0 1987.9 0 0 -798.898 0 -541.627 -384.762 0 0 0 -1921.06 2019.33 -2407.38 -818.888 0 0 0 0.03 0 0 0 0 0 2420.04 0 0 513.855 0 0 0 0 0 0 0 0 0 0 1885.97 0 0 -1342.89 0 0 0 0 0 0 0 0 0 0 1622.9 0 45.0911 0 
2364.35 0 1780.53 0 2483.37 0 0 0 0 0 0 0 0 0 0 0 1354.03 0 0 0 -389.645 0 -1628.24 1640.14 951.338 2001.94 0 0 0 0 -1106.52 0 1142.84 -1127.58 1144.37 0 -1537.9 0 636.235 0 0 0 1126.06 0 0 0 0 1050.22 1853.16 0 0.08 0 0 0 0 0 0 -400.174 0 1131.24 0 0 0 0 157.857 1088.82 0 0 0 0 0 0 0 0 0 0 0 187.002 0 0 0 38.2244 0 172.964 1161 0 0 
0 0 0 1722.85 0 173.269 0 0 0 0 0 0 -1181.91 0 0 0 0 0 0 0 2462.31 0 0 0 0 1743.45 0 0 0 0 0 -1047.32 0 0 0 0 0 0 1506.93 0 0 0 0 0 0 0 0 0 0 0 0 0.07 0 0 0 961.562 0 0 0 0 0 0 0 0 0 0 -833.842 185.476 0 0 2410.73 0 0 0 0 0 202.261 0 0 0 0 0 0 0 0 0 0 
0 0 0 0 0 0 0 0 952.406 0 0 0 0 1788.92 0 0 0 0 0 0 1126.67 0 0 0 0 0 0 0 0 0 0 0 0 0 -1883.68 0 0 0 0 2097.92 0 0 0 150.38 0 0 0 508.972 948.439 0 0 0 0.08 741.066 0 0 0 0 0 0 0 1955.09 0 0 0 0 0 0 0 0 0 0 0 0 0 0 0 0 0 0 -1476.87 0 0 0 -1021.68 0 0 
0 0 0 0 0 0 0 0 0 0 0 0 0 0 0 0 0 948.744 0 625.401 0 0 0 0 0 0 0 0 0 1911.6 0 0 0 0 0 0 0 0 0 0 -1812.88 0 0 0 0 0 0 0 1328.85 0 0 0 2157.58 0.01 0 0 0 0 0 0 0 0 0 0 0 0 0 0 -107.044 0 0 0 0 0 0 0 0 -1317.87 0 -1884.44 0 0 0 0 0 0 0 
0 0 0 0 0 0 507.904 0 0 0 0 0 0 0 0 0 0 0 0 0 0 144.887 0 0 0 0 0 0 0 0 0 0 0 1399.66 -1219.29 0 0 0 0 0 0 0 2277.37 0 0 0 0 476.165 0 0 0 0 0 0 0.07 0 0 0 0 0 0 2487.79 0 0 0 0 0 0 0 0 0 0 -2305.14 0 -506.531 0 0 0 0 0 1433.84 0 0 0 0 0 0 
0 0 0 0 0 0 0 0 0 0 -464.721 0 0 0 0 0 0 0 0 0 -919.904 -112.537 0 0 0 0 -890.301 0 0 0 0 0 0 0 0 0 0 0 0 0 0 0 0 0 -2011.86 0 0 1862.62 1415.83 1355.4 0 1664.86 0 0 0 0.06 0 0 0 0 0 0 0 0 0 0 0 0 1308.25 0 0 0 0 0 0 0 0 0 0 0 0 0 0 0 -1099.2 0 2008.04 
-402.921 0 0 0 0 0 831.248 0 0 0 0 0 0 0 0 0 0 1143.91 0 0 0 1075.24 0 0 0 0 0 0 0 0 -2222.74 0 2397.76 0 0 0 0 0 0 0 -510.651 0 0 1912.21 0 0 0 0 0 0 0 0 0 0 0 0 0.01 2478.94 0 0 0 0 0 0 0 0 0 0 0 0 0 0 0 0 0 0 0 0 0 0 0 0 0 0 0 0 0 
0 0 0 0 2348.17 0 0 0 0 0 0 0 0 0 0 0 0 1502.96 836.436 0 2021.32 0 0 0 0 2454.37 0 0 1425.75 0 0 0 0 0 0 0 0 0 0 0 0 0 779.519 0 380.947 0 0 0 0 0 -1000.32 0 0 0 0 0 2397.76 0.01 0 0 0 0 0 0 0 982.162 0 0 0 -991.623 0 0 0 0 0 1037.25 -289.544 0 0 0 0 0 0 0 0 0 0 
0 0 0 0 0 0 0 0 0 0 0 0 0 0 0 0 0 1898.18 0 0 0 0 0 0 2109.52 0 0 0 0 0 1013.9 0 -1624.58 0 0 0 0 0 0 0 0 0 0 0 0 0 0 0 883.892 985.977 0 0 0 0 0 0 0 0 0.03 0 0 0 0 -192.801 0 0 0 0 -1131.24 0 0 0 0 0 0 0 0 0 0 0 0 704.443 0 0 0 0 -1615.12 
0 0 0 0 -2133.32 0 0 -806.986 0 0 0 0 2369.08 0 0 0 0 0 0 0 0 0 0 1702.4 0 -1298.64 0 -2356.26 0 0 0 0 1685.31 0 0 0 0 0 0 0 0 0 1984.08 0 0 0 0 1085.16 0 0 2432.25 0 0 0 0 0 0 0 0 0.06 0 0 0 0 0 0 0 0 0 0 0 -727.027 0 0 0 0 0 153.737 0 0 0 0 0 0 0 0 0 
0 0 0 0 1935.26 0 0 0 0 0 0 0 0 0 1714.91 0 0 0 0 0 0 0 0 0 0 0 0 0 0 0 0 0 0 0 0 0 0 0 0 1905.96 0 0 0 0 0 0 0 0 0 0 0 0 0 0 0 0 0 0 0 0 0.06 0 0 0 0 0 0 -2010.64 0 0 -951.949 0 0 0 0 0 0 0 0 0 0 0 0 0 0 0 0 
0 0 0 0 0 0 0 0 0 0 0 0 0 499.512 0 0 0 0 0 0 0 0 0 0 0 0 0 0 0 0 0 0 0 0 0 1632.66 -1733.22 0 0 0 858.409 0 0 0 0 0 0 0 0 0 0 0 2351.99 0 2190.54 0 0 0 0 0 0 0.08 1604.89 0 0 0 0 0 0 0 0 0 0 0 0 0 0 0 0 0 0 0 0 0 0 0 0 
0 0 0 0 0 0 0 0 0 0 0 2467.5 0 1439.02 -68.1326 0 1402.25 0 0 0 0 1532.56 0 0 -1724.52 0 0 0 0 0 0 0 0 0 0 0 0 0 0 0 0 0 0 0 0 0 0 2344.97 -1143.6 0 0 0 0 0 0 0 0 0 0 0 0 -1099.2 0.01 0 838.572 0 0 0 1124.84 1796.85 0 0 0 0 0 0 -707.495 0 0 0 0 0 0 0 0 0 0 
667.211 0 0 0 0 0 0 0 0 261.62 0 0 0 0 0 0 1851.94 0 0 0 0 0 0 507.141 0 0 0 0 0 0 0 0 0 0 0 0 1195.49 0 0 0 0 0 0 0 -2185.2 0 -1615.57 0 0 0 0 0 0 0 0 0 0 0 -121.387 0 0 0 0 0.03 0 0 0 0 0 0 0 0 1450.62 0 0 0 0 0 0 0 0 0 0 0 749.916 0 0 
0 0 0 0 0 0 0 0 0 0 0 0 0 0 1901.53 -1363.03 0 -1468.32 0 -186.544 0 0 0 0 0 0 -1619.85 0 0 0 0 0 0 0 1932.05 0 0 0 0 0 0 0 0 2338.4 0 0 2052.29 0 0 0 1032.36 0 0 0 0 0 0 0 0 0 0 0 1873.15 0 0.06 0 0 0 0 0 0 0 0 0 0 0 0 -1470.46 0 0 0 0 0 0 0 1747.57 0 
0 0 0 0 0 0 0 0 0 0 0 -1448.33 0 0 0 0 0 2170.86 0 0 0 0 325.098 0 0 -2164.6 0 0 0 0 726.875 0 0 0 0 0 0 0 0 0 0 0 0 0 0 0 1124.07 0 0 0 1243.1 0 0 0 0 0 0 578.555 0 0 0 0 0 0 0 0.08 0 0 0 0 0 0 -10.4526 0 0 0 0 0 0 0 0 0 0 0 0 0 0 
0 0 0 0 0 0 0 0 0 0 -172.811 0 0 0 0 0 0 0 0 0 0 0 0 1550.11 0 0 0 0 0 0 -93.7681 0 0 0 0 0 0 0 0 0 0 0 0 544.984 0 0 0 0 0 0 0 832.469 0 0 0 0 0 0 0 0 0 0 0 0 0 0 0.07 0 0 0 0 0 0 0 0 0 -689.947 0 0 0 0 0 1008.1 0 0 0 0 
0 990.86 0 0 0 0 0 0 0 0 0 0 0 0 0 0 0 2087.39 0 0 1297.11 0 0 0 -518.128 0 0 0 0 0 0 0 0 0 0 0 0 0 0 0 0 0 0 0 1867.66 0 0 0 0 0 0 -2365.87 0 0 0 0 0 0 0 0 -65.9963 0 0 0 0 0 0 0.01 0 0 0 0 0 0 0 0 0 0 0 0 0 -1194.42 0 0 0 0 0 
0 0 2330.01 0 130.848 0 0 0 0 506.073 0 0 0 0 0 0 0 0 0 0 0 0 0 495.392 0 -1375.39 0 0 2422.79 0 0 0 0 0 0 0 0 0 0 0 0 0 0 0 0 0 -2443.24 0 0 0 0 0 0 1173.36 0 -1983.02 0 0 222.098 0 0 0 1331.6 0 0 0 0 0 0.03 0 903.424 0 0 0 0 0 0 0 0 0 0 0 0 0 0 0 0 
0 0 0 0 0 1077.68 0 0 0 0 0 0 0 1349.6 1588.56 0 0 0 0 0 0 0 0 0 0 0 0 0 0 -82.4763 0 0 0 0 0 0 0 0 0 0 0 -1308.1 0 0 0 1222.65 0 0 0 2401.27 0 0 0 0 0 0 0 -775.246 0 0 0 0 2193.44 0 0 0 0 0 0 0.08 0 0 -1674.47 0 0 0 0 0 0 0 0 0 0 0 0 -241.935 0 
0 0 0 0 0 0 0 0 0 0 0 0 0 0 2203.05 0 -1691.56 0 0 0 0 0 0 0 0 0 0 0 1016.04 0 0 0 0 0 0 0 0 0 0 0 0 0 0 0 0 -200.278 0 0 -2364.8 0 0 2040.85 0 0 0 0 0 0 0 0 1490.3 0 0 0 0 0 0 0 1586.89 0 0.05 0 0 0 -1378.44 0 0 0 0 0 0 0 0 0 0 0 0 
0 0 0 0 0 0 0 0 0 1648.23 0 0 0 0 0 0 0 0 0 0 0 0 0 0 0 -1804.64 -807.138 0 0 0 0 0 0 0 0 -21.5918 0 0 0 1133.08 0 -2295.98 -2279.2 1410.79 0 0 0 2328.33 0 0 0 0 0 0 0 0 0 0 0 133.29 0 0 0 0 0 0 0 0 0 0 0 0.05 0 2092.27 0 0 0 0 0 0 0 0 0 0 0 0 0 
0 0 990.249 0 0 0 0 0 0 0 0 0 0 1608.1 0 0 0 0 0 0 -188.223 -105.365 0 0 0 0 -1319.54 0 0 0 1875.29 0 0 0 0 0 0 804.086 0 0 0 -583.743 0 0 0 0 0 0 0 2072.74 0 0 0 0 905.255 0 0 0 0 0 0 0 0 906.323 0 -18.6926 0 0 0 -1061.2 0 0 0.06 0 0 0 0 0 0 0 0 0 0 0 897.015 0 699.561 
199.515 0 0 1612.06 0 0 0 0 0 0 0 0 0 -692.694 0 0 1020.46 0 0 2155.75 0 0 0 0 0 0 -70.8792 0 0 502.258 0 0 -1655.71 0 0 0 0 2483.83 0 0 0 0 0 0 0 0 0 0 0 0 0 0 0 0 0 0 0 0 0 0 0 0 0 0 0 0 0 0 0 0 0 -1953.41 0 0.04 0 0 497.223 2454.37 0 0 0 0 0 0 311.823 0 0 
0 818.125 0 970.717 0 0 0 0 0 0 0 0 0 0 0 0 0 0 0 0 0 0 2354.43 0 0 0 0 0 0 0 0 0 0 0 670.263 0 0 0 0 0 0 0 0 0 0 0 0 0 -161.519 0 0 0 0 0 1447.72 0 0 0 0 0 0 0 0 0 0 0 0 0 0 0 797.525 0 0 0 0.05 1593.14 0 0 0 0 0 0 0 0 0 0 1807.99 
0 -781.961 -716.498 0 0 0 2112.26 0 0 0 0 0 1888.87 0 0 0 0 0 0 0 0 0 0 0 0 0 0 0 0 0 0 1453.37 0 0 0 0 -1784.19 0 0 0 0 0 0 0 0 0 0 0 -1625.34 0 0 0 0 0 0 0 0 1484.34 0 0 0 0 0 0 0 0 0 0 0 0 0 0 0 0 -837.809 0.09 0 0 1184.96 0 37.4615 0 0 -721.381 0 0 0 
0 0 0 0 0 0 0 0 0 0 0 0 0 0 455.26 0 0 0 0 0 0 0 0 0 0 0 -1420.56 0 0 0 0 0 0 0 0 0 310.907 0 0 0 0 0 0 0 0 -1932.66 0 0 0 0 0 686.132 0 0 0 0 0 1984.54 0 0 0 0 -356.685 0 0 0 1975.39 0 0 0 0 0 0 1299.71 0 0 0.08 0 0 0 0 0 0 0 0 0 0 
0 0 0 0 0 0 0 869.396 0 1080.43 0 0 0 0 -1550.57 0 0 -546.51 0 0 611.972 0 0 0 0 0 0 0 0 423.215 0 0 612.735 594.729 0 0 -572.756 0 0 0 0 0 0 0 0 0 0 0 0 0 -1085.62 0 0 72.7104 0 0 0 0 0 1855.14 0 0 0 0 1305.35 0 0 0 0 0 0 0 0 2242.58 0 0 0 0.06 0 -96.3622 0 0 0 0 0 -2160.33 0 
0 0 0 0 0 0 0 -792.489 614.566 0 0 0 0 1137.35 0 0 0 -1290.86 0 -726.417 0 0 0 995.132 0 0 0 0 0 0 0 0 0 0 0 0 0 0 0 0 0 0 0 0 0 0 0 0 0 0 0 0 0 0 0 0 0 0 0 0 0 0 0 0 0 0 0 0 0 0 0 0 0 0 0 344.935 0 0 0.04 0 0 0 0 0 0 0 0 
0 -1492.58 0 0 0 0 0 0 0 0 0 0 0 0 0 0 0 0 0 0 0 0 0 0 0 0 0 0 0 0 0 0 0 1289.18 0 0 0 -1811.96 0 0 0 0 0 0 1912.06 0 0 0 0 0 0 0 0 1790.75 0 0 0 0 0 0 0 0 0 0 0 0 0 0 0 0 0 0 0 0 0 0 0 1851.18 0 0.01 0 -1005.2 0 0 1517.15 0 0 
0 0 0 0 632.42 0 0 0 0 0 0 0 0 -2424.16 0 0 0 0 0 0 0 0 0 0 0 0 0 98.4985 0 0 0 0 2155.6 0 0 1069.9 0 0 0 0 0 0 0 0 0 0 0 0 0 0 0 0 -1325.65 0 156.941 0 0 0 0 0 0 0 0 0 0 0 0 0 0 0 0 0 0 0 0 1634.04 0 0 0 0 0.07 0 0 0 0 0 0 
0 2496.8 0 -395.749 0 0 0 0 0 -1611.61 0 0 0 0 0 0 0 -2139.73 0 0 0 0 0 0 0 0 0 0 181.661 0 0 0 0 0 0 1019.24 0 0 0 0 1668.52 0 875.347 -262.688 0 0 0 0 0 0 1720.25 0 0 0 0 0 0 0 925.092 0 0 0 0 0 0 0 0 1406.52 0 0 0 0 0 0 0 0 0 0 0 -157.552 0 0.09 0 0 0 0 0 
86.2911 0 0 0 0 0 0 -1377.22 0 0 0 0 -1497.77 0 -1039.38 438.475 0 1068.38 0 0 505.31 0 0 0 0 -85.2229 0 0 0 0 2107.07 0 0 0 0 0 0 0 0 0 0 0 0 0 0 0 0 0 0 0 0 0 0 0 0 0 0 0 0 0 0 0 0 0 0 0 2113.79 0 0 0 0 0 0 0 0 0 0 0 0 0 0 0 0.01 0 0 0 0 
0 831.706 923.261 0 0 0 0 0 -2329.25 0 0 0 0 0 0 0 752.51 2411.95 0 0 0 0 0 0 0 -739.387 0 0 0 0 0 1621.68 0 0 0 0 0 0 0 1166.04 0 0 0 0 0 0 0 0 0 21.4393 1108.05 0 0 0 0 0 0 0 0 0 0 0 0 0 0 0 0 0 0 0 0 0 0 0 0 56.5355 0 0 0 0 0 0 0 0.04 0 0 0 
0 0 0 0 -783.029 0 0 0 0 0 0 0 0 0 0 0 0 0 0 0 0 0 0 0 -915.326 0 0 0 0 0 -736.641 0 0 0 0 0 0 0 0 0 0 0 0 0 924.787 0 0 0 0 0 -2143.24 0 1156.12 0 0 -1533.78 0 0 0 0 0 0 0 1865.98 0 0 0 0 0 0 0 0 1178.85 969.649 0 0 0 0 0 1179.31 0 0 0 0 0.04 0 0 
0 -379.116 0 0 -217.521 0 0 0 0 0 -2039.48 0 0 0 0 0 0 0 0 0 0 -64.3178 0 0 0 0 0 0 0 0 0 0 2305.29 0 0 -544.526 852.153 0 0 0 0 1498.84 -730.537 0 0 0 0 0 0 -1970.66 0 0 0 0 0 0 0 0 0 0 0 0 0 0 -681.86 0 0 0 0 871.685 0 0 0 0 0 0 0 1696.3 0 0 0 0 0 0 0 0.05 528.352 
0 0 0 0 681.86 0 0 0 0 0 0 0 0 0 0 0 0 0 0 0 0 0 0 0 0 0 0 1023.97 0 0 -460.906 702.612 0 0 173.727 0 0 0 0 0 0 0 0 -219.199 0 0 1401.79 0 0 0 0 0 0 0 0 790.506 0 0 296.869 0 0 0 0 0 0 0 0 0 0 0 0 0 -183.798 0 -470.367 0 0 0 0 0 0 0 0 0 0 966.292 0 
