*Vertices 66
*Matrix 
0.05 0 0 0 0 945.387 0 0 0 0 0 0 0 -316.858 0 -1097.06 -502.258 1481.75 0 2144 0 126.27 0 0 0 0 0 0 0 0 0 0 0 1977.83 0 285.119 0 0 0 0 973.769 0 0 0 0 0 0 -116.657 0 0 0 0 0 1391.57 0 0 0 0 0 0 0 0 0 0 0 0 
0 0.05 0 0 579.47 -156.941 0 0 0 1648.69 0 0 0 -1867.66 0 0 0 0 220.42 0 0 0 235.984 -1643.8 1643.19 0 971.328 0 0 324.03 0 0 0 0 0 113.91 0 0 0 0 0 0 0 2460.48 0 0 0 0 0 0 0 0 0 0 0 0 0 0 0 0 0 0 0 2340.54 0 0 
0 0 0 0 948.286 0 0 -1614.66 0 0 0 271.386 2147.82 0 0 0 0 1285.82 0 0 1051.29 0 0 0 0 0 0 168.691 0 -2087.39 0 0 0 0 0 1901.84 0 0 -481.353 0 0 0 -1585.97 0 0 1408.81 0 0 938.215 0 -431.761 0 0 0 0 0 0 0 0 0 0 -87.5118 0 0 0 0 
0 0 0 0.04 680.029 271.386 0 1921.98 631.199 0 0 -2343.44 -2351.53 -869.091 -865.276 0 1738.41 0 0 1074.48 0 0 0 358.211 0 0 0 0 0 0 0 0 2187.8 0 0 0 2370.75 0 0 0 0 0 0 0 0 0 0 0 0 0 0 0 0 0 0 0 682.928 0 0 0 0 0 0 0 0 0 
0 1884.9 -641.118 2022.08 0.05 0 -275.201 0 0 0 -889.843 0 0 -2356.41 0 0 0 0 0 0 0 0 0 0 -2136.83 0 -1193.35 0 681.249 0 0 0 0 0 0 1238.06 -612.735 -754.341 1972.03 2096.85 1278.95 0 0 0 0 601.596 0 0 0 0 0 0 0 0 0 1025.96 0 0 0 0 0 0 0 0 0 0 
-685.98 1084.09 0 2059.31 0 0.07 1599.7 0 -523.469 0 0 0 729.774 2330.93 0 0 0 0 0 0 0 249.107 0 185.629 0 0 0 146.565 0 0 -2110.43 0 0 0 0 -1463.44 0 0 2355.19 0 154.5 0 -993.149 0 0 0 0 0 0 0 0 0 1556.67 1851.79 0 0 0 0 1409.27 0 0 0 0 0 0 0 
0 0 0 0 1829.81 1065.32 0.08 0 1083.03 0 0 -1278.95 -388.272 0 0 0 0 0 0 0 1335.41 0 0 0 0 0 0 0 0 0 0 0 0 -708.869 0 0 -2021.62 0 0 0 0 0 -148.091 0 0 0 0 0 0 0 0 0 0 0 0 0 0 0 1150.17 0 0 0 0 0 0 0 
0 0 2195.43 -1106.98 0 0 0 0.05 -920.972 0 0 0 0 -1939.07 0 0 0 0 0 -1726.51 0 0 0 0 0 0 0 -1641.82 0 0 137.562 0 0 0 0 0 0 0 1667.15 -524.537 2030.17 0 0 714.057 0 1751.84 0 0 0 0 0 0 0 0 0 0 0 1425.44 922.651 0 0 0 0 0 656.377 0 
0 0 0 -168.996 0 -837.504 -1373.71 -1300.01 0.08 -485.321 0 0 1974.93 0 -597.171 1459.17 0 0 0 2078.39 0 0 1596.04 2399.59 40.2081 0 0 0 0 1378.44 0 0 0 0 1729.71 -216.605 0 0 0 0 1616.95 242.546 0 0 0 0 0 0 0 928.297 0 0 0 0 0 391.018 0 0 0 0 0 1323.36 -873.669 0 0 0 
0 1591.92 0 0 0 0 0 0 1318.17 0 0 0 0 -1839.27 0 0 0 0 0 -2255.24 0 -1357.23 0 0 0 0 0 0 0 0 0 0 0 0 -1377.38 1724.98 0 0 -30.7474 -1625.19 1556.52 0 -589.084 0 2234.95 2377.16 2153.77 0 0 -36.0881 0 -113.605 0 0 -1716.13 0 0 0 0 0 1950.67 0 0 0 0 0 
0 0 0 0 1951.89 0 0 0 0 0 0 53.7889 0 968.276 1040.76 1289.18 0 0 0 0 0 0 0 -383.084 0 0 0 0 0 0 0 0 -250.633 0 0 0 0 0 0 0 0 0 0 0 0 345.546 0 -2102.34 838.725 0 0 0 0 0 0 0 1242.33 0 0 0 0 0 0 0 0 0 
0 0 1188.92 2349.85 0 0 -716.193 0 0 0 1098.59 0.04 0 0 0 824.229 0 1177.79 0 0 0 -2027.42 0 0 0 2342.68 0 1061.97 0 0 0 0 0 0 0 0 1496.09 0 0 0 -2347.71 0 -69.3533 0 0 -535.066 -881.146 0 1269.19 0 0 0 0 0 0 0 0 2127.83 0 0 0 0 0 0 0 0 
0 0 -2090.9 473.724 0 -96.5148 -2155.75 0 644.169 0 0 0 0.06 158.162 0 0 0 0 2413.79 0 178.915 0 1043.81 0 0 585.574 0 1447.87 1904.28 0 0 2339.63 0 0 -1168.32 0 0 1265.98 0 0 0 0 0 912.732 0 0 0 0 0 0 0 481.811 0 0 0 0 -823.008 0 0 -202.719 0 306.177 0 0 0 0 
669.805 -823.618 0 649.205 2221.82 1542.02 0 924.024 0 1701.03 2354.73 0 2236.78 0.01 761.513 0 -1098.59 0 0 0 0 0 -2449.64 831.095 0 0 0 519.349 0 0 0 0 0 0 -930.738 0 0 -847.728 0 -1338.01 0 -1205.4 0 0 0 0 0 0 0 0 0 0 0 0 0 0 0 0 2458.65 168.538 0 0 2472.84 -1369.29 0 0 
0 0 0 1369.14 0 0 0 0 -2160.79 0 -403.989 0 0 -102.466 0.02 0 0 0 252.464 0 0 0 0 880.84 0 0 1788.92 0 -393.46 0 0 0 0 2289.42 -855.205 0 523.774 1280.94 1199.61 0 0 0 517.975 0 0 -1079.36 1905.5 1633.27 0 1608.4 0 -811.563 0 0 -1126.06 0 0 0 0 0 0 0 -1799.75 0 0 0 
1119.19 0 0 0 0 0 0 0 -2098.68 0 2305.75 2373.5 0 0 0 0.03 0 0 0 0 -1706.21 0 2326.96 0 -2307.58 2335.51 0 0 -524.537 0 391.171 0 0 -526.673 1620.46 0 0 0 0 1028.24 0 0 0 0 0 0 0 0 0 0 0 0 -1043.2 0 0 0 0 -239.647 0 0 2270.65 0 0 0 1343.04 0 
1236.38 0 0 966.14 0 0 0 0 0 0 0 0 0 1677.98 0 0 0.01 2450.56 505.005 0 0 2074.72 0 0 -830.638 172.811 0 761.361 1196.4 0 0 0 0 0 0 0 1742.07 0 0 0 1346.4 1522.8 -787.912 0 -837.962 0 0 0 0 0 0 0 0 0 0 0 0 0 0 0 -2367.55 0 0 0 829.264 -2032.15 
1574.07 0 -2032 0 0 0 0 0 0 0 0 -1242.33 0 0 0 0 -2264.7 0.03 -250.328 0 -1690.5 0 0 0 0 0 0 0 0 0 0 0 0 2131.95 0 0 0 0 1785.26 0 577.487 0 0 0 2378.08 -461.516 62.6392 1867.66 0 0 0 0 0 0 0 0 0 -964.919 0 453.887 0 0 0 0 0 0 
0 2292.02 0 0 0 0 0 0 0 0 0 0 -912.275 0 -1101.18 0 1487.55 -2325.43 0.03 0 0 0 0 0 0 0 0 1086.08 0 -520.417 0 0 0 159.078 286.035 0 2264.55 0 1001.85 0 0 497.375 0 688.269 -1629.15 2152.85 0 -2373.2 0 0 0 0 0 0 0 0 0 0 0 0 1864.76 0 0 -2245.02 0 0 
2316.58 0 0 1777.47 0 0 0 -675.298 -1117.51 1298.03 0 0 0 0 0 0 0 0 0 0.02 2458.34 0 0 0 -18.8452 0 0 0 0 0 -706.58 1816.08 858.409 637.303 509.43 0 0 0 0 0 0 0 -1115.38 0 0 0 0 0 0 0 0 833.537 0 1837.75 0 0 0 0 0 0 0 0 0 0 -2282.1 0 
0 0 839.335 0 0 0 2396.54 0 0 0 0 0 20.2185 0 0 2362.21 0 -2164.14 0 -25.4067 0.02 0 0 0 1829.51 0 0 0 575.961 0 0 0 0 1788.92 0 -2443.24 0 0 0 599.918 0 -1842.78 -190.054 2040.7 0 0 0 0 1827.83 0 0 0 0 0 0 0 0 0 0 0 0 0 0 1642.58 0 0 
2304.68 0 0 0 0 340.205 0 0 0 1886.58 0 -1703.92 0 0 0 0 656.377 0 0 0 0 0.04 0 0 611.362 0 0 0 0 -366.451 0 0 2203.51 0 2192.98 0 0 1563.84 0 0 377.285 0 0 0 0 0 0 0 -1993.7 0 1548.28 0 0 0 0 0 0 0 0 0 0 0 0 0 -1973.25 0 
0 2358.7 0 0 0 0 0 0 -1867.96 0 0 0 -254.448 -1026.87 0 398.953 0 0 0 0 0 0 0.08 0 0 2039.02 -553.682 1904.28 0 0 0 463.652 0 -1532.41 0 0 0 0 0 0 0 0 0 0 0 0 0 0 0 0 0 0 0 0 0 0 0 0 0 0 0 0 375.912 0 0 0 
0 239.036 0 909.375 0 -487.915 0 0 2116.08 0 356.99 0 0 1085.31 -130.696 0 0 0 0 0 0 0 0 0.06 2490.23 0 424.589 0 1739.48 -1260.34 0 0 -636.387 0 -940.352 0 0 0 0 0 497.681 -346.004 0 0 0 0 0 0 0 0 0 0 0 0 0 0 0 0 0 0 0 0 0 0 0 0 
0 1762.98 0 0 1414.15 0 0 0 2382.5 0 0 0 0 0 0 1368.98 -2245.93 0 0 -1591.16 2042.83 2366.18 0 -1872.08 0.07 0 687.201 841.472 0 0 0 0 0 0 0 0 0 0 0 0 2024.06 0 0 0 0 734.046 0 0 0 0 2072.89 0 0 0 0 0 0 -806.375 0 0 0 0 0 0 0 0 
0 0 0 0 0 0 0 0 0 0 0 1750.77 -1609.47 0 0 1822.49 -969.497 0 0 0 0 0 2211.91 0 0 0.07 1855.45 -973.159 0 2354.43 0 0 0 0 -968.734 0 0 0 0 0 0 0 1613.59 -1298.64 0 -2323.15 0 0 0 0 0 0 0 0 0 0 0 0 0 0 0 0 0 0 0 0 
0 166.402 0 0 1621.52 0 0 0 0 0 0 0 0 0 915.326 0 0 0 0 0 0 0 -2421.11 -1062.43 -469.298 2345.12 0.07 518.281 0 0 1690.5 0 1370.2 -2277.06 0 0 0 0 0 0 1373.87 698.34 1603.21 0 0 0 1463.74 0 0 0 0 -281.61 -897.931 0 0 0 0 0 0 0 -1531.5 0 0 0 0 0 
0 0 919.446 0 0 681.249 0 2475.74 0 0 0 103.992 799.661 2032.76 0 0 518.281 0 880.535 0 0 0 861.614 0 -1785.1 2347.87 -1349.15 0.03 -2248.99 0 0 0 0 -1474.12 0 -1171.99 -1348.54 0 265.587 0 0 -206.839 0 2303.77 2326.96 0 -1781.44 0 0 0 0 0 2022.84 685.522 2259.67 0 1498.99 928.144 0 0 0 0 0 0 0 0 
0 0 0 0 1163.9 0 0 0 0 0 0 0 1239.74 0 1356.32 -335.932 -1355.1 0 0 0 1070.97 0 0 738.319 0 0 0 -380.032 0.01 -717.109 419.553 0 0 0 0 0 0 0 0 0 -96.057 0 0 0 0 0 0 0 0 0 0 0 0 0 0 0 0 0 -144.276 -174.947 0 0 0 0 0 0 
0 14.7252 -1422.39 0 0 0 0 0 81.2555 0 0 0 0 0 0 0 0 0 237.51 0 0 -1527.38 0 289.087 0 -15.6407 0 0 -1160.39 0.09 0 2020.1 -53.1785 0 185.018 0 0 -848.033 1737.8 1751.99 1688.06 1514.25 -1489.23 0 0 0 0 0 0 0 0 0 0 0 0 0 0 0 0 0 0 0 0 0 0 0 
0 0 0 0 0 -665.38 0 -173.574 0 0 0 0 0 0 0 1415.22 0 0 0 -1086.99 0 0 0 0 0 0 388.577 0 1242.18 0 0.04 0 1383.18 0 0 0 0 0 0 0 0 0 -836.589 0 -258.568 0 615.787 0 0 0 0 0 0 0 0 0 0 0 1139.48 0 0 0 0 0 0 0 
0 0 0 0 0 0 0 0 0 0 0 0 -71.1844 0 0 0 0 0 0 1182.97 0 0 -728.858 0 0 0 0 0 0 1466.64 0 0.02 0 0 0 0 0 0 0 0 0 0 -758.461 0 0 0 956.679 0 0 2442.17 0 0 2170.4 -1315.12 0 0 0 0 0 0 0 0 0 -1314.36 0 397.275 
0 0 0 -2142.32 0 0 0 0 0 0 -971.48 0 0 0 0 0 0 0 0 -54.2467 0 960.646 0 675.451 0 0 2214.19 0 0 2025.28 487.762 0 0.09 0 -350.429 -1079.52 0 0 0 0 0 2459.87 -747.169 135.731 0 0 0 0 0 0 0 0 0 0 0 0 0 -1873 0 0 0 0 0 0 0 661.718 
2302.7 0 0 0 0 0 2287.74 0 0 0 0 0 0 0 -763.497 -2372.13 0 2348.32 -2135.15 1245.99 2067.25 0 322.504 0 0 0 -173.879 -41.5815 0 0 0 0 0 0.02 0 0 0 0 -563.753 0 0 0 0 1318.32 0 0 0 0 0 0 0 0 0 0 0 0 0 0 0 0 0 0 0 0 -2020.86 0 
0 0 0 0 0 0 0 0 -1418.42 828.959 0 0 2039.17 1692.33 173.269 -134.968 0 0 169.912 -958.205 0 2114.86 0 1681.04 0 2170.09 0 0 0 -1542.94 0 0 -986.282 0 0 0 0 0 -903.577 0 0 0 0 0 0 0 2382.2 0 0 0 0 -198.447 0 0 0 -1583.22 0 0 -436.644 984.451 0 0 0 0 0 0 
1764.66 1712.01 -2278.13 0 247.887 506.531 0 0 -696.661 -645.085 0 0 0 0 0 0 0 0 0 0 2129.2 0 0 0 0 0 0 -751.595 0 0 0 0 -659.429 0 0 0.09 0 0 -725.349 0 0 0 -1073.26 2346.19 0 0 2394.56 0 0 -1421.48 0 0 0 0 0 0 0 0 0 0 0 0 0 0 0 0 
0 0 0 1976.61 1912.06 0 680.792 0 0 0 0 -1893.9 0 0 -1451.69 0 966.292 0 1104.85 0 0 0 0 0 0 0 0 2238 0 0 0 0 0 0 0 0 0.06 0 1785.56 0 0 1072.04 0 0 0 0 0 0 0 0 -950.728 0 1969.44 0 0 0 0 0 0 -1150.01 0 0 0 0 0 0 
0 0 0 0 2335.51 0 0 0 0 0 0 0 1555.15 133.29 1043.2 0 0 0 0 0 0 2236.63 0 0 0 0 0 0 0 727.18 0 0 0 0 0 0 0 0 0 0 596.866 0 0 0 -667.211 0 1930.68 -885.418 0 1200.67 0 0 0 0 1760.84 0 0 0 0 0 -599.918 0 0 0 0 0 
0 0 1973.25 0 2189.17 1836.38 0 -266.808 0 -771.279 0 0 0 0 -566.195 0 0 2032.91 1074.18 0 0 0 0 0 0 0 0 150.685 0 -1779.15 0 0 0 2117.45 -2161.09 144.887 644.78 0 0.05 2206.41 0 0 -327.845 -2253.87 1445.43 0 0 0 0 0 2307.12 0 867.565 0 0 -1771.68 0 0 0 0 0 1562.01 0 0 0 0 
0 0 0 0 2315.97 0 0 643.254 0 133.442 0 0 0 453.429 0 -616.398 0 0 0 0 606.632 0 0 0 0 0 0 0 0 476.318 0 0 0 0 0 0 0 0 -929.823 0.05 749.916 0 0 0 0 0 0 0 -882.214 0 0 0 0 0 282.525 0 0 0 0 0 0 0 0 0 0 0 
-1816.54 0 0 0 2106.01 1306.42 0 -1418.42 1669.13 -1894.21 0 -226.829 0 0 0 0 2018.27 831.248 0 0 0 1076.16 0 1962.11 1905.65 0 -1919.84 0 -1187.55 -311.823 0 0 0 0 0 0 0 1150.78 0 1895.28 0.09 0 0 -1759.32 -1756.72 0 0 0 0 0 0 0 0 0 0 2209.46 0 0 0 1137.81 0 0 0 -550.63 0 0 
0 0 0 0 0 0 0 0 1672.34 0 0 0 0 2467.35 0 0 1472.14 0 -1496.7 0 1368.68 0 0 -1975.69 0 0 -1835.15 -111.164 0 1452.6 0 0 1698.58 0 0 0 2426.45 0 0 0 0 0.08 0 570.315 0 0 0 0 0 1650.82 0 0 0 0 -657.445 0 0 -548.646 0 0 0 0 0 0 0 0 
0 0 983.23 0 0 882.977 -88.58 0 0 -1369.9 0 1795.02 0 0 -2088 0 1851.33 0 0 -2248.53 2051.07 0 0 0 0 -1970.05 2490.08 0 0 2332.45 1448.03 1238.67 -1839.43 0 0 -2128.44 0 0 -72.8629 0 0 0 0.01 0 0 0 0 0 0 0 0 0 0 0 0 0 289.087 0 0 0 0 0 0 0 0 0 
0 11.5207 0 0 0 0 0 1788.31 0 0 0 0 585.269 0 0 0 0 0 -182.577 0 -837.352 0 0 0 0 656.224 0 2102.65 0 0 0 0 -228.507 1148.18 0 -675.604 0 0 990.402 0 497.07 -1839.58 0 0.09 0 1490.91 0 0 -2256.16 0 0 0 0 0 0 0 0 0 0 0 0 0 0 0 0 233.39 
0 0 0 0 0 0 0 0 0 -374.386 0 0 0 0 0 0 2471.77 2407.68 536.439 0 0 0 0 0 0 0 0 -654.241 0 0 2018.42 0 0 0 0 0 0 1723.91 -2116.99 0 -539.338 0 0 0 0.09 0 318.232 0 0 0 0 0 0 0 -1015.12 0 0 1932.2 2113.33 0 0 0 0 0 0 0 
0 0 -1588.87 0 552.156 0 0 758.003 0 2178.49 -121.235 -1860.03 0 0 -1017.72 0 0 2119.59 1130.63 0 0 0 0 0 -40.0555 1261.25 0 0 0 0 0 0 0 0 0 0 0 0 0 0 0 0 0 1903.06 0 0.01 0 0 0 0 0 0 0 2317.04 0 0 0 0 0 -1031.6 0 0 0 0 291.681 0 
0 0 0 0 0 0 0 0 0 -998.032 0 -2033.07 0 0 953.475 0 0 779.672 0 0 0 0 0 0 0 0 98.6511 2094.41 0 0 361.721 1277.73 0 0 948.592 158.01 0 884.503 0 0 0 0 0 0 498.444 0 0.07 0 -201.193 0 0 492.492 0 0 0 0 0 0 0 0 0 0 0 0 0 1818.37 
1176.72 0 0 0 0 0 0 0 0 0 761.055 0 0 0 -1878.19 0 0 1939.83 -1668.07 0 0 0 0 0 0 0 0 0 0 0 0 0 0 0 0 0 0 1906.72 0 0 0 0 0 0 0 0 0 0.09 0 0 0 0 0 0 0 0 0 0 0 0 0 0 0 0 0 0 
0 0 1447.72 0 0 0 0 0 0 0 1625.8 -2259.97 0 0 0 0 0 0 0 0 -526.063 -2171.93 0 0 0 0 0 0 0 0 0 0 0 0 0 0 0 0 0 2059.16 0 0 0 982.925 0 0 185.629 0 0.09 0 0 0 0 0 0 0 0 0 0 0 934.248 0 0 0 0 0 
0 0 0 0 0 0 0 0 220.573 -991.47 0 0 0 0 279.931 0 0 0 0 0 0 0 0 0 0 0 0 0 0 0 0 2438.66 0 0 0 2285.91 0 282.22 0 0 0 -693.152 0 0 0 0 0 0 0 0.01 0 0 0 1052.35 0 0 0 0 0 0 0 0 0 0 0 0 
0 0 2220.91 0 0 0 0 0 0 0 0 0 0 0 0 0 0 0 0 0 0 -125.965 0 0 666.753 0 0 0 0 0 0 0 0 0 0 0 2049.09 0 2188.56 0 0 0 0 0 0 0 0 0 0 0 0.01 0 0 0 0 0 0 -1488.16 0 415.586 0 0 0 0 0 0 
0 0 0 0 0 0 0 0 0 -2232.05 0 0 822.703 0 1547.21 0 0 0 0 859.783 0 0 0 0 0 0 -427.641 0 0 0 0 0 0 0 1021.23 0 0 0 0 0 0 0 0 0 0 0 2275.69 0 0 0 0 0.05 -146.26 0 0 0 0 -1673.86 0 -1804.79 0 0 0 0 905.56 0 
0 0 0 0 0 -1749.55 0 0 0 0 0 0 0 0 0 480.743 0 0 0 0 0 0 0 0 0 0 -63.5548 -1025.8 0 0 0 -254.753 0 0 0 0 1949.14 0 -773.873 0 0 0 0 0 0 0 0 0 0 0 0 1209.22 0 0 0 0 2215.87 0 0 0 0 0 1922.9 0 -1732.61 0 
651.341 0 0 0 0 880.078 0 0 0 0 0 0 0 0 0 0 0 0 0 37.1563 0 0 0 0 0 0 0 2056.41 0 0 0 -1767.4 0 0 0 0 0 0 0 0 0 0 0 0 0 2169.03 0 0 0 2454.68 0 0 0 0.05 0 0 0 0 1315.12 0 0 0 0 0 0 0 
0 0 0 0 0 0 0 0 0 1485.11 0 0 0 0 287.255 0 0 0 0 0 0 0 0 0 0 0 0 810.8 0 0 0 0 0 0 0 0 0 2176.05 0 2041.76 0 2142.48 0 0 -2003.01 0 0 0 0 0 0 0 0 0 0.01 0 0 0 0 0 0 0 0 0 0 0 
0 0 0 0 1353.72 0 0 0 -203.33 0 0 0 0 0 0 0 0 0 0 0 0 0 0 0 0 0 0 0 0 0 0 0 0 0 2286.07 0 0 0 1591.31 0 -2111.5 0 0 0 0 0 0 0 0 0 0 0 0 0 0 0.06 0 0 -1941.36 0 0 0 0 0 0 0 
0 0 0 2052.6 0 0 0 0 0 0 -1747.57 0 1409.42 0 0 0 0 0 0 0 0 0 0 0 0 0 0 -1214.56 0 0 0 0 0 0 0 0 0 0 0 0 0 0 -1724.68 0 0 0 0 0 0 0 0 0 2475.43 0 0 0 0.06 0 0 416.196 0 0 0 0 0 -622.196 
0 0 0 0 0 0 0 2073.35 0 0 0 -1056.93 0 0 0 468.078 0 1561.4 0 0 0 0 0 0 685.064 0 0 -1189.08 0 0 0 0 -609.531 0 0 0 0 0 0 0 0 -8.46889 0 0 -941.572 0 0 0 0 0 -343.867 1810.89 0 0 0 0 0 0.08 0 0 0 0 0 0 0 0 
0 0 0 0 0 -1377.68 1571.78 498.291 0 0 0 0 0 -1378.75 0 0 0 0 0 0 0 0 0 0 0 0 0 0 804.697 0 1013.9 0 0 0 430.998 0 0 0 0 0 0 0 0 0 -17.1667 0 0 0 0 0 0 0 0 328.913 0 461.058 0 0 0.09 0 0 0 0 0 1981.64 0 
0 0 0 0 0 0 0 0 0 0 0 0 1580.48 2320.7 0 0 0 2464.45 0 0 0 0 0 0 0 0 0 0 1625.34 0 0 0 0 0 -214.927 0 2119.74 0 0 0 905.408 0 0 0 0 -2087.69 0 0 0 0 1475.49 148.701 0 0 0 0 -1453.06 0 0 0 0 0 0 0 0 0 
0 0 0 0 0 0 0 0 0 -2482.76 0 0 0 0 0 1910.69 -1661.81 0 1388.52 0 0 0 0 0 0 0 315.79 0 0 0 0 0 0 0 0 0 0 495.544 0 0 0 0 0 0 0 0 0 0 1052.51 0 0 0 0 0 0 0 0 0 0 0 0.05 0 0 0 0 0 
0 0 2456.82 0 0 0 0 0 1240.81 0 0 0 -968.734 0 0 0 0 0 0 0 0 0 0 0 0 0 0 0 0 0 0 0 0 0 0 0 0 0 69.8111 0 0 0 0 0 0 0 0 0 0 0 0 0 0 0 0 0 0 0 0 0 0 0.07 0 0 0 0 
0 0 0 0 0 0 0 0 2193.59 0 0 0 0 -317.774 1151.23 0 0 0 0 0 0 0 -63.7074 0 0 0 0 0 0 0 0 0 0 0 0 0 0 0 0 0 0 0 0 0 0 0 0 0 0 0 0 0 2120.5 0 0 0 0 0 0 0 0 0 0.02 0 0 0 
0 2487.95 0 0 0 0 0 0 0 0 0 0 0 1460.84 0 0 0 0 -1011.15 0 2004.68 0 0 0 0 0 0 0 0 0 0 866.039 0 0 0 0 0 0 0 0 2438.35 0 0 0 0 0 0 0 0 0 0 0 0 0 0 0 0 0 0 0 0 0 0 0.07 0 0 
0 0 0 0 0 0 0 -583.59 0 0 0 0 0 0 0 679.876 1763.89 0 0 -104.907 0 -1709.72 0 0 0 0 0 0 0 0 0 0 0 2319.48 0 0 0 0 0 0 0 0 0 0 0 -340.663 0 0 0 0 0 -1073.87 733.284 0 0 0 0 0 560.396 0 0 0 0 0 0.08 0 
0 0 0 0 0 0 0 0 0 0 0 0 0 0 0 0 -595.035 0 0 0 0 0 0 0 0 0 0 0 0 0 0 1267.82 1639.23 0 0 0 0 0 0 0 0 0 0 -265.435 0 0 2428.59 0 0 0 0 0 0 0 0 0 365.383 0 0 0 0 0 0 0 0 0.09 
