*Vertices 32
*Matrix 
0.09 1046.71 0 0 1931.59 1238.67 0 1526.76 0 0 1880.47 0 0 0 0 -1754.28 0 0 0 0 0 0 0 0 641.575 0 2023.91 -2185.66 0 0 0 0 
1259.88 0.04 1264.46 0 0 2436.37 0 0 0 0 0 0 0 0 0 0 -1299.25 0 0 0 0 0 0 0 0 0 0 0 0 1864.3 0 0 
0 1226.16 0.02 0 0 -1908.4 2310.02 1511.35 486.084 0 -21.897 0 0 0 -1814.25 1980.88 0 0 0 0 0 0 -643.559 0 0 0 0 0 0 0 0 0 
0 0 0 0.04 0 0 2486.42 0 -1293.45 0 0 0 0 0 0 1611 0 0 498.138 0 0 0 0 0 0 0 0 0 0 0 0 0 
1260.03 0 0 0 0 0 0 1700.11 0 0 15.4881 0 0 0 0 773.263 0 0 0 0 0 0 0 0 0 0 0 0 0 0 0 0 
2360.07 -1680.58 1576.82 0 0 0.06 0 0 0 -1248.13 0 2302.55 0 0 0 0 0 0 0 0 0 -166.555 0 0 0 0 0 0 0 0 0 0 
0 0 -759.987 1656.62 0 0 0.07 2122.94 0 0 0 0 -1852.55 349.208 0 0 0 0 0 0 0 0 0 0 0 0 0 0 0 0 1702.4 0 
640.202 0 1991.41 0 1847.06 0 1343.5 0.08 0 -2380.67 0 0 0 0 0 0 0 0 0 0 0 0 0 0 0 0 0 0 0 -2498.02 1347.77 0 
0 0 1085.92 2424.01 0 0 0 0 0.05 0 0 1386.23 0 -1372.34 5.56963 0 0 0 -286.187 0 842.54 0 0 0 0 0 0 0 0 0 0 0 
0 0 0 0 0 1854.23 0 1836.99 0 0.04 0 0 0 0 737.404 0 0 0 0 0 0 0 -2284.39 0 0 1583.99 0 0 0 0 0 0 
2387.84 0 1006.88 0 343.562 0 0 0 0 0 0.08 -2218.31 2393.95 0 0 1441.62 0 0 0 0 0 0 0 0 0 0 0 0 0 0 0 0 
0 0 0 0 0 -2010.94 0 0 1311.46 0 1748.63 0.04 0 0 0 0 0 0 0 0 1369.75 0 0 -287.713 0 0 0 0 0 -209.891 0 0 
0 0 0 0 0 0 1494.72 0 0 0 -743.965 0 0.04 0 -1134.91 0 0 1597.42 -90.4111 0 0 0 1205.56 0 1220.82 0 0 0 0 0 0 0 
0 0 0 0 0 0 901.898 0 1403.78 0 0 0 0 0.07 0 261.01 0 0 0 0 0 0 0 0 0 0 0 0 0 0 0 957.747 
0 0 -780.587 0 0 0 0 0 1105.15 -148.854 0 0 64.4704 0 0 0 0 0 0 0 1102.25 2239.52 0 0 0 0 0 0 785.318 0 0 0 
2160.18 0 1133.23 -1107.75 -341.121 0 0 0 0 0 1901.38 0 0 -46.7696 0 0.04 1523.1 0 0 0 0 0 0 0 0 0 0 0 0 108.417 0 0 
0 2482.76 0 0 0 0 0 0 0 0 0 0 0 0 0 2410.73 0.02 0 0 0 0 0 0 -1911.6 0 0 0 0 0 0 0 0 
0 0 0 0 0 0 0 0 0 0 0 0 2444.3 0 0 0 0 0.01 0 0 0 0 0 0 0 0 0 0 198.294 0 0 0 
0 0 0 1002.46 0 0 0 0 -1574.53 0 0 0 1280.79 0 0 0 0 0 0.02 -1048.84 0 0 0 2101.73 0 0 1640.14 1816.23 0 0 0 0 
0 0 0 0 0 0 0 0 0 0 0 0 0 0 0 0 0 0 861.461 0.01 0 0 0 0 0 0 0 0 0 0 0 0 
0 0 0 0 0 0 0 0 459.227 0 0 969.802 0 0 -680.486 0 0 0 0 0 0.01 133.29 0 1955.55 -96.9726 0 0 0 0 0 -1681.34 0 
0 0 0 0 0 1512.57 0 0 0 0 0 0 0 0 104.755 0 0 0 0 0 1249.05 0.04 0 0 0 0 0 0 0 0 -1227.38 0 
0 0 506.989 0 0 0 0 0 0 1182.97 0 0 -706.122 0 0 0 0 0 0 0 0 0 0.07 1924.12 0 1682.26 0 0 0 0 0 0 
0 0 0 0 0 0 0 0 0 0 0 180.441 0 0 0 0 1998.12 0 246.361 0 193.869 0 329.371 0 0 0 0 -1226.31 0 0 0 0 
2232.96 0 0 0 0 0 0 0 0 0 0 0 -202.719 0 0 0 0 0 0 0 683.996 0 0 0 0.07 0 0 0 0 0 0 0 
0 0 0 0 0 0 0 0 0 1862.47 0 0 0 0 0 0 0 0 0 0 0 0 -1698.58 0 0 0.04 0 0 0 0 0 315.638 
2128.28 0 0 0 0 0 0 0 0 0 0 0 0 0 0 0 0 0 756.172 0 0 0 0 0 0 0 0.04 0 0 513.855 0 0 
643.101 0 0 0 0 0 0 0 0 0 0 0 0 0 0 0 0 0 2439.12 0 0 0 0 227.134 0 0 0 0.09 0 0 0 0 
0 0 0 0 0 0 0 0 0 0 0 0 0 0 1574.83 0 0 2377.01 0 0 0 0 0 0 0 0 0 0 0.03 0 0 0 
0 -53.3311 0 0 0 0 0 949.812 0 0 0 176.778 0 0 0 395.596 0 0 0 0 0 0 0 0 0 0 -482.116 0 0 0.04 100.177 0 
0 0 0 0 0 0 1898.79 -1142.99 0 0 0 0 0 0 0 0 0 0 0 0 1511.96 986.129 0 0 0 0 0 0 0 1846.75 0.07 0 
0 0 0 0 0 0 0 0 0 0 0 0 0 2248.53 0 0 0 0 0 0 0 0 0 0 0 831.401 0 0 0 0 0 0.02 
