*Vertices 40
*Matrix 
0.08 0 0 0 0 0 0 0 -1605.2 0 -2333.37 1141.62 0 0 0 2221.67 -27.6955 1981.95 0 0 2440.64 -28.7637 0 0 -774.026 0 -1220.66 -732.215 2425.84 0 0 0 0 0 0 0 0 2108.14 0 0 
0 0.09 1555.91 0 0 0 0 0 0 0 0 0 0 0 1361.81 0 0 0 0 1674.78 0 0 0 0 -632.115 0 0 0 0 0 0 0 991.318 1307.03 0 0 766.701 0 0 0 
0 1527.68 0.06 0 0 0 -357.906 0 0 0 -568.941 0 0 0 0 0 0 0 0 0 -394.223 0 0 0 1325.19 0 0 -2382.05 0 0 0 0 0 0 0 0 0 1342.74 1450.32 -545.747 
0 0 0 0 0 0 0 -180.593 0 0 0 633.03 0 0 2156.67 0 -2001.17 0 2042.38 0 526.368 0 0 0 -1230.28 0 -611.972 0 0 2119.74 0 0 0 0 0 2061.91 -52.4155 0 0 0 
0 0 0 0 0.03 0 0 2203.82 0 0 0 0 -453.581 0 0 0 -216.758 0 0 2006.97 0 -687.964 0 0 398.648 0 1200.98 0 0 0 -1787.39 0 0 0 1055.56 0 0 0 0 0 
0 0 0 0 0 0.09 0 0 0 0 0 0 0 0 0 2001.48 0 401.395 1899.24 0 0 -2232.51 -2308.34 0 -2468.26 0 0 0 0 297.784 238.731 0 0 0 0 2309.41 0 0 0 0 
0 0 2112.26 0 0 0 0.07 0 0 0 0 0 0 0 0 0 0 -202.261 0 0 0 0 0 0 2019.79 0 0 0 0 0 967.208 0 -714.667 -1089.28 0 0 0 0 0 0 
0 0 0 751.137 740.913 0 0 0.02 0 -377.438 0 0 0 47.38 0 0 0 0 0 0 0 1322.75 611.667 0 2469.63 399.411 0 0 0 0 -423.521 637.608 -1467.25 0 258.415 -1665.62 0 0 0 0 
1304.9 0 0 0 0 0 0 0 0.03 0 0 0 0 0 -720.008 1294.06 1919.23 0 0 -1671.27 0 0 0 0 0 777.383 0 -15.7933 0 188.07 -135.731 -82.3237 0 0 0 0 0 0 0 0 
0 0 0 0 0 0 0 1980.57 0 0.03 0 0 859.02 0 0 0 0 -519.807 0 567.11 0 0 0 0 -425.199 1976.15 0 0 0 -1071.58 0 0 0 0 0 0 1473.05 0 0 0 
1693.85 0 550.02 0 0 0 0 0 0 0 0.07 0 0 -65.6911 0 1646.24 1551.33 -266.35 0 -901.593 0 0 0 0 0 2025.59 0 0 -246.666 0 0 901.593 0 0 0 0 0 0 0 0 
-2171.32 0 0 1762.83 0 0 0 0 0 0 0 0.06 -2323.15 0 2290.8 -2388 0 69.9637 0 0 0 0 -1521.12 0 1426.66 0 0 0 1363.03 0 0 2376.09 0 -337.458 0 0 0 0 0 0 
0 0 0 0 1503.72 0 0 0 0 475.097 0 -1713.69 0.07 1011.15 0 0 0 -560.701 -1051.74 0 0 740.15 0 0 0 2174.52 0 -2242.58 1338.16 0 0 1672.03 0 0 0 -1820.2 2390.29 0 0 0 
0 0 0 0 0 0 0 -162.587 0 0 -482.269 0 1027.94 0 0 1935.41 0 0 0 0 0 0 0 0 0 1995.38 0 0 0 0 1823.56 0 0 -1601.08 0 849.406 0 0 0 0 
0 709.174 0 -188.07 0 0 0 0 -1545.69 0 0 1200.22 0 0 0.01 0 2152.85 0 0 0 0 -144.734 0 737.098 0 0 647.984 0 0 0 2306.82 0 0 0 -970.565 1323.82 -708.106 0 0 0 
1574.98 0 0 0 0 628.91 0 0 1569.19 0 -218.589 -612.278 0 1679.2 0 0.09 0 0 0 420.774 0 0 0 -378.811 452.513 -977.889 0 -1912.37 534.608 0 -1447.72 -51.9578 0 0 0 0 43.8704 0 0 0 
2004.23 0 0 1310.24 1689.28 0 0 0 -1257.13 0 468.535 0 0 0 -980.941 0 0.02 0 517.518 1568.27 0 0 0 -2424.77 0 -2075.64 0 -147.176 0 0 0 0 0 0 0 0 0 0 0 0 
101.398 0 0 0 0 811.106 -1867.35 0 0 1169.55 2251.88 1926.86 1137.5 0 0 0 0 0.01 0 0 0 0 0 0 0 -641.423 0 0 0 0 1675.85 0 0 0 0 0 0 0 -2282.56 0 
0 0 0 139.546 0 1777.93 0 0 0 0 0 0 2462.77 0 0 0 -1797.31 0 0.05 0 0 2459.11 -502.716 0 0 1315.73 0 -935.774 0 2222.74 1042.59 0 1940.29 0 0 0 0 0 0 0 
0 -2405.09 0 0 96.057 0 0 0 1502.2 1566.29 2210.68 0 0 0 0 1822.79 1059.37 0 0 0.03 0 0 -1217 0 0 0 0 0 0 0 0 0 0 0 0 0 814.615 -1204.79 0 0 
2327.42 0 482.727 504.089 0 0 0 0 0 0 0 0 0 0 0 0 0 0 0 0 0.02 525.91 0 0 0 0 0 0 0 0 0 -1724.37 0 0 -515.076 437.712 0 0 1996.75 0 
-1796.4 0 0 0 2057.02 1968.67 0 690.405 0 0 0 0 -2150.87 0 306.787 0 0 0 1646.09 0 -1605.66 0.06 0 0 0 0 0 0 0 0 0 0 0 0 0 0 1405.61 0 0 0 
0 0 0 0 0 -2278.13 0 2444.15 0 0 0 2370.75 0 0 0 0 0 0 -915.479 2054.12 0 0 0.09 1092.03 0 2033.98 0 0 0 853.069 0 0 0 0 0 0 0 0 0 0 
0 0 0 0 0 0 0 0 0 0 0 0 0 0 2316.74 2436.83 2273.09 0 0 0 0 0 583.285 0.08 0 12.2837 0 434.507 312.281 1857.59 0 898.236 0 -39.4452 0 0 0 0 0 0 
1164.36 1674.63 2136.52 -977.889 -327.235 2133.63 701.544 1050.68 0 -55.3148 0 651.952 0 0 0 38.377 0 0 0 0 0 0 0 0 0.06 0 0 1681.34 0 0 1606.88 0 0 0 0 0 -2165.36 0 0 832.774 
0 0 0 0 0 0 0 -1183.89 1455.35 24.3385 -1263.24 0 2017.81 -165.944 0 1827.07 1239.59 712.531 138.63 0 0 0 -1880.32 1876.96 0 0.07 0 0 -2255.85 0 0 0 0 2079.91 0 1620.46 0 0 1541.41 0 
194.784 0 0 1803.11 -219.199 0 0 0 0 0 0 0 0 0 2071.98 0 0 0 0 0 0 0 0 0 0 0 0.01 0 0 -1386.68 2149.49 0 1991.41 -877.483 0 1678.29 1197.62 0 1320 0 
1407.44 0 -239.647 0 0 0 0 0 207.297 0 0 0 1976.3 0 0 1980.12 173.421 0 2012.01 0 0 0 0 1201.44 -725.654 0 0 0.06 -890.912 0 0 0 1641.67 0 -1359.98 0 1713.08 1596.65 650.121 0 
1063.95 0 0 0 0 0 0 0 0 0 -2002.7 1764.81 2142.32 0 0 925.092 0 0 0 0 0 0 0 -943.251 0 376.675 0 1274.83 0.09 -1060.59 0 0 0 0 2027.88 163.961 0 -1502.04 0 0 
0 0 0 -274.438 0 -144.734 0 0 598.849 704.596 0 0 0 0 0 0 0 0 -1428.95 0 0 0 -1544.31 -851.085 0 0 1604.13 0 2404.63 0.08 360.195 0 -916.395 -607.547 0 0 0 2045.12 0 0 
0 0 0 0 156.636 1198.08 -1920.15 270.165 1990.65 0 0 0 0 2075.79 -351.955 -65.6911 0 13.5044 -1656.16 0 0 0 0 0 -2320.4 0 103.534 0 0 1837.44 0.07 0 0 0 1427.12 0 0 0 0 383.694 
0 0 0 0 0 0 0 1626.56 1740.09 0 1892.38 442.9 1092.18 0 0 -978.5 0 0 0 0 144.734 0 0 2419.28 0 0 0 0 0 0 0 0.01 1801.89 0 0 0 0 -381.863 0 2162.62 
0 -1086.38 0 0 0 0 333.186 -1943.95 0 0 0 0 0 0 0 0 0 0 2367.85 0 0 0 0 0 0 0 -1322.9 1838.05 0 2087.69 0 -140.004 0 0 0 0 0 0 0 0 
0 1287.35 0 0 0 0 1931.59 0 0 0 0 2180.78 0 978.042 0 0 0 0 0 0 0 0 0 -1481.6 0 291.528 2213.74 0 0 900.372 0 0 0 0 0 -1041.06 0 0 0 0 
0 0 0 0 -155.263 0 0 1373.87 0 0 0 0 0 0 1293.76 0 0 0 0 0 195.853 0 0 0 0 0 0 -1548.28 1071.43 0 1394.92 0 0 0 0.08 0 0 0 0 0 
0 0 0 1996.29 0 -818.583 0 -2086.78 0 0 0 0 -2046.19 2090.29 -538.118 0 0 0 0 0 -901.288 0 0 0 0 2086.47 2460.17 0 2056.26 0 0 0 0 1714.3 0 0.05 0 0 0 0 
0 46.7696 0 1835 0 0 0 0 0 -2187.49 0 0 1178.09 0 576.876 1919.08 0 0 0 855.205 0 -1033.89 0 0 -2089.68 0 1621.52 -209.128 0 0 0 0 0 0 0 0 0.01 0 0 0 
228.355 0 580.233 0 0 0 0 0 0 0 0 0 0 0 0 0 0 0 0 1472.29 0 0 0 0 0 0 0 517.212 -1106.37 597.781 0 154.653 0 0 0 0 0 0.04 0 0 
0 0 2108.29 0 0 0 0 0 0 0 0 0 0 0 0 0 0 1810.13 0 0 -349.055 0 0 0 0 1251.49 -2351.68 -1724.83 0 0 0 0 0 0 0 0 0 0 0.01 0 
0 0 -1157.95 0 0 0 0 0 0 0 0 0 0 0 0 0 0 0 0 0 0 0 0 0 1574.07 0 0 0 0 0 142.75 1496.7 0 0 0 0 0 0 0 0.05 
