*Vertices 73
*Matrix 
0.01 0 -504.852 0 1648.84 788.827 -1456.27 0 2033.52 -387.356 2039.48 0 194.479 0 1959.21 0 0 0 0 0 1662.11 0 2320.25 -1968.83 1723.61 0 0 -1068.07 -1715.22 0 0 0 1783.12 1889.63 0 -801.34 0 0 0 0 -1025.65 -1378.9 0 0 0 0 0 0 0 -497.223 0 -2475.13 0 0 -357.906 0 275.201 0 0 -1085.01 1912.37 0 0 0 0 0 0 0 0 0 0 0 0 
0 0.03 0 -1760.08 0 0 0 0 0 0 582.369 755.104 0 1724.83 0 -2064.04 0 0 0 0 0 0 0 0 0 -1943.34 0 0 525.147 293.817 0 0 0 0 0 -666.906 190.817 0 1189.69 0 67.6748 1555.3 0 0 0 1450.77 0 0 0 172.811 873.516 -1373.56 0 2362.36 0 0 0 2046.34 0 0 0 0 0 541.475 0 0 0 0 0 0 0 806.223 0 
-3.89111 0 0.08 0 0 0 0 0 0 0 840.098 0 0 0 2047.26 -2232.96 1556.37 0 0 0 -121.54 0 2194.66 0 0 0 1255.91 0 0 0 0 0 630.589 2227.62 0 -6.63778 0 727.332 0 0 -1614.51 1394.01 0 1282.92 -67.3696 0 1656.16 0 -691.626 0 0 1383.79 0 0 0 0 0 1420.26 -2485.66 0 0 0 0 0 0 0 0 0 0 0 0 0 -559.481 
0 345.698 0 0.07 0 0 1032.52 0 0 0 573.824 0 0 0 0 0 0 0 0 1783.27 -759.835 0 0 0 1764.05 0 -924.482 0 0 0 0 0 0 2364.5 1822.79 -1057.24 0 0 0 2235.56 0 0 -277.337 -460.143 0 0 0 0 0 0 0 2248.38 0 0 0 0 0 0 0 0 0 0 0 0 0 0 0 0 0 0 1044.27 0 0 
1332.36 0 0 0 0.06 0 0 0 0 0 -640.202 0 0 0 0 -746.864 -166.402 0 0 0 0 1903.67 0 712.683 1305.81 0 0 0 0 0 0 -2118.06 994.064 0 0 0 0 0 0 570.467 0 1798.38 0 -600.375 -2059.77 0 2345.42 0 0 0 0 0 0 0 0 -2081.29 0 0 0 0 0 0 -1566.13 0 0 0 0 0 0 0 0 0 0 
496.612 0 0 0 0 0.06 0 -264.367 0 1843.85 -61.1133 0 0 0 0 0 2190.85 0 -779.061 0 -1124.68 0 0 1891.77 0 1278.95 0 396.512 0 0 1231.19 2338.25 0 0 -654.088 0 0 -2396.54 0 0 0 997.421 0 943.861 0 -578.86 0 0 0 0 0 0 2237.24 -343.257 2226.4 0 0 0 0 0 0 0 0 0 0 0 0 677.587 0 0 0 0 -1119.5 
-2347.25 0 0 981.704 0 0 0.02 0 0 0 0 0 -426.725 -2184.13 0 0 297.632 0 0 1914.66 0 2049.85 2327.88 1071.89 0 -202.872 0 2201.53 -1698.28 -143.971 0 0 571.841 1068.83 1089.59 -261.467 0 0 -2284.69 1760.38 0 0 658.361 0 0 970.412 -2124.16 2199.85 0 0 -1723.15 -888.012 0 0 2391.51 0 0 0 0 0 0 1853.31 0 0 0 1771.07 0 0 -2465.51 0 0 0 0 
0 0 0 0 0 1334.65 0 0.09 0 635.167 0 0 0 738.014 0 0 1534.09 295.038 0 0 0 0 0 0 0 0 -1145.89 0 142.598 0 0 0 0 -727.79 0 1844 0 0 -1683.17 573.519 0 115.741 2023 0 0 1465.88 0 2421.26 -1767.4 0 0 0 0 1501.13 -1108.81 0 0 0 1236.99 0 0 0 0 0 0 0 0 0 0 0 299.921 0 0 
1765.42 0 0 0 0 0 0 0 0.06 0 0 -54.5518 0 0 1588.11 0 0 0 0 0 0 0 0 0 1743.75 -2324.82 0 0 0 219.199 0 -938.063 0 0 0 0 -499.359 0 0 0 0 0 1402.55 0 0 0 261.162 -2441.4 0 2078.84 1829.36 0 1300.78 0 0 0 0 0 0 1339.08 0 0 0 0 0 0 0 2436.52 925.245 0 0 0 0 
617.618 0 0 0 0 -1191.21 0 2325.59 0 0 0 0 0 2181.54 0 -1679.66 0 0 0 -259.331 1534.39 -2332.15 0 0 0 -482.116 0 0 0 0 0 0 0 0 0 0 -1595.43 2302.7 0 0 0 0 0 0 1385.62 -2395.47 0 0 0 0 -364.62 0 -1728.19 0 808.359 0 0 -196.921 0 0 2419.28 0 0 0 0 834.758 0 0 0 0 0 0 0 
270.623 -2370.6 2138.81 -532.167 -1804.94 -812.326 0 0 0 0 0 1761.15 0 0 1321.53 -25.1015 0 0 0 0 0 0 -1524.48 0 0 -1529.66 0 0 0 1066.85 0 0 1507.69 0 0 0 0 0 1053.88 0 2480.32 0 0 0 2476.35 1798.38 0 2281.03 0 0 980.789 222.098 0 0 0 0 0 0 0 0 0 0 0 302.973 0 0 0 0 0 0 0 -2406.92 0 
0 -1805.25 0 0 0 0 0 0 1623.66 0 422.147 0.07 177.999 -1612.22 0 1744.51 0 -643.559 0 0 0 0 525.3 0 0 2394.86 -878.246 -1827.22 0 0 -1759.93 0 0 714.515 -2223.04 0 2310.79 2269.89 0 0 0 0 0 0 754.189 0 2343.9 998.642 0 0 1314.66 0 0 0 0 0 0 1517 0 0 0 -1830.12 0 0 0 0 0 -1063.8 0 0 0 0 0 
-2252.65 0 0 0 0 0 2488.56 0 0 0 0 2028.34 0.06 0 189.901 0 -203.635 0 0 0 0 0 968.276 1434.75 0 1820.51 0 0 0 0 0 0 -1216.09 213.858 0 0 0 864.666 -2333.37 0 0 0 0 0 0 -1149.56 0 0 0 0 -656.987 0 0 1032.67 0 -2481.99 0 0 0 0 0 0 0 0 0 0 0 0 0 0 0 0 0 
0 -1738.72 0 0 0 0 -1831.49 2068.62 0 -1638.77 0 2278.74 0 0.03 0 1135.67 1493.35 0 0 0 0 928.602 -1938.15 0 -2017.35 0 -1047.93 0 0 0 0 1691.26 0 0 1344.87 2277.67 832.774 0 0 416.959 -1148.64 0 0 0 2030.32 0 0 -775.246 1198.84 0 0 0 0 0 -96.2096 0 0 0 0 0 0 0 -941.267 0 0 0 0 0 0 0 0 0 0 
523.774 0 2047.26 0 0 0 0 0 -2171.01 0 2292.32 0 2062.21 0 0.06 204.703 0 0 0 0 0 0 0 0 0 0 740.76 -1832.41 0 -586.947 -716.346 0 -1435.51 0 1831.34 0 498.444 0 903.272 0 0 0 0 0 0 0 0 221.335 0 0 712.378 0 0 279.168 -994.827 0 0 0 -900.525 0 0 0 0 0 0 0 0 0 -284.509 0 0 0 0 
0 1622.44 436.186 0 1382.87 0 0 0 0 -434.049 -14.8778 1718.27 0 401.395 761.055 0.09 0 0 0 0 0 -1112.02 0 0 0 0 -2459.11 0 0 0 -2244.1 0 0 0 0 0 0 0 554.292 0 512.482 0 2216.03 -2110.58 0 0 0 2252.19 1385.46 264.824 1516.24 0 0 0 0 0 0 0 0 0 0 0 0 0 0 0 0 1831.03 0 0 1759.32 0 0 
0 0 1528.6 0 0.534074 1303.52 -2292.17 932.417 0 0 0 0 1738.11 -1002.91 0 0 0.05 0 0 0 2124.77 0 0 0 1870.56 -590.304 0 0 0 0 1299.55 0 -2185.81 0 0 -1055.71 -984.298 0 0 0 0 2044.97 580.386 0 -4.1963 0 0 0 0 501.19 0 0 0 0 -2286.68 0 0 0 0 0 0 0 0 0 2312.92 0 1866.59 0 0 0 0 -1410.95 0 
0 0 0 0 0 0 0 2475.13 0 0 0 666.601 0 0 0 0 0 0.02 -1668.07 2191.31 687.811 0 0 1995.38 0 0 0 0 0 0 936.537 0 1962.26 0 0 0 0 0 1734.14 0 0 0 0 0 0 0 -797.83 0 0 0 0 0 0 0 0 0 0 0 367.519 0 0 0 0 2230.67 0 0 0 0 0 0 0 0 1505.55 
0 0 0 0 0 2420.65 0 0 0 0 0 0 0 0 0 0 0 -491.119 0.04 2168.72 1778.39 0 0 0 1562.47 430.692 0 -279.626 0 0 1737.49 215.537 -2098.22 0 0 210.807 0 0 -147.938 0 0 0 0 0 0 -1507.69 -357.601 0 0 2372.28 0 2348.63 0 454.65 0 0 0 0 0 0 0 0 0 0 0 0 0 0 0 0 0 0 835.521 
0 0 0 1990.8 0 0 2343.9 0 0 -112.079 0 0 0 0 0 0 0 210.196 1818.52 0.02 -821.787 0 0 0 0 1179.77 0 0 0 445.189 0 2077.62 2166.59 0 -1530.12 0 -259.484 2393.8 0 0 -671.636 451.14 0 -1718.88 0 0 0 -1259.73 0 0 0 1141.62 0 0 0 0 0 0 -2282.71 0 0 0 0 0 0 0 0 1907.33 0 0 1253.17 0 -891.675 
2292.78 0 105.213 -2005.14 0 -502.106 0 0 0 402.158 0 0 0 0 0 0 -716.803 -1933.88 153.127 1327.17 0.04 0 0 0 0 -174.337 0 -1451.84 0 0 0 995.895 0 0 0 0 0 0 2413.33 0 0 971.175 0 -67.217 1680.73 0 0 0 0 0 0 0 562.838 545.442 -846.355 0 0 0 0 0 0 0 1008.56 0 0 0 0 -2125.23 0 0 0 0 0 
0 0 0 0 1822.79 0 1276.36 0 0 1565.07 0 0 0 739.387 0 2100.67 0 0 0 0 0 0.08 0 0 0 0 0 -1466.49 0 0 0 61.4185 0 1535.77 0 0 -1204.49 0 0 0 407.041 995.895 0 -1833.48 -483.795 0 0 114.826 0 0 0 0 0 -1184.35 0 0 0 0 0 0 0 0 0 0 0 0 0 1293.3 0 107.196 0 0 0 
-1918.01 0 748.848 0 0 0 1773.81 0 0 0 1486.33 818.43 419.553 56.2304 0 0 0 0 0 0 0 0 0.05 1471.53 0 0 0 0 0 0 2372.43 0 0 0 1211.05 0 0 0 0 0 0 0 0 0 1831.19 0 0 0 0 0 0 0 0 0 0 0 0 0 0 0 0 -984.298 0 0 0 0 0 0 0 0 1636.02 0 0 
2472.23 0 0 0 1249.05 695.593 2366.63 0 0 0 0 0 -1063.8 0 0 0 0 1452.6 0 0 0 0 1762.67 0.02 0 -1480.99 0 0 -611.515 0 -1422.54 1405.15 0 0 0 -124.897 0 0 0 0 1842.78 816.599 -674.993 0 0 0 0 -223.472 0 2238 0 0 944.624 0 -898.694 2418.52 0 0 0 0 0 0 0 0 0 0 0 0 0 822.703 0 0 0 
-2180.17 0 0 1516.54 2217.09 0 0 0 37.4615 0 0 0 0 -490.509 0 0 426.42 0 -712.226 0 0 0 0 0 0.07 0 1811.5 0 0 0 0 0 0 0 0 0 -441.527 0 1145.59 0 1241.72 0 0 0 0 2498.63 0 0 0 0 0 -1367.92 0 -777.383 0 0 0 0 0 0 0 0 0 0 0 -835.215 0 0 0 0 0 0 0 
0 -821.482 0 0 0 -1487.85 1272.39 0 -241.63 1842.78 -2480.77 594.577 1269.65 0 0 0 -2399.9 0 767.312 -274.895 1052.96 0 0 300.684 0 0.06 0 -360.195 0 0 2153 0 0 0 1979.2 0 0 0 0 0 0 0 0 -202.414 0 0 919.752 0 137.41 0 0 0 0 0 0 0 0 0 0 0 0 0 0 0 0 0 0 0 0 0 0 114.063 0 
0 0 -1233.94 2375.79 0 0 0 386.593 0 0 0 2449.49 0 -1807.99 2077.01 2240.9 0 0 0 0 0 0 0 0 -598.239 0 0.02 -1990.65 1698.43 -135.884 0 0 1897.56 -1739.94 0 0 -785.928 0 0 0 0 655.766 1159.17 0 0 0 0 0 0 0 0 0 -1743.75 0 0 0 0 -2320.4 0 0 0 0 0 0 0 2259.51 0 0 0 0 0 0 0 
-74.0837 0 0 0 0 1319.7 48.9059 0 0 0 0 -411.618 0 0 1475.04 0 0 0 145.955 0 955 1980.12 0 0 0 60.3504 1435.97 0.03 2282.86 -526.826 0 2038.87 0 0 0 0 0 2037.64 0 0 0 0 0 0 0 1771.07 0 0 0 0 0 -2455.14 0 0 0 0 0 0 0 0 0 -56.3829 0 0 0 0 0 0 -1268.43 0 0 0 0 
-2158.5 1109.27 0 0 0 0 -274.743 310.907 0 0 0 0 0 0 0 0 0 0 0 0 0 0 0 2386.01 0 0 -667.058 -2266.53 0.02 0 0 1336.79 -2333.37 0 0 0 -2101.89 1043.2 0 0 50.2792 0 0 -54.2467 1704.99 0 2184.44 0 0 0 0 0 0 0 0 1077.84 0 0 0 0 0 0 0 0 0 0 0 0 0 0 0 0 0 
0 -937.452 0 0 0 0 -565.432 0 1035.26 0 185.934 0 0 0 383.541 0 0 0 0 1926.1 0 0 0 0 0 0 -1395.84 1659.67 0 0.07 0 2453.46 0 1221.27 0 1837.29 0 371.181 0 1122.09 0 0 0 0 0 1099.51 0 0 0 1179.62 0 0 0 -1020.16 0 0 0 0 0 0 0 0 0 1953.11 0 0 0 0 -2272.18 0 600.07 0 0 
0 0 0 0 0 -2246.09 0 0 0 0 0 828.959 0 0 1061.66 1464.35 1436.28 -110.858 2282.71 0 0 0 2379.3 951.949 0 1926.25 0 0 0 0 0.05 0 0 1122.09 0 0 0 0 0 0 0 0 0 1804.48 0 8.1637 0 0 0 0 0 0 0 -771.889 0 0 0 0 0 0 0 0 -785.623 1362.73 0 0 0 0 0 0 0 0 0 
0 0 0 0 1787.39 1528.9 0 0 770.516 0 0 0 0 -1930.98 0 0 0 0 -2055.19 835.063 727.943 1572.39 0 1473.05 0 0 0 762.581 1816.84 -301.447 0 0.03 0 0 0 0 0 0 -1756.87 0 1539.12 0 0 815.836 1432.92 0 0 0 0 0 0 0 0 31.663 0 0 0 0 0 0 0 0 -1760.23 0 0 0 -785.928 0 0 0 0 0 0 
2127.83 0 -514.618 0 -172.048 0 -936.079 0 0 0 591.067 0 -125.66 0 2217.25 0 909.223 -2145.99 2320.09 -126.576 0 0 0 0 0 0 790.353 0 1089.74 0 0 0 0.04 0 0 0 2375.94 0 0 0 0 1055.71 0 0 0 -955.458 0 0 0 0 -2384.49 0 0 0 1805.09 0 0 -1890.55 0 0 0 861.461 2226.1 -1380.28 0 0 0 0 123.218 0 0 0 0 
46.1592 0 2368.31 -1634.8 0 0 -106.891 -65.8437 0 0 0 -2327.27 -562.227 0 0 0 0 0 0 0 0 1831.34 0 0 0 0 422.147 0 0 2283.62 1965.62 0 0 0.09 0 229.881 0 0 0 0 0 0 -381.1 0 0 1235.77 250.023 -450.377 0 0 0 -2220.76 0 0 0 0 0 0 0 0 0 0 0 0 2338.1 0 2406.31 0 0 0 0 0 0 
0 0 0 -1463.13 0 -16.4037 -1112.32 0 0 0 0 -426.725 0 2139.73 -27.2378 0 0 0 0 2078.69 0 0 2153.46 0 0 -341.426 0 0 0 0 0 0 0 0 0.06 365.23 0 0 0 0 0 0 2202.6 0 0 0 0 -1530.73 0 1621.68 0 0 1084.7 0 2423.09 -829.722 -1147.57 0 0 0 0 0 0 0 0 0 0 0 0 0 0 635.624 0 
1019.7 2182.45 -2374.57 103.687 0 0 2198.78 -967.36 0 0 0 0 0 725.044 0 0 112.842 0 -184.713 0 0 0 0 24.6437 0 0 0 0 0 1551.33 0 0 0 1691.72 -1012.38 0.02 0 0 0 0 0 0 0 1296.66 0 2437.89 1988.66 0 0 0 0 0 0 0 0 0 -2474.82 0 0 0 0 0 0 0 0 0 -128.101 0 0 0 0 0 0 
0 1127.28 0 0 0 0 0 0 -1093.4 2019.33 0 2175.13 0 -2265.77 -815.531 0 1660.44 0 0 183.035 0 -1648.69 0 0 1177.02 0 128.864 0 1730.93 0 0 0 1406.67 0 0 0 0.02 0 -1375.24 0 0 0 0 0 0 0 0 1862.16 0 0 0 -1294.82 0 -367.061 586.032 -2048.94 0 0 -2204.73 0 0 0 2389.83 0 0 0 0 0 0 0 0 0 0 
0 0 2300.1 0 0 1887.04 0 0 0 823.923 0 685.522 -2402.19 0 0 0 0 0 0 -2380.37 0 0 0 0 0 0 0 -2369.69 2429.65 -48.4481 0 0 0 0 0 0 0 0.08 0 0 0 0 0 0 0 0 1495.18 -407.956 0 0 1349.6 1213.49 0 0 0 0 0 0 0 0 0 0 -403.226 0 0 0 0 0 0 0 640.965 0 389.34 
0 1920.3 0 0 0 0 1316.64 913.19 0 0 -2379.76 0 2378.99 0 -188.223 1072.95 0 1588.56 532.014 0 -681.249 0 0 0 208.06 0 0 0 0 0 0 2012.92 0 0 0 0 2107.99 0 0.03 0 0 0 0 2114.25 0 2249.6 0 0 0 -1735.36 0 0 1016.34 0 1914.2 0 0 -1112.78 0 0 0 0 -414.67 0 0 0 0 0 0 0 0 0 1481.9 
0 0 0 1184.5 1843.7 0 1281.85 2342.83 0 0 0 0 0 1409.57 0 0 0 0 0 0 0 0 0 0 0 0 0 0 0 -804.697 0 0 0 0 0 0 0 0 0 0.04 0 0 0 0 0 407.346 0 0 0 0 1857.59 0 0 0 0 0 0 0 0 0 0 0 0 0 0 -854.442 0 0 0 0 0 0 0 
-900.067 2269.28 2463.84 0 0 0 0 0 0 0 -2051.53 0 0 -1784.8 0 2363.12 0 0 0 -34.1044 0 1799.14 0 2060.84 1836.83 0 0 0 2179.4 0 0 77.1355 0 0 0 0 0 0 0 0 0.07 3.89111 0 0 0 0 1642.74 2399.75 0 812.174 0 0 -2392.57 0 0 0 0 0 0 0 0 0 0 0 0 638.676 0 0 -1881.69 0 0 0 -2482.76 
1863.84 1598.03 -2122.79 0 41.2763 1125.29 0 -40.2081 0 0 0 0 0 0 0 0 -2358.39 0 0 851.39 2366.63 2158.5 0 1834.54 0 0 -1195.33 0 0 0 0 0 1334.5 0 0 0 0 0 0 0 2034.9 0.04 0 0 -1376 0 0 0 0 0 0 0 0 2313.84 0 0 -1299.71 0 0 0 0 -1666.08 0 -1594.21 0 0 561.007 0 0 0 0 0 0 
0 0 0 1972.64 0 0 -1264.61 -2112.26 263.909 0 0 0 0 0 0 1526.46 759.682 0 0 0 0 0 0 1582 0 0 2259.82 0 0 0 0 0 0 921.888 1717.96 0 0 0 0 0 0 0 0.02 0 0 0 0 330.439 0 0 0 0 0 0 0 0 0 0 0 0 0 1293.76 0 0 -2299.65 0 1143.6 0 0 0 1547.36 0 0 
0 0 1795.02 794.626 1155.05 -2467.5 0 0 0 0 0 0 0 0 0 -396.817 0 0 0 -124.287 325.556 329.218 0 0 0 2369.08 0 0 148.701 0 -483.795 -1708.35 0 0 0 -2435.91 0 0 2180.47 0 0 0 0 0.01 496.307 0 0 0 0 0 756.478 0 0 353.481 1324.73 0 0 0 0 0 0 0 0 0 0 0 0 0 -463.652 0 0 0 0 
0 0 2170.4 0 840.709 0 0 0 0 98.8037 2499.08 2183.83 0 1434.29 0 0 -105.06 0 0 0 -1619.39 -178.304 2143.24 0 0 0 0 0 -1058.61 0 0 1001.85 0 0 0 0 0 0 0 0 0 -253.227 0 1034.65 0.01 0 1142.08 0 0 1121.02 -1049 0 905.713 0 0 0 -1117.97 0 -2468.11 0 0 0 0 0 0 0 0 0 0 284.356 0 0 0 
0 1630.68 0 0 0 2367.24 1660.44 1874.52 0 -1573.46 942.793 0 851.085 0 0 0 0 0 -2017.5 0 0 0 0 0 844.676 0 0 1778.54 0 -1226.46 1574.22 0 664.617 1411.1 0 -1912.82 0 0 1357.54 542.085 0 0 0 0 0 0.02 0 0 0 1384.85 0 1275.75 0 0 0 0 0 2462.61 0 0 0 0 0 0 0 0 0 0 0 0 -438.017 0 0 
0 0 1095.69 0 -1671.58 0 -26.78 0 -499.512 0 0 747.169 0 0 0 0 0 497.223 -328.455 0 0 0 0 0 0 -954.237 0 0 -400.937 0 0 0 0 2496.34 0 303.735 0 188.223 0 0 308.313 0 0 0 -475.249 0 0 1529.21 0 1518.22 0 2263.63 0 0 0 -23.2704 0 0 0 0 0 0 0 0 0 0 0 0 0 -116.657 0 0 0 
0 0 0 0 0 0 1565.98 -1378.75 2456.05 0 2265.47 -2231.13 0 -1849.8 -895.795 1608.1 0 0 0 805.765 0 1701.33 0 -818.278 0 0 0 0 0 0 0 0 0 1658.6 1477.63 0 1106.37 -1163.14 0 0 398.19 0 1636.17 0 0 0 -1781.59 0.08 0 0 -731.147 0 0 0 0 0 0 0 0 0 0 0 2036.27 0 0 0 0 0 0 0 0 0 0 
0 0 -361.721 0 0 0 0 -938.368 0 0 0 0 0 2365.41 0 1643.19 0 0 0 0 0 0 0 0 0 501.038 0 0 0 0 0 0 0 0 0 0 0 0 0 0 0 0 0 0 0 0 0 0 0.04 0 0 0 0 0 0 -463.5 -1792.12 0 656.072 0 -828.043 0 -213.248 0 0 0 0 0 0 0 0 0 0 
1033.74 706.275 0 0 0 0 0 0 -1083.94 0 0 0 0 0 0 2367.7 351.344 0 -559.633 0 0 0 0 1716.28 0 0 0 0 0 1682.41 0 0 0 0 1132.47 0 0 0 -2296.44 0 -325.556 0 0 0 -1826.3 1473.82 1864.3 0 0 0.02 0 0 0 0 0 0 0 0 0 0 2376.55 0 0 0 0 0 0 0 0 0 0 0 0 
0 -114.521 0 0 0 0 -1550.87 0 1447.72 1697.82 1340.14 2494.2 2261.19 0 -104.907 2426.45 0 0 0 0 0 0 0 0 0 0 0 0 0 0 0 0 -590.457 0 0 0 0 2423.7 0 -1627.02 0 0 0 -2309.41 -2335.96 0 0 -739.845 0 0 0.01 -2112.87 1453.37 1468.47 1051.44 0 0 0 0 0 0 0 0 0 0 0 0 0 0 0 0 0 2011.55 
-1513.95 1516.54 1827.37 -724.891 0 0 -1536.68 0 0 0 1230.74 0 0 0 0 0 0 0 380.947 2197.26 0 0 0 0 791.574 0 0 -259.484 0 0 0 0 0 -1125.9 0 0 -1916.94 335.17 0 0 0 0 0 0 0 2337.95 692.236 0 0 0 953.017 0.09 0 -413.297 0 0 0 0 0 0 0 1792.43 0 0 0 0 0 0 0 0 0 0 0 
0 0 0 0 0 -163.503 0 0 2153.31 988.723 0 0 0 0 0 0 0 0 0 0 1627.48 0 0 13.3518 0 0 1395.38 0 0 0 0 0 0 0 2456.21 0 0 0 158.315 0 1282.62 0 0 0 -1867.81 0 0 0 0 0 -1782.51 0 0 -1131.55 0 0 0 0 0 0 -1296.96 1195.03 0 0 0 0 0 0 0 0 0 0 0 
0 -788.369 0 0 0 1833.78 0 2111.35 0 0 0 0 -231.559 0 723.67 0 0 0 -757.546 0 -2156.36 321.741 0 0 -1593.91 0 0 0 0 -346.919 1250.57 1858.81 0 0 0 0 -738.319 0 0 0 0 742.897 0 -205.924 0 0 0 0 0 0 1253.32 -73.4733 830.79 0 0 0 0 0 0 0 -320.368 0 0 1326.26 0 0 0 0 0 244.987 0 0 0 
-1283.38 0 0 0 0 1130.33 1194.11 2060.84 0 113.453 0 0 0 1816.23 315.332 0 -745.796 0 0 0 2166.13 0 0 2107.68 0 0 0 0 0 0 0 0 94.5311 0 -1928.85 0 898.999 0 -643.864 0 0 0 0 1238.21 0 0 0 0 0 0 279.321 0 0 0 0.06 0 0 0 0 0 0 0 0 0 0 0 -2491.3 0 0 0 -384.915 -516.602 0 
0 0 0 0 1182.82 0 0 0 0 0 0 0 1711.1 0 0 0 0 0 0 0 0 0 0 1838.82 0 0 0 0 -341.731 0 0 0 0 0 -1875.44 0 -1615.57 0 0 0 0 0 0 0 0 0 1337.86 0 -76.6778 0 0 0 0 0 0 0 0 0 0 112.995 0 0 0 0 0 0 0 0 0 0 0 243.309 0 
1308.71 0 0 0 0 0 0 0 0 0 0 0 0 0 0 0 0 0 0 0 0 0 0 0 0 0 0 0 0 0 0 0 0 0 1674.02 -278.558 0 0 0 0 0 2241.36 0 0 1765.72 0 0 0 -1652.35 0 0 0 0 0 0 0 0.08 0 0 0 0 0 0 0 1204.95 0 0 0 0 0 0 0 -981.552 
0 727.943 1427.88 0 0 0 0 0 0 -494.171 0 1239.43 0 0 0 0 0 0 0 0 0 0 0 0 0 0 2355.49 0 0 0 0 0 666.753 0 0 0 0 0 824.686 0 0 0 0 0 0 2137.44 0 0 0 0 0 0 0 0 0 0 0 0.05 0 0 0 0 2332.3 -1063.65 0 -1144.83 0 0 941.267 0 0 -1583.38 0 
0 0 926.618 0 0 0 0 -173.727 0 0 0 0 0 0 -623.875 0 0 -1116.29 0 434.66 0 0 0 0 0 0 0 0 0 0 0 0 0 0 0 0 1725.29 0 0 0 0 0 0 0 579.623 0 0 0 1927.02 0 0 0 0 0 0 0 0 0 0.07 210.654 0 0 -2067.71 0 0 0 0 0 0 0 1068.07 0 0 
1190.76 0 0 0 0 0 0 0 2431.49 0 0 0 0 0 0 0 0 0 0 0 0 0 0 0 0 0 0 0 0 0 0 0 0 0 0 0 0 0 0 0 0 0 0 0 0 0 0 0 0 0 0 0 0 0 0 -100.177 0 0 1689.43 0.07 0 0 0 -2108.45 0 -688.879 0 0 0 0 0 0 0 
-738.624 0 0 0 0 0 0 0 0 734.809 0 0 0 0 0 0 0 0 0 0 0 0 0 0 0 0 0 0 0 0 0 0 0 0 0 0 0 0 0 0 0 0 0 0 0 0 0 0 1890.85 -453.124 0 0 2173.6 1907.94 0 0 0 0 0 0 0.03 0 0 0 0 966.14 -889.081 0 0 0 0 0 0 
0 0 0 0 0 0 2001.33 0 0 0 0 1160.85 0 0 0 0 0 0 0 0 0 0 1485.41 0 0 0 0 -1513.49 0 0 0 0 2307.58 0 0 0 0 0 0 0 0 78.2037 895.337 0 0 0 0 0 0 0 0 1245.08 2410.43 0 0 0 0 0 0 0 0 0.07 0 0 0 0 0 515.381 0 1556.52 0 0 0 
0 0 0 0 -729.316 0 0 0 0 0 0 0 0 -1185.72 0 0 0 0 0 0 -1671.42 0 0 0 0 0 0 0 0 0 11.6733 -968.734 227.134 0 0 0 -857.952 584.048 1499.76 0 0 0 0 0 0 0 0 997.726 1845.07 0 0 0 0 0 0 0 0 1282.16 1223.41 0 0 0 0.08 0 2208.24 0 0 0 -172.353 0 0 0 0 
0 1306.88 0 0 0 0 0 0 0 0 1656.77 0 0 0 0 0 0 -155.721 0 0 0 0 0 0 0 0 0 0 0 2282.1 -1423.92 0 996.048 0 0 0 0 0 0 0 0 1557.28 0 0 0 0 0 0 0 0 0 0 0 -1129.57 0 0 0 2355.04 0 1194.27 0 0 0 0.02 0 0 0 0 0 -238.273 0 0 0 
0 0 0 0 0 0 0 0 0 0 0 0 0 0 0 0 2485.2 0 0 0 0 0 0 0 0 0 0 0 0 0 0 0 0 668.889 0 0 0 0 0 0 0 0 2274.77 0 0 0 0 0 0 0 0 0 0 0 0 0 -2385.4 0 0 0 0 0 -1685.46 0 0.01 0 548.952 0 0 1520.05 0 0 0 
0 0 0 0 0 0 1562.93 0 0 1406.37 0 0 0 0 0 0 0 0 0 0 0 0 0 0 -405.82 0 1818.06 0 0 0 0 0 0 0 0 0 0 0 0 1603.21 -2070.3 0 0 0 0 0 0 0 0 0 0 0 0 0 0 0 0 1277.73 0 -1804.33 -1612.67 0 0 0 0 0.04 0 0 0 0 0 0 0 
0 0 0 0 0 0 0 0 0 0 0 0 0 0 0 0 2335.05 0 0 0 0 0 0 0 0 0 0 0 0 0 0 1385.46 0 162.893 0 -907.392 0 0 0 0 0 -213.553 -344.02 0 0 0 0 0 0 0 0 0 0 0 2221.06 0 0 0 0 0 1397.37 0 0 0 -945.845 0 0.04 0 0 0 785.47 0 0 
0 0 0 0 0 2099.9 0 0 1455.2 0 0 1064.56 0 0 0 -407.651 0 0 0 640.812 412.992 -2060.53 0 0 0 0 0 0 0 0 0 0 0 0 0 0 0 0 0 0 0 0 0 0 0 0 0 0 0 0 0 0 0 0 0 0 0 0 0 0 0 654.241 0 0 0 0 0 0.05 -193.564 0 0 0 0 
0 0 0 0 0 0 2368.62 0 2208.4 0 0 0 0 0 2179.56 0 0 0 0 0 0 0 0 0 0 0 0 -919.294 0 -2010.64 0 0 -597.018 0 0 0 0 0 0 0 1625.64 0 0 1848.43 0 0 0 0 0 0 0 0 0 0 0 0 0 881.756 0 0 0 0 1416.59 0 0 0 0 -1708.96 0.03 0 0 0 0 
0 0 0 0 0 0 0 0 0 0 0 0 0 0 0 0 0 0 0 0 0 -166.707 0 -925.092 0 0 0 0 0 0 0 0 0 0 0 0 0 0 0 0 0 0 0 0 -2335.51 0 2356.87 0 0 0 0 0 0 525.3 0 0 0 0 0 0 0 1517.61 0 1819.74 -841.777 0 0 0 0 0.07 0 0 0 
0 0 0 -1885.36 0 0 0 1665.78 0 0 0 0 0 0 0 -1572.54 0 0 0 -692.083 0 0 2307.43 0 0 0 0 0 0 -134.205 0 0 0 0 0 0 0 1915.11 0 0 0 0 1511.51 0 0 1435.21 0 0 0 0 0 0 0 0 2328.64 0 0 0 -1140.4 0 0 0 0 0 0 0 -1624.88 0 0 0 0.09 0 0 
0 1878.95 0 0 0 0 0 0 0 0 -1565.52 0 0 0 0 0 2464.45 0 0 0 0 0 0 0 0 -1882.31 0 0 0 0 0 0 0 0 -1750.01 0 0 0 0 0 0 0 0 0 0 0 0 0 0 0 0 0 0 0 2142.48 446.715 0 1967.6 0 0 0 0 0 0 0 0 0 0 0 0 0 0.09 0 
0 0 1597.57 0 0 2371.21 0 0 0 0 0 0 0 0 0 0 0 -1403.32 -80.6452 2324.52 0 0 0 0 0 0 0 0 0 0 0 0 0 0 0 0 0 121.387 -725.044 0 -1313.75 0 0 0 0 0 0 0 0 0 279.473 0 0 0 0 0 -536.286 0 0 0 0 0 0 0 0 0 0 0 0 0 0 0 0.05 
