*Vertices 35
*Matrix 
0.01 0 0 0 0 0 0 0 0 0 0 1498.23 0 0 0 -666.753 0 0 -951.796 0 0 0 0 0 0 0 881.909 0 0 0 2430.57 0 0 0 0 
0 0.07 0 0 0 752.205 -812.937 0 0 0 0 0 0 2037.19 261.62 568.789 0 0 0 0 0 0 0 0 0 0 186.697 1708.04 0 0 0 0 0 0 0 
0 0 0.09 0 0 -170.522 0 0 0 0 0 523.927 0 0 0 0 0 0 0 0 0 0 0 0 0 2257.23 0 0 290.918 0 -1393.25 2477.42 0 0 0 
0 0 0 0 0 0 0 0 2369.38 0 2258.9 0 0 0 254.295 -1646.09 0 0 0 0 0 841.014 652.104 0 0 635.319 2309.26 0 0 0 -256.279 0 0 0 0 
0 0 0 0 0.02 0 1153.83 0 0 0 0 128.712 -1418.88 0 0 0 0 -850.78 0 0 228.202 1421.32 0 0 1350.06 0 0 0 0 903.882 0 -2277.83 0 0 0 
0 1081.5 -1158.41 0 0 0.07 0 1854.99 897.473 0 0 1695.23 0 2125.54 0 0 0 0 -1545.69 -2312.16 0 0 0 0 0 0 0 0 0 0 0 0 0 0 0 
0 570.772 0 0 755.257 0 0.09 0 0 0 0 0 32.7311 0 -1422.85 -546.358 -648.442 0 0 -300.226 1754.43 0 475.097 0 0 -2052.9 0 1281.55 1840.95 2216.18 622.959 0 0 0 0 
0 0 0 0 0 -2229.61 0 0.06 0 0 0 2009.87 2060.84 0 0 0 0 0 0 -1841.41 0 0 0 0 1988.66 0 1506.01 -769.143 0 0 0 0 0 0 -2186.73 
0 0 0 177.541 0 -30.2896 0 0 0.04 -1738.11 0 0 0 1288.11 0 0 0 0 0 176.473 0 774.331 0 -337.458 1396.15 0 1001.54 1353.88 0 0 0 0 0 -971.48 0 
0 0 0 0 0 0 0 0 -2157.89 0.08 2320.7 0 0 0 0 0 0 0 0 -633.03 692.694 0 0 497.223 0 0 778.146 0 -127.033 1356.01 0 0 0 0 0 
0 0 0 2240.75 0 0 0 0 0 1535.16 0.07 0 2010.64 2242.58 0 1459.93 0 0 0 0 -1409.73 0 0 0 0 2288.51 0 92.2422 0 0 0 -1688.51 1703.92 0 0 
2302.09 0 223.014 0 1464.66 1238.52 0 2008.19 0 0 0 0.03 0 -1259.42 0 0 0 0 0 0 1787.24 0 0 -187.918 0 -2016.13 855.663 0 0 2247.92 0 0 0 0 0 
0 0 0 0 2392.57 0 1140.4 1370.36 0 0 -1737.95 0 0.06 0 0 0 0 0 0 -1475.19 1756.72 0 -490.967 1742.38 0 0 0 0 -1804.79 926.16 0 0 0 0 0 
0 2214.8 0 0 0 -550.172 0 0 2121.57 0 1723.46 -769.295 0 0.08 991.012 0 0 1022.9 1406.98 0 -1951.58 0 0 0 0 1968.67 0 0 0 887.249 -1811.5 0 0 0 0 
0 1469.39 0 1761.6 0 0 1514.1 0 0 0 0 0 0 166.402 0.04 -1984.08 0 2387.54 1208.3 0 0 0 0 0 -377.285 1393.55 0 0 0 0 0 0 0 0 0 
1064.26 -2286.98 0 781.35 0 0 1276.97 0 0 0 1488.77 0 0 0 2302.7 0.02 0 0 0 0 1710.79 -804.239 0 0 0 0 2386.47 1315.27 -1356.47 0 0 0 1830.12 0 0 
0 0 0 0 0 0 2487.03 0 0 0 0 0 0 0 0 0 0.01 67.0644 -223.014 0 0 0 1581.09 0 1317.71 0 0 0 1066.7 0 0 0 0 -1943.95 0 
0 0 0 0 1359.37 0 0 0 0 0 0 0 0 444.731 -858.867 0 1163.29 0.06 0 -1282.31 0 0 1004.9 0 0 0 -484.558 915.021 0 0 -212.638 0 0 0 0 
370.876 0 0 0 0 2238.91 0 0 0 0 0 0 0 -2336.73 -432.676 0 -530.183 0 0.03 228.202 -266.808 0 0 0 0 -41.1237 0 0 0 0 2391.35 0 0 0 -1067.31 
0 0 0 0 0 214.469 -2191.15 438.017 1461.15 699.713 0 0 1454.89 0 0 0 0 751.595 1322.6 0.02 0 -1035.87 0 0 0 2447.36 0 0 0 -1751.23 0 0 0 0 0 
0 0 0 0 -2195.12 0 2497.86 0 0 1061.82 2353.66 -366.756 2251.73 601.596 0 -897.32 0 0 -1191.52 0 0.06 0 0 0 0 0 0 2218.16 767.006 2427.52 0 0 0 -2403.26 0 
0 0 0 1587.8 1915.11 0 0 0 -1368.98 0 0 0 0 0 0 1418.12 0 0 0 109.79 0 0 0 0 0 0 0 0 0 0 0 0 0 0 0 
0 0 0 -533.845 0 0 1832.87 0 0 0 0 0 -386.135 0 0 0 -1611.76 1329.62 0 0 0 0 0.01 -647.984 0 0 0 2306.36 0 0 -1053.27 1806.01 0 0 0 
0 0 0 0 0 0 0 0 2212.67 -1282.92 0 29.0689 2339.47 0 0 0 0 0 0 0 0 0 2498.93 0.07 -1972.18 -257.653 0 652.562 0 0 0 0 0 0 0 
0 0 0 0 1054.8 0 0 -1478.09 2168.72 0 0 0 0 0 1411.4 0 -470.519 0 0 0 0 0 0 -971.48 0 0 -856.12 1275.75 0 -302.515 2313.38 0 0 -786.843 0 
0 0 -36.0881 -1157.95 0 0 314.112 0 0 0 -1192.13 2176.2 0 1508.91 -461.669 0 0 0 -2240.9 2137.14 0 0 0 2316.43 0 0.02 0 0 0 0 0 0 0 0 0 
2318.87 960.341 0 -683.844 0 0 0 258.263 2390.9 1333.43 0 -193.411 0 0 0 1500.21 0 1745.28 0 0 0 0 0 0 -300.989 0 0.07 0 0 -1388.06 750.679 0 587.863 0 0 
0 -951.491 0 0 0 0 736.793 350.734 382.321 0 662.023 0 0 0 0 1831.64 0 2340.69 0 0 239.952 0 2004.23 -2006.21 -688.574 0 0 0.04 0 0 0 0 0 0 0 
0 0 -147.328 0 0 0 2118.52 0 0 1802.35 0 0 532.014 0 0 564.058 2377.32 0 0 0 1956.92 0 0 0 0 0 0 0 0.01 712.683 0 0 0 0 0 
0 0 0 0 382.778 0 1532.87 0 0 -1913.59 0 1550.11 593.204 -725.654 0 0 0 0 0 225.761 1427.27 0 0 0 -203.787 0 471.282 0 434.507 0.09 0 0 0 0 0 
-2375.64 0 -284.204 -1263.24 0 0 1711.25 0 0 0 0 0 0 527.131 0 0 0 518.281 2377.32 0 0 0 -133.595 0 2457.12 0 430.845 0 0 0 0.09 0 0 0 0 
0 0 1671.27 0 -1338.62 0 0 0 0 0 2081.29 0 0 0 0 0 0 0 0 0 0 0 -499.207 0 0 0 0 0 0 0 0 0.06 0 0 0 
0 0 0 0 0 0 0 0 0 0 -438.78 0 0 0 0 2108.14 0 0 0 0 0 0 0 0 0 0 -770.363 0 0 0 0 0 0.06 0 0 
0 0 0 0 0 0 0 0 647.374 0 0 0 0 0 0 0 -1975.23 0 0 0 485.321 0 0 0 1709.88 0 0 0 0 0 0 0 0 0.06 0 
0 0 0 0 0 0 0 2287.13 0 0 0 0 0 0 0 0 0 0 817.209 0 0 0 0 0 0 0 0 0 0 0 0 0 0 0 0.01 
