*Vertices 58
*Matrix 
0.02 -1598.48 0 2272.94 0 0 0 2114.86 0 0 0 0 0 1792.73 1861.86 0 0 0 0 0 0 749.306 -439.848 421.842 0 1361.81 0 0 -284.967 0 0 -1067.77 0 0 0 0 0 0 0 0 0 0 0 0 0 0 0 0 0 -878.399 0 0 -1627.17 0 0 0 0 0 
444.121 0.05 -625.706 0 0 0 0 0 0 0 0 0 -1134.6 0 0 930.586 0 0 0 2498.32 0 0 0 0 0 1044.11 -1013.6 0 0 0 0 0 0 0 1641.97 0 0 0 0 0 0 0 0 0 -2.21259 0 0 0 0 0 0 2295.68 0 0 0 0 0 0 
0 2107.38 0.03 0 0 0 0 0 0 0 -1717.05 0 0 0 -1619.39 0 0 1379.06 0 0 0 -115.589 0 0 2218.01 733.131 0 0 2117.76 0 0 -326.624 447.935 0 0 0 1843.7 0 0 0 -1072.65 0 0 1920 -33.9518 0 0 0 115.131 0 -76.6778 0 0 -1551.03 0 0 0 0 
-1056.47 0 0 0.02 0 0 0 0 0 1470.61 0 0 0 0 0 0 0 0 0 0 0 0 0 0 0 534.303 0 0 0 0 0 1434.75 -1559.11 0 0 0 2380.52 0 0 0 0 0 0 0 0 0 0 0 0 0 0 0 0 0 0 0 0 0 
0 0 0 0 0.04 98.1933 0 1889.93 0 0 0 0 0 0 0 244.835 0 0 0 0 0 0 0 1961.65 0 0 0 0 -441.984 0 0 -343.257 0 0 1840.65 0 0 0 0 -2089.22 -1099.05 0 0 0 0 0 0 -1125.45 0 0 0 0 0 -613.651 0 0 0 0 
0 0 0 0 -306.482 0.03 0 0 2087.24 -652.867 0 0 0 2113.79 0 0 0 -1861.4 0 0 0 0 0 2201.38 -636.692 900.83 -939.894 0 0 966.445 0 0 0 0 0 0 0 0 0 0 0 0 0 0 0 0 1414.46 0 0 0 0 0 0 0 0 0 0 0 
0 0 0 0 0 0 0.09 0 2067.09 0 0 2137.9 0 0 -976.821 0 1231.8 0 -1594.97 1195.03 -1362.88 0 0 0 0 2481.08 0 0 0 0 0 0 0 2216.94 0 0 0 -1395.08 0 -1595.89 0 0 0 0 0 0 12.5889 0 0 0 0 0 0 0 0 0 0 0 
2454.53 0 0 0 1991.87 0 0 0.04 0 238.273 1966.99 0 0 0 914.411 693.457 0 0 0 0 0 0 0 0 0 0 -1690.19 0 0 0 0 0 0 1620.15 -57.1459 0 1793.04 2433.16 0 0 0 0 0 1261.56 0 0 0 0 0 0 0 0 0 0 0 0 0 0 
0 0 0 0 0 -76.8303 -2298.58 0 0.03 0 1271.48 0 1556.06 -966.445 0 0 0 0 304.956 0 0 1608.86 0 1240.65 -1065.17 0 0 0 2299.65 0 0 2340.24 0 0 0 0 0 0 0 0 0 0 1120.72 0 0 0 0 0 0 0 0 0 0 0 0 -1844.46 0 0 
0 0 0 2313.99 0 2185.66 0 1887.49 0 0.04 1280.63 1165.43 0 0 0 2471.62 0 0 0 0 2283.32 -1402.55 0 0 0 -1516.39 0 0 0 0 96.2096 0 0 -925.398 0 0 0 0 0 0 0 0 0 0 0 -1924.73 0 0 -2400.36 0 0 0 0 0 0 0 0 -1489.84 
0 0 911.206 0 0 0 0 1319.7 -809.427 1338.92 0.03 0 -822.245 0 2315.36 -242.088 0 0 0 0 0 467.925 0 0 0 0 0 0 0 0 -585.116 0 0 0 453.276 0 0 1398.89 0 0 -2200.92 0 903.577 0 0 0 0 234.458 0 0 0 0 0 0 0 0 0 -1958.6 
0 0 0 0 0 0 1331.14 0 0 1279.26 0 0.06 2349.39 0 0 0 0 0 -1368.68 2078.39 -344.478 0 0 -2469.63 0 0 0 685.675 0 0 0 0 0 0 0 2311.4 0 0 0 0 0 0 0 0 0 0 0 0 -1763.59 0 0 0 0 0 0 0 0 0 
0 1164.2 0 0 0 0 0 0 231.559 0 -1185.72 -374.538 0.01 0 0 535.981 536.897 521.485 0 0 419.248 -640.812 1935.71 0 0 0 796.152 0 0 0 0 0 -1021.84 0 0 -1295.43 0 0 1749.85 0 0 0 1042.74 1666.84 0 0 0 0 0 0 0 0 0 0 0 0 0 0 
834.758 0 0 0 0 -303.125 0 0 -159.23 0 0 0 0 0.03 0 0 0 0 0 0 0 -118.641 -1075.7 0 0 0 795.083 0 0 0 2472.99 0 0 0 0 0 0 0 0 0 0 0 0 0 0 965.682 0 0 0 0 0 0 1356.17 0 0 1731.85 0 0 
377.59 0 1988.81 0 0 0 141.987 1378.9 0 0 -428.251 0 0 0 0.08 0 0 0 0 2406.31 1711.25 0 0 0 -1844.61 2497.71 0 0 0 0 0 0 0 0 -85.3755 0 0 0 0 0 0 0 0 0 0 0 0 0 0 1524.02 0 0 0 0 0 0 0 0 
0 2367.85 0 0 2142.02 0 0 2246.85 0 -505.615 830.18 0 -1324.43 0 0 0.08 0 -1984.08 0 0 -1259.42 0 0 0 1347.32 0 0 0 0 0 0 0 0 0 0 1724.83 0 1837.14 0 0 0 0 0 0 0 0 2023.3 0 -139.088 0 0 0 0 0 0 0 0 0 
0 0 0 0 0 0 1757.33 0 0 0 0 0 -1516.24 0 0 0 0.01 1152.61 2045.58 0 0 0 0 321.741 0 0 0 0 0 0 0 0 0 0 1856.21 0 0 0 0 0 0 0 0 0 0 0 2035.36 -2257.84 0 0 0 0 0 0 0 0 0 1572.54 
0 0 2363.58 0 0 -293.512 0 0 0 0 0 0 2304.53 0 0 1383.33 -1585.82 0.08 -1135.36 0 0 0 0 0 504.395 0 0 -1227.68 0 2330.62 0 0 0 0 775.857 0 0 359.89 -1379.51 0 0 0 0 0 0 0 0 0 0 0 0 0 0 0 0 0 0 0 
0 0 0 0 0 0 898.541 0 543.458 0 0 1230.58 0 0 0 0 -275.964 1847.97 0.09 0 0 0 0 -24.3385 0 -2304.07 0 0 0 0 534.15 0 0 0 2426.76 0 0 -478.301 0 0 0 0 1212.58 -1329.77 0 0 0 0 -1142.23 0 0 0 0 0 0 0 0 0 
0 716.346 0 0 0 0 1551.18 0 0 0 0 2105.85 0 0 -341.121 0 0 0 0 0.04 0 545.747 0 0 1077.99 0 0 0 0 0 0 934.248 0 0 0 0 0 0 0 0 0 0 0 0 0 0 0 0 0 0 0 0 0 0 0 0 0 0 
0 0 0 0 0 0 -1132.16 0 0 177.847 0 2426.3 585.574 0 -652.409 -395.749 0 0 0 0 0.01 1457.64 0 0 0 0 0 0 0 0 0 0 2178.49 0 -397.122 1814.4 2100.67 0 0 -1968.98 0 1959.82 0 0 0 0 0 0 0 2276.3 0 0 153.279 -764.565 0 0 0 0 
2085.56 0 518.433 0 0 0 0 0 2446.13 980.483 -93.9207 0 1814.86 1271.02 0 0 0 0 0 -1461.15 1509.06 0 0 2409.97 -2037.49 0 0 0 134.968 0 0 1224.02 0 0 -787.759 0 0 0 0 0 0 0 0 0 0 0 0 0 0 0 0 -1989.27 0 0 0 0 0 0 
-409.635 0 0 0 0 0 0 0 0 0 0 0 2452.39 1528.6 0 0 0 0 0 0 0 0 0.06 1809.52 2349.85 -753.121 0 796.152 0 -389.95 -46.7696 0 2421.72 0 0 0 0 0 -1878.95 0 0 0 -1537.9 0 0 0 0 0 0 -1516.24 0 0 0 0 0 1441.31 2238 0 
-503.784 0 0 0 2410.73 2385.25 0 0 859.478 0 0 207.755 0 0 0 0 1736.27 0 -285.424 0 0 65.2333 -1952.5 0.01 -335.475 0 -616.245 0 -27.3904 0 -362.941 0 0 0 0 0 0 0 0 0 0 0 0 0 0 0 0 0 0 0 0 0 0 0 -1351.44 0 0 0 
0 0 852.306 0 0 38.6822 0 0 -1589.79 0 0 0 0 0 1910.23 1450.01 0 -2252.49 0 -315.485 0 -433.897 -605.564 129.627 0.06 0 0 0 0 1288.57 0 638.218 0 0 2255.39 0 480.285 0 0 0 0 0 0 0 0 2088.31 0 0 -1909.77 0 0 0 0 0 0 0 0 0 
680.486 579.165 1572.24 2210.38 0 -652.104 2048.78 0 0 1048.84 0 0 0 0 1119.8 0 0 0 -1405.45 0 0 0 -821.329 0 0 0.03 0 0 0 -1198.39 1338.92 -2486.57 0 0 1786.63 0 -628.758 0 -256.89 0 0 0 0 0 0 0 0 0 0 0 -1337.7 0 1358.46 0 0 0 -2072.89 0 
0 1721.93 0 0 0 1810.74 0 1700.26 0 0 0 0 843.76 1406.52 0 0 0 0 0 0 0 0 0 1887.19 0 0 0.08 0 0 0 0 0 0 0 0 0 0 -1758.1 0 0 0 0 0 0 -1374.78 0 0 0 0 0 0 0 0 0 2300.26 0 -114.216 2463.38 
0 0 0 0 0 0 0 0 0 0 0 -2460.63 0 0 0 0 0 1198.08 0 0 0 0 1662.72 0 0 0 0 0.05 0 0 0 0 0 0 0 1083.94 0 0 0 0 0 0 0 0 1426.05 0 0 843.913 0 0 -1773.05 0 0 -809.275 0 1590.7 0 0 
-2144.31 0 2325.13 0 2045.88 0 0 0 1221.73 0 0 0 0 0 0 0 0 0 0 0 0 538.118 0 -2209.16 0 0 0 0 0.04 0 0 441.984 0 0 0 0 0 0 0 0 0 1129.11 0 0 0 0 0 0 0 0 0 0 0 0 0 0 -1633.73 -1650.82 
0 0 0 0 0 734.657 0 0 0 0 0 0 0 0 0 0 0 -624.943 0 0 0 0 2148.12 0 2411.8 1456.88 0 0 0 0.08 0 0 -2208.4 0 1752.75 0 1639.84 0 0 -832.011 0 -1795.18 0 0 0 0 0 0 0 0 0 0 0 0 0 0 0 0 
0 0 0 0 0 0 0 0 0 -2269.28 1294.21 0 0 -2125.54 0 0 0 0 2226.55 0 0 0 997.726 849.864 0 1761.6 0 0 0 0 0.08 0 1627.63 0 0 0 0 0 0 0 0 0 0 0 0 -849.406 0 0 0 0 -1070.51 2016.74 0 1662.72 0 0 -1485.87 -904.492 
2438.51 0 -2302.85 912.885 -700.018 0 0 0 -778.451 0 0 0 0 0 0 0 0 0 0 2311.09 0 393.765 0 0 341.884 1887.95 0 0 -1563.84 0 0 0.06 0 0 2052.9 0 0 0 0 0 0 0 0 0 0 1838.82 0 0 0 -598.544 0 0 0 0 0 0 0 0 
0 0 -1103.63 1126.51 0 0 0 0 0 0 0 0 1696.91 0 0 0 0 0 0 0 -312.128 0 234.458 0 0 0 0 0 0 1460.08 -362.636 0 0.05 0 0 0 0 0 0 0 0 0 0 0 0 0 0 0 0 0 0 0 0 0 0 0 0 0 
0 0 0 0 0 0 -318.69 768.075 0 1416.9 0 0 0 0 0 0 0 0 0 0 0 0 0 0 0 0 0 0 0 0 0 0 0 0.06 0 2362.06 0 0 2034.44 0 0 0 -686.132 0 0 0 0 0 0 0 0 0 0 0 2409.05 0 2132.71 0 
0 2171.62 0 0 -1682.71 0 0 1572.39 0 0 2124.77 0 0 0 118.336 0 237.815 1942.58 2038.1 0 1528.44 -1376.77 0 0 1912.98 945.845 0 0 0 -693.915 0 1455.2 0 0 0.06 0 0 0 0 0 0 1681.49 0 0 0 0 0 0 2102.95 0 -298.395 0 0 0 0 0 0 0 
0 0 0 0 0 0 0 0 0 0 0 2242.73 425.504 0 0 2441.71 0 0 0 0 1206.47 0 0 0 0 0 0 1200.52 0 0 0 0 0 -980.026 0 0.05 -1167.87 0 0 0 160.756 0 0 357.753 0 -1880.47 0 0 0 0 0 490.051 0 0 0 0 0 0 
0 0 600.223 1995.83 0 0 0 -759.377 0 0 0 0 0 0 0 0 0 0 0 0 -407.041 0 0 0 1854.84 1506.16 0 0 0 -862.224 0 0 0 0 0 2060.08 0.04 0 2185.51 0 0 -2453.31 0 0 0 0 0 0 0 0 0 581.301 279.778 0 0 0 0 -2491.91 
0 0 0 0 0 0 2263.33 1142.99 0 0 1454.74 0 0 0 0 291.375 0 2205.34 -76.6778 0 0 0 0 0 0 0 -1134.3 0 0 0 0 0 0 0 0 0 0 0.09 0 0 133.595 0 0 0 0 0 0 1695.84 0 -1103.63 0 0 0 0 0 0 0 0 
0 0 0 0 0 0 0 0 0 0 0 0 1471.37 0 0 0 0 1209.37 0 0 0 0 538.728 0 0 132.527 0 0 0 0 0 0 0 829.569 0 0 103.229 0 0.03 0 0 0 0 0 0 1793.04 0 0 0 0 0 0 0 0 0 0 0 0 
0 0 0 0 -1421.02 0 2196.34 0 0 0 0 0 0 0 0 0 0 0 0 0 1365.63 0 0 0 0 0 0 0 0 -35.1726 0 0 0 0 0 0 0 0 0 0.07 0 0 0 0 0 0 0 0 0 0 0 0 0 0 0 0 0 0 
0 0 1917.1 0 280.389 0 0 0 0 0 -1656.93 0 0 0 0 0 0 0 0 0 0 0 0 0 0 0 0 0 0 0 0 0 0 0 0 2066.79 0 1121.63 0 0 0.04 -2316.28 105.365 0 0 0 0 0 0 0 0 1152.61 0 0 0 -10.6052 0 0 
0 0 0 0 0 0 0 0 0 0 0 0 0 0 0 0 0 0 0 0 1907.03 0 0 0 0 0 0 0 2264.85 -1493.5 0 0 0 0 1038.47 0 -992.996 0 0 0 351.802 0.03 0 0 0 0 0 0 0 0 0 0 0 0 0 0 0 0 
0 0 0 0 0 0 0 0 -1049.76 0 2364.65 0 -1844.16 0 0 0 0 0 633.488 0 0 0 2161.7 0 0 0 0 0 0 0 0 0 0 -1776.86 0 0 0 0 0 0 1030.53 0 0 0 0 0 1483.12 0 0 0 0 0 1018.78 0 0 0 0 0 
0 0 1804.79 0 0 0 0 1095.08 0 0 0 0 1151.23 0 0 0 0 0 -1594.52 0 0 0 0 0 0 0 0 0 0 0 0 0 0 0 0 -999.863 0 0 0 0 0 0 0 0.04 0 0 0 0 0 0 0 0 0 0 0 878.704 0 -1513.95 
0 363.857 2487.49 0 0 0 0 0 0 0 0 0 0 0 0 0 0 0 0 0 0 0 0 0 0 0 85.8333 -2028.64 0 0 0 0 0 0 0 0 0 0 0 0 0 0 0 0 0.08 0 0 0 1104.85 0 0 0 0 0 0 0 0 0 
0 0 0 0 0 0 0 0 0 -356.838 0 0 0 1781.75 0 0 0 0 0 0 0 0 0 0 -16.4037 0 0 0 0 0 1831.64 1383.02 0 0 0 2310.94 0 0 -1804.79 0 0 0 0 0 0 0.01 1221.12 0 0 0 0 0 0 0 0 0 0 0 
0 0 0 0 0 -256.279 1627.02 0 0 0 0 0 0 0 0 2489.62 561.464 0 0 0 0 0 0 0 0 0 0 0 0 0 0 0 0 0 0 0 0 0 0 0 0 0 1599.4 0 0 485.626 0.03 0 0 0 0 0 0 0 -947.371 0 0 0 
0 0 0 0 721.229 0 0 0 0 0 2372.43 0 0 0 0 0 1566.59 0 0 0 0 0 0 0 0 0 0 -1760.38 0 0 0 0 0 0 0 0 0 1101.49 0 0 0 0 0 0 0 0 0 0.08 0 923.261 0 0 0 2322.84 0 0 1170.46 0 
0 0 -2121.72 0 0 0 0 0 0 2354.27 0 390.713 0 0 0 1302 0 0 1664.86 0 0 0 0 0 1794.56 0 0 0 0 0 0 0 0 0 633.793 0 0 0 0 0 0 0 0 0 -1441.62 0 0 0 0.08 0 0 0 0 0 0 0 0 0 
1301.23 0 0 0 0 0 0 0 0 0 0 0 0 0 1577.73 0 0 0 0 0 2031.08 0 1016.65 0 0 0 0 0 0 0 0 2269.43 0 0 0 0 0 179.83 0 0 0 0 0 0 0 0 0 2144 0 0.08 2495.88 0 0 0 0 2267.75 0 0 
0 0 1168.32 0 0 0 0 0 0 0 0 0 0 0 0 0 0 0 0 0 0 0 0 0 0 -945.997 0 903.424 0 0 302.515 0 0 0 -305.414 0 0 0 0 0 0 0 0 0 0 0 0 0 0 -139.241 0.08 0 0 0 0 0 0 0 
0 -1591.77 0 0 0 0 0 0 0 0 0 0 0 0 0 0 0 0 0 0 0 -305.567 0 0 0 0 0 0 0 0 -1459.01 0 0 0 0 2340.39 1656.77 0 0 0 1864.3 0 0 0 0 0 0 0 0 0 0 0.06 0 0 -1481.14 0 0 0 
2142.78 0 0 0 0 0 0 0 0 0 0 0 0 -2313.99 0 0 0 0 0 0 -676.214 0 0 0 0 2324.06 0 0 0 0 0 0 0 0 0 0 -13.5044 0 0 0 0 0 1996.6 0 0 0 0 0 0 0 0 0 0.03 0 0 0 0 0 
0 0 2143.24 0 888.318 0 0 0 0 0 0 0 0 0 0 0 0 0 0 0 -1105.61 0 0 0 0 0 0 1503.88 0 0 2000.41 0 0 0 0 0 0 0 0 0 0 0 0 0 0 0 0 -496.46 0 0 0 0 0 0.09 0 0 0 0 
0 0 0 0 0 0 0 0 0 0 0 0 0 0 0 0 0 0 0 0 0 0 0 -2356.11 0 0 2355.65 0 0 0 0 0 0 -224.082 0 0 0 0 0 0 0 0 0 0 0 0 1206.47 0 0 0 0 1195.03 0 0 0.02 0 0 2227.16 
0 0 0 0 0 0 0 0 2366.63 0 0 0 0 -1895.73 0 0 0 0 0 0 0 0 1148.95 0 0 0 0 -1728.95 0 0 0 0 0 0 0 0 0 0 0 0 -566.195 0 0 -82.4763 0 0 0 0 0 2165.52 0 0 0 0 0 0 0 0 
0 0 0 0 0 0 0 0 0 0 0 0 0 0 0 0 0 0 0 0 0 0 -1220.82 0 0 2285.61 97.2777 0 -1193.96 0 -2007.74 0 0 2073.66 0 0 0 0 0 0 0 0 0 0 0 0 0 -589.999 0 0 0 0 0 0 0 0 0 0 
0 0 0 0 0 0 0 0 0 -2104.63 -1123.46 0 0 0 0 0 196.005 0 0 0 0 0 0 0 0 0 2138.05 0 2228.84 0 2482.45 0 0 0 0 0 -1136.13 0 0 0 0 0 0 -95.1415 0 0 0 0 0 0 0 0 0 0 1348.54 0 0 0.09 
