*Vertices 44
*Matrix 
0.06 0 0 0 0 0 2401.12 0 0 0 0 0 0 0 1226.77 0 0 0 0 -488.067 0 0 -450.682 0 0 0 -857.494 0 -568.331 0 2463.07 0 1499.91 0 0 0 0 0 0 0 -477.996 0 0 0 
0 0.01 0 0 276.879 0 -221.03 0 0 0 0 0 2223.65 -1921.83 0 0 1675.54 -876.72 1100.12 0 0 -702.765 -866.497 0 0 0 0 1924.73 0 0 0 0 0 0 0 0 0 0 -189.596 -161.214 1064.56 0 -1457.64 0 
0 0 0.01 0 0 0 1799.75 0 0 0 0 0 0 0 0 -1603.06 1161.92 -1369.14 0 0 0 2482.3 -945.082 0 0 0 0 0 0 0 0 -129.17 0 0 0 0 0 0 0 0 0 0 0 0 
0 0 0 0.08 0 0 0 0 0 1116.75 0 0 0 0 0 0 0 0 0 1879.86 0 208.67 0 0 0 0 0 0 0 0 0 0 0 0 2009.72 0 0 0 0 0 0 -1614.96 0 671.636 
0 987.503 0 0 0.06 0 0 0 0 -485.015 -1676.92 0 0 -65.3859 0 99.414 906.476 0 1562.01 0 0 965.224 0 -1172.9 0 0 687.506 0 0 0 0 0 0 0 0 0 0 0 0 0 0 0 0 0 
0 0 0 0 0 0.04 496.765 1572.85 0 1889.78 0 0 0 0 0 0 -2045.27 0 0 0 0 0 0 0 0 0 0 0 0 0 2017.81 0 0 305.109 0 0 0 0 996.811 0 0 -12.8941 0 -2230.37 
1748.48 308.618 2038.56 0 0 1315.73 0.03 0 1420.87 0 0 -1687.75 0 0 0 0 0 668.279 0 48.4481 1648.08 2365.11 0 0 -1972.49 0 0 0 1381.34 0 0 0 0 0 0 0 0 0 0 0 0 0 0 0 
0 0 0 0 0 -1359.52 0 0.09 0 0 0 0 2118.67 0 0 2210.53 0 0 -2156.36 0 -947.066 0 0 0 0 0 0 1653.42 0 0 0 0 0 -110.858 0 0 0 0 0 0 0 0 0 0 
0 0 0 0 0 0 501.648 0 0.04 0 0 -707.648 0 2055.04 0 -1435.36 0 0 1835.31 0 1851.33 -1669.9 0 0 0 0 0 0 0 0 0 0 0 0 -173.574 0 0 0 0 0 0 0 0 0 
0 0 0 -651.952 2103.41 934.706 0 0 0 0.03 0 0 802.713 0 1967.45 -2403.71 0 0 0 0 -2411.8 2315.21 0 522.401 0 0 0 0 0 0 0 0 -410.855 0 0 0 0 0 0 0 0 0 0 0 
0 0 0 0 1500.37 0 0 0 0 0 0.07 -574.435 0 0 0 1492.13 0 0 0 0 1528.14 2339.63 0 0 0 0 0 0 -633.183 0 1972.33 0 0 0 0 0 0 2025.28 0 0 0 0 0 -627.384 
0 0 0 0 0 0 2411.04 0 -1281.55 0 46.0067 0.04 0 0 0 0 0 1570.56 0 0 0 0 -477.081 0 0 1813.94 1781.75 0 0 -266.503 0 0 2220.45 0 -1395.99 0 0 0 0 0 0 0 0 0 
0 -2125.84 0 0 0 0 0 1544.77 0 -357.601 0 0 0.09 0 1278.5 95.9044 0 1892.07 0 1091.88 0 0 0 0 0 0 0 0 0 0 0 2265.77 0 0 0 0 0 0 0 -1123.77 0 2456.66 -1995.99 0 
0 1770.61 0 0 -1930.83 0 0 0 2019.49 0 0 0 0 0.07 0 0 0 1484.5 0 1807.38 0 0 0 0 -504.852 1919.84 0 0 0 0 0 0 0 0 0 0 0 0 0 0 0 0 0 0 
691.931 0 0 0 0 0 0 0 0 1655.71 0 0 1911.6 0 0.06 0 0 0 0 0 0 0 0 0 0 0 0 0 0 0 0 0 0 0 0 0 0 0 0 2180.32 0 0 0 0 
0 0 452.208 0 2097 0 0 1291.92 251.549 1001.54 -1552.1 0 -294.275 0 0 0.09 0 -1201.28 0 0 1264.76 0 0 0 0 0 0 0 0 0 0 0 0 0 0 0 -640.507 1726.2 -1029.16 0 0 0 0 0 
0 1898.18 -1903.21 0 2038.71 -479.064 0 0 0 0 0 0 0 0 0 0 0.06 0 0 0 0 0 0 0 0 0 0 0 0 0 0 0 2073.2 0 0 0 0 0 0 0 0 0 0 0 
0 1310.24 2288.35 0 0 0 -415.433 0 0 0 0 2312.62 -1330.84 1080.43 0 1376.92 0 0.07 0 0 0 1078.45 0 0 0 0 0 0 0 0 0 0 0 0 0 0 0 0 0 0 0 0 0 1769.39 
0 519.349 0 0 1378.9 0 0 2494.81 602.359 0 0 0 0 0 0 0 0 0 0.07 0 0 0 -1483.58 1587.5 0 0 0 0 0 0 0 0 0 0 2156.67 0 0 0 0 0 0 0 0 0 
2036.42 0 0 2425.53 0 0 458.617 0 0 0 0 0 193.411 -1557.59 0 0 0 0 0 0.07 0 208.975 0 0 0 2258.6 -566.958 0 0 0 0 0 0 0 0 44.7859 0 0 0 0 0 1703.62 0 0 
0 0 0 0 0 0 2334.74 -322.352 1662.11 2071.37 -874.737 0 0 0 0 1756.42 0 0 0 0 0.07 -194.784 0 0 0 0 0 0 0 0 491.577 0 0 0 0 0 0 0 0 -1862.32 0 0 1280.02 0 
0 -1336.48 1004.44 1918.47 2219.84 0 1593.14 0 -1993.24 2308.04 1856.06 0 0 0 0 0 0 2202.14 0 -1412.47 1778.54 0.02 1033.89 0 0 0 0 0 0 0 0 0 0 0 0 0 0 -2370.75 0 0 259.331 0 0 0 
-695.746 1895.43 1381.19 0 0 0 0 0 0 0 0 744.27 0 0 0 0 0 0 -2416.53 0 0 1509.22 0.07 0 0 0 0 0 0 0 0 0 0 0 0 0 0 0 0 0 0 0 0 0 
0 0 0 0 2389.68 0 0 0 0 721.381 0 0 0 0 0 0 0 0 2423.7 0 0 0 0 0.02 0 0 0 1224.17 0 0 0 2488.56 0 0 0 0 0 0 0 0 0 0 0 0 
0 0 0 0 0 0 2003.01 0 0 0 0 0 0 931.043 0 0 0 0 0 0 0 0 0 0 0 0 0 0 0 0 0 0 1707.89 0 0 0 0 -1962.42 0 0 0 0 0 0 
0 0 0 0 0 0 0 0 0 0 0 2228.54 0 -2197.41 0 0 0 0 0 1614.66 0 0 0 0 0 0.08 0 0 0 0 0 1911.76 0 -1872.08 -990.707 0 0 0 0 0 0 0 0 0 
2466.12 0 0 0 376.675 0 0 0 0 0 0 410.245 0 0 0 0 0 0 0 -1433.38 0 0 0 0 0 0 0.06 0 0 0 0 0 0 0 0 0 0 0 0 745.796 0 0 0 0 
0 2111.96 0 0 0 0 0 604.495 0 0 0 0 0 0 0 0 0 0 0 0 0 0 0 2403.56 0 0 0 0.05 0 0 0 0 0 0 0 0 0 0 0 0 0 0 0 0 
-465.941 0 0 0 0 0 780.587 0 0 0 2158.35 0 0 0 0 0 0 0 0 0 0 0 0 0 0 0 0 0 0.04 0 0 1716.59 0 0 0 0 0 0 0 0 0 0 832.316 0 
0 0 0 0 0 0 0 0 0 0 0 -1459.32 0 0 0 0 0 0 0 0 0 0 0 0 0 0 0 0 0 0.04 0 0 0 0 0 2293.54 0 0 0 0 0 0 0 0 
1060.59 0 0 0 0 1065.78 0 0 0 0 2422.48 0 0 0 0 0 0 0 0 0 1083.79 0 0 0 0 0 0 0 0 0 0.03 0 0 0 0 0 0 0 0 0 0 0 0 0 
0 0 579.775 0 0 0 0 0 0 0 0 0 -783.944 0 0 0 0 0 0 0 0 0 0 540.254 0 1788.16 0 0 2327.72 0 0 0.06 0 0 0 0 633.641 0 0 -753.273 0 0 1413.08 0 
-1811.66 0 0 0 0 0 0 0 0 1323.05 0 -578.707 0 0 0 0 2066.48 0 0 0 0 0 0 0 2085.41 0 0 0 0 0 0 0 0 0 0 0 0 0 0 0 0 0 -360.805 0 
0 0 0 0 0 2422.48 0 1146.66 0 0 0 0 0 0 0 0 0 0 0 0 0 0 0 0 0 -1957.69 0 0 0 0 0 0 0 0.01 0 0 -558.26 0 0 0 0 0 0 1508.3 
0 0 0 591.983 0 0 0 0 1033.89 0 0 -1272.7 0 0 0 0 0 0 919.294 0 0 0 0 0 0 2476.96 0 0 0 0 0 0 0 0 0.09 0 0 0 0 0 0 0 0 0 
0 0 0 0 0 0 0 0 0 0 0 0 0 0 0 0 0 0 0 2009.57 0 0 0 0 0 0 0 0 0 1956.47 0 0 0 0 0 0.06 1433.68 0 0 0 0 0 0 0 
0 0 0 0 0 0 0 0 0 0 0 0 0 0 0 1980.88 0 0 0 0 0 0 0 0 0 0 0 0 0 0 0 1258.05 0 196.005 0 2320.86 0.04 0 0 0 0 0 0 0 
0 0 0 0 0 0 0 0 0 0 1397.37 0 0 0 0 -1614.96 0 0 0 0 0 1545.08 0 0 -1067.61 0 0 0 0 0 0 0 0 0 0 0 0 0.05 0 0 0 0 498.749 0 
0 -425.962 0 0 0 2292.93 0 0 0 0 0 0 0 0 0 -674.383 0 0 0 0 0 0 0 0 0 0 0 0 0 0 0 0 0 0 0 0 0 0 0.07 0 0 0 0 805.46 
0 -1839.88 0 0 0 0 0 0 0 0 0 0 2148.27 0 107.044 0 0 0 0 0 -372.097 0 0 0 0 0 1901.68 0 0 0 0 -4.1963 0 0 0 0 0 0 0 0.04 0 0 0 0 
1255 1543.55 0 0 0 0 0 0 0 0 0 0 0 0 0 0 0 0 0 0 0 -1376 0 0 0 0 0 0 0 0 0 0 0 0 0 0 0 0 0 0 0.01 0 0 0 
0 0 0 1418.58 0 2096.39 0 0 0 0 0 0 1646.7 0 0 0 0 0 0 82.9341 0 0 0 0 0 0 0 0 0 0 0 0 0 0 0 0 0 0 0 0 0 0.01 0 0 
0 2007.74 0 0 0 0 0 0 0 0 0 0 900.983 0 0 0 0 0 0 0 271.233 0 0 0 0 0 0 0 1078.75 0 0 1561.71 9.38444 0 0 0 0 1499.76 0 0 0 0 0 0 
0 0 0 1471.83 0 368.587 0 0 0 0 727.027 0 0 0 0 0 0 354.244 0 0 0 0 0 0 0 0 0 0 0 0 0 0 0 812.479 0 0 0 0 1986.53 0 0 0 0 0.09 
