*Vertices 53
*Matrix 
0.04 0 0 0 0 0 0 -717.872 701.086 0 0 0 0 0 0 0 59.8926 -930.433 0 0 0 0 0 0 0 0 0 0 0 0 0 0 0 0 0 0 0 0 -79.2718 0 0 0 0 1590.55 0 0 0 0 0 0 0 0 0 
0 0.08 0 0 395.138 2385.86 0 0 0 0 0 0 0 0 0 0 0 2213.28 0 0 2301.17 0 0 0 0 0 0 0 0 0 -107.654 0 -691.473 0 0 0 0 0 0 0 0 0 543.458 0 0 0 0 0 0 0 0 0 0 
0 0 0.03 2351.68 1604.74 0 0 0 0 0 0 0 0 0 -1953.57 0 0 0 0 0 2406 0 0 0 0 0 0 0 0 0 0 0 0 0 0 948.439 0 0 0 0 0 766.549 0 17.9296 0 0 0 0 0 0 0 0 0 
0 0 -1317.56 0.05 0 0 0 0 0 0 0 0 1017.87 0 0 0 0 0 0 0 0 0 0 0 -339.29 0 0 0 0 0 0 0 0 0 0 2495.42 776.62 1039.54 0 0 0 0 0 0 0 0 0 0 0 0 0 0 0 
0 -1102.71 1803.26 0 0.05 0 0 0 0 0 0 0 0 0 0 0 0 0 1848.12 0 0 0 0 2148.73 0 0 0 0 823.161 2220.3 0 0 0 0 0 107.349 0 0 2172.08 0 0 0 0 0 0 0 0 0 0 0 0 0 0 
0 1560.79 0 0 0 0.09 0 0 0 0 0 2321.16 0 0 0 0 0 401.395 0 0 1257.44 0 0 0 0 0 0 0 0 0 403.378 0 0 0 0 0 0 0 0 0 0 0 0 0 0 0 0 0 0 0 0 0 0 
0 0 0 0 0 0 0 0 0 0 0 0 0 0 0 0 0 0 -532.472 0 0 988.876 0 0 0 0 0 0 -1350.52 0 0 0 1251.79 0 0 0 0 0 0 0 0 0 0 0 0 0 0 0 0 0 0 0 0 
1800.21 0 0 0 0 0 0 0.08 0 0 -448.241 2384.33 2101.12 0 0 0 0 0 0 1185.87 0 0 0 0 1200.67 0 0 0 0 0 0 0 0 0 0 0 738.929 0 0 -1510.13 -907.544 1316.34 0 1608.55 0 0 0 0 0 0 0 0 0 
1632.97 0 0 0 0 0 0 0 0.03 0 0 0 0 0 0 0 0 473.724 0 -357.448 -557.497 0 -1715.22 0 2436.37 0 0 0 0 0 0 0 0 0 0 772.347 -533.54 0 1728.95 0 0 0 0 0 0 0 0 0 0 0 0 0 0 
0 0 0 0 0 0 0 0 0 0.01 0 808.054 0 0 1364.25 0 306.635 -2227.77 0 0 0 0 1754.59 0 709.784 0 49.5163 0 0 0 0 0 926.618 0 0 -1094.78 -1597.42 0 0 0 0 1978.44 0 0 0 0 0 0 0 0 0 -1049 0 
0 0 0 0 0 0 0 2303.46 0 0 0 0 0 0 0 0 0 0 0 0 0 0 -2406.61 0 0 0 1185.57 0 0 0 0 0 0 0 0 0 0 0 0 0 2004.38 0 0 0 0 0 0 0 0 0 0 0 0 
0 0 0 0 0 -2243.34 0 1826.15 0 2451.93 0 0.05 0 -2114.4 0 784.86 0 0 0 0 0 0 0 0 2125.54 980.026 0 0 0 0 0 0 0 0 0 565.737 822.092 0 0 0 2312.31 0 0 0 0 0 0 0 0 0 0 0 0 
0 0 0 -26.6274 0 0 0 353.481 0 0 0 0 0.01 0 0 1591.31 0 0 0 2068.16 0 0 470.519 0 -2414.09 0 0 0 0 0 0 2230.52 0 0 0 0 0 1016.19 0 0 657.445 0 -2431.64 0 -1280.94 0 0 0 0 0 0 0 0 
0 0 0 0 0 0 0 0 0 0 0 414.06 0 0.02 0 0 0 0 0 0 0 0 0 0 0 364.315 0 0 0 0 0 0 0 0 0 0 0 0 0 0 0 2222.74 0 0 0 0 0 0 0 0 0 0 0 
0 0 651.189 0 0 0 0 0 0 1730.17 0 0 0 0 0.05 0 0 0 0 -76.5252 0 0 0 -2110.28 0 0 0 0 0 0 0 0 0 0 0 -2353.97 2273.09 0 0 0 0 0 0 0 0 0 2450.71 0 0 0 0 0 -1639.53 
0 0 0 0 0 0 0 0 0 0 0 -2277.21 1177.02 0 0 0.09 573.977 0 2369.53 0 0 0 0 0 0 1766.95 0 0 0 0 0 0 0 0 0 0 0 0 0 0 0 0 0 0 0 0 0 0 0 0 1059.37 0 0 
1784.95 0 0 0 0 0 0 0 0 1192.43 0 0 0 0 0 196.005 0.05 0 359.432 0 2036.58 0 0 810.648 0 0 0 0 262.23 0 -887.249 0 0 0 0 0 0 0 -330.897 0 0 -1888.87 0 0 0 0 0 0 0 0 0 0 0 
1949.29 2496.34 0 0 0 154.042 0 0 -1456.11 -2432.55 0 0 0 0 0 0 0 0.04 0 0 0 0 0 0 0 0 0 0 1376.61 0 0 0 0 0 0 0 0 0 0 0 1907.94 0 0 0 0 0 0 0 0 0 0 0 0 
0 0 0 0 -126.27 0 2089.68 0 0 0 0 0 0 0 0 -1889.93 1068.83 0 0.09 0 0 1244.16 0 0 0 0 -660.649 0 0 0 0 0 0 0 0 -132.374 0 0 -1824.47 1292.84 0 0 0 0 0 0 0 0 0 0 0 0 0 
0 0 0 0 0 0 0 1262.32 -1444.82 0 0 0 1507.69 0 -1352.05 0 0 0 0 0.03 0 0 0 0 0 0 1784.04 0 0 0 0 1958.6 0 0 0 0 0 0 -69.0481 0 0 0 0 0 0 0 0 0 0 0 0 0 0 
0 359.89 2028.79 0 0 840.556 0 0 2301.93 0 0 0 0 0 0 0 421.842 0 0 0 0.05 0 0 0 0 1431.09 1123.46 0 0 0 0 0 0 0 0 0 0 0 0 0 0 0 0 0 0 0 0 0 0 0 0 0 0 
0 0 0 0 0 0 174.947 0 0 0 0 0 0 0 0 0 0 0 -363.247 0 0 0.04 0 0 0 0 0 0 0 0 0 -2082.51 0 0 0 0 0 0 1331.29 0 1735.97 0 0 0 0 0 0 0 0 0 0 0 0 
0 0 0 0 0 0 0 0 2259.67 699.255 2149.34 0 -1973.56 0 0 0 0 0 0 0 0 0 0.01 0 1611.76 0 0 0 0 0 0 0 0 0 0 0 0 -145.802 0 1877.73 0 0 0 0 0 0 0 0 0 0 0 0 0 
0 0 0 0 698.187 0 0 0 0 0 0 0 0 0 1521.27 0 1325.95 0 0 0 0 0 0 0.03 0 0 0 0 0 0 0 0 0 0 0 0 0 0 0 0 0 0 2435.15 0 0 0 0 0 0 0 0 0 0 
0 0 0 1806.92 0 0 0 2311.55 983.993 -1982.71 0 -1594.06 528.352 0 0 0 0 0 0 0 0 0 1176.11 0 0.09 0 0 0 -742.134 0 0 0 0 0 0 0 0 0 0 0 0 148.396 0 0 0 0 0 0 0 0 0 0 0 
0 0 0 0 0 0 0 0 0 0 0 1282.46 0 2432.71 0 -1568.42 0 0 0 0 1877.12 0 0 0 0 0.01 0 0 0 0 0 750.069 0 0 0 0 0 0 0 0 0 0 0 0 0 0 0 0 0 0 0 0 0 
0 0 0 0 0 0 0 0 0 1994.92 2234.34 0 0 0 0 0 0 0 2037.64 -787.454 -1910.23 0 0 0 0 0 0.01 0 0 0 0 0 0 0 0 0 1400.57 0 0 0 0 0 0 -940.199 0 0 0 0 0 -926.466 0 0 0 
0 0 0 0 0 0 0 0 0 0 0 0 0 0 0 0 0 0 0 0 0 0 0 0 0 0 0 0 0 0 0 0 0 0 -583.132 0 0 0 1658.91 612.125 0 0 0 0 0 0 0 0 0 0 0 0 0 
0 0 0 0 1390.8 0 2031.24 0 0 0 0 0 0 0 0 0 -208.365 1876.66 0 0 0 0 0 0 2087.69 0 0 0 0.08 0 0 0 0 0 0 -150.99 -961.715 0 0 0 0 0 0 0 0 0 0 0 0 0 0 0 0 
0 0 0 0 -1016.95 0 0 0 0 0 0 0 0 0 0 0 0 0 0 0 0 0 0 0 0 0 0 0 0 0 0 0 1370.36 0 0 0 0 0 0 0 0 0 0 0 0 0 0 0 0 0 0 0 0 
0 -546.663 0 0 0 2038.87 0 0 0 0 0 0 0 0 0 0 946.608 0 0 0 0 0 0 0 0 0 0 0 0 0 0.08 0 0 0 0 0 0 0 0 0 0 0 0 0 0 0 0 0 0 0 0 0 0 
0 0 0 0 0 0 0 0 0 0 0 0 -2115.47 0 0 0 0 0 0 1116.44 0 -1112.32 0 0 0 -138.02 0 0 0 0 0 0.01 0 0 0 0 0 0 962.325 0 0 0 0 1886.12 0 0 0 0 0 0 0 0 0 
0 2453.92 0 0 0 0 2028.18 0 0 -1815.32 0 0 0 0 0 0 0 0 0 0 0 0 0 0 0 0 0 0 0 -1074.63 0 0 0.02 0 0 0 157.247 0 0 0 0 0 0 0 0 96.5148 0 0 0 0 0 0 0 
0 0 0 0 0 0 0 0 0 0 0 0 0 0 0 0 0 0 0 0 0 0 0 0 0 0 0 0 0 0 0 0 0 0.05 0 0 0 1948.53 717.261 0 -1395.38 0 0 0 0 0 0 0 0 0 0 0 0 
0 0 0 0 0 0 0 0 0 0 0 0 0 0 0 0 0 0 0 0 0 0 0 0 0 0 0 1786.48 0 0 0 0 0 0 0.01 0 0 0 0 0 0 0 800.729 0 0 0 0 0 0 0 0 0 0 
0 0 1950.36 -10.1474 2271.42 0 0 0 -1552.86 28.0007 0 26.78 0 0 1007.64 0 0 0 -143.361 0 0 0 0 0 0 0 0 0 807.749 0 0 0 0 0 0 0.03 0 0 0 0 0 0 0 -193.411 0 0 0 0 0 0 0 0 0 
0 0 0 -1338.31 0 0 0 1148.03 1586.28 -1728.19 0 1573.92 0 0 1562.01 0 0 0 0 0 0 0 0 0 0 0 -274.59 0 952.864 0 0 0 304.193 0 0 0 0.06 0 0 1387.14 0 0 0 1209.68 0 0 0 0 0 0 0 0 0 
0 0 0 564.058 0 0 0 0 0 0 0 0 489.441 0 0 0 0 0 0 0 0 0 1434.75 0 0 0 0 0 0 0 0 0 0 -481.201 0 0 0 0.04 0 -764.412 0 0 0 0 0 0 0 0 0 0 0 0 0 
-161.824 0 0 0 1792.58 0 0 0 -675.146 0 0 0 0 0 0 0 823.008 0 2331.39 903.424 0 2023.76 0 0 0 0 0 1276.82 0 0 0 -618.381 0 -1556.52 0 0 0 0 0.07 0 0 -454.039 0 0 0 0 0 0 0 0 0 0 0 
0 0 0 0 0 0 0 -94.0733 0 0 0 0 0 0 0 0 0 0 -592.135 0 0 0 1928.08 0 0 0 0 1464.2 0 0 0 0 0 0 0 0 109.18 843.15 0 0.02 2475.74 0 0 0 0 0 0 0 0 0 0 0 0 
0 0 0 0 0 0 0 -1978.9 0 0 965.377 2357.33 1677.98 0 0 0 0 -2360.53 0 0 0 331.202 0 0 0 0 0 0 0 0 0 0 0 -286.035 0 0 0 0 0 1343.2 0.05 663.854 0 0 0 0 0 0 0 0 0 0 0 
0 0 1654.48 0 0 0 0 1263.24 0 2414.55 0 0 0 -2113.79 0 0 1896.19 0 0 0 0 0 0 0 -2460.94 0 0 0 0 0 0 0 0 0 0 0 0 0 1472.9 0 1935.71 0.06 2422.18 0 0 0 0 393.155 0 0 0 0 0 
0 -1300.16 0 0 0 0 0 0 0 0 0 0 878.704 0 0 0 0 0 0 0 0 0 0 1463.29 0 0 0 0 0 0 0 0 0 0 -2094.87 0 0 0 0 0 0 1305.51 0.07 0 0 0 0 0 1001.69 0 0 0 0 
2135.91 0 -272.149 0 0 0 0 1790.9 0 0 0 0 0 0 0 0 0 0 0 0 0 0 0 0 0 0 -154.958 0 0 0 0 2366.48 0 0 0 -2389.98 -1942.58 0 0 0 0 0 0 0.09 0 0 0 0 0 0 0 0 0 
0 0 0 0 0 0 0 0 0 0 0 0 2252.34 0 0 0 0 0 0 0 0 0 0 0 0 0 0 0 0 0 0 0 0 0 0 0 0 0 0 0 0 0 0 0 0.04 0 0 0 0 0 0 0 0 
0 0 0 0 0 0 0 0 0 0 0 0 0 0 0 0 0 0 0 0 0 0 0 0 0 0 0 0 0 0 0 0 1168.02 0 0 0 0 0 0 0 0 0 0 0 0 0.08 0 0 0 0 0 0 0 
0 0 0 0 0 0 0 0 0 0 0 0 0 0 394.528 0 0 0 0 0 0 0 0 0 0 0 0 0 0 0 0 0 0 0 0 0 0 0 0 0 0 0 0 0 0 0 0.01 0 0 0 0 0 0 
0 0 0 0 0 0 0 0 0 0 0 0 0 0 0 0 0 0 0 0 0 0 0 0 0 0 0 0 0 0 0 0 0 0 0 0 0 0 0 0 0 583.285 0 0 0 0 0 0.07 0 0 0 0 0 
0 0 0 0 0 0 0 0 0 0 0 0 0 0 0 0 0 0 0 0 0 0 0 0 0 0 0 0 0 0 0 0 0 0 0 0 0 0 0 0 0 0 2433.16 0 0 0 0 0 0.05 0 0 0 0 
0 0 0 0 0 0 0 0 0 0 0 0 0 0 0 0 0 0 0 0 0 0 0 0 0 0 1346.71 0 0 0 0 0 0 0 0 0 0 0 0 0 0 0 0 0 0 0 0 0 0 0.03 0 0 0 
0 0 0 0 0 0 0 0 0 0 0 0 0 0 0 1570.25 0 0 0 0 0 0 0 0 0 0 0 0 0 0 0 0 0 0 0 0 0 0 0 0 0 0 0 0 0 0 0 0 0 0 0.08 0 0 
0 0 0 0 0 0 0 0 0 1344.72 0 0 0 0 0 0 0 0 0 0 0 0 0 0 0 0 0 0 0 0 0 0 0 0 0 0 0 0 0 0 0 0 0 0 0 0 0 0 0 0 0 0.05 0 
0 0 0 0 0 0 0 0 0 0 0 0 0 0 1349.6 0 0 0 0 0 0 0 0 0 0 0 0 0 0 0 0 0 0 0 0 0 0 0 0 0 0 0 0 0 0 0 0 0 0 0 0 0 0.03 
