*Vertices 50
*Matrix 
0.03 0 0 0 0 0 0 0 -1274.83 0 1375.24 0 1943.49 0 -1541.87 1440.4 0 0 0 2348.02 0 0 -1244.62 0 -1935.41 0 0 663.549 0 0 1969.74 -2057.94 0 0 0 0 -1498.69 0 0 -728.248 0 0 0 1484.19 0 0 2336.73 0 0 0 
0 0.08 0 0 1160.85 977.432 0 0 0 -1350.52 0 0 0 -524.079 0 0 0 1991.41 0 -816.446 0 1760.38 0 0 0 0 0 1502.96 0 0 0 -894.879 0 -898.694 0 0 0 0 -1324.12 0 0 1789.53 0 0 0 0 0 0 0 0 
0 0 0.09 0 0 0 1426.51 0 0 0 194.174 0 0 0 -1324.43 0 9.07926 0 0 0 0 0 0 0 0 0 1661.81 735.725 0 0 0 -1655.4 0 0 0 0 0 0 0 -1380.58 907.697 0 -396.054 0 0 0 2018.11 0 0 0 
0 0 0 0.09 0 0 0 0 0 0 0 0 0 0 1234.09 0 1898.94 0 0 0 0 0 0 2213.43 0 0 0 0 2283.62 0 0 0 2235.1 0 -1593.91 0 0 833.689 0 413.602 0 0 0 -238.426 0 -2268.21 0 0 0 0 
0 486.236 0 0 0.01 0 0 2208.24 0 0 0 0 0 2012.92 2193.9 660.192 -229.881 -2487.79 538.118 0 0 0 0 2369.23 0 0 0 0 -990.707 0 0 -649.51 0 0 0 0 -2435.61 2484.13 0 0 0 0 -245.14 0 0 0 0 0 0 2221.82 
0 -1476.71 0 0 0 0.08 0 1299.55 0 0 0 0 52.1104 0 0 2098.83 0 0 -2053.36 0 0 0 0 0 0 -998.642 0 0 0 0 2222.13 0 0 0 0 0 0 2165.67 0 -719.245 0 0 0 1827.52 0 0 0 0 0 2023.3 
0 0 990.86 0 0 0 0.02 0 0 0 0 0 0 0 0 1151.39 0 0 0 -107.959 0 0 0 2465.36 0 0 0 0 0 2364.65 0 1966.99 1909.47 1732 1235.16 0 -1954.18 -1496.7 0 0 0 2048.02 2170.25 0 0 0 0 0 0 0 
0 0 0 0 1078.45 -1527.99 0 0.08 0 0 2057.79 0 0 1019.85 -1375.55 0 0 0 0 -257.653 1385.31 0 0 0 0 2320.86 0 -981.399 0 0 0 0 0 0 0 2042.99 2437.74 0 0 0 0 939.589 0 0 0 0 0 0 0 1131.55 
-332.728 0 0 0 0 0 0 0 0.06 0 0 1736.27 -1394.92 0 0 371.181 1303.98 0 0 0 0 0 1988.66 0 0 2044.51 0 0 0 0 -2342.83 409.94 888.318 0 0 0 0 0 -684.149 0 272.912 0 0 0 -1345.48 0 -1461.15 0 0 0 
0 -2459.41 0 0 0 0 0 0 0 0.08 0 0 0 0 1094.16 0 1628.7 2372.89 1117.05 0 0 0 -395.901 0 0 0 0 0 0 0 0 0 295.19 0 0 0 0 0 606.326 -212.79 1053.73 0 0 0 0 0 0 0 -1588.87 0 
2174.83 0 -27.2378 0 0 0 0 812.479 0 0 0.07 0 0 200.583 1821.27 0 0 0 0 0 -1678.44 0 0 0 0 -1531.34 0 157.094 0 0 0 0 0 0 -118.946 0 0 2261.65 0 0 0 0 0 0 0 0 0 -2110.58 0 0 
0 0 0 0 0 0 0 0 1057.08 0 0 0.04 0 2441.86 0 0 0 0 -765.786 0 0 -216.453 0 2059.47 22.8126 0 0 0 227.592 0 0 0 0 1419.34 570.62 0 0 0 1293.45 0 0 0 188.528 994.217 0 -361.721 0 0 0 0 
-781.808 0 0 0 0 1947.92 0 0 1732 0 0 0 0 0 0 0 0 0 -1632.66 0 -978.347 0 2343.9 2294 0 0 1718.42 -553.224 0 2292.17 0 0 -1773.05 0 0 0 0 0 0 0 842.845 0 0 -1900.62 0 0 0 0 0 0 
0 -1438.11 0 0 -481.811 0 0 2400.36 0 0 1526.92 2031.69 0 0.03 0 0 2222.13 0 0 0 0 0 1226.62 0 1399.35 0 -579.318 -843.455 -352.565 634.098 0 1057.85 0 0 0 0 0 0 0 0 -1156.73 0 0 0 0 0 0 0 0 0 
1540.04 0 -2340.08 -327.387 2377.01 0 0 1534.85 0 172.353 1663.03 0 0 0 0 0 0 -1045.18 -2028.79 -1737.34 -217.978 0 0 0 270.775 0 0 -1275.14 0 -1048.84 0 0 0 0 0 0 0 0 299.31 1873 1756.11 1704.23 738.777 0 0 0 0 0 0 0 
-61.2659 0 0 0 1321.53 -602.359 -192.038 0 712.531 0 0 0 0 0 0 0.09 1134.6 1789.22 0 0 0 0 0 0 0 0 0 0 0 209.433 1283.23 0 -1329.62 -473.266 0 0 0 -1217.31 0 0 -1912.82 0 0 0 0 0 0 0 0 0 
0 0 -1300.32 -412.839 -2097.77 0 0 0 1603.82 1474.12 0 0 0 -1753.06 0 2363.89 0.09 1535.62 0 0 0 942.946 0 0 0 0 0 0 1549.96 0 0 0 2362.51 -458.312 0 0 0 -1468.47 0 1505.4 0 0 1855.45 0 2044.21 0 0 0 0 0 
0 626.774 0 0 -2073.81 0 0 0 0 -262.841 0 0 0 0 -1182.52 2484.13 2456.05 0.01 -261.315 0 0 0 0 0 0 0 0 0 0 0 0 0 0 -106.281 -1754.89 1871.01 0 0 0 0 0 0 0 2006.82 0 0 0 2400.2 0 0 
0 0 0 0 1909.16 -1339.08 0 0 0 1905.5 0 2289.88 -1111.26 0 2483.67 0 0 904.035 0.04 -811.258 -980.331 0 0 0 -1619.85 0 0 0 0 0 0 0 1665.17 0 0 1194.11 -221.946 0 0 0 0 0 -893.506 0 0 0 0 0 0 0 
1887.34 388.272 0 0 0 0 816.446 497.986 0 0 0 0 0 0 -588.626 0 0 0 1744.36 0.08 0 0 0 0 0 0 0 0 0 0 0 0 -872.753 0 1464.66 1736.88 0 0 0 0 -2316.74 0 0 0 0 0 0 0 0 0 
0 0 0 0 0 0 0 1137.04 0 0 -1005.97 0 1093.55 0 1148.64 0 0 0 -2040.85 0 0.01 0 0 -891.522 0 0 0 2342.07 0 2125.84 0 0 0 0 0 0 0 0 0 0 0 0 0 0 0 0 0 0 0 0 
0 1925.79 0 0 0 0 0 0 0 0 0 380.337 0 0 0 0 2068.93 0 0 0 0 0 0 0 1615.42 0 0 0 0 -628.91 -546.052 757.851 673.009 0 0 -1177.02 0 0 0 0 0 -2320.4 0 1679.36 1925.03 550.935 0 0 0 0 
1502.81 0 0 0 0 0 0 0 1779.31 1983.93 0 0 1694.77 1620.61 0 0 0 0 0 0 0 0 0 0 0 1891.46 0 0 1126.97 0 0 0 0 -2322.23 -55.0096 0 -1338.92 1772.9 0 0 0 0 -1762.67 0 0 0 0 -1801.58 0 0 
0 0 0 2356.56 2350.31 0 1093.4 0 0 0 0 31.5104 -1769.84 0 0 0 0 0 0 0 -972.701 0 0 0.04 752.663 -1403.01 0 0 0 0 0 0 0 0 0 144.429 0 0 0 1009.17 0 -708.563 0 0 468.688 0 1621.07 0 0 0 
318.69 0 0 0 0 0 0 0 0 0 0 907.086 0 1217.61 1930.22 0 0 0 689.337 0 0 -871.99 0 -893.048 0.04 2104.94 0 0 0 0 0 0 0 1315.27 0 0 0 0 1928.39 0 0 0 0 2288.2 0 0 0 0 0 660.649 
0 0 0 0 0 -1840.04 0 2267.3 1784.8 0 -979.11 0 0 0 0 0 0 0 0 0 0 0 2445.37 361.263 2256.61 0.08 -893.963 0 0 0 -2112.72 0 0 0 1613.9 0 0 0 2401.73 0 0 0 -2.82296 0 0 -775.552 0 0 0 0 
0 0 2305.29 0 0 0 0 0 0 0 0 0 1165.43 -251.701 0 0 0 0 0 0 0 0 0 0 0 2168.57 0.07 -795.846 0 0 0 0 0 0 0 -1918.62 0 0 0 2414.55 -2202.75 0 0 0 0 0 0 0 0 0 
-1944.41 545.595 -1282.92 0 0 0 0 1725.9 0 0 -1090.81 0 1160.24 -22.2022 1513.49 0 0 0 0 0 -1038.32 0 0 0 0 0 -533.235 0 0 0 -814.615 0 0 0 0 450.987 0 1374.48 0 -325.861 0 0 1611 0 1643.35 0 0 0 0 0 
0 0 0 1737.34 1041.22 0 0 0 0 0 0 528.809 0 1717.35 0 0 -2363.43 0 0 0 0 0 1922.9 0 0 0 0 0 0.04 0 0 0 0 0 758.309 0 0 0 0 0 0 0 0 0 0 0 0 0 1153.07 0 
0 0 0 0 0 0 1927.17 0 0 0 0 0 1708.81 -738.472 1938.92 2344.05 0 0 0 0 308.618 2026.35 0 0 0 0 0 0 0 0.03 0 0 2335.35 0 0 0 0 0 0 1920 -2148.43 0 0 0 0 0 0 0 0 0 
1048.23 0 0 0 0 721.839 0 0 2111.19 0 0 0 0 0 0 2013.53 0 0 0 0 0 998.337 0 0 0 1277.73 0 -2452.09 0 0 0.09 -1940.6 -385.83 2034.9 0 0 0 -1913.59 2386.32 0 0 -2152.7 0 0 0 0 0 0 0 0 
203.024 1065.02 -49.9741 0 1399.81 0 140.309 0 -67.5222 0 0 0 0 -1376.77 0 0 0 0 0 0 0 1135.06 0 0 0 0 0 0 0 0 553.682 0.01 0 1054.8 0 0 0 0 0 0 -1391.42 0 0 775.552 0 -1546.75 0 0 0 0 
0 0 0 -936.689 0 0 -1616.18 0 -2007.43 1970.66 0 0 1516.85 0 0 829.112 -2331.23 0 -730.689 2364.96 0 2364.19 0 0 0 0 0 0 0 570.772 1034.2 0 0.08 0 0 0 0 0 889.386 258.263 0 0 0 0 0 0 0 0 0 0 
0 -1705.76 0 0 0 0 2354.43 0 0 0 0 646.001 0 0 0 1227.68 -745.643 337.611 0 0 0 0 -1549.04 0 -2113.33 0 0 0 0 0 -467.009 2318.11 0 0.03 0 1744.97 0 -1232.11 -451.292 0 0 0 485.778 0 0 0 0 0 0 0 
0 0 0 1346.25 0 0 2093.34 0 0 0 -525.91 1728.95 0 0 0 0 0 1134.91 0 -1633.88 0 0 2070.15 0 0 1367 0 0 1738.87 0 0 0 0 0 0.03 0 0 0 0 0 -1806.92 0 -42.497 0 0 0 0 0 0 0 
0 0 0 0 0 0 0 2375.48 0 0 0 0 0 0 0 0 0 592.746 744.118 2436.83 0 -801.798 0 501.495 0 0 343.257 2196.04 0 0 0 0 0 1186.03 0 0 0 0 1279.41 0 0 0 0 0 0 0 0 0 0 0 
2045.58 0 0 0 -2117.3 0 -453.581 1182.06 0 0 0 0 0 0 0 0 0 0 128.559 0 0 0 2141.71 0 0 0 0 0 0 0 0 0 0 0 0 0 0.01 0 0 0 311.67 0 0 0 0 102.466 0 0 0 0 
0 0 0 -1069.29 -2109.67 464.721 1361.51 0 0 0 -663.854 0 0 0 0 2121.42 -107.349 0 0 0 0 0 1446.65 0 0 0 0 1304.9 0 0 2280.72 0 0 1081.19 0 0 0 0 1552.4 0 0 -408.414 1436.89 0 0 0 0 1558.05 0 0 
0 1692.18 0 0 0 0 0 0 -702.155 2237.08 0 -864.971 0 0 1606.27 0 0 0 0 0 0 0 0 0 -826.823 -2164.75 0 0 0 0 629.673 0 -255.364 -19.4555 0 1333.58 0 873.516 0.02 0 0 0 0 1241.26 0 0 0 0 1538.51 0 
-1797.31 0 1828.9 -2072.89 0 2010.33 0 0 0 625.095 0 0 0 0 -1775.8 0 -132.374 0 0 0 0 0 0 -826.67 0 0 2238 1090.04 0 -119.251 0 0 834.91 0 0 0 0 0 0 0.08 0 0 0 0 0 0 0 0 0 696.356 
0 0 -1916.79 0 0 0 0 0 327.082 2420.65 0 0 1559.88 2182.15 1784.19 439.695 0 0 0 834.605 0 0 0 0 0 0 1864.45 0 0 690.252 0 -890.759 0 0 1673.86 0 -2203.21 0 0 0 0 346.004 1783.88 0 0 0 -1034.65 677.282 0 0 
0 -1364.86 0 0 0 0 -678.655 1606.11 0 0 0 0 0 0 643.712 0 0 0 0 0 0 -398.038 0 504.7 0 0 0 0 0 0 -403.531 0 0 0 0 0 0 1354.95 0 0 1766.49 0 0 0 0 0 0 0 0 0 
0 0 -1046.56 0 -241.783 0 2030.93 0 0 0 0 -445.189 0 0 1313.59 0 -306.94 0 -1733.53 0 0 0 926.313 0 0 -706.427 0 -222.251 0 0 0 0 0 2382.05 -2103.11 0 0 889.386 0 0 557.192 0 0.08 2347.56 0 0 0 457.091 0 0 
2187.03 0 0 -1241.57 0 1120.87 0 0 0 0 0 214.164 2443.54 0 0 0 0 2161.85 0 0 0 2132.71 0 0 -2437.44 0 0 0 0 0 0 1015.88 0 0 0 0 0 0 -1750.47 0 0 0 2476.81 0.04 1550.57 0 0 0 0 0 
0 0 0 0 0 0 0 0 1239.13 0 0 0 0 0 0 0 -170.217 0 0 0 0 818.278 0 -1641.67 0 0 0 1757.94 0 0 0 0 0 0 0 0 0 0 0 0 0 0 0 2195.12 0.01 0 0 0 0 0 
0 0 0 526.063 0 0 0 0 0 0 0 2036.42 0 0 0 0 0 0 0 0 0 1544.31 0 0 0 -2318.72 0 0 0 0 0 196.005 0 0 0 0 705.359 0 0 0 0 0 0 0 0 0.08 0 0 138.478 0 
-1696.14 0 2312.01 0 0 0 0 0 1855.45 0 0 0 0 0 0 0 0 0 0 0 0 0 0 -1387.3 0 0 0 0 0 0 0 0 0 0 0 0 0 0 0 0 1962.72 0 0 0 0 0 0.05 -389.035 0 0 
0 0 0 0 0 0 0 0 0 0 796.152 0 0 0 0 0 0 -2064.2 0 0 0 0 416.196 0 0 0 0 0 0 0 0 0 0 0 0 0 0 87.2066 0 0 1566.29 0 413.449 0 0 0 1217.15 0.03 0 0 
0 0 0 0 0 0 0 0 0 1412.63 0 0 0 0 0 0 0 0 0 0 0 0 0 0 0 0 0 0 2347.25 0 0 0 0 0 0 0 0 0 -275.811 0 0 0 0 0 0 -87.5118 0 0 0.03 0 
0 0 0 0 -2467.35 173.879 0 1079.82 0 0 0 0 0 0 0 0 0 0 0 0 0 0 0 0 1141.32 0 0 0 0 0 0 0 0 0 0 0 0 0 0 1486.48 0 0 0 0 0 0 0 0 0 0.07 
