*Vertices 65
*Matrix 
0 430.998 0 0 -1448.03 -1820.96 0 0 0 0 0 0 0 0 2053.82 0 2424.16 0 1786.78 0 0 0 0 0 2304.38 -1730.63 488.372 1052.96 869.701 0 0 0 -180.441 0 0 0 0 0 0 0 0 1060.9 0 0 0 0 0 0 -1116.75 0 0 0 0 0 0 0 -2489.47 0 0 -130.696 2256.92 0 0 0 0 
1002 0.03 522.553 -1077.53 1402.55 639.439 0 0 0 0 0 -813.852 0 0 1287.04 0 1772.44 0 0 0 1041.06 0 0 0 0 0 349.361 1741.46 0 0 0 0 0 0 0 0 0 0 1638.62 0 0 0 0 0 0 0 0 0 0 0 -580.233 0 0 0 0 0 0 2384.49 0 -2229.3 57.6037 0 0 0 0 
0 2082.66 0.05 0 0 0 0 0 0 0 0 0 0 0 0 -490.814 0 698.645 0 0 2485.66 0 0 0 0 0 1470.31 953.932 0 0 0 0 0 0 0 0 0 0 0 0 -947.218 0 0 0 0 0 0 0 0 0 0 0 0 0 0 0 0 0 0 0 0 0 0 0 0 
0 -544.069 0 0.07 0 0 1467.25 0 0 0 0 0 0 0 0 230.491 0 0 0 0 0 0 2342.83 0 0 0 0 0 0 0 0 -2460.48 1765.11 2417.45 0 0 0 0 0 249.107 0 0 0 0 0 0 0 0 0 0 0 0 -1005.97 0 1332.82 0 0 0 0 0 0 0 0 0 1706.67 
196.005 573.519 0 0 0.05 0 0 0 0 0 0 1138.87 2151.33 0 0 0 0 0 1420.71 0 0 -912.732 0 0 0 0 -573.367 0 -1965.62 1482.97 0 0 0 0 0 0 0 0 0 0 0 0 0 0 0 0 0 0 0 0 0 0 0 0 0 1756.26 0 0 0 0 -61.1133 0 0 0 0 
-557.192 -2466.73 0 0 0 0.08 1944.87 0 2019.79 0 1214.56 0 26.3222 0 0 -2449.49 0 0 1228.75 2196.34 0 1943.34 340.205 -1057.39 1582.16 252.007 0 0 0 0 0 0 0 0 0 0 0 0 0 0 0 0 0 9.23185 0 0 0 0 0 1391.57 0 -698.34 0 0 0 -664.922 0 351.802 0 0 0 0 0 0 0 
0 0 0 2492.83 0 -760.598 0.06 0 0 0 0 0 -691.626 2031.24 0 0 0 0 0 0 -226.981 1003.98 0 -1327.17 0 0 0 0 2052.45 0 0 0 0 0 0 2367.55 0 0 0 0 0 0 0 1359.07 0 0 0 0 0 0 0 0 -316.858 0 0 0 0 0 0 0 0 -1123 0 0 0 
0 0 0 0 0 0 0 0.07 0 0 1782.2 0 0 2381.13 0 -1126.36 0 0 -294.58 0 2455.75 0 0 -7.70592 -635.472 0 -458.312 0 0 0 0 0 0 0 0 0 0 0 0 0 0 0 0 0 -2449.64 -1231.8 0 0 0 0 0 0 -927.839 2001.02 0 0 0 0 0 0 0 0 0 0 0 
0 0 0 0 0 2479.4 0 0 0 -605.258 303.583 1156.88 0 1621.37 1805.86 -2266.99 0 0 0 0 0 0 0 0 0 0 0 0 0 0 0 0 0 0 0 -1493.35 0 0 0 0 0 0 0 0 0 0 0 175.71 0 0 0 0 0 -1837.75 0 0 0 0 0 1116.6 731.758 0 184.256 0 0 
0 0 0 0 0 0 0 0 645.543 0.01 0 0 689.184 0 0 0 0 1728.34 0 -973.769 0 0 0 2300.1 0 -567.568 0 -2172.08 0 0 0 0 0 0 0 0 0 0 0 0 0 0 0 2359.46 0 0 0 0 0 0 0 0 1653.11 0 0 0 0 0 0 0 0 0 50.4318 0 0 
0 0 0 0 0 2137.59 0 1460.54 209.738 0 0.03 0 0 987.503 708.563 0 0 0 0 0 -1858.35 0 0 0 749.916 0 0 0 2220.15 0 0 0 218.131 0 0 0 2189.17 997.574 0 0 0 0 0 0 0 0 0 0 0 0 0 -1134.3 0 0 0 1250.11 0 1429.26 258.721 0 0 0 0 0 1164.2 
0 -2022.39 0 0 967.666 0 0 0 1.14444 0 0 0.01 0 0 0 0 1435.82 0 -2126.45 1754.74 0 0 0 0 0 0 -856.731 0 0 2357.78 0 0 0 0 0 0 0 0 0 0 0 0 0 0 0 0 0 0 0 0 -484.252 0 0 0 2161.09 0 0 0 0 0 0 0 0 0 0 
0 0 0 0 -489.441 819.956 1331.9 0 0 -1077.23 0 0 0 -713.294 1767.71 0 961.257 0 0 0 0 1941.21 0 0 0 948.134 0 0 0 0 0 0 0 0 0 -1934.03 -132.374 -1479.61 0 0 0 0 0 0 0 0 0 0 0 0 0 0 0 0 0 0 0 0 0 -1899.85 315.943 0 356.838 0 0 
0 0 0 0 0 0 2002.7 750.069 -1594.36 0 1887.19 0 -1378.6 0.07 420.164 0 0 -1736.58 0 1852.7 158.01 437.254 814.005 0 0 0 0 0 0 0 0 0 0 0 0 0 0 0 0 -1568.88 0 0 -88.7326 2036.73 0 0 969.802 0 0 0 0 0 2005.91 0 0 -785.928 1485.11 0 0 0 0 0 -2195.58 0 0 
242.546 1279.11 0 0 0 0 0 0 -494.171 0 175.863 0 -1148.79 2191.76 0.08 0 1489.07 0 -1227.38 1594.06 1284.91 0 0 -2311.24 1100.27 -749.916 -534.303 0 0 0 0 659.276 894.421 -341.578 1205.1 1538.82 0 0 0 0 0 0 0 0 -883.435 0 0 0 907.086 1684.39 0 0 0 0 -1657.23 0 0 0 0 0 0 0 1694.46 0 0 
0 0 2013.53 1446.65 0 1661.35 0 2443.39 1696.45 0 0 0 0 0 0 0.03 0 1412.78 0 601.138 0 743.66 0 0 0 0 0 -2267.3 0 0 -1440.7 0 0 0 0 0 85.0703 0 0 0 0 0 0 0 0 0 0 0 0 0 0 0 0 -1422.39 0 0 0 0 0 0 0 0 0 0 0 
1805.7 -851.848 0 0 0 0 0 0 0 0 0 -683.691 -122.761 0 303.125 0 0.07 0 0 1335.87 1395.08 0 0 0 0 0 0 0 0 0 1976.15 0 0 0 0 0 0 0 0 0 0 0 0 0 0 0 0 0 384.152 0 0 0 431.15 434.507 0 -2421.87 0 0 579.012 0 0 0 0 0 0 
0 0 1926.4 0 0 0 0 0 0 -1764.81 0 0 0 760.14 0 1162.37 0 0.07 2245.02 -107.349 0 0 0 0 448.393 -113.758 0 2310.48 0 0 0 0 0 0 0 -478.759 0 0 0 0 -1335.57 0 0 0 0 0 712.073 0 0 0 0 0 0 0 0 0 0 0 0 0 0 0 0 0 0 
1040.15 0 0 0 -840.709 2010.79 0 -1442.84 0 0 0 1595.58 0 0 -1027.63 0 0 -1624.58 0.05 0 1377.83 349.818 2305.29 -2373.65 1204.18 2331.39 0 10.6052 0 0 0 0 -1262.47 0 0 0 0 0 -2203.97 0 0 0 0 0 0 0 0 0 0 399.869 6.48518 0 0 2142.63 0 0 0 0 0 0 0 0 0 240.41 0 
0 0 0 0 0 2114.25 0 0 0 -1405.91 0 -1228.6 0 480.285 -205.466 1156.42 2219.38 712.378 0 0.05 1015.73 -1774.27 0 0 1477.78 1526.76 0 0 0 0 0 0 0 0 0 0 0 0 0 0 0 0 0 0 0 0 0 0 0 0 0 0 0 0 0 0 -1862.16 0 0 0 1477.02 0 0 0 0 
0 -2261.19 1194.88 0 0 0 1288.42 1538.21 0 0 -1871.47 0 0 -1697.52 -577.792 0 2126.76 0 961.715 -2371.97 0.09 0 2397.15 0 0 268.792 0 0 0 0 0 0 0 0 0 0 0 0 0 0 0 0 0 0 0 0 0 0 1290.55 0 0 0 0 0 0 0 0 0 0 0 0 0 0 0 0 
0 0 0 0 508.515 1613.9 2176.66 0 0 0 0 0 996.658 2149.95 0 -2036.58 0 0 1407.9 -127.491 0 0.08 0 -1653.11 0 0 0 0 0 0 0 0 0 0 0 0 0 0 0 0 0 0 0 0 0 0 0 -1104.08 0 1621.52 0 0 0 0 0 0 0 1545.99 0 0 0 0 0 0 0 
0 0 0 1833.17 0 474.029 0 0 0 0 0 0 0 628.91 0 0 0 0 2110.13 0 533.54 0 0.06 0 0 0 -668.737 0 0 1932.66 0 0 -171.59 -1564.46 0 0 0 0 0 0 0 0 0 0 0 0 0 1272.09 0 0 0 -1297.11 0 0 0 -1049.15 1204.03 0 1032.06 0 0 0 -264.367 0 39.2926 
0 0 0 0 0 1908.4 1879.25 -547.884 0 2283.17 0 0 0 0 990.707 0 0 0 1969.74 0 0 2276.15 0 0.02 0 0 0 0 0 1064.41 0 -39.2926 0 0 0 0 0 0 0 0 0 0 0 0 0 0 0 0 0 0 -1973.1 0 0 -2018.57 0 0 0 0 127.338 0 0 0 -1298.94 0 0 
2264.55 0 0 0 0 2191.76 0 184.256 0 0 302.973 0 0 0 11.3681 0 0 922.193 1694.46 -447.172 0 0 0 0 0.05 -64.6229 0 566.5 -798.288 0 0 0 0 0 0 0 0 0 0 488.067 0 0 0 0 0 0 1697.21 0 0 0 -2043.6 0 0 0 0 0 0 0 0 0 0 -997.269 0 0 0 
2451.17 0 0 0 0 1135.67 0 0 0 -1911.6 0 0 -1155.96 0 2084.03 0 0 2229.3 -2123.86 -2087.85 1255.46 0 0 0 -422.605 0.01 0 -104.602 0 0 0 0 0 0 0 0 0 0 0 0 0 0 0 0 0 0 0 0 0 0 0 0 0 0 0 0 0 203.635 0 0 0 0 0 0 0 
363.247 -207.602 1107.9 0 753.578 0 0 720.161 0 0 0 2154.38 0 0 832.011 0 0 0 0 0 0 0 -1416.9 0 0 0 0.07 0 202.414 0 0 0 0 0 2047.11 0 -1000.78 1162.22 1498.84 0 0 0 0 0 0 0 0 0 0 0 0 0 0 0 0 0 0 0 0 0 0 0 0 0 0 
1829.81 1888.71 818.735 0 0 0 0 0 0 1493.65 0 0 0 0 0 -741.218 0 -50.2792 -65.6911 0 0 0 0 0 -1393.86 531.098 0 0.04 0 0 0 -2233.12 0 0 0 0 0 0 0 0 0 0 -553.072 0 0 2464.29 0 0 0 0 0 748.848 0 0 0 0 0 0 0 0 0 0 0 0 0 
2456.21 0 0 0 118.793 0 -58.2141 0 0 0 -1561.25 0 0 0 0 0 0 0 0 0 0 0 0 0 2287.9 0 2129.66 0 0.03 0 1247.22 0 0 0 0 0 0 1678.14 -1435.36 0 0 0 0 0 0 0 0 0 0 1701.18 0 0 -1908.86 0 0 0 0 0 0 0 0 0 0 0 2311.55 
0 0 0 0 -1032.98 0 0 0 0 0 0 156.178 0 0 0 0 0 0 0 0 0 0 1444.06 2474.36 0 0 0 0 0 0.06 0 0 0 0 0 0 0 0 0 0 -241.63 0 0 -846.965 1212.88 -1719.64 0 0 0 0 0 0 0 0 0 0 0 0 0 0 0 0 -402.921 0 0 
0 0 0 0 0 0 0 0 0 0 0 0 0 0 0 2283.62 731.758 0 0 0 0 0 0 0 0 0 0 0 1538.36 0 0.04 2465.82 0 0 0 82.6289 0 0 0 0 0 0 0 0 0 0 0 0 -1952.19 0 -1163.14 0 0 0 0 0 0 0 1758.4 0 0 0 0 0 0 
0 0 0 1504.18 0 0 0 0 0 0 0 0 0 0 1167.87 0 0 0 0 0 0 0 0 1546.91 0 0 0 -1909.62 0 0 1835.31 0.08 0 0 -6.33259 0 1091.57 0 0 0 0 0 0 0 0 0 0 0 0 0 0 0 0 0 0 0 0 0 -270.47 0 0 0 0 0 0 
-1016.34 0 0 -1245.38 0 0 0 0 0 0 -1896.65 0 0 0 -539.644 0 0 0 890.606 0 0 0 2451.93 0 0 0 0 0 0 0 0 0 0.05 1492.58 0 0 0 0 -51.1948 0 0 0 1668.52 0 0 -378.506 0 0 0 0 0 1916.33 0 0 0 0 0 0 0 0 0 0 0 0 0 
0 0 0 1572.7 0 0 0 0 0 0 0 0 0 0 9.84222 0 0 0 0 0 0 0 785.165 0 0 0 0 0 0 0 0 0 873.363 0.01 0 0 0 0 0 0 0 -1799.75 0 0 0 0 -96.9726 0 0 0 1030.84 0 0 0 0 0 143.666 0 0 685.98 0 1730.32 0 0 0 
0 0 0 0 0 0 0 0 0 0 0 0 0 0 2339.93 0 0 0 0 0 0 0 0 0 0 0 -2200.77 0 0 0 0 551.698 0 0 0.03 0 0 0 0 0 0 0 0 0 0 0 0 0 0 0 0 0 0 0 0 0 0 0 0 0 0 0 0 1295.74 0 
0 0 0 0 0 0 2128.59 0 77.4407 0 0 0 -97.2777 0 155.11 0 0 -1223.41 0 0 0 0 0 0 0 0 0 0 0 0 784.249 0 0 0 0 0.01 0 0 0 0 0 593.509 0 0 0 0 0 -626.774 1135.98 0 0 0 0 2464.75 0 0 0 1611 0 0 0 0 0 0 4.50148 
0 0 0 0 0 0 0 0 0 0 -1746.65 0 2198.63 0 0 1704.54 0 0 0 0 0 0 0 0 0 0 1204.95 0 0 0 0 -1890.55 0 0 0 0 0.03 0 0 0 0 0 0 0 0 0 0 0 0 0 0 0 0 0 0 0 1144.83 0 0 0 0 0 0 0 0 
0 0 0 0 0 0 0 0 0 0 1153.52 0 -286.34 0 0 0 0 0 0 0 0 0 0 0 0 0 1921.83 0 557.192 0 0 0 0 0 0 0 0 0.09 0 308.618 0 2493.29 1881.85 0 0 0 0 0 0 0 0 0 -2339.78 0 0 0 0 0 -270.318 0 142.75 0 0 -1520.66 0 
0 -777.535 0 0 0 0 0 0 0 0 0 0 0 0 0 0 0 0 1009.93 0 0 0 0 0 0 0 389.492 0 1072.5 0 0 0 1821.73 0 0 0 0 0 0.04 0 1804.18 0 0 0 2355.95 0 0 0 0 0 0 0 0 0 0 0 0 0 -2090.14 0 0 0 0 1927.78 0 
0 0 0 2042.22 0 0 0 0 0 0 0 0 0 650.883 0 0 0 0 0 0 0 0 0 0 913.648 0 0 0 0 0 0 0 0 0 0 0 0 861.919 0 0.04 0 0 0 0 0 0 1334.35 0 0 -1694.31 0 0 0 0 0 0 0 -1504.49 1248.13 0 0 0 71.4896 2249.44 0 
0 0 -1497.31 0 0 0 0 0 0 0 0 0 0 0 0 0 0 959.12 0 0 0 0 0 0 0 0 0 0 0 224.845 0 0 0 0 0 0 0 0 1311 0 0.02 0 0 0 0 0 0 0 -158.62 0 0 0 0 0 0 0 0 0 0 0 0 0 0 0 0 
1472.44 0 0 0 0 0 0 0 0 0 0 0 0 0 0 0 0 0 0 0 0 0 0 0 0 0 0 0 0 0 0 0 0 2141.25 0 -140.004 0 -1348.69 0 0 0 0.02 718.787 0 0 0 0 0 0 0 0 0 0 0 0 0 0 0 0 0 0 -671.484 0 0 0 
0 0 0 0 0 0 0 0 0 0 0 0 0 1037.86 0 0 0 0 0 0 0 0 0 0 0 0 0 1691.11 0 0 0 0 2179.56 0 0 0 0 230.033 0 0 0 2176.35 0.04 0 -376.522 0 1865.67 564.058 0 0 2048.78 0 0 0 0 0 0 0 0 0 0 0 0 0 0 
0 0 0 0 0 2037.19 1440.86 0 0 -1609.32 0 0 0 2439.12 0 0 0 0 0 0 0 0 0 0 0 0 0 0 0 -1186.03 0 0 0 0 0 0 0 0 0 0 0 0 0 0.04 0 0 0 0 0 -1996.44 0 0 934.248 0 0 0 0 0 0 1367.46 0 0 0 54.7044 0 
0 0 0 0 0 0 0 -315.638 0 0 0 0 0 0 2105.7 0 0 0 0 0 0 0 0 0 0 0 0 0 0 1023.21 0 0 0 0 0 0 0 0 1790.6 0 0 0 -1125.6 0 0.09 0 0 0 0 0 0 0 0 0 0 0 0 0 0 0 0 0 0 0 0 
0 0 0 0 0 0 0 1736.88 0 0 0 0 0 0 0 0 0 0 0 0 0 0 0 0 0 0 0 884.198 0 1730.48 0 0 -470.061 0 0 0 0 0 0 0 0 0 0 0 0 0.06 0 921.735 0 0 0 0 0 0 0 0 0 0 0 0 0 2376.09 0 1886.73 0 
0 0 0 0 0 0 0 0 0 0 0 0 0 -750.679 0 0 0 -1095.69 0 0 0 0 0 0 -1555.3 0 0 0 0 0 0 0 0 2384.03 0 0 0 0 0 1473.82 0 0 -1800.82 0 0 0 0 0 0 0 0 0 0 944.166 0 -397.122 1103.93 0 0 -360.805 0 0 0 0 0 
0 0 0 0 0 0 0 0 2078.39 0 0 0 0 0 0 0 0 0 0 0 0 651.494 642.338 0 0 0 0 0 0 0 0 0 0 0 0 1199.45 0 0 0 0 0 0 -1338.16 0 0 -1717.81 0 0.09 0 0 0 1997.97 0 0 0 0 0 0 0 0 0 0 0 -1856.82 0 
-1026.11 0 0 0 0 0 0 0 0 0 0 0 0 0 2251.43 0 -216.3 0 0 0 2472.08 0 0 0 0 0 0 0 0 0 2407.53 0 0 0 0 -1416.29 0 0 0 0 1873 0 0 0 0 0 0 0 0.01 0 0 0 0 0 -1972.33 0 0 0 0 0 -1168.02 0 0 541.017 -178.304 
0 0 0 0 0 -382.321 0 0 0 0 0 0 0 0 -2169.03 0 0 0 1333.43 0 0 -455.412 0 0 0 0 0 0 1343.2 0 0 0 0 0 0 0 0 0 0 20.6763 0 0 0 1193.96 0 0 0 0 0 0.04 0 0 0 0 0 0 0 0 0 0 0 0 0 0 0 
0 -1173.82 0 0 0 0 0 0 0 0 0 175.863 0 0 0 0 0 0 1514.86 0 0 0 0 2421.57 -414.212 0 0 0 0 0 625.858 0 0 -880.078 0 0 0 0 0 0 0 0 1425.29 0 0 0 0 0 0 0 0.08 0 0 1141.62 0 0 0 0 -517.823 0 0 0 0 0 0 
0 0 0 0 0 839.641 0 0 0 0 -674.078 0 0 0 0 0 0 0 0 0 0 0 1483.89 0 0 0 0 1316.03 0 0 0 0 454.955 0 0 0 0 0 0 0 0 0 0 0 0 0 0 1299.1 0 0 0 0.09 0 0 0 0 0 0 0 -2020.86 0 0 0 0 0 
0 0 0 1103.93 0 0 68.8955 -928.907 0 490.661 0 0 0 1838.66 0 0 1146.2 0 0 0 0 0 0 0 0 0 0 0 -2321.92 0 0 0 0 0 0 0 0 114.978 0 0 0 0 0 2004.53 0 0 0 0 0 0 0 0 0.02 0 -831.401 0 0 0 0 0 0 2204.58 0 0 2372.13 
0 0 0 0 0 0 0 -402.921 -1157.19 0 0 0 0 0 0 2278.59 1969.89 0 -1764.81 0 0 0 0 1156.12 0 0 0 0 0 0 0 0 0 0 0 678.198 0 0 0 0 0 0 0 0 0 0 -1904.43 0 0 0 498.901 0 0 0.07 1905.19 0 0 0 0 0 0 0 0 0 -1018.63 
0 0 0 1594.52 0 0 0 0 0 0 0 -98.4985 0 0 2480.16 0 0 0 0 0 0 0 0 0 0 0 0 0 0 0 0 0 0 0 0 0 0 0 0 0 0 0 0 0 0 0 0 0 195.395 0 0 0 1908.7 -2115.92 0.06 0 -2130.27 0 0 0 0 0 0 0 0 
0 0 0 0 -1294.98 2424.01 0 0 0 0 2280.72 0 0 2491.61 0 0 1979.51 0 0 0 0 0 1683.02 0 0 0 0 0 0 0 0 0 0 0 0 0 0 0 0 0 0 0 0 0 0 0 -858.715 0 0 0 0 0 0 0 0 0.04 0 0 0 0 0 -1729.1 2473.6 -2413.79 0 
-1845.99 0 0 0 0 0 0 0 0 0 0 0 0 979.11 0 0 0 0 0 -2186.57 0 0 -1149.1 0 0 0 0 0 0 0 0 0 0 642.643 0 0 1782.36 0 0 0 0 0 0 0 0 0 2295.22 0 0 0 0 0 0 0 2134.54 0 0.08 0 0 0 0 0 0 0 2360.38 
0 667.669 0 0 0 1248.13 0 0 0 0 1838.97 0 0 0 0 0 0 0 0 0 0 -742.439 0 0 0 1188.62 0 0 0 0 0 0 0 0 0 -808.206 0 0 0 422.3 0 0 0 0 0 0 0 0 0 0 0 0 0 0 0 0 0 0.03 0 0 -545.747 0 0 0 0 
0 0 0 0 0 0 0 0 0 0 -1673.86 0 0 0 0 0 2331.84 0 0 0 0 0 1021.84 -422.3 0 0 0 0 0 0 590.762 2094.87 0 0 0 0 0 387.051 1390.96 -1934.34 0 0 0 0 0 0 0 0 0 0 -1098.13 0 0 0 0 0 0 0 0.01 0 0 0 0 0 0 
10.3 -236.9 0 0 0 0 0 0 795.694 0 0 0 -908.765 0 0 0 0 0 0 0 0 0 0 0 0 0 0 0 0 0 0 0 0 306.33 0 0 0 0 0 0 0 0 0 1759.93 0 0 -223.319 0 0 0 0 1878.49 0 0 0 0 0 0 0 0.03 0 2177.27 0 0 0 
-1168.17 452.361 0 0 2102.65 0 0 0 -2261.35 0 0 0 1489.07 0 0 0 0 0 0 -105.365 0 0 0 0 0 0 0 0 0 0 0 0 0 0 0 0 0 930.28 0 0 0 0 0 0 0 0 0 0 1992.02 0 0 0 0 0 0 0 0 564.821 0 0 0.09 0 0 0 0 
0 0 0 0 0 0 1988.81 0 0 0 0 0 0 0 0 0 0 0 0 0 0 0 0 0 257.5 0 0 0 0 0 0 0 0 -1896.34 0 0 0 0 0 0 0 1114.76 0 0 0 -1812.27 0 0 0 0 0 0 2123.55 0 0 1168.94 0 0 0 1892.38 0 0.02 1570.41 0 0 
0 0 0 0 0 0 0 0 -931.043 -407.041 0 0 750.984 -2259.06 999.1 0 0 0 0 0 0 0 1359.98 537.507 0 0 0 0 0 2406.77 0 0 0 0 0 0 0 0 0 -2018.57 0 0 0 0 0 0 0 0 0 0 0 0 0 0 0 -2289.73 0 0 0 0 0 2338.71 0.05 0 1654.64 
0 0 0 0 0 0 0 0 0 0 0 0 0 0 0 0 0 0 1345.79 0 0 0 0 0 0 0 0 0 0 0 0 0 0 0 -1777.93 0 0 -914.563 -246.208 1063.8 0 0 0 -2153.77 0 1177.94 0 1441.31 990.555 0 0 0 0 0 0 178.61 0 0 0 0 0 0 0 0.06 0 
0 0 0 639.744 0 0 0 0 0 0 869.701 0 0 0 0 0 0 0 0 0 0 0 58.8244 0 0 0 0 0 -1582.92 0 0 0 0 0 0 2114.09 0 0 0 0 0 0 0 0 0 0 0 0 2172.54 0 0 0 -210.501 -1750.77 0 0 1739.63 0 0 0 0 0 -1802.8 0 0.09 
