*Vertices 49
*Matrix 
0.02 0 0 856.12 0 0 0 0 0 0 2119.13 -1992.17 0 0 0 0 0 0 0 0 0 1094.32 1809.21 0 -1802.65 0 0 0 0 0 0 0 0 0 0 0 0 0 0 0 0 0 0 0 0 0 0 0 0 
0 0.02 0 0 0 0 0 0 0 0 0 0 0 0 0 0 0 0 0 0 0 0 0 0 0 0 0 0 0 0 0 0 0 1061.36 0 0 0 0 1185.87 0 0 0 -2492.07 0 1693.09 0 1782.82 0 0 
0 0 0.07 0 107.349 0 0 0 0 0 0 0 0 0 0 0 593.051 0 0 0 0 0 0 0 0 0 0 0 0 0 0 0 0 0 2441.86 0 0 -496.002 0 0 0 0 1819.59 0 0 0 2270.5 0 0 
45.3963 0 0 0.08 0 0 1993.09 0 -194.784 -879.925 0 0 0 0 0 0 0 0 0 0 0 0 0 0 0 0 0 0 0 0 -973.159 0 0 0 1440.55 0 0 0 0 0 0 0 0 0 0 0 0 0 0 
0 0 104.45 0 0.08 0 0 554.445 0 0 0 0 0 0 0 0 0 0 0 0 0 817.972 0 0 0 0 0 0 -756.172 0 0 0 0 2219.99 0 1055.86 0 0 0 1896.65 0 0 0 0 0 0 0 0 -1104.39 
0 0 0 0 0 0.02 0 0 0 1026.41 0 0 833.384 0 0 0 0 0 1032.36 0 0 0 0 0 0 0 0 0 0 0 0 0 0 2089.37 0 0 0 0 0 0 0 0 0 1741.16 -2118.21 0 0 0 0 
0 0 0 -1582.16 0 0 0.04 -1688.21 2458.95 0 0 2342.98 0 0 0 0 0 0 0 0 0 0 0 0 0 0 0 0 2420.96 0 0 0 0 0 0 0 0 0 0 0 0 0 0 0 0 0 0 0 0 
0 0 0 0 1443.3 0 1568.27 0.08 0 0 833.079 0 0 0 -161.061 0 0 0 0 0 0 0 0 0 0 0 0 0 0 0 740.76 0 0 -182.272 0 0 0 0 0 1292.69 0 0 833.079 0 0 0 0 0 0 
0 0 0 -687.048 0 0 1649.91 0 0.01 0 0 0 0 0 0 0 0 0 0 0 0 0 0 0 0 0 0 0 848.491 0 1581.24 0 0 -2008.35 0 0 0 0 0 0 0 0 0 0 0 0 0 0 0 
0 0 0 1895.12 0 2387.08 0 0 0 0.02 0 0 0 0 0 0 1914.5 0 0 0 0 0 0 0 0 0 0 0 0 0 0 0 0 0 0 0 0 0 1688.51 0 683.844 0 0 0 0 0 0 0 0 
1962.42 0 0 0 0 0 0 1457.79 0 0 0.05 0 0 0 -2094.1 0 0 0 0 0 0 0 0 773.415 0 0 0 0 0 0 0 0 0 -906.323 0 0 0 0 0 0 -2384.95 0 0 0 1317.26 0 0 0 0 
-802.713 0 0 0 0 0 -2433.62 0 0 0 0 0.01 2295.83 0 0 0 0 0 0 0 0 0 0 0 0 0 0 2182 0 1155.96 0 1883.53 0 0 397.732 0 -2185.05 0 0 0 0 0 0 -1015.88 2460.02 0 0 0 0 
0 0 0 0 0 2416.68 0 0 0 0 0 91.937 0.02 0 0 0 0 0 0 860.698 -2045.12 2456.66 0 0 0 0 0 0 0 0 0 0 0 -494.629 1030.69 0 0 602.054 0 0 0 0 0 0 1113.54 0 0 0 0 
0 0 0 0 0 0 0 0 0 0 0 0 0 0.04 0 2181.84 0 0 0 0 0 0 0 0 0 0 0 2386.62 -1339.84 0 0 0 0 0 1058 0 0 0 1332.36 0 0 0 0 0 0 2288.51 -850.78 0 0 
0 0 0 0 0 0 0 -1439.02 0 0 1455.81 0 0 0 0.07 0 0 0 0 0 0 2245.17 0 0 0 0 0 0 0 -1957.69 0 0 1680.88 0 0 1476.1 0 0 0 0 1679.66 0 0 0 0 0 0 0 0 
0 0 0 0 0 0 0 0 0 0 0 0 0 2203.05 0 0.02 0 1300.93 0 -2337.95 0 0 0 0 0 317.164 0 -1530.58 0 0 816.294 0 0 0 0 0 0 0 0 0 0 202.872 -2054.28 0 0 0 2130.12 0 0 
0 0 27.6955 0 0 0 0 0 0 1247.06 0 0 0 0 0 0 0.07 0 0 0 0 0 0 0 0 0 1253.93 0 0 0 0 -2082.05 0 0 0 0 1260.95 1111.1 0 0 0 0 0 0 0 0 0 0 0 
0 0 0 0 0 0 0 0 0 0 0 0 0 0 0 2423.7 0 0.04 0 0 0 0 0 244.377 0 0 0 0 0 0 0 0 0 0 0 0 0 0 0 0 0 -245.75 0 0 0 0 -251.396 0 0 
0 0 0 0 0 1257.29 0 0 0 0 0 0 0 0 0 0 0 0 0.09 0 0 0 0 0 -1824.47 0 0 0 0 0 1480.38 0 0 -1437.35 0 0 0 0 0 0 0 0 0 0 2367.7 0 0 0 0 
0 0 0 0 0 0 0 0 0 0 0 0 82.9341 0 0 17.9296 0 0 0 0.01 1115.22 -458.77 0 0 0 0 0 0 0 0 0 0 0 0 0 0 0 0 0 1883.83 0 0 0 0 0 0 0 0 0 
0 0 0 0 0 0 0 0 0 0 0 0 -1028.24 0 0 0 0 0 0 707.648 0.09 0 0 0 0 0 0 0 0 0 0 0 0 0 1702.55 0 0 0 0 0 0 0 1643.96 0 0 0 0 0 0 
1176.11 0 0 0 2433.16 0 0 0 0 0 0 0 -1601.54 0 290.918 0 0 0 0 -1050.52 0 0.01 2116.23 0 -2374.57 0 1391.87 0 1720.86 0 0 0 0 0 0 0 0 0 0 0 69.5059 -1041.98 2484.74 0 0 0 0 0 0 
2294.61 0 0 0 0 0 0 0 0 0 0 0 0 0 0 0 0 0 0 0 0 -1953.41 0.05 0 0 0 -1312.22 0 0 0 0 0 0 1516.54 0 0 0 0 0 0 0 0 0 0 0 0 0 0 0 
0 0 0 0 0 0 0 0 0 0 2282.25 0 0 0 0 0 0 1438.87 0 0 0 0 0 0.09 -410.703 0 0 0 0 0 0 2165.36 0 0 0 0 0 0 0 0 949.202 0 -1308.86 0 0 0 0 0 0 
423.826 0 0 0 0 0 0 0 0 0 0 0 0 0 0 0 0 0 -812.326 0 0 915.021 0 -1802.96 0.05 0 0 1285.21 0 0 0 0 0 1560.95 0 1359.98 0 0 0 0 0 0 0 0 0 0 0 0 0 
0 0 0 0 0 0 0 0 0 0 0 0 0 0 0 2486.42 0 0 0 0 0 0 0 0 0 0.08 2028.79 0 0 0 0 0 0 -1560.03 1241.11 0 0 0 0 0 0 0 1173.06 0 0 0 0 0 0 
0 0 0 0 0 0 0 0 0 0 0 0 0 0 0 0 -1099.51 0 0 0 0 -1497.31 2267.3 0 0 -640.66 0.04 0 0 0 0 0 0 0 0 0 0 0 0 1613.74 -609.531 1502.66 0 0 0 0 0 0 0 
0 0 0 0 0 0 0 0 0 0 0 1335.41 0 1941.82 0 -1912.06 0 0 0 0 0 0 0 0 1324.58 0 0 0.09 0 0 0 729.621 0 0 0 0 0 0 0 0 0 0 0 0 0 0 0 0 0 
0 0 0 0 2300.56 0 1387.91 0 -1403.93 0 0 0 0 1930.07 0 0 0 0 0 0 0 1274.38 0 0 0 0 0 0 0.05 0 0 0 -1159.93 1826.91 0 0 0 0 0 0 0 0 0 0 0 0 0 0 0 
0 0 0 0 0 0 0 0 0 0 0 2182.15 0 0 -1748.79 0 0 0 0 0 0 0 0 0 0 0 0 0 0 0.08 0 0 0 0 0 0 2207.33 0 0 -313.196 0 389.34 0 0 0 0 0 0 0 
0 0 0 -1632.97 0 0 0 -890.759 1010.09 0 0 0 0 0 0 733.589 0 0 1130.02 0 0 0 0 0 0 0 0 0 0 0 0.07 0 0 1503.72 0 0 0 0 0 0 -1125.6 0 0 0 0 2477.42 0 0 0 
0 0 0 0 0 0 0 0 0 0 0 -606.174 0 0 0 0 685.369 0 0 0 0 0 0 -1924.88 0 0 0 2191.76 0 0 0 0.08 0 0 0 0 0 0 0 0 0 0 0 0 0 0 0 0 0 
0 0 0 0 0 0 0 0 0 0 0 0 0 0 1498.99 0 0 0 0 0 0 0 0 0 0 0 0 0 441.069 0 0 0 0.07 0 0 0 0 131.153 0 664.464 0 0 0 0 0 0 1080.13 0 0 
0 1770 0 0 -853.984 1855.6 0 799.203 1491.06 0 -1227.23 0 -2369.84 0 0 0 0 0 -1142.38 0 0 0 -2131.34 0 1304.28 696.966 0 0 -310.45 0 2030.02 0 0 0.01 0 1245.69 2264.24 0 0 0 0 0 0 0 0 0 -11.8259 0 0 
0 0 -2212.21 1609.32 0 0 0 0 0 0 0 2051.38 587.1 1177.79 0 0 0 0 0 0 1889.32 0 0 0 0 436.338 0 0 0 0 0 0 0 0 0 0 0 0 -2051.84 1197.32 640.507 0 1061.51 0 0 0 0 0 0 
0 0 0 0 1839.88 0 0 0 0 0 0 0 0 0 -181.814 0 0 0 0 0 0 0 0 0 608.158 0 0 0 0 0 0 0 0 1274.68 0 0.01 0 0 0 0 0 0 0 0 0 0 0 0 0 
0 0 0 0 0 0 0 0 0 0 0 1659.83 0 0 0 0 -63.5548 0 0 0 0 0 0 0 0 0 0 0 0 121.235 0 0 0 -896.405 0 0 0.09 0 0 0 0 0 0 2429.65 0 1878.03 0 0 0 
0 0 -528.199 0 0 0 0 0 0 0 0 0 1021.38 0 0 0 807.901 0 0 0 0 0 0 0 0 0 0 0 0 0 0 0 2213.74 0 0 0 0 0.01 0 0 0 0 0 0 0 0 0 0 0 
0 1339.53 0 0 0 0 0 0 0 1775.95 0 0 0 1709.88 0 0 0 0 0 0 0 0 0 0 0 0 0 0 0 0 0 0 0 0 1763.89 0 0 0 0.06 0 0 0 0 0 0 0 0 0 0 
0 0 0 0 1260.64 0 0 1218.68 0 0 0 0 0 0 0 0 0 0 0 -2067.09 0 0 0 0 0 0 2353.36 0 0 553.835 0 0 2201.22 0 1543.86 0 0 0 0 0.02 0 -469.604 0 0 0 0 0 0 0 
0 0 0 0 0 0 0 0 0 727.485 -2321.16 0 0 0 -1756.72 0 0 0 0 0 0 1538.51 0 -842.54 0 0 -1500.52 0 0 0 390.408 0 0 0 2259.82 0 0 0 0 0 0 0 1638 0 -1059.07 0 0 0 0 
0 0 0 0 0 0 0 0 0 0 0 0 0 0 0 1456.27 0 2008.35 0 0 0 104.45 0 0 0 0 575.961 0 0 -111.469 0 0 0 0 0 0 0 0 0 -1787.55 0 0.05 0 0 0 0 2027.57 0 0 
0 -353.328 -876.11 0 0 0 0 -894.879 0 0 0 0 0 0 0 -1923.35 0 0 0 0 2032.15 1102.25 0 1773.51 0 -461.516 0 0 0 0 0 0 0 0 1815.16 0 0 0 0 0 -1807.84 0 0.01 0 0 0 0 0 0 
0 0 0 0 0 1488.46 0 0 0 0 0 -331.507 0 0 0 0 0 0 0 0 0 0 0 0 0 0 0 0 0 0 0 0 0 0 0 0 750.984 0 0 0 0 0 0 0.06 0 2283.62 0 1106.52 0 
0 1185.87 0 0 0 2280.11 0 0 0 0 1918.93 1013.75 -207.297 0 0 0 0 0 1222.5 0 0 0 0 0 0 0 0 0 0 0 0 0 0 0 0 0 0 0 0 0 -104.45 0 0 0 0.06 0 0 0 0 
0 0 0 0 0 0 0 0 0 0 0 0 0 1329.16 0 0 0 0 0 0 0 0 0 0 0 0 0 0 0 0 -1388.82 0 0 0 0 0 1026.87 0 0 0 0 0 0 499.054 0 0 0 0 0 
0 1344.26 400.632 0 0 0 0 0 0 0 0 0 0 -538.575 0 -2020.71 0 884.35 0 0 0 0 0 0 0 0 0 0 0 0 0 0 194.784 210.501 0 0 0 0 0 0 0 1689.58 0 0 0 0 0.07 0 0 
0 0 0 0 0 0 0 0 0 0 0 0 0 0 0 0 0 0 0 0 0 0 0 0 0 0 0 0 0 0 0 0 0 0 0 0 0 0 0 0 0 0 0 170.675 0 0 0 0.01 0 
0 0 0 0 1240.81 0 0 0 0 0 0 0 0 0 0 0 0 0 0 0 0 0 0 0 0 0 0 0 0 0 0 0 0 0 0 0 0 0 0 0 0 0 0 0 0 0 0 0 0.04 
