*Vertices 28
*Matrix 
0.05 -295.953 0 2221.37 2292.32 0 0 1439.79 0 0 996.2 0 0 0 0 1036.48 0 0 0 976.058 0 0 0 0 0 0 0 0 
-2325.13 0.04 2485.05 0 1719.79 0 0 0 0 1119.04 0 825.602 0 0 0 0 0 0 0 0 0 0 0 -1168.94 0 0 0 0 
0 555.666 0.06 0 0 1738.41 0 51.3474 -1971.11 0 0 0 1570.86 0 0 -416.654 0 0 0 0 0 0 0 0 0 0 0 0 
1057.7 0 0 0.06 0 0 0 2088 -2192.68 1743.9 0 0 0 0 0 0 219.657 0 0 0 0 0 0 1459.01 0 0 2280.72 0 
685.827 -474.334 0 0 0.08 -601.291 1722.08 0 0 626.774 0 1341.82 0 -2375.33 0 0 0 0 0 0 0 0 0 1163.44 0 0 0 0 
0 0 1757.94 0 1832.26 0.03 0 0 0 2205.5 0 0 0 0 0 -219.352 -937.605 0 1031.14 0 0 1494.87 0 0 0 0 0 0 
0 0 0 0 2163.69 0 0.05 0 1509.67 0 -310.602 0 0 0 0 0 0 0 0 0 0 0 0 0 0 0 0 0 
-2094.1 0 1109.58 1969.89 0 0 0 0.03 -1529.21 2132.25 0 0 1240.2 0 1854.23 0 0 432.371 0 0 0 0 2439.73 0 0 0 0 0 
0 0 -74.3889 2327.72 0 0 2270.81 980.789 0.01 489.593 0 0 0 0 0 0 0 0 0 0 165.639 0 0 0 0 0 0 -931.806 
0 1124.99 0 -915.326 1433.07 347.377 0 327.235 1724.52 0.07 0 768.685 0 0 0 0 0 0 0 845.744 0 0 0 0 0 0 0 0 
1093.86 0 0 0 0 0 882.214 0 0 0 0.05 0 0 0 0 0 0 0 0 0 0 343.715 0 0 0 0 0 0 
0 1343.35 0 0 -157.399 0 0 0 0 92.7 0 0.01 377.743 0 1208.3 0 0 0 0 1200.22 0 0 0 0 0 -704.443 0 0 
0 0 2126.61 0 0 0 0 1321.83 0 0 0 1031.45 0.09 0 0 0 0 0 0 0 0 0 0 0 2245.17 0 0 0 
0 0 0 0 1911.3 0 0 0 0 0 0 0 0 0.06 0 0 0 0 0 0 0 0 0 0 0 0 0 0 
0 0 0 0 0 0 0 2214.65 0 0 0 1075.09 0 0 0 0 0 0 0 0 0 0 0 0 0 0 -1019.39 0 
997.269 0 276.879 0 0 -1725.44 0 0 0 0 0 0 0 0 0 0.05 0 0 1592.99 -188.376 0 0 0 0 27.6955 0 0 0 
0 0 0 1770.46 0 509.583 0 0 0 0 0 0 0 0 0 0 0.06 0 0 0 1428.19 0 0 0 0 0 0 0 
0 0 0 0 0 0 0 1075.24 0 0 0 0 0 0 0 0 0 0.02 0 0 0 0 0 0 -1145.59 0 0 0 
0 0 0 0 0 62.6392 0 0 0 0 0 0 0 0 0 2276.15 0 0 0.08 0 0 2380.21 -1167.1 0 0 0 0 0 
128.559 0 0 0 0 0 0 0 0 -1370.2 0 277.032 0 0 0 2395.32 0 0 0 0.03 2408.14 0 832.163 0 0 782.723 0 0 
0 0 0 0 0 0 0 0 2345.42 0 0 0 0 0 0 0 -127.644 0 0 1477.94 0.05 0 0 0 0 0 0 -726.875 
0 0 0 0 0 1526 0 0 0 0 -1087.15 0 0 0 0 0 0 0 1760.84 0 0 0.08 0 0 1895.73 0 0 0 
0 0 0 0 0 0 0 998.489 0 0 0 0 0 0 0 0 0 0 -1119.8 2489.78 0 0 0.02 0 0 0 0 0 
0 1064.26 0 2090.29 1904.13 0 0 0 0 0 0 0 0 0 0 0 0 0 0 0 0 0 0 0.09 0 0 0 0 
0 0 0 0 0 0 0 0 0 0 0 0 2074.27 0 0 1465.42 0 815.531 0 0 0 1966.08 0 0 0.09 0 0 0 
0 0 0 0 0 0 0 0 0 0 0 1113.09 0 0 0 0 0 0 0 941.115 0 0 0 0 0 0.05 0 0 
0 0 0 1371.43 0 0 0 0 0 0 0 0 0 0 980.331 0 0 0 0 0 0 0 0 0 0 0 0 2104.94 
0 0 0 0 0 0 0 0 2141.87 0 0 0 0 0 0 0 0 0 0 0 -267.113 0 0 0 0 0 -941.267 0.06 
