*Vertices 51
*Matrix 
0.06 0 557.802 0 0 0 -117.42 -2486.11 2046.95 0 0 0 0 0 0 779.366 1394.16 0 0 1976 0 0 0 0 0 0 1954.63 1302.45 0 -1985.76 0 0 0 0 0 0 0 0 2010.64 0 -321.741 0 0 0 0 0 0 0 0 0 237.663 
0 0.01 0 0 0 0 0 0 566.5 2274.47 -2355.49 2440.49 0 0 0 0 0 0 0 811.869 0 575.655 1216.54 2043.29 0 0 -2024.06 0 0 0 0 0 -355.312 819.651 0 -1062.73 0 -782.723 0 0 0 0 0 0 0 0 0 0 0 0 0 
-914.258 0 0.03 0 0 0 2303.46 0 0 0 0 0 0 0 0 1702.55 954.695 577.487 0 0 0 0 0 0 1626.87 0 0 0 0 0 0 0 0 0 1944.87 0 0 0 0 0 0 0 0 0 0 0 0 0 0 0 0 
0 0 0 0.01 0 0 1390.5 0 0 -1100.88 0 2424.01 0 0 35.1726 0 0 0 0 0 0 0 -1853.77 0 0 0 0 0 0 -621.738 0 0 1819.74 0 0 0 0 0 1812.27 0 -2194.51 0 0 1800.52 0 0 0 0 0 0 0 
0 0 0 0 0.07 -476.928 0 0 0 0 0 0 0 0 0 0 0 -1600.01 0 0 674.23 2318.41 1200.06 0 88.4274 0 0 0 0 0 0 693.762 0 821.024 0 0 0 -1595.28 0 0 0 0 0 0 0 0 0 0 0 0 0 
0 0 0 0 1711.4 0.01 0 0 0 0 -525.758 0 1712.32 0 0 0 29.8318 0 0 0 0 -1051.13 -386.593 0 -1165.88 254.295 0 0 0 0 0 0 0 0 0 0 1035.57 1277.12 0 0 0 0 0 0 0 0 -521.638 0 0 0 0 
67.0644 0 -2196.95 2219.84 0 0 0.06 0 0 0 0 2250.66 1982.71 -1879.71 0 0 0 -477.538 0 0 0 0 1767.56 -1201.13 0 0 0 0 0 0 0 0 -1346.71 0 1602.6 882.214 -1860.33 0 0 0 0 0 0 0 0 0 0 0 0 0 0 
1684.55 0 0 0 0 0 0 0.08 1070.36 0 0 0 553.987 0 1265.22 0 0 2081.13 0 0 0 0 0 0 0 0 0 0 0 0 0 0 0 0 545.137 1264.15 1995.53 0 1023.97 2007.89 0 0 0 0 1919.23 0 0 0 -426.42 0 0 
1165.88 1267.97 0 0 0 0 0 382.015 0.07 0 -979.72 0 125.355 0 0 0 0 0 -627.384 0 0 0 0 0 0 0 0 0 0 0 1670.05 0 1045.18 0 0 0 -680.639 16.8615 0 0 0 2234.79 0 1424.83 0 0 0 0 0 0 0 
0 -1964.09 0 988.266 0 0 0 0 0 0.07 0 0 0 0 0 0 -965.987 0 0 0 0 823.466 0 0 -582.98 0 0 0 0 0 -677.74 0 1039.08 2159.11 -613.193 0 1678.29 0 863.445 0 1162.68 -254.295 0 0 0 0 0 0 0 0 0 
0 2189.93 0 0 0 -105.06 0 0 946.608 0 0.04 0 2178.03 0 0 1070.82 1781.29 0 0 0 0 0 0 -2162.62 -2008.65 0 0 0 0 0 0 0 0 1656.16 0 -1828.14 0 0 933.79 629.368 0 0 0 0 0 0 0 0 0 0 0 
0 -2095.32 0 1516.69 0 0 -445.952 0 0 0 0 0.05 0 0 0 -1037.1 -1341.98 1739.63 0 1570.25 0 0 -1083.03 -382.473 0 0 1810.43 0 0 0 769.753 -473.418 0 2140.49 -2132.86 -1299.86 0 0 0 654.241 2482.76 0 0 35.1726 0 0 0 0 0 0 0 
0 0 0 0 0 2263.18 188.833 922.498 2295.68 0 1982.56 0 0.09 0 2304.22 0 0 0 0 0 2396.08 0 0 0 2264.85 0 112.995 -329.371 0 0 36.5459 0 0 0 0 0 0 615.329 1792.58 -2467.04 0 -1383.48 0 0 -699.255 0 0 -2330.47 0 0 0 
0 0 0 0 0 0 1585.67 0 0 0 0 0 0 0.04 1590.7 0 0 0 -2102.19 0 0 0 0 0 0 1293.76 2148.88 0 0 0 0 0 0 0 0 0 1410.79 0 0 0 0 0 1977.68 0 0 0 0 0 1396.76 0 0 
0 0 0 1426.05 0 0 0 -1586.89 0 0 0 0 1770.76 426.572 0.01 0 0 0 0 0 -1155.2 0 1890.39 2071.83 0 0 0 0 0 1172.44 0 0 0 0 0 0 -1275.29 0 0 0 0 0 419.401 -138.02 -2391.35 0 0 0 0 0 0 
-583.743 0 203.94 0 0 0 0 0 0 0 2318.41 2097.16 0 0 0 0.09 0 0 0 287.561 0 0 -993.606 1089.59 0 0 0 354.701 0 915.784 0 0 0 0 0 0 0 0 780.74 0 0 0 0 -1489.38 0 0 0 0 0 0 1738.11 
-1497.62 0 2469.94 0 0 -2210.68 0 0 0 1610.08 483.795 -722.907 0 0 0 0 0.08 463.347 -1244.62 397.58 0 414.823 0 0 0 0 0 -488.372 -1643.04 0 0 0 -323.725 0 1084.25 0 0 0 0 425.504 0 1345.33 0 0 0 0 0 0 0 0 0 
0 0 -2318.57 0 1981.64 0 1541.72 -1204.49 0 0 0 1261.86 0 0 0 0 25.5593 0.04 -892.895 0 0 -1634.95 0 0 0 1204.03 -2230.52 0 0 0 0 0 1049.46 1913.43 0 0 0 823.618 0 0 0 0 0 0 0 658.055 0 0 0 0 0 
0 0 0 0 0 0 0 0 -601.749 0 0 0 0 573.977 0 0 61.8763 1545.53 0.01 0 0 0 0 -1773.51 0 0 1902.45 1921.37 0 0 0 0 0 0 0 0 0 0 0 0 0 -1281.7 0 0 0 0 0 0 0 0 0 
566.805 1717.35 0 0 0 0 0 0 0 0 0 -1807.84 0 0 0 -476.47 -121.845 0 0 0.09 0 0 0 0 0 0 -1938.92 0 0 0 0 0 602.206 0 2174.06 0 0 0 0 0 0 2389.22 0 0 0 -1970.05 0 0 0 0 0 
0 0 0 0 -1285.36 0 0 0 0 0 0 0 1327.63 0 870.312 0 0 0 0 0 0.09 -2427.82 0 -578.402 1882.76 0 0 0 -1596.35 0 0 0 720.923 0 0 0 0 69.2007 0 0 0 0 0 0 0 0 0 0 0 0 0 
0 674.688 0 0 -992.843 -1009.02 0 0 0 1881.39 0 0 0 0 0 0 -1.75481 787.759 0 0 -703.223 0.04 0 0 0 0 0 0 0 0 -139.546 -5.26444 0 0 0 699.561 0 2441.71 929.365 0 0 1432.62 0 0 0 0 0 0 0 0 0 
0 -168.996 0 -1939.38 2143.39 1503.57 945.387 0 0 0 0 1439.94 0 0 1366.7 -2434.84 0 0 0 0 0 0 0.07 0 1907.18 0 0 0 5.72222 0 0 0 0 -1204.95 0 0 -706.275 0 0 0 2086.63 0 0 0 0 0 0 0 0 -1573.15 762.123 
0 1943.95 0 0 0 0 2233.27 0 0 0 -2431.18 291.986 0 0 -1007.95 1003.07 0 0 -1237.45 0 1480.99 0 0 0.02 0 0 1803.26 0 0 0 0 0 0 0 0 0 0 0 0 0 0 0 0 0 0 0 0 0 0 0 0 
0 0 -1346.71 0 1759.01 1362.73 0 0 0 181.204 -1063.8 0 1412.63 0 0 0 0 0 0 0 1824.17 0 2101.28 0 0.07 0 0 -1849.65 0 0 1318.17 0 0 0 0 855.968 -989.639 0 0 0 0 0 0 0 0 0 0 0 0 0 0 
0 0 0 0 0 -1648.08 0 0 0 0 0 0 0 -68.1326 0 0 0 202.414 0 0 0 0 0 0 0 0.09 0 0 0 0 1783.27 0 0 0 1459.32 0 0 2027.88 1514.4 0 0 0 0 0 0 0 -496.307 0 0 0 0 
-613.804 -17.3193 0 0 0 0 0 0 0 0 0 1012.99 -1196.4 1198.84 0 0 0 1403.32 2447.66 -1326.87 0 0 0 2231.89 0 0 0.09 1987.44 0 0 0 0 0 0 1427.73 0 -133.29 0 0 0 -134.51 0 0 0 0 0 -77.7459 0 0 0 0 
-2006.36 0 0 0 0 0 0 0 0 0 0 0 -2446.44 0 0 1639.68 -1174.89 0 150.533 0 0 0 0 0 975.6 0 1928.24 0.02 -1481.14 0 -399.564 0 1674.17 0 2420.65 0 0 0 0 0 0 -989.334 0 0 0 0 0 0 -428.861 0 0 
0 0 0 0 0 0 0 0 0 0 0 0 0 0 0 0 -221.641 0 0 0 -180.441 0 -106.433 0 0 0 0 1834.54 0 0 0 0 1384.55 0 1670.81 2205.34 0 393.918 183.95 890.301 0 1875.29 0 0 134.968 0 0 0 0 0 0 
1657.69 0 0 1196.1 0 0 0 0 0 0 0 0 0 0 879.009 1275.44 0 0 0 0 0 0 0 0 0 0 0 0 0 0.02 0 0 1807.23 0 207.45 -1761.76 0 0 2008.8 0 0 0 1017.72 0 0 0 0 0 0 0 1565.07 
0 0 0 0 0 0 0 0 -686.743 -208.518 0 -1468.78 -1452.76 0 0 0 0 0 0 0 0 1211.97 0 0 2106.77 1453.37 0 -61.2659 0 0 0.09 2349.54 0 0 0 0 0 0 0 0 0 0 0 0 0 0 0 0 235.832 0 0 
0 0 0 0 1785.56 0 0 0 0 0 0 1892.53 0 0 0 0 0 0 0 0 0 514.466 0 0 0 0 0 0 0 0 -2006.52 0.06 0 0 0 0 0 -700.171 0 0 0 0 0 0 0 1821.42 -2135 0 0 1329.46 0 
0 -843.608 0 873.821 0 0 461.821 0 1020.77 -120.014 0 0 0 0 0 0 1470.31 -2422.64 0 907.086 -814.92 0 0 0 0 0 0 -927.992 -1771.98 2481.84 0 0 0 0 0 0 557.192 0 1083.18 573.977 0 0 0 0 0 0 0 0 0 1921.67 0 
0 531.556 0 0 -1784.8 0 0 0 0 2405.24 -463.5 -2260.43 0 0 0 0 0 -999.71 0 0 0 0 2126.15 0 0 0 0 0 0 0 0 0 0 0.09 -670.568 2298.73 902.814 0 961.867 -6.33259 0 0 0 0 0 0 0 0 0 0 0 
0 0 1723 0 0 0 -2210.99 1777.78 0 1579.71 0 1340.75 0 0 0 0 862.682 0 0 2483.98 0 0 0 0 0 1222.04 -1880.63 918.531 1102.56 -1822.34 0 0 0 1208.91 0.05 0 0 2382.35 0 0 0 1756.57 0 0 0 0 0 0 0 0 0 
0 611.057 0 0 0 0 -905.103 -1623.66 0 0 870.312 1908.86 0 0 0 0 0 0 0 0 0 622.654 0 0 664.922 0 0 0 -1224.78 2405.55 0 0 0 -2326.35 0 0 0 0 1927.32 0 0 0 0 0 0 0 0 -1914.81 0 -1557.59 0 
0 0 0 0 0 -281.457 -738.319 -441.374 -65.8437 -1309.17 0 0 0 1897.26 535.218 0 0 0 0 0 0 0 1553.16 0 740.76 0 1580.32 0 0 0 0 0 2251.12 -562.532 0 0 0.04 0 0 0 0 0 0 0 0 -1503.72 0 1016.19 0 0 0 
0 1654.33 0 0 -728.401 -978.652 0 0 2094.87 0 0 0 245.598 0 0 0 0 705.969 0 0 1665.78 -1229.21 0 0 0 1291.31 0 0 1596.19 0 0 190.664 0 0 -362.178 0 0 0.04 0 0 0 0 0 0 0 1731.7 0 0 0 0 0 
1129.72 0 0 1052.96 0 0 0 1729.71 0 -911.664 408.719 0 114.063 0 0 2061.14 0 0 0 0 0 1136.89 0 0 0 -1562.01 0 0 -5.26444 2323.76 0 0 29.9844 761.818 0 1342.28 0 0 0.08 0 0 0 0 0 0 0 0 0 0 0 0 
0 0 0 0 0 0 0 -1986.83 0 0 -786.386 1512.27 1177.63 0 0 0 2108.45 0 0 0 0 0 0 0 0 0 0 0 -1866.28 0 0 0 1435.21 101.093 0 0 0 0 0 0.04 1968.52 0 0 0 -181.661 0 0 0 0 0 0 
-2415.92 0 0 1204.64 0 0 0 0 0 2037.03 0 1439.18 0 0 0 0 0 0 0 0 0 0 1109.42 0 0 0 -1517.46 0 0 0 0 0 0 0 0 0 0 0 0 632.115 0.01 0 0 0 0 0 -1805.09 0 0 0 0 
0 0 0 0 0 0 0 0 -2147.36 1883.22 0 0 1323.51 0 0 0 907.392 0 1061.82 1436.43 0 364.62 0 0 0 0 0 -864.513 1836.38 0 0 0 0 0 -2082.35 0 0 0 0 0 0 0.08 0 0 0 0 0 0 0 0 0 
0 0 0 0 0 0 0 0 0 0 0 0 0 2299.34 986.587 0 0 0 0 0 0 0 0 0 0 0 0 0 0 -2247.76 0 0 0 0 0 0 0 0 0 0 0 0 0.05 0 0 0 0 1390.65 0 0 0 
0 0 0 457.854 0 0 0 0 1231.96 0 0 -941.725 0 0 1892.68 1487.4 0 0 0 0 0 0 0 0 0 0 0 0 0 0 0 0 0 0 0 0 0 0 0 0 0 0 0 0.03 0 0 0 0 0 0 0 
0 0 0 0 0 0 0 149.617 0 0 0 0 -604.038 0 602.359 0 0 0 0 0 0 0 0 0 0 0 0 0 1104.08 0 0 0 0 0 0 0 0 0 0 -111.164 0 0 0 0 0 0 0 637.15 0 0 0 
0 0 0 0 0 0 0 0 0 0 0 0 0 0 0 0 0 175.558 0 1036.18 0 0 0 0 0 0 0 0 0 0 0 1509.06 0 0 0 0 710.852 1355.1 0 0 0 0 0 0 0 0.04 0 -1274.07 0 0 0 
0 0 0 0 0 -1266.29 0 0 0 0 0 0 0 0 0 0 0 0 0 0 0 0 0 0 0 56.3829 389.95 0 0 0 0 981.857 0 0 0 0 0 0 0 0 281.61 0 0 0 0 0 0.09 0 0 2044.21 -1513.95 
0 0 0 0 0 0 0 0 0 0 0 0 427.335 0 0 0 0 0 0 0 0 0 0 0 0 0 0 0 0 0 0 0 0 0 0 -1635.56 2198.63 0 0 0 0 0 2155.9 0 1136.89 -1683.63 0 0.09 0 0 0 
0 0 0 0 0 0 0 821.329 0 0 0 0 0 -1671.88 0 0 0 0 0 0 0 0 0 0 0 0 0 410.55 0 0 1293.91 0 0 0 0 0 0 0 0 0 0 0 0 0 0 0 0 0 0.03 0 0 
0 0 0 0 0 0 0 0 0 0 0 0 0 0 0 0 0 0 0 0 0 0 -1834.24 0 0 0 0 0 0 0 0 -847.728 2458.8 0 0 1867.05 0 0 0 0 0 0 0 0 0 0 2429.65 0 0 0.06 0 
-2251.58 0 0 0 0 0 0 0 0 0 0 0 0 0 0 1553.47 0 0 0 0 0 0 2235.56 0 0 0 0 0 0 -1933.58 0 0 0 0 0 0 0 0 0 0 0 0 0 0 0 0 651.341 0 0 0 0.09 
