*Vertices 78
*Matrix 
0.01 0 0 0 1924.57 416.349 0 0 0 0 0 0 945.082 0 0 0 0 0 0 0 0 0 0 0 0 0 0 0 0 0 0 1019.24 0 2282.25 0 0 0 513.55 0 0 0 0 0 0 0 0 0 0 0 0 0 0 0 0 0 0 0 0 0 0 0 0 0 0 0 508.362 0 0 0 0 0 0 0 -1098.59 -1279.41 0 0 0 
0 0 -871.99 0 0 0 0 0 0 0 0 0 0 926.771 0 0 0 0 0 0 0 0 627.079 0 0 0 0 1871.17 0 614.566 0 0 0 0 0 1971.88 0 0 0 0 1071.43 0 991.47 -1193.96 0 0 0 0 0 0 0 0 0 0 0 387.051 0 0 0 0 0 0 0 0 0 -1800.52 0 0 0 0 0 0 983.688 0 0 0 0 0 
0 2168.26 0.05 1494.11 0 0 0 0 0 0 0 -278.1 0 0 -2014.91 0 0 0 2227.16 0 0 0 61.7237 -1170.92 443.358 0 0 0 0 0 0 0 0 0 0 0 0 0 2060.38 0 0 0 0 0 0 0 256.279 0 0 0 0 0 0 0 0 0 0 0 0 0 0 0 0 1399.04 0 0 0 0 0 0 0 0 0 0 0 0 0 0 
0 0 1378.9 0 1879.71 0 0 0 0 0 0 0 0 0 0 2349.7 0 0 0 0 0 0 0 2266.99 0 0 0 0 0 0 0 0 0 0 0 -2352.75 0 0 1056.78 0 0 0 0 0 0 0 -1635.87 1939.68 0 0 0 0 0 0 0 0 0 0 0 0 -2417.6 0 371.181 0 0 0 0 0 0 0 0 0 0 0 0 0 0 0 
-1648.53 0 0 1073.11 0.03 0 -396.207 0 -1937.54 0 0 0 0 0 0 0 0 0 1918.32 0 0 0 1713.69 0 0 0 0 0 0 0 0 0 1965.47 0 0 0 1092.94 0 0 0 0 0 0 -1470.92 0 0 0 0 555.513 0 0 0 0 0 475.097 0 0 0 0 0 0 0 706.427 0 0 0 0 0 0 0 0 0 0 0 0 0 0 0 
2135 0 0 0 0 0.07 0 -1100.73 0 0 0 0 0 0 0 0 0 0 0 0 0 0 0 0 0 0 0 0 0 0 1290.25 0 0 0 0 0 0 0 0 0 0 0 1481.29 791.726 0 0 0 0 -1701.03 0 0 0 0 0 0 0 0 0 0 0 796.457 0 0 0 0 0 0 0 0 0 0 -358.211 0 -2070.3 0 0 0 0 
0 0 0 0 732.215 0 0 2001.48 -2175.44 0 0 -1566.44 0 0 0 0 0 0 2275.69 0 0 1733.68 0 0 0 0 0 0 0 0 -1897.11 0 0 0 2162.92 0 0 0 0 0 944.319 0 0 0 0 0 2143.39 0 0 438.475 0 212.18 0 0 0 0 0 0 0 0 0 0 0 0 0 906.781 0 0 0 0 0 0 0 0 0 -2420.19 0 0 
0 0 0 0 0 2368.31 928.144 0 -25.1015 0 0 0 0 0 0 0 0 0 0 0 0 0 0 0 0 0 0 0 0 0 0 0 0 0 0 0 1658.6 0 0 0 0 0 0 0 0 0 0 0 1078.14 0 0 0 0 0 2093.04 0 -1609.47 -2243.34 0 0 0 0 1394.92 0 372.86 0 0 0 0 0 0 0 0 0 0 0 0 0 
0 0 0 0 1521.27 0 -1276.51 2211.91 0.02 0 0 0 0 0 0 0 0 1782.51 0 0 0 0 0 2237.39 0 0 0 0 0 0 0 0 0 0 0 0 0 0 0 0 0 -1854.38 0 0 0 0 0 0 0 0 0 0 0 0 0 0 0 0 565.584 0 0 0 0 0 0 0 0 0 0 -327.082 0 0 0 0 0 0 0 0 
0 0 0 0 0 0 0 0 0 0.08 0 0 0 0 0 0 0 1726.66 0 0 0 0 0 0 0 0 0 0 0 1095.23 0 0 0 0 1749.09 0 0 0 1884.29 0 0 -2092.73 0 0 0 0 0 1652.81 0 0 0 -70.1163 0 0 -223.93 0 0 0 0 0 0 0 0 0 0 0 0 0 0 0 0 0 0 0 0 0 0 0 
0 0 0 0 0 0 0 0 0 0 0.08 0 0 0 0 0 0 0 0 0 0 0 1259.73 0 0 0 0 0 0 0 1675.85 0 0 0 0 0 0 0 0 0 0 0 0 0 0 1647.47 1191.98 0 0 0 0 0 0 1525.54 0 0 0 0 0 0 0 0 0 0 0 0 0 0 0 0 0 0 0 0 0 0 0 0 
0 0 2413.48 0 0 0 -2009.72 0 0 0 0 0.05 0 -391.324 0 0 0 0 0 0 0 2397.61 0 0 1597.87 0 0 0 0 0 0 0 -1544.62 2111.5 0 0 0 0 0 0 2270.04 0 0 0 0 0 0 0 0 0 0 0 -1222.19 0 0 0 0 0 0 0 0 0 0 0 0 0 0 0 0 0 0 0 0 0 0 0 0 0 
-183.645 0 0 0 0 0 0 0 0 0 0 0 0.09 0 0 0 0 0 0 0 0 0 0 0 0 0 0 0 0 0 0 0 0 2491.15 0 0 1803.87 0 0 0 -1075.09 0 0 0 0 0 197.989 0 0 0 0 0 2067.09 0 0 0 0 0 0 0 0 0 -1451.99 0 0 0 0 0 0 0 0 0 0 0 0 0 0 0 
0 -1846.29 0 0 0 0 0 0 0 0 0 2349.7 0 0.02 0 0 0 0 0 0 1554.23 0 -529.878 0 0 0 0 0 0 0 0 0 0 550.02 0 1413.24 0 0 0 1129.11 0 0 0 0 1750.47 0 0 0 0 -2241.97 0 0 0 0 0 644.78 0 -846.66 0 0 0 0 0 0 0 0 0 0 0 0 0 0 0 0 0 0 0 0 
0 0 2069.08 0 0 0 0 0 0 0 0 0 0 0 0.01 0 -1135.98 0 0 0 0 0 0 0 0 0 0 874.889 0 0 -1284.14 0 0 -904.34 0 0 0 0 2230.83 0 0 0 0 0 0 0 0 0 0 0 0 0 0 0 0 0 0 0 0 0 1239.28 0 0 -112.384 0 0 0 0 0 0 0 0 0 0 0 0 0 0 
0 0 0 1627.78 0 0 0 0 0 0 0 0 0 0 0 0.07 0 0 0 0 0 0 0 -61.4185 0 0 0 0 0 0 0 0 0 0 -868.48 0 0 0 0 0 0 0 0 0 0 1015.88 0 0 0 0 0 0 0 0 0 0 0 0 0 0 0 2470.09 0 0 0 0 0 0 0 0 0 0 0 0 0 0 0 0 
0 0 0 0 0 0 0 0 0 0 0 0 0 0 -1435.82 0 0 0 0 0 0 0 0 0 780.282 0 0 1657.08 0 0 0 0 0 0 723.06 0 0 0 0 0 0 0 0 0 0 0 0 0 0 0 0 0 0 0 0 0 0 0 0 0 0 0 0 0 0 0 0 0 0 0 0 0 0 0 0 0 0 0 
0 0 0 0 0 0 0 0 2116.99 1994.92 0 0 0 0 0 0 0 0.03 1038.16 0 0 -137.715 0 0 0 0 0 0 0 -2054.89 0 0 -1721.63 0 0 0 0 -1481.29 0 0 0 0 0 0 0 0 0 2079 0 1846.6 0 0 -135.426 0 0 0 0 0 1355.1 0 0 0 0 0 827.738 0 0 0 0 0 0 0 0 0 0 0 0 0 
0 0 1363.95 0 -1047.32 0 -1957.23 0 0 0 0 0 0 0 0 0 0 1666.39 0.05 0 0 0 0 0 0 0 2321.16 0 0 2442.17 0 0 -1276.67 0 0 0 0 0 0 0 0 0 0 0 0 0 0 0 0 0 0 0 0 -146.413 0 -668.279 0 0 0 0 0 0 0 0 0 0 0 0 0 0 0 0 0 0 0 0 0 0 
0 0 0 0 0 0 0 0 0 0 0 0 0 0 0 0 0 0 0 0.06 1666.69 0 0 0 0 0 0 2311.7 0 612.43 0 0 0 0 0 0 -881.756 0 0 0 0 0 0 0 1052.96 0 0 0 0 -2082.81 0 0 0 -1161.31 0 1276.06 0 0 0 0 0 0 0 0 0 0 0 0 0 0 0 0 0 0 915.021 0 0 0 
0 0 0 0 0 0 0 0 0 0 0 0 0 978.347 0 0 0 0 0 291.223 0.08 0 2370.14 0 0 0 0 -1129.26 0 -332.118 0 0 0 0 0 0 0 0 0 193.411 0 0 0 0 0 0 -1934.34 752.052 0 0 0 0 0 0 0 0 0 0 0 0 0 0 0 0 2103.87 0 0 0 0 0 432.066 0 0 0 0 0 0 0 
0 0 0 0 0 0 511.719 0 0 0 0 1208.15 0 0 0 0 0 2458.19 0 0 0 0.04 0 0 0 0 0 -1353.57 0 0 0 0 0 0 0 0 0 0 0 2027.27 0 0 0 0 0 2169.18 0 0 0 0 0 0 0 2495.12 0 0 0 0 0 73.6259 0 0 -1526.76 0 0 -47.5326 0 0 0 0 0 0 0 0 0 0 0 0 
0 -1271.48 2050.46 0 1226 0 0 0 0 0 1623.66 0 0 312.738 0 0 0 0 0 0 2427.06 0 0.07 0 0 0 0 0 -1786.48 0 0 0 0 0 0 0 0 0 0 0 0 0 0 0 1999.95 0 0 0 0 0 0 0 0 0 0 0 0 0 0 -2185.51 0 0 0 0 0 0 -948.286 0 0 0 0 0 0 0 0 0 0 0 
0 0 2237.08 2474.97 0 0 0 0 403.226 0 0 0 0 0 0 2100.67 0 0 0 0 0 0 0 0 0 0 0 0 0 0 0 0 0 0 0 0 0 0 0 0 0 -611.667 0 0 0 611.362 0 0 0 879.62 0 0 0 0 0 588.015 0 0 0 0 0 0 0 0 0 0 0 0 0 0 0 0 0 0 0 0 0 0 
0 0 1555.3 0 0 0 0 0 0 0 0 2041.15 0 0 0 0 -13.5044 0 0 0 0 0 0 0 0.05 0 0 0 0 0 0 0 0 1212.73 0 0 860.24 0 0 0 0 0 0 0 0 0 0 0 0 0 0 0 0 0 0 0 0 0 0 0 0 0 892.438 0 0 0 0 2247.61 0 0 0 0 0 0 0 0 0 0 
0 0 0 0 0 0 0 0 0 0 0 0 0 0 0 0 0 0 0 0 0 0 0 0 0 0.06 0 0 0 0 -2220.15 0 0 0 0 0 0 0 0 0 0 0 0 0 0 0 0 0 0 0 0 0 492.645 -430.082 2091.05 2181.23 0 0 0 1947.16 0 858.562 -698.035 0 0 0 0 0 0 0 0 0 0 0 0 0 0 0 
0 0 0 0 0 0 0 0 0 0 0 0 0 0 0 0 0 0 -65.6911 0 0 0 0 0 0 0 0.05 0 -302.515 0 0 0 0 0 0 0 0 0 1926.71 0 0 0 0 0 0 0 0 0 0 760.14 -1874.37 0 0 0 0 0 0 0 0 0 0 430.54 0 0 0 905.866 0 0 0 0 0 0 0 0 0 0 0 0 
0 -907.544 0 0 0 0 0 0 0 0 0 0 0 0 860.393 0 505.463 0 0 -58.8244 1041.22 1088.67 0 0 0 0 0 0.04 0 0 0 0 0 0 0 0 0 0 0 2175.13 0 271.386 0 0 0 -735.572 0 -189.291 0 0 0 0 0 0 583.132 0 0 0 0 0 94.9889 0 0 0 0 0 0 0 0 0 0 0 0 0 0 0 0 -23.7281 
0 0 0 0 0 0 0 0 0 0 0 0 0 0 0 0 0 0 0 0 0 0 2056.26 0 0 0 2152.09 0 0.05 0 0 0 0 0 0 0 0 0 -2492.07 0 0 0 0 0 0 555.055 0 0 0 0 0 0 0 0 1560.34 0 0 0 0 0 0 0 0 2076.25 1429.11 0 0 0 0 0 0 0 0 0 0 0 0 0 
0 2337.64 0 0 0 0 0 0 0 2288.51 0 0 0 0 0 0 0 260.857 -316.706 229.728 2163.08 0 0 0 0 0 0 0 0 0.04 0 0 162.13 624.638 1105 0 0 -554.598 0 0 0 0 0 0 0 0 0 0 0 0 0 0 0 0 0 0 -858.409 0 719.703 1300.62 0 0 0 0 0 0 0 0 0 0 0 0 0 0 0 0 0 0 
0 0 0 0 0 580.233 1012.68 0 0 0 1311.91 0 0 0 1913.28 0 0 0 0 0 0 0 0 0 0 614.109 0 0 0 0 0.01 0 0 0 0 0 0 0 0 0 0 0 568.026 0 0 0 496.002 0 0 0 0 0 0 0 0 0 1220.82 0 0 0 0 0 0 0 0 0 0 0 0 877.789 0 0 0 0 0 0 0 0 
284.204 0 0 0 0 0 0 0 0 0 0 0 0 0 0 0 0 0 0 0 0 0 0 0 0 0 0 0 0 0 0 0.02 0 0 0 0 0 0 0 0 0 0 0 645.39 0 1062.88 0 0 0 245.293 0 0 255.516 0 1741.31 -140.004 0 0 0 0 0 0 0 0 0 0 0 0 0 0 0 0 0 0 0 0 0 0 
0 0 0 0 154.347 0 0 0 0 0 0 133.747 0 0 0 0 0 -480.895 1629 0 0 0 0 0 0 0 0 0 0 855.358 0 0 0.02 0 0 0 0 0 0 0 0 0 0 0 0 0 0 2274.16 0 0 -2455.14 0 0 1950.21 0 0 1901.23 0 0 1804.94 0 0 0 0 0 0 -1755.2 0 0 0 0 0 0 0 0 0 0 0 
-1178.85 0 0 0 0 0 0 0 0 0 0 1245.84 -556.276 584.658 -1214.1 0 0 0 0 0 0 0 0 0 1818.67 0 0 0 0 286.035 0 0 0 0.08 0 0 0 0 -387.509 0 0 0 0 0 0 0 0 0 0 0 885.113 0 0 0 0 0 0 0 0 0 0 0 0 0 0 0 0 0 0 0 0 0 0 0 0 0 0 0 
0 0 0 0 0 0 2188.56 0 0 2179.4 0 0 0 0 0 1136.13 -2081.9 0 0 0 0 0 0 0 0 0 0 0 0 -447.783 0 0 0 0 0.07 0 2426.6 0 0 0 0 0 0 0 0 2045.27 0 0 0 0 0 0 0 1463.9 0 0 902.966 0 0 0 0 0 0 0 0 0 1968.52 0 0 0 0 0 0 0 0 0 0 0 
0 901.288 0 -1106.52 0 0 0 0 0 0 0 0 0 1511.35 0 0 0 0 0 0 0 0 0 0 0 0 0 0 0 0 0 0 0 0 0 0.01 0 2161.24 0 0 0 0 0 0 0 0 0 0 0 2091.51 0 -2186.42 0 0 0 0 0 0 0 0 0 0 210.044 0 0 0 0 0 0 0 0 0 0 0 0 0 0 0 
0 0 0 0 2082.51 0 0 -1168.17 0 0 0 0 1192.28 0 0 0 0 0 0 -1580.17 0 0 0 0 -2498.32 0 0 0 0 0 0 0 0 0 1627.63 0 0.05 0 0 0 0 0 0 0 0 0 0 0 0 0 0 0 0 0 0 0 350.581 0 0 0 264.519 2035.81 0 0 0 1183.13 0 -874.584 0 0 0 0 0 0 0 0 0 0 
1761.3 0 0 0 0 0 0 0 0 0 0 0 0 0 0 0 0 1115.07 0 0 0 0 0 0 0 0 0 0 0 2371.97 0 0 0 0 0 1088.98 0 0.08 0 0 0 0 0 0 0 0 0 0 1836.07 0 0 0 0 0 183.645 0 0 0 0 0 -1592.38 0 0 0 -454.192 0 0 0 0 0 0 0 0 0 0 0 -2335.81 -539.186 
0 0 856.883 1185.11 0 0 0 0 0 -448.088 0 0 0 0 1642.12 0 0 0 0 0 0 0 0 0 0 0 2085.86 0 -1868.11 0 0 0 0 1240.81 0 0 0 0 0.04 0 0 0 236.9 0 535.524 0 0 0 0 0 0 0 0 0 0 0 0 0 0 0 0 0 0 0 0 -236.747 0 0 0 0 0 0 0 0 0 0 0 0 
0 0 0 0 0 0 0 0 0 0 0 0 0 379.269 0 0 0 0 0 0 -1769.39 -335.475 0 0 0 0 0 -2145.68 0 0 0 0 0 0 0 0 0 0 0 0.09 0 1859.72 0 0 0 0 0 0 0 0 0 0 0 0 1218.83 1699.04 0 0 0 0 0 0 1395.08 0 0 0 0 0 0 0 0 0 0 0 0 0 0 0 
0 -461.211 0 0 0 0 -516.449 0 0 0 0 1351.89 2444.61 0 0 0 0 0 0 0 0 0 0 0 0 0 0 0 0 0 0 0 0 0 0 0 0 0 0 0 0 0 0 2422.94 0 0 0 0 0 0 0 0 0 0 1145.44 0 0 0 0 0 0 0 0 0 0 1356.93 0 0 0 0 0 -2107.07 0 0 0 0 0 0 
0 0 0 0 0 0 0 0 2462.31 2168.87 0 0 0 0 0 0 0 0 0 0 0 0 0 1850.26 0 0 0 -951.033 0 0 0 0 0 0 0 0 0 0 0 2246.7 0 0.05 0 0 0 527.741 0 0 0 0 0 0 0 -767.464 0 0 0 0 1472.14 1375.09 0 0 0 0 0 0 0 0 0 0 0 0 0 0 0 1011.61 0 0 
0 -2431.79 0 0 0 -5.72222 0 0 0 0 0 0 0 0 0 0 0 0 0 0 0 0 0 0 0 0 0 0 0 0 2290.34 0 0 0 0 0 0 0 -843.913 0 0 0 0.05 0 0 0 2425.53 0 0 0 -896.71 0 0 1228.45 0 0 0 0 0 411.008 0 0 0 0 0 0 0 0 0 0 -457.091 0 0 0 0 0 0 0 
0 -1883.53 0 0 1123.31 1401.18 0 0 0 0 0 0 0 0 0 0 0 0 0 0 0 0 0 0 0 0 0 0 0 0 0 904.34 0 0 0 0 0 0 0 0 1412.93 0 0 0.05 0 0 0 0 0 -1553.77 0 0 0 0 0 0 0 1522.19 0 0 0 0 0 0 0 0 -1511.81 0 0 0 0 0 0 0 0 0 0 0 
0 0 0 0 0 0 0 0 0 0 0 0 0 2225.03 0 0 0 0 0 1906.26 0 0 -699.103 0 0 0 0 0 0 0 0 0 0 0 0 0 0 0 -392.85 0 0 0 0 0 0.01 0 0 0 0 0 0 0 0 0 0 0 0 0 0 0 0 0 0 -1738.56 0 0 0 0 0 0 0 0 0 0 0 0 0 0 
0 0 0 0 0 0 0 0 0 0 671.178 0 0 0 0 2362.36 0 0 0 0 0 324.946 0 -1771.52 0 0 0 1255.61 -793.558 0 0 2373.04 0 0 195.7 0 0 0 0 0 0 -2096.09 0 0 0 0.04 0 0 -974.837 0 0 0 0 0 -127.796 0 0 0 0 0 0 0 0 0 0 0 742.286 0 0 0 0 0 0 0 0 0 0 0 
0 0 -571.535 -1782.97 0 0 2104.63 0 0 0 -1555.3 0 911.969 0 0 0 0 0 0 0 409.329 0 0 0 0 0 0 0 0 0 -382.321 0 0 0 0 0 0 0 0 0 0 0 807.901 0 0 0 0.06 0 0 0 0 0 0 0 -2359.77 0 1780.83 0 -574.435 0 0 0 0 2426.91 0 0 0 0 0 0 0 0 0 0 0 0 0 0 
0 0 0 774.026 0 0 0 0 0 -1297.11 0 0 0 0 0 0 0 -954.695 0 0 102.618 0 0 0 0 0 0 953.932 0 0 0 0 2347.25 0 0 0 0 0 0 0 0 0 0 0 0 0 0 0.08 0 0 0 0 0 0 0 0 0 0 -483.947 0 0 2326.2 0 0 0 918.989 -1892.83 0 0 0 0 0 0 0 0 0 0 0 
0 0 0 0 -2164.14 -146.26 0 2349.39 0 0 0 0 0 0 0 0 0 0 0 0 0 0 0 0 0 0 0 0 0 0 0 0 0 0 0 0 0 1898.02 0 0 0 0 0 0 0 1378.6 0 0 0.09 0 0 0 0 613.651 0 1126.97 0 0 503.021 0 0 0 0 0 0 634.709 0 0 0 0 0 0 0 0 0 0 0 0 
0 0 0 0 0 0 -221.641 0 0 0 0 0 0 593.204 0 0 0 -895.032 0 -467.62 0 0 0 1508 0 0 1645.18 0 0 0 0 1103.02 0 0 0 1469.39 0 0 0 0 0 0 0 1999.5 0 0 0 0 0 0.03 -1908.25 0 0 0 0 1282.46 0 1217.15 0 0 0 0 0 0 0 2355.19 1080.13 0 0 0 0 0 0 0 0 0 0 0 
0 0 0 0 0 0 0 0 0 0 0 0 0 0 0 0 0 0 0 0 0 0 0 0 0 0 1508.3 0 0 0 0 0 -1428.19 1969.59 0 0 0 0 0 0 0 0 1453.67 0 0 0 0 0 0 607.7 0.06 1423.31 0 0 0 552.004 0 0 0 0 0 0 0 0 1526.76 0 0 0 0 0 0 0 0 0 0 0 0 0 
0 0 0 0 0 0 -42.497 0 0 -980.789 0 0 0 0 0 0 0 0 0 0 0 0 0 0 0 0 0 0 0 0 0 0 0 0 0 1500.98 0 0 0 0 0 0 0 0 0 0 0 0 0 0 -1550.11 0.08 1997.97 0 0 1022.6 0 -516.144 0 0 0 0 0 0 0 0 0 0 0 0 0 0 0 0 0 0 0 0 
0 0 0 0 0 0 0 0 0 0 0 -525.3 2324.67 0 0 0 0 2499.39 0 0 0 0 0 0 0 -253.533 0 0 0 0 0 2122.79 0 0 0 0 0 0 0 0 0 0 0 0 0 0 0 0 0 0 0 -1579.26 0.06 0 0 799.814 0 0 0 0 0 0 0 0 0 0 0 0 0 0 0 0 0 -2443.85 0 0 0 0 
0 0 0 0 0 0 0 0 0 0 55.9252 0 0 0 0 0 0 0 -63.86 2219.23 0 428.709 0 0 0 1080.43 0 0 0 0 0 0 2212.06 0 -1746.96 0 0 0 0 0 0 -1005.81 -647.832 0 0 0 0 0 -1036.64 0 0 0 0 0.09 0 0 0 0 0 0 0 0 0 0 0 0 0 0 0 0 0 0 0 0 0 0 0 0 
0 0 0 0 2430.88 0 0 -652.409 0 2233.12 0 0 0 0 0 0 0 0 0 0 0 0 0 0 0 -1326.26 0 -1126.51 2175.59 0 0 -557.039 0 0 0 0 0 858.715 0 -940.352 1693.55 0 0 0 0 1628.85 -2353.66 0 0 0 0 0 0 0 0.04 494.781 0 0 0 1152.3 0 2459.87 0 0 0 0 0 0 0 0 0 0 0 0 0 0 0 0 
0 2234.03 0 0 0 0 0 0 0 0 0 0 0 -647.526 0 0 0 0 -1295.43 -269.402 0 0 0 125.66 0 1247.52 0 0 0 0 0 -907.392 0 0 0 0 0 0 0 -1820.51 0 0 0 0 0 0 0 0 883.129 1232.41 1056.32 2496.34 1012.53 0 653.478 0.08 0 0 0 1730.63 0 0 0 1638.31 0 0 0 0 1060.44 0 0 0 0 0 0 0 0 0 
0 0 0 0 0 0 0 2103.56 0 0 0 0 0 0 0 0 0 0 0 0 0 0 0 0 0 0 0 0 0 676.061 -1376.61 0 1168.78 0 -559.328 0 1779 0 0 0 0 0 0 0 0 0 -1172.9 0 0 0 0 0 0 0 0 0 0.08 -31.3578 0 0 0 0 0 0 0 0 0 0 0 0 0 0 0 0 0 0 0 0 
0 0 0 0 0 0 0 1199.61 0 0 0 0 0 1411.71 0 0 0 0 0 0 0 0 0 0 0 0 0 0 0 0 0 0 0 0 0 0 0 0 0 0 0 0 0 1925.79 0 0 0 0 0 1517.91 0 508.209 0 0 0 0 2371.06 0.06 2146.29 0 0 0 0 0 0 0 0 0 -909.375 0 0 0 -892.285 0 0 0 0 0 
0 0 0 0 0 0 0 0 -922.193 0 0 0 0 0 0 0 0 1179.16 0 0 0 0 0 0 0 0 0 0 0 2184.9 0 0 0 0 0 0 0 0 0 0 0 2283.93 0 0 0 0 24.9489 830.18 1768.01 0 0 0 0 0 0 0 0 1502.5 0.06 0 0 0 0 0 763.649 0 0 0 0 0 0 0 0 0 0 0 0 0 
0 0 0 0 0 0 0 0 0 0 0 0 0 0 0 0 0 0 0 0 0 953.627 71.6422 0 0 1155.51 0 0 0 2242.42 0 0 2317.5 0 0 0 0 0 0 0 0 1083.64 -766.549 0 0 0 0 0 0 0 0 0 0 0 893.963 2057.48 0 0 0 0.06 0 0 0 0 0 0 0 0 0 0 0 0 0 0 0 0 0 0 
0 0 0 1701.48 0 1678.29 0 0 0 0 0 0 0 0 1897.11 0 0 0 0 0 0 0 0 0 0 0 0 837.046 0 0 0 0 0 0 0 0 2317.04 -1778.7 0 0 0 0 0 0 0 0 0 0 0 0 0 0 0 0 0 0 0 0 0 0 0.03 1853.77 0 0 0 0 0 0 0 0 0 0 0 0 921.583 0 0 0 
0 0 0 0 0 0 0 0 0 0 0 0 0 0 0 1658.91 0 0 0 0 0 0 0 0 0 410.703 -340.052 0 0 0 0 0 0 0 0 0 2217.55 0 0 0 0 0 0 0 0 0 0 10.6052 0 0 0 0 0 0 -1156.42 0 0 0 0 0 557.649 0.01 0 0 -425.657 0 0 0 0 0 0 0 0 0 0 0 0 0 
0 0 0 1088.67 -2189.93 0 0 236.595 0 0 0 0 -1593.14 0 0 0 0 0 0 0 0 2076.56 0 0 -844.066 1380.43 0 0 0 0 0 0 0 0 0 51.1948 0 0 0 1528.29 0 0 0 0 0 0 0 0 0 0 0 0 0 0 0 0 0 0 0 0 0 0 0 0 0 0 0 0 0 0 0 0 0 0 0 0 0 0 
0 0 2358.7 0 0 0 0 0 0 0 0 0 0 0 -2248.22 0 0 0 0 0 0 0 0 0 0 0 0 0 2060.69 0 0 0 0 0 0 0 0 0 0 0 0 0 0 0 -539.186 0 1182.82 0 0 0 0 0 0 0 0 311.06 0 0 0 0 0 0 0 0.09 0 0 0 0 0 0 0 0 0 0 0 0 0 0 
0 0 0 0 0 0 0 514.618 0 0 0 0 0 0 0 0 0 2082.05 0 0 823.923 0 0 0 0 0 0 0 908.307 0 0 0 0 0 0 0 0 -1466.64 0 0 0 0 0 0 0 0 0 0 0 0 2498.47 0 0 0 0 0 0 0 244.987 0 0 -1668.37 0 0 0 0 0 0 0 0 0 0 0 0 0 0 0 0 
409.329 237.51 0 0 0 0 -835.826 0 0 0 0 0 0 0 0 0 0 0 0 0 0 2110.43 0 0 0 0 -835.215 0 0 0 0 0 0 0 0 0 -420.774 0 1889.32 0 -235.984 0 0 0 0 0 0 1239.28 2002.24 -1372.95 0 0 0 0 0 0 0 0 0 0 0 0 0 0 0 0.06 0 0 0 0 0 0 0 0 0 0 0 0 
0 0 0 0 0 0 0 0 0 0 0 0 0 0 0 0 0 0 0 0 0 0 1302.15 0 0 0 0 0 0 0 0 0 -528.809 0 1751.69 0 0 0 0 0 0 0 0 1425.6 0 -837.809 0 1709.11 0 243.156 0 0 0 0 0 0 0 0 0 0 0 0 0 0 0 0 0.06 0 0 0 0 0 0 0 0 0 0 0 
0 0 0 0 0 0 0 0 0 0 0 0 0 0 0 0 0 0 0 0 0 0 0 0 1063.8 0 0 0 0 0 0 0 0 0 0 0 2151.78 0 0 0 0 0 0 0 0 0 0 0 0 0 0 0 0 0 0 0 0 0 0 0 0 0 0 0 0 0 0 0.09 0 0 0 -606.326 0 0 0 0 0 0 
0 0 0 0 0 0 0 0 0 0 0 0 0 0 0 0 0 0 0 0 0 0 0 0 0 0 0 0 0 0 0 0 0 0 0 0 0 0 0 0 0 0 0 0 0 0 0 0 0 0 0 0 0 0 0 1378.14 0 -1556.37 0 0 0 0 0 0 0 0 0 0 0.04 0 0 0 0 0 0 0 0 0 
0 0 0 0 0 0 0 0 -1920.76 0 0 0 0 0 0 0 0 0 0 0 0 0 0 0 0 0 0 0 0 0 2237.69 0 0 0 0 0 0 0 0 0 0 0 0 0 0 0 0 0 0 0 0 0 0 0 0 0 0 0 0 0 0 0 0 0 0 0 0 0 0 0.03 0 0 0 0 0 1495.18 0 0 
0 0 0 0 0 0 0 0 0 0 0 0 0 0 0 0 0 0 0 0 2233.57 0 0 0 0 0 0 0 0 0 0 0 0 0 0 0 0 0 0 0 0 0 -1799.6 0 0 0 0 0 0 0 0 0 0 0 0 0 0 0 0 0 0 0 0 0 0 0 0 0 0 0 0.01 0 0 0 0 0 1403.16 0 
0 0 0 0 0 402.31 0 0 0 0 0 0 0 0 0 0 0 0 0 0 0 0 0 0 0 0 0 0 0 0 0 0 0 0 0 0 0 0 0 0 -45.2437 0 0 0 0 0 0 0 0 0 0 0 0 0 0 0 0 0 0 0 0 0 0 0 0 0 0 2356.41 0 0 0 0.08 0 0 0 0 0 0 
0 2006.82 0 0 0 0 0 0 0 0 0 0 0 0 0 0 0 0 0 0 0 0 0 0 0 0 0 0 0 0 0 0 0 0 0 0 0 0 0 0 0 0 0 0 0 0 0 0 0 0 0 0 0 0 0 0 0 21.1341 0 0 0 0 0 0 0 0 0 0 0 0 0 0 0.07 0 0 0 0 0 
-202.414 0 0 0 0 141.987 0 0 0 0 0 0 0 0 0 0 0 0 0 0 0 0 0 0 0 0 0 0 0 0 0 0 0 0 0 0 0 0 0 0 0 0 0 0 0 0 0 0 0 0 0 0 1940.6 0 0 0 0 0 0 0 0 0 0 0 0 0 0 0 0 0 0 0 0 0.04 0 0 0 0 
2026.81 0 0 0 0 0 0 0 0 0 0 0 0 0 0 0 0 0 0 -1271.94 0 0 0 0 0 0 0 0 0 0 0 0 0 0 0 0 0 0 0 0 0 0 0 0 0 0 0 0 0 0 0 0 0 0 0 0 0 0 0 0 1901.53 0 0 0 0 0 0 0 0 0 0 0 0 0 0.06 0 0 0 
0 0 0 0 0 0 2485.81 0 0 0 0 0 0 0 0 0 0 0 0 0 0 0 0 0 0 0 0 0 0 0 0 0 0 0 0 0 0 0 0 0 0 2357.63 0 0 0 0 0 0 0 0 0 0 0 0 0 0 0 0 0 0 0 0 0 0 0 0 0 0 0 -1638.77 0 0 0 0 0 0.08 0 0 
0 0 0 0 0 0 0 0 0 0 0 0 0 0 0 0 0 0 0 0 0 0 0 0 0 0 0 0 0 0 0 0 0 0 0 0 0 898.541 0 0 0 0 0 0 0 0 0 0 0 0 0 0 0 0 0 0 0 0 0 0 0 0 0 0 0 0 0 0 0 0 791.269 0 0 0 0 0 0.08 0 
0 0 0 0 0 0 0 0 0 0 0 0 0 0 0 0 0 0 0 0 0 0 0 0 0 0 0 194.327 0 0 0 0 0 0 0 0 0 749.458 0 0 0 0 0 0 0 0 0 0 0 0 0 0 0 0 0 0 0 0 0 0 0 0 0 0 0 0 0 0 0 0 0 0 0 0 0 0 0 0.06 
