*Vertices 64
*Matrix 
0.04 0 0 0 0 0 0 0 0 0 0 0 163.198 0 0 0 1472.59 0 1061.05 -1345.64 0 0 0 0 -76.3726 -2452.39 0 0 1778.39 -924.94 2256.16 2011.09 0 0 0 0 0 1704.08 0 0 0 0 0 0 0 0 -2429.65 0 0 0 0 0 0 0 0 0 0 -640.812 0 0 0 534.913 0 0 
0 0.04 0 0 0 311.518 -1784.65 0 0 0 0 0 1092.94 0 456.328 1614.2 0 -2474.52 0 0 -173.879 0 517.06 0 -1811.35 0 0 0 810.648 0 0 569.552 2410.28 0 2359.92 0 0 0 0 0 0 0 0 0 1537.45 1126.97 0 1521.27 0 0 0 0 0 0 0 -416.501 1297.27 0 0 -114.063 250.328 0 0 0 
0 0 0.01 35.3252 0 0 0 615.482 0 0 -2077.47 0 577.334 0 0 0 0 0 0 0 0 0 0 906.476 0 1593.91 0 0 0 0 -345.546 0 0 506.531 0 2415.77 0 0 2326.04 0 0 0 -274.285 0 2429.81 0 -594.577 0 0 0 0 0 -596.866 0 0 0 0 0 596.255 -27.543 0 -1784.04 -674.23 0 
0 0 -1597.11 0 599.155 0 0 0 -1281.55 10.4526 0 0 0 0 0 0 0 0 0 1307.95 0 0 -664.769 1488.62 1961.81 1865.83 2159.41 2470.24 -2035.81 0 2280.72 0 0 0 0 0 0 -479.675 0 0 0 -1736.58 0 838.267 42.6496 1877.73 0 0 0 0 0 2346.19 0 0 -1180.23 0 0 0 0 0 1412.78 0 177.847 0 
0 0 0 -991.165 0.05 0 0 0 0 1971.27 -2055.19 -1302.76 0 0 0 -580.996 0 0 2213.58 57.6037 1779 0 0 0 0 0 1601.38 0 0 -760.75 0 0 1569.34 0 -1920.45 0 0 2146.75 0 0 2471.47 -1880.32 0 0 1067.77 -1488.01 379.574 0 0 0 0 0 0 -862.377 0 0 0 0 0 0 0 -519.349 612.125 0 
0 2194.2 0 0 0 0.05 0 1460.08 0 0 0 0 0 0 0 0 0 0 0 0 0 0 0 586.947 -1515.02 0 1675.24 0 0 -137.562 0 1724.07 1924.57 0 1308.56 0 0 0 0 1906.26 2392.73 0 0 0 2246.7 -795.846 0 0 0 0 0 0 0 0 0 0 0 0 0 0 0 0 -1767.86 0 
0 -98.9563 0 0 0 0 0.01 0 0 -2456.21 0 0 0 0 0 0 0 -1357.54 2237.69 0 0 969.344 1948.07 0 1030.23 0 0 0 0 0 0 -1245.23 -331.66 2114.4 0 0 0 0 0 0 2359.46 445.494 2082.66 0 0 -798.288 0 0 0 0 0 0 0 0 0 0 0 0 0 0 0 0 0 0 
0 0 -875.5 0 0 2472.99 0 0.08 0 1533.94 0 0 -39.2926 -2080.68 2146.9 0 0 0 0 893.506 0 0 114.063 -771.737 0 1247.67 0 -878.704 59.74 0 0 0 0 0 0 0 0 0 0 0 0 0 1613.13 0 0 0 0 0 -639.592 0 0 0 0 0 0 0 0 0 0 0 0 -455.412 0 0 
0 0 0 1895.12 0 0 0 0 0.09 0 0 0 2309.87 0 0 0 1165.73 0 0 158.315 2110.74 1381.34 0 491.272 0 0 0 0 0 0 0 622.196 -1600.31 0 -2429.65 0 0 -218.589 -960.036 0 0 0 0 0 0 0 0 -441.069 0 0 0 0 0 0 2412.11 203.177 -2233.73 0 0 0 0 0 0 0 
0 0 0 2498.78 753.731 0 1318.78 2483.37 0 0.03 0 0 -939.436 0 1169.55 1871.17 -1565.52 -404.752 2409.67 0 0 0 0 812.937 0 0 0 0 0 -2206.26 0 -265.435 0 0 0 0 0 2250.36 -826.823 -1779.61 1411.25 0 0 0 673.925 0 -2037.34 0 0 0 0 0 0 0 893.963 0 0 0 -1273.92 0 0 0 -151.448 0 
0 0 -1345.48 0 -2362.21 0 0 0 0 0 0.08 0 0 0 0 1980.73 0 -406.888 0 0 0 0 -2385.71 2438.51 0 0 -181.661 0 0 0 0 0 0 2442.93 1087.3 0 0 0 368.587 0 0 -842.845 0 643.101 0 1910.23 0 0 0 0 869.396 0 0 0 0 0 0 0 0 0 0 -1447.26 0 0 
0 0 0 0 2091.05 0 0 0 0 0 0 0.04 0 0 0 0 2076.71 0 0 -147.938 1467.25 -1716.9 0 0 -646.001 2423.55 0 -1232.26 -392.239 0 0 565.737 0 0 0 0 187.002 2372.43 0 0 0 0 0 0 0 0 0 0 0 0 0 0 0 0 0 0 0 1779.15 0 0 -154.805 0 0 0 
-2158.19 6.48518 968.581 0 0 0 0 908.46 1566.29 2094.26 0 0 0.03 0 -781.961 0 1513.64 0 0 0 0 0 0 0 0 0 1266.9 1449.86 2168.87 0 0 0 0 -188.986 0 0 -442.747 0 0 0 0 0 0 0 0 -1226 0 597.781 -431.455 0 0 -1951.12 0 0 0 0 0 0 0 0 0 0 0 0 
0 0 0 0 0 0 0 2028.18 0 0 0 0 0 0 1745.12 0 1826.3 0 0 0 2355.34 0 0 0 -1394.77 0 0 -1212.88 0 0 0 0 0 0 0 0 0 0 -653.478 0 0 0 1571.93 0 -1233.63 2229.61 0 0 0 -793.1 0 0 476.318 0 0 0 0 0 0 0 0 0 -528.352 0 
0 1934.19 0 0 0 0 0 -295.038 0 -2172.38 0 0 -999.557 852.916 0.02 2272.64 0 0 0 0 623.722 0 0 0 1460.08 1058.92 0 0 0 0 0 0 0 1303.52 0 0 867.718 0 -841.014 -1044.72 0 0 0 97.2777 107.501 0 0 0 0 0 0 0 0 -2059.47 0 0 164.571 -385.067 0 0 0 0 0 0 
0 -1809.37 0 0 -2073.5 0 0 0 0 881.451 2269.43 0 0 0 -544.374 0.02 0 -213.095 2406.31 0 0 0 0 0 1712.62 0 -884.808 0 0 0 0 0 1729.71 0 0 -1690.65 0 0 0 0 0 0 2075.33 761.361 0 0 0 0 0 0 0 0 0 0 0 0 0 0 0 0 0 0 0 804.849 
967.666 0 0 0 0 0 0 0 -2340.39 1891.46 0 -2479.25 1663.79 456.175 0 0 0.07 0 -843.303 323.878 -2285.61 0 -476.47 0 0 0 1042.59 0 0 1978.44 0 0 0 -1245.38 0 2196.04 -1441.01 0 1631.14 0 0 0 0 0 0 0 0 0 0 0 0 0 0 0 0 0 0 0 0 0 0 2307.73 0 0 
0 67.6748 0 0 0 0 915.937 0 0 793.863 -938.52 0 0 0 0 -45.2437 0 0.02 0 0 0 -752.052 0 0 0 0 0 0 466.552 0 0 1467.41 0 0 0 0 0 646.611 0 0 -1090.5 0 1770.91 0 1819.44 0 0 0 0 0 0 0 0 0 0 0 0 1743.6 0 0 0 0 721.839 0 
-1126.67 0 0 0 483.337 0 2349.54 0 0 1913.43 0 0 0 0 0 -73.1681 -2201.68 0 0.07 0 0 2484.59 0 0 0 2064.81 0 0 -1825.85 0 2185.35 0 2153.77 0 0 0 0 0 -1983.63 -754.036 660.955 0 0 -2324.06 0 667.821 0 0 1952.04 0 1579.71 0 0 0 0 405.21 0 0 0 0 0 0 0 0 
173.269 0 0 1251.64 -595.798 0 0 15.183 1929.46 0 0 1077.53 0 0 0 0 1210.44 0 0 0.03 0 689.642 0 0 15.9459 0 492.798 1246.45 0 0 -1101.18 0 0 -2247.46 0 0 0 0 0 0 823.466 130.696 0 0 0 0 -1488.77 1027.63 0 0 0 0 0 0 0 0 0 0 0 0 0 0 0 0 
0 -580.538 0 0 -968.429 0 0 0 2243.49 0 0 645.848 0 847.728 1338.47 0 -325.861 0 0 0 0.09 0 0 0 0 0 0 0 0 0 0 1091.27 0 0 0 0 0 1483.43 0 0 0 -1348.54 0 -68.2852 0 -680.334 0 0 0 0 0 0 0 0 0 0 0 0 987.503 0 -239.494 0 -1938.46 0 
0 0 0 0 0 0 -285.119 0 -500.58 0 0 2050.61 0 0 0 0 0 2205.8 1391.11 179.067 0 0.08 0 0 0 1851.48 0 0 0 0 -1459.32 1312.52 0 0 -1538.82 0 2332.3 0 -1258.2 0 0 0 0 -1354.95 1416.29 0 0 0 0 0 0 0 0 0 0 0 0 294.733 0 -1950.36 0 0 0 0 
0 2216.48 0 -1575.9 0 0 1020.92 -890.149 0 0 -734.046 0 0 0 0 0 730.842 0 0 0 0 0 0 0 0 0 2104.79 0 0 0 0 295.953 0 770.974 2439.88 0 0 0 0 -1602.76 0 0 987.503 252.77 0 0 1686.38 0 0 -1004.59 -1090.96 0 0 0 0 0 0 0 0 0 0 0 0 0 
0 0 683.691 1465.88 0 -2482.15 0 13.0467 950.423 -795.694 2099.14 0 0 0 0 0 0 0 0 0 0 0 0 0.01 0 2159.72 0 0 469.909 0 0 0 0 0 0 0 0 -1490.75 77.4407 1081.19 0 1777.17 2224.57 0 0 0 -1361.81 0 0 -1918.16 0 0 0 0 0 0 0 0 0 0 0 0 0 1789.68 
1500.06 1181.14 0 -244.377 0 -963.088 2370.3 0 0 0 0 2077.62 0 -1915.27 -2065.72 541.475 0 0 0 25.7118 0 0 0 0 0.05 0 0 0 0 0 0 -338.221 0 2484.59 0 0 0 0 0 0 0 0 0 0 0 -94.8363 -817.057 0 0 0 0 0 0 0 0 0 315.79 0 842.54 0 -967.055 0 0 1417.66 
290.765 0 1158.71 -408.719 0 0 0 779.366 0 0 0 294.275 0 0 1351.13 0 0 0 1662.88 0 0 615.635 0 2463.38 0 0.05 0 0 0 -518.738 -1473.2 0 -2017.96 717.414 626.011 -1074.63 0 0 0 0 0 1940.9 0 0 0 0 0 0 0 201.956 501.495 0 0 0 0 0 0 0 0 -1436.74 -2173.15 0 0 0 
0 0 0 1280.94 1975.39 382.778 0 0 0 0 2339.93 0 187.002 0 0 -2403.26 2285.61 0 0 915.021 0 0 -1288.72 0 0 0 0 0 0 0 0 0 -1697.67 0 818.735 653.63 0 0 1775.03 1959.36 0 0 0 0 0 1046.56 0 0 0 0 0 0 0 0 0 0 2286.22 1511.51 -2432.55 0 0 0 0 0 
0 0 0 -1474.88 0 0 0 2247 0 0 0 2247.76 -811.258 877.483 0 0 0 0 0 -1329.16 0 0 0 0 0 0 0 0 0 -819.193 0 0 -1162.37 2019.64 0 0 0 1347.93 0 0 0 0 1561.1 0 -1286.89 0 1666.08 0 929.06 0 0 0 0 0 0 0 0 0 0 0 0 0 0 -1556.67 
2492.22 1596.65 0 2032.76 0 0 0 1598.18 0 0 0 -1163.29 -439.695 0 0 0 0 308.466 -2069.84 0 0 0 0 -2361.6 0 0 0 0 0.01 0 0 1521.12 0 0 0 0 0 0 0 0 0 0 0 0 0 2449.03 0 0 0 0 0 -1797.92 0 0 0 0 0 0 0 0 0 0 0 0 
841.929 0 0 0 -931.654 254.601 0 0 0 1678.59 0 0 0 0 0 0 -1979.51 0 0 0 0 0 0 0 0 549.867 0 484.1 0 0.02 0 1862.32 -462.127 0 0 0 1157.8 0 0 0 -35.6304 -832.316 0 0 0 0 0 0 -304.651 0 0 -226.524 0 0 2002.7 762.123 -2300.87 0 0 0 0 0 0 0 
1513.03 0 225.303 314.264 0 0 0 0 0 0 0 0 0 0 0 0 0 0 159.23 -2107.99 0 1596.5 0 0 0 1681.04 0 0 0 0 0 0 0 0 0 0 0 -2384.64 711.921 0 0 1664.25 0 0 1691.87 -606.632 0 0 -392.85 0 0 0 0 0 -2274.62 0 -234.458 295.953 0 0 0 0 0 0 
1030.99 2029.56 0 0 0 -3.28074 2270.65 0 -1557.44 864.666 0 -364.162 0 0 0 0 0 -1859.57 0 0 2435 931.959 -1641.06 0 953.322 0 0 0 1290.25 792.795 0 0.07 0 24.0333 0 0 0 0 0 0 0 0 0 0 0 0 0 0 0 0 0 0 -250.328 0 0 0 0 0 0 0 920.362 0 0 0 
0 317.011 0 0 -2430.57 392.392 1376.77 0 1717.2 0 0 0 0 0 0 -71.1844 0 0 1334.65 0 0 0 0 0 0 -743.049 1993.7 -1524.48 0 1815.62 0 0 0.09 0 -1468.32 0 0 0 0 2429.35 0 0 0 0 28.4585 0 0 0 2248.38 0 0 0 0 0 0 0 0 0 0 0 0 0 0 0 
0 0 -2321.31 0 0 0 935.926 0 0 0 -1697.67 0 -1687.29 0 1799.6 0 -137.257 0 0 2283.01 0 0 2129.66 0 2452.24 2076.71 0 1433.07 0 0 0 1769.69 0 0.08 0 0 0 0 0 0 0 1724.07 0 0 0 0 0 0 0 0 792.642 0 0 0 0 0 0 0 -1869.79 0 0 0 0 0 
0 2133.93 0 0 1613.74 1116.75 0 0 -2253.87 0 1466.64 0 0 0 0 0 0 0 0 0 0 2395.93 -2170.09 0 0 2191.61 -1433.99 0 0 0 0 0 -1392.18 0 0.09 0 0 0 0 0 0 0 0 -830.18 0 2303.92 0 1019.7 0 0 -1651.74 0 0 2069.23 2391.05 0 0 0 0 0 0 0 0 0 
0 0 -1223.56 0 0 0 0 0 0 0 0 0 0 0 0 1897.26 -1744.82 0 0 0 0 0 0 0 0 -1072.8 722.602 0 0 0 0 0 0 0 0 0.08 0 2178.03 0 1994.77 0 1952.35 1024.12 0 -501.343 0 0 0 0 0 0 0 0 0 0 -2416.07 0 0 0 0 0 0 0 0 
0 0 0 0 0 0 0 0 0 0 0 -2173.45 1154.59 0 -1074.94 0 2312.62 0 0 0 0 -455.87 0 0 0 0 0 0 0 -360.5 0 0 0 0 0 0 0.07 0 0 0 -11.8259 1205.56 0 0 2155.29 606.937 0 1831.8 0 0 0 0 0 0 0 0 0 0 0 0 0 0 0 2376.4 
-1781.9 0 0 2114.7 -1201.28 0 0 0 2168.72 -776.467 0 1515.32 0 0 0 0 0 -1074.94 0 0 2486.11 0 0 730.842 0 0 0 1898.02 0 0 2048.78 0 0 0 0 -2059.77 0 0.03 0 0 0 0 0 848.033 814.31 0 0 0 -1681.95 0 0 0 0 0 0 0 0 0 0 0 0 0 74.8466 0 
0 0 -648.9 0 0 0 0 0 1560.95 336.238 -717.414 0 0 497.986 -972.243 0 -1916.79 0 488.372 0 0 1965.93 0 970.412 0 0 -1031.3 0 0 0 1024.12 0 0 0 0 0 0 0 0.09 895.795 0 0 0 0 0 0 54.2467 0 0 0 0 1090.96 0 0 -129.17 0 0 0 0 0 0 0 0 0 
0 0 0 0 0 -751.442 0 0 0 1457.95 0 0 0 0 2483.52 0 0 0 814.158 0 0 0 2149.65 53.1785 0 0 600.375 0 0 0 0 0 24.1859 0 0 -2370.14 0 0 -983.23 0.07 -566.805 0 0 0 -125.66 -678.045 0 0 0 0 0 0 -716.498 0 0 0 0 1954.33 -1971.42 0 0 1160.54 1037.25 0 
0 0 0 0 1147.11 -1644.26 2320.86 0 0 711.615 0 0 0 0 0 0 0 -405.057 -1061.51 -15.6407 0 0 0 0 0 0 0 0 0 1769.69 0 0 0 0 0 0 -1335.57 0 0 561.464 0.03 0 2244.71 0 0 0 -1127.28 0 0 0 0 0 0 -1372.04 0 0 0 0 0 0 -1699.96 0 0 0 
0 0 0 1799.75 1310.39 0 -1370.36 0 0 0 -1536.07 0 0 0 0 0 0 0 0 2279.2 -1655.4 0 0 -610.904 0 1693.55 0 0 0 2039.32 1425.14 0 0 1896.8 0 366.756 857.646 0 0 0 0 0.06 0 0 357.601 0 0 0 0 0 0 0 0 -2296.14 0 0 0 0 0 0 0 0 0 0 
0 0 842.845 0 0 0 1261.56 2149.65 0 0 0 0 0 -212.943 0 1962.26 0 2319.94 0 0 0 0 1454.59 208.518 0 0 0 2029.4 0 0 0 0 0 0 0 660.344 0 0 0 0 95.9044 0 0.02 0 0 2392.27 0 0 0 112.079 0 0 0 0 0 982.925 0 0 0 0 0 0 0 0 
0 0 0 1583.38 0 0 0 0 0 0 -294.885 0 0 0 594.424 1368.07 0 0 -415.738 0 -4.34889 1445.13 -1123.77 0 0 0 0 0 0 0 0 0 0 0 1326.56 0 0 -209.128 0 0 0 0 0 0.03 0 0 0 2100.05 0 0 0 0 0 0 0 0 0 0 0 0 0 0 0 306.482 
0 1752.3 -1553.93 1453.98 -99.7192 537.812 0 0 0 877.331 0 0 0 -130.543 1575.59 0 0 2296.59 0 0 0 1188.31 0 0 0 0 0 1726.66 0 0 -2197.87 0 163.198 0 0 -854.289 178.61 -1315.88 0 1773.96 0 46.7696 0 0 0.01 0 0 0 0 0 -1985.15 0 0 0 0 0 2361.9 0 -382.778 -1430.33 0 0 0 0 
0 -385.372 0 -259.789 2306.51 563.295 -1874.37 0 0 0 1478.39 0 1871.93 2244.87 0 0 0 0 1850.87 0 -213.248 0 0 0 -737.556 0 887.86 0 -333.491 0 873.058 0 0 0 -2111.19 0 2368.47 0 0 2300.71 0 0 -2206.87 0 0 0.04 1524.93 0 0 0 0 0 0 0 0 0 0 0 0 0 0 0 0 0 
2059.92 0 1886.73 0 2246.7 0 0 0 0 1663.34 0 0 0 0 0 0 0 0 0 -2262.57 0 0 344.172 -1379.82 873.516 0 0 1330.23 0 0 0 0 0 0 0 0 0 0 2277.21 0 241.63 0 0 0 0 1233.63 0.08 0 0 0 0 0 0 0 0 0 0 0 0 0 0 983.23 0 0 
0 2466.28 0 0 0 0 0 0 2168.42 0 0 0 77.5933 0 0 0 0 0 0 -1036.18 0 0 0 0 0 0 0 0 0 0 0 0 0 0 64.7755 0 207.755 0 0 0 0 0 0 1263.08 0 0 0 0.01 0 0 0 -960.646 0 0 0 0 0 -1096.91 0 0 0 0 0 0 
0 0 0 0 0 0 0 -173.269 0 0 0 0 2270.35 0 0 0 0 0 142.445 0 0 0 0 0 0 0 0 -212.18 0 1298.03 79.4244 0 -1019.7 0 0 0 0 -600.223 0 0 0 0 0 0 0 0 0 0 0.09 0 0 0 0 0 0 0 0 0 0 0 0 0 0 0 
0 0 0 0 0 0 0 0 0 0 0 0 0 -38.377 0 0 0 0 0 0 0 0 -386.135 -1235.92 0 2225.64 0 0 0 0 0 0 0 0 0 0 0 0 0 0 0 0 1783.73 0 0 0 0 0 0 0.05 0 0 0 0 0 0 0 0 0 0 0 0 0 0 
0 0 0 0 0 0 0 0 0 0 1909.31 0 0 0 0 0 0 0 -1747.41 0 0 0 9.07926 0 0 461.516 0 0 0 0 0 0 0 1753.97 2095.78 0 0 0 0 0 0 0 0 0 -2160.33 0 0 0 0 0 0.05 1503.42 0 0 0 0 0 0 1683.02 0 728.706 0 0 0 
0 0 0 -1054.64 0 0 0 0 0 0 0 0 2118.52 0 0 0 0 0 0 0 0 0 0 0 0 0 0 0 -411.313 1436.74 0 0 0 0 0 0 0 0 1328.55 0 0 0 0 0 0 0 0 1676.15 0 0 1190.6 0.01 0 0 0 0 0 0 0 0 0 0 0 219.352 
0 0 2222.43 0 0 0 0 0 0 0 0 0 0 1326.11 0 0 0 0 0 0 0 0 0 0 0 0 0 0 0 0 0 -1187.09 0 0 0 0 0 0 0 1758.25 0 0 0 0 0 0 0 0 0 0 0 0 0.07 0 0 0 0 0 0 0 0 -1905.19 -255.516 0 
0 0 0 0 -1277.73 0 0 0 0 0 0 0 0 0 1297.27 0 0 0 0 0 0 0 0 0 0 0 0 0 0 0 0 0 0 0 1882.46 0 0 0 0 0 1679.82 126.118 0 0 0 0 0 0 0 0 0 0 0 0.07 0 0 0 0 0 0 0 0 0 0 
0 0 0 -682.318 0 0 0 0 2287.59 1682.41 0 0 0 0 0 0 0 0 0 0 0 0 0 0 0 0 0 0 0 2124.62 2127.83 0 0 0 -2499.69 0 0 0 -1809.06 0 0 0 0 0 0 0 0 0 0 0 0 0 0 0 0.09 0 0 -1853.01 1614.35 -2187.95 0 0 0 0 
0 -1505.86 0 0 0 0 0 0 -1399.35 0 0 0 0 0 0 0 0 0 2103.56 0 0 0 0 0 0 0 0 0 0 -954.237 0 0 0 0 0 2364.35 0 0 0 0 0 0 190.817 0 0 0 0 0 0 0 0 0 0 0 0 0.02 0 0 0 0 0 0 0 0 
0 2072.28 0 0 0 0 0 0 -1912.06 0 0 0 0 0 1205.71 0 0 0 0 0 0 0 0 0 -311.823 0 1119.8 0 0 -1500.37 760.598 0 0 0 0 0 0 0 0 0 0 0 0 0 1448.03 0 0 0 0 0 0 0 0 0 0 0 0.03 0 0 0 0 0 0 0 
1683.17 0 0 0 0 0 0 0 0 0 0 967.36 0 0 2133.47 0 0 -1365.93 0 0 0 2272.33 0 0 0 0 -1713.54 0 0 0 1284.91 0 0 0 0 0 0 0 0 -400.632 0 0 0 0 0 0 0 1403.32 0 0 0 0 0 0 -703.986 0 0 0.04 -970.717 0 0 0 0 0 
0 0 1642.89 0 0 0 0 0 0 1246.6 0 0 0 0 0 0 0 0 0 0 -1725.9 0 0 0 364.467 0 -1342.74 0 0 0 0 0 0 -1457.79 0 0 0 0 0 1957.08 0 0 0 0 1628.39 0 0 0 0 0 -2358.09 0 0 0 -1656.01 0 0 2088 0 0 0 0 0 1728.8 
0 187.002 -792.642 0 0 0 0 0 0 0 0 0 0 0 0 0 0 0 0 0 0 -286.035 0 0 0 40.2081 0 0 0 0 0 0 0 0 0 0 0 0 0 0 0 0 0 0 1099.66 0 0 0 0 0 0 0 0 0 232.933 0 0 0 0 0.04 0 0 0 0 
0 -839.488 0 -363.399 0 0 0 0 0 0 0 2046.04 0 0 0 0 0 0 0 0 876.415 0 0 0 1306.42 1419.34 0 0 0 0 0 -950.117 0 0 0 0 0 0 0 0 710.089 0 0 0 0 0 0 0 0 0 251.701 0 0 0 0 0 0 0 0 0 0.03 0 0 0 
277.184 0 1654.79 0 2128.44 0 0 -947.676 0 0 2233.42 0 0 0 0 0 -396.97 0 0 0 0 0 0 0 0 0 0 0 0 0 0 0 0 0 0 0 0 0 0 95.7518 0 0 0 0 0 0 -354.701 0 0 0 0 0 -2220.91 0 0 0 0 0 0 0 0 0.04 0 0 
0 0 -1997.51 -2292.78 2484.59 -340.968 0 0 0 677.282 0 0 0 1969.89 0 0 0 -577.487 0 0 606.021 0 0 0 0 0 0 0 0 0 0 0 0 0 0 0 0 2478.64 0 2059.77 0 0 0 0 0 0 0 0 0 0 0 0 759.987 0 0 0 0 0 0 0 0 0 0.04 0 
0 0 0 0 0 0 0 0 0 0 0 0 0 0 0 2305.44 0 0 0 0 0 0 0 537.049 1425.9 0 0 2093.04 0 0 0 0 0 0 0 0 894.726 0 0 0 0 0 0 1564.3 0 0 0 0 0 0 0 1054.34 0 0 0 0 0 0 2261.19 0 0 0 0 0.01 
