*Vertices 63
*Matrix 
0.07 1488.92 0 0 0 109.638 0 1825.69 0 0 2223.96 0 0 0 0 -1572.7 0 0 0 1288.26 0 1769.39 0 0 91.0215 0 0 0 0 2399.59 0 0 0 297.174 0 0 1299.55 0 0 0 0 0 0 0 0 0 0 0 0 -572.298 -1454.89 0 0 0 0 0 0 0 0 585.421 0 0 0 
1812.11 0 -1137.81 0 2456.66 0 1750.77 1878.64 0 446.257 0 0 0 0 0 2282.1 0 0 0 0 0 -1868.88 0 0 0 0 0 0 2137.59 0 -47.38 0 0 0 0 0 0 250.175 1567.2 0 0 2145.68 0 0 0 -157.857 2427.52 0 1543.4 0 0 0 0 0 0 0 0 0 0 0 0 0 0 
0 1675.39 0.01 0 0 -2438.66 568.331 1415.68 0 0 0 -412.534 0 0 971.633 2137.9 0 2461.39 0 -143.361 0 0 570.925 0 212.638 2010.18 0 0 0 0 0 0 0 0 0 2420.5 0 0 0 0 1709.72 0 0 0 0 -2337.34 746.101 0 1101.95 0 0 0 0 0 0 -1001.85 0 -12.4363 0 0 -2262.72 0 0 
0 0 0 0.09 0 1142.84 1183.43 0 1869.95 1485.56 0 0 1681.49 0 0 2349.39 0 0 897.931 0 0 0 0 0 0 0 0 0 0 0 0 0 0 2296.59 0 0 0 1014.51 0 0 0 0 0 -1929.61 0 0 0 -1769.69 0 0 0 0 0 0 0 2219.84 0 0 0 0 0 0 0 
0 1146.05 0 0 0.08 0 0 63.097 -1919.08 0 0 0 0 0 0 0 1758.25 0 1938.92 0 0 0 0 0 157.094 424.741 0 0 0 1400.42 0 0 0 0 0 0 0 0 2170.25 0 0 0 254.448 0 0 0 0 0 0 0 0 0 0 0 0 0 0 0 0 0 0 0 0 
357.295 0 1873.45 2109.67 0 0.06 0 0 1218.83 0 0 0 1317.26 2089.68 1769.08 -1673.86 0 0 0 0 0 -937.605 1264.61 0 0 0 0 1788.31 0 2237.39 0 0 0 0 0 -828.196 0 0 0 0 0 0 0 0 -1048.54 0 0 0 0 0 0 0 0 0 0 0 444.426 0 0 0 0 0 -2247 
0 -2146.9 1667.3 -1572.85 0 0 0.07 1837.75 -1336.79 0 804.239 734.962 -2347.87 0 0 1855.91 1266.59 0 0 0 1715.22 0 0 1201.59 838.115 -1085.47 0 1690.65 0 0 0 0 1384.24 0 0 0 0 0 0 0 0 0 0 0 0 0 0 0 0 0 0 0 0 0 0 0 0 0 0 0 0 0 0 
1999.34 622.654 -2157.12 0 2261.04 0 2076.25 0.05 0 0 0 0 0 -2259.36 896.1 0 0 0 1776.56 0 0 1699.65 0 -938.52 0 0 1228.9 0 0 0 0 0 0 0 0 0 0 0 0 -966.445 0 0 0 0 0 0 2152.7 0 0 313.959 0 0 0 0 0 0 0 0 0 0 2499.85 0 1969.13 
0 0 0 -846.355 259.331 239.036 918.226 0 0.08 821.94 0 0 0 0 0 0 0 0 0 0 0 0 1570.1 1704.38 1627.63 0 0 0 0 -2214.5 0 761.971 0 0 -1703.01 0 0 459.38 0 0 0 0 1811.04 0 0 0 641.728 0 0 0 0 0 0 0 0 2174.67 0 0 1746.19 0 0 0 0 
0 2081.13 0 548.341 0 0 0 0 1728.34 0.08 0 25.8644 0 -1525.54 0 0 0 0 0 0 0 0 0 0 0 0 0 1542.63 0 769.601 1711.86 0 0 0 0 0 0 0 0 0 0 0 0 0 0 -2075.33 0 0 0 0 -795.694 326.777 0 0 -721.992 0 0 0 464.721 0 0 0 0 
1692.33 0 0 0 0 0 2286.22 0 0 0 0.05 0 0 2011.4 -1785.71 0 -475.402 0 0 0 0 0 0 0 0 0 0 0 0 2202.6 0 0 0 0 0 0 0 0 0 0 0 0 0 0 0 -730.079 0 0 0 951.033 0 0 0 0 0 0 0 1409.73 0 0 0 1804.33 0 
0 0 -1120.41 0 0 0 2343.44 0 0 1534.24 0 0.07 1523.56 0 0 1072.8 0 299.31 0 0 1323.66 -2076.25 0 603.732 0 0 0 -878.094 0 0 0 302.973 0 1481.6 2118.82 0 0 0 0 0 0 0 0 0 0 0 0 -1149.1 1009.63 0 0 0 0 0 0 0 0 0 -1699.04 0 0 0 0 
0 0 0 903.119 0 -1540.19 2491.91 0 0 0 0 1600.01 0 2375.03 0 0 1719.95 0 905.255 0 50.4318 0 0 0 0 -1151.23 0 0 0 0 0 0 0 0 0 0 -1547.21 0 0 0 -1034.96 0 0 0 0 0 757.851 0 202.414 0 0 -1186.64 0 0 0 0 0 -872.295 0 0 -1731.09 0 0 
0 0 0 0 0 -760.598 0 1618.78 0 1150.32 1203.88 0 1034.65 0.05 275.811 0 327.235 917.92 0 707.648 -198.599 1701.03 -197.684 0 962.783 0 -1160.39 0 0 0 0 0 0 -2121.88 0 0 0 0 -474.334 -304.651 0 0 0 0 0 0 0 0 0 0 0 0 0 0 0 474.334 0 0 0 0 0 0 0 
0 0 -146.413 0 0 -2138.2 0 700.018 0 0 -467.925 0 0 1208.46 0.03 0 0 0 0 0 0 1275.9 0 0 0 0 0 0 0 -101.093 0 2141.71 0 0 0 1204.64 0 0 0 0 0 2000.26 0 0 0 -1125.9 0 1247.52 0 0 0 0 0 0 0 0 0 0 0 0 1662.42 869.549 0 
-439.238 84.7652 1188.47 279.931 0 111.316 2389.07 0 0 0 0 44.0229 0 0 0 0.09 0 0 0 376.217 2153.31 0 0 1778.24 0 0 0 2435.91 -1180.07 0 0 0 0 0 -271.081 0 -77.2881 0 0 0 1331.6 0 0 0 0 0 0 0 0 0 0 0 0 0 0 0 -592.135 0 0 0 0 -2482.91 0 
0 0 0 0 -2492.98 0 -912.427 0 0 0 1925.34 0 1459.17 985.214 0 0 0.04 0 -2011.86 0 0 1799.75 0 2462.77 0 0 1278.95 0 0 0 0 0 0 0 0 0 -56.0778 646.306 0 0 0 0 0 0 0 0 0 0 0 0 0 0 0 0 0 0 0 -64.0126 0 0 0 0 0 
0 0 -1867.2 0 0 0 0 0 0 0 0 -1904.89 0 -270.623 0 0 0 0.02 0 1233.94 0 0 0 -1404.08 0 2259.36 0 0 1531.95 1800.97 0 0 0 0 603.885 0 0 0 0 0 0 0 0 0 0 0 0 0 0 0 -1216.54 1728.49 0 1851.63 0 0 0 0 0 1792.89 0 0 0 
0 0 0 133.29 -1660.44 0 0 1826 0 0 0 0 1290.09 0 0 0 1775.19 0 0.08 0 0 0 0 2006.82 0 0 0 0 0 0 0 0 0 0 0 0 0 0 0 0 0 0 -1884.44 0 0 0 0 1618.32 0 0 0 0 0 0 0 0 0 0 0 0 0 0 0 
449.919 0 -819.956 0 0 0 0 0 0 0 0 0 0 899.762 0 956.069 0 1378.9 0 0.04 0 0 0 91.0215 0 0 0 0 0 0 0 0 0 0 0 0 2028.03 0 0 0 0 -55.0096 0 0 0 0 0 0 0 0 0 0 0 711.463 0 -1526.46 0 0 0 0 0 0 0 
0 0 0 0 0 0 1805.25 0 0 0 0 443.663 1125.14 2019.18 0 1541.41 0 0 0 0 0.05 0 0 0 0 2103.56 -1021.99 0 0 0 0 0 0 0 0 -898.236 0 0 0 0 1050.83 0 0 0 0 0 0 0 2342.07 0 0 0 0 0 2073.2 0 -194.632 -1878.19 0 0 0 497.375 0 
-2043.6 2257.38 0 0 0 -756.325 0 2389.22 0 0 0 -827.281 0 -1263.24 -288.324 0 -1087.45 0 0 0 0 0.09 603.732 0 0 0 0 0 2115.77 2032.91 1209.22 0 78.814 0 0 0 0 -415.891 0 0 0 0 0 0 487.152 0 0 467.772 0 0 0 0 0 0 2446.59 0 0 0 0 0 0 0 0 
0 0 2096.39 0 0 510.651 0 0 718.329 0 0 0 0 -196.463 0 0 0 0 0 0 0 2437.13 0.09 -303.125 1632.51 -1992.02 0 0 1553.47 0 0 0 0 0 0 0 0 -2000.41 0 0 0 0 0 0 0 0 0 0 0 0 0 0 0 0 0 -1078.45 0 0 0 0 0 0 0 
0 0 0 0 0 0 -2481.08 1918.47 2348.48 0 0 1265.22 0 0 0 924.635 1772.9 992.538 1217.76 1727.12 0 0 1947 0.06 -1926.4 0 -1545.99 1838.51 0 0 0 0 0 0 -646.458 0 0 0 0 0 0 0 0 0 0 0 0 0 0 0 1214.1 0 0 0 0 0 0 0 -1038.16 0 0 0 0 
1047.47 0 363.094 0 -428.404 0 2151.63 0 -1921.52 0 0 0 0 1616.64 0 0 0 0 0 0 0 0 1748.33 508.515 0.08 0 0 0 0 0 -1327.78 0 0 193.258 0 0 2454.83 0 0 0 0 0 0 0 0 -1907.48 0 0 0 0 0 0 0 0 0 0 0 0 0 0 0 0 0 
0 0 -6.94296 0 -552.766 0 1123.16 0 0 0 0 0 -595.645 0 0 0 0 -914.716 0 0 2347.71 0 -18.8452 0 0 0.05 0 0 932.569 0 0 0 0 0 0 0 0 0 0 0 0 0 0 0 1688.36 0 678.35 0 0 0 0 0 0 0 0 0 0 0 0 0 0 0 0 
0 0 0 0 0 0 0 742.897 0 0 0 0 0 1546.45 0 0 -1898.79 0 0 0 1234.86 0 0 -2041.15 0 0 0.02 0 0 721.381 0 0 0 0 0 0 0 0 0 2340.69 0 0 -1355.71 0 0 0 0 0 0 0 0 0 -1176.72 0 0 0 0 0 0 0 0 0 0 
0 0 0 0 0 378.201 -146.565 0 0 -202.567 0 1641.06 0 0 0 -787.301 0 0 0 0 0 0 0 2411.8 0 0 0 0.01 0 -800.119 1995.07 0 0 620.06 0 0 0 0 0 0 0 0 0 0 0 0 0 1245.99 0 -497.986 0 0 0 0 0 0 0 0 -2290.64 0 0 0 0 
0 670.873 0 0 0 0 0 0 0 0 0 0 0 0 0 -1977.37 0 2152.39 0 0 0 204.398 1813.49 0 0 1329.62 0 0 0.06 0 0 0 280.999 0 0 0 0 0 0 0 0 0 0 0 0 0 0 0 0 0 0 0 2499.85 -579.012 0 0 1086.99 -1935.26 0 0 0 0 0 
1717.35 0 0 0 1338.92 -199.82 0 0 -1412.78 2343.9 434.812 0 0 0 245.14 0 0 -844.676 0 0 0 1858.35 0 0 0 0 1705.91 -599.765 0 0.08 0 0 0 0 0 0 0 -134.816 0 0 0 0 0 0 0 0 0 0 0 0 0 0 0 0 0 0 0 0 0 0 0 0 511.414 
0 466.704 0 0 0 0 0 0 0 1895.28 0 0 0 0 0 0 0 0 0 0 0 -988.571 0 0 2473.45 0 0 656.682 0 0 0.02 0 0 1893.44 1169.39 0 0 0 0 0 0 0 0 0 0 0 0 0 0 0 0 0 0 0 0 0 0 -1253.78 0 -605.258 -1460.08 0 -1296.35 
0 0 0 0 0 0 0 0 582.98 0 0 2412.72 0 0 864.36 0 0 0 0 0 0 0 0 0 0 0 0 0 0 0 0 0.03 0 0 0 0 0 0 2422.64 0 0 0 0 0 0 0 0 0 0 0 0 0 0 0 0 0 0 -1083.79 0 0 0 0 489.898 
0 0 0 0 0 0 518.891 0 0 0 0 0 0 0 0 0 0 0 0 0 0 242.698 0 0 0 0 0 0 -310.755 0 0 0 0.01 0 0 0 0 -400.021 504.089 0 0 0 0 0 0 0 0 0 0 0 0 0 0 0 0 0 0 0 0 890.149 0 0 0 
-309.992 0 0 530.183 0 0 0 0 0 0 0 1389.13 0 1665.32 0 0 0 0 0 0 0 0 0 0 -1136.59 0 0 1635.87 0 0 760.903 0 0 0.03 0 0 0 0 0 0 -1938 0 0 1705.3 0 -962.63 0 0 0 0 0 2253.72 0 0 0 0 0 0 0 -242.088 0 0 0 
0 0 0 0 0 0 0 0 1006.58 0 0 -42.497 0 0 0 363.857 0 799.509 0 0 0 0 0 1620.15 0 0 0 0 0 0 2441.56 0 0 0 0.03 0 0 0 0 0 788.369 0 0 0 0 0 0 0 0 0 0 -1502.35 0 0 0 0 0 0 0 0 0 0 0 
0 0 -232.78 0 0 1897.11 0 0 0 0 0 0 0 0 203.482 0 0 0 0 0 723.365 0 0 0 0 0 0 0 0 0 0 0 0 0 0 0.06 -995.285 -2379.3 0 0 0 1329.62 0 0 2461.7 0 0 0 0 0 0 0 0 0 0 0 0 0 1201.59 0 0 0 0 
376.827 0 0 0 0 0 0 0 0 0 0 0 2489.93 0 0 -1750.31 -889.538 0 0 -2164.45 0 0 0 0 2123.25 0 0 0 0 0 0 0 0 0 0 603.122 0.09 0 1832.71 0 0 0 -1168.78 377.285 0 0 0 0 0 -171.133 0 0 0 0 0 0 0 0 0 1686.53 0 0 0 
0 1184.04 0 -2312.62 0 0 0 0 -216.758 0 0 0 0 0 0 0 2194.36 0 0 0 0 396.512 1457.79 0 0 0 0 0 0 -2170.55 0 0 1659.98 0 0 2298.73 0 0.09 0 0 0 0 0 1098.74 0 0 -844.676 0 0 0 0 0 -2263.33 0 0 0 1970.81 0 0 0 0 235.221 0 
0 525.147 0 0 1995.38 0 0 0 0 0 0 0 0 -190.512 0 0 0 0 0 0 0 0 0 0 0 0 0 0 0 0 0 2254.63 918.836 0 0 0 246.055 0 0.03 0 0 0 2487.64 0 0 0 0 0 0 0 945.845 0 0 0 0 0 0 0 0 286.035 -345.393 0 0 
0 0 0 0 0 0 0 1307.79 0 0 0 0 0 1516.85 0 0 0 0 0 0 0 0 0 0 0 0 326.472 0 0 0 0 0 0 0 0 0 0 0 0 0 0 0 0 0 0 0 0 0 0 0 0 0 0 0 0 0 0 0 0 -2019.03 0 0 0 
0 0 2259.06 0 0 0 0 0 0 0 0 0 -951.643 0 0 578.402 0 0 0 0 667.058 0 0 0 0 0 0 0 0 0 0 0 0 2387.39 -1135.98 0 0 0 0 0 0.09 0 784.097 0 0 2187.49 0 0 0 0 0 0 0 0 0 0 0 301.599 0 0 0 0 0 
0 732.521 0 0 0 0 0 0 0 0 0 0 0 0 -535.371 0 0 0 0 140.004 0 0 0 0 0 0 0 0 0 0 0 0 0 0 0 559.633 0 0 0 0 0 0.03 0 0 0 0 0 0 0 0 0 0 0 0 0 0 0 0 0 0 0 0 0 
0 0 0 0 -969.344 0 0 0 2153.16 0 0 0 0 0 0 0 0 0 873.821 0 0 0 0 0 0 0 1148.95 0 0 0 0 0 0 0 0 0 465.636 0 1934.8 0 -681.707 0 0.08 0 0 0 0 0 0 0 2454.83 0 0 612.125 0 0 0 0 682.165 0 0 -1915.72 0 
0 0 0 1533.02 0 0 0 0 0 0 0 0 0 0 0 0 0 0 0 0 0 0 0 0 0 0 0 0 0 0 0 0 0 872.6 0 0 -1840.49 2228.54 0 0 0 0 0 0.02 0 0 0 1050.68 2080.98 0 0 0 0 0 2192.98 0 0 0 0 0 0 0 0 
0 0 0 0 0 177.847 0 0 0 0 0 0 0 0 0 0 0 0 0 0 0 -2170.25 0 0 0 454.344 0 0 0 0 0 0 0 0 0 2470.85 0 0 0 0 0 0 0 0 0.08 0 0 0 0 0 0 0 0 537.049 0 0 1142.38 -1822.95 -916.7 0 0 0 0 
0 574.892 2186.57 0 0 0 0 0 0 1337.7 66.4541 0 0 0 1987.29 0 0 0 0 0 0 0 0 0 1227.84 0 0 0 0 0 0 0 0 996.353 0 0 0 0 0 0 -578.097 0 0 0 0 0.03 0 0 0 0 0 0 940.962 0 0 0 0 177.847 0 0 0 0 0 
0 2344.51 -1235.92 0 0 0 0 2327.11 1699.35 0 0 0 -631.504 0 0 0 0 0 0 0 0 0 0 0 0 -1902.91 0 0 0 0 0 0 0 0 0 0 0 1272.7 0 0 0 0 0 0 0 0 0.06 0 0 45.7015 0 0 0 0 1550.72 0 0 0 -1232.41 0 -1845.07 0 0 
0 0 0 109.638 0 0 0 0 0 0 0 1063.04 0 0 -1079.36 0 0 0 1708.04 0 0 123.676 0 0 0 0 0 2496.8 0 0 0 0 0 0 0 0 0 0 0 0 0 0 0 493.561 0 0 0 0 0 0 0 0 0 0 -67.5222 0 -940.962 0 0 -110.248 0 0 1714.76 
0 128.101 -391.171 0 0 0 0 0 0 0 0 1578.19 -2221.67 0 0 0 0 0 0 0 134.663 0 0 0 0 0 0 0 0 0 0 0 0 0 0 0 0 0 0 0 0 0 0 -1705.15 0 0 0 0 0.07 0 1399.66 2315.52 1832.1 0 0 -265.282 0 0 0 0 0 0 0 
139.851 0 0 0 0 0 0 2454.53 0 0 2452.39 0 0 0 0 0 0 0 0 0 0 0 0 0 0 0 0 1639.68 0 0 0 0 0 0 0 0 -1649.91 0 0 0 0 0 0 0 0 0 -1547.52 0 0 0.02 0 0 0 0 0 306.787 0 0 0 0 0 1397.21 0 
2082.05 0 0 0 0 0 0 0 0 -2484.13 0 0 0 0 0 0 0 256.584 0 0 0 0 0 2229.61 0 0 0 0 0 0 0 0 0 0 0 0 0 0 -1894.97 0 0 0 481.353 0 0 0 0 0 1780.68 0 0.09 0 0 0 0 0 0 0 0 0 0 0 0 
0 0 0 0 0 0 0 0 0 -2268.97 0 0 1445.59 0 0 0 0 1320.76 0 0 0 0 0 0 0 0 0 0 0 0 0 0 0 2092.88 -628.3 0 0 0 0 0 0 0 0 0 0 0 0 0 866.649 0 0 0 0 0 0 0 0 0 0 0 0 0 0 
0 0 0 0 0 0 0 0 0 0 0 0 0 0 0 0 0 0 0 0 0 0 0 0 0 0 711.615 0 -333.644 0 0 0 0 0 0 0 0 1738.56 0 0 0 0 0 0 0 2109.82 0 0 2247.76 0 0 0 0.01 0 0 -942.335 0 0 2495.12 0 0 0 -991.012 
0 0 0 0 0 0 0 0 0 0 0 0 0 0 0 0 0 -818.583 0 458.617 0 0 0 0 0 0 0 0 -1300.01 0 0 0 0 0 0 0 0 0 0 0 0 0 1223.11 0 1234.24 0 0 0 0 0 0 0 0 0 0 0 0 0 0 0 689.489 0 0 
0 0 0 0 0 0 0 0 0 567.873 0 0 0 0 0 0 0 0 0 0 2187.8 -2298.58 0 0 0 0 0 0 0 0 0 0 0 0 0 0 0 0 0 0 0 0 0 1552.4 0 0 1183.43 -1583.68 0 0 0 0 0 0 0 0 0 0 0 0 1931.59 0 0 
0 0 1776.25 435.728 0 0 0 0 -1630.83 0 0 0 0 2081.74 0 0 0 0 0 -699.866 0 0 2491.76 0 0 0 0 0 0 0 0 0 0 0 0 0 0 0 0 0 0 0 0 0 0 0 0 0 1774.12 -1203.27 0 0 2424.62 0 0 0.09 0 0 0 0 0 0 0 
0 0 0 0 0 1985 0 0 0 0 0 0 0 0 0 1826.61 0 0 0 0 597.171 0 0 0 0 0 0 0 2398.68 0 0 0 0 0 0 0 0 -244.987 0 0 0 0 0 0 1658.3 0 0 -497.528 0 0 0 0 0 0 0 0 0.08 0 0 1406.83 0 0 0 
0 0 1975.39 0 0 0 0 0 0 0 -1169.24 0 1546.91 0 0 0 996.658 0 0 0 201.498 0 0 0 0 0 0 0 960.494 0 -1141.62 2294.76 0 0 0 0 0 0 0 0 -418.332 0 0 0 597.781 -1784.04 0 0 0 0 0 0 0 0 0 0 0 0.07 0 0 0 0 0 
0 0 0 0 0 0 0 0 -2031.85 -129.475 0 394.223 0 0 0 0 0 0 0 0 0 0 0 1707.74 0 0 0 2158.8 0 0 0 0 0 0 0 15.7933 0 0 0 0 0 0 -1487.24 0 1968.06 0 -1316.8 0 0 0 0 0 267.418 0 0 0 0 0 0 0 1509.37 0 -680.944 
1342.59 0 0 0 0 0 0 0 0 0 0 0 0 0 0 0 0 2176.81 0 0 0 0 0 0 0 0 0 0 0 0 1242.79 0 1534.55 -1108.2 0 0 -837.962 0 43.4126 -1751.08 0 0 0 0 0 0 0 -1209.98 0 0 0 0 0 0 0 0 2008.04 0 0 0.04 0 0 -2282.86 
0 0 -2122.03 0 0 0 0 -342.799 0 0 0 0 1709.57 0 1595.89 0 0 0 0 0 0 0 0 0 0 0 0 0 0 0 -341.578 0 0 0 0 0 0 0 2397.15 0 0 0 0 0 0 0 2026.81 0 0 0 0 0 0 1784.19 427.488 0 0 0 -2464.45 0 0.05 0 0 
0 0 0 0 0 0 0 0 0 0 1318.63 0 0 0 -174.184 2246.09 0 0 0 0 2317.8 0 0 0 0 0 0 0 0 0 0 0 0 0 0 0 0 2249.44 0 0 0 0 1542.63 0 0 0 0 0 0 2116.38 0 0 0 0 0 0 0 0 0 0 0 0.09 0 
0 0 0 0 0 1723.15 0 -463.805 0 0 0 0 0 0 0 0 0 0 0 0 0 0 0 0 0 0 0 0 0 -697.729 1150.17 890.606 0 0 0 0 0 0 0 0 0 0 0 0 0 0 0 2265.92 0 0 0 0 -1045.18 0 0 0 0 0 2322.38 1655.4 0 0 0.07 
