*Vertices 64
*Matrix 
0.09 1520.66 0 0 0 0 0 0 0 0 2161.55 0 0 -1452.91 0 0 0 0 0 0 0 0 0 0 0 0 0 0 0 0 0 0 0 0 0 0 0 0 -1293.45 0 0 0 1413.85 0 0 0 0 0 0 0 0 0 0 0 0 2428.59 0 0 2068.93 0 0 0 0 0 
1545.53 0.02 0 0 0 0 0 0 0 0 1291.01 0 0 0 0 0 0 0 0 1666.08 0 0 0 0 0 0 0 0 0 -334.864 0 0 1099.81 0 -612.125 0 0 0 0 0 0 -835.368 0 0 0 0 -1500.98 0 0 0 0 0 1215.32 -1061.66 0 0 0 0 0 0 0 0 0 0 
0 0 0.08 0 0 1690.19 0 0 0 0 0 0 0 0 0 0 1700.26 0 243.919 0 0 0 0 0 0 0 0 0 0 0 0 0 0 0 0 0 0 0 0 0 2097.46 0 0 0 0 0 0 0 2480.16 0 0 0 0 0 0 0 0 0 0 0 0 0 0 0 
0 0 0 0.09 0 0 0 0 0 0 0 -655.461 0 0 0 0 0 0 0 0 0 0 0 0 0 0 0 0 0 0 0 0 -1326.72 0 0 0 351.497 0 0 0 0 0 0 0 0 0 0 1898.79 0 0 0 0 0 0 -226.524 0 0 0 0 0 0 0 0 0 
0 0 0 0 0.09 0 -1009.32 0 0 0 0 0 -302.667 0 1801.89 0 0 0 480.59 0 0 0 0 0 0 0 200.888 0 0 0 0 0 1862.62 0 -958.052 0 0 0 0 0 0 0 0 0 0 0 1408.35 0 813.7 0 0 0 0 0 0 0 0 0 1454.44 0 0 0 0 0 
0 0 -916.089 0 0 0.05 0 0 0 2364.8 0 0 1589.02 0 0 0 -1283.53 0 0 736.03 0 0 0 1295.59 0 0 0 0 0 0 -614.566 0 0 0 0 0 0 0 0 0 0 0 0 0 0 0 0 0 0 0 0 0 -1498.99 0 0 1696.3 0 0 0 0 0 0 0 0 
0 0 0 0 -418.027 0 0 0 0 0 0 0 0 0 0 0 0 0 0 0 0 2232.05 0 0 0 2202.75 2247.61 0 0 1111.87 0 0 0 0 0 461.058 0 0 0 0 0 0 1068.22 0 0 0 0 1695.99 0 -1594.36 0 0 -2466.73 0 0 0 0 0 0 0 0 0 0 0 
0 0 0 0 0 0 0 0.09 0 0 0 0 0 0 0 1051.74 0 0 0 0 0 0 0 0 0 0 0 0 0 0 0 0 0 0 0 0 0 0 0 0 0 0 0 0 0 0 0 0 -1635.26 2139.12 0 12.2837 0 0 0 0 0 0 0 0 0 0 0 0 
0 0 0 0 0 0 0 0 0.02 0 0 0 0 0 0 0 0 0 0 0 0 0 0 0 0 0 0 0 0 0 0 0 0 0 0 0 0 0 0 0 0 0 -1460.39 0 0 326.624 0 0 0 0 0 0 0 0 607.7 1447.26 0 0 0 0 -471.435 0 0 0 
0 0 0 0 0 45.2437 0 0 0 0.08 0 0 0 0 0 0 0 0 0 0 -2163.38 2348.63 0 0 0 0 0 0 0 0 0 0 0 0 0 1352.96 0 0 0 0 0 0 0 0 0 0 0 0 0 0 0 0 0 0 0 0 0 0 0 0 0 0 0 0 
390.713 446.867 0 0 0 0 0 0 0 0 0.08 0 0 0 0 0 0 0 0 -1959.52 0 0 0 0 0 0 0 0 0 0 0 0 0 0 0 0 0 0 0 0 0 0 0 0 0 0 2462.16 2101.58 779.977 0 0 0 0 0 -564.821 0 0 0 0 0 0 0 0 0 
0 0 0 -1170.31 0 0 0 0 0 0 0 0.01 0 0 0 0 0 0 0 0 0 0 0 0 0 0 1159.32 1060.75 0 0 0 1632.36 0 0 0 0 0 630.284 0 0 0 0 0 0 0 0 0 0 -2311.55 0 0 0 0 0 0 0 0 0 1976.91 -2353.36 0 0 0 0 
0 0 0 0 2472.53 2212.82 0 0 0 0 0 0 0.06 0 0 0 0 0 0 0 -1121.17 0 0 0 -732.063 0 -637.913 0 0 0 0 0 0 126.118 0 0 0 0 0 1984.69 0 0 0 0 0 0 0 0 0 0 0 0 0 0 0 0 0 0 0 -2288.81 0 0 0 0 
-335.17 0 0 0 0 0 0 0 0 0 0 0 0 0 0 0 -891.827 0 0 -703.681 0 1774.88 0 0 0 0 0 1181.91 0 0 0 1477.32 0 0 0 0 0 0 0 0 0 1818.22 0 2249.44 0 -2234.95 0 0 0 0 0 0 0 0 0 0 0 0 0 0 0 0 0 0 
0 0 0 0 2220.91 0 0 0 0 0 0 0 0 0 0.07 0 0 0 0 0 0 0 0 0 0 0 786.233 0 0 0 0 0 0 0 0 0 -2488.25 -1219.14 461.669 2095.48 0 -1836.68 0 0 0 0 0 0 0 0 0 0 0 0 982.162 0 0 0 0 0 0 0 0 0 
0 0 0 0 0 0 0 1224.02 0 0 0 0 0 0 0 0.04 0 0 0 0 0 0 0 0 -1554.38 0 0 0 2484.74 -580.233 122.15 1491.52 1794.87 0 0 0 0 0 0 0 0 0 -844.066 0 -1382.41 0 0 0 0 0 0 0 0 0 0 0 0 0 0 0 0 0 0 0 
0 0 2011.55 0 0 -2276.91 0 0 0 0 0 0 0 -1682.56 0 0 0.07 0 0 0 0 0 0 1768.32 0 0 2486.11 0 0 0 0 0 0 2485.96 0 0 0 0 0 0 0 0 0 0 0 0 0 0 0 0 0 0 0 0 0 0 -227.592 0 0 0 0 0 0 0 
0 0 0 0 0 0 0 0 0 0 0 0 0 0 0 0 0 0.05 -769.906 0 0 0 0 0 0 0 0 -334.101 0 0 0 0 1397.98 0 0 0 1220.82 0 0 0 1951.43 0 0 0 12.2837 0 0 0 0 1678.9 0 0 0 0 0 0 0 1340.3 0 0 0 0 0 0 
0 0 -924.482 0 281.915 0 0 0 0 0 0 0 0 0 0 0 0 -2243.8 0.09 0 -261.925 0 0 0 0 0 0 0 0 0 0 0 0 0 0 0 0 0 0 0 0 0 0 0 0 0 0 0 0 -735.878 0 0 2368.92 0 2360.07 0 0 0 0 0 0 0 0 0 
0 822.55 0 0 0 757.546 0 0 0 0 481.811 0 0 -2135.46 0 0 0 0 0 0.09 0 0 0 0 0 0 1555.91 0 0 0 0 0 0 0 0 0 0 0 1995.07 102.466 0 0 0 0 0 0 0 0 0 0 0 0 0 1299.1 0 0 0 562.227 504.7 0 0 0 0 0 
0 0 0 0 0 0 0 0 0 1004.44 0 0 763.802 0 0 0 0 0 2179.86 0 0.03 0 0 0 0 0 0 2322.69 0 0 0 0 0 0 0 526.673 796.915 0 0 0 0 0 1376.16 0 0 0 0 0 0 0 0 0 0 0 0 0 0 0 0 0 0 0 0 0 
0 0 0 0 0 0 -269.402 0 0 1912.06 0 0 0 -2146.9 0 0 0 0 0 0 0 0.05 0 743.355 0 0 0 0 579.012 0 0 0 0 0 0 0 0 0 1671.88 487.915 0 0 0 0 0 0 0 0 0 0 0 0 0 0 2414.24 0 284.051 0 0 0 0 0 0 0 
0 0 0 0 0 0 0 0 0 0 0 0 0 0 0 0 0 0 0 0 0 0 0.05 0 0 0 0 0 -274.285 0 2428.89 0 0 0 0 0 0 0 0 0 0 0 0 0 850.169 0 0 0 -2257.38 0 0 0 0 0 0 0 2271.42 0 -490.661 838.878 0 0 0 0 
0 0 0 0 0 -1461.46 0 0 0 0 0 0 0 0 0 0 -620.975 0 0 0 0 1523.56 0 0.06 0 0 0 0 0 0 755.562 -1411.86 499.207 1553.47 0 485.931 0 0 1177.33 0 0 0 0 0 0 0 0 0 0 0 0 0 0 0 0 0 0 0 0 0 0 0 0 0 
0 0 0 0 0 0 0 0 0 0 0 0 639.744 0 0 1463.44 0 0 0 0 0 0 0 0 0.08 0 0 0 0 0 0 0 0 0 0 0 2085.25 0 0 1907.48 0 0 0 0 0 0 0 0 0 2227.16 0 0 0 0 0 0 0 0 0 0 0 0 0 0 
0 0 0 0 0 0 1623.2 0 0 0 0 0 0 0 0 0 0 0 0 0 0 0 0 0 0 0 0 0 0 0 -1447.11 0 0 0 0 1966.84 0 0 0 0 0 2363.58 0 -2223.04 0 0 0 0 0 0 0 0 0 0 0 0 0 0 0 0 0 2444.91 0 0 
0 0 0 0 -687.811 0 2311.55 0 0 0 0 -255.058 -582.064 0 2060.23 0 -34.4096 0 0 -804.544 0 0 0 0 0 0 0 287.408 0 0 0 0 0 0 0 0 0 0 0 0 0 0 0 0 0 0 0 2313.68 0 0 -2072.13 0 0 0 -1586.73 0 0 0 0 0 0 0 0 0 
0 0 0 0 0 0 0 0 0 0 0 -1275.75 0 1165.27 0 0 0 2298.58 0 0 1299.86 0 0 0 0 0 1185.87 0.06 0 0 0 1944.72 -2294.15 585.574 2163.84 0 0 0 0 0 0 0 -595.798 2382.66 0 0 0 0 0 0 0 1781.59 0 0 0 0 0 0 0 0 0 0 0 -2295.83 
0 0 0 0 0 0 0 0 0 0 0 0 0 0 0 1075.85 0 0 0 0 0 -304.193 -278.863 0 0 0 0 0 0.03 0 0 1178.24 0 0 0 0 0 0 0 0 0 0 -253.227 0 -1059.83 0 0 0 0 0 0 0 0 0 0 0 0 0 0 0 0 0 0 0 
0 -1374.48 0 0 0 0 1503.72 0 0 0 0 0 0 0 0 1099.35 0 0 0 0 0 0 0 0 0 0 0 0 0 0 0 0 0 0 0 0 0 -1398.89 0 0 0 0 0 642.643 0 0 0 0 1265.22 0 0 0 970.565 0 0 0 0 0 0 0 0 0 0 0 
0 0 0 0 0 1467.41 0 0 0 0 0 0 0 0 0 -131.916 0 0 0 0 0 0 384.304 1984.08 0 -249.413 0 0 0 0 0.01 -2449.03 1868.42 -2381.89 0 -105.213 -319.452 0 0 0 0 2094.56 0 0 0 0 0 0 0 1344.72 0 2411.65 0 0 0 0 39.5978 0 0 2400.97 0 0 0 0 
0 0 0 0 0 0 0 0 0 0 0 1295.28 0 -1213.64 0 1208.76 0 0 0 0 0 0 0 -365.383 0 0 0 1933.12 1178.09 0 -2314.6 0.01 0 0 0 0 0 0 0 0 0 -1798.07 0 0 0 0 0 0 0 0 0 1158.25 0 0 0 0 0 0 0 0 0 0 0 0 
0 1842.48 0 629.368 -1208.61 0 0 0 0 0 0 0 0 0 0 -338.374 0 2010.03 0 0 0 0 0 -2470.85 0 0 0 2284.23 0 0 -184.408 0 0.08 0 0 0 0 -638.371 0 0 0 0 0 0 0 1594.97 0 0 0 0 0 0 0 0 0 0 0 0 0 1620 0 0 0 0 
0 0 0 0 0 0 0 0 0 0 0 0 1893.6 0 0 0 -801.187 0 0 0 0 0 0 1390.19 0 0 0 -1124.23 0 0 1914.81 0 0 0.03 0 0 0 0 0 14.8778 0 0 0 0 0 0 0 0 0 0 0 0 2024.37 0 0 0 0 0 0 0 0 0 0 0 
0 2263.18 0 0 2094.87 0 0 0 0 0 0 0 0 0 0 0 0 0 0 0 0 0 0 0 0 0 0 -518.128 0 0 0 0 0 0 0.06 0 0 0 0 0 0 0 0 0 41.4289 0 0 0 0 -1284.3 0 0 938.215 1834.54 0 0 -571.078 0 0 0 0 0 0 0 
0 0 0 0 0 0 1000.02 0 0 1450.47 0 0 0 0 0 0 0 0 0 0 1206.02 0 0 2291.25 0 -1478.7 0 0 0 0 2110.89 0 0 0 0 0.08 0 0 0 0 0 0 0 0 0 0 0 0 0 0 -1193.2 -1823.56 0 0 0 0 0 0 0 2110.58 0 0 0 0 
0 0 0 1638 0 0 0 0 0 0 0 0 0 0 795.236 0 0 2467.96 0 0 -774.331 0 0 0 1531.34 0 0 0 0 0 1884.44 0 0 0 0 0 0.05 0 0 0 0 0 427.641 0 0 0 0 2395.93 0 0 0 0 -1217.31 0 0 0 0 0 0 0 0 0 0 0 
0 0 0 0 0 0 0 0 0 0 0 647.832 0 0 -2395.02 0 0 0 0 0 0 0 0 0 0 0 0 0 0 -1766.79 0 0 1941.21 0 0 0 0 0.04 1681.49 0 0 0 0 0 0 0 0 0 0 784.86 0 0 687.506 0 0 0 0 0 0 0 0 0 0 0 
965.835 0 0 0 0 0 0 0 0 0 0 0 0 0 54.0941 0 0 0 0 973.464 0 2435.91 0 -363.857 0 0 0 0 0 0 0 0 0 0 0 0 0 2168.11 0.06 0 0 0 0 -1736.12 0 0 0 0 0 0 0 0 0 0 0 2193.9 0 0 0 991.623 0 0 -1194.72 0 
0 0 0 0 0 0 0 0 0 0 0 0 641.423 0 1117.36 0 0 0 0 -1438.11 0 2193.75 0 0 206.687 0 0 0 0 0 0 0 0 -1276.21 0 0 0 0 0 0.06 0 0 1953.11 0 0 -2321.31 0 0 0 0 0 0 0 0 0 0 0 0 0 0 0 0 0 0 
0 0 -503.174 0 0 0 0 0 0 0 0 0 0 0 0 0 0 -160.909 0 0 0 0 0 0 0 0 0 0 0 0 0 0 0 0 0 0 0 0 0 0 0.08 0 -413.755 0 2243.64 -1565.52 0 0 0 1343.35 0 0 0 0 -756.325 0 0 0 0 329.371 0 0 0 0 
0 -1886.73 0 0 0 0 0 0 0 0 0 0 0 1858.04 -2294.92 0 0 0 0 0 0 0 0 0 0 2003.92 0 0 0 0 -14.7252 1519.44 0 0 0 0 0 0 0 0 0 0 0 0 0 0 0 0 0 0 0 0 0 0 0 0 0 1775.34 0 0 0 0 0 0 
-708.563 0 0 0 0 0 -1897.41 0 161.672 0 0 0 0 0 0 1764.66 0 0 0 0 913.343 0 0 0 0 0 0 1075.55 406.278 0 0 0 0 0 0 0 1635.26 0 0 1090.5 546.663 0 0.07 0 0 0 0 0 0 0 0 0 0 0 0 2293.08 0 -11.9785 -668.279 0 0 0 0 0 
0 0 0 0 0 0 0 0 0 0 0 0 0 -2055.19 0 0 0 0 0 0 0 0 0 0 0 2306.05 0 -707.648 0 1108.66 0 0 0 0 0 0 0 0 875.5 0 0 0 0 0.08 0 0 0 0 0 1818.22 0 0 -938.826 0 -315.332 0 0 0 1618.63 0 0 0 0 0 
0 0 0 0 0 0 0 0 0 0 0 0 0 0 0 1470.46 0 112.69 0 0 0 0 -1968.37 0 0 0 0 0 -352.565 0 0 0 0 0 1404.84 0 0 0 0 0 -341.121 0 0 0 0 0 0 0 0 0 0 1271.32 0 0 618.534 0 0 1979.81 0 0 0 0 0 0 
0 0 0 0 0 0 0 0 -1091.57 0 0 0 0 -173.269 0 0 0 0 0 0 0 0 0 0 0 0 0 0 0 0 0 0 40.3607 0 0 0 0 0 0 1868.42 786.081 0 0 0 0 0.01 0 0 0 0 0 0 0 0 0 0 0 0 0 0 0 0 0 0 
0 2006.52 0 0 2355.95 0 0 0 0 0 1216.54 0 0 0 0 0 0 0 0 0 0 0 0 0 0 0 0 0 0 0 0 0 0 0 0 0 0 0 0 0 0 0 0 0 0 0 0.03 0 0 0 0 -445.647 0 0 0 0 0 0 0 0 0 0 0 0 
0 0 0 1811.96 0 0 -1488.16 0 0 0 78.814 0 0 0 0 0 0 0 0 0 0 0 0 0 0 0 2194.51 0 0 0 0 0 0 0 0 0 734.962 0 0 0 0 0 0 0 0 0 0 0.08 0 0 0 0 0 0 0 0 0 0 0 0 0 0 0 0 
0 0 -913.343 0 178.915 0 0 1001.08 0 0 2267.75 -1055.25 0 0 0 0 0 0 0 0 0 0 -1232.87 0 0 0 0 0 0 -1364.1 0 0 0 0 0 0 0 0 0 0 0 0 0 0 0 0 0 0 0.05 0 0 0 0 0 0 0 2064.65 0 0 0 0 0 0 0 
0 0 0 0 0 0 -1094.32 2031.08 0 0 0 0 0 0 0 0 0 111.469 550.935 0 0 0 0 0 2325.13 0 0 0 0 0 294.58 0 0 0 1910.54 0 0 -903.424 0 0 -259.484 0 0 2247.61 0 0 0 0 0 0.08 2000.56 -914.106 0 0 1793.34 0 0 0 0 0 0 0 0 0 
0 0 0 0 0 0 0 0 0 0 0 0 0 0 0 0 0 0 0 0 0 0 0 0 0 0 -1125.75 0 0 0 0 0 0 0 0 2319.33 0 0 0 0 0 0 0 0 0 0 0 0 0 308.466 0.03 0 0 1793.95 0 0 0 2111.65 0 0 0 0 0 0 
0 0 0 0 0 0 0 945.845 0 0 0 0 0 0 0 0 0 0 0 0 0 0 0 0 0 0 0 328.455 0 0 2151.33 996.811 0 0 0 567.873 0 0 0 0 0 0 0 0 -2109.97 0 64.3178 0 0 2286.37 0 0.07 0 0 0 0 0 0 0 0 0 0 0 0 
0 1941.51 0 0 0 1711.1 2298.88 0 0 0 0 0 0 0 0 0 0 0 -205.771 0 0 0 0 0 0 0 0 0 0 38.0718 0 0 0 -1551.33 979.11 0 414.823 1433.84 0 0 0 0 0 -1935.41 0 0 0 0 0 0 0 0 0.06 -2122.79 0 0 -2430.11 0 0 0 0 0 0 0 
0 713.752 0 0 0 0 0 0 0 0 0 0 0 0 0 0 0 0 0 2407.83 0 0 0 0 0 0 0 0 0 0 0 0 0 0 1184.65 0 0 0 0 0 0 0 0 0 0 0 0 0 0 0 -2147.36 0 114.826 0.02 0 0 0 0 0 0 0 0 0 0 
0 0 0 -1194.72 0 0 0 0 1748.94 0 -1476.41 0 0 0 2218.47 0 0 0 2138.51 0 0 -1841.41 0 0 0 0 279.626 0 0 0 0 0 0 0 0 0 0 0 0 0 1347.01 0 0 1845.07 -169.301 0 0 0 0 -868.786 0 0 0 0 0.01 0 0 0 0 898.236 0 0 0 0 
1771.68 0 0 0 0 788.98 0 0 -240.715 0 0 0 0 0 0 0 0 0 0 0 0 0 0 0 0 0 0 0 0 0 0 0 0 0 0 0 0 0 1848.12 0 0 0 432.371 0 0 0 0 0 0 0 0 0 0 0 0 0.01 0 0 0 -852.153 0 0 0 0 
0 0 0 0 0 0 0 0 0 0 0 0 0 0 0 0 1527.22 0 0 0 0 -1892.22 357.601 0 0 0 0 0 0 0 -131.764 0 0 0 2377.32 0 0 0 0 0 0 0 0 0 0 0 0 0 -1586.89 0 0 0 404.599 0 0 0 0.02 0 0 0 0 0 0 0 
0 0 0 0 0 0 0 0 0 0 0 0 0 0 0 0 0 688.574 0 460.753 0 0 0 0 0 0 0 0 0 0 0 0 0 0 0 0 0 0 0 0 0 2139.88 -1684.85 0 890.454 0 0 0 0 0 -1649.91 0 0 0 0 0 0 0.05 0 0 0 0 0 0 
1534.39 0 0 0 1289.03 0 0 0 0 0 0 -451.75 0 0 0 0 0 0 0 1779.92 0 0 1305.51 0 0 0 0 0 0 0 0 0 0 0 0 0 0 0 0 0 0 0 -1188.47 2227.77 0 0 0 0 0 0 0 0 0 0 0 0 0 0 0.06 -163.045 0 0 0 0 
0 0 0 0 0 0 0 0 0 0 0 1280.63 -494.934 0 0 0 0 0 0 0 0 0 -182.119 0 0 0 0 0 0 0 2382.5 0 2285.15 0 0 1721.17 0 0 1722.69 0 -2212.97 0 0 0 0 0 0 0 0 0 0 0 0 0 -725.196 -683.233 0 0 -278.253 0 0 0 0 0 
0 0 0 0 0 0 0 0 863.598 0 0 0 0 0 0 0 0 0 0 0 0 0 0 0 0 0 0 0 0 0 0 0 0 0 0 0 0 0 0 0 0 0 0 0 0 0 0 0 0 0 0 0 0 0 0 0 0 0 0 0 0.05 0 0 0 
0 0 0 0 0 0 0 0 0 0 0 0 0 0 0 0 0 0 0 0 0 0 0 0 0 1690.65 0 0 0 0 0 0 0 0 0 0 0 0 0 0 0 0 0 0 0 0 0 0 0 0 0 0 0 0 0 0 0 0 0 0 0 0.08 0 0 
0 0 0 0 0 0 0 0 0 0 0 0 0 0 0 0 0 0 0 0 0 0 0 0 0 0 0 0 0 0 0 0 0 0 0 0 0 0 2317.04 0 0 0 0 0 0 0 0 0 0 0 0 0 0 0 0 0 0 0 0 0 0 0 0.04 0 
0 0 0 0 0 0 0 0 0 0 0 0 0 0 0 0 0 0 0 0 0 0 0 0 0 0 0 2362.51 0 0 0 0 0 0 0 0 0 0 0 0 0 0 0 0 0 0 0 0 0 0 0 0 0 0 0 0 0 0 0 0 0 0 0 0.07 
