*Vertices 56
*Matrix 
0.06 0 0 0 0 0 0 1128.5 0 0 -1812.42 0 -1625.19 0 0 0 -1878.49 0 2020.86 0 0 0 -81.4081 -2430.57 0 0 0 0 0 2263.33 0 1236.38 -278.558 2071.06 0 -406.43 965.072 0 0 0 0 0 0 15.183 0 417.112 -267.571 0 0 0 0 1866.13 2461.09 0 2356.26 0 
0 0.02 -1682.26 0 0 0 0 0 0 0 0 0 1430.33 0 -978.347 0 0 1957.99 0 0 0 0 610.599 0 0 0 1370.97 0 0 0 0 0 0 -1596.35 0 0 0 0 0 2456.97 1697.06 -1717.66 0 0 0 0 1438.11 -2233.42 0 0 0 0 753.273 0 0 0 
0 -2429.5 0 0 0 0 0 0 0 0 0 0 -1211.51 1590.85 -2338.56 0 984.146 0 0 0 0 0 0 0 -595.035 0 2161.4 0 0 0 648.137 0 1702.7 0 0 0 0 0 2078.23 0 0 2006.67 0 537.812 0 0 0 0 1082.87 0 0 0 -360.347 0 -1323.51 0 
0 0 0 0 0 0 0 0 0 0 0 0 0 0 -2470.4 0 0 874.279 344.935 0 0 2338.1 1401.33 2308.19 0 0 0 1956.77 -1450.62 0 0 0 -326.167 0 0 0 -691.473 0 0 0 0 0 0 0 2372.13 0 1244.01 0 0 -1441.92 0 0 469.604 0 0 0 
0 0 0 0 0.03 1531.04 0 803.934 0 0 -1882 0 -429.624 0 0 0 0 1361.35 -2384.64 0 0 0 0 -303.735 1744.51 483.642 0 0 -1746.35 0 0 0 0 0 0 0 0 1546.91 0 0 0 0 0 1734.29 0 -294.427 0 -1042.28 0 1179.62 0 0 0 0 0 0 
0 0 0 0 -1895.58 0.08 0 0 0 0 0 -156.789 492.798 0 0 0 0 0 0 0 0 0 1356.93 -172.658 -794.015 -776.772 1395.54 -1814.55 0 0 0 0 0 0 0 1490.6 0 0 0 2394.71 0 0 0 0 0 -462.584 1579.41 1208.3 1853.47 0 0 0 -1285.52 0 -1583.38 0 
0 0 0 0 0 0 0 0 0 0 0 0 0 0 0 0 0 0 35.02 0 0 0 0 0 0 0 0 0 414.823 0 0 0 -589.541 0 0 1978.13 0 0 747.78 1026.72 0 0 0 0 0 0 2429.35 0 0 0 0 212.333 0 1504.49 0 -1465.12 
873.211 0 0 0 2343.13 0 0 0.06 0 0 0 1616.64 0 0 0 -641.423 0 0 0 0 -426.878 0 1879.56 0 2213.89 -98.3459 0 0 0 0 -345.088 392.392 -172.353 0 0 0 0 -1256.68 0 0 -1309.47 0 0 0 0 0 0 0 0 0 0 0 2137.59 409.177 0 2329.55 
0 0 0 0 0 0 0 0 0.09 517.212 -1064.56 0 0 0 0 0 0 0 0 0 0 -1107.59 329.829 0 -1847.06 0 237.053 -811.411 0 2209.46 0 1580.48 0 1555.3 0 0 0 0 0 0 -1893.6 0 0 465.331 -1648.53 -1448.94 0 0 2376.4 1353.11 0 0 0 0 1206.17 409.635 
0 0 0 0 0 0 0 0 1130.02 0.09 0 367.061 1892.53 0 0 0 0 0 0 0 0 0 0 -581.454 -428.251 0 0 0 0 0 0 0 0 -1591.92 1482.36 0 0 0 0 0 0 0 0 0 2407.53 -96.2096 2092.43 0 0 0 0 1760.38 0 0 0 0 
270.013 0 0 0 -1001.85 0 0 0 2356.56 0 0.08 0 0 0 0 0 1204.79 0 0 -1067.77 0 -294.122 -797.83 0 0 0 0 0 2398.83 2352.44 0 0 0 786.538 0 0 0 0 -1114.31 -745.949 0 0 1372.95 0 0 0 -1191.06 0 0 0 0 0 1374.94 0 0 0 
0 0 0 0 0 -1869.95 0 2474.97 0 -512.024 0 0 0 35.9355 1808.91 -37.4615 0 0 0 0 0 0 0 1074.48 0 0 0 -1648.84 -2219.08 -1695.84 0 0 0 0 860.088 0 0 -48.9059 0 1054.34 0 0 2094.41 2231.44 0 381.863 -220.725 0 849.254 183.34 0 0 0 0 0 0 
1221.27 2498.47 -1563.84 0 -263.451 -2094.1 0 0 0 -929.06 0 0 0 0 -1066.24 0 -161.824 0 0 0 0 -1654.18 0 0 0 0 0 0 0 0 0 0 0 0 -502.869 0 2381.28 -110.401 0 0 0 0 0 0 0 1432.62 0 1231.5 0 1642.89 927.076 0 0 0 0 0 
0 0 -1489.38 0 0 0 0 0 0 0 0 1641.82 0 0.03 0 1167.87 0 0 0 0 0 533.998 0 0 -266.503 0 0 0 404.904 0 0 40.8185 0 0 1980.42 213.858 0 0 0 0 0 2350.76 0 0 0 0 0 -1874.07 0 0 0 0 0 2142.32 0 0 
0 -947.981 -1131.24 2340.54 0 0 0 0 0 0 0 1434.14 -1980.57 0 0 0 1192.74 0 978.347 -474.181 0 0 0 1428.34 0 0 0 0 0 1489.23 0 0 0 0 868.328 1954.02 0 1630.99 351.65 0 -1049.15 0 -1784.34 0 2230.22 0 0 -1706.37 0 0 0 0 -1105.3 0 0 0 
0 0 0 0 0 0 0 226.829 0 0 0 -1103.93 0 1716.9 0 0.09 0 1979.96 0 0 0 -1907.33 0 2313.53 0 536.286 0 -1850.11 2250.82 0 -2238.91 -1101.95 0 0 0 1321.07 -590.915 0 0 0 0 0 0 0 0 0 -2239.98 0 0 0 0 0 0 0 0 0 
557.497 0 2106.77 0 0 0 0 0 0 0 -2398.98 0 1331.75 0 2014.76 0 0.02 -183.493 1872.23 0 0 0 0 0 0 0 0 0 0 0 31.2052 0 0 0 0 0 2242.88 0 0 -2048.02 0 -2392.57 0 0 0 0 0 0 0 0 1033.28 -159.841 0 599.46 0 0 
0 -593.509 0 -1258.2 965.682 0 0 0 0 0 0 0 0 0 0 1974.17 -1603.06 0.02 0 0 0 0 -579.623 1992.63 0 2099.75 0 805.307 -51.8052 0 0 0 15.4881 0 0 0 0 0 0 0 0 0 0 0 0 0 984.756 0 0 0 0 -1333.89 0 0 0 0 
1680.58 0 0 812.326 -1069.75 0 291.375 0 0 0 0 0 0 0 842.082 0 1285.67 0 0.05 723.212 -2238.15 0 0 0 0 0 0 0 0 0 0 635.624 0 1851.79 -2172.99 92.2422 0 -796.762 0 1617.71 1238.82 0 0 1287.19 0 0 0 0 0 -157.247 0 0 0 0 0 0 
0 0 0 0 0 0 0 0 0 0 1559.88 0 0 0 -1231.35 0 0 0 74.5415 0.06 0 0 0 -758.156 0 0 0 -159.688 0 0 0 878.246 0 0 2361.14 1656.16 1392.48 -849.864 -1508.15 0 0 0 2099.44 1660.59 433.287 0 0 0 0 0 0 0 0 0 1212.42 0 
0 0 0 0 0 0 0 1303.52 0 0 0 0 0 0 0 0 0 0 2466.43 0 0.09 0 0 1707.74 0 0 0 0 0 0 0 0 0 0 0 0 0 0 0 0 0 1769.69 -508.362 0 0 0 0 0 0 1900.31 2381.44 0 0 0 0 1840.49 
0 0 0 735.267 0 0 0 0 1617.1 0 1143.91 0 2356.72 -1229.36 0 111.164 0 0 0 0 0 0.01 2205.19 364.925 0 689.184 0 0 0 0 0 -1377.07 0 0 2488.4 0 -1574.98 1215.78 0 0 -817.82 1441.92 904.035 1863.38 638.829 -2116.53 -150.685 0 0 0 -671.026 0 0 0 0 -391.476 
-893.506 -1596.96 0 2219.08 0 1550.26 0 -2319.48 2144.15 0 -1707.59 0 0 0 0 0 0 806.07 0 0 0 1340.45 0 -1415.37 0 0 0 0 2114.7 0 0 0 -2023.61 0 -800.424 0 0 0 0 0 0 2433.93 0 0 0 0 0 0 0 0 1468.02 -1264.31 0 0 0 0 
1119.34 0 0 -2373.81 718.177 -928.144 0 0 0 720.008 0 -235.221 0 0 401.395 -612.583 0 -661.565 0 338.221 1175.65 -2033.37 721.534 0.07 -1199.91 2198.93 -33.3415 0 0 0 0 0 0 0 317.316 0 0 0 0 0 0 -2351.37 0 0 0 0 -1518.22 0 2063.43 0 0 0 0 1590.55 0 1805.4 
0 0 2132.56 0 2180.32 -2468.72 0 1627.32 539.186 254.295 0 0 0 2224.88 0 0 0 0 0 0 0 0 0 1488.16 0.06 0 0 0 2287.59 -2430.88 1642.89 0 0 1610.69 0 0 1803.57 0 0 -112.69 0 0 0 0 0 0 0 0 0 275.964 -1771.52 0 2023.3 0 0 1195.94 
0 0 0 0 316.401 57.6037 0 2082.2 0 0 0 0 0 0 0 2137.14 0 1921.37 0 0 0 -1053.88 0 -1918.47 0 0.05 0 1919.84 0 0 0 0 0 0 1990.34 0 0 0 0 0 0 0 0 2241.2 0 0 0 0 0 0 0 0 0 -1728.49 0 1878.34 
0 1762.83 194.479 0 0 1738.26 0 0 950.117 0 0 0 0 0 0 0 0 0 0 0 0 0 0 1905.04 0 0 0.07 0 0 2077.32 0 -1915.42 0 0 0 0 0 0 0 1064.87 0 307.398 0 0 0 0 0 1519.75 0 0 0 0 0 0 0 2087.24 
0 0 0 2270.35 0 1715.52 0 0 730.079 0 0 199.362 0 0 0 1640.75 0 2058.4 0 2176.96 0 0 0 0 0 2127.37 0 0.03 0 0 0 -649.358 0 0 0 1463.9 0 2437.89 0 -2256.31 -150.533 1603.37 -1591.77 -957.595 0 0 248.65 0 0 1071.43 0 2220.3 1569.95 0 0 0 
0 0 0 385.83 -1516.08 0 666.295 0 0 0 3.89111 2270.35 0 2336.12 0 1922.9 0 463.805 0 0 0 0 -1605.5 0 -1307.34 0 0 0 0.08 0 0 0 0 -240.104 0 0 0 0 0 0 -1465.12 1529.21 0 0 0 0 247.276 388.119 0 -1044.27 0 0 0 0 443.815 0 
716.956 0 0 0 0 0 0 0 206.992 0 -1447.26 -2304.83 0 0 1934.64 0 0 0 0 0 0 0 0 0 1445.59 0 310.602 0 0 0 2387.39 0 0 2459.41 275.506 0 0 0 0 841.777 0 0 0 0 0 0 2005.91 0 -1355.56 0 -644.475 0 2039.48 0 0 1656.01 
0 0 416.196 0 0 0 0 -2042.07 0 0 0 0 0 0 0 2016.89 593.509 0 0 0 0 0 0 0 -1719.03 0 0 0 0 1837.9 0.02 0 0 -1573 0 0 0 0 0 183.95 0 0 0 0 0 0 0 0 0 1311.15 1618.63 -1817.61 1080.13 0 0 0 
1222.8 0 0 0 0 0 0 -31.2052 -2252.8 0 0 0 0 2406 0 -1361.51 0 0 1703.01 -695.441 0 1994.77 0 0 0 0 1102.25 -345.546 0 0 0 0.03 0 0 0 -346.919 0 0 0 0 0 0 0 -209.433 0 0 0 0 -2052.9 2061.91 -1834.39 0 0 0 0 0 
661.26 0 523.621 505.463 0 0 600.375 1907.79 0 0 0 0 0 0 0 0 0 1537.6 0 0 0 0 -1502.96 0 0 0 0 0 0 0 0 0 0.04 0 -1011.15 0 737.556 524.842 0 0 0 0 0 752.815 -1367 0 0 1309.63 0 0 0 944.166 0 1204.64 0 0 
-114.063 -632.42 0 0 0 0 0 0 -1915.72 -459.075 674.993 0 0 0 0 0 0 0 -272.149 0 0 0 0 0 2234.18 0 0 0 1365.47 2065.42 2297.2 0 0 0.05 2376.25 0 0 0 0 0 1658.91 0 -820.109 1104.54 0 0 0 0 0 0 0 -772.5 -1155.96 0 0 0 
0 0 0 0 0 0 0 0 0 -1143.91 0 133.9 1189.23 862.835 1836.38 0 0 0 1489.99 -281.61 0 1335.26 562.838 -450.072 0 1573.15 0 0 0 -673.315 0 0 1732.61 2401.43 0.06 0 0 0 0 0 0 -280.541 1735.66 0 2121.27 0 0 -1364.41 0 0 0 0 0 0 -2374.42 0 
702.155 0 0 0 0 -250.938 -562.075 0 0 0 0 0 0 581.759 -381.863 1541.87 0 0 1519.75 907.086 0 0 0 0 0 0 0 -319.91 0 0 0 -165.181 0 0 0 0.05 0 0 0 0 0 0 0 0 -2313.84 0 0 0 0 -594.424 0 0 0 0 0 1623.81 
-172.506 0 0 -935.469 0 0 0 0 0 0 0 0 1337.55 0 0 -1816.54 -551.241 0 0 1411.25 0 -41.4289 0 0 840.403 0 0 0 0 0 0 0 109.485 0 0 0 0.01 0 0 701.544 0 0 0 -1412.78 0 1695.68 0 0 0 0 0 2271.87 0 0 0 0 
0 0 0 0 1475.65 0 0 2237.85 0 0 0 946.303 -808.817 0 147.786 0 0 0 2080.68 -1704.99 0 1048.08 0 0 0 0 0 2434.39 0 0 0 0 2349.7 0 0 0 0 0.07 -582.064 0 2421.11 989.334 691.321 0 0 -2151.33 0 0 0 0 -866.192 0 0 -475.097 0 1810.13 
0 0 -1536.84 0 0 0 598.239 0 0 0 -780.282 0 0 0 30.4422 0 0 0 0 220.878 0 0 0 0 0 0 0 0 0 0 0 0 0 0 0 0 0 33.1889 0.01 0 -1236.69 0 1990.49 0 2407.22 0 0 1891.46 1207.08 0 -1111.41 0 0 0 0 0 
0 535.676 0 0 0 -1507.54 391.476 0 0 0 668.584 1177.94 0 0 0 0 354.701 0 -213.401 0 0 0 0 0 -1999.19 0 1855.6 1691.56 0 1801.28 1842.78 0 0 0 0 0 2166.28 0 0 0 0 0 1134.91 0 0 0 0 0 2156.36 0 0 -1381.04 0 0 -606.784 0 
0 539.338 0 0 0 0 0 545.9 2265.16 0 0 0 0 0 882.366 0 0 0 -1943.8 0 0 166.402 0 0 0 0 0 2495.88 31.663 0 0 0 0 747.017 0 0 0 2450.56 -359.127 0 0.01 0 1384.4 0 0 0 0 0 -2209.31 1565.52 -1217.15 0 0 0 957.9 0 
0 477.233 -1249.81 0 0 0 0 0 0 0 0 0 0 -2497.1 0 0 1593.91 0 0 0 -1574.37 1832.87 1381.8 2233.73 0 0 -1994.92 2095.17 -1365.63 0 0 0 0 0 871.838 0 0 -1295.13 0 0 0 0.02 956.832 0 0 -1349.91 0 0 0 73.6259 1014.66 0 0 0 0 0 
0 0 0 0 0 0 0 0 0 0 -1348.99 -1851.94 0 0 1366.24 0 0 0 0 2027.42 -1930.98 2009.72 0 0 0 0 0 693.762 0 0 0 0 0 2358.55 -803.171 0 0 -1899.4 -1470.15 550.63 2139.12 -1978.13 0.03 1312.83 1109.73 1559.27 0 1946.24 0 0 0 0 1195.79 0 0 -468.383 
-2118.98 0 1491.67 0 1242.33 0 0 0 -2218.92 0 0 -50.4318 0 0 0 0 0 0 2001.63 188.376 0 314.875 0 0 0 -392.544 0 -456.175 0 0 0 -1099.51 -244.835 379.574 0 0 58.2141 0 0 0 0 0 -1268.12 0.02 0 0 0 0 1739.02 0 2113.64 0 0 0 0 0 
0 0 0 1780.22 0 0 0 0 377.285 594.424 0 0 0 0 342.799 0 0 0 0 1946.24 0 -2054.58 0 0 0 0 0 0 0 0 0 0 256.737 0 2060.69 -159.536 0 0 2420.35 0 0 0 875.195 0 0.07 986.435 0 -309.839 0 0 0 331.355 0 0 0 0 
1927.47 0 0 0 925.855 919.752 0 0 2454.53 850.017 0 -1847.67 -1718.88 0 0 0 0 0 0 0 0 1727.27 0 0 0 0 0 0 0 0 0 0 0 0 0 0 908.612 561.464 0 0 0 1791.82 -1403.01 0 734.809 0 -1241.11 0 0 0 0 0 0 2013.38 0 0 
-917.768 1838.97 0 -52.7207 0 1921.22 -654.241 0 0 2497.71 -1863.69 1216.39 0 0 0 1016.34 0 -1900.62 0 0 0 1400.88 0 -1390.35 0 0 0 1356.47 2489.01 1824.17 0 0 0 0 0 0 0 0 0 0 0 0 0 0 0 1259.27 0.03 714.972 0 -49.9741 0 0 -33.9518 0 -173.574 0 
0 -1076.46 0 0 2009.11 126.576 0 0 0 0 0 0 389.645 -194.632 676.061 0 0 0 0 0 0 0 0 0 0 0 -141.682 0 457.549 0 0 0 2105.55 0 707.343 0 0 0 2397.15 0 0 0 911.664 0 1425.29 0 -1487.24 0.09 1704.69 0 -1082.11 -968.734 -1995.07 0 0 0 
0 0 -1432.92 0 0 -1729.41 0 0 1277.58 0 0 -261.773 0 0 0 0 0 0 0 0 0 0 0 -2057.79 0 0 0 0 0 888.012 0 1714.15 0 0 0 0 0 0 1282.62 755.257 -1424.07 0 0 -1137.35 0 0 0 1261.1 0.01 0 0 960.341 0 0 582.98 0 
0 0 0 1940.14 1009.48 0 0 0 -1016.04 0 0 -2041.92 -2336.12 0 0 0 0 0 691.473 0 1620.3 0 0 0 1390.35 0 0 1121.33 1834.54 0 1045.34 -2151.63 0 0 0 2157.58 0 0 0 0 1297.88 -260.094 0 0 0 0 -184.561 0 0 0.06 0 0 0 0 835.215 0 
0 0 0 0 0 0 0 0 0 0 0 0 -802.713 0 0 0 555.208 0 0 0 207.907 2410.73 627.232 0 -2364.19 0 0 0 0 -2001.63 1032.06 246.971 0 0 0 0 0 551.393 21.1341 0 66.6066 1889.02 0 0.991852 0 0 0 2007.13 0 0 0.02 -365.841 0 0 0 0 
2006.36 0 0 0 0 0 1211.05 0 0 -1683.17 0 0 0 0 0 0 -743.965 335.475 0 0 0 0 987.96 0 0 0 0 -268.487 0 0 917.615 0 2195.73 -1168.94 0 0 1239.28 0 0 -1932.97 0 0 0 0 1102.1 0 0 -1659.98 -902.203 0 1431.85 0.06 0 -281.762 0 0 
-448.851 1207.54 -91.4792 1407.74 0 2225.64 0 -1432 0 0 991.012 0 0 0 42.3444 0 0 0 0 0 0 0 0 0 1605.2 0 0 1055.25 0 1627.02 1078.91 0 0 -389.34 0 0 0 0 0 0 0 0 -318.995 0 0 0 1328.85 2484.74 0 0 0 0 0.06 1448.94 0 0 
0 0 0 0 0 0 -2486.72 -1654.79 0 0 0 0 0 1882.92 0 0 1620.46 0 0 0 0 0 0 1049.61 0 1623.51 0 0 0 0 0 0 -2314.45 0 0 0 0 -1436.74 0 0 0 0 0 0 0 1851.18 0 0 0 0 0 748.695 1953.26 0.02 0 -663.091 
1150.01 0 -602.512 0 0 2264.09 0 0 2186.57 0 0 0 0 0 0 0 0 0 0 2299.49 0 0 0 0 0 0 0 0 -437.864 0 0 0 0 0 1406.67 0 0 0 0 -1306.88 293.054 0 0 0 0 0 1348.54 0 1232.26 -550.325 0 0 0 0 0 0 
0 0 0 0 0 0 1410.95 106.891 -284.051 0 0 0 0 0 0 0 0 0 0 0 700.781 -822.703 0 550.02 973.312 1659.52 -1579.1 0 0 1322.29 0 0 0 0 0 1539.89 0 -1569.49 0 0 0 0 1349.6 0 0 0 0 0 0 0 0 0 0 -101.398 0 0.09 
