*Vertices 51
*Matrix 
0.02 0 0 0 0 1783.27 0 0 0 0 0 2125.08 -1202.05 0 0 0 0 -945.387 -302.667 0 0 0 -2267.3 0 619.297 0 0 587.558 0 0 1348.84 0 0 0 0 1307.49 0 0 0 0 0 0 -1403.62 0 0 0 -958.815 0 0 0 1758.25 
0 0.07 0 1071.73 2232.35 0 0 2203.97 0 0 0 0 0 0 0 0 0 -44.1755 0 0 0 -810.495 0 1350.06 894.879 2341.76 0 0 -2264.09 0 0 0 8.77407 0 0 0 0 0 -2208.4 0 0 -1694.62 639.439 0 0 0 0 0 0 0 0 
0 0 0.06 0 0 0 -1741.46 -52.2629 0 0 0 0 0 1980.57 -2270.5 0 0 0 0 0 0 0 1307.95 996.658 0 0 0 0 -303.125 0 0 0 0 0 0 0 0 0 0 -165.487 0 1837.6 0 0 0 0 0 0 0 2371.82 0 
0 1119.65 0 0.02 0 2024.67 0 0 768.685 0 0 0 1496.4 0 0 0 1891.61 -2434.84 404.752 0 434.965 2333.52 0 0 -713.141 0 0 0 0 0 0 0 1989.58 0 0 0 0 0 0 0 -1704.54 780.74 0 0 0 0 0 0 0 0 0 
0 -1445.43 0 0 0.08 0 0 0 0 0 643.559 0 0 1283.38 0 -1016.95 0 2358.09 -779.061 0 0 1107.59 -270.318 0 1603.21 0 0 0 0 1009.78 0 418.027 0 0 0 0 -1514.1 0 0 0 0 0 0 0 -43.7178 0 0 0 0 0 0 
1650.98 0 0 -440.306 0 0.02 0 0 0 0 2083.12 -1761.45 0 0 0 0 0 0 -1175.34 0 2089.37 0 -2103.26 0 0 0 2410.28 0 0 0 392.697 0 0 0 0 0 0 0 0 0 0 0 0 0 0 0 0 0 882.061 0 0 
0 0 -729.164 0 0 0 0.04 0 278.253 0 0 1692.02 748.39 0 0 1231.5 0 2.36518 988.113 0 0 0 0 0 0 0 0 0 0 0 0 0 0 0 0 0 0 0 0 -2487.33 0 0 0 0 0 0 0 0 0 0 0 
0 1589.79 666.448 0 0 0 0 0 0 0 0 0 0 0 0 2109.52 0 0 0 0 0 2149.34 0 0 2356.56 0 0 0 0 0 0 0 0 0 0 0 0 0 0 0 0 0 0 1088.52 0 -1731.7 0 0 0 0 0 
0 0 0 361.263 0 0 -1907.03 0 0.09 936.995 -1343.35 1818.83 2041.92 0 242.088 -1304.44 1337.7 0 0 0 894.269 0 -429.777 0 1119.95 0 1418.27 1320.61 -917.615 0 0 0 0 0 0 -286.95 0 0 0 -1238.98 0 0 1320.92 0 0 -2115.62 0 262.383 0 0 0 
0 0 0 0 0 0 0 0 840.403 0.09 -1892.83 -619.602 0 0 0 0 0 2423.4 0 855.51 0 0 0 0 2070.91 0 2050.61 0 0 0 0 0 0 0 0 0 0 0 0 0 1915.27 0 0 0 0 0 674.535 -2266.99 0 0 0 
0 0 0 0 478.912 424.894 0 0 162.282 -855.51 0.02 1554.23 1991.87 0 0 0 0 -531.251 0 0 0 394.986 0 0 0 0 2194.66 0 0 0 0 724.891 0 0 0 0 0 0 0 0 0 0 0 0 0 0 0 0 0 0 0 
2232.51 0 0 0 0 1108.66 780.129 0 2210.38 -789.895 -403.378 0.06 0 0 0 1143.91 0 0 1511.35 2009.57 0 -1525.7 2227.32 0 0 -2173.3 0 0 -502.869 1009.63 0 -1177.02 0 0 0 0 1021.23 0 0 0 0 0 907.697 0 0 0 0 0 0 0 0 
-696.203 0 0 -225.15 0 0 1294.98 0 -1390.04 0 1351.44 0 0.01 0 1322.6 0 0 0 0 0 0 0 0 0 0 0 1910.69 0 0 0 0 0 0 0 0 0 0 0 0 2161.24 0 0 0 0 0 1253.93 0 0 0 0 0 
0 0 1830.27 0 -537.202 0 0 0 0 0 0 0 0 0.02 2381.74 0 0 0 0 0 0 0 2172.23 -1135.21 0 0 0 0 701.086 0 0 0 1321.07 0 0 0 0 0 2247.15 0 0 0 0 0 0 0 0 0 1047.32 0 -2404.78 
0 0 111.011 0 0 0 0 0 623.875 0 0 0 -2214.19 -21.7444 0.03 0 0 0 0 0 -527.741 1308.71 0 1484.65 0 2013.99 0 0 -471.587 0 0 0 0 0 0 0 0 1946.09 0 0 0 0 0 0 0 0 0 -744.728 0 1783.58 0 
0 0 0 0 1448.03 0 -312.738 -442.9 1191.37 0 0 -1544.92 0 0 0 0.08 0 0 0 0 0 975.295 441.527 539.033 0 0 0 1550.57 0 1141.32 -164.113 0 0 2142.02 693.915 0 0 1011.31 -2480.47 0 0 0 0 0 0 0 0 0 0 798.898 0 
0 0 0 1120.41 0 0 0 0 1652.81 0 0 0 0 0 0 0 0.07 0 0 0 0 0 0 0 189.444 0 0 0 0 0 0 0 0 0 0 0 0 0 0 0 0 1677.22 0 0 0 0 0 0 0 0 0 
2484.74 -2465.67 0 -27.8481 -711.921 0 1601.08 0 0 703.986 1884.9 0 0 0 0 0 0 0.04 0 0 0 0 0 0 0 0 1154.59 0 0 0 0 0 -1638.92 0 0 0 0 0 2293.54 0 0 0 0 0 0 0 1670.2 0 0 0 0 
1697.36 0 0 555.208 72.4052 1559.57 55.7726 0 0 0 0 2409.67 0 0 0 0 0 0 0.02 0 0 0 0 0 144.887 0 -1397.21 0 0 0 0 0 0 -1528.6 0 0 0 0 1634.5 0 0 0 0 0 0 0 0 0 0 0 0 
0 0 0 0 0 0 0 0 0 1795.48 0 785.47 0 0 0 0 0 0 0 0.07 0 0 0 0 -1799.6 1774.12 0 0 0 0 0 0 0 0 0 1103.63 0 0 0 0 0 0 0 -106.128 0 0 0 0 0 0 0 
0 0 0 476.165 0 -451.292 0 0 2225.33 0 0 0 0 0 1690.5 0 0 0 0 0 0.06 0 0 860.088 0 0 0 0 2437.89 0 0 0 0 0 0 134.053 0 0 0 0 0 0 0 0 0 0 0 0 0 -188.833 0 
0 361.11 0 2138.05 -1283.23 0 0 1029.31 0 0 1232.57 -150.38 0 0 1302.3 -1493.65 0 0 0 0 0 0.04 0 0 0 0 0 0 0 0 0 0 0 -638.829 0 0 0 0 0 0 0 0 0 535.676 0 0 0 0 0 0 0 
721.839 0 1593.6 0 1839.73 -712.836 0 0 -2116.38 0 0 -150.838 0 2352.75 0 1754.74 0 0 0 0 0 0 0 -1249.66 1991.87 0 0 0 0 0 0 0 2056.41 0 1507.23 0 0 0 0 0 0 0 0 0 0 0 -2424.92 0 -1500.82 0 0 
0 924.787 288.781 0 0 0 0 0 0 0 0 0 0 -1902.14 2261.19 2286.98 0 0 0 0 -605.258 0 -271.233 0.04 1538.06 -48.6007 -1030.08 0 0 0 0 0 0 0 0 0 0 0 0 0 0 0 0 0 0 -460.143 0 0 0 0 0 
-2030.63 -2242.73 0 -2173.3 -2450.87 0 0 -169.759 664.769 532.777 0 0 0 0 0 0 1970.66 0 1504.18 1770.61 0 0 -1419.64 2266.23 0 2296.44 0 0 2396.85 0 0 0 0 0 0 0 0 0 534.15 0 0 0 0 0 0 0 0 0 0 98.0407 0 
0 979.72 0 0 0 0 0 0 0 0 0 187.307 0 0 -2396.08 0 0 0 0 1292.54 0 0 0 825.449 2169.33 0.07 -2112.11 1490.14 0 0 0 0 0 0 0 0 199.362 0 0 0 0 0 0 0 0 0 0 0 -2390.9 0 0 
0 0 0 0 0 -38.0718 0 0 1525.54 -740.455 1710.94 0 509.735 0 0 0 0 2244.25 1746.19 0 0 0 0 -553.072 0 -931.196 0 0 474.639 0 -2211.29 0 0 0 0 0 -2073.05 0 0 0 0 0 0 0 0 0 0 0 0 0 0 
1132.92 0 0 0 0 0 0 0 2156.06 0 0 0 0 0 0 -1332.36 0 0 0 0 0 0 0 0 0 1585.06 0 0.04 0 0 0 0 0 0 -2312.62 0 0 0 0 0 0 0 0 0 0 0 0 0 0 0 -289.239 
0 405.362 2133.32 0 0 0 0 0 1687.75 0 0 -1194.11 0 2306.97 -525.605 0 0 0 0 0 -545.289 0 0 0 1353.27 0 -2318.72 0 0.06 1642.12 0 0 0 0 0 0 0 0 0 0 0 0 0 0 0 0 0 0 0 0 0 
0 0 0 0 1924.57 0 0 0 0 0 0 1726.81 0 0 0 -1478.55 0 0 0 0 0 0 0 0 0 0 0 0 544.374 0.09 0 0 0 0 0 0 0 1721.78 0 0 0 0 0 0 0 0 0 0 1148.79 0 0 
1255 0 0 0 0 1390.5 0 0 0 0 0 0 0 0 0 343.715 0 0 0 0 0 0 0 0 0 0 -1027.02 0 0 0 0.08 0 0 0 0 0 -1623.97 0 0 0 0 0 0 0 0 0 0 0 0 0 0 
0 0 0 0 1367.15 0 0 0 0 0 1018.02 -831.095 0 0 0 0 0 0 0 0 0 0 0 0 0 0 0 0 0 0 0 0.04 1955.24 0 0 0 -1050.83 0 0 0 0 0 0 0 0 0 -1379.97 0 0 0 0 
0 196.921 0 815.073 0 0 0 0 0 0 0 0 0 1732.92 0 0 0 443.052 0 0 0 0 -1405.3 0 0 0 0 0 0 0 0 1833.93 0.04 0 -662.328 0 0 0 0 0 0 0 0 0 0 0 0 0 0 0 0 
0 0 0 0 0 0 0 0 0 0 0 0 0 0 0 1148.34 0 0 2059.31 0 0 874.432 0 0 0 0 0 0 0 0 0 0 0 0.05 0 0 0 0 0 0 0 -205.618 0 0 0 1420.26 0 0 0 0 0 
0 0 0 0 0 0 0 0 0 0 0 0 0 0 0 1467.56 0 0 0 0 0 0 2169.64 0 0 0 0 -1843.85 0 0 0 0 2417.29 0 0 0 0 0 0 0 0 -1072.5 0 0 0 842.692 0 0 1584.14 0 2407.83 
1196.86 0 0 0 0 0 0 0 2160.79 0 0 0 0 0 0 0 0 0 0 1823.4 -1398.13 0 0 0 0 0 0 0 0 0 0 0 0 0 0 0.02 0 0 0 0 118.641 0 0 0 0 0 0 0 0 0 0 
0 0 0 0 2184.44 0 0 0 0 0 0 1382.11 0 0 0 0 0 0 0 0 0 0 0 0 0 18.3874 2305.44 0 0 0 985.977 120.93 0 0 0 0 0.06 -1557.59 0 0 0 0 -1209.98 0 0 0 0 0 0 -1780.83 0 
0 0 0 0 0 0 0 0 0 0 0 0 0 0 874.889 1272.7 0 0 0 0 0 0 0 0 0 0 0 0 0 -1045.64 0 0 0 0 0 0 2122.94 0.09 0 0 0 0 0 0 0 0 0 0 0 0 0 
0 2328.33 0 0 0 0 0 0 0 0 0 0 0 -2330.16 0 764.26 0 1289.03 1200.98 0 0 0 0 0 863.292 0 0 0 0 0 0 0 0 0 0 0 0 0 0.09 413.144 385.067 0 0 0 0 0 0 0 0 0 0 
0 0 2489.78 0 0 0 468.993 0 1169.39 0 0 0 1692.33 0 0 0 0 0 0 0 0 0 0 0 0 0 0 0 0 0 0 0 0 0 0 0 0 0 1293.76 0.09 0 0 -2476.35 0 0 0 0 0 0 0 0 
0 0 0 1510.28 0 0 0 0 0 -871.227 0 0 0 0 0 0 0 0 0 0 0 0 0 0 0 0 0 0 0 0 0 0 0 0 0 777.383 0 0 2239.52 0 0.08 0 0 0 2317.04 0 2494.51 0 0 0 0 
0 1972.33 904.187 1051.59 0 0 0 0 0 0 0 0 0 0 0 0 1693.85 0 0 0 0 0 0 0 0 0 0 0 0 0 0 0 0 1194.42 -1043.2 0 0 0 0 0 0 0 0 805.765 0 0 0 0 -523.774 0 0 
1848.28 1660.74 0 0 0 0 0 0 -249.718 0 0 -415.891 0 0 0 0 0 0 0 0 0 0 0 0 0 0 0 0 0 0 0 0 0 0 0 0 692.541 0 0 -1680.27 0 0 0.04 0 0 0 0 0 0 0 0 
0 0 0 0 0 0 0 -1646.09 0 0 0 0 0 0 0 0 0 0 0 462.279 0 1567.96 0 0 0 0 0 0 0 0 0 0 0 0 0 0 0 0 0 0 0 2032.91 0 0.08 0 0 1149.25 0 0 0 0 
0 0 0 0 -1670.96 0 0 0 0 0 0 0 0 0 0 0 0 0 0 0 0 0 0 0 0 0 0 0 0 0 0 0 0 0 0 0 0 0 0 0 2420.19 0 0 0 0.03 0 0 0 0 0 1734.75 
0 0 0 0 0 0 0 133.29 994.217 0 0 0 755.257 0 0 0 0 0 0 0 0 0 0 1474.43 0 0 0 0 0 0 0 0 0 893.658 47.5326 0 0 0 0 0 0 0 0 0 0 0.06 0 0 0 0 0 
1426.21 0 0 0 0 0 0 0 0 -935.316 0 0 0 0 0 0 0 -2212.67 0 0 0 0 1314.97 0 0 0 0 0 0 0 0 -491.729 0 0 0 0 0 0 0 0 1276.67 0 0 2334.89 0 0 0.08 0 0 0 0 
0 0 0 0 0 0 0 0 2151.94 1596.5 0 0 0 0 -692.694 0 0 0 0 0 0 0 0 0 0 0 0 0 0 0 0 0 0 0 0 0 0 0 0 0 0 0 0 0 0 0 0 0.05 0 0 0 
0 0 0 0 0 2151.78 0 0 0 0 0 0 0 1320.61 0 0 0 0 0 0 0 0 -983.535 0 0 -34.5622 0 0 0 -1204.49 0 0 0 0 -2262.41 0 0 0 0 0 0 385.067 0 0 0 0 0 0 0.06 0 0 
0 0 957.289 0 0 0 0 0 0 0 0 0 0 0 -1885.2 -949.202 0 0 0 0 579.318 0 0 0 2292.47 0 0 0 0 0 0 0 0 0 0 0 -1166.49 0 0 0 0 0 0 0 0 0 0 0 0 0.03 0 
-336.848 0 0 0 0 0 0 0 0 0 0 0 0 -614.261 0 0 0 0 0 0 0 0 0 0 0 0 0 1266.9 0 0 0 0 0 0 681.707 0 0 0 0 0 0 0 0 0 70.8792 0 0 0 0 0 0.09 
