*Vertices 43
*Matrix 
0.06 -232.17 0 1470 1775.03 0 457.396 0 0 0 0 2296.59 0 0 0 0 0 0 0 0 0 0 922.04 0 0 0 0 0 0 2138.81 0 0 0 0 0 0 0 0 0 0 -527.436 -1003.07 0 
820.261 0.09 0 0 0 0 0 0 0 1368.22 0 1028.86 0 -2031.85 0 2068.93 0 1299.4 -1198.54 0 0 0 0 0 0 -198.752 0 1383.33 0 0 0 0 570.772 0 0 0 0 0 0 0 0 0 0 
0 0 0.01 0 0 0 -960.494 0 2022.08 0 0 0 0 0 0 0 0 1509.37 -1010.24 0 0 0 -2272.03 0 2247.31 0 0 0 0 0 0 0 0 0 0 0 1923.51 -563.295 646.763 0 -855.815 0 0 
1659.37 0 0 0.04 0 0 0 0 0 0 1428.19 0 0 0 0 1713.84 1757.18 0 144.429 1400.88 0 0 0 0 0 0 0 0 0 0 0 0 0 542.695 2471.92 0 0 -1528.75 0 0 1403.32 -355.007 0 
778.603 0 0 0 0.07 0 926.618 0 0 0 0 0 0 0 0 0 2067.71 0 0 0 0 625.401 0 0 0 0 0 -1017.26 0 1979.96 0 0 -2337.03 0 0 0 0 0 -1881.54 0 0 1000.02 0 
0 0 0 0 0 0.07 0 0 0 1720.56 0 0 0 0 0 0 0 0 2445.98 1049.46 0 0 0 362.178 0 2102.04 0 0 2165.06 1447.11 0 -1237.75 0 2221.82 0 0 0 0 0 0 893.353 -199.21 0 
-2024.83 0 1802.8 0 -1307.03 0 0.01 0 0 0 0 -183.035 0 0 854.595 0 0 0 0 0 0 0 0 0 0 0 0 2011.7 2086.93 1096.91 2218.92 0 0 1794.72 1424.99 -2355.34 1516.24 -148.701 -1504.94 0 -1047.93 0 0 
0 0 0 0 0 0 0 0.02 0 -958.052 0 -1040.15 636.998 0 0 2026.35 0 1016.04 0 0 0 0 0 0 0 0 0 0 0 0 0 0 1186.18 1723.15 0 0 671.026 0 0 0 0 -1492.74 0 
0 0 -709.021 0 0 0 0 0 0.06 0 0 0 0 0 0 0 0 0 1144.98 0 881.909 -658.361 2050.31 0 0 0 0 396.359 2463.23 0 -598.697 0 0 0 0 0 0 0 0 0 0 0 0 
0 -534.761 0 0 0 -1729.87 0 514.008 0 0 0 0 360.347 0 0 -1525.85 1720.25 -2370.75 0 2229 -710.242 2306.82 1484.19 0 0 -465.941 0 0 0 0 1050.52 0 0 0 0 0 -1240.04 911.359 0 0 0 0 0 
0 0 0 2307.89 0 0 0 0 0 0 0.04 0 0 92.0896 0 807.901 54.7044 0 0 0 0 0 155.263 438.017 0 0 -2160.02 0 0 0 2268.67 1263.08 0 0 877.178 -2002.85 292.596 469.146 0 0 -869.701 0 0 
1195.03 2356.26 0 0 0 0 379.116 -866.649 0 0 0 0.07 0 0 0 0 0 0 0 0 0 0 0 0 1061.05 0 -2369.08 0 0 0 1606.88 579.775 0 0 0 0 676.672 0 0 0 -1370.97 0 0 
0 0 0 0 0 0 0 2353.97 0 1746.5 0 0 0.08 0 -712.683 1784.49 0 0 2263.33 0 1805.86 1993.39 802.103 0 0 0 0 0 0 0 0 0 0 2420.04 -854.747 0 279.778 0 0 -473.266 0 0 -346.767 
0 883.435 0 0 0 0 0 0 0 0 -1337.86 0 0 0.04 0 0 0 0 1749.85 1441.62 0 0 1525.09 0 0 0 -60.6555 1274.22 -960.494 0 -1218.53 0 0 0 0 -1413.39 0 0 0 824.229 0 -898.846 1514.86 
0 0 0 0 0 0 -93.9207 0 0 0 0 0 -473.571 0 0.09 0 0 448.546 0 0 1785.71 0 0 0 0 0 0 1890.24 0 -2232.66 0 0 0 -1913.59 1962.72 0 1193.04 0 0 0 -256.89 0 0 
0 192.495 0 949.965 0 0 0 1993.39 0 297.784 362.026 0 -1327.02 0 0 0.04 0 2165.67 -552.156 0 0 -950.27 0 0 0 0 0 0 0 0 0 0 1442.84 0 0 0 0 0 1831.19 -690.863 -1849.35 0 0 
0 0 0 624.79 2314.6 0 0 0 0 988.723 2270.81 0 0 0 0 0 0.05 685.522 0 2033.98 0 0 0 0 0 1100.12 0 0 0 0 0 0 49.6689 0 0 0 2127.98 0 0 0 0 0 0 
0 1360.59 1101.34 0 0 0 0 1468.47 0 1746.35 0 0 0 0 1240.65 780.892 -1752.14 0.02 0 0 0 -1552.1 0 1166.04 0 1873.3 0 1609.62 0 2111.8 0 -477.233 0 -2030.93 0 0 990.097 0 0 0 2141.56 0 0 
0 -1098.9 973.159 1611 0 254.753 0 0 -1187.25 0 0 0 -463.195 -1614.05 0 -533.387 0 0 0.07 -252.464 0 1196.71 241.478 0 1375.55 0 -671.026 -968.429 -1251.34 2378.08 0 0 1785.87 1659.67 0 0 0 0 2160.02 0 0 0 0 
0 0 0 911.359 0 1082.11 0 0 0 -1276.36 0 0 0 1169.09 0 0 -2051.07 0 1788.46 0.08 0 763.344 0 1429.87 0 -2199.39 0 0 -1904.89 0 0 0 0 823.161 0 0 0 0 0 1357.69 -298.7 2368.62 0 
0 0 0 0 0 0 0 0 -262.688 2103.56 0 0 351.497 0 2105.7 0 0 0 0 0 0.05 -2019.94 0 -1806.92 0 -119.709 0 370.113 2287.74 0 0 0 0 0 0 0 0 0 816.294 0 0 0 -1672.95 
0 0 0 0 854.289 0 0 0 1074.63 1225.85 0 0 45.0911 0 0 1542.94 0 524.384 854.9 540.254 2200.77 0.03 -835.673 -2075.03 0 0 0 112.537 0 -1238.21 0 816.141 0 0 0 0 0 0 0 0 0 318.384 -2380.83 
1681.34 0 -2186.88 0 0 0 0 0 -750.526 -1350.52 794.931 0 -1758.4 2025.59 0 0 0 0 1449.71 0 0 483.795 0.07 0 0 1729.1 -478.912 832.469 0 -1638.31 0 2134.08 251.091 0 0 0 0 0 0 0 0 1203.42 0 
0 0 0 0 0 1782.05 0 0 0 0 604.343 0 0 0 0 0 0 -214.774 0 2489.17 530.335 -863.14 0 0.08 -485.626 1716.74 1776.86 0 0 -1698.13 0 1127.89 0 0 0 -1045.49 0 0 0 -245.903 0 0 -1041.67 
0 0 1583.22 0 0 0 0 0 0 0 0 1578.49 0 0 0 0 0 0 -1258.2 0 0 0 0 1999.34 0.03 0 0 0 0 0 0 0 1524.17 1141.32 -2116.23 0 2037.64 0 1635.41 390.866 0 0 0 
0 -1319.7 0 0 0 796.457 0 0 0 -51.9578 0 0 0 0 0 0 2182.15 -571.688 0 -1404.39 -1849.04 0 2037.49 -232.78 0 0.09 0 2169.18 0 -1233.79 0 0 0 1175.04 0 650.578 0 184.103 1956.47 0 0 0 0 
0 0 0 0 0 0 0 0 0 0 -219.81 2441.71 0 813.547 0 0 0 0 1761.76 0 0 0 2350.46 -2377.01 0 0 0 0 0 0 0 0 0 0 0 0 0 0 0 2315.06 -269.707 1946.7 0 
0 2401.27 0 0 -508.667 0 1575.9 0 1574.53 0 0 0 0 -988.418 2055.04 0 0 -1286.28 -797.372 0 2497.25 -131.153 -1730.02 0 0 -1604.28 0 0.02 1055.25 825.297 0 0 0 0 2109.97 0 0 1610.54 -872.6 0 0 0 -1708.5 
0 0 0 0 0 1956.77 2028.64 0 638.371 0 0 0 0 -1573.46 0 0 0 0 812.326 386.746 1023.82 0 0 0 0 0 0 5.41704 0.01 182.882 0 0 0 422.605 0 0 0 0 0 1132.77 -1346.1 -459.227 0 
1333.74 0 0 0 90.1059 -964.461 283.593 0 0 0 0 0 0 0 2358.7 0 0 350.429 -1922.59 0 0 2033.52 2094.41 -1348.84 0 2455.44 0 -1285.21 -1278.19 0.01 0 0 0 0 -1041.52 0 0 2402.95 0 -331.202 0 0 0 
0 0 0 0 0 0 -1237.45 0 -423.978 -1045.03 -1526 277.184 0 1708.04 0 0 0 0 0 0 0 0 0 0 0 0 0 0 0 0 0 1760.23 0 0 0 0 1730.32 0 -781.503 -579.623 2118.37 0 0 
0 0 0 0 0 -2049.09 0 0 0 0 1967.15 -1388.06 0 0 0 0 0 267.724 0 0 0 401.09 -470.367 1925.79 0 0 0 0 0 0 726.569 0.02 0 0 0 1501.59 0 2449.19 221.793 0 0 0 -1420.41 
0 1894.67 0 0 423.978 0 0 956.526 0 0 0 0 0 0 0 1884.9 -1619.39 0 -2074.27 0 0 0 2246.24 0 -2040.7 0 0 0 0 0 0 0 0.04 0 0 2472.99 0 0 1194.72 -2450.1 0 0 0 
0 0 0 24.3385 0 979.873 2285.61 -1459.93 0 0 0 0 2124.62 0 742.897 0 0 -1801.89 -1698.74 949.355 0 0 0 0 177.236 990.86 0 0 -738.777 0 0 0 0 0.07 0 2387.54 0 0 0 0 0 0 0 
0 0 0 2399.14 0 0 -984.909 0 0 0 -2470.7 0 875.195 0 -753.273 0 0 0 0 0 0 0 0 0 58.8244 0 0 1451.99 0 1603.06 0 0 0 0 0.07 0 0 -878.094 0 -705.817 0 0 0 
0 0 0 0 0 0 2033.37 0 0 0 2422.03 0 0 847.728 0 0 0 0 0 0 0 0 0 -429.319 0 443.358 0 0 0 0 0 2150.41 -1215.48 2336.57 0 0.09 0 0 156.484 0 260.857 0 0 
0 0 -732.673 0 0 0 -1043.2 1679.36 0 1821.12 2324.21 -1486.63 1639.84 0 -2199.7 0 1918.93 2064.35 0 0 0 0 0 0 -1109.73 0 0 0 0 0 -1604.28 0 0 0 0 0 0.01 0 0 0 0 0 0 
0 0 2467.35 47.2274 0 0 -735.725 0 0 -1884.44 1675.54 0 0 0 0 0 0 0 0 0 0 0 0 0 0 1989.88 0 437.254 0 -1163.44 0 731.3 0 0 957.137 0 0 0.09 0 0 0 0 1496.25 
0 0 528.352 0 400.784 0 1680.73 0 0 0 0 0 0 0 0 930.891 0 0 -809.427 0 619.144 0 0 0 115.284 581.759 0 1800.82 0 0 827.281 1393.25 -1824.47 0 0 -1497.62 0 0 0.07 0 1716.28 -1877.73 0 
0 0 0 0 0 0 0 0 0 0 0 0 2346.8 1168.17 0 1128.96 0 0 0 -2053.06 0 0 0 558.87 -2061.91 0 -2294.76 0 2261.65 -1783.12 1900.62 0 -1320 0 975.143 0 0 0 0 0.04 2011.25 0 -1593.75 
1356.17 0 1371.43 -1598.94 0 306.94 -2084.95 0 0 0 190.207 2172.69 0 0 1208.15 -1021.84 0 1799.3 0 488.22 0 0 0 0 0 0 2389.07 0 542.085 0 -388.73 0 0 0 0 -391.018 0 0 2390.29 -1375.24 0.09 0 1908.55 
1779.46 0 0 1137.35 1637.85 -557.649 0 -1668.52 0 0 0 0 0 1817.45 0 0 0 0 0 2385.56 0 882.366 526.215 0 0 0 -300.989 0 1378.29 0 0 0 0 0 0 0 0 0 -415.738 0 0 0.03 0 
0 0 0 0 0 0 0 0 0 0 0 0 527.284 -2235.25 0 0 0 0 0 0 1032.67 -332.881 0 -781.045 0 0 0 1999.19 0 0 0 -61.7237 0 0 0 0 0 -2329.4 0 1909.92 1985.46 0 0.01 
