*Vertices 42
*Matrix 
0.08 0 -1682.87 0 0 560.091 545.137 0 0 -395.596 1674.02 -374.996 0 0 -1623.36 0 0 1470.31 0 1499.76 398.19 1518.83 0 0 0 472.655 0 0 0 0 146.413 0 0 0 0 0 0 121.082 0 0 0 0 
0 0.07 0 988.876 399.106 1187.7 0 -1654.94 0 0 0 0 0 0 2412.11 0 -1045.49 0 0 0 0 0 0 0 0 0 -380.184 0 0 304.804 0 0 -1383.18 0 0 723.365 -1027.18 -1271.32 0 0 0 0 
1651.74 0 0.06 0 0 2308.04 0 0 0 0 0 2493.29 0 0 0 0 0 0 1035.11 0 0 0 0 -2192.22 0 0 0 0 0 2175.28 0 0 0 0 0 0 0 0 1213.34 0 0 0 
0 -47.2274 0 0.07 1265.22 0 0 -2353.05 0 0 0 0 0 60.5029 0 -2367.7 0 0 0 0 0 2104.48 0 0 0 1734.6 1265.07 0 0 0 -579.775 2015.52 -125.507 0 0 0 0 0 -2420.19 0 0 1403.78 
0 -958.51 0 38.377 0.07 0 0 0 2382.35 -978.805 -1396.6 1416.44 0 -1370.66 0 0 543.458 -445.647 0 0 0 0 0 0 0 0 -1695.84 0 -262.23 0 1176.72 0 0 2369.84 1781.9 0 0 0 0 0 0 0 
1255 234.153 -957.9 0 0 0.04 0 0 0 920.667 0 -1888.1 0 1014.36 0 0 1725.9 0 0 0 0 1200.37 0 0 0 0 0 0 0 0 0 0 -810.8 0 0 1353.72 0 0 889.081 0 0 0 
-1016.04 0 0 0 0 0 0 0 0 0 1851.79 0 0 0 0 0 0 0 -532.014 0 0 0 0 1423.15 0 2477.87 1062.27 0 222.098 -1292.54 -360.5 1744.36 0 0 0 -1087.3 0 0 0 0 -1968.06 0 
0 825.907 0 1903.06 0 0 0 0.04 0 0 -1430.17 0 0 0 0 0 0 1264.31 0 0 0 0 0 0 2266.99 629.826 0 0 0 0 0 -849.254 0 -1229.97 451.14 424.131 0 0 0 0 0 0 
0 0 0 0 1522.8 0 0 0 0.01 0 0 23.8807 0 0 0 0 0 0 -1398.89 0 0 0 0 2445.68 0 0 0 0 636.235 2148.73 0 0 0 0 0 0 0 0 0 0 -2302.24 -546.815 
-369.503 0 0 0 -1061.82 2102.34 0 0 0 0.07 0 0 -66.9118 0 505.768 0 -1668.37 0 0 0 0 0 1135.36 2229.76 0 0 0 0 2419.13 0 0 0 0 0 0 -467.009 1532.11 -512.177 -13.1993 929.365 0 0 
2348.63 0 0 0 -1188.31 0 968.429 2068.01 0 0 0.05 0 0 0 1978.59 0 0 0 -893.506 0 0 -582.369 425.047 393.002 0 0 0 29.9844 0 0 783.792 -351.039 0 0 0 0 2326.2 0 -951.643 0 0 0 
6.18 0 608.005 0 1688.36 -461.669 0 0 -389.34 0 0 0.03 -398.343 0 40.8185 0 0 649.052 0 0 2430.27 0 0 0 1245.69 0 0 -1077.84 -888.928 0 0 0 1856.82 0 0 -863.903 0 0 0 0 0 0 
0 0 0 0 0 0 0 0 0 2224.72 0 1381.19 0.04 0 0 0 0 0 0 0 334.712 0 0 1343.2 -353.328 0 0 0 -1899.85 0 559.938 2051.68 -1264.92 2212.21 0 -1080.74 0 0 -249.26 652.867 0 0 
0 0 0 -765.328 -986.892 309.229 0 0 0 0 0 0 0 0.06 0 0 0 -1875.59 0 0 0 0 0 0 0 0 0 0 22.9652 2089.37 0 0 1184.35 135.426 0 1895.28 0 0 -1176.41 0 0 0 
-2050 1668.52 0 0 0 0 0 0 0 1286.74 1158.41 990.402 0 0 0.08 0 -357.448 0 0 -367.824 0 0 0 0 0 2330.16 0 -116.047 1629.76 -1728.64 0 0 0 1454.13 0 0 0 0 0 0 2399.14 0 
0 0 0 2276.6 0 0 0 0 0 0 0 0 0 0 0 0.02 1872.69 0 0 0 704.138 0 2296.75 -866.802 1688.51 0 0 0 0 0 -840.098 -729.774 0 0 0 0 -901.135 0 0 0 0 0 
0 380.337 0 0 -1889.48 2172.23 0 0 0 725.959 0 0 0 0 2015.06 2371.52 0.08 0 0 -1236.84 0 0 0 0 0 0 0 0 1208.3 1109.88 0 0 0 -1436.43 1916.33 -606.021 -2462.61 0 -1960.59 0 0 0 
1350.06 0 0 0 -61.2659 0 0 131.611 0 0 0 383.541 0 2383.88 0 0 0 0.01 0 0 0 0 0 0 0 0 0 0 0 0 0 1126.21 0 671.484 -2492.98 0 0 0 1117.51 0 127.186 0 
0 0 -782.571 0 0 0 2200.31 0 1351.89 0 635.014 0 0 0 0 0 0 0 0.08 0 0 0 -2176.81 0 0 0 0 0 0 1058.31 0 0 178.762 0 500.122 -2111.35 0 0 0 0 0 0 
1017.41 0 0 0 0 0 0 0 0 0 0 0 0 0 39.7504 0 2110.89 0 0 0.09 0 996.658 -1949.75 406.583 706.427 -636.845 0 0 399.716 -1523.1 0 0 -1965.62 0 0 1852.4 236.747 0 669.805 0 -1249.05 481.201 
-871.38 0 0 0 0 0 0 0 0 0 0 991.012 -2080.37 0 0 2292.32 0 0 0 0 0.04 64.1652 0 1957.84 1354.64 0 0 0 0 0 0 0 311.518 0 0 0 0 0 0 0 0 0 
1824.78 0 0 1182.36 0 390.561 0 0 0 0 2309.56 0 0 0 0 0 0 0 0 -278.863 -2187.8 0.04 0 0 0 0 335.475 0 0 0 0 0 422.91 0 0 0 0 0 -1695.84 0 0 0 
0 0 0 0 0 0 0 0 0 -934.706 2253.56 0 0 0 0 -673.467 0 0 -1054.03 -412.381 0 0 0.05 -2036.12 0 634.861 0 0 -2135 0 0 1811.04 0 0 1514.1 0 0 696.661 2096.55 0 0 0 
0 0 1313.9 0 0 0 731.3 0 967.055 -1052.05 1458.4 0 -1447.26 0 0 -1477.94 0 0 0 753.121 2165.36 0 146.413 0.02 1975.39 0 2230.06 -1493.35 0 0 0 0 0 0 133.137 -1388.52 0 2441.71 2305.44 0 0 0 
0 0 0 0 0 0 0 2276.3 0 0 0 -2251.27 -2482.3 0 0 1995.53 0 0 0 -830.027 2416.99 0 0 299.921 0.08 0 0 0 0 0 0 1444.98 44.3281 0 1941.82 179.22 0 0 0 0 -2334.59 0 
2280.88 0 0 900.525 0 0 -1259.58 -988.723 0 0 0 0 0 0 -528.199 0 0 0 0 -766.091 0 0 821.787 0 0 0.04 2449.8 0 0 0 -1501.13 0 0 0 0 0 0 0 0 0 0 0 
0 2350 0 -1281.09 -1845.68 0 -45.5489 0 0 0 0 0 0 0 0 0 0 0 0 0 0 1279.11 0 1550.26 0 2009.26 0.06 0 -1835.92 0 0 0 -0.991852 2048.94 2476.5 0 0 0 0 0 0 0 
0 0 0 0 0 0 0 0 0 0 1502.2 815.378 0 0 671.484 0 0 0 0 0 0 0 0 803.171 0 0 0 0.02 1901.68 700.171 -1817.91 0 0 0 1761.15 0 0 0 0 0 0 1545.53 
0 0 0 0 275.201 0 42.8022 0 -1906.72 -1072.34 0 -1100.12 -108.722 770.058 743.812 0 -1504.03 0 0 1597.57 0 0 -1103.78 0 0 0 1577.58 2220.15 0.09 0 0 -141.377 0 0 -1583.99 0 2191.46 0 0 512.024 -1604.28 0 
0 504.7 148.549 0 0 0 -1596.5 0 235.069 0 0 0 0 -240.867 1091.42 0 277.337 0 2234.64 -1170 0 0 0 0 0 0 0 -612.125 0 0.06 0 0 0 1013.9 0 0 0 0 0 0 0 0 
1432.77 0 0 -485.626 -449.309 0 -1146.5 0 0 0 -710.7 0 2146.44 0 0 2155.9 0 0 0 0 0 0 0 0 0 -1753.97 0 1973.56 0 0 0.07 0 0 0 0 0 -732.826 890.606 0 0 0 0 
0 0 0 -185.781 0 0 910.291 -405.21 0 0 2012.16 0 1727.88 0 0 -2416.68 0 -1280.63 0 0 0 0 2219.53 0 -846.965 0 0 0 -885.571 0 0 0.01 0 0 1794.11 0 0 0 0 0 0 0 
0 -2418.06 0 -175.1 0 -1992.02 0 0 0 0 0 671.789 758.156 1020.46 0 0 0 0 1710.64 -918.073 1598.79 2431.49 0 0 -29.9844 0 1415.52 0 0 0 0 0 0.03 0 0 0 0 0 0 0 0 0 
0 0 0 0 491.882 0 0 1065.48 0 0 0 0 1236.69 2496.8 1817.76 0 -945.235 1633.27 0 0 0 0 0 0 0 0 2409.97 0 0 -1882.92 0 0 0 0.09 697.882 0 0 2351.68 0 0 0 0 
0 0 0 0 1000.47 0 0 -702.307 0 0 0 0 0 0 0 0 1681.34 -2094.87 451.14 0 0 0 -113.453 1681.49 -844.829 0 -1319.54 374.538 156.331 0 0 1976.3 0 964.766 0.02 0 0 0 0 0 0 0 
0 515.229 0 0 0 937.758 -1241.87 1942.88 0 -1170.46 0 -558.718 -2377.32 2133.63 0 0 983.84 0 -1840.8 1447.42 0 0 0 1442.99 1100.73 0 0 0 0 0 0 0 0 0 0 0.04 0 -23.5755 0 0 0 0 
0 1044.27 0 0 0 0 0 0 0 1124.68 797.983 0 0 0 0 319.91 -1271.63 0 0 1314.36 0 0 0 0 0 0 0 0 345.393 0 1159.63 0 0 0 0 0 0.07 -1681.65 0 0 0 0 
2073.66 -798.135 0 0 0 0 0 0 0 -938.673 0 0 0 0 0 0 0 0 0 0 0 0 2351.37 614.261 0 0 0 0 0 0 -987.35 0 0 2453.46 0 -75.7622 700.323 0.01 0 0 0 0 
0 0 -848.338 1835.15 0 -1134.14 0 0 0 -1914.2 -2340.85 0 2414.7 2401.73 0 0 2268.82 -1223.56 0 126.881 0 1765.42 2276.6 1611.3 0 0 0 0 0 0 0 0 0 0 0 0 0 0 0.01 0 0 -1994 
0 0 0 0 0 0 0 0 0 1683.78 0 0 756.478 0 0 0 0 0 0 0 0 0 0 0 0 0 0 0 -1204.79 0 0 0 0 0 0 0 0 0 0 0.02 0 0 
0 0 0 0 0 0 -531.404 0 -2194.81 0 0 0 0 0 1122.7 0 0 808.512 0 1441.77 0 0 0 0 1860.64 0 0 0 -535.066 0 0 0 0 0 0 0 0 0 0 0 0.09 0 
0 0 0 -1108.51 0 0 0 0 2389.07 0 0 0 0 0 0 0 0 0 0 1332.51 0 0 0 0 0 0 0 -298.395 0 0 0 0 0 0 0 0 0 0 900.372 0 0 0.09 
