*Vertices 49
*Matrix 
0.06 0 0 0 0 0 2363.28 0 0 0 0 0 0 834.605 0 0 0 0 0 -1087.6 -1102.86 1297.72 0 0 0 -1562.47 0 0 0 -2450.1 0 0 0 1520.97 0 2213.43 0 0 0 -532.014 0 0 0 342.189 20.3711 0 0 0 0 
0 0.02 0 2431.49 0 0 0 -1135.21 0 0 0 0 0 0 0 -1225.39 978.652 0 0 2462.46 2264.7 0 0 0 0 0 0 0 -277.795 0 0 0 955.306 0 0 0 -1316.8 0 0 0 0 229.575 0 0 0 0 0 0 0 
0 0 0.02 1870.86 -1524.17 0 0 1826 0 0 0 0 0 0 0 646.611 1049.76 0 2119.74 0 0 863.598 0 -296.716 0 0 0 0 0 -741.218 1438.41 0 0 0 -1686.22 0 0 0 0 247.124 0 0 0 0 0 0 0 0 0 
0 -1643.35 1249.81 0.05 0 0 0 0 -93.4629 0 -981.704 0 0 0 -128.101 0 0 0 -548.036 1049 -1014.36 815.226 -132.527 0 0 0 1005.66 0 846.66 0 -610.141 1038.62 0 0 234.611 1685.77 0 0 0 0 0 0 0 0 0 0 0 0 0 
0 0 1180.84 0 0.05 302.973 0 0 0 -1741.31 0 1189.99 0 0 0 0 1961.04 -303.888 -172.506 0 0 748.085 0 0 0 0 0 0 0 0 2270.2 0 324.946 0 -304.498 0 0 0 0 0 0 0 0 0 0 0 -2197.1 0 1017.11 
0 0 0 0 -436.033 0.03 0 0 0 0 765.023 0 559.633 0 1511.2 0 0 0 0 0 0 0 0 987.808 0 970.26 0 0 0 0 0 0 -1753.82 -1973.86 0 0 0 0 0 0 0 0 0 0 0 0 0 0 0 
-1261.41 0 0 0 0 0 0.08 0 2125.84 961.715 0 0 0 2203.67 -2107.23 0 -407.041 0 0 0 0 1270.56 0 0 -229.423 2077.93 0 0 0 0 0 0 1404.23 -2211.6 0 0 0 0 0 0 0 1813.94 0 0 0 0 0 0 0 
0 -668.737 679.571 0 0 0 0 0.02 0 0 0 -2318.72 0 0 2475.59 2418.52 1276.36 -1544.16 0 0 0 0 0 0 0 0 713.904 0 0 0 0 390.103 94.2259 -184.256 0 0 0 0 -2044.05 0 2042.99 0 0 0 0 0 0 0 -1205.86 
0 0 0 -434.049 0 0 461.211 0 0.04 2376.25 1407.9 0 346.767 1858.2 0 0 -1336.48 -2070.91 -752.663 0 1221.43 0 0 0 -105.67 0 0 0 0 0 0 0 2373.35 0 2454.68 -997.726 0 -957.442 0 0 0 -1224.33 -580.233 0 -1747.57 0 0 0 0 
0 0 0 0 287.103 0 1082.26 0 1961.35 0.01 0 0 0 0 0 0 0 0 1787.24 0 -1310.39 0 0 0 0 0 0 0 -917.615 0 0 0 0 0 0 0 -1548.28 1686.38 0 0 1180.53 0 0 0 0 -68.7429 -2475.74 0 0 
0 0 0 488.983 0 -364.62 0 0 2410.73 0 0.07 0 0 0 -21.897 74.2363 0 1248.89 0 174.947 0 0 0 0 0 0 0 0 0 59.1296 1484.95 0 0 0 0 0 0 1537.14 1823.4 0 0 0 0 0 0 0 0 0 0 
0 0 0 0 1123.92 0 0 -1435.21 0 0 0 0.07 0 0 0 648.442 0 0 0 0 0 2279.66 0 0 0 0 0 0 1704.38 0 0 0 2194.81 0 928.297 -627.079 0 0 0 0 0 0 0 0 0 0 0 1462.83 0 
0 0 0 0 0 -346.614 0 0 -722.449 0 0 0 0.02 0 2382.2 0 0 0 -2210.84 0 2403.26 0 0 0 0 0 0 0 0 -1119.19 0 0 0 1361.35 0 0 0 2118.98 0 0 0 0 0 0 0 0 0 0 0 
2431.03 0 0 0 0 0 2005.91 0 249.107 0 0 0 0 0.06 0 0 0 0 0 0 -1100.27 0 1452.91 0 0 416.196 0 0 0 0 0 0 0 394.375 888.623 0 0 0 0 0 289.697 0 0 0 0 0 0 0 -1694.92 
0 0 0 1650.82 0 927.229 378.811 1404.69 0 0 1897.72 0 2080.37 0 0.05 0 0 -975.143 0 0 0 0 0 0 0 0 0 0 0 0 -43.7178 -1712.16 0 1923.81 0 0 0 -1617.86 0 -1838.82 0 0 0 0 0 0 0 0 0 
0 654.241 1577.12 0 0 0 0 2247 0 0 1617.25 -316.248 0 0 0 0.06 0 0 675.604 -2080.07 0 366.298 0 0 0 0 584.506 0 0 0 0 0 0 356.227 0 2213.43 0 -1896.19 0 0 519.501 0 -576.266 0 0 0 0 0 0 
0 1897.87 -2065.11 0 -1918.78 0 1968.52 2292.02 831.553 0 0 0 0 0 0 0 0.09 0 1682.26 0 0 -1615.27 -946.608 -1957.38 2052.29 0 1380.28 0 0 0 -2038.26 0 0 0 747.169 0 -1241.26 0 0 2057.79 0 0 0 0 2256.16 0 0 1335.26 -1602.6 
0 0 0 0 2365.87 0 0 893.048 657.14 0 858.257 0 0 0 2243.34 0 0 0.06 0 1377.83 0 2308.8 0 -562.99 0 -2406.16 0 0 -435.118 0 0 2425.84 0 0 0 -1409.88 0 0 -1767.4 -1403.47 0 0 0 0 0 0 0 0 0 
0 0 1850.41 1739.02 2308.5 0 0 0 1767.1 -2224.42 0 0 -2416.38 0 0 1915.27 842.082 0 0.06 2097.77 -1329.77 0 0 0 0 0 -794.931 0 0 0 0 -688.269 0 0 1093.25 240.867 -1331.6 0 149.617 0 0 0 0 0 0 0 0 0 0 
-2114.7 -734.657 0 2444 0 0 0 0 0 0 686.743 0 0 0 0 1342.74 0 -1498.84 -974.38 0.08 1446.5 0 -1706.52 0 1722.54 -757.851 0 0 0 -49.6689 0 0 0 -412.992 0 0 0 0 0 0 2404.63 0 0 0 0 0 0 0 0 
2444.61 -2386.93 0 756.63 0 0 0 0 1350.37 615.635 0 0 -180.746 414.975 0 0 0 0 22.9652 1660.28 0.05 942.488 0 0 1528.14 0 0 0 712.378 0 0 0 -1579.26 -975.143 0 788.675 0 917.31 0 0 0 0 0 0 0 0 0 2471.01 0 
813.852 0 1254.54 -1631.6 71.7948 0 -793.405 0 0 0 0 2236.47 0 0 0 977.432 242.698 2168.42 0 0 1086.38 0.05 957.137 -2033.07 1070.51 2133.63 1717.96 0 2106.92 0 0 0 0 0 0 0 0 2309.26 0 0 1316.95 -1240.81 1778.08 0 0 0 0 0 0 
0 0 0 2184.9 0 0 0 0 0 0 0 0 0 -819.346 0 0 -1442.53 0 0 1012.22 0 1539.43 0.01 0 1716.44 0 -2043.29 2093.65 0 166.86 0 0 0 0 0 0 0 0 0 -2011.09 0 0 0 0 0 0 0 0 -18.54 
0 0 892.132 0 0 2451.02 0 0 0 0 0 0 0 0 0 0 -409.177 2246.24 0 0 0 1947.92 0 0.04 0 0 0 2165.06 0 0 0 0 0 0 979.873 0 0 -738.166 0 -2181.69 0 -1474.88 1014.21 0 0 0 0 -2312.62 0 
0 0 0 0 0 0 -794.015 0 1171.22 0 0 0 0 0 0 0 -1476.56 0 0 -535.524 -480.743 1492.13 1088.52 0 0.03 -263.451 0 0 0 0 -2311.09 0 0 2210.99 0 0 0 0 0 593.661 0 0 0 0 0 1001.24 0 0 0 
-1970.66 0 0 0 0 1891 -878.246 0 0 0 0 0 0 2072.74 0 0 0 2033.68 0 990.86 0 -901.44 0 0 961.409 0.08 0 0 0 0 0 0 2378.38 2286.98 570.62 0 0 0 0 0 0 0 -913.343 0 -2252.8 0 0 0 0 
0 0 0 485.778 0 0 0 2117.15 0 0 0 0 0 0 0 1802.8 1356.78 0 1402.86 0 0 -1810.89 -1742.53 0 0 0 0.08 1119.04 0 0 0 973.769 0 0 0 548.494 0 0 0 0 0 -210.654 0 318.232 0 0 0 0 0 
0 0 0 0 0 0 0 0 0 0 0 0 0 0 0 0 0 0 0 0 0 0 -2146.75 1053.73 0 0 1993.09 0.09 0 0 0 0 0 0 0 2307.12 0 1928.54 0 0 0 931.959 0 0 0 0 0 0 0 
0 110.553 0 1233.18 0 0 0 0 0 754.799 0 -124.134 0 0 0 0 0 -825.602 0 0 575.961 1908.25 0 0 0 0 0 0 0.07 1461.46 0 0 0 0 0 0 0 0 0 0 0 0 0 0 0 0 0 0 0 
2096.24 0 -1325.5 0 0 0 0 0 0 0 1117.21 0 1217.46 0 0 0 0 0 0 1851.94 0 0 2277.52 0 0 0 0 0 2479.55 0.02 0 0 0 0 0 0 0 0 0 2321.77 0 2283.47 0 -478.149 0 0 -2494.81 0 0 
0 0 -111.774 612.888 1873.91 0 0 0 0 0 2150.11 0 0 0 590.762 0 1193.04 0 0 0 0 0 0 0 2230.52 0 0 0 0 0 0.07 0 0 0 0 0 1397.98 0 1478.7 0 0 -1135.98 0 0 954.848 -1399.81 0 0 0 
0 0 0 1986.37 0 0 0 1364.56 0 0 0 0 0 0 917.005 0 0 -1153.83 -1670.96 0 0 0 0 0 0 0 -390.561 0 0 0 0 0.02 0 0 0 0 0 0 0 1086.99 0 0 0 0 0 0 0 0 0 
0 -2166.43 0 0 2430.11 2297.66 2386.32 1956.77 7.55333 0 0 -892.59 0 0 0 0 0 0 0 0 -954.695 0 0 0 0 -1467.1 0 0 0 0 0 0 0.03 0 0 0 0 0 1871.62 0 0 915.784 0 0 0 0 0 0 0 
-844.066 0 0 0 0 2036.27 1256.52 862.682 0 0 0 0 -1322.44 689.642 767.769 -1014.97 0 0 0 -1813.33 964.766 0 0 0 389.95 2427.06 0 0 0 0 0 0 0 0.03 1119.19 0 0 0 0 620.06 -385.372 0 1520.36 0 0 0 0 0 0 
0 0 -1114.92 2217.09 -357.753 0 0 0 -648.747 0 0 -1108.97 0 1245.54 0 0 1753.82 0 1385.77 0 0 0 0 2040.39 0 1650.67 0 0 0 0 0 0 0 -1327.02 0.02 -1830.88 -187.155 0 0 0 0 0 1836.22 0 0 0 0 0 0 
-299.615 0 0 831.553 0 0 0 0 146.413 0 0 1521.58 0 0 0 968.581 0 2289.12 2460.02 0 1785.1 0 0 0 0 0 1576.05 1547.36 0 0 0 0 0 0 79.2718 0.02 -1562.62 0 0 0 871.532 0 0 -810.038 0 0 0 -1061.51 0 
0 -1148.64 0 0 0 0 0 0 0 -2135.61 0 0 0 0 0 0 -55.9252 0 2207.17 0 0 0 0 0 0 0 0 0 0 0 1979.2 0 0 0 2349.7 1322.44 0.06 0 748.848 2444.91 0 617.771 0 0 578.707 0 0 0 0 
0 0 0 0 0 0 0 0 -2326.35 -200.888 528.352 0 869.701 0 1293.76 -921.43 0 0 0 0 -1126.36 2090.14 0 1411.86 0 0 0 851.085 0 0 0 0 0 0 0 0 0 0.04 0 0 2282.86 1270.1 0 1609.32 0 -1109.58 0 0 0 
0 0 0 0 0 0 0 627.079 0 0 -211.264 0 0 0 0 0 0 858.257 1086.38 0 0 0 0 0 0 0 0 0 0 0 2181.54 0 76.3726 0 0 0 1377.53 0 0.01 801.645 -1160.85 0 -1298.64 693.609 -1527.07 0 0 0 558.87 
-1253.47 0 1005.81 0 0 0 0 0 0 0 0 0 0 0 183.187 0 1166.65 2319.64 0 0 0 0 -465.331 -2269.13 -1405.91 0 0 0 0 202.567 0 -1841.26 0 2026.35 0 0 174.337 0 1583.07 0.02 799.051 0 0 0 0 0 0 0 0 
0 0 0 0 0 0 0 -650.578 0 -1786.63 0 0 0 1938.61 0 -2080.22 0 0 0 905.866 0 1860.79 0 0 0 0 0 0 0 0 0 0 0 1887.95 0 2037.8 0 -173.574 2124.77 279.473 0.08 0 -511.719 0 0 -1838.97 0 0 0 
0 1008.1 0 0 0 0 -291.528 0 1326.87 0 0 0 0 0 0 0 0 0 0 0 0 736.488 0 608.005 0 0 352.718 1941.82 0 -1730.02 1839.73 0 1239.89 0 0 0 -493.255 244.224 0 0 0 0.07 0 0 0 0 0 0 0 
0 0 0 0 0 0 0 0 1720.25 0 0 0 0 0 0 -17.4718 0 0 0 0 0 1262.02 0 -1939.53 0 1094.62 0 0 0 0 0 0 0 1521.42 884.35 0 0 0 2093.04 0 531.404 0 0.08 806.833 0 0 0 0 0 
903.577 0 0 0 0 0 0 0 0 0 0 0 0 0 0 0 0 0 0 0 0 0 0 0 0 0 1623.81 0 0 1313.44 0 0 0 0 0 328.913 0 1658.91 -445.952 0 0 0 1233.94 0.02 0 0 0 0 0 
173.421 0 0 0 0 0 0 0 -852.763 0 0 0 0 0 0 0 347.224 0 0 0 0 0 0 0 0 2164.14 0 0 0 0 1546.45 0 0 0 0 0 1789.99 0 1829.66 0 0 0 0 0 0.03 -411.924 2225.64 0 0 
0 0 0 0 0 0 0 0 0 1813.64 0 0 0 0 0 0 0 0 0 0 0 0 0 0 -1453.83 0 0 0 0 0 896.405 0 0 0 0 0 0 -563.295 0 0 2226.25 0 0 0 -105.823 0.08 0 0 0 
0 0 0 0 1757.48 0 0 0 0 -2486.27 0 0 0 0 0 0 0 0 0 0 0 0 0 0 0 0 0 0 0 1155.2 0 0 0 0 0 0 0 0 0 0 0 0 0 0 1270.71 0 0.03 0 0 
0 0 0 0 0 0 0 0 0 0 0 -583.895 0 0 0 0 983.535 0 0 0 732.215 0 0 -1083.48 0 0 0 0 0 0 0 0 0 0 0 1799.75 0 0 0 0 0 0 0 0 0 0 0 0.04 -924.787 
0 0 0 0 1357.23 0 0 738.014 0 0 0 0 0 1006.58 0 0 -57.9089 0 0 0 0 0 2280.57 0 0 0 0 0 0 0 0 0 0 0 0 0 0 0 -1007.8 0 0 0 0 0 0 0 0 -1122.24 0.03 
