*Vertices 69
*Matrix 
0.02 0 0 1009.78 0 349.208 1476.56 0 0 0 630.589 0 0 0 0 0 0 0 0 0 0 399.106 0 0 0 -456.633 1609.16 -781.961 0 0 0 0 0 0 0 -394.528 0 0 0 0 0 0 0 0 -918.683 0 0 0 0 0 0 0 0 0 0 0 0 0 0 0 0 0 0 0 325.556 0 0 0 0 
0 0.09 0 0 2461.24 0 0 0 194.021 0 0 1642.58 0 0 0 709.021 0 0 0 -2084.8 0 357.601 0 2138.51 -1642.12 0 0 0 0 288.476 0 0 0 0 0 0 0 0 0 0 2115.62 0 0 0 0 0 0 0 0 0 0 0 0 1004.59 0 0 0 0 0 -581.912 0 0 0 0 0 0 -550.935 0 -1891.77 
0 0 0.02 0 0 0 0 0 0 -2292.02 0 35.02 0 0 2357.48 0 0 0 0 0 0 1677.98 0 1248.44 0 -658.361 0 0 0 0 2356.72 0 0 0 0 -148.701 0 -1630.38 0 0 874.889 0 0 0 0 0 0 0 0 0 0 0 0 0 0 1615.88 0 0 1840.19 0 0 0 -201.651 0 0 0 0 -2463.99 0 
943.251 0 0 0.04 0 0 134.968 0 0 0 0 0 0 -1090.5 0 0 0 2253.11 0 0 0 0 2310.94 0 0 0 0 2324.21 769.143 0 0 0 -253.38 0 0 0 0 0 -561.312 0 0 2060.99 0 0 0 0 0 0 0 0 0 0 0 0 0 0 2049.24 0 1300.62 0 0 562.685 0 0 0 0 0 0 0 
0 1930.22 0 0 0.04 0 0 0 0 0 0 0 0 -514.924 0 0 0 0 0 -1128.5 0 0 0 0 0 2454.22 0 1783.88 0 0 1302.91 1623.97 780.587 0 0 0 -2495.42 0 0 0 0 0 0 0 0 0 0 0 0 0 0 0 0 417.112 0 0 -559.481 0 0 0 0 538.27 0 0 0 0 1907.79 0 0 
2468.87 0 0 0 0 0.04 0 0 0 -1623.81 1070.21 -359.584 0 1925.34 433.439 0 0 0 2296.75 0 0 0 0 0 0 -2186.57 0 0 2283.32 0 0 0 0 0 0 0 0 0 -808.969 0 0 0 0 0 0 727.18 0 75.9148 0 0 0 0 0 0 0 0 0 0 0 0 0 -1127.28 -25.4067 0 0 0 0 0 0 
-1539.28 0 0 61.5711 0 0 0.03 -2151.33 0 0 0 1654.48 2158.04 0 2389.68 0 1791.82 0 0 0 0 0 0 0 0 0 0 0 0 -1154.13 0 0 0 0 0 708.716 0 2466.73 0 -141.53 0 2409.97 0 0 0 0 533.235 0 0 0 454.802 0 0 0 0 0 0 0 0 0 1511.2 0 0 0 0 0 0 0 0 
0 0 0 0 0 0 1683.02 0.02 0 0 2313.68 -338.679 0 399.869 0 2231.74 -1720.56 0 0 -1341.21 0 0 0 0 0 0 1510.74 0 0 0 0 0 0 0 0 0 -964.461 0 0 2498.32 1084.55 0 0 0 0 0 0 0 0 -642.796 -74.6941 0 0 0 0 -2262.72 0 0 0 0 0 0 2175.89 0 -805.155 0 181.051 -1121.78 0 
0 1489.07 0 0 0 0 0 0 0.06 0 613.193 0 0 -952.101 -408.261 0 0 0 1994.31 0 0 0 0 0 0 0 0 0 0 0 382.015 0 0 0 0 0 -411.008 0 0 0 0 -617.008 0 0 0 0 0 0 0 0 0 0 0 0 0 0 0 0 0 0 0 0 0 0 1729.41 0 0 0 0 
0 0 392.239 0 0 1423.76 0 0 0 0.09 -2174.06 -612.125 0 0 0 0 0 1082.11 0 0 0 2454.68 -383.084 0 0 0 1548.74 -1595.58 -1120.87 1347.47 0 2077.62 0 0 -1491.97 0 0 0 0 0 0 2326.5 0 0 2176.81 0 0 0 0 0 0 0 0 0 0 0 0 0 0 0 0 0 -2025.44 0 0 0 0 0 0 
1135.36 0 0 0 0 511.719 0 1886.43 -21.5918 312.586 0.03 0 0 1935.56 0 0 0 0 0 1630.83 0 0 2006.21 0 0 0 0 0 0 -178.152 0 1315.73 0 0 0 1100.42 -462.737 1772.13 0 1249.05 0 0 0 0 0 -2059.16 0 0 1810.28 0 0 0 0 0 0 0 0 0 0 0 0 0 0 0 0 0 0 0 0 
0 681.402 -262.383 0 0 934.706 -2314.14 294.122 0 136.189 0 0.06 0 -1553.16 0 0 0 0 -282.525 -142.903 208.365 0 0 0 -89.9533 0 0 0 0 0 0 0 0 572.909 0 0 0 2196.19 0 0 0 2245.78 0 0 0 -835.978 0 0 0 0 0 -580.691 0 0 0 0 0 0 0 0 0 0 1585.06 0 0 957.289 0 0 0 
0 0 0 0 0 0 -341.121 0 0 0 0 0 0.01 2451.78 0 0 0 1490.3 -596.561 610.141 452.513 0 -1066.7 1331.45 0 0 0 0 0 0 2175.89 -519.807 0 0 0 118.793 0 0 0 -1583.22 0 0 0 0 2464.45 392.85 0 0 0 0 0 0 0 0 0 0 0 0 -410.092 0 0 0 0 0 0 0 0 0 0 
0 0 0 -53.3311 -378.964 -808.206 0 265.74 2356.41 0 805.002 1923.2 1479.92 0.04 0 2248.38 0 0 0 0 0 0 -418.485 0 0 0 1798.68 -55.0096 0 1282.31 0 -1544.16 0 0 -14.8778 0 1809.21 0 0 0 1790.29 1177.94 0 -2100.05 0 0 0 0 0 1528.44 2278.28 0 0 -1281.4 0 0 0 0 0 0 -173.727 0 0 0 0 0 0 0 0 
0 0 1505.86 0 0 1473.97 1010.39 0 -223.624 0 0 0 0 0 0.02 -1638 0 0 0 1127.28 0 1498.54 2058.24 0 0 0 -545.289 0 0 0 0 0 0 1937.39 708.563 0 0 0 0 0 0 76.6778 0 0 -1221.58 0 0 0 0 0 0 0 0 0 0 0 0 0 0 -779.366 0 0 0 -413.297 0 0 0 0 0 
0 1229.67 0 0 0 0 0 -1323.97 0 0 0 0 0 -569.704 -75.457 0.04 0 0 0 0 0 1868.72 0 0 1058.31 0 0 852.153 0 -1642.74 0 0 0 0 0 0 0 0 2037.34 0 0 -2236.17 0 0 0 0 0 930.586 0 -763.649 0 0 0 2436.37 0 0 0 0 0 0 0 0 1377.07 0 0 0 0 0 0 
0 0 0 0 0 0 465.941 -451.903 0 0 0 0 0 0 0 0 0.05 0 0 -237.663 0 0 0 0 0 0 0 0 0 0 0 -478.759 0 0 1006.42 0 2212.97 -1349.3 0 1224.78 0 0 0 0 0 2164.91 0 0 0 0 0 0 1754.13 0 -905.713 0 0 0 0 0 1704.38 0 0 0 0 0 0 0 0 
0 0 0 1004.75 0 0 0 0 0 2259.97 0 0 -2309.26 0 0 0 0 0.07 0 0 1657.69 0 -935.163 0 876.415 0 1585.82 874.737 0 0 0 0 0 -339.595 -574.129 0 1053.73 0 1492.28 1762.37 490.509 1963.48 0 0 0 0 2463.38 -2473.14 2453.31 0 0 834.147 0 0 0 972.243 -521.638 0 0 0 0 0 0 0 0 0 0 0 0 
0 0 0 0 0 2212.52 0 0 -268.334 0 0 776.467 581.149 0 0 0 0 0 0.03 -413.297 0 0 1259.12 1876.2 0 0 0 1673.86 0 936.232 0 0 0 -44.4807 -2414.85 816.752 560.244 -2078.84 0 0 0 0 0 0 0 348.445 0 0 0 0 0 0 -1198.23 0 475.555 0 0 9.84222 0 0 -1080.28 0 0 0 0 2070.45 0 301.141 0 
0 1487.85 0 0 -729.774 0 0 -947.371 0 0 1190.15 -2335.96 949.66 0 1683.48 0 2352.44 0 1576.05 0.01 2286.98 0 0 0 0 0 0 0 -299.005 0 0 268.944 0 0 0 2149.04 0 0 0 0 0 0 0 0 0 0 0 0 0 0 0 0 0 0 0 295.038 -956.984 0 0 0 0 0 0 0 0 0 0 0 0 
0 0 0 0 0 0 0 0 0 0 0 -2018.11 211.57 0 0 0 0 293.97 0 -1330.99 0.08 0 665.38 1876.81 0 0 0 0 0 0 0 0 0 0 0 0 0 0 0 0 0 0 0 0 0 0 0 0 0 0 0 0 0 0 927.229 0 0 0 0 0 0 0 0 -129.933 0 0 1319.09 0 0 
737.251 2103.87 1474.43 0 0 0 0 0 0 1916.03 0 0 0 0 1194.11 -383.847 0 0 0 0 0 0 1867.2 0 0 0 0 1197.16 0 0 0 0 0 0 -1176.26 0 795.846 2117.45 0 0 0 0 1693.85 0 0 0 0 0 284.356 0 0 0 -2408.29 0 0 -2460.48 0 -1884.9 0 0 0 0 0 0 0 644.475 0 0 0 
0 0 0 917.158 0 0 0 0 0 -1371.43 454.955 0 2342.83 -1631.9 -1764.2 0 0 590.152 1089.89 0 -891.675 -987.808 0.05 92.0896 0 2357.63 0 0 0 -1220.36 0 -1442.53 1213.34 892.59 -837.046 0 2352.9 0 0 0 0 0 0 0 0 0 2161.55 0 0 0 0 0 0 1327.94 0 0 0 0 0 0 0 0 0 0 0 0 0 1556.83 0 
0 -1229.36 1481.14 0 0 0 0 0 0 0 0 0 943.556 0 0 0 0 0 1778.39 0 848.033 0 2075.03 0.08 0 0 0 1075.24 0 0 2471.16 -580.538 971.938 0 0 0 0 1853.47 0 -1893.6 -2099.29 0 0 0 0 0 0 0 0 0 0 0 190.054 0 0 0 -808.664 1361.96 0 0 1207.85 -342.952 0 0 0 0 0 0 1645.48 
0 705.206 0 0 0 0 0 0 0 0 0 -328.15 0 0 0 1080.43 0 -525.452 0 0 0 0 0 0 0.07 0 0 2223.96 0 0 -1874.37 -1319.85 1542.02 0 0 0 0 0 0 0 -378.506 1995.68 0 0 0 0 0 0 0 0 0 0 0 0 0 0 0 0 0 0 0 0 0 0 0 0 0 0 0 
-2138.36 0 712.073 0 1676.92 1515.47 0 0 0 0 0 0 0 0 0 0 0 0 0 0 0 0 -938.368 0 0 0.09 0 0 2118.37 0 0 -825.449 0 0 0 1105.3 0 0 0 1345.79 0 0 0 0 0 0 711.463 -2272.03 0 0 0 0 0 0 0 0 0 0 0 0 0 0 0 0 81.2555 0 0 0 0 
-49.3637 0 0 0 0 0 0 1074.48 0 -2262.72 0 0 0 1191.06 1892.99 0 0 -2246.39 0 0 0 0 0 0 0 0 0.01 1994 -582.369 0 1347.16 -1390.65 0 1599.25 0 0 0 0 0 0 0 0 0 0 0 0 0 0 0 -543.458 2488.71 0 0 0 0 0.686666 0 0 0 0 0 0 0 0 0 0 0 0 0 
1571.17 0 0 1907.18 1344.11 0 0 0 0 71.1844 0 0 0 -374.844 0 -347.682 0 -1504.33 -1410.34 0 0 -1246.15 0 849.712 -2459.56 0 -416.654 0.07 0 0 0 0 0 0 588.015 0 -1090.96 0 0 0 2203.67 0 0 1048.23 0 0 0 0 0 0 0 0 0 0 -772.5 0 0 1424.53 0 0 0 0 0 0 0 0 0 0 0 
0 0 0 -1809.82 0 419.095 0 0 0 1583.99 0 0 0 0 0 0 0 0 0 1890.85 0 0 0 0 0 -1432.16 538.27 0 0.08 0 0 0 550.63 0 0 0 0 690.863 0 1256.68 1887.34 2382.81 0 0 0 0 0 0 0 -239.036 0 0 0 0 0 0 0 0 0 0 0 0 0 472.655 0 0 0 0 0 
0 1160.7 0 0 0 0 1955.7 0 0 775.246 815.378 0 0 2334.28 0 61.7237 0 0 2106.92 0 0 0 433.287 0 0 0 0 0 0 0.07 -621.281 -782.418 0 0 0 0 0 0 215.232 2214.5 0 0 0 -1598.33 0 0 0 0 0 0 0 0 1944.56 1412.32 0 2306.05 0 0 0 0 0 0 0 0 0 0 0 0 0 
0 0 -1686.53 0 1549.81 0 0 0 2073.2 0 0 0 -625.858 0 0 0 0 0 0 0 0 0 0 613.041 976.516 0 1288.87 0 0 1337.09 0.01 -191.122 0 -321.436 0 0 1872.23 0 0 0 0 0 0 0 0 1822.64 0 547.884 0 0 0 0 0 0 0 0 0 0 0 0 0 0 0 0 0 0 0 -347.53 0 
0 0 0 0 637.303 0 0 0 0 889.386 1887.34 0 -1157.95 667.516 0 0 807.749 0 0 -451.75 0 0 1287.5 1315.73 -1442.08 351.039 -278.71 0 0 -535.676 -1059.37 0.03 0 0 0 1380.12 0 0 0 0 1171.22 0 0 0 0 0 0 0 -1012.38 0 0 1444.21 0 0 0 0 795.999 0 0 0 0 0 735.572 0 0 0 0 0 0 
0 0 0 2352.14 -307.092 0 0 0 0 0 0 0 0 0 0 0 0 0 0 0 0 0 -542.848 24.3385 2149.49 0 0 0 1334.5 0 0 0 0.09 2367.4 1119.95 0 0 0 0 0 0 0 0 2128.74 0 0 0 0 0 0 -2268.82 0 0 0 0 1188.16 0 0 0 -1556.06 0 0 -2403.56 -2126.91 0 0 -1544.01 0 0 
0 0 0 0 0 0 0 0 0 0 0 -1041.22 0 0 -456.481 0 0 1900.31 -410.092 0 0 0 669.805 0 0 0 -31.9681 0 0 0 -1576.05 0 308.618 0.08 0 1171.07 0 0 0 -323.573 0 472.808 0 0 0 0 0 0 0 0 0 0 0 0 0 0 0 0 0 0 0 -153.127 0 0 0 0 0 0 0 
0 0 0 0 0 0 0 0 0 2091.2 0 0 0 -1768.47 1717.51 0 1242.64 -1990.04 1003.07 0 0 2415.46 -1879.56 0 0 0 0 -60.5029 0 0 0 0 -296.106 0 0.04 0 0 0 0 0 0 0 2181.23 0 0 0 0 2214.19 0 0 0 0 -2156.06 0 0 0 0 0 0 0 0 0 0 0 0 0 0 0 0 
-83.8496 0 970.26 0 0 0 -543.611 0 0 0 1671.12 0 1417.51 0 0 0 0 0 546.358 -284.356 0 0 0 0 0 -1323.05 0 0 0 0 0 -1782.05 0 1983.78 0 0.09 0 0 1433.99 0 0 0 2195.43 0 0 0 0 0 1415.37 0 0 0 0 0 0 0 0 0 0 0 0 0 0 0 0 -1721.47 0 0 0 
0 0 0 0 2447.2 0 0 953.627 1906.11 0 -130.696 0 0 906.476 0 0 -2484.44 535.371 681.097 0 0 -65.2333 88.8852 0 0 0 0 -1332.06 0 0 1284.6 0 0 0 0 0 0.01 0 0 0 0 0 1391.42 0 0 0 0 0 -2404.63 0 1467.25 0 0 0 0 0 0 0 2103.26 0 0 0 0 -572.909 0 0 0 0 1548.43 
0 0 -1460.39 0 0 0 1863.84 0 0 0 932.722 1585.97 0 0 0 0 662.786 0 -1395.69 0 0 1428.5 0 -571.23 0 0 0 0 1595.89 0 0 0 0 0 0 0 0 0.02 0 0 0 1708.2 0 -934.858 0 0 2324.98 0 0 0 0 0 0 0 0 0 0 -1839.58 0 0 0 0 0 0 0 0 0 0 0 
0 0 0 2220.45 0 2284.54 0 0 0 0 0 0 0 0 0 1713.84 0 1404.54 0 0 0 0 0 0 0 0 0 0 0 -429.167 0 0 0 0 0 -1808.45 0 0 0.05 1293.76 0 0 0 1315.88 2048.78 0 0 0 0 0 0 0 0 1051.74 0 0 0 0 0 0 0 0 0 0 0 0 0 0 0 
0 0 0 0 0 0 -975.753 514.161 0 0 -2438.51 0 -913.495 0 0 0 1650.98 866.344 0 0 0 0 0 -686.285 0 346.461 0 0 -2319.64 1574.07 0 0 0 644.475 0 0 0 0 2427.82 0.04 -1041.22 0 0 0 1721.78 0 0 0 0 0 2331.39 0 0 0 2463.53 0 0 0 0 0 0 0 0 0 0 0 0 0 0 
0 -1161.76 2191.61 0 0 0 0 1413.69 0 0 0 0 0 2423.86 0 0 0 2129.81 0 0 0 0 0 2401.43 2126 0 0 -963.393 316.858 0 0 1649.3 0 0 0 0 0 0 0 1869.33 0.08 469.451 0 -678.961 0 0 0 0 0 0 0 0 0 0 1683.17 0 0 -2421.57 0 0 0 0 0 0 0 0 0 0 0 
0 0 0 98.0407 0 0 -1138.57 0 -933.638 776.772 0 889.538 0 2370.75 1254.54 541.322 0 1532.26 0 0 0 0 0 0 550.783 0 0 0 1058.15 0 0 0 0 -254.753 0 0 0 15.3356 0 0 1253.01 0.05 0 0 0 0 0 0 0 0 0 0 0 0 0 0 0 894.726 0 0 -1271.32 0 -1267.05 0 0 0 0 0 0 
0 0 0 0 0 0 0 0 0 0 0 0 0 0 0 0 0 0 0 0 0 2006.67 0 0 0 0 0 0 0 0 0 0 0 0 -1149.86 711.463 330.134 0 0 0 0 0 0.05 0 0 1610.23 0 0 0 0 0 0 0 0 0 0 0 0 -1232.72 0 2314.6 0 0 0 0 0 0 0 0 
0 0 0 0 0 0 0 0 0 0 0 0 0 -585.421 0 0 0 0 0 0 0 0 0 0 0 0 0 -339.9 0 1126.82 0 0 -635.777 0 0 0 0 1481.44 1476.71 0 -582.675 0 0 0.06 0 0 0 0 0 0 48.9059 0 0 0 0 0 0 0 0 0 0 0 0 0 0 0 0 0 0 
1443.91 0 0 0 0 0 0 0 0 -1723.3 0 0 1051.29 0 2410.43 0 0 0 0 0 0 0 0 0 0 0 0 0 0 0 0 0 0 0 0 0 0 0 68.2852 1491.06 0 0 0 0 0.03 0 0 0 0 0 0 0 0 1246.91 0 0 0 2079.76 -1097.83 -1004.59 0 -1196.4 0 1978.59 0 0 0 -794.778 1569.64 
0 0 0 0 0 2278.44 0 0 0 0 793.863 -1924.88 -345.698 0 0 0 -620.823 0 2112.26 0 0 0 0 0 0 0 0 0 0 0 -764.565 0 0 0 0 0 0 0 0 0 0 0 750.526 0 0 0 0 0 0 0 0 0 0 0 0 0 0 0 412.229 0 0 0 0 0 0 0 0 0 0 
0 0 0 0 0 0 -140.309 0 0 0 0 0 0 0 0 0 0 -1049.91 0 0 0 0 2157.28 0 0 -657.14 0 0 0 0 0 0 0 0 0 0 0 2367.09 0 0 0 0 0 0 0 0 0.08 0 0 0 0 0 0 0 0 0 0 0 0 0 0 0 0 0 0 0 0 0 0 
0 0 0 0 0 1795.18 0 0 0 0 0 0 0 0 0 2491.76 0 1912.67 0 0 0 0 0 0 0 1695.07 0 0 0 0 1091.42 0 0 0 1712.16 0 0 0 0 0 0 0 0 0 0 0 0 0.04 0 0 0 291.681 0 0 0 1729.1 0 0 0 0 0 -668.126 0 0 2439.73 0 0 0 0 
0 0 0 0 0 0 0 0 0 0 -2422.33 0 0 0 0 0 0 2277.98 0 0 0 -2324.82 0 0 0 0 0 0 0 0 0 2361.6 0 0 0 1559.88 -973.769 0 0 0 0 0 0 0 0 0 0 0 0.01 0 0 0 0 0 40.8185 0 0 0 0 0 0 -1916.79 0 0 0 0 0 0 0 
0 0 0 0 0 0 0 1551.33 0 0 0 0 0 252.617 0 -2419.74 0 0 0 0 0 0 0 0 0 0 1927.47 0 -1813.33 0 0 0 0 0 0 0 0 0 0 0 0 0 0 0 0 0 0 0 0 0.05 0 2281.33 0 0 0 0 0 1075.09 0 0 0 0 0 2323.6 0 0 0 0 0 
0 0 0 0 0 0 530.335 -1723.91 0 0 0 0 0 2112.57 0 0 0 0 0 0 0 0 0 0 0 0 -1163.9 0 0 0 0 0 -518.891 0 0 0 1183.43 0 0 2446.75 0 0 0 2449.03 0 0 0 0 0 0 0.02 0 0 -46.4644 338.832 0 0 0 -2356.26 0 0 0 0 -866.649 -1065.17 0 451.598 0 -1123.46 
0 0 0 0 0 0 0 0 0 0 0 1435.82 0 0 0 0 0 -882.824 0 0 0 0 0 0 0 0 0 0 0 0 0 2013.08 0 0 0 0 0 0 0 0 0 0 0 0 0 0 0 1525.39 0 348.14 0 0.09 -2229.3 0 0 0 0 0 0 0 0 0 0 0 0 0 0 0 0 
0 0 0 0 0 0 0 0 0 0 0 0 0 0 0 0 1414.61 0 2440.95 0 0 -2165.21 0 601.138 0 0 0 0 0 927.229 0 0 0 0 -922.193 0 0 0 0 0 0 0 0 0 0 0 0 0 0 0 0 -903.882 0.05 0 0 0 0 0 0 -663.854 0 239.189 0 0 0 0 0 0 0 
0 -72.8629 0 0 1887.65 0 0 0 0 0 0 0 0 -105.823 0 -1598.48 0 0 0 0 0 0 1813.33 0 0 0 0 0 0 2.36518 0 0 0 0 0 0 0 0 1648.84 0 0 0 0 0 -1055.56 0 0 0 0 0 1351.13 0 0 0.03 0 0 0 0 0 0 0 0 0 0 1558.96 0 0 0 0 
0 0 0 0 0 0 0 0 0 0 0 0 0 0 0 0 60.1978 0 2342.52 0 1426.97 0 0 0 0 0 0 1780.53 0 0 0 0 0 0 0 0 0 0 0 -2012.77 -255.516 0 0 0 0 0 0 0 2440.95 0 -1768.78 0 0 0 0.07 0 0 0 0 0 0 0 1943.04 0 0 0 0 0 0 
0 0 -1078.3 0 0 0 0 561.464 0 0 0 0 0 0 0 0 0 -1857.28 0 -252.007 0 2277.52 0 0 0 0 1749.09 0 0 697.119 0 0 1730.02 0 0 0 0 0 0 0 0 0 0 0 0 0 0 1896.65 0 0 0 0 0 0 0 0.01 0 0 0 0 0 0 0 0 0 0 0 0 0 
0 0 0 -239.189 451.14 0 0 0 0 0 0 0 0 0 0 0 0 1102.25 0 948.592 0 0 0 911.054 0 0 0 0 0 0 0 638.066 0 0 0 0 0 0 0 0 0 0 0 0 0 0 0 0 0 0 0 0 0 0 0 0 0.08 -1242.03 -2256.61 657.903 0 0 0 0 0 0 0 0 0 
0 0 0 0 0 0 0 0 0 0 0 0 0 0 0 0 0 0 1026.72 0 0 916.852 0 918.989 0 0 0 184.866 0 0 0 0 0 0 0 0 0 2483.52 0 0 1907.94 905.713 0 0 -713.294 0 0 0 0 53.3311 0 0 0 0 0 0 2422.18 0.07 0 0 0 0 0 0 1542.79 0 0 0 0 
0 0 -782.266 2148.88 0 0 0 0 0 0 0 0 2278.89 0 0 0 0 0 0 0 0 0 0 0 0 0 0 0 0 0 0 0 0 0 0 0 -2227.77 0 0 0 0 0 1867.5 0 2122.64 -1607.18 0 0 0 0 722.297 0 0 0 0 0 -2039.48 0 0.04 0 0 0 0 0 0 -2255.55 0 0 0 
0 -1030.99 0 0 0 0 0 0 0 0 0 0 0 0 2416.68 0 0 0 0 0 0 0 0 0 0 0 0 0 0 0 0 0 1392.18 0 0 0 0 0 0 0 0 0 0 0 -1764.05 0 0 0 0 0 0 0 58.6718 0 0 0 -548.952 0 0 0.04 2276.15 0 0 0 0 -1566.44 -298.547 0 0 
0 0 0 0 0 0 2207.79 0 0 0 0 0 0 1641.21 0 0 -1289.79 0 2244.25 0 0 0 0 1452.76 0 0 0 0 0 0 0 0 0 0 0 0 0 0 0 0 0 2370.3 -747.169 0 0 0 0 0 0 0 0 0 0 0 0 0 0 0 0 -869.701 0.02 0 0 0 0 0 0 0 0 
0 0 0 1463.13 2486.27 -1472.9 0 0 0 0 0 0 0 0 0 0 0 0 0 0 0 0 0 -486.847 0 0 0 0 0 0 0 0 0 1519.75 0 0 0 0 0 0 0 0 0 0 919.141 0 0 -1564 52.4155 0 0 0 218.436 0 0 0 0 0 0 0 0 0.07 0 0 0 0 0 0 0 
0 0 -1980.27 0 0 1372.34 0 73.6259 0 -2121.27 0 2115.62 0 0 0 1930.83 0 0 0 0 0 0 0 0 0 0 0 0 0 0 0 -756.783 441.069 0 0 0 0 0 0 0 0 -380.795 0 0 0 0 0 0 0 0 0 0 0 0 -605.106 0 0 0 0 0 0 0 0.08 0 0 -280.389 0 1739.48 893.506 
0 0 0 0 0 0 0 0 0 0 0 0 0 0 2492.07 0 0 0 0 0 1531.95 0 0 0 0 0 0 0 -382.626 0 0 0 -557.039 0 0 0 -251.701 0 0 0 0 0 0 0 341.426 0 0 0 0 -1383.48 -428.556 0 0 0 0 0 0 0 0 0 0 0 0 0.03 0 0 150.38 0 0 
1449.4 0 0 0 0 0 0 -2405.85 1630.99 0 0 0 0 0 0 0 0 0 0 0 0 0 0 0 0 818.735 0 0 0 0 0 0 0 0 0 0 0 0 0 0 0 0 0 0 0 0 0 618.229 0 0 -2104.63 0 0 1979.66 0 0 0 -2012.92 0 0 0 0 0 0 0.07 0 0 0 0 
0 0 0 0 0 0 0 0 0 0 0 -534.455 0 0 0 0 0 0 787.759 0 0 -923.719 0 0 0 0 0 0 0 0 0 0 0 0 0 200.125 0 0 0 0 0 0 0 0 0 0 0 0 0 0 0 0 0 0 0 0 0 0 1593.75 -1755.5 0 0 1332.67 0 0 0.04 0 0 0 
0 -816.599 0 0 1506.62 0 0 1054.95 0 0 0 0 0 0 0 0 0 0 0 0 380.032 0 0 0 0 0 0 0 0 0 0 0 1863.54 0 0 0 0 0 0 0 0 0 0 0 0 0 0 0 0 0 -954.543 0 0 0 0 0 0 0 0 77.2881 0 0 0 1152.15 0 0 0.09 0 0 
0 0 -2466.89 0 0 0 0 1763.89 0 0 0 0 0 0 0 0 0 0 1784.34 0 0 0 -1044.57 0 0 0 0 0 0 0 2385.1 0 0 0 0 0 0 0 0 0 0 0 0 0 2072.74 0 0 0 0 0 0 0 0 0 0 0 0 0 0 0 0 0 2030.47 0 0 0 0 0.01 0 
0 2072.44 0 0 0 0 0 0 0 0 0 0 0 0 0 0 0 0 0 0 0 0 0 839.641 0 0 0 0 0 0 0 0 0 0 0 0 -31.663 0 0 0 0 0 0 0 1079.36 0 0 0 0 0 2397.76 0 0 0 0 0 0 0 0 0 0 0 2385.1 0 0 0 0 0 0.03 
