*Vertices 57
*Matrix 
0.03 0 0 0 0 0 0 0 0 0 1176.11 0 -2451.93 0 0 0 0 0 0 0 0 0 0 1764.5 0 2323.15 0 0 2066.03 0 0 0 0 0 0 0 0 0 0 0 0 0 0 0 0 0 0 0 0 -838.572 0 0 0 0 0 0 0 
0 0 0 0 0 0 0 0 0 1766.95 0 63.097 0 0 0 0 0 0 0 0 0 0 625.248 0 0 0 0 0 0 0 0 0 0 0 0 -1403.93 0 0 0 0 0 0 0 845.897 0 0 0 0 -452.361 0 0 0 0 0 1247.83 0 0 
0 0 0.04 0 0 0 0 1250.88 0 0 0 0 2138.66 0 0 0 0 0 0 -2129.51 0 0 1763.13 0 1423 0 0 0 0 0 0 0 0 0 -501.801 0 0 0 0 0 0 2457.73 0 0 0 0 0 0 0 0 0 0 0 0 0 0 0 
0 0 0 0.05 640.812 0 1400.27 0 0 0 0 0 0 0 0 0 0 0 0 0 0 0 0 0 2153.46 0 0 0 0 2183.98 0 1696.45 0 0 0 0 0 1769.08 0 0 2234.18 0 0 0 0 0 0 0 0 -653.935 0 0 0 1374.02 0 0 0 
0 0 0 2447.51 0.03 0 0 0 0 0 0 0 0 0 0 0 -17.3193 0 -1449.4 0 0 0 0 0 422.605 0 0 0 0 0 0 0 0 0 0 0 0 0 0 0 0 0 0 0 0 0 0 0 0 0 0 0 2421.72 0 0 0 0 
0 0 0 0 0 0.07 0 0 0 36.2407 0 0 0 0 0 0 0 0 0 0 0 0 0 0 0 0 0 0 0 0 0 0 0 0 0 0 0 0 0 0 0 0 -707.648 0 0 2153.61 0 0 0 0 0 0 0 0 0 0 0 
0 0 0 -2309.56 0 0 0 1785.41 0 2448.58 0 0 0 0 2292.02 0 -1744.36 0 0 0 0 0 0 0 0 0 0 0 0 0 0 0 0 0 0 0 0 0 705.969 0 0 0 713.294 0 0 0 0 0 0 0 0 1017.87 -1227.68 0 0 0 0 
0 0 -64.1652 0 0 0 1156.73 0.03 0 0 0 -1491.82 0 0 0 -2343.75 0 0 0 -740.76 0 0 2144.61 0 1706.82 0 0 0 0 0 768.99 0 0 0 0 0 -2109.82 0 1844.77 0 0 0 2239.98 0 0 0 920.667 0 0 0 0 758.309 0 0 0 0 0 
0 0 0 0 0 0 0 0 0 0 0 0 0 0 -892.438 -1131.7 0 0 0 0 0 0 0 0 0 0 0 0 -13.9622 0 0 0 0 0 0 0 0 1842.78 0 0 0 0 0 0 0 0 0 0 0 0 0 0 0 0 0 0 0 
0 -1174.73 0 0 0 2446.13 1663.79 0 0 0.02 0 0 0 0 0 0 348.445 0 0 0 0 -962.63 0 -1131.86 0 -2136.22 0 0 0 0 0 0 313.349 0 0 0 -188.07 0 2491 0 0 0 0 0 0 2106.62 0 548.799 2075.95 0 0 0 1613.59 0 0 0 0 
372.402 0 0 0 0 0 0 0 0 0 0.05 0 0 0 0 0 0 0 1176.87 0 0 0 0 0 0 0 2125.54 0 1641.82 0 0 0 0 0 1981.19 0 0 0 0 0 0 0 0 0 0 0 0 0 0 0 0 0 0 0 0 0 -2492.83 
0 -765.481 0 0 0 0 0 939.131 0 0 0 0.04 0 1516.08 0 0 0 591.678 0 0 0 0 0 0 0 0 0 0 0 0 0 0 0 0 0 0 0 0 0 0 0 0 0 0 0 0 1947.77 0 0 0 -523.927 0 0 0 0 0 0 
-2486.27 0 -726.722 0 0 0 0 0 0 0 0 0 0.05 0 0 0 0 0 2159.87 1787.39 0 0 0 0 0 0 0 -96.9726 0 0 0 0 0 0 0 1798.68 0 0 0 0 0 0 0 0 0 -1183.89 0 0 0 0 1699.65 0 0 2172.69 0 0 0 
0 0 0 0 0 0 0 0 0 0 0 917.768 0 0.07 0 0 0 0 0 1900.46 1022.6 0 0 0 0 0 0 0 0 -114.216 0 0 0 0 0 0 0 0 -2050.61 0 0 0 0 0 0 0 0 0 0 0 0 0 0 0 0 0 0 
0 0 0 0 0 0 1554.84 0 -243.156 0 0 0 0 0 0.06 2223.96 0 0 0 0 0 -918.836 0 0 0 0 0 0 0 0 0 0 0 0 0 0 0 0 0 0 0 0 0 0 0 0 0 -1119.34 0 1700.42 0 0 0 0 0 0 0 
0 0 0 0 0 0 0 1019.85 2478.94 0 0 0 0 0 635.319 0.09 0 0 0 0 -1205.25 0 0 1258.51 0 0 0 0 -350.429 0 0 1233.94 0 0 -170.98 0 0 0 0 0 0 0 0 0 0 0 0 0 0 0 0 -1084.25 0 0 0 0 0 
0 0 0 0 -1448.79 0 1616.95 0 0 1356.01 0 0 0 0 0 0 0.03 0 0 -993.759 0 0 0 0 0 0 0 0 0 1011 0 0 0 0 0 0 -2207.17 2207.79 0 1207.39 0 1184.19 -709.784 0 0 0 0 0 0 0 1239.74 0 0 0 0 0 0 
0 0 0 0 0 0 0 0 0 0 0 2001.48 0 0 0 0 0 0 0 0 0 -2286.22 0 0 0 0 0 0 0 879.315 0 0 0 0 0 0 -2335.81 0 0 0 2308.8 0 0 0 -1127.43 -102.924 0 0 0 1902.3 0 0 0 0 0 0 0 
0 0 0 0 652.257 0 0 0 0 0 -2420.35 0 1860.18 0 0 0 0 0 0.08 0 0 0 0 0 0 0 0 0 0 0 0 0 0 1943.65 1740.7 0 0 0 0 0 0 0 0 -976.821 0 0 0 0 0 0 0 0 0 0 0 0 0 
0 0 -975.6 0 0 0 0 -1136.59 0 0 0 0 -7.55333 169.454 0 0 434.507 0 0 0.01 1462.83 0 0 0 0 0 0 2306.67 855.052 0 0 0 649.358 0 0 0 -1592.23 0 0 0 2461.24 0 0 0 0 0 0 0 0 0 0 2124.01 0 -394.986 0 0 0 
0 0 0 0 0 0 0 0 0 0 0 0 0 -974.38 0 1238.98 0 0 0 753.426 0.04 0 0 0 1242.18 0 -1959.82 0 0 0 0 0 0 0 311.823 0 -688.421 1582.92 0 0 0 0 0 0 0 0 -1076.92 0 0 56.5355 -435.118 0 0 0 0 0 0 
0 0 0 0 0 0 0 0 0 1215.17 0 0 0 0 2327.88 0 0 -2419.28 0 0 0 0.04 2089.68 0 0 0 567.568 0 0 600.986 -228.202 0 0 0 0 0 0 0 0 0 0 0 0 0 0 0 0 0 0 0 0 0 0 0 0 0 0 
0 2028.95 1807.23 0 0 0 0 1562.78 0 0 0 0 0 0 0 0 0 0 0 0 0 2190.24 0.09 0 787.301 -2491 0 -19.1504 0 0 0 1740.7 221.03 0 0 0 0 0 0 -1260.49 0 2489.78 0 -1470.92 0 0 0 0 0 0 0 0 0 0 0 0 0 
1823.71 0 0 0 0 0 0 0 0 -848.643 0 0 0 0 0 2283.01 0 0 0 0 0 0 0 0.05 0 0 0 2094.87 0 0 0 0 0 1842.02 0 -226.218 0 0 0 0 0 0 -1190.6 0 -1649.6 0 1984.54 0 0 0 0 0 0 0 0 0 0 
0 0 -1837.9 358.974 519.044 0 0 -641.423 0 0 0 0 0 0 0 0 0 0 0 0 191.275 0 1856.97 0 0 0 0 0 0 0 0 0 0 0 0 1435.21 0 0 0 0 1586.43 0 0 0 0 2299.65 0 0 0 0 0 0 0 712.378 0 -1606.72 0 
-1305.05 0 0 0 0 0 0 0 0 1369.59 0 0 0 0 0 0 0 0 0 0 0 0 999.252 0 0 0 0 0 0 0 0 0 0 0 0 0 0 0 0 0 0 0 0 0 523.774 0 0 0 2156.67 0 0 0 0 -324.793 0 0 0 
0 0 0 0 0 0 0 0 0 0 577.334 0 0 0 0 0 0 0 0 0 1650.67 -292.901 0 0 0 0 0.04 -450.224 1644.41 -1743.75 0 0 0 0 0 0 0 0 0 0 1370.51 0 0 0 0 0 0 0 0 0 0 0 0 0 0 0 0 
0 0 0 0 0 0 0 0 0 0 0 0 -1446.96 0 0 0 0 0 0 1836.53 0 0 855.51 706.58 0 0 -119.251 0.04 0 0 0 0 0 0 0 0 904.797 -437.254 0 0 0 0 0 0 0 0 0 0 0 0 0 2439.12 0 0 0 0 0 
1952.8 0 0 0 0 0 0 0 220.42 0 -270.318 0 0 0 0 -1668.07 0 0 0 -296.258 0 0 0 0 0 0 489.746 0 0 0 0 0 0 91.3266 0 2069.84 0 0 0 0 0 0 0 0 0 0 0 1689.12 0 0 0 0 0 0 0 0 0 
0 0 0 -1104.39 0 0 0 0 0 0 0 0 0 2090.75 0 0 -136.189 88.2748 0 0 0 -1441.92 0 0 0 0 2047.41 0 0 0.05 0 0 0 0 2214.19 -1270.71 1723.15 0 -1063.49 0 188.681 0 11.5207 0 -2058.7 0 0 0 0 0 0 0 0 0 2137.44 0 0 
0 0 0 0 0 0 0 1828.44 0 0 0 0 0 0 0 0 0 0 0 0 0 2391.96 0 0 0 0 0 0 0 0 0.07 0 0 0 1956.01 0 0 -1893.14 2255.39 0 0 -1491.97 0 0 0 0 -232.78 0 0 0 1053.88 1665.32 0 0 0 0 0 
0 0 0 -715.278 0 0 0 0 0 0 0 0 0 0 0 1132.92 0 0 0 0 0 0 2039.02 0 0 0 0 0 0 0 0 0.02 0 0 0 0 0 0 0 0 -746.406 0 0 0 0 1578.49 1473.2 0 0 0 0 0 1021.23 0 0 0 0 
0 0 0 0 0 0 0 0 0 1041.22 0 0 0 0 0 0 0 0 0 1406.06 0 0 604.19 0 0 0 0 0 0 0 0 0 0.06 0 0 0 -749.611 0 0 2431.64 0 0 0 184.713 0 0 -2138.97 0 0 0 0 0 0 0 0 0 0 
0 0 0 0 0 0 0 0 0 0 0 0 0 0 0 0 0 0 -944.472 0 0 0 0 1760.84 0 0 0 0 -731.758 0 0 0 0 0.04 0 0 0 0 0 0 0 0 0 0 0 0 0 0 0 0 0 0 655.919 0 0 0 0 
0 0 1107.75 0 0 0 0 0 0 0 448.088 0 0 0 0 2129.66 0 0 -1379.82 0 1551.03 0 0 0 0 0 0 0 0 -175.405 838.267 0 0 0 0.03 -489.898 0 0 -1774.58 0 0 0 612.583 0 0 0 1668.83 0 0 0 0 0 0 -708.258 0 0 0 
0 -528.047 0 0 0 0 0 0 0 0 0 0 767.006 0 0 0 0 0 0 0 0 0 0 1623.81 1219.29 0 0 0 2042.53 2394.1 0 0 0 0 1401.64 0.05 0 0 0 0 0 0 0 0 0 0 0 0 -792.032 1658.45 0 0 0 0 0 0 0 
0 0 0 0 0 0 0 1637.85 0 -514.161 0 0 0 0 0 0 1069.6 868.786 0 803.934 -1893.14 0 0 0 0 0 0 1193.5 0 1851.79 0 0 -1738.56 0 0 0 0.09 0 0 0 0 0 0 592.746 0 0 0 0 0 0 0 0 0 0 0 0 0 
0 0 0 974.837 0 0 0 0 1259.58 0 0 0 0 0 0 0 705.206 0 0 0 2066.18 0 0 0 0 0 0 -763.649 0 0 -1183.13 0 0 0 0 0 0 0.07 0 0 0 0 487.457 0 0 0 0 0 0 0 0 0 -879.772 0 0 0 0 
0 0 0 0 0 0 554.903 2214.19 0 1558.2 0 0 0 1828.14 0 0 0 0 0 0 0 0 0 0 0 0 0 0 0 -1498.84 -1582.16 0 0 0 -614.261 0 0 0 0.02 0 0 0 499.664 0 0 0 0 0 0 0 880.078 0 0 0 0 0 0 
0 0 0 0 0 0 0 0 0 0 0 0 0 0 0 0 -966.903 0 0 0 0 0 1820.66 0 0 0 0 0 0 0 0 0 1901.23 0 0 0 0 0 0 0.02 0 0 0 0 0 0 0 0 0 0 0 0 0 0 0 0 0 
0 0 0 -520.875 0 0 0 0 0 0 0 0 0 0 0 0 0 1298.03 0 -134.053 0 0 0 0 1063.04 0 1457.49 0 0 -681.555 0 1478.7 0 0 0 0 0 0 0 0 0.05 0 0 1699.8 0 0 0 0 0 0 0 0 0 0 0 0 0 
0 0 -1212.58 0 0 0 0 0 0 0 0 0 0 0 0 0 1545.08 0 0 0 0 0 2251.88 0 0 0 0 0 0 0 1230.89 0 0 0 0 0 0 0 0 0 0 0.07 0 0 0 0 0 0 0 0 0 2039.93 0 0 0 0 0 
0 0 0 0 0 557.039 633.946 1531.65 0 0 0 0 0 0 0 0 467.467 0 0 0 0 0 0 1683.94 0 0 0 0 0 2392.57 0 0 0 0 1157.64 0 0 -1165.27 2014.6 0 0 0 0.03 0 0 0 49.6689 0 0 -1982.71 0 0 0 0 0 0 0 
0 -2127.06 0 0 0 0 0 0 0 0 0 0 0 0 0 0 0 0 1011 0 0 0 1509.67 0 0 0 0 0 0 0 0 0 709.632 0 0 0 507.141 0 0 0 517.518 0 0 0.07 0 0 0 0 0 0 0 1619.08 0 0 0 0 0 
0 0 0 0 0 0 0 0 0 0 0 0 0 0 0 0 0 2172.84 0 0 0 0 0 210.196 0 -1708.35 0 0 0 754.341 0 0 0 0 0 0 0 0 0 0 0 0 0 0 0.05 0 0 0 0 0 0 0 0 0 0 0 0 
0 0 0 0 0 298.547 0 0 0 2368.01 0 0 -1864.76 0 0 0 0 -388.272 0 0 0 0 0 0 708.869 0 0 0 0 0 0 1549.04 0 0 0 0 0 0 0 0 0 0 0 0 0 0.07 0 0 0 0 2192.37 0 0 0 0 0 0 
0 0 0 0 0 0 0 -1761.3 0 0 0 -2194.81 0 0 0 0 0 0 0 0 1303.22 0 0 -471.587 0 0 0 0 0 0 2308.34 102.466 1950.21 0 1611.76 0 0 0 0 0 0 0 -1188.01 0 0 0 0.02 0 668.432 0 0 0 0 0 0 0 0 
0 0 0 0 0 0 0 0 0 -634.709 0 0 0 0 916.852 0 0 0 0 0 0 0 0 0 0 0 0 0 869.243 0 0 0 0 0 0 0 0 0 0 0 0 0 0 0 0 0 0 0.04 0 0 928.449 0 253.685 0 0 0 0 
0 -2449.64 0 0 0 0 0 0 0 -216.605 0 0 0 0 0 0 0 0 0 0 0 0 0 0 0 67.6748 0 0 0 0 0 0 0 0 0 667.821 0 0 0 0 0 0 0 0 0 0 2201.53 0 0.08 0 1348.99 0 -1251.64 1645.33 0 0 0 
1100.57 0 0 -1125.75 0 0 0 0 0 0 0 0 0 0 2034.75 0 0 2273.09 0 0 -1270.26 0 0 0 0 0 0 0 0 0 0 0 0 0 0 -149.77 0 0 0 0 0 0 -1504.94 0 0 0 0 0 0 0.06 -476.318 0 0 0 0 0 0 
0 0 0 0 0 0 0 0 0 0 0 -1251.49 2456.66 0 0 0 1374.63 0 0 0 46.0067 0 0 0 0 0 0 0 0 0 1338.77 0 0 0 0 0 0 0 2291.86 0 0 0 0 0 0 -1962.26 0 -690.71 -2337.03 -722.602 0.06 0 1099.2 0 0 0 0 
0 0 0 0 0 0 1059.07 1011.46 0 0 0 0 0 0 0 669.805 0 0 0 -2004.53 0 0 0 0 0 0 0 2127.37 0 0 1746.96 0 0 0 0 0 0 0 0 0 0 1912.21 0 1599.55 0 0 0 0 0 0 0 0.08 0 0 0 0 0 
0 0 0 0 14.8778 0 1449.86 0 0 751.137 0 0 0 0 0 0 0 0 0 0 0 0 0 0 0 0 0 0 0 0 0 -77.7459 0 2076.56 0 0 0 315.332 0 0 0 0 0 0 0 0 0 1259.42 -1887.8 0 -1763.44 0 0.03 0 0 0 0 
0 0 0 2397.31 0 0 0 0 0 0 0 0 2202.75 0 0 0 0 0 0 -831.706 0 0 0 0 -1256.52 -1453.98 0 0 0 0 0 0 0 0 1650.82 0 0 0 0 0 0 0 0 0 0 0 0 0 -2073.5 0 0 0 0 0.05 0 0 0 
0 -555.208 0 0 0 0 0 0 0 0 0 0 0 0 0 0 0 0 0 0 0 0 0 0 0 0 0 0 0 2461.39 0 0 0 0 0 0 0 0 0 0 0 0 0 0 0 0 0 0 0 0 0 0 0 0 0.06 0 0 
0 0 0 0 0 0 0 0 0 0 0 0 0 0 0 0 0 0 0 0 0 0 0 0 2226.55 0 0 0 0 0 0 0 0 0 0 0 0 0 0 0 0 0 0 0 0 0 0 0 0 0 0 0 0 0 0 0.03 0 
0 0 0 0 0 0 0 0 0 0 1929.91 0 0 0 0 0 0 0 0 0 0 0 0 0 0 0 0 0 0 0 0 0 0 0 0 0 0 0 0 0 0 0 0 0 0 0 0 0 0 0 0 0 0 0 0 0 0.08 
