*Vertices 38
*Matrix 
0.08 0 2279.81 0 -2032.76 0 0 0 -352.565 1849.96 0 0 1383.94 0 0 0 0 0 0 0 0 0 664.617 0 0 0 0 0 0 0 0 0 0 0 0 0 0 0 
0 0.04 0 0 0 0 0 0 0 0 0 2248.99 0 0 0 0 0 0 0 0 0 0 0 0 0 0 0 0 0 0 0 0 0 0 0 0 0 0 
-689.642 0 0.03 0 0 0 0 1490.45 0 0 0 0 0 0 0 0 0 0 0 1155.2 0 0 0 0 2395.02 0 0 0 0 0 -491.577 0 -385.83 0 0 0 0 0 
0 0 0 0.02 0 0 1844 -1115.22 789.285 -1657.99 0 0 1194.27 0 0 0 0 0 0 0 46.9222 0 0 0 0 0 0 0 0 0 0 0 0 1455.5 0 0 0 0 
2436.83 0 0 0 0.06 0 2151.94 0 0 0 0 0 0 0 0 0 0 0 0 0 2475.13 -530.641 0 0 0 0 0 0 0 0 0 0 0 0 0 0 0 0 
0 0 0 0 0 0.04 0 574.129 0 0 -712.226 0 397.58 0 0 0 0 0 0 0 1370.2 -1088.82 0 0 0 0 0 0 0 0 0 0 0 0 0 0 0 0 
0 0 0 864.36 1818.67 0 0.02 0 0 0 0 0 0 0 0 0 -31.3578 1431.24 0 1715.22 0 0 0 0 0 -1392.64 0 0 0 0 0 0 0 0 0 0 0 0 
0 0 487.152 1373.41 0 2464.75 0 0 0 0 0 0 0 0 0 0 0 0 0 0 0 0 0 0 0 -1929.3 0 0 0 0 0 0 0 0 684.301 0 0 -205.924 
207.907 0 0 203.94 0 0 0 0 0 0 0 0 0 0 0 0 0 0 0 0 0 0 0 0 0 -1021.07 0 0 0 1701.33 0 0 0 0 0 0 0 0 
-2352.6 0 0 2455.9 0 0 0 0 0 0.08 0 0 0 0 0 1583.22 0 0 0 1043.81 -580.233 0 0 0 0 0 0 0 0 0 0 0 0 0 0 0 0 0 
0 0 0 0 0 -1161.92 0 0 0 0 0.06 0 0 0 -634.709 0 0 0 0 0 2428.28 0 0 1826 0 0 -2089.53 0 0 0 0 0 0 0 0 0 0 0 
0 1260.8 0 0 0 0 0 0 0 0 0 0.02 0 822.855 0 0 0 0 0 0 0 0 1325.8 0 0 0 0 0 0 0 0 0 0 0 0 0 0 0 
1777.78 0 0 -455.107 0 -1612.83 0 0 0 0 0 0 0.04 0 0 0 0 0 0 0 0 1974.17 0 0 0 0 0 0 0 0 0 0 0 0 0 0 0 0 
0 0 0 0 0 0 0 0 0 0 0 415.433 0 0 0 0 0 0 0 0 0 0 0 0 1396.91 0 0 0 0 0 0 0 0 0 0 0 0 0 
0 0 0 0 0 0 0 0 0 0 2101.12 0 0 0 0.04 0 0 2128.44 0 0 0 0 0 0 0 0 0 0 0 0 0 0 0 0 0 0 0 0 
0 0 0 0 0 0 0 0 0 1858.2 0 0 0 0 0 0.06 0 0 0 0 0 0 2372.59 0 0 0 0 0 0 0 0 0 0 0 0 0 -575.198 0 
0 0 0 0 0 0 1959.97 0 0 0 0 0 0 0 0 0 0.02 0 0 0 0 0 0 806.07 0 0 0 0 0 0 0 0 0 0 0 0 0 0 
0 0 0 0 0 0 177.084 0 0 0 0 0 0 0 1984.39 0 0 0.08 2459.26 0 0 0 0 1624.73 0 0 0 0 0 0 0 0 0 0 0 0 0 0 
0 0 0 0 0 0 0 0 0 0 0 0 0 0 0 0 0 -949.355 0.09 0 0 0 0 0 0 0 1860.79 0 0 0 0 0 0 0 0 0 0 0 
0 0 1630.22 0 0 0 -1012.38 0 0 1501.43 0 0 0 0 0 0 0 0 0 0.02 0 0 0 0 0 0 0 0 0 0 0 0 0 0 0 519.807 0 0 
0 0 0 -273.064 -871.99 300.378 0 0 0 2378.99 704.443 0 0 0 0 0 0 0 0 0 0.01 674.841 0 0 1923.2 -2066.48 0 0 0 0 0 0 0 0 0 0 0 0 
0 0 0 0 1020 1179.16 0 0 0 0 0 0 1966.08 0 0 0 0 0 0 0 175.405 0.06 0 0 0 0 0 0 0 0 0 0 0 0 0 0 0 0 
-725.806 0 0 0 0 0 0 0 0 0 0 2107.53 0 0 0 -839.03 0 0 0 0 0 0 0 2206.72 0 0 0 0 -265.282 0 0 0 0 0 0 0 0 0 
0 0 0 0 0 0 0 0 0 0 1061.36 0 0 0 0 0 2181.69 2434.54 0 0 0 0 2035.66 0.08 0 0 0 0 0 0 0 0 0 0 0 0 0 0 
0 0 208.67 0 0 0 0 0 0 0 0 0 0 -806.223 0 0 0 0 0 0 1890.24 0 0 0 0.04 0 1018.63 0 0 0 0 0 0 0 0 0 0 0 
0 0 0 0 0 0 241.02 1207.39 -26.3222 0 0 0 0 0 0 0 0 0 0 0 -73.0155 0 0 0 0 0.04 0 0 0 0 0 0 0 0 0 0 0 0 
0 0 0 0 0 0 0 0 0 0 1903.06 0 0 0 0 0 0 0 2069.23 0 0 0 0 0 -945.235 0 0.03 0 0 0 0 0 0 0 0 0 0 0 
0 0 0 0 0 0 0 0 0 0 0 0 0 0 0 0 0 0 0 0 0 0 0 0 0 0 0 0.09 0 0 0 231.101 0 0 0 0 0 0 
0 0 0 0 0 0 0 0 0 0 0 0 0 0 0 0 0 0 0 0 0 0 676.366 0 0 0 0 0 0.01 0 0 0 0 0 0 0 0 0 
0 0 0 0 0 0 0 0 2050.61 0 0 0 0 0 0 0 0 0 0 0 0 0 0 0 0 0 0 0 0 0.07 0 0 0 0 0 0 0 0 
0 0 1411.4 0 0 0 0 0 0 0 0 0 0 0 0 0 0 0 0 0 0 0 0 0 0 0 0 0 0 0 0.04 0 0 0 0 0 0 0 
0 0 0 0 0 0 0 0 0 0 0 0 0 0 0 0 0 0 0 0 0 0 0 0 0 0 0 2444.76 0 0 0 0 0 0 0 0 0 0 
0 0 423.521 0 0 0 0 0 0 0 0 0 0 0 0 0 0 0 0 0 0 0 0 0 0 0 0 0 0 0 0 0 0.08 0 0 0 0 0 
0 0 0 2237.24 0 0 0 0 0 0 0 0 0 0 0 0 0 0 0 0 0 0 0 0 0 0 0 0 0 0 0 0 0 0.09 0 0 0 0 
0 0 0 0 0 0 0 1517.3 0 0 0 0 0 0 0 0 0 0 0 0 0 0 0 0 0 0 0 0 0 0 0 0 0 0 0.05 0 0 0 
0 0 0 0 0 0 0 0 0 0 0 0 0 0 0 0 0 0 0 2331.69 0 0 0 0 0 0 0 0 0 0 0 0 0 0 0 0.05 0 0 
0 0 0 0 0 0 0 0 0 0 0 0 0 0 0 569.094 0 0 0 0 0 0 0 0 0 0 0 0 0 0 0 0 0 0 0 0 0.07 0 
0 0 0 0 0 0 0 2209.62 0 0 0 0 0 0 0 0 0 0 0 0 0 0 0 0 0 0 0 0 0 0 0 0 0 0 0 0 0 0.03 
