*Vertices 50
*Matrix 
0.05 0 0 0 0 1416.44 0 0 0 0 -435.27 0 0 0 0 0 0 0 0 0 0 0 0 0 -488.22 0 0 0 0 -1232.87 2490.08 0 0 285.577 0 0 0 0 0 0 0 0 0 2011.7 0 1673.56 0 0 0 0 
0 0.08 0 0 0 0 0 0 -613.956 0 0 0 0 0 0 0 0 -738.472 0 1374.94 0 0 0 0 0 0 0 0 0 1458.25 -794.778 0 0 0 0 0 0 0 0 0 0 0 0 0 0 0 0 0 0 0 
0 0 0.02 1486.18 0 0 0 0 0 0 0 1837.9 0 -1947.16 0 0 840.709 0 0 0 1844.16 1204.64 0 0 0 0 0 0 0 0 0 0 0 0 0 0 0 0 0 0 0 1709.42 0 2366.79 0 1921.37 0 0 0 0 
0 0 1483.12 0.02 0 0 0 0 0 0 0 -842.235 0 106.586 0 0 -188.223 0 0 0 0 0 0 0 0 0 0 2138.66 -1731.24 0 1456.72 0 -2072.13 0 0 0 0 0 0 0 0 0 707.038 -1192.59 0 1960.13 0 0 0 0 
0 0 0 0 0.09 0 227.592 0 0 0 0 0 0 0 0 0 0 -1105.76 0 0 0 0 0 0 0 17.0141 0 0 0 0 0 0 -100.635 140.767 0 0 0 923.872 0 0 781.198 0 0 0 0 301.447 0 0 0 0 
-2262.11 0 0 0 0 0.05 0 0 0 0 0 0 2151.78 0 0 -284.356 0 -403.684 0 0 0 0 0 0 0 0 0 -1239.59 0 0 0 0 0 0 0 0 0 1241.11 0 1948.23 0 0 0 0 0 0 0 0 0 0 
0 0 0 0 241.63 0 0.07 0 0 0 0 0 0 0 0 0 0 0 0 -2434.23 0 1818.52 0 0 0 -2131.95 0 2235.25 0 0 0 0 1414 0 0 0 0 0 0 0 1323.21 0 0 502.869 0 2446.9 0 0 0 0 
0 0 0 0 0 0 0 0 0 0 0 0 0 0 0 0 0 0 0 0 0 0 0 0 0 0 2234.03 0 1915.72 0 0 0 0 0 0 -944.014 -1142.99 544.679 967.208 0 0 0 0 0 0 0 0 0 0 0 
0 -1423.76 0 0 0 0 0 0 0 0 0 0 0 0 0 0 0 0 -1288.11 996.2 0 0 0 0 2393.19 0 0 0 0 0 0 0 0 0 0 0 0 1281.4 0 0 2437.74 218.284 -2460.17 1007.19 0 0 0 0 0 0 
0 0 0 0 0 0 0 0 0 0.05 0 0 0 0 0 0 0 0 0 0 -2198.93 0 0 1440.4 0 0 0 0 0 0 0 0 0 0 0 0 0 917.768 0 0 0 0 0 678.503 0 0 0 0 0 0 
-403.226 0 0 0 0 0 0 0 0 0 0.08 0 2045.73 0 0 0 0 0 2070.91 0 0 0 0 0 0 0 0 0 0 0 0 0 0 0 0 0 0 0 0 0 0 0 0 0 0 0 0 0 0 0 
0 0 368.282 47.5326 0 0 0 0 0 0 0 0.03 0 0 -67.5222 0 0 0 0 0 0 0 -2394.86 0 0 1003.37 0 0 0 0 0 0 2177.27 0 -334.712 1670.66 1663.49 -2473.91 0 0 0 0 0 0 0 0 0 0 0 0 
0 0 0 0 0 1201.74 0 0 0 0 1840.49 0 0.05 0 0 0 0 0 0 -1205.25 0 0 0 0 0 0 0 0 -639.134 0 910.749 0 -810.19 0 0 0 0 0 0 0 0 0 0 0 0 0 0 0 0 0 
0 0 -601.596 -2351.22 0 0 0 0 0 0 0 0 0 0.03 0 0 0 0 0 0 0 0 0 0 1073.87 1632.82 -1455.96 0 0 0 0 2015.98 0 0 0 0 0 0 0 0 0 0 1919.08 0 0 0 0 0 0 0 
0 0 0 0 0 0 0 0 0 0 0 -1530.12 0 0 0.01 0 0 0 0 0 0 0 0 0 0 0 0 960.341 0 0 0 0 0 0 0 0 0 0 0 1114 0 0 0 0 0 0 0 0 0 0 
0 0 0 0 0 661.87 0 0 0 0 0 0 0 0 0 0.07 0 0 0 0 0 0 0 0 0 0 0 0 -97.1252 0 0 0 0 0 0 0 0 0 0 0 0 0 0 0 0 0 116.657 0 0 0 
0 0 -763.039 2065.42 0 0 0 0 0 0 0 0 0 0 0 0 0.01 45.7015 0 0 0 0 0 0 1634.04 0 0 326.93 0 0 0 -1704.54 0 0 0 0 0 0 -753.121 0 0 0 0 0 0 0 0 0 0 0 
0 224.693 0 0 732.673 -371.944 0 0 0 0 0 0 0 0 0 0 929.823 0.05 0 2233.88 0 0 0 0 0 0 1818.52 0 0 0 -102.008 0 0 0 -776.62 -582.369 0 0 0 -473.724 0 1377.07 -1883.98 0 0 0 0 0 0 0 
0 0 0 0 0 0 0 0 -497.223 0 -2015.98 0 0 0 0 0 0 0 0.09 0 0 2066.03 0 0 0 0 0 0 0 1118.27 0 0 0 0 0 0 0 0 0 0 2495.27 0 0 0 0 -40.6659 0 0 0 0 
0 1648.08 0 0 0 0 -1720.25 0 608.615 0 0 0 1318.48 0 0 0 0 774.636 0 0.01 0 0 0 0 0 0 0 0 0 0 0 0 0 0 0 0 0 0 0 0 -943.709 0 0 0 -621.281 128.254 0 0 0 -948.592 
0 0 329.981 0 0 0 0 0 0 -1048.84 0 0 0 0 0 0 0 0 0 0 0 0 0 0 0 0 0 0 0 0 2412.26 0 1655.4 0 0 0 0 0 0 669.805 0 0 -198.141 0 2386.17 0 0 0 0 0 
0 0 2019.03 0 0 0 -1267.82 0 0 0 0 0 0 0 0 0 0 0 1836.38 0 0 0.02 0 0 0 0 79.7296 0 0 0 0 0 0 0 0 0 0 0 0 0 0 0 0 0 0 0 0 0 0 0 
0 0 0 0 0 0 0 0 0 0 0 -644.627 0 0 0 0 0 0 0 0 0 0 0.01 1806.47 0 0 0 0 0 0 0 0 0 0 0 2100.97 0 0 0 0 0 0 0 0 0 0 0 0 0 0 
0 0 0 0 0 0 0 0 0 -19.1504 0 0 0 0 0 0 0 0 0 0 0 0 582.98 0.07 0 0 0 415.433 1618.17 0 0 0 -130.238 0 0 0 0 0 0 -1139.94 0 0 0 0 0 0 0 0 0 0 
2432.1 0 0 0 0 0 0 0 2383.72 0 0 0 0 -158.467 0 0 -1033.28 0 0 0 0 0 0 0 0.02 2207.48 1273.61 0 1314.81 0 0 2073.2 0 0 0 0 0 0 -1660.44 0 772.652 0 0 0 0 0 0 0 0 0 
0 0 0 0 2.97555 0 595.645 0 0 0 0 -842.997 0 2294.92 0 0 0 0 0 0 0 0 0 0 -415.586 0.06 0 0 2480.32 0 0 0 0 0 0 0 0 0 -385.22 -593.356 0 -1558.35 0 0 0 1562.32 0 0 0 0 
0 0 0 0 0 0 0 1340.6 0 0 0 0 0 -1613.13 0 0 0 2342.68 0 0 0 2284.84 0 0 425.199 0 0.01 -341.731 0 0 0 0 0 -2137.75 0 -1159.63 479.522 0 0 0 0 0 533.998 0 0 0 0 0 0 0 
0 0 0 85.9859 0 117.878 1911.91 0 0 0 0 0 0 0 2410.58 0 -672.857 0 0 0 0 0 0 1988.66 0 0 -1436.28 0.01 0 0 0 0 0 0 0 0 0 0 0 0 0 0 0 0 0 0 0 0 0 0 
0 0 0 556.581 0 0 0 -2161.55 0 0 0 0 1614.96 0 0 -501.953 0 0 0 0 0 0 0 60.1978 1599.4 649.205 0 0 0.04 0 0 0 0 0 0 0 0 0 0 0 0 0 0 0 0 0 0 0 0 0 
-141.072 2167.2 0 0 0 0 0 0 0 0 0 0 0 0 0 0 0 0 2384.03 0 0 0 0 0 0 0 0 0 0 0.04 0 0 0 0 1945.02 0 0 0 0 0 0 0 0 0 0 0 0 0 0 0 
1250.72 1941.66 0 564.058 0 0 0 0 0 0 0 0 684.759 0 0 0 0 -1596.8 0 0 286.798 0 0 0 0 0 0 0 0 0 0.02 0 0 0 0 0 0 0 1916.94 0 0 0 0 0 0 0 0 0 0 0 
0 0 0 0 0 0 0 0 0 0 0 0 0 1409.73 0 0 -641.728 0 0 0 0 0 0 0 2212.21 0 0 0 0 0 0 0.09 -1005.97 0 1394.92 0 0 0 0 0 0 0 0 0 2386.62 0 0 0 0 0 
0 0 0 -2163.08 1560.34 0 1736.58 0 0 0 0 1720.56 -1691.26 0 0 0 0 0 0 0 -593.966 0 0 2482.91 0 0 0 0 0 0 0 -429.014 0.09 880.993 0 -694.22 0 1319.09 0 0 0 0 0 0 0 0 0 -1988.97 360.347 0 
2029.71 0 0 0 2130.12 0 0 0 0 0 0 0 0 0 0 0 0 0 0 0 0 0 0 0 0 0 2160.33 0 0 0 0 0 -914.563 0 0 0 0 0 0 0 0 0 0 0 0 0 0 0 0 0 
0 0 0 0 0 0 0 0 0 0 0 -128.712 0 0 0 0 0 2213.13 0 0 0 0 0 0 0 0 0 0 0 1831.03 0 285.272 0 0 0.07 -240.41 0 0 0 0 0 0 0 0 0 0 0 0 0 0 
0 0 0 0 0 0 0 2235.86 0 0 0 -1801.43 0 0 0 0 0 -1914.81 0 0 0 0 2297.51 0 0 0 2171.47 0 0 0 0 0 2368.62 0 1260.64 0.05 0 0 0 0 0 0 0 0 0 0 0 0 0 0 
0 0 0 0 0 0 0 511.719 0 0 0 1770.91 0 0 0 0 0 0 0 0 0 0 0 0 0 0 1380.73 0 0 0 0 0 0 0 0 0 0.05 0 0 0 0 0 0 0 0 0 0 0 0 0 
0 0 0 0 60.3504 240.104 0 -1790.29 1638.31 1420.87 0 1252.56 0 0 0 0 0 0 0 0 0 0 0 0 0 0 0 0 0 0 0 0 105.518 0 0 0 0 0.07 0 0 0 0 0 0 0 0 0 0 0 0 
0 0 0 0 0 0 0 561.922 0 0 0 0 0 0 0 0 1476.26 0 0 0 0 0 0 0 2307.89 2327.11 0 0 0 0 -1613.13 0 0 0 0 0 0 0 0.08 0 0 0 0 0 0 0 0 0 0 0 
0 0 0 0 0 -2107.68 0 0 0 0 0 0 0 0 1758.25 0 0 -1702.86 0 0 464.263 0 0 -197.378 0 2375.48 0 0 0 0 0 0 0 0 0 0 0 0 0 0.08 1921.06 0 0 0 0 0 0 0 0 0 
0 0 0 0 1530.58 0 -931.043 0 866.039 0 0 0 0 0 0 0 0 0 203.787 1733.38 0 0 0 0 859.325 0 0 0 0 0 0 0 0 0 0 0 0 0 0 1635.26 0.06 0 0 0 0 0 0 0 0 0 
0 0 1711.1 0 0 0 0 0 -684.149 0 0 0 0 0 0 0 0 2413.33 0 0 0 0 0 0 0 1709.57 0 0 0 0 0 0 0 0 0 0 0 0 0 0 0 0.03 0 0 0 0 0 0 0 0 
0 0 0 1513.34 0 0 0 0 1641.82 0 0 0 0 497.375 0 0 0 235.069 0 0 -2160.94 0 0 0 0 0 1825.54 0 0 0 0 0 0 0 0 0 0 0 0 0 0 0 0.05 0 0 0 0 0 0 0 
956.984 0 662.175 2202.44 0 0 990.86 0 -534.913 -2034.59 0 0 0 0 0 0 0 0 0 0 0 0 0 0 0 0 0 0 0 0 0 0 0 0 0 0 0 0 0 0 0 0 0 0.01 -597.324 1056.17 0 0 0 0 
0 0 0 0 0 0 0 0 0 0 0 0 0 0 0 0 0 0 0 8.77407 2217.86 0 0 0 0 0 0 0 0 0 0 -1055.1 0 0 0 0 0 0 0 0 0 0 0 -541.78 0.05 0 0 0 0 0 
-294.733 0 2443.08 -693.304 1379.67 0 -1653.11 0 0 0 0 0 0 0 0 0 0 0 376.98 897.473 0 0 0 0 0 193.106 0 0 0 0 0 0 0 0 0 0 0 0 0 0 0 0 0 578.707 0 0.07 0 0 0 0 
0 0 0 0 0 0 0 0 0 0 0 0 0 0 0 1677.68 0 0 0 0 0 0 0 0 0 0 0 0 0 0 0 0 0 0 0 0 0 0 0 0 0 0 0 0 0 0 0.08 0 0 0 
0 0 0 0 0 0 0 0 0 0 0 0 0 0 0 0 0 0 0 0 0 0 0 0 0 0 0 0 0 0 0 0 1626.41 0 0 0 0 0 0 0 0 0 0 0 0 0 0 0.06 0 0 
0 0 0 0 0 0 0 0 0 0 0 0 0 0 0 0 0 0 0 0 0 0 0 0 0 0 0 0 0 0 0 0 730.689 0 0 0 0 0 0 0 0 0 0 0 0 0 0 0 0.08 0 
0 0 0 0 0 0 0 0 0 0 0 0 0 0 0 0 0 0 0 922.193 0 0 0 0 0 0 0 0 0 0 0 0 0 0 0 0 0 0 0 0 0 0 0 0 0 0 0 0 0 0.03 
