*Vertices 48
*Matrix 
0.05 0 -1137.35 0 0 0 0 -164.113 0 0 0 0 0 0 337.306 0 0 0 0 0 0 0 0 0 0 0 726.569 0 2493.59 907.697 0 0 0 0 0 0 0 0 0 0 0 0 0 0 -1193.35 0 0 0 
0 0.03 0 0 0 0 609.836 0 0 0 2397.46 0 0 0 0 0 0 0 0 318.079 852.916 814.005 0 0 0 0 0 1518.68 0 71.0318 0 0 0 0 0 0 0 0 0 0 0 0 0 0 0 0 0 0 
1540.5 0 0.05 0 1735.51 0 0 0 0 0 0 0 0 -742.439 0 0 0 0 0 0 0 0 0 0 0 0 0 0 0 0 0 0 0 0 0 0 0 0 0 0 0 -1713.54 0 0 1869.18 0 0 0 
0 0 0 0.08 0 2348.63 0 2363.12 0 0 0 0 0 0 0 0 0 0 0 0 0 0 0 0 0 2250.21 0 0 0 0 0 -1253.78 0 0 0 0 2397.15 0 0 0 -2335.2 0 0 0 0 0 0 0 
0 0 1048.69 0 0.03 0 0 0 0 0 0 0 0 0 0 0 0 0 0 835.826 0 0 0 0 0 0 0 -323.573 -643.712 0 0 0 0 0 0 -1766.79 0 0 0 0 0 0 0 0 0 0 1864.45 0 
0 0 0 -489.441 0 0.07 0 0 0 0 0 0 1188.92 0 0 -1050.07 -71.9474 0 0 0 0 0 0 0 0 0 0 0 0 0 0 0 0 0 0 2039.78 0 0 0 0 0 0 0 0 0 0 0 0 
0 2262.26 0 0 0 0 0.05 0 -1451.99 0 0 0 0 0 0 2409.21 0 0 0 0 0 0 -1396.15 0 0 0 0 0 0 0 0 0 0 0 0 0 1406.83 0 0 0 0 -848.643 0 0 0 0 0 0 
2129.81 0 0 -1695.99 0 0 0 0.07 -1941.82 0 0 0 0 629.826 2492.37 0 1858.96 0 0 2050.77 0 0 0 0 0 0 0 0 0 0 1627.17 0 0 0 0 0 0 0 0 0 0 308.161 0 0 0 0 298.7 0 
0 0 0 0 0 0 -2130.73 2035.36 0.07 0 1293.15 0 0 0 0 0 0 1707.59 0 0 0 0 -323.725 0 0 0 0 0 0 0 0 0 0 1223.11 0 0 0 0 0 0 0 0 0 -2132.86 0 0 0 0 
0 0 0 0 0 0 0 0 0 0.06 736.183 0 0 -1805.7 0 0 0 0 0 0 0 0 0 0 0 0 0 0 0 0 2060.99 0 0 0 510.804 0 0 0 0 0 0 0 0 0 0 0 0 0 
0 2245.93 0 0 0 0 0 0 1454.28 1580.94 0.07 1648.84 0 0 0 0 0 0 0 0 0 0 0 0 0 0 0 0 0 0 0 0 0 0 0 0 0 0 0 0 0 0 0 -2276.15 0 0 0 0 
0 0 0 0 0 0 0 0 0 0 835.521 0.01 0 0 0 0 0 0 -453.276 0 0 0 0 0 0 0 1629.76 372.25 0 0 0 0 0 -1538.82 432.371 0 0 0 0 2198.32 0 0 0 433.439 0 0 0 0 
0 0 0 0 0 2000.72 0 0 0 0 0 0 0 0 0 0 0 0 0 0 0 0 0 0 -1642.28 0 0 0 0 -1007.19 0 0 0 0 0 0 0 0 0 0 0 2206.41 0 0 0 0 0 0 
0 0 -1945.33 0 0 0 0 -1151.54 0 -145.039 0 0 0 0.07 0 0 0 0 0 0 0 0 0 0 0 0 0 1497.77 0 0 0 0 1758.55 0 0 0 0 0 0 1109.42 1593.3 0 0 0 0 0 0 0 
652.715 0 0 0 0 0 0 2217.09 0 0 0 0 0 0 0.05 0 0 268.181 0 0 507.752 0 0 0 0 0 0 0 0 -395.749 0 0 0 2298.73 0 0 0 0 0 0 0 0 0 0 0 0 317.164 0 
0 0 0 0 0 -871.99 1000.47 0 0 0 0 0 0 0 0 0.03 0 0 0 0 0 0 0 0 2147.21 0 0 0 0 0 0 0 0 0 0 0 0 0 0 0 0 0 -1435.67 0 0 0 0 0 
0 0 0 0 0 -1514.56 0 1781.14 0 0 0 0 0 0 0 0 0 0 0 0 0 1031.6 0 -212.638 0 0 0 0 -1928.54 0 0 -173.269 0 2151.63 0 0 0 0 0 0 0 0 0 0 0 0 -896.252 0 
0 0 0 0 0 0 0 0 1722.24 0 0 0 0 0 1800.82 0 0 0.05 0 0 0 -178.304 0 1496.25 0 0 1685.16 0 0 0 0 0 0 0 0 0 0 0 0 0 0 0 0 0 0 0 0 0 
0 0 0 0 0 0 0 0 0 0 0 345.393 0 0 0 0 0 0 0.05 0 160.604 0 0 0 0 946.76 0 0 314.57 0 0 0 0 0 0 0 0 0 0 0 0 0 0 0 0 0 0 0 
0 579.318 0 0 171.896 0 0 -289.544 0 0 0 0 0 0 0 0 0 0 0 0.08 0 0 0 0 1736.73 -1608.25 0 0 0 0 0 0 0 0 0 0 0 0 0 0 0 -958.968 0 0 0 0 983.535 0 
0 2342.07 0 0 0 0 0 0 0 0 0 0 0 0 2122.18 0 0 0 2299.65 0 0.06 0 2007.13 1442.38 -2481.84 0 0 0 0 0 0 0 0 1012.38 0 0 0 0 0 0 0 0 0 0 0 0 0 0 
0 1059.37 0 0 0 0 0 0 0 0 0 0 0 0 0 0 -893.048 1471.53 0 0 0 0.02 0 0 0 0 0 0 0 0 0 -968.123 0 0 0 2030.63 0 0 960.036 0 0 0 0 0 560.091 0 0 0 
0 0 0 0 0 0 872.143 0 556.429 0 0 0 0 0 0 0 0 0 0 0 1077.23 0 0 0 0 0 0 0 0 0 0 0 0 0 0 0 0 0 -2164.45 0 0 0 681.555 0 0 0 0 0 
0 0 0 0 0 0 0 0 0 0 0 0 0 0 0 0 1891.92 -603.885 0 0 1533.17 0 0 0.07 0 0 0 0 0 0 0 0 0 0 0 0 0 0 0 0 0 0 0 0 0 520.722 0 0 
0 0 0 0 0 0 0 0 0 0 0 0 2467.5 0 0 237.663 0 0 0 105.213 358.058 0 0 0 0.06 0 -869.549 0 0 0 0 0 1221.88 0 0 0 0 0 0 0 0 0 0 -852.458 2414.24 0 0 0 
0 0 0 -2346.49 0 0 0 0 0 0 0 0 0 0 0 0 0 0 1574.68 664.159 0 0 0 0 0 0.06 0 746.101 0 2209.92 0 0 0 0 0 0 0 0 0 -622.959 0 0 0 981.552 0 0 0 0 
1092.33 0 0 0 0 0 0 0 0 0 0 1915.42 0 0 0 0 0 1536.99 0 0 0 0 0 0 -972.549 0 0.06 0 0 0 0 0 0 0 0 0 0 0 0 1923.35 0 0 -944.624 0 0 0 0 2235.56 
0 -1483.58 0 0 2394.41 0 0 0 0 0 0 1889.63 0 1264.61 0 0 0 0 0 0 0 0 0 0 0 -22.2022 0 0.01 0 0 0 0 0 0 0 0 0 0 0 0 0 0 -1595.74 0 0 2047.72 0 0 
-1784.04 0 0 0 2354.58 0 0 0 0 0 0 0 0 0 0 0 784.249 0 137.104 0 0 0 0 0 0 0 0 0 0.08 0 0 0 0 0 0 0 0 0 0 0 0 0 0 0 -207.144 0 0 0 
-837.657 -172.811 0 0 0 0 0 0 0 0 0 0 1753.67 0 1807.99 0 0 0 0 0 0 0 0 0 0 1938 0 0 0 0.07 -469.604 0 0 0 0 0 0 0 0 0 -1034.96 0 0 0 0 0 0 0 
0 0 0 0 0 0 0 2211.14 0 975.448 0 0 0 0 0 0 0 0 0 0 0 0 0 0 0 0 0 0 0 1354.34 0 0 0 0 1646.4 0 1303.98 0 0 -1851.02 0 0 -1549.2 0 0 0 0 0 
0 0 0 522.401 0 0 0 0 0 0 0 0 0 0 0 0 2466.43 0 0 0 0 -2461.24 0 0 0 0 0 0 0 0 0 0.04 0 0 2083.12 0 0 0 0 0 0 0 0 586.184 0 0 0 0 
0 0 0 0 0 0 0 0 0 0 0 0 0 1034.65 0 0 0 0 0 0 0 0 0 0 -395.138 0 0 0 0 0 0 0 0.06 0 0 0 0 0 0 0 0 0 0 1830.27 0 0 0 0 
0 0 0 0 0 0 0 0 937.91 0 0 244.072 0 0 1991.87 0 2181.39 0 0 0 -1912.21 0 0 0 0 0 0 0 0 0 0 0 0 0 0 0 0 0 0 1677.37 0 0 0 0 0 0 0 0 
0 0 0 0 0 0 0 0 0 391.629 0 120.319 0 0 0 0 0 0 0 0 0 0 0 0 0 0 0 0 0 0 734.504 2415.62 0 0 0 0 0 1990.49 0 0 0 0 0 -1608.71 0 0 0 0 
0 0 0 0 1708.81 -756.325 0 0 0 0 0 0 0 0 0 0 0 0 0 0 0 47.5326 0 0 0 0 0 0 0 0 0 0 0 0 0 0.03 0 0 0 0 0 0 0 2097 0 0 -420.011 0 
0 0 0 1623.05 0 0 2302.24 0 0 0 0 0 0 0 0 0 0 0 0 0 0 0 0 0 0 0 0 0 0 0 1646.86 0 0 0 0 0 0.02 0 0 0 0 0 0 0 0 0 2317.5 0 
0 0 0 0 0 0 0 0 0 0 0 0 0 0 0 0 0 0 0 0 0 0 0 0 0 0 0 0 0 0 0 0 0 0 1860.48 0 0 0.06 0 0 194.937 0 0 409.94 0 0 0 0 
0 0 0 0 0 0 0 0 0 0 0 0 0 0 0 0 0 0 0 0 0 527.894 342.799 0 0 0 0 0 0 0 0 0 0 0 0 0 0 0 0.05 0 0 0 0 0 0 0 0 0 
0 0 0 0 0 0 0 0 0 0 0 317.774 0 -615.787 0 0 0 0 0 0 0 0 0 0 0 1886.43 972.701 0 0 0 -1655.25 0 0 2390.29 0 0 0 0 0 0.02 0 0 0 0 0 0 0 0 
0 0 0 523.927 0 0 0 0 0 0 0 0 0 2138.51 0 0 0 0 0 0 0 0 0 0 0 0 0 0 0 2488.86 0 0 0 0 0 0 0 624.943 0 0 0.08 0 0 0 0 0 0 0 
0 0 1666.08 0 0 0 608.005 -2242.88 0 0 0 0 1473.05 0 0 0 0 0 0 -355.007 0 0 0 0 0 0 0 0 0 0 0 0 0 0 0 0 0 0 0 0 0 0.06 0 0 0 0 2176.05 0 
0 0 0 0 0 0 0 0 0 0 0 0 0 0 0 276.116 0 0 0 0 0 0 -388.424 0 0 0 -1026.87 1974.32 0 0 2465.51 0 0 0 0 0 0 0 0 0 0 0 0.04 0 0 0 0 0 
0 0 0 0 0 0 0 0 2493.9 0 1743.75 -841.166 0 0 0 0 0 0 0 0 0 0 0 0 -179.525 971.786 0 0 0 0 0 2294.61 867.565 0 1992.02 1902.45 0 -1803.26 0 0 0 0 0 0.04 0 0 0 0 
2304.99 0 2498.32 0 0 0 0 0 0 0 0 0 0 0 0 0 0 0 0 0 0 515.687 0 0 -2076.86 0 0 0 1689.58 0 0 0 0 0 0 0 0 0 0 0 0 0 0 0 0.04 0 0 0 
0 0 0 0 0 0 0 0 0 0 0 0 0 0 0 0 0 0 0 0 0 0 0 2360.84 0 0 0 -57.9089 0 0 0 0 0 0 0 0 0 0 0 0 0 0 0 0 0 0.03 1626.1 0 
0 0 0 0 2458.65 0 0 -272.759 0 0 0 0 0 0 1520.81 0 1693.7 0 0 -1565.07 0 0 0 0 0 0 0 0 0 0 0 0 0 0 0 -445.341 -607.852 0 0 0 0 2276.91 0 0 0 629.063 0.01 0 
0 0 0 0 0 0 0 0 0 0 0 0 0 0 0 0 0 0 0 0 0 0 0 0 0 0 1940.6 0 0 0 0 0 0 0 0 0 0 0 0 0 0 0 0 0 0 0 0 0.07 
