*Vertices 59
*Matrix 
0.01 0 0 419.401 0 0 0 0 0 0 0 0 -1583.38 0 0 0 0 0 0 0 0 0 0 0 0 1221.58 0 0 0 0 0 0 1493.65 0 0 0 0 0 0 0 0 0 0 0 0 0 0 0 0 0 0 0 0 0 0 0 0 0 0 
0 0.01 0 0 0 0 0 0 0 0 0 0 0 0 0 0 0 0 1284.6 1141.32 0 0 0 0 0 2207.79 0 0 0 0 0 0 0 -1915.27 0 0 116.657 0 0 0 0 0 0 444.731 0 0 -2018.72 0 0 -1339.69 0 0 0 0 0 0 0 0 0 
0 0 0.06 0 0 0 0 0 0 0 0 0 0 0 0 0 0 0 -1565.37 -652.257 1687.14 0 0 0 0 0 0 2127.67 0 0 0 0 0 1218.68 -2321.47 1437.04 0 0 0 0 0 0 0 0 0 0 0 0 0 0 0 0 0 0 0 0 0 0 0 
-1251.34 0 0 0.02 0 0 0 0 0 0 0 0 0 0 0 2476.65 0 0 0 1236.69 0 0 0 869.549 0 0 0 0 0 0 0 1206.17 0 0 0 0 0 0 0 0 0 0 963.393 0 0 0 0 2440.79 0 0 0 0 0 0 0 0 0 0 0 
0 0 0 0 0.06 -110.248 0 0 0 0 0 0 0 0 0 -1426.36 0 0 0 0 0 0 0 0 0 0 1888.41 0 0 0 0 0 0 0 2420.19 0 0 0 0 0 0 0 0 0 0 0 0 0 927.992 0 0 0 0 0 0 0 0 0 0 
0 0 0 0 2189.17 0.07 0 0 0 0 0 0 0 0 0 0 0 0 0 0 0 0 0 0 0 0 0 0 0 0 0 0 0 0 0 0 0 2037.64 1839.73 0 0 0 0 0 0 1849.19 0 0 0 0 0 0 0 0 0 0 0 0 0 
0 0 0 0 0 0 0.09 1716.28 0 0 0 0 0 0 0 0 0 0 0 0 0 0 1709.88 0 0 0 -710.547 0 -892.285 0 0 0 0 0 0 0 0 0 0 0 -288.018 0 1676.76 -1889.78 0 0 0 475.86 0 0 0 0 0 0 0 0 0 0 0 
0 0 0 0 0 0 -450.377 0.04 0 0 0 0 0 0 0 0 0 0 0 0 0 0 0 0 0 0 0 0 0 1848.43 0 0 0 0 0 0 0 0 0 599.612 0 0 0 0 -1440.09 0 0 1889.93 0 0 0 0 0 0 0 0 0 0 0 
0 0 0 0 0 0 0 0 0.07 764.107 0 0 0 2324.67 0 0 0 0 0 -2341.46 0 0 0 0 0 1869.95 0 0 0 0 0 2071.67 0 0 0 0 1357.08 0 0 0 0 0 0 0 0 280.694 0 0 0 0 -2388.15 0 0 0 0 0 0 0 0 
0 0 0 0 0 0 0 0 1873 0.04 0 0 0 0 0 0 0 0 0 617.618 0 0 0 0 0 0 0 0 0 0 0 0 1309.63 0 0 0 0 1894.36 0 0 197.531 0 0 0 0 0 0 0 775.246 0 0 0 0 0 0 0 0 0 0 
0 0 0 0 0 0 0 0 0 0 0.01 0 0 0 0 1179.16 0 0 0 0 0 0 0 0 -1237.6 0 0 0 0 1671.73 0 0 0 0 0 0 0 0 0 0 0 1788.92 0 0 0 -1286.43 0 0 0 0 0 0 0 0 0 0 0 0 0 
0 0 0 0 0 0 0 0 0 0 0 0.08 0 0 0 0 0 0 358.516 -1194.57 0 0 0 0 0 0 0 0 0 0 1615.42 0 0 0 0 0 0 0 0 0 0 0 0 0 0 -1895.89 0 1403.78 0 842.235 0 0 0 0 0 0 0 0 0 
-1539.58 0 0 0 0 0 0 0 0 0 0 0 0.07 0 0 0 0 0 0 0 0 0 0 0 0 0 0 0 0 0 0 1769.08 0 0 -1604.43 1331.75 0 0 606.174 0 0 1513.49 0 1412.02 0 0 0 0 0 0 0 0 0 0 0 0 0 0 0 
0 0 0 0 0 0 0 0 -1011.15 0 0 0 0 0.06 0 0 0 0 0 0 0 0 0 0 0 0 0 0 0 -1371.73 0 0 0 1767.4 0 0 0 1094.01 0 0 0 0 0 0 0 0 0 0 0 0 0 0 0 0 0 0 0 0 0 
0 0 0 0 0 0 0 0 0 0 0 0 0 0 0.03 0 1873.76 0 0 0 0 0 984.146 272.149 0 0 0 0 0 0 0 0 0 1263.08 0 0 -1055.41 0 386.135 0 0 0 1315.12 -1470.31 0 0 0 0 0 -2270.04 0 0 0 0 0 0 0 0 0 
0 0 0 2260.89 755.867 0 0 0 0 0 -578.249 0 0 0 0 0.07 0 0 0 0 1037.55 0 1313.29 831.553 0 0 0 753.731 0 0 0 0 0 0 0 0 0 0 0 0 0 0 0 0 0 0 0 0 0 1466.19 -84.46 0 0 0 0 0 0 0 0 
0 0 0 0 0 0 0 0 0 0 0 0 0 0 365.078 0 0.05 0 0 0 0 0 1574.68 0 0 1657.69 0 0 0 0 -2390.9 -1336.94 2335.96 0 0 0 0 0 0 0 0 0 0 0 0 0 0 0 1251.79 250.938 0 0 0 0 0 0 0 0 0 
0 0 0 0 0 0 0 0 0 0 0 0 0 0 0 0 0 0.07 0 0 0 0 0 1954.63 0 0 0 0 0 873.821 0 0 0 0 0 0 0 0 -169.607 0 0 0 0 0 0 0 -2140.95 0 0 0 0 0 0 0 0 0 0 0 0 
0 1657.38 1630.99 0 0 0 0 0 0 0 0 770.058 0 0 0 0 0 0 0.08 0 0 0 1006.73 0 0 0 0 0 0 0 0 0 0 382.778 2065.42 0 52.8733 0 0 0 0 0 0 1701.94 0 0 0 0 0 0 0 0 0 0 0 0 0 0 0 
0 -1742.07 2192.83 -2327.11 0 0 0 0 888.012 2039.02 0 2225.64 0 0 0 0 0 0 0 0.04 0 0 0 0 0 0 0 0 2270.2 0 0 0 0 0 -1910.84 0 0 0 0 0 0 0 0 -1330.23 0 0 0 0 0 0 0 0 0 0 0 0 0 0 0 
0 0 -2471.77 0 0 0 0 0 0 0 0 0 0 0 0 483.032 0 0 0 0 0.01 0 0 1289.79 0 -1100.42 0 0 2064.65 0 1917.86 0 -30.5948 0 0 0 0 -780.587 0 0 -393.46 0 0 0 0 0 0 0 0 0 0 0 0 0 0 0 0 0 0 
0 0 0 0 0 0 0 0 0 0 0 0 0 0 0 0 0 0 0 0 0 0.03 0 0 859.172 0 0 0 0 0 0 0 0 0 638.676 0 0 0 0 0 -1381.95 0 0 0 0 0 0 1705.6 0 -70.1163 0 0 0 0 0 0 0 0 0 
0 0 0 0 0 0 -655.919 0 0 0 0 0 0 0 914.411 2318.11 960.189 0 1035.26 0 0 0 0.05 -142.14 -561.617 2388.91 0 0 0 0 0 0 0 0 0 0 0 92.3948 1513.79 0 0 0 0 0 0 0 0 0 -1433.68 1484.95 0 0 0 0 0 0 0 0 0 
0 0 0 2498.93 0 0 0 0 0 0 0 0 0 0 1502.04 1075.09 0 -977.584 0 0 950.575 0 691.321 0.09 -766.854 0 0 0 0 -244.835 0 0 0 0 0 0 0 0 0 0 0 0 0 0 1565.83 0 0 0 728.706 0 0 0 0 0 0 0 0 0 0 
0 0 0 0 0 0 0 0 0 0 -2412.56 0 0 0 0 0 0 0 0 0 0 317.011 2384.79 -1000.93 0.05 0 0 0 0 0 0 0 -1187.7 0 -1412.32 499.969 0 1529.66 0 621.128 0 0 0 1569.34 0 0 0 0 0 0 1866.89 0 2231.74 0 0 0 0 0 0 
24.9489 696.203 0 0 0 0 0 0 381.71 0 0 0 0 0 0 0 -277.49 0 0 0 941.878 0 1625.95 0 0 0.08 0 0 0 644.932 0 0 0 0 0 0 0 0 1741.61 0 1434.75 0 0 0 0 0 0 0 -2035.2 0 0 0 0 0 0 0 0 0 0 
0 0 0 0 -30.2896 0 1302.15 0 0 0 0 0 0 0 0 0 0 0 0 0 0 0 0 0 0 0 0.08 0 0 0 -6.63778 0 0 0 0 0 0 0 0 0 0 0 0 0 0 906.934 -168.996 0 1527.07 0 0 0 0 -682.318 0 0 0 0 0 
0 0 1351.89 0 0 0 0 0 0 0 0 0 0 0 0 -184.713 0 0 0 0 0 0 0 0 0 0 0 0.05 0 0 0 0 0 0 0 0 0 1811.81 0 0 0 0 0 0 0 -1985.31 0 0 0 0 0 0 0 0 0 0 0 0 0 
0 0 0 0 0 0 -2391.81 0 0 0 0 0 0 0 0 0 0 0 0 2289.88 1609.62 0 0 0 0 0 0 0 0.01 0 0 0 0 0 1344.72 0 0 0 0 0 0 0 0 0 0 0 0 0 0 0 0 0 0 0 0 0 0 0 0 
0 0 0 0 0 0 0 2003.77 0 0 1825.24 0 0 -391.018 0 0 0 -70.7266 0 0 0 0 0 -2436.98 0 2481.08 0 0 0 0.08 0 0 0 0 0 0 0 0 0 0 0 0 0 0 0 0 1851.48 0 0 0 0 0 0 0 0 0 0 638.523 1814.86 
0 0 0 0 0 0 0 0 0 0 0 -1707.43 0 0 0 0 2418.82 0 0 0 1949.75 0 0 0 0 0 -927.992 0 0 0 0.06 0 0 0 0 -503.021 0 0 0 0 0 0 0 0 0 0 0 0 0 0 0 0 0 0 0 0 0 0 0 
0 0 0 -99.7192 0 0 0 0 -1627.63 0 0 0 1207.24 0 0 0 2384.79 0 0 0 0 0 0 0 0 0 0 0 0 0 0 0.04 1476.41 0 0 0 0 0 0 0 0 0 0 0 0 0 0 2141.25 0 0 0 0 0 0 0 0 0 0 0 
-846.507 0 0 0 0 0 0 0 0 2226.86 0 0 0 0 0 0 1887.49 0 0 0 1557.59 0 0 0 357.448 0 0 0 0 0 0 2466.12 0 0 0 0 0 0 0 0 0 0 0 0 0 0 -637.913 0 0 -2368.47 0 0 0 0 267.571 0 0 0 0 
0 -1244.93 192.19 0 0 0 0 0 0 0 0 0 0 1982.41 364.925 0 0 0 1327.33 0 0 0 0 0 0 0 0 0 0 0 0 0 0 0.09 0 -572.909 0 0 -69.2007 0 1257.59 0 0 0 0 0 0 0 0 0 0 0 0 0 0 0 0 0 0 
0 0 501.495 0 1969.74 0 0 0 0 0 0 0 1905.19 0 0 0 0 0 -1760.54 -1503.27 0 2457.12 0 0 1941.51 0 0 0 -651.646 0 0 0 0 0 0.03 0 170.98 0 0 0 2040.39 0 0 -2181.39 0 0 0 -1975.69 122.456 0 0 0 0 0 0 0 0 0 0 
0 0 1942.58 0 0 0 0 0 0 0 0 0 114.826 0 0 0 0 0 0 0 0 0 0 0 1171.68 0 0 0 0 0 1588.56 0 0 2268.06 0 0.08 0 0 0 0 0 0 0 839.488 0 0 0 0 0 0 0 0 0 0 0 0 0 0 0 
0 -142.445 0 0 0 0 0 0 1871.32 0 0 0 0 0 1229.36 0 0 0 880.84 0 0 0 0 0 0 0 0 0 0 0 0 0 0 0 2021.32 0 0.05 0 0 0 2464.29 4.80667 0 0 0 0 0 0 0 0 0 0 0 0 0 1054.49 0 0 0 
0 0 0 0 0 -1484.34 0 0 0 -547.731 0 0 0 1565.37 0 0 0 0 0 0 -199.973 0 -427.946 0 376.827 0 0 2274.77 0 0 0 0 0 0 0 0 0 0.01 2260.43 0 -1450.01 0 0 0 0 0 0 0 0 0 0 0 0 0 0 0 0 0 0 
0 0 0 0 0 1735.21 0 0 0 0 0 0 1189.54 0 848.796 0 0 1206.32 0 0 0 0 2482.76 0 0 2081.74 0 0 0 0 0 0 0 919.446 0 0 0 1914.81 0.02 0 0 0 349.971 0 0 0 781.655 0 0 0 0 0 0 0 0 0 0 0 0 
0 0 0 0 0 0 0 2013.84 0 0 0 0 0 0 0 0 0 0 0 0 0 0 0 0 1849.8 0 0 0 0 0 0 0 0 0 0 0 0 0 0 0.04 0 0 0 2415.62 0 0 0 0 0 293.664 0 0 0 0 0 0 0 0 0 
0 0 0 0 0 0 1450.62 0 0 -2117.45 0 0 0 0 0 0 0 0 0 0 1304.59 -1456.27 0 0 0 1247.98 0 0 0 0 0 0 0 944.624 -2297.66 0 2408.6 289.544 0 0 0.08 0 1763.13 0 239.341 0 0 0 0 0 0 2052.29 0 0 0 0 47.9904 0 0 
0 0 0 0 0 0 0 0 0 0 -722.297 0 -1608.71 0 0 0 0 0 0 0 0 0 0 0 0 0 0 0 0 0 0 0 0 0 0 0 1664.1 0 0 0 0 0.03 0 0 0 0 2039.02 0 0 0 0 0 0 0 0 0 0 0 0 
0 0 0 18.54 0 0 1825.08 0 0 0 0 0 0 0 872.753 0 0 0 0 0 0 0 0 0 0 0 0 0 0 0 0 0 0 0 0 0 0 0 832.774 0 1195.79 0 0.07 0 2294 0 0 0 0 0 0 0 0 0 0 0 0 0 0 
0 1782.05 0 0 0 0 -999.863 0 0 0 0 0 -52.1104 0 1846.75 0 0 0 -2099.14 2197.71 0 0 0 0 1152.76 0 0 0 0 0 0 0 0 0 1448.94 -2231.13 0 0 0 2241.36 0 0 0 0 0 0 0 0 -345.088 0 0 0 0 0 0 0 0 0 0 
0 0 0 0 0 0 0 1798.38 0 0 0 0 0 0 0 0 0 0 0 0 0 0 0 574.435 0 0 0 0 0 0 0 0 0 0 0 0 0 0 0 0 1822.03 0 775.399 0 0.03 0 0 0 0 0 0 0 0 0 0 0 0 0 0 
0 0 0 0 0 1648.84 0 0 -1688.97 0 1694.46 650.883 0 0 0 0 0 0 0 0 0 0 0 0 0 0 -2009.11 516.907 0 0 0 0 0 0 0 0 0 0 0 0 0 0 0 0 0 0.06 0 0 0 0 0 0 0 0 0 0 0 0 0 
0 76.22 0 0 0 0 0 0 0 0 0 0 0 0 0 0 0 1496.55 0 0 0 0 0 0 0 0 -1329.16 0 0 -1762.22 0 0 1358.76 0 0 0 0 0 -320.368 0 0 988.571 0 0 0 0 0.04 0 2485.66 -930.586 0 0 0 0 0 0 0 0 0 
0 0 0 270.623 0 0 1338.31 1074.63 0 0 0 2225.79 0 0 0 0 0 0 0 0 0 -1253.93 0 0 0 0 0 0 0 0 0 -210.654 0 0 1802.96 0 0 0 0 0 0 0 0 0 0 0 0 0.02 -117.725 0 -2021.77 0 0 0 0 0 0 0 0 
0 0 0 0 -1573.15 0 0 0 0 1510.13 0 0 0 0 0 0 1388.06 0 0 0 0 0 -1082.87 -1771.07 0 2321.16 1958.6 0 0 0 0 0 0 0 2290.8 0 0 0 0 0 0 0 0 1401.94 0 0 1328.09 -1401.18 0.03 0 0 0 0 0 0 0 0 0 0 
0 913.953 0 0 0 0 0 0 0 0 0 146.87 0 0 514.466 1441.77 1007.8 0 0 0 0 -48.6007 -2201.83 0 0 0 0 0 0 0 0 0 -673.772 0 0 0 0 0 0 2308.04 0 0 0 0 0 0 1151.08 0 0 0.01 0 0 0 0 0 0 0 0 0 
0 0 0 0 0 0 0 0 1725.29 0 0 0 0 0 0 1804.94 0 0 0 0 0 0 0 0 106.891 0 0 0 0 0 0 0 0 0 0 0 0 0 0 0 0 0 0 0 0 0 0 -1038.93 0 0 0 0 0 0 0 0 0 0 0 
0 0 0 0 0 0 0 0 0 0 0 0 0 0 0 0 0 0 0 0 0 0 0 0 0 0 0 0 0 0 0 0 0 0 0 0 0 0 0 0 1946.7 0 0 0 0 0 0 0 0 0 0 0.08 0 0 0 0 0 0 0 
0 0 0 0 0 0 0 0 0 0 0 0 0 0 0 0 0 0 0 0 0 0 0 0 1827.83 0 0 0 0 0 0 0 0 0 0 0 0 0 0 0 0 0 0 0 0 0 0 0 0 0 0 0 0.04 0 0 0 0 0 0 
0 0 0 0 0 0 0 0 0 0 0 0 0 0 0 0 0 0 0 0 0 0 0 0 0 0 705.969 0 0 0 0 0 0 0 0 0 0 0 0 0 0 0 0 0 0 0 0 0 0 0 0 0 0 0.04 0 0 0 0 0 
0 0 0 0 0 0 0 0 0 0 0 0 0 0 0 0 0 0 0 0 0 0 0 0 0 0 0 0 0 0 0 0 824.229 0 0 0 0 0 0 0 0 0 0 0 0 0 0 0 0 0 0 0 0 0 0.09 0 0 0 0 
0 0 0 0 0 0 0 0 0 0 0 0 0 0 0 0 0 0 0 0 0 0 0 0 0 0 0 0 0 0 0 0 0 0 0 0 1042.74 0 0 0 0 0 0 0 0 0 0 0 0 0 0 0 0 0 0 0.06 0 0 0 
0 0 0 0 0 0 0 0 0 0 0 0 0 0 0 0 0 0 0 0 0 0 0 0 0 0 0 0 0 0 0 0 0 0 0 0 0 0 0 0 1780.68 0 0 0 0 0 0 0 0 0 0 0 0 0 0 0 0.02 0 0 
0 0 0 0 0 0 0 0 0 0 0 0 0 0 0 0 0 0 0 0 0 0 0 0 0 0 0 0 0 1164.82 0 0 0 0 0 0 0 0 0 0 0 0 0 0 0 0 0 0 0 0 0 0 0 0 0 0 0 0.09 0 
0 0 0 0 0 0 0 0 0 0 0 0 0 0 0 0 0 0 0 0 0 0 0 0 0 0 0 0 0 187.918 0 0 0 0 0 0 0 0 0 0 0 0 0 0 0 0 0 0 0 0 0 0 0 0 0 0 0 0 0.01 
