*Vertices 58
*Matrix 
0.01 0 0 0 0 0 1396.3 2359.16 2236.01 753.121 0 0 -1273.77 0 0 0 0 0 0 0 0 0 0 1687.9 0 1219.6 0 0 0 0 2444 0 0 0 469.909 0 0 0 0 0 0 0 0 0 -1028.4 0 0 0 0 0 0 0 0 0 0 0 0 0 
0 0.08 0 0 0 0 766.701 -144.124 0 0 0 0 0 0 0 1730.17 0 147.786 0 2485.96 0 0 0 0 0 0 0 0 0 0 0 0 0 0 0 0 0 0 0 0 0 -104.144 0 0 0 0 0 0 0 0 0 0 0 0 0 0 0 0 
0 0 0.01 0 0 0 0 0 0 0 0 0 2104.63 1568.73 0 0 0 0 0 -331.507 0 0 -2459.11 0 0 0 0 0 0 0 -2431.33 -2493.59 0 0 0 0 2488.4 0 0 1298.33 840.098 862.377 0 0 0 0 0 0 0 0 0 0 2417.45 0 0 0 977.889 0 
0 0 0 0.08 -1357.08 0 0 0 0 0 0 0 0 1445.13 -569.247 0 2473.91 0 0 0 0 0 0 0 0 0 0 0 -880.078 0 0 0 0 0 0 0 0 0 0 0 0 0 0 0 0 0 1277.89 0 0 0 0 0 0 0 0 0 0 0 
0 0 0 1489.84 0 0 0 0 0 0 0 0 0 217.063 -407.041 0 0 0 0 0 0 0 0 0 0 0 0 0 0 0 0 -1334.65 1089.43 0 0 0 0 0 -2370.3 0 0 0 0 1863.99 0 0 0 0 1187.4 0 0 0 0 0 0 0 0 0 
0 0 0 0 0 0.04 0 0 0 0 0 0 0 0 0 0 -705.512 0 0 0 0 0 0 0 0 0 1197.16 0 0 0 0 0 0 -86.2911 0 0 0 0 0 0 0 0 0 0 0 0 0 0 0 0 0 0 0 0 0 0 0 0 
1879.25 1913.13 0 0 0 0 0.03 0 0 0 0 239.647 434.965 0 0 0 0 0 0 0 0 0 783.334 0 0 0 0 1311.15 0 0 0 0 0 0 0 0 88.7326 0 0 0 485.931 0 -1635.72 0 0 0 0 0 0 0 0 0 0 0 0 0 0 0 
991.165 1756.72 0 0 0 0 0 0.09 0 0 1199.61 0 0 1286.43 0 -207.297 0 0 0 0 1144.22 0 0 0 0 0 0 0 2074.27 0 0 0 0 -449.461 0 0 0 0 0 1908.25 0 0 0 0 0 0 -2499.69 0 0 0 0 0 0 0 0 0 0 0 
1942.43 0 0 0 0 0 0 0 0.08 0 0 0 0 1212.58 0 0 0 0 0 0 0 0 2349.09 0 0 0 0 0 0 -238.121 0 0 1615.12 0 0 48.4481 0 0 0 0 0 0 0 0 0 0 0 2419.89 0 0 0 0 0 0 0 0 0 0 
2195.12 0 0 0 0 0 0 0 0 0.03 0 0 0 0 0 0 0 246.055 1712.78 0 313.807 0 -2.67037 0 0 0 0 0 2454.99 0 0 0 0 0 0 0 0 0 0 0 0 0 2080.83 0 0 0 -1033.13 0 0 0 0 0 0 0 0 0 0 0 
0 0 0 0 0 0 0 248.344 0 0 0.09 0 -1110.49 0 0 0 0 1573.76 0 0 0 0 0 465.026 0 0 0 0 1695.23 0 0 0 0 1624.88 0 2431.33 0 0 -37.9192 0 0 0 1637.7 0 0 0 0 101.703 0 0 0 0 0 0 0 0 0 0 
0 0 0 0 0 0 2295.37 0 0 0 0 0.07 -1687.14 0 0 0 -433.439 2448.88 0 0 0 0 0 0 0 0 0 0 0 0 0 50.737 0 0 0 895.795 0 0 0 0 0 0 0 0 0 -1742.68 0 0 0 0 0 0 0 0 0 0 0 0 
933.18 0 -245.75 0 0 0 -1473.51 0 0 0 -255.364 -966.597 0.07 0 1971.57 0 0 0 0 0 0 0 1111.1 0 200.888 0 -869.091 0 0 0 0 0 0 0 0 0 0 0 0 0 0 0 0 0 0 -0.686666 0 0 0 0 0 0 0 0 0 0 0 0 
0 0 1924.57 1630.53 2454.68 0 0 -2431.18 715.43 0 0 0 0 0.04 -156.941 1150.93 0 0 0 0 0 0 0 1647.16 0 2026.2 0 0 0 0 0 0 0 0 0 -1145.89 0 0 0 0 0 0 0 0 0 0 0 -1446.81 0 0 0 0 0 0 0 0 0 0 
0 0 0 1146.5 35.4778 0 0 0 0 0 0 0 -847.423 620.06 0 0 0 2352.29 0 0 241.478 0 0 0 0 0 0 0 0 0 0 0 1477.17 471.282 0 0 0 0 0 0 0 745.796 0 0 0 0 0 0 0 0 0 0 0 0 0 0 0 0 
0 -1173.97 0 0 0 0 0 1206.17 0 0 0 0 0 916.547 0 0.08 1677.37 0 0 0 0 0 0 0 0 0 194.784 0 0 0 0 0 0 0 0 0 0 0 0 -223.624 0 0 0 0 0 2333.67 0 1470.15 0 0 0 0 0 0 0 0 0 0 
0 0 0 14.42 0 1590.4 0 0 0 0 0 1011.46 0 0 0 1304.74 0 0 0 0 2228.39 0 0 0 0 0 0 0 0 0 0 0 0 0 0 0 0 0 0 0 0 0 0 0 0 0 0 0 -955.458 0 0 0 0 0 0 1091.57 0 0 
0 850.169 0 0 0 0 0 0 0 1692.94 1656.01 -1242.03 0 0 -120.319 0 0 0.08 0 0 0 0 -595.035 0 0 0 -775.857 0 521.943 0 0 0 0 0 0 0 0 0 0 0 0 0 0 0 0 1297.11 2365.57 0 0 0 0 0 0 1899.09 0 0 0 0 
0 0 0 0 0 0 0 0 0 1485.26 0 0 0 0 0 0 0 0 0 0 0 0 0 0 0 1108.66 0 0 0 0 0 0 0 0 0 2214.04 0 0 0 -373.928 0 0 0 0 -1649.45 0 508.667 0 0 0 0 0 0 0 0 0 0 0 
0 2344.36 -528.199 0 0 0 0 0 0 0 0 0 0 0 0 0 0 0 0 0.06 0 0 0 0 604.19 0 0 0 0 0 0 0 0 0 0 0 0 0 0 0 0 0 0 0 0 0 0 0 0 0 0 0 0 0 0 0 0 0 
0 0 0 0 0 0 0 -1002.15 0 -1426.51 0 0 0 0 1717.96 0 -134.816 0 0 0 0.09 0 0 0 0 0 0 0 0 -554.75 0 0 0 0 0 0 0 0 2381.89 0 0 0 0 -203.635 0 0 0 0 0 0 0 0 0 0 0 0 0 0 
0 0 0 0 0 0 0 0 0 0 0 0 0 0 0 0 0 0 0 0 0 0.07 1607.33 0 -755.104 0 0 0 1905.96 0 0 -1107.59 0 0 0 0 0 0 0 0 0 0 0 0 1237.14 0 0 0 0 0 0 0 0 0 0 0 0 0 
0 0 1902.6 0 0 0 800.729 0 -635.167 -1956.62 0 0 2452.09 0 0 0 0 -2473.3 0 0 0 2399.14 0.05 0 0 2346.95 0 0 0 0 0 0 0 0 0 0 0 -343.41 0 0 0 0 0 0 0 0 2321.47 0 0 0 0 0 0 0 0 0 0 0 
1313.75 0 0 0 0 0 0 0 0 0 1931.59 0 0 212.333 0 0 0 0 0 0 0 0 0 0.04 -2393.03 0 0 0 0 0 0 0 0 0 0 0 0 0 2445.07 447.325 0 0 1669.59 876.263 0 0 0 0 -1714.3 0 0 0 0 0 0 0 0 0 
0 0 0 0 0 0 0 0 0 0 0 0 2465.21 0 0 0 0 0 0 -2320.4 0 2076.25 0 16.2511 0.01 0 0 0 0 0 0 0 0 0 0 0 0 0 0 0 0 0 0 0 0 0 0 0 0 0 0 0 0 0 0 0 0 0 
1361.35 0 0 0 0 0 0 0 0 0 0 0 0 771.432 0 0 0 0 1302.76 0 0 0 169.454 0 0 0.04 1606.11 0 0 0 0 0 0 0 0 0 0 0 0 0 0 0 0 0 0 0 0 0 0 0 2372.13 0 0 0 0 0 0 0 
0 0 0 0 0 -2348.02 0 0 0 0 0 0 -906.171 0 0 2496.64 0 2404.17 0 0 0 0 0 0 0 1657.99 0.01 -791.574 0 0 0 0 0 0 0 0 0 0 0 0 0 0 0 0 -235.069 0 0 0 2474.97 0 0 0 0 0 0 0 0 0 
0 0 0 0 0 0 321.589 0 0 0 0 0 0 0 0 0 0 0 0 0 0 0 0 0 0 0 271.538 0.04 0 0 0 0 0 0 0 0 0 0 0 0 0 0 0 0 0 0 807.749 0 -870.769 0 0 0 0 0 0 0 0 0 
0 0 0 2383.57 0 0 0 194.632 0 -927.076 -446.715 0 0 0 0 0 0 -1281.55 0 0 0 1679.2 0 0 0 0 0 0 0.04 0 0 0 0 1786.02 0 0 0 0 0 0 0 -967.971 0 1802.35 -747.475 0 0 0 0 0 0 0 0 0 0 0 0 0 
0 0 0 0 0 0 0 0 -1380.58 0 0 0 0 0 0 0 0 0 0 0 1643.5 0 0 0 0 0 0 0 0 0.07 0 0 0 0 24.7963 2008.96 0 0 0 0 0 0 0 0 1509.52 2133.32 2361.29 0 0 0 0 0 0 0 0 0 0 0 
2147.82 0 728.401 0 0 0 0 0 0 0 0 0 0 0 0 0 0 0 0 0 0 0 0 0 0 0 0 0 0 0 0.04 0 0 0 0 2042.38 0 0 0 0 0 0 0 0 0 0 0 0 0 0 0 0 0 0 0 0 0 0 
0 0 1729.1 0 730.689 0 0 0 0 0 0 615.94 0 0 0 0 0 0 0 0 0 1192.89 0 0 0 0 0 0 0 0 0 0.04 0 0 0 0 -1865.37 0 2334.74 0 0 0 0 0 0 0 0 219.352 0 0 0 0 0 0 0 0 0 0 
0 0 0 0 -1757.33 0 0 0 458.007 0 0 0 0 0 2304.07 0 0 0 0 0 0 0 0 0 0 0 0 0 0 0 0 0 0.09 2081.9 0 2463.23 0 0 -2280.57 0 0 0 0 0 0 0 0 0 0 0 0 0 0 0 0 0 0 0 
0 0 0 0 0 1851.33 0 533.54 0 0 -463.195 0 0 0 1924.27 0 0 0 0 0 0 0 0 0 0 0 0 0 1048.23 0 0 0 1772.44 0.07 0 0 0 0 0 0 2312.62 0 0 0 -229.118 0 0 0 0 -2186.12 0 0 0 0 1775.8 0 0 0 
333.644 0 0 0 0 0 0 0 0 0 0 0 0 0 0 0 0 0 0 0 0 0 0 0 0 0 0 0 0 1995.99 0 0 0 0 0.04 0 0 766.243 0 0 0 0 0 0 0 0 0 0 0 0 0 0 0 0 0 0 0 453.276 
0 0 0 0 0 0 0 0 1496.4 0 724.281 1495.33 0 1842.94 0 0 0 0 -558.412 0 0 0 0 0 0 0 0 0 0 304.193 1914.2 0 -2073.5 0 0 0.05 0 0 0 0 0 0 0 0 0 0 0 0 0 0 0 0 0 0 0 0 0 0 
0 0 -219.047 0 0 0 49.6689 0 0 0 0 0 0 0 0 0 0 0 0 0 0 0 0 0 0 0 0 0 0 0 0 2193.75 0 0 0 0 0.01 0 0 0 0 530.641 0 0 0 0 0 -503.174 0 0 0 0 0 0 0 0 0 0 
0 0 0 0 0 0 0 0 0 0 0 0 0 0 0 0 0 0 0 0 0 0 412.534 0 0 0 0 0 0 0 0 0 0 0 470.061 0 0 0.05 0 0 0 0 0 1857.28 0 -616.245 0 0 0 0 0 0 0 0 0 0 0 0 
0 0 0 0 1239.59 0 0 0 0 0 1286.13 0 0 0 0 0 0 0 0 0 -897.473 0 0 1225.24 0 0 0 0 0 0 0 -1347.62 1219.9 0 0 0 0 0 0.07 0 0 0 0 0 0 -1967.15 0 0 0 0 0 0 0 0 0 0 0 0 
0 0 -2007.58 0 0 0 0 1806.16 0 0 0 0 0 0 0 -1352.5 0 0 1386.38 0 0 0 0 1843.24 0 0 0 0 0 0 0 0 0 0 0 0 0 0 0 0 0 0 0 0 0 0 1313.75 0 0 0 0 0 0 0 0 0 0 0 
0 0 -425.199 0 0 0 2448.12 0 0 0 0 0 0 0 0 0 0 0 0 0 0 0 0 0 0 0 0 0 0 0 0 0 0 1350.98 0 0 0 0 0 0 0.01 0 0 0 0 0 0 0 0 0 0 0 0 0 0 0 0 0 
0 -1919.23 2205.65 0 0 0 0 0 0 0 0 0 0 0 1622.44 0 0 0 0 0 0 0 0 0 0 0 0 0 1529.21 0 0 0 0 0 0 0 -1084.55 0 0 0 0 0.03 0 0 0 0 0 0 0 0 0 0 0 0 0 0 0 0 
0 0 0 0 0 0 -1631.75 0 0 2475.13 -1068.53 0 0 0 0 0 0 0 0 0 0 0 0 -198.447 0 0 0 0 0 0 0 0 0 0 0 0 0 0 0 0 0 0 0.07 0 0 568.178 0 0 0 0 0 0 0 0 0 0 0 0 
0 0 0 0 2410.89 0 0 0 0 0 0 0 0 0 0 0 0 0 0 0 -2215.57 0 0 -132.069 0 0 0 0 2431.18 0 0 0 0 0 0 0 0 -463.5 0 0 0 0 0 0.01 1230.89 0 0 0 0 0 0 -90.5637 0 0 0 0 0 0 
571.535 0 0 0 0 0 0 0 0 0 0 0 0 0 0 0 0 0 867.26 0 0 2387.23 0 0 0 0 -21.7444 0 1734.9 -1763.74 0 0 0 1852.24 0 0 0 0 0 0 0 0 0 801.95 0.03 0 1691.11 0 0 0 0 0 0 0 0 0 0 0 
0 0 0 0 0 0 0 0 0 0 0 1761.15 965.835 0 0 929.212 0 1728.03 0 0 0 0 0 0 0 0 0 0 0 -1166.49 0 0 0 0 0 0 0 -1066.7 1157.64 0 0 0 1334.5 0 0 0.02 0 -1011 384.762 0 0 0 0 0 0 0 0 0 
0 0 0 1857.59 0 0 0 -1381.8 0 -327.54 0 0 0 0 0 0 0 187.155 958.052 0 0 0 -2488.25 0 0 0 0 1856.21 0 -708.258 0 0 0 0 0 0 0 0 0 1781.29 0 0 0 0 143.208 0 0.05 0 890.606 0 0 0 0 0 0 0 0 0 
0 0 0 0 0 0 0 0 2390.29 0 1371.58 0 0 2190.08 0 1744.67 0 0 0 0 0 0 0 0 0 0 0 0 0 0 0 1025.04 0 0 0 0 1322.75 0 0 0 0 0 0 0 0 -666.143 0 0.02 0 0 0 0 0 0 0 0 0 0 
0 0 0 0 397.122 0 0 0 0 0 0 0 0 0 0 0 1045.64 0 0 0 0 0 0 1307.34 0 0 -565.279 -115.131 0 0 0 0 0 0 0 0 0 0 0 0 0 0 0 0 0 219.657 -666.906 0 0.06 0 0 0 0 0 0 0 0 0 
0 0 0 0 0 0 0 0 0 0 0 0 0 0 0 0 0 0 0 0 0 0 0 0 0 0 0 0 0 0 0 0 0 1824.17 0 0 0 0 0 0 0 0 0 0 0 0 0 0 0 0.08 0 0 0 0 0 0 0 0 
0 0 0 0 0 0 0 0 0 0 0 0 0 0 0 0 0 0 0 0 0 0 0 0 0 2150.87 0 0 0 0 0 0 0 0 0 0 0 0 0 0 0 0 0 0 0 0 0 0 0 0 0.03 0 0 0 0 0 0 0 
0 0 0 0 0 0 0 0 0 0 0 0 0 0 0 0 0 0 0 0 0 0 0 0 0 0 0 0 0 0 0 0 0 0 0 0 0 0 0 0 0 0 0 2174.37 0 0 0 0 0 0 0 0.05 0 0 0 0 0 0 
0 0 232.017 0 0 0 0 0 0 0 0 0 0 0 0 0 0 0 0 0 0 0 0 0 0 0 0 0 0 0 0 0 0 0 0 0 0 0 0 0 0 0 0 0 0 0 0 0 0 0 0 0 0.03 0 0 0 0 0 
0 0 0 0 0 0 0 0 0 0 0 0 0 0 0 0 0 1145.44 0 0 0 0 0 0 0 0 0 0 0 0 0 0 0 0 0 0 0 0 0 0 0 0 0 0 0 0 0 0 0 0 0 0 0 0.09 0 0 0 0 
0 0 0 0 0 0 0 0 0 0 0 0 0 0 0 0 0 0 0 0 0 0 0 0 0 0 0 0 0 0 0 0 0 626.926 0 0 0 0 0 0 0 0 0 0 0 0 0 0 0 0 0 0 0 0 0.05 0 0 0 
0 0 0 0 0 0 0 0 0 0 0 0 0 0 0 0 670.263 0 0 0 0 0 0 0 0 0 0 0 0 0 0 0 0 0 0 0 0 0 0 0 0 0 0 0 0 0 0 0 0 0 0 0 0 0 0 0 0 0 
0 0 547.731 0 0 0 0 0 0 0 0 0 0 0 0 0 0 0 0 0 0 0 0 0 0 0 0 0 0 0 0 0 0 0 0 0 0 0 0 0 0 0 0 0 0 0 0 0 0 0 0 0 0 0 0 0 0 0 
0 0 0 0 0 0 0 0 0 0 0 0 0 0 0 0 0 0 0 0 0 0 0 0 0 0 0 0 0 0 0 0 0 0 526.215 0 0 0 0 0 0 0 0 0 0 0 0 0 0 0 0 0 0 0 0 0 0 0.04 
