*Vertices 62
*Matrix 
0.05 0 0 0 0 0 1586.58 0 0 0 0 0 0 0 0 0 0 0 -7.70592 0 0 0 0 0 0 0 0 0 0 0 0 0 0 0 -2346.49 1768.32 0 0 0 0 0 0 0 0 0 0 0 2414.09 0 -714.057 0 -2133.47 0 0 0 0 0 0 0 0 0 0 
0 0.02 0 0 0 0 0 0 0 0 2231.44 0 0 0 0 0 0 0 0 0 0 0 0 0 0 0 0 -122.761 0 0 0 -133.595 1255 0 0 0 0 0 0 0 0 2452.85 0 0 -1940.6 0 1114.76 0 0 0 0 0 0 0 0 0 0 0 0 0 0 0 
0 0 0.09 0 0 669.805 0 0 0 1456.42 0 0 0 1613.59 0 0 0 0 0 0 0 0 2270.2 0 0 0 0 0 0 0 0 0 0 0 0 -1915.72 0 0 0 0 457.244 0 0 0 0 0 571.383 0 0 0 138.173 0 0 0 0 0 0 0 0 0 0 0 
0 0 0 0.01 0 0 0 0 0 0 -261.467 0 0 0 0 -1527.53 0 -445.036 0 0 0 1884.14 0 1949.75 0 0 0 0 0 0 0 0 0 0 0 0 0 0 0 0 0 0 0 0 0 0 0 0 0 0 0 585.116 0 0 0 0 0 0 0 1201.28 0 0 
0 0 0 0 0.02 0 0 0 0 233.085 0 0 0 0 0 2422.94 0 726.569 0 0 0 0 0 0 0 0 0 0 0 0 0 0 0 1458.56 0 0 0 -672.857 0 0 0 0 0 -937.91 0 0 0 0 0 0 0 0 0 0 0 1223.72 0 0 0 0 0 0 
0 0 -2116.69 0 0 0.06 598.697 0 0 0 0 0 0 1085.01 0 0 0 0 0 0 0 0 279.321 0 1645.79 0 -1149.4 1746.8 0 0 1154.13 0 0 0 0 0 0 0 0 0 0 0 0 0 0 0 0 0 0 0 0 0 0 0 0 0 0 0 0 0 0 0 
-57.1459 0 0 0 0 664.312 0.03 0 0 0 0 0 0 0 0 -541.78 867.412 0 0 0 0 0 0 0 0 0 0 0 0 0 0 0 0 0 0 0 2116.84 666.143 0 0 0 0 0 0 0 0 1404.54 0 0 0 0 0 0 0 0 0 0 0 0 0 0 0 
0 0 0 0 0 0 0 0.02 0 1652.5 0 0 0 0 0 676.824 0 0 0 0 0 0 0 0 0 0 0 0 0 0 0 0 0 0 0 0 0 0 0 0 0 0 0 976.058 1309.02 0 0 0 0 970.717 0 0 0 0 0 0 0 0 0 0 0 0 
0 0 0 0 0 0 0 0 0.09 0 0 0 0 0 0 0 0 0 0 0 0 0 0 0 -138.478 360.347 0 0 0 37.1563 0 0 0 0 0 0 2436.98 0 0 0 0 2305.9 0 0 0 568.331 0 0 0 0 0 0 0 0 0 0 0 0 0 0 0 0 
0 0 -722.297 0 -906.934 0 0 1191.98 0 0.06 0 0 0 0 0 0 0 0 -1060.59 0 0 0 0 1381.34 0 -123.981 0 1476.41 0 0 0 2073.05 0 0 221.335 1515.78 0 0 0 0 0 0 -2248.22 0 -1001.85 0 0 0 0 0 0 0 0 0 0 0 0 0 0 0 0 0 
0 -410.55 0 -1104.85 0 0 0 0 0 0 0.08 1050.37 0 0 0 0 0 0 0 0 0 0 -245.598 0 0 0 0 0 0 0 -1072.8 0 0 0 750.679 0 0 0 0 0 0 690.1 776.772 0 0 0 0 0 424.284 0 0 0 0 0 0 0 0 0 0 0 0 0 
0 0 0 0 0 0 0 0 0 0 -2071.98 0.03 0 0 0 0 0 0 620.365 0 0 0 0 0 0 -964.309 0 0 0 0 0 0 0 0 0 0 1002.3 0 0 0 0 0 533.082 0 0 0 0 0 0 0 1938.31 0 0 0 0 0 0 0 0 0 0 0 
0 0 0 0 0 0 0 0 0 0 0 0 0 0 0 0 0 0 0 0 931.806 0 0 0 1644.41 0 0 0 0 0 0 0 1356.17 2286.22 0 0 0 0 0 0 0 -2227.77 -1977.07 0 0 0 0 0 0 0 0 0 0 0 0 0 0 0 0 0 0 0 
0 0 150.99 0 0 2090.9 0 0 0 0 0 0 0 0 0 0 0 0 0 0 0 0 0 0 1786.17 0 0 0 0 0 0 0 0 0 0 0 0 0 0 0 0 -912.732 1898.94 0 0 0 0 729.316 0 0 0 0 0 0 0 0 0 0 0 0 0 0 
0 0 0 0 0 0 0 0 0 0 0 0 0 0 0.03 0 -2065.72 0 0 0 0 0 0 0 1909.62 0 0 0 0 0 0 0 0 0 0 0 0 -2324.82 0 0 0 0 0 0 0 0 0 0 2421.87 0 1175.95 0 0 0 0 0 0 0 0 0 0 0 
0 0 0 -551.546 -531.251 0 832.469 1250.72 0 0 0 0 0 0 0 0.06 0 0 0 0 0 0 0 0 0 0 0 0 0 0 0 0 0 0 0 0 0 0 0 0 0 0 0 0 0 1119.19 0 1076.92 0 0 1243.25 0 0 0 0 0 0 0 0 0 0 1202.66 
0 0 0 0 0 0 1334.8 0 0 0 0 0 0 0 1645.63 0 0.08 2371.36 0 0 0 0 0 -1141.93 0 0 0 0 0 -1463.13 0 -718.482 0 0 0 1245.54 0 0 0 0 0 394.681 0 0 0 0 0 0 0 0 0 0 0 0 0 0 0 0 0 0 0 0 
0 0 0 -566.958 -1301.08 0 0 0 0 0 0 0 0 0 0 0 1180.84 0.07 0 0 0 0 0 0 0 0 1619.69 0 0 0 0 0 0 0 0 0 1595.58 0 0 0 0 1678.75 0 0 0 0 0 0 0 0 0 0 0 0 0 0 0 0 0 0 0 0 
1431.24 0 0 0 0 0 0 0 0 1067.61 0 -14.42 0 0 0 0 0 0 0.03 1861.86 0 0 0 -253.685 0 424.894 0 0 -372.25 0 0 0 0 0 0 0 0 0 0 0 0 0 0 0 0 1901.07 0 0 0 0 0 526.368 0 0 0 0 0 0 0 0 0 0 
0 0 0 0 0 0 0 0 0 0 0 0 0 0 0 0 0 0 1601.38 0.01 0 0 0 0 0 0 -824.076 0 812.174 0 0 -1216.39 0 0 0 0 0 0 0 0 0 0 0 0 0 0 0 0 1760.99 0 0 0 0 0 0 0 0 0 0 0 0 0 
0 0 0 0 0 0 0 0 0 0 0 0 1757.94 0 0 0 0 0 0 0 0.05 0 0 0 0 0 0 0 1700.42 0 0 2237.39 0 0 0 0 1385.16 0 0 0 0 0 -693.152 -1876.05 0 0 1967.76 0 0 0 0 0 0 0 0 0 0 0 0 0 0 0 
0 0 0 2117.6 0 0 0 0 0 0 0 0 0 0 0 0 0 0 0 0 0 0.09 0 842.692 0 0 0 0 0 0 0 0 0 0 0 0 -1349.91 0 2038.26 0 0 0 0 0 0 0 0 0 0 0 0 0 0 0 0 0 0 0 0 0 0 0 
0 0 1251.18 0 0 1262.02 0 0 0 0 -1157.49 0 0 0 0 0 0 0 0 0 0 0 0.01 0 1526.76 0 0 0 0 -1488.92 0 0 0 0 0 0 0 0 0 0 2251.73 0 0 0 0 0 -290.155 0 0 0 0 0 0 0 0 0 -1867.2 0 0 0 0 0 
0 0 0 1901.53 0 0 0 0 0 -1879.25 0 0 0 0 0 0 1879.1 0 1339.38 0 0 165.334 0 0.03 0 0 0 0 0 0 0 0 0 0 0 0 -346.309 0 0 0 0 0 0 0 0 0 0 0 0 0 0 0 0 0 0 0 0 0 0 0 0 0 
0 0 0 0 0 -367.977 0 0 -1336.79 0 0 0 2101.12 -1945.94 -411.924 0 0 0 0 0 0 0 -2026.35 0 0.05 0 0 0 0 0 0 0 0 200.278 0 1766.64 1957.99 0 0 563.448 0 0 0 1254.54 0 0 0 0 0 0 0 0 0 0 0 0 0 0 0 0 0 0 
0 0 0 0 0 0 0 0 1619.69 1068.22 0 316.401 0 0 0 0 0 0 -19.303 0 0 0 0 0 0 0.04 0 0 1718.42 0 -979.415 0 0 0 0 64.3178 0 0 0 -1930.22 0 0 0 0 0 0 0 550.172 0 0 0 0 0 0 0 0 0 0 0 0 0 0 
0 0 0 0 0 -154.347 0 0 0 0 0 0 0 0 0 0 0 -1272.85 0 -510.041 0 0 0 0 0 0 0.04 0 0 0 0 0 0 1953.87 0 0 0 0 0 0 -2073.96 2430.27 0 2300.71 0 0 0 0 0 0 0 0 0 0 0 0 0 0 0 0 0 0 
0 514.466 0 0 0 -1200.67 0 0 0 4.34889 0 0 0 0 0 0 0 0 0 0 0 0 0 0 0 0 0 0.08 0 0 0 0 0 0 0 0 0 0 0 0 2291.25 0 0 0 0 0 0 0 360.347 0 0 0 0 0 0 0 0 0 0 0 0 0 
0 0 0 0 0 0 0 0 0 0 0 0 0 0 0 0 0 0 934.553 1257.59 1671.58 0 0 0 0 338.527 0 0 0.09 251.549 0 0 0 0 0 0 0 0 1273 -277.795 0 0 0 0 0 0 0 0 0 0 2146.29 0 2267.6 0 0 0 0 0 0 0 0 0 
0 0 0 0 0 0 0 0 2246.85 0 0 0 0 0 0 0 -1292.23 0 0 0 0 0 -880.993 0 0 0 0 0 1658.45 0.07 0 0 1188.31 0 0 0 0 0 0 0 0 0 0 0 0 0 97.5829 0 0 0 0 0 0 0 0 0 0 0 289.85 0 0 0 
0 0 0 0 0 1231.96 0 0 0 0 2252.65 0 0 0 0 0 0 0 0 0 0 0 0 0 0 -2033.22 0 0 0 0 0.01 994.217 0 0 1060.75 0 0 0 0 0 0 0 0 0 0 0 0 0 0 0 0 0 0 0 0 0 0 0 0 0 0 0 
0 2231.89 0 0 0 0 0 0 0 1866.44 0 0 0 0 0 0 2011.7 0 0 -691.931 -942.64 0 0 0 0 0 0 0 0 0 -2325.74 0.01 0 0 0 0 -282.678 0 0 0 0 0 0 0 0 0 -2006.06 0 0 0 2222.43 0 0 0 0 0 0 0 0 0 0 0 
0 -1644.57 0 0 0 0 0 0 0 0 0 0 2035.97 0 0 0 0 0 0 0 0 0 0 0 0 0 0 0 0 1707.28 0 0 0.07 0 1880.32 -1973.1 0 0 0 0 0 -401.242 0 0 0 0 0 -657.445 0 0 0 0 0 0 0 0 0 0 0 0 0 0 
0 0 0 0 307.092 0 0 0 0 0 0 0 -1219.9 0 0 0 0 0 0 0 0 0 0 0 2322.53 0 -1853.77 0 0 0 0 0 0 0.07 0 0 0 0 0 0 0 0 0 0 0 0 0 0 0 0 0 0 0 0 0 0 0 0 0 0 0 0 
-628.3 0 0 0 0 0 0 0 0 -1745.73 1276.21 0 0 0 0 0 0 0 0 0 0 0 0 0 0 0 0 0 0 0 1300.01 0 1759.93 0 0.03 0 0 0 -76.6778 0 0 0 0 0 0 0 0 0 0 0 0 0 0 0 0 0 0 -1837.75 0 0 0 0 
-1063.65 0 2302.55 0 0 0 0 0 0 -1258.81 0 0 0 0 0 0 -226.066 0 0 0 0 0 0 0 1360.13 1637.24 0 0 0 0 0 0 1695.38 0 0 0.08 0 0 0 0 0 0 0 0 0 0 0 0 0 0 0 0 0 0 0 0 0 0 0 0 0 0 
0 0 0 0 0 0 -865.734 0 890.301 0 0 104.907 0 0 0 0 0 630.131 0 0 599.155 799.966 0 1462.52 1243.4 0 0 0 0 0 0 -1591.92 0 0 0 0 0 0 0 0 0 0 0 0 0 0 0 0 0 0 0 0 0 0 0 0 0 0 0 0 0 0 
0 0 0 0 230.644 0 387.051 0 0 0 0 0 0 0 1834.09 0 0 0 0 0 0 0 0 0 0 0 0 0 0 0 0 0 0 0 0 0 0 0.04 0 0 0 0 0 0 0 2140.95 0 0 2033.37 0 0 0 0 0 2420.96 0 0 0 0 0 0 0 
0 0 0 0 0 0 0 0 0 0 0 0 0 0 0 0 0 0 0 0 0 935.011 0 0 0 0 0 0 1178.85 0 0 0 0 0 229.728 0 0 0 0.08 0 0 0 0 0 2313.53 0 0 0 1287.8 0 0 0 0 0 0 0 0 0 0 0 0 0 
0 0 0 0 0 0 0 0 0 0 0 0 0 0 0 0 0 0 0 0 0 0 0 0 843.608 2113.64 0 0 2339.93 0 0 0 0 0 0 0 0 0 0 0.06 0 0 0 -2176.66 0 0 0 2166.74 0 0 -1177.18 0 0 0 0 0 0 0 0 0 0 0 
0 0 -637.455 0 0 0 0 0 0 0 0 0 0 0 0 0 0 0 0 0 0 0 1526.61 0 0 0 -60.9607 1994.92 0 0 0 0 0 0 0 0 0 0 0 0 0.04 0 0 0 0 0 0 0 0 0 1963.48 0 0 0 0 0 0 0 0 0 0 0 
0 2275.69 0 0 0 0 0 0 -122.608 0 -317.164 0 -945.54 381.405 0 0 2392.88 2458.19 0 0 0 0 0 0 0 0 872.906 0 0 0 0 0 2326.65 0 0 0 0 0 0 0 0 0.04 0 1240.65 0 0 0 0 0 0 0 0 0 0 0 0 0 0 0 0 0 0 
0 0 0 0 0 0 0 0 0 1696.3 -929.06 989.792 1177.02 2254.02 0 0 0 0 0 0 -1023.21 0 0 0 0 0 0 0 0 0 0 0 0 0 0 0 0 0 0 0 0 0 0.06 0 0 0 0 0 0 0 0 0 0 0 0 0 0 0 0 0 0 0 
0 0 0 0 142.903 0 0 -956.984 0 0 0 0 0 0 0 0 0 0 0 0 -930.433 0 0 0 2315.97 0 -1585.82 0 0 0 0 0 0 0 0 0 0 0 0 517.975 0 324.641 0 0.09 0 0 0 0 0 0 0 0 0 0 0 0 0 0 0 0 0 0 
0 -2152.09 0 0 0 0 0 -532.777 0 1428.19 0 0 0 0 0 0 0 0 0 0 0 0 0 0 0 0 0 0 0 0 0 0 0 0 0 0 0 0 76.9829 0 0 0 0 0 0.05 0 922.956 0 0 0 0 0 0 0 0 0 0 0 0 0 0 0 
0 0 0 0 0 0 0 0 -760.598 0 0 0 0 0 0 -197.836 0 0 181.509 0 0 0 0 0 0 0 0 0 0 0 0 0 0 0 0 0 0 1172.75 0 0 0 0 0 0 0 0.09 0 0 0 0 0 0 0 0 0 0 0 0 0 0 0 0 
0 2016.43 234.611 0 0 0 2207.79 0 0 0 0 0 0 0 0 0 0 0 0 0 499.664 0 -1182.67 0 0 0 0 0 0 -842.235 0 -210.501 0 0 0 0 0 0 0 0 0 0 0 0 -2149.65 0 0.04 0 0 0 2338.56 0 0 0 0 0 0 0 0 0 0 0 
1022.6 0 0 0 0 0 0 0 0 0 0 0 0 810.8 0 1407.74 0 0 0 0 0 0 0 0 0 -2024.37 0 0 0 0 0 0 1320.15 0 0 0 0 0 0 -927.686 0 0 0 0 0 0 0 0.09 0 0 0 0 0 0 0 0 0 0 0 0 1789.53 0 
0 0 0 0 0 0 0 0 0 0 1423.31 0 0 0 824.229 0 0 0 0 24.3385 0 0 0 0 0 0 0 895.947 0 0 0 0 0 0 0 0 0 -376.675 -2291.86 0 0 0 0 0 0 0 0 0 0.08 0 0 0 0 2441.71 0 0 0 0 0 0 0 0 
-615.482 0 0 0 0 0 0 1685.77 0 0 0 0 0 0 0 0 0 0 0 0 0 0 0 0 0 0 0 0 0 0 0 0 0 0 0 0 0 0 0 0 0 0 0 0 0 0 0 0 0 0.04 0 0 0 0 0 0 0 0 0 0 0 0 
0 0 -352.87 0 0 0 0 0 0 0 0 659.734 0 0 -274.895 -733.589 0 0 0 0 0 0 0 0 0 0 0 0 -627.995 0 0 1236.99 0 0 0 0 0 0 0 2053.82 2380.67 0 0 0 0 0 -663.854 0 0 0 0.06 0 0 0 0 0 0 0 0 0 0 0 
245.293 0 0 2324.06 0 0 0 0 0 0 0 0 0 0 0 0 0 0 -1060.14 0 0 0 0 0 0 0 0 0 0 0 0 0 0 0 0 0 0 0 0 0 0 0 0 0 0 0 0 0 0 0 0 0.02 0 0 0 0 0 0 0 0 0 0 
0 0 0 0 0 0 0 0 0 0 0 0 0 0 0 0 0 0 0 0 0 0 0 0 0 0 0 0 2442.78 0 0 0 0 0 0 0 0 0 0 0 0 0 0 0 0 0 0 0 0 0 0 0 0.05 0 0 0 0 0 0 0 0 0 
0 0 0 0 0 0 0 0 0 0 0 0 0 0 0 0 0 0 0 0 0 0 0 0 0 0 0 0 0 0 0 0 0 0 0 0 0 0 0 0 0 0 0 0 0 0 0 0 930.891 0 0 0 0 0.04 0 0 0 0 0 0 0 0 
0 0 0 0 0 0 0 0 0 0 0 0 0 0 0 0 0 0 0 0 0 0 0 0 0 0 0 0 0 0 0 0 0 0 0 0 0 593.814 0 0 0 0 0 0 0 0 0 0 0 0 0 0 0 0 0.02 0 0 0 0 0 0 0 
0 0 0 0 2095.63 0 0 0 0 0 0 0 0 0 0 0 0 0 0 0 0 0 0 0 0 0 0 0 0 0 0 0 0 0 0 0 0 0 0 0 0 0 0 0 0 0 0 0 0 0 0 0 0 0 0 0 0 0 0 0 0 0 
0 0 0 0 0 0 0 0 0 0 0 0 0 0 0 0 0 0 0 0 0 0 975.295 0 0 0 0 0 0 0 0 0 0 0 0 0 0 0 0 0 0 0 0 0 0 0 0 0 0 0 0 0 0 0 0 0 0.04 0 0 0 0 0 
0 0 0 0 0 0 0 0 0 0 0 0 0 0 0 0 0 0 0 0 0 0 0 0 0 0 0 0 0 0 0 0 0 0 2015.21 0 0 0 0 0 0 0 0 0 0 0 0 0 0 0 0 0 0 0 0 0 0 0.08 0 0 0 0 
0 0 0 0 0 0 0 0 0 0 0 0 0 0 0 0 0 0 0 0 0 0 0 0 0 0 0 0 0 1357.08 0 0 0 0 0 0 0 0 0 0 0 0 0 0 0 0 0 0 0 0 0 0 0 0 0 0 0 0 0.01 0 0 0 
0 0 0 2129.96 0 0 0 0 0 0 0 0 0 0 0 0 0 0 0 0 0 0 0 0 0 0 0 0 0 0 0 0 0 0 0 0 0 0 0 0 0 0 0 0 0 0 0 0 0 0 0 0 0 0 0 0 0 0 0 0.04 0 0 
0 0 0 0 0 0 0 0 0 0 0 0 0 0 0 0 0 0 0 0 0 0 0 0 0 0 0 0 0 0 0 0 0 0 0 0 0 0 0 0 0 0 0 0 0 0 0 974.99 0 0 0 0 0 0 0 0 0 0 0 0 0.02 0 
0 0 0 0 0 0 0 0 0 0 0 0 0 0 0 373.775 0 0 0 0 0 0 0 0 0 0 0 0 0 0 0 0 0 0 0 0 0 0 0 0 0 0 0 0 0 0 0 0 0 0 0 0 0 0 0 0 0 0 0 0 0 0 
