*Vertices 73
*Matrix 
0.07 0 0 0 0 0 0 0 0 0 1368.22 0 1932.51 0 0 -182.882 0 -899.457 0 -1395.23 0 0 2025.59 0 0 0 0 -373.318 -274.895 0 0 936.079 1863.54 0 0 0 0 0 -2099.9 0 0 0 0 0 0 0 -737.251 0 0 0 0 0 0 872.6 0 1314.05 0 0 0 0 0 0 0 0 0 0 0 0 0 0 0 593.204 0 
0 0.03 0 602.664 0 0 598.544 768.075 1933.12 0 0 0 0 0 0 0 0 0 0 0 -1799.14 0 1935.56 0 0 0 0 0 0 0 0 0 0 0 0 0 0 0 0 -2487.49 0 555.055 0 0 0 1956.16 0 0 0 0 0 0 0 0 0 0 0 0 0 0 -821.787 -954.543 0 0 0 0 0 2147.51 0 0 0 0 0 
0 0 0.03 1969.28 460.753 0 0 0 0 169.912 0 0 0 2231.74 0 0 0 725.349 0 0 0 2246.39 0 0 -1191.82 0 935.926 0 0 0 912.58 1276.67 0 0 0 0 0 1600.92 1248.44 0 0 1661.2 0 1881.85 0 0 0 0 0 0 0 -329.981 0 0 0 0 0 0 0 0 0 0 0 -1822.18 -230.644 0 0 0 0 0 0 0 0 
0 1144.67 -473.266 0.01 651.036 0 0 0 0 0 0 543.306 -128.712 -991.318 0 -1910.84 0 0 0 0 0 -1963.18 0 1520.66 0 0 0 0 0 0 0 0 0 0 0 2429.96 0 0 0 0 0 0 0 0 0 -2161.4 0 2091.81 1888.71 0 383.236 0 0 2027.57 0 0 0 0 0 0 0 0 0 0 0 0 0 0 1243.55 0 0 0 0 
0 0 1265.98 -1100.73 0.08 0 0 0 1258.35 -205.008 0 -443.815 0 0 2454.22 0 0 0 -1540.5 29.2215 0 0 0 -1016.95 0 0 0 1357.54 0 724.128 0 0 0 -2107.99 0 0 0 0 0 0 0 0 0 0 0 0 0 0 0 0 0 0 0 1575.9 2425.53 0 0 0 0 0 0 0 2491.45 143.666 0 0 0 0 0 0 0 0 0 
0 0 0 0 0 0.09 0 0 0 1344.72 0 0 0 -1394.31 1372.8 0 0 0 0 0 0 0 1932.51 2178.79 0 0 -181.204 -1497.16 0 -232.78 0 0 0 0 0 0 0 0 0 0 0 0 0 0 0 0 0 -1263.08 0 0 981.399 0 0 309.229 0 0 0 0 0 0 0 0 0 0 0 0 0 0 0 2479.09 0 0 153.127 
0 -1883.22 0 0 0 0 0.07 0 0 0 2298.27 1184.8 0 0 2005.29 0 0 -1774.88 0 -601.138 0 -2180.93 0 0 0 0 325.709 0 1317.56 0 -824.686 0 0 0 1357.39 0 0 0 0 0 -496.307 657.903 0 0 0 1410.79 1787.39 0 1661.66 0 0 0 0 2265.01 -2147.97 0 0 -140.156 0 0 0 0 0 0 0 0 0 0 0 0 0 0 0 
0 -793.863 0 0 0 0 0 0.01 0 0 0 0 0 0 0 0 0 0 0 0 -2373.35 0 0 0 0 0 0 0 0 0 0 -938.215 0 1228.14 0 0 0 -2136.98 0 0 554.903 0 0 1329.46 0 0 0 0 1870.71 0 1604.89 0 -472.961 2137.44 -406.888 0 0 0 0 0 0 0 0 0 0 370.571 0 0 0 0 0 0 0 
0 2435.45 0 0 1140.86 0 0 0 0.08 -1145.59 0 1800.21 0 0 368.587 0 0 0 0 0 0 0 0 0 0 0 2363.58 -1044.11 -391.629 0 1846.6 0 0 0 0 0 -1035.26 0 0 1903.52 0 -2288.35 0 -848.186 0 -728.401 0 0 -2055.04 -506.226 0 -2147.66 0 1886.12 0 0 361.873 0 0 0 0 -818.278 0 0 0 0 0 0 0 0 0 0 0 
0 0 2492.83 0 -270.623 364.315 0 0 -1135.82 0.07 0 0 0 0 0 0 0 0 0 486.236 0 0 1313.29 0 -305.872 558.107 0 0 307.55 0 0 0 0 0 259.026 0 1121.17 -1041.83 0 -1068.68 0 0 0 0 0 0 0 2253.56 0 0 0 0 0 0 0 0 0 0 0 0 0 0 0 0 0 0 0 2314.29 0 0 0 0 0 
-2186.27 0 0 0 0 0 -2498.47 0 0 0 0.09 0 1495.18 0 2484.74 -110.553 0 0 0 0 0 0 0 -1038.93 2216.03 0 0 0 0 0 0 0 0 0 0 0 0 0 0 0 0 -1741.46 1522.19 1910.54 1721.32 1948.99 1004.75 0 0 0 0 0 0 0 0 -778.451 0 0 0 0 0 0 0 -520.417 0 0 0 0 0 1417.2 0 0 0 
0 0 0 1796.85 -2006.36 0 1524.48 0 2492.07 0 0 0.01 0 105.365 0 -175.253 0 0 0 0 0 -277.795 0 0 0 120.624 0 -684.454 0 0 0 0 0 0 0 -2369.69 0 0 0 0 0 -1375.39 0 2419.58 0 0 0 0 0 0 2212.82 0 0 0 0 1962.26 0 0 0 0 2281.95 0 -2042.53 0 2079.76 0 0 -841.166 0 0 0 0 0 
-224.54 0 0 -58.5192 0 0 0 0 0 0 -1134.3 0 0.09 0 0 0 0 0 0 2163.38 0 0 0 -2090.9 0 0 -988.418 0 0 0 -1890.39 0 430.998 0 2302.85 0 0 0 0 0 0 0 -4.95926 0 -211.264 826.212 1654.64 1630.83 0 0 0 0 0 -249.26 0 0 0 0 0 0 0 0 0 0 0 0 0 0 0 0 0 0 0 
0 0 2229.15 1008.1 0 2185.05 0 0 0 0 0 2184.29 0 0.08 384.915 0 0 839.03 2358.24 0 -363.247 0 0 0 0 -65.5385 -1404.84 573.824 -1643.19 -2403.87 0 0 0 0 1406.83 0 -15.0304 0 -200.278 0 -923.109 0 0 0 0 0 1445.59 0 0 0 0 0 0 0 0 0 0 0 0 0 0 0 0 0 0 0 0 0 0 0 0 0 659.581 
0 0 0 0 809.122 -438.475 1846.45 0 2346.8 0 64.3178 0 0 -10.3 0.07 512.177 0 0 0 0 2210.23 0 0 0 -1267.36 0 195.7 0 0 0 -715.125 0 0 -468.535 0 0 0 0 0 0 0 -370.266 0 0 0 1719.03 0 0 -1571.78 0 1367.61 0 -2149.34 367.824 0 0 -1941.97 0 1423.31 0 0 0 0 0 0 0 0 -442.442 0 0 0 0 0 
1691.41 0 0 -591.067 0 0 0 0 0 0 -152.364 2349.39 0 0 -557.649 0 0 0 1239.13 0 0 0 0 1467.41 0 0 0 0 0 0 0 0 0 0 -907.239 0 308.313 0 484.252 1074.48 0 0 0 0 2244.56 -179.373 0 0 0 0 0 0 0 0 0 0 0 0 0 0 0 0 0 0 0 0 0 0 -1255.61 0 0 0 0 
0 0 0 0 0 0 0 0 0 0 0 0 0 0 0 0 0 -1384.09 0 1054.19 1383.33 -932.112 0 0 0 0 0 0 382.931 0 1441.77 0 0 1735.36 0 0 -738.472 0 0 0 0 2397 0 0 0 -1194.72 0 0 0 0 0 2253.56 0 0 0 0 0 0 0 0 0 0 0 0 0 0 -128.407 0 0 0 0 1899.85 0 
1545.84 0 -900.067 0 0 0 1583.53 0 0 0 0 0 0 -1954.48 0 0 -282.678 0.08 -2088.61 0 1338.62 0 -348.903 0 0 0 0 228.66 0 0 0 0 0 1917.4 0 -568.178 812.326 0 0 0 0 2027.88 0 0 0 0 0 1058.46 0 2087.08 1789.83 0 429.167 0 0 0 1352.2 0 1967.3 0 0 0 0 0 0 -2302.24 0 0 0 0 0 0 0 
0 0 0 0 1939.22 0 0 0 0 0 0 0 0 1352.05 0 854.137 0 716.803 0 0 1630.07 0 0 -1253.17 0 0 0 1249.05 0 0 1054.49 0 0 -1284.91 0 0 0 0 0 0 0 0 0 0 -1287.19 0 -657.445 1867.35 0 -234.458 1831.19 0 0 0 0 0 0 0 0 -1688.67 0 0 1087.45 0 0 0 1016.34 0 0 0 0 0 0 
-1898.02 0 0 0 1412.63 0 -327.082 0 0 -597.934 0 0 1344.26 0 0 0 -926.618 0 0 0.09 0 0 0 0 0 1508.76 474.639 0 0 1516.39 0 822.855 0 -1747.26 0 0 0 0 0 0 -110.858 2441.25 0 914.869 0 0 0 0 0 0 1906.57 0 0 1528.6 0 0 0 0 0 0 0 0 0 0 0 210.044 0 0 0 0 0 0 0 
0 888.165 0 0 0 0 0 695.898 0 0 0 0 0 -247.429 1129.57 0 -2162.16 -1968.06 966.903 0 0.06 0 0 0 0 1356.01 0 2156.51 0 0 2125.84 0 0 0 -201.498 0 0 -1493.04 632.115 2208.55 1133.08 -1891.46 2468.26 0 0 0 0 0 0 114.063 0 0 0 0 0 0 0 2434.23 544.069 0 0 2153.92 0 0 0 -1796.09 0 0 -2158.5 -249.718 1311.3 2446.59 0 
0 0 -29.9844 1385.77 0 0 124.134 0 0 0 0 -2353.36 0 0 0 0 2295.37 0 0 0 0 0.06 242.088 0 0 0 0 0 -698.492 0 1475.19 -608.463 0 0 0 1517.91 0 2096.09 0 179.067 2258.14 0 1772.44 0 912.122 0 0 750.984 -1230.74 0 0 0 0 0 0 0 2229.15 -47.2274 0 0 0 0 0 0 -192.19 0 0 59.1296 -548.036 0 0 0 0 
-2021.01 -2208.85 0 0 0 -891.827 0 0 0 110.248 0 0 0 0 0 0 0 1178.4 0 0 0 -105.976 0.08 0 0 2407.68 0 0 0 0 0 0 0 0 0 1003.98 0 1081.19 0 1903.36 0 0 2381.13 0 0 0 0 0 0 0 2437.59 0 1871.93 0 0 0 0 0 0 585.574 0 0 0 0 -1017.11 0 0 0 0 0 342.494 0 0 
0 0 0 198.141 1581.09 1722.69 0 0 0 0 2433.62 0 2247.76 0 0 -2023.91 0 0 1493.5 0 0 0 0 0.06 0 0 0 1868.11 0 853.832 0 0 0 0 0 0 0 0 0 0 0 579.165 0 0 1723.3 91.7844 0 0 0 0 0 0 0 0 0 0 0 0 0 0 0 0 0 0 0 0 0 0 1551.03 0 0 0 0 
0 0 809.427 0 0 0 0 0 0 411.161 1059.37 0 0 0 1856.36 0 0 0 0 0 0 0 0 0 0 0 -1003.83 0 1262.93 0 0 1248.28 -2212.21 -1003.68 0 0 1727.88 0 0 0 1123.92 0 0 0 0 850.627 -1364.1 1159.63 0 1402.55 0 119.098 0 0 -233.238 0 0 0 -1420.26 0 898.999 1934.8 0 0 0 0 0 0 0 0 0 0 0 
0 0 0 0 0 0 0 0 0 845.134 0 2165.06 0 -2259.51 0 0 0 0 0 1802.35 1488.31 0 736.183 0 0 0.08 0 0 0 0 508.82 0 0 907.086 -2477.87 953.932 0 0 0 0 0 0 0 0 0 0 0 0 1710.49 0 2285 0 0 0 0 0 0 0 0 -1821.73 0 0 0 0 0 0 0 0 0 0 0 0 0 
0 0 908.917 0 0 -2159.11 1970.05 0 2429.35 0 0 0 610.752 -2037.8 -1511.35 0 0 0 0 -753.883 0 0 0 0 583.132 0 0.03 0 0 0 0 0 2124.93 -1032.06 0 0 0 0 0 0 0 1261.56 -651.494 2306.97 859.478 0 2115.47 0 0 -590.915 0 0 0 -1028.86 0 0 0 1575.44 0 0 0 0 0 0 -856.273 0 0 0 749.001 0 0 0 0 
2386.93 0 0 0 1064.56 -2283.17 0 0 -1018.78 0 0 86.9015 0 1823.4 0 0 0 813.242 -506.836 0 2364.65 0 0 -1305.51 0 0 0 0.03 0 0 0 1644.72 -2302.09 0 0 -2156.67 -953.169 0 0 0 0 0 0 0 0 1361.96 1262.78 1703.47 0 0 -779.672 0 1828.44 0 0 0 0 0 0 0 0 859.935 0 0 0 0 0 0 0 0 0 0 0 
1850.26 0 0 0 0 0 238.731 0 839.335 -1266.9 0 0 0 -1438.87 0 0 1593.3 0 0 0 0 -1462.22 0 0 -263.756 0 0 0 0.01 0 0 2034.44 0 0 0 0 0 2237.39 -710.242 0 576.571 0 0 0 0 0 0 0 0 1157.03 0 0 0 -1579.56 0 0 0 0 0 0 0 1296.96 -485.168 0 0 0 0 0 0 0 0 0 0 
0 0 0 0 -301.904 1759.01 0 0 0 0 0 0 0 772.042 0 0 0 0 0 1929.46 0 0 0 324.335 0 0 0 0 0 0.08 108.57 0 0 2395.93 0 -1989.43 0 1187.4 0 725.044 0 0 0 0 2342.98 0 0 0 -275.506 -1659.22 330.744 0 0 1932.36 0 1947.46 0 0 0 0 1773.2 0 -1024.58 0 0 0 2340.24 0 1903.52 0 0 0 0 
0 0 2122.94 0 0 0 498.901 0 -1125.6 0 0 0 2012.62 0 597.476 0 2487.18 0 -1564.76 0 505.463 -538.575 0 0 0 -2265.47 0 0 0 -2151.78 0.06 0 0 0 0 0 0 0 -1991.71 0 0 0 1583.68 0 0 937.452 2114.86 0 1179.01 1381.8 2094.56 738.624 1938.76 862.835 0 0 0 74.2363 0 2008.5 0 0 0 0 0 -255.669 0 0 0 0 0 0 0 
269.555 0 996.048 0 0 0 0 2094.56 0 0 0 0 0 0 0 0 0 0 0 -186.85 0 -1025.35 0 0 -1403.32 0 0 1272.24 -154.653 0 0 0.07 2377.47 0 -1374.17 987.655 0 355.159 0 0 0 0 0 0 -1236.84 0 0 -1757.18 0 869.854 0 1687.75 1689.58 0 0 0 0 0 -1428.8 0 0 52.2629 0 317.011 0 0 0 0 0 0 0 0 0 
515.992 0 0 0 0 0 0 0 0 0 0 0 -1464.96 0 0 0 0 0 0 0 0 0 0 0 1559.42 0 268.639 218.589 0 0 0 -670.721 0 0 0 0 0 0 0 0 0 0 675.604 -305.719 0 0 0 0 0 1168.32 2379.3 1785.87 0 0 -1343.81 0 113.453 0 0 0 0 -234.764 0 0 0 0 0 0 0 0 1361.51 497.223 0 
0 0 0 0 2178.49 0 0 -1198.69 0 0 0 0 0 0 1653.57 0 1074.33 1544.16 -1581.7 -2492.22 0 0 0 0 -1041.06 1222.65 -1533.48 0 0 2004.84 0 0 0 0.05 0 1666.54 0 0 0 -331.812 0 0 0 -1192.13 -739.387 1952.19 0 1373.56 0 -517.823 0 -1746.5 0 0 0 0 0 0 -348.903 0 0 0 0 0 0 0 0 0 0 0 0 0 887.707 
0 0 0 0 0 0 2097.31 0 0 2358.24 0 0 -1426.51 2048.33 0 572.146 0 0 0 0 -393.002 0 0 0 0 460.753 0 0 0 0 0 -398.801 0 0 0.07 621.891 858.104 2162.31 -2103.41 0 0 0 0 0 -2195.27 0 0 0 0 1728.34 0 0 908.307 0 0 2121.42 0 0 0 0 0 0 0 0 0 0 0 0 0 0 0 60.3504 1057.54 
0 0 0 945.845 0 0 0 0 0 0 0 2419.43 0 0 0 0 0 652.104 0 0 0 -364.925 1773.35 0 0 2278.59 0 -1169.7 0 -1207.85 0 -1736.88 0 873.211 768.227 0.07 0 0 0 314.264 -989.944 0 1752.75 0 0 0 0 -1750.16 0 0 642.796 0 0 0 0 0 0 0 0 0 -980.789 0 502.869 0 0 0 0 -835.063 0 0 0 0 0 
0 0 0 0 0 0 0 0 2091.97 2468.26 0 0 0 -849.559 0 2144.76 1056.02 -1117.51 0 0 0 0 0 0 -2091.36 0 0 2382.05 0 0 0 0 0 0 -1814.71 0 0.09 1917.1 1814.86 0 -1939.22 662.481 0 2071.21 0 -82.9341 0 0 0 2034.44 0 0 0 0 776.62 0 0 0 0 0 0 0 0 0 38.6822 0 0 0 824.534 0 0 2350.31 0 
0 0 1394.31 0 0 0 0 1830.42 0 -127.644 0 0 0 0 0 0 0 0 0 0 -1897.26 2324.82 -903.272 0 0 0 0 0 -2248.83 2470.09 0 894.574 0 0 2309.26 0 -66.3015 0 0 0 0 921.43 710.242 0 0 0 0 2169.64 0 2122.18 742.286 0 0 0 0 0 0 0 0 0 0 0 0 0 0 0 0 0 0 1182.52 0 0 0 
1227.07 0 -53.4837 0 0 0 0 0 0 0 0 0 0 267.724 0 2279.05 0 0 0 0 181.356 0 0 0 0 0 0 0 -1943.04 0 1390.65 0 0 0 1937.54 0 628.91 0 0.02 0 0 246.971 0 0 0 -244.072 0 0 -1324.58 0 0 0 63.7074 0 208.975 0 2382.2 2436.83 0 0 0 0 0 0 0 0 0 0 -573.824 0 0 0 0 
0 1876.35 0 0 0 0 0 0 1677.37 2193.44 0 0 0 0 0 -1717.66 0 0 0 0 1444.21 413.755 830.027 0 0 0 0 0 0 -361.415 0 0 0 -1007.49 0 1562.47 0 0 0 0.06 0 0 -99.2615 -555.971 0 854.747 0 0 0 0 0 0 0 0 0 0 0 0 0 0 0 0 0 1402.71 0 0 0 0 0 0 785.318 0 2256.77 
0 0 0 0 0 0 2330.47 -1281.4 0 0 0 0 0 2298.58 0 0 0 0 0 750.221 677.892 620.212 0 0 1317.1 0 0 0 2138.51 0 0 0 0 0 0 -1549.35 773.263 0 0 0 0.02 0 440.001 0 0 0 0 0 0 0 1596.19 0 0 0 0 0 0 0 0 0 -523.011 0 -1409.88 0 0 0 0 0 0 0 0 0 0 
0 -1248.74 1769.69 0 0 0 2240.29 0 1825.39 0 1263.7 915.021 0 0 -1533.17 0 -652.562 558.26 0 1685.77 1686.83 0 0 -349.971 0 0 -914.869 0 0 0 0 0 0 0 0 0 1670.2 1573.92 776.009 0 0 0.01 0 0 0 0 0 0 0 929.823 0 0 0 -325.556 0 0 0 0 0 1779.76 0 0 0 0 0 -1807.69 0 0 0 0 0 0 1145.13 
0 0 0 0 0 0 0 0 0 0 2165.06 0 1777.93 0 0 0 0 0 0 0 -1733.99 179.678 2106.16 0 0 0 20.5237 0 0 0 -2069.23 0 -986.129 0 0 978.805 0 1688.36 0 -2348.78 -1976.61 0 0.09 0 0 499.664 0 0 -1082.72 0 0 716.346 0 0 1967.15 0 0 0 0 0 0 0 336.085 0 0 0 0 0 0 814.158 0 0 0 
0 0 901.746 0 0 0 0 -2477.57 1819.59 0 825.449 1238.52 0 0 0 0 0 0 0 -2289.88 0 0 0 0 0 0 2454.37 0 0 0 0 0 1455.35 234.458 0 0 -1338.77 0 0 1903.97 0 0 0 0.02 0 0 0 0 989.639 0 0 0 0 216.147 0 2113.03 0 0 0 0 0 0 0 0 0 0 0 -1741 -2284.23 0 0 0 -1825.54 
0 0 0 0 0 0 0 0 0 0 572.909 0 -663.549 0 0 649.968 0 0 900.067 0 0 535.218 0 2267.14 0 0 -320.826 0 0 -1824.32 0 1732.15 0 1545.23 -1762.37 0 0 0 0 0 0 0 0 0 0.02 -586.947 0 1352.81 0 0 0 0 0 0 0 0 0 0 0 1505.71 0 0 0 0 0 0 0 0 0 0 0 0 0 
0 -850.78 0 2420.96 0 0 -1078.75 0 -539.796 0 -2457.73 0 2410.12 0 -1449.25 1695.53 186.697 0 0 0 0 0 0 2100.05 518.281 0 0 1982.41 0 0 -1365.78 0 0 -1242.79 0 0 -176.626 0 1076.31 -1551.33 0 0 -427.946 0 -402.463 0.04 0 1655.25 955 0 0 0 0 428.098 34.4096 0 0 731.3 0 0 1838.21 0 -1089.74 0 0 0 0 0 0 516.907 0 -1710.33 0 
2158.04 0 0 0 0 0 -275.048 0 0 0 592.441 0 1301.08 -685.064 0 0 0 0 1459.78 0 0 0 0 0 -2295.83 0 -901.898 1736.43 0 0 192.648 0 0 0 0 0 0 0 0 0 0 0 0 0 0 0 0.09 0 0 -427.488 0 0 0 0 0 0 0 0 0 0 0 1990.65 0 0 0 0 0 0 0 0 0 0 0 
0 0 0 -1088.52 0 1725.29 0 0 0 1474.43 0 0 106.738 0 0 0 0 -395.749 949.965 0 0 347.377 0 0 1941.97 0 0 1432.77 0 0 0 -180.135 0 2142.48 0 979.568 0 -859.325 0 0 0 0 0 0 -983.23 -1630.38 0 0.02 0 648.442 0 0 -1827.52 0 0 0 583.743 0 -511.109 0 0 0 0 0 0 0 0 -1815.32 -1652.35 1837.6 2128.28 -1028.86 0 
0 0 0 -1085.62 0 0 261.925 -1773.66 1380.89 0 0 0 0 0 -1498.69 0 0 0 0 0 0 1795.33 0 0 0 2316.89 0 0 0 -2316.74 -409.635 0 0 0 0 0 0 0 2086.17 0 0 0 2189.32 -1894.97 0 -986.129 0 0 0 0 0 372.097 0 0 0 0 0 -56.5355 0 0 0 0 0 0 0 0 0 0 0 0 0 0 0 
0 0 0 0 0 0 0 0 2036.73 0 0 0 0 0 0 0 0 480.59 1998.43 0 1152.15 0 0 0 983.535 0 248.802 0 1399.66 1355.86 1390.19 1435.82 -658.666 1030.23 1639.07 0 -2339.63 -927.534 0 0 0 185.629 0 0 0 0 -2072.59 -2019.49 0 0.08 0 465.178 0 323.573 0 0 0 0 0 163.656 0 0 0 0 0 0 0 0 0 0 1515.47 0 0 
0 0 0 1695.38 0 -753.731 0 1566.9 0 0 0 -783.334 0 0 2445.83 0 0 133.442 -207.755 1589.33 0 0 -356.38 0 0 2209.77 0 -489.898 0 1037.55 2293.85 0 -525.147 0 0 642.949 0 -993.912 0 0 2296.14 0 0 0 0 0 0 0 0 0 0.06 0 1015.73 -2498.63 2076.1 0 0 0 0 0 0 1850.72 2097.92 0 0 0 0 -118.03 0 0 -1250.57 0 0 
0 0 -1350.98 0 0 0 0 0 2226.4 0 0 0 0 0 0 0 969.802 0 0 0 0 0 0 0 -1910.08 0 0 0 0 0 882.824 869.701 1342.74 -2123.71 0 0 0 0 0 0 0 0 469.146 0 0 0 0 0 -420.316 -50.2792 0 0.01 1482.97 0 636.235 0 0 0 0 0 0 0 0 0 0 0 0 0 0 0 0 0 302.362 
0 0 0 0 0 0 0 924.177 0 0 0 0 0 0 -1887.95 0 0 1741.92 0 0 0 0 -438.017 0 0 0 0 2201.38 0 0 1669.29 461.821 0 0 1939.68 0 0 0 -17.777 0 0 0 0 0 0 0 0 2192.22 0 0 1893.9 -32.7311 0.08 0 0 0 0 0 0 0 0 0 0 0 0 0 0 0 0 0 0 0 887.249 
789.132 0 0 1516.39 1448.03 -1229.82 -1803.87 -4.50148 646.611 0 0 0 -395.444 0 1164.66 0 0 0 0 -1967.15 0 0 0 0 0 0 2036.27 0 157.094 2234.95 1055.1 0 0 0 0 0 0 0 0 0 0 375.759 0 -223.014 0 1900.16 0 0 0 -746.864 670.11 0 0 0.06 0 0 0 0 703.375 0 0 0 0 2171.77 0 1113.24 0 0 0 0 0 0 0 
0 0 0 0 -370.724 0 -1189.38 178.762 0 0 0 0 0 0 0 0 0 0 0 0 0 0 0 0 718.329 0 0 0 0 0 0 0 1616.18 0 0 0 1852.4 0 2073.66 0 0 0 -1457.95 0 0 537.202 0 0 0 0 2485.96 -686.285 0 0 0 0 -77.1355 507.447 0 -2494.51 0 0 0 0 0 0 0 0 0 0 0 0 0 
48.4481 0 0 0 0 0 0 0 0 0 1997.82 1235.77 0 0 0 0 0 0 0 0 0 0 0 0 0 0 0 0 0 2031.24 0 0 0 0 494.781 0 0 0 0 0 0 0 0 345.851 0 0 0 0 0 0 0 0 0 0 0 0.01 0 0 0 0 0 0 0 0 0 0 -969.649 0 0 0 0 -2293.54 0 
0 0 0 0 0 0 0 0 2114.55 0 0 0 0 0 -846.202 0 0 -1840.19 0 0 0 1478.55 0 0 0 0 0 0 0 0 0 0 2499.08 0 0 0 0 0 1013.44 0 0 0 0 0 0 0 0 2210.99 0 0 0 0 0 0 784.249 0 0.08 0 0 774.941 0 0 0 0 0 0 1855.14 1429.72 435.575 0 1932.81 0 1821.12 
0 0 0 0 0 0 97.2777 0 0 0 0 0 0 0 0 0 0 0 0 0 2061.75 -1602.45 0 0 0 0 -1570.25 0 0 0 -417.57 0 0 0 0 0 0 0 916.852 0 0 0 0 0 0 1525.85 0 0 790.201 0 0 0 0 0 1950.51 0 0 0.08 0 0 0 0 0 0 0 0 0 0 0 0 0 -1129.11 0 
0 0 0 0 0 0 0 0 0 0 0 0 0 0 1741.31 0 0 -1832.41 0 0 307.855 0 0 0 1705.76 0 0 0 0 0 0 -684.912 0 -698.492 0 0 0 0 0 0 0 0 0 0 0 0 0 2432.71 0 0 0 0 0 -2232.51 0 0 0 0 0.08 954.39 0 0 0 0 0 0 0 0 0 0.534074 0 0 364.315 
0 0 0 0 0 0 0 0 0 0 0 0 0 0 0 0 0 0 187.918 0 0 0 -1495.18 0 0 1863.08 0 0 0 0 -1062.27 0 0 0 0 0 0 0 0 0 0 -1374.02 0 0 1710.64 0 0 0 0 260.552 0 0 0 0 1567.05 0 1423.15 0 180.288 0.09 0 0 0 0 0 0 0 0 0 0 0 0 0 
0 1935.41 0 0 0 0 0 0 0 0 0 -900.525 0 0 0 0 0 0 0 0 0 0 0 0 -186.697 0 0 0 0 657.903 0 0 0 0 0 -2046.34 0 0 0 0 2097.31 0 0 0 0 715.888 0 0 0 0 0 0 0 0 0 0 0 0 0 0 0.05 0 658.971 0 0 0 0 0 0 1345.18 0 0 0 
0 -1034.96 0 0 0 0 0 0 -341.273 0 0 0 0 0 0 0 0 0 0 0 -1579.87 0 0 0 1686.22 0 0 1371.43 -2027.88 0 0 1602.76 -152.058 0 0 0 0 0 0 0 0 0 0 0 0 0 -1952.35 0 0 0 1847.67 0 0 0 0 0 0 0 0 0 0 0.09 0 0 0 758.614 1419.64 0 0 0 1771.52 0 -1672.34 
0 0 0 0 -2095.48 0 0 0 0 0 0 1058 0 0 0 0 0 0 2491.76 0 0 0 0 0 0 0 0 0 1911.91 516.907 0 0 0 0 0 966.292 0 0 0 0 -2332.45 0 785.928 0 0 -1578.04 0 0 0 0 1010.09 0 0 0 0 0 0 0 0 0 -470.214 0 0.09 0 0 0 0 0 0 0 0 0 0 
0 0 100.94 0 1523.56 0 0 0 0 0 1150.93 0 0 0 0 0 0 0 0 0 0 0 0 0 0 0 0 0 0 0 0 978.957 0 0 0 0 0 0 0 -297.021 0 0 0 0 0 0 0 0 0 0 0 0 0 1415.52 0 0 0 0 0 0 0 0 0 0.07 0 1944.56 -172.201 0 0 -1551.64 0 0 0 
0 0 713.141 0 0 0 0 0 0 0 0 454.192 0 0 0 0 0 0 0 0 0 1583.83 -64.9281 0 0 0 71.4896 0 0 0 0 0 0 0 0 0 -1074.33 0 0 0 0 0 0 0 0 0 0 0 0 0 0 0 0 0 0 0 0 0 0 0 0 0 0 0 0.05 0 0 0 0 0 0 0 0 
0 0 0 0 0 0 0 2303.46 0 0 0 0 0 0 0 0 0 -2233.12 0 -389.34 -1161 0 0 0 0 0 0 0 0 0 1455.96 0 0 0 0 0 0 0 0 0 0 2211.91 0 0 0 0 0 0 0 0 0 0 0 2487.64 0 0 0 0 0 0 0 478.149 0 391.934 0 0.08 0 0 0 0 0 0 0 
0 0 0 0 0 0 0 0 0 0 0 0 0 0 0 0 1027.79 0 777.078 0 0 0 0 0 0 0 0 0 0 -2334.28 0 0 0 0 0 0 0 0 0 0 0 0 0 0 0 0 0 0 0 0 0 0 0 0 0 1294.67 1999.65 0 0 0 0 -2178.49 0 812.784 0 0 0.07 0 0 0 0 0 0 
0 2099.9 0 0 0 0 0 0 0 495.239 0 -2269.13 0 0 -1234.86 0 0 0 0 0 0 1284.14 0 0 0 0 0 0 0 0 0 0 0 0 0 -2075.64 0 0 0 0 0 0 0 329.218 0 0 0 -601.291 0 0 1137.2 0 0 0 0 0 2475.28 0 0 0 0 0 0 0 0 0 0 0.08 0 0 0 0 0 
0 0 0 255.364 0 0 0 0 0 0 0 0 0 0 0 602.359 0 0 0 0 -1225.55 1536.68 0 -1195.94 0 0 2214.65 0 0 -2283.17 0 0 0 0 0 0 1864.91 0 -1351.59 0 0 0 0 -1399.81 0 0 0 506.684 0 0 0 0 0 0 0 0 1607.33 0 0 0 0 0 0 0 0 0 0 0 0.06 0 0 0 0 
0 0 0 0 0 2246.54 0 0 0 0 1197.01 0 0 0 0 0 0 0 0 0 1211.66 0 0 0 0 0 0 0 0 0 0 0 0 0 0 0 0 -338.221 0 0 0 0 -2045.27 0 0 -585.727 0 160.756 0 0 0 0 0 0 0 0 0 0 -814.005 0 -229.575 0 0 548.341 0 0 0 0 0 0.01 0 0 0 
0 0 0 0 0 0 0 0 0 0 0 0 0 0 0 0 0 0 0 0 99.8718 0 1344.72 0 0 0 0 0 0 0 0 0 2118.37 0 0 0 0 0 0 512.329 0 0 0 0 0 0 0 2264.4 0 1885.66 774.789 0 0 0 0 0 1481.44 0 0 0 0 -2028.79 0 0 0 0 0 0 0 0 0.01 0 0 
-1036.94 0 0 0 0 0 0 0 0 0 0 0 0 0 0 0 2177.72 0 0 0 -2327.88 0 0 0 0 0 0 0 0 0 0 0 1094.16 0 5.41704 0 -439.085 0 0 0 0 0 0 0 0 -1791.21 0 313.959 0 0 0 0 0 0 0 914.411 0 698.187 0 0 0 0 0 0 0 0 0 0 0 0 0 0.08 0 
0 0 0 0 0 -2490.23 0 0 0 0 0 0 0 -888.165 0 0 0 0 0 0 0 0 0 0 0 0 0 0 0 0 0 0 0 -320.826 1731.24 0 0 0 0 1468.78 0 171.285 0 -2493.44 0 0 0 0 0 0 0 -1399.35 380.337 0 0 0 2334.28 0 1185.72 0 0 -518.891 0 0 0 0 0 0 0 0 0 0 0.03 
