*Vertices 57
*Matrix 
0.06 0 0 0 -554.292 0 -265.435 0 0 0 0 0 0 0 322.047 0 0 0 620.06 0 0 0 1340.14 -2116.38 2452.39 0 0 0 1758.4 -279.321 1562.78 1336.79 0 0 0 1826.3 0 0 0 0 0 0 0 0 0 -1.44963 0 0 0 0 0 0 0 0 0 0 0 
0 0.04 0 0 -710.242 -38.8348 1562.78 0 0 0 0 0 2371.36 0 0 0 -1726.2 0 0 0 0 -1814.25 0 1786.32 -1290.55 0 0 0 0 5.56963 0 -503.021 882.977 0 0 0 0 -486.999 0 0 0 0 0 0 0 0 144.887 0 0 0 0 0 0 0 1860.79 0 0 
0 0 0.09 0 1609.47 0 0 762.581 0 0 0 -717.566 2383.88 -1391.72 0 -330.287 -561.312 0 2152.39 0 0 0 0 767.922 0 0 0 0 331.66 0 0 0 0 0 -1910.23 0 -99.2615 0 0 0 0 1380.12 0 -846.812 0 0 0 0 0 0 0 0 0 0 0 0 0 
0 0 0 0.03 0 0 0 0 -1487.09 0 0 1651.89 0 0 0 0 0 0 268.029 0 0 0 741.066 1933.58 0 -1629.46 2055.65 0 0 0 0 0 853.221 0 0 0 612.888 0 0 0 -186.392 2442.01 0 1913.28 -1476.41 0 0 0 0 0 0 0 0 0 0 0 0 
280.389 1655.1 1943.04 0 0 49.6689 -2367.4 0 0 1219.44 0 0 0 0 0 2245.32 -1509.37 2143.54 0 0 0 0 0 758.003 0 0 -2393.03 0 0 0 0 0 971.786 0 -232.17 0 0 662.023 551.393 -122.761 0 0 2261.96 0 1321.83 0 0 0 0 0 0 -740.76 0 0 0 0 0 
0 1768.47 0 0 498.138 0.07 2231.44 0 0 -210.349 -2178.33 2494.35 0 0 0 176.931 2150.56 1672.95 0 0 0 0 -1571.02 0 0 0 0 0 0 -2429.35 -658.971 0 1976.91 1786.48 0 0 -2025.89 0 0 0 0 0 0 0 0 -144.581 0 0 0 0 0 -920.82 0 0 1203.73 -154.195 0 
1998.43 -1159.93 0 0 2168.57 -1976.61 0.04 1109.58 1127.28 0 0 0 0 0 0 145.344 737.556 0 0 0 0 0 0 0 0 -869.091 399.869 0 0 0 0 2067.25 957.9 0 -748.085 0 0 0 0 0 -116.81 0 0 0 0 0 0 0 0 0 0 0 0 0 0 0 0 
0 0 -2378.99 0 0 0 646.611 0.03 -985.519 0 2446.9 1625.19 0 0 0 0 0 0 0 2306.67 0 364.467 2469.94 0 1432.62 620.823 0 -1946.24 0 0 0 0 0 0 0 -559.481 0 0 0 0 0 -633.793 0 2448.42 0 0 0 0 1368.07 0 -2092.88 -0.839259 0 0 0 -1927.32 0 
0 0 0 651.952 0 0 -549.409 -1380.28 0.04 0 0 0 0 -1357.39 0 0 1911.91 0 0 1361.51 0 0 0 362.484 0 0 0 0 0 0 0 0 0 2367.24 0 -1699.04 1382.41 1826.3 0 -589.694 0 0 0 0 0 0 0 0 0 0 0 0 0 0 0 0 0 
0 0 0 0 2077.32 1368.68 0 0 0 0.09 -1460.39 0 0 0 0 -440.001 0 -2092.12 2107.23 0 0 0 0 0 0 0 0 -282.067 -25.7118 -836.436 0 0 0 0 -1490.45 0 492.187 1752.14 0 2315.67 0 0 0 0 0 0 553.529 0 0 0 0 0 0 -697.424 0 0 0 
0 0 0 0 0 -643.101 0 -203.94 0 40.9711 0 1579.56 0 0 0 0 1366.39 0 -1532.72 0 0 720.313 0 0 0 0 0 0 0 0 447.478 0 88.7326 0 0 -1147.42 0 2447.81 0 792.947 0 0 0 0 0 0 0 0 0 0 0 0 0 0 0 0 0 
0 0 -2236.32 1970.2 0 2289.12 0 1849.5 0 0 2208.4 0.04 0 0 0 0 0 -2415.46 0 -1766.03 1538.51 0 -2237.69 0 1951.89 0 1637.39 0 0 0 0 0 0 0 0 1508.91 0 1528.9 139.241 0 0 0 -1759.01 443.51 0 0 0 -2318.26 0 2456.51 0 0 0 0 0 0 0 
0 -443.815 127.491 0 0 0 0 0 0 0 0 0 0.01 0 0 0 -765.938 1798.53 0 262.383 0 1560.95 0 -444.884 955.306 0 0 0 0 0 0 0 0 -1089.59 0 0 0 0 0 -1714.15 0 0 1043.96 0 0 0 0 0 0 0 0 0 0 0 0 0 -1314.05 
0 0 1528.29 0 0 0 0 0 -2124.93 0 0 0 0 0.07 0 -1220.21 0 1797.46 0 24.4911 -129.17 337.458 0 2227.93 -940.352 0 0 0 0 0 -97.2777 0 0 -77.8985 0 1800.82 0 0 0 0 0 -1746.65 0 0 0 0 0 0 2079.91 0 0 0 0 0 0 0 0 
1633.27 0 0 0 0 0 0 0 0 0 0 0 0 0 0.02 -2240.44 0 0 0 0 0 0 0 0 0 0 0 0 -1930.98 0 1964.71 0 2428.74 1954.63 510.651 0 0 2340.39 0 0 0 0 218.894 0 0 0 0 0 0 -106.128 0 0 2113.03 0 0 673.772 0 
0 0 1192.13 0 -2287.13 864.971 1084.09 0 0 -850.932 0 0 0 137.104 2271.42 0.04 0 0 -1688.67 0 0 0 0 0 0 0 0 0 0 0 0 0 0 0 0 0 0 0 0 0 0 0 0 -56.3829 0 0 0 0 -850.627 0 0 0 -585.574 0 0 0 0 
0 65.5385 -1383.33 0 -508.515 -1273.31 1893.29 0 2371.82 0 2162.77 0 1213.95 0 0 0 0.02 0 0 0 0 -1611.91 0 0 0 0 0 0 0 0 0 0 0 1548.28 0 0 0 1555.15 0 0 0 -909.833 0 0 0 0 0 0 -605.869 0 0 0 0 0 -436.186 0 0 
0 0 0 0 1538.36 -697.119 0 0 0 1686.22 0 2366.48 -2041.46 -1342.59 0 0 0 0.09 0 0 0 0 0 0 -278.253 0 0 0 0 2197.26 0 0 0 0 0 0 0 0 0 0 0 0 0 0 0 2050.31 0 0 0 0 969.344 0 0 0 0 0 0 
-1407.28 0 77.7459 -1306.57 0 0 0 0 0 -633.488 568.941 0 0 0 0 765.481 0 0 0 0 0 0 992.233 0 -13.3518 0 0 913.8 0 0 -1213.8 -712.226 0 1103.47 224.235 0 0 0 449.767 -336.238 862.072 0 0 0 0 0 0 0 0 0 0 1502.66 0 0 0 0 0 
0 0 0 0 0 0 0 286.645 1276.36 0 0 -2214.65 1608.4 1797.01 0 0 0 0 0 0 0 -2137.44 0 0 1316.95 0 209.281 0 0 -1853.16 0 0 2183.68 288.629 0 0 0 1728.34 1776.86 221.183 0 0 0 0 0 0 0 354.854 0 -190.817 0 0 0 0 0 0 -1408.51 
0 0 0 0 0 0 0 0 0 0 0 848.949 0 1238.98 0 0 0 0 0 0 0.04 0 0 0 0 0 0 0 0 735.42 0 0 -195.7 0 0 0 0 0 1894.67 0 0 786.081 2410.58 0 0 -2077.32 0 0 0 0 0 0 0 0 0 -1842.94 0 
0 369.808 0 0 0 0 0 2313.84 0 0 -83.8496 0 70.1163 1428.04 0 0 2099.75 0 0 -703.07 0 0.08 0 0 0 0 1808.15 0 0 0 0 407.804 0 0 0 0 1127.28 1329.46 0 1009.48 0 0 0 0 0 0 0 0 0 822.398 0 0 0 0 0 0 0 
-995.59 0 0 1027.79 0 2024.37 0 -1038.01 0 0 0 -2425.23 0 0 0 0 0 0 1649.45 0 0 0 0.06 1802.65 0 0 1981.34 0 0 -169.301 0 820.261 0 0 -898.083 181.204 0 0 0 0 0 0 0 -2215.41 0 0 0 0 0 0 0 0 0 0 0 0 0 
343.867 1798.68 -1299.1 -1614.35 2030.17 0 0 0 -1532.41 0 0 0 317.774 1136.13 0 0 0 0 0 0 0 0 2256.77 0 0 0 0 0 0 1122.85 74.2363 0 0 0 0 -964.309 2120.35 1651.89 0 0 0 -767.769 0 0 0 -485.626 0 0 0 0 0 308.161 1845.68 0 0 0 0 
-499.207 982.315 0 0 0 0 0 -1174.89 0 0 0 2026.35 135.884 2431.49 0 0 0 1886.88 -1730.02 548.952 0 0 0 0 0.07 -687.506 0 0 0 -2352.9 0 2474.67 0 1163.59 0 0 2178.95 0 0 0 328.15 0 -1579.87 0 0 0 0 0 0 -1468.47 0 0 0 0 0 0 0 
0 0 0 -1229.67 0 0 1053.12 1831.34 0 0 0 0 0 0 0 0 0 0 0 0 0 0 0 0 1210.14 0.08 -29.0689 2082.96 0 0 0 2085.71 0 0 0 0 0 0 0 0 0 0 0 0 0 0 0 0 0 0 1439.18 0 0 0 0 0 0 
0 0 0 2445.83 -440.458 0 378.201 0 0 0 0 1994.46 0 0 0 0 0 0 0 743.965 0 2347.71 -1050.22 0 0 2416.23 0.08 0 0 0 0 0 -240.41 0 0 0 -150.38 0 0 0 222.709 0 0 2068.77 0 0 0 168.081 0 695.441 1919.08 -1828.75 0 0 0 0 0 
0 0 0 0 0 0 0 2175.74 0 2180.78 0 0 0 0 0 0 0 0 1053.73 0 0 0 0 0 0 2458.8 0 0.07 0 0 0 0 0 0 199.667 0 0 0 1083.18 -145.344 -2.51778 0 0 0 0 0 0 0 0 0 0 0 0 0 0 0 0 
1796.09 0 1028.09 0 0 0 0 0 0 -665.227 0 0 0 0 20.8289 0 0 0 0 0 0 0 0 0 0 0 0 0 0.06 -612.43 0 0 0 0 0 0 0 0 0 621.433 0 0 2183.22 0 0 0 0 0 0 0 0 0 0 0 -231.559 0 0 
-419.095 584.811 0 0 0 1701.18 0 0 0 109.943 0 0 0 0 0 0 0 -428.098 0 2215.57 -828.349 0 2247.61 1861.09 1910.84 0 0 0 1066.39 0.07 -1509.06 0 0 -1471.98 2113.94 0 -181.356 0 -1985 -1567.96 0 148.396 0 0 88.7326 0 2335.81 0 0 0 0 0 0 0 0 0 0 
589.389 0 0 0 0 1312.07 0 0 0 0 -1617.71 0 0 -1348.38 1638.92 0 0 0 1432.62 0 0 0 0 1568.27 0 0 0 0 0 1794.11 0.03 2029.86 0 0 0 0 0 0 0 -227.439 0 232.627 0 0 2045.43 0 0 0 0 0 0 0 596.561 0 0 0 1382.72 
1683.32 2329.86 0 0 0 0 -738.777 0 0 0 0 0 0 0 0 0 0 0 1290.4 0 0 673.62 1399.81 0 2448.88 349.818 0 0 0 0 -1643.5 0.08 0 0 0 0 2066.94 0 -1115.07 0 0 0 0 -1128.96 0 0 0 0 0 0 0 0 0 0 0 0 -2491 
0 -436.186 0 -55.4674 596.103 -1722.08 1434.45 0 0 0 964.919 0 0 0 516.144 0 0 0 0 1482.51 1924.73 0 0 0 0 0 489.746 0 0 0 0 0 0.06 0 -2488.1 0 0 0 0 0 0 0 0 0 0 0 0 0 0 0 0 0 0 730.384 0 0 0 
0 0 0 0 0 -75.1518 0 0 -2355.49 0 0 0 2153 1690.34 21.897 0 -826.06 0 -297.021 1046.4 0 0 0 0 70.1163 0 0 0 0 1802.96 0 0 0 0.03 0 0 -1429.56 0 0 0 0 0 0 -2027.73 0 -140.004 983.383 -334.407 0 0 2047.87 0 0 0 0 0 0 
0 0 -1233.33 0 -4.34889 0 1342.13 0 0 782.266 0 0 0 0 -1701.79 0 0 0 1221.27 0 0 0 -596.866 0 0 0 0 1118.12 0 1706.37 0 0 -2480.77 0 0.01 0 2123.1 0 0 -276.421 -194.479 -684.759 0 -785.928 0 0 -313.959 0 0 0 0 0 0 0 0 0 0 
-1721.17 0 0 0 0 0 0 -1873.91 -330.897 0 2191.31 -172.964 0 2018.42 0 0 0 0 0 0 0 0 1711.25 654.546 0 0 0 0 0 0 0 0 0 0 0 0.06 0 0 0 0 0 0 0 0 0 0 0 0 0 0 0 0 0 0 0 0 0 
0 0 -1372.19 2347.87 0 2077.62 0 0 599.46 -865.276 0 0 0 0 0 0 0 0 0 0 0 -1160.85 0 -2043.44 1677.53 0 -1158.71 0 0 -1745.89 0 1003.37 0 2473.3 -1825.54 0 0.09 0 0 0 1165.88 -823.771 1975.23 0 0 0 0 0 0 0 0 0 0 0 0 0 0 
0 730.537 0 0 894.574 0 0 0 -999.71 1709.42 1972.18 2042.07 0 0 -2053.97 0 -266.961 0 0 -1990.04 0 1779.92 0 1299.1 0 0 0 0 0 0 0 0 0 0 0 0 0 0.02 0 0 0 0 0 0 0 0 0 0 0 0 0 0 929.365 0 -23.5755 0 0 
0 0 0 0 -362.941 0 0 0 0 0 0 1229.82 0 0 0 0 0 0 1127.28 1024.43 425.657 0 0 0 0 0 0 996.048 0 299.005 0 644.322 0 0 0 0 0 0 0.09 0 0 0 0 0 -2396.08 0 0 0 0 0 0 0 0 0 0 0 0 
0 0 0 0 2455.29 0 0 0 -1265.37 -790.201 -1776.41 0 -323.573 0 0 0 0 0 1607.33 -814.158 0 1074.18 0 0 0 0 0 249.26 646.153 -996.048 2188.56 0 0 0 2003.16 0 0 0 0 0.03 0 0 0 -1364.71 -147.328 0 0 559.633 0 0 -97.1252 57.2985 0 0 0 0 0 
0 0 0 354.244 0 0 2112.26 0 0 0 0 0 0 0 0 0 0 0 2247.92 0 0 0 0 0 -474.334 0 1669.29 -625.095 0 0 0 0 0 0 365.688 0 381.71 0 0 0 0.09 -369.503 0 0 0 0 0 0 0 0 0 0 0 -2070.91 0 0 0 
0 0 556.124 1276.21 0 0 0 1136.74 0 0 0 0 0 -442.289 0 0 991.47 0 0 0 -77.1355 0 0 1650.06 0 0 0 0 0 2349.54 718.482 0 0 0 -1121.17 0 725.959 0 0 0 800.729 0.07 0 0 0 0 0 0 0 0 0 0 0 0 0 0 0 
0 0 0 0 463.958 0 0 0 0 0 0 2191.61 -1982.25 0 2296.29 0 0 0 0 0 549.257 0 0 0 1808.91 0 0 0 120.777 0 0 0 0 0 0 0 -1035.57 0 0 0 0 0 0 0 0 0 0 0 0 0 0 0 547.121 0 0 0 1142.99 
0 0 1191.67 -1369.29 0 0 0 2299.65 0 0 0 -1427.12 0 0 0 -546.968 0 0 0 0 0 0 1303.37 0 0 0 1112.32 0 0 0 0 2004.38 0 -16.0985 -1770.91 0 0 0 0 1401.03 0 0 0 0.03 869.701 0 0 0 0 0 0 0 0 0 1797.31 0 0 
0 0 0 -1864.76 944.014 0 0 0 0 0 0 0 0 0 0 0 0 0 0 0 0 0 0 0 0 0 0 0 0 1802.04 -790.811 0 0 0 0 0 0 0 -100.33 1734.14 0 0 0 2143.54 0.05 0 0 0 0 0 0 0 -1459.62 0 0 886.639 955.763 
1777.17 0 0 0 0 1743.29 0 0 0 0 0 0 0 0 0 0 0 -2463.68 0 0 828.043 0 0 642.491 0 0 0 0 0 0 0 0 0 -78.9666 0 0 0 0 0 0 0 0 0 0 0 0.06 0 -401.395 0 0 0 0 167.776 2083.42 0 19.7607 0 
0 -1399.5 0 0 0 0 0 0 0 1387.3 0 0 0 0 0 0 0 0 0 0 0 0 0 0 0 0 0 0 0 2324.21 0 0 0 909.68 1838.21 0 0 0 0 0 0 0 0 0 0 0 0.06 0 -2084.8 0 0 0 -214.011 0 0 0 0 
0 0 0 0 0 0 0 0 0 0 0 2365.72 0 0 0 0 0 0 0 2036.12 0 0 0 0 0 0 -264.672 0 0 0 0 0 0 2053.36 0 0 0 0 0 1199.61 0 0 0 0 0 2088.46 0 0 0 0 0 0 0 0 657.75 0 0 
0 0 0 0 0 0 0 -1302.76 0 0 0 0 0 912.732 0 -1543.4 1410.18 0 0 0 0 0 0 0 0 0 0 0 0 0 0 0 0 0 0 0 0 0 0 0 0 0 0 0 0 0 2181.08 0 0 0 0 1245.38 0 0 0 0 0 
0 0 0 0 0 0 0 0 0 0 0 2425.38 0 0 -2192.53 0 0 0 0 -994.522 0 1295.59 0 0 1256.98 0 -1176.72 0 0 0 0 0 0 0 0 0 0 0 0 0 0 0 0 0 0 0 0 0 0 0.01 0 0 0 0 0 0 0 
0 0 0 0 0 0 0 -2350.92 0 0 0 0 0 0 0 0 0 2186.27 0 0 0 0 0 0 0 1887.65 2357.63 0 0 0 0 0 0 -324.335 0 0 0 0 0 1030.99 0 0 0 0 0 0 0 0 0 0 0.08 0 0 -2432.55 0 0 0 
0 0 0 0 -582.98 1123.31 0 1128.04 0 0 0 0 0 0 0 0 0 0 1716.74 0 0 0 0 2353.97 0 0 824.686 0 0 0 0 0 0 0 0 0 0 0 0 -2199.55 0 0 0 0 0 0 0 0 1049.61 0 0 0.05 0 0 0 0 0 
0 0 0 0 0 0 0 0 0 0 0 0 0 0 2365.57 5.72222 0 0 0 0 0 0 0 2433.93 0 0 0 0 0 0 456.938 0 0 0 0 0 0 1861.86 0 0 0 0 -56.6881 0 -2081.29 714.82 2322.38 0 0 0 0 0 0.04 -451.445 0 0 0 
0 0 0 0 0 0 0 0 0 -1136.28 0 0 0 0 0 0 0 0 0 0 0 0 0 0 0 0 0 0 0 0 0 0 -42.8022 0 0 0 0 0 0 0 -2187.64 0 0 0 0 2347.56 0 0 0 0 1596.8 0 1820.96 0.09 0 0 0 
0 -413.144 0 0 0 -124.897 0 0 0 0 0 0 0 0 0 0 1152.61 0 0 0 0 0 0 0 0 0 0 0 1958.75 0 0 0 0 0 0 0 0 -439.543 0 0 0 0 0 2085.41 0 0 0 831.095 0 0 0 0 0 0 0.07 0 0 
0 0 0 0 0 2138.51 0 1571.02 0 0 0 0 0 0 -1854.84 0 0 0 0 0 -259.178 0 0 0 0 0 0 0 0 0 0 0 0 0 0 0 0 0 0 0 0 0 0 0 -873.821 -938.52 0 0 0 0 0 0 0 0 0 0.02 0 
0 0 0 0 0 0 0 0 0 0 0 0 1927.32 0 0 0 0 0 0 1600.92 0 0 0 0 0 0 0 0 0 0 -1836.38 484.863 0 0 0 0 0 0 0 0 0 0 -505.768 0 1383.94 0 0 0 0 0 0 0 0 0 0 0 0.07 
