*Vertices 48
*Matrix 
0.07 0 0 0 0 0 0 0 0 1437.04 0 395.749 -274.285 0 0 0 0 343.41 0 0 0 0 0 0 0 0 0 0 0 2148.58 0 -684.454 -750.069 966.903 0 1524.48 0 0 0 0 0 0 0 0 0 0 0 0 
0 0.05 0 0 0 0 0 0 0 -321.741 0 0 0 0 0 0 85.8333 0 1620.76 0 0 0 0 0 0 0 0 0 0 0 0 -888.012 0 -1564.15 537.965 0 0 0 0 0 0 0 1793.04 438.322 0 0 0 0 
0 0 0.02 565.127 0 0 0 0 0 0 0 0 0 308.161 2370.6 0 0 0 286.492 0 0 -2231.44 1783.12 0 -1418.88 1112.32 0 0 0 0 293.817 0 0 0 0 0 0 -478.301 0 0 0 0 -2126.61 0 0 0 0 0 
0 0 -499.054 0.03 0 0 0 0 0 0 0 0 0 0 0 0 0 1205.1 0 0 0 0 0 687.048 0 0 0 0 0 0 0 0 0 0 0 1543.86 0 0 0 0 0 0 0 0 0 0 0 0 
0 0 0 0 0.09 0 0 -443.205 0 0 -297.479 0 0 0 2348.63 0 0 0 0 0 0 1390.65 0 0 0 0 355.617 0 0 929.06 0 0 0 0 0 0 0 0 0 1145.74 0 -174.795 1248.13 0 2111.19 0 0 0 
0 0 0 0 0 0 0 0 -626.316 0 0 0 -826.518 124.134 0 789.438 595.492 0 1885.05 0 0 0 0 0 0 0 0 0 0 455.87 -16.8615 -1105.91 659.886 0 0 0 0 0 0 0 0 0 0 987.35 0 0 0 0 
0 0 0 0 0 0 0.09 0 0 0 0 0 0 0 0 0 0 0 0 0 0 0 0 0 0 0 0 1130.63 0 -248.955 0 0 0 0 0 0 0 0 0 0 0 0 0 0 2295.53 -1182.67 0 0 
0 0 0 0 2038.87 0 0 0 0 0 0 0 0 0 0 2181.23 0 0 1809.06 0 0 0 0 0 0 0 0 0 0 0 0 0 0 0 0 0 0 0 -1924.57 0 0 0 0 0 0 0 0 0 
0 0 0 0 0 785.775 0 0 0.04 1084.86 0 0 0 0 0 0 0 0 0 0 0 0 0 0 0 -2179.4 0 0 2107.68 0 0 -292.444 0 0 0 0 0 0 0 0 885.113 0 1275.14 0 2129.05 0 0 0 
-578.555 1619.54 0 0 0 0 0 0 370.418 0.05 0 0 0 0 1098.28 0 0 2432.55 484.405 -2128.28 0 0 0 0 0 0 0 0 0 0 0 0 0 0 0 0 0 1270.1 0 -1730.02 0 0 0 0 0 0 0 0 
0 0 0 0 -1049.15 0 0 0 0 0 0.08 1904.74 0 1623.05 0 0 0 0 0 0 0 0 928.602 0 0 0 0 0 0 2202.75 0 0 0 0 0 0 0 0 0 0 0 0 0 0 -56.9933 0 0 0 
-51.5 0 0 0 0 0 0 0 0 0 -1033.59 0.03 0 0 0 1927.47 0 0 0 0 0 0 0 0 0 0 1753.67 0 0 0 -882.061 0 0 0 0 0 0 0 0 0 1448.18 -286.645 0 0 0 0 0 0 
1869.03 0 0 0 0 -736.946 0 0 0 0 0 0 0.06 0 0 0 0 0 0 0 0 0 -345.393 0 0 0 1141.01 0 0 0 0 0 0 0 -1411.4 0 1108.05 0 0 0 -213.095 0 0 0 2092.27 0 0 0 
0 0 -1875.29 0 0 188.528 0 0 0 0 2273.09 0 0 0.07 0 0 0 0 0 0 -1017.41 0 0 1698.43 0 0 -1382.11 0 0 1853.47 0 0 0 0 0 0 946.608 0 0 1519.14 0 0 0 0 0 0 0 0 
0 0 -121.387 0 565.889 0 0 0 0 698.34 0 0 0 0 0.07 0 0 0 0 0 0 473.571 0 0 0 0 459.99 1178.4 0 0 0 0 0 0 0 0 1557.89 0 0 0 0 0 0 0 2330.32 2000.72 0 0 
0 0 0 0 0 2252.34 0 -2260.43 0 0 0 -311.365 0 0 0 0.04 0 0 446.104 0 917.005 0 0 1536.53 0 1607.03 0 0 0 0 -394.528 0 0 0 1388.36 0 0 0 0 331.965 0 0 0 0 0 0 0 0 
0 1818.67 0 0 0 2461.39 0 0 0 0 0 0 0 0 0 0 0.07 0 0 0 0 0 0 0 0 0 0 2034.59 -63.86 0 0 0 0 935.774 0 0 0 0 -1941.82 0 0 0 0 0 0 0 0 0 
1700.72 0 0 1658.6 0 0 0 0 0 834.452 0 0 0 0 0 0 0 0 0 0 0 0 0 1752.3 0 0 0 0 0 0 0 0 0 0 1043.66 0 0 0 0 0 -1871.32 0 0 0 0 0 -299.768 0 
0 1163.14 2260.58 0 0 -1196.25 0 1810.74 0 2191.76 0 0 0 0 0 1869.03 0 0 0.02 0 0 0 0 0 0 0 0 0 0 0 0 0 -333.186 0 1325.04 0 0 0 0 0 0 0 0 -1702.86 0 0 0 0 
0 0 0 0 0 0 0 0 0 -1448.64 0 0 0 0 0 0 0 0 0 0.07 1914.5 0 0 0 2347.25 0 0 0 0 0 0 0 0 0 0 0 0 0 0 0 911.969 2015.06 0 0 0 0 0 0 
0 0 0 0 0 0 0 0 0 0 0 0 0 867.718 0 209.433 0 0 0 751.137 0.07 2340.85 1052.05 0 0 0 204.703 0 0 0 0 0 0 0 0 0 0 1207.85 0 0 -2489.01 0 -983.993 0 0 0 0 0 
0 0 778.298 0 379.879 0 0 0 0 0 0 0 0 0 -1841.56 0 0 0 0 0 1323.97 0.04 0 0 0 2169.48 0 0 0 0 0 0 0 0 397.58 0 0 0 0 0 0 0 0 0 0 259.636 0 0 
0 0 -720.008 0 0 0 0 0 0 0 693.304 0 96.82 0 0 0 0 0 0 0 -166.402 0 0.03 0 0 0 0 0 0 0 0 0 1681.8 0 2026.2 0 0 780.74 0 0 0 0 0 0 0 0 0 0 
0 0 0 -1287.04 0 0 0 0 0 0 0 0 0 812.174 0 -1818.06 0 1042.74 0 0 0 0 0 0 0 0 0 0 1691.72 0 0 0 0 0 0 0 0 0 0 0 0 0 0 2011.09 0 0 0 0 
0 0 576.724 0 0 0 0 0 0 0 0 0 0 0 0 0 0 0 0 1810.59 0 0 0 0 0.01 0 0 -1269.65 0 0 0 0 0 1161 0 0 0 0 0 0 1853.31 0 0 0 868.328 0 0 0 
0 0 -785.47 0 0 0 0 0 1048.69 0 0 0 0 0 0 355.464 0 0 0 0 0 -423.826 0 0 0 0.03 0 0 0 0 0 0 0 0 1627.63 -1728.8 0 0 0 0 0 0 0 0 0 0 0 0 
0 0 0 0 825.449 0 0 0 0 0 0 2135.61 1537.29 -505.158 1981.95 0 0 0 0 0 -455.107 0 0 0 0 0 0.06 0 0 0 0 2224.27 0 0 -954.39 0 0 0 0 0 0 0 0 0 -2267.3 0 0 0 
0 0 0 0 0 0 -939.741 0 0 0 0 0 0 0 1686.07 0 -2497.56 0 0 0 0 0 0 0 2325.13 0 0 0.08 0 0 0 0 0 0 0 0 0 0 0 2473.91 0 0 0 0 0 0 0 0 
0 0 0 0 0 0 0 0 38.5296 0 0 0 0 0 0 0 480.285 0 0 0 0 0 0 1586.58 0 0 0 0 0.05 0 0 0 0 0 0 0 0 0 0 0 0 0 68.5903 0 0 0 0 0 
-308.466 0 0 0 841.166 1125.75 873.363 0 0 0 -204.398 0 0 -371.334 0 0 0 0 0 0 0 0 0 0 0 0 0 0 0 0.04 0 0 0 2298.88 0 0 0 0 0 0 0 0 0 0 0 0 0 0 
0 0 899.457 0 0 614.566 0 0 0 0 0 -1157.8 0 0 0 1970.81 0 0 0 0 0 0 0 0 0 0 0 0 0 0 0.05 0 0 0 0 0 0 0 0 0 -702.612 1240.04 -2357.94 0 0 1950.36 0 0 
-843.76 647.984 0 0 0 1269.95 0 0 1760.69 0 0 0 0 0 0 0 0 0 0 0 0 0 0 0 0 0 2289.27 0 0 0 0 0.03 0 2134.69 0 0 0 0 0 0 0 2326.5 0 0 -156.026 0 0 0 
2181.84 0 0 0 0 2118.21 0 0 0 0 0 0 0 0 0 0 0 0 1862.32 0 0 0 -519.349 0 0 0 0 0 0 0 0 0 0.04 0 0 0 0 0 0 0 0 0 0 0 0 0 0 0 
514.924 103.534 0 0 0 0 0 0 0 0 0 0 0 0 0 0 -619.297 0 0 0 0 0 0 0 2290.64 0 0 0 0 2250.21 0 1519.75 0 0.02 0 0 0 0 0 0 0 0 0 870.006 0 0 0 0 
0 -2153.16 0 0 0 0 0 0 0 0 0 0 -68.2852 0 0 1595.28 0 1945.02 837.504 0 0 -724.281 1774.27 0 0 189.749 -577.029 0 0 0 0 0 0 0 0.01 0 0 0 0 0 0 0 0 0 2092.12 0 0 0 
-30.4422 0 0 2406.61 0 0 0 0 0 0 0 0 0 0 0 0 0 0 0 0 0 0 0 0 0 -1167.87 0 0 0 0 0 0 0 0 0 0.06 0 0 0 0 0 0 0 0 0 0 0 0 
0 0 0 0 0 0 0 0 0 0 0 0 535.829 -1587.5 2227.01 0 0 0 0 0 0 0 0 0 0 0 0 0 0 0 0 0 0 0 0 0 0.03 0 0 0 0 0 0 1027.79 0 0 0 0 
0 0 1496.25 0 0 0 0 0 0 2280.57 0 0 0 0 0 0 0 0 0 0 1442.23 0 97.4303 0 0 0 0 0 0 0 0 0 0 0 0 0 0 0.05 0 0 -996.658 580.691 0 0 0 0 0 0 
0 0 0 0 0 0 0 -238.884 0 0 0 0 0 0 0 0 2289.88 0 0 0 0 0 0 0 0 0 0 0 0 0 0 0 0 0 0 0 0 0 0.02 0 0 0 0 0 0 0 0 0 
0 0 0 0 862.529 0 0 0 0 620.212 0 0 0 -1980.42 0 -773.721 0 0 0 0 0 0 0 0 0 0 0 2223.96 0 0 0 0 0 0 0 0 0 0 0 0.01 0 0 0 0 0 0 0 0 
0 0 0 0 0 0 0 0 -2303.92 0 0 1619.39 1384.85 0 0 0 0 2288.81 0 -334.712 661.87 0 0 0 -497.986 0 0 0 0 0 -1643.8 0 0 0 0 0 0 2128.59 0 0 0 0 0 731.605 0 0 0 0 
0 0 0 0 -2482.76 0 0 0 0 0 0 2375.48 0 0 0 0 0 0 0 -451.445 0 0 0 0 0 0 0 0 0 0 614.414 594.577 0 0 0 0 0 297.174 0 0 0 0.03 0 0 0 0 0 0 
0 2443.39 1782.66 0 1388.21 0 0 0 -2434.39 0 0 0 0 0 0 0 0 0 0 0 1089.13 0 0 0 0 0 0 0 1525.54 0 2268.52 0 0 0 0 0 0 0 0 0 0 0 0.01 -2465.21 0 2030.02 0 0 
0 25.7118 0 0 0 1665.01 0 0 0 0 0 0 0 0 0 0 0 0 1229.67 0 0 0 0 515.839 0 0 0 0 0 0 0 0 0 -666.143 0 0 -333.949 0 0 0 1068.99 0 104.297 0.02 0 0 0 0 
0 0 0 0 -2127.22 0 285.272 0 1556.52 0 1817.45 0 1122.55 0 2321.01 0 0 0 0 0 0 0 0 0 917.158 0 -2287.13 0 0 0 0 406.583 0 0 536.592 0 0 0 0 0 0 0 0 0 0.08 0 0 0 
0 0 0 0 0 0 1587.04 0 0 0 0 0 0 0 978.042 0 0 0 0 0 0 -1201.44 0 0 0 0 0 0 0 0 -685.98 0 0 0 0 0 0 0 0 0 0 0 837.809 0 0 0.06 0 1563.84 
0 0 0 0 0 0 0 0 0 0 0 0 0 0 0 0 0 984.603 0 0 0 0 0 0 0 0 0 0 0 0 0 0 0 0 0 0 0 0 0 0 0 0 0 0 0 0 0 0 
0 0 0 0 0 0 0 0 0 0 0 0 0 0 0 0 0 0 0 0 0 0 0 0 0 0 0 0 0 0 0 0 0 0 0 0 0 0 0 0 0 0 0 0 0 451.598 0 0.04 
