*Vertices 50
*Matrix 
0 0 0 -953.932 0 0 2105.09 2485.66 0 0 0 299.31 0 1234.09 0 0 0 0 -1191.06 0 640.507 0 0 0 -1182.36 896.557 0 0 0 0 0 0 0 0 0 775.552 1781.75 0 0 0 0 0 0 0 0 0 0 0 0 2283.62 
0 0.05 0 0 0 0 0 1658.3 0 0 0 0 -1483.12 0 -192.19 1896.8 0 0 0 0 1453.98 0 2487.49 0 -2076.86 0 0 0 0 243.919 0 0 -783.181 0 0 0 0 0 243.919 0 0 0 0 -2141.25 0 0 0 0 0 0 
0 0 0.09 -749.306 0 0 2175.28 0 0 0 -149.159 255.364 0 0 0 0 0 0 1272.39 0 0 0 -1633.58 0 0 0 0 0 0 0 0 0 0 1542.02 0 0 0 0 0 0 0 0 224.998 1108.81 0 0 0 0 0 0 
503.784 0 1188.31 0.01 0 0 1376.77 492.645 0 0 -1002.61 0 0 -902.203 0 2381.59 0 1381.19 -1786.94 0 0 0 0 0 0 0 2337.95 0 0 0 -1477.63 0 0 0 0 0 0 1139.18 0 0 0 0 0 -537.355 0 125.813 0 2289.73 0 0 
0 0 0 0 0 0 0 0 0 0 1324.27 1040.15 0 0 1902.75 -886.639 0 -283.441 1171.68 0 0 647.832 0 0 1329.31 -1381.95 0 0 0 0 0 0 0 0 0 0 0 1644.26 0 -2458.04 0 0 0 0 0 0 0 0 0 0 
0 0 0 0 0 0.08 1560.34 0 0 -1621.37 2116.69 0 0 0 0 0 0 1099.35 -2394.41 2439.57 0 0 -2332.61 0 1706.21 0 -231.864 0 0 1970.5 0 0 0 -1649.6 0 0 0 0 0 0 2410.89 2019.94 0 0 0 -220.878 0 0 0 0 
2201.53 0 53.1785 2048.48 0 1423.31 0.03 516.449 0 1571.02 0 0 195.853 0 -50.4318 0 0 0 0 396.817 0 887.555 2165.67 1359.52 0 0 0 -414.365 0 432.218 0 0 0 0 0 0 0 0 0 0 0 0 0 0 0 0 0 0 0 0 
2337.49 -1249.35 0 645.543 0 0 -1021.84 0.07 0 0 0 0 0 0 0 0 0 0 1299.4 0 -542.543 826.518 2098.38 153.432 1717.51 -540.559 0 0 0 0 0 0 0 1454.44 0 0 0 0 -489.593 0 0 1927.17 0 0 0 0 0 0 0 0 
0 0 0 0 0 0 0 0 0.01 0 197.378 0 0 0 0 0 2432.55 -539.338 0 0 0 733.894 0 0 0 0 0 1657.38 2036.42 0 0 0 0 0 0 0 0 0 0 0 0 0 0 0 0 0 0 0 0 0 
0 0 0 0 0 2094.56 393.307 0 0 0.07 0 0 0 0 0 -447.02 0 0 277.795 0 1350.67 0 0 -586.337 0 0 0 0 0 0 0 0 0 0 0 2417.6 0 0 0 -158.467 0 -879.925 0 0 0 0 0 0 0 0 
0 0 -1389.74 1005.05 2366.48 2133.47 0 0 1624.12 0 0.05 0 0 0 0 0 0 0 0 0 0 0 0 2358.7 -1393.25 1573.46 -2247.92 0 0 0 0 0 0 0 0 0 0 269.097 0 0 0 0 0 0 0 0 0 0 -675.451 594.729 
-2342.22 0 2066.48 0 1022.9 0 0 0 0 0 0 0.03 0 0 155.721 0 0 0 0 0 2381.59 0 0 0 731.91 0 0 0 0 0 0 2151.48 0 641.118 0 1643.04 0 0 0 0 0 0 0 0 0 0 0 0 0 0 
0 -244.224 0 0 0 0 321.894 0 0 0 0 0 0 0 197.226 216.91 0 0 0 -379.574 0 0 2347.25 2463.07 -1622.9 1735.82 187.002 756.325 0 0 0 0 0 0 0 0 0 0 0 2354.27 2070.3 0 0 0 0 0 0 0 0 0 
-322.047 0 0 -46.1592 0 0 0 0 0 0 0 0 0 0.02 1030.08 -867.87 0 0 2158.8 0 0 -6.18 -452.361 959.273 0 0 0 2237.08 0 0 0 0 0 0 0 0 0 0 0 0 0 0 0 0 0 0 0 0 0 0 
0 1772.29 0 0 -1573.92 0 1078.45 0 0 0 0 -1927.63 301.904 2414.4 0.02 0 0 431.761 1166.49 1073.11 0 0 0 0 -1304.28 0 0 1902.3 0 0 0 0 0 1195.79 0 0 0 0 0 1392.48 0 0 -1485.26 0 0 0 0 0 -1636.02 -496.307 
0 396.512 0 -995.59 -1935.71 0 0 0 0 -1431.85 0 0 1142.38 -310.45 0 0 1493.65 0 0 961.715 2138.36 2162.92 -1589.48 0 2149.04 0 0 2060.38 1329.62 0 -727.943 0 0 0 0 0 -1368.22 0 0 0 0 0 -2493.9 0 0 0 0 0 -1969.44 0 
0 0 0 0 0 0 0 0 -1208.76 0 0 0 0 0 0 300.073 0.08 0 0 1552.71 939.894 1554.23 0 0 1229.51 0 0 0 0 0 0 0 0 0 0 0 0 0 0 -548.646 0 0 0 0 0 0 0 0 0 0 
0 0 0 -981.246 776.62 2068.16 0 0 1414.91 0 0 0 0 0 799.356 0 0 0.08 -1493.35 1615.27 0 0 1418.42 -1129.26 0 1723 -2493.13 0 0 1850.41 0 0 432.524 0 0 0 0 0 0 0 0 0 0 0 0 877.636 0 0 0 0 
-289.239 0 1468.32 -395.596 1013.6 1635.26 0 1978.9 0 -556.581 0 0 0 2092.58 1539.89 0 0 821.482 0.05 0 -61.5711 0 2233.88 -1097.98 0 0 0 0 0 0 -64.6229 0 -2477.11 0 0 0 0 0 0 0 -1490.3 0 0 0 0 0 0 0 0 0 
0 0 0 0 0 1060.14 2492.98 0 0 0 0 0 -665.38 0 -527.741 1293.91 -2238.3 1655.25 0 0.08 593.661 1258.81 -1581.85 479.675 0 1936.93 0 -370.418 0 0 0 0 0 0 0 0 0 0 0 0 0 0 0 0 0 0 0 0 1596.8 0 
1203.57 2257.23 0 0 0 0 0 851.085 0 184.561 0 1359.37 0 0 0 -316.248 2323.15 0 -236.747 550.172 0.05 431.761 828.806 2184.74 0 0 0 0 0 0 0 0 0 0 0 0 0 0 0 0 0 0 0 0 1175.5 0 0 0 0 0 
0 0 0 0 -2310.17 0 2417.45 -2260.28 354.549 0 0 0 0 1972.49 0 2174.37 503.479 0 0 2352.29 276.116 0.02 0 0 -896.252 0 1180.53 0 0 0 0 0 0 0 1470.92 0 0 0 0 0 0 0 0 0 0 0 0 -1428.65 0 0 
0 1450.16 -1334.8 0 0 -1918.78 116.504 455.565 0 0 0 0 1778.39 -811.258 0 -1821.27 0 -227.592 2000.11 876.263 2089.22 0 0.07 0 0 0 0 29.3741 -2339.32 0 0 0 0 0 2390.74 0 0 0 0 0 0 0 0 0 0 0 0 0 0 0 
0 0 0 0 0 0 1741.46 680.029 0 2425.69 2175.44 0 -315.332 -628.3 0 0 0 1641.36 693.609 107.349 1551.79 0 0 0.05 0 -1571.63 0 -246.361 0 0 0 0 0 0 -1123.46 -1536.99 72.2526 -914.563 0 0 0 0 0 0 0 668.126 -2223.96 0 0 0 
-595.035 -1231.5 0 0 1873.61 -1037.71 0 1389.74 0 0 189.749 1275.29 -737.709 0 2487.18 -489.746 573.367 0 0 0 0 324.335 0 0 0.05 0 0 0 0 0 0 0 0 0 0 0 0 0 -878.552 0 0 0 0 1784.8 -1337.24 0 931.196 0 0 1812.27 
-2105.85 0 0 0 -8.46889 0 0 2130.73 0 0 1118.88 0 2210.68 0 0 0 0 -162.435 0 113.605 0 0 0 -785.47 0 0.01 -745.186 0 0 0 0 0 0 0 0 0 0 0 0 0 0 2322.84 761.361 0 0 0 2191.31 0 1421.02 -2286.83 
0 0 0 -1374.17 0 1751.38 0 0 0 0 -234.001 0 1192.74 0 0 0 0 -1635.26 0 0 0 1390.19 0 0 0 267.113 0.03 1341.06 0 0 0 0 0 0 0 0 0 0 1397.21 0 0 0 0 0 0 0 0 0 0 0 
0 0 0 0 0 0 1411.25 0 891.369 0 0 0 -1064.41 -1352.81 1907.64 1481.9 0 0 0 1454.74 0 0 -1679.51 -49.9741 0 0 1140.1 0.08 0 0 0 0 0 0 0 0 0 0 0 0 0 0 0 -192.953 0 0 0 0 0 0 
0 0 0 0 0 0 0 0 -1558.96 0 0 0 0 0 0 -370.418 0 0 0 0 0 0 2240.9 0 0 0 0 0 0.02 0 0 845.592 0 0 0 1824.02 0 0 0 0 -178.762 0 0 0 -320.215 0 0 0 -583.895 -657.598 
0 1687.6 0 0 0 1009.32 655.309 0 0 0 0 0 0 0 0 0 0 135.121 0 0 0 0 0 0 0 0 0 0 0 0.03 0 0 -1042.89 0 0 0 0 0 0 0 0 0 0 0 0 0 0 0 0 0 
0 0 0 519.196 0 0 0 0 0 0 0 0 0 0 0 882.061 0 0 1971.88 0 0 0 0 0 0 0 0 0 0 0 0.01 0 0 0 0 0 -1139.33 0 0 0 0 0 1534.09 -1729.41 0 0 0 0 0 0 
0 0 0 0 0 0 0 0 0 0 0 1533.48 0 0 0 0 0 0 0 0 0 0 0 0 0 0 0 0 2089.53 0 0 0.01 -1371.88 0 0 0 0 0 0 0 0 0 0 0 0 0 0 1115.99 0 0 
0 1421.17 0 0 0 0 0 0 0 0 0 0 0 0 0 0 0 -196.921 2265.47 0 0 0 0 0 0 0 0 0 0 -786.538 0 1675.24 0.05 0 0 1139.94 0 0 0 928.297 0 0 442.9 0 0 0 0 0 0 0 
0 0 2205.04 0 0 502.411 0 94.9889 0 0 0 -784.555 0 0 1798.84 0 0 0 0 0 0 0 0 0 0 0 0 0 0 0 0 0 0 0.02 0 0 0 0 0 0 0 0 1373.56 0 1357.08 0 0 0 0 0 
0 0 0 0 0 0 0 0 0 0 0 0 0 0 0 0 0 0 0 0 0 1368.98 1030.38 782.266 0 0 0 0 0 0 0 0 0 0 0.05 0 0 0 -1872.54 0 0 0 0 0 0 0 0 0 0 0 
-374.081 0 0 0 0 0 0 0 0 2495.12 0 483.642 0 0 0 0 0 0 0 0 0 0 0 874.126 0 0 0 0 1747.57 0 0 0 -1676.31 0 0 0.02 0 0 -1293.91 0 0 0 0 0 0 0 0 0 0 0 
-762.886 0 0 0 0 0 0 0 0 0 0 0 0 0 0 2143.39 0 0 0 0 0 0 0 1149.4 0 0 0 0 0 0 2449.64 0 0 0 0 0 0.02 0 0 0 0 0 0 0 -295.648 0 0 0 841.166 0 
0 0 0 1011.15 -2281.79 0 0 0 0 0 2199.7 0 0 0 0 0 0 0 0 0 0 0 0 -643.864 0 0 0 0 0 0 0 0 0 0 0 0 0 0.04 0 0 0 2101.73 0 0 0 0 0 0 0 0 
0 1334.5 0 0 0 0 0 1856.52 0 0 0 0 0 0 0 0 0 0 0 0 0 0 0 0 2483.98 0 2005.14 0 0 0 0 0 0 0 -962.63 -2456.66 0 0 0.04 0 0 0 0 0 0 0 0 668.126 0 0 
0 0 0 0 -2292.32 0 0 0 0 1084.55 0 0 2216.03 0 -49.8215 0 -80.1874 0 0 0 0 0 0 0 0 0 0 0 0 0 0 0 1749.7 0 0 0 0 0 0 0.08 0 0 0 0 0 0 0 0 0 0 
0 0 0 0 0 2461.85 0 0 0 0 0 0 875.195 0 0 0 0 0 -206.229 0 0 0 0 0 0 0 0 0 1608.4 0 0 0 0 0 0 0 0 0 0 0 0.08 -1479.61 0 0 0 0 0 -1477.63 0 2353.66 
0 0 0 0 0 -2243.49 0 2201.68 0 -1338.62 0 0 0 0 0 0 0 0 0 0 0 0 0 0 0 1832.71 0 0 0 0 0 0 0 0 0 0 0 -33.9518 0 0 2475.74 0.03 0 0 0 0 0 0 0 0 
0 0 601.749 0 0 0 0 0 0 0 0 0 0 0 2389.68 481.048 0 0 0 0 0 0 0 0 0 2016.89 0 0 0 0 2043.6 0 -1079.06 -1726.81 0 0 0 0 0 0 0 0 0 0 -931.654 988.418 -1209.98 0 0 0 
0 1795.18 2133.47 584.658 0 0 0 0 0 0 0 0 0 0 0 0 0 0 0 0 0 0 0 0 2006.67 0 0 -437.712 0 0 -1643.8 0 0 0 0 0 0 0 0 0 0 0 0 0 0 0 0 0 -1157.03 0 
0 0 0 0 0 0 0 0 0 0 0 0 0 0 0 0 0 0 0 0 1169.55 0 0 0 2203.36 0 0 0 -2352.6 0 0 0 0 -1616.03 0 0 -767.922 0 0 0 0 0 2239.22 0 0.04 0 0 0 0 0 
0 0 0 -279.626 0 2145.38 0 0 0 0 0 0 0 0 0 0 0 254.295 0 0 0 0 0 454.65 0 0 0 0 0 0 0 0 0 0 0 0 0 0 0 0 0 0 -919.446 0 0 0.08 0 0 0 0 
0 0 0 0 0 0 0 0 0 0 0 0 0 0 0 0 0 0 0 0 0 0 0 1109.73 597.324 -1707.59 0 0 0 0 0 0 0 0 0 0 0 0 0 0 0 0 1562.47 0 0 0 0.05 0 0 0 
0 0 0 2382.66 0 0 0 0 0 0 0 0 0 0 0 0 0 0 0 0 0 1225.09 0 0 0 0 0 0 0 0 0 835.826 0 0 0 0 0 0 2450.87 0 -1843.7 0 0 0 0 0 0 0.01 0 0 
0 0 0 0 0 0 0 0 0 0 1241.42 0 0 0 -1946.55 642.186 0 0 0 1983.63 0 0 0 0 0 -208.06 0 0 -139.393 0 0 0 0 0 0 0 -515.687 0 0 0 0 0 0 922.956 0 0 0 0 0.01 0 
-1929.76 0 0 0 0 0 0 0 0 0 758.156 0 0 0 -1932.66 0 0 0 0 0 0 0 0 0 569.857 574.435 0 0 1529.97 0 0 0 0 0 0 0 0 0 0 0 1779.31 0 0 0 0 0 0 0 0 0.09 
