*Vertices 41
*Matrix 
0.03 0 914.563 0 0 0 0 2144.31 0 899.762 0 0 0 1135.06 0 0 0 0 0 0 0 -1633.12 0 0 0 0 0 0 0 0 977.279 0 0 0 0 0 0 0 0 0 0 
0 0 2368.01 0 0 0 0 0 0 -1254.69 -240.257 0 0 0 1559.57 -2369.53 0 1900.92 -617.161 0 0 0 0 0 173.727 0 0 -2387.69 0 0 0 0 0 0 0 2292.93 0 0 0 1031.45 0 
1512.57 -883.587 0.02 1343.65 0 690.71 0 2351.83 400.174 0 0 0 0 -1966.38 0 0 -376.064 0 0 489.593 2320.4 395.138 0 0 0 0 0 0 0 0 0 0 0 0 -1420.41 0 0 0 -1785.87 0 0 
0 0 -151.296 0.02 0 708.411 0 0 0 0 0 185.934 847.575 2234.03 0 0 0 -549.257 0 0 0 0 0 0 0 0 0 0 0 0 0 0 0 0 0 0 0 0 0 0 0 
0 0 0 0 0.06 0 -914.258 0 2493.74 0 0 -2439.12 0 0 0 0 0 0 0 252.922 1254.08 0 1360.29 1786.17 0 0 0 0 0 0 0 0 0 0 0 0 0 0 0 0 0 
0 0 1360.9 499.512 0 0.04 2203.36 0 -1516.69 0 0 2462.92 0 0 0 0 0 0 0 0 0 0 2401.73 0 -2084.8 67.3696 0 0 0 0 0 0 0 0 40.6659 1194.72 0 970.26 0 1436.28 0 
0 0 0 0 -2336.12 1468.63 0.09 1825.69 0 0 0 0 2483.67 1002 0 -455.565 0 0 916.089 0 0 0 2312.77 -2407.99 0 0 0 0 2387.84 -1836.53 0 0 0 0 2488.25 0 0 0 0 0 0 
932.264 0 1974.17 0 0 0 -1933.88 0.05 2433.16 0 0 2449.95 0 246.361 751.9 0 0 0 1765.11 0 0 0 2425.69 0 480.743 0 2332.61 0 0 0 0 0 748.39 0 0 0 0 0 -1473.2 0 0 
0 0 -1611 0 95.7518 -876.11 0 2413.48 0.06 0 0 0 304.041 0 1009.63 0 871.532 0 0 0 0 0 259.484 0 0 0 0 0 0 -101.245 0 997.574 0 0 0 0 0 2439.12 0 0 0 
1311.61 2367.55 0 0 0 0 0 0 0 0.03 0 0 -389.187 0 -2417.91 0 0 1138.11 521.79 0 0 0 1586.28 0 0 0 0 0 0 0 0 0 -2152.85 -1002.91 0 0 0 0 0 0 0 
0 1965.01 0 0 0 0 0 0 0 0 0 0 0 0 0 0 0 0 0 2363.28 0 0 -1372.65 0 0 0 0 0 0 -350.734 0 0 0 1099.96 0 0 0 0 -1615.88 0 0 
0 0 0 1824.93 -1260.34 2268.21 0 -2436.06 0 0 0 0 -1730.78 0 0 1773.51 1953.41 2433.77 0 -951.643 921.583 0 0 0 0 0 0 0 0 0 0 0 -1657.69 2478.33 0 0 0 0 0 0 0 
0 0 0 1402.4 0 0 2186.57 0 -659.581 -230.644 0 -853.374 0.02 553.377 -1436.12 1877.57 0 0 0 0 -1799.14 0 1439.33 0 0 0 1711.55 0 0 0 0 -1064.26 0 0 0 361.415 0 0 0 0 0 
2190.69 0 -135.884 2469.63 0 0 -1288.87 1529.97 0 0 0 0 1184.35 0.06 488.372 581.149 0 0 0 564.364 0 0 0 0 0 0 0 -2011.55 0 0 0 0 0 0 0 0 0 0 0 0 1470.76 
0 -1617.71 0 0 0 0 0 1018.78 370.113 82.0185 0 0 835.368 1575.14 0.08 0 2001.94 0 0 1866.59 0 0 0 0 0 0 -1217.76 0 -791.726 0 -1663.18 0 0 0 0 0 0 0 0 0 0 
0 -1901.53 0 0 0 0 200.43 0 0 0 0 1660.89 1659.06 2328.49 0 0.06 0 553.987 0 0 0 0 1790.9 0 0 0 0 0 0 0 0 2341.15 0 0 0 0 941.878 0 0 0 0 
0 0 2477.11 0 0 0 0 0 201.193 0 0 1200.98 0 0 -430.54 0 0.05 0 0 0 0 0 0 1472.14 0 0 0 0 0 0 0 0 0 0 0 0 0 0 0 -2357.48 0 
0 1246.45 0 1464.66 0 0 0 0 0 -1559.27 0 -835.521 0 0 0 1965.47 0 0.06 2488.71 -181.509 0 0 -2252.49 0 0 0 0 0 0 0 0 0 0 0 0 0 0 0 0 0 0 
0 852 0 0 0 0 -1271.32 2492.68 0 125.507 0 0 0 0 0 0 0 1098.59 0.05 0 0 0 0 0 0 845.592 0 0 0 0 1765.42 0 0 0 0 0 -935.163 0 0 0 0 
0 0 146.718 0 -739.692 0 0 0 0 0 -48.9059 2001.17 0 1237.91 1406.22 0 0 199.21 0 0.07 0 0 0 0 0 0 0 0 0 0 0 0 0 0 0 0 0 -1017.41 0 0 -2000.26 
0 0 1673.1 0 2322.08 0 0 0 0 0 0 550.63 884.045 0 0 0 0 0 0 0 0.07 707.038 0 0 -1462.37 0 -715.43 1113.54 0 0 0 0 0 0 0 0 0 0 0 0 0 
1060.75 0 -713.294 0 0 0 0 0 0 0 0 0 0 0 0 0 0 0 0 0 1305.51 0.04 1219.9 324.335 0 0 0 0 0 0 0 0 0 0 0 0 0 0 0 0 -1461.15 
0 0 0 0 835.215 2363.58 -194.632 756.63 -1353.42 449.767 -862.224 0 261.162 0 0 277.642 0 2199.24 0 0 0 -458.007 0.09 0 859.783 0 0 0 -1459.32 0 -2141.56 0 0 0 0 0 0 0 0 0 0 
0 0 0 0 -1207.69 0 1831.8 0 0 0 0 0 0 0 0 0 276.269 0 0 0 0 1007.03 0 0.02 0 0 0 0 -2156.67 0 0 0 0 0 0 0 0 0 0 0 0 
0 178.61 0 0 0 -849.559 0 1658.15 0 0 0 0 0 0 0 0 0 0 0 0 2467.96 0 -182.119 0 0.09 0 0 0 0 0 0 0 0 0 0 0 -923.261 0 0 0 0 
0 0 0 0 0 -704.749 0 0 0 0 0 0 0 0 0 0 0 0 2477.87 0 0 0 0 0 0 0 0 0 0 0 0 -1257.44 0 0 0 0 0 0 616.092 0 0 
0 0 0 0 0 0 0 -611.362 0 0 0 0 597.324 0 253.227 0 0 0 0 0 2495.27 0 0 0 0 0 0.06 0 0 0 0 0 0 0 1649.6 0 0 0 0 0 0 
0 1787.55 0 0 0 0 0 0 0 0 0 0 0 1682.1 0 0 0 0 0 0 -636.387 0 0 0 0 0 0 0.07 0 0 0 0 0 0 0 0 0 0 0 0 0 
0 0 0 0 0 0 1835.46 0 0 0 0 0 0 0 1440.24 0 0 0 0 0 0 0 2265.92 -64.1652 0 0 0 0 0.04 0 0 0 0 0 0 0 0 223.014 0 0 0 
0 0 0 0 0 0 -1333.43 0 1891.92 0 1785.26 0 0 0 0 0 0 0 0 0 0 0 0 0 0 0 0 0 0 0.02 0 0 -149.617 0 0 0 0 0 0 0 0 
-47.38 0 0 0 0 0 0 0 0 0 0 0 0 0 -1960.89 0 0 0 2350.76 0 0 0 1762.06 0 0 0 0 0 0 0 0.04 0 0 0 0 2118.52 0 0 0 0 0 
0 0 0 0 0 0 0 0 952.864 0 0 0 -699.561 0 0 2170.4 0 0 0 0 0 0 0 0 0 1132.92 0 0 0 0 0 0.06 119.251 0 0 0 0 0 0 0 0 
0 0 0 0 0 0 0 1413.85 0 -632.725 0 -1142.23 0 0 0 0 0 0 0 0 0 0 0 0 0 0 0 0 0 1269.34 0 2384.18 0.09 0 0 0 0 0 0 0 0 
0 0 0 0 0 0 0 0 0 1750.62 1005.81 -2020.1 0 0 0 0 0 0 0 0 0 0 0 0 0 0 0 0 0 0 0 0 0 0.07 0 0 0 0 0 278.1 0 
0 0 1460.69 0 0 -423.978 2390.59 0 0 0 0 0 0 0 0 0 0 0 0 0 0 0 0 0 0 0 2410.89 0 0 0 0 0 0 0 0.03 0 0 0 0 0 0 
0 2396.08 0 0 0 2069.99 0 0 0 0 0 0 -2162.92 0 0 0 0 0 0 0 0 0 0 0 0 0 0 0 0 0 552.004 0 0 0 0 0.08 0 -724.433 1967.45 0 0 
0 0 0 0 0 0 0 0 0 0 0 0 0 0 0 2183.68 0 0 526.368 0 0 0 0 0 1289.03 0 0 0 0 0 0 0 0 0 0 0 0.04 0 0 0 0 
0 0 0 0 0 1380.12 0 0 1863.84 0 0 0 0 0 0 0 0 0 0 -884.045 0 0 0 0 0 0 0 0 1198.54 0 0 0 0 0 0 -1888.56 0 0.05 0 0 1506.62 
0 0 1007.34 0 0 0 0 -440.611 0 0 1834.7 0 0 0 0 0 0 0 0 0 0 0 0 0 0 -1628.24 0 0 0 0 0 0 0 0 0 -572.146 0 0 0.03 0 0 
0 549.409 0 0 0 3.12815 0 0 0 0 0 0 0 0 0 0 -492.798 0 0 0 0 0 0 0 0 0 0 0 0 0 0 0 0 1170.61 0 0 0 0 0 0.03 0 
0 0 0 0 0 0 0 0 0 0 0 0 0 2038.41 0 0 0 0 0 1988.97 0 2075.49 0 0 0 0 0 0 0 0 0 0 0 0 0 0 0 419.706 0 0 0.02 
