*Vertices 51
*Matrix 
0 0 0 0 0 0 0 0 1862.93 0 0 0 0 0 0 2450.56 0 2176.2 0 0 0 -167.165 0 1972.95 0 0 0 0 0 0 0 0 173.421 0 0 0 0 0 0 2069.54 -1358.46 0 0 0 -1761.6 0 0 0 0 0 0 
0 0 0 1195.94 0 0 0 725.654 0 0 0 0 0 1429.56 1396.15 0 0 0 0 502.411 0 0 0 2345.42 0 306.482 0 0 0 0 0 0 0 2180.32 0 0 0 0 0 0 0 0 0 0 0 0 0 0 0 0 0 
0 0 0.01 0 0 0 0 0 0 0 0 0 0 0 0 0 0 0 0 0 0 1793.5 0 0 0 0 0 0 0 0 0 0 0 0 0 0 0 1181.91 0 0 0 -986.282 -158.773 0 0 0 2362.21 2231.89 0 0 0 
0 -31.9681 0 0.05 0 0 0 0 0 0 0 0 0 0 0 0 0 0 526.826 0 0 0 0 0 0 0 0 0 0 0 53.7889 0 0 0 0 0 0 0 0 0 0 0 0 0 0 0 0 0 0 0 0 
0 0 0 0 0 0 0 0 0 0 0 0 0 0 0 0 0 -1305.96 0 0 0 0 0 0 2376.71 0 0 0 0 0 0 0 0 1831.19 0 0 0 0 1029.31 0 0 0 0 0 0 0 0 1820.51 0 0 0 
0 0 0 0 0 0.02 0 0 0 0 0 1619.54 0 0 -384.457 0 0 -483.489 0 0 0 0 0 0 0 0 0 0 0 0 0 0 0 -904.645 0 0 0 0 0 0 0 1654.79 397.275 0 0 0 0 0 0 0 0 
0 0 0 0 0 0 0.06 0 0 0 0 0 2203.21 0 2138.51 886.486 0 0 0 -936.079 0 0 0 0 0 0 0 0 0 0 665.227 0 0 0 0 0 0 0 0 0 0 0 0 175.71 0 -383.694 0 0 0 0 0 
0 493.408 0 0 0 0 0 0.04 0 98.0407 0 0 1653.87 0 0 0 0 0 0 0 0 0 0 0 0 -870.617 0 -443.205 -998.032 0 0 0 0 0 0 -1890.39 0 1159.32 0 2425.53 0 0 1119.5 1328.09 0 -1466.34 0 0 0 0 0 
585.879 0 0 0 0 0 0 0 0.07 0 0 0 0 0 0 0 0 66.7592 0 -1054.34 0 0 0 0 0 0 0 0 0 0 0 0 0 1864.91 0 286.645 0 0 0 1375.09 0 -799.203 1433.68 423.521 0 0 0 0 0 0 0 
0 0 0 0 0 0 0 -1627.48 0 0.06 -1201.9 0 -637.608 0 0 0 0 -2104.94 0 0 0 0 0 1503.57 0 0 0 0 0 0 0 2422.03 0 0 0 0 1999.19 0 0 0 0 0 1166.19 0 -868.786 0 0 0 0 0 0 
0 0 0 0 0 0 0 0 0 -1310.08 0.04 0 0 0 0 0 0 0 0 0 0 0 0 0 0 0 0 0 0 0 0 0 621.738 0 0 0 990.555 0 0 0 0 0 0 2377.47 0 0 -486.999 0 0 0 0 
0 0 0 0 0 859.172 0 0 0 0 0 0.05 0 0 0 0 0 345.546 0 0 0 0 0 563.906 0 0 0 0 0 0 0 0 0 -774.941 0 0 0 0 0 0 712.378 0 52.1104 0 0 0 0 849.101 0 0 0 
0 0 0 0 0 0 64.6229 1290.86 0 -131.764 0 0 0.02 0 0 1151.23 0 0 853.984 0 0 2421.26 0 0 0 0 0 105.06 0 0 0 0 0 0 0 0 0 0 0 0 0 2246.54 2104.02 0 1462.98 0 0 0 0 0 0 
0 1336.79 0 0 0 0 0 0 0 0 0 0 0 0.03 2393.03 0 0 0 0 0 0 0 0 1636.02 1284.14 0 0 -71.1844 0 0 0 2466.58 -2385.71 0 0 0 0 0 0 -446.257 0 0 0 0 0 0 0 0 0 0 0 
0 64.4704 0 0 0 2110.28 1255.91 0 0 0 0 0 0 875.5 0.08 0 1124.68 0 0 0 0 0 0 0 0 0 0 0 0 0 0 0 0 -1835.46 0 0 0 0 -1630.07 0 0 0 0 0 1706.52 481.811 0 0 0 0 0 
-1226.31 0 0 0 0 0 74.5415 0 0 0 0 0 2145.07 0 0 0.07 0 0 0 0 428.861 0 0 0 0 0 0 2498.63 0 0 0 0 0 108.57 0 0 0 0 1921.83 0 0 0 0 0 0 0 0 0 0 0 0 
0 0 0 0 0 0 0 0 0 0 0 0 0 0 737.861 0 0 393.765 0 0 0 0 0 0 0 0 0 0 1732.61 0 0 0 0 0 0 0 0 0 0 0 0 0 0 0 0 0 0 0 0 0 0 
-1584.29 0 0 0 1035.87 2176.66 0 0 724.586 887.249 0 1179.31 0 0 0 0 2134.69 0.07 -2088.61 0 0 2355.34 0 0 0 2191.15 0 0 0 0 0 0 0 0 0 0 0 -2259.51 0 0 0 0 0 1994 0 0 0 -1876.66 0 0 0 
0 0 0 2374.72 0 0 0 0 0 0 0 0 1424.99 0 0 0 0 11.063 0.05 2288.66 0 0 0 0 0 0 0 0 0 0 0 0 0 -1566.13 -611.209 0 0 862.377 0 0 0 0 0 0 0 0 0 0 0 0 0 
0 1512.12 0 0 0 0 1983.02 0 -829.112 0 0 0 0 0 0 0 0 0 -1619.39 0.08 0 0 0 0 0 2248.83 -1039.54 1759.01 0 0 0 -615.329 0 0 -47.38 0 0 0 1055.1 -1109.73 0 0 0 0 709.784 0 0 0 0 0 0 
0 0 0 0 0 0 0 0 0 0 0 0 0 0 0 1821.88 0 0 0 0 0.08 0 0 0 0 0 0 0 0 0 0 0 0 1977.83 0 0 0 0 0 2307.58 0 0 0 0 0 0 -2253.87 698.34 0 0 0 
-2071.06 0 533.692 0 0 0 0 0 0 0 0 0 2211.45 0 0 0 0 975.448 0 0 0 0.06 0 0 0 0 0 0 0 0 0 1607.64 0 0 0 0 0 0 0 0 0 0 0 0 0 0 0 0 0 0 0 
0 0 0 0 0 0 0 0 0 0 0 0 0 0 0 0 0 0 0 0 0 0 0.01 0 0 0 0 0 0 0 2444.76 -1093.55 0 0 0 0 0 0 0 0 0 0 0 0 0 0 0 1093.25 0 0 0 
-65.6911 1639.84 0 0 0 0 0 0 0 413.297 0 -1997.05 0 436.186 0 0 0 0 0 0 0 0 0 0.07 0 0 0 0 0 0 0 0 2480.93 0 0 0 2193.44 0 0 0 296.258 0 0 0 0 0 0 0 0 0 0 
0 0 0 0 2085.86 0 0 0 0 0 0 0 0 -616.245 0 0 0 0 0 0 0 0 0 0 0.02 0 0 -117.573 0 660.649 870.006 0 0 0 0 1987.14 0 0 -897.32 0 0 0 0 0 0 0 0 0 0 0 0 
0 1459.17 0 0 0 0 0 -277.795 0 0 0 0 0 0 0 0 0 -2160.79 0 109.79 0 0 0 0 0 0.01 0 0 0 0 0 0 0 0 0 0 0 0 0 0 0 0 1635.56 0 2079.3 0 0 0 0 0 0 
0 0 0 0 0 0 0 0 0 0 0 0 0 0 0 0 0 0 0 1191.06 0 0 0 0 0 0 0.08 548.799 0 0 0 0 0 0 0 0 294.122 0 0 -94.8363 0 0 0 151.906 1311 0 0 0 0 0 0 
0 0 0 0 0 0 0 900.677 0 0 0 0 -1239.13 1049.61 0 1252.25 0 0 0 -921.278 0 0 0 0 -442.442 0 2304.07 0.04 0 0 0 0 0 0 0 0 0 0 0 0 0 0 0 0 0 0 0 0 0 0 0 
0 0 0 0 0 0 0 2214.5 0 0 0 0 0 0 0 0 -469.146 0 0 0 0 0 0 0 0 0 0 0 0.07 0 -2342.22 1366.7 0 0 0 0 0 0 0 0 -68.8955 0 0 0 1321.53 0 0 0 0 -1268.88 0 
0 0 0 0 0 0 0 0 0 0 0 0 0 0 0 0 0 0 0 0 0 0 0 0 526.826 0 0 0 0 0.03 0 0 0 0 0 0 0 2435.76 272.149 0 0 0 0 0 0 0 0 0 0 0 0 
0 0 0 481.658 0 0 -14.7252 0 0 0 0 0 0 0 0 0 0 0 0 0 0 0 1374.78 0 -52.4155 0 0 0 1575.9 0 0.01 0 0 0 0 0 0 0 0 0 0 0 0 0 0 0 0 0 0 0 0 
0 0 0 0 0 0 0 0 0 1941.51 0 0 0 2303.77 0 0 0 0 0 -307.703 0 308.618 -1000.02 0 0 0 0 0 -2151.78 0 0 0.09 0 0 0 0 0 0 0 0 0 0 0 0 0 0 0 0 0 0 0 
7.55333 0 0 0 0 0 0 0 0 0 1520.97 0 0 1918.01 0 0 0 0 0 0 0 0 0 1563.08 0 0 0 0 0 0 0 0 0.01 0 0 0 0 0 0 0 1983.32 0 0 0 0 -1587.5 0 0 0 0 0 
0 397.122 0 0 2322.08 1613.9 0 0 1227.53 0 0 2291.86 0 0 1229.21 -637.608 0 0 -1980.27 0 -1307.34 0 0 0 0 0 0 0 0 0 0 0 0 0 484.1 -1484.5 0 0 0 0 1354.18 0 0 0 0 0 0 0 760.292 0 -611.82 
0 0 0 0 0 0 0 0 0 0 0 0 0 0 0 0 0 0 2022.54 1605.35 0 0 0 0 0 0 0 0 0 0 0 0 0 1476.87 0.02 0 0 0 0 -308.618 0 0 0 0 0 0 0 0 0 0 0 
0 0 0 0 0 0 0 2341.46 -2159.11 0 0 0 0 0 0 0 0 0 0 0 0 0 0 0 -850.017 0 0 0 0 0 0 0 0 -1694.92 0 0.09 0 0 1874.98 0 2463.53 0 2099.9 -376.064 2416.99 0 0 0 0 0 0 
0 0 0 0 0 0 0 0 0 -2406.16 2326.81 0 0 0 0 0 0 0 0 0 0 0 0 1005.36 0 0 2263.33 0 0 0 0 0 0 0 0 0 0.07 0 0 0 0 0 0 0 0 0 0 0 0 0 0 
0 0 1412.17 0 0 0 0 -752.205 0 0 0 0 0 0 0 0 0 1796.4 2434.39 0 0 0 0 0 0 0 0 0 0 -2027.73 0 0 0 0 0 0 0 0.02 0 2029.86 0 0 0 0 436.644 -1254.39 0 0 0 0 0 
0 0 0 0 2073.96 0 0 0 0 0 0 0 0 0 1632.36 296.258 0 0 0 260.704 0 0 0 0 464.873 0 0 0 0 1553.16 0 0 0 0 0 -462.279 0 0 0 0 0 0 -1224.63 0 0 0 0 0 0 0 0 
-711.463 0 0 0 0 0 0 2231.44 -471.282 0 0 0 0 -2431.64 0 0 0 0 0 1568.12 1110.34 0 0 0 0 0 1922.74 0 0 0 0 0 0 0 -1696.75 0 0 1661.05 0 0.01 2181.39 0 0 0 0 0 0 0 0 0 0 
-761.818 0 0 0 0 0 0 0 0 0 0 158.62 0 0 0 0 0 0 0 0 0 0 0 2488.56 0 0 0 0 -1828.9 0 0 0 -1595.13 2285 0 1391.26 0 0 0 -1964.09 0.07 0 0 0 0 0 0 0 1961.96 0 0 
0 0 433.592 0 0 1939.68 0 0 -542.085 0 0 0 1623.81 0 0 0 0 0 0 0 0 0 0 0 0 0 0 0 0 0 0 0 0 0 0 0 0 0 0 0 0 0 0 1971.57 0 0 0 0 0 0 0 
0 0 1463.44 0 0 -1803.26 0 1954.63 -83.697 2361.45 0 -1231.5 -842.997 0 0 0 0 0 0 0 0 0 0 0 0 -1089.59 0 0 0 0 0 0 0 0 0 1231.8 0 0 -750.374 0 0 0 0.07 0 0 0 0 0 0 0 0 
0 0 0 0 0 0 385.372 -803.629 1790.9 0 1273.31 0 0 0 0 0 0 1259.58 0 0 0 0 0 0 0 0 1977.68 0 0 0 0 0 0 0 0 2498.93 0 0 0 0 0 602.512 0 0.05 1214.71 0 0 0 0 0 0 
1640.9 0 0 0 0 0 0 0 0 966.14 0 0 -1759.93 0 -801.645 0 0 0 0 -1637.85 0 0 0 0 0 2017.65 -1399.96 0 1851.18 0 0 0 0 0 0 2221.52 0 -1214.56 0 0 0 0 0 243.767 0.04 0 0 0 0 0 0 
0 0 0 0 0 0 336.39 221.488 0 0 0 0 0 0 654.088 0 0 0 0 0 0 0 0 0 0 0 0 0 0 0 0 0 543.306 0 0 0 0 -373.318 0 0 0 0 0 0 0 0 643.559 0 0 0 0 
0 0 -299.768 0 0 0 0 0 0 0 893.048 0 0 0 0 0 0 0 0 0 833.537 0 0 0 0 0 0 0 0 0 0 0 0 0 0 0 0 0 0 0 0 0 0 0 0 600.375 0.03 0 0 0 0 
0 0 2477.72 0 2098.38 0 0 0 0 0 0 798.44 0 0 0 0 0 415.891 0 0 -2242.73 0 2483.52 0 0 0 0 0 0 0 0 0 0 0 0 0 0 0 0 0 0 0 0 0 0 0 0 0.07 0 0 0 
0 0 0 0 0 0 0 0 0 0 0 0 0 0 0 0 0 0 0 0 0 0 0 0 0 0 0 0 0 0 0 0 0 2001.48 0 0 0 0 0 0 1125.14 0 0 0 0 0 0 0 0.08 0 0 
0 0 0 0 0 0 0 0 0 0 0 0 0 0 0 0 0 0 0 0 0 0 0 0 0 0 0 0 1202.81 0 0 0 0 0 0 0 0 0 0 0 0 0 0 0 0 0 0 0 0 0.02 0 
0 0 0 0 0 0 0 0 0 0 0 0 0 0 0 0 0 0 0 0 0 0 0 0 0 0 0 0 0 0 0 0 0 1308.86 0 0 0 0 0 0 0 0 0 0 0 0 0 0 0 0 0.09 
