*Vertices 57
*Matrix 
0.01 0 2044.97 1048.23 0 0 0 1262.02 1830.88 0 0 -1074.48 -828.043 -1141.47 1155.35 0 0 -819.498 1804.03 474.029 0 0 -1294.82 0 0 0 0 0 0 0 593.661 0 -1493.5 0 0 0 0 0 0 0 65.2333 0 -568.789 0 0 0 0 0 0 -381.1 0 0 0 0 0 0 0 
0 0.01 0 0 -1303.98 502.411 0 0 -248.344 0 0 2043.14 0 0 0 0 0 1184.35 210.501 0 -310.45 0 0 0 1800.21 789.132 0 2313.84 0 0 1101.34 2461.24 0 0 0 0 0 -729.926 0 0 -1504.18 0 0 0 0 0 0 0 0 0 0 937.452 0 0 0 0 0 
786.233 0 0.01 0 0 0 0 0 0 0 0 -1026.41 0 0 0 0 0 0 0 0 0 1481.75 0 1676.76 0 0 0 0 1764.66 0 0 0 373.318 533.845 -663.396 -406.583 998.489 0 0 0 0 0 0 -1508.45 0 0 0 -1245.23 0 0 0 0 0 0 0 -554.598 1724.83 
-1948.07 0 0 0.01 0 -1632.82 2262.87 907.849 0 2386.32 0 0 1248.89 0 547.731 -2434.08 -441.374 0 0 445.341 2280.42 0 -1006.42 0 0 0 0 0 0 0 2064.35 0 0 494.476 0 0 0 0 -1432 0 0 0 0 1721.02 0 0 0 0 0 0 316.401 0 0 0 -1231.35 0 0 
0 2466.58 0 0 0.08 0 2250.05 0 0 0 -1301.39 0 0 0 0 1253.01 2291.25 0 0 0 1316.19 0 -312.433 -1312.37 0 0 2486.72 0 0 1033.13 -1950.82 0 0 -323.267 774.941 1523.87 282.83 0 0 0 0 1347.93 0 0 0 0 -1490.45 0 0 0 0 138.478 0 0 0 0 0 
0 2322.23 0 2241.51 0 0 -832.621 0 0 0 0 0 0 0 1940.75 0 0 0 0 0 0 -1594.21 -477.233 0 -1080.89 0 2412.87 0 0 2295.68 0 0 0 0 0 0 0 0 0 0 0 0 0 0 0 0 0 0 0 0 0 0 0 0 0 0 0 
0 0 0 2069.23 -1713.54 1679.82 0.07 0 0 0 0 0 0 0 84.0022 -2229.61 1720.86 1696.14 0 0 0 1183.89 1618.02 0 0 0 0 0 0 -1738.41 0 1775.03 -733.436 0 0 145.344 0 0 0 0 0 1357.08 0 0 0 0 0 0 0 0 0 0 0 0 0 0 0 
1892.68 0 0 2428.59 0 0 0 0 1451.38 0 0 -32.5785 0 0 0 2493.59 2049.39 0 0 0 0 -41.8867 -2461.85 0 1427.12 0 229.423 0 2264.4 -353.328 0 0 1324.12 0 0 0 0 0 0 0 0 0 0 0 0 0 0 0 0 0 0 0 0 0 0 0 0 
1833.93 -1144.22 0 0 0 0 0 2164.91 0.09 0 0 0 -1054.95 2360.38 -338.984 0 0 0 -485.626 0 436.796 0 1738.41 227.592 0 0 642.033 1011.15 0 1543.4 0 0 -1554.69 0 0 0 -105.213 0 0 0 0 0 0 0 0 0 -2317.5 0 0 0 0 0 0 0 0 0 0 
0 0 0 -446.715 0 0 0 0 0 0.02 0 0 0 0 0 153.127 2248.07 0 0 0 1623.66 0 1198.69 0 0 0 0 0 0 1116.44 1267.2 0 0 0 -370.571 0 -1437.19 0 0 0 0 0 0 0 0 0 0 0 0 0 0 706.275 0 0 2263.02 -697.272 2404.78 
0 0 0 0 -1604.13 0 0 0 0 0 0.05 0 0 0 882.061 348.75 0 0 0 0 0 0 302.21 0 2274.93 1128.04 0 0 0 727.79 -1213.8 0 0 -644.169 0 0 33.0363 0 0 -1485.11 0 0 0 0 0 579.318 0 -190.054 0 0 0 0 0 0 0 0 0 
-78.814 -1848.28 716.956 0 0 0 0 -50.2792 0 0 0 0.09 -862.835 0 0 0 0 0 0 0 0 1777.32 0 0 0 958.357 0 1564.61 0 0 1719.34 0 2450.25 -2023.76 0 -2496.95 1063.49 0 0 0 0 -882.519 0 0 0 0 0 0 0 0 0 0 0 0 0 0 0 
-823.618 0 0 -617.008 0 0 0 0 408.567 0 0 956.526 0 0 0 0 0 0 0 190.359 0 964.003 0 0 0 0 -244.987 0 0 0 0 0 0 0 0 0 0 0 0 0 0 0 0 0 0 0 0 0 0 0 0 0 0 0 0 0 0 
1310.39 0 0 0 0 0 0 0 1789.07 0 0 0 0 0.04 0 0 1974.62 0 -1829.05 0 0 0 0 0 0 1149.86 0 0 0 0 2495.27 0 0 0 0 0 0 0 0 0 0 0 0 0 0 0 0 0 1625.03 0 0 -2470.85 -483.489 0 0 0 0 
-1999.5 0 0 -820.872 0 1762.83 1543.09 0 651.952 0 18.54 0 0 0 0.06 0 0 77.1355 2255.55 0 2477.57 0 0 0 0 0 0 -1420.71 2459.87 0 1565.07 129.17 0 0 0 0 0 0 0 0 0 0 0 0 0 0 0 0 0 0 337.153 0 0 0 0 0 0 
0 0 0 2207.63 1747.11 0 2352.6 2460.78 0 -1093.55 1977.52 0 0 0 0 0.03 0 0 0 0 0 407.193 1399.81 1150.62 0 0 0 0 674.383 -2429.5 0 2370.14 640.355 0 0 0 0 0 0 0 0 0 0 0 -1119.8 0 0 0 -1080.89 -839.488 -516.144 0 0 0 0 0 -427.793 
0 0 0 1822.95 1288.26 0 -340.815 1598.64 0 -1328.85 0 0 0 1228.75 0 0 0.08 0 0 0 0 0 -1042.44 -1567.51 0 -1195.94 1149.1 0 0 0 0 0 -2070.6 0 0 0 0 0 0 0 0 0 1037.25 0 0 0 0 0 0 0 0 0 -160.604 0 0 0 0 
87.054 -1151.69 0 0 0 0 1982.1 0 0 0 0 0 0 0 1295.43 0 0 0.06 0 -354.244 -432.676 0 0 1587.65 0 -2475.89 0 0 0 0 0 0 2364.65 2490.84 0 0 0 0 0 0 0 0 0 0 0 0 0 0 0 0 -530.183 0 0 0 0 0 0 
-1695.53 2129.96 0 0 0 0 0 0 1562.78 0 0 0 0 2057.79 -847.88 0 0 0 0.02 0 0 0 2298.27 0 0 1172.44 0 0 0 0 927.534 -160.146 0 0 -134.663 0 0 -285.272 0 0 0 0 0 -121.998 -1072.5 0 630.741 0 0 0 0 0 0 0 0 0 0 
1226 0 0 1426.51 0 0 0 0 0 0 0 0 -620.67 0 0 0 0 2359.92 0 0.01 0 0 0 0 0 0 0 0 0 0 0 546.815 0 -482.574 0 0 403.226 2082.66 0 0 0 0 0 0 0 0 73.7785 0 0 -561.312 0 0 0 0 0 0 0 
0 2143.09 0 772.805 2322.53 0 0 0 1735.97 1899.09 0 0 0 0 1078.3 0 0 2241.51 0 0 0.01 0 0 0 0 0 0 0 -232.017 -550.935 0 -2043.6 0 -1612.22 0 0 0 0 0 0 0 0 -116.352 0 0 0 0 0 0 2486.88 -2229.3 0 0 -979.72 0 0 0 
0 0 -901.44 0 0 -426.725 -451.292 -399.716 0 0 0 1589.63 -1449.25 0 0 1339.99 0 0 0 0 0 0.04 2015.21 0 0 1530.27 -1058.15 -64.0126 0 0 1675.24 0 0 -2100.51 0 0 2167.5 0 0 0 0 1809.52 2154.07 0 0 0 0 0 373.012 0 0 0 0 0 0 0 2425.08 
-1608.71 0 0 1668.22 -655.461 2014.15 -2042.99 -289.85 2376.25 1856.82 135.273 0 0 0 0 1045.49 -53.6363 0 -1110.49 0 0 678.808 0.05 0 0 0 0 -618.686 0 0 -1965.32 0 -1750.77 -253.838 0 0 296.564 392.697 2239.22 0 0 533.54 0 1548.89 0 0 0 0 0 0 0 0 0 0 -1683.48 0 0 
0 0 -351.039 0 1927.32 0 0 0 -1625.64 0 0 0 0 0 0 -1006.58 1796.55 805.46 0 0 0 0 0 0.02 0 0 2480.77 766.549 0 -736.793 0 0 908.612 0 0 0 0 0 0 0 0 0 0 0 0 0 0 0 0 0 0 0 0 0 0 0 0 
0 578.249 0 0 0 1568.58 0 1491.06 0 0 -425.962 0 0 0 0 0 0 0 0 0 0 0 0 0 0.08 0 0 0 0 0 899.915 0 0 0 -848.033 0 -1158.25 2290.34 0 -2277.98 0 0 0 0 0 -1681.8 0 765.023 0 0 0 0 0 0 0 -745.491 0 
0 2270.65 0 0 0 0 0 0 0 0 2273.55 2261.35 0 -61.1133 0 0 2094.41 -1223.41 2287.29 0 0 -2222.43 0 0 0 0.09 0 0 0 0 0 0 0 0 0 0 0 0 0 0 0 0 1351.59 0 0 0 0 0 0 0 0 0 0 0 0 0 0 
0 0 0 0 -529.878 1333.74 0 -636.998 -2226.1 0 0 0 1022.75 0 0 0 -2320.09 0 0 0 0 1519.14 0 1857.74 0 0 0.03 0 -330.287 1672.03 0 0 0 0 0 0 0 0 2471.31 1897.26 0 0 0 0 0 -385.983 0 0 2116.53 0 0 0 0 0 0 0 0 
0 1993.09 0 0 0 0 0 0 2106.77 0 0 478.301 0 0 -2182 0 0 0 0 0 0 -203.482 1835.31 1811.35 0 0 0 0.09 0 0 0 0 0 0 0 -2427.37 -2030.63 0 0 0 0 0 0 0 0 0 0 0 0 0 0 0 0 0 2326.96 0 0 
0 0 1809.52 0 0 0 0 2201.99 0 0 0 0 0 0 645.238 2187.49 0 0 0 0 -2285.61 0 0 0 0 0 2496.03 0 0.04 0 0 0 -42.1918 0 0 2319.33 0.686666 0 1371.43 0 1052.35 0 0 0 0 0 0 0 0 0 0 805.918 0 0 0 0 0 
0 0 0 0 -694.372 1092.79 439.238 -389.34 -549.715 1245.08 2215.41 0 0 0 0 -2416.99 0 0 0 0 87.9696 0 0 1664.25 0 0 2141.56 0 0 0.03 0 0 0 0 -623.112 1546.3 0 0 0 0 2321.16 0 0 0 0 0 0 0 0 0 0 0 0 0 -1964.86 0 0 
-486.236 995.132 0 -48.2955 1884.14 0 0 0 0 2251.27 1292.23 420.621 0 -1584.75 -886.181 0 0 0 2372.74 0 0 -646.916 -1307.79 0 729.011 0 0 0 0 0 0.08 -1545.38 0 0 0 0 0 0 0 0 0 0 0 0 0 0 0 0 0 0 0 0 0 -800.882 0 -247.429 0 
0 1763.13 0 0 0 0 -2406.31 0 0 0 0 0 0 0 1612.22 -610.294 0 0 814.615 1258.51 -692.389 0 0 0 0 0 0 0 0 0 1226.92 0.06 0 0 0 0 0 0 -938.215 0 0 0 0 1745.12 0 0 1916.03 -1509.52 0 0 0 0 0 0 0 0 0 
2414.7 0 -1787.24 0 0 0 2061.75 -2115.47 -897.32 0 0 645.39 0 0 0 1000.47 2163.53 -1288.72 0 0 0 0 -128.101 -1724.52 0 0 0 0 -360.042 0 0 0 0 0 0 0 0 0 0 0 0 2160.18 0 0 0 0 0 2178.33 0 0 0 0 0 0 0 0 0 
0 0 33.6467 1701.33 -789.438 0 0 0 0 0 2158.65 538.575 0 0 0 0 0 1487.55 0 -1842.94 -275.048 1483.73 1736.43 0 0 0 0 0 0 0 0 0 0 0.09 0 0 0 -1034.81 -1772.74 0 0 0 0 0 0 0 0 0 0 0 0 0 2397.76 0 0 0 0 
0 0 904.95 0 143.818 0 0 0 0 -2167.96 0 0 0 0 0 0 0 0 1611.3 0 0 0 0 0 1325.95 0 0 0 0 1810.28 0 0 0 0 0.08 0 0 0 1674.78 0 0 0 0 0 0 -780.74 0 199.362 0 0 0 0 0 0 0 0 231.101 
0 0 -529.115 0 1547.67 0 -771.889 0 0 0 0 -788.827 0 0 0 0 0 0 0 0 0 0 0 0 0 0 0 -819.193 1753.52 1078.75 0 0 0 0 0 0.03 526.673 1580.78 0 528.352 767.769 0 0 0 0 0 0 0 -296.411 0 0 0 0 -1815.93 0 0 0 
0 0 -2481.69 0 -132.527 0 0 0 -489.593 2334.28 1378.75 -2024.98 0 0 0 0 0 0 0 608.31 0 1106.37 910.291 0 -2.36518 0 0 1925.34 1979.05 0 0 0 0 0 0 2350.46 0.09 0 0 0 0 0 -418.332 0 0 0 0 0 0 0 0 0 0 0 0 121.235 0 
0 1313.29 0 0 0 0 0 0 0 0 0 0 0 0 0 0 0 0 1956.62 1869.95 0 0 1331.75 0 -1478.85 0 0 0 0 0 0 0 0 2435.15 0 165.944 0 0 0 0 0 -2394.71 0 0 0 0 0 0 0 0 0 0 0 0 0 0 0 
0 0 0 38.8348 0 0 0 0 0 0 0 0 0 0 0 0 0 0 0 0 0 0 1635.56 0 0 0 304.804 0 -484.71 0 0 595.34 0 348.292 1035.42 0 0 0 0.09 0 0 0 0 0 0 0 0 0 0 0 -1259.88 0 0 -1043.81 0 0 0 
0 0 0 0 0 0 0 0 0 0 1406.67 0 0 0 0 0 0 0 0 0 0 0 0 0 982.162 0 823.008 0 0 0 0 0 0 0 0 2074.72 0 0 0 0.06 0 0 0 0 0 0 0 0 0 -1954.94 0 0 0 0 0 0 0 
-566.958 -528.657 0 0 0 0 0 0 0 0 0 0 0 0 0 0 0 0 0 0 0 0 0 0 0 0 0 0 -181.051 2190.54 0 0 0 0 0 1966.69 0 0 0 0 0 899.457 0 0 0 0 0 0 0 0 0 -547.884 0 1054.8 0 0 0 
0 0 0 0 1386.07 0 -1295.74 0 0 0 0 -2063.89 0 0 0 0 0 0 0 0 0 -1758.1 2049.85 0 0 0 0 0 0 0 0 0 1232.26 0 0 0 0 1646.86 0 0 -2491.45 0.03 0 0 1996.14 0 0 0 0 0 0 0 1305.05 0 0 0 0 
1777.32 0 0 0 0 0 0 0 0 0 0 0 0 0 0 0 1011.15 0 0 0 1310.08 -2411.04 0 0 0 -1170.31 0 0 0 0 0 0 0 0 0 0 2409.82 0 0 0 0 0 0.05 0 0 0 0 0 0 0 0 0 0 0 0 0 -1390.04 
0 0 1329.77 2159.72 0 0 0 0 0 0 0 0 0 0 0 0 0 0 1811.96 0 0 0 -2364.65 0 0 0 0 0 0 0 0 2238.46 0 0 0 0 0 0 0 0 0 0 0 0 0 1518.68 0 -1612.06 0 0 0 0 0 -681.097 0 0 0 
0 0 0 0 0 0 0 0 0 0 0 0 0 0 0 1960.28 0 0 821.787 0 0 0 0 0 0 0 0 0 0 0 0 0 0 0 0 0 0 0 0 0 0 -1007.95 0 0 0.04 0 0 0 0 0 0 0 0 0 0 313.807 0 
0 0 0 0 0 0 0 0 0 0 2258.29 0 0 0 0 0 0 0 0 0 0 0 0 0 897.473 0 -1750.16 0 0 0 0 0 0 0 408.414 0 0 0 0 0 0 0 0 -1017.11 0 0.04 0 0 0 0 0 0 0 0 0 31.9681 0 
0 0 0 0 2029.86 0 0 0 -413.297 0 0 0 0 0 0 0 0 0 149.77 1556.52 0 0 0 0 0 0 0 0 0 0 0 -1005.36 0 0 0 0 0 0 0 0 0 0 0 0 0 0 0.07 0 0 0 0 0 0 0 0 2132.56 0 
0 0 395.138 0 0 0 0 0 0 0 658.971 0 0 0 0 0 0 0 0 0 0 0 0 0 2135 0 0 0 0 0 0 873.821 1345.79 0 1236.53 0 0 0 0 0 0 0 0 1577.88 0 0 0 0.09 0 -241.63 -407.956 0 -856.731 0 0 0 0 
0 0 0 0 0 0 0 0 0 0 0 0 0 -178.304 0 -1896.04 0 0 0 0 0 1167.56 0 0 0 0 2449.95 0 0 0 0 0 0 0 0 -1246.3 0 0 0 0 0 0 0 0 0 0 0 0 0.04 0 0 0 1452.6 0 0 0 0 
-1592.23 0 0 0 0 0 0 0 0 0 0 0 0 0 0 613.346 0 0 0 1567.96 1806.01 0 0 0 0 0 0 0 0 0 0 0 0 0 0 0 0 0 0 -1495.03 0 0 0 0 0 0 0 -594.272 0 0.01 0 780.587 0 0 0 0 0 
0 0 0 521.332 0 0 0 0 0 0 0 0 0 0 1089.13 22.5074 0 -140.156 0 0 1487.7 0 0 0 0 0 0 0 0 0 0 0 0 0 0 0 0 0 890.912 0 0 0 0 0 0 0 0 1535.92 0 0 0.02 0 0 0 0 0 0 
0 -1724.68 0 0 1763.59 0 0 0 0 1804.64 0 0 0 917.005 0 0 0 0 0 0 0 0 0 0 0 0 0 0 712.378 0 0 0 0 0 0 0 0 0 0 0 161.977 0 0 0 0 0 0 0 0 -327.998 0 0.01 0 0 0 0 0 
0 0 0 0 0 0 0 0 0 0 0 0 0 -1421.02 0 0 2458.49 0 0 0 0 0 0 0 0 0 0 0 0 0 0 0 0 -362.789 0 0 0 0 0 0 0 -1336.48 0 0 0 0 0 2398.07 28.3059 0 0 0 0.04 0 0 0 0 
0 0 0 0 0 0 0 0 0 0 0 0 0 0 0 0 0 0 0 0 1231.8 0 0 0 0 0 0 0 0 0 -2407.83 0 0 0 0 1803.72 0 0 -967.666 0 -781.503 0 0 2144.46 0 0 0 0 0 0 0 0 0 0.09 1056.78 0 905.255 
0 0 0 228.965 0 0 0 0 0 1547.36 0 0 0 0 0 0 0 0 0 0 0 0 -1047.17 0 0 0 0 61.5711 0 -670.263 0 0 0 0 0 0 0 0 0 0 0 0 0 0 0 0 0 0 0 0 0 0 0 507.752 0.06 0 0 
0 0 -1546.45 0 0 0 0 0 0 257.195 0 0 0 0 0 0 0 0 0 0 0 0 0 0 1471.98 0 0 0 0 0 300.836 0 0 0 0 0 -406.888 0 0 0 0 0 0 0 -307.245 -251.549 2228.69 0 0 0 0 0 0 0 0 0.07 1194.72 
0 0 1252.71 0 0 0 0 0 0 615.94 0 0 0 0 0 2395.93 0 0 0 0 0 -2210.84 0 0 0 0 0 0 0 0 0 0 0 0 -640.965 0 0 0 0 0 0 0 1074.48 0 0 0 0 0 0 0 0 0 0 1365.02 0 -1788.31 0.06 
