*Vertices 73
*Matrix 
0.04 0 0 1485.41 0 18.0822 1147.88 0 0 0 0 -322.962 -1972.18 0 -2142.48 0 0 0 0 0 0 0 0 0 0 0 0 2097.92 -796.915 0 0 0 0 -1356.62 -383.084 1560.34 0 2196.95 1520.97 291.681 1819.9 0 0 0 0 0 558.87 0 0 0 0 0 0 0 0 0 0 0 0 0 0 2250.82 0 0 2385.1 0 0 0 0 0 0 0 0 
0 0.03 0 -51.9578 -1445.74 -1900.92 0 0 0 0 2141.87 -477.081 0 0 0 0 0 -415.586 -114.826 758.003 0 2035.05 0 2170.4 692.999 0 0 0 0 0 0 0 0 -1886.73 0 0 0 0 0 0 0 0 1077.38 2115.16 0 908.612 1824.32 0 0 0 -678.503 0 0 0 137.41 2477.57 0 0 0 0 0 0 0 0 0 0 0 0 0 0 0 0 0 
0 0 0.03 0 0 -1746.19 -2084.95 2044.97 0 0 441.221 0 0 -41.5815 0 0 0 0 0 0 0 0 0 0 1992.78 0 788.827 454.65 1327.33 0 0 -725.654 2179.1 0 0 0 0 1431.09 -425.81 -553.682 0 -1601.23 0 -1848.43 0 0 0 2300.26 2033.68 0 1362.27 0 0 0 0 1115.68 0 0 -45.7015 17.3193 -1801.43 0 0 0 0 0 0 0 0 0 0 0 0 
43.4126 669.347 0 0.04 0 2437.74 0 0 632.42 0 0 0 0 0 0 0 0 0 1168.78 0 0 0 1602.45 0 0 0 133.747 0 0 0 0 2069.08 0 342.494 0 1759.93 0 0 1371.12 1079.52 0 0 0 0 0 0 0 0 0 0 0 0 0 0 0 0 0 0 0 0 0 0 0 0 0 0 0 0 0 0 0 0 0 
0 -1285.36 0 0 0.07 -1108.05 0 2376.86 2361.75 0 0 0 0 734.199 -709.326 0 0 0 0 0 0 0 0 0 0 0 0 0 0 0 0 1808.6 -194.937 0 0 2126.61 0 0 0 0 0 0 0 1320.15 0 -1039.38 335.017 2118.06 0 -2355.65 0 0 -54.5518 5.87481 0 0 0 0 0 1975.54 0 0 0 0 0 0 -886.334 0 0 2039.32 0 0 0 
-1142.38 1540.5 -615.329 289.239 1500.98 0.04 0 0 0 0 0 0 2487.03 0 0 1845.53 0 0 0 0 0 0 -636.082 0 2.36518 0 0 0 0 0 0 0 0 2358.09 0 0 1214.87 0 -463.652 0 0 0 0 0 940.352 1003.68 0 0 -243.919 0 1220.66 0 0 0 0 2075.49 0 -1530.27 1616.95 0 0 0 -2144.61 0 0 0 0 0 0 2371.52 0 0 0 
121.387 0 2404.02 0 0 0 0.06 1256.37 0 0 -205.313 0 0 0 0 0 0 0 0 0 0 0 675.909 943.251 0 0 -2201.68 0 0 0 0 1921.98 0 0 -641.118 0 0 0 0 -174.795 0 0 331.965 0 1887.49 -282.983 0 0 0 0 0 0 0 0 0 0 0 -2487.49 0 0 0 0 0 0 0 0 0 0 0 0 0 2298.88 0 
0 0 2032.61 0 1879.25 0 2186.57 0.01 0 0 0 0 0 0 0 0 -1842.78 0 0 0 0 0 0 0 0 0 0 922.651 0 0 1961.96 416.807 0 0 0 0 0 0 0 0 0 0 0 0 0 0 0 0 0 -2021.01 0 -1242.03 0 0 0 0 0 0 0 0 0 -1460.23 0 -22.5074 0 0 0 0 0 0 0 0 0 
0 0 0 544.526 -1393.4 0 0 0 0.01 0 -1526.46 1545.69 1877.73 1599.09 758.766 -1211.36 0 0 0 0 936.384 0 0 0 0 0 947.981 -1047.47 628.91 0 0 0 0 0 1183.89 0 0 0 0 2436.67 -2210.38 0 0 2177.72 0 0 0 0 0 270.47 0 0 0 0 0 0 0 0 0 0 -1045.18 0 0 0 0 0 0 0 0 0 0 0 0 
0 0 0 0 0 0 0 0 0 0.08 0 0 0 0 467.009 0 0 0 556.886 2082.05 987.198 0 2150.56 0 0 0 0 -1572.24 0 0 0 2329.4 0 -1553.32 0 0 0 0 -1221.27 0 1414.46 0 0 -982.62 -847.88 0 -819.803 0 0 0 0 0 0 0 0 0 0 0 0 0 0 0 0 0 2483.37 0 0 0 2030.63 0 0 0 0 
0 603.427 2118.06 0 0 0 1205.71 0 110.096 0 0.01 0 -2464.29 1496.86 0 0 0 0 0 0 0 2149.19 0 0 0 2230.67 0 0 0 0 -1596.8 0 0 0 0 2024.37 0 0 0 0 2448.12 0 -2089.22 0 0 0 0 0 0 0 0 0 0 0 0 0 0 0 0 0 0 0 0 0 0 0 0 0 0 0 0 0 0 
-66.3015 1312.68 0 0 0 0 0 0 -2235.4 0 0 0.05 817.972 0 0 0 0 0 0 -434.66 697.729 0 -1625.03 -414.67 1103.78 0 2018.88 0 2224.72 1473.66 0 1994.16 0 0 278.405 0 2474.21 1334.04 0 1808.91 1678.44 0 0 0 -1163.59 0 0 0 0 0 2329.1 34.8674 2461.39 0 0 0 0 0 0 0 0 -1605.35 0 0 0 0 0 0 0 0 0 0 0 
-1890.39 0 0 0 0 -1266.9 0 0 1692.33 0 2145.68 -1441.77 0.08 0 -682.928 0 1573.76 0 0 -1923.66 0 0 0 0 0 239.494 0 0 0 0 1027.79 0 0 -62.1815 0 0 0 10.6052 0 0 0 1463.44 -1457.34 0 0 0 0 0 0 0 0 0 0 0 0 0 0 0 0 0 285.73 0 0 0 0 0 0 0 0 0 0 0 0 
0 0 2264.7 0 1042.13 0 0 0 1442.53 0 2006.36 0 0 0.07 0 0 0 0 0 1734.75 0 0 0 0 0 0 0 0 0 0 906.629 -1570.56 0 0 0 -692.846 0 -377.438 0 0 0 0 0 755.867 0 0 0 1900.92 0 -1829.05 0 0 0 -1074.33 2035.05 0 0 0 0 0 0 0 0 0 0 758.156 0 0 0 0 0 -1727.58 0 
2208.7 0 0 0 1557.59 0 0 0 -389.492 2413.63 0 0 38.5296 0 0.05 0 0 0 857.189 0 0 0 1490.91 0 0 0 739.54 0 0 0 0 0 0 0 0 0 -393.765 480.743 -1446.65 0 0 0 0 0 0 0 0 0 0 0 0 0 0 0 0 0 0 0 87.6644 0 0 0 0 0 0 0 0 0 0 0 0 0 0 
0 0 0 0 0 836.894 0 0 2396.85 0 0 0 0 0 0 0.03 0 0 0 0 0 0 0 -1083.33 0 0 0 0 0 0 1264.61 0 0 0 0 0 1270.71 0 0 0 0 0 649.968 0 0 0 0 0 0 0 0 0 0 0 0 0 0 0 0 1699.19 0 0 0 0 0 804.239 0 1294.82 0 0 0 0 0 
0 0 0 0 0 0 0 -1392.18 0 0 0 0 -2390.9 0 0 0 0.06 0 0 -1978.13 0 0 0 0 0 0 0 0 0 -641.881 0 0 1311.15 0 0 2468.57 0 835.673 0 0 0 0 0 -1000.32 0 0 2474.36 0 0 0 0 0 0 1770.61 0 811.716 0 857.036 0 0 0 0 -1613.9 1586.28 1371.27 0 0 0 0 0 0 0 0 
0 1450.77 0 0 0 0 0 0 0 0 0 0 0 0 0 0 0 0.09 0 -1848.73 -2017.96 1656.16 -1158.56 0 341.884 0 588.015 0 0 1935.56 0 0 0 851.238 1859.42 1515.47 0 0 0 0 0 1603.98 1685.46 0 2014.91 0 -2119.74 0 1257.74 0 0 0 1491.06 -1069.44 0 0 0 0 0 0 0 -2342.68 0 0 0 0 0 0 0 0 0 0 103.229 
0 -709.632 0 824.381 0 0 0 0 0 1594.21 0 0 0 0 -1725.75 0 0 0 0.04 -742.134 1098.44 0 0 0 0 0 1219.75 0 2310.63 0 0 0 0 -1514.4 494.324 0 0 759.987 -340.815 2434.54 1585.67 330.439 -598.849 1187.4 0 0 0 0 0 0 0 0 0 0 0 0 0 0 0 0 -1704.99 -676.061 0 0 0 0 0 0 0 0 -1783.43 0 0 
0 -2185.51 0 0 0 0 0 0 0 1666.39 0 1194.27 -423.826 -1440.7 0 0 1873 561.617 2165.97 0.01 -2456.05 0 0 0 1379.21 0 0 0 -117.115 0 0 0 1733.22 0 -2133.47 0 0 1354.95 0 0 0 0 0 0 0 0 0 1853.77 -464.873 0 0 0 0 0 0 2379.15 2058.85 0 0 -71.4896 0 -2424.92 0 0 0 0 0 0 97.8881 -618.686 0 0 0 
0 0 0 0 0 0 0 0 1853.92 -1401.33 0 1546.45 0 0 0 0 0 1720.56 112.537 -1933.12 0.04 0 0 0 0 0 -878.246 1055.71 0 1973.86 0 0 0 2437.59 0 0 -1301.23 0 0 -2310.17 0 0 448.393 0 0 0 -1155.66 0 -1459.78 0 0 0 0 0 0 0 1160.24 0 0 0 2246.24 0 0 0 0 0 0 0 0 0 0 0 0 
0 2085.25 0 0 0 0 0 0 0 0 2313.68 0 0 0 0 0 0 -321.589 0 0 0 0.08 0 0 0 0 1346.71 0 -752.663 0 0 0 0 0 -1140.86 0 0 0 0 -307.855 0 0 0 0 0 0 0 0 648.442 0 0 1317.41 0 0 0 0 0 0 0 0 -595.035 0 0 0 0 0 0 0 0 0 0 0 0 
0 0 0 1544.77 0 -762.123 612.278 0 0 1207.85 0 1704.23 0 0 -1992.32 0 0 1715.06 0 0 0 0 0.03 0 0 1858.96 0 0 0 1969.13 0 -337.916 0 -1927.78 0 0 0 0 0 0 -210.501 0 0 0 0 -900.067 -2258.9 708.869 0 0 0 0 0 0 0 0 972.549 0 0 0 0 0 0 0 0 0 -1068.99 0 0 899.609 0 0 0 
0 -1156.12 0 0 0 0 2246.54 0 0 0 0 1989.27 0 0 0 -328.455 0 0 0 0 0 0 0 0 0 1877.27 879.925 0 -2077.01 0 0 0 0 2243.95 0 0 0 0 0 0 0 1407.13 -2412.56 0 0 0 -462.889 992.08 0 0 0 0 0 0 0 0 0 2152.39 0 0 0 0 0 0 0 2141.56 0 0 0 0 1805.25 0 0 
0 -2057.18 -1200.67 0 0 -343.562 0 0 0 0 0 1471.07 0 0 0 0 0 1346.71 0 2295.37 0 0 0 0 0.02 0 0 0 0 0 0 1332.97 0 0 2488.71 0 0 0 0 0 0 0 0 0 0 0 0 1047.47 0 0 0 0 0 0 0 0 0 0 0 -1936.78 0 0 0 0 0 0 0 0 0 0 0 0 0 
0 0 0 0 0 0 0 0 0 0 1474.43 0 1875.9 0 0 0 0 0 0 0 0 0 268.029 2381.74 0 0 0 0 0 -1514.25 0 0 0 0 0 0 0 -810.8 0 0 2245.48 0 1155.05 2432.1 0 0 0 0 0 0 0 487.915 0 -1845.07 0 0 0 0 0 0 0 0 0 0 0 0 1973.56 0 -725.196 0 1279.56 0 0 
0 0 -583.285 -2116.84 0 0 246.055 0 2279.96 0 0 1126.82 0 0 1175.95 0 0 581.454 1426.51 0 -2250.82 476.775 0 -811.106 0 0 0.07 0 2453.15 0 0 0 0 -14.8778 0 0 0 0 0 0 0 0 1798.38 0 0 0 0 -1395.69 0 0 0 0 0 0 0 0 0 0 0 0 0 0 0 0 0 0 0 0 0 0 0 0 0 
-1498.69 0 2037.8 0 0 0 0 1475.19 -466.704 1188.47 0 0 0 0 0 0 0 0 0 0 242.698 0 0 0 0 0 0 0.09 0 0 0 0 0 -1049.76 0 0 2224.27 0 2113.33 0 0 0 -1526.31 0 0 0 0 0 0 0 0 0 288.476 0 2197.41 -1015.73 0 -1732.76 0 0 0 0 0 0 0 0 -868.023 469.909 527.589 0 0 0 0 
-11.6733 0 372.707 0 0 0 0 0 1900.62 0 0 210.501 0 0 0 0 0 0 1099.2 -2398.53 0 -611.972 0 -2436.37 0 0 2221.37 0 0 0 0 0 2054.43 0 0 0 1244.62 0 -2215.72 0 0 0 0 0 0 -967.971 0 0 0 0 0 0 0 0 0 -129.475 0 0 0 0 0 0 0 0 0 0 0 0 0 0 0 0 0 
0 0 0 0 0 0 0 0 0 0 0 -1380.73 0 0 0 0 -1511.96 1797.46 0 0 1275.6 0 -958.51 0 0 1481.44 0 0 0 0 1595.43 2052.45 0 0 1395.99 0 0 0 1964.71 0 0 0 0 -944.166 0 1838.05 1508 -1083.33 0 0 -2287.44 0 -1017.11 0 0 0 0 0 0 0 0 0 0 0 0 -2394.1 0 0 0 0 0 0 0 
0 0 0 0 0 0 0 2110.89 0 0 277.642 0 2072.13 901.898 0 276.879 0 0 0 0 0 0 0 0 0 0 0 0 0 -891.98 0.07 0 1154.44 0 0 0 0 0 -1344.57 0 0 0 0 0 0 0 0 0 -1221.43 0 0 0 0 0 0 -350.124 0 0 222.251 0 0 -2411.95 0 1914.35 0 0 0 0 0 0 0 0 0 
0 0 -1692.94 2084.03 -620.06 0 -135.884 1980.88 0 -245.14 0 -1703.92 0 734.199 0 0 0 0 0 0 0 0 1453.67 0 912.732 0 0 0 0 1138.42 0 0.02 -725.959 0 2087.54 0 0 1542.18 -1746.5 339.137 144.276 0 0 0 40.5133 0 1884.44 0 0 0 0 0 0 0 0 0 0 0 0 0 0 2186.57 0 0 0 0 0 0 0 0 0 0 0 
0 0 1028.4 0 2275.08 0 0 0 0 0 0 0 0 0 0 0 -2136.07 0 0 -2060.23 0 0 0 0 0 0 0 0 -661.26 0 -476.775 2328.79 0.06 -2061.75 0 0 -583.285 764.565 -854.595 0 0 1936.32 0 1984.85 0 0 0 0 0 0 0 0 0 0 0 0 0 0 0 0 887.097 0 0 1059.68 0 0 0 656.377 0 0 0 0 0 
138.478 1507.08 0 1400.11 0 371.334 0 0 0 -427.183 0 0 -987.503 0 0 0 0 1038.62 -1286.74 0 1838.51 0 1835.31 -385.678 0 0 306.94 -1910.23 0 0 0 0 -541.932 0.02 0 0 0 0 0 0 28.6111 76.3726 0 0 0 0 0 0 1639.07 -113.3 840.403 0 0 0 0 0 0 0 0 0 0 0 -891.369 0 0 0 -1785.41 0 0 0 0 41.7341 1526.15 
-52.2629 0 0 0 0 0 1059.83 0 2160.18 0 0 1677.53 0 0 0 0 0 -618.076 2042.38 -1262.02 0 -973.159 0 0 1594.36 0 0 0 0 -407.804 0 1509.37 0 0 0 0 -97.7355 0 0 0 0 0 2264.7 38.9874 1232.41 1837.14 0 0 0 0 0 0 1385.46 0 0 2018.11 0 0 0 0 0 0 0 0 0 0 0 0 0 190.359 0 0 -1263.08 
-1790.9 0 0 -460.906 1997.51 0 0 0 0 0 -1454.59 0 0 1220.82 0 0 992.996 -2458.49 0 0 0 0 0 0 0 0 0 0 0 0 0 0 0 0 0 0.02 2283.93 0 0 0 0 0 410.398 0 0 0 0 1736.88 0 0 0 0 0 0 0 0 0 0 2366.18 0 0 0 0 0 2139.58 0 0 0 0 0 0 0 0 
0 0 0 0 0 -541.932 0 0 0 0 0 750.679 0 0 772.805 -1245.08 0 0 0 0 -2212.67 0 0 0 0 0 0 -311.06 2180.32 0 0 0 1781.59 0 1313.29 -1337.7 0 0 0 0 2291.71 0 0 0 0 0 0 0 0 0 0 0 0 0 0 0 792.489 0 0 0 0 0 -787.759 -1929 0 0 0 0 0 0 0 0 0 
-1912.52 0 1848.12 0 0 0 0 0 0 0 0 777.993 74.8466 1919.08 1494.57 0 1360.13 0 -802.866 2196.95 0 0 0 0 0 2496.95 0 0 0 0 0 -1723 1014.82 0 0 0 0 0 0 -1971.27 0 -259.178 0 0 0 616.245 0 -1921.67 0 0 -350.124 0 0 0 -1496.09 0 0 0 0 0 0 0 0 0 0 0 0 0 1390.19 0 0 0 0 
685.522 0 -1628.54 -1133.08 0 -762.581 0 0 0 2366.94 0 0 0 0 1612.98 0 0 0 416.196 0 0 0 0 0 0 0 0 -1182.52 -430.235 -858.562 1077.38 1700.72 2000.11 0 0 0 0 0 0.08 0 0 -1897.41 0 470.824 0 0 0 233.695 0 0 0 0 0 0 0 0 0 0 0 0 0 -746.559 0 0 0 0 -1915.11 0 0 74.9992 0 0 0 
2275.69 0 791.421 1733.07 0 0 1986.83 0 1557.44 0 0 794.32 0 0 0 0 0 0 1043.35 0 -1836.07 -1925.34 0 0 0 0 0 0 0 0 0 2440.95 0 0 0 0 0 1761.3 0 0.06 -49.3637 0 0 0 0 0 0 0 0 0 0 0 0 0 0 0 0 0 0 0 0 0 0 0 0 0 0 0 0 0 0 0 0 
1241.87 0 0 0 0 0 0 0 -2141.41 1813.33 1248.59 -1448.79 0 0 0 0 0 0 -152.058 0 0 0 615.024 0 0 307.092 0 0 0 0 0 -1711.71 0 -18.3874 0 0 -850.475 0 0 -569.094 0.05 0 0 2197.71 1826.76 0 0 0 0 318.079 0 0 0 0 0 0 1306.27 0 0 0 0 0 0 0 0 0 0 0 0 0 0 0 323.573 
0 0 2185.2 0 0 0 0 0 0 0 0 0 2021.16 0 0 0 0 1763.59 -353.786 0 0 0 0 -826.67 0 0 0 0 0 0 0 0 1844 2234.18 0 0 0 -11.063 447.63 0 0 0.08 0 -370.571 0 0 -1512.27 -2103.26 0 0 0 0 0 0 0 0 0 0 0 0 0 2477.72 317.927 -1060.44 0 -2132.25 0 0 0 0 0 0 0 
0 891.98 0 0 0 0 -671.484 0 0 0 899.762 0 -1442.84 0 0 188.07 0 2348.63 2295.83 0 1608.86 0 0 -1805.4 0 1920.91 -2368.01 -2317.8 0 0 0 0 0 0 -929.365 -58.5192 0 0 0 0 0 0 0.09 2487.79 0 0 0 -163.503 0 0 0 0 0 0 0 -852.153 0 0 0 0 0 0 0 0 0 0 1924.42 564.211 1945.33 0 0 0 0 
0 -948.286 -1117.66 0 1317.41 0 0 0 924.024 130.543 0 0 0 -102.313 0 0 -1141.93 0 1204.49 0 0 0 0 0 0 665.075 0 0 0 1147.27 0 0 -573.519 0 1956.77 0 0 0 -1441.31 0 1365.17 623.875 464.11 0.02 -1280.94 0 0 1775.19 0 0 0 0 0 0 0 0 0 0 0 0 0 0 0 0 0 0 0 0 0 0 0 -1166.65 -1294.21 
0 0 0 0 0 491.119 -82.9341 0 0 201.498 0 880.23 0 0 0 0 0 1771.68 0 0 0 0 0 0 0 0 0 0 0 0 0 1208.3 0 0 1323.21 0 0 0 0 0 1943.65 0 0 2389.98 0.08 0 0 0 0 0 0 0 2404.32 0 0 0 0 0 0 2494.81 0 0 0 0 0 0 0 0 0 -6.33259 0 0 0 
0 2429.81 0 0 1789.07 -1416.14 712.836 0 0 0 0 0 0 0 0 0 0 0 0 0 0 0 443.358 0 0 0 0 0 -212.027 -694.83 0 0 0 0 1048.39 0 0 1608.25 0 0 0 0 0 0 0 0.08 0 0 0 0 933.485 0 0 0 0 0 0 0 0 1755.04 0 0 -1528.9 0 0 0 0 0 -162.435 0 0 0 0 
-2255.09 641.423 0 0 -129.78 0 0 0 0 528.962 0 0 0 0 0 0 720.771 -1050.37 0 0 874.126 0 1018.17 2439.57 0 0 0 0 0 1126.82 0 -664.312 0 0 0 0 0 0 0 0 0 -2389.52 0 0 0 0 0 0 0 0 0 0 0 0 0 0 0 0 0 0 0 0 -1100.27 0 0 1768.78 0 2446.29 0 -1199.45 0 0 0 
0 0 -1752.75 0 2360.07 0 0 0 0 0 0 0 0 2060.69 0 0 0 0 0 -1917.86 0 0 1624.42 2234.79 -138.936 0 471.587 0 0 665.38 0 0 0 0 0 -53.0259 0 1208 -1805.25 0 0 1969.13 2144.76 239.036 0 0 0 0.01 0 0 0 0 0 0 0 299.921 0 0 0 0 0 0 0 0 0 1824.63 1301.08 0 0 0 -487.762 0 -1552.71 
0 0 546.968 0 0 -770.669 0 0 0 0 0 0 0 0 0 0 0 -87.6644 0 564.669 1604.28 782.876 0 0 0 0 0 0 0 0 -2195.27 0 0 1572.08 0 0 0 0 0 0 0 0 0 0 0 0 0 0 0.02 0 0 0 0 0 1483.58 0 0 0 0 0 0 0 0 0 0 0 0 0 1149.71 0 0 0 0 
0 0 0 0 87.5118 0 0 -580.233 68.5903 0 0 0 0 2453.92 0 0 0 0 0 0 0 0 0 0 0 0 0 0 0 0 0 0 0 -373.012 0 0 0 0 0 0 2342.98 0 0 0 0 0 0 0 0 0.02 0 0 0 0 0 0 0 0 0 0 0 0 0 0 -236.595 0 0 0 0 0 0 0 0 
0 2055.35 1699.19 0 0 -985.977 0 0 0 0 0 1089.59 0 0 0 0 0 0 0 0 0 0 0 0 0 0 0 0 0 968.276 0 0 0 1363.34 0 0 0 -885.571 0 0 0 0 0 0 0 -40.0555 0 0 0 0 0.06 0 0 0 0 0 0 367.824 2333.52 0 0 0 0 0 0 0 0 631.657 0 0 0 -1130.94 -2247.92 
0 0 0 0 0 0 0 2289.88 0 0 0 692.694 0 0 0 0 0 0 0 0 0 1599.55 0 0 0 1235.01 0 0 0 0 0 0 0 0 0 0 0 0 0 0 0 0 0 0 0 0 0 0 0 0 0 0.08 -1231.96 0 0 0 0 1283.68 0 0 1309.63 -1062.27 0 -1406.83 0 0 0 0 0 0 0 0 1996.14 
0 0 0 0 2491.15 0 0 0 0 0 0 1715.98 0 0 0 0 0 986.587 0 0 0 0 0 0 0 0 0 1852.24 0 -1631.75 0 0 0 0 1422.54 0 0 0 0 0 0 0 0 0 -918.989 0 0 0 0 0 0 974.38 0.06 0 0 0 0 0 0 0 0 599.765 0 0 -1308.4 0 0 1662.27 0 462.889 0 0 0 
0 0 0 0 673.925 0 0 0 0 0 0 0 0 1747.11 0 0 -2451.78 2098.38 0 0 0 0 0 0 0 1809.82 0 0 0 0 0 0 0 0 0 0 0 0 0 0 0 0 0 0 0 0 0 0 0 0 0 0 0 0.08 0 0 0 0 0 0 0 0 0 0 0 0 0 1931.75 -1850.87 0 0 0 0 
0 402.158 0 0 0 0 0 0 0 0 0 0 0 1190.76 0 0 0 0 0 0 0 0 0 0 0 0 0 2049.7 0 0 0 0 0 0 0 0 0 -648.9 0 0 0 0 0 0 0 0 0 0 2222.28 0 0 0 0 0 0.06 0 0 0 0 -1436.74 0 0 0 0 0 1884.75 0 0 0 0 0 0 -835.521 
0 2351.83 912.275 0 0 1065.32 0 0 0 0 0 0 0 0 0 0 -1325.34 0 0 2266.99 0 0 0 0 0 0 0 235.832 2081.29 0 -145.344 0 0 0 1937.39 0 0 0 0 0 0 0 -887.555 0 0 0 0 2242.88 0 0 0 0 0 0 0 0.01 492.187 0 0 0 0 0 0 0 0 0 0 0 0 0 0 0 -2100.67 
0 0 0 0 0 0 0 0 0 0 0 0 0 0 0 0 0 0 0 1376.92 1343.81 0 1038.16 0 0 0 0 0 0 0 0 0 0 0 0 0 -1501.28 0 0 0 2397.46 0 0 0 0 0 0 0 0 0 0 0 0 0 0 -2398.68 0.06 0 -2268.36 0 0 0 0 0 0 1328.55 0 0 0 0 0 0 0 
0 0 0 0 0 -467.62 207.297 0 0 0 0 0 0 0 0 0 1074.48 0 0 0 0 0 0 -2363.43 0 0 0 -215.69 0 0 0 0 0 0 0 0 0 0 0 0 0 0 0 0 0 0 0 0 0 0 1348.99 1224.17 0 0 0 0 0 0 0 0 0 516.602 0 853.526 0 191.733 0 0 0 0 0 0 0 
0 0 2013.84 0 0 73.1681 0 0 0 0 0 0 0 0 -391.476 0 0 0 0 0 0 0 0 0 0 0 0 0 0 0 2487.79 0 0 0 0 -2381.13 0 0 0 0 0 0 0 0 0 0 0 0 0 0 945.082 0 0 0 0 0 -2221.98 0 0.08 0 0 0 0 0 2180.01 -2029.86 0 0 0 0 0 0 0 
0 0 421.384 0 1264 0 0 0 0 0 0 0 0 0 0 -165.029 0 0 0 1325.8 0 0 0 0 -977.889 0 0 0 0 0 0 0 0 0 0 0 0 0 0 0 0 0 0 0 1844.16 1877.42 0 0 0 0 0 0 0 0 1296.04 0 0 0 0 0.02 0 0 0 0 0 0 0 0 0 0 0 0 0 
0 0 1569.8 0 0 0 0 0 -401.547 0 0 0 1342.59 0 0 0 0 0 2039.48 0 -2124.32 -111.469 0 0 0 0 0 0 0 0 0 0 -1665.17 0 0 0 0 0 0 0 0 0 0 0 0 0 0 0 0 0 0 1868.42 0 0 0 0 0 0 0 0 0 0 0 0 0 -582.217 0 0 0 0 0 0 0 
-114.826 0 0 0 0 0 0 -667.669 0 0 0 2347.1 0 0 0 0 0 304.651 1410.64 -1963.33 0 0 0 0 0 0 0 0 0 0 1721.17 1746.8 0 0 0 0 0 0 2467.96 0 0 -1858.04 0 0 0 0 0 0 0 0 0 -366.146 -253.838 0 0 0 0 1955.7 0 0 0 0.08 0 0 0 0 0 0 0 0 0 0 -1584.6 
0 0 0 0 0 2201.07 0 0 0 0 0 0 0 0 0 0 -235.527 0 0 0 0 0 0 0 0 0 0 0 0 0 0 0 0 694.372 0 0 158.925 0 0 0 0 1709.88 0 0 0 -561.159 2284.23 0 0 0 0 0 0 0 0 0 0 0 0 0 0 0 0.06 0 0 0 1254.08 478.912 0 0 0 0 0 
0 0 0 0 0 0 0 2292.32 0 0 0 0 0 0 0 0 -1005.2 0 0 0 0 0 0 0 0 0 0 0 0 0 2007.28 0 183.798 0 0 0 772.195 0 0 0 0 1276.97 0 0 0 0 0 0 0 0 0 1178.4 0 0 0 0 0 -899.762 0 0 0 0 0 0.03 329.524 0 0 -913.343 0 0 0 0 0 
2361.75 0 0 0 0 0 0 0 0 720.771 0 0 0 0 0 0 1711.25 0 0 0 0 0 0 0 0 0 0 0 0 0 0 0 0 0 0 -1694.01 0 0 0 0 0 0 0 0 0 0 0 0 0 1941.05 0 0 -91.7844 0 0 0 0 0 1661.66 0 0 0 0 -2106.92 0.09 0 0 0 0 0 0 0 0 
0 0 0 0 0 0 0 0 0 0 0 0 0 791.879 0 901.288 0 0 0 0 0 0 0 -1353.42 0 0 0 0 0 -237.968 0 0 0 0 0 0 0 0 0 0 0 -2411.65 0 0 0 0 2134.39 1335.26 0 0 0 0 0 0 -243.614 0 -1730.48 123.218 2485.66 0 1942.73 0 0 0 0 0 0 0 0 0 0 0 0 
0 0 0 0 922.346 0 0 0 0 0 0 0 0 0 0 0 0 0 0 0 0 0 -430.998 0 0 -395.444 0 333.644 0 0 0 0 0 -696.509 0 0 0 0 -631.047 0 0 0 2175.28 0 0 0 0 61.8763 0 0 0 0 0 0 0 0 0 0 0 0 0 0 2251.27 0 0 0 0.04 0 635.472 0 0 0 0 
0 0 0 0 0 0 0 0 0 0 0 0 0 0 0 2022.08 0 0 0 0 0 0 0 0 0 0 0 -2473.45 0 0 0 0 -1571.78 0 0 0 0 0 0 0 0 0 -617.771 0 0 0 1791.21 0 0 0 2316.43 0 -476.928 1790.14 0 0 0 0 0 0 0 0 -2142.02 1265.37 0 0 0 0.01 0 0 0 903.119 0 
0 0 0 0 0 0 0 0 0 667.211 0 0 0 0 0 0 0 0 0 -1987.14 0 0 0 0 0 2245.63 0 -388.882 0 0 0 0 0 0 0 0 0 -2359.92 0 0 0 0 -1043.96 0 0 894.421 0 0 2113.18 0 0 0 0 -788.522 0 0 0 0 0 0 0 0 0 0 0 0 1807.38 0 0.03 0 597.171 0 0 
0 0 0 0 1091.27 1769.23 0 0 0 0 0 0 0 0 0 0 0 0 0 1079.06 0 0 -658.513 0 0 0 0 0 0 0 0 0 0 0 26.78 0 0 0 2463.23 0 0 0 0 0 1467.1 0 -677.435 0 0 0 0 0 2090.14 0 0 0 0 0 0 0 0 0 0 0 0 0 0 0 0 0.07 0 1265.68 0 
0 0 0 0 0 0 0 0 0 0 0 0 0 0 0 0 0 0 2399.29 0 0 0 0 -2337.95 0 57.4511 0 0 0 0 0 0 0 0 0 0 0 0 0 0 0 0 0 0 0 0 0 -35.9355 0 0 0 0 0 0 0 0 0 0 0 0 0 0 0 0 0 0 0 0 1274.38 0 0.09 0 0 
0 0 0 0 0 0 1720.71 0 0 0 0 0 0 1549.96 0 0 0 0 0 0 0 0 0 0 0 0 0 0 0 0 0 0 0 -1038.47 0 0 0 0 0 0 0 0 0 632.878 0 0 0 0 0 0 480.438 0 0 0 0 0 0 0 0 0 0 0 0 0 0 0 0 239.036 0 -2210.38 0 0.07 0 
0 0 0 0 0 0 0 0 0 0 0 0 0 0 0 0 0 2415.77 0 0 0 0 0 0 0 0 0 0 0 0 0 0 0 2036.12 962.783 0 0 0 0 0 1781.14 0 0 -2405.39 0 0 0 -1600.62 0 0 -1225.55 464.721 0 0 -2438.2 2141.41 0 0 0 0 0 1303.83 0 0 0 0 0 0 0 0 0 0 0.09 
