*Vertices 63
*Matrix 
0.08 0 0 0 0 0 0 0 0 -2207.94 0 0 0 0 0 0 0 0 0 362.484 0 0 0 0 0 0 0 0 0 0 0 0 0 436.491 0 0 0 0 0 0 0 0 0 0 1967.45 0 0 0 -540.864 0 0 0 0 858.104 0 0 -1082.11 0 0 1856.06 0 0 0 
0 0.06 0 0 0 0 0 1653.87 0 0 0 100.177 0 -459.075 2218.47 0 0 0 0 0 0 -889.081 0 0 -22.2022 0 0 1963.03 0 0 0 0 0 0 -1085.31 0 0 0 0 0 0 0 0 0 0 0 0 0 0 0 0 0 1321.22 1361.81 0 0 1545.69 0 0 0 0 0 0 
0 0 0.01 0 -2470.24 0 0 0 0 2447.2 0 971.48 114.368 0 0 0 0 0 0 1902.14 0 0 0 0 74.8466 0 0 -121.693 0 0 0 0 -161.824 0 0 0 0 0 0 0 627.689 0 0 0 -102.924 0 0 0 0 0 0 0 0 0 641.575 0 0 0 0 0 0 0 0 
0 0 0 0.09 0 0 0 0 0 0 0 0 -3.89111 0 0 2219.99 0 0 2160.79 0 0 -1099.35 0 0 0 0 0 0 0 0 0 0 -880.383 0 0 0 0 0 0 0 0 0 0 0 0 0 -1305.51 0 0 0 0 0 0 0 0 0 0 0 0 0 0 0 0 
0 0 -541.017 0 0.01 0 0 0 0 0 0 0 0 0 0 0 0 0 0 0 0 0 0 0 0 0 0 0 0 0 0 0 0 0 0 102.771 0 0 0 0 0 0 1024.28 0 0 0 0 380.032 0 0 0 0 0 0 1361.66 0 0 0 0 0 1672.03 -1495.33 0 
0 0 0 0 0 0 0 1935.41 -665.838 0 0 0 0 1957.53 0 0 0 1863.08 0 0 0 0 0 0 0 0 0 0 0 0 -965.987 0 1924.88 -1947.92 0 0 0 0 0 0 0 0 0 0 0 0 0 0 0 0 0 0 0 0 0 -1923.51 0 0 0 0 0 0 0 
0 0 0 0 0 0 0.09 778.909 0 0 930.28 1704.23 115.131 0 0 0 0 2206.41 0 1985.92 0 0 0 0 0 0 0 0 0 0 0 0 0 0 0 0 -1733.38 -87.817 0 0 0 0 0 0 0 0 0 0 0 0 0 0 0 0 0 0 0 0 0 0 0 0 0 
0 691.931 0 0 0 -997.421 2203.82 0.08 1326.72 0 0 2222.74 -1150.62 0 0 0 0 0 0 0 0 0 0 0 0 0 1714.3 0 2469.02 0 0 0 0 950.88 0 0 0 0 0 0 0 0 0 0 -495.087 0 0 0 0 0 0 711.463 0 0 0 0 0 0 0 0 0 0 0 
0 0 0 0 0 1170.31 0 883.282 0.07 0 0 0 0 -236.747 0 243.004 0 0 0 0 1847.97 0 0 0 0 0 0 0 0 0 0 0 0 0 0 -568.178 299.615 0 -1300.47 0 0 1734.75 -1249.35 0 0 0 0 -1249.5 0 0 0 0 0 0 0 0 0 0 0 0 -162.74 0 0 
976.974 0 790.048 0 0 0 0 0 0 0.09 0 0 1390.04 0 0 0 0 0 0 0 0 0 0 0 0 0 0 0 0 0 0 0 0 0 0 0 0 0 0 0 0 0 0 0 0 0 0 -2428.74 0 0 0 0 0 0 0 0 0 0 0 0 2254.17 -2135.61 0 
0 0 0 0 0 0 -1454.59 0 0 0 0.01 0 0 0 0 0 0 -291.528 0 0 0 0 0 0 841.777 0 0 1581.09 0 0 0 0 0 0 0 0 0 0 0 1969.44 0 0 0 0 -398.19 0 0 0 0 0 0 0 0 0 0 0 0 0 0 0 0 584.658 0 
0 168.233 946.303 0 0 0 -1667.61 1939.22 0 0 0 0.02 0 0 0 0 0 0 0 0 0 0 0 0 0 0 0 2213.89 0 0 0 0 0 2286.68 0 0 0 0 0 0 714.057 0 645.543 0 0 0 0 0 -1125.29 0 0 0 1991.87 0 0 0 0 0 0 0 0 0 0 
0 0 1581.39 -2153.46 0 0 1167.71 1647.62 0 1069.6 0 0 0.03 0 0 0 0 0 0 0 0 0 616.398 0 0 0 0 0 0 -1083.48 0 0 0 0 0 0 0 0 0 0 0 0 -951.033 0 0 0 0 0 0 0 0 0 0 0 0 0 0 0 0 0 0 0 0 
0 158.773 0 0 0 896.1 0 0 823.008 0 0 0 0 0.02 0 1254.69 0 0 -495.544 -101.703 0 0 0 0 -95.4466 0 0 0 0 741.371 2171.16 0 0 0 0 0 0 919.599 0 0 0 0 0 0 0 0 0 0 1571.78 0 29.5267 0 0 0 0 0 0 0 0 0 0 530.03 0 
0 1691.87 0 0 0 0 0 0 0 0 0 0 0 0 0.01 -1005.97 0 0 0 1513.95 0 0 0 0 0 0 0 0 0 0 0 0 1352.96 677.892 0 0 1868.27 -1638.16 0 0 1746.5 0 0 0 0 0 0 633.03 0 0 0 0 0 0 0 0 0 -2063.43 0 0 0 0 0 
0 0 0 1083.18 0 0 0 0 -912.427 0 0 0 0 1337.24 -1599.55 0.09 1678.14 0 0 0 0 0 0 0 0 0 0 -1418.42 0 0 0 0 0 0 0 0 0 2339.63 0 0 0 0 0 0 0 0 0 0 0 0 0 0 -1341.06 0 0 0 0 0 90.7163 0 0 0 0 
0 0 0 0 0 0 0 0 0 0 0 0 0 0 0 -1000.78 0.06 0 -2298.43 0 0 0 0 0 0 0 0 0 0 0 0 0 0 1675.85 0 0 0 0 1116.29 0 0 0 2005.91 0 0 0 0 0 0 0 0 0 0 0 0 0 -2114.55 0 0 749.458 0 0 0 
0 0 0 0 0 1754.59 1940.9 0 0 0 -197.073 0 0 0 0 0 0 0.01 0 0 0 0 0 0 79.7296 0 0 0 -711.463 0 0 0 0 0 0 0 844.676 2460.33 0 0 0 0 0 0 0 0 0 0 0 1647.77 0 0 0 0 0 0 0 0 0 0 0 0 0 
0 0 0 1703.92 0 0 0 0 0 0 0 0 0 1738.26 0 0 -1325.95 0 0.02 0 0 0 0 0 0 0 0 0 0 0 1438.57 0 0 0 1299.55 0 0 0 0 0 0 0 0 0 0 0 1251.34 0 0 0 0 0 0 0 0 0 0 0 0 0 0 0 0 
487.762 0 -352.718 0 0 0 -208.518 0 0 0 0 0 0 -1013.14 353.481 0 0 0 0 0.06 0 0 0 0 0 1688.06 0 0 -2065.42 0 0 0 0 731.147 0 -1009.48 0 1879.41 0 0 1812.27 0 0 0 0 0 0 0 2057.63 0 0 0 0 0 0 -1010.7 0 1797.77 1176.26 0 0 0 0 
0 0 0 0 0 0 0 0 -2477.87 0 0 0 0 0 0 0 0 0 0 0 0.06 0 0 0 0 0 0 0 0 0 0 0 0 0 0 0 0 0 0 0 0 0 0 0 2463.38 0 0 0 0 0 0 0 0 0 0 0 0 0 0 0 0 0 0 
0 -754.341 0 263.298 0 0 0 0 0 0 0 0 0 0 0 0 0 0 0 0 0 0.02 2318.26 0 0 0 0 1912.67 0 1970.05 0 0 0 0 0 0 0 0 0 0 0 1022.14 0 0 0 0 0 0 0 0 0 0 0 0 0 0 0 0 0 0 0 0 0 
0 0 0 0 0 0 0 0 0 0 0 0 322.504 0 0 0 0 0 0 0 0 1805.4 0.08 2167.81 0 0 0 0 -141.53 0 665.38 491.577 0 0 0 0 0 0 0 0 0 882.061 0 0 0 0 0 0 1367.15 0 0 -2411.65 -254.143 0 0 0 0 0 0 0 0 0 0 
0 0 0 0 0 0 0 0 0 0 0 0 0 0 0 0 0 0 0 0 0 0 298.547 0.09 0 0 0 0 -1661.35 0 0 2456.51 0 -885.723 -1757.94 0 0 0 0 0 0 0 1255.91 1371.88 0 0 2342.68 0 -625.553 0 0 0 0 0 0 0 0 427.335 0 0 0 0 0 
0 -2333.67 -201.346 0 0 0 0 0 0 0 1064.1 0 0 1510.13 0 0 0 2286.07 0 0 0 0 0 0 0.04 0 0 0 0 0 0 0 0 420.011 0 0 0 0 -1753.97 0 0 0 0 0 0 0 0 0 0 0 736.03 0 0 0 0 0 0 0 0 0 0 1946.39 0 
0 0 0 0 0 0 0 0 0 0 0 0 0 0 0 0 0 0 0 96.82 0 0 0 0 0 0.07 0 0 0 0 0 0 1997.36 0 0 0 0 0 0 1945.17 0 0 0 0 0 1578.49 0 -1052.35 0 0 0 707.648 0 0 -2485.96 0 0 0 0 0 0 -1537.29 0 
0 0 0 0 0 0 0 -81.8659 0 0 0 0 0 0 0 0 0 0 0 0 0 0 0 0 0 0 0.07 0 0 0 0 0 0 0 0 0 1737.8 0 1580.02 0 0 0 0 0 0 0 0 0 0 0 0 2374.42 0 179.22 -501.495 0 0 0 0 0 0 0 0 
0 -888.47 1194.72 0 0 0 0 0 0 0 -314.875 396.359 0 0 0 1889.78 0 0 0 0 0 -1083.94 0 0 0 0 0 0.01 0 0 0 0 0 0 0 1481.6 0 0 0 0 0 0 1934.34 0 0 0 0 0 0 0 -1722.54 0 0 2333.67 0 0 -507.447 -2040.7 0 2162.01 0 0 0 
0 0 0 0 0 0 0 2171.93 0 0 0 0 0 0 0 0 0 1938.76 0 1807.08 0 0 5.56963 -1312.52 0 0 0 0 0.02 0 0 0 0 -1511.96 0 0 0 0 0 0 0 0 1034.35 0 0 0 0 0 0 0 0 0 0 0 0 0 0 0 0 776.62 0 0 0 
0 0 0 0 0 0 0 0 0 0 0 0 128.559 1248.28 0 0 0 0 0 0 0 -931.806 0 0 0 0 0 0 0 0.01 0 -1858.2 0 0 -597.324 0 0 1061.66 2209.01 0 0 0 0 0 0 -1464.05 -1817.76 1414.91 0 1503.42 -2200 0 0 0 0 0 0 0 1737.8 0 2177.72 0 926.923 
0 0 0 0 0 706.732 0 0 0 0 0 0 0 1006.42 0 0 0 0 202.261 0 0 0 2373.2 0 0 0 0 0 0 0 0.03 0 0 0 0 0 0 0 0 1952.19 0 0 0 0 0 0 0 0 0 0 1142.08 0 0 0 0 2387.39 0 0 0 0 0 0 0 
0 0 0 0 0 0 0 0 0 0 0 0 0 0 0 0 0 0 0 0 0 0 283.898 2231.28 0 0 0 0 0 2433.01 0 0.09 0 0 0 0 0 0 0 -1337.4 0 0 0 0 0 0 0 0 0 0 0 0 0 0 -1099.2 0 0 0 0 0 0 0 0 
0 0 1032.36 -314.722 0 -519.044 0 0 0 0 0 0 0 0 -1883.53 0 0 0 0 0 0 0 0 0 0 -1645.79 0 0 0 0 0 0 0.08 0 0 2160.79 0 0 0 1055.41 2370.91 1689.28 0 0 0 0 0 0 0 0 0 0 0 0 0 0 0 0 0 0 0 0 0 
98.6511 0 0 0 0 450.072 0 -1622.44 0 0 0 2444.76 0 0 -840.251 0 1856.82 0 0 1692.02 0 0 0 -622.044 1680.12 0 0 0 466.552 0 0 0 0 0.08 0 0 0 0 0 0 0 0 0 0 0 0 0 0 0 -1061.82 0 0 0 0 0 0 0 0 0 0 0 0 0 
0 2407.22 0 0 0 0 0 0 0 0 0 0 0 0 0 0 0 0 2396.85 0 0 0 0 -324.03 0 0 0 0 0 -1012.38 0 0 0 0 0.02 0 0 -2457.73 0 0 0 67.217 0 0 0 0 100.024 2148.88 0 0 0 0 -2369.69 0 0 0 0 0 0 0 0 0 0 
0 0 0 0 2182 0 0 0 509.888 0 0 0 0 0 0 0 0 0 0 -1359.98 0 0 0 0 0 0 0 2088.46 0 0 0 0 -1420.26 0 0 0.09 0 0 -1560.79 0 131.306 0 0 0 0 0 0 0 0 0 0 0 0 0 0 0 0 0 0 0 0 0 0 
0 0 0 0 0 0 1935.71 0 461.211 0 0 0 0 0 -1072.95 0 0 -46.7696 0 0 0 0 0 0 0 0 1468.47 0 0 0 0 0 0 0 0 0 0.03 0 0 0 0 0 0 0 0 -1750.92 0 0 0 0 1346.25 0 0 0 0 0 0 0 0 0 0 0 0 
0 0 0 0 0 0 1587.65 0 0 0 0 0 0 918.683 479.064 -128.712 0 -2193.44 0 1545.08 0 0 0 0 0 0 0 0 0 679.113 0 0 0 0 1023.21 0 0 0.03 0 0 0 0 0 -1408.05 0 0 0 0 0 0 0 0 0 0 0 0 0 0 0 0 0 0 0 
0 0 0 0 0 0 0 0 -954.39 0 0 0 0 0 0 0 764.87 0 0 0 0 0 0 0 -1025.65 0 -270.928 0 0 30.2896 0 0 0 0 0 1381.19 0 0 0.01 0 0 0 0 0 0 0 2026.96 0 0 845.286 0 944.014 2320.25 0 0 0 0 0 0 0 0 -2282.25 0 
0 0 0 0 0 0 0 0 0 0 1386.07 0 0 0 0 0 0 0 0 0 0 0 0 0 0 -595.492 0 0 0 0 163.503 501.953 1057.7 0 0 0 0 0 0 0.09 0 520.417 0 1042.44 0 0 0 0 0 0 979.11 0 0 0 0 0 0 -2135.15 0 0 2019.18 -2006.36 0 
0 0 1437.8 0 0 0 0 0 0 0 0 -2127.52 0 0 -31.8155 0 0 0 0 -1491.82 0 0 0 0 0 0 0 0 0 0 0 0 1578.49 0 0 997.116 0 0 0 0 0.09 0 0 0 -981.552 0 0 0 0 2480.01 0 0 828.349 0 0 0 0 0 0 0 1957.23 0 0 
0 0 0 0 0 0 0 0 1853.62 0 0 0 0 0 0 0 0 0 0 0 0 1549.2 1937.7 0 0 0 0 0 0 0 0 0 2126.91 0 1503.27 0 0 0 0 -1921.06 0 0 1572.7 -470.367 0 0 0 0 0 0 0 0 0 0 0 0 -266.198 0 0 0 0 0 0 
0 0 0 0 524.689 0 0 0 -2401.73 0 0 -307.55 -934.095 0 0 0 639.592 0 0 0 0 0 0 1355.56 0 0 0 1279.11 1847.51 0 0 0 0 0 0 0 0 0 0 0 0 644.169 0.02 0 0 2018.72 0 0 1340.3 0 0 0 0 0 0 0 281.61 -1043.35 0 0 0 0 0 
0 0 0 0 0 0 0 0 0 0 0 0 0 0 0 0 0 0 0 0 0 0 0 -1426.05 0 0 0 0 0 0 0 0 0 0 0 0 0 2485.81 0 2413.79 0 750.526 0 0.04 0 0 0 0 0 0 0 0 0 0 0 0 0 0 0 0 0 0 0 
2226.71 0 -1315.73 0 0 0 0 939.283 0 0 1176.41 0 0 0 0 0 0 0 0 0 2250.51 0 0 0 0 0 0 0 0 0 0 0 0 0 0 0 0 0 0 0 -2143.54 0 0 0 0.06 0 0 0 0 0 301.294 -2015.82 0 0 0 0 0 0 0 -572.756 0 0 0 
0 0 0 0 0 0 0 0 0 0 0 0 0 0 0 0 0 0 0 0 0 0 0 0 0 156.941 0 0 0 -1761.3 0 0 0 0 0 0 -1028.24 0 0 0 0 0 2429.04 0 0 0.08 0 0 1407.59 0 0 -285.424 0 0 0 0 0 0 0 0 0 0 0 
0 0 0 58.5192 0 0 0 0 0 0 0 0 0 0 0 0 0 0 1299.4 0 0 0 0 -1937.7 0 0 0 0 0 -569.247 0 0 0 0 626.469 0 0 0 535.218 0 0 0 0 0 0 0 0.04 0 1173.06 0 0 0 0 0 0 0 0 0 0 0 0 326.167 0 
0 0 0 0 -338.832 0 0 0 166.097 395.749 0 0 0 0 -2067.09 0 0 0 0 0 0 0 0 0 0 -1281.7 0 0 0 473.876 0 0 0 0 902.203 0 0 0 0 0 0 0 0 0 0 0 0 0.04 0 0 0 0 -772.958 0 0 0 0 0 2363.73 0 0 -107.196 0 
2429.35 0 0 0 0 0 0 0 0 0 0 1365.32 0 1863.69 0 0 0 0 0 1556.83 0 0 217.368 -2192.53 0 0 0 0 0 0 0 0 0 0 0 0 0 0 0 0 0 0 -2295.53 0 0 -271.844 -214.774 0 0.09 2381.74 0 0 0 0 2167.04 0 0 0 0 0 0 0 0 
0 0 0 0 0 0 0 0 0 0 0 0 0 0 0 0 0 453.581 0 0 0 0 0 0 0 0 0 0 0 2490.54 0 0 0 -333.186 0 0 0 0 294.275 0 1878.95 0 0 0 0 0 0 0 1030.99 0.08 0 0 0 0 0 191.733 0 1977.07 0 2200 0 0 0 
0 0 0 0 0 0 0 0 0 0 0 0 0 2436.22 0 0 0 0 0 0 0 0 0 0 1455.2 0 0 581.454 0 -1749.09 1348.99 0 0 0 0 0 -783.029 0 0 1297.11 0 0 0 0 -1686.53 0 0 0 0 0 0.02 0 0 0 0 0 0 0 0 0 0 0 0 
0 0 0 0 0 0 0 -1280.79 0 0 0 0 0 0 0 0 0 0 0 0 0 0 833.689 0 0 383.999 1176.41 0 0 0 0 0 0 0 0 0 0 0 2001.02 0 0 0 0 0 613.193 -508.057 0 0 0 0 0 0 0 0 0 0 0 574.129 0 2226.71 0 0 0 
0 376.37 0 0 0 0 0 0 0 0 0 -845.439 0 0 0 -1174.89 0 0 0 0 0 0 2073.96 0 0 0 0 0 0 0 0 0 0 0 -540.864 0 0 0 1940.9 0 -718.94 0 0 0 0 0 0 -1343.2 0 0 0 0 0.08 0 0 0 0 2203.21 0 0 0 0 0 
-2231.59 1849.96 0 0 0 0 0 0 0 0 0 0 0 0 0 0 0 0 0 0 0 0 0 0 0 0 2338.4 1050.52 0 0 0 0 0 0 0 0 0 0 0 0 0 0 0 0 0 0 0 0 0 0 0 0 0 0.05 0 370.724 0 0 0 0 0 0 0 
0 0 1000.78 0 1402.86 0 0 0 0 0 0 0 0 0 0 0 0 0 0 0 0 0 0 0 0 -385.067 2115.47 0 0 0 0 1615.12 0 0 0 0 0 0 0 0 0 0 0 0 0 0 0 0 2264.7 0 0 0 0 0 0.05 0 0 0 0 0 -620.67 0 0 
0 0 0 0 0 878.399 0 0 0 0 0 0 0 0 0 0 0 0 0 -1329 0 0 0 0 0 0 0 0 0 0 739.845 0 0 0 0 0 0 0 0 0 0 0 0 0 0 0 0 0 0 1290.86 0 0 0 1340.91 0 0.04 0 0 0 -1340.3 0 0 0 
1623.05 420.621 0 0 0 0 0 0 0 0 0 0 0 0 0 0 -1057.08 0 0 0 0 0 0 0 0 0 0 1674.17 0 0 0 0 0 0 0 0 0 0 0 0 0 1774.88 -1177.63 0 0 0 0 0 0 0 0 0 0 0 0 0 0 0 0 1708.04 -1456.88 0 0 
0 0 0 0 0 0 0 0 0 0 0 0 0 0 63.7074 0 0 0 0 727.79 0 0 0 2231.74 0 0 0 1226.62 0 0 0 0 0 0 0 0 0 0 0 353.786 0 0 646.916 0 0 0 0 0 0 1979.35 0 -1163.9 1394.16 0 0 0 0 0.01 0 1177.18 0 0 0 
0 0 0 0 0 0 0 0 0 0 0 0 0 0 0 1932.36 0 0 0 1092.18 0 0 0 0 0 0 0 0 0 629.521 0 0 0 0 0 0 0 0 0 0 0 0 0 0 0 0 0 -177.847 0 0 0 0 0 0 0 0 0 0 0.02 0 0 0 0 
992.843 0 0 0 0 0 0 0 0 0 0 0 0 0 0 0 2446.9 0 0 0 0 0 0 0 0 0 0 516.297 1851.48 0 0 0 0 0 0 0 0 0 0 0 0 0 0 0 338.374 0 0 0 0 -2235.4 0 728.401 0 0 0 1428.65 -183.187 1942.88 0 0 0 0 0 
0 0 0 0 2177.72 0 0 0 210.196 859.325 0 0 0 0 0 0 0 0 0 0 0 0 0 0 0 0 0 0 0 -2424.47 0 0 0 0 0 0 0 0 0 -747.475 1180.23 0 0 0 0 0 0 0 0 0 0 0 0 0 2187.64 0 1702.25 0 0 0 0.07 0 0 
0 0 0 0 592.593 0 0 0 0 -458.312 1633.88 0 0 -1630.38 0 0 0 0 0 0 0 0 0 0 -302.21 1986.83 0 0 0 0 0 0 0 0 0 0 0 0 -1817 625.401 0 0 0 0 0 0 1830.58 -1147.72 0 0 0 0 0 0 0 0 0 0 0 0 0 0.07 0 
0 0 0 0 0 0 0 0 0 0 0 0 0 0 0 0 0 0 0 0 0 0 0 0 0 0 0 0 0 874.584 0 0 0 0 0 0 0 0 0 0 0 0 0 0 0 0 0 0 0 0 0 0 0 0 0 0 0 0 0 0 0 0 0.09 
