*Vertices 65
*Matrix 
0.07 0 0 0 -1745.89 0 900.525 0 2454.68 -2351.22 0 876.263 -2336.88 1674.32 0 918.531 -121.235 0 0 -10.1474 -988.876 0 0 0 0 0 0 1741.46 0 0 0 0 0 0 0 0 0 1998.12 0 0 0 -2294.46 0 0 1708.96 0 2332 0 0 0 0 0 0 0 0 0 0 0 -1386.53 0 0 0 0 0 0 
0 0.05 0 0 -342.341 2190.39 0 0 2092.88 0 0 0 0 0 0 0 -65.6911 0 1299.4 -1146.5 0 220.267 0 0 729.621 -1172.9 0 0 0 2355.34 0 0 0 -1151.54 0 0 0 1766.49 1279.26 0 0 -1363.95 -398.495 0 0 0 0 0 0 0 0 0 0 387.204 0 0 0 0 -1271.63 0 -1658.91 0 0 0 1916.03 
0 0 0.04 0 0 0 0 0 257.347 0 0 -27.0852 0 0 0 94.8363 2409.51 -2096.55 0 -600.681 0 0 0 0 0 0 0 89.4955 0 2225.33 0 0 0 0 0 0 0 0 0 -2085.71 0 0 0 2280.72 0 -952.254 0 0 251.091 0 -1737.95 0 0 0 0 465.484 1309.32 0 0 0 0 0 574.74 0 215.537 
0 0 0 0.05 2017.96 0 -2446.75 0 776.162 0 0 0 2055.5 974.227 0 0 -878.704 0 0 -1096.76 0 0 0 0 -2388.15 0 0 0 2282.25 0 -1613.13 0 0 0 2039.02 0 0 2280.11 -885.418 0 0 0 0 -2171.32 0 0 -615.482 0 2423.4 0 0 -1222.19 305.109 0 0 0 0 0 0 2151.48 0 2325.89 0 0 0 
1560.49 -1915.88 0 -1322.75 0.05 0 0 -2120.96 0 0 0 -1137.96 0 0 1941.66 2478.03 0 0 0 460.295 0 1574.68 0 0 0 -682.623 0 0 0 2477.26 0 0 2033.37 0 0 0 0 0 0 0 0 0 0 0 0 0 0 0 0 0 799.356 -1920.76 1837.14 0 0 1755.5 0 0 1556.98 1122.09 1444.98 -943.861 -1121.78 0 0 
0 869.396 0 0 0 0.05 1490.3 2124.32 0 0 0 0 1591.16 0 790.963 0 0 0 587.405 469.604 988.418 -1175.65 0 -1500.21 0 0 -257.347 0 732.521 0 2422.18 0 0 0 0 0 -1802.19 -876.11 -779.672 0 0 0 0 0 0 1366.7 0 0 0 0 0 1195.79 0 2232.66 0 0 0 0 2354.73 1901.53 593.509 0 0 0 0 
-87.5118 0 0 168.233 0 1205.4 0.03 0 0 0 0 0 0 0 -1241.26 0 0 0 -1994.92 0 148.854 0 0 0 169.912 -258.873 0 0 -1470.61 0 -756.02 0 0 0 1114.76 854.9 0 0 0 0 0 0 0 2026.51 2469.63 0 1884.75 0 0 1078.91 0 1475.19 0 0 0 1682.71 0 0 1198.84 0 0 1354.79 0 0 2427.37 
0 0 0 0 1516.39 1544.31 0 0.06 0 0 0 0 0 0 0 0 0 0 0 0 -1209.37 0 527.589 0 0 0 -347.682 0 0 0 1451.38 0 0 1813.64 0 0 0 0 0 -915.937 0 0 0 0 0 0 -1889.48 0 1721.02 2144.46 0 -2404.93 0 0 1849.04 0 0 0 -113.147 -1134.91 0 0 0 0 0 
-2476.2 1399.96 245.445 1496.55 0 0 0 0 0.08 0 0 0 1576.36 -1929.46 0 -2226.4 0 0 0 0 0 0 0 0 1046.86 -581.301 0 -845.592 100.33 0 0 0 0 0 2346.8 0 2118.82 0 0 0 0 2109.36 1818.22 -1183.74 1550.26 0 0 0 0 0 0 450.53 -1706.52 0 0 898.846 0 0 -2028.34 0 0 0 2304.68 0 -1102.86 
1887.95 0 0 0 0 0 0 0 0 0.03 0 0 0 0 2247.92 0 0 24.9489 -1404.23 0 0 0 0 0 0 418.638 0 0 2298.43 0 0 1602.45 0 0 0 0 0 0 2025.74 0 0 972.243 0 0 0 0 1196.1 0 0 0 0 0 0 1324.73 0 0 804.849 0 -2149.65 0 1821.42 -2011.4 1790.9 0 0 
0 0 0 0 0 0 0 0 0 0 0.01 683.691 0 0 1736.73 2214.5 0 -816.446 0 0 0 0 0 0 0 349.971 1173.97 0 229.575 0 -477.081 0 0 -637.303 0 0 0 0 0 0 0 2496.95 0 0 2362.82 2269.43 0 0 -245.445 2441.4 0 1775.8 0 605.869 0 0 0 0 0 0 0 0 0 0 0 
31.5104 0 -928.755 0 492.798 0 0 0 0 0 2299.19 0.08 0 0 0 0 0 0 1037.1 0 0 1145.89 0 -293.664 0 0 0 0 0 1706.06 -451.14 0 0 0 0 0 0 0 0 0 0 0 0 0 0 0 988.418 0 361.873 0 0 177.541 0 -169.607 0 0 -1141.16 0 0 -2069.99 0 0 0 0 0 
-1785.71 0 0 1762.37 0 1932.51 0 0 2384.33 0 0 0 0.01 0 0 0 0 2344.81 0 2024.22 0 0 0 0 0 0 0 -1781.29 0 0 0 0 0 0 -312.128 0 -1298.18 0 0 -775.246 0 0 2065.42 0 0 -1176.56 0 0 0 1063.19 0 -747.627 0 0 0 0 0 0 0 0 0 887.555 1707.43 0 0 
835.978 0 0 -1344.57 0 0 0 0 1973.4 0 0 0 0 0.08 0 0 456.633 0 1343.81 0 2393.95 0 0 0 266.961 0 0 0 0 0 0 0 0 796.152 0 0 0 0 1748.79 0 509.888 0 0 -1256.83 0 0 0 0 0 0 0 0 0 0 0 -2499.39 0 0 0 0 0 0 0 522.706 0 
0 0 0 0 2300.87 104.755 1817.15 0 0 1956.62 553.529 0 0 0 0 0 0 0 0 951.491 0 0 0 -1571.47 0 0 0 0 0 0 0 0 -202.719 2360.68 0 0 0 2082.66 838.115 0 0 0 0 0 -766.243 -1961.2 0 0 0 0 -2178.95 0 0 -2007.13 0 2290.64 0 0 -679.876 0 0 -446.104 0 0 2025.74 
2198.63 0 142.445 0 479.064 0 0 0 -675.146 0 2174.37 0 0 0 0 0.07 0 0 0 -1934.49 0 1463.29 -1733.07 0 -2144.92 1473.97 0 0 0 0 981.857 0 0 0 0 1782.51 0 0 0 0 -44.3281 0 0 1867.05 -1612.83 1215.93 0 0 1839.12 0 1012.68 0 1636.48 0 0 0 0 0 -2144.15 0 972.549 2444 -492.645 0 0 
562.38 1640.45 1800.67 2158.35 0 0 0 0 0 0 0 0 0 -1860.18 0 0 0.06 0 2060.23 0 0 -121.387 0 -2131.79 0 0 -177.847 0 0 0 0 0 0 0 0 -165.181 0 2477.57 0 0 -193.564 0 0 1825.39 0 0 0 0 -1207.69 0 1758.25 -1484.34 0 0 1714.76 1178.09 0 0 0 0 0 0 2152.39 1313.29 0 
0 0 -1069.6 0 0 0 0 0 0 1556.67 764.565 0 -58.8244 0 0 0 0 0.09 0 0 0 -850.169 -1716.59 0 0 -1942.43 0 0 0 0 0 0 0 0 310.602 512.482 0 2374.72 0 1602.15 0 0 0 0 -977.126 174.947 0 0 0 0 0 0 0 849.406 1949.75 1574.68 992.843 0 1491.67 0 0 0 0 1829.05 0 
0 -956.984 0 0 0 1599.86 -952.712 0 0 2085.25 0 651.036 0 1407.9 0 0 -382.015 0 0.04 0 2007.43 0 0 0 0 0 0 -662.786 0 0 0 -1705.6 0 0 0 0 0 2008.35 0 1356.47 0 0 0 0 0 0 0 0 0 0 0 334.254 0 0 0 0 1794.72 0 0 0 0 479.522 0 0 0 
-1923.05 -329.829 1037.86 -35.02 1012.53 1468.78 0 0 0 0 0 0 -1219.44 0 1933.73 -1938.92 0 0 0 0.05 -547.884 0 0 0 0 0 0 -1606.72 0 -721.534 0 729.316 0 0 0 0 2129.51 0 0 0 0 0 -1720.71 0 0 -2095.17 0 0 0 1889.48 0 -1126.82 0 1401.03 0 -272.759 0 0 0 0 0 0 0 0 1986.83 
2162.47 0 0 0 0 -1280.94 -318.079 1849.04 0 0 0 0 0 -409.024 0 0 0 0 2194.66 -1128.65 0.07 0 1770 0 0 0 0 0 0 0 0 -1010.24 0 0 0 0 0 0 0 1606.88 0 0 1991.87 0 1973.4 0 0 0 -1440.09 645.848 1642.12 0 0 0 -2430.11 0 0 1878.8 0 0 0 0 1987.9 0 0 
0 -73.4733 0 0 2266.23 1011 0 0 0 0 0 412.534 0 0 0 2206.11 -2299.49 106.433 0 0 0 0 -535.218 0 0 1856.97 0 0 0 -2378.84 1516.54 0 0 0 0 -2016.74 0 0 -222.556 1569.19 0 0 0 0 0 0 0 0 -582.522 0 0 0 -96.9726 0 0 0 0 0 265.13 0 0 0 0 0 -2245.63 
0 0 0 0 0 0 0 -1105.15 0 0 0 0 0 0 0 -2418.97 0 1047.01 0 0 37.4615 -2176.35 0.03 0 0 0 0 -1674.78 0 0 -9.68963 1541.11 0 0 1947.77 0 1145.13 892.438 0 60.5029 0 0 -127.186 0 -308.313 0 0 -1936.78 308.771 1740.55 0 2394.56 1553.93 0 0 0 -2184.59 -81.8659 0 0 0 0 0 0 0 
0 0 0 0 0 -132.832 0 0 0 0 0 1394.01 0 0 1874.07 0 1614.05 0 0 0 0 0 0 0.08 -1015.43 0 0 -791.116 0 0 0 0 0 0 0 157.399 0 0 787.301 0 0 0 0 0 0 2235.4 0 1782.51 0 0 0 0 0 0 0 -932.875 0 0 0 -961.257 0 2152.7 -561.464 0 0 
0 1905.5 0 -1610.23 0 0 -1428.65 0 682.318 0 0 0 0 2081.29 0 376.064 0 0 0 0 0 0 0 -905.56 0.09 0 0 0 563.906 -1795.63 0 0 0 0 0 0 0 0 0 -60.9607 0 0 0 0 617.771 0 0 0 0 0 -195.09 0 0 0 0 0 1225.24 0 2025.13 0 0 585.879 0 730.842 -2465.51 
0 1231.19 0 0 -1081.8 0 1957.08 0 -1909.16 173.727 723.67 0 0 0 0 38.8348 0 1038.62 0 0 0 104.45 0 0 0 0.07 0 0 0 0 2270.2 0 -2409.67 0 462.737 0 0 0 0 1492.43 0 0 -1670.66 0 -2074.57 0 0 1478.39 760.292 0 0 0 0 0 0 0 0 0 -1498.08 -966.292 0 0 0 0 -3.89111 
0 0 0 0 0 1843.24 0 1944.11 0 0 -1959.36 0 0 0 0 0 -361.568 0 0 0 0 0 0 0 0 0 0.02 0 0 0 0 0 0 364.772 0 0 0 0 0 0 0 -736.793 0 0 0 0 0 0 0 0 1249.66 0 0 0 1376 0 0 0 0 0 0 0 0 1168.48 0 
-1328.7 0 2003.46 0 0 0 0 0 1904.74 0 0 0 480.743 0 0 0 0 0 -2471.31 235.679 0 0 787.759 1528.14 0 0 0 0.04 10.1474 0 2221.37 2321.92 0 0 0 -992.843 0 0 1298.94 -873.516 0 0 0 0 0 -1265.83 1350.22 0 0 0 -1943.34 0 0 429.319 0 400.174 -2174.37 0 0 0 2444.91 0 -2286.83 0 0 
0 0 0 -1923.96 0 -1273.46 2444.61 0 -2046.19 268.334 -339.9 0 0 0 0 0 0 0 0 0 0 0 0 0 -718.177 0 0 1750.01 0 0 2148.58 591.067 0 0 0 0 930.738 0 0 0 1420.71 0 -1207.08 0 806.223 0 -487.762 -2046.49 0 0 0 0 0 1288.42 0 0 0 0 0 0 0 0 -1676.92 0 0 
0 -74.2363 1803.26 0 -1877.12 0 0 0 0 0 0 1296.5 0 0 0 0 0 0 0 -1000.02 0 -1376.92 0 0 1821.42 0 0 0 0 0.08 0 0 0 0 0 0 0 1052.2 -243.309 0 0 2114.4 0 0 0 0 0 616.245 0 -2469.18 0 0 0 534.455 0 0 0 0 1739.94 0 1173.97 -420.774 1716.59 0 0 
0 0 0 -8.46889 0 2268.36 726.875 -654.546 0 0 -83.8496 491.119 0 0 0 -1992.63 0 0 0 0 0 1418.27 2235.4 0 0 1395.99 0 -829.264 113.3 0 0.08 0 530.183 0 0 0 0 0 0 0 0 -2481.54 1097.83 0 0 0 0 0 0 0 2252.65 -2313.84 0 0 0 2390.9 -1852.7 0 0 0 89.6481 1120.56 769.448 0 1935.26 
0 0 0 0 0 0 0 0 0 -1468.32 0 0 0 0 0 0 0 0 2159.87 1224.17 2122.64 0 -1626.26 0 0 0 0 1395.38 1314.51 0 0 0 1605.66 2160.63 282.983 0 0 0 0 -1220.36 0 0 0 0 0 0 1003.22 0 0 2329.55 0 0 0 0 0 0 0 0 0 0 -275.658 0 793.71 -1036.64 -1778.24 
0 0 0 0 2390.59 0 0 0 0 0 0 0 0 0 2163.99 0 0 0 0 0 0 0 0 0 0 2430.72 0 0 0 0 1099.51 -2458.8 0.09 0 0 0 0 0 0 0 0 0 0 0 148.854 0 -1002.91 0 -82.9341 0 953.017 -338.984 0 0 0 1943.95 0 -429.93 0 0 2040.24 0 0 0 0 
0 -620.67 0 0 0 0 0 -2116.23 0 0 927.839 0 0 1936.32 1222.65 0 0 0 0 0 0 0 0 0 0 0 -269.402 0 0 0 0 2311.09 0 0.02 0 0 416.349 0 -96.9726 1494.26 0 0 0 618.076 0 0 0 0 0 0 774.636 0 0 0 0 0 0 0 0 0 0 644.475 -543.153 -2372.74 0 
0 0 0 -1769.54 0 0 292.291 0 -1347.32 0 0 0 -1679.97 0 0 0 0 661.718 0 0 0 0 1234.24 0 0 956.984 0 0 0 0 0 952.254 0 0 0.01 0 1615.88 0 0 0 0 -852.306 376.98 0 0 0 0 0 0 0 0 0 0 0 0 0 1674.02 0 -1414.15 0 0 0 0 0 0 
0 0 0 0 0 0 -252.159 0 0 0 0 0 0 0 0 -33.9518 1565.37 -574.74 0 0 0 -272.607 0 -628.605 0 0 0 -1795.94 0 0 0 0 0 0 0 0.06 -82.3237 0 0 0 0 0 2214.8 0 0 -1416.29 0 -129.933 0 0 0 0 0 0 347.987 0 0 0 0 0 0 0 0 0 1511.51 
0 0 0 0 0 2017.81 0 0 855.815 0 0 0 2269.74 0 0 0 0 0 0 -2094.71 0 0 44.0229 0 0 0 0 0 -354.701 0 0 0 0 615.787 2381.59 -1772.9 0.03 0 0 1061.2 1765.57 0 558.107 -2125.23 98.4985 -557.955 -984.909 0 0 0 -921.125 0 0 0 0 0 -1500.82 2287.29 -167.013 0 0 0 1861.4 0 0 
-434.965 1974.47 0 1410.64 0 918.836 0 0 0 0 0 0 0 0 82.0185 0 776.772 -2422.03 320.368 0 0 0 -201.041 0 0 0 0 0 0 175.71 0 0 0 0 0 0 0 0 0 0 -1603.21 0 0 0 1643.35 0 0 0 0 0 1319.54 -2052.6 0 0 0 0 0 2109.97 0 0 0 0 0 0 -1937.85 
0 -527.436 0 2045.43 0 -2180.62 0 0 0 1834.39 0 0 0 -402.463 -578.555 0 0 0 0 0 0 2336.12 0 -132.221 0 0 0 1051.44 0 -2098.53 0 0 0 1767.25 0 0 0 0 0.09 0 0 1654.03 0 -2039.78 2183.52 1884.29 0 0 0 0 0 0 0 0 0 0 0 0 0 1822.49 0 0 0 0 0 
0 0 2496.34 0 0 0 0 917.158 0 0 0 0 -2032.61 0 0 0 0 1668.68 2090.75 0 -2061.91 -1765.42 854.137 0 2045.43 886.792 0 2115.77 0 0 0 -1684.7 0 -113.453 0 0 -798.898 0 0 0.08 0 0 1610.54 1497.47 399.106 0 0 0 0 0 0 1375.85 -2287.59 0 0 0 0 0 -1233.02 0 0 0 0 0 0 
0 0 0 0 0 0 0 0 0 0 0 0 0 1337.55 0 1679.36 146.26 0 0 0 0 0 0 0 0 0 0 0 517.975 0 0 0 0 0 0 0 1675.39 1128.65 0 0 0.07 0 0 0 0 -2157.58 0 0 0 0 0 0 0 0 0 0 0 0 0 0 0 1063.49 0 -758.461 0 
819.346 -2011.4 0 0 0 0 0 0 419.706 2086.32 922.498 0 0 0 0 0 0 0 0 0 0 0 0 0 0 0 -593.051 0 0 -949.355 1836.38 0 0 0 1461.91 0 0 0 -245.598 0 0 0.04 0 0 0 0 0 0 979.873 0 2260.58 0 1257.74 0 0 -927.534 0 2110.43 1901.23 0 0 0 -2122.18 0 0 
0 -1529.66 0 0 0 0 0 0 1337.24 0 0 0 -550.325 0 0 0 0 0 0 -1179.46 -1913.59 0 386.746 0 0 -1550.72 0 0 -620.975 0 -851.848 0 0 0 765.023 -819.498 1475.95 0 0 -2280.27 0 0 0.07 0 0 0 0 0 0 0 0 1707.43 1697.82 821.787 0 0 2168.26 0 0 1348.69 0 0 1731.85 0 0 
0 0 -239.952 2171.47 0 0 2264.55 0 539.186 0 0 0 0 893.658 0 -2232.81 1922.28 0 0 0 0 0 0 0 0 0 0 0 0 0 0 0 0 -1878.8 0 0 -2304.07 0 -1718.12 2108.45 0 0 0 0.03 0 0 0 1480.38 0 1590.55 0 0 0 0 617.618 0 0 0 235.069 0 0 1483.73 0 0 0 
826.67 0 0 0 0 0 -2115.47 0 24.1859 0 -2079.15 0 0 0 2480.01 1263.24 0 -82.1711 0 0 1342.28 0 -1597.11 0 -1423.46 -1554.54 0 0 -2097.61 0 0 0 1319.09 0 0 0 2315.67 136.647 2341.76 99.5666 0 0 0 0 0.01 0 2229.61 0 0 0 0 0 0 0 514.313 0 0 0 0 0 0 0 601.596 0 0 
0 0 -1218.53 0 0 1952.8 0 0 0 0 -125.202 0 31.8155 0 -1641.36 489.898 0 -1074.79 0 -1553.01 0 0 0 -1357.39 0 0 0 -920.515 0 0 0 0 0 0 0 2066.79 2401.43 0 556.429 0 1245.23 0 0 0 0 0.04 0 0 494.018 0 0 0 0 94.3785 -523.927 0 -2156.97 2032 0 0 0 -185.324 -928.144 0 0 
-979.72 0 0 1007.64 0 0 -301.599 853.374 0 1673.56 0 -876.873 0 0 0 0 0 0 0 0 0 0 0 0 0 0 0 897.168 335.932 0 0 791.269 -189.138 0 0 0 1054.03 0 0 0 0 0 0 0 -261.62 0 0.02 97.2777 0 0 0 0 140.919 0 0 1659.06 1446.04 0 0 0 -1616.64 -2264.85 0 0 0 
0 0 0 0 0 0 0 0 0 0 0 0 0 0 0 0 0 0 0 0 0 0 1676.76 -915.632 0 1200.83 0 0 759.072 1943.34 0 0 0 0 0 1362.27 0 0 0 0 0 0 0 -510.041 0 0 -2435.91 0.08 0 0 0 0 0 0 0 0 0 -2393.49 -684.606 0 0 0 0 0 2362.67 
0 0 -2136.37 1264.61 0 0 0 817.972 0 0 163.808 -2212.06 0 0 0 683.233 -2307.58 0 0 0 -237.358 -270.013 2394.25 0 0 1313.59 0 0 0 0 0 0 2433.16 0 0 0 0 0 0 0 0 451.598 0 0 0 -1748.33 0 0 0.04 0 0 0 0 0 0 1456.72 0 0 0 152.058 0 -2085.86 0 0 1599.55 
0 0 0 0 0 0 1623.51 2356.11 0 0 1599.86 0 60.8081 0 0 0 0 0 0 1904.89 -511.719 0 -636.082 0 0 0 0 0 0 1031.6 0 -212.18 0 0 0 0 0 0 0 0 0 0 0 1882.61 0 0 0 0 0 0.05 0 2352.14 0 2149.95 -1883.83 0 -587.558 0 -126.881 0 -161.061 0 -692.389 0 -1600.62 
0 0 1290.7 0 573.214 0 0 0 0 0 0 0 0 0 1431.24 -406.888 1954.33 0 0 0 441.832 0 0 0 1464.05 0 -1858.65 -208.06 0 0 -51.0422 0 2411.04 -927.839 0 0 1551.79 -2328.94 0 0 0 -782.266 0 0 0 0 0 0 0 0 0.09 -792.642 0 0 0 0 0 0 887.555 0 0 0 0 65.2333 0 
0 0 0 -1101.64 444.426 -323.878 2425.08 -142.445 1159.78 0 2181.08 -738.319 1747.72 0 0 0 443.663 0 2397.61 2264.09 0 0 1080.43 0 0 0 0 0 0 0 -2088.46 0 1118.58 0 0 0 0 -1287.96 0 -200.278 0 0 -1500.67 0 0 0 0 0 0 -1963.79 1137.81 0.04 0 -848.033 -2056.41 2035.51 0 -1792.28 0 1659.37 0 0 322.81 0 0 
0 0 0 576.724 1916.64 0 0 0 1618.63 0 0 0 0 0 0 1608.1 0 0 0 0 0 2121.88 -1477.63 0 0 0 0 0 0 0 0 0 0 0 0 0 0 0 0 -1631.29 0 -442.595 -95.7518 0 0 0 -1373.87 0 0 0 0 0 0.05 0 0 0 0 0 0 0 888.165 0 0 0 0 
0 1946.85 0 0 0 2331.08 0 0 0 1463.59 -10.3 -2059.31 0 0 1847.06 0 0 -1375.24 0 1627.02 0 0 0 0 0 0 0 -681.097 -260.552 271.538 0 0 0 0 0 0 0 0 0 0 0 0 1827.68 0 0 2493.9 0 0 0 635.472 0 929.823 0 0.03 0 0 0 0 0 0 0 -1395.99 -667.974 0 0 
0 0 0 0 0 0 0 -1049.3 0 0 0 0 0 0 0 0 1761.76 2021.47 0 0 464.568 0 0 0 0 0 861.309 0 0 0 0 0 0 0 0 1617.71 0 0 0 0 0 0 0 2320.7 1638.77 -726.569 0 0 0 -1838.97 0 1624.73 0 0 0.01 0 0 354.701 0 1824.47 0 0 188.528 0 -1026.72 
0 0 -2448.88 0 1029.47 0 2205.5 0 1086.38 0 0 0 0 2347.25 -774.789 0 1397.67 2373.81 0 -1985.46 0 0 0 2128.44 0 0 0 139.546 0 0 -664.006 0 -600.681 0 0 0 0 0 0 0 0 -1973.56 0 0 0 0 1851.94 0 -1068.83 0 0 -795.694 0 0 0 0.01 0 0 0 0 2079.91 0 0 -1109.27 0 
0 0 2107.99 0 0 0 0 0 0 -1886.12 0 -1629.15 0 0 0 0 0 2462 472.198 0 0 0 1583.07 0 145.65 0 0 1813.64 0 0 1189.08 0 0 0 585.116 0 1361.2 0 0 0 0 0 705.512 0 0 -675.909 -1428.8 0 0 146.413 0 0 0 0 0 0 0.06 0 0 0 -1314.97 0 0 0 0 
0 0 0 0 0 0 0 0 0 0 0 0 0 0 0 0 0 0 0 0 -683.996 0 2282.56 0 0 0 0 0 0 0 0 0 1082.42 0 0 0 -508.209 -444.426 0 0 0 1588.41 0 0 0 331.202 0 1565.22 0 0 0 61.4185 0 0 -1230.12 0 0 0.08 1000.32 0 2201.83 0 0 -1175.19 -815.226 
663.549 918.226 0 0 2240.44 472.35 -657.903 -1777.63 1004.59 806.223 0 0 0 0 -463.958 1345.03 0 -1984.69 0 0 0 152.974 0 0 1886.27 1924.27 0 0 0 882.061 0 0 0 0 -2282.25 0 -2487.49 0 0 -395.291 0 124.439 0 -1660.59 0 0 0 2096.85 0 1473.82 1414.15 0 0 0 0 0 0 824.992 0.08 -945.845 0 0 0 0 0 
0 0 0 -1895.12 -101.856 1377.22 0 1153.52 0 0 0 2057.48 0 0 0 0 0 0 0 0 0 0 0 1296.04 0 -548.494 0 0 0 0 0 0 0 0 0 0 0 0 1225.55 0 0 0 1868.57 0 0 0 0 0 257.805 0 0 -1142.23 0 0 -435.423 0 0 0 1002.76 0.03 326.777 1579.71 243.004 -1957.84 0 
0 1922.9 0 0 2040.09 -2358.39 0 0 0 1087.15 0 0 0 0 0 2142.63 0 0 0 0 0 0 0 0 0 0 0 1614.2 0 -427.641 1768.47 -2356.26 -70.1163 0 0 0 0 0 0 0 0 0 0 0 0 0 588.473 0 0 440.153 0 0 -1738.26 0 0 1280.48 227.744 -62.9444 0 -1211.97 0.02 0 1077.07 1686.22 0 
0 0 0 1509.06 1961.96 0 -711.921 0 0 -1425.44 0 0 1091.42 0 -1886.73 494.629 0 0 494.934 0 0 0 0 450.835 -2199.24 0 0 0 0 1371.58 532.167 0 0 2117.15 0 0 0 0 0 0 922.193 0 0 -424.436 0 948.286 -377.895 0 166.25 0 0 0 0 -806.375 0 0 0 0 0 -593.356 0 0.02 0 1063.65 0 
0 0 2310.17 0 1361.05 0 0 0 1392.18 79.577 0 0 -936.995 0 0 1777.32 2183.68 0 0 0 -532.319 0 0 2203.21 0 0 0 956.984 -283.593 -2452.54 -2416.53 -1877.88 0 152.821 0 0 382.931 0 0 0 0 1054.03 -546.052 0 2360.53 1614.81 0 0 0 1850.11 0 84.3074 0 1948.84 -1652.5 0 0 0 0 1227.53 797.83 0 0.04 1911.15 0 
0 0 0 0 0 0 0 0 0 0 0 0 0 1891 0 0 2044.05 1771.22 0 0 0 0 0 0 2218.77 0 2241.2 0 0 0 0 901.593 0 1162.53 0 0 0 0 0 0 2337.18 0 0 0 0 0 0 0 0 0 1282.01 0 0 0 0 -642.643 0 2188.1 0 -81.5607 789.132 -2476.2 2059.01 0.09 0 
0 617.618 2267.14 0 0 0 2386.62 0 -1055.41 0 0 0 0 0 1151.23 0 0 0 0 -1043.66 0 2008.35 0 0 -2136.52 -556.429 0 0 0 0 -281.762 1916.49 0 0 0 -2441.71 0 2241.81 0 0 0 0 0 0 0 0 0 1528.6 1852.55 -859.783 0 0 0 0 1380.58 0 0 2010.03 0 0 0 0 0 0 0 
