*Vertices 45
*Matrix 
0.09 0 0 0 0 0 0 0 0 0 0 0 0 0 0 0 0 0 0 0 0 2225.18 0 0 -133.747 -544.526 0 0 328.455 0 0 0 0 0 0 2279.2 0 0 0 0 0 0 0 0 0 
0 0.07 0 -1284.91 0 0 0 0 0 0 0 0 0 0 0 0 1861.71 0 0 0 0 0 0 0 0 0 0 0 0 2327.57 0 0 0 0 -345.698 0 0 0 0 0 0 0 0 0 0 
0 0 0.05 0 290.613 0 0 0 0 0 0 2229.76 0 0 0 767.312 0 0 0 0 0 0 0 0 0 0 0 0 0 0 0 0 0 0 0 0 0 -512.482 0 0 0 0 0 0 0 
0 -244.224 0 0.08 0 0 2202.29 0 0 650.578 0 0 0 314.112 0 0 0 0 0 0 0 0 0 0 0 0 0 0 0 0 0 0 0 1205.86 0 0 0 0 2262.87 289.392 -443.358 0 0 0 0 
0 0 1041.22 0 0.05 0 0 0 0 0 0 0 0 0 0 0 1295.89 0 0 0 0 0 0 0 1430.78 0 1723.15 0 0 0 0 0 0 0 0 0 2065.11 0 0 0 0 0 0 0 0 
0 0 0 0 0 0.02 1666.54 0 0 0 0 627.689 2023.3 40.6659 0 0 0 0 0 0 0 0 0 0 0 0 0 0 0 0 0 0 0 1884.44 0 0 0 0 1745.58 0 0 0 0 0 0 
0 0 0 861.766 0 1260.49 0.03 867.26 0 0 0 0 0 0 -142.598 0 0 164.418 0 0 0 0 0 0 0 0 2057.02 0 0 0 0 1736.88 0 507.141 0 0 0 0 0 0 0 0 0 0 0 
0 0 0 0 0 0 -1419.8 0.08 0 0 0 0 0 0 0 0 0 0 0 0 0 0 1775.64 0 0 0 0 0 0 2076.56 0 0 0 0 0 1052.05 0 0 0 0 0 463.5 0 0 0 
0 0 0 0 0 0 0 0 0.09 0 -2362.51 0 2267.6 0 1268.12 0 0 0 0 0 0 0 0 0 0 0 0 0 0 0 0 0 2454.07 0 0 0 0 0 0 0 0 0 0 0 0 
0 0 0 910.749 0 0 0 0 0 0.01 919.294 0 0 0 0 0 0 0 0 0 1088.06 -624.332 0 0 0 0 0 0 0 0 0 0 0 0 0 0 0 0 0 0 839.03 2180.17 0 0 0 
0 0 0 0 0 0 0 0 1513.03 -271.996 0.08 1804.94 0 1081.65 0 0 1602.3 0 0 0 0 0 -1247.67 0 0 0 0 0 2030.17 0 0 0 0 0 0 972.549 0 0 0 0 0 0 0 0 0 
0 0 1889.17 0 0 588.931 0 0 0 0 -1979.51 0.07 0 -28.4585 0 0 128.101 0 0 0 0 0 0 0 0 0 0 1786.78 0 453.734 0 0 1803.26 2165.21 0 0 0 0 0 0 -1507.23 0 0 0 0 
0 0 0 0 0 1262.17 0 0 -2482.3 0 0 0 0.07 0 0 0 0 0 0 0 332.881 0 0 -447.935 0 1928.24 0 53.3311 0 -1494.26 893.506 -77.5933 0 2042.53 0 0 0 1651.59 0 0 0 0 0 0 2113.94 
0 0 0 -1498.99 0 2373.35 0 0 0 0 702.612 -395.596 0 0 0 0 0 0 0 1616.34 0 0 0 0 0 0 682.012 0 0 0 0 0 0 0 0 0 0 0 0 0 0 0 0 2238.91 0 
0 0 0 0 0 0 -1060.59 0 938.063 0 0 0 0 0 0.06 0 -732.978 1025.19 0 0 0 0 0 0 0 -625.553 0 0 0 0 0 2208.7 0 0 0 0 0 0 0 0 0 0 0 0 0 
0 0 1782.36 0 0 0 0 0 0 0 0 0 0 0 0 0.04 0 0 0 0 0 0 0 0 0 0 -1983.02 0 0 0 1700.26 0 -34.257 0 0 0 0 0 0 0 -94.2259 738.777 0 0 0 
0 796.152 0 0 -296.564 0 0 0 0 0 750.069 454.192 0 0 782.418 0 0.06 506.073 0 0 0 0 0 0 0 0 0 0 0 0 0 -1385.46 0 0 0 1982.71 0 0 -599.307 0 0 0 0 0 0 
0 0 0 0 0 0 503.479 0 0 0 0 0 0 0 2495.73 0 506.684 0.07 0 0 0 808.817 0 0 0 0 0 0 0 0 0 0 0 0 1727.42 0 0 0 0 -920.209 0 0 0 0 0 
0 0 0 0 0 0 0 0 0 0 0 0 0 0 0 0 0 0 0.02 -414.823 0 0 0 0 0 0 0 0 0 0 0 0 0 0 0 0 0 0 1671.12 0 0 0 0 0 0 
0 0 0 0 0 0 0 0 0 0 0 0 0 1669.74 0 0 0 0 1278.34 0.06 0 1050.83 0 0 0 -1340.14 0 0 0 -355.464 0 0 0 838.725 0 0 -1526.76 0 0 0 0 0 0 0 0 
0 0 0 0 0 0 0 0 0 679.418 0 0 -515.687 0 0 0 0 0 0 0 0.07 0 0 0 0 0 0 0 0 210.349 0 1618.17 0 -568.484 0 0 0 1830.27 0 0 0 0 0 0 0 
1762.83 0 0 0 0 0 0 0 0 1152.46 0 0 0 0 0 0 0 -998.947 0 2069.38 0 0.03 0 0 -1060.59 550.63 -465.484 0 0 0 0 0 0 0 0 0 0 0 0 0 0 0 0 0 0 
0 0 0 0 0 0 0 -393.765 0 0 1913.13 0 0 0 0 0 0 0 0 0 0 0 0.02 -559.481 0 0 0 0 0 0 0 0 0 0 0 0 1285.82 2466.12 0 0 0 0 0 0 0 
0 0 0 0 0 0 0 0 0 0 0 0 1064.56 0 0 0 0 0 0 0 0 0 2031.08 0.02 0 0 0 0 0 0 0 0 0 0 0 -183.798 0 0 0 0 0 0 0 0 0 
2398.37 0 0 0 1605.96 0 0 0 0 0 0 0 0 0 0 0 0 0 0 0 0 -898.389 0 0 0.06 0 0 0 0 0 1251.34 0 0 0 0 0 0 0 -1658.15 0 0 0 0 0 0 
102.771 0 0 0 0 0 0 0 0 0 0 0 -1463.59 0 -118.488 0 0 0 0 1494.11 0 -754.952 0 0 0 0.02 0 0 0 0 0 0 0 2038.87 1631.29 0 0 0 0 0 0 0 0 0 0 
0 0 0 0 -443.968 0 -86.9015 0 0 0 0 0 0 1891.61 0 493.103 0 0 0 0 0 1500.98 0 0 0 0 0.04 0 0 0 0 0 1859.11 0 0 0 0 0 0 0 -1846.45 0 0 0 0 
0 0 0 0 0 0 0 0 0 0 0 1273.61 1760.08 0 0 0 0 0 0 0 0 0 0 0 0 0 0 0.04 1196.71 0 0 0 0 0 0 0 0 0 2330.62 222.861 0 0 0 0 0 
2490.54 0 0 0 0 0 0 0 0 0 1526.15 0 0 0 0 0 0 0 0 0 0 0 0 0 0 0 0 1959.82 0.06 -1159.93 0 1792.58 0 0 0 0 0 0 403.836 0 0 0 0 0 0 
0 -1164.66 0 0 0 0 0 239.799 0 0 0 196.005 2367.4 0 0 0 0 0 0 2124.32 -338.832 0 0 0 0 0 0 0 2494.51 0.09 -817.515 0 0 0 0 0 0 0 0 0 2059.01 0 0 0 0 
0 0 0 0 0 0 0 0 0 0 0 0 945.082 0 0 1113.85 0 0 0 0 0 0 0 0 1947.61 0 0 0 0 467.467 0 0 0 0 0 0 0 0 0 0 0 0 0 0 0 
0 0 0 0 0 0 103.229 0 0 0 0 0 2169.18 0 2450.1 0 -2436.22 0 0 0 -1049 0 0 0 0 0 0 0 1216.09 0 0 0.09 0 0 0 0 0 0 0 0 0 1923.2 0 0 0 
0 0 0 0 0 0 0 0 16.5563 0 0 80.9503 0 0 0 1349.91 0 0 0 0 0 0 0 0 0 0 -624.332 0 0 0 0 0 0.05 0 -11.2156 0 300.836 0 0 0 0 0 261.162 0 0 
0 0 0 2177.72 0 1244.77 432.371 0 0 0 0 1110.19 645.238 0 0 0 0 0 0 -47.2274 1651.43 0 0 0 0 623.875 0 0 0 0 0 0 0 0 -1517.15 0 0 0 0 0 0 0 0 0 0 
0 -1698.89 0 0 0 0 0 0 0 0 0 0 0 0 0 0 0 368.587 0 0 0 0 0 0 0 129.933 0 0 0 0 0 0 2352.75 1541.26 0.06 0 0 0 0 -23.423 0 118.946 0 0 0 
2133.63 0 0 0 0 0 0 18.6926 0 0 2075.79 0 0 0 0 0 1401.49 0 0 0 0 0 0 -457.396 0 0 0 0 0 0 0 0 0 0 0 0.07 0 0 0 0 -2345.42 0 0 0 0 
0 0 0 0 2108.91 0 0 0 0 0 0 0 0 0 0 0 0 0 0 999.863 0 0 -2082.81 0 0 0 0 0 0 0 0 0 377.132 0 0 0 0.01 1662.27 0 0 0 0 0 0 0 
0 0 -773.873 0 0 0 0 0 0 0 0 0 -1708.66 0 0 0 0 0 0 0 2266.99 0 -144.429 0 0 0 0 0 0 0 0 0 0 0 0 0 1924.12 0.05 0 0 0 0 0 0 0 
0 0 0 1953.72 0 720.618 0 0 0 0 0 0 0 0 0 0 753.273 0 -1021.53 0 0 0 0 0 1907.03 0 0 -909.986 -1379.06 0 0 0 0 0 0 0 0 0 0.04 0 2396.08 0 0 0 0 
0 0 0 2303.77 0 0 0 0 0 0 0 0 0 0 0 0 0 -156.789 0 0 0 0 0 0 0 0 0 -2449.64 0 0 0 0 0 0 1774.27 0 0 0 0 0 0 0 0 0 0 
0 0 0 -776.009 0 0 0 0 0 1762.37 0 1759.47 0 0 0 -2348.32 0 0 0 0 0 0 0 0 0 0 -161.977 0 0 -2289.12 0 0 0 0 0 993.606 0 0 2268.52 0 0.05 0 0 0 0 
0 0 0 0 0 0 0 1134.91 0 -299.615 0 0 0 0 0 1504.94 0 0 0 0 0 0 0 0 0 0 0 0 0 0 0 0.991852 0 0 251.701 0 0 0 0 0 0 0.02 0 0 0 
0 0 0 0 0 0 0 0 0 0 0 0 0 0 0 0 0 0 0 0 0 0 0 0 0 0 0 0 0 0 0 0 1287.35 0 0 0 0 0 0 0 0 0 0.07 0 0 
0 0 0 0 0 0 0 0 0 0 0 0 0 44.9385 0 0 0 0 0 0 0 0 0 0 0 0 0 0 0 0 0 0 0 0 0 0 0 0 0 0 0 0 0 0.04 0 
0 0 0 0 0 0 0 0 0 0 0 0 1003.22 0 0 0 0 0 0 0 0 0 0 0 0 0 0 0 0 0 0 0 0 0 0 0 0 0 0 0 0 0 0 0 0 
