*Vertices 47
*Matrix 
0.09 0 0 0 0 -949.507 1271.17 -2092.88 0 0 2010.33 -554.903 0 0 0 1115.22 0 0 0 0 0 0 0 0 0 0 0 0 0 282.22 0 0 0 0 0 0 0 1933.27 0 0 0 0 -1617.4 0 1597.11 690.863 0 
0 0.05 27.3904 0 0 0 2176.05 356.685 2099.9 -129.322 0 0 0 0 0 0 0 0 -675.451 0 0 0 2049.39 0 0 0 0 0 0 0 2130.73 -2005.45 0 0 -2144.46 0 -147.633 0 0 2382.5 0 -1731.7 0 1510.28 0 0 0 
0 622.501 0.06 0 0 0 827.433 0 0 0 0 0 0 0 0 0 0 0 1226.16 0 0 0 996.963 -685.217 0 0 0 0 0 0 0 0 0 0 0 1038.16 0 0 0 0 -2445.22 0 -679.418 0 0 -1170.31 0 
0 0 0 0.04 769.295 0 0 0 0 0 0 -2265.31 0 0 0 0 -1006.42 -411.466 0 0 0 -887.249 0 1317.87 -790.353 0 1549.65 969.039 666.295 -137.867 0 0 1947.61 0 0 0 0 0 0 -233.39 0 0 -193.869 0 0 0 0 
0 0 0 -1548.89 0.01 2485.05 -98.3459 1780.53 0 1960.89 0 0 0 -939.894 0 0 0 0 0 0 0 0 1854.08 0 660.192 0 1344.87 -819.193 0 1481.44 0 0 250.938 0 513.245 0 0 -999.252 2179.25 0 1727.12 0 0 0 0 1083.79 0 
1444.82 0 0 0 1726.2 0.03 0 0 0 0 2488.71 0 0 0 2323.15 0 1111.26 0 0 0 0 0 0 0 0 0 0 0 0 747.475 0 -1425.9 -718.94 0 0 0 0 0 0 0 35.6304 0 0 0 0 0 0 
-1766.64 1961.81 -1093.71 0 1733.83 0 0.04 0 0 0 0 0 0 1262.02 0 0 2130.42 -989.334 0 -301.141 0 0 0 0 -1263.24 0 1592.99 1944.26 2158.04 0 0 1595.58 1516.39 0 -1927.93 0 0 511.719 0 0 1663.64 1178.09 1801.58 0 0 0 0 
2244.1 2364.65 0 0 -77.5933 0 0 0.03 0 0 0 -1793.04 0 0 -1666.39 0 -2256.16 0 0 0 953.322 0 0 2345.42 2168.11 565.279 0 0 0 -450.072 -1615.42 0 1275.6 22.5074 0 1868.57 0 1360.9 1191.52 0 0 -1416.75 658.361 0 -72.2526 0 -1863.38 
0 1009.02 0 0 0 0 0 0 0.06 -765.938 0 0 0 1758.71 268.639 1551.94 -982.162 0 0 0 0 0 0 0 477.844 0 0 1081.35 0 2274.77 -1418.88 16.5563 0 0 0 575.655 0 0 -356.533 0 -1911.76 0 0 -1087.45 0 0 0 
0 1445.28 0 0 196.615 0 0 0 -740.76 0.06 0 2174.83 0 1611.91 0 0 0 0 0 0 1154.59 588.473 -90.7163 2001.79 0 0 2064.96 0 -747.017 0 0 0 0 0 0 0 0 0 0 -127.186 -229.423 0 0 -2350 0 0 0 
2243.95 0 0 0 0 1504.18 0 0 0 0 0.02 0 0 0 -1182.52 442.442 0 0 0 0 540.864 0 0 0 -720.771 1949.9 -925.245 0 2422.33 2238 -74.9992 686.285 1690.65 0 -1668.52 -324.335 1821.12 0 0 0 0 0 0 1131.4 0 0 0 
245.75 0 0 2297.2 0 0 0 1524.63 0 -1027.02 0 0.07 -1701.48 1830.58 903.272 0 0 0 0 -1895.43 0 0 0 2469.18 -2154.68 0 0 1877.12 0 0 1762.22 0 -351.344 0 0 0 2421.72 0 685.98 0 0 0 180.288 0 0 951.338 0 
0 0 0 0 0 0 0 0 0 0 0 -2044.66 0.05 0 0 0 2015.52 0 0 -24.7963 0 0 0 0 0 0 0 0 0 0 1414 0 1028.86 -993.606 0 0 0 0 -918.836 0 1379.06 0 0 0 0 0 0 
0 0 0 0 -1590.4 0 1794.11 0 1787.24 -356.075 0 -665.99 0 0.07 0 0 0 0 2444.15 0 0 953.169 2313.99 -426.572 0 -694.678 0 0 0 0 1203.73 1282.92 2011.09 -1092.18 985.977 0 1889.02 0 0 1145.44 0 0 859.325 0 0 -301.752 0 
0 0 0 0 0 -1688.97 0 1973.4 1277.28 0 2065.72 1368.22 0 0 0.02 0 0 0 0 0 -124.592 0 -2481.99 0 0 0 0 0 0 622.196 0 1895.28 0 0 0 0 0 913.8 -1601.23 0 0 0 0 0 0 0 0 
2384.79 0 0 0 0 0 0 0 1227.07 0 499.817 0 0 0 0 0.07 0 1554.99 -1858.35 746.864 0 1227.84 0 0 0 2421.57 0 0 0 0 0 0 0 274.438 0 0 0 0 0 0 0 0 -654.241 0 0 0 0 
0 0 0 2183.83 0 2364.5 1771.83 1560.95 1122.09 0 0 0 2277.37 0 0 0 0.02 0 867.718 0 1070.06 0 0 0 0 0 0 1377.07 0 0 1446.96 0 0 0 0 0 0 0 0 0 0 0 0 0 0 0 0 
0 0 0 -575.808 0 0 -459.075 0 0 0 0 0 0 0 0 2036.73 0 0.05 0 0 0 1730.32 2459.26 0 0 0 0 0 1066.85 0 -37.0037 0 0 0 0 0 0 0 0 459.532 0 0 0 -2445.37 -2482.15 0 0 
0 506.684 1480.53 0 0 0 0 0 0 0 0 0 0 1217.31 0 1159.63 -1813.03 0 0.06 0 0 0 0 1837.75 2430.11 0 0 0 0 593.814 -408.261 0 0 0 0 1860.18 0 1267.36 0 1267.51 -1679.82 0 1497.92 0 -1511.81 0 6.79037 
0 0 0 0 0 0 2382.2 0 0 0 0 -1168.32 -1450.32 0 0 2319.79 0 0 0 0.04 2265.77 -2354.27 0 0 0 0 0 0 0 0 0 -383.847 0 0 0 0 0 857.189 0 -723.518 0 0 0 0 1242.64 0 0 
0 0 0 0 0 0 0 1406.83 0 -302.057 82.1711 0 0 0 2090.59 0 10.6052 0 0 -1150.78 0.01 0 0 0 0 0 0 0 0 0 -839.946 0 0 0 0 0 846.66 0 2177.57 0 0 0 0 75.3044 0 0 0 
0 0 0 193.258 0 0 0 0 0 -692.083 0 0 0 -742.744 0 -813.547 0 -1612.06 0 1521.58 0 0.09 0 0 0 2117.6 0 0 0 -1054.49 1015.12 -141.835 0 0 0 0 0 2029.4 0 0 0 1455.96 0 0 0 0 0 
0 -1440.4 0.381481 0 1365.78 0 0 0 0 1851.18 0 0 0 48.2955 -43.7178 0 0 -1400.72 0 0 0 0 0.09 -357.448 0 1749.85 0 606.174 0 0 0 0 1247.67 0 0 -55.1622 0 -395.749 0 1018.02 0 -529.267 0 0 0 0 2112.87 
0 0 -1948.23 2372.43 0 0 0 1987.59 0 -739.082 0 1204.79 0 827.281 0 0 0 0 152.058 0 0 0 406.888 0.04 0 0 0 0 -712.226 0 0 0 0 0 1477.48 377.285 1569.8 0 0 -1537.29 0 0 0 0 1506.78 0 2085.41 
0 0 0 1930.83 913.19 0 126.27 -661.412 -463.958 0 -2167.96 1877.42 0 0 0 0 0 0 2289.12 0 0 0 0 0 0.05 0 0 0 0 0 1714.76 0 0 2084.95 2262.41 0 0 0 0 0 0 0 0 0 -569.399 0 0 
0 0 0 0 0 0 0 -2131.79 0 0 2278.89 0 0 577.181 0 1157.64 0 0 0 0 0 1406.52 683.538 0 0 0 0 0 -1669.44 0 0 0 0 0 0 0 0 -979.263 0 0 0 0 0 1175.95 0 -1253.32 0 
0 0 0 1226.46 2143.7 0 485.321 0 0 -1762.52 193.106 0 0 0 0 0 0 0 0 0 0 0 0 0 0 0 0.09 -116.657 0 0 1448.79 0 0 0 0 0 0 0 0 0 1084.7 0 -1466.03 0 0 0 921.125 
0 0 0 -592.593 -1227.23 0 253.227 0 -1988.05 0 0 -1739.17 0 0 0 0 1664.4 0 0 0 0 0 -1623.97 0 0 0 1162.98 0.01 0 0 0 0 0 0 0 0 0 0 454.344 2237.24 1003.98 0 1491.06 0 0 997.421 1563.69 
0 0 0 1755.65 0 0 953.475 0 0 1990.04 -830.485 0 0 0 0 0 0 -1471.53 0 0 0 0 0 414.67 0 632.572 0 0 0.04 0 0 0 0 0 0 0 0 0 -1000.78 0 0 989.334 -2193.75 0 0 0 0 
-803.781 0 0 5.26444 -403.531 2370.75 0 -880.535 97.8881 0 659.429 0 0 0 -1681.19 0 0 0 105.823 0 0 -394.681 0 0 0 0 0 0 0 0.07 0 0 0 0 -569.704 0 2053.36 0 0 0 0 0 -215.537 2107.84 0 0 1888.1 
0 -1647.31 0 0 0 0 0 -1313.29 -24.6437 0 40.3607 585.879 2346.03 -2464.45 0 0 -364.925 864.36 679.724 0 -326.319 2041.31 0 0 830.18 0 -6.48518 0 0 0 0.07 0 0 -849.559 0 0 0 0 0 0 0 0 0 0 0 1892.53 -1748.48 
0 1324.12 0 0 0 68.7429 616.55 0 2255.7 0 2060.69 0 0 2128.59 -610.294 0 0 0 0 -1863.69 0 1263.24 0 0 0 0 0 0 0 0 0 0.06 -1788.46 0 0 0 0 0 0 2357.48 0 396.817 -844.676 2363.58 0 0 0 
0 0 0 -1869.18 1041.22 -132.527 -1661.2 466.247 0 0 -1039.99 -2150.56 1697.82 2364.96 0 0 0 0 0 0 0 0 2433.77 0 0 0 0 0 0 0 0 2496.95 0.07 0 0 0 0 0 0 0 0 1627.17 0 0 0 0 286.95 
0 0 0 0 0 0 0 1653.72 0 0 0 0 -331.355 1506.32 0 1210.14 0 0 0 0 0 0 0 0 2465.67 0 0 0 0 0 -1137.5 0 0 0.08 0 55.3148 0 0 0 0 0 -273.522 0 0 638.523 0 -334.864 
0 1154.59 0 0 1875.13 0 -1219.29 0 0 0 -354.701 0 0 466.552 0 0 0 0 0 0 0 0 0 -173.879 -1123 0 0 0 0 -1884.75 0 0 0 0 0.05 0 0 0 1526.31 0 0 -1902.3 592.898 0 0 803.934 0 
0 0 -1064.56 0 0 0 0 1868.72 1650.52 0 87.054 0 0 0 0 0 0 0 2342.07 0 0 0 -291.986 1093.71 0 0 0 0 0 0 0 0 0 -1015.73 0 0.03 1900.77 0 0 0 -888.775 0 0 -932.569 0 0 0 
0 1904.58 0 0 0 0 0 0 0 0 1988.66 -1418.73 0 1421.17 0 0 0 0 0 0 1876.35 0 0 -2469.33 0 0 0 0 0 -1067 0 0 0 0 0 -240.257 0 0 0 0 0 -1888.56 631.047 2165.21 0 0 0 
-1668.37 0 0 0 29.5267 0 -1112.48 -431.608 0 0 0 0 0 0 1478.24 0 0 0 1898.63 1547.36 0 1709.88 394.223 0 0 726.112 0 0 0 0 0 0 0 0 0 0 0 0.01 0 425.962 0 0 -806.07 0 0 0 0 
0 0 0 0 -2454.53 0 0 1687.6 2095.02 0 0 2322.84 -143.056 0 -1228.14 0 0 0 0 0 2489.62 0 0 0 0 0 0 -33.4941 2165.52 0 0 0 0 0 367.977 0 0 0 0.05 0 0 0 -1197.16 2113.33 0 0 0 
0 -51.9578 0 2388.76 0 0 0 0 0 2062.52 0 0 0 -273.98 0 0 0 207.297 1298.79 -890.149 0 0 764.87 -2033.52 0 0 0 -1618.78 0 0 0 857.799 0 0 0 0 0 988.266 0 0.02 0 -635.167 9.84222 0 0 0 0 
0 0 1266.14 0 689.947 -966.903 1439.18 0 236.595 -2172.54 0 0 -198.294 0 0 0 0 0 2478.94 0 0 0 0 0 0 0 1941.36 1424.07 0 0 0 0 0 0 0 -1835.76 0 0 0 0 0.02 0 -374.996 2119.43 0 0 0 
0 36.2407 0 0 0 0 -1531.19 -1189.84 0 0 0 0 0 0 0 0 0 0 0 0 0 -503.479 -821.635 0 0 0 0 0 2482.91 0 0 -1882.15 -500.732 773.11 1605.35 0 -595.492 0 0 -140.919 0 0.01 1616.49 0 1209.98 0 0 
2063.13 0 1181.91 1088.98 0 0 -1291.77 2362.67 0 0 0 1093.55 0 -2272.03 0 440.306 0 0 -2085.1 0 0 0 0 0 0 0 1339.84 -170.37 -1437.65 1754.89 0 2062.36 0 0 2083.88 0 778.756 382.931 -107.959 1685.77 -2319.64 631.657 0.05 0 0 0 0 
0 1183.89 0 0 0 0 0 0 555.818 879.162 2403.41 0 0 0 0 0 0 -1673.41 0 0 1596.5 0 0 0 0 43.5652 0 0 0 2150.56 0 1018.48 0 0 0 935.011 409.024 0 380.49 0 -1069.44 0 0 0.01 0 927.229 0 
1418.42 0 0 0 0 0 0 1860.18 0 0 0 0 0 0 0 0 0 2427.67 -582.369 624.943 0 0 0 2167.04 1791.21 0 0 0 0 0 0 0 0 1674.63 0 0 0 0 0 0 0 -1262.32 0 0 0.04 -1191.98 0 
2307.43 0 185.171 0 1964.86 0 0 0 0 0 0 831.248 0 2274.32 0 0 0 0 0 0 0 0 0 0 0 -108.875 0 -815.683 0 0 2191.92 0 0 0 840.098 0 0 0 0 0 0 0 0 -5.11185 256.279 0.04 0 
0 0 0 0 0 0 0 -416.196 0 0 0 0 0 0 0 0 0 0 2262.41 0 0 0 -256.737 -292.291 0 0 -977.584 -1038.01 0 2113.94 720.313 0 1523.41 2104.48 0 0 0 0 0 0 0 0 0 0 0 0 0.02 
