*Vertices 50
*Matrix 
0.01 2347.56 0 0 -98.6511 0 0 0 0 0 0 0 0 0 -1931.29 0 0 0 -497.528 1725.9 0 436.186 0 0 0 0 0 0 0 0 1456.27 0 0 0 0 1473.05 0 0 0 0 0 905.56 0 0 0 0 0 0 0 0 
2409.21 0.08 0 0 0 0 0 0 0 1531.34 190.512 0 0 -1903.67 0 0 0 0 0 0 0 680.792 0 0 0 0 0 0 0 0 0 1622.29 0 0 597.324 -1124.84 0 0 0 0 0 0 1738.72 0 0 0 -689.032 2334.89 -486.847 0 
0 0 0.05 0 592.441 0 0 0 0 248.65 0 0 0 0 0 551.546 0 -956.069 0 0 0 0 0 0 -726.875 0 0 0 0 0 0 0 0 0 0 0 1115.99 0 0 0 0 0 0 0 0 0 0 0 0 0 
0 0 0 0.01 0 0 0 1367.76 1443.45 0 0 0 0 0 0 0 0 -1321.22 0 0 0 0 0 0 0 0 0 0 0 0 0 0 0 0 0 0 0 0 0 0 0 0 0 0 0 0 0 0 0 0 
2495.27 0 1549.65 0 0.01 0 0 2454.53 0 1494.87 0 0 0 0 1036.03 -572.451 0 0 0 -1645.79 0 600.833 1238.06 0 -2163.69 0 0 0 0 0 0 0 0 0 0 0 0 0 0 0 0 0 0 0 -1975.84 0 0 0 0 0 
0 0 0 0 0 0.01 0 0 0 0 0 -1424.99 0 0 0 678.808 0 0 0 0 -562.838 1137.04 0 0 0 0 1800.21 -1558.96 0 0 0 2174.83 0 0 0 0 0 0 0 0 0 0 0 0 0 0 0 0 0 0 
0 0 0 0 0 0 0 0 2175.28 0 0 -140.614 -1062.73 0 0 0 0 -288.629 0 0 0 2420.8 2294.15 1062.12 -1469.08 0 -2366.94 0 0 0 0 0 0 0 0 0 0 0 0 0 0 0 0 0 0 0 0 0 0 -1907.18 
0 0 0 2277.67 -994.064 0 0 0.07 756.172 0 0 0 0 0 0 0 -36.2407 0 1888.26 0 637.761 0 0 1670.66 0 0 0 -1617.25 0 0 0 1654.18 -1309.78 -1430.94 0 0 0 0 0 0 0 0 0 1058 0 0 0 0 0 0 
0 0 0 -102.161 0 0 2115.16 1264.92 0 -2303.31 1953.87 0 248.955 0 0 0 -1970.2 0 0 -294.122 0 0 0 2211.14 2371.67 -1131.4 0 0 0 0 0 0 0 0 0 0 0 0 0 0 0 0 -548.494 0 0 0 0 0 0 0 
0 1295.89 2304.53 0 -2248.99 0 0 0 128.101 0.04 0 0 0 0 0 0 0 0 -1703.16 0 0 0 0 0 1206.78 2230.06 0 0 0 -459.838 0 0 -421.079 0 0 0 1331.45 0 -1063.04 0 0 0 0 1357.08 0 0 2135.46 0 -1829.81 0 
0 1423.61 0 0 0 0 0 0 2446.59 0 0.01 0 0 0 1953.26 0 0 0 2097.16 -949.202 0 0 0 0 -408.414 0 0 0 0 0 -749.458 0 0 0 0 0 0 790.506 0 0 0 0 0 0 0 0 0 0 0 0 
0 0 0 0 0 1784.19 1753.06 0 0 0 0 0.07 0 1591.92 0 -1633.43 0 635.319 0 0 0 0 1737.34 0 0 0 0 0 0 0 0 0 0 0 0 468.535 0 0 0 0 0 1575.75 0 0 0 0 0 -2316.74 969.649 0 
0 0 0 0 0 0 2475.28 0 1972.33 0 0 0 0.09 -938.673 0 0 0 0 0 0 0 -1844 -1414.46 -76.5252 784.555 0 0 0 1052.81 0 871.838 0 0 0 -191.733 0 1045.18 -109.79 0 0 0 0 0 0 0 0 0 0 0 0 
0 -691.778 0 0 0 0 0 0 0 0 0 851.848 -2141.41 0.05 0 0 0 0 0 0 0 0 2127.98 2016.74 0 986.435 0 0 0 0 0 0 0 0 0 302.362 0 0 0 0 0 -1284.45 0 0 0 0 0 0 0 0 
-781.808 0 0 0 1554.84 0 0 0 0 0 -1535.77 0 0 0 0.06 0 -818.735 -1325.5 0 0 0 0 2294.61 0 0 0 0 0 0 0 0 0 0 0 0 0 0 0 0 -394.07 0 0 0 0 0 0 0 0 0 0 
0 0 -1137.5 0 2049.39 1027.18 0 0 0 0 0 -1587.8 0 0 0 0.02 1585.67 0 0 0 0 0 0 0 271.386 0 0 0 0 0 0 0 0 0 -1678.44 0 0 0 0 0 0 0 0 0 0 0 0 0 0 0 
0 0 0 0 0 0 0 -1007.34 -2086.32 0 0 0 0 0 972.701 -388.272 0.04 0 0 0 1015.88 0 0 0 512.94 2168.26 0 0 0 0 0 0 0 0 2058.4 0 0 0 0 0 0 0 0 0 0 0 0 0 0 0 
0 0 1976.76 -1126.97 0 0 1385.31 0 0 0 0 -2063.74 0 0 1369.14 0 0 0.04 0 0 0 1256.07 2171.32 270.013 261.162 0 0 0 0 0 1696.6 0 0 0 1602.6 0 0 0 0 0 0 0 -950.575 0 0 542.39 -795.999 0 0 0 
633.946 0 0 0 0 0 0 1519.75 0 -20.0659 -278.863 0 0 0 0 0 0 0 0.01 0 0 0 2314.29 0 0 2392.27 185.018 0 0 -1457.34 0 0 0 0 0 0 1598.03 0 0 0 0 0 0 0 0 0 0 -1334.65 0 1236.69 
1409.73 0 0 0 1763.59 0 0 0 -443.205 0 1025.96 0 0 0 0 0 0 0 0 0.01 0 612.735 1820.66 0 0 0 0 0 0 0 0 0 0 0 0 0 0 0 0 0 0 1038.62 0 0 0 0 0 0 0 -2056.26 
0 0 0 0 0 1003.98 0 778.146 0 0 0 0 0 0 0 0 1891.61 0 0 0 0.02 0 0 0 0 0 0 0 0 0 0 -1219.6 0 0 0 0 0 0 0 0 0 0 0 0 -86.4437 0 0 0 0 0 
2328.64 1472.75 0 0 -1676.61 -458.617 -773.11 0 0 0 0 0 -1110.19 0 0 0 0 1388.82 0 881.756 0 0.09 0 0 0 2031.85 0 0 0 0 0 0 0 0 2319.64 0 0 827.281 0 0 -1231.65 0 0 0 0 438.169 0 0 0 0 
0 0 0 0 786.386 0 -617.618 0 0 0 0 2452.7 -48.4481 602.206 780.892 0 0 680.334 -548.494 1703.92 0 0 0.04 0 0 0 702.765 0 0 0 0 0 0 0 0 0 0 0 -248.344 0 0 0 0 0 0 0 0 0 0 0 
0 0 0 0 0 0 -1737.04 691.778 338.984 0 0 0 -1418.58 1700.57 0 0 0 1810.13 0 0 0 0 0 0 0 435.27 0 0 0 0 0 0 0 0 0 1262.78 0 0 1036.18 0 0 0 0 0 0 -942.946 0 0 -706.732 2293.24 
0 0 696.814 0 907.239 0 -784.555 0 1900.46 -733.589 -364.01 0 2344.97 0 0 102.008 2285 -2376.86 0 0 0 0 0 0 0.09 -214.469 0 0 2177.72 0 0 0 0 0 0 0 0 -1429.72 0 0 0 0 0 0 0 0 0 0 0 0 
0 0 0 0 0 0 0 0 -687.506 -343.257 0 0 0 1632.82 0 0 1956.92 0 -2086.17 0 0 -377.59 0 1957.69 447.63 0.08 0 0 -1055.25 120.014 0 0 0 0 0 0 0 0 0 0 0 0 0 0 0 0 0 0 0 0 
0 0 0 0 0 642.033 1911.76 0 0 0 0 0 0 0 0 0 0 0 893.201 0 0 0 1334.35 0 0 0 0.03 0 0 0 0 0 0 0 0 0 0 0 -579.47 0 -1134.75 0 -1388.36 0 0 0 0 0 -1479 0 
0 0 0 0 0 188.986 0 2039.93 0 0 0 0 0 0 0 0 0 0 0 0 0 0 0 0 0 0 0 0.01 0 0 0 0 0 241.478 -745.796 0 0 0 0 0 0 0 0 0 0 0 0 0 0 0 
0 0 0 0 0 0 0 0 0 0 0 0 -113.605 0 0 0 0 0 0 0 0 0 0 0 172.201 1366.7 0 0 0.06 0 0 0 0 0 0 0 0 0 0 0 -566.652 0 0 0 0 0 0 0 0 2454.07 
0 0 0 0 0 0 0 0 0 2186.73 0 0 0 0 0 0 0 0 2206.41 0 0 0 0 0 0 -772.195 0 0 0 0.03 0 0 0 0 0 1885.66 0 0 0 0 0 0 0 0 0 0 0 0 0 0 
917.768 0 0 0 0 0 0 0 0 0 -1221.43 0 704.443 0 0 0 0 -4.34889 0 0 0 0 0 0 0 0 0 0 0 0 0.05 0 -220.573 0 0 0 0 1611.76 0 0 0 0 0 0 0 0 0 0 0 0 
0 1057.85 0 0 0 1802.96 0 1080.28 0 0 0 0 0 0 0 0 0 0 0 0 -747.017 0 0 0 0 0 0 0 0 0 0 0.04 0 0 0 0 0 0 0 0 2308.04 0 0 -2394.25 0 0 0 -2064.65 -1519.14 0 
0 0 0 0 0 0 0 1755.35 0 -1451.08 0 0 0 0 0 0 0 0 0 0 0 0 0 0 0 0 0 0 0 0 1862.77 0 0.05 0 0 0 0 0 0 0 -1107.75 0 0 2476.96 0 0 0 0 0 0 
0 0 0 0 0 0 0 1569.64 0 0 0 0 0 0 0 0 0 0 0 0 0 0 0 0 0 0 0 67.3696 0 0 0 0 0 0.08 0 0 0 0 0 0 0 0 767.159 0 0 0 0 0 0 0 
0 1113.7 0 0 0 0 0 0 0 0 0 0 324.335 0 0 -1223.87 2226.25 132.221 0 0 0 2440.03 0 0 0 0 0 -1629 0 0 0 0 0 0 0.06 0 0 0 0 0 0 0 0 0 -957.595 1091.57 0 0 0 0 
332.118 2199.39 0 0 0 0 0 0 0 0 0 2184.29 0 1064.71 0 0 0 0 0 0 0 0 0 1742.84 0 0 0 0 0 -157.399 0 0 0 0 0 0.07 2263.48 0 0 0 0 0 0 -1535.16 0 0 0 0 0 -885.571 
0 0 2074.11 0 0 0 0 0 0 757.088 0 0 1112.48 0 0 0 0 0 2071.37 0 0 0 0 0 0 0 0 0 0 0 0 0 0 0 0 915.479 0.03 0 0 0 0 0 0 0 0 0 -187.155 126.881 -1741.77 0 
0 0 0 0 0 0 0 0 0 0 949.202 0 -522.401 0 0 0 0 0 0 0 0 1696.45 0 0 -386.288 0 0 0 0 0 863.598 0 0 0 0 0 0 0.08 0 0 0 0 0 0 0 0 0 0 0 0 
0 0 0 0 0 0 0 0 0 -2427.06 0 0 0 0 0 0 0 0 0 0 0 0 1407.9 2404.78 0 0 2407.38 0 0 0 0 0 0 0 0 0 0 0 0.03 -279.931 0 0 0 0 0 0 0 0 0 0 
0 0 0 0 0 0 0 0 0 0 0 0 0 0 1349.6 0 0 0 0 0 0 0 0 0 0 0 0 0 0 0 0 0 0 0 0 0 0 0 2386.78 0.03 0 0 0 0 0 0 0 0 0 0 
0 0 0 0 0 0 0 0 0 0 0 0 0 0 0 0 0 0 0 0 0 -1473.2 0 0 0 0 2478.94 0 -2336.57 0 0 1985.15 124.439 0 0 0 0 0 0 0 0.02 0 0 0 1924.57 0 0 0 0 0 
2124.47 0 0 0 0 0 0 0 0 0 0 666.143 0 -28.4585 0 0 0 0 0 740.608 0 0 0 0 0 0 0 0 0 0 0 0 0 0 0 0 0 0 0 0 0 0.09 0 0 0 0 0 0 0 0 
0 1120.41 0 0 0 0 0 0 -2236.01 0 0 0 0 0 0 0 0 435.728 0 0 0 0 0 0 0 0 1694.01 0 0 0 0 0 0 996.811 0 0 0 0 0 0 0 0 0.01 0 0 0 0 0 0 0 
0 0 0 0 0 0 0 0.0762963 0 -395.596 0 0 0 0 0 0 0 0 0 0 0 0 0 0 0 0 0 0 0 0 0 -884.655 2210.53 0 0 91.174 0 0 0 0 0 0 0 0.09 0 0 0 0 0 0 
0 0 0 0 1583.38 0 0 0 0 0 0 0 0 0 0 0 0 0 0 0 1252.25 0 0 0 0 0 0 0 0 0 0 0 0 0 1168.48 0 0 0 0 0 -1863.08 0 0 0 0.02 0 0 -600.528 0 0 
0 0 0 0 0 0 0 0 0 0 0 0 0 0 0 0 0 657.445 0 0 0 -566.5 0 665.227 0 0 0 0 0 0 0 0 0 0 -604.343 0 0 0 0 0 0 0 0 0 0 0.06 0 0 0 0 
0 -1457.79 0 0 0 0 0 0 0 346.004 0 0 0 0 0 0 0 2272.18 0 0 0 0 0 0 0 0 0 0 0 0 0 0 0 0 0 0 861.919 0 0 0 0 0 0 0 0 0 0.08 0 0 0 
0 826.365 0 0 0 0 0 0 0 0 0 552.309 0 0 0 0 0 0 -192.038 0 0 0 0 0 0 0 0 0 0 0 0 2398.53 0 0 0 0 2333.37 0 0 0 0 0 0 0 -2342.52 0 0 0.07 0 0 
0 -28.4585 0 0 0 0 0 0 0 2154.84 0 -9.38444 0 0 0 0 0 0 0 0 0 0 0 -765.328 0 0 2087.69 0 0 0 0 1957.84 0 0 0 0 -1587.95 0 0 0 0 0 0 0 0 0 0 0 0.06 970.107 
0 0 0 0 0 0 814.768 0 0 0 0 0 0 0 0 0 0 0 -32.4259 1945.48 0 0 0 869.091 0 0 0 0 2349.7 0 0 0 0 0 0 2423.55 0 0 0 0 0 0 0 0 0 0 0 0 -2041.15 0 
