*Vertices 68
*Matrix 
0.06 0 0 0 622.806 0 0 0 0 1032.52 0 0 0 474.944 -1965.16 0 0 1499.91 0 0 0 -1459.17 0 0 -824.534 0 0 1402.86 0 0 0 0 210.807 1150.01 432.066 0 0 0 0 0 0 0 0 0 0 -2209.16 1100.27 0 0 0 0 0 0 0 0 0 0 -568.178 0 0 0 0 0 0 0 0 0 0 
0 0.03 0 1979.66 0 0 0 0 0 0 0 0 0 0 2407.53 0 0 0 0 0 871.685 0 0 0 1551.79 0 0 0 -785.928 0 0 0 0 2343.13 0 0 0 0 0 0 0 0 0 0 0 0 0 0 0 0 0 0 0 0 0 0 0 0 0 0 0 0 0 0 0 0 0 0 
0 0 0.07 0 67.0644 546.358 0 0 1598.03 10.7578 0 0 -919.446 0 0 0 0 0 0 0 752.205 0 0 0 0 0 0 0 -1350.52 0 0 0 0 0 0 0 0 0 2366.48 0 0 0 0 0 0 0 0 0 -485.931 0 0 0 0 0 0 0 0 0 0 0 0 0 0 0 0 0 0 0 
0 1814.4 0 0.02 0 0 0 0 0 0 0 0 0 0 0 0 0 0 0 0 0 0 0 0 0 0 0 0 0 0 0 0 0 0 0 0 2445.68 0 0 0 -1856.97 0 0 2373.5 0 0 0 537.049 0 0 -1290.55 0 0 0 -934.4 0 0 0 0 0 0 0 0 0 0 0 0 0 
981.399 0 806.833 0 0.04 0 -1511.2 0 0 0 0 0 0 1895.58 0 0 0 0 0 0 0 0 0 0 0 -857.799 0 0 0 0 319.3 0 0 494.476 0 -203.787 0 0 0 0 0 0 0 0 0 0 0 0 0 0 1664.1 0 0 0 0 0 0 0 0 0 0 0 0 0 0 0 0 0 
0 0 -420.316 0 0 0.04 -1699.5 0 0 0 0 0 0 0 0 0 0 0 0 0 0 945.54 0 0 0 0 0 0 0 0 0 0 0 0 0 0 0 0 0 0 0 0 0 0 0 0 0 0 0 0 0 0 1165.73 0 692.694 0 0 0 0 0 0 0 0 0 0 0 -554.598 0 
0 0 0 0 -1057.54 -713.752 0 0 0 0 285.577 0 0 0 0 0 0 0 0 0 1109.58 -106.281 0 0 0 0 0 0 0 0 0 90.8689 0 0 1834.39 0 0 0 0 0 0 0 0 0 2450.56 0 -1094.01 0 0 0 2382.81 0 -961.867 0 0 0 0 0 0 0 0 0 201.498 0 0 0 -69.0481 0 
0 0 0 0 0 0 0 0.07 0 0 0 0 -1367.76 0 2065.57 0 0 0 0 0 0 0 1105.91 0 0 0 0 2417.14 0 0 0 0 0 0 0 -1957.69 0 0 0 -1130.63 0 0 0 0 0 0 -341.121 0 0 0 0 0 0 0 0 0 0 0 0 0 0 0 0 0 0 0 0 0 
0 0 -1806.31 0 0 0 0 0 0.02 0 0 0 0 0 1515.47 260.857 0 0 0 0 0 0 996.811 0 -69.2007 0 0 0 0 1965.16 0 0 0 0 0 0 0 0 0 0 0 0 0 0 0 0 0 0 0 0 0 0 -112.232 0 0 0 0 0 0 0 0 0 0 0 0 0 0 0 
1932.66 0 1663.34 0 0 0 0 0 0 0.05 -1785.26 1530.43 2195.12 0 0 0 0 -188.681 0 0 0 -138.173 0 0 0 0 0 -817.667 0 0 0 0 0 0 0 0 1426.21 2220.91 0 0 0 0 0 0 0 0 0 -1332.51 0 0 0 0 0 0 0 0 0 0 0 0 0 0 0 0 0 -1358.46 0 0 
0 0 0 0 0 0 1785.1 0 0 2105.24 0.03 -675.756 0 0 0 0 2456.82 0 0 0 0 0 -2216.64 252.159 0 0 1413.85 0 0 0 0 0 0 0 1754.59 0 0 0 -968.734 0 0 0 0 0 0 0 0 0 0 0 1461.3 2072.44 0 0 0 0 0 0 0 0 0 0 0 0 0 0 0 0 
0 0 0 0 0 0 0 0 0 1938.46 2140.19 0.01 0 0 0 0 2093.19 0 0 0 0 0 0 0 0 0 1642.58 0 0 0 0 0 0 0 0 2476.81 0 0 0 0 0 0 0 0 0 0 0 0 0 0 0 0 0 863.598 0 0 0 -1089.89 0 0 0 0 0 0 0 0 0 0 
0 0 -42.8022 0 0 0 0 1960.43 0 903.577 0 0 0.06 0 0 0 0 0 0 0 0 0 0 2015.82 0 0 0 0 0 2010.48 0 0 0 0 0 0 0 0 0 1700.42 1148.79 0 0 0 0 0 0 -1375.09 -1529.05 0 0 0 0 0 0 0 0 -845.439 0 0 0 0 0 0 0 0 0 0 
503.479 0 0 0 572.451 0 0 0 0 0 0 0 0 0.09 -2189.17 0 0 0 0 0 340.663 0 0 0 0 -364.01 0 0 0 0 0 0 -1619.54 2230.22 0 0 0 0 0 -417.875 0 0 0 0 0 0 0 0 0 0 0 0 0 0 0 1756.87 0 0 0 486.541 0 0 0 0 0 0 0 0 
1996.44 2267.75 0 0 0 0 0 532.624 -1411.4 0 0 0 0 406.735 0.02 0 0 0 0 0 0 -295.495 0 0 0 0 -1199.15 0 0 0 0 0 0 0 0 2480.32 0 0 0 2438.35 0 0 0 -315.638 2263.94 0 833.995 0 0 0 0 0 0 0 0 0 0 0 0 0 0 0 0 -1362.27 0 0 0 0 
0 0 0 0 0 0 0 0 1370.66 0 0 0 0 0 0 0.03 0 1172.6 0 0 0 0 0 0 1695.38 0 0 0 0 556.581 2136.68 0 0 0 0 0 0 0 0 0 0 0 0 0 0 1822.79 0 0 0 0 0 -304.956 0 0 0 0 0 0 0 0 0 0 0 0 0 0 0 0 
0 0 0 0 0 0 0 0 0 0 1450.77 2163.38 0 0 0 0 0.07 0 0 0 0 0 0 0 0 0 0 0 0 0 0 0 0 0 0 0 0 0 0 0 0 0 0 0 0 0 2470.09 0 0 0 0 0 -1308.86 0 0 0 0 0 0 0 0 0 0 0 0 0 0 0 
-1603.67 0 0 0 0 0 0 0 0 -894.269 0 0 0 0 0 -85.5281 0 0.03 0 0 0 0 0 0 0 0 0 150.99 376.98 0 0 2101.12 0 0 0 0 0 0 0 0 0 0 0 0 1174.12 0 0 0 0 1661.81 0 683.996 0 0 0 0 0 0 0 0 0 0 0 0 0 0 0 0 
0 0 0 0 0 0 0 0 0 0 0 0 0 0 0 0 0 0 0.07 0 0 1414 0 0 0 -1423.92 1112.48 0 0 0 0 0 0 0 0 0 0 0 0 0 -532.929 0 1626.71 0 0 0 0 0 0 0 0 0 0 0 0 0 0 0 0 0 0 0 0 0 0 0 0 0 
0 0 0 0 0 0 0 0 0 0 0 0 0 0 0 0 0 0 0 0.07 0 0 0 0 0 0 0 0 0 2369.23 0 0 0 0 0 0 1907.18 0 0 0 0 0 0 0 0 0 0 0 0 0 0 -1016.5 0 -395.749 0 -2200.16 -284.204 0 0 0 0 0 0 0 0 0 0 0 
0 2200.77 -972.854 0 0 0 -508.972 0 0 0 0 0 0 -1322.6 0 0 0 0 0 0 0.08 1782.66 0 -1787.24 0 0 0 1183.74 0 0 0 0 0 0 0 0 0 0 0 0 -1560.79 2169.33 0 0 0 0 0 0 0 0 0 0 0 1067.92 0 0 0 0 0 0 0 0 0 0 0 0 0 0 
1491.67 0 0 0 0 -1711.71 551.698 0 0 632.115 0 0 0 0 234.001 0 0 0 2361.75 0 -1162.07 0.08 614.109 293.512 0 0 0 0 0 0 0 1850.41 0 0 -2066.03 0 0 0 0 0 0 0 0 0 762.581 -1326.72 1804.79 0 0 -1998.43 40.0555 0 0 0 0 0 -351.65 0 0 0 0 0 0 0 0 0 0 0 
0 0 0 0 0 0 0 -598.239 -1670.81 0 1885.2 0 0 0 0 0 0 0 0 0 0 1063.65 0.01 0 -2392.88 0 160.909 0 0 0 0 0 0 0 0 639.439 0 0 0 0 0 0 0 0 -966.597 0 1303.52 0 1174.12 0 0 0 0 0 0 0 0 0 0 0 0 0 0 0 0 0 0 0 
0 0 0 0 0 0 0 0 0 0 729.926 0 1742.23 0 0 0 0 0 0 0 671.178 -89.1903 0 0.03 0 0 0 0 0 0 0 1019.39 0 -1595.28 0 0 0 0 0 0 0 0 852.306 0 0 0 0 0 0 0 0 0 0 2372.43 671.941 0 0 0 0 0 0 0 0 0 0 0 0 -2038.56 
1875.29 -374.691 0 0 0 0 0 0 2037.19 0 0 0 0 0 0 2004.23 0 0 0 0 0 0 604.495 0 0.03 0 0 0 426.878 0 0 0 0 0 0 0 0 0 0 0 0 -683.691 0 0 0 0 0 0 0 0 -566.195 0 0 0 0 0 2231.74 0 773.415 0 0 0 0 0 0 0 0 0 
0 0 0 0 1325.34 0 0 0 0 0 0 0 0 1820.81 0 0 0 0 -972.091 0 0 0 0 0 0 0.05 0 0 2278.59 1837.44 0 0 0 0 0 0 1385.77 0 0 0 0 0 0 0 0 0 0 0 0 0 0 0 0 0 0 0 -1853.01 0 0 0 0 0 0 0 0 0 0 0 
0 0 0 0 0 0 0 0 0 0 1844 -474.181 0 0 2321.47 0 0 0 1412.02 0 0 0 868.023 0 0 0 0.05 0 0 0 0 0 1983.93 0 0 0 0 0 0 0 0 0 0 0 0 0 0 0 0 0 0 0 -892.438 0 0 0 2200.16 0 0 0 0 0 0 0 0 0 0 0 
-395.291 0 0 0 0 0 0 -1062.27 0 2340.54 0 0 0 0 0 0 0 1647.92 0 0 1511.05 0 0 0 0 0 0 0.07 0 -2416.23 -397.427 0 0 0 -188.376 0 -1600.47 0 0 0 0 0 0 -793.1 1585.82 0 0 0 0 0 0 702.307 -56.8407 0 0 0 0 0 0 0 0 0 0 0 0 0 0 0 
0 2423.7 1632.97 0 0 0 0 0 0 0 0 0 0 0 0 0 0 -1135.36 0 0 0 0 0 0 935.926 2098.99 0 0 0.04 0 -810.343 0 0 0 0 0 0 0 0 0 0 0 0 0 0 0 0 0 0 -1334.5 0 0 -1558.5 0 0 0 0 0 0 0 0 0 0 0 0 0 0 0 
0 0 0 0 0 0 0 0 104.297 0 0 0 -1779.31 0 0 1168.02 0 0 0 2251.88 0 0 0 0 0 1378.14 0 1876.66 0 0.08 0 0 0 0 1913.74 0 0 0 0 0 0 -1187.86 0 0 0 0 0 0 0 0 0 0 0 0 0 0 0 0 0 0 0 0 0 0 0 0 0 0 
0 0 0 0 -1666.69 0 0 0 0 0 0 0 0 0 0 2024.83 0 0 0 0 0 0 0 0 0 0 0 543.458 1668.07 0 0.08 0 0 0 0 0 0 0 0 0 0 -198.447 0 0 0 0 -1508.15 0 0 0 0 0 1914.04 2064.96 -1390.35 0 0 0 0 0 0 0 0 0 -2485.66 0 0 1071.89 
0 0 0 0 0 0 -1021.07 0 0 0 0 0 0 0 0 0 0 -1023.82 0 0 0 1028.55 0 -277.032 0 0 0 0 0 0 0 0.09 0 0 0 0 0 0 0 0 -950.575 0 0 0 0 0 0 364.162 577.792 2183.07 0 0 0 0 0 0 0 0 0 0 0 0 0 0 0 0 0 0 
1221.43 0 0 0 0 0 0 0 0 0 0 0 0 2431.18 0 0 0 0 0 0 0 0 0 0 0 0 -2264.09 0 0 0 0 0 0.01 0 0 0 0 0 0 0 0 0 0 0 0 0 0 0 0 0 0 2042.07 1146.81 0 0 -479.217 0 0 0 0 0 0 0 0 0 0 0 0 
341.731 2465.67 0 0 1091.72 0 0 0 0 0 0 0 0 1556.98 0 0 0 0 0 0 0 0 0 -1193.35 0 0 0 0 0 0 0 0 0 0.02 0 0 0 -667.058 0 -578.555 0 0 0 0 0 0 0 0 0 0 0 0 -1609.16 0 0 0 0 0 0 0 0 0 0 0 0 0 0 0 
40.0555 0 0 0 0 0 879.315 0 0 0 -2105.85 0 0 0 0 0 0 0 0 0 0 1311 0 0 0 0 0 1059.68 0 -1397.98 0 0 0 0 0.06 533.082 1844 0 0 0 0 0 0 0 0 1126.97 0 0 0 0 0 0 0 0 0 0 691.931 0 0 0 0 0 0 0 0 0 0 0 
0 0 0 0 73.3207 0 0 -186.239 0 0 0 601.138 0 0 1205.56 0 0 0 0 0 0 0 1874.68 0 0 0 0 0 0 0 0 0 0 0 -546.815 0.06 0 0 0 0 0 0 0 994.369 0 0 0 0 0 0 0 0 0 0 0 884.503 0 0 0 0 0 0 0 0 0 0 0 0 
0 0 0 -252.617 0 0 0 0 0 1988.97 0 0 0 0 0 0 0 0 0 299.921 0 0 0 0 0 1539.43 0 1826.3 0 0 0 0 0 0 2464.75 0 0 0 0 0 0 0 0 0 0 239.647 0 954.695 0 0 0 0 0 0 0 0 0 0 0 0 0 0 0 0 0 0 0 0 
0 0 0 0 0 0 0 0 0 2281.95 0 0 0 0 0 0 0 0 0 0 0 0 0 0 0 0 0 0 0 0 0 0 0 -12.5889 0 0 0 0.01 0 787.149 0 0 0 0 0 -961.104 0 0 -600.375 1089.13 0 0 0 0 0 0 0 0 0 0 0 0 0 0 0 0 0 0 
0 0 2056.26 0 0 0 0 0 0 0 -2427.82 0 0 0 0 0 0 0 0 0 0 0 0 0 0 0 0 0 0 0 0 0 0 0 0 0 0 0 0.02 0 0 0 0 0 0 0 0 2156.21 0 0 0 0 0 0 0 0 0 0 0 0 0 0 0 0 0 0 0 0 
0 0 0 0 0 0 0 1349.76 0 0 0 0 718.024 2483.06 1370.05 0 0 0 0 0 0 0 0 0 0 0 0 0 0 0 0 0 0 201.651 0 0 0 223.93 0 0.04 0 0 0 0 0 0 0 2018.42 0 0 0 0 0 1520.05 0 0 0 0 0 0 0 0 0 0 0 0 0 0 
0 0 0 1706.37 0 0 0 0 0 0 0 0 2153.31 0 0 0 0 0 -1074.48 0 1036.94 0 0 0 0 0 0 0 0 0 0 -1084.09 0 0 0 0 0 0 0 0 0.01 0 0 0 0 -1168.17 0 0 0 0 0 0 0 -1833.32 0 0 0 0 0 0 0 0 0 0 0 0 0 0 
0 0 0 0 0 0 0 0 0 0 0 0 0 0 0 0 0 0 0 0 -308.313 0 0 0 2104.79 0 0 0 0 -149.007 -1755.5 0 0 0 0 0 0 0 0 0 0 0.06 2058.09 0 0 2395.93 0 0 0 0 0 0 0 0 0 1828.75 0 0 0 0 0 0 0 0 0 0 0 0 
0 0 0 0 0 0 0 0 0 0 0 0 0 0 0 0 0 0 1099.81 0 0 0 0 2243.95 0 0 0 0 0 0 0 0 0 0 0 0 0 0 0 0 0 -431.15 0.01 0 0 0 0 0 0 0 0 0 0 0 0 0 0 0 0 0 0 0 0 0 0 2465.06 0 0 
0 0 0 962.172 0 0 0 0 0 0 0 0 0 0 -2176.96 0 0 0 0 0 0 0 0 0 0 0 0 2064.65 0 0 0 0 0 0 0 528.809 0 0 0 0 0 0 0 0.07 0 0 0 0 0 0 1794.72 0 0 0 0 -1771.07 0 97.7355 0 0 0 0 0 0 0 0 2339.63 0 
0 0 0 0 0 0 1732.76 0 0 0 0 0 0 0 -1105.61 0 0 165.792 0 0 0 1234.4 1379.82 0 0 0 0 778.298 0 0 0 0 0 0 0 0 0 0 0 0 0 0 0 0 0 -1402.71 0 0 0 0 0 0 0 0 0 0 0 0 0 0 0 0 0 0 0 0 0 0 
253.685 0 0 0 0 0 0 0 0 0 0 0 0 0 0 2326.81 0 0 0 0 0 1418.88 0 0 0 0 0 0 0 0 0 0 0 0 1204.18 0 920.209 1258.96 0 0 453.887 617.618 0 0 -1104.24 0.07 0 0 0 0 1606.88 0 0 0 0 0 0 0 0 0 0 0 0 0 0 0 0 0 
-1790.9 0 0 0 0 0 1714.61 -2021.16 0 0 0 0 0 0 -470.367 0 273.217 0 0 0 0 2429.65 2166.13 0 0 0 0 0 0 0 -2461.09 0 0 0 0 0 0 0 0 0 0 0 0 0 0 0 0.07 0 0 0 0 -1594.52 0 0 1276.21 0 0 0 0 0 0 0 0 0 0 0 0 0 
0 0 0 1724.98 0 0 0 0 0 -1596.96 0 0 850.932 0 0 0 0 0 0 0 0 0 0 0 0 0 0 0 0 0 0 2300.41 0 0 0 0 -941.42 0 922.498 748.848 0 0 0 0 0 0 0 0 0 0 0 0 0 0 -545.595 0 0 0 0 0 0 0 0 0 0 0 0 0 
0 0 1204.49 0 0 0 0 0 0 0 0 0 522.248 0 0 0 0 0 0 0 0 0 1571.78 0 0 0 0 0 0 0 0 -1430.02 0 0 0 0 0 2097.92 0 0 0 0 0 0 0 0 0 0 0.09 0 0 0 0 0 0 1339.38 0 0 0 0 0 0 0 0 0 0 0 0 
0 0 0 0 0 0 0 0 0 0 0 0 0 0 0 0 0 1812.88 0 0 0 -1158.86 0 0 0 0 0 0 -765.481 0 0 647.069 0 0 0 0 0 1532.26 0 0 0 0 0 0 0 0 0 0 0 0.01 0 0 0 0 0 2332 0 0 0 0 0 0 0 0 0 0 0 0 
0 0 0 1818.37 382.015 0 1267.36 0 0 0 -1512.42 0 0 0 0 0 0 0 0 0 0 -1558.5 0 0 -2220.3 0 0 0 0 0 0 0 0 0 0 0 0 0 0 0 0 0 0 1585.82 0 671.941 0 0 0 0 0.01 0 0 0 1015.73 0 0 0 0 0 0 0 0 0 0 0 0 0 
0 0 0 0 0 0 0 0 0 0 2167.96 0 0 0 0 834.147 0 -782.876 0 1946.55 0 0 0 0 0 0 0 -616.092 0 0 0 0 2283.47 0 0 0 0 0 0 0 0 0 0 0 0 0 -98.0407 0 0 0 0 0.03 0 0 0 0 0 0 0 0 0 0 0 0 0 0 0 0 
0 0 0 0 0 -396.512 1702.09 0 303.888 0 0 0 0 0 0 0 -525.758 0 0 0 0 0 0 0 0 0 658.055 1805.25 2344.05 0 -1669.9 0 15.4881 -116.199 0 0 0 0 0 0 0 0 0 0 0 0 0 0 0 0 0 0 0.07 0 0 0 0 0 0 0 0 0 0 0 0 0 0 0 
0 0 0 0 0 0 0 0 0 0 0 2470.4 0 0 0 0 0 0 0 2460.78 -767.769 0 0 941.878 0 0 0 0 0 0 1970.5 0 0 0 0 0 0 0 0 -2214.8 2466.43 0 0 0 0 0 0 0 0 0 0 0 0 0.06 0 0 0 0 0 0 0 0 0 0 0 0 0 0 
0 0 0 895.489 0 -493.408 0 0 0 0 0 0 0 0 0 0 0 0 0 0 0 0 0 746.559 0 0 0 0 0 0 1289.33 0 0 0 0 0 0 0 0 0 0 0 0 0 0 0 1823.1 -933.18 0 0 595.95 0 0 0 0.01 0 0 0 0 0 0 2177.42 0 0 0 0 0 0 
0 0 0 0 0 0 0 0 0 0 0 0 0 -945.997 0 0 0 0 0 -1268.88 0 0 0 0 0 0 0 0 0 0 0 0 -97.1252 0 0 -635.472 0 0 0 0 0 2254.17 0 518.891 0 0 0 0 2167.65 1957.38 0 0 0 0 0 0 0 0 0 0 0 0 0 0 0 0 0 0 
0 0 0 0 0 0 0 0 0 0 0 0 0 0 0 0 0 0 0 126.423 0 1912.67 0 0 1218.68 -1854.23 2060.53 0 0 0 0 0 0 0 -481.811 0 0 0 0 0 0 0 0 0 0 0 0 0 0 0 0 0 0 0 0 0 0.02 0 0 0 0 0 0 0 0 0 0 0 
2384.49 0 0 0 0 0 0 0 0 0 0 2397.76 1751.69 0 0 0 0 0 0 0 0 0 0 0 0 0 0 0 0 0 0 0 0 0 0 0 0 0 0 0 0 0 0 1391.72 0 0 0 0 0 0 0 0 0 0 0 0 0 0.03 0 0 0 0 0 0 0 0 0 0 
0 0 0 0 0 0 0 0 0 0 0 0 0 0 0 0 0 0 0 0 0 0 0 0 2500 0 0 0 0 0 0 0 0 0 0 0 0 0 0 0 0 0 0 0 0 0 0 0 0 0 0 0 0 0 0 0 0 0 0.08 0 2236.78 0 0 0 0 0 0 0 
0 0 0 0 0 0 0 0 0 0 0 0 0 2471.62 0 0 0 0 0 0 0 0 0 0 0 0 0 0 0 0 0 0 0 0 0 0 0 0 0 0 0 0 0 0 0 0 0 0 0 0 0 0 0 0 0 0 0 0 0 0.07 0 0 0 0 0 0 0 0 
0 0 0 0 0 0 0 0 0 0 0 0 0 0 0 0 0 0 0 0 0 0 0 0 0 0 0 0 0 0 0 0 0 0 0 0 0 0 0 0 0 0 0 0 0 0 0 0 0 0 0 0 0 0 0 0 0 0 1699.04 0 0 0 0 0 0 0 0 0 
0 0 0 0 0 0 0 0 0 0 0 0 0 0 0 0 0 0 0 0 0 0 0 0 0 0 0 0 0 0 0 0 0 0 0 0 0 0 0 0 0 0 0 0 0 0 0 0 0 0 0 0 0 0 2299.19 0 0 0 0 0 0 0 0 0 0 0 0 0 
0 0 0 0 0 0 374.233 0 0 0 0 0 0 0 0 0 0 0 0 0 0 0 0 0 0 0 0 0 0 0 0 0 0 0 0 0 0 0 0 0 0 0 0 0 0 0 0 0 0 0 0 0 0 0 0 0 0 0 0 0 0 0 0.07 0 0 134.968 0 0 
0 0 0 0 0 0 0 0 0 0 0 0 0 0 2167.65 0 0 0 0 0 0 0 0 0 0 0 0 0 0 0 0 0 0 0 0 0 0 0 0 0 0 0 0 0 0 0 0 0 0 0 0 0 0 0 0 0 0 0 0 0 0 0 0 0.08 0 0 0 0 
0 0 0 0 0 0 0 0 0 0 0 0 0 0 0 0 0 0 0 0 0 0 0 0 0 0 0 0 0 0 1172.75 0 0 0 0 0 0 0 0 0 0 0 0 0 0 0 0 0 0 0 0 0 0 0 0 0 0 0 0 0 0 0 0 0 0.09 0 0 0 
0 0 0 0 0 0 0 0 0 -496.155 0 0 0 0 0 0 0 0 0 0 0 0 0 0 0 0 0 0 0 0 0 0 0 0 0 0 0 0 0 0 0 0 580.996 0 0 0 0 0 0 0 0 0 0 0 0 0 0 0 0 0 0 0 1159.02 0 0 0.08 0 0 
0 0 0 0 0 -2055.35 2300.56 0 0 0 0 0 0 0 0 0 0 0 0 0 0 0 0 0 0 0 0 0 0 0 0 0 0 0 0 0 0 0 0 0 0 0 0 159.23 0 0 0 0 0 0 0 0 0 0 0 0 0 0 0 0 0 0 0 0 0 0 0.05 0 
0 0 0 0 0 0 0 0 0 0 0 0 0 0 0 0 0 0 0 0 0 0 0 825.755 0 0 0 0 0 0 1704.99 0 0 0 0 0 0 0 0 0 0 0 0 0 0 0 0 0 0 0 0 0 0 0 0 0 0 0 0 0 0 0 0 0 0 0 0 0.08 
