*Vertices 55
*Matrix 
0.07 0 2162.92 0 0 0 2159.57 1109.27 0 0 478.454 0 0 0 0 -365.535 0 1957.69 2432.55 0 0 979.11 0 -1710.18 -436.033 1962.87 0 0 0 0 0 0 0 -1637.55 0 0 0 495.849 1154.59 0 0 0 0 0 0 0 0 -510.804 2480.47 1838.97 0 -400.174 0 -272.454 0 
0 0 0 0 0 0 0 0 -2398.53 1067.77 0 0 0 0 0 0 0 -1585.51 0 1716.9 540.712 0 0 1437.35 0 0 1387.6 0 0 0 0 0 0 0 0 0 0 0 0 -502.258 0 0 1170.46 0 0 0 0 0 0 0 -271.844 0 0 -199.973 0 
1401.64 0 0 0 0 0 0 -784.86 -111.469 2096.24 0 2279.5 292.138 0 -664.006 0 0 1462.37 1212.42 0 0 0 0 0 0 0 1114 -1540.65 2168.26 0 0 0 0 0 1250.57 0 0 0 -1539.89 0 0 0 0 0 1193.66 730.689 0 -2251.27 0 0 -434.507 -2046.65 1797.16 0 0 
0 0 0 0.05 -933.332 556.581 0 -980.941 0 0 1552.55 -386.135 2023.91 -1854.84 1197.47 0 0 -1484.5 0 0 -1157.49 0 701.239 -1864.15 0 0 0 2426.15 0 0 0 0 367.519 -1087.45 0 0 2139.88 729.621 0 0 0 0 2415.16 0 0 0 0 0 0 0 0 0 0 0 0 
0 0 0 1442.84 0.04 0 2125.39 0 0 0 -2346.34 0 863.598 0 0 0 0 1776.25 0 0 0 2024.22 -2437.89 0 0 0 -2400.05 2041.46 0 -2373.65 1056.02 2466.73 0 0 0 0 552.614 0 0 0 0 0 0 -430.998 0 -1369.59 2098.53 0 -2292.93 0 0 -426.725 0 0 0 
0 0 0 -1127.28 0 0.09 -337.764 0 0 0 356.38 0 0 0 0 0 0 0 0 -542.848 1430.17 981.246 0 0 685.217 748.695 0 0 0 0 0 0 0 0 0 0 732.368 1039.23 0 -1914.35 0 0 836.894 0 2054.58 0 0 -1172.9 -1673.25 0 0 -2397.61 0 0 0 
-1574.83 0 0 0 1335.41 2191.76 0.05 303.278 0 0 0 0 0 0 0 0 2256.92 0 -2172.23 0 0 0 0 0 0 0 0 0 0 0 0 -714.515 2389.52 925.398 2495.42 0 0 0 2377.32 0 0 0 0 0 0 0 0 0 -359.432 0 0 -725.349 0 0 -1307.34 
-2068.62 0 1042.13 -922.651 0 0 -1531.65 0.07 0 0 0 0 -441.527 0 0 0 2284.54 616.245 -2272.03 0 0 0 0 0 1388.36 1860.94 0 1659.67 0 0 0 693.609 844.066 0 1974.47 0 2018.42 -653.02 0 0 0 1480.68 0 0 0 -704.596 0 2209.92 0 0 0 -1828.9 0 603.275 0 
0 602.512 2282.56 0 0 0 0 0 0.07 0 1356.01 687.353 0 0 0 0 0 1730.48 0 0 0 0 0 816.446 0 1541.41 0 0 -1221.58 316.553 1256.07 0 0 1102.1 0 0 0 0 0 0 0 0 109.638 -2451.63 0 1560.79 0 1958.14 0 0 0 -2222.89 527.131 1388.21 81.8659 
0 -680.792 -1535.16 0 0 0 0 0 0 0.09 1696.45 0 64.0126 0 0 0 0 87.054 0 0 0 0 0 0 -692.541 0 0 0 0 0 0 881.603 0 0 0 0 -34.4096 0 0 0 0 0 0 0 0 0 319.147 234.916 481.353 0 -173.727 -393.46 2378.54 0 0 
-448.241 0 0 1961.35 -559.023 2049.85 0 0 -2353.21 1841.26 0.07 1849.8 -681.097 815.989 0 0 0 0 0 0 0 0 0 0 0 0 -1669.29 49.3637 -2100.67 -113.758 0 -1874.37 0 0 -1006.27 0 0 0 0 0 0 0 0 0 0 0 0 0 2218.01 0 0 0 761.513 631.352 0 
0 0 -179.678 1005.05 0 0 0 0 -2187.8 0 1627.93 0.09 0 0 0 220.267 0 0 0 -1509.22 0 0 0 0 -321.741 0 0 -704.138 0 2427.67 1420.87 0 0 1473.36 0 -1982.71 0 0 0 -2134.85 0 0 0 1984.39 0 2362.21 0 0 0 0 0 0 -2058.7 1581.7 0 
0 0 -737.709 -2278.59 -2090.75 0 0 -702.46 0 2461.24 1712.78 0 0.02 1701.94 0 0 328.608 1970.81 0 1734.44 0 0 2222.13 0 0 0 -615.635 0 -2186.27 0 0 0 0 0 0 0 0 0 954.39 1471.07 0 0 0 0 1736.58 2441.56 0 0 0 0 0 0 0 1668.52 0 
0 0 0 689.489 0 0 0 0 0 0 1739.94 0 -1370.2 0.02 0 0 779.214 0 0 -2042.07 0 2344.36 0 -2473.75 0 0 0 0 0 105.06 2181.84 -1553.47 0 0 0 0 0 2006.21 0 0 0 971.023 -538.881 0 289.697 0 0 1840.49 0 0 0 0 0 0 0 
0 0 -844.981 -1959.06 0 0 0 0 0 0 0 0 0 0 0.06 0 0 0 -1029.62 1555.3 657.903 0 0 0 0 0 0 0 0 507.294 0 0 0 0 1537.14 0 -348.445 -2098.07 541.017 0 0 0 780.129 -1849.8 268.944 2288.05 0 0 0 0 571.688 357.753 0 0 0 
-198.752 0 0 0 0 0 0 0 0 0 0 2272.94 0 0 0 0.08 0 -1275.9 0 0 -576.266 -1075.85 2153.92 333.033 0 0 0 0 0 0 0 0 0 919.752 944.777 0 -546.052 0 0 0 0 1374.02 0 -1240.04 -1302.45 -648.747 0 193.869 0 0 0 0 0 1124.38 -1003.68 
0 0 0 0 0 0 -981.704 2005.91 0 0 0 0 -1533.78 -1963.79 0 0 0.05 0 0 141.53 -313.501 0 0 2308.34 0 0 0 0 0 0 0 0 0 -1824.47 -385.067 0 2460.02 0 0 0 1929.15 0 2219.08 0 0 0 0 435.881 0 0 0 0 0 0 0 
422.452 -1396.6 1414.46 -804.086 -1663.18 0 0 -1861.4 -172.964 -315.638 0 0 2004.23 0 0 1561.86 0 0.02 0 0 1948.53 0 0 0 0 0 0 0 0 0 0 0 -852.611 0 0 1378.9 0 0 0 0 790.506 0 0 0 975.448 0 0 0 0 920.667 -1760.54 -1496.09 0 0 0 
2331.54 0 -1325.34 0 0 0 -1686.83 2228.23 0 0 0 0 0 0 1801.13 0 0 0 0 0 0 0 0 1139.94 0 0 0 0 -1205.86 2407.53 0 29.9844 0 0 0 0 0 0 2484.28 0 0 0 0 183.798 2480.01 0 -1220.66 0 0 0 0 94.6837 0 0 0 
0 -946.608 0 0 0 1020.62 0 0 0 0 0 -849.712 2338.1 985.366 -1941.05 0 704.749 0 0 0.02 0 -222.709 -2452.39 -714.209 -1077.23 2317.5 0 0 0 0 0 0 0 1717.35 780.435 0 0 0 0 0 0 0 0 0 0 0 0 -2144.92 0 0 0 0 0 0 0 
0 2176.81 0 -1318.17 0 2263.02 0 0 0 0 0 0 0 0 -1094.62 301.752 -447.63 326.014 0 0 0 0 1950.97 0 0 0 -2147.82 0 0 0 0 0 2224.88 -319.91 0 0 0 0 0 0 0 0 0 0 0 2417.91 0 0 -1965.77 0 0 0 0 0 0 
-1400.88 0 0 0 2009.57 1386.07 0 0 0 0 0 0 0 1309.32 0 -1375.24 0 0 0 -1139.79 0 0.06 0 -2318.41 -1652.35 0 0 0 0 0 0 0 0 343.41 1526.61 0 0 1692.18 0 2480.16 382.473 0 2410.43 0 0 0 0 0 0 0 1729.71 0 0 -516.297 -1891.16 
0 0 0 2294.76 1103.93 0 0 0 0 0 0 0 -1345.64 0 0 1027.18 0 0 0 -142.598 -1480.07 0 0.06 0 0 0 0 0 0 0 0 0 0 0 1033.74 1707.13 588.321 0 0 1636.94 0 0 0 0 0 0 1415.83 0 0 -115.284 0 0 0 0 0 
-219.81 87.2066 0 2067.09 0 0 0 0 343.867 0 0 0 0 1910.23 0 2074.72 1477.17 0 -657.75 858.257 0 1865.52 0 0.01 759.529 2007.89 0 0 0 0 0 1394.31 0 33.9518 0 0 437.712 0 0 1004.14 0 0 0 0 -2405.85 0 0 0 0 -2385.1 0 0 0 0 0 
1191.37 0 0 0 0 1986.53 0 2182.61 0 -1322.9 0 645.543 0 0 0 0 0 0 0 1591.01 0 2069.23 0 1209.98 0.02 -138.325 0 0 0 0 0 0 -1409.42 0 0 0 -812.174 0 0 0 0 1212.88 -81.8659 -486.236 0 0 -444.884 0 0 0 0 0 0 0 0 
1672.64 0 0 0 0 852.916 0 1561.56 -1739.48 0 0 0 0 0 0 0 0 0 0 1171.22 0 0 0 -987.35 2087.08 0.01 1287.65 0 0 0 0 1310.24 -1543.24 -615.177 0 0 1792.43 0 0 0 0 0 0 0 0 0 0 846.66 0 0 0 0 1859.26 580.844 0 
0 -1864.45 -1149.1 0 -419.095 0 0 0 0 0 1083.18 0 1045.79 0 0 0 0 0 0 0 1363.95 0 0 0 0 815.226 0.05 0 0 0 0 0 0 0 116.962 0 0 0 0 0 -830.943 1146.96 0 0 0 0 0 2285.61 0 0 0 0 0 0 0 
0 0 102.924 694.22 1302.91 0 0 1060.75 0 0 -69.5059 1827.52 0 0 0 0 0 0 0 0 0 0 0 0 0 0 0 0.06 0 0 0 0 2258.45 0 0 1510.74 -326.319 0 -1021.84 -613.041 0 0 0 0 0 0 0 0 0 0 0 0 0 0 0 
0 0 1313.44 0 0 0 0 0 -298.853 0 -198.294 0 -885.723 0 0 0 0 0 2471.47 0 0 0 0 0 0 0 0 0 0.07 0 0 0 0 -2429.04 0 0 58.0615 0 -511.261 0 735.572 1791.97 0 0 0 0 0 0 0 -770.058 0 0 0 0 0 
0 0 0 0 455.107 0 0 0 1764.2 0 -2065.11 1344.26 0 636.387 2265.01 0 0 0 -1606.11 0 0 0 0 0 0 0 0 0 0 0.07 0 0 0 0 0 1182.82 0 0 0 0 0 0 -1803.11 0 0 0 0 2245.63 0 330.439 0 0 0 0 0 
0 0 0 0 2069.08 0 0 0 2249.44 0 0 1990.8 0 -2184.29 0 0 0 0 0 0 0 0 0 0 0 0 0 0 0 0 0.04 0 0 0 0 7.40074 0 0 0 1933.88 0 0 0 0 0 1854.84 0 0 0 0 0 -1620 83.3918 -1475.8 0 
0 0 0 0 -2286.98 0 202.567 2115.01 0 -502.869 -2416.84 0 0 -1189.23 0 0 0 0 2101.12 0 0 0 0 432.066 0 -1024.28 0 0 0 0 0 0.06 338.679 0 -1790.29 309.381 0 0 0 1504.03 0 0 0 0 0 0 0 17.4718 0 1699.19 0 0 0 2200.61 0 
0 0 0 -724.433 0 0 2326.81 783.334 0 0 0 0 0 0 0 0 0 1519.75 0 0 -2037.64 0 0 0 1331.75 1823.4 0 -1100.73 0 0 0 -2495.57 0.01 1887.04 0 0 1394.31 0 0 -1878.49 589.694 0 0 0 0 0 0 0 0 0 0 -2.21259 0 0 0 
1027.63 0 0 -253.075 0 0 -212.638 0 -2423.4 0 0 686.59 0 0 0 2061.3 1018.78 0 0 557.649 -1145.59 2310.63 0 -726.112 0 -1665.17 0 0 125.66 0 0 0 1092.64 0.01 0 0 1983.32 0 -895.032 0 0 0 0 0 0 0 0 0 0 0 -1178.09 145.497 1786.63 0 0 
0 0 1126.36 0 0 0 -883.892 1607.03 0 0 -1858.5 0 0 0 1827.22 1527.38 -1255.15 0 0 -2455.44 0 2356.72 389.645 0 0 0 2327.11 0 0 0 0 439.39 0 0 0 -1482.06 0 0 0 0 0 0 0 0 1043.05 809.732 0 0 -1580.63 0 0 0 0 1748.79 0 
0 0 0 0 0 0 0 0 0 0 0 617.313 0 0 0 0 0 -569.247 0 0 0 0 1497.47 0 0 0 0 1015.88 0 -833.689 1267.97 737.556 0 0 2467.35 0 0 1745.73 -2205.65 0 0 2317.35 0 0 1701.18 0 417.875 0 0 0 0 0 -1334.04 0 0 
0 0 0 -226.066 1449.4 2360.07 0 -879.467 0 70.5741 0 0 0 0 -2059.62 1779.61 302.057 0 0 0 0 0 1111.41 -1894.82 1036.79 -2130.27 0 683.844 1297.11 0 0 0 1309.93 2411.34 0 0 0.07 -1489.68 0 563.753 1221.27 1887.95 0 0 0 -1735.36 0 0 0 -2326.2 0 490.356 901.898 0 -250.023 
495.392 0 0 -1566.29 0 209.586 0 -247.581 0 0 0 0 0 -461.669 1824.63 0 0 0 0 0 0 2293.08 0 0 0 0 0 0 0 0 0 0 0 0 0 1890.7 -2200.61 0.09 810.648 0 0 0 0 0 0 0 684.301 0 650.121 -269.707 0 0 0 0 0 
-67.0644 0 -72.4052 0 0 0 2075.64 0 0 0 0 0 2318.26 0 1626.71 0 0 0 -675.146 0 0 0 0 0 0 0 0 -1331.9 2346.95 0 0 0 0 -1746.96 0 -1321.38 0 1181.14 0.09 0 0 0 0 0 0 0 -1599.55 0 1101.18 0 0 0 2253.11 0 0 
0 -1939.38 0 0 0 -816.294 0 0 0 0 0 -2116.53 1667.15 0 0 0 0 0 0 0 0 1537.14 435.728 -327.082 0 0 0 -1784.8 0 0 2068.62 -1930.22 -1963.33 0 0 0 -55.1622 0 0 0.05 2134.39 1717.66 0 0 0 0 0 0 -1202.96 2048.48 0 0 0 0 0 
0 0 0 0 0 0 0 0 0 0 0 0 0 0 0 0 -2330.01 -776.925 0 0 0 1593.45 0 0 0 0 1276.06 0 -1037.86 0 0 0 -203.635 0 0 0 2151.63 0 0 -1313.75 0.02 0 985.214 0 0 1723.61 0 -711.921 0 1813.03 0 2352.14 -2271.57 0 0 
0 0 0 0 0 0 0 -2210.23 0 0 0 0 0 2408.44 0 2062.52 0 0 0 0 0 0 0 0 -1506.93 0 145.192 0 2149.19 0 0 0 0 0 0 -537.507 1488.62 0 0 -1316.03 0 0.02 0 0 0 0 0 0 0 0 0 0 0 0 765.481 
0 -1570.86 0 1132.77 0 1001.85 0 0 -622.196 0 0 0 0 -1579.1 -1936.32 0 -129.17 0 0 0 0 2128.9 0 0 1089.74 0 0 0 0 182.882 0 0 0 0 0 0 0 0 0 0 2289.88 0 0.04 0 1917.55 0 0 0 0 0 0 0 -790.811 0 0 
0 0 0 0 265.893 0 0 0 768.99 0 0 2244.56 0 0 2393.34 -2131.64 0 0 2118.67 0 0 0 0 0 2336.42 0 0 0 0 0 0 0 0 0 0 0 0 0 0 0 0 0 0 0.08 0 -2389.22 0 0 0 0 -1761.3 0 0 0 0 
0 0 -2483.06 0 0 1449.86 0 0 0 0 0 0 -292.291 -1202.35 1510.28 1978.59 0 928.144 -1091.72 0 0 0 0 1461.15 0 0 0 0 0 0 0 0 0 0 -1261.86 -55.62 0 0 0 0 0 0 -1684.39 0 0.02 0 0 0 0 0 2451.48 0 0 1117.97 -110.706 
0 0 885.723 0 -710.852 0 0 2183.07 601.901 0 0 652.104 1247.67 0 -185.018 -656.224 0 0 0 0 -1715.67 0 0 0 0 0 0 0 0 0 1008.41 0 0 0 1427.58 0 -100.94 0 0 0 -1643.04 0 0 1355.25 0 0.07 0 0 0 0 0 0 0 1084.25 2192.98 
0 0 0 0 1249.05 0 0 0 0 -1814.71 0 0 0 0 0 0 0 0 -507.599 0 0 0 2166.74 0 1877.12 0 0 0 0 0 0 0 0 0 0 2459.72 0 1857.13 -1740.85 0 0 0 0 0 0 0 0.09 0 0 0 850.322 0 0 0 0 
2245.02 0 363.094 0 0 1619.85 0 1810.59 1798.84 -1685.92 0 0 0 -1687.75 0 1402.1 -2320.09 0 0 2052.14 0 0 0 0 0 842.082 2425.69 0 0 1880.47 0 -622.806 0 0 0 0 0 0 0 0 -1987.59 0 0 0 0 0 0 0.01 0 0 0 0 2143.85 2488.71 0 
686.285 0 0 0 2416.07 683.996 1866.13 0 0 -940.046 -1609.47 0 0 0 0 0 0 0 0 0 -458.464 0 0 0 0 0 0 0 0 0 0 0 0 0 1304.9 0 0 2496.8 -7.09555 680.944 0 0 0 0 0 0 0 0 0.07 -211.57 2421.87 0 502.258 -2022.23 2169.33 
1847.67 0 0 0 0 0 0 0 0 0 0 0 0 0 0 0 0 1776.41 0 0 0 0 1684.85 2080.22 0 0 0 0 -1788.46 1197.16 0 -810.648 0 0 0 0 2346.49 -2409.82 0 -397.122 -484.558 0 0 0 0 0 0 0 6.33259 0.04 0 0 0 0 0 
0 -1671.73 2053.82 0 0 0 0 0 0 -1081.19 0 0 0 0 880.688 0 0 -1731.39 0 0 0 2140.49 0 0 0 0 0 0 0 0 0 0 0 2323.3 0 0 0 0 0 0 0 0 0 -1260.64 -2257.99 0 777.383 0 2356.56 0 0.05 0 1181.75 0 0 
1987.59 0 1001.39 0 -2309.41 -490.509 -841.319 2412.72 -103.687 781.198 0 0 0 0 1536.68 0 0 600.223 1472.59 0 0 0 0 0 0 0 0 0 0 0 -1477.94 0 -11.9785 737.709 0 0 78.3563 0 0 0 633.183 0 0 0 0 0 0 0 0 0 0 0.01 0 0 0 
0 0 1044.42 0 0 0 0 0 1249.5 -1527.99 -1863.54 428.861 0 0 0 0 0 0 0 0 0 0 0 0 0 1825.39 0 0 0 0 1869.49 0 0 575.808 0 2032.15 -1511.35 0 -2377.62 0 -2357.48 0 1392.48 0 0 0 0 911.664 -1775.49 0 2338.86 0 0.09 0 0 
796.152 2461.39 0 0 0 0 0 932.264 814.158 0 953.169 -590.304 -2273.55 0 0 -756.02 0 0 0 0 0 -2478.03 0 0 0 383.999 0 0 0 0 -261.01 -2289.42 0 0 -34.257 0 0 0 0 0 0 0 0 0 1042.89 1492.43 0 387.967 1828.59 0 0 0 0 0 1894.51 
0 0 0 0 0 0 -1461.15 0 1739.02 0 0 0 0 0 0 724.433 0 0 0 0 0 543.153 0 0 0 0 0 0 0 0 0 0 0 0 0 0 -126.423 0 0 0 0 1063.04 0 0 1366.7 -545.289 0 0 1811.2 0 0 0 0 2432.86 0.02 
