*Vertices 71
*Matrix 
0.07 0 0 1365.63 0 -1879.1 0 0 2046.8 0 0 0 0 2359.31 0 0 -112.384 0 0 0 485.626 0 0 0 0 0 0 0 0 0 -1436.58 0 0 0 0 0 0 0 0 0 0 0 0 0 0 0 0 -2210.99 0 0 548.341 0 0 0 0 0 0 0 -56.5355 0 0 561.769 0 0 0 0 0 0 0 0 0 
0 0.04 1425.75 0 383.999 0 36.6985 0 0 0 0 0 205.008 0 0 -1521.73 0 0 1304.74 658.208 -196.463 0 0 0 0 0 0 -1827.22 0 0 0 0 -162.74 0 0 2130.27 0 0 0 0 0 0 0 0 -1996.29 855.205 777.383 0 -2045.88 0 0 0 0 2257.68 0 1084.25 0 463.195 1498.38 0 0 0 -1551.94 0 0 0 0 0 0 0 0 
0 1835.15 0.06 1877.12 0 0 -533.235 0 1864.91 0 0 0 0 2116.08 804.697 0 0 0 0 1447.42 0 0 0 2322.38 0 0 0 0 0 -2315.97 1924.73 -543.306 -356.685 0 0 0 0 0 666.601 1515.17 0 0 0 0 0 156.178 0 0 0 0 0 -646.458 0 0 0 701.392 0 0 302.362 0 0 0 0 1214.71 0 -2410.43 2297.81 0 0 0 0 
1529.51 0 -2169.33 0.03 0 1631.75 -1860.18 0 830.332 -492.645 1740.55 0 0 0 0 0 0 0 2208.55 0 0 0 0 835.063 -1081.65 2411.34 0 0 0 -997.879 0 0 1124.38 992.08 0 0 0 367.367 0 0 0 0 0 0 -1099.96 0 -772.347 0 0 0 1591.01 -92.2422 0 0 0 0 0 0 0 0 1004.29 0 0 2197.56 0 0 2399.9 0 0 0 0 
0 -94.3785 0 0 0.04 0 0 0 0 -432.524 0 0 2423.86 1533.78 0 0 0 0 0 0 0 0 0 0 0 -1101.95 0 0 0 0 0 2013.08 0 0 0 0 0 0 0 0 218.589 0 0 0 0 -701.697 0 1428.19 0 -1139.94 0 2136.37 0 509.888 1806.31 0 0 0 0 0 21.5918 0 -25.7118 -422.3 0 0 0 0 0 0 0 
-1235.31 0 0 -934.248 0 0.03 0 1902.45 29.0689 0 -1876.35 0 0 0 0 180.135 0 403.531 0 0 0 0 0 821.024 0 0 0 0 2168.87 0 0 348.903 0 0 0 0 0 0 1755.81 0 0 0 0 0 0 0 0 0 -707.801 548.646 0 0 0 1631.14 0 1422.85 0 -665.838 0 -263.146 0 0 0 1910.99 0 0 -601.291 0 0 2249.44 0 
0 906.781 491.577 1316.64 0 0 0 0 0 2210.53 0 0 -2154.23 0 882.824 0 0 0 -2151.17 0 0 0 0 0 0 -2351.83 0 2307.58 0 -1023.36 1243.25 0 0 0 0 0 -1268.27 0 0 0 2451.17 0 0 0 0 0 0 0 0 0 0 0 207.907 0 0 0 1863.99 0 0 -1298.18 0 0 0 837.046 0 0 -2068.77 2090.44 0 0 0 
0 0 0 0 0 -1623.2 0 0.01 -1100.73 0 -35.783 0 0 831.553 2149.49 0 309.839 0 1351.28 0 0 0 0 0 0 -432.676 0 -1324.43 0 0 0 0 0 0 0 -1816.08 2116.08 0 492.645 0 0 -1075.4 0 1975.23 0 1827.22 0 0 487.609 0 0 0 0 0 0 0 0 525.91 1568.88 0 0 0 0 -424.131 0 883.435 0 0 0 0 0 
-1672.8 0 1324.27 1235.62 0 1967.45 0 1861.86 0.04 -1044.42 0 1103.78 1088.82 0 656.529 0 0 0 0 0 0 0 -2207.94 0 0 -158.315 0 -1242.48 0 0 -79.4244 -619.297 0 0 0 1554.69 0 0 0 0 0 0 0 0 0 0 0 1696.6 1868.72 0 0 0 689.947 0 -855.205 0 0 0 2310.48 -2485.2 0 0 0 0 -290.918 0 0 -2057.33 0 2198.32 0 
0 0 0 1598.33 -1958.91 0 -1280.94 0 1468.47 0.02 0 2258.75 -1863.99 0 0 0 0 670.415 0 0 621.433 55.3148 0 -1913.59 0 0 0 861.614 1912.82 0 0 0 0 0 0 0 0 0 0 1097.83 0 0 0 1307.64 0 0 0 0 1659.22 0 -160.604 0 -1293.6 0 0 0 -1732.46 1070.51 0 0 0 1345.18 -1699.5 1773.66 -290.002 0 0 0 0 318.079 0 
0 0 0 1600.01 0 -2404.17 0 -123.524 0 0 0.05 -1385.62 1269.34 1811.04 0 0 0 0 0 0 0 1674.63 1780.98 0 0 0 1167.41 0 0 1914.2 0 0 0 0 0 0 0 0 0 -1887.8 0 0 0 0 1808.15 0 1309.02 266.198 0 -598.544 917.768 0 0 1691.26 0 -941.725 0 0 243.461 0 2009.26 0 0 0 0 0 0 0 0 2391.35 0 
0 0 0 0 0 0 0 0 2384.95 -1914.35 137.715 0.01 0 0 0 0 -737.709 0 0 0 0 1329.62 0 1391.87 0 0 0 0 0 0 0 1808.3 0 2453.92 0 0 0 0 0 0 0 0 0 0 -2464.14 0 -1363.19 0 418.943 1163.59 389.95 2457.58 0 0 0 0 0 0 0 0 -1507.08 0 353.633 0 0 0 0 2200.16 0 0 0 
0 1987.44 0 0 379.574 0 -1265.68 0 -1972.49 -1315.73 201.346 0 0.05 1870.71 -861.309 1492.13 313.044 1364.56 0 0 0 -826.975 0 0 366.756 369.35 0 -202.872 0 892.59 0 0 0 0 0 0 0 0 -226.829 0 0 2282.4 0 0 0 0 0 0 1305.35 747.78 0 0 -996.048 0 1423.15 0 0 0 -431.608 0 0 0 13.5044 0 0 0 433.744 0 0 0 1166.95 
-695.746 0 -676.977 0 632.572 0 0 -467.009 0 0 -2105.7 0 2302.39 0.09 0 0 0 -41.5815 -336.085 2028.03 -1686.99 0 0 0 0 894.726 0 -293.512 0 0 0 493.713 1207.24 2342.68 0 2478.94 -2066.03 0 0 1529.36 0 0 0 2078.39 1573.15 0 1966.38 203.177 1642.58 1525.54 0 0 561.922 0 0 0 2008.5 1065.48 0 0 0 -2438.35 0 0 827.738 0 0 0 0 0 0 
0 0 815.531 0 0 0 -697.272 814.615 271.996 0 0 0 2098.53 0 0.05 0 0 -1570.71 0 -627.995 0 0 0 -1573.15 0 1643.96 0 0 -2429.04 -1255.46 0 0 0 -2063.28 978.5 1209.98 -481.506 1846.45 0 0 2212.21 1786.48 2247.61 0 0 1924.57 0 0 0 0 0 -826.823 0 346.767 0 0 -1828.75 0 0 0 -1955.85 0 -295.19 0 -1575.29 0 0 0 0 0 0 
0 -1564 0 0 0 1889.78 0 0 0 0 0 0 -2383.88 0 0 0.06 0 0 0 1697.97 0 1075.24 0 0 -407.346 0 0 0 -1868.42 1667.46 0 0 0 -1136.43 -22.66 0 2404.48 0 796.609 0 -210.501 0 0 -1921.52 0 0 0 0 0 0 0 0 2251.88 0 445.189 0 2032.91 2436.52 0 0 0 1303.37 1450.16 0 0 0 0 0 -1367 0 0 
-684.454 0 0 0 0 0 0 443.358 0 0 0 1568.42 664.159 0 0 0 0.01 0 0 0 2447.2 0 0 2032 0 -53.3311 -76.3726 0 -1844.46 0 0 0 0 0 -1721.63 0 0 0 -1750.31 0 0 0 2419.43 -1114 695.288 1347.47 834.452 0 2025.59 0 1100.12 0 -803.629 0 0 0 1534.55 0 0 0 2377.77 2127.67 0 0 -1279.87 -904.187 0 0 0 0 -2242.42 
0 0 0 0 0 714.057 0 0 0 -257.347 0 0 132.984 -2460.48 1982.25 0 0 0.07 -963.851 -19.1504 0 2255.85 1275.6 0 0 0 0 0 0 0 2316.43 0 0 0 0 1633.88 0 0 0 0 0 1303.22 0 0 0 0 0 0 0 0 895.184 0 0 0 0 0 0 -1892.99 0 0 1320.15 1375.55 0 0 0 1370.82 0 0 0 0 0 
0 1251.03 0 207.907 0 0 1761.91 2374.11 0 0 0 0 0 -2463.07 0 0 0 1807.69 0 0 613.346 0 0 1615.27 0 2324.37 0 0 120.319 0 0 0 0 2095.78 0 0 -1226.62 0 259.789 0 0 0 -1055.56 0 0 0 0 0 0 0 0 -935.926 0 0 -21.1341 0 -2458.34 0 0 0 0 0 -1411.71 0 0 0 0 0 0 0 0 
0 331.05 -944.166 0 0 0 0 0 0 0 0 0 0 -1829.97 7.55333 433.287 0 1353.27 0 0.07 1652.04 0 0 0 0 0 0 0 -611.667 646.763 0 1162.83 0 -1007.34 0 0 -1627.63 0 0 0 0 0 0 0 0 0 114.521 0 2278.89 0 0 0 -728.553 0 0 1258.66 0 -1966.99 0 358.974 0 0 620.06 0 0 2267.6 0 0 0 0 0 
1264.61 -1376.16 0 0 0 0 0 0 0 1335.87 0 0 0 1729.71 0 0 173.574 0 239.952 -1470.15 0.02 0 0 1902.91 0 0 0 0 0 720.313 1817.91 -970.87 0 0 0 0 -604.953 2217.55 0 0 0 0 1193.35 0 -1844.92 0 0 0 0 0 -1400.88 0 0 0 0 0 0 0 0 0 -1665.62 758.766 0 0 2456.05 -1687.44 -1876.96 0 0 0 -1547.67 
0 0 0 0 0 0 0 0 0 583.285 -1555.76 2186.42 -130.39 0 0 -811.869 0 1879.71 0 0 0 0.03 2174.37 -500.427 788.522 0 0 0 0 0 0 0 0 2394.86 0 667.516 0 0 -2169.94 -1701.94 0 0 0 0 574.435 0 -1685.61 0 1569.19 0 0 0 931.349 0 0 0 0 -2175.59 0 0 0 -1164.97 0 0 2379.91 15.183 -839.488 0 0 0 0 
0 0 0 0 0 0 0 0 -291.681 0 2155.9 0 0 0 0 0 0 2474.82 0 0 0 -2259.67 0.02 1591.31 738.166 0 0 0 0 0 0 0 0 0 77.2881 2250.66 400.021 0 -2066.03 -1278.34 -1145.44 0 0 0 0 0 697.882 2416.68 2320.4 1034.96 0 0 565.279 2371.52 748.543 1632.97 0 -1744.36 0 0 0 0 -1677.83 0 0 -505.158 0 -804.239 0 0 362.178 
0 0 351.497 -1964.25 0 -2267.3 0 0 0 581.607 0 2215.41 0 0 -714.667 0 1840.8 0 2002.4 0 -900.83 -1081.5 808.054 0.09 0 0 -683.844 0 0 0 0 0 0 0 0 0 2006.82 0 0 -1895.58 0 0 0 0 0 0 0 -2172.99 0 0 0 0 0 0 2154.99 0 987.96 11.3681 -264.672 0 0 2472.08 0 735.115 710.395 -313.349 0 0 0 0 0 
0 0 0 1629.61 0 0 0 0 0 0 0 0 -1067.31 0 0 -1380.28 0 0 0 0 0 1066.7 1543.55 0 0.07 0 0 -169.607 0 0 0 0 0 0 0 0 0 0 1598.33 0 1737.95 0 0 0 0 0 0 0 0 0 0 0 0 0 0 0 2321.31 0 0 0 0 0 0 0 -1690.04 0 0 0 2052.29 0 0 
0 0 0 -1303.06 -774.789 0 1014.51 1200.22 -1467.25 0 0 0 806.223 2244.25 1889.02 0 1110.8 0 -67.98 0 0 0 0 0 0 0.07 0 0 2488.71 1158.41 0 0 0 -942.03 1415.52 -1665.01 0 0 0 0 0 0 0 0 0 0 0 514.161 0 0 1773.96 0 -2440.03 -181.204 0 0 0 0 0 0 0 0 0 0 -1984.54 0 2304.99 0 0 0 0 
0 0 0 0 0 0 0 0 0 0 -1844.92 0 0 0 0 0 616.398 0 0 0 0 0 0 2007.74 0 0 0.06 0 0 0 0 0 0 0 0 0 0 0 0 0 0 957.289 0 0 0 0 1078.75 0 0 0 0 0 0 0 0 0 0 0 0 2185.05 0 0 -290.765 737.709 -2.97555 0 0 -1566.74 447.783 0 572.604 
0 2389.52 0 0 0 0 1492.28 -431.15 1186.94 -152.364 0 0 446.257 1347.32 0 0 0 0 0 0 0 0 0 0 -612.125 0 0 0 0 0 0 -605.716 0 2306.51 0 -1364.41 848.186 0 0 0 0 0 0 -1505.1 0 1265.68 0 0 0 851.238 0 0 0 -1239.28 0 872.753 0 0 0 0 0 -2049.85 -576.266 -312.433 0 0 0 0 0 450.072 0 
0 0 0 0 0 -194.784 0 0 0 -2253.87 0 0 0 0 -746.559 788.98 1009.93 0 241.02 -227.134 0 0 0 0 0 2253.11 0 0 0.05 0 882.061 367.214 0 0 -746.864 0 -2091.81 2267.6 0 0 0 0 640.355 0 -807.291 0 0 0 0 0 0 0 0 0 -2005.29 0 0 0 0 0 0 0 0 0 0 2489.32 -1126.82 0 0 0 -552.309 
0 0 1155.2 -53.7889 0 0 1858.04 0 0 0 1134.6 0 -1031.45 0 1846.29 1502.2 0 0 0 1703.92 1474.58 0 0 0 0 2452.7 0 0 0 0.05 0 0 0 0 0 1008.56 0 0 0 0 1432.31 0 1215.78 0 0 -67.98 0 0 0 0 0 0 -1932.97 0 0 0 1779.61 0 0 0 834.605 -1284.3 0 0 0 -1225.09 629.826 0 -1653.42 0 -2069.08 
565.889 0 2158.5 0 0 0 -1217.76 0 -364.162 0 0 0 0 0 0 0 0 1110.95 0 0 -1930.52 0 0 0 0 0 0 0 231.254 0 0.05 0 0 0 0 -1421.93 0 0 2089.83 0 2181.69 0 0 -2066.64 -935.621 -247.429 0 -722.755 0 2121.88 1401.79 0 -929.518 0 0 0 -0.381481 0 0 0 0 0 0 0 0 1343.96 0 0 0 0 0 
0 0 2285.76 0 -1622.9 -1494.11 0 0 -1118.12 0 0 981.094 0 1136.28 0 0 0 0 0 1942.27 -2131.34 0 0 0 0 0 0 2494.66 1961.04 0 0 0.02 0 0 421.537 -107.196 0 0 0 0 0 0 0 0 0 -332.27 568.941 0 0 0 0 0 0 -192.648 0 0 0 0 0 0 0 0 0 0 0 -2396.08 595.798 0 0 0 0 
0 -2134.08 2120.04 -735.42 0 0 0 0 0 0 0 0 0 -1397.21 0 0 0 0 0 0 0 0 0 0 0 0 0 0 0 0 0 0 0.06 0 0 0 0 645.238 0 0 0 0 0 0 0 2319.94 0 0 2231.28 0 0 -288.934 0 0 0 0 0 0 0 0 0 0 0 0 2007.43 0 0 0 0 0 0 
0 0 0 -1028.4 0 0 0 0 0 0 0 959.426 0 462.127 1915.57 1836.83 0 0 682.775 825.755 0 -1804.64 0 0 0 -1511.35 0 -1563.84 0 0 0 0 0 0.06 2118.21 0 0 669.347 0 0 0 0 2462.92 0 0 134.205 0 0 0 0 0 0 0 0 0 0 0 0 0 0 -2249.29 0 0 0 0 0 -239.494 0 0 0 0 
0 0 0 0 0 0 0 0 0 0 0 0 0 0 -153.432 1113.09 643.712 0 0 0 0 0 -1794.87 0 0 956.984 0 0 864.055 0 0 1874.98 0 -60.9607 0.02 0 0 0 0 0 0 0 0 0 -1707.59 -1271.63 0 0 -1152.46 1511.66 0 0 0 2328.49 0 0 2006.67 0 0 0 0 0 -2258.75 0 2214.19 0 0 0 -1309.32 0 0 
0 980.789 0 0 0 0 0 742.134 -1485.72 0 0 0 0 1063.04 707.648 0 0 631.199 0 0 0 -405.972 509.583 0 0 1079.06 0 1458.4 0 2079 326.472 679.724 0 0 0 0.01 0 0 -431.761 0 0 0 0 0 0 1939.53 -793.252 0 0 0 0 0 0 0 0 828.806 0 0 0 0 -2462.46 1772.13 1514.4 0 -392.697 794.931 0 0 0 0 0 
0 0 0 0 0 0 1537.14 1822.79 0 0 0 0 0 1094.32 1600.92 994.369 0 0 2098.07 963.24 -1234.86 0 2048.02 1081.04 0 0 0 1233.18 1803.11 0 0 0 0 0 0 0 0.01 0 0 2451.78 0 0 991.623 0 0 -949.355 1515.47 -2319.48 0 -2135.61 0 0 1171.38 0 517.518 0 0 0 0 0 846.66 0 0 -855.052 816.904 0 0 0 0 0 0 
0 0 0 267.571 0 0 0 0 0 0 0 0 0 0 -397.885 0 0 0 0 0 2026.66 0 0 0 0 0 0 0 380.49 0 0 0 -880.84 552.156 0 0 0 0.05 0 0 0 -798.593 41.2763 0 0 0 806.68 1241.26 0 0 0 1349.45 2493.59 0 166.707 0 0 0 0 0 200.125 0 0 0 0 0 724.433 0 0 2075.64 0 
0 0 1084.7 0 0 1114.15 0 -30.7474 0 0 0 0 2282.56 0 0 2473.91 1941.97 0 962.935 0 0 2218.62 125.66 0 958.51 0 0 0 0 0 1401.18 0 0 0 0 -585.116 0 0 0.01 0 0 576.724 0 0 0 -216.605 2401.27 0 0 0 0 1029.62 0 -576.724 0 0 0 -2483.21 0 122.761 0 0 0 0 0 0 0 0 0 -2042.53 0 
0 0 1168.17 0 0 0 0 0 0 -1254.84 -918.073 0 0 -2264.85 0 0 0 0 0 0 0 977.737 2118.52 901.898 0 0 0 0 0 0 0 0 0 0 0 0 1995.07 0 0 0.08 0 0 -423.063 0 0 -861.156 2451.32 0 -700.323 0 0 0 0 0 0 -195.853 0 0 0 0 0 0 0 0 0 0 0 0 0 0 0 
0 0 0 0 1470 0 -2213.13 0 0 0 0 0 0 0 2201.38 460.295 0 0 0 0 0 0 453.276 0 -1051.13 0 0 0 0 2363.43 -11.3681 0 0 0 0 0 0 0 0 0 0.06 0 0 -997.269 0 0 0 0 0 0 378.506 0 0 1295.43 0 0 442.289 0 321.894 2081.9 0 0 0 0 0 0 0 0 0 0 0 
0 0 0 0 0 0 0 1433.07 0 0 0 0 369.655 0 880.84 0 0 1154.74 0 0 0 0 0 0 0 0 -757.241 0 0 0 0 0 0 0 0 0 0 422.91 2087.24 0 0 0.03 0 0 851.238 0 0 0 0 0 0 2276.45 0 0 0 1771.83 0 -279.931 2114.4 2385.86 0 0 -498.138 0 0 0 -1403.93 0 0 0 0 
0 0 0 0 0 0 0 0 0 0 0 0 0 0 1983.32 0 302.973 0 2097 0 1096 0 0 0 0 0 0 0 1686.99 2436.98 0 0 0 1524.48 0 0 -1690.65 -895.032 0 -1842.48 0 0 0.02 -786.691 0 0 0 0 0 0 293.97 0 0 -1937.7 -996.2 0 0 0 0 1436.89 -559.175 1965.77 0 0 0 0 0 0 0 0 0 
0 0 0 0 0 0 0 -733.589 0 340.51 0 0 0 2015.67 0 -1732.15 -619.907 0 0 0 0 0 0 0 0 0 0 -2430.88 0 0 2427.37 0 0 0 0 0 0 0 0 0 1245.23 0 1184.8 0.05 0 0 291.223 0 0 0 0 0 0 0 0 0 0 0 0 0 0 2150.41 0 1947.46 0 1995.83 0 0 0 0 0 
0 902.509 0 -1189.23 0 0 0 0 0 0 562.838 2436.67 0 430.082 0 0 -2315.67 0 0 0 1220.82 -2475.74 0 0 0 0 0 0 2360.53 0 -468.23 0 0 0 1119.19 0 0 0 0 0 0 1974.01 0 0 0.09 0 0 0 0 0 0 0 0 -366.146 0 0 0 0 1111.71 0 0 0 0 0 0 -2146.29 -2437.74 0 1697.52 0 0 
0 -1934.49 1127.89 0 -1199.3 0 0 887.402 0 0 0 0 0 0 -4.0437 0 2204.89 0 0 0 0 0 0 0 0 0 0 -241.173 0 2359.31 -1780.83 -558.412 10.9104 -169.149 125.965 1128.96 1462.98 0 2183.22 563.906 0 0 0 0 0 0.05 2189.02 0 0 0 98.6511 0 2343.9 -513.855 0 0 0 -2151.94 0 -2326.96 0 0 0 0 -2465.67 0 0 908.307 0 0 0 
0 2129.35 0 -2395.78 0 0 0 0 0 0 -1990.95 30.137 0 806.07 0 0 726.417 0 0 -1174.28 0 2459.72 577.181 0 0 0 1655.71 0 0 0 0 -505.615 0 0 0 1951.12 -929.67 -2387.54 -374.233 -997.574 0 0 0 -1826.76 0 -2464.29 0.01 576.876 2488.25 0 1039.38 0 1522.03 -595.645 0 -1398.43 0 1774.73 0 140.614 0 1301.23 0 0 2385.4 0 0 0 0 1205.4 0 
2322.99 0 0 0 -1588.87 0 0 0 -2494.35 0 511.567 0 0 1331.9 0 0 0 0 0 0 0 0 1127.74 -656.987 0 -170.217 0 0 0 0 1556.83 0 0 0 0 0 -1768.01 1733.07 0 0 0 0 0 0 0 0 -1363.8 0.07 469.909 0 0 0 0 0 -1868.42 -93.9207 0 2133.78 0 0 0 0 679.418 0 0 0 248.192 0 0 0 0 
0 1174.43 0 0 0 -2027.88 0 -2484.13 1100.73 1396.3 0 1153.52 -1662.27 -1648.84 0 0 2090.44 0 0 -2297.36 0 2097.31 2065.11 0 0 0 0 0 0 0 0 0 1093.86 0 2280.72 0 0 0 0 754.494 0 0 0 0 0 0 2428.89 372.86 0.01 0 0 0 0 0 381.252 2389.07 0 0 -1314.05 0 0 1230.89 -105.823 0 0 -380.032 0 0 0 0 0 
0 0 0 0 755.562 -2206.87 0 0 0 0 2280.11 -15.0304 1606.42 -1174.43 0 0 0 0 0 0 0 0 1162.22 0 0 0 0 1128.04 0 0 232.78 0 0 0 59.2822 0 -373.623 0 0 0 0 0 0 0 0 0 0 0 0 0 0 -706.58 0 0 0 0 0 0 0 0 0 0 0 0 1264.46 -85.6807 0 0 0 0 0 
851.085 0 0 -402.158 0 0 0 0 0 -1024.58 -2490.23 214.164 0 0 0 0 -258.263 787.301 0 0 -622.959 0 0 0 0 506.684 0 0 0 0 -651.494 0 0 0 0 0 0 0 0 0 -1967.3 0 -1256.83 0 0 2345.88 896.863 0 0 0 0.03 0 2245.32 541.322 2121.11 -1484.65 -911.817 0 0 2249.75 0 460.906 0 0 0 -132.527 2085.1 0 0 0 -554.903 
0 0 -53.9415 805.765 1248.13 0 0 0 0 0 0 -1265.98 0 0 1003.22 0 0 0 -2183.98 0 0 0 0 0 0 0 0 0 0 0 0 0 1025.96 0 0 0 0 296.258 755.562 0 0 659.124 0 0 0 0 0 0 0 1649.91 0 0.07 0 0 0 -321.436 1891.16 0 0 0 0 0 0 0 0 0 0 0 847.423 0 0 
0 0 0 0 0 0 847.728 0 -1701.64 -552.614 0 0 294.122 1786.78 0 -2286.37 1685.77 0 0 956.679 0 -1673.25 -192.953 0 0 2169.48 0 0 0 199.82 1722.54 0 0 0 0 0 1466.34 -199.362 0 0 0 0 0 0 0 -806.375 -881.298 0 0 0 2109.97 0 0.07 0 0 -1774.73 0 0 0 0 0 0 0 0 0 0 0 0 0 0 0 
0 981.704 0 0 -1874.22 1505.1 0 0 0 0 -128.559 0 0 0 -1622.44 0 0 0 0 0 0 0 1503.88 0 0 -1039.08 0 1809.52 0 0 0 607.7 0 0 174.184 0 0 0 1579.26 0 115.131 0 372.707 0 2356.72 -768.227 1905.8 0 0 0 1898.18 0 0 0.08 0 467.925 0 2067.55 1649.91 -5.41704 0 -18.8452 0 385.983 0 0 1195.33 0 0 -1962.87 -1404.69 
0 0 0 0 1303.37 0 0 0 -2124.47 0 0 0 529.878 0 0 927.229 0 0 -1386.84 0 0 0 -303.735 1973.25 0 0 0 0 -2089.37 0 0 0 0 0 0 0 427.183 454.802 0 0 0 0 1462.98 0 0 0 0 1780.83 -1012.68 0 250.175 0 0 0 0.04 0 0 702.002 0 0 0 1480.38 0 2251.88 0 0 0 0 0 0 0 
0 1419.49 624.027 0 0 -131.306 0 0 0 0 2157.12 0 0 0 0 0 0 0 0 -685.675 0 0 1341.36 0 0 0 0 1958.75 0 0 0 0 0 0 0 124.287 0 0 0 -2176.66 0 -1612.06 0 0 0 0 -2221.06 1205.86 1826.46 0 -1094.47 -306.482 -829.264 1167.41 0 0.05 -1164.82 0 1521.88 0 0 0 -1308.1 0 0 1756.42 0 0 0 2168.72 0 
0 0 0 0 0 0 483.032 0 0 862.835 0 0 0 -218.284 394.528 405.972 2396.54 0 -190.664 0 0 0 0 -565.432 331.355 0 0 0 0 1882.31 -1058 0 0 0 1175.19 0 0 0 0 0 -285.882 0 0 0 0 0 0 0 0 0 1443.3 248.192 0 0 0 -1432.92 0.08 -339.137 0 0 629.521 570.925 0 0 0 -2175.59 0 0 1572.85 0 1276.21 
0 2084.95 0 0 0 250.481 0 2214.19 0 1048.08 0 0 0 2161.7 0 -2351.83 0 -1251.64 0 -1428.19 0 400.479 842.235 1316.19 0 0 0 0 0 0 0 0 0 0 0 0 0 0 -552.309 0 0 1854.99 0 0 0 -277.032 -1983.17 -1293.6 0 0 0 0 0 -1331.29 -1362.58 0 75.7622 0.02 0 0 2314.29 0 0 0 0 0 0 0 0 0 0 
95.1415 2220.3 131.306 0 0 0 0 2279.2 1818.06 0 -2349.7 0 -749.611 0 0 0 0 0 0 0 0 0 0 -655.309 0 0 0 0 0 0 0 0 0 0 0 0 0 0 0 0 -1936.78 2173.15 0 0 1981.64 0 0 0 887.707 0 0 0 0 2225.79 0 -839.183 0 0 0.02 0 0 0 -2165.52 0 0 1498.54 -686.438 0 0 0 0 
0 0 0 0 0 1727.27 2084.49 0 -564.211 0 0 0 0 0 0 0 0 0 0 -2431.49 0 0 0 0 0 0 2192.98 0 0 0 0 0 0 0 0 0 0 0 -1584.14 0 2398.98 -1274.99 -206.687 0 0 -1559.27 -2489.32 0 0 0 -1117.36 0 0 -2456.97 0 0 0 0 0 0.04 -398.343 0 1737.8 -95.9044 0 2445.37 1808.6 0 0 0 0 
0 0 0 2348.32 -212.943 0 0 0 0 0 784.555 2169.48 0 0 -963.851 0 -559.786 -1495.79 0 0 -940.199 0 0 0 0 0 0 0 0 2370.75 0 0 0 1265.53 0 1766.18 1954.94 121.845 0 0 0 0 1898.94 0 0 0 0 0 0 0 0 0 0 0 0 0 608.158 2077.47 0 -291.833 0.02 0 0 -2094.71 0 -1634.65 0 0 0 0 0 
-680.639 0 0 0 0 0 0 0 0 1031.6 0 0 0 -2472.84 0 -194.632 989.181 -1085.01 0 0 -998.489 781.808 0 -2346.8 0 0 0 -136.952 0 2289.12 0 0 0 0 0 -1671.12 0 0 0 0 0 0 2085.25 791.726 0 0 1467.1 0 994.522 0 -438.017 0 0 1086.54 1529.05 0 -104.45 0 0 0 0 0.06 0 0 -1158.41 -2201.22 -218.131 46.1592 0 0 0 
0 1321.53 0 0 1711.25 0 0 0 0 -650.578 0 1870.86 1548.89 0 73.9311 877.636 0 0 1572.54 -155.568 0 0 1189.84 0 0 0 -1723 1932.97 0 0 0 0 0 0 -1837.9 -2296.75 0 0 0 0 0 587.863 0 0 0 0 0 1110.03 -1656.93 0 0 0 0 0 0 -2353.66 0 0 2225.49 -2410.12 0 0 0.04 0 0 627.842 0 0 0 0 0 
0 0 1532.56 -2132.71 -403.073 -2369.23 1799.75 1521.42 0 -1357.69 0 0 0 0 0 0 0 0 0 0 0 0 0 467.467 0 0 -1207.39 1660.59 0 0 0 0 0 0 0 0 -893.506 0 0 0 0 0 0 2193.75 0 0 0 0 0 0 0 0 0 -20.6763 1624.27 0 0 0 0 2431.18 -1247.83 0 0 0.04 0 0 0 0 0 0 1948.38 
0 0 0 0 0 0 0 0 -2372.28 -886.181 0 0 0 -1774.58 2454.22 0 2147.97 0 0 0 1018.17 2269.89 0 -1905.5 832.926 2035.05 -900.525 0 0 0 0 0 -1991.26 0 397.732 -555.361 -1708.96 0 0 0 0 0 0 0 0 1589.02 2372.59 0 0 699.103 0 0 0 0 0 0 0 0 0 0 0 112.384 0 0 0.02 0 -726.569 0 0 0 0 
0 0 -592.593 0 0 0 0 799.661 0 0 0 0 0 0 0 0 -1988.2 1622.75 0 -2103.41 -913.648 -506.226 1989.58 1374.32 0 0 0 0 -2372.28 2326.04 -2433.62 2294 0 0 0 254.448 0 0 0 0 0 0 0 1979.2 2212.82 0 0 0 -697.424 1630.68 366.909 0 0 0 0 -270.928 -20.0659 0 275.201 1553.62 -2457.12 -420.774 -550.02 0 0 0.04 0 -54.7044 0 1456.57 0 
0 0 469.451 -172.201 0 2297.81 1891.77 0 0 0 0 0 -444.121 0 0 0 0 0 0 0 2472.53 -1125.14 0 0 0 -1884.29 0 0 1889.17 1508 0 -1461.76 0 -2325.74 0 0 0 608.768 0 0 0 1274.99 0 0 -468.383 0 0 -1020.92 0 0 1176.87 0 0 1978.44 0 0 0 0 2452.7 -1758.55 0 1319.54 0 0 -1452.76 0 0.07 0 2233.88 0 0 
0 0 0 0 0 0 2100.67 0 1636.33 0 0 1163.59 0 0 0 0 0 0 0 0 0 0 -1374.94 0 0 0 -748.848 0 0 0 0 0 0 0 0 0 0 0 0 0 0 0 0 0 0 711.921 0 0 0 0 0 0 0 0 0 0 0 0 0 0 0 1861.4 0 0 0 -402.463 0 0.06 0 0 0 
0 0 0 0 0 0 0 0 0 0 0 0 0 0 0 856.883 0 0 0 0 0 0 0 0 -1301.08 0 -58.8244 0 0 229.118 0 0 0 0 869.854 0 0 0 0 0 0 0 0 0 1372.04 0 0 0 0 0 0 1907.03 0 0 0 0 867.87 0 0 0 0 0 0 0 0 0 -418.79 0 0.01 2.21259 0 
0 0 0 0 0 625.553 0 0 -1762.52 192.953 -15.0304 0 0 0 0 0 0 0 0 0 0 0 0 0 0 0 0 835.521 0 0 0 0 0 0 0 0 0 -1618.78 -182.272 0 0 0 0 0 0 0 2401.12 0 0 0 0 0 0 1837.75 0 2225.49 0 0 0 0 0 0 0 0 0 -2001.79 0 0 -1592.68 0.06 0 
0 0 0 0 0 0 0 0 0 0 0 0 1582 0 0 0 -2442.78 0 0 0 351.192 0 -1493.19 0 0 0 1769.08 0 1117.21 -2371.82 0 0 0 0 0 0 0 0 0 0 0 0 0 0 0 0 0 0 0 0 -844.218 0 0 342.647 0 0 2314.75 0 0 0 0 0 0 1993.55 0 0 0 0 0 0 0.06 
