*Vertices 67
*Matrix 
0.04 0 0 0 0 0 0 0 0 0 0 0 0 0 0 0 0 356.99 0 0 0 0 0 0 -1138.11 0 0 0 0 0 2344.05 0 0 846.355 0 0 0 0 0 -240.867 0 0 0 0 0 0 0 -385.83 0 0 0 0 0 0 0 0 0 0 0 0 0 0 0 0 0 750.832 0 
0 0 0 0 0 0 0 0 0 0 0 -867.565 0 1805.7 0 0 2020.25 0 0 0 0 0 0 0 1304.28 0 0 -1097.52 0 0 0 0 0 -22.8126 0 0 0 0 0 0 0 0 0 0 1968.21 0 0 -1459.93 567.568 0 0 0 0 0 0 0 0 0 0 0 0 0 0 2250.36 0 0 0 
0 0 0.05 0 0 0 2313.07 0 0 0 0 0 0 0 970.565 0 0 0 0 0 0 0 0 0 0 0 0 -589.999 0 2386.17 0 0 0 0 0 0 0 0 -2116.84 0 0 0 0 0 1027.79 1963.48 1570.41 0 0 0 0 0 1182.82 0 0 0 0 0 0 0 0 -2029.4 0 0 -153.89 -1177.63 0 
0 0 0 0.05 623.875 0 0 0 0 0 0 0 0 0 0 0 0 0 0 -1202.66 0 0 774.178 0 0 242.546 0 0 0 0 0 2276.76 0 0 0 0 0 0 0 0 0 0 0 0 0 0 0 1748.33 0 0 0 0 0 0 0 -868.175 0 0 0 -782.113 0 0 1115.53 1011.61 0 0 0 
0 0 0 632.878 0.03 1717.05 547.121 0 0 0 0 0 0 0 0 709.632 0 0 0 0 0 0 0 0 0 0 0 1066.55 1592.07 0 0 0 0 0 0 0 0 0 0 0 0 864.36 0 0 -269.707 0 0 0 0 0 0 0 0 0 0 0 0 2035.51 0 0 0 0 0 0 0 0 0 
0 0 0 0 2277.21 0.02 0 -779.824 0 0 0 -752.815 -228.507 2418.21 0 0 0 0 0 0 0 0 0 0 0 0 0 0 0 1714 -508.362 216.453 0 0 0 0 0 0 0 0 0 0 0 0 1513.03 2439.12 0 0 0 0 0 0 0 0 0 0 0 0 0 1099.66 0 0 0 0 0 0 0 
0 0 -2185.96 0 -1484.95 0 0.08 0 0 0 0 0 -285.119 0 0 0 0 0 0 0 0 1585.67 0 0 0 0 0 0 0 0 0 0 0 0 0 0 0 0 -920.667 0 78.0511 0 0 0 0 1364.1 967.208 0 0 0 1527.68 0 0 0 0 0 0 0 625.858 0 0 0 0 0 0 0 329.981 
0 0 0 0 0 1761.3 0 0.08 0 0 0 1978.13 0 0 0 0 0 0 0 0 0 0 0 0 2390.74 0 0 0 0 0 0 0 0 982.162 0 0 0 2200.16 0 0 2387.84 0 0 0 0 0 0 -560.701 0 0 0 0 0 -1873.15 0 0 0 1616.79 0 0 0 0 0 0 0 0 0 
0 0 0 0 0 0 0 0 0 0 0 0 0 -417.264 393.612 0 0 0 2181.08 0 0 0 0 0 0 0 0 0 0 0 0 0 0 68.4378 0 0 2042.38 0 0 0 0 0 0 0 0 0 0 0 0 0 0 0 0 0 0 0 1686.07 0 0 0 0 -2223.81 0 0 0 0 0 
0 0 0 0 0 0 0 0 0 0.09 0 0 0 0 0 0 0 0 0 0 0 706.122 0 0 0 2083.12 0 0 0 289.85 0 0 0 0 0 0 0 0 2167.81 0 0 0 0 0 0 0 0 0 0 -1451.69 0 0 0 0 0 0 0 0 0 0 1699.04 0 0 0 0 0 0 
0 0 0 0 0 0 0 0 0 0 0.01 0 0 78.2037 0 0 432.371 0 0 666.601 0 0 0 0 0 0 0 0 0 0 0 0 0 -1302 0 0 0 0 0 0 618.229 0 0 0 1839.58 0 0 0 0 0 0 522.401 0 0 0 0 0 0 0 0 0 0 0 0 -1976 0 0 
0 -990.555 0 0 0 -104.602 0 2477.87 0 0 0 0.04 0 0 0 -721.534 0 0 730.537 0 0 0 0 2148.73 0 0 0 0 0 0 988.418 0 0 0 0 0 0 0 2205.04 2265.16 0 0 0 208.213 0 0 0 0 0 0 0 0 0 -796.609 0 0 0 0 0 902.509 0 0 0 0 0 0 0 
0 0 0 0 0 -754.799 1960.13 0 0 0 0 0 0.09 0 0 0 0 0 0 0 0 0 0 0 0 0 1794.72 0 0 0 1596.19 0 -1964.86 0 0 0 0 0 0 -513.55 884.808 0 0 0 0 0 0 0 0 0 0 0 0 0 0 0 0 0 0 0 0 0 0 0 0 0 0 
0 -1491.82 0 0 0 2109.06 0 0 -940.046 0 1251.79 0 0 0 0 -1455.81 0 0 0 0 -1672.64 0 2033.83 0 0 0 1797.62 0 0 0 0 0 0 0 0 0 0 0 0 0 0 0 0 0 -133.747 -522.401 0 0 1560.18 0 0 0 0 0 0 0 -1394.31 0 0 0 0 0 0 0 0 0 0 
0 0 2074.27 0 0 0 0 0 2472.08 0 0 0 0 0 0.08 0 0 0 0 0 0 0 2051.99 0 0 0 0 0 0 2278.44 0 0 0 0 0 0 0 0 304.498 0 0 0 1143.91 0 -2480.62 0 0 0 0 0 0 0 0 0 0 0 0 0 0 0 0 844.829 0 -2431.03 0 0 0 
0 0 0 0 -1367.76 0 0 0 0 0 0 1825.08 0 -583.438 0 0 0 0 0 0 0 0 1463.74 0 0 0 0 1063.49 0 -592.898 0 0 0 282.067 0 0 0 0 0 0 0 0 0 0 0 0 0 0 0 0 2148.58 0 0 0 0 1615.73 0 0 0 0 0 0 0 0 0 0 0 
0 713.446 0 0 0 0 0 0 0 0 -1932.81 0 0 0 0 0 0.02 -1984.39 0 0 0 1936.32 0 0 0 0 0 0 0 0 0 0 0 -1468.93 0 0 2165.52 0 2251.73 0 0 0 0 0 0 0 0 0 0 0 0 0 0 0 0 0 0 0 0 0 1186.48 0 0 0 0 0 1556.98 
-1869.95 0 0 0 0 0 0 0 0 0 0 0 0 0 0 0 160.298 0.09 0 0 0 0 0 0 0 0 0 0 0 0 0 0 -166.097 0 0 0 0 0 0 0 0 0 1728.03 0 1796.7 0 0 0 0 1410.18 0 0 0 0 0 0 0 47.0748 0 0 0 -1336.94 0 0 -1110.34 0 0 
0 0 0 0 0 0 0 0 1733.68 0 0 783.486 0 0 0 0 0 0 0.04 0 0 0 0 0 -261.62 0 -387.967 0 0 -327.845 0 0 0 0 97.1252 0 0 806.223 0 0 0 0 0 0 0 -2077.32 2036.42 0 -860.24 0 0 1915.42 0 0 0 0 0 0 0 0 0 0 0 0 0 0 0 
0 0 0 1584.9 0 0 0 0 0 0 1857.59 0 0 0 0 0 0 0 0 0.02 0 0 0 2480.93 0 0 0 0 0 1493.8 891.675 0 2073.05 0 0 0 738.014 0 0 0 -25.2541 0 89.8007 0 0 0 0 0 0 0 0 -1799.45 2119.89 0 290.46 0 0 0 0 1510.28 0 0 0 0 0 0 0 
0 0 0 0 0 0 0 0 0 0 0 0 0 1078.14 0 0 0 0 0 0 0.01 0 0 0 0 0 0 0 0 0 1178.85 0 0 0 0 0 0 0 0 0 -675.909 0 0 0 0 0 0 0 0 0 0 0 0 0 240.41 0 0 0 0 0 0 0 0 0 0 0 0 
0 0 0 0 0 0 197.684 0 0 -1227.68 0 0 0 0 0 0 1277.43 0 0 0 0 0.06 0 0 0 0 0 0 0 0 0 0 0 0 0 0 0 0 0 0 0 0 0 0 0 0 0 0 1963.48 0 0 0 0 0 0 0 0 0 0 0 0 0 0 0 0 1903.06 0 
0 0 0 1903.36 0 0 0 0 0 0 0 0 0 1098.9 1654.03 2330.93 0 0 0 0 0 0 0.05 0 0 -1684.85 0 0 0 0 0 0 0 0 -80.9503 0 0 0 0 0 0 0 0 0 0 0 0 602.054 0 0 0 0 0 0 0 0 0 0 0 0 0 0 0 0 0 0 0 
0 0 0 0 0 0 0 0 0 0 0 2198.02 0 0 0 0 0 0 0 -2183.37 0 0 0 0.02 0 0 0 0 0 0 0 0 0 0 0 0 0 0 0 0 1228.45 0 0 0 0 0 0 0 0 0 0 0 0 0 0 0 804.239 0 0 0 0 0 0 0 0 0 0 
-2236.01 1623.97 0 0 0 0 0 393.46 0 0 0 0 0 0 0 0 0 0 616.092 0 0 0 0 0 0.02 2072.44 0 0 0 0 0 -159.841 0 0 0 0 1406.98 -1697.06 0 0 0 0 0 0 0 0 0 0 0 0 0 0 0 0 0 0 0 0 0 0 0 0 2147.05 0 0 0 0 
0 0 0 2059.77 0 0 0 0 0 -37.4615 0 0 0 0 0 0 0 0 0 0 0 0 -586.032 0 -179.525 0.04 0 0 0 -356.685 0 0 0 0 1747.87 0 0 0 0 0 0 0 0 0 0 0 0 0 0 0 0 0 0 0 0 1703.62 0 0 0 0 0 0 0 0 0 0 0 
0 0 0 0 0 0 0 0 0 0 0 0 295.953 -1051.9 0 0 0 0 1485.72 0 0 0 0 0 0 0 0.09 2393.95 0 0 0 0 0 -779.214 0 0 0 0 0 0 0 0 0 0 0 0 0 1676 0 0 0 0 0 0 0 476.165 0 0 0 0 0 0 0 0 0 0 0 
0 1694.46 152.821 0 -977.889 0 0 0 0 0 0 0 0 0 0 501.648 0 0 0 0 0 0 0 0 0 0 -1106.37 0.03 0 0 0 0 963.393 0 0 0 0 -654.698 0 0 134.358 0 0 340.663 -1937.54 0 0 0 0 2013.23 0 0 0 0 0 2006.97 -1556.37 0 0 0 0 0 0 0 0 0 0 
0 0 0 0 2351.37 0 0 0 0 0 0 0 0 0 0 0 0 0 0 0 0 0 0 0 0 0 0 0 0 0 -1302.3 0 2227.32 0 0 0 0 0 0 2215.72 0 0 0 0 0 0 -971.786 0 0 0 0 0 -1850.72 0 0 0 0 0 0 0 1053.73 0 -1365.93 0 0 0 0 
0 0 614.872 0 0 2095.78 0 0 0 2204.89 0 0 0 0 -2454.07 -92.3948 0 0 1132.92 -2273.86 0 0 0 0 0 1703.62 0 0 0 0.07 0 0 -1751.84 2018.42 0 0 0 0 0 2088.61 0 0 0 -1994.16 0 0 0 0 0 0 0 0 0 0 0 0 0 0 0 0 0 0 0 0 -2230.06 0 0 
1845.84 0 0 0 0 107.349 0 0 0 0 0 1597.26 -565.737 0 0 0 0 0 0 604.801 -53.4837 0 0 0 0 0 0 0 -189.291 0 0.04 0 0 0 0 0 0 0 0 0 0 363.247 0 0 2294.15 0 0 0 0 0 0 -1198.69 0 0 0 0 0 0 0 0 0 0 0 0 0 0 0 
0 0 0 574.892 0 2111.65 0 0 0 0 0 0 0 0 0 0 0 0 0 0 0 0 0 0 1370.51 0 0 0 0 0 0 0.09 0 0 0 0 2236.78 0 0 0 0 0 0 0 -171.59 -393.155 1140.1 0 0 0 200.888 0 0 0 0 0 0 0 0 593.509 0 750.832 0 0 0 0 -2499.08 
0 0 0 0 0 0 0 0 0 0 0 0 1124.53 0 0 0 0 1466.19 0 2169.79 0 0 0 0 0 0 0 1229.51 -640.812 -2189.17 0 0 0.03 0 -815.989 -1390.35 795.999 0 0 0 0 0 0 0 0 0 0 0 0 0 0 0 0 0 1269.95 0 0 0 0 0 0 -219.81 0 1428.5 0 0 0 
1396.15 1749.7 0 0 0 0 0 612.735 -639.744 0 1371.27 0 0 0 0 1678.9 1625.95 0 0 0 0 0 0 0 0 0 -1741.16 0 0 1006.42 0 0 0 0.07 0 0 0 0 0 0 0 0 0 0 0 0 0 0 0 0 0 0 0 0 0 0 0 1284.91 0 0 0 0 0 -824.229 0 995.59 0 
0 0 0 0 0 0 0 0 0 0 0 0 0 0 0 0 0 0 864.208 0 0 0 74.6941 0 0 626.621 0 0 0 0 0 0 -1590.7 0 0.06 0 1838.36 0 -446.104 0 0 0 0 0 0 1866.89 0 0 0 0 0 0 0 2225.18 0 0 0 2191.92 0 0 0 0 0 0 0 -954.085 0 
0 0 0 0 0 0 0 0 0 0 0 0 0 0 0 0 0 0 0 0 0 0 0 0 0 0 0 0 0 0 0 0 1043.5 0 0 0.04 0 0 0 0 0 0 0 0 0 0 0 0 0 0 1508.76 0 0 0 0 0 0 0 0 0 2408.14 0 -2248.99 -493.866 0 -2109.36 0 
0 0 0 0 0 0 0 0 1354.64 0 0 0 0 0 0 0 1838.97 0 0 528.809 0 0 0 0 -1533.02 0 0 0 0 0 0 -307.55 1682.1 0 -760.14 0 0.09 0 0 0 0 -1337.24 0 0 0 0 -2032.61 0 0 0 0 0 1064.26 0 0 0 0 0 0 0 0 0 0 0 0 0 0 
0 0 0 0 0 0 0 -1460.69 0 0 0 0 0 0 0 0 0 0 1363.95 0 0 0 0 0 -2147.51 0 0 817.667 0 0 0 0 0 0 0 0 0 0.01 906.323 0 0 0 0 0 0 0 0 0 0 1608.55 -1061.97 0 0 0 0 0 0 0 0 725.196 1941.97 0 0 0 -1044.57 0 0 
0 0 1869.03 0 0 0 -2235.71 0 0 113.3 0 1244.16 0 0 409.787 0 2045.58 0 0 0 0 0 0 0 0 0 0 0 0 0 0 0 0 0 1532.41 0 0 624.027 0.01 0 218.436 0 0 0 0 0 0 0 0 0 0 0 0 0 0 0 0 0 0 0 0 -313.196 0 0 0 0 0 
-187.46 0 0 0 0 0 0 0 0 0 0 445.036 2448.12 0 0 0 0 0 0 0 0 0 0 0 0 0 0 0 -2172.54 1032.67 0 0 0 0 0 0 0 0 0 0.01 1806.16 0 0 0 0 0 0 0 1975.23 0 0 0 0 0 0 0 0 0 -2244.87 0 0 0 0 0 0 0 0 
0 0 0 0 0 0 1099.05 -939.741 0 0 1172.75 0 2466.89 0 0 0 0 0 0 -1316.03 -15.7933 0 0 1191.37 0 0 0 -1821.73 0 0 0 0 0 0 0 0 0 0 2289.73 1999.19 0.09 0 0 2097.16 42.6496 0 0 0 0 0 0 0 0 0 0 0 0 0 -1275.75 0 -1968.21 0 1674.63 0 0 0 0 
0 0 0 0 -288.934 0 0 0 0 0 0 0 0 0 0 0 0 0 0 0 0 0 0 0 0 0 0 0 0 0 1854.38 0 0 0 0 0 -1468.78 0 0 0 0 0.07 0 1945.78 0 0 0 0 0 0 0 0 0 0 0 0 0 0 0 0 -1419.49 0 0 0 0 0 1945.78 
0 0 0 0 0 0 0 0 0 0 0 0 0 0 -1342.13 0 0 2376.25 0 -223.472 0 0 0 0 0 0 0 0 0 0 0 0 0 0 0 0 0 0 0 0 0 0 0.07 0 0 0 0 0 0 0 -1758.1 0 0 0 1070.51 -18.3874 0 0 0 0 0 0 1881.24 0 0 0 0 
0 0 0 0 0 0 0 0 0 0 0 1416.14 0 0 0 0 0 0 0 0 0 0 0 0 0 0 0 1996.75 0 -130.543 0 0 0 0 0 0 0 0 0 0 1272.7 -1954.33 0 0.07 1659.98 0 0 0 0 0 2124.32 0 0 0 0 0 0 -2427.21 0 0 0 78.9666 0 0 0 0 0 
0 1026.41 -1224.63 0 2110.13 -1480.99 0 0 0 0 831.706 0 0 1056.02 1508.15 0 0 -1313.14 0 0 0 0 0 0 0 0 0 913.343 0 0 -558.565 1603.82 0 0 0 0 0 0 0 0 1682.1 0 0 867.26 0.05 0 0 2319.33 0 0 0 0 0 0 0 0 0 -1711.4 0 0 0 2004.07 0 0 0 0 0 
0 0 2078.39 0 0 2278.13 -339.747 0 0 0 0 0 0 -800.882 0 0 0 0 2044.51 0 0 0 0 0 0 0 0 0 0 0 0 -2207.94 0 0 824.992 0 0 0 0 0 0 0 0 0 0 0.01 0 0 0 0 0 1141.47 0 0 0 0 745.949 0 0 0 0 2305.29 0 0 0 0 0 
0 0 -906.476 0 0 0 -1459.93 0 0 0 0 0 0 0 0 0 0 0 -272.149 0 0 0 0 0 0 0 0 0 2405.55 0 0 -2225.49 0 0 0 0 298.09 0 0 0 0 0 0 0 0 0 0 0 26.1696 0 0 0 0 0 912.275 0 0 0 0 1721.93 0 0 0 0 2450.87 0 0 
-32.5785 888.928 0 -1288.11 0 0 0 1271.17 0 0 0 0 0 0 0 0 0 0 0 0 0 0 -322.504 0 0 0 383.389 0 0 0 0 0 0 0 0 0 0 0 0 0 0 0 0 0 371.029 0 0 0.08 0 0 -318.384 0 0 567.415 0 0 0 0 0 0 0 0 0 -947.523 0 0 0 
0 -2373.5 0 0 0 0 0 0 0 0 0 0 0 -2126 0 0 0 0 -744.575 0 0 1223.87 0 0 0 0 0 0 0 0 0 0 0 0 0 0 0 0 0 181.814 0 0 0 0 0 0 -1320.15 0 0.01 0 0 1450.01 0 0 1570.71 0 0 0 1401.33 0 0 0 0 0 0 0 0 
0 0 0 0 0 0 0 0 0 1017.87 0 0 0 0 0 0 0 -2307.89 0 0 0 0 0 0 0 0 0 1924.27 0 0 0 0 0 0 0 0 0 1844.31 0 0 0 0 0 0 0 0 0 0 0 0.07 0 0 697.424 0 0 0 1995.07 0 0 0 0 0 546.358 0 0 0 0 
0 0 0 0 0 0 1951.12 0 0 0 0 0 0 0 0 2012.31 0 0 0 0 0 0 0 0 0 0 0 0 0 0 0 171.285 0 0 0 -1869.95 0 1199 0 0 0 0 1804.03 1021.38 0 0 0 891.675 0 0 0 0 0 0 0 0 0 0 0 -1686.07 0 0 0 0 0 0 1465.42 
0 0 0 0 0 0 0 0 0 0 1197.16 0 0 0 0 0 0 0 -2453.46 2012.01 0 0 0 0 0 0 0 0 0 0 2055.8 0 0 0 0 0 0 0 0 0 0 0 0 0 0 1079.67 0 0 -1880.32 0 0 0 0 0 -1737.95 0 0 0 0 0 0 0 0 0 0 0 0 
0 0 2386.62 0 0 0 0 0 0 0 0 0 0 0 0 0 0 0 0 1659.98 0 0 0 0 0 0 0 0 -1391.57 0 0 0 0 0 0 0 -2207.48 0 0 0 0 0 0 0 0 0 0 0 0 407.346 0 0 0.01 0 0 0 0 0 0 0 0 0 0 0 0 0 0 
0 0 0 0 0 0 0 2045.88 0 0 0 -649.51 0 0 0 0 0 0 0 0 0 0 0 0 0 0 0 0 0 0 0 0 0 0 1386.84 0 0 0 0 0 0 0 0 0 0 0 0 -1745.58 0 0 0 0 0 0.02 0 0 0 0 -593.661 0 0 0 0 0 0 0 0 
0 0 0 0 0 0 0 0 0 0 0 0 0 0 0 0 0 0 0 2129.81 92.3948 0 0 0 0 0 0 0 0 0 0 0 -1375.39 0 0 0 0 0 0 0 0 0 458.77 0 0 0 1962.72 0 2270.2 0 0 606.021 0 0 0.06 -1436.12 0 0 0 0 0 0 -1350.37 0 0 0 -1605.04 
0 0 0 -71.9474 0 0 0 0 0 0 0 0 0 0 0 2200.16 0 0 0 0 0 0 0 0 0 1497.92 1802.5 -2077.78 0 0 0 0 0 0 0 0 0 0 0 0 0 0 2494.35 0 0 0 0 0 0 0 0 0 0 0 768.075 0.03 0 0 0 0 0 0 0 0 1152.91 0 -853.679 
0 0 0 0 0 0 0 0 -687.048 0 0 0 0 1934.8 0 0 0 0 0 0 0 0 0 -683.538 0 0 0 1238.82 0 0 0 0 0 0 0 0 0 0 0 0 0 0 0 0 0 -763.344 0 0 0 2028.34 0 0 0 0 0 0 0.01 0 0 0 2043.14 0 1764.05 0 0 0 0 
0 0 0 0 -1842.17 0 0 2253.11 0 0 0 0 0 0 0 0 0 -1779.15 0 0 0 0 0 0 0 0 0 0 0 0 0 0 0 2176.05 -1315.58 0 0 0 0 0 0 0 0 520.875 601.901 0 0 0 0 0 0 0 0 0 0 0 0 0.02 1255.91 734.657 0 0 0 0 0 0 0 
0 0 0 0 0 0 1137.2 0 0 0 0 0 0 0 0 0 0 0 0 0 0 0 0 0 0 0 0 0 0 0 0 0 0 0 0 0 0 0 0 1274.07 -270.928 0 0 0 0 0 0 0 1995.22 0 0 0 0 1299.4 0 0 0 716.956 0.03 0 2494.51 286.798 0 0 0 0 -20.6763 
0 0 0 868.328 0 1175.8 0 0 0 0 0 -2467.8 0 0 0 0 0 0 0 1690.34 0 0 0 0 0 0 0 0 0 0 0 2085.56 0 0 0 0 0 -2212.52 0 0 0 0 0 0 0 0 1874.68 0 0 0 -90.8689 0 0 0 0 0 0 1693.55 0 0.09 0 0 0 0 0 0 0 
0 0 0 0 0 0 0 0 0 1364.56 0 0 0 0 0 0 225.15 0 0 0 0 0 0 0 0 0 0 0 -1016.34 0 0 0 0 0 0 1115.53 0 449.461 0 0 2298.58 503.327 0 0 0 0 0 0 0 0 0 0 0 0 0 0 -1310.39 0 -807.596 0 0.08 0 0 0 0 0 0 
0 0 -130.085 0 0 0 0 0 757.698 0 0 0 0 0 -1216.54 0 0 1786.17 0 0 0 0 0 0 0 0 0 0 0 0 0 1325.95 1013.29 0 0 0 0 0 -1866.59 0 0 0 0 1469.08 975.6 -2333.83 0 0 0 0 0 0 0 0 0 0 0 0 -1056.93 0 0 0.05 0 0 0 0 0 
0 0 0 1604.13 0 0 0 0 0 0 0 0 0 0 0 0 0 0 0 0 0 0 0 0 2117.6 0 0 0 2295.68 0 0 0 0 0 0 -2107.99 0 0 0 0 871.838 0 1023.51 0 0 0 0 0 0 1276.67 0 0 0 0 2172.69 0 104.45 0 0 0 0 0 0.08 0 0 0 0 
0 2263.79 0 2112.57 0 0 0 0 0 0 0 0 0 0 -676.977 0 0 0 0 0 0 0 0 0 0 0 0 0 0 0 0 0 1202.05 1369.9 0 -1588.87 0 0 0 0 0 0 0 0 0 0 0 2449.19 0 0 0 0 0 0 0 0 0 0 0 0 0 0 0 0.04 0 -1165.73 0 
0 0 872.295 0 0 0 0 0 0 0 -1689.43 0 0 0 0 0 0 1388.06 0 0 0 0 0 0 0 0 0 0 0 -1506.62 0 0 0 0 0 0 0 1546.45 0 0 0 0 0 0 0 0 765.481 0 0 0 0 0 0 0 0 -704.901 0 0 0 0 0 0 0 0 0.06 0 0 
1658.76 0 2026.05 0 0 0 0 0 0 0 0 0 0 0 0 0 0 0 0 0 0 1867.66 0 0 0 0 0 0 0 0 0 0 0 -379.269 -192.801 2274.32 0 0 0 0 0 0 0 0 0 0 0 0 0 0 0 0 0 0 0 0 0 0 0 0 0 0 0 -2050.77 0 0.04 0 
0 0 0 0 0 0 1944.56 0 0 0 0 0 0 0 0 0 -1914.96 0 0 0 0 0 0 0 0 0 0 0 0 0 0 1985.15 0 0 0 0 0 0 0 0 0 -261.162 0 0 0 0 0 0 0 0 2409.82 0 0 0 -1114 -111.011 0 0 358.821 0 0 0 0 0 0 0 0.05 
