*Vertices 47
*Matrix 
0.01 0 0 0 0 0 0 0 0 0 0 0 0 0 0 -1195.79 0 0 0 0 0 0 0 0 0 0 2284.84 2409.05 0 -844.523 0 0 0 0 2457.73 0 0 0 0 0 0 0 0 0 0 0 -2231.44 
0 0.06 0 0 0 0 0 0 0 0 0 0 0 2149.19 0 0 0 0 0 0 0 0 0 0 0 0 17.9296 0 0 0 0 1540.04 0 1396.45 0 0 0 1702.09 1562.78 0 0 0 0 0 -1214.71 0 0 
0 0 0.08 0 2106.31 0 -533.998 0 2275.69 0 0 0 0 0 0 0 -1916.03 1698.74 0 0 0 0 0 0 0 0 0 0 0 -1439.33 0 0 0 0 0 0 0 0 0 -1280.33 0 0 0 0 0 0 0 
0 0 0 0.07 0 0 0 0 0 0 1795.79 0 0 -1704.23 575.503 0 0 0 0 0 0 0 0 0 0 0 0 0 0 0 0 0 0 0 0 0 0 0 0 0 0 739.387 617.161 0 0 0 0 
0 0 154.347 0 0 2299.49 0 0 0 0 0 0 0 -1288.42 0 0 0 0 0 0 0 0 0 -1812.42 0 0 0 -988.113 0 0 1933.73 0 0 0 0 0 0 0 0 2402.65 0 0 -1605.35 0 0 1689.89 0 
0 0 0 0 1251.49 0.01 0 0 0 0 0 0 0 -900.525 0 0 0 0 0 0 0 0 0 0 0 0 0 0 0 0 0 0 0 0 0 0 0 0 0 0 0 0 -244.987 0 0 0 0 
0 0 -1635.56 0 0 0 0.08 1173.97 0 2261.35 0 0 0 0 0 0 0 0 0 0 0 0 0 0 0 0 0 0 0 0 0 0 2257.07 0 1821.27 0 0 2436.83 0 0 0 0 0 0 0 712.531 0 
0 0 0 0 0 0 -132.679 0.02 0 0 0 0 1955.4 0 0 0 0 0 0 0 1436.89 0 0 0 0 0 0 0 0 0 2399.59 0 0 2280.72 1289.64 0 0 0 0 0 0 0 0 1274.22 0 0 0 
0 0 1346.71 0 0 0 0 0 0.06 0 0 0 -740.15 0 0 0 0 0 0 210.807 0 0 0 0 0 0 2464.75 0 0 262.535 0 0 0 0 2318.57 0 0 0 0 0 0 1588.72 0 0 0 0 0 
0 0 0 0 0 0 1273.92 0 0 0.03 0 0 0 0 0 0 0 0 0 0 0 0 0 0 0 0 0 2369.99 0 0 0 0 0 0 1326.26 0 0 0 2314.75 0 0 2030.47 -1834.24 0 0 0 0 
0 0 0 173.574 0 0 0 0 0 0 0.04 0 0 0 929.67 0 0 0 0 0 0 0 0 736.183 0 0 0 0 2144.31 0 0 0 0 0 0 0 0 0 0 1388.36 0 0 0 0 0 0 0 
0 0 0 0 0 0 0 0 0 0 0 0.06 0 0 0 0 0 0 0 0 0 0 0 0 0 0 1874.98 0 0 1927.63 0 0 0 0 0 0 0 0 0 0 0 0 2242.12 0 0 0 0 
0 0 0 0 0 0 0 412.687 -358.516 0 0 0 0.09 0 0 0 0 0 0 0 1311.15 0 0 1362.12 2397.46 0 0 0 0 -1316.03 0 0 0 2204.43 0 0 1787.09 0 0 0 0 0 0 0 0 0 0 
0 1619.54 0 287.561 140.004 1826.15 0 0 0 0 0 0 0 0.01 0 0 0 0 0 -1478.09 -135.121 0 2008.35 0 0 0 0 0 0 0 323.878 0 0 0 0 0 0 0 0 0 0 611.667 0 0 0 -804.392 0 
0 0 0 36.8511 0 0 0 0 0 0 2011.55 0 0 0 0.01 0 0 0 0 0 0 0 0 0 2429.2 0 0 0 0 0 1026.26 0 0 0 0 0 0 0 0 0 0 0 0 0 0 0 0 
-815.683 0 0 0 0 0 0 0 0 0 0 0 0 0 0 0.05 0 0 0 0 0 0 0 0 0 993.301 0 0 0 0 0 0 0 0 0 0 0 0 0 1659.06 0 0 0 1362.88 0 0 0 
0 0 1012.38 0 0 0 0 0 0 0 0 0 0 0 0 0 0.08 0 13.5044 0 0 1848.43 0 0 0 0 0 0 0 0 0 0 0 443.663 0 0 0 0 0 0 0 0 0 1058.76 0 0 0 
0 0 1353.11 0 0 0 0 0 0 0 0 0 0 0 0 0 0 0.06 0 1352.81 0 0 0 0 0 0 0 0 0 0 0 0 0 0 0 0 0 0 0 0 2079.3 0 0 0 -1383.48 1479.16 0 
0 0 0 0 0 0 0 0 0 0 0 0 0 0 0 0 -1697.21 0 0.09 0 0 0 0 0 0 0 0 0 0 0 0 190.512 1180.99 0 -1928.39 -1061.2 0 0 0 2371.21 0 0 0 1110.34 0 0 0 
0 0 0 0 0 0 0 0 102.313 0 0 0 0 756.935 0 0 0 -117.115 0 0.04 0 0 0 0 0 0 1744.97 0 310.144 0 0 0 0 0 0 609.073 2147.36 0 0 0 0 0 1498.99 0 0 0 0 
0 0 0 0 0 0 0 1998.89 0 0 0 0 1843.85 -32.1207 0 0 0 0 0 0 0.02 0 0 0 0 0 0 0 0 0 0 -2168.87 0 -1683.32 2319.94 0 0 0 0 0 -2187.03 -309.687 0 0 0 0 0 
0 0 0 0 0 0 0 0 0 0 0 0 0 0 0 0 628.147 0 0 0 0 0.05 0 0 0 0 -1931.75 1442.84 0 1214.56 0 0 0 0 0 0 0 0 0 0 0 0 0 0 0 0 0 
0 0 0 0 0 0 0 0 0 0 0 0 0 420.469 0 0 0 0 0 0 0 0 0.06 0 0 0 0 0 0 0 -907.392 0 1410.95 0 -2301.78 0 0 0 0 0 0 0 0 0 1843.7 1417.51 0 
0 0 0 0 2255.09 0 0 0 0 0 1824.02 0 2156.06 0 0 0 0 0 0 0 0 0 0 0.05 0 0 0 2274.93 0 0 0 0 0 0 -2373.81 0 0 1898.94 0 0 0 0 0 0 0 0 0 
0 0 0 0 0 0 0 0 0 0 0 0 2406.61 0 2492.52 0 0 0 0 0 0 0 0 0 0.09 0 2388.76 0 0 0 0 0 0 0 0 0 0 0 2156.51 0 0 0 0 0 0 0 1259.12 
0 0 0 0 0 0 0 0 0 0 0 0 0 0 0 1056.93 0 0 0 0 0 0 0 0 0 0.06 0 0 2222.43 0 0 0 0 0 0 0 0 0 0 1439.33 0 0 0 860.393 0 0 0 
2462.77 972.854 0 0 0 0 0 0 -424.741 0 0 -682.012 0 0 0 0 0 0 0 -220.573 0 1601.69 0 0 63.097 0 0.04 -940.504 1581.7 2134.69 -720.313 0 0 0 242.088 0 0 0 0 0 0 -771.432 0 0 0 1367.15 0 
-194.632 0 0 0 2200.46 0 0 0 0 -1614.96 0 0 0 0 0 0 0 0 0 0 0 1179.16 0 -723.212 0 0 864.208 0.07 0 0 0 0 1252.25 0 0 0 0 0 2370.75 0 0 2077.47 0 0 0 0 0 
0 0 0 0 0 0 0 0 0 0 -147.786 0 0 0 0 0 0 0 0 -1968.06 0 0 0 0 0 1437.19 -1666.39 0 0.01 0 0 0 0 0 0 0 0 0 1572.7 0 0 0 0 2050.61 0 0 0 
-2215.26 0 -832.621 0 0 0 0 0 398.19 0 0 -192.038 -2343.13 0 0 0 0 0 0 0 0 2117.3 0 0 0 0 1456.27 0 0 0.02 0 0 0 1570.86 0 0 0 0 2222.28 0 0 0 0 0 0 0 0 
0 0 0 0 -182.577 0 0 -867.565 0 0 0 0 0 1619.85 -1986.37 0 0 0 0 0 0 0 -301.294 0 0 0 2179.4 0 0 0 0 0 846.66 0 0 0 0 0 0 0 0 0 0 0 0 0 0 
0 53.7889 0 0 0 0 0 0 0 0 0 0 0 0 0 0 0 0 1225.7 0 2304.99 0 0 0 0 0 0 0 0 0 0 0.09 0 0 0 0 0 0 0 1854.99 0 0 42.6496 0 0 0 0 
0 0 0 0 0 0 -629.215 0 0 0 0 0 0 0 0 0 0 0 483.337 0 0 0 -632.42 0 0 0 0 -841.624 0 0 2392.12 0 0 0 1354.79 0 0 0 -2125.54 0 0 0 0 0 595.645 0 0 
0 -327.693 0 0 0 0 0 -245.903 0 0 0 0 2480.32 0 0 0 -1365.17 0 0 0 -379.879 0 0 0 0 0 0 0 0 632.115 0 0 0 0.09 0 0 0 0 0 0 0 0 0 0 0 2047.11 0 
-1788.92 0 0 0 0 0 -183.798 2428.74 -1048.23 -1218.99 0 0 0 0 0 0 0 0 892.438 0 -1277.43 0 1138.42 1490.91 0 0 -74.0837 0 0 0 0 0 1329.16 0 0.01 2287.29 -370.418 0 0 0 0 0 0 0 0 1336.02 0 
0 0 0 0 0 0 0 0 0 0 0 0 0 0 0 0 0 0 -439.238 510.956 0 0 0 0 0 0 0 0 0 0 0 0 0 0 2486.57 0 968.581 0 0 0 -1313.9 0 1373.87 0 219.199 0 0 
0 0 0 0 0 0 0 0 0 0 0 0 -1978.9 0 0 0 0 0 0 -123.981 0 0 0 0 0 0 0 0 0 0 0 0 0 0 2343.29 -90.5637 0.06 0 0 0 0 0 0 0 0 0 0 
0 2126.61 0 0 0 0 -488.525 0 0 0 0 0 0 0 0 0 0 0 0 0 0 0 0 1918.78 0 0 0 0 0 0 0 0 0 0 0 0 0 0 0 0 0 616.398 0 0 1933.88 0 0 
0 1337.09 0 0 0 0 0 0 0 2327.72 0 0 0 0 0 0 0 0 0 0 0 0 0 0 1456.11 0 0 1776.71 2397 941.115 0 0 -1006.42 0 0 0 0 0 0.05 0 0 0 0 0 0 0 0 
0 0 1190.45 0 1730.93 0 0 0 0 0 2264.09 0 0 0 0 412.839 0 0 -674.535 0 0 0 0 0 0 -2000.41 0 0 0 0 0 152.364 0 0 0 0 0 0 0 0.01 165.639 0 -767.464 0 0 -1449.1 0 
0 0 0 0 0 0 0 0 0 0 0 0 0 0 0 0 0 1868.88 0 0 -322.352 0 0 0 0 0 0 0 0 0 0 0 0 0 0 -1309.47 0 0 0 736.488 0.03 0 0 0 0 0 0 
0 0 0 -2353.21 0 0 0 0 1834.7 2054.58 0 0 0 1811.66 0 0 0 0 0 0 -2429.35 0 0 0 0 0 2025.13 1492.89 0 0 0 0 0 0 0 0 0 2216.79 0 0 0 0.04 0 0 0 0 0 
0 0 0 969.955 747.627 1375.24 0 0 0 345.698 0 1386.68 0 0 0 0 0 0 0 36.0881 0 0 0 0 0 0 0 0 0 0 0 -832.011 0 0 0 331.812 0 0 0 -1189.38 0 0 0.05 352.412 0 0 0 
0 0 0 0 0 0 0 963.546 0 0 0 0 0 0 0 690.1 1969.59 0 1034.35 0 0 0 0 0 0 -1974.78 0 0 1639.68 0 0 0 0 0 0 0 0 0 0 0 0 0 -1299.25 0.06 0 0 0 
0 -722.755 0 0 0 0 0 0 0 0 0 0 0 0 0 0 0 -557.039 0 0 0 0 -1103.47 0 0 0 0 0 0 0 0 0 1699.8 0 0 1931.9 0 -343.867 0 0 0 0 0 0 0.01 0 0 
0 0 0 0 -1538.82 0 1889.93 0 0 0 0 0 0 1096.76 0 0 0 -782.571 0 0 0 0 1952.65 0 0 0 1561.86 0 0 0 0 0 0 -299.005 2451.78 0 0 0 0 2275.38 0 0 0 0 0 0 0 
336.543 0 0 0 0 0 0 0 0 0 0 0 0 0 0 0 0 0 0 0 0 0 0 0 833.842 0 0 0 0 0 0 0 0 0 0 0 0 0 0 0 0 0 0 0 0 0 0.04 
