*Vertices 62
*Matrix 
0.05 0 0 0 0 0 -719.703 -1601.99 0 0 0 -1243.55 0 -1720.25 -355.312 0 0 -706.732 38.9874 2254.63 0 0 2438.51 0 0 0 0 1177.63 0 0 0 0 1033.74 1953.87 0 0 0 -1394.16 0 -1454.59 0 0 0 0 0 0 0 0 0 1307.79 515.992 -1438.11 0 0 0 0 0 0 986.129 0 0 0 
0 0.01 0 0 0 -1932.05 0 929.06 0 0 0 0 0 0 0 2196.49 0 0 0 0 0 557.192 2374.57 2195.12 2021.16 0 2480.93 0 0 0 0 -2209.01 0 0 0 -50.1267 0 0 0 0 0 0 0 0 1325.19 0 0 0 0 -2411.5 0 -2384.18 0 -1193.96 0 0 1537.14 -830.485 0 -2256 0 0 
0 0 0.06 0 0 0 0 0 0 1898.33 0 0 0 -1053.12 0 365.078 0 0 0 225.303 0 -1075.7 0 0 0 0 0 0 215.079 0 0 0 0 0 0 0 0 2053.67 0 0 1110.64 0 0 0 0 0 0 0 636.845 0 699.713 0 0 -1537.9 0 0 896.405 0 725.806 0 0 0 
0 0 0 0.05 0 0 0 0 -2013.69 0 0 -926.771 0 0 0 1815.01 0 0 0 179.983 0 -1029.47 110.401 0 0 0 0 0 1998.58 0 -1189.23 0 0 0 0 -888.928 2344.97 0 0 -647.679 0 0 0 0 0 0 0 14.1148 0 0 1461.15 0 -436.491 0 0 0 0 0 0 0 0 0 
0 0 0 0 0.08 0 0 0 963.393 0 0 0 570.009 0 0 0 0 0 0 0 1521.27 0 0 0 0 0 0 0 0 -1087.76 0 0 0 0 0 -2489.17 0 0 0 0 0 281.152 0 0 1858.35 -1148.79 0 0 2351.53 0 0 0 0 0 -414.212 0 0 0 2303.46 0 0 0 
0 -1728.49 0 0 0 0.04 0 -256.737 0 0 0 0 0 1236.84 0 0 0 2427.98 0 0 -674.688 0 0 0 0 0 0 -352.26 0 0 0 0 1710.64 0 1584.9 0 0 2116.84 0 0 -1447.57 2249.75 1833.63 1337.7 1027.48 0 0 0 0 0 -745.186 0 0 0 0 0 0 0 -2270.96 0 0 0 
1739.48 0 0 0 0 0 0.06 0 0 0 31.3578 0 -284.509 0 0 0 0 0 0 0 0 0 1175.04 0 0 177.694 0 0 0 0 0 1985.92 0 2013.38 0 0 0 2041.76 0 0 0 0 0 2144.46 0 0 0 0 0 0 0 395.138 0 0 0 0 -1040.6 1029.77 0 0 0 0 
431.913 -2090.59 0 0 0 -324.183 0 0.03 0 0 148.244 0 0 0 0 0 0 0 2327.72 0 0 1168.94 0 2490.84 0 0 -2365.87 -1301.84 0 0 -1283.84 0 0 0 0 0 0 1569.19 0 0 0 0 0 0 0 0 0 0 0 0 -623.722 0 2306.51 2243.49 0 0 2393.95 0 0 0 0 0 
0 0 0 1808.3 381.252 0 0 0 0.07 0 0 0 0 -834.605 0 1103.78 0 -2392.73 0 0 786.081 0 0 0 2205.04 -1319.09 0 0 0 0 0 0 0 0 1785.71 0 0 0 0 -1314.66 0 0 0 0 1242.79 469.909 0 0 0 0 0 0 0 -890.606 0 -602.359 0 0 0 0 -1827.37 0 
0 0 -1571.93 0 0 0 0 0 0 0.08 0 1917.4 0 873.821 0 0 0 -795.541 -2000.26 0 2295.83 0 0 -1426.21 96.3622 0 0 -2232.2 -732.063 1987.44 0 0 2073.35 0 1264 930.433 0 0 0 0 0 0 182.424 0 0 0 0 0 1385.77 0 0 0 -478.759 0 0 0 0 0 0 0 0 2147.05 
0 0 0 0 0 0 2166.89 -2432.25 0 0 0.05 0 0 0 -1166.19 0 0 2216.94 -318.842 0 -124.439 0 787.149 0 1045.79 -1712.62 0 0 0 0 0 1707.89 0 1189.38 25.7118 0 0 0 -574.435 0 -1946.55 0 0 -882.366 -2124.62 0 2190.39 -1505.4 0 0 -264.519 1359.68 0 0 855.358 0 0 0 0 0 0 0 
1982.41 0 0 -829.264 0 0 0 0 0 641.728 0 0.03 0 0 425.199 0 0 -1590.7 0 0 0 0 0 0 -150.685 0 0 577.944 0 -991.623 0 0 0 0 0 0 0 0 -1111.1 0 0 0 2165.21 0 -759.682 0 0 0 0 1541.87 0 0 0 552.614 0 1664.56 0 0 0 0 0 0 
0 0 0 0 1797.92 0 1527.22 0 0 0 0 0 0.07 0 0 1906.57 0 -2054.89 0 0 1786.17 0 0 -499.969 0 2163.99 2135.3 0 0 0 2143.24 218.741 913.648 -455.87 0 0 -1573.31 265.893 0 0 0 0 0 0 -518.738 1886.43 0 0 0 0 0 0 0 0 114.673 0 0 744.27 0 0 1787.39 0 
-987.503 0 197.836 0 0 2130.57 0 0 -149.007 -1944.26 0 0 0 0.05 0 0 0 0 0 564.058 0 0 702.002 -87.2066 0 0 0 631.809 0 0 0 0 0 0 1000.93 0 0 0 0 1618.47 2154.68 0 0 0 0 899.762 0 0 0 0 0 -132.374 0 0 -85.3755 -1392.48 0 0 0 0 0 0 
2130.27 0 0 0 0 0 0 0 0 0 1275.44 886.792 0 0 0.08 0 1935.87 -1784.04 0 0 0 0 0 0 0 0 0 1564.76 0 0 0 -1105.46 0 0 0 0 -175.253 0 0 0 0 0 0 0 0 0 0 0 1292.54 0 0 0 0 0 0 0 0 0 0 0 0 0 
0 -1490.3 739.998 1693.7 0 0 0 0 -1624.58 0 0 0 2364.19 0 0 0.01 -310.144 0 0 2061.14 0 -1412.78 -88.7326 0 0 0 0 0 0 0 0 0 0 0 0 0 0 0 0 0 0 1166.19 0 2168.42 0 0 0 0 0 0 -479.827 0 1493.96 0 523.164 0 -1598.03 0 2346.34 0 0 0 
0 0 0 0 0 0 0 0 0 0 0 0 0 0 1745.73 1098.28 0.05 1221.12 0 0 0 0 0 0 0 0 0 1164.97 0 0 0 0 0 0 0 0 0 2324.67 0 0 0 -1603.82 0 0 0 0 0 0 99.2615 0 0 0 1163.9 -2088.76 0 0 2465.06 -670.263 2185.05 0 -2237.85 0 
2411.95 0 0 0 0 1534.24 0 0 -580.538 -2153 -2382.5 -2181.23 1545.84 0 1402.55 0 2288.2 0.04 0 0 0 0 0 0 0 0 0 0 0 0 -172.658 0 443.663 2270.65 0 0 2011.7 -1573.15 0 0 0 0 0 1144.37 -1049.76 0 0 0 0 2227.32 -1038.16 0 1767.4 0 0 0 -2489.78 364.772 -298.395 -2344.36 0 0 
-2454.83 0 0 0 0 0 0 2140.8 0 1686.68 -1655.71 0 0 0 0 0 0 0 0.08 0 2452.54 1750.92 0 0 0 -598.849 1163.75 0 0 0 1940.6 0 0 470.214 0 0 903.882 0 0 0 0 0 0 -91.6318 0 2459.41 0 0 459.685 0 0 0 0 2285.91 0 0 0 -1043.81 1764.81 -1454.13 -1668.68 836.589 
1751.53 0 2372.89 1788.92 0 0 0 0 0 0 0 0 0 1842.33 0 1533.17 0 0 0 0 0 0 737.861 0 0 0 0 -893.963 0 74.2363 0 -529.267 0 0 0 0 -98.4985 1500.67 0 0 0 1140.86 -76.3726 1835.76 0 0 0 0 0 0 0 1893.6 -1279.87 0 0 0 0 680.334 2478.18 0 0 0 
0 0 0 0 2090.9 -1793.04 0 0 -124.744 1040.3 91.174 0 1731.39 0 0 0 0 0 -2349.85 0 0.01 0 0 1117.97 0 1605.66 1757.03 0 0 0 0 0 0 0 0 0 0 0 0 0 -1535.31 1187.09 0 667.974 0 0 2489.93 0 -1449.1 1992.48 0 203.787 0 0 0 1477.48 0 0 0 0 0 1148.34 
0 -1366.7 2406.16 1722.39 0 0 0 -306.787 0 0 0 0 0 0 0 -2450.56 0 0 505.463 0 0 0.07 0 0 2401.27 0 0 0 0 606.479 0 0 0 -2010.33 -1481.14 1762.37 -1348.08 0 0 0 0 0 -2113.33 1696.75 0 0 0 0 0 2434.84 0 0 0 -55.0096 0 -103.992 0 0 0 -612.583 391.476 0 
-910.596 -1466.34 0 764.412 0 0 -1943.04 0 0 0 1598.64 0 0 755.257 0 755.409 0 0 0 300.684 0 0 0 1766.64 0 0 0 -101.093 0 -40.2081 0 0 -1518.98 0 1022.14 1877.88 -1071.89 0 0 76.0674 0 1165.88 2459.87 0 0 313.349 0 0 0 2325.28 0 1678.29 0 991.012 -1497.16 0 0 666.601 0 0 0 0 
0 -1279.11 0 0 0 0 0 602.054 0 2113.03 0 0 -625.248 -1207.24 0 0 0 0 0 0 1204.34 0 2372.28 0.06 0 0 0 0 0 1818.67 -1193.2 1647.31 0 0 0 1251.18 0 -308.466 0 0 0 626.164 551.393 309.076 0 821.024 1378.44 0 0 0 0 0 0 0 0 0 -472.045 0 0 0 0 0 
0 2449.34 0 0 0 0 0 0 2191 -2422.48 395.749 604.953 0 0 0 0 0 0 0 0 0 -1814.55 0 0 0.02 4.80667 0 -247.581 0 0 0 0 0 0 0 2212.82 539.949 0 -1725.44 0 0 730.689 0 0 0 0 0 421.842 0 0 0 1481.6 0 410.703 0 2206.26 0 0 0 0 0 0 
0 0 0 0 0 0 1057.39 0 -478.607 0 -817.515 0 -1473.82 0 0 0 0 0 -937.758 0 1295.13 0 0 0 -82.9341 0.04 0 0 0 0 0 0 0 0 0 0 0 2157.73 0 0 0 0 0 1890.55 0 170.827 0 0 0 0 0 0 1180.84 0 0 0 530.335 0 0 0 857.494 0 
0 -198.447 0 0 0 0 0 -2279.5 0 0 0 0 -53.9415 0 0 0 0 0 637.15 0 -337.153 0 0 0 0 0 0.04 0 0 -150.838 0 0 925.245 0 -198.141 0 0 0 0 0 0 0 0 0 550.478 0 0 0 -439.39 0 0 -104.144 0 0 1950.06 0 440.001 -542.085 0 0 0 0 
-391.324 0 0 0 0 -204.55 0 2341.15 0 -314.417 0 -202.261 0 738.624 -806.833 0 -443.51 0 0 215.995 0 0 900.983 0 2199.85 0 0 0.09 0 0 0 0 0 0 0 0 0 0 0 0 0 689.795 0 340.205 -2129.96 1122.85 0 0 0 0 1867.05 0 0 0 0 0 0 -1880.63 -114.216 -146.107 0 0 
0 0 1206.47 -2212.36 0 0 0 0 0 -1920.61 0 0 0 0 0 0 0 0 0 0 0 0 0 0 0 0 0 0 0.03 -582.369 0 0 0 89.8007 -1496.09 0 0 0 1353.88 0 2430.42 700.934 0 -2208.55 0 0 1630.99 0 0 0 1946.7 2347.71 502.411 0 0 0 2055.8 0 0 -1373.26 0 0 
0 0 0 0 -1691.41 0 0 0 0 1578.65 0 2217.4 0 0 0 0 0 0 0 -2130.57 0 732.215 1442.99 1317.1 0 0 1073.41 0 -825.755 0.01 0 -185.629 -151.143 0 0 0 0 0 0 0 0 -1457.03 975.906 578.249 0 0 0 -1271.94 0 0 0 -1389.13 0 0 0 0 0 0 0 0 0 0 
0 0 0 -2025.74 0 0 0 2405.39 0 0 0 0 338.679 0 0 0 0 1728.8 2463.84 0 0 0 0 -2290.64 0 0 0 0 0 0 0.05 0 0 723.67 0 0 0 0 0 0 -597.934 0 0 0 1083.33 0 443.663 0 0 0 0 0 0 0 0 0 0 2340.54 0 0 0 0 
0 -2075.64 0 0 0 0 1026.41 0 0 0 1009.78 0 1583.53 0 297.021 0 0 0 0 -2391.96 0 0 0 521.79 0 0 0 0 0 1959.36 0 0.04 1336.48 0 0 0 0 0 -1129.41 0 0 1064.26 -589.694 0 1215.17 880.078 0 0 0 -2455.75 0 0 0 0 0 0 1612.67 -3.89111 0 0 0 0 
-1100.57 0 0 0 0 1630.68 0 0 0 -722.144 0 0 1545.69 0 0 0 0 -458.77 0 0 0 0 515.687 0 0 0 2021.62 0 0 -796.915 0 511.567 0.05 0 0 0 0 0 0 0 -685.064 0 1917.71 0 0 -1198.84 603.122 0 0 -16.0985 0 0 0 0 0 0 0 0 0 0 0 0 
-2183.37 0 0 0 0 0 1227.99 0 0 0 -1251.79 0 2276.3 0 0 0 0 2200.16 1459.17 0 0 1121.48 0 0 0 0 0 0 1738.26 0 1878.19 0 0 0.05 421.384 2232.51 2050.92 708.869 0 0 -949.507 0 -467.925 0 0 0 0 0 0 765.023 -883.282 1719.18 0 0 0 0 0 0 0 0 0 1426.36 
0 0 0 0 0 1256.83 0 0 -157.094 126.118 655.461 0 0 1965.77 0 0 0 0 0 0 0 2041.76 1416.59 0 0 0 974.532 0 -678.961 0 0 0 0 262.841 0.06 0 -144.734 0 -2449.8 -2419.74 0 0 -951.491 2391.2 0 0 23.1178 0 -1696.75 0 0 0 0 0 852 0 1946.09 2095.63 -1671.42 0 0 2074.72 
0 575.655 0 597.171 47.9904 0 0 0 0 2455.75 0 0 0 0 0 0 0 0 0 0 0 784.402 1297.42 -2167.5 -117.267 0 0 0 0 0 0 0 0 778.909 0 0.03 1773.35 1457.64 0 -1363.19 -1346.25 883.282 0 0 99.8718 0 0 0 0 0 0 2133.63 2469.18 0 692.846 0 0 0 0 0 0 0 
0 0 0 -1233.33 0 0 0 0 0 0 0 0 -1431.85 0 -1448.79 0 0 418.027 856.273 -663.244 0 1914.96 121.082 0 -1253.93 0 0 0 0 0 0 0 0 75.457 -1218.99 1927.32 0.04 28.3059 2093.49 1254.23 -546.663 -56.0778 0 0 0 1228.75 0 0 0 0 0 -930.28 0 0 0 0 0 0 0 0 0 0 
-421.537 0 557.649 0 0 1996.6 1044.27 1667.91 0 0 0 0 2379.3 0 0 0 -950.88 1975.08 0 450.682 0 0 0 -765.786 0 450.072 0 0 0 0 0 0 0 1459.17 0 2315.06 454.497 0.02 0 0 0 0 -1647.31 1121.63 1946.24 1071.89 0 -495.392 0 0 0 0 0 0 0 0 0 1132.62 0 0 0 0 
0 0 0 0 0 0 0 0 0 0 154.653 818.278 0 0 0 0 0 0 0 0 0 0 0 0 -685.369 0 0 0 -2107.53 0 0 255.516 0 0 1312.98 0 0.686666 0 0.08 0 0 0 0 1822.49 0 552.309 0 0 0 0 0 0 0 1673.25 0 0 0 0 0 0 0 -749.611 
-673.315 0 0 -971.328 0 0 0 0 1703.47 0 0 0 0 1510.59 0 0 0 0 0 0 0 0 113.3 0 0 0 0 0 0 0 0 0 0 0 185.018 1966.38 2003.16 0 0 0.07 790.658 1712.62 0 678.045 0 2333.98 0 0 0 0 0 -1701.64 604.648 -1958.6 1968.52 0 0 -160.909 0 0 0 0 
0 0 853.374 0 0 -320.368 0 0 0 0 2099.44 0 0 1875.74 0 0 0 0 0 0 1982.1 0 0 0 0 0 0 0 -180.135 0 -398.19 0 26.017 2222.74 0 1709.11 -372.097 0 0 1455.81 0.09 691.931 0 1524.93 0 0 0 0 0 0 -822.092 1324.73 0 0 -1730.93 0 2305.6 0 1487.7 0 0 1170.16 
0 0 0 0 2124.62 1059.68 0 0 0 0 0 0 0 0 0 -1766.79 -2174.52 0 0 -134.968 770.669 0 1213.34 -2055.96 2424.47 0 0 -1147.72 1791.36 917.158 0 -597.934 0 0 0 773.263 -1699.35 0 0 1789.83 -540.864 0.08 1175.95 -2270.2 0 -678.198 -1854.84 0 -566.652 0 -267.724 0 0 1530.43 0 0 -1876.05 0 1096 0 0 1209.37 
0 0 0 0 0 1047.93 0 0 0 -1090.04 0 2142.48 0 0 0 0 0 0 0 719.398 0 -1926.4 2142.32 414.518 0 0 0 0 0 72.7104 0 1540.04 -311.823 -458.007 -1330.99 0 0 364.162 0 0 0 47.9904 0.09 0 0 0 0 0 -1789.68 -123.981 273.827 0 0 515.992 0 0 0 0 0 0 0 -376.217 
0 0 0 0 0 980.026 -646.306 0 0 0 -1613.13 0 0 0 0 2395.17 0 2490.23 -2311.85 -208.365 989.029 2071.98 0 554.445 0 1905.65 0 2280.72 701.392 2036.42 0 0 0 0 -302.362 0 0 -1540.65 -1735.36 -2472.69 464.568 -2097.77 0 0.02 0 0 0 0 0 0 -2160.48 0 0 0 0 1435.67 0 0 2249.6 -2499.39 0 0 
0 795.846 0 0 -1487.55 2021.01 0 0 643.406 0 -435.575 367.977 -2432.1 0 0 0 0 584.964 0 0 0 0 0 0 0 0 -1194.11 1653.26 0 0 -1023.21 1122.39 0 0 0 -304.041 0 -477.844 0 0 0 0 0 0 0.06 180.746 0 0 91.7844 0 0 0 0 0 -576.266 2403.26 0 0 0 0 0 0 
0 0 0 0 -752.052 0 0 0 2271.57 0 0 0 1405.61 -1251.34 0 0 0 0 -334.101 0 0 0 1758.4 2403.1 0 1153.68 0 249.107 0 0 0 -1355.56 -2268.67 0 0 0 -640.965 2074.88 947.523 1892.83 0 -2153.31 0 0 2370.14 0.01 -2172.54 0 -762.886 0 0 0 0 0 0 0 0 -1021.07 0 0 -596.255 0 
0 0 0 0 0 0 0 0 0 0 -231.101 0 0 0 0 0 0 0 0 0 1589.63 0 0 -2415.77 0 0 0 0 1863.84 0 2155.29 0 1440.24 0 -2174.83 0 0 0 0 0 0 -1701.33 0 0 0 -147.023 0.02 0 0 1756.72 376.827 -134.51 0 0 0 2267.75 0 0 0 0 0 0 
0 0 0 -318.384 0 0 0 0 0 0 -2098.38 0 0 0 0 0 0 0 0 0 0 0 0 0 916.395 0 0 0 0 1261.41 0 0 0 0 0 0 0 674.078 0 0 0 0 0 0 0 0 0 0.07 0 0 0 0 1491.21 1571.93 -772.958 600.681 0 0 0 0 0 0 
0 0 -1757.79 0 940.809 0 0 0 0 1140.86 0 0 0 0 1562.78 0 923.872 0 -2407.68 0 293.207 0 0 0 0 0 1138.57 0 0 0 0 0 0 0 1397.52 0 0 0 0 0 0 2414.55 2216.79 0 -602.969 688.726 0 0 0.07 2047.41 0 1657.38 -90.4111 0 -2359 0 0 0 0 0 0 0 
330.287 948.134 0 0 0 0 0 0 0 0 0 -1560.95 0 0 0 0 0 -2244.1 0 0 1064.26 1410.03 751.137 0 0 0 0 0 0 0 0 -1402.71 -950.423 2362.67 0 0 0 0 0 0 0 0 -56.9933 0 0 0 -1094.78 0 2432.25 0.09 0 0 0 -1169.24 731.91 0 0 2323.76 0 0 0 0 
700.018 0 -1634.5 -1025.35 0 1822.34 0 -723.518 0 0 -710.089 0 0 0 0 1728.03 0 -1843.55 0 0 0 0 0 0 0 0 0 492.798 2092.12 0 0 0 0 1058.61 0 0 0 0 0 0 1213.19 1175.04 -983.535 2093.8 0 0 587.1 0 0 0 0.04 0 0 0 2314.14 0 0 0 0 0 0 0 
1467.1 -890.301 0 0 0 0 -1712.32 0 0 0 1276.36 0 0 -88.1222 0 0 0 0 0 -897.015 1386.38 0 -1419.49 0 541.017 0 -2266.38 0 2238.15 1682.56 0 0 0 914.869 0 9.07926 2117.15 0 0 407.804 -1702.09 0 0 0 0 0 -773.568 0 1816.23 0 0 0 0 0 0 2339.47 0 2134.54 0 0 0 0 
0 0 0 -1348.54 0 0 0 898.999 0 2033.52 0 0 0 0 0 -290.765 -1683.63 1094.62 0 2319.03 0 0 0 0 0 -512.787 0 0 1981.64 0 0 0 0 0 0 -1751.53 0 0 0 1085.01 0 0 0 0 0 0 0 1493.19 -850.78 0 0 0 0.08 0 0 -2044.51 2115.16 0 0 -2435.76 0 2398.53 
0 -2213.58 1519.59 0 0 0 0 -1198.84 1775.8 0 0 1095.84 0 0 0 0 2334.59 0 1898.94 0 0 2361.29 1661.96 0 1710.18 0 0 0 0 0 0 0 0 0 0 0 0 0 -918.531 1908.4 0 2078.69 485.626 0 0 0 0 2251.12 0 2025.13 0 0 0 0.04 2168.87 0 0 -2335.51 0 0 0 0 
0 0 0 0 -1546.45 0 0 0 0 0 -1890.85 0 2121.27 1928.54 0 -2164.45 0 0 0 0 0 0 2166.74 0 0 0 754.952 0 0 0 0 0 0 0 1804.64 -544.069 0 0 0 309.381 -1874.83 0 0 0 1948.38 0 0 -134.358 -648.289 -887.402 -948.592 0 0 2195.73 0.06 0 0 -619.449 0 0 0 -2124.01 
0 0 0 0 0 0 0 0 762.734 0 0 -2370.3 0 2227.32 0 0 0 0 0 0 2323.45 615.787 0 0 113.605 0 0 0 0 0 0 0 0 0 0 0 0 0 0 0 0 0 0 811.258 -514.313 0 2264.85 2249.44 0 0 0 1103.32 932.417 0 0 0.01 2315.36 166.25 0 0 -735.725 0 
0 827.128 7.70592 0 0 0 1896.04 324.946 0 0 0 0 0 0 0 325.098 -1829.51 -2103.72 0 0 0 0 0 1472.9 0 2006.82 2427.52 0 -1979.51 0 0 1704.99 0 0 -2070.91 0 0 0 0 0 2100.97 786.386 0 0 0 0 0 0 0 0 0 0 385.678 0 0 -1002.46 0.09 0 0 0 1008.41 0 
0 2317.8 0 0 0 0 1421.78 0 0 0 0 0 -262.535 0 0 0 1994.77 1236.69 -412.534 2376.71 0 0 1475.95 0 0 0 -1487.09 -1626.1 0 0 2063.13 1488.46 0 0 -669.958 0 0 2425.53 0 1004.14 0 0 0 0 0 -2311.09 0 0 0 1627.32 0 505.768 0 595.187 394.375 -1715.06 0 0.01 0 0 0 0 
1376.92 0 -2154.23 0 1948.99 -1207.24 0 0 0 0 0 0 0 0 0 2322.23 1343.65 733.436 -1098.59 633.793 0 0 0 0 0 0 0 -872.448 0 0 0 0 0 0 2219.38 0 0 0 0 0 1339.99 877.026 0 1052.35 0 0 0 0 0 0 0 0 0 0 0 0 0 0 0.07 1157.19 -713.294 0 
0 1878.34 0 0 0 0 0 0 0 0 0 0 0 0 0 0 0 1035.87 -289.239 0 0 585.879 0 0 0 0 0 15.9459 -16.4037 0 0 0 0 0 0 0 0 0 0 0 0 0 0 -824.229 0 0 0 0 0 0 0 0 2290.95 0 0 0 0 0 1102.86 0.09 0 0 
0 0 0 0 0 0 0 0 -1366.08 0 0 0 -765.633 0 0 0 1871.47 0 1139.79 0 0 1642.28 0 0 0 -691.931 0 0 0 0 0 0 0 0 0 0 0 0 0 0 0 0 0 0 0 -1292.54 0 0 0 0 0 0 0 0 0 558.107 -391.171 0 1064.41 0 0.09 0 
0 0 0 0 0 0 0 0 0 1274.53 0 0 0 0 0 0 0 0 -130.238 0 -366.146 0 0 0 0 0 0 0 0 0 0 0 0 904.645 401.09 0 0 0 431.303 0 493.408 1321.53 -606.479 0 0 0 0 0 0 0 0 0 1938 0 2460.94 0 0 0 0 0 0 0.05 
