*Vertices 65
*Matrix 
0.01 0 0 0 2409.97 1811.2 0 1111.41 -1669.13 0 2321.92 0 0 0 0 504.547 0 0 1871.32 0 0 0 -2229.45 0 0 0 -1894.51 0 0 0 -1244.32 -273.217 -900.83 0 0 0 2119.59 0 0 0 0 0 0 0 0 0 0 0 1839.88 0 0 0 1785.26 0 -1398.43 2319.48 0 0 0 0 0 0 1606.11 0 0 
0 0.06 0 955.916 0 0 0 0 0 1177.94 0 0 0 0 0 1219.9 280.084 2464.29 1412.32 0 0 615.024 -850.169 0 0 -1411.71 -2065.42 -2.97555 0 0 0 2178.49 0 2206.56 0 0 0 1091.72 0 0 -1242.03 0 0 0 1489.99 0 0 0 0 2054.73 -1358.46 0 0 412.381 0 660.039 392.239 0 0 79.577 0 -2366.33 1771.22 0 0 
0 0 0.06 0 0 0 0 0 0 0 0 1510.28 2498.02 2249.14 905.866 0 -1693.24 0 0 0 0 -2018.57 0 0 235.984 2369.69 -1656.47 0 0 0 0 0 1677.22 0 0 0 0 0 0 -593.661 0 0 0 0 0 0 0 0 -982.162 0 0 974.227 -110.401 0 0 0 0 2030.02 0 -831.858 0 940.352 0 0 0 
0 -1204.18 0 0.07 0 1539.58 0 0 0 0 0 0 0 0 0 0 0 1020.62 0 0 0 0 -2202.6 0 0 0 471.435 1599.25 0 0 -1275.14 0 0 0 2192.07 1687.6 2003.16 498.749 -1975.39 0 0 1869.33 1417.2 0 0 -1459.78 0 0 0 -104.45 930.891 0 0 0 0 0 0 0 0 41.8867 2415.46 0 1321.68 2424.92 0 
808.206 0 0 0 0.01 -362.178 0 0 1301.39 0 -2438.66 -1949.14 0 0 0 0 0 0 1394.01 0 -878.857 0 0 1197.47 0 0 0 2305.29 0 1815.47 0 0 0 0 0 0 -2179.86 0 1655.86 0 0 2072.59 0 0 0 0 0 0 0 946.913 0 0 731.605 0 0 0 0 0 0 0 0 0 0 1437.96 0 
1611.76 0 0 1755.96 1480.22 0 0 0 0 219.81 -627.689 0 0 2235.4 0 0 0 0 -1299.71 1401.94 0 0 0 0 0 1204.95 0 0 0 0 0 246.666 0 0 0 0 0 -1987.29 0 0 0 0 0 2250.05 0 0 0 0 0 -697.272 0 0 0 0 0 0 0 0 0 0 0 0 0 0 0 
0 0 0 0 0 0 0.03 0 -1552.55 -618.381 1967.45 -1031.6 0 0 0 0 0 0 0 0 0 0 354.549 1420.1 0 -615.177 1764.2 1582.16 0 0 0 0 0 0 -663.549 0 0 2136.22 0 0 0 531.709 -717.261 0 0 0 0 -47.5326 0 0 0 0 -521.638 0 0 1247.06 0 0 0 0 0 0 0 0 0 
1010.54 0 0 0 0 0 0 0.03 0 0 0 0 1726.05 -2149.95 0 0 0 -705.512 0 221.03 0 0 0 0 0 0 192.343 2160.02 0 0 0 0 -1038.47 0 0 0 0 -167.013 0 0 0 24.4911 0 0 1391.87 0 0 0 0 0 2025.28 0 2452.09 0 1579.1 0 -2311.55 0 245.75 -2198.32 0 0 0 2220.76 0 
2237.69 0 0 0 -226.981 0 -239.036 0 0.09 1696.45 0 -243.461 0 0 1971.57 0 0 0 0 0 0 0 0 322.199 0 1124.68 0 0 0 0 0 0 602.512 0 0 0 -2414.09 1875.59 0 0 0 0 0 1837.44 0 0 0 0 0 0 0 0 175.405 -647.069 0 -256.279 -1992.02 0 480.59 0 0 0 0 0 0 
0 1187.25 0 0 0 2155.75 2108.91 0 -1696.6 0.06 2170.86 0 0 0 0 2452.24 -813.7 1955.09 0 -2003.46 0 0 0 0 0 1759.32 2144.15 0 1232.26 0 0 0 0 1303.67 664.312 0 -735.267 0 0 0 0 0 1380.73 0 939.589 0 0 0 -1855.14 0 2427.21 0 0 0 0 318.384 0 -2422.48 0 1369.29 0 -921.735 855.052 0 0 
-859.02 0 0 0 -1597.57 11.2156 2424.31 0 0 959.426 0.07 0 0 -1385.77 0 -1786.48 0 946.76 1191.98 0 1081.19 1036.33 0 0 0 2395.32 0 0 0 0 0 2486.57 0 0 1613.74 0 0 1759.77 0 -1969.74 -428.861 332.728 0 0 0 0 0 0 0 0 0 1336.94 0 1450.62 0 -2174.67 0 0 0 -50.5844 0 0 1520.81 0 0 
0 0 1813.49 0 515.992 0 1523.41 0 1933.88 0 0 0.06 0 2374.57 0 0 1695.23 530.793 0 0 -383.694 0 0 0 0 -794.778 591.372 0 0 1785.41 0 0 -1350.67 972.549 0 0 0 0 0 0 0 0 0 0 0 0 0 195.09 0 0 0 0 -2149.04 1914.2 0 0 0 -167.165 0 0 0 0 1237.14 -299.005 0 
0 0 1679.97 0 0 0 0 637.608 0 0 0 0 0.02 0 0 0 -925.245 0 0 0 0 0 0 -2065.72 0 2098.07 0 -2075.79 0 0 0 0 0 0 2447.97 0 0 -330.592 0 0 0 0 0 0 0 0 634.251 0 0 1578.19 0 0 0 0 0 -1853.01 0 0 0 0 0 0 0 0 0 
0 0 735.878 0 0 143.971 0 2283.32 0 0 -607.7 1516.39 0 0.04 -2233.27 1881.54 0 1146.5 0 0 0 0 0 0 0 0 0 0 0 0 0 121.387 0 0 0 0 0 0 0 0 0 0 1632.51 0 0 0 0 0 0 0 0 0 0 0 -1768.01 0 0 -1327.17 -41.1237 -1929.91 1798.84 0 0 0 0 
0 0 703.07 0 0 0 0 0 796.762 0 0 0 0 785.928 0.05 0 0 0 0 0 0 0 0 0 0 0 0 0 0 0 662.938 0 0 -1169.09 2452.09 0 2333.06 0 0 0 0 0 0 0 0 0 0 0 0 -29.6793 1849.04 0 0 0 1026.57 0 0 0 0 -185.018 0 0 0 0 0 
594.577 -1869.33 0 0 0 0 0 0 0 -67.8274 2197.87 0 0 1220.36 0 0.01 0 0 2135.15 0 0 0 0 0 0 -763.497 0 0 0 0 0 0 0 943.403 0 0 0 1246.45 0 0 1886.27 778.451 0 1947.61 1771.37 0 0 0 0 -613.498 0 1199.3 0 0 0 0 0 0 1856.67 0 0 0 0 0 0 
0 692.694 -44.0229 0 0 0 0 0 0 2463.53 0 -1553.01 2105.09 0 0 0 0.02 -499.969 0 0 0 -135.884 0 0 -1359.07 0 0 0 0 235.984 -197.836 -499.969 -1342.59 0 0 0 0 0 0 0 0 1799.91 0 -1363.34 0 0 1700.42 0 -1156.42 110.248 -1569.49 2393.8 1516.69 -374.996 0 0 0 370.724 0 0 898.083 0 477.538 0 0 
0 767.006 0 954.848 0 0 0 -1070.97 0 -1726.51 1823.25 961.409 0 1502.81 0 0 914.716 0.09 -1530.27 0 0 0 0 -92.8526 0 378.811 0 -1094.47 0 -389.34 0 0 0 0 237.968 0 0 0 0 0 0 0 2247.46 0 0 0 0 0 -360.652 -2174.83 0 0 0 0 0 0 0 1325.04 0 0 1829.97 0 -80.7978 -1468.78 0 
276.269 -582.064 0 0 1313.9 888.318 0 0 0 0 344.63 0 0 0 0 1607.64 0 1880.78 0.03 0 0 0 -537.507 2398.68 -695.135 0 0 -290.46 0 0 0 0 0 0 0 0 0 0 0 0 35.3252 0 0 1768.17 0 0 0 -485.168 1459.93 0 0 -1580.32 0 0 0 0 0 0 0 0 0 0 0 0 2133.93 
0 0 0 0 0 1776.71 0 -1670.81 0 1711.55 0 0 0 0 0 0 0 0 0 0 -77.4407 0 1549.35 681.097 -556.429 -713.752 0 0 0 0 0 0 1481.29 1626.1 0 1927.93 0 0 0 0 -1957.84 0 0 0 0 0 0 0 0 0 0 0 0 0 0 0 -2405.39 0 1007.34 0 -487.152 0 0 452.055 2076.86 
0 0 0 0 -969.192 0 0 0 0 0 680.944 1099.81 0 0 0 0 0 0 0 1372.04 0.02 462.584 0 0 1582.16 0 0 0 0 0 0 1505.1 0 507.599 0 0 0 0 0 0 0 0 0 0 0 0 0 0 1952.5 0 0 0 0 0 -1133.23 0 0 0 0 0 0 2186.88 0 -2231.74 0 
0 -88.8852 -2430.57 0 0 0 0 0 0 0 -930.738 0 0 0 0 0 2269.89 0 0 0 -739.998 0.08 1305.81 0 666.906 -2393.34 0 -2005.6 0 0 -1285.82 250.786 0 0 0 809.275 0 0 1364.86 -505.005 0 0 0 2047.11 0 -1295.13 0 0 0 0 0 1795.79 0 0 0 0 0 1316.03 -809.58 1740.39 0 1061.2 805.765 0 0 
691.778 -342.647 0 1193.2 0 0 -1055.56 0 0 0 0 0 0 0 0 0 0 0 283.898 -1986.37 0 1148.79 0 0 0 -4.50148 -47.0748 0 1927.63 0 0 1756.57 0 0 0 0 0 -2241.97 0 -1765.42 0 1605.04 0 -1813.79 0 0 0 847.423 811.258 0 -595.492 -155.721 0 2111.8 0 0 0 0 1693.4 0 0 0 0 0 0 
0 0 0 0 -1652.5 0 -1909.31 0 2208.4 0 0 0 113.758 0 0 0 0 1440.09 -1424.22 -2095.93 0 0 0 0.09 0 0 0 0 0 0 -1148.34 0 0 0 0 0 0 0 0 0 0 1234.86 0 0 0 0 2108.14 1463.44 0 0 0 0 0 0 -748.848 0 0 0 0 0 1037.1 28.1533 0 2050.61 0 
0 0 1303.67 0 0 0 0 0 0 0 0 0 0 0 0 0 -1127.12 0 -2213.89 1833.93 1676.92 -1233.33 0 0 0 0 0 -2217.09 0 0 760.14 0 9.84222 0 0 1653.72 0 0 2148.27 0 0 -2003.62 0 0 0 0 0 0 0 0 0 0 0 0 0 0 1652.81 0 -2327.72 0 0 0 0 0 1921.37 
0 -2368.62 -445.341 0 0 256.432 969.192 0 -1081.8 -417.264 -1074.94 1728.64 598.849 0 0 104.297 0 -2133.93 0 2180.17 0 -2090.29 1358.15 0 0 0.02 0 0 0 2299.34 0 -2095.32 0 0 0 0 2268.36 1055.41 0 -2065.72 0 13.0467 0 0 0 0 0 0 0 219.81 0 0 2296.9 -73.4733 0 0 0 0 0 1397.98 0 0 328.761 0 0 
-1491.52 1856.82 180.288 -1003.22 0 0 1101.18 829.722 0 928.297 0 1678.14 0 0 0 0 0 0 0 0 0 0 1135.98 0 0 0 0.08 1371.12 0 0 466.094 731.758 0 0 0 -665.38 -1636.02 0 -2028.79 0 0 0 1810.89 0 0 0 -12.1311 0 0 0 0 -2374.57 0 0 -2435 0 0 0 0 0 0 1643.8 1887.49 0 0 
0 -272.301 0 -187.46 526.978 0 -1221.58 -674.383 0 0 0 0 1504.33 0 0 0 0 -2293.54 1715.67 0 0 -426.115 0 0 -273.827 0 -2407.68 0.06 -1497.16 0 -822.855 0 0 0 2494.81 0 0 -1800.97 0 0 0 0 0 0 -1554.23 0 0 0 0 2024.37 0 0 2485.35 0 0 0 0 0 0 0 0 1925.18 1699.35 0 0 
0 0 0 0 0 0 0 0 0 1309.17 0 0 0 0 0 0 0 0 0 0 0 0 -425.657 0 0 0 0 2228.54 0.07 -219.199 -1236.38 0 0 0 -833.689 676.061 -399.258 2440.64 0 0 0 0 0 0 1878.95 1146.5 0 1838.66 0 0 0 0 0 0 0 0 1215.63 0 0 0 0 578.707 0 0 0 
0 0 0 0 -1601.69 0 0 0 0 0 0 607.395 0 0 0 0 -2337.79 1786.02 0 0 0 0 0 0 0 64.9281 0 0 2460.17 0.02 0 -1913.89 1593.75 2355.49 0 0 0 0 0 181.204 1816.23 0 761.513 0 0 0 0 0 0 0 0 2055.5 0 0 -1079.67 0 1418.58 0 2466.12 0 0 877.941 152.821 0 0 
-696.203 0 0 929.823 0 0 0 0 0 0 0 0 0 0 -837.504 0 -1168.02 0 0 0 0 37.9192 0 1139.64 -335.017 0 770.058 912.122 -1990.8 0 0.06 0 0 0 2041 0 0 0 0 0 -815.531 134.663 0 2004.23 -21.4393 -2135.15 310.144 0 0 2431.33 0 -1095.39 0 0 -628.452 -1141.01 -546.968 0 0 0 0 1165.88 0 938.52 0 
-851.695 1447.11 0 0 0 -1049.91 0 0 0 0 -491.119 0 0 -288.781 0 0 1364.25 0 0 0 1284.3 -177.999 -2033.07 0 0 2362.51 12.1311 0 0 -273.064 0 0.05 -424.589 0 0 -894.116 0 0 1002.46 0 0 0 0 0 0 0 0 1805.25 2017.04 1374.63 1913.74 0 0 -72.7104 0 0 898.236 0 0 -546.052 0 0 -1320 0 0 
-1100.12 0 954.543 0 0 0 0 -1067.92 1685.77 0 0 1092.18 0 0 0 0 429.93 0 0 2074.72 0 0 0 0 -715.583 0 0 0 0 989.334 0 330.897 0.07 0 0 0 2050.31 0 0 0 -1121.02 0 0 0 0 0 378.048 1970.05 0 0 2251.88 -154.653 0 0 0 0 0 0 0 0 0 0 0 0 0 
0 -2283.62 0 0 0 0 0 0 0 559.023 0 774.026 0 0 -359.584 -348.75 0 0 0 1850.87 1947.77 0 0 0 0 0 0 0 0 90.4111 0 0 0 0.05 626.316 0 0 0 0 0 0 0 0 0 -673.925 0 -385.372 0 0 0 0 0 0 0 0 0 0 0 0 0 0 0 1794.87 0 2222.89 
0 0 0 1144.37 0 0 2360.07 0 0 -2169.64 1265.07 0 1734.44 0 -1089.59 0 0 2266.08 0 0 0 0 0 0 0 0 0 1358.46 1804.64 0 -2029.25 0 0 -1314.05 0.07 0 429.319 -90.7163 0 0 0 0 -1359.68 0 -1463.9 0 0 0 0 1543.4 0 0 0 0 0 0 0 693.304 0 1729.71 0 0 -291.223 1944.72 0 
0 0 0 -1049.76 0 0 0 0 0 0 0 0 0 0 0 0 0 0 0 1905.04 0 2301.78 0 0 157.094 0 396.97 0 -1170.31 0 0 728.858 0 0 0 0.05 1213.19 0 -399.411 0 0 -1964.55 1815.93 0 0 0 30.5948 0 0 0 0 0 0 -59.5874 0 0 0 0 0 0 0 0 0 0 0 
-2004.23 0 0 -1309.47 -1763.74 0 0 0 564.364 -985.672 0 0 0 0 -439.695 0 0 0 0 0 0 0 0 0 0 92.3948 2355.04 0 2011.4 0 0 0 430.998 0 928.297 1396.6 0.06 -1779.61 0 0 0 -517.06 2414.55 0 1584.75 0 0 0 1214.71 2077.78 0 0 0 -180.898 0 0 0 0 -960.952 0 0 0 0 0 0 
0 704.291 0 1611.76 0 -237.815 -171.438 357.601 1650.36 0 -182.577 0 1916.03 0 0 1076.62 0 0 0 0 0 0 -1408.05 0 0 -2115.62 0 -351.039 1500.98 0 0 0 0 0 -1394.01 0 2458.65 0.03 -2168.72 0 -2345.58 0 0 -37.3089 0 0 0 1966.54 0 0 0 0 -2395.32 0 0 750.221 0 0 0 0 0 0 0 0 0 
0 0 0 -1670.35 1073.87 0 0 0 0 0 0 0 0 0 0 0 0 0 0 0 0 2354.43 0 0 -1043.5 0 -1813.03 0 0 0 0 -991.775 0 0 0 2451.93 0 -2228.08 0.04 0 -659.124 0 874.126 0 2314.6 -2051.53 2219.38 0 0 2357.33 0 0 0 0 873.211 0 0 0 0 0 -302.362 0 0 0 0 
0 0 1008.26 0 0 0 0 0 0 0 2115.47 0 0 0 0 0 0 0 0 0 0 -1163.14 -512.177 0 0 -1038.47 0 0 0 -922.651 0 0 0 0 0 0 0 0 0 0.03 0 0 0 2237.24 0 1077.38 1931.29 0 0 0 0 0 0 0 -2127.06 0 0 0 0 0 0 0 0 0 0 
0 1866.13 0 0 0 0 0 0 0 0 2020.86 0 0 0 0 -1607.03 0 0 -1550.11 -2098.53 0 0 0 0 0 0 0 0 0 -19.303 1849.04 0 2021.01 0 0 0 0 -1377.68 1964.09 0 0.08 -320.063 0 -98.6511 0 0 0 0 0 0 0 0 0 2412.11 -461.364 834.91 0 0 0 0 2467.96 0 0 1545.69 0 
0 0 0 636.235 1666.23 0 1164.82 -1438.41 0 0 -485.015 0 0 0 0 1784.65 -1122.39 0 0 0 0 0 1185.26 -243.156 -2319.48 -802.255 0 0 0 0 -398.801 0 0 0 0 2184.59 426.725 0 0 0 1113.09 0.04 0 0 0 603.122 0 0 0 0 -114.063 0 -2348.78 0 0 0 0 0 2301.78 0 2478.94 0 0 0 0 
0 0 0 -1170 0 0 -2106.77 0 0 839.03 0 0 0 -1934.49 0 0 0 -1321.83 0 0 0 0 0 0 0 0 2461.24 0 0 2108.29 0 0 0 0 -1406.22 750.374 -423.215 0 918.226 0 0 0 0.08 0 0 0 1966.23 0 0 0 0 0 0 0 0 1904.43 0 0 0 0 0 0 1657.99 2264.85 0 
0 0 0 0 0 -1517.3 0 0 479.827 0 0 0 0 0 0 2116.99 1303.98 0 -1995.22 0 0 -497.833 248.344 0 0 0 0 0 0 0 2364.96 0 0 0 0 0 0 1585.21 0 1326.56 1070.82 0 0 0.01 1383.33 0 0 1705.45 0 0 0 0 0 0 0 0 806.833 0 -1270.56 0 0 0 0 -402.768 0 
0 -262.23 0 0 0 0 0 1652.04 0 -2189.17 0 0 0 0 0 -1194.11 0 0 0 0 0 0 0 0 0 0 0 1194.57 1027.63 0 -535.676 0 0 2448.88 2037.19 0 -1137.2 0 1937.24 0 0 0 0 848.796 0.06 286.035 0 0 0 -724.738 0 0 0 0 0 0 0 0 0 0 2180.78 -1467.86 0 0 0 
0 0 0 818.888 0 0 0 0 0 0 0 0 0 0 0 0 0 0 0 0 0 665.075 0 0 0 0 0 0 -484.405 0 -2064.35 0 0 0 0 0 0 0 1536.53 886.639 0 2162.77 0 0 607.242 0.07 0 989.029 0 0 1381.95 0 0 1845.84 0 0 0 0 -946.15 858.409 0 0 -1946.55 2028.95 0 
0 0 0 0 0 0 0 0 0 0 0 0 630.741 0 0 0 468.841 0 0 0 0 0 0 -898.846 0 0 167.165 0 0 0 -170.675 0 -1553.47 -1864.6 0 -636.692 0 0 1725.59 -564.516 0 0 767.464 0 0 0 0.03 0 0 0 600.223 0 0 0 0 0 584.048 -150.075 0 0 0 1265.22 0 0 0 
0 0 0 0 0 0 2033.22 0 0 0 0 1638.62 0 0 0 0 0 0 1870.86 0 0 0 -1751.38 1521.42 0 0 0 0 2054.58 0 0 80.4926 -494.171 0 0 0 0 1468.78 0 0 0 0 0 1116.29 0 -395.138 0 0.01 0 0 -1453.98 0 0 -770.363 0 -1075.24 0 0 0 0 0 1674.02 0 0 0 
-491.577 0 640.355 0 0 0 0 0 0 -1677.22 0 0 0 0 0 0 2355.8 291.986 -2181.08 0 -405.362 0 2402.04 0 0 0 0 0 0 0 0 2001.17 0 0 0 0 1563.84 0 0 0 0 0 0 0 0 0 0 0 0.07 295.801 0 -375.912 0 0 0 0 0 0 0 0 0 0 0 0 0 
0 -1808.45 0 -695.441 2203.05 314.112 0 0 0 0 0 0 2300.87 0 1346.71 53.0259 -70.8792 2425.69 0 0 0 0 0 0 0 1524.63 0 2345.27 0 0 844.371 -708.258 0 0 -2381.59 0 -249.26 0 1572.39 0 0 0 0 0 1641.67 0 0 0 2244.71 0.03 0 0 0 2199.85 -1562.78 0 0 0 1057.7 1736.27 -975.906 0 0 -27.3904 0 
0 -888.775 0 2220.76 0 0 0 1898.33 0 476.318 0 0 0 0 465.789 0 -2355.49 0 0 0 0 0 1516.24 0 0 0 0 0 0 0 0 871.38 2200.46 0 0 0 0 0 0 0 0 1773.35 0 0 0 2285.76 2286.83 2242.88 0 0 0.06 0 0 -1123.77 2374.11 -710.852 0 0 0 0 0 0 0 0 970.107 
0 0 107.807 0 0 0 0 0 0 0 860.851 0 0 0 0 -1348.54 -1986.98 0 1392.33 0 0 15.3356 -582.522 0 0 0 632.42 0 0 -1702.55 1840.04 0 2004.38 0 0 0 0 0 0 0 0 0 0 0 0 0 0 0 1875.29 0 0 0 -517.518 0 0 -209.433 0 462.432 31.5104 340.358 0 0 0 0 1547.21 
1168.17 0 1224.33 0 958.815 0 107.044 -92.5474 1538.97 0 0 536.286 0 0 0 0 1087.3 0 0 0 0 0 0 0 0 899.762 0 2216.03 0 0 0 0 0 0 0 0 0 1915.42 0 0 0 1204.49 0 0 0 0 0 0 0 0 0 -1568.88 0 0 0 0 0 0 0 0 -173.574 0 0 0 0 
0 2247.61 0 0 0 0 0 0 456.786 0 2231.74 1583.99 0 0 0 0 -1659.83 0 0 0 0 0 -643.406 0 0 79.4244 0 0 0 0 0 1815.32 0 0 0 1758.86 -2495.42 0 0 0 -1757.64 0 0 0 0 -2358.09 0 1541.57 0 -673.467 -640.965 0 0 0.07 1618.32 0 0 0 0 0 0 0 0 -1207.69 0 
1665.32 0 0 0 0 0 0 1159.32 0 0 0 0 0 2413.79 1804.94 0 0 0 0 0 -2167.35 0 0 -223.624 0 0 -997.269 0 0 2306.21 -267.571 0 0 0 0 0 0 0 -1576.2 -1342.89 741.829 0 0 0 0 0 0 0 0 1662.72 2154.23 0 0 -817.82 0.05 -818.43 0 0 0 0 0 0 0 -985.214 0 
2281.95 -1054.19 0 0 0 0 969.649 0 1391.42 -1262.47 2306.82 0 -1157.34 0 0 0 0 0 0 0 0 0 0 0 0 0 0 0 0 0 -1136.74 0 0 0 0 0 0 2314.45 0 0 866.802 0 1904.28 0 0 0 0 -1041.98 0 0 -1340.3 -474.792 0 0 -270.47 0 0 0 0 0 2157.28 -319.147 0 0 0 
0 1739.78 0 0 0 0 0 -1849.96 -877.331 0 0 0 0 0 0 0 0 0 0 918.836 0 0 0 0 262.688 0 0 0 1706.67 560.854 360.347 701.086 0 0 0 0 0 0 0 0 0 0 0 1572.08 0 0 -1716.44 0 0 0 0 0 0 0 0 0 0.01 0 0 0 2297.66 0 0 0 791.269 
0 0 1445.43 0 0 0 0 0 0 1170.92 0 1906.87 0 1928.54 0 0 1390.65 2410.28 0 0 0 1382.56 0 0 0 0 0 0 0 0 0 0 0 0 2374.57 0 0 0 0 0 0 0 0 0 0 0 -1693.55 0 0 0 0 1490.91 0 0 0 0 0 0.07 0 -2440.18 0 0 -1393.09 0 1081.8 
0 0 0 0 0 0 0 843.303 2047.72 0 0 0 0 -2483.06 0 2452.24 0 0 0 1127.74 0 -314.57 -521.332 0 2342.22 0 0 0 0 2464.75 0 0 0 0 0 0 927.992 0 0 0 0 -1255.46 0 -3.89111 0 845.744 0 0 0 -2138.66 0 827.433 0 0 0 0 0 0 0.06 0 0 -2414.4 0 0 0 
0 1174.28 1500.52 -797.983 0 0 0 -1177.48 0 553.529 -17.6244 0 0 1807.38 1213.8 0 0 0 0 0 0 -2061.91 0 0 0 1775.49 0 0 0 0 0 478.607 0 0 1456.57 0 0 0 0 0 0 0 0 0 0 -895.032 0 0 0 1339.99 0 108.264 0 0 0 0 0 85.9859 0 0.08 0 0 -1662.57 0 0 
0 0 0 771.889 0 0 0 0 0 0 0 0 0 -156.636 0 0 1192.59 1111.41 0 2306.82 0 0 0 -1977.37 0 0 0 0 0 0 0 0 0 0 0 0 0 0 -735.572 0 -1549.35 1858.96 0 0 167.318 0 0 0 0 1801.89 0 0 1041.52 0 0 358.211 -708.563 0 0 0 0.06 1361.96 0 0 0 
0 233.695 1963.33 0 0 0 0 0 0 -398.495 0 0 0 0 0 0 0 0 0 0 -2236.32 -2035.36 0 343.104 0 0 2183.52 2117.76 -2379.76 1402.86 1247.67 0 0 0 0 0 0 0 0 0 0 0 0 0 772.652 0 135.731 2050 0 0 0 0 0 0 0 561.159 0 0 622.044 0 -1240.35 0 1351.44 0 477.233 
-1533.02 603.427 0 571.23 0 0 0 0 0 1540.04 907.849 1123.62 0 0 0 0 1752.75 2485.35 0 0 0 -789.132 0 0 0 -885.113 -2229 875.5 0 265.435 0 -2243.64 0 1392.64 -428.556 0 0 0 0 0 0 0 2073.66 0 0 -1896.04 0 0 0 0 0 0 0 0 0 0 0 -62.7918 0 -987.35 0 875.652 0.03 0 2259.51 
0 0 0 -966.597 -966.597 0 0 500.885 0 0 0 -402.463 0 0 0 0 0 206.687 0 1046.1 253.533 0 0 -2015.82 0 0 0 0 0 0 -1224.63 0 0 0 832.011 0 0 0 0 0 -539.796 0 2486.11 1861.4 0 -1481.9 0 0 0 1174.43 0 0 0 -830.18 806.07 0 0 0 0 0 0 0 0 0.07 0 
0 0 0 0 0 0 0 0 0 0 0 0 0 0 0 0 0 0 -1936.48 2196.8 0 0 0 0 -755.409 0 0 0 0 0 0 0 0 271.386 0 0 0 0 0 0 0 0 0 0 0 0 0 0 0 0 1876.2 -2191.15 0 0 0 0 859.02 1966.54 0 0 0 -732.368 -347.072 0 0.09 
