*Vertices 27
*Matrix 
0.03 0 993.606 0 1298.18 857.341 896.71 1191.21 0 0 0 0 0 0 -1800.21 0 -813.7 0 0 0 0 0 0 0 0 0 0 
0 0.07 0 0 0 753.121 0 -36.6985 0 0 0 0 0 0 0 0 0 0 0 0 0 0 0 0 0 0 0 
1596.19 0 0.01 0 0 0 0 -611.362 183.645 0 0 0 0 0 0 0 0 0 0 0 753.578 0 0 0 -897.32 0 0 
0 0 0 0 244.987 0 -2043.75 0 1591.46 0 1750.62 0 0 0 0 0 0 0 0 0 -102.161 0 0 0 0 1575.9 0 
1554.84 0 0 1119.34 0.09 1504.79 0 0 653.935 0 0 0 0 0 495.849 0 0 0 0 2351.53 0 0 0 0 0 0 0 
1409.57 221.03 0 0 72.4052 0.02 0 0 0 0 0 0 0 0 0 0 0 0 0 0 0 0 0 0 0 0 0 
2156.82 0 0 1344.57 0 0 0 1974.93 0 0 0 -1055.71 0 0 0 0 0 0 0 0 0 0 0 0 0 0 0 
637.15 2096.55 -2305.44 0 0 0 1167.87 0.04 0 0 0 0 0 0 0 0 0 0 0 -1881.54 0 0 0 1593.91 0 0 1667.3 
0 0 2211.75 2020.86 1559.88 0 0 0 0.09 0 0 0 0 0 0 0 0 0 0 0 0 0 0 0 0 0 0 
0 0 0 0 0 0 0 0 0 0.07 0 0 1941.36 0 0 0 0 0 0 0 0 0 0 0 0 0 0 
0 0 0 1371.88 0 0 0 0 0 0 0 0 0 0 0 0 0 0 0 0 0 0 0 0 0 812.632 0 
0 0 0 0 0 0 205.161 0 0 0 0 0.04 1879.71 0 0 0 0 0 0 0 0 0 0 -434.965 0 0 0 
0 0 0 0 0 0 0 0 0 1683.48 0 -93.6155 0 0 0 0 0 0 0 0 0 0 0 -522.248 0 0 0 
0 0 0 0 0 0 0 0 0 0 0 0 0 0.06 0 2214.65 0 0 0 0 0 0 -347.377 0 -319.3 0 0 
-1692.33 0 0 0 762.581 0 0 0 0 0 0 0 0 0 0.09 0 0 2443.69 0 0 0 1613.59 0 0 0 0 0 
0 0 0 0 0 0 0 0 0 0 0 0 0 1306.57 0 0.09 0 0 0 0 0 0 -550.02 0 0 0 0 
2174.67 0 0 0 0 0 0 0 0 0 0 0 0 0 0 0 0.08 0 0 0 0 0 0 0 0 0 0 
0 0 0 0 0 0 0 0 0 0 0 0 0 0 566.5 0 0 0 794.168 0 -781.808 0 0 0 0 0 0 
0 0 0 0 0 0 0 0 0 0 0 0 0 0 0 0 0 1458.25 0.04 0 0 0 0 0 0 0 0 
0 0 0 0 -2004.99 0 0 2499.08 0 0 0 0 0 0 0 0 0 0 0 0.03 0 0 0 0 0 0 634.251 
0 0 853.526 -1396.45 0 0 0 0 0 0 0 0 0 0 0 0 0 1286.89 0 0 0.04 0 0 0 0 0 0 
0 0 0 0 0 0 0 0 0 0 0 0 0 0 2165.06 0 0 0 0 0 0 0.06 0 0 0 0 0 
0 0 0 0 0 0 0 0 0 0 0 0 0 678.045 0 1869.33 0 0 0 0 0 0 0 0 0 0 0 
0 0 0 0 0 0 0 -624.79 0 0 0 2245.02 1256.07 0 0 0 0 0 0 0 0 0 0 0.09 0 0 0 
0 0 1858.35 0 0 0 0 0 0 0 0 0 0 1518.52 0 0 0 0 0 0 0 0 0 0 0.07 0 0 
0 0 0 -643.712 0 0 0 0 0 0 1108.05 0 0 0 0 0 0 0 0 0 0 0 0 0 0 0 0 
0 0 0 0 0 0 0 1705.3 0 0 0 0 0 0 0 0 0 0 0 2002.09 0 0 0 0 0 0 0.03 
