*Vertices 67
*Matrix 
0.01 0 0 0 0 0 0 0 0 0 0 0 0 0 -888.928 0 0 0 31.0526 0 813.242 0 0 1165.43 -1135.21 0 2418.21 -2078.54 0 0 0 0 -169.607 0 0 0 0 0 0 0 -237.663 1311.61 0 0 0 0 0 0 0 -963.088 -381.405 0 0 0 0 0 0 0 0 0 0 71.1844 0 0 450.53 0 0 
0 0.09 -1943.95 0 0 0 0 2384.95 1405.45 2375.79 768.227 0 0 0 0 0 0 1405.76 0 0 0 0 -1280.33 0 0 1483.43 0 0 2256.77 852 -1553.32 0 0 0 1749.4 657.445 -2329.25 0 0 0 0 0 0 0 0 0 0 0 0 0 -1063.04 0 0 -2023.15 0 0 0 0 437.101 -201.956 0 0 0 0 0 0 0 
0 678.35 0.03 0 0 1752.14 0 0 0 0 0 0 0 0 0 0 625.706 0 0 0 0 1284.14 -1292.38 -508.515 0 0 268.792 0 0 -11.5207 0 0 871.38 -472.198 0 0 652.867 0 0 0 0 0 0 0 0 0 0 0 0 0 0 0 -750.832 0 0 0 0 0 0 0 0 0 0 0 0 0 0 
0 0 0 0.09 0 0 2006.36 0 1228.45 0 2225.03 0 0 0 -1254.69 0 0 0 457.244 0 471.587 1461.61 0 0 0 0 0 -335.932 2300.26 0 0 0 0 0 0 0 0 0 0 -654.393 0 0 0 0 0 1459.47 0 0 1482.67 0 0 0 0 -1327.78 0 0 1890.55 0 765.786 2146.14 -1724.22 0 0 0 0 0 0 
0 0 0 0 0.08 0 0 0 0 0 0 0 -1538.36 -483.947 1718.73 577.487 0 0 0 0 0 726.569 0 -542.848 0 0 0 0 -1698.28 0 0 0 0 0 0 1551.64 1570.71 0 0 0 0 0 0 0 466.094 0 0 0 0 0 0 0 0 0 -1221.12 0 0 0 0 0 0 0 0 0 0 0 0 
0 0 -743.355 0 0 0.04 2259.67 0 0 0 2428.89 77.4407 0 0 0 0 0 0 0 -930.433 0 0 -749.458 1711.4 -391.018 0 0 0 0 0 1006.42 0 1031.45 0 -1459.47 0 0 0 0 0 0 0 0 0 0 0 0 0 0 0 0 0 0 0 0 0 0 0 0 0 0 0 0 0 0 0 2024.37 
0 0 0 2106.46 0 1180.68 0.02 0 0 1016.5 -645.238 0 2428.74 0 0 0 0 0 -2329.4 0 -1737.34 602.359 0 0 -1829.81 0 0 -805.612 0 0 0 0 354.854 0 0 0 1833.32 0 0 0 0 0 0 0 0 0 0 0 0 0 0 -519.349 0 0 0 -300.531 0 0 0 0 272.759 0 -1056.17 0 0 0 0 
0 -2195.73 0 0 0 0 0 0.07 0 -302.21 -26.017 0 0 1320.31 0 0 0 0 0 -1619.24 0 0 0 0 0 0 0 1649.91 0 1402.55 0 0 0 2112.11 0 0 0 0 0 0 0 0 0 0 0 0 0 0 -405.057 0 -1953.87 0 1400.88 0 0 0 0 0 0 0 0 0 0 0 0 0 0 
0 324.946 0 2252.8 0 0 0 0 0.01 0 0 0 0 169.607 0 1274.53 0 0 0 0 0 0 0 327.998 0 0 0 0 0 0 0 0 0 0 0 0 0 0 0 833.995 0 0 0 0 0 0 0 -1692.63 0 0 0 0 0 0 -1451.38 0 0 1763.74 0 0 -185.629 0 0 0 0 0 0 
0 805.612 0 0 0 0 739.387 2400.66 0 0.02 0 0 -1653.11 0 0 991.623 0 1302.15 0 0 2266.08 0 337.916 -611.362 0 0 0 0 0 -1595.58 2456.66 -443.815 0 0 1068.99 0 0 0 0 0 0 -1029.62 0 140.156 0 0 0 0 0 0 0 0 0 0 -724.738 0 0 0 0 0 0 0 0 0 0 0 -760.292 
0 1767.4 0 1975.39 0 2222.28 -1381.34 1528.6 0 0 0 0 -1266.14 2121.27 0 0 0 0 -1598.33 0 0 0 0 0 0 0 -521.027 2459.56 0 0 785.318 0 0 0 0 0 0 0 0 0 0 0 1585.82 0 -469.146 0 1548.74 0 -1929.61 -802.408 0 0 0 0 0 0 0 0 0 0 0 0 0 0 0 0 0 
0 0 0 0 0 1839.12 0 0 0 0 0 0 1688.67 0 0 -1801.89 0 -2438.35 0 0 1363.19 0 0 0 0 0 0 0 1396.3 0 0 0 0 0 0 0 0 548.189 0 -256.89 0 -592.441 0 0 0 0 2351.68 0 0 0 0 0 0 0 0 0 0 0 0 -823.466 0 0 0 0 0 0 0 
0 0 0 0 -1709.11 0 2020.71 0 0 1992.78 2318.87 -251.091 0.08 1925.18 0 0 0 0 -1234.7 0 0 1277.89 0 0 0 0 0 1259.42 0 0 0 0 0 1032.36 0 -799.966 0 0 0 0 0 0 0 0 0 -2063.43 0 213.706 0 -1491.82 0 -92.0896 0 0 0 0 0 0 0 -2.82296 0 0 0 0 0 -1529.05 0 
0 0 0 0 1629.76 0 0 -630.436 1596.8 0 2176.35 0 -58.8244 0.06 0 1816.23 0 0 0 -1733.38 -1721.47 1847.21 0 0 0 0 0 0 0 0 0 0 0 0 0 0 0 0 0 0 0 0 0 0 0 0 0 0 674.23 0 0 0 0 0 0 1691.11 0 0 0 1583.83 0 -2129.51 0 0 0 0 0 
627.995 0 0 2460.94 1941.36 0 0 0 0 0 0 0 0 0 0.05 0 0 -283.441 0 0 0 0 0 -2333.06 1548.89 1765.72 0 0 2391.51 0 0 0 0 0 0 0 0 0 0 0 0 0 0 0 1282.77 0 0 0 0 0 0 1737.19 0 0 0 932.112 0 0 0 0 0 0 0 0 0 0 0 
0 0 0 0 625.858 0 0 0 -168.081 2346.64 0 2408.29 0 1612.06 0 0 0 0 0 -1682.26 2178.64 -1084.86 0 794.626 0 0 0 0 0 0 -906.171 220.878 -2088.31 0 0 0 0 0 0 0 -241.783 0 0 -416.654 0 0 -1154.13 0 0 0 0 0 0 0 0 0 0 0 0 0 0 0 -1722.39 0 0 0 0 
0 0 1698.13 0 0 0 0 0 0 0 0 0 0 0 0 0 0.09 2258.14 0 0 0 0 0 0 -1785.1 0 0 110.858 0 1068.99 0 0 -306.787 -234.916 0 0 0 1052.35 0 0 0 0 0 0 0 0 2198.78 0 0 0 -814.005 0 0 0 0 0 0 0 0 0 -2243.95 0 0 0 0 0 0 
0 -797.983 0 0 0 0 0 0 0 1540.96 0 -2411.5 0 0 701.086 0 -288.781 0.01 0 0 478.912 1087.15 0 0 0 866.344 0 0 0 848.186 0 1307.79 0 0 0 0 0 0 0 0 0 0 0 -1880.78 0 0 0 0 0 0 0 2305.29 0 0 0 0 0 0 0 0 0 0 0 0 0 0 0 
2128.28 0 0 1691.72 0 0 -1519.9 0 0 0 -365.841 0 2127.98 0 0 0 0 0 0.05 0 0 625.248 0 0 0 0 492.798 0 0 0 0 238.578 0 0 0 367.061 0 0 0 0 0 0 -1325.95 327.54 0 0 0 0 0 0 0 0 0 -1752.91 0 0 0 -2049.7 0 0 0 0 0 0 0 0 0 
0 0 0 0 0 1587.04 0 1804.03 0 0 0 0 0 50.1267 0 -621.891 0 0 0 0.08 0 0 0 -23.5755 0 0 0 0 -1975.54 0 0 0 0 0 0 0 0 0 0 0 0 0 0 0 0 702.155 2362.97 0 0 0 0 0 -1985.15 0 0 0 0 -1038.16 0 0 0 0 0 0 0 0 0 
693.152 0 0 640.049 0 0 2183.98 0 0 1952.96 0 -155.568 0 25.8644 0 -569.704 0 -331.965 0 0 0.04 1472.44 0 2386.32 0 0 0 0 -762.886 0 0 0 0 2334.44 0 0 0 0 0 0 -515.992 0 0 -1742.99 0 0 2342.07 0 0 0 0 251.244 0 0 0 0 0 0 0 0 0 0 0 753.121 0 -2266.84 0 
0 0 156.484 -859.02 2126.76 0 -767.312 0 0 0 0 0 1479.77 2051.99 0 434.202 0 1001.24 1045.64 0 -545.442 0.03 0 0 0 0 0 0 0 612.735 0 0 2447.97 -1198.69 0 0 0 0 0 0 0 0 0 0 0 0 2080.22 0 0 0 0 0 0 0 0 -1426.82 0 0 0 0 0 0 0 0 0 1565.37 2376.4 
0 1783.88 -1047.78 0 0 2173.3 0 0 0 2480.62 0 0 0 0 0 0 0 0 0 0 0 0 0.06 0 0 0 306.177 0 0 0 0 0 2074.27 0 0 0 0 0 0 0 0 0 0 0 0 871.075 0 0 0 -2124.93 0 0 0 0 0 0 -1802.65 0 0 0 0 0 0 0 0 0 0 
1935.1 0 225.608 0 2385.25 1745.73 0 0 364.467 -1430.48 0 0 0 0 1289.03 -116.047 0 0 0 -785.165 2170.55 0 0 0.09 0 0 -1302.45 0 0 1872.08 2137.14 0 0 0 0 0 0 0 0 0 0 0 0 0 0 0 0 0 0 0 0 0 0 0 0 0 0 1172.9 0 0 -1603.21 0 0 0 0 0 0 
2299.65 0 0 0 0 1288.87 1319.54 0 0 0 0 0 0 0 206.381 0 -369.655 0 0 0 0 0 0 0 0.01 0 0 1160.08 0 0 0 0 0 0 0 0 0 0 0 0 0 0 0 0 0 0 0 0 0 0 0 0 0 0 0 0 1604.43 0 -1083.64 -1208.46 0 0 0 0 0 0 0 
0 2289.88 0 0 0 0 0 0 0 0 0 0 0 0 1729.71 0 0 442.747 0 0 0 0 0 0 0 0.04 0 784.097 0 0 0 0 0 0 0 0 0 0 1714.61 0 -411.466 0 0 0 0 -632.267 0 0 0 0 0 0 0 0 0 0 908.155 0 0 0 0 0 1546.75 -1087.91 0 0 0 
-2258.45 0 1709.88 0 0 0 0 0 0 0 -802.255 0 0 0 0 0 0 0 2283.32 0 0 0 -290.613 2210.38 0 0 0.09 0 2404.78 0 0 0 0 0 1057.24 0 0 0 0 0 0 0 0 0 0 0 0 -1686.22 0 0 -1748.18 0 0 0 0 0 0 0 0 0 0 0 0 -1451.38 0 -440.458 0 
-89.8007 0 0 4.34889 0 0 1465.58 2273.4 0 0 2178.49 0 1575.75 0 0 0 736.641 0 0 0 0 0 0 0 -481.811 2266.53 0 0 0 0 0 2134.54 0 0 0 0 0 0 -1627.02 0 0 0 0 0 0 0 0 0 0 0 0 0 0 0 0 0 0 0 1894.67 0 0 0 0 0 0 0 0 
0 -244.377 0 1152.46 -282.83 0 0 0 0 0 0 -1273.61 0 0 2180.93 0 0 0 0 1517.3 1506.01 0 0 0 0 0 1176.41 0 0.05 0 -288.781 0 0 0 -2281.64 1181.3 0 0 0 0 0 0 0 0 0 0 0 0 0 0 2016.59 0 0 0 0 0 0 0 0 0 0 0 0 0 0 0 0 
0 -964.461 1355.86 0 0 0 0 822.703 0 -421.995 0 0 0 0 0 0 2234.49 728.095 0 0 0 1892.22 0 2131.49 0 0 0 0 0 0.05 0 183.187 2403.87 0 76.5252 0 0 0 0 0 0 0 0 0 0 0 0 0 0 0 -267.876 -418.332 0 0 0 0 0 0 0 0 0 0 0 0 0 0 0 
0 1538.21 0 0 0 1058.15 0 0 0 2294.61 -2096.55 0 0 0 0 -325.251 0 0 0 0 0 0 0 913.8 0 0 0 0 -1362.42 0 0.09 1807.69 0 1554.23 0 0 0 0 -1826.15 0 0 0 0 0 0 0 0 0 0 0 0 0 0 0 0 -636.845 0 0 0 0 0 0 2483.37 0 0 0 0 
0 0 0 0 0 0 0 0 0 1321.99 0 0 0 0 0 559.633 0 1369.29 851.543 0 0 0 0 0 0 0 0 1889.17 0 814.92 502.258 0.09 0 0 0 0 0 0 0 0 0 0 -2254.33 0 0 0 0 0 0 -771.126 0 0 0 0 -93.7681 0 0 591.678 0 0 0 0 0 0 0 0 0 
-1735.21 0 1576.66 0 0 1614.35 -541.322 0 0 0 0 0 0 0 0 -641.423 1775.95 0 0 0 0 -1102.4 2399.9 0 0 0 0 0 0 -1264.92 0 0 0.01 0 0 0 0 2445.68 0 0 0 0 0 -720.618 0 0 0 112.537 0 -1405.91 0 0 0 0 0 0 0 0 0 -2414.4 0 0 0 0 0 0 0 
0 0 -1472.9 0 0 0 0 665.075 0 0 0 0 1807.38 0 0 0 517.823 0 0 0 110.248 -317.316 0 0 0 0 0 0 0 0 2177.42 0 0 0.05 0 0 0 0 0 0 0 -2038.56 0 1713.39 0 0 0 0 0 0 0 0 0 0 0 0 330.744 -261.162 0 0 0 0 0 0 0 0 0 
0 1791.97 0 0 0 1196.4 0 0 0 1507.08 0 0 0 0 0 0 0 0 0 0 0 0 0 0 0 0 2295.37 0 231.559 2494.96 0 0 0 0 0 0 0 0 171.133 0 0 0 0 0 95.5992 -1130.33 -1313.29 -438.169 0 2111.19 0 0 0 0 0 1284.6 0 -434.812 0 0 0 0 0 0 -1206.63 0 0 
0 2008.8 0 0 -1188.47 0 0 0 0 0 0 0 1302.15 0 0 0 0 0 1708.66 0 0 0 0 0 0 0 0 0 1764.96 0 0 0 0 0 0 0.05 0 -1588.41 0 0 0 0 0 0 0 0 0 0 0 0 0 0 0 0 0 -2030.02 0 0 0 0 0 0 0 0 0 0 0 
0 -1311.76 2404.63 0 983.688 0 -1215.02 0 0 0 0 0 0 0 0 0 0 0 0 0 0 0 0 0 0 0 0 0 0 0 0 0 0 0 0 0 0.01 0 0 0 1947 0 0 0 0 0 0 0 0 0 0 0 0 0 0 -1863.99 0 2155.29 0 0 0 0 0 0 0 0 0 
0 0 0 0 0 0 0 0 0 0 0 -576.571 0 0 0 0 -1001.39 0 0 0 0 0 0 0 0 0 0 0 0 0 0 0 2127.06 0 0 -168.996 0 0.01 0 0 0 0 0 0 0 0 0 0 0 0 315.943 0 0 0 0 0 0 0 0 0 0 0 0 0 0 0 0 
0 0 0 0 0 0 0 0 0 0 0 0 0 0 0 0 0 0 0 0 0 0 0 0 0 2332.15 0 -1741.92 0 0 1302.76 0 0 0 1039.38 0 0 0 0.05 0 0 0 0 0 0 0 0 0 0 0 0 0 0 0 0 0 0 0 0 0 0 0 0 0 0 0 0 
0 0 0 1958.91 0 0 0 0 -104.144 0 0 1348.38 0 0 0 0 0 0 0 0 0 0 0 0 0 0 0 0 0 0 0 0 0 0 0 0 0 0 0 0.01 0 0 0 0 807.291 0 0 0 0 0 0 0 0 0 0 0 0 0 0 0 0 0 0 -911.817 0 0 0 
-757.698 0 0 0 0 0 0 0 0 0 0 0 0 0 0 -413.907 0 0 0 0 1155.35 0 0 0 0 1841.26 0 0 0 0 0 0 0 0 0 0 1390.65 0 0 0 0.03 0 0 0 0 0 0 0 0 0 0 0 2307.28 0 0 0 0 -640.965 0 0 0 0 0 0 0 -535.524 0 
1043.5 0 0 0 0 0 0 0 0 441.679 0 1739.02 0 0 0 0 0 0 0 0 0 0 0 0 0 0 0 0 0 0 0 0 0 285.882 0 0 0 0 0 0 0 0.06 0 0 0 0 0 913.8 0 1431.85 0 0 0 0 0 -564.821 0 653.783 0 0 0 0 0 1230.43 0 0 0 
0 0 0 0 0 0 0 0 0 0 1600.47 0 0 0 0 0 0 0 158.62 0 0 0 0 0 0 0 0 0 0 0 0 -19.4555 0 0 0 0 0 0 0 0 0 0 0.08 0 0 2241.81 0 0 0 0 0 0 0 0 0 0 0 1251.34 0 0 0 0 0 0 0 -2149.49 0 
0 0 0 0 0 0 0 0 0 1922.44 0 0 0 0 0 215.995 0 2443.69 436.644 0 -2063.43 0 0 0 0 0 0 0 0 0 0 0 -1838.51 973.617 0 0 0 0 0 0 0 0 0 0.05 0 0 0 0 0 1282.92 0 0 0 1514.86 -1898.33 0 0 0 0 0 -935.469 0 0 0 2364.5 0 0 
0 0 0 0 1057.08 0 0 0 0 0 958.51 0 0 0 1519.14 0 0 0 0 0 0 0 0 0 0 0 0 0 0 0 0 0 0 0 688.116 0 0 0 0 -2281.95 0 0 0 0 0.02 1013.75 0 0 552.309 0 -2063.43 0 0 0 0 0 0 0 0 0 -65.5385 0 0 0 0 2193.59 0 
0 0 0 -622.959 0 0 0 0 0 0 0 0 -1362.42 0 0 0 0 0 0 89.6481 0 0 2211.14 0 0 1924.57 0 0 0 0 0 0 0 0 -539.491 0 0 0 0 0 0 0 -1005.05 0 1973.4 0.07 0 0 1425.29 0 0 0 0 0 0 0 0 0 1155.96 0 -677.282 0 0 0 0 0 -972.854 
0 0 0 0 0 0 0 0 0 0 -1503.72 -1003.68 0 0 0 1255.76 -489.441 0 0 67.0644 1090.04 -1980.88 0 0 0 0 0 0 0 0 0 0 0 0 2397.31 0 0 0 0 0 0 0 0 0 0 0 0.03 0 0 0 2294.31 0 0 0 0 0 0 0 0 0 0 0 0 0 0 0 0 
0 0 0 0 0 0 0 0 -827.738 0 0 0 2077.17 0 0 0 0 0 0 0 0 0 0 0 0 0 492.645 0 0 0 0 0 -1041.06 0 1642.43 0 0 0 0 0 0 562.685 0 0 0 0 0 0.08 0 0 0 0 0 0 0 0 0 0 0 0 0 0 0 0 -568.178 0 -315.485 
0 0 0 828.806 0 0 0 127.186 0 0 2035.05 0 0 2411.04 0 0 0 0 0 0 0 0 0 0 0 0 0 0 0 0 0 0 0 0 0 0 0 0 0 0 0 0 0 0 2063.43 877.178 0 0 0.07 0 0 0 0 0 0 0 0 0 0 -1430.02 0 -2421.87 -1000.17 0 0 0 606.784 
1847.82 0 0 0 0 0 0 0 0 0 -1269.95 0 693.609 0 0 0 0 0 0 0 0 0 1764.35 0 0 0 0 0 0 0 0 -2022.69 -1112.63 0 1031.6 0 0 0 0 0 0 120.624 0 2123.4 0 0 0 0 0 0 0 0 0 86.4437 0 0 0 0 0 0 0 1572.24 0 0 0 0 0 
1351.44 -1551.18 0 0 0 0 0 -1373.71 0 0 0 0 0 0 0 0 -971.328 0 0 0 0 0 0 0 0 0 1435.67 0 1672.95 1943.34 0 0 0 0 0 0 0 595.645 0 0 0 0 0 0 1584.14 0 -1806.62 0 0 0 0.04 -405.82 0 0 0 0 0 0 0 0 0 0 0 0 0 0 0 
0 0 0 0 0 0 1777.32 0 0 0 0 0 1201.9 0 1799.75 0 0 594.272 0 0 -562.075 0 0 0 0 0 0 0 0 1583.22 0 0 0 0 0 0 0 0 0 0 0 0 0 0 0 0 0 0 0 0 1218.99 0.04 0 0 0 0 0 0 0 0 -888.012 0 0 1862.16 0 0 0 
0 0 1088.52 0 0 0 0 1781.9 0 0 0 0 0 0 0 0 0 0 0 1518.22 0 0 0 0 0 0 0 0 0 0 0 0 0 0 0 0 0 0 0 0 -472.961 0 0 0 0 0 0 0 0 0 0 0 0.08 0 0 0 0 0 0 0 0 0 0 0 489.441 0 0 
0 1831.8 0 852.306 0 0 0 0 0 0 0 0 0 0 0 0 0 0 -72.5578 0 0 0 0 0 0 0 0 0 0 0 0 0 0 0 0 0 0 0 0 0 0 0 0 1185.11 0 0 0 0 0 1958.75 0 0 0 0.06 0 0 0 0 0 0 0 0 0 0 0 0 -1883.53 
0 0 0 0 2441.1 0 0 0 1901.84 1395.84 0 0 0 0 0 0 0 0 0 0 0 0 0 0 0 0 0 0 0 0 0 -788.827 0 0 0 0 0 0 0 0 0 0 0 2197.26 0 0 0 0 0 0 0 0 0 0 0 0 0 0 -2302.39 0 0 0 0 0 0 0 -1664.56 
0 0 0 0 0 0 -1970.2 0 0 0 0 0 0 1814.71 466.094 0 0 0 0 0 0 818.43 0 0 0 0 0 0 0 0 -89.1903 0 0 0 1086.08 129.17 -742.134 0 0 0 0 -681.249 0 0 0 0 0 0 0 0 0 0 0 0 0 0.06 0 0 0 0 0 0 0 0 0 0 0 
0 0 0 1370.51 0 0 0 0 0 0 0 0 0 0 0 0 0 0 0 0 0 0 2398.07 0 1808.15 1747.87 0 0 0 0 0 0 0 -554.445 0 0 0 0 0 0 0 0 0 0 0 0 0 0 0 0 0 0 0 0 0 0 0.03 0 0 0 0 0 0 0 -604.038 599.765 321.436 
0 0 0 0 0 0 0 0 -1979.05 0 0 0 0 0 0 0 0 0 1010.54 1193.04 0 0 0 450.987 0 0 0 0 0 0 0 1462.37 0 -49.6689 1967.45 0 1395.08 0 0 0 1002.91 -2336.88 -931.349 0 0 0 0 0 0 0 0 0 0 0 0 0 0 0 0 0 0 0 0 0 0 -847.423 0 
0 2347.87 0 2459.26 0 0 0 0 0 0 0 0 0 0 0 0 0 0 0 0 0 0 0 0 2161.7 0 0 -969.344 0 0 0 0 0 0 0 0 0 0 0 0 0 0 0 0 0 -1313.59 0 0 0 0 0 0 0 0 2058.24 0 0 0 0.09 0 0 0 0 0 0 0 0 
0 2102.65 0 1535 0 0 0 0 0 0 0 1271.32 2370.6 -1429.72 0 0 0 0 0 0 0 0 0 0 -1511.81 0 0 0 0 0 0 0 1534.09 0 0 0 0 0 0 0 0 0 0 0 0 0 0 0 1722.69 0 0 0 0 0 0 0 0 0 0 0.02 0 0 0 0 0 0 0 
0 0 0 -2003.01 0 0 493.103 0 2392.12 0 0 0 0 0 0 0 2439.73 0 0 0 0 0 0 1793.95 0 0 0 0 0 0 0 0 0 0 0 0 0 0 0 0 0 0 0 2397.46 709.784 1475.04 0 0 0 0 0 1971.72 0 0 0 0 0 0 0 0 0.02 -1549.65 0 0 0 0 0 
438.169 0 0 0 0 0 0 0 0 0 0 0 0 1826.91 0 0 0 0 0 0 0 0 0 0 0 0 0 0 0 0 0 0 0 0 0 0 0 0 0 0 0 0 0 0 0 0 0 0 2483.37 -206.076 0 0 0 0 0 0 0 0 0 0 237.358 0.04 1815.47 0 0 -772.042 -442.289 
0 0 0 0 0 0 1678.9 0 0 0 0 0 0 0 0 -297.937 0 0 0 0 0 0 0 0 0 135.273 0 0 0 0 -2201.68 0 0 0 0 0 0 0 0 0 0 0 0 0 0 0 0 0 1575.29 0 0 0 0 0 0 0 0 0 0 0 0 1406.98 0.03 0 0 0 0 
0 0 0 0 0 0 0 0 0 0 0 0 0 0 0 0 0 0 0 0 177.236 0 0 0 0 990.097 1233.48 0 0 0 0 0 0 0 0 0 0 0 0 80.9503 0 -887.249 0 0 0 0 0 0 0 0 0 2034.75 0 0 0 0 0 0 0 0 0 0 0 0 1745.58 0 0 
-501.648 0 0 0 0 0 0 0 0 0 0 0 0 0 0 0 0 0 0 0 0 0 0 0 0 0 0 0 0 0 0 0 0 0 2400.81 0 0 0 0 0 0 0 0 574.587 0 0 0 1991.41 0 0 0 0 1603.67 0 0 0 1554.23 0 0 0 0 0 0 1341.82 0 -1255.3 0 
0 0 0 0 0 0 0 0 0 0 0 0 -328.608 0 0 0 0 0 0 0 2042.38 2250.66 0 0 0 0 2239.68 0 0 0 0 0 0 0 0 0 0 0 0 0 2175.13 0 -955.611 0 -2197.1 0 0 0 0 0 0 0 0 0 0 0 -639.744 312.128 0 0 0 -652.562 0 0 201.041 0.01 0 
0 0 0 0 0 353.175 0 0 0 1090.2 0 0 0 0 0 0 0 0 0 0 0 1674.17 0 0 0 0 0 0 0 0 0 0 0 0 0 0 0 0 0 0 0 0 0 0 0 282.067 0 -1266.59 -1792.43 0 0 0 0 1439.48 14.42 0 -1753.21 0 0 0 0 803.781 0 0 0 0 0.07 
