*Vertices 34
*Matrix 
0.06 0 0 0 0 0 0 0 0 1388.06 1606.57 0 0 2442.78 1492.43 0 0 -1946.39 0 0 0 2287.44 0 0 0 0 1784.49 0 0 0 0 0 2424.77 0 
0 0.09 0 0 0 0 0 1650.36 1163.44 0 0 0 0 0 0 1811.81 0 0 0 0 1539.28 0 0 0 2340.54 851.39 0 0 0 0 0 0 175.405 0 
0 0 0.03 0 0 0 0 0 2220.91 194.021 0 0 0 0 2468.87 -2017.04 173.727 -1854.69 -1964.86 0 1267.51 0 1144.83 0 -2476.96 965.987 0 0 0 0 0 0 0 791.726 
0 0 0 0.01 0 0 0 0 0 0 0 0 -1397.98 0 0 0 0 -2326.81 2378.99 0 0 0 0 0 0 0 0 0 0 0 736.03 1816.23 0 0 
0 0 0 0 0.05 0 0 0 1705.45 -341.426 0 0 0 0 0 0 2094.56 -840.098 0 -2346.19 517.67 0 2142.17 0 0 0 0 -1018.63 588.168 0 0 0 0 0 
0 0 0 0 0 0.07 1107.14 0 813.852 0 0 0 0 -817.209 0 0 0 0 0 376.217 516.755 0 -1116.6 0 0 -659.581 0 0 0 0 0 0 0 2114.4 
0 0 0 0 0 910.443 0.05 0 0 0 0 0 1977.52 383.236 0 0 0 0 0 0 0 0 0 0 -2385.4 0 -1221.27 0 1184.19 -693.152 0 0 0 218.894 
0 1249.05 0 0 0 0 0 0.02 0 334.712 1949.14 0 0 0 0 0 0 0 0 895.184 1634.65 0 0 0 0 0 0 2064.65 0 0 0 0 0 0 
0 -234.001 -795.389 0 -738.319 1790.44 0 0 0.07 0 2396.54 0 0 0 0 425.504 0 0 0 0 0 0 0 0 0 646.916 0 1836.53 2439.27 -62.1815 0 -2448.58 0 0 
1935.71 0 -1962.42 0 -963.698 0 0 111.927 0 0.02 0 0 0 0 0 0 179.525 -928.297 -636.082 0 0 0 665.075 0 2378.23 1197.62 -1263.24 2274.32 1572.24 1673.86 0 0 0 -1982.86 
1389.74 0 0 0 0 0 0 1040.3 204.703 0 0.04 1169.55 1292.08 0 1282.01 -1633.43 0 0 0 895.642 0 0 0 0 0 0 0 0 0 0 2237.39 1905.19 0 0 
0 0 0 0 0 0 0 0 0 0 2121.11 0.05 0 0 0 0 0 1540.96 0 -1445.74 0 517.975 0 0 2387.08 -334.254 1745.43 -214.316 0 0 0 120.472 -2052.29 2484.74 
0 0 0 2084.34 0 0 2010.64 0 0 0 13.3518 0 0.09 -105.518 0 0 0 2499.39 0 0 -1936.78 0 0 2487.33 -521.638 0 0 0 0 0 0 0 0 0 
261.925 0 0 0 0 -356.99 2382.35 0 0 0 0 0 -1528.29 0.01 0 0 0 0 0 94.3785 755.409 0 0 147.176 -50.8896 1617.1 0 0 2028.18 0 -445.341 0 0 0 
1066.09 0 -293.054 0 0 0 0 0 0 0 2333.52 0 0 0 0.08 0 0 0 0 0 -865.886 290.918 0 -1170.46 0 0 0 0 1336.94 2330.01 0 0 -848.796 -1914.2 
0 1865.37 -831.706 0 0 0 0 0 -560.396 0 4.34889 0 0 0 0 0.02 0 -1206.47 425.352 0 1747.87 0 0 0 1252.71 0 -489.288 0 0 895.795 0 0 0 0 
0 0 2210.68 0 924.635 0 0 0 0 -485.015 0 0 0 0 0 0 0.03 0 0 0 0 0 0 1561.56 479.064 384.152 -462.889 1468.93 0 0 0 -1082.72 446.409 1664.4 
709.937 0 367.061 2079.15 182.119 0 0 0 0 -44.3281 0 915.326 450.224 0 0 275.048 0 0.09 0 0 0 0 0 1405.15 0 0 0 0 0 0 0 0 0 0 
0 0 -1956.62 -54.3992 0 0 0 0 0 1379.82 0 0 0 0 0 1523.87 0 0 0.02 431.455 0 0 2487.03 0 0 680.639 455.718 0 0 0 2039.63 0 2250.82 2143.09 
0 0 0 0 221.641 1773.81 0 955.916 0 0 1601.38 1169.09 0 1326.41 0 0 0 0 1726.2 0.02 0 0 0 0 0 1669.44 0 0 0 0 -1000.78 0 0 0 
0 2035.66 1638.16 0 1619.54 114.826 0 -267.571 0 0 0 0 1271.78 85.9859 400.327 -2266.69 0 0 0 0 0.05 427.335 0 0 0 0 -1060.9 -1900.46 0 2247.76 0 0 0 1274.38 
-1109.42 0 0 0 0 0 0 0 0 0 0 2421.11 0 0 874.889 0 0 0 0 0 2061.91 0 0 0 0 0 0 -339.29 450.682 0 0 1811.5 0 0 
0 0 2414.85 0 1429.11 -1699.65 0 0 0 -316.095 0 0 0 0 0 0 0 0 -1936.17 0 0 0 0 -2170.25 0 0 1519.75 0 0 0 0 0 0 1641.97 
0 0 0 0 0 0 0 0 0 0 0 0 334.559 829.264 -655.156 0 331.507 957.137 0 0 0 0 2307.12 0.02 1235.01 0 0 -30.2896 0 0 1263.7 0 0 0 
0 -1010.09 1763.13 0 0 0 -2345.88 0 0 1912.37 0 -771.432 85.3755 742.897 0 757.851 -320.368 0 0 0 0 0 0 2380.98 0.02 0 0 2126.91 0 0 0 0 0 0 
0 -2304.53 -104.297 0 0 300.531 0 0 1013.29 1330.99 0 728.248 0 1934.95 0 0 1708.35 0 1825.85 1119.5 0 0 0 0 0 0.08 0 0 0 0 0 2089.07 768.227 0 
1141.16 0 0 0 0 0 -911.206 0 0 1043.81 0 -512.94 0 0 0 1640.6 1795.02 0 -241.325 0 -1800.52 0 -14.5726 0 0 0 0.05 1353.42 1255.61 443.815 0 0 2080.52 0 
0 0 0 0 718.635 0 0 1230.89 -250.023 1817 0 1408.51 0 0 0 0 -268.334 0 0 0 1531.19 892.743 0 -2493.13 995.895 0 -2016.59 0.05 0 0 387.509 -1334.65 2305.9 2374.11 
0 0 0 0 902.814 0 1650.67 0 -168.691 -1641.67 0 0 0 1682.87 1882.92 0 0 0 0 0 0 1268.12 0 0 0 0 1954.33 0 0.08 0 0 0 -155.263 0 
0 0 0 0 0 0 661.718 0 -359.432 417.875 0 0 0 0 -1647.16 1514.86 0 0 0 0 -457.854 0 0 0 0 0 2422.33 0 0 0.03 0 0 0 0 
0 0 0 1291.16 0 0 0 0 0 0 -1976 0 0 1795.79 0 0 0 0 503.327 2437.28 0 0 0 421.079 0 0 0 1962.11 0 0 0.07 0 0 1871.62 
0 0 0 1587.19 0 0 0 0 -1645.94 0 952.101 80.6452 0 0 0 0 -1229.36 0 0 0 0 584.811 0 0 0 -577.487 0 2348.17 0 0 0 0.03 0 0 
492.798 1200.98 0 0 0 0 0 0 0 0 0 510.041 0 0 932.264 0 2177.11 0 1483.73 0 0 0 0 0 0 -2402.8 -756.783 -1200.83 -1021.99 0 0 0 0.09 0 
0 0 1680.58 0 0 1882.92 62.0289 0 0 2487.49 0 -254.295 0 0 -1647.16 0 541.169 0 1305.51 0 -484.1 0 2113.48 0 0 0 0 1653.11 0 0 -1310.54 0 0 0.01 
