*Vertices 75
*Matrix 
0.08 0 0 0 0 0 0 0 0 0 0 0 0 0 184.713 0 0 0 0 -472.503 0 0 0 0 0 2295.98 1573 -1271.48 0 0 0 0 0 0 0 0 -1746.04 0 0 719.55 0 0 0 2292.63 0 0 0 -154.805 0 0 3.43333 0 1820.96 0 699.255 0 2435.45 0 0 0 0 0 0 0 0 -2254.02 0 0 2403.71 0 0 0 0 0 0 
0 0.06 0 0 0 0 0 0 0 0 0 0 0 0 0 0 0 0 427.335 0 0 0 674.078 0 0 0 0 2348.02 -205.924 0 0 0 0 0 0 0 0 0 0 0 0 0 0 0 0 0 0 0 0 0 78.814 0 0 0 0 0 0 0 0 0 0 0 0 0 0 0 0 0 0 0 0 0 0 0 0 
0 0 0.05 0 0 0 540.101 0 0 0 0 0 0 0 0 0 1743.14 0 0 0 0 -2087.24 0 0 0 0 0 0 0 0 0 0 0 0 0 0 0 0 0 0 0 0 0 0 0 0 0 0 0 0 1916.64 0 0 0 0 0 0 0 0 0 0 0 0 1068.83 0 1919.39 0 0 0 0 0 0 0 0 0 
0 0 0 0.09 0 2228.84 0 259.026 0 0 0 0 0 0 0 1851.18 1111.71 0 0 0 0 0 0 0 0 0 0 0 0 0 0 0 0 0 0 0 -958.815 0 0 0 0 0 0 0 0 0 0 0 0 0 0 0 0 1093.4 0 -2314.29 0 0 0 0 0 0 0 0 2269.43 0 -1366.7 0 0 0 0 0 0 0 0 
0 0 0 0 0.01 0 0 0 1992.63 0 0 0 891.522 0 0 0 0 0 1463.44 2137.29 0 0 0 0 0 0 0 0 0 0 -1471.37 0 0 2297.66 0 0 -428.251 0 0 0 0 0 0 0 -2038.26 0 901.44 0 -1930.68 554.598 0 0 0 0 0 63.86 0 0 0 0 0 0 0 0 0 0 0 -1410.34 0 0 0 0 0 0 0 
0 0 0 379.116 0 0.08 0 0 0 0 0 0 0 0 315.485 0 0 0 0 0 0 -2249.44 0 0 904.187 0 0 0 0 0 0 0 0 0 0 0 0 0 2062.97 0 0 0 0 0 787.454 0 0 -2483.83 0 0 0 0 0 0 2499.08 0 0 0 0 0 0 0 0 0 0 2260.12 0 0 0 0 0 0 0 0 0 
0 0 1094.93 0 0 0 0.04 0 0 -1325.04 950.27 0 0 0 0 0 0 0 0 903.272 0 0 0 0 0 0 0 0 0 0 0 0 0 0 -620.67 0 0 1726.81 0 0 -1569.64 0 0 0 0 0 0 0 0 0 0 0 0 1905.5 0 0 0 0 -850.017 0 0 0 0 0 0 0 -522.553 0 0 0 0 0 0 0 0 
0 0 0 900.22 0 0 0 0.01 0 1433.84 1136.13 0 0 0 0 0 0 -1385.46 0 0 1473.2 0 0 0 0 0 0 0 0 0 0 0 0 0 1341.21 0 0 0 0 0 0 0 0 0 -2246.7 0 0 0 0 0 0 0 -1656.77 0 0 1587.04 0 0 0 0 0 0 0 0 -1435.82 0 0 0 0 0 0 0 0 0 0 
0 0 0 0 -1332.06 0 0 0 0.09 0 0 0 0 0 0 0 0 0 0 2104.48 0 0 0 0 0 0 0 0 0 0 0 0 0 0 0 0 0 0 0 0 0 0 0 340.358 0 0 -2481.23 0 0 0 0 0 0 0 0 0 0 849.101 0 0 0 0 1785.87 0 0 1625.34 0 0 0 0 0 780.74 0 0 0 
0 0 0 0 0 0 -888.47 2347.25 0 0.07 0 0 0 0 0 0 0 0 0 0 0 0 0 0 0 0 0 0 0 0 0 0 0 0 0 0 0 0 0 0 -1142.08 0 0 0 0 0 0 2370.3 -2211.29 0 0 1606.11 0 0 0 0 0 0 2480.16 0 0 0 0 0 0 0 0 0 0 0 0 0 837.352 0 0 
0 0 0 0 0 0 2051.53 -1677.22 0 0 0.07 0 0 0 0 -436.949 0 0 0 421.232 0 0 0 0 0 0 0 0 0 0 0 0 0 0 0 0 0 0 0 0 0 0 0 0 0 0 -1540.8 0 2430.57 0 0 0 0 0 0 0 0 0 0 0 -1403.47 0 0 0 293.97 0 0 0 1317.41 0 0 0 1889.93 0 0 
0 0 0 0 0 0 0 0 0 0 0 0.07 0 0 0 0 -827.586 -546.663 0 1317.26 0 0 0 0 0 0 0 0 0 0 0 0 0 0 0 949.507 1220.36 0 0 0 131.001 0 0 0 0 -2308.95 0 0 -1879.71 0 0 0 0 0 0 0 0 0 1255.91 1452.76 0 0 0 0 0 0 0 0 0 0 0 0 0 0 0 
0 0 0 0 -1619.69 0 0 0 0 0 0 0 0.02 0 0 0 0 0 0 0 0 0 0 0 0 1993.39 0 0 0 0 0 0 0 0 0 0 0 0 0 922.651 0 0 0 0 960.189 0 0 0 0 0 0 0 90.7163 0 0 2376.25 0 0 0 0 0 0 0 0 0 0 0 0 0 0 0 0 0 0 0 
0 0 0 0 0 0 0 0 0 0 0 0 0 0 0 0 0 0 0 0 0 0 0 0 0 0 0 0 1609.16 0 0 0 0 1041.98 0 0 0 0 0 0 0 0 0 0 0 0 1694.92 0 0 -1353.88 0 0 0 0 0 671.789 1372.49 0 0 0 0 0 0 0 0 0 0 1429.41 0 0 0 0 0 0 0 
768.075 0 0 0 0 -1532.11 0 0 0 0 0 0 0 0 0.05 0 0 0 0 0 0 0 0 0 0 0 0 0 0 0 0 0 1588.56 0 0 0 836.741 0 0 0 0 0 0 0 0 0 0 0 0 0 0 0 0 0 0 0 0 0 0 0 0 0 0 0 2061.45 0 0 0 0 0 0 0 0 0 0 
0 0 0 -2017.04 0 0 0 0 0 0 752.51 0 0 0 0 0.09 0 0 0 0 -402.463 0 0 0 0 0 941.878 -1514.56 0 0 1738.87 0 0 0 0 2380.83 0 0 0 0 0 0 0 -653.325 -1047.93 2123.55 0 0 0 0 0 0 990.555 0 0 0 0 0 0 0 0 0 0 -1547.98 0 0 0 0 0 0 0 0 0 0 0 
0 0 2498.47 976.058 0 0 0 0 0 0 0 171.743 0 0 0 0 0 0 0 0 0 0 0 0 0 0 0 0 2130.57 0 0 0 0 0 0 0 333.949 0 0 -1919.23 944.319 0 0 0 0 0 1710.18 0 0 0 0 0 0 0 0 0 0 0 0 0 0 0 0 0 -405.82 0 0 1647.47 0 -1951.12 0 0 0 0 0 
0 0 0 0 0 0 0 -2492.07 0 0 0 636.235 0 0 0 0 0 0.08 0 0 0 0 0 0 0 0 0 0 0 0 0 0 0 0 0 0 0 0 0 1581.39 0 0 0 0 1853.62 0 0 0 0 2110.28 837.962 0 0 0 0 0 0 0 0 0 0 0 0 0 0 0 0 0 0 0 0 0 0 0 0 
0 499.359 0 0 1582.61 0 0 0 0 0 0 0 0 0 0 0 0 0 0.06 0 0 0 0 0 130.696 0 0 0 0 0 0 0 0 0 0 0 0 0 1960.43 901.288 0 0 0 0 0 0 0 0 0 0 1896.95 -1912.82 0 0 0 0 0 0 837.809 0 0 0 0 0 0 -27.6955 0 0 0 0 0 0 0 0 0 
1572.54 0 0 0 1315.27 0 280.694 0 -1149.56 0 1567.66 -1766.95 0 0 0 0 0 0 0 0.02 304.956 0 0 0 0 1517.61 0 0 0 0 835.673 0 0 0 0 0 1714.91 0 0 0 0 0 0 0 0 -1079.06 0 0 0 328.608 510.498 0 0 0 0 0 1782.05 0 0 0 0 0 0 0 0 -220.725 0 0 0 0 0 0 0 0 0 
0 0 0 0 0 0 0 -1995.38 0 0 0 0 0 0 0 1688.06 0 0 0 1925.18 0.02 0 0 0 0 -1371.12 0 0 0 0 0 0 1464.51 467.162 0 0 0 0 -962.783 0 0 0 0 0 0 0 0 0 0 0 0 0 0 0 0 0 0 0 0 0 0 0 1154.9 0 0 0 0 0 0 0 0 0 0 0 0 
0 0 2483.67 0 0 2021.77 0 0 0 0 0 0 0 0 0 0 0 0 0 0 0 0.03 0 0 0 0 2335.35 0 0 0 0 0 0 1403.62 0 0 0 0 0 0 0 0 0 0 0 0 0 0 0 0 0 0 0 0 0 -610.141 0 0 0 0 0 -2394.56 0 -308.313 0 0 0 0 0 0 0 0 0 0 0 
0 1823.86 0 0 0 0 0 0 0 0 0 0 0 0 0 0 0 0 0 0 0 0 0.08 0 0 0 0 0 0 0 1808.15 0 0 0 0 0 0 52.1104 0 0 0 0 0 0 1066.24 0 0 0 0 0 0 1364.56 0 0 0 0 -2413.17 -812.326 0 0 0 0 0 0 0 0 0 0 870.769 0 0 0 0 0 0 
0 0 0 0 0 0 0 0 0 0 0 0 0 0 0 0 0 0 0 0 0 0 0 0.05 0 698.035 0 0 1700.26 0 0 0 -676.824 0 0 0 0 0 1745.58 0 0 0 -1632.82 0 0 0 0 -446.257 1496.55 0 0 0 0 0 0 0 0 0 0 0 0 -196.005 0 0 0 0 0 0 0 0 0 0 0 0 0 
0 0 0 0 0 63.86 0 0 0 0 0 0 0 0 0 0 0 0 731.91 0 0 0 0 0 0.02 0 0 0 0 0 0 1055.71 0 0 0 0 0 683.386 -1977.37 0 0 0 0 0 0 0 0 -942.03 0 0 1431.39 0 -232.322 0 0 0 0 0 0 0 0 0 0 0 0 0 462.432 0 0 0 0 0 0 0 0 
-1510.44 0 0 0 0 0 0 0 0 0 0 0 45.5489 0 0 0 0 0 0 2318.72 -1478.24 0 0 885.113 0 0.06 0 0 0 0 0 0 0 602.359 0 0 0 0 0 0 0 0 0 0 0 0 0 0 0 0 0 0 2040.24 73.3207 0 0 0 0 0 0 0 0 0 0 0 -2480.32 0 0 0 0 0 0 0 0 0 
-173.727 0 0 0 0 0 0 0 0 0 0 0 0 0 0 714.057 0 0 0 0 0 -694.525 0 0 0 0 0.03 971.633 0 0 0 0 0 0 1695.23 0 0 0 0 0 0 0 0 0 163.35 0 -2105.7 0 0 -2100.82 0 0 0 0 0 759.682 0 0 0 0 0 0 1464.96 0 0 0 0 2359.31 0 0 0 0 0 0 0 
-1439.02 322.352 0 0 0 0 0 0 0 0 0 0 0 0 0 -297.021 0 0 0 0 0 0 0 0 0 0 1443.14 0.07 0 0 0 518.586 0 0 0 0 0 0 0 0 0 0 0 1764.5 0 0 1498.99 0 2254.17 0 0 0 0 0 0 0 0 0 0 0 0 0 0 0 0 0 2071.37 0 0 0 0 0 0 0 0 
0 1323.82 0 0 0 0 0 0 0 0 0 0 0 -167.623 0 0 -49.8215 0 0 0 0 0 0 2428.43 0 0 0 0 0.08 0 0 0 0 0 0 0 0 0 0 0 0 1786.32 0 -1056.78 0 0 0 0 0 0 592.135 0 0 -975.295 0 -1030.69 1238.98 0 0 0 0 0 0 0 0 0 0 0 0 0 0 0 0 0 0 
0 0 0 0 0 0 0 0 0 0 0 0 0 0 0 0 0 0 0 0 0 0 0 0 0 0 0 0 0 0 0 0 0 0 0 0 0 0 0 -2238.15 0 1467.56 0 0 0 0 0 0 2404.78 0 0 0 0 2041 0 0 0 0 0 458.312 0 0 0 0 0 0 0 0 0 0 0 0 0 0 0 
0 0 0 0 1221.73 0 0 0 0 0 0 0 0 0 0 -970.87 0 0 0 780.282 0 0 1275.75 0 0 0 0 0 0 0 0.09 0 2286.98 301.447 0 2294.61 0 0 0 0 0 0 0 0 0 0 0 -1578.34 0 0 1511.81 0 0 0 0 0 0 0 0 0 0 0 0 0 0 0 0 0 0 0 0 0 0 0 0 
0 0 0 0 0 0 0 0 0 0 0 0 0 0 0 0 0 0 0 0 0 0 0 0 -329.218 0 0 1626.41 0 0 0 0.04 0 0 0 0 946.455 -2370.14 0 0 1839.58 -1302.3 0 -1695.07 0 0 0 0 980.331 0 0 0 0 0 0 2444.61 0 0 0 0 0 0 1562.62 0 0 0 0 0 0 0 0 0 0 0 0 
0 0 0 0 0 0 0 0 0 0 0 0 0 0 2182.61 0 0 0 0 0 1361.96 0 0 1864.15 0 0 0 0 0 0 -1398.89 0 0.01 0 0 0 0 -883.435 0 0 0 0 0 -163.198 0 0 0 0 0 0 0 0 0 -475.86 0 0 0 0 0 0 -66.7592 0 -1559.72 0 0 0 0 0 2411.95 0 0 0 0 0 0 
0 0 0 0 -527.284 0 0 0 0 0 0 0 0 901.746 0 0 0 0 0 0 -1939.38 1507.39 0 0 0 90.1059 0 0 0 0 -152.821 0 0 0.04 0 1596.96 0 0 0 -1088.82 0 -1973.4 0 0 0 0 0 0 0 0 0 -1633.73 0 0 0 1298.79 2306.51 0 0 1326.26 0 0 0 0 0 0 1528.44 0 0 0 0 0 0 -753.883 0 
0 0 0 0 0 0 694.22 421.842 0 0 0 0 0 0 0 0 0 0 0 0 0 0 0 0 0 0 251.701 0 0 0 0 0 0 0 0.08 0 0 0 0 0 0 0 0 0 1074.02 1685.77 0 -132.374 0 0 0 0 0 0 -2224.57 0 0 0 0 0 0 0 0 0 0 0 0 0 -476.775 0 0 0 0 0 0 
0 0 0 0 0 0 0 0 0 0 0 -2439.27 0 0 0 1504.18 0 0 0 0 0 0 0 0 0 0 0 0 0 0 1539.43 0 0 2253.56 0 0.02 0 0 0 0 0 0 0 0 -1048.69 0 0 1451.38 0 0 0 0 0 0 0 0 0 0 0 0 0 0 0 0 0 0 0 0 1664.25 0 0 0 0 0 0 
-241.935 0 0 -2258.9 542.238 0 0 0 0 0 0 339.442 0 0 -676.214 0 2375.33 0 0 703.07 0 0 0 0 0 0 0 0 0 0 0 1756.26 0 0 0 0 0.01 0 0 0 0 0 0 -2421.57 0 -899.304 0 0 0 0 0 1187.86 0 0 0 0 0 0 0 0 0 0 0 512.787 0 0 0 0 0 0 0 0 0 0 0 
0 0 0 0 0 0 2200.61 0 0 0 0 0 0 0 0 0 0 0 0 0 0 0 1165.58 0 1696.45 0 0 0 0 0 0 -1.29704 -795.389 0 0 0 0 0.02 0 0 0 0 0 2181.54 0 0 0 0 0 639.134 0 0 0 0 0 0 0 0 0 1598.18 0 0 0 0 0 0 142.293 0 161.824 0 0 0 0 0 0 
0 0 0 0 0 -2088.76 0 0 0 0 0 0 0 0 0 0 0 0 1920.61 0 -788.827 0 0 829.112 2029.86 0 0 0 0 0 0 0 0 0 0 0 0 0 0.04 0 0 231.559 0 -191.885 0 2122.18 1721.17 0 1515.78 0 0 0 0 0 0 0 0 0 0 0 -1511.05 0 229.423 -2374.42 0 0 0 0 2041.76 0 0 0 0 0 0 
619.144 0 0 0 0 0 0 0 0 0 0 0 2054.12 0 0 0 1327.02 -2426.76 -2342.52 0 0 0 0 0 0 0 0 0 0 2017.35 0 0 0 2311.85 0 0 0 0 0 0.04 0 1065.17 0 0 0 0 0 0 0 0 0 0 0 0 0 0 0 0 0 773.263 0 0 -2497.71 0 0 0 0 0 0 0 0 0 0 0 0 
0 0 0 0 0 0 2238.91 0 0 -1144.67 0 -243.767 0 0 0 0 -1240.65 0 0 0 0 0 0 0 0 0 0 0 0 0 0 1421.93 0 0 0 0 0 0 0 0 0.01 0 0 0 0 0 0 0 0 0 0 2262.11 0 0 0 0 0 0 0 0 0 0 0 0 0 0 785.623 0 0 0 0 0 0 0 0 
0 0 0 0 0 0 0 0 0 0 0 0 0 0 0 0 0 0 0 0 0 0 0 0 0 0 0 0 -1151.84 1622.75 0 -34.257 0 646.306 0 0 0 0 -1889.32 1504.33 0 0.08 0 0 243.919 0 0 0 0 0 0 0 0 0 1963.79 0 0 0 1322.9 2264.55 0 0 0 0 0 0 0 0 0 0 0 0 0 0 2276.6 
0 0 0 0 0 0 0 0 0 0 0 0 0 0 0 0 0 0 0 0 0 0 0 895.337 0 0 0 0 0 0 0 0 0 0 0 0 0 0 0 0 0 0 0.07 0 0 0 0 0 0 784.555 0 0 0 0 0 0 0 -208.975 0 0 0 0 0 1080.28 0 0 0 0 0 0 0 0 0 0 0 
1406.37 0 0 0 0 0 0 0 1298.94 0 0 0 0 0 0 -1618.32 0 0 0 0 0 0 0 0 0 0 0 1824.78 -1826.15 0 0 1210.44 984.146 0 0 0 -1582.31 717.261 910.443 0 0 0 0 0.09 0 0 0 1873.45 0 0 0 -2092.12 0 0 0 0 0 0 0 0 -514.161 0 747.932 2369.69 0 0 0 0 0 0 0 0 0 0 0 
0 0 0 0 1261.25 -198.599 0 -1854.53 0 0 0 0 682.165 0 0 1366.08 0 933.485 0 0 0 0 -1324.43 0 0 0 11.6733 0 0 0 0 0 0 0 -1820.2 2278.13 0 0 0 0 0 1255 0 0 0 0 0 0 0 -2387.54 0 0 0 0 0 0 0 0 0 0 0 0 0 0 0 0 0 0 0 0 0 0 0 0 0 
0 0 0 0 0 0 0 0 0 0 0 2129.05 0 0 0 -2138.51 0 0 0 -700.934 0 0 0 0 0 0 0 0 0 0 0 0 0 0 -355.007 0 2390.44 0 1241.26 0 0 0 0 0 0 0.08 1670.51 0 0 0 1457.49 0 0 0 -688.879 0 0 0 1670.2 0 -177.847 0 0 0 0 -2181.23 0 0 0 0 0 0 0 0 0 
0 0 0 0 1773.05 0 0 0 1144.98 0 224.387 0 0 -1590.85 0 0 1091.11 0 0 0 0 0 0 0 0 0 -758.156 -589.846 0 0 0 0 0 0 0 0 0 0 2124.93 0 0 0 0 0 0 -22.5074 0.05 0 0 1348.54 0 0 0 0 0 0 0 0 -1083.48 0 0 0 0 1427.43 0 0 0 0 0 0 -2340.39 0 0 0 0 
1536.68 0 0 0 0 -330.744 0 0 0 174.032 0 0 0 0 0 0 0 0 0 0 0 0 0 -750.832 -434.812 0 0 0 0 0 340.968 0 0 0 -295.038 570.467 0 0 0 0 0 0 0 2275.54 0 0 0 0.03 0 0 0 2317.8 0 0 0 0 0 0 0 0 0 0 763.039 515.076 0 -718.635 0 0 0 0 0 0 0 0 2172.69 
0 0 0 0 -728.706 0 0 0 0 -290.46 2297.97 -669.195 0 0 0 0 0 0 0 0 0 0 0 -149.007 0 0 0 539.338 0 -124.592 0 272.607 0 0 0 0 0 0 2417.75 0 0 0 0 0 0 0 0 0 0.07 0 -1677.37 0 0 -565.737 0 -1537.29 0 0 0 1441.77 0 0 0 0 0 0 0 1209.83 0 0 0 0 0 0 0 
0 0 0 0 1925.03 0 0 0 0 0 0 0 0 -519.501 0 0 0 1726.51 0 541.627 0 0 0 0 0 0 1557.44 0 0 0 0 0 0 0 0 0 0 -765.481 0 0 0 0 1422.7 0 -1351.13 0 -203.482 0 0 0.04 0 -2165.06 1618.32 -1564.61 0 0 1686.22 0 0 0 1450.32 0 0 0 0 0 1289.18 0 0 714.209 0 0 0 0 0 
-1480.07 -1666.54 2106.92 0 0 0 0 0 0 0 0 0 0 0 0 0 0 1424.07 1139.48 -1298.79 0 0 0 0 1132.47 0 0 0 1731.85 0 480.895 0 0 0 0 0 0 0 0 0 0 0 0 0 0 -1480.07 0 0 832.926 0 0.07 0 0 0 0 1290.86 0 0 0 0 0 0 0 0 0 -302.973 -2309.11 0 0 0 0 0 0 0 1751.69 
0 0 0 0 0 0 0 0 0 -954.695 0 0 0 0 0 0 0 0 1923.35 0 0 0 226.066 0 0 0 0 0 0 0 0 0 0 1355.25 0 0 1435.36 0 0 0 1649.45 0 0 -525.147 0 0 0 -1238.98 0 86.9015 0 0 0 0 0 0 0 0 0 0 0 0 0 949.965 0 0 0 607.089 0 0 0 0 0 0 0 
-451.14 0 0 0 0 0 0 -631.962 0 0 0 0 -475.402 0 0 1768.47 0 0 0 0 0 0 0 0 1578.04 -1006.12 0 0 0 0 0 0 0 0 0 0 0 0 0 0 0 0 0 0 0 0 0 0 0 -590.762 0 0 0.08 -255.211 0 -104.755 0 0 0 0 0 0 0 0 0 0 0 0 844.218 0 0 0 0 0 0 
0 0 0 1180.68 0 0 -1819.9 0 0 0 0 0 0 0 0 0 0 0 0 0 0 0 0 0 0 852.611 0 0 612.278 2141.56 0 0 1443.6 0 0 0 0 0 0 0 0 0 0 0 0 0 0 0 1622.59 -908.917 0 0 1025.8 0.06 0 0 0 0 0 0 0 0 0 -1634.95 0 0 2495.27 0 0 0 0 0 0 0 0 
-1668.83 0 0 0 0 2382.05 0 0 0 0 0 0 0 0 0 0 0 0 0 0 0 0 0 0 0 0 0 0 0 0 0 0 0 0 -567.721 0 0 0 0 0 0 499.359 0 0 0 1594.82 0 0 0 0 0 0 0 0 0.06 -1634.5 0 0 0 0 0 0 0 0 0 0 436.338 0 0 0 2262.26 0 2128.59 0 0 
0 0 0 241.478 -1782.36 0 0 1507.69 0 0 0 0 2464.9 1853.77 0 0 0 0 0 0 0 -1763.13 0 0 0 0 1208.15 0 660.344 0 0 85.3755 0 -2118.98 0 0 0 0 0 0 0 0 0 0 0 0 0 0 2246.39 0 -830.332 0 -525.605 0 2012.16 0.06 0 0 0 0 0 0 0 0 0 0 0 0 0 0 0 0 0 0 0 
2312.77 0 0 0 0 0 0 0 0 0 0 0 0 2128.59 0 0 0 0 0 -2209.46 0 0 1871.62 0 0 0 0 0 2252.49 0 0 0 0 1505.86 0 0 0 0 0 0 0 0 0 0 0 0 0 0 0 2349.85 0 0 0 0 0 0 0.09 -1528.14 0 0 611.667 0 0 0 0 0 0 0 2441.71 0 0 0 0 0 0 
0 0 0 0 0 0 0 0 1841.41 0 0 0 0 0 0 0 0 0 0 0 0 0 887.402 0 0 0 0 0 0 0 0 0 0 0 0 0 0 0 0 0 0 0 2387.23 0 0 0 0 0 0 0 0 0 0 0 0 0 51.9578 0.01 0 0 -978.042 0 0 0 0 0 0 0 0 0 0 0 0 0 0 
0 0 0 0 0 0 2472.99 0 0 -1603.67 0 222.861 0 0 0 0 0 0 2023.76 0 0 0 0 0 0 0 0 0 0 0 0 0 0 0 0 0 0 0 0 0 0 -1236.84 0 0 0 670.415 1066.24 0 0 0 0 0 0 0 0 0 0 0 0.01 0 0 0 0 0 0 0 0 -906.018 -790.048 0 0 0 0 0 0 
0 0 0 0 0 0 0 0 0 0 0 1531.95 0 0 0 0 0 0 0 0 0 0 0 0 0 0 0 0 0 -1142.99 0 0 0 -327.998 0 0 0 -371.029 0 2217.09 0 -2178.49 0 0 0 0 0 0 1668.52 0 0 0 0 0 0 0 0 0 0 0.07 0 0 2300.71 0 0 0 0 0 1200.06 0 0 0 0 0 0 
0 0 0 0 0 0 0 0 0 0 -1406.67 0 0 0 0 0 0 0 0 0 0 0 0 0 0 0 0 0 0 0 0 0 1801.28 0 0 0 0 0 2143.24 0 0 0 0 -1486.33 0 -2219.08 0 0 0 1502.96 0 0 0 0 0 0 9.38444 363.704 0 0 0.06 0 0 0 0 0 0 927.076 0 0 0 0 0 0 0 
0 0 0 0 0 0 0 0 0 0 0 0 0 0 0 0 0 0 0 0 0 2325.89 0 -1788 0 0 0 0 0 0 0 0 0 0 0 0 0 0 0 0 0 0 0 0 0 0 0 0 0 0 0 0 0 0 0 0 0 0 0 0 0 0.06 0 0 0 0 0 0 0 0 0 0 0 0 0 
0 0 0 0 0 0 0 0 1732.92 0 0 0 0 0 0 0 0 0 0 0 678.503 0 0 0 0 0 2071.37 0 0 0 0 1626.26 -1251.49 0 0 0 0 0 612.888 1346.55 0 0 0 -1962.42 0 0 0 1639.68 0 0 0 0 0 0 0 0 0 0 0 1940.75 0 0 0.08 0 0 0 0 0 0 0 0 0 0 92.0896 0 
0 0 2261.19 0 0 0 0 0 0 0 0 0 0 0 0 384.457 0 0 0 0 0 1815.32 0 0 0 0 0 0 0 0 0 0 0 0 0 0 -176.016 0 -1864.3 0 0 0 -1209.07 1769.23 0 0 2245.02 1317.87 0 0 0 -882.519 0 680.181 0 0 0 0 0 0 0 0 0 0.03 0 0 0 -1622.75 0 1286.58 0 0 0 0 0 
0 0 0 1448.48 0 0 0 1844.16 0 0 217.215 0 0 0 -1112.32 0 1630.22 0 0 0 0 0 0 0 0 0 0 0 0 0 0 0 0 0 0 0 0 0 0 0 0 0 0 0 0 0 0 0 0 0 0 0 0 0 0 0 0 0 0 0 0 0 0 0 0.03 0 0 0 0 0 0 0 0 0 0 
357.143 0 1413.24 0 0 1779 0 0 2178.33 0 0 0 0 0 0 0 0 0 307.398 -2368.01 0 0 0 0 0 604.343 0 0 0 0 0 0 0 0 0 0 0 0 0 0 0 0 0 0 0 510.193 0 2269.89 0 0 2307.58 0 0 0 0 0 0 0 0 0 0 0 0 0 0 0.03 0 0 0 0 0 0 0 0 0 
0 0 0 1774.73 0 0 1562.47 0 0 0 0 0 0 0 0 0 0 0 0 0 0 0 0 0 517.67 0 0 2150.56 0 0 0 0 0 152.821 0 0 0 2115.92 0 0 -2387.84 0 0 0 0 0 0 0 0 -1700.26 1105.3 0 0 820.261 -254.753 0 0 0 0 0 0 0 0 0 0 0 0.01 0 0 0 0 0 0 0 0 
0 0 0 0 2354.73 0 0 0 0 0 0 0 0 663.396 0 0 -41.5815 0 0 0 0 0 0 0 0 0 534.761 0 0 0 0 0 0 0 0 0 0 0 0 0 0 0 0 0 0 0 0 0 2335.05 0 0 578.555 0 0 0 0 0 0 -1071.58 0 1220.21 0 0 -1501.74 0 0 0 0.07 -1454.44 0 0 0 0 0 0 
2223.65 0 0 0 0 0 0 0 0 0 -57.2985 0 0 0 0 0 0 0 0 0 0 0 2353.82 0 0 0 0 0 0 0 0 0 495.849 0 69.2007 493.561 0 -843.608 -110.858 0 0 0 0 0 0 0 0 0 0 0 0 0 1321.22 0 0 0 2358.55 0 367.367 2472.23 0 0 0 0 0 0 0 -1535.46 0.04 0 0 0 0 -219.504 0 
0 0 0 0 0 0 0 0 0 0 0 0 0 0 0 0 630.741 0 0 0 0 0 0 0 0 0 0 0 0 0 0 0 0 0 0 0 0 0 0 0 0 0 0 0 0 0 0 0 0 -156.636 0 0 0 0 0 0 0 0 0 0 0 0 0 -175.253 0 0 0 0 0 0.05 0 0 0 0 0 
0 0 0 0 0 0 0 0 0 0 0 0 0 0 0 0 0 0 0 0 0 0 0 0 0 0 0 0 0 0 0 0 0 0 0 0 0 0 0 0 0 0 0 0 0 0 2305.14 0 0 0 0 0 0 0 -2347.87 0 0 0 0 0 0 0 0 0 0 0 0 0 0 0 0.04 8.31629 0 0 0 
0 0 0 0 0 0 0 0 1970.96 0 0 0 0 0 0 0 0 0 0 0 0 0 0 0 0 0 0 0 0 0 0 0 0 0 0 0 0 0 0 0 0 0 0 0 0 0 0 0 0 0 0 0 0 0 0 0 0 0 0 0 0 0 0 0 0 0 0 0 0 0 1823.1 0.04 0 0 0 
0 0 0 0 0 0 0 0 0 2162.16 1327.02 0 0 0 0 0 0 0 0 0 0 0 0 0 0 0 0 0 0 0 0 0 0 0 0 0 0 0 0 0 0 0 0 0 0 0 0 0 0 0 0 0 0 0 979.873 0 0 0 0 0 0 0 0 0 0 0 0 0 0 0 0 0 0.08 0 0 
0 0 0 0 0 0 0 0 0 0 0 0 0 0 0 0 0 0 0 0 0 0 0 0 0 0 0 0 0 0 0 0 0 -1841.26 0 0 0 0 0 0 0 0 0 0 0 0 0 0 0 0 0 0 0 0 0 0 0 0 0 0 0 0 1157.19 0 0 0 0 0 1644.87 0 0 0 0 0.08 0 
0 0 0 0 0 0 0 0 0 0 0 0 0 0 0 0 0 0 0 0 0 0 0 0 0 0 0 0 0 0 0 0 0 0 0 0 0 0 0 0 0 1022.6 0 0 0 0 0 1347.47 0 0 -8.31629 0 0 0 0 0 0 0 0 0 0 0 0 0 0 0 0 0 0 0 0 0 0 0 0.04 
