*Vertices 48
*Matrix 
0.05 1631.14 0 1672.19 0 0 -1621.22 1744.06 0 0 0 0 0 0 0 0 0 0 0 1075.09 0 -34.4096 0 0 -1001.69 0 0 0 0 0 0 0 1543.55 0 0 0 0 0 2267.45 0 0 0 0 0 0 0 -2476.81 0 
-438.475 0 0 0 0 0 0 0 469.756 0 0 0 0 -1334.5 0 0 0 1466.64 0 0 2397.15 0 0 0 0 0 0 906.934 0 0 0 0 0 -2171.16 0 -203.787 0 0 0 0 2478.33 0 488.678 -1170.92 0 249.26 0 0 
0 0 0.01 0 0 2156.06 0 0 0 0 0 0 0 0 0 0 0 0 0 839.946 -448.393 1869.33 2064.96 0 0 0 0 0 0 0 0 0 0 0 0 0 0 0 0 0 0 0 0 0 0 0 0 0 
687.658 0 0 0 0 1984.39 0 0 0 0 0 0 0 0 2415.62 0 293.664 0 0 0 0 200.735 311.365 860.088 -401.09 0 0 0 0 0 -83.2392 0 0 0 0 0 1955.4 0 1711.55 -1231.65 0 0 0 0 0 0 0 0 
0 0 0 0 0.07 0 1476.56 0 0 0 412.076 192.343 0 1138.72 0 0 -1584.44 1576.2 0 0 0 0 902.814 2244.25 0 0 0 0 0 0 241.325 0 0 0 0 0 0 0 0 0 0 0 0 0 0 0 0 0 
0 0 -886.334 53.3311 0 0.02 0 0 0 0 0 482.116 0 0 0 0 0 0 0 2136.22 0 0 1076.16 0 0 -530.335 -76.6778 0 0 0 0 1753.52 0 0 0 0 0 0 0 0 0 0 0 0 0 0 0 0 
-846.355 0 0 0 2061.45 0 0.03 0 0 0 0 0 0 0 0 0 0 0 0 0 0 0 0 0 2140.49 0 0 0 0 0 0 0 0 0 0 0 0 -1535.46 0 0 0 0 0 0 0 0 0 0 
-1008.56 0 0 0 0 0 0 0 0 -484.252 358.364 0 0 2307.28 0 0 1836.83 0 0 0 0 0 1465.88 0 0 0 0 0 0 0 0 0 0 0 0 0 0 0 -1351.28 0 0 1736.88 0 0 0 0 0 0 
0 308.161 0 0 0 0 0 0 0 1794.72 0 2459.56 -765.023 0 -1415.07 0 -412.534 0 0 0 0 0 0 0 0 0 0 -1508 0 0 0 0 0 0 0 0 0 0 0 0 0 0 0 328.761 0 0 -472.961 0 
0 0 0 0 0 0 0 603.275 1187.09 0.07 0 0 1791.51 0 1378.9 0 0 0 2366.02 0 0 1289.03 0 0 0 0 2290.49 0 0 0 0 0 0 723.975 0 0 1440.4 0 0 0 0 0 0 0 0 0 -2287.13 0 
0 0 0 0 -1951.12 0 0 2362.36 0 0 0.06 248.802 0 804.239 2217.25 0 2373.5 396.207 0 0 0 13.0467 0 0 0 0 0 0 769.295 417.722 0 0 0 0 0 0 0 0 0 0 0 0 0 0 478.454 0 0 0 
0 0 0 0 2254.02 -1038.77 0 0 1579.1 0 -383.694 0 1501.74 0 0 0 0 0 2030.63 0 967.513 -187.307 0 0 0 0 0 0 0 0 0 0 0 0 0 0 0 0 0 0 0 0 0 0 0 1537.14 0 0 
0 0 0 0 0 0 0 0 2181.23 -770.669 0 1894.21 0.08 0 -2343.59 0 0 0 -261.62 0 0 0 0 0 0 0 0 0 0 -1666.54 0 0 0 649.815 907.086 0 0 0 0 -1075.09 0 0 0 0 0 0 0 0 
0 1467.41 0 0 -1062.27 0 0 2228.69 0 0 1999.95 0 0 0.01 0 0 0 0 0 0 0 0 0 0 0 -1303.98 0 0 0 0 0 0 0 0 0 0 0 0 0 0 0 0 0 0 0 0 1104.39 0 
0 0 0 2273.25 0 0 0 0 -1501.59 924.482 886.944 0 1249.96 0 0.08 0 0 0 0 1914.96 -588.015 1167.71 0 0 0 0 0 0 0 0 0 0 0 0 864.818 0 0 1719.34 0 0 0 0 0 0 0 0 0 0 
0 0 0 0 0 0 0 0 0 0 0 0 0 0 0 0.05 0 0 808.664 0 0 0 1627.02 0 0 0 0 -155.11 0 0 0 0 0 0 0 0 0 0 0 0 0 0 -182.272 0 0 0 0 0 
0 0 0 1310.54 -1166.49 0 0 475.86 1795.18 0 -1606.72 0 0 0 0 0 0.01 0 0 0 0 2206.56 -1683.63 1779.92 1279.72 0 0 0 0 0 0 0 0 0 0 0 0 0 0 0 0 0 0 0 0 0 424.284 0 
0 661.412 0 0 1399.96 0 0 0 0 0 2354.12 0 0 0 0 0 0 0.01 0 0 -465.484 0 2495.73 0 0 1563.69 0 0 0 0 0 0 0 0 2440.79 0 0 0 -772.652 0 0 0 0 0 0 1655.55 0 0 
0 0 0 0 0 0 0 0 0 2286.07 0 1068.83 -1258.51 0 0 1623.36 0 0 0.07 603.885 0 0 0 0 782.266 0 0 0 0 0 0 0 0 0 0 0 0 0 0 0 0 0 0 0 0 0 0 0 
1714.15 0 -1287.8 0 0 -809.427 0 0 0 0 0 0 0 0 428.251 0 0 0 2126.45 0.07 0 0 0 1877.27 2042.53 0 0 0 0 -998.337 635.929 0 0 0 0 0 0 -1476.71 0 0 0 0 0 0 0 0 0 0 
0 1223.41 70.7266 0 0 0 0 0 0 0 0 537.202 0 0 -2156.36 0 0 2382.66 0 0 0.03 0 -912.58 0 0 0 -876.873 0 0 0 0 0 243.461 0 0 0 0 0 0 -633.641 0 0 0 0 0 0 0 0 
2054.73 0 -2133.17 -916.852 0 0 0 0 0 1603.82 1937.24 -1238.67 0 0 2258.75 0 496.765 0 0 0 0 0.08 0 0 0 0 -1027.48 0 0 0 -204.093 0 0 0 0 0 0 651.952 0 0 0 0 1955.7 0 0 -1160.24 0 0 
0 0 2305.75 1224.48 2125.39 367.061 0 -2064.96 0 0 0 0 0 0 0 75.9148 766.396 -396.054 0 0 66.9118 0 0.06 0 0 0 0 0 -740.303 0 0 0 0 0 0 0 -940.962 0 0 -2259.82 0 2346.34 0 0 0 0 0 2402.04 
0 0 0 2355.8 -722.144 0 0 0 0 0 0 0 0 0 0 0 1989.88 0 0 1171.83 0 0 0 0 0.0762963 0 0 0 0 0 10.6052 1083.03 0 0 1871.47 0 0 2303.16 0 1266.44 0 0 0 0 -1012.07 162.435 0 0 
2488.4 0 0 1578.49 0 0 -2419.74 0 0 0 0 0 0 0 0 0 1775.49 0 -1739.94 1231.65 0 0 0 1964.55 0.03 0 0 0 0 -505.31 0 0 0 0 0 -839.946 0 0 0 -2090.9 0 0 0 0 0 0 0 0 
0 0 0 0 0 1677.37 0 0 0 0 0 0 0 1878.49 0 0 0 -557.649 0 0 0 0 0 0 0 0.08 0 1903.06 0 0 0 0 0 0 0 0 0 2430.88 0 0 132.832 0 0 0 2145.68 0 0 0 
0 0 0 0 0 34.5622 0 0 0 2101.73 0 0 0 0 0 0 0 0 0 0 -1785.41 2362.82 0 0 0 0 0 0 0 0 0 0 1881.39 0 0 -2238 0 0 0 0 0 0 0 0 0 0 0 0 
0 -1027.94 0 0 0 0 0 0 -1378.9 0 0 0 0 0 0 1644.41 0 0 0 0 0 0 0 0 0 2067.71 0 0.01 0 0 0 0 -234.458 0 0 0 0 0 0 0 0 0 0 0 0 0 0 0 
0 0 0 0 0 0 0 0 0 0 375.301 0 0 0 0 0 0 0 0 0 0 0 1396.15 0 0 0 0 0 0.04 0 0 0 0 0 0 0 0 0 0 0 0 0 0 0 0 994.98 0 0 
0 0 0 0 0 0 0 0 0 0 198.447 0 2446.13 0 0 0 0 0 0 -146.107 0 0 0 0 1721.02 0 0 0 0 0.03 0 0 0 0 0 0 0 0 514.313 0 0 0 0 0 0 0 0 0 
0 0 0 2433.01 2185.05 0 0 0 0 0 0 0 0 0 0 0 0 0 0 276.269 0 -570.162 0 1806.31 0 0 0 0 0 0 0.04 -1916.18 0 0 517.67 0 1722.85 0 0 1708.5 0 0 0 0 0 0 0 0 
0 0 0 0 0 209.738 0 0 0 0 0 0 0 0 0 0 0 0 0 0 0 0 0 2316.89 0 0 0 0 0 0 -1518.83 0.09 0 0 0 1994.61 -260.399 0 0 0 0 0 -586.947 0 0 0 -849.712 0 
-467.315 0 0 0 0 0 0 0 0 0 0 0 0 0 0 0 0 0 0 0 783.486 0 0 0 0 0 1764.66 223.319 0 0 0 0 0 1355.71 0 0 1419.19 0 0 0 0 0 -1717.66 1607.18 0 0 0 0 
0 -1439.63 0 0 0 0 0 0 0 822.55 0 0 2416.53 0 0 0 0 0 0 0 0 0 0 0 0 0 0 0 0 0 0 0 2327.88 0.06 0 0 0 0 0 0 0 0 0 0 22.66 0 0 0 
0 0 0 0 0 0 0 0 0 0 0 0 423.063 0 1146.81 0 0 1809.52 0 0 0 0 0 2194.36 0 0 0 0 0 0 506.073 0 0 0 0 0 0 0 0 0 0 0 0 0 0 0 0 1917.55 
0 2208.24 0 0 0 0 0 0 0 0 0 0 0 0 0 0 0 0 0 0 0 0 0 0 1180.38 0 -501.343 0 0 0 0 1725.59 0 0 0 0.04 0 0 0 0 0 0 0 -1331.6 0 0 0 0 
0 0 0 -191.427 0 0 0 0 0 1560.95 0 0 0 0 0 0 0 0 0 0 0 0 766.854 0 0 0 0 0 0 0 1310.39 660.955 1354.03 0 0 0 0.01 0 675.146 0 0 0 0 0 -1163.9 0 0 0 
0 0 0 0 0 0 2116.84 0 0 0 0 0 0 0 788.064 0 0 0 0 1430.94 0 -2100.51 0 377.895 0 942.64 0 0 0 0 0 0 0 0 0 0 0 0.08 0 0 1770.61 0 0 2218.16 0 0 0 0 
-1224.02 0 0 2408.75 0 0 0 1946.7 0 0 0 0 0 0 0 0 0 -143.361 0 0 0 0 0 0 0 0 0 0 0 -974.075 0 0 0 0 0 0 -2291.71 0 0.02 0 0 0 0 0 0 0 0 0 
0 0 0 1949.29 0 0 0 0 0 0 0 0 1526 0 0 0 0 0 0 0 1854.08 0 2280.11 1463.44 2375.64 0 0 0 0 0 695.441 0 0 0 0 0 0 0 0 0 0 0 0 0 0 0 0 0 
0 728.553 0 0 0 0 0 0 0 0 0 0 0 0 0 0 0 0 0 0 0 0 0 0 0 310.755 0 0 0 0 0 0 0 0 0 0 0 1351.28 0 0 0.03 0 0 0 0 0 0 0 
0 0 0 0 0 0 0 1806.31 0 0 0 0 0 0 0 0 0 0 0 0 0 0 2080.52 0 0 0 0 0 0 0 0 0 0 0 0 0 0 0 0 0 0 0.04 0 0 0 0 0 1448.03 
0 -989.639 0 0 0 0 0 0 0 0 0 0 0 0 0 1389.43 0 0 0 0 0 901.898 0 0 0 0 0 0 0 0 0 -499.207 651.952 0 0 0 0 0 0 0 0 0 0.08 0 0 0 0 0 
0 907.239 0 0 0 0 0 0 2405.85 0 0 0 0 0 0 0 0 0 0 0 0 0 0 0 0 0 0 0 0 0 0 0 1659.37 0 0 -1926.25 0 -1088.37 0 0 0 0 0 0.04 0 0 0 -297.632 
0 0 0 0 0 0 0 0 0 0 1574.98 0 0 0 0 0 0 0 0 0 0 0 0 354.701 0 -1541.57 0 0 0 0 0 0 0 727.332 0 0 966.445 0 0 0 0 0 0 0 0.06 0 0 0 
0 1799.3 0 0 0 0 0 0 0 0 0 2368.16 0 0 0 0 0 -493.561 0 0 0 2313.53 0 -154.653 0 0 0 0 -1179.01 0 0 0 0 0 0 0 0 0 0 0 0 0 0 0 0 0.08 0 0 
2437.44 0 0 0 0 0 0 0 965.224 1356.78 0 0 0 -1768.93 0 0 1764.35 0 0 0 0 0 0 0 0 0 0 0 0 0 0 1504.64 0 0 0 0 0 0 0 0 0 0 0 0 0 0 0.05 0 
0 0 0 0 0 0 0 0 0 0 0 0 0 0 0 0 0 0 0 0 0 0 -993.301 0 0 0 0 0 0 0 0 0 0 0 -2196.04 0 0 0 0 0 0 2197.56 0 963.24 0 0 0 0.07 
