*Vertices 57
*Matrix 
0.06 0 0 804.697 0 0 0 0 0 2262.41 0 0 0 0 0 0 2108.75 1973.71 0 0 0 1766.79 1929 0 0 0 0 0 0 0 -550.63 0 -1287.96 0 0 0 0 0 0 0 0 0 0 0 0 -1359.22 0 0 0 0 0 0 -492.645 -2250.36 0 0 -884.96 
0 0.09 0 0 0 0 0 0 0 -527.436 0 0 -973.464 -1275.9 -1931.14 -1517.46 0 0 1088.06 0 1563.39 2095.17 0 0 2435.15 0 -1519.75 0 0 0 2282.86 0 0 0 0 0 0 0 0 2123.25 0 0 0 0 0 0 0 0 0 0 0 0 0 515.992 0 0 0 
0 0 0.01 0 0 0 0 0 0 0 0 0 -1073.11 0 -307.398 2357.17 0 0 0 2092.88 0 0 2318.72 0 0 -136.647 -352.412 0 1703.77 0 2393.49 0 0 0 0 0 0 0 0 0 0 0 -1958.91 -341.121 -614.566 0 0 0 0 0 0 0 0 0 0 0 0 
1576.51 0 0 0.08 0 2420.35 0 0 0 0 0 -370.571 0 0 0 398.801 1966.23 -215.079 516.449 1565.37 0 0 0 0 108.112 1404.23 0 0 102.161 0 0 0 2308.8 0 0 0 0 0 0 0 0 0 0 0 0 0 0 0 0 0 0 0 0 0 0 0 0 
0 0 0 0 0 0 0 0 0 -185.018 1733.38 -91.174 304.804 1196.55 0 0 0 0 0 0 -2017.96 0 -2049.09 2154.23 2156.82 0 0 0 0 0 1311.46 0 -499.512 0 0 0 0 0 0 0 0 0 0 0 0 0 0 0 0 0 0 -2326.65 0 0 0 0 0 
0 0 0 -1503.57 0 0.03 382.931 1701.48 0 1564.46 -916.7 1040.76 0 0 0 2217.25 0 0 0 0 0 0 0 1863.69 0 0 0 0 0 0 0 0 243.156 0 0 0 -67.0644 0 0 0 0 -2223.81 0 0 0 0 0 -446.715 0 0 -371.029 0 2153 0 0 0 0 
0 0 0 0 0 204.703 0.04 2265.92 948.286 0 0 0 -279.473 -268.029 0 0 0 0 0 1883.07 0 0 0 -164.266 0 0 805.155 563.906 1563.39 0 0 1061.51 0 0 0 0 -39.14 0 0 0 0 0 0 0 0 0 -582.064 1149.56 0 0 0 0 0 0 0 0 0 
0 0 0 0 0 1723.61 1465.58 0.08 1871.93 0 0 0 0 0 0 0 0 0 0 1611.76 -812.479 0 0 1107.14 0 2182 0 0 991.775 0 0 2232.81 0 0 0 0 0 0 0 0 0 0 0 0 0 0 0 0 0 0 0 0 0 0 0 0 0 
0 0 0 0 0 0 774.178 1886.12 0.05 0 1103.63 0 0 659.429 0 0 1891.92 1216.85 0 1829.66 0 0 0 0 0 0 0 -1045.64 0 0 0 913.8 0 0 202.872 0 0 0 0 -1478.24 0 259.331 0 0 0 0 0 0 0 0 0 0 0 0 0 0 0 
1925.64 1964.71 0 0 -846.965 -180.288 0 0 0 0.05 0 0 0 2297.36 0 0 0 -218.894 0 0 0 0 0 -123.981 1068.83 -392.85 0 0 266.808 0 0 0 573.061 0 2139.42 0 0 452.666 0 0 0 0 2212.67 0 0 0 0 0 907.239 0 0 0 0 0 0 0 0 
0 0 0 0 -2446.9 419.706 0 0 -2339.32 0 0.01 0 2241.36 0 0 0 0 0 1805.09 0 0 0 -610.141 0 0 0 0 0 0 0 0 0 0 1527.22 0 0 0 0 0 0 1353.72 0 0 0 0 0 0 0 0 0 0 0 0 0 0 0 0 
0 0 0 1262.93 335.932 -1473.36 0 0 0 0 0 0.05 -345.088 2205.95 0 0 -989.639 0 -1625.03 969.344 0 0 0 0 2001.33 754.341 389.95 0 0 -2130.57 0 0 0 0 0 0 0 0 0 0 0 0 0 0 0 0 0 0 0 1980.73 0 0 0 0 0 0 0 
0 -1073.41 -2478.64 0 1370.2 0 1862.16 0 0 0 1159.17 -1719.34 0.02 0 0 0 0 438.932 919.446 0 -749.458 0 0 0 -2085.25 0 0 0 0 0 0 0 2422.94 -695.746 -881.298 0 0 0 -943.709 0 1097.22 0 0 0 0 0 0 0 0 1761.3 0 0 0 0 0 0 0 
0 512.024 0 0 2275.38 0 1446.96 0 219.962 584.048 0 954.695 0 0.02 0 0 0 -2020.55 0 0 0 0 0 0 0 -1367.61 0 0 1098.13 0 0 0 0 0 0 0 0 0 0 0 0 0 0 0 0 0 0 2177.42 1222.19 0 0 0 0 2348.63 0 1222.65 0 
0 2420.8 815.683 0 0 0 0 0 0 0 0 0 0 0 0.09 0 0 0 0 116.657 0 -152.211 0 0 -1268.73 0 0 -1131.4 0 784.097 0 0 1820.51 0 0 0 2379.91 0 0 0 0 -610.294 0 0 0 0 0 0 0 0 0 -1264.92 0 -2370.3 0 0 0 
0 2031.54 2414.85 -1991.87 0 -1528.75 0 0 0 0 0 0 0 0 0 0.04 0 0 1193.81 -604.648 0 0 0 -2067.4 2312.92 0 2402.8 0 0 0 0 0 0 0 0 0 0 1130.02 0 0 0 0 0 0 0 487.762 0 -1066.55 -1576.97 0 0 0 0 0 0 0 0 
1180.07 0 0 844.981 0 0 0 0 -1246.15 0 0 1258.2 0 0 0 0 0.01 0 0 0 0 2257.84 75.457 1178.24 0 0 0 0 0 0 0 -994.217 0 -99.7192 0 -536.134 0 0 0 0 0 0 0 0 0 0 0 0 0 0 0 0 0 0 0 0 0 
2256 0 0 1915.11 0 0 0 0 1985.46 96.6674 0 0 2361.45 2454.53 0 0 0 0.07 -80.0348 0 0 0 0 0 0 -1766.64 0 0 0 0 997.116 0 0 0 0 0 0 0 -730.079 0 0 0 0 -2256.16 0 0 0 0 0 0 0 -411.313 -1744.36 0 0 0 0 
0 525.605 0 83.5444 0 0 0 0 0 0 223.624 706.122 2360.07 0 0 -1163.9 0 -2102.34 0.01 1711.1 0 0 0 0 0 0 -982.772 1686.38 0 0 526.826 0 0 223.624 0 0 1421.78 0 0 0 0 0 0 0 0 0 0 0 0 0 358.974 0 0 0 0 0 0 
0 0 1152.61 720.313 0 0 1979.81 1756.42 1293.45 0 0 -1179.31 0 0 709.021 1538.36 0 0 761.208 0.08 0 0 548.494 0 0 0 0 0 -1293.76 0 0 0 0 0 0 0 -1630.99 0 0 0 0 2426.76 0 0 0 0 0 0 0 0 0 0 0 0 0 0 0 
0 2112.42 0 0 1978.44 0 0 2469.79 0 0 0 0 2272.48 0 0 0 0 0 0 0 0.06 0 0 0 0 0 0 996.963 -1803.42 1671.58 0 323.878 -1938.15 0 0 0 0 0 0 0 0 0 0 0 0 2485.66 0 817.362 0 0 0 0 0 0 0 0 0 
1352.35 -2417.14 0 0 0 0 0 0 0 0 0 0 0 0 2390.13 0 1063.95 0 0 0 0 0 -1143.15 0 592.135 0 1094.16 0 2124.47 -1201.9 0 -745.186 0 1852.24 0 0 0 0 0 -2069.38 0 1785.1 0 218.589 0 0 0 -2092.12 0 0 1909.77 0 1914.66 0 0 0 -142.75 
1123.46 0 -622.959 0 2187.8 0 0 0 0 0 -661.26 0 0 0 0 0 -1436.43 0 0 1082.11 0 1155.35 0.03 0 0 0 0 2453.46 0 0 0 0 0 0 0 1255.3 0 2423.55 0 0 0 -37.6141 0 0 0 0 0 0 0 0 0 0 0 0 0 0 0 
0 0 0 0 886.029 1518.22 1388.21 1824.93 0 110.858 0 0 0 0 0 2134.24 966.14 0 0 0 0 0 0 0.05 898.083 0 -1055.25 0 0 0 0 -656.529 0 0 0 0 0 0 0 0 0 0 921.278 0 0 0 0 -827.738 0 0 0 0 0 0 0 0 0 
0 -494.018 0 684.912 -453.581 0 0 0 0 718.787 0 1914.5 2085.86 0 2422.33 802.866 0 0 0 0 0 2168.57 0 2157.43 0.06 0 0 0 0 0 0 0 0 -1969.74 0 0 0 0 0 0 252.312 1405.91 0 -45.5489 0 0 0 0 1784.34 0 0 -1973.56 0 0 0 0 0 
0 0 629.673 970.26 0 0 0 1833.32 0 -2205.34 0 -629.673 0 1138.42 0 0 0 2150.11 0 0 0 0 0 0 0 0.04 0 0 0 0 0 571.23 0 0 0 1472.59 -1136.59 0 0 0 0 -539.338 0 0 0 0 673.62 0 0 0 0 0 0 0 0 0 0 
0 1563.23 -2480.77 0 0 0 -2192.53 0 0 0 0 1695.38 0 0 0 -1588.72 0 0 2154.07 0 0 2397.76 0 1370.2 0 0 0.07 0 2093.95 -1266.14 0 0 1855.91 908.307 0 0 0 -2380.21 0 0 0 0 0 -915.937 -490.661 0 0 0 0 0 0 0 0 0 -1579.87 0 0 
0 0 0 0 0 0 546.052 0 1844.92 0 0 0 0 0 1312.07 0 0 0 -623.569 0 -306.024 0 1154.13 0 0 0 0 0.02 0 0 0 0 0 579.623 0 0 0 0 0 2251.88 0 0 0 0 0 0 0 0 0 0 0 0 0 0 0 0 0 
0 0 2174.37 -669.347 0 0 -2113.48 2053.06 0 -2316.58 0 0 0 877.026 0 0 0 0 0 2469.33 -2015.37 1377.38 0 0 0 0 -2016.59 0 0.08 0 0 0 1120.26 0 0 0 0 788.827 0 0 0 0 -1341.36 0 0 0 0 0 0 0 0 0 0 0 0 0 0 
0 0 0 0 0 0 0 0 0 0 0 425.657 0 0 1694.46 0 0 0 0 0 -1827.07 1144.06 0 0 0 0 95.294 0 0 0.01 0 0 599.155 0 0 0 0 0 0 0 0 0 0 0 0 0 0 -526.826 0 0 0 0 0 0 0 0 0 
2139.12 -115.741 -1478.39 0 132.221 0 0 0 0 0 0 0 0 0 0 0 0 1570.86 1966.99 0 0 0 0 0 0 0 0 0 0 0 0.07 0 1552.4 0 0 0 0 0 -1209.37 0 80.6452 0 0 0 1190.91 0 0 0 0 0 910.291 0 0 0 0 -1417.81 0 
0 0 0 0 0 0 1173.97 714.667 2326.5 0 0 0 0 0 0 0 2021.62 0 0 0 -505.31 187.46 0 1388.67 0 -631.352 0 0 0 0 0 0.05 0 0 0 0 0 0 0 0 0 0 0 0 0 0 0 0 0 0 0 0 0 0 0 0 0 
-1453.52 0 0 1615.27 405.21 319.3 0 0 0 664.769 0 0 -1471.68 0 1112.48 0 0 0 0 0 92.5474 0 0 0 0 0 1845.53 0 146.718 -250.786 1654.03 0 0 1312.22 0 0 0 0 0 0 0 0 0 0 -120.319 0 2467.96 0 0 0 0 0 0 0 0 0 0 
0 0 0 0 0 0 0 0 0 0 1666.39 0 937.452 0 0 0 -463.958 0 726.264 0 0 -1858.2 0 0 1286.58 0 1385.01 819.346 0 0 0 0 -969.344 0.08 0 -1539.74 0 0 0 0 0 1618.93 -1926.4 0 1156.73 0 0 0 0 0 0 0 0 0 0 1569.95 0 
0 0 0 0 0 0 0 0 -36.8511 383.694 0 0 1272.55 0 0 0 0 0 0 0 0 0 0 0 0 0 0 0 0 0 0 0 0 0 0.09 0 0 0 2450.56 0 0 0 0 0 0 0 0 0 0 0 0 0 0 0 0 0 0 
0 0 0 0 0 0 0 0 0 0 0 0 0 0 0 0 2002.85 0 0 0 0 0 -1539.28 0 0 1882.31 0 0 0 0 0 0 0 2170.55 0 0.06 0 0 0 0 1148.95 0 0 0 0 0 0 0 0 -529.572 0 0 0 0 0 0 0 
0 0 0 0 0 1930.83 966.445 0 0 0 0 0 0 0 -1191.21 0 0 0 -958.663 1041.22 0 0 0 0 0 851.238 0 0 0 0 0 0 0 0 0 0 0.09 0 0 1053.58 0 0 0 2201.83 0 -1535.77 0 0 0 0 0 0 0 0 2309.41 1828.59 0 
0 0 0 0 0 0 0 0 0 2442.47 0 0 0 0 0 -2380.83 0 0 0 0 0 0 2390.9 0 0 0 518.738 0 1148.34 0 0 0 0 0 0 0 0 0.02 0 0 0 0 0 0 0 0 0 0 0 0 0 -1245.38 0 0 0 -772.805 0 
0 0 0 0 0 0 0 0 0 0 0 0 -1663.34 0 0 0 0 543.153 0 0 0 0 0 0 0 0 0 0 0 0 967.055 0 0 0 1894.82 0 0 0 0.07 2445.37 0 0 0 0 0 0 0 0 0 0 0 0 0 0 0 0 0 
0 -1306.42 0 0 0 0 0 0 1996.29 0 0 0 0 0 0 0 0 0 0 0 0 2164.91 0 0 0 0 0 2138.2 0 0 0 0 0 0 0 0 -947.981 0 942.946 0.01 -409.787 0 0 1466.19 0 0 0 0 0 0 0 0 -615.94 0 0 -670.568 0 
0 0 0 0 0 0 0 0 0 0 2328.33 0 1798.99 0 0 0 0 0 0 0 0 0 0 0 212.333 0 0 0 0 0 222.709 0 0 0 0 1913.43 0 0 0 -855.358 0.09 0 -26.017 0 0 -1847.21 0 0 0 0 0 0 0 0 -1849.04 0 0 
0 0 0 0 0 749.001 0 0 -863.598 0 0 0 0 0 989.029 0 0 0 0 -1499.76 0 -539.644 -2187.03 0 963.088 1599.7 0 0 0 0 0 0 0 1670.96 0 0 0 0 0 0 0 0 0 0 0 0 0 0 0 0 0 0 0 0 0 0 0 
0 0 1975.39 0 0 0 0 0 0 -1838.36 0 0 0 0 0 0 0 0 0 0 0 0 0 482.727 0 0 0 0 -2324.21 0 0 0 0 2336.27 0 0 0 0 0 0 1457.95 0 0.03 2468.26 0 0 2136.37 0 0 0 0 0 0 0 0 0 0 
0 0 -819.498 0 0 0 0 0 0 0 0 0 0 0 0 0 0 -1822.34 0 0 0 2208.24 0 0 944.929 0 1770.76 0 0 0 0 0 0 0 0 0 906.323 0 0 1433.07 0 0 -1483.28 0.09 0 0 0 0 0 0 0 0 0 0 0 463.195 1506.78 
0 0 868.023 0 0 0 0 0 0 0 0 0 0 0 0 0 0 0 0 0 0 0 0 0 0 0 909.375 0 0 0 2232.05 0 1131.55 37.1563 0 0 0 0 0 0 0 0 0 0 0.09 0 1874.68 0 0 -133.137 2293.85 0 0 0 0 0 0 
743.812 0 0 0 0 0 0 0 0 0 0 0 0 0 0 -2028.18 0 0 0 0 -190.207 0 0 0 0 0 0 0 0 0 0 0 0 0 0 0 1215.78 0 0 0 1981.19 0 0 0 0 0.06 2231.28 2190.85 0 0 0 2286.07 0 -2367.85 0 0 0 
0 0 0 0 0 0 -926.008 0 0 0 0 0 0 0 0 0 0 0 0 0 0 0 0 0 0 449.614 0 0 0 0 0 0 1513.49 0 0 0 0 0 0 0 0 0 2203.97 0 902.966 -1709.11 0.09 0 0 0 0 1414 0 0 0 0 -1258.96 
0 0 0 0 0 1341.67 1312.07 0 0 0 0 0 0 2102.95 0 2246.39 0 0 0 0 -1961.04 -2341.3 0 -2046.8 0 0 0 0 0 1562.47 0 0 0 0 0 0 0 0 0 0 0 0 0 0 0 1247.52 0 0.03 0 0 0 0 0 0 0 0 2153.61 
0 0 0 0 0 0 0 0 0 1419.03 0 0 0 -1588.72 0 1235.47 0 0 0 0 0 0 0 0 1971.88 0 0 0 0 0 0 0 0 0 0 0 0 0 0 0 0 0 0 0 0 0 0 0 0.08 0 0 0 0 0 0 0 -158.773 
0 0 0 0 0 0 0 0 0 0 0 1629.92 -2263.79 0 0 0 0 0 0 0 0 0 0 0 0 0 0 0 0 0 0 0 0 0 0 244.072 0 0 0 0 0 0 0 0 2266.99 0 0 0 0 0.06 0 0 0 0 0 0 0 
0 0 0 0 0 2437.28 0 0 0 0 0 0 0 0 0 0 0 0 413.602 0 0 558.26 0 0 0 0 0 0 0 0 1912.21 0 0 0 0 0 0 0 0 0 0 0 0 0 764.26 0 0 0 0 0 0.06 0 1672.8 0 -1352.35 1449.71 0 
0 0 0 0 529.572 0 0 0 0 0 0 0 0 0 347.987 0 0 -1931.44 0 0 0 0 0 0 1060.44 0 0 0 0 0 0 0 0 0 0 0 0 1170.61 0 0 0 0 0 0 0 -1754.59 -0.839259 0 0 0 0 0.04 0 0 0 0 0 
1925.79 0 0 0 0 1423.46 0 0 0 0 0 0 0 0 0 0 0 436.949 0 0 0 476.775 0 0 0 0 0 0 0 0 0 0 0 0 0 0 0 0 0 97.7355 0 0 0 0 0 0 0 0 0 0 -862.529 0 0.08 0 0 0 0 
-1798.68 295.495 0 0 0 0 0 0 0 0 0 0 0 1847.06 1443.6 0 0 0 0 0 0 0 0 0 0 0 0 0 0 0 0 0 0 0 0 0 0 0 0 0 0 0 0 0 0 -1045.49 0 0 0 0 0 0 0 0.07 0 0 0 
0 0 0 0 0 0 0 0 0 0 0 0 0 0 0 0 0 0 0 0 0 0 0 0 0 0 -2400.66 0 0 0 0 0 0 0 0 0 -612.888 0 0 0 1777.63 0 0 0 0 0 0 0 0 0 1016.65 0 0 0 0 0 0 
0 0 0 0 0 0 0 0 0 0 0 0 0 -1686.22 0 0 0 0 0 0 0 0 0 0 0 0 0 0 0 0 1828.29 0 0 2060.99 0 0 961.409 -533.54 0 -797.372 0 0 0 2346.34 0 0 0 0 0 0 -1706.67 0 0 0 0 0.04 0 
2403.56 0 0 0 0 0 0 0 0 0 0 0 0 0 0 0 0 0 0 0 0 2305.6 0 0 0 0 0 0 0 0 0 0 0 0 0 0 0 0 0 0 0 0 0 813.547 0 0 2004.38 -2215.57 -2249.9 0 0 0 0 0 0 0 0 
