*Vertices 61
*Matrix 
0.03 287.255 0 0 0 0 0 0 1397.67 0 0 0 0 -194.327 -2149.04 0 0 0 0 0 0 0 0 0 2050.31 0 0 -2075.33 0 668.737 0 0 0 0 484.71 0 0 0 0 1690.8 0 773.415 0 0 0 0 0 0 0 0 0 0 649.358 0 0 0 878.399 0 0 0 0 
1542.33 0.02 0 0 0 0 0 0 0 0 0 0 0 0 0 0 0 0 0 0 0 0 -221.641 0 0 1679.2 0 0 2270.04 0 0 0 0 0 0 0 0 0 0 -458.007 0 0 0 1023.36 -693.457 2159.87 0 0 0 0 -679.113 0 0 0 0 0 0 0 0 0 0 
0 0 0.06 0 0 0 0 0 0 0 0 0 0 0 0 0 0 0 0 0 0 0 0 0 0 0 0 0 0 0 0 0 0 0 1407.44 0 0 0 0 0 0 1506.16 0 0 0 680.944 0 0 0 0 0 0 0 0 0 0 0 1981.64 0 0 0 
0 0 0 0.08 0 0 -1704.84 0 0 0 0 0 0 0 0 0 0 0 0 -481.811 0 0 0 84.9178 0 0 0 0 1023.67 0 0 0 1245.54 0 0 0 505.615 0 -128.254 0 0 0 0 0 0 0 0 0 0 0 0 0 0 0 0 0 0 0 0 0 0 
0 0 0 0 0.08 0 0 1983.32 0 -2000.11 0 0 0 0 0 0 689.032 0 0 0 0 0 0 0 0 0 0 0 0 0 0 0 1858.35 0 0 0 0 0 0 0 0 0 0 0 0 0 0 0 -2019.49 0 0 0 1198.69 0 0 0 0 0 2284.23 0 0 
0 0 0 0 0 0.09 0 0 0 0 0 0 0 0 0 0 0 0 0 0 0 0 0 0 0 0 0 0 0 0 0 0 0 0 759.224 0 0 0 0 449.309 0 0 0 -1371.88 2390.9 1812.88 -805.918 0 0 0 0 0 0 381.71 0 -2451.78 0 0 0 0 0 
0 0 0 2183.98 0 0 0.07 0 0 0 0 690.1 0 0 0 0 0 1013.9 0 0 1565.37 0 1709.88 0 0 0 0 0 0 -113.758 0 0 537.355 0 -293.512 -550.783 0 0 0 0 0 0 0 0 0 0 -23.1178 476.318 0 0 0 0 0 0 -774.941 195.547 0 0 0 0 0 
0 0 0 0 922.346 0 0 0.06 0 0 0 0 0 0 0 0 0 1248.74 0 0 39.4452 0 0 0 0 0 0 0 0 0 0 0 1694.46 0 0 0 771.432 -221.183 0 0 0 0 0 368.892 0 0 0 0 0 0 0 0 0 -1296.66 0 0 0 0 1532.41 0 0 
-192.953 0 0 0 0 0 0 0 0.01 0 1885.36 0 0 -940.809 0 0 0 0 0 0 0 0 0 0 0 0 0 -2126 0 0 0 0 0 0 0 0 0 0 0 0 0 758.919 0 0 0 0 0 0 0 499.512 0 0 0 0 0 0 0 0 0 0 0 
0 0 0 0 1540.35 0 0 0 0 0.07 0 -512.94 0 624.943 0 0 1995.38 1522.49 0 0 0 0 0 0 0 0 0 0 0 0 0 300.684 1435.51 0 0 0 2008.65 0 0 0 0 -463.195 0 0 0 0 0 0 0 -127.796 0 0 0 -718.329 0 0 0 0 0 -2324.37 0 
0 0 0 0 0 0 0 0 1110.8 0 0.02 0 1347.93 0 0 0 0 0 121.082 -2196.65 0 0 0 0 0 -1650.36 0 0 0 0 0 2172.84 0 0 1169.39 0 -994.369 0 0 0 0 0 0 0 0 0 1940.75 0 0 0 0 0 0 0 0 2379.6 0 0 0 0 0 
0 0 0 0 0 0 509.278 0 0 -182.424 0 0.03 -518.586 0 0 0 0 0 0 0 0 0 0 0 1607.79 0 0 0 0 0 0 0 0 0 0 0 0 0 0 868.786 0 0 0 0 0 0 0 1299.4 0 729.316 -947.829 0 0 0 0 0 0 -1423.61 -436.644 448.698 0 
0 0 0 0 0 0 0 0 0 0 1708.2 1660.44 0.03 1448.79 0 0 0 0 2006.82 0 0 0 0 1564.91 0 0 0 0 0 0 1117.82 0 0 0 0 0 0 0 0 0 0 0 0 0 0 0 0 1737.65 0 0 0 0 0 0 0 0 0 0 -2257.23 0 0 
2468.26 0 0 0 0 0 0 0 854.289 -2371.52 0 0 2018.88 0.07 1206.47 0 0 0 0 0 0 0 0 2204.28 0 0 0 0 0 0 0 0 0 0 0 0 0 0 0 0 -269.555 0 0 0 0 0 0 0 0 0 0 0 0 0 0 0 -1130.48 0 0 0 1955.4 
181.051 0 0 0 0 0 0 0 0 0 0 0 0 -325.861 0.05 0 0 0 0 461.364 0 0 0 0 0 0 0 0 0 0 0 0 0 0 0 0 0 0 0 0 0 860.088 0 1930.52 0 0 0 0 0 -893.811 0 0 0 0 0 0 0 1354.95 0 0 0 
0 0 0 0 0 0 0 0 0 0 0 0 0 0 0 0.06 0 0 0 -2068.16 1096.45 0 0 0 0 0 0 0 0 0 879.467 0 0 0 0 0 0 0 0 0 0 0 0 0 0 -2.51778 0 0 -10.7578 0 0 0 0 0 0 0 0 1645.48 0 0 0 
0 0 0 0 -493.561 0 0 0 0 -2055.35 0 0 0 0 0 0 0.01 0 745.796 0 0 0 0 0 0 0 0 -931.349 0 0 2085.86 0 979.568 975.906 0 0 0 0 0 0 0 0 0 -1146.81 2169.79 0 0 0 106.433 0 1899.4 0 -2019.33 0 0 -489.593 0 0 0 0 0 
0 0 0 0 0 0 770.516 -388.577 0 2002.09 0 0 0 0 0 0 0 0 0 0 -226.676 0 0 0 -0.381481 1007.8 0 0 0 0 0 0 -989.181 0 2257.07 0 2457.58 0 0 0 0 0 2315.82 0 0 2485.96 0 0 0 0 0 0 0 0 0 0 -1262.63 0 0 0 0 
0 0 0 0 0 0 0 0 0 0 -1748.79 0 426.572 0 0 0 1136.74 0 0.05 0 0 615.177 0 0 890.912 0 0 -586.489 -1562.32 0 0 1285.06 0 0 0 0 0 0 0 0 0 0 2114.25 0 0 0 0 0 0 0 0 0 0 0 0 0 0 0 0 0 0 
0 0 0 -2109.06 0 0 0 0 0 0 6.63778 0 0 0 2460.33 1149.1 0 0 0 0 829.112 0 0 0 0 32.8837 0 0 0 0 0 0 0 687.506 0 0 0 0 1121.63 -887.707 0 0 0 0 -2084.49 0 0 0 0 0 1115.53 0 2474.36 0 0 0 0 0 0 0 0 
0 0 0 0 0 0 2218.77 -774.636 0 0 0 0 0 0 0 2200.61 0 -1516.69 0 1659.83 0.04 0 0 0 0 0 0 0 -630.131 0 0 0 0 0 0 0 0 0 0 0 0 0 0 0 0 0 0 0 0 0 0 0 0 0 0 0 0 0 0 0 0 
0 0 0 0 0 0 0 0 0 0 0 0 0 0 0 0 0 0 -2069.08 0 0 0.09 830.943 0 0 0 0 0 0 0 0 0 0 0 0 0 0 -897.626 0 -268.944 0 0 0 0 0 0 0 2467.5 0 0 0 0 0 0 0 0 0 0 0 0 0 
0 -185.781 0 0 0 0 -688.574 0 0 0 0 0 0 0 0 0 0 0 0 0 0 2194.51 0.07 0 0 1305.05 0 0 0 0 0 0 958.663 0 0 0 -2381.28 0 0 0 0 0 0 1506.62 0 0 0 1029.92 0 0 0 0 0 0 0 0 0 0 0 0 0 
0 0 0 2050.77 0 0 0 0 0 0 0 0 -2267.75 786.081 0 0 0 0 0 0 0 0 0 0.06 -173.269 0 0 0 -1088.21 0 1219.29 0 0 0 0 0 0 0 0 497.681 0 0 0 0 0 0 0 0 0 0 0 0 0 2015.06 0 0 0 0 0 0 0 
-653.325 0 0 0 0 0 0 0 0 0 0 2373.04 0 0 0 0 0 1864.91 -2115.77 0 0 0 0 -664.617 0.05 0 -572.298 0 0 0 0 0 0 0 0 0 588.931 0 -554.445 820.719 0 0 0 0 0 0 -795.694 0 0 0 0 0 0 584.201 0 0 0 0 0 0 0 
0 -386.746 0 0 0 0 0 0 0 0 1939.53 0 0 0 0 0 0 -1811.66 0 813.242 0 0 2286.22 0 0 0.02 0 0 0 0 0 0 0 0 0 0 0 0 -1893.29 0 0 0 0 0 1350.83 0 0 0 0 0 0 0 0 0 1612.83 -2327.11 0 0 0 0 0 
0 0 0 0 0 0 0 0 0 0 0 0 0 0 0 0 0 0 0 0 0 0 0 0 1410.95 0 0.09 0 0 -1410.03 0 0 2128.59 -564.974 0 0 0 0 -1297.27 0 0 0 -2218.16 0 0 2368.16 0 0 0 0 0 0 0 0 0 0 0 0 0 0 0 
998.489 0 0 0 0 0 0 0 -1959.21 0 0 0 0 0 0 0 -1613.59 0 428.251 0 0 0 0 0 0 0 0 0 731.758 0 2142.02 0 0 1479.31 0 0 0 1072.04 0 0 0 0 0 0 0 0 0 0 0 0 -2350.61 0 0 0 0 0 0 0 0 0 0 
0 1699.65 0 -933.332 0 0 0 0 0 0 0 0 0 0 0 0 0 0 2409.05 0 -2427.98 0 0 990.097 0 0 0 -2118.37 0.06 0 0 0 0 0 0 1869.95 0 2133.32 0 0 0 172.506 0 0 1792.43 0 0 0 0 0 0 -2293.08 0 0 0 0 0 0 0 0 0 
180.288 0 0 0 0 0 1377.07 0 0 0 0 0 0 0 0 0 0 0 0 0 0 0 0 0 0 0 -1540.8 0 0 0.09 0 0 0 0 0 1690.8 1886.73 0 0 0 0 0 1468.47 0 0 0 0 0 0 1452.15 0 0 0 0 0 0 0 0 0 0 0 
0 0 0 0 0 0 0 0 0 0 0 0 -720.313 0 0 1695.07 1780.83 0 0 0 0 0 0 -1053.73 0 0 0 -1197.93 0 0 0.04 0 0 0 0 0 259.178 0 1780.53 0 0 0 0 0 0 0 0 0 0 0 0 0 0 0 245.75 0 0 0 0 0 0 
0 0 0 0 0 0 0 0 0 2362.51 1217.76 0 0 0 0 0 0 0 -109.333 0 0 0 0 0 0 0 0 0 0 0 0 0.04 0 0 0 0 0 0 0 0 0 0 0 0 0 0 0 0 0 0 633.335 0 0 0 0 0 0 0 0 0 0 
0 0 0 1665.47 -379.269 0 2372.89 -1217.92 0 1521.58 0 0 0 0 0 0 920.972 2008.04 0 0 0 0 223.472 0 0 0 -2234.03 0 0 0 0 0 0.09 0 0 1816.54 0 2196.19 0 0 0 0 -2194.81 0 0 0 0 0 0 0 0 0 0 0 0 0 0 0 0 0 0 
0 0 0 0 0 0 0 0 0 0 0 0 0 0 0 0 1600.16 0 0 1780.07 0 0 0 0 0 0 2338.4 1730.78 0 0 0 0 0 0.08 0 0 0 0 0 0 1174.89 0 1082.57 -1638.77 -2232.51 0 0 591.067 0 0 0 0 0 52.2629 0 0 0 0 505.615 0 0 
-1429.87 0 1914.66 0 0 287.103 -809.732 0 0 0 -219.657 0 0 0 0 0 0 1385.31 0 0 0 0 0 0 0 0 0 0 0 0 0 0 0 0 0.04 0 0 0 0 0 0 0 0 2476.81 0 0 0 0 0 0 0 0 -257.805 1949.14 2230.83 0 0 0 0 0 0 
0 0 0 0 0 0 1548.28 0 0 0 0 0 0 0 0 0 0 0 0 0 0 0 0 0 0 0 0 0 1382.72 2126.76 0 0 -1232.87 0 0 0.05 -1208.91 0 372.86 0 0 0 0 0 0 0 0 0 0 0 0 0 0 1380.73 0 0 0 0 0 0 0 
0 0 0 231.101 0 0 0 -2408.14 0 281.915 981.399 0 0 0 0 0 0 -533.082 0 0 0 0 990.707 0 1745.89 0 0 0 0 -2093.34 1217.15 0 0 0 0 -1644.41 0.05 0 2259.06 0 0 917.768 0 -1908.86 0 0 0 0 0 0 0 0 0 0 0 0 60.3504 0 0 0 0 
0 0 0 0 0 0 0 1349.6 0 0 0 0 0 0 0 0 0 0 0 0 0 1424.68 0 0 0 0 0 -1291.92 253.38 0 0 0 -2468.72 0 0 0 0 0.05 0 0 1177.02 0 0 0 0 0 0 2288.66 0 2237.54 0 0 0 0 0 0 0 0 0 0 0 
0 0 0 119.709 0 0 0 0 0 0 0 0 0 0 0 0 0 0 0 1485.41 0 0 0 0 622.349 2452.39 663.091 0 0 0 -697.577 0 0 0 0 547.121 -568.941 0 0.06 0 0 0 0 0 0 0 0 1485.87 0 -1812.42 -1413.24 0 0 0 0 -909.223 0 0 0 0 0 
2314.14 2316.13 0 0 0 4.1963 0 0 0 0 0 2197.1 0 0 0 0 0 0 0 1543.4 0 -1246.6 0 457.701 -283.288 0 0 0 0 0 0 0 0 0 0 0 0 0 0 0.06 0 730.995 0 0 0 0 0 0 0 -1534.09 0 0 0 0 0 0 0 0 0 0 0 
0 0 0 0 0 0 0 0 0 0 0 0 0 2160.94 0 0 0 0 0 0 0 0 0 0 0 0 0 0 0 0 0 0 0 1826.46 0 0 0 172.506 0 0 0 0 0 0 0 0 0 0 0 0 0 0 0 0 0 0 0 0 0 0 0 
1009.48 0 -1260.49 0 0 0 0 0 658.971 2307.28 0 0 0 0 513.092 0 0 0 0 0 0 0 0 0 0 0 0 0 -1295.89 0 0 0 0 0 0 0 -518.738 0 0 2166.74 0 0.08 520.569 0 0 0 -1817.61 -654.546 0 0 0 0 995.132 0 946.608 0 0 0 0 0 0 
0 0 0 0 0 0 0 0 0 0 0 0 0 0 0 0 0 157.857 300.989 0 0 0 0 0 0 0 757.546 0 0 1929.61 0 0 -1797.92 787.912 0 0 0 0 0 0 0 1135.98 0.03 0 0 0 0 0 0 0 0 0 0 0 0 0 0 0 0 0 0 
0 2456.66 0 0 0 -1491.52 0 1532.11 0 0 0 0 0 0 660.802 0 1360.74 0 0 0 0 0 -308.161 0 0 0 0 0 0 0 0 0 0 -1015.73 1703.16 0 1636.48 0 0 0 0 0 0 0.07 0 0 -1494.87 0 0 -2233.88 2023 -1649.14 0 0 0 0 1370.36 0 1605.81 0 0 
0 2154.84 0 0 0 -1449.86 0 0 0 0 0 0 0 0 0 0 1083.94 0 0 1373.41 0 0 0 0 0 -363.094 0 0 1563.08 0 0 0 0 -761.971 0 0 0 0 0 0 0 0 0 0 0.03 0 0 0 0 -934.248 0 0 946.608 -1302.45 0 0 0 0 0 0 0 
0 1814.25 -861.614 0 0 1163.75 0 0 0 0 0 0 0 0 0 980.026 0 1851.02 0 0 0 0 0 0 0 0 1005.2 0 0 0 0 0 0 0 0 0 0 0 0 0 0 0 0 0 0 0.04 0 0 0 0 0 0 0 100.177 0 0 0 0 0 0 0 
0 0 0 0 0 2169.03 -2201.68 0 0 0 1138.11 0 0 0 0 0 0 0 0 0 0 0 0 0 1860.48 0 0 0 0 0 0 0 0 0 0 0 0 0 0 0 0 1756.57 0 874.279 0 0 0.07 302.973 0 0 0 0 1765.11 0 0 0 0 657.598 0 0 0 
0 0 0 0 0 0 -705.359 0 0 0 0 424.284 1487.4 0 0 0 0 0 0 0 0 296.411 1745.12 0 0 0 0 0 0 0 0 0 0 -618.381 0 0 0 -1087.3 -446.715 0 0 1539.43 0 0 0 0 2478.03 0.01 0 0 0 0 0 0 0 0 0 0 0 0 0 
0 0 0 0 1375.24 0 0 0 0 0 0 0 0 0 0 2032.15 2241.2 0 0 0 0 0 0 0 0 0 0 0 0 0 0 0 0 0 0 0 0 0 0 0 0 0 0 0 0 0 0 0 0.04 0 0 0 0 0 0 0 0 0 0 0 0 
0 0 0 0 0 0 0 0 2116.53 -1025.8 0 832.926 0 0 722.144 0 0 0 0 0 0 0 0 0 0 0 0 0 0 1460.84 0 0 0 0 0 0 0 -840.861 321.741 -1793.95 0 0 0 2263.02 -2344.36 0 0 0 0 0.08 0 0 0 0 0 0 -428.861 0 0 0 0 
0 -1275.29 0 0 0 0 0 0 0 0 0 -908.46 0 0 0 0 -2061.14 0 0 617.924 0 0 0 0 0 0 0 1245.23 0 0 0 1282.77 0 0 0 0 0 0 -65.5385 0 0 0 0 508.057 0 0 0 0 0 0 0.01 0 0 0 0 0 0 1681.34 0 0 0 
0 0 0 0 0 0 0 0 0 0 0 0 0 0 0 0 0 0 0 0 0 0 0 0 0 0 0 0 -618.076 0 0 0 0 0 0 0 0 0 0 0 0 0 0 2060.38 0 0 0 0 0 0 0 0.05 0 0 0 0 0 0 0 0 0 
1340.91 0 0 0 2164.3 0 0 0 0 0 0 0 0 0 0 0 -962.02 0 0 -1591.77 0 0 0 0 0 0 0 0 0 0 0 0 0 0 412.076 0 0 0 0 0 0 36.2407 0 0 931.654 0 -422.452 0 0 0 0 0 0.07 0 -2284.08 0 0 0 2481.84 0 0 
0 0 0 0 0 904.187 0 1805.55 0 -373.623 0 0 0 0 0 0 0 0 0 0 0 0 0 928.297 -2199.39 0 0 0 0 0 0 0 0 -2466.12 -4.1963 -559.938 0 0 0 0 0 0 0 0 1233.48 2317.04 0 0 0 0 0 0 0 0.02 315.638 0 0 0 0 0 0 
0 0 0 0 0 0 -2042.38 0 0 0 0 0 0 0 0 0 0 0 0 0 0 0 0 0 0 893.353 0 0 0 0 -549.409 0 0 0 1153.52 0 0 0 0 0 0 757.241 0 0 0 0 0 0 0 0 0 0 -1171.99 2046.95 0.08 2257.07 2260.73 0 0 0 0 
0 0 0 0 0 -2256.61 -1726.36 0 0 0 1308.86 0 0 0 0 0 -1004.44 0 0 0 0 0 0 0 0 2214.04 0 0 0 0 0 0 0 0 0 0 0 0 1751.38 0 0 0 0 0 0 0 0 0 0 0 0 0 0 0 -574.587 0.02 0 0 0 0 0 
48.6007 0 0 0 0 0 0 0 0 0 0 0 0 1131.09 0 0 0 2120.81 0 0 0 0 0 0 0 0 0 0 0 0 0 0 0 0 0 0 349.361 0 0 0 0 0 0 777.993 0 0 0 0 0 1741.92 0 0 0 0 -1956.47 0 0.01 0 0 0 0 
0 0 -773.873 0 0 0 0 0 0 0 0 325.556 0 0 763.497 2054.43 0 0 0 0 0 0 0 0 0 0 0 0 0 0 0 0 0 0 0 0 0 0 0 0 0 0 0 0 0 0 2017.04 0 0 0 -339.747 0 0 0 0 0 0 0.05 0 0 0 
0 0 0 0 964.614 0 0 1671.88 0 0 0 -747.627 1027.02 0 0 0 0 0 0 0 0 0 0 0 0 0 0 0 0 0 0 0 0 -2421.41 0 0 0 0 0 0 0 0 0 1653.57 0 0 0 0 0 0 0 0 -1317.56 0 0 0 0 0 0.02 0 0 
0 0 0 0 0 0 0 0 0 899.457 0 1124.53 0 0 0 0 0 0 0 0 0 0 0 0 0 0 0 0 0 0 0 0 0 0 0 0 0 0 0 0 0 0 0 0 0 0 0 0 0 0 0 0 0 0 0 0 0 0 0 0.04 0 
0 0 0 0 0 0 0 0 0 0 0 0 0 1706.98 0 0 0 0 0 0 0 0 0 0 0 0 0 0 0 0 0 0 0 0 0 0 0 0 0 0 0 0 0 0 0 0 0 0 0 0 0 0 0 0 0 0 0 0 0 0 0.07 
