*Vertices 60
*Matrix 
0.06 0 0 0 0 0 0 0 0 0 0 -1405.45 0 0 0 0 0 0 0 0 0 0 0 0 0 0 0 0 1007.34 0 0 0 0 0 0 0 0 0 1778.39 0 0 0 0 0 1313.75 0 0 0 -1176.11 0 0 0 0 0 108.57 0 0 0 0 0 
0 0.07 0 -114.216 0 0 0 0 0 0 0 -2003.77 0 0 0 0 2372.28 0 0 0 0 0 0 0 2311.55 0 1964.09 0 0 0 277.337 0 0 0 0 0 0 0 0 0 0 0 0 2189.78 0 0 0 1025.35 0 0 0 0 0 0 -983.993 0 0 0 0 0 
0 0 0 0 0 0 0 0 0 0 0 0 0 0 0 0 0 0 0 0 0 0 0 0 0 0 0 0 0 0 0 321.284 0 0 -90.4111 0 0 0 0 1010.24 -1520.05 0 2374.57 0 0 0 0 0 0 1739.78 0 0 -67.217 0 0 0 0 0 0 0 
0 -1447.87 0 0.08 0 0 0 0 0 0 0 0 0 0 -349.055 0 0 0 0 0 0 0 0 0 0 0 593.661 0 0 0 0 0 1429.26 0 0 711.31 947.218 0 0 0 0 0 225.761 0 0 0 0 0 2140.19 -237.205 0 0 0 0 0 0 0 0 0 0 
0 0 0 0 0.07 2403.56 0 0 0 0 0 0 0 0 0 0 0 0 0 0 0 0 0 0 0 0 0 0 0 -1439.94 0 0 314.112 0 0 -1770.61 0 0 0 0 0 0 0 0 -1232.72 869.091 0 0 0 0 0 0 0 0 0 235.679 0 1179.46 0 0 
0 0 0 0 -1216.7 0.09 0 0 0 0 0 0 0 0 1715.83 391.324 0 0 0 0 0 0 0 0 0 0 618.839 0 0 0 0 0 0 0 0 0 1941.97 0 0 0 0 0 0 0 0 0 0 0 0 0 0 0 0 0 0 0 0 0 0 0 
0 0 0 0 0 0 0.07 0 0 0 0 1099.66 0 1649.6 0 0 0 0 0 0 0 1810.43 -1931.59 608.615 0 0 0 0 0 0 0 0 0 0 0 0 0 0 0 0 0 0 0 0 0 0 0 0 725.501 0 0 0 0 77.7459 0 0 0 0 0 0 
0 0 0 0 0 0 0 0 0 908.155 0 0 463.958 0 -2281.64 0 0 0 0 0 0 550.935 0 0 0 0 0 0 0 0 0 0 0 0 0 0 0 0 0 1692.79 0 0 0 0 0 0 0 0 0 0 0 -706.732 0 0 0 0 0 0 0 0 
0 0 0 0 0 0 0 0 0.06 0 0 0 0 1732.46 0 0 -2242.12 0 0 0 0 0 994.522 0 0 0 2361.45 0 0 -2385.56 0 0 0 0 0 0 0 0 0 0 0 0 453.429 0 0 0 0 0 0 0 0 0 0 0 0 1549.35 0 0 0 0 
0 0 0 0 0 0 0 -530.793 0 0.03 2469.18 0 0 0 0 0 0 0 0 135.578 0 1910.69 0 464.568 0 0 2275.54 0 0 0 2123.1 976.669 0 0 0 0 0 0 0 0 0 0 0 0 0 0 0 0 -1581.55 0 0 0 0 0 0 0 0 0 0 0 
0 0 0 0 0 0 0 0 0 2050.92 0.02 0 0 56.5355 0 0 0 0 0 0 0 0 0 0 601.444 0 0 0 0 0 0 -1835 1784.65 0 0 0 0 0 0 0 0 0 0 1452.15 0 0 0 0 1461.3 1418.12 0 0 0 0 0 0 0 0 0 0 
-1905.96 848.796 0 0 0 0 664.006 0 0 0 0 0.06 -154.5 0 0 0 0 0 0 0 0 0 0 0 0 0 0 0 0 0 0 0 0 0 0 0 0 2495.57 1700.87 1351.28 0 0 0 0 0 0 -1249.05 0 374.691 942.793 -994.369 0 0 0 0 0 0 0 0 0 
0 0 0 0 0 0 0 -1500.06 0 0 0 1853.62 0.06 0 0 0 0 0 0 0 0 0 0 0 0 0 0 0 1758.4 0 0 0 0 0 0 0 0 0 437.101 0 0 0 -2081.59 0 0 0 0 0 0 0 0 0 0 0 0 0 0 2489.17 0 0 
0 0 0 0 0 0 -2241.97 0 1254.69 0 -121.693 0 0 0.05 0 0 0 0 0 0 0 0 -1679.51 0 0 0 0 0 0 0 0 -2177.11 0 0 2063.28 0 0 0 0 0 2405.24 0 0 0 0 0 1272.85 0 0 0 0 0 0 0 0 0 0 0 0 0 
0 0 0 2382.81 0 6.48518 0 -1309.17 0 0 0 0 0 0 0.03 0 0 58.977 0 0 0 97.4303 0 0 0 0 0 733.131 0 0 0 0 0 0 320.368 0 0 0 0 0 0 0 0 0 0 0 0 -936.842 0 0 0 0 0 0 0 0 0 0 0 0 
0 0 0 0 0 -2446.44 0 0 0 0 0 0 0 0 0 0.02 0 0 0 0 0 0 0 0 -776.925 0 0 1076.16 0 829.722 0 0 -2295.53 0 0 0 0 0 0 0 2480.93 0 1374.48 1856.06 0 0 0 0 0 -255.821 0 0 0 0 0 0 0 0 0 0 
0 371.487 0 0 0 0 0 0 1005.51 0 0 0 0 0 0 0 0.08 0 0 0 0 0 0 0 0 0 0 0 0 0 0 -201.498 0 0 0 0 0 0 0 1930.68 0 0 0 0 0 0 0 0 0 0 2410.58 0 0 0 0 0 0 0 0 0 
0 0 0 0 0 0 0 0 0 0 0 0 0 0 1267.82 0 0 0.03 0 -1795.33 0 0 0 0 0 0 0 0 0 0 1898.02 0 0 0 0 0 0 1533.94 0 0 1759.47 -170.217 0 0 0 0 0 0 0 0 0 0 0 0 -1751.53 0 0 0 0 0 
0 0 0 0 0 0 0 0 0 0 0 0 0 0 0 0 0 0 0.09 0 964.156 -1563.54 0 0 0 0 0 0 0 -233.543 0 0 0 0 0 0 0 0 0 0 0 0 1280.18 0 0 0 0 -462.432 0 1816.54 0 0 0 2175.28 1171.99 0 0 1769.69 0 0 
0 0 0 0 0 0 0 0 0 687.811 0 0 0 0 0 0 0 2100.36 0 0.02 0 -1682.87 0 0 0 0 0 0 0 0 0 0 0 0 0 0 0 0 0 0 0 0 0 1432.46 0 0 1943.8 0 0 511.872 0 0 0 0 0 0 0 194.632 0 0 
0 0 0 0 0 0 0 0 0 0 0 0 0 0 0 0 0 0 1711.4 0 0.04 0 1293.45 0 1296.35 0 0 -2173.45 0 0 0 0 0 0 0 0 0 -34.4096 0 369.198 1685.31 0 0 0 0 1645.18 0 2369.53 0 0 866.344 0 0 0 0 0 0 0 0 0 
0 0 0 0 0 0 1742.53 234.611 0 904.187 0 0 0 0 2063.59 0 0 0 -924.482 2240.75 0 0 -582.369 0 0 0 0 0 0 0 0 0 0 0 0 -2184.74 0 2496.34 0 0 0 -1202.35 0 0 0 0 0 -531.404 15.183 2352.75 0 0 0 0 0 0 0 0 0 0 
0 0 0 0 0 0 2214.96 0 1916.18 0 0 0 0 1940.6 0 0 0 0 0 0 -1403.62 -504.089 0.01 0 0 0 0 588.626 0 0 0 0 2353.36 0 0 0 -1509.06 0 0 788.522 0 0 0 0 0 1927.02 0 0 0 0 0 0 0 0 -1594.82 0 -1393.09 0 0 0 
0 0 0 0 0 0 2227.47 0 0 -1189.84 0 0 0 0 0 0 0 0 0 0 0 0 0 0.04 0 0 0 0 0 1618.78 0 0 0 0 0 0 -27.543 1612.06 0 0 0 0 0 0 0 0 0 0 0 0 0 0 0 0 0 0 0 0 0 0 
0 586.947 0 0 0 0 0 0 0 0 1648.53 0 0 0 0 2450.71 0 0 0 0 2402.49 0 0 0 0.03 0 0 0 2383.88 1465.42 0 0 0 0 0 0 -1576.82 0 0 0 2405.09 -668.889 0 0 0 2190.54 -1615.12 -1373.26 -383.541 0 -1949.9 0 1377.22 0 0 0 -418.638 0 0 0 
0 0 0 0 0 0 0 0 0 0 0 0 0 0 0 0 0 0 0 0 0 0 0 0 0 0.02 0 0 -542.085 0 0 0 0 0 0 0 0 0 0 0 0 0 0 0 0 0 0 0 0 1270.1 0 0 0 0 0 0 0 0 0 0 
0 1441.31 0 -475.249 0 -270.318 0 0 -1910.38 -967.666 0 0 0 0 0 0 0 0 0 0 0 0 0 0 0 0 0.03 0 0 0 0 0 0 0 2376.4 0 0 0 0 1162.07 0 0 0 1625.49 0 0 0 0 0 -916.7 0 0 0 0 0 0 0 0 -1220.05 0 
0 0 0 0 0 0 0 0 0 0 0 0 0 0 1065.48 -376.827 0 0 0 0 2275.08 0 746.712 0 0 0 0 0.02 0 0 0 0 0 1931.9 0 0 0 0 -66.1489 0 0 517.823 0 0 -183.187 0 0 0 0 0 0 0 0 0 -1648.38 0 0 0 0 -1227.84 
1483.12 0 0 0 0 0 0 0 0 0 0 0 -778.603 0 0 0 0 0 0 0 0 0 0 0 226.524 1526.92 0 0 0.04 0 0 0 0 0 0 0 0 0 1213.64 0 0 0 0 0 0 373.928 0 0 0 0 0 -2261.8 0 0 0 0 0 0 0 0 
0 0 0 0 666.753 0 0 0 1636.78 0 0 0 0 0 0 -1441.31 0 0 781.655 0 0 0 0 -62.6392 -264.824 0 0 0 0 0.07 0 0 0 0 0 0 0 0 0 1431.7 0 0 0 -237.205 0 -1734.44 0 0 0 0 0 0 0 0 0 0 0 0 0 0 
0 432.371 0 0 0 0 0 0 0 268.487 0 0 0 0 0 0 0 93.7681 0 0 0 0 0 0 0 0 0 0 0 0 0.02 0 0 0 0 0 0 0 0 0 0 0 0 2439.57 221.641 0 0 0 0 0 0 0 0 0 0 0 0 0 0 0 
0 0 1240.35 0 0 0 0 0 0 96.3622 -1772.44 0 0 553.377 0 0 -488.678 0 0 0 0 0 0 0 0 0 0 0 0 0 0 0.02 1757.33 0 0 0 0 0 0 0 -736.641 0 0 0 1319.7 0 0 0 0 0 0 0 0 0 0 0 0 0 0 0 
0 0 0 1583.07 41.8867 0 0 0 0 0 1626.87 0 0 0 0 1189.38 0 0 0 0 0 0 -2449.8 0 0 0 0 0 0 0 0 -29.6793 0.06 0 0 355.312 0 0 0 0 0 0 0 0 0 0 0 0 0 0 0 0 0 0 0 0 2252.49 0 0 0 
0 0 0 0 0 0 0 0 0 0 0 0 0 0 0 0 0 0 0 0 0 0 0 0 0 0 0 2010.33 0 0 0 0 0 0.03 326.624 0 0 0 0 0 0 0 0 0 0 0 0 0 0 0 0 2300.71 0 0 0 0 0 0 0 0 
0 0 1407.28 0 0 0 0 0 0 0 0 0 0 1385.31 2155.75 0 0 0 0 0 0 0 0 0 0 0 -69.9637 0 0 0 0 0 0 -1026.87 0.07 0 0 1177.63 0 0 0 0 0 2193.9 0 0 0 0 0 0 0 0 0 -211.112 0 0 0 0 0 0 
0 0 0 1285.82 -234.001 0 0 0 0 0 0 0 0 0 0 0 0 0 0 0 0 -1301.54 0 0 0 0 0 0 0 0 0 0 2476.5 0 0 0.01 0 0 0 0 0 0 0 0 0 0 0 -1667.15 0 0 0 1901.68 0 1256.98 0 0 0 0 0 0 
0 0 0 271.233 0 22.0496 0 0 0 0 0 0 0 0 0 0 0 0 0 0 0 0 2451.93 1076.92 964.766 0 0 0 0 0 0 0 0 0 0 0 0.03 0 0 -1054.19 0 0 0 0 0 0 0 0 0 0 0 0 0 0 0 0 0 0 0 0 
0 0 0 0 0 0 0 0 0 0 0 -740.913 0 0 0 0 0 -1591.62 0 0 585.574 2145.83 0 2433.77 0 0 0 0 0 0 0 0 0 0 616.855 0 0 0.03 0 0 0 42.497 0 -2239.98 0 0 0 2005.45 0 0 859.325 0 0 -1828.14 0 0 0 103.229 0 0 
2166.28 0 0 0 0 0 0 0 0 0 0 -952.559 830.943 0 0 0 0 0 0 0 0 0 0 0 0 0 0 -678.655 2185.05 0 0 0 0 0 0 0 0 0 0.03 0 0 725.654 0 0 0 0 0 0 0 0 0 0 0 0 0 0 0 0 0 0 
0 0 1954.48 0 0 0 0 -0.534074 0 0 0 2359.61 0 0 0 0 1554.08 0 0 0 1423.15 0 -341.578 0 0 0 384.61 0 0 1504.94 0 0 0 0 0 0 -924.024 0 0 0.08 0 0 0 0 0 0 0 0 0 0 0 0 0 0 0 0 0 0 0 0 
0 0 -238.731 0 0 0 0 0 0 0 0 0 0 972.243 0 -984.146 0 2408.6 0 0 1193.04 0 0 0 -1290.25 0 0 0 0 0 0 1276.51 0 0 0 0 0 0 0 0 0.08 0 0 0 0 0 0 0 0 0 0 0 0 0 0 0 0 -834.758 0 0 
0 0 0 0 0 0 0 0 0 0 0 0 0 0 0 0 0 -709.174 0 0 0 324.793 0 0 -481.506 0 0 2128.44 0 0 0 0 0 0 0 0 0 -1028.7 1425.44 0 0 0.03 0 -122.456 380.337 0 0 0 0 0 0 0 0 0 0 0 598.239 0 0 0 
0 0 -1582.16 2112.42 0 0 0 0 686.59 0 0 0 -1462.37 0 0 1180.53 0 0 686.132 0 0 0 0 0 0 0 0 0 0 0 0 0 0 0 0 0 0 0 0 0 0 0 0.03 0 0 0 0 0 0 1069.14 0 0 0 0 0 0 0 0 0 0 
0 1207.69 0 0 0 0 0 0 0 0 -1226.77 0 0 0 0 1949.29 0 0 0 1542.63 0 0 0 0 0 0 88.4274 0 0 1103.47 1968.67 0 0 0 -143.056 0 0 -1236.53 0 0 0 -2250.51 0 0.02 0 0 0 0 -1063.19 0 0 0 0 0 600.528 0 -937.3 0 0 0 
-688.116 0 0 0 -134.053 0 0 0 0 0 0 0 0 0 0 0 0 0 0 0 0 0 0 0 0 0 0 2007.13 0 0 445.036 2230.83 0 0 0 0 0 0 0 0 0 -513.092 0 0 0.06 -310.144 0 0 0 0 0 0 0 0 -1365.78 0 0 0 0 0 
0 0 0 0 909.833 0 0 0 0 0 0 0 0 0 0 0 0 0 0 0 2245.48 0 488.22 0 149.159 0 0 0 242.088 -96.5148 0 0 0 0 0 0 0 0 0 0 0 0 0 0 279.778 0.05 0 0 0 -422.758 0 -2014.45 0 0 0 0 -21.897 0 0 0 
0 0 0 0 0 0 0 0 0 0 0 2422.18 0 2447.81 0 0 0 0 0 1977.52 0 0 0 0 724.433 0 0 0 0 0 0 0 0 0 0 0 0 0 0 0 0 0 0 0 0 0 0.04 -730.384 0 0 0 0 0 0 0 0 0 0 0 0 
0 1187.7 0 0 0 0 0 0 0 0 0 0 0 0 -195.7 0 0 0 1611.45 0 1210.59 809.275 0 0 -2192.07 0 0 0 0 0 0 0 0 0 0 962.477 0 -1728.19 0 0 0 0 0 0 0 0 2335.35 0.07 0 0 -1759.16 0 0 0 0 0 0 0 0 0 
748.695 0 0 -361.873 0 0 -1531.95 0 0 -993.912 1430.02 -173.727 0 0 0 0 0 0 0 0 0 16.8615 0 0 1683.78 0 0 0 0 0 0 0 0 0 0 0 0 0 0 0 0 0 0 2431.64 0 0 0 0 0.06 0 0 1091.72 0 2288.05 0 0 0 0 0 0 
0 0 400.479 1278.5 0 0 0 0 0 0 1521.58 -2467.5 0 0 0 1803.11 0 0 1368.68 652.715 0 -322.352 0 0 0 -1195.94 1420.1 0 0 0 0 0 0 0 0 0 0 0 0 0 0 0 1374.32 0 0 -875.5 0 0 0 0.01 0 0 0 0 0 0 0 -197.226 0 0 
0 0 0 0 0 0 0 0 0 0 0 1710.64 0 0 0 0 -765.481 0 0 0 -2465.67 0 0 0 604.038 0 0 0 0 0 0 0 0 0 0 0 0 2236.78 0 0 0 0 0 0 0 0 0 259.178 0 0 0.08 0 0 0 -544.221 2486.88 0 0 0 0 
0 0 0 0 0 0 0 1424.68 0 0 0 0 0 0 0 0 0 0 0 0 0 0 0 0 0 0 0 0 -140.156 0 0 0 0 -860.088 0 2156.97 0 0 0 0 0 0 0 0 0 1561.4 0 0 0.0762963 0 0 0.04 1223.72 0 0 0 0 0 0 0 
0 0 2037.8 0 0 0 0 0 0 0 0 0 0 0 0 0 0 0 0 0 0 0 0 0 368.892 0 0 0 0 0 0 0 0 0 0 0 0 0 0 0 0 0 0 0 0 0 0 0 0 0 0 2365.26 0.08 0 0 0 0 0 0 0 
0 0 0 0 0 0 1582.16 0 0 0 0 0 0 0 0 0 0 0 -2185.66 0 0 0 0 0 0 0 0 0 0 0 0 0 0 0 220.725 -955.458 0 1255.61 0 0 0 0 0 0 0 0 0 0 237.053 0 0 0 0 0.05 0 0 0 0 0 0 
653.63 712.378 0 0 0 0 0 0 0 0 0 0 0 0 0 0 0 -2274.32 1977.22 0 0 0 2019.49 0 0 0 0 -8.77407 0 0 0 0 0 0 0 0 0 0 0 0 0 0 0 1962.11 777.078 0 0 0 0 0 1709.72 0 0 0 0.08 0 -65.8437 0 0 0 
0 0 0 0 1866.44 0 0 0 1126.06 0 0 0 0 0 0 0 0 0 0 0 0 0 0 0 0 0 0 0 0 0 0 0 0 0 0 0 0 0 0 0 0 0 0 0 0 0 0 0 0 0 1105.15 0 0 0 0 0.01 0 0 0 0 
0 0 0 0 0 0 0 0 0 0 0 0 0 0 0 0 0 0 0 0 0 0 1269.04 0 -806.375 0 0 0 0 0 0 0 -595.492 0 0 0 0 0 0 0 0 2245.48 0 1216.09 0 340.968 0 0 0 0 0 0 0 0 -1670.2 0 0.05 0 0 0 
0 0 0 0 130.085 0 0 0 0 0 0 0 1224.63 0 0 0 0 0 759.072 2128.13 0 0 0 0 0 0 0 0 0 0 0 0 0 0 0 0 0 1375.55 0 0 1348.54 0 0 0 0 0 0 0 0 -331.355 0 0 0 0 0 0 0 0.08 0 0 
0 0 0 0 0 0 0 0 0 0 0 0 0 0 0 0 0 0 0 0 0 0 0 0 0 0 1793.04 0 0 0 0 0 0 0 0 0 0 0 0 0 0 0 0 0 0 0 0 0 0 0 0 0 0 0 0 0 0 0 0.05 0 
0 0 0 0 0 0 0 0 0 0 0 0 0 0 0 0 0 0 0 0 0 0 0 0 0 0 0 2205.95 0 0 0 0 0 0 0 0 0 0 0 0 0 0 0 0 0 0 0 0 0 0 0 0 0 0 0 0 0 0 0 0.05 
