*Vertices 65
*Matrix 
0.06 0 0 0 0 0 -2357.94 0 0 -151.448 0 -399.716 2487.79 -1143.15 0 -1165.73 0 0 0 0 123.371 -136.494 830.943 0 0 0 0 0 0 0 0 0 0 0 0 0 0 1894.51 0 0 0 0 897.626 0 0 -1672.03 1796.09 0 0 0 1339.69 1257.59 -149.007 0 0 0 0 0 306.33 0 0 0 0 0 0 
0 0.01 0 0 0 0 0 0 0 0 1179.77 0 0 0 0 2145.53 2467.19 0 0 0 0 -113.3 458.007 0 0 0 0 0 2053.51 0 0 0 227.134 0 0 0 0 0 0 0 362.026 -86.1385 0 0 0 0 -1910.23 2118.06 -1643.04 0 0 0 0 0 0 0 0 0 1114.76 0 0 0 0 0 0 
0 0 0.03 0 -2335.96 2315.21 0 0 0 561.769 0 380.642 0 0 0 0 1835.46 746.406 0 -1602.6 0 195.09 0 -67.3696 -560.701 0 -2470.4 0 0 0 0 0 0 0 0 0 0 0 0 0 0 0 0 0 0 0 0 0 448.546 2095.48 0 0 0 1882.46 0 0 0 0 2027.73 0 0 827.738 0 0 0 
0 0 0 0.02 0 0 0 0 0 1021.84 0 0 0 0 0 0 0 0 0 0 0 0 0 0 0 0 -279.778 0 0 0 0 0 0 0 -2437.59 1850.26 0 0 0 0 0 0 0 2089.37 0 0 0 0 0 0 878.094 0 0 0 0 -2205.5 0 0 2106.92 0 0 1149.56 -1116.6 0 0 
0 0 1684.24 0 0.07 0 0 0 0 0 1261.56 0 -860.088 0 906.781 0 -1533.33 -205.466 0 0 2408.44 0 0 0 0 -2401.73 0 0 0 0 0 0 0 0 0 0 0 0 2353.97 0 0 0 0 0 0 0 0 1211.2 0 0 0 0 2418.52 0 -16.0985 0 0 -912.275 0 0 0 0 0 0 0 
0 0 -839.335 0 0 0.01 -77.5933 0 0 0 0 0 0 0 0 -466.094 0 0 0 -286.187 0 0 0 0 0 0 2177.11 0 0 0 0 0 0 389.34 0 951.338 0 0 -1932.66 -457.701 0 0 0 1130.94 0 -474.487 0 0 1099.66 -428.404 0 0 1301.54 -104.144 2050.16 497.833 0 -1240.2 0 13.1993 0 -1530.73 0 1184.5 0 
-1325.95 0 0 0 0 -1253.01 0.02 0 0 1184.65 1539.43 -1981.19 0 -1570.25 0 0 0 0 0 0 0 0 0 0 1610.69 0 0 0 0 0 0 0 1559.88 717.719 870.922 0 0 0 0 0 -1460.08 0 0 2022.39 1386.99 0 960.799 365.993 0 0 0 -1376.92 1234.24 0 0 0 0 0 0 0 2411.65 0 0 0 0 
0 0 0 0 0 0 0 0.06 0 0 0 -1641.67 0 1437.5 0 0 0 0 0 1524.93 0 0 0 1182.52 1818.52 0 1113.09 0 0 0 -2252.8 0 0 -1623.66 1839.58 0 0 0 -1106.83 0 0 0 -736.488 -735.878 0 0 0 0 0 0 0 0 2202.9 0 0 0 0 0 0 0 0 0 0 0 0 
0 0 0 0 0 0 0 0 0.07 0 0 74.3889 1238.36 0 -1729.87 0 0 0 796.762 0 0 2170.86 0 0 0 -976.974 0 1457.49 0 0 -1062.73 0 2445.68 0 1769.54 0 -1484.8 0 0 -128.559 0 0 0 0 0 0 0 0 0 0 0 0 0 1701.79 0 0 0 0 0 0 0 1506.01 0 0 0 
1834.39 0 2341.61 1698.58 0 0 620.365 0 0 0.04 0 0 -400.479 0 0 0 1274.22 0 0 0 0 0 0 0 0 0 0 0 0 0 1450.62 0 0 0 0 0 0 -1807.54 0 0 0 0 0 0 0 1775.34 0 -1750.01 0 -2253.41 0 0 1029.31 710.395 1792.73 1406.52 0 0 557.497 0 0 0 0 0 0 
0 1780.53 0 0 1607.64 0 -606.937 0 0 0 0.05 0 0 0 2152.09 2453.15 2457.27 0 538.118 1866.74 0 0 0 595.187 2061.6 -1711.4 0 -1970.05 0 0 0 0 0 0 1238.82 0 -226.676 -1455.05 -19.9133 0 2326.81 0 0 0 -1060.75 0 0 0 0 0 1561.4 0 0 82.1711 0 0 1483.58 -1246.15 -484.252 0 0 0 0 0 0 
1066.7 0 -2253.87 0 0 0 1327.63 -1428.19 2013.53 0 0 0.06 0 0 0 0 989.639 0 0 0 0 438.627 -573.367 0 0 0 0 0 638.676 0 0 0 0 928.907 -282.22 2085.25 0 0 0 1981.95 0 0 0 -1652.04 -856.12 1097.98 0 0 -1347.47 -1636.02 0 0 0 0 0 0 0 0 0 0 0 0 0 0 0 
700.018 0 0 0 1744.36 0 0 0 223.777 23.423 0 0 0.04 1358.76 0 0 0 0 0 0 0 0 0 0 0 0 0 0 757.241 0 0 0 0 -2452.85 0 0 -1468.63 0 0 2412.87 0 -1792.12 0 0 0 0 -2177.42 1418.42 0 0 0 1937.7 0 0 -13.3518 0 0 0 0 61.8763 0 0 0 -687.658 0 
257.805 0 0 0 0 0 746.559 1989.73 0 0 0 0 -218.589 0.04 1793.95 0 0 0 0 0 0 0 1972.49 939.436 2.82296 0 0 -1024.58 0 1166.8 0 -2308.5 0 0 2280.11 0 78.5089 2259.67 0 0 58.977 0 -1607.49 0 0 0 0 0 0 0 -1249.35 -246.513 0 -1892.22 0 0 0 0 0 1584.44 0 0 0 0 0 
0 0 0 0 1478.55 0 0 0 -2179.25 0 -1101.79 0 0 2262.72 0.05 473.266 -953.017 0 1570.71 0 0 0 0 0 0 0 0 0 0 0 -1538.97 1146.81 0 2322.84 0 0 0 0 -1521.42 0 0 0 187.613 0 -488.22 0 0 -232.475 2009.57 -1758.71 0 0 1781.44 0 0 -2432.71 0 0 0 376.98 966.597 -576.113 0 0 0 
-1216.54 1720.71 0 0 0 1007.03 0 0 0 0 1745.73 0 0 0 -698.34 0.04 0 0 0 0 0 0 0 0 0 0 -829.875 0 0 0 0 0 2082.05 0 0 1674.93 -1905.65 -2.06 0 0 -248.344 0 0 0 0 0 0 0 0 0 0 0 1323.97 0 0 0 0 0 -272.912 0 887.707 0 0 0 0 
0 1088.67 -1760.99 0 2454.53 0 0 0 0 763.497 955.153 332.423 0 0 -2258.29 0 0.07 0 0 0 0 0 0 0 -169.759 538.118 -1789.53 0 -2317.8 0 0 0 0 0 582.522 1336.94 0 0 0 -1128.19 0 0 1538.36 0 0 0 0 0 0 0 0 0 0 1974.93 0 0 0 0 1075.7 -2362.51 0 0 0 0 0 
0 0 -824.992 0 492.95 0 0 0 0 0 0 0 0 0 0 0 0 0.03 0 0 0 0 293.817 0 -2378.99 0 0 0 0 0 0 0 0 62.6392 0 0 0 -506.836 0 0 0 1487.09 0 0 0 0 0 1764.2 0 0 1798.99 -2082.05 0 0 1930.52 0 1608.1 0 0 0 0 0 0 0 0 
0 0 0 0 0 0 0 0 2049.24 0 109.485 0 0 0 -1197.78 0 0 0 0.07 0 0 1439.63 0 0 0 0 449.309 751.289 0 1691.56 0 0 0 0 0 2399.14 -2158.96 0 1849.5 2073.66 1100.57 0 -208.365 0 0 0 -1382.26 230.186 0 0 -2095.78 0 0 0 0 -1038.16 2327.88 0 -1929 0 0 0 0 0 0 
0 0 1057.54 0 0 155.416 0 189.901 0 0 -2215.26 0 0 0 0 0 0 0 0 0.07 1320.31 15.7933 0 1162.98 0 0 0 0 0 -1605.66 0 -513.398 1193.04 0 0 -206.992 0 0 0 0 0 0 0 0 0 0 0 0 0 0 0 0 0 0 0 0 147.176 2495.27 0 0 364.62 0 -2349.09 0 0 
-652.409 0 0 0 -228.202 0 0 0 0 0 0 0 0 0 0 0 0 0 0 361.873 0.02 0 1149.86 182.577 764.26 0 1596.5 0 0 0 2261.19 0 0 0 -544.221 0 1253.32 0 0 0 0 0 0 0 2175.13 0 0 0 0 0 0 0 0 0 188.07 0 0 -366.451 0 1946.09 0 0 0 -291.223 0 
-2092.58 2353.66 1358.46 0 0 0 0 0 -2269.28 0 0 97.4303 0 0 0 0 0 0 1238.36 1807.23 0 0.07 0 0 0 1328.85 0 0 0 0 1250.27 0 0 -2245.78 0 0 0 0 0 0 0 -937.605 -875.5 -375.759 0 1740.55 0 0 0 1960.89 0 0 318.537 0 0 0 0 880.84 0 0 0 0 675.909 0 0 
1407.44 676.672 0 0 0 0 0 0 0 0 0 -204.093 0 1966.99 0 0 0 -710.547 0 0 -963.24 0 0.06 0 0 0 0 1376.46 0 -1547.98 -774.026 0 0 0 0 -225.761 0 0 0 0 0 338.069 0 0 0 0 0 0 0 0 0 0 0 0 0 0 0 0 0 0 0 0 0 0 0 
0 0 -1833.63 0 0 0 0 -1726.66 0 0 -2257.53 0 0 226.829 0 0 0 0 0 -688.726 1215.17 0 0 0.07 0 1549.35 0 0 0 0 0 2454.99 -31.9681 0 1903.06 0 0 0 -1226.92 673.62 0 0 1602.3 0 0 0 -1916.49 2331.08 0 0 0 0 0 0 0 1997.97 -158.01 0 0 0 0 0 -177.389 -379.574 0 
0 0 2347.56 0 0 0 -788.064 -638.523 0 0 2163.08 0 0 1119.65 0 0 -1069.6 2159.72 0 0 -1414.46 0 0 0 0.07 0 0 0 0 0 0 2138.05 0 701.086 0 0 0 -2396.39 0 2480.01 0 0 0 0 0 0 0 0 0 0 0 -227.287 0 0 0 0 -2089.98 0 0 0 1680.73 0 0 0 0 
0 0 0 0 -926.618 0 0 0 -832.163 0 1346.1 0 0 0 0 0 -1920.45 0 0 0 0 1639.07 0 2007.58 0 0.04 0 0 0 0 -31.663 0 0 0 0 -2176.05 0 1406.67 0 0 0 0 0 614.261 -1168.94 0 0 0 0 0 0 0 1437.19 0 0 1941.36 0 0 -1001.69 0 0 0 0 0 0 
0 0 227.897 1827.68 0 2012.16 0 2334.89 0 0 0 0 0 0 0 -611.972 -1398.43 0 -991.165 0 -1468.78 0 0 0 0 0 0.03 -1338.62 0 0 0 1450.77 -1652.96 2388.76 0 0 0 0 0 0 0 -1616.79 -1705.3 0 0 0 0 0 -1429.72 0 0 34.7148 0 2364.5 0 0 0 0 0 992.843 2250.97 0 0 0 -2336.73 
0 0 0 0 0 0 0 0 -792.184 0 1129.26 0 0 1890.24 0 0 0 0 1828.14 0 0 0 -183.798 0 0 0 -366.298 0 0 0 0 0 0 0 761.666 0 0 0 0 0 -722.907 0 0 2008.96 -1090.5 0 -811.106 0 0 0 0 1599.4 0 0 0 0 0 0 0 -1173.67 173.116 0 0 0 0 
0 807.138 0 0 0 0 0 0 0 0 0 644.322 1273.31 0 0 0 -1163.75 0 0 0 0 0 0 0 0 0 0 0 0.03 0 0 0 0 1121.94 0 1008.87 0 -1241.26 0 0 0 0 0 0 -2218.16 0 0 0 0 0 0 0 2186.57 0 1178.55 0 0 0 -1752.45 2115.77 952.864 0 0 0 0 
0 0 0 0 0 0 0 0 0 0 0 0 0 2097 0 0 0 0 2284.69 1461 0 0 1028.7 0 0 0 0 0 0 0.03 0 0 0 0 193.869 -1599.86 -525.147 0 0 0 0 0 0 246.818 0 0 0 0 0 0 0 0 0 0 0 0 0 1031.14 0 0 0 355.464 0 1159.93 0 
0 0 0 0 0 0 0 2265.62 1277.89 325.861 0 0 0 0 -785.775 0 0 0 0 0 625.248 430.235 1689.12 0 0 -907.849 0 0 0 0 0.07 -1901.99 0 0 781.808 0 0 0 0 0 967.666 2227.47 0 0 0 0 0 0 0 0 0 476.623 0 0 0 0 0 -1593.14 0 0 0 -49.6689 0 0 0 
0 0 0 0 0 0 0 0 0 0 0 0 0 2093.04 1143.6 0 0 0 0 84.6126 0 0 0 773.568 828.043 0 200.125 0 0 0 -783.944 0.06 0 171.896 -372.097 0 0 0 1535.77 -445.189 0 302.21 0 0 410.398 0 0 0 0 0 0 0 0 0 1270.56 0 -1569.34 0 0 0 0 0 0 0 0 
0 2036.58 0 0 0 0 1849.35 0 1531.65 0 0 0 0 0 0 519.501 0 0 0 317.469 0 0 0 1443.75 0 0 1446.5 0 0 0 0 0 0.04 0 0 0 0 -2026.51 414.518 -1457.49 0 0 0 999.252 0 1398.59 0 0 0 0 0 0 -463.805 0 0 0 -1341.98 0 875.652 0 0 0 0 0 0 
0 0 0 0 0 -1755.04 -997.879 2170.25 0 0 0 -2391.51 -514.924 0 1773.35 0 0 820.414 0 0 0 1496.09 0 0 1272.39 0 74.3889 0 1375.85 0 0 -2014.15 0 0.03 0 0 0 0 2206.87 0 0 0 0 1379.67 0 0 0 0 761.208 0 -358.364 0 0 0 -421.995 0 0 17.1667 0 0 0 -412.687 1921.22 0 0 
0 0 0 2398.07 0 0 1379.36 -1974.01 -261.467 0 711.921 530.183 0 -1480.22 0 0 480.132 0 0 0 2166.13 0 0 -956.526 0 0 0 -1780.53 0 -35.783 -1296.66 1491.82 0 0 0.08 0 0 2336.12 0 0 -1681.8 -70.2689 2374.11 0 0 1399.2 0 0 234.458 0 0 -1394.16 1392.18 0 0 1175.19 0 2354.27 0 0 0 0 0 0 0 
0 0 0 -668.279 0 -1356.93 0 0 0 0 0 -320.215 0 0 0 380.184 2070.3 0 -1176.41 -1088.37 0 0 -315.79 0 0 1712.93 0 0 -886.334 1293.15 0 0 0 0 0 0.03 -1768.32 1848.89 0 1710.79 0 0 0 -1483.89 0 1566.44 -787.912 0 0 0 0 0 639.286 1854.53 0 0 0 2380.37 0 0 0 0 0 0 0 
0 0 0 0 0 0 0 0 499.512 0 1129.57 0 -2295.37 -2424.01 0 1653.57 0 0 965.682 0 -1324.12 0 0 0 0 0 0 0 0 759.987 0 0 0 0 0 -1472.59 0 0 0 0 0 0 0 1854.23 0 0 0 0 0 0 1319.85 0 0 -535.981 0 2230.83 0 0 0 0 0 0 0 2439.12 -1028.86 
1133.99 0 0 0 0 0 0 0 0 2464.14 -987.198 0 0 23.8807 0 -2340.85 0 -255.058 0 0 0 0 0 0 1758.1 1177.33 0 0 1934.03 0 0 0 1393.09 0 -20.2185 662.023 0 0.08 1267.51 0 0 0 0 0 0 -2255.39 0 0 0 884.198 0 1904.13 0 0 -373.928 2072.13 0 0 0 -1462.83 -380.947 0 0 0 0 
0 0 0 0 1163.29 1956.31 0 -255.364 0 0 -121.693 0 0 0 1892.68 0 0 0 1670.51 0 0 0 0 2152.85 0 0 0 0 0 0 0 2118.98 2174.06 -1155.05 0 0 0 1611.45 0.08 0 0 0 -1280.94 0 0 -58.5192 0 0 0 1425.29 0 543.306 0 -1653.26 -22.8126 0 0 -2413.33 0 0 0 0 0 0 2080.07 
0 0 0 0 0 1808.91 0 0 1919.54 0 0 -1829.66 19.1504 0 0 0 1628.09 0 -2421.72 0 0 0 0 -715.278 1171.99 0 0 0 0 0 0 981.704 -553.072 0 0 2268.21 0 0 0 0.07 0 0 0 1771.98 0 0 0 0 0 -690.1 720.923 0 0 1155.81 0 0 0 -808.817 0 0 0 0 0 0 0 
0 161.519 0 0 0 0 -1700.11 0 0 0 1848.43 0 0 2382.2 0 1202.2 0 0 -2088.61 0 0 0 0 0 0 0 0 1383.79 0 0 758.766 0 0 0 -817.209 0 0 0 0 0 0.01 1862.32 0 0 0 0 0 0 0 0 0 0 0 0 0 0 0 0 0 0 0 -2411.95 0 -746.559 0 
0 -1176.26 0 0 0 0 0 0 0 0 0 0 -1207.24 0 0 0 0 2216.79 0 0 0 917.158 244.072 0 0 0 224.845 0 0 0 -360.805 868.48 0 0 1137.81 0 0 0 0 0 2476.5 0.06 2327.88 -328.761 279.931 0 0 0 0 0 0 0 0 0 1950.82 1328.24 0 0 0 0 0 0 0 0 0 
1771.52 0 0 0 0 0 0 518.738 0 0 0 0 0 1788.31 -1081.5 0 2026.81 0 -2221.06 0 0 -888.623 0 1763.28 0 0 1408.51 0 0 0 0 0 0 0 547.273 0 0 0 1419.03 0 0 797.372 0.06 0 -1952.19 0 0 -2128.9 -1827.98 0 1521.58 0 0 0 0 0 2053.21 0 0 0 0 0 0 -1390.96 0 
0 0 0 1849.96 0 566.195 -2129.51 -826.06 0 0 0 949.355 0 0 0 0 0 0 0 0 0 -1031.91 0 0 0 1128.8 0 1083.64 0 1517.15 0 0 1232.11 1137.81 0 955.458 1498.99 0 0 1912.37 0 768.99 0 0.06 0 0 0 0 0 0 0 1485.26 672.552 0 0 2444.15 -895.184 -1635.87 0 1275.44 0 0 1178.55 0 0 
0 0 0 0 0 0 2367.7 0 0 0 -1480.38 408.261 0 0 -2499.54 0 0 0 0 0 -906.018 0 0 0 0 2213.58 0 2276.15 -2055.96 0 0 2456.66 0 0 0 0 0 0 0 0 0 1212.27 1962.87 0 0.05 1063.8 0 0 0 1802.65 1599.55 0 249.26 0 -630.436 0 0 0 0 0 0 0 2103.11 0 1008.71 
-1867.05 0 0 0 0 -150.38 0 0 0 -2055.65 0 2407.83 0 0 0 0 0 0 0 0 0 -325.709 0 0 0 0 0 0 0 0 0 0 569.094 0 1137.5 210.196 0 1305.35 28.0007 0 0 0 0 0 -2465.21 0.05 1038.01 0 -1549.65 892.895 0 0 0 0 0 2129.05 0 0 0 0 0 832.469 0 0 0 
1594.67 418.18 0 0 0 0 -2015.37 0 0 0 0 0 -750.984 0 0 0 0 0 -231.559 0 0 0 0 -548.646 0 0 0 2234.34 0 0 0 0 0 0 0 1344.42 0 0 0 0 0 0 0 0 0 450.377 0.08 0 0 0 0 0 2476.96 0 0 2495.88 0 0 0 0 0 0 0 0 1166.04 
0 426.725 0 0 956.526 0 1627.32 0 0 980.941 0 0 515.687 0 -1185.57 0 0 -547.121 -482.574 0 0 0 0 1038.77 0 0 0 0 0 0 0 0 0 0 0 0 0 0 0 0 0 0 -208.975 0 0 0 0 0.02 1997.67 0 0 0 0 0 0 1775.8 0 -718.787 0 0 0 0 1387.91 0 0 
0 1739.63 384.304 0 0 2169.03 0 0 0 0 0 1878.49 0 0 -360.652 0 0 0 0 0 0 0 0 0 0 0 -580.691 0 0 0 0 0 0 -1198.69 -1935.1 0 0 0 0 0 0 0 -2477.87 0 0 1860.48 0 15.6407 0.08 0 0 0 0 568.026 0 0 0 0 0 0 0 0 0 0 0 
0 0 -538.118 0 0 2009.87 0 0 0 997.574 0 2083.42 0 0 -364.467 0 0 0 0 0 0 -196.005 0 0 0 0 0 0 0 0 0 0 0 0 0 0 0 1062.12 2175.44 2427.82 0 0 0 0 -644.169 -1927.78 0 0 0 0.05 1994.77 0 0 0 0 -612.583 1938 0 -1255.15 1874.37 0 0 0 0 0 
475.097 0 0 1912.37 0 0 0 0 0 0 -1357.69 0 0 415.281 0 0 0 -1014.36 98.1933 0 0 0 0 0 0 0 0 0 0 0 0 0 0 -166.555 0 0 1181.75 0 0 -1699.5 0 0 1526.46 0 -26.9326 0 0 0 0 950.27 0.05 0 0 0 0 0 0 633.183 0 0 0 0 0 0 0 
456.175 0 0 0 0 0 -1247.83 0 0 0 0 0 2167.96 444.426 0 0 0 1424.07 0 0 0 0 0 0 1439.33 0 1876.51 1316.95 0 0 -371.181 0 0 0 1568.88 0 0 2321.31 -2389.22 0 0 0 0 1312.52 0 0 0 0 0 0 0 0.04 0 1002.61 0 0 0 0 633.488 934.858 0 0 0 0 0 
-769.601 0 0 0 1152.61 465.941 -432.524 -15.9459 0 788.369 0 0 0 0 1356.32 1618.78 0 0 0 0 0 1149.4 0 0 0 -1843.85 0 0 1544.47 0 0 0 -2323.91 0 427.488 1515.02 0 0 0 0 0 0 0 1458.56 1926.56 0 1602.6 0 0 0 0 0 0.05 0 0 0 0 391.171 0 0 0 0 0 600.528 0 
0 0 254.295 0 0 -2382.66 0 0 91.174 271.081 1328.55 0 0 1275.9 0 0 1658.91 0 0 0 0 0 0 0 0 0 -580.844 0 0 0 0 0 0 0 0 1249.66 1829.36 0 -411.008 783.029 0 0 0 0 0 0 0 0 -658.971 0 0 2001.33 0 0.09 -494.476 -1799.3 0 -1810.59 0 0 0 0 0 0 0 
0 0 0 0 -1275.75 533.235 0 0 0 -1652.35 0 0 1142.84 0 0 0 0 1348.69 0 0 -1088.98 0 0 0 0 0 0 0 -656.835 0 0 1385.77 0 1235.77 0 0 0 806.833 145.192 0 0 1283.23 0 0 -70.2689 0 0 0 0 0 0 0 0 1710.79 0.01 -2151.94 1999.5 2125.54 -362.789 0 1056.93 0 0 0 2124.32 
0 0 0 295.495 0 -2430.72 0 0 0 2125.23 0 0 0 0 -2121.57 0 0 0 721.534 0 0 0 0 -1087.15 0 -1168.48 0 0 0 0 0 0 0 0 578.249 0 1279.87 872.6 0 0 0 -576.266 0 1862.62 0 1229.51 229.728 -1665.78 0 1150.93 0 0 0 -832.469 2456.36 0.07 0 0 0 1118.43 0 0 0 0 0 
0 0 0 0 0 0 0 0 0 0 791.421 0 0 0 0 0 0 1414.15 2105.7 -238.578 0 0 0 -1186.79 95.4466 0 0 0 0 0 0 286.187 1947.16 0 0 0 0 0 0 0 0 0 984.451 2228.39 0 0 0 0 0 -2233.42 0 0 0 0 -2020.86 0 0.07 0 -2093.8 0 0 -2081.13 909.833 0 0 
0 0 0 0 418.79 1822.18 0 0 0 0 -105.06 0 0 0 0 0 0 0 0 2251.27 1819.13 287.561 0 0 0 0 0 0 0 -1574.98 -200.888 0 0 618.076 -1403.78 2474.36 0 0 683.386 -995.59 0 0 0 -781.655 0 0 0 -230.338 0 0 -296.411 0 406.888 1138.42 1653.11 0 0 0.03 0 0 0 0 0 0 0 
-955.458 -1496.7 1452.15 -614.566 0 0 0 0 0 2251.27 2237.39 0 0 0 0 -332.423 216.605 0 357.143 0 0 0 0 0 0 785.928 0 0 1885.81 0 0 0 1086.69 0 0 0 0 0 0 0 0 0 0 0 0 0 0 0 0 1152 0 1535.46 0 0 -2006.67 0 676.519 0 0.02 0 -2214.65 0 0 0 0 
0 0 0 0 0 -2126.76 0 0 0 0 0 0 2096.39 1965.32 2041 0 -1129.11 0 0 0 -146.87 0 0 0 0 0 1471.83 -2398.83 2116.69 0 0 0 0 0 0 0 0 1383.79 0 0 0 0 0 -757.393 0 0 0 0 0 1816.84 0 -1888.41 0 0 0 -991.318 0 0 0 0.09 0 0 0 0 0 
0 0 0 0 0 0 361.415 0 0 0 0 0 0 0 1781.44 2235.86 0 0 0 -930.738 0 0 0 0 -1381.19 0 881.146 -1472.59 2422.94 0 0 0 0 0 0 0 0 1316.64 0 0 0 0 0 0 0 0 0 0 0 0 0 0 0 0 1894.06 0 0 0 -429.472 0 0.08 0 2078.54 355.312 0 
0 0 -825.449 -2408.6 0 1335.26 0 0 -601.138 0 0 0 0 0 622.806 0 0 0 0 0 0 0 0 0 0 0 0 0 0 580.233 1010.24 0 0 1309.17 0 0 0 0 0 0 649.358 0 0 0 0 808.512 0 0 0 0 0 0 0 0 0 0 -551.546 0 0 0 0 0.06 0 0 0 
0 0 0 -827.128 0 0 0 0 0 0 0 0 0 0 0 0 0 0 0 890.759 0 908.155 0 1662.57 0 0 0 0 0 0 0 0 0 1276.36 0 0 0 0 0 0 0 0 0 407.193 -421.537 0 0 -1627.32 0 0 0 0 0 0 0 0 1049.3 0 0 0 -582.217 0 0.09 0 0 
0 0 0 0 0 -2156.36 0 0 0 0 0 0 -1448.18 0 0 0 0 0 0 0 116.962 0 0 -1195.64 0 0 0 0 0 1485.41 0 0 0 0 0 0 1561.86 0 0 0 141.224 0 1517.61 0 0 0 0 0 0 0 0 0 -1380.58 0 0 0 0 0 0 0 1132.47 0 0 0.06 0 
0 0 0 0 0 0 0 0 0 0 0 0 0 0 0 0 0 0 0 0 0 0 0 0 0 0 2032.15 0 0 0 0 0 0 0 0 0 2323.45 0 -824.381 0 0 0 0 0 1156.58 0 -2254.48 0 0 0 0 0 0 0 -1179.16 0 0 0 0 0 0 0 0 0 0.05 
