*Vertices 52
*Matrix 
0.02 0 0 1746.96 0 1335.87 22.2022 0 2359.16 0 0 0 0 0 0 0 0 1624.27 0 0 0 0 0 -266.655 0 0 -1124.53 0 409.94 0 0 0 -778.909 0 0 83.5444 0 0 0 0 799.814 0 -1480.68 0 0 0 0 0 0 0 0 0 
0 0 0 0 0 0 1456.42 2225.33 0 0 0 0 1738.41 0 0 0 0 518.281 0 0 0 0 0 0 -1313.9 0 0 0 0 0 0 0 0 0 0 504.395 0 0 0 0 0 0 0 0 0 0 0 0 0 0 0 0 
0 0 0.02 0 0 0 1044.72 254.295 0 1289.33 0 0 0 773.721 0 0 0 0 633.641 -845.744 688.269 0 0 0 0 -1709.42 0 0 57.4511 0 0 0 0 0 0 0 0 0 0 0 1929.46 -2066.79 0 1823.56 0 0 0 0 0 0 0 0 
1598.48 0 0 0.03 901.135 2449.19 2400.05 0 0 0 0 0 0 0 1773.35 0 -508.362 0 0 0 0 0 0 0 0 0 0 0 0 0 0 0 0 0 0 0 1279.87 0 0 0 0 0 0 0 0 0 0 0 0 0 0 0 
0 0 0 800.729 0.08 1406.67 0 -880.84 0 0 0 0 0 777.688 0 -286.035 1462.98 0 0 0 0 0 0 0 0 0 0 0 0 -2115.16 0 1583.68 0 0 0 0 0 0 0 0 0 0 0 0 0 -507.294 0 0 -2277.98 0 0 0 
1532.87 0 0 658.055 1727.12 0.02 0 0 0 1529.97 0 374.844 0 1260.8 1094.32 0 0 0 -2255.24 0 1882.31 1219.29 0 -2480.01 0 -1584.9 0 0 0 0 0 0 0 0 0 0 0 0 0 0 1127.58 0 0 0 0 0 0 -1406.06 0 0 1173.51 0 
814.92 -191.885 -1441.16 485.168 0 0 0.02 0 0 0 0 2009.57 0 0 818.278 1802.35 0 1834.85 0 0 0 0 -2305.14 0 0 0 0 0 0 0 0 0 0 0 0 0 0 0 0 0 0 0 0 0 -987.808 0 0 -3.12815 0 0 0 0 
0 975.906 -1235.01 0 1376.77 0 0 0.08 0 0 0 0 1457.95 0 0 -1371.43 2411.95 0 0 1377.83 0 0 0 0 0 0 0 0 0 0 0 0 0 0 0 0 982.467 0 -1522.03 2164.14 0 0 0 0 0 0 0 0 -1740.85 0 0 0 
1391.57 0 0 0 0 0 0 0 0.08 0 -749.458 0 0 0 0 0 0 1752.45 0 0 0 0 0 0 0 0 0 -401.242 0 0 0 0 0 0 0 0 0 0 0 0 0 0 0 0 0 0 0 578.555 0 0 0 0 
0 0 1377.68 0 0 -740.76 0 0 0 0.03 2329.71 827.433 0 827.281 0 0 1057.85 0 984.298 0 0 0 0 0 0 0 0 0 0 1431.39 0 0 0 0 2159.87 0 0 -562.532 1812.27 0 0 2437.74 0 0 0 0 0 0 0 0 0 0 
0 0 0 0 0 0 0 0 1579.87 -363.552 0.03 0 2199.55 722.144 0 0 58.0615 2194.81 0 1192.74 0 742.134 0 0 0 0 -1519.44 0 0 -1910.08 0 0 0 0 0 0 0 0 0 0 0 0 0 0 0 0 0 0 0 0 -378.811 1753.67 
0 0 0 0 0 492.187 -1551.79 0 0 -177.694 0 0.07 0 0 0 2102.04 2495.73 0 1992.48 0 0 0 0 0 0 0 0 0 0 0 0 0 1308.25 0 0 0 0 0 0 0 0 -2111.19 0 0 0 0 0 0 0 -2490.39 0 0 
0 2300.1 0 0 0 0 0 -1671.12 0 0 1182.36 0 0 0 0 0 0 0 1632.97 0 -1161.92 0 0 0 0 0 0 0 0 0 139.698 0 0 0 0 0 0 0 0 0 0 0 0 0 -1079.67 0 0 0 0 -428.709 0 0 
0 0 134.968 0 -679.724 1548.13 0 0 0 -701.697 686.895 0 0 0.07 2309.72 0 0 0 0 0 0 0 0 0 0 -1832.87 0 0 0 0 0 0 0 0 1265.98 0 0 0 0 0 0 -1030.84 0 0 0 0 0 0 0 0 0 0 
0 0 0 1810.89 0 486.084 -556.886 0 0 0 0 0 0 -1233.79 0.07 0 0 0 0 2461.24 0 0 0 0 0 0 2405.09 0 0 1711.86 0 0 -1348.38 2456.51 -1543.55 0 0 0 0 0 -1204.95 0 0 0 0 1835.76 0 0 0 -1825.08 0 0 
0 0 0 0 2092.88 0 2418.67 1166.04 0 0 0 -1762.67 0 0 0 0.08 0 0 82.0185 0 0 0 0 0 0 -1956.01 0 0 0 0 0 0 2233.88 0 0 0 0 0 0 0 0 0 0 0 0 0 -2284.84 0 1379.67 0 0 0 
0 0 0 1811.2 1093.1 0 0 -414.67 0 328.455 -815.226 -99.7192 0 0 0 0 0.05 501.801 0 0 0 0 1638.31 0 1759.93 0 0 0 0 0 0 0 0 0 0 0 0 0 0 0 0 0 0 345.393 0 -1691.56 1768.01 0 0 0 0 0 
984.298 1355.71 0 0 0 0 688.726 0 42.1918 0 -555.361 0 0 0 0 0 -156.331 0.06 0 0 0 0 456.786 0 0 0 0 0 1559.57 0 0 0 0 0 0 -113.3 0 0 0 0 0 0 0 0 -2414.7 0 0 0 0 223.167 0 0 
0 0 651.952 0 0 1670.81 0 0 0 689.947 0 1904.89 1411.71 0 0 2237.85 0 0 0.01 0 0 0 0 0 0 0 0 0 0 0 0 -2306.05 0 0 -1388.36 0 0 0 0 0 0 302.82 0 0 0 -2005.75 0 0 0 0 1552.71 0 
0 0 2422.64 0 0 0 0 2427.06 0 0 642.491 0 0 0 -1162.68 0 0 0 0 0.08 0 -428.404 0 0 0 0 1785.71 0 0 0 0 0 0 0 0 0 0 0 0 0 0 0 1701.03 -1834.54 0 0 0 -637.455 0 0 0 1535.92 
0 0 1745.58 0 0 2160.79 0 0 0 0 0 0 1089.43 0 0 0 0 0 0 0 0.01 0 0 0 0 0 -911.969 0 0 0 0 0 0 0 -898.236 0 0 0 0 0 0 0 -419.401 0 0 0 0 0 0 0 0 0 
0 0 0 0 0 2446.44 0 0 0 0 1963.64 0 0 0 0 0 0 0 0 -179.983 0 0.01 0 0 0 0 0 0 0 0 0 0 0 0 0 0 0 0 0 0 0 0 0 0 0 0 0 0 0 0 0 0 
0 0 0 0 0 0 79.4244 0 0 0 0 0 0 0 0 0 1964.25 1040.3 0 0 0 0 0.08 0 0 0 0 0 0 0 0 -1296.96 0 2081.29 0 0 0 0 0 0 0 0 0 0 0 0 -4.50148 0 0 623.264 0 0 
582.675 0 0 0 0 1384.09 0 0 0 0 0 0 0 0 0 0 0 0 0 0 0 0 0 0.07 0 0 0 0 0 0 0 0 0 0 0 2257.68 0 0 0 0 0 0 0 -2079.76 0 0 0 0 0 0 0 0 
0 1600.47 0 0 0 0 0 0 0 0 0 0 0 0 0 0 780.587 0 0 0 0 0 0 0 0.09 0 0 0 0 0 0 0 0 0 0 0 0 0 0 0 0 0 0 0 0 0 0 0 0 0 -1392.33 0 
0 0 1415.37 0 0 597.324 0 0 0 0 0 0 0 1126.67 0 1062.43 0 0 0 0 0 0 0 0 0 0.07 0 0 0 0 0 -118.336 0 -316.706 0 0 0 0 -2165.82 0 0 0 0 0 0 0 0 0 0 0 0 0 
1397.82 0 0 0 0 0 0 0 0 0 1479.16 0 0 0 1316.03 0 0 0 0 -969.955 -1181.45 0 0 0 0 0 0.05 0 0 0 0 0 0 0 0 732.521 0 0 19.9133 0 -2369.84 0 0 0 0 0 0 0 0 0 0 -310.755 
0 0 0 0 0 0 0 0 61.8763 0 0 0 0 0 0 0 0 0 0 0 0 0 0 0 0 0 0 0 0 0 116.504 0 2359.31 0 0 0 0 0 0 647.832 1668.83 0 0 0 0 0 0 0 0 0 0 0 
2410.73 0 1035.87 0 0 0 0 0 0 0 0 0 0 0 0 0 0 1724.22 0 0 0 0 0 0 0 0 0 0 0.08 0 0 0 0 0 0 0 0 0 -679.113 0 0 0 -391.629 0 0 0 0 0 0 0 0 0 
0 0 0 0 1442.69 0 0 0 0 865.734 -490.509 0 0 0 903.882 0 0 0 0 0 0 0 0 0 0 0 0 0 0 0.07 0 -263.604 0 -1126.82 0 0 0 0 0 0 0 0 0 0 0 1299.71 0 0 0 0 0 0 
0 0 0 0 0 0 0 0 0 0 0 0 692.083 0 0 0 0 0 0 0 0 0 0 0 0 0 0 1401.33 0 0 0.01 0 0 0 0 0 0 2457.73 0 2414.7 0 0 0 0 0 0 0 0 0 -200.43 0 0 
0 0 0 0 834.452 0 0 0 0 0 0 0 0 0 0 0 0 0 513.855 0 0 0 628.758 0 0 1946.55 0 0 0 942.03 0 0.08 0 0 0 0 0 0 0 0 0 0 0 0 0 0 0 0 0 0 0 140.919 
-953.017 0 0 0 0 0 0 0 0 0 0 1883.22 0 0 969.955 1905.5 0 0 0 0 0 0 0 0 0 0 0 -780.587 0 0 0 0 0.05 0 0 0 0 0 0 0 0 1457.18 0 0 2272.79 0 0 169.454 0 0 0 728.248 
0 0 0 0 0 0 0 0 0 0 0 0 0 0 1653.57 0 0 0 0 0 0 0 -1126.36 0 0 1012.07 0 0 0 1749.09 0 0 0 0.09 0 0 0 0 969.344 76.22 0 0 0 0 0 0 0 0 0 0 0 0 
0 0 0 0 0 0 0 0 0 953.78 0 0 0 308.924 -1636.48 0 0 0 2497.86 0 -1208.3 0 0 0 0 0 0 0 0 0 0 0 0 0 0 1599.25 962.935 0 0 0 0 0 0 0 0 0 0 0 0 -756.783 0 0 
1648.38 131.001 0 0 0 0 0 0 0 0 0 0 0 0 0 0 0 389.95 0 0 0 0 0 1726.97 0 0 298.242 0 0 0 0 0 0 0 1935.41 0 0 -1142.54 0 0 0 0 0 0 0 0 0 0 -427.488 0 0 0 
0 0 0 -83.3918 0 0 0 1632.82 0 0 0 0 0 0 0 0 0 0 0 0 0 0 0 0 0 0 0 0 0 0 0 0 0 0 1472.75 0 0.08 0 0 0 0 0 0 0 0 0 0 0 0 0 0 0 
0 0 0 0 0 0 0 0 0 1943.8 0 0 0 0 0 0 0 0 0 0 0 0 0 0 0 0 0 0 0 0 -1295.28 0 0 0 0 949.202 0 0.04 0 -767.006 270.013 0 0 0 0 0 0 0 0 0 0 0 
0 0 0 0 0 0 0 1330.53 0 -1678.14 0 0 0 0 0 0 0 0 0 0 0 0 0 0 0 598.239 89.1903 0 1947.31 0 0 0 0 1970.66 0 0 0 0 0.04 0 0 0 0 0 0 0 0 0 0 0 0 0 
0 0 0 0 0 0 0 1342.28 0 0 0 0 0 0 0 0 0 0 0 0 0 0 0 0 0 0 0 -127.338 0 0 -613.193 0 0 2347.25 0 0 0 -1212.27 0 0.09 0 0 0 0 0 0 0 0 0 0 0 0 
578.402 0 1335.41 0 0 -1099.66 0 0 0 0 0 0 0 0 510.651 0 0 0 0 0 0 0 0 0 0 0 -398.343 2353.51 0 0 0 0 0 0 0 0 0 -791.726 0 0 0.02 0 0 0 0 0 1159.63 0 815.989 0 0 0 
0 0 2479.4 0 0 0 0 0 0 215.537 0 -835.673 0 549.562 0 0 0 0 506.836 0 0 0 0 0 0 0 0 0 0 0 0 0 -1289.64 0 0 0 0 0 0 0 0 0 0 0 0 0 0 0 0 0 0 0 
375.912 0 0 0 0 0 0 0 0 0 0 0 0 0 0 0 0 0 0 2397.61 2496.03 0 0 0 0 0 0 0 -768.685 0 0 0 0 0 0 0 0 0 0 0 0 0 0.07 0 0 0 0 0 0 0 0 0 
0 0 1127.58 0 0 0 0 0 0 0 0 0 0 0 0 0 21.4393 0 0 285.882 0 0 0 -1255.91 0 0 0 0 0 0 0 0 0 0 0 0 0 0 0 0 0 0 0 0.04 0 0 0 0 0 0 0 0 
0 0 0 0 0 0 2211.6 0 0 0 0 0 1729.56 0 0 0 0 1730.78 0 0 0 0 0 0 0 0 0 0 0 0 0 0 2169.79 0 0 0 0 0 0 0 0 0 0 0 0.04 0 0 0 0 0 0 -1979.51 
0 0 0 0 1392.48 0 0 0 0 0 0 0 0 0 -2416.99 0 1650.06 0 2301.93 0 0 0 0 0 0 0 0 0 0 599.155 0 0 0 0 0 0 0 0 0 0 0 0 0 0 0 0.05 0 0 0 0 -931.654 0 
0 0 0 0 0 0 0 0 0 0 0 0 0 0 0 -1322.14 1210.59 0 0 0 0 0 2171.47 0 0 0 0 0 0 0 0 0 0 0 0 0 0 0 0 0 -170.217 0 0 0 0 0 0.03 0 0 0 1464.96 0 
0 0 0 0 0 1560.64 -1078.45 0 1755.81 0 0 0 0 0 0 0 0 0 0 2103.72 0 0 0 0 0 0 0 0 0 0 0 0 801.035 0 0 0 0 0 0 0 0 0 0 0 0 0 0 0.08 0 0 0 0 
0 0 0 0 367.061 0 0 1358.46 0 0 0 0 0 0 0 2212.06 0 0 0 0 0 0 0 0 0 0 0 0 0 0 0 0 0 0 0 -1067.77 0 0 0 0 -48.1429 0 0 0 0 0 0 0 0.05 -28.1533 1590.24 0 
0 0 0 0 0 0 0 0 0 0 0 -443.815 -318.842 0 1456.27 0 0 50.2792 0 0 0 0 2499.39 0 0 0 0 0 0 0 2349.7 0 0 0 225.608 0 0 0 0 0 0 0 0 0 0 0 0 0 -1828.9 0.06 0 0 
0 0 0 0 0 2245.02 0 0 0 0 1907.94 0 0 0 0 0 0 0 2320.09 0 0 0 0 0 -2015.52 0 0 0 0 0 0 0 0 0 0 0 0 0 0 0 0 0 0 0 0 -1560.79 516.907 0 -2169.48 0 0.09 714.209 
0 0 0 0 0 0 0 0 0 0 988.723 0 0 0 0 0 0 0 0 2122.49 0 0 0 0 0 0 2474.52 0 0 0 0 500.885 1277.58 0 0 0 0 0 0 0 0 0 0 0 -1595.28 0 0 0 0 0 264.977 0 
