*Vertices 72
*Matrix 
0.01 0 0 0 0 0 0 0 2161.55 763.955 0 0 0 0 0 437.407 0 -267.724 2328.03 0 0 0 -2487.64 2195.73 0 0 -852 0 0 0 0 0 0 -2271.57 0 0 509.583 483.947 0 -1622.59 0 0 0 0 0 0 0 -475.555 393.155 0 0 0 0 0 -167.776 0 802.408 -1204.79 959.12 2369.99 1197.93 -1790.14 0 0 0 0 0 0 2044.97 0 0 0 
0 0.01 0 0 0 0 0 0 0 0 0 0 -1015.88 0 0 0 -2244.71 0 0 0 0 0 0 1451.23 -1342.13 -322.504 -2117.6 0 0 1887.49 0 0 0 603.732 1569.34 0 0 1689.12 0 2203.21 0 0 0 0 0 0 0 0 0 0 0 0 -1572.39 0 0 510.498 -0.228889 0 0 -88.4274 0 0 0 0 0 0 0 0 0 0 0 0 
0 0 0.01 0 0 0 0 188.07 0 1507.39 0 0 0 0 0 0 0 1088.21 -383.847 0 0 0 -1440.86 0 0 0 0 208.518 0 0 0 0 0 0 0 1238.98 0 0 -2292.32 1555.3 0 0 0 0 191.885 0 0 -745.338 0 2456.82 0 0 0 -614.261 0 0 0 0 0 0 0 0 1795.02 0 -2041.31 0 0 0 1809.06 0 0 0 
0 0 0 0.07 0 0 0 0 2000.41 0 1890.7 0 0 0 0 0 1964.55 1285.82 1855.75 0 0 0 -1786.17 0 0 0 -2403.71 1135.82 -271.996 1374.32 0 0 0 -2058.24 0 0 0 0 0 0 0 0 -1371.58 0 811.258 0 0 0 0 0 1111.41 856.273 0 0 0 440.916 -2486.42 0 0 0 0 -571.23 0 -2021.77 0 283.135 0 0 -1489.38 0 0 0 
0 0 0 0 0.09 0 0 985.824 0 0 0 2371.82 0 0 0 1750.62 -1511.66 0 2066.18 150.075 1444.67 0 0 0 0 1682.1 0 0 0 -288.018 0 0 2092.27 0 1172.75 1287.8 0 0 0 0 0 -2326.81 2431.94 0 0 309.839 0 0 -138.325 -2468.57 0 0 0 0 0 0 0 0 0 -1070.82 0 0 -754.952 0 0 0 0 -657.598 0 0 0 -885.876 
0 0 0 0 0 0.03 0 0 0 0 0 0 287.408 0 2409.51 0 0 -94.3785 0 0 2466.58 0 0 0 0 0 0 0 0 0 0 -366.451 0 1946.85 0 0 0 0 0 0 1680.27 -2487.64 0 0 0 0 -2471.62 0 0 0 448.393 0 0 0 0 0 0 0 0 68.1326 0 0 393.612 0 -698.95 963.698 0 0 0 0 0 1881.85 
0 0 0 0 0 0 0.09 0 0 0 0 0 556.429 0 0 0 2416.53 0 0 0 1183.74 0 0 0 0 0 0 0 -252.77 -418.18 0 0 0 0 0 967.055 -195.395 0 0 1001.85 2301.93 -1299.71 0 0 0 0 0 1918.01 0 -1103.47 0 -1129.11 -856.273 0 0 -7.70592 0 2458.8 0 0 0 0 0 0 0 2089.98 1020.46 0 0 0 0 0 
0 0 -862.835 0 322.657 0 0 0.01 460.753 0 0 0 1270.1 -507.141 0 0 0 335.017 433.439 0 0 -1426.21 2337.34 0 0 0 868.938 0 0 0 0 0 0 0 0 0 0 0 0 1776.41 0 2435.45 0 0 1328.85 0 0 166.555 -53.3311 0 0 0 1682.26 0 0 0 0 0 0 0 620.212 0 0 2318.57 0 0 0 0 0 0 805.612 0 
1419.19 0 0 -1620 0 0 0 -98.0407 0.02 0 0 -1835.76 0 0 -1387.75 0 0 1003.22 620.518 0 -2128.44 2145.38 0 0 0 0 0 555.208 1628.7 0 0 0 0 0 -1694.92 0 0 0 0 0 0 776.62 0 0 0 0 0 2204.73 0 0 0 -205.466 1639.07 0 0 0 -528.962 0 -1384.7 0 0 -1184.04 1611.3 0 0 0 0 0 0 0 0 0 
368.892 0 -112.69 0 0 0 0 0 0 0.09 0 0 -1475.04 0 -935.316 0 0 2149.8 1850.87 0 0 0 -1956.92 0 0 0 -1476.41 0 0 0 0 0 0 -1856.06 1020.16 -1139.03 0 0 0 -964.003 0 0 889.538 0 0 1635.41 0 0 -276.421 -623.112 0 953.475 0 0 0 1703.31 1928.39 0 0 0 0 0 0 1274.07 -2144.92 0 1066.24 0 0 0 0 0 
0 0 0 -1766.64 0 0 0 0 0 0 0.05 0 0 0 0 0 29.5267 0 0 0 0 0 -2014.91 0 0 0 0 0 0 0 0 686.285 687.811 2156.82 0 0 0 0 0 0 0 0 1860.33 0 0 0 -1516.39 0 0 -277.947 0 1918.32 0 0 639.744 0 0 0 0 0 1974.47 201.041 -1500.21 0 0 -65.9963 0 -67.217 0 0 0 0 
0 0 0 0 1121.33 0 0 0 1329.31 0 0 0.01 0 0 -12.2837 0 0 0 931.654 1385.62 0 1549.81 -792.184 0 0 0 0 -2086.32 0 0 0 1321.83 0 358.821 0 0 -1485.72 2197.87 0 0 0 0 0 0 0 -2229 0 1287.5 0 1636.02 0 0 0 0 -799.203 0 619.297 594.882 0 0 463.195 0 0 517.06 418.638 -1246.6 0 2432.1 0 0 2495.88 0 
0 739.692 0 0 0 1802.19 253.533 1825.24 0 -332.728 0 0 0.06 0 0 1024.43 1549.04 -1235.31 253.533 0 0 0 0 1874.37 0 0 0 -1629 0 1927.93 0 0 0 0 0 0 0 0 1379.51 0 2261.04 0 2055.35 1860.48 0 0 0 0 0 0 0 0 0 0 0 0 2467.19 0 0 0 -2230.06 -950.575 -2361.29 0 1403.93 240.257 0 0 0 765.328 0 0 
0 0 0 0 0 0 0 -673.925 0 0 0 0 0 0.05 0 0 -1802.8 0 0 0 0 0 0 0 76.5252 0 0 0 -2333.83 0 0 376.675 0 1645.94 0 0 0 0 0 1215.93 0 1199.61 0 0 0 0 0 0 0 0 0 0 0 225.761 0 0 2168.57 1479.46 0 0 0 0 0 0 0 0 0 0 0 0 0 0 
0 0 0 0 0 2049.39 0 0 1607.18 -1826 0 1146.81 0 0 0.03 0 -1510.28 0 2113.18 -2459.72 0 0 0 0 -222.404 0 0 0 0 0 0 -753.121 0 1876.2 396.359 0 0 -1875.59 1248.13 0 1287.35 0 0 0 0 0 0 0 1925.49 0 0 0 0 0 0 0 -1050.68 0 0 -1220.97 0 1837.14 0 -13.8096 -796.152 -153.127 -588.321 0 0 0 0 0 
1204.95 0 0 0 -2162.01 0 0 0 0 0 0 0 2337.64 0 0 0.05 350.429 0 0 2407.99 0 1914.04 0 0 0 0 -382.931 0 0 0 0 0 0 0 -1602.3 0 0 0 0 0 -1483.28 0 0 -1223.11 0 0 0 0 -708.411 -301.752 0 0 0 -1356.47 2041.15 0 0 1852.09 0 0 0 0 0 0 0 0 -1484.95 0 0 0 0 1153.07 
0 774.636 0 766.854 1461.15 0 1830.73 0 0 0 -2080.83 0 1765.42 618.534 891.522 996.963 0.01 0 665.532 -1273.16 0 0 0 2156.51 0 0 1049.61 2258.29 0 0 0 0 0 0 0 0 1175.04 0 0 0 0 1100.57 0 0 0 -1630.53 1227.38 0 0 -396.207 -1276.67 0 0 0 0 0 0 0 0 0 -2384.95 0 0 1779.15 -818.735 0 710.089 0 0 0 0 0 
-24.7963 0 215.995 -218.131 0 1473.36 0 -1034.35 -283.135 -263.146 0 0 525.452 0 0 0 0 0.03 1328.39 0 704.443 0 1888.26 0 1639.07 -246.361 0 0 0 0 0 0 0 653.172 0 0 0 -222.556 965.377 0 0 0 0 0 0 0 0 0 -1533.48 0 -525.758 1135.67 0 0 1071.28 0 -541.169 2355.04 0 -1063.04 0 0 0 0 2060.38 0 0 -854.9 0 0 0 0 
1343.65 0 438.627 727.485 -864.208 0 0 1757.18 2416.07 -366.451 0 -1496.7 64.9281 0 -958.968 0 -1939.83 -416.044 0.04 0 0 0 0 0 0 0 0 0 0 0 0 0 -356.99 2000.56 0 0 0 -1844.92 0 0 -2055.04 0 0 0 1703.77 0 0 0 0 0 0 0 0 0 0 1163.9 0 0 987.045 0 0 0 0 0 0 0 0 0 0 0 0 0 
0 0 0 0 588.473 0 0 0 0 0 0 1182.97 0 0 -285.882 -1458.86 1313.9 0 0 0.02 -934.858 0 0 0 0 0 1894.36 0 0 0 0 -1454.59 1696.6 -1486.79 758.309 0 -1269.49 0 162.74 0 -1412.47 0 2181.84 -538.881 0 0 0 0 1657.99 0 -558.718 0 -1057.24 197.684 0 0 -1764.5 0 0 2088.61 241.325 0 -2129.05 0 0 645.848 0 0 0 0 0 0 
0 0 0 0 755.257 2079 1937.54 0 1278.65 0 0 0 0 0 0 0 0 -1520.66 0 169.759 0.07 -76.3726 0 536.592 0 0 0 -2018.57 0 0 0 2356.26 -255.211 0 0 0 0 0 0 993.149 0 0 0 -2461.55 -942.488 0 0 0 1355.86 0 0 0 0 2.06 0 -2456.05 -1220.97 0 0 0 1567.35 -732.978 0 1828.14 0 0 0 0 0 0 0 0 
0 0 0 0 0 0 0 88.8852 -1384.55 0 0 996.353 0 0 0 -354.854 0 0 0 0 -81.1029 0.07 0 0 0 0 -1859.57 0 931.196 0 0 575.655 2465.97 0 0 0 1327.48 0 0 -1384.24 0 0 0 2169.94 1292.23 0 0 1924.27 0 0 0 0 0 -1224.94 0 0 0 0 0 0 0 0 0 446.257 0 0 0 0 0 435.728 0 0 
-1655.71 0 1918.47 -326.624 0 0 0 1261.86 0 -732.063 -1485.11 -1692.02 0 0 0 0 0 1662.57 0 0 0 0 0.06 0 0 0 0 -792.947 0 690.863 0 0 0 0 0 0 733.436 0 0 0 0 1118.43 0 854.595 0 978.347 551.851 0 -1321.83 0 0 0 1828.59 -1202.2 0 0 617.618 0 0 0 0 0 -1637.85 0 1739.94 0 0 0 0 0 0 0 
-779.214 1760.08 0 0 0 0 0 0 0 0 0 0 1926.1 0 0 0 1025.65 0 0 0 -746.406 0 0 0.02 0 0 0 0 0 0 0 -416.196 0 0 1251.79 0 775.399 0 1124.68 0 -1476.56 0 317.469 0 0 2168.57 -625.858 0 -1204.79 2295.22 0 0 0 0 2429.81 0 541.78 0 0 1023.82 -445.036 1955.55 1849.35 0 419.401 0 -586.184 0 0 0 1168.17 0 
0 -1018.17 0 0 0 0 0 0 0 0 0 0 0 -1950.51 450.53 0 0 2380.52 0 0 0 0 0 0 0 273.217 0 1638 1199.91 0 0 0 0 0 0 0 1580.17 2020.4 0 0 0 -2032.76 -2248.53 -460.601 0 0 0 0 0 -346.767 1144.98 0 0 1093.4 0 -57.2985 0 0 0 0 0 -55.62 0 0 871.838 0 0 0 0 1836.07 0 0 
0 1840.19 0 0 1886.43 0 0 0 0 0 0 0 0 0 0 0 0 1188.62 0 0 0 0 0 0 1454.44 0.03 0 0 0 0 -2256.46 0 0 0 0 0 0 -1881.85 0 0 0 0 0 0 197.073 0 0 0 0 -1125.45 0 0 0 0 0 0 -1609.16 0 0 1600.62 0 0 0 0 833.995 0 0 0 0 0 0 0 
-846.202 645.39 0 2438.96 0 0 0 -1196.25 0 888.623 0 0 0 0 0 -2404.17 1257.74 0 0 2040.39 0 -1874.83 0 0 0 0 0.04 0 0 0 0 0 0 0 -699.713 0 0 2367.09 0 0 0 980.178 0 224.693 0 2027.12 865.429 0 0 0 0 0 0 -1439.79 0 0 0 0 0 0 0 0 0 0 -2427.21 -656.987 0 426.267 0 0 0 0 
0 0 -136.647 1435.06 0 0 0 0 674.078 0 0 1328.09 1932.05 0 0 0 2021.32 0 0 0 1749.7 0 -1721.78 0 -1094.01 0 0 0.03 -2094.26 0 1048.08 0 2199.09 0 -123.829 635.319 0 0 0 0 0 1512.73 0 0 0 0 1422.39 0 0 0 0 0 0 1818.98 0 0 0 -2206.41 166.555 0 -660.649 0 0 0 0 0 -491.577 0 0 0 2313.68 0 
0 0 0 338.832 0 0 1842.48 0 -306.177 0 0 0 0 -2338.1 0 0 0 0 0 0 0 -1729.71 0 0 1179.01 0 0 1692.79 0.03 0 0 0 0 0 1332.21 0 0 0 0 0 944.319 0 0 0 0 1361.51 0 0 0 1253.47 0 -502.411 0 0 816.599 0 0 1481.75 0 0 0 0 0 0 1867.35 0 1054.95 0 0 0 2250.21 0 
0 963.698 0 -1061.2 336.085 0 2106.31 0 0 0 0 0 1254.39 0 0 0 0 0 0 0 0 0 -1545.53 0 0 0 0 0 0 0.02 0 0 0 0 0 0 0 0 0 0 1270.41 0 0 0 2080.22 0 2100.97 0 0 1745.43 0 0 0 0 0 0 876.72 -1177.94 0 0 0 0 0 0 1779.76 2236.17 0 -2084.34 0 0 0 0 
0 0 0 0 0 0 0 0 0 0 0 0 0 0 0 0 0 0 0 0 0 0 0 0 0 1002.46 0 -1655.1 0 0 0.04 0 0 0 0 0 2122.79 0 0 1829.2 0 -940.046 0 229.728 0 0 1192.13 1890.09 0 0 0 0 0 0 -1057.24 0 0 -1686.07 0 141.835 -262.535 0 0 -1.90741 0 0 0 0 0 0 0 0 
0 0 0 0 0 56.8407 0 0 0 0 -72.2526 -194.327 0 924.94 140.614 0 0 0 0 25.5593 1281.55 -2498.63 0 1050.98 0 0 0 0 0 0 0 0.05 0 0 0 0 0 845.592 -1192.28 0 0 0 0 0 0 0 1647.62 0 0 -552.461 -424.131 0 0 0 0 0 0 0 1450.93 0 0 0 1150.78 0 -2108.6 0 0 0 0 -209.891 0 0 
0 0 0 0 1024.58 0 0 0 0 0 -53.1785 0 0 0 0 0 0 0 -1218.53 572.909 2073.35 -107.044 0 0 0 0 0 554.75 0 0 0 0 0.09 0 0 0 -52.1104 577.029 0 0 -781.961 0 1924.12 1024.89 0 0 0 0 0 0 0 0 0 0 0 0 758.766 0 1740.55 0 211.875 0 2199.55 0 0 0 0 0 0 0 0 0 
1821.12 1057.24 0 2003.77 0 -2006.36 0 0 0 704.901 -2176.5 2385.4 0 1803.87 -823.466 0 0 1395.38 1011.76 -1903.82 0 0 0 0 0 0 0 0 0 0 0 0 0 0.03 0 0 0 0 0 0 0 0 -1978.59 0 0 0 0 1561.71 0 0 0 0 0 -1485.56 0 0 0 0 0 2012.01 0 0 -2158.35 0 0 0 0 0 0 0 0 0 
0 -1531.5 0 0 -1853.16 0 0 0 391.934 2081.74 0 0 0 0 1300.62 1275.75 0 0 0 1839.58 0 0 0 -1669.74 0 0 1923.35 2468.72 2433.77 0 0 0 0 0 0.02 138.173 0 2158.96 0 0 0 0 0 -1560.95 2265.16 0 0 0 -974.685 0 0 0 0 0 0 0 0 0 1115.38 0 0 0 0 -1189.84 0 0 0 0 0 0 -176.778 0 
0 0 1709.11 0 1438.72 0 1070.67 0 0 2333.37 0 0 0 0 0 0 0 0 0 0 0 0 0 0 0 0 0 461.516 0 0 0 0 0 0 2402.34 0.07 2464.75 0 0 870.006 0 0 -1351.74 0 0 0 0 0 -1168.17 -1156.88 -345.393 0 0 1355.1 0 0 -550.935 0 0 0 0 0 -1522.95 0 0 0 0 0 0 387.661 0 0 
1093.55 0 0 0 0 0 2297.81 0 0 0 0 2321.16 0 0 0 0 201.956 0 0 309.381 0 923.719 725.044 2447.05 -982.925 0 0 0 0 0 1311.15 0 465.941 0 0 -2068.01 0.09 -2032 0 0 1677.22 0 0 0 0 962.935 0 0 0 0 -445.799 0 0 -1642.89 0 1529.97 0 0 2048.78 0 0 1435.36 59.2822 -698.187 2072.28 0 0 0 0 -943.098 195.853 266.655 
25.1015 -1373.56 0 0 0 0 0 0 0 0 0 2317.19 0 0 -1370.2 0 0 1559.88 -1547.98 0 0 0 0 0 2283.47 1528.75 2021.62 0 0 0 0 -1179.77 -2370.6 0 1462.07 0 2053.51 0.03 -1256.22 0 0 0 0 0 -524.995 0 1411.71 0 0 0 0 0 0 987.96 0 0 0 0 0 0 749.153 174.642 2219.08 0 -2023.3 0 484.863 0 0 -637.608 0 0 
0 0 -33.7992 0 0 0 0 0 0 0 0 0 -1308.4 0 1429.56 0 0 1686.07 0 1966.84 0 0 0 -2404.02 0 0 0 0 0 0 0 1879.1 0 0 0 0 0 1249.2 0.02 0 0 1906.72 0 0 -2181.08 0 0 0 0 0 0 0 0 0 0 0 1602.3 0 81.4081 1852.85 1340.75 1782.2 0 1596.8 0 -83.5444 611.362 0 0 0 0 552.766 
-1135.98 1277.58 2369.53 0 0 0 -1194.42 -1883.98 0 102.771 0 0 0 1560.49 0 0 0 0 0 0 2411.34 1697.52 0 0 0 0 0 0 0 0 596.255 0 0 0 0 666.448 0 0 0 0 0 0 0 0 0 0 0 2340.54 0 -2402.95 0 0 0 -1685 0 1292.38 0 0 0 0 0 0 0 -1127.74 0 0 0 0 0 0 1322.75 0 
0 0 0 0 0 -2069.38 -477.538 0 0 0 0 0 1193.2 0 -751.137 -2389.52 0 0 -382.473 1476.41 0 0 0 -78.814 0 0 0 0 -1803.42 -518.433 0 0 -2304.07 0 0 0 2136.07 0 0 0 0.05 0 2059.16 1629.76 0 0 0 0 2148.73 0 0 0 0 0 0 0 0 0 0 0 2368.62 0 2412.56 0 -535.524 1486.79 0 0 0 0 0 531.861 
0 0 0 0 2241.36 -2420.96 1409.12 2041.92 1201.13 0 0 0 0 646.916 0 0 284.661 0 0 0 0 0 1285.21 0 292.138 0 312.891 -1292.54 0 0 -1262.47 0 0 0 0 0 0 0 1751.69 0 0 0.05 0 0 0 0 -1407.13 2127.67 0 0 0 -737.861 0 2033.52 0 0 0 0 0 0 0 0 0 0 0 0 0 0 -542.39 0 1140.4 0 
0 0 0 1459.93 2093.04 0 0 0 0 1195.33 -2247.31 0 2457.58 0 0 0 0 0 0 543.611 0 0 0 1298.33 2206.26 0 0 0 0 0 0 0 -2168.72 -1933.42 0 -1725.9 0 0 0 0 -1740.09 0 0.02 0 0 0 0 0 0 0 0 536.897 0 -1145.44 0 554.292 0 0 0 -1043.5 0 0 0 0 2012.92 0 1190.91 -1268.88 0 -1471.83 0 0 
0 0 0 0 0 0 0 0 0 0 0 0 996.506 0 0 -1165.12 0 0 0 1709.42 -134.663 1985.92 932.264 0 -2224.57 0 1974.32 0 0 0 89.4955 0 -1878.49 0 2137.9 0 0 0 0 0 -949.66 0 0 0 2455.44 0 0 -1978.9 -1059.98 -289.544 0 0 0 0 0 1799.6 0 0 2027.88 926.313 0 0 0 0 0 0 0 0 0 0 2076.56 0 
0 0 1579.71 -371.639 0 0 0 694.525 0 0 0 0 0 0 0 0 0 0 1613.9 0 -564.211 763.649 0 0 0 2171.16 0 0 0 748.543 0 0 0 0 -81.4081 0 0 -988.266 924.024 0 0 0 0 1461.15 0.04 0 0 0 0 0 0 0 0 0 0 0 0 0 0 1439.18 0 434.355 270.318 0 0 0 801.95 -382.626 0 0 0 0 
0 0 0 0 2299.65 0 0 0 0 1279.41 0 -664.312 0 0 0 0 2140.03 0 0 0 0 0 -1698.89 1110.19 0 0 1730.48 0 -1207.54 0 0 0 0 0 0 0 2051.38 0 0 0 0 0 0 0 0 0.08 0 2375.33 80.4926 0 0 0 -994.522 0 0 -176.321 0 0 0 0 0 819.041 0 -1839.58 0 0 0 0 0 0 0 562.532 
0 0 0 0 0 2181.08 0 0 0 0 -714.515 0 0 0 0 0 -1164.36 0 0 0 0 0 2290.8 -1087.15 0 0 203.33 -2169.94 0 1236.38 2459.11 1041.83 0 0 0 0 0 -1684.39 0 0 0 -548.952 0 0 0 0 0.04 1594.97 -1981.95 -1181.6 0 1346.55 0 0 0 0 -1169.85 2201.07 0 -1071.89 0 -1809.52 2171.93 -1860.48 0 2137.29 0 0 0 0 0 -1387.3 
-361.568 0 -2084.34 0 0 0 2285.76 -1098.9 -1158.86 0 0 -1575.59 0 0 0 0 0 0 0 0 0 -1081.96 0 0 0 0 0 0 0 0 1727.42 0 0 683.996 0 0 0 0 0 -2379.6 0 -2158.5 0 1217.46 0 1826.76 1174.12 0.03 0 0 0 0 0 0 0 0 1750.92 2033.37 0 -122.608 0 2088.46 -1321.53 0 0 45.7015 0 0 0 0 0 0 
-859.02 0 0 0 260.857 0 0 1103.47 0 2046.8 0 0 0 0 -91.937 -1657.84 0 -684.454 0 226.524 1414.15 0 861.614 2351.99 0 0 0 0 0 0 0 0 0 0 985.977 2270.35 0 0 0 0 1150.32 0 0 -506.226 0 -2048.02 -408.261 0 0.01 0 0 0 0 0 2428.43 0 0 1818.98 0 0 0 0 0 0 0 0 0 0 0 0 0 0 
0 0 586.184 0 2447.05 0 1874.83 0 0 -213.553 -1679.2 957.137 0 0 0 462.889 371.944 0 0 0 0 0 0 1215.93 26.4748 -1971.42 0 0 2252.95 870.006 0 178.915 0 0 0 526.521 0 0 0 965.987 0 0 0 2439.12 0 0 -1045.95 0 0 0.04 0 0 -2121.88 0 -725.501 0 0 0 0 0 0 -1516.54 0 0 0 0 0 0 0 0 0 0 
0 0 0 -685.675 0 485.321 0 0 0 0 0 0 0 0 0 0 1197.32 1038.47 0 2003.92 0 0 0 0 -2309.26 0 0 0 0 0 0 2194.51 0 0 0 2328.18 971.328 0 0 0 0 0 0 0 0 0 0 0 0 0 0.07 0 0 0 0 0 0 678.503 0 2419.13 0 0 0 -2100.51 0 -2058.09 0 0 0 0 -1518.68 0 
0 0 0 -2356.11 0 0 -456.481 0 -2422.18 1657.08 496.612 0 0 0 0 0 0 2302.85 0 0 0 0 0 0 0 0 0 0 1519.44 0 0 0 0 0 0 0 0 0 0 0 0 1432.31 -1114.15 0 0 0 2437.44 0 0 0 0 0.05 0 0 -947.371 -1161.92 1435.51 0 0 0 0 0 0 0 0 0 0 0 998.337 0 0 0 
0 2415.77 0 0 0 0 -1086.54 -620.518 1468.32 0 0 0 0 0 0 0 0 0 0 723.975 0 0 1103.78 0 0 0 0 0 0 0 0 0 0 0 0 0 0 0 0 0 0 0 0 0 0 1397.82 0 0 0 2055.5 0 0 0.03 443.052 0 0 0 0 0 0 0 0 0 -1775.95 0 0 0 0 2279.96 0 0 0 
0 0 347.987 0 0 0 0 0 0 0 0 0 0 2298.27 0 2100.21 0 0 0 -824.534 -1560.18 -858.257 552.004 0 -422.758 0 1917.25 -2168.26 0 0 0 0 0 -2203.36 0 1888.41 553.835 1042.28 0 -308.771 0 2191.61 871.838 0 0 0 0 0 0 0 0 0 1959.21 0.04 0 0 0 2269.89 0 1046.71 0 0 1359.22 0 0 0 0 0 0 0 0 0 
2260.43 0 0 0 0 0 0 0 0 0 -993.454 1231.35 0 0 0 -38.0718 0 -315.18 0 0 0 0 0 -1006.42 0 0 0 0 -1131.7 0 2086.32 0 0 0 0 0 0 0 0 0 0 0 0 0 0 0 0 0 -1513.79 1897.56 0 1752.75 0 0 0.01 0 1196.4 0 0 0 0 0 2423.25 1598.79 0 579.623 0 0 0 0 0 0 
0 1170.16 0 912.732 0 0 1514.1 0 0 573.367 0 0 0 0 0 0 0 0 -1169.09 0 2388 0 0 0 -266.35 0 0 0 0 0 0 0 0 0 0 0 1795.33 0 0 -1623.81 0 0 -1268.58 2045.43 0 533.235 0 0 0 0 0 -1623.66 0 0 0 0.06 0 0 0 0 0 501.953 0 0 0 0 0 0 0 0 0 0 
-963.088 -130.085 0 1595.58 0 0 0 0 2205.34 -375.149 0 999.252 -2048.33 -2140.19 -532.319 0 0 2296.44 0 -521.638 1842.78 0 -1497.77 -1520.97 0 2313.84 0 0 0 -899.915 0 0 2062.36 0 0 1670.35 0 0 -1223.72 0 0 0 0 0 0 0 -1250.88 1382.26 0 0 0 -2052.29 0 0 -283.898 0 0.02 0 0 1937.39 1115.22 0 0 0 0 0 0 0 0 -161.519 0 1886.12 
-2094.1 0 0 0 0 0 306.94 0 0 0 0 1241.42 0 2410.89 0 825.602 0 330.897 0 0 0 0 0 0 0 0 0 38.2244 -1872.54 -153.89 -1796.09 0 0 0 0 0 0 0 0 0 0 0 0 0 0 0 -1271.02 1669.44 537.965 0 754.952 0 0 1237.3 0 0 0 0 -1714 0 0 0 1306.12 436.186 0 0 0 0 0 0 0 0 
2433.62 0 0 0 0 0 0 0 -1701.94 0 0 0 0 0 0 0 0 0 2343.29 0 0 0 0 0 0 0 0 -1874.07 0 0 0 -1089.74 481.048 0 2282.25 0 1608.55 0 1789.38 0 0 0 0 -1255.91 0 0 0 0 0 0 0 0 0 0 0 0 0 2198.02 0.02 0 0 -561.159 0 0 0 0 0 0 0 0 0 0 
2228.08 2001.17 0 0 -970.26 564.516 0 0 0 0 0 0 0 0 409.177 0 0 -1849.04 0 1159.93 0 0 0 2350.46 0 2279.81 0 0 0 0 2173.45 0 0 -710.547 0 0 0 0 -1831.34 0 0 0 -1960.89 -1433.68 200.888 0 483.947 2214.96 0 0 -409.024 0 0 1605.04 0 0 1271.02 0 0 0.06 0 0 0 -2493.9 0 0 0 0 0 0 0 0 
-1115.53 0 0 0 0 0 0 138.783 0 0 -287.866 2078.84 -626.621 0 0 0 1734.75 0 0 757.698 466.857 0 0 -12.4363 0 0 0 1533.63 0 0 1079.82 0 1728.95 0 0 0 0 -2042.68 -856.578 0 -976.211 0 0 0 0 0 0 0 0 0 0 0 0 0 0 0 863.903 0 0 0 0.09 0 996.506 485.778 0 0 0 0 0 0 0 0 
556.581 0 0 486.694 0 0 0 0 -712.226 0 2119.43 0 631.657 0 -348.445 0 0 0 0 0 689.032 0 0 161.824 -686.132 0 0 0 0 0 0 0 0 0 0 0 1017.11 439.238 1452.15 0 0 0 0 0 -1646.86 669.5 -0.534074 805.155 0 -1524.93 0 0 0 0 0 1802.35 0 0 -660.649 0 0 0.01 0 0 0 0 0 0 0 -1863.38 0 0 
0 0 -1262.17 0 -1580.02 1158.56 0 0 -2408.6 0 2093.65 0 -1443.14 0 0 0 0 0 0 1271.02 0 0 482.879 -666.448 0 0 0 0 0 0 0 1444.36 1516.69 -2092.58 0 2497.25 -276.727 929.67 0 0 36.6985 0 0 0 1553.32 0 770.669 -251.549 0 0 0 0 0 -2340.69 -1121.78 0 0 2455.75 0 0 1644.87 0 0.09 0 0 0 0 -823.161 2485.35 -2079.3 0 0 
0 0 0 1014.05 0 0 0 -340.51 0 1105 0 1917.25 0 0 1832.41 0 1651.13 0 0 0 -860.088 -65.8437 0 0 0 0 0 0 0 0 -1808.6 0 0 0 152.211 0 1854.69 0 -658.513 -1394.62 0 0 0 0 0 724.738 -1737.65 0 0 0 -1112.32 0 -1751.69 0 1875.74 0 0 607.242 0 1239.28 1170.77 0 0 0.09 0 0 -206.534 0 0 0 0 0 
0 0 622.349 0 0 1531.34 0 0 0 -1438.72 0 1257.44 -603.885 0 -1061.82 0 -1193.35 613.346 0 0 0 0 -1173.36 -772.805 98.0407 -120.624 -1316.03 0 1438.41 479.675 0 758.461 0 0 0 0 -877.178 642.796 0 0 2098.53 0 1936.48 0 0 0 0 0 0 0 0 0 0 0 0 0 0 0 0 0 0 0 0 0 0.06 0 0 0 0 0 0 0 
0 0 0 2394.56 0 2472.38 -1093.25 0 0 0 1184.8 2362.21 106.738 0 756.783 0 0 0 0 1697.36 0 0 0 0 0 0 2252.95 0 0 1822.34 0 0 0 0 0 0 0 0 2416.38 0 153.432 0 0 0 0 0 -2142.32 2451.48 0 0 1445.89 0 0 0 -2469.63 0 0 0 0 0 0 0 0 0 0 0.05 0 -209.738 0 0 -1417.36 0 
0 0 0 0 0 0 1085.62 0 0 2438.96 0 0 0 0 -1085.01 549.867 -2492.37 0 0 0 0 0 0 -2252.49 0 0 0 -1718.12 709.784 0 0 0 0 0 0 0 0 1633.27 2342.37 0 0 0 -1837.29 0 2283.32 0 0 0 0 0 0 0 0 0 0 0 0 0 0 0 0 0 0 414.975 0 0 0.02 0 0 0 0 0 
0 0 0 0 174.947 0 0 0 0 0 -758.156 2109.21 0 0 0 0 0 2086.78 0 0 0 0 0 0 0 0 -1696.75 0 0 -1439.02 0 0 0 0 0 0 0 0 0 0 0 0 -2377.32 0 2301.48 0 0 0 0 0 0 0 0 0 0 0 0 0 0 0 0 0 -1004.14 0 0 1262.02 0 0.01 0 -355.922 -148.701 0 
-1804.64 0 1951.89 1531.8 0 0 0 0 0 0 0 0 0 0 0 0 0 0 0 0 0 0 0 0 0 0 0 0 0 0 0 0 0 0 0 0 0 0 0 0 0 -452.971 0 0 0 0 0 0 0 0 0 713.752 51.0422 0 0 0 0 0 0 0 0 0 1776.41 0 0 0 0 0 0.03 0 0 0 
0 0 0 0 0 0 0 0 0 0 0 0 -1400.72 0 0 0 0 0 0 0 0 73.3207 0 0 2021.32 0 0 0 0 0 0 1021.23 0 0 0 -490.661 1159.02 1887.95 0 0 0 0 -729.621 0 0 0 0 0 0 0 0 0 0 0 0 0 -1686.83 0 0 0 0 705.206 -1759.32 0 0 0 0 -608.31 0 0.08 0 0 
0 0 0 0 0 0 0 1926.4 0 0 0 -1813.79 0 0 0 0 0 0 0 0 0 0 0 1649.75 0 0 0 -1835.15 432.829 0 0 0 0 0 -1359.37 0 -249.718 0 0 -19.7607 0 1315.27 0 2284.39 0 0 0 0 0 0 226.829 0 0 0 0 0 0 0 0 0 0 0 0 0 0 1214.1 0 2126.3 0 0 0.03 0 
0 0 0 0 1195.18 -157.247 0 0 0 0 0 0 0 0 0 2036.73 0 0 0 0 0 0 0 0 0 0 0 0 0 0 0 0 0 0 0 0 -1421.78 0 1364.1 0 -1783.88 0 0 0 0 -349.818 1374.78 0 0 0 0 0 0 0 0 0 307.855 0 0 0 0 0 0 0 0 0 0 0 0 0 0 0.09 
