*Vertices 54
*Matrix 
0.03 0 -1143.6 0 0 0 0 0 0 0 0 0 0 2216.94 0 0 0 0 0 0 0 0 0 0 0 0 -1391.72 0 0 0 0 0 0 0 0 0 0 -420.011 0 2309.72 0 0 0 2257.84 0 0 746.406 0 0 1131.4 1437.04 0 0 0 
0 0.06 0 0 0 0 0 0 0 2269.13 0 362.789 0 0 0 0 0 633.335 1132.01 0 0 0 0 0 0 0 2360.23 0 0 0 0 0 1510.9 0 -755.409 352.107 0 0 0 0 0 0 0 0 0 0 0 0 2162.01 0 0 0 0 1845.53 
-281.152 0 0.05 0 0 0 0 0 0 0 2024.22 1369.14 0 0 0 -607.242 0 0 0 0 0 0 0 0 0 0 423.978 0 0 302.362 0 0 0 0 0 0 0 0 0 0 0 0 0 2204.58 0 0 0 2045.73 0 0 614.566 0 0 0 
0 0 0 0.03 0 0 0 0 0 0 0 0 0 0 0 0 0 0 0 0 0 0 0 0 0 0 98.1933 0 0 0 0 0 2160.48 0 0 0 0 0 0 -1200.06 0 0 0 0 0 0 1752.3 0 -446.257 0 0 0 0 0 
0 0 0 0 0 0 0 0 0 0 663.701 0 -1061.36 0 0 0 0 0 0 -1377.07 0 0 0 0 0 0 0 0 -1607.03 0 0 0 0 0 0 0 0 0 0 0 0 0 0 0 0 0 0 0 2152.85 1279.26 0 0 0 2086.93 
0 0 0 0 0 0.06 0 0 0 0 0 0 0 0 0 0 0 0 0 0 0 0 0 0 0 2422.33 1769.54 0 0 0 1460.69 177.236 0 0 0 107.654 0 0 0 0 0 0 0 0 0 0 0 -1660.59 2297.97 0 0 0 0 0 
0 0 0 0 0 0 0.02 0 0 0 0 0 0 -498.444 2421.41 0 0 0 0 0 0 0 0 0 0 0 0 0 0 1451.23 0 2423.4 0 476.928 0 0 0 0 0 0 0 0 0 221.335 2202.75 0 115.436 0 1962.11 0 0 0 0 0 
0 0 0 0 0 0 0 0.02 0 0 0 0 0 0 0 0 0 0 0 0 0 775.094 0 0 0 0 0 0 0 0 0 0 0 0 0 0 0 0 0 0 360.5 0 2311.7 -757.851 0 -1180.38 0 0 0 0 0 0 0 0 
0 0 0 0 0 0 0 0 0.08 0 0 0 0 0 0 -1364.86 0 0 0 1310.85 0 0 1306.42 0 0 530.183 0 0 0 0 0 2074.42 0 0 0 0 0 0 0 0 0 0 0 0 0 0 0 0 0 0 0 0 0 0 
0 -2175.28 0 0 0 0 0 0 0 0.02 -844.523 1419.64 0 0 0 0 0 0 0 0 0 0 0 0 0 0 0 0 0 0 0 0 0 0 0 0 2016.28 2322.53 0 0 0 0 0 0 -447.325 -100.94 0 0 0 0 0 0 0 0 
0 0 1135.36 0 368.435 0 0 0 0 -1085.92 0.01 0 0 0 0 0 -967.36 0 2219.23 0 1302.91 837.809 0 0 0 0 0 0 0 0 0 0 0 0 0 0 1120.87 0 1860.33 0 0 0 0 0 0 0 -2225.94 0 0 0 0 0 0 0 
0 1246.91 609.073 0 0 0 0 0 0 1303.37 0 0.01 0 0 0 0 0 0 0 0 -623.417 0 0 0 -1416.59 0 0 0 0 0 0 0 865.734 0 -823.466 609.226 0 0 1349.6 -2044.66 0 0 0 0 0 0 0 0 0 0 0 0 0 0 
0 0 0 0 759.682 0 0 0 0 0 0 0 0.07 1779.31 0 0 0 0 0 0 0 0 0 0 0 0 0 0 0 0 882.824 0 0 0 -879.315 0 0 0 736.03 -2409.97 0 0 0 0 0 0 0 0 0 0 0 1564.91 -2304.07 0 
2187.8 0 0 0 0 0 2017.04 0 0 0 0 0 1735.66 0.07 -559.786 0 0 -2272.18 0 0 0 0 0 0 0 1465.27 0 0 0 2213.13 0 0 0 0 0 0 0 0 0 0 0 0 0 0 0 0 0 0 -459.075 0 0 0 0 0 
0 0 0 0 0 0 -1578.65 0 0 0 0 0 0 1697.36 0.09 0 0 646.153 0 0 0 0 0 0 1106.37 0 0 0 0 0 0 0 0 0 2071.37 0 0 0 0 0 0 0 0 0 0 0 0 0 0 1723.3 0 0 0 0 
0 0 756.172 0 0 0 0 0 -757.698 0 0 0 0 0 0 0.05 0 0 0 0 0 0 0 0 -1041.52 0 0 1547.36 0 0 1972.64 0 0 0 2160.79 0 0 0 0 0 0 0 0 0 0 0 0 0 0 0 0 0 0 0 
0 0 0 0 0 0 0 0 0 0 1875.29 0 0 0 0 0 0.08 0 1812.27 0 0 0 0 0 0 0 0 0 0 0 0 0 0 0 1057.7 0 0 0 0 0 0 0 0 0 0 0 0 0 0 0 0 0 1333.74 0 
0 640.202 0 0 0 0 0 0 0 0 0 0 0 1974.93 2121.27 0 0 0.07 0 0 0 0 0 0 0 0 0 0 0 0 0 0 2492.83 0 0 0 0 0 0 0 -1958.91 0 0 0 0 0 0 -1360.29 0 0 0 -279.321 0 830.027 
0 640.355 0 0 0 0 0 0 0 0 168.538 0 0 0 0 0 667.058 0 0 0 0 0 0 0 0 0 0 0 0 0 0 0 -9.07926 0 0 0 0 0 0 0 2220.3 0 0 0 0 0 0 0 0 0 0 0 0 0 
0 0 0 0 -1703.47 0 0 0 891.064 0 0 0 0 0 0 0 0 0 0 0.03 0 0 0 0 1607.49 0 0 0 1687.44 0 0 0 1771.83 0 0 0 0 0 0 0 -2068.77 0 0 0 0 1962.26 0 0 0 0 0 -808.512 0 1020.31 
0 0 0 0 0 0 0 0 0 0 534.608 -795.541 0 0 0 0 0 0 0 0 0.07 0 0 0 0 0 0 0 0 0 0 0 0 0 0 0 0 0 2084.03 0 0 0 0 1334.35 0 0 0 0 0 0 0 0 1152.76 948.592 
0 0 0 0 0 0 0 1331.9 0 0 767.006 0 0 0 0 0 0 0 0 0 0 0.08 0 0 0 0 0 0 0 0 0 2307.58 0 0 1.75481 0 0 0 0 0 0 0 0 0 0 -1775.34 0 233.543 0 0 0 0 0 0 
0 0 0 0 0 0 0 0 -248.344 0 0 0 0 0 0 0 0 0 0 0 0 0 0.09 0 284.204 698.798 0 0 0 0 0 0 0 0 0 0 0 0 0 265.587 0 0 0 0 0 0 0 0 0 0 2051.84 0 0 -1807.08 
0 0 0 0 0 0 0 0 0 0 0 0 0 0 0 0 0 0 0 0 0 0 0 0.04 0 0 0 1609.62 0 0 0 0 0 0 0 0 0 0 0 0 0 0 0 0 0 1566.59 0 0 -1282.46 0 0 0 0 0 
0 0 0 0 0 0 0 0 0 0 0 -1416.9 0 0 -408.719 2427.21 0 0 0 2114.86 0 0 -1147.88 0 0.04 0 0 0 0 0 0 0 0 0 0 0 0 0 0 0 0 0 0 229.575 795.389 0 0 0 0 0 0 0 0 0 
0 0 0 0 0 489.288 0 0 -485.015 0 0 0 0 778.909 0 0 0 0 0 0 0 0 1157.34 0 0 0 0 0 0 -1154.13 0 0 0 0 0 -1513.49 0 0 0 0 1859.87 0 0 0 0 0 0 -2330.62 0 0 0 1639.53 0 0 
-1047.47 2272.18 -2239.68 2220.76 0 1482.82 0 0 0 0 0 0 0 0 0 0 0 0 0 0 0 0 0 0 0 0 0.09 0 0 0 0 0 0 0 0 0 0 0 0 0 0 0 0 0 0 0 0 0 -890.454 0 0 0 0 0 
0 0 0 0 0 0 0 0 0 0 0 0 0 0 0 1807.69 0 0 0 0 0 0 0 158.01 0 0 0 0.07 0 0 0 0 0 0 2379.3 0 0 0 0 0 0 0 0 0 0 0 0 0 0 0 0 0 0 0 
0 0 0 0 8.92666 0 0 0 0 0 0 0 0 0 0 0 0 0 0 1303.22 0 0 0 0 0 0 0 0 0.06 0 0 0 0 0 0 0 0 0 0 0 0 0 895.032 0 0 0 0 1322.6 0 0 0 746.864 0 0 
0 0 -1385.01 0 0 0 -360.347 0 0 0 0 0 0 2002.55 0 0 0 0 0 0 0 0 0 0 0 2226.71 0 0 0 0.04 0 0 0 0 0 1079.82 0 0 0 0 -456.023 0 0 0 0 0 0 1976.45 0 0 0 0 0 -775.399 
0 0 0 0 0 747.475 0 0 0 0 0 0 120.167 0 0 1297.42 0 0 0 0 0 0 0 0 0 0 0 0 0 0 0.06 0 0 0 0 0 0 -1688.51 0 1985.61 0 0 0 0 0 1186.03 0 0 0 0 0 0 0 1836.38 
0 0 0 0 0 2346.8 919.446 0 -554.292 0 0 0 0 0 0 0 0 0 0 0 0 -646.306 0 0 0 0 0 0 0 0 0 0.06 0 0 0 0 0 0 0 0 -573.824 63.2496 0 0 0 0 1547.82 0 0 0 0 0 0 0 
0 -1311.3 0 -480.895 0 0 0 0 0 0 0 -138.63 0 0 0 0 0 932.569 698.798 1518.98 0 0 0 0 0 0 0 0 0 0 0 0 0 -409.329 0 0 0 0 0 0 0 2294.92 0 0 0 0 0 -697.729 0 -1840.49 0 943.861 0 0 
0 0 0 0 0 0 998.032 0 0 0 0 0 0 0 0 0 0 0 0 0 0 0 0 0 0 0 0 0 0 0 0 0 2466.58 0.02 0 0 0 1150.93 0 -2479.09 0 0 0 0 1026.87 0 0 823.008 0 0 0 0 0 -2077.01 
0 -714.362 0 0 0 0 0 0 0 0 0 1586.89 740.455 0 20.9815 938.52 -1056.47 0 0 0 0 409.94 0 0 0 0 0 1992.48 0 0 0 0 0 0 0.01 0 0 0 -1842.33 1987.14 0 393.46 0 0 0 0 0 0 0 1048.23 0 0 0 0 
0 -879.162 0 0 0 1514.86 0 0 0 0 0 2400.51 0 0 0 0 0 0 0 0 0 0 0 0 0 14.1148 0 0 0 -273.37 0 0 0 0 0 0.08 0 0 476.012 0 0 0 0 -1809.52 0 0 0 0 0 0 0 0 0 0 
0 0 0 0 0 0 0 0 0 -1737.19 2051.23 0 0 0 0 0 0 0 0 0 0 0 0 0 0 0 0 0 0 0 0 0 0 0 0 0 0.07 0 0 0 0 20.3711 0 449.461 0 273.675 0 0 0 0 0 0 0 0 
-1622.59 0 0 0 0 0 0 0 0 994.98 0 0 0 0 0 0 0 0 0 0 0 0 0 0 0 0 0 0 0 0 -1058.92 0 0 2452.54 0 0 0 0.03 0 0 0 637.608 0 0 1112.17 0 0 0 -308.466 0 0 0 0 0 
0 0 0 0 0 0 0 0 0 0 -123.981 584.964 278.558 0 0 0 0 0 0 0 517.06 0 0 0 0 0 0 0 0 0 0 0 0 0 -1510.59 1000.47 0 0 0.04 0 0 0 0 0 0 0 0 0 0 0 0 0 0 1373.87 
-94.5311 0 0 2309.56 0 0 0 0 0 0 0 -1245.54 825.449 0 0 0 0 0 0 0 0 0 -174.337 0 0 0 0 0 0 0 2203.97 0 0 -2436.22 844.066 0 0 0 0 0.07 0 0 0 0 0 -918.531 0 0 0 0 1182.36 0 0 0 
0 0 0 0 0 0 0 -123.524 0 0 0 0 0 0 0 0 0 2195.58 1954.18 367.061 0 0 0 0 0 -862.224 0 0 0 -496.918 0 52.4155 0 0 0 0 0 0 0 0 0.08 0 0 0 0 -1130.33 0 0 1591.62 0 0 0 0 0 
0 0 0 0 0 0 0 0 0 0 0 0 0 0 0 0 0 0 0 0 0 0 0 0 0 0 0 0 0 0 0 155.11 1695.53 0 -675.756 0 2227.16 1412.47 0 0 0 0.04 2372.28 0 0 0 0 0 0 0 0 0 0 0 
0 0 0 0 0 0 0 2041.92 0 0 0 0 0 0 0 0 0 0 0 0 0 0 0 0 0 0 0 0 -2175.28 0 0 0 0 0 0 0 0 0 0 0 0 2225.33 0.07 0 0 0 0 0 0 0 0 0 0 0 
-2069.99 0 2242.73 0 0 0 387.509 884.35 0 0 0 0 0 0 0 0 0 0 0 0 1732.31 0 0 0 -2304.38 0 0 0 0 0 0 0 0 0 0 1481.44 2219.38 0 0 0 0 0 0 0.02 0 -2232.51 0 217.215 1369.14 0 0 0 0 0 
0 0 0 0 0 0 -547.578 0 0 137.104 0 0 0 0 0 0 0 0 0 0 0 0 0 0 2006.97 0 0 0 0 0 0 0 0 1928.08 0 0 0 480.285 0 0 0 0 0 0 0.01 0 0 0 0 2053.06 0 0 0 -998.032 
0 0 0 0 0 0 0 1271.02 0 159.383 0 0 0 0 0 0 0 0 0 2129.05 0 -93.6155 0 -91.174 0 0 0 0 0 0 44.7859 0 0 0 0 0 -202.567 0 0 2308.04 457.549 0 0 2488.86 0 0.03 0 0 -1605.81 0 0 0 0 0 
1595.89 0 0 219.047 0 0 580.233 0 0 0 -1900.46 0 0 0 0 0 0 0 0 0 0 0 0 0 0 0 0 0 0 0 0 1825.24 0 0 0 0 0 0 0 0 0 0 0 0 0 0 0.02 0 0 0 0 0 0 0 
0 0 1898.18 0 0 -603.275 0 0 0 0 0 0 0 0 0 0 0 1967.3 0 0 0 1515.63 0 0 0 -12.8941 0 0 517.823 -1120.26 0 0 911.512 2428.59 0 0 0 0 0 0 0 0 0 -1659.06 0 0 0 0.01 0 0 0 0 0 0 
0 -1217.61 0 1536.38 1632.36 1162.83 742.439 0 0 0 0 0 0 70.1163 0 0 0 0 0 0 0 0 0 2318.11 0 0 19.9133 0 0 0 0 0 0 0 0 0 0 2384.49 0 0 -404.904 0 0 1984.39 0 1343.65 0 0 0.05 0 0 0 0 0 
-338.527 0 0 0 470.367 0 0 0 0 0 0 0 0 0 -883.587 0 0 0 0 0 0 0 0 0 0 0 0 0 0 0 0 0 1479.92 0 509.125 0 0 0 0 0 0 0 0 0 -785.012 0 0 0 0 0.02 0 0 0 2211.6 
2143.85 0 -992.691 0 0 0 0 0 0 0 0 0 0 0 0 0 0 0 0 0 0 0 -115.131 0 0 0 0 0 0 0 0 0 0 0 0 0 0 0 0 797.678 0 0 0 0 0 0 0 0 0 0 0.04 748.085 0 0 
0 0 0 0 0 0 0 0 0 0 0 0 -663.701 0 0 0 0 -1333.43 0 -112.232 0 0 0 0 0 -1820.66 0 0 1324.58 0 0 0 1267.05 0 0 0 0 0 0 0 0 0 0 0 0 0 0 0 0 0 2174.67 0 0 0 
0 0 0 0 0 0 0 0 0 0 0 0 1656.62 0 0 0 833.232 0 0 0 2461.7 0 0 0 0 0 0 0 0 0 0 0 0 0 0 0 0 0 0 0 0 0 0 0 0 0 0 0 0 0 0 0 0.02 0 
0 2131.64 0 0 -348.14 0 0 0 0 0 0 0 0 0 0 0 0 1239.13 0 1633.73 2402.95 0 -878.552 0 0 0 0 0 0 1322.29 1507.23 0 0 7.24815 0 0 0 0 1542.33 0 0 0 0 0 2134.54 0 0 0 0 790.811 0 0 0 0.07 
