*Vertices 54
*Matrix 
0.08 0 0 0 0 0 0 0 0 0 0 0 2327.27 0 0 294.733 453.276 0 0 0 0 2305.6 0 0 0 0 0 0 0 0 0 0 1122.7 -1422.54 0 0 0 0 0 0 471.129 0 0 0 0 0 0 -256.737 0 0 0 0 0 0 
0 0.05 0 0 0 0 0 0 0 0 0 2157.28 591.678 2437.59 -1797.77 0 -968.276 -412.381 0 0 0 0 0 -981.552 0 0 0 0 0 0 0 0 0 0 2488.4 0 0 0 0 0 0 -123.981 0 0 0 0 0 0 0 0 0 1188.31 0 0 
0 0 0.06 0 0 0 2442.01 0 0 0 0 -2239.07 1460.54 0 0 0 0 0 0 473.571 0 0 0 0 0 0 1941.82 0 0 0 0 0 0 0 1977.07 0 0 0 -2423.7 0 1122.55 0 0 0 0 0 -1135.98 1018.48 0 0 0 0 0 0 
0 0 0 0.01 0 0 0 0 0 0 0 0 0 0 0 0 0 0 0 0 0 0 0 0 0 0 0 0 0 0 0 0 0 0 1121.63 0 0 0 0 0 0 0 0 0 0 0 0 -1513.18 0 0 1836.99 0 0 0 
0 0 0 0 0.03 0 0 0 0 -163.503 43.5652 0 0 0 0 0 0 0 0 0 0 0 0 0 0 0 0 0 0 1549.96 921.583 0 0 0 0 0 2034.9 0 -187.765 1886.73 0 0 0 0 0 0 0 1595.13 0 -2420.5 0 893.658 0 0 
0 0 0 0 0 0.06 0 0 0 0 0 250.175 0 0 2448.27 -923.719 0 0 0 1298.64 0 0 0 564.516 0 0 0 0 0 685.827 0 700.476 1760.99 2008.19 0 0 0 0 0 0 0 0 -1472.14 0 0 0 0 0 0 0 0 0 0 0 
0 0 2318.26 0 0 0 0.08 0 0 0 1401.18 0 0 0 0 0 0 0 0 0 0 0 0 0 0 0 0 0 0 1352.81 0 0 1959.97 1805.4 0 0 0 1045.18 -1166.8 0 0 0 0 -1213.49 1553.62 0 838.725 0 0 0 0 0 0 0 
0 0 0 0 0 0 0 0.05 0 0 0 0 385.372 0 0 0 0 0 0 0 0 0 0 0 0 0 0 0 0 0 0 0 0 0 0 0 0 0 0 0 0 -677.587 1233.63 0 0 0 0 0 0 0 0 0 0 0 
0 0 0 0 0 0 0 0 0.04 -599.612 0 0 0 0 1882 0 0 0 0 0 0 0 0 0 0 0 0 0 0 0 0 0 57.7563 0 0 0 0 0 0 0 0 0 0 0 0 0 0 0 0 0 0 0 0 0 
0 0 0 0 2236.47 0 0 0 717.261 0.05 0 0 -1182.67 -60.9607 0 0 684.759 0 0 1112.63 0 0 0 0 0 0 1218.68 2455.29 1657.69 481.201 0 0 0 0 0 0 0 0 0 0 0 0 0 -1189.08 -2024.98 0 0 0 0 0 0 0 0 0 
0 0 0 0 -42.8022 0 -954.848 0 0 0 0.01 0 2036.27 0 0 0 0 0 0 0 -1798.99 0 1724.83 1870.1 0 0 952.712 0 0 0 0 0 1194.72 0 0 0 0 0 0 0 1865.21 0 0 0 0 0 0 0 0 0 0 0 0 0 
0 2027.73 -1505.4 0 0 1018.17 0 0 0 0 0 0.01 0 2345.73 0 0 0 2359.31 88.7326 0 0 -294.58 0 0 0 0 0 0 0 0 0 0 0 0 0 0 0 0 0 0 0 0 0 0 46.617 0 0 0 0 0 0 -1508.91 0 0 
2308.19 2420.96 2188.56 0 0 0 0 -574.435 0 117.573 -1497.62 0 0.06 0 0 0 0 0 38.5296 0 -1405 283.288 0 0 0 0 0 0 0 0 -1950.06 1126.06 0 0 0 0 0 0 0 0 1705.15 0 0 -1679.97 356.99 0 0 0 0 0 0 0 0 0 
0 1221.12 0 0 0 0 0 0 0 -324.641 0 978.957 0 0.09 0 0 0 0 0 0 0 0 0 2427.37 0 0 0 0 0 0 0 0 0 0 0 0 0 0 0 0 0 0 0 0 0 0 0 0 0 1717.96 0 0 0 0 
0 1294.98 0 0 0 49.3637 0 0 671.484 0 0 0 0 0 0.04 0 0 0 0 0 0 0 0 0 0 0 1242.33 0 88.8852 0 0 0 0 0 -1777.93 0 0 0 0 0 0 0 0 0 0 0 0 0 1110.34 0 0 0 0 0 
-204.55 0 0 0 0 2114.86 0 0 0 0 0 0 0 0 0 0.05 816.446 0 0 0 0 0 0 2376.86 0 0 0 0 0 0 0 -1052.35 0 0 0 2442.47 0 0 0 0 0 0 0 0 0 0 2391.35 0 0 0 1057.85 0 0 0 
1581.85 758.309 0 0 0 0 0 0 0 1549.81 0 0 0 0 0 1100.42 0.02 0 0 0 0 0 0 0 0 0 0 0 0 1135.52 0 0 0 180.746 -1398.74 0 0 0 0 0 0 0 0 0 0 1131.4 0 0 0 0 0 0 0 0 
0 801.492 0 0 0 0 0 0 0 0 0 2102.5 0 0 0 0 0 0.07 0 0 0 0 0 0 0 0 0 0 0 0 0 0 0 0 2397.92 0 0 0 0 0 0 0 0 0 0 -1799.91 0 0 0 481.506 0 0 0 0 
0 0 0 0 0 0 0 0 0 0 0 2024.98 272.607 0 0 0 0 0 0.05 428.251 0 -86.2911 0 1429.41 0 0 0 0 0 1470.76 0 0 0 0 0 0 0 2469.18 0 854.9 0 -1337.7 0 0 0 0 0 277.032 0 -1156.88 -261.162 2264.09 0 0 
0 0 1372.49 0 0 926.313 0 0 0 808.054 0 0 0 0 0 0 0 0 2232.2 0.06 -1770.76 0 0 0 0 0 0 0 0 2066.33 0 0 0 0 0 -1031.3 0 0 0 0 0 0 0 1951.43 -1791.21 0 0 0 0 1209.52 0 0 0 0 
0 0 0 0 0 0 0 0 0 0 620.823 0 -323.573 0 0 0 0 0 0 27.6955 0 0 439.39 0 0 0 0 0 1698.28 0 0 0 0 0 0 0 0 0 0 0 0 0 1032.21 0 0 0 0 0 -2491 0 0 0 0 0 
1785.87 0 0 0 0 0 0 0 0 0 0 1980.57 2230.06 0 0 0 0 0 543.306 0 0 0 1357.54 0 0 0 0 328.761 0 0 0 0 -1531.04 1016.8 2344.05 0 0 0 0 0 -1497.01 0 2483.21 0 0 0 770.974 0 0 0 0 0 0 0 
0 0 0 0 0 0 0 0 0 0 -673.162 0 0 0 0 0 0 0 0 0 1094.32 1444.21 0 0 0 0 0 0 1429.72 0 0 0 0 0 0 0 0 0 0 0 0 0 0 0 0 0 0 -74.5415 0 0 0 0 0 0 
0 265.435 0 0 0 61.7237 0 0 0 0 2342.68 0 0 2411.95 0 1667.61 0 0 811.106 0 0 0 0 0.01 0 0 0 0 0 0 0 0 513.092 0 0 0 0 0 0 0 0 0 0 0 0 0 0 0 0 0 0 0 0 0 
0 0 0 0 0 0 0 0 0 0 0 0 0 0 0 0 0 0 0 0 0 0 0 0 0.05 0 0 0 0 2137.9 -1356.32 0 -1029.62 0 0 0 -294.275 0 0 0 0 0 0 0 0 0 2015.98 0 0 0 0 0 0 0 
0 0 0 0 0 0 0 0 0 0 0 0 0 0 0 0 0 0 0 0 0 0 0 0 0 0.04 914.258 0 0 0 0 0 0 0 0 0 0 0 473.571 0 0 0 0 0 0 0 0 0 0 2372.43 0 2462.61 0 0 
0 0 1007.8 0 0 0 0 0 0 -357.753 -1619.85 0 0 0 1835.92 0 0 0 0 0 0 0 0 0 0 -1020.16 0.06 0 0 1031.6 0 -1175.04 0 0 0 0 0 0 0 0 0 0 0 1567.96 0 0 0 -1266.44 0 0 0 0 0 0 
0 0 0 0 0 0 0 0 0 2010.94 0 0 0 0 0 0 0 0 0 0 0 1204.18 0 0 0 0 0 0.06 0 6.18 0 0 0 0 0 0 0 0 0 0 0 0 0 0 0 955.458 0 0 0 0 0 0 0 0 
0 0 0 0 0 0 0 0 0 363.704 0 0 0 0 2375.18 0 0 0 0 0 -565.279 0 -2122.33 0 0 0 0 0 0.07 0 0 0 0 0 0 0 0 0 0 0 0 0 0 0 0 1473.97 0 0 0 -579.165 0 0 0 0 
0 0 0 0 -1325.19 -539.033 -480.895 0 0 -1549.96 0 0 0 0 0 0 758.003 0 334.254 704.291 0 0 0 0 1932.51 0 -1448.03 1806.62 0 0.02 1888.41 -582.98 0 0 0 0 -18.0822 0 0 0 0 0 0 -72.8629 0 0 0 0 0 0 0 0 0 0 
0 0 0 0 807.596 0 0 0 0 0 0 0 -1212.58 0 0 0 0 0 0 0 0 0 0 0 2395.47 0 0 0 0 -1462.22 0.08 0 0 0 0 0 0 0 0 0 0 0 0 2324.67 0 0 0 0 0 0 -870.312 0 0 0 
0 0 0 0 0 365.23 0 0 0 0 0 0 1179.16 0 0 -1085.01 0 0 0 0 0 0 0 0 0 0 67.8274 0 0 763.344 0 0.06 0 2150.72 0 0 0 0 0 0 0 0 0 0 0 0 0 0 0 1615.42 0 0 0 0 
646.916 0 0 0 0 1379.67 624.027 0 378.048 0 385.678 0 0 0 0 0 0 0 0 0 0 -2163.38 0 1897.56 623.264 0 0 0 0 0 0 0 0.02 0 0 0 0 0 44.1755 1031.6 0 0 0 0 0 0 0 0 0 0 0 0 0 0 
847.423 0 0 0 0 2341.3 -895.184 0 0 0 0 0 0 0 0 0 1573.61 0 0 0 0 2067.86 0 0 0 0 0 0 0 0 0 2371.21 0 0.03 1160.54 0 0 0 0 0 0 0 0 0 0 0 -2490.08 0 0 0 0 0 0 0 
0 -147.481 161.214 486.541 0 0 0 0 0 0 0 0 0 0 1130.02 0 1275.14 345.241 0 0 0 -1170.61 0 0 0 0 0 0 0 0 0 0 0 -641.575 0.09 -1280.18 0 0 0 0 0 0 0 0 2123.1 0 0 0 0 0 0 0 0 0 
0 0 0 0 0 0 0 0 0 0 0 0 0 0 0 10.9104 0 0 0 -467.467 0 0 0 0 0 0 0 0 0 0 0 0 0 0 -2207.48 0.03 0 661.412 0 2023 0 500.58 0 0 0 0 1307.95 0 0 0 2191.46 0 0 0 
0 0 0 0 1243.55 0 0 0 0 0 0 0 0 0 0 0 0 0 0 0 0 0 0 0 -340.663 0 0 0 0 2321.77 0 0 0 0 0 0 0.02 0 0 0 0 0 0 -26.017 0 0 0 0 0 0 0 0 0 0 
0 0 0 0 0 0 1073.87 0 0 0 0 0 0 0 0 0 0 0 -1562.93 0 0 0 0 0 0 0 0 0 0 0 0 0 0 0 0 2432.1 0 0.04 0 2323.15 0 0 0 0 -1022.6 0 0 0 0 0 0 952.101 0 699.255 
0 0 427.946 0 1310.54 0 1964.09 0 0 0 0 0 0 0 0 0 0 0 0 0 0 0 0 0 0 1783.27 0 0 0 0 0 0 674.23 0 0 0 0 0 0.01 0 0 0 0 0 0 0 0 0 0 0 0 0 0 0 
0 0 0 0 739.387 0 0 0 0 0 0 0 0 0 0 0 0 0 -930.28 0 0 0 0 0 0 0 0 0 0 0 0 0 2266.69 0 0 2075.95 0 -909.833 0 0.06 0 0 2121.27 0 0 0 0 0 0 0 0 0 0 0 
1979.66 0 -818.888 0 0 0 0 0 0 0 1161.31 0 1912.98 0 0 0 0 0 0 0 0 -589.999 0 0 0 0 0 0 0 0 0 0 0 0 0 0 0 0 0 0 0 0 0 0 0 0 -83.8496 2078.84 1126.67 0 0 0 0 0 
0 1520.2 0 0 0 0 0 1653.42 0 0 0 0 0 0 0 0 0 0 -1510.44 0 0 0 0 0 0 0 0 0 0 0 0 0 0 0 0 -1597.11 0 0 0 0 0 0.01 0 0 0 904.34 2194.97 0 0 0 -2433.32 0 0 0 
0 0 0 0 0 -1714.61 0 1426.82 0 0 0 0 0 0 0 0 0 0 0 0 2344.81 373.318 0 0 0 0 0 0 0 0 0 0 0 0 0 0 0 0 0 1926.71 0 0 0.05 1818.06 0 0 587.405 0 0 0 0 0 0 0 
0 0 0 0 0 0 659.734 0 0 -456.786 0 0 -835.978 0 0 0 0 0 0 286.95 0 0 0 0 0 0 1779.46 0 0 -1317.56 302.362 0 0 0 0 0 2451.78 0 0 0 0 0 215.232 0.01 0 162.435 -436.338 0 0 -2454.53 0 0 0 0 
0 0 0 0 0 0 -1323.82 0 0 2427.06 0 2299.8 683.844 0 0 0 0 0 0 571.688 0 0 0 0 0 0 0 0 0 0 0 0 0 0 -1681.19 0 0 -740.608 0 0 0 0 0 0 0.02 329.676 0 0 0 1810.28 0 -303.125 0 0 
0 0 0 0 0 0 0 0 0 0 0 0 0 0 0 0 -337.458 -432.829 0 0 0 0 0 0 0 0 0 658.208 1841.26 0 0 0 0 0 0 0 0 0 0 0 0 793.71 0 2249.75 2249.29 0.06 0 0 0 0 0 0 0 0 
0 0 -463.5 0 0 0 627.995 0 0 0 0 0 0 0 0 -1691.87 0 0 0 0 0 1804.18 0 0 1477.48 0 0 0 0 0 0 0 0 1534.55 0 -1898.33 0 0 0 0 -1712.78 -2451.78 1140.86 917.005 0 0 0.01 0 0 0 1581.85 0 0 0 
-935.316 0 -136.647 -1669.29 -1688.97 0 0 0 0 0 0 0 0 0 0 0 0 0 1849.8 0 0 0 2425.08 0 0 0 483.184 0 0 0 0 0 0 0 0 0 0 0 0 0 1161.61 0 0 0 0 0 0 0 0 0 0 624.638 0 0 
0 0 0 0 0 0 0 0 0 0 0 0 0 0 -862.835 0 0 0 0 0 1611 0 0 0 0 0 0 0 0 0 0 0 0 0 0 0 0 0 0 0 2117.45 0 0 0 0 0 0 0 0.05 0 0 0 1483.28 0 
0 0 0 0 1882.15 0 0 0 0 0 0 0 0 -2160.79 0 0 0 720.618 609.684 -1053.42 0 0 0 0 0 585.879 0 0 2412.87 0 0 -2010.33 0 0 0 0 0 0 0 0 0 0 0 1084.55 -715.583 0 0 0 0 0.04 0 0 0 0 
0 0 0 2319.64 0 0 0 0 0 0 0 0 0 0 0 2339.78 0 0 1139.33 0 0 0 0 0 0 0 0 0 0 0 1204.64 0 0 0 0 657.445 0 0 0 0 0 -936.995 0 0 0 0 1291.47 0 0 0 0.04 0 0 0 
0 -822.245 0 0 1072.5 0 0 0 0 0 0 -279.626 0 0 0 0 0 0 -701.239 0 0 0 0 0 0 649.815 0 0 0 0 0 0 0 0 0 0 0 217.978 0 0 0 0 0 0 1228.75 0 0 582.98 0 0 0 0.06 0 0 
0 0 0 0 0 0 0 0 0 0 0 0 0 0 0 0 0 0 0 0 0 0 0 0 0 0 0 0 0 0 0 0 0 0 0 0 0 0 0 0 0 0 0 0 0 0 0 0 1391.57 0 0 0 0.02 0 
0 0 0 0 0 0 0 0 0 0 0 0 0 0 0 0 0 0 0 0 0 0 0 0 0 0 0 0 0 0 0 0 0 0 0 0 0 1714 0 0 0 0 0 0 0 0 0 0 0 0 0 0 0 0.08 
