*Vertices 50
*Matrix 
0.02 0 0 0 1950.21 0 0 0 0 0 0 0 0 0 0 0 0 0 0 0 0 -1657.69 0 0 0 0 523.621 0 1475.8 0 0 0 0 0 1064.87 0 0 0 0 0 0 0 0 0 0 0 0 0 0 0 
0 0.03 0 0 0 0 0 -646.001 0 0 0 0 0 0 0 0 0 0 0 0 0 0 0 0 0 -1.75481 0 0 0 0 0 0 0 0 0 118.03 0 0 0 0 2296.14 0 0 0 0 0 0 0 0 0 
0 0 0.01 0 0 0 0 0 0 0 0 0 0 0 0 0 1296.66 0 0 1827.98 0 1632.66 0 0 0 0 0 370.724 0 0 0 0 208.213 0 0 0 0 0 225.913 -1467.41 0 0 -667.364 0 0 -38.8348 0 0 0 0 
0 0 0 0.05 0 0 0 0 0 0 0 0 0 0 0 0 322.657 899.457 0 0 0 0 0 0 0 0 0 0 0 0 0 0 0 0 0 0 -362.789 0 0 0 0 173.116 0 0 0 0 0 0 0 0 
-1889.02 0 0 0 0.04 0 0 0 -231.864 0 0 0 0 2111.65 0 0 0 0 0 2375.18 0 1246.15 0 0 1726.2 0 0 -1873.91 2444.3 0 -1166.49 0 0 0 0 -493.561 0 0 0 0 0 0 0 0 0 0 -1031.75 0 0 0 
0 0 0 0 0 0.01 0 -69.3533 0 123.218 2015.52 0 0 0 0 0 0 0 416.807 1877.57 0 0 0 0 0 1722.39 0 0 0 0 0 0 -1651.43 0 0 0 547.578 0 0 0 0 0 0 0 0 0 0 0 0 0 
0 0 0 0 0 0 0.05 0 0 0 0 0 0 980.331 0 0 0 1058.92 0 0 0 0 0 0 0 0 0 0 0 -519.807 0 0 0 0 0 0 0 0 0 0 -1380.89 0 0 0 0 0 0 0 0 0 
0 2413.63 0 0 0 -2237.85 0 0.04 0 -239.494 0 1808.76 0 0 0 0 0 1197.16 933.79 0 0 1600.16 2379.76 0 0 0 0 0 0 0 0 0 0 1252.1 0 0 0 0 0 0 0 -1425.9 0 -463.347 0 0 0 0 0 0 
0 0 0 0 1223.87 0 0 0 0.04 0 0 0 0 0 -2056.57 0 0 0 0 0 0 714.667 0 0 0 0 0 0 1789.99 0 0 0 0 0 1222.5 1570.25 0 1204.49 0 0 0 0 1433.53 0 0 0 0 0 0 0 
0 0 0 0 0 -480.895 0 1656.62 0 0.01 0 0 0 0 0 0 0 0 0 0 -1249.2 0 0 0 0 0 0 0 0 0 0 0 0 0 0 0 0 -237.51 0 0 0 0 0 0 0 0 0 0 0 0 
0 0 0 0 0 1183.58 0 0 0 0 0.04 0 697.272 0 0 0 0 0 0 0 0 0 0 1141.32 0 0 0 0 -143.361 0 0 0 0 0 0 0 0 0 0 0 0 0 0 0 0 0 0 0 0 0 
0 0 0 0 0 0 0 1544.92 0 0 0 0.05 -234.001 0 0 0 0 0 716.651 -94.8363 0 0 0 1851.48 -1197.16 0 0 0 0 0 0 0 0 0 0 0 0 0 0 2450.71 -1945.17 0 0 0 0 -912.275 0 0 0 0 
0 0 0 0 0 0 0 0 0 0 1119.5 2354.88 0.09 -873.058 0 0 1151.08 0 0 0 0 0 826.67 0 0 1210.9 -934.553 -2179.4 0 0 0 0 0 0 0 0 0 0 0 0 0 0 0 -675.451 0 0 0 0 0 0 
0 0 0 0 312.281 0 2166.28 0 0 0 0 0 1747.72 0.07 0 0 0 0 0 0 0 0 1141.32 0 0 -1306.57 0 -1544.31 212.638 0 0 0 0 0 0 -1067.16 0 0 0 0 0 0 0 0 0 0 0 0 0 0 
0 0 0 0 0 0 0 0 2232.96 0 0 0 0 0 0.08 0 1854.38 0 0 0 1462.22 0 0 0 0 0 0 0 0 0 0 0 0 0 0 0 1696.75 0 0 -1349.91 0 0 0 2023.91 0 1162.53 0 0 0 0 
0 0 0 0 0 0 0 0 0 0 0 0 0 0 0 0.07 0 0 0 0 -1327.78 0 0 0 0 0 0 0 0 0 0 1232.57 0 0 0 0 0 0 0 0 578.707 0 0 0 0 408.414 636.54 0 0 0 
0 0 1687.44 -168.386 0 0 0 0 0 0 0 0 712.989 0 -1134.45 0 0.07 0 0 0 0 0 -147.328 0 0 -208.67 422.758 0 0 162.893 0 0 2300.1 0 0 0 253.533 0 0 0 0 0 0 0 0 0 1223.87 0 0 0 
0 0 0 2421.41 0 0 -38.2244 2391.81 0 0 0 0 0 0 0 0 0 0.02 0 0 0 0 2152.09 0 0 0 0 0 0 0 0 0 0 0 0 0 0 0 1736.88 0 -2323.91 -863.14 0 0 0 -945.082 0 0 0 0 
0 0 0 0 0 -1999.95 0 -672.857 0 0 0 896.557 0 0 0 0 0 0 0.04 0 950.88 1701.33 0 0 0 1782.36 -567.873 0 0 1420.41 0 0 -193.411 1998.43 -739.54 0 0 0 0 0 0 0 0 0 0 0 0 0 0 0 
0 0 -1296.5 0 -696.661 1368.98 0 0 0 0 0 640.812 0 0 0 0 0 0 0 0.05 0 -458.312 0 0 0 0 0 1505.71 0 0 0 0 0 0 0 0 0 0 0 0 0 0 0 0 0 0 0 0 0 0 
0 0 0 0 0 0 0 0 0 291.833 0 0 0 0 -235.832 1167.41 0 0 2498.63 0 0.06 0 0 0 0 1320.61 2277.37 0 0 0 0 0 0 0 0 0 0 0 0 0 0 0 0 0 1394.31 0 0 0 0 0 
-1211.51 0 1279.87 0 718.482 0 0 2239.98 207.907 0 0 0 0 0 0 0 0 0 -2497.56 1376 0 0.02 0 0 0 0 0 0 2175.59 0 0 0 0 0 0 0 0 114.368 0 0 0 0 0 0 -1330.68 0 0 0 0 0 
0 0 0 0 0 0 0 -1388.36 0 0 0 0 1439.33 -2397.92 0 0 543.153 304.346 0 0 0 0 0.03 0 0 0 0 0 0 0 0 0 0 0 0 0 0 0 0 2253.72 0 0 0 0 0 0 0 0 0 0 
0 0 0 0 0 0 0 0 0 0 2002.85 -878.552 0 0 0 0 0 0 0 0 0 0 0 0.03 0 0 0 0 0 0 0 0 0 0 0 0 405.667 0 0 0 0 0 0 0 872.906 0 0 0 0 0 
0 0 0 0 1020 0 0 0 0 0 0 -2367.7 0 0 0 0 0 0 0 0 0 0 0 0 0.08 0 767.922 0 0 0 0 2434.84 0 0 0 0 0 0 0 0 0 0 0 0 0 0 0 0 0 0 
0 -380.49 0 0 0 2023.91 0 0 0 0 0 0 1103.78 2260.58 0 0 2203.05 0 1209.68 0 788.675 0 0 0 0 0.08 0 0 0 0 0 0 0 0 0 0 0 0 0 0 0 0 -697.272 0 0 0 0 0 0 0 
1077.68 0 0 0 0 0 0 0 0 0 0 0 -604.648 0 0 0 288.324 0 1757.48 0 -1203.57 0 0 0 -2131.79 0 0 0 0 0 0 0 0 -163.656 0 0 0 0 0 0 0 0 0 0 1644.26 0 0 0 0 0 
0 0 -350.276 0 728.248 0 0 0 0 0 0 0 2252.8 1556.83 0 0 0 0 0 -901.44 0 0 0 0 0 0 0 0.02 0 0 0 0 0 0 0 0 0 -1213.8 0 0 0 0 0 0 0 1761.6 0 0 0 0 
2057.18 0 0 0 1276.82 0 0 0 -896.1 0 -2300.26 0 0 1486.79 0 0 0 0 0 0 0 -600.223 0 0 0 0 0 0 0.06 0 0 0 0 0 0 0 0 0 0 0 0 0 0 0 0 0 0 0 0 -1082.87 
0 0 0 0 0 0 -1002 0 0 0 0 0 0 0 0 0 710.242 0 1897.87 0 0 0 0 0 0 0 0 0 0 0.07 0 825.144 0 0 0 0 0 0 0 0 0 1245.99 0 0 0 0 0 0 0 0 
0 0 0 0 914.258 0 0 0 0 0 0 0 0 0 0 0 0 0 0 0 0 0 0 0 0 0 0 0 0 0 0.08 0 0 0 66.1489 0 0 0 0 0 0 0 0 -1437.5 1158.25 0 0 0 0 0 
0 0 0 0 0 0 0 0 0 0 0 0 0 0 0 705.054 0 0 0 0 0 0 0 0 2115.62 0 0 0 0 -1362.58 0 0.07 0 0 0 0 0 0 0 0 0 0 0 0 0 0 0 0 0 0 
0 0 -252.464 0 0 946.76 0 0 0 0 0 0 0 0 0 0 -1233.79 0 2278.89 0 0 0 0 0 0 0 0 0 0 0 0 0 0.04 0 -1247.06 0 0 0 0 0 0 0 0 0 0 0 0 0 0 0 
0 0 0 0 0 0 0 -392.697 0 0 0 0 0 0 0 0 0 0 2217.09 0 0 0 0 0 0 0 2172.84 0 0 0 0 0 0 0.06 0 0 0 0 0 0 0 0 0 0 -1080.58 0 0 0 0 0 
768.532 0 0 0 0 0 0 0 -945.692 0 0 0 0 0 0 0 0 0 -856.731 0 0 0 0 0 0 0 0 0 0 0 967.818 0 1247.06 0 0.06 0 0 913.8 0 0 0 2412.72 0 0 0 0 0 0 0 0 
0 455.565 0 0 341.884 0 0 0 1933.73 0 0 0 0 -394.986 0 0 0 0 0 0 0 0 0 0 0 0 0 0 0 0 0 0 0 0 0 0.03 0 0 0 0 0 0 0 0 1127.43 0 0 0 0 0 
0 0 0 -316.553 0 2272.94 0 0 0 0 0 0 0 0 704.749 0 1489.38 0 0 0 0 0 0 1792.58 0 0 0 0 0 0 0 0 0 0 0 0 0.01 0 0 0 1988.81 0 0 0 0 -250.633 0 0 0 0 
0 0 0 0 0 0 0 0 2248.68 404.141 0 0 0 0 0 0 0 0 0 0 0 1026.26 0 0 0 0 0 -516.907 0 0 0 0 0 0 -1932.97 0 0 0.04 0 0 0 0 0 0 0 0 0 0 2299.49 0 
0 0 398.953 0 0 0 0 0 0 0 0 0 0 0 0 0 0 -502.564 0 0 0 0 0 0 0 0 0 0 0 0 0 0 0 0 0 0 0 0 0.06 0 0 0 1843.39 0 2336.42 0 2154.99 0 0 0 
0 0 -1349.15 0 0 0 0 0 0 0 0 -1084.09 0 0 1944.72 0 0 0 0 0 0 0 2381.44 0 0 0 0 0 0 0 0 0 0 0 0 0 0 0 0 0.07 0 0 1330.07 -1511.96 0 759.987 0 0 0 0 
0 1864.76 0 0 0 0 -2391.2 0 0 0 0 1540.96 0 0 0 -352.26 0 -363.552 0 0 0 0 0 0 0 0 0 0 0 0 0 0 0 0 0 0 2382.05 0 0 0 0.02 0 0 0 0 0 0 0 0 0 
0 0 0 792.337 0 0 0 -1267.36 0 0 0 0 0 0 0 0 0 760.75 0 0 0 0 0 0 0 0 0 0 0 968.429 0 0 0 0 1969.28 0 0 0 0 0 0 0.08 0 0 904.797 0 0 0 0 0 
0 0 -355.77 0 0 0 0 0 14.5726 0 0 0 0 0 0 0 0 0 0 0 0 0 0 0 0 2465.36 0 0 0 0 0 0 0 0 0 0 0 0 1089.13 1718.88 0 0 0.04 0 0 0 0 0 0 0 
0 0 0 0 0 0 0 753.426 0 0 0 0 -986.74 0 1299.86 0 0 0 0 0 0 0 0 0 0 0 0 0 0 0 -133.595 0 0 0 0 0 0 0 0 52.8733 0 0 0 0.06 0 0 0 0 0 0 
0 0 0 0 0 0 0 0 0 0 0 0 0 0 0 0 0 0 0 0 985.366 1376.77 0 -1891.77 0 0 2346.03 0 0 0 -1064.56 0 0 -31.663 0 496.155 0 0 1478.85 0 0 -643.864 0 0 0.06 0 0 0 0 0 
0 0 1265.37 0 0 0 0 0 0 0 0 730.995 0 0 1097.52 1432.77 0 2362.97 0 0 0 0 0 0 0 0 0 1092.49 0 0 0 0 0 0 0 0 1517.76 0 0 -1105.3 0 0 0 0 0 0 0 0 0 0 
0 0 0 0 -973.464 0 0 0 0 0 0 0 0 0 0 1628.09 650.731 0 0 0 0 0 0 0 0 0 0 0 0 0 0 0 0 0 0 0 0 0 1076.01 0 0 0 0 0 0 0 0.05 -1292.08 0 0 
0 0 0 0 0 0 0 0 0 0 0 0 0 0 0 0 0 0 0 0 0 0 0 0 0 0 0 0 0 0 0 0 0 0 0 0 0 0 0 0 0 0 0 0 0 0 337.916 0.06 0 0 
0 0 0 0 0 0 0 0 0 0 0 0 0 0 0 0 0 0 0 0 0 0 0 0 0 0 0 0 0 0 0 0 0 0 0 0 0 2366.94 0 0 0 0 0 0 0 0 0 0 0.02 0 
0 0 0 0 0 0 0 0 0 0 0 0 0 0 0 0 0 0 0 0 0 0 0 0 0 0 0 0 1921.98 0 0 0 0 0 0 0 0 0 0 0 0 0 0 0 0 0 0 0 0 0.09 
