*Vertices 69
*Matrix 
0.08 1021.84 -2157.43 0 0 0 0 0 0 0 0 2048.78 0 0 0 0 -2265.01 -2185.66 122.608 0 0 1399.66 0 0 2436.83 0 0 0 303.43 0 0 0 0 0 0 0 0 873.211 2300.41 1145.44 1988.05 0 0 0 0 -48.1429 0 0 -569.247 -1976.15 2090.59 1746.96 0 -1023.97 -1593.45 0 0 1308.1 0 -2443.08 893.811 884.503 0 0 2265.62 1654.64 0 -1418.58 1770.15 
1474.73 0.05 0 231.254 0 0 0 0 0 0 0 0 0 0 -1573.15 0 0 0 -2358.7 0 0 -994.674 0 0 0 2154.99 935.926 -140.461 0 -226.066 0 0 0 0 1300.62 -1278.8 0 -39.4452 0 0 0 0 11.6733 -239.036 0 985.672 0 0 -1094.93 0 1916.94 -349.361 0 0 1499.3 0 0 0 0 0 0 0 0 0 0 0 -2266.99 0 2120.96 
1976.91 0 0.02 -7.09555 1850.11 0 -113.147 0 1727.27 0 187.765 0 559.786 -513.092 2200.31 -709.784 0 0 0 -1489.53 0 0 0 0 0 726.112 0 0 -1834.39 0 0 0 0 0 0 0 0 0 0 0 2360.84 0 0 0 0 0 -993.912 1889.93 0 0 1728.8 2212.36 -1073.87 0 0 0 -166.86 -1480.07 0 0 0 0 0 0 549.715 1064.26 0 0 1971.42 
0 -1331.6 -1296.5 0.06 -1163.75 0 -735.878 2021.47 0 0 0 -1844.46 964.919 691.473 -1276.82 0 768.532 0 0 2163.53 0 0 0 0 0 -1165.58 0 0 0 0 0 0 2318.26 0 0 1486.18 0 0 0 0 1556.06 0 0 0 0 0 0 0 0 0 0 0 0 0 0 0 28.1533 243.614 0 1408.51 -1560.03 0 350.734 0 0 0 0 0 0 
0 0 -1515.93 221.641 0.03 0 0 0 0 0 0 0 402.005 0 0 0 0 0 1605.04 0 0 0 0 0 0 2139.88 0 0 0 452.666 2336.73 2456.36 0 0 -1535.77 2362.21 0 -1204.03 -1388.52 0 0 0 0 0 0 371.029 0 0 1519.29 0 0 1577.88 0 -1576.05 256.127 0 0 0 0 288.781 0 0 0 0 -1495.64 627.842 0 0 0 
0 0 0 0 0 0.06 0 0 0 0 1834.09 2475.43 1313.14 0 -231.101 -2080.37 0 0 717.872 0 0 0 -951.033 0 0 0 816.294 1748.79 0 0 0 -2054.89 0 0 0 0 -1622.59 0 1993.85 0 0 -340.052 0 0 -395.138 0 0 0 0 0 0 0 -150.075 0 0 -826.06 -277.642 1068.53 0 0 0 0 0 -583.285 0 0 2097.61 -2275.23 0 
0 0 2161.7 -278.863 0 0 0.07 0 0 0 0 0 1838.36 9.84222 0 0 -1001.24 0 0 0 0 1270.56 0 0 0 -627.232 0 0 0 2001.48 0 1520.66 0 0 0 0 1195.79 0 2338.25 -552.156 0 1907.64 0 0 0 0 0 0 0 616.398 0 0 -2227.47 0 0 0 0 0 0 1003.98 0 0 0 0 -111.621 0 0 -1153.37 0 
0 0 0 -2366.48 0 0 0 0 0 -190.817 0 1574.22 0 0 0 1993.7 0 738.166 0 0 0 2314.14 0 0 0 0 -609.989 0 0 0 0 -1628.85 0 0 0 0 1779.15 0 0 0 0 1529.36 -889.081 0 0 0 0 0 0 0 268.792 0 0 0 -1405.15 0 -1394.01 0 0 0 0 773.263 0 855.663 0 -635.929 0 0 0 
0 0 1286.74 0 0 0 0 0 0.02 544.679 0 0 976.669 2465.67 0 0 -730.537 1939.22 -1756.26 0 -1119.65 0 0 1144.83 0 1510.28 0 0 -1451.54 0 0 0 0 0 0 0 -2468.87 -1326.41 0 0 0 0 0 0 0 0 2483.67 0 0 0 0 0 0 0 0 0 563.143 0 0 0 0 0 -1990.04 -2489.32 0 0 0 0 0 
0 0 0 0 0 0 0 -1836.68 -858.409 0.05 -1662.57 202.567 0 0 0 0 0 0 0 0 0 0 0 0 0 2063.13 0 0 -248.192 0 2464.6 0 0 1448.94 0 0 1770.46 0 0 0 0 0 -530.641 356.227 0 153.432 0 1808.6 0 0 0 0 160.146 1209.07 0 0 0 0 0 0 0 2409.97 0 0 0 0 0 0 0 
0 0 781.35 0 0 2135 0 0 0 -442.289 0.08 0 0 0 0 0 300.073 -124.744 0 0 0 -613.804 -306.94 0 -1189.84 0 1988.36 -563.448 0 0 0 0 1866.28 0 0 0 0 0 0 -250.175 0 0 0 -1953.26 0 0 -346.614 0 0 0 0 313.196 0 2410.73 0 0 0 0 0 0 0 304.193 0 0 0 0 0 0 0 
1680.43 0 0 -2443.08 0 -1615.27 0 -1350.06 0 1991.26 0 0 1957.84 1924.12 -169.607 0 0 1638.16 0 0 2295.22 0 0 -2402.34 0 0 0 0 1398.43 0 0 0 0 -1734.6 0 0 713.141 0 0 0 0 0 0 657.598 0 673.315 1549.35 1987.9 0 0 0 0 0 0 -175.253 0 0 0 -2465.21 0 600.986 0 0 0 -1832.1 0 0 0 0 
0 0 -1683.63 -178.304 -91.0215 2349.54 176.931 0 1401.49 0 0 -1351.28 0.06 0 -1144.67 0 0 0 1500.98 0 0 229.423 0 0 -897.015 0 0 1640.6 0 0 2444.61 0 0 0 0 0 0 -170.675 0 0 0 0 0 0 0 0 1961.04 0 0 389.492 -1704.54 0 -257.805 0 0 0 0 0 0 0 0 0 0 0 0 0 0 0 0 
0 0 39.903 -9.23185 0 0 -1993.55 0 1417.36 0 0 -972.091 0 0.01 0 0 -1641.51 2209.01 2065.26 0 0 1612.06 0 0 0 0 0 0 0 0 1058.46 1186.94 1468.17 0 0 0 0 1580.32 0 0 2319.94 0 0 0 0 0 0 0 0 0 0 0 1625.03 0 1721.63 0 0 0 0 0 0 -1498.84 0 2283.47 0 0 -1908.25 2258.75 0 
0 -1173.36 400.784 -2156.97 0 2284.08 0 0 0 0 0 2424.77 2251.73 0 0.03 -1504.64 2427.21 0 0 0 0 -1543.7 1273 0 0 0 0 0 1634.8 0 0 0 0 0 -2002.24 0 2246.09 0 0 0 0 0 1990.34 0 0 0 0 -1515.63 0 0 0 2317.04 0 398.343 0 0 0 0 -759.224 0 -1389.43 0 0 0 1511.51 0 0 0 0 
0 0 -360.195 0 0 -673.315 0 1543.7 0 0 0 0 0 0 2354.12 0 2479.25 0 -1445.59 0 0 0 0 0 1794.41 -183.95 0 0 0 0 0 0 0 0 0 0 0 0 0 0 0 -1831.8 0 0 0 0 2025.89 944.624 0 0 0 0 0 -388.119 0 0 0 -2446.44 508.972 0 0 451.75 -953.169 0 0 0 -144.124 958.815 0 
74.2363 0 0 2353.05 0 0 2472.99 0 1628.24 0 -649.663 0 0 1498.38 742.744 1518.37 0.08 0 0 0 0 0 -156.484 -862.224 863.75 0 80.0348 2223.5 0 0 0 0 -2470.7 0 350.581 0 0 0 0 0 0 2263.33 282.983 0 0 0 0 1469.54 0 0 0 0 0 0 -1531.95 0 0 0 0 -1675.7 0 491.729 0 0 0 947.676 0 0 -2026.81 
490.356 0 0 0 0 0 0 780.282 -250.938 0 2255.24 -2234.64 0 273.522 0 0 0 0.08 0 0 0 0 -812.937 980.636 0 0 -640.355 0 0 0 0 1901.23 0 0 0 0 0 0 0 0 0 0 2002.7 0 0 -624.79 0 -17.777 0 1097.06 -776.009 0 0 0 0 0 0 0 0 0 2096.55 0 -1244.47 -316.248 0 0 0 0 0 
-2193.75 1326.56 0 0 2384.49 -1450.77 0 0 163.808 0 0 0 -2380.67 71.337 0 671.484 0 0 0.07 0 0 0 0 0 26.9326 1241.87 0 0 0 0 0 910.291 0 0 0 -835.978 2318.26 0 0 0 0 0 -770.669 2072.89 0 1099.35 0 1815.93 261.773 0 0 0 0 0 0 0 328.608 0 0 0 -164.266 1245.99 -29.8318 0 0 0 0 0 0 
0 0 2056.41 -1563.08 0 0 0 0 0 0 0 0 0 0 0 0 0 0 0 0.04 0 -509.888 0 2142.78 0 0 -288.629 21.7444 0 0 0 -2380.06 0 0 0 0 0 801.035 0 0 0 0 1685 0 0 -897.626 -774.636 566.652 1926.86 0 1914.2 0 0 0 0 -171.285 0 0 -1917.25 0 0 0 284.967 0 -1118.27 0 1151.54 0 1255 
0 0 0 0 0 0 0 0 2029.56 0 0 -1606.11 0 0 0 0 0 0 0 0 0 18.8452 0 1877.27 0 0 938.673 -707.648 0 0 -2424.77 0 60.9607 0 635.777 1357.39 0 0 -2248.83 0 0 0 -2285 0 0 0 924.177 2399.59 0 0 0 0 0 0 0 0 0 0 0 871.227 0 0 105.518 0 0 -2241.51 0 0 1319.54 
-1161.46 2308.19 0 0 0 0 2141.87 738.777 0 0 -1783.27 0 50.8896 -467.467 -1967.91 0 0 0 0 -1617.1 -1721.32 0.08 0 0 0 0 515.992 0 0 -209.586 0 1141.01 0 1764.2 0 -1748.63 0 2073.96 184.408 0 0 0 2261.04 0 0 0 2122.03 0 0 0 0 0 -1758.4 0 -2170.86 -2084.64 1914.2 0 -7.40074 0 0 0 2338.86 -1909.01 828.349 0 0 0 0 
0 0 0 0 0 933.027 0 0 0 0 -1819.44 0 0 0 458.464 0 1969.74 -744.88 0 0 0 0 0.02 0 0 0 0 0 0 0 0 0 0 0 0 0 -1718.73 0 0 0 0 0 0 0 0 0 0 2474.97 -294.58 1460.08 0 0 0 -764.87 0 0 266.35 0 0 0 0 0 0 0 2018.27 1917.1 0 1586.89 0 
0 0 0 0 0 0 0 0 -255.058 0 0 647.984 0 0 0 0 -618.992 2454.07 0 -74.3889 -1533.02 0 0 0.04 1377.07 0 0 0 0 0 0 0 0 2188.1 0 270.013 0 0 2260.58 0 0 2140.8 0 0 0 0 0 0 0 0 0 0 0 0 0 0 0 0 -795.999 993.606 0 557.649 0 0 0 0 0 0 0 
1461.91 0 0 0 0 0 0 0 0 0 1649.75 0 1890.7 0 0 -1766.79 1210.14 0 853.221 0 0 0 0 -69.3533 0.03 0 0 0 0 0 2008.5 0 0 325.861 0 0 -85.2229 156.484 0 0 0 1730.02 0 0 0 0 0 0 0 0 0 1734.44 1406.67 -187.002 68.4378 0 0 -1087.91 0 1429.87 0 213.706 0 0 -384.457 0 121.693 0 0 
0 -199.973 -2287.74 -124.134 -1013.29 0 -245.445 0 512.635 -1433.99 0 0 0 0 0 2268.52 0 0 1855.45 0 0 0 0 0 0 0.05 0 -182.73 -2265.92 0 0 0 2296.59 0 1228.75 0 0 0 0 -335.78 0 1122.09 0 1346.86 2135 0 -681.86 0 0 0 2160.94 0 1919.23 0 -233.848 0 0 -641.118 0 0 0 0 0 1051.13 0 0 -1698.58 -693.915 0 
0 -487.762 0 0 0 1759.77 0 1398.13 0 0 -831.248 0 0 0 0 0 -660.649 -579.165 0 1652.65 -563.295 -522.401 0 0 0 0 0.02 0 0 0 0 0 -386.593 0 0 -371.792 -116.81 0 0 0 0 0 0 0 0 0 -1512.27 -2420.8 1620.91 0 0 2375.33 1552.86 0 0 -582.522 0 229.728 0 1988.66 0 0 0 0 -2445.98 0 216.605 0 0 
0 1771.22 0 0 0 942.03 0 0 0 0 1653.57 0 -1564.61 0 0 0 2042.99 0 0 2330.01 -445.341 0 0 0 0 1086.69 0 0.06 0 -1856.21 0 0 0 0 0 0 0 0 645.39 0 -191.885 0 -281.152 0 0 0 0 0 0 0 0 0 0 142.293 0 1824.47 0 0 0 611.515 0 -396.207 0 0 2464.29 0 0 1396.15 0 
323.725 0 -453.581 0 0 0 0 0 -545.137 1601.38 0 1509.52 0 0 2133.93 0 0 0 0 0 0 0 0 0 0 -2193.14 0 0 0.02 0 0 -110.401 0 0 0 -1198.23 1761.45 0 283.898 1908.25 0 0 0 0 0 0 0 0 573.214 136.036 0 0 -1254.84 0 0 525.452 0 0 -2407.07 0 0 0 0 0 0 -574.129 0 0 0 
0 2345.88 0 0 1389.74 0 -1090.35 0 0 0 0 0 0 0 0 0 0 0 0 0 0 1524.93 0 0 0 0 0 1736.88 0 0 0 0 0 641.118 495.544 0 0 2233.88 303.735 0 0 -866.649 0 0 0 -874.279 -1159.17 952.101 0 -2280.57 0 915.937 0 0 0 0 0 0 0 0 0 -1116.6 0 1989.73 0 0 0 0 0 
0 0 0 0 568.941 0 0 0 0 1191.21 0 0 2083.42 -294.733 0 0 0 0 0 0 1513.18 0 0 0 1381.19 0 0 0 0 0 0 0 2127.06 0 -2072.59 0 0 0 0 0 -2458.8 0 0 0 0 0 0 0 0 0 -1098.74 0 0 0 0 0 0 0 692.999 0 0 0 0 0 -862.835 0 0 0 1588.26 
0 0 0 0 1441.47 -1681.95 1126.51 -907.239 0 0 0 0 0 1988.36 0 0 0 1617.56 -2041.61 2349.85 0 1833.78 0 0 0 0 0 0 -1040.76 0 0 0.03 -2152.55 1053.27 0 1245.23 0 0 0 254.601 0 0 299.615 0 0 0 0 0 -731.452 0 906.781 0 0 0 0 0 1858.96 0 2431.64 86.4437 933.027 -1262.63 0 0 0 1256.98 0 1967.6 0 
0 0 0 -1365.93 0 0 0 0 0 0 1952.65 0 0 2304.83 0 0 1031.91 0 0 0 1029.31 0 0 0 0 2161.7 -320.826 0 0 0 2107.38 -2307.12 0.02 1488.01 0 1070.67 349.971 0 0 0 0 0 0 0 0 1729.41 -602.054 0 0 0 0 0 0 0 0 0 0 0 1835.31 0 0 -919.294 0 0 0 0 209.738 0 1577.73 
0 0 0 0 0 0 0 0 0 -1830.58 0 -312.433 0 0 0 0 0 0 0 0 0 2263.02 0 -2492.98 1386.07 0 0 0 0 533.998 0 -2461.09 -1070.06 0.02 0 0 0 974.38 0 0 0 0 0 0 -1226 316.553 0 478.301 0 2080.37 0 0 -786.691 2358.09 0 0 1668.07 0 0 0 0 0 0 0 0 0 1161 -1441.62 0 
0 1171.99 0 0 -1146.81 0 0 0 0 0 0 0 0 0 -1120.56 0 -1373.87 0 0 0 2116.99 0 0 0 0 2329.25 0 0 0 1406.52 1743.29 0 0 0 0.01 0 0 0 -1825.69 0 0 0 61.1133 1496.09 -2468.72 0 0 0 0 0 0 0 0 0 1700.87 0 0 0 0 0 -906.171 0 0 0 0 0 -1320.31 904.34 0 
0 1233.33 0 602.817 2124.77 0 0 0 0 0 0 0 0 0 0 0 0 0 530.641 0 -761.055 2078.23 0 -1577.43 0 0 -1259.42 0 -913.343 0 0 588.015 1442.69 0 0 0.08 0 0 0 1159.32 0 0 0 1832.41 0 0 1654.33 -1110.03 150.685 0 0 0 0 1343.35 1600.62 0 0 -2217.4 -2433.16 0 0 0 0 0 0 0 0 0 0 
0 0 0 0 0 1961.96 408.719 -690.405 -1541.11 -197.073 0 -300.684 0 0 2281.03 0 0 0 -2494.05 0 0 0 908.917 0 -2167.5 0 2203.82 0 364.315 0 0 0 2218.31 0 0 0 0.05 0 -610.599 1262.47 0 0 0 0 1144.98 0 0 0 0 -1533.94 0 0 0 1893.44 0 0 0 0 0 1372.19 -1172.9 0 -636.235 0 0 0 0 0 2055.35 
231.864 717.566 0 0 1027.18 0 0 0 -1473.97 0 0 0 1639.99 2479.71 0 0 0 0 0 -39.5978 0 423.826 0 0 -1180.07 0 0 0 0 -384.457 0 0 0 -2409.82 0 0 0 0.02 0 1487.09 0 0 1513.03 0 -143.513 0 0 0 -1042.89 0 2299.19 0 1546.14 0 1085.47 0 0 0 0 0 0 0 0 0 0 0 1334.8 357.906 0 
-1621.07 0 0 0 2027.88 2499.85 -2343.13 0 0 0 0 0 0 0 0 0 0 0 0 0 2285.45 2422.94 0 1721.17 0 0 0 1166.19 2057.79 -1050.83 0 0 0 0 1393.55 0 -790.811 0 0.09 0 0 0 0 1080.74 2104.02 0 0 0 0 1570.41 0 0 0 7.70592 1375.7 -2086.78 0 0 0 0 0 0 -215.537 0 9.84222 -1281.09 0 0 -592.441 
-13.0467 0 0 0 0 0 1606.72 0 0 0 1081.5 0 0 0 0 0 0 0 0 0 0 0 0 0 0 -1143.76 0 0 -1510.74 0 0 364.925 0 0 0 430.692 -884.198 522.553 0 0.05 0 2348.02 -159.993 0 0 0 -1229.21 2356.87 0 0 0 0 0 -2496.64 0 0 -238.578 0 0 0 2391.2 0 0 0 -2331.84 0 0 0 0 
1975.69 0 -1051.9 678.198 0 0 0 0 0 0 0 0 0 -2051.07 0 0 0 0 0 0 0 0 0 0 0 0 0 -1.60222 0 0 1233.18 0 0 0 0 0 0 0 0 0 0.08 1792.43 0 0 0 0 0 0 1051.29 631.352 0 0 0 0 -1310.24 0 0 0 0 0 0 0 0 0 0 1600.31 2176.81 0 0 
0 0 0 0 0 1688.06 -1818.37 -217.215 0 0 0 0 0 0 0 1623.97 2380.83 0 0 0 0 0 0 -1347.62 1004.59 -1007.95 0 0 0 153.89 0 0 0 0 0 0 0 0 0 -2033.07 2069.84 0.08 0 0 0 0 0 0 -1746.65 0 2363.28 0 -555.971 2164.6 0 0 0 0 1529.82 -1007.34 2171.32 2113.79 0 0 861.766 0 0 0 0 
0 1168.63 0 0 0 0 0 2083.42 0 -808.664 0 0 0 0 192.038 0 -1790.6 -57.1459 2405.24 -87.054 -2481.69 -1302.15 0 0 0 0 0 2149.65 0 0 0 -806.986 0 0 2365.26 0 0 2073.05 0 -1515.02 0 0 0.01 0 -678.808 1180.23 0 0 2094.87 0 0 264.824 0 0 0 0 0 0 231.864 0 0 0 0 0 0 0 0 0 0 
0 1134.91 0 0 0 0 0 0 0 -1306.88 2384.95 317.469 0 0 0 0 0 0 -418.943 0 0 0 0 0 0 832.621 0 0 0 0 0 0 0 0 -2150.41 -1491.82 0 0 1415.68 0 0 0 0 0.05 0 0 0 0 0 801.035 0 0 0 1882.31 0 0 0 0 0 0 0 0 0 0 0 0 0 0 1472.75 
0 0 0 0 0 -1965.32 0 0 0 0 0 0 0 0 0 0 0 0 0 0 0 0 0 0 0 167.776 0 0 0 0 0 0 0 27.8481 2438.51 0 1698.43 408.414 2375.79 0 0 0 2221.06 0 0.01 0 2282.86 0 0 0 0 0 1280.94 0 0 0 0 0 1731.54 -52.2629 0 0 0 0 0 0 0 419.401 0 
1556.06 444.731 0 0 2093.49 0 0 0 0 2179.1 0 2367.09 0 0 0 0 0 1306.27 -329.524 200.278 0 0 0 0 0 0 0 0 0 -2356.56 0 0 1727.73 980.026 0 0 0 0 0 0 0 0 1347.16 0 0 0.02 1437.04 0 0 0 0 0 0 91.3266 -1461.76 0 0 0 0 0 0 0 -1452.76 0 0 0 -2255.24 0 0 
0 0 -301.904 0 0 0 0 0 -649.663 0 -541.322 1021.53 2323.91 0 0 -2320.4 0 0 0 1166.95 -758.003 -1849.19 0 0 0 308.618 -1673.41 0 0 1629 0 0 -231.254 0 0 1385.77 0 0 0 1467.41 0 0 0 0 -16.2511 136.036 0.08 680.792 1486.33 0 0 -2202.14 1710.03 0 0 1700.42 0 0 0 0 0 0 0 0 0 0 0 0 -1344.11 
0 0 2139.73 0 0 0 0 0 0 1420.1 0 338.221 0 0 1672.64 606.479 -328.761 1376.31 -1038.77 531.098 2094.1 0 -1574.83 0 0 0 308.313 0 0 323.878 0 0 0 -748.085 0 -911.817 0 0 0 493.713 0 0 0 0 0 0 1800.67 0.01 1503.42 0 0 0 0 0 -1682.26 0 0 0 0 -1260.64 1919.08 0 0 0 -2452.7 0 0 0 0 
249.413 2266.84 0 0 296.564 0 0 0 0 0 0 0 0 0 0 0 0 0 611.515 -1847.21 0 0 -1833.02 0 0 0 428.404 0 -974.685 0 0 2077.78 0 0 0 1255.46 0 2366.48 0 0 -917.92 -2292.78 467.62 0 0 0 -9.68963 938.978 0.01 0 2142.32 0 0 -1919.54 -1531.8 469.451 0 0 1809.82 0 0 0 0 0 0 0 -228.05 0 0 
295.038 0 0 0 0 0 -1493.5 0 0 0 0 0 1792.43 0 0 0 0 -1384.7 0 0 0 0 -22.8126 0 0 0 0 0 -1835.15 -1169.09 0 0 0 2261.5 0 0 558.26 0 2080.22 0 1070.97 0 0 -1894.97 0 0 0 0 0 0.03 0 0 0 -587.405 0 0 -120.472 1928.08 0 0 1991.56 -1056.17 2216.48 -1597.57 2028.18 0 0 0 0 
1179.62 13.3518 1739.17 0 0 0 0 -2069.23 0 0 0 0 -1954.02 0 0 0 0 -41.8867 0 1913.13 0 0 0 0 0 128.254 0 0 0 0 -117.725 -1375.7 0 0 0 0 0 -1814.71 0 0 0 -947.676 0 0 0 0 0 0 1347.47 0 0.05 973.312 1176.41 754.036 -753.731 904.95 484.405 0 1453.67 0 -70.2689 0 0 0 0 0 406.888 0 1172.75 
2267.6 -1511.96 1624.88 0 654.088 0 0 0 0 0 2086.78 0 0 0 -123.066 0 0 0 0 0 0 0 0 0 -1716.13 0 1613.59 0 0 -1193.04 0 0 0 0 0 0 0 0 0 0 0 0 -472.655 0 0 0 -548.799 0 0 0 -2224.88 0.09 0 2233.73 391.781 1599.86 0 -1130.63 0 0 0 0 0 0 0 0 0 2429.04 0 
0 0 3.58592 0 0 356.533 568.941 0 0 -651.799 0 0 1556.06 -330.287 0 0 0 0 0 0 0 -1706.82 0 0 270.165 2208.4 1690.34 0 2213.28 0 0 0 0 750.221 0 0 0 -383.999 0 0 0 -2111.19 0 0 348.903 0 2189.32 0 0 0 1033.13 0 0.03 0 0 0 0 0 0 287.866 0 -2362.06 -2274.47 0 0 0 0 0 -537.355 
776.162 0 0 0 1708.66 0 0 0 0 1206.47 1355.56 0 0 0 -1972.79 1262.78 0 0 0 0 0 0 2032 0 1312.22 0 0 503.174 0 0 0 0 0 -1495.33 0 440.764 886.486 0 -1821.42 -964.003 0 -1480.07 0 1942.43 0 425.352 0 0 -2060.84 1382.72 1399.2 -1621.07 0 0 0 0 0 0 0 0 0 0 0 1308.71 0 0 -510.346 0 418.027 
1227.68 2339.47 0 0 -248.497 0 0 -1285.21 0 0 0 -563.601 0 -1633.43 0 0 2231.28 0 0 0 0 2120.04 0 0 -56.8407 1237.45 0 0 0 0 0 0 0 0 -1427.27 -2496.19 0 -1927.32 -2455.44 0 949.507 0 0 0 0 726.264 0 651.646 -948.744 0 -266.35 1593.6 0 0 0.09 -188.681 0 1338.16 0 0 0 0 0 0 0 0 0 0 -361.568 
0 0 0 0 0 2217.55 0 0 0 0 0 0 0 0 0 0 0 0 0 1003.52 0 2144.92 0 0 0 0 1682.26 161.367 630.284 0 0 0 0 0 0 0 0 0 -68.5903 0 0 0 0 0 0 0 -473.266 0 -2029.56 0 1697.36 -781.198 0 0 -2321.16 0.03 0 -2199.24 0 0 0 0 2239.83 0 0 0 0 0 0 
0 0 -582.827 -1989.27 0 149.159 0 -20.8289 2298.58 0 0 0 0 0 0 0 0 0 -1213.34 0 0 -1363.64 -391.018 0 0 0 0 0 0 0 0 959.883 0 1094.01 0 0 0 0 0 2480.01 0 0 0 0 0 0 0 0 0 -846.202 1299.4 0 0 0 0 0 0.09 1678.44 0 0 -1777.32 -17.3193 0 -633.03 1687.75 0 0 1760.99 0 
-2435 0 -2407.99 2012.16 0 2272.64 0 0 0 0 0 0 0 0 0 -394.833 0 0 0 0 0 0 0 0 -1749.09 2154.68 -2356.11 0 0 0 0 0 0 0 0 -544.374 0 0 0 0 0 0 0 0 0 0 0 0 0 2138.51 0 1625.19 0 0 324.03 784.249 -698.035 0 -2020.1 0 0 1001.24 0 0 0 0 0 2371.06 0 
0 0 0 0 0 0 0 0 0 0 0 -1204.64 0 0 1612.52 1719.49 0 0 0 524.995 0 -840.251 0 -1047.01 0 0 0 0 1815.62 0 858.562 622.349 1346.86 0 0 420.164 0 0 0 0 0 1676.15 2047.87 0 155.416 0 0 0 2442.63 0 -741.676 0 0 0 0 0 0 -2465.21 0.01 0 0 0 0 0 -2215.72 0 0 -1959.97 0 
-1750.16 0 0 -1683.63 409.177 0 1768.62 0 0 0 0 0 0 0 0 0 824.839 0 0 0 532.319 0 0 1865.52 -790.201 0 638.523 -713.904 0 0 0 47.5326 0 0 0 0 -2123.25 0 0 0 0 1510.28 0 0 1629.76 0 0 2309.87 0 0 0 0 648.9 0 0 0 0 0 0 0.02 0 0 0 -1886.43 0 0 2000.26 0 0 
-1575.29 0 0 684.301 0 0 0 0 0 0 0 -1953.26 0 0 34.1044 0 0 -1593.6 639.744 0 0 0 0 0 0 0 0 0 0 0 0 2437.89 0 0 335.627 0 -178.915 0 0 1629 0 -163.35 0 0 0 0 0 750.221 0 1421.63 -1661.2 0 0 0 0 0 2240.75 0 0 0 0.01 0 0 0 0 -73.9311 0 0 1965.47 
-189.901 0 0 0 0 0 0 -571.23 0 -1348.38 -1242.64 0 0 2215.26 0 1125.14 2028.64 0 -221.946 0 0 0 0 1355.1 1567.35 0 0 -837.809 0 89.6481 0 -101.703 -1604.28 0 0 0 0 0 0 0 0 532.777 0 0 0 0 0 0 0 1863.23 0 0 -1918.78 0 0 0 466.552 1630.22 0 0 0 0.03 0 0 0 0 0 0 0 
0 0 0 1311.46 0 0 0 0 -1749.09 0 0 0 0 0 0 -618.839 0 2348.48 1412.63 -887.707 1773.35 -2427.67 0 0 0 0 0 0 0 0 0 0 0 0 0 0 1808.6 0 1691.72 0 0 0 0 0 0 1308.56 0 0 0 -2468.11 0 0 957.137 0 0 2148.12 0 0 0 0 0 0 0.03 0 0 0 0 0 0 
0 0 0 0 0 -1407.28 0 -944.166 -2323.45 0 0 0 0 518.586 0 0 0 1386.68 0 0 0 1565.83 0 0 0 2282.56 0 0 0 -501.801 0 0 0 0 0 0 0 0 0 0 0 0 0 0 0 0 0 0 0 -859.172 0 0 0 1641.67 0 0 2094.71 0 0 492.035 0 0 0 0.02 2454.22 0 0 0 0 
898.846 0 2095.17 0 1942.88 0 -606.784 0 0 0 0 1838.66 0 0 -1191.67 0 0 0 0 1361.81 0 -579.318 -2151.17 0 -1659.67 0 342.189 266.961 0 0 1104.69 0 0 0 0 0 0 0 -1209.07 -2013.08 0 -268.792 0 0 0 0 0 -1600.16 0 75.9148 0 0 0 0 0 0 -1728.95 0 2095.63 0 0 0 0 2174.52 0.09 1194.88 168.386 0 -543.916 
-700.781 0 44.7859 0 1055.1 0 0 138.02 0 0 0 0 0 0 0 0 2488.56 0 0 0 134.968 0 1922.59 0 0 0 0 0 -62.3341 0 0 -755.257 0 0 0 0 0 0 -1343.04 0 -2111.04 0 0 0 0 0 0 0 0 0 0 0 0 0 0 0 0 0 0 0 2425.53 0 0 0 -2180.01 0.01 0 0 2356.11 
0 1700.57 0 0 0 545.137 0 0 0 0 0 0 0 -297.021 0 -2405.39 0 0 0 -20.8289 0 0 0 0 -2041.31 1280.33 -1944.41 0 0 0 0 0 2283.01 1138.87 1604.74 0 0 1477.17 0 0 2122.03 0 0 0 0 120.624 0 0 1569.03 0 744.575 0 0 1113.54 0 0 0 0 0 -35.02 0 0 0 0 2142.78 0 0.05 0 -1054.64 
2456.36 0 0 0 0 982.009 32.7311 0 0 0 0 0 0 622.654 0 -1482.06 0 0 0 0 0 0 -1197.62 0 0 612.583 0 -1583.99 0 0 0 -1497.92 0 -1051.9 -897.168 0 0 295.648 0 0 0 0 0 0 2006.36 0 0 0 0 0 0 1553.47 0 0 0 0 341.884 211.264 2103.56 0 0 0 0 0 0 0 0 0.01 0 
-853.679 2287.74 -1926.56 0 0 0 0 0 0 0 0 0 0 0 0 0 2456.97 0 0 879.62 2099.29 0 0 0 0 0 0 0 0 0 652.257 0 2400.36 0 0 0 -8.46889 0 1517 0 0 0 0 152.669 0 0 1309.63 0 0 0 2216.33 0 -1574.07 1525.24 1156.42 0 0 0 0 0 486.541 0 0 0 403.531 2398.83 2165.82 0 0.08 
