*Vertices 46
*Matrix 
0.06 0 0 0 0 2487.95 0 0 0 759.072 0 -24.9489 0 1643.8 1932.36 0 0 0 0 -1266.59 -1650.36 -2405.7 0 31.8155 0 -1559.72 0 0 0 0 2413.79 588.931 -1022.9 0 0 924.787 0 644.78 0 0 0 0 0 0 0 0 
0 0.04 0 0 0 -1016.19 2336.12 0 0 0 -953.475 0 530.488 0 0 0 0 0 0 2475.28 0 -1593.91 0 1360.74 0 1987.9 0 1741.31 0 0 -724.586 0 0 0 0 0 0 0 2296.59 0 -328.455 -1977.98 0 0 0 0 
0 0 0 0 0 0 12.5889 0 0 0 1235.77 -553.682 0 0 0 0 0 0 0 0 0 0 1132.16 0 0 0 -2363.89 0 0 0 238.121 -939.283 0 1752.75 0 1558.2 0 -1871.47 0 690.71 0 0 0 0 0 0 
0 0 0 0.04 0 0 1967.76 -1112.48 0 20.3711 0 0 382.778 0 -2022.08 2153.16 0 -1958.3 0 0 0 0 0 -1371.12 0 0 0 0 -1190.15 0 0 1052.2 0 0 0 0 390.255 1784.34 1995.53 0 0 0 0 1666.84 0 0 
0 0 0 0 0.05 -1294.06 0 0 2452.24 0 2048.48 1321.53 0 0 716.498 0 0 780.892 -996.658 0 906.934 1527.38 1289.33 0 0 0 0 0 0 0 0 0 953.932 0 0 403.836 0 1164.82 0 0 0 0 0 0 0 0 
2325.13 1623.81 0 0 2207.02 0.02 1478.24 0 0 -1679.05 0 0 0 1940.9 0 0 -1229.36 -686.438 1069.44 0 1037.25 1933.73 0 0 2149.65 0 0 0 0 0 2220.76 0 0 415.891 1570.86 -2077.47 0 0 0 0 0 0 0 0 0 0 
0 847.27 -2292.17 -2215.41 0 1412.93 0.06 -218.741 0 0 0 0 0 0 0 0 0 0 0 0 -669.958 0 0 0 0 0 0 0 0 0 0 1128.96 -847.27 1397.82 -1131.24 0 0 2202.6 2382.2 0 0 0 0 0 1923.2 0 
0 0 0 1792.89 0 0 -1265.98 0.04 0 0 772.958 0 0 0 0 -1136.74 -2226.4 0 1428.8 -1249.2 1482.82 0 0 0 0 0 0 1861.86 0 0 0 0 0 0 251.244 0 0 0 0 763.497 1951.58 0 0 0 0 0 
0 0 0 0 792.947 0 0 0 0.07 0 0 0 0 0 1661.66 2419.13 0 0 0 1069.14 0 0 0 0 0 0 0 0 0 0 0 0 2081.13 0 0 0 0 0 0 0 0 0 2365.41 0 0 -2339.93 
786.081 0 0 -718.482 0 2183.52 0 0 0 0.02 0 0 0 1951.58 0 0 0 1394.92 0 0 0 0 0 0 0 -1011.46 1538.82 0 0 0 0 0 0 0 837.657 -1382.11 0 0 0 0 1747.87 0 0 -1055.25 0 0 
0 741.829 -1891.92 0 1846.9 0 0 582.98 0 0 0.06 0 0 0 0 0 0 0 0 2475.74 0 0 0 0 0 -2324.52 0 2282.1 1075.85 1648.99 0 0 284.051 0 0 0 -1066.55 -931.501 0 189.291 365.841 0 1435.97 0 0 0 
-1856.06 0 2474.67 0 278.863 0 0 0 0 0 0 0.09 0 383.999 0 0 0 2225.49 0 -1206.02 0 885.113 1953.72 0 0 -1369.29 0 1334.04 0 0 0 0 0 0 -2395.47 0 0 0 0 0 0 2405.55 1982.86 -2251.88 0 0 
0 350.581 0 1853.92 0 0 0 0 0 0 0 0 0.01 0 0 0 0 0 0 -27.543 1935.26 1732.46 0 0 0 -1399.66 0 0 0 0 0 -1640.9 0 0 889.691 0 0 0 0 0 0 0 0 0 0 0 
2409.67 0 0 0 0 675.756 0 0 0 -870.312 0 -1631.9 0 0.06 0 0 -25.8644 0 0 0 0 0 0 0 -2331.69 0 0 -474.792 0 0 0 0 671.941 0 0 634.861 0 488.22 0 0 0 0 0 0 0 1625.8 
1630.38 0 0 -746.864 1820.35 0 0 0 1367.46 0 0 0 0 0 0.04 0 0 0 0 0 0 0 0 0 0 0 0 0 0 0 0 0 0 0 1381.95 104.602 0 0 0 0 0 1778.7 0 0 0 0 
0 0 0 1860.33 0 0 0 710.395 -17.9296 0 0 0 0 0 0 0.08 0 0 1732.76 0 849.712 0 0 0 0 0 0 0 0 0 0 0 0 0 2203.21 885.418 0 0 0 0 0 0 0 0 0 0 
0 0 0 0 0 -42.9548 0 1670.81 0 0 0 0 0 -1167.71 0 0 0.01 0 1052.81 0 0 0 0 0 0 2440.79 0 0 0 0 1533.78 0 -1841.26 0 -44.7859 0 0 -1779.76 0 100.33 0 0 0 0 0 0 
0 0 0 1632.82 743.355 2393.34 0 0 0 -261.01 0 87.817 0 0 0 0 0 0.07 0 0 0 0 0 0 0 0 0 0 0 0 0 0 0 0 0 0 0 -559.633 0 0 17.1667 0 2480.32 0 0 0 
0 0 0 0 -1677.22 -1992.93 0 2487.33 0 0 0 0 0 0 0 -478.912 1065.94 0 0.01 0 0 0 0 0 0 0 0 0 0 0 0 0 0 2436.06 0 0 0 0 -193.869 0 1077.23 0 0 0 0 0 
1653.72 -1991.26 0 0 0 0 0 1217.46 906.934 0 -726.264 2346.95 -127.644 0 0 0 0 0 0 0.02 2394.25 0 -1657.54 0 0 0 1177.79 0 0 0 0 0 -552.309 0 2009.11 0 0 0 0 0 0 0 0 0 0 763.497 
2078.23 0 0 0 -2008.04 390.255 2450.71 1493.65 0 0 0 0 2086.78 0 0 330.287 0 0 0 1701.33 0.08 -2045.58 0 0 0 0 0 0 0 -945.082 0 0 0 0 -2158.19 2312.92 0 0 0 0 0 0 0 0 0 0 
1599.4 -791.116 0 0 2256.77 -2435.45 0 0 0 0 0 -1764.96 953.475 0 0 0 0 0 0 0 697.272 0.08 0 1760.38 0 81.1029 1701.79 0 0 -2044.05 0 0 2431.79 0 -1406.52 0 0 0 0 0 0 2098.83 255.364 1370.2 0 -1896.19 
0 0 2323.6 0 424.894 0 0 0 0 0 0 -1798.07 0 0 0 0 0 0 0 1364.1 0 0 0.04 0 0 0 0 0 0 0 0 -389.34 0 0 0 -908.46 0 0 0 0 1023.67 2154.84 25.8644 0 0 0 
662.328 -1107.29 0 2049.24 0 0 0 0 0 0 0 0 0 0 0 0 0 0 0 0 0 2334.13 0 0.04 -1362.73 0 0 -104.45 0 0 0 369.808 0 0 0 0 0 0 0 0 804.849 0 0 0 0 0 
0 0 0 0 0 2006.67 0 0 0 0 0 0 0 799.203 0 0 0 0 0 0 0 0 0 -2177.42 0.09 0 1130.18 0 547.884 0 2412.41 0 0 0 0 0 995.132 0 0 -1130.48 0 0 0 0 -694.983 0 
-2132.25 -709.937 0 0 0 0 0 0 0 1451.99 1491.36 1957.84 577.181 0 0 0 -979.263 0 0 0 0 1986.07 0 0 0 0.03 0 0 0 0 0 0 -1067.31 2217.55 0 0 0 0 0 0 0 0 0 0 0 0 
0 0 -103.839 0 0 0 0 0 0 1816.08 0 0 0 0 0 0 0 0 0 1590.7 0 -742.897 0 0 1657.69 0 0.03 0 1318.02 0 1562.62 0 0 0 1542.63 0 -1020.62 0 0 0 0 995.285 -1704.84 0 0 0 
0 1184.96 0 0 0 0 0 1066.55 0 0 2477.42 -477.996 0 -583.132 0 0 0 0 0 0 0 0 0 -25.7118 0 0 0 0.08 0 0 136.952 1546.45 0 0 -1016.34 0 0 0 0 0 0 -1319.39 0 0 0 0 
0 0 0 638.829 0 0 0 0 0 0 1857.43 0 0 0 0 0 0 0 0 0 0 0 0 0 -449.919 0 -835.673 0 0.03 1196.86 837.046 0 0 -1170.46 0 -384.61 0 0 0 -27.2378 0 0 0 0 0 0 
0 0 0 0 0 0 0 0 0 0 2134.69 0 0 0 0 0 0 0 0 0 -1292.54 -328.15 0 0 0 0 0 0 2290.34 0 0 488.372 0 0 0 0 0 0 1452.15 -1336.79 2475.28 0 0 0 0 -2448.58 
1123.92 1204.79 676.214 0 0 -2396.24 0 0 0 0 0 0 0 0 0 0 790.048 0 0 0 0 0 0 0 2360.99 0 -3.73852 1591.77 1198.84 0 0.06 0 0 636.54 0 0 0 0 0 0 -540.406 1830.88 0 0 0 0 
-1246.91 0 1475.49 -936.384 0 0 -386.746 0 0 0 0 0 -205.313 0 0 0 0 0 0 0 0 0 1535 2275.84 0 0 0 -172.506 0 1166.95 0 0.01 0 0 0 1643.8 0 0 0 0 -295.495 0 0 0 0 0 
1475.04 0 0 0 211.112 0 -1852.4 0 142.445 0 2171.93 0 0 812.937 0 0 1955.24 0 0 -1891.31 0 -1453.22 0 0 0 2316.43 0 0 0 0 0 0 0.08 0 0 1547.52 0 2178.03 1106.22 0 0 0 0 0 -2076.56 0 
0 0 -1644.41 0 0 2127.06 -1717.81 0 0 0 0 0 0 0 0 0 0 0 -750.832 0 0 0 0 0 0 -373.165 0 0 1478.55 0 688.879 0 0 0.03 0 2494.51 0 -1773.35 0 0 1528.6 0 0 0 0 0 
0 0 0 0 0 -1192.74 2288.81 1290.7 0 1909.01 0 -418.027 -2203.21 0 -2343.9 2488.25 412.076 0 0 -11.9785 1447.11 -187.002 0 0 0 0 1875.44 -1845.84 0 0 0 0 0 0 0.08 0 -48.1429 0 915.326 0 -816.752 0 0 0 0 0 
2316.43 0 -2384.95 0 2292.63 976.363 0 0 0 -1987.59 0 0 0 991.318 -1205.86 762.123 0 0 0 0 493.561 0 1205.1 0 0 0 0 0 -62.0289 0 0 -1523.56 2360.07 -1733.68 0 0.02 0 0 0 1402.4 2199.7 0 0 0 0 0 
0 0 0 -2277.21 0 0 0 0 0 0 1707.59 0 0 0 0 0 0 0 0 0 0 0 0 0 1780.37 0 -1257.44 0 0 0 0 0 0 0 188.528 0 0.08 1413.24 0 0 0 0 0 0 0 0 
-1299.1 0 1426.21 2347.25 1288.57 0 -1329 0 0 0 -1627.48 0 0 245.598 0 0 2140.19 1498.54 0 0 0 0 0 0 0 0 0 0 0 0 0 0 2199.24 1770.61 0 0 1105.3 0.07 0 0 0 0 0 0 0 0 
0 -2129.51 0 936.689 0 0 2303.16 0 0 0 0 0 0 0 0 0 0 0 -1864.91 0 0 0 0 0 0 0 0 0 0 1577.88 0 0 716.803 0 1310.85 0 0 0 0.05 0 1220.51 0 0 0 0 0 
0 0 -2325.89 0 0 0 0 563.601 0 0 545.137 0 0 0 0 0 2345.73 0 0 0 0 0 0 0 1644.11 0 0 0 1277.89 1018.78 0 0 0 0 0 2186.73 0 0 0 0.01 0 0 0 -2398.07 0 0 
0 382.473 0 0 0 0 0 1269.34 0 1712.93 1967.6 0 0 0 0 0 0 2156.06 2140.19 0 0 0 -2010.03 1721.47 0 0 0 0 0 2414.24 -1703.77 -501.038 0 -85.6807 1162.83 671.178 0 0 -825.449 0 0.06 0 0 0 0 183.035 
0 -1768.93 0 0 0 0 0 0 0 0 0 2048.94 0 0 545.137 0 0 0 0 0 0 -263.146 1347.01 0 0 0 -242.393 -539.491 0 0 1880.47 0 0 0 0 0 0 0 0 0 0 0.08 0 0 0 0 
0 0 0 0 0 0 0 0 516.602 0 248.192 860.851 0 0 0 0 0 1931.59 0 0 0 1605.2 148.549 0 0 0 -1999.8 0 0 0 0 0 0 0 0 0 0 0 0 0 0 0 0.02 168.691 -2487.64 0 
0 0 0 -591.678 0 0 0 0 0 -2465.51 0 -293.207 0 0 0 0 0 0 0 0 0 2341.15 0 0 0 0 0 0 0 0 0 0 0 0 0 0 0 0 0 869.243 0 0 -485.473 0.06 0 0 
0 0 0 0 0 0 2020.86 0 0 0 0 0 0 0 0 0 0 0 0 0 0 0 0 0 -2045.88 0 0 0 0 0 0 0 -1152.15 0 0 0 0 0 0 0 0 0 1924.12 0 0.03 0 
0 0 0 0 0 0 0 0 1710.64 0 0 0 0 688.574 0 0 0 0 0 -1330.99 0 171.438 0 0 0 0 0 0 0 84.6126 0 0 0 0 0 0 0 0 0 0 -698.798 0 0 0 0 0.06 
