*Vertices 74
*Matrix 
0.06 0 0 2122.49 0 0 0 0 0 0 0 0 0 0 0 0 0 0 0 0 0 0 0 0 0 0 0 0 0 0 0 0 0 0 0 0 0 0 0 0 0 0 0 2178.79 0 0 0 0 0 0 0 0 0 0 0 0 0 0 0 0 0 0 0 0 0 -2158.35 0 0 0 0 0 -2101.89 0 0 
0 0.01 0 0 682.012 0 2331.39 439.085 0 0 0 0 0 0 0 0 0 0 0 0 0 0 1738.41 0 0 0 0 0 0 0 0 0 0 0 0 0 -1189.54 0 0 0 0 0 0 0 0 0 1523.56 0 0 0 0 0 0 0 0 -1800.21 0 0 0 0 0 0 0 0 0 -2039.32 0 0 0 1952.65 0 0 0 0 
0 0 0.08 0 -1879.71 0 0 0 0 0 0 0 0 0 0 0 264.824 1743.9 0 0 0 0 0 0 0 0 0 0 0 0 0 0 2243.8 0 0 -297.479 0 0 0 0 0 0 0 0 0 0 0 0 0 0 0 0 0 0 0 0 0 0 0 0 -1435.36 1115.99 2250.21 146.26 0 0 2229.3 0 0 0 0 0 423.215 0 
190.817 0 0 0.01 0 0 0 0 0 0 1160.08 0 0 0 0 0 0 0 0 0 0 1984.08 0 0 944.472 0 0 2148.12 0 0 0 0 0 0 0 0 0 0 0 4.65407 -1679.51 0 -1493.5 0 0 0 0 0 0 0 0 0 0 0 0 0 -37.0037 0 0 0 0 0 0 0 1087.6 0 0 0 0 0 0 0 0 0 
0 -369.961 -1434.75 0 0.07 0 0 0 0 0 0 0 0 0 0 0 0 0 0 0 1614.96 0 0 0 2330.62 2326.04 0 0 0 0 0 0 0 2489.62 0 -1383.02 1118.88 0 0 0 0 0 0 2370.6 0 0 0 0 0 0 0 0 0 0 0 0 0 0 0 0 0 0 0 0 0 0 854.442 0 0 0 0 0 0 0 
0 0 0 0 0 0.07 0 0 0 0 0 2098.38 0 0 0 0 -1209.07 0 0 0 0 0 0 0 0 0 1330.07 0 0 0 0 0 0 0 0 0 0 0 0 0 0 0 0 0 0 0 0 0 0 0 0 0 0 0 0 0 0 0 0 0 0 913.953 -1521.73 0 0 0 0 -338.527 0 0 0 0 0 0 
0 -79.577 0 0 0 0 0.09 0 0 0 0 0 0 0 0 0 0 0 0 0 0 2403.87 0 461.669 0 0 0 0 0 0 0 0 0 0 0 0 0 0 0 0 0 0 0 0 0 0 0 0 0 -1112.63 0 0 0 0 0 0 999.405 0 1409.42 0 0 1158.56 0 0 0 0 0 0 1503.42 0 0 0 0 1876.66 
0 2454.07 0 0 0 0 0 0.01 0 0 0 -1721.78 0 0 0 0 0 0 539.338 0 0 0 0 0 0 0 0 0 0 -1328.85 0 -981.246 0 0 0 0 0 0 0 0 0 0 0 0 0 0 0 0 0 1258.35 0 0 0 0 0 0 0 0 0 0 0 0 0 0 0 -1128.04 0 662.175 0 0 0 0 2034.44 0 
0 0 0 0 0 0 0 0 0.02 0 -1396.6 0 0 0 0 0 1143.6 0 504.395 1491.97 0 0 0 0 0 0 0 0 0 0 0 0 1207.39 0 0 0 0 0 0 0 1196.71 0 0 2057.18 0 0 0 0 0 0 0 0 0 1005.97 0 -1116.9 -2135.91 0 0 0 0 0 0 0 0 0 0 0 2016.74 0 0 2029.1 0 0 
0 0 0 0 0 0 0 0 0 0.08 0 -1493.5 0 0 -474.029 0 0 106.281 741.981 0 0 0 0 0 0 0 0 0 0 0 0 0 0 0 0 0 0 0 0 0 0 0 0 0 0 0 0 0 0 1701.03 0 0 0 0 0 0 0 1481.14 0 0 0 0 1683.17 0 0 1699.96 437.101 2406.46 0 0 0 0 0 0 
0 0 0 1298.33 0 0 0 0 1788.31 0 0.09 0 381.252 0 0 0 913.495 0 0 0 297.174 0 0 0 0 0 1799.6 0 0 0 0 924.482 0 0 0 0 1124.84 0 0 0 1015.27 0 0 0 0 0 -266.808 0 110.553 0 0 0 -2279.35 0 0 0 0 0 0 0 0 0 0 0 0 0 0 0 0 0 0 0 0 0 
0 0 0 0 0 -961.409 0 1169.09 0 1470.76 0 0.05 0 0 0 0 0 0 0 0 0 0 0 0 0 -1907.79 0 0 0 0 0 0 0 0 0 0 0 0 0 0 0 0 0 0 0 0 0 0 0 0 0 0 0 0 0 1146.05 0 0 0 0 0 0 490.967 0 0 0 0 0 0 0 0 0 0 0 
0 0 0 0 0 0 0 0 0 0 374.844 0 0.06 -2015.82 0 0 0 0 0 0 0 0 0 0 0 0 0 0 0 0 205.924 0 0 0 0 0 0 0 0 0 464.263 0 0 0 0 0 0 0 0 0 0 0 0 0 1956.92 0 0 818.43 0 1561.56 -2025.89 0 0 0 0 0 0 0 0 1553.32 0 0 2435.15 0 
0 0 0 0 0 0 0 0 0 0 0 0 -1493.96 0.08 0 0 0 0 0 1836.68 0 0 0 0 0 0 1928.69 0 0 0 0 0 0 0 0 0 1144.67 0 0 0 0 -1502.04 0 0 0 0 0 0 -192.038 0 0 0 0 0 0 73.3207 0 0 0 0 0 0 0 0 0 0 0 0 0 0 0 0 0 0 
0 0 0 0 0 0 0 0 0 217.521 0 0 0 0 0.03 0 -1558.66 0 0 0 0 0 0 -1235.01 0 0 0 0 0 0 0 0 0 2393.34 0 0 0 0 774.026 0 0 0 0 0 0 0 0 0 0 0 0 0 0 0 0 0 0 0 0 -41.1237 0 0 0 0 0 0 0 0 0 0 0 1288.11 0 0 
0 0 0 0 0 0 0 0 0 0 0 0 0 0 0 0.05 0 0 0 0 0 0 0 0 0 0 0 0 -1692.48 0 -98.3459 0 0 0 0 0 0 0 0 0 0 0 0 0 0 0 0 0 0 0 0 0 0 0 0 0 1903.21 1166.95 0 0 0 0 -842.082 0 -364.315 0 0 0 0 0 0 0 1165.43 0 
0 0 -1129.87 0 0 32.2733 0 0 2132.56 0 1289.03 0 0 0 2187.64 0 0.01 0 0 0 0 0 0 0 0 0 0 0 0 0 0 1076.46 0 0 0 0 0 0 948.439 0 0 0 0 0 0 -2062.67 1210.75 0 0 0 0 0 -2222.74 0 0 0 0 0 0 0 0 0 0 0 0 0 0 0 0 0 0 0 0 0 
0 0 589.694 0 0 0 0 0 0 2331.69 0 0 0 0 0 0 0 0.03 0 0 0 0 0 1567.81 0 0 -33.4941 0 0 499.969 0 0 0 -621.433 0 0 0 0 1577.43 0 0 0 0 0 0 0 0 0 0 -46.4644 0 0 1961.04 0 0 0 0 0 0 -1808.3 -1895.73 0 -203.482 0 0 0 0 0 0 0 421.232 0 0 0 
0 0 0 0 0 0 0 -65.8437 -131.611 -1252.56 0 0 0 0 0 0 0 0 0.09 0 0 0 0 0 2371.52 0 0 0 0 0 0 0 0 0 0 0 0 0 0 0 0 0 0 0 0 0 0 388.272 0 0 2320.55 0 0 0 0 0 0 0 0 0 0 0 1854.38 0 0 2150.26 0 0 0 0 0 0 0 0 
0 0 0 0 0 0 0 0 -429.472 0 0 0 0 696.203 0 0 0 0 0 0.03 0 0 0 0 0 0 0 0 0 0 0 0 0 0 0 0 0 0 827.433 0 0 1351.44 0 0 578.555 0 0 -1530.27 1482.21 1955.4 0 0 0 0 0 0 1594.52 0 0 -659.581 0 0 0 0 0 0 0 0 0 0 0 0 0 -499.664 
0 0 0 0 1647.92 0 0 0 0 0 2272.79 0 0 0 0 0 0 0 0 0 0.05 0 0 1970.35 0 520.722 0 0 0 0 0 -867.87 0 0 0 0 0 1856.82 0 0 0 0 0 0 2019.79 0 0 0 0 0 0 0 0 0 0 0 0 0 0 0 0 0 0 0 2194.36 0 0 0 0 0 0 0 0 0 
0 0 0 2218.16 0 0 325.251 0 0 0 0 0 0 0 0 0 0 0 0 0 0 0.05 0 0 0 0 0 0 1396.3 0 0 204.398 0 -1931.14 0 0 388.424 1842.17 0 0 0 0 0 0 0 0 0 0 0 0 0 0 0 0 -1095.84 0 0 -858.715 0 -2404.32 0 0 -301.599 1933.12 0 0 0 0 0 0 671.331 0 0 0 
0 855.205 0 0 0 0 0 0 0 0 0 0 0 0 0 0 0 0 0 0 0 0 0.05 0 0 0 1020.31 0 0 0 0 0 0 0 0 0 0 0 0 0 0 0 0 0 0 0 0 0 0 0 0 0 0 0 0 0 0 0 -139.851 0 0 0 0 0 0 0 0 0 0 0 0 0 0 0 
0 0 0 0 0 0 -358.516 0 0 0 0 0 0 0 1134.3 0 0 2304.53 0 0 840.709 0 0 0.01 374.233 0 0 0 0 0 1287.5 0 0 0 0 0 0 0 0 0 0 0 -1749.24 0 0 0 0 0 0 0 0 0 0 0 0 0 0 0 -1108.05 0 0 0 0 501.19 0 0 0 0 0 0 0 1372.04 0 0 
0 0 0 1877.42 -1159.47 0 0 0 0 0 0 0 0 0 0 0 0 0 613.498 0 0 0 0 312.738 0.04 0 0 0 1762.67 1064.1 0 0 0 0 0 0 0 0 0 0 0 0 0 0 0 0 0 0 0 0 0 0 2408.14 0 1361.51 0 0 0 -1173.67 0 0 0 0 0 0 0 0 0 0 0 0 0 -1268.12 0 
0 0 0 0 -2050.92 0 0 0 0 0 0 619.907 0 0 0 0 0 0 0 0 2337.34 0 0 0 0 0.08 0 2372.28 2377.93 0 0 0 0 0 0 0 0 0 0 0 0 2137.9 0 0 0 0 0 0 2494.2 0 0 0 0 1154.74 0 0 -382.015 0 0 0 1742.07 0 920.362 0 0 0 0 0 0 0 0 0 0 0 
0 0 0 0 0 -1310.24 0 0 0 0 -1934.34 0 0 381.863 0 0 0 1557.89 0 0 0 0 -2410.43 0 0 0 0.04 0 0 0 326.319 0 -431.455 0 0 0 0 0 0 0 0 0 0 0 0 0 2024.83 0 0 0 0 2413.33 0 0 0 0 0 82.3237 0 0 0 0 0 0 640.202 0 -1421.63 0 0 0 0 0 0 0 
0 0 0 2001.94 0 0 0 0 0 0 0 0 0 0 0 0 0 0 0 0 0 0 0 0 0 1297.11 0 0.06 0 313.349 0 0 0 0 0 2224.11 -30.5948 0 0 0 0 -575.198 0 0 0 0 0 0 0 0 0 -2202.6 0 0 0 0 77.1355 1339.53 0 0 0 0 0 0 0 0 0 -595.187 0 0 241.935 0 0 0 
0 0 0 0 0 0 0 0 0 0 0 0 0 0 0 -0.686666 0 0 0 0 0 649.663 0 0 -895.642 -1842.02 0 0 0.08 -258.263 0 2053.21 0 0 0 -1450.01 0 0 0 0 1523.56 0 0 2467.19 0 0 0 0 0 0 0 0 0 0 0 0 0 0 0 0 -411.161 0 0 0 0 0 0 0 0 0 0 0 0 0 
0 0 0 0 0 0 0 -28.7637 0 0 0 0 0 0 0 0 0 -2031.85 0 0 0 0 0 0 1105.46 0 0 1160.08 1340.45 0.02 0 51.5 -280.389 -1775.34 0 0 0 0 0 0 0 0 0 0 0 0 1552.1 0 2027.88 0 0 0 0 0 0 0 0 0 0 0 0 0 0 0 0 0 0 0 0 0 -1682.41 0 0 0 
0 0 0 0 0 0 0 0 0 0 0 0 -1528.6 0 0 1141.32 0 0 0 0 0 0 0 -2254.48 0 0 1051.29 0 0 0 0.05 0 0 -350.581 0 0 0 0 0 0 0 1722.54 0 0 -26.4748 0 0 0 1798.23 0 1729.87 0 0 0 0 0 800.729 0 0 0 0 0 0 0 1367.31 0 0 0 0 0 0 0 0 0 
0 0 0 0 0 0 0 -1023.67 0 0 1711.25 0 0 0 0 0 368.13 0 0 0 -1964.25 1105.3 0 0 0 0 0 0 194.937 78.0511 0 0.06 -1318.63 0 0 8.01111 0 0 0 0 0 0 0 -619.449 0 39.2926 1705.3 0 0 0 0 0 0 0 0 0 0 -902.203 1793.34 0 0 0 2353.97 0 1890.09 0 0 2269.28 0 0 0 0 1290.4 0 
0 0 -1214.56 0 0 0 0 0 2436.67 0 0 0 0 0 0 0 0 0 0 0 0 0 0 0 0 0 -1039.99 0 0 1667.61 0 -1539.89 0.04 0 0 0 2045.43 0 0 0 0 0 1327.94 0 0 0 0 0 0 0 0 0 0 0 0 0 0 0 0 0 -873.974 0 -519.044 0 0 0 0 2435.91 0 0 0 0 0 0 
0 0 0 0 803.476 0 0 0 0 0 0 0 0 0 -1304.59 0 0 -2008.35 0 0 0 866.344 0 0 0 0 0 0 0 1605.81 987.655 0 0 0.07 0 0 0 0 0 0 0 0 0 0 0 0 0 0 0 -118.641 0 0 0 2309.26 0 1340.14 0 0 0 0 0 571.078 0 954.39 0 0 -1865.52 0 0 0 0 0 0 0 
0 0 0 0 0 0 0 0 0 0 0 0 0 0 0 0 0 0 0 0 0 0 0 0 0 0 0 0 0 0 0 0 0 0 0 0 0 0 0 0 0 0 0 0 0 0 0 0 0 0 0 0 0 0 0 0 0 0 0 0 0 1327.02 0 0 709.174 0 0 1960.59 0 0 2142.63 0 1596.8 0 
0 0 1760.23 0 -343.562 0 0 0 0 0 0 0 0 0 0 0 0 0 0 0 0 0 0 0 0 0 0 -1803.11 -816.141 0 0 2446.29 0 0 0 0.02 0 0 2429.81 -837.962 0 0 0 662.481 0 0 0 0 0 0 0 2212.82 0 0 0 0 0 0 0 0 0 0 0 0 0 1066.24 0 0 0 0 0 1055.41 0 0 
0 1824.32 0 0 2218.62 0 0 0 0 0 457.701 0 0 1861.09 0 0 0 0 0 0 0 672.094 0 0 0 0 0 -674.688 0 0 0 0 -875.5 0 0 0 0.02 0 0 0 0 0 0 0 0 0 0 0 0 0 0 0 0 0 0 0 254.906 0 0 0 0 -2499.39 -117.267 0 0 0 0 0 0 0 0 0 0 1906.11 
0 0 0 0 0 0 0 0 0 0 0 0 0 0 0 0 0 0 0 0 1452.6 4.50148 0 0 0 0 0 0 0 0 0 0 0 0 0 0 0 0.05 0 0 0 1603.52 0 0 0 0 0 0 -1227.68 0 0 0 0 0 684.606 0 1220.36 0 0 0 0 0 0 0 0 0 0 -1452.3 0 0 0 0 -340.358 0 
0 0 0 0 0 0 0 0 0 0 0 0 0 0 368.435 0 1901.38 -1238.52 0 869.701 0 0 0 0 0 0 0 0 0 0 0 0 0 0 0 -2465.06 0 0 0.04 0 0 879.62 0 0 0 0 0 0 0 0 1079.06 0 0 0 0 0 0 0 0 0 0 0 94.5311 0 0 0 0 0 0 0 0 0 0 0 
0 0 0 2485.2 0 0 0 0 0 0 0 0 0 0 0 0 0 0 0 0 0 0 0 0 0 0 0 0 0 0 0 0 0 0 0 -1616.34 0 0 0 0.01 0 0 0 0 0 0 0 0 0 0 2040.09 0 0 0 0 0 0 0 0 0 0 0 -1003.98 0 0 0 0 0 0 0 0 32.4259 0 0 
0 0 0 668.279 0 0 0 0 1683.17 0 -2278.89 0 -825.297 0 0 0 0 0 0 0 0 0 0 0 0 0 0 0 -2388.3 0 0 0 0 0 0 0 0 0 0 0 0.01 0 0 1046.1 0 0 0 0 217.673 0 0 0 0 0 0 0 0 1651.74 0 0 0 0 0 -330.287 0 0 0 0 821.787 0 0 0 0 0 
0 0 0 0 0 0 0 0 0 0 0 0 0 2212.67 0 0 0 0 0 2209.92 0 0 0 0 0 2447.66 0 -2214.8 0 0 -1131.4 0 0 0 0 0 0 96.3622 -1866.28 0 0 0.08 2190.85 0 0 0 1502.96 0 0 0 0 0 0 0 0 0 0 0 0 0 0 0 0 0 0 0 0 0 0 -1038.47 0 1503.11 0 0 
0 0 0 -375.301 0 0 0 0 0 0 0 0 0 0 0 0 0 0 0 0 0 0 0 -407.193 0 0 0 0 0 0 0 0 1852.55 0 0 0 0 0 0 0 0 614.566 0.09 0 -984.298 259.331 0 0 0 0 0 0 0 0 0 1923.96 0 0 0 0 0 -1094.62 0 370.418 0 0 0 0 0 -1365.78 0 0 0 0 
1604.13 0 0 0 573.061 0 0 0 1340.14 0 0 0 0 0 0 0 0 0 0 0 0 0 0 0 0 0 0 0 -361.263 0 0 -2151.33 0 0 0 -760.445 0 0 0 0 1447.11 0 0 0.05 2390.59 0 0 0 0 359.127 -1685.16 0 0 0 1004.29 0 0 1173.51 0 0 0 0 0 0 0 0 0 0 -241.783 0 0 0 0 0 
0 0 0 0 0 0 0 0 0 0 0 0 0 0 0 0 0 0 0 2133.63 -347.224 0 0 0 0 0 0 0 0 0 1708.96 0 0 0 0 0 0 0 0 0 0 0 425.047 -863.75 0.01 0 0 0 0 0 -2229.45 0 0 0 0 0 0 0 0 0 0 768.99 0 0 0 1391.11 0 0 0 0 0 0 0 0 
0 0 0 0 0 0 0 0 0 0 0 0 0 0 0 0 1148.18 0 0 0 0 0 0 0 0 0 0 0 0 0 0 553.682 0 0 0 0 0 0 0 0 0 0 714.667 0 0 0.06 0 0 0 0 0 0 0 0 1566.44 0 0 0 0 0 0 0 -610.904 0 0 0 0 0 1572.24 -1680.73 0 0 0 0 
0 808.359 0 0 0 0 0 0 0 0 803.781 0 0 0 0 0 1724.07 0 0 0 0 0 0 0 0 0 1160.7 0 0 -1961.65 0 -1197.62 0 0 0 0 0 0 0 0 0 -346.919 0 0 0 0 0.08 0 0 0 0 -1381.95 2096.39 0 0 0 0 0 152.974 0 0 0 0 0 0 0 1103.02 -1872.84 0 0 -157.857 0 0 0 
0 0 0 0 0 0 0 0 0 0 0 0 0 0 0 0 0 0 60.6555 716.498 0 0 0 0 0 0 0 0 0 0 0 0 0 0 0 0 0 0 0 0 0 0 0 0 0 0 0 0.06 0 1179.16 0 0 0 0 0 0 0 0 2273.09 0 0 0 0 0 0 0 0 0 0 0 0 0 0 0 
0 0 0 0 0 0 0 0 0 0 -1790.6 0 0 -1656.16 0 0 0 0 0 1253.47 0 0 0 0 0 -133.29 0 0 0 2398.53 1740.39 0 0 0 0 0 0 2050.77 0 0 -152.058 0 0 0 0 0 0 0 0.09 0 0 0 0 2078.69 0 0 0 0 0 0 0 0 0 0 0 0 0 -1044.27 0 0 0 922.651 0 0 
0 0 0 0 0 0 1227.84 -939.283 0 -90.8689 0 0 0 0 0 0 0 1267.51 0 734.352 0 0 0 0 0 0 0 0 0 0 0 0 0 451.445 0 0 0 0 0 0 0 0 0 719.703 0 0 0 1488.31 0 0.02 0 0 0 0 0 0 0 0 -2136.83 0 0 0 0 0 0 0 0 0 0 0 0 -1528.9 0 0 
0 0 0 0 0 0 0 0 0 0 0 0 0 0 0 0 0 0 -288.324 0 0 0 0 0 0 0 0 0 0 0 1293.15 0 0 0 0 0 0 0 953.932 -224.54 0 0 0 -944.166 1643.96 0 0 0 0 0 0 0 0 0 -405.972 0 0 0 0 0 0 0 0 0 0 0 -1247.98 0 0 0 0 0 892.743 0 
0 0 0 0 0 0 0 0 0 0 0 0 0 0 0 0 0 0 0 0 0 0 0 0 0 0 -994.98 68.2852 0 0 0 0 0 0 0 -701.544 0 0 0 0 0 0 0 0 0 0 -531.098 0 0 0 0 0.03 577.029 2284.23 0 0 0 0 0 0 0 0 0 0 0 0 0 0 0 0 0 0 0 0 
0 0 0 0 0 0 0 0 0 0 1317.87 0 0 0 0 0 -496.46 -881.146 0 0 0 0 0 0 -23.8807 0 0 0 0 0 0 0 0 0 0 0 0 0 0 0 0 0 0 0 0 0 176.931 0 0 0 0 1076.16 0.05 0 811.258 0 0 0 0 0 0 0 0 1235.31 0 0 0 0 0 0 0 0 -371.181 0 
0 0 0 0 0 0 0 0 2463.68 0 0 0 0 0 0 0 0 0 0 0 0 0 0 0 0 2378.38 0 0 0 0 0 0 0 535.066 0 0 0 0 0 0 0 0 0 0 0 0 0 0 2048.17 0 0 864.513 0 0.08 0 0 0 0 0 0 0 0 0 0 0 2026.35 0 0 0 0 0 0 0 0 
0 0 0 0 0 0 0 0 0 0 0 0 -261.925 0 0 0 0 0 0 0 0 852.916 0 0 1606.27 0 0 0 0 0 0 0 0 0 0 0 0 -768.532 0 0 0 0 0 301.904 0 -455.87 0 0 0 0 785.623 0 1537.29 0 0.02 0 0 0 0 0 -1947.61 0 0 0 0 0 0 0 0 0 -219.657 0 0 0 
0 2451.17 0 0 0 0 0 0 1493.65 0 0 781.35 0 -808.969 0 0 0 0 0 0 0 0 0 0 0 0 0 0 0 0 0 0 0 -300.073 0 0 0 0 0 0 0 0 2392.42 0 0 0 0 0 0 0 0 0 0 0 0 0.02 0 0 2205.95 315.638 0 0 0 0 0 0 0 0 0 0 -1703.92 0 0 0 
0 0 0 -1620.3 0 0 744.423 0 2034.29 0 0 0 0 0 0 -2463.53 0 0 0 -175.253 0 0 0 0 0 957.9 0 198.447 0 0 -2134.24 0 0 0 0 0 2117.15 -1532.87 0 0 0 0 0 0 0 0 0 0 0 0 0 0 0 0 0 0 0.09 0 1167.1 0 0 902.051 660.039 0 0 0 454.65 0 0 0 0 0 0 0 
0 0 0 0 0 0 0 0 0 2348.78 0 0 824.229 0 0 831.095 0 0 0 0 0 1204.95 0 0 0 0 1964.4 -993.759 0 0 0 936.842 0 0 0 0 0 0 0 0 -295.19 0 0 1298.18 0 0 0 0 0 0 0 0 0 0 0 0 0 0.06 0 301.447 0 0 0 0 0 0 -1862.47 0 0 0 0 0 0 0 
0 0 0 0 0 0 -588.778 0 0 0 0 0 0 0 0 0 0 0 0 0 0 0 -882.519 2471.62 1152.76 0 0 0 0 0 0 -1062.73 0 0 0 0 0 0 0 0 0 0 0 0 0 0 843.608 -844.829 0 2395.32 0 0 0 0 0 2155.9 -1947 0 0 0 0 0 0 0 0 0 0 0 0 0 0 1908.4 0 1986.53 
0 0 0 0 0 0 0 0 0 0 0 0 -1152.61 0 -2046.04 0 0 832.774 0 -1298.18 0 1965.62 0 0 0 0 0 0 0 0 0 0 0 0 0 0 0 0 0 0 0 0 0 0 0 0 0 0 0 0 0 0 0 0 0 662.481 0 -1989.27 0 0.06 800.424 2331.08 0 0 1566.9 0 0 0 778.298 0 0 0 0 0 
0 0 705.969 0 0 0 0 0 0 0 0 0 2051.99 0 0 0 0 1669.29 0 0 0 0 0 0 0 2290.8 0 0 261.62 0 0 0 2204.58 0 0 0 0 0 0 0 0 0 0 0 0 0 0 0 0 0 0 0 0 0 -656.529 0 0 0 0 615.329 0 0 0 0 2286.83 0 0 0 0 0 0 0 0 0 
0 0 1130.33 0 0 1359.83 -2462.46 0 0 0 0 0 0 0 0 0 0 0 0 0 0 0 0 0 0 0 0 0 0 0 0 0 0 1944.56 727.79 0 1788.92 0 0 0 0 0 -707.19 0 -1601.99 0 0 0 0 0 0 0 0 0 0 0 -939.741 0 0 -903.424 0 0.06 0 0 0 0 0 0 0 0 2394.71 0 0 -373.318 
0 0 978.652 0 0 -1414.91 0 0 0 1815.32 0 1347.32 0 0 0 -1956.92 0 1165.88 -46.9222 0 0 2390.9 0 0 0 1703.47 0 0 0 0 0 1262.93 1242.79 0 0 0 -163.656 0 -2044.21 -101.245 0 0 0 0 0 2485.35 0 0 0 0 0 0 0 0 0 0 36.8511 0 0 0 0 0 0.09 -447.935 0 0 0 0 0 0 0 2275.99 0 -2179.25 
0 0 2367.85 0 0 0 0 0 0 0 0 0 0 0 0 0 0 0 0 0 0 197.531 0 -891.827 0 0 0 0 0 0 0 0 0 335.322 0 0 0 0 0 0 -134.053 0 246.055 0 0 0 0 0 0 0 0 0 -188.833 0 0 0 0 0 0 0 0 0 229.118 0.02 0 0 0 0 0 0 0 0 0 1462.98 
0 0 0 -364.162 0 0 0 0 0 0 0 0 0 0 0 -1340.75 0 0 0 0 1775.49 0 0 0 0 0 1150.62 0 0 0 -277.032 129.322 0 0 -557.344 0 0 0 0 0 0 0 0 0 0 0 0 0 0 0 0 0 0 0 0 0 0 0 0 -666.601 -307.398 0 0 0 0 0 0 0 1605.04 0 588.015 665.685 0 0 
-946.15 897.168 0 0 0 0 0 2071.21 0 -242.393 0 0 0 0 0 0 0 0 -741.371 0 0 0 0 0 0 0 0 0 0 0 0 0 0 0 0 -840.556 0 0 0 0 0 0 0 0 1167.56 0 0 0 0 0 0 0 0 2273.25 0 0 0 0 0 0 0 0 0 0 0 0.05 0 0 0 0 0 0 0 0 
0 0 -415.738 0 -202.567 0 0 0 0 1642.58 0 0 0 0 0 0 0 0 0 0 0 0 0 0 0 0 38.377 0 0 0 0 0 0 1925.34 0 0 0 0 0 0 0 0 0 0 0 0 -1746.04 0 0 0 317.927 0 0 0 0 0 941.267 2264.4 0 0 0 0 0 0 0 0 0 0 0 0 2180.32 0 0 0 
0 0 0 0 0 854.442 0 -2062.52 0 -98.9563 0 0 0 0 0 0 0 0 0 0 0 0 0 0 0 0 0 545.289 0 0 0 37.4615 2165.82 0 749.153 0 0 119.861 0 0 0 0 0 0 0 0 -663.701 0 -190.512 0 0 0 0 0 0 0 0 0 0 0 0 0 0 0 0 0 0 0.03 0 0 0 0 0 0 
0 0 0 0 0 0 -2173.3 0 886.639 0 0 0 0 0 0 0 0 0 0 0 0 0 0 0 0 0 0 0 0 0 0 0 0 0 0 0 0 0 0 0 2102.8 0 0 901.135 0 688.574 0 0 0 0 0 0 0 0 0 0 0 0 0 1846.14 0 0 0 0 90.7163 0 0 0 0.07 0 0 0 0 0 
0 31.0526 0 0 0 0 0 0 0 0 0 0 -1256.83 0 0 0 0 0 0 0 0 0 0 0 0 0 0 0 0 0 0 0 0 0 0 0 0 0 0 0 0 -1292.99 2288.05 0 0 2041.46 0 0 0 0 0 0 0 0 0 0 0 0 0 0 0 0 0 0 0 0 0 0 0 0.02 0 0 0 0 
0 0 0 0 0 0 0 0 0 0 0 0 0 0 0 0 0 2334.59 0 0 0 1759.32 0 0 0 0 0 1151.23 0 -2016.59 0 0 0 0 -1367.61 0 0 0 0 0 0 0 0 0 0 0 516.449 0 0 0 0 0 0 0 -41.2763 141.377 0 0 0 0 0 -1769.84 0 0 1251.79 0 159.841 0 0 0 0.04 0 0 0 
319.91 0 0 0 0 0 0 0 1313.75 0 0 0 0 0 2348.78 0 0 0 0 0 0 0 0 -1635.11 0 0 0 0 0 0 0 0 0 0 0 1220.66 0 0 0 1269.65 0 1736.58 0 0 0 0 0 0 -880.23 688.421 0 0 0 0 0 0 0 0 1790.29 0 0 0 -1782.97 0 2272.03 0 0 0 0 0 0 0 0 0 
0 0 1216.24 0 0 0 0 -1759.62 0 0 0 0 299.005 0 0 1907.03 0 0 0 0 0 0 0 0 -964.919 0 0 0 0 0 0 1077.84 0 0 -424.589 0 0 200.888 0 0 0 0 0 0 0 0 0 0 0 0 1111.41 0 461.211 0 0 0 0 0 0 0 0 0 0 0 0 0 0 0 0 0 0 0 0.01 -545.137 
0 0 0 0 0 0 -2221.67 0 0 0 0 0 0 0 0 0 0 0 0 2177.11 0 0 0 0 0 0 0 0 0 0 0 0 0 0 0 0 1337.55 0 0 0 0 0 0 0 0 0 0 0 0 0 0 0 0 0 0 0 0 0 949.66 0 0 851.848 -1422.54 444.884 0 0 0 0 0 0 0 0 98.6511 0.05 
