*Vertices 57
*Matrix 
0.05 0 1115.83 0 0 0 0 0 422.605 -371.639 0 0 0 2252.95 0 0 0 0 0 0 0 0 2019.94 106.586 0 0 -1173.36 0 555.513 0 0 0 0 2188.25 1880.17 0 0 0 0 -1346.1 0 0 -967.971 0 0 0 0 0 0 0 2182.91 0 0 0 0 0 0 
0 0.05 0 751.747 10.7578 0 0 -1296.96 0 1721.32 1958.75 2280.11 0 0 0 0 0 0 0 0 0 0 0 0 0 0 0 0 0 0 0 0 0 0 0 -2458.19 0 0 0 0 0 0 2323.6 0 0 0 924.482 0 0 621.433 485.626 0 2489.78 0 0 0 0 
-846.355 0 0.09 0 -2393.64 0 2067.55 1002.46 0 0 0 0 228.813 0 0 0 0 0 -504.547 0 541.017 0 0 53.3311 45.0911 1291.31 0 0 0 0 0 0 0 0 0 0 -410.398 0 0 0 0 0 0 0 0 0 0 0 0 0 0 0 0 0 -697.882 0 0 
0 -756.172 0 0.07 0 0 -1371.12 2016.43 0 0 0 1282.62 0 671.026 0 0 -832.621 0 1316.95 -1280.63 0 0 0 0 0 1217.46 0 0 0 0 0 0 710.852 0 0 0 0 1365.78 0 0 0 2493.74 0 0 0 0 0 0 0 0 0 0 132.221 0 0 0 0 
0 2391.2 2481.84 0 0.09 0 0 0 0 0 0 0 0 0 0 0 0 0 0 0 0 -226.371 0 0 0 0 0 0 0 0 0 0 -1546.75 0 0 0 2432.4 0 -946.15 0 801.798 0 0 0 0 0 0 0 0 0 0 0 0 0 0 0 0 
0 0 0 0 0 0.09 0 0 0 881.146 0 -1839.12 0 -924.024 986.892 0 2387.23 -1088.82 0 -562.532 0 0 437.407 0 2134.85 0 0 1588.41 0 0 0 0 0 0 0 0 0 0 0 504.395 0 0 0 0 0 0 0 0 2266.53 0 0 1194.27 -1339.84 79.7296 0 0 0 
0 0 2051.23 1036.94 0 0 0.04 0 0 0 1548.89 0 0 0 0 2304.38 2379.6 0 0 0 0 -326.319 0 0 0 0 0 0 0 0 0 0 0 0 2302.7 0 0 0 0 0 0 0 0 0 0 0 0 0 61.4185 0 0 0 0 0 0 0 525.605 
0 1664.71 -216.91 689.489 0 0 0 0.04 0 -734.352 -283.135 0 0 0 0 0 0 0 909.528 372.86 0 0 0 1658.76 -929.67 0 0 0 0 0 0 0 0 0 0 2269.13 0 0 0 0 0 1517.3 0 0 0 872.295 0 0 0 0 0 0 0 0 0 0 0 
436.796 0 0 0 0 0 0 0 0.09 1311.91 -487.152 0 0 0 2452.85 0 0 0 1975.84 0 0 2498.17 159.993 0 0 2056.26 0 0 0 0 0 -1222.34 0 0 0 0 0 -371.334 0 0 0 0 0 0 172.353 0 0 1176.11 0 2460.48 0 0 0 0 0 0 0 
-45.2437 1099.2 0 0 0 -1979.66 0 -1553.01 2415.16 0.01 0 0 0 0 0 -2364.04 2208.85 0 0 0 0 0 0 0 0 0 537.202 0 0 0 0 696.051 0 0 0 0 0 0 0 0 0 0 0 -586.795 1336.79 0 0 0 -121.54 0 0 0 0 0 0 0 0 
0 -2253.56 0 0 0 0 155.11 1728.19 623.264 0 0 -141.072 0 0 1634.34 215.69 2388 0 0 -178.762 -1980.73 0 0 0 0 2106.77 0 0 0 0 -492.34 0 0 346.767 0 0 0 0 0 0 0 -1541.57 0 0 0 0 0 0 0 -127.949 0 0 0 0 0 0 0 
0 -346.919 0 2179.1 0 -1145.89 0 0 0 0 321.741 0.01 0 0 0 0 -494.629 0 0 1883.68 0 925.398 1141.32 0 1519.44 0 0 0 0 2167.81 0 0 0 0 0 -807.749 0 0 0 0 0 0 0 0 1714.45 0 0 0 1081.65 -1187.86 0 0 0 0 0 0 0 
0 0 1839.73 0 0 0 0 0 0 0 0 0 0.07 0 1975.23 0 2238.46 0 182.424 0 0 0 0 0 0 0 0 0 0 0 1849.5 0 0 0 0 0 0 0 0 0 0 0 0 0 0 0 1189.08 0 0 0 0 -906.629 1242.79 0 0 0 0 
1454.13 0 0 746.101 0 241.783 0 0 0 0 0 0 0 0.04 2362.97 2395.17 0 2193.9 -282.372 0 1635.56 0 1126.67 0 0 0 0 0 0 0 0 0 -461.974 0 0 0 0 0 0 0 0 0 0 0 0 0 0 0 0 0 0 0 0 0 0 0 0 
0 0 0 0 0 1502.2 0 0 -2450.1 0 667.974 0 -2151.94 414.212 0.03 0 0 0 -7.40074 1671.88 -63.4022 0 0 1961.2 2344.51 450.987 0 0 0 0 0 0 0 0 0 0 0 0 0 0 0 0 0 913.495 0 0 0 0 0 -2303.16 0 -1941.21 0 2243.19 0 0 0 
0 0 0 0 0 0 2466.73 0 0 -1532.11 2347.71 0 0 1115.22 0 0.06 0 0 0 0 0 0 2001.79 0 858.562 0 0 0 0 0 0 0 0 0 0 0 0 0 0 0 0 0 0 0 0 0 0 0 0 0 0 0 0 0 0 0 0 
0 0 0 906.476 0 938.063 834.605 0 0 2318.87 1583.38 188.681 -217.673 0 0 0 0 0 0 0 0 -1637.09 0 0 0 0 0 0 -806.833 0 0 1096 0 0 0 0 0 0 2038.71 0 0 0 0 0 0 0 0 0 0 0 0 0 0 -2324.06 0 0 0 
0 0 0 0 0 288.934 0 0 0 0 0 0 0 438.322 0 0 0 0.01 0 0 0 0 2308.8 0 0 0 0 0 2010.79 0 0 0 0 0 0 0 0 0 0 0 0 0 0 0 0 0 0 0 0 0 -1305.35 0 0 0 -1405 0 1849.65 
0 0 1009.32 -550.325 0 0 0 756.63 1414.15 0 0 0 1768.62 881.298 -2376.25 0 0 0 0.01 1057.08 0 0 0 0 881.909 0 0 1690.5 0 0 0 0 0 0 0 0 0 0 0 -88.2748 0 0 0 0 0 -919.752 0 0 0 0 2488.71 0 0 -1038.77 0 -2397.61 0 
0 0 0 844.676 0 1432.92 0 600.986 0 0 1459.17 335.17 0 0 614.566 0 0 0 776.009 0.04 0 0 0 739.235 0 0 0 224.387 0 0 681.707 0 0 0 0 0 0 0 0 0 0 0 0 0 0 0 0 0 0 0 0 1211.51 0 1009.48 0 0 0 
0 0 -1251.49 0 0 0 0 0 0 0 2445.22 0 0 -22.0496 1726.2 0 0 0 0 0 0.05 2321.62 0 0 0 0 0 0 0 0 0 0 0 0 0 0 0 0 0 0 0 0 -693.304 0 0 0 0 0 0 0 0 844.523 0 0 0 0 0 
0 0 0 0 761.666 0 953.932 0 1521.88 0 0 48.7533 0 0 0 0 -463.195 0 0 0 1450.32 0.02 -1270.26 0 0 818.583 0 0 0 0 0 -1917.71 0 0 0 707.343 0 0 0 0 0 0 0 -52.7207 0 0 0 0 0 0 0 0 2218.77 977.584 0 0 0 
2372.59 0 0 0 0 1170.77 0 0 976.821 0 0 -1868.88 0 312.738 0 -872.143 0 1769.08 0 0 0 583.132 0.07 0 0 0 0 0 0 0 0 0 0 0 0 0 0 0 0 0 0 0 0 0 0 0 0 0 0 0 2285.45 0 -941.878 0 0 1663.79 0 
-985.061 0 1773.51 0 0 0 0 1586.43 0 0 0 0 0 0 1065.94 0 0 0 0 1103.93 0 0 0 0.03 367.977 0 0 0 0 0 0 0 0 0 0 0 -1981.19 0 0 0 0 0 0 0 0 0 0 0 -1900.16 0 0 0 0 0 0 0 0 
0 0 236.29 0 0 45.8541 0 459.99 0 0 0 2083.57 0 0 2115.31 526.978 0 0 1583.99 0 0 0 0 1799.6 0.03 0 0 0 0 0 -1460.69 0 0 0 0 0 1166.04 -46.7696 0 0 0 0 0 -2124.01 0 0 0 0 1324.58 0 0 0 -1732.31 0 -1955.4 2204.28 0 
0 0 843.913 -1170.31 0 0 0 0 2377.93 0 -2249.9 0 0 0 2302.85 0 0 0 0 0 0 1867.5 0 0 0 0.07 0 0 0 0 0 0 0 0 0 0 0 0 0 0 0 0 -355.312 0 493.866 0 -1428.65 -179.678 0 0 0 964.461 0 0 -151.601 0 0 
629.521 0 0 0 0 0 0 0 0 420.927 0 0 0 0 0 0 0 0 0 0 0 0 0 0 0 0 0.01 0 0 0 0 0 0 0 0 1384.85 0 0 0 0 0 0 1158.86 0 -563.601 0 110.096 0 0 0 0 0 0 0 0 0 0 
0 0 0 0 0 2303.92 0 0 0 0 0 0 0 0 0 0 0 0 1970.81 441.069 0 0 0 0 0 0 0 0.09 0 0 0 0 2316.89 0 -2032.91 0 0 0 0 -2245.02 0 0 0 0 0 0 0 1924.27 0 0 -2099.14 0 0 0 0 0 0 
978.195 0 0 0 0 0 0 0 0 0 0 0 0 0 0 0 -78.5089 1646.24 0 0 0 0 0 0 0 0 0 0 0.01 2279.5 0 0 0 -938.52 0 0 0 0 1100.57 0 0 0 0 0 0 -791.116 1717.05 0 0 0 0 -1951.28 0 0 0 0 0 
0 0 0 0 0 0 0 0 0 0 0 1725.75 0 0 0 0 0 0 0 0 0 0 0 0 0 0 0 0 678.198 0.04 0 2256.16 0 -1663.03 0 0 0 0 0 0 0 0 0 0 0 1383.18 0 0 0 0 -2021.77 0 0 0 955.306 0 0 
0 0 0 0 0 0 0 0 0 0 -1869.33 0 1900.46 0 0 0 0 0 0 1999.34 0 0 0 0 1264.15 0 0 0 0 0 0.07 0 0 0 0 0 0 0 0 0 1697.67 0 0 0 0 0 0 0 0 0 -1630.38 0 0 -711.615 0 0 0 
0 0 0 0 0 0 0 0 476.928 2202.75 0 0 0 0 0 0 743.66 0 0 0 0 674.23 0 0 0 0 0 0 0 1374.63 0 0.02 0 0 0 0 2415.31 0 0 0 0 0 0 0 1639.53 2044.66 0 0 0 0 0 0 0 0 0 0 0 
0 0 0 -234.458 1657.69 0 0 0 0 0 0 0 0 -1433.99 0 0 0 0 0 0 0 0 0 0 0 0 0 263.298 0 0 0 0 0.06 0 0 0 0 0 0 0 0 1326.41 0 0 476.623 0 0 0 0 0 0 0 0 0 0 1332.21 0 
1444.06 0 0 0 0 0 0 0 0 0 1390.5 0 0 0 0 0 0 0 0 0 0 0 0 0 0 0 0 0 -1422.09 1716.13 0 0 0 0.07 916.547 0 0 0 0 0 0 0 0 0 0 0 0 0 -1901.23 0 0 0 0 0 0 0 0 
-1572.54 0 0 0 0 0 2266.84 0 0 0 0 0 0 0 0 0 0 0 0 0 0 0 0 0 0 0 0 1781.29 0 0 0 0 0 -593.661 0.04 0 0 0 0 0 0 0 0 0 0 -812.021 0 1638.46 -1064.41 0 0 0 0 1621.22 0 0 0 
0 1417.2 0 0 0 0 0 1709.57 0 0 0 -491.882 0 0 0 0 0 0 0 0 0 -1526.31 0 0 0 0 2113.94 0 0 0 0 0 0 0 0 0.01 0 0 1522.19 0 -683.691 1542.48 0 0 0 0 0 0 0 0 0 0 0 0 0 0 0 
0 0 1656.93 0 -1814.1 0 0 0 0 0 0 0 0 0 0 0 0 0 0 0 0 0 0 1788.16 1798.07 0 0 0 0 0 0 333.644 0 0 0 0 0.08 0 0 0 0 0 -1012.38 0 0 0 0 0 0 0 0 0 0 0 0 0 0 
0 0 0 783.792 0 0 0 0 -1290.86 0 0 0 0 0 0 0 0 0 0 0 0 0 0 0 2489.47 0 0 0 0 0 0 0 0 0 0 0 0 0.05 0 748.085 0 0 0 0 0 0 2430.57 0 0 0 0 0 0 0 0 0 0 
0 0 0 0 1678.59 0 0 0 0 0 0 0 0 0 0 0 -912.427 0 0 0 0 0 0 0 0 0 0 0 709.632 0 0 0 0 0 0 -140.004 0 0 0.09 0 597.324 0 0 0 0 0 0 0 79.2718 0 0 2240.29 0 0 0 0 0 
880.383 0 0 0 0 200.125 0 0 0 0 0 0 0 0 0 0 0 0 -256.737 0 0 0 0 0 0 0 0 865.429 0 0 0 0 0 0 0 0 0 1227.99 0 0.02 0 0 0 0 0 0 0 0 0 0 0 0 0 0 0 0 -2263.48 
0 0 0 0 1658.45 0 0 0 0 0 0 0 0 0 0 0 0 0 0 0 0 0 0 0 0 0 0 0 0 0 851.085 0 0 0 0 1798.23 0 0 -1412.02 0 0.09 0 2362.51 0 0 2222.89 1142.08 0 0 843.455 0 1748.63 0 0 0 0 0 
0 0 0 968.886 0 0 0 1851.94 0 0 1329.77 0 0 0 0 0 0 0 0 0 0 0 0 0 0 0 0 0 0 0 0 0 -2062.06 0 0 188.833 0 0 0 0 0 0 0 0 0 0 200.43 0 0 0 0 0 0 0 0 0 0 
-1108.51 1394.01 0 0 0 0 0 0 0 0 0 0 0 0 0 0 0 0 0 0 420.621 0 0 0 0 404.599 801.798 0 0 0 0 0 0 0 0 0 648.747 0 0 0 120.472 0 0.06 0 0 0 0 0 0 0 0 0 2414.4 0 0 0 0 
0 0 0 0 0 0 0 0 0 2158.5 0 0 0 0 2307.12 0 0 0 0 0 0 2292.78 0 0 1007.64 0 0 0 0 0 0 0 0 0 0 0 0 0 0 0 0 0 0 0.07 0 0 0 0 0 0 0 0 0 0 1913.28 -259.636 0 
0 0 0 0 0 0 0 0 502.564 396.512 0 1886.27 0 0 0 0 0 0 0 0 0 0 0 0 0 648.747 2500 0 0 0 0 -2020.4 -935.774 0 0 0 0 0 0 0 0 0 0 0 0.04 0 0 0 0 0 0 1728.49 0 0 0 0 2476.5 
0 0 0 0 0 0 0 2444.15 0 0 0 0 0 0 0 0 0 0 2024.52 0 0 0 0 0 0 0 0 0 -1623.2 2318.72 0 1361.51 0 0 -1729.87 0 0 0 0 0 576.571 0 0 0 0 0.05 0 0 0 0 0 0 0 0 0 0 0 
0 -1050.37 0 0 0 0 0 0 0 0 0 0 875.5 0 0 0 0 0 0 0 0 0 0 0 0 -944.624 1308.71 0 -978.5 0 0 0 0 0 0 0 0 1456.72 0 0 307.092 2356.26 0 0 0 0 0.06 2351.37 1572.08 0 304.956 0 0 0 0 0 0 
0 0 0 0 0 0 0 0 2309.26 0 0 0 0 0 0 0 0 0 0 0 0 0 0 0 0 -373.165 0 521.18 0 0 0 0 0 0 -2011.7 0 0 0 0 0 0 0 0 0 0 0 1176.26 0.07 0 301.294 0 0 0 0 0 0 0 
0 0 0 0 0 439.848 -938.978 0 0 2061.45 0 2154.99 0 0 0 0 0 0 0 0 0 0 0 -277.337 -761.666 0 0 0 0 0 0 0 0 -96.5148 586.184 0 0 0 -96.2096 0 0 0 0 0 0 0 -1764.81 0 0.04 0 0 0 0 0 0 0 0 
0 1465.42 0 0 0 0 0 0 168.538 0 1147.42 285.424 0 0 2304.07 0 0 0 0 0 0 0 0 0 0 0 0 0 0 0 0 0 0 0 0 0 0 0 0 0 2461.39 0 0 0 0 0 0 -501.953 0 0.08 0 -2150.56 0 0 1139.94 0 0 
-306.635 2008.96 0 0 0 0 0 0 0 0 0 0 0 0 0 0 0 -876.568 1344.26 0 0 0 718.329 0 0 0 0 2198.48 0 1916.49 973.922 0 0 0 0 0 0 0 0 0 0 0 0 0 0 0 1242.33 0 0 0 0.04 0 0 0 0 -948.592 0 
0 0 0 0 0 -380.032 0 0 0 0 0 0 1831.8 0 -1628.85 0 0 0 0 2395.47 -394.681 0 0 0 0 1193.96 0 0 258.568 0 0 0 0 0 0 0 0 0 1949.45 0 -1395.99 0 0 0 2353.66 0 0 0 0 -775.246 0 0 0 0 0 1886.88 0 
0 996.811 0 -686.59 0 171.133 0 0 0 0 0 0 1878.8 0 0 0 0 0 0 0 0 -454.192 -2171.77 0 2285.76 0 0 0 0 0 0 0 0 0 0 0 0 0 0 0 0 0 1447.11 0 0 0 0 0 0 0 0 0 0.04 0 0 0 0 
0 0 0 0 0 -275.201 0 0 0 0 0 0 0 0 608.31 0 -1795.48 0 2062.36 2498.02 0 -850.169 0 0 0 0 0 0 0 0 369.503 0 0 0 -507.904 0 0 0 0 0 0 0 0 0 0 0 0 0 0 0 0 0 0 0.09 0 0 0 
0 0 1256.37 0 0 0 0 0 0 0 0 0 0 0 0 0 0 2348.17 0 0 0 0 0 0 1502.04 -213.248 0 0 0 -2333.67 0 0 0 0 0 0 0 0 0 0 0 0 0 543.611 0 0 0 0 0 -2017.04 0 0 0 0 0.08 0 0 
0 0 0 0 0 0 0 0 0 0 0 0 0 0 0 0 0 0 -41.2763 0 0 0 1457.03 0 1690.04 0 0 0 0 0 0 0 -223.167 0 0 0 0 0 0 0 0 0 0 -1117.05 0 0 0 0 0 0 -1226.46 1911.45 0 0 0 0.01 0 
0 0 0 0 0 0 1179.92 0 0 0 0 0 0 0 0 0 0 -566.805 0 0 0 0 0 0 0 0 0 0 0 0 0 0 0 0 0 0 0 0 0 -1786.17 0 0 0 0 1895.12 0 0 0 0 0 0 0 0 0 0 0 0.06 
