*Vertices 61
*Matrix 
0.01 2106.77 2207.48 0 -1620.91 0 0 0 0 0 0 2104.33 0 0 0 0 0 0 0 1581.7 0 0 0 0 0 0 0 2395.02 0 0 0 0 -2362.06 -1845.84 0 1992.02 -272.759 2085.56 -2010.79 0 0 26.4748 0 0 2425.69 0 -2232.35 0 -1807.08 0 0 0 0 0 0 314.57 0 0 0 -658.666 0 
561.769 0.05 -538.728 0 0 0 0 -583.895 0 0 0 1403.62 0 0 0 -11.8259 0 -2011.55 0 0 0 0 0 0 -385.067 0 0 -2475.74 0 0 0 0 0 0 -416.807 0 1567.96 0 0 1242.94 0 0 0 0 0 0 0 0 -1405.61 1411.86 0 2079.15 0 0 0 0 2342.52 0 0 1884.9 0 
1128.5 1940.14 0.08 0 0 0 0 0 0 0 -1401.03 1145.44 0 0 0 0 0 0 0 0 2274.93 -2457.88 2431.18 2051.38 0 -1434.29 0 0 0 0 -2072.13 2179.25 0 955 0 0 0 0 0 0 0 581.759 -2103.72 1520.97 0 0 0 -1791.67 0 0 0 -246.666 0 0 2008.04 1977.37 0 -315.027 0 0 0 
0 0 0 0.05 0 0 0 0 -154.195 -391.934 0 0 0 0 1986.53 0 0 0 259.636 0 -1596.65 0 0 -228.965 0 0 0 0 171.133 0 0 -2467.35 0 2035.51 0 0 0 -707.19 0 0 0 0 0 0 0 2054.12 -1235.92 0 0 0 196.921 0 0 0 0 0 1483.43 -1763.59 -671.941 0 0 
2297.66 0 0 0 0.09 0 0 0 1358 0 2422.64 0 0 0 0 0 0 0 0 1552.25 1594.82 0 0 0 0 0 -1100.57 0 0 0 0 0 0 1474.58 -1949.9 -2317.5 0 304.804 0 0 0 0 0 0 367.061 -1203.12 0 0 0 2379.76 0 0 0 0 0 0 -550.02 0 1516.85 0 -1806.01 
0 0 0 0 0 0.05 0 0 -1883.83 0 0 0 -392.087 0 653.935 1313.14 646.153 358.058 0 0 0 0 0 1812.57 675.909 0 0 -870.464 0 0 -2363.28 -1578.49 0 0 0 0 1880.93 0 0 0 0 0 0 0 0 308.771 0 0 0 0 -361.263 0 -2259.51 0 0 0 175.71 2338.4 0 0 0 
0 0 0 0 0 0 0.07 -1285.52 0 -2011.55 0 -567.11 0 -253.075 0 0 0 0 0 0 1760.38 188.223 0 0 0 2248.83 0 0 282.372 0 0 0 0 0 0 0 1247.83 -1831.03 0 0 0 -858.257 0 0 0 0 0 -2047.26 2284.84 1846.9 0 -493.866 0 0 1397.98 0 0 0 0 0 -811.563 
0 -1274.07 0 0 0 0 1863.08 0.04 -416.044 0 0 1279.56 0 0 0 0 0 0 0 0 -601.901 0 0 0 0 -2364.96 0 0 0 0 0 0 524.995 0 0 0 0 0 -2089.22 2122.03 0 0 0 0 0 0 0 0 -1697.67 0 0 1237.14 0 0 1805.25 0 0 0 2486.88 0 174.337 
0 0 0 2490.39 477.691 1579.56 0 297.784 0.08 0 0 0 0 877.026 0 1612.52 0 -1042.13 0 0 1289.64 0 0 1051.9 -249.718 0 -631.047 0 0 1809.82 2419.13 0 0 699.255 0 0 0 0 0 1467.25 0 0 0 -1338.47 0 0 0 0 0 0 0 0 0 0 0 -622.806 0 0 0 0 -1992.48 
0 0 0 -1712.78 0 0 206.534 0 0 0.08 0 0 0 0 0 1262.17 0 2295.37 -815.226 0 1180.99 0 0 0 0 -71.0318 0 0 0 220.573 0 0 1897.26 0 0 0 -290.307 0 0 0 0 0 0 0 0 0 0 1303.98 0 0 -2043.29 0 0 0 0 0 0 0 0 0 0 
0 0 2009.11 0 934.706 0 0 0 0 0 0.07 0 0 0 0 0 0 -127.338 0 0 0 0 0 0 0 0 2089.22 0 0 1726.05 0 0 0 1873.61 1302.76 0 0 -563.753 977.126 0 0 0 0 0 0 -1810.13 0 0 0 0 0 1427.43 1633.12 -1091.11 0 0 766.243 0 -1003.83 0 0 
205.771 -414.06 -2030.93 0 0 0 2234.49 -1103.47 0 0 0 0.09 0 0 0 0 0 1341.21 0 0 0 0 1834.09 0 -2285.91 0 434.965 0 0 0 0 0 -856.273 0 624.943 0 62.3341 0 -2010.33 1241.87 0 0 0 -1432.62 0 446.104 0 0 2169.48 48.1429 0 0 1845.84 0 -1689.12 0 0 0 0 0 0 
0 0 0 0 0 -306.024 0 0 0 0 0 0 0.03 0 1502.04 1474.43 0 0 1487.09 0 2219.69 0 0 -2486.72 0 0 0 0 0 0 0 0 0 1550.87 0 0 0 -253.533 0 0 0 0 970.565 0 -1529.51 0 0 0 0 -899.762 0 0 0 0 2393.49 0 0 0 0 0 0 
0 0 0 0 0 0 1152.3 0 -224.54 0 0 0 0 0.01 -1228.14 -2197.56 0 422.605 0 0 0 1196.55 0 0 0 0 0 0 1648.84 2128.9 0 0 0 0 0 0 0 -1291.92 0 0 450.987 0 0 1582.46 0 1643.35 1749.24 0 1206.02 0 0 -1832.1 0 0 -2048.02 0 -922.498 0 -873.669 2375.48 0 
0 0 0 600.528 0 1982.25 0 0 0 0 0 0 -2318.41 1531.65 0.02 0 0 0 0 -1135.67 0 0 0 -1427.58 0 0 0 2204.43 0 0 0 0 0 0 0 0 0 0 0 2389.37 0 0 0 1138.26 0 0 0 2348.48 0 0 283.593 0 0 0 0 0 0 0 0 0 0 
0 1432.62 0 0 0 569.247 0 0 -2413.63 1206.17 0 0 2133.63 -1617.56 0 0.06 -1523.41 -1913.13 0 0 0 0 0 0 1830.73 0 0 0 0 0 764.412 -1841.26 0 -179.678 0 0 1753.36 0 0 2166.43 0 0 0 0 0 0 0 0 0 -527.589 947.523 0 -188.376 2462 0 0 0 0 0 0 0 
0 0 0 0 0 -1787.39 0 0 0 0 0 0 0 0 0 1382.11 0.04 744.27 0 -1181.6 0 0 1484.5 0 0 -1874.07 1033.43 402.31 0 0 0 0 0 0 0 0 94.6837 0 0 -207.297 0 0 0 642.186 0 1327.48 0 0 0 0 1869.18 0 0 0 0 0 0 0 0 0 0 
0 1564.3 0 0 0 -1159.63 0 0 -1249.96 -1384.7 1090.35 2337.34 0 976.974 0 188.833 -1817.15 0.04 0 0 0 0 0 0 0 -2462.46 0 0 0 0 2397.92 0 0 1714.91 0 2192.83 0 -395.138 0 0 0 1131.55 0 2105.55 0 1838.05 -2020.86 0 0 0 -2421.26 0 0 -2402.04 0 768.99 0 0 1808.45 0 -1770.15 
0 0 0 1766.03 0 0 0 0 0 -302.057 0 0 1081.35 0 0 0 0 0 0.09 0 0 -2246.85 0 0 0 0 0 0 0 0 -638.676 0 0 1979.35 2116.53 0 0 -127.186 0 0 0 -1397.82 0 1631.44 0 0 0 -1621.37 955.763 0 1922.9 0 0 1089.59 0 0 -461.211 0 0 -2294.76 0 
1643.04 0 0 0 974.227 0 0 0 0 0 0 0 0 0 -603.275 0 1966.08 0 0 0.02 -623.417 0 0 0 0 822.703 0 -144.276 -2343.44 0 0 0 0 0 0 0 0 2311.7 0 0 0 1367.15 0 0 0 909.375 0 -89.1903 0 302.362 0 -1301.23 2061.91 0 -120.167 -2491 0 0 0 0 0 
0 0 2486.27 1876.51 1986.07 0 -2395.93 2113.94 -212.79 1376.31 0 0 -1476.26 0 0 0 0 0 0 1352.96 0 0 -2234.49 0 1095.08 0 1410.49 0 0 0 0 1342.13 0 0 0 0 0 0 0 2073.5 0 0 -1401.03 0 0 1599.4 0 0 2013.53 0 -705.817 0 1458.1 0 0 -1535.46 0 0 0 0 0 
0 0 2107.53 0 0 0 -2101.89 0 0 0 0 0 0 -683.081 0 0 0 0 2408.44 0 0 0.03 0 0 0 0 0 0 2102.5 0 694.525 0 0 0 0 0 1398.13 456.633 0 0 1883.68 882.672 -1606.11 0 0 0 0 0 0 0 0 0 0 0 0 0 0 1056.02 0 0 0 
0 0 -169.301 0 0 0 0 0 0 0 0 -2356.41 0 0 0 0 1968.67 0 0 0 -338.527 0 0.08 0 0 0 0 0 0 0 0 -327.693 -400.479 0 2195.58 0 1585.51 -636.692 0 0 0 -165.334 0 0 -1497.16 0 1616.95 2052.75 -371.792 -943.861 0 -1363.95 0 0 0 756.172 0 0 0 0 0 
0 0 710.395 471.892 0 2333.67 0 0 1142.38 0 0 0 -514.008 0 -833.689 0 0 0 0 0 0 0 0 0.01 -962.477 0 395.901 -433.134 0 0 0 0 1201.28 0 1275.44 0 0 0 0 0 1571.47 0 0 0 -1845.38 0 0 0 0 0 0 0 0 259.026 0 0 -2464.6 0 0 0 0 
0 165.181 0 0 0 -562.38 0 0 1519.29 0 0 -1198.54 0 0 0 -2319.64 0 0 0 0 -2328.49 0 0 822.703 0 -904.492 0 1664.4 0 -298.547 0 0 0 1992.78 0 387.967 -42.8022 0 0 0 0 0 0 2154.23 0 0 0 0 0 0 768.227 0 0 -976.058 0 0 0 -328.608 0 0 0 
0 0 1669.13 0 0 0 1761.15 2029.86 0 1275.6 0 0 0 0 0 0 318.079 2077.62 0 -1457.95 0 0 0 0 1189.99 0.09 0 0 0 0 -112.232 -1548.28 0 -1813.64 0 2441.56 1560.49 0 0 492.187 0 -823.771 0 0 0 0 1933.12 0 -2484.89 0 0 0 0 0 0 0 0 0 0 0 0 
0 0 0 0 2106.46 0 0 0 1023.21 0 1969.59 2105.55 0 0 0 0 359.432 0 0 0 2204.28 0 0 1294.67 0 0 0.01 0 0 0 0 1249.66 1979.51 1349.45 0 0 0 0 0 0 0 -1261.41 0 0 0 0 -2259.21 0 -1413.39 0 0 0 0 2082.96 0 1075.24 0 -634.556 0 0 0 
2210.07 -912.122 0 0 0 -1557.89 0 0 0 0 0 0 0 0 2125.23 0 -224.845 0 0 -84.0022 0 0 0 108.875 -601.901 0 0 0.01 0 0 1842.63 0 0 0 0 0 0 0 0 262.078 0 0 0 0 0 866.497 0 0 0 0 0 0 0 0 0 0 0 0 0 -2427.98 0 
0 0 0 1335.11 0 0 1013.6 0 0 0 0 0 0 -9.84222 0 0 0 0 0 1022.75 0 -2305.44 0 0 0 0 0 0 0 0 0 0 -1853.16 0 0 0 0 0 0 0 0 -821.024 0 2154.68 0 0 56.2304 0 2184.29 0 0 0 0 0 0 0 0 738.777 0 0 0 
0 0 0 0 0 0 0 0 1747.26 -861.156 -284.661 0 0 1868.57 0 0 0 0 0 0 0 0 0 0 -572.756 0 0 0 0 0.08 1352.81 -435.881 0 0 397.732 -596.866 0 0 0 0 1757.48 0 928.755 0 0 0 0 0 0 0 0 0 0 890.606 0 1179.46 0 0 0 0 -1906.11 
0 0 2459.26 0 0 1863.54 0 0 1556.22 0 0 0 0 0 0 -1394.01 0 -510.956 -2086.17 0 0 1406.22 0 0 0 1020.92 0 253.533 0 -143.361 0.01 0 0 0 0 0 0 0 1865.52 0 0 0 1730.17 0 0 0 0 0 0 0 1403.93 0 0 0 0 0 0 995.438 -945.082 -618.686 0 
0 0 2004.38 1067.77 0 18.0822 0 0 0 0 0 0 0 0 0 -1432.16 0 0 0 0 -2068.32 0 -1214.87 0 0 2238 1049.15 0 0 2053.06 0 0.08 0 2239.68 2052.29 2353.97 -1607.79 0 0 -1996.9 0 0 0 0 0 0 0 -1844.46 -606.479 0 0 1658.91 0 0 -830.638 -593.356 -366.146 1497.77 0 0 0 
-738.777 0 0 0 0 0 0 -169.759 0 -1631.14 0 200.888 0 0 0 0 0 0 0 0 0 0 1547.36 1395.84 0 0 1658.3 0 1896.65 0 0 0 0.05 253.838 0 0 0 1092.79 0 0 0 0 0 1803.72 0 0 0 0 0 0 0 0 0 0 0 0 1966.08 0 1651.28 0 0 
2436.98 0 -333.338 -1922.44 1491.82 0 0 0 946.303 0 994.369 0 -599.307 0 0 1012.83 0 1667.3 1634.65 0 0 0 0 0 1243.71 -945.692 -1688.36 0 0 0 0 -2363.43 2452.39 0.03 -1896.19 2297.81 0 0 0 280.084 -1087.91 0 0 -1837.6 -1313.9 0 -1012.83 0 0 -565.889 0 315.485 0 0 0 0 0 1290.55 0 0 0 
0 1703.31 0 0 1522.19 0 0 0 0 0 -983.993 -2370.6 0 0 0 0 0 0 172.201 0 0 0 223.93 455.107 0 0 0 0 0 2457.12 0 -2074.42 0 1650.06 0 0 0 0 0 0 -265.282 2230.83 0 0 0 0 1978.74 0 0 0 0 0 0 -1493.96 1536.53 -1088.67 0 0 464.263 0 0 
-137.104 0 0 0 1166.34 0 0 0 0 0 0 0 0 0 0 0 0 772.195 0 0 0 0 0 0 -2404.17 -575.045 0 0 0 769.143 0 -1077.84 0 1000.02 0 0.04 0 0 470.214 0 -25.8644 -316.706 0 0 0 138.63 0 0 0 0 0 0 0 0 0 1520.51 0 -1391.26 0 2063.59 0 
2036.42 2407.83 0 0 0 167.47 -2425.69 0 0 -750.221 0 123.524 0 0 0 -262.841 299.158 0 0 0 0 372.555 2430.88 0 -1500.06 -1453.98 0 0 0 0 0 -593.814 0 0 0 0 0.05 0 0 0 2178.79 0 0 -74.3889 0 1009.48 0 1285.97 -2424.92 196.463 0 1668.52 0 2323.45 -2054.43 0 1353.11 0 0 0 0 
1063.8 0 0 1878.64 1142.23 0 1891.77 0 0 0 989.334 0 1037.1 -2479.25 0 0 0 -1148.64 1968.83 -647.221 0 1733.83 -61.7237 0 0 0 0 0 0 0 0 0 -360.5 0 0 0 0 0.04 1469.08 1958.14 0 0 0 0 0 0 0 0 0 1105.91 0 0 0 2100.05 405.972 0 0 0 0 0 0 
-716.346 0 0 0 0 0 0 2104.02 0 0 1776.25 1925.79 0 0 0 0 0 0 0 0 0 0 0 0 0 0 0 0 0 0 -443.205 0 0 0 0 2152.09 0 1238.67 0.01 0 0 116.962 0 -1111.56 0 0 601.901 0 907.544 0 555.513 0 0 723.823 0 0 0 0 0 0 -589.389 
0 -574.74 0 0 0 0 0 -1732.46 -2414.24 0 0 559.328 0 0 1121.63 1967.15 2477.87 0 0 0 -480.132 0 0 0 0 1666.39 0 -263.298 0 0 0 1327.17 0 -1640.75 0 0 0 2230.06 0 0.04 0 0 1021.68 0 0 0 0 0 -1745.89 960.036 0 0 0 0 0 0 0 0 0 0 0 
0 0 0 0 0 0 0 0 0 0 0 0 0 2069.38 0 0 0 0 0 0 0 -1238.21 0 867.107 0 0 0 0 0 2146.29 0 0 0 1142.23 -568.484 197.989 -21.4393 0 0 0 0 0 0 0 0 0 0 0 0 0 0 0 364.162 -2460.48 0 0 0 0 0 0 0 
779.824 0 -66.9118 0 0 0 857.341 0 0 0 0 0 0 0 0 0 0 -35.783 -1866.59 168.233 0 -463.652 105.67 0 0 1292.54 1217.46 0 1732.46 0 0 0 0 0 188.223 912.885 0 0 -1086.54 0 0 0.07 0 0 1406.22 0 0 0 0 0 0 0 -1871.47 0 0 0 0 0 0 0 0 
0 0 1635.56 0 0 0 0 0 0 0 0 0 1878.8 0 0 0 0 0 0 0 -1725.9 1658.76 0 0 0 0 0 0 0 -2239.22 2020.1 0 0 0 0 0 0 0 0 -1016.8 0 0 0.07 0 0 0 0 -1163.29 -1167.26 0 0 2008.19 0 0 0 0 0 0 0 0 0 
0 0 1033.28 0 0 0 0 0 -891.98 0 0 -1760.69 0 1774.42 2127.06 0 728.706 2170.4 1002 0 0 0 0 0 470.061 0 0 0 -397.58 0 0 0 -783.486 29.0689 0 0 155.721 0 705.054 0 0 0 0 0.04 0 0 2463.99 0 -580.233 -1241.87 0 0 2008.65 0 0 1528.29 0 2496.19 0 0 0 
-1928.85 0 0 0 2006.06 0 0 0 0 0 0 0 -1217.76 0 0 0 0 0 0 0 0 0 1047.01 -1823.56 0 0 0 0 0 0 0 0 0 1780.53 0 0 0 0 0 0 0 2062.52 0 0 0 0 1961.81 0 -1449.4 1587.04 0 -792.184 0 0 0 0 0 0 -1871.01 0 0 
0 0 0 1480.53 589.999 1261.71 0 0 0 0 695.135 -33.3415 0 -2427.98 0 0 1239.28 1930.07 0 1580.02 1601.08 0 0 0 0 0 0 -1693.7 0 0 0 0 0 0 0 824.229 1778.24 0 0 0 0 0 0 0 0 0.02 0 -846.812 0 0 0 0 0 0 0 0 -2452.09 0 0 0 0 
1901.68 0 0 1636.94 0 0 0 0 0 0 0 0 0 160.909 0 0 0 2328.33 0 0 0 0 -1276.67 0 0 1434.45 -1011.31 0 -2300.87 0 0 0 0 493.561 2326.5 0 0 0 210.349 0 0 0 0 1476.26 -1185.72 0 0.05 0 0 0 0 0 -37.3089 1726.2 0 0 0 0 -1381.19 0 2484.89 
0 0 -723.518 0 0 0 1575.44 0 0 -513.55 0 0 0 0 1124.84 0 0 0 2114.4 666.753 0 0 -437.254 0 0 0 0 0 0 0 0 61.8763 0 0 0 0 -942.64 0 0 0 0 0 -1620.91 0 0 2160.94 0 0.08 -2254.33 0 0 0 1138.57 2145.99 0 0 0 -252.312 0 -1805.86 0 
924.635 775.094 0 0 0 0 -2435.91 2074.11 0 0 0 1759.32 0 1815.16 0 0 0 0 1113.09 0 780.129 0 -926.008 0 0 -118.946 -986.892 0 1681.8 0 0 2442.78 0 0 0 0 -174.947 0 1136.28 -412.687 0 0 -487.915 66.3015 -136.952 0 0 1294.06 0.03 -2459.41 0 0 0 0 0 0 0 0 0 0 0 
0 1150.78 0 0 197.226 0 -1165.12 0 0 0 0 -1630.38 454.039 0 0 755.104 0 0 0 -37.9192 0 0 -150.685 0 0 0 0 0 0 0 0 0 0 -786.081 0 0 -1548.89 2253.72 0 1270.26 0 0 0 -270.013 2223.96 0 0 0 48.6007 0.04 1104.39 0 -1126.51 0 1656.16 0 0 2288.51 0 0 0 
0 0 0 627.537 0 -37.3089 0 0 0 1964.86 0 0 0 0 29.9844 1476.71 -1746.35 -1195.64 2270.81 0 397.275 0 0 0 2196.04 0 0 0 0 0 2392.42 0 0 0 0 0 0 0 -1002.15 0 0 0 0 0 0 0 0 0 0 -1421.93 0.09 1237.3 0 0 0 0 -2368.92 0 0 0 0 
0 -43.7178 329.524 0 0 0 990.707 1472.14 0 0 -22.0496 0 0 -1174.43 0 0 0 0 0 348.598 0 0 542.085 0 0 0 0 0 0 0 0 1941.05 0 1884.59 0 0 1795.33 0 0 0 0 0 1541.72 0 1726.81 0 0 0 0 0 1519.59 0.05 0 0 0 1967.15 1863.84 -2033.37 0 0 0 
0 0 0 0 0 -550.02 0 0 0 0 -1189.38 1498.69 0 0 0 -429.167 0 0 0 2468.87 931.501 0 0 0 0 0 0 0 0 0 0 0 0 0 0 0 0 0 0 0 99.7192 -825.297 0 -1504.64 0 0 1108.2 2089.98 0 223.472 0 0 0.09 0 0 0 0 0 0 0 0 
0 0 0 0 0 0 0 0 0 0 915.021 0 0 0 0 -1087.76 0 446.104 1022.75 0 0 0 0 -922.803 1581.7 0 1920.15 0 0 -152.058 0 0 0 0 -2267.6 0 2055.8 1489.99 1949.14 0 1233.79 0 0 0 0 0 -2328.49 -2485.2 0 0 0 0 0 0.03 0 0 0 0 0 0 1361.66 
0 0 -468.841 0 0 0 -1897.11 -318.842 0 0 0 970.717 1600.77 -1218.38 0 0 0 0 0 -1282.92 0 0 0 0 0 0 0 0 0 0 0 -109.79 0 0 2202.9 0 2232.96 1636.63 0 0 0 0 0 0 0 0 0 0 0 -1644.11 0 0 0 0 0.06 0 0 1992.02 0 0 0 
113.91 0 2358.7 0 0 0 0 0 763.497 0 0 0 0 0 0 0 0 -2368.77 0 802.713 -1940.14 0 234.153 0 0 0 2226.4 0 0 1748.33 0 790.811 0 0 -2241.66 -1437.35 0 0 0 0 0 0 0 2423.09 0 0 0 0 0 0 0 2201.38 0 0 0 0.09 0 -1526.31 0 0 0 
0 2183.68 0 -2487.49 -806.68 490.814 0 0 0 0 817.057 0 0 1126.06 0 0 0 0 586.947 0 0 0 0 974.38 0 0 0 0 0 0 0 -1330.07 2279.66 0 0 0 2381.28 0 0 0 0 0 0 0 0 -1280.94 0 0 0 0 918.989 901.44 0 0 0 0 0.04 0 0 0 0 
0 0 -1395.99 303.583 0 1956.77 0 0 0 0 0 0 0 0 0 0 0 0 0 0 0 1119.04 0 0 1910.23 0 2033.07 0 2373.65 0 920.057 -1073.56 0 -58.5192 0 473.724 0 0 0 0 0 0 0 320.673 0 0 0 -1944.56 0 -1572.85 0 2030.93 0 0 2149.65 -1183.43 0 0.05 0 -1148.18 0 
0 0 0 1931.75 1820.96 0 0 1962.11 0 0 948.286 0 0 -170.064 0 0 0 -736.03 0 0 0 0 0 0 0 0 0 0 0 0 285.119 0 1649.91 0 1357.39 0 0 0 0 0 0 0 0 0 2000.26 0 1494.26 0 0 0 0 0 0 0 0 0 0 0 0.09 0 0 
174.184 -1862.93 0 0 0 0 0 0 0 0 0 0 0 -587.863 0 0 0 0 1932.66 0 0 0 0 0 0 0 0 1480.07 0 0 -375.149 0 0 0 0 -1465.58 0 0 0 0 0 0 0 0 0 0 0 1504.49 0 0 0 0 0 0 0 0 0 -136.341 0 0.09 0 
0 0 0 0 2315.97 0 629.215 1222.8 -2347.71 0 0 0 0 0 0 0 0 -1913.13 0 0 0 0 0 0 0 0 0 0 0 1078.45 0 0 0 0 0 0 0 0 1227.38 0 0 0 0 0 0 0 1282.01 0 0 0 0 0 0 46.3118 0 0 0 0 0 0 0.09 
