*Vertices 42
*Matrix 
0.02 -1480.99 0 -224.235 0 0 0 1167.71 0 496.307 0 0 0 -73.0155 0 2118.67 0 0 0 0 -1607.94 0 1594.06 0 0 0 -1638.92 0 0 0 752.51 1493.96 0 0 0 0 2421.11 204.245 0 0 -2263.02 0 
-1413.08 0.06 1020.46 -2082.51 0 -735.572 0 0 0 0 0 0 1950.36 0 -1336.02 1529.21 0 0 1129.57 0 0 0 0 -1506.01 348.75 -1219.14 0 0 0 2283.78 0 0 2296.9 0 0 0 0 0 0 0 0 0 
0 -1114 0.09 1723.46 394.986 0 0 1279.72 0 0 0 0 0 0 0 0 0 0 0 0 0 62.9444 303.583 -1550.26 1761.45 0 0 -1557.89 -815.836 0 303.43 -78.6615 2335.96 0 0 0 0 0 0 0 0 0 
1924.12 446.104 -2089.22 0.03 0 0 0 -1596.96 -846.507 0 0 0 0 0 -1129.26 2427.21 0 0 0 0 1064.1 0 1490.6 0 0 0 0 0 0 0 0 0 0 0 0 1892.07 1366.54 0 0 0 0 0 
0 0 1967.91 0 0.06 0 0 0 0 0 0 0 667.211 0 0 0 0 0 0 781.808 -610.141 0 0 0 1254.08 0 0 0 0 1811.5 0 2474.67 0 0 0 1290.4 0 0 0 0 0 0 
0 2211.45 0 0 0 0.01 0 0 0 -1138.26 0 0 2321.47 1638.16 0 -136.799 0 0 1271.94 2214.96 0 495.087 0 -0.0762963 0 0 0 2373.04 0 331.66 1562.78 0 0 0 0 2398.53 0 0 -619.907 0 0 0 
0 0 0 0 0 0 0.09 0 151.753 1674.17 0 0 0 0 0 0 0 0 0 0 0 2062.67 0 0 0 -964.003 0 0 0 2304.68 0 -455.718 0 -220.725 0 0 0 0 0 1168.17 0 0 
1146.35 0 -1058.31 -1750.47 0 0 0 0.09 0 0 953.627 0 2221.21 1279.26 0 0 0 0 0 -2169.64 -1539.43 2434.39 0 698.492 0 1896.19 2467.65 0 0 0 2220.45 0 0 0 -2076.25 0 1410.03 0 0 0 0 -942.64 
0 0 0 -44.9385 0 0 528.504 0 0.03 0 0 0 1821.73 0 0 0 2337.18 0 0 702.307 0 1230.89 -879.772 0 -2176.2 0 0 0 -722.297 2088.76 0 0 0 0 -963.088 0 -2379.76 0 0 0 0 -716.193 
2283.93 0 0 0 0 2071.67 429.014 0 0 0.05 -1173.67 0 0 0 0 -1396.3 0 0 0 0 -2376.25 981.246 0 0 0 0 85.5281 0 2222.43 0 0 0 0 2332.61 0 0 0 0 0 0 0 0 
0 0 0 0 0 0 0 -404.294 0 765.633 0.03 0 0 0 598.697 0 2411.65 1888.41 0 0 0 0 1300.16 0 0 0 0 0 0 0 0 0 0 -199.82 2143.39 0 -467.62 0 0 -1824.17 0 1160.24 
0 0 0 0 0 0 0 0 0 0 0 0.02 -2228.84 0 0 2472.99 0 0 0 0 0 2470.55 0 0 2421.11 0 0 816.599 0 -766.396 1393.09 0 0 0 -1087.3 0 -1197.32 0 0 0 0 0 
0 38.377 0 0 345.546 2425.23 0 -972.396 916.852 0 0 -84.46 0.07 2018.57 0 0 -540.559 0 0 -489.898 -1263.7 0 0 785.775 1837.29 0 1821.88 0 0 -979.263 0 0 0 0 -555.208 0 0 0 0 0 0 0 
2318.87 0 0 0 0 1994.31 0 -473.876 0 0 0 0 1716.13 0 0 0 0 1454.74 0 0 116.657 0 0 0 0 0 0 0 983.84 0 1566.29 0 0 0 0 0 0 0 0 0 1323.82 -585.727 
0 115.284 0 -1992.78 0 0 0 0 0 0 709.174 0 0 0 0.01 0 0 0 2433.62 0 0 0 1151.54 336.848 0 0 0 0 0 0 165.639 0 0 0 -1226.31 -827.128 0 0 0 0 0 0 
-1452.6 1932.36 0 -842.845 0 26.78 0 0 0 1811.04 0 -488.525 0 0 0 0.02 0 1913.59 0 0 0 0 0 0 0 0 -820.109 0 0 0 786.081 0 0 0 0 0 0 0 1870.1 0 0 0 
0 0 0 0 0 0 0 0 2356.11 0 1364.71 0 762.123 0 0 0 0.06 0 0 0 0 0 0 0 0 0 0 0 0 0 -2329.25 0 -1505.25 957.289 0 798.135 0 0 0 0 0 0 
0 0 0 0 0 0 0 0 0 0 1266.9 0 0 907.086 0 935.163 0 0.09 -1394.16 0 0 0 0 0 0 0 0 0 0 0 0 -1893.75 0 2071.52 610.904 751.9 959.731 0 0 0 0 0 
0 2249.14 0 0 0 950.728 0 0 0 0 0 0 0 0 -256.89 0 0 -989.944 0.08 0 1607.33 163.808 0 0 746.254 0 1737.8 -2454.53 -1897.41 0 0 0 1741 0 0 -1029.16 603.885 0 0 0 0 0 
0 0 0 0 1233.18 490.967 0 2392.42 -888.623 0 0 0 1224.33 0 0 0 0 0 0 0.02 0 0 0 0 0 640.812 0 0 0 0 0 -1061.05 2028.64 0 0 0 0 0 1375.7 0 0 0 
964.309 0 0 704.138 -1850.26 0 0 1068.22 0 -946.303 0 0 1036.03 -1390.96 0 0 0 0 -511.414 0 0.03 0 0 0 -33.7992 0 0 0 0 0 1437.04 0 0 0 0 0 0 695.288 0 0 0 0 
0 0 1327.33 0 0 -1063.04 1072.65 434.66 -1611.15 1545.08 0 2292.78 0 0 0 0 0 0 2193.59 0 0 0.03 0 0 0 0 0 0 0 0 0 0 0 0 0 0 -699.561 0 0 0 1112.48 0 
2146.9 0 2074.27 1278.8 0 0 0 0 -688.726 0 1797.46 0 0 0 -985.519 0 0 0 0 0 0 0 0.04 0 0 0 0 0 0 0 0 0 -632.878 0 0 -2389.98 0 0 0 -205.466 0 0 
0 2074.88 1462.68 0 0 2427.37 0 -1907.48 0 0 0 0 -9.38444 0 -1706.06 0 0 0 0 0 0 0 0 0.08 868.023 0 2347.71 704.443 0 0 0 0 0 1172.75 0 0 0 0 0 0 0 0 
0 -2019.03 1871.93 0 1462.22 0 0 0 2154.84 0 0 -571.078 1908.09 0 0 0 0 0 -169.912 0 1896.65 0 0 2368.92 0.05 0 0 0 1768.01 -243.309 2049.24 0 -501.648 0 0 0 0 0 0 0 -149.922 0 
0 1990.19 0 0 0 0 -1017.11 -630.741 0 0 0 0 0 0 0 0 0 0 0 1103.93 0 0 0 0 0 0.06 0 1759.47 0 0 0 0 0 2456.97 0 0 2022.84 0 0 0 0 0 
2138.66 0 0 0 0 0 0 -855.205 0 2095.93 0 0 2470.09 0 0 -1038.47 0 0 765.786 0 0 0 0 913.038 0 0 0.07 -2490.69 1816.08 1638.62 0 1123.92 1105.46 0 0 -1848.73 1650.67 0 0 0 0 0 
0 0 852.458 0 0 379.421 0 0 0 0 0 1231.04 0 0 0 0 0 0 368.435 0 0 0 0 -761.055 0 -1900.62 2436.22 0.09 275.506 0 706.427 574.129 0 0 -26.017 0 0 0 0 0 0 0 
0 0 1270.71 0 0 0 0 0 -1033.13 2124.93 0 0 0 -413.907 0 0 0 0 2045.27 0 0 0 0 0 -449.309 0 1899.85 -1599.86 0.05 0 0 935.316 0 0 0 0 0 0 0 0 0 0 
0 1418.27 0 0 119.251 651.952 -1147.27 0 -1057.08 0 0 2238.61 -609.073 0 0 0 0 0 0 0 0 0 0 0 -179.22 0 1924.57 0 0 0.03 794.626 0 1988.05 0 -324.183 -1482.97 0 0 0 0 0 0 
-1973.1 0 -535.524 0 0 1923.2 0 -2406.31 0 0 0 45.5489 0 2250.66 -1330.68 1178.09 -1625.64 0 0 0 578.249 0 0 0 1097.06 0 0 1716.59 0 775.552 0 0 0 0 0 1528.29 0 0 0 0 0 -1797.31 
516.755 0 -1222.8 0 2474.97 0 -71.337 0 0 0 0 0 0 0 0 0 0 -1881.85 0 -644.627 0 0 0 0 0 0 1755.81 2415.31 1536.38 0 0 0.03 430.387 0 0 0 0 0 0 0 0 0 
0 638.829 161.672 0 0 0 0 0 0 0 0 0 0 0 0 0 1027.48 0 775.552 1163.75 0 0 387.661 0 1350.83 0 -966.292 0 0 2086.32 0 -902.356 0.01 0 0 0 0 0 0 0 0 0 
0 0 0 0 0 0 2059.16 0 0 -740.608 637.303 0 0 0 0 0 476.318 1107.59 0 0 0 0 0 -2313.68 0 408.872 0 0 0 0 0 0 0 0.04 0 0 0 0 0 0 1976.3 0 
0 0 0 0 0 0 0 -969.497 -459.685 0 1988.2 -2147.97 2009.57 0 101.55 0 0 1966.69 0 0 0 0 0 0 0 0 0 2259.82 0 493.255 0 0 0 0 0.01 0 480.743 0 0 0 0 0 
0 0 0 -250.633 299.921 1279.26 0 0 0 0 0 0 0 0 945.082 0 -1712.47 1146.81 2289.57 0 0 0 720.618 0 0 0 2142.93 0 0 589.084 -1731.54 0 0 0 0 0.03 0 1526 0 0 0 0 
-1755.81 0 0 2015.52 0 0 0 -434.507 -575.808 0 -1276.21 835.673 0 0 0 0 0 1705.76 879.009 0 0 2467.8 0 0 0 2229.61 1042.59 0 0 0 0 0 0 0 1896.95 0 0 0 0 0 -669.958 0 
1500.06 0 0 0 0 0 0 0 0 0 0 0 0 0 0 0 0 0 0 0 -590.609 0 0 0 0 0 0 0 0 0 0 0 0 0 0 1751.38 0 0.04 0 1928.39 0 0 
0 0 0 0 0 2130.57 0 0 0 0 0 0 0 0 0 1954.48 0 0 0 -945.997 0 0 0 0 0 0 0 0 0 0 0 0 0 0 0 0 0 0 0 0 0 0 
0 0 0 0 0 0 -612.125 0 0 0 1579.1 0 0 0 0 0 0 0 0 0 0 0 -300.226 0 0 0 0 0 0 0 0 0 0 0 0 0 0 358.211 0 0.07 0 0 
1107.59 0 0 0 0 0 0 0 0 0 0 0 0 -1551.48 0 0 0 0 0 0 0 -965.835 0 0 1363.8 0 0 0 0 0 0 0 0 1649.14 0 0 -497.375 0 0 0 0.05 0 
0 0 0 0 0 0 0 677.282 1201.28 0 -451.14 0 0 -634.404 0 0 0 0 0 0 0 0 0 0 0 0 0 0 0 0 111.621 0 0 0 0 0 0 0 0 0 0 0.05 
