*Vertices 71
*Matrix 
0.05 0 0 1090.04 -297.937 0 0 0 0 0 1234.24 0 1361.35 0 0 0 -1440.4 0 0 -913.19 0 0 0 0 0 674.23 1578.04 -1128.19 0 0 0 -477.996 0 0 -1370.82 0 0 0 0 827.433 0 -2231.28 1442.69 570.162 0 -694.678 0 0 0 2095.17 0 0 0 0 0 0 0 679.724 1400.57 0 0 0 0 0 0 0 0 -1724.07 0 0 0 
0 0.01 0 0 0 0 0 0 0 0 0 -839.793 -1024.43 -873.974 0 -2066.48 0 0 0 0 1569.64 -482.269 0 -36.2407 1845.84 394.375 1130.63 0 0 0 0 -2440.79 0 2485.81 0 0 0 0 1497.92 0 0 0 0 -1097.67 0 -975.906 2102.5 0 0 0 2458.19 0 0 0 0 0 0 0 -583.132 0 0 2477.11 0 0 0 48.1429 0 0 0 0 0 
0 0 0.06 0 0 2368.47 0 0 0 -1684.7 0 0 0 0 0 1369.29 2307.89 0 0 -2279.5 2028.79 0 -257.5 0 0 0 0 -401.7 0 0 385.22 0 0 0 0 1614.05 0 0 0 0 0 0 0 0 0 0 -388.272 0 0 953.322 0 0 0 0 0 0 0 0 0 -1883.22 0 0 0 -1920.76 0 0 0 -2052.14 0 0 0 
-1672.49 0 0 0.08 -2248.68 0 0 0 0 0 1283.99 0 0 0 0 0 0 0 0 1066.09 0 0 770.058 0 0 0 0 1754.59 0 -2276.76 1228.9 1018.17 0 0 2353.66 0 0 0 0 0 0 0 -1649.75 0 0 0 0 0 673.315 -430.235 0 0 0 0 0 0 0 0 0 0 0 0 0 0 0 0 0 0 2268.67 1333.89 0 
2348.17 0 0 1693.85 0.08 0 0 0 0 1941.21 0 0 0 0 0 0 -788.98 0 0 0 -1681.34 1111.41 0 0 0 0 0 0 0 0 949.202 2464.14 0 0 0 0 0 0 0 -625.706 0 0 420.164 110.858 0 0 0 0 0 0 0 1162.98 0 0 0 0 0 1806.16 0 0 0 -467.467 0 0 0 0 0 0 0 0 0 
0 0 1757.64 0 0 0.05 0 0 0 0 -1689.58 0 1988.97 0 0 0 0 0 0 0 1251.18 0 0 0 0 -380.795 0 0 1833.78 0 0 0 985.214 -192.495 -2401.88 0 0 0 0 1556.83 0 836.589 0 0 0 2200.46 -933.638 0 0 0 1731.7 0 0 -1703.77 -2306.82 0 -655.614 0 -948.897 -1204.95 1712.01 0 0 0 0 0 1301.84 0 0 2324.06 0 
0 0 0 0 0 0 0.03 0 0 0 0 0 0 1381.65 0 0 0 0 0 0 2470.85 0 0 1854.23 -2387.69 0 -1181.75 -420.011 0 0 0 0 0 -1602.15 0 0 1898.48 0 -1661.66 0 0 2083.42 0 0 0 0 -1970.66 0 0 0 0 65.6911 2293.08 0 454.192 0 0 0 0 0 0 0 0 0 0 0 0 0 0 0 0 
0 0 0 0 0 0 0 0 1484.34 0 0 0 1607.03 -2239.83 0 1500.82 0 1063.04 0 0 0 0 0 0 0 0 0 0 0 0 0 -1780.07 0 0 0 0 0 0 -154.958 1016.5 0 0 0 0 0 0 0 -1241.42 0 0 0 0 0 110.706 0 1124.84 0 0 0 0 0 0 0 0 0 0 -1694.46 0 0 0 0 
0 0 0 0 0 0 0 -800.882 0.08 0 -709.784 0 0 0 501.648 0 0 0 0 -2257.99 0 1694.92 0 0 0 0 0 0 0 0 0 2470.85 425.962 0 491.729 0 0 0 0 0 0 0 0 0 0 0 0 1698.58 0 0 0 0 0 0 0 0 0 0 0 0 0 0 -617.771 0 0 0 0 0 0 0 0 
0 0 1516.08 0 -1443.45 0 0 0 0 0.02 0 916.547 177.999 0 624.485 0 -1240.04 0 0 -1250.88 0 0 -373.623 0 0 0 0 0 -2408.9 -1128.8 0 2154.99 0 0 0 0 0 -755.715 0 0 2134.69 0 1547.82 2013.53 -562.838 1881.08 0 0 1880.32 0 1640.29 1872.69 0 0 -1369.44 0 0 0 0 0 0 0 -251.701 0 0 -1055.1 0 0 0 0 -568.789 
-1444.67 0 0 -93.3103 0 378.811 0 0 186.239 0 0.03 0 0 0 0 23.8807 0 217.521 0 1802.19 0 0 0 0 0 0 0 -1742.23 0 0 0 0 0 0 0 0 2268.52 1144.67 0 1402.55 0 0 0 0 0 -2038.71 0 1679.82 0 0 0 0 0 0 0 0 0 0 0 0 0 0 0 0 0 1917.86 -1581.85 0 0 0 0 
0 1155.51 0 0 0 0 0 0 0 -1885.36 0 0.04 0 0 0 0 0 0 0 2481.69 0 -1293.45 1968.67 1978.44 1768.17 0 0 0 0 203.024 0 0 0 1755.04 0 -792.184 0 0 0 1042.89 -1283.23 -384.304 -846.66 0 0 0 0 0 0 0 0 1455.96 0 0 0 0 0 0 0 0 0 0 0 0 0 0 1347.16 0 0 0 0 
914.716 493.713 0 0 0 1436.89 0 1335.87 0 -2393.19 0 0 0.07 0 0 0 0 -116.81 0 0 551.546 2422.94 0 0 0 0 0 0 0 444.121 0 0 302.667 0 0 893.658 0 0 -458.159 -858.715 0 0 0 0 1835.76 -1283.38 698.187 0 -55.7726 0 -883.74 0 -476.165 -205.008 0 0 0 0 0 0 0 0 0 0 0 0 0 0 0 0 0 
0 -1389.28 0 0 0 0 -236.747 -1329.16 0 0 0 0 0 0.02 0 0 0 0 0 0 0 0 849.712 0 0 -237.205 0 0 0 0 1697.97 0 0 0 0 0 0 0 0 1802.65 0 0 0 2409.82 0 0 0 -199.362 0 0 0 0 407.651 0 0 0 0 0 0 0 0 0 0 0 0 0 0 0 1229.21 685.064 0 
0 0 0 0 0 0 0 0 1292.69 2427.37 0 0 0 0 0.01 0 -1717.51 -1795.18 1564.61 0 0 0 2299.04 2043.44 0 0 0 0 0 -1664.86 0 0 0 0 0 0 518.586 0 0 0 0 0 0 0 0 0 0 0 0 0 2366.94 0 0 -1466.8 0 0 0 0 0 0 0 0 0 -1676.92 1287.35 0 0 0 0 0 0 
0 -391.324 2474.82 0 0 0 0 -528.657 0 0 2150.72 0 0 0 0 0.03 0 0 0 0 0 0 607.242 0 0 1581.09 0 0 0 0 0 0 0 0 -109.943 0 0 0 848.186 522.553 0 0 0 0 0 -1571.17 0 -1373.1 0 0 2083.27 0 0 -568.941 0 0 0 4.1963 0 0 0 0 0 0 0 0 0 0 0 0 0 
1450.01 0 -2069.23 0 1405.15 0 0 0 0 2128.44 0 0 0 0 2118.06 0 0.01 0 0 0 0 886.792 0 0 0 0 0 0 0 0 1524.48 937.758 0 2241.05 0 0 0 0 -1791.67 0 482.727 0 2266.38 0 -28.0007 0 0 0 0 1944.87 0 0 -1056.93 1065.32 0 0 0 0 0 0 0 0 -695.593 0 0 0 0 0 1088.67 0 0 
0 0 0 0 0 0 0 -1876.66 0 0 -622.806 0 158.162 0 2386.62 0 0 0.06 -1378.29 0 193.564 1029.47 0 2344.51 0 0 0 0 0 0 0 0 0 0 -1032.36 0 2129.96 1079.67 252.77 1233.33 0 0 -164.571 0 0 0 0 0 0 0 -2434.69 0 1962.87 -303.125 0 0 0 0 0 0 1103.32 0 0 0 0 0 0 -855.052 2311.4 0 0 
0 0 0 0 0 0 0 0 0 0 0 0 0 0 2322.53 0 0 682.318 0.05 -1131.55 -1408.2 -403.989 0 0 0 0 1566.44 0 0 0 0 -2215.87 0 0 -623.264 0 251.549 0 2109.06 0 0 0 1460.54 0 0 1240.2 0 0 0 1351.28 0 0 0 1211.66 0 0 0 0 0 0 0 0 0 0 0 0 0 0 0 0 0 
2026.35 0 1355.56 -730.232 0 0 0 0 -1688.67 1408.81 1379.82 -1581.55 0 0 0 0 0 0 2103.26 0.02 0 -1120.72 1897.56 0 0 0 0 1526.76 0 0 0 0 1061.05 1693.24 469.298 0 0 0 0 0 0 0 0 0 0 0 0 0 0 0 0 0 0 0 0 0 0 0 0 1734.44 0 0 0 0 -27.0852 0 0 0 0 0 0 
0 -1422.54 -548.952 0 2431.33 900.983 1889.78 0 0 0 0 0 2247.92 0 0 0 0 1195.49 2245.93 0 0.05 0 0 0 0 0 -726.417 526.521 -553.987 0 0 0 0 0 0 0 0 0 -1551.94 0 -200.735 0 -190.817 0 0 0 0 0 1789.53 0 656.072 0 0 2449.49 0 -2221.06 0 0 0 0 0 0 0 -339.137 0 -2214.65 0 0 0 0 -953.017 
0 -2217.86 0 0 1603.37 0 0 0 1951.12 0 0 -1437.04 844.371 0 0 0 1203.42 -1013.29 -756.478 1889.93 0 0 0 2180.17 0 -1244.47 893.048 0 0 -387.814 0 0 0 1654.18 0 0 0 0 0 -2.82296 0 0 0 0 0 0 0 0 0 0 0 0 0 0 0 -809.122 571.078 0 0 0 0 0 0 0 0 0 0 0 0 0 0 
0 0 1447.57 503.937 0 0 0 0 0 1621.83 0 -394.986 0 2299.65 -860.546 1957.69 0 0 0 -175.863 0 0 0.09 0 0 0 0 0 0 0 0 0 0 0 -447.478 0 0 0 96.82 0 855.968 516.602 0 0 0 0 1056.17 0 0 1508 0 0 0 0 0 0 0 0 0 0 0 0 0 0 0 0 0 0 0 -2227.16 0 
0 -299.005 0 0 0 0 -2353.51 0 0 0 0 -346.309 0 0 -336.39 0 0 2362.67 0 0 0 -267.876 0 0 2408.6 0 0 0 0 1363.19 0 0 0 0 0 0 0 1911.15 0 -93.3103 -1949.75 0 -6.94296 1470.92 0 0 0 0 1694.16 0 2351.83 0 0 0 0 0 1868.88 0 0 0 0 0 -2452.09 0 0 0 0 0 0 0 0 
0 1803.11 0 0 0 0 564.211 0 0 0 0 -685.064 0 0 0 0 0 0 0 0 0 0 0 855.663 0 0 0 847.118 0 0 -2202.29 0 1385.62 0 0 0 0 0 -1476.87 0 0 235.374 1935.87 0 -1743.75 0 0 -1619.24 1751.99 1078.14 0 523.927 0 0 0 0 0 0 0 0 0 0 0 665.532 0 0 0 0 1986.98 1394.77 0 
-412.992 1492.74 0 0 0 1982.71 0 0 0 0 0 0 0 1043.66 0 2210.38 0 0 0 0 0 -1122.09 0 0 0 0.08 0 -10.1474 0 2227.77 0 0 0 -1670.96 638.371 0 0 0 2497.71 0 0 0 0 0 0 -175.1 0 0 -93.0052 0 0 565.889 898.236 0 0 0 0 0 0 0 0 0 0 0 0 0 0 0 0 0 0 
-250.938 1596.04 0 0 0 0 981.857 0 0 0 0 0 0 0 0 0 0 0 1592.07 0 730.232 914.563 0 0 0 0 0 0 0 0 1081.19 0 0 0 0 0 0 0 -551.698 0 0 0 0 0 0 -1233.94 0 0 0 -617.771 0 0 0 0 0 2355.04 0 0 0 0 0 0 0 0 0 0 0 1342.74 0 0 0 
-1672.03 0 -376.522 -740.608 0 0 -1496.4 0 0 0 2246.7 0 0 0 0 0 0 0 0 -579.318 2109.06 0 0 0 -107.501 2398.68 0 0.08 1465.42 0 1860.48 0 0 -2200.77 0 2148.43 0 0 0 0 1754.13 0 0 0 0 0 0 0 0 -1762.06 0 0 0 0 0 0 0 0 0 1840.04 0 0 0 0 0 0 0 0 0 2423.09 0 
0 0 0 0 0 231.559 0 0 0 -988.571 0 0 0 0 0 0 0 0 0 0 -1382.87 0 0 0 0 0 0 -353.481 0 0 6.02741 -276.269 0 231.254 0 0 0 2187.34 2309.26 0 0 64.3178 0 1370.51 0 0 0 2423.09 -237.053 0 2015.82 0 -758.766 0 0 0 -759.682 -1890.55 0 0 -894.574 0 0 0 1224.94 0 0 0 -2422.18 0 0 
0 0 0 -2352.6 0 0 0 0 0 -2167.35 0 2208.55 1612.06 0 1002.15 0 0 0 0 0 0 -423.826 0 -354.854 0 621.281 0 0 0 0 0 0 0 255.364 2012.47 0 1681.8 2422.33 -2464.75 0 0 0 724.128 0 0 0 0 2151.48 0 0 -2462.92 0 -1417.36 0 0 0 0 0 0 0 0 0 0 0 0 0 0 0 -2479.86 0 0 
0 0 2458.8 -248.955 -294.275 0 0 0 0 0 0 0 0 1510.9 0 0 1153.07 0 0 0 0 0 0 0 1035.42 0 -955.306 23.1178 -980.026 0 0 0 2470.85 0 99.8718 0 0 -163.045 0 0 0 0 0 0 -1842.94 0 0 0 0 0 740.15 0 0 0 0 0 493.866 -1730.48 0 0 0 0 0 0 -1239.28 172.048 2015.52 0 0 0 0 
861.614 984.909 0 1155.05 486.084 0 0 -1878.34 1820.81 195.395 0 0 0 0 0 0 -1549.65 0 -1229.97 0 0 0 0 0 0 0 0 0 -1461.15 0 0 0.09 0 0 1313.9 0 0 0 -1809.82 0 0 -415.281 0 0 0 0 0 1662.72 2072.89 0 0 1148.34 215.079 0 0 0 -1922.59 0 0 0 -411.618 0 0 0 0 0 0 0 800.882 0 0 
0 0 0 0 0 388.272 0 0 1790.6 0 0 0 2459.56 0 0 0 0 0 0 -1653.26 0 0 0 0 1051.9 0 0 0 0 0 -558.412 0 0 2023.91 0 0 -1413.85 0 0 0 912.732 0 -40.3607 -1378.9 1764.2 0 0 0 0 1581.7 0 0 0 0 0 0 0 0 0 0 0 0 0 0 0 0 0 0 -1203.42 0 0 
0 998.489 0 0 0 -1273.77 -1406.67 0 0 0 0 -374.233 0 0 0 0 -1922.13 0 0 -1764.35 0 2270.96 0 0 0 -1775.8 0 881.603 1865.06 2162.92 0 0 1250.42 0 1613.9 -1022.75 0 0 0 0 1445.89 0 0 -381.863 1098.74 0 1133.38 -1778.08 0 0 0 0 0 -808.206 0 0 0 0 0 0 0 0 0 0 0 0 0 1568.88 0 0 0 
768.838 0 0 2342.22 0 -2402.19 0 0 1005.97 0 0 0 0 0 0 580.233 0 2367.24 -691.473 972.549 0 0 953.78 0 0 585.574 0 0 0 2288.81 -1126.36 -1018.78 0 -1794.26 0.07 -1431.39 0 0 -2448.58 0 0 0 2310.63 0 0 0 0 0 0 0 0 0 0 0 0 -1741.46 0 0 0 0 0 0 0 0 0 0 0 -1806.31 0 0 0 
0 0 -2257.07 0 0 0 0 0 0 0 0 2108.45 -140.919 0 0 0 0 0 0 0 0 0 0 0 0 0 0 -987.35 0 0 0 0 0 -1301.54 -881.603 0.04 0 -1136.59 0 1083.03 0 1873.76 0 0 0 0 1768.01 2392.57 0 0 0 0 0 -702.612 0 0 0 1335.11 0 0 0 0 0 1807.38 0 -370.418 0 0 -2304.22 0 0 
0 0 0 0 0 0 -290.765 0 0 0 -2201.68 0 0 0 -148.854 0 0 2115.16 2055.04 0 0 0 0 0 0 0 0 0 0 2094.87 0 0 1459.17 0 0 0 0.08 0 -515.839 -267.418 0 0 0 0 0 0 -14.1148 0 194.174 0 0 0 0 0 -446.104 0 0 0 939.436 0 0 -171.896 0 0 0 -1460.39 0 0 0 6.94296 0 
0 0 0 0 0 0 0 0 0 2135.76 795.694 0 0 0 0 0 0 505.31 0 0 0 0 0 -1064.56 0 0 0 0 -331.66 1562.17 344.935 0 0 0 0 -858.715 0 0.07 0 0 1424.99 0 0 0 0 -1244.93 -1335.87 0 0 0 0 0 0 -2226.4 1804.48 0 0 0 0 0 0 0 0 922.803 0 0 0 0 0 0 0 
0 -490.509 0 0 0 0 2367.09 1332.21 0 0 0 0 2348.63 0 0 494.629 -1836.38 630.589 -1231.96 0 1852.7 0 1452.3 0 1660.28 1538.97 634.556 0 254.448 -1373.71 0 1768.47 0 0 -474.639 0 -109.638 0 0.07 0 0 0 0 0 -421.69 0 0 0 2247.46 1780.07 0 0 2141.56 0 0 0 0 607.852 0 0 0 0 0 0 0 0 187.765 0 -1461.61 0 0 
2329.1 0 0 0 -2144.61 730.842 0 1199 0 0 -1306.27 187.765 -300.226 591.067 0 -1295.13 0 1602.3 0 0 0 235.527 0 1132.01 0 0 0 0 0 0 0 0 0 0 0 -1237.45 774.178 0 0 0.02 0 0 0 639.439 435.423 0 0 -381.252 0 0 0 0 0 0 0 0 0 0 1524.02 0 0 0 0 0 0 0 833.232 0 0 0 0 
0 0 0 0 0 0 0 0 0 594.119 0 2145.68 0 0 0 0 1638 0 0 0 -1248.28 0 197.836 893.658 0 0 0 2326.81 0 0 0 0 1951.73 1728.49 0 0 0 1979.2 0 0 0.09 0 0 -1286.89 0 0 663.549 640.355 -717.566 0 0 1108.36 -1970.5 0 0 0 0 0 0 0 0 2498.32 0 0 2040.7 0 0 0 0 -2456.51 0 
698.187 0 0 0 0 303.125 1301.69 0 0 0 0 -2281.79 0 0 0 0 0 0 0 0 0 0 855.51 0 2212.97 0 0 0 -395.138 0 0 1391.57 0 0 0 2277.52 0 0 0 0 0 0.03 2429.35 0 0 0 0 0 0 0 0 0 0 0 0 0 0 0 0 0 0 95.9044 0 0 -501.801 0 0 619.449 0 0 0 
597.781 0 0 -1686.99 -2033.22 0 0 0 0 -1207.08 0 -814.005 0 0 0 0 2396.39 -2315.82 1146.5 0 -180.593 0 0 2090.29 661.718 0 0 0 0 1930.37 0 0 2113.18 0 1695.07 0 0 0 0 0 0 162.893 0.09 0 -2017.5 0 -184.866 0 0 0 0 0 0 1015.12 0 551.241 0 0 0 0 144.429 0 0 0 0 0 -694.372 0 0 0 0 
-1140.1 2004.38 0 0 437.559 0 0 0 0 -722.602 0 0 0 1826 0 0 0 0 0 0 0 0 0 -2310.17 0 0 0 0 1676 0 0 0 641.423 -246.208 0 0 0 0 0 2381.44 91.3266 0 0 0.09 -2375.33 0 1250.11 0 0 0 0 0 0 0 0 -715.125 0 0 0 0 0 0 0 0 0 0 0 0 0 0 323.42 
0 0 0 0 0 0 0 0 0 -2471.31 0 0 736.488 0 0 0 534.15 0 0 0 0 0 0 0 2486.27 0 0 0 0 0 1741.61 0 726.264 1720.56 0 0 0 0 -1441.47 -2089.22 0 0 425.81 -503.784 0.06 0 0 0 0 0 0 -2462.61 0 0 0 0 0 0 0 0 0 0 0 0 1442.08 0 0 0 0 0 0 
-813.089 2299.34 0 0 0 1368.53 0 0 0 1943.19 719.398 0 320.368 0 0 -1121.02 0 0 623.417 0 0 0 0 0 0 -724.281 1766.95 0 0 0 0 0 0 0 0 0 0 1330.68 0 0 0 0 0 0 0 0.01 0 0 0 0 0 1854.08 0 0 0 -1702.25 0 0 0 -1984.85 1350.22 0 0 2425.84 -459.838 0 0 0 0 0 0 
0 567.415 1251.03 0 0 -2280.42 1136.13 0 0 0 0 0 1075.85 0 0 0 0 0 0 0 0 0 1305.35 0 0 0 0 0 0 0 0 0 0 2351.68 0 -98.1933 707.343 1920.91 0 0 555.208 0 1774.73 971.633 0 0 0.02 0 0 0 0 0 0 0 0 0 0 0 0 0 0 0 1824.63 0 0 0 532.929 0 0 0 0 
0 0 0 0 0 0 0 1740.24 -2322.23 0 -1020 0 0 2252.04 0 55.62 0 0 0 0 0 0 0 0 1762.37 0 0 0 -154.653 -1594.82 0 1522.19 0 -938.826 0 -424.741 0 0 0 1714.76 -955 0 0 0 0 0 0 0.09 2406.61 0 0 -1261.56 2261.8 0 78.814 0 0 0 0 0 -1033.59 -1814.71 0 0 0 0 0 0 0 0 0 
0 0 0 2116.53 0 0 0 0 0 -1001.85 0 0 -1276.06 0 0 0 0 0 0 0 255.364 0 0 1571.47 1893.14 1429.41 0 0 -346.461 0 0 -1068.68 0 0 0 0 2075.64 0 1318.32 0 1056.17 0 0 0 0 0 0 372.25 0.09 0 0 19.1504 0 0 0 0 0 0 0 0 0 0 0 0 0 0 0 0 0 0 0 
-2350.31 0 -1630.99 862.987 0 0 0 0 0 0 0 0 0 0 0 0 1431.85 0 1252.25 0 0 0 2020.86 0 294.122 0 -793.863 1464.2 0 0 0 0 1148.18 0 0 0 0 0 262.383 0 0 0 0 0 0 0 0 0 0 0.05 0 0 0 0 0 0 0 0 1594.06 0 0 0 0 -159.993 0 0 0 0 0 0 2090.59 
0 968.886 0 0 0 -72.4052 0 0 0 -504.7 0 0 217.063 0 -569.247 1844 0 -1286.74 0 0 1109.27 0 0 -1809.98 0 0 0 0 998.032 551.393 2460.48 0 0 0 0 0 0 0 0 0 0 0 0 0 0 0 0 0 0 0 0.07 884.198 503.479 -1425.29 0 0 0 0 1537.75 -157.704 0 -425.047 0 0 0 0 0 0 0 0 0 
0 0 0 0 1106.22 0 -809.427 0 0 1152.61 0 -1930.52 0 0 0 0 0 0 0 0 0 0 0 0 1908.55 -264.214 0 0 0 0 0 -1249.81 0 0 0 0 0 0 0 0 731.147 0 0 0 2364.35 708.563 0 -939.589 350.429 0 694.372 0.01 0 1936.32 0 0 0 0 0 0 0 0 1828.44 0 0 0 0 0 -2198.17 0 0 
0 0 0 0 0 0 -1576.82 0 0 0 0 0 461.516 -1835.61 0 0 -1116.14 2016.28 0 0 0 0 0 0 0 -998.032 0 0 1519.29 1333.74 0 -1370.36 0 0 0 0 0 0 1647.62 0 2092.12 0 0 0 0 0 0 -2100.51 0 0 -1669.9 0 0.08 0 0 0 0 0 0 0 0 0 0 0 1150.78 0 0 0 0 693.152 0 
0 0 0 0 0 -369.808 0 -1947.61 0 0 0 0 1369.44 0 1337.4 2482.6 389.34 1177.18 813.547 0 897.473 0 0 0 0 0 0 0 0 0 0 0 0 -732.826 0 -128.559 0 1734.75 0 0 0 0 -2412.72 0 0 0 0 0 0 0 -2016.28 -1349.45 0 0.05 0 0 0 0 0 0 0 0 0 0 0 0 0 0 0 0 0 
0 0 0 0 0 -1021.53 996.353 0 0 -1332.21 0 0 0 0 0 0 0 0 0 0 0 0 0 0 0 0 0 0 0 0 0 0 0 0 0 0 352.87 1526.31 0 0 0 0 0 0 0 0 0 2318.72 0 0 0 0 0 0 0 2049.39 0 0 1788.77 0 0 0 -847.423 0 0 0 -64.9281 0 0 0 0 
0 0 0 0 0 0 0 823.161 0 0 0 0 0 0 0 0 0 0 0 0 2355.34 126.576 0 0 0 0 -202.719 0 0 0 0 0 0 0 1181.3 0 0 0 0 0 0 0 -1717.66 1143.15 0 -1637.39 0 0 0 0 0 0 0 0 -317.621 0.07 0 0 0 0 0 0 0 0 0 -670.721 0 1296.96 0 0 0 
0 0 0 0 0 583.59 0 0 0 0 0 0 0 0 0 0 0 0 0 0 0 -1882.61 0 1263.54 0 0 0 0 2020.86 0 1944.26 1527.99 0 0 0 0 0 0 0 0 0 0 0 0 0 0 0 0 0 0 0 0 0 0 0 0 0.06 0 0 0 0 0 -1764.81 0 0 0 0 -158.162 0 -2239.68 0 
1267.36 0 0 0 1174.73 0 0 0 0 0 0 0 0 0 0 1196.71 0 0 0 0 0 0 0 0 0 0 0 0 1388.97 0 -2133.01 0 0 0 0 1838.05 0 0 1841.11 0 0 0 0 0 0 0 0 0 0 0 0 0 0 0 0 0 0 0.06 0 2406 0 0 0 1089.89 0 0 214.621 0 0 2262.41 -504.547 
-272.912 2111.5 0 0 0 1664.56 0 0 0 0 0 0 0 0 0 0 0 0 0 0 0 0 0 0 0 0 0 0 0 0 0 0 0 0 0 0 348.14 0 0 661.718 0 0 0 0 0 0 0 0 0 -935.926 1476.1 0 0 0 -2285.3 0 0 0 0.05 0 0 0 0 0 -1395.23 0 0 967.208 0 0 0 
0 0 1242.94 0 0 -839.793 0 0 0 0 0 0 0 0 0 0 0 0 0 327.998 0 0 0 0 0 0 0 -1915.57 0 0 0 0 0 0 0 0 0 0 0 0 0 0 0 0 0 1398.28 0 0 0 0 -989.486 0 0 0 0 0 0 1845.53 0 0.02 0 0 0 0 1641.67 0 0 0 0 0 0 
0 0 0 0 0 1155.66 0 0 0 0 0 0 0 0 0 0 0 2209.46 0 0 0 0 0 0 0 0 0 0 2258.9 0 0 -1764.35 0 0 0 0 0 0 0 0 0 0 -164.113 0 0 -552.614 0 -2234.95 0 0 0 0 0 0 0 0 0 0 0 0 0.01 -795.694 0 0 0 0 0 0 0 0 0 
0 681.555 0 0 656.377 0 0 0 0 0 0 0 0 0 0 0 0 0 0 0 0 0 0 0 0 0 0 0 0 0 0 0 0 0 0 0 132.832 0 0 0 -1087.76 136.799 0 0 0 0 0 1350.83 0 0 -359.432 0 0 0 0 0 0 0 0 0 -2240.59 0.06 0 0 0 0 0 0 0 0 0 
0 0 0 0 0 0 0 0 1036.48 13.3518 0 0 0 0 0 0 1036.03 0 0 0 0 0 0 -944.014 0 0 0 0 0 0 0 0 0 0 0 0 0 0 0 0 0 0 0 0 0 0 860.851 0 0 0 0 -1513.95 0 0 1824.02 0 -292.291 0 0 0 0 0 0.02 0 0 0 0 0 0 1730.02 0 
0 0 1132.92 0 0 0 0 0 0 0 0 0 0 0 -569.704 0 0 0 0 0 524.079 0 0 0 2031.85 0 0 0 0 0 0 0 0 0 0 -528.809 0 1982.1 0 0 0 0 0 0 0 -403.378 0 0 0 1284.6 0 0 0 0 0 0 0 1362.88 0 0 0 0 0 0.03 0 0 0 0 0 0 0 
0 0 0 0 0 0 0 0 0 0 0 0 0 0 -2464.14 0 0 0 0 720.771 0 0 0 0 0 0 0 0 2029.71 0 442.289 0 0 0 0 0 0 0 0 0 -519.349 821.329 0 0 2100.21 -748.543 0 0 0 0 0 0 -399.258 0 0 0 0 0 -958.663 164.266 0 0 0 0 0.03 0 0 0 0 0 1883.37 
0 1807.69 0 0 0 0 0 0 0 -1437.35 2364.65 0 0 0 0 0 0 0 0 0 1555.3 0 0 0 0 0 0 0 0 0 454.039 0 0 0 0 -1510.9 -1670.66 0 0 0 0 0 0 0 0 0 0 0 0 0 0 0 0 0 0 -1624.27 0 0 0 0 0 0 0 0 0 0.09 0 1342.28 0 0 759.377 
0 0 0 0 0 1992.63 0 1889.48 0 0 1213.34 -1498.84 0 0 0 0 0 0 0 0 0 0 0 0 0 0 0 0 0 0 -1482.36 0 0 0 0 0 0 0 -665.838 1668.52 0 0 2460.02 0 0 0 765.175 0 0 0 0 0 0 0 221.488 0 0 -827.433 0 0 0 0 0 0 0 0 0 0 0 0 0 
-2455.75 0 2281.64 0 0 0 0 0 0 0 0 0 0 0 0 0 0 2077.93 0 0 0 0 0 0 0 0 2464.45 0 0 0 0 0 0 1675.08 1950.36 0 0 0 0 0 0 -856.883 0 0 0 0 0 0 0 0 0 0 0 0 0 -635.319 -1962.11 0 1844.46 0 0 0 0 0 0 2265.47 0 0 0 0 1898.79 
0 0 0 1370.05 0 0 0 0 0 0 0 0 0 1124.84 0 0 2.97555 -1984.85 0 0 0 0 0 0 1312.07 0 0 0 -1616.03 -2408.75 0 2001.48 -42.0392 0 0 -119.404 0 0 830.943 0 0 0 0 0 0 0 0 0 0 0 0 1571.17 0 0 0 0 0 0 0 0 0 0 0 0 0 0 0 0 0.05 0 0 
0 0 0 -235.527 0 2210.99 0 0 0 0 0 0 0 -309.381 0 0 0 0 0 0 0 0 1291.92 0 -1659.52 0 0 -121.235 0 0 0 0 0 0 0 0 -807.443 0 0 0 1889.78 0 0 0 0 0 0 0 0 0 0 0 1397.98 0 0 0 -1226.31 -158.467 0 0 0 0 -1249.66 0 0 0 0 0 0 0.07 0 
0 0 0 0 0 0 0 0 0 -639.592 0 0 0 0 0 0 0 0 0 0 -671.331 0 0 0 0 0 0 0 0 0 0 0 0 0 0 0 0 0 0 0 0 0 0 -277.49 0 0 0 0 0 -1565.37 0 0 0 0 0 0 0 499.359 0 0 0 0 0 0 1940.14 1793.04 0 240.562 0 0 0.09 
