*Vertices 28
*Matrix 
0.08 0 0 0 0 0 0 1233.18 0 159.993 0 0 -698.34 0 2301.02 0 0 0 0 0 0 0 0 0 0 0 0 0 
0 0.07 0 0 0 0 0 0 -246.513 2357.78 0 0 0 0 0 0 0 315.943 0 0 0 0 0 0 0 0 0 0 
0 0 0.04 0 0 -1975.23 0 0 0 1790.6 0 0 0 0 1863.38 0 0 0 0 0 0 0 0 0 0 0 0 0 
0 0 0 0.06 -994.064 0 0 0 -588.473 0 0 0 0 1714.91 0 0 0 0 0 0 0 -692.389 0 1787.85 0 0 0 0 
0 0 0 2324.52 0.04 0 0 0 1739.78 0 0 0 0 0 0 0 0 0 0 0 0 0 0 0 0 0 442.595 0 
0 0 -1682.87 0 0 0.04 0 0 0 0 0 1515.17 0 0 0 0 1609.78 0 0 -1132.62 0 -2210.53 0 908.917 1974.32 0 0 0 
0 0 0 0 0 0 0.06 0 1007.03 0 0 0 0 2151.17 0 0 0 0 0 0 0 0 0 0 0 0 0 0 
-1139.33 0 0 0 0 0 0 0.04 2464.9 982.162 0 0 -362.484 0 0 0 0 0 0 0 0 0 0 1782.97 0 1326.72 25.1015 0 
0 -1982.71 0 -1958.3 1052.81 0 1706.98 2157.12 0.06 0 0 0 0 -1441.62 0 0 0 0 0 299.615 0 0 0 0 0 0 0 0 
461.974 1674.63 -845.286 0 0 0 0 -1857.89 0 0 0 0 0 1394.31 0 1432.46 0 0 0 0 0 0 0 0 0 -639.439 0 0 
0 0 0 0 0 0 0 0 0 0 0.04 0 0 0 -400.784 0 0 2292.32 1537.75 0 0 0 0 0 0 0 0 0 
0 0 0 0 0 1533.17 0 0 0 0 0 0.04 -1826.3 0 0 0 0 0 -376.37 -1163.29 0 -828.806 1438.57 593.661 0 0 1287.5 0 
2331.84 0 0 0 0 0 0 966.445 0 0 0 67.5222 0.06 -2135.61 0 1478.55 0 0 1792.58 0 0 0 0 0 0 0 0 -760.75 
0 0 0 -420.774 0 0 305.261 0 -6.33259 1393.86 0 0 1033.74 0.04 0 -56.8407 0 0 0 0 0 0 0 -363.857 0 0 0 0 
-2088.76 0 -369.655 0 0 0 0 0 0 0 829.264 0 0 0 0.07 0 74.3889 0 0 0 0 0 0 0 0 2268.67 0 0 
0 0 0 0 0 0 0 0 0 1376.31 0 0 307.55 -1237.3 0 0.09 0 0 2363.73 0 0 0 -121.235 0 0 2424.77 0 0 
0 0 0 0 0 -1450.16 0 0 0 0 0 0 0 0 1572.24 0 0 1664.86 0 1637.55 0 0 0 0 0 0 0 0 
0 427.793 0 0 0 0 0 0 0 0 1284.6 0 0 0 0 0 208.06 0.07 0 0 0 0 0 0 0 0 1432.31 0 
0 0 0 0 0 0 0 0 0 0 1943.65 -1674.93 2364.5 0 0 2027.88 0 0 0.02 0 0 1250.72 0 0 0 0 0 0 
0 0 0 0 0 476.165 0 0 2192.83 0 0 1027.79 0 0 0 0 1993.09 0 0 0.07 0 0 0 0 1167.71 0 0 0 
0 0 0 0 0 0 0 0 0 0 0 0 0 0 0 0 0 0 0 0 0.08 0 2129.96 0 0 0 0 0 
0 0 0 -1344.42 0 -509.735 0 0 0 0 0 1073.26 0 0 0 0 0 0 1848.89 0 0 0.03 0 0 0 0 0 0 
0 0 0 0 0 0 0 0 0 0 0 -1112.17 0 0 0 261.162 0 0 0 0 1244.77 0 0.06 0 0 0 0 0 
0 0 0 910.138 0 1805.7 0 1982.71 0 0 0 -1216.24 0 -867.26 0 0 0 0 0 0 0 0 0 0.02 0 0 0 0 
0 0 0 0 0 1131.24 0 0 0 0 0 0 0 0 0 0 0 0 0 223.319 0 0 0 0 0.03 0 0 0 
0 0 0 0 0 0 0 1654.79 0 363.399 0 0 0 0 1530.12 -369.808 0 0 0 0 0 0 0 0 0 0.05 0 0 
0 0 0 0 1311.76 0 0 -917.615 0 0 0 254.295 0 0 0 0 0 1776.86 0 0 0 0 0 0 0 0 0.06 0 
0 0 0 0 0 0 0 0 0 0 0 0 1209.37 0 0 0 0 0 0 0 0 0 0 0 0 0 0 0.08 
