*Vertices 68
*Matrix 
0.02 0 0 0 0 0 0 0 0 0 -68.4378 -1472.44 0 1480.07 0 0 0 0 1517.46 0 0 0 1875.44 1311.15 0 0 0 727.638 0 0 0 56.8407 0 0 0 2386.32 0 0 0 0 0 0 -908.917 0 0 0 0 0 1709.72 0 0 0 0 0 0 0 0 0 0 0 0 -17.3193 0 0 0 0 0 0 
0 0 0 0 0 0 0 1953.26 0 0 0 -1177.48 0 0 0 -956.832 0 0 0 -1536.53 0 0 2368.01 0 0 0 2348.78 -131.458 2333.98 -1163.59 -1103.02 263.146 0 2303.92 0 -1106.07 2236.93 1348.38 919.294 0 0 -1446.96 0 0 0 266.808 0 0 0 0 0 0 0 0 0 0 0 0 0 -2098.38 0 0 2500 0 -26.1696 0 0 0 
0 0 0.01 0 0 0 2293.08 0 0 0 0 1539.74 0 0 -1623.97 -2031.08 -985.519 -1689.43 0 2143.39 0 2480.93 0 0 -143.666 0 0 0 0 0 0 0 0 0 -1241.57 867.26 0 0 0 637.455 0 0 0 -1423.46 0 0 0 0 0 0 0 0 0 304.804 0 0 0 2124.01 -1414.76 432.981 0 0 0 0 0 0 0 1619.54 
0 0 0 0 0 0 0 0 0 0 2196.34 13.1993 0 2301.17 0 0 2381.28 996.506 0 0 0 2410.28 0 -1153.52 1349.91 0 0 1035.11 0 -852.153 829.112 0 -915.174 0 0 0 0 0 -378.964 0 0 0 0 0 0 0 0 0 0 0 0 0 703.07 0 0 0 0 0 0 0 0 0 -463.5 0 0 0 0 0 
0 0 0 0 0.08 -2051.23 0 0 886.944 0 0 1194.42 0 1977.37 0 0 995.743 85.3755 1854.38 0 0 0 0 0 0 -2319.48 0 0 1516.24 0 0 0 0 0 0 0 62.0289 0 0 0 0 0 0 1737.19 0 0 0 1417.81 0 853.832 0 -1919.39 0 925.55 0 0 0 0 0 0 -1390.65 -2470.4 0 0 0 0 0 0 
0 0 0 0 2374.26 0.09 0 0 17.6244 0 0 0 0 0 0 0 610.446 0 0 0 0 0 1412.02 -898.999 0 0 0 0 0 0 1434.45 -1915.57 0 707.953 0 0 0 0 2239.83 0 -1735.66 0 0 0 0 1967.15 0 0 0 0 -1534.39 0 0 0 0 0 -488.525 0 0 0 0 0 0 0 0 0 0 0 
0 0 568.026 0 0 0 0.07 0 -1061.82 0 1107.44 0 0 0 0 0 1320.31 0 1841.72 0 1643.65 1740.55 -1272.55 -2023.91 0 0 0 0 0 0 0 2323.6 0 47.6852 0 2317.04 0 0 0 0 2398.37 0 0 0 0 0 0 0 0 0 0 0 0 0 0 0 0 0 0 0 0 0 0 0 0 0 -97.4303 0 
0 594.272 0 0 0 0 0 0.07 0 0 -365.23 780.892 1440.09 0 -1890.24 264.367 0 0 0 0 0 0 -228.507 0 0 0 2314.29 -521.027 0 0 0 0 0 0 0 0 0 214.316 0 0 2084.19 0 0 0 0 0 720.923 0 0 0 0 0 0 0 0 0 -1576.51 0 0 0 0 0 0 273.827 0 0 0 0 
0 0 0 0 2122.64 1665.93 817.209 0 0.02 0 0 0 0 0 171.896 0 350.887 0 0 0 2458.34 0 0 0 0 -1429.11 -1693.55 0 0 0 0 0 1615.42 0 0 2040.7 0 0 -825.449 0 0 0 0 1397.37 0 0 0 0 0 0 0 0 0 0 0 0 -857.799 0 0 1964.09 0 0 0 0 -2302.39 0 0 0 
0 0 0 0 0 0 0 0 0 0.01 0 -2300.1 2479.86 -1072.04 0 0 0 0 0 -1273.92 0 -1819.13 277.184 0 0 0 0 0 1052.81 -1035.57 1720.56 893.811 1230.43 2272.79 0 0 0 0 0 0 0 0 0 0 0 1096.45 0 0 0 0 0 0 0 0 0 0 0 0 0 0 0 0 0 2207.79 0 0 -246.818 0 
987.503 0 0 -1687.29 0 0 1870.56 2154.23 0 0 0.06 -1926.25 0 840.251 612.583 2338.1 0 0 0 -974.075 0 0 0 0 0 0 0 0 0 0 2298.27 0 0 -644.322 0 0 150.075 0 0 0 0 676.977 1476.1 0 0 0 0 0 0 0 0 0 0 0 0 0 0 0 0 0 0 0 0 0 0 0 0 -1842.94 
904.187 1004.29 -1326.41 1052.35 2498.63 0 0 1555.91 0 2388.45 66.4541 0.09 0 -2447.81 0 0 0 0 -865.276 0 0 0 0 0 0 -834.91 0 1059.68 2100.67 0 0 0 0 881.146 1794.56 0 0 0 0 0 0 0 1910.99 449.767 0 0 0 0 0 0 0 0 72.4052 0 -538.27 0 0 0 0 0 669.958 0 0 0 0 0 0 0 
0 0 0 0 0 0 0 -64.3178 0 1216.7 0 0 0 1558.2 0 0 0 0 0 0 0 -2229.3 1427.58 0 0 0 0 1441.16 0 0 1225.09 0 0 637.303 0 2031.39 1069.29 0 0 0 0 0 0 -1147.72 0 0 -43.26 0 0 0 0 0 0 0 0 1298.03 0 0 0 0 0 0 0 90.1059 0 0 0 0 
-601.138 0 0 -911.512 -1255.91 0 0 0 0 527.284 2283.62 1471.83 -1628.09 0 0 0 0 0 0 0 0 -1492.74 0 0 -658.666 1806.31 2495.88 0 731.605 2457.88 0 0 0 0 2360.07 0 662.938 0 0 2417.91 0 0 -2176.2 0 0 738.929 0 0 0 0 0 0 0 0 1062.27 0 0 0 0 0 0 658.666 0 -2208.7 0 0 0 0 
0 0 -2427.52 0 0 0 0 -1455.35 2317.65 0 167.928 0 0 0 0.06 0 0 0 0 0 1405.3 911.054 0 0 0 909.375 -56.0778 0 0 0 0 776.315 0 0 0 0 1391.42 -734.962 -1871.47 0 421.995 53.6363 0 2235.25 0 1361.96 0 0 0 0 0 0 0 -858.715 0 0 0 0 0 0 0 0 0 0 0 0 -1270.87 0 
0 323.42 -1995.99 0 0 0 0 889.233 0 0 1910.08 0 0 0 0 0.06 0 -1626.56 2148.88 331.965 0 -1983.47 0 668.737 0 -1212.73 0 -162.282 0 0 1573.46 0 0 49.3637 0 0 0 2231.89 0 0 0 0 0 0 0 0 0 0 0 0 0 0 0 0 0 0 0 0 0 0 0 0 0 0 0 0 0 0 
0 0 1580.48 1448.79 -1156.27 -1376.77 2062.52 0 1068.38 0 0 0 0 0 0 0 0.02 0 364.162 0 -1011 0 1615.12 0 0 0 0 0 0 0 0 540.712 0 1568.88 0 0 0 -497.833 -200.583 0 0 -442.137 1148.03 0 2279.96 975.6 0 0 0 0 -1427.58 0 0 0 0 0 0 0 0 0 0 0 0 0 -415.433 0 167.47 0 
0 0 318.537 -157.094 -1957.84 0 0 0 0 0 0 0 0 0 0 1920.15 0 0.08 0 0 0 0 -353.633 127.033 1616.18 2372.74 0 466.399 1234.7 0 0 789.743 0 0 0 -957.289 0 495.087 0 -1216.09 0 0 0 -2415.31 0 0 0 0 -1535.31 0 0 0 2481.84 0 0 0 0 0 0 0 0 0 0 0 0 0 0 0 
-2410.43 0 0 0 1871.01 0 1715.98 0 0 0 0 1567.66 0 0 0 1844 -1781.14 0 0.03 0 0 -1030.08 0 0 0 0 0 -833.384 2356.87 0 1831.8 2267.6 0 0 2317.19 0 1510.13 0 0 1553.77 0 0 -928.755 0 0 0 0 0 0 -69.5059 0 0 297.784 0 0 0 2319.03 0 -775.399 0 0 0 0 0 0 0 0 0 
0 2428.59 -1540.5 0 0 0 0 0 0 1223.41 2368.92 0 0 0 0 -2426.76 0 0 0 0.07 0 0 0 0 0 0 0 0 0 0 2091.66 -741.676 0 0 2144.15 0 2175.59 0 -1321.99 889.996 0 0 0 0 0 0 0 0 0 -727.79 0 0 0 0 0 0 0 0 0 0 0 -1116.14 0 0 -132.527 172.964 -1405 308.313 
0 0 0 0 0 0 1130.18 0 150.533 0 0 0 0 0 1030.69 0 194.479 0 0 0 0.08 0 0 0 199.515 0 0 0 0 2038.87 0 1255.46 0 0 -24.4911 0 0 0 2105.09 0 0 0 946.913 -1042.89 51.0422 0 0 0 0 0 0 0 0 0 0 0 -861.919 0 -2335.35 0 -1132.16 0 0 0 0 0 0 0 
0 0 123.218 -1241.26 0 0 2201.99 0 0 1017.41 0 0 -381.558 -1661.5 532.472 -14.1148 0 0 1986.07 0 0 0 0 1840.8 -1688.97 0 0 0 2298.12 0 458.159 0 0 0 0 0 0 0 -2206.87 0 -662.328 1963.18 0 1797.31 0 -278.863 0 0 0 0 0 0 0 0 0 0 0 0 0 0 0 0 0 0 0 0 0 0 
-71.4896 628.3 0 0 0 -883.587 -1148.18 -1291.47 0 -1966.99 0 0 -789.59 0 0 0 1708.81 1099.35 0 0 0 0 0.08 0 0 2057.18 -1438.11 0 0 1560.95 0 0 0 501.343 266.045 0 0 0 275.964 1229.51 -401.09 0 0 0 0 0 0 0 0 0 0 -1.29704 0 0 0 0 0 0 0 0 0 0 -2347.87 0 1885.81 -935.316 2279.5 0 
2003.01 0 0 1636.33 0 1590.85 841.166 0 0 0 0 0 0 0 0 -891.98 0 -82.0185 0 0 0 -850.017 0 0.05 0 0 0 0 0 -691.168 0 0 0 2244.71 0 0 1667.61 1460.39 0 -1645.63 0 0 0 0 0 202.109 0 0 0 0 0 0 0 0 0 -1360.74 0 0 0 -223.014 0 0 0 0 0 0 0 0 
0 0 789.59 848.033 0 0 0 0 0 0 0 0 0 431.761 0 0 0 -1935.41 0 0 2408.44 2221.67 0 0 0 0 0 0 0 2406 -757.698 0 0 0 0 0 0 839.335 1418.58 0 0 0 1345.18 1291.01 0 707.801 0 0 0 0 634.556 0 0 0 0 0 0 0 -254.295 2315.52 1604.59 0 0 0 0 0 0 0 
0 0 0 0 1572.54 0 0 0 -630.284 0 0 -978.5 0 1174.89 489.135 2298.73 0 2258.29 0 0 0 0 886.792 0 0 0.07 -675.756 0 0 1612.98 0 1783.73 0 0 463.958 0 0 -2075.79 -1087.6 0 0 0 0 0 0 0 0 0 0 0 -2165.52 1940.44 0 0 0 0 0 0 0 890.301 0 0 0 0 0 0 0 0 
0 1218.38 0 0 0 0 0 -1070.67 1431.7 0 0 0 0 2321.92 -1283.38 0 0 0 0 0 0 0 1392.94 0 0 630.589 0.07 0 0 0 0 0 0 -1743.75 0 -145.955 0 0 2297.05 0 2192.07 1308.86 -1954.48 -2073.81 0 0 0 0 0 0 0 34.7148 0 0 0 0 0 0 0 0 0 0 0 0 0 0 0 0 
-551.088 2207.33 0 -975.295 0 0 0 -1345.03 0 0 0 2255.7 990.555 0 0 2415.16 0 -1922.74 1089.13 0 0 0 0 0 0 0 0 0.01 0 0 0 0 0 0 0 0 0 0 0 0 0 0 0 0 0 0 0 0 0 0 0 0 0 0 0 0 0 0 0 0 0 0 0 -132.679 0 0 0 0 
0 1795.79 0 0 1031.3 0 0 0 0 938.215 0 -1686.38 0 -1570.41 0 0 0 395.596 309.992 0 0 1360.44 0 0 0 0 0 0 0.05 0 856.426 0 0 0 0 0 0 0 1418.12 0 0 0 0 0 0 0 0 556.276 0 0 -1830.73 0 0 1492.89 0 254.906 -1306.42 -1978.9 0 0 0 528.657 2000.26 0 0 0 0 0 
0 1448.03 0 1308.56 0 0 0 0 0 -1690.8 0 0 0 2027.73 0 0 0 0 0 0 327.693 0 -2312.62 1233.18 -1581.55 1740.7 0 0 0 0.06 -1562.01 0 0 0 -140.309 0 1470.31 0 0 0 0 299.158 -244.072 2393.19 0 0 0 0 0 0 0 0 1914.81 0 0 0 0 0 0 0 0 0 0 -1357.23 0 0 0 0 
0 -1919.39 0 1691.56 0 2160.02 0 0 0 -1558.66 664.006 0 2077.47 0 0 500.122 0 0 514.313 -1775.34 0 498.596 0 0 1278.65 0 0 0 1040.3 1453.06 0.08 0 0 0 0 0 -970.87 0 0 0 0 0 510.041 0 0 0 0 0 0 0 0 0 0 0 0 0 0 0 0 0 0 0 0 0 0 0 0 0 
-1792.43 1674.02 0 0 0 498.596 984.298 0 0 -1045.18 0 0 0 0 -692.694 0 2188.25 -901.898 716.956 1484.65 -21.7444 0 0 0 0 -179.678 0 0 0 0 0 0.05 0 0 0 0 1740.09 0 0 0 1257.59 2170.71 1957.08 0 0 0 0 0 0 0 0 0 0 0 0 0 0 0 0 0 0 0 0 -347.072 0 1821.12 0 0 
0 0 0 996.811 0 0 0 0 -454.65 1139.94 0 0 0 0 0 0 0 0 0 0 0 0 0 0 0 0 0 0 0 0 0 0 0.04 -429.624 0 0 0 0 818.125 0 1858.96 477.844 0 0 0 0 0 -1482.97 0 0 0 0 0 0 0 139.698 -299.005 898.236 0 0 796.304 0 0 0 0 0 0 0 
0 -830.332 0 0 0 2226.71 562.99 0 0 1359.98 316.706 228.813 -660.192 0 0 939.131 -1823.86 0 0 0 0 0 -1907.48 2414.55 0 0 2295.98 0 0 0 0 0 -1469.7 0.06 0 0 0 1767.1 0 0 0 0 -641.118 0 944.472 0 0 0 -1324.43 -2121.57 0 0 0 0 0 0 0 0 0 0 0 0 0 0 0 0 0 2248.53 
0 0 1605.66 0 0 0 0 0 0 0 0 511.414 0 160.451 0 0 0 0 -898.083 1108.36 2485.66 0 2117.6 0 0 -260.704 0 0 0 1222.95 0 0 0 0 0.07 0 0 2473.14 0 -402.768 0 1047.32 0 0 -1501.28 0 0 0 0 0 1336.63 1535.31 0 0 0 0 0 0 0 0 0 0 0 0 0 0 0 0 
467.009 354.549 2007.13 0 0 0 308.771 0 -1599.86 0 0 0 -128.101 0 0 0 0 1895.28 0 0 0 0 0 0 0 0 -1737.95 0 0 0 0 0 0 0 0 0.04 0 1858.81 1710.49 0 1330.23 0 0 0 -1173.36 0 0 343.867 0 0 1671.88 0 0 -2126.15 0 0 0 0 0 0 0 0 0 1414.76 0 0 0 0 
0 2007.58 0 0 321.894 0 0 0 0 0 875.195 0 1258.81 1436.43 -1407.44 0 0 0 1898.18 1152.91 0 0 0 243.614 0 0 0 0 0 -202.261 2412.87 -2030.17 0 0 0 0 0.06 0 0 0 0 0 -1213.95 0 849.254 0 983.688 1574.68 0 0 1714.91 0 0 0 0 0 0 0 0 0 0 0 0 0 0 0 0 0 
0 -381.863 0 0 0 0 0 1689.58 0 0 0 0 0 0 976.058 517.365 -169.149 -460.448 0 0 0 0 0 1883.53 1617.1 -363.247 0 0 0 0 0 0 0 -2233.73 -1977.37 2130.88 0 0.08 0 0 0 0 0 0 0 0 0 0 0 0 0 0 0 0 0 0 0 0 0 0 0 1734.9 -2386.01 0 0 0 0 0 
0 1087.91 0 -987.045 0 1216.09 0 0 2281.79 0 0 0 0 0 594.119 0 498.901 0 0 -1912.37 2361.75 -90.7163 -1264.76 0 1127.89 355.159 -2459.26 0 2099.9 0 0 0 420.469 0 0 1158.25 0 0 0.05 0 0 0 245.75 1927.02 0 0 0 -2332.61 0 0 0 0 0 0 0 0 0 0 0 0 0 0 -1153.68 0 0 0 0 0 
0 0 585.116 0 0 0 0 0 0 0 0 0 0 2473.91 0 0 0 264.519 1254.08 -751.595 0 0 777.841 -809.885 0 0 0 0 0 0 0 0 0 0 2037.49 0 0 0 0 0.07 0 0 876.72 779.214 0 -1336.63 0 0 0 0 0 0 0 0 0 -244.072 0 0 0 0 0 510.651 0 0 0 0 0 0 
0 0 0 0 0 1136.74 1807.54 1920.15 0 0 0 0 0 0 1503.27 0 0 0 0 0 0 2395.17 671.026 0 0 0 796.304 0 0 0 0 1476.26 364.772 0 0 1542.18 0 0 0 0 0 0 0 0 -1519.29 0 0 0 1646.55 1378.6 0 0 0 413.144 0 0 487.915 0 0 0 0 0 0 0 0 2321.16 0 0 
0 1070.67 0 0 0 0 0 0 0 0 1579.87 0 0 0 24.3385 0 -971.328 0 0 0 0 1032.06 0 0 0 0 1370.66 0 0 676.366 0 -203.787 65.5385 0 1881.54 0 0 0 0 0 0 0.03 0 0 1443.6 0 0 0 0 0 0 0 0 0 0 0 0 -1431.85 0 1533.48 0 0 0 0 0 68.2852 0 0 
55.0096 0 0 0 0 0 0 0 0 0 -1871.62 -2139.42 0 2380.83 0 0 -1478.24 0 1797.62 0 1444.52 0 0 0 -797.372 0 2112.11 0 0 -1052.81 1698.43 -1690.65 0 2450.25 0 0 1643.96 0 866.192 -1600.16 0 0 0.06 0 0 0 0 0 0 0 0 0 0 0 0 0 0 -725.654 0 0 0 0 0 0 0 0 0 0 
0 0 936.232 0 304.956 0 0 0 564.669 0 0 -744.27 702.46 0 -1922.28 0 0 -319.3 0 0 174.184 32.5785 0 0 1201.44 0 877.178 0 0 1914.2 0 0 0 0 0 0 0 0 1084.7 894.116 0 0 0 0.02 0 -164.418 0 0 0 0 0 462.127 0 0 9.23185 0 0 0 0 0 0 0 0 0 0 1441.31 0 0 
0 0 0 0 0 0 0 0 0 0 0 0 0 0 0 0 -1335.57 0 0 0 145.192 0 0 0 0 0 0 0 0 0 0 0 0 -2017.2 1947.61 2038.1 536.286 0 0 0 1464.2 359.737 0 0 0.08 0 0 0 0 0 0 0 0 0 0 486.084 0 0 0 0 0 0 0 0 0 -1016.8 980.636 0 
0 86.9015 0 0 0 1655.25 0 0 0 -2348.17 0 0 0 2451.63 565.584 0 2231.74 0 0 0 0 1248.28 0 -1459.47 1027.48 0 0 0 0 0 0 0 0 0 0 0 0 0 0 2091.97 0 0 0 1971.57 0 0.01 0 0 0 0 0 0 0 0 0 0 0 0 366.451 0 0 0 1507.08 0 0 0 0 7.40074 
0 0 0 0 0 0 0 -1788.61 0 0 0 0 1219.29 0 0 0 0 0 0 0 0 0 0 0 0 0 0 0 0 0 0 0 0 0 0 0 1078.75 0 0 0 0 0 0 0 0 0 0.06 0 0 0 0 0 0 0 0 0 0 0 267.571 0 0 0 0 0 -110.248 0 0 1503.42 
0 0 0 0 1999.65 0 0 0 0 0 0 0 0 0 0 0 0 0 0 0 0 0 0 0 0 0 0 0 2419.13 0 0 0 2166.89 0 0 -902.051 1364.71 0 468.841 0 0 0 0 0 0 0 0 0.09 0 0 0 0 0 0 0 0 0 0 0 0 0 0 -27.0852 0 0 0 1973.4 0 
818.278 0 0 0 0 0 0 0 0 0 0 0 0 0 0 0 0 -2154.84 0 0 0 0 0 0 0 0 0 0 0 0 0 0 0 1395.99 0 0 0 0 0 0 1075.7 0 0 0 0 0 0 0 0.07 943.861 -2410.73 0 0 1204.03 0 0 0 0 0 977.279 0 0 0 2185.51 0 0 0 0 
0 0 0 0 253.075 0 0 0 0 0 0 0 0 0 0 0 0 0 2365.87 -1759.47 0 0 0 0 0 0 0 0 0 0 0 0 0 2070.76 0 0 0 0 0 0 -615.024 0 0 0 0 0 0 0 1953.72 0.05 0 0 0 0 0 -398.19 0 0 0 1532.26 0 0 0 0 0 0 0 0 
0 0 0 0 0 -294.427 0 0 0 0 0 0 0 0 0 0 2253.11 0 0 0 0 0 0 0 -417.57 421.384 0 0 1960.59 0 0 0 0 0 28.0007 -1289.03 -377.743 0 0 0 0 0 0 0 0 0 0 0 1219.9 0 0.04 0 0 0 0 0 0 0 0 0 0 0 0 0 0 465.331 0 0 
0 0 0 0 981.704 0 0 0 0 0 0 0 0 0 0 0 0 0 0 0 0 0 -772.5 0 0 1472.59 2130.88 0 0 0 0 0 0 0 -2162.47 0 0 0 0 0 0 0 0 1065.78 0 0 0 0 0 0 0 0.09 0 1699.04 -2213.58 0 0 2387.54 0 309.381 0 -107.349 0 0 0 0 2109.52 0 
0 0 0 -1156.88 0 0 0 0 0 0 0 -119.098 0 0 0 0 0 -620.67 1589.94 0 0 0 0 0 0 0 0 0 0 1054.49 0 0 0 0 0 0 0 0 0 0 0 0 0 0 0 0 0 0 0 0 0 0 0.04 0 0 0 2414.7 0 0 0 0 524.689 0 0 0 0 0 0 
0 0 -2295.83 0 1854.53 0 0 0 0 0 0 0 0 0 -2297.36 0 0 0 0 0 0 0 0 0 0 0 0 0 -277.184 0 0 0 0 0 0 625.553 0 0 0 0 2430.72 0 0 0 0 0 0 0 1075.55 0 0 2164.14 0 0.02 0 0 0 0 0 0 0 0 0 0 0 0 -765.481 0 
0 0 0 0 0 0 0 0 0 0 0 -1531.65 0 885.266 0 0 0 0 0 0 0 0 0 0 0 0 0 0 0 0 0 0 0 0 0 0 0 0 0 0 0 0 0 -269.402 0 0 0 0 0 0 0 1732.15 0 0 0 0 0 0 0 0 0 0 726.264 0 0 1258.96 0 0 
0 0 0 0 0 0 0 0 0 0 0 0 1507.69 0 0 0 0 0 0 0 0 0 0 -1902.14 0 0 0 0 282.678 0 0 0 -1858.65 0 0 0 0 0 0 1122.39 0 0 0 0 1777.93 0 0 0 0 1185.11 0 0 0 0 0 0.03 0 0 0 0 0 0 0 0 0 0 -290.613 0 
0 0 0 0 0 -1670.81 0 -2210.84 1668.37 0 0 0 0 0 0 0 0 0 1186.18 0 2042.68 0 0 0 0 0 0 0 -1819.44 0 0 0 1766.03 0 0 0 0 0 0 0 1717.81 0 0 0 0 0 0 0 0 0 0 0 982.009 0 0 0 0.04 0 1316.64 0 0 0 0 0 0 -286.34 0 0 
0 0 1057.08 0 0 0 0 0 0 0 0 0 0 0 0 0 0 0 0 0 0 0 0 0 0 0 0 0 1973.86 0 0 0 271.386 0 0 0 0 0 0 0 0 1902.75 1599.55 0 0 0 0 0 0 0 0 650.731 0 0 0 0 0 0.05 0 0 0 0 -2282.86 0 0 0 0 0 
0 0 493.866 0 0 0 0 0 0 0 0 0 0 0 0 0 0 0 723.365 0 513.55 0 0 0 -792.795 0 0 0 0 0 0 0 0 0 0 0 0 0 0 0 0 0 0 0 0 1808.3 -1193.5 0 0 0 0 0 0 0 0 0 -1136.28 0 0.06 0 0 0 0 0 0 0 0 0 
0 -1513.79 1345.03 0 0 0 0 0 1953.87 0 0 0 0 0 0 0 0 0 0 0 0 0 0 2007.58 -1677.22 1498.54 0 0 0 0 0 0 0 0 0 0 0 0 0 0 0 2254.17 0 0 0 0 0 0 431.761 1234.86 0 1154.29 0 0 0 0 0 0 0 0.04 0 0 0 0 0 0 0 0 
0 0 0 0 -1558.5 0 0 0 0 0 0 -556.429 0 0 0 0 0 0 0 0 -592.441 0 0 0 1928.39 0 0 0 0 0 0 0 1634.5 0 0 0 0 0 0 0 0 0 0 0 0 0 0 0 0 0 0 0 0 0 0 0 0 0 0 0 0.03 0 0 1133.08 0 0 0 0 
-1152 0 0 0 1415.83 0 0 0 0 0 0 0 0 -962.63 0 0 0 0 0 1242.79 0 0 0 0 0 0 0 0 -1357.84 0 0 0 0 0 0 0 0 2017.65 0 1503.42 0 0 0 0 0 0 0 0 0 0 0 -773.873 43.26 0 0 0 0 0 0 0 0 0.04 0 0 2406.61 0 0 0 
0 2384.03 0 -2068.77 0 0 0 0 0 0 0 0 0 0 0 0 0 0 0 0 0 0 -255.974 0 0 0 0 0 1441.47 0 0 0 0 0 0 0 0 1561.4 1285.97 0 0 0 0 0 0 1849.04 0 1154.74 0 0 0 0 0 0 1210.9 0 0 -225.15 0 0 0 0 0.03 0 0 1547.98 0 0 
0 0 0 0 0 0 0 -1951.43 0 1664.86 0 0 -1435.06 2016.59 0 0 0 0 0 0 0 0 0 0 0 0 0 453.124 0 2096.24 0 -608.31 0 0 0 2024.67 0 0 0 0 0 0 0 0 0 0 0 0 -1361.96 0 0 0 0 0 0 0 0 0 0 0 -1334.5 0 0 0.06 0 0 0 0 
0 2243.49 0 0 0 0 0 0 1183.58 0 0 0 0 0 0 0 1710.79 0 0 -2377.01 0 0 1525.09 0 0 0 0 0 0 0 0 0 0 0 0 0 0 0 0 0 0 0 0 0 0 0 946.913 0 0 0 0 0 0 0 0 0 0 0 0 0 0 -1961.5 0 0 0.04 0 0 0 
0 0 0 0 0 0 0 0 0 0 0 0 0 0 0 0 0 0 0 958.052 0 0 1152.76 0 0 0 0 0 0 0 0 499.969 0 0 0 0 0 0 0 0 -664.922 575.655 0 986.282 1560.18 0 0 0 0 0 107.654 0 0 0 783.181 0 -1702.86 0 0 0 0 0 -723.365 0 0 0.06 0 0 
0 0 0 0 0 0 2408.44 0 0 760.598 0 0 0 0 146.87 0 2099.44 0 0 1351.13 0 0 1750.77 0 0 0 0 0 0 0 0 0 0 0 0 0 0 0 0 0 0 0 0 0 1266.9 0 0 -2240.14 0 0 0 -2119.89 0 -1528.6 0 559.786 0 0 0 0 0 0 0 0 0 0 0.02 0 
0 0 2252.8 0 0 0 0 0 0 0 -1232.72 0 0 0 0 0 0 0 0 -683.691 0 0 0 0 0 0 0 0 0 0 0 0 0 1357.23 0 0 0 0 0 0 0 0 0 0 0 1806.31 -1179.92 0 0 0 0 0 0 0 0 0 0 0 0 0 0 0 0 0 0 0 0 0.03 
