*Vertices 54
*Matrix 
0.06 0 2191 1952.8 0 -1290.09 0 0 2400.2 0 -1950.36 0 -2111.96 0 1068.07 823.618 -2312.62 0 0 0 0 0 0 0 0 0 0 0 0 0 0 0 0 0 0 0 0 0 0 0 1680.58 0 0 0 0 0 0 346.461 0 0 0 0 0 0 
0 0.04 0 0 2272.33 0 0 0 0 0 0 0 2230.98 0 334.101 -968.734 -2177.11 1742.68 0 0 0 0 812.021 0 0 0 -1041.83 0 0 -1730.48 0 -248.039 0 371.639 0 0 61.5711 0 0 0 0 0 646.916 0 0 0 0 0 0 2180.01 0 0 0 369.655 
2313.84 0 0.07 0 0 0 950.27 0 0 0 0 0 0 2448.27 0 0 2000.26 0 0 0 0 0 0 2367.4 0 0 0 1468.78 0 0 0 -1137.5 0 0 0 0 0 0 0 0 0 0 0 0 -1420.87 0 0 0 0 0 0 1487.24 0 0 
-71.1844 0 0 0.03 -189.138 0 0 0 0 0 0 0 0 0 -90.4111 960.646 0 0 0 2314.6 2465.97 0 0 0 0 -1036.33 0 0 0 0 0 0 0 -1674.63 1653.72 0 0 0 0 0 0 0 0 0 0 0 1231.8 0 0 0 0 0 0 -1685.16 
0 1638.16 0 -1821.73 0.04 0 -1728.64 0 1535.31 1423.92 0 1849.35 0 0 0 603.122 989.792 0 0 0 0 0 0 0 0 0 0 0 0 0 1578.95 0 0 0 0 0 1198.39 268.334 0 0 0 0 0 0 0 421.537 0 0 0 615.177 0 0 0 0 
2105.09 0 0 0 0 0.03 0 0 0 0 -34.257 1335.72 0 0 0 1173.51 0 0 531.861 0 920.82 0 0 0 797.678 0 0 0 0 0 0 0 0 0 0 0 0 0 -1361.81 0 0 0 0 0 0 -1414.46 0 0 1010.39 0 0 -998.794 0 0 
0 0 -1856.97 0 1893.44 0 0.01 0 0 0 0 0 1137.35 0 -1405.3 0 0 0 0 2214.04 0 555.055 0 0 0 0 0 0 0 0 0 0 0 0 0 0 0 0 0 0 0 -385.83 0 0 0 0 0 0 0 0 0 0 0 0 
0 0 0 0 0 0 0 0.06 1462.83 0 -1464.35 0 0 0 1047.01 0 0 0 0 0 0 0 0 0 0 0 0 0 0 0 0 0 0 0 0 0 0 746.254 0 693.762 0 0 0 0 0 0 0 0 0 0 666.753 0 -2412.26 0 
1350.52 0 0 0 1410.95 0 0 -2097.31 0.01 0 -1055.71 0 0 1069.14 0 0 1665.62 0 0 0 0 0 854.442 0 0 1508.45 0 0 0 0 0 0 0 0 0 0 0 0 0 0 0 -1990.34 0 0 0 0 0 0 0 0 0 0 0 -588.168 
0 0 0 0 2145.53 0 0 0 0 0.06 0 0 1171.83 -130.238 0 810.19 441.832 -2003.62 0 0 0 0 1381.8 1993.39 0 0 0 0 0 0 0 0 0 1413.24 0 428.251 0 0 0 0 0 0 0 0 0 0 0 0 0 0 -1471.68 613.346 0 0 
2005.45 0 0 0 0 1038.77 0 1518.98 -1024.43 0 0.03 0 0 85.9859 0 0 0 2046.49 0 0 0 -2202.29 0 0 0 0 0 0 1190.3 0 0 -376.37 0 0 0 0 0 0 0 -344.63 109.485 0 0 0 0 0 0 0 0 0 0 0 0 0 
0 0 0 0 1877.27 -1514.25 0 0 0 0 0 0.06 0 0 0 0 1259.73 0 515.381 0 0 0 0 0 0 0 0 0 0 0 0 0 0 0 0 0 0 0 0 0 0 0 0 0 0 0 0 0 0 0 0 0 0 -295.801 
-1082.72 2306.82 0 0 0 0 2291.41 0 0 845.134 0 0 0.05 0 -1826 0 0 0 -517.365 0 0 0 0 0 0 0 0 0 0 0 0 0 0 0 0 0 0 0 882.519 0 0 0 0 0 0 0 0 0 0 0 0 0 0 0 
0 0 536.744 0 0 0 0 0 563.753 2180.93 2249.14 0 0 0.02 0 0 0 0 0 1063.04 -637.608 0 0 0 0 0 -32.1207 0 0 0 0 0 0 0 0 0 0 0 0 1032.21 0 0 0 1833.78 0 -615.482 0 0 0 0 0 0 1832.26 0 
1751.84 718.177 0 955.458 0 0 1523.26 761.666 0 0 0 0 424.284 0 0.01 0 0 -229.27 0 0 0 0 1013.9 0 0 0 0 0 0 0 0 0 0 0 0 0 0 0 0 0 -2210.07 0 0 0 0 0 0 0 0 -378.658 0 0 -855.815 0 
563.753 282.83 0 124.439 1707.59 -2399.29 0 0 0 -626.011 0 0 0 0 0 0.06 0 0 0 -781.35 0 0 0 0 2177.72 0 0 0 0 0 0 0 0 0 983.688 772.347 -1649.3 1455.5 1989.73 184.713 -1535.92 0 0 0 0 0 0 0 0 0 -2168.57 0 0 0 
-1313.75 -282.372 -1504.64 0 1150.01 0 0 0 872.448 1309.47 0 2417.75 0 0 0 0 0.02 1017.72 0 0 0 0 2166.13 0 0 0 0 1418.58 0 0 -1087.45 0 2388.76 0 0 0 0 0 0 378.506 0 0 -367.214 0 0 0 0 0 0 0 0 0 0 0 
0 -12.4363 0 0 0 0 0 0 0 -755.715 2237.54 0 0 0 -589.541 0 -1404.08 0 2156.36 0 0 1721.47 -52.2629 0 0 2043.29 -563.448 0 0 0 0 0 0 0 0 0 0 0 0 0 0 0 0 0 0 2392.27 0 0 0 0 0 0 0 0 
0 0 0 0 0 1753.52 0 0 0 0 0 -2229.15 67.217 0 0 0 0 2188.1 0.07 2380.67 2148.73 0 0 0 0 0 0 0 0 0 0 0 1517.61 0 2250.97 0 0 0 0 0 0 0 0 1155.35 0 0 0 -2130.73 0 0 0 0 1768.78 0 
0 0 0 1158.71 0 0 -267.418 0 0 0 0 0 0 76.0674 0 2228.69 0 0 2462.16 0.05 0 0 0 0 0 0 0 0 0 0 -408.567 0 0 0 0 0 0 0 0 0 0 0 0 170.217 1415.98 -2017.81 0 1391.87 0 0 0 0 0 0 
0 0 0 937.758 0 998.337 0 0 0 0 0 0 0 -2431.79 0 0 0 0 2071.52 0 0.08 1865.67 0 1938.92 0 0 0 0 0 0 0 0 0 0 0 0 0 0 0 0 0 1013.6 0 0 0 2013.08 0 0 0 0 0 1423 0 0 
0 0 0 0 0 0 1118.27 0 0 0 -2177.27 0 0 0 0 0 0 -726.417 0 0 856.12 0.08 0 0 0 0 0 0 0 2480.62 0 0 0 0 0 0 0 0 0 0 0 0 0 0 0 0 0 0 -510.651 -917.615 0 0 0 0 
0 2028.95 0 0 0 0 0 0 708.258 253.227 0 0 0 0 -1451.54 0 140.156 2175.74 0 0 0 0 0.05 0 0 0 0 0 0 0 0 1703.01 0 0 0 0 2248.22 -2091.66 0 0 0 0 0 0 0 0 0 0 0 1621.68 0 0 0 0 
0 0 1283.23 0 0 0 0 0 0 944.472 0 0 0 0 0 0 0 0 0 0 721.839 0 0 0.08 0 2308.95 0 0 2088.61 0 0 346.614 0 0 0 0 0 0 0 0 0 0 0 0 0 0 1253.01 0 -2173.45 0 -2476.65 -2403.56 1209.07 0 
0 0 0 0 0 216.3 0 0 0 0 0 0 0 0 0 1073.72 0 0 0 0 0 0 0 0 0.04 309.076 0 0 0 0 0 2332.76 0 0 0 0 0 0 0 0 0 0 2248.53 0 0 0 -168.081 0 0 0 0 0 0 0 
0 0 0 -1110.95 0 0 0 0 448.698 0 0 0 0 0 0 0 0 2295.98 0 0 0 0 0 2407.68 -1856.52 0.03 0 0 0 0 0 0 0 0 0 0 0 0 0 0 -437.407 0 0 0 0 0 0 0 0 0 0 0 0 1874.07 
0 2158.35 0 0 0 0 0 0 0 0 0 0 0 28.7637 0 0 0 2269.59 0 0 0 0 0 0 0 0 0.05 0 0 0 0 0 0 0 0 0 0 0 0 0 0 0 0 0 0 0 0 0 0 0 0 0 -1123.62 0 
0 0 1781.59 0 0 0 0 0 0 0 0 0 0 0 0 0 -103.229 0 0 0 0 0 0 0 0 0 0 0.03 0 0 0 0 0 0 0 -445.494 0 0 0 0 0 0 0 0 0 0 0 0 0 0 0 0 0 0 
0 0 0 0 0 0 0 0 0 0 1279.87 0 0 0 0 0 0 0 0 0 0 0 0 1725.29 0 0 0 0 0.08 0 0 0 0 0 0 0 403.073 0 0 0 0 0 -1118.12 0 0 0 0 0 0 0 0 0 0 0 
0 891.369 0 0 0 0 0 0 0 0 0 0 0 0 0 0 0 0 0 0 0 2388.15 0 0 0 0 0 0 0 0 0 999.557 0 -1440.7 0 0 0 0 0 0 0 0 0 0 0 0 0 0 0 0 1591.92 0 0 0 
0 0 0 0 1595.74 0 0 0 0 0 0 0 0 0 0 0 2127.83 0 0 -1548.59 0 0 0 0 0 0 0 0 0 0 0.02 0 0 0 0 0 0 0 0 0 0 -20.9815 0 0 0 -1430.63 0 1439.63 0 0 0 0 0 0 
0 2380.83 578.555 0 0 0 0 0 0 0 -112.995 0 0 0 0 0 0 0 0 0 0 0 540.406 -18.9978 723.06 0 0 0 0 2331.69 0 0.09 -1596.5 0 0 55.62 0 0 299.158 0 0 0 0 0 -2024.22 0 0 0 0 0 0 0 0 0 
0 0 0 0 0 0 0 0 0 0 0 0 0 0 0 0 61.2659 0 2266.08 0 0 0 0 0 0 0 0 0 0 0 0 -2235.1 0.01 0 0 0 0 0 1148.34 0 0 0 0 0 0 0 0 0 0 0 0 0 0 0 
0 -1023.21 0 1889.32 0 0 0 0 0 2308.04 0 0 0 0 0 0 0 0 0 0 0 0 0 0 0 0 0 0 0 468.688 0 0 0 0.03 0 1781.75 0 0 0 0 0 0 0 0 0 0 0 0 0 0 0 0 0 0 
0 0 0 2400.36 0 0 0 0 0 0 0 0 0 0 0 1251.34 0 0 -671.484 0 0 0 0 0 0 0 0 0 0 0 0 0 0 0 0.08 0 0 -449.309 0 0 -907.697 0 0 0 0 0 0 0 0 0 0 0 0 0 
0 0 0 0 0 0 0 0 0 2136.83 0 0 0 0 0 -1546.6 0 0 0 0 0 0 0 0 0 0 0 -603.275 0 0 0 1775.8 0 2299.34 0 0.04 -191.275 0 0 0 0 0 0 0 0 0 -312.433 2354.43 0 -672.552 0 0 0 0 
0 -2473.14 0 0 1883.37 0 0 0 0 0 0 0 0 0 0 845.134 0 0 0 0 0 0 278.1 0 0 0 0 0 1517.15 0 0 0 0 0 0 -110.401 0.08 0 -461.974 0 1104.24 0 0 0 0 0 0 0 0 0 0 0 0 0 
0 0 0 0 1688.36 0 0 1865.83 0 0 0 0 0 0 0 -15.6407 0 0 0 0 0 0 1486.33 0 0 0 0 0 0 0 0 0 0 0 229.27 0 0 0.03 0 0 0 973.159 0 0 0 0 0 0 1492.13 0 0 0 0 0 
0 0 0 0 0 672.094 0 0 0 0 0 0 425.962 0 0 2055.65 0 0 0 0 0 0 0 0 0 0 0 0 0 0 0 225.15 -1792.28 0 0 0 100.177 0 0.02 1172.14 0 422.758 0 0 2220.91 0 0 0 2435.15 0 0 0 0 0 
0 0 0 0 0 0 0 58.8244 0 0 -1322.75 0 0 -416.501 0 1885.2 2236.01 0 0 0 0 0 0 0 0 0 0 0 0 0 0 0 0 0 0 0 0 0 -114.368 0.08 0 0 0 0 0 0 0 0 0 0 0 0 0 1753.52 
2111.65 0 0 0 0 0 0 0 0 0 -143.056 0 0 0 1443.75 -1606.27 0 0 0 0 0 0 0 0 0 1646.55 0 0 0 0 0 0 0 0 -1927.63 0 165.487 0 0 0 0.06 0 0 0 1515.17 0 0 -1842.94 0 0 0 0 0 0 
0 0 0 0 0 0 637.455 0 -1463.44 0 0 0 0 0 0 0 0 0 0 0 2079.15 0 0 0 0 0 0 0 0 0 855.51 0 0 0 0 0 0 -113.3 1240.35 0 0 0.02 0 0 723.365 0 0 0 0 0 0 0 0 0 
0 -699.103 0 0 0 0 0 0 0 0 0 0 0 0 0 0 218.741 0 0 0 0 0 0 0 2337.95 0 0 0 -1082.42 0 0 0 0 0 0 0 0 0 0 0 0 0 0 636.845 0 0 1797.46 0 0 0 0 0 0 0 
0 0 0 0 0 0 0 0 0 0 0 0 0 2321.01 0 0 0 0 1727.58 1107.75 0 0 0 0 0 0 0 0 0 0 0 0 0 0 0 0 0 0 0 0 0 0 463.958 0.02 0 52.2629 0 0 0 0 0 0 0 0 
0 0 -467.772 0 0 0 0 0 0 0 0 0 0 0 0 0 0 0 0 -935.774 0 0 0 0 0 0 0 0 0 0 0 624.79 0 0 0 0 0 0 2485.81 0 2227.32 738.929 0 0 0.03 0 0 0 0 -2084.03 0 0 0 0 
0 0 0 0 -2048.94 -718.94 0 0 0 0 0 0 0 1071.12 0 0 0 651.189 0 51.3474 1000.93 0 0 0 0 0 0 0 0 0 -357.448 0 0 0 0 0 0 0 0 0 0 0 0 1638 0 0.04 0 0 0 0 0 1439.33 0 0 
0 0 0 2089.37 0 0 0 0 0 0 0 0 0 0 0 0 0 0 0 0 0 0 0 2332.3 2016.74 0 0 0 0 0 0 0 0 0 0 -2416.07 0 0 0 0 0 0 785.623 0 0 0 0.08 0 0 0 0 0 0 0 
-866.344 0 0 0 0 0 0 0 0 0 0 0 0 0 0 0 0 0 1965.47 -2401.43 0 0 0 0 0 0 0 0 0 0 -567.263 0 0 0 0 1642.28 0 0 0 0 521.332 0 0 0 0 0 0 0 0 0 0 0 0 0 
0 0 0 0 0 1454.59 0 0 0 0 0 0 0 0 0 0 0 0 0 0 0 837.199 0 643.101 0 0 0 0 0 0 0 0 0 0 0 0 0 1289.48 -1843.39 0 0 0 0 0 0 0 0 0 0.04 0 0 0 0 0 
0 2301.02 0 0 -724.433 0 0 0 0 0 0 0 0 0 -541.627 0 0 0 0 0 0 1003.98 1162.53 0 0 0 0 0 0 0 0 0 0 0 0 -1632.05 0 0 0 0 0 0 0 0 -647.374 0 0 0 0 0.06 0 0 0 0 
0 0 0 0 0 0 0 19.6081 0 -2398.22 0 0 0 0 0 2408.44 0 0 0 0 0 0 0 -42.9548 0 0 0 0 0 1750.77 0 0 0 0 0 0 0 0 0 0 0 0 0 0 0 0 0 0 0 0 0.06 -503.174 0 0 
0 0 960.952 0 0 2278.59 0 0 0 1892.99 0 0 0 0 0 0 0 0 0 0 2420.8 0 0 -1697.06 0 0 0 0 0 0 0 0 0 0 0 0 0 0 0 0 0 0 0 0 0 -1052.51 0 0 0 0 2190.85 0.09 0 0 
0 0 0 0 0 0 0 1740.85 0 0 0 0 0 -2345.27 1845.38 0 0 0 284.204 0 0 0 0 -1827.22 0 0 2301.17 0 0 0 0 0 0 0 0 0 0 0 0 0 0 0 0 0 0 0 0 0 0 0 0 0 0.09 0 
0 1068.68 0 1284.91 0 0 0 0 1326.11 0 0 -1566.9 0 0 0 0 0 0 0 0 0 0 0 0 0 -1707.74 0 0 0 0 0 0 0 0 0 0 0 0 0 1804.03 0 0 0 0 0 0 0 0 0 0 0 0 0 0.01 
