*Vertices 56
*Matrix 
0.04 0 0 -2231.13 0 0 0 0 0 1442.84 0 495.392 8.92666 0 0 0 0 0 0 0 0 0 946.303 0 0 0 0 1664.1 0 0 0 0 0 0 2225.94 0 0 0 0 0 0 318.842 0 0 0 0 0 0 0 0 0 0 0 0 438.017 0 
0 0.01 0 0 474.639 541.932 0 0 0 0 938.673 0 0 0 0 0 0 0 2108.14 0 0 0 0 0 -1634.95 0 0 0 -1965.77 0 0 0 1964.25 0 0 0 0 0 0 0 1227.53 0 0 0 0 0 0 0 0 -1259.12 0 0 2470.7 0 0 0 
0 0 0.07 0 0 0 -417.57 0 0 0 0 0 0 0 0 0 834.147 0 0 -215.537 0 0 0 0 0 0 1597.11 0 0 0 0 0 0 0 0 0 0 0 0 1462.68 819.346 0 0 0 0 0 0 0 0 0 0 0 0 0 0 0 
441.527 0 0 0.06 -48.2955 0 1091.11 0 0 0 0 0 0 0 0 2347.1 0 0 0 0 0 0 0 2049.7 0 -1753.82 0 0 0 0 0 0 0 0 0 0 0 0 0 0 0 0 0 0 0 0 -2470.55 0 0 -481.353 -1112.32 0 0 0 0 0 
0 2.82296 0 670.11 0.02 0 0 0 0 0 0 0 0 0 0 0 0 0 978.042 0 2430.88 0 0 0 0 0 0 0 -1416.44 0 0 0 123.981 0 0 0 875.958 0 0 0 0 0 -2124.32 0 1230.74 0 0 0 -1123.46 0 0 1378.29 0 59.4348 0 0 
0 -982.62 0 0 0 0.02 0 0 0 0 0 0 0 0 0 0 0 0 0 0 0 0 0 0 0 1718.42 0 0 0 0 0 0 0 0 1886.12 0 0 0 0 0 0 0 0 0 763.802 0 0 0 0 0 0 0 -1251.49 0 0 0 
0 0 174.947 2243.95 0 0 0.08 0 0 0 0 0 0 0 0 0 -171.285 0 0 0 0 0 -1050.07 0 0 0 0 0 0 0 0 0 667.821 0 0 0 0 0 0 0 0 0 -1504.49 0 0 0 0 919.752 0 0 1846.14 0 0 0 0 0 
0 0 0 0 0 0 0 0.09 0 1977.07 0 0 2491.15 0 0 0 0 0 0 0 0 0 0 0 0 0 0 0 0 0 0 0 0 0 0 0 0 0 0 0 0 0 0 0 0 0 -1965.16 0 0 0 0 0 0 0 0 0 
0 0 0 0 0 0 0 0 0.01 0 2117.91 0 699.561 0 0 0 0 0 0 0 0 0 0 0 0 0 0 1002 0 0 0 0 0 -1849.5 0 1569.34 0 0 0 0 0 0 -429.472 1215.63 0 0 0 0 0 0 0 0 0 0 0 0 
642.491 0 0 0 0 0 0 588.626 0 0.05 0 0 0 0 0 0 0 0 0 -2325.59 0 0 0 0 0 0 0 0 0 0 0 0 0 0 2189.17 0 1438.11 0 0 -378.658 0 0 0 0 0 0 0 1611.3 0 0 0 0 0 0 0 0 
0 -1586.12 0 0 0 0 0 0 2432.4 0 0.03 0 0 0 0 0 0 0 0 0 0 1136.89 0 0 0 0 0 0 1344.26 -2058.85 0 0 0 0 -779.366 0 0 2212.67 0 0 0 0 0 0 0 0 0 0 -1304.13 0 0 0 0 0 676.977 0 
-798.898 0 0 0 0 0 0 0 0 0 0 0.02 0 0 0 0 0 0 0 2137.29 0 0 0 0 0 0 0 0 0 0 0 0 0 0 0 0 0 0 0 0 0 0 0 0 0 0 0 0 0 0 0 0 0 1699.04 -431.15 0 
1370.51 0 0 0 0 0 0 1913.13 -765.481 0 0 0 0.02 0 0 -1012.68 0 0 0 0 0 0 0 0 0 0 0 451.598 0 0 0 0 2024.67 -1182.21 0 0 0 0 0 0 0 0 0 0 1610.23 0 0 1446.65 -328.455 0 431.761 0 0 0 0 0 
0 0 0 0 0 0 0 0 0 0 0 0 0 0.09 0 0 0 0 0 0 1387.45 0 0 0 0 1974.17 0 0 0 0 0 0 2401.43 -594.882 0 -2480.16 0 0 0 0 0 0 0 0 0 0 0 1670.81 0 0 0 0 0 0 0 0 
0 0 0 0 0 0 0 0 0 0 0 0 0 0 0 0 0 0 0 0 0 1462.68 0 0 -2471.47 0 0 0 0 0 0 0 0 0 0 0 0 475.86 0 0 0 0 0 0 0 0 0 0 0 0 0 0 1374.63 0 0 0 
0 0 0 -75.457 0 0 0 0 0 0 0 0 -713.141 0 0 0.05 0 0 0 0 1000.02 0 -1226.92 0 0 0 0 0 0 0 0 0 0 0 0 0 810.495 0 0 0 0 0 0 0 0 0 -990.097 0 1281.85 0 0 0 0 2137.44 0 0 
0 0 -1583.22 0 0 0 -1231.96 0 0 0 0 0 0 0 0 0 0.02 -1984.39 0 0 0 0 0 0 744.575 0 0 0 0 0 0 1895.12 0 0 0 0 0 0 1802.8 1615.27 0 0 0 0 0 0 0 0 0 0 0 0 0 0 0 0 
0 0 0 0 0 0 0 0 0 0 0 0 0 0 0 0 1580.17 0.02 0 0 -781.35 0 0 0 0 0 1343.65 0 0 0 -1820.66 0 0 0 2428.28 0 0 0 0 200.583 0 0 -441.984 0 0 0 0 0 0 -1206.02 0 0 0 0 0 0 
0 1891.77 0 0 616.703 0 0 0 0 0 0 0 0 0 0 0 0 0 0.01 1527.68 -1169.39 0 0 0 0 0 0 0 0 0 0 0 0 0 2383.11 1314.81 0 0 0 0 0 0 0 0 0 0 0 0 0 -1501.28 0 0 0 0 0 0 
0 0 2234.03 0 0 0 0 0 0 2416.68 0 341.121 0 0 0 0 0 0 -1776.71 0.02 1150.01 0 0 0 0 0 0 0 0 0 -1753.67 0 0 0 0 385.983 0 -19.9133 0 0 0 1897.26 0 0 0 0 0 -1289.79 0 884.198 0 0 0 0 0 0 
0 0 0 0 1984.85 0 0 0 0 0 0 0 0 1068.22 0 -1048.69 0 384.762 2183.37 1935.87 0.01 0 0 0 0 0 0 1350.37 0 -2451.78 0 0 0 0 0 2158.35 0 1070.36 0 0 0 0 0 0 0 -1076.77 0 0 0 0 0 0 0 0 0 0 
0 0 0 0 0 0 0 0 0 0 2481.84 0 0 0 1714.3 0 0 0 0 0 0 0.03 1418.58 0 0 0 0 0 -107.349 127.949 0 0 0 0 0 0 0 0 -511.872 0 -1107.75 0 0 2271.87 0 0 0 1530.88 0 -755.562 0 -1212.12 0 0 0 0 
-1822.95 0 0 0 0 0 -1414.3 0 0 0 0 0 0 0 0 2494.81 0 0 0 0 0 1492.89 0.06 0 0 0 0 0 0 0 0 0 -199.21 1863.84 0 0 0 0 0 0 0 1639.38 0 0 0 0 0 0 0 0 680.639 0 0 0 0 0 
0 0 0 -342.341 0 0 0 0 0 0 0 0 0 0 0 0 0 0 0 0 0 0 0 0.07 0 -637.761 0 0 0 0 0 0 0 0 0 0 0 0 0 0 1486.33 0 0 0 0 0 0 0 0 0 0 0 0 0 0 0 
0 -2093.65 0 0 0 0 0 0 0 0 0 0 0 0 -2068.01 0 852.611 0 0 0 0 0 0 0 0.07 0 0 1168.94 0 0 0 0 0 0 0 0 0 0 0 0 0 1482.67 2052.75 0 -923.414 0 0 0 0 0 0 0 0 0 0 0 
0 0 0 941.42 0 -1645.63 0 0 0 0 0 0 0 1170.61 0 0 0 0 0 0 0 0 0 704.138 0 0.03 0 0 0 0 -1710.79 0 0 0 0 0 0 0 0 0 0 0 602.359 0 0 0 0 0 0 0 -600.07 0 0 0 1039.84 0 
0 0 1110.95 0 0 0 0 0 0 0 0 0 0 0 0 0 0 -1305.81 0 0 0 0 0 0 0 0 0.07 0 -438.78 0 0 2167.35 0 0 0 0 0 0 1874.37 0 0 0 0 0 2133.93 -2197.56 0 0 0 0 0 0 0 0 0 0 
-544.374 0 0 0 0 0 0 0 1251.34 0 0 0 -588.015 0 0 0 0 0 0 0 1885.2 0 0 0 1384.24 0 0 0.04 0 44.0229 0 538.27 0 0 0 1579.71 0 0 0 0 0 0 0 -792.032 0 1598.64 0 0 0 0 0 0 0 0 -1635.41 0 
0 -1796.09 0 0 2009.72 0 0 0 0 0 -558.412 0 0 0 0 0 0 0 0 0 0 642.033 0 0 0 0 -7.85852 0 0.02 0 0 2205.04 0 -2109.21 0 0 0 0 0 0 0 -841.014 0 1507.08 1750.31 0 0 0 0 0 0 0 0 0 0 0 
0 0 0 0 0 0 0 0 0 0 -1379.82 0 0 0 0 0 0 0 0 0 1351.44 1211.97 0 0 0 0 0 -1310.85 0 0.01 337.916 0 2059.92 0 0 1750.62 0 0 0 0 0 0 0 0 0 0 0 0 0 1611.91 0 0 -865.276 0 0 0 
0 0 0 0 0 0 0 0 0 0 0 0 0 0 0 0 0 282.83 0 1444.52 0 0 0 0 0 704.291 0 0 0 2312.31 0.02 0 0 0 0 0 0 0 0 0 0 0 0 0 0 -2305.75 0 0 0 0 0 0 0 0 0 0 
0 0 0 0 0 0 0 0 0 0 0 0 0 0 0 0 997.574 0 0 0 0 0 0 0 0 0 -875.042 -759.835 374.386 0 0 0.06 0 1430.33 0 0 0 0 0 0 0 0 0 2160.02 0 0 2200.77 0 0 0 0 -2174.37 0 0 713.904 0 
0 2241.05 0 0 102.924 0 1558.35 0 0 0 0 0 1129.72 2096.85 0 0 0 0 0 0 0 0 -1641.21 0 0 0 0 0 0 -1661.35 0 0 0 0 0 0 0 0 0 0 -1804.18 0 0 0 0 0 0 0 0 2236.78 0 -559.633 0 0 974.685 0 
0 0 0 0 0 0 0 0 -864.36 0 0 0 1134.6 795.541 0 0 0 0 0 0 0 0 2060.99 0 0 0 0 0 2189.63 0 0 945.997 0 0.02 0 0 0 0 0 0 0 0 0 0 0 1462.68 177.847 0 0 0 0 0 0 0 0 -44.7859 
-1467.71 0 0 0 0 1317.56 0 0 0 -719.245 -192.495 0 0 0 0 0 0 991.165 -1621.37 0 0 0 0 0 0 0 0 0 0 0 0 0 0 0 0.06 0 0 470.061 0 0 0 0 0 0 0 0 0 0 0 1443.3 0 0 1631.6 0 0 0 
0 0 0 0 0 0 0 0 2441.25 0 0 0 0 -556.886 0 0 0 0 1259.42 1065.48 -2271.87 0 0 0 0 0 0 1124.68 0 1219.9 0 0 0 0 0 0.08 0 0 0 0 0 0 0 0 0 1166.19 0 0 0 0 0 0 0 0 0 0 
0 0 0 0 869.701 0 0 0 0 1037.71 0 0 0 0 0 -192.953 0 0 0 0 0 0 0 0 0 0 0 0 0 0 0 0 0 0 0 0 0.04 0 0 0 0 0 0 0 0 0 1368.98 0 0 -1155.05 0 0 0 0 0 0 
0 0 0 0 0 0 0 0 0 0 879.315 0 0 0 1227.68 0 0 0 0 -455.107 2112.87 0 0 0 0 0 0 0 0 0 0 0 0 0 1634.5 0 0 0.07 0 0 0 0 -1485.11 0 0 0 0 0 -934.706 0 0 2321.92 0 0 0 0 
0 0 0 0 0 0 0 0 0 0 0 0 0 0 0 0 570.772 0 0 0 0 -1630.53 0 0 0 0 1379.82 0 0 0 0 0 0 0 0 0 0 0 0 -2010.94 1527.53 0 0 2446.75 0 0 0 0 2185.51 0 0 0 1945.02 0 0 0 
0 0 1999.5 0 0 0 0 0 0 872.143 0 0 0 0 0 0 1611.91 -95.9044 0 0 0 0 0 0 0 0 0 0 0 0 0 0 0 0 0 0 0 0 1185.72 0.04 0 0 0 0 0 0 1971.42 -283.288 0 0 0 0 0 0 0 0 
0 2238.46 326.472 0 0 0 0 0 0 0 0 0 0 0 0 0 0 0 0 0 0 1335.57 0 2056.26 0 0 0 0 0 0 0 0 821.024 0 0 0 0 0 1731.39 0 0.03 0 0 0 0 0 0 0 0 -281.152 0 0 0 0 0 0 
1977.98 0 0 0 0 0 0 0 0 0 0 0 0 0 0 0 0 0 0 -1371.12 0 0 642.186 0 1739.94 0 0 0 -2135.3 0 0 0 0 0 0 0 0 0 0 0 0 0.03 0 0 0 0 1095.69 0 2378.54 0 0 0 0 0 0 0 
0 0 0 0 -1309.32 0 1261.56 0 -1227.99 0 0 0 0 0 0 0 0 266.35 0 0 0 0 0 0 874.279 -915.479 0 0 0 0 0 0 0 0 0 0 0 1703.62 0 0 0 0 0 0 0 0 0 1097.06 -2116.69 0 0 1287.19 0 0 0 0 
0 0 0 0 0 0 0 0 -1054.8 0 0 0 0 0 0 0 0 0 0 0 0 1948.99 0 0 0 0 0 1814.71 1421.48 0 0 1456.11 0 0 0 0 0 0 1971.27 0 0 0 0 0 0 0 0 0 0 0 -1979.51 0 0 0 0 0 
0 0 0 0 -1043.35 1400.11 0 0 0 0 0 0 1667.3 0 0 0 0 0 0 0 0 0 0 0 1198.39 0 -1367.31 0 2456.82 0 0 0 0 0 0 0 0 0 0 0 0 0 0 0 0.02 0 0 0 0 0 0 0 0 0 0 0 
0 0 0 0 0 0 0 0 0 0 0 0 0 0 0 0 0 0 0 0 -2086.47 0 0 0 0 0 -155.263 -1900.77 0 0 2435.76 0 0 1807.99 0 1608.25 0 0 0 0 0 0 0 0 0 0.07 0 0 0 0 0 0 0 2452.39 0 0 
0 0 0 2121.27 0 0 0 1511.66 0 0 0 0 0 0 0 -1924.42 0 0 0 0 0 0 0 0 0 0 0 0 0 0 0 2367.24 0 608.31 0 0 -1568.12 0 0 2481.69 0 -2306.97 0 0 0 0 0.03 0 0 0 0 0 0 0 0 0 
0 0 0 0 0 0 -1707.89 0 0 1479.92 0 0 1057.24 -139.088 0 0 0 0 0 1524.02 0 -26.1696 0 0 0 0 0 0 0 0 0 0 0 0 0 0 0 0 0 1961.65 0 0 -802.713 0 0 0 0 0.04 0 1394.62 503.479 1859.57 0 0 0 0 
0 0 0 0 -1113.85 0 0 0 0 0 -854.137 0 707.038 0 0 6.18 0 0 0 0 0 0 0 0 0 0 0 0 0 0 0 0 0 0 0 0 0 -955 2301.32 0 0 -1390.35 2365.57 0 0 0 0 0 0.01 0 0 -1133.84 0 0 567.873 0 
0 -297.021 0 -1394.62 0 0 0 0 0 0 0 0 0 0 0 0 0 1468.47 1271.78 -1255.61 0 459.99 0 0 0 0 0 0 0 -1814.86 0 0 2289.42 0 -1983.47 0 1472.75 0 0 0 2009.41 0 0 0 0 0 0 1524.17 0 0.02 0 0 0 0 -918.836 0 
0 0 0 479.369 0 0 458.007 0 0 0 0 0 590.915 0 0 0 0 0 0 0 0 0 1667.15 0 0 -277.795 0 0 0 0 0 0 0 0 0 0 0 0 0 0 0 0 0 -2375.18 0 0 0 1555.3 0 0 0.02 0 0 0 0 0 
0 0 0 0 1116.6 0 0 0 0 0 0 0 0 0 0 0 0 0 0 0 0 -1211.05 0 0 0 0 0 0 0 0 0 2341.15 -377.285 0 0 0 0 -1449.55 0 0 0 0 1287.65 0 0 0 0 -1286.13 772.195 0 0 0.04 0 0 0 0 
0 1435.82 0 0 0 492.187 0 0 0 0 0 0 0 0 1108.81 0 0 0 0 0 0 0 0 0 0 0 0 0 0 -521.027 0 0 0 0 694.372 0 0 0 -1024.74 0 0 0 0 0 0 0 0 0 0 0 0 0 0.04 0 0 0 
0 0 0 0 2413.79 0 0 0 0 0 0 2127.06 0 0 0 2131.95 0 0 0 0 0 0 0 0 0 0 0 0 0 0 0 0 0 0 0 0 0 0 0 0 0 0 0 0 0 1838.66 0 0 0 0 0 0 0 0.03 0 0 
-4.80667 0 0 0 0 0 0 0 0 0 1342.59 -1025.19 0 0 0 0 0 0 0 0 0 0 0 0 0 1722.08 0 1765.42 0 0 0 1269.8 -1439.02 0 0 0 0 0 0 0 0 0 0 0 0 0 0 0 -2222.13 683.081 0 0 0 0 0.05 0 
0 0 0 0 0 0 0 0 0 0 0 0 0 0 0 0 0 0 0 0 0 0 0 0 0 0 0 0 0 0 0 0 0 270.47 0 0 0 0 0 0 0 0 0 0 0 0 0 0 0 0 0 0 0 0 0 0.02 
