*Vertices 43
*Matrix 
0.09 0 0 0 0 1703.01 0 0 0 0 0 0 0 0 0 0 0 0 0 0 0 0 0 0 2480.47 715.125 0 0 0 0 0 0 0 0 0 0 0 0 0 0 249.413 539.186 0 
0 0.06 0 0 0 0 0 0 0 0 0 0 0 0 0 0 0 -2387.54 0 0 0 0 0 558.718 0 -123.371 0 0 0 0 0 0 0 0 0 344.325 0 0 0 1895.28 2413.63 0 0 
0 0 0.07 -774.026 0 1201.28 0 0 0 0 0 0 1572.39 0 0 0 1942.58 2157.43 0 0 0 0 -2108.75 328.15 0 0 0 0 0 0 0 0 0 0 0 0 -145.497 0 0 0 0 0 0 
0 0 -1325.5 0.03 0 592.746 0 0 0 2469.18 0 0 0 0 -380.947 0 0 0 0 0 0 184.408 0 0 0 0 0 0 0 0 0 2070.3 0 0 0 0 0 0 0 0 0 -1753.67 0 
0 0 0 0 0.09 0 0 0 0 0 0 0 672.857 0 0 -550.02 0 0 0 0 2388.15 996.658 0 0 0 1493.5 0 0 1493.19 0 0 0 0 0 0 0 0 0 0 -624.485 0 859.02 0 
1828.44 0 -1964.55 59.1296 0 0.09 0 0 0 0 0 0 0 0 0 0 1264 0 0 0 0 -150.99 0 0 0 0 639.744 0 2142.32 0 0 0 1938.92 0 0 0 0 0 0 0 0 0 0 
0 0 0 0 0 0 0.01 0 0 0 2145.99 0 0 976.211 0 0 0 0 0 0 0 2001.02 0 0 0 0 0 0 0 0 0 0 0 0 0 0 0 0 0 0 0 0 0 
0 0 0 0 0 0 0 0.02 0 0 0 -1057.08 0 1463.13 0 0 0 0 0 0 2081.29 0 0 0 -1939.38 0 0 0 0 0 0 0 0 0 0 0 0 0 0 2005.75 0 1187.55 0 
0 0 0 0 0 0 0 0 0.02 0 0 319.91 0 0 0 0 0 0 0 0 0 0 0 0 0 0 0 636.235 0 -1369.75 0 0 0 2033.68 0 0 0 0 0 0 0 0 0 
0 0 0 -146.718 0 0 0 0 0 0.05 0 0 0 0 0 0 0 0 0 0 0 0 0 1093.4 0 0 0 0 0 0 172.201 0 0 0 1356.32 0 0 -1066.55 0 0 0 0 0 
0 0 0 0 0 0 140.919 0 0 0 0.07 0 0 0 0 0 0 0 0 0 0 0 0 0 0 0 0 -125.813 790.201 0 -1608.86 0 2143.54 0 0 0 0 0 0 0 -320.826 0 0 
0 0 0 0 0 0 0 367.214 -588.473 0 0 0.01 0 0 -587.252 0 2153 0 0 0 0 0 0 0 0 0 1776.41 0 0 0 0 0 96.3622 0 0 1541.57 0 583.285 0 0 0 0 0 
0 0 434.812 0 1558.35 0 0 0 0 0 0 0 0.08 0 0 0 0 0 0 0 0 0 0 0 371.639 1046.1 0 0 0 0 0 0 0 0 0 0 0 0 0 0 0 0 0 
0 0 0 0 0 0 2372.89 -1206.02 0 0 0 0 0 0.05 0 -204.55 0 0 0 1289.64 -1399.04 0 0 0 -1891.92 1439.79 0 0 0 0 0 0 0 -492.798 0 0 0 0 0 0 0 0 0 
0 0 0 970.412 0 0 0 0 0 0 0 -1349.91 0 0 0.03 0 0 0 0 0 1536.99 0 2084.19 0 0 0 0 0 0 0 139.546 0 0 0 0 0 0 0 0 0 0 0 0 
0 0 0 0 2319.33 0 0 0 0 0 0 0 0 829.875 0 0.07 0 0 0 0 0 0 836.894 -1365.32 0 0 0 0 -2407.22 0 0 0 -1106.98 619.755 0 2269.74 1672.49 0 0 0 0 0 0 
0 0 2081.44 0 0 -2261.19 0 0 0 0 0 971.633 0 0 0 0 0.04 0 0 0 1078.91 0 0 0 0 0 0 0 0 1957.99 0 0 -131.611 0 0 0 0 0 0 0 1643.5 0 0 
0 1689.89 2398.07 0 0 0 0 0 0 0 0 0 0 0 0 0 0 0.01 0 0 0 -1148.49 0 0 1508 0 0 0 0 0 0 0 0 0 0 2376.71 0 0 0 0 0 0 0 
0 0 0 0 0 0 0 0 0 0 0 0 0 0 0 0 0 0 0.05 0 0 0 0 0 54.5518 0 0 509.735 0 0 0 0 0 0 484.71 0 0 0 0 0 0 0 0 
0 0 0 0 0 0 0 0 0 0 0 0 0 1424.22 0 0 0 0 0 0.09 0 997.879 0 0 0 0 0 0 0 1345.48 0 0 -1066.85 0 0 0 0 0 0 2169.94 0 0 0 
0 0 0 0 1374.94 0 0 546.205 0 0 0 0 0 -1405.76 1294.06 0 1343.35 0 0 0 0.05 0 0 0 2496.19 0 0 0 1441.31 -2202.14 0 0 0 0 0 -798.593 0 0 1413.54 0 0 0 0 
0 0 0 -57.6037 193.869 1347.16 911.206 0 0 0 0 0 0 0 0 0 0 2153.31 0 -1538.97 0 0.08 0 0 0 0 0 0 0 0 0 0 0 0 0 488.22 0 0 0 0 0 0 0 
0 0 -2021.32 0 0 0 0 0 0 0 0 0 0 0 1896.65 1466.34 0 0 0 0 0 0 0.02 0 0 0 0 2234.34 0 0 0 -1415.68 -154.958 0 0 0 0 0 0 2439.73 1776.41 0 0 
0 115.436 563.906 0 0 0 0 0 0 -257.958 0 0 0 0 0 1502.35 0 0 0 0 0 0 0 0.02 0 1434.14 0 0 0 0 0 0 0 1576.82 1403.93 0 0 -996.811 -1308.4 0 0 0 0 
2308.04 0 0 0 0 0 0 1670.05 0 0 0 0 1937.39 2030.17 0 0 0 822.55 -959.731 0 -1372.49 0 0 0 0.03 0 0 0 0 0 0 0 0 0 0 2170.25 0 0 0 0 0 0 0 
2040.39 -342.189 0 0 2110.13 0 0 0 0 0 0 0 2330.93 -45.2437 0 0 0 0 0 0 0 0 0 797.372 0 0.08 0 0 0 0 1578.34 0 -1549.04 -1463.74 664.769 0 0 0 -1912.06 -765.328 0 0 0 
0 0 0 0 0 1337.09 0 0 0 0 0 2067.86 0 0 0 0 0 0 0 0 0 0 0 0 0 0 0.01 -86.9015 0 0 0 0 0 0 566.347 0 0 2177.42 0 0 0 0 0 
0 0 0 0 0 0 0 0 -1218.53 0 1791.21 0 0 0 0 0 0 0 -818.735 0 0 0 2246.39 0 0 0 -105.976 0.06 0 0 0 -684.912 0 0 0 0 0 0 0 -811.411 0 0 0 
0 0 0 0 -2021.77 1656.62 0 0 0 0 2056.57 0 0 0 0 556.886 0 0 0 0 1841.56 0 0 0 0 0 0 0 0.04 0 0 0 1127.28 0 434.202 0 0 0 0 0 0 0 0 
0 0 0 0 0 0 0 0 -1556.52 0 0 0 0 0 0 0 2368.62 0 0 1615.42 -1970.05 0 0 0 0 0 0 0 0 0.01 0 0 0 0 0 0 -904.645 0 0 1223.56 -486.847 1719.64 0 
0 0 0 0 0 0 0 0 0 -2116.99 1235.92 0 0 0 -1461.46 0 0 0 0 0 0 0 0 0 0 2009.41 0 0 0 0 0.02 0 0 0 0 0 1482.21 0 0 0 0 0 0 
0 0 0 552.919 0 0 0 0 0 0 0 0 0 0 0 0 0 0 0 0 0 0 1447.87 0 0 0 0 -2207.17 0 0 0 0.05 0 0 0 0 0 0 0 0 0 0 0 
0 0 0 0 0 517.06 0 0 0 0 998.642 1344.42 0 0 0 -896.1 364.315 0 0 148.701 0 0 -1789.07 0 0 -1264 0 0 1519.9 0 0 0 0.01 0 0 0 2448.88 0 0 0 0 0 0 
0 0 0 0 0 0 0 0 318.842 0 0 0 0 -251.244 0 2415.62 0 0 0 0 0 0 0 730.537 0 -1036.64 0 0 0 0 0 0 0 0.06 0 0 0 1889.93 0 0 0 2068.47 1917.1 
0 0 0 0 0 0 0 0 0 1446.5 0 0 0 0 0 0 0 0 203.177 0 0 0 0 1823.25 0 1724.22 -758.461 0 1452.3 0 0 0 0 0 0.01 0 0 0 0 0 -1278.34 0 0 
0 1864.76 0 0 0 0 0 0 0 0 0 1041.98 0 0 0 2054.73 0 -921.888 0 0 1436.89 611.057 0 0 1640.14 0 0 0 0 0 0 0 0 0 0 0.06 0 -761.971 0 0 0 0 0 
0 0 1269.49 0 0 0 0 0 0 0 0 0 0 0 0 1411.4 0 0 0 0 0 0 0 0 0 0 0 0 0 -1691.11 1330.38 0 -2295.83 0 0 0 0.09 0 0 0 182.577 1222.04 0 
0 0 0 0 0 0 0 0 0 -2102.34 0 1036.79 0 0 0 0 0 0 0 0 0 0 0 -1562.17 0 0 2117.45 0 0 0 0 0 0 2132.56 0 1414.61 0 0 0 0 0 0 0 
0 0 0 0 0 0 0 0 0 0 0 0 0 0 0 0 0 0 0 0 848.338 0 0 1184.04 0 1677.83 0 0 0 0 0 0 0 0 0 0 0 0 0.08 0 0 0 0 
0 306.177 0 0 2496.34 0 0 992.386 0 0 0 0 0 0 0 0 0 0 0 1976.15 0 0 -2245.93 0 0 1197.62 0 -2240.14 0 -31.9681 0 0 0 0 0 0 0 0 0 0.07 0 0 0 
760.292 2390.44 0 0 0 0 0 0 0 0 -821.177 0 0 0 0 0 483.947 0 0 0 0 0 -696.661 0 0 0 0 0 0 1581.39 0 0 0 0 -1790.44 0 225.303 0 0 0 0.02 1157.34 0 
-317.621 0 0 815.073 -7.09555 0 0 691.778 0 0 0 0 0 0 0 0 0 0 0 0 0 0 0 0 0 0 0 0 0 694.83 0 0 0 1258.66 0 0 952.406 0 0 0 -146.565 0.01 0 
0 0 0 0 0 0 0 0 0 0 0 0 0 0 0 0 0 0 0 0 0 0 0 0 0 0 0 0 0 0 0 0 0 1146.81 0 0 0 0 0 0 0 0 0.07 
