*Vertices 56
*Matrix 
0.02 0 0 0 0 0 0 0 0 0 0 252.77 0 0 0 0 0 0 -1943.04 0 1543.4 1406.22 -1862.93 2234.49 0 0 0 1259.42 0 0 0 0 1990.04 0 0 0 0 392.544 0 0 0 0 451.14 0 0 0 0 0 0 0 0 1783.88 0 0 0 0 
0 0 0 0 0 0 0 -531.861 -856.883 0 0 2410.43 0 0 0 0 1717.81 0 0 0 0 0 0 0 0 0 0 0 0 0 0 0 0 0 0 0 0 0 0 0 0 0 0 0 0 1995.83 -2147.82 -1828.75 0 2292.47 0 0 0 0 0 0 
0 0 0 0 0 0 1645.33 0 -412.534 87.6644 0 0 0 0 0 0 0 0 0 1126.06 0 0 0 0 0 0 43.5652 0 0 428.709 0 0 0 0 0 0 0 0 952.254 0 0 0 0 0 -184.103 0 0 0 0 0 0 0 0 0 0 0 
0 0 0 0.01 0 637.15 -1714.45 0 0 0 0 0 0 0 0 0 0 0 0 0 0 0 0 0 0 0 0 0 0 0 0 0 0 0 0 0 2414.4 0 0 0 0 1074.18 0 0 -1337.24 0 0 0 0 0 0 0 0 0 0 0 
0 0 0 0 0.05 0 0 -142.293 0 326.777 0 1245.23 0 0 0 0 0 0 0 0 0 -128.559 -400.327 1623.97 0 0 -384.915 0 0 0 0 0 0 0 0 1219.75 0 0 426.572 -204.245 0 0 0 0 0 0 0 0 0 -24.3385 0 0 0 0 1808.6 0 
0 0 0 490.509 0 0.08 0 0 0 0 0 0 0 0 0 0 2051.99 0 0 0 0 0 0 0 0 0 0 0 0 0 0 0 0 0 0 0 0 134.816 0 0 0 0 2070.6 0 0 0 1208.76 0 0 0 0 0 0 0 0 0 
0 0 2107.23 2190.39 0 0 0.06 0 0 0 0 0 0 0 0 0 0 0 -684.454 0 0 0 0 1550.26 0 0 0 0 407.193 0 0 0 0 0 0 0 0 1447.26 0 0 0 0 0 0 0 0 0 0 0 0 -1206.47 0 -706.58 0 0 0 
0 572.756 0 0 -272.301 0 0 0.08 0 0 0 0 -1305.05 2044.66 0 0 2451.02 0 0 -5.26444 0 0 0 0 0 0 0 0 0 237.815 0 0 0 0 0 0 0 0 0 0 529.572 0 -401.395 0 0 0 0 0 0 0 0 0 0 0 0 0 
0 -486.541 -1677.53 0 0 0 0 0 0.09 1771.68 0 0 0 0 0 0 0 0 0 0 0 0 0 0 0 0 0 0 0 0 0 0 0 0 0 0 0 0 2281.18 0 0 0 0 0 0 0 -1673.41 0 0 0 0 0 1039.84 0 0 0 
0 0 -1096 0 563.448 0 0 0 1176.41 0.08 1925.64 0 0 0 956.374 1632.05 0 0 0 0 0 2004.23 0 1114.92 0 0 0 -2458.04 0 0 0 0 0 0 0 0 0 0 0 0 0 387.814 0 0 0 1458.1 0 0 0 1649.75 -1637.09 0 0 0 0 1280.63 
0 0 0 0 0 0 0 0 0 -1558.35 0.01 806.68 0 0 0 2267.3 1926.71 0 0 696.966 0 0 0 0 2435.61 0 0 -1619.39 0 0 0 0 502.716 0 0 0 -2120.2 718.482 2274.62 0 0 0 0 0 0 0 0 0 0 0 0 0 0 0 0 0 
-2362.36 682.623 0 0 -571.993 0 0 0 0 0 2263.79 0.08 0 0 0 0 0 0 0 0 -1219.9 0 0 0 0 0 2081.9 0 0 0 0 0 0 0 0 779.824 2441.71 0 0 0 0 0 0 0 -2250.66 0 0 0 0 0 0 0 0 0 0 0 
0 0 0 0 0 0 0 2314.29 0 0 0 0 0.09 0 -311.975 0 0 0 491.577 0 0 0 0 0 0 0 0 0 -19.9133 0 0 0 0 -1615.57 0 0 0 0 0 0 0 0 0 0 0 0 0 0 0 0 0 0 0 0 0 0 
0 0 0 0 0 0 0 2412.72 0 0 0 0 0 0.02 0 0 0 0 0 22.0496 0 503.479 0 1899.24 0 0 0 0 2131.03 0 0 0 0 -93.4629 0 0 2475.89 0 0 -812.021 0 0 0 1058.31 0 0 -891.369 0 0 0 0 0 0 0 0 0 
0 0 0 0 0 0 0 0 0 1755.5 0 0 1143.6 0 0.08 1748.94 0 0 645.848 0 0 1627.48 0 0 0 0 0 0 0 2414.55 0 0 0 0 0 770.363 0 0 0 0 0 -470.061 0 0 0 2231.74 0 0 0 0 0 0 -2496.95 0 0 0 
0 0 0 0 0 0 0 0 0 40.3607 2469.33 0 0 0 -2165.52 0.03 0 0 0 0 0 0 0 0 0 2146.44 0 0 371.334 0 0 0 0 0 0 0 0 0 0 0 0 0 -2414.55 0 -757.851 0 0 0 0 0 0 2382.66 0 0 0 0 
0 252.159 0 0 0 -290.46 0 -1006.73 0 0 783.639 0 0 0 0 0 0.09 0 0 0 1911.6 0 0 0 0 0 0 0 0 0 1148.49 0 0 0 0 0 0 0 0 -1713.54 0 2052.9 0 0 0 -951.186 0 0 0 0 0 0 0 0 0 0 
0 0 0 0 0 0 0 0 0 0 0 0 0 0 0 0 0 0.08 1237.91 0 0 0 0 0 0 0 0 0 0 0 0 0 0 696.509 0 0 0 0 2470.85 0 0 0 0 0 0 0 0 0 0 0 0 0 0 0 0 0 
305.261 0 0 0 0 0 1615.88 0 0 0 0 0 -242.393 0 551.088 0 0 255.821 0.02 0 0 0 0 0 0 0 0 0 0 0 141.53 0 0 0 1307.18 -587.71 0 0 0 0 0 0 0 0 0 0 0 0 2167.04 -782.571 0 0 0 0 0 0 
0 0 584.201 0 0 0 0 -1400.57 0 0 1481.29 0 0 1294.37 0 0 0 0 0 0.08 0 0 628.147 0 0 0 0 0 0 0 0 0 0 0 1377.22 0 0 0 0 0 -49.8215 0 0 0 0 0 0 0 0 0 179.983 2016.43 0 0 0 0 
687.201 0 0 0 0 0 0 0 0 0 0 -1839.58 0 0 0 0 2466.12 0 0 0 0.04 1363.64 0 0 0 0 0 0 0 0 0 0 0 0 0 0 0 0 0 0 0 0 0 0 0 0 1509.37 0 -168.691 0 0 0 0 0 0 0 
154.195 0 0 0 -102.466 0 0 0 0 41.8867 0 0 0 2060.08 2285.76 0 0 0 0 0 834.758 0.08 0 0 0 0 0 0 0 0 0 0 0 0 787.454 0 0 0 0 0 0 0 0 0 0 0 0 0 0 -2185.51 0 0 0 0 0 0 
-1338.47 0 0 0 -1206.93 0 0 0 0 0 0 0 0 0 0 0 0 0 0 1318.78 0 0 0.05 0 0 0 0 0 0 -450.072 1569.19 0 0 0 0 0 0 443.358 0 -1195.03 0 0 1410.79 0 0 0 0 0 2031.54 0 -1019.7 0 0 0 0 0 
-867.412 0 0 0 -61.4185 0 2184.9 0 0 1644.72 0 0 0 1538.82 0 0 0 0 0 0 0 0 0 0.04 0 0 0 0 0 0 805.46 0 0 0 0 1076.92 0 0 0 0 0 0 0 0 0 0 0 2111.5 0 0 204.55 -596.866 0 0 0 0 
0 0 0 0 0 0 0 0 0 0 292.749 0 0 0 0 0 0 0 0 0 0 0 0 0 0.07 0 0 0 0 0 0 0 0 1493.04 0 0 1101.64 0 0 0 0 1940.44 0 0 0 -2456.82 0 0 0 1177.63 -543.764 0 0 0 0 0 
0 0 0 0 0 0 0 0 0 0 0 0 0 0 0 380.184 0 0 0 0 0 0 0 0 0 0.07 0 0 0 0 0 0 0 0 0 0 1668.52 0 0 0 0 2019.03 0 0 0 -1533.63 0 0 0 0 0 0 1017.87 0 0 0 
0 0 241.478 0 1777.78 0 0 0 0 0 0 1066.09 0 0 0 0 0 0 0 0 0 0 0 0 0 0 0.06 0 2038.1 0 0 0 0 0 0 0 0 0 0 0 1175.65 0 0 1023.82 -1473.66 0 0 0 0 0 1571.32 0 0 0 0 0 
339.9 0 0 0 0 0 0 0 0 1822.79 -592.593 0 0 0 0 0 0 0 0 0 0 0 0 0 0 0 0 0.09 -163.503 0 0 0 0 0 0 1557.13 0 0 0 0 0 0 0 0 0 0 0 0 -1553.47 0 0 1427.73 0 1911.45 0 0 
0 0 0 0 0 0 1092.79 0 0 0 0 0 1107.75 -95.4466 0 -794.473 0 0 0 0 0 0 0 0 0 0 -1155.66 2288.35 0.02 187.765 0 0 -104.297 0 433.897 0 0 0 0 -639.897 171.133 0 0 0 0 0 0 0 0 0 0 -92.7 0 0 0 0 
0 0 -2052.6 0 0 0 0 2434.54 0 0 0 0 0 0 -1009.02 0 0 0 0 0 0 0 -600.681 0 0 0 0 0 2444.76 0.08 0 0 0 0 0 0 0 0 0 0 0 0 0 2097.31 0 0 0 0 0 0 0 0 0 0 0 0 
0 0 0 0 0 0 0 0 0 0 0 0 0 0 0 0 861.614 0 -1023.82 0 0 0 -591.525 2377.93 0 0 0 0 0 0 0.02 0 0 289.239 -234.764 0 134.816 0 0 0 0 0 0 0 0 0 0 0 0 0 0 1872.23 0 0 0 0 
0 0 0 0 0 0 0 0 0 0 0 0 0 0 0 0 0 0 0 0 0 0 0 0 0 0 0 0 0 0 0 0.05 0 -649.815 0 0 0 0 0 0 0 0 0 1139.94 0 0 0 0 0 0 0 0 0 0 0 0 
2209.77 0 0 0 0 0 0 0 0 0 -1053.27 0 0 0 0 0 0 0 0 0 0 0 0 0 0 0 0 0 774.331 0 0 0 0.03 0 0 2329.1 0 0 0 -1392.79 0 0 0 0 0 0 0 0 0 0 0 0 0 0 0 0 
0 0 0 0 0 0 0 0 0 0 0 0 -2299.19 474.487 0 0 0 956.526 0 0 0 0 0 0 671.484 0 0 0 0 0 613.193 1206.47 0 0.07 0 0 0 0 0 0 1665.47 0 0 0 0 0 0 0 -614.872 0 0 0 2199.24 0 0 0 
0 0 0 0 0 0 0 0 0 0 0 0 0 0 0 0 0 0 -493.408 -672.399 0 1785.87 0 0 0 0 0 0 965.224 0 -643.101 0 0 0 0.08 0 0 0 0 1888.71 0 0 1456.57 0 -1589.02 0 0 0 0 0 0 -531.404 0 0 0 0 
0 0 0 0 -604.953 0 0 0 0 0 0 -395.291 0 0 1470.76 0 0 0 1945.78 0 0 0 0 1448.94 0 0 0 2216.18 0 0 0 0 -591.678 0 0 0 0 0 0 0 0 0 0 0 -1509.37 0 0 0 0 0 0 0 0 0 0 0 
0 0 0 -1969.89 0 0 0 0 0 0 1922.44 1700.26 0 323.725 0 0 0 0 0 0 0 0 0 0 836.436 1509.37 0 0 0 0 1633.27 0 0 0 0 0 0.02 0 -1542.94 0 0 0 0 0 0 0 0 0 -2298.58 0 0 0 0 0 0 0 
1498.23 0 0 0 0 735.572 2484.74 0 0 0 2187.03 0 0 0 0 0 0 0 0 0 0 0 -1278.5 0 0 0 0 0 0 0 0 0 0 0 0 0 0 0.05 0 0 2461.24 0 0 0 0 0 0 0 0 0 -682.318 0 0 0 0 0 
0 0 2440.18 0 -2360.23 0 0 0 142.445 0 -1357.39 0 0 0 0 0 0 -33.7992 0 0 0 0 0 0 0 0 0 0 0 0 0 0 0 0 0 0 1887.8 0 0.08 0 0 0 0 1195.64 0 0 0 0 0 0 0 0 0 0 0 0 
0 0 0 0 -2327.11 0 0 0 0 0 0 0 0 1400.57 0 0 472.35 0 0 0 0 0 1814.1 0 0 0 0 0 1764.81 0 0 0 1004.29 0 1191.37 0 0 0 0 0.04 0 0 0 -306.177 0 0 1099.96 0 0 0 0 0 0 0 0 0 
0 0 0 0 0 0 0 2177.57 0 0 0 0 0 0 0 0 0 0 0 -501.495 0 0 0 0 0 0 2216.33 0 -71.7948 0 0 0 0 1039.38 0 0 0 -2482.91 0 0 0.04 0 0 0 0 0 0 0 0 0 2091.66 0 0 0 0 0 
0 0 0 604.19 0 0 0 0 0 602.206 0 0 0 0 143.513 0 -442.442 0 0 0 0 0 0 0 322.81 -258.873 0 0 0 0 0 0 0 0 0 0 0 0 0 0 0 0.09 0 0 0 0 0 -370.876 984.909 0 0 0 1889.32 0 0 0 
2306.51 0 0 0 0 664.769 0 1123 0 0 0 0 0 0 0 1332.82 0 0 0 0 0 0 1568.12 0 0 0 0 0 0 0 0 0 0 0 1242.64 0 0 0 0 0 0 0 0.08 0 0 0 -57.4511 0 0 0 0 0 0 0 0 0 
0 0 0 0 0 0 0 0 0 0 0 0 0 1512.88 0 0 0 0 0 0 0 0 0 0 0 0 -161.824 0 0 1516.24 0 -1889.32 0 0 0 0 0 0 488.678 1489.38 0 0 0 0.09 0 0 0 0 0 0 0 0 0 0 0 0 
0 0 1515.78 641.118 0 0 0 0 0 0 0 484.252 0 0 0 -601.901 0 0 0 0 0 0 0 0 0 0 571.23 0 0 0 0 0 0 0 1528.6 -1671.73 0 0 0 0 0 0 0 0 0.03 0 0 0 0 0 0 0 0 0 0 0 
0 -1253.93 0 0 0 0 0 0 0 2448.73 0 0 0 0 1230.28 0 2473.3 0 0 0 0 0 0 0 884.045 1107.29 0 0 0 0 0 0 0 0 0 0 0 0 0 0 0 0 0 0 0 0.07 0 0 0 -646.916 0 0 0 0 0 0 
0 -1637.09 0 0 0 2152.09 0 0 2437.44 0 0 0 0 2365.41 0 0 0 0 0 0 -1585.97 0 0 0 0 0 0 0 0 0 0 0 0 0 0 0 0 0 0 -2214.19 0 0 47.6852 0 0 0 0.01 0 0 0 0 0 0 0 0 0 
0 2128.28 0 0 0 0 0 0 0 0 0 0 0 0 0 0 0 0 0 0 0 0 0 2280.88 0 0 0 0 0 0 0 0 0 0 0 0 0 0 0 0 0 -992.233 0 0 0 0 0 0.06 0 0 0 0 0 0 0 0 
0 0 0 0 0 0 0 0 0 0 0 0 0 0 0 0 0 0 1730.63 0 1034.65 0 -890.606 0 0 0 0 -291.223 0 0 0 0 0 -765.328 0 0 -1181.75 0 0 0 0 861.003 0 0 0 0 0 0 0.02 0 0 0 1368.22 0 0 0 
0 2372.28 0 0 770.363 0 0 0 0 1403.47 0 0 0 0 0 0 0 0 2360.38 0 0 707.19 0 0 2031.69 0 0 0 0 0 0 0 0 0 0 0 0 0 0 0 0 0 0 0 0 2169.79 0 0 0 0.03 0 0 0 0 0 0 
0 0 0 0 0 0 1572.39 0 0 2246.7 0 0 0 0 0 0 0 0 0 1037.25 0 0 -738.624 -76.5252 2157.58 0 -955.458 0 0 0 0 0 0 0 0 0 0 1168.78 0 0 -1363.19 0 0 0 0 0 0 0 0 0 0.04 1887.8 0 0 0 0 
-3.43333 0 0 0 0 0 0 0 0 0 0 0 0 0 0 1136.59 0 0 0 2371.97 0 0 0 -64.4704 0 0 0 609.073 2314.45 0 1429.26 0 0 0 -2175.89 0 0 0 0 0 0 0 0 0 0 0 0 0 0 0 -2149.49 0.06 0 0 0 0 
0 0 0 0 0 0 1296.04 0 -2318.11 0 0 0 0 0 1998.73 0 0 0 0 0 0 0 0 0 0 -2269.59 0 0 0 0 0 0 0 -825.297 0 0 0 0 0 0 0 2343.59 0 0 0 0 0 0 1544.47 0 0 0 0.05 0 0 0 
0 0 0 0 0 0 0 0 0 0 0 0 0 0 0 0 0 0 0 0 0 0 0 0 0 0 0 1215.02 0 0 0 0 0 0 0 0 0 0 0 0 0 0 0 0 0 0 0 0 0 0 0 0 0 0.02 0 0 
0 0 0 0 293.054 0 0 0 0 0 0 0 0 0 0 0 0 0 0 0 0 0 0 0 0 0 0 0 0 0 0 0 0 0 0 0 0 0 0 0 0 0 0 0 0 0 0 0 0 0 0 0 0 0 0 0 
0 0 0 0 0 0 0 0 0 1956.62 0 0 0 0 0 0 0 0 0 0 0 0 0 0 0 0 0 0 0 0 0 0 0 0 0 0 0 0 0 0 0 0 0 0 0 0 0 0 0 0 0 0 0 0 0 0 
