*Vertices 65
*Matrix 
0.02 0 0 -1130.63 0 0 -11.5207 1062.43 0 -1532.26 0 1803.57 0 0 0 0 0 0 0 0 0 0 0 2342.52 0 0 0 0 0 0 0 -725.044 0 0 0 0 -481.964 1394.16 0 1889.93 0 -1540.8 0 0 0 0 0 831.706 0 0 0 0 0 0 0 0 0 0 0 0 0 0 0 0 0 
0 0.04 0 0 0 0 0 839.03 0 0 0 0 0 0 0 0 0 0 0 0 0 0 0 0 0 0 -2387.23 0 0 0 0 0 0 0 1638.46 0 0 0 0 0 299.158 0 0 2351.07 0 0 0 0 0 0 0 0 0 0 0 0 0 0 0 0 0 0 0 0 0 
0 0 0.01 0 0 0 0 0 0 0 0 0 0 -1499.3 0 0 0 0 0 0 0 0 0 612.278 0 0 0 0 0 0 0 -235.527 0 0 0 0 2011.55 0 0 0 -1619.54 0 0 0 2341.15 0 0 0 0 0 0 0 0 0 0 0 0 0 0 0 0 0 0 0 0 
2393.64 0 0 0.06 0 -1766.79 -1665.32 0 0 0 2209.92 0 0 0 0 0 0 -2137.75 735.878 0 0 0 0 0 0 0 0 0 0 0 0 0 2062.52 0 -45.8541 0 0 0 0 0 1060.9 0 0 0 0 0 0 0 0 2396.54 1326.41 0 0 0 0 0 0 0 0 0 0 0 0 0 0 
0 0 0 0 0.08 0 1457.34 0 0 443.968 -666.448 0 0 0 0 0 0 0 0 -702.002 -892.438 -724.433 73.6259 0 0 931.959 0 0 -643.254 0 0 0 0 0 0 -273.217 0 0 0 0 0 0 0 0 0 0 0 0 0 0 1236.08 0 0 0 0 0 0 0 0 0 0 1719.64 0 0 0 
0 0 0 880.383 0 0.07 0 0 0 0 0 2388.76 1347.32 0 0 0 0 459.685 0 0 0 -463.5 0 55.9252 0 0 0 -283.135 0 0 0 0 0 0 0 0 2120.96 -527.741 0 0 0 0 0 0 0 0 0 0 0 0 1152.3 -2075.03 0 0 0 0 0 0 0 0 0 0 0 0 0 
-769.448 0 0 304.956 -891.064 0 0.01 0 0 0 0 0 0 0 0 0 0 0 0 0 0 0 0 0 0 0 0 0 806.833 0 0 0 2437.28 0 0 533.387 0 0 0 0 0 0 1713.84 0 0 0 0 0 0 0 0 0 0 0 0 -1584.44 0 0 0 0 0 0 0 0 0 
1346.4 -508.362 0 0 0 0 0 0.07 2396.08 0 0 0 0 1932.66 0 0 0 0 0 0 0 0 0 0 0 0 0 0 0 0 0 0 0 0 0 0 0 0 0 0 0 0 0 0 0 0 -544.679 0 1030.69 0 -833.995 0 0 0 0 0 0 0 0 0 0 0 0 0 0 
0 0 0 0 0 0 0 1445.13 0.07 0 0 0 0 0 0 0 0 0 -1559.42 2164.14 0 949.507 0 0 608.921 0 0 0 0 0 0 0 0 0 0 0 0 0 -1290.09 0 0 0 0 0 0 0 0 0 0 0 961.867 0 0 0 0 0 0 0 0 0 0 0 0 0 0 
-1589.18 0 0 0 1133.53 0 0 0 0 0.02 0 0 1904.74 0 0 0 -459.075 0 0 0 0 -672.552 0 0 0 0 0 0 0 -1069.14 0 0 0.534074 0 0 0 2280.72 0 0 0 0 453.887 0 0 0 0 0 0 0 0 0 1835.46 0 0 0 0 0 0 0 0 0 0 0 0 0 
0 0 0 643.254 1353.27 0 0 0 0 0 0.07 0 0 0 0 0 0 0 0 1611.61 0 0 0 0 0 0 0 0 2467.04 0 0 -513.092 0 0 0 0 0 0 0 0 0 0 0 0 0 0 0 0 0 0 0 0 0 0 0 0 0 0 0 0 0 0 0 0 -2337.79 
1225.09 0 0 0 0 -289.697 0 0 0 0 0 0.04 0 0 0 0 743.049 0 514.008 0 0 0 0 0 604.495 0 -1865.67 0 0 0 537.507 0 0 0 -393.918 0 0 0 0 0 0 0 0 602.206 0 0 0 0 0 0 0 0 0 0 -815.683 0 0 0 0 0 0 0 0 0 0 
0 0 0 0 0 -370.724 0 0 0 307.092 0 0 0.06 0 0 0 0 0 0 0 0 0 0 0 0 0 0 -727.485 0 0 0 0 0 0 0 389.34 0 0 0 1179.77 0 0 0 0 -1006.12 0 0 0 0 0 0 0 0 0 0 0 0 0 0 0 0 0 0 0 0 
0 0 -2367.55 0 0 0 0 1937.24 0 0 0 0 0 0.08 0 1867.66 0 0 0 0 0 0 0 2246.24 0 0 0 0 0 0 0 0 0 0 0 0 0 -1970.05 0 0 0 513.703 0 0 0 0 0 0 0 2401.73 0 0 0 0 0 0 0 0 0 0 0 0 0 0 0 
0 0 0 0 0 0 0 0 0 0 0 0 0 0 0.05 906.018 0 0 0 0 -1255 -952.864 2122.33 2385.4 927.381 904.95 0 0 0 333.033 -2106.01 0 0 0 0 0 0 0 0 0 0 0 0 0 0 0 0 0 0 0 0 0 0 0 0 0 0 0 0 0 0 0 0 0 0 
0 0 0 0 0 0 0 0 0 0 0 0 0 -1392.48 -50.737 0.01 0 0 0 0 0 0 0 0 0 -1280.48 0 0 0 0 0 0 0 254.295 0 2178.03 0 2077.01 0 0 0 1055.41 1920.76 0 0 0 0 0 0 0 1866.74 0 0 0 0 0 0 0 0 0 0 0 0 0 0 
0 0 0 0 0 0 0 0 0 2498.78 0 186.697 0 0 0 0 0.05 0 0 0 0 0 0 0 -1686.68 2101.73 0 -2034.9 0 0 -210.654 0 0 0 0 0 0 0 0 0 1983.47 1230.74 0 0 0 0 0 0 0 0 1527.07 0 0 0 0 0 0 0 0 0 0 0 0 0 0 
0 0 0 1758.71 0 -450.53 0 0 0 0 0 0 0 0 0 0 0 0.02 0 0 0 0 0 0 0 0 0 0 0 181.967 2401.73 0 0 0 0 0 -1883.22 2073.96 0 0 0 0 0 0 0 0 0 0 0 0 0 610.599 0 0 0 0 0 0 0 0 0 0 0 0 0 
0 0 0 -741.371 0 0 0 0 -1759.16 0 0 2221.67 0 0 0 0 0 0 0.04 0 0 0 0 0 0 0 0 0 660.955 0 0 0 0 1637.7 0 0 0 1564.46 0 -1302.91 0 0 2184.9 0 -963.088 1394.01 0 0 0 0 0 0 0 0 0 0 0 0 0 0 0 0 952.712 0 0 
0 0 0 0 2244.25 0 0 0 1028.86 0 1904.58 0 0 0 0 0 0 0 0 0.07 0 0 0 0 0 0 0 0 0 0 0 -484.71 0 0 0 0 0 0 0 0 0 0 0 0 0 0 0 0 0 0 0 0 0 0 0 0 0 0 0 0 0 0 0 0 0 
0 0 0 0 2127.67 0 0 0 0 0 0 0 0 0 409.329 0 0 0 0 0 0.02 0 0 0 0 -1712.78 -394.681 0 0 0 1871.01 388.577 0 0 0 -123.066 0 0 0 0 0 0 0 0 0 0 2130.27 0 0 0 0 0 0 0 0 0 0 0 0 1872.08 0 0 0 0 0 
0 0 0 0 -2256.77 1262.78 0 0 1631.29 292.444 0 0 0 0 1459.17 0 0 0 0 0 0 0.09 0 0 0 0 0 0 0 -1532.72 0 0 0 0 0 0 0 0 0 0 0 1873.15 0 0 0 0 2362.06 0 0 0 0 0 0 0 0 0 0 0 0 0 1278.95 0 0 0 0 
0 0 0 0 717.719 0 0 0 0 0 0 0 0 0 140.919 0 0 0 0 0 0 0 0.04 0 0 0 0 0 0 0 0 0 0 0 0 0 0 0 0 0 0 0 0 0 0 -513.855 0 0 0 0 0 0 0 0 0 0 0 0 0 0 0 0 0 0 0 
2086.02 0 1001.85 0 0 1449.55 0 0 0 0 0 0 0 2295.07 1206.78 0 0 0 0 0 0 0 0 0.04 0 0 0 0 -1820.2 0 0 375.301 0 1143.76 0 0 0 0 0 0 0 0 0 0 -1519.44 -94.5311 0 0 0 0 0 0 0 0 0 0 0 0 0 0 0 0 0 0 0 
0 0 0 0 0 0 0 0 -2429.5 0 0 -1295.43 0 0 -1557.28 0 2193.29 0 0 0 0 0 0 0 0.06 0 0 0 0 2358.39 0 0 0 0 -90.4111 0 0 0 0 516.297 0 0 0 752.815 0 0 0 0 1708.81 2149.19 0 334.864 0 0 0 0 0 0 0 0 0 0 0 0 0 
0 0 0 0 2000.41 0 0 0 0 0 0 0 0 0 1037.1 283.593 770.821 0 0 0 2288.66 0 0 0 0 0.06 0 0 0 0 0 0 0 0 0 0 -1859.87 0 0 0 1422.39 0 0 0 0 0 0 0 0 0 0 0 -312.433 0 0 0 0 0 0 0 0 0 0 0 0 
0 428.098 0 0 0 0 0 0 0 0 0 1074.48 0 0 0 0 0 0 0 0 -1040.45 0 0 0 0 0 0.05 0 0 0 2177.42 0 0 0 0 0 0 0 0 0 0 0 0 0 0 -649.205 2307.43 0 1297.57 0 -125.507 2274.47 0 0 0 0 0 0 0 0 0 0 0 0 0 
0 0 0 0 0 1227.23 0 0 0 0 0 0 22.2022 0 0 0 1420.87 0 0 0 0 0 0 0 0 0 0 0.01 0 0 0 0 0 0 0 0 0 0 0 -378.506 0 0 0 0 0 0 0 0 0 1181.45 0 0 0 0 0 0 0 0 0 0 0 0 0 0 0 
0 0 0 0 1863.08 0 -1851.94 0 0 0 1630.53 0 0 0 0 0 0 0 1293.76 0 0 0 0 -217.826 0 0 0 0 0.01 0 0 0 0 0 0 0 0 1174.43 0 -1995.99 0 0 0 0 -1548.43 0 0 0 844.218 0 0 0 0 0 0 0 0 0 0 0 0 0 0 0 0 
0 0 0 0 0 0 0 0 0 67.0644 0 0 0 0 -1221.88 0 0 1737.34 0 0 0 -852.763 0 0 -495.392 0 0 0 0 0 0 0 0 0 0 -1467.56 0 0 0 0 0 1762.52 0 0 0 0 1062.73 0 0 0 0 0 0 0 0 0 0 2452.09 0 0 0 0 0 0 0 
0 0 0 0 0 0 0 0 0 0 0 -1669.59 0 0 1508.45 0 -2046.95 1974.01 0 0 -872.448 0 0 0 0 0 1820.35 0 0 0 0.09 0 -73.0155 0 0 0 0 0 0 0 0 0 0 0 120.319 0 0 0 0 0 0 0 0 0 0 0 0 0 0 0 0 0 0 0 0 
1757.48 0 -1022.45 0 0 0 0 0 0 0 158.162 0 0 0 0 0 0 0 0 -37.3089 914.411 0 0 2037.8 0 0 0 0 0 0 0 0.06 0 0 0 0 0 0 0 0 0 0 1593.14 0 0 0 0 0 0 0 1848.89 0 0 0 0 0 0 0 0 0 0 0 0 0 0 
0 0 0 1987.14 0 0 664.769 0 0 -1093.55 0 0 0 0 0 0 0 0 0 0 0 0 0 0 0 0 0 0 0 0 210.501 0 0.01 0 0 219.962 0 0 0 835.521 0 0 0 0 0 0 87.5118 0 0 0 0 0 0 0 0 0 0 0 -587.558 0 0 0 0 0 0 
0 0 0 0 0 0 0 0 0 0 0 0 0 0 0 2454.99 0 0 1922.13 0 0 0 0 1682.87 0 0 0 0 0 0 0 0 0 0.05 0 0 0 0 0 0 0 0 0 0 0 0 0 0 0 0 0 0 0 0 0 0 0 0 0 0 0 0 0 0 0 
0 -1094.47 0 -2402.49 0 0 0 0 0 0 0 1075.09 0 0 0 0 0 0 0 0 0 0 0 0 2302.85 0 0 0 0 0 0 0 0 0 0.09 0 2017.5 0 0 0 0 0 0 0 0 2334.74 0 0 0 0 0 0 0 0 0 0 0 0 0 0 0 0 0 0 0 
0 0 0 0 -2117.3 0 1366.54 0 0 0 0 0 633.183 0 0 1190.6 0 0 0 0 -292.138 0 0 0 0 0 0 0 0 -1110.19 0 0 884.655 0 0 0.06 0 0 0 1905.35 0 0 0 0 0 0 0 -606.174 1323.66 0 0 0 0 0 0 0 0 0 0 0 0 0 0 0 0 
-344.172 0 1395.38 0 0 1431.09 0 0 0 -2234.95 0 0 0 0 0 0 0 -2040.7 0 0 0 0 0 0 0 1133.38 0 0 0 0 0 0 0 0 1840.49 0 0.03 0 0 0 0 0 0 738.777 -2382.81 0 1582.16 0 0 0 0 0 0 0 0 0 0 0 0 0 0 0 0 0 0 
-1046.56 0 0 0 0 834.91 0 0 0 0 0 0 0 -1576.36 0 1772.9 0 1300.47 1556.37 0 0 0 0 0 0 0 0 0 -2261.96 0 0 0 0 0 0 0 0 0.05 0 0 0 0 2435.61 0 0 2368.77 -267.418 0 0 290.307 2064.81 0 0 0 0 0 0 0 0 0 0 0 0 0 0 
0 0 0 0 0 0 0 0 1018.94 0 0 0 0 0 0 0 0 0 0 0 0 0 0 0 0 0 0 0 0 0 0 0 0 0 0 0 0 0 0 0 0 0 55.62 0 0 0 0 0 0 0 0 0 0 0 0 0 0 0 0 0 0 0 0 0 0 
235.679 0 0 0 0 0 0 0 0 0 0 0 -1477.17 0 0 0 0 0 1995.99 0 0 0 0 0 583.895 0 0 857.036 777.535 0 0 0 -1200.06 0 0 379.574 0 0 0 0.01 0 0 0 0 0 0 0 0 0 -2009.72 0 0 0 0 0 0 0 0 0 0 0 0 0 0 0 
0 1695.23 2494.96 1408.51 0 0 0 0 0 0 0 0 0 0 0 0 1579.1 0 0 0 0 0 0 0 0 -91.937 0 0 0 0 0 0 0 0 0 0 0 0 0 0 0.01 0 0 0 0 0 0 0 852.458 0 0 0 -228.05 0 0 0 -229.118 0 0 0 0 0 0 0 0 
-1470.15 0 0 0 0 0 0 0 0 1488.16 0 0 0 -1918.62 0 2084.49 2250.21 0 0 0 0 1280.79 0 0 0 0 0 0 0 -1256.07 0 0 0 0 0 0 0 0 0 0 0 0.08 0 0 614.414 0 0 0 0 0 0 0 0 0 0 0 0 0 0 0 0 0 0 0 0 
0 0 0 0 0 0 -44.7859 0 0 0 0 0 0 0 0 253.227 0 0 -605.411 0 0 0 0 0 0 0 0 0 0 0 0 2041.46 0 0 0 0 0 1665.93 981.704 0 0 0 0.07 323.267 0 0 0 0 0 0 0 0 0 0 0 0 0 0 0 0 0 0 0 0 0 
0 2380.67 0 0 0 0 0 0 0 0 0 1168.17 0 0 0 0 0 0 0 0 0 0 0 0 1426.36 0 0 0 0 0 0 0 0 0 0 0 -560.244 0 0 0 0 0 1371.27 0.02 0 0 0 0 0 0 0 0 0 0 0 0 0 0 0 0 0 0 0 0 0 
0 0 -232.17 0 0 0 0 0 0 0 0 0 419.553 0 0 0 0 0 1423.46 0 0 0 0 -2177.72 0 0 0 0 -183.493 0 1597.72 0 0 0 0 0 1074.33 0 0 0 0 2470.55 0 0 0.01 0 0 0 0 2472.23 0 0 0 0 0 0 0 0 0 0 0 0 0 0 0 
0 0 0 0 0 0 0 0 0 0 0 0 0 0 0 0 0 0 1590.7 0 0 0 -279.778 482.116 0 0 1425.14 0 0 0 0 0 0 0 -843.455 0 0 762.123 0 0 0 0 0 0 0 0.06 -905.866 0 0 0 78.814 -1949.45 0 0 0 0 0 0 0 0 0 0 0 0 0 
0 0 0 0 0 0 0 -1344.42 0 0 0 0 0 0 0 0 0 0 0 0 1193.81 -1576.66 0 0 0 0 439.695 0 0 -462.432 0 0 1466.8 0 0 0 522.858 556.581 0 0 0 0 0 0 0 1804.94 0.06 0 0 -2104.02 0 0 0 0 0 0 0 0 0 0 0 0 0 0 0 
136.189 0 0 0 0 0 0 0 0 0 0 0 0 0 0 0 0 0 0 0 0 0 0 0 0 0 0 0 0 0 0 0 0 0 0 1419.19 0 0 0 0 0 0 0 0 0 0 0 0.02 1923.2 0 0 0 0 666.143 0 0 0 0 0 0 0 0 0 0 0 
0 0 0 0 0 0 0 1138.72 0 0 0 0 0 0 0 0 0 0 0 0 0 0 0 0 171.743 0 2484.89 0 1775.8 0 0 0 0 0 0 996.353 0 0 0 0 -727.027 0 0 0 0 0 0 2335.2 0.02 0 0 0 0 0 0 0 0 0 0 0 0 0 0 0 0 
0 0 0 1076.92 0 0 0 0 0 0 0 0 0 1625.03 0 0 0 0 0 0 0 0 0 0 807.596 0 0 -1976.3 0 0 0 0 0 0 0 0 0 -1829.36 0 2239.83 0 0 0 0 306.024 0 658.971 0 0 0.03 -819.498 0 0 0 0 0 0 0 0 0 0 0 0 0 0 
0 0 0 129.17 -1548.43 459.99 0 2286.07 2379.45 0 0 0 0 0 0 1090.81 610.904 0 0 0 0 0 0 0 0 0 1265.68 0 0 0 0 -188.681 0 0 0 0 0 -125.202 0 0 0 0 0 0 0 -985.519 0 0 0 721.992 0.05 0 0 0 0 0 0 0 0 0 0 0 0 0 0 
0 0 0 0 0 950.575 0 0 0 291.986 0 0 0 0 0 0 0 1176.56 0 0 0 0 0 0 1766.64 0 15.6407 0 0 0 0 0 0 0 0 0 0 0 0 0 0 0 0 0 0 -641.728 0 0 0 0 0 0.05 0 0 0 0 0 0 0 0 0 0 0 0 0 
0 0 0 0 0 0 0 0 0 0 0 0 0 0 0 0 0 0 0 0 0 0 0 0 0 699.103 0 0 0 0 0 0 0 0 0 0 0 0 0 0 746.254 0 0 0 0 0 0 0 0 0 0 0 0.06 0 0 0 0 0 0 0 0 0 0 0 0 
0 0 0 0 0 0 0 0 0 0 0 0 0 0 0 0 0 0 0 0 0 0 0 0 0 0 0 0 0 0 0 0 0 0 0 0 0 0 0 0 0 0 0 0 0 0 0 2118.37 0 0 0 0 0 0.01 0 0 0 0 0 0 0 0 0 0 0 
0 0 0 0 0 0 0 0 0 0 0 1009.63 0 0 0 0 0 0 0 0 0 0 0 0 0 0 0 0 0 0 0 0 0 0 0 0 0 0 0 0 0 0 0 0 0 0 0 0 0 0 0 0 0 0 0.08 0 0 0 0 0 0 0 0 0 0 
0 0 0 0 0 0 1301.23 0 0 0 0 0 0 0 0 0 0 0 0 0 0 0 0 0 0 0 0 0 0 0 0 0 0 0 0 0 0 0 0 0 0 0 0 0 0 0 0 0 0 0 0 0 0 0 0 0.02 0 0 0 0 0 0 0 0 0 
0 0 0 0 0 0 0 0 0 0 0 0 0 0 0 0 0 0 0 0 0 0 0 0 0 0 0 0 0 0 0 0 0 0 0 0 0 0 0 0 2475.89 0 0 0 0 0 0 0 0 0 0 0 0 0 0 0 0.07 0 0 0 0 0 0 0 0 
0 0 0 0 0 0 0 0 0 0 0 0 0 0 0 0 0 0 0 0 0 0 0 0 0 0 0 0 0 2071.67 0 0 0 0 0 0 0 0 0 0 0 0 0 0 0 0 0 0 0 0 0 0 0 0 0 0 0 0.01 0 0 0 0 0 0 0 
0 0 0 0 0 0 0 0 0 0 0 0 0 0 0 0 0 0 0 0 0 0 0 0 0 0 0 0 0 0 0 0 625.553 0 0 0 0 0 0 0 0 0 0 0 0 0 0 0 0 0 0 0 0 0 0 0 0 0 0.01 0 0 0 0 0 0 
0 0 0 0 0 0 0 0 0 0 0 0 0 0 0 0 0 0 0 0 2277.37 0 0 0 0 0 0 0 0 0 0 0 0 0 0 0 0 0 0 0 0 0 0 0 0 0 0 0 0 0 0 0 0 0 0 0 0 0 0 0.05 0 0 0 334.559 0 
0 0 0 0 0 0 0 0 0 0 0 0 0 0 0 0 0 0 0 0 0 307.855 0 0 0 0 0 0 0 0 0 0 0 0 0 0 0 0 0 0 0 0 0 0 0 0 0 0 0 0 0 0 0 0 0 0 0 0 0 0 0.04 0 0 0 0 
0 0 0 0 1261.41 0 0 0 0 0 0 0 0 0 0 0 0 0 0 0 0 0 0 0 0 0 0 0 0 0 0 0 0 0 0 0 0 0 0 0 0 0 0 0 0 0 0 0 0 0 0 0 0 0 0 0 0 0 0 0 0 0.04 0 0 0 
0 0 0 0 0 0 0 0 0 0 0 0 0 0 0 0 0 0 1734.44 0 0 0 0 0 0 0 0 0 0 0 0 0 0 0 0 0 0 0 0 0 0 0 0 0 0 0 0 0 0 0 0 0 0 0 0 0 0 0 0 0 0 0 0.09 0 0 
0 0 0 0 0 0 0 0 0 0 0 0 0 0 0 0 0 0 0 0 0 0 0 0 0 0 0 0 0 0 0 0 0 0 0 0 0 0 0 0 0 0 0 0 0 0 0 0 0 0 0 0 0 0 0 0 0 0 0 2391.66 0 0 0 0 0 
0 0 0 0 0 0 0 0 0 0 825.755 0 0 0 0 0 0 0 0 0 0 0 0 0 0 0 0 0 0 0 0 0 0 0 0 0 0 0 0 0 0 0 0 0 0 0 0 0 0 0 0 0 0 0 0 0 0 0 0 0 0 0 0 0 0.09 
