*Vertices 75
*Matrix 
0.08 0 656.377 0 0 0 0 0 0 0 356.99 1231.96 0 0 0 0 0 1720.56 0 0 0 0 0 0 0 0 -1623.97 1518.98 0 2390.13 230.796 0 850.169 0 0 -2001.48 0 0 1357.39 -2350.61 221.641 -17.9296 0 0 0 0 852.916 0 0 0 0 0 0 0 0 0 0 0 0 2393.8 0 0 0 1111.87 768.227 0 0 0 0 -1020.46 0 0 0 -581.759 -2462.31 
0 0.02 2374.42 0 0 -2358.7 1847.82 1505.1 0 0 0 0 0 0 0 0 -512.177 0 0 0 0 0 0 0 0 -1885.36 0 0 0 0 0 -92.3948 0 0 480.285 -1442.38 0 0 0 1213.49 0 0 0 0 0 1573.61 0 -1965.16 1022.14 0 514.161 -741.066 0 0 1738.72 0 0 0 0 0 -1348.69 1443.3 0 0 538.881 0 443.51 0 0 -596.103 0 0 0 0 0 
-683.844 1245.38 0.05 0 0 0 1278.19 0 0 0 0 0 0 1487.24 1530.73 0 0 1803.11 0 -397.885 -497.07 643.406 0 0 503.937 0 0 0 -1490.14 0 0 476.928 482.116 0 0 0 0 141.682 1664.56 0 0 0 -1916.33 0 0 0 0 0 0 0 0 0 0 -510.651 0 0 0 0 0 0 0 0 0 0 0 1581.55 0 0 335.322 2222.43 0 -1276.97 1390.35 0 0 
0 0 0 0.02 2170.09 0 0 0 0 0 0 1586.58 0 0 0 1003.22 0 0 1375.55 0 0 1414.15 0 0 0 1222.5 0 0 0 0 0 0 0 -2221.21 0 0 0 -949.355 0 0 0 0 0 0 0 0 0 0 1655.1 0 0 0 0 0 -1541.41 1152.61 0 0 2342.07 0 0 0 2013.38 0 0 0 1173.51 0 0 0 0 0 2133.93 0 0 
0 0 0 -987.503 0.07 0 0 0 -2484.59 0 0 0 -254.448 0 0 0 0 -702.46 0 0 0 2361.6 0 514.161 0 0 0 0 0 0 0 0 0 0 0 0 0 1673.71 0 0 0 1888.71 0 0 0 -472.655 2436.67 0 0 2052.9 1251.34 -2271.42 0 0 0 0 2075.03 0 0 0 0 -2299.65 0 0 0 0 -1391.26 -1442.84 0 0 1122.55 0 2326.65 0 0 
0 -434.049 0 0 0 0.08 -1740.55 0 0 0 0 0 0 0 -847.27 0 -1085.47 275.048 0 0 0 0 0 0 0 0 0 1585.36 0 2452.54 -1675.85 0 0 0 0 0 0 0 0 0 2408.6 0 0 283.593 -2259.21 0 0 -2384.79 0 0 0 0 0 1530.58 0 1967.76 0 0 0 1950.06 0 1970.66 -2488.4 0 1002.76 223.93 0 0 143.208 0 0 0 0 0 0 
0 1003.68 -1959.97 0 0 1525.09 0.04 0 0 1002.91 0 0 0 0 0 0 0 0 0 0 0 0 -1196.55 -804.239 0 -1588.72 0 1134.3 1377.38 139.393 0 0 626.316 0 0 1822.64 306.94 2122.33 0 0 0 0 0 0 0 0 0 0 415.738 0 0 0 0 1.60222 0 0 0 0 617.313 -2129.96 888.165 0 -1381.04 327.998 0 0 0 0 -996.048 0 1784.19 0 0 0 -709.632 
0 -971.175 0 0 0 0 0 0.02 0 0 0 0 -1122.24 0 0 0 994.674 0 0 0 0 0 1647.77 0 0 0 0 1956.01 0 0 2385.4 0 0 0 0 0 0 -367.977 0 0 832.316 1886.43 0 0 0 0 2031.39 446.867 0 1271.48 0 0 481.353 0 0 0 0 1080.13 -1976.45 0 0 0 0 0 0 1021.38 1246.45 0 0 735.878 0 0 0 0 0 
0 0 0 0 -2256.31 0 0 0 0.06 0 0 0 1442.99 0 0 0 0 -2216.48 0 -404.599 273.827 0 1236.38 0 0 1480.68 0 0 0 0 0 -1032.21 1446.65 0 0 0 0 1050.52 0 -1570.25 -691.931 0 0 2196.65 0 0 0 0 0 0 0 1332.82 924.94 1955.85 0 0 -1157.19 489.288 0 0 -1041.37 0 0 487.762 156.178 0 0 0 0 0 0 -262.383 0 0 0 
0 0 0 0 0 0 1984.08 0 0 0.04 0 0 -1138.57 0 -827.586 -673.467 0 0 0 0 0 0 0 789.59 -235.069 0 0 0 1776.25 367.061 -2450.41 0 -1197.47 0 0 0 0 -1062.27 0 0 -1976 0 0 0 0 0 0 1532.87 0 0 0 523.316 1832.71 0 0 0 0 0 1500.98 53.9415 0 0 0 0 0 0 0 0 -270.775 2325.89 0 0 0 0 0 
-1140.25 0 0 0 0 0 0 0 0 0 0.03 0 0 0 0 0 0 0 0 0 -123.829 0 0 0 0 0 2051.53 0 1630.68 0 0 0 0 0 1141.47 521.18 0 0 0 446.867 -180.593 0 0 1984.54 0 0 1408.2 1795.48 0 0 -827.281 -670.721 0 0 0 1802.35 0 0 0 0 0 -1366.08 707.19 0 0 0 0 0 0 0 0 0 0 0 930.586 
1772.74 0 0 -1191.67 0 0 0 0 0 0 0 0.05 1949.75 -553.835 958.357 0 0 -1443.3 0 661.107 0 -1338.01 1914.5 2112.87 0 0 0 -770.669 0 2043.9 0 0 633.488 0 0 0 0 1661.96 0 0 0 0 -1519.75 0 0 0 2168.26 0 0 0 0 0 0 0 1515.32 1197.93 0 0 0 0 0 -1425.29 0 0 -458.617 0 751.442 0 0 254.601 0 0 0 -2394.25 0 
0 0 0 0 -246.666 0 0 1532.72 -1684.7 2384.79 0 2215.26 0.08 0 0 0 -319.605 0 0 -1435.97 0 0 -1846.29 0 140.919 0 0 0 1284.3 0 0 0 0 0 0 0 0 0 0 0 0 0 0 1721.02 1250.57 0 0 0 0 0 0 0 0 0 -1466.34 -1211.66 0 0 174.795 0 2171.47 1489.84 0 0 0 0 0 0 1986.98 1749.55 0 0 1420.41 -990.097 1071.58 
0 0 -254.906 0 0 0 0 0 0 0 0 -2314.14 0 0.03 1660.13 183.493 0 2172.23 0 0 502.258 -699.408 0 832.621 0 628.758 -1316.34 0 0 2440.95 0 0 182.882 -1123 0 0 0 0 0 -1555.45 0 0 0 -1344.11 0 0 2208.24 0 0 2207.63 -218.131 0 0 1238.67 0 356.99 0 0 0 0 0 1137.96 0 0 -2228.84 0 0 2368.62 1296.35 -839.183 0 0 0 0 0 
0 0 1157.64 0 0 1661.35 0 0 0 1088.82 0 -241.478 0 -930.586 0 0 0 0 0 0 0 0 0 639.744 0 728.858 0 1427.73 0 -882.977 0 -2285.15 0 0 0 -548.799 81.7133 0 -531.709 -140.767 2364.96 0 0 0 -694.525 0 0 0 0 0 0 0 411.924 2094.56 0 -925.398 0 0 0 0 0 0 0 0 373.47 0 0 0 138.02 0 -2091.97 0 -1721.78 0 0 
0 0 0 701.544 0 0 0 0 0 -1495.64 0 0 0 -2330.93 0 0.04 0 1493.04 0 -1001.24 -785.47 0 -1003.07 0 1127.28 0 1068.68 0 0 0 0 -749.763 0 0 0 1882.46 0 905.713 0 0 0 2359.77 1223.72 -1725.75 0 0 0 0 0 0 0 0 0 0 0 0 0 0 0 0 0 0 2136.22 0 0 0 0 876.415 0 -1556.06 0 0 0 0 0 
0 2216.18 0 0 0 1249.2 0 394.681 0 0 0 0 2134.08 0 0 0 0.05 0 -215.69 0 569.552 319.3 -2124.16 0 -1599.25 0 0 0 0 1293.15 -1710.94 908.765 0 0 0 0 0 0 0 0 0 844.371 0 0 0 1029.62 0 0 0 0 0 0 -81.8659 0 0 0 -183.34 0 0 0 1977.83 -1042.28 1140.55 0 0 0 0 0 0 363.399 0 0 0 0 0 
1623.05 0 1292.54 0 -951.643 53.0259 0 0 2285.91 0 0 -1356.32 0 -723.518 0 1625.8 0 0.09 0 0 0 1410.95 853.526 0 -1217 0 0 0 0 0 2037.19 0 0 0 0 0 0 -1655.1 -1043.35 520.875 0 0 0 1734.75 0 0 0 0 0 0 0 530.183 0 -959.883 0 0 0 1825.54 0 0 0 0 2355.8 0 0 0 0 0 0 0 -284.967 0 0 0 0 
0 0 0 558.718 0 0 0 0 0 0 0 0 0 0 0 0 2078.39 0 0.02 0 0 0 0 0 0 0 0 0 0 0 -480.59 0 0 -2159.41 0 0 0 0 0 0 0 0 579.928 -168.844 0 -1759.32 0 0 0 0 0 0 0 0 0 274.438 0 0 0 0 0 0 0 2087.24 0 0 0 -877.789 0 331.507 0 0 0 0 0 
0 0 -1270.41 0 0 0 0 0 -542.543 0 0 1365.32 2238.91 0 0 2410.43 0 0 0 0.06 0 0 0 -187.46 -1695.84 -1328.24 -314.112 2182.3 -132.221 0 0 0 0 0 0 0 0 0 0 0 0 0 0 0 0 0 0 -1414.61 0 0 0 0 0 0 0 0 0 0 0 49.6689 0 0 0 0 628.758 0 0 0 0 0 1468.78 0 0 0 0 
0 0 -826.212 0 0 0 0 0 2227.77 0 1266.44 0 0 -211.722 0 -937.758 1156.27 0 0 0 0.05 0 0 0 0 1560.49 0 960.036 -1707.43 -2134.39 0 0 0 0 0 572.451 727.332 0 0 0 0 0 0 0 -667.516 1405.76 1202.81 -429.167 -1708.96 0 0 0 0 0 0 93.0052 364.315 0 0 0 0 -1218.68 -1288.57 0 0 2273.71 0 0 -852.763 0 0 0 0 0 0 
0 0 1066.39 1938.15 -1455.66 0 0 0 0 0 0 2436.98 0 28.1533 0 0 -976.821 1927.78 0 0 0 0.04 0 0 0 0 -2266.69 0 2307.43 0 997.726 0 0 0 0 -1190.15 0 0 0 0 0 -636.082 0 0 0 -26.6274 0 0 0 0 1092.94 0 1851.18 0 -1757.94 0 1206.78 0 82.7815 0 1866.13 -1449.55 0 0 -1067.61 0 1961.04 0 0 0 0 0 2340.39 0 247.581 
0 0 0 0 0 0 -1645.94 1098.74 -1120.72 0 0 -890.149 -1634.5 0 0 640.202 1992.32 959.883 0 0 0 0 0.01 380.184 0 1997.36 0 0 0 0 0 2168.57 0 0 0 1869.03 637.455 0 580.538 0 0 0 0 987.503 0 0 0 0 -1416.9 0 0 0 0 0 1051.29 1762.98 0 -141.987 0 2012.77 0 0 0 0 0 0 0 0 0 2235.4 0 0 0 0 0 
0 0 0 0 -733.589 0 502.716 0 0 -167.928 0 173.116 0 1803.26 598.697 0 0 0 0 -625.401 0 0 -25.2541 0.06 0 2322.99 0 0 0 0 0 1966.99 0 721.076 0 1640.14 0 0 0 0 0 0 0 0 0 0 -1142.38 -787.912 673.772 0 1514.56 0 0 0 0 0 0 0 -1600.62 0 0 0 0 662.633 -2237.24 0 0 0 0 -2073.05 1917.86 0 1540.35 0 0 
0 0 557.192 0 0 0 0 0 0 -585.421 0 0 1519.59 0 0 -1244.62 2130.73 2270.2 0 1013.6 0 0 0 0 0.02 0 2409.36 0 0 -240.867 1014.97 0 0 0 -2308.04 0 0 0 0 0 314.57 -1536.53 0 0 0 1296.2 0 0 0 0 0 0 0 2172.99 0 0 0 0 0 0 0 2255.24 0 0 0 0 -400.174 0 0 0 0 -537.965 0 1126.36 0 
0 -1164.51 0 -389.34 0 0 1599.55 0 -1003.37 0 0 0 0 -1667.3 -461.211 0 0 0 0 -1344.57 887.249 0 349.055 596.408 0 0.06 0 0 -1790.6 0 0 1596.19 0 0 0 0 358.516 0 0 1547.06 0 610.904 0 0 0 0 1099.2 -450.682 1919.84 1168.94 -2188.86 0 0 0 0 -428.098 0 0 -954.543 0 1623.05 0 0 -600.375 0 532.472 2286.07 1970.66 0 0 0 0 -379.421 0 0 
-528.352 0 0 0 0 0 0 0 0 0 1876.81 0 0 718.635 0 2286.52 0 0 0 -1095.08 0 -1134.6 0 0 1944.41 0 0.05 0 0 1419.34 0 0 0 0 0 0 0 0 0 0 0 0 0 510.193 0 1961.81 0 -1079.36 -1686.68 2022.39 0 0 0 0 0 -434.202 0 0 0 0 0 2378.54 -1475.19 -596.561 0 0 0 0 0 0 0 0 0 0 0 
2300.1 0 0 0 0 -2428.28 1685.92 1099.2 0 0 0 -769.753 0 0 -660.039 0 0 0 0 -637.761 1824.32 0 0 0 0 0 0 0.08 0 0 0 0 0 0 0 0 1835 0 0 0 0 0 2396.85 0 0 0 2487.64 0 0 0 0 -2453 0 0 0 0 0 0 0 0 0 0 0 -322.199 -1225.24 0 0 1210.59 0 0 -1695.07 0 0 0 0 
0 0 1300.93 0 0 0 1587.8 0 0 -930.738 1400.72 0 2324.21 0 0 0 0 0 0 -2491.76 1375.24 1409.73 0 0 0 -173.421 0 0 0.06 0 0 0 0 0 1289.33 0 1570.86 1009.78 0 -525.91 0 0 0 0 0 0 2080.68 0 0 0 0 0 0 0 0 1888.87 -1665.17 -575.808 0 0 0 0 -2268.67 0 0 0 0 0 0 -2409.67 0 0 0 0 1051.29 
-2273.25 0 0 0 0 360.347 405.057 0 0 -595.798 0 1822.18 0 1882.15 929.975 0 -153.737 0 0 0 -971.786 0 0 0 -383.999 0 1535.77 0 0 0.03 -1244.77 0 0 1694.01 0 0 0 0 0 0 0 654.241 0 0 0 0 0 0 0 79.7296 0 0 0 0 0 608.31 0 -1205.86 0 0 0 0 0 0 0 -1542.02 1314.36 2336.88 0 0 0 -118.793 0 0 -1617.4 
2269.59 0 0 0 0 1763.74 0 -1379.82 0 -1781.59 0 0 0 0 0 0 -1951.89 1398.74 1842.02 0 0 -77.7459 0 0 2482.76 0 0 0 0 -2243.64 0.05 0 0 0 0 0 1557.13 682.928 -2168.11 0 0 0 0 0 0 0 0 1924.57 0 0 0 0 -2339.63 0 0 0 0 0 0 0 0 0 0 -1839.43 0 2421.57 0 0 0 1377.38 0 -2070.45 0 0 0 
0 -2251.12 1748.02 0 0 0 0 0 -1284.14 0 0 0 0 0 1448.33 -171.59 -2091.36 0 0 0 0 0 -2348.78 1751.99 0 7.09555 0 0 0 0 0 0.04 8.92666 0 0 0 2433.01 0 0 0 0 0 1605.04 0 1328.09 702.46 2428.74 0 0 0 0 0 0 0 2229.91 0 0 0 2485.35 0 0 0 -1156.58 -2436.22 829.112 0 712.378 0 0 0 2467.65 0 0 0 0 
-795.541 0 1631.29 0 0 0 1183.28 0 1101.34 -394.07 0 2337.79 0 2484.89 0 0 0 0 0 0 0 0 0 0 0 0 0 0 0 0 0 -1289.79 0.02 0 0 0 0 2159.41 0 0 0 0 0 0 0 0 0 0 0 0 0 810.038 0 0 0 0 0 0 0 0 0 35.3252 0 0 0 0 0 0 0 0 -1010.24 0 -1162.83 -353.175 0 
0 0 0 -393.002 0 0 0 0 0 0 0 0 0 1094.93 0 0 0 0 2253.56 0 0 0 0 -2033.37 0 0 0 0 0 947.066 0 0 0 0.04 0 2267.6 0 0 0 1384.09 0 0 0 133.29 0 0 0 2307.12 0 0 0 473.418 -1256.68 0 0 -1683.17 0 0 0 0 0 0 997.421 0 0 0 0 -1214.26 0 0 2074.11 1017.87 -1617.25 0 0 
0 337.916 0 0 0 0 0 0 0 0 1624.27 0 0 0 0 0 0 0 0 0 0 0 0 0 -1506.93 0 0 0 -510.956 0 0 0 0 0 0.04 0 0 0 0 0 -809.427 1898.18 0 765.481 0 0 0 -1106.37 0 0 1875.9 0 0 -833.995 0 1716.59 1441.92 0 0 0 0 0 0 619.144 0 0 0 0 0 0 557.802 -1793.95 0 0 0 
1656.77 1160.7 0 0 0 0 51.8052 0 0 0 1125.75 0 0 0 -1770.91 978.5 0 0 0 0 1904.74 -1441.16 -1114.76 524.384 0 0 0 0 0 0 0 0 0 -827.891 0 0.08 0 0 0 526.063 880.993 0 1719.03 0 1437.96 0 0 0 0 0 0 0 0 0 0 2068.93 0 0 0 2301.02 0 0 0 741.981 0 0 -2198.48 0 -1326.11 0 1187.09 2419.13 -431.15 0 0 
0 0 0 0 0 0 1635.11 0 0 0 0 0 0 0 1379.82 0 0 0 0 0 232.78 0 -1372.95 0 0 297.632 0 -753.121 -861.156 0 -2404.02 1615.88 0 0 0 0 0.03 0 -2105.55 0 0 0 0 0 0 0 0 0 0 0 0 1146.5 0 0 0 0 0 0 0 0 0 0 1996.6 0 0 0 2473.45 0 0 0 2374.87 224.998 0 0 0 
0 0 -451.598 -464.873 1061.36 0 -1509.06 1146.2 1450.16 -783.639 0 1234.55 0 0 0 1851.02 0 2318.26 0 0 0 0 0 0 0 0 0 0 -2349.09 0 2165.97 0 2167.5 0 0 0 0 0.03 -70.5741 0 0 0 0 0 -2153.77 0 0 1781.14 0 0 -703.833 0 -2305.9 0 0 0 0 0 0 1693.09 0 0 0 0 93.9207 0 -1223.26 0 0 0 0 0 0 0 0 
213.095 0 -366.604 0 0 0 0 0 0 0 0 0 0 0 2287.74 0 0 1728.19 0 0 0 0 -171.438 0 0 0 0 0 0 0 -320.521 0 0 0 0 0 1192.59 1295.59 0.05 2044.36 -2388.61 0 0 0 0 1749.09 0 -261.62 0 2374.26 0 0 0 0 0 0 -729.316 349.361 0 0 0 0 0 -1069.6 1522.8 108.112 -1971.11 0 -1366.08 0 0 0 2471.31 1890.85 0 
1958.45 2243.03 0 0 0 0 0 0 1397.06 0 668.737 0 0 2411.04 1413.69 0 0 -993.606 0 0 0 0 0 0 0 1344.57 0 0 655.766 0 0 0 0 -2061.45 0 1531.34 0 0 233.085 0.04 -1351.28 0 0 1141.77 0 0 0 0 1444.52 0 -2395.78 0 671.941 0 0 -1233.02 0 0 0 0 0 0 0 0 706.275 0 0 0 0 0 290.613 0 0 0 0 
2.67037 0 0 0 0 2379.76 0 -2261.5 1325.04 -1831.49 780.282 0 0 0 2430.27 0 0 0 0 0 0 0 0 0 805.46 0 0 0 0 0 0 0 0 0 -243.309 -642.186 0 0 -651.646 -1375.7 0.08 1283.07 446.867 0 0 0 0 0 0 823.161 0 0 0 0 2361.29 0 0 1253.01 638.829 0 0 0 0 0 0 0 1356.17 0 0 0 0 0 0 0 0 
359.584 0 0 0 -16.7089 0 0 -131.764 0 0 0 0 0 0 0 1709.88 -1364.1 0 0 0 0 2131.49 0 0 -12.4363 1544.31 0 0 0 -317.469 0 0 0 0 319.452 0 0 0 0 0 -306.635 0 0 0 -971.023 0 0 0 0 0 1682.26 2382.81 0 0 0 0 2423.7 0 0 1234.86 0 0 2272.18 0 0 0 0 0 0 -2203.82 0 0 0 0 0 
0 0 1961.5 0 0 0 0 0 0 0 0 2316.74 0 0 0 41.8867 0 0 1128.5 0 0 0 0 0 0 0 0 -964.461 0 0 0 445.036 0 0 0 -2344.97 0 0 0 0 1764.96 0 0.04 -291.833 0 0 0 1005.51 1257.44 0 -1667.3 -2099.44 0 0 0 -243.614 0 0 0 0 0 0 0 0 0 704.291 0 0 381.863 1134.14 -344.63 0 2316.28 0 0 
0 0 0 0 0 -2121.88 0 0 473.876 0 -236.137 0 637.608 216.91 0 -132.832 0 980.026 -890.912 0 0 0 1573.31 0 0 0 -1412.78 0 0 0 0 0 0 745.338 -2157.43 0 0 0 0 1961.65 0 0 715.735 0.02 0 0 0 0 0 940.046 0 0 0 0 0 0 1896.19 0 -1180.07 0 0 1216.7 0 1211.51 0 0 -633.03 0 0 0 0 0 950.575 0 0 
0 0 0 0 0 221.946 0 0 0 0 0 0 1785.56 0 1348.99 0 0 0 0 0 -2460.17 0 0 0 0 0 0 0 0 0 0 -1198.23 0 0 0 1599.09 0 -268.639 0 0 0 -642.491 0 0 0.04 0 0 -1026.26 1611.76 0 0 0 0 0 2248.68 778.603 1543.09 0 2207.48 1772.13 510.956 0 0 965.987 0 0 1848.89 0 0 0 0 0 0 -94.8363 316.095 
0 1858.65 0 0 -847.728 0 0 0 0 0 0 0 0 0 0 0 -465.026 0 -511.567 0 343.867 -943.861 0 0 -979.263 0 1590.4 0 0 0 0 512.787 0 0 0 0 0 0 -436.338 0 0 0 0 0 0 0.07 0 0 0 732.368 0 0 0 0 739.235 0 0 0 0 1664.56 0 0 0 1820.35 -2439.73 0 0 -636.692 0 0 0 0 -1444.06 0 0 
30.9 0 0 0 2233.27 0 0 2487.33 0 0 -1260.64 633.946 0 -554.598 0 0 0 0 0 0 2410.58 0 0 1568.27 0 730.995 0 1924.27 12.4363 0 0 695.288 0 0 0 0 0 0 0 0 0 0 0 0 0 0 0.05 1807.69 0 0 0 0 668.432 0 0 0 0 0 0 0 0 0 -419.248 0 0 -751.595 0 -562.685 0 -1801.13 0 1262.17 2443.85 -537.202 0 
0 795.083 0 0 0 1883.68 0 -2078.69 0 2318.11 1740.09 0 0 0 0 0 0 0 0 -365.535 -718.329 0 0 -1600.92 0 882.214 1779.31 0 0 0 103.076 0 0 367.367 -698.492 0 0 157.094 1888.87 0 0 0 -2223.96 0 430.082 0 -445.799 0.07 0 1756.26 0 0 0 -1170.16 0 2465.82 0 0 0 0 748.39 0 0 0 0 0 -894.116 0 0 0 0 0 0 0 0 
0 -311.06 0 -745.643 0 0 -1494.42 0 0 0 0 0 0 0 0 0 0 0 0 0 2078.08 0 709.021 569.857 0 1849.5 -1708.66 0 0 0 0 0 0 0 0 0 0 0 0 199.667 0 0 2062.97 0 1979.81 0 0 0 0.02 0 2445.22 0 0 599.307 0 0 -1648.69 0 0 0 -1522.49 0 0 0 0 986.587 -216.3 0 0 1478.7 0 0 0 0 0 
0 0 0 0 555.818 0 0 -1436.58 0 0 0 0 0 1489.53 0 0 0 0 0 0 0 0 0 0 0 -510.804 1135.21 0 0 -897.015 0 0 0 0 0 0 0 0 244.682 0 -1580.78 0 0 -1122.24 0 1372.49 0 937.605 0 0.01 0 0 0 0 0 0 0 1550.11 0 0 0 0 0 0 1671.73 0 -1554.23 0 -251.701 0 -1125.29 2253.11 0 -1717.66 0 
0 1896.95 0 0 420.927 0 0 0 0 0 331.05 0 0 -203.787 0 0 0 0 0 0 0 -848.949 0 -1595.74 0 757.088 0 0 0 0 0 0 0 0 -2203.97 0 0 2127.52 0 -2417.6 0 928.907 92.8526 0 0 0 0 0 1696.6 0 0 0 0 0 0 -1588.41 0 1657.99 1220.36 0 0 0 -1833.93 0 1609.01 -1869.18 1968.52 2307.43 0 0 0 1645.79 0 0 0 
0 -89.9533 0 0 2303.92 0 0 0 -1636.17 -1959.52 -2418.97 0 0 0 0 0 0 -345.546 0 0 0 0 0 0 0 0 0 2324.52 0 0 0 0 -90.8689 -86.1385 0 0 1913.74 0 0 0 0 1391.11 588.015 0 0 0 0 0 0 0 0 0 0 0 0 0 0 0 0 0 0 1214.71 0 0 0 -179.83 0 -1392.64 0 0 0 0 0 0 0 
0 0 0 0 0 0 0 1712.32 184.103 -1515.17 0 0 0 0 2331.54 0 1939.68 0 0 0 0 2159.87 0 0 0 0 0 0 0 0 -1871.78 0 0 -2154.68 0 0 0 -1926.86 0 -470.824 0 0 0 0 0 0 -1299.86 0 0 0 0 0 0.08 0 1153.22 0 0 0 -960.494 0 0 0 0 0 0 0 -5.41704 0 1309.93 0 2022.84 -1709.42 2228.54 0 0 
0 0 -1052.05 0 0 660.344 1451.38 0 -93.1578 0 0 0 0 1592.68 1673.86 0 0 19.9133 0 0 0 0 0 0 -1410.18 0 0 0 0 0 0 0 0 0 190.054 0 0 0 0 0 0 0 0 0 0 0 0 -1527.07 2307.58 0 0 0 0 0.06 0 0 0 0 0 2004.68 0 0 0 0 0 0 0 0 0 1348.69 0 0 0 0 0 
0 -2130.57 0 415.281 0 0 0 0 0 0 0 -1280.02 1721.47 0 0 0 0 0 0 0 0 1980.88 1719.49 0 0 0 0 0 0 0 0 413.449 0 0 0 0 0 0 0 0 -2446.44 0 0 0 665.38 1264 0 0 0 0 0 0 2260.12 0 0.09 2312.31 37.3089 1149.71 0 0 0 0 0 -2029.4 0 0 0 0 2103.72 0 0 0 0 0 0 
0 0 0 -219.504 0 1684.39 0 0 0 0 2073.2 2432.1 -925.398 2221.21 -1682.56 0 0 0 -1868.57 0 262.688 0 -477.081 0 0 -57.1459 248.65 0 -1062.43 108.264 0 0 0 2022.84 1660.89 -2262.26 0 0 0 763.802 0 0 -2401.43 0 1119.8 0 0 341.426 0 0 -1488.77 0 0 0 -1555.15 0.03 -494.018 2348.93 0 1059.37 838.878 -24.1859 1188.01 0 0 -1190.76 31.8155 0 0 0 0 0 0 0 0 
0 0 0 0 -178.457 0 0 0 -84.7652 0 0 0 0 0 0 0 -324.183 0 0 0 2423.09 -1958.14 0 0 0 0 0 0 292.901 0 0 0 0 0 -481.658 0 0 0 -1611.15 0 0 1362.27 0 -379.574 2291.56 0 0 0 236.595 0 0 0 0 0 180.746 -1291.77 0 -648.442 0 197.989 0 1142.38 0 0 0 0 1896.95 0 0 0 0 0 0 2463.53 0 
0 0 0 0 0 0 0 -105.213 -332.575 0 0 0 0 0 0 0 0 -335.17 0 0 0 0 -177.847 0 0 0 0 0 1526.76 -1397.21 0 0 0 0 0 0 0 0 677.74 0 1137.04 0 0 0 0 0 0 0 0 1428.65 1454.89 0 0 0 2386.17 243.309 -2151.63 0 0 0 0 0 0 0 0 0 -332.118 -1034.81 0 885.266 0 0 0 0 0 
0 0 0 341.426 0 0 1211.36 2469.18 0 -344.172 0 0 -2293.08 0 0 0 0 0 0 0 0 -1339.08 0 -1626.41 0 600.833 0 0 0 0 0 11.063 0 0 0 0 0 0 0 0 1263.08 0 0 1320.46 2074.72 0 0 0 0 0 1297.72 0 1335.26 0 0 0 0 0 0.09 0 0 0 0 0 0 0 -270.928 0 1620.61 0 0 -2096.09 0 0 0 
1004.29 0 0 0 0 587.863 -416.044 0 0 -510.346 0 0 0 0 0 0 0 0 0 1955.09 0 0 -1703.01 0 0 0 0 0 0 0 0 0 0 0 0 2013.69 0 -0.991852 0 0 0 1808.6 0 0 -153.737 -1896.5 0 0 0 0 0 0 0 1519.9 0 1177.79 1642.28 0 0 0.01 0 486.236 1371.27 0 -402.31 0 0 0 0 0 -824.381 0 0 0 0 
0 1727.27 0 0 0 0 708.411 0 -1255.61 0 0 0 -1329.31 0 0 0 1370.82 0 0 0 0 1536.84 0 0 0 881.451 0 0 0 0 0 0 0 0 0 0 0 0 0 0 0 0 0 0 -209.281 0 0 767.464 -1132.47 0 0 0 0 0 0 -406.125 0 0 0 0 0.09 434.812 1592.07 0 1648.53 0 0 1259.58 0 0 0 0 0 0 0 
0 2028.34 0 0 1725.44 2063.59 0 0 0 0 1185.42 1365.32 671.636 -1677.37 0 0 720.161 0 0 0 342.494 2147.36 0 0 1467.41 0 2028.18 0 0 0 0 0 1066.09 0 0 0 0 0 0 0 0 0 0 -194.479 0 0 0 0 0 0 0 1234.24 0 0 0 -1303.67 1529.21 0 0 2004.53 2229.91 0.01 0 0 -2061.14 -851.085 0 0 0 0 177.389 0 1995.83 0 -1741.77 
0 0 0 -1868.27 0 1073.41 -980.941 0 0 0 -1033.59 0 0 0 0 -467.315 -448.698 -1559.88 0 0 1959.21 0 0 0 0 0 1578.49 0 719.855 0 0 1685.92 0 -921.278 0 0 -140.614 0 0 0 0 -1910.08 0 0 0 0 1336.02 0 0 0 634.404 0 0 0 0 1115.53 0 0 0 1037.71 2189.93 0 0.02 0 0 0 -1486.33 0 0 -439.39 -766.854 0 0 220.267 0 
480.895 0 0 0 0 0 1657.54 0 -349.055 0 0 0 0 0 0 0 0 0 1818.83 0 0 0 0 -492.34 0 922.498 -2331.08 -244.53 0 0 -282.83 -1520.36 0 0 -1973.1 -793.71 0 0 833.689 0 0 0 0 1913.74 1918.32 -1231.96 0 0 0 0 0 0 0 0 -953.017 0 0 0 0 0 0 0 0 0.06 0 0 2234.64 0 2290.8 -2023.91 0 555.971 1834.39 917.463 852.916 
-1689.43 1488.16 0 0 0 -1632.05 0 0 1374.78 0 0 851.238 0 -744.423 -2403.1 0 0 0 0 315.332 0 -1754.74 0 -409.024 0 0 0 1112.02 0 0 0 1833.78 0 0 0 0 0 -2479.86 -98.9563 -683.233 0 0 0 0 0 1969.59 0 0 0 1629.76 -345.393 0 0 0 0 0 0 0 0 1714.45 1801.74 2470.55 0 0 0.01 0 0 -1318.17 -794.626 0 0 0 2062.36 0 0 
0 0 2149.04 0 0 802.713 0 936.995 0 0 0 0 0 0 0 0 0 0 0 0 28.4585 0 0 0 0 1221.27 0 0 0 2131.34 1883.98 0 0 0 0 0 0 0 -365.535 0 0 0 -2377.93 0 0 0 69.6585 0 -831.095 0 2253.11 1404.08 0 0 0 2114.86 0 0 0 0 0 159.993 0 0 0 0.06 -443.968 0 0 0 0 0 -1997.82 0 0 
0 595.34 0 -1041.52 -1852.85 0 0 -626.621 0 0 0 58.3666 0 0 0 0 0 0 0 0 0 2158.8 0 0 31.5104 -709.174 0 0 0 1642.89 0 1699.35 0 0 0 -382.778 -2116.38 1310.54 -640.355 0 597.171 0 0 -2121.72 -1060.9 0 0 -904.797 1308.4 507.447 1544.31 0 1549.96 0 0 231.407 2340.39 -1097.98 771.279 0 0 0 1444.82 975.448 0 -889.996 0 0 0 0 0 0 0 0 0 
0 0 0 0 1940.6 0 0 0 0 0 0 0 0 -161.061 0 -1575.9 0 0 894.879 0 0 0 0 0 0 2318.26 0 1696.45 0 1292.99 0 0 0 628.147 0 0 0 0 0 0 0 0 0 0 0 -121.387 -431.303 0 0 0 463.195 738.166 0 0 0 0 0 762.429 0 0 1115.38 0 0 0 1219.14 0 0 0.09 0 0 0 0 0 0 0 
0 0 1634.5 0 0 1460.08 2471.47 0 0 2372.13 0 0 1680.43 794.168 -2075.03 0 0 0 0 0 -1802.5 0 0 0 0 0 0 0 0 0 0 0 0 0 0 -2049.24 0 0 -1099.2 0 0 0 1985.46 0 0 0 0 0 0 800.119 0 0 -217.215 0 1596.19 0 0 0 -455.87 0 0 0 0 -1711.55 -1899.24 0 0 0 0.03 0 -919.599 0 0 0 0 
1858.35 223.167 2195.43 0 0 0 0 -1364.71 0 -802.408 0 -766.396 2084.64 -256.127 0 -2387.69 -672.094 0 23.1178 0 0 0 1757.33 1332.06 0 0 0 0 -709.326 0 -2017.65 0 0 0 0 0 0 0 0 0 0 2341 2271.11 0 0 0 1050.68 0 1813.18 0 0 0 0 88.7326 0 0 0 275.201 0 0 0 0 -840.861 -1079.36 0 0 0 0 0 0.01 0 0 0 0 0 
0 0 0 0 1653.26 0 1526.92 0 0 0 0 0 0 0 -782.571 0 0 2429.5 0 1309.17 0 0 0 1616.34 0 0 0 -1680.43 0 0 0 1673.41 1697.82 -1244.32 -888.318 262.078 1442.23 0 0 -288.171 0 0 -1077.68 0 0 0 0 0 0 -1583.53 0 0 -166.707 0 0 0 0 0 0 -1778.7 0 1303.67 2040.7 0 0 0 0 0 -334.407 0 0 -891.827 0 0 -1185.72 
0 0 2209.01 0 0 0 0 0 -2269.59 0 0 0 0 0 0 0 0 0 0 0 0 0 0 0 276.421 0 0 0 0 286.492 1392.79 0 0 -1056.93 92.2422 -390.103 1498.54 0 0 0 0 0 0 0 0 0 1916.33 0 0 80.4926 560.396 0 2399.14 0 0 0 0 0 -1168.17 0 0 0 0 1817.3 0 0 0 0 0 0 2030.32 0.05 0 0 0 
0 0 -2349.39 1426.51 1836.99 0 0 0 0 0 0 0 2499.39 0 314.875 0 0 0 0 0 0 553.224 0 2458.19 0 1890.09 0 0 0 0 0 0 -258.873 632.725 0 423.368 0 0 -1992.78 0 0 0 -2327.72 281.61 0 -1546.14 944.777 0 0 0 0 0 671.789 0 0 0 0 0 0 0 0 -1400.72 0 359.127 -1818.83 2125.39 0 0 0 0 0 0 0.01 0 0 
937.452 0 0 0 0 0 0 0 0 0 0 -975.143 -2087.24 0 0 0 0 0 0 0 0 0 0 0 2380.67 0 0 0 0 0 0 0 -357.295 0 0 0 0 0 1524.02 0 0 0 0 0 -1319.54 0 2425.99 0 0 2082.35 0 0 0 0 0 0 -1552.71 0 0 0 0 0 1001.85 1009.17 0 0 0 0 0 0 0 0 0 0.07 0 
-1409.12 0 0 0 0 0 -705.817 0 0 0 -852.306 0 1885.36 0 0 0 0 0 0 0 0 2293.69 0 0 0 0 0 0 1908.09 -334.712 0 0 0 0 0 0 0 0 0 0 0 0 0 0 2222.43 0 0 0 0 0 0 0 0 0 0 0 0 0 0 0 0 -976.211 0 2369.84 0 0 0 0 0 0 -1396.15 0 0 0 0.09 
