*Vertices 29
*Matrix 
0.05 0 0 0 1499.45 0 -1005.2 451.903 0 232.475 0 113.91 0 2428.59 0 1363.64 0 0 0 0 0 0 0 0 0 -1159.47 0 0 -296.106 
0 0.08 709.021 0 0 0 217.673 -1946.24 -552.004 0 0 -1031.91 0 0 0 0 742.592 1365.02 0 0 1137.81 0 2019.49 0 0 0 0 0 1444.36 
0 961.715 0.06 0 -1745.28 0 0 0 651.646 0 0 1431.24 0 0 0 0 0 1215.32 0 1397.37 0 0 0 0 -839.793 0 -1247.52 0 0 
0 0 0 0.08 0 0 -1596.35 2164.3 0 0 0 591.83 0 0 0 0 0 0 0 0 2140.03 1574.68 33.1889 0 0 0 0 0 0 
-284.356 0 1310.69 0 0.03 0 0 0 0 0 362.789 0 0 0 -44.4807 2269.89 2396.08 0 1798.68 0 1760.69 0 0 1664.71 2081.59 0 0 0 0 
0 0 0 0 0 0.04 0 0 0 1160.24 0 1685.92 1348.84 2073.35 0 0 0 0 0 0 0 0 0 0 0 0 -2281.49 888.47 0 
688.574 -2297.2 0 2051.38 0 0 0.07 0 0 0 0 1.90741 754.341 0 37.6141 0 0 2370.3 770.669 0 0 0 0 0 166.707 -2325.28 0 -123.829 1272.55 
866.192 -52.5681 0 1833.32 0 0 0 0.08 0 476.318 0 1703.77 0 83.3918 0 -1958.3 0 0 281.915 0 -2312.46 0 0 -978.5 1912.82 0 0 0 0 
0 2308.8 -949.355 0 0 0 0 0 0.08 329.981 396.817 -113.91 -619.297 0 0 -2245.48 0 0 -708.869 1850.87 0 0 0 0 1747.11 -2396.69 0 238.273 0 
487.609 0 0 0 0 2185.51 0 2287.13 1986.98 0.02 0 0 0 0 0 0 0 0 0 0 0 0 0 1168.32 0 0 0 2339.93 0 
0 0 0 0 973.464 0 0 0 1427.43 0 0.06 0 0 0 0 -1105.91 0 0 0 -1198.54 0 1697.36 2163.23 0 0 0 0 -1929.46 1408.66 
730.079 1884.75 330.134 55.62 0 -605.564 627.842 2211.14 1567.05 0 0 0.02 781.35 0 0 0 -2474.67 0 0 -2387.69 0 1469.7 0 0 0 2039.93 0 0 -980.331 
0 0 0 0 0 -2217.09 999.71 0 -1633.43 0 0 2313.23 0.07 0 0 0 1544.16 0 0 0 0 2452.54 1375.55 0 0 0 -2070.91 0 0 
1958.14 0 0 0 0 -1197.32 0 -16.8615 0 0 0 0 0 0.02 0 891.369 2400.2 0 0 0 0 2259.67 0 1494.42 0 0 -585.116 0 0 
0 0 0 0 1778.54 0 -1264.31 0 0 0 0 0 0 0 0.09 0 0 0 846.965 0 0 0 0 -591.372 2296.9 -589.999 0 0 0 
1163.14 0 0 0 2021.47 0 0 649.663 1966.54 0 -1543.24 0 0 -1822.79 0 0.03 0 0 0 0 0 660.039 0 1393.55 0 0 0 0 0 
0 -29.5267 0 0 -2148.12 0 0 0 0 0 0 2133.93 507.141 74.8466 0 0 0.08 0 0 0 0 0 0 172.353 0 0 0 1426.82 0 
0 1602.6 -2005.91 0 0 0 1627.48 0 0 0 0 0 0 0 0 0 0 0.05 0 0 1639.23 -342.494 0 0 0 0 0 0 0 
0 0 0 0 1853.77 0 -1600.01 488.83 -1620.46 0 0 0 0 0 -2440.64 0 0 0 0.02 0 0 0 0 0 611.057 0 2362.51 2413.48 0 
0 0 1655.1 0 0 0 0 0 2193.75 0 -397.275 2092.43 0 0 0 0 0 0 0 0.09 0 0 -1122.55 -940.046 0 0 0 0 0 
0 1737.8 0 223.319 1873.91 0 0 734.962 0 0 0 0 0 0 0 0 0 2400.81 0 0 0.05 0 0 0 -295.953 0 1986.83 0 0 
0 0 0 519.959 0 0 0 0 0 0 100.024 2295.37 -1100.57 289.697 0 1956.01 0 281.304 0 0 0 0.05 1885.51 0 1385.31 0 0 0 1529.66 
0 -246.971 0 2254.78 0 0 0 0 0 0 1697.06 0 1738.11 0 0 0 0 0 0 -1322.44 0 -1707.74 0.06 0 0 301.447 0 673.009 749.611 
0 0 0 0 -1255.61 0 0 2007.13 0 -1154.59 0 0 0 -949.049 2166.59 607.395 -1278.19 0 0 -953.322 0 0 0 0 2267.45 0 0 0 482.421 
0 0 577.639 0 2157.43 0 -1064.1 -711.921 1466.8 0 0 0 0 0 -2468.11 0 0 0 1648.84 0 -805.155 920.515 0 1564 0 0 0 0 0 
-1364.86 0 0 0 0 0 -294.275 0 2148.58 0 0 -377.132 0 0 200.583 0 0 0 0 0 0 0 2467.19 0 0 0.08 0 0 0 
0 0 1879.56 0 0 2119.28 0 0 0 0 0 0 -615.177 2155.9 0 0 0 0 -237.815 0 -1713.54 0 0 0 0 0 0.09 0 -1845.99 
0 0 0 0 0 2047.11 -705.969 0 58.8244 483.642 580.386 0 0 0 0 0 -1116.9 0 1726.66 0 0 0 -1873.15 0 0 0 0 0.05 277.795 
-712.683 -594.882 0 0 0 0 -2114.4 0 0 0 2182.15 2143.85 0 0 0 0 0 0 0 0 0 -2254.94 1043.5 688.879 0 0 1817.3 -971.786 0.08 
