*Vertices 53
*Matrix 
0.07 0 0 0 2113.64 0 0 2400.05 0 0 0 0 0 0 0 0 0 0 0 0 0 0 0 0 0 0 0 0 0 0 1932.36 0 -427.641 0 0 0 0 0 0 -2186.42 0 0 0 0 0 0 0 0 0 0 0 0 0 
0 0.03 0 0 1506.32 0 0 825.297 0 0 0 0 0 0 0 0 0 0 0 0 0 0 0 0 0 0 0 0 0 0 0 0 0 0 0 0 1920.91 0 0 0 0 0 0 0 0 0 0 0 0 0 0 0 0 
0 0 0.09 876.72 0 0 0 853.679 0 0 0 0 -290.002 0 0 0 0 0 -485.626 0 0 -2088.61 1769.39 0 0 0 0 0 636.998 0 0 2365.72 0 0 0 0 0 0 0 0 0 0 0 0 0 0 0 0 0 0 0 0 0 
0 0 1909.62 0 0 0 0 0 0 0 -661.412 0 0 0 0 0 0 0 0 1061.97 0 605.869 0 0 0 0 0 0 0 0 0 782.418 0 0 0 0 0 0 0 0 1309.02 1355.1 0 0 0 0 0 0 0 0 0 0 0 
806.223 1621.22 0 0 0.09 0 0 0 0 0 0 0 0 0 498.291 -102.466 0 772.805 0 0 2201.22 0 0 0 0 0 0 0 0 16.8615 903.577 0 0 0 0 0 0 0 0 0 -1251.64 0 0 0 0 0 0 0 0 0 0 0 0 
0 0 0 0 0 0 0 0 0 0 0 0 0 1842.78 0 0 0 0 0 0 0 0 0 0 0 0 0 0 0 0 0 0 0 1736.58 0 0 0 0 0 0 0 -1957.69 -86.2911 0 0 0 0 9.23185 0 0 0 0 0 
0 0 0 0 0 0 0.01 0 -1342.43 0 1694.16 0 0 2389.37 0 0 0 0 0 0 0 0 0 0 0 0 0 277.337 0 -1407.59 0 2176.2 0 0 0 0 0 0 0 1719.03 0 0 0 0 0 0 0 0 0 0 0 0 0 
1232.57 -2485.81 -298.853 0 0 0 0 0.01 0 0 0 0 0 796.762 0 0 0 0 0 755.867 0 1787.55 0 0 0 1964.25 0 0 0 0 0 0 0 0 0 0 0 0 0 0 0 73.7785 0 0 0 0 0 0 0 0 0 0 0 
0 0 0 0 0 0 517.518 0 0.05 1639.84 0 0 0 0 0 0 0 0 0 0 0 0 0 0 0 0 0 0 0 0 0 0 0 0 0 0 0 0 0 0 0 0 0 0 0 0 0 0 0 0 0 0 0 
0 0 0 0 0 0 0 0 -623.417 0.03 0 0 0 0 182.577 1132.62 0 0 0 0 0 0 0 0 0 0 0 0 790.506 164.418 0 0 0 0 0 0 0 0 0 0 1828.9 0 0 0 0 0 0 0 0 0 643.101 0 0 
0 0 0 2397.92 0 0 540.864 0 0 0 0.05 -1825.69 0 0 0 0 0 0 0 0 0 0 0 0 0 0 0 1541.57 0 0 606.632 0 0 2135.15 0 -1179.77 0 0 0 0 -1678.59 0 -1675.39 0 0 0 0 0 0 0 0 0 0 
0 0 0 0 0 0 0 0 0 0 1900.01 0.09 0 0 0 0 0 0 0 0 0 0 0 0 0 0 0 0 0 0 0 0 0 0 0 0 0 0 0 0 0 0 1742.53 0 0 0 0 0 0 0 0 0 0 
0 0 483.489 0 0 0 0 0 0 0 0 0 0 0 0 0 0 0 0 0 0 0 -612.43 0 -201.193 0 0 0 0 0 0 0 0 0 0 0 1499.6 0 0 0 0 2465.36 0 0 0 0 0 0 1350.22 0 0 0 0 
0 0 0 0 0 -1936.48 2050.61 1621.68 0 0 0 0 0 0.06 0 0 0 0 0 0 -428.404 776.467 96.6674 0 0 0 0 0 0 587.71 0 0 0 0 0 0 0 0 0 0 0 0 0 0 0 0 0 0 0 0 0 0 0 
0 0 0 0 1346.86 0 0 0 0 -2079.61 0 0 0 0 0.09 0 0 0 0 0 0 1345.33 0 0 0 0 1898.63 0 0 0 0 0 0 0 0 0 0 407.498 0 0 0 0 0 0 0 0 0 0 0 0 0 0 0 
0 0 0 0 -2108.14 0 0 0 0 538.423 0 0 0 0 0 0.01 0 0 0 -1072.04 0 268.944 0 0 0 0 0 0 0 0 0 0 0 1862.93 0 0 2014.91 0 0 0 0 -2074.27 0 0 0 0 0 0 0 0 0 0 0 
0 0 0 0 0 0 0 0 0 0 0 0 0 0 0 0 0.07 0 0 1073.56 0 0 0 -23.1178 0 0 0 315.027 0 0 0 0 0 0 0 0 0 0 0 0 0 0 0 0 0 0 0 0 0 0 0 0 0 
0 0 0 0 875.042 0 0 0 0 0 0 0 0 0 0 0 0 0.04 0 0 0 0 0 0 0 0 0 0 0 0 0 0 2025.59 0 0 0 0 0 0 0 0 0 0 0 0 0 0 0 0 0 0 0 0 
0 0 2262.11 0 0 0 0 0 0 0 0 0 0 0 0 0 0 0 0.07 0 0 0 224.235 0 0 0 0 0 0 0 0 0 -11.3681 0 0 0 0 -1894.51 0 0 0 0 0 0 0 0 0 0 0 0 0 0 0 
0 0 0 -1526.92 0 0 0 901.746 0 0 0 0 0 0 0 2085.86 2201.83 0 0 0.07 0 1048.23 0 0 0 0 0 0 984.909 0 0 0 0 -1011.15 0 0 0 0 0 0 0 0 0 0 0 0 0 0 0 0 0 0 0 
0 0 0 0 1217 0 0 0 0 0 0 0 0 -1196.71 0 0 0 0 0 0 0.04 0 0 1187.09 0 0 966.597 0 0 0 0 0 0 0 0 0 0 0 0 0 0 0 0 0 0 0 0 0 0 0 0 0 0 
0 0 -2028.79 2367.4 0 0 0 257.347 0 0 0 0 0 -51.1948 -29.0689 1287.8 0 0 0 1011.15 0 0.03 0 0 0 0 0 0 0 0 0 1500.67 0 1089.28 0 0 0 0 0 0 0 0 0 0 0 0 0 0 0 0 0 0 0 
0 0 1419.19 0 0 0 0 0 0 0 0 0 -1107.44 1736.12 0 0 0 0 1987.75 0 0 0 0.06 0 0 0 -349.208 0 0 0 0 0 0 -1367 0 0 0 0 0 0 0 0 0 0 0 0 0 0 0 0 0 0 0 
0 0 0 0 0 0 0 0 0 0 0 0 0 0 0 0 796.304 0 0 0 -181.661 0 0 0 0 0 0 0 0 2116.38 0 0 0 0 0 0 0 0 1204.64 0 0 0 0 0 0 0 0 0 0 0 0 0 0 
0 0 0 0 0 0 0 0 0 0 0 0 1241.11 0 0 0 0 0 0 0 0 0 0 0 0 0 0 0 0 321.741 0 0 0 0 2182.3 1459.93 0 0 0 0 0 0 0 0 0 0 0 0 0 0 0 0 0 
0 0 0 0 0 0 0 2138.36 0 0 0 0 0 0 0 0 0 0 0 0 0 0 0 0 0 0.09 0 0 0 2123.55 0 0 0 0 0 1544.77 0 -1509.83 0 0 0 0 0 2454.68 0 0 0 0 0 -1339.38 0 0 0 
0 0 0 0 0 0 0 0 0 0 0 0 0 0 -1250.88 0 0 0 0 0 -1362.12 0 -1189.69 0 0 0 0.01 0 0 0 2024.06 0 0 0 0 0 2384.64 485.473 1799.14 0 0 0 0 0 0 0 0 0 0 0 0 0 0 
0 0 0 0 0 0 2454.53 0 0 0 1563.84 0 0 0 0 0 2300.1 0 0 0 0 0 0 0 0 0 0 0 -1925.79 0 0 0 -1979.81 2072.89 0 -2110.13 0 0 0 0 0 0 0 0 0 -1188.16 0 0 0 0 0 0 0 
0 0 -221.641 0 0 0 0 0 0 2242.42 0 0 0 0 0 0 0 0 0 -1630.53 0 0 0 0 0 0 0 2467.35 0.06 0 0 0 0 0 0 0 0 0 0 0 0 0 0 -1931.75 0 0 0 0 0 0 0 0 0 
0 0 0 0 193.258 0 1309.32 0 0 202.872 0 0 0 -271.081 0 0 0 0 0 0 0 0 0 407.804 -597.018 -1003.83 0 0 0 0.01 0 0 0 0 -715.888 0 0 0 0 0 0 0 0 0 0 0 0 0 0 0 0 0 0 
256.127 0 0 0 -1388.21 0 0 0 0 0 40.9711 0 0 0 0 0 0 0 0 0 0 0 0 0 0 0 -241.783 0 0 0 0.05 1903.36 0 0 0 1248.89 1846.29 0 0 0 0 0 -1996.44 0 0 0 0 0 0 0 0 0 0 
0 0 61.7237 2055.65 0 0 2234.34 0 0 0 0 0 0 0 0 0 0 0 0 0 0 -1880.47 0 0 0 0 0 0 0 0 592.898 0.08 0 0 0 0 0 0 0 -385.525 0 0 0 0 0 0 -1196.71 0 0 0 0 0 0 
559.328 0 0 0 0 0 0 0 0 0 0 0 0 0 0 0 0 -1495.48 306.177 0 0 0 0 0 0 0 0 2226.86 0 0 0 0 0.05 0 0 0 0 0 0 0 0 0 0 0 0 0 0 0 0 0 0 0 0 
0 0 0 0 0 273.827 0 0 0 0 1973.86 0 0 0 0 118.03 0 0 0 -873.058 0 322.047 -2104.33 0 0 0 0 1975.84 0 0 0 0 0 0 0 0 0 2462.16 0 0 0 0 0 0 0 0 0 0 0 0 0 0 0 
0 0 0 0 0 0 0 0 0 0 0 0 0 0 0 0 0 0 0 0 0 0 0 0 1347.62 0 0 0 0 1003.37 0 0 0 0 0 453.887 0 0 0 0 0 0 0 0 1069.29 0 0 0 0 0 0 0 0 
0 0 0 0 0 0 0 0 0 0 1680.58 0 0 0 0 0 0 0 0 0 0 0 0 0 1773.51 1798.53 0 192.648 0 0 -588.321 0 0 0 -499.969 0.06 -2370.3 0 0 0 0 0 0 0 0 0 0 0 0 0 0 0 0 
0 -2213.89 0 0 0 0 0 0 0 0 0 0 403.378 0 0 1692.79 0 0 0 0 0 0 0 0 0 0 1394.01 0 0 0 2277.21 0 0 0 0 520.112 0.07 0 0 0 0 -1729.1 0 0 0 0 0 0 0 0 0 0 0 
0 0 0 0 0 0 0 0 0 0 0 0 0 0 728.401 0 0 0 -1648.69 0 0 0 0 0 0 111.927 1785.41 0 0 0 0 0 0 1970.66 0 0 0 0.06 0 0 0 0 0 0 0 0 0 0 0 0 0 0 0 
0 0 0 0 0 0 0 0 0 0 0 0 0 0 0 0 0 0 0 0 0 0 0 -1748.02 0 0 1759.47 0 0 0 0 0 0 0 0 0 0 0 0.02 0 0 0 0 0 0 0 0 0 0 0 0 0 0 
277.642 0 0 0 0 0 1786.02 0 0 0 0 0 0 0 0 0 0 0 0 0 0 0 0 0 0 0 0 0 0 0 0 743.507 0 0 0 0 0 0 0 0.07 0 0 0 0 0 0 0 0 0 0 0 0 0 
0 0 0 1735.97 899.915 0 0 0 0 1874.68 -2252.65 0 0 0 0 0 0 0 0 0 0 0 0 0 0 0 0 0 0 0 0 0 0 0 0 0 0 0 0 0 0.06 0 0 0 0 0 0 0 0 0 0 0 0 
0 0 0 1136.89 0 -1217 0 -1022.14 0 0 0 0 103.687 0 0 1785.1 0 0 0 0 0 0 0 0 0 0 0 0 0 0 0 0 0 0 0 0 2106.46 0 0 0 0 0.05 0 0 0 0 0 0 0 0 0 0 2352.44 
0 0 0 0 0 1753.67 0 0 0 0 1182.67 -221.793 0 0 0 0 0 0 0 0 0 0 0 0 0 0 0 0 0 0 1567.35 0 0 0 0 0 0 0 0 0 0 0 0.09 0 0 0 0 0 0 0 0 0 0 
0 0 0 0 0 0 0 0 0 0 0 0 0 0 0 0 0 0 0 0 0 0 0 0 0 -246.361 0 0 1676.46 0 0 0 0 0 0 0 0 0 0 0 0 0 0 0.01 0 0 0 0 0 0 0 0 0 
0 0 0 0 0 0 0 0 0 0 0 0 0 0 0 0 0 0 0 0 0 0 0 0 0 0 0 0 0 0 0 0 0 0 541.78 0 0 0 0 0 0 0 0 0 0.06 0 0 0 0 0 0 0 0 
0 0 0 0 0 0 0 0 0 0 0 0 0 0 0 0 0 0 0 0 0 0 0 0 0 0 0 237.51 0 0 0 0 0 0 0 0 0 0 0 0 0 0 0 0 0 0.09 0 0 0 0 0 0 0 
0 0 0 0 0 0 0 0 0 0 0 0 0 0 0 0 0 0 0 0 0 0 0 0 0 0 0 0 0 0 0 1782.05 0 0 0 0 0 0 0 0 0 0 0 0 0 0 0.02 0 0 0 0 0 0 
0 0 0 0 0 1470.61 0 0 0 0 0 0 0 0 0 0 0 0 0 0 0 0 0 0 0 0 0 0 0 0 0 0 0 0 0 0 0 0 0 0 0 0 0 0 0 0 0 0 0 0 0 0 0 
0 0 0 0 0 0 0 0 0 0 0 0 1518.37 0 0 0 0 0 0 0 0 0 0 0 0 0 0 0 0 0 0 0 0 0 0 0 0 0 0 0 0 0 0 0 0 0 0 0 0.03 0 0 0 0 
0 0 0 0 0 0 0 0 0 0 0 0 0 0 0 0 0 0 0 0 0 0 0 0 0 1929.91 0 0 0 0 0 0 0 0 0 0 0 0 0 0 0 0 0 0 0 0 0 0 0 0.05 0 -667.974 0 
0 0 0 0 0 0 0 0 0 819.041 0 0 0 0 0 0 0 0 0 0 0 0 0 0 0 0 0 0 0 0 0 0 0 0 0 0 0 0 0 0 0 0 0 0 0 0 0 0 0 0 0.05 0 0 
0 0 0 0 0 0 0 0 0 0 0 0 0 0 0 0 0 0 0 0 0 0 0 0 0 0 0 0 0 0 0 0 0 0 0 0 0 0 0 0 0 0 0 0 0 0 0 0 0 758.309 0 0.05 0 
0 0 0 0 0 0 0 0 0 0 0 0 0 0 0 0 0 0 0 0 0 0 0 0 0 0 0 0 0 0 0 0 0 0 0 0 0 0 0 0 0 2004.38 0 0 0 0 0 0 0 0 0 0 0.01 
