*Vertices 64
*Matrix 
0.03 1632.05 2380.98 0 0 0 0 0 0 0 0 0 0 0 0 0 0 0 0 0 0 461.821 0 0 0 2298.73 0 0 0 1442.53 0 0 0 419.553 83.8496 0 0 0 0 0 0 0 0 0 0 0 0 0 0 2298.88 0 0 0 0 0 0 0 0 0 0 0 0 0 0 
-930.586 0 0 0 0 0 0 0 0 0 0 0 0 324.03 0 0 0 0 0 0 0 0 0 0 0 0 0 0 280.999 0 -374.081 0 0 0 0 1588.26 0 0 0 -80.34 -848.186 0 0 0 0 0 0 0 0 1501.89 0 0 0 0 0 1717.35 0 0 0 0 0 0 0 0 
-1972.95 0 0.01 0 0 0 538.27 794.32 586.795 0 0 0 0 0 0 0 0 0 0 0 0 0 -737.251 0 0 0 0 -44.0229 0 0 0 0 0 0 0 1303.83 0 321.894 0 0 0 0 0 0 0 2279.66 0 0 0 0 0 0 0 47.9904 -1319.54 0 0 1292.69 0 0 0 0 0 0 
0 0 0 0.03 0 0 0 0 1575.29 0 0 0 0 0 0 0 0 -671.178 0 0 0 1147.72 0 0 0 0 0 777.535 0 0 0 0 0 0 0 0 0 909.986 0 0 0 0 0 0 0 0 0 0 0 0 0 0 0 0 -400.937 0 0 0 0 0 0 0 0 0 
0 0 0 0 0.09 0 0 0 0 0 0 0 0 0 0 0 0 0 0 0 0 2003.31 0 0 0 0 0 0 0 0 -995.895 1654.33 2350.61 0 713.904 0 0 0 0 0 0 0 0 0 0 0 0 0 -2035.97 0 0 614.109 0 0 0 0 0 0 0 0 0 0 0 0 
0 0 0 0 0 0.05 0 0 0 0 0 0 0 0 0 0 0 0 -2371.21 0 0 0 990.707 0 0 1917.1 0 0 0 0 0 0 0 0 0 0 0 0 1386.07 1633.12 0 0 0 0 0 0 0 0 0 0 0 0 0 1766.34 599.612 0 0 1604.28 0 0 0 0 0 0 
0 0 555.361 0 0 0 0.07 0 -1049.3 0 0 0 0 0 0 0 -1305.05 0 -1259.42 0 0 0 0 0 0 0 0 0 0 0 0 0 0 0 615.024 0 0 0 0 0 1690.19 1966.99 0 0 0 0 396.664 0 1048.69 0 0 0 0 0 0 0 0 0 0 0 0 0 0 0 
0 0 714.972 0 0 0 0 0.07 0 0 0 0 0 0 0 0 0 -12.7415 0 0 2370.14 0 0 0 0 -648.747 0 0 0 0 0 1621.98 0 0 0 0 0 0 0 0 0 2464.6 0 0 0 0 0 0 0 0 0 0 0 0 0 0 0 0 0 0 0 0 0 0 
0 0 -1070.82 2456.66 0 0 605.869 0 0.03 0 0 0 1019.55 0 0 0 0 0 0 0 0 0 0 0 0 0 0 0 0 0 0 0 0 0 0 0 0 0 1602.3 0 1754.74 0 0 -1179.31 0 0 0 0 0 0 0 0 0 0 0 -1768.78 0 0 0 0 0 0 0 0 
0 0 0 0 0 0 0 0 0 0.09 0 0 0 0 2288.81 -1274.22 0 0 -687.964 0 0 534.303 0 0 0 0 0 1269.04 0 0 0 0 0 0 0 0 944.777 0 0 0 0 0 0 0 0 0 0 0 0 1019.55 0 0 0 14.5726 466.094 -1654.94 0 0 0 0 0 0 0 0 
0 0 0 0 0 0 0 0 0 0 0.09 0 0 0 0 0 0 0 0 0 0 0 1546.91 0 968.886 0 0 0 0 -1160.85 0 0 0 0 0 0 0 0 0 0 0 0 0 0 0 0 0 0 0 0 0 0 0 0 -160.909 0 1333.89 0 0 0 0 0 0 0 
0 0 0 0 0 0 0 0 0 0 0 0.01 0 0 1427.43 0 0 0 0 0 0 0 0 -1878.34 0 1881.85 0 1116.6 0 0 0 0 0 0 0 0 0 1327.02 0 0 0 0 0 0 0 0 792.795 0 0 0 0 0 -1210.44 0 1553.77 0 0 1769.08 0 0 0 0 0 0 
0 0 0 0 0 0 0 0 1708.66 0 0 0 0.01 0 0 0 0 0 0 0 0 833.079 484.405 0 0 0 -2281.18 2092.43 0 0 0 94.2259 0 0 0 0 0 0 0 0 0 0 0 0 0 0 0 0 1629.61 0 0 0 0 0 0 0 0 -355.77 0 0 0 0 0 0 
0 847.575 0 0 0 0 0 0 0 0 0 0 0 0.07 0 0 0 0 0 0 0 0 0 0 0 0 0 -283.288 0 0 0 0 1274.99 0 0 0 79.8822 -2349.85 0 18.54 0 0 0 0 0 1394.01 1026.11 0 0 0 0 0 781.198 0 0 0 0 0 0 0 0 0 0 0 
0 0 0 0 0 0 0 0 0 -249.107 0 -1806.62 0 0 0.04 0 0 955.458 0 0 0 0 0 0 0 0 0 0 0 0 1891.92 0 0 1015.12 -1517 0 0 0 0 0 0 0 1929.91 0 0 0 0 0 0 0 2448.58 -1549.81 2021.93 0 0 0 0 -2090.75 0 0 0 0 0 0 
0 0 0 0 0 0 0 0 0 -356.533 0 0 0 0 0 0.01 0 0 0 0 0 -78.9666 0 -1021.23 1866.89 0 2432.25 0 0 0 -2131.49 0 0 0 0 0 0 0 0 -1877.27 0 0 0 0 0 2268.67 0 0 0 0 0 0 0 0 0 2019.18 0 0 0 0 0 0 0 0 
0 0 0 0 0 0 1382.26 0 0 0 0 0 0 0 0 0 0.05 2462.31 0 0 0 0 0 0 1370.05 0 0 0 0 0 0 -807.138 0 0 0 0 0 534.455 0 0 0 0 0 0 0 -2251.12 0 0 0 0 0 0 0 0 0 0 0 0 0 0 0 0 0 0 
0 0 0 1665.32 0 0 0 2281.03 0 0 0 0 0 0 2088.46 0 1060.14 0.06 0 0 0 0 1790.14 0 0 0 0 0 0 0 0 104.907 0 0 0 -1394.31 0 0 0 0 0 0 0 0 0 0 -1951.43 0 0 0 0 0 0 0 0 0 0 0 0 0 0 0 0 0 
0 0 0 0 0 874.432 -832.469 0 0 560.396 0 0 0 0 0 0 0 0 0.03 0 0 0 0 0 0 0 0 0 0 0 0 0 0 0 -1112.17 0 0 0 0 0 0 0 0 0 0 0 0 0 0 0 0 0 2175.13 1608.1 0 0 0 0 0 0 0 0 0 0 
0 0 0 0 0 0 0 0 0 0 0 0 0 0 0 0 0 0 0 0.08 0 0 0 0 0 1994.61 0 0 0 0 0 0 0 0 0 0 0 474.181 0 0 1955.85 1864.3 0 0 0 0 0 0 23.5755 0 0 0 0 1976.61 0 0 0 0 0 0 0 0 0 0 
0 0 0 0 0 0 0 1794.26 0 0 0 0 0 0 0 0 0 0 0 0 0 0 0 0 0 0 0 0 0 0 0 1952.35 1479.46 1009.17 0 0 0 0 0 0 0 0 0 0 0 0 0 0 0 0 0 0 603.427 0 0 0 0 0 0 0 0 0 0 0 
504.089 0 0 -1130.02 -647.984 0 0 0 0 2075.95 0 0 2183.07 0 0 1066.24 0 0 0 0 0 0.04 0 2487.79 0 0 0 -210.654 0 0 0 0 0 0 0 0 0 0 0 0 0 0 0 0 0 0 2292.47 -1321.99 0 0 0 0 0 0 0 0 0 0 0 0 0 -1195.64 0 0 
0 0 313.349 0 0 -678.808 0 0 0 0 2032.46 0 47.0748 0 0 0 0 287.255 0 0 0 0 0.01 0 1567.81 0 0 2023.15 -1742.84 0 -416.959 0 0 0 1247.52 0 0 0 0 0 0 0 0 0 0 0 0 0 0 0 0 0 0 0 0 0 0 0 0 0 0 0 0 0 
0 0 0 0 0 0 0 0 0 0 0 2377.47 0 0 0 1869.79 0 0 0 0 0 -779.214 0 0.08 0 0 0 0 0 0 0 0 152.669 0 0 0 0 0 0 0 0 -1199.61 0 -1253.47 225.608 0 0 0 0 0 0 0 593.661 0 0 -1763.89 0 570.162 0 0 0 0 0 0 
0 0 0 0 0 0 0 0 0 0 262.841 0 0 0 0 1506.93 -1571.93 0 0 0 0 0 656.224 0 0.06 0 0 0 1826.76 -898.846 0 0 0 0 132.221 2211.29 0 0 0 0 0 1719.49 0 0 0 0 0 0 0 0 0 0 0 0 0 0 0 2332.15 0 0 0 0 0 0 
2285.76 0 0 0 0 -256.432 0 125.202 0 0 0 -355.464 0 0 0 0 0 0 0 1590.85 0 0 0 0 0 0.05 0 0 0 0 0 0 0 0 0 0 0 0 1368.37 0 0 0 0 0 0 0 0 0 0 -1256.98 0 0 0 0 0 0 0 0 0 0 0 0 0 0 
0 0 0 0 0 0 0 0 0 0 0 0 1604.13 0 0 278.863 0 0 0 0 0 0 0 0 0 0 0.01 1627.78 0 0 0 0 0 0 0 0 0 0 0 0 0 0 0 -1667.76 0 0 0 0 0 0 0 0 0 366.604 0 0 0 0 0 0 0 0 0 0 
0 0 1196.25 -2090.75 0 0 0 0 0 -876.263 0 1148.03 -567.721 495.392 0 0 0 0 0 0 0 -1795.63 -1354.79 0 0 0 1121.94 0.03 0 0 0 0 0 0 2498.02 2261.8 0 0 0 0 0 0 0 0 0 0 0 0 0 1135.21 0 0 0 0 2071.06 0 0 0 0 0 0 0 0 0 
0 1154.59 0 0 0 0 0 0 0 0 0 0 0 0 0 0 0 0 0 0 0 0 -116.352 0 1894.06 0 0 0 0.06 0 0 0 0 0 0 0 0 -556.734 1671.12 0 0 0 0 0 0 0 0 0 0 0 0 482.727 0 0 0 0 -1117.51 0 0 0 0 0 0 0 
1347.62 0 0 0 0 0 0 0 0 0 2231.13 0 0 0 0 0 0 0 0 0 0 0 0 0 2245.17 0 0 0 0 0.09 0 0 0 0 0 0 0 0 0 0 0 0 0 0 0 0 0 0 0 0 0 0 0 0 -702.46 0 0 0 0 0 0 0 0 0 
0 -1686.38 0 0 152.821 0 0 0 0 0 0 0 0 0 1568.42 -1554.69 0 0 0 0 0 0 1903.67 0 0 0 0 0 0 0 0.09 0 0 0 0 0 0 0 1266.59 0 0 0 0 0 307.703 1063.34 0 0 -1467.86 0 0 0 0 0 1710.03 0 0 0 0 0 0 0 0 0 
0 0 0 0 2156.82 0 0 -1923.05 0 0 0 0 1673.56 0 0 0 2292.63 -1710.33 0 0 965.987 0 0 0 0 0 0 0 0 0 0 0.03 0 0 0 614.719 0 0 1903.36 0 0 0 0 0 0 0 0 0 0 1549.65 0 0 0 0 0 1846.29 0 0 -1396.6 0 0 0 492.492 0 
0 0 0 0 -2104.63 0 0 0 0 0 0 0 0 1849.19 0 0 0 0 0 0 -1334.35 0 0 2324.52 0 0 0 0 0 0 0 0 0.09 0 0 0 -732.368 0 0 0 0 0 0 2284.84 0 -2396.69 0 -60.8081 0 0 1551.33 0 0 0 0 0 0 0 0 0 0 0 0 0 
1730.02 0 0 0 0 0 0 0 0 0 0 0 0 0 93.6155 0 0 0 0 0 1219.75 0 0 0 0 0 0 0 0 0 0 0 0 0.07 0 0 0 0 0 0 -830.332 0 0 0 -2049.24 1814.55 0 0 0 0 0 792.337 0 0 0 0 723.212 0 0 0 0 0 0 0 
2383.11 0 0 0 -1071.43 0 1571.17 0 0 0 0 0 0 0 1333.12 0 0 0 -390.713 0 0 0 -250.938 0 1806.01 0 0 351.344 0 0 0 0 0 0 0.02 -1094.47 0 0 0 0 0 0 0 0 2192.68 -231.864 0 -1924.12 0 0 0 0 0 0 0 0 0 0 0 0 0 0 0 0 
0 1777.47 1147.27 0 0 0 0 0 0 0 0 0 0 0 0 0 0 273.98 0 0 0 0 0 0 1730.32 0 0 -607.395 0 0 0 1634.65 0 0 2319.18 0.09 0 0 0 0 0 0 -1751.38 0 0 0 0 0 0 0 0 0 0 0 0 0 0 1952.19 0 0 0 0 0 0 
0 0 0 0 0 0 0 0 0 1404.39 0 0 0 -1677.07 0 0 0 0 0 0 0 0 0 0 0 0 0 0 0 0 0 0 -265.282 0 0 0 0.05 0 0 0 0 1805.09 0 1526.46 0 0 0 0 0 0 0 0 0 0 0 0 0 0 0 0 0 0 0 0 
0 0 959.883 1987.44 0 0 0 0 0 0 0 1973.56 0 706.58 0 0 1783.58 0 0 -563.295 0 0 0 0 0 0 0 0 899.457 0 0 0 0 0 0 0 0 0.01 0 0 0 0 0 0 0 0 0 0 0 0 0 0 0 0 0 0 0 1972.64 0 0 0 0 0 -1257.13 
0 0 0 0 0 14.2674 0 0 351.497 0 0 0 0 0 0 0 0 0 0 0 0 0 0 0 0 -1572.54 0 0 1524.63 0 -1509.06 2483.06 0 0 0 0 0 0 0.03 0 0 904.797 0 0 0 0 0 0 0 0 0 26.1696 0 0 0 0 0 1641.82 0 0 0 0 0 0 
0 2370.75 0 0 0 2039.32 0 0 0 0 0 0 0 936.842 0 -991.623 0 0 0 0 0 0 0 0 0 0 0 0 0 0 0 0 0 0 0 0 0 0 0 0.01 0 0 0 0 0 0 0 0 0 0 0 0 0 0 0 0 0 0 0 0 0 0 0 0 
0 1256.22 0 0 0 0 1675.85 0 934.553 0 0 0 0 0 0 0 0 0 0 486.847 0 0 0 0 0 0 0 0 0 0 0 0 0 2269.28 0 0 0 0 0 0 0.01 -131.764 0 -1802.35 -576.266 2157.43 0 0 -1586.12 1011.61 0 0 0 0 0 0 0 0 0 0 0 0 0 0 
0 0 0 0 0 0 1263.7 582.522 0 0 0 0 0 0 0 0 0 0 0 2376.25 0 0 0 1690.65 568.331 0 0 0 0 0 0 0 0 0 0 0 -2060.69 0 2360.38 0 -1489.84 0.04 0 0 0 -1463.13 0 0 0 0 0 -294.733 -130.848 1944.56 1773.51 0 0 0 0 0 0 0 0 0 
0 0 0 0 0 0 0 0 0 0 0 0 0 0 494.018 0 0 0 0 0 0 0 0 0 0 0 0 0 0 0 0 0 0 0 0 -935.163 0 0 0 0 0 0 0.07 0 0 2440.64 0 0 0 0 0 0 0 0 0 0 -2136.68 0 0 0 0 0 0 0 
0 0 0 0 0 0 0 0 2163.23 0 0 0 0 0 0 0 0 0 0 0 0 0 0 824.839 0 0 1952.8 0 0 0 0 0 -1444.06 0 0 0 -1044.27 0 0 0 359.584 0 0 0.08 0 0 0 1564.46 0 0 0 -147.176 0 0 0 0 0 0 -101.703 0 0 0 0 0 
0 0 0 0 0 0 0 0 0 0 0 0 0 0 0 0 0 0 0 0 0 0 0 183.493 0 0 0 0 0 0 858.409 0 0 1987.44 2391.96 0 0 0 0 0 1152.76 0 0 0 0.06 0 0 0 1700.11 628.147 0 0 0 0 0 0 0 0 0 0 0 0 0 0 
0 0 2046.8 0 0 0 0 0 0 0 0 0 0 1757.33 0 295.495 282.83 0 0 0 0 0 0 0 0 0 0 0 0 0 1576.36 0 -164.418 190.054 -1897.26 0 0 0 0 0 -1223.56 1079.82 -2212.52 0 0 0.02 0 0 0 0 0 0 2395.32 0 0 0 0 0 0 0 0 0 0 0 
0 0 0 0 0 0 1779.76 0 0 0 0 1109.12 0 1502.04 0 0 0 -1932.36 0 0 0 -212.485 0 0 0 0 0 0 0 0 0 0 0 0 0 0 0 0 0 0 0 0 0 0 0 0 0.04 -1361.51 519.959 0 0 0 0 0 0 0 0 0 0 0 0 0 0 0 
0 0 0 0 0 0 0 0 0 0 0 0 0 0 0 0 0 0 0 0 0 1695.53 0 0 0 0 0 0 0 0 0 0 1141.47 0 -760.598 0 0 0 0 0 0 0 0 -1007.64 0 0 -581.759 0.01 0 767.769 0 1250.57 0 0 0 0 0 0 0 0 0 0 0 0 
0 0 0 0 1274.38 0 -2332 0 0 0 0 0 905.56 0 0 0 0 0 0 722.907 0 0 0 0 0 0 0 0 0 0 475.86 0 0 0 0 0 0 0 0 0 894.421 0 0 0 539.644 0 923.566 0 0.04 0 660.497 0 0 0 0 0 0 0 0 0 0 0 0 0 
706.58 -587.863 0 0 0 0 0 0 0 810.343 0 0 0 0 0 0 0 0 0 0 0 0 0 0 0 1050.22 0 -1615.42 0 0 0 -594.272 0 0 0 0 0 0 0 0 2431.18 0 0 0 -173.269 0 0 1018.78 0 0.03 0 0 0 0 0 -598.849 640.812 0 0 0 0 0 0 0 
0 0 0 0 0 0 0 0 0 0 0 0 0 0 1193.35 0 0 0 0 0 0 0 0 0 0 0 0 0 0 0 0 0 541.017 0 0 0 0 0 0 0 0 0 0 0 0 0 0 0 765.328 0 0.08 0 0 0 -187.918 0 0 0 0 0 0 0 0 0 
0 0 0 0 2499.54 0 0 0 0 0 0 0 0 0 -32.2733 0 0 0 0 0 0 0 0 0 0 0 0 0 -381.863 0 0 0 0 -38.9874 0 0 0 0 -883.435 0 0 2419.58 0 2256.16 0 0 0 -1687.44 0 0 0 0.01 0 0 0 0 0 0 0 0 0 0 0 0 
0 0 0 0 0 0 0 0 0 0 0 1766.18 0 -2306.82 1475.04 0 0 0 -1001.24 0 2341.91 0 0 440.153 0 0 0 0 0 0 0 0 0 0 0 0 0 0 0 0 0 2304.83 0 0 0 920.209 0 0 0 0 0 0 0.02 1188.01 0 0 1880.32 0 0 0 0 0 0 0 
0 0 1853.92 0 0 1514.4 0 0 0 857.799 0 0 0 0 0 0 0 0 671.331 2289.73 0 0 0 0 0 0 1215.48 0 0 0 0 0 0 0 0 0 0 0 0 0 0 -2040.54 0 0 0 0 0 0 0 0 0 0 -1660.44 0 0 0 -1368.07 0 0 -2295.07 0 0 0 0 
0 0 -686.438 -1156.58 0 1909.62 0 0 0 -248.344 667.821 -107.501 0 0 0 0 0 0 0 0 0 0 0 0 0 0 0 1582.16 0 -770.669 1329.62 0 0 0 0 0 0 0 0 0 0 2210.84 0 0 0 0 0 0 0 0 1415.07 0 0 0 0.05 0 100.94 2302.55 0 0 0 0 0 0 
0 1922.28 0 0 0 0 0 0 730.537 -2052.29 0 0 0 0 0 1716.74 0 0 0 0 0 0 0 1531.5 0 0 0 0 0 0 0 1942.43 0 0 0 0 0 0 0 0 0 0 0 0 0 0 0 0 0 -1222.8 0 0 0 0 0 0.07 -1880.32 0 0 0 0 0 0 0 
0 0 0 0 0 0 0 0 0 0 -212.333 0 0 0 0 0 0 0 0 0 0 0 0 0 0 0 0 0 -580.691 0 0 0 0 513.398 0 0 0 0 0 0 0 0 1549.35 0 0 0 0 0 0 -820.566 0 0 -100.024 -251.854 2035.2 956.069 0.08 0 0 0 0 0 0 0 
0 0 -38.2244 0 0 37.6141 0 0 0 0 0 -1047.01 526.521 0 -568.636 0 0 0 0 0 0 0 0 2220.3 889.233 0 0 0 0 0 0 0 0 0 0 612.125 0 1410.64 965.072 0 0 0 0 0 0 0 0 0 0 0 0 0 0 0 -2318.41 0 0 0.04 0 0 1829.2 0 0 0 
0 0 0 0 0 0 0 0 0 0 0 0 0 0 0 0 0 0 0 0 0 0 0 0 0 0 0 0 0 0 0 -68.7429 0 0 0 0 0 0 0 0 0 0 0 2066.33 0 0 0 0 0 0 0 0 0 0 0 0 0 0 0.07 0 0 0 0 0 
0 0 0 0 0 0 0 0 0 0 0 0 0 0 0 0 0 0 0 0 0 0 0 0 0 0 0 0 0 0 0 0 0 0 0 0 0 0 0 0 0 0 0 0 0 0 0 0 0 0 0 0 0 1406.06 0 0 0 0 0 0.03 0 0 0 0 
0 0 0 0 0 0 0 0 0 0 0 0 0 0 0 0 0 0 0 0 0 0 0 0 0 0 0 0 0 0 0 0 0 0 0 0 0 0 0 0 0 0 0 0 0 0 0 0 0 0 0 0 0 0 0 0 0 2042.83 0 0 0.08 0 0 0 
0 0 0 0 0 0 0 0 0 0 0 0 0 0 0 0 0 0 0 0 0 1415.98 0 0 0 0 0 0 0 0 0 0 0 0 0 0 0 0 0 0 0 0 0 0 0 0 0 0 0 0 0 0 0 0 0 0 0 0 0 0 0 0 0 0 
0 0 0 0 0 0 0 0 0 0 0 0 0 0 0 0 0 0 0 0 0 0 0 0 0 0 0 0 0 0 0 1538.51 0 0 0 0 0 0 0 0 0 0 0 0 0 0 0 0 0 0 0 0 0 0 0 0 0 0 0 0 0 0 0.01 0 
0 0 0 0 0 0 0 0 0 0 0 0 0 0 0 0 0 0 0 0 0 0 0 0 0 0 0 0 0 0 0 0 0 0 0 0 0 2197.56 0 0 0 0 0 0 0 0 0 0 0 0 0 0 0 0 0 0 0 0 0 0 0 0 0 0 
