*Vertices 49
*Matrix 
0.06 0 0 0 2079.91 0 -316.706 108.417 0 1542.79 0 2182.91 0 0 1449.4 -548.189 0 0 0 0 0 0 0 1614.81 0 0 0 0 0 0 0 0 0 0 0 684.149 -907.392 0 0 -533.692 0 0 0 2226.1 0 0 0 0 0 
0 0.06 0 0 1.75481 0 1717.35 0 0 1268.43 -689.337 0 0 0 1965.62 0 1739.48 2030.63 -1118.27 0 0 0 0 0 0 0 1272.55 0 0 0 0 0 0 0 0 0 0 0 0 1441.31 0 0 0 0 -543.153 0 0 0 0 
0 0 0.01 0 0 0 965.072 0 0 -2259.67 0 0 2222.43 0 0 2487.33 -1648.99 0 0 0 0 1524.02 0 0 0 0 0 0 0 0 0 0 0 0 0 0 577.029 0 0 0 0 0 0 0 0 0 0 0 0 
0 0 0 0.08 0 0 -371.944 0 1100.12 0 0 0 -1032.98 -1656.16 0 1559.27 2214.04 0 0 0 0 0 0 0 0 0 0 0 1464.05 0 -920.972 0 0 0 0 0 0 0 0 0 0 0 0 0 0 943.403 0 163.656 0 
2396.85 1458.25 0 0 0.08 0 1385.01 0 0 0 -1370.36 -840.709 0 0 74.3889 181.814 594.729 0 0 0 777.535 0 0 0 0 0 0 0 0 0 0 0 522.401 0 0 0 0 0 0 0 0 -2313.68 0 0 0 215.384 0 714.972 -2281.95 
0 0 0 0 0 0.07 0 0 1728.64 0 0 0 830.18 0 1719.18 0 0 0 0 0 -231.407 0 0 0 0 0 0 0 0 0 -1566.13 0 0 0 0 0 0 -1161 0 1848.73 0 0 0 0 0 0 0 0 0 
388.577 -779.977 2253.11 1764.35 2174.83 0 0.06 0 0 -1403.47 0 0 0 0 -702.46 0 0 0 0 0 0 0 0 0 0 0 0 0 928.297 0 0 0 0 0 -467.772 0 0 0 0 0 0 0 0 0 0 0 0 0 0 
1402.55 0 0 0 0 0 0 0.07 0 1864.3 0 0 0 0 0 0 -1011.31 1400.88 0 0 262.23 0 0 0 0 0 0 0 0 0 0 1424.68 -689.337 0 0 0 0 0 0 0 0 0 0 0 0 -148.091 2037.34 0 -1717.96 
0 0 0 2167.81 0 1642.12 0 0 0.01 2188.56 255.669 0 0 0 0 0 0 517.365 506.684 -2190.08 0 0 0 0 0 0 0 0 0 0 0 0 0 0 0 0 0 0 0 0 -759.529 0 0 0 0 0 0 0 0 
1586.89 1616.34 -1505.55 0 0 0 737.251 -1148.34 14.1148 0.02 0 0 2045.43 0 -1437.04 0 0 0 0 0 0 1026.87 0 402.921 0 0 0 0 0 0 0 0 0 0 0 0 0 2022.23 0 0 0 -905.103 702.765 0 0 0 0 0 0 
0 2197.41 0 0 1371.27 0 0 0 2109.06 0 0.02 0 0 0 0 0 -1012.83 0 0 0 0 0 0 0 0 1791.97 0 0 -95.9044 0 0 0 0 0 0 0 -2462.46 0 0 0 0 0 0 0 0 0 0 0 -92.3948 
-375.607 0 0 0 1890.55 0 0 0 0 0 0 0.07 2284.69 0 0 1553.01 0 0 0 0 0 0 0 0 0 0 0 0 0 0 0 0 895.032 0 0 -164.571 0 0 883.129 0 0 0 0 0 0 1269.04 0 0 0 
0 0 2009.87 1696.3 0 2492.98 0 0 0 806.223 0 1901.84 0.02 1593.3 0 0 0 -651.036 0 2423.25 0 0 122.608 0 0 0 0 0 0 0 0 1573.92 -308.618 0 0 0 0 0 0 0 -2140.49 0 457.091 0 0 0 0 0 0 
0 0 0 169.912 0 0 0 0 0 0 0 0 2394.1 0.01 0 -1236.38 0 1509.67 0 0 0 0 1699.35 85.5281 0 0 0 0 0 0 0 0 0 0 0 0 0 0 0 -458.617 0 0 1974.32 0 0 754.341 0 0 0 
136.341 214.927 0 0 1160.7 1336.33 1756.72 0 0 1085.62 0 0 0 0 0.05 2498.17 0 0 0 0 0 0 0 0 0 0 0 0 0 0 0 0 0 0 0 0 0 0 0 0 -1782.36 0 0 0 0 0 0 0 0 
1157.03 0 534.913 2102.65 1412.02 0 0 0 0 0 0 -1279.72 0 281.915 -2223.5 0.09 0 0 0 0 0 0 0 0 0 0 0 0 0 0 0 0 0 0 0 0 0 0 0 418.485 0 0 0 0 1157.64 0 2455.14 0 0 
0 1261.56 1688.97 249.26 1153.52 0 0 -1841.87 0 0 1815.16 0 0 0 0 0 0.09 120.777 -1277.89 0 0 0 0 0 0 2017.35 0 0 0 0 0 -2028.49 0 0 0 0 0 0 0 0 0 0 0 0 0 0 0 0 0 
0 2117.3 0 0 0 0 0 925.703 1524.93 0 0 0 167.623 -732.826 0 0 2207.79 0.05 0 0 0 0 0 0 0 45.5489 0 0 0 0 0 0 0 0 0 0 0 0 2337.34 0 0 0 0 0 0 -1435.36 0 0 0 
0 471.129 0 0 0 0 0 0 -539.033 0 0 0 0 0 0 0 745.338 0 0.01 0 0 0 1819.44 0 0 0 0 0 0 0 0 0 0 0 0 0 0 0 0 -113.605 0 0 0 0 0 0 0 0 0 
0 0 0 0 0 0 0 0 2204.73 0 0 0 2155.14 0 0 0 0 0 0 0.01 0 0 0 0 0 0 0 2298.58 0 0 0 0 0 0 -2480.16 0 0 0 0 0 28.1533 0 0 0 0 0 0 0 0 
0 0 0 0 716.193 902.051 0 1414.61 0 0 0 0 0 0 0 0 0 0 0 0 0.03 0 0 0 0 0 0 0 0 0 2142.63 0 0 0 0 -572.298 0 0 -1818.67 0 0 0 0 953.78 0 0 0 0 0 
0 0 1405.45 0 0 0 0 0 0 1862.32 0 0 0 0 0 0 0 0 0 0 0 0.08 0 0 0 0 0 0 1741 0 0 0 0 0 0 0 0 0 0 0 0 0 0 0 0 0 -690.252 0 0 
0 0 0 0 0 0 0 0 0 0 0 0 893.506 92.3948 0 0 0 0 -512.177 0 0 0 0.05 0 0 0 0 0 0 0 0 0 0 0 0 2244.1 0 0 0 0 0 0 0 0 98.3459 0 0 0 0 
2346.49 0 0 0 0 0 0 0 0 -608.31 0 0 0 1938.46 0 0 0 0 0 0 0 0 0 0.09 0 247.276 877.178 0 0 1492.89 0 0 -434.965 0 0 0 0 0 0 0 0 0 0 0 0 0 -1852.09 0 0 
0 0 0 0 0 0 0 0 0 0 0 0 0 0 0 0 0 0 0 0 0 0 0 0 0 0 1769.08 1001.69 0 0 0 0 0 0 0 0 0 0 813.7 0 0 0 0 0 0 0 0 -974.532 0 
0 0 0 0 0 0 0 0 0 0 1234.4 0 0 0 0 0 2440.95 1032.98 0 0 0 0 0 63.2496 0 0.05 0 -1499.76 0 0 247.887 0 0 2411.65 0 0 0 -1605.35 0 0 0 0 0 0 0 0 0 0 0 
0 544.221 0 0 0 0 0 0 0 0 0 0 0 0 0 0 0 0 0 0 0 0 0 1514.56 1851.18 0 0.08 0 0 0 0 0 0 0 0 0 0 0 0 0 0 0 0 -508.82 0 0 0 0 0 
0 0 0 0 0 0 0 0 0 0 0 0 0 0 0 0 0 0 0 106.586 0 0 0 0 -2481.84 2362.97 0 0.03 2325.28 0 0 0 0 0 0 0 0 0 0 0 0 0 0 0 0 0 -435.423 0 0 
0 0 0 2012.47 0 0 -2320.7 0 0 0 1780.53 0 0 0 0 0 0 0 0 0 0 -1270.71 0 0 0 0 0 2371.82 0.02 1016.65 0 0 2120.81 0 0 0 0 0 0 0 0 0 0 0 0 0 0 0 0 
0 0 0 0 0 0 0 0 0 0 0 0 0 0 0 0 0 0 0 0 0 0 0 2366.79 0 0 0 0 -45.7015 0.05 0 -1232.87 0 0 0 0 0 0 0 0 0 0 -1383.94 -112.079 0 0 0 0 0 
0 0 0 2382.81 0 1030.23 0 0 0 0 0 0 0 0 0 0 0 0 0 0 -1504.03 0 0 0 0 -1583.53 0 0 0 0 0.05 0 0 1798.23 0 0 0 0 0 0 0 0 0 -2045.43 0 0 0 0 0 
0 0 0 0 0 0 0 1671.73 0 0 0 0 -284.356 0 0 0 1491.36 0 0 0 0 0 0 0 0 0 0 0 0 1345.64 0 0.02 0 2034.9 0 0 877.026 0 0 0 0 2303 0 0 20.2185 0 0 0 0 
0 0 0 0 1341.36 0 0 763.192 0 0 0 -1966.23 -1390.19 0 0 0 0 0 0 0 0 0 0 1908.09 0 0 0 0 518.433 0 0 0 0.09 0 290.765 0 0 0 0 767.006 0 0 0 0 873.211 -1802.65 0 0 0 
0 0 0 0 0 0 0 0 0 0 0 0 0 0 0 0 0 0 0 0 0 0 0 0 0 1744.21 0 0 0 0 1526.92 540.864 0 0.06 926.618 0 2446.13 0 0 0 2275.38 0 0 0 0 0 0 0 0 
0 0 0 0 0 0 11.8259 0 0 0 0 0 0 0 0 0 0 0 0 352.26 0 0 0 0 0 0 0 0 0 0 0 0 -197.378 1544.47 0.06 0 0 0 0 0 0 0 0 0 0 0 0 0 0 
-1246.76 0 0 0 0 0 0 0 0 0 0 1129.41 0 0 0 0 0 0 0 0 -1223.11 0 1369.59 0 0 0 0 0 0 0 0 0 0 0 0 0.09 0 1060.14 0 0 0 0 0 0 0 0 0 0 0 
-760.14 0 1124.68 0 0 0 0 0 0 0 1271.63 0 0 0 0 0 0 0 0 0 0 0 0 0 0 0 0 0 0 0 0 -1872.84 0 2383.57 0 0 0 -1822.95 0 0 0 0 0 -26.6274 0 0 0 0 0 
0 0 0 0 0 745.033 0 0 0 2276.91 0 0 0 0 0 0 0 0 0 0 0 0 0 0 0 2292.78 0 0 0 0 0 0 0 0 0 342.952 -1609.62 0.01 0 0 0 0 0 0 -1084.4 0 0 0 -2305.9 
0 0 0 0 0 0 0 0 0 0 0 1507.39 0 0 0 0 0 2057.94 0 0 1601.54 0 0 0 -254.906 0 0 0 0 0 0 0 0 0 0 0 0 0 0.02 0 -98.4985 0 0 0 0 0 1399.81 0 0 
-705.664 1180.23 0 0 0 1579.41 0 0 0 0 0 0 0 561.769 0 -2046.65 0 0 1229.06 0 0 0 0 0 0 0 0 0 0 0 0 0 358.821 0 0 0 0 0 0 0 781.808 0 0 0 0 0 0 0 0 
0 0 0 0 0 0 0 0 233.085 0 0 0 -814.158 0 -183.493 0 0 0 0 -1547.98 0 0 0 0 0 0 0 0 0 0 0 0 0 1852.7 0 0 0 0 -412.839 1929.15 0 0 569.704 0 0 0 0 0 0 
0 0 0 0 142.903 0 0 0 0 -1785.87 0 0 0 0 0 0 0 0 0 0 0 0 0 0 0 0 0 0 0 0 0 2465.36 0 0 0 0 0 0 0 0 0 0.07 0 2432.55 0 0 0 -407.041 0 
0 0 0 0 0 0 0 0 0 -1566.13 0 0 1482.97 1844 0 0 0 0 0 0 0 0 0 0 0 0 0 0 0 -19.9133 0 0 0 0 0 0 0 0 0 0 -829.875 0 0.07 0 0 0 97.5829 0 0 
-1284.45 0 0 0 0 0 0 0 0 0 0 0 0 0 0 0 0 0 0 0 464.721 0 0 0 0 0 -898.999 0 0 2292.02 2403.71 0 0 0 0 0 -1551.79 0 0 0 0 1961.81 0 0.01 0 0 0 0 0 
0 1489.84 0 0 0 0 0 0 0 0 0 0 0 0 0 -2406.31 0 0 0 0 0 0 1196.86 0 0 0 0 0 0 0 0 878.246 -1521.73 0 0 0 0 2115.31 0 0 0 0 0 0 0.03 0 0 0 0 
0 0 0 737.404 299.31 0 0 2229.91 0 0 0 -444.578 0 -1439.94 0 0 0 -1295.13 0 0 0 0 0 0 0 0 0 0 0 0 0 0 1162.83 0 0 0 0 0 0 0 0 0 0 0 0 0.09 0 0 0 
0 0 0 0 0 0 0 1556.37 0 0 0 0 0 0 0 1443.6 0 0 0 0 0 2226.71 0 -429.167 0 0 0 -349.513 0 0 0 0 0 0 0 0 0 0 1864.6 0 0 0 575.503 0 0 0 0.05 0 0 
0 0 0 -2450.56 2353.66 0 0 0 0 0 0 0 0 0 0 0 0 0 0 0 0 0 0 0 -511.261 0 0 0 0 0 0 0 0 0 0 0 0 0 0 0 0 2141.41 0 0 0 0 0 0.05 0 
0 0 0 0 1232.26 0 0 467.62 0 0 949.355 0 0 0 0 0 0 0 0 0 0 0 0 0 0 0 0 0 0 0 0 0 0 0 0 0 0 -1047.93 0 0 0 0 0 0 0 0 0 0 0.04 
