*Vertices 39
*Matrix 
0.06 -32.4259 0 530.03 0 0 0 720.771 0 0 0 1682.56 0 0 0 1607.18 0 -209.128 0 0 0 0 0 0 0 0 0 954.695 0 0 0 0 0 0 0 0 0 0 0 
-2337.34 0.09 1967.45 1521.73 0 0 0 0 -1868.88 2241.05 0 0 0 0 -476.012 0 0 0 0 0 0 0 -1844.46 0 0 0 -978.347 0 1734.29 1088.21 0 363.247 0 0 0 1891.92 1826.91 0 0 
0 -756.478 0.08 0 0 -1214.56 0 0 0 0 0 0 0 0 0 1313.14 0 0 1410.64 0 0 0 0 2020.86 850.322 -395.596 0 0 0 0 0 0 0 0 0 0 0 1886.43 0 
807.749 201.041 0 0.06 0 0 0 629.215 0 -1775.64 0 -167.623 0 0 0 1000.17 118.03 1159.93 0 0 0 0 2220.91 -44.3281 -1773.35 0 0 0 0 0 0 0 1018.78 0 0 0 0 -2272.64 0 
0 0 0 0 0.04 1434.75 -246.513 0 0 1429.26 0 0 0 0 0 0 0 0 0 0 0 0 0 2166.59 0 0 -2073.5 0 0 -175.405 0 0 0 -1311.3 0 -307.855 0 0 0 
0 0 -1735.21 0 -1988.66 0 0 80.7978 0 0 0 0 -940.199 0 2403.87 0 0 -761.666 1132.16 184.408 0 0 0 0 0 2466.89 1503.72 1309.63 0 0 -6.02741 0 0 0 0 0 -1049.91 0 0 
0 0 0 0 1062.73 0 0.07 0 0 -405.82 0 0 0 0 -658.971 0 0 0 0 2080.68 0 781.045 0 -119.709 0 -2306.05 0 0 0 0 -525.3 641.118 0 0 0 0 0 0 0 
1492.58 0 0 -109.943 0 -439.238 0 0.01 0 0 2464.6 0 0 0 0 0 0 0 0 140.767 0 0 0 0 723.518 0 0 0 0 0 0 0 1025.19 1108.05 0 0 0 0 0 
0 1494.11 0 0 0 0 0 0 0.08 0 129.933 0 -1648.23 0 803.476 -591.22 0 0 0 -2225.79 0 0 0 -313.807 0 0 0 1914.2 0 0 0 0 2458.49 856.273 0 449.309 1327.63 -2033.22 0 
0 1019.55 0 -766.701 -1607.64 0 -463.042 0 0 0.02 0 0 0 0 0 -2233.73 0 0 1120.72 0 -1467.41 0 0 0 0 0 2374.72 0 0 0 -395.901 0 467.315 2112.87 1449.1 0 0 0 0 
0 0 0 0 0 0 0 2224.57 2272.48 0 0 0 0 0 0 0 0 0 0 0 1887.49 0 0 0 0 0 0 -2380.06 0 0 0 0 0 0 0 0 0 0 0 
817.209 0 0 1115.53 0 0 0 0 0 0 0 0.04 0 0 0 1143.45 0 0 0 0 0 0 0 0 1413.69 0 0 0 0 0 -2048.78 0 0 0 0 0 0 0 0 
0 0 0 0 0 -1888.87 0 0 2153.77 0 0 0 0.08 0 293.817 -92.0896 0 -2219.53 0 0 -1216.24 0 0 0 0 0 0 0 -204.855 0 0 184.713 2285 0 0 -2133.63 0 0 2464.6 
0 0 0 0 0 0 0 0 0 0 0 0 0 0.08 0 0 0 0 0 0 0 1595.74 0 1496.7 0 0 0 0 0 0 -1925.49 0 0 0 0 1621.83 0 58.2141 657.292 
0 -800.272 0 0 0 -1250.57 1214.56 0 -132.069 0 0 0 -868.48 0 0.01 0 0 748.39 0 0 0 809.275 0 0 0 0 0 807.749 0 1644.72 0 0 0 0 1217 0 0 0 0 
-496.307 0 1116.9 1990.19 0 0 0 0 1868.88 2408.6 0 -247.581 1885.36 0 0 0.08 0 0 0 0 0 0 0 0 2068.77 0 0 0 0 0 0 0 0 0 0 -2000.56 -1990.95 0 0 
0 0 0 1706.82 0 0 0 0 0 0 0 0 0 0 0 0 0.01 0 0 0 0 0 0 2237.08 280.541 0 0 0 0 -2331.39 0 0 0 0 0 0 2444.3 0 0 
1251.03 0 0 2362.67 0 -593.051 0 0 0 0 0 0 155.263 0 -1498.84 0 0 0 0 1228.6 0 0 0 -1724.52 0 0 0 647.679 0 0 0 0 0 1829.2 1969.28 0 0 0 0 
0 0 -854.137 0 0 2153.46 0 0 0 2273.71 0 0 0 0 0 0 0 0 0.09 0 0 0 0 0 -2276.91 0 0 1350.83 1822.34 0 0 2361.29 0 0 0 0 0 750.832 0 
0 0 0 0 0 1454.74 1074.63 -478.912 115.741 0 0 0 0 0 0 0 0 2374.57 0 0.04 2266.53 0 0 0 0 -68.8955 0 2039.93 0 -1846.75 0 -1999.8 0 0 0 0 -1077.38 0 0 
0 0 0 0 0 0 0 0 0 1466.95 1770 0 1571.02 0 0 0 0 0 0 2326.2 0 -741.218 0 1313.29 0 0 0 0 -2046.34 0 0 0 0 0 0 0 1046.4 288.018 0 
0 0 0 0 0 0 -2384.95 0 0 0 0 0 0 1648.53 2278.44 0 0 0 0 0 -2194.66 0.04 1809.67 0 0 0 0 2487.95 -1641.21 0 0 0 940.504 0 0 0 0 0 0 
0 -1919.08 0 702.612 0 0 0 0 0 0 0 0 0 0 0 0 0 0 0 0 0 1206.17 0.01 0 0 0 0 46.617 2364.8 0 221.946 1015.12 0 0 0 0 0 0 -1518.22 
0 0 852.916 -907.697 -1451.84 0 -1178.4 0 588.015 0 0 0 0 347.682 0 0 140.767 908.765 0 0 -505.005 0 0 0.09 0 0 0 0 2106.46 0 0 182.272 0 0 0 0 1741.16 0 0 
0 0 2060.69 -407.346 0 0 0 -69.6585 0 0 0 2318.41 0 0 0 -1283.23 1594.21 0 -97.7355 0 0 0 0 0 0.07 0 0 0 0 0 0 0 0 0 0 0 0 0 0 
0 0 938.978 0 0 1233.79 2209.92 0 0 0 0 0 0 0 0 0 0 0 0 -463.958 0 0 0 0 0 0.06 -1902.14 682.623 467.772 0 0 0 0 0 0 0 357.295 0 0 
0 587.71 0 0 841.166 -353.786 0 0 0 754.189 0 0 0 0 0 0 0 0 0 0 0 0 0 0 0 532.167 0.06 638.218 -815.989 0 2191.31 0 0 0 0 0 1948.99 -1937.85 0 
-2327.42 0 0 0 0 1212.27 0 0 -923.872 0 1308.86 0 0 0 -1556.67 0 0 2000.41 280.541 1731.54 0 -1107.44 1330.53 0 0 -845.439 603.58 0.09 0 0 0 581.912 0 0 0 0 0 0 0 
0 645.238 0 0 0 0 0 0 0 0 0 0 1143.91 0 0 0 0 0 1162.98 0 462.432 974.532 -359.279 2465.97 0 1833.78 -1618.93 0 0.09 0 1538.06 0 1249.35 1148.95 0 0 0 0 0 
0 -1706.82 0 0 1784.95 0 0 0 0 0 0 0 0 0 -1133.23 0 -46.4644 0 0 1326.72 0 0 0 0 0 0 0 0 0 0.02 0 0 1814.86 0 0 0 -1259.27 2091.66 1302.15 
0 0 0 0 0 -753.426 1446.2 0 0 -1851.63 0 1037.86 0 -1230.43 0 0 0 0 0 0 0 0 2091.51 0 0 0 1567.2 0 187.765 0 0.05 0 0 2114.55 0 0 0 0 0 
0 623.722 0 0 0 0 1185.26 0 0 0 0 0 1894.97 0 0 0 0 0 649.052 1362.73 0 0 1061.97 327.845 0 0 0 1298.33 0 0 0 0.08 0 0 0 0 0 -697.882 2214.65 
0 0 0 -2236.63 0 0 0 636.692 -396.207 -775.857 0 0 2256.77 0 0 0 0 0 0 0 0 1033.43 0 0 0 0 0 0 971.48 1972.18 0 0 0.06 0 0 391.934 -736.488 0 0 
0 0 0 0 -167.776 0 0 2123.86 1581.55 -951.796 0 0 0 0 0 0 0 265.282 0 0 0 0 0 0 0 0 0 0 1625.64 0 -1060.59 0 0 0.01 -1556.22 0 0 2083.12 0 
0 0 0 0 0 0 0 0 0 -800.882 0 0 0 0 544.069 0 0 1406.06 0 0 0 0 0 0 0 0 0 0 0 0 0 0 0 -642.643 0.09 0 0 0 0 
0 -1703.01 0 0 692.694 0 0 0 764.718 0 0 0 1560.95 1625.34 0 314.875 0 0 0 0 0 0 0 0 0 0 0 0 0 0 0 0 1696.3 0 0 0 0 0 0 
0 1362.58 0 0 0 486.694 0 0 -695.441 0 0 0 0 0 0 -1974.93 -1253.32 0 0 -1823.56 -325.556 0 0 1648.38 0 -1038.77 -174.337 0 0 1983.02 0 0 2264.24 0 0 0 0.02 0 0 
0 0 901.44 1618.78 0 0 0 0 124.287 0 0 0 0 1399.66 0 0 0 0 -1251.64 0 1971.27 0 0 0 0 0 815.989 0 0 -841.319 0 -373.318 0 2256 0 0 0 0.06 0 
0 0 0 0 0 0 0 0 0 0 0 0 639.439 -673.162 0 0 0 0 0 0 0 0 1815.62 0 0 0 0 0 0 -927.381 0 1613.28 0 0 0 0 0 0 0 
