*Vertices 60
*Matrix 
0.02 0 0 0 0 0 -1360.29 0 0 0 0 0 0 1531.8 0 1777.93 0 0 0 0 0 833.232 455.565 0 0 0 0 0 0 0 0 0 0 0 1100.12 0 0 0 0 0 0 0 0 0 0 0 0 1823.4 0 0 -1963.18 0 0 0 0 0 0 0 0 0 
0 0.04 0 0 940.962 0 0 0 0 0 0 0 0 0 0 0 0 0 0 0 0 680.181 0 0 0 0 0 0 2083.42 0 0 0 0 671.178 -481.658 0 0 0 0 0 -63.7074 0 1329.77 0 0 0 0 0 -1219.14 0 0 0 0 0 0 0 0 0 0 0 
0 0 0.07 0 0 0 0 0 0 0 0 0 0 1025.8 0 0 135.273 0 0 0 0 -1309.47 0 0 0 0 0 -828.806 0 0 0 0 0 0 1623.66 0 0 0 0 0 0 0 0 0 325.251 0 0 0 -397.58 0 0 -1105.46 0 0 0 0 956.526 443.358 0 0 
0 0 0 0 0 0 0 0 0 0 2153.77 0 0 -524.689 0 0 0 0 -292.444 0 0 0 0 0 0 0 0 0 0 0 0 -278.71 0 0 0 0 0 0 0 0 0 0 534.15 0 0 0 0 0 0 0 0 0 0 0 557.802 0 0 0 0 0 
0 -971.023 0 0 0.05 0 0 0 0 0 0 0 0 0 1847.36 0 -1093.86 0 0 0 -173.421 0 0 0 0 0 0 0 0 0 0 0 0 0 0 0 0 0 -774.483 0 0 0 0 0 0 0 0 0 0 441.069 0 0 0 0 0 2051.07 0 0 0 0 
0 0 0 0 0 0.03 0 2403.41 0 0 0 -2047.87 0 0 0 0 0 0 0 0 0 0 -2378.23 0 0 0 0 0 0 0 0 0 0 0 0 0 0 822.55 0 0 0 1052.2 0 0 0 0 0 664.464 0 0 0 0 0 0 0 0 0 0 0 0 
-1081.35 0 0 0 0 0 0.08 0 0 0 0 0 0 0 0 0 0 0 0 0 0 -460.753 0 0 0 0 0 0 0 1565.52 2024.83 0 0 1204.18 0 0 0 0 0 0 0 0 0 0 0 0 0 0 0 0 0 0 0 -515.229 0 0 0 879.315 0 0 
0 0 0 0 0 -641.423 0 0.02 0 20.8289 0 0 0 0 1795.63 0 0 0 0 0 0 0 -829.722 0 0 0 0 2388.15 0 2314.91 0 0 -1277.73 0 0 0 0 922.193 2450.1 0 0 0 0 -1517.61 0 0 0 0 -1221.43 0 0 0 0 0 0 0 0 0 0 0 
0 0 0 0 0 0 0 0 0.04 0 0 0 0 0 0 0 0 0 0 0 0 0 -1214.71 0 0 0 1061.36 0 0 0 0 0 -2097.46 0 713.141 0 0 0 0 0 0 0 0 -669.652 0 1238.67 0 0 0 2495.42 0 0 0 0 0 -185.934 0 1524.78 0 0 
0 0 0 0 0 0 0 962.02 0 0.05 0 0 0 0 1779.46 0 0 0 0 0 0 0 0 0 0 0 0 0 0 0 264.061 0 0 0 0 0 0 0 0 -175.1 -450.682 0 0 0 0 -312.891 0 0 0 0 0 0 0 0 0 0 -247.429 0 0 0 
0 0 0 1437.35 0 0 0 0 0 0 0.05 0 0 188.528 0 0 0 0 0 0 478.759 0 0 0 0 0 0 0 0 0 0 0 0 0 152.364 0 0 0 765.023 0 0 0 0 0 0 2053.36 0 16.5563 0 0 0 0 0 0 0 0 0 0 0 0 
0 0 0 0 0 2165.21 0 0 0 0 0 0.01 0 -2130.73 0 0 0 977.432 1380.58 0 1188.47 0 0 0 0 0 0 -1851.48 0 0 0 0 0 0 0 0 0 0 0 0 0 0 0 0 0 0 0 0 0 0 0 0 1396.76 0 0 0 0 0 0 0 
0 0 0 0 0 0 0 0 0 0 0 0 0.01 -2197.87 1830.27 0 0 0 0 0 0 1484.04 0 0 0 0 -656.224 0 0 -1136.89 0 0 0 0 0 0 0 0 2322.23 2401.12 0 0 0 0 0 0 0 0 0 0 0 -794.778 0 0 0 0 0 0 0 0 
-449.767 0 2324.52 414.823 0 0 0 0 0 0 1330.68 0.0762963 1617.25 0.08 0 0 0 0 0 0 0 0 1663.95 0 616.092 711.005 0 0 0 1756.26 0 0 0 0 0 0 0 0 0 0 0 -1953.26 0 0 0 0 0 0 0 0 0 0 1854.99 0 0 0 0 0 0 0 
0 0 0 0 -303.43 0 0 608.768 0 945.54 0 0 2028.18 0 0.04 1727.42 0 0 0 0 0 0 0 0 0 0 -187.155 0 0 0 0 0 0 0 0 0 0 -1319.24 2489.47 0 0 0 418.638 0 0 0 0 0 0 685.064 0 0 0 -226.218 0 0 2313.23 0 0 0 
1713.84 0 0 0 0 0 0 0 0 0 0 0 0 0 448.088 0.04 0 0 0 0 0 -342.799 0 0 0 0 0 0 -740.455 0 0 0 -1970.2 0 1985 2400.66 0 0 1603.37 0 0 0 0 -1133.69 0 0 0 0 0 0 0 0 -751.9 -246.361 -533.235 1942.12 0 0 0 0 
0 0 1023.51 0 2177.88 0 0 0 0 0 0 0 0 0 0 0 0.03 0 690.863 2469.18 0 0 0 0 0 0 0 -1877.88 0 0 0 0 -1944.87 0 0 0 0 0 0 -813.242 0 0 0 0 0 0 0 0 0 0 0 0 0 0 0 0 0 0 0 0 
0 0 0 0 0 0 0 0 0 0 0 -1459.93 0 0 0 0 0 0.08 0 0 0 0 0 0 0 0 0 0 0 0 0 0 0 0 0 0 0 0 0 0 0 0 0 0 0 1799.6 0 0 0 0 88.1222 0 0 0 0 0 0 0 0 0 
0 0 0 2461.39 0 0 0 0 0 0 0 -425.81 0 0 0 0 997.269 0 0.01 0 0 0 2221.21 0 0 0 0 0 0 0 0 0 0 0 0 -140.614 0 0 0 0 0 0 0 0 0 -2076.1 0 0 0 2368.01 2451.93 0 0 0 0 0 0 0 0 0 
0 0 0 0 0 0 0 0 0 0 0 0 0 0 0 0 2140.64 0 0 0.01 0 0 0 0 0 0 -307.855 0 0 0 -364.772 0 0 0 0 0 -2183.07 0 0 0 0 -274.285 1344.26 0 -322.962 0 0 0 0 0 0 0 0 1412.78 0 0 0 0 0 0 
0 0 0 0 997.421 0 0 0 0 0 2442.01 -2313.99 0 0 0 0 0 0 0 0 0.06 0 0 0 0 0 0 0 0 0 0 0 827.128 0 -266.198 -1337.24 0 0 0 0 0 0 0 0 0 0 0 0 0 0 0 0 0 0 0 0 0 0 0 0 
1158.86 1853.47 1334.65 0 0 0 1327.94 0 0 0 0 0 1527.99 0 0 1305.2 0 0 0 0 0 0.08 0 0 0 0 0 0 0 0 1097.67 0 0 0 0 0 0 0 1551.94 0 768.685 0 0 0 0 0 0 0 0 -2166.89 0 888.012 0 0 0 0 0 2285.61 0 0 
1217.46 0 0 0 0 64.0126 0 2293.69 2322.38 0 0 0 0 2306.97 0 0 0 0 1400.88 0 0 0 0.06 0 1688.51 776.62 0 0 0 814.92 0 1410.95 0 0 0 0 0 0 69.8111 0 0 0 0 0 0 0 0 0 0 1824.93 0 0 0 0 0 0 -1.44963 0 0 0 
0 0 0 0 0 0 0 0 0 0 0 0 0 0 0 0 0 0 0 0 0 0 0 0.03 0 0 109.18 0 0 0 0 0 0 0 0 0 616.855 0 0 0 0 0 0 0 0 0 0 980.483 0 1321.53 0 0 0 0 0 0 0 558.412 0 0 
0 0 0 0 0 0 0 0 0 0 0 0 0 629.215 0 0 0 0 0 0 0 0 192.038 0 0.03 0 539.186 0 0 0 0 0 0 0 0 0 0 0 0 0 0 0 0 1162.07 0 0 -289.087 0 0 0 0 0 0 0 401.7 0 0 0 2180.17 0 
0 0 0 0 0 0 0 0 0 0 0 0 0 -1449.71 0 0 0 0 0 0 0 0 2344.66 0 0 0 0 0 -1385.16 0 0 0 1691.11 602.512 0 0 0 0 0 0 0 0 0 0 0 0 0 0 0 0 154.347 0 0 0 1227.68 0 0 0 0 0 
0 0 0 0 0 0 0 0 2332.76 0 0 0 -895.184 0 -1146.81 0 0 0 0 1679.05 0 0 0 -868.023 -1999.65 0 0.03 0 0 0 0 1706.67 0 0 0 0 0 1635.41 0 0 -524.232 0 0 1092.03 0 0 0 0 0 0 0 0 0 0 0 0 0 0 0 0 
0 0 452.971 0 0 0 0 374.233 0 0 0 988.723 0 0 0 0 1994.16 0 0 0 0 0 0 0 0 0 0 0.06 0 478.912 0 0 0 0 0 0 0 0 0 0 0 0 94.5311 0 1462.22 0 0 0 0 0 0 0 0 0 0 0 0 0 0 0 
0 1164.2 0 0 0 0 0 0 0 0 0 0 0 0 0 1899.24 0 0 0 0 0 0 0 0 0 1863.54 0 0 0.03 0 0 0 0 0 0 0 0 0 -323.573 0 0 0 0 0 0 0 0 0 0 0 0 0 0 0 0 0 -1625.49 0 0 0 
0 0 0 0 0 0 -901.898 -402.005 0 0 0 0 -288.934 -1189.84 0 0 0 0 0 0 0 0 2403.1 0 0 0 0 -1423.46 0 0.04 0 1457.03 0 0 0 0 2191.61 0 0 0 1824.78 0 0 0 0 -189.138 1461.61 0 0 0 -1448.03 0 0 0 0 0 0 0 0 0 
0 0 0 0 0 0 -888.775 0 0 -861.766 0 0 0 0 0 0 0 0 0 -1405.76 0 120.014 0 0 0 0 0 0 0 0 0.02 0 -449.156 2304.83 0 0 0 0 0 2389.98 0 0 0 472.045 0 0 0 0 0 0 0 0 1767.86 0 0 0 0 -514.313 0 0 
0 0 0 -2122.03 0 0 0 0 0 0 0 0 0 0 0 0 0 0 0 0 0 0 1632.21 0 0 0 1405.61 0 0 -589.236 0 0.03 0 0 0 0 0 0 0 0 0 0 0 0 0 0 0 0 0 0 0 0 1535 0 0 0 0 0 0 0 
0 0 0 0 0 0 0 -2092.43 -2109.21 0 0 0 0 0 0 -2305.44 2149.95 0 0 0 569.094 0 0 0 0 2475.59 0 0 0 0 2441.86 0 0.02 0 0 -746.864 0 0 0 0 0 1240.65 0 0 0 0 0 0 0 0 0 1438.41 0 0 0 0 0 0 0 0 
0 -779.214 0 0 0 0 492.34 0 0 0 0 0 0 0 0 0 0 0 0 0 0 0 0 0 0 1856.52 0 0 0 0 -674.383 0 0 0.08 0 1308.25 0 0 0 1887.65 0 0 0 0 0 -243.156 0 0 -1208.3 0 -62.7918 0 0 0 2119.28 0 0 0 0 0 
-881.756 1386.68 -357.906 0 0 0 0 0 1433.68 0 -874.279 0 0 0 0 1647.92 0 0 0 0 -1229.21 0 0 0 0 0 0 0 0 0 0 0 0 0 0 0 0 0 1430.02 0 -55.3148 0 1130.33 0 0 0 0 0 0 0 0 0 0 0 1045.34 0 0 0 0 0 
0 0 0 0 0 0 0 0 0 0 0 0 0 0 0 1427.88 0 0 -1824.02 0 -41.5815 0 0 0 0 0 0 0 0 0 0 0 922.193 1743.29 0 0.08 0 0 0 1534.24 0 0 0 -661.107 0 0 0 0 0 0 0 0 0 0 0 0 0 0 0 1728.03 
0 0 0 0 0 0 0 0 0 0 0 0 0 0 0 0 0 0 0 298.7 0 0 0 784.555 0 0 0 0 0 2496.34 0 0 0 0 0 0 0.07 0 0 0 0 0 0 0 0 0 0 0 631.657 0 0 0 0 0 0 0 0 0 0 0 
0 0 0 0 0 1218.68 0 -2267.3 0 0 0 0 0 0 -63.2496 0 0 0 0 0 0 0 0 0 0 0 2043.29 0 0 0 0 0 0 0 0 0 0 0 0 0 0 0 0 0 0 0 0 0 0 -794.778 0 0 1931.44 0 0 1104.08 0 0 0 0 
0 0 0 0 126.728 0 0 1267.36 0 0 298.547 0 681.097 0 -205.771 2463.68 0 0 0 0 0 1026.87 1805.55 0 0 0 0 0 -1044.72 0 0 0 0 0 -1519.44 0 0 0 0.01 0 1951.58 0 0 0 0 0 0 0 0 0 0 0 0 0 0 2206.56 0 0 0 0 
0 0 0 0 0 0 0 0 0 -2397.76 0 0 -871.227 0 0 0 1543.24 0 0 0 0 0 0 0 0 0 0 0 0 0 1474.43 0 0 2132.86 0 894.879 0 0 0 0.01 0 0 0 0 0 0 -1880.93 0 0 0 0 0 1350.83 1567.35 0 376.827 0 0 0 0 
0 -52.8733 0 0 0 0 0 0 0 -2170.4 0 0 0 0 0 0 0 0 0 0 0 495.849 0 0 0 0 2017.96 0 0 980.483 0 0 0 0 -1820.05 0 0 0 20.9815 0 0.01 0 1499.15 0 0 0 0 2432.1 0 0 0 1823.1 0 0 0 0 0 -1850.87 0 0 
0 0 0 0 0 1226.92 0 0 0 0 0 0 0 573.367 0 0 0 0 0 -1901.23 0 0 0 0 0 0 0 0 0 0 0 0 988.418 0 0 0 0 0 0 0 0 0.08 0 0 0 1057.24 0 1018.63 0 257.958 0 0 -923.109 0 0 286.798 0 0 0 0 
0 1527.38 0 1732.76 0 0 0 0 0 0 0 0 0 0 -73.9311 0 0 0 0 2096.24 0 0 0 0 0 0 0 1719.18 0 0 0 0 0 0 1222.65 0 0 0 0 0 -320.978 0 0.06 0 0 0 -24.3385 0 0 0 0 0 0 0 0 0 0 0 0 0 
0 0 0 0 0 0 0 1619.69 452.361 0 0 0 0 0 0 1070.97 0 0 0 0 0 0 0 0 1187.09 0 1325.04 0 0 0 2230.06 0 0 0 0 -134.968 0 0 0 0 0 0 0 0.08 0 0 0 0 0 0 0 0 1183.13 0 0 0 0 0 0 0 
0 0 203.177 0 0 0 0 0 0 0 0 0 0 0 0 0 0 0 0 -1947.16 0 0 0 0 0 0 0 921.278 0 0 0 0 0 0 0 0 0 0 0 0 0 0 0 0 0.05 0 0 830.027 254.143 0 0 0 1240.96 0 0 0 0 1864.45 0 0 
0 0 0 0 0 0 0 0 -922.346 419.553 1424.99 0 0 0 0 0 0 -37.0037 -2346.8 0 0 0 0 0 0 0 0 0 0 154.653 0 0 0 1410.95 0 0 0 0 0 0 0 2456.51 0 0 0 0.08 0 0 0 0 0 0 778.298 0 -84.7652 0 0 0 0 0 
0 0 0 0 0 0 0 0 0 0 0 0 0 0 0 0 0 0 0 0 0 0 0 0 1650.21 0 0 0 0 -1006.88 0 0 0 0 0 0 0 0 0 6.63778 0 0 575.045 0 0 0 0.05 0 -630.894 0 0 0 0 0 0 0 0 0 0 0 
-2021.16 0 0 0 0 1990.34 0 0 0 0 1661.2 0 0 0 0 0 0 0 0 0 0 0 0 589.541 0 0 0 0 0 0 0 0 0 0 0 0 0 0 0 0 -2396.69 -1199.61 0 0 1500.52 0 0 0.05 0 0 0 0 0 0 0 0 0 0 0 0 
0 -1939.53 1849.19 0 0 0 0 1239.13 0 0 0 0 0 0 0 0 0 0 0 0 0 0 0 0 0 0 0 0 0 0 0 0 0 219.047 0 0 1681.34 0 0 0 0 0 0 0 -884.045 0 33.6467 0 0.09 0 0 536.592 0 0 0 0 801.187 0 0 0 
0 0 0 0 980.483 0 0 0 565.432 0 0 0 0 0 811.258 0 0 0 1831.03 0 0 2327.42 -771.432 -2182.3 0 0 0 0 0 0 0 0 0 0 0 0 0 572.604 0 0 0 -1490.45 0 0 0 0 0 0 0 0.05 0 845.439 0 0 0 0 0 1508.15 0 0 
2099.44 0 0 0 0 0 0 0 0 0 0 0 0 0 0 0 0 -1220.05 669.652 0 0 0 0 0 0 2293.69 0 0 0 2200.31 0 0 0 2278.44 0 0 0 0 0 0 0 0 0 0 0 0 0 0 0 0 0 0 0 275.353 359.127 0 -1565.52 0 0 0 
0 0 -175.405 0 0 0 0 0 0 0 0 0 -862.835 0 0 0 0 0 0 0 0 -442.747 0 0 0 0 0 0 0 0 0 0 -171.285 0 0 0 0 0 0 0 554.292 0 0 0 0 0 0 0 224.235 2196.65 0 0 569.704 0 0 0 0 0 0 0 
0 0 0 0 0 0 0 0 0 0 0 -2310.63 0 -2173.91 0 238.731 0 0 0 0 0 0 0 0 0 0 0 0 0 0 -143.056 349.361 0 0 0 0 0 -617.008 0 2411.65 0 2395.32 0 1052.51 1199.45 1813.94 0 0 0 0 0 -331.965 0 0 -1216.24 1257.74 0 0 0 0 
0 0 0 0 0 0 1541.87 0 0 0 0 0 0 0 -2187.34 1833.93 0 0 0 -1202.05 0 0 0 0 0 0 0 0 0 0 0 0 0 0 0 0 0 0 0 -2039.63 0 0 0 0 0 0 0 0 0 0 2154.99 0 0 0.02 0 0 0 0 0 0 
0 0 0 1059.07 0 0 0 0 0 0 0 0 0 0 0 -631.199 0 0 0 0 0 0 0 0 1339.99 -742.897 0 0 0 0 0 0 0 -1010.7 -587.863 0 0 0 0 0 0 0 0 0 0 -161.672 0 0 0 0 1952.8 0 1699.19 0 0.04 1822.95 0 0 0 0 
0 0 0 0 -1289.94 0 0 0 792.489 0 0 0 0 0 0 1373.56 0 0 0 0 0 0 0 0 0 0 0 0 0 0 0 0 0 0 0 0 0 992.691 684.149 438.932 0 1660.59 0 0 0 0 0 0 0 0 0 0 1681.34 0 2373.65 0.05 0 0 0 0 
0 0 352.718 0 0 0 0 0 0 2494.2 0 0 0 0 877.483 0 0 0 0 0 0 0 785.775 0 0 0 0 0 1657.08 0 0 0 0 0 0 0 0 0 0 0 0 0 0 0 0 0 0 0 1690.8 0 -710.852 0 0 0 0 0 0.03 0 0 0 
0 0 815.836 0 0 0 -1172.14 0 -1824.78 0 0 0 0 0 0 0 0 0 0 0 0 -1190.6 0 1708.66 0 0 0 0 0 0 -298.547 0 0 0 0 0 0 0 0 0 1945.33 0 0 0 1399.81 0 0 0 0 1630.22 0 0 0 0 0 0 0 0.01 0 0 
0 0 0 0 0 0 0 0 0 0 0 0 0 0 0 0 0 0 0 0 0 0 0 0 2278.74 0 0 0 0 0 0 0 0 0 0 0 0 0 0 0 0 0 0 0 0 0 0 0 0 0 0 0 0 0 0 0 0 0 0.09 0 
0 0 0 0 0 0 0 0 0 0 0 0 0 0 0 0 0 0 0 0 0 0 0 0 0 0 0 0 0 0 0 0 0 0 0 1544.31 0 0 0 0 0 0 0 0 0 0 0 0 0 0 0 0 0 0 0 0 0 0 0 0.06 
