*Vertices 39
*Matrix 
0 0 0 527.131 0 0 -655.309 1119.95 0 0 0 0 0 0 0 0 792.795 0 0 0 0 454.039 0 2219.84 0 0 0 0 0 0 240.104 0 0 0 0 0 0 0 0 
0 0.09 0 0 0 0 926.16 0 650.578 0 0 0 0 0 0 0 0 0 0 0 0 0 0 0 0 0 0 2063.74 0 0 0 0 0 0 0 0 0 0 0 
0 0 0.06 345.546 0 0 0 0 0 -379.879 0 0 0 0 0 0 0 0 0 0 0 0 -758.766 0 0 2158.35 0 0 0 0 0 0 0 0 0 0 0 0 0 
-2224.72 0 -1968.83 0.09 0 0 328.608 968.429 0 0 0 0 0 0 0 279.473 -894.421 0 0 702.918 0 0 0 0 0 858.867 0 0 0 1863.23 0 0 0 0 0 1313.9 0 0 0 
0 0 0 0 0.07 0 0 2271.11 0 0 0 0 0 0 0 0 0 225.608 0 0 0 0 0 0 -353.023 0 2364.65 0 0 0 0 1492.28 1234.86 -567.721 0 0 0 0 0 
0 0 0 0 0 0.06 -1096.91 0 0 0 0 0 0 0 -226.829 2163.08 0 -679.571 800.577 827.738 0 2171.62 0 0 0 0 0 0 0 0 -89.0378 -2462.92 1586.28 0 0 0 0 0 0 
996.2 2304.22 0 -683.538 0 1329.16 0.08 1068.07 0 0 0 0 0 0 0 0 0 -751.289 0 0 0 0 0 0 0 0 0 0 0 0 0 0 0 0 0 0 0 0 0 
1562.47 0 0 -799.814 -1857.59 0 -325.098 0.03 -1060.14 0 0 0 0 0 0 0 0 837.504 0 0 0 0 0 0 0 0 2251.73 0 0 1756.42 922.498 -2328.94 0 0 0 0 0 0 0 
0 1811.04 0 0 0 0 0 -1959.21 0.03 0 0 0 0 0 1092.94 0 0 0 0 0 0 0 0 2086.02 0 0 246.666 0 0 0 0 0 0 -546.205 0 0 0 0 0 
0 0 1603.82 0 0 0 0 0 0 0.01 0 0 0 0 0 0 0 -1453.37 178.762 0 0 0 0 1433.23 0 0 0 0 0 0 0 0 2179.25 0 0 0 0 0 0 
0 0 0 0 0 0 0 0 0 0 0.05 0 571.841 1114.46 2071.98 -1784.34 0 831.553 0 0 2106.46 0 0 0 0 0 0 0 0 0 0 0 0 0 0 0 0 0 0 
0 0 0 0 0 0 0 0 0 0 0 0 0 0 0 0 0 0 0 0 1926.86 0 0 0 0 0 1870.1 0 0 0 0 0 0 1809.37 0 0 0 0 0 
0 0 0 0 0 0 0 0 0 0 763.039 0 0.07 0 0 0 0 0 0 0 1503.72 0 1342.59 0 0 0 0 0 1901.99 0 0 0 0 -2161.4 1105.15 0 0 0 0 
0 0 0 0 0 0 0 0 0 0 -630.741 0 0 0.01 0 0 0 0 0 0 0 0 1741 -586.489 0 0 0 0 0 0 0 0 0 0 0 0 0 0 0 
0 0 0 0 0 -132.984 0 0 699.103 0 1330.68 0 0 0 0.07 0 0 0 0 0 0 0 -811.106 0 -182.73 0 0 0 1320.15 0 0 0 0 0 0 0 0 0 0 
0 0 0 1894.36 0 990.707 0 0 0 0 1647.01 0 0 0 0 0.01 0 0 0 0 0 0 0 0 2374.11 0 0 0 0 0 0 0 0 0 0 0 0 0 0 
1452.45 0 0 -564.821 0 0 0 0 0 0 0 0 0 0 0 0 0.04 0 0 0 1541.72 0 0 0 -880.993 0 0 0 0 0 0 0 0 0 -443.815 0 0 0 0 
0 0 0 0 -1506.01 57.7563 2439.42 -1698.43 0 -39.7504 2281.64 0 0 0 0 0 0 0.03 1727.12 1966.99 0 0 0 0 0 0 -705.664 0 0 0 -1303.67 0 0 0 0 0 0 0 0 
0 0 0 0 0 -1610.23 0 0 0 2320.25 0 0 0 0 0 0 0 -337.764 0.07 0 0 1114.31 0 0 0 0 0 0 0 0 0 0 0 0 0 0 0 0 0 
0 0 0 575.045 0 19.9133 0 0 0 0 0 0 0 0 0 0 0 431.303 0 0.04 0 0 0 0 0 0 0 664.312 0 0 0 0 0 0 0 0 0 0 0 
0 0 0 0 0 0 0 0 0 0 548.799 -1094.62 205.466 0 0 0 898.541 0 0 0 0.02 0 -830.027 0 0 0 2190.39 0 0 0 1766.34 0 0 0 0 0 0 0 0 
2074.11 0 0 0 0 1173.36 0 0 0 0 0 0 0 0 0 0 0 0 -2194.05 0 0 0.09 0 0 0 0 1697.82 0 1131.24 0 -1372.19 0 248.65 0 0 0 0 0 0 
0 0 726.112 0 0 0 0 0 0 0 0 0 -80.0348 1518.98 2335.2 0 0 0 0 0 1126.06 0 0.05 0 0 0 0 0 0 0 -273.522 0 0 259.636 0 0 0 0 0 
2153.61 0 0 0 0 0 0 0 1446.65 -2246.39 0 0 0 2399.44 0 0 0 0 0 0 0 0 0 0.07 0 0 0 0 0 0 389.645 0 0 0 0 0 0 0 0 
0 0 0 0 1835.15 0 0 0 0 0 0 0 0 0 -142.293 150.838 1587.34 0 0 0 0 0 0 0 0.04 0 0 0 0 0 0 0 0 0 0 0 0 0 0 
0 0 1678.14 944.929 0 0 0 0 0 0 0 0 0 0 0 0 0 0 0 0 0 0 0 0 0 0 -600.07 1398.89 0 -2071.06 1391.57 0 0 0 1013.6 0 0 0 0 
0 0 0 0 -1094.47 0 0 757.698 1902.14 0 0 1350.52 0 0 0 0 0 -994.369 0 0 2069.38 1831.19 0 0 0 1681.95 0.03 0 0 0 0 0 0 0 0 0 0 0 0 
0 -1725.29 0 0 0 0 0 0 0 0 0 0 0 0 0 0 0 0 0 2338.1 0 0 0 0 0 1272.7 0 0.05 0 0 -276.574 -1026.41 0 0 0 0 0 0 0 
0 0 0 0 0 0 0 0 0 0 0 0 -425.962 0 363.399 0 0 0 0 0 0 1159.17 0 0 0 0 0 0 0.07 0 0 0 0 0 0 0 0 0 0 
0 0 0 -452.361 0 0 0 -991.928 0 0 0 0 0 0 0 0 0 0 0 0 0 0 0 0 0 2464.6 0 0 0 0.03 0 0 0 0 0 0 0 -928.144 0 
1094.78 0 0 0 0 -2070.91 0 -643.559 0 0 0 0 0 0 0 0 0 -272.149 0 0 2243.64 1100.27 -412.534 -1646.24 0 1725.9 0 411.313 0 0 0.06 0 0 1540.19 0 2475.28 1706.37 0 0 
0 0 0 0 1638.46 -765.481 0 1668.98 0 0 0 0 0 0 0 0 0 0 0 0 0 0 0 0 0 0 0 7.55333 0 0 0 0.05 0 0 0 0 0 0 0 
0 0 0 0 1438.26 2344.36 0 0 0 559.938 0 0 0 0 0 0 0 0 0 0 0 2079.61 0 0 0 0 0 0 0 0 0 0 0.01 0 -70.7266 1908.55 0 0 0 
0 0 0 0 801.035 0 0 0 124.134 0 0 933.638 2266.99 0 0 0 0 0 0 0 0 0 -969.192 0 0 0 0 0 0 0 1475.34 0 0 0.04 0 0 0 0 0 
0 0 0 0 0 0 0 0 0 0 0 0 1713.84 0 0 0 1275.44 0 0 0 0 0 0 0 0 54.857 0 0 0 0 0 0 -214.927 0 0 0 0 0 0 
0 0 0 -1760.84 0 0 0 0 0 0 0 0 0 0 0 0 0 0 0 0 0 0 0 0 0 0 0 0 0 0 1725.14 0 1006.42 0 0 0.02 0 0 0 
0 0 0 0 0 0 0 0 0 0 0 0 0 0 0 0 0 0 0 0 0 0 0 0 0 0 0 0 0 0 1200.06 0 0 0 0 0 0.05 0 10.7578 
0 0 0 0 0 0 0 0 0 0 0 0 0 0 0 0 0 0 0 0 0 0 0 0 0 0 0 0 0 1932.97 0 0 0 0 0 0 0 0.07 0 
0 0 0 0 0 0 0 0 0 0 0 0 0 0 0 0 0 0 0 0 0 0 0 0 0 0 0 0 0 0 0 0 0 0 0 0 944.777 0 0 
