*Vertices 60
*Matrix 
0.09 0 1207.08 0 0 2137.59 0 0 0 0 -2360.07 0 0 0 0 0 0 0 0 0 0 0 0 0 0 1047.17 1714.76 0 0 0 0 0 0 0 0 0 0 0 0 267.113 0 0 0 0 0 0 0 0 0 0 0 0 167.013 0 0 -2197.87 0 0 0 0 
0 0.03 0 0 0 0 0 0 0 0 0 -1845.23 2083.42 0 0 0 0 0 -1301.23 0 0 0 0 0 0 0 0 0 0 0 0 0 0 0 1441.62 0 0 0 0 0 0 -356.38 0 2251.27 0 0 0 0 0 0 0 0 1184.5 0 191.122 0 0 0 0 0 
215.384 0 0.01 0 0 0 -155.11 0 2337.95 0 0 0 0 0 0 0 0 1919.84 0 0 0 0 0 0 -2403.71 2288.35 0 0 0 0 0 0 -468.23 -223.472 1119.65 0 0 0 0 0 0 0 0 0 1789.38 0 0 0 0 0 0 0 0 0 0 0 0 0 0 0 
0 0 0 0.09 998.032 0 0 0 0 0 0 781.961 0 0 0 0 0 0 0 0 0 1922.13 0 0 0 -83.3918 0 2493.74 0 0 0 2162.92 0 0 0 1999.04 0 2469.33 2162.16 0 0 0 0 0 0 0 0 0 0 0 0 0 0 0 1830.73 0 -812.174 0 264.061 0 
0 0 0 1796.7 0.04 0 0 -680.334 0 1709.27 0 0 0 0 0 0 0 0 0 0 0 0 0 0 0 0 0 0 0 1549.65 2470.85 1908.25 1283.38 0 0 0 0 0 -2137.44 0 0 0 0 612.888 0 0 0 0 0 0 0 0 -578.249 0 0 0 0 0 0 0 
2126.3 0 0 0 0 0.04 -810.038 0 0 0 0 0 581.149 0 0 0 0 0 0 0 0 0 0 0 0 0 0 -517.06 0 0 0 -2168.72 -124.439 0 0 0 505.615 0 0 2135.61 0 0 0 0 0 0 0 0 0 0 0 0 0 0 0 0 0 0 0 0 
0 0 494.934 0 0 -8.46889 0.01 0 0 0 0 0 -99.1089 0 -505.31 0 0 0 0 0 0 0 0 0 0 -1592.53 0 0 0 0 0 0 0 0 0 2045.12 0 0 2157.89 0 2309.41 0 0 2222.13 0 0 0 0 0 0 -243.767 0 0 1509.06 0 0 0 0 0 0 
0 0 0 0 -564.974 0 0 0.08 0 0 0 0 0 0 0 0 0 0 0 0 0 2342.83 0 1987.14 0 0 0 0 0 0 0 0 0 0 0 0 0 0 0 249.26 0 0 0 0 -1999.04 0 0 0 0 0 0 426.725 0 0 0 0 0 0 0 0 
0 0 2062.21 0 0 0 0 0 0.01 0 0 0 0 2323.6 0 0 0 0 0 -2166.13 0 0 -1142.54 0 0 2374.42 0 0 0 0 0 0 0 0 0 0 0 1570.86 0 -267.571 0 0 0 0 1022.75 0 0 0 0 0 0 0 0 0 0 0 1267.36 0 0 0 
0 0 0 0 -580.691 0 0 0 0 0.07 2204.58 0 0 0 0 0 2480.62 0 0 0 0 0 0 -1372.65 0 0 0 51.1948 0 0 0 0 0 0 0 0 0 0 0 0 0 0 0 0 0 0 0 0 0 0 0 0 0 871.685 0 1789.07 0 0 0 0 
2253.26 0 0 0 0 0 0 0 0 -1528.6 0.04 0 0 0 0 0 0 0 0 0 0 0 0 0 0 0 0 0 0 0 0 -1238.52 0 0 0 0 0 0 0 916.242 0 0 0 0 -1165.27 0 0 -1957.23 0 0 0 0 0 0 0 508.82 0 0 1951.12 0 
0 -1424.22 0 385.525 0 0 0 0 0 0 0 0.03 0 0 0 0 0 0 0 0 0 0 2331.08 0 1951.58 0 132.374 0 0 0 0 0 0 -972.549 0 0 0 0 0 0 0 0 0 0 0 0 1975.23 0 0 0 0 0 0 0 0 0 0 0 0 0 
0 2338.71 0 0 0 -74.8466 -1179.01 0 0 0 0 0 0 0 0 0 0 -945.845 0 0 0 0 0 0 0 0 0 0 0 0 0 0 0 0 0 0 821.787 0 0 0 0 0 -2329.1 0 1374.94 0 0 0 0 0 343.41 0 0 0 0 0 0 0 1817.45 0 
0 0 0 0 0 0 0 0 920.057 0 0 0 0 0.01 1749.85 -796.304 0 0 0 1891.92 0 0 0 0 0 0 0 0 0 2472.38 0 0 1180.23 0 0 0 -28.3059 0 0 0 0 0 0 0 0 0 0 -1893.75 58.5192 0 0 0 0 0 0 0 0 0 0 0 
0 0 0 0 0 0 -1896.34 0 0 0 0 0 0 1000.17 0.09 1093.55 980.483 0 0 0 0 0 0 0 0 0 0 0 0 0 0 639.744 0 0 0 0 0 0 0 0 0 0 0 0 376.37 0 0 0 0 0 0 0 0 0 2298.27 0 0 0 0 0 
0 0 0 0 0 0 0 0 0 0 0 0 0 627.537 2453.76 0.03 0 0 2134.08 1760.38 0 0 0 0 0 0 0 0 -2432.4 0 76.6778 0 0 0 0 -1706.82 -634.404 0 -507.447 0 0 0 0 0 0 0 0 0 0 0 0 0 275.201 0 0 0 0 0 0 0 
0 0 0 0 0 0 0 0 0 163.961 0 0 0 0 2171.93 0 0.06 196.158 0 1793.8 0 0 0 0 0 -909.68 0 0 777.688 336.39 0 0 0 0 0 0 0 0 -1789.22 0 0 0 0 0 0 0 0 0 0 0 0 0 0 0 0 0 0 0 -783.334 0 
0 0 1110.34 0 0 0 0 0 0 0 0 0 -1625.19 0 0 0 942.03 0.09 0 1733.83 0 0 0 0 0 0 0 0 0 0 0 0 0 0 0 0 0 0 0 0 0 0 0 0 0 0 86.1385 688.116 0 0 0 0 0 0 0 -76.9829 0 0 0 0 
0 -770.363 0 0 0 0 0 0 0 0 0 0 0 0 0 846.202 0 0 0.03 0 0 0 0 -2446.59 0 0 0 0 0 0 0 0 0 0 0 0 0 0 181.814 0 -2200 0 0 0 0 1400.57 539.491 0 0 2180.01 0 0 0 0 1223.87 0 -122.303 0 0 0 
0 0 0 0 0 0 0 0 1813.18 0 0 0 0 2478.79 0 -638.829 2260.89 1572.08 0 0.05 0 0 0 0 0 0 0 0 0 0 0 0 0 0 0 0 0 0 0 0 0 0 0 0 0 0 0 0 -107.044 0 0 0 0 0 0 0 0 -2450.41 0 0 
0 0 0 0 0 0 0 0 0 0 0 0 0 0 0 0 0 0 0 0 0.01 0 0 0 0 0 0 0 0 0 0 -1814.86 0 0 0 -89.3429 1415.98 -313.959 0 0 0 0 2305.14 0 0 0 0 0 0 0 0 0 0 0 0 0 0 0 0 0 
0 0 0 871.227 0 0 0 2369.69 0 0 0 0 0 0 0 0 0 0 0 0 0 0.07 0 0 0 0 0 0 0 0 0 0 0 0 0 0 0 -349.208 0 0 0 0 0 0 0 0 0 0 0 0 609.989 0 -148.091 0 0 0 1583.22 0 0 0 
0 0 0 0 0 0 0 0 1336.18 0 0 1024.89 0 0 0 0 0 0 0 0 0 0 0.02 0 0 0 0 0 0 0 0 1090.5 0 0 0 2327.42 0 0 0 0 0 0 0 0 522.858 -587.1 0 0 0 0 0 0 0 0 0 0 0 0 0 0 
0 0 0 0 0 0 0 820.872 0 -352.565 0 0 0 0 0 0 0 0 839.335 0 0 0 0 0.02 889.996 0 0 0 0 0 0 0 0 0 0 0 0 0 0 0 0 0 0 -649.205 0 0 0 0 0 0 0 0 -589.694 0 0 0 0 0 0 0 
0 0 -1812.57 0 0 0 0 0 0 0 0 -2228.54 0 0 0 0 0 0 0 0 0 0 0 1929.46 0.02 0 0 0 0 0 -2239.83 0 1251.03 0 0 2318.72 0 0 0 1784.49 0 0 0 0 0 0 0 0 0 1741.92 0 0 0 0 0 1617.71 0 0 0 0 
-780.892 0 2304.22 512.177 0 0 -782.418 0 -1617.56 0 0 0 0 0 0 0 2335.81 0 0 0 0 0 0 0 0 0.08 0 -909.375 0 0 0 0 0 0 0 0 0 0 0 0 0 185.629 0 0 0 0 1886.88 0 0 0 0 0 0 0 0 -1469.24 0 0 0 0 
-63.5548 0 0 0 0 0 0 0 0 0 0 652.409 0 0 0 0 0 0 0 0 0 0 0 0 0 0 0.01 0 0 0 0 0 0 0 0 -2371.36 0 0 505.31 0 1876.66 0 0 0 0 0 -1031.75 1708.5 699.561 0 -40.8185 2076.25 0 -1305.2 0 0 0 0 0 0 
0 0 0 2196.34 0 -405.82 0 0 0 -2381.59 0 0 0 0 0 0 0 0 0 0 0 0 0 0 0 -1442.84 0 0.01 0 1409.12 0 0 0 0 0 0 0 0 0 1562.17 0 1937.24 0 0 0 0 0 0 0 0 0 0 0 0 0 0 0 0 0 0 
0 0 0 0 0 0 0 0 0 0 0 0 0 0 0 2468.57 1383.79 0 0 0 0 0 0 0 0 0 0 0 0.05 0 0 0 0 2311.24 0 0 0 1442.69 0 0 0 0 0 0 0 0 0 0 -1978.13 0 0 0 0 195.853 0 0 2099.9 0 0 0 
0 0 0 0 2147.82 0 0 0 0 0 0 0 0 1185.42 0 0 2360.23 0 0 0 0 0 0 0 0 0 0 -407.804 0 0.01 0 -1222.65 0 900.22 0 0 0 0 0 0 0 0 0 0 0 761.055 0 0 2344.97 0 770.669 -349.208 0 2285.15 0 0 0 0 0 0 
0 0 0 0 1714.91 0 0 0 0 0 0 0 0 0 0 2272.03 0 0 0 0 0 0 0 0 816.446 0 0 0 0 0 0.04 0 -850.017 0 0 0 0 0 933.943 0 1999.34 0 0 805.765 0 0 0 0 -2043.6 0 0 0 0 0 0 -32.4259 0 0 2165.36 0 
0 0 0 -2232.81 -1279.72 539.491 0 0 0 0 -1214.71 0 0 0 -829.875 0 0 0 0 0 -448.698 0 2124.16 0 0 0 0 0 0 -563.601 0 0.05 0 0 560.701 0 0 2207.48 0 0 0 0 0 0 0 0 0 0 0 585.879 0 980.789 0 0 0 0 0 757.241 0 0 
0 0 1787.7 0 1188.47 2135.61 0 0 0 0 0 0 0 1275.75 0 0 0 0 0 0 0 0 0 0 -2154.84 0 0 0 0 0 -193.411 0 0.03 0 0 -295.648 0 0 0 0 0 1892.22 0 0 0 0 0 0 0 0 0 0 0 0 0 -751.747 0 0 0 0 
0 0 686.438 0 0 0 0 0 0 0 0 1500.06 0 0 0 0 0 0 0 0 0 0 0 0 0 0 0 0 230.949 1271.63 0 0 0 0.07 0 0 0 0 0 0 0 0 0 897.626 0 0 0 0 0 0 0 0 0 0 0 0 0 0 0 0 
0 -209.586 -143.361 0 0 0 0 0 0 0 0 0 0 0 0 0 0 0 0 0 0 0 0 0 0 0 0 0 0 0 0 1116.44 0 0 0 0 1702.09 0 0 1148.49 0 0 0 0 0 0 0 0 0 0 0 0 0 0 0 0 0 2010.18 0 0 
0 0 0 -1269.95 0 0 814.005 0 0 0 0 0 0 0 0 -341.426 0 0 0 0 1861.09 0 -1769.08 0 -2074.11 0 2397.61 0 0 0 0 0 918.226 0 0 0.04 0 0 0 1836.83 0 0 0 0 0 0 0 0 0 -2172.99 0 2110.74 0 0 0 0 0 0 0 0 
0 0 0 0 0 -1045.64 0 0 0 0 0 0 935.926 1957.23 0 1848.28 0 0 0 0 249.565 0 0 0 0 0 0 0 0 0 0 0 0 0 1289.33 0 0.03 0 113.758 0 0 0 0 0 0 0 1972.33 0 0 0 0 0 0 0 0 0 0 -1095.54 0 0 
0 0 0 -1979.2 0 0 0 0 2297.51 0 0 0 0 0 0 0 0 0 0 0 794.931 1544.16 0 0 0 0 0 0 341.884 0 0 -1195.03 0 0 0 0 0 0.07 0 -1136.89 0 0 0 0 0 0 0 -2455.75 0 0 -250.786 2218.92 0 -942.64 0 0 0 0 1323.36 0 
0 0 0 -1229.67 -1225.85 0 -217.978 0 0 0 0 0 0 0 0 368.13 720.313 0 -1511.96 0 0 0 0 0 0 0 -234.764 0 0 0 -679.418 0 0 0 0 0 2389.52 0 0.01 0 0 592.288 0 0 0 1175.8 0 0 0 0 0 0 0 0 0 0 0 0 1395.84 0 
636.845 0 0 0 0 50.2792 0 1184.19 -243.004 0 750.374 0 0 0 0 0 0 0 0 0 0 0 0 0 1373.56 0 0 -253.38 0 0 0 0 0 0 13.9622 -797.372 0 2182.3 0 0.01 0 0 0 0 -574.282 0 0 0 0 0 0 0 0 58.6718 0 0 403.531 0 0 0 
0 0 0 0 0 0 5.26444 0 0 0 0 0 0 0 0 0 0 0 1073.41 0 0 0 0 0 0 0 2207.94 0 0 0 2324.98 0 0 0 0 0 0 0 0 0 0 0 0 0 0 2011.4 0 0 0 0 0 0 0 0 0 2464.9 0 0 0 0 
0 1756.11 0 0 0 0 0 0 0 0 0 0 0 0 0 0 0 0 0 0 0 0 0 0 0 -984.603 0 -1905.65 0 0 0 0 -147.633 0 0 0 0 0 -900.372 0 0 0.02 0 0 0 0 1657.69 0 1472.59 0 500.732 0 0 627.079 2469.48 0 0 0 0 0 
0 0 0 0 0 0 0 0 0 0 0 0 2113.33 0 0 0 0 0 0 0 1937.54 0 0 0 0 0 0 0 0 0 0 0 0 0 0 0 0 0 0 0 0 0 0.07 0 0 2451.78 0 0 0 0 0 0 0 0 0 0 735.115 0 0 0 
0 1056.93 0 0 -2107.23 0 1559.57 0 0 0 0 0 0 0 0 0 0 0 0 0 0 0 0 -1011.46 0 0 0 0 0 0 1594.82 0 0 1142.38 0 0 0 0 0 0 0 0 0 0 0 638.676 0 0 0 0 0 0 1798.68 1869.18 0 0 0 0 0 0 
0 0 722.907 0 0 0 0 1896.19 2412.87 0 1551.18 0 -1817.91 0 -70.5741 0 0 0 0 0 0 0 745.796 0 0 0 0 0 0 0 0 0 0 0 0 0 0 0 0 -1797.31 0 0 0 0 0.04 0 0 0 0 0 0 0 0 0 0 1238.36 0 0 0 0 
0 0 0 0 0 0 0 0 0 0 0 0 0 0 0 0 0 0 -1633.43 0 0 0 869.091 0 0 0 0 0 0 1465.12 0 0 0 0 0 0 0 0 -1627.32 0 2128.44 0 1495.79 -639.439 0 0.02 0 878.094 0 0 0 0 0 0 0 0 0 0 201.804 0 
0 0 0 0 0 0 0 0 0 0 0 1167.1 0 0 0 0 0 1991.26 -59.2822 0 0 0 0 0 0 -2161.85 1920.3 0 0 0 0 0 0 0 0 0 -996.2 0 0 0 0 1866.44 0 0 0 0 0.07 0 0 0 0 677.892 0 0 0 0 0 -1276.36 0 0 
0 0 0 0 0 0 0 0 0 0 496.307 0 0 124.744 0 0 0 646.306 0 0 0 0 0 0 0 0 2284.39 0 0 0 0 0 0 0 0 0 0 -1955.4 0 0 0 0 0 0 0 1924.73 0 0.05 0 0 2264.85 0 0 0 0 0 2167.96 726.417 0 0 
0 0 0 0 0 0 0 0 0 0 0 0 0 866.192 0 0 0 0 0 -2471.62 0 0 0 0 0 0 -1447.57 0 1721.78 -2303.92 -458.617 0 0 0 0 0 0 0 0 0 0 1864.91 0 0 0 0 0 0 0.04 0 0 1989.58 0 0 0 0 1382.41 0 -102.008 0 
0 0 0 0 0 0 0 0 0 0 0 0 0 0 0 0 0 0 373.318 0 0 0 0 0 1406.37 0 0 0 0 0 0 1743.9 0 0 0 -1439.48 0 0 0 0 0 0 0 0 0 0 0 0 0 0.07 0 0 0 0 0 335.17 0 0 0 0 
0 0 0 0 0 0 304.804 0 0 0 0 0 -2386.62 0 0 0 0 0 0 0 0 -727.79 0 0 0 0 968.123 0 0 -1269.04 0 0 0 0 0 0 0 2476.96 0 0 0 2261.8 0 0 0 0 0 1747.26 0 0 0 0 0 -1007.8 0 0 -160.604 0 0 0 
0 0 0 0 0 0 0 2216.03 0 0 0 0 0 0 0 0 0 0 0 0 0 0 0 0 0 0 -1147.57 0 0 421.995 0 936.079 0 0 0 1902.3 0 -110.553 0 0 0 0 0 0 0 0 -0.0762963 0 1542.18 0 0 0.07 0 0 0 -1733.83 0 0 0 0 
1710.64 1318.17 0 0 2479.25 0 0 0 0 0 0 0 0 0 0 -1309.02 0 0 0 0 0 1255.15 0 -857.494 0 0 0 0 0 0 0 0 0 0 0 0 0 0 0 0 0 0 0 1842.94 0 0 0 0 0 0 0 0 0.02 0 0 0 0 0 20.0659 0 
0 0 0 0 0 0 -2215.26 0 0 1555.3 0 0 0 0 0 0 0 0 0 0 0 0 0 0 0 0 1480.68 0 1923.66 2369.69 0 0 0 0 0 0 0 1962.87 0 1654.94 0 1294.52 0 -915.937 0 0 0 0 0 0 -174.184 0 0 0.01 0 0 0 0 0 0 
0 782.571 0 159.383 0 0 0 0 0 0 0 0 0 0 403.073 0 0 0 2326.81 0 0 0 0 0 0 0 0 0 0 0 0 0 0 0 0 0 0 0 0 0 0 -1689.28 0 0 0 0 0 0 0 0 0 0 0 0 0.06 0 0 0 0 0 
2151.78 0 0 0 0 0 0 0 0 553.377 449.767 0 0 0 0 0 0 1580.02 0 0 0 0 0 0 1570.71 -2240.14 0 0 0 0 684.759 0 1685 0 0 0 0 0 0 0 1440.55 0 0 0 2148.73 0 0 0 0 512.787 0 -2152.09 0 0 0 0.03 133.137 0 0 0 
0 0 0 -51.0422 0 0 0 0 2063.28 0 0 0 0 0 0 0 0 0 -1790.29 0 0 1483.89 0 0 0 0 0 0 -318.537 0 0 0 0 0 0 0 0 0 0 1199.45 0 0 490.356 0 0 0 0 1857.59 1903.36 0 -2371.67 0 0 0 0 2308.19 0 0 916.852 261.62 
0 0 0 0 0 0 0 0 0 0 0 0 0 0 0 0 0 0 0 -1816.69 0 0 0 0 0 0 0 0 0 0 0 207.602 0 0 162.13 0 2221.21 0 0 0 0 0 0 0 0 0 1067.16 -1240.65 0 0 0 0 0 0 0 0 0 0.07 0 0 
0 0 0 645.085 0 0 0 0 0 0 43.1074 0 -322.81 0 0 0 924.177 0 0 0 0 0 0 0 0 0 0 0 0 0 -321.894 0 0 0 0 0 0 2472.08 1775.34 0 0 0 0 0 0 1981.8 0 0 -2394.1 0 0 0 -1793.8 0 0 0 1722.54 0 0.01 0 
0 0 0 0 0 0 0 0 0 0 0 0 0 0 0 0 0 0 0 0 0 0 0 0 0 0 0 0 0 0 0 0 0 0 0 0 0 0 0 0 0 0 0 0 0 0 0 0 0 0 0 0 0 0 0 0 1069.14 0 0 0.09 
