*Vertices 47
*Matrix 
0.01 0 0 0 -173.421 0 -2289.88 0 0 0 0 383.694 0 0 0 0 0 0 -1252.4 0 0 0 314.112 0 0 1621.22 0 0 0 0 0 -758.156 -90.4111 0 0 0 0 0 0 563.906 0 0 0 0 30.9 0 2460.17 
0 0.04 -102.618 -1660.59 0 0 0 0 0 1597.87 0 1004.9 2084.8 -1013.75 0 1348.23 0 -1165.27 0 0 0 0 0 0 0 0 864.666 0 0 0 0 2428.59 2300.87 0 -33.7992 0 0 0 0 0 0 0 0 0 0 0 2410.73 
0 -810.953 0.08 -1145.59 0 0 0 1117.66 0 0 -2336.88 0 0 0 0 0 0 0 2470.09 0 0 0 0 0 0 0 0 0 0 0 0 0 1080.28 0 0 0 0 -1999.04 1028.09 0 0 0 0 0 0 0 979.415 
0 1842.17 2306.97 0 0 1704.38 0 0 0 0 1184.96 0 2418.36 -1556.37 0 0 0 0 0 2115.62 0 0 0 0 -400.784 0 0 -2212.67 0 0 0 0 0 0 957.289 0 0 0 0 0 679.113 0 0 0 0 0 0 
-320.063 0 0 0 0.05 0 0 198.599 0 0 0 2277.52 0 0 72.2526 0 0 547.884 2069.08 0 2167.96 0 -1657.23 0 1339.69 0 0 0 -2377.62 931.349 402.463 0 0 0 0 0 0 1936.63 0 0 0 864.818 1422.24 164.876 0 1968.98 0 
0 0 0 1389.89 0 0.03 1693.09 1440.4 0 0 0 0 0 0 1127.89 0 0 0 0 0 0 0 -1526.61 0 0 0 0 0 -488.983 0 0 0 -999.405 239.647 0 0 0 0 -407.346 -2124.01 0 0 0 -929.518 2238.76 0 0 
-1392.94 0 0 0 0 1371.88 0.02 0 0 0 0 0 0 2268.97 -660.039 413.297 0 0 -904.645 0 0 0 0 -100.635 0 0 0 0 297.174 -1449.71 0 0 0 0 -1047.93 -2146.14 0 0 0 2272.48 0 0 0 0 -411.161 0 2420.65 
0 0 -473.418 0 486.084 2340.69 0 0.01 2224.11 0 0 0 0 0 0 0 0 0 0 0 2313.53 0 0 -1231.04 0 0 0 0 0 -694.983 0 864.971 1057.85 0 0 0 1545.08 0 16.5563 0 0 0 0 506.836 0 0 0 
0 0 0 0 0 0 0 -17.6244 0.06 0 0 714.362 0 0 0 -213.401 0 0 477.233 0 0 0 0 -2044.36 0 1295.28 0 0 0 0 -2283.32 2433.93 0 -151.296 0 0 0 2451.32 0 0 0 -2093.19 0 1039.54 0 67.98 1174.89 
0 2425.08 0 0 0 0 0 0 0 0.05 0 0 499.512 1271.78 1731.24 0 0 0 163.808 0 0 -2121.42 0 0 765.938 0 -244.072 0 0 910.291 0 0 0 0 0 0 0 0 0 631.047 0 0 0 147.481 0 0 0 
0 0 -1653.72 1728.95 0 0 0 0 0 0 0.08 0 0 0 -1261.1 0 0 0 0 0 -902.203 0 0 -2147.36 0 0 1450.01 0 0 0 0 -217.521 0 0 0 1852.85 0 1980.57 -762.276 0 0 0 0 0 0 0 0 
293.817 811.411 0 0 -1082.26 0 0 0 964.919 0 0 0 -78.2037 0 0 1837.44 772.805 0 0 0 0 0 0 -800.272 0 1770.46 0 0 2066.94 864.513 0 0 -1203.12 0 -2176.96 -1774.58 0 -1107.44 0 352.26 0 0 0 2384.64 0 0 0 
0 2096.7 0 -81.5607 0 0 0 0 0 1774.27 0 -1906.87 0 -2387.69 0 0 0 1858.81 0 0 0 0 0 0 0 2485.81 0 -721.992 0 329.676 0 991.928 0 0 0 0 0 2239.98 0 0 0 0 0 0 0 0 0 
0 284.509 0 2108.91 0 0 485.168 0 0 2326.5 0 0 1218.99 0 -649.51 -1825.85 -1462.83 0 0 -673.62 0 -778.451 0 0 -450.53 0 0 0 787.149 0 0 0 2088 0 0 0 0 956.221 431.761 0 0 -190.054 0 0 0 0 0 
0 0 0 0 -1147.11 796.304 1754.13 0 0 1559.11 577.639 0 0 -262.993 0.08 0 0 914.411 0 0 0 0 -1329.16 -992.843 0 0 2499.08 0 0 0 1574.53 0 0 0 0 0 0 0 -2370.91 2256.31 0 0 0 0 0 0 0 
0 1657.38 0 0 0 0 1436.74 0 -626.774 0 0 -106.433 0 -2122.64 0 0.01 0 0 0 0 -618.229 0 0 2079 0 0 2241.36 0 0 0 0 0 1523.1 0 232.627 0 1097.06 506.226 0 404.599 0 0 0 0 0 55.4674 0 
0 0 0 0 0 0 0 0 0 0 0 1679.2 0 898.541 0 0 0.07 0 1110.34 -621.128 -2112.87 0 0 0 0 0 0 2301.32 -2284.23 0 0 0 0 0 250.328 -271.538 0 2233.88 -1352.96 0 0 1264.92 0 0 0 0 1953.41 
0 1727.27 0 0 -46.4644 0 0 0 0 0 0 0 746.406 0 -431.455 0 0 0.01 0 0 0 0 0 0 0 0 0 1732.76 0 0 0 1679.2 -835.826 0 0 0 0 0 0 0 0 -727.638 0 -331.355 0 0 0 
2453.76 0 -135.578 0 -2223.81 0 -94.6837 0 -954.085 -727.943 0 0 0 0 0 0 1139.18 0 0.06 0 0 0 0 0 0 -1993.24 0 2052.45 0 0 0 0 1197.32 2423.25 0 0 0 0 727.332 -1746.96 -714.82 0 0 0 0 0 1290.09 
0 0 0 891.675 0 0 0 0 0 0 0 0 0 1411.25 0 0 459.38 0 0 0.08 0 0 0 -1021.53 0 2195.58 2216.03 1961.5 0 0 0 2335.35 0 0 0 0 -2393.95 0 0 0 -100.482 0 613.651 2487.79 2401.73 0 0 
0 0 0 0 2112.72 0 0 1125.9 0 0 -1850.41 0 0 0 0 -1448.79 1812.88 0 0 0 0.05 0 0 -1263.54 0 0 2071.52 1675.7 0 0 0 2367.09 0 0 0 -335.322 0 0 0 0 0 -40.8185 0 0 -1032.36 0 0 
0 0 0 0 0 0 0 0 0 1976 0 0 0 -2499.24 0 0 0 0 0 0 0 0.08 -2412.72 0 0 -149.007 0 2462.16 0 0 0 942.946 0 0 0 0 2323.15 0 2203.21 0 -921.125 0 0 0 0 0 -206.381 
2376.4 0 0 0 -1340.3 1925.49 0 0 0 0 0 0 0 0 -92.0896 0 0 0 0 0 0 -1905.8 0.07 0 0 0 0 2262.26 159.993 0 -208.975 0 1502.04 -934.706 0 0 0 0 -639.439 0 0 0 0 0 0 0 0 
0 0 0 0 0 0 -2313.53 -1384.7 -739.845 0 2246.7 1669.59 0 0 1446.04 -1985 0 0 0 -88.1222 -176.016 0 0 0.07 0 1102.25 0 0 0 0 0 0 0 0 0 0 0 1329.92 456.786 0 0 0 0 755.409 0 0 0 
0 0 0 1983.17 1526.92 0 0 0 0 369.198 0 0 0 149.77 0 0 0 0 0 0 0 0 0 0 0.08 0 0 0 1844 710.395 0 0 0 0 0 0 0 0 0 0 -1500.82 0 0 0 0 0 0 
-9.68963 0 0 0 0 0 0 0 -2299.34 0 0 -2027.27 558.718 0 0 0 0 0 830.638 -418.79 0 1777.32 0 -562.685 0 0.03 0 0 1876.96 0 1427.73 1556.67 0 0 -990.555 1658.91 0 2393.49 190.054 0 0 1689.89 0 0 -633.946 0 0 
0 2437.28 0 0 0 0 0 0 0 1682.56 795.541 0 0 0 1852.24 699.713 0 0 0 -1214.26 -260.704 0 0 0 0 0 0.04 0 0 0 0 168.996 0 0 0 0 0 0 0 443.052 0 2123.86 0 1100.12 1913.89 0 0 
0 0 0 -554.75 0 0 0 0 0 0 0 0 1369.75 0 0 0 -215.69 -1637.7 -412.992 -1778.24 1527.07 2473.91 -789.438 0 0 0 0 0 0 0 0 0 0 -2119.59 0 0 1861.86 -1206.02 1227.23 0 0 0 0 0 1589.79 0 0 
0 0 0 0 -2260.58 -1644.87 228.813 0 0 0 0 -766.549 0 1477.48 0 0 1359.83 0 0 0 0 0 1910.38 0 1972.03 2465.06 0 0 0.08 0 0 0 0 575.35 872.295 2075.49 0 0 -1367.31 0 0 0 426.267 1990.95 0 1685.46 -172.964 
0 0 0 0 2298.73 0 -526.063 -928.907 0 1566.44 0 2485.96 230.338 0 0 0 0 0 0 0 0 0 0 0 1141.47 0 0 0 0 0.09 -111.469 -5.72222 1288.42 0 1980.57 0 0 0 -1253.01 306.94 -1140.25 0 0 0 0 0 1677.37 
0 0 0 0 -2092.12 0 0 0 803.781 0 0 0 0 0 2078.23 0 0 0 0 0 0 0 1363.95 0 0 -1119.65 0 0 0 -1877.42 0.06 -920.209 0 -1101.18 -1423.76 0 0 2324.21 1897.26 0 0 1475.8 0 0 0 0 0 
1920.15 -331.355 0 0 0 0 0 2486.72 1825.54 0 2480.93 0 -639.897 0 0 0 0 1608.71 0 1905.35 -1628.24 327.845 0 0 0 1315.73 -1904.43 0 0 1026.41 1699.8 0.09 0 243.919 0 0 0 0 1677.98 0 0 1453.83 0 0 -2269.89 0 -1121.78 
-1911.91 1060.29 1983.17 0 0 744.27 0 -2111.96 0 0 0 775.552 0 1098.9 0 -34.1044 0 133.29 -304.956 0 0 0 1604.13 0 0 0 0 0 0 527.284 0 0 0.05 922.651 0 0 0 0 0 0 0 0 0 -1348.23 0 1261.56 0 
0 0 0 0 0 1761.3 0 0 -794.626 0 0 0 0 0 0 0 0 0 1846.14 0 0 0 716.041 0 0 0 0 -1350.83 -521.638 0 289.087 -317.011 2333.98 0.08 346.156 0 0 1775.49 0 0 0 0 0 0 0 0 2396.08 
0 1467.1 0 -1617.86 0 0 312.128 0 0 0 0 1827.83 0 0 0 1171.07 2246.39 0 0 0 0 0 0 0 0 1003.37 0 0 -155.11 -133.595 255.516 0 0 -1347.01 0.06 0 -1648.23 0 0 0 0 0 0 0 0 626.926 65.6911 
0 0 0 0 0 0 -1202.51 0 0 0 1291.31 1928.39 0 0 0 0 442.289 0 0 0 -2157.12 0 0 0 0 -190.97 0 0 483.795 0 0 0 0 0 0 0.02 0 0 0 0 1851.02 0 0 2041.92 0 0 0 
0 0 0 0 0 0 0 799.203 0 0 0 0 0 0 0 -2336.73 0 0 0 1798.07 0 -237.51 0 0 0 0 0 1233.48 0 0 0 0 0 0 -649.052 0 0.07 0 0 0 -846.049 0 1996.44 0 0 0 0 
0 0 1125.9 0 1365.93 0 0 0 -1532.87 0 -908.612 -134.968 2486.57 2247.61 0 -1044.42 -2099.29 0 0 0 0 0 0 -1824.93 0 1361.81 0 933.332 0 0 1809.52 0 0 -1945.17 0 0 0 0 -871.075 0 0 0 2299.34 0 -2168.42 -1667.3 0 
0 0 2216.79 0 0 545.9 0 294.58 0 0 1650.36 0 0 1611.91 -1194.57 0 -1447.87 0 -449.919 0 0 1819.9 1285.82 1048.39 0 -1548.28 0 556.124 383.694 1606.11 -570.925 -263.909 0 0 0 0 0 -1926.1 0.07 0 0 0 0 0 -42.497 0 0 
346.309 0 0 0 0 520.417 1755.04 0 0 2444.3 0 399.258 0 0 -1681.19 1775.49 0 0 1575.9 0 0 0 0 0 0 0 -1767.71 0 0 88.1222 0 0 0 0 0 0 0 0 0 0.02 0 0 0 0 0 0 0 
0 0 0 2260.73 0 0 0 0 0 0 0 0 0 0 0 0 0 0 -2019.18 455.107 0 1562.93 0 0 2041.92 0 0 0 0 2443.69 0 0 0 0 0 1442.99 -1933.88 0 0 0 0.01 0 0 0 0 0 0 
0 0 0 0 1608.71 0 0 0 2233.42 0 0 0 0 2331.84 0 0 551.393 165.334 0 0 2210.07 0 0 0 0 272.149 -900.067 0 0 0 1070.97 -1325.8 0 0 0 0 0 0 0 0 0 0 0 0 0 0 0 
0 0 0 0 360.652 0 0 0 0 0 0 0 0 0 0 0 0 0 0 374.538 0 0 0 0 0 0 0 0 73.4733 0 0 0 0 0 0 0 178.915 -253.227 0 0 0 0 0.03 0 0 0 2207.79 
0 0 0 0 637.303 761.361 0 -1375.09 2335.35 -1755.96 0 -978.805 0 0 0 0 0 186.392 0 -280.084 0 0 0 1865.06 0 0 100.177 0 1978.44 0 0 0 1930.52 0 0 484.863 0 0 0 0 0 0 0 0.03 -804.697 0 0 
-247.276 0 0 0 0 -440.916 -1798.23 0 0 0 0 0 0 0 0 0 0 0 0 351.955 2276.91 0 0 0 0 -1510.9 1534.09 2364.04 0 0 0 672.399 0 0 0 0 0 2216.03 141.072 0 0 0 0 -1373.87 0.04 2312.77 0 
0 0 0 0 -1317.71 0 0 0 2094.41 0 0 0 0 0 0 2409.05 0 0 0 0 0 0 0 0 0 0 0 0 1331.9 0 0 0 336.238 0 250.481 0 0 -1278.65 0 0 0 0 0 0 -149.922 0.07 0 
1859.72 262.078 2053.06 0 0 0 1707.13 0 90.4111 0 0 0 0 0 0 0 2340.69 0 -585.727 0 0 -1981.8 0 0 0 0 0 0 -328.608 -1902.6 0 1850.57 0 600.375 -892.743 0 0 0 0 0 0 0 -551.088 0 0 0 0.02 
