*Vertices 53
*Matrix 
0 -1035.87 0 0 1542.48 2145.53 0 0 0 0 2288.51 0 0 0 0 0 0 0 0 0 -466.399 0 -955.458 250.633 0 0 0 0 0 0 0 -783.639 0 0 0 0 0 0 0 0 0 0 0 0 0 0 0 0 0 0 0 0 0 
2351.22 0.08 0 0 1864.3 0 0 0 2260.28 0 0 0 -889.081 0 0 562.227 0 0 -2124.47 0 0 0 0 1212.42 0 0 0 0 0 0 0 0 184.561 0 0 0 0 0 0 0 0 0 0 0 1400.72 0 0 -846.049 -2082.96 -1884.9 0 0 0 
0 0 0.08 0 1870.4 0 2106.16 0 0 0 2433.77 0 0 419.858 -585.727 0 0 0 0 -134.663 1769.08 0 0 0 -1384.09 286.798 -1850.26 0 0 0 1665.78 0 0 0 0 0 0 1894.06 0 0 -1179.01 0 0 0 0 0 0 0 0 0 -195.547 0 0 
0 0 0 0.05 0 0 0 0 0 1427.73 0 0 0 0 0 0 2447.2 0 0 1376.92 2007.43 2469.63 0 1327.78 0 0 0 0 0 0 0 0 0 0 1878.34 0 0 -1098.59 -1006.88 0 0 0 562.838 0 0 0 0 0 -784.097 0 0 0 0 
669.347 2239.37 -418.79 0 0.04 0 0 1584.14 0 0 0 0 0 0 0 0 0 1028.24 0 0 0 0 -1471.83 0 2389.68 0 1062.73 0 0 0 0 0 0 0 0 0 0 0 0 0 0 0 0 0 0 0 0 0 -1540.04 0 0 0 991.012 
-1211.66 0 0 0 0 0 0 0 0 0 0 0 1967.6 1086.84 0 999.405 980.789 0 0 0 0 1140.25 0 2458.65 0 0 -1937.09 0 1322.29 0 0 0 0 0 0 2249.29 0 0 0 0 0 0 0 0 0 0 0 -2199.09 -2038.87 0 0 0 0 
0 0 44.0229 0 0 0 0.08 0 0 233.085 0 0 1398.13 0 0 1094.16 0 0 0 0 0 0 0 1309.17 0 1442.38 0 0 36.3933 0 0 0 0 0 -89.4955 0 0 0 0 1039.69 0 0 0 0 -2128.74 0 0 0 0 0 0 0 0 
0 0 0 0 1215.63 0 0 0.07 0 0 0 0 0 0 0 0 0 0 -138.783 0 0 0 1127.43 0 0 1264.61 0 0 0 0 0 0 0 0 0 0 0 0 0 0 0 0 0 0 0 0 0 0 0 0 -374.386 0 0 
0 1435.51 0 0 0 0 0 0 0.02 0 0 0 0 -620.365 0 0 0 1481.44 0 584.201 0 0 0 0 1641.82 54.0941 0 499.207 0 -2216.48 0 0 0 523.774 0 0 0 0 0 0 0 0 0 0 0 917.92 0 0 2461.7 0 0 0 0 
0 0 0 1713.69 0 0 1400.72 0 0 0.01 0 93.1578 0 -2486.27 0 0 0 343.257 0 0 0 0 0 0 0 0 0 0 0 0 0 0 0 2401.43 0 0 -2382.66 0 0 0 0 0 0 879.315 0 0 0 0 0 0 0 0 0 
-1800.06 0 1152.3 0 0 0 0 0 0 0 0.05 0 0 1418.88 2068.93 0 -511.567 0 2314.75 0 0 -2262.57 0 0 0 0 -1336.18 0 0 0 0 0 0 0 0 0 0 0 0 0 0 0 0 -206.534 0 0 0 0 0 0 0 0 -1439.63 
0 0 0 0 0 0 0 0 0 -1621.07 0 0.04 0 0 0 0 2415.16 -1271.17 0 -488.983 0 0 994.217 0 0 0 -672.857 0 0 0 0 0 1349.91 0 0 0 0 0 0 0 0 0 0 0 0 0 0 0 0 0 0 0 0 
0 1509.98 0 0 0 1878.49 -1580.94 0 0 0 0 0 0.05 0 0 0 1765.72 0 -643.712 1639.68 0 0 1331.75 0 2136.22 0 1096.45 0 0 813.395 0 0 0 0 0 0 -425.962 0 0 0 0 0 0 0 0 221.641 317.621 1976.61 0 0 0 0 0 
0 0 1894.82 0 0 -1224.48 0 0 1549.65 1145.89 2337.03 0 0 0.03 -356.838 0 0 608.158 0 0 0 0 0 986.129 0 0 0 0 0 0 0 0 0 0 0 0 0 0 0 0 0 2088.76 0 0 0 0 0 0 100.94 0 0 0 0 
0 0 2399.14 0 0 0 0 0 0 0 -538.423 0 0 1641.21 0.07 0 0 0 0 0 -1528.14 -1478.24 0 0 2045.27 0 0 0 0 0 0 2157.43 0 0 0 0 0 0 0 1670.2 0 0 0 1510.44 0 0 0 0 0 0 0 0 2342.37 
0 2432.25 0 0 0 -2402.49 2179.25 0 0 0 0 0 0 0 0 0.06 0 0 0 0 0 1707.59 -2309.26 0 0 0 0 0 0 0 0 0 0 0 0 0 0 0 0 0 0 0 0 0 0 0 0 0 0 0 0 0 -451.903 
0 0 0 -379.879 0 1516.85 0 0 0 0 587.558 1004.59 -2007.13 0 0 0 0 0 0 0 0 0 0 0 0 0 0 0 0 0 0 1475.65 0 0 0 -187.46 0 -213.858 0 0 0 1133.53 0 0 0 0 0 0 0 -686.438 0 0 0 
0 0 0 0 1991.1 0 0 0 1302.3 -65.6911 0 -1067.92 0 991.47 0 0 0 0.05 0 -106.891 0 0 0 2435.15 0 0 -129.78 0 683.386 0 0 0 0 0 0 0 0 0 0 0 0 0 0 0 0 0 0 0 0 0 0 0 0 
0 2158.8 0 0 0 0 0 1625.03 0 0 888.623 0 1308.86 0 0 0 0 0 0.08 1951.73 0 0 1272.7 -111.774 0 2450.56 0 0 0 0 0 0 0 0 0 0 0 0 -318.69 0 0 0 0 0 2368.92 0 -760.903 0 0 0 0 0 0 
0 0 858.409 2169.33 0 0 0 0 2427.37 0 0 2498.78 1685.61 0 0 0 0 815.989 -329.676 0.06 0 0 1184.35 -449.614 0 -1216.54 0 0 -2244.25 0 0 -1068.07 0 0 0 0 0 0 0 2335.35 0 0 -298.547 0 0 0 0 0 0 0 0 -2165.36 -1547.06 
397.275 0 -1787.55 2164.91 0 0 0 0 0 0 0 0 0 0 563.753 0 0 0 0 0 0.01 2095.48 0 0 2383.72 0 0 0 0 0 0 0 0 0 -2192.68 0 2387.23 0 0 0 0 1610.23 0 0 0 0 0 0 0 0 0 1002.3 0 
0 0 0 2385.25 0 -1495.94 0 0 0 0 921.43 0 0 0 914.258 250.481 0 0 0 0 -1670.51 0.03 0 0 1317.71 0 0 -2439.57 0 0 0 0 0 0 0 0 0 0 0 0 0 0 0 -414.518 0 0 0 0 0 0 0 0 0 
-143.056 0 0 0 457.701 0 0 562.227 0 0 0 -1604.43 2378.99 0 0 2272.33 0 0 1937.09 -963.851 0 0 0.08 0 0 0 0 0 0 0 -2438.66 0 0 0 0 0 0 0 0 0 0 0 0 0 0 0 0 0 0 1414.91 -1533.48 0 0 
2186.57 -951.186 0 2349.54 0 1739.33 -300.531 0 0 0 0 0 0 1977.22 0 0 0 164.113 459.38 -480.743 0 0 0 0.04 0 0 0 0 0 0 0 2019.79 0 0 0 0 0 0 0 0 0 0 0 0 809.427 0 0 0 0 0 1860.79 -1536.68 0 
0 0 2448.27 0 1276.51 0 0 0 1106.83 0 0 0 -2496.19 0 -2264.55 0 0 0 0 0 1512.12 2169.03 0 0 0.02 0 0 0 0 0 0 0 0 -335.475 0 0 0 0 0 0 -1455.2 0 0 0 0 0 0 0 0 0 0 0 0 
0 0 1662.88 0 0 0 -2131.49 2149.65 2209.16 0 0 0 0 0 0 0 0 0 -2180.93 -1905.19 0 0 0 0 0 0.07 0 0 0 1857.74 -1401.03 0 0 0 0 446.409 0 0 217.215 0 0 0 0 0 0 0 0 0 0 0 0 -190.97 0 
0 0 2487.64 0 -93.3103 -206.839 0 0 0 0 1677.98 2425.84 -1824.17 0 0 0 0 -1047.17 0 0 0 0 0 0 0 0 0.09 0 0 0 0 0 0 0 0 0 0 0 0 0 0 -1383.63 -717.719 0 0 0 0 0 2377.16 0 0 0 0 
0 0 0 0 0 0 0 0 -117.725 0 0 0 0 0 0 0 0 0 0 0 0 1969.28 0 0 0 0 0 0.01 0 0 0 0 0 0 0 0 0 0 0 0 0 0 0 0 0 0 0 0 0 0 0 0 0 
0 0 0 0 0 2443.85 2234.64 0 0 0 0 0 0 0 0 0 0 193.106 0 1154.74 0 0 0 0 0 0 0 0 0 0 0 0 0 0 -2205.04 0 0 -2345.42 0 0 0 1431.85 0 0 0 0 0 0 0 -520.722 -829.264 0 0 
0 0 0 0 0 0 0 0 673.772 0 0 0 844.523 0 0 0 0 0 0 0 0 0 0 0 0 -277.49 0 0 0 0.01 1446.35 -46.3118 0 0 0 0 0 0 0 0 2163.38 0 0 0 0 288.934 0 0 0 0 0 0 -500.732 
0 0 217.673 0 0 0 0 0 0 0 0 0 0 0 0 0 0 0 0 0 0 0 2364.04 0 0 -539.949 0 0 0 2278.13 0.08 0 0 0 0 0 0 0 0 0 0 0 0 0 0 0 -2350.92 0 0 0 0 0 0 
1576.82 0 0 0 0 0 0 0 0 0 0 0 0 0 2169.33 0 2236.47 0 0 689.489 0 0 0 81.5607 0 0 0 0 0 -487.457 0 0.03 0 0 0 0 0 0 0 0 0 0 0 0 0 0 0 0 0 0 0 0 0 
0 638.523 0 0 0 0 0 0 0 0 0 2118.82 0 0 0 0 0 0 0 0 0 0 0 0 0 0 0 0 0 0 0 0 0.05 0 0 0 0 0 0 0 0 0 2375.33 0 0 0 0 0 0 0 0 0 0 
0 0 0 0 0 0 0 0 2495.27 1826.46 0 0 0 0 0 0 0 0 0 0 0 0 0 0 -426.267 0 0 0 0 0 0 0 0 0.08 0 0 0 0 0 0 0 0 0 0 0 0 0 0 0 0 0 0 0 
0 0 0 1282.01 0 0 369.655 0 0 0 0 0 0 0 0 0 0 0 0 0 2420.19 0 0 0 0 0 0 0 -1704.99 0 0 0 0 0 0.09 0 0 0 0 0 0 0 -579.318 0 0 -945.997 0 1788.16 0 0 0 0 -829.264 
0 0 0 0 0 433.439 0 0 0 0 0 0 0 0 0 0 1857.74 0 0 0 0 0 0 0 0 1768.93 0 0 0 0 0 0 0 0 0 0.04 0 0 0 0 0 0 0 0 0 0 0 0 0 0 0 0 0 
0 0 0 0 0 0 0 0 0 -794.015 0 0 1311.61 0 0 0 0 0 0 0 1659.98 0 0 0 0 0 0 0 0 0 0 0 0 0 0 0 0.03 0 0 0 0 0 0 0 0 0 0 0 0 1810.28 0 0 0 
0 0 2074.11 835.215 0 0 0 0 0 0 0 0 0 0 0 0 1004.75 0 0 0 0 0 0 0 0 0 0 0 1186.03 0 0 0 0 0 0 0 0 0.04 0 0 0 0 0 0 -510.041 0 0 0 0 0 0 0 0 
0 0 0 209.433 0 0 0 0 0 0 0 0 0 0 0 0 0 0 1235.31 0 0 0 0 0 0 -73.3207 0 0 0 0 0 0 0 0 0 0 0 0 0.03 -562.075 0 0 0 0 0 1328.85 0 0 0 0 0 1525.09 0 
0 0 0 0 0 0 644.475 0 0 0 0 0 0 0 1861.86 0 0 0 0 155.11 0 0 0 0 0 0 0 0 0 0 0 0 0 0 0 0 0 0 -299.31 0.08 0 0 0 0 303.125 0 0 0 0 0 0 0 0 
0 0 713.141 0 0 0 0 0 0 0 0 0 0 0 0 0 0 0 0 0 0 0 0 0 841.777 0 0 0 0 -1344.57 0 0 0 0 0 0 0 0 0 0 0.05 0 0 0 0 0 0 0 0 0 0 0 0 
0 0 0 0 0 0 0 0 0 0 0 0 0 1922.74 0 0 1806.92 0 0 0 2297.66 0 0 0 0 0 -930.891 0 1772.74 0 0 0 0 0 0 0 0 0 0 0 0 0.04 0 0 0 0 0 0 0 0 0 0 0 
0 0 0 635.624 0 0 0 0 0 0 0 0 0 0 0 0 0 0 0 -553.987 0 0 0 0 0 0 -625.706 0 0 0 0 0 713.141 0 1512.73 0 0 0 0 0 0 0 0.09 1611.15 0 0 0 0 0 0 0 0 0 
0 0 0 0 0 0 0 0 0 799.661 -1144.06 0 0 0 1707.43 0 0 0 0 0 0 -1441.62 0 0 0 0 0 0 0 0 0 0 0 0 0 0 0 0 0 0 0 0 1289.48 0.02 0 0 0 0 0 0 0 0 0 
0 -850.78 0 0 0 0 -225.303 0 0 0 0 0 0 0 0 0 0 0 -336.848 0 0 0 0 1552.86 0 0 0 0 0 0 0 0 0 0 0 0 0 1955.55 0 -1349.91 0 0 0 0 0.05 0 0 0 0 0 0 -749.153 380.184 
0 0 0 0 0 0 0 0 1515.02 0 0 0 -573.672 0 0 0 0 0 0 0 0 0 0 0 0 0 0 0 0 -370.113 0 0 0 0 -1509.06 0 0 0 1466.19 0 0 0 0 0 0 0.05 0 0 0 0 0 0 253.075 
0 0 0 0 0 0 0 0 0 0 0 0 688.269 0 0 0 0 0 2231.13 0 0 0 0 0 0 0 0 0 0 0 2245.63 0 0 0 0 0 0 0 0 0 0 0 0 0 0 0 0.02 -769.295 839.488 0 0 0 0 
0 2180.32 0 0 0 -228.507 0 0 0 0 0 0 -322.047 0 0 0 0 0 0 0 0 0 0 0 0 0 0 0 0 0 0 0 0 0 -1106.52 0 0 0 0 0 0 0 0 0 0 0 2001.17 0.04 0 0 0 0 0 
0 111.774 0 -100.024 99.5666 2186.57 0 0 -1343.81 0 0 0 0 1067 0 0 0 0 0 0 0 0 0 0 0 0 -1163.44 0 0 0 0 0 0 0 0 0 0 0 0 0 0 0 0 0 0 0 -239.952 0 0.09 0 0 0 0 
0 -671.636 0 0 0 0 0 0 0 0 0 0 0 0 0 0 -1399.35 0 0 0 0 0 53.4837 0 0 0 0 0 2103.11 0 0 0 0 0 0 0 1403.32 0 0 0 0 0 0 0 0 0 0 0 0 0 0 0 0 
0 0 1890.55 0 0 0 0 1503.72 0 0 0 0 0 0 0 0 0 0 0 0 0 0 -1551.94 -145.802 0 0 0 0 -1834.39 0 0 0 0 0 0 0 0 0 0 0 0 0 0 0 0 0 0 0 0 0 0.02 0 0 
0 0 0 0 0 0 0 0 0 0 0 0 0 0 0 0 0 0 0 -672.704 2012.47 0 0 -261.62 0 -529.572 0 0 0 0 0 0 0 0 0 0 0 0 0.534074 0 0 0 0 0 339.29 0 0 0 0 0 0 0 0 
0 0 0 0 2352.75 0 0 0 0 0 1530.88 0 0 0 206.992 1167.41 0 0 0 467.772 0 0 0 0 0 0 0 0 0 2392.42 0 0 0 0 -2155.75 0 0 0 0 0 0 0 0 0 -769.143 2078.84 0 0 0 0 0 0 0.04 
