*Vertices 67
*Matrix 
0.05 870.617 0 0 162.435 0 1422.85 0 0 0 0 1243.4 0 0 0 0 -1965.16 1968.21 0 217.063 0 0 0 0 0 0 0 0 0 0 0 2171.01 0 1999.65 0 0 0 0 0 0 0 0 0 0 0 0 0 0 0 0 0 -835.673 0 0 0 0 0 0 1128.65 0 0 0 0 0 0 0 0 
-1277.12 0.04 0 0 0 0 0 0 0 1713.84 0 0 0 0 0 0 0 0 0 0 0 0 0 0 0 0 0 0 0 0 0 1345.03 0 0 0 0 0 0 2037.8 0 -199.667 0 0 -2141.1 0 0 0 -153.89 0 0 0 0 0 692.846 0 0 0 0 0 0 0 0 0 0 0 0 0 
0 0 0.01 0 0 0 -949.66 0 0 0 -1659.67 0 219.199 0 0 0 0 57.9089 2075.95 0 0 0 0 0 0 0 0 0 0 0 0 0 0 0 0 0 0 0 1431.85 0 0 0 0 0 0 0 0 0 1561.4 0 43.26 0 0 0 0 0 0 0 0 0 0 0 0 0 0 0 0 
0 0 0 0.04 0 0 0 0 0 0 0 0 0 500.122 0 0 0 2332.45 0 0 0 -2305.9 0 0 0 0 0 0 -593.051 0 0 -663.701 0 0 0 0 0 -674.535 0 0 0 0 2162.16 0 0 0 0 0 0 -1703.31 0 0 -287.713 0 2422.64 0 0 0 0 0 0 0 0 0 0 0 0 
-1788.61 0 0 0 0.01 0 0 0 0 0 0 0 0 0 0 -516.297 1337.55 0 2494.96 0 -61.7237 0 0 0 0 0 0 917.005 0 -568.331 1762.83 0 0 0 0 -1198.23 -1278.04 0 0 0 2041.61 0 798.44 0 0 0 0 0 0 0 -606.632 0 -1256.52 0 0 0 0 0 0 0 0 0 0 0 0 0 0 
0 0 0 0 0 0.08 0 0 -1609.01 0 0 0 0 0 0 -812.174 0 1246.3 0 0 0 0 -1951.89 2021.16 0 0 0 0 525.91 0 0 0 0 0 0 0 0 1510.59 0 0 0 0 0 0 0 0 0 0 0 0 0 0 0 0 0 0 0 0 -367.061 0 0 0 0 0 0 0 0 
-105.67 0 1804.64 0 0 0 0.01 -1837.29 0 0 0 0 0 0 0 0 1880.93 0 0 0 -2339.17 0 0 0 0 0 0 0 0 0 0 0 0 0 0 0 0 0 0 0 0 0 1124.07 0 2254.63 0 0 0 0 0 0 0 817.057 0 0 0 0 0 1350.98 0 0 0 0 0 0 0 0 
0 0 0 0 0 0 272.759 0.03 0 0 0 0 0 0 91.937 0 0 0 1391.26 0 0 0 0 0 0 0 0 608.463 0 0 160.146 375.912 0 0 0 -1113.24 0 0 0 0 0 0 0 0 0 0 0 0 0 639.744 0 0 -136.647 0 0 0 0 0 0 0 0 0 0 0 0 0 0 
0 0 0 0 0 1120.87 0 0 0.09 0 0 0 0 0 0 0 0 0 0 0 0 0 -1957.38 0 0 0 0 0 1272.09 0 0 2149.34 0 0 0 0 0 0 0 -774.331 0 0 0 0 0 -1744.21 0 0 0 0 0 0 -1629.31 1517.46 0 0 -1649.14 940.352 0 1599.09 0 0 0 0 0 0 0 
0 -1418.42 0 0 0 0 0 0 0 0.02 0 868.786 0 2232.96 0 2196.04 0 0 0 0 1236.84 0 0 0 0 0 0 0 0 0 0 0 0 -1034.2 0 0 0 0 1930.68 0 0 0 0 0 0 0 0 1446.5 0 0 0 0 1905.96 0 0 0 0 0 0 0 0 0 0 0 0 0 0 
0 0 1785.56 0 0 0 0 0 0 0 0.02 0 0 2433.62 0 0 0 0 0 0 0 -1340.6 0 297.937 0 0 1762.37 0 0 0 0 0 0 -621.281 0 0 0 0 0 0 0 467.62 0 -581.912 0 0 -947.523 0 0 1892.53 0 0 0 0 -271.233 0 0 -9.99481 0 0 0 0 0 0 0 0 0 
69.2007 0 0 0 0 0 0 0 0 1981.03 0 0 1123 0 0 0 0 959.426 0 286.645 0 0 0 0 0 0 0 0 0 0 -1329.62 0 0 0 0 0 -2307.89 0 0 0 2349.09 0 0 0 0 0 0 0 0 0 0 -1459.78 0 0 -1199.45 0 0 0 0 0 0 0 0 0 0 0 0 
0 0 27.0852 0 0 0 0 0 0 0 0 140.309 0.02 0 0 0 0 0 0 0 0 0 0 0 0 0 0 -236.595 0 0 0 0 0 0 0 0 0 0 0 0 -1760.38 0 0 0 0 0 2438.81 0 0 0 0 0 0 0 0 0 0 555.055 0 -539.186 0 687.506 0 0 0 0 0 
0 0 0 976.516 0 0 0 0 0 2268.21 1198.39 0 0 0.06 0 0 0 0 0 0 0 0 82.1711 0 651.036 0 0 -2364.65 0 0 0 0 55.3148 0 0 0 57.7563 1289.03 0 0 0 0 0 0 0 0 0 0 0 0 0 0 0 0 978.805 0 0 0 0 0 68.5903 0 0 0 0 0 0 
0 0 0 0 0 0 0 -277.947 0 0 0 0 0 0 0.04 0 0 0 0 -442.747 1881.08 0 0 0 0 0 0 0 0 0 0 0 0 0 0 0 0 0 0 0 0 0 0 0 -192.343 0 0 0 0 0 0 0 0 0 0 2264.85 0 446.562 0 0 -2301.63 0 0 0 0 0 0 
0 0 0 0 1458.1 193.716 0 0 0 1883.68 0 0 0 0 0 0.03 0 0 0 0 0 0 0 0 0 0 0 0 0 0 0 0 0 0 0 0 2224.27 0 606.784 0 0 0 0 0 0 0 0 0 0 241.935 0 0 796.457 607.7 0 0 0 0 0 0 0 0 0 0 0 0 0 
-2282.4 0 0 0 -1105.61 0 2434.23 0 0 0 0 0 0 0 0 0 0.07 0 0 0 0 0 -1426.66 0 0 658.971 0 1473.36 0 0 0 0 1211.2 0 0 0 0 0 0 0 0 0 0 0 0 0 41.5815 0 0 1737.8 0 0 0 0 0 0 0 705.359 0 0 0 0 0 0 0 0 0 
-110.858 0 2092.88 -1280.63 0 -917.31 0 0 0 0 0 1784.34 0 0 0 0 0 0.05 0 0 0 0 0 0 0 0 0 0 0 0 1921.98 679.418 0 0 0 0 0 2368.01 0 0 0 0 0 0 0 0 0 0 2398.37 0 0 0 0 0 2149.34 0 0 0 1007.95 0 0 0 -1076.62 0 0 0 0 
0 0 1678.14 0 660.649 0 0 1441.31 0 0 0 0 0 0 0 0 0 0 0.02 0 0 -709.937 0 0 0 -124.897 1157.34 0 0 0 0 0 0 0 0 201.193 0 0 0 0 0 0 0 0 0 0 0 0 0 0 0 0 0 0 0 0 1472.44 0 0 1641.51 0 0 0 0 0 0 0 
714.362 0 0 0 0 0 0 0 0 0 0 -956.832 0 0 63.5548 0 0 0 0 0.06 0 0 0 0 0 0 1418.88 0 0 0 0 -1615.73 0 0 0 -2210.68 0 0 0 0 0 0 0 0 0 0 0 0 0 0 0 0 0 -517.975 0 0 0 0 0 2434.23 0 1596.96 0 0 0 0 -178.762 
0 0 0 0 -2454.83 0 -939.436 0 0 1390.5 0 0 0 0 2124.01 0 0 0 0 0 0.08 0 0 0 0 0 0 0 0 0 0 0 0 0 0 0 0 0 0 0 0 638.981 0 2260.43 2061.6 0 0 0 0 0 0 558.107 0 0 0 0 0 0 0 0 0 0 0 0 0 -484.1 0 
0 0 0 1454.28 0 0 0 0 0 0 52.4155 0 0 0 0 0 0 0 449.156 0 0 0.01 0 0 0 0 0 0 -774.026 0 0 0 0 0 0 1989.43 0 0 0 0 0 0 0 0 0 0 0 259.178 0 0 0 0 0 0 0 0 0 440.001 0 0 0 0 0 0 0 0 0 
0 0 0 0 0 2080.98 0 0 1420.56 0 0 0 0 -545.289 0 0 -387.509 0 0 0 0 0 0.06 0 0 0 0 0 0 0 0 0 0 0 0 0 0 1664.56 0 0 0 0 0 0 0 0 0 0 1252.86 0 766.701 0 0 0 -1781.44 0 0 0 0 0 85.6807 0 0 0 0 0 0 
0 0 0 0 0 32.7311 0 0 0 0 903.577 0 0 0 0 0 0 0 0 0 0 0 0 0.02 0 0 0 0 0 0 849.864 0 2160.63 0 0 0 321.131 0 0 0 0 0 0 0 0 0 0 0 0 133.137 0 2338.71 0 0 0 0 0 0 0 0 0 0 0 0 0 0 0 
0 0 0 0 0 0 0 0 0 0 0 0 0 -1272.85 0 0 0 0 0 0 0 0 0 0 0.01 0 0 0 0 -2152.24 0 0 0 0 0 0 0 1751.23 2432.86 0 2272.03 0 0 0 0 0 0 0 0 0 0 0 0 0 0 -877.331 0 0 0 0 0 0 0 0 0 0 0 
0 0 0 0 0 0 0 0 0 0 0 0 0 0 0 0 1314.36 0 1311.76 0 0 0 0 0 0 0.05 1015.58 0 0 0 0 0 0 0 0 0 0 0 0 0 0 0 0 0 0 0 0 653.935 0 0 0 0 0 0 0 0 0 0 0 0 0 0 0 0 0 0 0 
0 0 0 0 0 0 0 0 0 0 899.152 0 0 0 0 0 0 0 130.543 -382.473 0 0 0 0 0 -696.966 0.04 -815.378 0 0 0 0 0 0 1382.72 0 0 0 0 0 1681.34 0 1946.09 0 0 0 0 0 0 0 0 0 0 0 0 1844.77 0 0 0 0 0 0 0 0 0 0 0 
0 0 0 0 1882.76 0 0 1518.83 0 0 0 0 1432.46 -2337.95 0 0 2143.24 0 0 0 0 0 0 0 0 0 -833.689 0.04 0 0 0 0 0 0 465.026 0 0 0 0 0 0 0 0 0 0 0 0 0 0 0 0 30.4422 0 0 0 301.904 0 0 -1228.75 0 347.377 0 0 0 0 1907.48 0 
0 0 0 -1284.45 0 -699.255 0 0 1893.75 0 0 0 0 0 0 0 0 0 0 0 0 1092.64 0 0 0 0 0 0 0.06 0 0 0 0 403.226 -1495.64 2002.55 0 0 0 0 0 0 0 0 0 -23.1178 0 0 0 608.615 0 0 -109.333 0 0 0 0 0 0 585.421 0 0 0 0 0 0 0 
0 0 0 0 -486.694 0 0 0 0 0 0 0 0 0 0 0 0 0 0 0 0 0 0 0 1041.67 0 0 0 0 0 0 0 0 -603.732 0 2213.74 0 0 0 0 0 0 0 0 0 0 0 0 0 0 0 0 0 0 0 0 0 0 0 0 0 1551.94 0 0 0 0 0 
0 0 0 0 1862.62 0 0 -164.266 0 0 0 50.5844 0 0 0 0 0 2464.75 0 0 0 0 0 577.792 0 0 0 0 0 0 0.03 0 0 0 0 0 0 0 0 0 0 0 0 0 -468.078 0 0 0 0 0 0 0 0 0 0 0 0 0 0 0 0 0 0 0 0 0 0 
-1490.3 -2158.35 0 1482.67 0 0 0 1213.8 1880.02 0 0 0 0 0 0 0 0 2180.01 0 -796.609 0 0 0 0 0 0 0 0 0 0 0 0.07 0 0 0 0 0 0 0 0 0 0 881.146 0 0 0 79.2718 0 0 0 0 0 0 0 0 0 0 0 0 41.1237 1924.27 0 0 0 0 0 0 
0 0 0 0 0 0 0 0 0 0 0 0 0 1834.24 0 0 1449.1 0 0 0 0 0 0 -575.655 0 0 0 0 0 0 0 0 0.06 0 857.952 0 0 0 0 0 0 -1818.22 0 0 0 0 2258.14 0 0 0 0 0 0 0 0 0 0 0 1995.68 0 379.727 0 0 0 0 0 0 
1877.12 0 0 0 0 0 0 0 0 -192.038 -2001.48 0 0 0 0 0 0 0 0 0 0 0 0 0 0 0 0 0 -156.178 1078.3 0 0 0 0.08 0 0 0 0 1106.83 0 0 0 0 0 0 1155.96 0 0 0 0 0 0 0 0 0 0 2465.97 0 0 0 0 0 0 0 0 0 0 
0 0 0 0 0 0 0 0 0 0 0 0 0 0 0 0 0 0 0 0 0 0 0 0 0 0 1647.62 2242.73 1389.58 0 0 0 1103.02 0 0.08 0 0 -816.294 0 0 0 0 0 0 0 0 0 175.71 0 0 0 0 0 0 0 0 -604.801 0 0 0 80.6452 0 0 0 0 0 0 
0 0 0 0 325.861 0 0 -303.888 0 0 0 0 0 0 0 0 0 0 1930.22 2398.22 0 -1974.78 0 0 0 0 0 0 -786.691 1165.58 0 0 0 0 0 0.08 0 2430.11 0 0 0 0 0 0 0 1868.88 0 0 0 0 1801.13 0 0 0 -1866.44 0 0 0 0 0 0 0 0 0 0 0 1082.57 
0 0 0 0 2164.14 0 0 0 0 0 0 -319.452 0 -315.79 0 2111.5 0 0 0 0 0 0 0 916.089 0 0 0 0 0 0 0 0 0 0 0 0 0.09 0 0 -1694.01 -1498.84 -772.5 0 66.6066 0 0 0 0 0 0 0 0 0 0 0 0 0 0 0 0 0 0 0 0 0 0 0 
0 0 0 2497.71 0 -553.682 0 0 0 0 0 0 0 2292.78 0 0 0 1349.3 0 0 0 0 2288.2 0 -1475.95 0 0 0 0 0 0 0 0 0 -63.097 2371.36 0 0.06 0 0 0 0 0 2068.32 1722.08 0 158.162 0 0 0 0 0 0 0 0 0 0 0 0 -1870.86 0 0 0 0 0 0 0 
0 1576.66 2356.72 0 0 0 0 0 0 1080.28 0 0 0 0 0 2017.04 0 0 0 0 0 0 0 0 1242.33 0 0 0 0 0 0 0 0 612.888 0 0 0 0 0.08 0 0 0 2259.36 1936.93 0 0 -744.27 0 0 0 0 0 0 0 0 0 0 0 0 2491.61 0 0 0 0 0 0 0 
0 0 0 0 0 0 0 0 2407.38 0 0 0 0 0 0 0 0 0 0 0 0 0 0 0 0 0 0 0 0 0 0 0 0 0 0 0 801.798 0 0 0.05 0 0 0 0 0 0 0 0 -969.192 0 0 0 0 0 0 0 0 0 0 0 0 1786.17 0 0 0 0 0 
0 755.562 0 0 -967.208 0 0 0 0 0 0 1948.53 -466.247 0 0 0 0 0 0 0 0 0 0 0 881.451 0 1943.04 0 0 0 0 0 0 0 0 0 1684.55 0 0 0 0.02 0 -2292.78 0 0 0 0 0 0 0 0 0 0 0 0 0 0 0 0 0 0 0 0 0 0 0 0 
0 0 0 0 0 0 0 0 0 0 -1477.94 0 0 0 0 0 0 0 0 0 342.799 0 0 0 0 0 0 0 0 0 0 0 1906.72 0 0 0 -186.239 0 0 0 0 0 0 623.417 0 0 0 0 1533.02 0 0 0 0 0 0 324.641 0 -1594.36 0 1923.81 1577.12 0 0 0 0 0 0 
0 0 0 2437.74 -2078.54 0 -287.408 0 0 0 0 0 0 0 0 0 0 0 0 0 0 0 0 0 0 0 1493.04 0 0 0 0 -2305.75 0 0 0 0 0 0 2169.33 0 -128.559 0 0.03 0 0 0 -974.99 1966.54 0 0 0 0 0 0 0 0 0 0 0 0 0 0 0 0 0 0 0 
0 936.995 0 0 0 0 0 0 0 0 1058.76 0 0 0 0 0 0 0 0 0 375.912 0 0 0 0 0 0 0 0 0 0 0 0 0 0 0 -1402.25 -791.116 -920.667 0 0 533.998 0 0.02 0 0 0 2223.04 0 0 -1699.35 0 0 0 0 0 0 0 0 0 0 0 0 0 0 0 0 
0 0 0 0 0 0 -442.442 0 0 0 0 0 0 0 1246.91 0 0 0 0 0 678.961 0 0 0 0 0 0 0 0 0 -1569.95 0 0 0 0 0 0 -768.838 0 0 0 0 0 0 0.06 2008.5 0 0 0 2315.21 0 0 0 0 0 1457.79 0 0 0 0 0 0 0 0 0 0 0 
0 0 0 0 0 0 0 0 -592.441 0 0 0 0 0 0 0 0 0 0 0 0 0 0 0 0 0 0 0 1689.73 0 0 0 0 2039.17 0 762.734 0 0 0 0 0 0 0 0 -1635.72 0.09 0 0 0 0 0 -1118.88 0 0 972.701 0 0 1628.24 255.974 0 0 0 0 -167.013 0 0 0 
0 0 0 0 0 0 0 0 0 0 -930.433 0 104.755 0 0 0 925.855 0 0 0 0 0 0 0 0 0 0 0 0 0 0 1835.92 -662.481 0 0 0 0 1280.18 -1252.71 0 0 0 1167.26 0 0 0 0.01 0 -965.529 0 0 0 0 0 0 0 0 0 1205.86 0 0 0 0 0 0 0 0 
0 1810.13 0 0 0 0 0 0 0 287.561 0 0 0 0 0 0 0 0 0 0 0 -1938.76 0 0 0 748.39 0 0 0 0 0 0 0 0 1493.5 0 0 0 0 0 0 0 -1595.89 606.021 0 0 0 0 0 0 0 0 0 0 0 0 0 0 0 0 1590.09 0 0 0 0 0 0 
0 0 2190.85 0 0 0 0 0 0 0 0 0 0 0 0 0 0 -2250.21 0 0 0 0 118.488 0 0 0 0 0 0 0 0 0 0 0 0 0 0 0 0 -1097.98 0 489.898 0 0 0 0 -368.282 0 0.02 0 0 882.214 0 0 0 0 0 0 2352.44 0 0 0 0 0 0 0 0 
0 0 0 857.799 0 0 0 -397.275 0 0 2414.7 0 0 0 0 872.906 26.4748 0 0 0 0 0 0 686.59 0 0 0 0 617.618 0 0 0 0 0 0 0 0 0 0 0 0 0 0 0 11.8259 0 0 0 0 0.01 0 0 1913.13 0 0 0 0 0 0 2461.39 0 0 0 0 0 0 0 
0 0 1224.78 0 52.7207 0 0 0 0 0 0 0 0 0 0 0 0 0 0 0 0 0 -1239.89 0 0 0 0 0 0 0 0 0 0 0 0 2400.51 0 0 0 0 0 0 0 2200.92 0 0 0 0 0 0 0.05 0 0 0 0 0 0 1783.12 0 0 0 0 0 0 0 0 0 
628.758 0 0 0 0 0 0 0 0 0 0 1632.66 0 0 0 0 0 0 0 0 391.934 0 0 1326.41 0 0 0 -1134.75 0 0 0 0 0 0 0 0 0 0 0 0 0 0 0 0 0 1647.16 0 0 1748.63 0 0 0.03 0 1630.53 0 0 0 0 0 0 0 0 0 0 457.549 0 0 
0 0 0 863.292 -1980.73 0 -5.11185 834.147 -2385.1 640.507 0 0 0 0 0 1292.69 0 0 0 0 0 0 0 0 0 0 0 0 -2116.84 0 0 0 0 0 0 0 0 0 0 0 0 0 0 0 0 0 0 0 0 2063.59 0 0 0.09 2111.96 468.688 0 0 0 0 0 0 0 0 0 0 0 0 
0 610.141 0 0 0 0 0 0 -1668.37 0 0 0 0 0 0 2496.03 0 0 0 1565.98 0 0 0 0 0 0 0 0 0 0 0 0 0 0 0 0 0 0 0 0 0 0 0 0 0 0 0 0 0 0 0 -887.555 -2218.92 0 0 0 -191.733 0 0 0 0 0 0 0 0 0 0 
0 0 0 1341.98 0 0 0 0 0 0 1165.43 2179.71 0 2150.11 0 0 0 -2281.18 0 0 0 0 459.227 0 0 0 0 0 0 0 0 0 0 0 0 1267.82 0 0 0 0 0 0 0 0 0 -2468.11 0 0 0 0 0 0 -66.6066 0 0.06 -854.747 0 0 0 0 0 0 0 0 0 0 0 
0 0 0 0 0 0 0 0 0 0 0 0 0 0 -106.891 0 0 0 0 0 0 0 0 0 424.741 0 1482.36 -301.294 0 0 0 0 0 0 0 0 0 0 0 0 0 2048.17 0 0 -1809.21 0 0 0 0 0 0 0 0 0 -1845.53 0.08 0 0 0 0 0 0 0 0 0 0 0 
0 0 0 0 0 0 0 0 2175.28 0 0 0 0 0 0 0 0 0 -1264.46 0 0 0 0 0 0 0 0 0 0 0 0 0 0 -650.273 98.1933 0 0 0 0 0 0 0 0 0 0 0 0 0 0 0 0 0 0 903.119 0 0 0.05 0 0 0 0 0 0 0 0 0 0 
0 0 0 0 0 0 0 0 510.193 0 1341.82 0 355.464 0 1532.26 0 1116.6 0 0 0 0 -752.51 0 0 0 0 0 0 0 0 0 0 0 0 0 0 0 0 0 0 0 -303.125 0 0 0 -1276.36 0 0 0 0 -1054.95 0 0 0 0 0 0 0.09 0 0 0 0 0 0 0 0 0 
159.23 0 0 0 0 342.952 -342.494 0 0 0 0 0 0 0 0 0 0 1691.11 0 0 0 0 0 0 0 0 0 -1739.02 0 0 0 0 2224.27 0 0 0 0 0 0 0 0 0 0 0 0 -1977.22 1843.24 0 -46.1592 0 0 0 0 0 0 0 0 0 0.04 0 0 0 0 0 0 0 0 
0 0 0 0 0 0 0 0 -207.144 0 0 0 191.122 0 0 0 0 0 -251.396 1138.26 0 0 0 0 0 0 0 0 1737.04 0 0 -945.54 0 0 0 0 0 2279.5 1367.46 0 0 1545.69 0 0 0 0 0 0 0 99.414 0 0 0 0 0 0 0 0 0 0.03 0 0 0 0 0 0 0 
0 0 0 0 0 0 0 0 0 0 0 0 0 2305.14 -332.575 0 0 0 0 0 0 0 2366.33 0 0 0 0 846.812 0 0 0 -1733.53 2118.98 0 69.8111 0 0 0 0 0 0 380.795 0 0 0 0 0 -1180.84 0 0 0 0 0 0 0 0 0 0 0 0 0.05 0 0 0 0 0 0 
0 0 0 0 0 0 0 0 0 0 0 0 2008.35 0 0 0 0 0 0 1282.92 0 0 0 0 0 0 0 0 0 1032.21 0 0 0 0 0 0 0 0 0 -718.635 0 0 0 0 0 0 0 0 0 0 0 0 0 0 0 0 0 0 0 0 0 0.06 0 0 0 0 0 
0 0 0 0 0 0 0 0 0 0 0 0 0 0 0 0 0 278.253 0 0 0 0 0 0 0 0 0 0 0 0 0 0 0 0 0 0 0 0 0 0 0 0 0 0 0 0 0 0 0 0 0 0 0 0 0 0 0 0 0 0 0 0 0.03 0 0 0 0 
0 0 0 0 0 0 0 0 0 0 0 0 0 0 0 0 0 0 0 0 0 0 0 0 0 0 0 0 0 0 0 0 0 0 0 0 0 0 0 0 0 0 0 0 0 1182.97 0 0 0 0 0 0 0 0 0 0 0 0 0 0 0 0 0 0.01 0 0 0 
0 0 0 0 0 0 0 0 0 0 0 0 0 0 0 0 0 0 0 0 0 0 0 0 0 0 0 0 0 0 0 0 0 0 0 0 0 0 0 0 0 0 0 0 0 0 0 0 0 0 0 2271.26 0 0 0 0 0 0 0 0 0 0 0 0 0.08 0 0 
0 0 0 0 0 0 0 0 0 0 0 0 0 0 0 0 0 0 0 0 -394.986 0 0 0 0 0 0 742.439 0 0 0 0 0 0 0 0 0 0 0 0 0 0 0 0 0 0 0 0 0 0 0 0 0 0 0 0 0 0 0 0 0 0 0 0 0 0.08 0 
0 0 0 0 0 0 0 0 0 0 0 0 0 0 0 0 0 0 0 1065.48 0 0 0 0 0 0 0 0 0 0 0 0 0 0 0 10.9104 0 0 0 0 0 0 0 0 0 0 0 0 0 0 0 0 0 0 0 0 0 0 0 0 0 0 0 0 0 0 0.09 
