*Vertices 41
*Matrix 
0.05 2430.27 0 313.044 0 0 0 0 -443.052 1662.42 0 0 0 0 0 0 0 0 0 0 0 672.246 0 0 0 0 0 0 0 0 0 0 0 0 1684.85 0 -242.241 0 0 0 0 
-313.807 0.08 1522.95 0 0 2079.61 0 -2247 0 0 0 -250.023 0 2414.55 1409.42 0 0 0 -1699.5 0 0 0 0 0 0 0 0 0 0 0 0 0 0 0 0 0 0 0 0 0 0 
0 787.606 0.02 0 0 0 0 0 953.932 0 856.426 0 790.353 0 918.989 0 0 0 0 0 0 0 0 0 0 0 0 0 0 0 0 0 0 0 1644.57 0 0 0 0 -959.426 0 
1286.74 0 0 0.02 1033.89 0 0 0 0 0 0 0 0 0 0 0 0 0 0 0 0 0 0 0 0 0 0 2149.04 0 0 0 0 0 0 0 0 0 1708.5 0 0 364.162 
0 0 0 724.586 0.05 0 0 0 0 0 -1220.97 0 0 0 0 1865.98 0 0 0 0 937.452 0 0 0 0 0 0 0 607.7 0 1321.07 0 0 0 0 0 0 0 0 0 -985.366 
0 1204.18 0 0 0 0 0 0 1319.54 202.414 0 2107.99 0 -2118.06 0 0 0 0 -1152.3 0 0 0 0 0 0 1078.45 0 0 0 0 0 0 0 0 0 137.104 0 0 0 0 0 
0 0 0 0 0 0 0.08 0 0 -958.815 0 2444.15 0 0 0 627.232 0 0 601.291 0 -314.112 0 0 0 0 0 0 0 0 0 0 -1618.78 0 0 0 0 0 0 0 0 0 
0 70.5741 0 0 0 0 0 0.01 0 0 2282.1 0 0 0 168.844 0 0 0 2327.57 0 0 0 0 0 0 0 0 0 0 0 0 0 -1773.2 0 0 0 2277.37 0 962.477 0 0 
2114.86 0 1465.27 0 0 2254.02 0 0 0.06 2478.64 0 0 0 0 0 862.072 -465.484 0 0 0 0 0 0 0 0 0 -1926.25 0 0 0 0 -1721.78 0 1125.29 0 0 0 0 0 0 0 
1547.98 0 0 0 0 828.959 909.07 0 316.095 0.06 0 0 0 -341.884 1166.65 0 0 0 0 0 2271.42 0 655.461 0 -2452.85 0 0 0 0 0 0 0 0 0 0 0 0 0 0 0 0 
0 0 -1867.2 0 1147.72 0 0 1556.83 0 0 0 0 0 1113.85 0 0 0 2209.92 0 0 0 0 0 0 0 0 0 0 0 0 0 0 -382.168 0 0 0 0 0 0 0 -2200.16 
0 774.789 0 0 0 -571.993 -523.621 0 0 0 0 0.07 1832.26 0 1602.15 0 0 368.13 706.122 1680.27 0 0 0 0 0 0 0 0 0 0 -1513.64 0 0 0 0 0 0 0 -1359.07 0 0 
0 0 793.863 0 0 0 0 0 0 0 0 2326.81 0.06 0 0 0 0 0 653.172 0 0 0 2370.6 0 0 0 0 0 0 0 0 0 0 0 0 0 0 46.3118 0 0 0 
0 -317.316 0 0 0 1841.72 0 0 0 1697.52 620.518 0 0 0.08 0 0 0 0 0 0 -1163.59 0 0 0 0 0 0 0 -2017.35 0 0 0 0 0 0 0 2238.61 0 0 0 0 
0 1934.03 76.5252 0 0 0 0 1605.66 0 -813.7 0 2237.85 0 0 0.05 -1005.2 0 0 2316.43 0 -465.178 0 -1885.97 0 0 0 -1423.15 427.793 0 131.458 0 0 0 0 0 0 0 0 -980.636 0 0 
0 0 0 0 1199 0 -1114.92 0 1361.35 0 0 0 0 0 -309.076 0.01 1956.92 0 0 0 0 0 0 0 0 0 0 0 0 0 0 1690.04 0 0 0 0 0 0 0 550.478 0 
0 0 0 0 0 0 0 0 890.606 0 0 0 0 0 0 1584.9 0.03 0 2406.16 2318.57 0 -1031.91 22.66 0 0 0 0 0 0 0 0 0 0 0 0 0 0 0 0 0 0 
0 0 0 0 0 0 0 0 0 0 464.415 1005.36 0 0 0 0 0 0.01 1777.63 0 0 0 0 0 0 0 0 0 0 -26.9326 0 0 0 0 0 0 0 0 0 0 0 
0 349.513 0 0 0 -908.307 591.678 2336.88 0 0 0 1607.03 1822.03 0 309.076 0 438.475 1773.35 0.06 0 0 587.1 0 0 0 0 0 0 0 0 0 0 0 0 0 0 0 0 2256.46 0 0 
0 0 0 0 0 0 0 0 0 0 0 -371.181 0 0 0 0 799.509 0 0 0.06 0 0 0 0 0 0 1125.6 0 0 0 0 76.5252 0 543.916 -1144.83 0 0 0 362.331 0 0 
0 0 0 0 591.525 0 1897.41 0 0 -1841.72 0 0 0 219.962 1406.52 0 0 0 0 0 0.01 0 0 2272.64 0 1614.66 0 0 0 0 1267.05 -745.033 0 0 0 0 0 0 0 0 806.07 
1778.08 0 0 0 0 0 0 0 0 0 0 0 0 0 0 0 1471.37 0 1876.35 0 0 0.08 0 1172.14 0 0 0 0 0 345.546 -320.673 0 -2023.91 0 0 -2486.11 0 0 0 0 0 
0 0 0 0 0 0 0 0 0 -468.383 0 0 -180.898 0 1896.65 0 1684.24 0 0 0 0 0 0.05 -2205.5 0 0 0 470.214 0 0 0 0 0 0 0 0 0 1195.94 0 0 0 
0 0 0 0 0 0 0 0 0 0 0 0 0 0 0 0 0 0 0 0 1365.02 94.6837 480.59 0.03 992.233 0 0 0 0 0 0 0 0 0 0 0 0 0 0 242.241 0 
0 0 0 0 0 0 0 0 0 -114.216 0 0 0 0 0 0 0 0 0 0 0 0 0 1836.83 0.09 0 0 0 0 0 -1689.28 0 2119.89 0 -531.709 0 0 -115.436 0 0 1734.9 
0 0 0 0 0 1367.15 0 0 0 0 0 0 0 0 0 0 0 0 0 0 504.547 0 0 0 0 0.07 0 0 0 0 0 0 0 0 0 0 0 0 0 0 0 
0 0 0 0 0 0 0 0 2022.39 0 0 0 0 0 1910.84 0 0 0 0 1048.54 0 0 0 0 0 0 0.02 0 933.485 0 0 0 0 0 0 0 0 0 0 0 0 
0 0 0 392.85 0 0 0 0 0 0 0 0 0 0 1989.12 0 0 0 0 0 0 0 2217.55 0 0 0 0 0.04 0 0 0 0 0 1643.04 0 0 0 0 0 97.8881 0 
0 0 0 0 1640.45 0 0 0 0 0 0 0 0 -941.572 0 0 0 0 0 0 0 0 0 0 0 0 709.021 0 0.01 0 0 0 0 0 0 0 -759.987 871.227 0 0 0 
0 0 0 0 0 0 0 0 0 0 0 0 0 0 1793.65 0 0 1208 0 0 0 1088.82 0 0 0 0 0 0 0 0.04 0 0 233.543 0 0 0 0 0 0 0 0 
0 0 0 0 -584.201 0 0 0 0 0 0 4.34889 0 0 0 0 0 0 0 0 559.633 -239.036 0 0 1566.29 0 0 0 0 0 0.04 0 0 0 0 0 0 0 0 0 0 
0 0 0 0 0 0 -1916.79 0 -1025.04 0 0 0 0 0 0 1267.66 0 0 0 -577.181 2374.72 0 0 0 0 0 0 0 0 0 0 0.09 0 0 0 0 0 0 1468.78 0 0 
0 0 0 0 0 0 0 -537.202 0 0 -911.817 0 0 0 0 0 0 0 0 0 0 1627.48 0 0 2485.96 0 0 0 0 -530.335 0 0 0.02 0 0 -2125.08 0 0 0 0 0 
0 0 0 0 0 0 0 0 802.713 0 0 0 0 0 0 0 0 0 0 -477.233 0 0 0 0 0 0 0 1075.55 0 0 0 0 0 0.08 0 0 0 0 0 0 -738.166 
1870.86 0 -2438.81 0 0 0 0 0 0 0 0 0 0 0 0 0 0 0 0 1465.27 0 0 0 0 1883.37 0 0 0 0 0 0 0 0 0 0.02 0 0 0 0 0 -2473.75 
0 0 0 0 0 2169.18 0 0 0 0 0 0 0 0 0 0 0 0 0 0 0 -1651.13 0 0 0 0 0 0 0 0 0 0 399.411 0 0 0.05 0 0 0 537.507 0 
-1608.25 0 0 0 0 0 0 2258.29 0 0 0 0 0 -1846.9 0 0 0 0 0 0 0 0 0 0 0 0 0 0 1625.34 0 0 0 0 0 0 0 0 0 0 0 0 
0 0 0 1639.53 0 0 0 0 0 0 0 0 1723.61 0 0 0 0 0 0 0 0 0 1450.32 0 -1337.86 0 0 0 1714.15 0 0 0 0 0 0 0 0 0.04 0 0 0 
0 0 0 0 0 0 0 2204.58 0 0 0 698.035 0 0 2344.97 0 0 0 899.304 -888.012 0 0 0 0 0 0 0 0 0 0 0 -2169.48 0 0 0 0 0 0 0.01 270.013 0 
0 0 2274.32 0 0 0 0 0 0 0 0 0 0 0 0 1824.47 0 0 0 0 0 0 0 -1315.27 0 0 0 -1365.02 0 0 0 0 0 0 0 -219.047 0 0 1954.02 0.07 0 
0 0 0 985.977 2497.86 0 0 0 0 0 230.033 0 0 0 0 0 0 0 0 0 -1199.61 0 0 0 382.778 0 0 0 0 0 0 0 0 267.266 1965.32 0 0 0 0 0 0.05 
