*Vertices 69
*Matrix 
0.08 0 0 -837.199 2172.23 591.067 0 0 0 0 -1362.58 -799.203 0 0 -1350.83 0 -1291.77 0 0 0 0 0 0 0 1871.01 0 0 0 681.249 0 -340.205 0 0 0 0 0 0 978.195 0 0 0 0 0 0 0 0 -330.287 0 2256.92 0 -2108.91 0 0 0 0 0 0 0 0 0 0 0 0 1675.24 0 0 0 0 0 
0 0.05 -2207.79 0 -1758.55 0 0 0 0 0 0 0 0 0 1327.78 0 1699.8 0 0 0 0 344.02 0 0 0 0 1268.73 1675.24 0 1031.91 0 0 0 0 2125.39 537.507 0 0 0 0 0 0 -1795.33 604.801 -1752.45 0 0 0 0 0 0 0 2134.39 -531.404 1907.33 0 0 0 0 0 0 0 0 0 0 880.23 0 1133.69 0 
0 -2085.41 0.04 0 0 2158.8 0 1035.72 -1977.52 0 0 0 2388.3 0 0 0 0 2451.48 -1429.87 0 1322.6 0 38.8348 0 0 0 -2411.5 0 0 2285.15 0 0 0 0 -406.888 0 2098.83 -1017.11 0 0 90.1059 0 -114.063 0 0 0 0 0 0 2237.69 -482.116 0 761.666 0 0 0 0 0 0 0 0 0 0 862.072 -2155.45 2228.84 0 0 0 
792.032 0 0 0.09 0 0 0 2028.03 0 0 897.32 714.972 0 0 1983.63 0 0 0 0 0 -1236.99 0 971.48 2028.03 1195.18 0 0 -1533.33 0 0 0 0 0 0 0 0 0 2261.35 1131.7 2042.07 -948.897 0 0 0 0 1953.26 -1692.02 0 774.178 0 0 0 0 0 -1621.83 0 0 -259.789 0 0 0 0 0 -1731.39 0 2133.01 0 0 0 
-2271.42 967.971 0 0 0.04 2074.11 0 0 0 0 -229.27 0 -620.67 1467.71 218.131 0 0 0 0 1783.58 2298.58 0 0 0 0 0 1863.99 0 -1472.59 0 0 0 0 -2250.21 -2149.8 0 -1227.38 0 2304.53 0 655.004 0 0 0 0 0 0 0 1893.44 0 1736.88 0 -2453 2361.9 0 0 0 0 0 0 1252.25 1093.86 -2244.71 0 0 0 1725.14 0 0 
-1256.37 0 1074.33 0 -793.863 0.09 0 0 0 0 0 1795.48 -2216.48 0 0 0 2384.33 0 0 0 0 0 0 -1298.64 0 0 0 0 -2401.88 0 -1603.37 936.232 0 0 0 63.097 0 0 0 1050.37 0 0 -1383.33 1956.31 2211.6 2321.92 0 0 -732.673 -1684.39 0 -220.267 0 0 0 2182.76 0 0 0 0 0 0 -2441.71 0 0 0 -795.846 -408.567 0 
0 0 0 0 0 0 0 583.743 -1184.5 0 0 1345.03 0 0 0 0 0 -885.418 0 0 -111.927 0 0 258.11 0 0 0 0 0 0 -2408.29 0 0 0 0 -1888.56 0 0 0 0 0 1934.8 0 2443.39 73.4733 0 0 0 466.552 0 -652.867 0 0 2070.15 0 0 0 1839.27 -2130.57 0 0 0 0 2483.67 0 0 0 0 0 
0 0 674.993 1015.88 0 0 -842.54 0.06 -583.743 0 0 0 0 0 0 872.295 1854.23 -1395.84 0 0 0 2321.92 2096.09 -1489.68 0 1713.39 -1844.61 0 0 -1853.47 0 0 0 -2189.63 0 1999.04 1121.02 0 0 0 -358.516 656.072 1629.92 342.494 0 555.208 0 0 0 0 0 0 0 0 -951.186 0 0 0 0 0 0 0 0 0 0 0 0 0 0 
0 0 1349.91 0 0 0 1773.96 2442.01 0.09 -239.799 -1783.58 0 0 0 -1652.2 0 524.689 0 0 0 1957.08 0 0 0 505.615 1579.71 0 1006.12 0 16.2511 1157.19 0 0 0 0 0 0 0 0 0 0 -950.575 0 -2251.43 0 0 0 2475.74 0 0 0 0 0 -377.285 627.079 0 0 0 -437.407 0 0 0 0 0 0 0 -149.312 0 2000.26 
0 0 0 0 0 0 0 0 505.768 0.08 0 0 0 0 0 0 0 0 0 0 1053.73 -352.87 -1522.19 0 -2350.46 0 0 0 2025.13 0 2126.76 322.504 0 0 0 0 0 2297.66 0 0 0 0 -1314.97 0 0 0 0 0 0 742.744 0 0 0 0 0 0 0 0 315.027 0 0 0 -1220.36 0 0 0 0 0 0 
-383.847 0 0 -1602.91 213.706 0 0 0 2029.25 0 0.06 0 0 0 1511.96 0 0 365.383 0 0 0 169.607 175.863 0 813.852 2476.81 1529.21 0 2006.06 0 1944.56 1608.25 2259.97 0 1403.78 2040.54 0 180.288 -204.245 -1908.7 0 0 0 0 0 697.577 0 0 -234.764 1524.48 2315.82 0 1375.85 0 0 0 -2059.92 0 0 2324.06 0 0 0 0 553.987 0 0 1968.83 0 
2151.33 0 0 1708.04 0 -560.701 753.121 0 0 0 0 0.09 2247.46 0 0 -1247.22 0 0 -2142.63 0 0 0 0 0 624.332 0 0 2127.98 -713.904 0 0 0 0 2070.91 0 -1563.23 0 0 0 0 -2432.1 0 0 770.821 0 0 0 0 0 0 2206.72 0 0 0 0 0 0 0 0 0 0 88.2748 0 0 0 1785.1 0 0 -806.833 
0 0 2034.9 0 371.487 -2397.61 0 0 0 0 0 1838.05 0 0 0 0 1521.27 0 0 0 0 0 0 -861.003 0 0 0 1780.37 -54.857 0 -43.26 0 -304.346 0 0 0 0 0 0 1000.17 0 0 832.774 -975.906 0 0 0 0 1762.98 0 -1986.98 0 0 0 0 0 0 0 1423.76 1627.32 0 0 0 0 0 0 0 0 0 
0 0 0 0 -2257.84 0 0 0 0 0 0 0 0 0.09 0 0 0 -1066.7 0 0 0 2166.28 -449.767 237.358 -902.051 0 1798.84 1298.94 -1506.01 0 0 0 0 0 0 0 0 0 0 116.504 0 0 0 0 0 0 0 0 620.67 1963.03 0 0 0 0 0 0 270.165 -290.307 0 0 0 1238.36 0 0 0 0 1370.2 0 0 
2354.43 839.335 0 1388.82 1291.92 0 0 0 -1768.78 0 144.429 0 0 0 0.05 0 0 0 0 315.485 -2413.48 -21.4393 0 0 547.273 -882.366 275.048 0 0 756.02 0 0 0 0 0 0 0 0 0 0 0 0 0 0 -1211.36 2243.95 0 -2067.4 0 0 -1414.76 1141.16 0 -539.491 0 0 -738.014 1183.74 2379.45 -1948.99 0 0 0 -830.79 0 1272.24 0 0 0 
0 0 0 0 0 0 0 1821.88 0 0 0 -1879.41 0 0 0 0.09 0 0 0 276.879 0 -480.743 0 0 -627.995 2346.19 0 0 0 0 -47.2274 792.032 -823.313 -718.024 0 -2151.94 0 0 0 -201.956 0 0 0 0 0 0 0 0 0 2307.73 0 0 2176.35 0 0 2217.86 0 2404.63 1149.1 0 0 -1878.95 0 -51.6526 0 2020.55 0 -1631.44 0 
1095.39 -2162.47 0 0 0 -1246.91 0 -1515.17 606.784 0 0 0 2499.39 0 0 0 0.01 0 0 0 0 0 0 0 0 0 1762.06 259.178 0 0 0 0 0 0 1617.25 0 0 0 0 0 0 0 0 0 1682.1 0 0 0 0 -1387.14 2457.43 0 0 0 1145.59 0 0 0 0 0 0 0 0 0 0 0 0 0 -1569.95 
0 0 -1579.26 0 0 0 -1845.38 1863.08 0 0 -71.6422 0 0 1381.19 0 0 0 0.05 0 0 0 0 998.184 0 0 0 0 0 0 0 0 -2063.74 0 1136.74 0 2428.43 0 -148.396 0 0 0 -2382.96 0 0 0 0 0 0 -1791.21 0 0 1603.98 718.94 556.581 958.968 0 0 0 0 0 0 0 1029.16 0 0 -1288.87 0 582.98 1357.08 
0 0 1292.54 0 0 0 0 0 0 0 0 1985.92 0 0 0 0 0 0 0.02 0 0 -1415.22 0 1010.85 -902.966 0 0 569.552 0 -1940.75 984.146 0 0 0 0 -2354.58 0 0 0 -140.614 0 0 0 0 0 0 -1079.82 0 0 0 0 0 -1169.39 0 -1891 519.959 0 1484.8 0 0 0 0 0 523.621 0 0 0 1873 0 
0 0 0 0 1791.97 0 0 0 0 0 0 0 0 0 -611.667 2391.81 0 0 0 0.08 0 -1442.38 0 0 -1663.34 1402.1 0 1500.67 2246.09 0 0 0 0 0 0 0 0 0 2494.51 1812.57 -933.638 0 0 0 0 0 0 0 0 0 -328.761 0 0 1895.89 0 0 1094.93 0 1821.73 0 0 0 0 0 0 -1232.26 2126.15 0 0 
0 0 1899.55 671.636 978.652 0 -212.18 0 -1140.86 -183.035 0 0 0 0 2419.74 0 0 0 0 0 0.05 0 0 0 0 0 0 0 0 0 160.909 0 0 1380.58 0 0 -1369.44 0 0 0 0 0 0 0 0 0 2479.86 0 0 -911.664 0 2011.55 0 0 0 0 33.9518 1823.4 0 0 -166.707 0 1023.51 1790.75 145.344 0 -626.316 0 0 
0 2210.38 0 0 0 0 0 -1573.15 0 -2038.71 1527.38 0 0 1596.35 1978.59 -1900.16 0 0 -705.359 1630.53 0 0.01 0 0 0 0 0 0 -2218.01 0 0 0 0 0 -446.104 0 0 0 -58.0615 0 0 0 0 0 0 0 0 0 0 1200.98 0 0 0 0 0 0 0 0 0 0 0 0 0 0 0 1580.94 -2062.36 0 0 
0 0 176.778 735.267 0 0 0 -913.19 0 -2094.1 606.784 0 0 506.226 0 0 0 2098.83 0 0 0 0 0.09 0 0 0 0 -1081.8 0 0 0 0 0 0 -2460.94 0 0 0 0 0 417.57 1782.36 -2412.87 0 -513.855 2028.18 0 1297.11 0 0 0 0 0 -479.675 0 1881.24 0 0 0 2402.65 0 0 0 0 -2341.3 0 0 -510.346 0 
0 0 0 -1266.29 0 2407.22 -1795.94 1706.52 0 0 0 0 1614.2 -1021.84 0 0 0 0 -897.778 0 0 0 0 0.03 0 0 0 0 746.559 0 2201.22 0 0 0 0 0 0 910.596 0 -864.513 0 2179.56 0 422.758 0 1235.01 -1641.21 0 1700.57 0 0 0 0 2166.74 0 -343.104 0 0 0 0 938.673 0 0 -482.116 0 482.421 0 1018.78 0 
1212.73 0 0 -1204.03 0 0 0 0 900.372 2016.59 2038.56 1724.98 0 -288.324 425.962 -1289.79 0 0 2050.31 590.304 0 0 0 0 0.02 0 0 0 868.48 335.78 0 0 -949.66 2367.55 0 -2065.57 -1950.21 0 234.306 0 0 0 0 0 0 -1019.24 0 0 0 0 0 801.34 0 442.747 0 0 0 0 -105.365 0 0 1093.1 0 0 0 604.648 0 2123.25 0 
0 0 0 0 0 0 0 -1755.35 1764.66 0 -1774.27 0 0 0 92.7 -606.479 0 0 0 -585.116 0 0 0 0 0 0.02 0 -411.771 0 0 0 0 0 0 0 796.609 0 2340.39 0 0 0 0 2430.11 0 -2300.1 0 0 0 0 -976.058 0 -621.891 -2176.2 232.017 0 0 0 0 0 1506.78 0 -654.088 0 2199.7 0 0 0 2249.29 2059.01 
0 2354.12 140.919 0 -2433.93 0 0 1599.7 0 0 1535.77 0 0 -1769.84 -670.11 0 -2253.41 0 0 0 0 0 0 0 0 0 0.09 0 0 -1482.82 0 593.356 0 1772.59 0 0 0 0 0 2295.07 1604.74 -32.7311 -380.184 0 0 1847.36 0 1341.36 0 0 0 -1665.17 0 0 0 0 2482.6 1816.39 -1998.73 1285.36 0 1823.71 2137.75 -426.42 0 0 0 0 0 
0 739.998 0 -418.638 0 0 0 0 2370.6 0 0 187.613 1263.85 1508.61 0 0 594.119 0 1561.25 803.018 0 0 -1009.93 0 0 -834.605 0 0 0 0 -256.584 1531.65 -2235.71 0 0 -707.038 0 0 0 0 0 0 1172.75 404.294 0 0 35.3252 0 1184.96 0 0 0 -2075.03 0 0 0 0 0 0 1097.98 0 0 0 0 1084.25 0 0 0 0 
1837.9 0 0 0 1401.03 -580.538 0 0 0 -2462.46 -1910.69 2494.66 1281.4 1699.65 0 0 0 0 0 -41.8867 0 1299.86 0 1817.91 -1230.74 0 0 0 0.06 -1232.26 0 2083.12 0 2117.15 2021.01 0 0 0 0 0 0 0 -188.07 0 0 0 0 0 0 -34.4096 -2115.16 0 0 0 -532.777 -110.401 0 0 0 0 1821.42 0 0 0 0 0 0 0 0 
0 2241.81 2265.01 0 0 0 0 -865.886 1319.7 0 0 0 0 0 952.559 0 0 0 -1876.96 0 0 0 0 0 -1147.27 0 631.657 0 -1345.64 0.05 0 0 -2292.47 -1966.54 -1331.9 0 0 0 718.177 2100.51 0 0 0 -964.003 0 0 0 0 0 1865.67 1359.68 0 0 0 0 0 0 0 0 0 2323.91 1453.83 1966.54 0 0 -1141.32 1586.28 0 805.918 
-807.138 0 0 0 0 352.26 1031.14 0 -1388.36 -937.758 -2361.29 0 2119.74 0 0 782.418 0 0 -248.802 0 1259.58 0 0 1418.88 0 0 0 2232.05 0 0 0.03 0 852.611 0 1187.4 0 0 0 -1585.97 0 0 0 1880.32 0 0 0 0 0 0 0 0 0 0 -950.27 351.955 0 0 0 385.372 -2031.08 1197.62 -1585.82 0 0 0 0 490.356 2339.17 0 
0 0 0 0 0 -1972.64 0 0 0 306.33 25.2541 0 0 0 0 170.064 0 -2374.42 0 0 0 0 0 0 0 0 -721.992 -366.146 1908.55 0 0 0.04 0 1038.77 0 0 0 0 1948.23 0 0 0 0 0 1968.37 0 0 0 0 -575.503 0 1085.31 -1029.01 0 0 910.291 1872.54 0 0 0 0 0 0 -704.596 1367.61 0 0 0 925.855 
0 0 0 0 0 0 0 0 0 0 1667 0 2279.35 0 0 -149.77 0 0 0 0 0 0 0 0 -420.621 0 0 -222.709 0 1530.88 -1894.82 0 0.08 0 1832.41 0 438.017 535.371 0 0 2366.63 -1490.91 0 0 -1511.05 152.516 0 0 0 -214.164 0 0 0 0 0 0 0 0 0 -318.995 0 -1767.4 -627.537 0 0 0 0 0 -60.3504 
0 0 0 0 2328.33 0 0 1008.56 0 0 0 -1742.07 0 0 0 -1606.57 0 -2003.46 0 0 2308.65 0 0 0 85.2229 0 1559.88 0 -1419.95 2028.18 0 -1836.38 0 0.01 0 1461 2218.62 0 0 0 170.37 538.423 2068.16 -99.5666 0 -1245.08 29.9844 -895.642 0 1898.33 649.663 1306.57 -61.7237 0 0 1902.91 0 2107.38 0 0 0 545.137 0 -1959.21 1687.6 -916.395 0 61.8763 0 
0 -928.602 -1293.15 0 1626.41 0 0 0 0 0 1073.26 0 0 0 0 0 -368.282 0 0 0 0 2478.48 850.627 0 0 0 0 0 -402.921 -2009.57 1061.05 0 -2071.98 0 0.04 1607.33 0 0 0 0 0 0 0 -1724.68 2078.69 1109.73 0 0 0 0 0 0 0 0 1640.29 0 0 0 0 0 0 -1988.97 0 0 0 0 1109.12 0 0 
0 -1672.64 0 0 0 -186.85 -681.707 -518.738 0 0 971.175 1838.05 0 0 0 642.796 0 2436.22 2287.44 0 0 0 0 0 -797.067 528.657 0 1977.68 0 0 0 0 0 544.679 1123 0.05 0 0 -891.827 0 0 -174.337 0 0 815.073 0 -1676.31 0 0 237.205 0 143.208 0 0 0 -119.404 942.183 0 -2072.59 0 -1604.59 0 0 0 150.227 638.523 0 990.86 0 
0 0 1400.72 0 178.152 0 0 27.8481 0 0 0 0 0 0 0 0 0 0 0 0 106.586 0 0 0 2031.54 0 0 0 0 0 0 0 2198.02 -1978.13 0 0 0.09 0 0 0 0 0 0 2223.2 723.212 0 1706.82 0 2461.7 -2097.46 1096.61 0 0 0 0 0 0 1697.21 2304.83 2240.9 807.596 0 0 0 0 0 -709.021 0 0 
-421.384 0 294.122 -122.303 0 0 0 0 0 1939.07 -1142.99 0 0 0 0 0 0 -1108.81 0 0 0 0 0 -2385.25 0 252.007 0 0 0 0 0 0 -61.1133 0 0 0 0 0 0 0 0 0 0 229.423 508.972 0 0 0 0 -145.039 0 0 0 0 0 940.199 0 0 -175.253 1598.48 1070.67 0 0 -506.378 0 967.513 0 0 101.245 
0 0 0 1502.96 -1358 0 0 0 0 0 1676.76 0 0 0 0 0 0 0 0 1718.42 0 1956.77 0 0 1949.6 0 0 0 0 -1720.56 -431.608 -607.089 0 0 0 -1067.31 0 0 0.08 0 0 0 0 0 0 0 0 0 0 0 0 0 0 0 0 -393.155 0 0 0 506.073 0 0 0 0 0 0 650.121 -2294.46 0 
0 0 0 136.036 0 -1001.85 0 0 0 0 2143.39 0 -1659.83 2133.32 0 2176.5 0 0 497.528 -2286.83 0 0 0 1548.28 0 0 2345.42 0 0 1558.96 0 0 0 0 0 0 0 0 0 0.06 1123 0 309.381 255.364 2006.36 0 432.218 0 0 0 0 994.827 137.257 1444.82 0 0 0 2314.45 0 1606.27 1762.37 -763.802 2418.52 0 0 -1876.96 0 0 -1465.27 
0 0 -2183.83 1892.22 -533.845 0 0 -674.841 0 0 0 -486.236 0 0 0 0 0 0 0 1629.92 0 0 884.35 0 0 0 960.799 0 0 0 0 0 1202.05 308.924 0 0 0 0 0 1319.24 0.08 0 -1801.43 0 0 0 0 0 0 658.208 0 2346.8 -860.851 0 1814.4 0 0 0 2462.46 0 0 0 0 0 0 0 -1294.82 0 0 
0 0 0 0 0 0 152.211 1905.5 663.396 0 0 0 0 0 0 0 0 -14.1148 0 0 0 0 965.835 1625.64 0 0 2148.73 0 0 0 0 0 -260.857 2174.52 0 40.5133 0 0 0 0 0 0.02 -551.088 -1238.52 0 0 0 0 0 0 -813.852 -193.258 0 -385.067 0 0 0 671.636 0 279.321 0 0 0 -482.421 0 0 0 1084.09 0 
0 -786.538 470.519 0 0 2401.58 0 -2154.99 0 1612.06 0 0 965.529 0 0 0 0 0 0 0 0 0 1456.72 0 0 -101.093 775.704 -2433.93 -2213.58 0 1724.22 0 0 41.5815 0 0 0 0 0 -84.1548 1528.75 466.857 0 -408.414 0 0 0 0 0 -1623.81 1971.11 0 0 1615.88 0 0 2368.77 0 0 620.518 0 2490.08 0 0 -37.4615 0 0 0 0 
0 695.135 0 0 0 -1234.7 1303.98 -1075.4 1712.93 0 0 -1546.45 -1002 0 0 0 0 0 0 0 0 0 0 2380.67 0 0 0 627.232 0 28.0007 0 0 0 -526.368 1399.2 0 2131.64 -658.666 0 940.199 0 -580.996 -946.455 0.03 1506.93 0 0 -20.3711 0 1059.68 0 0 0 0 0 0 0 0 0 0 0 -436.033 0 0 0 0 400.784 0 1071.12 
0 1071.43 0 0 0 1490.45 -2201.38 0 0 0 0 0 0 0 -1025.19 0 -1580.78 0 0 0 0 0 2362.06 0 0 1785.87 0 0 0 0 0 -1864.3 -7.09555 0 -519.501 603.885 -2048.78 -417.264 0 2087.24 0 0 0 1356.17 0.09 0 0 0 0 0 0 0 0 -574.892 -517.212 0 490.509 0 0 0 0 1226 1636.48 0 0 0 0 0 0 
0 0 0 -213.248 0 -377.895 0 -204.55 0 0 1999.95 0 0 0 486.236 0 0 0 0 0 0 0 -1436.74 -411.924 15.4881 0 1043.35 0 0 0 0 0 1055.86 2035.51 2422.18 0 0 0 0 0 0 0 0 0 0 0 0 0 0 777.23 0 44.3281 0 0 -1800.36 0 -1795.48 0 0 0 0 -224.693 0 2234.64 0 0 0 0 -1672.49 
2453.61 0 0 -1427.12 0 0 0 0 0 0 0 0 0 0 0 0 0 0 -162.13 0 1840.95 0 0 -705.359 0 0 0 -1197.62 0 0 0 0 0 350.276 0 925.398 -551.088 0 0 -637.15 0 0 0 0 0 0 0.04 0 0 0 0 0 0 1329.62 0 0 1665.62 -477.691 470.977 0 0 1373.87 0 0 2288.66 0 0 0 0 
0 0 0 0 0 0 0 0 -93.9207 0 0 0 0 0 2474.67 0 0 0 0 0 0 0 783.181 0 0 0 2023.91 0 0 0 0 0 0 -1936.78 0 0 0 0 0 0 0 0 0 -113.147 0 0 0 0.09 0 0 0 0 1186.64 -2086.02 0 -2225.03 0 0 0 1200.22 596.713 1368.07 0 2136.22 -625.858 0 -14.2674 0 0 
2491 0 0 351.802 -2310.48 -1721.63 -1429.56 0 0 0 1777.17 0 1536.38 -1284.91 0 0 0 511.567 0 0 0 0 0 -849.559 0 0 0 -1276.97 0 0 0 0 0 0 0 0 1020.62 0 0 0 0 0 0 0 0 0 0 0 0.03 0 569.704 0 -892.743 0 1576.2 0 0 0 0 1231.96 0 0 0 2111.5 0 0 0 0 0 
0 0 -1059.68 0 0 1372.49 0 0 0 1941.51 -850.169 0 0 -1395.69 0 1896.65 1693.55 0 0 0 -1148.79 821.329 0 0 0 -893.963 0 0 189.291 204.703 0 -1977.83 699.866 1434.6 0 659.124 -2355.34 1684.24 0 0 -943.251 0 -2092.43 723.518 0 -1748.33 0 0 0 0.01 691.321 0 0 2439.42 0 0 0 0 162.282 0 0 1949.9 0 0 1886.88 0 0 0 0 
859.172 0 1815.16 0 1787.24 0 461.211 0 0 0 -1889.32 -1582.16 -400.327 0 2245.78 0 734.809 0 0 -1041.37 0 0 0 0 0 0 0 0 421.232 -891.675 0 0 0 1569.49 0 0 1857.43 0 0 0 0 -600.223 -607.852 0 0 0 0 0 289.697 -1691.11 0.01 0 0 0 0 1516.54 0 0 0 0 0 93.9207 0 0 -2114.09 -639.439 1083.33 0 -1825.69 
0 0 0 0 0 802.713 0 0 0 0 0 0 0 0 -87.054 0 0 2043.75 0 0 2088.61 0 0 0 1786.48 1683.78 141.987 0 0 0 0 943.098 0 530.641 0 -474.639 0 0 0 -799.203 1728.19 -1057.08 0 0 0 -2013.99 0 0 0 0 0 0.02 -1930.83 0 -1591.92 -1298.64 0 0 0 0 0 0 1457.64 0 0 0 -1095.23 1359.68 0 
0 -2316.43 2470.09 0 1847.82 0 0 0 0 0 2244.25 0 0 0 0 -2045.88 0 -1740.85 -1002.3 0 0 0 0 0 0 126.881 0 365.383 0 0 0 645.695 0 -1278.34 0 0 0 0 0 21.4393 295.343 0 0 0 0 0 0 -954.237 -1194.27 0 0 1013.29 0.02 0 0 0 1272.39 0 1537.14 0 2211.45 0 0 0 0 0 0 -768.99 0 
0 1655.55 0 0 1481.6 0 729.164 0 561.617 0 0 0 0 0 -746.101 0 0 400.174 0 -98.4985 0 0 2461.55 139.393 1160.39 -1952.35 0 0 0 0 1024.74 0 0 0 0 0 0 0 0 1978.29 0 892.285 -262.23 0 718.482 0 1771.68 -2483.67 0 564.974 0 0 0 0.05 0 -2200 0 0 0 0 0 -905.103 0 0 0 0 134.816 0 0 
0 203.33 0 2421.87 0 0 0 930.433 1397.52 0 0 0 0 0 0 0 -2075.95 -1928.69 1634.34 0 0 0 0 0 0 0 0 0 1186.79 0 54.5518 0 0 0 207.297 0 0 0 0 0 -1464.96 0 0 0 1330.07 1414 0 0 631.504 0 0 113.605 0 0 0.08 -1922.44 0 0 0 1464.81 0 0 0 0 -770.669 0 1104.08 0 0 
0 0 0 0 0 1212.88 0 0 0 0 0 0 0 0 0 626.469 0 0 -236.747 0 0 0 1520.2 -1580.78 0 0 0 0 -1052.35 0 0 1135.52 0 944.624 0 945.235 0 -2385.4 2209.01 0 0 0 0 0 0 0 0 2263.94 0 0 2411.34 1377.53 0 1236.69 360.958 0.09 0 0 0 654.088 0 0 0 0 -2144.15 0 -933.943 0 0 
0 0 0 0 0 0 0 0 0 0 1653.26 0 0 430.692 1991.87 0 0 0 0 1538.36 1394.16 0 0 0 0 0 1867.05 0 0 0 0 -648.595 0 0 0 1214.26 0 0 0 0 0 0 -1841.56 0 1109.27 1753.52 1307.34 0 0 0 0 0 -1791.51 0 0 0 0.08 0 -1134.3 0 0 -1442.53 2366.94 0 0 341.578 0 0 0 
0 0 0 1092.33 0 0 875.805 0 0 0 0 0 0 -268.181 -1396.3 293.207 0 0 1991.26 0 -978.5 0 0 0 0 0 1920.15 0 0 0 0 0 0 -1972.03 0 0 2261.5 0 0 2429.96 0 -660.039 0 0 0 0 1879.25 0 0 0 0 0 0 0 0 0 0 0.04 0 -1631.75 0 0 0 0 0 0 43.8704 -1177.48 -2085.41 
0 0 0 0 0 0 830.332 0 -1029.16 -1060.29 0 0 1287.8 0 -12.2837 2296.29 0 0 0 954.237 0 0 0 0 552.614 0 -1604.13 0 0 0 -2182.15 0 0 0 0 93.7681 -768.532 2336.12 0 0 1801.28 0 0 0 0 0 -1768.78 0 0 1618.93 0 0 1476.87 0 0 0 -2467.04 0 0.03 0 0 -61.7237 0 0 0 1730.32 0 0 0 
0 0 0 0 0 0 0 0 0 0 -826.823 0 -1060.9 0 2475.74 0 0 0 0 0 0 0 2384.18 0 0 1211.51 863.445 1291.77 0 0 549.257 0 1854.53 0 0 0 1290.25 217.521 1118.58 1968.37 0 1557.13 -228.355 0 0 0 0 989.029 2399.9 0 0 0 0 0 -357.448 1995.99 0 1193.5 0 0.05 0 0 0 496.155 0 0 0 0 0 
0 0 0 0 459.38 0 0 0 0 0 0 0 0 0 0 0 0 0 0 0 2141.71 0 0 722.144 0 0 0 0 146.26 2032.76 1609.32 0 0 0 0 2317.65 -502.564 -1784.19 0 -559.786 0 0 0 0 0 0 0 -2176.05 0 0 0 0 -1793.5 0 0 0 0 0 0 0 0.02 0 0 0 0 0 0 0 0 
0 0 0 0 -318.842 0 0 0 0 0 0 -615.024 0 -742.134 0 2149.19 0 0 0 0 0 0 0 0 1412.17 216.147 1493.19 0 0 -2263.94 -1237.14 0 -1837.6 2298.43 -1427.27 0 0 0 0 1362.58 0 0 -1212.12 2442.93 -1589.48 1789.53 1647.01 2193.59 0 -1239.59 2245.32 0 0 -665.838 0 0 2256 0 1299.55 0 0 0.05 0 1894.51 0 1396.3 1853.47 0 0 
0 0 0 0 1296.66 1442.53 0 0 0 -1605.04 0 0 0 0 0 0 0 331.812 0 0 -166.86 0 0 0 0 0 1730.93 0 0 2021.77 0 0 -1168.48 0 0 0 0 0 0 374.996 0 0 0 0 -2224.42 0 0 0 0 0 0 2299.04 0 0 0 0 1062.58 0 0 0 0 0 0.08 0 0 0 0 0 -1910.54 
-519.349 0 -2175.13 -209.128 0 0 5.41704 0 0 0 0 0 0 0 -911.817 -682.318 0 0 2256.31 0 2256.31 0 0 1138.72 0 2418.06 -840.861 0 0 0 0 1231.04 0 2374.26 0 0 0 2464.9 0 0 0 -1267.36 0 0 0 1607.03 0 1363.64 -1376.61 0 0 0 0 0 0 0 0 0 0 248.497 0 2001.48 0 0.06 0 983.383 0 2095.02 0 
0 0 -1030.23 0 0 0 0 0 0 0 2462.92 0 0 0 0 0 0 0 0 0 -703.833 0 2017.81 0 0 0 0 -353.023 0 0 0 -2465.06 0 2058.7 0 2152.55 0 0 0 0 0 0 2147.66 0 0 0 -667.669 -123.829 0 -1203.12 338.527 0 0 0 42.8022 -1032.82 0 0 0 0 0 0 0 0 0.03 37.6141 2417.45 -1122.55 0 
0 1315.42 1690.65 -115.589 0 0 0 0 0 0 0 1847.97 0 0 770.516 -223.93 0 -605.106 0 2146.75 0 2417.6 0 1356.01 2305.6 0 0 0 0 -165.639 0 0 0 -1187.09 0 -1084.4 0 1465.73 0 66.1489 0 0 0 0 0 0 0 0 0 0 1325.65 0 0 0 0 0 2450.41 0 -1149.1 0 0 -59.8926 0 -1513.64 -1186.79 0.06 0 0 0 
0 0 0 0 1618.47 470.977 0 0 -443.663 0 0 0 0 1013.75 0 0 0 0 0 424.589 -1988.36 1249.2 0 0 0 0 0 0 0 -742.439 27.0852 0 0 0 -2410.12 0 2414.24 0 184.103 0 -1952.5 0 0 -1225.24 0 0 0 1615.27 0 0 1430.63 498.749 0 842.082 -32.2733 -1507.08 0 162.587 0 0 0 1387.6 0 0 -1782.82 0 0.01 -203.33 2155.9 
0 -1964.86 0 0 0 2322.08 0 0 0 0 1193.81 0 0 0 0 -2476.65 0 1602.45 496.002 0 0 0 -1509.37 278.558 -1647.47 -242.851 0 0 0 0 562.838 0 0 1898.79 0 332.118 0 0 -152.974 0 0 -1763.44 0 0 0 0 0 0 0 0 0 2024.22 432.981 0 0 0 0 -363.247 0 0 0 0 0 -158.773 193.869 0 2373.96 0 0 
0 0 0 0 0 0 0 0 -1280.33 0 0 654.088 0 0 0 0 1275.6 -396.512 0 0 0 0 0 0 0 -5.41704 0 0 0 2301.32 0 -138.478 -30.2896 0 0 0 0 875.652 0 -724.586 0 0 0 1025.19 0 821.787 0 0 0 0 237.205 0 0 0 0 0 0 -353.481 0 0 0 0 -841.777 0 0 0 2162.77 0 0.04 
