*Vertices 50
*Matrix 
0.08 1054.64 -572.451 1634.19 0 2059.31 0 0 0 0 -1238.67 -779.366 0 0 0 156.484 2214.19 1737.95 0 0 0 0 0 0 0 -72.8629 -1957.38 0 -172.353 0 0 0 419.095 0 0 0 0 0 0 0 -595.645 0 0 0 0 0 0 -179.067 0 0 
578.249 0.06 0 0 1566.74 -1047.62 2396.85 0 1695.53 0 -1346.4 0 0 0 453.887 0 0 0 0 0 0 0 0 -2054.73 749.153 0 0 0 0 0 0 0 0 0 1735.66 0 -1399.5 0 0 821.482 0 0 0 0 750.069 2368.77 0 0 0 0 
579.928 0 0.04 0 -903.577 1403.62 1753.36 1415.98 0 0 594.577 -1115.22 575.655 0 0 0 -746.406 0 0 0 0 0 0 0 -534.303 912.427 0 0 0 2159.57 0 0 0 0 0 0 0 0 906.476 0 0 0 0 -1079.06 0 -1990.65 0 0 0 0 
20.5237 0 0 0.08 0 0 0 -1034.5 0 0 0 0 0 0 0 0 0 0 0 1102.71 0 0 1414.91 0 0 1145.28 0 -1241.87 0 1357.23 0 0 -880.84 0 0 0 0 566.652 1507.23 1512.57 0 0 929.212 0 0 0 0 0 0 0 
0 1989.27 468.383 0 0 0 0 0 0 629.521 0 0 0 0 1590.4 0 0 0 0 0 0 0 0 0 0 0 1611.91 -1298.03 0 0 0 0 2143.54 0 0 1778.85 0 0 0 0 0 0 -1308.71 0 -207.755 0 0 -861.919 0 1720.71 
815.989 570.467 1935.26 0 0 0.03 1758.4 -1559.11 0 0 0 0 0 0 1458.86 0 -2006.97 0 1132.01 -50.2792 -487.304 0 0 0 0 0 0 340.358 0 0 1716.28 0 0 2212.52 0 0 0 2227.77 0 2167.04 903.424 0 0 0 2066.94 0 0 0 0 0 
0 2180.01 1051.74 0 0 1878.34 0.08 744.118 0 2410.28 0 0 0 2209.77 1986.07 0 0 0 0 0 -906.018 0 0 0 0 0 0 0 0 -1642.12 0 -1668.37 0 0 0 0 0 0 0 0 0 713.141 0 -2334.74 0 0 0 0 0 0 
0 0 109.485 1925.95 0 2368.01 1988.51 0.04 0 0 0 0 1811.81 0 0 609.989 0 0 0 0 -1112.63 0 0 -729.774 2175.89 2326.35 0 0 0 2107.23 0 0 0 712.989 -540.712 0 0 1312.07 0 -2467.65 0 -2165.82 196.463 0 2358.85 0 0 0 0 0 
0 769.143 0 0 0 0 0 0 0.09 0 0 682.47 0 0 -1003.68 0 0 0 0 0 0 0 0 1964.86 0 0 0 0 0 1057.85 0 0 2335.35 0 0 0 0 0 0 0 0 0 0 -464.873 0 0 -340.358 0 0 0 
0 0 0 0 2112.57 0 -1991.1 0 0 0.04 0 0 0 0 0 0 0 0 0 0 0 0 0 0 0 0 0 0 -44.9385 0 0 -1034.35 0 -1201.59 0 0 1777.93 0 0 0 0 0 0 1969.28 0 0 0 0 0 0 
-1904.43 989.029 -47.6852 0 0 0 0 0 0 0 0.07 0 0 0 -1899.85 0 0 0 0 0 0 2051.07 621.281 0 0 0 0 -68.7429 2282.4 835.673 2227.62 1267.2 0 611.667 0 0 0 1561.25 0 0 0 -554.75 0 0 0 0 0 0 0 0 
-102.466 0 949.049 0 0 0 0 0 842.54 0 0 0.09 0 1542.63 0 0 -896.405 0 0 0 0 -1954.48 0 0 2348.63 1854.23 0 0 517.212 0 0 0 0 0 0 0 0 0 -2064.81 0 0 -1112.02 1211.2 0 0 810.19 0 1107.44 373.318 0 
0 0 -281.152 0 0 0 0 1446.96 0 0 0 0 0.04 0 0 -1825.54 0 0 1611.61 0 0 0 0 2320.25 0 0 0 1887.04 -7.70592 0 -1984.24 0 0 576.724 0 0 915.479 0 0 1952.35 0 -582.98 -691.015 1798.99 0 0 0 0 0 0 
0 0 0 0 0 0 2355.65 0 0 0 0 -1153.83 0 0 1447.26 0 -296.106 0 0 1410.79 0 0 310.907 0 0 0 0 0 172.201 0 0 0 0 -835.521 0 0 -2175.28 0 0 0 0 0 0 0 0 0 0 0 0 0 
0 1158.25 0 0 28.7637 1680.73 1097.83 0 -815.073 0 -1092.49 0 0 630.436 0.03 1874.98 -1251.64 1249.35 0 0 0 0 -1738.87 0 0 0 0 0 0 0 0 0 1021.07 1956.77 1231.35 0 0 0 0 0 -2193.9 232.017 0 1036.79 0 0 0 0 0 0 
-197.226 0 0 0 0 0 0 457.549 0 0 0 0 489.288 0 -147.938 0 -634.404 0 0 0 597.629 0 0 0 0 0 2343.13 2073.81 2066.18 -619.907 674.841 0 0 -478.912 0 0 -2387.39 0 0 0 1270.1 2288.96 0 0 0 1975.54 711.768 0 -436.033 0 
-1452.6 0 34.8674 0 0 -1604.43 0 0 0 0 0 1658.45 0 1795.33 1094.62 1103.17 0.01 -2072.74 0 0 0 0 0 0 0 0 0 0 0 -76.5252 1164.66 0 0 0 0 0 0 0 624.027 0 1096.91 0 0 1688.21 0 0 -1746.35 0 0 0 
719.092 0 0 0 0 0 0 0 0 0 0 0 0 0 -162.74 0 2036.42 0.02 586.947 0 551.241 0 0 0 0 1703.92 0 0 0 0 0 0 0 0 0 0 0 -1712.47 52.5681 0 0 0 0 0 0 1305.2 0 0 0 -1004.75 
0 0 0 0 0 1522.8 0 0 0 0 0 0 2239.68 0 0 0 0 -21.5918 0.08 0 0 1161 0 0 0 0 0 0 -1254.54 0 0 -977.737 0 -1023.97 0 0 -1785.56 0 0 0 0 0 0 -1822.18 0 0 2390.9 0 0 0 
0 0 0 -1678.9 0 2432.71 0 0 0 0 0 0 0 362.178 0 0 0 0 0 0.05 1244.77 -2455.44 0 0 1482.67 0 -202.567 0 0 -1410.18 -149.312 1267.51 0 0 0 284.814 0 0 0 0 0 0 0 0 0 0 233.39 0 1035.11 0 
0 0 0 0 0 491.882 409.024 476.623 0 0 0 0 0 0 0 -164.876 0 -446.562 0 372.555 0.04 0 0 1443.3 0 1259.73 0 0 0 0 0 -1490.3 0 0 0 0 237.053 1676.61 0 0 0 0 -840.403 1928.69 0 0 1325.8 0 0 0 
0 0 0 0 0 0 0 0 0 0 -1548.89 481.353 0 0 0 0 0 0 -1838.51 1922.9 0 0.09 -191.275 -269.097 1170.16 0 0 0 -496.612 0 0 0 0 2295.53 0 0 0 0 0 0 0 0 1981.95 0 0 -677.129 0 0 -1045.79 -1640.75 
0 0 0 110.706 0 0 0 0 0 0 -1648.38 0 0 1697.82 -376.217 0 0 0 0 0 0 49.2111 0.06 0 -150.227 -1269.65 0 -1979.66 0 2266.53 0 1271.32 0 1819.44 0 0 0 0 0 0 0 0 534.15 0 0 2153.31 0 1670.81 0 0 
0 1172.75 0 0 0 0 0 751.289 1316.64 0 0 0 -1956.47 0 0 0 0 0 0 0 1136.89 768.99 0 0.07 0 0 0 -452.818 1553.16 -1498.84 0 0 0 0 761.208 0 0 0 1823.71 -344.325 0 0 -226.981 35.6304 0 0 -1745.12 -935.316 0 0 
0 -664.617 -847.728 0 0 0 0 519.654 0 0 0 2295.83 0 0 0 0 0 0 0 2253.56 0 1281.55 1042.44 0 0.05 0 0 0 0 0 0 0 0 0 2244.41 0 0 0 0 -290.613 1955.7 1954.79 -1335.41 1400.27 -2113.79 -554.14 0 2494.66 0 0 
-1401.33 0 534.303 1820.2 0 0 0 2227.16 0 0 0 2339.63 0 0 0 0 0 713.141 0 0 -1400.11 0 248.955 0 0 0.01 0 2416.53 0 0 0 0 0 0 0 0 2185.2 0 0 0 0 0 0 96.6674 0 741.371 0 -2113.64 0 0 
-1119.34 0 0 0 -2270.96 0 0 0 0 0 0 0 0 0 0 968.123 0 0 0 2492.98 0 0 0 0 0 0 0.04 -817.82 0 1166.95 0 0 0 0 0 0 0 0 176.931 -1921.67 -913.495 979.415 1753.36 -2204.12 2488.25 0 -248.192 0 0 0 
0 0 0 -944.166 -1440.4 -1784.95 0 0 0 0 2007.58 0 1129.57 0 0 -1930.98 0 0 0 0 0 0 -1910.54 -1860.79 0 1212.42 317.316 0.06 0 0 2456.82 0 875.042 0 0 0 0 0 0 0 0 2377.47 0 0 0 0 1618.47 0 0 1772.59 
1452.3 0 0 0 0 0 0 0 0 1795.33 2191.31 -1954.63 2209.92 2290.64 0 -240.257 0 0 -671.178 0 0 735.267 0 -2289.12 0 0 0 0 0.08 0 0 0 0 0 0 0 0 0 0 0 0 0 0 0 1278.95 0 0 0 0 0 
0 0 2194.97 327.387 0 0 2143.39 2188.1 -1682.71 0 -288.324 0 0 0 0 1092.03 -1779.92 0 0 2157.73 0 0 -1834.24 853.069 0 0 -689.947 0 0 0.01 0 -2365.26 0 0 0 0 0 0 1484.8 0 645.085 0 0 0 0 1833.32 0 0 0 0 
0 0 0 0 0 -1304.74 0 0 0 0 -209.891 0 216.91 0 0 538.27 2040.09 0 0 253.838 0 0 0 0 0 0 0 2380.21 0 0 0.07 0 0 359.89 0 0 0 0 -79.4244 0 0 596.561 0 1519.29 -1823.4 0 2157.12 0 0 0 
0 0 0 0 0 0 2157.58 0 0 1768.01 -21.897 0 0 0 0 0 0 0 2480.01 1703.92 721.381 0 1613.9 0 0 0 0 0 0 -2105.55 0 0.08 0 0 0 0 0 -85.2229 0 0 0 0 0 0 -1024.74 2483.06 1880.78 0 0 0 
719.092 0 0 826.518 1532.87 0 0 0 -176.321 0 0 0 0 0 38.8348 0 0 0 0 0 0 0 0 0 0 0 0 -974.837 0 0 0 0 0.06 -1385.16 1914.2 0 0 -751.442 2326.81 2279.5 0 2256.92 0 0 0 -187.613 0 0 0 0 
0 0 0 0 0 2027.27 0 -2185.2 0 37.7667 174.032 0 2168.57 1991.87 169.301 -12.7415 0 0 -844.066 0 0 -487.457 2400.51 0 0 0 0 0 0 0 -1061.97 0 968.276 0.02 0 2213.13 0 1210.75 1089.89 1856.52 0 0 0 0 -931.349 0 0 0 -2373.96 0 
0 2373.35 0 0 0 0 0 1692.48 0 0 0 0 0 0 1776.71 0 0 0 0 0 0 0 0 -1095.54 -1771.37 0 0 0 0 0 0 0 -451.445 0 0.01 0 0 0 0 2189.93 0 2135.3 0 0 1706.52 0 0 0 0 0 
0 0 0 0 803.934 0 0 0 0 0 0 0 0 0 0 0 0 0 0 265.893 0 0 0 0 0 0 0 0 0 0 0 0 0 1927.63 0 0.02 1191.06 1062.73 0 0 0 0 0 0 0 1904.58 -645.543 0 0 -745.338 
0 -517.212 0 0 0 0 0 0 0 1921.67 0 0 -7.70592 1809.98 0 -794.778 0 0 1232.41 0 2486.27 0 0 0 0 488.22 0 0 0 0 0 0 0 0 0 -1975.08 0.03 0 -802.713 0 0 0 0 0 0 0 0 0 0 0 
0 0 0 547.121 0 2433.32 0 1619.39 0 0 1474.43 0 0 0 0 0 0 578.249 0 0 -452.513 0 0 0 0 0 0 0 0 0 0 2463.53 -2398.37 1656.47 0 -1212.27 0 0.03 0 -1560.95 0 0 0 0 0 0 0 0 0 0 
0 0 -2280.88 889.538 0 0 0 0 0 0 0 -172.201 0 0 0 0 1304.28 330.134 0 0 0 0 0 628.147 0 0 697.729 0 0 2203.21 2251.12 0 874.889 499.359 0 0 -1904.58 0 0.04 320.215 -2354.12 0 0 0 0 0 2254.17 0 0 0 
0 1816.54 0 -919.752 0 1845.38 0 905.56 0 0 0 0 -1713.84 0 0 0 0 0 0 0 0 0 0 1128.04 -1170.16 0 -82.6289 0 0 0 0 0 -415.891 1704.69 109.027 0 0 -2227.93 2332.76 0.06 0 0 2171.47 0 0 0 -539.033 0 0 0 
-1498.08 0 0 0 0 -2123.25 0 0 0 0 0 0 0 0 293.97 1267.36 -1820.51 0 0 0 0 0 0 0 344.935 0 954.237 0 0 2291.71 0 0 0 0 0 0 0 0 1312.68 0 0 -703.375 0 0 2004.68 2423.55 0 704.749 0 0 
0 0 0 0 0 0 -467.772 662.633 0 0 509.583 -1794.11 -518.586 0 -2391.81 1001.39 0 0 0 0 0 0 0 0 -677.587 0 1182.52 -633.335 0 0 -1368.83 0 1920.3 0 1783.43 0 0 0 0 0 -1922.28 0.05 2091.51 0 0 0 2493.74 0 0 -585.421 
0 0 0 868.786 2053.51 0 0 -889.538 0 0 0 1888.56 1550.11 0 0 0 0 0 0 0 1359.68 454.802 -1934.34 1322.6 85.8333 0 -733.284 0 0 0 0 0 0 0 0 0 0 0 0 863.598 0 -1859.57 0.09 0 0 0 -286.95 -1305.2 0 0 
0 0 1892.99 0 0 0 -1226.46 0 -827.433 -1659.83 0 0 2227.32 0 -1165.12 0 1105 0 -188.223 0 774.331 0 0 -1032.67 1801.89 279.626 1731.09 0 0 0 -1239.59 0 0 0 0 0 0 0 0 0 0 0 0 0.05 0 0 0 0 0 0 
0 1503.72 0 0 2167.2 -498.596 0 -1841.87 0 0 0 0 0 0 0 0 0 0 0 0 0 0 0 0 1218.83 0 726.875 0 -1339.99 0 1637.85 -396.664 0 -349.208 672.246 0 0 0 0 0 -787.149 0 0 0 0.01 0 0 0 0 -1137.04 
0 -1105.61 2035.51 0 0 0 0 0 0 0 0 876.415 0 0 0 1911.6 0 -1106.68 0 0 0 -1187.7 -785.012 0 -1276.06 262.535 0 0 0 -101.245 0 1339.23 1387.91 0 0 276.879 0 0 0 0 1754.59 0 0 0 0 0.06 0 0 0 0 
0 0 0 0 0 0 0 0 2100.97 0 0 0 0 0 0 -1592.84 1519.44 0 2072.89 522.706 461.058 0 0 -1522.03 0 0 322.504 -1617.71 0 0 1599.09 -490.661 0 0 0 -1722.39 0 0 -76.22 964.003 0 1796.55 2369.08 0 0 0 0.05 0 0 0 
725.959 0 0 0 35.6304 0 0 0 0 0 0 2475.74 0 0 0 0 0 0 0 0 0 0 -191.885 2104.94 2407.68 1786.17 0 0 0 0 0 0 0 0 0 0 0 0 0 0 866.344 0 925.703 0 0 0 0 0.07 0 0 
0 0 0 0 0 0 0 0 0 0 0 2075.18 0 0 0 -1688.97 0 0 0 -1671.88 0 1699.65 0 0 0 0 0 0 0 0 0 0 0 2058.7 0 0 0 0 0 0 0 0 0 0 0 0 0 0 0.09 0 
0 0 0 0 2232.81 0 0 0 0 0 0 0 0 0 0 0 0 -1988.81 0 0 0 1053.42 0 0 0 0 0 1110.03 0 0 0 0 0 0 0 1162.83 0 0 0 0 0 -1710.33 0 0 -1585.51 0 0 0 0 0.09 
