*Vertices 49
*Matrix 
0.02 1141.01 0 0 2103.87 0 0 0 0 0 0 0 0 0 -2265.77 0 0 0 0 0 0 1179.31 0 0 0 0 0 -556.734 0 -450.072 0 0 0 0 0 0 0 0 777.535 0 0 0 0 0 0 0 0 0 487.457 
882.977 0.07 0 0 -1971.11 0 1112.17 0 0 1589.02 -1141.32 0 -2075.18 0 0 0 0 0 2104.94 -988.266 0 -561.769 1803.57 0 0 0 0 0 0 0 0 1589.94 0 0 -137.257 0 0 0 0 0 0 0 0 0 0 0 0 0 0 
0 0 0.06 0 0 -204.398 -216.3 0 0 0 0 0 1204.03 0 0 0 503.479 0 0 0 0 0 0 -691.778 -1634.8 362.331 2039.32 965.682 1459.01 0 0 0 0 0 0 0 0 984.603 0 0 0 0 0 0 0 0 0 0 0 
0 0 0 0.01 -405.362 0 0 0 0 -1283.53 0 0 859.325 0 0 0 0 0 0 0 -2116.99 2059.31 0 0 0 1917.86 1589.02 0 0 0 0 0 494.781 0 -134.51 0 0 0 0 0 0 0 0 0 0 0 0 0 570.62 
-217.826 -541.017 0 1553.93 0.03 0 0 -597.629 0 2122.18 0 0 0 0 0 0 0 -1627.63 2333.37 0 0 0 1094.47 -1626.71 0 0 0 0 0 0 0 0 0 0 0 0 0 136.647 0 -3.58592 0 0 0 0 0 0 0 0 447.783 
0 0 504.242 0 0 0.07 0 0 2473.14 2111.96 0 0 0 0 0 0 0 0 850.322 0 -420.164 2189.02 999.863 0 0 -1398.59 0 0 0 0 2432.86 0 0 0 0 0 0 0 0 0 308.466 0 0 0 0 682.775 0 0 0 
0 -537.66 2251.27 0 0 0 0.09 0 0 0 1189.38 0 0 1313.14 0 0 0 0 -1943.95 -445.952 0 0 455.87 0 0 896.557 0 -2112.72 1912.06 0 0 0 0 0 0 0 0 0 0 0 0 0 0 0 0 0 0 0 0 
0 0 0 0 -904.492 0 0 0.07 0 0 0 2280.42 2100.21 423.978 0 1821.57 0 0 0 0 -781.045 0 0 501.801 0 0 1391.87 0 0 0 -2370.3 -1092.03 0 0 0 -1519.75 0 0 0 0 0 0 0 0 0 0 0 -1235.16 0 
0 0 0 0 0 1419.95 0 0 0.01 0 186.85 0 2224.27 -249.413 -2253.26 0 0 0 0 0 0 0 0 2351.37 -1372.8 0 0 1653.57 0 0 0 -2019.03 -1852.09 0 0 0 0 0 0 0 0 0 0 0 0 0 0 -61.5711 0 
0 990.555 0 766.243 9.53703 2078.54 0 0 0 0.04 0 0 0 -1530.43 1475.19 0 0 2406 0 0 0 0 0 0 348.445 0 0 0 0 0 0 0 -1557.13 0 0 0 -165.029 0 0 0 0 2248.53 0 -1245.54 1169.39 0 -1168.02 -304.041 0 
0 1604.59 0 0 0 0 2389.52 0 -294.58 0 0.05 0 0 0 0 0 0 0 0 0 829.264 0 0 0 -1719.95 0 0 0 1312.07 2143.09 0 0 0 0 41.2763 0 0 0 -2335.51 0 2209.46 -679.266 0 0 0 0 0 0 0 
0 0 0 0 0 0 0 1535.46 0 0 0 0 0 0 0 1690.95 2159.11 0 592.593 0 2354.88 -2061.14 0 0 0 616.092 -874.432 0 0 0 -1142.08 -1454.74 1038.62 -413.297 0 0 0 0 0 0 0 0 0 0 0 0 0 0 0 
0 1492.58 1824.02 97.4303 0 0 0 -237.053 -1397.82 0 0 0 0.04 -133.595 0 0 667.821 0 0 0 0 0 -894.421 0 0 0 0 0 0 0 -123.371 1004.59 0 0 0 0 0 0 0 0 0 0 0 0 0 0 0 0 0 
0 0 0 0 0 0 1585.82 435.881 253.38 -1108.2 0 0 2189.02 0.09 0 -1945.63 0 0 375.912 0 0 0 0 0 0 1659.83 0 0 0 1169.7 -794.473 0 0 -241.02 0 0 0 -2482.3 0 0 -875.805 0 0 0 0 0 0 0 0 
-592.288 0 0 0 0 0 0 0 1658.45 -235.984 0 0 0 0 0.04 0 0 0 0 0 1764.81 0 628.91 0 0 2205.04 0 -178.915 -62.9444 0 0 -1418.73 0 0 0 -159.23 -1188.92 0 0 0 0 0 0 0 0 0 0 0 0 
0 0 0 0 0 0 0 610.141 0 0 0 1717.66 0 785.165 0 0.05 0 0 0 0 0 0 0 2166.13 0 0 0 0 0 -1161 0 -1416.44 0 0 0 0 0 -1472.75 0 0 0 0 0 0 1745.58 621.433 0 0 0 
0 0 -997.726 0 0 0 0 0 0 0 0 2285.3 520.875 0 0 0 0.01 0 1177.33 -615.177 0 1898.63 0 271.233 0 -1269.19 2128.13 -1651.59 0 0 0 0 0 0 0 0 0 0 0 0 632.42 0 0 0 0 0 0 0 0 
0 0 0 0 304.193 0 0 0 0 1257.59 0 0 0 0 0 0 0 0.01 2336.27 0 0 0 0 0 0 0 1927.02 0 0 1705.76 0 -590.915 0 0 0 0 0 0 0 0 0 0 0 0 0 0 0 0 0 
0 -806.528 0 0 1695.23 2196.34 451.14 0 0 0 0 1802.65 0 -1840.04 0 0 264.824 -1697.21 0 0 1629.46 0 2197.71 -281.304 0 2461.7 0 0 0 0 0 0 0 0 0 0 0 0 0 0 0 0 0 0 0 0 0 0 0 
0 1982.1 0 0 0 0 -250.938 0 0 0 0 0 0 0 0 0 -2.06 0 0 0 0 -250.633 0 2267.91 0 0 1890.39 0 0 0 0 492.798 0 0 -59.74 0 0 0 0 706.58 0 0 0 0 0 0 0 0 0 
0 0 0 1461 0 1841.56 0 -1090.2 0 0 934.095 613.193 0 0 -973.769 0 0 0 1533.78 0 0.03 -1402.4 0 0 0 479.064 2275.38 0 -93.7681 0 0 0 0 0 0 0 0 0 0 0 0 0 0 0 0 0 0 0 0 
-171.896 1571.63 0 1576.97 0 610.141 0 0 0 0 0 -312.433 0 0 0 0 978.805 0 0 1712.93 831.706 0.05 0 2429.5 0 0 2089.22 2116.69 0 0 1653.57 -2006.67 0 0 0 0 0 0 0 -806.986 0 0 0 0 -273.522 0 0 0 0 
0 1103.32 0 0 1255.91 418.638 194.632 0 0 0 0 0 2162.77 0 -1112.93 0 0 0 2495.57 0 0 0 0.08 0 0 0 0 0 0 0 0 0 2287.9 -112.995 0 0 0 0 0 -46.4644 0 0 0 0 0 0 0 0 0 
0 0 -1233.48 0 -1086.69 0 0 -32.2733 647.221 0 0 0 0 0 0 1855.3 -211.875 0 1661.66 1016.04 0 2247.46 0 0.01 0 0 0 0 -1528.6 0 0 1836.53 -1860.94 0 -394.833 0 2238 0 0 0 0 0 0 0 0 -1352.81 136.341 2159.87 0 
0 0 632.115 0 0 0 0 0 -1990.34 1760.99 927.839 0 0 0 0 0 0 0 0 0 0 0 0 0 0.05 0 0 2354.43 0 2194.81 0 -89.6481 0 0 0 0 0 0 0 0 0 0 2355.95 -682.318 0 0 0 0 0 
0 0 -1446.35 -1341.36 0 468.688 239.799 0 0 0 0 1773.66 0 1371.73 2435 0 454.344 0 1890.85 0 1518.68 0 0 0 0 0.05 0 0 0 0 0 0 -781.808 0 0 0 0 0 0 0 0 0 0 0 -957.747 0 0 0 0 
0 0 -278.558 1117.97 0 0 0 312.281 0 0 0 1878.03 0 0 0 0 104.602 315.485 0 1609.78 684.912 -444.273 0 0 0 0 0.08 -1455.2 0 2285.91 450.53 0 0 0 0 0 0 0 0 0 0 0 0 2179.4 0 0 0 0 0 
350.276 0 780.892 0 0 0 -505.615 0 -2384.18 0 0 0 0 0 -237.51 0 1629 0 0 0 0 437.101 0 0 1291.47 0 1775.49 0.02 0 0 0 0 0 0 0 0 0 0 0 0 0 0 0 0 0 0 0 0 0 
0 0 -764.565 0 0 0 -473.876 0 0 0 1186.64 0 0 0 1716.9 0 0 0 0 0 -104.297 0 0 792.184 0 0 0 0 0.03 0 0 0 1337.4 0 0 0 0 0 1889.17 0 0 0 1008.26 0 0 0 0 0 0 
1541.41 0 0 0 0 0 0 0 0 0 1491.82 0 0 -1966.84 0 1050.22 0 -792.642 0 0 0 0 0 0 2136.98 0 1721.78 0 0 0.02 0 0 0 2388.45 0 0 0 0 0 -1379.82 0 0 -320.978 0 0 0 0 0 0 
0 0 0 0 0 -1368.07 0 2403.56 0 0 0 2142.02 1791.36 2330.16 0 0 0 0 0 0 0 632.267 0 0 0 0 151.143 0 0 0 0.07 -246.513 -355.007 0 0 0 0 0 0 0 0 0 0 0 0 0 0 0 0 
0 2445.07 0 0 0 0 0 1520.81 208.213 0 0 80.7978 1812.57 0 917.005 81.4081 0 -2064.2 0 -20.2185 0 -510.804 0 -116.504 -389.34 0 0 0 0 0 841.319 0.09 0 0 0 0 0 0 0 0 0 0 0 0 0 0 -1222.04 0 0 
0 0 0 -805.155 0 0 0 0 21.5918 2258.14 0 1720.4 0 0 0 0 0 0 0 0 0 0 -1299.55 1701.18 0 -246.818 0 0 1728.03 0 -567.873 0 0.05 0 0 0 0 0 0 0 0 0 -1726.05 0 0 0 0 0 0 
0 0 0 0 0 0 0 0 0 0 0 -1601.38 0 279.168 0 0 0 0 0 0 0 0 2367.55 0 0 0 0 0 0 912.275 0 0 0 0.03 0 0 0 0 0 0 0 0 0 0 0 0 0 0 0 
0 -517.975 0 389.95 0 0 0 0 0 0 -1751.08 0 0 0 0 0 0 0 0 2447.81 0 0 0 414.518 0 0 0 0 0 0 0 0 0 0 0.04 0 0 0 0 -67.217 1264.15 0 0 0 0 0 0 0 0 
0 0 0 0 0 0 0 1688.36 0 0 0 0 0 0 -1341.82 0 0 0 0 0 0 0 0 0 0 0 0 0 0 0 0 0 0 0 0 0.03 0 0 0 0 0 0 0 0 0 0 0 0 0 
0 0 0 0 0 0 0 0 0 425.962 0 0 0 0 1507.39 0 0 0 0 0 0 0 0 475.402 0 0 0 0 0 0 0 0 0 0 0 0 0.03 0 0 0 0 0 0 -1429.41 -481.964 0 0 0 0 
0 0 -286.34 0 -1476.87 0 0 0 0 0 0 0 0 2047.26 0 1453.83 0 0 0 0 0 0 0 0 0 0 0 0 0 0 0 0 0 0 0 0 0 0.02 0 0 0 0 0 0 0 0 0 0 0 
-1418.12 0 0 0 0 0 0 0 0 0 659.886 0 0 0 0 0 0 0 0 0 0 0 0 0 0 0 0 0 1289.94 0 0 0 0 0 0 0 0 0 0.05 0 0 964.309 0 0 0 0 0 0 0 
0 0 0 0 2390.59 0 0 0 0 0 0 0 0 0 0 0 0 0 0 2243.19 0 -2224.88 644.169 0 0 0 0 0 0 1739.02 0 0 0 0 128.559 0 0 0 0 0.06 0 0 0 -2036.27 0 0 0 0 0 
0 0 0 0 0 1535.31 0 0 0 0 -133.29 0 0 -359.89 0 0 404.447 0 0 0 0 0 0 0 0 0 0 0 0 0 0 0 0 0 1541.11 0 0 0 0 0 0.04 0 0 0 -356.533 2029.4 0 0 0 
0 0 0 0 0 0 0 0 0 2321.92 1639.23 0 0 0 0 0 0 0 0 0 0 0 0 0 0 0 0 0 0 0 0 0 0 0 0 0 0 0 2439.12 0 0 0.02 0 0 0 0 0 0 0 
0 0 0 0 0 0 0 0 0 0 0 0 0 0 0 0 0 0 0 0 0 0 0 0 1190.3 0 0 0 1185.57 1016.5 0 0 425.657 0 0 0 0 0 0 0 0 0 0.02 0 0 -1612.22 -1423.92 0 0 
0 0 0 0 0 0 0 0 0 2309.41 0 0 0 0 0 0 0 0 0 0 0 0 0 0 2320.86 0 -480.743 0 0 0 0 0 0 0 0 0 2011.25 0 0 -764.565 0 0 0 0 0 0 2472.99 0 0 
0 0 0 0 0 0 0 0 0 -2033.68 0 0 0 0 0 1266.59 0 0 0 0 0 -49.9741 0 0 0 -449.004 0 0 0 0 0 0 0 0 0 0 -1349.91 0 0 0 2212.21 0 0 0 0.09 2396.54 0 0 0 
0 0 0 0 0 2250.36 0 0 0 0 0 0 0 0 0 -1798.38 0 0 0 0 0 0 0 624.485 0 0 0 0 0 0 0 0 0 0 0 0 0 0 0 0 267.724 0 1441.31 0 -1938.46 0.09 0 0 -623.112 
0 0 0 0 0 0 0 0 0 438.017 0 0 0 0 0 0 0 0 0 0 0 0 0 2050.77 0 0 0 0 0 0 0 1531.65 0 0 0 0 0 0 0 0 0 0 -278.558 1404.84 0 0 0.04 0 0 
0 0 0 0 0 0 0 2344.81 -1319.09 2456.21 0 0 0 0 0 0 0 0 0 0 0 0 0 -472.808 0 0 0 0 0 0 0 0 0 0 0 0 0 0 0 0 0 0 0 0 0 0 0 0.04 0 
2031.85 0 0 493.103 -842.235 0 0 0 0 0 0 0 0 0 0 0 0 0 0 0 0 0 0 0 0 0 0 0 0 0 0 0 0 0 0 0 0 0 0 0 0 0 0 0 0 146.107 0 0 0.01 
