*Vertices 51
*Matrix 
0.03 0 0 -741.523 1375.09 0 0 0 0 0 -1727.12 1902.6 0 -537.202 0 0 0 0 0 0 0 2416.38 0 0 752.968 0 0 0 0 0 1813.94 0 0 0 0 0 0 0 1691.26 0 0 -2245.02 0 0 0 0 0 0 0 0 0 
0 0 0 0 1292.99 1910.99 -453.429 590.915 0 0 0 -767.617 0 0 -1079.21 0 0 0 0 0 0 0 0 0 0 -2171.47 0 1903.36 0 -1204.95 0 0 0 0 1306.12 0 0 0 0 0 0 -535.066 0 0 37.7667 0 0 0 0 0 -848.949 
0 0 0 2122.33 0 -424.131 0 0 0 0 0 459.227 -181.661 0 0 0 0 0 0 -667.364 0 2475.43 0 0 2085.25 1262.63 -784.707 0 0 0 1271.78 0 0 0 0 1041.06 0 0 0 1511.66 0 0 0 0 0 0 0 0 0 0 0 
1127.43 0 2492.52 0.09 0 0 0 0 1168.63 0 -2187.95 0 0 838.878 0 0 0 0 0 0 0 0 0 1589.79 0 0 -138.783 0 0 0 -401.395 0 0 0 0 0 0 0 0 0 0 1486.63 772.652 0 0 0 0 0 0 0 0 
-264.519 795.083 0 0 0.03 1922.9 0 0 1802.8 0 1300.78 543.001 0 0 0 -796.304 0 0 0 0 0 0 0 0 0 0 0 0 0 -161.214 -518.281 0 -152.669 0 0 0 0 0 0 0 -2196.65 0 0 0 1332.67 0 0 -1418.27 0 0 0 
0 2351.53 1992.02 0 792.947 0.02 0 -489.135 0 0 1461.76 0 0 -318.842 0 -1982.86 769.448 760.292 0 1395.08 0 -1972.03 1565.37 0 0 2219.23 0 0 -276.269 0 -300.378 0 0 860.24 0 -166.555 0 0 0 1258.2 0 2099.6 0 0 913.8 374.844 0 0 0 -456.481 0 
0 -500.885 0 0 0 0 0.08 0 0 0 -234.153 0 0 2193.44 -291.681 0 0 0 0 0 591.22 0 0 0 0 -2198.32 0 2162.77 0 -1835.46 -463.5 0 0 0 0 0 913.8 0 973.769 0 0 0 0 0 0 697.424 0 0 0 0 0 
0 -1121.78 0 0 0 -1037.71 0 0.03 0 0 470.061 -448.393 0 0 479.675 0 0 1866.74 0 0 0 556.124 0 0 0 0 0 915.937 -834.91 0 -639.134 -1932.81 0 0 0 0 2346.49 0 0 -480.285 0 0 0 0 530.335 2025.44 0 0 0 0 0 
0 0 0 1056.02 521.332 0 0 0 0.09 0 0 2371.36 0 0 -275.506 0 0 737.251 0 0 803.323 0 890.301 0 -1554.99 0 0 0 0 0 -575.808 0 0 0 0 0 275.048 1984.54 623.569 0 0 0 -1205.25 2320.86 -290.765 0 0 0 0 -1060.9 0 
0 0 0 0 0 0 0 0 0 0.01 0 0 0 0 0 0 0 0 0 2373.96 891.98 0 2165.36 0 0 -730.384 0 0 486.847 746.559 0 2050.61 0 0 0 0 -1611.61 -1583.83 0 1028.86 -72.8629 0 -958.205 0 0 0 0 0 0 -1306.88 0 
2440.79 0 0 -2.36518 1758.4 -1273 1518.37 1386.07 0 0 0 0 -1761.76 0 0 0 0 0 -1547.82 0 0 0 0 -2255.55 0 0 0 0 0 0 1714.91 0 0 0 0 0 -778.756 0 0 0 -42.1918 0 0 1348.08 0 0 0 0 0 -1537.9 0 
2411.95 0.686666 2159.41 0 -2335.81 0 0 674.535 1988.36 0 0 0.06 0 0 0 0 0 0 1904.43 0 -46.7696 0 0 0 0 0 0 0 0 -285.882 0 0 0 0 0 1509.83 0 0 0 2470.7 -1987.29 -1323.66 0 0 0 0 0 0 0 0 1086.08 
0 0 1349.91 0 0 0 0 0 0 0 2243.34 0 0.05 0 0 -2110.58 0 0 1485.56 0 0 0 -784.249 0 0 0 0 0 0 0 0 144.124 0 0 310.602 0 0 0 0 0 0 0 -509.735 0 0 0 0 0 0 0 0 
-1081.96 0 0 2366.63 0 2093.04 110.248 0 0 0 0 0 0 0.03 915.021 484.71 -629.673 0 0 52.8733 0 0 1092.64 0 0 0 0 0 0 0 0 0 1004.44 0 0 0 0 0 0 0 0 0 0 2429.5 819.498 0 -1324.12 -1645.79 0 -1730.78 0 
0 1328.24 0 0 0 0 1743.9 1162.83 -215.69 0 0 0 0 -1272.55 0.09 0 0 0 0 -1877.42 1920.15 0 1192.43 0 0 0 0 -1546.3 -282.372 0 0 0 0 0 0 -1889.32 0 0 0 0 0 -704.443 0 1454.74 0 0 0 0 0 0 0 
0 0 0 0 -734.657 1496.09 0 0 0 0 0 0 -2447.2 502.716 0 0.05 0 0 0 1988.2 0 0 1627.17 0 0 0 0 2274.62 0 0 0 0 -1584.75 0 0 791.726 0 0 0 0 0 1808.3 1899.55 2305.6 0 0 0 0 0 0 0 
0 0 0 0 0 -974.685 0 0 0 0 0 0 0 -2081.29 0 0 0.03 154.653 0 1779 0 0 0 0 0 0 0 0 0 0 0 0 -279.931 -335.017 0 0 0 0 0 0 1687.44 -457.701 0 0 1249.66 -197.836 0 0 0 0 0 
0 0 0 0 0 761.971 0 -1583.68 1408.51 0 0 0 0 0 0 0 -2214.65 0.09 0 1574.07 1682.87 0 -1006.27 0 -706.732 0 0 0 -337.458 232.322 0 2296.14 0 0 495.697 951.491 0 0 1043.2 0 0 0 0 1470.92 0 -1701.79 0 0 0 0 0 
0 0 0 0 0 0 0 0 0 0 663.701 1071.89 1915.27 0 0 0 0 0 0.05 -711.768 0 0 0 0 0 0 0 0 954.085 0 0 0 0 0 0 0 164.266 0 0 0 0 0 0 1477.02 1651.43 0 0 -1370.51 0 0 0 
0 0 -605.716 0 0 -2376.25 0 0 0 1636.94 0 0 0 -310.602 -714.667 -141.835 -282.067 1256.22 987.198 0.01 0 0 0 -726.569 2478.94 214.164 0 0 0 0 1191.82 0 0 0 -2279.35 0 0 0 210.349 1575.59 0 0 0 0 0 0 0 0 0 0 0 
0 0 0 0 0 0 2163.99 0 -2094.87 2405.24 0 2009.41 0 0 -1066.24 0 0 930.128 0 0 0.07 -596.866 0 0 0 -2190.85 0 0 -833.079 1171.68 0 -140.461 0 0 0 0 0 2496.49 0 -1743.14 0 0 0 0 1511.2 2438.2 0 0 0 0 0 
2099.44 0 2408.44 0 0 2114.55 0 -824.381 0 0 0 0 0 0 0 0 0 0 0 0 1759.93 0 0 -1252.86 494.476 0 0 0 1157.95 0 -1123.31 0 0 0 0 0 0 0 1653.87 0 -1068.68 0 0 -911.054 -33.6467 -992.233 0 0 0 0 0 
0 0 0 0 0 1757.64 0 0 -1210.44 209.128 0 0 2321.77 20.5237 -1644.26 2447.05 0 2322.38 0 0 0 0 0.05 0 0 589.694 0 0 -1058.76 -1078.91 0 2126.91 0 0 0 -1385.46 0 0 0 0 0 0 0 2309.11 0 0 0 -815.531 -187.46 0 0 
0 0 0 -1267.82 0 0 0 0 0 0 -1156.58 0 0 0 0 0 0 0 0 605.258 0 1539.74 0 0.04 2110.13 1508.3 0 0 0 0 0 2431.49 0 0 0 0 0 930.28 0 0 -1031.14 0 0 0 -2095.93 2324.21 0 1650.06 0 0 0 
1906.26 0 878.552 0 0 0 0 0 678.655 0 0 0 0 0 0 0 0 980.789 0 -913.038 0 -1182.06 0 440.916 0.08 0 0 0 0 0 0 -169.301 0 0 0 0 -2117.6 0 0 -465.026 0 0 0 0 0 0 0 0 0 0 0 
0 -1904.89 2404.93 0 0 958.815 313.501 0 0 1574.22 0 0 0 0 0 0 0 0 0 308.924 -1079.97 0 795.389 -1490.14 0 0.04 0 1016.5 1967.91 0 0 222.709 -929.67 1569.8 0 0 0 0 0 0 1687.29 670.263 -391.018 0 2079.76 0 1206.63 0 0 0 0 
0 0 -243.156 2462.16 0 0 0 0 0 0 0 0 0 0 0 0 0 0 0 0 0 0 0 0 0 0 0.01 0 1014.21 39.14 0 1504.33 0 0 0 0 2349.39 0 0 0 0 0 0 -136.799 0 0 0 0 0 0 -1000.78 
0 1344.42 0 0 0 0 2454.22 -306.177 0 0 0 0 0 0 274.59 1895.12 0 0 0 0 0 0 0 0 0 1134.3 0 0.09 0 0 -632.572 0 1439.94 2285.61 1526.76 -1995.38 1729.71 -940.046 0 0 0 0 0 0 0 1316.19 0 0 -693.609 -31.0526 0 
0 0 0 0 0 443.358 0 2348.93 0 580.996 0 0 0 0 2405.09 0 0 1226.77 932.875 0 -577.334 353.023 -1530.88 0 0 724.128 1083.64 0 0.02 -2499.54 1359.83 972.854 0 0 0 1496.55 663.549 0 -1345.64 -1865.37 0 -26.9326 0 0 0 446.715 0 0 0 0 0 
0 -1634.04 0 0 1974.62 0 -761.208 0 0 1055.41 0 -1339.99 0 0 0 0 0 2260.12 0 0 -2194.05 0 -1764.2 0 0 0 1919.69 0 721.992 0.09 0 0 1519.29 0 0 -682.165 0 0 0 0 1028.24 0 0 0 643.254 0 0 0 0 -612.125 0 
1456.88 0 -2419.13 1206.63 -440.001 1959.52 1244.47 2269.43 -224.693 0 -1569.64 0 0 0 0 0 0 0 0 -1131.55 0 -183.493 0 0 0 0 0 -40.3607 -151.296 0 0.06 0 0 0 0 0 2244.25 0 0 0 0 0 0 0 866.802 322.199 0 0 910.901 0 0 
0 0 0 0 0 0 0 2446.75 0 2262.41 0 0 2105.85 0 0 0 0 -895.337 0 0 209.281 0 -2054.28 -633.641 943.403 -68.5903 1980.88 0 -1276.67 0 0 0.08 0 0 2145.99 0 0 0 251.396 0 0 0 0 0 0 0 0 0 0 0 -1480.22 
0 0 0 0 2094.26 0 0 0 0 0 0 0 0 1696.3 0 -1359.22 -1768.78 0 0 0 0 0 0 0 0 -608.005 0 -131.764 0 977.279 0 0 0 -742.592 0 1282.92 0 0 0 0 100.787 0 0 0 0 0 0 0 0 0 -694.678 
0 0 0 0 0 2058.24 0 0 0 0 0 0 0 0 0 0 546.663 0 0 0 0 0 0 0 0 -1697.21 0 1953.11 0 0 0 0 2449.8 0.08 0 0 -1049.91 0 458.77 -1138.42 917.92 0 0 -538.118 -339.595 1343.5 0 0 0 0 0 
0 -1930.68 0 0 0 0 0 0 0 0 0 0 480.743 0 0 0 0 1543.7 0 1675.7 0 0 0 0 0 0 0 -2413.63 0 0 0 439.848 0 0 0.03 0 0 0 0 0 767.769 1755.35 0 0 0 0 0 0 0 0 0 
0 0 -129.017 0 0 523.621 0 0 0 0 0 1342.89 0 0 721.992 495.239 0 505.31 0 0 0 0 556.429 0 0 0 0 -634.709 1972.95 2241.2 0 0 1787.09 0 0 0.08 0 0 0 580.233 0 0 0 0 0 -706.122 -2222.43 0 0 0 0 
0 0 0 0 0 0 1331.45 -1469.85 -1382.56 709.021 838.115 0 0 0 0 0 0 0 702.765 0 0 0 0 0 -949.812 0 -994.064 -2180.62 2075.64 0 600.375 0 0 488.22 0 0 0.05 -438.627 0 0 0 1027.02 0 0 2421.41 157.552 0 0 0 0 0 
0 0 0 0 0 0 0 0 207.907 -838.878 0 0 0 0 0 0 0 0 0 0 1857.43 0 0 1678.44 0 0 0 2124.47 0 0 0 0 0 0 0 0 1214.87 0.07 0 0 0 0 0 434.355 0 1257.9 0 -2376.09 0 0 -860.698 
2340.39 0 0 0 0 0 -2095.93 0 1739.94 0 0 0 0 0 0 0 0 281.762 0 -117.115 0 1473.97 0 0 0 0 0 0 -716.041 0 0 1925.03 0 -2361.9 0 0 0 0 0.08 0 0 -855.052 0 0 0 -746.864 0 0 0 0 0 
0 0 907.697 0 0 1069.29 0 -1401.94 0 2491.61 0 -835.978 0 0 0 0 0 0 0 -1221.88 -371.792 0 0 0 1999.34 0 0 0 320.368 0 0 0 0 973.159 0 -1781.44 0 0 0 0.05 0 0 2230.98 0 0 0 0 0 1112.63 0 0 
0 0 0 0 -1267.2 0 0 0 0 1341.67 -2238.46 1403.16 0 0 0 0 1659.22 0 0 0 0 -1059.83 0 2444.76 0 2392.12 0 0 0 2048.02 0 0 1828.9 -666.601 -1795.94 0 0 0 0 0 0.02 0 0 0 0 0 0 -1982.25 0 0 0 
2230.52 -2385.1 0 2305.75 0 -118.336 0 0 0 0 0 -1794.26 0 0 608.921 -1606.27 -580.538 0 0 0 0 0 0 0 0 1741.92 0 0 -1186.18 0 0 0 0 0 2419.89 0 -1172.29 0 -143.513 0 0 0.04 0 0 0 1354.34 -238.884 0 0 0 0 
0 0 0 783.639 0 0 0 0 -1149.25 1995.99 0 0 1571.17 0 0 738.166 0 0 0 0 0 0 0 0 0 -1390.65 0 0 0 0 0 0 0 0 0 0 0 0 0 1623.51 0 0 0.08 0 -1352.35 897.931 2447.51 0 0 0 -646.001 
0 0 0 0 0 0 0 0 -5.87481 0 2253.72 0 0 1304.59 422.91 -111.164 0 -663.244 -2279.96 0 0 -495.544 1354.79 0 0 0 2337.95 0 0 0 0 0 0 2292.32 0 0 0 396.97 0 0 0 0 0 0.08 0 0 0 0 0 0 0 
0 1364.56 0 0 152.516 926.771 0 1899.55 361.568 0 0 0 0 385.678 0 0 1435.21 0 -1750.62 0 -1267.05 2158.5 0 -1211.05 0 -884.96 0 0 0 -180.441 686.285 0 0 439.695 0 0 1147.57 0 0 0 0 0 2425.38 0 0.04 1395.54 0 0 0 0 0 
0 0 0 0 0 380.49 298.853 -87.2066 0 0 0 0 0 0 0 0 2264.55 2471.62 0 0 1102.1 237.053 0 16.2511 0 0 0 1043.05 1975.84 0 -1282.01 0 0 640.812 0 -199.21 -1626.87 1381.65 -777.078 0 0 1346.25 -1777.02 0 -2411.8 0 0 0 0 0 0 
0 0 0 0 0 0 0 0 0 0 0 0 0 2071.98 0 0 0 0 0 0 0 0 0 0 0 1566.59 0 0 0 0 0 0 0 0 0 -325.709 0 0 0 0 0 -1611 1777.17 0 0 0 0.07 0 0 0 0 
0 0 0 0 1812.27 0 0 0 0 0 0 0 0 1761.3 0 0 0 0 2449.8 0 0 0 -876.568 -1990.8 0 0 0 0 0 0 0 0 0 0 0 0 0 1620.61 0 0 -94.0733 0 0 0 0 0 0 0.09 0 0 0 
0 0 0 0 0 0 0 0 0 0 0 0 0 0 0 0 0 0 0 0 0 0 512.94 0 0 0 0 -1903.21 0 0 835.215 0 0 0 0 0 0 0 0 1522.34 0 0 0 0 0 0 0 0 0 0 0 
0 0 0 0 0 834.452 0 0 388.577 1521.27 615.024 0 0 -138.936 0 0 0 0 0 0 0 0 0 0 0 0 0 802.56 0 1087.76 0 0 0 0 0 0 0 0 0 0 0 0 0 0 0 0 0 0 0 0.08 0 
0 1765.72 0 0 0 0 0 0 0 0 0 364.315 0 0 0 0 0 0 0 0 0 0 0 0 0 0 445.189 0 0 0 0 -789.895 1392.03 0 0 0 0 -2258.45 0 0 0 0 360.042 0 0 0 0 0 0 0 0.02 
