*Vertices 36
*Matrix 
0.04 0 1286.58 0 0 110.706 0 0 0 1352.81 0 0 0 0 0 0 197.684 0 0 2240.44 -1164.36 0 0 1263.39 0 0 0 0 0 -1835.46 0 0 0 0 0 0 
0 0.04 0 0 1013.29 0 0 0 0 0 0 2109.97 0 973.006 0 1890.85 0 0 0 0 0 0 0 0 2109.21 0 0 1384.4 0 0 0 0 0 0 0 0 
1348.84 0 0.06 0 788.369 0 1579.56 0 0 1946.55 0 0 0 0 0 0 0 1992.63 -2247.76 0 0 0 0 0 0 1030.38 0 0 0 0 -2194.05 0 0 0 0 -2230.22 
0 0 0 0.06 2096.85 0 0 0 0 0 0 0 -2023.61 0 0 609.836 0 304.346 -1207.39 0 0 0 0 0 0 0 0 0 0 0 2023 0 0 0 0 0 
0 1525.39 1501.13 1749.85 0.07 -332.118 298.547 2167.2 -1146.05 504.852 0 0 1603.82 1350.22 0 0 0 0 0 1497.62 0 0 0 -1110.19 0 0 0 0 0 0 0 0 0 0 0 0 
324.641 0 0 0 1443.75 0.03 1895.73 -1243.55 0 0 0 0 0 0 0 0 0 0 1081.8 0 0 0 0 0 0 0 0 1965.16 0 0 0 0 0 0 0 0 
0 0 1549.04 0 732.978 1622.14 0.08 0 0 0 0 0 0 0 0 0 0 -1752.14 0 0 0 0 1077.38 0 0 0 0 0 0 0 0 0 0 0 -729.621 0 
0 0 0 0 -7.55333 -2141.71 0 0.06 0 0 0 0 349.361 0 0 0 0 0 0 0 0 0 0 1043.2 0 -2409.05 0 1764.35 0 949.355 0 0 0 0 0 2493.44 
0 0 0 0 -2140.49 0 0 0 0.09 2175.13 1531.65 0 0 0 0 0 0 0 1110.03 1007.19 0 0 0 0 0 0 0 0 0 0 0 0 0 1461.91 0 0 
2284.08 0 2081.29 0 -1819.13 0 0 0 2436.98 0.02 -2075.03 0 0 0 0 0 0 0 0 0 0 0 0 0 0 0 0 0 0 0 0 0 0 0 0 0 
0 0 0 0 0 0 0 0 1201.44 897.626 0.06 -1116.6 0 0 2175.89 0 1863.84 0 0 0 0 0 0 0 0 0 129.933 0 0 0 0 0 0 0 0 0 
0 2338.56 0 0 0 0 0 0 0 0 1493.96 0.01 0 0 0 0 0 0 0 -1006.58 0 0 0 0 2037.34 2327.27 0 1991.71 0 0 0 0 0 0 1970.96 0 
0 0 0 1090.66 247.734 0 0 1804.48 0 0 0 0 0.07 0 0 0 0 0 0 0 0 0 0 -809.732 0 0 2237.54 0 0 0 0 0 -916.547 0 0 0 
0 1620.76 0 0 1583.83 0 0 0 0 0 0 0 0 0.03 0 0 0 -470.061 0 0 0 0 0 0 1855.3 0 0 0 0 0 2330.16 0 0 0 0 0 
0 0 0 0 0 0 0 0 0 0 1168.02 0 0 0 0.01 0 0 0 0 0 0 0 0 0 0 0 0 0 0 0 2244.56 0 0 0 1617.4 0 
0 1450.62 0 -473.876 0 0 0 0 0 0 0 0 0 0 0 0.06 0 0 0 0 0 1098.9 0 0 0 0 0 0 0 0 0 -129.933 0 0 0 0 
1430.17 0 0 0 0 0 0 0 0 0 257.5 0 0 0 0 0 0.01 0 0 0 1208.61 0 0 0 0 0 0 0 1747.87 0 0 0 1540.19 0 -36.2407 0 
0 0 -781.045 2054.12 0 0 1763.89 0 0 0 0 0 0 -326.93 0 0 0 0.05 0 0 0 2469.48 -92.0896 0 0 0 0 0 0 0 0 0 0 0 0 1155.96 
0 0 2317.8 903.424 0 -1435.36 0 0 1805.86 0 0 0 0 0 0 0 0 0 0.03 0 0 751.137 0 0 0 0 0 0 0 0 0 1797.62 0 0 0 0 
2262.57 0 0 0 2040.39 0 0 0 2438.2 0 0 2064.04 0 0 0 0 0 0 0 0.09 0 0 0 0 0 0 0 0 0 0 919.141 0 0 0 0 0 
1895.73 0 0 0 0 0 0 0 0 0 0 0 0 0 0 0 2413.02 0 0 0 0.06 0 0 0 0 0 0 0 -643.864 0 0 0 471.892 0 0 0 
0 0 0 0 0 0 0 0 0 0 0 0 0 0 0 -310.297 0 650.121 2459.11 0 0 0.02 0 0 1452.3 0 2435.15 0 -2459.41 0 0 0 0 0 0 0 
0 0 0 0 0 0 -754.799 0 0 0 0 0 0 0 0 0 0 1580.94 0 0 0 0 0.07 0 0 0 0 0 0 0 0 0 0 0 0 0 
1315.88 0 0 0 786.538 0 0 291.07 0 0 0 0 2343.9 0 0 0 0 0 0 0 0 0 0 0.02 0 0 0 0 0 0 0 0 0 0 1285.36 0 
0 1678.75 0 0 0 0 0 0 0 0 0 357.448 0 1102.4 0 0 0 0 0 0 0 -1245.69 0 0 0.07 0 0 0 -293.97 0 0 0 0 0 0 0 
0 0 -598.849 0 0 0 0 98.9563 0 0 0 2382.96 0 0 0 0 0 0 0 0 0 0 0 0 0 0 0 0 0 0 0 0 0 0 0 0 
0 0 0 0 0 0 0 0 0 0 -246.361 0 2388.61 0 0 0 0 0 0 0 0 279.778 0 0 0 0 0.08 0 1498.08 0 0 2062.52 -378.353 0 0 0 
0 -618.992 0 0 0 25.4067 0 288.171 0 0 0 1852.7 0 0 0 0 0 0 0 0 0 0 0 0 0 0 0 0 0 0 0 0 0 0 0 0 
0 0 0 0 0 0 0 0 0 0 0 0 0 0 0 0 100.787 0 0 0 1411.4 306.177 0 0 -941.572 0 2499.24 0 0.09 0 2053.06 0 0 -1275.14 0 0 
887.707 0 0 0 0 0 0 1056.32 0 0 0 0 0 0 0 0 0 0 0 0 0 0 0 0 0 0 0 0 0 0.02 0 0 0 0 0 0 
0 0 -1255.91 -731.758 0 0 0 0 0 0 0 0 0 431.455 2035.97 0 0 0 0 -1718.73 0 0 0 0 0 0 0 0 2041.92 0 0.01 0 0 0 0 0 
0 0 0 0 0 0 0 0 0 0 0 0 0 0 0 2376.4 0 0 -1449.86 0 0 0 0 0 0 0 2150.11 0 0 0 0 0.04 0 0 0 0 
0 0 0 0 0 0 0 0 0 0 0 0 718.177 0 0 0 2312.92 0 0 0 -56.2304 0 0 0 0 0 898.541 0 0 0 0 0 0.08 0 0 0 
0 0 0 0 0 0 0 0 -481.964 0 0 0 0 0 0 0 0 0 0 0 0 0 0 0 0 0 0 0 946.15 0 0 0 0 0.08 0 0 
0 0 0 0 0 0 535.829 0 0 0 0 1578.34 0 0 -1103.17 0 1159.32 0 0 0 0 0 0 -418.638 0 0 0 0 0 0 0 0 0 0 0.08 0 
0 0 279.168 0 0 0 0 -1034.5 0 0 0 0 0 0 0 0 0 2214.5 0 0 0 0 0 0 0 0 0 0 0 0 0 0 0 0 0 0.01 
