*Vertices 47
*Matrix 
0.01 0 0 0 0 0 0 0 0 0 0 0 0 0 0 0 0 0 0 2475.28 2480.93 -1726.36 864.055 0 0 0 1920 0 -578.555 0 0 0 0 0 0 0 0 0 0 0 0 0 0 0 0 0 0 
0 0.06 0 0 0 2441.25 -1533.78 0 0 0 0 0 0 0 0 0 1330.68 0 1330.53 0 0 0 0 -1107.29 0 0 0 0 0 0 0 0 0 1587.19 0 0 0 0 0 0 0 0 0 0 0 0 0 
0 0 0.09 0 1208.46 0 0 0 0 2000.72 1486.48 0 0 0 0 0 0 0 0 0 0 0 0 0 0 0 0 0 0 0 0 0 0 0 0 0 0 1705.45 0 0 0 -842.997 0 -643.101 0 0 0 
0 0 0 0.09 1710.94 0 0 0 0 0 0 0 0 0 0 0 0 0 0 0 0 0 0 0 0 0 0 0 0 0 0 0 0 0 -1511.66 0 0 1999.65 0 0 0 0 0 0 0 0 0 
0 0 2084.95 116.352 0.01 0 0 0 0 0 0 1794.72 -226.829 0 0 0 0 0 0 0 0 0 0 0 0 0 660.802 0 0 0 0 0 0 0 0 0 0 0 0 0 0 0 0 0 0 0 0 
0 119.556 0 0 0 0.04 1112.93 1520.51 0 0 0 0 0 0 0 0 0 -475.555 0 0 0 0 0 305.414 0 0 0 0 0 -1914.2 0 0 0 0 0 0 0 0 0 0 0 0 0 0 0 0 0 
0 2141.56 0 0 0 -977.889 0.01 0 0 -16.4037 0 0 1856.06 2277.06 260.399 0 0 0 0 0 0 0 0 0 377.59 0 0 0 0 0 0 0 0 0 0 0 2407.68 2115.01 0 0 0 0 0 0 0 0 0 
0 0 0 0 0 -2448.73 0 0.02 0 0 0 2376.25 1845.53 0 0 0 0 0 0 0 -2268.36 0 0 0 0 0 2167.04 0 0 0 0 0 0 2449.49 0 0 0 0 0 0 0 0 0 0 0 0 0 
0 0 0 0 0 0 0 0 0.06 0 0 0 0 1761.45 0 0 0 0 0 0 0 0 0 0 0 0 0 0 -1201.44 0 2270.04 0 0 0 0 0 0 0 0 0 0 0 0 0 0 0 0 
0 0 2036.88 0 0 0 -1100.73 0 0 0 0 0 0 2075.64 -390.103 0 -29.2215 0 -1878.95 0 1160.08 0 0 0 0 0 0 0 0 0 0 0 0 0 0 0 0 0 0 0 0 0 0 0 0 0 0 
0 0 357.448 0 0 0 0 0 0 0 0.09 0 0 0 0 0 0 0 0 0 0 0 0 0 0 0 0 0 869.396 920.209 0 0 0 0 0 0 0 0 0 0 0 0 -932.569 0 0 0 0 
0 0 0 0 2140.49 0 0 1959.82 0 0 0 0.09 0 0 0 0 0 0 0 0 0 0 0 0 0 0 0 0 0 0 0 0 800.272 0 0 0 135.426 0 0 0 0 0 0 0 0 646.001 0 
0 0 0 0 1807.38 0 -2321.01 -1508.91 0 0 0 0 0 2162.31 0 0 0 0 0 0 0.228889 0 0 0 155.873 0 0 0 0 1132.31 0 0 0 0 0 0 567.721 0 0 0 0 0 0 0 0 0 0 
0 0 0 0 0 0 -2187.64 0 584.048 2013.99 0 0 782.266 0.09 0 0 0 0 2065.11 215.69 0 0 0 0 0 0 0 0 0 0 0 0 0 0 0 -432.524 0 0 0 0 0 0 0 0 0 0 0 
0 0 0 0 0 0 892.285 0 0 1475.49 0 0 0 0 0 0 0 0 0 0 0 0 897.626 0 -424.284 -87.6644 0 0 0 0 0 0 -1577.73 821.94 1862.32 0 0 -2290.19 0 2483.37 0 0 0 0 0 0 0 
0 0 0 0 0 0 0 0 0 0 0 0 0 0 0 0.04 0 0 0 0 0 0 -2474.97 0 0 0 1957.38 0 0 0 0 1143.76 0 0 0 0 0 0 0 0 0 0 0 0 0 0 0 
0 -191.275 0 0 0 0 0 0 0 1457.79 0 0 0 0 0 0 0.02 0 0 0 0 0 0 0 0 0 0 0 0 0 0 0 0 0 0 0 0 1628.09 0 0 0 0 0 0 0 0 0 
0 0 0 0 0 -1136.74 0 0 0 0 0 0 0 0 0 0 0 0.05 992.691 0 0 0 0 0 0 -311.975 0 0 0 -404.904 1669.59 0 0 0 0 0 0 0 0 0 0 0 0 0 0 0 0 
0 -1347.77 0 0 0 0 0 0 0 1353.27 0 0 0 1456.11 0 0 0 2263.48 0.01 2.21259 0 0 -11.3681 0 0 2276.76 0 0 0 610.141 0 0 0 0 0 0 0 0 0 0 0 0 0 0 0 0 0 
506.226 0 0 0 0 0 0 0 0 0 0 0 0 -1294.21 0 0 0 0 1320.61 0 0 0 0 0 0 0 0 0 -2261.8 0 0 0 0 0 0 1862.47 0 0 0 0 0 0 0 0 0 0 0 
-310.297 0 0 0 0 0 0 1408.35 0 -610.904 0 0 2385.25 0 0 0 0 0 0 0 0 0 0 759.987 0 0 0 0 441.832 0 0 0 0 0 0 0 0 0 0 0 0 0 0 0 0 0 0 
1332.97 0 0 0 0 0 0 0 0 0 0 0 0 0 0 0 0 0 0 0 0 0.08 1335.87 0 798.44 -30.137 0 0 0 0 0 0 0 0 0 0 0 0 0 0 -1755.35 0 0 0 0 0 0 
-320.521 0 0 0 0 0 0 0 0 0 0 0 0 0 1584.14 -1331.75 0 0 868.175 0 0 1774.73 0.06 0 0 0 0 0 569.399 0 0 0 0 0 0 -425.962 0 0 0 0 0 0 0 0 0 0 0 
0 147.938 0 0 0 1396.15 0 0 0 0 0 0 0 0 0 0 0 0 0 0 698.187 0 0 0.09 0 0 0 0 0 0 799.814 0 0 0 0 -1510.59 1554.99 0 0 0 0 0 0 0 0 0 0 
0 0 0 0 0 0 -94.6837 0 0 0 0 0 1288.42 0 -2127.67 0 0 0 0 0 0 101.398 0 0 0.04 0 1442.69 -1338.47 0 0 1872.54 -418.027 0 0 0 2059.01 0 0 0 0 0 0 0 0 0 0 0 
0 0 0 0 0 0 0 0 0 0 0 0 0 0 1785.26 0 0 283.746 -90.8689 0 0 1965.62 0 0 0 0.02 0 0 0 0 0 0 0 0 1920.45 -1572.24 0 0 0 0 0 0 0 0 0 0 0 
1652.04 0 0 0 -333.033 0 0 -499.054 0 0 0 0 0 0 0 1554.69 0 0 0 0 0 0 0 0 -562.532 0 0.09 0 0 0 0 0 0 0 0 0 0 0 0 0 0 0 0 0 0 0 0 
0 0 0 0 0 0 0 0 0 0 0 0 0 0 0 0 0 0 0 0 0 0 0 0 2412.26 0 0 0.07 -1640.14 0 0 0 0 0 0 0 0 0 0 0 0 0 0 0 0 0 0 
2177.27 0 0 0 0 0 0 0 -1719.95 0 2155.45 0 0 0 0 0 0 0 0 888.47 -1200.52 0 -2491.3 0 0 0 0 1381.95 0.02 0 0 0 0 0 0 0 0 0 0 0 0 0 0 0 0 0 0 
0 0 0 0 0 -2326.2 0 0 0 0 1096.91 0 1366.08 0 0 0 0 -1840.04 -728.553 0 0 0 0 0 0 0 0 0 0 0.05 2370.75 0 0 0 0 0 0 0 0 0 0 0 0 0 0 0 0 
0 0 0 0 0 0 0 0 2030.93 0 0 0 0 0 0 0 0 1782.66 0 0 0 0 0 1959.82 -1436.89 0 0 0 0 -1.90741 0.09 1202.66 0 0 0 0 1401.03 0 0 0 0 0 0 0 0 0 0 
0 0 0 0 0 0 0 0 0 0 0 0 0 0 0 2358.55 0 0 0 0 0 0 0 0 2208.85 0 0 0 0 0 1829.81 0.05 0 0 0 0 0 0 0 0 0 0 0 0 1278.34 0 0 
0 0 0 0 0 0 0 0 0 0 0 1956.16 0 0 -2149.04 0 0 0 0 0 0 0 0 0 0 0 0 0 0 0 0 0 0.08 0 0 0 0 0 0 0 0 0 0 0 0 0 0 
0 2216.64 0 0 0 0 0 2123.71 0 0 0 0 0 0 118.793 0 0 0 0 0 0 0 0 0 0 0 0 0 0 0 0 0 0 0.09 0 0 0 0 0 0 0 0 0 0 0 0 0 
0 0 0 1005.36 0 0 0 0 0 0 0 0 0 0 1774.58 0 0 0 0 0 0 0 0 0 0 651.646 0 0 0 0 0 0 0 0 0.02 0 0 0 -432.371 0 0 0 0 0 0 0 0 
0 0 0 0 0 0 0 0 0 0 0 0 0 2308.04 0 0 0 0 0 -1571.17 0 0 -3.43333 1809.21 -82.4763 1766.79 0 0 0 0 0 0 0 0 0 0.01 0 0 0 0 0 0 0 0 0 0 0 
0 0 0 0 0 0 522.095 0 0 0 0 1984.39 -1337.55 0 0 0 0 0 0 0 0 0 0 -253.533 0 0 0 0 0 0 -1156.42 0 0 0 0 0 0.04 0 0 0 0 0 0 0 0 0 0 
0 0 -1337.24 1580.63 0 0 785.47 0 0 0 0 0 0 0 1231.35 0 1780.53 0 0 0 0 0 0 0 0 0 0 0 0 0 0 0 0 0 0 0 0 0 0 0 0 0 0 0 0 0 0 
0 0 0 0 0 0 0 0 0 0 0 0 0 0 0 0 0 0 0 0 0 0 0 0 0 0 0 0 0 0 0 0 0 0 1083.03 0 0 0 0.09 0 0 0 0 0 0 0 0 
0 0 0 0 0 0 0 0 0 0 0 0 0 0 2363.58 0 0 0 0 0 0 0 0 0 0 0 0 0 0 0 0 0 0 0 0 0 0 0 0 0.08 0 0 0 0 0 0 0 
0 0 0 0 0 0 0 0 0 0 0 0 0 0 0 0 0 0 0 0 0 679.571 0 0 0 0 0 0 0 0 0 0 0 0 0 0 0 0 0 0 0.08 0 0 0 0 0 0 
0 0 2476.96 0 0 0 0 0 0 0 0 0 0 0 0 0 0 0 0 0 0 0 0 0 0 0 0 0 0 0 0 0 0 0 0 0 0 0 0 0 0 0.05 0 0 0 0 733.741 
0 0 0 0 0 0 0 0 0 0 290.002 0 0 0 0 0 0 0 0 0 0 0 0 0 0 0 0 0 0 0 0 0 0 0 0 0 0 0 0 0 0 0 0.09 0 0 0 0 
0 0 484.252 0 0 0 0 0 0 0 0 0 0 0 0 0 0 0 0 0 0 0 0 0 0 0 0 0 0 0 0 0 0 0 0 0 0 0 0 0 0 0 0 0.06 0 0 0 
0 0 0 0 0 0 0 0 0 0 0 0 0 0 0 0 0 0 0 0 0 0 0 0 0 0 0 0 0 0 0 1137.04 0 0 0 0 0 0 0 0 0 0 0 0 0.01 0 0 
0 0 0 0 0 0 0 0 0 0 0 2164.45 0 0 0 0 0 0 0 0 0 0 0 0 0 0 0 0 0 0 0 0 0 0 0 0 0 0 0 0 0 0 0 0 0 0.01 0 
0 0 0 0 0 0 0 0 0 0 0 0 0 0 0 0 0 0 0 0 0 0 0 0 0 0 0 0 0 0 0 0 0 0 0 0 0 0 0 0 0 44.6333 0 0 0 0 0.02 
