*Vertices 49
*Matrix 
0.04 0 632.878 0 0 0 1321.07 0 -465.026 527.741 0 -521.332 68.4378 2266.99 1452.15 0 0 0 0 0 0 0 691.015 -2028.03 0 0 0 0 1725.14 0 0 0 0 0 0 0 0 0 0 0 0 -53.7889 0 0 0 0 0 0 0 
0 0.09 0 2202.9 0 0 1754.28 0 0 0 0 0 0 0 0 -1668.52 -501.495 0 0 0 -707.495 0 0 0 853.832 0 2154.99 1844 0 748.39 0 0 168.844 0 0 0 -1686.83 0 0 0 0 0 0 0 0 0 0 0 0 
1681.49 0 0.06 0 0 0 -2126.91 0 0 0 2414.55 -1424.53 0 0 985.977 -2038.1 578.707 0 0 0 0 1643.65 0 0 0 730.842 0 1309.93 -149.77 723.365 0 0 0 0 0 0 0 0 0 0 0 0 761.208 0 -1641.82 0 0 0 -861.614 
0 521.027 0 0.04 -1131.55 0 1207.39 0 1204.34 -326.014 0 2270.65 0 384.915 0 0 0 0 -2172.69 0 1023.36 2090.9 0 718.482 1492.58 0 1638.16 0 0 0 -438.169 0 -764.565 0 0 0 0 0 0 0 0 0 0 0 0 0 0 0 0 
0 0 0 2438.51 0.04 0 0 0 0 0 0 0 0 0 0 0 0 -439.085 61.4185 0 0 0 2033.68 0 0 0 0 0 0 0 0 0 -761.971 0 0 0 1029.62 -1637.85 0 0 0 0 0 0 0 -869.091 -1090.81 0 0 
0 0 0 0 0 0.09 473.418 -883.435 0 0 0 0 -87.9696 1668.68 0 0 0 -1026.11 0 0 0 0 -1624.73 0 0 375.454 0 1078.14 0 0 454.65 1235.62 0 0 1315.27 0 0 0 0 0 0 0 0 0 0 0 0 0 0 
1989.58 402.463 -995.895 -2150.41 0 1211.66 0.06 0 -271.691 0 1047.17 -1713.69 0 0 955.458 415.433 -122.15 0 0 0 0 0 2069.08 0 0 282.983 0 0 0 0 0 0 0 0 0 0 0 0 0 0 0 0 0 0 -718.94 0 0 0 0 
0 0 0 0 0 2321.62 0 0.02 0 0 0 0 1371.43 837.504 0 0 0 0 0 0 2211.6 0 0 0 921.125 0 2300.56 0 2020.1 1210.44 0 1051.9 0 0 0 0 0 0 2261.35 0 0 2004.23 0 0 0 0 2186.88 0 0 
2113.33 0 0 1564.91 0 0 672.704 0 0.05 0 0 -846.812 0 0 1779.15 0 0 0 0 0 0 0 -2031.85 0 833.689 0 0 0 0 0 0 0 -1854.84 0 0 0 0 0 0 0 0 0 0 0 0 0 0 -332.881 0 
166.097 0 0 -1569.64 0 0 0 0 0 0.07 0 848.491 0 -1854.38 0 0 0 0 0 1632.05 0 0 0 -676.977 922.346 0 0 1415.52 -244.987 0 2435.91 0 1350.98 0 0 497.681 0 0 0 0 0 0 0 0 0 0 0 0 0 
0 0 1825.85 0 0 0 -537.66 0 0 0 0.05 0 0 0 -361.873 0 909.07 0 576.876 0 0 1023.82 1520.36 0 0 0 0 0 0 1282.77 0 0 658.666 -2183.07 0 0 0 0 0 0 -34.257 0 0 0 0 0 0 0 0 
2331.84 0 2095.02 -2350.31 0 0 2236.47 0 2011.55 1705.76 0 0.02 0 0 1163.29 584.353 0 1184.8 -318.537 0 0 -1005.97 413.449 0 -648.747 0 0 -1270.87 0 0 0 0 0 0 0 0 0 0 0 0 0 0 0 0 0 0 42.497 0 0 
2123.86 0 0 0 0 -2217.4 0 -1039.69 0 0 0 0 0.08 1525.7 0 1564 0 0 0 0 0 0 0 0 -375.454 0 0 0 0 0 0 1623.05 0 0 0 1504.79 0 0 0 0 0 0 0 0 0 0 0 0 0 
2251.43 0 0 1665.78 0 1844 0 1384.4 0 2456.36 0 0 1653.11 0.09 0 1696.75 -1911.45 0 0 0 0 2090.59 2122.18 0 0 -446.104 0 0 0 0 0 0 0 0 0 0 0 0 1770.46 0 0 0 0 0 0 0 0 0 0 
222.709 0 218.284 0 0 0 -2119.13 0 -50.1267 0 802.408 2024.67 0 0 0 677.74 718.94 0 0 2273.86 1378.44 305.261 0 0 0 2262.87 0 0 -329.829 0 0 0 -1090.2 0 0 0 0 0 0 0 0 0 -1145.74 -1039.99 0 2162.01 0 0 0 
0 2318.57 1235.47 0 0 0 -385.22 0 0 0 0 413.907 2414.55 1424.38 409.024 0.03 1332.67 0 1139.79 0 1061.2 0 1082.11 0 686.438 2072.13 0 0 0 1828.9 2228.39 0 -1455.66 1172.44 0 0 0 0 0 0 0 0 0 0 0 -1109.88 0 0 0 
0 1318.78 656.987 0 0 0 143.361 0 0 0 -467.162 0 0 1275.6 -1806.62 735.572 0.06 0 0 0 0 1829.2 0 0 -1135.82 0 -204.855 0 0 0 0 0 0 0 0 0 -1224.78 0 -1693.4 0 0 0 0 0 1982.25 0 0 0 0 
0 0 0 0 1978.29 2388.91 0 0 0 0 0 738.319 0 0 0 0 0 0.03 0 0 0 0 0 0 -947.218 0 0 0 851.695 0 0 0 0 0 0 0 0 0 0 0 0 0 0 0 0 0 0 0 0 
0 0 0 -541.932 2146.6 0 0 0 0 0 -81.1029 -1549.65 0 0 0 -703.375 0 0 0.01 1482.82 0 0 1403.01 -10.3 0 0 2041.15 0 0 2174.37 0 1504.79 0 -261.925 0 0 0 0 0 983.078 0 0 0 0 0 0 0 -527.894 0 
0 0 0 0 0 0 0 0 0 -756.935 0 0 0 0 -283.288 0 0 0 -524.384 0.08 1073.26 1775.95 264.367 2444.61 0 0 0 -10.4526 1865.52 0 0 0 0 0 0 0 0 0 0 0 0 -758.919 0 0 0 0 0 0 0 
0 1781.44 0 2243.19 0 0 0 -259.331 0 0 0 0 0 0 2376.09 2106.77 0 0 0 2104.79 0.07 0 0 0 0 0 0 0 -2419.74 0 0 0 1703.92 0 0 0 0 0 0 0 159.536 0 1991.26 0 0 -1539.43 1822.03 0 0 
0 0 -349.513 501.19 0 0 0 0 0 0 -2448.42 -620.212 0 2470.09 1316.49 0 738.472 0 0 769.906 0 0.04 0 0 0 0 0 0 0 0 0 771.432 0 0 0 0 0 0 0 0 0 0 0 2321.16 0 1655.25 0 0 0 
2081.29 0 0 0 44.0229 -2005.14 1627.32 0 -1662.72 0 1204.79 386.135 0 2498.78 0 2375.48 0 0 379.116 763.344 0 0 0 0 0 0 0 0 0 0 0 0 0 0 0 0 0 0 0 0 0 0 0 0 0 0 0 0 0 
-393.918 0 0 1309.17 0 0 0 0 0 629.063 0 0 0 0 0 0 0 0 1429.41 2171.32 0 0 0 0.01 -1728.34 0 0 0 0 0 0 0 2105.85 2359.61 0 0 0 -1533.02 0 0 0 1967.15 0 2494.96 0 0 0 975.753 0 
0 -1129.72 0 756.172 0 0 0 -900.067 2256.46 -209.281 0 1363.49 868.48 0 0 1390.35 -1703.62 1279.87 0 0 0 0 0 1150.17 0 0 0 0 0 0 0 0 2290.64 0 0 -1785.56 0 0 0 0 0 0 0 0 0 0 0 0 2404.17 
0 0 2496.95 0 0 924.329 -181.051 0 0 0 0 0 0 610.141 -1729.87 1632.97 0 0 0 0 0 0 0 0 0 0.09 0 63.097 0 -2442.78 0 0 -1927.02 0 0 0 0 0 0 0 0 0 0 0 0 0 0 0 0 
0 2203.82 0 515.687 0 0 0 1622.59 0 0 0 0 0 0 0 0 -1827.22 0 827.281 0 0 0 0 0 0 0 0.04 0 -1714.76 1529.21 592.898 0 1917.25 0 0 1742.38 0 0 0 0 0 0 0 0 0 0 0 -1899.85 -660.039 
0 638.066 595.95 0 0 -177.084 0 0 0 737.098 0 2155.14 0 0 0 0 0 0 0 -1649.6 0 0 0 0 0 -546.052 0 0.05 2291.1 -371.487 0 0 0 0 0 0 0 0 0 0 0 0 0 0 0 1054.64 0 0 0 
1935.26 0 2247.61 0 0 0 0 571.688 0 900.525 0 0 0 0 2242.58 0 0 1205.86 0 1019.24 -100.177 0 0 0 0 0 -409.787 27.543 0.04 -1629.61 0 0 -979.568 0 0 0 0 0 0 0 0 1455.5 0 0 0 0 0 0 0 
0 1900.16 -2440.49 0 0 0 0 -2034.29 0 0 90.7163 0 0 0 0 2163.84 0 0 -1300.93 0 0 0 0 0 0 2338.86 2189.47 -1377.68 2448.27 0.07 -1885.97 0 2159.87 0 0 0 0 0 0 0 0 0 0 0 0 0 0 0 0 
0 0 0 2277.67 0 1925.34 0 0 0 -2228.84 0 0 0 0 0 733.741 0 0 0 0 0 0 0 0 0 0 894.574 0 0 1809.67 0.03 0 0 0 0 832.011 0 0 0 0 0 0 0 551.546 0 0 0 0 -292.901 
0 0 0 0 0 -1098.9 0 1544.31 0 0 0 0 929.975 0 0 0 0 0 2172.99 0 0 -349.361 0 0 0 0 0 0 0 0 0 0.04 0 0 0 0 0 0 0 0 0 0 0 0 2383.42 0 0 0 0 
0 -730.384 0 1096.76 1822.79 0 0 0 2070.3 -1564.15 -1321.38 0 0 0 1402.25 2398.53 0 0 0 0 1573.15 0 0 2320.7 -2400.05 1875.9 2102.95 0 1995.53 933.485 0 0 0.06 -2096.39 684.454 0 0 0 -354.854 0 0 0 0 0 0 0 0 -50.1267 0 
0 0 0 0 0 0 0 0 0 0 989.181 0 0 0 0 -1571.17 0 0 1485.41 0 0 0 0 639.897 0 0 0 0 0 0 0 0 -371.639 0.01 0 0 0 0 0 2276.76 0 -1778.24 0 0 232.475 0 0 0 0 
0 0 0 0 0 1436.43 0 0 0 0 0 0 0 0 0 0 0 0 0 0 0 0 0 0 0 0 0 0 0 0 0 0 2198.48 0 0.01 0 0 0 0 0 0 0 0 0 0 0 0 0 1301.84 
0 0 0 0 0 0 0 0 0 1433.53 0 0 -1716.13 0 0 0 0 0 0 0 0 0 0 0 1544.62 0 994.064 0 0 0 -1274.38 0 0 0 0 0.01 0 0 1405.15 0 0 0 0 0 0 0 0 0 0 
0 662.328 0 0 1838.21 0 0 0 0 0 0 0 0 0 0 0 -1632.51 0 0 0 0 0 0 0 0 0 0 0 0 0 0 0 0 0 0 0 0 0 0 0 2240.9 0 0 0 0 0 0 0 0 
0 0 0 0 -452.666 0 0 0 0 0 0 0 0 0 0 0 0 0 0 0 0 0 0 1164.97 0 0 0 0 0 0 0 0 0 0 0 0 0 0.07 0 25.4067 0 0 0 0 2106.92 0 0 1614.96 0 
0 0 0 0 0 0 0 -1508 0 0 0 0 0 114.368 0 0 175.405 0 0 0 0 0 0 0 0 0 0 0 0 0 0 0 1270.1 0 0 1383.79 0 0 0.07 0 998.184 709.174 0 0 0 -203.94 -1115.68 0 0 
0 0 0 0 0 0 0 0 0 0 0 0 0 0 0 0 0 0 450.377 0 0 0 0 0 0 0 0 0 0 0 0 0 0 2191.46 0 0 0 2340.24 0 0.07 2220.15 0 0 0 0 0 0 0 0 
0 0 0 0 0 0 0 0 0 0 584.506 0 0 0 0 0 0 0 0 0 -2105.24 0 0 0 0 0 0 0 0 0 0 0 0 0 0 0 2000.41 0 1173.82 1294.67 0.06 0 0 0 0 0 0 0 0 
-395.596 0 0 0 0 0 0 -197.073 0 0 0 0 0 0 0 0 0 0 0 2087.24 0 0 0 1.29704 0 0 0 0 -1568.73 0 0 0 0 1895.12 0 0 0 0 886.486 0 0 0.03 0 0 0 0 0 0 0 
0 0 1797.46 0 0 0 0 0 0 0 0 0 0 0 -443.663 0 0 0 0 0 920.057 0 0 0 0 0 0 0 0 0 0 0 0 0 0 0 0 0 0 0 0 0 0 0 1005.51 1652.96 0 0 0 
0 0 0 0 0 0 0 0 0 0 0 0 0 0 -1341.98 0 0 0 0 0 0 131.611 0 2023.76 0 0 0 0 0 0 2057.18 0 0 0 0 0 0 0 0 0 0 0 0 0.06 0 0 0 0 0 
0 0 -22.3548 0 0 0 1366.85 0 0 0 0 0 0 0 0 0 -1765.27 0 0 0 0 0 0 0 0 0 0 0 0 0 0 274.133 0 1249.81 0 0 0 2215.72 0 0 0 0 2091.81 0 0.04 0 0 0 0 
0 0 0 0 509.888 0 0 0 0 0 0 0 0 0 1941.05 -276.269 0 0 0 0 899.915 -1437.96 0 0 0 0 0 -2274.32 0 0 0 0 0 0 0 0 0 0 2411.5 0 0 0 2275.08 0 0 0 1964.25 -2232.66 0 
0 0 0 0 2402.34 0 0 1532.72 0 0 0 389.34 0 0 0 0 0 0 0 0 -1106.83 0 0 0 0 0 0 0 0 0 0 0 0 0 0 0 0 0 722.449 0 0 0 0 0 0 -1533.17 0.09 0 0 
0 0 0 0 0 0 0 0 -330.439 0 0 0 0 0 0 0 0 0 827.586 0 0 0 0 1632.66 0 0 377.59 0 0 0 0 0 -1425.6 0 0 0 0 -1716.28 0 0 0 0 0 0 0 1997.97 0 0.09 0 
0 0 -2159.26 0 0 0 0 0 0 0 0 0 0 0 0 0 0 0 0 0 0 0 0 0 1419.03 0 1517.76 0 0 0 -908.46 0 0 0 1464.81 0 0 0 0 0 0 0 0 0 0 0 0 0 0.07 
