*Vertices 63
*Matrix 
0.06 0 0 0 0 0 0 0 -2222.43 -1611.76 0 -947.218 318.232 0 2024.37 854.747 0 0 1711.4 0 759.987 -1337.55 0 1268.73 0 0 0 0 1743.75 -2364.5 0 1970.2 0 0 -103.687 427.335 0 0 0 0 0 784.402 0 0 0 0 0 0 1822.64 0 0 0 0 0 0 1584.14 0 0 0 0 0 0 0 
0 0.06 2191.61 2265.62 -1292.54 0 0 0 348.445 0 530.641 0 2254.02 -1247.67 0 0 1472.44 0 0 0 -450.53 0 0 0 0 0 0 0 0 0 -447.02 1815.62 0 0 0 0 2393.49 0 0 0 0 0 0 -2200.61 0 0 0 0 0 0 0 0 0 0 0 0 0 0 0 0 0 0 0 
0 1581.24 0.03 0 0 0 0 0 476.47 0 0 0 0 0 0 0 -1089.28 0 -595.035 0 393.918 1494.26 0 0 42.1918 0 0 1524.17 0 0 965.529 0 2104.63 0 0 0 0 0 -1959.36 -1711.4 2090.44 0 0 0 0 0 0 0 0 0 0 0 0 0 0 0 0 0 0 0 214.621 0 -317.927 
0 -265.435 0 0.07 0 0 2129.96 0 -592.288 2125.39 0 2371.06 0 0 707.953 0 0 -289.239 0 0 0 0 0 0 0 -862.835 0 0 0 0 0 2245.48 0 0 0 0 0 0 0 0 0 0 0 0 0 0 0 0 0 0 0 0 0 0 0 0 0 0 0 0 0 0 0 
0 -2490.84 0 0 0.07 -2213.74 -1125.14 0 0 0 1884.9 0 0 0 0 0 -1098.28 0 0 0 2489.62 1445.59 0 1974.01 0 0 0 0 2135.15 -994.522 0 0 0 0 1878.8 0 -1409.27 0 0 0 0 0 0 0 0 0 0 0 0 0 0 0 0 0 0 -2294.31 0 0 0 0 0 0 0 
0 0 0 0 1684.7 0.09 0 -1372.04 -342.341 0 0 0 0 0 0 0 0 0 571.535 0 -910.138 312.738 -538.423 0 0 0 0 1390.8 0 -191.122 0 -397.58 2344.36 -332.575 0 0 0 0 0 0 0 0 666.753 0 0 0 0 0 0 0 0 0 0 0 0 1770.76 0 1972.64 0 0 0 0 0 
0 0 0 1027.79 89.0378 0 0.01 1634.19 -77.4407 0 0 0 0 0 0 112.69 0 0 2377.77 0 2246.7 979.72 0 0 0 0 -1762.52 0 0 1876.66 -1301.54 0 1563.08 0 1176.87 1450.32 0 0 0 2163.53 0 1982.1 0 0 0 0 0 0 0 0 0 0 0 836.436 324.946 0 0 0 -352.87 0 0 -1899.09 0 
0 0 0 0 0 1659.98 2304.22 0.06 0 0 0 0 -2180.93 1757.94 0 -1289.33 0 0 0 0 0 -793.252 2228.08 0 1408.51 0 0 0 0 464.415 0 0 0 0 0 2378.99 0 0 0 2260.73 0 0 0 0 0 1721.02 0 -1442.69 0 0 0 0 0 0 0 0 0 0 0 -2324.67 0 0 0 
2397.61 2098.83 740.15 -562.38 0 1690.95 1604.59 0 0.08 -1465.58 0 0 0 2129.35 0 -1097.06 0 1990.19 -994.217 1339.23 0 -291.223 1604.89 219.504 -1632.36 132.069 -257.5 0 0 0 0 1591.62 1592.38 0 0 0 0 -416.044 0 0 0 0 0 0 -923.261 0 0 0 0 744.575 0 0 0 0 0 0 0 0 0 0 0 0 0 
-2063.74 0 0 7.09555 0 0 0 0 1755.04 0.02 0 2460.48 0 0 0 0 0 0 0 0 0 1614.66 0 2124.77 -1347.62 -2151.17 0 0 0 0 0 2048.48 85.0703 0 0 0 0 0 0 0 0 0 0 0 0 547.884 0 0 0 0 0 0 0 0 0 0 0 0 0 0 -825.602 0 0 
0 2355.34 0 0 -660.344 0 0 0 0 0 0.06 1583.68 0 0 0 -2160.18 1917.1 0 2395.32 0 0 0 0 0 0 0 492.035 0 0 -1036.03 0 -2442.93 0 0 0 0 0 0 0 0 0 0 0 0 0 0 0 0 0 0 0 0 0 0 0 0 0 0 0 0 0 0 0 
-366.604 0 0 2353.97 0 0 0 0 0 1920.3 -2421.26 0.01 0 0 0 0 0 0 0 1645.02 -297.937 0 1774.73 0 0 0 0 2376.4 0 0 1888.26 -1384.85 -1523.1 0 -1299.4 0 0 -935.469 0 0 1545.69 0 0 0 0 0 0 0 0 0 0 -1050.98 1719.49 -167.47 1405.76 0 0 0 0 0 0 0 0 
1963.33 1025.5 0 0 0 0 0 -1214.41 0 0 0 0 0.03 0 0 0 -834.758 586.642 0 0 516.449 0 1238.98 0 0 0 2191.31 0 1190.3 1799.45 1993.7 0 0 0 0 0 0 0 0 0 0 0 0 0 -2269.89 0 0 0 0 0 0 0 0 0 0 0 2356.87 0 0 0 -1678.14 0 0 
0 -187.307 0 0 0 0 0 653.325 885.876 0 0 0 0 0.09 1356.47 0 2296.14 0 0 0 0 0 -578.249 0 -1527.22 0 1907.64 2029.4 396.512 0 0 922.04 0 209.586 0 0 0 0 0 0 -2042.22 0 0 0 0 0 0 0 0 0 140.614 0 0 0 0 0 0 0 0 0 0 0 1116.14 
794.931 0 0 917.158 0 0 0 0 0 0 0 0 0 -831.858 0.06 0 0 0 0 0 0 787.606 559.023 0 2353.21 0 1761.6 0 -1889.48 0 0 0 0 0 -1079.67 0 -269.555 0 -297.327 0 0 0 0 0 0 0 0 0 0 0 0 0 0 0 -268.487 0 0 0 0 0 0 0 0 
335.17 0 0 0 0 0 616.55 -814.31 539.338 0 1239.59 0 0 0 0 0 0 0 799.814 0 1978.13 0 283.288 0 -1296.5 0 0 2027.73 732.826 0 466.399 0 0 1825.69 -2422.03 0 0 2069.99 0 0 -816.294 0 0 0 0 -1369.29 0 0 0 0 0 0 0 0 0 2424.16 -1742.53 0 0 0 0 0 0 
0 -1109.88 -1280.48 0 430.235 0 0 0 0 0 649.358 0 -1450.93 -1206.47 0 0 0.06 1675.24 0 -133.9 0 2352.29 2132.1 0 0 0 878.246 0 629.063 0 0 0 0 -1585.21 0 0 2398.53 0 0 0 0 0 0 161.061 0 0 0 0 0 0 0 0 0 0 0 0 0 0 0 1516.24 -950.88 1835.61 0 
0 0 0 -1665.01 0 0 0 0 827.738 0 0 0 1626.1 0 0 0 -1088.98 0.01 0 0 0 -2209.92 0 0 0 1355.1 0 642.643 0 189.901 0 0 0 2055.19 0 0 0 0 342.341 0 0 0 0 0 0 0 0 0 0 0 0 0 0 775.704 0 0 0 -444.273 -1993.39 0 0 0 0 
1007.49 0 985.977 0 0 1590.24 489.746 0 1000.93 0 436.491 0 0 0 0 202.567 0 0 0.09 0 0 0 0 0 2219.38 638.371 0 2202.6 0 0 0 0 761.055 0 0 0 0 0 0 0 -853.221 -852.611 0 0 0 847.88 1035.11 0 0 0 0 1280.33 0 0 0 0 0 0 0 0 0 0 0 
0 0 0 0 0 0 0 0 -2281.03 0 0 -392.85 0 0 0 0 -1792.58 0 0 0.06 1823.71 0 0 0 0 1204.34 0 0 1976.76 0 1674.47 0 0 2050.92 -1053.73 0 0 0 0 0 0 0 0 0 0 0 0 0 0 0 0 0 0 0 0 0 0 0 0 0 0 0 0 
438.78 -1617.25 525.605 0 1116.44 -472.198 -1574.68 0 0 0 0 880.535 -1149.4 0 0 2036.42 0 0 0 -222.556 0.04 0 0 0 0 413.602 2192.07 0 0 -850.475 1492.58 0 -748.695 0 0 0 0 0 0 0 1426.21 0 0 0 0 0 0 0 0 0 0 0 0 0 0 0 0 0 0 793.405 0 0 0 
1894.36 0 -1683.32 0 2125.08 -426.572 -906.323 2340.08 472.35 -1487.4 0 0 0 0 2295.68 0 237.968 278.863 0 0 0 0.01 0 0 0 0 0 0 661.565 0 0 0 0 0 990.097 0 -1860.79 0 1412.47 0 0 0 0 0 0 0 0 0 -1187.4 -2321.47 0 0 0 0 0 0 0 842.692 0 0 532.777 0 0 
0 0 0 0 0 -2171.16 0 956.832 2243.95 0 0 2057.33 2020.71 580.996 66.1489 1491.52 -938.063 0 0 0 0 0 0.08 0 0 0 0 0 -1000.78 0 0 0 0 0 -1480.07 1443.45 0 0 0 1160.7 0 0 551.393 0 0 0 0 0 0 0 0 -845.134 1057.39 0 0 0 0 0 1859.11 0 0 0 0 
1941.82 0 0 0 1902.91 0 0 0 -1514.86 2087.08 0 0 0 0 0 0 0 0 0 0 0 0 0 0.01 0 0 0 0 1113.24 0 1200.98 0 0 0 0 0 0 0 0 0 1792.12 0 0 0 -1601.69 0 0 0 0 0 0 0 0 0 0 0 0 0 0 0 0 0 0 
0 0 483.184 0 0 0 0 131.153 -2099.44 -315.79 0 0 0 1930.52 -794.015 1726.66 0 0 895.337 0 0 0 0 0 0.02 0 0 -259.636 -476.775 2401.12 0 0 0 1817.76 1704.69 2214.35 0 0 0 -1448.64 0 0 0 0 0 0 0 0 -1913.74 0 0 0 0 0 -477.233 0 0 1789.83 0 0 0 0 0 
0 0 0 105.823 0 0 0 0 750.679 -1645.33 0 0 0 0 0 0 0 1682.87 -1104.08 1013.9 1693.55 0 0 0 0 0.09 2246.85 1845.68 0 0 0 0 0 0 0 0 0 0 0 0 0 0 0 0 0 -2378.99 0 0 0 0 0 0 0 0 0 0 -1288.11 0 0 0 1135.82 0 0 
0 0 0 0 0 0 -2088.92 0 2018.57 0 1430.33 0 537.049 -1121.78 282.22 0 1940.44 0 0 0 -1740.7 0 0 0 0 -1046.4 0.09 0 447.325 0 0 -1367.31 1748.79 0 1220.51 0 0 1137.96 0 0 0 0 0 0 0 0 0 0 0 0 0 0 0 0 0 0 0 0 0 0 0 0 0 
0 0 -16.5563 0 0 50.8896 0 0 0 0 0 -1824.32 0 1005.36 0 1996.29 0 8.62148 2258.9 0 0 0 0 0 611.972 1184.96 0 0.08 -1383.02 1241.11 -95.1415 0 0 -827.433 0 0 0 0 0 0 0 0 0 0 0 0 804.086 0 0 -1070.82 0 0 0 0 -492.492 -789.59 0 0 0 0 0 0 0 
1352.35 0 0 0 1859.72 0 0 0 0 0 0 0 1382.41 -2288.81 621.738 654.393 1272.39 0 0 -1356.78 0 2487.03 1710.49 56.6881 1698.43 0 -1427.88 -41.4289 0.01 0 2369.53 0 0 0 -1756.57 0 0 0 0 0 0 0 2469.48 0 1777.93 0 0 0 0 -1214.1 0 0 178.152 0 0 0 2262.72 -2319.94 0 -919.294 0 2176.96 0 
-1893.29 0 0 0 -524.079 546.358 -382.931 2249.29 0 0 439.543 0 1009.02 0 0 0 0 -774.483 0 0 -1090.2 0 0 0 1293.6 0 0 490.814 0 0.07 0 0 0 0 0 2265.77 0 0 0 0 0 316.095 0 0 519.349 0 0 0 0 0 0 0 0 0 0 0 0 0 2252.34 0 0 0 0 
0 1511.96 353.175 0 0 0 1895.28 0 0 0 0 355.159 221.946 0 0 -1366.24 0 0 0 2180.32 -2133.78 0 0 944.319 0 0 0 1868.72 -786.691 0 0.09 1729.56 0 0 0 0 0 0 0 0 0 0 0 0 0 0 0 0 0 0 0 0 0 0 0 0 0 0 0 0 0 0 0 
1940.75 -1696.14 0 -1901.23 0 758.309 0 0 -1856.36 1438.41 1135.82 1211.2 0 -122.456 0 0 0 0 0 0 0 0 0 0 0 0 991.012 0 0 0 -735.115 0.08 1824.17 0 0 -1925.03 0 0 0 0 0 0 0 984.756 0 0 0 -638.829 0 0 0 0 0 0 0 0 0 1433.53 0 0 0 0 0 
0 0 1573.61 0 0 1084.09 84.6126 0 -1224.78 -1147.42 0 1071.43 0 0 0 0 0 0 2119.28 0 -381.863 0 0 0 0 0 -1401.64 0 0 0 0 2013.69 0.07 360.652 0 0 0 0 0 0 0 0 -1756.72 0 0 0 0 134.51 0 0 0 0 0 0 0 0 0 0 0 0 0 0 0 
0 0 0 0 0 241.02 0 0 0 0 0 0 0 -2405.7 0 1464.96 -902.814 677.74 0 -1690.65 0 0 0 0 1536.07 0 0 -2210.53 0 0 0 0 479.369 0.04 1016.04 1916.18 0 0 0 0 0 0 0 0 0 0 0 0 254.601 0 0 0 0 1350.98 1537.45 0 0 1431.24 0 0 0 1965.47 0 
-1852.7 0 0 0 1515.93 0 1630.68 0 0 0 0 1328.55 0 0 2449.8 2397.92 0 0 0 751.442 0 1709.57 -2075.64 0 -1027.02 0 680.639 0 1041.06 0 0 0 0 258.415 0.08 0 0 741.066 0 0 0 0 0 0 0 0 2396.39 0 0 0 0 0 871.38 0 -2453.61 0 0 0 0 0 0 0 2200 
-176.778 0 0 0 0 0 1591.77 2359.77 0 0 0 0 0 0 0 0 0 0 0 0 0 0 1674.17 0 763.497 0 0 0 0 1267.36 0 -800.882 0 -1084.55 0 0.07 0 0 0 0 0 0 0 0 0 0 0 0 0 0 0 0 0 0 1828.9 0 0 0 1140.4 0 0 0 0 
0 227.744 0 0 -25.8644 0 0 0 0 0 0 0 0 0 -256.584 0 280.694 0 0 0 0 1944.41 0 0 0 0 0 0 0 0 0 0 0 0 0 0 0 0 0 0 0 0 0 0 0 2015.21 0 0 0 0 2274.93 0 0 0 2181.54 0 0 0 0 0 0 0 0 
0 0 0 0 0 0 0 0 674.535 0 0 639.592 0 0 0 -2193.29 0 0 0 0 0 0 0 0 0 0 2440.95 0 0 0 0 0 0 0 -18.8452 0 0 0.03 0 0 0 0 0 0 0 894.574 0 1066.24 0 0 -1331.75 0 0 0 0 0 0 0 0 0 0 2143.7 0 
0 0 1823.4 0 0 0 0 0 0 0 0 0 0 0 1947.46 0 0 1246.91 0 0 0 -36.6985 0 0 0 0 0 0 0 0 0 0 0 0 0 0 0 0 0.08 0 0 0 0 0 0 0 0 0 0 0 0 0 0 -2369.08 0 0 0 0 0 0 0 -780.435 0 
0 0 1511.35 0 0 0 965.377 2307.58 0 0 0 0 0 0 0 0 0 0 0 0 0 0 1393.09 0 -1421.93 0 0 0 0 0 0 0 0 0 0 0 0 0 0 0 0 0 0 0 0 0 124.744 0 0 0 0 0 0 0 0 0 -901.746 1724.83 0 0 1572.24 0 0 
0 0 -1380.58 0 0 0 0 0 0 0 0 -999.1 0 -700.171 0 2016.59 0 0 2227.01 0 1129.57 0 0 952.712 0 0 0 0 0 0 0 0 0 0 0 0 0 0 0 0 0.02 0 0 0 0 1214.56 0 0 242.698 0 0 0 0 0 0 0 0 0 0 0 0 0 0 
1748.18 0 0 0 0 0 -1175.95 0 0 0 0 0 0 0 0 0 0 0 727.638 0 0 0 0 0 0 0 0 0 0 -336.543 0 0 0 0 0 0 0 0 0 0 0 0 0 0 0 500.58 0 1330.84 0 0 0 0 0 1964.25 0 0 0 0 0 0 0 0 0 
0 0 0 0 0 1515.93 0 0 0 0 0 0 0 0 0 0 0 0 0 0 0 0 -1660.59 0 0 0 0 0 1720.25 0 0 0 1369.9 0 0 0 0 0 0 0 0 0 0.08 0 0 0 0 0 0 0 0 0 0 0 0 0 0 0 0 0 0 0 0 
0 1822.18 0 0 0 0 0 0 0 0 0 0 0 0 0 0 -521.638 0 0 0 0 0 0 0 0 0 0 0 0 0 0 1062.43 0 0 0 0 0 0 0 0 0 0 0 0 1850.11 0 0 0 0 0 0 0 0 -417.112 0 0 0 624.027 0 0 0 1014.05 0 
0 0 0 0 0 0 0 0 1712.78 0 0 0 -2111.04 0 0 0 0 0 0 0 0 0 0 1663.79 0 0 0 0 1529.05 -1501.13 0 0 0 0 0 0 0 0 0 0 0 0 0 681.86 0.06 -1787.39 0 1434.29 0 0 0 0 0 0 0 0 0 0 0 0 0 0 0 
0 0 0 0 0 0 0 -1623.05 0 -1514.1 0 0 0 0 0 1883.68 0 0 1441.31 0 0 0 0 0 0 192.648 0 0 0 0 0 0 0 0 0 0 95.9044 1678.75 0 0 -1526.15 2105.4 0 0 -197.531 0.06 0 184.713 0 0 0 0 0 0 1063.8 -1833.17 0 0 1788.61 0 0 0 -304.651 
0 0 0 0 0 0 0 0 0 0 0 0 0 0 0 0 0 0 985.672 0 0 0 0 0 0 0 0 -1098.9 0 0 0 0 0 0 1975.54 0 0 0 0 62.7918 0 0 0 0 0 0 0.06 0 0 -306.94 0 0 0 0 0 0 0 0 622.959 0 0 0 0 
0 0 0 0 0 0 0 -1662.42 0 0 0 0 0 0 0 0 0 0 0 0 0 0 0 0 0 0 0 0 0 0 0 363.399 1135.67 0 0 0 0 2339.17 0 0 0 2141.71 0 0 2365.87 1427.58 0 0 0 0 0 0 0 -1528.75 0 0 401.395 0 0 0 0 -1021.84 0 
844.066 0 0 0 0 0 0 0 0 0 0 0 0 0 0 0 0 0 0 0 0 -1567.51 0 0 -94.8363 0 0 0 0 0 0 0 0 170.675 0 0 0 0 0 0 2196.49 0 0 0 0 0 0 0 0.09 0 0 0 0 0 0 0 0 0 0 0 0 -1590.55 1419.8 
0 0 0 0 0 0 0 0 480.132 0 0 0 0 0 0 0 0 0 0 0 0 -1584.75 0 0 0 0 0 1657.99 801.798 0 0 0 0 0 0 0 0 0 0 0 0 0 0 0 0 0 2410.43 0 0 0.09 0 1193.66 0 0 0 1625.19 0 0 0 0 0 497.833 0 
0 0 0 0 0 0 0 0 0 0 0 0 0 1937.39 0 0 0 0 0 0 0 0 0 0 0 0 0 0 0 0 0 0 0 0 0 0 46.617 2073.2 0 0 0 0 0 0 0 0 0 0 0 0 0.06 0 0 0 0 0 0 0 0 0 1505.71 0 0 
0 0 0 0 0 0 0 0 0 0 0 2373.2 0 0 0 0 0 0 -2434.84 0 0 0 377.438 0 0 0 0 0 0 0 0 0 0 0 0 0 0 0 0 0 0 0 0 0 0 0 0 0 0 2008.96 0 0.02 0 0 0 0 0 0 0 0 0 0 0 
0 0 0 0 0 0 0 0 0 0 0 -756.02 0 0 0 0 0 0 0 0 0 0 2106.01 0 0 0 0 0 2131.49 0 0 0 0 0 148.701 0 0 0 0 0 0 0 0 0 0 0 0 0 0 0 0 0 0.06 0 0 420.621 0 0 0 0 0 0 0 
0 0 0 0 0 0 2032.3 0 0 0 0 -1138.87 0 0 0 0 0 -1814.25 0 0 0 0 0 0 0 0 0 0 0 0 0 0 0 -1501.89 0 0 0 0 1552.71 0 0 -586.947 0 203.33 0 0 0 2407.53 0 0 0 0 0 0.09 0 0 0 0 0 -1934.19 0 0 0 
0 0 0 0 0 0 2226.25 0 0 0 0 2219.08 0 0 -993.759 0 0 0 0 0 0 0 0 0 1914.2 0 0 1195.33 0 0 0 0 0 699.713 -818.125 -151.296 -1279.26 0 0 0 0 0 0 0 0 1354.95 0 0 0 0 0 0 0 0 0.08 0 0 -1274.38 1117.82 1521.42 0 0 0 
2383.11 0 0 0 763.192 646.153 0 0 0 0 0 0 0 0 0 777.383 0 0 0 0 0 0 0 0 0 0 0 -447.325 0 0 0 0 0 0 0 0 0 0 0 0 0 0 0 0 0 -1662.11 0 0 0 -166.25 0 0 -495.392 0 0 0.06 0 0 -733.589 0 0 0 0 
0 0 0 0 0 0 0 0 0 0 0 0 542.39 0 0 -145.192 0 0 0 0 0 0 0 0 0 1985.46 0 0 582.522 0 0 0 0 0 0 0 0 0 0 2460.78 0 0 0 0 0 0 0 -1713.39 0 0 0 0 0 0 0 0 0.02 0 0 0 0 0 0 
0 0 0 0 0 1631.75 0 0 0 0 0 0 0 0 0 0 0 545.442 0 0 0 -268.639 0 0 1457.95 0 0 0 1086.38 0 0 1294.52 0 383.236 0 0 0 0 0 -1585.67 0 0 0 -156.178 0 0 0 0 0 0 0 0 0 0 -1746.8 0 0 0.07 -644.78 0 0 0 0 
0 0 0 0 0 0 -378.964 0 0 0 0 0 0 0 0 0 0 680.486 0 0 0 0 1446.96 0 0 0 0 0 0 -809.732 0 0 0 0 0 -1835.61 0 0 0 0 0 0 0 0 0 2257.53 1891 0 0 0 0 0 0 0 1697.82 -888.623 0 1425.29 0.01 0 0 0 0 
0 0 0 0 0 0 0 -312.281 0 0 0 0 0 0 0 0 1412.78 0 0 0 1314.81 0 0 0 0 0 0 0 -813.7 0 0 0 0 0 0 0 0 0 0 0 0 0 0 0 0 0 0 0 0 0 0 0 0 -874.889 2051.53 0 0 0 0 0.01 0 0 -511.261 
0 0 176.016 0 0 0 0 0 0 -2306.05 0 0 708.563 0 0 0 363.247 0 0 0 0 2464.75 0 0 0 -1699.96 0 0 0 0 0 0 0 0 0 0 0 0 0 2059.77 0 0 0 0 0 0 0 0 0 0 1105.15 0 0 0 0 0 0 0 0 0 0.04 0 0 
0 0 0 0 0 0 944.624 0 0 0 0 0 0 0 0 0 1606.88 0 0 0 0 0 0 0 0 0 0 0 1188.47 0 0 0 0 1800.67 0 0 0 145.802 681.707 0 0 0 0 -573.977 0 0 0 493.713 -1057.54 1241.57 0 0 0 0 0 0 0 0 0 0 0 0.06 0 
0 0 581.454 0 0 0 0 0 0 0 0 0 0 2219.38 0 0 0 0 0 0 0 0 0 0 0 0 0 0 0 0 0 0 0 0 76.6778 0 0 0 0 0 0 0 0 0 0 -862.682 0 0 -43.26 0 0 0 0 0 0 0 0 0 0 835.063 0 0 0.05 
