*Vertices 39
*Matrix 
0.07 0 0 0 0 0 0 0 2273.71 0 0 0 0 1965.62 0 0 0 -939.741 2346.34 0 0 0 0 0 0 2155.29 0 0 729.926 0 0 0 0 1047.78 0 0 0 0 0 
0 0.09 0 0 876.263 0 0 0 0 0 0 0 0 0 -233.695 0 0 0 0 0 0 0 0 0 0 0 0 0 0 0 0 0 0 0 0 0 0 0 0 
0 0 0.03 -374.233 0 0 0 0 2187.49 2467.04 -1051.13 0 0 0 0 0 0 0 0 -1872.23 0 0 0 0 0 0 0 0 0 0 0 0 0 0 2405.09 0 0 0 0 
0 0 1609.01 0.04 0 0 0 0 0 0 2230.52 0 0 824.992 0 0 0 0 -1824.47 -513.855 0 0 0 0 0 0 -1921.67 0 0 0 0 0 0 0 0 0 0 0 0 
0 2116.84 0 0 0.03 0 0 0 215.384 2482.45 0 0 0 0 0 0 0 -346.767 0 0 0 0 0 0 0 0 0 327.387 0 0 0 0 0 0 0 0 1467.1 0 0 
0 0 0 0 0 0.07 -1270.87 0 0 0 1744.21 0 0 0 0 0 -461.821 0 0 0 0 0 0 0 0 0 0 0 0 0 0 0 0 0 0 0 0 0 0 
0 0 0 0 0 2061.3 0 0 1513.95 327.235 0 0 0 0 1432 0 0 0 0 0 0 0 0 0 0 0 0 0 0 0 0 0 0 0 0 0 0 0 0 
0 0 0 0 0 0 0 0.02 0 2411.5 418.943 0 0 0 0 0 0 0 0 0 0 0 0 0 0 0 0 0 0 0 -29.2215 0 0 0 0 0 0 0 0 
2111.65 0 1021.68 0 393.002 0 -672.857 0 0.08 0 0 2291.25 0 0 0 0 0 0 0 0 0 0 0 0 0 0 -1495.48 0 713.446 0 0 0 0 0 0 0 0 2297.97 0 
0 0 1956.01 0 1366.54 0 -1692.48 402.005 0 0.03 0 0 0 0 0 0 0 0 0 0 0 0 0 0 0 0 0 0 0 0 0 0 0 0 0 0 0 0 0 
0 0 1146.5 109.18 0 801.035 0 2366.33 0 0 0.02 0 -765.023 0 2376.4 -1775.34 0 0 0 0 0 0 0 0 0 0 0 0 0 2385.4 0 0 0 0 0 0 0 0 0 
0 0 0 0 0 0 0 0 1860.79 0 0 0.08 0 0 0 0 1762.22 0 0 0 0 0 0 0 0 0 0 0 0 0 0 0 0 2040.85 0 1309.63 0 0 0 
0 0 0 0 0 0 0 0 0 0 2456.36 0 0.09 0 -930.891 0 0 826.67 0 0 0 0 0 0 0 0 735.878 0 0 0 0 0 0 0 0 0 -287.561 0 0 
1816.23 0 0 1028.24 0 0 0 0 0 0 0 0 0 0.02 0 0 0 71.1844 0 0 0 -1657.08 0 0 0 0 0 0 0 1276.36 0 0 0 0 0 936.079 0 169.454 -2108.75 
0 1757.79 0 0 0 0 2360.23 0 0 0 -521.332 0 -171.896 0 0.08 0 0 0 0 -1323.51 0 0 0 0 0 670.721 0 0 0 0 0 0 0 0 0 0 0 0 1092.33 
0 0 0 0 0 0 0 0 0 0 926.771 0 0 0 0 0 0 0 0 0 0 0 0 0 0 0 0 0 0 0 0 0 0 0 470.367 0 0 0 0 
0 0 0 0 0 2491 0 0 0 0 0 758.919 0 0 0 0 0.06 0 0 0 2428.13 -1787.24 0 1011.46 0 0 0 0 0 0 0 0 0 -2023 0 0 0 1142.23 -1162.83 
-922.193 0 0 0 727.943 0 0 0 0 0 0 0 1991.87 -115.131 0 0 0 0 0 0 0 -948.897 0 0 0 2252.95 0 0 0 0 0 -446.562 0 0 0 0 0 2452.39 0 
2117.3 0 0 297.174 0 0 0 0 0 0 0 0 0 0 0 0 0 0 0.07 0 0 0 0 0 0 212.485 0 0 0 0 0 0 0 0 0 0 0 0 0 
0 0 1669.59 -1340.91 0 0 0 0 0 0 0 0 0 0 1135.21 0 0 0 0 0.08 0 0 0 0 0 0 0 -1364.25 0 -1244.77 0 1036.18 0 -13.0467 0 0 0 0 0 
0 0 0 0 0 0 0 0 0 0 0 0 0 0 0 0 399.411 0 0 0 0.08 0 1674.02 0 0 -39.5978 0 0 0 0 -1335.26 0 2453.76 0 0 0 0 0 0 
0 0 0 0 0 0 0 0 0 0 0 0 0 1683.63 0 0 2195.88 1966.84 0 0 0 0.04 0 0 1711.4 429.777 0 0 0 0 0 0 0 931.806 0 0 0 0 0 
0 0 0 0 0 0 0 0 0 0 0 0 0 0 0 0 0 0 0 0 2354.27 0 0.02 0 0 0 0 -44.4807 0 0 1350.67 0 0 1587.95 0 836.589 0 0 0 
0 0 0 0 0 0 0 0 0 0 0 0 0 0 0 0 1881.69 0 0 0 0 0 0 0.06 0 0 0 1788.16 0 0 461.211 0 0 0 0 0 0 0 0 
0 0 0 0 0 0 0 0 0 0 0 0 0 0 0 0 0 0 0 0 0 1284.91 0 0 0.07 0 0 0 1967.6 0 0 0 0 0 0 0 0 0 0 
-1769.69 0 0 0 0 0 0 0 0 0 0 0 0 0 802.103 0 0 1715.83 1845.84 0 1162.68 785.012 0 0 0 0 0 0 -1612.06 0 0 0 0 0 0 0 0 0 0 
0 0 0 -252.922 0 0 0 0 -1229.67 0 0 0 2492.52 0 0 0 0 0 0 0 0 0 0 0 0 0 0.09 0 0 0 0 -279.321 0 0 0 0 0 0 0 
0 0 0 0 168.538 0 0 0 0 0 0 0 0 0 0 0 0 0 0 1549.5 0 0 1196.86 2359.16 0 0 0 0.07 0 -575.045 0 0 0 0 0 0 0 0 0 
1897.41 0 0 0 0 0 0 0 1442.08 0 0 0 0 0 0 0 0 0 0 0 0 0 0 0 2288.2 -964.003 0 0 0.01 0 0 0 0 0 2390.74 -618.381 0 0 0 
0 0 0 0 0 0 0 0 0 0 2353.36 0 0 1273.16 0 0 0 0 0 1423.92 0 0 0 0 0 0 0 531.709 0 0.06 0 0 1409.88 0 0 -497.528 0 0 0 
0 0 0 0 0 0 0 1363.34 0 0 0 0 0 0 0 0 0 0 0 0 1136.89 0 -85.6807 -784.86 0 0 0 0 0 0 0.06 0 0 0 0 0 0 0 0 
0 0 0 0 0 0 0 0 0 0 0 0 0 0 0 0 0 2164.14 0 -1568.73 0 0 0 0 0 0 1826.61 0 0 0 0 0.02 0 0 0 0 0 0 0 
0 0 0 0 0 0 0 0 0 0 0 0 0 0 0 0 0 0 0 0 -802.713 0 0 0 0 0 0 0 0 924.024 0 0 0.03 0 890.759 0 0 0 0 
-1103.93 0 0 0 0 0 0 0 0 0 0 -1543.7 0 0 0 0 1779.92 0 0 -1555.76 0 621.586 1429.11 0 0 0 0 0 0 0 0 0 0 0.03 0 0 0 0 1089.59 
0 0 2454.68 0 0 0 0 0 0 0 0 0 0 0 0 -2379.91 0 0 0 0 0 0 0 0 0 0 0 0 1800.06 0 0 0 -17.3193 0 0.02 0 0 0 0 
0 0 0 0 0 0 0 0 0 0 0 1092.49 0 -2187.49 0 0 0 0 0 0 0 0 479.064 0 0 0 0 0 -1707.43 2266.38 0 0 0 0 0 0.05 902.814 0 0 
0 0 0 0 -926.771 0 0 0 0 0 0 0 2321.62 0 0 0 0 0 0 0 0 0 0 0 0 0 0 0 0 0 0 0 0 0 0 -375.149 0.03 0 0 
0 0 0 0 0 0 0 0 1466.03 0 0 0 0 -1019.24 0 0 -1814.25 1646.09 0 0 0 0 0 0 0 0 0 0 0 0 0 0 0 0 0 0 0 0.08 0 
0 0 0 0 0 0 0 0 0 0 0 0 0 1769.69 1254.39 0 207.45 0 0 0 0 0 0 0 0 0 0 0 0 0 0 0 0 514.771 0 0 0 0 0.03 
