*Vertices 56
*Matrix 
0.06 0 0 0 0 0 0 2423.55 0 1889.48 0 0 -2143.24 0 0 -2000.11 0 0 0 0 1828.44 -2036.27 0 0 0 0 0 0 0 2235.56 0 0 0 0 0 0 0 0 0 0 1723.15 0 0 -1479.77 2329.25 0 0 37.1563 0 1259.12 0 2094.56 0 0 -1767.86 0 
0 0.07 0 2136.98 -796.609 0 0 -110.401 2132.1 -528.199 553.224 0 0 0 -214.774 0 0 2080.98 0 0 0 -1005.51 0 -835.673 0 0 0 -850.169 0 0 0 0 0 0 1762.98 0 2352.6 0 0 0 0 0 0 1905.5 -2164.91 -1879.25 0 1283.68 0 0 0 704.291 2097.16 -429.93 1960.74 0 
0 0 0.02 0 0 0 0 0 0 0 0 0 0 0 286.492 1402.4 0 2087.69 0 0 24.4911 0 0 -375.912 0 0 0 2216.18 -167.623 -157.399 0 0 0 -1635.26 0 0 2175.59 0 0 0 0 0 0 0 0 0 1879.71 0 0 0 0 0 0 0 0 -222.098 
0 2183.83 0 0.03 0 0 0 -2173.76 1662.27 0 0 747.932 1690.95 0 0 0 0 0 -1980.27 0 -1805.55 0 0 0 0 0 576.266 -2361.9 0 0 -1016.04 0 -429.014 0 178.152 959.426 0 0 0 0 -2201.68 0 0 0 0 0 0 0 0 1409.27 0 0 56.2304 0 2262.57 0 
0 1982.86 0 0 0.03 0 0 0 0 0 0 0 0 -2033.98 0 0 1717.66 0 0 0 0 -1764.5 -201.041 0 0 0 0 0 0 -661.87 0 -1186.18 0 0 0 0 0 0 1976.15 -950.117 -1339.69 0 0 1694.62 0 0 0 -2358.09 0 0 0 1775.95 0 0 2032.61 0 
0 0 0 0 0 0.07 0 2147.97 0 0 0 0 0 773.263 0 1611 0 0 0 0 2438.51 0 0 0 0 0 0 -2377.47 -991.775 243.461 0 0 -1900.46 2500 0 0 705.817 164.266 0 0 0 0 0 0 0 0 0 0 0 1111.71 1220.21 1077.38 0 0 0 0 
0 0 0 0 0 0 0.01 1212.73 -2185.35 0 -936.842 0 0 0 0 0 0 2366.63 1754.74 -727.485 0 -937.3 0 0 1930.07 0 0 0 0 0 0 0 0 0 0 0 0 0 2419.58 0 -1587.5 -1616.03 252.77 0 1982.71 0 0 0 0 0 0 0 0 -604.648 0 0 
1545.53 2430.88 0 1025.65 0 477.996 794.015 0.06 0 -1589.18 0 0 0 0 0 0 0 1137.81 0 0 0 0 -1626.87 0 -2015.06 0 0 -1699.96 0 0 0 -660.649 0 -768.227 0 2204.12 0 2159.26 -499.207 0 0 -1509.06 380.032 0 0 0 319.147 0 1591.77 0 0 1438.87 614.872 0 0 0 
0 -296.258 0 2441.4 0 0 -1122.7 0 0.05 1047.01 0 0 0 0 0 0 0 0 0 -683.386 0 0 0 0 0 1604.89 0 0 0 2408.6 -947.676 0 0 0 0 0 0 0 0 -1760.54 -1806.62 0 0 0 0 812.479 -1596.96 0 1339.99 0 0 -2490.08 0 0 0 1804.33 
1011.31 -701.697 0 0 0 0 0 683.081 -2158.5 0.02 530.488 0 1266.59 -773.11 0 1242.18 45.0911 0 1552.71 0 2194.97 -767.159 0 0 0 -1508.61 0 2476.2 0 2219.99 2003.62 -598.697 0 971.938 0 0 0 0 0 0 0 0 0 283.898 -1896.04 0 0 -1965.62 0 -474.639 0 0 0 0 0 0 
0 -627.842 0 0 0 0 -321.436 0 0 -196.31 0 0 0 0 0 0 1690.04 0 0 1649.45 1373.26 0 0 0 0 269.402 0 0 0 -1432.92 0 0 1997.67 0 1361.96 -579.623 1254.69 0 -1936.48 0 2253.41 0 0 0 0 0 0 0 0 0 0 1867.81 0 0 0 0 
0 0 0 -1457.64 0 0 0 0 0 0 0 0.08 0 0 -630.589 0 0 -1162.83 0 0 0 0 1020 1744.36 0 2346.64 2286.22 0 0 0 185.629 -845.592 1170.16 0 0 0 -1707.89 0 0 0 2084.34 1566.44 0 0 0 0 1756.72 0 0 0 0 0 0 0 0 0 
1849.35 0 0 2414.7 0 0 0 0 0 -1194.11 0 0 0.06 0 0 0 2035.97 0 0 2128.44 -361.568 0 0 0 0 0 0 0 1423.46 0 0 0 0 0 -1773.66 0 -67.3696 0 0 1604.59 -137.562 -396.512 0 0 0 0 904.035 1696.91 0 0 -195.09 0 0 -380.642 0 2249.75 
0 0 0 0 1251.49 2040.09 0 0 0 -387.356 0 0 0 0.01 0 0 0 0 0 0 0 1043.35 803.781 0 0 -788.827 1636.33 -2095.63 0 762.886 2091.51 0 0 1064.41 523.316 0 0 0 0 0 0 0 0 0 1938.61 0 2375.79 0 0 -1547.67 0 0 1356.47 -213.706 0 0 
0 2312.92 1799.14 0 0 0 0 0 0 0 0 -1217.15 0 0 0.02 0 0 0 0 2191 967.666 835.978 0 1755.5 0 0 0 -1028.09 0 34.8674 0 -2492.68 197.531 0 1737.49 0 -375.759 266.655 103.076 694.678 0 313.654 0 0 0 -738.929 163.808 0 0 0 102.924 0 0 0 -747.017 -2461.85 
1981.64 0 1298.33 0 0 898.236 0 0 0 81.5607 0 0 0 0 0 0.08 0 0 0 0 0 0 0 0 1923.2 -772.042 0 0 0 0 0 0 0 -38.5296 0 0 2125.54 0 -224.998 1058.15 0 0 274.133 0 0 0 0 0 0 0 0 722.602 0 0 0 -636.692 
0 0 0 0 -709.021 0 0 0 0 -512.787 1860.33 0 2113.79 0 0 0 0.01 0 0 0 0 -2399.75 -1573.76 0 0 0 -347.682 0 2439.42 0 0 0 0 0 0 0 2231.13 2136.22 0 0 0 0 0 -485.168 0 0 0 2272.64 0 642.796 0 0 0 0 0 0 
0 -1299.71 -1248.13 0 0 0 2008.8 -1336.48 0 0 0 1294.67 0 0 0 0 0 0.03 901.135 0 0 0 0 0 0 1121.17 2145.07 0 1847.21 0 0 0 0 0 1542.18 0 0 0 2052.75 0 0 0 0 0 1882.61 0 899.762 0 0 0 -2481.69 0 0 0 0 0 
0 0 0 1213.8 0 0 -586.337 0 0 134.053 0 0 0 0 0 0 0 -151.906 0.02 -1193.66 0 -239.952 0 0 0 0 1595.58 0 0 2192.83 0 0 0 -2209.46 0 0 1983.78 0 0 0 2305.14 0 0 -311.67 -259.789 -292.291 -2272.64 0 0 0 2211.29 0 59.2822 2447.36 0 0 
0 0 0 0 0 0 1548.74 0 1817.15 0 -1835 0 -294.733 0 332.881 0 0 0 -745.949 0.03 0 0 0 0 1158.56 0 0 900.83 0 0 0 0 0 1492.13 0 0 0 0 0 0 0 0 0 -488.678 0 0 0 0 0 465.178 -1308.86 0 0 1360.9 0 0 
933.943 0 1054.49 -353.328 0 1965.62 0 0 0 -993.759 1157.34 0 1829.2 0 445.799 0 0 0 0 0 0.09 0 0 0 0 0 600.986 -1899.09 0 145.192 0 0 0 -597.781 0 0 2107.38 -1410.95 0 0 2250.36 0 0 -1811.2 0 0 0 0 0 0 205.466 -555.055 0 0 0 0 
-598.239 1039.23 0 0 1682.71 0 -667.211 0 0 675.909 0 0 0 -728.858 678.655 0 1380.12 0 -186.392 0 0 0.01 0 -1743.75 0 0 0 0 0 0 0 1382.87 0 0 0 1824.93 -818.278 -942.335 0 0 0 0 0 935.316 0 527.741 0 0 0 0 0 894.726 0 0 0 1189.23 
0 0 0 0 1534.85 0 0 2433.47 0 0 0 2380.98 0 2206.56 0 0 -1027.02 0 0 0 0 0 0.02 0 0 0 1610.69 489.593 0 0 0 -2288.96 0 0 517.212 2004.23 0 0 0 0 0 -1622.9 0 0 0 0 0 0 0 -746.864 -1101.03 0 0 0 -1993.7 0 
0 760.14 -1255 0 0 0 0 0 0 0 0 -2231.59 0 0 2248.53 0 0 0 0 0 0 1894.82 0 0.03 0 0 0 780.892 0 -2013.53 0 0 0 0 452.818 877.178 0 0 0 0 0 0 0 0 0 0 0 -714.057 0 0 1661.5 0 2250.21 0 2283.62 -2360.53 
0 0 0 0 0 0 2227.77 686.438 0 0 0 0 0 0 0 1490.75 0 0 0 -1826.15 0 0 0 0 0.05 0 2213.13 0 0 0 0 0 0 903.272 0 0 1050.22 675.756 0 0 0 0 0 2081.29 -1942.73 0 0 -244.072 0 0 -116.81 0 1579.26 0 -2145.53 1815.47 
0 0 0 0 0 0 0 0 1579.26 115.436 2080.68 1964.55 0 -939.131 0 1984.69 0 -1732 0 0 0 0 0 0 0 0.03 0 0 0 0 379.269 -1973.4 2268.36 0 883.435 2039.63 481.658 -1398.43 -2204.43 0 0 0 0 0 1172.29 0 0 0 0 -2043.75 0 -1726.66 1069.75 1981.49 0 0 
0 0 0 2014.15 0 0 0 0 0 0 0 772.5 0 1912.82 0 0 -151.448 -750.069 -1580.94 0 196.158 0 -898.083 0 1417.81 0 0 0 0 0 0 -778.603 -779.672 528.962 328.455 0 -1587.95 0 0 0 1997.21 0 0 0 0 0 0 -718.177 0 -1060.29 0 0 949.965 0 -912.732 0 
0 1438.57 -1701.03 1207.08 0 -920.057 0 2193.44 0 -2461.55 0 0 0 2312.01 -713.752 0 0 0 0 -120.167 780.129 0 2049.85 1328.55 0 0 0 0.06 -1181.14 2138.81 0 0 0 0 0 0 1767.25 0 0 0 -2478.94 0 0 0 695.288 0 0 -2138.51 0 2421.87 -1013.6 0 0 -2070.6 0 0 
0 0 1485.72 0 0 -302.057 0 0 0 0 0 0 1459.93 0 0 0 279.626 -2453.76 0 0 0 0 0 0 0 0 0 -179.067 0.01 0 0 2297.97 0 0 0 0 0 0 -2373.04 0 0 1088.67 0 0 0 1032.52 0 0 2319.33 0 -2078.39 0 0 0 0 470.367 
1246.91 0 143.818 0 2122.94 217.215 0 0 -1092.49 -2019.33 1276.97 0 0 217.215 -1409.12 0 0 0 -1922.9 0 1655.86 0 0 1577.58 0 0 0 1548.13 0 0 0 0 0 0 1549.04 -1064.87 0 0 0 0 0 889.081 -1414 0 1103.17 0 0 0 -534.913 2312.92 0 -283.593 0 0 0 0 
0 0 0 849.254 0 0 0 0 -1826.91 1833.32 0 828.501 0 193.716 0 0 0 0 0 0 0 0 0 0 0 1689.58 0 0 0 0 0.04 272.454 0 -1544.31 0 0 0 -28.6111 0 0 0 0 0 0 0 0 -299.463 0 0 1876.81 0 0 0 0 0 0 
0 0 0 0 -849.864 0 0 -782.876 0 2033.83 0 -1386.53 0 0 1109.42 0 0 0 0 0 0 1907.94 2437.13 0 0 879.62 -930.891 0 1150.32 0 1672.34 0.07 0 1390.8 0 0 -1922.59 0 -1584.75 2353.82 0 0 1090.81 0 761.055 -210.196 0 0 1431.09 -141.377 0 0 0 0 1193.81 0 
0 0 0 1580.32 0 -2173.76 0 0 0 0 489.593 -883.129 0 0 2037.19 0 0 0 0 0 0 0 0 0 0 2225.79 -1782.2 0 0 0 0 0 0.06 0 -1091.11 0 0 0 1894.06 0 1605.66 0 0 0 1471.22 0 0 2430.88 0 0 -1097.83 466.399 -1870.71 0 0 0 
0 0 2171.47 0 0 2254.94 0 -720.313 0 -189.596 0 0 0 65.9963 0 956.679 0 0 -933.638 1481.75 -530.488 0 0 0 -1227.53 0 -378.201 0 0 0 -2068.77 1311.61 0 0 0 -42.8022 0 0 1023.36 1399.66 0 2417.14 0 0 -1436.74 0 0 0 0 0 0 2407.07 0 0 0 1027.02 
0 300.684 0 -1402.55 0 0 0 0 0 0 -636.998 0 1402.71 2038.56 -290.002 0 0 627.079 0 0 0 0 -1355.56 1179.62 0 1232.72 -1664.86 0 0 -1230.89 0 0 -809.732 0 0.08 1645.18 0 0 -191.58 0 0 0 0 0 0 0 2343.59 783.486 927.534 0 571.688 520.722 1947 0 0 0 
0 0 0 -2351.22 0 0 0 100.94 0 0 798.746 0 0 0 0 0 0 0 0 0 0 -188.223 1442.84 683.844 0 1175.34 0 0 0 812.937 0 0 0 -1667.15 -2272.18 0.03 0 2118.37 0 -921.125 0 0 0 0 0 0 0 0 0 0 631.809 0 0 0 0 1052.2 
0 950.117 734.657 0 0 -1052.81 0 0 0 0 -1789.53 -307.092 928.602 0 1452.6 1440.4 -763.649 0 919.294 0 2007.28 -1578.34 0 0 1236.69 -1516.39 1290.09 2166.59 0 0 0 1197.32 0 0 0 0 0.05 0 0 0 287.713 0 -22.2022 2129.05 0 0 0 0 0 0 0 0 -349.208 0 2082.2 0 
0 0 0 0 0 568.484 0 495.697 0 0 0 0 0 0 -349.055 0 1212.58 0 0 0 2098.99 788.98 0 0 -15.9459 755.104 0 0 0 0 2461.09 0 0 0 0 744.423 0 0.01 0 0 0 0 0 0 0 0 0 0 0 0 0 0 -912.885 -335.017 0 0 
0 0 0 0 -2314.91 0 978.195 -1623.97 0 0 127.949 0 0 0 2492.83 -741.981 0 -994.98 0 0 0 0 0 0 0 378.201 0 0 -1882.76 0 0 1374.32 -795.846 1189.23 -985.672 0 0 0 0.09 2439.27 2208.24 0 971.328 0 0 0 -1972.03 0 0 -571.688 0 0 0 0 1279.26 0 
0 0 0 0 -725.196 0 0 0 2316.28 0 0 0 2338.86 0 2073.81 2277.83 0 0 0 0 0 0 0 0 0 0 0 0 0 0 0 66.6066 0 -823.771 0 1905.04 0 0 1936.78 0.08 0 0 734.962 0 0 0 -2270.35 0 1985.61 109.943 0 0 0 0 0 0 
331.507 0 0 1855.14 2317.65 0 -586.337 0 -581.759 0 -1671.88 768.38 1651.28 0 0 0 0 0 717.566 0 261.315 0 0 0 0 0 1551.33 1040.15 0 0 0 0 530.488 0 0 0 -655.614 0 -698.492 0 0.08 0 0 1444.67 1040.76 0 0 0 0 0 1016.19 0 290.002 0 0 -476.928 
0 0 0 0 0 0 81.2555 2151.33 0 0 0 2468.72 972.549 0 650.883 0 0 0 0 0 0 0 -1282.92 0 0 0 0 0 -2373.04 -1446.81 0 0 0 2449.95 0 0 0 0 0 0 0 0.07 919.752 42.3444 0 739.082 0 1137.2 0 0 1358.76 1772.13 0 -1115.22 0 0 
0 0 0 0 0 0 1473.97 -1615.88 0 0 0 0 0 0 0 -1704.38 0 0 0 0 0 0 0 0 0 0 0 0 0 -1056.02 0 -1763.28 0 0 0 0 -2279.5 0 944.624 2498.78 0 2359 0.07 1011.76 0 0 0 0 2186.88 0 0 561.769 0 -2208.09 0 0 
629.063 -1612.83 0 0 469.909 0 0 0 0 2037.95 0 0 0 0 0 0 2120.66 0 -884.96 656.529 -892.132 476.47 0 0 1658.15 0 0 0 0 0 0 0 0 0 0 0 1917.86 0 0 0 1850.11 731.758 -2019.94 0.08 0 0 0 0 -1244.32 0 0 0 1451.69 0 0 0 
2388.91 1943.95 0 0 0 0 1086.54 0 0 146.26 0 0 0 2120.81 0 0 0 -1498.54 -2355.65 0 0 0 0 0 -728.706 2249.44 0 -181.509 0 1299.86 0 2366.48 506.684 -118.946 0 0 0 0 0 0 -324.793 0 0 0 0.06 0 0 0 0 0 0 0 0 0 0 0 
0 1589.02 0 0 0 0 0 0 -1184.65 0 0 0 0 0 2341.3 0 0 0 1173.67 0 0 -640.66 0 0 0 0 0 0 -821.635 0 0 1707.13 0 0 0 0 0 0 0 0 0 2302.85 0 0 0 0.05 2014.6 0 0 0 1382.56 -1607.33 0 0 0 -547.731 
0 0 2380.21 0 0 0 0 -195.853 140.461 0 0 -40.0555 1402.71 2121.72 1394.62 0 0 -659.276 479.827 0 0 0 0 0 0 0 0 0 0 0 -1728.03 0 0 0 989.486 0 0 0 -1643.19 1723.61 0 0 0 0 0 -1858.65 0.08 -268.487 0 0 -148.244 0 -1544.31 0 0 0 
-135.884 -1947 0 0 -120.167 0 0 0 0 -911.359 0 0 2494.51 0 0 0 793.252 0 0 0 0 0 0 1933.12 1784.49 0 513.703 727.943 0 0 0 0 923.566 0 -529.572 0 0 0 0 0 0 446.104 0 0 0 0 2255.7 0.07 -441.527 0 -949.049 -784.402 907.392 0 2042.83 0 
0 0 0 0 0 0 0 -836.436 1047.17 0 0 0 0 0 0 0 0 0 0 0 0 0 0 0 0 0 0 0 -328.455 -177.541 0 1693.7 0 0 705.512 0 0 0 0 874.584 0 0 885.266 1065.63 0 0 0 1875.29 0.03 -1716.44 0 2482.15 0 1575.29 0 -2284.84 
2009.57 0 0 2329.55 0 -806.986 0 0 0 -941.572 0 0 0 1659.37 0 0 709.632 0 0 -2472.69 0 0 2077.93 0 0 -2216.18 1958.91 -1253.93 0 1364.41 -787.454 2456.66 0 0 0 0 0 0 965.377 -417.722 0 0 0 0 0 0 0 0 120.93 0.09 0 0 -559.786 0 0 0 
0 0 0 0 0 -1053.88 0 0 0 0 0 0 -820.261 0 1195.33 0 0 -1323.97 2013.38 -1163.75 2318.72 0 1307.95 498.901 426.267 0 0 -604.801 857.799 0 0 0 -2392.57 0 -471.74 2111.8 0 0 0 0 369.961 1985 0 0 0 -2026.51 -123.981 1374.02 0 0 0.04 0 1492.13 0 0 0 
694.678 1967.91 0 0 -1409.12 1603.21 0 576.876 -2312.16 0 554.292 0 0 0 0 1588.26 0 0 0 0 727.18 1220.82 0 0 0 463.042 0 0 0 -1386.53 0 0 558.26 1589.63 -562.227 0 0 0 0 0 0 2214.19 -2180.62 0 0 -1160.54 0 -427.03 2275.38 0 0 0.04 0 0 0 0 
0 1400.88 0 -2229.76 0 0 0 1858.81 0 0 0 0 0 2205.65 0 0 0 0 -1971.88 0 0 0 0 -1177.33 144.124 1284.75 244.53 0 0 0 0 0 -1286.58 0 -221.641 0 595.492 1274.68 0 0 -290.918 0 0 1805.09 0 0 1198.69 -1958.75 0 -27.0852 -747.017 0 0.08 0 0 0 
0 809.122 0 0 0 0 -331.05 0 0 0 0 0 166.86 656.224 0 0 0 0 2084.95 1827.37 0 0 0 0 0 -1210.75 0 2185.51 0 0 0 0 0 0 0 0 0 1863.23 0 0 0 -1243.4 949.049 0 0 0 0 0 1737.95 0 0 0 0 0.02 0 0 
-669.652 2346.8 0 -551.393 753.731 0 0 0 0 0 0 0 0 0 1281.24 0 0 0 0 0 0 0 -556.276 115.741 1970.2 0 -1435.06 0 0 0 0 93.7681 0 0 0 0 1271.02 0 576.724 0 0 0 0 0 0 0 0 760.292 0 0 0 0 0 0 0.01 0 
0 0 1260.95 0 0 0 0 0 1350.67 0 0 0 -415.281 0 -1758.4 -2453.92 0 0 0 0 0 1826.91 0 1337.4 7.85852 0 0 0 1487.4 0 0 0 0 333.491 0 -1455.5 0 0 0 0 1767.4 0 0 0 0 -416.196 0 0 442.747 0 0 0 0 0 0 0.07 
