*Vertices 53
*Matrix 
0.06 0 0 0 0 458.312 -1432.46 0 0 273.064 0 0 0 0 0 0 2455.44 1285.82 0 -828.654 2000.72 0 0 846.965 0 0 0 0 0 0 0 0 0 0 0 0 0 0 0 0 0 0 0 0 0 0 0 0 0 0 0 0 0 
0 0.04 0 2252.34 2283.32 0 0 0 397.58 0 12.4363 -1171.07 0 0 0 0 1906.11 0 2450.1 0 0 0 0 0 0 -1450.01 704.901 729.164 0 2439.42 1337.7 1468.63 0 0 0 0 0 0 -1307.18 79.7296 0 0 0 0 0 0 0 0 0 0 0 0 0 
0 0 0 1379.51 911.206 0 -832.926 0 0 2461.09 0 0 0 0 0 0 0 455.565 0 0 0 0 0 0 1245.69 0 0 0 -665.38 0 -988.571 0 0 0 0 0 0 0 0 0 0 0 0 0 0 0 0 0 0 0 0 0 2245.32 
0 1338.77 1810.28 0.07 -1783.88 0 0 0 -2122.49 0 621.433 0 0 0 0 970.87 2284.54 0 2178.79 -2302.09 0 0 0 -2438.81 0 0 2492.98 -444.731 0 0 0 0 0 0 0 0 0 0 0 0 1917.25 0 0 0 0 0 0 0 1709.42 0 0 0 0 
0 -1438.72 2274.62 362.636 0.08 0 0 0 2074.88 0 0 2160.79 0 0 373.318 0 0 -1005.36 1794.11 1080.43 0 0 0 1348.23 0 -2068.16 2046.34 0 0 892.438 0 0 0 0 0 0 0 0 0 0 0 2479.25 0 0 0 0 0 0 0 -1922.13 0 0 0 
464.11 0 0 0 0 0.07 0 0 0 0 -1703.92 0 0 0 0 0 -63.4022 0 1706.06 1752.75 0 -87.9696 0 0 0 -1019.39 0 0 0 0 0 0 598.697 0 0 0 0 0 -776.162 0 0 0 0 0 0 0 0 0 716.346 0 0 0 0 
1973.4 0 2015.06 0 0 0 0.09 0 0 0 0 0 0 0 -323.267 0 0 1084.7 1144.83 0 0 0 0 0 0 0 0 0 0 0 0 0 -2088.15 0 0 0 0 0 0 0 0 0 0 0 -985.824 0 0 0 0 0 0 0 0 
0 0 0 0 0 0 0 0.04 0 0 0 1767.1 0 1529.05 2019.18 0 0 0 0 0 0 0 0 0 0 0 0 0 0 0 0 0 0 0 0 0 -279.321 0 0 0 0 0 0 0 0 0 0 0 0 -1607.18 0 0 0 
0 1653.26 0 200.583 2316.28 0 0 0 0.05 -766.396 484.558 0 0 0 376.064 0 0 1898.94 0 0 0 2218.01 -54.3992 414.365 0 0 0 0 0 0 0 0 0 0 0 0 0 0 0 0 0 0 0 0 0 0 0 0 0 0 0 0 0 
656.377 0 -1134.3 0 0 0 0 0 2196.04 0.03 0 612.125 0 0 0 1975.23 1302.3 0 0 0 0 -196.463 0 0 0 -654.851 0 0 0 0 0 0 0 0 0 0 0 0 0 0 0 0 0 0 0 0 0 0 0 0 0 0 0 
0 238.273 0 -42.8022 0 -586.795 0 0 1924.42 0 0.05 1107.75 0 0 0 1537.45 0 0 -746.864 2266.53 -735.572 0 0 0 0 0 0 0 0 1024.58 0 0 0 -2124.93 0 0 0 0 0 0 0 0 0 0 0 0 0 0 0 0 0 0 0 
0 1335.11 0 0 68.8955 0 0 345.393 0 -612.125 -1899.7 0.04 0 0 0 0 0 0 0 2309.41 0 0 1468.17 0 552.919 0 2443.85 1334.8 0 0 0 0 0 0 0 0 0 0 0 0 0 -1246.91 0 0 0 0 0 0 0 0 0 0 0 
0 0 0 0 0 0 0 0 0 0 0 0 0.03 0 0 2092.12 0 0 0 0 -268.029 0 -949.355 0 -2296.29 0 0 1196.1 1058.92 1791.82 0 0 0 0 -1073.72 0 0 -1023.06 0 0 0 0 0 0 0 0 -574.74 0 0 0 0 0 0 
0 0 0 0 0 0 0 -1282.77 0 0 0 0 0 0.02 0 620.975 -989.639 0 1267.66 -1165.27 0 0 0 0 0 0 2431.94 0 -2095.63 0 0 0 2409.67 0 0 0 0 -1184.5 0 0 0 0 0 0 0 0 0 0 0 0 0 0 0 
0 0 0 0 720.771 0 1848.73 1535.31 -1363.19 0 0 0 0 0 0.06 0 0 -1519.75 0 0 0 -2129.81 0 0 1627.78 836.589 1825.85 0 713.752 0 0 0 0 0 0 0 0 0 0 0 0 0 0 0 0 0 0 0 0 0 0 0 -374.081 
0 0 0 1018.17 0 0 0 0 0 -100.482 2160.02 0 2285.3 -541.322 0 0.01 0 -1768.78 0 -2108.14 -552.156 0 0 521.18 -2432.55 1123.31 0 0 0 0 2439.12 0 0 0 2267.3 0 0 0 0 0 0 0 0 1761.91 0 0 0 0 0 0 0 0 0 
1529.21 309.229 0 357.906 0 2212.06 0 0 0 -131.153 0 0 0 -707.495 0 0 0.06 0 0 0 0 -1091.72 0 0 904.492 1958.6 0 0 0 0 0 0 0 0 0 0 0 -1911.76 0 -665.227 0 0 0 0 0 0 0 0 0 0 0 0 0 
-1147.88 0 -1800.06 0 1906.87 0 309.839 0 -1943.65 0 0 0 0 0 1776.71 808.664 0 0.07 2319.79 817.057 2387.39 0 -468.688 0 1062.27 0 -1249.05 0 1296.81 0 0 -2180.01 0 0 0 1219.9 15.4881 0 0 0 0 1058.31 -480.285 0 0 594.577 0 0 258.721 -2342.83 0 0 0 
0 25.4067 0 -1212.42 2024.98 2344.36 -888.165 0 0 0 -1013.9 0 0 -1005.36 0 0 0 -1331.29 0.03 0 489.441 1923.2 0 0 -2290.8 -609.073 0 1984.24 0 915.632 215.995 0 0 0 0 0 0 0 0 0 0 0 0 0 0 0 0 0 0 0 0 0 0 
1287.04 0 0 1388.97 -2397 -2113.79 0 0 0 0 -34.257 817.209 0 416.501 0 1828.29 0 1975.54 0 0.09 0 939.436 0 0 0 0 0 0 614.872 0 0 0 0 1293.15 0 0 0 208.823 -285.424 0 0 0 0 0 0 0 0 0 0 0 0 0 0 
2405.85 0 0 0 0 0 0 0 0 0 1126.97 0 2495.27 0 0 -2233.42 0 -998.642 -1415.68 0 0.02 0 0 0 0 0 0 2378.54 0 0 -900.525 0 0 0 0 0 0 0 0 0 0 0 0 0 -1289.33 0 0 1286.43 -1739.48 0 0 0 0 
0 0 0 0 0 2370.45 0 0 1432.16 2253.41 0 0 0 0 735.878 0 -120.777 0 1815.01 -577.181 0 0.02 0 0 0 0 404.141 489.135 0 -354.244 0 -1469.24 0 0 0 213.401 0 0 0 0 0 0 0 0 0 0 0 0 0 0 0 0 0 
0 0 0 0 0 0 0 0 -1968.37 0 0 -535.371 -1489.99 0 0 0 0 1905.04 0 0 0 0 0.03 0 2295.07 0 0 0 2464.45 1311.15 0 -2069.23 0 1379.51 0 0 0 -1158.86 0 0 0 0 0 0 0 -108.417 0 0 0 0 0 0 0 
2455.6 0 0 1327.33 -370.876 0 0 0 1869.64 0 0 0 0 0 0 1200.52 0 0 0 0 0 0 0 0.03 -1056.93 1341.82 1440.7 0 0 0 0 0 -337.458 0 0 0 0 0 0 0 0 -2307.12 0 0 0 0 0 0 0 -1945.48 0 -1460.23 1639.38 
0 0 -353.481 0 0 0 0 0 0 0 0 -1175.8 1991.71 0 2133.47 2117.6 67.217 973.159 -457.244 0 0 0 2465.51 427.946 0.09 0 0 0 0 0 0 0 0 0 0 0 0 0 0 0 0 0 0 0 0 0 0 0 0 0 786.843 -1206.32 0 
0 -280.541 0 0 -1142.69 490.204 0 0 0 40.6659 0 0 0 0 475.86 133.137 -1068.38 0 1754.59 0 0 0 0 2150.72 0 0.05 694.067 -2066.48 0 0 0 0 0 0 0 0 -848.338 0 0 0 0 0 1727.88 0 0 0 0 0 0 0 0 0 0 
0 743.66 0 -1644.57 -1330.68 0 0 0 0 0 0 941.42 0 1903.97 1702.55 0 0 1314.81 0 0 0 -1162.07 0 2493.29 0 332.728 0.07 0 0 0 0 0 0 0 0 0 0 0 0 0 0 0 0 0 -1050.83 0 0 418.638 0 0 0 0 0 
0 -1410.95 0 1386.84 0 0 0 0 0 0 0 1235.47 183.493 0 0 0 0 0 1295.89 0 1712.32 -1715.06 0 0 0 875.042 0 0.07 1999.95 0 2235.86 0 0 0 0 0 0 0 0 -1570.86 0 0 0 0 0 0 907.849 0 0 0 0 0 2157.43 
0 0 1544.31 0 0 0 0 0 0 0 0 0 177.236 1535.62 -967.208 0 0 -349.055 0 1327.33 0 0 -234.306 0 0 0 0 1136.74 0.06 0 0 0 0 0 0 0 0 0 0 0 933.18 0 893.048 0 0 0 0 0 0 445.647 0 0 0 
0 447.63 0 0 -2044.82 0 0 0 0 0 -660.344 0 1591.01 0 0 0 0 0 1509.22 0 0 1306.27 1643.8 0 0 0 0 0 0 0.07 0 -977.584 0 -456.938 0 -406.888 0 0 0 0 0 0 0 72.5578 0 0 0 0 0 0 0 0 0 
0 -997.726 2167.04 0 0 0 0 0 0 0 0 0 0 0 0 2335.2 0 0 1855.45 0 1257.29 0 0 0 0 0 0 912.122 0 0 0.09 0 0 0 0 0 0 0 0 0 1144.06 0 0 0 0 0 0 -1124.99 0 0 0 0 0 
0 -1557.89 0 0 0 0 0 0 0 0 0 0 0 0 0 0 0 2041.31 0 0 0 1690.65 2219.53 0 0 0 0 0 0 -37.4615 0 0.01 1490.75 0 0 0 0 0 0 0 -286.798 0 0 620.67 0 -2211.14 0 0 0 0 0 0 0 
0 0 0 0 0 1564.15 2015.37 0 0 0 0 0 0 -489.135 0 0 0 0 0 0 0 0 0 1289.48 0 0 0 0 0 0 0 2004.99 0.02 -553.835 0 2266.99 0 0 0 -348.14 0 0 2061.6 0 0 0 0 0 -2417.75 0 0 0 0 
0 0 0 0 0 0 0 0 0 0 -246.055 0 0 0 0 0 0 0 0 -140.004 0 0 2240.29 0 0 0 0 0 0 574.282 0 0 -101.093 0 0 1943.19 0 0 0 0 0 -888.012 0 0 0 0 0 0 0 0 0 0 -886.792 
0 0 0 0 0 0 0 0 0 0 0 0 210.807 0 0 221.946 0 0 0 0 0 0 0 0 0 0 0 0 0 0 0 0 0 0 0.09 0 0 0 0 0 0 0 0 721.534 932.875 -709.174 0 0 0 -1155.2 0 0 0 
0 0 0 0 0 0 0 0 0 0 0 0 0 0 0 0 0 1563.23 0 0 0 -214.774 0 0 0 0 0 0 0 130.848 0 0 1771.22 -1734.75 0 0.01 0 0 0 -789.285 0 0 0 0 0 0 0 627.689 2185.96 -127.949 0 0 -2297.66 
0 0 0 0 0 0 0 752.968 0 0 0 0 0 0 0 0 0 1731.39 0 0 0 0 0 0 0 2352.6 0 0 0 0 0 0 0 0 0 0 0.01 0 0 0 0 0 0 557.802 0 0 0 0 533.692 0 0 0 0 
0 0 0 0 0 0 0 0 0 0 0 0 2087.24 -600.833 0 0 376.064 0 0 1351.13 0 0 1338.62 0 0 0 0 0 0 0 0 0 0 0 0 0 0 0.01 -1094.62 0 0 1660.28 -2276.91 0 0 0 0 0 0 0 0 0 0 
0 895.032 0 0 0 -537.355 0 0 0 0 0 0 0 0 0 0 0 0 0 2122.49 0 0 0 0 0 0 0 0 0 0 0 0 0 0 0 0 0 2083.12 0.08 0 0 0 0 -530.03 0 0 0 0 0 0 0 0 0 
0 2473.91 0 0 0 0 0 0 0 0 0 0 0 0 0 0 -1577.73 0 0 0 0 0 0 0 0 0 0 1792.58 0 0 0 0 2469.79 0 0 -2239.07 0 0 0 0.07 0 0 0 0 0 0 -1615.42 0 0 0 0 254.143 0 
0 0 0 1708.5 0 0 0 0 0 0 0 0 0 0 0 0 0 0 0 0 0 0 0 0 0 0 0 0 -753.273 0 1180.23 2150.87 0 0 0 0 0 0 0 0 0.07 0 0 0 0 0 0 0 0 0 -1497.01 0 -1988.2 
0 0 0 0 675.756 0 0 0 0 0 0 78.2037 0 0 0 0 0 1583.53 0 0 0 0 0 -48.9059 0 0 0 0 0 0 0 0 0 -1532.72 0 0 0 1140.55 0 0 0 0 0 0 0 0 0 0 0 0 0 0 0 
0 0 0 0 0 0 0 0 0 0 0 0 0 0 0 0 0 -1917.1 0 0 0 0 0 0 0 1700.87 0 0 344.325 0 0 0 582.675 0 0 0 0 1992.78 0 0 0 0 0.06 0 0 -159.688 0 0 0 0 0 0 0 
0 0 0 0 0 0 0 0 0 0 0 0 0 0 0 2097.46 0 0 0 0 0 0 0 0 0 0 0 0 0 827.433 0 1806.62 0 0 634.861 0 1555.15 0 -2338.56 0 0 0 0 0.07 0 0 0 0 0 0 2387.69 0 0 
0 0 0 0 0 0 1841.72 0 0 0 0 0 0 0 0 0 0 0 0 0 1121.94 0 0 0 0 0 1571.78 0 0 0 0 0 0 0 -1066.55 0 0 0 0 0 0 0 0 0 0.03 0 0 -269.402 0 0 0 0 0 
0 0 0 0 0 0 0 0 0 0 0 0 0 0 0 0 0 554.14 0 0 0 0 -1881.85 0 0 0 0 0 0 0 0 1405.3 0 0 366.146 0 0 0 0 0 0 0 1576.97 0 0 0 0 0 0 0 0 0 0 
0 0 0 0 0 0 0 0 0 0 0 0 1557.59 0 0 0 0 0 0 0 0 0 0 0 0 0 0 326.624 0 0 0 0 0 0 0 0 0 0 0 265.435 0 0 0 0 0 0 0.05 0 0 0 0 0 0 
0 0 0 0 0 0 0 0 0 0 0 0 0 0 0 0 0 0 0 0 1167.71 0 0 0 0 0 1940.75 0 0 0 459.685 0 0 0 0 892.895 0 0 0 0 0 0 0 0 761.513 0 0 0.04 0 0 193.258 2411.04 0 
0 0 0 2296.44 0 2149.8 0 0 0 0 0 0 0 0 0 0 0 -133.747 0 0 1517.76 0 0 0 0 0 0 0 0 0 0 0 870.464 0 0 75.1518 296.869 0 0 0 0 0 0 0 0 0 0 0 0 0 0 0 0 
0 0 0 0 -1604.43 0 0 -1272.55 0 0 0 0 0 0 0 0 0 1111.26 0 0 0 0 0 1930.22 0 0 0 0 56.9933 0 0 0 0 0 1708.81 2187.03 0 0 0 0 0 0 0 0 0 0 0 0 0 0 0 0 0 
0 0 0 0 0 0 0 0 0 0 0 0 0 0 0 0 0 0 0 0 0 0 0 0 1884.75 0 0 0 0 0 0 0 0 0 0 0 0 0 0 0 1206.32 0 0 1497.16 0 0 0 1576.51 0 0 0.01 0 0 
0 0 0 0 0 0 0 0 0 0 0 0 0 0 0 0 0 0 0 0 0 0 0 902.203 1655.55 0 0 0 0 0 0 0 0 0 0 0 0 0 0 533.235 0 0 0 0 0 0 0 358.058 0 0 0 0.02 0 
0 0 -991.012 0 0 0 0 0 0 0 0 0 0 0 -713.599 0 0 0 0 0 0 0 0 2262.72 0 0 0 1410.18 0 0 0 0 0 2002.7 0 187.46 0 0 0 0 409.94 0 0 0 0 0 0 0 0 0 0 0 0.01 
