*Vertices 47
*Matrix 
0.05 0 0 0 -1817.45 0 0 0 0 1925.18 0 0 0 0 0 0 0 -1215.02 0 2374.57 0 -1058 -376.675 0 0 0 0 -927.229 0 0 0 0 0 0 844.371 0 0 362.941 0 2094.1 0 951.949 0 0 0 0 0 
0 0.02 0 -164.266 0 2227.77 0 0 0 0 0 0 0 -1263.54 0 0 0 0 0 -1097.06 746.559 1248.59 0 0 0 0 0 0 0 0 0 0 0 0 0 2022.54 0 -1183.58 -393.307 31.0526 -2016.89 0 0 0 -31.8155 2413.63 0 
0 0 0 0 0 774.941 -312.433 0 0 0 2364.5 0 0 -1982.71 0 0 1898.33 -1386.84 0 0 0 1485.26 144.887 0 0 0 0 0 533.692 0 0 0 0 0 0 276.269 0 0 0 0 0 0 0 0 0 2309.26 1982.71 
0 -605.716 0 0.04 0 0 0 0 0 0 0 1249.05 1302.91 0 0 0 0 893.811 1374.78 0 609.531 0 1229.97 0 0 0 0 214.164 0 0 0 -2427.06 0 0 2384.95 -1511.66 -747.627 0 0 0 -1560.79 522.248 0 -1825.08 0 0 0 
1522.19 0 0 0 0.03 0 0 1100.42 0 2244.25 0 16.4037 -755.409 0 -787.149 293.664 0 0 0 2038.41 0 0 0 -1941.66 0 0 -1807.84 0 0 0 0 0 0 0 0 0 -796.762 425.199 0 1285.21 0 0 0 0 0 0 0 
0 -496.612 1921.22 0 0 0.09 0 1701.48 0 2174.83 -2019.49 2159.41 -2141.25 0 0 2049.7 0 0 0 0 0 1011.31 0 2194.81 0 0 0 0 0 0 0 0 0 0 0 -401.547 0 0 0 233.848 0 0 0 0 0 0 0 
0 0 2410.28 0 0 0 0.04 -1910.23 0 0 0 0 0 -1141.47 1275.75 0 0 2016.59 0 829.264 0 0 0 0 0 0 0 0 0 0 2324.82 0 0 -1766.64 0 0 0 -136.799 0 177.389 1176.11 0 0 -139.698 0 0 0 
0 0 0 0 1450.47 -2461.39 1065.78 0.07 951.033 -390.866 0 0 0 0 0 1963.79 0 0 0 0 0 0 638.829 799.203 0 0 1437.8 0 0 0 -2485.96 0 0 0 2179.56 0 913.953 1626.1 0 -1348.23 0 0 0 2469.48 -617.771 0 0 
0 0 0 0 0 0 0 1858.81 0.06 0 0 0 0 0 0 0 0 1932.66 516.449 0 364.925 0 0 0 1653.42 0 0 0 0 0 0 0 0 0 0 263.146 0 22.66 0 0 -1040.91 0 0 0 2190.08 0 0 
-389.798 0 0 0 81.1029 181.661 0 1854.38 0 0.09 0 0 1823.71 0 0 0 0 0 0 0 0 -1436.12 2286.52 0 0 0 0 -192.648 0 0 1103.93 0 0 0 -827.433 0 -1441.62 1216.85 0 0 0 -968.123 0 1580.94 0 2098.07 0 
0 0 1229.97 0 0 1760.23 0 0 0 0 0.07 -242.241 0 0 0 0 -764.412 -1193.04 1025.35 0 0 2163.84 0 0 0 0 2299.95 0 0 303.278 0 1919.84 0 0 0 347.224 0 0 2231.28 0 0 0 1553.93 0 0 0 0 
0 0 0 -2258.14 1616.64 2046.19 0 0 0 0 2196.8 0.02 970.412 2477.72 0 0 0 0 2277.37 0 0 0 0 0 0 77.4407 0 0 0 0 1720.1 -2167.5 0 0 0 0 0 -1954.63 -1680.27 0 0 -1974.47 1690.5 0 0 0 1535.77 
0 0 0 2470.7 2450.87 2044.97 0 0 0 889.081 0 138.173 0.09 -1644.11 0 -2303.31 0 1475.65 0 627.384 0 0 -553.529 0 0 -2233.73 0 0 0 1647.77 0 0 0 0 0 0 2223.96 0 0 0 0 0 0 1078.3 0 0 0 
0 1772.44 1315.27 0 0 0 2346.19 0 0 0 0 -1043.5 30.9 0.07 0 0 2095.78 0 0 0 0 0 0 0 0 0 0 0 1818.83 -1046.1 0 2266.53 0 0 0 0 0 0 0 0 1397.52 0 0 2431.64 -1554.84 0 0 
0 0 0 0 1288.11 0 105.67 0 0 0 0 0 0 0 0.02 0 334.864 0 0 1741.61 0 0 0 0 0 0 0 0 0 0 818.888 1751.23 474.487 0 0 0 0 0 0 1185.72 0 0 0 0 0 0 0 
0 0 0 0 -957.9 -1841.87 0 1391.57 0 0 0 0 1616.34 0 0 0.07 0 0 0 801.95 2096.85 2457.12 0 0 0 0 0 -2423.55 0 0 -1062.27 0 0 2370.45 1942.12 0 0 0 0 0 0 -1112.17 0 0 -1105.91 0 1783.27 
0 0 -1057.24 0 0 0 0 0 0 0 2343.29 0 0 2480.77 -2011.86 0 0.05 0 2078.39 0 0 0 0 0 0 0 0 0 0 0 0 1444.52 0 0 0 0 0 701.239 0 0 0 0 0 0 0 0 1540.96 
-160.298 0 1971.72 1745.28 0 0 -1535.16 0 -427.946 0 2086.93 0 286.798 0 0 0 0 0.05 0 0 0 -1737.8 0 0 0 0 0 0 1140.71 0 1385.46 -815.989 0 0 0 0 0 0 0 709.632 1467.41 0 -793.863 0 1591.77 0 0 
0 0 0 1468.78 0 0 0 0 1768.01 0 1065.02 408.872 0 0 0 0 848.949 0 0.03 2199.85 0 0 400.174 -2487.03 -300.531 0 0 0 0 0 0 0 -460.906 0 0 0 0 0 0 0 -2244.25 0 0 0 -1041.06 0 0 
364.62 -1822.64 0 0 -1709.11 0 1438.41 0 0 0 0 0 -216.3 0 -686.438 2142.02 0 0 1905.19 0 1140.4 0 0 566.958 0 0 869.396 0 1077.53 0 0 0 0 0 0 0 0 7.09555 0 -516.755 -1593.3 0 953.932 0 0 -99.5666 120.777 
0 -1301.08 0 1454.28 0 0 0 0 -189.138 0 0 0 0 0 0 -388.577 0 0 0 -890.912 0.02 0 1751.23 0 0 0 0 0 0 0 0 0 0 -256.584 0 0 0 0 0 2198.02 0 0 0 2419.74 -171.133 8.1637 0 
1272.39 -234.306 -1471.68 0 0 247.124 0 0 0 -1737.95 1770.61 0 0 0 0 -1569.64 0 -457.701 0 0 0 0 2447.66 0 0 0 0 0 0 2486.42 1927.47 0 2413.33 0 0 0 0 -518.891 0 -2231.44 0 0 0 0 0 0 0 
-1570.71 0 -944.777 648.595 0 0 0 2134.85 0 -1719.79 0 0 2023.3 0 0 0 0 0 -427.946 0 476.47 -640.812 0.06 0 -326.777 0 0 0 2439.88 0 0 0 2025.74 -174.184 471.129 -434.965 1251.64 0 0 0 1745.28 0 1215.63 0 0 0 0 
0 0 0 0 1425.6 -2062.52 0 -1715.37 0 0 0 0 0 0 0 0 0 0 -795.389 1811.35 0 0 0 0.01 0 0 1466.03 0 0 0 1242.79 -725.959 -1282.16 0 0 0 822.703 0 0 -398.801 0 0 0 0 2266.99 -2470.4 0 
0 0 0 0 0 0 0 0 1345.94 0 0 0 0 0 0 0 0 0 22.0496 0 0 0 2033.22 0 0.09 0 0 295.801 0 219.047 0 1179.16 0 0 0 0 0 0 0 0 0 0 0 2285 0 0 -253.99 
0 0 0 0 0 0 0 0 0 0 0 538.27 1746.19 0 0 0 0 0 0 0 0 0 0 0 0 0.05 542.238 -848.491 0 -2098.22 -1053.88 0 0 1725.44 0 0 -658.055 0 924.787 2068.77 0 0 0 -339.137 0 0 0 
0 0 0 0 1197.01 0 0 -151.448 0 0 -1256.52 0 0 0 0 0 0 0 0 1406.52 0 0 0 1641.82 0 143.208 0 0 -446.867 0 0 0 -1211.97 0 0 0 0 0 0 0 0 -20.9815 0 0 0 0 0 
1733.99 0 0 2020.1 0 0 0 0 0 1808.15 0 0 0 0 0 -2104.79 0 0 0 0 0 0 0 0 79.2718 1891.92 0 0.05 0 652.409 0 1627.17 0 0 0 -1354.34 3.89111 0 0 713.141 1085.01 0 0 -1405.76 0 -185.781 0 
0 0 2054.12 0 0 0 0 0 0 0 0 0 0 -813.395 0 0 0 333.796 0 -179.525 0 0 1851.33 0 0 0 138.936 0 0.07 -843.15 2388.76 0 1533.02 0 0 0 -1678.29 0 0 0 -1759.01 0 0 -509.125 -1131.86 0 0 
0 0 0 0 0 0 0 0 0 0 -1014.05 0 -1222.95 2379.45 0 0 0 0 0 0 0 2098.22 0 0 760.75 556.581 0 1637.7 2412.72 0.09 2302.55 0 -1768.32 0 0 0 382.931 613.804 0 369.808 0 117.573 0 0 0 232.78 0 
0 0 0 0 0 0 -1883.68 -2147.36 0 -531.556 0 -382.321 0 0 37.1563 1386.68 0 2098.53 0 0 0 1448.64 0 -1016.34 0 693.915 0 0 2351.99 1002.3 0 0 113.3 1520.05 0 0 0 0 0 -1721.32 -957.442 0 944.472 0 2462.92 0 0 
0 0 0 44.3281 0 0 0 0 0 0 -1486.18 2382.35 0 496.307 1107.75 0 2268.52 2402.8 0 0 0 0 0 -620.67 1768.32 0 0 892.59 0 0 0 0.07 0 0 0 0 -1326.26 1112.63 -2382.81 0 0 911.664 1094.32 -2270.96 -1279.87 0 0 
0 0 0 0 0 0 0 0 0 0 0 0 0 0 1866.59 0 0 0 2138.81 0 0 -215.842 -64.9281 -1113.7 0 0 1152.46 0 547.884 2269.43 -1665.62 0 0.07 0 551.851 0 1528.44 0 0 -186.697 0 0 0 -647.069 0 20.2185 -218.131 
0 0 0 0 0 0 2445.37 0 0 0 0 0 0 0 0 -981.399 0 0 0 0 203.787 0 534.913 0 0 -1350.22 0 0 0 0 2181.69 0 0 0.09 0 0 0 0 0 0 -2259.36 0 679.876 0 1271.63 172.353 -1839.43 
-680.181 0 0 -168.386 0 0 0 411.771 0 -1907.79 0 0 0 0 0 2278.44 0 0 0 0 0 0 1769.69 0 0 0 0 0 0 0 0 0 1782.51 0 0.09 0 0 0 0 0 0 -997.726 0 0 431.913 0 -778.451 
0 246.818 2250.82 1742.23 0 74.5415 0 0 -252.159 0 467.925 0 0 0 0 0 0 0 0 0 0 0 -431.608 0 0 0 0 -1670.66 0 0 0 0 0 0 0 0.01 2115.77 2364.65 0 630.741 0 0 240.104 2041.46 0 0 0 
0 0 0 -1347.01 2002.4 0 0 -620.212 0 41.2763 0 0 2021.47 0 0 0 0 0 0 0 0 0 2290.95 1171.38 0 -698.798 0 -1891.16 -235.221 -2482.15 0 2371.82 -202.261 0 0 -2418.52 0.07 0 739.082 722.602 2042.68 -1923.51 0 0 0 0 0 
1481.6 -1062.58 0 0 997.879 0 2348.17 1457.18 -715.43 -2030.17 0 -2245.32 0 0 0 0 2371.97 0 0 2228.23 0 1110.34 0 0 0 0 0 0 0 -388.577 0 2351.22 0 0 0 -338.069 0 0.02 0 0 0 -839.335 0 0 0 776.315 0 
0 467.162 0 0 0 0 0 0 0 0 -836.894 1323.05 0 0 0 0 0 0 0 0 0 0 0 0 0 2378.69 0 0 0 0 0 552.156 0 0 0 0 1642.43 0 0 0 0 0 -1886.27 0 0 -684.759 0 
55.9252 -136.952 0 0 -326.167 541.78 -2464.9 77.8985 0 0 0 0 0 0 2343.75 0 0 2275.99 0 1515.17 -2333.22 -1812.57 0 1745.73 0 -802.103 0 1295.74 0 -277.642 567.568 0 1963.94 0 0 -1635.72 1584.44 0 0 0.03 0 0 -302.667 0 0 0 1180.38 
0 1479.77 0 -2158.19 0 0 405.362 0 -667.211 0 0 0 0 1866.28 0 0 0 -2139.58 -190.054 -602.359 0 0 418.18 0 0 0 0 1325.04 2282.1 0 1994.16 0 0 2300.71 0 0 798.593 0 0 0 0.05 0 2272.48 -1858.2 1956.16 0 0 
1195.64 0 0 -144.124 0 0 0 0 0 2107.84 0 -124.744 0 0 0 -841.777 0 0 0 0 0 0 0 0 0 0 -1046.4 0 0 177.999 0 1976.76 0 0 104.297 0 1867.66 -1231.8 0 0 0 0.08 0 2212.82 -244.682 -1652.5 0 
0 0 0 0 0 0 0 0 0 0 -2002.24 888.012 0 0 0 0 0 -924.024 0 1350.67 0 0 931.196 0 0 0 0 0 0 0 2191.15 808.664 0 -620.67 0 -285.424 0 0 -1065.32 -878.704 -2199.09 0 0.06 0 0 2497.86 -795.999 
0 0 0 1051.9 0 0 -1652.35 -2426.6 0 564.364 0 0 1659.67 -1106.68 0 0 0 0 0 0 -1127.74 0 0 0 1511.2 -46.4644 0 1006.88 316.095 0 0 839.335 1319.24 0 0 1451.54 0 0 0 0 -837.199 1636.63 0 0 0 -2355.8 0 
0 -913.343 0 0 0 0 0 -1855.6 -1320.76 0 0 0 0 555.361 0 455.26 0 2185.2 1977.68 0 -789.132 0 0 -1218.07 0 0 0 0 -1348.99 0 -1135.06 -490.509 0 1308.1 2229.45 0 0 0 0 0 -545.442 2160.94 0 0 0.03 0 1162.83 
0 -1494.72 1150.17 0 0 0 0 0 0 -1795.79 0 0 0 0 0 0 0 0 0 1824.47 2438.66 0 0 -59.4348 0 0 0 -679.418 0 1363.19 0 0 -15.9459 2186.57 0 0 0 1136.74 -2328.79 0 0 2223.04 -1329.46 953.78 0 0 2359 
0 0 -462.737 0 0 0 0 0 0 0 0 1034.65 0 0 0 -2295.53 2099.29 0 0 1462.07 0 0 0 0 480.895 0 0 0 0 0 0 0 1657.54 -972.396 -1417.66 0 0 0 0 -395.291 0 0 1764.66 0 844.371 -1393.09 0.08 
