*Vertices 58
*Matrix 
0.04 1371.27 0 0 0 0 0 -1309.63 0 0 0 0 -2271.42 0 0 0 0 0 0 0 0 0 0 -101.703 0 0 511.719 0 906.934 0 0 0 0 0 0 0 0 0 0 1421.02 0 0 0 0 0 0 0 0 0 0 0 0 0 0 0 0 0 0 
2344.05 0.08 0 0 0 0 0 0 0 0 0 0 0 0 0 0 0 0 0 0 2375.64 0 0 0 0 1760.99 0 0 0 2149.34 0 0 0 -2076.86 0 0 0 0 -794.015 0 0 0 0 0 0 0 0 0 0 -382.778 0 0 0 0 0 0 0 0 
0 0 0.01 -290.918 0 0 0 277.49 0 0 0 0 -2452.54 0 0 0 0 -978.347 -349.513 0 0 0 747.78 0 0 0 1559.72 0 0 0 1832.26 0 0 0 0 0 1616.18 1827.22 0 0 0 0 0 0 0 0 0 0 -542.39 0 0 0 0 0 0 0 0 0 
0 0 1869.64 0.03 0 0 926.466 0 0 -1365.02 0 0 0 0 0 0 0 0 0 0 0 -205.313 0 0 0 0 0 0 2487.79 0 0 0 0 0 0 -1065.32 0 0 0 0 0 -1773.51 0 0 -947.523 0 0 0 0 0 0 0 0 0 0 0 0 0 
0 0 0 0 0.04 2348.32 0 0 0 0 0 0 0 -2099.29 0 0 0 0 0 0 0 0 -1085.31 0 0 0 2185.51 0 0 0 0 0 0 -508.362 0 0 0 2161.85 0 0 0 -144.734 0 0 0 0 0 0 0 0 0 0 0 0 0 0 0 0 
0 0 0 0 1627.93 0.07 0 0 0 0 0 0 0 0 0 0 0 0 0 0 0 0 -1835 0 0 0 0 0 0 0 0 0 0 0 0 -1470 0 0 0 0 0 0 2243.95 333.949 2430.27 0 0 0 0 0 0 0 0 0 0 0 0 0 
0 0 0 1397.52 0 0 0.03 0 -1141.62 0 0 0 0 0 1550.42 0 0 0 -2194.36 0 0 0 0 981.857 0 0 0 0 0 0 -282.678 0 0 0 2337.95 0 0 0 0 -308.313 0 2466.12 0 0 0 0 0 0 0 0 0 0 0 0 0 0 0 0 
1909.77 0 270.623 0 0 0 0 0.03 0 0 0 -2082.81 0 0 0 0 0 0 0 1928.69 0 0 0 0 2494.05 2109.67 0 0 0 0 0 0 0 0 0 0 0 0 0 0 -1922.74 -1530.58 0 0 0 0 0 1714.91 0 0 0 0 0 0 0 0 0 0 
0 0 0 0 0 0 -184.103 0 0.04 0 0 0 0 0 1749.09 0 0 0 0 0 0 979.873 319.758 0 0 0 0 0 0 1634.8 0 0 0 0 0 0 0 0 0 0 0 0 0 0 0 0 0 0 0 0 0 0 0 0 0 0 0 0 
0 0 0 2016.43 0 0 0 0 0 0.09 0 1869.33 0 0 0 538.881 0 0 0 0 0 -732.368 0 0 0 0 0 0 0 0 0 885.266 0 -91.7844 0 0 0 0 0 0 0 0 0 0 0 0 0 0 0 0 0 0 0 836.436 0 0 0 0 
0 0 0 0 0 0 0 0 0 0 0.01 0 0 0 0 0 0 0 0 0 0 0 0 0 0 -1591.46 0 0 0 1453.83 -2374.72 0 0 0 0 0 0 0 0 0 0 319.452 0 2476.35 0 0 0 0 0 0 0 0 0 0 0 0 0 0 
0 0 0 0 0 0 0 2219.84 0 -1941.21 0 0 0 0 0 0 0 0 0 0 0 0 0 0 0 -407.651 0 1805.86 0 0 0 0 0 0 0 0 0 715.583 -2238.3 0 0 0 -2282.1 10.9104 0 1507.84 0 0 0 0 0 0 0 0 0 0 0 0 
1099.96 0 1859.11 0 0 0 0 0 0 0 0 0 0.09 0 -906.629 0 0 0 0 0 0 0 0 0 2066.94 0 0 432.371 0 0 0 0 -90.1059 0 0 210.807 0 0 0 0 0 0 0 0 0 2473.3 0 0 0 0 0 0 0 0 0 0 0 0 
0 0 0 0 576.113 0 0 0 0 0 0 0 0 0.07 -1152 762.429 0 736.488 0 0 0 0 0 0 0 0 0 0 0 0 0 0 0 0 0 0 0 1894.36 0 -1786.32 0 0 0 0 0 0 0 0 0 0 0 0 0 0 0 0 0 0 
0 0 0 0 0 0 2209.92 0 1339.38 0 0 0 -687.201 743.965 0.06 -1523.87 0 0 0 0 0 0 0 0 -1086.99 0 0 0 0 -96.5148 0 2338.86 0 0 0 0 0 0 0 0 -833.079 1162.22 0 0 0 0 0 0 0 0 0 0 0 0 0 -1370.2 0 0 
0 0 0 0 0 0 0 0 0 -299.31 0 0 0 1977.83 1605.2 0.01 0 0 0 0 -1159.47 0 0 -340.663 0 0 0 0 0 0 0 0 2389.68 0 0 0 0 0 0 0 0 0 0 0 0 0 -326.167 0 0 0 0 0 0 0 0 0 0 0 
0 0 0 0 0 0 0 0 0 0 0 0 0 0 0 0 0.09 0 0 0 0 0 0 0 0 -161.824 0 11.063 0 0 207.907 0 0 0 18.9978 0 0 0 0 0 0 0 0 2118.52 0 449.004 0 0 0 0 0 0 0 0 0 0 0 0 
0 0 1037.71 0 0 0 0 0 0 0 0 0 0 -238.731 0 0 0 0.07 0 0 0 0 0 0 0 0 0 531.709 0 -1375.55 0 1890.24 2490.23 0 0 0 0 0 0 -36.2407 586.032 0 0 0 0 1212.42 0 0 0 0 0 0 0 0 0 0 0 0 
0 0 754.952 0 0 0 537.507 0 0 0 0 0 0 0 0 0 0 0 0.04 0 -337.001 0 0 0 0 0 0 0 0 0 0 0 0 0 0 0 0 0 0 0 0 0 0 0 780.435 0 0 0 0 0 0 0 0 0 0 0 0 0 
0 0 0 0 0 0 0 1970.81 0 0 0 0 0 0 0 0 0 0 0 0.01 0 0 0 0 0 1578.49 -132.984 0 0 0 217.826 0 0 0 0 0 1764.81 0 0 906.476 2172.38 0 0 0 0 0 0 0 0 0 0 0 0 0 0 0 0 0 
0 -611.209 0 0 0 0 0 0 0 0 0 0 0 0 0 221.641 0 0 941.572 0 0.04 0 0 0 -996.048 0 593.661 0 0 1260.34 0 0 0 0 0 0 -240.562 0 0 0 0 0 0 0 0 2175.13 0 0 0 0 0 0 0 0 0 0 0 0 
0 0 0 -1021.07 0 0 0 0 1735.21 -607.242 0 0 0 0 0 0 0 0 0 0 0 0.03 0 0 0 0 0 0 0 0 0 0 1091.11 0 0 0 0 0 0 0 0 0 0 0 0 280.236 0 0 0 0 0 0 1898.48 0 0 0 0 0 
0 0 2469.94 0 1895.89 838.115 0 0 851.39 0 0 0 0 0 0 0 0 0 0 0 0 0 0.03 0 0 0 0 0 0 0 -2480.77 0 0 0 0 0 0 2320.55 0 0 0 0 0 0 100.635 0 0 0 0 0 0 0 0 0 -1430.48 0 0 0 
985.824 0 0 0 0 0 1832.41 0 0 0 0 0 0 0 0 -1485.56 0 0 0 0 0 0 0 0.07 0 0 0 0 1040.91 0 0 0 968.886 0 0 0 0 0 0 0 0 0 0 1788.77 0 -891.217 0 0 0 0 0 0 0 0 0 0 0 0 
0 0 0 0 0 0 0 2158.35 0 0 0 0 888.318 0 1348.84 0 0 0 0 0 -1618.32 0 0 0 0.09 0 0 0 0 0 0 0 -967.971 0 0 -2381.28 0 2387.69 0 0 0 0 0 0 0 0 0 0 0 0 0 0 0 0 0 0 0 -2458.49 
0 -1891.16 0 0 0 0 0 2425.69 0 0 2167.5 655.309 0 0 0 0 1534.55 0 0 2091.66 0 0 0 0 0 0.03 0 0 0 -828.654 0 0 0 0 0 0 0 0 0 0 0 -1709.88 -782.113 0 0 0 0 0 0 0 0 0 0 0 0 0 0 0 
1201.9 0 2230.67 0 -507.904 0 0 0 0 0 0 0 0 0 0 0 0 0 0 2361.45 1367.61 0 0 0 0 0 0.09 0 0 0 0 0 0 0 0 1813.64 0 0 -549.715 0 0 0 0 0 0 -2012.77 0 0 0 0 0 0 0 0 0 0 0 0 
0 0 0 0 0 0 0 0 0 0 0 2422.48 -1994 0 0 0 743.812 -2450.71 0 0 0 0 0 0 0 0 0 0 0 0 0 2313.38 1493.96 0 0 0 0 0 0 1709.42 0 0 0 0 0 1552.55 0 0 0 0 0 1025.19 0 0 0 0 0 0 
1808.6 0 0 560.396 0 0 0 0 0 0 0 0 0 0 0 0 0 0 0 0 0 0 0 -1969.28 0 0 0 0 0.08 0 0 618.686 0 0 0 0 0 0 0 2051.07 0 528.657 1541.11 0 2401.58 0 0 0 0 0 0 0 0 0 0 0 0 0 
0 -502.258 0 0 0 0 0 0 1373.1 0 -198.752 0 0 0 191.427 0 0 260.552 0 0 41.4289 0 0 0 0 1909.31 0 0 0 0 0 0 0 -78.9666 0 0 0 0 0 0 0 0 0 0 0 617.924 0 0 0 0 0 0 0 0 0 0 0 0 
0 0 -1284.91 0 0 0 211.112 0 0 0 917.158 0 0 0 0 0 658.513 0 0 -968.581 0 0 92.7 0 0 0 0 0 0 0 0.04 1658.3 0 0 0 0 0 0 0 0 0 -251.244 -632.572 0 0 0 0 0 0 0 0 0 0 0 0 0 0 0 
0 0 0 0 0 0 0 0 0 2335.96 0 0 0 0 46.9222 0 0 2256 0 0 0 0 0 0 0 0 0 -1428.04 -1726.36 0 2479.71 0.05 0 0 0 0 0 2084.95 0 0 -1714 0 1720.4 0 0 0 0 0 0 0 0 0 0 0 0 0 0 0 
0 0 0 0 0 0 0 0 0 0 0 0 1271.32 0 0 -1746.65 0 819.956 0 0 0 1814.1 0 276.879 870.464 0 0 2492.52 0 0 0 0 0.06 0 0 0 0 0 0 0 0 -1147.11 0 0 0 0 0 0 0 0 0 0 0 0 0 0 0 0 
0 877.178 0 0 151.753 0 0 0 0 2276.76 0 0 0 0 0 0 0 0 0 0 0 0 0 0 0 0 0 0 0 -85.2229 0 0 0 0.09 0 0 2349.09 0 891.369 0 0 0 0 0 0 0 0 0 0 0 0 0 0 0 0 0 0 0 
0 0 0 0 0 0 1438.72 0 0 0 0 0 0 0 0 0 1179.16 0 0 0 0 0 0 0 0 0 0 0 0 0 0 0 0 0 0.06 0 0 0 0 0 -1369.44 0 0 0 0 0 0 0 0 0 0 0 0 0 0 0 0 0 
0 0 0 911.054 0 1930.37 0 0 0 0 0 0 1937.09 0 0 0 0 0 0 0 0 0 0 0 -1336.33 0 362.636 0 0 0 0 0 0 0 0 0 0 0 0 0 -1936.48 0 0 0 0 0 0 0 0 0 0 0 0 0 0 0 0 0 
0 0 -298.09 0 0 0 0 0 0 0 0 0 0 0 0 0 0 0 0 378.048 51.9578 0 0 0 0 0 0 0 0 0 0 0 0 1712.78 0 0 0.09 0 0 0 0 0 0 0 0 0 0 0 0 0 0 0 0 0 0 0 0 0 
0 0 -5.41704 0 -528.962 0 0 0 0 0 0 2154.38 0 1685.16 0 0 0 0 0 0 0 0 1719.95 0 806.375 0 0 0 0 0 0 -801.95 0 0 0 0 0 0.04 0 0 0 0 0 0 0 0 0 0 0 0 0 0 0 0 0 0 0 0 
0 528.504 0 0 0 0 0 0 0 0 0 167.318 0 0 0 0 0 0 0 0 0 0 0 0 0 0 -1060.29 0 0 0 0 0 0 2342.68 0 0 0 0 0.08 0 0 0 0 0 0 0 0 0 0 0 0 0 0 0 0 0 0 0 
161.977 0 0 0 0 0 691.931 0 0 0 0 0 0 562.38 0 0 0 288.018 0 1900.62 0 0 0 0 0 0 0 836.436 -1181.3 0 0 0 0 0 0 0 0 0 0 0.07 0 0 0 545.289 0 0 0 0 0 0 0 0 0 0 0 0 0 0 
0 0 0 0 0 0 0 1034.5 0 0 0 0 0 0 1234.4 0 0 863.598 0 -707.19 0 0 0 0 0 0 0 0 0 0 0 -966.75 0 0 2365.87 2377.32 0 0 0 0 0.01 0 0 0 0 0 0 0 0 0 0 0 0 0 0 0 0 0 
0 0 0 189.291 549.562 0 2109.82 2084.8 0 0 1226.46 0 0 0 2487.33 0 0 0 0 0 0 0 0 0 0 -1528.14 0 0 1797.77 0 2367.24 0 -1000.78 0 0 0 0 0 0 0 0 0.09 0 0 875.347 -1359.68 0 0 0 0 0 0 0 0 0 0 0 0 
0 0 0 0 0 724.128 0 0 0 0 0 -1909.01 0 0 0 0 0 0 0 0 0 0 0 0 0 2450.41 0 0 -1529.05 0 1696.45 2498.17 0 0 0 0 0 0 0 0 0 0 0.08 0 0 -1527.38 0 0 0 0 0 0 0 0 0 0 0 0 
0 0 0 0 0 2176.2 0 0 0 0 1821.27 1377.99 0 0 0 0 2006.97 0 0 0 0 0 0 1507.84 0 0 0 0 0 0 0 0 0 0 0 0 0 0 0 -1358.15 0 0 0 0.06 0 0 0 0 0 0 0 0 0 0 0 0 0 0 
0 0 0 2241.81 0 -282.22 0 0 0 0 0 0 0 0 0 0 0 0 1010.7 0 0 0 -531.098 0 0 0 0 0 -2349.39 0 0 0 0 0 0 0 0 0 0 0 0 1553.32 0 0 0.02 0 0 0 0 0 0 0 0 0 0 0 -460.601 0 
0 0 0 0 0 0 0 0 0 0 0 800.882 958.205 0 0 0 1556.83 1068.22 0 0 -1123.16 -1702.4 0 -913.648 0 0 625.706 395.291 0 314.112 0 0 0 0 0 0 0 0 0 0 0 188.07 1864.15 0 0 0.01 0 0 0 0 2332.15 0 0 0 0 0 0 0 
0 0 0 0 0 0 0 0 0 0 0 0 0 0 0 2489.17 0 0 0 0 0 0 0 0 0 0 0 0 0 0 0 0 0 0 0 0 0 0 0 0 0 0 0 0 0 0 0.07 0 0 0 0 0 0 0 0 0 0 0 
0 0 0 0 0 0 0 1241.72 0 0 0 0 0 0 0 0 0 0 0 0 0 0 0 0 0 0 0 0 0 0 0 0 0 0 0 0 0 0 0 0 0 0 0 0 0 0 0 0.05 0 0 0 0 0 0 0 0 0 0 
0 0 2110.74 0 0 0 0 0 0 0 0 0 0 0 0 0 0 0 0 0 0 0 0 0 0 0 0 0 0 0 0 0 0 0 0 0 0 0 0 0 0 0 0 0 0 0 0 0 0.08 0 0 0 0 0 0 0 0 0 
0 1213.49 0 0 0 0 0 0 0 0 0 0 0 0 0 0 0 0 0 0 0 0 0 0 0 0 0 0 0 0 0 0 0 0 0 0 0 0 0 0 0 0 0 0 0 0 0 0 0 0.02 0 0 0 0 0 0 0 0 
0 0 0 0 0 0 0 0 0 0 0 0 0 0 0 0 0 0 0 0 0 0 0 0 0 0 0 0 0 0 0 0 0 0 0 0 0 0 0 0 0 0 0 0 0 1299.71 0 0 0 0 0.08 0 0 0 0 0 0 0 
0 0 0 0 0 0 0 0 0 0 0 0 0 0 0 0 0 0 0 0 0 0 0 0 0 0 0 1088.52 0 0 0 0 0 0 0 0 0 0 0 0 0 0 0 0 0 0 0 0 0 0 0 0.08 0 0 0 0 0 0 
0 0 0 0 0 0 0 0 0 0 0 0 0 0 0 0 0 0 0 0 0 269.25 0 0 0 0 0 0 0 0 0 0 0 0 0 0 0 0 0 0 0 0 0 0 0 0 0 0 0 0 0 0 0.09 0 0 0 0 0 
0 0 0 0 0 0 0 0 0 2367.55 0 0 0 0 0 0 0 0 0 0 0 0 0 0 0 0 0 0 0 0 0 0 0 0 0 0 0 0 0 0 0 0 0 0 0 0 0 0 0 0 0 0 0 0.08 0 0 0 0 
0 0 0 0 0 0 0 0 0 0 0 0 0 0 0 0 0 0 0 0 0 0 2281.18 0 0 0 0 0 0 0 0 0 0 0 0 0 0 0 0 0 0 0 0 0 0 0 0 0 0 0 0 0 0 0 0.03 0 0 0 
0 0 0 0 0 0 0 0 0 0 0 0 0 0 435.27 0 0 0 0 0 0 0 0 0 0 0 0 0 0 0 0 0 0 0 0 0 0 0 0 0 0 0 0 0 0 0 0 0 0 0 0 0 0 0 0 0.08 0 0 
0 0 0 0 0 0 0 0 0 0 0 0 0 0 0 0 0 0 0 0 0 0 0 0 0 0 0 0 0 0 0 0 0 0 0 0 0 0 0 0 0 0 0 0 2136.22 0 0 0 0 0 0 0 0 0 0 0 0.03 0 
0 0 0 0 0 0 0 0 0 0 0 0 0 0 0 0 0 0 0 0 0 0 0 0 1493.35 0 0 0 0 0 0 0 0 0 0 0 0 0 0 0 0 0 0 0 0 0 0 0 0 0 0 0 0 0 0 0 0 0.09 
