*Vertices 65
*Matrix 
0.04 0 0 0 0 0 0 0 0 0 0 0 0 0 0 1921.06 0 1386.84 0 0 0 0 0 0 0 -574.74 0 -2185.51 0 0 638.523 0 0 0 1139.79 0 0 1743.75 0 505.463 0 0 1843.09 0 -2235.56 -1706.98 0 0 1015.27 0 0 0 0 0 0 -285.119 0 0 0 0 0 0 0 0 914.869 
0 0.08 0 2333.22 0 0 0 2096.39 0 0 -1339.69 1479.31 1242.64 -892.59 0 0 0 0 0 1018.17 900.983 0 0 0 1754.59 0 -747.017 0 0 0 0 0 -111.011 0 59.4348 0 0 0 372.097 0 0 2437.74 354.091 0 0 0 0 0 20.2185 648.595 627.384 0 358.211 0 1974.78 0 0 0 0 1092.03 0 0 0 0 0 
0 0 0.02 0 0 -1683.63 -571.078 0 0 0 42.6496 0 0 0 0 0 2487.79 0 0 0 0 0 0 1987.9 0 0 0 0 0 0 0 0 0 0 1914.04 0 0 -1705.76 0 0 0 0 0 1750.62 -1837.44 -917.92 0 0 0 0 0 1877.27 0 -1179.46 0 0 0 0 0 0 0 0 0 0 0 
0 375.912 0 0.08 464.568 241.325 0 0 0 0 -155.873 0 0 0 0 0 0 0 0 -84.3074 0 0 -1932.66 0 0 0 -1405.91 0 0 0 0 1920.76 0 0 0 1339.99 149.77 0 2037.03 0 0 0 0 0 0 0 0 0 1195.79 0 0 0 0 0 0 0 0 0 0 0 0 0 -2055.8 0 0 
0 0 0 -1009.63 0.09 0 0 1804.33 -460.906 0 0 0 1879.1 0 991.012 -2490.84 0 0 0 229.881 0 0 0 0 0 0 0 0 0 0 -129.933 0 -441.984 0 288.171 0 0 -493.103 0 0 0 0 0 1324.12 0 0 0 0 0 0 0 0 0 0 0 0 0 0 0 0 0 0 0 0 2334.59 
0 0 53.4837 -1712.16 0 0.09 0 0 0 0 0 0 871.838 965.835 -1280.02 0 0 0 0 0 0 0 0 259.636 0 0 0 385.525 0 -1871.93 1879.71 0 2013.53 0 0 0 0 0 0 0 712.683 0 0 0 106.433 0 0 0 1489.68 0 0 1019.24 0 -1637.7 0 0 1735.05 0 0 0 0 0 0 0 -2001.94 
0 0 249.565 0 0 0 0 0 0 1218.83 0 0 0 0 0 0 0 0 0 0 0 0 363.399 0 520.875 -1668.22 0 562.838 0 734.962 0 0 0 0 0 1706.67 0 0 0 0 0 0 0 0 0 0 0 2014.3 0 0 -1221.27 0 0 834.758 0 1764.35 0 -1292.69 0 0 0 0 0 0 0 
0 -2354.43 0 0 1461.15 0 0 0.09 0 0 0 0 0 0 0 0 0 0 0 0 0 0 0 -494.476 861.309 0 0 0 0 0 0 0 0 980.941 0 0 0 0 0 0 2400.2 0 0 0 0 2451.48 0 1651.74 109.638 2078.08 0 0 0 0 0 0 0 0 0 -306.787 0 0 -2482.45 0 0 
0 0 0 0 1909.92 0 0 0 0.07 0 0 0 -1220.82 534.761 0 0 0 2382.5 -1965.77 0 0 2248.68 575.35 -530.488 0 -361.415 -524.995 -208.975 2463.38 0 0 0 0 0 1614.96 0 -1898.63 0 -2238.3 0 1314.05 -1176.41 -115.894 1172.75 0 864.208 940.352 0 0 0 0 0 0 0 -944.319 0 0 0 0 0 0 0 0 0 0 
0 0 0 0 0 0 -1624.88 0 0 0.02 1181.6 0 1898.02 0 -411.008 0 0 858.257 0 0 0 1545.08 0 0 -2229.15 0 0 0 0 0 0 -531.251 0 251.244 0 0 0 0 0 0 -210.196 0 0 1864.15 0 1993.85 0 0 0 0 0 0 -577.334 2094.26 0 0 0 0 0 0 0 0 0 -941.42 0 
0 -1193.04 2334.13 592.441 0 0 0 0 0 865.276 0.02 2483.52 0 0 -1078.6 0 0 0 0 -1662.57 0 -44.9385 0 0 1597.87 0 0 -118.183 0 0 0 0 0 0 0 0 0 0 0 0 0 0 0 0 0 2138.05 537.66 2413.63 1912.21 0 0 0 0 0 0 0 0 0 0 0 0 0 0 0 0 
0 -1624.27 0 0 0 0 0 0 0 0 2002.7 0.09 0 0 0 0 0 0 0 0 0 0 0 0 0 0 0 0 0 1986.07 0 -244.987 0 0 0 0 0 0 0 0 2122.64 0 0 0 0 0 0 0 0 0 0 0 1377.53 0 0 0 0 0 0 0 0 0 0 0 0 
0 -570.772 0 0 -371.944 -872.753 0 0 -2210.38 -308.008 0 0 0 0 0 0 1189.99 0 0 0 -328.608 0 -1383.94 1249.35 0 2018.72 0 2120.04 0 0 0 0 0 0 0 470.977 2263.18 0 0 -1879.86 0 0 0 0 222.556 0 -1630.22 2414.4 -593.509 1651.28 0 0 -82.1711 -2088.61 0 0 0 0 0 0 0 0 0 0 0 
0 -91.174 0 0 0 2283.93 0 0 -148.701 0 0 0 0 0.04 -179.983 2119.28 0 0 0 0 0 -1064.87 0 1712.78 0 0 918.531 -1275.75 0 0 1265.37 2065.57 -2382.2 0 0 0 -1564.15 1373.26 -1489.23 0 0 0 0 0 0 0 0 0 67.3696 0 0 0 -2490.54 0 721.839 0 0 -1992.93 0 0 0 0 0 0 0 
0 0 0 0 836.894 2100.51 0 0 0 1854.38 -498.444 0 0 2182.91 0.04 -902.509 261.925 0 1589.33 -1314.66 0 0 2393.95 2158.65 0 0 -2462.46 0 0 0 0 0 0 -1373.41 -1410.95 0 0 490.967 0 0 0 0 -969.497 -1585.51 0 -917.92 0 0 0 0 0 1766.49 0 0 0 0 0 0 0 0 0 0 0 0 0 
239.341 0 0 0 2240.9 0 0 0 0 0 0 0 0 -224.235 -1240.2 0.02 0 0 0 0 0 1212.73 0 0 0 0 0 0 0 0 0 0 -1990.95 155.873 0 0 1845.99 0 0 0 0 0 0 0 0 0 0 0 0 0 0 0 0 1281.55 -1970.2 0 0 0 0 0 0 0 0 0 0 
0 0 -94.3785 0 0 0 0 0 0 0 0 0 765.938 0 244.53 0 0.05 -2070.91 0 1578.19 1682.87 0 225.455 -1927.93 0 2186.73 0 0 0 0 0 1607.03 0 0 0 0 -889.843 0 373.47 0 0 0 0 0 -1919.84 0 -197.226 -2201.22 2253.56 0 0 0 0 2420.35 0 0 0 0 -1036.48 0 0 1791.82 0 0 0 
1404.23 0 0 0 0 0 0 0 -441.832 -818.278 0 0 0 0 0 0 2057.02 0.05 0 0 0 0 0 0 0 0 0 0 0 -1359.83 0 0 0 0 0 0 0 0 0 944.929 1611.91 0 0 0 0 0 0 0 1032.36 0 0 0 0 0 0 393.002 0 0 0 0 0 0 0 0 0 
0 0 0 0 0 0 0 0 -2356.72 0 0 0 0 0 -31.5104 0 0 0 0.02 0 1488.62 0 0 1270.1 0 2008.5 -2141.71 -103.687 0 0 0 0 0 0 1102.25 0 0 0 2228.69 0 257.347 0 328.761 915.174 1401.33 1670.05 0 0 0 -301.447 0 2277.98 -1860.33 0 0 0 -2213.13 0 0 0 0 -2250.05 0 0 0 
0 -388.119 0 -352.565 1311.61 0 0 0 0 0 1130.33 0 0 0 -1327.63 0 -875.195 0 0 0.02 -833.995 655.156 0 0 0 0 0 -748.085 0 0 0 1061.97 0 0 0 0 0 0 2417.14 9.23185 0 0 565.889 892.285 0 0 0 0 595.34 0 0 0 1496.86 0 0 0 0 0 0 0 2369.53 0 2352.75 0 0 
0 1862.77 0 0 0 0 0 0 0 0 0 0 1888.87 0 0 0 1702.86 0 997.574 2472.38 0.05 0 0 -358.821 0 0 0 0 0 0 0 0 -204.398 -18.9978 0 0 0 0 -763.039 0 -482.727 0 0 0 0 0 898.236 0 0 194.479 0 0 -2485.66 0 0 0 0 0 0 0 0 -1798.84 0 0 0 
0 0 0 0 0 0 0 0 -1694.46 -2392.88 -2075.03 0 0 1654.18 0 949.965 0 0 0 1542.79 0 0.02 1024.89 1859.87 272.759 0 0 0 0 0 0 1942.43 -18.2348 1355.56 0 1335.87 -632.572 0 -1103.47 2491 0 0 0 0 0 -1841.26 1607.33 0 0 2163.38 1774.73 0 0 1279.87 -1051.13 0 0 0 0 0 0 1832.26 0 0 0 
0 0 0 -2219.38 0 0 1695.23 0 -827.433 0 0 0 685.675 0 2229.61 0 -1345.33 0 0 0 0 1810.59 0.07 0 0 0 0 -545.595 0 0 0 0 0 0 0 0 1731.39 0 0 0 0 0 1931.29 0 2208.09 0 0 0 0 0 0 0 0 0 0 0 0 1811.04 0 1245.84 586.642 2358.09 0 0 720.008 
0 0 688.269 0 0 1646.7 0 1755.5 -480.59 0 0 0 -797.372 1936.32 1703.77 0 1786.94 0 1958.14 0 1525.09 473.113 0 0.07 0 0 0 173.727 0 0 0 0 0 0 0 0 0 429.014 0 0 0 0 0 0 1898.18 0 0 0 0 0 0 0 0 0 0 0 0 0 0 0 0 0 0 0 0 
0 -1050.68 0 0 0 0 488.067 -2205.95 0 1578.8 2480.32 0 0 0 0 0 0 0 0 0 0 1226.16 0 0 0.01 0 0 995.895 534.15 0 -855.815 0 0 0 -1103.17 1129.57 0 0 0 0 0 0 73.1681 0 397.427 0 0 0 1639.23 0 0 1560.18 0 2088.15 0 0 -1787.09 0 0 1561.86 0 0 0 0 0 
-2317.5 0 0 0 0 0 -799.356 0 -2064.5 0 0 0 1394.47 0 0 0 -356.38 0 -772.347 0 0 0 0 0 0 0.04 -170.37 0 0 0 1457.49 0 0 0 0 0 0 0 0 0 530.183 0 145.65 0 2062.52 473.113 0 1007.34 0 1466.19 420.164 0 0 -1229.67 238.884 0 0 0 0 -385.678 0 0 0 0 0 
0 -1356.78 0 2080.98 0 0 0 0 -2395.78 0 0 0 0 227.287 2277.21 0 0 0 -527.589 0 0 0 0 0 0 1616.49 0.04 0 0 0 -803.018 0 0 0 0 0 0 0 0 0 0 -389.645 0 0 0 0 0 0 0 0 0 0 0 -564.364 51.9578 0 0 0 326.472 0 0 0 0 0 0 
773.263 0 0 0 0 416.196 -1840.8 0 -130.543 0 -1270.26 0 -2403.87 2350 0 0 0 0 334.101 2008.96 0 0 -1905.8 1261.86 1073.41 0 0 0.04 398.495 0 0 0 0 1317.87 0 0 0 0 0 0 -719.092 0 0 0 0 0 0 0 0 1517.61 2313.38 0 0 0 0 0 0 0 0 0 0 0 0 0 0 
0 0 0 0 0 0 0 0 279.015 0 0 0 0 0 0 0 0 0 0 0 0 0 0 0 -1559.88 0 0 -974.38 0.04 0 0 -1714.61 -266.961 0 0 0 2339.63 0 0 0 2196.04 0 0 0 0 0 0 0 0 612.278 2210.99 0 0 2061.6 0 0 0 0 0 0 0 0 0 0 0 
0 0 0 0 0 103.992 -650.121 0 0 0 0 1502.81 0 0 0 0 0 -430.998 0 0 0 0 0 0 0 0 0 0 0 0 0 0 0 0 2393.8 0 691.778 0 -1207.69 891.98 0 2396.24 -2426.76 0 0 0 0 0 0 0 21.897 0 0 0 -1345.33 238.884 0 0 0 0 0 0 0 0 0 
1900.62 0 0 0 -846.355 720.923 0 0 0 0 0 0 0 -2350.76 0 0 0 0 0 0 0 0 0 0 1431.09 791.421 776.315 0 0 0 0 0 1542.79 0 -1938.31 0 -1269.8 358.058 0 2264.09 1402.86 -159.23 1547.98 0 0 453.124 426.267 0 0 0 0 0 0 0 0 0 0 1313.29 0 0 0 0 0 -1698.89 0 
0 0 0 535.524 0 0 0 0 0 1567.05 0 1665.17 0 883.892 0 0 2490.54 0 0 669.195 0 -330.744 0 0 0 0 0 0 -664.006 0 0 0.06 0 0 -1097.22 2095.32 0 0 -2057.18 0 0 0 0 0 0 972.243 1448.48 0 0 0 0 0 0 1947.77 0 1123.16 0 0 0 0 0 0 -1533.17 -1249.96 2323.3 
0 -1118.27 0 0 -2055.65 2297.05 0 0 0 0 0 0 0 1072.65 0 243.461 0 0 0 0 529.267 728.553 0 0 0 0 0 0 -301.294 0 1810.28 0 0.03 0 0 1248.59 0 0 2323.91 0 0 2283.32 0 0 0 1598.03 -680.639 0 0 0 0 0 0 0 974.38 0 -1537.45 -749.458 0 0 -1549.5 0 0 0 0 
0 0 0 0 0 0 0 916.7 0 412.534 0 0 0 0 -2189.78 575.961 0 0 0 0 1141.93 146.107 0 0 0 0 0 2095.17 0 0 0 0 0 0 0 1268.88 0 0 0 0 0 0 0 0 -1201.44 0 -2313.38 0 0 0 0 1422.24 1536.53 616.092 0 0 0 0 -2458.49 0 0 0 0 0 0 
-1574.68 -1583.22 -804.392 0 534.761 0 0 0 -1576.51 0 0 0 0 0 607.089 0 0 0 1657.23 0 0 0 0 0 -924.635 0 0 0 0 2193.59 1060.29 1498.69 0 0 0.07 -1088.82 0 0 1561.56 1841.41 -2026.96 0 1804.48 0 0 0 0 0 0 0 -588.778 0 0 0 0 0 0 0 0 0 1256.83 0 0 0 0 
0 0 0 2149.04 0 0 -933.943 0 0 0 0 0 -1241.72 0 0 0 0 0 0 0 0 952.559 0 0 2317.8 0 0 0 0 0 0 162.435 1792.12 -2496.19 1352.5 0.02 -2173.91 0 0 0 1367.31 0 1743.14 0 1693.24 0 0 1348.23 0 0 0 0 0 0 0 0 0 0 -1832.71 0 0 0 0 0 0 
0 0 0 2465.82 0 0 0 0 488.372 0 0 0 -984.451 2221.98 0 -846.965 454.65 0 0 0 0 1327.02 1222.19 0 0 0 0 0 -1430.02 -1615.42 565.127 0 0 0 0 2089.68 0.02 0 -264.519 0 1401.18 0 0 0 0 -309.076 0 0 -2058.7 0 0 0 505.615 0 -1304.44 0 0 0 1087.15 0 -875.5 0 0 447.783 0 
1994.31 0 1889.48 0 2050.92 0 0 0 0 0 0 0 0 -1614.35 1913.28 0 0 0 0 0 0 0 0 1737.95 0 0 0 0 0 0 -79.8822 0 0 0 0 0 0 0.02 0 25.4067 0 859.63 0 2295.37 -424.894 0 0 -1309.17 0 0 21.5918 0 0 0 0 0 0 0 0 0 0 0 0 0 -777.993 
0 -349.666 0 772.042 0 0 0 0 531.556 0 0 0 0 -112.69 0 0 2302.24 0 -2413.17 -1689.12 81.2555 165.029 0 0 0 0 0 0 0 -1217.46 0 412.534 482.421 0 208.365 0 2150.72 0 0.04 0 2203.67 1670.96 0 866.344 0 0 0 0 0 0 -411.924 731.91 0 2460.48 0 0 0 2149.34 0 0 500.275 0 0 0 632.725 
551.851 0 0 0 0 0 0 0 0 0 0 0 13.657 0 0 0 0 199.667 0 -1852.09 0 -839.946 0 0 0 0 0 0 0 1136.43 1758.4 0 0 0 1438.26 0 0 542.695 0 0.09 0 0 0 -426.42 -730.079 -1037.4 0 1069.6 0 0 0 1282.62 0 0 0 0 0 0 0 0 0 0 0 1409.12 0 
0 0 0 0 0 -639.744 0 793.863 92.0896 2397.31 0 -2368.16 0 0 0 0 0 271.081 1560.18 0 836.894 0 0 0 0 2168.42 0 -450.835 -1802.19 0 490.509 0 0 0 1318.93 1641.51 2129.51 0 -1527.07 0 0.02 0 0 0 0 -1822.34 0 0 0 0 0 0 0 0 0 0 0 0 0 0 1532.11 -1473.05 0 0 0 
0 -2060.53 0 0 0 0 0 0 1467.25 0 0 0 0 0 0 0 0 0 0 0 0 0 0 0 0 0 223.777 0 0 -1435.36 -619.144 0 2236.01 0 0 0 0 -159.993 2469.48 0 0 0.04 -1391.26 0 1753.67 0 0 1342.59 -747.017 0 0 0 0 0 0 0 0 0 0 796.609 0 0 1370.05 0 1875.44 
-109.638 1997.82 0 0 0 0 0 0 -2359.61 0 0 0 0 0 2343.9 0 0 0 1098.28 -294.733 0 0 1780.22 0 583.743 -148.091 0 0 0 497.833 -100.94 0 0 0 297.021 565.737 0 0 0 0 0 1418.12 0.02 -1611.45 0 0 0 0 1346.55 0 0 -809.58 0 0 0 0 0 0 0 0 0 0 0 0 1205.25 
0 0 1524.93 0 1902.14 0 0 0 2230.98 -1900.92 0 0 0 0 1484.34 0 0 0 924.787 1041.06 0 0 0 0 0 0 0 0 0 0 0 0 0 0 0 0 0 925.855 940.199 -2197.87 0 0 -979.72 0.01 0 0 0 0 1040.76 -488.22 1561.1 1815.93 0 0 0 0 0 0 0 -700.934 0 0 -1493.8 -460.448 0 
1692.63 0 2425.69 0 0 984.603 0 0 0 0 0 0 -1386.99 0 0 0 1749.24 0 1847.51 0 0 0 1217.15 1142.38 -635.624 -532.777 0 0 0 0 0 0 0 -2142.17 0 1759.01 0 2109.82 0 2240.9 0 1627.93 0 0 0.09 -2298.88 0 0 -1098.13 0 0 0 0 1990.95 -1713.54 0 169.607 0 1649.75 0 0 0 0 0 -1508.76 
724.891 0 1792.28 0 0 0 0 171.285 -2063.59 104.297 558.565 0 0 0 1528.44 0 0 0 1513.18 0 0 -1441.16 0 0 0 -2021.93 0 0 0 0 2136.07 1643.04 2103.11 0 0 0 454.802 0 0 -1579.1 -740.303 0 0 0 -2440.34 0.09 0 0 0 1087.76 0 1732.15 -1977.37 0 0 0 0 0 0 0 0 0 0 0 0 
0 0 0 0 0 0 0 0 790.963 0 -1764.96 0 1727.12 0 0 0 124.287 0 0 0 2107.53 -960.036 0 0 0 0 0 0 0 0 -141.224 -430.692 1199.76 1362.12 0 0 0 0 0 0 0 0 0 0 0 0 0.08 0 0 0 0 0 1429.72 1621.07 0 0 -1726.05 0 0 0 0 0 0 0 0 
0 0 0 0 0 0 1499.3 -526.978 0 0 343.257 0 369.198 0 0 0 153.432 0 0 0 0 0 0 0 0 1661.66 0 0 0 0 0 0 0 0 0 421.079 0 463.195 0 1605.04 0 951.033 0 0 0 0 0 0.01 0 -2091.66 587.71 0 0 0 0 0 0 0 129.933 0 0 0 0 0 0 
-2244.41 -355.922 0 980.483 0 -2160.48 0 2349.09 0 0 839.488 0 1428.34 -2349.7 0 0 1378.6 234.001 0 -257.958 0 0 0 0 2491.15 0 0 0 0 0 0 0 0 0 0 0 -666.906 0 0 0 0 2446.9 2101.58 439.238 -2033.07 0 0 0 0.04 -951.338 0 2315.21 0 0 0 0 0 0 0 0 0 0 0 0 0 
0 1007.8 0 0 0 0 0 -1401.49 0 0 0 0 2485.81 0 0 0 0 0 -922.651 0 -256.584 -1415.83 0 0 0 642.491 0 1243.25 -1421.17 0 0 0 0 0 0 0 0 0 0 0 0 0 0 -2400.81 0 1319.39 0 -18.2348 2358.55 0.05 0 0 0 0 0 1149.71 0 0 0 0 0 0 0 0 0 
0 1118.58 0 0 0 0 975.906 0 0 0 0 0 0 0 0 0 0 0 0 0 0 542.238 0 0 0 387.204 0 -685.217 -1095.54 1735.97 0 0 0 0 -1987.14 0 0 436.644 1759.62 0 0 0 0 2015.67 0 0 0 -688.116 0 0 0.02 0 0 0 1702.09 0 0 0 0 0 0 0 0 0 0 
0 0 -164.571 0 0 731.147 0 0 0 0 0 0 0 0 -306.33 0 0 0 -1929.46 0 0 0 0 0 292.444 0 0 0 0 0 0 0 0 261.467 0 0 0 0 815.836 446.562 0 0 -77.5933 -1602.6 0 -343.562 0 0 1562.47 0 0 0.05 531.556 0 0 1978.44 0 0 0 0 -40.3607 0 0 0 0 
0 1836.83 0 0 0 0 0 0 0 -2343.13 0 2391.35 1237.14 10.3 0 0 0 0 756.325 1737.49 1101.03 0 0 0 0 0 0 0 0 0 0 0 0 2065.57 0 0 186.697 0 0 0 0 0 0 0 0 1322.44 -1945.02 0 0 0 0 2322.84 0.08 -646.458 0 0 0 0 0 0 0 330.287 0 0 0 
0 0 -251.396 0 0 2008.35 442.595 0 0 -1946.09 0 0 -274.743 0 0 1343.96 1786.94 0 0 0 0 530.946 0 0 -1061.66 1705.91 2424.92 0 1841.26 0 0 -1723.15 0 513.398 0 0 0 0 116.81 0 0 0 0 0 -1386.38 0 -526.215 0 0 0 0 0 -544.069 0.07 0 0 0 0 0 0 0 1242.94 0 0 0 
0 -1891 0 0 0 0 0 0 -1857.13 0 0 0 0 1596.19 0 2040.39 0 0 0 0 0 1993.39 0 0 0 539.338 506.836 0 0 -548.952 0 0 -1002.61 0 0 0 2353.05 0 0 0 0 0 0 0 1180.38 0 0 0 0 0 -1301.08 0 0 0 0.03 0 0 0 0 0 0 0 -1651.43 0 0 
2063.28 0 0 0 0 0 2189.17 0 0 0 0 0 0 0 0 0 0 972.396 0 0 0 0 0 0 0 0 0 0 0 2124.16 0 -273.675 0 0 0 0 0 0 0 0 0 0 0 0 0 0 0 0 0 -761.513 0 -84.1548 0 0 0 0.03 0 0 0 0 0 0 0 0 0 
0 0 0 0 0 -259.331 0 0 0 0 0 0 0 0 0 0 0 0 5.11185 0 0 0 0 0 1494.42 0 0 0 0 0 0 0 2362.21 0 0 0 0 0 0 0 0 0 0 0 2271.42 0 -1310.08 0 0 0 0 0 0 0 0 0 0.09 0 0 0 0 0 0 0 -1031.6 
0 0 0 0 0 0 -988.418 0 0 0 0 0 0 766.396 0 0 0 0 0 0 0 0 1979.81 0 0 0 0 0 0 0 -391.629 0 842.997 0 0 0 0 0 27.3904 0 0 0 0 0 0 0 0 0 0 0 0 0 0 0 0 0 0 0.09 0 0 0 0 0 0 0 
0 0 0 0 0 0 0 0 0 0 0 0 0 0 0 0 -49.9741 0 0 0 0 0 0 0 0 0 757.088 0 0 0 0 0 0 1818.83 0 -290.002 -266.655 0 0 0 0 0 0 0 -431.15 0 0 1152.61 0 0 0 0 0 0 0 0 0 0 0.01 0 0 0 0 0 0 
0 409.787 0 0 0 0 0 -1338.47 0 0 0 0 0 0 0 0 0 0 0 0 0 0 210.654 0 1898.63 -849.406 0 0 0 0 0 0 0 0 0 0 0 0 0 0 0 -987.808 0 2423.55 0 0 0 0 0 0 0 0 0 0 0 0 0 0 0 0.06 0 0 0 0 0 
0 0 0 0 0 0 0 0 0 0 0 0 0 0 0 0 0 0 0 1111.71 0 0 1910.84 0 0 0 0 0 0 0 0 0 -1133.23 0 2348.63 0 -270.165 0 -2149.04 0 985.519 0 0 0 0 0 0 0 0 0 0 -2045.27 0 0 0 0 0 0 0 0 0.06 0 0 0 0 
0 0 0 0 0 0 0 0 0 0 0 0 0 0 0 0 1753.21 0 -1581.55 0 1357.39 1344.11 -2446.59 0 0 0 0 0 0 0 0 0 0 0 0 0 0 0 0 0 1375.24 0 0 0 0 0 0 0 0 0 0 0 1238.82 -430.082 0 0 0 0 0 0 0 0.09 0 0 0 
0 0 0 -990.707 0 0 0 2260.12 0 0 0 0 0 0 0 0 0 0 0 -405.21 0 0 0 0 0 0 0 0 0 0 0 796.915 0 0 0 0 0 0 0 0 0 1190.76 0 2125.54 0 0 0 0 0 0 0 0 0 0 -1225.24 0 0 0 0 0 0 0 0.03 0 0 
0 0 0 0 0 0 0 0 0 730.995 0 0 0 0 0 0 0 0 0 0 0 0 0 0 0 0 0 0 0 0 -1611 1518.98 0 0 0 0 1972.49 0 0 -1438.26 0 0 0 1592.68 0 0 0 0 0 0 0 0 0 0 0 0 0 0 0 0 0 0 0 0 0 
406.278 0 0 0 1629.76 -1086.38 0 0 0 0 0 0 0 0 0 0 0 0 0 0 0 0 1311.91 0 0 0 0 0 0 0 0 2149.65 0 0 0 0 0 -275.964 1295.43 0 0 -2135.46 -262.078 0 1940.75 0 0 0 0 0 0 0 0 0 0 0 2139.73 0 0 0 0 0 0 0 0.06 
