*Vertices 48
*Matrix 
0.08 0 0 0 1032.67 0 -1389.13 685.217 0 932.875 0 0 0 0 2294.92 0 1983.93 0 0 0 686.285 -971.48 0 0 0 0 0 0 0 0 492.95 1426.82 0 488.678 0 0 0 0 -1753.67 0 0 1646.24 0 0 0 214.469 -183.645 0 
0 0.07 0 0 0 0 0 -439.085 0 0 0 0 0 0 -944.777 0 -2256 0 0 0 0 840.709 0 1566.44 0 1170.92 0 0 0 1613.44 1305.35 0 0 0 0 1491.82 0 0 0 0 0 0 0 1581.7 0 1508 -1882.92 0 
0 0 0.07 0 -261.315 0 0 0 0 0 0 0 0 0 0 0 20.5237 0 0 0 0 2062.36 0 0 0 0 0 0 0 0 0 0 0 0 -145.65 0 -380.032 0 2277.52 0 1498.08 0 0 0 0 0 1279.11 0 
0 0 0 0.03 0 1103.47 413.449 -1847.36 0 0 0 0 2029.1 0 0 0 0 526.063 -819.193 0 2201.83 0 0 -2089.53 0 636.54 0 0 2105.55 0 0 0 0 0 0 558.412 353.023 0 0 -1171.68 0 1711.25 0 11.8259 0 1432.31 0 0 
489.746 0 1064.87 0 0.05 -149.159 0 1944.72 -596.713 0 0 2471.77 0 0 0 -443.052 0 0 0 -294.733 0 0 0 -1391.26 -645.085 0 0 0 0 -597.476 0 0 0 0 0 -2403.56 0 0 0 0 2067.09 0 0 375.759 2281.18 -296.411 0 0 
0 0 0 1715.06 -819.803 0.02 0 -2298.43 0 0 0 0 2334.13 0 0 0 0 0 0 0 0 2246.39 0 0 0 0 0 0 0 103.381 0 0 33.0363 0 0 -1658.15 -546.358 0 0 -1853.16 0 1705.15 0 0 1279.11 0 0 0 
-2093.65 0 0 -848.643 0 0 0.09 0 -1694.62 0 0 0 2241.36 0 0 0 -25.5593 0 0 0 0 2428.59 0 0 0 0 0 0 0 2051.53 -1178.85 0 0 0 0 0 1598.94 0 0 0 0 0 0 0 0 0 0 0 
300.836 974.685 0 680.486 726.417 -1664.56 0 0.07 0 -678.961 0 0 0 2189.93 0 0 0 0 -1826.61 -528.962 0 0 0 0 0 -501.953 0 -198.904 -2296.59 1524.32 0 0 563.295 0 0 1322.75 1562.01 0 0 0 0 0 0 -1486.48 1495.03 2104.48 0 0 
0 0 0 0 1734.44 0 -600.681 0 0.01 2248.68 0 0 0 912.427 0 0 0 0 2250.21 849.254 0 0 0 1357.23 0 0 0 0 -1215.17 0 0 0 0 -2069.84 0 0 0 0 0 0 0 -119.098 0 0 -1741.46 0 -767.006 0 
915.632 0 0 0 0 0 0 29.0689 2010.79 0.04 2359.31 0 0 0 -1511.2 0 0 0 -1610.84 0 0 0 0 0 0 2163.38 0 0 0 891.827 0 0 0 1037.71 0 -1554.23 -2346.34 0 0 0 0 0 -702.307 0 1376 0 0 0 
0 0 0 0 0 0 0 0 0 25.1015 0.01 0 0 0 0 2316.13 0 0 -1176.87 0 0 0 0 -2142.02 0 0 0 -344.478 0 0 -535.524 0 1306.57 0 0 1967.91 -425.047 0 0 0 0 -1526.92 0 1419.03 -226.981 0 0 0 
0 0 0 0 513.245 0 0 0 0 0 0 0.03 0 0 2346.34 -964.309 -1470.76 0 0 0 0 1480.83 1183.58 0 0 0 0 0 0 0 1234.55 0 0 -1812.27 0 0 0 999.252 0 -468.23 0 0 0 1082.72 0 0 0 0 
0 0 0 -2271.72 0 -517.823 1580.78 0 0 0 0 0 0.02 0 0 1658.15 0 1589.48 0 0 0 0 0 0 0 0 0 0 -195.395 0 0 0 0 0 2076.4 0 0 0 1369.59 0 -1043.96 0 0 0 0 0 0 0 
0 0 0 0 0 0 0 -2058.55 2358.55 0 0 0 0 0.05 0 0 0 0 0 0 -1453.22 0 0 -1744.67 0 0 0 973.464 2335.66 0 0 0 0 538.575 0 0 0 0 0 0 0 -1109.73 -75.9148 1392.18 0 0 1518.52 0 
9.23185 1014.21 0 0 0 0 0 0 0 -1530.43 0 2267.91 0 0 0.02 121.693 1092.03 0 0 0 0 0 0 0 428.556 2195.88 0 0 0 -2205.95 0 0 0 0 0 984.756 0 0 1154.13 0 0 0 0 0 0 2190.69 1177.33 1927.32 
0 0 0 0 980.636 0 0 0 0 0 -1013.14 -417.57 1053.73 0 1424.07 0.03 -1531.5 0 0 2139.58 1441.77 0 0 0 0 0 436.491 0 0 1488.77 0 0 0 0 2054.12 1854.53 0 0 0 0 0 0 0 0 0 92.0896 1910.23 0 
1066.55 -286.798 -979.263 0 0 0 -1005.36 0 0 0 0 2225.64 0 0 1179.62 -642.338 0.01 0 0 0 0 0 0 0 0 0 0 0 0 1279.11 0 0 523.621 0 0 0 0 -162.74 0 574.587 2085.71 0 0 0 0 280.541 0 951.338 
0 0 0 1397.37 0 0 0 0 0 0 0 0 -322.047 0 0 0 0 0.04 1577.12 0 0 813.242 0 598.544 0 0 1363.8 0 -371.944 0 0 1821.73 0 1460.23 0 0 0 2226.71 0 0 0 -232.627 1624.42 0 0 82.4763 0 0 
0 0 0 1284.45 0 0 0 -354.701 -2067.71 739.998 2470.4 0 0 0 0 0 0 2410.89 0 1219.14 0 0 454.802 141.987 0 0 0 0 0 -382.473 -1118.88 0 0 0 0 0 0 0 0 0 0 0 0 -394.833 0 -1235.92 -2055.19 0 
0 0 0 0 474.792 0 0 -418.79 13.5044 0 0 0 0 0 0 -1333.43 0 0 1919.23 0.09 287.713 0 0 0 0 0 429.624 -571.078 0 0 486.999 0 864.055 515.076 0 0 0 0 0 0 0 0 0 0 1849.96 0 0 0 
-195.09 0 0 -970.717 0 0 0 0 0 0 0 0 0 -824.686 0 1558.35 0 0 0 2247 0.01 0 0 0 1859.11 0 0 0 0 0 0 0 0 0 0 0 0 0 1358.76 0 0 0 0 -476.928 0 0 0 0 
315.943 2050.31 1499.76 0 0 1590.09 -604.495 0 0 0 0 -1704.54 0 0 0 0 0 -1555.3 0 0 0 0.06 1740.24 -1384.4 0 0 0 -1310.85 -2081.74 0 419.401 0 1820.66 0 0 2245.78 93.6155 0 -266.503 2343.13 0 0 0 0 0 0 0 0 
0 0 0 0 0 0 0 0 0 0 0 1175.5 0 0 0 0 0 0 -104.144 0 0 -1478.7 0.03 0 0 -390.866 0 0 0 0 0 2117.76 0 -2126.15 0 0 2289.73 0 0 0 0 0 0 0 1657.38 0 0 0 
0 1224.02 0 1354.03 1224.94 0 0 0 2189.32 0 834.3 0 0 695.441 0 0 0 627.842 -1372.95 0 0 -1998.58 0 0.07 0 0 -852.916 -91.3266 1424.99 795.999 -874.889 0 1779.31 728.553 0 0 0 129.017 0 891.675 0 -2306.51 0 0 0 0 0 0 
0 0 0 0 -425.199 0 0 0 0 0 0 0 0 0 -671.026 0 0 0 0 0 1824.32 0 0 0 0.03 0 0 580.691 519.349 0 0 0 0 0 0 0 0 0 0 0 0 0 0 0 0 -1592.68 0 0 
0 -1057.24 0 -1209.22 0 0 0 658.513 0 278.558 0 0 0 0 1057.08 0 0 0 0 0 0 0 -584.658 0 0 0.07 1815.16 0 0 0 0 0 0 0 0 1754.13 0 0 0 0 1610.39 0 0 0 0 0 0 -2213.13 
0 0 0 0 0 0 0 0 0 0 0 0 0 0 0 -1486.63 0 -828.196 0 -1869.18 0 0 0 1525.54 0 -2016.59 0 0 -319.147 0 0 0 0 0 0 0 0 0 1609.62 1248.28 0 1769.23 0 0 0 0 2102.5 0 
0 0 0 0 0 0 0 2238.61 0 0 288.476 0 0 1502.35 0 0 0 0 0 779.519 0 -2093.65 0 1217.76 -465.484 0 0 0.02 0 0 0 0 0 0 0 0 -1820.35 0 0 0 0 0 0 0 2179.4 0 0 -931.959 
0 0 0 499.817 0 0 0 -1343.04 2143.09 0 0 0 -598.086 1745.89 0 0 0 2053.97 0 0 0 1384.85 0 611.209 700.018 0 1371.58 0 0.01 0 0 180.898 1145.89 0 0 0 0 0 0 -353.481 0 784.86 0 1383.02 -1379.21 2046.04 -724.433 0 
0 -2445.37 0 0 1153.22 761.055 2498.02 1573.92 0 -2127.83 0 0 0 0 -1128.96 2477.87 282.372 0 2491.61 0 0 0 0 813.7 0 0 0 0 0 0.08 0 0 0 0 0 0 0 -602.664 0 236.29 -1411.86 0 -229.881 0 603.885 2354.73 1762.22 0 
2299.49 1951.73 0 0 0 0 1859.42 0 0 0 1342.13 -149.464 0 0 0 0 0 0 1616.64 -2160.63 0 1072.5 0 1646.86 0 0 0 0 0 0 0 0 1834.39 0 0 0 0 -351.65 11.2156 720.161 -1914.66 0 0 0 0 -2348.17 -1266.44 0 
933.79 0 0 0 0 0 0 0 0 0 0 0 0 0 0 0 0 59.1296 0 0 0 0 -20.5237 0 0 0 0 0 -451.598 0 0 0.01 388.119 0 -1685.31 0 0 0 1693.4 0 0 0 0 0 0 0 0 0 
0 0 0 0 0 2256 0 1330.53 0 0 1775.49 0 0 0 0 0 2021.32 0 0 -866.802 0 401.547 0 2452.54 0 0 0 0 2427.82 0 232.475 365.535 0.01 0 0 91.4792 -630.436 0 0 0 -779.977 0 -1232.41 0 0 0 -512.94 0 
1608.25 0 0 0 0 0 0 0 -1899.09 1546.75 0 -1729.71 0 2311.09 0 0 0 1903.06 0 -2378.54 0 0 -980.789 -1841.87 0 0 0 0 0 0 0 0 0 0.04 -687.658 0 572.451 0 0 370.266 0 0 1653.87 0 0 0 1047.01 0 
0 0 870.159 0 0 0 0 0 0 0 0 0 -1329.62 0 0 -1657.69 0 0 0 0 0 0 0 0 0 0 0 0 0 0 0 717.872 0 2209.46 0.09 0 0 0 0 0 0 0 2184.74 0 2215.72 0 2040.24 0 
0 2334.13 0 -615.787 1215.02 -1989.27 0 -1760.23 0 -2313.53 2139.42 0 0 0 398.953 -1888.56 0 0 0 0 0 758.461 0 0 0 -1310.85 0 0 0 0 0 0 1611.61 0 0 0.05 0 1673.71 0 0 1831.49 0 0 0 0 0 2044.36 0 
0 0 559.938 452.513 0 1730.32 -2137.75 -1029.92 0 122.761 -60.8081 0 0 0 0 0 0 0 0 0 0 -492.035 2006.36 0 0 0 0 2203.36 0 0 0 0 787.454 -333.033 0 0 0 0 1582.31 0 0 0 0 0 0 0 0 0 
0 0 0 0 0 0 0 0 0 0 0 1949.75 0 0 0 0 -1065.63 554.903 0 0 0 0 0 2254.02 0 0 0 0 0 2066.79 -157.094 0 0 0 0 -62.0289 0 0.07 0 0 0 -1734.75 0 0 2063.74 0 0 0 
793.558 0 2423.09 0 0 0 0 0 0 0 0 0 536.286 0 -2484.13 0 0 0 0 0 618.992 -397.732 0 0 0 0 859.02 0 0 0 -780.74 2015.06 0 0 0 0 -690.71 0 0.09 0 0 2467.04 0 0 0 0 2206.87 1529.36 
0 0 0 1681.95 0 1748.79 0 0 0 0 0 685.827 0 0 0 0 -1679.2 0 0 0 0 1078.45 0 -1927.93 0 0 1967.76 0 2397.46 1650.82 -1538.36 0 0 1770.15 0 0 0 0 0 0.01 0 0 0 0 0 0 0 0 
0 0 -1757.79 0 -1204.95 0 0 0 0 0 0 0 586.337 0 0 0 1177.18 0 0 0 0 0 0 0 0 356.99 0 0 0 434.812 37.7667 0 1280.48 0 0 710.852 0 0 0 0 0.02 0 0 0 0 0 0 0 
996.506 0 0 -468.535 0 -403.226 0 0 180.593 0 1327.63 0 0 440.611 0 0 0 -1665.47 0 0 0 0 0 -2015.37 0 0 637.455 0 1116.29 0 0 0 0 0 0 0 0 1787.24 -1001.08 0 0 0.07 0 0 0 0 0 0 
0 0 0 0 0 0 0 0 0 -2102.95 0 0 0 1569.64 0 0 0 1294.52 0 0 0 0 0 0 0 0 0 0 0 688.421 0 0 1414.76 1624.42 1959.06 0 0 0 0 0 0 0 0.05 -761.513 0 0 0 0 
0 632.115 0 -161.519 -1585.06 0 0 175.1 0 0 -2139.42 629.215 0 2087.08 0 0 0 0 1373.87 0 -1612.22 0 0 0 0 0 0 0 2030.17 0 0 0 0 0 0 0 0 0 0 0 0 0 747.475 0.06 0 -1067.92 0 0 
0 0 0 0 1740.55 1673.71 0 649.052 -25.5593 -836.131 715.735 0 0 0 0 0 0 0 0 2453.15 0 0 -85.8333 0 0 0 0 1059.53 736.335 662.481 0 0 0 0 1641.67 0 0 -725.501 0 0 0 0 0 0 0 0 1783.43 0 
-1740.39 -1164.66 0 2168.57 -2407.83 0 0 -269.86 0 0 0 0 0 0 1697.06 -1105 913.038 954.543 2073.2 0 0 0 0 0 830.332 0 0 0 1368.37 1874.07 205.466 0 0 0 0 0 0 0 0 0 0 0 0 -2239.07 0 0.01 0 0 
-1221.43 -655.156 -561.464 0 0 0 0 0 1874.07 0 0 0 0 73.9311 1784.04 2425.69 0 0 -2425.84 0 0 0 0 0 0 0 973.159 0 1810.59 1617.25 -196.158 0 1859.26 -1793.19 1570.25 -2494.66 0 0 372.707 0 0 0 0 0 926.313 0 0.01 0 
0 0 0 0 0 0 0 0 0 0 0 0 0 0 -98.0407 0 -981.857 0 0 0 0 0 0 0 0 1305.66 0 1580.32 0 0 0 0 0 0 0 0 0 0 -129.475 0 0 0 0 0 0 0 0 0.07 
