*Vertices 47
*Matrix 
0.06 0 648.137 0 0 165.792 0 0 0 2277.37 0 0 200.278 0 0 0 0 0 0 0 0 0 0 0 0 0 0 0 0 0 0 0 0 0 1370.2 0 0 0 1612.52 0 -360.5 0 0 0 0 644.322 0 
0 0.09 0 0 0 0 0 0 0 0 0 0 0 -1118.88 0 0 0 0 826.212 0 0 1253.32 0 0 0 0 0 0 0 0 0 0 0 0 -28.7637 0 0 0 2468.26 76.22 0 0 0 0 0 0 0 
-1284.91 0 0.03 0 0 0 0 0 0 0 0 2391.66 0 0 0 0 0 0 0 2054.89 0 0 0 0 0 0 0 0 0 0 0 0 0 0 0 0 0 0 0 0 -1433.53 0 0 0 0 0 1974.93 
0 0 0 0.03 0 0 0 0 0 0 0 0 0 0 0 0 0 1133.99 0 0 0 0 0 0 1013.75 0 0 0 987.96 0 0 0 0 0 0 0 0 0 0 0 0 0 489.593 0 0 0 0 
0 0 0 0 0 0 1058.31 0 0 9.84222 0 0 0 0 0 0 0 0 421.995 0 0 0 0 2288.2 0 0 0 0 -837.809 0 0 1292.99 -192.19 0 0 0 0 0 0 0 0 -2188.56 1636.63 0 0 368.282 0 
1976.3 0 0 0 0 0.01 0 0 0 0 0 0 2000.26 0 0 0 0 0 0 0 0 0 -1984.08 0 0 0 2176.81 0 0 0 1050.37 0 0 0 1558.35 0 0 0 0 0 164.571 1113.7 0 0 0 0 0 
0 0 0 0 -41.5815 0 0 0 2407.53 0 0 0 0 0 -193.869 0 0 0 2490.84 0 0 0 0 0 0 -1692.94 0 0 0 0 0 0 0 1832.1 0 0 0 0 0 0 0 0 0 -1433.38 0 0 0 
0 0 0 0 0 0 0 0.07 0 0 0 0 0 0 1755.96 0 0 0 0 0 0 0 0 0 0 0 0 0 0 0 0 0 -1148.18 0 984.756 0 828.959 0 0 0 1583.38 0 0 0 0 -1385.16 0 
0 0 0 0 0 0 -531.404 0 0.03 0 0 1500.52 1432.46 0 0 -1720.56 0 0 0 0 0 18.0822 0 0 0 0 0 -272.607 0 0 0 0 0 -1365.02 0 0 0 0 0 0 -124.134 0 0 1477.48 0 1557.74 0 
-1048.08 0 0 0 -553.072 0 0 0 0 0.06 0 0 0 0 0 794.626 -179.525 0 337.306 0 0 0 0 0 0 0 0 0 0 0 0 0 126.881 0 0 0 1880.78 1186.48 0 0 0 2489.62 0 0 0 0 0 
0 0 0 0 0 0 0 0 0 0 0.02 0 0 0 0 0 0 0 0 0 -1008.56 0 0 0 0 0 324.335 1402.1 738.166 0 1321.53 0 2410.58 0 2164.6 0 0 0 927.229 0 0 0 0 0 0 0 0 
0 0 1481.9 0 0 0 0 0 1451.99 0 0 0.03 0 -8.46889 1580.32 0 0 0 0 0 0 0 0 -449.919 0 0 0 0 0 0 0 522.858 219.199 0 0 0 0 0 0 0 0 -70.1163 0 0 1072.5 0 0 
-75.457 0 0 0 0 -1875.9 0 0 306.177 0 0 0 0.01 2057.33 0 0 0 0 0 0 -1712.62 0 -1135.36 1825.85 0 0 0 0 0 0 0 0 0 0 0 0 0 0 0 0 0 0 0 0 0 0 0 
0 1150.17 0 0 0 0 0 0 0 0 0 2110.13 -1721.32 0.04 0 0 0 0 0 0 0 0 0 0 0 0 0 0 0 0 -822.703 0 0 0 0 548.036 0 0 0 0 0 51.6526 1942.43 0 0 0 0 
0 0 0 0 0 0 1067.92 1472.75 0 0 0 -184.256 0 0 0.01 -582.522 0 0 523.927 0 0 0 0 0 0 0 0 0 0 0 0 0 0 0 0 0 0 0 0 -1597.72 0 1947.31 -875.042 1240.04 0 0 0 
0 0 0 0 0 0 0 0 -777.078 -317.927 0 0 0 0 1063.8 0.03 0 0 2383.72 0 0 0 0 0 0 0 0 0 0 0 0 0 0 0 568.178 0 0 0 0 0 0 0 0 0 0 0 0 
0 0 0 0 0 0 0 0 0 856.883 0 0 0 0 0 0 0.05 0 0 0 0 0 0 0 0 0 0 0 0 0 0 2488.1 0 0 0 0 0 0 -1917.55 0 0 0 0 0 0 0 -1658.15 
0 0 0 1784.04 0 0 0 0 0 0 0 0 0 0 0 0 0 0.03 0 0 0 0 0 0 1300.62 0 2052.75 0 0 1882.76 0 0 0 0 0 0 0 -1958.75 0 0 0 0 0 -879.315 0 0 0 
0 2287.59 0 0 -2000.56 0 -632.42 0 0 2496.8 0 0 0 0 -373.47 -1500.82 0 0 0.06 0 0 0 0 0 0 0 0 1672.95 0 -2481.54 0 0 0 0 0 0 0 0 0 0 0 0 524.079 0 -467.009 0 0 
0 0 1818.37 0 0 0 0 0 0 0 0 0 0 0 0 0 0 0 0 0.01 0 0 0 2108.29 0 0 0 0 0 709.937 0 0 0 0 0 0 0 0 0 0 -25.8644 277.49 2347.87 1733.68 0 0 0 
0 0 0 0 0 0 0 0 0 0 2247 0 -305.872 0 0 0 0 0 0 0 0.07 0 0 0 1223.72 -1160.08 0 0 0 0 0 0 0 0 0 0 0 0 0 -983.078 0 0 0 0 0 0 0 
0 804.239 0 0 0 0 0 0 226.524 0 0 0 0 0 0 0 0 0 0 0 0 0.03 0 -1742.99 0 0 0 0 0 0 0 0 0 0 0 0 0 2210.23 179.678 0 0 0 0 0 0 0 0 
0 0 0 0 0 1276.67 0 0 0 0 0 0 2211.29 0 0 0 0 0 0 0 0 0 0.05 0 0 0 0 0 0 0 0 0 0 0 2457.27 0 0 0 0 1848.12 1437.65 0 0 0 203.482 0 1818.06 
0 0 0 0 33.6467 0 0 0 0 0 0 -1857.13 -1009.93 0 0 0 0 0 0 1261.41 0 264.672 0 0.03 0 0 0 0 0 2270.2 0 0 0 1688.36 59.1296 0 0 0 0 0 0 0 1470.15 0 2304.38 0 0 
0 0 0 -286.798 0 0 0 0 0 0 0 0 0 0 0 0 0 669.805 0 0 1444.52 0 0 0 0.06 0 -1103.02 0 0 0 0 0 0 0 0 0 0 0 0 0 0 0 0 0 0 0 0 
0 0 0 0 0 0 2259.06 0 0 0 0 0 0 0 0 0 0 0 0 0 2371.67 0 0 0 0 0.03 0 0 427.946 0 0 0 0 0 0 0 0 0 -615.94 0 0 0 1803.87 -199.515 0 0 0 
0 0 0 0 0 -2208.4 0 0 0 0 -1130.33 0 0 0 0 0 0 2221.37 0 0 0 0 0 0 -1099.81 0 0.07 0 2235.86 0 0 0 0 0 0 1616.34 0 0 0 911.664 0 0 0 0 0 0 0 
0 0 0 0 0 0 0 0 901.898 0 1961.5 0 0 0 0 0 0 0 -636.998 0 0 0 0 0 0 0 0 0.01 0 0 0 0 0 0 0 0 0 0 421.232 0 0 0 0 0 0 0 0 
0 0 0 -1499.15 1877.12 0 0 0 0 0 -1923.2 0 0 0 0 0 0 0 0 0 0 0 0 0 0 1174.73 1939.07 0 0.08 0 0 0 0 0 0 0 0 0 0 1460.54 0 0 0 0 0 0 0 
0 0 0 0 0 0 0 0 0 0 0 0 0 0 0 0 0 430.692 2361.14 -1836.38 0 0 0 868.023 0 0 0 0 0 0.01 0 0 0 0 570.315 0 40.5133 0 0 0 0 0 0 0 0 0 0 
0 0 0 0 0 1722.85 0 0 0 0 -1086.99 0 0 1751.99 0 0 0 0 0 0 0 0 0 0 0 0 0 0 0 0 0.06 0 0 0 -1979.51 0 0 0 0 0 0 0 -723.823 988.876 0 0 1623.2 
0 0 0 0 707.801 0 0 0 0 0 0 2006.67 0 0 0 0 -2052.75 0 0 0 0 0 0 0 0 0 0 0 0 0 0 0.05 0 0 0 0 -249.87 0 0 0 0 0 2360.38 0 0 0 0 
0 0 0 0 466.399 0 0 2473.3 0 1659.22 -1815.47 2425.99 0 0 0 0 0 0 0 0 0 0 0 0 0 0 0 0 0 0 0 0 0.08 0 -2163.23 0 0 0 0 0 0 0 0 0 0 -290.002 0 
0 0 0 0 0 0 1252.71 0 1579.87 0 0 0 0 0 0 0 0 0 0 0 0 0 0 -672.094 0 0 0 0 0 0 0 0 0 0 0 0 0 0 0 0 0 0 -644.627 0 0 885.266 0 
2141.1 -388.73 0 0 0 -702.307 0 1664.1 0 0 2045.58 0 0 0 0 -564.516 0 0 0 0 0 0 -1228.29 -162.13 0 0 0 0 0 -1030.23 1394.77 0 2304.99 0 0 2252.95 -311.365 0 0 0 0 0 0 0 0 0 0 
0 0 0 0 0 0 0 0 0 0 0 0 0 2397.76 0 0 0 0 0 0 0 0 0 0 0 0 -1516.24 0 0 0 0 0 0 0 983.535 0.07 1825.24 0 0 1962.42 0 0 -84.9178 -2118.82 0 0 0 
0 0 0 0 0 0 0 794.626 0 1919.08 0 0 0 0 0 0 0 0 0 0 0 0 0 0 0 0 0 0 0 -521.638 0 1988.2 0 0 2438.81 -394.223 0.06 0 0 0 0 0 0 0 327.998 0 0 
0 0 0 0 0 0 0 0 0 1794.26 0 0 0 0 0 0 0 1266.44 0 0 0 -1473.51 0 0 0 0 0 0 0 0 0 0 0 0 0 0 0 0.09 0 0 1101.49 1886.73 0 0 0 0 0 
1578.8 1516.85 0 0 0 0 0 0 0 0 2275.99 0 0 0 0 0 2427.06 0 0 0 0 -15.7933 0 0 0 1441.77 0 36.0881 0 0 0 0 0 0 0 0 0 0 0.04 0 0 0 0 0 0 0 0 
0 -463.805 0 0 0 0 0 0 0 0 0 0 0 0 106.586 0 0 0 0 0 -2037.34 0 -314.57 0 0 0 1824.02 0 2149.04 0 0 0 0 0 0 78.2037 0 0 0 0.05 -1276.51 0 0 0 0 0 0 
1285.06 0 1188.01 0 0 574.435 0 -1302.15 1856.97 0 0 0 0 0 0 0 0 0 0 -1984.69 0 0 -1419.03 0 0 0 0 0 0 0 0 0 0 0 0 0 0 1757.48 0 2475.28 0.03 0 0 0 0 0 0 
0 0 0 0 853.984 -95.4466 0 0 0 -2030.78 0 2071.83 0 2148.27 826.823 0 0 0 0 2055.35 0 0 0 0 0 0 0 0 0 0 0 0 0 0 0 0 0 -1116.14 0 0 0 0.05 0 0 0 0 1832.41 
0 0 0 585.879 -1991.1 0 0 0 0 0 0 0 0 -1967.15 -1146.96 0 0 0 430.082 2419.28 0 0 0 1214.41 0 1338.77 0 0 0 0 -475.249 1832.41 0 95.4466 0 -71.6422 0 0 0 0 0 0 0.07 0 -432.981 0 0 
0 0 0 0 0 0 -86.5963 0 382.321 0 0 0 0 0 -140.004 0 0 -2333.98 0 -560.091 0 0 0 0 0 1766.79 0 0 0 0 872.6 0 0 0 0 1769.69 0 0 0 0 0 0 0 0.02 0 0 0 
0 0 0 0 0 0 0 0 0 0 0 -1603.82 0 0 0 0 0 0 440.916 0 0 0 1876.05 -1097.52 0 0 0 0 0 0 0 0 0 0 0 0 679.571 0 0 0 0 0 1476.26 0 0.01 0 0 
576.724 0 0 0 1715.37 0 0 -433.592 1113.85 0 0 0 0 0 0 0 0 0 0 0 0 0 0 0 0 0 0 0 0 0 0 0 487.762 320.215 0 0 0 0 0 0 0 0 0 0 0 0.07 0 
0 0 270.775 0 0 0 0 0 0 0 0 0 0 0 0 0 1129.57 0 0 0 0 0 1026.41 0 0 0 0 0 0 0 -2339.78 0 0 0 0 0 0 0 0 0 0 915.937 0 0 0 0 0.07 
