*Vertices 41
*Matrix 
0.03 0 0 0 0 -1501.28 0 0 1674.47 0 0 0 0 0 0 0 0 0 1082.26 715.735 0 0 0 0 0 0 0 0 0 0 896.71 0 0 0 0 0 -403.684 0 0 0 0 
0 0.04 0 0 0 2113.94 0 0 0 0 0 0 0 0 0 0 0 0 0 -745.796 -103.992 0 0 0 0 0 1228.29 0 0 0 0 0 0 0 0 0 0 0 0 0 0 
0 0 0.09 0 994.522 0 0 0 0 -1121.17 0 0 0 0 0 0 0 2066.94 0 0 0 0 0 0 0 2430.88 0 0 0 0 0 0 0 0 0 -2304.99 0 0 0 0 -1376.16 
0 0 0 0.07 0 0 0 0 2453.31 0 0 2205.04 0 0 0 0 0 0 0 0 0 0 0 0 0 0 0 0 0 0 0 0 251.701 0 0 0 73.6259 0 1385.62 0 2331.39 
0 0 2491.15 0 0.07 1992.63 0 2040.09 0 0 0 0 0 0 0 0 0 0 0 0 0 0 0 0 0 0 0 0 -315.18 0 0 0 0 0 0 0 0 0 0 0 0 
-207.907 -512.329 0 0 2409.36 0.07 0 2269.13 0 0 0 0 0 0 0 -1469.7 0 0 0 0 2445.37 0 0 0 0 0 0 1368.53 0 0 0 0 0 0 0 0 0 0 0 0 0 
0 0 0 0 0 0 0.09 -47.2274 1057.85 0 0 0 0 1214.1 0 0 0 0 0 0 0 0 0 0 0 0 0 0 0 289.697 -886.029 0 0 0 0 0 0 -661.718 0 0 865.429 
0 0 0 0 1496.7 998.794 -320.063 0.03 0 0 0 0 0 0 0 0 2439.12 0 -300.531 0 0 0 1112.48 0 0 0 0 0 0 0 0 -1587.65 0 0 0 0 0 0 0 0 0 
1526.46 0 0 1738.11 0 0 1343.81 0 0.03 0 1747.26 0 0 0 0 0 0 0 0 0 -1721.63 0 0 0 0 0 0 -2113.64 0 0 1670.05 0 0 0 0 0 0 0 0 0 0 
0 0 2478.03 0 0 0 0 0 0 0.03 0 0 0 0 2449.34 0 0 0 -1186.48 0 0 0 0 0 0 1084.25 0 0 0 0 0 0 493.255 0 0 0 -2248.07 0 0 0 0 
0 0 0 0 0 0 0 0 1029.31 0 0.03 0 0 0 0 0 0 172.811 0 0 1690.8 0 0 0 0 0 0 0 0 0 0 0 -2460.48 0 0 1345.48 0 1323.51 0 0 0 
0 0 0 683.386 0 0 0 0 0 0 0 0.01 0 0 0 0 -1510.13 2460.78 0 0 0 0 0 0 0 0 0 0 0 0 0 0 -1594.21 0 2225.94 0 0 993.912 0 0 0 
0 0 0 0 0 0 0 0 0 0 0 0 0.02 0 1278.04 0 163.808 0 0 0 466.552 0 0 0 0 0 0 0 0 0 0 724.586 0 0 0 0 -771.737 0 -1471.83 0 453.887 
0 0 0 0 0 0 -885.266 0 0 0 0 0 0 0.04 0 0 0 0 0 -699.408 0 0 0 0 0 0 0 0 0 0 0 0 -92.3948 0 0 0 0 0 0 0 1797.46 
0 0 0 0 0 0 0 0 0 -1744.67 0 0 -682.775 0 0.02 0 2102.8 0 0 0 0 0 0 1847.97 -1156.58 1406.37 0 0 0 195.395 0 0 0 0 0 0 -55.0096 0 0 0 0 
0 0 0 0 0 1191.06 0 0 0 0 0 0 0 0 0 0.07 0 0 0 0 0 -1635.26 0 0 0 0 0 607.242 0 0 442.595 0 2100.05 2158.35 0 0 0 0 0 0 0 
0 0 0 0 0 0 0 -1709.11 0 0 0 -271.996 1219.9 0 2069.08 0 0.04 -381.1 0 0 0 0 0 0 0 0 0 0 2217.55 0 0 0 0 0 0 553.224 0 0 0 0 0 
0 0 1710.33 0 0 0 0 0 0 0 1975.54 -318.69 0 0 0 0 2150.87 0.01 0 2244.25 0 0 0 0 0 0 0 0 0 0 0 0 0 0 0 0 0 0 0 0 0 
1395.08 0 0 0 0 0 0 2151.48 0 -2413.63 0 0 0 0 0 0 0 0 0.06 0 0 701.697 0 0 0 -730.384 0 0 0 0 0 0 1042.89 0 0 0 0 0 0 0 0 
-552.156 -1689.12 0 0 0 0 0 0 0 0 0 0 0 2142.78 0 0 0 -1559.11 0 0.07 0 0 0 0 0 0 243.767 0 0 -592.135 0 380.184 0 0 1571.17 0 0 0 1442.23 0 0 
0 2262.26 0 0 0 994.98 0 0 319.605 0 -2378.54 0 -977.432 0 0 0 0 0 0 0 0 0 0 0 0 988.571 0 0 333.796 0 -2262.87 0 0 0 -1467.71 0 0 0 0 0 2213.43 
0 0 0 0 0 0 0 0 0 0 0 0 0 0 0 2268.36 0 0 -2406.61 0 0 0.01 0 0 0 -1653.11 0 0 0 2114.86 1963.18 0 0 0 0 0 0 0 0 0 0 
0 0 0 0 0 0 0 2040.09 0 0 0 0 0 0 0 0 0 0 0 0 0 0 0.01 0 0 0 0 0 0 0 0 -917.31 0 0 -154.5 0 0 0 0 1379.06 0 
0 0 0 0 0 0 0 0 0 0 0 0 0 0 -12.2837 0 0 0 0 0 0 0 0 0 1226.77 0 0 -633.335 2226.25 0 0 0 543.916 0 0 1909.47 0 0 0 0 972.091 
0 0 0 0 0 0 0 0 0 0 0 0 0 0 -513.55 0 0 0 0 0 0 0 0 935.316 0.08 0 0 0 0 0 -27.543 2174.06 20.6763 0 0 -313.654 0 0 658.971 0 0 
0 0 2077.32 0 0 0 0 0 0 1021.07 0 0 0 0 2217.7 0 0 0 1293.45 0 2305.44 -157.857 0 0 0 0.02 0 0 0 0 0 0 0 173.421 0 0 0 0 0 0 0 
0 687.506 0 0 0 0 0 0 0 0 0 0 0 0 0 0 0 0 0 906.018 0 0 0 0 0 0 0.04 0 1175.19 0 0 0 0 0 0 0 0 -1439.33 0 0 0 
0 0 0 0 0 1234.55 0 0 -125.66 0 0 0 0 0 0 1313.75 0 0 0 0 0 0 0 2396.39 0 0 0 0.08 0 0 2289.57 0 0 0 0 0 0 0 0 0 -1265.68 
0 0 0 0 -1239.13 0 0 0 0 0 0 0 0 0 0 0 2342.22 0 0 0 55.3148 0 0 1598.33 0 0 1206.32 0 0.08 0 0 0 0 0 0 0 0 -1574.37 0 0 0 
0 0 0 0 0 0 1015.43 0 0 0 0 0 0 0 -11.8259 0 0 0 0 1322.75 0 498.291 0 0 0 0 0 0 0 0.05 0 0 85.6807 -462.737 0 0 0 0 0 0 0 
-835.368 0 0 0 0 0 1686.99 0 856.12 0 0 0 0 0 0 1926.4 0 0 0 0 2291.71 1363.95 0 0 1384.09 0 0 -808.664 0 0 0.04 0 0 0 0 0 0 0 0 -415.586 0 
0 0 0 0 0 0 0 -984.603 0 0 0 0 1000.93 0 0 0 0 0 0 1239.74 0 0 2317.04 0 -295.19 0 0 0 0 0 0 0.07 0 0 0 0 0 0 0 0 0 
0 0 0 43.7178 0 0 0 0 0 -166.25 644.017 -237.815 0 161.977 0 2172.38 0 0 -2399.44 0 0 0 0 -387.967 976.211 0 0 0 0 1460.69 0 0 0.07 0 0 0 0 0 0 -347.53 0 
0 0 0 0 0 0 0 0 0 0 0 0 0 0 0 1215.63 0 0 0 0 0 0 0 0 0 2111.04 0 0 0 2364.96 0 0 0 0.04 0 0 0 0 -2246.39 0 0 
0 0 0 0 0 0 0 0 0 0 0 2285.76 0 0 0 0 0 0 0 847.575 2416.07 0 -2272.94 0 0 0 0 0 0 0 0 0 0 0 0.01 0 0 0 0 1968.21 0 
0 0 -1421.48 0 0 0 0 0 0 0 -849.712 0 0 0 0 0 -219.047 0 0 0 0 0 0 2499.54 2399.59 0 0 0 0 0 0 0 0 0 0 0.05 0 0 0 0 0 
-140.461 0 0 1232.57 0 0 0 0 0 813.7 0 0 -1476.41 0 2125.08 0 0 0 0 0 0 0 0 0 0 0 0 0 0 0 0 0 0 0 0 0 0.09 0 0 0 0 
0 0 0 0 0 0 2102.8 0 0 0 -987.198 1965.62 0 0 0 0 0 0 0 0 0 0 0 0 0 0 253.38 0 1449.71 0 0 0 0 0 0 0 0 0.08 0 0 0 
0 0 0 -1255.91 0 0 0 0 0 0 0 0 1072.8 0 0 0 0 0 0 -284.661 0 0 0 0 2276.6 0 0 0 0 0 0 0 0 495.849 0 0 0 0 0.05 0 0 
0 0 0 0 0 0 0 0 0 0 0 0 0 0 0 0 0 0 0 0 0 0 772.5 0 0 0 0 0 0 0 2285.15 0 -743.355 0 1099.2 0 0 0 0 0.08 0 
0 0 1394.62 1779.92 0 0 1311.15 0 0 0 0 0 1788.31 1554.99 0 0 0 0 0 0 -1682.26 0 0 1649.14 0 0 0 -2363.12 0 0 0 0 0 0 0 0 0 0 0 0 0.06 
