*Vertices 74
*Matrix 
0.09 -923.566 0 0 0 2353.36 0 0 0 0 0 0 0 0 0 0 0 899.762 0 0 0 0 0 637.761 0 0 0 0 0 0 0 0 0 0 0 0 0 0 0 0 0 -2496.8 0 0 0 0 0 0 0 0 389.798 0 0 0 0 0 0 0 0 0 0 3.89111 0 0 0 736.183 0 0 0 0 0 0 0 0 
1635.26 0.05 0 0 0 -417.264 -104.297 0 0 0 0 0 1637.24 0 0 0 0 0 0 2463.23 0 0 0 0 0 0 0 0 2423.09 0 0 0 0 0 -1707.13 0 0 0 0 0 0 -2208.7 0 0 0 0 0 0 0 0 0 0 0 -2189.17 0 0 0 1826.3 14.42 0 0 0 0 0 0 0 0 0 0 0 0 0 0 0 
0 0 0.06 0 0 0 0 0 -1425.14 0 0 2029.71 0 0 0 2304.38 0 0 0 0 0 0 0 0 0 70.4215 0 429.777 0 0 2306.21 0 0 0 1223.41 0 0 -253.99 0 0 0 0 0 -199.057 0 0 0 0 0 0 0 0 0 289.239 0 1711.25 0 0 0 0 0 0 0 0 0 0 0 0 0 0 0 0 0 0 
0 0 0 0.04 0 0 -309.534 -1119.5 0 0 0 0 0 0 0 0 0 0 0 0 0 0 0 0 0 0 0 0 0 0 900.372 0 0 1538.06 0 0 0 0 11.6733 0 0 0 0 0 0 911.664 1358.15 0 0 0 0 0 0 0 2329.4 0 0 0 0 0 144.124 0 0 0 0 0 0 0 0 0 0 0 0 0 
0 0 0 0 0.08 -2456.05 0 0 0 0 0 0 0 0 0 0 0 0 0 0 0 0 0 0 0 0 0 0 0 0 -1221.73 -200.583 2371.67 1451.23 0 0 0 0 0 0 0 0 0 0 0 0 0 0 0 0 0 -8.31629 0 0 -1663.79 -1678.14 0 0 1503.27 0 0 0 0 0 0 0 0 0 2484.13 0 0 0 0 0 
14.7252 205.924 0 0 2483.37 0.02 -294.58 0 2125.54 0 0 0 961.867 0 0 0 0 0 0 0 0 0 0 0 0 0 0 0 0 0 0 -2244.41 0 0 0 0 -770.669 0 2302.55 -2144 0 0 0 0 0 0 0 148.091 0 0 0 0 0 0 0 0 0 0 0 0 0 0 1055.71 0 0 0 0 0 0 0 0 0 0 0 
0 472.503 0 763.649 0 783.029 0.02 -306.024 0 0 0 0 0 252.77 -1302.61 0 0 515.534 0 -117.267 -850.017 0 0 0 0 0 0 0 0 0 0 1355.86 -1879.71 0 -1603.06 0 0 0 0 0 0 0 0 0 0 0 0 0 0 0 0 0 0 0 0 0 0 0 2357.94 0 2032.61 0 0 0 0 0 0 0 0 0 0 0 0 0 
0 0 0 1355.71 0 0 -885.571 0.06 0 0 -834.605 0 0 0 0 0 0 0 0 0 0 0 0 0 0 0 0 0 0 0 0 0 0 0 0 0 0 0 0 0 0 0 0 0 0 1823.25 85.8333 1383.33 0 0 0 0 0 0 0 0 0 0 0 0 0 0 -327.845 0 0 0 0 0 0 0 0 0 0 0 
0 0 1693.09 0 0 2439.88 0 0 0.03 0 0 0 0 0 0 0 0 0 0 2221.21 0 0 0 0 0 0 0 0 0 1251.49 0 0 0 0 0 0 0 1183.13 0 1219.44 0 0 0 0 0 2218.62 0 0 0 0 0 0 0 0 -2223.04 0 0 0 0 0 0 0 0 0 0 1144.37 590.457 0 0 0 0 0 0 0 
0 0 0 0 0 0 0 0 0 0.05 0 676.672 0 0 0 0 0 0 0 0 0 2000.41 0 0 0 0 0 -2294.76 -241.173 0 0 0 0 0 -1902.91 0 0 0 0 0 1090.81 0 0 0 0 0 0 -449.309 0 0 0 0 0 0 0 0 0 0 0 0 0 0 1391.11 0 2371.97 0 0 0 0 0 0 0 0 0 
0 0 0 0 0 0 0 -574.74 0 0 0.03 1392.33 0 0 858.104 0 2054.73 0 0 0 1452.3 0 0 0 0 0 964.919 0 0 -1781.14 0 0 0 0 0 0 0 0 0 -184.256 0 0 0 0 0 0 0 0 -429.624 0 0 0 0 -940.504 0 0 0 0 0 0 0 0 0 0 1873.61 0 0 0 0 0 0 0 0 0 
0 0 -2094.41 0 0 0 0 0 0 1813.33 -755.409 0.07 0 0 0 0 0 1821.27 0 0 -1606.27 0 -1073.87 0 0 0 2000.87 0 0 0 0 0 0 0 0 0 0 0 0 0 0 0 0 0 0 0 0 0 0 0 0 0 -1404.69 0 -491.272 0 2071.98 0 2365.57 0 0 0 0 0 0 0 0 0 0 1897.41 0 0 0 0 
0 143.361 0 0 0 50.737 0 0 0 0 0 0 0.04 0 0 0 0 97.1252 0 0 0 2379.15 0 0 2387.54 0 1307.95 798.746 0 0 0 0 0 0 0 0 0 0 0 0 397.732 0 0 0 0 0 0 0 0 -1430.48 0 0 1601.23 1421.17 0 0 0 0 0 0 202.872 0 0 0 0 0 0 0 0 0 0 0 0 0 
0 0 0 0 0 0 -533.998 0 0 0 0 0 0 0 0 0 0 -776.162 0 0 -451.75 0 898.541 0 0 0 0 0 0 0 0 0 0 958.052 0 -1020.62 1945.17 0 0 0 0 0 0 0 0 0 0 0 0 0 0 0 0 0 0 0 706.732 0 0 0 0 0 0 0 0 0 0 0 0 0 0 0 0 0 
0 0 0 0 0 0 2038.41 0 0 0 618.534 0 0 0 0.09 0 2180.93 0 0 0 0 1933.58 0 0 0 0 0 1160.08 0 0 0 0 0 0 0 0 0 -951.643 0 0 0 0 0 0 0 0 0 0 0 0 0 0 2062.36 0 0 0 0 0 0 0 0 0 0 0 0 0 0 0 0 0 0 0 0 0 
0 0 1739.63 0 0 0 0 0 0 0 0 0 0 0 0 0.02 0 1520.97 0 0 -1527.83 0 0 0 0 0 0 0 0 914.869 1494.26 0 0 0 0 0 0 0 0 1859.26 0 0 0 0 0 0 0 0 0 0 0 0 0 0 -552.309 0 0 0 0 0 0 0 0 0 1503.11 0 638.218 -1056.17 0 0 0 0 0 1407.74 
0 0 0 0 0 0 0 0 0 0 -16.4037 0 0 0 -153.737 0 0.07 0 0 0 1872.54 0 0 0 0 0 1382.41 0 0 0 0 0 260.552 -1325.34 0 0 0 0 0 0 0 0 0 0 1686.38 0 0 0 0 -152.516 0 0 0 0 0 0 0 0 0 0 442.747 0 0 0 0 0 0 0 0 0 0 0 0 2303.61 
198.599 0 0 0 0 0 -1197.16 0 0 0 0 67.8274 -35.3252 938.52 0 -759.835 0 0.07 0 0 0 0 0 0 0 0 0 0 1030.23 0 0 1975.54 0 0 0 0 0 0 0 571.535 1800.36 0 0 0 0 0 0 0 1145.89 0 0 0 0 0 0 0 0 0 1119.95 419.401 0 0 2447.2 0 -817.515 0 0 0 0 0 0 0 0 0 
0 0 0 0 0 0 0 0 0 0 0 0 0 0 0 0 0 0 0.03 0 0 0 0 0 0 0 0 0 0 0 0 -865.276 0 0 0 0 0 0 0 0 0 2250.82 0 0 0 0 -38.6822 0 0 0 1888.87 0 0 -287.561 0 0 0 0 0 -2047.26 0 0 0 0 0 0 0 0 0 0 0 0 0 0 
0 1702.09 0 0 0 0 1193.81 0 1972.49 0 0 0 0 0 0 0 0 0 0 0.06 0 0 0 0 0 0 0 0 0 0 0 0 0 0 0 0 0 -1241.57 -1473.2 0 2200.31 0 0 0 0 0 0 -2422.48 0 0 0 0 -625.553 0 0 0 529.115 0 -717.261 0 0 0 2112.57 0 0 0 0 0 0 0 0 0 0 0 
0 0 0 0 0 0 -432.829 0 0 0 -457.701 313.044 0 -387.661 0 -1653.57 2328.33 0 0 0 0.09 0 0 0 0 0 0 0 0 0 0 0 0 0 2021.16 0 -68.4378 0 0 -1214.26 0 0 0 0 0 0 0 0 0 0 0 0 0 0 0 0 0 0 0 0 0 0 0 0 589.084 0 0 0 0 0 0 0 0 0 
0 0 0 0 0 0 0 0 0 -1813.03 0 0 2349.24 0 1221.58 0 0 0 0 0 0 0.04 0 0 0 0 0 0 0 1054.64 0 0 0 0 0 0 -228.202 -2166.74 0 0 0 0 0 0 0 0 0 0 0 0 2347.41 0 0 0 0 0 0 0 0 0 0 0 0 0 0 0 2168.42 0 0 0 0 0 0 0 
0 0 0 0 0 0 0 0 0 0 0 -935.621 0 1915.88 0 0 0 0 0 0 0 0 0.06 0 0 1876.96 0 -414.212 0 0 0 0 0 0 0 0 0 0 0 0 0 0 0 0 0 0 0 0 0 0 0 0 0 0 0 0 0 575.808 0 0 0 0 0 0 -1511.66 0 0 0 2006.06 0 0 0 0 0 
-729.774 0 0 0 0 0 0 0 0 0 0 0 0 0 0 0 0 0 0 0 0 0 0 0.06 0 0 0 0 0 0 0 0 0 0 0 0 0 0 0 0 0 0 0 0 0 0 0 0 0 0 0 0 1908.7 0 0 636.082 0 0 0 0 0 0 0 0 0 0 0 806.833 0 0 0 0 0 0 
0 0 0 0 0 0 0 0 0 0 0 0 -95.294 0 0 0 0 0 0 0 0 0 0 0 0.09 0 586.337 0 0 0 0 0 657.292 0 0 0 2279.96 1191.67 0 2351.83 0 -869.396 0 0 0 0 0 0 767.006 0 0 2284.54 0 0 0 0 0 0 0 0 0 0 -812.174 -1853.62 0 0 0 0 0 0 0 0 0 0 
0 0 -4.50148 0 0 0 0 0 0 0 0 0 0 0 0 0 0 0 0 0 0 0 -311.67 0 0 0.03 0 0 0 0 0 0 0 0 -735.725 0 0 0 520.875 0 0 2177.72 0 1993.85 508.667 0 0 0 0 0 0 952.864 0 0 0 0 0 0 0 0 0 0 0 0 0 0 0 0 0 0 0 0 0 0 
0 0 0 0 0 0 0 0 0 0 -52.5681 -1594.97 235.527 0 0 0 104.144 0 0 0 0 0 0 0 248.497 0 0.02 0 0 0 0 0 0 0 0 0 0 0 -56.8407 0 0 0 1910.54 0 0 0 0 0 0 1137.35 0 0 0 0 0 0 0 0 0 1191.06 1958.6 0 0 0 0 0 -1737.04 0 0 0 0 0 0 0 
0 0 2485.05 0 0 0 0 0 0 -1300.93 0 0 21.7444 0 481.353 0 0 0 0 0 0 0 769.601 0 0 0 0 0.06 0 0 0 0 0 0 278.558 0 0 0 0 0 137.715 0 0 0 0 2357.63 2196.49 174.947 0 0 0 0 0 0 0 0 -149.312 0 0 0 -491.424 0 0 0 0 0 1873.91 0 0 0 0 0 0 0 
0 383.999 0 0 0 0 0 0 0 -866.649 0 0 0 0 0 0 0 -1017.26 0 0 0 0 0 0 0 0 0 0 0.03 0 0 0 0 0 0 0 0 0 0 0 0 0 0 0 0 0 0 0 2440.95 0 0 0 0 0 0 0 0 0 0 0 879.162 0 0 0 0 0 0 0 0 0 0 0 0 0 
0 0 0 0 0 0 0 0 2172.23 0 285.119 0 0 0 0 2289.73 0 0 0 0 0 265.587 0 0 0 0 0 0 0 0.08 -1891 0 -2098.22 0 0 0 0 0 0 0 0 0 0 0 0 0 430.54 -677.587 0 0 0 0 0 -310.45 0 0 0 0 0 0 243.614 0 0 2421.72 0 0 0 0 0 -1066.24 0 0 0 0 
0 0 -1629.92 -602.664 117.878 0 0 0 0 0 0 0 0 0 0 709.326 0 0 0 0 0 0 0 0 0 0 0 0 0 -1655.86 0.01 0 0 0 0 0 0 0 0 2406.77 0 0 0 1866.44 0 0 0 0 0 0 0 0 1009.93 0 0 0 0 0 0 0 0 0 0 2424.77 -316.248 2292.32 0 -2177.57 0 0 0 0 0 0 
0 0 0 0 -1844.92 1988.36 1503.11 0 0 0 0 0 0 0 0 0 0 -140.461 2294.31 0 0 0 0 0 0 0 0 0 0 0 0 0.05 0 2484.89 0 0 0 0 0 0 2252.49 0 0 0 0 0 0 -1877.73 0 0 0 0 0 0 0 0 0 0 1337.09 0 -1356.32 0 0 0 0 0 0 0 0 -736.03 0 0 0 0 
0 0 0 0 1392.48 0 -7.55333 0 0 0 0 0 0 0 0 0 1210.59 0 0 0 0 0 0 0 657.75 0 0 0 0 2332.61 0 0 0.06 0 0 0 0 0 200.583 0 0 0 0 0 0 0 0 0 739.998 0 -2268.67 0 0 0 0 0 -1122.24 0 0 0 0 0 0 0 0 0 0 0 0 0 0 -717.872 0 0 
0 0 0 2440.34 2126 0 0 0 0 0 0 0 0 985.366 0 0 1624.73 0 0 0 0 0 0 0 0 0 0 0 0 0 0 -392.697 0 0.05 0 0 0 0 0 0 0 0 0 116.657 -1506.16 0 0 0 0 0 -816.904 0 2278.44 0 0 0 -175.863 -2293.69 0 0 0 0 0 0 0 0 0 0 0 0 0 0 0 0 
0 1161.92 1162.22 0 0 0 -1679.2 0 0 479.522 0 0 0 0 0 0 0 0 0 0 -909.375 0 0 0 0 1289.18 0 2039.48 0 0 0 0 0 0 0.07 0 0 0 0 0 0 0 0 0 0 0 0 -2116.38 0 0 0 0 0 0 -365.535 0 0 0 0 0 0 0 0 0 0 0 0 0 -1240.35 0 0 0 0 0 
0 0 0 0 0 0 0 0 0 0 0 0 0 1461 0 0 0 0 0 0 0 0 0 0 0 0 0 0 0 0 0 0 0 0 0 0.06 0 0 0 -796.762 0 0 1921.37 0 0 0 0 0 0 2197.26 0 0 0 0 0 0 0 0 0 0 0 0 0 0 0 -235.984 -332.27 0 0 0 0 0 0 0 
0 0 0 0 0 2384.03 0 0 0 0 0 0 0 -1961.35 0 0 0 0 0 0 110.706 -1753.06 0 0 -2202.14 0 0 0 0 0 0 0 0 0 0 0 0.03 -295.038 0 0 0 0 0 0 1220.05 0 0 0 0 0 0 2241.97 0 0 0 1686.53 0 0 0 0 2196.65 0 1618.17 0 0 1518.98 0 0 0 0 0 0 0 0 
0 0 888.012 0 0 0 0 0 -583.132 0 0 0 0 0 1005.51 0 0 0 0 359.89 0 1755.81 0 0 -1447.11 0 0 0 0 0 0 0 0 0 0 0 2432.25 0 2470.09 0 0 0 0 0 1753.21 0 0 0 0 0 0 0 0 0 0 0 0 0 0 0 -50.1267 0 0 0 0 0 0 0 -982.009 0 0 0 0 0 
0 0 0 1146.05 0 1447.87 0 0 0 0 0 0 0 0 0 0 0 0 0 1566.74 0 0 0 0 0 1197.78 -796.915 0 0 0 0 0 2336.27 0 0 0 0 2003.46 0.06 0 0 0 0 962.935 0 0 0 0 0 1419.19 0 0 -1967.91 0 0 -309.229 0 0 0 0 0 -1333.89 0 0 0 0 0 0 0 0 0 0 0 0 
0 0 0 0 0 -2378.69 0 0 888.012 0 -2456.36 0 0 0 0 1467.1 0 15.9459 0 0 346.309 0 0 0 -786.843 0 0 0 0 0 780.892 0 0 0 0 1898.48 0 0 0 0.05 0 0 0 0 0 -1044.88 0 2130.88 0 0 0 0 -1186.03 0 0 0 0 -1946.85 0 0 0 0 1890.7 0 -194.021 0 0 1466.8 0 0 0 0 0 0 
0 0 0 0 0 0 0 0 0 61.5711 0 0 1687.6 0 0 0 0 360.958 0 449.156 0 0 0 0 0 0 0 1685.31 0 0 0 1558.81 0 0 0 0 0 0 0 0 0.02 0 0 0 0 0 0 -804.697 0 0 0 459.532 0 0 0 0 0 0 -416.196 0 0 0 0 0 688.116 0 0 0 0 0 0 0 0 0 
87.2066 1842.63 0 0 0 0 0 0 0 0 0 0 0 0 0 0 0 0 -1842.33 0 0 0 0 0 1049.3 -127.491 0 0 0 0 0 0 0 0 0 0 0 0 0 0 0 0 0 0 0 0 0 0 0 0 0 0 -1193.5 0 161.214 0 169.301 0 1038.32 0 0 0 0 0 0 0 0 0 2243.34 0 0 0 0 0 
0 0 0 0 0 0 0 0 0 0 0 0 0 0 0 0 0 0 0 0 0 0 0 0 0 0 -1904.13 0 0 0 0 0 0 0 0 1421.78 0 0 0 0 0 0 0.05 0 0 0 1737.04 0 0 0 0 0 0 0 0 0 0 0 0 0 0 0 0 0 0 0 0 0 0 0 0 0 0 0 
0 0 -246.361 0 0 0 0 0 0 0 0 0 0 0 0 0 0 0 0 0 0 0 0 0 0 741.981 0 0 0 0 1443.45 0 0 2386.01 0 0 0 0 1100.27 0 0 0 0 0.07 0 0 0 0 0 0 0 0 0 0 0 2048.94 0 0 0 0 0 0 0 0 0 0 0 0 0 0 0 0 0 0 
0 0 0 0 0 0 0 0 0 0 0 0 0 0 0 0 690.558 0 0 0 0 0 0 0 0 -2000.72 0 0 0 0 0 0 0 789.438 0 0 -1229.97 -1594.67 0 0 0 0 0 0 0.08 915.021 0 0 -136.799 0 2115.31 0 0 0 0 0 0 0 0 0 1617.71 0 0 0 0 0 0 0 0 0 0 0 0 0 
0 0 0 1107.75 0 0 0 -813.089 556.276 0 0 0 0 0 0 0 0 0 0 0 0 0 0 0 0 0 0 1299.25 0 0 0 0 0 0 0 0 0 0 0 1322.14 0 0 0 0 -703.223 0.02 0 0 0 0 0 0 437.864 0 0 0 0 0 -1735.21 0 0 0 0 -1287.04 0 0 0 0 0 0 1572.39 0 0 0 
0 0 0 560.549 0 0 0 2427.37 0 0 0 0 0 0 0 0 0 0 -1823.4 0 0 0 0 0 0 0 0 174.032 0 1623.05 0 0 0 0 0 0 0 0 0 0 0 0 2223.35 0 0 0 0.06 0 0 0 0 -1473.05 0 0 0 77.1355 0 0 -1321.83 0 0 0 0 2131.95 0 -1400.72 0 0 0 0 0 0 0 0 
0 0 0 0 0 -1771.83 0 -559.786 0 1560.18 0 0 0 0 0 0 0 0 0 2493.13 0 0 0 0 0 0 0 -753.883 0 479.369 0 -1920 0 0 -671.636 0 0 0 0 1180.07 2093.04 0 0 0 0 0 0 0.09 0 0 2486.57 0 0 0 0 0 0 0 0 0 0 0 0 1789.53 0 -953.475 0 0 0 0 0 0 0 -1859.26 
0 0 0 0 0 0 0 0 0 0 567.721 0 0 0 0 0 0 -1287.5 0 0 0 0 0 0 1166.34 0 0 0 1958.14 0 0 0 -972.701 0 0 0 0 0 0 0 0 0 0 0 0.228889 0 0 0 0.05 0 0 0 0 0 0 0 2208.09 0 0 0 0 0 0 0 0 0 0 0 0 0 0 0 0 0 
0 0 0 0 0 0 0 0 0 0 0 0 1297.42 0 0 0 1909.62 0 0 0 0 0 0 0 0 0 1054.03 0 0 0 0 0 0 0 0 2290.8 0 0 2178.64 0 0 0 0 0 0 0 0 0 0 0.05 0 0 1618.32 0 0 0 0 -1163.59 0 0 1676.31 0 700.629 0 0 0 0 0 0 0 0 0 0 0 
1319.24 0 0 0 0 0 0 0 0 0 0 0 0 0 0 0 0 0 -1084.4 0 0 1590.24 0 0 0 0 0 0 0 0 0 0 975.753 -565.432 0 0 0 0 0 0 0 0 0 0 -1165.27 0 0 878.246 0 0 0 0 0 0 -167.776 1473.51 1865.37 0 0 0 -1221.43 0 0 0 77.8985 0 240.562 0 0 0 0 0 0 0 
0 0 0 0 1946.85 0 0 0 0 0 0 0 0 0 0 0 0 0 0 0 0 0 0 0 -1873 1549.65 0 0 0 0 0 0 0 0 0 0 -2358.39 0 0 0 2247.15 0 0 0 0 0 -287.713 0 0 0 0 0.03 0 0 -228.813 0 0 0 0 0 0 0 0 0 0 0 0 0 1788.77 0 0 0 0 0 
0 0 0 0 0 0 0 0 0 0 0 -1007.49 253.533 0 1890.24 0 0 0 0 727.027 0 0 0 -312.433 0 0 0 0 0 0 -131.001 0 0 1661.81 0 0 0 0 -238.273 1047.62 0 1882.76 0 0 0 -686.132 0 0 0 -30.9 0 0 0.07 -643.254 0 0 -417.264 0 0 0 0 0 0 0 0 0 0 0 0 0 0 0 0 0 
0 2097.31 1684.7 0 0 0 0 0 0 0 997.421 0 958.357 0 0 0 0 0 2315.06 0 0 0 0 0 0 0 0 0 0 2138.81 0 0 0 0 0 0 0 0 0 0 0 0 0 0 0 0 0 0 0 0 0 0 1482.67 0.01 0 -119.556 0 0 0 0 0 0 0 0 0 0 938.368 0 -788.98 0 0 0 0 0 
0 0 0 1105.61 -234.153 0 0 0 2151.33 0 0 221.946 0 0 0 555.666 0 0 0 0 0 0 0 0 0 0 0 0 0 0 0 0 0 0 -1535 0 0 0 0 0 0 79.1192 0 0 0 0 0 0 0 0 -1339.53 -89.1903 0 0 0 0 0 0 0 0 0 0 0 0 0 0 0 0 0 0 1245.23 0 0 0 
0 0 -1981.8 0 1576.66 0 0 0 0 0 0 0 0 0 0 0 0 0 0 0 0 0 0 -1159.93 0 0 0 0 0 0 0 0 0 0 0 0 -33.6467 0 -1789.53 0 0 0 0 -613.498 0 0 2169.64 0 0 0 -869.396 0 0 1848.58 0 0.06 0 0 0 0 0 0 0 0 0 0 0 1720.56 0 0 0 0 0 0 
0 0 0 0 0 0 0 0 0 0 0 -2346.34 0 165.029 0 0 0 0 0 1709.11 0 0 0 0 0 0 0 -181.356 0 0 0 0 -231.864 1512.27 0 0 0 0 0 0 0 2170.71 0 0 0 0 0 0 -254.143 0 704.901 0 -361.415 0 0 0 0.08 0 0 0 0 0 0 0 0 0 0 0 0 0 0 0 0 0 
0 2465.51 0 0 0 0 0 0 0 0 0 0 0 0 0 0 0 0 0 0 0 0 1901.53 0 0 0 0 0 0 0 0 0 0 1983.93 0 0 0 0 0 41.7341 0 0 0 0 0 0 0 0 0 -2462 0 0 0 0 0 0 0 0.05 0 -1902.3 0 2305.14 0 1536.84 1683.48 0 0 0 0 0 0 0 0 0 
0 -2054.58 0 0 1284.6 0 -2419.43 0 0 0 0 2498.17 0 0 0 0 0 2247.46 0 -2326.5 0 0 0 0 0 0 0 0 0 0 0 1119.04 0 0 0 0 0 0 0 0 1041.22 944.624 0 0 0 1491.82 831.553 0 0 0 0 0 0 0 0 0 0 0 0.03 0 0 0 0 0 0 633.488 0 0 0 0 0 0 0 0 
0 0 0 0 0 0 0 0 0 0 0 0 0 0 0 0 0 -2234.79 -1126.51 0 0 0 0 0 0 0 1657.54 0 0 0 0 0 0 0 0 0 0 0 0 0 0 0 0 0 0 0 0 0 0 0 0 0 0 0 0 0 0 1603.82 0 0.02 0 0 0 0 0 0 0 0 0 0 0 0 2327.42 0 
0 0 0 2005.6 0 0 1757.48 0 0 0 0 0 1673.1 0 0 0 -1765.88 0 0 0 0 0 0 0 0 0 282.067 -48.1429 1004.14 957.595 0 1806.47 0 0 0 0 -27.6955 700.171 0 0 0 0 0 0 1819.44 0 0 0 0 -1370.66 -1988.2 0 0 0 0 0 0 0 0 0 0.04 0 0 0 0 0 0 0 0 0 0 -1433.53 0 0 
2093.04 0 0 0 0 0 0 0 0 0 0 0 0 0 0 0 0 0 0 0 0 0 0 0 0 0 0 0 0 0 0 0 0 0 0 0 0 0 -59.5874 0 0 0 0 0 0 0 0 0 0 0 0 0 0 0 0 0 0 -1158.71 0 0 0 0.08 0 1512.88 0 0 0 0 0 0 0 0 0 0 
0 0 0 0 0 1578.95 0 586.947 0 -988.113 0 0 0 0 0 0 0 1752.75 0 2411.65 0 0 0 0 -1406.83 0 0 0 0 0 0 0 0 0 0 0 -404.904 0 0 -865.886 0 0 0 0 0 0 0 0 0 1925.18 0 0 0 0 0 0 0 0 0 0 0 0 0 0 0 0 1394.01 0 0 0 0 0 0 0 
0 0 0 0 0 0 0 0 0 0 0 0 0 0 0 0 0 0 0 0 0 0 0 0 2373.96 0 0 0 0 2380.67 2062.82 0 0 0 0 0 0 0 0 0 0 0 0 0 0 421.995 2009.57 -48.6007 0 0 0 0 0 0 0 0 0 1519.59 0 0 0 -276.727 0 0.06 0 0 0 0 0 0 0 0 0 0 
0 0 0 0 0 0 0 0 0 2007.13 -2330.32 0 0 0 0 166.25 0 -2496.95 0 0 2278.13 0 570.467 0 0 0 0 0 0 0 561.464 0 0 0 0 0 0 0 0 -2218.31 1849.96 0 0 0 0 0 0 0 0 0 2175.13 0 0 0 0 0 0 -1823.71 0 0 0 0 0 0 0.06 0 0 0 566.652 0 0 0 0 0 
1544.31 0 0 0 0 0 0 0 -201.041 0 0 0 0 0 0 0 0 0 0 0 0 0 0 0 0 0 0 0 0 0 1492.43 0 0 0 0 -112.69 -2174.21 0 0 0 0 0 0 0 0 0 2112.87 1536.38 0 0 0 0 0 0 0 0 0 0 2352.44 0 0 0 0 0 0 0 0 -2328.18 0 0 0 0 0 0 
0 0 0 0 0 0 0 0 -1375.7 0 0 0 0 0 0 -229.728 0 0 0 0 0 1777.47 0 0 0 0 -1535.31 1369.44 0 0 0 0 0 0 0 2170.25 0 0 0 0 0 0 0 0 0 0 0 0 0 0 97.4303 0 0 824.839 0 0 0 0 0 0 0 0 -1908.4 0 0 0 0.05 0 0 0 0 0 0 0 
0 0 0 0 0 0 0 0 0 0 0 0 0 0 0 1983.78 0 0 0 0 0 0 0 2162.77 0 0 0 0 0 0 1678.29 0 0 0 0 0 0 0 0 955.153 0 0 0 0 0 0 0 0 0 0 0 0 0 0 0 273.064 0 0 0 0 0 0 0 0 0 -621.738 0 0.04 0 0 0 0 0 0 
0 0 0 0 38.5296 0 0 0 0 0 0 0 0 0 0 0 0 0 0 0 0 0 1155.05 0 0 0 0 0 0 0 0 0 0 0 2420.04 0 0 85.6807 0 0 0 1914.5 0 0 0 0 0 0 0 0 0 -961.562 0 895.337 0 0 0 0 0 0 0 0 0 0 -2449.49 0 0 0 0.04 0 0 0 0 0 
0 0 0 0 0 0 0 0 0 0 0 1431.7 0 0 0 0 0 0 0 0 0 0 0 0 0 0 0 0 0 -511.567 0 -837.962 0 0 0 0 0 0 0 0 0 0 0 0 0 0 0 0 0 0 0 0 0 0 0 0 0 0 0 0 0 0 0 0 0 0 0 0 0 0.05 0 0 0 0 
0 0 0 0 0 0 0 0 0 0 0 0 0 0 0 0 0 0 0 0 0 0 0 0 0 0 0 0 0 0 0 0 0 0 0 0 0 0 0 0 0 0 0 0 0 -1056.02 0 0 0 0 0 0 0 0 1271.63 0 0 0 0 0 0 0 0 0 0 0 0 0 0 0 0 0 0 0 
0 0 0 0 0 0 0 0 0 0 0 0 0 0 0 0 0 0 0 0 0 0 0 0 0 0 0 0 0 0 0 0 1035.57 0 0 0 0 0 0 0 0 0 0 0 0 0 0 0 0 0 0 0 0 0 0 0 0 0 0 0 42.0392 0 0 0 0 0 0 0 0 0 0 0.05 0 0 
0 0 0 0 0 0 0 0 0 0 0 0 0 0 0 0 0 0 0 0 0 0 0 0 0 0 0 0 0 0 0 0 0 0 0 0 0 0 0 0 0 0 0 0 0 0 0 0 0 0 0 0 0 0 0 0 0 0 0 1669.9 0 0 0 0 0 0 0 0 0 0 0 0 0.03 0 
0 0 0 0 0 0 0 0 0 0 0 0 0 0 0 -1373.1 1998.89 0 0 0 0 0 0 0 0 0 0 0 0 0 0 0 0 0 0 0 0 0 0 0 0 0 0 0 0 0 0 441.984 0 0 0 0 0 0 0 0 0 0 0 0 0 0 0 0 0 0 0 0 0 0 0 0 0 0.07 
