*Vertices 59
*Matrix 
0.02 -472.961 0 0 0 0 0 0 0 0 0 0 0 0 0 0 0 0 0 0 0 0 0 0 0 1461.46 0 0 0 0 0 0 0 0 0 0 0 0 0 0 1171.53 -1665.32 0 -235.527 0 0 0 0 0 0 0 0 569.857 0 0 0 0 0 0 
1309.63 0 0 0 0 0 0 0 0 0 0 0 0 0 0 0 0 0 0 0 0 0 0 0 0 0 1218.53 -1661.66 0 0 0 1086.54 0 0 0 0 0 0 0 0 0 0 1450.32 0 0 0 0 0 0 0 0 0 -98.1933 1554.08 515.076 0 0 0 0 
0 0 0.08 2295.83 -738.624 0 0 0 0 0 0 0 0 0 0 0 0 0 0 995.895 0 0 0 0 -85.2229 0 1205.1 0 0 0 -783.334 0 0 0 0 0 0 0 0 0 0 -2496.95 2414.55 0 0 0 0 0 393.307 0 0 0 -1133.23 0 731.605 0 0 0 0 
0 0 -208.213 0.01 0 0 1932.05 0 0 0 0 0 0 0 0 0 0 0 0 0 0 1645.79 0 1673.41 0 0 0 0 0 1390.19 0 -723.975 0 0 0 0 0 -2125.08 0 0 -2430.42 0 0 0 0 0 -147.938 2186.12 0 841.472 0 0 0 384.152 0 0 0 0 0 
0 0 2460.63 0 0.07 0 0 0 0 0 888.775 -727.485 0 2085.41 0 0 0 0 0 0 0 0 0 0 1469.39 0 0 1461.76 0 0 0 0 0 0 0 0 0 0 0 0 0 -699.713 0 0 0 0 0 0 0 -2200.16 0 0 -1462.52 0 0 0 0 0 0 
0 0 0 0 0 0.06 0 0 0 0 -310.907 0 0 1111.87 0 0 2065.72 0 0 0 0 0 0 2078.84 0 0 0 0 0 0 0 0 749.153 0 0 0 0 964.003 0 0 0 0 0 0 -543.153 0 0 -110.401 0 0 0 0 0 0 0 0 0 0 0 
0 0 0 1161.31 0 0 0.04 0 0 0 1740.39 0 0 0 0 0 0 0 0 0 0 0 0 -868.175 0 0 0 0 0 0 0 0 0 0 0 0 0 0 0 0 1002.46 1935.71 0 0 0 0 793.71 0 0 -30.5948 0 -2375.79 0 0 0 0 0 0 0 
0 0 0 0 0 0 0 0.02 -1575.44 0 0 0 0 0 0 1742.99 0 0 0 265.893 0 0 0 0 0 0 0 0 0 0 0 0 0 0 0 0 0 0 0 0 0 0 0 0 0 0 1867.05 0 0 0 0 0 -452.818 0 0 0 0 0 0 
0 0 0 0 0 0 0 617.161 0.08 0 0 0 0 0 0 0 1330.38 0 0 0 0 0 0 0 0 0 0 0 0 1129.26 0 0 0 -1255.3 0 0 1820.96 0 0 0 0 0 0 0 0 0 0 0 0 0 -1322.75 0 0 0 0 0 0 0 0 
0 0 0 0 0 0 0 0 0 0 0 0 0 1092.33 0 0 0 0 0 0 0 0 0 0 0 0 0 0 0 0 0 719.092 0 0 0 0 0 0 0 0 0 0 0 0 0 0 0 0 0 0 0 1006.88 0 -1131.4 0 0 0 1998.89 0 
0 0 0 0 2334.28 -755.257 1887.8 0 0 0 0.08 0 0 0 0 0 0 2058.24 0 0 0 0 0 0 0 0 0 0 0 0 0 0 0 0 -82.9341 656.224 0 0 0 0 0 0 -2193.59 0 0 -1387.91 0 0 0 -353.328 0 0 0 0 0 0 0 0 0 
0 0 0 0 2266.84 0 0 0 0 0 0 0.03 495.087 0 0 0 0 0 0 0 0 -124.439 0 0 0 0 0 1449.86 -1459.01 293.97 0 0 0 0 0 0 0 0 0 1487.7 0 0 0 0 0 0 0 0 0 0 -2178.33 0 0 0 0 0 0 0 0 
0 0 0 0 0 0 0 0 0 0 0 2216.48 0.08 0 -1764.5 0 2485.5 0 0 0 0 0 0 0 0 0 1275.44 728.706 0 765.633 0 1087.91 0 0 0 -638.371 0 0 0 0 -1323.21 0 0 0 0 0 0 1994.46 0 0 0 0 1291.01 0 0 0 0 0 944.166 
0 0 0 0 1247.37 -138.936 0 0 0 2316.89 0 0 0 0.05 166.097 0 -2047.56 0 0 0 966.14 0 0 0 0 0 0 0 0 0 0 0 2173.91 0 0 0 0 0 0 0 0 0 0 0 0 0 0 0 0 0 -495.697 0 0 -516.144 0 0 0 0 0 
0 0 0 0 0 0 0 0 0 0 0 0 849.559 1544.77 0.03 808.969 0 0 0 1806.47 0 0 0 0 0 0 0 0 0 0 0 46.9222 0 0 0 0 0 -1754.13 0 0 1607.94 0 0 0 0 0 0 0 -140.156 0 0 0 -37.1563 0 0 -2308.95 0 0 0 
0 0 0 0 0 0 0 1894.51 0 0 0 0 0 0 86.9015 0.08 0 0 0 0 0 0 0 0 0 0 0 0 0 0 0 0 0 0 0 0 0 0 0 0 -1609.62 0 0 0 0 0 0 381.252 0 1102.56 0 0 0 0 0 0 0 0 0 
0 0 0 0 0 1788.46 0 0 -1319.09 0 0 0 456.023 -1389.13 0 0 0.05 0 0 1197.32 0 1063.95 0 0 0 0 0 0 0 0 0 0 0 0 0 0 0 0 0 0 0 0 0 0 0 0 0 1047.01 0 0 0 0 0 848.186 0 0 0 0 0 
0 0 0 0 0 0 0 0 0 0 -1164.97 0 0 0 0 0 0 0.01 0 0 0 0 508.972 0 0 0 0 0 0 0 0 -1218.53 0 0 1697.67 0 -91.3266 -399.564 0 1815.93 0 0 0 0 0 0 830.79 -211.57 0 0 0 0 0 0 0 0 0 0 0 
0 0 0 0 0 0 0 0 0 0 0 0 0 0 0 0 0 0 0.03 0 2174.98 0 0 0 0 479.217 0 0 0 0 0 -1433.53 0 0 0 49.8215 0 0 0 1820.66 0 1515.63 0 0 0 0 0 0 0 0 0 0 0 0 0 0 0 0 0 
0 0 -1769.39 0 0 0 0 -1631.75 0 0 0 0 0 0 543.153 0 1227.99 0 0 0.06 0 0 0 0 0 1930.52 0 0 0 0 0 0 0 0 0 2110.89 0 0 736.03 0 0 0 0 0 0 0 304.498 0 0 0 0 0 0 0 0 0 0 0 0 
0 0 0 0 0 0 0 0 0 0 0 0 0 -1372.34 0 0 0 0 2166.28 0 0 -1099.35 0 0 0 0 0 0 0 0 0 0 0 0 0 0 0 0 0 0 0 0 0 0 0 1629.92 0 0 1190.76 1184.8 0 0 0 1249.35 -2121.88 0 1099.81 0 0 
0 0 0 1000.17 0 0 0 0 0 0 0 1433.38 0 0 0 0 1620 0 0 0 2129.81 0.04 0 0 0 0 0 0 0 0 0 0 0 0 1901.07 0 0 1720.25 -1115.83 0 0 0 0 0 0 -998.184 0 -292.444 0 0 0 -1546.75 0 0 0 0 0 0 0 
0 0 0 0 0 0 0 0 0 0 0 0 0 0 0 0 0 2432.86 0 0 0 0 0.06 0 0 0 0 0 0 0 -150.685 0 0 0 0 0 999.252 0 0 0 0 2049.24 0 -1056.32 0 0 0 0 0 0 0 0 0 0 0 0 0 0 0 
0 0 0 1188.16 0 1506.16 2246.39 0 0 0 0 0 0 0 0 0 0 0 0 0 0 0 0 0.04 0 0 0 0 -1143.76 0 0 1922.74 0 0 0 0 -1399.2 0 -141.682 0 881.909 0 0 0 0 0 0 0 0 0 0 0 0 0 0 0 0 0 0 
0 0 -571.078 0 -86.1385 0 0 0 0 0 0 0 0 0 0 0 0 0 0 0 0 0 0 0 0.03 979.263 0 0 0 0 0 0 0 0 0 0 0 0 0 0 0 0 0 0 0 0 0 0 0 -1602.6 0 0 0 0 2485.2 0 0 0 0 
1477.78 0 0 0 0 0 0 0 0 0 0 0 0 0 0 0 0 0 1624.73 -1781.14 0 0 0 0 983.078 0.09 0 0 0 0 0 0 975.753 0 0 0 0 0 0 0 0 2165.36 0 -1959.97 0 0 0 1688.51 0 0 0 0 0 0 2110.58 0 0 0 0 
0 1120.41 199.362 0 0 0 0 0 0 0 0 0 1295.89 0 0 0 0 0 0 0 0 0 0 0 0 0 0.08 -608.463 0 0 0 0 0 0 107.959 0 0 0 0 0 0 0 0 0 0 0 1593.75 0 0 0 0 1109.42 0 0 0 0 0 0 0 
0 -107.196 0 0 -1255.91 0 0 0 0 0 0 -1373.41 507.141 0 0 0 0 0 0 0 0 0 0 0 0 0 1741.46 0.02 0 459.532 0 1548.74 0 0 0 0 0 0 0 0 0 0 0 2015.82 0 894.269 0 0 0 0 0 0 1213.49 0 0 0 0 0 0 
0 0 0 0 0 0 0 0 0 0 0 397.58 0 0 0 0 0 0 0 0 0 0 0 1745.73 0 0 0 0 0.09 0 0 1791.67 0 0 0 0 0 0 0 0 0 436.949 1337.24 0 0 0 0 0 0 0 0 0 0 0 1644.11 0 0 0 0 
0 0 0 538.575 0 0 0 0 1957.38 0 0 2017.5 -1261.25 0 0 0 0 0 0 0 0 0 0 0 0 0 0 2164.75 0 0.04 69.5059 0 0 0 0 0 0 0 0 0 133.29 0 0 0 -2281.64 -89.4955 0 0 0 -236.137 0 0 0 0 0 2382.81 0 0 0 
0 0 1454.44 0 0 0 0 0 0 0 0 0 0 0 0 0 0 0 0 0 0 0 1318.48 0 0 0 0 0 0 -513.55 0.09 0 0 0 0 0 0 0 0 0 0 0 0 0 0 0 0 0 0 0 0 652.867 1033.59 0 0 0 0 0 0 
0 2478.79 0 684.759 0 0 0 0 0 -38.5296 0 0 -1186.33 0 -1699.04 0 0 -2441.4 2444.76 0 0 0 0 710.395 0 0 0 719.855 723.365 0 0 0.05 0 0 0 0 0 0 0 0 1568.58 0 0 0 0 0 0 0 0 0 0 0 0 0 0 0 0 0 0 
0 0 0 0 0 2353.97 0 0 0 0 0 0 0 -98.0407 0 0 0 0 0 0 0 0 0 0 0 -1387.6 0 0 0 0 0 0 0.09 0 629.978 0 0 0 0 0 1653.26 0 0 0 0 -827.128 0 1505.71 0 0 0 0 0 0 0 0 0 0 0 
0 0 0 0 0 0 0 0 567.873 0 0 0 0 0 0 0 0 0 0 0 0 0 0 0 0 0 0 0 0 0 0 0 0 0 0 0 0 0 0 0 1854.69 0 0 799.356 0 0 0 0 0 0 0 0 0 0 0 0 0 0 0 
0 0 0 0 0 0 0 0 0 0 1297.11 0 0 0 0 0 0 -1573.15 0 0 0 2018.88 0 0 0 0 2378.99 0 0 0 0 0 168.844 0 0.03 0 0 1171.53 1121.94 0 0 -321.589 0 -316.248 0 0 -2347.87 -916.547 0 0 0 0 0 0 0 0 0 0 0 
0 0 0 0 0 0 0 0 0 0 865.429 0 948.592 0 0 0 0 0 1284.6 -2388.76 0 0 0 0 0 0 0 0 0 0 0 0 0 0 0 0 0 0 -2058.09 0 0 0 0 2456.82 0 0 0 0 -2224.88 0 0 587.1 0 167.623 1240.35 0 0 0 0 
0 0 0 0 0 0 0 0 1355.56 0 0 0 0 0 0 0 0 2016.74 0 0 0 0 2494.05 -294.733 0 0 0 0 0 0 0 0 0 0 0 0 0.03 0 0 -1204.49 0 0 0 0 0 0 0 0 0 0 1614.66 0 0 0 0 0 0 0 0 
0 0 0 1093.71 0 -1057.7 0 0 0 0 0 0 0 0 1116.14 0 0 -515.687 0 0 0 2068.62 0 0 0 0 0 0 0 0 0 0 0 0 2259.67 0 0 0.06 -359.432 -884.96 0 0 0 0 0 0 0 0 -482.421 0 0 -31.2052 0 0 1310.24 0 0 0 0 
0 0 0 0 0 0 0 0 0 0 0 0 0 0 0 0 0 0 0 -1412.78 0 2402.65 0 185.629 0 0 0 0 0 0 0 0 0 0 1590.55 -789.59 0 -895.489 0.03 0 0 0 2315.36 2453.46 0 -428.404 -2233.42 0 0 0 0 0 0 0 0 0 0 0 0 
0 0 0 0 0 0 0 0 0 0 0 738.929 0 0 0 0 0 -2427.82 130.085 0 0 0 0 0 0 0 0 0 0 0 0 0 0 0 0 0 952.254 1198.23 0 0.02 0 0 0 0 0 0 0 0 0 0 0 0 0 0 0 0 0 0 0 
1925.34 0 0 2271.57 0 0 -86.7489 0 0 0 0 0 -1129.57 0 1349.76 2245.63 0 0 0 0 0 0 0 -469.909 0 0 0 0 0 -1126.21 0 455.26 -1552.25 1413.54 0 0 0 0 0 0 0.09 0 0 0 0 0 0 0 1611.61 0 0 0 0 0 0 0 0 0 0 
2440.64 0 -2398.68 0 -30.7474 0 -1993.7 0 0 0 0 0 0 0 0 0 0 0 -631.504 0 0 0 1701.64 0 0 1865.67 0 0 789.285 0 0 0 0 0 -1273.92 0 0 0 0 0 0 0.02 -561.769 0 0 0 891.675 0 0 0 0 1401.18 0 0 0 0 0 0 0 
0 193.716 43.7178 0 0 0 0 0 0 0 366.909 0 0 0 0 0 0 0 0 0 0 0 0 0 0 0 0 0 1491.82 0 0 0 0 0 0 0 0 0 1410.79 0 0 -1191.06 0.02 0 0 0 0 0 0 0 0 0 0 0 0 0 0 0 0 
1160.85 0 0 0 0 0 0 0 0 0 0 0 0 0 0 0 0 0 0 0 0 0 305.872 0 0 -1696.6 0 1519.9 0 0 0 0 0 -2122.33 1093.4 2341.46 0 0 2444.46 0 0 0 0 0.09 0 0 0 0 0 0 -123.218 0 1288.11 93.6155 0 0 0 0 0 
0 0 0 0 0 2397.15 0 0 0 0 0 0 0 0 0 0 0 0 0 0 0 0 0 0 0 0 0 0 0 -211.112 0 0 0 0 0 0 0 0 0 0 0 0 0 0 0 0 0 0 0 0 0 0 0 0 0 0 0 0 0 
0 0 0 0 0 0 0 0 0 0 304.498 0 0 0 0 0 0 0 0 0 2145.83 793.558 0 0 0 0 0 -148.091 0 318.079 0 0 130.848 0 0 0 0 0 -252.464 0 0 0 0 0 0 0.09 0 0 0 0 0 0 0 0 0 -2233.88 0 0 0 
0 0 0 2318.26 0 0 -619.144 1263.24 0 0 0 0 0 0 0 0 0 2433.01 0 1007.49 0 0 0 0 0 0 158.315 0 0 0 0 0 0 0 486.999 0 0 0 2476.5 0 0 -1576.2 0 0 0 0 0.02 0 0 0 1459.47 0 -117.878 0 0 0 0 0 0 
0 0 0 -1759.47 0 609.226 0 0 0 0 0 0 -1205.1 0 0 2425.99 1826.61 -1670.2 0 0 0 2164.14 0 0 0 1599.09 0 0 0 0 0 0 1241.72 0 -2216.64 0 0 0 0 0 0 0 0 0 0 0 0 0.03 0 0 0 -777.078 0 0 0 0 0 0 0 
0 0 1931.44 0 0 0 0 0 0 0 0 0 0 0 549.409 0 0 0 0 0 -14.2674 0 0 0 0 0 0 0 0 0 0 0 0 0 0 -396.817 0 -1917.71 0 0 2469.63 0 0 0 0 0 0 0 0.06 0 0 0 0 0 0 0 0 0 0 
0 0 0 1890.85 -2299.34 0 2210.99 0 0 0 1501.74 0 0 0 0 1468.47 0 0 0 0 281.61 0 0 0 1514.86 0 0 0 0 -1005.97 0 0 0 0 0 0 0 0 0 0 0 0 0 0 0 0 0 0 0 0.07 0 0 0 0 0 0 0 0 0 
0 0 0 0 0 0 0 0 -766.854 0 0 2201.07 0 1707.43 0 0 0 0 0 0 0 0 0 0 0 0 0 0 0 0 0 0 0 0 0 0 -848.949 0 0 0 0 0 0 -752.205 0 0 -245.14 0 0 0 0.03 0 0 0 0 0 0 0 0 
0 0 0 0 0 0 -515.687 0 0 2087.24 0 0 0 0 0 0 0 0 0 0 0 2023.15 0 0 0 0 -1875.44 0 0 0 1269.34 0 0 0 0 -1097.67 0 1399.66 0 0 0 -143.666 0 0 0 0 0 2150.72 0 0 0 0.06 0 0 0 0 0 0 0 
-318.232 405.667 2290.03 0 -1694.01 0 0 -420.774 0 0 0 0 696.203 0 938.978 0 0 0 0 0 0 0 0 0 0 0 0 389.492 0 0 -278.405 0 0 0 0 0 0 0 0 0 0 0 0 1593.45 0 0 496.765 0 0 0 0 0 0.02 0 0 0 0 0 0 
0 2026.81 0 1400.42 0 0 0 0 0 1778.08 0 0 0 262.535 0 0 -1707.59 0 0 0 -777.535 0 0 0 0 0 0 0 0 0 0 0 0 0 0 1858.5 0 0 0 0 0 0 0 1243.55 0 0 0 0 0 0 0 0 0 0.07 0 0 0 0 0 
0 1787.24 70.4215 0 0 0 0 0 0 0 0 0 0 0 0 0 0 0 0 0 724.738 0 0 0 1986.98 1386.68 0 0 1722.85 0 0 0 0 0 0 -1109.58 0 -999.1 0 0 0 0 0 0 0 0 0 0 0 0 0 0 0 0 0.07 0 0 0 0 
0 0 0 0 0 0 0 0 0 0 0 0 0 0 2233.73 0 0 0 0 0 0 0 0 0 0 0 0 0 0 653.478 0 0 0 0 0 0 0 0 0 0 0 0 0 0 0 2252.19 0 0 0 0 0 0 0 0 0 0.05 0 0 0 
0 0 0 0 0 0 0 0 0 0 0 0 0 0 0 0 0 0 0 0 2406.92 0 0 0 0 0 0 0 0 0 0 0 0 0 0 0 0 0 0 0 0 0 0 0 0 0 0 0 0 0 0 0 0 0 0 0 0 0 0 
0 0 0 0 0 0 0 0 0 1525.09 0 0 0 0 0 0 0 0 0 0 0 0 0 0 0 0 0 0 0 0 0 0 0 0 0 0 0 0 0 0 0 0 0 0 0 0 0 0 0 0 0 0 0 0 0 0 0 0.03 0 
0 0 0 0 0 0 0 0 0 0 0 0 213.858 0 0 0 0 0 0 0 0 0 0 0 0 0 0 0 0 0 0 0 0 0 0 0 0 0 0 0 0 0 0 0 0 0 0 0 0 0 0 0 0 0 0 0 0 0 0 
