*Vertices 54
*Matrix 
0.03 0 0 0 0 0 2248.83 0 0 0 0 0 0 0 0 0 0 0 0 0 0 0 0 0 0 0 0 0 0 0 0 0 1817.91 0 0 0 0 0 0 -2328.33 -1499.45 0 1780.07 0 0 0 0 0 0 0 0 0 0 0 
0 0.05 0 0 0 -1243.4 1507.84 0 0 0 0 0 0 1493.5 0 0 0 0 0 0 2143.09 0 0 0 469.451 522.095 -508.362 0 0 0 -1012.07 0 0 0 0 0 0 0 0 0 0 0 1786.78 0 0 0 0 1226.16 0 0 0 0 0 0 
0 0 0.09 0 0 0 0 0 0 0 0 0 0 0 0 0 0 0 0 1127.58 0 0 0 1735.97 0 0 0 0 0 -250.328 0 0 0 0 1982.86 0 0 0 0 -701.086 0 0 -2496.49 -482.116 0 0 0 1571.32 0 0 0 0 0 0 
0 0 0 0 0 0 0 0 0 1289.33 0 0 0 0 0 0 0 0 0 0 0 0 -81.1029 0 0 0 1103.32 0 -998.032 0 0 0 0 0 0 0 -760.292 0 -829.417 0 0 0 0 0 0 0 0 0 0 0 0 0 0 0 
0 0 0 0 0.03 0 -1229.67 -1426.05 0 0 1286.28 0 0 0 2388.76 0 0 0 0 0 0 0 0 0 0 0 506.989 0 0 0 0 0 0 0 0 0 0 0 0 0 0 289.697 0 0 -674.993 274.895 0 0 0 0 0 0 0 0 
0 610.599 0 0 0 0.09 0 0 0 1827.98 0 0 2260.89 0 -730.079 0 0 0 0 0 0 0 0 0 0 1644.41 0 0 0 0 -725.959 0 0 0 0 0 0 -2182.3 0 0 0 0 0 2369.53 1233.48 0 0 0 0 0 0 0 0 0 
1844.61 1289.33 0 0 -1908.7 0 0.04 0 0 0 0 0 1226.31 0 0 0 0 0 0 0 -618.534 0 1861.86 0 0 0 0 0 0 0 0 0 0 0 0 0 0 0 0 0 0 1305.81 0 0 0 0 0 0 0 0 0 0 0 0 
0 0 0 0 -461.821 0 0 0.01 0 0 0 0 0 0 284.051 0 0 0 0 0 0 0 -1876.2 2026.96 0 0 1442.08 0 0 0 0 0 0 0 0 1321.83 0 0 0 0 0 0 0 0 0 1680.88 0 0 -1285.36 0 0 0 0 0 
0 0 0 0 0 0 0 0 0.09 0 0 0 0 2286.83 0 0 0 0 0 0 0 0 0 0 1133.38 0 -1024.43 160.298 0 0 0 0 0 0 343.41 0 0 0 0 0 0 0 0 0 0 0 0 0 0 0 0 0 0 0 
0 0 0 1946.39 0 68.2852 0 0 0 0.03 0 0 0 0 0 0 0 -2483.21 0 1973.86 -1051.44 0 0 0 0 0 0 1210.29 1768.78 0 0 0 -162.74 0 0 2065.87 0 0 -280.999 0 0 0 0 0 0 0 0 -548.036 0 0 0 0 0 0 
0 0 0 0 -56.3829 0 0 0 0 0 0.08 1225.39 0 0 0 0 0 0 0 0 0 -575.503 0 0 0 0 0 0 0 0 0 0 0 873.058 0 1000.93 0 0 0 0 0 2258.29 0 0 0 0 0 0 0 0 0 0 0 0 
0 0 0 0 0 0 0 0 0 0 109.79 0.09 0 0 0 0 0 0 1501.74 0 0 0 0 0 0 0 0 1222.19 0 0 0 0 0 0 -136.494 0 0 0 -1034.2 0 0 0 0 0 -528.504 0 0 0 0 0 0 0 0 0 
0 0 0 0 0 273.522 622.349 0 0 0 0 0 0.02 0 0 0 0 0 0 0 0 0 0 0 0 0 -508.209 0 405.972 0 0 0 -448.546 0 0 0 1831.49 0 579.012 0 0 0 0 0 0 0 0 0 0 0 0 0 0 0 
0 1105.91 0 0 0 0 0 0 1416.9 0 0 0 0 0.06 0 -902.356 0 0 0 0 0 0 2031.69 0 0 0 0 0 1792.73 0 0 0 0 0 0 0 1684.7 2140.64 0 -1710.03 0 0 0 0 0 0 0 0 -1345.03 0 0 0 0 0 
0 0 0 0 -1257.74 2231.74 0 -782.876 0 0 0 0 0 0 0.02 0 0 0 0 0 0 0 0 0 0 0 0 0 0 1293.3 0 914.258 0 0 2351.53 -189.291 1716.13 2080.98 0 0 0 0 0 0 0 0 0 0 0 0 0 0 0 0 
0 0 0 0 0 0 0 0 0 0 0 0 0 383.847 0 0.01 0 0 0 0 0 0 2490.39 0 0 0 1171.07 0 0 0 0 0 0 0 0 0 0 0 0 0 0 0 0 0 -821.482 0 0 0 0 0 0 0 0 0 
0 0 0 0 0 0 0 0 0 0 0 0 0 0 0 0 0.03 0 0 0 0 0 0 0 0 0 -337.611 0 0 0 -591.067 2254.02 0 0 842.845 0 0 0 0 2003.77 0 0 0 0 0 0 0 0 0 -865.734 0 0 0 0 
0 0 0 0 0 0 0 0 0 1062.73 0 0 0 0 0 0 0 0.08 0 0 0 0 0 0 0 0 0 -1762.83 0 1698.58 0 0 0 -961.409 0 0 0 -1158.41 0 0 0 0 1334.04 0 0 0 0 0 0 0 0 0 0 0 
0 0 0 0 0 0 0 0 0 0 0 197.836 0 0 0 0 0 0 0.05 0 0 2270.2 0 0 0 0 0 0 0 0 0 0 0 0 0 0 -1823.4 0 0 0 5.11185 1643.35 0 -812.632 0 0 0 0 0 0 0 0 0 0 
0 0 -1865.67 0 0 0 0 0 0 -1086.38 0 0 0 0 0 0 0 0 0 0.08 0 985.977 0 0 0 468.078 0 0 0 0 0 0 0 0 0 0 0 0 0 0 0 0 0 2202.75 0 -1353.27 2397.92 0 0 0 0 0 0 0 
0 -2352.9 0 0 0 0 675.298 0 0 -2319.03 0 0 0 0 0 0 0 0 0 0 0.05 1906.26 0 1350.37 0 0 0 0 0 0 0 2223.65 0 0 0 0 2400.2 0 0 0 618.229 1103.78 0 0 0 0 0 0 0 0 0 0 0 0 
0 0 0 0 0 0 0 0 0 0 -2050.46 0 0 0 0 0 0 0 -211.722 1274.83 -1994.46 0.09 0 0 0 0 0 0 0 2030.32 -1513.64 0 0 0 0 0 0 2196.95 0 1550.87 0 0 1017.87 0 0 0 0 0 0 0 0 1511.05 0 0 
0 0 0 -7.85852 0 0 -1180.84 1168.32 0 0 0 0 0 259.941 0 -1915.42 0 0 0 0 0 0 0.07 0 2488.56 0 0 0 0 0 0 0 -770.211 229.881 2006.67 0 0 0 0 0 0 0 0 0 0 0 1955.7 0 0 0 0 0 0 0 
0 0 -2034.44 0 0 0 0 328.761 0 0 0 0 0 0 0 0 0 0 0 0 1035.11 0 0 0 0 -1132.31 0 0 0 851.238 0 0 0 0 0 0 0 1710.03 0 0 0 0 0 0 0 0 0 0 0 0 0 0 0 0 
0 1637.7 0 0 0 0 0 0 1192.89 0 0 0 0 0 0 0 0 0 0 0 0 0 -1659.67 0 0 0 0 0 0 0 -2408.14 0 0 0 0 0 0 0 0 0 0 0 2093.8 0 0 0 0 0 0 0 0 0 0 0 
0 2371.21 0 0 0 -2387.23 0 0 0 0 0 0 0 0 0 0 0 0 0 2334.28 0 0 0 826.975 0 0.03 0 0 0 901.288 0 0 0 0 0 0 1367.61 0 0 0 0 0 0 0 0 0 0 294.885 0 0 1268.43 0 0 0 
0 -1073.72 0 2401.43 1013.44 0 0 -573.824 386.746 0 0 0 -1346.86 0 0 1564.15 -540.864 0 0 0 0 0 0 0 0 0 0.02 2488.56 483.947 0 0 0 0 0 0 0 0 0 0 0 0 1768.93 -1502.96 0 0 0 -1844.31 646.153 0 0 0 0 0 0 
0 0 0 0 0 0 0 0 694.525 1227.53 0 2389.22 0 0 0 0 0 -1743.29 0 0 0 0 0 0 0 0 1123 0.08 0 0 -2232.35 0 0 0 0 0 0 0 0 975.448 0 0 -1228.9 0 0 0 0 0 0 0 0 0 0 0 
0 0 0 1639.38 0 0 0 0 0 1714 0 0 1434.14 652.104 0 0 0 0 0 0 0 0 0 0 0 0 1959.97 0 0.02 0 0 0 -1005.05 0 0 0 0 -2082.96 0 0 -1650.36 0 0 0 0 0 0 0 0 0 0 0 0 0 
0 0 1595.74 0 0 0 0 0 0 0 0 0 0 0 -1959.67 0 0 893.811 0 0 0 1047.01 0 2324.37 0 2337.95 0 0 0 0.08 0 -2259.21 0 0 0 0 0 0 0 -1683.94 0 0 0 1409.27 0 1057.7 0 548.952 0 0 0 0 1826.3 0 
0 2326.65 0 0 0 1756.72 0 0 0 0 0 0 0 0 0 0 -583.743 0 0 0 0 -696.203 0 0 631.504 0 0 1255.91 0 0 0.09 0 -794.626 0 0 0 0 0 0 0 0 0 0 -1504.64 0 0 0 0 0 0 0 0 0 0 
0 0 0 0 0 0 0 0 0 0 0 0 0 0 501.495 0 2076.1 0 0 0 413.602 0 0 0 0 0 0 0 0 1079.06 0 0.09 0 0 0 -1445.28 0 0 0 0 0 0 0 0 1866.59 -1344.72 0 0 0 0 0 0 0 0 
850.627 0 0 0 0 0 0 0 0 1372.04 0 0 188.833 0 0 0 0 0 0 0 0 0 -1546.6 0 0 0 0 0 -2243.49 0 447.63 0 0.04 0 -526.215 0 0 0 0 0 0 0 0 0 0 0 0 0 1696.91 0 0 0 0 0 
0 0 0 0 0 0 0 0 0 0 2358.55 0 0 0 0 0 0 552.766 0 0 0 0 1760.38 0 0 0 0 0 0 0 0 0 0 0.05 0 0 -1971.11 0 0 0 0 0 0 0 0 0 0 -71.337 0 0 0 0 0 0 
0 0 -558.412 0 0 0 0 0 1603.67 0 0 2115.62 0 0 -363.399 0 118.488 0 0 0 0 0 1631.14 0 0 0 0 0 0 0 0 0 163.198 0 0.09 0 0 0 0 0 0 0 0 2214.35 0 -1480.53 -424.436 0 0 0 0 0 0 0 
0 0 0 0 0 0 0 1473.97 0 2081.74 -1312.98 0 0 0 1150.62 0 0 0 0 0 0 0 0 0 0 0 0 0 0 0 0 -487.152 0 0 0 0.04 0 0 1101.64 0 0 0 0 0 0 0 0 0 0 0 0 0 0 0 
0 0 0 2013.53 0 0 0 0 0 0 0 0 -1605.81 1346.25 -382.015 0 0 0 1691.72 0 -1854.69 0 0 0 0 282.525 0 0 0 0 0 0 0 -2117.15 0 0 0.06 39.14 0 0 0 0 0 1544.01 0 0 0 0 0 0 0 0 0 713.141 
0 0 0 0 0 -1716.28 0 0 0 0 0 0 0 -1760.38 2106.92 0 0 2329.71 0 0 0 345.546 0 138.02 0 0 0 0 975.143 0 0 0 0 0 0 0 1231.35 0.02 0 0 0 0 0 0 0 0 0 0 0 0 0 0 0 0 
0 0 0 -2187.95 0 0 0 0 0 2391.05 0 1687.75 1386.84 0 0 0 0 0 0 0 0 0 0 0 0 0 0 0 0 0 0 0 0 0 0 -1699.96 0 0 0.06 2067.4 0 -317.469 205.618 0 0 0 0 0 0 0 0 0 0 0 
-986.435 0 1123.46 0 0 0 0 0 0 0 0 0 0 -529.878 0 0 1264.31 0 0 0 0 2015.37 0 0 0 0 0 284.814 0 721.839 0 0 0 0 0 0 0 0 1661.5 0.05 0 1551.79 0 0 0 0 0 0 0 0 0 0 0 0 
721.381 0 0 0 0 0 0 0 0 0 0 0 0 0 0 0 0 0 2474.06 0 1186.79 0 0 0 0 0 0 0 1004.29 0 0 0 0 0 0 0 0 0 0 0 0.08 0 0 0 2246.09 0 0 0 0 0 0 0 0 0 
0 0 0 0 -487.152 0 -206.992 0 0 0 -2161.09 0 0 0 0 0 0 0 -1355.71 0 2072.89 0 0 0 0 0 1912.67 0 0 0 0 0 0 0 0 0 0 0 385.83 608.005 0 0.02 0 0 0 0 0 0 0 0 0 0 0 0 
1462.22 1966.08 -2183.83 0 0 0 0 0 0 0 0 0 0 0 0 0 0 1287.35 0 0 0 -1583.07 0 0 -582.064 0 1264.76 1405 0 0 0 0 0 0 0 0 0 0 1295.13 0 0 0 0.04 0 0 -507.752 -1506.62 0 0 0 0 0 0 0 
0 0 -1584.29 0 0 -899.457 0 0 0 0 0 0 0 0 0 0 0 0 899.152 2397.76 0 0 0 0 0 0 0 0 0 1971.11 547.121 0 0 0 2173.15 0 -1976.76 0 0 0 0 0 0 0.07 0 0 0 762.886 0 0 0 0 0 0 
0 0 0 0 2428.89 -138.63 0 0 0 0 0 1696.3 0 0 0 1423.15 0 0 0 0 0 0 0 0 0 0 0 0 0 0 0 -116.504 0 0 0 0 0 0 0 0 -2352.75 0 0 0 0 0 0 0 0 0 0 0 0 0 
0 0 0 0 1572.54 0 0 1080.74 0 0 0 0 0 0 0 0 0 0 0 1578.49 0 0 0 0 0 0 0 0 0 -2411.19 0 1460.54 0 0 -2374.26 0 0 0 0 0 0 0 1527.83 0 0 0.07 0 0 0 0 0 0 0 0 
0 0 0 0 0 0 0 0 0 0 0 0 0 0 0 0 0 0 0 2015.82 0 0 -25.5593 0 0 0 950.117 0 0 0 0 0 0 0 2011.7 0 0 0 0 0 0 0 908.46 0 0 0 0.02 0 0 0 0 0 0 0 
0 1413.54 -923.109 0 0 0 0 0 0 2460.48 0 0 0 0 0 0 0 0 0 0 0 0 0 0 0 -1850.11 1685.31 0 0 -313.654 0 0 0 1711.25 0 0 0 0 0 0 0 0 0 1687.44 0 0 0 0.02 0 0 0 0 0 0 
0 0 0 0 0 0 0 557.192 0 0 0 0 0 201.956 0 0 0 0 0 0 0 0 0 0 0 0 0 0 0 0 0 0 1235.16 0 0 0 0 0 0 0 0 0 0 0 0 0 0 0 0.05 0 0 0 0 0 
0 0 0 0 0 0 0 0 0 0 0 0 0 0 0 0 1601.38 0 0 0 0 0 0 0 0 0 0 0 0 0 0 0 0 0 0 0 0 0 0 0 0 0 0 0 0 0 0 0 0 0.09 0 0 0 0 
0 0 0 0 0 0 0 0 0 0 0 0 0 0 0 0 0 0 0 0 0 0 0 0 0 873.363 0 0 0 0 0 0 0 0 0 0 0 0 0 0 0 0 0 0 0 0 0 0 0 0 0.05 0 0 0 
0 0 0 0 0 0 0 0 0 0 0 0 0 0 0 0 0 0 0 0 0 2186.73 0 0 0 0 0 0 0 0 0 0 0 0 0 0 0 0 0 0 0 0 0 0 0 0 0 0 0 0 0 0.01 0 0 
0 0 0 0 0 0 0 0 0 0 0 0 0 0 0 0 0 0 0 0 0 0 0 0 0 0 0 0 0 946.303 0 0 0 0 0 0 0 0 0 0 0 0 0 0 0 0 0 0 0 0 0 0 0.09 0 
0 0 0 0 0 0 0 0 0 0 0 0 0 0 0 0 0 0 0 0 0 0 0 0 0 0 0 0 0 0 0 0 0 0 0 0 2099.75 0 0 0 0 0 0 0 0 0 0 0 0 0 0 0 0 0.03 
