*Vertices 63
*Matrix 
0.02 0 0 0 0 0 2128.28 -418.638 0 0 0 0 0 -2201.68 0 1323.05 0 0 0 0 0 0 0 0 0 0 -790.048 830.027 0 0 0 0 0 0 0 1075.7 856.273 0 0 0 210.959 -221.793 1248.89 0 0 2357.17 0 1121.63 2194.66 0 0 0 0 0 0 0 0 0 0 0 0 0 0 
0 0 167.776 0 0 0 1281.7 0 171.133 0 0 0 0 0 0 0 0 0 434.812 0 175.1 -368.13 0 0 0 0 0 0 0 0 0 0 1898.63 0 0 0 0 0 0 0 507.294 0 0 0 0 0 0 0 0 0 0 0 0 0 0 0 0 0 0 0 0 0 0 
0 844.218 0.06 0 0 0 0 0 0 0 0 0 2206.56 0 0 0 0 0 1432.31 0 0 0 0 -343.867 0 181.509 0 487.609 0 -2191.61 0 0 1583.07 0 0 0 0 0 0 0 0 -152.058 0 0 0 0 0 0 0 0 0 0 0 2064.35 -248.192 1950.82 0 0 0 0 0 0 -2306.82 
0 0 0 0.07 0 0 0 0 0 0 0 1405.61 0 0 0 0 0 0 0 0 2022.23 0 2102.95 749.916 0 0 0 0 0 0 434.049 -2394.71 0 0 0 0 0 0 0 0 837.199 0 0 1531.8 0 0 0 0 0 96.5148 165.181 0 0 0 0 0 0 0 -1441.92 0 0 -170.217 0 
0 0 0 0 0.09 -1918.47 -1799.45 0 0 0 0 0 0 0 0 0 0 0 0 54.857 2226.55 0 0 0 0 0 0 1805.25 -950.27 -2122.18 -933.485 0 2193.44 -192.343 1808.15 0 0 0 1078.75 0 0 0 0 0 0 0 0 0 0 0 0 0 0 0 0 0 0 0 0 0 0 0 0 
0 0 0 0 254.601 0.02 0 1530.43 213.401 0 0 0 0 1537.14 0 0 0 1950.06 0 0 0 -357.143 0 1645.02 2175.74 1436.12 123.676 0 315.943 527.284 0 0 0 0 0 0 2126.61 -526.063 0 0 0 0 0 542.238 0 0 0 0 0 0 0 0 0 0 0 605.716 64.1652 0 -1613.13 0 0 0 0 
415.586 1378.6 0 0 1944.41 0 0.01 0 0 0 0 0 0 0 0 2255.7 -1280.48 0 812.326 0 0 0 0 2069.38 0 0 0 0 1810.89 0 0 0 0 0 0 0 0 0 0 1487.09 0 0 0 0 0 0 0 0 0 0 0 0 0 0 0 0 0 0 0 0 0 697.577 0 
-1479.92 0 0 0 0 397.275 0 0 0 0 0 0 0 -380.642 965.224 452.818 0 0 0 0 0 1271.63 2149.95 0 0 0 0 2057.33 0 0 0 0 0 -832.163 0 0 0 0 0 0 0 0 0 0 0 0 0 0 0 -814.463 0 0 0 0 0 0 0 0 0 0 232.322 -149.312 0 
0 1825.24 0 0 0 984.146 0 0 0.06 0 0 0 1346.55 2467.8 0 0 0 1000.93 66.9118 0 1956.77 0 0 0 0 0 944.929 550.478 0 0 0 0 -307.55 0 0 0 0 2448.12 0 -271.081 -1759.01 0 0 0 0 0 0 -418.18 0 0 0 0 0 0 0 0 0 0 0 0 0 0 0 
0 0 0 0 0 0 0 0 0 0.07 -190.817 0 0 0 739.082 -689.032 0 0 0 2426.6 0 0 0 0 0 -142.445 0 0 2478.18 0 0 0 0 0 0 2137.29 0 0 0 0 0 1374.94 0 0 0 0 0 0 0 0 0 760.14 0 0 0 0 0 0 0 0 1625.19 0 0 
0 0 0 0 0 0 0 0 0 -76.5252 0.01 -1989.58 592.746 2004.38 0 0 833.995 0 -2407.22 0 0 0 0 0 980.941 0 1964.55 0 0 0 0 0 1526 0 0 713.446 0 0 2363.73 0 0 0 0 541.932 0 0 0 -1328.39 1688.36 0 0 0 0 0 0 279.168 0 0 0 0 0 0 0 
0 0 0 -249.565 0 0 0 0 0 0 2413.63 0.07 0 0 0 0 634.251 -1948.38 2180.62 0 1355.56 104.907 0 0 2291.56 0 0 0 0 0 0 0 1236.23 0 0 0 0 0 0 0 2095.48 0 0 0 0 0 0 0 0 0 0 -182.424 0 0 0 0 0 0 0 0 0 0 0 
0 0 -1294.52 0 0 0 0 0 440.916 0 -2101.43 0 0.06 0 0 137.867 0 -595.035 0 0 1437.04 0 0 2298.27 0 805.918 0 0 0 0 1394.77 0 0 0 0 0 0 0 0 702.918 0 0 0 0 -1012.99 0 0 37.9192 0 0 0 0 0 1519.59 1479.61 0 -486.236 0 0 -1579.87 0 0 0 
855.815 0 0 0 0 -557.497 0 -698.798 -466.857 0 1770.61 0 0 0.05 0 -435.27 0 0 0 0 0 -919.752 0 0 -1448.94 0 -41.8867 0 0 0 0 2205.8 -38.2244 0 0 0 0 2439.12 1732.92 0 1906.72 0 0 0 0 0 0 0 0 0 0 0 -523.927 0 0 0 0 -1228.6 0 0 0 2210.38 0 
0 0 0 0 0 0 0 -1616.34 0 1817.76 0 0 0 0 0 -181.661 -1814.1 0 2441.71 0 0 0 0 0 1180.84 1467.1 0 0 0 0 0 0 0 0 -206.229 2229.45 -967.971 0 637.455 -1330.84 0 1676.15 0 0 0 0 0 0 -1598.79 0 0 103.229 0 -337.153 0 0 451.14 0 0 0 0 0 0 
-1817.61 0 0 0 0 0 -1323.82 1313.59 0 2035.2 0 0 1429.26 -1115.07 642.338 0.01 0 0 0 -1689.12 0 0 0 0 0 1575.75 0 2485.05 0 0 0 0 0 0 0 1928.85 0 0 1886.58 0 -1049.46 -1756.87 0 0 0 0 0 0 0 1385.31 0 0 0 0 -1740.24 0 0 0 0 0 0 0 0 
0 0 0 0 0 0 -1281.4 0 0 0 776.925 -1488.46 0 0 1694.31 0 0.08 0 0 0 0 0 0 0 1560.49 0 250.938 1803.57 0 -1504.49 0 0 0 0 1699.35 0 0 0 0 -1775.8 0 2340.08 0 0 2140.49 0 0 0 268.639 0 0 0 2237.54 0 0 0 0 0 0 0 2169.33 0 0 
0 0 0 0 0 28.1533 0 0 1524.17 0 0 1608.25 -1869.49 0 0 0 0 0 -2002.4 2463.07 0 0 2349.85 0 0 2473.45 0 0 0 -389.645 868.48 0 0 0 0 0 0 2213.43 -1428.8 -1318.02 0 0 0 0 0 0 2190.54 0 0 0 0 0 0 360.042 0 0 -943.403 0 0 0 0 -1963.33 0 
0 2457.58 -1549.65 0 0 0 -1689.73 0 698.645 0 432.829 1048.08 0 0 731.147 0 0 496.155 0.09 0 0 0 0 0 0 0 -229.27 0 -2168.57 0 0 177.694 0 0 0 0 2247.92 2471.47 -346.309 0 0 0 0 0 1830.73 0 0 0 0 0 0 0 0 0 0 0 0 -946.608 1933.27 0 0 0 0 
0 0 0 0 -690.405 0 0 0 0 -1158.1 0 0 0 0 0 -1969.74 0 2069.54 0 0.04 -314.417 0 0 0 0 0 0 0 0 0 0 2034.9 0 0 896.252 0 0 1585.06 2372.28 770.058 2187.34 1177.33 0 0 0 0 0 0 0 0 0 0 0 0 0 2119.13 0 0 0 0 0 0 0 
0 -182.424 0 -133.9 -1049.3 0 0 0 -936.689 0 0 -603.275 2082.96 0 0 0 0 0 0 1343.5 0.08 0 0 0 0 0 0 0 254.753 0 -917.92 0 1024.74 0 0 0 0 2178.64 0 -519.807 0 0 -522.858 0 0 0 0 0 0 0 0 0 0 0 0 0 0 0 0 0 0 0 0 
0 -1255.91 0 0 0 2068.32 0 -1644.26 0 0 0 -364.772 0 -1327.63 0 0 0 0 0 0 0 0.04 0 0 0 1259.58 0 0 0 0 1886.73 0 0 0 0 1612.83 0 -2094.1 0 1913.43 1764.96 0 0 0 0 2120.2 0 0 0 0 0 0 875.958 0 0 0 0 2229.15 0 -993.454 0 0 -1786.17 
0 0 0 2188.41 0 0 0 1387.6 0 0 0 0 0 0 0 0 0 -2019.49 0 0 0 0 0.07 0 550.172 2432.71 0 712.836 -1894.97 0 835.063 -2230.83 0 -1042.13 0 829.112 1042.13 0 0 0 -620.06 0 0 894.726 0 0 -1947.92 0 0 5.72222 0 0 0 0 0 0 0 0 0 0 0 0 0 
0 0 1764.81 -414.975 0 2364.8 1105.61 0 0 0 0 0 463.347 0 0 0 0 0 0 0 0 0 0 0.04 0 0 0 0 -1838.97 0 0 0 0 0 0 0 0 0 0 0 0 0 0 0 0 0 0 0 0 0 0 0 0 0 -2164.3 0 0 0 371.181 0 0 0 0 
0 0 0 0 0 -725.044 0 0 0 0 250.481 -139.851 0 -2009.41 -2358.7 0 546.663 0 0 0 0 0 1943.95 0 0.01 729.011 0 0 0 0 2386.78 0 0 0 0 1289.33 0 0 0 0 0 0 0 0 0 0 0 1689.28 0 0 0 0 0 -199.82 0 0 0 0 0 0 0 0 0 
0 0 -1368.83 0 0 2214.8 0 0 0 224.235 0 0 1526.15 0 -453.276 809.122 0 1717.05 0 0 0 836.283 163.35 0 1369.29 0.02 0 0 778.451 0 1970.96 -1765.88 0 2098.83 -1189.99 0 0 -437.712 0 0 0 0 0 0 0 0 0 0 0 0 0 0 0 0 0 0 0 0 0 0 0 0 0 
1499.3 0 0 0 0 1460.39 0 0 697.577 0 2151.94 0 0 464.11 0 0 -1918.01 0 2187.64 0 0 0 0 0 0 0 0.05 1367.92 0 0 -667.974 0 0 0 0 1061.51 0 0 -2047.11 0 0 1289.94 0 0 1702.09 0 0 0 0 0 1376.61 0 0 0 0 713.446 0 0 0 0 0 0 0 
2400.81 0 1846.14 0 701.392 0 0 -1475.19 2282.71 0 0 0 0 0 0 2226.25 1275.9 0 0 0 0 0 -1495.48 0 0 0 -692.541 0.05 0 0 1388.97 0 0 0 2000.56 0 126.118 902.356 -951.491 2052.45 0 0 0 0 0 0 0 0 0 0 0 0 -2479.4 0 0 0 0 0 0 0 1991.41 0 0 
0 0 0 0 1758.55 -1930.68 423.978 0 0 -1977.83 0 0 0 0 0 0 0 0 2401.73 0 -2035.66 0 -1151.54 2295.37 0 1761.76 0 0 0.08 1253.62 2431.64 0 0 0 302.667 0 0 0 0 0 0 1049.76 0 0 0 0 0 0 0 0 0 609.989 0 0 0 -288.018 -1696.45 0 -559.175 0 0 0 0 
0 0 2186.12 0 -983.23 -1622.9 0 0 0 0 0 0 0 0 0 0 -611.515 1505.25 0 0 0 0 0 0 0 0 0 0 362.484 0.09 -121.387 1554.84 0 0 0 1692.18 279.473 0 0 0 542.695 0 -91.174 0 0 0 0 0 1575.14 -1233.79 0 0 0 0 0 0 0 0 0 0 0 0 0 
0 0 0 1159.32 -1627.48 0 0 0 0 0 0 0 2083.42 0 0 0 0 -234.916 0 0 2481.69 -1033.43 583.895 0 2026.96 305.719 1140.86 782.418 2039.17 -1661.05 0.06 2071.21 -127.033 1917.71 2238.46 882.824 0 0 0 0 0 0 0 0 0 0 0 -1555.91 0 -2163.23 0 1248.28 0 0 0 0 1501.59 0 0 0 0 0 477.996 
0 0 0 -1323.21 0 0 0 0 0 0 0 0 0 1683.17 0 0 0 0 -815.378 -2436.22 0 0 2023.61 0 0 2217.4 0 0 0 987.503 -2476.2 0.01 -172.811 0 1306.88 0 0 2289.57 0 0 0 -781.198 -987.35 0 0 0 0 0 0 0 186.239 0 0 -1658.15 0 0 0 0 0 0 0 0 0 
0 228.05 -1827.37 0 1760.08 0 0 0 -664.312 0 -172.506 1363.19 0 2429.2 0 0 0 0 0 0 154.195 0 0 0 0 0 0 0 0 0 1316.34 515.687 0.06 0 0 1900.62 -1645.79 -420.469 0 47.2274 0 505.463 0 0 0 0 0 0 0 0 0 0 0 0 -37.7667 0 0 0 0 0 0 0 0 
0 0 0 0 2090.44 0 0 -1043.5 0 0 0 0 0 0 0 0 0 0 0 0 0 0 1477.63 0 0 2175.44 0 0 0 0 -648.595 0 0 0.03 0 0 0 0 -1049.91 0 0 0 0 0 0 -168.844 -2033.52 0 0 0 0 0 -891.217 0 0 0 0 0 0 0 0 0 0 
0 0 0 0 -1423.31 0 0 0 0 0 0 0 0 0 -1378.75 0 1699.35 0 0 1523.71 0 0 0 0 0 -824.686 0 1945.02 -2332.76 0 789.285 768.075 0 0 0.05 0 0 773.415 0 0 0 0 0 0 0 0 0 0 0 0 0 -768.685 0 0 0 0 0 0 0 0 0 0 0 
1629.15 0 0 0 0 0 0 0 0 1264.61 -2437.44 0 0 0 1619.69 -1790.9 0 0 0 0 0 983.993 1910.54 0 -1043.96 0 2173.91 0 0 253.227 1200.06 0 2039.17 0 0 0.02 1387.6 0 -1729.26 0 -238.731 1918.62 2100.36 0 -1813.18 0 0 0 0 0 0 0 0 0 0 0 0 0 0 0 1336.48 0 0 
1906.42 0 0 0 0 -1735.51 0 0 0 0 0 0 0 0 275.658 0 0 0 629.521 0 0 0 1827.37 0 0 0 0 559.481 0 706.58 0 0 297.479 0 0 1197.78 0.06 0 0 0 0 0 0 -963.546 0 0 0 0 0 0 0 0 0 0 0 -727.027 0 0 -1794.11 0 0 0 0 
0 0 0 0 0 2049.7 0 0 -1184.65 0 0 0 0 1417.36 0 0 0 1599.09 1511.2 -1768.93 2017.96 -198.294 0 0 0 -1884.44 0 468.383 0 0 0 162.74 1300.32 0 2409.51 0 0 0.01 0 -784.402 -491.272 0 0 0 0 0 0 0 0 0 947.981 0 1922.59 0 0 0 -1786.63 0 0 0 0 0 0 
0 0 0 0 1367.76 0 0 0 0 0 483.032 0 0 -2144.61 -1250.11 1981.49 0 -2330.77 872.143 1512.88 0 0 0 0 0 0 1445.59 -689.795 0 0 0 0 0 1914.2 0 1366.24 0 0 0 0 0 0 0 1692.02 0 0 0 0 0 0 0 -91.6318 0 0 0 0 0 0 2440.64 0 0 0 -1609.32 
0 0 0 0 0 0 -419.401 0 1484.19 0 0 0 -811.869 0 2039.63 0 2106.77 2168.57 0 452.055 -989.639 1866.44 0 0 0 0 0 1139.33 0 0 0 0 1657.23 0 0 0 0 1521.27 0 0.01 91.7844 0 0 -976.516 0 0 0 0 0 0 0 0 0 0 0 0 0 0 0 0 0 0 0 
1114.46 107.044 0 262.841 0 0 0 0 918.683 0 0 766.396 0 1727.58 0 374.233 0 0 0 -1732.61 0 2365.26 2086.47 0 0 0 0 0 0 67.98 0 0 0 0 0 -382.168 0 1897.41 0 1015.43 0.03 0 0 0 0 0 2024.67 0 0 -1385.46 -307.245 0 0 0 0 0 0 0 0 514.313 0 0 0 
1078.45 0 398.801 0 0 0 0 0 0 1254.84 0 0 0 0 -1206.63 2091.36 -2193.44 0 0 -400.937 0 0 0 0 0 0 2144.92 0 -1122.55 0 0 -1255.76 82.0185 0 0 1693.7 0 0 0 0 0 0.02 0 0 597.934 0 -518.128 0 0 0 0 0 0 0 0 1860.94 0 0 0 0 0 -1282.31 -2398.07 
1527.53 0 0 0 0 0 0 0 0 0 0 0 0 0 0 0 0 0 0 0 915.479 0 0 0 0 0 0 0 0 -1540.35 0 965.377 0 0 0 2045.73 0 0 0 0 0 0 0.07 0 0 0 0 0 0 0 0 0 -1701.18 0 0 0 0 0 0 0 0 0 0 
0 0 0 -667.211 0 67.98 0 0 0 0 1458.56 0 0 0 0 0 0 0 0 0 0 0 999.863 0 0 0 0 0 0 0 0 0 0 0 0 0 2354.58 0 1667.76 2221.37 0 0 0 0 0 0 0 697.729 0 0 -499.969 0 0 0 0 0 0 -1675.24 0 0 0 0 0 
0 0 0 0 0 0 0 0 0 0 0 0 1802.5 0 0 0 1895.43 0 2327.11 0 0 0 0 0 0 0 -809.427 0 0 0 0 0 0 0 0 903.882 0 0 0 0 0 -2386.17 0 0 0 0 0 0 0 0 0 0 0 0 0 0 0 0 0 0 -895.337 0 0 
2130.57 0 0 0 0 0 0 0 0 0 0 0 0 0 0 0 0 0 0 0 0 1001.85 0 0 0 0 0 0 0 0 0 0 0 -7.40074 0 0 0 0 0 0 0 0 0 0 0 0.03 -1782.51 0 0 0 0 0 0 0 0 0 0 2342.68 0 0 0 0 0 
0 0 0 0 0 0 0 0 0 0 0 0 0 0 0 0 0 1144.67 0 0 0 0 -1258.96 0 0 0 0 0 0 0 0 0 0 1041.67 0 0 0 0 0 0 436.949 2435.91 0 0 0 934.706 0.01 0 0 1589.18 0 0 0 0 0 0 0 0 0 613.041 0 0 0 
2393.34 0 0 0 0 0 0 0 -432.829 0 2491.15 0 -186.392 0 0 0 0 0 0 0 0 0 0 0 164.876 0 0 0 0 0 -1998.28 0 0 0 0 0 0 0 0 0 0 0 0 -2006.67 0 0 0 0 0 0 7.85852 2060.38 0 0 0 2337.95 0 0 -56.6881 1239.28 -158.925 0 -523.011 
1034.65 0 0 0 0 0 0 0 0 0 -1465.88 0 0 0 97.2777 0 2166.28 0 0 0 0 0 0 0 0 0 0 0 0 1412.78 0 0 0 0 0 0 0 0 0 0 0 0 0 0 0 0 0 0 0 0 0 0 0 -2273.71 0 0 0 -382.015 0 0 0 0 0 
0 0 0 2299.65 0 0 0 584.964 0 0 0 0 0 0 0 2223.96 0 0 0 0 0 0 482.574 0 0 0 0 0 0 -1273.46 -1809.37 0 0 0 0 0 0 0 0 0 -1074.02 0 0 0 0 0 -102.924 0 0 0 0 0 0 0 0 0 434.202 0 0 0 0 0 0 
0 0 0 -436.338 0 0 0 0 0 0 0 0 0 0 0 0 0 0 0 0 0 0 0 0 0 0 836.894 0 0 0 0 -960.952 0 0 0 0 0 601.749 0 0 1353.57 0 0 2020.1 0 0 0 2178.79 0 0 0.03 0 0 0 0 0 0 1230.89 0 0 0 0 0 
0 0 0 0 0 0 0 0 0 2220.91 0 2185.51 0 0 2368.77 0 0 0 0 0 0 0 0 0 0 0 0 0 221.03 0 2365.41 0 0 0 1251.03 0 0 0 2264.09 0 0 0 0 0 0 0 0 -2057.79 0 0 0 0.09 1558.05 0 0 0 -2063.59 0 0 0 0 0 0 
0 0 0 0 0 0 0 0 0 0 0 0 0 380.032 0 0 580.233 0 0 0 0 -440.458 0 0 0 0 0 124.439 0 0 0 0 0 1367.61 0 0 0 -1871.17 0 0 0 0 -1196.55 0 0 0 0 0 0 0 0 1785.71 0.06 0 0 0 0 0 0 0 0 0 1920 
0 0 1563.39 0 0 0 0 0 0 0 0 0 -1522.8 0 -738.929 0 0 2385.71 0 0 0 0 0 0 2234.18 0 0 0 0 0 0 2375.64 0 0 0 0 0 0 0 0 0 0 0 0 0 0 0 0 2080.37 0 0 0 0 0.04 0 0 0 0 0 0 0 0 0 
0 0 -1693.7 0 0 0 0 0 0 0 0 0 -428.251 0 0 2395.93 0 0 0 0 0 0 0 -1319.09 0 0 0 0 0 0 0 0 2347.87 0 0 0 0 0 0 0 0 0 0 0 0 0 0 0 0 0 0 0 0 0 0.02 0 0 -716.498 0 0 0 -548.036 0 
0 0 2473.45 0 0 -1737.8 0 0 0 0 630.589 0 0 0 0 0 0 0 0 2381.13 0 0 0 0 0 0 -2377.01 0 988.266 0 0 0 0 0 0 0 1619.39 0 0 0 0 1922.59 0 0 0 0 0 526.673 0 0 0 0 0 0 0 0.06 0 0 0 0 0 0 0 
0 0 0 0 0 716.956 0 0 0 0 0 0 -1490.3 0 2214.04 0 0 2245.78 0 0 0 0 0 0 0 0 0 0 1288.72 0 1034.35 0 0 0 0 0 0 374.538 0 0 0 0 0 0 0 0 0 0 0 -373.318 0 -1596.8 0 0 0 0 0.05 0 0 523.164 0 0 0 
0 0 0 0 0 0 0 0 0 0 0 0 0 1630.68 0 0 0 0 -1150.01 0 0 -2194.05 0 0 0 0 0 0 0 0 0 0 0 0 0 0 0 0 0 0 0 0 0 1985.92 0 2198.32 0 0 1712.62 0 -1358.46 0 0 0 1107.75 0 0 0.03 2330.47 0 0 0 2051.53 
0 0 0 1052.05 0 -1922.59 0 0 0 0 0 0 0 0 0 0 0 0 927.534 0 0 0 0 1008.56 0 0 0 0 1384.24 0 0 0 0 0 0 0 -255.364 0 229.423 0 0 0 0 0 0 0 0 214.469 0 0 0 0 0 0 0 0 0 767.464 0.01 0 0 0 0 
0 0 0 0 0 0 0 0 0 0 0 0 -568.789 0 0 0 0 0 0 0 0 1553.01 0 0 0 0 0 0 0 0 0 0 0 0 0 0 0 0 0 0 1268.43 0 0 0 0 0 1839.58 -1352.5 0 0 0 0 0 0 0 0 1056.63 0 0 0.08 0 -1310.24 0 
0 0 0 0 0 0 0 -1366.85 0 2337.18 0 0 0 0 0 0 -2203.36 0 0 0 0 0 0 0 0 0 0 2390.44 0 0 0 0 0 0 0 305.872 0 0 0 0 0 0 0 0 -1257.13 0 0 1580.78 0 0 0 0 0 0 0 0 0 0 0 0 0.09 0 -1094.32 
0 0 0 -2461.55 0 0 899.915 1925.03 0 0 0 0 0 765.328 0 0 0 2429.65 0 0 0 0 0 0 0 0 0 0 0 0 0 0 0 0 0 0 0 0 0 0 0 -464.721 0 0 0 0 0 0 0 0 0 0 0 0 1064.1 0 0 0 0 265.282 0 0.04 0 
0 0 1092.94 0 0 0 0 0 0 0 0 0 0 0 0 0 0 0 0 0 0 -1413.69 0 0 0 0 0 0 0 0 1345.03 0 0 0 0 0 0 0 2433.77 0 0 -78.2037 0 0 0 0 0 699.866 0 0 0 0 -1607.18 0 0 0 0 148.244 0 0 -906.629 0 0.04 
