*Vertices 56
*Matrix 
0.08 0 2213.43 910.901 0 0 0 0 0 1063.04 0 0 1590.55 0 0 -1733.38 0 2094.56 0 0 0 0 0 0 0 -1084.86 0 0 0 0 0 0 -2006.21 0 0 0 0 0 0 1051.29 0 0 0 -774.331 0 0 0 -35.6304 1442.84 0 0 0 0 0 0 2276.91 
0 0 0 0 0 766.396 0 0 0 1788 0 0 0 -606.937 0 0 0 0 0 0 0 0 0 0 0 0 0 0 0 0 0 0 0 0 -1549.81 0 0 0 0 1854.23 0 0 0 0 0 2323.91 0 0 0 0 0 0 0 0 0 0 
1257.44 0 0 0 0 0 945.997 0 0 0 0 0 -1693.24 0 0 0 0 1969.44 0 0 0 0 -1363.8 1409.12 0 0 0 0 0 1936.17 0 0 0 0 0 0 0 0 2277.21 -2343.29 0 0 0 0 0 0 0 0 0 0 0 0 0 -2391.2 0 0 
1706.67 0 0 0.02 0 1266.75 0 2159.72 0 0 0 0 0 0 0 0 0 0 0 -1286.43 0 0 0 2077.62 0 0 0 0 0 0 0 0 953.932 0 -1556.67 0 0 -2053.51 -2221.82 0 0 0 0 0 0 0 0 0 0 1886.43 0 0 0 0 0 0 
0 0 0 0 0.03 0 -706.732 0 0 0 0 -1847.67 283.288 0 0 2370.91 0 0 0 2483.98 0 0 0 0 0 0 0 0 0 0 0 0 0 0 0 -1006.88 0 0 0 -1018.94 2431.49 -2011.25 0 0 0 0 0 157.399 0 0 0 0 0 0 0 0 
0 579.318 0 1191.37 0 0.06 0 0 0 0 332.118 0 0 0 0 -807.901 0 1843.7 2140.8 494.171 0 0 0 358.974 0 0 0 0 1283.23 0 1108.51 0 542.085 0 0 0 0 0 -234.001 0 0 0 -1039.38 0 0 0 0 0 0 0 0 0 0 0 0 0 
0 0 -1344.42 0 -775.246 0 0.08 0 0 0 531.098 1795.94 0 0 0 0 0 2027.73 0 0 0 0 0 0 0 0 0 0 0 0 1471.53 0 0 0 0 0 0 0 0 0 0 0 0 0 1901.23 0 0 0 0 0 0 -1831.64 0 0 0 0 
0 0 0 1668.83 0 0 0 0.03 1308.86 0 2308.95 0 2224.88 -1232.57 1238.82 0 0 1585.51 0 0 0 0 0 0 0 -1645.18 0 0 0 0 0 0 0 0 0 0 0 1064.26 0 0 0 1815.01 -1384.7 -1320.31 0 0 0 0 0 0 -2456.05 667.974 0 -1648.38 1312.52 0 
0 0 0 0 0 0 0 94.2259 0.04 1654.18 0 0 0 0 0 0 1087.45 2101.43 -315.027 0 0 0 0 0 -1118.88 1173.82 0 0 0 0 0 -1135.06 0 0 0 0 -2415.01 0 0 0 0 0 0 0 0 0 0 0 0 0 0 0 0 0 0 0 
1332.67 1845.84 0 0 0 0 0 0 1774.88 0.07 0 0 0 0 2018.57 0 1491.36 -453.734 0 0 0 1326.87 0 0 0 0 0 0 0 0 0 0 0 0 0 0 0 0 660.802 777.535 0 0 0 0 0 385.372 0 0 0 0 0 2036.58 0 0 1390.8 0 
0 0 0 0 0 -73.0155 1121.48 2337.64 0 0 0 0 0 0 0 0 -212.333 0 0 0 0 0 0 0 0 0 0 0 0 -1025.8 0 -1542.48 0 0 0 0 0 0 651.494 0 0 0 0 0 0 0 -383.389 0 0 0 0 0 799.356 0 0 0 
0 0 0 0 2404.63 0 -2321.01 0 0 0 0 0.04 0 0 76.0674 0 1570.1 -732.826 417.264 0 0 1665.17 0 0 0 2131.64 0 -2193.75 0 0 0 -1204.79 0 0 0 0 0 0 0 0 0 0 0 -479.827 0 0 0 0 0 0 0 0 0 0 0 0 
2135 0 2405.09 0 2216.03 0 0 1021.99 0 0 0 0 0.09 0 2174.06 0 0 0 0 0 0 0 0 0 0 -1837.14 1164.36 0 -307.092 0 0 0 0 373.47 0 -1556.98 0 0 0 0 0 0 0 0 0 0 0 0 -146.718 0 0 0 0 0 0 0 
0 -1356.32 0 0 0 0 0 2496.95 0 0 0 0 0 0.09 0 -776.009 0 -2380.83 0 549.562 0 0 0 0 2245.78 0 0 0 0 0 0 0 0 0 0 -904.035 0 0 0 0 0 0 0 2119.13 0 0 0 0 0 0 0 0 0 0 0 0 
0 0 0 0 0 0 0 524.537 0 1769.84 0 742.439 2383.42 0 0.04 0 0 -522.095 0 0 -514.618 0 -336.695 0 0 0 0 1760.38 2303.31 0 0 0 0 0 0 0 0 0 0 0 0 0 0 0 0 0 0 0 0 0 0 0 0 0 1383.33 0 
309.839 0 0 0 -1648.38 628.452 0 0 0 0 0 0 0 368.587 0 0 1586.12 1167.1 2349.09 0 0 0 0 0 0 0 0 0 0 0 0 0 0 0 0 0 0 0 -2301.32 0 0 0 0 0 1614.66 0 0 0 0 0 0 0 0 0 -291.528 0 
0 0 0 0 0 0 0 0 864.513 1361.96 -327.693 -1122.09 0 0 0 2317.19 0.08 -1070.36 -497.528 1719.03 0 0 0 0 -2290.49 0 0 1527.53 0 0 0 0 0 0 0 0 0 0 0 0 0 0 0 0 0 0 0 1378.44 0 0 0 -2202.9 1413.24 0 0 0 
2184.9 0 -1222.5 0 0 2354.73 -478.759 -16.8615 404.447 1780.37 0 2331.08 0 279.473 604.953 -70.8792 -1558.2 0.07 0 0 0 0 2307.58 0 0 41.4289 0 0 0 0 0 -799.203 0 0 1239.13 0 0 0 0 0 0 0 0 0 -210.807 0 0 0 0 196.463 0 0 0 -2227.16 0 0 
0 0 0 0 0 -2243.64 0 0 2083.88 0 0 2461.09 0 0 0 1306.73 840.861 0 0.07 0 0 0 0 0 0 0 0 0 0 -1240.35 0 0 0 0 0 0 0 0 0 0 0 0 0 0 0 0 0 0 0 0 0 0 0 0 0 0 
0 0 0 1048.54 881.146 1968.06 0 0 0 0 0 0 0 1570.1 0 0 -1728.64 0 0 0 0 0 0 0 0 364.772 0 0 0 0 0 0 0 0 0 0 0 0 0 0 0 0 0 0 0 136.952 1310.39 0 0 0 0 0 0 0 0 0 
0 0 0 0 0 0 0 0 0 0 0 0 0 0 1666.84 0 0 0 0 0 0.02 0 0 0 0 0 0 0 0 0 0 0 0 0 0 0 0 0 0 0 0 0 0 0 0 0 0 0 0 0 0 2376.71 2038.41 2010.64 0 0 
0 0 0 0 0 0 0 0 0 2184.59 0 1394.47 0 0 0 0 0 0 0 0 0 0 0 0 0 0 0 0 0 0 1255.3 0 0 0 0 1470.31 0 -2082.51 0 0 0 -120.777 1697.21 0 0 0 0 0 0 0 0 0 0 0 0 0 
0 0 2439.27 0 0 0 0 0 0 0 0 0 0 0 -1640.14 0 0 1540.04 0 0 0 0 0.08 0 0 0 2313.53 1423.61 0 0 0 0 0 0 0 0 0 0 0 0 0 0 0 0 0 0 0 0 1602.15 0 0 0 0 0 0 0 
0 0 -592.898 2497.25 0 -450.682 0 0 0 0 0 0 0 0 0 0 0 0 0 0 0 0 0 0.04 0 0 0 0 0 0 0 -246.818 0 0 0 0 0 0 0 -925.092 0 0 0 0 579.775 0 0 0 0 0 0 0 0 0 0 0 
0 0 0 0 0 0 0 0 -60.0452 0 0 0 0 2189.78 0 0 2317.5 0 0 0 0 0 0 0 0.01 0 0 0 0 0 0 0 0 -1962.87 1479.77 0 0 0 0 0 0 0 0 0 0 2263.33 0 0 0 0 0 0 0 0 0 0 
589.541 0 0 0 0 0 0 -816.141 -1103.93 0 0 2069.84 361.11 0 0 0 0 564.516 0 2217.4 0 0 0 0 0 0 0 2286.98 0 0 0 0 0 2245.78 0 0 795.389 0 0 0 0 0 0 0 0 0 0 0 0 0 0 0 0 0 0 0 
0 0 0 0 0 0 0 0 0 0 0 0 -1533.78 0 0 0 0 0 0 0 0 0 -505.158 0 0 0 0.08 0 0 0 935.011 0 -2153.77 0 1590.55 0 0 0 0 0 0 0 0 0 2342.98 0 0 0 0 0 0 0 0 0 0 0 
0 0 0 0 0 0 0 0 0 0 0 2491.15 0 0 1137.2 0 -1338.31 0 0 0 0 0 -837.962 0 0 -547.121 0 0.01 0 0 0 0 0 0 0 0 0 0 0 -441.527 0 0 0 0 0 0 0 0 0 0 0 0 0 0 0 0 
0 0 0 0 0 2375.03 0 0 0 0 0 0 2439.73 0 1425.44 0 0 0 0 0 0 0 0 0 0 0 0 0 0.06 2003.16 0 0 0 0 0 0 0 0 0 0 0 0 0 -662.023 0 0 0 0 0 0 0 0 -2246.54 0 0 0 
0 0 1042.13 0 0 0 0 0 0 0 2371.06 0 0 0 0 0 0 0 1921.83 0 0 0 0 0 0 0 0 0 1679.51 0.02 0 0 -1450.47 0 0 0 0 0 0 0 0 0 0 0 0 603.275 0 0 0 0 0 -379.727 0 0 0 0 
0 0 0 0 0 1421.17 -794.931 0 0 0 0 0 0 0 0 0 0 0 0 0 0 -281.152 0 0 0 0 489.593 0 0 0 0.06 0 0 0 0 1218.99 -28.3059 0 0 2209.31 0 -1619.54 0 0 0 0 0 0 0 0 0 0 0 0 0 0 
0 0 0 0 0 0 0 0 1280.02 0 -598.239 971.023 0 0 0 0 0 2258.9 0 0 0 0 0 2022.39 0 0 0 0 0 0 0 0.08 0 0 0 0 0 544.374 0 -43.5652 0 0 -2104.63 0 0 0 0 0 1468.32 0 0 0 0 1098.59 0 0 
317.927 0 0 2208.55 0 1280.02 0 0 0 0 0 0 0 0 0 0 0 0 0 0 0 0 0 0 0 0 2346.03 0 0 216.91 0 0 0.06 0 0 0 0 0 0 0 0 0 0 0 0 0 0 897.168 0 -964.461 462.889 0 0 0 0 69.0481 
0 0 0 0 0 0 0 0 0 0 0 0 -610.141 0 0 0 0 0 0 0 0 0 0 0 2080.52 2431.33 0 0 0 0 0 0 0 0.02 0 0 -85.6807 0 0 0 0 0 0 0 2166.74 0 0 0 0 1047.47 0 0 2496.03 0 0 0 
0 2329.1 0 1511.51 0 0 0 0 0 0 0 0 0 0 0 0 0 -295.038 0 0 0 0 0 0 -600.833 0 765.938 0 0 0 0 0 0 0 0.03 0 0 0 0 0 0 0 0 0 0 1110.03 0 0 1334.19 0 0 0 0 -1703.92 0 0 
0 0 0 0 1410.64 0 0 0 0 0 0 0 -41.7341 -1154.74 0 0 0 0 0 0 0 -82.9341 0 0 0 0 0 0 0 0 2196.04 0 0 0 0 0.02 0 0 0 0 0 0 0 -1404.23 0 0 -633.335 0 0 -126.728 1992.48 0 0 0 0 0 
0 0 0 0 0 0 0 0 1679.66 0 0 0 0 0 0 0 0 0 0 0 0 0 0 0 0 781.503 0 0 0 0 -734.809 0 0 589.999 0 0 0.08 0 0 0 0 0 0 -132.679 580.081 0 0 0 0 2409.82 -61.2659 0 0 0 0 0 
0 0 0 2220.91 0 0 0 -200.735 0 0 0 0 0 0 0 0 0 0 0 0 0 1763.13 0 0 0 0 0 0 0 0 0 2208.09 0 0 0 0 0 0.02 -1015.27 0 0 0 0 0 0 0 0 2353.36 2172.54 0 994.827 0 0 0 0 0 
0 0 2028.18 1048.39 0 -1502.04 0 0 0 2138.81 -418.79 0 0 0 0 2447.81 0 0 0 0 0 0 0 0 0 0 0 0 0 0 0 0 0 0 0 0 0 -2427.37 0.08 0 0 358.821 0 0 0 0 0 -2175.28 0 0 0 0 897.168 0 0 0 
-2314.14 248.344 -486.389 0 -224.235 0 0 0 0 1319.24 0 0 0 0 0 0 0 0 0 0 0 0 0 -2128.13 0 0 0 2334.13 0 0 739.54 1475.34 0 0 0 0 0 0 0 0.06 0 0 0 0 0 0 0 0 0 0 0 0 2290.64 0 0 0 
0 0 0 0 1600.31 0 0 0 0 0 0 0 0 0 0 0 0 0 0 0 0 0 0 0 0 0 0 0 0 0 0 0 0 0 0 0 0 0 0 0 0.05 0 0 0 0 0 -473.113 0 0 0 1963.79 0 0 0 0 0 
0 0 0 0 1745.43 0 0 875.958 0 0 0 0 0 0 0 0 0 0 0 0 0 971.328 0 0 0 0 0 0 0 0 -1251.18 0 0 0 0 0 0 0 -269.097 0 0 0.04 0 1876.81 0 0 0 0 0 -804.239 0 0 0 0 0 0 
0 0 0 0 0 528.199 0 2344.66 0 0 0 0 0 0 0 0 0 0 0 0 0 1432 0 0 0 0 0 0 0 0 0 -1958.14 0 0 0 0 0 0 0 0 0 0 0.04 0 0 0 0 1332.36 0 0 0 0 0 0 0 1109.12 
1410.49 0 0 0 0 0 0 1407.9 0 0 0 -2055.19 0 -1697.36 0 0 0 0 0 0 0 0 0 0 0 0 0 0 1212.27 0 0 0 0 0 0 2210.23 1228.75 0 0 0 0 -2205.65 0 0.05 0 1438.26 0 0 0 0 1112.32 0 0 0 0 -151.906 
0 0 0 0 0 0 1270.26 0 0 0 0 0 0 0 0 -1677.53 0 -1450.93 0 0 0 0 0 872.448 0 0 2043.75 0 0 0 0 0 0 2364.5 0 0 2410.73 0 0 0 0 0 0 0 0.05 0 0 0 0 0 0 0 0 0 -73.0155 0 
0 1796.85 0 0 0 0 0 0 0 2189.02 0 0 0 0 0 0 0 0 0 1438.41 0 0 0 0 1664.86 0 0 0 0 820.261 0 0 0 0 -2249.29 0 0 0 0 0 0 0 0 -1646.86 0 0.02 0 0 0 0 0 0 0 0 0 0 
0 0 0 0 0 0 0 0 0 0 -1433.68 0 0 0 0 0 0 0 0 978.347 0 0 0 0 0 0 0 0 0 0 0 0 0 0 0 345.393 0 0 0 0 2494.66 0 0 0 0 0 0.07 0 0 0 0 0 0 0 0 0 
-702.46 0 0 0 1067.61 0 0 0 0 0 0 0 0 0 0 0 2325.89 0 0 0 0 0 0 0 0 0 0 0 0 0 0 0 -1071.58 0 0 0 0 1466.19 2142.78 0 0 0 1544.62 0 0 0 0 0.06 2428.13 0 -1524.32 0 0 0 0 0 
2300.1 0 0 0 0 0 0 0 0 0 0 0 2244.87 0 0 0 0 0 0 0 0 0 -1182.36 0 0 0 0 0 0 0 0 -1981.03 0 0 -1321.38 0 0 157.704 0 0 0 0 0 0 0 0 0 30.9 0.07 0 0 0 0 0 0 0 
0 0 0 2091.05 0 0 0 0 0 0 0 0 0 0 0 0 0 -1960.13 0 0 0 0 0 0 0 0 0 0 0 0 0 0 -1282.16 584.964 0 2283.17 861.919 0 0 0 0 228.355 0 0 0 0 0 0 0 0.02 0 0 0 0 0 0 
0 0 0 0 0 0 0 -1007.34 0 0 0 0 0 0 0 0 0 0 0 0 0 0 0 0 0 0 0 0 0 0 0 0 908.917 0 0 2214.5 1919.69 -885.876 0 0 930.586 0 0 332.575 0 0 0 2165.06 0 0 0.03 0 0 0 0 0 
0 0 0 0 0 0 -1166.65 2380.67 0 -1439.63 0 0 0 0 0 0 225.15 0 0 0 1901.07 0 0 0 0 0 0 0 0 -2133.78 0 0 0 0 0 0 0 0 0 0 0 0 0 0 0 0 0 0 0 0 0 0.08 0 0 0 0 
0 0 0 0 0 0 0 0 0 0 125.965 0 0 0 0 0 -613.346 0 0 0 -701.697 0 0 0 0 0 0 0 736.335 0 0 0 0 1557.89 0 0 0 0 -71.337 288.476 0 0 0 0 0 0 0 0 0 0 0 0 0.02 0 0 0 
0 0 -1089.89 0 0 0 0 -1721.17 0 0 0 0 0 0 0 0 0 699.713 0 0 2283.47 0 0 0 0 0 0 0 0 0 0 2369.08 0 0 1269.49 0 0 0 0 0 0 0 0 0 0 0 0 0 0 0 0 0 0 0.05 0 1677.07 
0 0 0 0 0 0 0 2373.04 0 752.51 0 0 0 0 693.304 -2020.4 0 0 0 0 0 0 0 0 0 0 0 0 0 0 0 0 0 0 0 0 0 0 0 0 0 0 0 0 -802.713 0 0 0 0 0 0 0 0 0 0.06 0 
-1502.81 0 0 0 0 0 0 0 0 0 0 0 0 0 0 0 0 0 0 0 0 0 0 0 0 0 0 0 0 0 0 0 247.429 0 0 0 0 0 0 0 0 0 -1022.6 1812.42 0 0 0 0 0 0 0 0 0 1069.29 0 0.05 
