*Vertices 57
*Matrix 
0.01 -2312.92 0 0 0 -1299.25 0 0 0 0 0 0 0 0 0 1692.02 0 1257.29 0 0 0 0 0 0 0 0 0 0 0 0 0 0 2488.25 0 0 0 1724.07 0 0 1443.45 0 0 0 0 0 0 0 0 0 0 0 0 0 0 0 0 0 
-1701.79 0.06 0 0 0 2398.53 0 0 0 0 0 0 2112.26 0 0 0 2490.54 0 0 -1433.07 0 0 0 0 0 0 0 0 0 0 0 1113.7 0 0 -1525.7 0 0 0 0 0 0 0 0 0 0 0 0 0 0 0 0 0 0 0 0 0 0 
0 0 0.06 754.341 0 0 0 0 1633.88 2291.41 2026.2 0 0 1311.15 0 0 0 0 0 0 0 0 0 0 0 0 0 0 0 0 0 0 0 0 0 0 0 0 -2086.02 0 0 0 0 0 185.018 0 0 -1826.76 0 0 0 2380.98 0 2395.32 0 0 0 
0 0 -1756.26 0.09 0 0 0 0 0 0 0 0 0 0 609.378 0 0 0 0 0 -176.626 0 0 0 0 0 0 0 0 1815.32 0 0 0 0 0 0 0 0 0 0 0 0 0 0 0 0 0 0 2373.5 0 0 0 0 0 0 0 0 
0 0 0 0 0.06 0 0 1124.38 0 0 0 0 0 -2492.68 0 0 -1542.94 0 0 0 -812.937 38.0718 0 0 -2177.72 0 2310.63 0 0 0 0 0 0 0 0 0 0 576.876 0 0 0 0 0 0 1462.98 1723.76 0 1014.21 0 0 0 0 0 0 0 0 0 
-274.895 -905.56 0 0 0 0.08 -380.032 0 0 554.445 0 0 0 0 0 0 0 0 0 1378.14 0 0 0 0 0 0 1975.39 0 0 0 0 0 0 0 0 0 0 0 0 0 0 0 0 0 0 0 1473.82 0 -1470.61 0 0 0 0 0 0 0 0 
0 0 0 0 0 1907.33 0.04 0 0 0 0 0 0 0 0 1555.6 0 0 0 0 0 0 2152.85 -1932.51 0 0 0 -577.334 174.337 -432.524 0 0 0 0 -465.484 0 0 0 215.232 0 0 0 0 1221.27 0 0 0 0 0 0 0 0 0 0 0 0 0 
0 0 0 0 557.649 0 0 0.02 0 0 0 0 0 0 0 0 772.347 0 0 8.31629 0 0 0 0 0 0 0 0 0 0 0 0 0 0 -2199.7 0 0 0 0 0 1256.52 0 -430.692 0 0 0 0 0 0 0 0 1378.9 0 0 0 1766.49 0 
0 0 -1336.33 0 0 0 0 0 0.09 0 0 0 0 -1333.43 0 0 -1826.46 0 0 0 0 0 0 0 0 0 0 0 0 0 0 0 0 0 0 0 0 0 0 0 0 0 0 2136.22 0 1889.32 0 0 0 0 76.0674 0 2464.75 0 0 0 0 
0 0 2333.22 0 0 162.893 0 0 0 0 0 0 0 2441.71 0 2431.03 0 0 0 0 0 0 0 0 -852.916 0 0 0 0 0 0 0 0 0 0 0 0 0 0 0 0 0 0 -636.54 0 0 0 0 0 0 0 0 0 0 0 0 -1151.39 
0 0 1586.89 0 0 0 0 0 0 0 0.03 0 -1798.84 0 0 0 0 0 0 0 0 0 0 0 0 0 890.149 0 0 162.587 0 0 0 0 0 0 723.212 -2032.61 0 0 0 2379.15 0 0 0 0 0 0 0 0 0 0 0 0 -198.904 -2151.02 0 
0 0 0 0 0 0 0 0 0 0 0 0.07 0 0 0 0 0 0 0 0 0 0 -657.292 2357.33 0 0 0 0 0 0 0 0 -2472.53 0 0 0 0 0 0 0 0 1148.49 0 0 1374.48 0 -978.042 0 0 0 0 0 0 0 0 0 0 
0 1933.27 0 0 0 0 0 0 0 0 -1566.13 0 0.08 0 0 0 0 0 0 0 0 0 0 0 0 0 0 0 0 0 0 0 0 797.678 0 0 0 0 0 2421.72 0 0 0 0 860.851 0 1822.34 0 0 0 0 0 0 0 0 0 0 
0 0 924.024 0 2435.45 0 0 0 -2287.9 1520.81 0 0 0 0.04 0 0 0 0 2451.32 0 0 0 0 -34.4096 0 0 0 0 0 0 0 0 0 2232.66 0 0 0 -2001.17 0 657.14 0 0 0 0 0 0 0 0 0 0 0 0 0 0 0 0 0 
0 0 0 1059.22 0 0 0 0 0 0 0 0 0 0 0 0 0 0 0 0 2185.66 0 0 0 0 -1968.06 0 0 0 0 0 0 1700.72 0 393.002 0 0 0 0 0 0 708.563 0 0 0 1918.47 -479.217 0 422.758 0 0 0 0 0 0 0 0 
1461.46 0 0 0 0 0 66.3015 0 0 -1035.87 0 0 0 0 0 0 0 0 0 0 0 0 0 0 0 -342.494 0 1408.66 0 0 0 0 0 0 0 0 0 0 0 0 0 0 0 0 0 0 850.932 0 0 0 0 0 0 1345.03 352.718 0 0 
0 -379.269 0 0 889.843 0 0 -508.667 2217.09 0 0 0 0 0 0 0 0.01 0 0 0 0 -1964.25 0 0 2159.87 0 0 0 0 -1990.19 2025.28 0 0 0 0 0 791.421 0 0 0 0 0 0 0 0 0 -668.584 0 0 0 0 2402.8 1149.4 0 0 0 69.8111 
1933.12 0 0 0 0 0 0 0 0 0 0 0 0 0 0 0 0 0.08 -1690.65 0 0 0 0 0 0 0 0 0 0 0 0 0 0 0 0 0 0 0 0 0 0 0 0 0 0 0 0 0 0 0 0 0 0 -134.663 0 0 1003.98 
0 0 0 0 0 0 0 0 0 0 0 0 0 -2499.85 0 0 0 -470.061 0.05 0 0 0 0 0 1802.19 -1431.7 0 0 0 0 -1397.21 -1398.13 206.076 2092.73 0 0 0 0 0 0 0 0 0 0 0 2494.96 0 0 1117.97 0 0 0 0 0 0 0 0 
0 -907.086 0 0 0 -505.615 0 -1293.76 0 0 0 0 0 0 0 0 0 0 0 0.06 0 0 0 0 0 576.876 0 -1370.66 0 2326.5 0 -2351.53 0 0 0 0 0 0 0 0 1858.04 0 0 0 0 0 0 0 0 1432.31 -1242.64 2292.02 0 0 0 0 0 
0 0 0 1690.95 -2406 0 0 0 0 0 0 0 0 0 134.51 0 0 0 0 0 0.03 0 0 0 1911.15 0 0 -10.4526 0 0 0 0 0 0 0 0 0 0 0 0 0 0 0 0 0 0 0 0 1698.43 0 0 1079.67 0 0 0 0 0 
0 0 0 0 1743.29 0 0 0 0 0 0 0 0 0 0 0 -2488.4 0 0 0 0 0.01 0 0 1835.46 0 0 0 987.045 240.104 0 0 0 0 0 0 0 0 0 2401.73 0 0 2075.33 907.392 0 0 0 0 0 0 0 0 0 0 0 838.725 0 
0 0 0 0 0 0 856.731 0 0 0 0 1156.42 0 0 0 0 0 0 0 0 0 0 0.05 0 0 0 0 0 0 0 0 0 939.283 0 0 0 0 0 -1997.36 -1218.22 2374.11 0 0 0 0 0 -777.535 0 0 0 0 0 0 -968.581 0 559.938 0 
0 0 0 0 0 0 940.962 0 0 0 0 1020 0 2004.23 0 0 0 0 0 0 0 0 0 0.09 0 0 0 0 0 0 0 0 0 0 0 0 0 0 0 -2142.02 0 0 0 0 0 0 0 0 0 0 0 0 0 0 0 0 0 
0 0 0 0 2351.22 0 0 0 0 352.565 0 0 0 0 0 0 1427.73 0 648.442 0 -1250.42 2108.45 0 0 0.02 0 0 0 0 0 0 0 0 0 -1966.08 2478.79 0 0 0 -2002.09 0 0 0 0 0 0 -2470.4 0 901.746 0 0 1084.25 98.3459 0 0 0 0 
0 0 0 0 0 0 0 0 0 0 0 0 0 0 1447.42 570.009 0 0 344.02 833.689 0 0 0 0 0 0.08 0 0 -1097.37 0 594.729 0 2079.76 0 0 0 0 0 0 0 0 2394.1 0 0 0 0 0 0 0 0 0 0 0 0 0 0 0 
0 0 0 0 -134.51 -245.445 0 0 0 0 -1250.27 0 0 0 0 0 0 0 0 0 0 0 0 0 0 0 0.08 1388.36 0 0 0 0 292.596 0 0 0 0 0 1900.62 0 0 0 0 0 0 -1865.98 0 0 648.595 0 0 0 0 627.689 0 542.085 0 
0 0 0 0 0 0 1985.15 0 0 0 0 0 0 0 0 2256.16 0 0 0 1780.07 -550.935 0 0 0 0 0 472.961 0.07 0 0 0 0 0 -1808.15 -1171.68 0 1789.38 0 0 0 317.927 0 0 0 0 0 0 0 0 0 0 0 0 0 0 0 0 
0 0 0 0 0 0 631.504 0 0 0 0 0 0 0 0 0 0 0 0 0 0 1746.5 0 0 0 1630.99 0 0 0.02 0 0 0 0 0 0 0 0 1860.18 112.232 0 0 1618.78 0 0 122.608 0 0 0 0 0 -1818.52 0 0 0 0 0 0 
0 0 0 -819.193 0 0 844.371 0 0 0 888.318 0 0 0 0 0 2396.85 0 0 -759.835 0 1504.94 0 0 0 0 0 0 0 0 0 0 0 0 0 0 0 0 0 0 0 0 2404.48 0 0 226.829 0 0 0 0 0 2029.71 0 0 0 -1261.86 0 
0 0 0 0 0 0 0 0 0 0 0 0 0 0 0 0 1540.5 0 -2400.2 0 0 0 0 0 0 438.932 0 0 0 0 0.01 0 0 0 2005.75 0 0 0 0 0 0 0 0 0 0 -1684.85 0 0 0 0 0 0 0 0 2003.31 0 0 
0 1703.62 0 0 0 0 0 0 0 0 0 0 0 0 0 0 0 0 124.592 1524.32 0 0 0 0 0 0 0 0 0 0 0 0.03 0 1958.75 0 0 0 0 0 0 0 0 0 0 0 0 0 0 -2233.57 0 0 0 0 1496.55 0 0 0 
724.891 0 0 0 0 0 0 0 0 0 0 762.886 0 0 1351.59 0 0 0 2051.38 0 0 0 1929.3 0 0 -2087.24 1303.06 0 0 0 0 0 0.04 0 0 0 0 0 0 0 646.611 0 0 0 1042.13 0 0 0 0 0 0 -2473.91 46.9222 0 0 0 0 
0 0 0 0 0 0 0 0 0 0 0 0 2153.92 1686.99 0 0 0 0 421.079 0 0 0 0 0 0 0 0 -1171.22 0 0 0 -1082.72 0 0.06 0 0 0 0 0 0 0 -1506.93 -1380.43 0 0 0 0 -2012.16 0 2030.63 1384.7 0 0 0 1767.1 1016.5 0 
0 -674.383 0 0 0 0 -2074.42 2498.78 0 0 0 0 0 0 -2338.71 0 0 0 0 0 0 0 0 0 1542.48 0 0 -608.921 0 0 742.286 0 0 0 0.03 0 0 0 0 0 0 0 0 0 1702.09 -1204.64 -594.577 0 0 0 0 0 0 1749.85 905.713 1627.48 0 
0 0 0 0 0 0 0 0 0 0 0 0 0 0 0 0 0 0 0 0 0 0 0 0 1078.45 0 0 0 0 0 0 0 0 0 0 0.01 0 0 -463.958 0 0 0 0 0 0 1608.71 1951.73 0 0 0 0 0 0 2327.42 0 0 0 
-152.058 0 0 0 0 0 0 0 0 0 -1586.28 0 0 0 0 0 2463.99 0 0 0 0 0 0 0 0 0 0 -1531.04 0 0 0 0 0 0 0 0 0 0 697.577 0 0 0 384.762 0 0 -1312.98 0 0 2377.16 0 0 -389.035 0 0 0 0 -56.0778 
0 0 0 0 1681.34 0 0 0 0 0 -2346.19 0 0 -941.878 0 0 0 0 0 0 0 0 0 0 0 0 0 0 2144.92 0 0 0 0 0 0 0 0 0.02 1344.42 0 1872.54 0 0 0 0 0 0 0 0 0 0 0 0 2411.04 0 0 0 
0 0 -1724.22 0 0 0 1424.83 0 0 0 0 0 0 0 0 0 0 0 0 0 0 0 -1070.82 0 0 0 544.984 0 -1416.9 0 0 0 0 0 0 638.829 1889.02 2372.89 0 0 0 0 0 0 0 0 0 103.076 0 0 0 0 0 0 0 0 0 
313.807 0 0 0 0 0 0 0 0 0 0 0 1754.74 1695.99 0 0 0 0 0 0 0 -756.02 505.158 -1251.34 760.292 0 0 0 0 0 0 0 0 0 0 0 0 0 0 0.02 955.306 0 0 0 0 0 0 0 0 0 0 0 0 0 236.137 0 0 
0 0 0 0 0 0 0 -397.58 0 0 0 0 0 0 0 0 0 0 0 2496.34 0 0 399.106 0 0 0 0 -149.922 0 0 0 0 -113.453 0 0 0 0 -1041.52 0 1746.65 0.02 0 0 0 1626.56 -806.375 0 0 141.224 0 0 0 0 0 0 0 0 
0 0 0 0 0 0 0 0 0 0 -2236.78 1822.49 0 0 953.322 0 0 0 0 0 0 0 0 0 0 2259.97 0 0 906.476 0 0 0 0 727.485 0 0 0 0 0 0 0 0.04 0 -30.5948 0 0 0 0 0 -886.486 0 0 0 212.18 0 0 0 
0 0 0 0 0 0 0 2161.85 0 0 0 0 0 0 0 0 0 0 0 0 0 1901.23 0 0 0 0 0 0 0 728.095 0 0 0 2008.96 0 0 -1484.5 0 0 0 0 0 0.09 0 0 0 0 -2378.08 0 0 0 0 0 0 0 0 0 
0 0 0 0 0 0 1536.38 0 1431.7 291.223 0 0 0 0 0 0 0 0 0 0 0 -181.356 0 0 0 0 0 0 0 0 0 0 0 0 0 0 0 0 0 0 0 2013.23 0 0.06 -1703.31 1346.55 0 0 0 0 0 0 0 79.1192 0 0 0 
0 0 1843.55 0 -2025.44 0 0 0 0 0 0 2417.14 -548.952 0 0 0 0 0 0 0 0 0 0 0 0 0 0 0 215.842 0 0 0 1479.46 0 1688.51 0 0 0 0 0 -1696.45 0 0 -226.218 0.04 0 -1391.87 0 -2083.12 0 0 0 0 0 0 0 1854.23 
0 0 0 0 344.325 0 0 0 1450.77 0 0 0 0 0 2239.37 0 0 0 1942.27 0 0 0 0 0 0 0 -238.121 0 0 1431.39 1983.32 0 0 0 -2005.29 -1185.42 -726.264 0 0 0 1941.66 0 0 -152.364 0 0 0 0 0 0 -680.792 0 0 0 0 0 0 
0 0 0 0 0 -1989.12 0 0 0 0 0 1884.44 -416.349 0 -867.412 1403.93 1516.85 0 0 0 0 0 -2121.72 0 1861.71 0 0 0 0 0 0 0 0 0 413.602 2426.76 0 0 0 0 0 0 0 0 -2363.89 0 0.09 0 0 0 0 0 0 0 0 0 0 
0 0 1331.9 0 2039.02 0 0 0 0 0 0 0 0 0 0 0 0 0 0 0 0 0 0 0 0 0 0 0 0 0 0 0 0 901.135 0 0 0 0 1846.9 0 0 0 2065.72 0 0 0 0 0.09 0 0 2186.42 0 0 -1348.23 -2404.63 0 0 
0 0 0 118.03 0 1777.93 0 0 0 0 0 0 0 0 833.537 0 0 0 1773.05 0 -895.489 0 0 0 2411.95 0 2171.62 0 0 0 0 -615.635 0 0 0 0 849.559 0 0 0 -263.756 0 0 0 -763.039 0 0 0 0.06 0 0 0 2336.57 0 0 0 0 
0 0 0 0 0 0 0 0 0 0 0 0 0 0 0 0 0 0 0 -636.845 0 0 0 0 0 0 0 0 0 0 0 0 0 444.731 0 0 0 0 0 0 0 2487.79 0 0 0 0 0 0 0 0.09 0 0 0 0 0 0 0 
0 0 0 0 0 0 0 0 -485.015 0 0 0 0 0 0 0 0 0 0 564.821 0 0 0 0 0 0 0 0 827.128 0 0 0 0 1965.01 0 0 0 0 0 0 0 0 0 0 0 -1750.16 0 1310.39 0 0 0.03 0 0 0 0 0 0 
0 0 -2445.83 0 0 0 0 1527.68 0 0 0 0 0 0 0 0 -1775.8 0 0 457.091 -95.9044 0 0 0 941.725 0 0 0 0 2230.52 0 0 -824.076 0 0 0 -853.069 0 0 0 0 0 0 0 0 0 0 0 0 0 0 0.05 0 0 1853.92 0 -460.295 
0 0 0 0 0 0 0 0 1300.16 0 0 0 0 0 0 0 -873.821 0 0 0 0 0 0 0 809.122 0 0 0 0 0 0 0 2115.16 0 0 0 0 0 0 0 0 0 0 0 0 0 0 0 1511.35 0 0 0 0.02 0 0 0 0 
0 0 -1744.82 0 0 0 0 0 0 0 0 0 0 0 0 1283.99 0 173.116 0 0 0 0 -1797.77 0 0 0 2000.41 0 0 0 0 2364.35 0 0 1990.95 298.7 0 1190.6 0 0 0 -1892.38 0 1007.8 0 0 0 -2481.38 0 0 0 0 0 0.03 0 0 0 
0 0 0 0 0 0 0 0 0 0 -1827.68 0 0 0 0 1632.36 0 0 0 0 0 0 0 0 0 0 0 0 0 0 537.66 0 0 865.123 2379.45 0 0 0 0 328.15 0 0 0 0 0 0 0 630.894 0 0 0 -1267.36 0 0 0.04 0 0 
0 0 0 0 0 0 0 -1168.02 0 0 2153.31 0 0 0 0 0 0 0 0 0 0 126.576 1839.73 0 0 0 -727.18 0 0 -1974.47 0 0 0 455.26 719.703 0 0 0 0 0 0 0 0 0 0 0 0 0 0 0 0 0 0 0 0 0.07 -507.904 
0 0 0 0 0 0 0 0 0 2203.82 0 0 0 0 0 0 1564.76 911.817 0 0 0 0 0 0 0 0 0 0 0 0 0 0 0 0 0 0 -1904.74 0 0 0 0 0 0 0 -2365.87 0 0 0 0 0 0 2466.89 0 0 0 708.258 0.07 
