*Vertices 65
*Matrix 
0.02 0 0 0 0 0 0 0 0 0 0 0 0 0 0 0 0 0 0 0 0 2110.43 0 0 0 0 0 2251.88 0 0 0 0 0 0 0 -32.7311 -434.202 0 0 0 0 1038.01 0 0 0 0 0 0 101.55 0 0 0 0 0 0 0 0 0 0 0 0 0 0 0 0 
0 0.05 -273.675 0 0 775.094 -37.1563 2041.76 0 0 0 0 0 -2136.37 0 1299.4 2065.87 0 -1270.71 0 98.1933 0 0 0 0 0 0 2080.22 -1451.23 0 0 0 103.076 0 0 0 0 620.67 0 0 0 0 -1068.07 0 0 0 0 2190.24 0 1470.46 -1871.32 0 0 0 0 0 0 0 0 0 0 803.629 0 0 1828.75 
0 1608.55 0.05 0 0 0 0 -496.765 0 -151.296 0 0 0 0 0 0 -316.553 0 0 1498.54 0 0 0 2124.93 0 0 -400.174 0 0 0 0 0 2235.25 0 0 0 0 349.971 0 0 0 0 0 0 0 0 0 414.06 0 0 0 0 0 0 0 0 0 0 0 0 -501.648 0 0 0 0 
0 0 0 0.01 0 0 0 2471.01 -1318.32 0 0 0 1700.11 1561.1 0 0 0 0 0 0 0 0 0 0 0 0 0 -407.956 0 2234.03 0 0 0 0 0 0 0 0 0 0 0 0 -482.116 -98.0407 2218.31 0 0 0 0 0 0 0 -299.768 0 0 0 0 950.27 1081.04 0 2477.26 0 0 0 0 
0 0 0 0 0.08 0 0 -1989.12 1923.05 0 -589.846 301.447 1712.93 0 0 -880.535 0 0 1433.07 0 0 0 0 0 0 731.3 0 2034.29 1236.69 0 0 1335.41 0 0 0 0 -775.399 0 0 0 -2199.09 0 0 0 0 0 0 0 0 0 2150.72 0 -1030.99 0 0 0 0 0 0 0 0 0 0 0 0 
0 -131.153 0 0 0 0.07 0 0 0 994.674 0 0 0 0 0 1966.38 0 0 -1218.38 -646.153 0 0 855.205 0 0 0 0 -3.12815 0 0 0 -195.395 -623.264 1906.72 0 0 0 0 0 1622.29 0 0 0 0 0 2168.57 0 0 0 -50.1267 0 0 0 0 0 0 0 0 -171.743 0 0 0 0 0 0 
0 -709.174 0 0 0 0 0.07 0 0 0 0 0 2448.27 0 0 0 2107.23 0 0 0 0 1382.72 0 897.168 0 0 0 0 -1292.99 0 0 1924.42 0 0 0 0 1129.26 0 0 0 0 0 0 0 201.956 884.045 0 0 0 0 0 0 0 0 0 0 0 0 0 0 0 0 0 0 0 
0 1512.73 -894.879 -357.601 533.692 0 0 0 0 0 2191.15 0 -787.606 0 0 0 0 0 1478.39 0 0 0 0 0 1361.35 0 0 0 466.399 0 0 -213.706 2026.96 1639.99 1229.21 0 0 0 0 0 0 0 0 0 0 0 869.243 0 0 0 0 0 0 0 -660.039 0 0 0 0 0 0 0 0 0 0 
0 0 0 2041.15 2406.77 0 0 0 0.01 0 0 0 711.005 -1150.17 239.799 0 0 2105.85 0 0 0 191.275 0 0 0 0 0 0 454.65 0 0 0 0 877.026 0 0 0 0 0 0 0 0 391.629 0 0 0 0 0 449.767 0 0 0 0 0 0 -1277.73 0 1947.16 0 0 0 0 0 0 -2099.6 
0 0 1677.68 0 0 2017.04 0 0 0 0.09 0 0 238.273 0 0 0 0 0 0 143.361 0 -1442.38 0 0 2066.94 0 0 0 0 1923.35 0 -75.457 0 1372.04 1622.44 0 0 0 0 0 0 0 0 0 0 0 0 0 0 0 0 0 833.537 0 0 0 0 0 0 0 -2171.62 1660.74 0 1125.9 0 
0 0 0 0 2153.61 0 0 1913.89 0 0 0.09 0 1548.59 1934.19 -1395.99 0 0 0 -330.134 1950.67 0 0 -40.6659 0 0 0 742.286 0 1288.57 0 0 0 0 0 0 0 0 0 0 0 318.69 0 434.202 0 0 0 0 0 -1781.75 0 0 0 1205.1 -1609.78 0 0 0 0 0 0 0 1581.85 0 0 0 
0 0 0 0 -860.851 0 0 0 0 0 0 0.07 0 0 0 0 0 0 0 0 0 -277.642 0 0 642.796 0 0 0 0 0 2352.6 0 0 0 0 -275.658 0 0 0 0 0 0 0 0 0 0 1194.27 0 946.76 0 0 0 0 0 0 0 1570.41 0 0 0 0 0 0 0 0 
0 0 0 133.9 2169.48 0 124.592 2053.82 -751.289 -1656.47 2419.58 0 0.09 0 -1590.85 0 0 1230.58 -340.663 -101.245 0 0 0 744.88 616.092 2444 0 0 959.273 0 0 0 -1069.6 -2491.76 2154.23 0 0 1711.4 0 0 0 374.081 0 0 0 0 0 0 0 0 0 0 0 0 2477.72 0 0 0 0 0 0 0 -527.741 0 541.169 
0 700.476 0 813.7 0 0 0 0 -709.937 0 -500.122 0 0 0.07 -897.473 0 0 1157.34 2060.99 2194.97 0 2395.32 0 -1292.38 0 -23.7281 0 0 0 2496.64 1965.77 0 0 -1119.04 0 0 0 0 -1240.2 0 0 0 0 0 0 0 0 0 0 0 0 0 0 0 -1319.09 1245.99 0 0 0 0 0 0 0 0 0 
0 0 0 0 0 0 0 0 1015.43 0 457.091 0 2308.65 1936.48 0.06 0 0 -646.611 0 0 0 0 0 -559.633 -121.235 0 154.195 0 0 0 425.047 2154.84 -1098.74 -2025.13 0 0 0 0 0 0 -1315.58 0 0 0 0 588.473 0 -431.761 0 -1498.84 0 0 1983.17 1933.73 0 0 2331.84 0 0 0 0 -1407.9 -347.53 1630.53 0 
0 2314.91 0 0 -640.202 -1892.83 0 0 0 0 0 0 0 0 0 0 0 0 0 0 2346.03 0 0 0 0 0 0 0 0 0 1739.02 0 1443.91 0 -286.798 0 0 2454.99 0 0 0 0 0 0 0 0 0 0 0 0 0 0 0 0 0 0 0 0 0 0 0 0 0 0 691.778 
0 2138.05 126.728 0 0 0 1852.4 0 0 0 0 0 0 0 0 0 0.03 0 787.149 0 0 0 -613.193 0 0 0 2108.45 0 -1738.11 1415.98 0 0 1998.89 0 0 0 0 0 0 0 0 -784.707 0 0 0 0 0 0 0 0 0 0 0 0 0 -2082.81 0 0 0 0 0 0 0 0 0 
0 0 0 0 0 0 0 0 -2087.24 0 0 0 541.475 2287.29 2409.82 0 0 0.02 0 0 0 -2142.78 0 0 0 0 0 374.996 0 0 0 0 232.78 0 0 0 0 0 0 0 0 747.932 0 743.202 0 0 0 0 0 0 1854.38 0 0 0 -1972.18 0 0 0 0 0 0 0 -944.319 0 0 
0 1531.19 0 0 -1372.49 876.568 0 2071.83 0 0 431.608 0 -1381.8 1858.81 0 0 -179.525 0 0.08 -1176.26 1687.6 0 0 1040.45 0 2219.23 0 -58.8244 0 838.572 0 0 0 0 0 0 0 0 0 0 0 0 0 0 0 0 0 0 0 1117.51 2355.19 0 0 -768.532 0 0 0 0 -1173.21 0 0 0 0 0 0 
0 0 141.224 0 0 699.103 0 0 0 1472.44 -442.9 0 1582.46 1797.62 0 0 0 0 -668.737 0.05 0 732.063 0 2280.42 0 0 0 1842.63 0 0 0 539.338 0 0 2016.43 0 0 0 0 0 0 0 0 0 0 0 -1522.95 0 -1291.92 0 0 0 0 0 0 0 0 0 0 0 0 0 0 0 0 
0 772.5 0 0 0 0 0 0 0 0 0 0 0 0 0 -616.703 0 0 -683.538 0 0.02 0 607.089 -1295.13 1515.17 319.758 -1167.56 0 -852 -129.933 922.803 -111.469 0 2130.42 0 0 0 0 0 -1124.53 0 0 1677.98 0 0 1327.33 0 0 0 0 0 0 0 -63.097 0 0 0 0 0 0 2499.54 0 0 0 0 
-1617.86 0 0 0 0 0 -1691.56 0 -918.531 166.25 0 863.75 0 832.926 0 0 0 2017.96 0 1952.35 0 0.01 -987.198 1776.56 1350.37 0 0 0 -1798.07 0 2156.67 0 2135.3 0 0 0 0 0 0 0 0 0 931.806 0 0 0 0 0 -893.811 0 901.898 0 0 0 0 0 0 1496.25 0 0 0 0 0 0 -462.737 
0 0 0 0 0 1555.45 0 0 0 0 -75.1518 0 0 0 0 0 1349.6 0 0 0 1582.46 273.064 0.03 0 1548.13 0 0 -2040.09 2158.65 0 0 -1255 0 0 0 0 0 0 -1166.8 0 0 0 0 0 -792.337 0 0 0 0 -1826 0 0 0 0 0 161.672 0 0 555.513 0 0 1196.4 -688.726 0 889.081 
0 0 790.811 0 0 0 1672.03 0 0 0 0 0 -330.287 1405.15 1003.68 0 0 0 -2396.69 1214.87 264.977 1756.26 0 0.07 1654.33 0 207.297 0 0 0 0 0 0 0 0 0 0 0 -831.706 0 0 1218.07 0 0 -626.774 0 0 0 0 1085.16 0 -2041.92 0 0 0 0 0 1790.29 0 0 0 0 0 -1186.18 0 
0 0 0 0 0 0 0 2244.1 0 -976.821 0 -1465.42 -988.723 0 802.408 0 0 0 0 0 1488.16 -644.475 2003.92 921.583 0.02 0 1140.86 0 1853.16 0 0 0 0 0 -77.4407 0 0 0 0 -1244.47 0 0 0 1814.71 -1390.8 0 0 0 0 0 0 0 0 -2006.36 0 0 0 0 0 2087.69 0 0 0 0 0 
0 0 0 0 -143.208 0 0 0 0 0 0 0 -2429.96 1509.22 0 0 0 0 -1146.81 0 1316.64 0 0 0 0 0.03 2123.25 0 0 0 0 -353.175 0 0 0 0 0 -735.725 0 0 0 0 0 0 0 0 0 0 2270.35 0 0 0 0 0 0 0 0 336.085 0 0 2423.09 0 0 0 0 
0 0 1333.28 0 0 0 0 0 0 0 903.272 0 0 0 -111.316 0 1860.94 0 0 0 0.686666 0 0 -1165.58 2295.68 -875.805 0.09 1060.44 2072.89 0 0 0 0 589.846 0 0 0 0 0 0 0 0 0 0 0 0 0 0 0 0 0 0 0 0 0 0 0 0 0 0 0 0 0 0 0 
1914.96 605.106 0 1550.11 1467.1 -264.824 0 0 0 0 0 0 0 0 0 0 0 1590.4 -2344.36 -106.586 0 0 453.734 0 0 0 -530.793 0.08 0 0 0 0 0 0 0 0 0 0 0 0 0 0 0 0 59.1296 0 0 0 0 0 0 0 0 0 0 0 -1584.29 720.008 0 0 0 0 0 0 -285.577 
0 2258.14 0 0 246.818 0 -1171.99 827.891 -2020.71 0 1789.38 0 1910.08 0 0 0 1262.78 0 0 0 2348.17 -1161.31 40.8185 0 -1712.78 0 382.626 0 0.01 2005.6 0 0 1717.66 0 2241.51 1130.18 0 0 0 0 0 -498.596 0 0 0 0 0 2200.61 0 1523.41 0 0 0 0 0 0 0 0 0 1927.78 0 0 0 1638.77 0 
0 0 0 982.009 0 0 0 0 0 458.77 0 0 0 -1630.99 0 0 -2214.35 0 -265.587 0 2142.48 0 0 0 0 0 0 0 1042.44 0.01 0 2467.8 0 2071.98 0 0 0 0 1992.78 -1815.32 0 0 0 0 0 0 0 0 0 0 0 0 0 0 0 0 0 0 0 0 0 0 0 0 0 
0 0 0 0 0 0 0 0 0 0 0 5.26444 0 2167.35 1236.99 952.864 0 0 0 0 2382.35 -1986.22 0 0 0 0 0 0 0 0 0.03 0 1393.7 -721.381 0 0 0 1294.52 0 0 0 0 0 -937.605 0 0 0 0 0 0 0 0 0 -2198.78 0 0 0 0 0 0 0 0 -2024.37 0 0 
0 0 0 0 -2007.43 -1007.64 2432.71 1304.28 0 1687.6 0 0 0 0 1210.75 0 0 0 0 2431.33 -1450.77 0 2139.88 0 0 179.983 0 0 0 245.14 0 0 -1869.64 0 0 1647.47 0 0 0 0 0 0 0 0 0 -2056.11 0 -1323.97 0 0 0 -199.667 0 0 0 0 0 0 0 0 1569.19 0 0 0 0 
0 -722.297 1240.65 0 0 -4.80667 0 2393.64 0 0 0 0 107.349 0 -114.978 -1372.8 2193.75 2366.94 0 0 0 -57.4511 0 0 0 0 0 0 -376.37 0 -386.135 2432.25 0.06 0 0 0 451.292 0 -48.6007 0 0 0 0 0 -2185.81 808.206 0 0 0 0 0 213.401 0 0 0 0 0 1205.71 0 0 0 1279.87 0 0 0 
0 0 0 0 0 117.42 0 -1907.79 -2074.57 1909.31 0 0 1437.5 2045.27 -904.187 0 0 0 0 0 -319.91 0 0 0 0 0 1445.59 0 0 -12.7415 1959.52 0 0 0 1864.3 0 0 0 0 0 0 0 0 -173.727 0 -2253.72 0 0 -523.316 0 0 0 0 0 2287.44 0 0 0 -1831.03 0 0 0 0 0 1478.85 
0 0 0 0 0 0 0 -1910.69 0 1749.24 0 0 1665.78 0 0 436.644 0 0 0 1796.24 0 0 0 0 675.451 0 0 0 1302.15 0 0 0 0 -2119.43 0.07 0 569.704 0 0 0 0 0 0 0 0 0 0 0 0 0 0 0 0 0 0 0 0 0 -539.491 0 0 0 0 0 0 
1529.36 0 0 0 0 0 0 0 0 0 0 -609.989 0 0 0 0 0 0 0 0 0 0 0 0 0 0 0 0 1869.33 0 0 -240.257 0 0 0 0 0 0 0 0 0 0 0 0 0 0 0 0 0 0 0 0 0 0 -754.799 0 0 0 0 0 0 -1105.91 0 0 0 
527.589 0 0 0 2480.47 0 -127.796 0 0 0 0 0 0 0 0 0 0 0 0 0 0 0 0 0 0 0 0 0 0 0 0 0 2270.04 0 2161.85 0 0.09 0 0 0 0 0 0 0 0 0 0 0 998.947 0 0 0 0 0 2471.31 0 0 0 0 0 0 0 -2134.08 0 0 
0 2178.64 1742.68 0 0 0 0 0 0 0 0 0 787.301 0 0 -484.558 0 0 0 0 0 0 0 0 0 514.466 0 0 0 0 530.335 0 0 0 0 0 0 0.06 270.165 0 0 0 0 0 0 0 0 0 0 0 0 636.387 0 0 934.858 103.534 0 0 0 491.882 0 0 0 -111.316 0 
0 0 0 0 0 0 0 0 0 0 0 0 0 -735.267 0 0 0 0 0 0 0 0 1940.14 -249.413 0 0 0 0 0 274.59 0 0 -928.449 0 0 0 0 1066.55 0.02 0 0 0 0 0 0 0 0 1015.58 0 0 0 0 0 0 0 0 0 0 0 0 -475.555 0 0 0 0 
0 0 0 0 0 1930.83 0 0 0 0 0 0 0 0 0 0 0 0 0 0 1582.77 0 0 0 1863.08 0 0 0 0 -2450.41 0 0 0 0 0 0 0 0 0 0.04 0 0 865.429 0 0 0 -110.858 0 0 0 0 0 0 0 0 1900.46 0 0 0 0 0 0 0 0 0 
0 0 0 0 1392.03 0 0 0 0 0 2196.8 0 0 0 866.039 0 0 0 0 0 0 0 0 0 0 0 0 0 0 0 0 0 0 0 0 0 0 0 0 0 0.06 0 0 0 0 1671.58 0 0 0 2093.04 0 -2149.19 0 661.26 0 0 0 0 0 0 0 0 0 0 0 
1005.2 0 0 0 0 0 0 0 0 0 0 0 2471.62 0 0 0 -2284.69 1489.23 0 0 0 0 0 -562.838 0 0 0 0 1731.7 0 0 0 0 0 0 0 0 0 0 0 0 0 0 0 1165.12 0 0 0 0 0 0 0 0 0 0 0 0 0 -519.044 0 0 0 0 0 2142.32 
0 1785.41 0 1011.46 0 0 0 0 2221.52 0 -2397.92 0 0 0 0 0 0 0 0 0 1537.6 1752.3 0 0 0 0 0 0 0 0 0 0 0 0 0 0 0 0 0 2403.41 0 0 0.06 0 0 0 -2130.12 0 0 0 0 0 0 0 0 0 -887.555 1445.43 0 0 0 0 -1870.86 0 2363.89 
0 0 0 -551.851 0 0 0 0 0 0 0 0 0 0 0 0 0 2334.74 0 0 0 0 0 0 447.783 0 0 0 0 0 -49.2111 0 0 1485.11 0 0 0 0 0 0 0 0 0 0.08 0 0 0 0 0 0 0 0 0 1871.93 0 0 0 0 0 0 -1990.04 0 755.867 0 0 
0 0 0 1590.85 0 0 -1146.96 0 0 0 0 0 0 0 0 0 0 0 0 0 0 0 1985.31 1359.07 2387.23 0 0 1778.7 0 0 0 0 -779.672 0 0 0 0 0 0 0 0 -610.904 0 0 0.02 0 0 0 0 0 0 0 0 0 0 0 2233.73 0 0 0 0 0 0 0 0 
0 0 0 0 0 -284.509 -113.758 0 0 0 0 0 0 0 584.658 0 0 0 0 0 1452.91 0 0 0 0 0 0 0 0 0 0 -733.131 -33.0363 -649.358 0 0 0 0 0 0 1059.83 0 0 0 0 0.07 0 0 0 0 0 0 -244.835 0 0 0 0 0 0 394.223 0 0 0 0 0 
0 0 0 0 0 0 0 1711.4 0 0 0 1298.79 0 0 0 0 0 0 0 117.42 0 0 0 0 0 0 0 0 0 0 0 0 0 0 0 0 0 0 0 -1352.5 0 0 783.944 0 0 0 0.08 0 0 0 -897.931 0 0 0 0 0 0 0 0 0 0 0 0 0 0 
0 1259.73 346.767 0 0 0 0 0 0 0 0 0 0 0 -1218.38 0 0 0 0 0 0 0 0 0 0 0 0 0 2332.45 0 0 1878.03 0 0 0 0 0 0 2350.76 0 0 0 0 0 0 0 0 0.05 0 0 0 0 0 0 0 0 0 0 0 0 0 -694.22 -1657.69 0 0 
1416.75 0 0 0 0 0 0 0 2297.81 0 1992.93 970.565 0 0 0 0 0 0 0 -633.793 0 -630.436 0 0 0 2077.01 0 0 0 0 0 0 0 -2462.61 0 0 -2096.85 0 0 0 0 0 0 0 0 0 0 0 0.04 0 0 0 1989.43 0 0 0 0 0 0 0 0 0 0 0 0 
0 712.836 0 0 0 144.429 0 0 0 0 0 0 0 0 1139.03 0 0 0 -2449.8 0 0 0 391.018 1758.4 0 0 0 0 -17.6244 0 0 0 0 0 0 0 0 0 0 0 912.427 0 0 0 0 0 0 0 0 0.02 0 0 0 0 0 0 0 0 0 0 -1842.17 0 0 0 0 
0 -889.081 0 0 2426.3 0 0 0 0 0 0 0 0 0 0 0 0 1217.31 1917.4 0 0 1846.9 0 0 0 0 0 0 0 0 0 0 0 0 0 0 0 0 0 0 0 0 0 0 0 0 -485.168 0 0 0 0.03 0 -622.044 0 0 0 0 0 0 0 0 0 0 0 0 
0 0 0 0 0 0 0 0 0 0 0 0 0 0 0 0 0 0 0 0 0 0 0 -1071.28 0 0 0 0 0 0 0 730.232 376.675 0 0 0 0 -460.906 0 0 614.261 0 0 0 0 0 0 0 0 0 0 0.06 0 0 0 0 0 0 0 0 0 0 0 0 0 
0 0 0 853.984 923.566 0 0 0 0 2025.44 -2095.78 0 0 0 2011.55 0 0 0 0 0 0 0 0 0 0 0 0 0 0 0 0 0 0 0 0 0 0 0 0 0 0 0 0 0 0 453.276 0 0 -1034.5 0 -208.213 0 0.04 0 0 0 0 0 0 -1164.36 0 0 0 -284.967 0 
0 0 0 0 0 0 0 0 0 0 2013.69 0 0 0 -1876.05 0 0 0 1941.97 0 2353.05 0 0 0 613.956 0 0 0 0 0 -1132.31 0 0 0 0 0 0 0 0 0 1605.66 0 0 -673.772 0 0 0 0 0 0 0 0 0 0.04 0 0 -2288.96 0 0 1078.75 0 0 0 0 0 
0 0 0 0 0 0 0 797.22 0 0 0 0 -499.969 1363.8 0 0 0 2359.61 0 0 0 0 0 0 0 0 0 0 0 0 0 0 0 -1824.32 0 1581.55 1562.17 -470.519 0 0 0 0 0 0 0 0 0 0 0 0 0 0 0 0 0.07 0 0 0 0 0 0 0 0 1092.49 1168.78 
0 0 0 0 0 0 0 0 1948.38 0 0 0 0 133.29 0 0 -852 0 0 0 0 0 401.7 0 0 0 0 0 0 0 0 0 0 0 0 0 0 764.87 0 -647.221 0 0 0 0 0 0 0 0 0 0 0 0 0 0 0 0.04 0 1557.13 0 0 0 0 0 0 0 
0 0 0 0 0 0 0 0 0 0 0 -1283.07 0 0 1997.36 0 0 0 0 0 0 0 0 0 0 0 0 63.5548 0 0 0 0 0 0 0 0 0 0 0 0 0 0 2497.56 0 -899.915 0 0 0 0 0 0 0 0 -1754.43 0 0 0.04 0 0 0 0 0 0 0 0 
0 0 0 -111.469 0 0 0 0 1253.47 0 0 0 0 0 0 0 0 0 0 0 0 777.535 0 -206.229 0 -1790.75 0 -1353.27 0 0 0 0 1184.65 0 0 0 0 0 0 0 0 0 -777.23 0 0 0 0 0 0 0 0 0 0 0 0 2033.83 0 0.04 0 0 -427.183 0 0 0 0 
0 0 0 1635.11 0 1267.66 0 0 0 0 0 0 0 0 0 0 0 0 -1793.34 0 0 0 2328.18 0 0 0 0 0 0 0 0 0 0 2455.6 -1524.48 0 0 0 0 0 0 -1265.98 0 0 0 0 0 0 0 0 0 0 0 0 0 0 0 0 0.07 0 0 0 0 0 0 
0 0 0 0 0 0 0 0 0 0 0 0 0 0 0 0 0 0 0 0 0 0 0 0 -1049.76 0 0 0 1632.05 0 0 0 0 0 0 0 0 284.509 0 0 0 0 0 0 0 -101.398 0 0 0 0 0 0 2289.27 2271.26 0 0 0 0 0 0.08 0 2308.65 -2288.51 0 0 
0 0 1095.23 458.922 0 0 0 0 0 2104.02 0 0 0 0 0 0 0 0 0 0 2171.77 0 0 0 0 873.211 0 0 0 0 0 2252.04 0 0 0 0 0 0 -1523.1 0 0 0 0 2446.9 0 0 0 0 0 494.629 0 0 0 0 0 0 0 976.516 0 0 0.06 0 0 -1357.69 0 
0 358.364 0 0 0 0 0 0 0 1710.49 703.833 0 0 0 2222.43 0 0 0 0 0 0 0 253.075 0 0 0 0 0 0 0 0 0 -2133.47 0 0 950.117 0 0 0 0 0 0 0 0 0 0 0 320.215 0 0 0 0 0 0 0 0 0 0 0 -2091.97 0 0.07 0 0 0 
0 0 0 0 0 0 0 0 0 0 0 0 2293.69 0 -803.018 0 0 -1625.34 0 0 0 0 -185.476 0 0 0 0 0 0 0 1285.52 0 0 0 0 0 -1000.78 0 0 0 0 0 1526.31 117.573 0 0 0 2240.59 0 0 0 0 0 0 0 0 0 0 0 732.063 0 0 0.05 0 0 
0 0 0 0 0 0 0 0 0 -2432.55 0 0 0 0 2046.04 0 0 0 0 0 0 0 0 -236.747 0 0 0 0 -2291.41 0 0 0 0 0 0 0 0 -1601.54 0 0 0 0 0 0 0 0 0 0 0 0 0 0 2343.29 0 1195.03 0 0 0 0 0 436.338 0 0 0.03 0 
0 32.2733 0 0 0 0 0 0 -849.559 0 0 0 1593.6 0 0 1986.98 0 0 0 0 0 101.703 774.483 0 0 0 0 1339.99 0 0 0 0 0 2293.24 0 0 0 0 0 0 0 1974.93 825.297 0 0 0 0 0 0 0 0 0 0 0 -2229.61 0 0 0 0 0 0 0 0 0 0 
