*Vertices 57
*Matrix 
0.08 1831.49 1491.06 1596.35 0 0 0 0 0 0 227.744 0 897.015 0 0 0 1475.04 0 0 0 0 0 0 0 0 0 0 0 1185.11 -852.611 0 -1765.72 0 0 1169.39 0 0 1791.82 0 24.4911 0 0 -1314.81 0 0 0 0 0 0 0 0 0 0 0 0 0 0 
344.63 0.09 0 0 0 0 0 0 0 0 1434.14 0 543.458 -2233.57 0 0 201.498 0 0 0 0 -815.073 0 0 0 0 0 0 2202.75 0 -1252.71 0 0 0 0 0 0 0 159.993 -1525.09 0 -1229.06 2039.78 0 0 2120.04 -988.571 120.014 2062.21 0 0 0 0 -1823.4 1421.48 0 0 
-266.655 0 0.09 -873.211 0 0 -2107.07 0 -911.664 894.421 0 0 0 2394.56 0 0 0 0 0 0 0 -2105.85 0 0 0 1391.72 0 0 0 0 0 0 0 0 0 0 0 0 1072.34 0 1721.17 0 -616.092 1730.78 -1332.36 0 2313.68 1502.96 0 896.71 0 0 0 0 0 0 0 
2239.98 0 1881.08 0.05 0 0 0 0 1306.27 0 0 -1939.38 0 0 1045.49 0 0 -1652.5 0 0 0 0 0 1783.88 -575.198 -770.516 0 1989.58 -1226.62 0 1748.48 0 0 0 0 0 0 0 -521.638 0 2408.14 0 0 1871.78 129.17 0 0 0 -988.266 1893.9 2288.51 0 0 0 767.617 0 0 
0 0 0 0 0.08 0 0 1313.9 0 0 0 0 2346.64 0 0 0 -813.089 2043.9 0 0 426.725 0 1739.78 0 0 1603.98 0 1834.85 0 0 0 2189.02 0 0 0 0 0 -1550.26 -1799.14 0 0 0 0 2064.96 0 0 -1253.32 0 2317.5 466.399 -1213.49 0 0 0 0 0 0 
0 0 0 0 0 0.06 0 0 -1254.84 0 -1337.7 2063.13 0 0 0 -1265.22 1554.69 0 0 0 0 -1068.38 0 1974.32 0 0 0 0 0 0 0 0 -2380.67 -271.844 0 0 1408.51 625.553 -291.833 0 0 0 0 903.424 0 -140.004 995.438 168.233 1789.38 0 2073.05 0 0 0 0 0 0 
0 0 -326.624 0 0 0 0 812.174 0 0 0 0 0 0 -1041.06 0 1212.73 0 2291.71 0 1814.71 -1307.79 0 0 2216.94 -679.418 0 1955.24 0 0 0 0 0 0 0 -1946.09 -2300.1 0 1479.77 0 0 -940.352 0 0 0 -1268.43 485.626 565.127 0 1864.6 -1411.71 0 0 0 0 0 0 
0 0 0 0 2335.81 0 2463.84 0.09 9.07926 0 0 0 0 0 0 0 0 0 0 0 0 0 842.235 0 0 1996.6 0 0 0 0 -333.796 0 0 0 0 1399.66 875.195 -2080.37 0 0 0 0 0 0 0 0 0 -1823.86 0 0 0 0 0 0 0 0 1688.36 
0 0 -2315.06 2207.48 0 1132.47 0 -676.366 0.07 0 0 0 0 0 0 0 0 186.544 0 0 0 0 0 0 -2192.98 0 139.241 -131.764 903.119 2285.45 0 0 0 0 0 0 0 0 0 0 0 0 2338.25 0 0 0 0 -798.898 -472.045 0 672.399 0 0 0 0 0 0 
0 0 1002.46 0 0 0 0 0 0 0.01 0 0 0 -2263.63 -597.781 0 0 0 0 0 2055.19 0 0 0 0 0 0 0 0 1876.05 0 0 0 0 -716.956 0 0 0 0 0 -1694.16 0 1959.21 0 0 0 0 0 0 -249.565 0 0 0 0 2216.79 0 0 
1838.97 -1042.28 0 0 0 763.649 0 0 0 0 0.06 2192.07 0 1143.76 0 0 0 0 0 1511.05 0 -1813.33 0 973.922 2376.55 0 15.3356 0 0 0 0 0 818.43 1742.68 0 577.029 -996.811 -1632.36 0 -160.604 0 0 0 0 0 0 0 0 1955.85 0 0 0 0 0 0 -1192.13 0 
0 0 0 -475.402 0 1837.14 0 0 0 0 -958.815 0.08 1680.88 0 0 0 0 0 0 0 0 0 0 0 0 51.5 0 0 1825.39 0 0 2477.57 0 0 0 0 2160.63 0 0 0 0 0 0 0 371.944 0 0 0 -1931.59 0 0 0 -2445.68 0 0 0 0 
861.614 1330.23 0 0 -921.583 0 0 0 0 0 0 1559.42 0.05 0 1457.18 1525.09 0 0 1087.3 0 0 0 0 0 0 0 0 0 0 2050 0 0 0 0 0 0 0 0 0 1607.18 0 0 0 0 695.288 0 0 0 0 0 1821.73 997.574 0 -1832.1 0 0 0 
0 920.362 1558.35 0 0 0 0 0 0 -1564.3 -1660.28 0 0 0.08 0 -1769.69 0 0 0 0 405.362 0 2302.24 0 -705.512 -298.853 0 1655.86 353.786 0 0 2285.45 0 0 0 0 0 0 506.226 0 1078.3 2384.03 206.381 -109.943 0 0 0 146.107 -1469.24 0 0 0 0 0 0 -52.1104 0 
0 0 0 2068.01 0 0 1601.23 0 0 1501.43 0 0 -2371.06 0 0.06 0 -1571.78 0 0 -1901.23 0 0 0 641.575 0 0 0 -2463.68 1710.33 0 0 0 418.79 1946.7 0 0 0 744.118 0 0 751.595 0 -714.667 0 0 0 1483.12 0 2473.75 103.534 -2113.18 0 0 0 0 0 0 
0 0 0 0 0 -1596.19 0 0 0 0 0 0 1850.26 2249.44 0 0.01 -902.356 0 0 0 0 597.781 0 0 0 0 0 0 271.691 990.402 0 1165.43 0 0 0 0 1304.9 1838.97 410.245 146.87 0 0 -1114.92 0 0 2027.57 0 0 0 0 -420.316 32.5785 0 0 0 0 0 
1880.17 1852.7 0 0 2053.82 2422.18 -1692.94 0 0 0 0 0 0 0 2413.94 394.681 0.04 0 0 2265.77 683.691 0 -1687.29 0 0 -14.2674 0 0 0 0 0 0 0 0 0 1688.21 0 0 0 0 0 -1996.44 0 0 0 0 -779.061 0 0 894.879 0 0 0 -1596.19 -809.427 0 0 
0 0 0 389.34 1340.6 0 0 0 -775.704 0 0 0 0 0 0 0 0 0.06 0 0 302.057 0 0 1779.61 0 0 0 750.526 0 1528.9 0 0 0 -1909.31 0 0 0 0 0 0 0 0 0 0 0 1488.16 778.298 0 -853.526 0 0 0 0 0 0 0 0 
0 0 0 0 0 0 2461.85 0 0 0 0 0 -2160.02 0 0 0 0 0 0.05 -1984.08 0 0 0 0 0 0 0 171.438 1408.96 0 0 1595.13 769.906 0 0 0 0 0 0 -1101.03 -742.134 0 0 0 1472.9 0 0 0 0 0 0 0 0 0 0 0 0 
0 0 0 0 0 0 0 0 0 0 2308.04 0 0 0 -528.352 0 1079.67 0 292.596 0.04 0 -1618.32 0 592.441 0 945.082 0 0 0 0 0 0 -295.495 1247.83 -398.953 0 0 0 0 -787.759 2197.56 0 0 0 562.075 685.522 0 0 0 0 0 0 0 0 0 0 0 
0 0 0 0 166.707 0 680.486 0 0 2415.92 0 0 0 488.22 0 0 1192.74 1871.93 0 0 0.01 0 0 186.392 0 1580.17 0 0 2194.81 0 0 0 -483.337 0 0 1051.59 0 -1400.72 0 0 0 0 0 0 0 0 0 2467.5 0 0 0 0 0 0 0 1239.28 0 
0 842.54 -520.569 0 0 -2253.56 2147.05 0 0 0 1271.78 0 0 0 0 1499.15 0 0 0 -2489.01 0 0.07 0 0 0 1614.2 0 0 -521.485 0 2039.17 27.8481 -334.864 1970.81 0 -998.032 0 -408.719 -509.583 0 0 0 0 0 0 2247 0 251.396 -1122.24 953.475 0 0 0 0 0 0 0 
0 0 0 0 -944.319 0 0 2029.71 0 0 0 0 0 687.658 0 0 998.337 0 0 0 0 0 0.09 2209.16 -2250.66 -747.475 0 -958.51 0 -1834.09 0 1188.16 0 2254.48 0 0 0 -84.3074 0 0 0 0 0 1499.6 0 0 -67.0644 0 -392.544 -866.497 -451.75 1721.93 0 0 0 0 0 
0 0 0 1558.5 0 -694.22 0 0 0 0 -1180.23 0 0 0 36.8511 0 0 1093.71 0 261.773 -1862.32 0 -1118.58 0.02 0 0 0 1478.85 0 0 0 0 0 1209.37 0 0 1358.61 0 0 0 0 0 0 -215.842 -818.125 0 -181.967 0 1446.04 0 0 0 0 0 0 0 0 
0 0 0 1796.7 0 0 2274.77 0 1992.78 0 2043.9 0 0 -353.786 0 0 0 0 0 0 0 0 -1619.39 0 0.04 0 0 0 0 0 0 61.2659 0 1093.1 1009.17 1506.62 0 0 0 0 0 0 0 0 0 -1898.63 1788.16 0 0 0 0 0 0 1230.74 0 0 -2418.21 
0 0 1168.32 -1329.77 -30.137 0 -1656.01 329.981 0 0 0 1826.15 0 1136.59 0 0 1629.31 0 0 2418.97 -2201.07 -2386.01 1653.72 0 0 0.04 0 0 334.101 0 0 0 0 0 -1385.77 0 -440.764 0 0 0 0 1295.89 0 0 1305.96 0 0 0 1640.9 0 0 2427.67 0 0 0 0 0 
0 0 0 0 0 0 0 0 2329.55 0 -1765.57 0 0 0 0 0 0 0 0 0 0 0 0 0 0 0 0.09 0 0 0 -1333.74 0 1872.23 0 0 0 0 0 0 1237.45 1345.48 0 0 0 -1110.95 0 0 0 0 1860.48 0 0 0 0 0 0 0 
0 0 0 -209.738 -388.73 0 1134.91 0 1281.4 0 0 0 0 2085.1 391.171 0 0 395.749 -1890.09 0 0 0 1174.43 -847.27 0 0 0 0.09 -1767.1 0 0 0 0 0 0 0 0 0 0 1744.36 1825.69 0 0 0 0 0 0 0 -13.8096 0 0 0 0 0 0 0 0 
1488.62 -2251.12 0 -566.805 0 0 0 0 -1830.42 0 0 -1017.26 0 1418.73 2232.2 -1348.54 0 0 270.165 0 -1722.54 1652.04 0 0 0 1395.84 0 1916.94 0.09 0 0 0 0 0 0 0 -2356.56 1107.59 0 0 0 0 0 0 0 0 0 0 2368.47 -451.75 0 0 0 0 0 0 0 
-397.275 0 0 0 0 0 0 0 2297.36 -2341.91 0 0 -1457.95 0 0 -559.481 0 -396.817 0 0 0 0 -30.4422 0 0 0 0 0 0 0.07 0 0 0 0 0 0 0 1817 0 2321.16 0 0 0 1599.4 0 0 0 -609.836 0 0 0 0 1968.52 0 0 0 0 
0 1403.93 0 2126.76 0 0 0 705.512 0 0 0 0 0 0 0 0 0 0 0 0 0 2212.82 0 0 0 0 541.169 0 0 0 0.07 2214.5 0 1344.42 0 0 0 0 0 0 368.892 -90.7163 2097.77 0 0 0 0 0 0 0 0 0 0 0 0 0 0 
2048.17 0 0 0 -1856.67 0 0 0 0 0 0 2059.16 0 -130.238 0 -1554.08 0 0 -494.476 0 0 46.1592 1517.61 0 -31.2052 0 0 0 0 0 1584.44 0.01 0 857.952 0 0 0 0 0 0 -1526.15 0 0 0 0 83.2392 1681.19 0 0 0 0 0 -384.915 -1386.84 0 0 -333.338 
0 0 0 0 0 488.067 0 0 0 0 908.765 0 0 0 -1179.77 0 0 0 1701.33 -190.512 -2447.36 -486.847 0 0 0 0 -384.152 0 0 0 0 0 0.07 1536.84 -948.592 0 0 0 2154.68 0 0 0 0 0 0 693.762 655.004 0 0 0 0 0 0 0 0 0 0 
0 0 0 0 0 -669.195 0 0 0 0 2028.34 0 0 0 -949.355 0 0 -1693.7 0 -217.063 0 1583.07 325.556 330.897 1977.37 0 0 0 0 0 -529.572 -900.067 -2039.48 0.04 0 0 0 0 0 1767.56 0 0 0 0 0 0 0 -1264 0 0 0 0 0 0 0 0 0 
508.515 0 0 0 0 0 0 0 0 1146.5 0 0 0 0 0 0 0 0 0 1918.32 0 0 0 0 69.6585 147.481 0 0 0 0 0 0 1806.16 0 0.04 0 0 0 1750.01 0 -584.353 0 1531.8 0 -1491.52 0 0 0 0 0 0 0 0 0 0 0 0 
0 0 0 0 0 0 2330.93 1007.49 0 0 1856.52 0 0 0 0 0 -1436.89 0 0 0 1665.32 183.798 0 0 2012.16 0 0 0 0 0 0 0 0 0 0 0.01 0 0 102.771 2281.18 0 0 0 0 525.605 0 0 0 0 -1965.16 0 0 0 0 0 0 0 
0 0 0 0 0 686.132 2346.8 894.726 0 0 -171.133 -1630.99 0 0 0 469.298 0 0 0 0 0 0 0 136.036 0 -2388.45 0 0 -706.275 0 0 0 0 0 0 0 0.03 1406.22 0 0 0 569.552 0 0 0 0 0 0 0 0 0 837.352 0 0 0 0 0 
-1086.69 0 0 0 1305.81 2069.23 0 -1976.3 0 0 130.543 0 0 0 980.941 2141.56 0 0 0 0 1187.4 2315.67 -1017.26 0 0 0 0 0 1339.38 645.695 0 0 0 0 0 0 1732 0.03 0 1169.7 0 0 0 0 0 -50.4318 0 0 0 1227.23 1585.21 0 0 0 -2495.12 0 0 
0 -1195.03 -562.38 1268.58 1306.57 1700.72 -1716.9 0 0 0 0 0 0 651.646 0 2043.6 0 0 0 0 0 1762.52 0 0 0 0 0 0 0 0 0 0 773.873 0 -91.0215 -426.42 0 0 0.02 0 0 0 0 0 -295.343 0 2008.19 -1038.47 0 0 1706.52 0 0 -864.055 0 0 0 
-229.728 -177.084 0 0 0 0 0 0 0 0 -371.029 0 -1049.15 0 0 -526.673 0 0 2483.52 -2420.96 0 0 0 0 0 0 974.075 -730.232 0 2326.5 0 0 0 1628.85 0 -1337.86 0 -2177.27 0 0.01 0 0 224.845 0 0 2308.65 0 1885.05 0 0 916.395 2355.49 0 0 0 0 0 
0 0 -1876.81 1545.08 0 0 0 0 0 2045.27 0 0 0 65.8437 1598.33 0 0 0 1405.76 -897.168 0 0 0 0 0 0 2126 983.078 0 0 613.346 1141.16 0 0 -1473.05 0 0 0 0 0 0.06 0 1592.99 0 -1879.25 0 0 0 0 0 0 0 0 0 0 0 0 
0 1852.4 0 0 0 0 2424.16 0 0 0 0 0 0 1602.91 0 0 2473.6 0 0 0 0 0 0 0 0 1041.52 0 0 0 0 1117.21 0 0 0 0 0 -2284.54 0 0 0 0 0 -1131.24 542.085 0 -878.857 -1248.59 0 -739.998 316.553 -366.604 0 0 0 0 0 0 
-530.183 118.488 -464.568 0 0 0 0 0 2419.74 1314.2 0 0 0 2381.13 1623.81 175.863 0 0 0 0 0 0 0 0 0 0 0 0 0 0 -53.6363 0 0 0 2116.08 0 0 0 0 683.844 846.049 2371.52 0.06 0 0 -1097.37 0 0 -2105.09 0 0 678.503 2058.24 0 0 0 0 
0 0 -858.867 -629.978 -739.998 1812.27 0 0 0 0 0 0 0 -195.242 0 0 0 0 0 0 0 0 -1277.28 2119.74 0 0 0 0 0 557.497 0 0 0 0 0 0 0 0 0 0 0 -2122.79 0 0.02 0 1323.05 0 0 1914.5 -976.058 0 0 -71.9474 0 0 -1623.51 0 
0 0 -1815.78 9.68963 0 0 0 0 0 0 0 2047.87 -1070.21 0 0 0 0 0 1558.66 -465.941 0 0 0 992.08 0 -707.801 -1857.74 0 0 0 0 0 0 0 -2039.48 1658.6 0 0 -1108.97 0 2091.66 0 0 0 0.06 0 0 0 98.9563 1968.98 0 0 0 0 -912.732 0 0 
0 696.661 0 0 0 -2108.45 -25.8644 0 0 0 0 0 0 0 0 1517.3 0 -2278.59 0 -937.452 0 -994.98 0 0 -419.553 0 0 0 0 0 0 1816.08 179.83 0 0 0 0 96.82 0 881.146 0 995.59 2071.67 2126.91 0 0.01 -1242.03 0 1653.11 0 0 0 0 0 0 0 1909.47 
0 1780.07 1423.15 0 1706.52 1746.96 2449.95 0 0 0 0 0 0 0 1961.04 0 -1431.55 -1936.32 0 0 0 0 -1649.3 1916.18 446.715 0 0 0 0 0 0 1235.16 -2487.64 0 0 0 0 0 -2276.15 0 0 224.54 0 0 0 580.233 0.02 0 0 0 0 0 0 0 0 0 0 
0 -171.59 132.069 0 0 -661.107 -1505.55 1003.37 -1099.35 0 0 0 0 1604.28 0 0 0 0 0 0 1244.01 1526.76 0 0 0 0 0 0 0 0.534074 0 0 0 811.411 0 0 0 0 2125.54 -1769.39 0 0 0 0 0 0 0 0.01 0 1865.98 -1457.18 0 0 0 0 0 0 
0 -789.743 0 858.104 1267.97 1516.85 0 0 2165.06 0 933.943 2454.07 0 263.756 -340.358 0 0 -1270.1 0 0 0 1226.92 -683.996 -1870.25 0 -1634.34 0 304.651 634.098 0 0 0 0 0 0 0 0 0 0 0 0 1614.05 1929.76 -50.1267 -496.307 -447.172 0 0 0.02 1124.23 634.098 0 0 0 0 72.1 0 
0 0 -46.9222 2422.64 -1427.12 0 2106.46 0 0 2080.07 0 0 0 0 1972.64 0 987.198 0 0 0 0 770.211 1637.09 0 0 0 1358.46 0 -2126.76 0 0 0 0 0 0 288.781 0 109.027 0 0 0 -843.76 0 96.2096 2022.39 0 0 -648.595 372.707 0 0 0 0 0 0 0 0 
0 0 0 1178.7 -2137.75 -631.352 -401.852 0 -340.51 0 0 0 -93.6155 0 1039.54 833.995 0 0 0 0 0 0 -1609.62 0 0 0 0 0 0 0 0 0 0 0 0 0 0 1393.7 1106.07 1325.5 0 1120.26 0 0 0 0 0 1809.98 2408.14 0 0.07 0 0 0 18.6926 0 0 
0 0 0 0 0 0 0 0 0 0 0 0 1779.31 0 0 1684.09 0 0 0 0 0 0 -2321.92 0 0 -232.017 0 0 0 0 0 0 0 0 0 0 2241.97 0 0 62.3341 0 0 -125.507 0 0 0 0 0 0 0 0 0.05 0 0 0 0 0 
0 0 0 0 0 0 0 0 0 0 0 -902.051 0 0 0 0 0 0 0 0 0 0 0 0 0 0 0 0 0 -2010.79 0 2360.53 0 0 0 0 0 0 0 0 0 0 -166.555 2165.97 0 0 0 0 0 0 0 0 0.09 1185.11 0 0 0 
0 -1155.66 0 0 0 0 0 0 0 0 0 0 -763.802 0 0 0 -1618.02 0 0 0 0 0 0 0 1633.43 0 0 0 0 0 0 1439.94 0 0 0 0 0 0 2478.33 0 0 0 0 0 0 0 0 0 0 0 0 0 1179.31 0.09 0 0 -2428.59 
0 566.042 0 1055.56 0 0 0 0 0 913.648 0 0 0 0 0 0 296.564 0 0 0 0 0 0 0 0 0 0 0 0 0 0 0 0 0 0 0 0 -1842.02 0 0 0 0 0 0 1141.77 0 0 0 0 0 1363.8 0 0 0 0.05 0 0 
0 0 0 0 0 0 0 0 0 0 -562.075 0 0 555.055 0 0 0 0 0 0 132.069 0 0 0 0 0 0 0 0 0 0 0 0 0 0 0 0 0 0 0 0 0 0 203.024 0 0 0 0 1094.32 0 0 0 0 0 0 0.06 0 
0 0 0 0 0 0 0 -150.38 0 0 0 0 0 0 0 0 0 0 0 0 0 0 0 0 2124.62 0 0 0 0 0 0 -196.005 0 0 0 0 0 0 0 0 0 0 0 0 0 -213.248 0 0 0 0 0 0 0 1449.71 0 0 0 
