*Vertices 59
*Matrix 
0.09 0 0 -877.636 -756.935 0 0 0 1866.28 0 0 0 0 0 0 0 0 0 0 -546.815 0 0 0 0 1792.58 1465.73 0 0 0 0 0 0 0 784.707 0 2326.5 0 0 0 0 0 0 0 161.519 0 0 0 0 0 0 0 0 0 0 -1986.98 0 0 0 0 
0 0.05 0 -1292.99 0 0 0 1485.41 0 0 0 0 0 0 1714.15 2438.2 0 0 0 0 0 0 0 -907.849 0 0 0 0 0 0 0 0 0 0 0 0 0 2235.71 0 0 0 0 0 -1035.72 0 0 0 0 0 0 0 0 0 0 0 0 0 0 0 
0 0 0.01 0 0 0 0 0 0 0 1239.13 0 0 0 0 0 -1283.68 0 0 0 0 -1509.98 0 0 0 0 0 0 55.7726 -819.041 1758.25 0 0 0 0 0 0 0 0 0 1967.91 0 2450.25 0 0 0 0 0 0 0 0 0 0 0 0 0 0 0 0 
630.284 -1587.95 0 0.03 0 0 0 0 0 0 0 0 0 0 0 0 0 0 0 0 0 0 0 0 0 0 0 0 0 0 0 0 0 2159.11 0 0 0 -1764.35 0 0 0 0 0 0 0 0 0 0 0 0 0 0 0 0 0 0 0 0 0 
-669.652 0 0 0 0.02 0 0 0 1927.63 0 0 0 0 -630.741 0 0 1506.93 0 0 -1918.01 0 0 -2077.47 0 0 0 2487.18 2028.49 0 -785.775 0 0 0 0 0 0 0 0 0 0 0 0 0 0 0 0 0 0 0 0 0 0 0 0 0 0 0 0 0 
0 0 0 0 0 0.04 0 0 0 -1557.89 1762.37 0 0 0 0 0 0 -2107.99 0 0 0 0 1059.53 0 0 0 0 274.895 0 0 0 0 0 -2106.16 1532.11 0 0 0 0 0 0 0 2010.03 1479 0 0 0 0 0 0 0 0 0 0 0 0 0 0 0 
0 0 0 0 0 0 0.04 0 615.94 0 0 0 0 0 0 0 0 0 0 0 0 0 0 0 0 0 0 0 0 0 0 0 1186.18 0 0 0 1972.03 2186.57 0 0 0 0 0 0 0 0 0 0 0 0 0 0 0 0 0 0 0 0 0 
0 522.248 0 0 0 0 0 0.05 0 0 0 750.221 0 0 457.091 0 0 0 0 0 137.257 0 0 891.522 0 0 0 0 0 0 0 0 0 0 0 0 826.518 0 0 0 0 0 0 0 0 0 0 -124.592 0 0 0 0 0 0 0 0 0 0 0 
-1209.37 0 0 0 -281.457 0 812.937 0 0.08 0 0 0 -468.383 425.199 364.772 -1220.82 0 0 0 -395.901 188.376 2375.64 0 0 0 0 2348.17 -116.199 0 0 0 0 0 0 0 0 -1494.72 0 0 0 0 0 0 0 0 0 0 0 0 0 0 0 0 0 0 0 0 0 0 
0 0 0 0 0 2270.04 0 0 0 0.06 0 0 0 0 0 0 -1549.04 0 0 0 0 0 0 1714 0 0 0 0 0 0 0 0 -1350.98 0 0 0 0 0 0 0 275.658 0 0 0 0 0 0 0 0 0 0 0 0 0 0 0 0 0 0 
0 0 -620.06 0 0 359.127 0 0 0 0 0.04 0 739.54 0 0 0 0 0 0 0 0 0 0 0 0 0 0 0 0 0 0 0 0 0 0 0 0 0 0 0 0 0 0 0 0 0 0 0 0 0 0 0 0 0 0 0 0 0 0 
0 0 0 0 0 0 0 1141.77 0 0 0 0 0 0 0 0 1736.27 0 0 0 0 1367.92 0 0 0 0 0 0 271.538 1912.37 -1215.17 -1121.48 0 0 0 0 241.325 0 0 0 0 0 0 0 0 0 0 0 0 0 0 0 0 0 0 0 0 0 0 
0 0 0 0 0 0 0 0 1600.62 0 1148.03 0 0.02 0 0 0 0 0 0 0 0 0 0 0 0 0 0 0 0 0 0 0 0 0 0 0 0 0 0 0 0 0 0 0 0 0 0 0 0 0 0 0 0 0 0 0 0 0 0 
0 0 0 0 1418.73 0 0 0 149.007 0 0 0 0 0.03 0 0 0 0 0 2265.31 0 0 0 0 0 0 0 0 0 0 0 0 0 0 0 0 0 0 0 0 0 0 0 0 0 0 -545.442 0 0 0 0 0 0 0 0 0 0 -62.4866 0 
0 1231.35 0 0 0 0 0 1048.39 -1124.07 0 0 0 0 0 0.07 0 0 0 0 0 0 0 -1456.11 0 0 0 0 0 262.535 0 0 0 0 0 162.74 0 0 2236.78 0 0 934.706 0 0 0 0 0 0 0 0 0 -2428.43 0 0 0 0 0 0 0 1892.53 
0 -1467.1 0 0 0 0 0 0 -1689.89 0 0 0 0 0 0 0 0 0 0 0 0 0 0 625.248 0 0 0 0 0 0 0 1668.37 0 0 1584.6 0 239.952 0 0 0 0 0 0 0 2116.23 1360.9 0 0 0 0 0 0 0 0 0 0 0 0 0 
0 0 483.337 0 2301.17 0 0 0 0 995.438 0 1481.9 0 0 0 0 0.07 0 0 0 0 0 0 0 0 0 0 0 0 0 841.624 0 0 0 -631.962 0 0 1176.11 0 0 0 1218.53 0 1049 745.796 0 0 0 0 0 0 0 0 0 0 0 248.192 0 0 
0 0 0 0 0 469.146 0 0 0 0 0 0 0 0 0 0 0 0 0 0 0 0 0 0 0 0 0 0 0 0 2069.08 0 0 0 0 0 0 0 0 1509.22 0 0 0 0 0 0 0 0 0 0 0 0 0 0 0 0 0 0 0 
0 0 0 0 0 0 0 0 0 0 0 0 0 0 0 0 0 0 0.03 0 0 0 0 0 2295.68 -741.981 0 0 0 0 316.401 0 -583.59 0 0 0 0 0 0 0 2288.66 0 0 -637.455 0 0 0 0 0 0 0 0 0 0 0 0 0 0 0 
-0.228889 0 0 0 298.242 0 0 0 2346.49 0 0 0 0 -573.977 0 0 0 0 0 0.01 0 1820.35 0 0 0 0 0 0 0 0 0 0 0 0 0 0 0 2246.24 0 2224.72 0 0 170.675 0 0 0 0 0 0 -690.558 0 396.97 0 0 0 0 0 0 0 
0 0 0 0 0 0 0 -279.168 -755.715 0 0 0 0 0 0 0 0 0 0 0 0.08 0 0 1710.18 0 0 1306.57 0 2165.97 0 0 0 0 0 0 0 0 0 0 0 0 0 0 0 0 0 0 0 0 0 0 0 -1454.44 0 0 0 0 0 0 
0 0 1594.36 0 0 0 0 0 105.213 0 0 2180.78 0 0 0 0 0 0 0 1516.39 0 0 0 1859.87 0 0 0 0 0 -1827.68 -1087.3 0 0 0 0 -1233.79 0 0 0 0 0 0 0 0 0 0 0 0 0 0 0 0 0 0 0 0 0 0 0 
0 0 0 0 2485.96 -914.563 0 0 0 0 0 0 0 0 -757.088 0 0 0 0 0 0 0 0.01 0 0 0 0 -1724.52 0 0 0 0 -549.715 0 0 2242.88 886.334 0 0 0 0 0 0 0 0 0 0 0 -452.208 0 0 0 0 0 0 0 0 0 0 
0 2286.52 0 0 0 0 0 1810.89 0 2425.99 0 0 0 0 0 2078.39 0 0 0 0 -951.338 1596.35 0 0.08 0 0 0 0 0 0 0 0 -922.498 0 0 0 0 0 0 0 0 0 110.858 -2146.29 0 0 0 0 0 0 0 0 0 0 0 0 0 0 0 
1441.16 0 0 0 0 0 0 0 0 0 0 0 0 0 0 0 0 0 1724.68 0 0 0 0 0 0.01 0 0 0 0 0 321.284 0 0 0 0 2152.39 629.063 795.236 0 0 0 0 2407.99 0 0 0 0 0 0 0 0 0 0 0 0 0 0 0 0 
-1864.3 0 0 0 0 0 0 0 0 0 0 0 0 0 0 0 0 0 934.858 0 0 0 0 0 0 0.02 0 0 0 0 0 0 0 0 0 0 0 0 0 0 553.987 0 0 0 0 0 0 0 0 0 0 0 0 0 0 0 0 0 0 
0 0 0 0 1700.42 0 0 0 1818.98 0 0 0 0 0 0 0 0 0 0 0 1536.23 0 0 0 0 0 0.05 0 0 0 0 0 0 0 0 0 0 0 0 0 0 0 0 2378.54 0 0 0 0 0 0 0 0 0 0 0 0 0 0 0 
0 0 0 0 -2018.11 1518.83 0 0 1490.45 0 0 0 0 0 0 0 0 0 0 0 0 0 1939.07 0 0 0 0 0 1141.47 0 -730.995 0 0 0 0 0 0 0 0 0 0 0 0 0 0 0 0 0 0 0 0 0 0 0 0 0 0 0 0 
0 0 133.137 0 0 0 0 0 0 0 0 1343.81 0 0 -543.306 0 0 0 0 0 -171.896 0 0 0 0 0 0 1797.46 0.01 0 0 0 0 0 0 1921.37 0 0 0 0 0 0 526.521 579.012 0 0 0 0 0 0 0 0 0 0 0 0 0 0 0 
0 0 2455.44 0 -1007.49 0 0 0 0 0 0 1750.01 0 0 0 0 0 0 0 0 0 2314.45 0 0 0 0 0 0 0 0.02 0 0 0 0 0 1638.62 0 0 0 2072.74 0 0 0 0 0 0 0 0 0 0 0 0 0 0 0 0 0 0 0 
0 0 1332.97 0 0 0 0 0 0 0 0 1789.22 0 0 0 0 -1329.46 -1980.12 1181.45 0 0 835.826 0 0 1741 0 0 268.487 0 0 0.03 0 0 0 0 0 0 0 0 0 0 0 0 0 974.38 0 0 0 0 0 0 0 0 0 0 0 0 0 0 
0 0 0 0 0 0 0 0 0 0 0 2066.64 0 0 0 2420.96 0 0 0 0 0 0 0 0 0 0 0 0 0 0 0 0.06 0 0 0 1529.51 0 0 0 0 0 2303.77 0 0 0 0 0 0 0 0 0 0 0 0 0 0 0 0 0 
0 0 0 0 0 0 622.806 0 0 1724.83 0 0 0 0 0 0 0 0 306.482 0 0 0 2285.15 1471.22 0 0 0 0 0 0 0 0 0.03 122.608 0 0 0 0 -887.402 0 0 0 0 0 0 0 0 0 0 0 0 0 0 0 0 0 0 0 0 
-549.715 0 0 399.106 0 1805.7 0 0 0 0 0 0 0 0 0 0 0 0 0 0 0 0 0 0 0 0 0 0 0 0 0 0 -268.639 0.08 1080.28 0 0 -1589.02 0 0 20.3711 0 0 1909.92 0 0 0 0 0 0 0 0 0 0 0 0 0 0 0 
0 0 0 0 0 837.504 0 0 0 0 0 0 0 0 -527.436 482.727 2199.24 0 0 0 0 0 0 0 0 0 0 0 0 0 0 0 0 862.224 0 0 0 0 -1000.78 0 0 0 0 0 0 0 0 0 0 0 0 0 0 -1367.31 0 0 0 0 0 
1278.19 0 0 0 0 0 0 0 0 0 0 0 0 0 0 0 0 0 0 0 0 527.436 1069.9 0 -752.205 0 0 0 1310.39 -374.996 0 -287.255 0 0 0 0.05 0 0 0 0 0 0 0 0 0 0 0 0 0 0 0 0 0 0 0 0 0 0 0 
0 0 0 0 0 0 2382.5 -798.746 753.883 0 0 964.766 0 0 0 1903.52 0 0 0 0 0 0 -951.643 0 340.358 0 0 0 0 0 0 0 0 0 0 0 0.09 1182.52 1326.72 0 0 0 0 0 0 0 0 0 0 0 0 0 0 0 0 0 0 0 0 
0 2172.99 0 837.657 0 0 994.827 0 0 0 0 0 0 0 647.984 0 -738.014 0 0 -1409.73 0 0 0 0 1833.32 0 0 0 0 0 0 0 0 -2361.6 0 0 1160.08 0.06 0 0 0 0 0 0 0 0 0 0 0 0 0 0 0 0 0 0 0 0 0 
0 0 0 0 0 0 0 0 0 0 0 0 0 0 0 0 0 0 0 0 0 0 0 0 0 0 0 0 0 0 0 0 1925.79 0 592.898 0 2154.53 0 0.03 -180.746 0 0 0 0 0 0 0 0 0 0 0 0 0 0 0 0 0 0 0 
0 0 0 0 0 0 0 0 0 0 0 0 0 0 0 0 0 2462 0 1591.46 0 0 0 0 0 0 0 0 0 2326.81 0 0 0 0 0 0 0 0 -415.738 0.04 0 -812.479 0 -1043.2 0 0 0 0 0 0 0 0 0 0 0 0 0 0 0 
0 0 -2413.02 0 0 0 0 0 0 184.103 0 0 0 0 240.41 0 0 0 2028.64 0 0 0 0 0 0 1230.74 0 0 0 0 0 0 0 48.2955 0 0 0 0 0 0 0.04 0 0 0 0 0 0 0 0 0 0 0 0 0 0 0 0 0 0 
0 0 0 0 0 0 0 0 0 0 0 0 0 0 0 0 -2295.37 0 0 0 0 0 0 0 0 0 0 0 0 0 0 2012.92 0 0 0 0 0 0 0 -235.832 0 0.07 0 0 2004.53 0 0 0 0 0 0 0 0 0 0 0 0 0 0 
0 0 1782.05 0 0 -1423.46 0 0 0 0 0 0 0 0 0 0 0 0 0 1900.77 0 0 0 2255.24 -755.562 0 0 0 196.31 0 0 0 0 0 0 0 0 0 0 0 0 0 0.06 0 0 0 0 0 0 0 0 0 0 0 0 0 0 0 0 
1441.47 -1329 0 0 0 1053.58 0 0 0 0 0 0 0 0 0 0 2127.98 0 -1029.01 0 0 0 0 -1809.98 0 0 -1250.27 0 -2081.13 0 0 0 0 1563.08 0 0 0 0 0 2372.43 0 0 0 0.03 0 0 0 0 0 0 0 0 0 0 0 0 0 0 0 
0 0 0 0 0 0 0 0 0 0 0 0 0 0 0 -2336.88 781.655 0 0 0 0 0 0 0 0 0 0 0 0 0 927.534 0 0 0 0 0 0 0 0 0 0 2291.1 0 0 0.09 0 0 0 0 0 0 0 0 0 0 1239.13 0 0 0 
0 0 0 0 0 0 0 0 0 0 0 0 0 0 0 2008.5 0 0 0 0 0 0 0 0 0 0 0 0 0 0 0 0 0 0 0 0 0 0 0 0 0 0 0 0 0 0 0 0 0 0 0 0 0 0 0 0 0 0 0 
0 0 0 0 0 0 0 0 0 0 0 0 0 2145.07 0 0 0 0 0 0 0 0 0 0 0 0 0 0 0 0 0 0 0 0 0 0 0 0 0 0 0 0 0 0 0 0 0.05 0 0 0 0 0 0 0 0 0 0 0 0 
0 0 0 0 0 0 0 1258.05 0 0 0 0 0 0 0 0 0 0 0 0 0 0 0 0 0 0 0 0 0 0 0 0 0 0 0 0 0 0 0 0 0 0 0 0 0 0 0 0.05 0 0 0 0 0 0 0 0 0 0 0 
0 0 0 0 0 0 0 0 0 0 0 0 0 0 0 0 0 0 0 0 0 0 2184.13 0 0 0 0 0 0 0 0 0 0 0 0 0 0 0 0 0 0 0 0 0 0 0 0 0 0.03 0 0 0 0 0 0 0 0 0 0 
0 0 0 0 0 0 0 0 0 0 0 0 0 0 0 0 0 0 0 1195.49 0 0 0 0 0 0 0 0 0 0 0 0 0 0 0 0 0 0 0 0 0 0 0 0 0 0 0 0 0 0 0 0 0 0 0 0 0 0 0 
0 0 0 0 0 0 0 0 0 0 0 0 0 0 1181.3 0 0 0 0 0 0 0 0 0 0 0 0 0 0 0 0 0 0 0 0 0 0 0 0 0 0 0 0 0 0 0 0 0 0 0 0.06 0 0 0 0 0 0 0 0 
0 0 0 0 0 0 0 0 0 0 0 0 0 0 0 0 0 0 0 262.688 0 0 0 0 0 0 0 0 0 0 0 0 0 0 0 0 0 0 0 0 0 0 0 0 0 0 0 0 0 0 0 0 0 0 0 0 0 0 0 
0 0 0 0 0 0 0 0 0 0 0 0 0 0 0 0 0 0 0 0 1981.03 0 0 0 0 0 0 0 0 0 0 0 0 0 0 0 0 0 0 0 0 0 0 0 0 0 0 0 0 0 0 0 0.08 0 0 0 0 0 0 
0 0 0 0 0 0 0 0 0 0 0 0 0 0 0 0 0 0 0 0 0 0 0 0 0 0 0 0 0 0 0 0 0 0 492.035 0 0 0 0 0 0 0 0 0 0 0 0 0 0 0 0 0 0 0.02 0 0 0 0 0 
1431.24 0 0 0 0 0 0 0 0 0 0 0 0 0 0 0 0 0 0 0 0 0 0 0 0 0 0 0 0 0 0 0 0 0 0 0 0 0 0 0 0 0 0 0 0 0 0 0 0 0 0 0 0 0 0.01 0 0 0 0 
0 0 0 0 0 0 0 0 0 0 0 0 0 0 0 0 0 0 0 0 0 0 0 0 0 0 0 0 0 0 0 0 0 0 0 0 0 0 0 0 0 0 0 0 660.497 0 0 0 0 0 0 0 0 0 0 0.01 0 0 0 
0 0 0 0 0 0 0 0 0 0 0 0 0 0 0 0 2102.8 0 0 0 0 0 0 0 0 0 0 0 0 0 0 0 0 0 0 0 0 0 0 0 0 0 0 0 0 0 0 0 0 0 0 0 0 0 0 0 0.08 0 0 
0 0 0 0 0 0 0 0 0 0 0 0 0 2051.07 0 0 0 0 0 0 0 0 0 0 0 0 0 0 0 0 0 0 0 0 0 0 0 0 0 0 0 0 0 0 0 0 0 0 0 0 0 0 0 0 0 0 0 0.01 0 
0 0 0 0 0 0 0 0 0 0 0 0 0 0 660.039 0 0 0 0 0 0 0 0 0 0 0 0 0 0 0 0 0 0 0 0 0 0 0 0 0 0 0 0 0 0 0 0 0 0 0 0 0 0 0 0 0 0 0 0.08 
