*Vertices 51
*Matrix 
0.06 0 0 0 0 0 2177.11 0 1025.04 0 0 828.654 0 0 0 0 874.737 0 0 148.854 0 0 0 0 1869.49 0 0 0 -1695.99 0 0 0 0 0 0 0 0 0 0 0 0 0 2013.53 0 -1575.9 0 2280.11 0 0 0 0 
0 0.05 0 0 0 -64.9281 0 0 0 0 0 0 0 0 0 1612.83 0 0 0 0 2091.97 0 0 0 -774.789 0 0 0 -376.675 0 0 -372.86 0 0 0 0 0 0 0 0 0 0 867.565 0 0 0 1287.35 -763.344 0 0 0 
0 0 0.08 656.377 0 0 0 0 0 0 1106.68 0 -1332.36 0 0 0 0 0 756.325 0 0 0 2267.14 0 0 0 0 0 0 0 1397.82 0 0 0 0 0 0 1049.46 0 0 0 0 0 0 0 0 0 0 0 0 0 
0 0 2234.49 0.09 0 0 0 0 0 2175.13 0 0 0 0 0 -2191.15 0 0 0 0 1381.95 0 0 260.704 0 0 0 0 0 0 -2270.04 0 0 0 0 0 0 0 893.506 0 0 0 0 0 0 0 0 0 2277.67 0 0 
0 0 0 0 0.09 2100.51 0 0 0 0 1670.35 0 0 2336.88 0 0 0 0 0 0 0 0 0 0 -1936.02 0 0 0 0 0 0 0 0 0 0 0 0 0 -539.644 91.7844 -713.294 1096.76 0 0 0 0 0 0 1579.56 0 0 
0 -1696.14 0 0 -1935.71 0.03 1732.31 0 0 0 0 0 0 0 0 0 0 0 0 0 0 0 0 0 0 0 0 0 0 0 0 0 0 0 0 0 0 0 0 0 0 0 0 0 0 1320.92 0 93.9207 0 2405.39 0 
-2380.06 0 0 0 0 516.144 0.05 0 0 0 0 0 -1019.55 0 0 0 0 0 0 0 0 0 0 0 0 0 0 0 0 2055.8 0 0 0 0 0 1137.5 0 0 0 0 0 0 0 0 2437.89 -579.165 1129.57 0 0 0 0 
0 0 0 0 0 0 0 0.02 0 0 0 0 0 0 0 13.1993 0 0 0 0 2174.98 0 0 -1252.56 0 0 0 0 0 0 0 0 0 0 0 0 0 1070.82 0 0 0 0 0 6.33259 0 0 0 0 0 0 0 
1748.33 0 0 0 0 0 0 0 0 0 1217.46 0 0 0 0 0 0 0 0 0 0 1806.47 -368.13 0 0 0 -686.895 0 0 -1493.04 488.83 0 0 2333.37 0 0 0 0 0 0 0 0 -623.722 0 0 0 0 0 0 0 0 
0 0 0 1612.37 0 0 0 0 0 0.01 0 0 0 0 2363.43 0 0 0 0 2158.35 0 -480.132 0 0 598.697 0 0 0 0 0 0 0 0 0 0 0 0 0 0 0 0 0 0 0 0 1551.48 0 0 -1374.32 -2018.72 0 
0 0 -1404.84 0 2077.62 0 0 0 -539.949 0 0.08 0 0 0 0 0 0 0 0 0 0 1207.39 0 0 0 0 0 0 0 -863.75 0 0 0 -6.63778 1848.43 0 0 0 0 0 0 0 0 0 0 0 0 0 0 0 0 
-1429.56 0 0 0 0 0 0 0 0 0 0 0.08 0 0 0 0 1258.05 0 0 0 0 1253.47 0 0 0 2360.99 0 0 0 0 1788.77 0 0 0 -1189.69 0 0 0 0 0 -2473.75 0 0 0 0 0 0 400.479 0 0 0 
0 0 420.011 0 0 0 848.186 0 0 0 0 0 0.05 0 0 -839.335 417.417 0 0 0 0 0 0 0 0 0 0 0 0 0 0 2235.4 0 1065.02 0 0 -242.698 0 0 0 0 0 0 0 0 0 0 14.2674 0 0 0 
0 0 0 0 1486.94 0 0 0 0 0 0 0 0 0.06 0 0 0 0 0 0 1822.18 0 0 0 -1499.91 0 0 0 0 0 0 0 0 0 0 0 0 0 0 0 0 0 0 1481.44 0 0 0 0 0 0 0 
0 0 0 0 0 0 0 0 0 -993.149 0 0 0 0 0.03 2420.19 0 0 0 0 2014.76 0 0 0 0 0 0 0 0 0 0 0 0 0 0 0 -176.321 0 0 0 0 0 0 0 153.279 0 0 0 0 0 0 
0 2091.05 0 385.22 0 0 0 1907.79 0 0 0 0 -1176.11 0 -350.887 0.01 0 0 -974.38 -1432.16 0 0 1420.1 1500.37 0 0 0 0 0 1494.87 0 0 0 0 0 0 0 0 0 0 0 0 0 0 0 0 0 0 0 594.729 0 
2183.07 0 0 0 0 0 0 0 0 0 0 637.913 -2031.69 0 0 0 0.08 0 0 0 0 201.041 0 0 0 0 0 0 0 0 0 0 0 0 1901.99 0 0 0 0 0 0 641.27 1397.98 0 0 0 0 866.192 0 0 -2026.2 
0 0 0 0 0 0 0 0 0 0 0 0 0 0 0 0 0 0 0 0 0 0 0 0 0 0 0 0 2465.67 1128.96 0 0 0 0 0 0 0 0 0 0 0 0 1370.82 366.604 0 0 0 0 0 0 0 
0 0 274.743 0 0 0 0 0 0 0 0 0 0 0 0 217.978 0 0 0 0 0 0 2398.53 901.898 0 0 0 0 0 0 0 0 0 0 0 0 0 396.664 0 499.969 0 0 0 0 0 0 0 0 0 0 0 
-1127.28 0 0 0 0 0 0 0 0 1679.2 0 0 0 0 0 2155.29 0 0 0 0.07 2097.16 0 0 0 0 0 -1539.28 0 0 0 0 0 0 610.752 0 0 0 0 0 0 0 0 0 0 0 0 0 0 0 0 0 
0 922.498 0 1523.87 0 0 0 599.155 0 0 0 0 0 2399.75 -23.8807 0 0 0 0 1504.94 0.06 0 0 1157.34 0 0 0 0 0 0 1987.44 0 0 0 0 0 0 0 0 0 0 0 2383.27 0 0 327.998 0 0 0 0 0 
0 0 0 0 0 0 0 0 2424.92 2453.61 -1894.67 -2214.04 0 0 0 0 380.184 0 0 0 0 0.06 0 0 0 0 0 0 0 0 0 0 0 0 0 0 0 2250.66 0 0 0 0 0 0 0 0 0 0 0 0 0 
0 0 -1967.91 0 0 0 0 0 1313.29 0 0 0 0 0 0 1214.71 0 0 -956.069 0 0 0 0.05 0 0 0 0 0 0 0 0 0 0 0 0 2067.55 -1822.18 0 0 0 0 0 0 0 0 0 0 0 748.39 0 0 
0 0 0 -1450.77 0 0 0 2419.58 0 0 0 0 0 0 0 -1094.47 0 0 1840.65 0 -576.876 0 0 0.05 924.94 0 0 0 0 2048.33 0 0 -1285.97 0 -1221.12 0 0 0 0 -601.596 0 0 0 0 0 -1028.4 0 0 1424.83 0 0 
1221.43 -1357.08 0 0 911.206 0 0 0 0 2245.32 0 0 0 685.98 0 0 0 0 0 0 0 0 0 -554.445 0.07 0 0 2326.96 0 0 0 0 -2327.57 2197.87 0 0 0 825.297 344.02 0 0 0 0 0 238.273 0 1003.98 0 0 0 0 
0 0 0 0 0 0 0 0 0 0 0 2300.41 0 0 0 0 0 0 0 0 0 0 0 0 0 0.02 0 0 0 333.644 0 0 0 0 0 0 0 0 0 0 0 0 0 0 0 0 -734.199 0 0 0 0 
0 0 0 0 0 0 0 0 882.519 0 0 0 0 0 0 0 0 0 0 -1049.3 0 0 0 0 0 0 0.02 0 0 0 0 0 0 0 0 0 0 0 0 0 2234.34 0 0 0 -2494.35 0 0 2159.41 0 0 0 
0 0 0 0 0 0 0 0 0 0 0 0 0 0 0 0 0 0 0 0 0 0 0 0 -1132.01 0 0 0.05 0 0 0 2151.33 0 0 0 0 0 0 0 0 0 0 0 0 0 0 0 0 0 0 0 
1079.82 2072.13 0 0 0 0 0 0 0 0 0 0 0 0 0 0 0 803.018 0 0 0 0 0 0 0 0 0 0 0.05 0 0 0 0 0 0 0 0 0 0 0 0 0 0 0 0 0 0 0 0 0 0 
0 0 0 0 0 0 520.112 0 940.504 0 -556.886 0 0 0 0 334.101 0 1780.98 0 0 0 0 0 1852.24 0 1005.97 0 0 0 0.08 0 0 0 0 0 0 0 0 0 -1324.27 0 0 1768.17 0 0 0 0 0 0 0 0 
0 0 -167.623 420.621 0 0 0 0 2238.61 0 0 1239.28 0 0 0 0 0 0 0 0 -1230.28 0 0 0 0 0 0 0 0 0 0.08 0 903.272 0 0 0 0 0 2140.03 0 0 0 -902.509 0 0 0 0 0 0 0 0 
0 2207.02 0 0 0 0 0 0 0 0 0 0 -466.857 0 0 0 0 0 0 0 0 0 0 0 0 0 0 -579.318 0 0 0 0.04 0 0 0 0 0 0 0 0 0 1396.3 0 0 0 0 0 0 0 0 0 
0 0 0 0 0 0 0 0 0 0 0 0 0 0 0 0 0 0 0 0 0 0 0 2271.87 1575.59 0 0 0 0 0 568.636 0 0.07 918.226 0 0 0 0 0 -309.839 0 0 1482.36 0 0 0 0 0 0 -2402.95 0 
0 0 0 0 0 0 0 0 -1808.3 0 1540.5 0 -180.135 0 0 0 0 0 0 1971.88 0 0 0 0 -721.992 0 0 0 0 0 0 0 -455.87 0.07 0 0 0 0 0 0 0 -647.984 0 0 0 0 0 0 411.466 0 0 
0 0 0 0 0 0 0 0 0 0 1895.12 2332.61 0 0 0 0 -1284.91 0 0 0 0 0 0 2211.91 0 0 0 0 0 0 0 0 0 0 0.02 0 0 0 0 -1303.22 0 0 0 0 0 213.248 0 0 0 0 0 
0 0 0 0 0 0 798.288 0 0 0 0 0 0 0 0 0 0 0 0 0 0 0 -19.1504 0 0 0 0 0 0 0 0 0 0 0 0 0.02 0 0 0 0 0 0 0 0 0 0 0 0 0 0 0 
0 0 0 0 0 0 0 0 0 0 0 0 2479.86 0 1189.99 0 0 0 0 0 0 0 2373.5 0 0 0 0 0 0 0 0 0 0 0 0 0 0.02 0 0 0 882.061 0 0 0 0 2422.33 0 0 0 0 0 
0 0 1836.83 0 0 0 0 2042.38 0 0 0 0 0 0 0 0 0 0 -634.556 0 0 -1307.95 0 0 -773.721 0 0 0 0 0 0 0 0 0 0 0 0 0 0 0 0 0 0 411.161 0 0 0 467.925 0 0 0 
0 0 0 328.15 277.795 0 0 0 0 0 0 0 0 0 0 0 0 0 0 0 0 0 0 0 1697.21 0 0 0 0 0 1503.11 0 0 0 0 0 0 0 0 0 0 0 0 0 0 0 0 0 799.356 0 0 
0 0 0 0 424.284 0 0 0 0 0 0 0 0 0 0 0 0 0 2050 0 0 0 0 -243.309 0 0 0 0 0 244.53 0 0 -876.415 0 -987.198 0 0 0 0 0.09 0 0 0 772.347 0 0 0 0 0 0 0 
0 0 0 0 -1605.81 0 0 0 0 0 0 2171.47 0 0 0 0 0 0 0 0 0 0 0 0 0 0 455.26 0 0 0 0 0 0 0 0 0 1761.6 0 0 0 0 0 0 0 0 0 0 0 -1022.75 0 0 
0 0 0 0 505.005 0 0 0 0 0 0 0 0 0 0 0 2293.39 0 0 0 0 0 0 0 0 0 0 0 0 0 0 1153.37 0 739.082 0 0 0 0 0 0 0 0.05 0 0 0 0 0 0 0 0 0 
830.943 -459.38 0 0 0 0 0 0 -2347.87 0 0 0 0 0 0 0 706.275 -1385.01 0 0 611.667 0 0 0 0 0 0 0 0 2219.38 1817 0 2043.75 0 0 0 0 0 0 0 0 0 0.03 0 0 0 0 0 0 0 0 
0 0 0 0 0 0 0 -2321.16 0 0 0 0 0 1405.15 0 0 0 -87.054 0 0 0 0 0 0 0 0 0 0 0 0 0 0 0 0 0 0 0 2162.62 0 1677.53 0 0 0 0.02 0 1405.91 0 0 0 -948.134 0 
-43.4126 0 0 0 0 0 2483.37 0 0 0 0 0 0 0 1308.25 0 0 0 0 0 0 0 0 0 1312.07 0 1074.63 0 0 0 0 0 0 0 0 0 0 0 0 0 0 0 0 0 0 0 -1664.25 0 0 0 0 
0 0 0 0 0 1826.76 -863.75 0 0 1380.73 0 0 0 0 0 0 0 0 0 0 -1410.18 0 0 2196.65 0 0 0 0 0 0 0 0 0 0 1845.84 0 1976.15 0 0 0 0 0 0 1227.07 0 0.03 0 0 0 0 0 
467.009 2310.94 0 0 0 0 470.824 0 0 0 0 0 0 0 0 0 0 0 0 0 0 0 0 0 -63.86 2332.15 0 0 0 0 0 0 0 0 0 0 0 0 0 0 0 0 0 0 1264.92 0 0.08 -314.264 0 0 0 
0 -966.445 0 0 0 1900.92 0 0 0 0 0 697.577 574.282 0 0 0 1305.81 0 0 0 0 0 0 0 0 0 564.364 0 0 0 0 0 0 0 0 0 0 -169.454 0 0 0 0 0 0 0 0 2438.66 0.06 0 0 0 
0 0 0 -844.676 -559.175 0 0 0 0 1267.82 0 0 0 0 0 0 0 0 0 0 0 0 2276.3 107.654 0 0 0 0 0 0 0 0 0 -1320.61 0 0 0 0 499.969 0 2362.51 0 0 0 0 0 0 0 0.01 154.805 0 
0 0 0 0 0 1752.14 0 0 0 1590.85 0 0 0 0 0 -1395.23 0 0 0 0 0 0 0 0 0 0 0 0 0 0 0 0 -1516.24 0 0 0 0 0 0 0 0 0 0 1383.63 0 0 0 0 2315.52 0.04 0 
0 0 0 0 0 0 0 0 0 0 0 0 0 0 0 0 1459.32 0 0 0 0 0 0 0 0 0 0 0 0 0 0 0 0 0 0 0 0 0 0 0 0 0 0 0 0 0 0 0 0 0 0.07 
