*Vertices 39
*Matrix 
0.08 0 0 0 0 0 0 0 -186.544 0 0 0 0 0 0 0 0 0 0 0 0 0 0 0 0 0 0 1450.32 0 -1019.55 0 0 0 0 0 0 0 0 0 
0 0.09 0 0 0 0 0 1123.46 0 0 0 -706.427 0 0 2364.65 0 0 0 0 0 0 0 0 0 -916.852 -729.316 1745.43 0 0 0 0 0 -1145.89 0 0 0 0 0 0 
0 0 0.03 0 0 -1910.69 0 0 0 0 0 0 1084.09 503.479 0 0 192.648 553.224 0 0 -2387.08 0 0 0 2360.99 0 0 -1146.96 0 0 0 2060.53 0 0 0 0 0 0 0 
0 0 0 0 0 0 0 0 1746.8 0 0 0 0 -2304.53 0 0 0 0 0 0 0 0 0 0 0 0 0 0 0 0 1073.87 0 0 0 0 0 0 0 0 
0 0 0 0 0 1153.07 0 0 0 0 0 0 0 0 -2080.52 0 0 0 0 0 0 0 0 0 0 0 0 0 0 0 0 2329.4 0 0 0 0 0 0 0 
0 0 2280.11 0 -2298.58 0.01 -28.3059 -994.369 0 0 0 0 0 0 -773.263 0 0 0 0 0 0 2048.48 0 0 0 0 0 0 0 0 0 0 1828.29 0 0 0 0 0 0 
0 0 0 0 0 1936.48 0.06 0 0 0 2015.98 0 0 0 0 0 0 0 0 0 0 0 0 222.709 0 0 0 -951.796 -941.115 0 0 0 0 1667.61 0 0 0 0 0 
0 117.42 0 0 0 2497.56 0 0.02 0 0 0 0 0 1512.73 0 0 0 0 -758.919 0 1439.79 0 0 0 0 0 0 1421.17 0 0 2350.46 0 0 -1110.34 0 0 0 0 0 
1801.89 0 0 -303.43 0 0 0 0 0.01 0 0 0 -570.467 0 0 0 0 0 0 505.31 0 0 0 0 0 0 0 0 0 0 0 0 0 0 0 1142.08 0 0 0 
0 0 0 0 0 0 0 0 0 0.03 0 0 0 -172.353 0 0 0 0 0 -613.498 1.44963 0 0 0 0 0 0 0 0 0 1329.46 0 0 0 103.687 0 0 0 0 
0 0 0 0 0 0 845.439 0 0 0 0.05 0 -1811.04 0 0 229.27 1002.15 0 0 0 0 0 0 0 1915.72 0 0 1289.33 2028.34 659.124 0 0 0 0 0 0 0 0 0 
0 777.078 0 0 0 0 0 0 0 0 0 0.02 0 0 0 0 0 0 0 0 0 0 0 0 0 0 0 0 0 0 0 0 0 0 0 0 0 0 0 
0 0 20.6763 0 0 0 0 0 400.632 0 357.143 0 0.01 0 -611.362 0 0 0 0 -156.178 0 2064.04 0 0 0 0 0 0 1715.98 0 0 0 -2041.46 0 0 0 0 0 0 
0 0 366.756 2204.73 0 0 0 -2482.6 0 1460.69 0 0 0 0.03 0 0 0 -1097.22 0 -1143.76 0 1101.95 0 0 2362.06 0 985.977 0 0 0 1113.24 0 0 0 0 0 0 0 0 
0 -1089.74 0 0 1971.27 2449.49 0 0 0 0 0 0 293.817 0 0.09 0 0 -330.439 0 0 0 0 0 0 0 0 259.178 -282.983 0 0 0 0 0 0 0 0 0 -2058.24 0 
0 0 0 0 0 0 0 0 0 0 1044.72 0 0 0 0 0.09 0 0 0 0 0 -1323.36 0 0 0 0 0 0 0 0 0 0 2494.81 0 0 0 0 0 2036.58 
0 0 -806.528 0 0 0 0 0 0 0 1110.8 0 0 0 0 0 0.03 0 0 0 0 0 0 0 0 0 0 0 0 0 0 0 1843.24 0 0 0 0 0 0 
0 0 -2324.98 0 0 0 0 0 0 0 0 0 0 -1210.9 1353.57 0 0 0.09 -902.356 37.1563 0 -1051.44 0 0 0 0 1013.29 0 639.897 1587.65 0 0 0 1795.94 0 0 0 0 0 
0 0 0 0 0 0 0 883.892 0 0 0 0 0 0 0 0 0 14.42 0.01 0 0 0 1568.88 0 0 0 689.642 0 -1318.17 0 1129.57 -1647.47 0 0 0 0 0 0 0 
0 0 0 0 0 0 0 0 -1437.5 -671.484 0 0 306.33 -326.93 0 0 0 1963.33 0 0.01 0 0 0 0 0 0 0 0 0 0 1867.2 0 0 0 0 0 2088 0 0 
0 0 1954.48 0 0 0 0 -1384.85 0 2029.25 0 0 0 0 0 0 0 0 0 0 0.08 0 360.5 0 0 -1036.18 0 843.303 0 0 0 0 0 0 0 0 0 0 0 
0 0 0 0 0 1595.13 0 0 0 0 0 0 -331.05 -980.331 0 2001.48 0 1003.52 0 0 0 0.08 1455.35 0 0 0 1512.12 0 0 0 0 0 0 0 0 0 0 0 0 
0 0 0 0 0 0 0 0 0 0 0 0 0 0 0 0 0 0 317.011 0 2148.88 1876.81 0.06 0 0 0 0 0 -387.204 0 0 0 0 0 0 0 0 0 0 
0 0 0 0 0 0 134.816 0 0 0 0 0 0 0 0 0 0 0 0 0 0 0 0 0.06 2293.24 0 0 0 0 1455.96 0 0 0 0 0 0 0 0 0 
0 627.384 2394.71 0 0 0 0 0 0 0 479.522 0 0 29.9844 0 0 0 0 0 0 0 0 0 308.771 0.04 0 0 0 0 0 0 0 0 0 0 0 0 0 0 
0 1729.26 0 0 0 0 0 0 0 0 0 0 0 0 0 0 0 0 0 0 915.021 0 0 0 0 0.08 1225.7 0 -2187.64 0 0 0 0 0 0 0 0 0 0 
0 1901.84 0 0 0 0 0 0 0 0 0 0 0 -57.4511 -2236.01 0 0 -1389.13 -1427.88 0 0 1697.52 0 0 0 305.414 0.04 2054.58 0 0 1343.65 -309.534 0 -26.4748 0 0 0 0 0 
2366.02 0 -1426.97 0 0 0 1993.55 604.495 0 0 -1266.9 0 0 0 1581.39 0 0 0 0 0 -124.134 0 0 0 0 0 -1863.99 0.01 0 0 0 0 0 696.509 0 0 0 0 0 
0 0 0 0 0 0 1736.27 0 0 0 -25.5593 0 2013.69 0 0 0 0 -1675.85 1778.24 0 0 0 -1331.29 0 0 1706.52 0 0 0.09 0 0 0 0 0 0 0 0 0 0 
-657.75 0 0 0 0 0 0 0 0 0 955.763 0 0 0 0 0 0 1305.66 0 0 0 0 0 -329.676 0 0 0 0 0 0.08 0 0 0 0 0 0 0 0 0 
0 0 0 201.193 0 0 0 -1125.14 0 1427.12 0 0 0 2027.88 0 0 0 0 -1660.28 2355.34 0 0 0 0 0 0 1131.09 0 0 0 0.01 0 1065.02 0 0 0 0 0 0 
0 0 1350.83 0 942.488 0 0 0 0 0 0 0 0 0 0 0 0 0 2065.42 0 0 0 0 0 0 0 1994.46 0 0 0 0 0.09 0 0 0 0 0 0 0 
0 2434.84 0 0 0 1237.6 0 0 0 0 0 0 423.826 0 0 770.058 1783.27 0 0 0 0 0 0 0 0 0 0 0 0 0 -49.9741 0 0.05 0 0 0 0 0 0 
0 0 0 0 0 0 2016.89 2259.97 0 0 0 0 0 0 0 0 0 -2181.39 0 0 0 0 0 0 0 0 2013.08 629.215 0 0 0 0 0 0.05 0 0 0 0 0 
0 0 0 0 0 0 0 0 0 1652.04 0 0 0 0 0 0 0 0 0 0 0 0 0 0 0 0 0 0 0 0 0 0 0 0 0.01 0 0 0 0 
0 0 0 0 0 0 0 0 2081.9 0 0 0 0 0 0 0 0 0 0 0 0 0 0 0 0 0 0 0 0 0 0 0 0 0 0 0.09 0 0 0 
0 0 0 0 0 0 0 0 0 0 0 0 0 0 0 0 0 0 0 1088.21 0 0 0 0 0 0 0 0 0 0 0 0 0 0 0 0 0.03 0 0 
0 0 0 0 0 0 0 0 0 0 0 0 0 0 2060.99 0 0 0 0 0 0 0 0 0 0 0 0 0 0 0 0 0 0 0 0 0 0 0.05 0 
0 0 0 0 0 0 0 0 0 0 0 0 0 0 0 1337.4 0 0 0 0 0 0 0 0 0 0 0 0 0 0 0 0 0 0 0 0 0 0 0.09 
