*Vertices 67
*Matrix 
0.07 0 0 0 0 0 0 0 0 0 0 0 0 0 605.716 -1179.01 0 0 0 0 0 0 0 0 0 0 0 2131.95 0 0 0 0 0 0 0 0 1574.53 2012.62 0 0 0 0 0 421.079 0 0 0 0 0 0 0 0 0 0 0 0 0 0 0 0 0 -2110.74 0 0 0 0 0 
0 0.06 0 0 857.494 0 0 0 0 0 0 0 0 0 0 -672.246 -596.255 0 0 0 0 0 0 0 0 0 0 0 0 0 1266.75 0 0 0 0 0 0 1954.48 0 1170.92 0 0 0 0 0 0 0 0 2308.5 0 -1511.51 0 0 0 0 0 0 0 0 0 0 -573.672 0 0 0 0 0 
0 0 0.08 0 0 0 0 0 0 1044.57 0 0 0 0 0 0 0 -1973.1 0 0 0 0 1872.84 0 0 0 0 0 0 0 0 0 0 0 0 0 0 595.798 0 0 0 0 0 0 0 1973.4 0 0 0 0 0 0 0 0 0 0 2407.07 0 0 -380.49 0 0 0 0 0 -638.218 0 
0 0 0 0 -278.253 0 0 0 0 0 0 0 0 0 0 0 0 0 0 0 0 1294.21 0 1253.01 0 252.77 0 0 0 0 1638.92 75.457 0 0 0 0 0 0 0 0 0 0 0 0 -1936.32 0 799.356 0 0 0 0 0 0 0 0 0 0 0 0 -283.593 0 0 1512.57 0 0 0 0 
0 -2.97555 0 1528.9 0.09 0 0 0 0 0 0 1392.18 668.584 0 0 0 0 0 0 0 0 0 0 0 0 0 2091.2 0 0 0 0 0 0 -402.463 2309.56 0 0 0 0 0 0 0 0 0 0 0 0 -1970.2 0 0 0 -857.036 427.793 0 0 0 0 0 0 0 0 -751.9 0 0 0 0 0 
0 0 0 0 0 0.09 475.707 0 0 0 1297.42 0 0 0 0 0 0 0 0 0 0 0 1333.74 0 0 0 0 0 0 0 0 0 0 0 0 0 0 -1384.7 0 0 0 985.214 0 0 0 0 0 531.709 1465.58 0 0 0 0 1568.88 0 0 0 -699.866 0 0 0 1975.69 0 0 0 0 0 
0 0 0 0 0 -1828.9 0.07 0 0 0 0 0 2171.47 0 0 2275.99 0 0 1739.17 -1903.97 0 0 0 0 0 0 0 0 0 0 0 0 0 0 0 0 0 0 0 -1341.06 0 0 0 0 0 0 0 0 0 0 0 0 0 0 0 0 0 1244.16 0 0 -163.656 0 0 0 0 0 0 
0 0 0 0 0 0 0 0.04 0 0 0 0 776.162 0 0 1301.84 0 0 -731.605 0 -702.765 0 0 1942.12 0 1930.52 0 0 0 0 0 0 0 0 0 0 0 0 0 0 0 1961.2 0 1010.7 0 0 0 0 0 0 0 0 0 0 1785.26 0 -162.893 0 -2422.33 0 0 1661.5 0 0 0 0 0 
0 0 0 0 0 0 0 0 0.05 0 0 0 0 0 0 0 0 0 0 0 0 0 0 0 0 0 0 0 0 0 0 0 0 0 0 0 0 0 2271.57 0 0 0 0 0 0 0 0 0 0 0 0 0 1133.69 0 0 0 0 0 0 0 0 0 0 0 0 0 0 
0 0 1863.08 0 0 0 0 0 0 0 0 0 0 0 0 0 0 0 0 306.787 0 0 1193.81 0 0 0 0 0 0 0 2002.24 0 0 1486.33 0 0 2354.58 0 0 0 0 0 0 0 0 0 0 0 0 0 -799.509 0 0 0 0 0 0 0 0 0 0 0 0 0 0 0 1961.81 
0 0 0 0 0 -2303.61 0 0 0 0 0.09 -613.041 0 0 0 0 0 0 0 0 0 1804.64 0 0 0 0 0 0 0 0 0 0 0 0 0 0 0 0 0 0 0 0 0 1763.89 0 0 0 0 0 0 0 1433.99 0 0 0 0 0 -445.341 0 0 0 1105.15 0 0 0 0 0 
0 0 0 0 -1943.95 0 0 0 0 0 771.889 0.03 0 0 0 0 0 0 0 -167.623 0 1761.91 0 0 0 0 0 0 0 0 0 0 0 0 0 1833.78 0 0 0 0 0 -80.6452 0 0 0 0 0 0 1276.51 0 0 751.595 0 0 -1772.44 0 2406.92 0 0 0 0 0 0 0 0 0 0 
0 0 0 0 2113.18 0 606.632 490.356 0 0 0 0 0.04 0 0 0 0 0 0 0 0 0 226.524 -24.6437 0 0 146.26 0 -537.965 0 0 0 0 0 1992.02 0 0 172.658 0 0 0 0 0 0 0 0 0 0 0 -1928.39 186.239 0 0 0 0 0 0 0 0 0 0 0 0 0 0 0 0 
0 0 0 0 0 0 0 0 0 0 0 0 0 0 0 -1999.5 0 0 0 -1513.64 0 0 814.005 0 0 0 0 0 0 0 0 0 0 0 -1878.19 0 0 0 0 2207.63 0 -121.845 0 0 0 0 0 0 0 0 0 0 0 2146.14 1995.83 0 0 0 0 0 0 0 0 0 0 0 0 
2013.53 0 0 0 0 0 0 0 0 0 0 0 0 0 0.02 0 0 335.017 0 0 0 0 0 0 0 1456.42 0 0 462.584 0 0 0 0 0 0 0 0 0 0 1976.15 -1930.68 0 0 0 0 1996.14 0 0 0 0 2478.48 0 0 0 0 0 0 0 0 -2341 0 -2202.6 0 0 0 0 0 
438.322 -2361.9 0 0 0 0 -784.097 1292.69 0 0 0 0 0 554.445 0 0.09 0 0 0 0 0 0 0 0 0 0 0 0 0 0 0 0 0 0 0 0 0 0 0 0 2364.19 0 0 0 0 0 0 0 0 0 0 0 1024.89 0 0 0 0 0 0 0 0 0 0 0 0 0 0 
0 136.952 0 0 0 0 0 0 0 0 0 0 0 0 0 0 0.06 0 0 0 0 0 0 0 1831.34 0 -2046.8 0 0 0 0 0 132.984 0 0 0 0 0 0 0 0 0 0 0 0 0 0 0 0 0 0 0 0 937.91 0 855.052 0 0 0 0 0 1947.61 0 0 0 0 0 
0 0 -1449.71 0 0 0 0 0 0 0 0 0 0 0 1676.76 0 0 0.01 0 0 0 0 0 173.421 0 0 -1380.28 0 0 0 0 0 1941.05 0 0 0 0 0 0 0 0 0 2426.91 0 0 0 0 0 0 0 0 0 0 0 0 -603.275 0 0 0 0 0 0 0 0 0 0 0 
0 0 0 0 0 0 1066.85 -21.1341 0 0 0 0 0 0 0 0 0 0 0.02 0 0 0 0 0 0 0 0 0 0 1179.16 0 1489.23 0 2100.97 0 0 0 0 0 616.55 0 0 0 0 0 0 0 0 0 0 0 -1150.01 0 0 0 0 0 0 0 0 699.103 0 -1922.59 0 0 0 0 
0 0 0 0 0 0 2018.57 0 0 853.679 0 -358.669 0 -339.29 0 0 0 0 0 0 0 0 0 0 0 0 0 0 0 2405.85 0 0 0 0 0 0 0 0 0 0 0 0 -204.093 0 0 0 -1736.12 0 1276.97 0 0 0 0 0 0 0 0 868.633 0 0 0 0 0 0 0 0 0 
0 0 0 0 0 0 0 2074.42 0 0 0 0 0 0 0 0 0 0 0 0 0.07 0 0 0 0 0 0 0 -425.81 0 0 0 0 0 0 0 0 0 0 0 0 0 0 0 0 0 0 0 0 0 0 0 0 0 -1661.96 0 0 0 0 0 0 1540.65 0 0 0 0 0 
0 0 0 -903.882 0 0 0 0 0 0 774.331 2454.68 0 0 0 0 0 0 0 0 0 0.04 0 0 1577.73 0 2189.78 0 -2254.02 0 1316.34 0 0 0 0 0 0 0 0 0 0 0 0 0 0 0 0 0 0 0 0 0 0 0 0 0 0 0 0 0 0 0 0 0 0 0 0 
0 0 869.549 0 0 2470.24 0 0 0 -130.696 0 0 1814.4 -1314.05 0 0 0 0 0 0 0 0 0.06 0 0 0 0 234.306 0 0 0 0 0 0 0 1512.57 0 0 0 0 0 0 0 0 0 305.414 0 2322.38 0 0 -110.401 0 0 0 0 0 0 0 0 0 727.943 0 0 0 0 0 0 
0 0 0 693.457 0 0 0 -108.264 0 0 0 0 -825.297 0 0 0 0 -513.092 0 0 0 0 0 0.04 0 0 0 0 0 0 0 0 0 0 0 0 0 0 0 0 0 0 0 1175.19 2358.09 0 0 0 2329.86 0 0 0 0 0 0 0 0 0 0 -366.451 0 0 0 0 0 0 0 
0 0 0 0 0 0 0 0 0 0 0 0 0 0 0 0 -1628.54 0 0 0 0 589.999 0 0 0.07 0 -1067.16 0 0 2248.99 256.279 0 0 0 0 0 0 0 0 0 2203.82 -476.012 0 0 0 1697.82 0 0 0 0 0 0 2379.3 0 0 0 0 0 0 0 0 -847.27 0 0 0 0 0 
0 0 0 -752.205 0 0 0 888.928 0 0 0 0 0 0 111.927 0 0 0 0 0 0 0 0 0 0 0.02 0 0 0 0 0 0 0 1180.07 0 0 0 0 0 0 0 0 0 0 0 0 0 0 0 0 1307.18 0 0 0 0 0 0 0 1838.97 0 0 712.073 0 0 0 0 0 
0 0 0 0 2307.43 0 0 0 0 0 0 0 -504.089 0 0 0 1162.83 1793.5 0 0 0 1436.12 0 0 932.112 0 0.09 0 0 0 0 0 0 -1103.02 1489.84 0 0 110.858 0 -1932.81 0 0 0 0 0 0 0 0 0 0 0 0 0 0 0 0 0 0 0 465.636 0 0 0 0 0 0 0 
1255.3 0 0 0 0 0 0 0 0 0 0 0 0 0 0 0 0 0 0 0 0 0 2291.25 0 0 0 0 0.01 326.472 0 0 -1733.53 0 0 0 0 0 0 0 -674.23 0 0 0 0 0 0 0 0 0 287.561 0 0 0 0 0 0 0 0 0 0 0 0 1081.5 0 0 0 0 
0 0 0 0 0 0 0 0 0 0 0 0 1657.69 0 -998.947 0 0 0 0 0 2363.43 165.181 0 0 0 0 0 890.149 0.03 0 531.404 0 0 0 0 0 0 0 0 0 0 0 0 0 0 0 0 2428.13 0 0 0 0 0 0 0 -1108.97 0 0 0 0 0 0 0 0 0 0 0 
0 0 0 0 0 0 0 0 0 0 0 0 0 0 0 0 0 0 1906.57 143.208 0 0 0 0 2091.51 0 0 0 0 0.05 0 0 0 0 0 0 0 -268.792 0 2139.88 0 0 1760.08 0 0 0 0 0 0 0 0 0 0 0 0 0 0 -1946.7 0 0 0 0 0 0 0 0 0 
0 387.204 0 -1904.58 0 0 0 0 0 -2226.55 0 0 0 0 0 0 0 0 0 0 0 2265.47 0 0 2207.17 0 0 0 104.907 0 0.02 0 1804.33 0 -1448.33 0 0 0 0 0 0 -2048.02 0 1500.37 0 0 2156.21 0 0 0 0 0 0 0 0 0 0 0 466.094 0 0 0 2046.65 0 0 0 0 
0 0 0 -995.285 0 0 0 0 0 0 0 0 0 0 0 0 0 0 -659.429 0 0 0 0 0 0 0 0 2260.73 0 0 0 0.09 -552.156 0 0 0 0 0 711.158 0 0 0 0 0 0 0 0 0 0 0 -1500.52 0 0 0 0 0 1136.59 0 0 498.138 1396.76 0 0 0 0 0 0 
0 0 0 0 0 0 0 0 0 0 0 0 0 0 0 0 -905.408 2498.17 0 0 0 0 0 0 0 0 0 0 0 0 -643.712 1251.64 0.07 0 0 451.14 0 0 0 0 -1518.68 0 0 0 0 0 0 -1112.02 803.018 0 0 0 0 0 580.386 0 -554.14 1832.87 0 0 0 0 0 0 0 0 0 
0 0 0 0 -1091.27 0 0 0 0 726.875 0 0 0 0 0 0 0 0 -673.315 0 0 0 0 0 0 225.15 756.02 0 0 0 0 0 0 0 0 0 0 0 0 0 0 0 0 0 0 0 0 0 0 0 0 0 0 0 0 0 1673.25 2083.88 0 0 0 0 0 0 0 0 0 
0 0 0 0 -2011.86 0 0 0 0 0 0 0 2378.23 1036.94 0 0 0 0 0 0 0 0 0 0 0 0 1291.92 0 0 0 397.275 0 0 0 0.07 0 0 703.223 0 0 0 0 0 0 0 0 0 0 0 0 0 0 0 0 0 0 0 0 0 940.504 0 0 0 0 0 0 0 
0 0 0 0 0 0 0 0 0 0 0 1578.65 0 0 0 0 0 0 0 0 0 0 -1616.34 0 0 0 0 0 0 0 0 0 -677.74 0 0 0.03 0 0 0 0 0 -682.928 0 0 0 0 0 1967.45 0 0 0 0 0 0 0 0 2301.78 0 0 0 355.464 0 0 0 0 0 0 
-433.287 0 0 0 0 0 0 0 0 994.98 0 0 0 0 0 0 0 0 0 0 0 0 0 0 0 0 0 0 0 0 0 0 0 0 0 0 0.04 0 229.27 0 38.2244 0 0 502.869 0 0 1490.3 0 0 0 0 0 0 0 0 0 0 1484.8 0 0 0 0 0 0 0 0 0 
-273.827 2422.18 -1661.35 0 0 214.927 0 0 0 0 0 0 1380.43 0 0 0 0 0 0 0 0 0 0 0 0 0 852.763 0 0 2027.12 0 0 0 0 329.524 0 0 0.03 0 0 0 0 0 0 0 0 0 0 0 0 -328.608 0 0 0 -259.178 0 0 0 1987.29 0 0 0 0 0 0 0 0 
0 0 0 0 0 0 0 0 1941.97 0 0 0 0 0 0 0 0 0 0 0 0 0 0 0 0 0 0 0 0 0 0 755.715 0 0 0 0 1694.62 0 0.05 477.996 0 0 0 0 0 0 0 0 0 0 0 0 0 0 0 0 0 0 0 0 0 0 0 0 0 -1170.77 0 
0 15.0304 0 0 0 0 1004.14 0 0 0 0 0 0 1708.96 -939.436 0 0 0 2043.6 0 0 0 0 0 0 0 2052.14 1726.51 0 -1971.27 0 0 0 0 0 0 0 0 1244.16 0.09 -1724.68 0 0 0 -850.169 585.116 -2402.19 0 0 0 0 0 0 0 0 0 0 0 0 0 0 0 0 0 0 0 0 
0 0 0 0 0 0 0 0 0 0 0 0 0 0 1841.56 1764.05 0 0 0 0 0 0 0 0 -499.359 0 0 0 0 0 0 0 392.087 0 0 0 2212.97 0 0 460.753 0.03 0 0 0 0 0 0 0 0 0 0 0 0 0 0 2474.21 0 0 0 0 0 0 0 0 0 0 0 
0 0 0 0 0 1999.5 0 1678.59 0 0 0 -184.256 0 -248.344 0 0 0 0 0 0 0 0 0 0 254.601 0 0 0 0 0 -859.478 0 0 0 0 56.5355 0 0 0 0 0 0.04 0 0 0 0 0 -199.973 -735.42 0 1841.26 0 0 0 0 0 0 0 0 0 0 0 289.392 0 0 0 0 
0 0 0 0 0 0 0 0 0 0 0 0 0 0 0 0 0 -393.46 0 1482.82 0 0 0 0 0 0 0 0 0 1248.44 0 0 0 0 0 0 0 0 0 0 0 0 0 0 0 0 0 0 0 0 0 1825.24 2276.3 0 -963.393 0 0 340.205 0 0 0 0 0 0 0 0 0 
1303.06 0 0 0 0 0 0 -2264.09 0 0 523.621 0 0 0 0 0 0 0 0 0 0 0 0 784.249 0 0 0 0 0 0 2496.64 0 0 0 0 0 1597.26 0 0 0 0 0 0 0.01 0 2326.35 794.473 0 0 2427.52 0 0 0 0 -2027.42 0 0 0 0 0 2020.86 0 0 0 0 0 0 
0 0 0 1144.52 0 0 0 0 0 0 0 0 0 0 0 0 0 0 0 0 0 0 0 2433.93 0 0 0 0 0 0 0 0 0 0 0 0 0 0 0 -1695.84 0 0 0 0 0.09 0 0 0 0 0 1990.95 0 0 0 -730.689 0 0 0 -329.676 0 -1074.33 0 1325.19 0 0 0 0 
0 0 727.18 0 0 0 0 0 0 0 0 0 0 0 702.155 0 0 0 0 0 0 0 -1149.71 0 -679.571 0 0 0 0 0 0 0 0 0 0 0 0 0 0 2114.4 0 0 0 -1327.94 0 0.06 0 0 -104.45 0 0 0 0 1839.73 0 2086.63 0 0 -702.46 0 0 0 0 0 0 0 0 
0 0 0 2051.53 0 0 0 0 0 0 0 0 0 0 0 0 0 0 0 -1699.65 0 0 0 0 0 0 0 0 0 0 2064.35 0 0 0 0 0 -1272.7 0 0 -752.205 0 0 0 1264.46 0 0 0.02 0 2004.99 1786.48 0 -1893.14 0 0 0 1372.95 0 0 0 0 0 0 0 0 0 0 0 
0 0 0 0 -1482.51 2135.61 0 0 0 0 0 0 0 0 0 0 0 0 0 0 0 0 1613.9 0 0 0 0 0 907.697 0 0 0 1400.42 0 0 176.473 0 0 0 0 0 -1936.02 0 0 0 0 0 0.04 0 0 0 0 0 0 0 1652.04 0 0 0 0 0 131.306 0 0 0 0 0 
0 1065.94 0 0 0 -307.703 0 0 0 0 0 -333.644 0 0 0 0 0 0 0 2345.42 0 0 0 2457.88 0 0 0 0 0 0 0 0 -2029.56 0 0 0 0 0 0 0 0 -211.57 0 0 0 840.861 -158.315 0 0.09 0 0 0 0 0 762.581 917.768 0 0 0 0 -1318.17 0 0 0 0 0 0 
0 0 0 0 0 0 0 0 0 0 0 0 700.934 0 0 0 0 0 0 0 0 0 0 0 0 0 0 -966.445 0 0 0 0 0 0 0 0 0 0 0 0 0 0 0 -509.888 0 0 602.817 0 0 0.02 0 0 0 0 0 0 0 0 0 0 1415.52 0 0 0 0 0 0 
0 -2139.12 0 0 0 0 0 0 0 1326.72 0 0 1287.8 0 -37.1563 0 0 0 0 0 0 0 -2267.3 0 0 1229.51 0 0 0 0 0 -45.3963 0 0 0 0 0 1660.13 0 0 0 1455.81 0 0 1225.85 0 0 0 0 0 0.01 0 0 0 0 0 0 0 0 0 0 0 0 0 0 0 0 
0 0 0 0 2424.77 0 0 0 0 0 795.236 -599.307 0 0 0 0 0 0 -1539.89 0 0 0 0 0 0 0 0 0 0 0 0 0 0 0 0 0 0 0 0 0 0 0 1766.03 0 0 0 724.586 0 0 0 0 0.04 0 917.31 235.221 0 0 0 0 -1479.77 0 0 0 0 0 0 0 
0 0 0 0 205.618 0 0 0 1551.33 0 0 0 0 0 0 1701.18 0 0 0 0 0 0 0 0 -731.3 0 0 0 0 0 0 0 0 0 0 0 0 0 0 0 0 0 -1012.68 0 0 0 0 0 0 0 0 0 0.07 -2173.45 81.5607 0 0 0 0 0 1938.92 0 66.7592 -2294.15 -309.992 0 0 
0 0 0 0 0 -612.888 0 0 0 0 0 0 0 2267.3 0 0 1732.92 0 0 0 0 0 0 0 0 0 0 0 0 0 0 0 0 0 0 0 0 0 0 0 0 0 0 0 0 -1342.13 0 0 0 0 0 593.966 1193.96 0.03 0 528.809 0 0 521.638 0 0 0 0 0 0 0 0 
0 0 0 0 0 0 0 2119.74 0 0 0 93.4629 0 -324.03 0 0 0 0 0 0 -1031.45 0 0 0 0 0 0 0 0 0 0 0 2186.42 0 0 0 0 1110.19 0 0 0 0 1432 1724.37 1497.01 0 0 0 44.3281 0 0 832.926 -619.755 0 0.02 0 0 0 0 0 0 -2301.78 0 0 2224.57 0 0 
0 0 0 0 0 0 0 0 0 0 0 0 0 0 0 0 -1137.2 1171.22 0 0 0 0 0 0 0 0 0 0 1062.73 0 0 0 0 0 0 0 0 0 0 0 -2251.43 0 0 0 0 1322.9 -228.355 810.343 2295.68 0 0 0 0 -1631.44 0 0.01 1088.06 0 0 0 0 0 0 0 0 0 0 
0 0 1916.79 0 0 0 0 35.9355 0 0 0 2133.47 0 0 0 0 0 0 0 0 0 0 0 0 0 0 0 0 0 0 0 1243.4 -1882.76 -1621.37 0 1036.94 0 0 0 0 0 0 0 0 0 0 0 0 0 0 0 0 0 0 0 -1896.5 0.01 -234.916 0 0 0 0 0 0 0 0 0 
0 0 0 0 0 1688.36 -599.918 0 0 0 -2429.65 0 0 0 0 0 0 0 0 -989.181 0 0 0 0 0 0 0 0 0 -1136.89 0 0 1441.92 -155.568 0 0 512.482 0 0 0 0 0 2142.63 0 0 0 0 0 0 0 0 0 0 0 0 0 1144.22 0.09 0 0 0 0 0 0 0 0 0 
0 0 0 0 0 0 0 318.69 0 0 0 0 0 0 0 0 0 0 0 0 0 0 0 0 0 -2460.63 0 0 0 0 -246.513 0 0 0 0 0 0 1124.84 0 0 0 0 0 0 -1870.71 2268.97 0 0 0 0 0 0 0 1721.17 0 0 0 0 0.07 0 0 0 0 0 0 0 0 
0 0 1526.46 -909.223 0 0 0 0 0 0 0 0 0 0 2499.54 0 0 0 0 0 0 0 0 -1886.27 0 0 -700.476 0 0 0 0 -594.882 0 0 766.243 0 0 0 0 0 0 0 0 0 0 0 0 0 0 0 0 1084.25 0 0 0 0 0 0 0 0.09 0 0 0 0 0 0 0 
0 0 0 0 0 0 1655.55 0 0 0 0 0 0 0 0 0 0 0 -1342.13 0 0 0 1061.2 0 0 0 0 0 0 0 0 2127.83 0 0 0 -1766.79 0 0 0 0 0 0 0 421.995 -1481.44 0 0 0 1576.05 -661.565 0 0 1845.53 0 0 0 0 0 0 0 0.08 0 0 0 0 0 0 
1301.69 2481.69 0 0 1998.58 1931.14 0 -1130.94 0 0 1753.97 0 0 0 2217.7 0 666.753 0 0 0 116.657 0 0 0 2183.98 368.74 0 0 0 0 0 0 0 0 0 0 0 0 0 0 0 0 0 0 0 0 0 1382.41 0 0 0 0 0 0 -52.4155 0 0 0 0 0 0 0.05 0 0 0 0 0 
0 0 0 -639.134 0 0 0 0 0 0 0 0 0 0 0 0 0 0 1763.13 0 0 0 0 0 0 0 0 2394.56 0 0 421.537 0 0 0 0 0 0 0 0 0 0 -1164.66 0 0 285.882 0 0 0 0 0 0 0 -1078.6 0 0 0 0 0 0 0 0 0 0.04 0 0 0 0 
0 0 0 0 0 0 0 0 0 0 0 0 0 0 0 0 0 0 0 0 0 0 0 0 0 0 0 0 0 0 0 0 0 0 0 0 0 0 0 0 0 0 0 0 0 0 0 0 0 0 0 0 348.75 0 0 0 0 0 0 0 0 0 0 0.03 0 0 0 
0 0 0 0 0 0 0 0 0 0 0 0 0 0 0 0 0 0 0 0 0 0 0 0 0 0 0 0 0 0 0 0 0 0 0 0 0 0 0 0 0 0 0 0 0 0 0 0 0 0 0 0 1667.61 0 -1564.76 0 0 0 0 0 0 0 0 0 0.07 0 1348.38 
0 0 1933.27 0 0 0 0 0 0 0 0 0 0 0 0 0 0 0 0 0 0 0 0 0 0 0 0 0 0 0 0 0 0 0 0 0 0 0 675.146 0 0 0 0 0 0 0 0 0 0 0 0 0 0 0 0 0 0 0 0 0 0 0 0 0 0 0.08 0 
0 0 0 0 0 0 0 0 0 2256.46 0 0 0 0 0 0 0 0 0 0 0 0 0 0 0 0 0 0 0 0 0 0 0 0 0 0 0 0 0 0 0 0 0 0 0 0 0 0 0 0 0 0 0 0 0 0 0 0 0 0 0 0 0 0 2014.76 0 0 
