*Vertices 63
*Matrix 
0.02 2109.06 0 -1709.72 0 1093.86 0 0 0 0 0 0 630.131 0 0 -2209.62 0 0 0 0 0 2290.8 -1770 0 1464.81 0 0 0 0 -211.112 1712.78 0 1500.52 302.057 980.941 0 -1144.06 0 0 -2357.63 0 0 -1078.75 0 612.888 0 0 0 2292.63 0 0 1188.47 0 0 0 2192.83 1737.49 0 0 0 0 0 2309.26 
586.337 0.06 0 1094.01 0 0 0 0 909.528 0 0 0 0 -432.829 2057.48 0 -1044.27 0 350.429 -1150.47 1187.55 2239.52 -2337.79 0 0 1541.72 0 0 0 -2327.57 0 0 0 801.035 -359.584 -778.909 0 0 0 0 0 0 0 867.87 0 0 0 -1612.06 1801.89 0 301.141 0 0 304.346 0 0 1976.3 802.103 -429.93 0 0 1402.1 0 
0 0 0.01 0 0 0 2092.88 0 0 0 0 -437.864 529.42 0 252.159 0 0 0 0 0 0 0 0 0 1594.06 -1820.35 0 0 0 0 0 -1684.85 0 -1103.63 -1033.28 0 2068.62 0 -282.22 0 0 0 0 1113.7 0 0 901.288 0 -1393.4 0 2172.69 0 2424.47 0 0 0 0 0 0 0 0 0 0 
1351.28 -757.241 0 0.07 0 0 0 0 0 0 0 0 -620.67 0 1570.25 0 0 0 0 96.3622 0 0 1948.38 0 0 0 0 0 0 0 0 0 0 0 0 0 148.854 0 -1042.28 0 0 0 -606.479 0 0 0 -921.735 2307.12 474.487 0 -1581.85 0 2202.44 0 0 0 0 0 0 0 0 0 0 
0 0 0 0 0.02 0 0 0 0 0 0 -503.937 1811.5 -357.601 0 0 1763.59 0 0 0 -416.807 0 0 0 0 0 2403.87 459.532 0 0 0 -2039.93 0 0 0 0 0 1202.66 0 0 0 0 0 0 0 815.836 0 0 0 0 0 -473.571 0 0 0 -835.215 2465.21 0 0 0 0 0 0 
-1340.91 0 0 0 0 0.05 0 0 0 0 0 0 0 16.5563 0 0 0 0 -2411.65 0 0 0 -524.537 0 0 0 1982.1 0 0 0 0 2368.62 0 0 0 0 0 -1000.93 2257.23 0 163.961 612.888 0 1374.94 0 617.771 0 0 0 0 510.956 926.618 1532.72 0 0 0 1906.11 0 0 0 0 232.627 2430.42 
0 0 539.491 0 0 0 0.02 535.829 0 0 0 0 1835.46 0 -1259.42 764.107 1520.51 0 0 0 1150.17 0 0 584.201 0 0 0 0 0 0 0 -2310.63 0 0 0 0 0 0 0 0 0 0 0 2189.78 0 1202.51 0 0 0 0 0 0 0 0 0 0 1327.33 0 0 0 745.491 283.441 0 
0 0 0 0 0 0 -89.0378 0 0 0 0 0 0 0 2366.18 0 0 0 0 0 0 -107.196 0 0 0 0 0 0 0 0 -720.008 2346.49 0 0 0 1334.96 0 -903.272 0 0 0 0 0 929.975 0 1753.82 0 0 0 0 0 0 0 2207.79 0 352.26 0 0 0 0 0 -2060.08 0 
0 281.915 0 0 0 0 0 0 0.05 0 0 0 0 0 0 0 0 0 0 0 0 -667.364 0 0 0 0 0 0 0 0 0 0 0 114.521 0 1428.19 1287.8 0 0 -1601.69 0 1222.65 0 0 -1172.29 0 1310.08 0 0 0 0 0 0 726.417 0 0 0 0 1922.9 -232.627 0 0 0 
0 0 0 0 0 0 0 0 0 0.03 0 679.266 274.743 469.756 0 -2483.21 0 0 0 1181.3 0 0 0 0 0 0 0 0 0 0 688.726 -2249.75 0 750.526 802.713 0 0 0 0 0 1287.65 0 0 0 0 0 0 0 0 2142.78 0 -42.3444 0 0 0 0 1302.3 187.307 6.18 0 0 0 0 
0 0 0 0 0 0 0 0 0 0 0.03 1735.51 0 0 -1395.99 0 -1004.29 0 0 0 0 -737.709 -1359.37 0 -169.454 1343.81 0 0 0 0 0 1121.48 0 0 0 -1250.57 0 0 0 0 2446.59 0 0 0 0 0 0 0 0 0 -1067.31 2027.88 0 0 0 0 0 266.808 -205.618 0 575.045 0 0 
0 0 -1757.94 0 -2128.74 0 0 0 0 111.469 454.497 0.05 0 0 0 0 0 0 672.552 0 0 -1418.88 0 484.405 0 -669.5 -1151.23 0 0 0 0 0 0 935.316 761.361 0 -161.367 0 576.876 -211.722 1725.9 0 0 0 0 -1706.82 0 0 0 -242.241 0 0 0 0 186.392 1373.1 1150.01 0 373.928 2235.4 0 -321.894 0 
198.904 0 925.855 1891.92 -1293.76 0 584.658 0 0 1539.74 0 0 0 -1244.93 0 1632.21 0 0 0 0 0 461.211 0 0 0 1642.74 0 0 0 1281.7 1005.2 0 -52.1104 0 0 0 1921.37 0 0 0 0 0 -28.0007 0 -2228.39 0 0 0 0 0 0 0 0 0 0 0 0 0 0 0 0 0 0 
0 1458.1 0 0 -257.347 2069.54 0 0 0 1725.59 0 0 -1881.39 0.09 0 0 1704.54 1646.4 0 0 0 0 0 0 0 0 0 0 0 0 0 0 0 0 910.291 0 0 0 -576.876 0 2040.54 -1490.91 0 227.287 0 0 -684.606 0 0 0 0 0 -1976 0 -205.618 0 0 -174.49 0 0 -312.433 0 0 
0 2272.48 -439.39 2448.42 0 0 1817.76 1234.86 0 0 -292.138 0 0 0 0.01 0 0 0 0 0 0 0 -1856.82 0 0 -713.141 908.917 0 0 0 0 0 0 1401.64 975.295 347.377 0 0 0 0 0 0 0 0 0 0 0 0 0 0 0 0 0 0 0 102.466 0 0 0 0 0 0 0 
331.355 0 0 0 0 0 1875.59 0 0 1718.27 0 0 -605.411 0 0 0.07 0 0 1544.77 528.809 0 0 925.855 0 -2260.89 0 0 0 -2.06 0 2097.46 0 0 1235.77 0 543.458 0 0 0 0 0 0 1823.4 0 0 161.519 0 -230.644 0 0 0 -1767.86 2219.38 -563.906 0 551.698 1090.04 70.7266 -341.426 0 0 0 0 
0 1897.56 0 0 499.664 0 948.897 0 0 0 -1960.74 0 0 2384.79 0 0 0.04 0 0 0 0 0 0 0 1182.36 0 -261.162 0 2334.13 -2287.13 814.768 0 0 1783.27 0 0 0 -64.3178 0 0 0 0 -489.593 1679.2 0 0 708.716 0 0 0 -1887.19 -275.964 0 0 -2434.39 0 0 2439.57 0 0 0 0 -428.556 
0 0 0 0 0 0 0 0 0 0 0 0 0 1300.78 0 0 0 0 1025.96 -310.755 0 0 0 0 0 0 0 -436.949 0 0 0 0 0 0 0 0 -790.963 0 0 -897.778 0 0 0 0 0 0 0 0 0 0 0 0 0 0 0 0 0 0 0 0 0 0 0 
0 91.0215 0 0 0 -1689.89 0 0 0 0 0 833.232 0 0 0 2479.09 0 58.6718 0.01 0 0 0 1921.06 0 0 0 0 0 0 -544.984 -512.787 740.608 0 -87.5118 0 0 0 1382.87 0 0 0 -1831.03 0 536.592 0 0 0 -820.414 0 0 -912.58 0 627.079 0 610.446 0 0 0 0 0 2320.4 0 0 
0 2023.15 0 -1616.79 0 0 0 0 0 2326.5 0 0 0 0 0 -1735.97 0 -645.695 0 0 0 1106.52 0 0 0 2192.07 -1506.01 787.606 0 0 0 -422.91 0 -1682.41 0 0 0 0 0 0 1586.73 0 2393.34 0 0 0 -428.404 0 0 0 0 -2264.85 2152.39 0 0 1450.62 0 0 0 0 0 0 2276.91 
0 -1166.49 0 0 1025.8 0 1267.82 0 0 0 0 0 0 0 0 0 0 0 0 0 0.05 2499.85 0 0 0 1963.48 2019.18 0 0 0 0 1272.7 -1111.1 0 0 0 -2307.89 0 0 0 0 0 0 238.426 0 0 0 0 0 0 0 0 0 0 1032.52 1932.36 0 1921.83 0 0 0 0 0 
-1603.21 -1920.45 0 0 0 0 0 -494.171 -1948.23 0 513.398 2098.22 2440.64 0 0 0 0 0 0 1958.3 840.251 0.03 -1080.43 0 0 0 2083.88 0 2350.31 -151.753 0 29.9844 475.097 0 0 -2001.48 137.104 0 1282.16 1851.94 -1255.46 0 0 2498.63 0 0 0 0 0 0 0 0 0 0 -2455.9 0 0 2041.31 0 0 0 0 0 
-903.882 -534.761 0 -573.672 0 709.937 0 0 0 0 609.836 0 0 0 1605.66 -2049.09 0 0 -821.329 0 0 1460.39 0 0 0 0 0 -1407.13 1721.47 0 0 1869.64 0 1518.22 0 0 0 0 0 0 0 0 0 1531.5 0 0 374.844 0 0 0 0 0 0 0 839.641 411.008 0 0 0 397.275 -134.053 0 0 
0 0 0 0 0 0 2377.47 0 0 0 0 1158.71 0 0 0 0 0 0 0 0 0 0 0 0.04 140.767 0 0 -104.755 0 0 0 -1468.17 1047.32 0 0 0 0 -1603.37 0 0 340.358 0 0 0 0 0 1656.32 -1099.66 -209.281 0 0 0 0 0 2129.96 365.841 0 871.075 0 0 0 0 -120.319 
-1464.05 0 2365.11 0 0 0 0 0 0 0 2443.24 0 0 0 0 2497.86 -1497.77 0 0 0 0 0 0 -1515.32 0.01 0 0 0 991.47 -1000.17 0 0 0 0 -370.571 0 0 0 0 0 0 0 0 1736.88 0 2211.91 0 -1854.99 1894.82 0 0 0 -702.918 0 1529.66 0 1936.17 1915.42 0 0 0 0 0 
0 -931.349 1150.01 0 0 0 0 0 0 0 -398.953 200.735 -442.137 0 1408.96 0 0 0 0 1080.58 48.1429 0 0 0 0 0.09 0 741.676 0 -477.081 770.058 0 0 0 636.845 -1142.99 2388.61 0 774.178 0 0 0 0 0 2200.16 0 1460.08 0 0 -1277.58 -672.094 0 0 0 -1971.72 761.055 -95.7518 1688.67 0 0 -1058.76 38.9874 -1143.91 
0 0 0 0 2263.79 1878.34 0 0 0 0 0 1808.15 0 0 2482.91 0 1352.2 0 0 176.321 577.944 -943.403 0 0 0 0 0.08 0 0 0 -1086.99 0 0 658.971 -1514.1 0 0 0 0 1416.44 0 -725.501 91.3266 -1349.76 1049.76 0 0 147.481 0 0 951.643 1235.77 -2010.33 -646.306 0 0 0 0 -217.368 0 0 -1072.19 0 
0 0 0 0 -1881.69 0 0 0 0 0 0 0 0 0 0 0 0 2418.67 0 2131.49 0 0 467.162 1375.85 0 211.264 0 0.03 0 0 634.098 0 0 0 -2116.99 0 0 0 0 167.47 325.709 0 0 0 0 0 0 263.451 -1373.1 0 0 2037.19 0 0 0 0 0 74.2363 0 0 0 0 0 
0 0 0 0 0 0 0 0 0 0 0 0 0 0 0 954.085 1192.28 0 0 0 0 963.546 -1189.38 0 2088.31 0 0 0 0.03 0 0 0 0 0 0 0 0 2485.2 0 0 0 0 0 0 0 0 0 0 0 1907.94 0 0 0 0 0 0 0 0 658.666 0 0 -1997.82 0 
1508.3 1346.86 0 0 0 0 0 0 0 0 0 0 -486.694 0 0 0 2301.02 0 1178.85 0 0 -1256.52 0 0 1517.91 -2053.36 0 0 0 0.03 2126.15 0 -1831.03 0 0 0 0 1158.25 0 -350.429 0 0 -10.6052 0 0 0 0 0 1043.81 0 0 0 0 0 0 0 0 0 -190.817 2202.9 757.241 362.484 0 
926.16 0 0 0 0 0 0 -1546.75 0 1752.14 0 0 -865.276 0 0 -2495.88 1307.34 0 -540.864 0 0 0 0 0 0 -449.309 225.455 2267.14 0 529.725 0.01 -1286.43 0 0 0 0 1312.68 0 2247.76 0 0 0 0 0 1458.4 -1224.17 0 0 0 1259.88 0 0 0 0 0 0 2167.5 0 0 0 0 902.509 0 
0 0 850.932 0 -1314.66 -2142.32 1692.33 -1248.13 0 815.378 1844.16 0 0 0 0 0 0 0 -121.693 1564.61 -1563.54 -2103.87 -1261.56 1591.01 0 0 0 0 0 0 27.3904 0.03 1990.8 0 0 862.529 2327.72 0 0 0 -503.174 0 0 0 -321.131 0 1395.69 0 0 0 0 0 0 0 0 0 0 -1334.5 0 0 0 413.144 0 
1627.02 0 0 0 0 0 0 0 0 0 0 0 -2329.1 0 0 0 0 0 0 0 35.1726 -127.491 0 -2383.57 0 0 0 0 0 268.944 0 1277.43 0.07 1960.89 0 0 0 1252.71 0 0 0 0 0 0 0 0 0 0 0 -163.808 0 0 0 0 1277.89 0 0 0 0 0 0 0 0 
-2125.54 -530.335 1487.7 0 0 0 0 0 356.99 -1223.41 0 1262.78 0 0 -1222.19 581.759 -478.759 0 2336.88 -1472.75 0 0 -1038.93 0 0 0 -284.204 0 0 0 0 0 1727.42 0.08 414.823 0 0 0 0 0 0 -211.875 1884.59 0 0 0 2074.42 0 2449.8 0 0 0 0 2294.92 0 0 0 0 0 0 2439.27 0 0 
-891.675 2103.11 -404.141 0 0 0 0 0 0 -1214.71 0 1731.7 0 -839.793 -951.186 0 0 0 0 0 0 0 0 0 2151.48 -1209.98 -1204.03 -408.872 0 0 0 0 0 1569.8 0.03 0 0 2361.9 776.772 1683.48 0 0 0 0 0 0 0 0 0 0 -1480.22 0 0 0 0 0 0 -2048.48 1046.71 0 1068.99 -136.952 -727.18 
0 2098.53 0 0 0 0 0 646.916 -1660.59 0 -80.9503 0 0 0 2004.53 -956.679 0 0 0 0 0 2155.45 0 0 0 176.473 0 0 0 0 0 730.232 0 0 0 0.03 0 0 0 0 2105.09 0 -1270.41 0 0 0 0 0 0 945.387 0 0 0 -47.0748 0 -1452.6 0 0 0 1560.95 0 0 0 
-1150.78 0 -496.765 2198.93 0 0 0 0 73.7785 0 0 2365.26 2156.82 0 0 0 0 1783.27 0 0 -2328.33 -2333.52 0 0 0 161.824 0 0 0 0 1189.54 -2419.13 0 0 0 0 0.09 0 1815.78 0 1326.72 0 0 0 -1166.95 0 1659.83 0 0 1435.82 0 0 0 0 1753.36 0 0 0 0 0 0 0 1966.23 
0 0 0 0 147.176 -2277.37 0 -1856.52 0 0 0 0 0 0 0 0 2462.77 0 -1765.88 0 0 0 0 1568.73 0 0 0 0 2181.08 1590.24 0 0 1290.55 0 2084.49 0 0 0.06 0 1645.18 -1793.8 0 0 0 0 1699.96 796.457 0 0 926.466 0 0 967.971 -1670.81 2303 1059.53 0 -472.961 0 0 0 0 0 
0 0 2314.29 833.842 0 -1930.07 0 0 0 0 0 2098.22 0 -1135.67 0 0 0 0 0 0 0 -860.088 0 0 0 -225.455 0 0 0 0 2034.75 0 0 0 -347.072 0 -580.844 0 0.03 0 185.934 1544.92 215.079 0 0 0 0 0 0 2046.04 0 1608.1 0 -1471.07 1969.13 0 0 0 0 0 0 0 2096.55 
-1207.85 0 0 0 0 0 0 0 2233.88 0 0 2068.01 0 0 0 0 0 125.202 0 0 0 140.309 0 0 0 0 -741.371 809.275 0 62.6392 0 0 0 0 -1072.65 0 0 -138.02 0 0.05 1288.87 -2117.76 0 1157.49 1720.1 0 2201.83 0 0 0 0 0 0 -2368.77 0 0 0 1303.22 -931.959 0 0 0 0 
0 0 0 0 0 -559.023 0 0 0 1513.95 -75.9148 -1876.2 0 882.824 0 0 0 0 0 -354.396 0 399.716 0 -549.409 0 0 0 -2496.64 0 0 0 671.026 0 0 0 -816.904 884.808 1256.52 -1854.53 1447.11 0.02 0 0 2058.7 2333.22 849.406 0 -2460.02 0 0 1591.92 0 0 0 0 0 0 0 1204.49 0 0 -2298.58 0 
0 0 0 0 0 2399.14 0 0 1689.43 0 0 0 0 -1150.32 0 0 0 0 -56.0778 0 0 0 0 0 0 0 1522.95 0 0 0 0 0 0 1857.89 0 0 0 0 -133.595 1041.06 0 0.08 -2071.67 0 0 0 0 1918.32 0 0 0 0 628.758 0 0 0 0 0 -2453.76 0 0 0 0 
-1223.26 0 0 1787.09 0 0 0 0 0 0 0 0 -489.288 0 0 -2277.98 -1715.52 0 0 839.335 0 0 0 0 0 0 1229.06 0 0 1084.7 0 0 0 1555.76 0 -100.177 0 0 1918.32 0 0 -1449.86 0.07 1551.48 0 0 0 0 1777.17 1040.6 0 0 0 0 645.848 0 0 0 0 0 0 -2026.96 0 
0 982.62 -523.011 0 0 1764.5 -674.535 2040.39 0 0 0 0 0 -1394.31 0 0 2027.12 0 -511.719 0 2346.95 813.547 -2028.95 0 1185.57 0 2120.96 0 0 0 0 0 0 0 0 0 0 0 0 -2103.72 -1776.1 0 98.1933 0.03 0 0 0 0 0 -465.789 0 -1357.08 252.77 530.335 0 -73.6259 0 0 0 1663.18 0 0 0 
2334.13 0 0 0 0 0 0 0 -611.362 0 0 0 1484.04 0 0 0 0 0 0 0 0 0 0 0 0 -2455.9 1234.86 0 0 0 -2218.62 2016.28 0 0 0 0 1608.4 0 0 -748.695 54.2467 0 0 0 0.01 0 0 0 0 0 0 -2010.64 0 0 0 0 222.404 911.054 0 0 0 1713.84 0 
0 0 0 0 -1991.87 -1465.12 -1834.7 2060.69 0 0 0 2041 0 0 0 2498.93 0 0 0 0 0 0 0 0 -485.168 0 0 0 0 0 1722.24 0 0 0 0 0 0 -2476.04 0 0 -205.466 0 0 0 0 0.05 0 287.408 0 0 0 0 0 -956.069 0 2238.61 0 0 0 -1340.3 0 0 0 
0 0 428.098 2472.23 0 0 0 0 187.002 0 0 0 0 742.592 0 0 2478.48 0 0 1031.3 0 0 2285.76 938.826 0 1533.94 0 0 0 0 0 -1141.62 0 1179.46 0 0 238.884 1912.67 0 1570.56 0 0 0 0 0 0 0.09 -1919.54 0 0 0 -1591.16 0 -2348.17 0 -992.08 0 -2498.47 2396.85 0 -1813.33 1032.52 0 
0 -1785.26 0 2034.44 0 0 0 0 0 0 0 0 0 0 0 613.346 0 0 -692.999 0 0 0 0 828.501 1203.88 0 392.85 -438.932 0 0 0 0 0 0 0 0 0 0 0 0 1373.41 -904.645 0 0 0 2284.84 1919.39 0.05 0 0 -15.3356 -1674.63 0 0 0 0 0 0 0 0 0 0 0 
158.467 698.34 483.947 559.481 0 0 0 0 0 0 0 0 0 0 0 0 0 0 0 0 0 0 0 -423.063 1879.41 0 0 1067.92 0 196.158 0 0 0 -1342.89 0 0 0 0 0 0 0 0 916.395 0 0 0 0 0 0.04 0 0 0 0 -850.78 0 1969.74 0 0 0 0 0 0 0 
0 0 0 0 0 0 0 0 0 2312.01 0 -799.203 0 0 0 0 0 0 0 0 0 0 0 0 0 -625.248 0 0 -1573.31 0 -1505.4 0 1637.39 0 0 1013.14 -2115.16 1894.36 1026.87 0 0 0 -1143.6 2321.62 0 0 0 0 0 0.08 0 0 0 0 0 0 -1498.23 0 0 0 -783.792 1994.31 0 
0 -571.993 -1940.14 1646.86 0 -1789.22 0 0 0 0 -709.937 0 0 0 0 0 789.743 0 -1822.64 0 0 0 0 0 0 -2420.65 585.116 0 0 0 0 0 0 0 2138.66 0 0 0 0 0 982.009 0 0 0 0 0 0 1265.22 0 0 0.08 2212.36 0 1936.02 0 0 0 0 0 -697.729 0 0 0 
1182.21 0 0 0 1081.35 191.427 0 0 0 711.921 1764.35 0 0 0 0 -2216.33 -2079.15 0 0 1909.62 0 0 0 0 0 0 -613.193 1279.11 0 0 0 0 0 0 0 0 0 0 1602.76 0 0 0 0 165.792 -1772.74 0 785.012 2320.25 0 0 -238.884 0 0 0 0 973.769 -101.55 0 0 0 0 0 0 
0 0 -1776.1 1301.39 0 -767.922 0 0 0 0 0 0 0 541.475 0 -254.295 0 0 1770 -539.491 0 0 0 0 2421.41 0 -1853.31 0 0 0 0 0 0 0 0 0 0 1384.55 0 0 0 994.98 0 -676.672 0 0 0 0 0 0 0 0 0.02 976.211 0 0 0 0 0 0 836.131 0 -966.445 
0 -48.1429 0 0 0 0 0 262.078 1580.78 0 0 0 0 0 0 9.07926 0 0 0 0 0 0 0 0 0 0 -1099.96 0 0 0 0 0 0 -275.964 0 2468.41 0 1933.58 -1144.22 1252.25 0 0 0 -583.132 0 884.198 1554.23 0 2414.55 0 -597.476 0 910.596 0.03 0 0 0 2160.33 1152.76 0 0 0 0 
0 0 0 0 0 0 0 0 0 0 0 629.368 0 20.0659 0 0 971.175 0 804.239 0 -575.961 2194.66 -694.372 -238.731 673.772 1746.19 0 0 0 0 0 0 -813.242 0 0 0 607.395 1814.1 2261.96 0 0 0 752.815 0 0 0 0 0 0 0 0 0 0 0 0.01 1275.6 0 0 0 163.045 1290.25 0 0 
692.083 0 0 0 -120.93 0 0 348.598 0 0 0 -904.34 0 0 -1970.5 1945.48 0 0 0 -490.356 -56.2304 0 -194.327 417.417 0 1061.05 0 0 0 0 0 0 0 0 0 1351.59 0 933.79 0 0 0 0 0 824.839 0 1365.78 -890.454 0 760.292 0 0 1736.73 0 0 1991.1 0.06 0 0 0 0 0 0 0 
443.205 487.304 0 0 -1130.79 419.858 -706.885 0 0 -1598.18 0 1357.39 0 0 0 2297.36 0 0 0 0 0 0 0 0 2415.01 -2009.72 0 0 0 0 -514.161 0 0 0 0 0 0 0 0 0 0 0 0 0 -1939.38 0 0 0 0 902.661 0 912.58 0 0 0 0 0 0 0 2226.25 0 376.675 0 
0 145.65 0 0 0 0 0 0 0 -930.891 -527.284 0 0 -1689.12 0 2013.38 1743.9 0 0 0 1740.24 -1695.84 0 -461.821 2497.25 -1596.35 0 2160.18 0 0 0 1871.62 0 0 1898.18 0 0 513.703 0 -2181.54 0 0 0 0 922.193 0 774.178 0 0 0 0 0 0 1826.46 0 0 0 0.04 0 0 0 -174.032 0 
0 1201.44 0 0 0 0 0 0 1991.26 -322.81 -52.8733 2494.2 0 0 0 -1690.5 0 0 0 0 0 0 0 0 0 0 1506.62 0 -2469.02 2459.87 0 0 0 0 102.924 0 0 0 0 1025.35 422.758 422.3 0 0 0 0 1701.94 0 0 0 0 0 0 983.688 0 0 0 0 0.01 -1975.39 0 0 0 
0 0 0 0 0 0 0 0 780.435 0 0 290.613 0 0 0 0 0 0 0 0 0 0 -1707.89 0 0 0 0 0 0 2320.86 0 0 0 0 0 2279.05 0 0 0 0 0 0 0 724.433 0 -2498.63 0 0 0 0 1687.14 0 0 0 2428.89 0 38.8348 0 -701.544 0.04 0 0 0 
0 0 0 0 0 0 313.044 0 0 0 877.789 0 0 2471.77 0 0 0 0 -1640.75 0 0 0 1293.76 0 0 -1031.91 0 0 0 -1169.85 0 0 0 893.658 2386.32 0 0 0 0 0 0 0 0 0 0 0 -1279.11 0 0 363.704 0 0 1105.61 0 1944.56 0 0 0 0 0 0.09 0 0 
0 -1488.62 0 0 0 250.481 -7.70592 -162.435 0 0 0 2488.1 0 0 0 0 0 0 0 0 0 0 0 0 0 1476.41 -1062.73 0 1297.88 1566.59 -895.795 -790.048 0 0 1657.23 0 0 0 0 0 650.426 0 -342.189 0 -1138.11 0 847.728 0 0 399.869 0 0 0 0 0 0 -1037.71 1346.25 0 0 0 0.05 0 
1297.72 0 0 0 0 2418.52 0 0 0 0 0 0 0 0 0 0 1247.67 0 0 -16.0985 0 0 0 -1455.66 0 -1782.66 0 0 0 0 0 0 0 0 393.002 0 -604.953 0 -997.269 0 0 0 0 0 0 0 0 0 0 0 0 0 1272.39 0 0 0 0 0 0 0 0 0 0 
