*Vertices 52
*Matrix 
0.09 2327.11 0 -542.543 -667.211 0 0 0 0 0 0 0 0 0 0 0 0 -2090.29 0 0 0 0 0 0 0 0 0 0 0 0 0 0 0 1606.72 0 0 -1932.05 0 1405.3 0 0 180.746 1410.95 0 -1485.26 0 0 0 0 0 0 0 
-2033.52 0.07 0 0 769.295 0 0 0 1394.47 0 0 0 0 0 0 0 0 0 0 2385.86 0 0 0 0 0 0 0 0 1949.75 0 0 -533.235 0 0 0 0 0 0 0 0 0 0 0 0 0 773.263 0 0 0 0 0 0 
0 0 0.08 -579.928 0 0 0 0 0 0 803.476 0 0 -59.1296 0 0 0 0 0 2482.76 0 0 0 0 0 0 0 2299.04 0 0 2191 0 -24.1859 0 0 0 0 0 0 0 0 0 0 0 0 0 0 0 0 0 0 0 
-992.538 0 -118.183 0.02 0 0 0 0 0 0 0 0 0 1421.93 0 0 0 0 0 0 0 0 0 0 0 0 0 0 0 0 0 0 0 0 808.664 0 0 0 0 0 0 0 0 0 0 0 0 0 0 0 0 0 
1831.64 -382.168 0 0 0.06 0 2026.66 0 0 0 0 0 237.358 1585.36 0 0 0 0 0 0 0 0 0 0 2386.47 0 0 0 -978.347 0 0 0 0 0 0 0 0 0 0 0 0 0 -2116.53 -272.149 0 0 0 0 0 0 -483.642 0 
0 0 0 0 0 0.08 0 0 0 0 0 0 0 0 0 0 0 0 -1530.27 0 0 0 0 0 0 0 0 0 0 0 0 0 0 0 0 2417.29 0 0 1154.29 875.347 0 0 0 0 0 220.267 0 0 0 0 0 0 
0 0 0 0 182.882 0 0.04 0 256.584 0 0 0 0 0 0 -574.587 -607.395 0 0 0 0 0 1325.95 344.172 0 0 0 1824.02 0 0 0 0 0 0 0 0 0 -965.529 0 0 0 2111.04 0 0 0 0 0 0 0 0 0 0 
0 0 0 0 0 0 0 0.02 0 0 0 0 0 0 0 0 0 1669.29 0 0 0 0 0 0 0 0 0 0 0 1184.65 0 0 -2255.55 0 0 0 0 0 2485.81 0 0 1617.86 0 0 0 0 0 0 845.744 0 0 0 
0 -2344.2 0 0 0 0 1216.39 0 0.07 528.504 0 0 0 -1508.45 0 0 0 0 0 0 0 0 0 -93.7681 0 0 512.482 4.80667 2456.97 33.0363 0 0 0 0 0 0 0 0 938.826 0 0 0 0 0 0 0 0 0 0 -624.943 0 0 
0 0 0 0 0 0 0 0 -629.673 0.05 0 0 0 0 0 0 0 0 0 2489.78 0 0 0 0 0 0 0 0 -949.049 0 0 0 0 0 0 2062.82 0 0 0 0 0 1269.34 0 0 0 0 0 0 0 0 0 0 
0 0 -1221.58 0 0 0 0 0 0 0 0.05 0 0 0 0 0 0 0 0 0 0 0 0 0 0 0 33.7992 0 2174.67 0 0 0 0 0 0 0 0 0 0 0 0 0 0 0 0 0 0 0 0 0 0 0 
0 0 0 0 0 0 0 0 0 0 0 0.07 -1738.56 0 0 1860.79 0 0 0 0 0 0 0 0 0 0 0 0 592.746 0 0 1323.97 0 0 0 0 0 0 0 0 -1364.25 2045.73 0 0 0 0 0 1367.31 0 0 0 0 
0 0 0 0 1793.5 0 0 0 0 0 0 1731.54 0.05 0 0 0 0 0 0 0 0 1810.59 0 0 0 0 0 0 0 0 0 0 0 1362.73 869.549 0 0 0 0 0 0 0 0 0 0 0 0 0 0 0 0 0 
0 0 1831.34 -383.084 2292.02 0 0 0 555.971 0 0 0 0 0.07 0 0 367.061 0 0 0 0 0 1825.54 0 0 0 0 -2354.73 0 0 0 0 1847.06 0 0 0 0 -1379.06 0 0 -790.963 0 0 0 0 0 0 0 -487.762 0 0 0 
0 0 0 0 0 0 0 0 0 0 0 0 0 0 0.02 0 0 0 0 0 0 0 0 0 0 0 0 0 0 0 0 0 0 1801.13 0 0 0 0 0 0 0 0 0 0 978.805 0 0 0 0 0 0 0 
0 0 0 0 0 0 2426.3 0 0 0 0 1019.09 0 0 0 0.01 0 -19.6081 0 1274.68 0 0 0 0 0 0 0 0 6.94296 1702.4 0 -2484.74 0 -1475.95 0 0 0 0 0 0 0 0 0 0 0 0 0 0 0 0 2211.91 0 
0 0 0 0 0 0 1464.05 0 0 0 0 0 0 2487.79 0 0 0.03 0 0 0 0 0 437.559 0 0 0 0 0 0 0 0 0 0 0 0 0 0 0 0 1518.22 0 0 0 0 0 1023.21 0 0 0 -1474.12 235.527 0 
1852.4 0 0 0 0 0 0 1909.77 0 0 0 0 0 0 0 2206.56 0 0.07 0 1336.48 0 0 0 0 0 0 0 0 0 -931.196 0 0 0 0 -1125.9 0 0 0 0 0 0 0 0 0 0 0 0 0 0 0 0 0 
0 0 0 0 0 1932.81 0 0 0 0 0 0 0 0 0 0 0 0 0 0 0 0 0 0 0 0 0 56.9933 0 0 0 0 0 0 0 0 0 0 1712.62 0 0 0 -1660.28 0 0 0 2037.64 0 0 0 0 0 
0 -404.141 -1282.16 0 0 0 0 0 0 996.048 0 0 0 0 0 2072.74 0 -1998.28 0 0.08 0 0 0 1146.96 0 -690.1 0 0 0 0 0 0 992.08 0 0 0 0 2434.23 0 0 190.664 0 0 -917.31 0 0 1584.6 0 0 0 0 0 
0 0 0 0 0 0 0 0 0 0 0 0 0 0 0 0 0 0 0 0 0.07 0 0 0 -2121.42 0 0 0 0 1957.23 0 0 0 0 2391.51 0 0 0 0 0 0 1364.86 0 0 0 0 0 0 0 0 0 0 
0 0 0 0 0 0 0 0 0 0 0 0 1821.88 0 0 0 0 0 0 0 0 0.07 0 0 0 0 0 0 0 0 0 0 0 0 0 0 2418.06 1995.53 775.704 0 0 0 0 0 2409.05 0 0 0 0 2351.22 0 0 
0 0 0 0 0 0 1402.1 0 0 0 0 0 0 1278.95 0 0 2236.63 0 0 0 0 0 0.06 0 0 45.3963 0 0 0 0 0 0 0 0 0 0 0 0 1341.98 0 0 0 0 0 0 1206.32 0 -841.929 -1015.12 2152.55 0 0 
0 0 0 0 0 0 539.338 0 486.541 0 0 0 0 0 0 0 0 0 0 2140.03 0 0 0 0.06 0 0 0 2079.45 0 0 2305.14 0 -346.309 0 0 0 0 0 0 0 0 1981.8 763.039 734.504 0 0 0 0 -475.402 -1884.9 -928.907 0 
0 0 0 0 190.207 0 0 0 0 0 0 0 0 0 0 0 0 0 0 0 1351.44 0 0 0 0.05 0 0 0 0 0 0 0 0 0 0 0 0 1628.54 -759.377 0 1719.49 0 0 0 0 0 0 2295.07 0 0 0 0 
0 0 0 0 0 0 0 0 0 0 0 0 0 0 0 0 0 0 0 978.347 0 0 2452.7 0 0 0.02 0 0 0 0 0 0 0 0 0 0 0 0 0 1023.36 -1812.57 0 0 0 0 0 0 2147.36 0 0 0 0 
0 0 0 0 0 0 0 0 236.9 0 455.87 0 0 0 0 0 0 0 0 0 0 0 0 0 0 0 0.01 0 0 0 0 0 0 0 0 0 0 0 0 0 0 0 0 0 0 0 2308.95 0 0 0 0 0 
0 0 760.903 0 0 0 -2194.51 0 1493.19 0 0 0 0 598.086 0 0 0 0 1472.14 0 0 0 0 -2148.73 0 0 0 0.09 812.174 0 0 0 0 0 0 0 0 0 0 0 0 0 1378.9 0 0 0 536.592 0 0 0 0 0 
0 -1176.26 0 0 -290.002 0 0 0 2132.4 2001.94 189.291 -255.058 0 0 0 989.792 0 0 0 0 0 0 0 0 0 0 0 -2235.56 0.01 0 0 0 0 0 0 0 0 0 0 0 -1520.97 0 0 0 0 0 0 0 1372.65 0 1072.34 0 
0 0 0 0 0 0 0 557.497 -21.5918 0 0 0 0 0 0 -215.384 0 -740.15 0 0 1713.08 0 0 0 0 0 0 0 0 0.03 0 0 1440.55 0 0 0 943.556 0 0 0 -458.312 0 0 732.215 0 0 546.358 0 2230.52 0 0 0 
0 0 -201.193 0 0 0 0 0 0 0 0 0 0 0 0 0 0 0 0 0 0 0 0 -153.432 0 0 0 0 0 0 0.03 0 0 1531.19 0 0 0 0 0 0 0 -859.63 0 0 0 0 0 0 0 0 1768.17 0 
0 1626.41 0 0 0 0 0 0 0 0 0 -1564.76 0 0 0 2085.1 0 0 0 0 0 0 0 0 0 0 0 0 0 0 0 0 0 0 2355.49 0 0 0 0 0 0 0 -2148.58 0 1811.35 0 -2262.26 1218.99 0 0 0 203.94 
0 0 1406.22 0 0 0 0 -624.943 0 0 0 0 0 340.815 0 0 0 0 0 -1802.8 0 0 0 2378.38 0 0 0 0 0 1750.92 0 0 0.03 0 0 0 0 0 0 -1166.65 0 -1399.81 0 0 0 0 0 0 0 0 0 0 
1008.41 0 0 0 0 0 0 0 0 0 0 0 205.771 0 763.955 899.762 0 0 0 0 0 0 0 0 0 0 0 0 0 0 238.884 0 0 0 0 0 0 0 0 -987.35 0 0 0 2234.64 0 0 0 0 1733.68 0 0 1944.72 
0 0 0 1239.43 0 0 0 0 0 0 0 0 2230.06 0 0 0 0 1427.58 0 0 871.38 0 0 0 0 0 0 0 0 0 0 112.537 0 0 0.08 0 0 0 0 0 0 0 1321.38 0 0 0 0 0 2142.63 0 0 0 
0 0 0 0 0 517.67 0 0 0 880.84 0 0 0 0 0 0 0 0 0 0 0 0 0 0 0 0 0 0 0 0 0 0 0 0 0 0.06 0 0 0 -1694.46 0 0 -778.756 0 0 0 0 0 2234.79 0 0 0 
1024.58 0 0 0 0 0 0 0 0 0 0 0 0 0 0 0 0 0 0 0 0 1700.57 0 0 0 0 0 0 0 -1446.65 0 0 0 0 0 0 0.03 0 0 1956.16 0 0 -716.498 -664.159 0 0 0 0 0 1758.86 0 0 
0 0 0 0 0 0 -760.445 0 0 0 0 0 0 1874.68 0 0 0 0 0 2457.12 0 2371.97 0 0 -1143.76 0 0 0 0 0 0 0 0 0 0 0 0 0.07 0 0 0 0 0 0 0 0 0 0 0 0 0 0 
943.403 0 0 0 0 92.2422 0 2345.12 -118.793 0 0 0 0 0 0 0 0 0 1099.81 0 0 -37.9192 1628.7 0 561.464 0 0 0 0 0 0 0 0 0 0 0 0 0 0.06 0 0 0 0 0 0 0 0 0 -1018.63 0 1749.85 0 
0 0 0 0 0 166.555 0 0 0 0 0 0 0 0 0 0 190.054 0 0 0 0 0 0 0 0 2359.61 0 0 0 0 0 0 -516.297 2181.84 0 -151.448 -157.094 0 0 0.01 0 0 0 696.356 0 0 0 0 0 0 0 0 
0 0 0 0 0 0 0 0 0 0 0 2450.1 0 -1847.21 0 0 0 0 0 167.165 0 0 0 0 1820.81 426.725 0 0 2302.09 2011.86 0 0 0 0 0 0 0 0 0 0 0.07 0 1616.18 0 0 0 0 0 0 0 0 0 
498.444 0 0 0 0 0 1058.15 -107.349 0 -1850.26 0 -1623.51 0 0 0 0 0 0 0 0 -592.135 0 0 1950.06 0 0 0 0 0 0 438.78 0 1892.53 0 0 0 0 0 0 0 0 0.09 0 0 0 0 0 0 0 0 0 0 
-1407.9 0 0 0 -1145.44 0 0 0 0 0 0 0 0 0 0 0 0 0 -1124.07 0 0 0 0 -1375.85 0 0 0 1564.91 0 0 0 1103.47 0 0 1667 -184.103 -3.58592 0 0 0 940.657 0 0.08 0 0 0 0 0 0 1318.17 0 0 
0 0 0 0 411.466 0 0 0 0 0 0 0 0 0 0 0 0 0 0 -1610.23 0 0 0 -122.608 0 0 0 0 0 1170.46 0 0 0 -1067.61 0 0 1394.31 0 0 1421.78 0 0 0 0.03 0 0 1663.64 0 0 1129.11 0 0 
1809.98 0 0 0 0 0 0 0 0 0 0 0 0 0 857.799 0 0 0 0 0 0 -1258.2 0 0 0 0 0 0 0 0 0 -1322.29 0 0 0 0 0 0 0 0 0 0 0 0 0.07 0 0 0 0 0 0 0 
0 1421.32 0 0 0 1640.9 0 0 0 0 0 0 0 0 0 0 -1580.32 0 0 0 0 0 1754.74 0 0 0 0 0 0 0 0 0 0 0 0 0 0 0 0 0 0 0 0 0 0 0.03 0 662.328 0 0 0 0 
0 0 0 0 0 0 0 0 0 0 0 0 0 0 0 0 0 0 1632.05 588.168 0 0 0 0 0 0 -273.064 1770.46 0 -1487.24 0 1713.84 0 0 0 0 0 0 0 0 0 0 0 -1783.88 0 0 0.09 2307.58 914.716 0 0 0 
0 0 0 0 0 0 0 0 0 0 0 444.884 0 0 0 0 0 0 0 0 0 0 2364.19 0 2095.17 1075.24 0 0 0 0 0 2217.55 0 0 0 0 0 0 0 0 0 0 0 0 0 1542.33 -716.956 0.06 0 2071.83 0 0 
0 0 0 0 0 0 0 -1083.33 0 0 0 0 0 -1382.41 0 0 0 0 0 0 0 0 1298.64 121.693 0 0 0 0 1590.85 1462.98 0 0 0 2189.32 1737.34 -1884.14 0 0 1482.97 0 0 0 0 0 0 0 1806.92 0 0.05 0 0 0 
0 0 0 0 0 0 0 0 -1619.54 0 0 0 0 0 0 0 -2033.98 0 0 0 0 343.41 1002.3 2409.97 0 0 0 0 0 0 0 0 0 0 0 0 766.243 0 0 0 0 0 266.655 -1699.96 0 0 0 2463.53 0 0.01 0 0 
0 0 0 0 -1995.53 0 0 0 0 0 0 0 0 0 0 -2211.29 1337.7 0 0 0 0 0 0 -687.658 0 0 0 0 2437.44 0 1551.48 0 0 0 0 0 0 0 1302.3 0 0 0 0 0 0 0 0 0 0 0 0.06 0 
0 0 0 0 0 0 0 0 0 0 0 0 0 0 0 0 0 0 0 0 0 0 0 0 0 0 0 0 0 0 0 -510.804 0 1123.16 0 0 0 0 0 0 0 0 0 0 0 0 0 0 0 0 0 0.02 
