[
  {
    "type": "date_keyword",
    "named": true,
    "fields": {}
  },
  {
    "type": "date_query",
    "named": true,
    "fields": {},
    "children": {
      "multiple": true,
      "required": true,
      "types": [
        {
          "type": "date_keyword",
          "named": true
        },
        {
          "type": "date_literal",
          "named": true
        }
      ]
    }
  },
  {
    "type": "field",
    "named": true,
    "fields": {}
  },
  {
    "type": "op",
    "named": true,
    "fields": {}
  },
  {
    "type": "query",
    "named": true,
    "fields": {},
    "children": {
      "multiple": true,
      "required": true,
      "types": [
        {
          "type": "date_query",
          "named": true
        },
        {
          "type": "field",
          "named": true
        },
        {
          "type": "identifier",
          "named": true
        },
        {
          "type": "op",
          "named": true
        },
        {
          "type": "query",
          "named": true
        }
      ]
    }
  },
  {
    "type": "&",
    "named": false
  },
  {
    "type": "(",
    "named": false
  },
  {
    "type": ")",
    "named": false
  },
  {
    "type": "+",
    "named": false
  },
  {
    "type": "A",
    "named": false
  },
  {
    "type": "F",
    "named": false
  },
  {
    "type": "T",
    "named": false
  },
  {
    "type": "a",
    "named": false
  },
  {
    "type": "date_literal",
    "named": true
  },
  {
    "type": "f",
    "named": false
  },
  {
    "type": "identifier",
    "named": true
  },
  {
    "type": "t",
    "named": false
  },
  {
    "type": "|",
    "named": false
  }
]