<svg width="60" height="50" viewBox="0 0 60 50" fill="none" xmlns="http://www.w3.org/2000/svg">
<path d="M18.5536 49.2666H17.9628C12.3607 49.2666 7.41514 47.0345 4.04515 42.9862C0.675153 38.9378 -0.681597 33.4233 0.325024 27.8431L0.346905 27.6899L4.35151 8.41091C5.008 5.25975 8.09351 3.2465 11.2447 3.903C14.3958 4.55949 16.4091 7.645 15.7526 10.7962L11.748 29.9876C11.376 32.1759 11.7918 34.1235 12.9734 35.524C14.0895 36.8808 15.862 37.6029 17.9628 37.6029H18.5536C23.8056 37.6029 29.0575 33.1169 30.0203 27.8212L30.0641 27.6461L34.0687 8.84857C34.9003 4.55949 38.8392 0.0078125 45.623 0.0078125H52.9976C56.2144 0.0078125 58.8185 2.6119 58.8185 5.82871C58.8185 9.04552 56.2144 11.6496 52.9976 11.6496H45.623C45.5354 11.6496 45.4479 11.6496 45.3823 11.6496L41.4652 29.9876C39.4519 40.8197 29.4076 49.2666 18.5536 49.2666ZM45.4917 11.1463L45.4479 11.2995C45.4698 11.2557 45.4698 11.2119 45.4917 11.1463Z" fill="white"/>
<path d="M54.201 30.469C54.0041 30.469 53.8071 30.469 53.6321 30.4471C53.4351 30.4252 53.26 30.4033 53.0631 30.3596C52.8662 30.3158 52.6911 30.272 52.516 30.2283C52.341 30.1626 52.144 30.1189 51.9689 30.0313C51.7939 29.9657 51.6188 29.8781 51.4438 29.7906C51.2687 29.7031 51.1155 29.5937 50.9623 29.5061C50.8092 29.3967 50.656 29.2873 50.5028 29.156C50.3496 29.0466 50.2183 28.9153 50.087 28.7621C48.9929 27.6898 48.3801 26.1799 48.3801 24.6481C48.3801 24.4511 48.3801 24.2542 48.402 24.0791C48.4239 23.8822 48.4458 23.7071 48.4895 23.5102C48.5333 23.3351 48.5771 23.1382 48.6208 22.9631C48.6865 22.788 48.7521 22.5911 48.8178 22.416C48.8834 22.241 48.971 22.0659 49.0585 21.8908C49.146 21.7158 49.2554 21.5626 49.343 21.4094C49.4524 21.2562 49.5618 21.103 49.6712 20.9499C49.8025 20.7967 49.9119 20.6654 50.0651 20.5341C50.1964 20.4028 50.3496 20.2715 50.4809 20.1402C50.6341 20.0308 50.7873 19.8995 50.9404 19.8119C51.0936 19.7025 51.2687 19.615 51.4219 19.5275C51.5969 19.4399 51.772 19.3524 51.9471 19.2867C52.1221 19.2211 52.2972 19.1554 52.4941 19.0898C52.6692 19.0241 52.8662 18.9804 53.0412 18.9585C53.2382 18.9147 53.4132 18.8928 53.6102 18.871C53.9822 18.8272 54.3761 18.8272 54.7481 18.871C54.945 18.8928 55.1201 18.9147 55.3171 18.9585C55.4921 19.0023 55.6891 19.046 55.8641 19.0898C56.0392 19.1554 56.2362 19.1992 56.4112 19.2867C56.5863 19.3524 56.7613 19.4399 56.9364 19.5275C57.1115 19.615 57.2647 19.7244 57.4178 19.8119C57.571 19.9214 57.7242 20.0308 57.8774 20.1402C58.0306 20.2715 58.1619 20.4028 58.2932 20.5341C58.4245 20.6654 58.5558 20.8186 58.6871 20.9499C58.7965 21.103 58.9278 21.2562 59.0372 21.4094C59.1466 21.5626 59.2341 21.7376 59.3217 21.8908C59.4092 22.0659 59.4967 22.241 59.5624 22.416C59.628 22.5911 59.6937 22.7661 59.7593 22.9631C59.825 23.1382 59.8687 23.3351 59.8906 23.5102C59.9344 23.7071 59.9563 23.8822 59.9782 24.0791C60 24.2761 60 24.473 60 24.6481C60 26.1799 59.3873 27.6898 58.2932 28.7621C58.1619 28.8934 58.0087 29.0247 57.8774 29.156C57.7242 29.2654 57.571 29.3967 57.4178 29.5061C57.2647 29.6155 57.0896 29.7031 56.9364 29.7906C56.7613 29.8781 56.5863 29.9657 56.4112 30.0313C56.2362 30.097 56.0611 30.1626 55.8641 30.2283C55.6891 30.2939 55.4921 30.3377 55.3171 30.3596C55.1201 30.4033 54.945 30.4252 54.7481 30.4471C54.5949 30.4471 54.398 30.469 54.201 30.469Z" fill="white"/>
</svg>
