<?xml version="1.0" encoding="UTF-8" standalone="no"?>
<!-- Created with Inkscape (http://www.inkscape.org/) -->

<svg
   xmlns:dc="http://purl.org/dc/elements/1.1/"
   xmlns:cc="http://creativecommons.org/ns#"
   xmlns:rdf="http://www.w3.org/1999/02/22-rdf-syntax-ns#"
   xmlns:svg="http://www.w3.org/2000/svg"
   xmlns="http://www.w3.org/2000/svg"
   xmlns:sodipodi="http://sodipodi.sourceforge.net/DTD/sodipodi-0.dtd"
   xmlns:inkscape="http://www.inkscape.org/namespaces/inkscape"
   width="115.81845mm"
   height="56.61517mm"
   viewBox="0 0 115.81845 56.61517"
   version="1.1"
   id="svg556"
   inkscape:version="0.92.1 r15371"
   sodipodi:docname="inversesceme.svg"
   inkscape:export-filename="C:\Robert\Uni\Studienarbeit\tupaper\pictures\inversesceme.png"
   inkscape:export-xdpi="96"
   inkscape:export-ydpi="96">
  <defs
     id="defs550">
    <inkscape:path-effect
       effect="powerstroke"
       id="path-effect109"
       is_visible="true"
       offset_points="0,0.091570447"
       sort_points="true"
       interpolator_type="CubicBezierJohan"
       interpolator_beta="0.2"
       start_linecap_type="zerowidth"
       linejoin_type="extrp_arc"
       miter_limit="4"
       end_linecap_type="zerowidth" />
  </defs>
  <sodipodi:namedview
     id="base"
     pagecolor="#ffffff"
     bordercolor="#666666"
     borderopacity="1.0"
     inkscape:pageopacity="0.0"
     inkscape:pageshadow="2"
     inkscape:zoom="1.979899"
     inkscape:cx="66.098818"
     inkscape:cy="112.62715"
     inkscape:document-units="mm"
     inkscape:current-layer="layer1"
     showgrid="false"
     inkscape:window-width="1920"
     inkscape:window-height="1027"
     inkscape:window-x="-8"
     inkscape:window-y="-8"
     inkscape:window-maximized="1"
     fit-margin-top="0"
     fit-margin-left="0"
     fit-margin-right="0"
     fit-margin-bottom="0" />
  <metadata
     id="metadata553">
    <rdf:RDF>
      <cc:Work
         rdf:about="">
        <dc:format>image/svg+xml</dc:format>
        <dc:type
           rdf:resource="http://purl.org/dc/dcmitype/StillImage" />
        <dc:title></dc:title>
      </cc:Work>
    </rdf:RDF>
  </metadata>
  <g
     inkscape:label="Ebene 1"
     inkscape:groupmode="layer"
     id="layer1"
     transform="translate(-46.726154,-12.989368)">
    <rect
       style="fill:#ececec;stroke:#000000;stroke-width:0.25;stroke-miterlimit:4;stroke-dasharray:none;stroke-opacity:1"
       id="rect10"
       width="13.098559"
       height="3.3818343"
       x="57.631416"
       y="13.114368" />
    <rect
       style="fill:#ececec;stroke:#000000;stroke-width:0.25;stroke-miterlimit:4;stroke-dasharray:none;stroke-opacity:1"
       id="rect10-1"
       width="13.098559"
       height="3.3818343"
       x="70.72998"
       y="13.114368" />
    <rect
       style="fill:#ececec;stroke:#000000;stroke-width:0.25;stroke-miterlimit:4;stroke-dasharray:none;stroke-opacity:1"
       id="rect10-11"
       width="13.098559"
       height="3.3818343"
       x="83.828537"
       y="13.114368" />
    <rect
       style="fill:#ececec;stroke:#000000;stroke-width:0.25;stroke-miterlimit:4;stroke-dasharray:none;stroke-opacity:1"
       id="rect10-4"
       width="13.098559"
       height="3.3818343"
       x="96.927124"
       y="13.114368" />
    <rect
       style="fill:#ececec;stroke:#000000;stroke-width:0.25;stroke-miterlimit:4;stroke-dasharray:none;stroke-opacity:1"
       id="rect10-10"
       width="13.098559"
       height="3.3818343"
       x="110.02568"
       y="13.114368" />
    <rect
       style="fill:#ececec;stroke:#000000;stroke-width:0.25;stroke-miterlimit:4;stroke-dasharray:none;stroke-opacity:1"
       id="rect10-0"
       width="13.098559"
       height="3.3818343"
       x="123.12416"
       y="13.114368" />
    <rect
       style="fill:#ececec;stroke:#000000;stroke-width:0.25;stroke-miterlimit:4;stroke-dasharray:none;stroke-opacity:1"
       id="rect10-3"
       width="13.098559"
       height="3.3818343"
       x="136.22261"
       y="13.114368" />
    <rect
       style="fill:#ececec;stroke:#000000;stroke-width:0.25;stroke-miterlimit:4;stroke-dasharray:none;stroke-opacity:1"
       id="rect10-6"
       width="13.098559"
       height="3.3818343"
       x="149.32103"
       y="13.114368" />
    <rect
       style="fill:#f9f9f9;stroke:#000000;stroke-width:0.25;stroke-miterlimit:4;stroke-dasharray:none;stroke-opacity:1"
       id="rect10-31"
       width="13.098559"
       height="3.3818343"
       x="57.631424"
       y="23.191904" />
    <rect
       style="fill:#f9f9f9;stroke:#000000;stroke-width:0.25;stroke-miterlimit:4;stroke-dasharray:none;stroke-opacity:1"
       id="rect10-1-0"
       width="13.098559"
       height="3.3818343"
       x="70.72998"
       y="23.191904" />
    <rect
       style="fill:#f9f9f9;stroke:#000000;stroke-width:0.25;stroke-miterlimit:4;stroke-dasharray:none;stroke-opacity:1"
       id="rect10-11-1"
       width="13.098559"
       height="3.3818343"
       x="83.828537"
       y="23.191904" />
    <rect
       style="fill:#f9f9f9;stroke:#000000;stroke-width:0.25;stroke-miterlimit:4;stroke-dasharray:none;stroke-opacity:1"
       id="rect10-4-4"
       width="13.098559"
       height="3.3818343"
       x="96.927124"
       y="23.191904" />
    <rect
       style="fill:#4d4d4d;stroke:#000000;stroke-width:0.25;stroke-miterlimit:4;stroke-dasharray:none;stroke-opacity:1"
       id="rect10-10-4"
       width="13.098559"
       height="3.3818343"
       x="110.02568"
       y="23.191904" />
    <rect
       style="fill:#4d4d4d;stroke:#000000;stroke-width:0.25;stroke-miterlimit:4;stroke-dasharray:none;stroke-opacity:1"
       id="rect10-0-2"
       width="13.098559"
       height="3.3818343"
       x="123.12416"
       y="23.191904" />
    <rect
       style="fill:#4d4d4d;stroke:#000000;stroke-width:0.25;stroke-miterlimit:4;stroke-dasharray:none;stroke-opacity:1"
       id="rect10-3-4"
       width="13.098559"
       height="3.3818343"
       x="136.22266"
       y="23.191904" />
    <rect
       style="fill:#4d4d4d;stroke:#000000;stroke-width:0.25;stroke-miterlimit:4;stroke-dasharray:none;stroke-opacity:1"
       id="rect10-6-5"
       width="13.098559"
       height="3.3818343"
       x="149.32104"
       y="23.191904" />
    <path
       style="fill:#000000;fill-rule:nonzero;stroke:none;stroke-width:0.25;stroke-linecap:butt;stroke-linejoin:miter;stroke-opacity:1"
       d="m 103.33508,17.444491 c 0,0.519168 0,2.076672 0,2.59584 z m 0.18314,2.59584 c 0,-0.519168 0,-2.076672 0,-2.59584 z"
       id="path107"
       inkscape:connector-curvature="0"
       inkscape:path-effect="#path-effect109"
       inkscape:original-d="m 103.42665,20.040331 v 0.86528 l 0.78862,-0.73942 c 0,0 -1.22285,0.109203 -0.78862,-0.12586 z" />
    <path
       style="fill:none;stroke:#000000;stroke-width:0.25;stroke-linecap:butt;stroke-linejoin:miter;stroke-opacity:1"
       d="m 110.02565,16.516015 c 0,6.540081 0,6.540081 0,6.540081"
       id="path99"
       inkscape:connector-curvature="0" />
    <path
       sodipodi:type="star"
       style="fill:#000000;stroke:#000000;stroke-width:0.36108583;stroke-miterlimit:4;stroke-dasharray:none;stroke-opacity:1"
       id="path121"
       sodipodi:sides="3"
       sodipodi:cx="100.54167"
       sodipodi:cy="21.644344"
       sodipodi:r1="1.2284226"
       sodipodi:r2="0.61421126"
       sodipodi:arg1="1.5707963"
       sodipodi:arg2="2.6179939"
       inkscape:flatsided="true"
       inkscape:rounded="0"
       inkscape:randomized="0"
       d="m 100.54167,22.872767 -1.063843,-1.842634 2.127693,0 z"
       inkscape:transform-center-y="0.5292198"
       transform="matrix(0.58518642,0,0,0.81915271,51.190031,4.3198071)" />
    <text
       xml:space="preserve"
       style="font-style:normal;font-weight:normal;font-size:3.17499995px;line-height:1.25;font-family:sans-serif;letter-spacing:0px;word-spacing:0px;fill:#000000;fill-opacity:1;stroke:none;stroke-width:0.25"
       x="52.273689"
       y="16.344357"
       id="text129"
       transform="scale(1.0327325,0.96830495)"><tspan
         sodipodi:role="line"
         id="tspan127"
         x="52.273689"
         y="16.344357"
         style="font-size:3.17499995px;stroke-width:0.25">a:</tspan></text>
    <text
       xml:space="preserve"
       style="font-style:normal;font-weight:normal;font-size:3.17499995px;line-height:1.25;font-family:sans-serif;letter-spacing:0px;word-spacing:0px;fill:#000000;fill-opacity:1;stroke:none;stroke-width:0.25"
       x="45.125103"
       y="26.785862"
       id="text133"
       transform="scale(1.0327325,0.96830495)"><tspan
         sodipodi:role="line"
         id="tspan131"
         x="45.125103"
         y="26.785862"
         style="font-size:3.17499995px;stroke-width:0.25">a1,a0:</tspan></text>
    <text
       xml:space="preserve"
       style="font-style:normal;font-weight:normal;font-size:3.17499995px;line-height:1.25;font-family:sans-serif;letter-spacing:0px;word-spacing:0px;fill:#000000;fill-opacity:1;stroke:none;stroke-width:0.25"
       x="107.82522"
       y="21.631609"
       id="text311"
       transform="scale(1.0327325,0.96830495)"><tspan
         sodipodi:role="line"
         id="tspan309"
         x="107.82522"
         y="21.631609"
         style="font-size:3.17499995px;stroke-width:0.25">T(a)</tspan></text>
    <rect
       style="fill:#ffffff;stroke:#000000;stroke-width:0.25;stroke-miterlimit:4;stroke-dasharray:none;stroke-opacity:1"
       id="rect651"
       width="47.021492"
       height="15.643934"
       x="86.318626"
       y="33.312801" />
    <rect
       style="fill:#f9f9f9;stroke:#000000;stroke-width:0.25;stroke-miterlimit:4;stroke-dasharray:none;stroke-opacity:1"
       id="rect10-31-5"
       width="13.098559"
       height="3.3818343"
       x="57.631424"
       y="56.175766" />
    <rect
       style="fill:#f9f9f9;stroke:#000000;stroke-width:0.25;stroke-miterlimit:4;stroke-dasharray:none;stroke-opacity:1"
       id="rect10-1-0-6"
       width="13.098559"
       height="3.3818343"
       x="70.72998"
       y="56.175766" />
    <rect
       style="fill:#f9f9f9;stroke:#000000;stroke-width:0.25;stroke-miterlimit:4;stroke-dasharray:none;stroke-opacity:1"
       id="rect10-11-1-6"
       width="13.098559"
       height="3.3818343"
       x="83.828537"
       y="56.175766" />
    <rect
       style="fill:#f9f9f9;stroke:#000000;stroke-width:0.25;stroke-miterlimit:4;stroke-dasharray:none;stroke-opacity:1"
       id="rect10-4-4-1"
       width="13.098559"
       height="3.3818343"
       x="96.927124"
       y="56.175766" />
    <rect
       style="fill:#4d4d4d;stroke:#000000;stroke-width:0.25;stroke-miterlimit:4;stroke-dasharray:none;stroke-opacity:1"
       id="rect10-10-4-1"
       width="13.098559"
       height="3.3818343"
       x="110.0256"
       y="56.175766" />
    <rect
       style="fill:#4d4d4d;stroke:#000000;stroke-width:0.25;stroke-miterlimit:4;stroke-dasharray:none;stroke-opacity:1"
       id="rect10-0-2-6"
       width="13.098559"
       height="3.3818343"
       x="123.12421"
       y="56.175766" />
    <rect
       style="fill:#4d4d4d;stroke:#000000;stroke-width:0.25;stroke-miterlimit:4;stroke-dasharray:none;stroke-opacity:1"
       id="rect10-3-4-8"
       width="13.098559"
       height="3.3818343"
       x="136.22266"
       y="56.175766" />
    <rect
       style="fill:#4d4d4d;stroke:#000000;stroke-width:0.25;stroke-miterlimit:4;stroke-dasharray:none;stroke-opacity:1"
       id="rect10-6-5-2"
       width="13.098559"
       height="3.3818343"
       x="149.32103"
       y="56.175766" />
    <path
       style="fill:none;stroke:#000000;stroke-width:0.25;stroke-linecap:butt;stroke-linejoin:miter;stroke-opacity:1"
       d="m 110.02566,59.557783 c 0,6.54008 0,6.54008 0,6.54008"
       id="path99-3"
       inkscape:connector-curvature="0" />
    <path
       sodipodi:type="star"
       style="fill:#000000;stroke:#000000;stroke-width:0.36108583;stroke-miterlimit:4;stroke-dasharray:none;stroke-opacity:1"
       id="path121-4"
       sodipodi:sides="3"
       sodipodi:cx="100.54167"
       sodipodi:cy="21.644344"
       sodipodi:r1="1.2284226"
       sodipodi:r2="0.61421126"
       sodipodi:arg1="1.5707963"
       sodipodi:arg2="2.6179939"
       inkscape:flatsided="true"
       inkscape:rounded="0"
       inkscape:randomized="0"
       d="m 100.54167,22.872767 -1.063843,-1.842634 2.127693,0 z"
       inkscape:transform-center-y="0.5292198"
       transform="matrix(0.58518642,0,0,0.81915271,51.190034,47.361574)" />
    <rect
       style="fill:#ececec;stroke:#000000;stroke-width:0.25;stroke-miterlimit:4;stroke-dasharray:none;stroke-opacity:1"
       id="rect10-9"
       width="13.098559"
       height="3.3818343"
       x="57.631424"
       y="66.097702" />
    <rect
       style="fill:#ececec;stroke:#000000;stroke-width:0.25;stroke-miterlimit:4;stroke-dasharray:none;stroke-opacity:1"
       id="rect10-1-9"
       width="13.098559"
       height="3.3818343"
       x="70.729996"
       y="66.097702" />
    <rect
       style="fill:#ececec;stroke:#000000;stroke-width:0.25;stroke-miterlimit:4;stroke-dasharray:none;stroke-opacity:1"
       id="rect10-11-2"
       width="13.098559"
       height="3.3818343"
       x="83.828545"
       y="66.097702" />
    <rect
       style="fill:#ececec;stroke:#000000;stroke-width:0.25;stroke-miterlimit:4;stroke-dasharray:none;stroke-opacity:1"
       id="rect10-4-6"
       width="13.098559"
       height="3.3818343"
       x="96.927124"
       y="66.097702" />
    <rect
       style="fill:#ececec;stroke:#000000;stroke-width:0.25;stroke-miterlimit:4;stroke-dasharray:none;stroke-opacity:1"
       id="rect10-10-8"
       width="13.098559"
       height="3.3818343"
       x="110.0256"
       y="66.097702" />
    <rect
       style="fill:#ececec;stroke:#000000;stroke-width:0.25;stroke-miterlimit:4;stroke-dasharray:none;stroke-opacity:1"
       id="rect10-0-6"
       width="13.098559"
       height="3.3818343"
       x="123.12421"
       y="66.097702" />
    <rect
       style="fill:#ececec;stroke:#000000;stroke-width:0.25;stroke-miterlimit:4;stroke-dasharray:none;stroke-opacity:1"
       id="rect10-3-1"
       width="13.098559"
       height="3.3818343"
       x="136.22244"
       y="66.097702" />
    <rect
       style="fill:#ececec;stroke:#000000;stroke-width:0.25;stroke-miterlimit:4;stroke-dasharray:none;stroke-opacity:1"
       id="rect10-6-6"
       width="13.098559"
       height="3.3818343"
       x="149.32079"
       y="66.097702" />
    <text
       xml:space="preserve"
       style="font-style:normal;font-weight:normal;font-size:3.17499995px;line-height:1.25;font-family:sans-serif;letter-spacing:0px;word-spacing:0px;fill:#000000;fill-opacity:1;stroke:none;stroke-width:0.25"
       x="44.958363"
       y="60.884422"
       id="text528"
       transform="scale(1.0327325,0.96830495)"><tspan
         sodipodi:role="line"
         id="tspan526"
         x="44.958363"
         y="60.884422"
         style="font-size:3.17499995px;stroke-width:0.25">b1,b0:</tspan></text>
    <text
       xml:space="preserve"
       style="font-style:normal;font-weight:normal;font-size:3.17499995px;line-height:1.25;font-family:sans-serif;letter-spacing:0px;word-spacing:0px;baseline-shift:baseline;fill:#000000;fill-opacity:1;stroke:none;stroke-width:0.25"
       x="48.549313"
       y="71.076698"
       id="text532"
       transform="scale(1.0327325,0.96830495)"><tspan
         sodipodi:role="line"
         id="tspan530"
         x="48.549313"
         y="71.076698"
         style="font-size:3.17499995px;baseline-shift:baseline;stroke-width:0.25">a<tspan
   id="tspan534"
   style="font-size:3.17499995px;stroke-width:0.25"><tspan
   style="font-size:2.82222223px;baseline-shift:super;stroke-width:0.25"
   id="tspan536">-1</tspan>:</tspan></tspan></text>
    <text
       xml:space="preserve"
       style="font-style:normal;font-weight:normal;font-size:3.17499995px;line-height:1.25;font-family:sans-serif;letter-spacing:0px;word-spacing:0px;fill:#000000;fill-opacity:1;stroke:none;stroke-width:0.25"
       x="107.52946"
       y="66.150406"
       id="text544"
       transform="scale(1.0327325,0.96830495)"><tspan
         sodipodi:role="line"
         id="tspan542"
         x="107.52946"
         y="66.150406"
         style="font-size:3.17499995px;stroke-width:0.25">T<tspan
   style="font-size:2.82222223px;baseline-shift:super;stroke-width:0.25"
   id="tspan546">-1</tspan>(b1,b0)</tspan></text>
    <path
       style="fill:none;stroke:#000000;stroke-width:0.25;stroke-linecap:butt;stroke-linejoin:miter;stroke-opacity:1"
       d="m 110.02567,26.573738 c 0,6.54008 0,6.54008 0,6.54008"
       id="path99-8"
       inkscape:connector-curvature="0" />
    <path
       sodipodi:type="star"
       style="fill:#000000;stroke:#000000;stroke-width:0.36108583;stroke-miterlimit:4;stroke-dasharray:none;stroke-opacity:1"
       id="path121-1"
       sodipodi:sides="3"
       sodipodi:cx="100.54167"
       sodipodi:cy="21.644344"
       sodipodi:r1="1.2284226"
       sodipodi:r2="0.61421126"
       sodipodi:arg1="1.5707963"
       sodipodi:arg2="2.6179939"
       inkscape:flatsided="true"
       inkscape:rounded="0"
       inkscape:randomized="0"
       d="m 100.54167,22.872767 -1.063843,-1.842634 2.127693,0 z"
       inkscape:transform-center-y="0.5292198"
       transform="matrix(0.58518642,0,0,0.81915271,51.190044,14.377529)" />
    <path
       style="fill:none;stroke:#000000;stroke-width:0.25;stroke-linecap:butt;stroke-linejoin:miter;stroke-opacity:1"
       d="m 110.02567,49.324449 c 0,6.54008 0,6.54008 0,6.54008"
       id="path99-4"
       inkscape:connector-curvature="0" />
    <path
       sodipodi:type="star"
       style="fill:#000000;stroke:#000000;stroke-width:0.36108583;stroke-miterlimit:4;stroke-dasharray:none;stroke-opacity:1"
       id="path121-6"
       sodipodi:sides="3"
       sodipodi:cx="100.54167"
       sodipodi:cy="21.644344"
       sodipodi:r1="1.2284226"
       sodipodi:r2="0.61421126"
       sodipodi:arg1="1.5707963"
       sodipodi:arg2="2.6179939"
       inkscape:flatsided="true"
       inkscape:rounded="0"
       inkscape:randomized="0"
       d="m 100.54167,22.872767 -1.063843,-1.842634 2.127693,0 z"
       inkscape:transform-center-y="0.5292198"
       transform="matrix(0.58518642,0,0,0.81915271,51.190044,37.12824)" />
    <text
       xml:space="preserve"
       style="font-style:normal;font-weight:normal;font-size:3.88055563px;line-height:1.25;font-family:sans-serif;letter-spacing:0px;word-spacing:0px;fill:#000000;fill-opacity:1;stroke:none;stroke-width:0.25"
       x="103.02484"
       y="44.672741"
       id="text782"
       transform="scale(1.0327325,0.96830495)"><tspan
         sodipodi:role="line"
         id="tspan780"
         x="103.02484"
         y="44.672741"
         style="font-size:3.88055563px;stroke-width:0.25">x<tspan
   style="font-size:3.17499995px;baseline-shift:super;stroke-width:0.25"
   id="tspan784">-1</tspan> </tspan></text>
  </g>
</svg>
