<?xml version="1.0" encoding="UTF-8" standalone="no"?>
<!-- Created with Inkscape (http://www.inkscape.org/) -->

<svg
   xmlns:dc="http://purl.org/dc/elements/1.1/"
   xmlns:cc="http://creativecommons.org/ns#"
   xmlns:rdf="http://www.w3.org/1999/02/22-rdf-syntax-ns#"
   xmlns:svg="http://www.w3.org/2000/svg"
   xmlns="http://www.w3.org/2000/svg"
   xmlns:sodipodi="http://sodipodi.sourceforge.net/DTD/sodipodi-0.dtd"
   xmlns:inkscape="http://www.inkscape.org/namespaces/inkscape"
   width="179.81889mm"
   height="43.112991mm"
   viewBox="0 0 179.81889 43.112991"
   version="1.1"
   id="svg1890"
   inkscape:version="0.92.1 r15371"
   sodipodi:docname="16b8op.svg"
   inkscape:export-filename="C:\Robert\Uni\Studienarbeit\Paper\pictures\16b8op.png"
   inkscape:export-xdpi="96"
   inkscape:export-ydpi="96">
  <defs
     id="defs1884" />
  <sodipodi:namedview
     id="base"
     pagecolor="#ffffff"
     bordercolor="#666666"
     borderopacity="1.0"
     inkscape:pageopacity="0.0"
     inkscape:pageshadow="2"
     inkscape:zoom="1.4"
     inkscape:cx="140.22447"
     inkscape:cy="4.2771253"
     inkscape:document-units="mm"
     inkscape:current-layer="layer1"
     showgrid="false"
     inkscape:window-width="1920"
     inkscape:window-height="1027"
     inkscape:window-x="-8"
     inkscape:window-y="-8"
     inkscape:window-maximized="1"
     fit-margin-top="0"
     fit-margin-left="0"
     fit-margin-right="0"
     fit-margin-bottom="0" />
  <metadata
     id="metadata1887">
    <rdf:RDF>
      <cc:Work
         rdf:about="">
        <dc:format>image/svg+xml</dc:format>
        <dc:type
           rdf:resource="http://purl.org/dc/dcmitype/StillImage" />
        <dc:title></dc:title>
      </cc:Work>
    </rdf:RDF>
  </metadata>
  <g
     inkscape:label="Ebene 1"
     inkscape:groupmode="layer"
     id="layer1"
     transform="translate(-14.903459,-16.460913)">
    <g
       id="g5673"
       transform="translate(-3.7041668,0.85044843)"
       style="stroke-width:0.25">
      <rect
         y="31.414801"
         x="25.040699"
         height="11.64212"
         width="11.64212"
         id="rect1892"
         style="opacity:1;fill:#ffffff;stroke:#000000;stroke-width:0.25;stroke-miterlimit:4;stroke-dasharray:none;stroke-dashoffset:0;stroke-opacity:1" />
      <text
         id="text5668"
         y="38.491596"
         x="26.925737"
         style="font-style:normal;font-weight:normal;font-size:3.52777767px;line-height:1.25;font-family:sans-serif;letter-spacing:0px;word-spacing:0px;fill:#000000;fill-opacity:1;stroke:none;stroke-width:0.25"
         xml:space="preserve"><tspan
           style="font-size:3.52777767px;stroke-width:0.25"
           y="38.491596"
           x="26.925737"
           id="tspan5666"
           sodipodi:role="line">MUL</tspan></text>
    </g>
    <g
       transform="translate(18.672439,0.85044843)"
       id="g5673-6"
       style="stroke-width:0.25">
      <rect
         y="31.414801"
         x="25.040699"
         height="11.64212"
         width="11.64212"
         id="rect1892-9"
         style="opacity:1;fill:#ffffff;stroke:#000000;stroke-width:0.25;stroke-miterlimit:4;stroke-dasharray:none;stroke-dashoffset:0;stroke-opacity:1" />
      <text
         id="text5668-3"
         y="38.491596"
         x="26.925737"
         style="font-style:normal;font-weight:normal;font-size:3.52777767px;line-height:1.25;font-family:sans-serif;letter-spacing:0px;word-spacing:0px;fill:#000000;fill-opacity:1;stroke:none;stroke-width:0.25"
         xml:space="preserve"><tspan
           style="font-size:3.52777767px;stroke-width:0.25"
           y="38.491596"
           x="26.925737"
           id="tspan5666-1"
           sodipodi:role="line">MUL</tspan></text>
    </g>
    <g
       transform="translate(41.049047,0.85044843)"
       id="g5673-3"
       style="stroke-width:0.25">
      <rect
         y="31.414801"
         x="25.040699"
         height="11.64212"
         width="11.64212"
         id="rect1892-1"
         style="opacity:1;fill:#ffffff;stroke:#000000;stroke-width:0.25;stroke-miterlimit:4;stroke-dasharray:none;stroke-dashoffset:0;stroke-opacity:1" />
      <text
         id="text5668-0"
         y="38.491596"
         x="26.925737"
         style="font-style:normal;font-weight:normal;font-size:3.52777767px;line-height:1.25;font-family:sans-serif;letter-spacing:0px;word-spacing:0px;fill:#000000;fill-opacity:1;stroke:none;stroke-width:0.25"
         xml:space="preserve"><tspan
           style="font-size:3.52777767px;stroke-width:0.25"
           y="38.491596"
           x="26.925737"
           id="tspan5666-0"
           sodipodi:role="line">MUL</tspan></text>
    </g>
    <g
       transform="translate(63.425654,0.85044843)"
       id="g5673-1"
       style="stroke-width:0.25">
      <rect
         y="31.414801"
         x="25.040699"
         height="11.64212"
         width="11.64212"
         id="rect1892-6"
         style="opacity:1;fill:#ffffff;stroke:#000000;stroke-width:0.25;stroke-miterlimit:4;stroke-dasharray:none;stroke-dashoffset:0;stroke-opacity:1" />
      <text
         id="text5668-4"
         y="38.491596"
         x="26.925737"
         style="font-style:normal;font-weight:normal;font-size:3.52777767px;line-height:1.25;font-family:sans-serif;letter-spacing:0px;word-spacing:0px;fill:#000000;fill-opacity:1;stroke:none;stroke-width:0.25"
         xml:space="preserve"><tspan
           style="font-size:3.52777767px;stroke-width:0.25"
           y="38.491596"
           x="26.925737"
           id="tspan5666-8"
           sodipodi:role="line">MUL</tspan></text>
    </g>
    <g
       transform="translate(85.802262,0.85044843)"
       id="g5673-14"
       style="stroke-width:0.25">
      <rect
         y="31.414801"
         x="25.040699"
         height="11.64212"
         width="11.64212"
         id="rect1892-15"
         style="opacity:1;fill:#ffffff;stroke:#000000;stroke-width:0.25;stroke-miterlimit:4;stroke-dasharray:none;stroke-dashoffset:0;stroke-opacity:1" />
      <text
         id="text5668-9"
         y="38.491596"
         x="26.925737"
         style="font-style:normal;font-weight:normal;font-size:3.52777767px;line-height:1.25;font-family:sans-serif;letter-spacing:0px;word-spacing:0px;fill:#000000;fill-opacity:1;stroke:none;stroke-width:0.25"
         xml:space="preserve"><tspan
           style="font-size:3.52777767px;stroke-width:0.25"
           y="38.491596"
           x="26.925737"
           id="tspan5666-13"
           sodipodi:role="line">MUL</tspan></text>
    </g>
    <g
       transform="translate(108.17885,0.85044843)"
       id="g5673-2"
       style="stroke-width:0.25">
      <rect
         y="31.414801"
         x="25.040699"
         height="11.64212"
         width="11.64212"
         id="rect1892-5"
         style="opacity:1;fill:#ffffff;stroke:#000000;stroke-width:0.25;stroke-miterlimit:4;stroke-dasharray:none;stroke-dashoffset:0;stroke-opacity:1" />
      <text
         id="text5668-30"
         y="38.491596"
         x="26.925737"
         style="font-style:normal;font-weight:normal;font-size:3.52777767px;line-height:1.25;font-family:sans-serif;letter-spacing:0px;word-spacing:0px;fill:#000000;fill-opacity:1;stroke:none;stroke-width:0.25"
         xml:space="preserve"><tspan
           style="font-size:3.52777767px;stroke-width:0.25"
           y="38.491596"
           x="26.925737"
           id="tspan5666-6"
           sodipodi:role="line">MUL</tspan></text>
    </g>
    <g
       transform="translate(130.55546,0.85044843)"
       id="g5673-31"
       style="stroke-width:0.25">
      <rect
         y="31.414801"
         x="25.040699"
         height="11.64212"
         width="11.64212"
         id="rect1892-7"
         style="opacity:1;fill:#ffffff;stroke:#000000;stroke-width:0.25;stroke-miterlimit:4;stroke-dasharray:none;stroke-dashoffset:0;stroke-opacity:1" />
      <text
         id="text5668-43"
         y="38.491596"
         x="26.925737"
         style="font-style:normal;font-weight:normal;font-size:3.52777767px;line-height:1.25;font-family:sans-serif;letter-spacing:0px;word-spacing:0px;fill:#000000;fill-opacity:1;stroke:none;stroke-width:0.25"
         xml:space="preserve"><tspan
           style="font-size:3.52777767px;stroke-width:0.25"
           y="38.491596"
           x="26.925737"
           id="tspan5666-17"
           sodipodi:role="line">MUL</tspan></text>
    </g>
    <g
       transform="translate(152.93206,0.85044843)"
       id="g5673-15"
       style="stroke-width:0.25">
      <rect
         y="31.414801"
         x="25.040699"
         height="11.64212"
         width="11.64212"
         id="rect1892-78"
         style="opacity:1;fill:#ffffff;stroke:#000000;stroke-width:0.25;stroke-miterlimit:4;stroke-dasharray:none;stroke-dashoffset:0;stroke-opacity:1" />
      <text
         id="text5668-1"
         y="38.491596"
         x="26.925737"
         style="font-style:normal;font-weight:normal;font-size:3.52777767px;line-height:1.25;font-family:sans-serif;letter-spacing:0px;word-spacing:0px;fill:#000000;fill-opacity:1;stroke:none;stroke-width:0.25"
         xml:space="preserve"><tspan
           style="font-size:3.52777767px;stroke-width:0.25"
           y="38.491596"
           x="26.925737"
           id="tspan5666-85"
           sodipodi:role="line">MUL</tspan></text>
    </g>
    <rect
       style="opacity:1;fill:#cccccc;stroke:#000000;stroke-width:0.25;stroke-miterlimit:4;stroke-dasharray:none;stroke-dashoffset:0;stroke-opacity:1"
       id="rect5771"
       width="10.958051"
       height="3.7417734"
       x="15.293455"
       y="16.585913" />
    <rect
       style="opacity:1;fill:#cccccc;stroke:#000000;stroke-width:0.25;stroke-miterlimit:4;stroke-dasharray:none;stroke-dashoffset:0;stroke-opacity:1"
       id="rect5771-1"
       width="10.958051"
       height="3.7417734"
       x="26.516502"
       y="16.585913" />
    <rect
       style="opacity:1;fill:#cccccc;stroke:#000000;stroke-width:0.25;stroke-miterlimit:4;stroke-dasharray:none;stroke-dashoffset:0;stroke-opacity:1"
       id="rect5771-3"
       width="10.958051"
       height="3.7417734"
       x="37.739555"
       y="16.585913" />
    <rect
       style="opacity:1;fill:#cccccc;stroke:#000000;stroke-width:0.25;stroke-miterlimit:4;stroke-dasharray:none;stroke-dashoffset:0;stroke-opacity:1"
       id="rect5771-7"
       width="10.958051"
       height="3.7417734"
       x="48.962605"
       y="16.585913" />
    <rect
       style="opacity:1;fill:#cccccc;stroke:#000000;stroke-width:0.25;stroke-miterlimit:4;stroke-dasharray:none;stroke-dashoffset:0;stroke-opacity:1"
       id="rect5771-16"
       width="10.958051"
       height="3.7417734"
       x="60.185654"
       y="16.585913" />
    <rect
       style="opacity:1;fill:#cccccc;stroke:#000000;stroke-width:0.25;stroke-miterlimit:4;stroke-dasharray:none;stroke-dashoffset:0;stroke-opacity:1"
       id="rect5771-8"
       width="10.958051"
       height="3.7417734"
       x="71.408707"
       y="16.585913" />
    <rect
       style="opacity:1;fill:#cccccc;stroke:#000000;stroke-width:0.25;stroke-miterlimit:4;stroke-dasharray:none;stroke-dashoffset:0;stroke-opacity:1"
       id="rect5771-4"
       width="10.958051"
       height="3.7417734"
       x="82.63176"
       y="16.585913" />
    <rect
       style="opacity:1;fill:#cccccc;stroke:#000000;stroke-width:0.25;stroke-miterlimit:4;stroke-dasharray:none;stroke-dashoffset:0;stroke-opacity:1"
       id="rect5771-2"
       width="10.958051"
       height="3.7417734"
       x="93.854805"
       y="16.585913" />
    <rect
       style="opacity:1;fill:#cccccc;stroke:#000000;stroke-width:0.25;stroke-miterlimit:4;stroke-dasharray:none;stroke-dashoffset:0;stroke-opacity:1"
       id="rect5771-5"
       width="10.958051"
       height="3.7417734"
       x="105.07787"
       y="16.585913" />
    <rect
       style="opacity:1;fill:#cccccc;stroke:#000000;stroke-width:0.25;stroke-miterlimit:4;stroke-dasharray:none;stroke-dashoffset:0;stroke-opacity:1"
       id="rect5771-18"
       width="10.958051"
       height="3.7417734"
       x="116.30093"
       y="16.585913" />
    <rect
       style="opacity:1;fill:#cccccc;stroke:#000000;stroke-width:0.25;stroke-miterlimit:4;stroke-dasharray:none;stroke-dashoffset:0;stroke-opacity:1"
       id="rect5771-12"
       width="10.958051"
       height="3.7417734"
       x="127.52404"
       y="16.585913" />
    <rect
       style="opacity:1;fill:#cccccc;stroke:#000000;stroke-width:0.25;stroke-miterlimit:4;stroke-dasharray:none;stroke-dashoffset:0;stroke-opacity:1"
       id="rect5771-59"
       width="10.958051"
       height="3.7417734"
       x="138.7471"
       y="16.585913" />
    <rect
       style="opacity:1;fill:#cccccc;stroke:#000000;stroke-width:0.25;stroke-miterlimit:4;stroke-dasharray:none;stroke-dashoffset:0;stroke-opacity:1"
       id="rect5771-76"
       width="10.958051"
       height="3.7417734"
       x="149.97014"
       y="16.585913" />
    <rect
       style="opacity:1;fill:#cccccc;stroke:#000000;stroke-width:0.25;stroke-miterlimit:4;stroke-dasharray:none;stroke-dashoffset:0;stroke-opacity:1"
       id="rect5771-50"
       width="10.958051"
       height="3.7417734"
       x="161.19319"
       y="16.585913" />
    <rect
       style="opacity:1;fill:#cccccc;stroke:#000000;stroke-width:0.25;stroke-miterlimit:4;stroke-dasharray:none;stroke-dashoffset:0;stroke-opacity:1"
       id="rect5771-27"
       width="10.958051"
       height="3.7417734"
       x="172.41624"
       y="16.585913" />
    <rect
       style="opacity:1;fill:#cccccc;stroke:#000000;stroke-width:0.25;stroke-miterlimit:4;stroke-dasharray:none;stroke-dashoffset:0;stroke-opacity:1"
       id="rect5771-42"
       width="10.958051"
       height="3.7417734"
       x="183.6393"
       y="16.585913" />
    <g
       id="g6064"
       transform="translate(72.629552,-12.242882)"
       style="fill:#666666;stroke-width:0.25">
      <rect
         y="67.950012"
         x="-57.601093"
         height="3.7417734"
         width="10.958051"
         id="rect5771-54"
         style="opacity:1;fill:#666666;stroke:#000000;stroke-width:0.25;stroke-miterlimit:4;stroke-dasharray:none;stroke-dashoffset:0;stroke-opacity:1" />
      <rect
         y="67.950012"
         x="-46.378044"
         height="3.7417734"
         width="10.958051"
         id="rect5771-1-4"
         style="opacity:1;fill:#666666;stroke:#000000;stroke-width:0.25;stroke-miterlimit:4;stroke-dasharray:none;stroke-dashoffset:0;stroke-opacity:1" />
      <rect
         y="67.950012"
         x="-35.154995"
         height="3.7417734"
         width="10.958051"
         id="rect5771-3-6"
         style="opacity:1;fill:#666666;stroke:#000000;stroke-width:0.25;stroke-miterlimit:4;stroke-dasharray:none;stroke-dashoffset:0;stroke-opacity:1" />
      <rect
         y="67.950012"
         x="-23.931946"
         height="3.7417734"
         width="10.958051"
         id="rect5771-7-3"
         style="opacity:1;fill:#666666;stroke:#000000;stroke-width:0.25;stroke-miterlimit:4;stroke-dasharray:none;stroke-dashoffset:0;stroke-opacity:1" />
      <rect
         y="67.950012"
         x="-12.708897"
         height="3.7417734"
         width="10.958051"
         id="rect5771-16-0"
         style="opacity:1;fill:#666666;stroke:#000000;stroke-width:0.25;stroke-miterlimit:4;stroke-dasharray:none;stroke-dashoffset:0;stroke-opacity:1" />
      <rect
         y="67.950012"
         x="-1.4858422"
         height="3.7417734"
         width="10.958051"
         id="rect5771-8-9"
         style="opacity:1;fill:#666666;stroke:#000000;stroke-width:0.25;stroke-miterlimit:4;stroke-dasharray:none;stroke-dashoffset:0;stroke-opacity:1" />
      <rect
         y="67.950012"
         x="9.7372055"
         height="3.7417734"
         width="10.958051"
         id="rect5771-4-6"
         style="opacity:1;fill:#666666;stroke:#000000;stroke-width:0.25;stroke-miterlimit:4;stroke-dasharray:none;stroke-dashoffset:0;stroke-opacity:1" />
      <rect
         y="67.950012"
         x="20.960255"
         height="3.7417734"
         width="10.958051"
         id="rect5771-2-6"
         style="opacity:1;fill:#666666;stroke:#000000;stroke-width:0.25;stroke-miterlimit:4;stroke-dasharray:none;stroke-dashoffset:0;stroke-opacity:1" />
      <rect
         y="67.950012"
         x="32.183323"
         height="3.7417734"
         width="10.958051"
         id="rect5771-5-1"
         style="opacity:1;fill:#666666;stroke:#000000;stroke-width:0.25;stroke-miterlimit:4;stroke-dasharray:none;stroke-dashoffset:0;stroke-opacity:1" />
      <rect
         y="67.950012"
         x="43.406384"
         height="3.7417734"
         width="10.958051"
         id="rect5771-18-7"
         style="opacity:1;fill:#666666;stroke:#000000;stroke-width:0.25;stroke-miterlimit:4;stroke-dasharray:none;stroke-dashoffset:0;stroke-opacity:1" />
      <rect
         y="67.950012"
         x="54.62949"
         height="3.7417734"
         width="10.958051"
         id="rect5771-12-8"
         style="opacity:1;fill:#666666;stroke:#000000;stroke-width:0.25;stroke-miterlimit:4;stroke-dasharray:none;stroke-dashoffset:0;stroke-opacity:1" />
      <rect
         y="67.950012"
         x="65.852554"
         height="3.7417734"
         width="10.958051"
         id="rect5771-59-9"
         style="opacity:1;fill:#666666;stroke:#000000;stroke-width:0.25;stroke-miterlimit:4;stroke-dasharray:none;stroke-dashoffset:0;stroke-opacity:1" />
      <rect
         y="67.950012"
         x="77.075577"
         height="3.7417734"
         width="10.958051"
         id="rect5771-76-2"
         style="opacity:1;fill:#666666;stroke:#000000;stroke-width:0.25;stroke-miterlimit:4;stroke-dasharray:none;stroke-dashoffset:0;stroke-opacity:1" />
      <rect
         y="67.950012"
         x="88.298645"
         height="3.7417734"
         width="10.958051"
         id="rect5771-50-9"
         style="opacity:1;fill:#666666;stroke:#000000;stroke-width:0.25;stroke-miterlimit:4;stroke-dasharray:none;stroke-dashoffset:0;stroke-opacity:1" />
      <rect
         y="67.950012"
         x="99.521698"
         height="3.7417734"
         width="10.958051"
         id="rect5771-27-0"
         style="opacity:1;fill:#666666;stroke:#000000;stroke-width:0.25;stroke-miterlimit:4;stroke-dasharray:none;stroke-dashoffset:0;stroke-opacity:1" />
      <rect
         y="67.950012"
         x="110.74475"
         height="3.7417734"
         width="10.958051"
         id="rect5771-42-3"
         style="opacity:1;fill:#666666;stroke:#000000;stroke-width:0.25;stroke-miterlimit:4;stroke-dasharray:none;stroke-dashoffset:0;stroke-opacity:1" />
    </g>
    <g
       id="g6072"
       style="stroke-width:0.25">
      <path
         inkscape:connector-curvature="0"
         id="path6066"
         d="m 15.293455,20.327686 v 2.854683 h 22.391548 v -2.806331"
         style="fill:none;stroke:#000000;stroke-width:0.25;stroke-linecap:butt;stroke-linejoin:miter;stroke-opacity:1" />
      <path
         inkscape:connector-curvature="0"
         id="path6068"
         d="m 26.726951,23.182369 v 9.103377"
         style="fill:none;stroke:#000000;stroke-width:0.25;stroke-linecap:butt;stroke-linejoin:miter;stroke-opacity:1" />
    </g>
    <g
       transform="translate(22.391548)"
       id="g6072-8"
       style="stroke-width:0.25">
      <path
         inkscape:connector-curvature="0"
         id="path6066-9"
         d="m 15.293455,20.327686 v 2.854683 h 22.391548 v -2.806331"
         style="fill:none;stroke:#000000;stroke-width:0.25;stroke-linecap:butt;stroke-linejoin:miter;stroke-opacity:1" />
      <path
         inkscape:connector-curvature="0"
         id="path6068-1"
         d="m 26.726951,23.182369 v 9.103377"
         style="fill:none;stroke:#000000;stroke-width:0.25;stroke-linecap:butt;stroke-linejoin:miter;stroke-opacity:1" />
    </g>
    <g
       transform="translate(44.6272)"
       id="g6072-5"
       style="stroke-width:0.25">
      <path
         inkscape:connector-curvature="0"
         id="path6066-99"
         d="m 15.293455,20.327686 v 2.854683 h 22.391548 v -2.806331"
         style="fill:none;stroke:#000000;stroke-width:0.25;stroke-linecap:butt;stroke-linejoin:miter;stroke-opacity:1" />
      <path
         inkscape:connector-curvature="0"
         id="path6068-3"
         d="m 26.726951,23.182369 v 9.103377"
         style="fill:none;stroke:#000000;stroke-width:0.25;stroke-linecap:butt;stroke-linejoin:miter;stroke-opacity:1" />
    </g>
    <g
       transform="translate(67.018748)"
       id="g6072-2"
       style="stroke-width:0.25">
      <path
         inkscape:connector-curvature="0"
         id="path6066-6"
         d="m 15.293455,20.327686 v 2.854683 h 22.391548 v -2.806331"
         style="fill:none;stroke:#000000;stroke-width:0.25;stroke-linecap:butt;stroke-linejoin:miter;stroke-opacity:1" />
      <path
         inkscape:connector-curvature="0"
         id="path6068-39"
         d="m 26.726951,23.182369 v 9.103377"
         style="fill:none;stroke:#000000;stroke-width:0.25;stroke-linecap:butt;stroke-linejoin:miter;stroke-opacity:1" />
    </g>
    <g
       transform="translate(89.573974,-0.04835193)"
       id="g6072-9"
       style="stroke-width:0.25">
      <path
         inkscape:connector-curvature="0"
         id="path6066-1"
         d="m 15.293455,20.327686 v 2.854683 h 22.391548 v -2.806331"
         style="fill:none;stroke:#000000;stroke-width:0.25;stroke-linecap:butt;stroke-linejoin:miter;stroke-opacity:1" />
      <path
         inkscape:connector-curvature="0"
         id="path6068-4"
         d="m 26.726951,23.182369 v 9.103377"
         style="fill:none;stroke:#000000;stroke-width:0.25;stroke-linecap:butt;stroke-linejoin:miter;stroke-opacity:1" />
    </g>
    <g
       transform="translate(112.23059)"
       id="g6072-7"
       style="stroke-width:0.25">
      <path
         inkscape:connector-curvature="0"
         id="path6066-0"
         d="m 15.293455,20.327686 v 2.854683 h 22.391548 v -2.806331"
         style="fill:none;stroke:#000000;stroke-width:0.25;stroke-linecap:butt;stroke-linejoin:miter;stroke-opacity:1" />
      <path
         inkscape:connector-curvature="0"
         id="path6068-8"
         d="m 26.726951,23.182369 v 9.103377"
         style="fill:none;stroke:#000000;stroke-width:0.25;stroke-linecap:butt;stroke-linejoin:miter;stroke-opacity:1" />
    </g>
    <g
       transform="translate(134.67668)"
       id="g6072-94"
       style="stroke-width:0.25">
      <path
         inkscape:connector-curvature="0"
         id="path6066-10"
         d="m 15.293455,20.327686 v 2.854683 h 22.391548 v -2.806331"
         style="fill:none;stroke:#000000;stroke-width:0.25;stroke-linecap:butt;stroke-linejoin:miter;stroke-opacity:1" />
      <path
         inkscape:connector-curvature="0"
         id="path6068-35"
         d="m 26.726951,23.182369 v 9.103377"
         style="fill:none;stroke:#000000;stroke-width:0.25;stroke-linecap:butt;stroke-linejoin:miter;stroke-opacity:1" />
    </g>
    <g
       transform="translate(156.91235,-0.04835193)"
       id="g6072-0"
       style="stroke-width:0.25">
      <path
         inkscape:connector-curvature="0"
         id="path6066-91"
         d="m 15.293455,20.327686 v 2.854683 h 22.391548 v -2.806331"
         style="fill:none;stroke:#000000;stroke-width:0.25;stroke-linecap:butt;stroke-linejoin:miter;stroke-opacity:1" />
      <path
         inkscape:connector-curvature="0"
         id="path6068-34"
         d="m 26.726951,23.182369 v 9.103377"
         style="fill:none;stroke:#000000;stroke-width:0.25;stroke-linecap:butt;stroke-linejoin:miter;stroke-opacity:1" />
    </g>
    <g
       transform="rotate(180,26.411281,38.017409)"
       id="g6072-57"
       style="stroke-width:0.25">
      <path
         inkscape:connector-curvature="0"
         id="path6066-5"
         d="m 15.293455,20.327686 v 2.854683 h 22.391548 v -2.806331"
         style="fill:none;stroke:#000000;stroke-width:0.25;stroke-linecap:butt;stroke-linejoin:miter;stroke-opacity:1" />
      <path
         inkscape:connector-curvature="0"
         id="path6068-393"
         d="m 26.726951,23.182369 v 9.103377"
         style="fill:none;stroke:#000000;stroke-width:0.25;stroke-linecap:butt;stroke-linejoin:miter;stroke-opacity:1" />
    </g>
    <g
       transform="rotate(180,37.607055,38.017409)"
       id="g6072-8-0"
       style="stroke-width:0.25">
      <path
         inkscape:connector-curvature="0"
         id="path6066-9-8"
         d="m 15.293455,20.327686 v 2.854683 h 22.391548 v -2.806331"
         style="fill:none;stroke:#000000;stroke-width:0.25;stroke-linecap:butt;stroke-linejoin:miter;stroke-opacity:1" />
      <path
         inkscape:connector-curvature="0"
         id="path6068-1-3"
         d="m 26.726951,23.182369 v 9.103377"
         style="fill:none;stroke:#000000;stroke-width:0.25;stroke-linecap:butt;stroke-linejoin:miter;stroke-opacity:1" />
    </g>
    <g
       transform="rotate(180,48.72488,38.017409)"
       id="g6072-5-3"
       style="stroke-width:0.25">
      <path
         inkscape:connector-curvature="0"
         id="path6066-99-5"
         d="m 15.293455,20.327686 v 2.854683 h 22.391548 v -2.806331"
         style="fill:none;stroke:#000000;stroke-width:0.25;stroke-linecap:butt;stroke-linejoin:miter;stroke-opacity:1" />
      <path
         inkscape:connector-curvature="0"
         id="path6068-3-8"
         d="m 26.726951,23.182369 v 9.103377"
         style="fill:none;stroke:#000000;stroke-width:0.25;stroke-linecap:butt;stroke-linejoin:miter;stroke-opacity:1" />
    </g>
    <g
       transform="rotate(180,59.920656,38.017409)"
       id="g6072-2-1"
       style="stroke-width:0.25">
      <path
         inkscape:connector-curvature="0"
         id="path6066-6-4"
         d="m 15.293455,20.327686 v 2.854683 h 22.391548 v -2.806331"
         style="fill:none;stroke:#000000;stroke-width:0.25;stroke-linecap:butt;stroke-linejoin:miter;stroke-opacity:1" />
      <path
         inkscape:connector-curvature="0"
         id="path6068-39-2"
         d="m 26.726951,23.182369 v 9.103377"
         style="fill:none;stroke:#000000;stroke-width:0.25;stroke-linecap:butt;stroke-linejoin:miter;stroke-opacity:1" />
    </g>
    <g
       transform="rotate(180,71.198267,37.993233)"
       id="g6072-9-3"
       style="stroke-width:0.25">
      <path
         inkscape:connector-curvature="0"
         id="path6066-1-1"
         d="m 15.293455,20.327686 v 2.854683 h 22.391548 v -2.806331"
         style="fill:none;stroke:#000000;stroke-width:0.25;stroke-linecap:butt;stroke-linejoin:miter;stroke-opacity:1" />
      <path
         inkscape:connector-curvature="0"
         id="path6068-4-3"
         d="m 26.726951,23.182369 v 9.103377"
         style="fill:none;stroke:#000000;stroke-width:0.25;stroke-linecap:butt;stroke-linejoin:miter;stroke-opacity:1" />
    </g>
    <g
       transform="rotate(180,82.526576,38.017409)"
       id="g6072-7-1"
       style="stroke-width:0.25">
      <path
         inkscape:connector-curvature="0"
         id="path6066-0-7"
         d="m 15.293455,20.327686 v 2.854683 h 22.391548 v -2.806331"
         style="fill:none;stroke:#000000;stroke-width:0.25;stroke-linecap:butt;stroke-linejoin:miter;stroke-opacity:1" />
      <path
         inkscape:connector-curvature="0"
         id="path6068-8-1"
         d="m 26.726951,23.182369 v 9.103377"
         style="fill:none;stroke:#000000;stroke-width:0.25;stroke-linecap:butt;stroke-linejoin:miter;stroke-opacity:1" />
    </g>
    <g
       transform="rotate(180,93.749618,38.017409)"
       id="g6072-94-1"
       style="stroke-width:0.25">
      <path
         inkscape:connector-curvature="0"
         id="path6066-10-4"
         d="m 15.293455,20.327686 v 2.854683 h 22.391548 v -2.806331"
         style="fill:none;stroke:#000000;stroke-width:0.25;stroke-linecap:butt;stroke-linejoin:miter;stroke-opacity:1" />
      <path
         inkscape:connector-curvature="0"
         id="path6068-35-9"
         d="m 26.726951,23.182369 v 9.103377"
         style="fill:none;stroke:#000000;stroke-width:0.25;stroke-linecap:butt;stroke-linejoin:miter;stroke-opacity:1" />
    </g>
    <g
       transform="rotate(180,104.86745,37.993233)"
       id="g6072-0-1"
       style="stroke-width:0.25">
      <path
         inkscape:connector-curvature="0"
         id="path6066-91-6"
         d="m 15.293455,20.327686 v 2.854683 h 22.391548 v -2.806331"
         style="fill:none;stroke:#000000;stroke-width:0.25;stroke-linecap:butt;stroke-linejoin:miter;stroke-opacity:1" />
      <path
         inkscape:connector-curvature="0"
         id="path6068-34-6"
         d="m 26.726951,23.182369 v 9.103377"
         style="fill:none;stroke:#000000;stroke-width:0.25;stroke-linecap:butt;stroke-linejoin:miter;stroke-opacity:1" />
    </g>
  </g>
</svg>
