/media/ssd/desarrollo/prueba_tecnica/src/main/java/org/rlnieto/tracking/service/LogService.java
/media/ssd/desarrollo/prueba_tecnica/src/main/java/org/rlnieto/tracking/resource/TrackingResource.java
/media/ssd/desarrollo/prueba_tecnica/src/main/java/org/rlnieto/tracking/model/Tracking.java
/media/ssd/desarrollo/prueba_tecnica/src/main/java/org/rlnieto/tracking/model/Item.java
/media/ssd/desarrollo/prueba_tecnica/src/main/java/org/rlnieto/tracking/service/TrackingService.java
/media/ssd/desarrollo/prueba_tecnica/src/main/java/org/rlnieto/tracking/model/Log.java
