{
    "accent seasoning": 232,
    "acorn squash": 61,
    "active dry yeast": 252,
    "adobo sauce": 210,
    "adobo seasoning": 148,
    "agar": 33,
    "agave": 187,
    "agave nectar": 187,
    "agave syrup": 187,
    "aioli": 269,
    "albacore tuna": 66,
    "alcohol": 338,
    "ale": 240,
    "alfalfa sprout": 226,
    "alfalfa sprouts": 289,
    "alfredo sauce": 41,
    "allspice": 85,
    "allspice berries": 351,
    "almond bark": 319,
    "almond butter": 187,
    "almond extract": 280,
    "almond flavoring": 315,
    "almond flour": 297,
    "almond meal": 74,
    "almond milk": 277,
    "almond paste": 280,
    "almonds": 118,
    "aluminum foil": 257,
    "amaretti cookies": 288,
    "amaretto": 239,
    "amaretto liqueur": 239,
    "american cheese": 122,
    "anaheim chilies": 343,
    "ancho chili": 322,
    "ancho chilies": 322,
    "anchovies": 260,
    "anchovy": 260,
    "anchovy fillet": 260,
    "anchovy fillets": 260,
    "anchovy paste": 260,
    "andouille sausage": 273,
    "andouille sausages": 273,
    "angel flake coconut": 6,
    "angel food cake": 288,
    "angel hair pasta": 149,
    "angostura bitters": 279,
    "anise": 270,
    "anise extract": 225,
    "anise seed": 225,
    "anise seeds": 137,
    "apple": 36,
    "apple brandy": 83,
    "apple butter": 253,
    "apple cider": 83,
    "apple cider vinegar": 119,
    "apple jelly": 123,
    "apple juice": 83,
    "apple juice concentrate": 83,
    "apple pie filling": 216,
    "apple pie spice": 263,
    "apples": 216,
    "applesauce": 253,
    "apricot": 123,
    "apricot brandy": 329,
    "apricot halves": 206,
    "apricot jam": 123,
    "apricot nectar": 123,
    "apricot preserves": 123,
    "apricots": 214,
    "arborio rice": 195,
    "arrowroot": 187,
    "artichoke": 135,
    "artichoke heart": 135,
    "artichoke hearts": 135,
    "artichokes": 135,
    "artificial sweetener": 106,
    "arugula": 184,
    "arugula leaves": 184,
    "asiago cheese": 15,
    "asian chili sauce": 9,
    "asparagus": 125,
    "asparagus spears": 125,
    "asparagus tips": 125,
    "aubergine": 54,
    "aubergines": 54,
    "avocado": 50,
    "avocados": 50,
    "baby artichokes": 301,
    "baby arugula": 184,
    "baby back ribs": 261,
    "baby bella mushrooms": 209,
    "baby bok choy": 177,
    "baby carrots": 27,
    "baby clams": 272,
    "baby corn": 177,
    "baby greens": 249,
    "baby lima beans": 309,
    "baby portabella mushrooms": 183,
    "baby potatoes": 236,
    "baby red potatoes": 236,
    "baby shrimp": 39,
    "baby spinach": 160,
    "baby spinach leaves": 160,
    "bacon": 38,
    "bacon bits": 38,
    "bacon drippings": 232,
    "bacon fat": 232,
    "bacon grease": 232,
    "bagel": 174,
    "bagels": 174,
    "baguette": 228,
    "baileys irish cream": 327,
    "baked beans": 244,
    "baking apples": 216,
    "baking chocolate": 315,
    "baking cocoa": 315,
    "baking mix": 105,
    "baking potato": 58,
    "baking potatoes": 58,
    "baking powder": 252,
    "baking sheet": 242,
    "baking soda": 131,
    "balsamic vinaigrette": 14,
    "balsamic vinegar": 87,
    "bamboo shoot": 93,
    "bamboo shoots": 93,
    "bamboo skewers": 271,
    "banana": 338,
    "banana liqueur": 34,
    "banana peppers": 343,
    "bananas": 6,
    "barbecue sauce": 56,
    "barley": 28,
    "barley flour": 72,
    "bartlett pears": 133,
    "basil": 40,
    "basil leaves": 64,
    "basil pesto": 64,
    "basmati rice": 195,
    "batter": 347,
    "bay leaf": 127,
    "bay leaves": 127,
    "bay scallops": 299,
    "bean sprouts": 177,
    "beans": 186,
    "beef": 25,
    "beef base": 223,
    "beef bouillon": 223,
    "beef bouillon cube": 223,
    "beef bouillon cubes": 223,
    "beef bouillon granules": 223,
    "beef brisket": 294,
    "beef broth": 223,
    "beef chuck": 294,
    "beef consomme": 223,
    "beef flank steak": 18,
    "beef gravy": 41,
    "beef mince": 341,
    "beef roast": 294,
    "beef round steak": 294,
    "beef short ribs": 294,
    "beef sirloin": 359,
    "beef sirloin steak": 359,
    "beef steak": 359,
    "beef stew meat": 294,
    "beef stock": 223,
    "beef tenderloin": 345,
    "beef tenderloin steaks": 345,
    "beefsteak tomato": 348,
    "beefsteak tomatoes": 348,
    "beer": 240,
    "beet": 251,
    "beetroot": 251,
    "beets": 251,
    "belgian endive": 80,
    "bell pepper": 4,
    "bell peppers": 4,
    "berries": 10,
    "bibb lettuce": 168,
    "bicarbonate soda": 303,
    "bing cherries": 333,
    "biscuit": 142,
    "biscuit mix": 105,
    "biscuits": 94,
    "bisquick": 105,
    "bisquick baking mix": 105,
    "bitters": 279,
    "bittersweet chocolate": 239,
    "bittersweet chocolate chips": 239,
    "bittersweet semisweet chocolate": 239,
    "black bean sauce": 9,
    "black beans": 245,
    "black forest ham": 193,
    "black mustard seeds": 132,
    "black olives": 95,
    "black pepper": 139,
    "black peppercorns": 219,
    "black sesame seeds": 114,
    "black tea": 308,
    "black vinegar": 93,
    "blackberries": 267,
    "blackberry": 10,
    "blackstrap molasses": 332,
    "blanched almond": 137,
    "blanched almonds": 137,
    "blanched slivered almonds": 137,
    "blood orange": 334,
    "blood orange juice": 334,
    "blood oranges": 334,
    "blue cheese": 63,
    "blue cheese dressing": 222,
    "blue curacao": 298,
    "blueberries": 267,
    "blueberry pie filling": 356,
    "bocconcini": 181,
    "boiled ham": 193,
    "boiled potatoes": 236,
    "boiling potatoes": 58,
    "boiling water": 144,
    "bok choy": 177,
    "bologna": 296,
    "boneless beef chuck": 294,
    "boneless beef sirloin": 359,
    "boneless chicken": 130,
    "boneless chicken breast": 130,
    "boneless chicken breasts": 130,
    "boneless chicken thighs": 130,
    "boneless chuck roast": 294,
    "boneless lamb shoulder": 325,
    "boneless pork": 18,
    "boneless pork chops": 18,
    "boneless pork loin": 18,
    "boneless pork shoulder": 221,
    "boneless skinless chicken": 130,
    "bonito flakes": 67,
    "bosc pears": 133,
    "boston butt": 261,
    "boston lettuce": 168,
    "boston lettuce leaves": 289,
    "bottled clam juice": 299,
    "bouillon": 223,
    "bouillon cube": 275,
    "bouillon cubes": 275,
    "bouquet garni": 323,
    "bourbon": 69,
    "bourbon whiskey": 69,
    "bow tie pasta": 149,
    "boysenberries": 270,
    "braggs liquid aminos": 342,
    "bran flakes": 295,
    "brandy": 190,
    "bratwurst": 362,
    "bratwursts": 362,
    "bread": 200,
    "bread cubes": 200,
    "bread dough": 94,
    "bread flour": 297,
    "bread machine yeast": 252,
    "breadcrumbs": 90,
    "breakfast sausage": 53,
    "brewed coffee": 203,
    "brewed espresso": 203,
    "brie cheese": 63,
    "brine": 260,
    "brioche bread": 200,
    "broccoli": 197,
    "broccoli floret": 197,
    "broccoli florets": 197,
    "broccoli rabe": 138,
    "broccolini": 125,
    "broiler": 205,
    "broth": 129,
    "brown gravy mix": 223,
    "brown lentils": 28,
    "brown mustard": 116,
    "brown mustard seeds": 132,
    "brown onion": 112,
    "brown rice": 213,
    "brown rice flour": 321,
    "brown rice syrup": 187,
    "brown sugar": 65,
    "brownie mix": 70,
    "brownies": 70,
    "browning sauce": 223,
    "brussels sprout": 61,
    "brussels sprouts": 247,
    "buckwheat flour": 74,
    "buffalo": 159,
    "buffalo wing sauce": 222,
    "bulgar wheat": 339,
    "bulgur": 339,
    "bulgur wheat": 339,
    "bulk italian sausage": 126,
    "bulk pork sausage": 53,
    "bulk sausage": 53,
    "bun": 269,
    "buns": 269,
    "burdock root": 67,
    "burgundy wine": 31,
    "butter": 30,
    "butter beans": 244,
    "butter flavor crisco": 157,
    "butter flavor shortening": 157,
    "butter lettuce": 249,
    "butter lettuce leaves": 289,
    "butter substitute": 277,
    "buttermilk": 265,
    "buttermilk biscuits": 94,
    "butternut squash": 61,
    "butterscotch chips": 212,
    "butterscotch pudding mix": 335,
    "butterscotch schnapps": 327,
    "button mushroom": 209,
    "button mushrooms": 209,
    "cabbage": 198,
    "cabbage leaves": 341,
    "cacao": 189,
    "caesar salad dressing": 222,
    "cajun seasoning": 273,
    "cake": 141,
    "cake flour": 297,
    "cake mix": 70,
    "calamari": 163,
    "calumet baking powder": 274,
    "calvados": 190,
    "camembert cheese": 0,
    "campari": 279,
    "canadian bacon": 193,
    "candied cherries": 225,
    "candied fruit": 225,
    "candied ginger": 133,
    "candied orange peel": 225,
    "candied pineapple": 225,
    "candies": 141,
    "candy": 212,
    "candy bar": 311,
    "candy bars": 212,
    "candy cane": 358,
    "candy canes": 358,
    "candy corn": 319,
    "candy sprinkles": 141,
    "cane syrup": 69,
    "canned artichoke hearts": 135,
    "canned beef broth": 350,
    "canned black beans": 245,
    "canned broth": 350,
    "canned chicken": 62,
    "canned chicken broth": 19,
    "canned chipotle chiles": 153,
    "canned corn": 185,
    "canned crushed pineapple": 8,
    "canned kidney beans": 120,
    "canned mandarin oranges": 324,
    "canned mushrooms": 191,
    "canned peaches": 206,
    "canned pineapple": 8,
    "canned plum tomatoes": 154,
    "canned pumpkin": 276,
    "canned pumpkin puree": 276,
    "canned tomato": 154,
    "canned tomato sauce": 23,
    "canned tomatoes": 154,
    "canned tuna": 66,
    "canned whole tomatoes": 154,
    "cannellini": 186,
    "cannellini beans": 186,
    "canola oil": 11,
    "cantaloupe": 107,
    "capellini": 146,
    "capers": 260,
    "capsicum": 100,
    "caramel": 335,
    "caramel candies": 335,
    "caramel sauce": 239,
    "caramel topping": 335,
    "caramels": 335,
    "caraway seed": 188,
    "caraway seeds": 188,
    "carbonated beverage": 310,
    "cardamom": 316,
    "cardamom pods": 316,
    "cardamom powder": 136,
    "cardamom seeds": 316,
    "carnation evaporated milk": 199,
    "carrot": 27,
    "carrot sticks": 27,
    "carrots": 27,
    "cashew nuts": 254,
    "cashews": 254,
    "casing": 220,
    "casings": 220,
    "caster sugar": 13,
    "catalina dressing": 14,
    "catfish": 314,
    "catfish fillets": 314,
    "catsup": 56,
    "cauliflower": 103,
    "cauliflower floret": 103,
    "cauliflower florets": 103,
    "caviar": 59,
    "cayenne": 79,
    "cayenne pepper": 79,
    "cayenne powder": 79,
    "celeriac": 150,
    "celery": 129,
    "celery leaves": 275,
    "celery rib": 129,
    "celery ribs": 129,
    "celery root": 150,
    "celery salt": 99,
    "celery seed": 99,
    "celery seeds": 99,
    "celery soup": 68,
    "cellophane noodles": 317,
    "cereal": 24,
    "certo": 35,
    "chablis": 287,
    "challah": 200,
    "chambord raspberry liquor": 270,
    "champagne": 287,
    "champagne vinegar": 87,
    "chanterelle mushrooms": 352,
    "chardonnay wine": 287,
    "cheddar cheese": 122,
    "cheddar cheese soup": 68,
    "cheese": 122,
    "cheese ravioli": 149,
    "cheese sauce": 357,
    "cheese slices": 289,
    "cheese spread": 357,
    "cheese tortellini": 149,
    "cheese whiz": 357,
    "cheesecake": 81,
    "cheesecloth": 323,
    "cheez whiz": 357,
    "cherries": 133,
    "cherry brandy": 333,
    "cherry juice": 333,
    "cherry peppers": 326,
    "cherry pie filling": 140,
    "cherry preserves": 123,
    "cherry tomatoes": 5,
    "chervil": 208,
    "chestnuts": 293,
    "chia seeds": 338,
    "chicken": 62,
    "chicken base": 275,
    "chicken bouillon": 275,
    "chicken bouillon cube": 275,
    "chicken bouillon cubes": 275,
    "chicken bouillon granule": 275,
    "chicken bouillon granules": 275,
    "chicken bouillon powder": 275,
    "chicken breast": 130,
    "chicken breast fillets": 130,
    "chicken breast halves": 130,
    "chicken breast tenders": 130,
    "chicken breasts": 130,
    "chicken broth": 19,
    "chicken cutlets": 130,
    "chicken drumsticks": 205,
    "chicken fat": 76,
    "chicken gravy": 41,
    "chicken legs": 205,
    "chicken liver": 293,
    "chicken livers": 293,
    "chicken meat": 62,
    "chicken parts": 205,
    "chicken pieces": 205,
    "chicken sausage": 126,
    "chicken soup": 68,
    "chicken stock": 19,
    "chicken stock cube": 218,
    "chicken stock powder": 227,
    "chicken tenderloins": 130,
    "chicken tenders": 130,
    "chicken thigh": 205,
    "chicken thighs": 205,
    "chicken wings": 205,
    "chickpea flour": 132,
    "chickpeas": 28,
    "chile": 210,
    "chili": 156,
    "chili beans": 245,
    "chili flakes": 96,
    "chili oil": 93,
    "chili paste": 9,
    "chili pepper": 96,
    "chili pepper flakes": 96,
    "chili peppers": 353,
    "chili powder": 245,
    "chili sauce": 56,
    "chili seasoning mix": 155,
    "chili with beans": 155,
    "chilies": 156,
    "chinese cabbage": 143,
    "chinese chives": 255,
    "chinese egg noodles": 268,
    "chinese noodles": 268,
    "chinese rice wine": 93,
    "chipotle chile": 153,
    "chipotle chiles": 153,
    "chipotle pepper": 153,
    "chipotle peppers": 153,
    "chips": 212,
    "chives": 208,
    "chocolate": 108,
    "chocolate bar": 327,
    "chocolate cake mix": 70,
    "chocolate chip cookie": 70,
    "chocolate chip cookies": 336,
    "chocolate chips": 212,
    "chocolate curls": 336,
    "chocolate frosting": 70,
    "chocolate fudge topping": 311,
    "chocolate hazelnut spread": 189,
    "chocolate ice cream": 311,
    "chocolate instant pudding": 140,
    "chocolate liqueur": 327,
    "chocolate milk": 327,
    "chocolate pieces": 319,
    "chocolate pudding": 140,
    "chocolate pudding mix": 140,
    "chocolate shavings": 189,
    "chocolate sprinkles": 311,
    "chocolate syrup": 140,
    "chocolate wafer cookies": 336,
    "chocolate wafer crumbs": 336,
    "chocolate wafers": 336,
    "chopped pimiento": 246,
    "chopped tomato": 5,
    "chopped tomatoes": 5,
    "chorizo sausage": 337,
    "chow mein noodles": 215,
    "chuck": 89,
    "chuck roast": 294,
    "chunky peanut butter": 82,
    "chunky salsa": 290,
    "chutney": 60,
    "ciabatta": 228,
    "ciabatta rolls": 269,
    "cider": 83,
    "cider vinegar": 119,
    "cilantro": 78,
    "cilantro leaf": 78,
    "cilantro leaves": 78,
    "cilantro stems": 78,
    "cinnamon": 16,
    "cinnamon raisin bread": 200,
    "cinnamon stick": 316,
    "cinnamon sticks": 316,
    "cinnamon sugar": 267,
    "citric acid": 308,
    "citron": 225,
    "clam juice": 299,
    "clams": 272,
    "clarified butter": 11,
    "clear honey": 281,
    "clementines": 334,
    "cloth": 283,
    "clove": 46,
    "cloves": 46,
    "club soda": 312,
    "coarse black pepper": 139,
    "coarse grain mustard": 49,
    "coarse salt": 101,
    "coarse sea salt": 101,
    "coarse sugar": 131,
    "coating mix": 14,
    "coco lopez": 88,
    "cocoa": 108,
    "cocoa powder": 108,
    "coconut": 6,
    "coconut cream": 32,
    "coconut extract": 141,
    "coconut flakes": 6,
    "coconut flour": 297,
    "coconut milk": 32,
    "coconut oil": 187,
    "coconut rum": 298,
    "coconut sugar": 187,
    "coconut water": 338,
    "cod": 302,
    "cod fish fillets": 266,
    "coffee": 203,
    "coffee beans": 189,
    "coffee creamer": 360,
    "coffee ice cream": 311,
    "coffee liqueur": 189,
    "cognac": 190,
    "cointreau liqueur": 22,
    "coke": 148,
    "cola": 261,
    "colby": 122,
    "colby cheese": 122,
    "cold water": 131,
    "coleslaw": 168,
    "coleslaw mix": 198,
    "collard greens": 247,
    "colored sprinkles": 319,
    "condensed beef broth": 223,
    "condensed chicken broth": 275,
    "condensed milk": 259,
    "condensed tomato soup": 23,
    "consomme": 227,
    "converted rice": 195,
    "cooked bacon": 38,
    "cooked beef": 296,
    "cooked brown rice": 213,
    "cooked chicken": 62,
    "cooked chicken breast": 62,
    "cooked chicken breasts": 62,
    "cooked egg noodles": 180,
    "cooked elbow macaroni": 3,
    "cooked ham": 193,
    "cooked lobster meat": 39,
    "cooked macaroni": 3,
    "cooked noodles": 180,
    "cooked pasta": 149,
    "cooked pork": 296,
    "cooked pumpkin": 276,
    "cooked quinoa": 213,
    "cooked rice": 195,
    "cooked shrimp": 163,
    "cooked spaghetti": 146,
    "cooked turkey": 62,
    "cooked turkey breast": 62,
    "cooked white rice": 195,
    "cooked wild rice": 304,
    "cookie": 311,
    "cookie cutter": 242,
    "cookies": 142,
    "cooking apples": 216,
    "cooking oil": 11,
    "cooking sherry": 169,
    "cooking spray": 346,
    "cooking wine": 93,
    "cool whip": 81,
    "cool whip free": 172,
    "cool whip lite": 172,
    "cool whip topping": 81,
    "coriander": 97,
    "coriander leaves": 97,
    "coriander powder": 235,
    "coriander seed": 234,
    "coriander seeds": 234,
    "corn": 185,
    "corn chex": 257,
    "corn chips": 26,
    "corn flake crumbs": 90,
    "corn flakes": 90,
    "corn husks": 173,
    "corn kernel": 185,
    "corn kernels": 185,
    "corn muffin mix": 284,
    "corn oil": 11,
    "corn syrup": 176,
    "corn tortilla": 26,
    "corn tortilla chips": 26,
    "corn tortillas": 26,
    "cornbread": 284,
    "cornbread mix": 284,
    "cornbread stuffing mix": 171,
    "corned beef": 362,
    "corned beef brisket": 362,
    "cornflour": 175,
    "cornichons": 229,
    "cornish hens": 18,
    "cornmeal": 194,
    "cornstarch": 308,
    "cotija cheese": 173,
    "cottage cheese": 75,
    "country bread": 228,
    "country ham": 49,
    "courgette": 218,
    "courgettes": 218,
    "couscous": 213,
    "crab": 39,
    "crabmeat": 39,
    "crabs": 314,
    "cracked black pepper": 139,
    "cracked pepper": 139,
    "cracked wheat": 339,
    "cracker": 14,
    "cracker crumb": 90,
    "cracker crumbs": 105,
    "crackers": 200,
    "craisins": 237,
    "cranberries": 231,
    "cranberry juice": 178,
    "cranberry juice cocktail": 308,
    "cranberry sauce": 231,
    "crawfish": 273,
    "crawfish tails": 273,
    "cream": 117,
    "cream cheese": 110,
    "cream cheese frosting": 319,
    "cream cheese spread": 110,
    "cream potato soup": 340,
    "cream sherry": 169,
    "creamed corn": 284,
    "creamy peanut butter": 82,
    "crema": 173,
    "creme cacao": 327,
    "creme cassis": 270,
    "creme fraiche": 175,
    "cremini mushroom": 209,
    "cremini mushrooms": 209,
    "creole mustard": 49,
    "creole seasoning": 273,
    "crepes": 217,
    "crescent roll dough": 94,
    "crescent rolls": 94,
    "crisco": 157,
    "crisco shortening": 157,
    "crisp bacon": 38,
    "crisp rice cereal": 262,
    "crispy rice cereal": 262,
    "croissants": 200,
    "crouton": 92,
    "croutons": 92,
    "crunchy peanut butter": 82,
    "crushed pineapple": 8,
    "crushed tomatoes": 154,
    "crusty bread": 228,
    "crystallized ginger": 16,
    "cube steaks": 205,
    "cubed ham": 193,
    "cucumber": 121,
    "cucumbers": 121,
    "cumin": 98,
    "cumin powder": 98,
    "cumin seed": 98,
    "cumin seeds": 98,
    "cupcakes": 141,
    "currant jelly": 123,
    "currants": 303,
    "curry": 60,
    "curry leaves": 235,
    "curry paste": 60,
    "curry powder": 60,
    "custard": 192,
    "custard powder": 327,
    "cut green beans": 102,
    "daikon radish": 67,
    "dark beer": 240,
    "dark brown sugar": 65,
    "dark chocolate": 239,
    "dark chocolate chips": 212,
    "dark cocoa": 108,
    "dark corn syrup": 176,
    "dark molasses": 332,
    "dark raisin": 85,
    "dark raisins": 85,
    "dark rum": 69,
    "dark sesame oil": 143,
    "dark soy sauce": 9,
    "dark sweet cherries": 333,
    "dashi": 67,
    "dashi stock": 227,
    "dates": 306,
    "deep fat": 242,
    "deli ham": 193,
    "deli roast beef": 296,
    "deli turkey": 330,
    "demerara sugar": 281,
    "desiccated coconut": 6,
    "dessert topping": 81,
    "diced green chilies": 156,
    "diced onion": 158,
    "diced onions": 158,
    "diced pimentos": 246,
    "diced tomato": 5,
    "diced tomatoes": 154,
    "digestive biscuits": 336,
    "dijon mustard": 116,
    "dill": 59,
    "dill pickle": 76,
    "dill pickle relish": 76,
    "dill pickle slices": 269,
    "dill pickles": 76,
    "dill seed": 351,
    "dill sprigs": 59,
    "dill weed": 59,
    "dinner rolls": 94,
    "dipping sauce": 317,
    "distilled white vinegar": 119,
    "ditalini": 186,
    "doritos": 26,
    "double cream": 175,
    "double crust": 216,
    "dream whip": 81,
    "dried ancho chile": 322,
    "dried ancho chiles": 322,
    "dried apple": 36,
    "dried apricot": 214,
    "dried apricots": 214,
    "dried basil": 40,
    "dried basil leaves": 40,
    "dried bay leaf": 127,
    "dried bay leaves": 127,
    "dried beans": 354,
    "dried beef": 246,
    "dried black beans": 245,
    "dried blueberries": 74,
    "dried bread": 90,
    "dried breadcrumbs": 90,
    "dried cherries": 214,
    "dried chili": 96,
    "dried chilies": 353,
    "dried chipotle powder": 153,
    "dried chives": 77,
    "dried cilantro": 78,
    "dried cranberries": 231,
    "dried currant": 85,
    "dried currants": 214,
    "dried dates": 306,
    "dried dill": 59,
    "dried dill weed": 59,
    "dried figs": 306,
    "dried fruit": 237,
    "dried garbanzo beans": 349,
    "dried herbs": 341,
    "dried italian seasoning": 40,
    "dried lentils": 28,
    "dried marjoram": 55,
    "dried mexican oregano": 322,
    "dried mint": 89,
    "dried mushrooms": 352,
    "dried mustard": 116,
    "dried navy beans": 354,
    "dried onion": 77,
    "dried onion flakes": 77,
    "dried oregano": 91,
    "dried oregano leaves": 91,
    "dried parsley": 55,
    "dried parsley flakes": 55,
    "dried pinto beans": 245,
    "dried porcini mushrooms": 352,
    "dried red chili": 96,
    "dried red chilies": 235,
    "dried red pepper": 241,
    "dried rosemary": 55,
    "dried rosemary leaves": 233,
    "dried rubbed sage": 243,
    "dried sage": 243,
    "dried savory": 304,
    "dried shiitake mushrooms": 165,
    "dried shredded coconut": 6,
    "dried shrimp": 361,
    "dried split peas": 28,
    "dried sweetened cranberries": 231,
    "dried tarragon": 287,
    "dried tarragon leaves": 193,
    "dried tart cherries": 333,
    "dried thyme": 113,
    "dried thyme leaves": 113,
    "dried tomatoes": 152,
    "dried yeast": 252,
    "drippings": 232,
    "dry active yeast": 252,
    "dry basil": 40,
    "dry bread": 90,
    "dry breadcrumbs": 90,
    "dry lentils": 28,
    "dry milk": 199,
    "dry mustard": 116,
    "dry onion": 307,
    "dry oregano": 91,
    "dry pasta": 149,
    "dry red wine": 31,
    "dry roasted peanuts": 115,
    "dry sherry": 169,
    "dry vermouth": 287,
    "dry white wine": 162,
    "dry yeast": 252,
    "duck": 261,
    "duck breasts": 18,
    "duck fat": 219,
    "dutch process cocoa": 108,
    "edamame": 125,
    "egg": 12,
    "egg bread": 200,
    "egg noodles": 180,
    "egg roll wraps": 196,
    "egg substitute": 75,
    "egg wash": 52,
    "egg white": 12,
    "egg whites": 12,
    "egg yolk": 12,
    "egg yolks": 34,
    "eggnog": 276,
    "eggplant": 54,
    "eggplants": 54,
    "eggs": 12,
    "elbow macaroni": 3,
    "enchilada sauce": 290,
    "endive": 80,
    "endives": 80,
    "english cucumber": 121,
    "english cucumbers": 121,
    "english muffin": 174,
    "english muffins": 200,
    "english mustard": 175,
    "english peas": 125,
    "english toffee": 335,
    "enoki mushrooms": 268,
    "equal sugar substitute": 106,
    "escarole": 247,
    "espresso": 189,
    "espresso powder": 189,
    "evaporated milk": 75,
    "evaporated skim milk": 75,
    "extra firm tofu": 207,
    "extra large egg": 12,
    "extra large eggs": 12,
    "extract": 141,
    "fajita seasoning mix": 155,
    "farfalle pasta": 149,
    "farina": 136,
    "farmer cheese": 142,
    "fast rising yeast": 252,
    "fat": 338,
    "fat free buttermilk": 265,
    "fat free cream": 75,
    "fava beans": 208,
    "fennel": 104,
    "fennel bulb": 104,
    "fennel bulbs": 104,
    "fennel seed": 20,
    "fennel seeds": 20,
    "fenugreek seeds": 132,
    "fermented black beans": 93,
    "feta": 63,
    "feta cheese": 63,
    "fettuccine": 149,
    "fettuccine pasta": 149,
    "fig": 214,
    "figs": 133,
    "filberts": 280,
    "file powder": 273,
    "filet mignon": 345,
    "fillets": 266,
    "fine breadcrumbs": 90,
    "fine dry breadcrumb": 90,
    "fine dry breadcrumbs": 90,
    "fine salt": 101,
    "fine sea salt": 101,
    "fine sugar": 281,
    "fingerling potatoes": 236,
    "firm bananas": 34,
    "firm silken tofu": 277,
    "firm tofu": 207,
    "firm white fish": 266,
    "fish": 266,
    "fish fillet": 266,
    "fish fillets": 266,
    "fish sauce": 285,
    "fish stock": 272,
    "five cheese blend": 14,
    "flaked coconut": 6,
    "flaked sea salt": 112,
    "flank steak": 359,
    "flank steaks": 18,
    "flat bread": 258,
    "flat leaf parsley": 138,
    "flavoring": 141,
    "flax seed": 72,
    "flax seed meal": 72,
    "flax seeds": 72,
    "flounder": 266,
    "flounder fillets": 314,
    "flour": 297,
    "flour tortilla": 26,
    "flour tortillas": 26,
    "focaccia bread": 174,
    "foie gras": 350,
    "fontina": 0,
    "fontina cheese": 0,
    "food coloring": 141,
    "frangelico": 270,
    "frank": 159,
    "frankfurters": 362,
    "franks": 159,
    "french baguette": 228,
    "french baguettes": 228,
    "french bread": 200,
    "french dressing": 116,
    "french fries": 269,
    "french onion soup": 307,
    "french rolls": 269,
    "fresh apricots": 333,
    "fresh asparagus": 125,
    "fresh basil": 64,
    "fresh basil leaf": 64,
    "fresh basil leaves": 64,
    "fresh bay leaves": 127,
    "fresh bean sprouts": 317,
    "fresh black pepper": 139,
    "fresh blackberries": 267,
    "fresh blueberries": 267,
    "fresh breadcrumb": 90,
    "fresh breadcrumbs": 90,
    "fresh broccoli": 197,
    "fresh broccoli florets": 197,
    "fresh cherries": 333,
    "fresh chervil": 208,
    "fresh chili pepper": 96,
    "fresh chives": 59,
    "fresh cilantro": 78,
    "fresh cilantro leaves": 78,
    "fresh cilantro stem": 161,
    "fresh cilantro stems": 78,
    "fresh coconut": 361,
    "fresh coriander": 97,
    "fresh coriander leaves": 97,
    "fresh corn": 185,
    "fresh corn kernels": 185,
    "fresh crabmeat": 39,
    "fresh cracked pepper": 139,
    "fresh cranberries": 231,
    "fresh cream": 175,
    "fresh dill": 59,
    "fresh dill weed": 59,
    "fresh figs": 133,
    "fresh fruit": 10,
    "fresh garlic": 21,
    "fresh garlic clove": 2,
    "fresh garlic cloves": 21,
    "fresh ginger": 73,
    "fresh gingerroot": 73,
    "fresh goat cheese": 63,
    "fresh green beans": 102,
    "fresh ground pepper": 139,
    "fresh herb": 182,
    "fresh herbs": 182,
    "fresh horseradish": 229,
    "fresh italian parsley": 138,
    "fresh jalapeno": 210,
    "fresh jalapeno pepper": 210,
    "fresh jalapeno peppers": 210,
    "fresh jalapenos": 210,
    "fresh lemon": 48,
    "fresh lemon juice": 7,
    "fresh lemon rind": 111,
    "fresh lemon zest": 111,
    "fresh lemongrass": 285,
    "fresh lime juice": 134,
    "fresh lump crabmeat": 39,
    "fresh mango": 88,
    "fresh marjoram": 124,
    "fresh mint leaves": 84,
    "fresh mozzarella cheese": 181,
    "fresh mushrooms": 191,
    "fresh nutmeg": 43,
    "fresh okra": 202,
    "fresh onion": 158,
    "fresh orange juice": 47,
    "fresh oregano": 124,
    "fresh parmesan cheese": 15,
    "fresh parsley": 138,
    "fresh parsley leaves": 138,
    "fresh parsley sprigs": 323,
    "fresh peach": 206,
    "fresh peaches": 267,
    "fresh peas": 125,
    "fresh pepper": 139,
    "fresh pineapple": 88,
    "fresh pineapple chunks": 8,
    "fresh pumpkin": 61,
    "fresh raspberries": 109,
    "fresh raspberry": 109,
    "fresh rhubarb": 216,
    "fresh ricotta": 283,
    "fresh rosemary": 124,
    "fresh rosemary leaf": 124,
    "fresh rosemary leaves": 124,
    "fresh sage": 233,
    "fresh sage leaves": 233,
    "fresh salmon": 167,
    "fresh shiitake mushrooms": 165,
    "fresh shrimp": 163,
    "fresh spinach": 160,
    "fresh spinach leaves": 160,
    "fresh strawberries": 10,
    "fresh tarragon": 59,
    "fresh tarragon leaves": 49,
    "fresh thyme": 45,
    "fresh thyme leave": 45,
    "fresh thyme leaves": 45,
    "fresh thyme sprig": 45,
    "fresh thyme sprigs": 45,
    "fresh thyme teaspoon": 45,
    "fresh tomato": 5,
    "fresh tomatoes": 5,
    "fresh tuna": 167,
    "fresh white breadcrumbs": 90,
    "fresh yeast": 252,
    "fried onions": 77,
    "frisee": 184,
    "fritos corn chips": 155,
    "frosting": 141,
    "frozen artichoke hearts": 135,
    "frozen baby peas": 179,
    "frozen blackberries": 267,
    "frozen blueberries": 109,
    "frozen bread dough": 94,
    "frozen broccoli": 197,
    "frozen broccoli florets": 197,
    "frozen cauliflower": 340,
    "frozen chopped broccoli": 193,
    "frozen chopped spinach": 160,
    "frozen corn": 185,
    "frozen corn kernels": 185,
    "frozen cranberries": 231,
    "frozen edamame": 125,
    "frozen green beans": 71,
    "frozen green pea": 179,
    "frozen green peas": 179,
    "frozen hash browns": 248,
    "frozen lemonade": 310,
    "frozen lemonade concentrate": 310,
    "frozen lima beans": 309,
    "frozen limeade concentrate": 310,
    "frozen meatballs": 25,
    "frozen mixed berries": 10,
    "frozen mixed vegetables": 71,
    "frozen okra": 202,
    "frozen orange juice": 47,
    "frozen peaches": 206,
    "frozen pearl onions": 331,
    "frozen peas": 179,
    "frozen puff pastry": 52,
    "frozen raspberries": 267,
    "frozen shrimp": 163,
    "frozen spinach": 160,
    "frozen strawberries": 10,
    "frozen tater tots": 248,
    "frozen unsweetened raspberries": 267,
    "frozen unsweetened strawberries": 172,
    "frozen vegetables": 71,
    "frozen whipped topping": 81,
    "frozen yogurt": 320,
    "fruit": 10,
    "fruit cocktail": 206,
    "fruit juice": 356,
    "fruit pectin": 35,
    "fryer": 205,
    "fryer chicken": 205,
    "fryer chickens": 205,
    "frying chicken": 205,
    "frying oil": 255,
    "fudge": 70,
    "fudge brownie mix": 70,
    "fuji apples": 133,
    "fusilli": 149,
    "gala apples": 216,
    "galangal": 285,
    "game": 18,
    "ganache": 239,
    "garam masala": 132,
    "garam masala powder": 235,
    "garbanzo beans": 213,
    "garlic": 21,
    "garlic butter": 278,
    "garlic chives": 255,
    "garlic clove": 21,
    "garlic cloves": 21,
    "garlic granules": 2,
    "garlic oil": 255,
    "garlic paste": 235,
    "garlic pepper seasoning": 278,
    "garlic powder": 2,
    "garlic salt": 2,
    "garlic sauce": 250,
    "gelatin": 356,
    "gelatin powder": 356,
    "genoa salami": 326,
    "german chocolate": 70,
    "german sweet chocolate": 315,
    "ghee": 316,
    "gherkins": 76,
    "gin": 279,
    "ginger": 73,
    "ginger ale": 308,
    "ginger beer": 312,
    "ginger juice": 255,
    "ginger paste": 73,
    "ginger powder": 73,
    "gingerroot": 73,
    "gingersnap cookies": 142,
    "gingersnaps": 336,
    "glace cherries": 303,
    "glaze": 267,
    "gluten": 321,
    "gluten flour": 297,
    "glutinous rice": 252,
    "gnocchi": 149,
    "goat cheese": 63,
    "gochujang": 255,
    "golden brown sugar": 65,
    "golden caster sugar": 281,
    "golden delicious apple": 36,
    "golden delicious apples": 216,
    "golden raisin": 85,
    "golden raisins": 85,
    "golden syrup": 303,
    "goose": 293,
    "gorgonzola": 63,
    "gouda cheese": 0,
    "graham cracker": 142,
    "graham cracker crumbs": 142,
    "graham cracker crust": 142,
    "graham crackers": 142,
    "grain": 195,
    "grain bread": 174,
    "grain cereal": 274,
    "grainy mustard": 49,
    "gram flour": 235,
    "grana padano": 283,
    "grand marnier": 192,
    "granny smith apples": 216,
    "granola cereal": 24,
    "granulated garlic": 2,
    "granulated onion": 77,
    "granulated sugar": 13,
    "grape jelly": 123,
    "grape juice": 231,
    "grape leaves": 339,
    "grape tomatoes": 5,
    "grapefruit": 334,
    "grapefruit juice": 178,
    "grapefruits": 334,
    "grapes": 291,
    "grapeseed oil": 11,
    "gravy": 304,
    "gray salt": 101,
    "great northern beans": 186,
    "greek yogurt": 17,
    "green apple": 36,
    "green apples": 216,
    "green beans": 102,
    "green bell pepper": 4,
    "green bell peppers": 4,
    "green cabbage": 198,
    "green capsicum": 100,
    "green cardamom pods": 316,
    "green chili": 156,
    "green chili pepper": 156,
    "green chili peppers": 156,
    "green chili salsa": 290,
    "green chilies": 156,
    "green curry paste": 285,
    "green enchilada sauce": 290,
    "green food coloring": 141,
    "green grapes": 291,
    "green leaf lettuce": 168,
    "green lentils": 28,
    "green olives": 164,
    "green onion": 145,
    "green onion tops": 145,
    "green onions": 145,
    "green peas": 179,
    "green pepper": 4,
    "green peppercorns": 190,
    "green peppers": 4,
    "green seedless grapes": 291,
    "green tea": 308,
    "green tomatoes": 314,
    "greens": 249,
    "grenadine": 298,
    "grey poupon": 14,
    "grilled chicken": 330,
    "grilled chicken breast": 62,
    "grits": 195,
    "ground allspice": 238,
    "ground almonds": 137,
    "ground beef": 25,
    "ground black pepper": 139,
    "ground cardamom": 316,
    "ground cayenne pepper": 79,
    "ground chicken": 86,
    "ground chuck": 25,
    "ground cinnamon": 16,
    "ground cloves": 29,
    "ground coffee": 203,
    "ground coriander": 60,
    "ground cumin": 98,
    "ground fennel": 20,
    "ground flax seeds": 72,
    "ground ginger": 73,
    "ground lamb": 89,
    "ground lean pork": 86,
    "ground mace": 303,
    "ground meat": 25,
    "ground mustard": 116,
    "ground nutmeg": 43,
    "ground oregano": 91,
    "ground paprika": 256,
    "ground pecans": 230,
    "ground pepper": 139,
    "ground pork": 86,
    "ground red pepper": 79,
    "ground round": 25,
    "ground sage": 243,
    "ground sausage": 53,
    "ground sirloin": 25,
    "ground thyme": 113,
    "ground turkey": 86,
    "ground turkey breast": 86,
    "ground turmeric": 235,
    "ground veal": 293,
    "ground venison": 25,
    "ground walnuts": 137,
    "ground white pepper": 139,
    "grouper": 302,
    "gruyere": 0,
    "gruyere cheese": 0,
    "guacamole": 26,
    "guinness stout": 31,
    "habanero": 344,
    "habanero pepper": 344,
    "habanero peppers": 344,
    "haddock": 266,
    "half cream": 117,
    "halibut": 266,
    "halibut fillets": 167,
    "halibut steaks": 167,
    "ham": 193,
    "ham bone": 354,
    "ham hock": 354,
    "ham hocks": 354,
    "ham steak": 193,
    "hamburger": 25,
    "hamburger bun": 269,
    "hamburger buns": 269,
    "hamburger meat": 25,
    "hard salami": 326,
    "hardboiled egg": 99,
    "harissa": 166,
    "hash brown potatoes": 248,
    "hash browns": 248,
    "hass avocado": 50,
    "hass avocadoes": 50,
    "havarti cheese": 0,
    "hazelnut oil": 80,
    "hazelnuts": 128,
    "head broccoli": 197,
    "head cauliflower": 103,
    "head iceberg lettuce": 168,
    "head lettuce": 168,
    "head romaine lettuce": 168,
    "heavy cream": 117,
    "heavy syrup": 355,
    "heavy whipping cream": 117,
    "heinz chili sauce": 56,
    "heirloom tomatoes": 348,
    "hen": 304,
    "herb stuffing mix": 171,
    "herbes provence": 124,
    "herbs": 182,
    "hoagie rolls": 269,
    "hoisin sauce": 9,
    "homemade chicken stock": 304,
    "hominy": 245,
    "honey": 238,
    "honey mustard": 116,
    "honey roasted peanuts": 115,
    "honeydew": 107,
    "honeydew melon": 107,
    "horseradish": 229,
    "horseradish sauce": 229,
    "hot chili oil": 9,
    "hot chili pepper": 353,
    "hot chili peppers": 353,
    "hot chili sauce": 250,
    "hot coffee": 203,
    "hot dog": 286,
    "hot dog buns": 269,
    "hot dogs": 362,
    "hot fudge": 311,
    "hot italian sausage": 126,
    "hot italian sausages": 126,
    "hot paprika": 256,
    "hot pepper": 96,
    "hot pepper flakes": 241,
    "hot pepper sauce": 57,
    "hot peppers": 351,
    "hot red pepper": 241,
    "hot sauce": 57,
    "hot sausage": 53,
    "hot water": 144,
    "hummus": 258,
    "hungarian paprika": 256,
    "ice": 33,
    "ice cream": 34,
    "ice cream topping": 335,
    "ice cube": 33,
    "ice cubes": 33,
    "ice water": 131,
    "iceberg lettuce": 289,
    "icing": 141,
    "icing sugar": 13,
    "idaho potatoes": 58,
    "imitation crabmeat": 39,
    "instant brown rice": 195,
    "instant chicken bouillon": 275,
    "instant coffee": 189,
    "instant coffee crystals": 189,
    "instant coffee granules": 189,
    "instant coffee powder": 189,
    "instant espresso": 189,
    "instant espresso powder": 189,
    "instant lemon pudding": 140,
    "instant mashed potatoes": 340,
    "instant minced garlic": 2,
    "instant minced onion": 77,
    "instant polenta": 149,
    "instant potato flakes": 340,
    "instant pudding mix": 140,
    "instant rice": 195,
    "instant vanilla pudding": 140,
    "instant yeast": 252,
    "irish cream": 327,
    "irish whiskey": 69,
    "israeli couscous": 213,
    "italian bread": 200,
    "italian breadcrumbs": 90,
    "italian cheese": 15,
    "italian cheese blend": 15,
    "italian dressing": 14,
    "italian herb seasoning": 40,
    "italian parsley": 138,
    "italian plum": 353,
    "italian plum tomatoes": 154,
    "italian salad dressing": 14,
    "italian sausage": 126,
    "italian sausages": 126,
    "italian seasoned breadcrumbs": 90,
    "italian seasoning": 40,
    "italian spices": 40,
    "italian style breadcrumbs": 90,
    "italian tomatoes": 154,
    "italian turkey sausage": 126,
    "jalapeno": 210,
    "jalapeno chile": 210,
    "jalapeno chiles": 210,
    "jalapeno pepper": 210,
    "jalapeno peppers": 210,
    "jalapenos": 210,
    "jam": 280,
    "japanese eggplant": 204,
    "japanese eggplants": 54,
    "jar": 42,
    "jarlsberg cheese": 0,
    "jars": 42,
    "jasmine rice": 195,
    "jellied cranberry sauce": 123,
    "jello gelatin": 356,
    "jelly": 280,
    "jelly beans": 319,
    "jicama": 305,
    "jiffy cornbread mix": 284,
    "juice": 7,
    "jumbo pasta shells": 217,
    "jumbo shrimp": 163,
    "juniper berries": 219,
    "kabocha squash": 227,
    "kaffir lime leaves": 285,
    "kahlua": 203,
    "kaiser rolls": 269,
    "kalamata olive": 95,
    "kalamata olives": 95,
    "kale": 247,
    "kale leaves": 247,
    "karo syrup": 176,
    "katakuriko": 227,
    "kernel corn": 185,
    "ketchup": 56,
    "key lime juice": 29,
    "kidney bean": 120,
    "kidney beans": 120,
    "kielbasa": 362,
    "kirby cucumbers": 121,
    "kirsch": 192,
    "kitchen bouquet": 223,
    "kiwi": 328,
    "kiwi fruit": 328,
    "kiwi fruits": 328,
    "knudsen sour cream": 110,
    "kombu": 67,
    "konnyaku": 255,
    "kosher salt": 101,
    "kraft caramels": 335,
    "kraft milk": 14,
    "kumquats": 334,
    "ladyfingers": 288,
    "lager beer": 240,
    "lamb": 325,
    "lamb chops": 18,
    "lamb loin chops": 18,
    "lamb shanks": 325,
    "lamb shoulder": 325,
    "lard": 232,
    "lardons": 293,
    "large marshmallows": 259,
    "large raw shrimp": 163,
    "large shrimp": 163,
    "lasagna noodle": 217,
    "lasagna noodles": 217,
    "lavender": 136,
    "leaf lettuce": 289,
    "leaf oregano": 91,
    "lean bacon": 38,
    "lean beef": 25,
    "lean ground beef": 25,
    "lean ground lamb": 89,
    "lean ground turkey": 86,
    "lean ham": 193,
    "lean hamburger": 25,
    "lean pork": 221,
    "leek": 44,
    "leek white": 44,
    "leeks": 44,
    "lemon": 48,
    "lemon cake mix": 70,
    "lemon curd": 109,
    "lemon extract": 141,
    "lemon gelatin": 356,
    "lemon juice": 7,
    "lemon juice taste": 7,
    "lemon peel": 111,
    "lemon pepper": 278,
    "lemon pepper seasoning": 278,
    "lemon rind": 111,
    "lemon slice": 264,
    "lemon slices": 264,
    "lemon twist": 279,
    "lemon wedge": 264,
    "lemon wedges": 264,
    "lemon yogurt": 265,
    "lemon zest": 111,
    "lemonade": 310,
    "lemongrass": 285,
    "lemons": 48,
    "lentils": 28,
    "lettuce": 289,
    "lettuce leaf": 289,
    "lettuce leaves": 289,
    "licorice": 319,
    "light beer": 240,
    "light brown sugar": 65,
    "light butter": 75,
    "light coconut milk": 32,
    "light corn syrup": 176,
    "light cream": 117,
    "light cream cheese": 110,
    "light margarine": 253,
    "light mayonnaise": 226,
    "light molasses": 332,
    "light olive oil": 11,
    "light rum": 329,
    "light sour cream": 346,
    "light soy sauce": 9,
    "light syrup": 206,
    "light whipped topping": 320,
    "lima beans": 309,
    "lime": 134,
    "lime juice": 134,
    "lime peel": 161,
    "lime rind": 161,
    "lime slice": 161,
    "lime slices": 329,
    "lime soda": 312,
    "lime wedge": 134,
    "lime wedges": 134,
    "lime zest": 161,
    "limeade": 310,
    "limes": 134,
    "limoncello": 270,
    "linguine": 146,
    "liqueur": 22,
    "liquid": 4,
    "liquid egg substitute": 346,
    "liquid honey": 281,
    "liquid pectin": 35,
    "liquid smoke": 261,
    "liquid smoke flavoring": 261,
    "liquor": 299,
    "littleneck clams": 272,
    "live lobsters": 286,
    "liver": 293,
    "lobster": 286,
    "lobster meat": 39,
    "lobster tails": 286,
    "lobsters": 286,
    "long grain rice": 195,
    "louisiana hot sauce": 57,
    "low fat buttermilk": 265,
    "lump crabmeat": 39,
    "macadamia nuts": 212,
    "macaroni": 3,
    "macaroni noodles": 3,
    "mace": 225,
    "mache": 80,
    "mackerel": 302,
    "madeira wine": 190,
    "madras curry powder": 60,
    "mahi mahi fillets": 167,
    "malibu rum": 298,
    "malt vinegar": 119,
    "manchego cheese": 63,
    "mandarin orange": 324,
    "mandarin orange segments": 324,
    "mandarin oranges": 324,
    "mango": 88,
    "mango chutney": 60,
    "mango nectar": 355,
    "mangoes": 88,
    "manicotti": 217,
    "manila clams": 272,
    "maple extract": 263,
    "maple flavoring": 263,
    "maple sugar": 263,
    "maple syrup": 238,
    "maraschino cherries": 300,
    "maraschino cherry": 315,
    "maraschino cherry juice": 358,
    "margarine": 157,
    "marinade": 271,
    "marinara sauce": 41,
    "marinated artichoke hearts": 135,
    "marjoram": 182,
    "marjoram leaves": 127,
    "marmalade": 123,
    "marsala": 190,
    "marsala wine": 162,
    "marshmallow cream": 300,
    "marshmallow creme": 300,
    "marshmallows": 259,
    "marzipan": 137,
    "masa harina": 173,
    "masala": 235,
    "mascarpone": 283,
    "mascarpone cheese": 109,
    "mashed banana": 253,
    "mashed bananas": 253,
    "mashed potatoes": 58,
    "mashed sweet potatoes": 263,
    "matzo meal": 70,
    "mayonnaise": 226,
    "mcintosh apples": 216,
    "meal": 194,
    "meat": 25,
    "meat tenderizer": 148,
    "meatballs": 25,
    "medium cheddar": 122,
    "medium egg noodles": 180,
    "medium grain rice": 195,
    "medium pasta shells": 3,
    "medium shrimp": 163,
    "melon": 107,
    "meringue": 141,
    "merlot": 350,
    "mesclun": 184,
    "mexican blend cheese": 318,
    "mexican cheese": 318,
    "mexican chocolate": 322,
    "mexican crema": 173,
    "mexican oregano": 153,
    "mexicorn": 318,
    "meyer lemon": 48,
    "meyer lemons": 334,
    "microwave popcorn": 257,
    "midori melon liqueur": 298,
    "mild cheddar cheese": 122,
    "mild chili powder": 153,
    "mild curry powder": 60,
    "mild green chilies": 156,
    "mild italian sausage": 126,
    "mild salsa": 290,
    "milk": 75,
    "milk chocolate": 212,
    "milk chocolate chips": 212,
    "millet": 213,
    "minced beef": 341,
    "minced clams": 272,
    "minced garlic clove": 21,
    "minced garlic cloves": 21,
    "minced ginger": 73,
    "mincemeat": 300,
    "mineral water": 312,
    "mini chocolate chip": 212,
    "mini chocolate chips": 212,
    "mini marshmallows": 259,
    "miniature marshmallow": 259,
    "miniature marshmallows": 259,
    "mint": 84,
    "mint extract": 358,
    "mint leaf": 84,
    "mint leaves": 84,
    "mint sprig": 328,
    "mint sprigs": 192,
    "minute rice": 195,
    "minute tapioca": 35,
    "minute white rice": 195,
    "miracle whip": 226,
    "miracle whip light": 226,
    "mirin": 143,
    "miso": 9,
    "mixed baby greens": 249,
    "mixed berries": 10,
    "mixed dried fruit": 303,
    "mixed fresh herbs": 182,
    "mixed fruit": 303,
    "mixed greens": 249,
    "mixed herbs": 341,
    "mixed italian herbs": 40,
    "mixed mushrooms": 209,
    "mixed nuts": 257,
    "mixed salad greens": 168,
    "mixed spice": 303,
    "mixed vegetables": 71,
    "mizuna": 67,
    "molasses": 332,
    "monosodium glutamate": 215,
    "monterey jack cheese": 318,
    "montrachet": 352,
    "morel": 352,
    "morels": 352,
    "mortadella": 326,
    "mozzarella cheese": 181,
    "mozzarella string cheese": 181,
    "msg": 93,
    "muenster cheese": 0,
    "muffins": 284,
    "mung bean sprouts": 317,
    "mushroom": 191,
    "mushroom caps": 183,
    "mushroom pieces": 191,
    "mushroom soup": 68,
    "mushroom stems": 191,
    "mushrooms": 191,
    "mussels": 299,
    "mustard": 116,
    "mustard greens": 247,
    "mustard powder": 116,
    "mustard seeds": 132,
    "nacho cheese": 318,
    "nam pla": 285,
    "napa cabbage": 198,
    "natural bran": 295,
    "natural yoghurt": 100,
    "navel orange": 178,
    "navel oranges": 178,
    "navy beans": 186,
    "nectarine": 206,
    "nectarines": 133,
    "neufchatel cheese": 346,
    "new potato": 236,
    "new potatoes": 236,
    "nicoise olives": 260,
    "nonfat milk": 75,
    "nonfat plain yogurt": 346,
    "nonfat sour cream": 346,
    "nonfat vanilla yogurt": 253,
    "nonfat yogurt": 17,
    "nonstick cooking spray": 346,
    "noodles": 180,
    "nori": 67,
    "nutella": 212,
    "nutmeg": 43,
    "nutritional yeast": 342,
    "nutritional yeast flakes": 342,
    "nuts": 24,
    "oat bran": 74,
    "oat flour": 297,
    "oatmeal": 24,
    "oats": 24,
    "octopus": 302,
    "oil": 11,
    "okara": 227,
    "okra": 202,
    "old bay seasoning": 39,
    "old cheddar cheese": 122,
    "old fashioned oats": 24,
    "oleo": 157,
    "olive": 95,
    "olive oil": 11,
    "olives": 95,
    "onion": 158,
    "onion flakes": 77,
    "onion powder": 77,
    "onion rings": 357,
    "onion salt": 77,
    "onion soup": 307,
    "onion soup mix": 307,
    "onions": 158,
    "orange": 178,
    "orange bell pepper": 213,
    "orange bell peppers": 204,
    "orange bitters": 279,
    "orange blossom water": 136,
    "orange extract": 22,
    "orange flower water": 136,
    "orange gelatin": 356,
    "orange juice": 47,
    "orange juice concentrate": 47,
    "orange liqueur": 22,
    "orange marmalade": 123,
    "orange peel": 170,
    "orange rind": 170,
    "orange sherbet": 310,
    "orange slice": 279,
    "orange slices": 308,
    "orange twist": 279,
    "orange zest": 170,
    "oranges": 178,
    "ore": 110,
    "orecchiette": 149,
    "oregano": 91,
    "oregano leaves": 91,
    "oreo cookies": 336,
    "oriental sesame oil": 143,
    "original sauce": 244,
    "orzo pasta": 149,
    "oscar mayer bacon": 14,
    "other sweet onion": 158,
    "oxtails": 294,
    "oyster": 352,
    "oyster crackers": 257,
    "oyster mushrooms": 352,
    "oyster sauce": 93,
    "oysters": 272,
    "palm sugar": 285,
    "pam cooking spray": 75,
    "pancake mix": 105,
    "pancake syrup": 206,
    "pancakes": 347,
    "pancetta": 233,
    "panko breadcrumbs": 90,
    "papaya": 88,
    "papayas": 88,
    "paper": 184,
    "paper towels": 242,
    "paprika": 256,
    "parchment paper": 242,
    "parmesan cheese": 15,
    "parmigiano": 15,
    "parsley": 138,
    "parsley flakes": 55,
    "parsley sprig": 323,
    "parsley sprigs": 323,
    "parsley stems": 323,
    "parsnip": 150,
    "parsnips": 150,
    "passata": 341,
    "passion fruit": 328,
    "pasta": 149,
    "pasta sauce": 41,
    "pasta shells": 149,
    "pastrami": 296,
    "pastry dough": 52,
    "pastry flour": 74,
    "pastry shells": 230,
    "pea pods": 177,
    "pea shoots": 125,
    "peach": 206,
    "peach nectar": 355,
    "peach preserves": 123,
    "peach schnapps": 355,
    "peach slices": 206,
    "peaches": 267,
    "peanut butter": 82,
    "peanut butter chips": 212,
    "peanut butter cups": 212,
    "peanut oil": 11,
    "peanut sauce": 250,
    "peanuts": 115,
    "pear": 133,
    "pearl barley": 213,
    "pearl onions": 331,
    "pears": 133,
    "peas": 179,
    "peasant bread": 228,
    "pecan halves": 211,
    "pecan pieces": 211,
    "pecans": 211,
    "pecorino cheese": 283,
    "pecorino romano cheese": 15,
    "pectin": 35,
    "penne": 149,
    "penne pasta": 149,
    "penne rigate": 149,
    "pepitas": 237,
    "pepper": 139,
    "pepper sauce": 57,
    "peppercorn": 219,
    "peppercorns": 219,
    "peppermint": 358,
    "peppermint candies": 358,
    "peppermint candy": 358,
    "peppermint extract": 358,
    "pepperoncini peppers": 326,
    "pepperoni": 126,
    "pepperoni slices": 40,
    "pernod": 299,
    "pesto sauce": 64,
    "philadelphia cream cheese": 110,
    "philadelphia neufchatel cheese": 110,
    "phyllo dough": 313,
    "phyllo pastry": 313,
    "phyllo pastry sheets": 313,
    "picante sauce": 290,
    "pickle": 76,
    "pickle juice": 76,
    "pickle relish": 76,
    "pickled ginger": 114,
    "pickled jalapeno pepper": 210,
    "pickled jalapeno peppers": 210,
    "pickles": 76,
    "pickling cucumbers": 351,
    "pickling salt": 351,
    "pickling spices": 351,
    "pie crust": 230,
    "pie crusts": 230,
    "pie dough": 131,
    "pie filling": 140,
    "pie pastry": 230,
    "pie shell": 230,
    "pie shells": 230,
    "pimento stuffed olive": 164,
    "pimento stuffed olives": 164,
    "pimentos": 246,
    "pimiento": 246,
    "pimientos": 246,
    "pine nuts": 128,
    "pineapple": 8,
    "pineapple chunk": 8,
    "pineapple chunks": 8,
    "pineapple juice": 8,
    "pineapple rings": 8,
    "pineapple slices": 8,
    "pineapple tidbits": 8,
    "pink grapefruit": 334,
    "pink lemonade": 310,
    "pink peppercorns": 334,
    "pink salmon": 66,
    "pinto beans": 245,
    "piquillo peppers": 152,
    "pistachio nut": 128,
    "pistachio nuts": 128,
    "pistachio pudding mix": 140,
    "pistachios": 128,
    "pita bread": 258,
    "pita bread rounds": 258,
    "pita breads": 258,
    "pita chips": 301,
    "pitted black olives": 95,
    "pitted dates": 306,
    "pitted prunes": 137,
    "pitted ripe olives": 95,
    "pizza cheese": 227,
    "pizza crust": 224,
    "pizza crusts": 224,
    "pizza dough": 224,
    "pizza sauce": 41,
    "plain breadcrumbs": 90,
    "plain flour": 297,
    "plain nonfat yogurt": 17,
    "plain soymilk": 277,
    "plain yogurt": 17,
    "plantains": 344,
    "planters pecans": 274,
    "planters sliced almonds": 274,
    "planters walnuts": 274,
    "plum": 348,
    "plum sauce": 9,
    "plum tomato": 5,
    "plum tomatoes": 5,
    "plums": 133,
    "poblano chile": 173,
    "poblano chiles": 173,
    "poblano pepper": 210,
    "poblano peppers": 210,
    "polenta": 149,
    "polish sausage": 362,
    "pomegranate": 178,
    "pomegranate juice": 350,
    "pomegranate molasses": 339,
    "pomegranate seeds": 128,
    "popcorn": 257,
    "popped popcorn": 257,
    "poppy seed": 51,
    "poppy seeds": 51,
    "porcini mushrooms": 352,
    "pork": 221,
    "pork and beans": 244,
    "pork belly": 221,
    "pork butt": 221,
    "pork chops": 18,
    "pork fat": 293,
    "pork loin": 18,
    "pork loin chops": 18,
    "pork loin roast": 18,
    "pork ribs": 261,
    "pork roast": 221,
    "pork sausage": 53,
    "pork shoulder": 221,
    "pork spareribs": 261,
    "pork tenderloin": 18,
    "port wine": 350,
    "portabella mushroom": 183,
    "portabella mushroom caps": 183,
    "portabella mushrooms": 183,
    "pot roast": 294,
    "potato": 58,
    "potato chips": 76,
    "potato flakes": 340,
    "potato flour": 321,
    "potato starch": 321,
    "potatoes": 58,
    "poultry seasoning": 243,
    "pound cake": 288,
    "powdered coffee creamer": 360,
    "powdered ginger": 73,
    "powdered milk": 199,
    "powdered sugar": 13,
    "prawns": 163,
    "prepared horseradish": 229,
    "prepared mustard": 116,
    "prepared pizza crust": 224,
    "prepared stuffing": 171,
    "prepared yellow mustard": 116,
    "preserved lemon": 325,
    "preserves": 123,
    "pretzel": 257,
    "pretzel sticks": 257,
    "pretzels": 257,
    "process american cheese": 122,
    "processed cheese": 122,
    "prosciutto": 0,
    "prosecco": 312,
    "protein powder": 338,
    "provolone cheese": 181,
    "prune": 137,
    "prunes": 303,
    "pudding": 140,
    "pudding mix": 140,
    "puff pastry": 52,
    "puff pastry sheets": 52,
    "pumpernickel bread": 174,
    "pumpkin": 276,
    "pumpkin pie filling": 276,
    "pumpkin pie spice": 16,
    "pumpkin puree": 276,
    "pumpkin seeds": 213,
    "pumpkin spice": 263,
    "pure maple syrup": 238,
    "pure olive oil": 11,
    "pure vanilla extract": 29,
    "puree": 20,
    "purple cabbage": 198,
    "purple onion": 158,
    "quail": 293,
    "quaker oats": 24,
    "queso blanco": 173,
    "queso fresco": 173,
    "quick oats": 24,
    "quinoa": 213,
    "rabbit": 293,
    "radicchio": 184,
    "radish": 305,
    "radishes": 305,
    "raisin bran cereal": 295,
    "raisins": 85,
    "ramen noodles": 268,
    "ranch dressing": 222,
    "ranch dressing mix": 222,
    "ranch salad dressing": 222,
    "ranch style beans": 245,
    "raspberries": 109,
    "raspberry jam": 280,
    "raspberry liqueur": 270,
    "raspberry preserves": 280,
    "raspberry vinaigrette dressing": 14,
    "raspberry vinegar": 87,
    "ravioli": 149,
    "raw cashews": 187,
    "raw honey": 187,
    "raw peanuts": 257,
    "raw potatoes": 248,
    "raw rice": 195,
    "raw shrimp": 163,
    "raw sugar": 187,
    "real butter": 30,
    "real maple syrup": 238,
    "red apple": 36,
    "red apples": 36,
    "red beans": 120,
    "red beets": 251,
    "red bell pepper": 151,
    "red bell peppers": 152,
    "red bliss potatoes": 58,
    "red cabbage": 198,
    "red capsicum": 100,
    "red capsicums": 100,
    "red chile": 96,
    "red chili pepper": 96,
    "red chili peppers": 353,
    "red chili powder": 235,
    "red chilies": 96,
    "red currant jelly": 280,
    "red curry paste": 285,
    "red delicious apples": 216,
    "red enchilada sauce": 290,
    "red food coloring": 141,
    "red grapefruit": 334,
    "red grapes": 291,
    "red hot pepper": 353,
    "red hot sauce": 57,
    "red kidney beans": 120,
    "red leaf lettuce": 168,
    "red lentil": 28,
    "red lentils": 28,
    "red miso": 268,
    "red onion": 158,
    "red onions": 158,
    "red pepper": 151,
    "red pepper flakes": 241,
    "red pepper sauce": 57,
    "red peppers": 151,
    "red potatoes": 58,
    "red radishes": 305,
    "red seedless grapes": 291,
    "red snapper": 266,
    "red snapper fillets": 266,
    "red wine": 31,
    "red wine vinegar": 87,
    "refried beans": 290,
    "refrigerated biscuits": 94,
    "refrigerated buttermilk biscuits": 94,
    "refrigerated pie crust": 230,
    "refrigerated pie crusts": 230,
    "relish": 76,
    "reynolds wrap foil": 355,
    "rhubarb": 267,
    "rib": 233,
    "rib eye steaks": 345,
    "ribbon": 358,
    "ribs": 273,
    "rice": 195,
    "rice chex": 257,
    "rice flour": 321,
    "rice krispies": 262,
    "rice milk": 277,
    "rice noodles": 317,
    "rice paper": 317,
    "rice vermicelli": 317,
    "rice vinegar": 147,
    "rice wine": 93,
    "rice wine vinegar": 147,
    "ricotta cheese": 283,
    "ricotta salata": 283,
    "rigatoni pasta": 149,
    "ripe olives": 95,
    "risotto rice": 175,
    "ritz cracker": 171,
    "ritz crackers": 171,
    "roast": 294,
    "roast beef": 296,
    "roasted almonds": 118,
    "roasted cashews": 254,
    "roasted garlic": 21,
    "roasted peanuts": 115,
    "roasted red pepper": 152,
    "roasted red peppers": 152,
    "roasted sesame seeds": 292,
    "roasted sunflower seeds": 237,
    "roasted turkey": 330,
    "roasted unsalted peanuts": 115,
    "roasting chicken": 205,
    "roasting chickens": 205,
    "rock salt": 234,
    "rocket": 112,
    "roll": 196,
    "rolled oats": 24,
    "rolls": 269,
    "roma": 50,
    "roma tomato": 5,
    "roma tomatoes": 5,
    "romaine lettuce": 168,
    "romaine lettuce hearts": 168,
    "romaine lettuce leaves": 289,
    "romano cheese": 15,
    "root beer": 203,
    "roquefort cheese": 80,
    "rose water": 136,
    "rosemary": 124,
    "rosemary sprig": 350,
    "rosemary sprigs": 124,
    "rotel": 290,
    "rotel tomatoes": 290,
    "rotini pasta": 149,
    "round roast": 294,
    "round steak": 359,
    "round steaks": 294,
    "roux": 227,
    "rubbed sage": 243,
    "ruby port": 350,
    "rum": 329,
    "rum extract": 329,
    "rump roast": 294,
    "russet baking potatoes": 58,
    "russet potato": 58,
    "russet potatoes": 58,
    "rutabaga": 150,
    "rutabagas": 150,
    "rye bread": 200,
    "rye flour": 252,
    "rye whiskey": 279,
    "safflower oil": 11,
    "saffron": 166,
    "saffron thread": 166,
    "saffron threads": 166,
    "sage": 243,
    "sage leaves": 233,
    "sake": 227,
    "salad dressing": 222,
    "salad greens": 249,
    "salad leaves": 112,
    "salad oil": 11,
    "salami": 326,
    "salmon": 167,
    "salmon fillet": 167,
    "salmon fillets": 167,
    "salmon steaks": 167,
    "salsa": 290,
    "salsa verde": 290,
    "salt": 101,
    "salt and pepper": 101,
    "salt pork": 354,
    "salt substitute": 342,
    "salt water": 232,
    "salted butter": 30,
    "salted cashews": 118,
    "salted peanuts": 115,
    "saltine crackers": 90,
    "saltines": 90,
    "sambal oelek": 250,
    "san marzano tomatoes": 154,
    "sandwich bread": 200,
    "sandwich buns": 269,
    "sardines": 66,
    "sauerkraut": 188,
    "sausage": 53,
    "sausage links": 53,
    "sausages": 341,
    "savory": 182,
    "savoy cabbage": 198,
    "scallion": 145,
    "scallions": 145,
    "scallops": 299,
    "scotch": 344,
    "scotch bonnet pepper": 344,
    "sea bass": 302,
    "sea bass fillets": 167,
    "sea salt": 101,
    "sea scallops": 163,
    "seafood": 286,
    "seafood cocktail sauce": 39,
    "seafood seasoning": 39,
    "season salt": 148,
    "seasoned bread crumbs": 90,
    "seasoned croutons": 92,
    "seasoned flour": 52,
    "seasoned pepper": 278,
    "seasoned rice vinegar": 147,
    "seasoned stuffing mix": 171,
    "seasoning": 148,
    "seasoning salt": 148,
    "seed oil": 247,
    "seedless cucumber": 121,
    "seedless grapes": 291,
    "seedless raisin": 85,
    "seedless raisins": 85,
    "seedless raspberry jam": 280,
    "seedless watermelon": 107,
    "seeds": 134,
    "seitan": 207,
    "self raising flour": 105,
    "self rising flour": 105,
    "seltzer water": 312,
    "semisweet baking chocolate": 315,
    "semisweet chocolate": 239,
    "semisweet chocolate chips": 212,
    "semisweet chocolate morsel": 212,
    "semisweet chocolate morsels": 212,
    "semolina": 136,
    "semolina flour": 252,
    "serrano chili": 343,
    "serrano chilies": 343,
    "serrano ham": 337,
    "serrano pepper": 343,
    "serrano peppers": 343,
    "sesame": 292,
    "sesame dressing": 14,
    "sesame oil": 143,
    "sesame paste": 349,
    "sesame seed oil": 143,
    "sesame seed paste": 349,
    "sesame seeds": 292,
    "shallot": 158,
    "shallots": 44,
    "shaoxing wine": 93,
    "sharp cheddar cheese": 122,
    "sharp cheese": 122,
    "shell pasta": 3,
    "shelled pistachios": 128,
    "sherry wine": 169,
    "sherry wine vinegar": 87,
    "shiitake mushroom": 165,
    "shiitake mushroom caps": 165,
    "shiitake mushrooms": 165,
    "shimeji mushrooms": 227,
    "shiso leaves": 67,
    "shortbread cookies": 336,
    "shortcrust pastry": 52,
    "shortening": 157,
    "shoyu": 207,
    "shredded cheddar cheese": 122,
    "shredded coconut": 6,
    "shrimp": 163,
    "shrimp paste": 361,
    "shrimp stock": 299,
    "sifted flour": 297,
    "silken tofu": 207,
    "simple syrup": 312,
    "simply potatoes": 318,
    "single cream": 175,
    "sirloin": 359,
    "sirloin steak": 359,
    "sirloin steaks": 359,
    "skewers": 271,
    "skim milk": 75,
    "skim milk powder": 199,
    "skinless chicken breast": 130,
    "skinless chicken breasts": 130,
    "skinless chicken thighs": 205,
    "skirt steak": 345,
    "skirt steaks": 345,
    "sliced almonds": 118,
    "sliced apples": 216,
    "sliced mushrooms": 191,
    "sliced ripe olives": 95,
    "sliced water chestnuts": 215,
    "slivered almonds": 118,
    "small onion": 158,
    "small potato": 236,
    "small potatoes": 236,
    "small red potatoes": 236,
    "small shell pasta": 3,
    "small shrimp": 163,
    "small white beans": 186,
    "smoked bacon": 38,
    "smoked gouda cheese": 0,
    "smoked ham": 193,
    "smoked ham hock": 354,
    "smoked ham hocks": 354,
    "smoked mozzarella cheese": 181,
    "smoked paprika": 256,
    "smoked salmon": 66,
    "smoked sausage": 273,
    "smoked turkey": 330,
    "smoked turkey breast": 330,
    "smooth peanut butter": 82,
    "snap peas": 177,
    "snow pea pods": 177,
    "snow peas": 177,
    "soaked water": 166,
    "soba noodles": 268,
    "soda water": 312,
    "soft breadcrumbs": 90,
    "soft brown sugar": 281,
    "soft cream cheese": 37,
    "soft margarine": 172,
    "soft tofu": 207,
    "sole": 266,
    "sole fillets": 266,
    "solid pack pumpkin": 276,
    "solid white tuna": 66,
    "sorghum flour": 321,
    "sorrel": 208,
    "soup": 68,
    "soup mix": 307,
    "soup stock": 227,
    "sour cherries": 333,
    "sour cream": 346,
    "sour milk": 295,
    "sour mix": 298,
    "sourdough bread": 200,
    "sourdough starter": 252,
    "southern comfort": 298,
    "soy flour": 297,
    "soy sauce": 9,
    "soy yogurt": 277,
    "soya sauce": 9,
    "soybeans": 309,
    "soymilk": 277,
    "spaghetti": 146,
    "spaghetti noodles": 146,
    "spaghetti sauce": 41,
    "spaghetti squash": 149,
    "spaghettini": 146,
    "spam": 66,
    "spanish chorizo": 337,
    "spanish olives": 164,
    "spanish onion": 158,
    "spanish onions": 158,
    "spareribs": 261,
    "sparkling water": 312,
    "sparkling wine": 312,
    "spelt": 72,
    "spelt flour": 297,
    "spice cake mix": 70,
    "spiced rum": 329,
    "spices": 341,
    "spicy brown mustard": 116,
    "spicy mustard": 116,
    "spicy sausage": 273,
    "spinach": 160,
    "spinach leaves": 160,
    "spiral shaped pasta": 149,
    "splenda granular": 106,
    "splenda sugar substitute": 106,
    "split peas": 28,
    "sponge cake": 288,
    "spring greens": 249,
    "spring onion": 112,
    "spring onions": 112,
    "spring roll wrappers": 196,
    "sprite": 312,
    "squash": 204,
    "squid": 163,
    "sriracha sauce": 250,
    "stale bread": 200,
    "star anise": 234,
    "starch": 206,
    "steak": 359,
    "steak sauce": 223,
    "steak seasoning": 269,
    "steaks": 345,
    "steamed rice": 93,
    "steel cut oats": 72,
    "stevia": 338,
    "stew meat": 294,
    "stewed tomatoes": 154,
    "stewing beef": 294,
    "stick": 1,
    "sticks": 1,
    "stilton cheese": 0,
    "stir fry vegetables": 71,
    "stock": 227,
    "stone ground mustard": 49,
    "stout beer": 240,
    "strawberries": 10,
    "strawberry": 10,
    "strawberry gelatin": 356,
    "strawberry ice cream": 311,
    "strawberry jam": 280,
    "strawberry jelly": 356,
    "strawberry preserves": 280,
    "strawberry yogurt": 320,
    "streaky bacon": 175,
    "string": 323,
    "string beans": 102,
    "strip steaks": 345,
    "striped bass": 302,
    "strong black coffee": 203,
    "strong coffee": 203,
    "stuffed green olives": 164,
    "stuffed olives": 164,
    "sucanat": 187,
    "suet": 225,
    "sugar": 13,
    "sugar cookie": 94,
    "sugar snap pea": 177,
    "sugar snap peas": 125,
    "sugar substitute": 106,
    "sugar syrup": 312,
    "sultana": 303,
    "sultanas": 303,
    "sumac": 301,
    "summer squash": 204,
    "sunflower oil": 11,
    "sunflower seeds": 237,
    "superfine sugar": 13,
    "sushi rice": 67,
    "sweet baking chocolate": 315,
    "sweet basil": 40,
    "sweet bell pepper": 151,
    "sweet bell peppers": 353,
    "sweet butter": 30,
    "sweet cherries": 333,
    "sweet chili sauce": 250,
    "sweet chocolate": 239,
    "sweet corn": 185,
    "sweet cream": 313,
    "sweet green pepper": 4,
    "sweet hungarian paprika": 256,
    "sweet italian sausage": 126,
    "sweet onion": 158,
    "sweet onions": 158,
    "sweet paprika": 256,
    "sweet peas": 179,
    "sweet pepper": 151,
    "sweet peppers": 4,
    "sweet pickle relish": 76,
    "sweet pickles": 76,
    "sweet potato": 61,
    "sweet potatoes": 61,
    "sweet red pepper": 151,
    "sweet red peppers": 151,
    "sweet relish": 76,
    "sweet rice": 114,
    "sweet rice flour": 321,
    "sweet sherry": 169,
    "sweet soy sauce": 285,
    "sweet vermouth": 279,
    "sweetcorn": 218,
    "sweetened coconut": 6,
    "sweetened condensed milk": 13,
    "sweetened flaked coconut": 6,
    "sweetened whipped cream": 192,
    "swiss chard": 247,
    "swiss cheese": 0,
    "swordfish": 302,
    "swordfish steaks": 167,
    "syrup": 109,
    "tabasco sauce": 57,
    "table salt": 101,
    "taco sauce": 290,
    "taco seasoning": 155,
    "taco seasoning mix": 155,
    "taco shells": 26,
    "tahini": 301,
    "tahini paste": 301,
    "tamari": 353,
    "tamari soy sauce": 9,
    "tamarind paste": 361,
    "tamarind pulp": 361,
    "tangerine": 334,
    "tangerine juice": 334,
    "tangerines": 334,
    "tap water": 144,
    "tapenade": 348,
    "tapioca": 216,
    "tapioca flour": 321,
    "tapioca starch": 321,
    "tarragon": 208,
    "tarragon leaves": 208,
    "tarragon vinegar": 87,
    "tart apple": 36,
    "tart apples": 216,
    "tartar": 176,
    "tartar sauce": 314,
    "tasty cheese": 100,
    "tater tots": 248,
    "tawny port": 350,
    "tea": 308,
    "tea bags": 308,
    "tempeh": 207,
    "tenderloin": 345,
    "tequila": 50,
    "teriyaki marinade": 9,
    "teriyaki sauce": 9,
    "texas pete": 159,
    "textured vegetable protein": 342,
    "thai basil": 317,
    "thai chile": 317,
    "thai chiles": 285,
    "thai fish sauce": 285,
    "thickened cream": 175,
    "thin spaghetti": 146,
    "thousand island dressing": 222,
    "thyme": 45,
    "thyme leaves": 45,
    "tilapia fillets": 167,
    "tiny new potatoes": 236,
    "toast": 200,
    "toasted almond": 118,
    "toasted almonds": 118,
    "toasted hazelnuts": 118,
    "toasted oat cereal": 257,
    "toasted sesame": 14,
    "toasted sesame oil": 143,
    "toasted sesame seeds": 292,
    "toasted sliced almonds": 118,
    "toasted wheat germ": 72,
    "toffee pieces": 212,
    "tofu": 207,
    "tomatillo": 173,
    "tomatillo salsa": 173,
    "tomatillos": 173,
    "tomato juice": 23,
    "tomato ketchup": 56,
    "tomato paste": 23,
    "tomato puree": 23,
    "tomato sauce": 23,
    "tomato soup": 23,
    "tomatoes": 5,
    "tomatoes with juice": 154,
    "tonic water": 312,
    "toothpick": 201,
    "toothpicks": 201,
    "top round steak": 359,
    "top sirloin steak": 345,
    "top sirloin steaks": 345,
    "tortellini": 149,
    "tortilla": 26,
    "tortilla chips": 26,
    "tortillas": 26,
    "triple sec": 22,
    "trout": 167,
    "trout fillets": 314,
    "truffle oil": 352,
    "tuna": 66,
    "tuna fish": 66,
    "tuna steaks": 167,
    "turbinado sugar": 238,
    "turkey": 86,
    "turkey bacon": 193,
    "turkey breast": 130,
    "turkey broth": 304,
    "turkey gravy": 304,
    "turkey sausage": 53,
    "turkey stock": 304,
    "turmeric": 235,
    "turmeric powder": 235,
    "turnip": 150,
    "turnip greens": 354,
    "turnips": 150,
    "udon noodles": 268,
    "umeboshi": 67,
    "unbaked pie shell": 230,
    "unbaked pie shells": 230,
    "unbleached bread flour": 297,
    "unbleached cane sugar": 187,
    "unbleached flour": 297,
    "unbleached white flour": 297,
    "uncooked rice": 195,
    "unflavored gelatin": 33,
    "unsalted butter": 30,
    "unsalted cashews": 254,
    "unsalted chicken stock": 19,
    "unsalted margarine": 189,
    "unsalted peanuts": 115,
    "unseasoned breadcrumbs": 90,
    "unsifted flour": 297,
    "unsulphured molasses": 332,
    "unsweetened almond milk": 187,
    "unsweetened apple juice": 83,
    "unsweetened applesauce": 253,
    "unsweetened baking chocolate": 315,
    "unsweetened chocolate": 315,
    "unsweetened chocolate squares": 315,
    "unsweetened cocoa": 108,
    "unsweetened cocoa powder": 108,
    "unsweetened coconut": 6,
    "unsweetened coconut milk": 32,
    "unsweetened flaked coconut": 6,
    "unsweetened pineapple juice": 88,
    "urad dal": 132,
    "vanilla": 29,
    "vanilla bean": 192,
    "vanilla bean paste": 192,
    "vanilla bean seeds": 192,
    "vanilla beans": 192,
    "vanilla cake mix": 70,
    "vanilla essence": 29,
    "vanilla extract": 29,
    "vanilla flavoring": 29,
    "vanilla frosting": 319,
    "vanilla frozen yogurt": 320,
    "vanilla greek yogurt": 338,
    "vanilla ice cream": 34,
    "vanilla pod": 192,
    "vanilla protein powder": 338,
    "vanilla pudding mix": 140,
    "vanilla sugar": 280,
    "vanilla vodka": 327,
    "vanilla wafer cookies": 336,
    "vanilla wafer crumbs": 336,
    "vanilla wafers": 142,
    "vanilla yogurt": 17,
    "veal": 293,
    "veal cutlets": 130,
    "veal stock": 190,
    "vegan butter": 277,
    "vegan margarine": 277,
    "vegan mayonnaise": 342,
    "vegemite": 100,
    "vegetable bouillon cube": 207,
    "vegetable bouillon cubes": 28,
    "vegetable broth": 19,
    "vegetable juice": 23,
    "vegetable oil": 11,
    "vegetable shortening": 157,
    "vegetable soup mix": 155,
    "vegetable stock": 19,
    "vegetables": 103,
    "velveeta cheese": 122,
    "venison": 294,
    "vermicelli": 317,
    "vermouth": 287,
    "vidalia onion": 158,
    "vidalia onions": 158,
    "vinaigrette": 249,
    "vinaigrette dressing": 14,
    "vinegar": 119,
    "virgin olive oil": 11,
    "vital wheat gluten": 252,
    "vodka": 33,
    "wafers": 142,
    "waffle": 347,
    "walnut halves": 211,
    "walnut oil": 80,
    "walnut pieces": 211,
    "walnuts": 211,
    "warm water": 144,
    "wasabi": 114,
    "wasabi paste": 114,
    "wasabi powder": 114,
    "water": 144,
    "water chestnut": 215,
    "water chestnuts": 215,
    "water milk": 360,
    "watercress": 249,
    "watermelon": 107,
    "wax paper": 242,
    "wheat": 74,
    "wheat berries": 213,
    "wheat bran": 295,
    "wheat crackers": 174,
    "wheat flour": 74,
    "wheat germ": 72,
    "wheat hamburger buns": 269,
    "whey protein powder": 338,
    "whipped cream": 192,
    "whipped cream cheese": 37,
    "whipped topping": 81,
    "whipping cream": 117,
    "whiskey": 69,
    "white balsamic vinegar": 87,
    "white beans": 186,
    "white bread": 200,
    "white bread flour": 297,
    "white button mushrooms": 209,
    "white cabbage": 198,
    "white cake mix": 70,
    "white cheddar cheese": 122,
    "white cheese": 173,
    "white chocolate": 239,
    "white chocolate chips": 212,
    "white corn": 185,
    "white corn syrup": 176,
    "white cornmeal": 194,
    "white distilled vinegar": 119,
    "white fish fillets": 266,
    "white flour": 297,
    "white grape juice": 312,
    "white hominy": 322,
    "white horseradish": 229,
    "white kidney beans": 186,
    "white miso": 114,
    "white mushroom": 209,
    "white mushrooms": 209,
    "white onion": 158,
    "white onions": 158,
    "white pearl onions": 331,
    "white pepper": 139,
    "white peppercorns": 219,
    "white potatoes": 58,
    "white rice": 195,
    "white rum": 329,
    "white sauce": 227,
    "white sesame seeds": 292,
    "white shoepeg corn": 246,
    "white sugar": 13,
    "white truffle oil": 352,
    "white vinegar": 119,
    "white wine": 162,
    "white wine vinegar": 87,
    "whole allspice": 351,
    "whole almond": 137,
    "whole almonds": 137,
    "whole bay leaf": 127,
    "whole black peppercorn": 219,
    "whole black peppercorns": 219,
    "whole canned tomatoes": 154,
    "whole chicken": 205,
    "whole chicken breast": 130,
    "whole chicken breasts": 130,
    "whole chickens": 205,
    "whole cloves": 46,
    "whole coriander seeds": 234,
    "whole corn": 185,
    "whole cumin seeds": 132,
    "whole grain bread": 174,
    "whole grain mustard": 49,
    "whole green chilies": 156,
    "whole green onions": 145,
    "whole kernel corn": 185,
    "whole milk": 131,
    "whole milk mozzarella": 181,
    "whole mushrooms": 191,
    "whole pecans": 211,
    "whole tomato": 5,
    "whole tomatoes": 154,
    "whole turkey": 205,
    "whole wheat bread": 174,
    "whole wheat couscous": 339,
    "whole wheat flour": 74,
    "whole wheat pasta": 149,
    "whole wheat penne": 149,
    "whole wheat spaghetti": 146,
    "whole wheat tortilla": 174,
    "whole wheat tortillas": 26,
    "wide egg noodles": 180,
    "wild mushrooms": 165,
    "wild rice": 171,
    "wine": 31,
    "wine vinegar": 87,
    "winter squash": 61,
    "wonton skins": 196,
    "wonton wrappers": 196,
    "wood chips": 261,
    "wooden skewers": 271,
    "worcestershire sauce": 229,
    "wrap": 242,
    "wraps": 258,
    "xanthan gum": 321,
    "yam": 150,
    "yams": 150,
    "yeast": 252,
    "yellow bell pepper": 282,
    "yellow bell peppers": 282,
    "yellow cake mix": 70,
    "yellow cornmeal": 194,
    "yellow food coloring": 141,
    "yellow mustard": 116,
    "yellow mustard seeds": 132,
    "yellow onion": 158,
    "yellow onions": 158,
    "yellow pepper": 218,
    "yellow peppers": 282,
    "yellow potatoes": 58,
    "yellow split peas": 28,
    "yellow squash": 204,
    "yellow tomatoes": 348,
    "yoghurt": 17,
    "yogurt": 17,
    "yukon gold potato": 58,
    "yukon gold potatoes": 58,
    "yuzu": 255,
    "zinfandel": 350,
    "ziti pasta": 217,
    "zucchini": 197
}