{
  "uas":0.0,
  "las":0.0,
  "las_per_type":{
    "":{
      "p":0.0,
      "r":0.0,
      "f":0.0
    }
  },
  "ents_p":99.6458833945,
  "ents_r":99.6197406144,
  "ents_f":99.6328102895,
  "ents_per_type":{
    "INGREDIENT":{
      "p":99.6458833945,
      "r":99.6197406144,
      "f":99.6328102895
    }
  },
  "tags_acc":99.9645511764,
  "token_acc":100.0,
  "textcat_score":0.0,
  "textcats_per_cat":{

  }
}