{
  "uas":0.0,
  "las":0.0,
  "las_per_type":{
    "":{
      "p":0.0,
      "r":0.0,
      "f":0.0
    }
  },
  "ents_p":97.646804369,
  "ents_r":97.36251887,
  "ents_f":97.5044544031,
  "ents_per_type":{
    "INGREDIENT":{
      "p":97.646804369,
      "r":97.36251887,
      "f":97.5044544031
    }
  },
  "tags_acc":99.9638774209,
  "token_acc":100.0,
  "textcat_score":0.0,
  "textcats_per_cat":{

  }
}