{
  "lang":"en",
  "pipeline":[
    "ner"
  ],
  "spacy_version":">=2.2.3",
  "speed":{
    "nwords":1235051,
    "cpu":15542.3445000181,
    "gpu":null
  },
  "accuracy":{
    "uas":0.0,
    "las":0.0,
    "las_per_type":{
      "":{
        "p":0.0,
        "r":0.0,
        "f":0.0
      }
    },
    "ents_p":99.5739571789,
    "ents_r":99.5331904406,
    "ents_f":99.5535696363,
    "ents_per_type":{
      "INGREDIENT":{
        "p":99.5739571789,
        "r":99.5331904406,
        "f":99.5535696363
      }
    },
    "tags_acc":99.9717008517,
    "token_acc":100.0,
    "textcat_score":0.0,
    "textcats_per_cat":{

    }
  },
  "vectors":{
    "width":0,
    "vectors":0,
    "keys":0,
    "name":"spacy_pretrained_vectors"
  },
  "name":"model0",
  "version":"0.0.0",
  "labels":{
    "ner":[
      "INGREDIENT"
    ]
  }
}