{
  "uas":0.0,
  "las":0.0,
  "las_per_type":{
    "":{
      "p":0.0,
      "r":0.0,
      "f":0.0
    }
  },
  "ents_p":98.9188602835,
  "ents_r":98.8259518821,
  "ents_f":98.8723842567,
  "ents_per_type":{
    "INGREDIENT":{
      "p":98.9188602835,
      "r":98.8259518821,
      "f":98.8723842567
    }
  },
  "tags_acc":99.9717008517,
  "token_acc":100.0,
  "textcat_score":0.0,
  "textcats_per_cat":{

  }
}