{
  "uas":0.0,
  "las":0.0,
  "las_per_type":{
    "":{
      "p":0.0,
      "r":0.0,
      "f":0.0
    }
  },
  "ents_p":99.6996623209,
  "ents_r":99.6656471514,
  "ents_f":99.6826518343,
  "ents_per_type":{
    "INGREDIENT":{
      "p":99.6996623209,
      "r":99.6656471514,
      "f":99.6826518343
    }
  },
  "tags_acc":99.9717008517,
  "token_acc":100.0,
  "textcat_score":0.0,
  "textcats_per_cat":{

  }
}