{
  "uas":0.0,
  "las":0.0,
  "las_per_type":{
    "":{
      "p":0.0,
      "r":0.0,
      "f":0.0
    }
  },
  "ents_p":99.6793888785,
  "ents_r":99.6504015956,
  "ents_f":99.6648931294,
  "ents_per_type":{
    "INGREDIENT":{
      "p":99.6793888785,
      "r":99.6504015956,
      "f":99.6648931294
    }
  },
  "tags_acc":99.9645511764,
  "token_acc":100.0,
  "textcat_score":0.0,
  "textcats_per_cat":{

  }
}