  __  __          _   _  _____ _____  _               _____ _   _ _____ _   _  _____      __  ___  __
 |  \/  |   /\   | \ | |/ ____|  __ \| |        /\   |_   _| \ | |_   _| \ | |/ ____|    /_ |/ _ \/_ |
 | \  / |  /  \  |  \| | (___ | |__) | |       /  \    | | |  \| | | | |  \| | |  __      | | | | || ()
 | |\/| | / /\ \ | . ` |\___ \|  ___/| |      / /\ \   | | | . ` | | | | . ` | | |_ |     | | | | || |
 | |  | |/ ____ \| |\  |____) | |    | |____ / ____ \ _| |_| |\  |_| |_| |\  | |__| |     | | |_| || |
 |_|  |_/_/    \_\_| \_|_____/|_|    |______/_/    \_\_____|_| \_|_____|_| \_|\_____|     |_|\___/ |_()


                            ___ ___ ___   _   ___  __  __ ___ _  _     ___ ___ ___ _____ ___ ___  _  _
                           / __|_ _/ __| / \ |   \|  \/  |_ _| \| |   | __|   \_ _|_   _|_ _/   \| \| |
                          | (__ | |\__ \/ _ \| |) | |\/| || || .` |   | _|| |) | |  | |  | | ()  | .` |
                           \___|___|___/_/ \_\___/|_|  |_|___|_|\_|   |___|___/___| |_| |___\___/|_|\_|



MANSPLAINING 101: CISADMIN EDITION
Walkthrough by Marni Cohen
marni@puppetlabs.com
