[gd_scene load_steps=5 format=2]

[ext_resource path="res://scripts/start.gd" type="Script" id=1]
[ext_resource path="res://prefabs/player.tscn" type="PackedScene" id=2]
[ext_resource path="res://prefabs/camera.tscn" type="PackedScene" id=3]
[ext_resource path="res://scenes/pause_menu.tscn" type="PackedScene" id=4]

[node name="Node" type="Node" index="0"]

script = ExtResource( 1 )

[node name="player" parent="." index="0" instance=ExtResource( 2 )]

position = Vector2( 125, 152 )

[node name="camera" parent="." index="1" instance=ExtResource( 3 )]

current = false
zoom = Vector2( 4, 4 )

[node name="CanvasModulate" type="CanvasModulate" parent="." index="2"]

color = Color( 0.27451, 0.270588, 0.32549, 1 )
_sections_unfolded = [ "Visibility", "Z Index" ]

[node name="pause_menu" parent="." index="3" instance=ExtResource( 4 )]


