{
	"nodes":[
	  { "id":0, "name":"NPWD2551", "group":"SUBSYS_A"},
	  { "id":1, "name":"NPWD2471", "group":"SUBSYS_A"},
	  { "id":2, "name":"NPWD2xxx", "group":"SUBSYS_B"},
	  { "id":3, "name":"NPWD23xx", "group":"SUBSYS_C"},
	  { "id":4, "name":"NPWD24xx", "group":"SUBSYS_A"},
	  { "id":5, "name":"NPWD26xx", "group":"SUBSYS_A"}
	],
	"links":[
	  { "source": 0, "target":1, "value": 0.8 },
	  { "source": 0, "target":2, "value": 0.3 },
	  { "source": 1, "target":2, "value": 0.1 },
	  { "source": 0, "target":4, "value": 0.4 },
	  { "source": 0, "target":5, "value": 0.7 }
	]
}
