<?xml version="1.0" encoding="UTF-8" standalone="no"?>
<!-- Created with Inkscape (http://www.inkscape.org/) -->

<svg
   xmlns:dc="http://purl.org/dc/elements/1.1/"
   xmlns:cc="http://creativecommons.org/ns#"
   xmlns:rdf="http://www.w3.org/1999/02/22-rdf-syntax-ns#"
   xmlns:svg="http://www.w3.org/2000/svg"
   xmlns="http://www.w3.org/2000/svg"
   xmlns:sodipodi="http://sodipodi.sourceforge.net/DTD/sodipodi-0.dtd"
   xmlns:inkscape="http://www.inkscape.org/namespaces/inkscape"
   id="svg3487"
   version="1.1"
   inkscape:version="0.91 r13725"
   width="186"
   height="124"
   viewBox="0 0 186 124"
   sodipodi:docname="arai-ma - அரை-மா.svg">
  <metadata
     id="metadata3493">
    <rdf:RDF>
      <cc:Work
         rdf:about="">
        <dc:format>image/svg+xml</dc:format>
        <dc:type
           rdf:resource="http://purl.org/dc/dcmitype/StillImage" />
        <dc:title></dc:title>
      </cc:Work>
    </rdf:RDF>
  </metadata>
  <defs
     id="defs3491" />
  <sodipodi:namedview
     pagecolor="#ffffff"
     bordercolor="#666666"
     borderopacity="1"
     objecttolerance="10"
     gridtolerance="10"
     guidetolerance="10"
     inkscape:pageopacity="0"
     inkscape:pageshadow="2"
     inkscape:window-width="1600"
     inkscape:window-height="837"
     id="namedview3489"
     showgrid="false"
     inkscape:zoom="2.5014853"
     inkscape:cx="42.180105"
     inkscape:cy="73.832455"
     inkscape:window-x="0"
     inkscape:window-y="30"
     inkscape:window-maximized="1"
     inkscape:current-layer="svg3487" />
  <path
     style="fill:#000000"
     d="m 57.090672,102.28291 c -11.72493,-3.997239 -20.23922,-14.489978 -20.28559,-24.999327 -0.032,-7.25874 7.66808,-15.254768 16.40925,-17.039864 l 3.07569,-0.628111 0.27418,-16.709941 0.27418,-16.709942 26.47582,0 26.475818,0 0,3.5 0,3.5 -7.39301,0 c -5.818968,0 -7.522238,0.336778 -7.999998,1.581787 -0.78963,2.05775 -0.78963,21.778676 0,23.836426 0.50623,1.319203 2.57348,1.581787 12.452948,1.581787 6.79331,0 12.92184,-0.490206 14.36837,-1.149291 2.52117,-1.148719 2.52256,-1.157047 2.79706,-16.75 l 0.27463,-15.600709 4.75,-0.304791 4.75,-0.304791 0.0153,14.804791 c 0.008,8.142635 0.34592,15.293164 0.75,15.890065 1.43357,2.117652 9.35699,3.367385 14.43921,2.277444 l 4.79549,-1.028446 0,-15.971927 0,-15.971927 4.75,0.304791 4.75,0.304791 0,37.5 0,37.499995 -4.5,0 -4.5,0 -0.5,-17.401911 -0.5,-17.401916 c -14.87713,-0.02517 -31.99641,0.27598 -45.04903,0.674361 l -13.950968,0.294378 -0.53998,9.917546 c -0.61442,11.284809 -1.42287,13.66899 -6.11313,18.028176 -8.6049,7.997486 -19.38229,10.282556 -30.54624,6.476556 z m 20.3158,-8.755438 c 1.42362,-0.932793 3.68519,-3.433423 5.02572,-5.556957 2.15617,-3.415595 2.4039,-4.807662 2.14758,-12.06788 l -0.28975,-8.20691 -14.5,-0.262462 c -12.23077,-0.221387 -15.03842,0.01336 -17.94045,1.5 -9.29832,4.763313 -4.48673,21.468878 7.44045,25.832828 4.94416,1.808981 14.45794,1.158525 18.11645,-1.238619 z m 6.88355,-46.831747 0,-13 -8.41434,-0.293098 c -6.05664,-0.210971 -8.64421,0.06923 -9.23469,1 -0.95498,1.505321 -1.14777,21.856076 -0.22972,24.248475 0.51857,1.351351 2.04752,1.571486 9.25,1.331787 l 8.62875,-0.287164 z"
     id="path3497"
     inkscape:connector-curvature="0"
     sodipodi:nodetypes="ssscccccccssssssccccsscccccccccccccsssssscssssccsssscc" />
</svg>
