<svg width="173" height="120" viewBox="0 0 173 120" fill="none" xmlns="http://www.w3.org/2000/svg">
<path d="M159.366 120H13.7002C6.68858 120 0.974121 114.317 0.974121 107.267V12.7331C0.974121 5.71763 6.65352 0 13.7002 0H159.366C166.378 0 172.092 5.68255 172.092 12.7331V107.302C172.057 114.317 166.378 120 159.366 120Z" fill="#0B477F"/>
<path d="M42.9228 40.2637C45.4205 40.2637 47.4453 38.2377 47.4453 35.7387C47.4453 33.2396 45.4205 31.2137 42.9228 31.2137C40.4251 31.2137 38.4004 33.2396 38.4004 35.7387C38.4004 38.2377 40.4251 40.2637 42.9228 40.2637Z" fill="white"/>
<path d="M51.0563 48.0862C51.0563 48.0862 49.8643 50.9976 42.8527 50.9976C35.8411 50.9976 34.6491 48.0862 34.6491 48.0862C34.6491 45.0345 36.3319 42.3686 38.821 40.9304C39.9429 41.8073 41.3802 42.3686 42.9228 42.3686C44.4654 42.3686 45.8677 41.8424 46.9895 40.9655C49.4085 42.4037 51.0563 45.0695 51.0563 48.0862Z" fill="white"/>
<path fill-rule="evenodd" clip-rule="evenodd" d="M30.512 25.2142C29.9107 25.2142 29.4249 25.6987 29.4249 26.303V55.9434C29.4249 56.5477 29.9107 57.0322 30.512 57.0322H56.2446C56.8315 57.0322 57.3317 56.5271 57.3317 55.9434V26.303C57.3317 25.6987 56.8459 25.2142 56.2446 25.2142H30.512ZM25.6393 26.303C25.6393 23.61 27.8179 21.4286 30.512 21.4286H56.2446C58.9387 21.4286 61.1174 23.61 61.1174 26.303V55.9434C61.1174 58.5869 58.9531 60.8179 56.2446 60.8179H30.512C27.8179 60.8179 25.6393 58.6365 25.6393 55.9434V26.303Z" fill="white"/>
<path fill-rule="evenodd" clip-rule="evenodd" d="M30.512 78.5887C29.9107 78.5887 29.4249 79.0732 29.4249 79.6774V94.7143C29.4249 95.3185 29.9107 95.803 30.512 95.803L143.03 95.803C143.617 95.803 144.117 95.2979 144.117 94.7143V79.6774C144.117 79.0731 143.631 78.5886 143.03 78.5886L30.512 78.5887ZM25.6393 79.6774C25.6393 76.9844 27.8179 74.803 30.512 74.803L143.03 74.803C145.724 74.803 147.903 76.9844 147.903 79.6774V94.7143C147.903 97.3577 145.738 99.5887 143.03 99.5887L30.512 99.5887C27.8179 99.5887 25.6393 97.4073 25.6393 94.7143V79.6774Z" fill="white"/>
<path d="M147.816 24.7242H74.7205V27.4251H147.816V24.7242Z" fill="white"/>
<path d="M89.2345 34.2303H74.7205V36.9313H89.2345V34.2303Z" fill="white"/>
<path d="M147.816 34.2303H94.4579V36.9313H147.816V34.2303Z" fill="white"/>
<path d="M83.9758 43.7364H74.7205V46.4373H83.9758V43.7364Z" fill="white"/>
<path d="M119.805 43.7364H87.4816V46.4373H119.805V43.7364Z" fill="white"/>
<path d="M157.816 43.7363H134.398V46.4373H157.816V43.7363Z" fill="white"/>
<path d="M97.0875 54.0141H74.7205V58.8197H97.0875V54.0141Z" fill="#E91D4E"/>
</svg>
