<svg width="15" height="15" viewBox="0 0 15 15" fill="none" xmlns="http://www.w3.org/2000/svg">
<path d="M5.26324 7.77551V3.39275C5.26324 2.59165 6.15816 2.11576 6.82235 2.56366L13.3215 6.94641C13.9094 7.34284 13.9094 8.20818 13.3215 8.60461L6.82235 12.9874C6.15816 13.4353 5.26324 12.9594 5.26324 12.1583L5.26324 7.77551Z" fill="#0B477F"/>
</svg>
