{
  "document_type": "invoice",
  "ref": "F-2023-4",
  "document_date": "2023-01-10T11:54:18.470Z",
  "currency": "EUR",
  "subtotal_ht": 43.04,
  "subtotal_ttc": 46.64,
  "discount_ht": -4.3,
  "shipping_ht": 12,
  "total_ht": 50.74,
  "total_ttc": 65.74,
  "trade_party_name": "The company",
  "trade_party_registration_number": "11234432425334",
  "trade_party_vat_number": "EU7364533533737",
  "trade_party_primary_contact_name": "John Doe",
  "trade_party_primary_contact_phone": "+33123456789",
  "trade_party_primary_contact_email": "toto@tutu.com",
  "trade_party_address": {
    "contact_first_name": "John",
    "contact_last_name": "Doe",
    "line_1": "32 rue inconnue",
    "line_2": "digicode 1234 1er étage à gauche",
    "city": "Paris",
    "postal_code": "75018",
    "country": "FR",
    "contact_phone": "+33123456789"
  },
  "items": [
    {
      "name": "prestation 1",
      "description": "standard",
      "quantity": 11,
      "unit_price_ht": 0.34,
      "vat": 20
    },
    {
      "name": "prestation 2",
      "description": "another description",
      "quantity": 14,
      "unit_price_ht": 0.34,
      "vat": 20
    },
    {
      "name": "prestation 3",
      "description": "another description",
      "quantity": 1,
      "unit_price_ht": 34.54,
      "vat": 5.5
    }
  ]
}
