{
  "scripts": {
    "android": "react-native run-android",
    "ios": "react-native run-ios",
    "web": "expo start --web",
    "start": "react-native start",
    "test": "jest"
  },
  "dependencies": {
    "@react-native-community/async-storage": "^1.7.1",
    "@react-native-community/masked-view": "^0.1.6",
    "axios": "^0.19.1",
    "expo": "~36.0.0",
    "expo-av": "^8.0.0",
    "expo-image-picker": "^8.0.2",
    "lodash": "^4.17.15",
    "moment": "^2.24.0",
    "react": "~16.9.0",
    "react-dom": "~16.9.0",
    "react-native": "~0.61.4",
    "react-native-easy-toast": "^1.2.0",
    "react-native-fs": "^2.16.2",
    "react-native-gesture-handler": "~1.5.0",
    "react-native-picker-select": "^6.3.3",
    "react-native-reanimated": "~1.4.0",
    "react-native-safe-area-context": "^0.6.2",
    "react-native-screens": "2.0.0-alpha.12",
    "react-native-share": "^3.0.0",
    "react-native-snap-carousel": "^3.8.4",
    "react-native-switch": "^1.5.0",
    "react-native-unimodules": "~0.7.0",
    "react-native-web": "~0.11.7",
    "react-navigation": "^4.0.10",
    "react-navigation-stack": "^2.0.15",
    "react-navigation-tabs": "^2.7.0",
    "react-redux": "^7.1.3",
    "reactotron-react-native": "^4.0.3",
    "redux": "^4.0.5",
    "redux-persist": "^6.0.0",
    "redux-persist-transform-filter": "^0.0.20",
    "redux-thunk": "^2.3.0",
    "rn-fetch-blob": "^0.12.0",
    "rn-round-checkbox": "^0.3.4",
    "uuid-js": "^0.7.5"
  },
  "devDependencies": {
    "@babel/core": "~7.6.0",
    "babel-jest": "~24.9.0",
    "jest": "~24.9.0",
    "metro-react-native-babel-preset": "~0.56.0",
    "react-test-renderer": "~16.9.0"
  },
  "jest": {
    "preset": "react-native"
  },
  "private": true
}
