Request to http://localhost:5000/api/movies at 2020-10-16T13:37:37+03:00
Request to http://localhost:5000/api/movies/351f6e54-b207-4a18-89fa-6d7fd406c324 at 2020-10-16T13:37:57+03:00
Request to http://localhost:5000/api/movies at 2020-10-16T13:37:57+03:00
Request to http://localhost:5000/api/movies/add at 2020-10-16T13:38:04+03:00
Request to http://localhost:5000/api/movies at 2020-10-16T13:38:04+03:00
Request to http://localhost:5000/api/movies/add at 2020-10-16T13:38:15+03:00
Request to http://localhost:5000/api/movies at 2020-10-16T13:38:15+03:00
Request to http://localhost:5000/api/movies/add at 2020-10-16T13:38:23+03:00
Request to http://localhost:5000/api/movies at 2020-10-16T13:38:23+03:00
Request to http://localhost:5000/api/movies/sorted at 2020-10-16T13:38:24+03:00
Request to http://localhost:5000/api/movies/sorted at 2020-10-16T13:38:27+03:00
Request to http://localhost:5000/api/movies at 2020-10-16T13:38:33+03:00
Request to http://localhost:5000/api/movies/add at 2020-10-16T13:38:46+03:00
Request to http://localhost:5000/api/movies at 2020-10-16T13:38:46+03:00
Request to http://localhost:5000/api/movies/sorted at 2020-10-16T13:38:48+03:00
Request to http://localhost:5000/api/movies/sorted at 2020-10-16T13:38:50+03:00
Request to http://localhost:5000/api/movies/sorted at 2020-10-16T13:38:51+03:00
Request to http://localhost:5000/api/movies/sorted at 2020-10-16T13:38:52+03:00
Request to http://localhost:5000/api/movies/title at 2020-10-16T13:39:00+03:00
Request to http://localhost:5000/api/movies/title at 2020-10-16T13:39:04+03:00
Request to http://localhost:5000/api/movies/star at 2020-10-16T13:39:07+03:00
Request to http://localhost:5000/api/movies/star at 2020-10-16T13:39:11+03:00
Request to http://localhost:5000/api/movies/6fdb84ad-7ebe-412f-94f5-f3cdebe5eb68 at 2020-10-16T13:39:17+03:00
Request to http://localhost:5000/api/movies at 2020-10-16T13:39:17+03:00
Request to http://localhost:5000/api/movies/6fdb84ad-7ebe-412f-94f5-f3cdebe5eb68 at 2020-10-16T13:39:18+03:00
Request to http://localhost:5000/api/movies at 2020-10-16T13:39:18+03:00
Request to http://localhost:5000/api/movies/6fdb84ad-7ebe-412f-94f5-f3cdebe5eb68 at 2020-10-16T13:39:19+03:00
Request to http://localhost:5000/api/movies at 2020-10-16T13:39:19+03:00
Request to http://localhost:5000/api/movies/83b6f7ae-b42c-40a8-a26a-79905bb0fc42 at 2020-10-16T13:39:20+03:00
Request to http://localhost:5000/api/movies at 2020-10-16T13:39:21+03:00
Request to http://localhost:5000/api/movies at 2020-10-16T13:39:23+03:00
Request to http://localhost:5000/api/movies/title at 2020-10-16T13:39:29+03:00
Request to http://localhost:5000/api/movies at 2020-10-16T13:39:31+03:00
Request to http://localhost:5000/api/movies/2351dcf3-33d8-478c-a4f9-0ae7fee4ff67 at 2020-10-16T13:39:32+03:00
Request to http://localhost:5000/api/movies at 2020-10-16T13:39:32+03:00
Request to http://localhost:5000/api/movies/904ae7f4-adc0-4fb7-b52c-a7f11620e4da at 2020-10-16T13:39:33+03:00
Request to http://localhost:5000/api/movies at 2020-10-16T13:39:33+03:00
Request to http://localhost:5000/api/movies at 2020-10-16T13:39:34+03:00
Request to http://localhost:5000/api/movies at 2020-10-16T13:39:39+03:00
Request to http://localhost:5000/api/movies/add at 2020-10-16T13:39:51+03:00
Request to http://localhost:5000/api/movies at 2020-10-16T13:39:51+03:00
Request to http://localhost:5000/api/movies/add at 2020-10-16T13:39:59+03:00
Request to http://localhost:5000/api/movies at 2020-10-16T13:39:59+03:00
Request to http://localhost:5000/api/movies/sorted at 2020-10-16T13:40:00+03:00
Request to http://localhost:5000/api/movies/sorted at 2020-10-16T13:40:02+03:00
Request to http://localhost:5000/api/movies/title at 2020-10-16T13:40:23+03:00
Request to http://localhost:5000/api/movies at 2020-10-16T13:41:21+03:00
Request to http://localhost:5000/api/movies at 2020-10-16T13:41:56+03:00
Request to http://localhost:5000/api/movies/title at 2020-10-16T13:42:00+03:00
Request to http://localhost:5000/api/movies/67dd4ca7-7152-4af5-9615-b31f73c76572 at 2020-10-16T13:42:11+03:00
Request to http://localhost:5000/api/movies at 2020-10-16T13:42:11+03:00
Request to http://localhost:5000/api/movies at 2020-10-16T13:42:13+03:00
Request to http://localhost:5000/api/movies/star at 2020-10-16T13:42:33+03:00
Request to http://localhost:5000/api/movies/star at 2020-10-16T13:42:36+03:00
Request to http://localhost:5000/api/movies/star at 2020-10-16T13:42:38+03:00
Request to http://localhost:5000/api/movies at 2020-10-16T13:42:53+03:00
Request to http://localhost:5000/api/movies/title at 2020-10-16T13:42:58+03:00
Request to http://localhost:5000/api/movies/undefined at 2020-10-16T13:42:59+03:00
Request to http://localhost:5000/api/movies at 2020-10-16T13:42:59+03:00
Request to http://localhost:5000/api/movies at 2020-10-16T13:43:01+03:00
Request to http://localhost:5000/api/movies at 2020-10-16T13:43:07+03:00
Request to http://localhost:5000/api/movies at 2020-10-16T13:43:10+03:00
Request to http://localhost:5000/api/movies/star at 2020-10-16T13:43:14+03:00
Request to http://localhost:5000/api/movies/title at 2020-10-16T13:43:21+03:00
Request to http://localhost:5000/api/movies/title at 2020-10-16T13:43:23+03:00
Request to http://localhost:5000/api/movies/star at 2020-10-16T13:43:27+03:00
Request to http://localhost:5000/api/movies/title at 2020-10-16T13:43:32+03:00
Request to http://localhost:5000/api/movies at 2020-10-16T13:43:37+03:00
Request to http://localhost:5000/api/movies/d690dcfe-fc98-42d3-93b9-914437473539 at 2020-10-16T13:43:38+03:00
Request to http://localhost:5000/api/movies at 2020-10-16T13:43:38+03:00
Request to http://localhost:5000/api/movies at 2020-10-16T13:43:39+03:00
