D:\Proyectos\Servicios_Web\Repositorio\render-rest-saludo-J19-main\src\main\java\com\example\restservice\Greeting.java
D:\Proyectos\Servicios_Web\Repositorio\render-rest-saludo-J19-main\src\main\java\com\example\restservice\User.java
D:\Proyectos\Servicios_Web\Repositorio\render-rest-saludo-J19-main\src\main\java\com\example\restservice\RestserviceApplication.java
D:\Proyectos\Servicios_Web\Repositorio\render-rest-saludo-J19-main\src\main\java\com\example\restservice\UserRepository.java
D:\Proyectos\Servicios_Web\Repositorio\render-rest-saludo-J19-main\src\main\java\com\example\restservice\GreetingController.java
D:\Proyectos\Servicios_Web\Repositorio\render-rest-saludo-J19-main\src\main\java\com\example\restservice\MainController.java
