[
    {
      "id": 12,
      "nombre": "CASACA VARILITE",
      "descripcion": "Cuando cae la temperatura, está casaca ofrece abrigo ligero y plegable contra el frio. Incorpora cámaras tejidas con aislamiento...",
      "precio": 379.00,
      "url": "producto1.png",
      "desctacado": true,
      "activo": true
    },
    {
      "id": 5,
      "nombre": "POLO DOODLE BADGE",
      "descripcion": "Con este polo adidas, recordarás los días en que cubrías tus cuadernos con dibujos....",
      "precio": 89.00,
      "url": "producto2.png",
      "desctacado": true,
      "activo": true
    },
    {
      "id": 31,
      "nombre": "POLERA BELLISTA",
      "descripcion": "Deja que tu ropa hable por ti. Esta polera actualiza el legado deportivo de adidas...",
      "precio": 249.00,
      "url": "producto3.png",
      "desctacado": true,
      "activo": true
    },
    {
      "id": 13,
      "nombre": "POLO NIÑA ORIGINALS",
      "descripcion": "Prepárate para el verano. Este polo luce un gran logo del Trifolio que resalta sobre detalles florales coloridos...",
      "precio": 79.00,
      "url": "producto4.png",
      "desctacado": true,
      "activo": true
    },
    {
      "id": 25,
      "nombre": "GORRA ADIDAS",
      "descripcion": "Una gorra de diseño minimalista que lleva el Trifolio en el frente. Esta gorra adidas es perfecta para los días soleados...",
      "precio": 49.00,
      "url": "producto5.png",
      "desctacado": false,
      "activo": false
    },
    {
      "id": 37,
      "nombre": "MOCHILA ADIDAS",
      "descripcion": "Con esta mochila adidas de tamaño mediano, podrás llevar contigo todo lo esencial...",
      "precio": 189.00,
      "url": "producto6.png",
      "desctacado": false,
      "activo": false
    },
    {
      "id": 48,
      "nombre": "TENIS ADIZERO",
      "descripcion": "Estos tenis ultraligeros te darán velocidad y estilo. Son perfectos para entrenamientos intensos y carreras...",
      "precio": 259.00,
      "url": "producto7.png",
      "desctacado": false,
      "activo": false
    },
    {
      "id": 52,
      "nombre": "CHAQUETA ADIDAS",
      "descripcion": "Con esta chaqueta de adidas, estarás listo para cualquier clima. Te mantendrá caliente y seco en todo momento...",
      "precio": 429.00,
      "url": "producto8.png",
      "desctacado": false,
      "activo": false
    }
  ]
  