<svg width="159" height="40" viewBox="0 0 159 40" fill="none" xmlns="http://www.w3.org/2000/svg">
<rect width="159" height="39.3641" rx="19.682" fill="#A6F6F1"/>
<path d="M59.3063 24.7177C57.953 24.7177 56.8983 24.3397 56.1423 23.5837C55.3863 22.8183 55.0083 21.7263 55.0083 20.3077V14.7777H56.8283V20.2377C56.8283 22.1603 57.659 23.1217 59.3203 23.1217C60.9723 23.1217 61.7983 22.1603 61.7983 20.2377V14.7777H63.5903V20.3077C63.5903 21.7263 63.2123 22.8183 62.4563 23.5837C61.7097 24.3397 60.6597 24.7177 59.3063 24.7177ZM70.1152 17.0177C70.8432 17.0177 71.4919 17.1763 72.0612 17.4937C72.6399 17.811 73.0925 18.259 73.4192 18.8377C73.7459 19.4163 73.9092 20.0837 73.9092 20.8397C73.9092 21.5957 73.7459 22.2677 73.4192 22.8557C73.0925 23.4343 72.6399 23.8823 72.0612 24.1997C71.4919 24.517 70.8432 24.6757 70.1152 24.6757C69.1072 24.6757 68.3092 24.3397 67.7212 23.6677V27.2937H65.9712V17.1017H67.6372V18.0817C67.9265 17.727 68.2812 17.461 68.7012 17.2837C69.1305 17.1063 69.6019 17.0177 70.1152 17.0177ZM69.9192 23.1777C70.5632 23.1777 71.0905 22.963 71.5012 22.5337C71.9212 22.1043 72.1312 21.5397 72.1312 20.8397C72.1312 20.1397 71.9212 19.575 71.5012 19.1457C71.0905 18.7163 70.5632 18.5017 69.9192 18.5017C69.4992 18.5017 69.1212 18.5997 68.7852 18.7957C68.4492 18.9823 68.1832 19.253 67.9872 19.6077C67.7912 19.9623 67.6932 20.373 67.6932 20.8397C67.6932 21.3063 67.7912 21.717 67.9872 22.0717C68.1832 22.4263 68.4492 22.7017 68.7852 22.8977C69.1212 23.0843 69.4992 23.1777 69.9192 23.1777ZM75.5688 14.1897H77.3188V24.5777H75.5688V14.1897ZM82.9757 24.6757C82.2197 24.6757 81.5384 24.5123 80.9317 24.1857C80.3251 23.859 79.8491 23.4063 79.5037 22.8277C79.1677 22.2397 78.9997 21.577 78.9997 20.8397C78.9997 20.1023 79.1677 19.4443 79.5037 18.8657C79.8491 18.287 80.3251 17.8343 80.9317 17.5077C81.5384 17.181 82.2197 17.0177 82.9757 17.0177C83.7411 17.0177 84.4271 17.181 85.0337 17.5077C85.6404 17.8343 86.1117 18.287 86.4477 18.8657C86.7931 19.4443 86.9657 20.1023 86.9657 20.8397C86.9657 21.577 86.7931 22.2397 86.4477 22.8277C86.1117 23.4063 85.6404 23.859 85.0337 24.1857C84.4271 24.5123 83.7411 24.6757 82.9757 24.6757ZM82.9757 23.1777C83.6197 23.1777 84.1517 22.963 84.5717 22.5337C84.9917 22.1043 85.2017 21.5397 85.2017 20.8397C85.2017 20.1397 84.9917 19.575 84.5717 19.1457C84.1517 18.7163 83.6197 18.5017 82.9757 18.5017C82.3317 18.5017 81.7997 18.7163 81.3797 19.1457C80.9691 19.575 80.7637 20.1397 80.7637 20.8397C80.7637 21.5397 80.9691 22.1043 81.3797 22.5337C81.7997 22.963 82.3317 23.1777 82.9757 23.1777ZM91.3995 17.0177C92.5008 17.0177 93.3408 17.2837 93.9195 17.8157C94.5075 18.3383 94.8015 19.1317 94.8015 20.1957V24.5777H93.1495V23.6677C92.9348 23.9943 92.6268 24.2463 92.2255 24.4237C91.8335 24.5917 91.3575 24.6757 90.7975 24.6757C90.2375 24.6757 89.7475 24.5823 89.3275 24.3957C88.9075 24.1997 88.5808 23.9337 88.3475 23.5977C88.1235 23.2523 88.0115 22.865 88.0115 22.4357C88.0115 21.7637 88.2588 21.227 88.7535 20.8257C89.2575 20.415 90.0461 20.2097 91.1195 20.2097H93.0515V20.0977C93.0515 19.575 92.8928 19.1737 92.5755 18.8937C92.2675 18.6137 91.8055 18.4737 91.1895 18.4737C90.7695 18.4737 90.3541 18.539 89.9435 18.6697C89.5421 18.8003 89.2015 18.9823 88.9215 19.2157L88.2355 17.9417C88.6275 17.643 89.0988 17.4143 89.6495 17.2557C90.2001 17.097 90.7835 17.0177 91.3995 17.0177ZM91.1615 23.4017C91.6001 23.4017 91.9875 23.3037 92.3235 23.1077C92.6688 22.9023 92.9115 22.613 93.0515 22.2397V21.3717H91.2455C90.2375 21.3717 89.7335 21.703 89.7335 22.3657C89.7335 22.683 89.8595 22.935 90.1115 23.1217C90.3635 23.3083 90.7135 23.4017 91.1615 23.4017ZM104.438 14.1897V24.5777H102.758V23.6117C102.468 23.9663 102.109 24.2323 101.68 24.4097C101.26 24.587 100.793 24.6757 100.28 24.6757C99.5611 24.6757 98.9124 24.517 98.3337 24.1997C97.7644 23.8823 97.3164 23.4343 96.9897 22.8557C96.6631 22.2677 96.4997 21.5957 96.4997 20.8397C96.4997 20.0837 96.6631 19.4163 96.9897 18.8377C97.3164 18.259 97.7644 17.811 98.3337 17.4937C98.9124 17.1763 99.5611 17.0177 100.28 17.0177C100.774 17.0177 101.227 17.1017 101.638 17.2697C102.048 17.4377 102.398 17.6897 102.688 18.0257V14.1897H104.438ZM100.49 23.1777C100.91 23.1777 101.288 23.0843 101.624 22.8977C101.96 22.7017 102.226 22.4263 102.422 22.0717C102.618 21.717 102.716 21.3063 102.716 20.8397C102.716 20.373 102.618 19.9623 102.422 19.6077C102.226 19.253 101.96 18.9823 101.624 18.7957C101.288 18.5997 100.91 18.5017 100.49 18.5017C100.07 18.5017 99.6917 18.5997 99.3557 18.7957C99.0197 18.9823 98.7537 19.253 98.5577 19.6077C98.3617 19.9623 98.2637 20.373 98.2637 20.8397C98.2637 21.3063 98.3617 21.717 98.5577 22.0717C98.7537 22.4263 99.0197 22.7017 99.3557 22.8977C99.6917 23.0843 100.07 23.1777 100.49 23.1777Z" fill="black"/>
</svg>
