<svg width="414" height="432" viewBox="0 0 414 432" fill="none" xmlns="http://www.w3.org/2000/svg">
<path d="M500 432C428.369 174.809 82.1538 36.8372 -82 0V432H500Z" fill="url(#paint0_linear)"/>
<path d="M136.695 432C264.468 113.248 432.137 37.3686 500 0V432H136.695Z" fill="url(#paint1_linear)"/>
<defs>
<linearGradient id="paint0_linear" x1="209" y1="0" x2="209" y2="432" gradientUnits="userSpaceOnUse">
<stop stop-color="#A6F6F1"/>
<stop offset="1" stop-color="#4EB7B2"/>
</linearGradient>
<linearGradient id="paint1_linear" x1="173.398" y1="64.2645" x2="620.698" y2="167.301" gradientUnits="userSpaceOnUse">
<stop stop-color="#41AEA9"/>
<stop offset="1" stop-color="#A6F6F1"/>
</linearGradient>
</defs>
</svg>
