<svg width="1440" height="922" viewBox="0 0 1440 922" fill="none" xmlns="http://www.w3.org/2000/svg">
<path d="M413.633 928.624C363.133 745.624 154.133 835.624 115.633 729.124C77.1326 622.624 36.2324 598.757 -18.3674 598.124C-147.427 596.629 -18.3674 928.624 -18.3674 928.624C-18.3674 928.624 464.133 1111.62 413.633 928.624Z" fill="#FFA372"/>
<circle cx="1128.5" cy="358.5" r="358.5" fill="#FFA372"/>
</svg>
