{
  "itemsCards": [
    {
      "color": "#5398BE",
      "id": 1,
      "name": "Nuttela Cookies",
      "price": "$13",
      "itemCode": "63352",
      "url": "images/cookie1.jpg",
      "starColor": false,
      "favColor": "#ffffff"
    },
    {
      "color": "#F2CD5D",
      "id": 2,
      "name": "Chocolate Cookies",
      "price": "$10",
      "itemCode": "83247",
      "url": "images/cookie2.jpg",
      "starColor": false,
      "favColor": "#ffffff"
    },
    {
      "color": "#A7BED3",
      "id": 3,
      "name": "Not Oreo Cookies",
      "price": "$20",
      "itemCode": "62087 ",
      "url": "images/cookie3.jpg",
      "starColor": false,
      "favColor": "#ffffff"
    },
    {
      "color": "#FFCAAF",
      "id": 4,
      "name": "Dark Side Cookies",
      "price": "$30",
      "itemCode": "49680 ",
      "url": "images/cookie4.jpg",
      "starColor": false
    },
    {
      "id": 5,
      "name": "Diet Cookies",
      "price": "$45",
      "color": "#472836",
      "itemCode": "38955 ",
      "url": "images/cookie5.jpg",
      "starColor": false
    },
    {
      "id": 6,
      "name": "Macaron  Cookies",
      "price": "$15",
      "color": "#D35269",
      "itemCode": "40718 ",
      "url": "images/cookie6.jpg",
      "starColor": false
    },
    {
      "color": "#BCD8C1",
      "id": 7,
      "name": "Cristmas Cookies",
      "price": "$15",
      "itemCode": "80937 ",
      "url": "images/cookie7.jpg",
      "starColor": false
    },
    {
      "color": "#422040",
      "id": 8,
      "name": "Brownie Cookies",
      "price": "$25",
      "itemCode": "14158",
      "url": "images/cookie8.jpg",
      "starColor": false,
      "favColor": "#ffffff"
    },
    {
      "id": 9,
      "name": "New-Year Cookies",
      "price": "$35",
      "color": "#D8A7CA",
      "itemCode": "43995 ",
      "url": "images/cookie9.jpg",
      "starColor": false
    },
    {
      "id": 10,
      "name": "Oat Cookies",
      "price": "$9",
      "color": "#A2C7E5",
      "itemCode": "95253 ",
      "url": "images/cookie10.jpg",
      "starColor": false
    }
  ]
}
