{
  "intents": [
    {
      "intent": "GetDefinition",
      "slots": [
        {
          "name": "Term",
          "type": "LIST_OF_TERMS"
        }
      ]
    },
    {
      "intent": "AMAZON.HelpIntent"
    },
    {
      "intent": "AMAZON.StopIntent"
    },
    {
      "intent": "AMAZON.CancelIntent"
    }
  ]
}