{
	"info": {
		"_postman_id": "776b0bf1-7528-4cd6-a93d-306e5203a7a7",
		"name": "SpringBoot",
		"schema": "https://schema.getpostman.com/json/collection/v2.1.0/collection.json"
	},
	"item": [
		{
			"name": "getRequests",
			"item": [
				{
					"name": "GetAll",
					"request": {
						"method": "GET",
						"header": [
							{
								"key": "Content-Type",
								"name": "Content-Type",
								"value": "application/json",
								"type": "text"
							}
						],
						"url": {
							"raw": "localhost:1111/shop/orders/list/",
							"host": [
								"localhost"
							],
							"port": "1111",
							"path": [
								"shop",
								"orders",
								"list",
								""
							]
						}
					},
					"response": []
				},
				{
					"name": "GetById1",
					"request": {
						"method": "GET",
						"header": [],
						"url": {
							"raw": "localhost:1111/shop/orders/1/",
							"host": [
								"localhost"
							],
							"port": "1111",
							"path": [
								"shop",
								"orders",
								"1",
								""
							]
						}
					},
					"response": []
				},
				{
					"name": "GetById2",
					"request": {
						"method": "GET",
						"header": [],
						"url": {
							"raw": "localhost:1111/shop/orders/2/",
							"host": [
								"localhost"
							],
							"port": "1111",
							"path": [
								"shop",
								"orders",
								"2",
								""
							]
						}
					},
					"response": []
				},
				{
					"name": "GetById3",
					"request": {
						"method": "GET",
						"header": [],
						"url": {
							"raw": "localhost:1111/shop/orders/3/",
							"host": [
								"localhost"
							],
							"port": "1111",
							"path": [
								"shop",
								"orders",
								"3",
								""
							]
						}
					},
					"response": []
				},
				{
					"name": "GetOrderByCustomerLastName",
					"request": {
						"method": "GET",
						"header": [
							{
								"key": "Content-Type",
								"name": "Content-Type",
								"value": "application/json",
								"type": "text"
							}
						],
						"url": {
							"raw": "localhost:1111/shop/orders/customer?lastname=White",
							"host": [
								"localhost"
							],
							"port": "1111",
							"path": [
								"shop",
								"orders",
								"customer"
							],
							"query": [
								{
									"key": "lastname",
									"value": "White"
								}
							]
						}
					},
					"response": []
				},
				{
					"name": "GetOrderWithDateAfter",
					"request": {
						"method": "GET",
						"header": [
							{
								"key": "Content-Type",
								"name": "Content-Type",
								"value": "application/json",
								"type": "text"
							}
						],
						"url": {
							"raw": "localhost:1111/shop/orders/after?date=2019-03-25",
							"host": [
								"localhost"
							],
							"port": "1111",
							"path": [
								"shop",
								"orders",
								"after"
							],
							"query": [
								{
									"key": "date",
									"value": "2019-03-25"
								}
							]
						}
					},
					"response": []
				},
				{
					"name": "GetNotFoundId",
					"request": {
						"method": "GET",
						"header": [],
						"url": {
							"raw": "localhost:1111/shop/orders/9/",
							"host": [
								"localhost"
							],
							"port": "1111",
							"path": [
								"shop",
								"orders",
								"9",
								""
							]
						}
					},
					"response": []
				},
				{
					"name": "GetNotFoundCustLastname",
					"protocolProfileBehavior": {
						"disableBodyPruning": true
					},
					"request": {
						"method": "GET",
						"header": [
							{
								"key": "Content-Type",
								"name": "Content-Type",
								"type": "text",
								"value": "application/json"
							}
						],
						"body": {
							"mode": "raw",
							"raw": "{\r\n\t\"lastName\": \"Ehrmantraut\"\r\n}",
							"options": {
								"raw": {
									"language": "json"
								}
							}
						},
						"url": {
							"raw": "localhost:1111/shop/orders/customer?lastname=Salamanca",
							"host": [
								"localhost"
							],
							"port": "1111",
							"path": [
								"shop",
								"orders",
								"customer"
							],
							"query": [
								{
									"key": "lastname",
									"value": "Salamanca"
								}
							]
						}
					},
					"response": []
				},
				{
					"name": "GetNotFoundAfterDate",
					"request": {
						"method": "GET",
						"header": [
							{
								"key": "Content-Type",
								"name": "Content-Type",
								"type": "text",
								"value": "application/json"
							}
						],
						"url": {
							"raw": "localhost:1111/shop/orders/after?date=2022-03-25",
							"host": [
								"localhost"
							],
							"port": "1111",
							"path": [
								"shop",
								"orders",
								"after"
							],
							"query": [
								{
									"key": "date",
									"value": "2022-03-25"
								}
							]
						}
					},
					"response": []
				},
				{
					"name": "ActuatorHealth",
					"request": {
						"method": "GET",
						"header": [],
						"url": {
							"raw": "localhost:1111/shop/actuator/health",
							"host": [
								"localhost"
							],
							"port": "1111",
							"path": [
								"shop",
								"actuator",
								"health"
							]
						}
					},
					"response": []
				}
			],
			"protocolProfileBehavior": {}
		},
		{
			"name": "putRequests",
			"item": [
				{
					"name": "PutById1",
					"request": {
						"method": "PUT",
						"header": [
							{
								"key": "Content-Type",
								"name": "Content-Type",
								"value": "application/json",
								"type": "text"
							}
						],
						"body": {
							"mode": "raw",
							"raw": "{\r\n        \"customer\": {\r\n            \"firstName\": \"TestPutName\",\r\n            \"lastName\": \"TestPutSurname\",\r\n            \"billingDetails\": {\r\n                \"cardNumber\": 999999999,\r\n                \"paymentSystem\": \"AMERICAN_EXPRESS\"\r\n            }\r\n        },\r\n        \"date\": \"2009-09-09\",\r\n        \"dresses\": [\r\n            {\r\n                \"id\": 1,\r\n                \"size\": 42,\r\n                \"color\": \"White\",\r\n                \"manufacturer\": {\r\n                    \"id\": 1,\r\n                    \"companyName\": \"AK\",\r\n                    \"country\": \"Russia\",\r\n                    \"city\": \"Samara\"\r\n                }\r\n            },\r\n            {\r\n                \"id\": 2,\r\n                \"size\": 44,\r\n                \"color\": \"Red\",\r\n                \"manufacturer\": {\r\n                    \"id\": 1,\r\n                    \"companyName\": \"AK\",\r\n                    \"country\": \"Russia\",\r\n                    \"city\": \"Samara\"\r\n                }\r\n            }\r\n        ]\r\n}",
							"options": {
								"raw": {
									"language": "json"
								}
							}
						},
						"url": {
							"raw": "localhost:1111/shop/orders/1/",
							"host": [
								"localhost"
							],
							"port": "1111",
							"path": [
								"shop",
								"orders",
								"1",
								""
							]
						}
					},
					"response": []
				},
				{
					"name": "PutNotFound",
					"request": {
						"method": "PUT",
						"header": [
							{
								"key": "Content-Type",
								"name": "Content-Type",
								"type": "text",
								"value": "application/json"
							}
						],
						"body": {
							"mode": "raw",
							"raw": "{\r\n        \"customer\": {\r\n            \"firstName\": \"TestPutName\",\r\n            \"lastName\": \"TestPutSurname\",\r\n            \"billingDetails\": {\r\n                \"cardNumber\": 999999999,\r\n                \"paymentSystem\": \"AMERICAN_EXPRESS\"\r\n            }\r\n        },\r\n        \"date\": \"2009-09-09\",\r\n        \"dresses\": [\r\n            {\r\n                \"id\": 1,\r\n                \"size\": 42,\r\n                \"color\": \"White\",\r\n                \"manufacturer\": {\r\n                    \"id\": 1,\r\n                    \"companyName\": \"AK\",\r\n                    \"country\": \"Russia\",\r\n                    \"city\": \"Samara\"\r\n                }\r\n            },\r\n            {\r\n                \"id\": 2,\r\n                \"size\": 44,\r\n                \"color\": \"Red\",\r\n                \"manufacturer\": {\r\n                    \"id\": 1,\r\n                    \"companyName\": \"AK\",\r\n                    \"country\": \"Russia\",\r\n                    \"city\": \"Samara\"\r\n                }\r\n            }\r\n        ]\r\n}",
							"options": {
								"raw": {
									"language": "json"
								}
							}
						},
						"url": {
							"raw": "localhost:1111/shop/orders/9/",
							"host": [
								"localhost"
							],
							"port": "1111",
							"path": [
								"shop",
								"orders",
								"9",
								""
							]
						}
					},
					"response": []
				},
				{
					"name": "GetAll",
					"request": {
						"method": "GET",
						"header": [
							{
								"key": "Content-Type",
								"name": "Content-Type",
								"value": "application/json",
								"type": "text"
							}
						],
						"url": {
							"raw": "localhost:1111/shop/orders/list/",
							"host": [
								"localhost"
							],
							"port": "1111",
							"path": [
								"shop",
								"orders",
								"list",
								""
							]
						}
					},
					"response": []
				}
			],
			"protocolProfileBehavior": {}
		},
		{
			"name": "postRequests",
			"item": [
				{
					"name": "PostOrder",
					"request": {
						"method": "POST",
						"header": [
							{
								"key": "Content-Type",
								"name": "Content-Type",
								"value": "application/json",
								"type": "text"
							}
						],
						"body": {
							"mode": "raw",
							"raw": "{\r\n        \"customer\": {\r\n            \"firstName\": \"Gustavo\",\r\n            \"lastName\": \"Fring\",\r\n            \"billingDetails\": {\r\n                \"cardNumber\": 55554488,\r\n                \"paymentSystem\": \"VISA\"\r\n            }\r\n        },\r\n        \"date\": \"2017-06-19\",\r\n        \"dresses\": [\r\n            {\r\n                \"id\": 1,\r\n                \"size\": 42,\r\n                \"color\": \"White\",\r\n                \"manufacturer\": {\r\n                    \"id\": 1,\r\n                    \"companyName\": \"AK\",\r\n                    \"country\": \"Russia\",\r\n                    \"city\": \"Samara\"\r\n                }\r\n            },\r\n            {\r\n                \"id\": 2,\r\n                \"size\": 44,\r\n                \"color\": \"Red\",\r\n                \"manufacturer\": {\r\n                    \"id\": 1,\r\n                    \"companyName\": \"AK\",\r\n                    \"country\": \"Russia\",\r\n                    \"city\": \"Samara\"\r\n                }\r\n            },\r\n            {\r\n                \"id\": 3,\r\n                \"size\": 46,\r\n                \"color\": \"Blue\",\r\n                \"manufacturer\": {\r\n                    \"id\": 1,\r\n                    \"companyName\": \"AK\",\r\n                    \"country\": \"Russia\",\r\n                    \"city\": \"Samara\"\r\n                }\r\n            },\r\n            {\r\n                \"id\": 4,\r\n                \"size\": 48,\r\n                \"color\": \"Yellow\",\r\n                \"manufacturer\": {\r\n                    \"id\": 2,\r\n                    \"companyName\": \"DR\",\r\n                    \"country\": \"Germany\",\r\n                    \"city\": \"Berlin\"\r\n                }\r\n            },\r\n            {\r\n                \"id\": 5,\r\n                \"size\": 40,\r\n                \"color\": \"Purple\",\r\n                \"manufacturer\": {\r\n                    \"id\": 2,\r\n                    \"companyName\": \"DR\",\r\n                    \"country\": \"Germany\",\r\n                    \"city\": \"Berlin\"\r\n                }\r\n            },\r\n            {\r\n                \"id\": 6,\r\n                \"size\": 38,\r\n                \"color\": \"Green\",\r\n                \"manufacturer\": {\r\n                    \"id\": 2,\r\n                    \"companyName\": \"DR\",\r\n                    \"country\": \"Germany\",\r\n                    \"city\": \"Berlin\"\r\n                }\r\n            }\r\n        ]\r\n}",
							"options": {
								"raw": {
									"language": "json"
								}
							}
						},
						"url": {
							"raw": "localhost:1111/shop/orders/",
							"host": [
								"localhost"
							],
							"port": "1111",
							"path": [
								"shop",
								"orders",
								""
							]
						}
					},
					"response": []
				},
				{
					"name": "PostNotValid",
					"request": {
						"method": "POST",
						"header": [
							{
								"key": "Content-Type",
								"name": "Content-Type",
								"type": "text",
								"value": "application/json"
							}
						],
						"body": {
							"mode": "raw",
							"raw": "{\r\n        \"customer\": {\r\n            \"firstName\": \"Test\",\r\n            \"lastName\": \"Test\",\r\n            \"billingDetails\": {\r\n                \"cardNumber\": 55554488,\r\n                \"paymentSystem\": \"VISA\"\r\n            }\r\n        },\r\n        \"dresses\": [\r\n            {\r\n                \"id\": 1,\r\n                \"size\": 42,\r\n                \"color\": \"White\",\r\n                \"manufacturer\": {\r\n                    \"id\": 1,\r\n                    \"companyName\": \"AK\",\r\n                    \"country\": \"Russia\",\r\n                    \"city\": \"Samara\"\r\n                }\r\n            },\r\n            {\r\n                \"id\": 2,\r\n                \"size\": 44,\r\n                \"color\": \"Red\",\r\n                \"manufacturer\": {\r\n                    \"id\": 1,\r\n                    \"companyName\": \"AK\",\r\n                    \"country\": \"Russia\",\r\n                    \"city\": \"Samara\"\r\n                }\r\n            },\r\n            {\r\n                \"id\": 3,\r\n                \"size\": 46,\r\n                \"color\": \"Blue\",\r\n                \"manufacturer\": {\r\n                    \"id\": 1,\r\n                    \"companyName\": \"AK\",\r\n                    \"country\": \"Russia\",\r\n                    \"city\": \"Samara\"\r\n                }\r\n            },\r\n            {\r\n                \"id\": 4,\r\n                \"size\": 48,\r\n                \"color\": \"Yellow\",\r\n                \"manufacturer\": {\r\n                    \"id\": 2,\r\n                    \"companyName\": \"DR\",\r\n                    \"country\": \"Germany\",\r\n                    \"city\": \"Berlin\"\r\n                }\r\n            },\r\n            {\r\n                \"id\": 5,\r\n                \"size\": 40,\r\n                \"color\": \"Purple\",\r\n                \"manufacturer\": {\r\n                    \"id\": 2,\r\n                    \"companyName\": \"DR\",\r\n                    \"country\": \"Germany\",\r\n                    \"city\": \"Berlin\"\r\n                }\r\n            },\r\n            {\r\n                \"id\": 6,\r\n                \"size\": 38,\r\n                \"color\": \"Green\",\r\n                \"manufacturer\": {\r\n                    \"id\": 2,\r\n                    \"companyName\": \"DR\",\r\n                    \"country\": \"Germany\",\r\n                    \"city\": \"Berlin\"\r\n                }\r\n            }\r\n        ]\r\n}",
							"options": {
								"raw": {
									"language": "json"
								}
							}
						},
						"url": {
							"raw": "localhost:1111/shop/orders/",
							"host": [
								"localhost"
							],
							"port": "1111",
							"path": [
								"shop",
								"orders",
								""
							]
						}
					},
					"response": []
				},
				{
					"name": "GetAll",
					"request": {
						"method": "GET",
						"header": [
							{
								"key": "Content-Type",
								"name": "Content-Type",
								"value": "application/json",
								"type": "text"
							}
						],
						"url": {
							"raw": "localhost:1111/shop/orders/list/",
							"host": [
								"localhost"
							],
							"port": "1111",
							"path": [
								"shop",
								"orders",
								"list",
								""
							]
						}
					},
					"response": []
				},
				{
					"name": "GetById4",
					"request": {
						"method": "GET",
						"header": [],
						"url": {
							"raw": "localhost:1111/shop/orders/4/",
							"host": [
								"localhost"
							],
							"port": "1111",
							"path": [
								"shop",
								"orders",
								"4",
								""
							]
						}
					},
					"response": []
				}
			],
			"protocolProfileBehavior": {}
		},
		{
			"name": "deleteRequests",
			"item": [
				{
					"name": "DeleteById2",
					"request": {
						"method": "DELETE",
						"header": [],
						"url": {
							"raw": "localhost:1111/shop/orders/2/",
							"host": [
								"localhost"
							],
							"port": "1111",
							"path": [
								"shop",
								"orders",
								"2",
								""
							]
						}
					},
					"response": []
				},
				{
					"name": "GetById2",
					"request": {
						"method": "GET",
						"header": [],
						"url": {
							"raw": "localhost:1111/shop/orders/2/",
							"host": [
								"localhost"
							],
							"port": "1111",
							"path": [
								"shop",
								"orders",
								"2",
								""
							]
						}
					},
					"response": []
				},
				{
					"name": "GetAll",
					"request": {
						"method": "GET",
						"header": [
							{
								"key": "Content-Type",
								"name": "Content-Type",
								"value": "application/json",
								"type": "text"
							}
						],
						"url": {
							"raw": "localhost:1111/shop/orders/list/",
							"host": [
								"localhost"
							],
							"port": "1111",
							"path": [
								"shop",
								"orders",
								"list",
								""
							]
						}
					},
					"response": []
				}
			],
			"protocolProfileBehavior": {}
		}
	],
	"protocolProfileBehavior": {}
}