Data;Domiciar Rat%;Individual Rat#
05 10 2020;7,5;2.541,40
28 09 2020;8,2;2.767,00
21 09 2020;8,1;2.815,60
14 09 2020;8,1;2.785,10
07 09 2020;8,2;2.739,00
31 08 2020 ;8,1;2.743,60
24 08 2020;8,4;2.746,30
17 08 2020;8,6;2.929,20
10 08 2020;8,6;2.926,60
03 08 2020;8,3;2.767,80
27 07 2020;9,2;3.131,30
20 07 2020;8,6;2.901,40
13 07 2020;8,7;2.944,90
06 07 2020;8,7;3.050,10
29 06 2020;9,3;3.230,80
22 06 2020;8,5;2.892,10
15 06 2020;9,2;3.199,20
08 06 2020;8,7;3.013,70
01 06 2020;8,3;2.772,50
25 05 2020;8,9;3.053,90
18 05 2020;9,2;3.202,00
11 05 2020;9,5;3.349,20
04 05 2020;8,5;2.899,40
27 04 2020;9;3.184,00
20 04 2020;9;3.146,10
13 04 2020;8,4;2.941,50
06 04 2020;8;2.835,00
30 03 2020;9,9;3.383,30
23 03 2020;10,2;3.593,90
16 03 2020;9,4;3.219,50
09 03 2020;9,5;3.296,90
02 03 2020;9,8;3.385,70
24 02 2020;10,1;3.428,90
17 02 2020;9,1;3.081,80
10 02 2020;9,3;3.167,90
03 02 2020;9;3.028,40
27 01 2020;10,1;3.535,90
20 01 2020;10;3.550,30
13 01 2020;10;3.427,90
06 01 2020;10,4;3.558,20
30 12 2019;11,1;3.791,60
23 12 2019;10;3431,8
16 12 2019;10;3409,8
09 12 2019;9,7;3.271,00
02 12 2019;10;3.302,20
25 11 2019;10,1;3.391,70
18 11 2019;11;3.787,80
11 11 2019;10,7;3.589,10
04 11 2019;10,5;3.571,00
28 10 2019;10,3;3.488,30
21 10 2019;10,3;3.466,40
14 10 2019;11;3.705,00
07 10 2019;11,1;3.782,50
30 09 2019;11;3.649,70
23 09 2019;11,3;3.830,70
16 09 2019;11,3;3.793,30
09 09 2019;11;3.720,70
02 09 2019;11,4;3.835
26 08 2019;11,1;3.773,80
19 08 2019;11;3.813,10
12 08 2019;11,9;4.057,60
05 08 2019;11;3.728,90
29 07 2019;11,4;3.885,20
22 07 2019;12,7;4.326,40
15 07 2019;12,1;3.996,60
08 07 2019;11,3;3.803,90
01 07 2019;11,5;3.849,60
24 06 2019;11,3;3.770,20
17 06 2019;10,7;3.487,60
10 06 2019;11,8;3.879,40
03 06 2019;11,2;3.718,70
27 05 2019;11,4;3.929,20
20 05 2019;11,3;3.626
13 05 2019;10,6;3.525
06 05 2019;10,5;3.488,80
29 04 2019;12;3.950,60
22 04 2019;;
15 04 2019;10,5;3.400,50
08 04 2019;11,4;3.740,10
01 04 2019;10,7;3.512,70
25 03 2019;11,6;3.740,50
18 03 2019;10,9;3.513,80
11 03 2019;10,8;3.615,90
04 03 2019;11;3.663,70
25 02 2019;11;3.553,10
18 02 2019;10,7;3.497,80
11 02 2019;10,8;3.699,20
04 02 2019;10,6;3.447,20
28 01 2019;11;3.645,00
21 01 2019;10,6;3.599,60
14 01 2019;11,1;3.777,90
07 01 2019;11,1;3.608,60
31 12 2018;11;3.570,70
