[gd_scene load_steps=10 format=2]

[ext_resource path="res://assets/GFX/Items/bronze_1.png" type="Texture" id=1]
[ext_resource path="res://assets/GFX/Items/bronze_2.png" type="Texture" id=2]
[ext_resource path="res://assets/GFX/Items/bronze_4.png" type="Texture" id=3]
[ext_resource path="res://assets/GFX/Items/bronze_3.png" type="Texture" id=4]
[ext_resource path="res://scripts/Coin.gd" type="Script" id=5]
[ext_resource path="res://assets/SFX/coin_SFX.wav" type="AudioStream" id=6]

[sub_resource type="SpriteFrames" id=1]

animations = [ {
"frames": [ ExtResource( 1 ), ExtResource( 2 ), ExtResource( 3 ), ExtResource( 4 ) ],
"loop": true,
"name": "default",
"speed": 5.0
} ]

[sub_resource type="CircleShape2D" id=2]

custom_solver_bias = 0.0
radius = 42.6032

[sub_resource type="Animation" id=3]

resource_name = "die"
length = 0.5
loop = false
step = 0.1
tracks/0/type = "value"
tracks/0/path = NodePath(".:scale")
tracks/0/interp = 1
tracks/0/loop_wrap = true
tracks/0/imported = false
tracks/0/enabled = true
tracks/0/keys = {
"times": PoolRealArray( 0, 0.2, 0.5 ),
"transitions": PoolRealArray( 1, 1, 1 ),
"update": 0,
"values": [ Vector2( 1, 1 ), Vector2( 1.1, 1.1 ), Vector2( 1e-05, 1e-05 ) ]
}
tracks/1/type = "method"
tracks/1/path = NodePath(".")
tracks/1/interp = 1
tracks/1/loop_wrap = true
tracks/1/imported = false
tracks/1/enabled = true
tracks/1/keys = {
"times": PoolRealArray( 0.5 ),
"transitions": PoolRealArray( 1 ),
"values": [ {
"args": [  ],
"method": "die"
} ]
}

[node name="Coin" type="AnimatedSprite"]

frames = SubResource( 1 )
animation = "default"
frame = 2
playing = true
script = ExtResource( 5 )
_sections_unfolded = [ "Transform" ]

[node name="Area" type="Area2D" parent="." index="0"]

input_pickable = true
gravity_vec = Vector2( 0, 1 )
gravity = 98.0
linear_damp = 0.1
angular_damp = 1.0
collision_layer = 64
audio_bus_override = false
audio_bus_name = "Master"
_sections_unfolded = [ "Collision" ]

[node name="CollisionShape2D" type="CollisionShape2D" parent="Area" index="0"]

visible = false
shape = SubResource( 2 )

[node name="AnimationPlayer" type="AnimationPlayer" parent="." index="1"]

root_node = NodePath("..")
autoplay = ""
playback_process_mode = 1
playback_default_blend_time = 0.0
playback_speed = 1.0
anims/die = SubResource( 3 )
blend_times = [  ]

[node name="AudioStreamPlayer" type="AudioStreamPlayer" parent="." index="2"]

stream = ExtResource( 6 )
volume_db = -15.0
pitch_scale = 1.0
autoplay = false
mix_target = 0
bus = "Master"

[connection signal="body_entered" from="Area" to="." method="_on_RigidBody2D_body_entered"]


