"인증번호","인증회차","분야코드","분야명","제품명","모델명","준공일자","설치위치","사업명","설치수량"
"SGPD-00086","04","2","공공시설물","KLG-22","KLG-22","20120627","상암동 DMC 외국인학교","DMC외국인학교 건립공사","72"
"SGPD-00088","04","2","공공시설물","DKM-00691","DKM-00691","20110802","서울특별시 동작구","2011년 자전거보관대 설치","35"
"SGPD-00088","04","2","공공시설물","DKM-00691","DKM-00691","20110613","서울특별시 서초구","자전거 보관대 구매","7"
"SGPD-00088","04","2","공공시설물","DKM-00691","DKM-00691","20101018","서울특별시 한강사업본부","한강시설수방대비응급복구공사 관급자재 구매 - 자전거보관대","42"
"SGPD-00088","04","2","공공시설물","DKM-00691","DKM-00691","20120613","서울특별시 동작구","2012년 자전거보관대 설치","15"
"SGPD-00088","04","2","공공시설물","DKM-00691","DKM-00691","20100930","서울특별시 동작구","자전거시범기관 이용시설 구매 및 설치","13"
"SGPD-00088","04","2","공공시설물","DKM-00691","DKM-00691","20101124","서울특별시 동대문구","왕산로 디자인 서울거리 조성공사 2차 관급자재 구매 - 도디 안태훈","15"
"SGPD-00088","04","2","공공시설물","DKM-00691","DKM-00691","20110314","서울특별시 서초구","자전거 보관대 구매","28"
"SGPD-00052","03","2","공공시설물","ZBD-500","ZBD-500","20100929","서울 영등포구 여의도동","","100"
"SGPD-00052","03","2","공공시설물","ZBD-500","ZBD-500","20100929","서울 강북구 번동","","3"
"SGPD-00054","03","2","공공시설물","DN-P","DN-P","20130527","서울 서초구 원지동 서울추모공원","시민공원 탄성볼라드 구매 설치","8"
"SGPD-00054","03","2","공공시설물","DN-P","DN-P","20110531","서울 강동구 암사동 새장터어린이공원 / 명일동 진달래공원","새장터 진달래어린이공원 시설개선공사 자재용 볼라드 조달구매","8"
"SGPD-00054","03","2","공공시설물","DN-P","DN-P","20110809","서울 양천구 목동 파리공원","볼라드 납품","2"
"SGPD-00054","03","2","공공시설물","DN-P","DN-P","20130707","서울 노원구 상계동 불암산 허브공원 등산로 초입","차량진입방지용 볼라드 구매","2"
"SGPD-00054","03","2","공공시설물","DN-P","DN-P","20120702","서울 종로구 관철동 젊음의거리","볼라드조달구매-건설관리과-","27"
"SGPD-00054","03","2","공공시설물","DN-P","DN-P","20111103","서울 종로구 관철동 젊음의거리","젊음의거리 시설물 볼라드조달구매","36"
"SGPD-00064","18","2","공공시설물","CIB-005","CIB-005","20100510","서울 동대문구 전농동","동대문구청 벤치납품건","2"
"SGPD-00069","04","2","공공시설물","HBE-B1001","HBE-B1001","20111130","서울 송파구 송파동","송파반도 래미안 아파트 조경시설물공사","3"
"SGPD-00069","04","2","공공시설물","HBE-B1001","HBE-B1001","20121013","서울 중구 만리동1가","충정녹지정비공사","5"
"SGPD-00069","04","2","공공시설물","HBE-B1001","HBE-B1001","20111130","서울 동작구 신대방동","남부수도사업소 시설물 설치공사","4"
"SGPD-00069","04","2","공공시설물","HBE-B1001","HBE-B1001","20110719","서울 서대문구 현저동","서대문독립공원","3"
"SGPD-00071","04","2","공공시설물","HBE-1003","HBE-1003","20110506","서울 중구 다동","중구 다동 오피스","17"
"SGPD-00096","04","2","공공시설물","YJ-07","YJ-07","20130910","서울 성동구 마장동 503-9 적십자병원 뒷쪽","쾌적한 보행환경조성","39"
"SGPD-00096","04","2","공공시설물","YJ-07","YJ-07","20130605","서울 동대문구 전농동 295-320 (전농사거리 우리은행앞)","차량진입금지봉외 1종","40"
"SGPD-00098","04","2","공공시설물","HGRS-DB702","HGRS-DB702","20121226","서울 서대문구 북가좌동","2012년 하반기 소공원 정비공사","11"
"SGPD-00098","04","2","공공시설물","HGRS-DB702","HGRS-DB702","20121120","서울 서대문구 영천동","관급자재구매-공원시설 개선사업","8"
"SGPD-00098","04","2","공공시설물","HGRS-DB702","HGRS-DB702","20120713","서울 서대문구 남가좌2동","볼라드 구매 설치","15"
"SGPD-00098","04","2","공공시설물","HGRS-DB702","HGRS-DB702","20121226","서울 영등포구 여의도동","여의도공원 편의시설 정비사업 관급자재 구매","90"
"SGPD-00100","04","2","공공시설물","BD-012-03","BD-012-03","20131130","서울 동작구 상도1동","2013년 도로시설물 유지보수공사(연간)","50"
"SGPD-00100","04","2","공공시설물","BD-012-03","BD-012-03","20130723","서울 중구 을지로2가 교차로","물품구매(탄성볼라드)","228"
"SGPD-00059","03","2","공공시설물","복합재료맨홀뚜껑","복합재료맨홀뚜껑","2013    ","서울특별시 중구 세종대로 110","서울특별시신청사건립공사   ","250"
"SGPD-00085","04","2","공공시설물","KLG-23","KLG-23","20130325","9호선 염창역 2번 출구 주변","자전거보관대 구매(구비)","30"
"SGPD-00085","04","2","공공시설물","KLG-23","KLG-23","20130122","영파여고앞 ","영파여고앞 자전거 보관대 구매","50"
"SGPD-00085","04","2","공공시설물","KLG-23","KLG-23","20121107","길동 사거리","자전거 보관대 구매2","16"
"SGPD-00085","04","2","공공시설물","KLG-23","KLG-23","20121122","6호선 삼각지역 주변","자전거 보관대 구매2","10"
"SGPD-00085","04","2","공공시설물","KLG-23","KLG-23","20120907","둔촌역 3번출구 GS칼텍스 앞","자전거 보관대 구매","50"
"SGPD-00085","04","2","공공시설물","KLG-23","KLG-23","20120507","강동구 상일동 328(상일초교)","자전거 보관대 구매","26"
"SGPD-00085","04","2","공공시설물","KLG-23","KLG-23","20120507","9호선 양천향교역 주변","자전거 보관대 구매","38"
"SGPD-00085","04","2","공공시설물","KLG-23","KLG-23","20101027","청계천 주변","자전거 이용활성화를 위한 자전거보관대 구매","48"
"SGPD-00085","04","2","공공시설물","KLG-23","KLG-23","20110630","경복궁사거리","자전거 보관대 구매","30"
"SGPD-00085","04","2","공공시설물","KLG-23","KLG-23","20110517","송정역 주변","자전거보관대 구매","25"
"SGPD-00099","04","2","공공시설물","HGRS-DB701","HGRS-DB701","20120131","서울 성북구 돈암동","볼라드-교통사고잦은곳 개선사업","191"
"SGPD-00099","04","2","공공시설물","HGRS-DB701","HGRS-DB701","20100624","서울 동대문구 전농동","볼라드구매-최남","25"
"SGPD-00133","04","2","공공시설물","BHL-01","BHL-01","20140320","서울 종로구 홍지동","보행자방호울타리조달구매","7"
"SGPD-00133","04","2","공공시설물","BHL-01","BHL-01","20140212","서울 성동구 마장동","마장지하차도구조개선사업","148"
"SGPD-00043","03","2","공공시설물","CHB-4503","CHB-4503","20101030","서울 동작구 사당동","사당로 디자인서울 거리","12"
"SGPD-00043","03","2","공공시설물","CHB-4503","CHB-4503","20100902","서울 도봉구 도봉동","도봉산길 디자인서울거리","20"
"SGPD-00043","03","2","공공시설물","CHB-4503","CHB-4503","20111030","서울 영등포구 신길동","신길역 주변","9"
"SGPD-00043","03","2","공공시설물","CHB-4503","CHB-4503","20111221","서울 도봉구 도봉동","도봉로 및 도봉산역 주변 ","4"
"SGPD-00043","03","2","공공시설물","CHB-4503","CHB-4503","20110410","서울 강남구 논현동","학동근린공원","5"
"SGPD-00043","03","2","공공시설물","CHB-4003","CHB-4003","20130430","서울 마포구 상암동","한강자전거투어 관련 편의시설 조달 구매","44"
"SGPD-00043","03","2","공공시설물","CHB-4003","CHB-4003","20100902","서울 도봉구 도봉동","도봉산길 디자인서울 거리","4"
"SGPD-00043","03","2","공공시설물","CHB-4003","CHB-4003","20110410","서울 강남구 논현동","학동근린공원","7"
"SGPD-00131","19","2","공공시설물","KL-83","KL-83","20140209","서울 은평구 신사동 359번지","디자인형울타리(도로시설물보수공사 2차","100"
"SGPD-00131","19","2","공공시설물","KL-83","KL-83","20140311","서울 은평구 신사동 359","방호형울타리(관내도로시설물 보수공사)","14"
"SGPD-00131","19","2","공공시설물","KL-83","KL-83","20170620","서울 은평구 응암동 748-3","디자인형 울타리 설치공사","34"
"SGPD-00131","19","2","공공시설물","KL-83","KL-83","20130704","강남구 일원동677","보행장방호울타리 - 일원동 677번지 주변 하수관 개량공사","41"
"SGPD-00131","19","2","공공시설물","KL-83","KL-83","20121114","학여울역 진입도로 중앙건널목","디자인형울타리 - 학여울역 하수암거신설공사","37"
"SGPD-00131","19","2","공공시설물","KL-83","KL-83","20110607","보신각 주변","보신각터 펜스","100"
"SGPD-00142","04","2","공공시설물","ACP-265 (레미안형)","ACP-265 (레미안형)","20101103","서울 양천구 신월동","신월로 가로등 설치공사","19"
"SGPD-00142","04","2","공공시설물","ACP-265 (레미안형)","ACP-265 (레미안형)","20111031","서울 도봉구 도봉동","의정부시계 환경개선 가로등 신설공사","52"
"SGPD-00142","04","2","공공시설물","ACP-265 (레미안형)","ACP-265 (레미안형)","20110516","서울 동작구 본동","매봉길외2개소노선 가로등 개량공사용 관급자재구매","11"
"SGPD-00142","04","2","공공시설물","ACP-265 (레미안형)","ACP-265 (레미안형)","20120413","서울 성북구 삼선동5가","가로등주 조명등유지보수","50"
"SGPD-00142","04","2","공공시설물","ACP-265 (레미안형)","ACP-265 (레미안형)","20110524","서울 성북구 삼선동5가","철제가로등주 조명등유지보수","28"
"SGPD-00142","04","2","공공시설물","ACP-265 (레미안형)","ACP-265 (레미안형)","20130429","서울 성북구 삼선동5가","철재가로등주 외 1종","4"
"SGPD-00142","04","2","공공시설물","ACP-265 (레미안형)","ACP-265 (레미안형)","20120924","서울 광진구 자양동","가로등주 및 등기구 구매","16"
"SGPD-00142","04","2","공공시설물","ACP-265 (레미안형)","ACP-265 (레미안형)","20111027","서울 동작구 신대방동 395","가로등구매 보라매길가로등개량공사","51"
"SGPD-00142","04","2","공공시설물","ACP-265 (레미안형)","ACP-265 (레미안형)","20120517","서울 성북구 삼선동5가","가로등주외2종 조명등 유지보수","16"
"SGPD-00142","04","2","공공시설물","ACP-265 (레미안형)","ACP-265 (레미안형)","20111011","서울 영등포구 신길동","신길역주변 경관사업 전기설비공사","15"
"SGPD-00142","04","2","공공시설물","ACP-265 (레미안형)","ACP-265 (레미안형)","20120517","서울 성북구 삼선동5가","가로등주외 2종 조명등 유지보수","5"
"SGPD-00143","18","2","공공시설물","ACP-261(남대문로형)","ACP-261(남대문로형)","20180730","서울 광진구 군자동 364-17 (군자동 노인복지회관 앞)","철제가로등주 외 구매","36"
"SGPD-00143","18","2","공공시설물","ACP-261(남대문로형)","ACP-261(남대문로형)","20170615","서울 관악구 신림동 145-6 (서울대입구 교차로)","관악산 저류조 설치 전기공사","12"
"SGPD-00143","18","2","공공시설물","ACP-261(남대문로형)","ACP-261(남대문로형)","20180417","서울 동대문구 전농동 518 동대문 롯데케슬 노블레스 아파트 입구","전농 11구역 주택재개발 아파트 신축공사","24"
"SGPD-00143","18","2","공공시설물","ACP-261(남대문로형)","ACP-261(남대문로형)","20101014","서울 중구 필동2가 퇴계로34길","필동길 가로등 개량공사용 관급자재 구매","56"
"SGPD-00143","18","2","공공시설물","ACP-261(남대문로형)","ACP-261(남대문로형)","20120621","서울 마포구 동교동","가로등유지보수공사","1"
"SGPD-00143","18","2","공공시설물","ACP-261(남대문로형)","ACP-261(남대문로형)","20120621","서울 마포구 동교동","가로등유지보수공사","1"
"SGPD-00143","18","2","공공시설물","ACP-261(남대문로형)","ACP-261(남대문로형)","20120604","서울 송파구 삼전동","삼학사로도로조명개선공사","28"
"SGPD-00143","18","2","공공시설물","ACP-261(남대문로형)","ACP-261(남대문로형)","20110503","서울 강남구 역삼동 665-1","테헤란로북22길-충현교회주변-가로등설치공사","7"
"SGPD-00060","03","2","공공시설물","MDSS08-121","MDSS08-121","20100708","마포구 상암동 월드컵파크 1단지 삼거리","상암로 도로조명 개선사업","107"
"SGPD-00060","03","2","공공시설물","MDSS08-121","MDSS08-121","20121010","성동교남단~강변북로","왕십리길 가로등 개량공사","71"
"SGPD-00060","03","2","공공시설물","MDSS08-121","MDSS08-121","20111019","길음교차로~정릉입구","도로조명개선공사","70"
"SGPD-00060","03","2","공공시설물","MDSS08-121","MDSS08-121","20120924","디지털3단지 국민일보앞","가로등주 외 12종 구매","64"
"SGPD-00060","03","2","공공시설물","MDSS08-121","MDSS08-121","20120730","국민대학교~정릉입구","정릉길 가로등 개량공사","68"
"SGPD-00060","03","2","공공시설물","MDSS08-121","MDSS08-121","20120530","천동초교~초일초교","천동초교~천일초교간 가로등 설치공사","28"
"SGPD-00060","03","2","공공시설물","MDSS08-121","MDSS08-121","20120701","숭덕초교~종암사거리","정릉길 가로등 개량공사 2차-2","70"
"SGPD-00060","03","2","공공시설물","MDSS08-121","MDSS08-121","20120530","숭덕초교~종암사거리","정릉길 가로등 개량공사 2차-1","77"
"SGPD-00060","03","2","공공시설물","MDSS08-121","MDSS08-121","20110921","종암사거리~길음교차로","정릉길 가로등주 개량공사","11"
"SGPD-00056","18","2","공공시설물","GR-151","GR-151","20180420"," 우이천로 174(우이천)","2018년 하천시설물 유지보수공사(연간단가) 관급자재(디자인형울타리)구매","10"
"SGPD-00056","18","2","공공시설물","GR-151","GR-151","20110705","서울 강남구 개포4동 656","개포동 육교주변 무단횡단금지 방호울타리 구매","57"
"SGPD-00056","18","2","공공시설물","GR-151","GR-151","20120110","서울 광진구 광장동 581","디자인휀스 구매 -워커힐 기도로 구조개선공사","230"
"SGPD-00070","04","2","공공시설물","HBE-1002","HBE-1002","20100331","서울 송파구 방이동","올림픽공원 휴게편익시설 제조 설치","60"
"SGPD-00002","21","2","공공시설물","YB-505","YB-505","20121022","서울 서초구 잠원동 58-14 (신동근린공원)","신동근린공원 시설물 현대화사업 관급자재 구매-에코셀스톤블록 등 6종","5"
"SGPD-00002","21","2","공공시설물","YB-505","YB-505","20130810","서울 용산구 이태원동 34-87","종합행정타운 옥외용 벤치 구매","6"
"SGPD-00002","21","2","공공시설물","YB-505","YB-505","20121126","서울 용산구 이촌동 302-183","한강공원 편의시설 정비 및 확충공사 관급자재구매-벤치외 4종","4"
"SGPD-00002","21","2","공공시설물","YB-505","YB-505","20120820","서울 서초구 원지동419-7","'시공원 보수정비사업 관급자재 구매","4"
"SGPD-00002","21","2","공공시설물","YB-505","YB-505","20130505","서울 서초구 잠원동 55-14 (신동근린공원)","옥외용 벤치 구매(신동근린공원)","2"
"SGPD-00210","05","2","공공시설물","기능형 가로등 분전함","ACERO-A(ACE-02)","20120820","서울 서초구 내곡동","서초보금자리지구 분전반설치공사","1"
"SGPD-00210","05","2","공공시설물","기능형 가로등 분전함","ACERO-A(ACE-02)","20120612","서울 송파구 잠실동","푸른도시과 자재구매","2"
"SGPD-00210","05","2","공공시설물","기능형 가로등 분전함","ACERO-A(ACE-02)","20120601","서울 서대문구 북가좌동","북가좌동 주민참여형","1"
"SGPD-00210","05","2","공공시설물","기능형 가로등 분전함","ACERO-A(ACE-02)","20120731","서울 강남구 대치동 영동대로 남단일대","영동대로 가로등공사","5"
"SGPD-00210","05","2","공공시설물","기능형 가로등 분전함","ACERO-A(ACE-02)","20120405","서울 송파구 잠실동 성내천변","성내천산책로 변 공원등조성","2"
"SGPD-00210","05","2","공공시설물","기능형 가로등 분전함","ACERO-A(ACE-02)","20120216","서울 강동구 암사동 암사대교","구리-암사대교","2"
"SGPD-00210","05","2","공공시설물","기능형 가로등 분전함","ACERO-A(ACE-02)","20111209","서울 노원구 상계동 노원에코센터 내","노원에코센터 외부공간조성공사","1"
"SGPD-00210","05","2","공공시설물","기능형 가로등 분전함","ACERO-A(ACE-02)","20121023","서울 영등포구 대림동 대림유수지 내","대림유수지내 생태공원 조명공사","1"
"SGPD-00210","05","2","공공시설물","기능형 가로등 분전함","ACERO-A(ACE-02)","20121005","서울 도봉구 도봉동","가로등용 보수자재구매","1"
"SGPD-00210","05","2","공공시설물","기능형 가로등 분전함","ACERO-A(ACE-02)","20120723","서울 중구 만리동1가 손기정기념관 내","손기정기념관 내 조명분전반","1"
"SGPD-00210","05","2","공공시설물","기능형 가로등 분전함","ACERO-A(ACE-02)","20120601","서울 영등포구 대림동 현대1차","대림 현대1차아파트 분전반교체","1"
"SGPD-00210","05","2","공공시설물","기능형 가로등 분전함","ACERO-A(ACE-02)","20120517","서울 관악구 청룡동","신라창의어린이공원","1"
"SGPD-00210","05","2","공공시설물","기능형 가로등 분전함","ACERO-A(ACE-02)","20120515","서울 송파구 양재대로 송파구구간","양재대로 가로등설치공사","4"
"SGPD-00210","05","2","공공시설물","기능형 가로등 분전함","ACERO-A(ACE-02)","20120510","서울 서대문구 신촌동 신촌로일원","신촌로가로등설치공사","2"
"SGPD-00210","05","2","공공시설물","기능형 가로등 분전함","ACERO-A(ACE-02)","20120507","서울 금천구 서울금천로 일대","금천로 가로등설치공사","4"
"SGPD-00210","05","2","공공시설물","기능형 가로등 분전함","ACERO-A(ACE-02)","20120424","서울 양천구 신정동 등촌로 일대","등촌로 가로등설치공사","3"
"SGPD-00210","05","2","공공시설물","기능형 가로등 분전함","ACERO-A(ACE-02)","20111215","서울 송파구 잠실동 위례성길 일대","위례성길-성내천간 도로개설공사","2"
"SGPD-00210","05","2","공공시설물","기능형 가로등 분전함","ACERO-A(ACE-02)","20120220","서울 양천구 신정6동","도로조명 보수자재구매","1"
"SGPD-00210","05","2","공공시설물","기능형 가로등 분전함","ACERO-A(ACE-02)","20120217","서울 종로구 옥인동공원 내","옥인동공원 내 제어반설치공사","1"
"SGPD-00210","05","2","공공시설물","기능형 가로등 분전함","ACERO-A(ACE-02)","20111215","서울 강동구 길동 천동초교 앞","천동초교-천일초교 간 가로등설치공사","1"
"SGPD-00210","05","2","공공시설물","기능형 가로등 분전함","ACERO-A(ACE-02)","20111118","서울 마포구 망원동","망원한강공원 생태공간 조성사업","1"
"SGPD-00210","05","2","공공시설물","기능형 가로등 분전함","ACERO-A(ACE-02)","20111115","경기 과천시 막계동","대공원 내 보수자재구매","3"
"SGPD-00210","05","2","공공시설물","기능형 가로등 분전함","ACERO-A(ACE-02)","20111118","서울 종로구 신문로2가 역사박물관 내","옥외분전함 설치용 ","4"
"SGPD-00210","05","2","공공시설물","기능형 가로등 분전함","ACERO-A(ACE-02)","20110610","서울 구로구 가린열어린이공원","관내 가린열어린이공원 내 공원등 조명공사","1"
"SGPD-00210","05","2","공공시설물","기능형 가로등 분전함","ACERO-A(ACE-02)","20110530","서울 영등포구 선유로 남단","선유로가로등 개량공사","3"
"SGPD-00210","05","2","공공시설물","기능형 가로등 분전함","ACERO-A(ACE-02)","20110822","서울 중구 회현동1가 롯데캐슬 뒤","회현동 주상복합 가로등공사","1"
"SGPD-00210","05","2","공공시설물","기능형 가로등 분전함","ACERO-A(ACE-02)","20130613","서울 영등포구 당산동3가","차없는 문화의 거리 조성사업","1"
"SGPD-00210","05","2","공공시설물","기능형 가로등 분전함","ACERO-A(ACE-02)","20121029","서울 강남구 대치동","보수용 가로등용 분전반 구매","2"
"SGPD-00210","05","2","공공시설물","기능형 가로등 분전함","ACERO-A(ACE-02)","20121029","서울 강동구 고덕동","선사로-고덕지구 구간내 가로등조명공사","2"
"SGPD-00210","05","2","공공시설물","기능형 가로등 분전함","ACERO-A(ACE-02)","20121023","서울 용산구 한남동","남산한남동 분전함설치공사","1"
"SGPD-00210","05","2","공공시설물","기능형 가로등 분전함","ACERO-A(ACE-02)","20120924","서울 구로구 구로동","도로과 자재구매","1"
"SGPD-00210","05","2","공공시설물","기능형 가로등 분전함","ACERO-A(ACE-02)","20120319","서울 강남구 세곡동 은곡마을공원 내","은곡마을공원 내 공원등조명설치","1"
"SGPD-00210","05","2","공공시설물","기능형 가로등 분전함","ACERO-A(ACE-02)","20111201","서울 구로구 고척1동 계남근린공원 내","계남근린공원 내 분전함개량공사","2"
"SGPD-00210","05","2","공공시설물","기능형 가로등 분전함","ACERO-A(ACE-02)","20120412","서울 영등포구 여의도동 시범아파트 내 공원","자유평화공원 내 분전함개량공사","1"
"SGPD-00210","05","2","공공시설물","기능형 가로등 분전함","ACERO-A(ACE-02)","20110721","서울 관악구 청룡동","청룡산 동네뒷산공원화사업","1"
"SGPD-00210","05","2","공공시설물","기능형 가로등 분전함","ACERO-A(ACE-02)","20110506","서울 서대문구 의주로 일대","통일-의주로 버스중앙차선 내 정류장조명공사","9"
"SGPD-00210","05","2","공공시설물","기능형 가로등 분전함","ACERO-A(ACE-02)","20110511","서울 중구 수표동","수표동 가로개량현장","1"
"SGPD-00210","05","2","공공시설물","기능형 가로등 분전함","ACERO-A(ACE-02)","20120511","서울 관악구 대학동 관악산공원","관악산 공원 보수정비공사","1"
"SGPD-00210","05","2","공공시설물","기능형 가로등 분전함","ACERO-A(ACE-02)","20110905","서울 관악구 청룡동","상상어린이공원","1"
"SGPD-00210","05","2","공공시설물","기능형 가로등 분전함","ACERO-A(ACE-02)","20110427","서울 양천구 신정6동 양천구 관내","선로개량용 보수용 분전함 구매","5"
"SGPD-00210","05","2","공공시설물","기능형 가로등 분전함","ACERO-A(ACE-02)","20110425","서울 마포구 동교동 서교로 일대","서교로가로등정비공사","4"
"SGPD-00210","05","2","공공시설물","기능형 가로등 분전함","ACERO-A(ACE-02)","20110531","서울 용산구 관내 어린이공원","2011 어린이공원 재정비 전기공사","1"
"SGPD-00210","05","2","공공시설물","기능형 가로등 분전함","ACERO-A(ACE-02)","20110512","서울 서대문구 신촌동","신촌로개량공사","1"
"SGPD-00210","05","2","공공시설물","기능형 가로등 분전함","ACERO-A(ACE-02)","20120622","서울 구로구 천왕동","수목원용 분전반구매","1"
"SGPD-00210","05","2","공공시설물","기능형 가로등 분전함","ACERO-A(ACE-02)","20111213","서울 동작구 대방동 제비어울림공원","대방동 제비어울림공원 내 제어반설치","1"
"SGPD-00210","05","2","공공시설물","기능형 가로등 분전함","ACERO-A(ACE-02)","20111226","서울 강남구 강남구청 관내","공원등 유지보수용 자재구매","1"
"SGPD-00210","05","2","공공시설물","기능형 가로등 분전함","ACERO-A(ACE-02)","20111216","서울 강서구 개화동 다솔어울림공원 내","다솔 어울림공원 내 전기조명공사","1"
"SGPD-00210","05","2","공공시설물","기능형 가로등 분전함","ACERO-A(ACE-02)","20111214","서울 도봉구 도봉동 무수골공원 내","무수골 공원 조성공사","1"
"SGPD-00210","05","2","공공시설물","기능형 가로등 분전함","ACERO-A(ACE-02)","20110531","서울 중구 예관동","관내 보안등 설치공사","1"
"SGPD-00210","05","2","공공시설물","기능형 가로등 분전함","ACERO-A(ACE-02)","20120723","서울 강동구 성내동 선래오","성내로 가로등공사","2"
"SGPD-00210","05","2","공공시설물","기능형 가로등 분전함","ACERO-A(ACE-02)","20120416","서울 마포구 공덕동 만리배수지 내","만리배수지 공원화 공원등조명공사","1"
"SGPD-00210","05","2","공공시설물","기능형 가로등 분전함","ACERO-A(ACE-02)","20120717","서울 도봉구 도봉동 무수골","무수골가로등공사","2"
"SGPD-00210","05","2","공공시설물","기능형 가로등 분전함","ACERO-A(ACE-02)","20120618","서울 구로구 구로동","공원등 유지보수관련자재구매","1"
"SGPD-00210","05","2","공공시설물","기능형 가로등 분전함","ACERO-A(ACE-02)","20110817","서울 중구 저동1가","저동 현장","1"
"SGPD-00210","05","2","공공시설물","기능형 가로등 분전함","ACERO-A(ACE-02)","20110809","서울 노원구 월계동","화랑고가 가로등설치공사","1"
"SGPD-00210","05","2","공공시설물","기능형 가로등 분전함","ACERO-A(ACE-02)","20130531","서울 용산구 성남어린이공원","성남어린이공원 정비공원","1"
"SGPD-00210","05","2","공공시설물","기능형 가로등 분전함","ACERO-A(ACE-02)","20121130","서울 양천구 신정6동","도로과 자재구매","2"
"SGPD-00210","05","2","공공시설물","기능형 가로등 분전함","ACERO-A(ACE-02)","20120627","서울 송파구 문정동 양재대로 구간","양재대로 가로등설치공사","4"
"SGPD-00210","05","2","공공시설물","기능형 가로등 분전함","ACERO-A(ACE-02)","20130723","서울 광진구 광장동","가로등용분전반설치","1"
"SGPD-00210","05","2","공공시설물","기능형 가로등 분전함","ACERO-A(ACE-02)","20120510","서울 양천구 신정동 강서로 구간","강서로 가로등설치공사","6"
"SGPD-00210","05","2","공공시설물","기능형 가로등 분전함","ACERO-A(ACE-02)","20120619","서울 강남구 역삼동","역삼개나리공원 조명보수","1"
"SGPD-00210","05","2","공공시설물","기능형 가로등 분전함","ACERO-A(ACE-02)","20120416","서울 송파구 잠실동 삼학사로 일대","삼학사로 도로조명공사","2"
"SGPD-00210","05","2","공공시설물","기능형 가로등 분전함","ACERO-A(ACE-02)","20120206","서울 서초구 반포동 신반포나들못","한강공원 육갑문","3"
"SGPD-00210","05","2","공공시설물","기능형 가로등 분전함","ACERO-A(ACE-02)","20111201","서울 금천구 참새어울림공원","참새어울림공원","1"
"SGPD-00210","05","2","공공시설물","기능형 가로등 분전함","ACERO-A(ACE-02)","20120416","서울 관악구 청룡동","창의공원 내 분전함설치공사","1"
"SGPD-00210","05","2","공공시설물","기능형 가로등 분전함","ACERO-A(ACE-02)","20120410","서울 중구 회현동1가","남산회현자락 분전함설치공사","2"
"SGPD-00210","05","2","공공시설물","기능형 가로등 분전함","ACERO-A(ACE-02)","20120319","서울 영등포구 신길동 내 신길공원","신길공원 내 제어반설치공사","1"
"SGPD-00210","05","2","공공시설물","기능형 가로등 분전함","ACERO-A(ACE-02)","20120309","서울 중랑구 망우동","망우동 기부체납건","1"
"SGPD-00210","05","2","공공시설물","기능형 가로등 분전함","ACERO-A(ACE-02)","20120203","서울 강동구 암사동 암사대교","구리-암사대교 간","3"
"SGPD-00210","05","2","공공시설물","기능형 가로등 분전함","ACERO-A(ACE-02)","20111226","서울 강남구 세곡동","공원등유지보수용 자재구매2","2"
"SGPD-00210","05","2","공공시설물","기능형 가로등 분전함","ACERO-A(ACE-02)","20111215","서울 성동구 금호동 금호교차로","금호교차로 구조개선공사","1"
"SGPD-00210","05","2","공공시설물","기능형 가로등 분전함","ACERO-A(ACE-02)","20111212","서울 영등포구 당산동3가 영등포구청","가로등시설물 정비자재 구매","3"
"SGPD-00210","05","2","공공시설물","기능형 가로등 분전함","ACERO-A(ACE-02)","20110824","서울 도봉구 창동","창동 산157번지 일대 동네뒷산","1"
"SGPD-00210","05","2","공공시설물","기능형 가로등 분전함","ACERO-A(ACE-02)","20111108","서울 중구 신당동 청구역 주변","신당7지구 도로조명공사","1"
"SGPD-00210","05","2","공공시설물","기능형 가로등 분전함","ACERO-A(ACE-02)","20111020","서울 강남구 세곡동","세곡지구 4단지","1"
"SGPD-00210","05","2","공공시설물","기능형 가로등 분전함","ACERO-A(ACE-02)","20111005","서울 영등포구 여의도동 여의백화점앞길","여의도백화점 앞 가로등 설치공사","1"
"SGPD-00210","05","2","공공시설물","기능형 가로등 분전함","ACERO-A(ACE-02)","20110722","서울 양천구 신정동","신정3지구 국민임대주택단지 내 가로등분전함 설치공사","1"
"SGPD-00210","05","2","공공시설물","기능형 가로등 분전함","ACERO-A(ACE-02)","20110714","서울 강남구 개포동 탈터근린공원 내","달터근린공원 내 제어반개량사업","1"
"SGPD-00210","05","2","공공시설물","기능형 가로등 분전함","ACERO-A(ACE-02)","20110519","서울 성동구 성수동1가 ","2011년 수방대비 공원등 제어반 구매","5"
"SGPD-00210","05","2","공공시설물","기능형 가로등 분전함","ACERO-A(ACE-02)","20110315","서울 양천구 신정동","신정3지구 국민임대주택단지 조성사업","10"
"SGPD-00210","05","2","공공시설물","기능형 가로등 분전함","ACERO-A(ACE-02)","20111007","서울 중구 저동1가 미래에셋 빌딩 뒤면","을지로3가역 12번출구 입구 저동 미래에셋빌딩 앞 도로","1"
"SGPD-00210","05","2","공공시설물","기능형 가로등 분전함","ACERO-A(ACE-02)","20110908","서울 서대문구 통일로-의주로 버스중앙차선","통일로 버스전용차선 승강장 조명","9"
"SGPD-00210","05","2","공공시설물","기능형 가로등 분전함","ACERO-A(ACE-02)","20110810","서울 용산구 청파동 청파공원 내","청파어린이공원 조성사업","1"
"SGPD-00210","05","2","공공시설물","기능형 가로등 분전함","ACERO-A(ACE-02)","20110218","서울 강동구 길동 강동-하남 BRT 구간 내","","12"
"SGPD-00210","05","2","공공시설물","기능형 가로등 분전함","ACERO-A(ACE-02)","20110510","서울 영등포구 여의도동 국회둔치주차장","국회둔치주차장 경관조명","1"
"SGPD-00210","05","2","공공시설물","기능형 가로등 분전함","ACERO-A(ACE-02)","20110511","서울시 노원구 일원 (상록수불암 외 4개소)","상상어린이공원 조성사업 ","6"
"SGPD-00210","05","2","공공시설물","기능형 가로등 분전함","ACERO-A(ACE-02)","20110405","서울 광진구 구의동 광진구청 (창고)","노후분전함 교체분","1"
"SGPD-00210","05","2","공공시설물","기능형 가로등 분전함","ACERO-A(ACE-02)","20110330","서울 성북구 석관동 송계길공원 앞","","1"
"SGPD-00210","05","2","공공시설물","기능형 가로등 분전함","ACERO-A(ACE-02)","20110512","서울 금천구 독산동 옥계공원 외 2개소","상상어린이공원조성사업","3"
"SGPD-00210","05","2","공공시설물","기능형 가로등 분전함","ACERO-A(ACE-02)","20110405","서울 도봉구 도봉동 청포원 뒷길","","1"
"SGPD-00210","05","2","공공시설물","기능형 가로등 분전함","ACERO-A(ACE-02)","20110324","서울 강동구 천호동 천사 은하수 상상어린이공원 외","","2"
"SGPD-00132","04","2","공공시설물","BHL-02","BHL-02","20140116","서울 종로구 통의동","디자인휀스조달구매","17"
"SGPD-00136","04","2","공공시설물","DKM-00301","DKM-00301","20120503","서울특별시 관악구","서울대입구역 교차로 횡단보도 설치공사","48"
"SGPD-00136","04","2","공공시설물","DKM-00301","DKM-00301","20110831","서울특별시 강남구","2011년 어린이-연화어린이집 외 6개소-보호구역 개선사업-디자인형울타리 구매-교통정책과-12142","27"
"SGPD-00136","04","2","공공시설물","DKM-00301","DKM-00301","20110726","서울특별시 종로구","창의문길외 1개소 보도정비 디자인형울타리 구매-도로과-","80"
"SGPD-00136","04","2","공공시설물","DKM-00301","DKM-00301","20101202","서울특별시 구로구","관급자재구매/구로전철역앞 보도육교 철거공사/도로과","17"
"SGPD-00136","04","2","공공시설물","DKM-00301","DKM-00301","20100805","서울특별시 서대문구","디자인형 울타리 구매/도로정비양화로/토목과","31"
"SGPD-00136","04","2","공공시설물","DKM-00301","DKM-00301","20110905","서울특별시 관악구","2011년 어린이보호구역 개선공사 관급자재","42"
"SGPD-00136","04","2","공공시설물","DKM-00301","DKM-00301","20110629","서울특별시 구로구","관급자재/디자인형울타리/도로시설물보수공사","32"
"SGPD-00136","04","2","공공시설물","DKM-00301","DKM-00301","20101115","서울특별시 서대문구","디자인형 울타리 구매 - 백련사외 2개소 설치","18"
"SGPD-00136","04","2","공공시설물","DKM-00301","DKM-00301","20101115","서울특별시 종로구","창의문길외 1개소 보도정비 디자인형울타리 구매-도로과-","18"
"SGPD-00136","04","2","공공시설물","DKM-00301","DKM-00301","20110502","서울특별시 서대문구","동교동삼거리 린나이빌딩 옆 디자인형울타리 구매 - 2011 관내 도로시설물 유지보수공사 연간단가","11"
"SGPD-00136","04","2","공공시설물","DKM-00301","DKM-00301","20100820","서울특별시 노원구","2010년 노인보호구역 개선공사 디자인형울타리-교통지도과","44"
"SGPD-00136","04","2","공공시설물","DKM-00301","DKM-00301","20110927","서울특별시 종로구","창의문길외 1개소 보도정비 디자인형울타리 구매-도로과-","12"
"SGPD-00136","04","2","공공시설물","DKM-00301","DKM-00301","20110826","서울특별시 서대문구","동교동삼거리 외 1개소 방호울타리 구매 - 2011년 관내도로시설물 유지보수공사","6"
"SGPD-00136","04","2","공공시설물","DKM-00301","DKM-00301","20110425","서울특별시 구로구","관급자재/디자인형울타리/2011년 도로시설물 보수공사/도로과","13"
"SGPD-00136","04","2","공공시설물","DKM-00301","DKM-00301","20110907","서울특별시 강동구","관급자재 : 디자인울타리 구매 - 어린이보호구역 개선공사","27"
"SGPD-00136","04","2","공공시설물","DKM-00301","DKM-00301","20101220","서울특별시 성북구","디자인형울타리-북악산길수로 및 측구정비공사","67"
"SGPD-00136","04","2","공공시설물","DKM-00301","DKM-00301","20111104","서울특별시 금천구","관급자재 디자인휀스 구매","31"
"SGPD-00136","04","2","공공시설물","DKM-00301","DKM-00301","20111026","서울특별시 도봉구","관급자재 조달구매 - 디자인형울타리","54"
"SGPD-00136","04","2","공공시설물","DKM-00301","DKM-00301","20110525","서울특별시 종로구","창의문길외 1개소 보도정비 디자인형울타리 구매-도로과-","40"
"SGPD-00136","04","2","공공시설물","DKM-00301","DKM-00301","20101220","서울특별시 서대문구","디자인형 울타리 구매 - 세검정길 현대 싱그런아파트앞","19"
"SGPD-00136","04","2","공공시설물","DKM-00301","DKM-00301","20101207","서울특별시 동대문구","왕산로 디자인 서울거리 조성공사 2차 관급자재 구매 ","140"
"SGPD-00136","04","2","공공시설물","DKM-00301","DKM-00301","20101115","서울특별시 동대문구","왕산로 디자인 서울거리 조성공사 2차 관급자재 구매 - 도디","123"
"SGPD-00138","04","2","공공시설물","DHP610 DHN308","DHP610 DHN308","20100722","올림픽대로","저용량광원교체공사가로등기구","1002"
"SGPD-00138","04","2","공공시설물","DHP610 DHN308","DHP610 DHN308","20110515","테헤란로","테헤란로개량공사용","283"
"SGPD-00138","04","2","공공시설물","DHP610 DHN308","DHP610 DHN308","20110520","동일로","동일로가로등 개량공사용","53"
"SGPD-000A1","01","2","공공시설물","YB-804","YB-804","20130702","서울 서초구 서초2동 1336 (우성 1차 아파트 놀이터)","공동주택지원사업 어린이놀이 보수(서초권) 관급자재 구매 - 파고라및의자","3"
"SGPD-000A1","01","2","공공시설물","YB-804","YB-804","20130821","서울 용산구 이태원동 34-87 (종합 행정타운내)","종합행정타운 옥외용 벤치구매-총무과","4"
"SGPD-000A1","01","2","공공시설물","YB-804","YB-804","20130716","서울 서초구 방배동 2525","공동주택지원사업어린이놀이보수(방배권2)관급자재구매-옥외용벤치(평의자)","8"
"SGPD-000A1","01","2","공공시설물","YB-804","YB-804","20130530","서울 성동구 용답동 (도로변)","'공원녹지과-3453.김현곤.의자.전농천 녹지대 정비사업","6"
"SGPD-00008","01","2","공공시설물","Frigg(SP-2)","Frigg(SP-2)","20091231","서울 노원구 공릉동","보안등 및 분전반 구매","34"
"SGPD-00008","01","2","공공시설물","Frigg(SP-2)","Frigg(SP-2)","20100514","서울 강남구 개포동","언주로 친환경 고효율 광원교체공사","109"
"SGPD-00008","01","2","공공시설물","Frigg(SP-2)","Frigg(SP-2)","20100430","서울 마포구 성산동","가로등 유지보수공사","51"
"SGPD-00008","01","2","공공시설물","Frigg(SP-2)","Frigg(SP-2)","20091025","서울 송파구 잠실3동","석촌호수길 도로조명 개선공사","43"
"SGPD-00008","01","2","공공시설물","Frigg(SP-2)","Frigg(SP-2)","20091025","서울 송파구 잠실3동","삼학사길 도로조명 개선공사","20"
"SGPD-000B1","01","2","공공시설물","YB-803","YB-803","20130723","서울 송파구 방이동 88-17  (몽촌 토성역 1번출구 근방)","2013년 가로수 생육환경 개선사업","9"
"SGPD-000B1","01","2","공공시설물","YB-803","YB-803","20130215","서울 송파구 방이동 88-20","'가로변 의자설치 사업","28"
"SGPD-000B1","01","2","공공시설물","YB-803","YB-803","20130530","서울 성동구 용답동 29 (도로변)","공원녹지과-3453.김현곤.의자.전농천 녹지대 정비사업","3"
"SGPD-000B1","01","2","공공시설물","YB-803","YB-803","20130408","서울 마포구 성산동 390-1","관급자재 옥외용벤치 구매","9"
"SGPD-000B1","01","2","공공시설물","YB-803","YB-803","20130702","서울 서초구 서초2동 (우성 1차 아파트)","공동주택지원사업 어린이놀이 보수(서초권) 관급자재 구매 - 파고라및의자","7"
"SGPD-00933","21","2","공공시설물","YB-504","YB-504","20130125","서울 도봉구 도봉동 427-113","무수골 공공시설설치 조성공사 3차구간 관급자재-옥외용벤치 조달구매","3"
"SGPD-00933","21","2","공공시설물","YB-504","YB-504","20120629","서울 마포구 상암동 1582-1","'DMC외국인학교 건립공사 - 조형파고라외 3개 구매 - 공공사업부","33"
"SGPD-00933","21","2","공공시설물","YB-504","YB-504","20130920","서울 영등포구 당산동6가 당산중학교 후문","당산동 지정보호수 쉼터조성 공사/육각정자 등 11종","4"
"SGPD-00933","21","2","공공시설물","YB-504","YB-504","20130216","서울 용산구 한남동 한남외국인아파트","가로변녹지량확충-의자설치-사업 등의자 조달구매","3"
"SGPD-00031","18","2","공공시설물","GR-095","GR-095","20171214","서울 은평구 불광로 169 ","디자인형울타리","10"
"SGPD-00031","18","2","공공시설물","GR-095","GR-095","20110915","서울 노원구 공릉동 711","2011년 도로시설물 보수공사 디자인형울타리 구매","68"
"SGPD-00031","18","2","공공시설물","GR-095","GR-095","20120110","서울 성북구 보문동1가 204-20","디자인휀스-2011하천유지관리공사","114"
"SGPD-00031","18","2","공공시설물","GR-095","GR-095","20130119","서울 성동구 금호동4가","디자인형 울타리 구매","70"
"SGPD-00031","18","2","공공시설물","GR-095","GR-095","20111026","서울 강남구 대치동 975-20","세영아파트 이면도로 도로보행자 방호울타리구매","62"
"SGPD-00031","18","2","공공시설물","GR-095","GR-095","20111230","서울 성북구 보문동3가 228","보행자 방호울타리 교통시설물 설치 및 정비","150"
"SGPD-00032","02","2","공공시설물","GP-056-01","GP-056-01","20130630","서울 종로구 종로2가 38-1","디자인형울타리 조달구매 ","448"
"SGPD-00034","05","2","공공시설물","디자인아이엠유맨홀","디자인아이엠유맨홀","20101126","동대문 신설동역~용두동사거리 일대 보도설치","왕산로 디자인서울거리 조성공사","189"
"SGPD-00034","05","2","공공시설물","디자인아이엠유맨홀","디자인아이엠유맨홀","20101230","용산구 삼각지역~숙대입구역 일대 보도설치","한강로 서울거리 르네상스 조성공사","87"
"SGPD-00034","05","2","공공시설물","디자인아이엠유맨홀","디자인아이엠유맨홀","20091030","광진구 군자역~아차산역삼거리 일대 보도설치","건강테마 보행벨트 조성공사","117"
"SGPD-00034","05","2","공공시설물","디자인아이엠유맨홀","디자인아이엠유맨홀","20121028","강북구 도봉세무서~미아역 일대 보도설치","2012년 포장도로 굴착복구공사(도봉세무서~미아역)","224"
"SGPD-00034","05","2","공공시설물","디자인아이엠유맨홀","디자인아이엠유맨홀","20090930","종로구 안국역사거리 일대 보도설치","고궁로 보도정비공사","135"
"SGPD-00034","05","2","공공시설물","디자인아이엠유맨홀","디자인아이엠유맨홀","20101022","종로구 삼청동카페골목 일대 보도설치","삼청동 디자인서울거리 조성공사","105"
"SGPD-00034","05","2","공공시설물","디자인아이엠유맨홀","디자인아이엠유맨홀","20100705","서초구 서래마을 까페거리 일대 보도설치","서래마을 글로벌빌리지 특화거리","83"
"SGPD-00034","05","2","공공시설물","디자인아이엠유맨홀","디자인아이엠유맨홀","20130515","성둥구 뚝섬역 4번출구방향(아차산로) 일대 보도설치","서울숲일대 장애물 없는 대중교통 이용환경","54"
"SGPD-00034","05","2","공공시설물","디자인아이엠유맨홀","디자인아이엠유맨홀","20101025","중랑구 망우사거리~우림시장오거리 일대 보도설치","면목동길 르네상스 조성공사","205"
"SGPD-00034","05","2","공공시설물","디자인아이엠유맨홀","디자인아이엠유맨홀","20101008","마포구 홍익대입구역사거리~홍익대앞(홍익로) 일대 보도설치","서교로 디자인 서울거리조성공사","104"
"SGPD-00034","05","2","공공시설물","디자인아이엠유맨홀","디자인아이엠유맨홀","20101103","동작구 사당역~총신대입구역 일대 보도설치","동작대로 르네상스 조성사업","80"
"SGPD-00034","05","2","공공시설물","디자인아이엠유맨홀","디자인아이엠유맨홀","20090930","종로구 광화문역 광화문광장 일대 보도설치","광화문광장 조성공사","171"
"SGPD-00048","03","2","공공시설물","CIP-370","CIP-370","20100413","경기 수원시 영통구 망포동 66-1번지","퍼걸러 관급자재 구입","1"
"SGPD-00009","01","2","공공시설물","Strass e(SP-1)","Strass e(SP-1)","20110330","서울 영등포구 여의도동","국회주차장 조명시설공사","14"
"SGPD-00009","01","2","공공시설물","Strass e(SP-1)","Strass e(SP-1)","20091230","서울 강동구 천호동","한강공원 자전거도로 산책로 분리조성 전기공사","1181"
"SGPD-00027","18","2","공공시설물","GR-096","GR-096","20180828","구의강변로 84","볼라드 디자인형 울타리 구매","3"
"SGPD-00027","18","2","공공시설물","GR-096","GR-096","20111231","서울 은평구 진관동 28","통일-의주로 2단계 중앙버스전용차로 설치공사 방호울타리 구매","1300"
"SGPD-00105","04","2","공공시설물","WD-BL002","WD-BL002","20120530","서울 구로구 천왕동","천왕지구 공원조성","49"
"SGPD-00193","05","2","공공시설물","보안등","SIRIUS-555","20111010","서울 구로구 천왕동","SH공사 천왕1지구 도시개발사업","122"
"SGPD-00199","05","2","공공시설물","철재가로등주","HK-309","20110410","서울 도봉구 도봉동 4","도로개설 가로등신설공사 관급","9"
"SGPD-00208","05","2","공공시설물","단문형 가로등 분전함","NANUMI (NNM-02)","20110408","서울 강북구 삼각산동 삼각산중학교 산책로","","1"
"SGPD-00182","20","2","공공시설물","교량용 난간","MF-A212","20141212","전라북도 군산시 청소년회관로 75 군산청소년수련관 앞","월명공원 진입부 경관디자인 개선사업","116"
"SGPD-00182","20","2","공공시설물","교량용 난간","MF-A212","20130815","서울 구로구 신도림동 330-7 도림교","도림교 확장공사 중 보도용 난간 제작 납품","165"
"SGPD-00182","20","2","공공시설물","교량용 난간","MF-A212","20121029","서울 서초구 우면동 398-3","서울서초보금자리 주택지구 조성공사 중 교량보도난간 제작 납품","122"
"SGPD-00182","20","2","공공시설물","교량용 난간","MF-A212","20121123","서울 강남구 세곡동 세곡1교","서울강남보금자리 주택지구 조성공사 중 교량보도난간 제작 납품","182"
"SGPD-00182","20","2","공공시설물","교량용 난간","MF-A212","20111205","서울 강서구 가양동 439-1","한강전망수변데크난간 제작 납품","70"
"SGPD-00212","05","2","공공시설물","수목보호덮개(DNG-100)","DNG-100","20130510","서울 성북구 석관동 349-8 돌곶이역 7번출구앞","이문로 레인가든 조성사업","117"
"SGPD-00191","05","2","공공시설물","LED 보안등","SLD-PL-PN2-70","20101230","전북 전주시 완산구 평화동1가","","1"
"SGPD-00191","05","2","공공시설물","LED 보안등","SLD-PL-PN2-70","20101230","경북 영천시 문내동 152-1","","1"
"SGPD-00156","05","2","공공시설물","등벤치","HBE-B1525","20110719","서울 서대문구 서대문우체국사서함","서대문 독립공원 조경공사","7"
"SGPD-00192","05","2","공공시설물","반달 소형","BPD-001","20100525","서울특별시 강남구 언주로 및 압구정","언주로 및 압구정로 친환경 고효율 광원교체에 따른 관급자재-보행등기구-구매","344"
"SGPD-00196","05","2","공공시설물","보안등 (공원등)_ Unicorn 유니콘형","ACP-AL759","20121129","서울 서초구 우면동 336번지 외 (서초보금자리지구내 공원)","서울서초보금자리지구 공원등공사 지금자재 구매","94"
"SGPD-00196","05","2","공공시설물","보안등 (공원등)_ Unicorn 유니콘형","ACP-AL759","20110125","경기 용인시 수지구 풍덕천동","하천 전기시설물 유지보수 공사 연간단가","11"
"SGPD-00196","05","2","공공시설물","보안등 (공원등)_ Unicorn 유니콘형","ACP-AL759","20111027","서울 종로구 옥인동","옥인 시범아파트 녹지조성 및 수성동계곡 복원사업","29"
"SGPD-00196","05","2","공공시설물","보안등 (공원등)_ Unicorn 유니콘형","ACP-AL759","20110406","서울 서초구 서초동 1376-8","구청사 공원화 조성사업 관급자재구매","3"
"SGPD-00196","05","2","공공시설물","보안등 (공원등)_ Unicorn 유니콘형","ACP-AL759","20111017","서울 광진구 화양동","로데오거리 공원등주 구매","16"
"SGPD-00196","05","2","공공시설물","보안등 (공원등)_ Unicorn 유니콘형","ACP-AL759","20110610","서울 중구 회현동1가 ","남산 공원등 조달구매","5"
"SGPD-00196","05","2","공공시설물","보안등 (공원등)_ Unicorn 유니콘형","ACP-AL759","20110311","서울 영등포구 신길동 41-49","신길역 주변경관사업 전기설비공사","5"
"SGPD-00196","05","2","공공시설물","보안등 (공원등)_ Unicorn 유니콘형","ACP-AL759","20110318","서울 서초구 양재동 23번지","공원등-구청사 공원화 조성사업","2"
"SGPD-00190","05","2","공공시설물","몰드프레임 방음벽","SLM-MNB-01","20111215","서울 송파구 풍납동 풍납중학교방음벽설치_","풍납중학교방음벽설치","88"
"SGPD-00190","05","2","공공시설물","몰드프레임 방음벽","SLM-MNB-01","20111123","서울 강서구 방화2동 851","개롸동길 방화11단지앞 방음벽 설치공사","124"
"SGPD-00190","05","2","공공시설물","몰드프레임 방음벽","SLM-MNB-01","20120630","서울 강서구 화곡동 화곡터널","화곡터널 방음벽설치공사","280"
"SGPD-00190","05","2","공공시설물","몰드프레임 방음벽","SLM-MNB-01","20121031","서울 송파구 풍납동 388-6","송파세무서 방음벽 설치공사","100"
"SGPD-00206","05","2","공공시설물","IR(이르)","IR-01","20130531","서울 마포구 연남동 휴먼타운(주민센터 부근)","연남동 휴먼타운 조성사업","14"
"SGPD-00205","05","2","공공시설물","IR(이르)","IR-02","20130531","서울 마포구 연남동 휴먼타운 (주민센터 부근)","연남동 휴먼타운 조성사업","19"
"SGPD-00205","05","2","공공시설물","IR(이르)","IR-02","20100927","서울 강남구 삼성동  아셈로","","45"
"SGPD-00159","18","2","공공시설물","BL","BL-01","20120831","서울특별시 중구 세종대로110 서울특별시 신청사 휴게공간","서울특별시 신청사 증축공사","12"
"SGPD-00278","18","2","공공시설물","자전거 도로용 휀스","DAUS-RA-036","20130612","서울시 구로구 안양천 개천도로 밑","안양천 보행자 전용도로","104"
"SGPD-00278","18","2","공공시설물","자전거 도로용 휀스","DAUS-RA-036","20140131","서울 양천구 신정동 871-20(오금교인근)","신도림 빗물펌프장 주변 토출구 보행로 설치","60"
"SGPD-00278","18","2","공공시설물","자전거 도로용 휀스","DAUS-RA-036","20111230","서울 강동구 강일동","강일2지구 택지개발현장 광명초등학교 휀스","1068"
"SGPD-00194","05","2","공공시설물","lotus(로투스)","lotus-01","20130718","서울 중구 태평로1가 서울시청 신청사 부근","서울시청 녹지대 보안등 설치전기공사-추가공사","2"
"SGPD-00194","05","2","공공시설물","lotus(로투스)","lotus-01","20130910","서울 강남구 세곡동 (강남보금자리 LH 세곡 푸르지오 내)","강남보금자리","92"
"SGPD-00181","20","2","공공시설물","교량용 난간","MF-A211","20130604","서울 서초구 서초동 1451-89","예술의 전당 난간 제작 납품","9"
"SGPD-00181","20","2","공공시설물","교량용 난간","MF-A211","20121031","서울 서초구 우면동 331","우면지구 보도용난간 제작 납품","260"
"SGPD-00181","20","2","공공시설물","교량용 난간","MF-A211","20121031","서울 서초구 우면동 292-1","우면지구 보도용난간 제작 납품","545"
"SGPD-00253","06","2","공공시설물","수목보호덮개(DNG-120)","DNG-120","20120705","서울 동작구 노량진동","노량진역 광장 휴게공간 조성사업","6"
"SGPD-00331","06","2","공공시설물","SW안전방호책","SW-J11","20120630","서울 용산구 한남동","한남대교 중앙분리대","48"
"SGPD-00294","20","2","공공시설물","Design Fence","CRF-01","20121031","서울 성북구 안암동5가","어린이보호구역개선사업","154"
"SGPD-00330","06","2","공공시설물","SW안전방호책","SW-K03","20120731","서울 마포구 상암동","가드레일구매 - 성산대교","306"
"SGPD-00330","06","2","공공시설물","SW안전방호책","SW-K03","20120514","서울 금천구 시흥동","건축물식공영주차장","285"
"SGPD-00312","06","2","공공시설물","보행자용휀스","DAUS-RA-034a-1","20160430","서울시 도봉구 창동 21-1","동부간선도로 확장공사(2공구) 중 가드휀스 설치공사","106"
"SGPD-00275","06","2","공공시설물","Bicycle road fence","BRF-12","20130411","서울 서초구 서초동 우면산 방면","디자인형울타리난간-우면천수해복구공사","75"
"SGPD-00273","20","2","공공시설물","Bicycle road fence","BRF-07","20121030","서울 서대문구 북가좌동 불관천 주변","관급자재 구매-관내도로시설물 보수공사","360"
"SGPD-00281","06","2","공공시설물","자전거보관대","NEO-S140","20130724","서울 양천구 신정1동","자전거 시범학교","199"
"SGPD-00281","06","2","공공시설물","자전거보관대","NEO-S140","20130925","서울 양천구 신정1동","자전거 시범학교","12"
"SGPD-00281","06","2","공공시설물","자전거보관대","NEO-S140","20130913","서울 동대문구 용두동","자전거 거치대 공사","1"
"SGPD-00264","06","2","공공시설물","볼라드","SYBD-106","20130429","서울 금천구","관급자재 조달구매","90"
"SGPD-00264","06","2","공공시설물","볼라드","SYBD-106","20120830","서울 금천구 독산동","보행안전시설물 유지보수공사","10"
"SGPD-00264","06","2","공공시설물","볼라드","SYBD-106","20121203","서울 용산구","2012관내도로시설물 유지보수공사 연간단가","100"
"SGPD-00264","06","2","공공시설물","볼라드","SYBD-106","20120210","서울 금천구","볼라드 구매","6"
"SGPD-00264","06","2","공공시설물","볼라드","SYBD-106","20130411","서울 동대문구","차량진입 금지봉구매","60"
"SGPD-00264","06","2","공공시설물","볼라드","SYBD-106","20120425","서울 노원구","어린이보호구역 시설물 유지보수 볼라드구매","8"
"SGPD-00264","06","2","공공시설물","볼라드","SYBD-106","20120406","서울 동대문구","차량진입금지봉","40"
"SGPD-00264","06","2","공공시설물","볼라드","SYBD-106","20120731","서울 성북구","교통시설물 설치 및 정비","50"
"SGPD-00264","06","2","공공시설물","볼라드","SYBD-106","20120426","서울 금천구","관급자재 조달구매","20"
"SGPD-00264","06","2","공공시설물","볼라드","SYBD-106","20120221","서울 성북구","교통시설물 설치 및 정비","50"
"SGPD-00329","06","2","공공시설물","Guard rail (open type)","GR-O-01","20130211","서울 금천구 시흥동","긍하로 노측 가드레일 설치공사","127"
"SGPD-00321","18","2","공공시설물","이노휀스 (Inno-Fence)","WRF-S-201","20161206","경기도 남양주시 금곡동 154-36 (금곡삼거리)","남양주시 금곡동 금곡삼거리 교통개선공사","24"
"SGPD-00321","18","2","공공시설물","이노휀스 (Inno-Fence)","WRF-S-201","20160912","경북 영주시 기흥동 1620","경북 영주시 기흥동 아파트휀스 설치","36"
"SGPD-00321","18","2","공공시설물","이노휀스 (Inno-Fence)","WRF-S-201","20150620","경기 고양시 일산서구 대화동 2210 장성초등학교","일산 장성초 휀스설치공사","8"
"SGPD-00321","18","2","공공시설물","이노휀스 (Inno-Fence)","WRF-S-201","20130102","서울 강남구","보행자 방호 울타리설치공사","52"
"SGPD-00321","18","2","공공시설물","이노휀스 (Inno-Fence)","WRF-S-201","20131113","서울 관악구 서림동 117","보그니마을 환경개선공사","88"
"SGPD-00321","18","2","공공시설물","이노휀스 (Inno-Fence)","WRF-S-201","20131030","서울 중랑구 망우동","상봉동 코스트코주변","81"
"SGPD-00224","06","2","공공시설물","등벤치","HBE-B1501","20120803","충남 예산군 예산읍","삼학공원 조경시설물 설치공사","10"
"SGPD-00224","06","2","공공시설물","등벤치","HBE-B1501","20120630","인천 중구 중산동","영종도 우미린 아파트 조경시설물 공사","29"
"SGPD-00224","06","2","공공시설물","등벤치","HBE-B1501","20120630","경기 구리시 구리우체국사서함","남양주 별내 우미린 아파트 조경시설물 공사","24"
"SGPD-00224","06","2","공공시설물","등벤치","HBE-B1501","20120630","인천 중구 중산동","영종도 우미린 아파트 조경시설물 공사","40"
"SGPD-00224","06","2","공공시설물","등벤치","HBE-B1501","20111115","서울 송파구 송파동","송파반도 래미안 아파트 조경시설물공사","4"
"SGPD-00300","06","2","공공시설물","그린 보행자 보호펜스","DK-1008","20120625","서울특별시 송파구","관내하천시설물정비공사-연간단가","177"
"SGPD-00300","06","2","공공시설물","그린 보행자 보호펜스","DK-1008","20110816","서울특별시 구로구","관급자재/디자인형울타리/2011년 도로시설물 보수공사-연간단가","14"
"SGPD-00300","06","2","공공시설물","그린 보행자 보호펜스","DK-1008","20121031","서울특별시 노원구","어린이보호구역 시설물유지보수 자재 구매","23"
"SGPD-00223","06","2","공공시설물","등벤치","HBE-E1512","20111122","서울 동작구 신대방동","남부수도사업소 시설물 설치공사","9"
"SGPD-00223","06","2","공공시설물","등벤치","HBE-E1512","20111128","서울 은평구 구산동","서부장애인복지관 시설물 설치공사","6"
"SGPD-00223","06","2","공공시설물","등벤치","HBE-E1512","20120615","서울 강동구 암사동","광나루 축구장 시설물 설치공사","12"
"SGPD-00223","06","2","공공시설물","등벤치","HBE-E1512","20120120","서울 강북구 미아동","미아 버스정류장 시설물 설치공사","4"
"SGPD-00243","06","2","공공시설물","파고라","HPE-B1226","20120930","서울 동작구 상도동","상도동 소공원","2"
"SGPD-00260","06","2","공공시설물","볼라드","JW-289","20130906","서울 서초구 방배동 504-1 (까리따스방배종합사회복지관입구)","볼라드-2013 관내간선도로굴착복구공사","12"
"SGPD-00325","18","2","공공시설물","철재가로등주 일체형","ENLP-SP테파-401-100 ENLA-SP암-903ENLS-301","20120731","서울 강남구 세곡동","서울 강남보금자리지구 전기공사","243"
"SGPD-00325","18","2","공공시설물","철재가로등주 일체형","ENLP-SP테파-401-100 ENLA-SP암-903ENLS-301","20120531","서울 영등포구 대림동","가로등기구외 4종구매","16"
"SGPD-00222","06","2","공공시설물","평벤치","CHB 4004","20101127","서울 강서구 공항동","활주로상상어린이공원","4"
"SGPD-00222","06","2","공공시설물","평벤치","CHB 4004","20110909","경기 성남시 중원구 상대원1동","상대원1동 등산로 조경시설물 공사","2"
"SGPD-00341","06","2","공공시설물","충격흡수몰드 방음벽","SLM-MNB-02","20121119","서울 서초구 잠원동6-1번지","고속국도1호 잠원동 6-1번지 외 1개소 방음벽 설치 및 정비공사","70"
"SGPD-00333","06","2","공공시설물","차량용안전난간","SHB-01","20110930","서울 관악구 신림동  도림교","교량난간-차량방호울타리 구매 - 관악도림교","234"
"SGPD-00333","06","2","공공시설물","차량용안전난간","SHB-01","20111031","서울 서초구 양재동 영동2교","관급자재-방호울타리 구매-영동2교","326"
"SGPD-00333","06","2","공공시설물","차량용안전난간","SHB-01","20131110","서울 도봉구 도봉동","관급자재 구매(도봉교 보도정비공사)","60"
"SGPD-00333","06","2","공공시설물","차량용안전난간","SHB-01","20130820","서울특별시 성북구 길음로 142","교량난간-길음중학교신축부지내도로이설공사","32"
"SGPD-00270","06","2","공공시설물","U-PL","U-PL-02","20130116","서울 양천구 신정1동 1038-19 호성약국 맞은편","방범CCTV성능개선사업","14"
"SGPD-00305","06","2","공공시설물","보호펜스","HY-SJ1","20111125","천호초등학교주변","어린이보호구역","140"
"SGPD-00305","06","2","공공시설물","보호펜스","HY-SJ1","20120808","천동초등학교 주변","2012년 도로시설물유지보수공사","14"
"SGPD-00305","06","2","공공시설물","보호펜스","HY-SJ1","20120727","천일초등학교 주변","천호동 55-217간 도로개성공사3차","300"
"SGPD-00305","06","2","공공시설물","보호펜스","HY-SJ1","20120522","한려대학교 입구","한려대학교 진입도로 잔여구간 개설공사2차분 난간구입","104"
"SGPD-00303","06","2","공공시설물","디자인 펜스","NEO-FS307","20120816","서울 노원구 중계동","관급자재조달구매","48"
"SGPD-00314","06","2","공공시설물","디자인펜스","F-201","20130808","서울특별시 서초구 반포동 128-11  서울성모병원사거리","디자인형울타리 2012년 교통사고 잦은 곳 개선사업","32"
"SGPD-00238","06","2","공공시설물","옥외용 벤치","ST-501","20130515","서울 성북구 성북동 227-6 (만해한용운 심우장-올라가는 나무계단 옆)","옥외용벤치 외 1종 - 걷기좋은거리조성사업","3"
"SGPD-00244","06","2","공공시설물","파고라","SIP-203","20160408","화성시 동탄신도시 내 롯데인력개발원 근처","동탄(2)3-2공구 조경공사","2"
"SGPD-00244","06","2","공공시설물","파고라","SIP-203","20151217","경기도 의왕시 모락로 134","도시숲 조성공사","2"
"SGPD-00240","06","2","공공시설물","평벤치","SIB-114","20110919","서울 노원구 중계동 삿갓봉 근린공원 내 ","근린공원 정비공사","2"
"SGPD-00240","06","2","공공시설물","평벤치","SIB-114","20121221","서울 종로구 구기동 58-4","마을버스정류소 벤치 설치","2"
"SGPD-00240","06","2","공공시설물","평벤치","SIB-114","20111215","대구 달성군 다사읍","대구 죽곡2지구 시설물 설치공사","6"
"SGPD-00240","06","2","공공시설물","평벤치","SIB-114","20111206","서울 종로구 숭인동 종로종합사회복지관 앞 ","종로사회복지관 장애인 무료 셔틀버스 승차대 설치공사","2"
"SGPD-00276","06","2","공공시설물","자전거도로용안전난간","SHF-210B","20130630","서울 노원구 중계동 509-2","서울시 노원구 중계동 홈플러스 난간설치공사","269"
"SGPD-00276","06","2","공공시설물","자전거도로용안전난간","SHF-210B","20130524","서울 강동구 회전교차로","안전휀스 구매(2012년 회전교차로 설치공사)","40"
"SGPD-00316","06","2","공공시설물","디자인펜스","JSF-316","20160421","'서울 강남구 영동대로 735","방호울타리 구매","170"
"SGPD-00316","06","2","공공시설물","디자인펜스","JSF-316","20131218","송파구 방이동 126-5","'교통사고 잦은곳등 도로교통소통개선공사","100"
"SGPD-00316","06","2","공공시설물","디자인펜스","JSF-316","20161226","서울 관악구 낙성대로3길 37","216년 도로교통소통개선사업 관급자재 추가구매-디자인형울타리 ","48"
"SGPD-00316","06","2","공공시설물","디자인펜스","JSF-316","20160920","서울시 성북구 석관동 77-9","디자인형울타리-교통시설 환경개선","6"
"SGPD-00316","06","2","공공시설물","디자인펜스","JSF-316","20160419","'서울 성동구 마장로40길 10","'토목과-3690최우람디자인형울타리(2016.이면도로포장및정비공사)","12"
"SGPD-00316","06","2","공공시설물","디자인펜스","JSF-316","20141012","서울 송파구 장지동 841-2","'관내 도로시설물 유지보수공사","53"
"SGPD-00316","06","2","공공시설물","디자인펜스","JSF-316","20160905","서울 중구 퇴계로8길101","관급자재 구매(도로시설물 유지보수공사)","75"
"SGPD-00316","06","2","공공시설물","디자인펜스","JSF-316","20120605","동대문구 용신동 햇살어린이집 앞","디자인 울타리 설치 공사","230"
"SGPD-00316","06","2","공공시설물","디자인펜스","JSF-316","20120416","서울시 관악구 구암초등학교 앞","어린이보호구역 교통시설물 정비 관급자재 구매","50"
"SGPD-00335","06","2","공공시설물","차량용 방호울타리(SB4)","NRB-201P(SB4)","20130831","서울 서초구 양재동 염곡지하차도 상부 U-Type 구간","양재 현대차사옥 앞 염곡사거리 지하차도 안전난간 설치공사","440"
"SGPD-00319","06","2","공공시설물","디자인펜스","JSF-157","20160406","서울 도봉구 방학동 391-2 ","관급자재 구매(2016년 하천시설물 유지보수공사 디자인형울타리) ","45"
"SGPD-00319","06","2","공공시설물","디자인펜스","JSF-157","20161205","범서농어촌도로101호 ","'범서농어촌도로101호(곡망선)확포장공사 난간","198"
"SGPD-00319","06","2","공공시설물","디자인펜스","JSF-157","20160705"," 동대문구 장안벚꽃로 279","관급자재구매(2016년 도로시설물 보수공사)-도로과-7680-서정길 ","58"
"SGPD-00319","06","2","공공시설물","디자인펜스","JSF-157","20170608","서울 중랑구 면목동 1516","2017년 도로시설물 유지보수공사-디자인형 울타기 구매 1","30"
"SGPD-00319","06","2","공공시설물","디자인펜스","JSF-157","20170419","  서울 성동구 마장로 262","디자인형울타리 구매(2017년 도로부속시설물유지)","320"
"SGPD-00319","06","2","공공시설물","디자인펜스","JSF-157","20170509","서울 성북구 정릉동 109-115","디자인형울타리 구매-2017년 도로시설물 유지보수공사","558"
"SGPD-00319","06","2","공공시설물","디자인펜스","JSF-157","20170316","서울 강남구 학동사거리 부근","도로관리과-3190 (디자인울타리)-학동사거리 교차로 외1개소 가드휀스","447"
"SGPD-00319","06","2","공공시설물","디자인펜스","JSF-157","20170421","성동구 용답역 부근","디자인형울타리구매(하천시설물 및 체육편의시설 유)","30"
"SGPD-00319","06","2","공공시설물","디자인펜스","JSF-157","20161101","성북구 성북 어린이집 부근","교통안전시설구매-2016년 어린이 교통안전물 정비사업 2차","205"
"SGPD-00319","06","2","공공시설물","디자인펜스","JSF-157","20170626","서울 중랑구 상봉동 481 ","2017년 도로시설물 유지보수공사-디자인형 울타리 조달 구매","82"
"SGPD-00319","06","2","공공시설물","디자인펜스","JSF-157","20161020","서울 강남구 영동대로 202","디자인울타리 구매[학여울사거리 외4개소 방호울타리 일제정비]","500"
"SGPD-00319","06","2","공공시설물","디자인펜스","JSF-157","20161020","성북구 해뜨는 어린이집 부근","디자인형울타리-2016년 어린이보호구역 교통안전표지 정비공사","12"
"SGPD-00319","06","2","공공시설물","디자인펜스","JSF-157","20160419","서울  성동구 살곶이2나길 32","토목과-3690최우람디자인형울타리(2016.이면도로포장및정비공사)","18"
"SGPD-00319","06","2","공공시설물","디자인펜스","JSF-157","20120627","성동구 사근동 마장2","사근동길 보도단절공사","400"
"SGPD-00326","19","2","공공시설물","Cityunion (시티유니온) + Ocean (오션)","THP2-902 DN-R101","20130820","서울 서초구 내곡동","헌릉로 가로등 정비공사 중공기초 외 12종","11"
"SGPD-00326","19","2","공공시설물","Cityunion (시티유니온) + Ocean (오션)","THP2-902 DN-R101","20130805","서울 서초구 양재동","강남대로 가로등 정비공사 중공기초 외 11종 관급자재 구매","11"
"SGPD-00326","19","2","공공시설물","Cityunion (시티유니온) + Ocean (오션)","THP2-902 DN-R101","20111129","대구 남구 대명동","국제문화산업지구 철제가로등 외 4종 구입","21"
"SGPD-00326","19","2","공공시설물","Cityunion (시티유니온) + Ocean (오션)","THP2-902 DN-R101","20120629","울산 동구 일산동","울산방어 택지개발사업 전기공사  지급자재 가로등주외 5건","42"
"SGPD-00326","19","2","공공시설물","Cityunion (시티유니온) + Ocean (오션)","THP2-902 DN-R101","20110318","대구 남구 대명3동","국제문화산업지구가로등 개체공사 철제가로등주 외 5종 구입","40"
"SGPD-00326","19","2","공공시설물","Cityunion (시티유니온) + Ocean (오션)","THP2-902 DN-R101","20110407","서울 양천구 신정동","세라믹 메탈램프 외 6종","16"
"SGPD-00326","19","2","공공시설물","Cityunion (시티유니온) + Ocean (오션)","THP2-902 DN-R101","20120614","대구 동구 효목동","철재가로등주 조달구입- 동촌유원지 선비마을 앞도로 가로등 설치공사","10"
"SGPD-00326","19","2","공공시설물","Cityunion (시티유니온) + Ocean (오션)","THP2-902 DN-R101","20110722","제주 제주시 조천읍","함덕 해수욕장 가로등주","8"
"SGPD-00326","19","2","공공시설물","Cityunion (시티유니온) + Ocean (오션)","THP2-902 DN-R101","20111125","서울 영등포구 여의도동","여의도 백화점 앞 가로등 설치공사 관급자재 구매/ 가로등기구외 3종 ","6"
"SGPD-00326","19","2","공공시설물","Cityunion (시티유니온) + Ocean (오션)","THP2-902 DN-R101","20110117","부산 기장군 장안읍","자안산업단지내 지원시설부지 가로등 설치공사","8"
"SGPD-00357","07","2","공공시설물","차량용 방호울타리 (SB4)","KW-E710SB4(P)","20120528","강원 홍천군 서면","클럽 모우골프장 조성공사","235"
"SGPD-00357","07","2","공공시설물","차량용 방호울타리 (SB4)","KW-E710SB4(P)","20120511","경북 의성군 안평면","석탑2도로 선형개량공사","62"
"SGPD-00357","07","2","공공시설물","차량용 방호울타리 (SB4)","KW-E710SB4(P)","20111228","전북 김제시 월성동","학남교 방호책 설치공사","197"
"SGPD-00357","07","2","공공시설물","차량용 방호울타리 (SB4)","KW-E710SB4(P)","20111221","경북 칠곡군 지천면","심지소하천 정비공사","44"
"SGPD-00357","07","2","공공시설물","차량용 방호울타리 (SB4)","KW-E710SB4(P)","20111228","경북 칠곡군 왜관읍","칠곡 아곡 소하천 정비공사","88"
"SGPD-00357","07","2","공공시설물","차량용 방호울타리 (SB4)","KW-E710SB4(P)","20111229","대구 서구 비산동","금암리 직금마을 진입로 확포장공사","97"
"SGPD-00357","07","2","공공시설물","차량용 방호울타리 (SB4)","KW-E710SB4(P)","20111006","경북 포항시 북구 기계면","은천지구 농업용저수지 뚝높이기사업","162"
"SGPD-00357","07","2","공공시설물","차량용 방호울타리 (SB4)","KW-E710SB4(P)","20110812","경북 경산시 남산면","경산시 우금-연하간 도로확포장공사","35"
"SGPD-00357","07","2","공공시설물","차량용 방호울타리 (SB4)","KW-E710SB4(P)","20110527","전북 김제시 월성동","덕적천 재해위험지구","112"
"SGPD-00357","07","2","공공시설물","차량용 방호울타리 (SB4)","KW-E710SB4(P)","20110510","경남 마산시 회원1동","영산강3-1지구(마산2공구)소라교 개설공사","248"
"SGPD-00357","07","2","공공시설물","차량용 방호울타리 (SB4)","KW-E710SB4(P)","20110310","경북 김천시 대항면","직지상가 컨벤션웨딩홀 안전휀스 설치공사","29"
"SGPD-00357","07","2","공공시설물","차량용 방호울타리 (SB4)","KW-E710SB4(P)","20110223","전북 진안군 진안읍","종평교","140"
"SGPD-00357","07","2","공공시설물","차량용 방호울타리 (SB4)","KW-E710SB4(P)","20120612","전북 남원시 운봉읍","국도 24호선 운봉교 통수단면 부족 개선공사","139"
"SGPD-00357","07","2","공공시설물","차량용 방호울타리 (SB4)","KW-E710SB4(P)","20120625","경기 용인시 기흥구 영덕동","기흥동 주민센터 진입로 중3-168호 개설공사","40"
"SGPD-00357","07","2","공공시설물","차량용 방호울타리 (SB4)","KW-E710SB4(P)","20120511","경북 봉화군 석포면","석포역 주변지역 정비사업","73"
"SGPD-00357","07","2","공공시설물","차량용 방호울타리 (SB4)","KW-E710SB4(P)","20120513","경북 안동시 길안면","안동 천지교 보수공사","480"
"SGPD-00357","07","2","공공시설물","차량용 방호울타리 (SB4)","KW-E710SB4(P)","20120420","경북 의성군 금성면","금성도로 확장공사","66"
"SGPD-00357","07","2","공공시설물","차량용 방호울타리 (SB4)","KW-E710SB4(P)","20111115","경기 성남시 분당구 이매동","이매동 안말진입로 도로 연결송사","110"
"SGPD-00357","07","2","공공시설물","차량용 방호울타리 (SB4)","KW-E710SB4(P)","20111012","경남 창원시 봉림동","창원 봉림지구 택지조성공사","123"
"SGPD-00357","07","2","공공시설물","차량용 방호울타리 (SB4)","KW-E710SB4(P)","20110930","경북 영천시 화남면","경북사천교 개체공사","25"
"SGPD-00357","07","2","공공시설물","차량용 방호울타리 (SB4)","KW-E710SB4(P)","20110628","경남 거창군 거창읍","거창군 소교량 보수공사","60"
"SGPD-00357","07","2","공공시설물","차량용 방호울타리 (SB4)","KW-E710SB4(P)","20110617","서울 구로구 신도림동","신도림 다큐브프라자 교량 건설공사","178"
"SGPD-00357","07","2","공공시설물","차량용 방호울타리 (SB4)","KW-E710SB4(P)","20110325","경남 창원시 동읍","중앙지구","92"
"SGPD-00357","07","2","공공시설물","차량용 방호울타리 (SB4)","KW-E710SB4(P)","20110127","전남 영암군 삼호읍","화원-삼포 도로개설공사","243"
"SGPD-00357","07","2","공공시설물","차량용 방호울타리 (SB4)","KW-E710SB4(P)","20120428","경남 마산시 진동면","현동-임곡2 도로공사","85"
"SGPD-00357","07","2","공공시설물","차량용 방호울타리 (SB4)","KW-E710SB4(P)","20111219","충남 예산군 덕산면","신평교 재가설사업 교량공사","124"
"SGPD-00357","07","2","공공시설물","차량용 방호울타리 (SB4)","KW-E710SB4(P)","20110215","경북 안동시 길안면","현곡교 외 2개교 설치공사","72"
"SGPD-00357","07","2","공공시설물","차량용 방호울타리 (SB4)","KW-E710SB4(P)","20111229","제주 서귀포시 표선면","성읍-대천간 2공구 성읍1교 교량방호책 설치공사","79"
"SGPD-00357","07","2","공공시설물","차량용 방호울타리 (SB4)","KW-E710SB4(P)","20110705","경기 안양시 만안구 안양3동","안양예술고가교 보수공사","36"
"SGPD-00357","07","2","공공시설물","차량용 방호울타리 (SB4)","KW-E710SB4(P)","20110121","전북 진안군 진안읍","군상교 건설공사","32"
"SGPD-00366","07","2","공공시설물","펜스(보행자용)","KL-82W","20180820","서울 성동구 옥수동 517번지 인근","관급자재구매 옥수동 517번지 인근","16"
"SGPD-00366","07","2","공공시설물","펜스(보행자용)","KL-82W","20170713","서울 강서구 등촌3동 707-3","안전휀스(강서구민올림픽체육센터 옥상녹화공사)","57"
"SGPD-00366","07","2","공공시설물","펜스(보행자용)","KL-82W","20140911","서울 강서구 화곡동18-5","관내도로시설물 보수공사-안전휀스","80"
"SGPD-00363","07","2","공공시설물","자전거도로용 휀스","DAUS-SS-023","20140310","서울시 도봉구 쌍문동 우이천 덕수교현장","우이천 덕수교 재설치 공사","108"
"SGPD-00360","07","2","공공시설물","3S관절형방호책","3S-AG","20140228","서울 송파구 잠실동","잠실지하차도 가드레일 설치공사","169"
"SGPD-00360","07","2","공공시설물","3S관절형방호책","3S-AG","20131226","강원 양양군 양양읍","강릉국토 양양출장소_양양군 양양읍 송암리 29-2","316"
"SGPD-00360","07","2","공공시설물","3S관절형방호책","3S-AG","20140114","인천 중구 인천공항우체국사서함","인천건설본부-우회고가교 관절형교량방호책 구입","100"
"SGPD-00360","07","2","공공시설물","3S관절형방호책","3S-AG","20130827","강원 정선군 신동읍","국도38호선 신동육교등 3개교-정선국토관리사무소","200"
"SGPD-00360","07","2","공공시설물","3S관절형방호책","3S-AG","20130329","경기 남양주시 별내면","LH공사-남양주 별내지구(뱅이교)","139"
"SGPD-00360","07","2","공공시설물","3S관절형방호책","3S-AG","20130705","전북 무주군 무주읍","남원국토관리사무소-국도1호선 칠리교 등 (무주출장소)","158"
"SGPD-00360","07","2","공공시설물","3S관절형방호책","3S-AG","20131219","전북 김제시 김제우체국사서함","전주국토관리사무소-국도1호선 대화교등 18개교","135"
"SGPD-00360","07","2","공공시설물","3S관절형방호책","3S-AG","20130722","경남 진해시 현동","경상남도개발공사-마산현동 보금자리주택공사(1공구)","78"
"SGPD-00360","07","2","공공시설물","3S관절형방호책","3S-AG","20131223","강원 홍천군 홍천읍","홍천국토 관내 홍천지구 도로시설물 정비공사","220"
"SGPD-00360","07","2","공공시설물","3S관절형방호책","3S-AG","20131010","전북 남원시 신촌동","남원국토관리사무소-국도17호선 신촌교등 2개교","94"
"SGPD-00360","07","2","공공시설물","3S관절형방호책","3S-AG","20110217","김포고속화도로","김포고속화도로가드레일","60"
"SGPD-00360","07","2","공공시설물","3S관절형방호책","3S-AG","20110111","아모레화장품 물류센터진입로","아모레화장품 물류센터진입로","39"
"SGPD-00360","07","2","공공시설물","3S관절형방호책","3S-AG","20110111","진주평거3택지개발사업조성공사","진주평거3택지개발사업조성공사","61"
"SGPD-00360","07","2","공공시설물","3S관절형방호책","3S-AG","20111105","구리시 교통사고다발지역정비사업","교통사고다발지역정비사업","73"
"SGPD-00360","07","2","공공시설물","3S관절형방호책","3S-AG","20111024","금호터널앞 방호책 설치공사","금당터널앞 방호책 설치공사","111"
"SGPD-00360","07","2","공공시설물","3S관절형방호책","3S-AG","20110523","오송산업과학단지 진입로 개설공사","오송산업과학단지 진입로 개설공사","710"
"SGPD-00360","07","2","공공시설물","3S관절형방호책","3S-AG","20110323","연삼로 일원 8호광장 도남사거리","연삼로 일원 8호광장-도남사거리 안전한 보행환경조성공사","137"
"SGPD-00360","07","2","공공시설물","3S관절형방호책","3S-AG","20110806","경인아라뱃길 횡단교량","경인아라뱃길 횡단교량 경관 개선공사","390"
"SGPD-00360","07","2","공공시설물","3S관절형방호책","3S-AG","20110810","도로시설물 정비공사 1구역","도로시설물 정비공사 1구역","100"
"SGPD-00360","07","2","공공시설물","3S관절형방호책","3S-AG","20111109","북항고가교","북항고가교 교량용 난간 정비공사","242"
"SGPD-00360","07","2","공공시설물","3S관절형방호책","3S-AG","20120507","광교택지 4공구","광교택지4공구 가드레일 설치공사","63"
"SGPD-00360","07","2","공공시설물","3S관절형방호책","3S-AG","20110826","구리시 동구릉","교통사고발생지점 개선 공사","102"
"SGPD-00360","07","2","공공시설물","3S관절형방호책","3S-AG","20111017","방이고가차도","방이고가차도 가드레일 설치공사","70"
"SGPD-00360","07","2","공공시설물","3S관절형방호책","3S-AG","20111110","유등천 좌안도로","유등천 좌안도로","124"
"SGPD-00360","07","2","공공시설물","3S관절형방호책","3S-AG","20110811","임계면","임계면(소3-4호)도시계획도로","78"
"SGPD-00360","07","2","공공시설물","3S관절형방호책","3S-AG","20110514","고대산 평화제첨특구","고대산 평화체험특구 진입도로 개설공사","52"
"SGPD-00360","07","2","공공시설물","3S관절형방호책","3S-AG","20110228","동회천간 도로","도련-동회천간 도시계획도로 개설공사 4차분","81"
"SGPD-00360","07","2","공공시설물","3S관절형방호책","3S-AG","20110709","강남 논현로 삼성물산 주변(포이동)","강남 논현로 정비공사","93"
"SGPD-00360","07","2","공공시설물","3S관절형방호책","3S-AG","20110404","교통안전시설물 설치공사","교통안전시설물 설치공사","106"
"SGPD-00360","07","2","공공시설물","3S관절형방호책","3S-AG","20111102","국도77호선 문산대교","국도77호선 문산대교","185"
"SGPD-00360","07","2","공공시설물","3S관절형방호책","3S-AG","20110830","상주지구-강창교","낙동강살리기33공구","375"
"SGPD-00360","07","2","공공시설물","3S관절형방호책","3S-AG","20110425","제주혁신도시","제주혁신도시 도순-혁신도시간","179"
"SGPD-00360","07","2","공공시설물","3S관절형방호책","3S-AG","20110603","국도 6호선 평창 백옥포리","국도 6호선 평창 백옥포리 수해위험지구 개선공사","167"
"SGPD-00360","07","2","공공시설물","3S관절형방호책","3S-AG","20110426","완주군","완주군 등 2개군 안전시설물","50"
"SGPD-00360","07","2","공공시설물","3S관절형방호책","3S-AG","20110808","대평 회전교차로","대평 회전교차로 설치사업","44"
"SGPD-00360","07","2","공공시설물","3S관절형방호책","3S-AG","20111202","소사로동 중앙분리대 설치공사","소사동로 중앙분리대 설치공사","75"
"SGPD-00360","07","2","공공시설물","3S관절형방호책","3S-AG","20120117","백범로 도로안전시설 설치공사","도로안전시설 설치공사","392"
"SGPD-00360","07","2","공공시설물","3S관절형방호책","3S-AG","20110517","광주산업단지","광주산업단지 방호울타리 설치공사","114"
"SGPD-00360","07","2","공공시설물","3S관절형방호책","3S-AG","20110705","국도77호선 송촌대교","국도77호선 송촌대교 가드레일 설치공사","211"
"SGPD-00360","07","2","공공시설물","3S관절형방호책","3S-AG","20110615","군도 주사곡 도로","군도 주사곡 도로 정비사업외 1건","70"
"SGPD-00360","07","2","공공시설물","3S관절형방호책","3S-AG","20110422","목포-장흥간 고속도로","목포-장흥간 고속도로 1공구","318"
"SGPD-00360","07","2","공공시설물","3S관절형방호책","3S-AG","20111223","남부순환로~부천시계간 도로개설공사","남부순환로~부천시계간 도로개설공사","574"
"SGPD-00360","07","2","공공시설물","3S관절형방호책","3S-AG","20111007","서부대로 중앙분리대 설치공사","서부대로 중앙분리대 설치공사","135"
"SGPD-00360","07","2","공공시설물","3S관절형방호책","3S-AG","20111109","자하문터널","자하문터널보수공사","247"
"SGPD-00358","07","2","공공시설물","3S개방형중앙분리대","3S-OC","20130611","경기 양주시 마전동","한국가스공사-암매교차로~장춘교차로중분대설치공사","207"
"SGPD-00358","07","2","공공시설물","3S개방형중앙분리대","3S-OC","20140314","경기 시흥시 정왕동","한국수자원공사-서해안로확장공사시흥시정왕동","617"
"SGPD-00350","07","2","공공시설물","평벤치","SIB-305","20120531","전남 나주시 영산동","영산강살리기 사업 3공구","19"
"SGPD-00350","07","2","공공시설물","평벤치","SIB-305","20111229","전남 나주시 다시면","영산강살리기 사업 4공구","30"
"SGPD-00359","07","2","공공시설물","차량용 방호책","KR-E610 SB4(M)","20111230","대구 북구 북대구우체국사서함","낙동강44공구 노곡교 설치공사","262"
"SGPD-00455","08","2","공공시설물","교량용 펜스","DAUS-RA-071","20130513","서울 은평구 진관동 선림사 입구","은평3지구 폭포동 밥할머니교-선림사간 보행자 보도설치공사","228"
"SGPD-00455","08","2","공공시설물","교량용 펜스","DAUS-RA-071","20121031","경기 평택시 평택동","국가자전거도로구축사업 한신주유소-법원사거리","80"
"SGPD-00456","08","2","공공시설물","교량용 펜스","DAUS-RA-043a","20131130","서울 관악구 신림동 110-10(신림3교)","신림3교 재설치공사","42"
"SGPD-00456","08","2","공공시설물","교량용 펜스","DAUS-RA-043a","20130228","서울 송파구 문정동 420-1(탄천쪽 방향)","탄천문정지구 하천정비공사","76"
"SGPD-00456","08","2","공공시설물","교량용 펜스","DAUS-RA-043a","20131230","도봉구 쌍문동 우이천 덕수교현장","우이천 덕수교 재설치 공사","114"
"SGPD-00456","08","2","공공시설물","교량용 펜스","DAUS-RA-043a","20130909","서울 송파구 풍납동 388-1번지 서울 아산병원 앞","성내천 교량 보수 보강공사","498"
"SGPD-00456","08","2","공공시설물","교량용 펜스","DAUS-RA-043a","20120120","강원 양양군 양양읍","자전거도로설치공사","1211"
"SGPD-00471","08","2","공공시설물","코스틸라 + Cento (센토)","THP2-901 CTO-100","20120705","인천 동구 송현동","수문통 가로공원 조성공사 관급 -철재가로등주외 3종","44"
"SGPD-00471","08","2","공공시설물","코스틸라 + Cento (센토)","THP2-901 CTO-100","20110804","경기 안양시 만안구 박달동","박달동 호현마을 주변 도로개설 전기공사 관급자재 구입","35"
"SGPD-00471","08","2","공공시설물","코스틸라 + Cento (센토)","THP2-901 CTO-100","20111231","경기 안양시 만안구 안양6동","명학역 앞 육교 재설치 전기공사 관급자재","2"
"SGPD-00349","07","2","공공시설물","벤치","RHBE-004","20130220","서울 관악구 봉천동","2012 가로변 녹지량 확충사업 관련 평의자 설치","11"
"SGPD-00371","07","2","공공시설물","Design Fence","CRF-02","20131031","서울 성북구 정릉천","휀스-정릉천 산책로 조성공사","520"
"SGPD-00430","08","2","공공시설물","Simon (시몬) + Ecomoon (에코문)","THP-066010-1 ec-1010","20131002","SH내곡","SH내곡","37"
"SGPD-00430","08","2","공공시설물","Simon (시몬) + Ecomoon (에코문)","THP-066010-1 ec-1010","20121212","경인선 자전거도로","경인선 자전거도로","50"
"SGPD-00430","08","2","공공시설물","Simon (시몬) + Ecomoon (에코문)","THP-066010-1 ec-1010","20130920","양재동 하나로 마트앞","양재동 하나로 마트앞","5"
"SGPD-00457","08","2","공공시설물","관절형중앙분리대","3S-AC","20140310","서울 강남구 서울강남우체국사서함","도시기반시설본부-강남순환도로8공구 구룡지하차도","100"
"SGPD-00457","08","2","공공시설물","관절형중앙분리대","3S-AC","20130630","충남 천안시 동남구 천안우체국사서함","충청남도 천안시-천안대로외1개소 중분대설치공사","181"
"SGPD-00457","08","2","공공시설물","관절형중앙분리대","3S-AC","20130630","서울 강서구 서울강서우체국사서함","강서도로사업소-오목교","145"
"SGPD-00457","08","2","공공시설물","관절형중앙분리대","3S-AC","20140329","경기 남양주시 별내면","LH공사-남양주 별내지구(뱅이교)","139"
"SGPD-00457","08","2","공공시설물","관절형중앙분리대","3S-AC","20131204","경북 포항시 남구 포항우체국사서함","한국도로공사-고속국도65호선 울산~포항간 건설공사","54"
"SGPD-00457","08","2","공공시설물","관절형중앙분리대","3S-AC","20140117","인천 서구 백석동","인천건설본부-백석대교 중앙분리대","20"
"SGPD-00457","08","2","공공시설물","관절형중앙분리대","3S-AC","20131011","서울 강동구 암사동","도시기반시설본부-암사대교","346"
"SGPD-00457","08","2","공공시설물","관절형중앙분리대","3S-AC","20131106","인천 중구 중산동","현대건설-영종도 힐스테이트","195"
"SGPD-00457","08","2","공공시설물","관절형중앙분리대","3S-AC","20140319","경기 화성시 남양동","LH공사-화성남양뉴타운 도시개발사업조성공사","190"
"SGPD-00457","08","2","공공시설물","관절형중앙분리대","3S-AC","20130725","경기 평택시 안중읍","인광육교 중분대 설치공사-경기도 평택시 안중출장소","30"
"SGPD-00457","08","2","공공시설물","관절형중앙분리대","3S-AC","20130712","경북 포항시 남구 포항우체국사서함","한국도로공사-고속국도65호선 울산~포항간 건설공사","200"
"SGPD-00457","08","2","공공시설물","관절형중앙분리대","3S-AC","20130909","서울 강동구 암사동","도시기반시설본부-암사대교","220"
"SGPD-00464","08","2","공공시설물","차량용 방호책","KR-E610SB5N(M)","20111030","경기 성남시 분당구 판교동","성남판교 국지도57호선중 교량난간설치공사","220"
"SGPD-00386","08","2","공공시설물","평벤치","HBE-E1012","20111028","서울 도봉구 도봉동","도봉로 및 도봉산로 주변 조성공사","2"
"SGPD-00449","08","2","공공시설물","프리휀스Ⅲ (Free-Fence-3)","WRF-S-203-3","20131206","서울 종로구 명륜동3가 산2-14","북악하늘길 진입개선 및 어울림마당 조성공사","6"
"SGPD-00449","08","2","공공시설물","프리휀스Ⅲ (Free-Fence-3)","WRF-S-203-3","20140410","서울 종로구 명륜동1가 23-9 명륜상상어린이공원","명륜상상어린이공원 외 안전펜스 조달구매","6"
"SGPD-00449","08","2","공공시설물","프리휀스Ⅲ (Free-Fence-3)","WRF-S-203-3","20131203","경기 가평군 이곡2리","위임국도75호선 가평군 이곡2리 보도설치공사 관급자재 휀스","284"
"SGPD-00449","08","2","공공시설물","프리휀스Ⅲ (Free-Fence-3)","WRF-S-203-3","20131023","서울 중구 신당동 1-72 응봉공원 內","신당동 응봉공원개선공사","2"
"SGPD-00449","08","2","공공시설물","프리휀스Ⅲ (Free-Fence-3)","WRF-S-203-3","20121204","충남 아산시 온천동","온양천 친환경 온천교구간 안전휀스 조달구입","66"
"SGPD-00558","10","2","공공시설물","교량용펜스","KWA-718","20121017","전남 나주시 빛가람동","광주전남혁신도시 교량공사 2공구","150"
"SGPD-00808","17","2","공공시설물","미래도시","SH1212-Q11","20181130","서울 영등포구 문래동3가","가로수 생육환경 개선사업","220"
"SGPD-00808","17","2","공공시설물","미래도시","SH1212-Q11","20181130","서울 영등포구 문래동3가","가로수 생육환경 개선사업","200"
"SGPD-00808","17","2","공공시설물","미래도시","SH1212-Q11","20181228","서울 영등포구 문래동3가","가로수 생육환경 개선사업","200"
"SGPD-00808","17","2","공공시설물","미래도시","SH1212-Q11","20181228","서울 영등포구 문래동3가","가로수 생육환경 개선사업","200"
"SGPD-00808","17","2","공공시설물","미래도시","SH1212-Q11","20181228","서울 영등포구 문래동3가","가로수 생육환경 개선사업","200"
"SGPD-00808","17","2","공공시설물","미래도시","SH1212-Q11","20181228","서울 영등포구 문래동3가","가로수 생육환경 개선사업","200"
"SGPD-00808","17","2","공공시설물","미래도시","SH1212-Q11","20161231","서울 서대문구 북아현동","새문안로 보도정비공사","25"
"SGPD-00808","17","2","공공시설물","미래도시","SH1212-Q11","20171231","서울 용산구 이태원동","이태원로 보도정비공사","20"
"SGPD-00816","17","2","공공시설물","다온B","MDSS44-10A16(등주) MDLM-100-50(등기구)","20170512","-","철재 가로등주 2종","328"
"SGPD-00810","17","2","공공시설물","자전거보관대","BP-045-B","20180809","송파대로 201(테라타워2 B동)","장지동 테라타워2앞 근린공원 자정거 보관대 구매","1"
"SGPD-00852","18","2","공공시설물","가로등분전함","DNR-400P","20180510","은평구 녹번역 근처","분전반외-2018 가로등 시설물 정비공사(토목과6292 고동인)","10"
"SGPD-00877","20","2","공공시설물","HC-BSA2","HC-BSA2","20180726","서울 강남구 세곡동","밤고개로 확장공사(2구간)_투수블럭외 6종","71"
"SGPD-00882","20","2","공공시설물","볼라드","Kgrim-BL-4","20191118","서울 영등포구 양평동 (선유로 47길 30-양평2동 주민센터)","관급자재구매(2019년 도로시설물 설치 및 보수공사-연간단가)191107","10"
"SGPD-00863","19","2","공공시설물","보행자용펜스","KL-WP01B","20181210","서울 강서구 화곡동 18-5 우장초교 앞","우장초교 통학로 조성공사","80"
"SGPD-00863","19","2","공공시설물","보행자용펜스","KL-WP01B","20181210","서울 강서구 화곡동 18-5 우장초교 앞","우장초교 통학로 조성공사","80"
"SGPD-00867","19","2","공공시설물","Design Fence","BRF-12-06","20190601","서울 동작구 동작동 현충원","안전휀스 구매","164"
"SGPD-00867","19","2","공공시설물","Design Fence","BRF-12-06","20190601","서울 동작구 동작동 현충원","안전휀스 구매","164"
"SGPD-00867","19","2","공공시설물","Design Fence","BRF-12-06","20190601","서울 동작구 동작동 현충원","안전휀스 구매","164"
"SGPD-00881","20","2","공공시설물","공공시설물 볼라드","SSBD-05","20191216","서울 영등포구 영등포동4가","관급자재조달구매 노인보행사고다발구간 개선공사(영등포시장교차로)","24"
"SGPD-00838","18","2","공공시설물","자전거도로용휀스","JSF-B04","20180723","서울 노원구 공릉동","디자인형 울타리 구매 설치","68"
"SGPD-00838","18","2","공공시설물","자전거도로용휀스","JSF-B04","20181130","서울 서대문구 홍은동","2018년 하천유기관리 및 시설물 정비공사","6"
"SGPD-00838","18","2","공공시설물","자전거도로용휀스","JSF-B04","20170814","서울 서대문구 홍은동","홍제천 산책로 및 진출입로 설치공사","110"
"SGPD-00838","18","2","공공시설물","자전거도로용휀스","JSF-B04","20181221","서울 서대문구 북가좌동","세월교 설치공사","112"
"SGPD-00884","20","2","공공시설물","조화","SH1212-Q18","20181114","서울 동작구 흑석동143-80","흑석 7구역 재개발사업","80"
"SGPD-00884","20","2","공공시설물","조화","SH1212-Q18","20181114","서울 동작구 흑석동143-80","흑석 7구역 재개발사업","80"
"SGPD-00884","20","2","공공시설물","조화","SH1212-Q18","20181114","서울 동작구 흑석동143-80","흑석 7구역 재개발사업","80"
"SGPD-00884","20","2","공공시설물","조화","SH1212-Q18","20181114","서울 동작구 흑석동143-80","흑석 7구역 재개발사업","80"
"SGPD-00842","18","2","공공시설물","볼라드","SYBD-900","20181202","서울 광진구 구의동","천호대로(광나루역) 확장공사(7차)볼라드구매","52"
"SGPD-00842","18","2","공공시설물","볼라드","SYBD-900","20181004","서울 강북구 미아동 195-1","볼라드구매(미아동195-1(궁전회관옆)보도개설공사","2"
"SGPD-00862","19","2","공공시설물","보행자용펜스","KL-WP01A","20190214","서울 강서구 염창동 264-30 염창감리교회 건너편","울타리설치","176"
"SGPD-00512","18","2","공공시설물","보행자용펜스","GR-209","20180723","새문안로 5길","사직로8길 60 주변 하수관로 정비공사 디자인형울타리 조달구매","93"
"SGPD-00805","21","2","공공시설물","볼라드","KLB-13","20171112","서울 성동구 하왕십리동 999-125","볼라드 구매","5"
"SGPD-00805","21","2","공공시설물","볼라드","KLB-13","20180511","서울 성동구 성수동2가 277-70(성수이로22길 60 외 6곳)","볼라드 구매","20"
"SGPD-00805","21","2","공공시설물","볼라드","KLB-13","20161227","서울 구로구 구로동 235-2 외 23곳","지역역량강화산업외 G밸리도시활력 증진개발사업(3차)","114"
"SGPD-00805","21","2","공공시설물","볼라드","KLB-13","20171222","서울 서대문구 홍은동 14-4(홍은중앙로5길 74(미건스카이빌 앞 외 1곳)","볼라드 구매(홍은중앙로 도시경관개선사업)","10"
"SGPD-00815","17","2","공공시설물","다온A","MDSS43-10A16(등주) MDLM-100-50(등기구)","20170907","-","LED보안등기구 외 1종-전통문양 가로등 설치","7"
"SGPD-00815","17","2","공공시설물","다온A","MDSS43-10A16(등주) MDLM-100-50(등기구)","20170829","-","LED보안등기구 외 3종 구매-가로등 유지보수","2"
"SGPD-00815","17","2","공공시설물","다온A","MDSS43-10A16(등주) MDLM-100-50(등기구)","20170411","-","송산그린시티 국도77호선 전기공사 관급자재-가로등주","17"
"SGPD-00815","17","2","공공시설물","다온A","MDSS43-10A16(등주) MDLM-100-50(등기구)","20170406","-","스마트허브 강촌로 가로등 정비공사","11"
"SGPD-00902","20","2","공공시설물","공공시설물 펜스(자전거도로용)","SSBF-01","20190829","서울 양천구 목동동로 323","관내방호울타리 설치공사 관급자재구매","251"
"SGPD-00902","20","2","공공시설물","공공시설물 펜스(자전거도로용)","SSBF-01","20190829","서울 양천구 목동동로 323","관내방호울타리 설치공사 관급자재구매","251"
"SGPD-00530","19","2","공공시설물","횡단보도 편의시설","횡단보도 쉘타","20170410","성동구 고산자로 202","횡단보도 안전쉘타 설치","1"
"SGPD-00530","19","2","공공시설물","횡단보도 편의시설","횡단보도 쉘타","20170410","서울 성동구 행당동 319-36","횡단보도 안전쉘타 설치","1"
"SGPD-00530","19","2","공공시설물","횡단보도 편의시설","횡단보도 쉘타","20170410","성동구 고산자로 202","횡단보도 안전쉘타 설치","1"
"SGPD-00530","19","2","공공시설물","횡단보도 편의시설","횡단보도 쉘타","20141016","금천구 가산디지털1로 168 ","횡단보도 편의시설 설치","1"
"SGPD-00480","18","2","공공시설물","자전거보관대","BP-036","20171218","서울 성북구 삼선동5가","자전거보관대 조달구매","30"
"SGPD-00795","16","2","공공시설물","U-PL","U-PL-02","20170210","서울 금천구 가산동 28-2 골말공원 입구","방범용 CCTV카메라폴 제작 납품","3"
"SGPD-00795","16","2","공공시설물","U-PL","U-PL-02","20130116","서울 양천구 신월2동 507-1 휴대혼아울렛 앞","방범CCTV성능개선사업","14"
"SGPD-00403","22","2","공공시설물","등벤치","SIB-214","20160530","서울 양천구 지양로 47 독서근린공원 내 ","독서근린공원 지하주차장 건설 조경공사 관급자재 구매","18"
"SGPD-00403","22","2","공공시설물","등벤치","SIB-214","20111020","경기 안양시 동안구 부림동 한가람길","부림동 한가람길 조성공사","11"
"SGPD-00403","22","2","공공시설물","등벤치","SIB-214","20110810","서울 종로구 사직동 사직공원 내 ","사직공원 정비사업","8"
"SGPD-00818","17","2","공공시설물","라온A","MDSP39-05A16(등주) MDLM-50-35(등기구)","20171129","-","종로 BRT 및 도로공간 재편 전기공사_신호등 및 가로등","4"
"SGPD-00818","17","2","공공시설물","라온A","MDSP39-05A16(등주) MDLM-50-35(등기구)","20171122","-","범죄제로화 사업지역 LED 보안등 개량공사 관급자재 구매","6"
"SGPD-00818","17","2","공공시설물","라온A","MDSP39-05A16(등주) MDLM-50-35(등기구)","20171031","-","만리재로 보행환경개선 전기공사_보안등","3"
"SGPD-00818","17","2","공공시설물","라온A","MDSP39-05A16(등주) MDLM-50-35(등기구)","20170913","-","2017년 보안등공원등 유지보수공사 2구역-연간단가","35"
"SGPD-00818","17","2","공공시설물","라온A","MDSP39-05A16(등주) MDLM-50-35(등기구)","20170913","-","2017년 보안등공원등 유지보수공사 1구역-연간단가","40"
"SGPD-00818","17","2","공공시설물","라온A","MDSP39-05A16(등주) MDLM-50-35(등기구)","20170726","-","도로조명시설물 유지보수용 자재구매-12차","4"
"SGPD-00818","17","2","공공시설물","라온A","MDSP39-05A16(등주) MDLM-50-35(등기구)","20170531","-","2017년 주택가 빛환경 개선사업 관급자재 구매","12"
"SGPD-00818","17","2","공공시설물","라온A","MDSP39-05A16(등주) MDLM-50-35(등기구)","20170531","-","상계2동 일대 보안등 개량공사","2"
"SGPD-00818","17","2","공공시설물","라온A","MDSP39-05A16(등주) MDLM-50-35(등기구)","20170516","-","2017년 보안등 보수공사-연간단가 관급자재 구매","10"
"SGPD-00818","17","2","공공시설물","라온A","MDSP39-05A16(등주) MDLM-50-35(등기구)","20170413","-","도로과5910 2017년 1 2구역 보안등 신설 및 유지보수공사","50"
"SGPD-00818","17","2","공공시설물","라온A","MDSP39-05A16(등주) MDLM-50-35(등기구)","20171128","-","상도근린공원 공원등 설치","4"
"SGPD-00818","17","2","공공시설물","라온A","MDSP39-05A16(등주) MDLM-50-35(등기구)","20171123","-","2017년 방학로 가로등 개량공사 LED가로등기구 125W 외 3종","95"
"SGPD-00818","17","2","공공시설물","라온A","MDSP39-05A16(등주) MDLM-50-35(등기구)","20171025","-","2017년 공원내 공원등시설개선사업 전기공사","4"
"SGPD-00818","17","2","공공시설물","라온A","MDSP39-05A16(등주) MDLM-50-35(등기구)","20171018","-","보안등기구 외 3종 구매-보안등 유지보수","70"
"SGPD-00818","17","2","공공시설물","라온A","MDSP39-05A16(등주) MDLM-50-35(등기구)","20190919","-","2017년 방학로 가로등 개량공사","84"
"SGPD-00818","17","2","공공시설물","라온A","MDSP39-05A16(등주) MDLM-50-35(등기구)","20170915","-","관급자재구매(2017년 공원내 공원등시설개선사업 전기공사)","17"
"SGPD-00818","17","2","공공시설물","라온A","MDSP39-05A16(등주) MDLM-50-35(등기구)","20170508","-","LED 가로등 기구(50W 100W) 구매","57"
"SGPD-00818","17","2","공공시설물","라온A","MDSP39-05A16(등주) MDLM-50-35(등기구)","20170418","-","관급자재구매(2017년 어린이공원 정비사업)","11"
"SGPD-00818","17","2","공공시설물","라온A","MDSP39-05A16(등주) MDLM-50-35(등기구)","20170216","-","여성안심 귀갓길 및 소녀상 조명자재","3"
"SGPD-00818","17","2","공공시설물","라온A","MDSP39-05A16(등주) MDLM-50-35(등기구)","20170206","-","새문안로 중앙버스전용차로 전기공사_가로등주 및 부속설비구매","15"
"SGPD-00818","17","2","공공시설물","라온A","MDSP39-05A16(등주) MDLM-50-35(등기구)","20171123","-","관급자재 구매-청룡동마을마당 공원등설치","1"
"SGPD-00818","17","2","공공시설물","라온A","MDSP39-05A16(등주) MDLM-50-35(등기구)","20171121","-","난향동 정문학교옆산책로 공원등 설치","1"
"SGPD-00818","17","2","공공시설물","라온A","MDSP39-05A16(등주) MDLM-50-35(등기구)","20171117","-","장위13구역 LED보안등기구 교체사업 자재구매","100"
"SGPD-00818","17","2","공공시설물","라온A","MDSP39-05A16(등주) MDLM-50-35(등기구)","20171114","-","관급자재 구매-상도그린공원 공원등 설치","2"
"SGPD-00818","17","2","공공시설물","라온A","MDSP39-05A16(등주) MDLM-50-35(등기구)","20171114","-","관급자재 구매-당곡어린이공원 공원등 설치","2"
"SGPD-00818","17","2","공공시설물","라온A","MDSP39-05A16(등주) MDLM-50-35(등기구)","20171114","-","관급자재구매-난향동휴먼시아 산책로 공원등 설치","2"
"SGPD-00627","12","2","공공시설물","미끄럼방지 가로수보호덮개","논슬립 디자인 정사각형","20170406","서울특별시 영등포구 도영로 한국철도공사수도권서부본부 앞","도영로 가로수 보호판 정비공사","113"
"SGPD-00651","21","2","공공시설물","교량용 펜스","KWA-732a","20131130","광주 북구 용전동 신용산교","일곡~용전간 도로확장공사","812"
"SGPD-00651","21","2","공공시설물","교량용 펜스","KWA-732a","20151107","전남 나주시 구진포로 200","송계마을 교량보수공사","17"
"SGPD-00625","12","2","공공시설물","Yron2 (와이론2) + Ocean (오션)","THP2-903DN-R101","20140831","서울 마포구 창전동","마포구 상수 12구역","28"
"SGPD-00625","12","2","공공시설물","Yron2 (와이론2) + Ocean (오션)","THP2-903DN-R101","20140531","서울 성동구 상왕십리동","왕십리 뉴타운 2구역","36"
"SGPD-00576","19","2","공공시설물","자전거보관대","KLG-40","20161214","서울 금천구 가산동 717 독산역 주변","조달물품 구매(벚꽃로 자전거도로 정비 및 시설물 설치)","20"
"SGPD-00511","18","2","공공시설물","보행자용 펜스","GR-207","20180806","천호대교 북단","디자인형울타리 구매","174"
"SGPD-00771","21","2","공공시설물","펜스","KL-105CB","20180710","서울 서초구 양재동311(양재근린공원 주변 / 언남중학교 앞)","?타리구매설치","136"
"SGPD-00771","21","2","공공시설물","펜스","KL-105CB","20161010","서울 강서구 화곡동 382-18","디자인형울타리등(2016년 관내도로시설물 보수공사)","28"
"SGPD-00772","21","2","공공시설물","펜스","KL-105CA","20180516","서울 성동구 금호동1가(행당로 e편한세상 금호아파트 105동 앞 도로주변)","울타리구매설치","75"
"SGPD-00501","09","2","공공시설물","우레탄 볼라드","SD-UB02","20140701","서울 구로구 구로동 188-11","롯데호텔 볼라드설치","14"
"SGPD-00776","20","2","공공시설물","네오 이노휀스 200(원형바) / 영문명:Neo Inno-Fence-200(CC)","WRF-S-N200(CC)","20171218","경기 남양주시 호평동 489-4","호평 4.17통 비법정도로 인도정비공사","18"
"SGPD-00776","20","2","공공시설물","네오 이노휀스 200(원형바) / 영문명:Neo Inno-Fence-200(CC)","WRF-S-N200(CC)","20170929","서울 서초구 양재동 390 고인돌공원내","고인돌근린공원외1개소 정비공사 휀스","16"
"SGPD-00658","12","2","공공시설물","보행자용 펜스","KWF-808P","20150811","서울 동대문구 청량리동 1-2","시조사 삼거리 교차로 개선공사","242"
"SGPD-00658","12","2","공공시설물","보행자용 펜스","KWF-808P","20150924","경기 오산시 가장동 산 67","청학~가장간((가장1산단~오산시계)확장공사","80"
"SGPD-00658","12","2","공공시설물","보행자용 펜스","KWF-808P","20141021","경기 구리시 토평동 194-10","구리 태영 데시앙 아파트 신축공사","160"
"SGPD-00658","12","2","공공시설물","보행자용 펜스","KWF-808P","20151230","대구광역시 달성군 화원읍 구라리 1063번지 ","화원진천천 자전거도로안전시설물 설치공사","24"
"SGPD-00629","12","2","공공시설물","미끄럼방지 가로수보호덮개","논슬립 스탠다드 정사각형","20170823","서울특별시 금천구 벚꽃로 190","가리봉배수분구 하수관거 종합정비공사","37"
"SGPD-00664","12","2","공공시설물","자전거도로용 펜스","MF-BR006","20141229","서울특별시 서대문구 모래내로 273","홍제천 인도교 설치공사-볼라드 및 난간","32"
"SGPD-00714","19","2","공공시설물","보행자용 펜스","KL-106","20160516","경기 김포시 고촌읍 태리 대보천 주변","대보천 정비공사(휀스)","250"
"SGPD-00714","19","2","공공시설물","보행자용 펜스","KL-106","20170623","서울 중랑구 묵동 공릉로12가길(화랑대e편한세상주변)","울타리설치","143"
"SGPD-00653","20","2","공공시설물","세로지주형난간","MF-B034","20131219","서울시 서초구 서초대로 385 진흥아파트 앞 서초3교","사임당로 녹색길 연결 보도교 건설공사","52"
"SGPD-00653","20","2","공공시설물","세로지주형난간","MF-B034","20131219","서울시 서초구 서운로 79 신동아2차 아파트 앞 서초2교","서초대로 녹색길 연결 보도교 건설공사","55"
"SGPD-00652","20","2","공공시설물","창살형난간","MF-B043","20140929","서울특별시 용산구 녹사평대로 245 한신아파트 앞","2014관내 도로시설물 유지보수공사","104"
"SGPD-00652","20","2","공공시설물","창살형난간","MF-B043","20141020","서울특별시 용산구 한남대로 112 한남초등학교 앞","한남초교 앞 보도육교 보행환경 개선사업 ","144"
"SGPD-00725","18","2","공공시설물","보행자용 휀스","GR-151-02","20171108","도봉로 511","도봉로노해로창동역 방호울타리 교체공사","2240"
"SGPD-00513","22","2","공공시설물","보행자용 펜스","GR-208","20181218","용마산로 364(중화중학교)","사직로8길 60 주변 하수관로 정비공사 디자인형울타리 조달구매","92"
"SGPD-00684","13","2","공공시설물","볼라드","SYBD-200","20150831","서울 동대문구 전농동","관급자재추가구매(시공원보수정비사업)","14"
"SGPD-00684","13","2","공공시설물","볼라드","SYBD-200","20151022","서울 동대문구 용두동","관급자재추가구매","4"
"SGPD-00739","14","2","공공시설물","공원등","ARP-001","20170312","충북 청주시 청원구 직지대로848번길 42 우암 어린이 공원","새싹어린이공원 및 기타공원 전기공사용 관급자재","2"
"SGPD-00739","14","2","공공시설물","공원등","ARP-001","20160820","충북 청주시 청원구 직지대로 848번길 42 우암 어린이공원","우암어린이공원 재정비사업 전기 관급자재 구입 (경관조명기구)","6"
"SGPD-00739","14","2","공공시설물","공원등","ARP-001","20151017","충북 청주시 상당구 명암동 산25-5 명암약수터","명암약수터 주변 생태공원 공원등 설치공사 관급자재 구입 (공원등주)","3"
"SGPD-00573","18","2","공공시설물","보행자용 펜스","DAUS-SS-050","20140711","세곡2공공주택지구","세곡2 공공주택지구 난간","348"
"SGPD-00573","18","2","공공시설물","보행자용 펜스","DAUS-SS-050","20150709","서울지방경찰청 부근","문정지구 도시개발사업 단지조성공사 디자인형울타리(저류지)구매","532"
"SGPD-00573","18","2","공공시설물","보행자용 펜스","DAUS-SS-050","20160930","서울 강북구 번동","디자인형 울타리 구매-우이천 산책로 난간 설치","432"
"SGPD-00573","18","2","공공시설물","보행자용 펜스","DAUS-SS-050","20160830","서울 강북구 번동 242 부근 하천","디자인형 울타리 구매-우이천 산책로 난간 설치","1800"
"SGPD-00573","18","2","공공시설물","보행자용 펜스","DAUS-SS-050","20151210","은평구 구파발역 부근 물푸레골","물푸레골 교량난간 및 보도데크난간 제작 및 설치 공사","358"
"SGPD-00573","18","2","공공시설물","보행자용 펜스","DAUS-SS-050","20160707","서울 강남구 율현동 233","세곡2지구 보행로 안전휀스 설치공사","80"
"SGPD-00573","18","2","공공시설물","보행자용 펜스","DAUS-SS-050","20160630","관악산 둘레길","2015년 재난대비 구거 및 관악산 둘레길 정비공사","460"
"SGPD-00573","18","2","공공시설물","보행자용 펜스","DAUS-SS-050","20160520","서울 강남구 자곡동 361-2부근","세곡2 보금자리주택지구 조경공사(2공구)디자인형울타리 조달구매","210"
"SGPD-00573","18","2","공공시설물","보행자용 펜스","DAUS-SS-050","20141228","서울 강남구 자곡동 361-2 부근","세곡2 보금자리주택지구 조성공사 디자인형울타리 구매","905"
"SGPD-00628","12","2","공공시설물","미끄럼방지 가로수보호덮개","논슬립 디자인 원형","20170621","서울특별시 중구 남창동 도동사거리 앞","소월로 보행환경 개선사업가로수보호판","52"
"SGPD-00448","08","2","공공시설물","보행자용휀스","SHF-C005","20141117","충청남도 계룡시 두마면 두계리 계룡역","두계삼거리 계룡역간 도로정비(부대)공사 관급자재 안전휀스 구입","33"
"SGPD-00448","08","2","공공시설물","보행자용휀스","SHF-C005","20140831","충청남도 천안시 서북구 성환읍","성환읍 성월리 인도설치공사-교량난간","126"
"SGPD-00448","08","2","공공시설물","보행자용휀스","SHF-C005","20131230","서울 강남구 영동대로3길 9 개포어린이집 일원","서울 강남구 영동대로3길 9 개포어린이집 일원","159"
"SGPD-00448","08","2","공공시설물","보행자용휀스","SHF-C005","20131031","옥천군 청산면 하서리 청산국궁장.","청산 국궁장 기반시설공사 관급자재","35"
"SGPD-00448","08","2","공공시설물","보행자용휀스","SHF-C005","20140404","경기 용인시 수지구 죽전1동 죽전교 부근","탄철길훈 1차 아파트 운동시설 설치공사","44"
"SGPD-00448","08","2","공공시설물","보행자용휀스","SHF-C005","20140103","충청남도 천안시 동남구 안서동 산16-5 단국대학교병원 삼거리","단국대학교병원삼거리교통안전시설물설치(관급)-안전휀스","180"
"SGPD-00448","08","2","공공시설물","보행자용휀스","SHF-C005","20140106","울진군 울진읍 읍남리 350번지  일원 (에너지 프라자 울진 충전소)","울진도시계획도로 종로 3-11호선 개설공사 휀스구입 ","200"
"SGPD-00713","19","2","공공시설물","보행자용펜스","KL-106A","20161212","서울 은평구 응암동 응암초교앞","울타리","25"
"SGPD-00661","12","2","공공시설물","보행자용 펜스","KL-105","20141202","섬진강 주변 자전거도로","섬진강 무수1호 난간설치","260"
"SGPD-00661","12","2","공공시설물","보행자용 펜스","KL-105","20151030","서울 성동구 마장동 816-76","마장동 816-76 삼성홈타운 옆","39"
"SGPD-00661","12","2","공공시설물","보행자용 펜스","KL-105","20151106","서울 서초구 내곡동 다니엘학교 진입로","헌인마을진입도로 포장공사      ","59"