"키","명칭","행정시","행정구","행정동","전화번호","홈페이지주소"
"BE_IW12-0560","Lotte Duty Free Shop","Seoul","Jung-gu","Myeong-dong","02-759-7586 ","http://kr.lottedfs.com/branchMain.jsp?bCode=2 "
"BE_IW12-0561","Lotte Duty Free Shop","Seoul","Jung-gu","Myeong-dong","02-759-7586 ","http://kr.lottedfs.com/branchMain.jsp?bCode=2 "
"BE_IW12-0562","Silla Duty Free Shop","Seoul","Jung-gu","Jangchung-dong","02-2230-3635 ","http://www.shilladfs.com/en/dutyfree/main.jsp"
"BE_IW12-0563","Silla Duty Free Shop","Seoul","Jung-gu","Jangchung-dong","02-2230-3635 ","http://www.shilladfs.com/en/dutyfree/main.jsp "
"BE_IW12-0564","Galleria Department Store","Seoul","Yongsan-gu","Namyeong-dong","02-390-4114","http://dept.galleria.co.kr/ "
"BE_IW12-0565","Lotte Department Store","Seoul","Jung-gu","Myeong-dong","02-771-2500 ","http://www.lotteshopping.com/ "
"BE_IW12-0566","Lotte Department Store","Seoul","Jung-gu","Myeong-dong","02-771-2500 ","http://www.lotteshopping.com/ "
"BE_IW12-0567","Shinsegae Department Store","Seoul","Jung-gu","Myeong-dong","02-310-1090 ","http://www.shinsegae.com/ "
"BE_IW12-0568","Shinsegae Department Store","Seoul","Jung-gu","Myeong-dong","02-310-1090 ","http://www.shinsegae.com/ "
"BE_IW12-0569","Golden Town","Seoul","Jung-gu","Sindang-dong","02-2238-4241 ",""
"BE_IW12-0570","Golden Town","Seoul","Jung-gu","Sindang-dong","02-2238-4241 ",""
"BE_IW12-0571","Good Morning City","Seoul","Jung-gu","Gwanghui-dong","02-2118-8700 ","http://www.goodmorningcity.kr/"
"BE_IW12-0572","Good Morning City","Seoul","Jung-gu","Gwanghui-dong","02-2118-8700 ","http://www.goodmorningcity.kr/ "
"BE_IW12-0573","New Zone","Seoul","Jung-gu","Sindang-dong","","http://www.nuzzon.co.kr/ "
"BE_IW12-0574","New Zone","Seoul","Jung-gu","Sindang-dong","","http://www.nuzzon.co.kr/ "
"BE_IW12-0575","DOOSAN Tower","Seoul","Jung-gu","Gwanghui-dong","02-3398-2340","http://www.doota.com/kr/index.do?_method=main"
"BE_IW12-0576","DOOSAN Tower","Seoul","Jung-gu","Gwanghui-dong","02-3398-2340 ","http://www.doota.com/kr/index.do?_method=main "
"BE_IW12-0577","The OT","Seoul","Jung-gu","Sindang-dong","02-2117-8000 ",""
"BE_IW12-0578","The OT","Seoul","Jung-gu","Sindang-dong","02-2117-8000 ",""
"BE_IW12-0579","Designer Club","Seoul","Jung-gu","Sindang-dong","02-2237-2503 ",""
"BE_IW12-0580","Designer Club","Seoul","Jung-gu","Sindang-dong","02-2237-2503 ",""
"BE_IW12-0581","LOTTE Outlet Seoul Station Store","Seoul","Yongsan-gu","Namyeong-dong","02-6965-2500","http://store.lotteshopping.com"
"BE_IW12-0582","Migliore","","","","02-3393-2802 ","http://www.migliore.co.kr/ "
"BE_IW12-0583","Migliore","Seoul","Jung-gu","Myeong-dong","02-3393-2802 ","http://www.migliore.co.kr/ "
"BE_IW12-0584","Venezia Mega Mall Support Center","Seoul","Jung-gu","Hwanghak-dong","02-2048-5100","http://www.veneziamegamall.net/"
"BE_IW12-0585","Venezia Mega Mall Support Center","Seoul","Jung-gu","Hwanghak-dong","02-2048-5100","http://www.veneziamegamall.net/"
"BE_IW12-0586","Venezia Mega Mall Support Center","Seoul","Jung-gu","Hwanghak-dong","02-2048-5100 ","http://www.veneziamegamall.net/ "
"BE_IW12-0587","Studio W","Seoul","Jung-gu","Sindang-dong","02-2230-7000 ",""
"BE_IW12-0588","Studio W","Seoul","Jung-gu","Sindang-dong","02-2230-7000 ",""
"BE_IW12-0589","SHINSEGAE E Mart Cheonggyecheon Store","Seoul","Jung-gu","Hwanghak-dong","02-2290-1234 ","http://emart.shinsegae.com/branch/floor/floor.jsp?id=951 "
"BE_IW12-0590","SHINSEGAE E Mart Cheonggyecheon Store","Seoul","Jung-gu","Hwanghak-dong","02-2290-1234","http://emart.shinsegae.com/branch/floor/floor.jsp?id=951"
"BE_IW12-0591","SHINSEGAE E Mart Cheonggyecheon Store","Seoul","Jung-gu","Hwanghak-dong","02-2290-1234","http://emart.shinsegae.com/branch/floor/floor.jsp?id=951"
"BE_IW12-0592","Sinpyeonghwa Fashion Town","Seoul","Jung-gu","Sindang-dong","02-2238-6813 ","http://www.sph.co.kr/ "
"BE_IW12-0593","Art Plaza","Seoul","Jung-gu","Sindang-dong","02-2232-2000 ","http://art-plaza.co.kr/ "
"BE_IW12-0594","Art Plaza","Seoul","Jung-gu","Sindang-dong","02-2232-2000 ","http://art-plaza.co.kr"
"BE_IW12-0595","Art Plaza","Seoul","Jung-gu","Sindang-dong","02-2232-2000 ","http://art-plaza.co.kr"
"BE_IW12-0596","Art Plaza","Seoul","Jung-gu","Sindang-dong","02-2232-2000 ","http://art-plaza.co.kr"
"BE_IW12-0597","APM Fashion Mall","Seoul","Jung-gu","Sindang-dong","02-2250-2027 ","http://apm-korea.com/ "
"BE_IW12-0598","APM Fashion Mall","Seoul","Jung-gu","Sindang-dong","02-2250-2027 ","http://apm-korea.com/main.asp"
"BE_IW12-0599","U Us","Seoul","Jung-gu","Sindang-dong","02-6270-1000 ","http://www.uus.co.kr/ "
"BE_IW12-0600","U Us","Seoul","Jung-gu","Sindang-dong","02-6270-1000 ","http://www.uus.co.kr/ "
"BE_IW12-0601","CERESTAR","Seoul","Jung-gu","Gwanghui-dong","02-2265-3531 ",""
"BE_IW12-0602","CERESTAR","Seoul","Jung-gu","Gwanghui-dong","02-2265-3531 ",""
"BE_IW12-0603","Techno Shopping District","Seoul","Jung-gu","Sindang-dong","02-2232-4821",""
"BE_IW12-0604","Techno Shopping District","Seoul","Jung-gu","Sindang-dong","02-2232-4821",""
"BE_IW12-0605","Hello APM","Seoul","Jung-gu","Gwanghui-dong","02-6388-1114 ","http://www.helloapm.com/ "
"BE_IW12-0606","Hello APM","Seoul","Jung-gu","Gwanghui-dong","02-6388-1114 ","http://www.helloapm.com/ "
"BE_IW12-0607","HYEYANG Elysium","Seoul","Jung-gu","Sindang-dong","02-2250-1114 ",""
"BE_IW12-0608","HYEYANG Elysium","Seoul","Jung-gu","Sindang-dong","02-2250-1114 ",""
"BE_IW12-0609","Gwanghui Market","Seoul","Jung-gu","Sindang-dong","02-2238-4352",""
"BE_IW12-0610","Gwanghui Market","Seoul","Jung-gu","Sindang-dong","02-2238-4352",""
"BE_IW12-0611","Namdaemun Market","Seoul","Jung-gu","Hoehyeon-dong","02-753-2805","http://www.namdaemunmarket.co.kr/"
"BE_IW12-0612","Namdaemun Market","Seoul","Jung-gu","Hoehyeon-dong","02-753-2805",""
"BE_IW12-0613","Nampyeonghwa Market","Seoul","Jung-gu","Sindang-dong","02-2237-0622",""
"BE_IW12-0614","Nampyeonghwa Market","Seoul","Jung-gu","Sindang-dong","02-2237-0620 ",""
"BE_IW12-0615","Nampyeonghwa Market","Seoul","Jung-gu","Sindang-dong","02-2237-0622",""
"BE_IW12-0616","Dongpyeonghwa Market","Seoul","Jung-gu","Sindang-dong","02-2238-7791",""
"BE_IW12-0617","Donghwa Market","Seoul","Jung-gu","Gwanghui-dong","02-2265-9611~5 ",""
"BE_IW12-0618","Donghwa Market","Seoul","Jung-gu","Gwanghui-dong","02-2265-9611~5 ",""
"BE_IW12-0619","Bangsan Total Market","Seoul","Jung-gu","Euljiro-dong","02-2268-6691 ~6694","http://www.방산종합시장.kr"
"BE_IW12-0620","Bangsan Total Market","Seoul","Jung-gu","Euljiro-dong","02-2268-6691 ~6694","http://bangsanmarket.net/home/home/best/index.php"
"BE_IW12-0621","Samick Fashion Town","Seoul","Jung-gu","Hoehyeon-dong","02-757-3352 ",""
"BE_IW12-0622","Samick Fashion Town","Seoul","Jung-gu","Hoehyeon-dong","02-757-3352 ",""
"BE_IW12-0623","Seoul Central Market","Seoul","Jung-gu","Hwanghak-dong","02-2232-9559",""
"BE_IW12-0192","Woorinara","Seoul","Jung-gu","Myeong-dong","02-753-0334",""
"BE_IW12-0358","Sponge House Gwanghwamun : Art Museum next to the Cinema ","Seoul","Jung-gu","Myeong-dong","02-2285-2095 ","http://www.spongehouse.com/ "
"BE_IW12-0359","Cinus EOE4","Seoul","Jung-gu","Jangchung-dong","02-2236-2024 ",""
"BE_IW12-0360","Cinus EOE5","Seoul","Jung-gu","Jangchung-dong","02-2236-2024  ","http://www.cinus.co.kr/Front/Theater/CinusIntro.aspx?code=1002&area=0 "
"BE_IW12-0361","DDP(Dongdaemun Design Plaza)","Seoul","Jung-gu","Gwanghui-dong","","http://www.ddp.or.kr"
"BE_IW12-0362","Guidance of Sightseeing gallery","Seoul","Jung-gu","Myeong-dong","02-1330 / 02-729-9497~9 ","http://korean.visitkorea.or.kr/kor/hd/tour_helper/tour_info_pavilion/hd_1_1_2_1.jsp"
"BE_IW12-0363","Guidance of Sightseeing gallery","Seoul","Jung-gu","Myeong-dong","1330 ","http://korean.visitkorea.or.kr/kor/hd/tour_helper/tour_info_pavilion/hd_1_1_2_1.jsp "
"BE_IW12-0364","Deoksugung National Museum of Art","Seoul","Jung-gu","Sogong-dong","02-2022-0600","http://www.moca.go.kr/contents/contentsManage.do?_method=includeHtml&cat=about&fname=building"
"BE_IW12-0365","Deoksugung National Museum of Art","Seoul","Jung-gu","Sogong-dong","02-2022-0600 ","www.moca.go.kr/index.do?_method=main "
"BE_IW12-0366","Seoul Museum of Art","Seoul","Jung-gu","Sogong-dong","02-2124-8800","http://seoulmoa.seoul.go.kr/index.jsp"
"BE_IW12-0367","Seoul Museum of Art","Seoul","Jung-gu","Sogong-dong","02-2124-8800 ","http://seoulmoa.seoul.go.kr/index.jsp "
"BE_IW12-0368","Stamp Culture Nuri","","","","02-6450-5600","http://www.kstamp.go.kr/kstampworld/"
"BE_IW12-0369","Stamp Culture Nuri","","","","02-6450-5600 ","http://www.kstamp.go.kr/ "
"BE_IW12-0370","Josun Ilbo Museum of Art","Seoul","Jung-gu","Myeong-dong","02-724-6322","http://gallery.chosun.com/"
"BE_IW12-0371","Josun Ilbo Museum of Art","Seoul","Jung-gu","Myeong-dong","","http://gallery.chosun.com/ "
"BE_IW12-0372","Museum of Korean Modern Literature","Seoul","Jung-gu","Jangchung-dong","02-2277-4857","http://www.kmlm.or.kr/main/"
"BE_IW12-0373","Museum of Korean Modern Literature","Seoul","Jung-gu","Jangchung-dong","02-2277-4857","http://www.kmlm.or.kr/main/ "
"BE_IW12-0374","Gwanghuimun","Seoul","Jung-gu","Gwanghui-dong","",""
"BE_IW12-0375","Gwanghuimun","Seoul","Jung-gu","Gwanghui-dong","",""
"BE_IW12-0376","Old Russian Legation","Seoul","Jung-gu","Sogong-dong","",""
"BE_IW12-0377","Old Russian Legation","Seoul","Jung-gu","Sogong-dong","",""
"BE_IW12-0378","Deoksugang Palace","Seoul","Jung-gu","Sogong-dong","",""
"BE_IW12-0379","Deoksugang Palace","Seoul","Jung-gu","Sogong-dong","",""
"BE_IW12-0380","Deoksugang Palace","Seoul","Jung-gu","Sogong-dong","02-771-9951","http://www.deoksugung.go.kr/"
"BE_IW12-0381","Deoksugang Palace 입니다","","","","",""
"BE_IW12-0382","Myeongdong Cathoic Cathedral","Seoul","Jung-gu","Myeong-dong","",""
"BE_IW12-0383","Myeongdong Cathoic Cathedral","Seoul","Jung-gu","Myeong-dong","02-774-1784","http://www.mdsd.or.kr/"
"BE_IW12-0384","Seoul Seonggwak-gil Walking","","","","",""
"BE_IW12-0385","Seoul History","Seoul","Jung-gu","Hoehyeon-dong","",""
"BE_IW12-0386","Seoul History","Seoul","Jung-gu","Hoehyeon-dong","042-481-4650 ",""
"BE_IW12-0387","Seoul Castle","Seoul","Jung-gu","Jangchung-dong","",""
"BE_IW12-0388","Seoul Castle","Seoul","Jung-gu","Jangchung-dong","","http://www.bukak.or.kr/"
"BE_IW12-0389","Sungnyemun","Seoul","Jung-gu","Sogong-dong","",""
"BE_IW12-0390","Sungnyemun","Seoul","Jung-gu","Sogong-dong","042-481-4650","http://www.sungnyemun.or.kr/"
"BE_IW12-0391","Sungnyemun","Seoul","Jung-gu","Sogong-dong","042-481-4650","http://www.cha.go.kr/korea/heritage/search/Culresult_Db_View.jsp?mc=NS_04_03_01&VdkVgwKey=110001000011&flag=Y"
"BE_IW12-0392","Yakhyeon Catholic Church","Seoul","Jung-gu","Myeong-dong","",""
"BE_IW12-0393","Yakhyeon Catholic Church","Seoul","Jung-gu","Jungnim-dong","02-392-5018 ","http://www.yakhyeon.or.kr/"
"BE_IW12-0394","Jungdong Church","Seoul","Jung-gu","Sogong-dong","",""
"BE_IW12-0395","Jungdong Church","Seoul","Jung-gu","Sogong-dong","02-753-0001","http://chungdong.onmam.com/"
"BE_IW12-0396","Jungmyeongjeon","Seoul","Jung-gu","Sogong-dong","",""
"BE_IW12-0397","Jungmyeongjeon","Seoul","Jung-gu","Sogong-dong","",""
"BE_IW12-0398","Cheonggyecheon remains","Seoul","Jung-gu","Myeong-dong","",""
"BE_IW12-0399","Bank of Korea Main building","Seoul","Jung-gu","Sogong-dong","",""
"BE_IW12-0400","Bank of Korea Main building","Seoul","Jung-gu","Sogong-dong","",""
"BE_IW12-0401","Wongudan Main Gate","Seoul","Jung-gu","Sogong-dong","",""
"BE_IW12-0402","Wongudan","Seoul","Jung-gu","Sogong-dong","",""
"BE_IW12-0403","Wongudan","Seoul","Jung-gu","Sogong-dong","",""
"BE_IW12-0404","GwangSeongmyo","Seoul","Jung-gu","Jangchung-dong","",""
"BE_IW12-0405","Gwangtonggwan","Seoul","Jung-gu","Myeong-dong","",""
"BE_IW12-0406","Salvation Army Center Hall","Seoul","Jung-gu","Sogong-dong","",""
"BE_IW12-0407","Malli-dong Jeong yeong-guk house","Seoul","Jung-gu","Jungnim-dong","",""
"BE_IW12-0408","Mokmyeoksan Beacon Fire Station Site","Seoul","Jung-gu","Pil-dong","",""
"BE_IW12-0409","Paejae School East","Seoul","Jung-gu","Sogong-dong","",""
"BE_IW12-0410","King's son in law Park young hyo House","Seoul","Jung-gu","Pil-dong","",""
"BE_IW12-0411","Samgakdong master builder Lee seung op house","Seoul","Jung-gu","Pil-dong","",""
"BE_IW12-0412","Samchungdong Kim chun yeong house","Seoul","Jung-gu","Pil-dong","",""
"BE_IW12-0413","Sohn kee Chung laurel wreath menumental tree ","Seoul","Jung-gu","Jungnim-dong","",""
"BE_IW12-0414","Waryongmyo","Seoul","Jung-gu","Pil-dong","",""
"BE_IW12-0415","Jegi-dong See breeze Yoon Taek Young Site","Seoul","Jung-gu","Pil-dong","",""
"BE_IW12-0416","March First Independence Movement Site Severance hospital","Seoul","Jung-gu","Hoehyeon-dong","",""
"BE_IW12-0417","March First Independence Movement Site","Seoul","Jung-gu","Sogong-dong","",""
"BE_IW12-0418","March First Independence Movement Site","Seoul","Jung-gu","Hoehyeon-dong","",""
"BE_IW12-0419","March First Independence Movement Monument","Seoul","Jung-gu","Jangchung-dong","",""
"BE_IW12-0420","Gasan Site","Seoul","Jung-gu","Gwanghui-dong","",""
"BE_IW12-0421","Patriot Kang woo gyu Anti-Japan Dead Site","Seoul","Jung-gu","Hoehyeon-dong","",""
"BE_IW12-0422","House Site of Kang hee maeng","Seoul","Jung-gu","Sogong-dong","",""
"BE_IW12-0423","Gosanja Kim Jung-ho Monument Memorial","","","","",""
"BE_IW12-0424","Goeundamgol","Seoul","Jung-gu","Myeong-dong","",""
"BE_IW12-0425","Government Institution Buddhis sermon School Site","Seoul","Jung-gu","Sogong-dong","",""
"BE_IW12-0426","Hyoseogwan Site","Seoul","Jung-gu","Myeong-dong","",""
"BE_IW12-0427","Gurigae","Seoul","Jung-gu","Myeong-dong","",""
"BE_IW12-0428","Gukdo Cinema Site","Seoul","Jung-gu","Euljiro-dong","",""
"BE_IW12-0429","Guksadang Shrine Site","Seoul","Jung-gu","Pil-dong","",""
"BE_IW12-0430","Gungisi Site","Seoul","Jung-gu","Myeong-dong","",""
"BE_IW12-0431","Gyunyeok Office Site","Seoul","Jung-gu","Pil-dong","",""
"BE_IW12-0432","House Site of Kim bum woo","Seoul","Jung-gu","Myeong-dong","",""
"BE_IW12-0433","Statue of Patriot Kim yong hwan","Seoul","Jung-gu","Jangchung-dong","",""
"BE_IW12-0434","Statue of General Kim Yu Shin","Seoul","Jung-gu","Hoehyeon-dong","",""
"BE_IW12-0435","Patriot Kim ik sang Dead Site","Seoul","Jung-gu","Pil-dong","",""
"BE_IW12-0436","Patriot Na Seok ju Dead Momorial Site","Seoul","Jung-gu","Myeong-dong","",""
"BE_IW12-0437","Statue of Na Seok ju Patriotic martyr","Seoul","Jung-gu","Myeong-dong","",""
"BE_IW12-0438","Nambyeolgung Site","Seoul","Jung-gu","Sogong-dong","",""
"BE_IW12-0439","Nambyeolyoung Namsoyoung Site","Seoul","Jung-gu","Pil-dong","",""
"BE_IW12-0440","Nsamsansa Site","Seoul","Jung-gu","Pil-dong","",""
"BE_IW12-0441","Namsomun Site","Seoul","Jung-gu","Jangchung-dong","",""
"BE_IW12-0442","Namji Site","Seoul","Jung-gu","Hoehyeon-dong","",""
"BE_IW12-0443","Namhakttang Site","Seoul","Jung-gu","Pil-dong","",""
"BE_IW12-0444","Senior Citizen's Center Site","Seoul","Jung-gu","Pil-dong","",""
"BE_IW12-0445","Provisional Government of the Republic of Korea Seoul Communicatie Site","Seoul","Jung-gu","Sogong-dong","",""
"BE_IW12-0281","Chongdong Theater","Seoul","Jung-gu","Sogong-dong","",""
"BE_IW12-0282","Chongdong Theater [Smile] Now It's your turn","","","","",""
"BE_IW12-0283","Jung-gu art's mecca Chungmu Art Hall","","","","",""
"BE_IW12-0284","Chungmu Art Hall","Seoul","Jung-gu","Sindang-dong","02-2230-6600~6603 ","http://www.cmah.or.kr/"
"BE_IW12-0285","Chungmu Art Hall","Seoul","Jung-gu","Sindang-dong","02-2230-6600~6603  ","http://www.cmah.or.kr/ "
"BE_IW12-0286","Korea House Folk Theater","Seoul","Jung-gu","Pil-dong","",""
"BE_IW12-0287","Hanwha General Insurance (The Past First Fire & Marine Insurance )Cecil Theater","Seoul","Jung-gu","Sogong-dong","",""
"BE_IW12-0288","Hanwha General Insurance (The Past First Fire & Marine Insurance )Cecil Theater","Seoul","Jung-gu","Sogong-dong","02-736-7600","http://www.ceciltheater.com/"
"BE_IW12-0289","Haechi Hall","Seoul","Jung-gu","Myeong-dong","",""
"BE_IW12-0290","Haechi Hall","Seoul","Jung-gu","Myeong-dong","02-3789-7962 ","http://cafe.naver.com/haichihall/ "
"BE_IW12-0291","Hoam Art Hall","Seoul","Jung-gu","Sogong-dong","02-751-9606 ","http://www.hoamarthall.org/main/main.aspx "
"BE_IW12-0292","Hoam Art Hall","Seoul","Jung-gu","Sogong-dong","02-751-9606","http://www.hoamarthall.org/main/main.aspx"
"BE_IW12-0293","Namsan Park","","","","","http://parks.seoul.go.kr/template/default.jsp?park_id=namsan"
"BE_IW12-0294","Namsan Park","","","","","http://parks.seoul.go.kr/template/default.jsp?park_id=namsan "
"BE_IW12-0295","Ever-green Children's Park","Seoul","Jung-gu","Dasan-dong","",""
"BE_IW12-0296","Dasan Children's Park","Seoul","Jung-gu","Sindang5-dong","",""
"BE_IW12-0297","Dasan Children's garden","Seoul","Jung-gu","Sindang5-dong","",""
"BE_IW12-0298","Rest Area in the Downtown Nam Mountain Trail","","","","",""
"BE_IW12-0299","Muhakbong Park","Seoul","Jung-gu","Sindang5-dong","",""
"BE_IW12-0300","Muhakbong Neighborhood Park","Seoul","Jung-gu","Sindang5-dong","",""
"BE_IW12-0301","Mukjeong Children's Garden","Seoul","Jung-gu","Gwanghui-dong","",""
"BE_IW12-0302","Baejae Children's Garden","Seoul","Jung-gu","Sogong-dong","",""
"BE_IW12-0303","Seosomun Park","Seoul","Jung-gu","Jungnim-dong","",""
"BE_IW12-0304","SeosomunPark","Seoul","Jung-gu","Jungnim-dong","",""
"BE_IW12-0305","SonKeeChung Athletic Park","Seoul","Jung-gu","Jungnim-dong","",""
"BE_IW12-0306","SonKeeChung Athletic Park","Seoul","Jung-gu","Jungnim-dong","",""
"BE_IW12-0307","Sunhwa Culture Park","Seoul","Jung-gu","Sogong-dong","",""
"BE_IW12-0308","Ssangrim Children's Garden","Seoul","Jung-gu","Gwanghui-dong","",""
"BE_IW12-0309","Yaksu Children's Garden","Seoul","Jung-gu","Cheonggu-dong","02-3396-5855",""
"BE_IW12-0310","Eungbong Park","Seoul","Jung-gu","Sindang-dong","",""
"BE_IW12-0311","Inhyun Children's Garden","Seoul","Jung-gu","Gwanghui-dong","",""
"BE_IW12-0312","Jangchungdan Park","Seoul","Jung-gu","Jangchung-dong","",""
"BE_IW12-0313","Jungdong Park","Seoul","Jung-gu","Sogong-dong","",""
"BE_IW12-0314","Jungdong Park","Seoul","Jung-gu","Sogong-dong","",""
"BE_IW12-0315","joyful Seonggwak-gil Walking","","","","",""
"BE_IW12-0316","Chunghyun Children's Garden","Seoul","Jung-gu","Dasan-dong","02-3396-5855",""
"BE_IW12-0317","Hanbit Media Park Culture Park","Seoul","Jung-gu","Myeong-dong","02-3396-5855",""
"BE_IW12-0318","Hwnaghak Children's Graden","Seoul","Jung-gu","Hwanghak-dong","",""
"BE_IW12-0319","Hullyeonwon Park","Seoul","Jung-gu","Euljiro-dong","",""
"BE_IW12-0320","Hullyeonwon Park","Seoul","Jung-gu","Euljiro-dong","",""
"BE_IW12-0321","Godang Memorial Hall","Seoul","Jung-gu","Euljiro-dong","02-2265-0220",""
"BE_IW12-0322","Godang Memorial Hall","Seoul","Jung-gu","Euljiro-dong","02-2265-0220",""
"BE_IW12-0323","Godang Memorial Hall","Seoul","Jung-gu","Euljiro-dong","02-2265-0220 ",""
"BE_IW12-0324","Born again Ahn Jung-geun Memorial Hall","","","","",""
"BE_IW12-0325","YuGwan-sun Memorial Hall","Seoul","Jung-gu","Sogong-dong","02-752-3353",""
"BE_IW12-0326","YuGwan-sun Memorial Hall","Seoul","Jung-gu","Sogong-dong","02-752-3353",""
"BE_IW12-0327","YuGwan-sun Memorial Hall","Seoul","Jung-gu","Sogong-dong","02-752-3353 ",""
"BE_IW12-0328","Ahn Jung-geun Memorial Hall","Seoul","Yongsan-gu","Huam-dong","02-771-4195","http://www.patriot.or.kr/"
"BE_IW12-0329","Ahn Jung-geun Memorial Hall","Seoul","Yongsan-gu","Huam-dong","02-771-4195 ","http://www.patriot.or.kr/ "
"BE_IW12-0330","50th Anniversary Memorial Youngnak Church","Seoul","Jung-gu","Euljiro-dong","02-2273-6301","http://club.youngnak.net/information/0106_info.asp"
"BE_IW12-0331","50th Anniversary Memorial Youngnak Church","Seoul","Jung-gu","Euljiro-dong","02-2273-6301 ","http://youngnak.net/ "
"BE_IW12-0332","Namsan Library","Seoul","Yongsan-gu","Huam-dong","02-754-7338 ","http://nslib.sen.go.kr/"
"BE_IW12-0333","SonKeeChung Library","Seoul","Jung-gu","Jungnim-dong","02-313-0892 ",""
"BE_IW12-0334","SonKeeChung Library","Seoul","Jung-gu","Jungnim-dong","02-313-0892 ",""
"BE_IW12-0335","Mesuem of Agriculture","Seoul","Jung-gu","Sogong-dong","02-2080-5727~8 ","http://www.agrimuseum.or.kr/"
"BE_IW12-0336","Dongguk University Museum","Seoul","Jung-gu","Pil-dong","02-2260-3722 ","http://210.94.204.227/"
"BE_IW12-0337","Sisters of Stpaul of Charires History Meseum","Seoul","Jung-gu","Myeong-dong","02-3706-3255  ","http://www.spcseoul.or.kr/contents/sub3_1.asp"
"BE_IW12-0338","Woori bank History Meseum","Seoul","Jung-gu","Hoehyeon-dong","02-2002-5090 ","https://www.woorimuseum.com/"
"BE_IW12-0339","Jong le Nara Paper Art Meseum","","","","02-2279-7901","http://www.papermuseum.or.kr"
"BE_IW12-0340","Global village folk Meseum","Seoul","Jung-gu","Hoehyeon-dong","02-311-1316","http://www.serii.re.kr/cms.do?method=getCms&mcode=S059"
"BE_IW12-0341","Chojun Textile & Quilt Art Meseum","Seoul","Jung-gu","Myeong-dong","02-753-4075","http://www.jculture.co.kr/museum/"
"BE_IW12-0342","Shinhan Meseum","Seoul","Jung-gu","Myeong-dong","02-311-1316","http://www.shinhanmuseum.co.kr/"
"BE_IW12-0343","Bank of Korea Money Meseum","Seoul","Jung-gu","Sogong-dong","02-759-4881","http://museum.bok.or.kr/index.do"
"BE_IW12-0344","CGV Myeongdong","Seoul","Jung-gu","Myeong-dong","1544-1122","http://www.cgv.co.kr/"
"BE_IW12-0345","CGV Myeongdong","Seoul","Jung-gu","Myeong-dong","1544-1122","http://www.cgv.co.kr/"
"BE_IW12-0346","CGV Myeongdong","Seoul","Jung-gu","Myeong-dong","1544-1122 ","www.cgv.co.kr/ "
"BE_IW12-0347","KTX Cinema","Seoul","Jung-gu","Pil-dong","02-2285-0818 ","http://www.ktxcinema.co.kr/"
"BE_IW12-0348","KTX Cinema","Seoul","Jung-gu","Pil-dong","02-2285-0818  ","http://www.ktxcinema.co.kr/ "
"BE_IW12-0349","Daehan Cinema","Seoul","Jung-gu","Gwanghui-dong","02-3393-3500","http://www.daehancinema.co.kr/"
"BE_IW12-0350","Daehan Cinema","Seoul","Jung-gu","Gwanghui-dong","02-3393-3500 ","http://www.daehancinema.co.kr/ "
"BE_IW12-0351","Lotte Cinema","Seoul","Jung-gu","Sogong-dong","1544-8855","http://www.lottecinema.co.kr/"
"BE_IW12-0352","Lotte Cinema Avenuel","Seoul","Jung-gu","Sogong-dong","1544-8855 ","http://www.lottecinema.co.kr/LHS/LHFS/Contents/CinemaInfo/Cinema.aspx?CinemaGroupCode=0001&CinemaCode=1001&ScreenType=100"
"BE_IW12-0353","Megabox Dongdaemun","Seoul","Jung-gu","Gwanghui-dong","02-1544-0600","http://www.megabox.co.kr/theaters/main_dongdaemun.aspx?TheaterCode=12"
"BE_IW12-0354","Megabox Dongdaemun","Seoul","Jung-gu","Gwanghui-dong","02-1544-0600 ","http://www.megabox.co.kr/theaters/main_dongdaemun.aspx?TheaterCode=12 "
"BE_IW12-0355","Seounl annimation Cinema","Seoul","Jung-gu","Pil-dong","02-3455-8341~2","http://cinema.ani.seoul.kr/"
"BE_IW12-0356","Seounl annimation Cinema","Seoul","Jung-gu","Pil-dong","02-3455-8341~2 ","http://cinema.ani.seoul.kr/ "
"BE_IW12-0357","Sponge House Gwanghwamun : Art Museum next to the Cinema ","Seoul","Jung-gu","Myeong-dong","02-2285-2095","http://www.spongehouse.com/"
"BE_IW12-0624","Seoul Central Market","Seoul","Jung-gu","Hwanghak-dong","02-2232-9559",""
"BE_IW12-0446","Dohwaseo Site","Seoul","Jung-gu","Myeong-dong","",""
"BE_IW12-0001","Niji&Pub(Myeongdong)","Seoul","Jung-gu","Myeong-dong","02-752-2221",""
"BE_IW12-0002","LoungeW","Seoul","Jung-gu","Jungnim-dong","02-313-2480","http://www.loungew.com"
"BE_IW12-0003","ScandinavianClub","Seoul","Jung-gu","Gwanghui-dong","02-2265-9964",""
"BE_IW12-0004","Family Buffet","Seoul","Jung-gu","Myeong-dong","02-773-1772",""
"BE_IW12-0005","Hoabin","Seoul","Jung-gu","Sogong-dong","02-757-0025","http://hoabinh.co.kr"
"BE_IW12-0006","Gangga","Seoul","Jung-gu","Myeong-dong","02-3783-0610","http://www.ganga.co.kr"
"BE_IW12-0007","Gisoya","Seoul","Jung-gu","Myeong-dong","02-774-0863",""
"BE_IW12-0008","Norita(Myeongdong)","Seoul","Jung-gu","Myeong-dong","02-774-1990","http://www.inolita.co.kr"
"BE_IW12-0009","MatchingMall","Seoul","Jung-gu","Myeong-dong","02-319-6352",""
"BE_IW12-0010","Megongcore","Seoul","Jung-gu","Jangchung-dong","02-2279-3936",""
"BE_IW12-0011","MyeongdongDonggas","Seoul","Jung-gu","Myeong-dong","02-776-5300",""
"BE_IW12-0012","Saboten Myeongdong.","Seoul","Jung-gu","Myeong-dong","02-756-4510",""
"BE_IW12-0013","OutbackSteakHouse(Seodaemun)","Seoul","Jung-gu","Sogong-dong","02-6323-2501","http://www.outback.co.kr/"
"BE_IW12-0014","OutbackSteakHouse(Sicheong)","Seoul","Jung-gu","Sogong-dong","02-754-5181","http://www.outback.co.kr/"
"BE_IW12-0015","OutbackSteakHouse(Hoehyun)","Seoul","Jung-gu","Hoehyeon-dong","02-3789-9501","http://www.outback.co.kr/"
"BE_IW12-0016","Ahababrica","Seoul","Jung-gu","Sogong-dong","02-753-7003",""
"BE_IW12-0017","UrbanGarden","Seoul","Jung-gu","Sogong-dong","02-777-2254","http://www.urbangarden.co.kr/"
"BE_IW12-0018","Zen Hideaway","Seoul","Jung-gu","Myeong-dong","02-776-1461","http://zenhideaway.com"
"BE_IW12-0019","Toenmaru","Seoul","Jung-gu","Myeong-dong","02-777-1529",""
"BE_IW12-0020","Palace","Seoul","Jung-gu","Hoehyeon-dong","02-728-1141",""
"BE_IW12-0021","PizzaMolrleymini","Seoul","Jung-gu","Myeong-dong","02-777-0988","http://www.pizzamall.com"
"BE_IW12-0022","HaneulJeongwon","Seoul","Jung-gu","Jangchung-dong","02-2266-9886",""
"BE_IW12-0023","(Yujinchamchi)front Cityhall Seosomundong","","","","",""
"BE_IW12-0024","(Yujinchamchi)front Cityhall Seosomundong","","","","",""
"BE_IW12-0025","Gana Japanese food","Seoul","Jung-gu","Myeong-dong","02-755-7495",""
"BE_IW12-0026","Dadohaesusan","Seoul","Jung-gu","Sogong-dong","02-755-9553",""
"BE_IW12-0027","DongsinChamchi","Seoul","Jung-gu","Sogong-dong","02-3455-1837",""
"BE_IW12-0028","Donghae","","","","02-756-3321",""
"BE_IW12-0029","Donghae Japanese food","Seoul","Jung-gu","Myeong-dong","02-754-4161",""
"BE_IW12-0030","Donghae  sushi restaurant","Seoul","Jung-gu","Sindang5-dong","02-2253-5280",""
"BE_IW12-0031","Maknae sushi restaurant","Seoul","Jung-gu","Hoehyeon-dong","02-776-6445",""
"BE_IW12-0032","Midori Japanese food","Seoul","Jung-gu","Myeong-dong","02-776-5560",""
"BE_IW12-0033","Mijori","Seoul","Jung-gu","Sogong-dong","02-778-1131","http://www.fishjoy.co.kr"
"BE_IW12-0034","Boksusa Japanese food","Seoul","Jung-gu","Myeong-dong","02-752-7765",""
"BE_IW12-0035","Saboten Myugyo","Seoul","Jung-gu","Myeong-dong","02-2006-1982",""
"BE_IW12-0036","SajoChamchi","Seoul","Jung-gu","Myeong-dong","02-771-8884",""
"BE_IW12-0037","Saho Tuna","Seoul","Jung-gu","Sogong-dong","02-757-9838",""
"BE_IW12-0038","Samwon","Seoul","Jung-gu","Myeong-dong","02-777-3680",""
"BE_IW12-0039","Seogang japanese food","Seoul","Jung-gu","Gwanghui-dong","02-2267-9959",""
"BE_IW12-0040","Seongjin","Seoul","Jung-gu","Myeong-dong","02-2269-5551",""
"BE_IW12-0041","Songwonbokjib","Seoul","Jung-gu","Myeong-dong","02-755-3979","http://www.songwonbok.co.kr"
"BE_IW12-0042","Sinradarangwon","Seoul","Jung-gu","Sogong-dong","02-771-6780","http://www.darangwon.co.kr"
"BE_IW12-0043","Sinwon","Seoul","Jung-gu","Myeong-dong","02-736-8000",""
"BE_IW12-0044","Orae bokjib","Seoul","Jung-gu","Jangchung-dong","02-2266-9224",""
"BE_IW12-0045","Oryukdo ","Seoul","Jung-gu","Gwanghui-dong","02-2265-5420",""
"BE_IW12-0046","Oryukdo Japanese food","Seoul","Jung-gu","Gwanghui-dong","02-2268-0592",""
"BE_IW12-0047","Oyang Tuna","Seoul","Jung-gu","Sogong-dong","02-736-1001",""
"BE_IW12-0048","YujinChamchi","Seoul","Jung-gu","Sogong-dong","02-754-9900",""
"BE_IW12-0049","Leekyungja Gangreungjib","Seoul","Jung-gu","Hoehyeon-dong","02-318-8981",""
"BE_IW12-0050","Yisobe","Seoul","Jung-gu","Myeong-dong","02-736-4480",""
"BE_IW12-0051","Jaewoo","Seoul","Jung-gu","Gwanghui-dong","02-2272-4600",""
"BE_IW12-0052","Jijunghae","Seoul","Jung-gu","Sogong-dong","02-755-1505",""
"BE_IW12-0053","Jinya","Seoul","Jung-gu","Hoehyeon-dong","02-3783-7088",""
"BE_IW12-0054","Jinya","Seoul","Jung-gu","Hoehyeon-dong","02-3783-7088",""
"BE_IW12-0055","Cheongsong","Seoul","Jung-gu","Myeong-dong","02-2271-0001",""
"BE_IW12-0056","Haejo","Seoul","Jung-gu","Euljiro-dong","02-2268-3165",""
"BE_IW12-0057","Huibun Japanese food","Seoul","Jung-gu","Hoehyeon-dong","02-773-3337",""
"BE_IW12-0058","Daedongboseong","Seoul","Jung-gu","Hoehyeon-dong","02-778-8081",""
"BE_IW12-0059","Dukhwajang","Seoul","Jung-gu","Jangchung-dong","02-2279-4075",""
"BE_IW12-0060","Donggang","Seoul","Jung-gu","Sogong-dong","02-755-8404",""
"BE_IW12-0061","Dongbanghong","Seoul","Jung-gu","Myeong-dong","02-752-6732",""
"BE_IW12-0062","Dintaifung","Seoul","Jung-gu","Myeong-dong","",""
"BE_IW12-0063","DintaifungKorea","Seoul","Jung-gu","Myeong-dong","02-771-2783",""
"BE_IW12-0064","Mandari","Seoul","Jung-gu","Cheonggu-dong","02-2253-1139",""
"BE_IW12-0065","Myeongboseoung","Seoul","Jung-gu","Myeong-dong","02-775-5200",""
"BE_IW12-0066","Baejaebanjeom","Seoul","Jung-gu","Sogong-dong","02-752-7666",""
"BE_IW12-0067","Andongjang","Seoul","Jung-gu","Euljiro-dong","02-2266-3814",""
"BE_IW12-0068","","Seoul","Jung-gu","Sogong-dong","02-752-3201",""
"BE_IW12-0069","Araehyang","Seoul","Jung-gu","Hoehyeon-dong","02-752-3991",""
"BE_IW12-0070","Yewon","Seoul","Jung-gu","Hoehyeon-dong","02-778-1640",""
"BE_IW12-0071","Yehyang","Seoul","Jung-gu","Hoehyeon-dong","02-775-0468",""
"BE_IW12-0072","Yihwawon","Seoul","Jung-gu","Dasan-dong","02-2236-1888",""
"BE_IW12-0073","Jageumseong","Seoul","Jung-gu","Sogong-dong","02-775-3034",""
"BE_IW12-0074","Juraedeung","Seoul","Jung-gu","Sogong-dong","02-755-1539",""
"BE_IW12-0075","Junggukseong","Seoul","Jung-gu","Myeong-dong","02-779-5050",""
"BE_IW12-0076","HwaMyeong","Seoul","Jung-gu","Myeong-dong","02-757-6767",""
"BE_IW12-0077","KRMyeongdong Pork Rib Hangover Soup","Seoul","Jung-gu","Myeong-dong","02-778-7370",""
"BE_IW12-0078","Ganaan Pork Rib Hangover Soup","Seoul","Jung-gu","Dasan-dong","02-2234-5200",""
"BE_IW12-0079","Ganeunggolmyeongga","Seoul","Jung-gu","Jungnim-dong","02-312-6166",""
"BE_IW12-0080","GangnamDuck Back-boneStew","Seoul","Jung-gu","Donghwa-dong","02-2299-1090","http://www.onedang.com"
"BE_IW12-0081","Ganghodongbaek(Myeongdong)","Seoul","Jung-gu","Myeong-dong","02-777-6780",""
"BE_IW12-0082","Geobukyideung","Seoul","Jung-gu","Sindang5-dong","02-2232-2188",""
"BE_IW12-0083","Gyeongbokgung","Seoul","Jung-gu","Euljiro-dong","02-2266-2004","http://www.koreansteak.com"
"BE_IW12-0084","Gogung","Seoul","Jung-gu","Myeong-dong","02-776-3211","http://Ggogung.co.kr"
"BE_IW12-0085","Gogisarang","Seoul","Jung-gu","Gwanghui-dong","02-2265-6492",""
"BE_IW12-0086","GoryeoSamgyetang","Seoul","Jung-gu","Sogong-dong","02-752-9376",""
"BE_IW12-0087","Gosang","Seoul","Jung-gu","Myeong-dong","02-6030-8955","http://baru-gosang.com"
"BE_IW12-0088","Gohyangjib","Seoul","Jung-gu","Gwanghui-dong","02-2266-9166",""
"BE_IW12-0089","Golmokmatjib","","","","",""
"BE_IW12-0090","Gomguksijib","Seoul","Jung-gu","Myeong-dong","02-756-3249",""
"BE_IW12-0091","Gomcottjib","Seoul","Jung-gu","Myeong-dong","02-756-4010",""
"BE_IW12-0092","Gwanggaeto","","","","02-773-1300",""
"BE_IW12-0093","Gwangdong susan","Seoul","Jung-gu","Myeong-dong","02-2231-6042",""
"BE_IW12-0094","Gwanghwamun tofuchon","Seoul","Jung-gu","Sogong-dong","02-723-4883",""
"BE_IW12-0095","GupangHalmae Bossam","Seoul","Jung-gu","Sogong-dong","02-754-4353","http://www.gupangdol.com"
"BE_IW12-0096","Gunsan Cuttlefish","Seoul","Jung-gu","Myeong-dong","02-773-9393",""
"BE_IW12-0193","Woorim Myung-ga","Seoul","Jung-gu","Jungnim-dong","011-267-2452",""
"BE_IW12-0194","WoorimJeong","Seoul","Jung-gu","Sogong-dong","02-752-5939",""
"BE_IW12-0195","Woowa","Seoul","Jung-gu","Sogong-dong","02-753-3460",""
"BE_IW12-0196","Won-GrandMother Bonga","Seoul","Jung-gu","Hwanghak-dong","02-2232-3232",""
"BE_IW12-0197","Won-GrandMother Bossam in Yaksu","Seoul","Jung-gu","Dasan-dong","02-2235-7128","http://bossam.co.kr"
"BE_IW12-0198","Won-GrandMother Bonga","Seoul","Jung-gu","Hwanghak-dong","02-2232-3232",""
"BE_IW12-0199","Wolmae's Namwon Chueotang","Seoul","Jung-gu","Sogong-dong","02-757-9580",""
"BE_IW12-0200","Wolchon","Seoul","Jung-gu","Myeong-dong","02-756-2267",""
"BE_IW12-0201","Yoo-gojib Kalguksu(Noodle Soup)","Seoul","Jung-gu","Donghwa-dong","02-2253-2233",""
"BE_IW12-0202","YooJung restaurant","Seoul","Jung-gu","Sindang-dong","02-2232-5727",""
"BE_IW12-0203","Eunseong","Seoul","Jung-gu","Euljiro-dong","02-2266-6096",""
"BE_IW12-0204","Ginkgo Tree House","Seoul","Jung-gu","Sindang5-dong","02-2252-8836",""
"BE_IW12-0205","Leegachon","Seoul","Jung-gu","Myeong-dong","02-753-0223",""
"BE_IW12-0206","Jang-ga Ahn-ga","Seoul","Jung-gu","Pil-dong","02-2269-2432",""
"BE_IW12-0207","Janganga","Seoul","Jung-gu","Sogong-dong","02-752-6900",""
"BE_IW12-0208","Jangteo Bonga","Seoul","Jung-gu","Sogong-dong","02-3782-7292",""
"BE_IW12-0209","Jeonju Jungang Hall","Seoul","Jung-gu","Myeong-dong","02-776-3525",""
"BE_IW12-0210","Jeonju Pungnam Hall","Seoul","Jung-gu","Myeong-dong","02-736-2144",""
"BE_IW12-0211","Jungsungbon Shabu Suki","Seoul","Jung-gu","Gwanghui-dong","02-2269-5270",""
"BE_IW12-0212","Jeongtong Samgye-tang","Seoul","Jung-gu","Myeong-dong","02-2272-6900",""
"BE_IW12-0213","Jeil Garden","Seoul","Jung-gu","Myeong-dong","02-777-1137","http://www.02-777-6661.kti114.net/"
"BE_IW12-0214","Jeil Naengmyeon Charcoal Grilled Galbi","Seoul","Jung-gu","Sogong-dong","02-756-2166",""
"BE_IW12-0215","Jomaru","Seoul","Jung-gu","Pil-dong","02-2274-7933",""
"BE_IW12-0216","Joowon Mountain Duck","Seoul","Jung-gu","Gwanghui-dong","02-2273-2703",""
"BE_IW12-0217","Jungang Hall","Seoul","Jung-gu","Myeong-dong","02-776-3525",""
"BE_IW12-0218","Geo","Seoul","Jung-gu","Hoehyeon-dong","02-771-5731",""
"BE_IW12-0219","Jihwaja in Jangchung","Seoul","Jung-gu","Jangchung-dong","02-2269-5834","http://jihwajafood.co.kr"
"BE_IW12-0220","Jingogae","Seoul","Jung-gu","Pil-dong","02-2267-0955",""
"BE_IW12-0221","Jin tofu House","Seoul","Jung-gu","Jangchung-dong","02-2275-9345",""
"BE_IW12-0222","Jinmi Jokbal(Pigs' Feet)","Seoul","Jung-gu","Myeong-dong","02-752-0477",""
"BE_IW12-0223","Jinju Hall","Seoul","Jung-gu","Sogong-dong","02-753-5388",""
"BE_IW12-0224","CharmTaste Pork Back-bone Stew","Seoul","Jung-gu","Dasan-dong","02-2231-0240",""
"BE_IW12-0225","Cheonggiwa Bok house","Seoul","Jung-gu","Dasan-dong","02-2232-5688",""
"BE_IW12-0226","Cheongmokwon","Seoul","Jung-gu","Hoehyeon-dong","02-779-4722",""
"BE_IW12-0227","Cheongsongok","Seoul","Jung-gu","Sogong-dong","02-754-1547",""
"BE_IW12-0228","Chungmu-style Gimbap","Seoul","Jung-gu","Myeong-dong","02-755-8488",""
"BE_IW12-0229","Chungmuro Ribs of Pork","Seoul","Jung-gu","Pil-dong","02-272-6428",""
"BE_IW12-0230","Chungmu House","Seoul","Jung-gu","Myeong-dong","02-776-4088",""
"BE_IW12-0231","Taejin Charcoal Grilled Galbi","Seoul","Jung-gu","Myeong-dong","02-735-9272",""
"BE_IW12-0232","Torangto","Seoul","Jung-gu","Sindang-dong","02-2236-5274",""
"BE_IW12-0233","Pyeongnaeok","Seoul","Jung-gu","Euljiro-dong","02-2267-5892",""
"BE_IW12-0234","Pyeongyang Myeonok(Jangchung-dong)","Seoul","Jung-gu","Jangchung-dong","02-267-7784",""
"BE_IW12-0235","Pyeongog chik naengmyeon","Seoul","Jung-gu","Hwanghak-dong","02-2252-4555",""
"BE_IW12-0236","Pyeongchang Beef Teacher","Seoul","Jung-gu","Sogong-dong","02-739-8819",""
"BE_IW12-0237","Pulhyanggi","Seoul","Jung-gu","Jangchung-dong","02-2265-1320",""
"BE_IW12-0238","Pildong Myeonok","Seoul","Jung-gu","Pil-dong","02-2266-2611",""
"BE_IW12-0239","Hanuso(in Hoehyeon)","Seoul","Jung-gu","Hoehyeon-dong","02-3789-9904","www.hanuso.com"
"BE_IW12-0240","Hadongkwan","Seoul","Jung-gu","Myeong-dong","02-776-5656","http://www.hadongkwan.com"
"BE_IW12-0241","Korea House","Seoul","Jung-gu","Pil-dong","02-2266-9101~3","http://www.koreahouse.or.kr"
"BE_IW12-0242","Hansungok","Seoul","Jung-gu","Jangchung-dong","02-2264-2066",""
"BE_IW12-0243","Hanuri Hardwood Charcoal House","Seoul","Jung-gu","Gwanghui-dong","02-2265-8803",""
"BE_IW12-0244","Hanchang Garden","Seoul","Jung-gu","Jungnim-dong","02-756-4551",""
"BE_IW12-0245","Hamheung Naengmyeon","Seoul","Jung-gu","Gwanghui-dong","02-2267-9500",""
"BE_IW12-0246","Hamheung Naengmyeon(in Yaksu)","Seoul","Jung-gu","Dasan-dong","02-2237-8778",""
"BE_IW12-0247","Hatsalmaru","Seoul","Jung-gu","Hoehyeon-dong","02-777-9227",""
"BE_IW12-0248","Hwaseong","Seoul","Jung-gu","Myeong-dong","",""
"BE_IW12-0249","Bull House","Seoul","Jung-gu","Pil-dong","02-2273-0929",""
"BE_IW12-0250","Hwangtogol","Seoul","Jung-gu","Gwanghui-dong","02-2263-1384",""
"BE_IW12-0251","National Theather of Korea","Seoul","Jung-gu","Jangchung-dong","02-2280-4114 ","http://www.ntok.go.kr/index.do"
"BE_IW12-0252","National Theather of Korea","Seoul","Jung-gu","Jangchung-dong","02-2280-4114",""
"BE_IW12-0253","Namsan Arts Center","Seoul","Jung-gu","Myeong-dong","",""
"BE_IW12-0254","Namsan Arts Center","Seoul","Jung-gu","Pil-dong","02-758-2000","http://www.nsartscenter.or.kr/"
"BE_IW12-0255","Walking along Deoksugoung Stonewall Walkway can see Chongdong Theater","","","","",""
"BE_IW12-0256","Myeong-dong (Samil-ro) Changgo Theater","Seoul","Jung-gu","Myeong-dong","02-319-8021","http://cafe.naver.com/samilro/"
"BE_IW12-0257","Myeong-dong NANTA Theatre","Seoul","Jung-gu","Sogong-dong","02-739-8288","http://nanta.i-pmc.co.kr/about/place_myeongdong.asp"
"BE_IW12-0258","Myeong-dong NANTA Theatre","","","","02-739-8288 ","http://nanta.i-pmc.co.kr/ "
"BE_IW12-0259","Myeongdong Catholic Cathedral Hall Kkoseuteu","Seoul","Jung-gu","Myeong-dong","02-778-6295",""
"BE_IW12-0260","Myeongdong Catholic Cathedral Hall Kkoseuteu","Seoul","Jung-gu","Myeong-dong","",""
"BE_IW12-0261","Myeongdong Theater","Seoul","Jung-gu","Myeong-dong","1644-2003","http://www.mdtheater.or.kr/home/main.aspx"
"BE_IW12-0262","Myeongdong Theater","Seoul","Jung-gu","Myeong-dong","1644-2003","http://www.MDtheater.or.kr"
"BE_IW12-0263","Myeongdong Theater","Seoul","Jung-gu","Myeong-dong","",""
"BE_IW12-0264","Myeong-dong Changgo Theater","Seoul","Jung-gu","Myeong-dong","",""
"BE_IW12-0265","Myungbo Art Hall","","","","02-2274-2121","http://www.myungbo.com/"
"BE_IW12-0266","Myungbo Art Hall","","","","02-2274-2121 ","http://www.myungbo.com/ "
"BE_IW12-0267","Munhwailbo Hall","Seoul","Jung-gu","Sogong-dong","02-3701-5754","http://hall.munhwa.com/"
"BE_IW12-0268","Munhwailbo Hall","","","","",""
"BE_IW12-0269","Seoul Namsan Traditional Theater","Seoul","Jung-gu","Pil-dong","02-2261-0515","http://www.sejongpac.or.kr/sngad/"
"BE_IW12-0270","Seoul Namsan Traditional Theater","Seoul","Jung-gu","Pil-dong","02-2261-0515 ","http://www.sejongpac.or.kr/sngad/ "
"BE_IW12-0271","Seoul Animation Center","Seoul","Jung-gu","Pil-dong","02-3455-8341~2","http://www.ani.seoul.kr/potal/index.jsp"
"BE_IW12-0272","Seoul Animation Center","Seoul","Jung-gu","Pil-dong","",""
"BE_IW12-0273","Seoul Fashion Art Hall","Seoul","Jung-gu","Sindang-dong","02-3670-4567","http://www.sfdc.seoul.kr/about/service/display.asp"
"BE_IW12-0274","Seoul Fashion Art Hall","Seoul","Jung-gu","Sindang-dong","",""
"BE_IW12-0275","Yeohae Cultural Space","Seoul","Jung-gu","Gwanghui-dong","02-2274-0161",""
"BE_IW12-0276","Yeohae Cultural Space","Seoul","Jung-gu","Gwanghui-dong","",""
"BE_IW12-0277","Ihwa Woman High School Centennial Anniversary Memorial Hall","Seoul","Jung-gu","Sogong-dong","02-777-4257~8 ","http://www.ewha100.com/"
"BE_IW12-0278","Ihwa Woman High School Centennial Anniversary Memorial Hall","Seoul","Jung-gu","Sogong-dong","02-777-4257~8 ","http://www.ewha100.com/"
"BE_IW12-0279","Ihwa Woman High School Centennial Anniversary Memorial Hall","Seoul","Jung-gu","Sogong-dong","",""
"BE_IW12-0280","Chongdong Theater","Seoul","Jung-gu","Sogong-dong","02-751-1500","http://miso.chongdong.com/"
"BE_IW12-0099","Kummoon","Seoul","Jung-gu","Sogong-dong","02-756-0415",""
"BE_IW12-0100","Nadohyang","Seoul","Jung-gu","Myeong-dong","02-752-2000",""
"BE_IW12-0101","Nakdonggang River","Seoul","Jung-gu","Myeong-dong","02-777-1797",""
"BE_IW12-0102","Nammun Tobang","Seoul","Jung-gu","Hoehyeon-dong","02-778-6727",""
"BE_IW12-0103","Namsan Mauntain Seolleongtang(Ox Bone Soup)","Seoul","Jung-gu","Pil-dong","02-777-3959",""
"BE_IW12-0104","Namwon Jeong","Seoul","Jung-gu","Myeong-dong","02-736-4481",""
"BE_IW12-0105","Namwon Chueotang","Seoul","Jung-gu","Euljiro-dong","02-2265-2394",""
"BE_IW12-0106","Nampo Myeonok","Seoul","Jung-gu","Myeong-dong","02-777-2269",""
"BE_IW12-0107","Neutinamu And gomiboki","Seoul","Jung-gu","Sindang-dong","02-2234-9713",""
"BE_IW12-0108","Neutinamu House","Seoul","Jung-gu","Jangchung-dong","02-186-74",""
"BE_IW12-0109","Dachai","Seoul","Jung-gu","Sindang-dong","02-2231-3392","http://dachai.co.kr"
"BE_IW12-0110","Dalgaebi","Seoul","Jung-gu","Sogong-dong","02-763-3434","http://www.dalgaebi.com"
"BE_IW12-0111","Chicken hanmari Pork hangeun","Seoul","Jung-gu","Jangchung-dong","02-2285-5988",""
"BE_IW12-0112","Damyang Charcoal Grilled Short Rib Patties","Seoul","Jung-gu","Yaksu-dong","02-2233-8569",""
"BE_IW12-0113","Daerim Jeong","Seoul","Jung-gu","Gwanghui-dong","02-266-2678","http://www.daerimjung.com/"
"BE_IW12-0114","Daebok","Seoul","Jung-gu","Gwanghui-dong","02-2275-7221",""
"BE_IW12-0115","Daebok House","Seoul","Jung-gu","Sogong-dong","02-755-0189","http://bookfood.net"
"BE_IW12-0116","Daewon","Seoul","Jung-gu","Myeong-dong","02-776-1124",""
"BE_IW12-0117","Daewon House","Seoul","Jung-gu","Myeong-dong","02-777-2038",""
"BE_IW12-0118","Dae Jang Geum","Seoul","Jung-gu","Jangchung-dong","02-2233-3113",""
"BE_IW12-0119","Dae Jang Geum Korean Table d'hote","Seoul","Jung-gu","Jangchung-dong","02-2233-3113",""
"BE_IW12-0120","Dongung","Seoul","Jung-gu","Myeong-dong","02-756-1362",""
"BE_IW12-0121","Donghae Raw Fish Restaurant","Seoul","Jung-gu","Sindang5-dong","02-2253-5280",""
"BE_IW12-0122","Deungchon Shabu-shabu Kalguksu(Noodle Soup)","Seoul","Jung-gu","Dasan-dong","02-2231-0779",""
"BE_IW12-0123","Madang House","Seoul","Jung-gu","Sogong-dong","02-755-6616",""
"BE_IW12-0124","Manpo House","Seoul","Jung-gu","Gwanghui-dong","02-2267-3934",""
"BE_IW12-0125","Malddugi Pork Back-bone Stew","Seoul","Jung-gu","Jangchung-dong","02-2273-1341",""
"BE_IW12-0126","Myeong-Dong Kyoja","Seoul","Jung-gu","Myeong-dong","02-776-5348","http://mdkj.co.kr "
"BE_IW12-0127","Myeongdong Budae-jjigae(Sausage Stew)","Seoul","Jung-gu","Myeong-dong","02-752-6800",""
"BE_IW12-0128","Myeongdong Budae-jjigae(Sausage Stew)","Seoul","Jung-gu","Myeong-dong","02-752-6800",""
"BE_IW12-0129","Myeongdong Samgye-tang","Seoul","Jung-gu","Myeong-dong","02-778-7370",""
"BE_IW12-0130","Myeongdong jumulleok(Marinated Grilled)","Seoul","Jung-gu","Myeong-dong","02-752-9292",""
"BE_IW12-0131","Myeongdong Hamheung Myeonok","Seoul","Jung-gu","Myeong-dong","02-776-8430",""
"BE_IW12-0132","Moran","Seoul","Jung-gu","Sogong-dong","02-778-9450",""
"BE_IW12-0133","Moguchon Myungga","Seoul","Jung-gu","Sogong-dong","02-6399-0301",""
"BE_IW12-0134","Mokpo Nakji(Octopus)","Seoul","Jung-gu","Donghwa-dong","02-2232-2362",""
"BE_IW12-0135","Mokpo Sebal Nakji(Octopus with three legs)","Seoul","Jung-gu","Myeong-dong","02-777-7143",""
"BE_IW12-0136","Mujinjang","Seoul","Jung-gu","Sindang-dong","02-2232-5566",""
"BE_IW12-0137","Munhwaok","Seoul","Jung-gu","Euljiro-dong","02-265-0322",""
"BE_IW12-0138","Migak","Seoul","Jung-gu","Euljiro-dong","02-2267-3438",""
"BE_IW12-0139","MiniMani","Seoul","Jung-gu","Myeong-dong","02-757-9279",""
"BE_IW12-0140","Mijeong Galbi","Seoul","Jung-gu","Myeong-dong","02-2266-4281",""
"BE_IW12-0141","Mihyang Korean Table d'hote","Seoul","Jung-gu","Myeong-dong","02-737-9333",""
"BE_IW12-0142","Bau's Bossam","Seoul","Jung-gu","Myeong-dong","02-776-9644",""
"BE_IW12-0143","Bangil Haejang-guk(Hangover Soup)","Seoul","Jung-gu","Sogong-dong","02-723-0049",""
"BE_IW12-0144","Baeksang","Seoul","Jung-gu","Pil-dong","02-2263-7700",""
"BE_IW12-0145","Baeksong Hall","Seoul","Jung-gu","Hwanghak-dong","02-2233-7672",""
"BE_IW12-0146","Bonga Original Chicken hanmari","Seoul","Jung-gu","Euljiro-dong","02-2274-2986",""
"BE_IW12-0147","Bonga House Tojong(Native) Sundae","Seoul","Jung-gu","Pil-dong","02-2265-5595",""
"BE_IW12-0148","Bong-hee Seolleongtang(Ox Bone Soup)","Seoul","Jung-gu","Gwanghui-dong","02-2267-0202",""
"BE_IW12-0149","Bong-hee Seolleongtang(Ox Bone Soup)","Seoul","Jung-gu","Gwanghui-dong","02-2267-0202",""
"BE_IW12-0150","Busan Galbi","Seoul","Jung-gu","Gwanghui-dong","02-2279-5821",""
"BE_IW12-0151","SanJeong","Seoul","Jung-gu","Jangchung-dong","02-2266-9224",""
"BE_IW12-0152","Samdae Naengmyeon","Seoul","Jung-gu","Myeong-dong","02-752-6800",""
"BE_IW12-0153","Samsugabsan","Seoul","Jung-gu","Hoehyeon-dong","02-771-7187",""
"BE_IW12-0154","Samchully","Seoul","Jung-gu","Myeong-dong","02-776-2361",""
"BE_IW12-0155","Shabu-Gung Shabu-Ga","Seoul","Jung-gu","Sogong-dong","02-757-4582",""
"BE_IW12-0156","Seoul Ttukbaegi","Seoul","Jung-gu","Myeong-dong","02-2263-0596",""
"BE_IW12-0157","Seoul Myung Charcoal Grilled Galbi","Seoul","Jung-gu","Hwanghak-dong","02-2235-9288",""
"BE_IW12-0158","Seoul Samgye-tang","Seoul","Jung-gu","Euljiro-dong","02-2263-1743",""
"BE_IW12-0159","Seoul Samgye-tang(Nutrition Center)","Seoul","Jung-gu","Sogong-dong","02-775-4300",""
"BE_IW12-0160","Seokssanjeong","Seoul","Jung-gu","Euljiro-dong","02-2266-9494",""
"BE_IW12-0161","Seokcheon","Seoul","Jung-gu","Hoehyeon-dong","02-756-5949",""
"BE_IW12-0162","Serim","Seoul","Jung-gu","Myeong-dong","",""
"BE_IW12-0163","Sokcho House","Seoul","Jung-gu","Sogong-dong","02-775-2226",""
"BE_IW12-0164","Son-ga Myung-ga","Seoul","Jung-gu","Myeong-dong","02-777-1013",""
"BE_IW12-0165","SongWon","Seoul","Jung-gu","Jangchung-dong","02-266-8159",""
"BE_IW12-0166","SongJeong","Seoul","Jung-gu","Gwanghui-dong","02-2268-0592",""
"BE_IW12-0167","SongJeong","Seoul","Jung-gu","Gwanghui-dong","02-2268-0592",""
"BE_IW12-0168","SotJeongWon","Seoul","Jung-gu","Myeong-dong","02-3785-3114",""
"BE_IW12-0169","Sinchon Seolleongtang(Ox Bone Soup)","Seoul","Jung-gu","Hoehyeon-dong","02-6456-8772","http://sinchonfood.net"
"BE_IW12-0170","Agurang Kkotgerang","Seoul","Jung-gu","Jangchung-dong","02-2263-5554",""
"BE_IW12-0171","Arirang Garden","Seoul","Jung-gu","Pil-dong","02-2273-7507",""
"BE_IW12-0172","Amiso(Myungdong A Head Office)","Seoul","Jung-gu","Myeong-dong","02-756-3317",""
"BE_IW12-0173","I Love Sindang-dong Topokki","Seoul","Jung-gu","Sindang-dong","02-2232-7872","http://www.ilovesindangdong.co.kr"
"BE_IW12-0174","Yaksu Hanbang Samgye-tang","Seoul","Jung-gu","Dasan-dong","02-2252-9775",""
"BE_IW12-0175","Yangmiok","Seoul","Jung-gu","Euljiro-dong","02-2275-8837",""
"BE_IW12-0176","Ungteori Saeng Gogi","Seoul","Jung-gu","Sogong-dong","011-260-7912",""
"BE_IW12-0177","Ungteori Saeng Gogi","Seoul","Jung-gu","Dasan-dong","02-2232-6362","http://ungteori.com"
"BE_IW12-0178","Yenmeol","Seoul","Jung-gu","Sindang-dong","02-2238-0202",""
"BE_IW12-0179","OhDaegam ","Seoul","Jung-gu","Myeong-dong","02-776-1515",""
"BE_IW12-0180","Obokjeong","Seoul","Jung-gu","Sogong-dong","02-755-1551",""
"BE_IW12-0181","Osinjeong","Seoul","Jung-gu","Pil-dong","02-2273-3031","http://osinjung.com"
"BE_IW12-0182","Ojang Galbi","Seoul","Jung-gu","Gwanghui-dong","02-2267-9328",""
"BE_IW12-0183","Ojang-dong Bok-House","Seoul","Jung-gu","Gwanghui-dong","02-2268-6771",""
"BE_IW12-0184","Ojang-dong Sinchang Myeonok","Seoul","Jung-gu","Gwanghui-dong","02-2273-4889",""
"BE_IW12-0185","Ojang-dong Hamheung Naengmyeon","Seoul","Jung-gu","Cheonggu-dong","02-2234-2121",""
"BE_IW12-0186","Ojang-dong Bok-House","Seoul","Jung-gu","Gwanghui-dong","011-739-8515",""
"BE_IW12-0187","Ojang-dong Heungnam House","Seoul","Jung-gu","Gwanghui-dong","02-2266-0735",""
"BE_IW12-0188","OkdolJeong","Seoul","Jung-gu","Pil-dong","02-2266-2409",""
"BE_IW12-0189","Yonggung Seafood Shabu Suki","Seoul","Jung-gu","Myeong-dong","02-777-3536",""
"BE_IW12-0190","Yongsusan","Seoul","Jung-gu","Myeong-dong","02-771-5553","http://www.yongsusan.co.kr"
"BE_IW12-0191","WoolaeOk","Seoul","Jung-gu","Euljiro-dong","02-265-0151",""
"BE_IW12-0625","Sungnyemun Imports Store","Seoul","Jung-gu","Hoehyeon-dong","02-3455-3133 ",""
"BE_IW12-0626","Sungnyemun Imports Store","Seoul","Jung-gu","Hoehyeon-dong","02-3455-3133 ",""
"BE_IW12-0627","Sinjungbu Market","Seoul","Jung-gu","Gwanghui-dong","02-2273-0006 ",""
"BE_IW12-0628","Sinjungbu Market","Seoul","Jung-gu","Gwanghui-dong","02-2273-0006 ",""
"BE_IW12-0629","SHINPHYEONGHWA Fashion Town","Seoul","Jung-gu","Sindang-dong","02-2238-6813","http://www.sph.co.kr/"
"BE_IW12-0630","Area Six","Seoul","Jung-gu","Sindang-dong","02-2238-4914",""
"BE_IW12-0631","Attraction of Foreigner Tourist - Namdaemun Market","","","","",""
"BE_IW12-0632","Jayu Shopping District","Seoul","Jung-gu","Jangchung-dong","02-755-7106 ",""
"BE_IW12-0633","Jayu Shopping District","Seoul","Jung-gu","Hoehyeon-dong","02-755-7106 ",""
"BE_IW12-0634","Jeil Pyeonghwa Market","Seoul","Jung-gu","Sindang-dong","02-2252-6744~5 ","http://www.jeilpyunghwa.com/ "
"BE_IW12-0635","Jeil Pyeonghwa Market","Seoul","Jung-gu","Sindang-dong","02-2252-6744~5 ","http://www.jeilpyunghwa.com/ "
"BE_IW12-0636","Jungbu Market","","","","02-2267-5617  ",""
"BE_IW12-0637","Jungbu Market","Seoul","Jung-gu","Gwanghui-dong","02-2267-5617  ",""
"BE_IW12-0638","Cheongpyeonghwa Market","Seoul","Jung-gu","Sindang-dong","02-2252-8036","http://www.cph.co.kr"
"BE_IW12-0639","Cheongpyeonghwa Market","Seoul","Jung-gu","Sindang-dong","02-2252-8036","http://www.cph.co.kr"
"BE_IW12-0640","Tongil Market","Seoul","Jung-gu","Gwanghui-dong","",""
"BE_IW12-0641","Tongil Market","Seoul","Jung-gu","Gwanghui-dong","",""
"BE_IW12-0642","Pyeonghwa Market","Seoul","Jung-gu","Gwanghui-dong","02-2265-3533 ","http://www.pyounghwa.com/  "
"BE_IW12-0643","Pyeonghwa Market","Seoul","Jung-gu","Gwanghui-dong","02-2265-3533 ","http://www.pyounghwa.com/  "
"BE_IW12-0644","Grand Ambassador","Seoul","Jung-gu","Jangchung-dong","02-2275-1101","https://www.ambatel.com/FrontSite/Ambassador/gate/default.aspx"
"BE_IW12-0645","New Oriental Tourist Hotel","Seoul","Jung-gu","Hoehyeon-dong","02-753-0701",""
"BE_IW12-0646","New International Hotel","Seoul","Jung-gu","Myeong-dong","02-732-0161","http://www.newkukjehotel.com/"
"BE_IW12-0647","New-Cheonji Hotel","Seoul","Jung-gu","Euljiro-dong","02-2265-6131",""
"BE_IW12-0648","Ramada Hotel and Suites Seoul Central","Seoul","Jung-gu","Hoehyeon-dong","02-2119-8900","http://www.ramada-central.com/"
"BE_IW12-0649","LOTTE Hotel","Seoul","Jung-gu","Myeong-dong","02-771-1000","http://www.lottehotel.com/"
"BE_IW12-0650","Loisir Hotel Myeong-dong Seoul","Seoul","Jung-gu","Myeong-dong","02-6936-6000",""
"BE_IW12-0651","Metro Hotel","Seoul","Jung-gu","Myeong-dong","02-752-1112","http://www.metrohotel.co.kr/"
"BE_IW12-0652","Millennium Seoul Hilton","Seoul","Jung-gu","Hoehyeon-dong","02-753-7788","http://www.hilton.co.kr/"
"BE_IW12-0653","Banyantree Club and Spa Seoul","Seoul","Jung-gu","Jangchung-dong","02-2250-8000","http://www.banyantreeclub.net/"
"BE_IW12-0654","Best Winston New Seoul Hotel","Seoul","Jung-gu","Myeong-dong","02-735-8800","http://www.bestwesternnewseoul.com/"
"BE_IW12-0655","Best Western Hotel Kukdo","Seoul","Jung-gu","Euljiro-dong","02-6466-1234","http://www.hotelkukdo.com/"
"BE_IW12-0656","Savoy Hotel","Seoul","Jung-gu","Myeong-dong","02-776-2641","https://www.savoyhotel.co.kr/html/kor/wc/index.asp"
"BE_IW12-0657","Seoul Royal Hotel","Seoul","Jung-gu","Myeong-dong","02-756-1112 ","http://www.royal.co.kr/ "
"BE_IW12-0658","Seoul Prince Hotel","Seoul","Jung-gu","Myeong-dong","02-752-7111","http://www.princeseoul.co.kr/"
"BE_IW12-0659","Seoul Rex Hotel","Seoul","Jung-gu","Hoehyeon-dong","02-752-3191","http://www.hotelrex.co.kr/"
"BE_IW12-0660","Seoul Royal Hotel","","","","02-756-1112","http://www.royal.co.kr/"
"BE_IW12-0661","Sejong Hotel","Seoul","Jung-gu","Myeong-dong","02-773-6000","http://www.sejong.co.kr/"
"BE_IW12-0662","Summit Hotel","Seoul","Jung-gu","Jangchung-dong","02-2285-0540","http://www.summithotelseoul.com/"
"BE_IW12-0663","Astoria Hotel","Seoul","Jung-gu","Jangchung-dong","02-2275-1101",""
"BE_IW12-0664","Acacia Hotel","Seoul","Jung-gu","Euljiro-dong","02-2277-4917~21","http://www.hotelacacia.co.kr/"
"BE_IW12-0665","Westin Joseon Hotel","Seoul","Jung-gu","Sogong-dong","02-771-0500","http://twc.echosunhotel.com/"
"BE_IW12-0666","Ibis Ambassador Myeong-dong","Seoul","Jung-gu","Myeong-dong","02-6272-1101","https://ibis.ambatel.com/FrontSite/ibis/myeongdong/intro.aspx "
"BE_IW12-0667","East Gate Tower Hotel","Seoul","Jung-gu","Gwanghui-dong","02-3407-0700","http://www.eastgatehotel.kr/"
"BE_IW12-0668","Koreana Hotel","Seoul","Jung-gu","Myeong-dong","02-2171-7000","http://www.koreanahotel.com/"
"BE_IW12-0669","Palace Hotel","Seoul","Jung-gu","Hoehyeon-dong","02-777-7731",""
"BE_IW12-0670","Pacific Hotel","Seoul","Jung-gu","Myeong-dong","02-777-7811","http://www.thepacifichotel.co.kr/"
"BE_IW12-0671","Fraser Place Central Seoul","Seoul","Jung-gu","Sogong-dong","02-2220-8888 ","http://www.fraserplace.co.kr/ "
"BE_IW12-0672","Fraser Place Central Seoul","Seoul","Jung-gu","Jungnim-dong","02-2220-8888","http://www.fraserplace.co.kr/"
"BE_IW12-0673","President Hotel","Seoul","Jung-gu","Myeong-dong","02-753-3131","http://www.hotelpresident.co.kr/korean/"
"BE_IW12-0674","President Hotel","Seoul","Jung-gu","Myeong-dong","02-753-3131","http://www.hotelpresident.co.kr/korean/"
"BE_IW12-0675","Plaza Hotel","Seoul","Jung-gu","Sogong-dong","02-771-2200 ","http://www.hoteltheplaza.com/kor/"
"BE_IW12-0676","Hotel PJ","Seoul","Jung-gu","Gwanghui-dong","02-2280-7000","http://www.hotelpj.co.kr/"
"BE_IW12-0677","Hotel SHILLA","Seoul","Jung-gu","Jangchung-dong","02-2233-3131","http://www.shilla.net/kr/seoul/index.jsp"
"BE_IW12-0097","Gwongamyeongga","Seoul","Jung-gu","Gwanghui-dong","02-2278-7379",""
"BE_IW12-0098","Kumgang Bubbling Seokkeo Jjigae","Seoul","Jung-gu","Myeong-dong","02-779-3610",""
"BE_IW12-0447","Tongnip Publishing Company Site","Seoul","Jung-gu","Sogong-dong","",""
"BE_IW12-0448","Dongak Teacher World of Poetry","Seoul","Jung-gu","Pil-dong","",""
"BE_IW12-0449","Dongyang Cinema Site","Seoul","Jung-gu","Sogong-dong","",""
"BE_IW12-0450","Dongpyeonggwan Site","Seoul","Jung-gu","Gwanghui-dong","",""
"BE_IW12-0451","Manhae Hanyong-un Monument","Seoul","Jung-gu","Pil-dong","",""
"BE_IW12-0452","Myeongnegung Site","Seoul","Jung-gu","Sogong-dong","",""
"BE_IW12-0453","Mokmyeoksan Beacon Fire Station Site","Seoul","Jung-gu","Pil-dong","",""
"BE_IW12-0454","Muyo Site","Seoul","Jung-gu","Myeong-dong","",""
"BE_IW12-0455","Park eung Jin Monument","Seoul","Jung-gu","Euljiro-dong","",""
"BE_IW12-0456","Pak Paengnyeon Site","Seoul","Jung-gu","Pil-dong","",""
"BE_IW12-0457","Anticommunism young man Movement Monument Memorial","Seoul","Jung-gu","Pil-dong","",""
"BE_IW12-0458","Paejae School Site Namgung Site","Seoul","Jung-gu","Sogong-dong","",""
"BE_IW12-0459","Statue of Kim Koo teacher","Seoul","Jung-gu","Hoehyeon-dong","",""
"BE_IW12-0460","Site of Bumingwan bomb attack","Seoul","Jung-gu","Myeong-dong","",""
"BE_IW12-0461","Site of Sangjinhouse","Seoul","Jung-gu","Sogong-dong","",""
"BE_IW12-0462","Site of Seosomun Station","Seoul","Jung-gu","Sogong-dong","",""
"BE_IW12-0463","Site of Seohakdang","Seoul","Jung-gu","Sogong-dong","",""
"BE_IW12-0464","Seonhyecheong Site","Seoul","Jung-gu","Hoehyeon-dong","",""
"BE_IW12-0465","Statue of Lee si yeong teacher","Seoul","Jung-gu","Hoehyeon-dong","",""
"BE_IW12-0466","Sodeokmun Site","Seoul","Jung-gu","Sogong-dong","",""
"BE_IW12-0467","Bust of Son Kee Chung","Seoul","Jung-gu","Jungnim-dong","",""
"BE_IW12-0468","Sontag Hotel site","Seoul","Jung-gu","Sogong-dong","",""
"BE_IW12-0469","Suretkkol","Seoul","Jung-gu","Sogong-dong","",""
"BE_IW12-0470","Shuncheong site","Seoul","Jung-gu","Sogong-dong","",""
"BE_IW12-0471","Guard barracks site","Seoul","Jung-gu","Sogong-dong","",""
"BE_IW12-0472","Ssanghoejeong site","Seoul","Jung-gu","Hoehyeon-dong","",""
"BE_IW12-0473","Statue of AhnJunggeun","Seoul","Yongsan-gu","Huam-dong","",""
"BE_IW12-0474","Yangsungji home","Seoul","Jung-gu","Euljiro-dong","",""
"BE_IW12-0475","Yanghyangcheong site","Seoul","Jung-gu","Myeong-dong","",""
"BE_IW12-0476","Eoseogak Pavilion site","Seoul","Jung-gu","Sogong-dong","",""
"BE_IW12-0477","Yeomchocheong site","Seoul","Jung-gu","Euljiro-dong","",""
"BE_IW12-0478","Youngheejeon site","Seoul","Jung-gu","Euljiro-dong","",""
"BE_IW12-0479","Yebinsi site","Seoul","Jung-gu","Sogong-dong","",""
"BE_IW12-0480","Oesol Choi Hyun bae teacher Monument Memorial","Seoul","Jung-gu","Jangchung-dong","",""
"BE_IW12-0481","Statue of Yu Gwang sun","Seoul","Jung-gu","Jangchung-dong","",""
"BE_IW12-0482","Yuseongnyong site","Seoul","Jung-gu","Pil-dong","",""
"BE_IW12-0483","Statue of the Yujung Reverend Samyeong","Seoul","Jung-gu","Jangchung-dong","",""
"BE_IW12-0484","Statue of General Yun Gwan","Seoul","Jung-gu","Jungnim-dong","",""
"BE_IW12-0485","Yun seon-do teacher site","Seoul","Jung-gu","Myeong-dong","",""
"BE_IW12-0486","Eunsung bar site","Seoul","Jung-gu","Myeong-dong","",""
"BE_IW12-0487","Euppaekttang site","Seoul","Jung-gu","Pil-dong","",""
"BE_IW12-0488","Lee deok hyung site","Seoul","Jung-gu","Hoehyeon-dong","",""
"BE_IW12-0489","Imun site","Seoul","Jung-gu","Sogong-dong","",""
"BE_IW12-0490","Lee byeok site","Seoul","Jongno-gu","Jongno1.2.3.4ga-dong","",""
"BE_IW12-0491","Lee jae myeong deed site","Seoul","Jung-gu","Myeong-dong","",""
"BE_IW12-0492","Lee chung sun suicide site","Seoul","Jung-gu","Sogong-dong","",""
"BE_IW12-0493","Lee han eung teacher Monument Memorial","Seoul","Jung-gu","Jangchung-dong","",""
"BE_IW12-0494","Lee hwang teacher site","Seoul","Jung-gu","Sogong-dong","",""
"BE_IW12-0495","Lee hoi young Lee si young 6 brother site","Seoul","Jung-gu","Myeong-dong","",""
"BE_IW12-0496","Lee hee seong Teacher Monument","Seoul","Jung-gu","Pil-dong","",""
"BE_IW12-0497","Lee Jun patriotice martyr","Seoul","Jung-gu","Jangchung-dong","",""
"BE_IW12-0498","Jangakwon site","Seoul","Jung-gu","Myeong-dong","",""
"BE_IW12-0499","Jangchungdan site","Seoul","Jung-gu","Jangchung-dong","",""
"BE_IW12-0500","Chugyeonggung site","Seoul","Jung-gu","Sogong-dong","",""
"BE_IW12-0501","Jeonhwanguk site","Seoul","Jung-gu","Sogong-dong","",""
"BE_IW12-0502","Jeonggwangpil site","Seoul","Jung-gu","Hoehyeon-dong","",""
"BE_IW12-0503","Jungmi army raised in the cause of justice source site","Seoul","Jung-gu","Sogong-dong","",""
"BE_IW12-0504","Jejungwon site","Seoul","Jung-gu","Myeong-dong","",""
"BE_IW12-0505","Joseon Gwangmunhoe site","Seoul","Jung-gu","Myeong-dong","",""
"BE_IW12-0506","Cho chi-hun Monument","Seoul","Jung-gu","Pil-dong","",""
"BE_IW12-0507","Jotaegwon chumbi","Seoul","Jung-gu","Jangchung-dong","",""
"BE_IW12-0508","Typefoundry site","Seoul","Jung-gu","Pil-dong","",""
"BE_IW12-0509","Jin Gogae","Seoul","Jung-gu","Myeong-dong","",""
"BE_IW12-0510","Chungang Park Seung-hi Monument Memorial","Seoul","Jung-gu","Jangchung-dong","",""
"BE_IW12-0511","Admiral Yi sun-sin birthplace site","Seoul","Jung-gu","Euljiro-dong","",""
"BE_IW12-0512","Chilpae Market site","Seoul","Jung-gu","Hoehyeon-dong","",""
"BE_IW12-0513","Taepyeonggwan site","Seoul","Jung-gu","Sogong-dong","",""
"BE_IW12-0514","Residency General site","Seoul","Jung-gu","Pil-dong","",""
"BE_IW12-0515","Palhongmun site","Seoul","Jung-gu","Sogong-dong","",""
"BE_IW12-0516","Pulmujae","Seoul","Jung-gu","Jangchung-dong","",""
"BE_IW12-0517","Hadogam site","Seoul","Jung-gu","Gwanghui-dong","",""
"BE_IW12-0518","Student Anticommunist Monument","Seoul","Jung-gu","Jangchung-dong","",""
"BE_IW12-0519","Korea Urim Independence Movement Paris library Monument","Seoul","Jung-gu","Jangchung-dong","",""
"BE_IW12-0520","Hanseongbu the west govemment office site","Seoul","Jung-gu","Myeong-dong","",""
"BE_IW12-0521","Hanseongbu the west govemment office site","Seoul","Jung-gu","Myeong-dong","",""
"BE_IW12-0522","Hyeminseo site","Seoul","Jung-gu","Myeong-dong","",""
"BE_IW12-0523","Hoedong a bookshop site","Seoul","Jung-gu","Myeong-dong","",""
"BE_IW12-0524","Hullyeonwon site","Seoul","Jung-gu","Gwanghui-dong","",""
"BE_IW12-0525","Gyeongungung Yangijae","Seoul","Jung-gu","Sogong-dong","",""
"BE_IW12-0526","Gyeongungung Yangijae","Seoul","Jung-gu","Sogong-dong","",""
"BE_IW12-0527","Sungjeongjeon Hall in Gyeonghuigung palace","Seoul","Jung-gu","Pil-dong","",""
"BE_IW12-0528","Sungjeongjeon Hall in Gyeonghuigung palace","Seoul","Jung-gu","Pil-dong","",""
"BE_IW12-0529","Old Supreme Court govemment office Building","Seoul","Jung-gu","Sogong-dong","",""
"BE_IW12-0530","Old Supreme Court govemment office Building","Seoul","Jung-gu","Sogong-dong","",""
"BE_IW12-0531","Old the USA Culture Center","Seoul","Jung-gu","Myeong-dong","",""
"BE_IW12-0532","Old the USA Culture Center","Seoul","Jung-gu","Myeong-dong","",""
"BE_IW12-0533","Old Shina Daily News Annex","Seoul","Jung-gu","Sogong-dong","",""
"BE_IW12-0534","Old Shina Daily News Annex","Seoul","Jung-gu","Sogong-dong","",""
"BE_IW12-0535","Namdaemunro Korea electric power office","Seoul","Jung-gu","Myeong-dong","",""
"BE_IW12-0536","Namdaemunro Korea electric power office","Seoul","Jung-gu","Myeong-dong","",""
"BE_IW12-0537","USA legation","Seoul","Jung-gu","Sogong-dong","",""
"BE_IW12-0538","USA legation","Seoul","Jung-gu","Sogong-dong","",""
"BE_IW12-0539","Seoul City Hall Govermment office","Seoul","Jung-gu","Myeong-dong","",""
"BE_IW12-0540","Seoul City Hall Govermment office","Seoul","Jung-gu","Myeong-dong","",""
"BE_IW12-0541","Anglican Seoul Catholic Church","Seoul","Jung-gu","Sogong-dong","",""
"BE_IW12-0542","Anglican Catholic Church","Seoul","Jung-gu","Sogong-dong","","http://www.cathedral.or.kr/"
"BE_IW12-0543","Seongjemyo","Seoul","Jung-gu","Euljiro-dong","",""
"BE_IW12-0544","Seongjemyo","Seoul","Jung-gu","Euljiro-dong","",""
"BE_IW12-0545","Supyogyo","Seoul","Jung-gu","Jangchung-dong","",""
"BE_IW12-0546","Supyogyo","Seoul","Jung-gu","Jangchung-dong","",""
"BE_IW12-0547","House of Former President Park Chung-hee in Sindang-dong","Seoul","Jung-gu","Donghwa-dong","",""
"BE_IW12-0548","House of Former President Park Chung-hee in Sindang-dong","Seoul","Jung-gu","Donghwa-dong","",""
"BE_IW12-0549","Old Jeil Bank Head shop ","Seoul","Jung-gu","Myeong-dong","",""
"BE_IW12-0550","Old Jeil Bank Head shop ","Seoul","Jung-gu","Myeong-dong","",""
"BE_IW12-0551","Jangchungdan Monument Memorial","Seoul","Jung-gu","Jangchung-dong","",""
"BE_IW12-0552","Jangchungdan Monument Memorial","Seoul","Jung-gu","Jangchung-dong","",""
"BE_IW12-0553","Jungdong Ehwa girl's highschool Simson Memorial Hall","Seoul","Jung-gu","Sogong-dong","",""
"BE_IW12-0554","Jungdong Ehwa girl's highschool Simson Memorial Hall","Seoul","Jung-gu","Sogong-dong","",""
"BE_IW12-0555","Taepyeongro Old National Assembly","Seoul","Jung-gu","Myeong-dong","",""
"BE_IW12-0556","Taepyeongro Old National Assembly","Seoul","Jung-gu","Myeong-dong","",""
"BE_IW12-0557","Taepyeongro Old National Assembly","Seoul","Jung-gu","Myeong-dong","",""
"BE_IW12-0558","Lotte Duty Free Shop","Seoul","Jongno-gu","Sajik-dong","02-399-3111 ","http://www.dutyfree24.com/?Domain=Naver3 "
"BE_IW12-0559","Lotte Duty Free Shop","Seoul","Jongno-gu","Sajik-dong","02-399-3111 ","http://www.dutyfree24.com/?Domain=Naver3"