"서비스구분","서비스ID","대분류명","소분류명","서비스상태","서비스명","결제방법","장소명","서비스대상","바로가기URL","장소X좌표","장소Y좌표","서비스개시시작일시","서비스개시종료일시","접수시작일시","접수종료일시","지역명"
"자체","S191226130616487995","시설대관","다목적실","접수중","강서구 화곡3동주민센터 3층 다목적실","유료","강서구 화곡3동주민센터","제한없음(서울시 관련시민-상세정보 확인)","http://yeyak.seoul.go.kr/reservation/view.web?rsvsvcid=S191226130616487995","37.54252738921281","126.83841186542683","2019-12-27 00:00:00.0","2020-12-31 00:00:00.0","2019-12-27 09:00:00.0","2020-12-30 18:00:00.0","강서구"
"자체","S191226135135616533","시설대관","회의실","접수중","강서구 화곡3동주민센터 2층 프로그램실","유료","강서구 화곡3동주민센터","제한없음(서울시 관련시민-상세정보 확인)","http://yeyak.seoul.go.kr/reservation/view.web?rsvsvcid=S191226135135616533","37.54252738921281","126.83841186542683","2019-12-27 00:00:00.0","2020-12-31 00:00:00.0","2019-12-27 09:00:00.0","2020-12-30 18:00:00.0","강서구"
"자체","S191226140017176279","시설대관","주민사랑방","접수중","강서구 화곡3동주민센터 2층 작은도서관(북까페)","무료","강서구 화곡3동주민센터","제한없음","http://yeyak.seoul.go.kr/reservation/view.web?rsvsvcid=S191226140017176279","37.54252738921281","126.83841186542683","2019-12-27 00:00:00.0","2020-12-31 00:00:00.0","2019-12-27 09:00:00.0","2020-12-30 18:00:00.0","강서구"
"자체","S200107163026634168","시설대관","다목적실","접수중","강서구 화곡8동 주민센터 3층 다목적실","유료(요금안내문의)","강서구 화곡8동주민센터","제한없음","http://yeyak.seoul.go.kr/reservation/view.web?rsvsvcid=S200107163026634168","37.532694422089534","126.8483304695426","2020-01-01 00:00:00.0","2020-12-31 00:00:00.0","2020-01-07 09:00:00.0","2020-12-31 18:00:00.0","강서구"
"자체","S200108092958121655","시설대관","강의실","접수중","강서구 화곡8동주민센터 3층 창작공방실","유료(요금안내문의)","강서구 화곡8동주민센터","제한없음","http://yeyak.seoul.go.kr/reservation/view.web?rsvsvcid=S200108092958121655","37.532694422089534","126.8483304695426","2020-01-08 00:00:00.0","2020-12-31 00:00:00.0","2020-01-08 09:00:00.0","2020-12-31 18:00:00.0","강서구"
"자체","S200108094055555840","시설대관","기타","예약일시중지","강서구 화곡8동주민센터 지하 공연연습장","유료(요금안내문의)","강서구 화곡8동주민센터","제한없음","http://yeyak.seoul.go.kr/reservation/view.web?rsvsvcid=S200108094055555840","37.532694422089534","126.8483304695426","2020-01-08 00:00:00.0","2020-12-31 00:00:00.0","2020-01-08 09:00:00.0","2020-12-31 21:00:00.0","강서구"
"자체","S200108191510727807","시설대관","다목적실","접수종료","강서구 화곡4동주민센터 3층 다목적실","유료","강서구 화곡4동주민센터","제한없음","http://yeyak.seoul.go.kr/reservation/view.web?rsvsvcid=S200108191510727807","37.53482132095772","126.86045951968177","2020-01-08 00:00:00.0","2020-12-31 00:00:00.0","2020-01-08 09:00:00.0","2020-01-08 20:59:00.0","강서구"
"자체","S200108191753296381","시설대관","강의실","접수종료","강서구 화곡4동주민센터 3층 문화교실","유료","강서구 화곡4동주민센터","제한없음","http://yeyak.seoul.go.kr/reservation/view.web?rsvsvcid=S200108191753296381","37.53482132095772","126.86045951968177","2020-01-08 00:00:00.0","2020-12-31 00:00:00.0","2020-01-08 09:00:00.0","2020-01-08 18:00:00.0","강서구"
"자체","S191110171323657178","시설대관","녹화/촬영","예약일시중지","2020년 영화촬영1(야간)-강서","유료","강서한강공원>영화촬영장소","제한없음","http://yeyak.seoul.go.kr/reservation/view.web?rsvsvcid=S191110171323657178","","","2019-12-01 00:00:00.0","2020-12-31 00:00:00.0","2019-12-01 00:00:00.0","2020-12-31 00:00:00.0","강서구"
"자체","S200107103729854309","시설대관","주민사랑방","접수중","강서구 화곡본동주민센터 2층 작은도서관(북카페)","무료","강서구 화곡본동주민센터","제한없음","http://yeyak.seoul.go.kr/reservation/view.web?rsvsvcid=S200107103729854309","37.54404976203401","126.84766474183878","2020-01-07 00:00:00.0","2020-12-31 00:00:00.0","2020-01-07 09:00:00.0","2020-12-31 18:00:00.0","강서구"
"자체","S200108103136013349","시설대관","다목적실","접수중","강서구 화곡본동주민센터 2층 다목적실","유료","강서구 화곡본동주민센터","제한없음","http://yeyak.seoul.go.kr/reservation/view.web?rsvsvcid=S200108103136013349","37.54404976203401","126.84766474183878","2020-01-08 00:00:00.0","2020-12-31 00:00:00.0","2020-01-08 00:00:00.0","2020-12-31 00:00:00.0","강서구"
"자체","S191029105940840552","시설대관","다목적실","접수중","강서구 가양3동주민센터 3층 다목적실 ","유료","강서구 가양3동주민센터","제한없음","http://yeyak.seoul.go.kr/reservation/view.web?rsvsvcid=S191029105940840552","37.56108733613971","126.86055994789228","2020-01-01 00:00:00.0","2020-12-31 00:00:00.0","2020-01-01 00:00:00.0","2020-12-31 23:59:00.0","강서구"
"자체","S191217123813453386","시설대관","다목적실","접수중","강서구 화곡2동 주민센터 3층 다목적실","유료","강서구 화곡2동 주민센터","제한없음","http://yeyak.seoul.go.kr/reservation/view.web?rsvsvcid=S191217123813453386","37.53182639579191","126.85448691049805","2020-01-01 00:00:00.0","2020-12-31 00:00:00.0","2020-01-01 00:00:00.0","2020-12-31 18:00:00.0","강서구"
"자체","S191217131832224244","시설대관","기타","접수중","강서구 화곡2동 주민센터 3층 문화창작실","유료","강서구 화곡2동 주민센터","제한없음","http://yeyak.seoul.go.kr/reservation/view.web?rsvsvcid=S191217131832224244","37.53182639579191","126.85448691049805","2020-01-01 00:00:00.0","2020-12-31 00:00:00.0","2020-01-01 00:00:00.0","2020-12-31 18:00:00.0","강서구"
"자체","S191217133104377422","시설대관","기타","접수중","강서구 화곡2동 주민센터 2층 프로그램실","유료","강서구 화곡2동 주민센터","제한없음","http://yeyak.seoul.go.kr/reservation/view.web?rsvsvcid=S191217133104377422","37.53182639579191","126.85448691049805","2020-01-01 00:00:00.0","2020-12-31 00:00:00.0","2020-01-01 09:00:00.0","2020-12-31 18:00:00.0","강서구"
"자체","S200107092541775611","시설대관","강의실","접수중","강서구 공항동주민센터 1층 프로그램실","유료","강서구 공항동주민센터","제한없음","http://yeyak.seoul.go.kr/reservation/view.web?rsvsvcid=S200107092541775611","37.55878244580938","126.81007314859781","2020-01-01 00:00:00.0","2020-12-31 00:00:00.0","2020-01-01 09:00:00.0","2020-12-31 18:00:00.0","강서구"
"자체","S200107171117626773","시설대관","다목적실","접수중","강서구 공항동주민센터 2층 다목적실","유료","강서구 공항동주민센터","제한없음","http://yeyak.seoul.go.kr/reservation/view.web?rsvsvcid=S200107171117626773","37.55878244580938","126.81007314859781","2020-01-01 00:00:00.0","2020-12-31 00:00:00.0","2020-01-01 09:00:00.0","2020-12-31 18:00:00.0","강서구"
"자체","S200108181015418930","시설대관","강의실","접수종료","강서구 등촌3동주민센터 3층 강의실","유료","강서구 등촌3동주민센터","제한없음","http://yeyak.seoul.go.kr/reservation/view.web?rsvsvcid=S200108181015418930","37.55888771640073","126.8479197486879","2020-01-01 00:00:00.0","2020-12-31 00:00:00.0","2020-01-01 09:00:00.0","2020-12-31 18:00:00.0","강서구"
"자체","S200108183556138928","시설대관","다목적실","접수중","강서구 등촌3동주민센터 3층 다목적실","유료","강서구 등촌3동주민센터","제한없음","http://yeyak.seoul.go.kr/reservation/view.web?rsvsvcid=S200108183556138928","37.55888771640073","126.8479197486879","2020-01-01 00:00:00.0","2020-12-31 00:00:00.0","2020-01-01 09:00:00.0","2020-12-31 18:00:00.0","강서구"
"자체","S200108154946730559","시설대관","강의실","접수중","강서구 가양1동주민센터 2층 배움방","유료","강서구 가양1동주민센터","제한없음","http://yeyak.seoul.go.kr/reservation/view.web?rsvsvcid=S200108154946730559","37.56948644775049","126.84470611694118","2020-01-01 00:00:00.0","2020-12-31 00:00:00.0","2020-01-01 09:00:00.0","2020-12-31 18:00:00.0","강서구"
"자체","S200108172944876227","시설대관","다목적실","접수중","강서구 가양1동주민센터 3층 다목적실","유료","강서구 가양1동주민센터","제한없음","http://yeyak.seoul.go.kr/reservation/view.web?rsvsvcid=S200108172944876227","37.56948644775049","126.84470611694118","2020-01-01 00:00:00.0","2020-12-31 00:00:00.0","2020-01-01 09:00:00.0","2020-12-31 18:00:00.0","강서구"
"자체","S200108173229087280","시설대관","회의실","접수중","강서구 가양1동주민센터 지하 만남의방","유료","강서구 가양1동주민센터","제한없음","http://yeyak.seoul.go.kr/reservation/view.web?rsvsvcid=S200108173229087280","37.56948644775049","126.84470611694118","2020-01-01 00:00:00.0","2020-12-31 00:00:00.0","2020-01-01 09:00:00.0","2020-12-31 18:00:00.0","강서구"
"자체","S200103163040354470","시설대관","다목적실","접수중","강서구 방화2동주민센터 3층 다목적실","유료","강서구 방화2동주민센터","제한없음","http://yeyak.seoul.go.kr/reservation/view.web?rsvsvcid=S200103163040354470","37.566720208691905","126.80673878623706","2020-01-03 00:00:00.0","2020-12-31 00:00:00.0","2020-01-03 00:00:00.0","2020-12-31 23:59:00.0","강서구"
"자체","S181227171846132024","시설대관","주민사랑방","접수종료","강서구 화곡6동주민센터 2층 작은도서관(북까페)","무료","강서구 화곡6동주민센터","제한없음(서울시 관련시민-상세정보 확인)","http://yeyak.seoul.go.kr/reservation/view.web?rsvsvcid=S181227171846132024","37.55181584582429","126.85007525352466","2020-01-01 00:00:00.0","2020-12-31 00:00:00.0","2020-01-02 09:00:00.0","2020-12-31 18:00:00.0","강서구"
"자체","S200108211902171587","시설대관","회의실","접수중","강서구 화곡6동주민센터 2층 회의실","유료","강서구 화곡6동주민센터","제한없음","http://yeyak.seoul.go.kr/reservation/view.web?rsvsvcid=S200108211902171587","37.55181584582429","126.85007525352466","2020-01-01 00:00:00.0","2020-12-31 00:00:00.0","2020-01-01 09:00:00.0","2020-12-31 18:00:00.0","강서구"
"자체","S200108214231269793","시설대관","강당","접수중","강서구 화곡6동주민센터 3층 강당","유료","강서구 화곡6동주민센터","제한없음(서울시 관련시민-상세정보 확인)","http://yeyak.seoul.go.kr/reservation/view.web?rsvsvcid=S200108214231269793","37.55181584582429","126.85007525352466","2020-01-01 00:00:00.0","2020-12-31 00:00:00.0","2020-01-01 09:00:00.0","2020-12-31 18:00:00.0","강서구"
"자체","S200407134047326662","시설대관","주민사랑방","접수중","강서구 화곡6동주민센터 2층 작은도서관(북까페)","무료","강서구 화곡6동주민센터","제한없음(서울시 관련시민-상세정보 확인)","http://yeyak.seoul.go.kr/reservation/view.web?rsvsvcid=S200407134047326662","37.55181584582429","126.85007525352466","2020-04-07 00:00:00.0","2020-12-31 00:00:00.0","2020-04-07 09:00:00.0","2020-12-31 18:00:00.0","강서구"
"자체","S200407141125648204","시설대관","다목적실","접수중","강서구 화곡6동주민센터 3층 프로그램실","유료","강서구 화곡6동주민센터","제한없음(서울시 관련시민-상세정보 확인)","http://yeyak.seoul.go.kr/reservation/view.web?rsvsvcid=S200407141125648204","37.55181584582429","126.85007525352466","2020-04-07 00:00:00.0","2020-12-31 00:00:00.0","2020-04-07 09:00:00.0","2020-12-31 18:00:00.0","강서구"
"자체","S200108101444341533","시설대관","기타","접수중","강서구 발산1동주민센터 3층 다목적실","유료","강서구 발산1동주민센터","제한없음","http://yeyak.seoul.go.kr/reservation/view.web?rsvsvcid=S200108101444341533","37.55311584656352","126.8331786734401","2020-01-01 00:00:00.0","2020-12-31 00:00:00.0","2020-01-01 00:00:00.0","2020-12-31 00:00:00.0","강서구"
"자체","S200108102909074931","시설대관","주민사랑방","접수중","강서구 발산1동주민센터 2층 작은도서관(북까페)","무료","강서구 발산1동주민센터","제한없음","http://yeyak.seoul.go.kr/reservation/view.web?rsvsvcid=S200108102909074931","37.55311584656352","126.8331786734401","2020-01-01 00:00:00.0","2020-12-31 00:00:00.0","2020-01-01 00:00:00.0","2020-12-31 00:00:00.0","강서구"
"자체","S200108103432014832","시설대관","강의실","접수중","강서구 발산1동주민센터 4층 배움터","유료","강서구 발산1동주민센터","제한없음(회의실 다목적실)","http://yeyak.seoul.go.kr/reservation/view.web?rsvsvcid=S200108103432014832","37.55311584656352","126.8331786734401","2020-01-01 00:00:00.0","2020-12-31 00:00:00.0","2020-01-01 09:00:00.0","2020-12-31 18:00:00.0","강서구"
"자체","S200108105421361368","시설대관","강의실","접수중","강서구 발산1동주민센터 2층 배움터","유료","강서구 발산1동주민센터","제한없음","http://yeyak.seoul.go.kr/reservation/view.web?rsvsvcid=S200108105421361368","37.55311584656352","126.8331786734401","2020-01-01 00:00:00.0","2020-12-31 00:00:00.0","2020-01-01 09:00:00.0","2020-12-31 18:00:00.0","강서구"
"자체","S200408161212563581","시설대관","다목적실","접수중","강서구 발산1동 주민센터 4층 라이브무대","유료","강서구 발산1동주민센터","제한없음","http://yeyak.seoul.go.kr/reservation/view.web?rsvsvcid=S200408161212563581","37.55311584656352","126.8331786734401","2020-01-01 00:00:00.0","2020-12-31 00:00:00.0","2020-01-01 09:00:00.0","2020-12-31 18:00:00.0","강서구"
"자체","S191228115257769790","시설대관","다목적실","접수중","강서구 등촌2동주민센터 3층 다목적실","유료","강서구 등촌2동주민센터","제한없음","http://yeyak.seoul.go.kr/reservation/view.web?rsvsvcid=S191228115257769790","37.54265881126042","126.86250431541155","2019-12-27 00:00:00.0","2020-12-31 00:00:00.0","2019-12-27 09:00:00.0","2020-12-31 18:00:00.0","강서구"
"자체","S191228123230218289","시설대관","주민사랑방","접수중","강서구 등촌2동주민센터 2층 작은도서관","무료","강서구 등촌2동주민센터","제한없음","http://yeyak.seoul.go.kr/reservation/view.web?rsvsvcid=S191228123230218289","37.54265881126042","126.86250431541155","2020-01-02 00:00:00.0","2020-12-31 00:00:00.0","2020-01-02 09:00:00.0","2020-12-31 18:00:00.0","강서구"
"자체","S181224162613901782","시설대관","강의실","접수중","강서구 방화3동주민센터 취미교실","유료","강서구 방화3동주민센터","제한없음","http://yeyak.seoul.go.kr/reservation/view.web?rsvsvcid=S181224162613901782","37.57871815482906","126.81365877620476","2020-01-01 00:00:00.0","2020-12-31 00:00:00.0","2020-01-01 09:00:00.0","2020-12-15 18:00:00.0","강서구"
"자체","S181226084647270928","시설대관","강의실","접수중","강서구 방화3동주민센터 3층 어학실","유료","강서구 방화3동주민센터","제한없음","http://yeyak.seoul.go.kr/reservation/view.web?rsvsvcid=S181226084647270928","37.57871815482906","126.81365877620476","2020-01-01 00:00:00.0","2020-12-31 00:00:00.0","2020-01-01 09:00:00.0","2020-12-15 18:00:00.0","강서구"
"자체","S191230161930749593","시설대관","다목적실","접수중","강서구 방화3동주민센터 3층 다목적실","유료","강서구 방화3동주민센터","제한없음","http://yeyak.seoul.go.kr/reservation/view.web?rsvsvcid=S191230161930749593","37.57871815482906","126.81365877620476","2020-01-01 00:00:00.0","2020-12-31 00:00:00.0","2020-01-01 09:00:00.0","2020-12-15 18:00:00.0","강서구"
"자체","S200103132343181143","시설대관","다목적실","접수중","강서구 우장산동 주민센터 3층 다목적실","유료","강서구 우장산동주민센터","제한없음","http://yeyak.seoul.go.kr/reservation/view.web?rsvsvcid=S200103132343181143","37.54828760090818","126.84183504277004","2020-01-01 00:00:00.0","2020-12-31 00:00:00.0","2020-01-01 00:00:00.0","2020-12-31 00:00:00.0","강서구"
"자체","S200107153034607915","시설대관","다목적실","접수중","강서구 내발산문화센터 다목적실","유료","내발산동문화센터","제한없음(강서구 관련주민)","http://yeyak.seoul.go.kr/reservation/view.web?rsvsvcid=S200107153034607915","37.55749760744118","126.84319632941924","2020-01-01 00:00:00.0","2020-12-31 00:00:00.0","2020-01-01 09:00:00.0","2020-12-31 18:00:00.0","강서구"
"자체","S200107154258406049","시설대관","강의실","접수중","강서구 내발산문화센터 4층 배움터2","유료","내발산동문화센터","제한없음","http://yeyak.seoul.go.kr/reservation/view.web?rsvsvcid=S200107154258406049","37.55749760744118","126.84319632941924","2020-01-01 00:00:00.0","2020-12-31 00:00:00.0","2020-01-01 09:00:00.0","2020-12-31 18:00:00.0","강서구"
"자체","S191110165039438027","시설대관","녹화/촬영","예약일시중지","2020년 영화촬영1(주간)-강서","유료","강서한강공원","제한없음","http://yeyak.seoul.go.kr/reservation/view.web?rsvsvcid=S191110165039438027","","","2019-12-01 00:00:00.0","2020-12-31 00:00:00.0","2019-12-01 00:00:00.0","2020-12-31 00:00:00.0","강서구"
"자체","S191111194911600806","시설대관","녹화/촬영","예약일시중지","2020년 녹화1-강서","유료","강서한강공원","제한없음","http://yeyak.seoul.go.kr/reservation/view.web?rsvsvcid=S191111194911600806","","","2019-12-01 00:00:00.0","2020-12-31 00:00:00.0","2019-12-01 00:00:00.0","2020-12-31 00:00:00.0","강서구"
"자체","S200102160020325000","시설대관","다목적실","접수중","강서구 등촌1동 주민센터 3층 다목적실 ","유료","강서구 등촌1동 주민센터","제한없음","http://yeyak.seoul.go.kr/reservation/view.web?rsvsvcid=S200102160020325000","37.55582715857135","126.85890835780772","2020-01-02 00:00:00.0","2020-12-31 00:00:00.0","2020-01-02 09:00:00.0","2020-12-24 18:00:00.0","강서구"
"자체","S200102181307658617","시설대관","강의실","접수중","강서구 등촌1동 주민센터 2층 프로그램실","유료","강서구 등촌1동 주민센터","제한없음(서울시)","http://yeyak.seoul.go.kr/reservation/view.web?rsvsvcid=S200102181307658617","37.55582715857135","126.85890835780772","2020-01-02 00:00:00.0","2020-12-31 00:00:00.0","2020-01-02 09:00:00.0","2020-12-24 18:00:00.0","강서구"
"자체","S200107091312232219","시설대관","다목적실","접수종료","강서구 가양2동주민센터 다목적실","유료","강서구 가양2동주민센터","제한없음","http://yeyak.seoul.go.kr/reservation/view.web?rsvsvcid=S200107091312232219","37.56739738473125","126.85127102368361","2020-01-02 00:00:00.0","2020-12-31 00:00:00.0","2020-01-07 09:00:00.0","2020-01-07 18:00:00.0","강서구"
"자체","S200107092041331992","시설대관","기타","접수종료","강서구 가양2동주민센터 4층 생활체육실","유료","강서구 가양2동주민센터","제한없음","http://yeyak.seoul.go.kr/reservation/view.web?rsvsvcid=S200107092041331992","37.56739738473125","126.85127102368361","2020-01-02 00:00:00.0","2020-12-31 00:00:00.0","2020-01-07 09:00:00.0","2020-01-07 18:00:00.0","강서구"
"자체","S200107092358208219","시설대관","회의실","접수종료","강서구 가양2동주민센터 2층 구암마실","유료","강서구 가양2동주민센터","제한없음","http://yeyak.seoul.go.kr/reservation/view.web?rsvsvcid=S200107092358208219","37.56739738473125","126.85127102368361","2020-01-02 00:00:00.0","2020-12-31 00:00:00.0","2020-01-02 00:00:00.0","2020-01-07 00:00:00.0","강서구"
"자체","S200107092657545080","시설대관","강의실","접수종료","강서구 가양2동주민센터 2층 체험학습실","유료","강서구 가양2동주민센터","제한없음","http://yeyak.seoul.go.kr/reservation/view.web?rsvsvcid=S200107092657545080","37.56739738473125","126.85127102368361","2020-01-07 00:00:00.0","2020-12-31 00:00:00.0","2020-01-07 09:00:00.0","2020-01-07 18:00:00.0","강서구"
"자체","S200108194937847719","시설대관","강의실","접수종료","강서구 가양2동주민센터 2층 체험학습실","유료","강서구 가양2동주민센터","제한없음","http://yeyak.seoul.go.kr/reservation/view.web?rsvsvcid=S200108194937847719","37.56739738473125","126.85127102368361","2020-01-08 00:00:00.0","2020-12-31 00:00:00.0","2020-01-08 09:00:00.0","2020-01-08 18:00:00.0","강서구"
"자체","S200108195212069310","시설대관","회의실","접수중","강서구 가양2동주민센터 2층 구암마실","유료","강서구 가양2동주민센터","제한없음","http://yeyak.seoul.go.kr/reservation/view.web?rsvsvcid=S200108195212069310","37.56739738473125","126.85127102368361","2020-01-08 00:00:00.0","2020-12-31 00:00:00.0","2020-01-08 00:00:00.0","2020-12-31 00:00:00.0","강서구"
"자체","S200108195403388859","시설대관","기타","접수중","강서구 가양2동주민센터 4층 생활체육실","유료","강서구 가양2동주민센터","제한없음","http://yeyak.seoul.go.kr/reservation/view.web?rsvsvcid=S200108195403388859","37.56739738473125","126.85127102368361","2020-01-08 00:00:00.0","2020-12-31 00:00:00.0","2020-01-08 09:00:00.0","2020-12-31 18:00:00.0","강서구"
"자체","S200108195554204547","시설대관","다목적실","접수중","강서구 가양2동주민센터 다목적실","유료","강서구 가양2동주민센터","제한없음","http://yeyak.seoul.go.kr/reservation/view.web?rsvsvcid=S200108195554204547","37.56739738473125","126.85127102368361","2020-01-08 00:00:00.0","2020-12-31 00:00:00.0","2020-01-08 09:00:00.0","2020-12-31 18:00:00.0","강서구"
"자체","S200108195724162894","시설대관","강의실","접수중","강서구 가양2동주민센터 2층 체험학습실","유료","강서구 가양2동주민센터","제한없음","http://yeyak.seoul.go.kr/reservation/view.web?rsvsvcid=S200108195724162894","37.56739738473125","126.85127102368361","2020-01-08 00:00:00.0","2020-12-31 00:00:00.0","2020-01-08 09:00:00.0","2020-12-31 18:00:00.0","강서구"
"자체","S200108084742731357","시설대관","다목적실","접수중","강서구 화곡1동주민센터 다목적실","유료","강서구 화곡1동주민센터","제한없음","http://yeyak.seoul.go.kr/reservation/view.web?rsvsvcid=S200108084742731357","37.530508758824624","126.84159201598922","2020-01-01 00:00:00.0","2020-12-31 00:00:00.0","2020-01-01 09:00:00.0","2020-12-31 18:00:00.0","강서구"
"자체","S200102163648957902","시설대관","기타","접수중","강서구 염창 문화예술창작공간 공연연습장","유료","강서구 염창 문화예술창작공간","제한없음","http://yeyak.seoul.go.kr/reservation/view.web?rsvsvcid=S200102163648957902","37.5518942402","126.8674033648","2020-01-01 00:00:00.0","2020-12-31 00:00:00.0","2020-01-01 10:00:00.0","2020-12-31 20:00:00.0","강서구"