"서비스구분","서비스ID","대분류명","소분류명","서비스상태","서비스명","결제방법","장소명","서비스대상","바로가기URL","장소X좌표","장소Y좌표","서비스개시시작일시","서비스개시종료일시","접수시작일시","접수종료일시","지역명"
"자체","S191231182235056820","시설대관","기타","접수중","동작구 사당2동주민센터 3층다목적회의실","유료","사당2동주민센터 3층 다목적회의실","제한없음","http://yeyak.seoul.go.kr/reservation/view.web?rsvsvcid=S191231182235056820","37.48871285429559","126.97925343882126","2020-01-01 00:00:00.0","2020-12-31 00:00:00.0","2020-01-01 09:00:00.0","2020-12-31 00:00:00.0","동작구"
"자체","S191231174904782434","시설대관","회의실","접수중","상도3동주민센터 소회의실","무료","상도3동주민센터 3층 다목적회의실","제한없음","http://yeyak.seoul.go.kr/reservation/view.web?rsvsvcid=S191231174904782434","37.499124818586694","126.9314051641112","2020-01-01 00:00:00.0","2020-12-31 00:00:00.0","2020-01-01 09:00:00.0","2020-12-31 18:00:00.0","동작구"
"자체","S191206151917867710","시설대관","다목적실","접수중","대방동 주민센터 다목적회의실","유료(요금안내문의)","대방동 자치회관 다목적회의실","제한없음","http://yeyak.seoul.go.kr/reservation/view.web?rsvsvcid=S191206151917867710","37.50814983365549","126.92632541788087","2019-12-31 00:00:00.0","2020-12-31 00:00:00.0","2019-12-31 09:00:00.0","2020-12-31 23:59:00.0","동작구"
"자체","S191231175810826056","시설대관","주민사랑방","예약일시중지","동작구 사당3동주민센터 커뮤니티룸","무료","사당3동주민센터 커뮤니티룸","제한없음","http://yeyak.seoul.go.kr/reservation/view.web?rsvsvcid=S191231175810826056","37.4866859015","126.9720401623","2020-01-02 00:00:00.0","2020-12-31 00:00:00.0","2020-01-02 09:00:00.0","2020-12-31 18:00:00.0","동작구"
"자체","S191223164138980565","시설대관","기타","접수중","흑석동주민센터 맘스하트카페","무료","흑석동주민센터 2층 맘스하트카페","유아(동작구 주민과 미취학자녀)제한없음","http://yeyak.seoul.go.kr/reservation/view.web?rsvsvcid=S191223164138980565","37.5057786194","126.9665907516","2019-12-23 00:00:00.0","2020-12-31 00:00:00.0","2019-12-23 09:00:00.0","2020-12-31 18:00:00.0","동작구"
"자체","S191231181552706600","시설대관","기타","접수중","동작구 사당2동주민센터 2층 주민사랑방","유료","사당2동주민센터 2층 주민사랑방","제한없음","http://yeyak.seoul.go.kr/reservation/view.web?rsvsvcid=S191231181552706600","37.48871285429559","126.97925343882126","2020-01-01 00:00:00.0","2020-12-31 00:00:00.0","2020-01-01 09:00:00.0","2020-12-30 18:00:00.0","동작구"
"자체","S191230100706564074","시설대관","다목적실","접수종료","동작구 상도4동주민센터 다목적회의실","유료","상도4동주민센터 2층 다목적실","제한없음","http://yeyak.seoul.go.kr/reservation/view.web?rsvsvcid=S191230100706564074","37.500598788698696","126.93777759663565","2020-01-01 00:00:00.0","2020-12-31 00:00:00.0","2019-12-30 00:00:00.0","2019-12-31 00:00:00.0","동작구"
"자체","S191227141503806796","시설대관","회의실","접수중","노량진2동주민센터 지하소회의실 ","무료","노량진2동주민센터 지하소회의실","제한없음","http://yeyak.seoul.go.kr/reservation/view.web?rsvsvcid=S191227141503806796","37.50850576847282","126.93731862436249","2019-12-01 00:00:00.0","2020-12-31 00:00:00.0","2019-12-01 09:00:00.0","2020-12-31 18:00:00.0","동작구"
"자체","S191220101644504115","시설대관","다목적실","접수중","신대방1동주민센터 Kids & Mom 카페","무료","신대방1동주민센터 Kids & Mom 카페","제한없음","http://yeyak.seoul.go.kr/reservation/view.web?rsvsvcid=S191220101644504115","37.48894352002268","126.91003916968559","2019-12-20 00:00:00.0","2020-12-31 00:00:00.0","2019-12-20 09:00:00.0","2020-12-31 18:00:00.0","동작구"
"자체","S181227184939217765","시설대관","주민사랑방","접수중","대방동 주민센터 사랑의 방","유료(요금안내문의)","동작구 대방동주민센터>대방동 주민센터 사랑의 방","제한없음","http://yeyak.seoul.go.kr/reservation/view.web?rsvsvcid=S181227184939217765","37.50814983365549","126.92632541788087","2019-12-31 00:00:00.0","2020-12-31 00:00:00.0","2019-12-31 09:00:00.0","2020-12-31 23:00:00.0","동작구"
"자체","S191231103801251185","시설대관","주민사랑방","접수중","대방동 주민센터 사랑의 방","유료(요금안내문의)","동작구 대방동주민센터>대방동 주민센터 사랑의 방","제한없음","http://yeyak.seoul.go.kr/reservation/view.web?rsvsvcid=S191231103801251185","37.50814983365549","126.92632541788087","2019-12-31 00:00:00.0","2020-12-31 00:00:00.0","2019-12-31 09:00:00.0","2020-12-31 23:00:00.0","동작구"
"자체","S191230175245270675","시설대관","다목적실","접수중","신대방2동 자치회관 나래홀","유료","신대방2동 자치회관","제한없음","http://yeyak.seoul.go.kr/reservation/view.web?rsvsvcid=S191230175245270675","37.4984142464","126.9245436824","2019-12-31 00:00:00.0","2020-12-31 00:00:00.0","2019-12-31 09:00:00.0","2020-12-31 18:00:00.0","동작구"
"자체","S191230180910814496","시설대관","강의실","접수중","신대방2동 자치회관 3층 누리","유료","신대방2동 자치회관","제한없음","http://yeyak.seoul.go.kr/reservation/view.web?rsvsvcid=S191230180910814496","37.4984142464","126.9245436824","2019-12-31 00:00:00.0","2020-12-31 00:00:00.0","2019-12-31 09:00:00.0","2020-12-31 18:00:00.0","동작구"
"자체","S191230182219773230","시설대관","강의실","접수중","신대방2동 자치회관 3층 소담","유료","신대방2동 자치회관","제한없음","http://yeyak.seoul.go.kr/reservation/view.web?rsvsvcid=S191230182219773230","37.4984142464","126.9245436824","2019-12-31 00:00:00.0","2020-12-31 00:00:00.0","2019-12-31 09:00:00.0","2020-12-31 18:00:00.0","동작구"
"자체","S191220111436510555","시설대관","다목적실","접수중","신대방1동주민센터 다목적실","유료","신대방1동 자치회관 다목적실","제한없음","http://yeyak.seoul.go.kr/reservation/view.web?rsvsvcid=S191220111436510555","37.48894352002268","126.91003916968559","2019-12-20 00:00:00.0","2020-12-31 00:00:00.0","2019-12-20 09:00:00.0","2020-12-31 18:00:00.0","동작구"
"자체","S191231113142293664","시설대관","다목적실","접수중","사당1동 주민센터 3층 교양강좌실","유료","사당1동주민센터 3층 교양강좌실","제한없음","http://yeyak.seoul.go.kr/reservation/view.web?rsvsvcid=S191231113142293664","37.48307245685921","126.97877108415413","2019-12-31 00:00:00.0","2020-12-31 00:00:00.0","2019-12-31 12:00:00.0","2020-12-28 18:00:00.0","동작구"
"자체","S200109103302958874","시설대관","다목적실","접수중","사당5동 주민센터 다목적회의실","유료","사당5동 주민센터 다목적회의실","제한없음","http://yeyak.seoul.go.kr/reservation/view.web?rsvsvcid=S200109103302958874","37.48566105020782","126.96697962061731","2020-01-09 00:00:00.0","2020-12-31 00:00:00.0","2020-01-09 09:00:00.0","2020-12-31 18:00:00.0","동작구"
"자체","S200109105111483307","시설대관","회의실","접수종료","사당5동 주민센터 문화의방","유료","사당5동 주민센터 문화의방","제한없음","http://yeyak.seoul.go.kr/reservation/view.web?rsvsvcid=S200109105111483307","37.48566105020782","126.96697962061731","2020-01-09 00:00:00.0","2020-12-31 00:00:00.0","2020-01-09 09:00:00.0","2020-01-09 18:00:00.0","동작구"
"자체","S191226134837778342","시설대관","다목적실","접수중","노량진2동 주민센터 지하다목적실 대관","무료","노량진2동주민센터지하다목적실","제한없음","http://yeyak.seoul.go.kr/reservation/view.web?rsvsvcid=S191226134837778342","37.50850576847282","126.93731862436249","2019-12-01 00:00:00.0","2020-12-31 00:00:00.0","2019-12-01 09:00:00.0","2020-12-31 21:00:00.0","동작구"
"자체","S191231175449576069","시설대관","회의실","예약일시중지","동작구 사당3동주민센터 문화의 방","유료","사당3동주민센터 문화의방","제한없음","http://yeyak.seoul.go.kr/reservation/view.web?rsvsvcid=S191231175449576069","37.4866859014904","126.97204016234481","2020-01-02 00:00:00.0","2020-12-31 00:00:00.0","2020-01-02 09:00:00.0","2020-12-31 18:00:00.0","동작구"
"자체","S191231174154146670","시설대관","다목적실","접수중","상도3동 지혜의 숲","무료","상도3동 지혜의 숲","제한없음","http://yeyak.seoul.go.kr/reservation/view.web?rsvsvcid=S191231174154146670","37.499124818586694","126.9314051641112","2020-01-01 00:00:00.0","2020-12-31 00:00:00.0","2020-01-01 09:00:00.0","2020-12-31 18:00:00.0","동작구"
"자체","S191231173441784841","시설대관","다목적실","예약일시중지","동작구 사당3동주민센터 다목적회의실","유료","사당3동주민센터 다목적회의실","제한없음","http://yeyak.seoul.go.kr/reservation/view.web?rsvsvcid=S191231173441784841","37.4866859014904","126.97204016234481","2020-01-02 00:00:00.0","2020-12-31 00:00:00.0","2020-01-02 09:00:00.0","2020-12-31 18:00:00.0","동작구"
"자체","S200107202042822759","시설대관","다목적실","접수중","상도1동 주민센터 다목적강당 ","유료","상도1동 주민센터 4층 대강당","성인","http://yeyak.seoul.go.kr/reservation/view.web?rsvsvcid=S200107202042822759","37.49810106158807","126.9530825673526","2020-01-07 00:00:00.0","2020-12-31 00:00:00.0","2020-01-07 00:00:00.0","2020-12-31 00:00:00.0","동작구"
"자체","S191226143515771575","시설대관","다목적실","접수중","노량진2동주민센터 2층 다목적실 ","무료","노량진2동주민센터 다목적실","제한없음","http://yeyak.seoul.go.kr/reservation/view.web?rsvsvcid=S191226143515771575","37.50850576847282","126.93731862436249","2019-12-01 00:00:00.0","2020-12-31 00:00:00.0","2019-12-01 09:00:00.0","2020-12-31 21:00:00.0","동작구"
"자체","S191223151439288385","시설대관","강의실","접수중","흑석동주민센터 3층 문화강좌실","유료","흑석동주민센터 3층 문화강좌실","제한없음","http://yeyak.seoul.go.kr/reservation/view.web?rsvsvcid=S191223151439288385","37.5057786193814","126.96659075156063","2019-12-23 00:00:00.0","2020-12-31 00:00:00.0","2019-12-23 09:00:00.0","2020-12-31 18:00:00.0","동작구"
"자체","S191220105821189762","시설대관","다목적실","접수중","신대방1동주민센터 공유부엌","유료","신대방1동주민센터 공유부엌","제한없음","http://yeyak.seoul.go.kr/reservation/view.web?rsvsvcid=S191220105821189762","37.48894352002268","126.91003916968559","2020-01-01 00:00:00.0","2020-12-31 00:00:00.0","2019-12-20 09:00:00.0","2020-12-31 18:00:00.0","동작구"
"자체","S191226174001592577","시설대관","다목적실","접수중","상도2동 주민센터 다목적회의실","유료","상도2동 자치회관 다목적회의실","제한없음","http://yeyak.seoul.go.kr/reservation/view.web?rsvsvcid=S191226174001592577","37.50546651507301","126.94230199482412","2020-01-01 00:00:00.0","2020-12-31 00:00:00.0","2020-01-02 09:00:00.0","2020-12-31 18:00:00.0","동작구"
"자체","S191224151544335132","시설대관","다목적실","접수중","사당4동주민센터 다목적회의실","유료(요금안내문의)","사당4동주민센터 다목적회의실","제한없음","http://yeyak.seoul.go.kr/reservation/view.web?rsvsvcid=S191224151544335132","37.480977014684605","126.971635270282","2019-12-24 00:00:00.0","2020-12-31 00:00:00.0","2019-12-24 09:00:00.0","2020-12-31 18:00:00.0","동작구"
"자체","S191224170226187360","시설대관","다목적실","접수중","사당4동주민센터 주민사랑방 지하회의실","유료(요금안내문의)","사당4동주민센터 다목적회의실","제한없음","http://yeyak.seoul.go.kr/reservation/view.web?rsvsvcid=S191224170226187360","37.480977014684605","126.971635270282","2019-12-24 00:00:00.0","2020-12-31 00:00:00.0","2019-12-24 09:00:00.0","2020-12-31 18:00:00.0","동작구"
"자체","S191224171300763918","시설대관","다목적실","접수중","사당4동주민센터 주민사랑방 다목적실(사랑룸)","유료(요금안내문의)","사당4동주민센터 다목적회의실","제한없음","http://yeyak.seoul.go.kr/reservation/view.web?rsvsvcid=S191224171300763918","37.480977014684605","126.971635270282","2019-12-24 00:00:00.0","2020-12-31 00:00:00.0","2019-12-24 09:00:00.0","2020-12-31 18:00:00.0","동작구"
"자체","S191224172517422818","시설대관","다목적실","접수중","사당4동 주민사랑방 다목적실(소통룸)","유료(요금안내문의)","사당4동주민센터 다목적회의실","제한없음","http://yeyak.seoul.go.kr/reservation/view.web?rsvsvcid=S191224172517422818","37.480977014684605","126.971635270282","2019-12-24 00:00:00.0","2020-12-31 00:00:00.0","2019-12-24 09:00:00.0","2020-12-31 18:00:00.0","동작구"
"자체","S191224173009899608","시설대관","기타","접수중","사당4동주민센터 주민사랑방 방송실","유료(요금안내문의)","사당4동주민센터 다목적회의실","제한없음","http://yeyak.seoul.go.kr/reservation/view.web?rsvsvcid=S191224173009899608","37.480977014684605","126.971635270282","2019-12-24 00:00:00.0","2020-12-31 00:00:00.0","2019-12-24 09:00:00.0","2020-12-31 18:00:00.0","동작구"
"자체","S191220111058183371","시설대관","강의실","접수중","신대방1동주민센터 문화의 방","유료","신대방1동 주민센터 문화의방","제한없음","http://yeyak.seoul.go.kr/reservation/view.web?rsvsvcid=S191220111058183371","37.48894352002268","126.91003916968559","2019-12-20 00:00:00.0","2020-12-31 00:00:00.0","2019-12-20 09:00:00.0","2020-12-31 22:00:00.0","동작구"
"자체","S191231102945318135","시설대관","회의실","접수중","대방동 자치회관 문화의방","유료(요금안내문의)","동작구 대방동주민센터>대방동 자치회관 문화의 방","제한없음","http://yeyak.seoul.go.kr/reservation/view.web?rsvsvcid=S191231102945318135","37.50814983365549","126.92632541788087","2019-12-31 00:00:00.0","2020-12-31 00:00:00.0","2019-12-31 09:00:00.0","2020-12-31 23:59:00.0","동작구"
"자체","S191223141800183999","시설대관","기타","접수중","흑석동주민센터 3층 문화의 방 ","유료","흑석동 자치회관","제한없음","http://yeyak.seoul.go.kr/reservation/view.web?rsvsvcid=S191223141800183999","37.5057786193814","126.96659075156063","2019-12-23 00:00:00.0","2020-12-31 00:00:00.0","2019-12-23 08:00:00.0","2020-12-31 23:00:00.0","동작구"
"자체","S191223154103816642","시설대관","강당","접수중","흑석동주민센터 4층다목적강당","유료","흑석동 자치회관","제한없음","http://yeyak.seoul.go.kr/reservation/view.web?rsvsvcid=S191223154103816642","37.5057786193814","126.96659075156063","2019-12-23 00:00:00.0","2020-12-31 00:00:00.0","2019-12-23 09:00:00.0","2020-12-31 18:00:00.0","동작구"
"자체","S191224150920618764","시설대관","다목적실","접수중","노량진1동주민센터 3층 다목적실","무료","노량진1동 주민센터 ","제한없음","http://yeyak.seoul.go.kr/reservation/view.web?rsvsvcid=S191224150920618764","37.51230679575601","126.94200264838538","2019-12-24 00:00:00.0","2020-12-30 00:00:00.0","2019-12-24 09:00:00.0","2020-12-30 20:00:00.0","동작구"
"자체","S191224151759073487","시설대관","다목적실","접수중","노량진1동주민센터 2층 다목적실","무료","노량진1동 주민센터 ","제한없음","http://yeyak.seoul.go.kr/reservation/view.web?rsvsvcid=S191224151759073487","37.51230679575601","126.94200264838538","2019-12-24 00:00:00.0","2020-12-30 00:00:00.0","2019-12-24 09:00:00.0","2020-12-30 21:00:00.0","동작구"
"자체","S191231173152617816","시설대관","기타","접수중","동작구 사당2동주민센터 2층컴퓨터교육장","유료","사당2동주민센터 2층 컴퓨터교육장","제한없음","http://yeyak.seoul.go.kr/reservation/view.web?rsvsvcid=S191231173152617816","37.48307245685921","126.97877108415413","2020-01-01 00:00:00.0","2020-12-31 00:00:00.0","2020-01-01 09:00:00.0","2020-12-30 00:00:00.0","동작구"
"자체","S200102200659142817","시설대관","주민사랑방","접수중","상도1동주민센터 살피재어울림방","무료","상도1동주민센터 살피재어울림방","제한없음","http://yeyak.seoul.go.kr/reservation/view.web?rsvsvcid=S200102200659142817","37.49810106158807","126.9530825673526","2020-01-02 00:00:00.0","2020-12-31 00:00:00.0","2020-01-02 00:00:00.0","2020-12-31 00:00:00.0","동작구"
"자체","S191231120334256777","시설대관","강당","접수중","사당1동 4층 강당","유료","사당1동 4층강당","제한없음","http://yeyak.seoul.go.kr/reservation/view.web?rsvsvcid=S191231120334256777","37.48307245685921","126.97877108415413","2019-12-31 00:00:00.0","2020-12-31 00:00:00.0","2019-12-31 12:00:00.0","2020-12-28 18:00:00.0","동작구"
"자체","S191231115743157745","시설대관","다목적실","접수중","사당1동 주민센터 3층 문화의 방","유료","사당1동 주민센터 3층 문화의 방","제한없음","http://yeyak.seoul.go.kr/reservation/view.web?rsvsvcid=S191231115743157745","37.48307245685921","126.97877108415413","2019-12-31 00:00:00.0","2020-12-31 00:00:00.0","2019-12-31 12:00:00.0","2020-12-28 18:00:00.0","동작구"
"자체","S191226194137591910","시설대관","회의실","접수중","상도2동주민센터 열림쉼터(소회의실)","유료","상도2동주민센터 열림쉼터(소회의실)","제한없음","http://yeyak.seoul.go.kr/reservation/view.web?rsvsvcid=S191226194137591910","37.50546651507301","126.94230199482412","2020-01-02 00:00:00.0","2020-12-31 00:00:00.0","2020-01-02 09:00:00.0","2020-12-31 18:00:00.0","동작구"