"문화행사코드","장르분류코드","장르명","제목","시작일자","종료일자","시간","장소","원문링크주소","대표이미지","홈페이지","이용대상","이용요금","주최","문의","주관및후원","기타내용","연령","무료구분","자치구"
"89444","7","전시/미술","군기시유적전시실","2017-01-01","2020-12-31","09:00-21:00","시민청 군기시유적전시실(B1)","http://seoulcitizenshall.kr/nr/?c=2/12/58&uid=2","HTTP://CULTURE.SEOUL.GO.KR/data/ci/20170710170213.jpg","","시민 누구나","무료","시민청","739-7733","시민청","","0","1","중구"
"52691","1","콘서트","페인터즈: 히어로","2010-10-01","2020-12-31","5PM / 8PM","서울극장 5층(종로) / 낙원상가 4층(인사동) / 한라아트홀 2층(제주)","www.thepainters.co.kr","HTTP://CULTURE.SEOUL.GO.KR/data/ci/20150612141411.jpg","","남녀노소 누구나 즐길 수 있는 드로잉 공연 24개월 이상 관람 가능","A석 - 40000원 / S석 - 50000원 / V석 - 60000원","","766-7855","","[액션드로잉: 히어로]를 탄생시킨 (주)펜타토닉이 제주전용관 오픈과 해외시장 진출의 성공을 기반으로 [페인터즈: 히어로]를 야심차게 완성했습니다. 더욱 강력해진 무대로 더욱 업그레이드된 감동과 즐거움을 느낄 수 있을 것입니다","0","0","종로구"
"52712","1","콘서트","요리하는 마술사","2014-09-13","2025-06-30","평일 11시2시 주말 11시1시3시","맛있는 극장","www.joynchohee.com","HTTP://CULTURE.SEOUL.GO.KR/data/ci/20150613172155.jpg","","24개월 이상","평일 5900원 주말 6900원","","070-7018-1084","1","1.쿠키만들기 체험 2.직접 마술 배우기 체험 3.신기한 마술공연까지 오감만족 이색 체험 매직컬 요리하는 마술사 요술사 입니다!!","0","0","종로구"
"77546","3","뮤지컬/오페라","댄스뮤지컬 [사랑하면 춤을춰라]","2006-01-01","2026-12-31","월 목 금 20:00 / 토 일 공휴일 15:00","종로구 삼일대로 386 시네코아 4층 사춤전용관","http://ticket.interpark.com/Ticket/Goods/GoodsInfo.asp?GoodsCode=15002469","HTTP://CULTURE.SEOUL.GO.KR/data/ci/20160622155810.JPG","","만 7세 이상","VIP석 70000원 R석 50000원 S석 40000원","","3676-7616","1","* 꿈꾸는 자에게 전하는 감동의 메시지! 어린 시절부터 함께 자란 친구 준 선 빈 3인의 탄생 성장 사랑의 모든 감정을 언어가 아닌 춤으로 표현한다. “바라고 원하는 것을 얻기 위해 열심히 노력하는 자에겐 결실이 따르는 법” [사랑하면 춤을춰라]가 던지는 희망의 메시지!","0","0","종로구"
"92616","19","문화교양/강좌","책두레 서비스 신청 온라인 운영","2015-10-20","2027-12-31","항시","온라인","http://lib.gangseo.seoul.kr/index.jsp","HTTP://CULTURE.SEOUL.GO.KR/data/ci/20170329115517.JPG","","강서구립통합도서관 회원 (통합도서관 비회원인 자는 신청 불가)","0","","3665-8797","","신청권수 : 1인당 2권 (통합도서관 대출 권수 포함) 대출기간 :14일 1회(7일) 연장가능","0","1","강서구"
"98146","7","전시/미술","규장각과 정조시대","2018-03-12","2028-12-31","09:30 ~ 17:30","서울대학교 한국규장각연구원 서울특별시 관악구 관악로1 103동 전시B1","http://e-kyujanggak.snu.ac.kr/home/index.do?idx=05&siteCd=KYU&topMenuId=205&targetId=276","HTTP://CULTURE.SEOUL.GO.KR/data/ci/20180312143357.gif","","전체","무료","","880-5318","","","0","1","관악구"
"98145","10","기타","과학체험학습","2018-03-12","2028-12-31","10:00 ~ 17:00","서울특별시 관악구 낙성대로 101","http://www.ssp.re.kr/ssp/ssp_01.jsp?cd_menu=0401","HTTP://CULTURE.SEOUL.GO.KR/data/ci/20180312142440.jpg","","전체","무료","","881-3000","","","0","1","관악구"
"98144","7","전시/미술","서화전적실 상설전","2016-10-07","2028-12-31","10:00~17:00","호림박물관(신림본관)","http://horimmuseum.org/sillim/exhibit/%ED%98%84%EC%9E%AC-%EC%A0%84%EC%8B%9C","HTTP://CULTURE.SEOUL.GO.KR/data/ci/20180312141111.jpg","","전체","- 일반 : 4000원(단체 3000원)  - 청소년 : 2000원(단체 1000원)  - 장애인 : 무료","","858-2500","","","0","0","관악구"