{
  "warnings": [
    {
      "file": "/Users/leif/Documents/_dev/OpenSource/SwiftObject/SwiftObject/Object.swift",
      "line": 39,
      "symbol": "ObjectFunction",
      "symbol_kind": "source.lang.swift.decl.typealias",
      "warning": "undocumented"
    },
    {
      "file": "/Users/leif/Documents/_dev/OpenSource/SwiftObject/SwiftObject/Object.swift",
      "line": 40,
      "symbol": "ObjectVariable",
      "symbol_kind": "source.lang.swift.decl.typealias",
      "warning": "undocumented"
    }
  ],
  "source_directory": "/Users/leif/Documents/_dev/OpenSource/SwiftObject"
}