<svg width="23" height="21" viewBox="0 0 23 21" fill="none" xmlns="http://www.w3.org/2000/svg">
<path d="M22.4732 0.978871C22.2645 0.80339 22.0105 0.686851 21.7386 0.64188C21.4667 0.59691 21.1874 0.625223 20.9309 0.723752L0.960995 8.361C0.656406 8.47747 0.398751 8.68683 0.226587 8.95775C0.0544238 9.22867 -0.0229909 9.54657 0.00592819 9.86389C0.0348472 10.1812 0.168545 10.4809 0.387014 10.7181C0.605483 10.9552 0.896976 11.1172 1.21787 11.1796L6.46427 12.2009V18.5413C6.46396 18.8331 6.55262 19.1185 6.71903 19.3612C6.88544 19.6039 7.12211 19.793 7.39905 19.9047C7.67599 20.0164 7.98075 20.0455 8.27471 19.9884C8.56868 19.9313 8.83862 19.7906 9.05035 19.584L12.001 16.7116L16.4141 20.4922C16.6885 20.7295 17.0427 20.8607 17.4098 20.8611C17.5694 20.8609 17.7279 20.8364 17.8797 20.7885C18.1301 20.7112 18.3553 20.5713 18.5328 20.3829C18.7103 20.1944 18.834 19.9639 18.8914 19.7144L22.9613 2.42563C23.0233 2.16407 23.0106 1.89099 22.9246 1.63595C22.8386 1.38091 22.6825 1.15365 22.4733 0.978766L22.4732 0.978871ZM1.29935 9.75214C1.29234 9.70646 1.30219 9.65984 1.32715 9.62055C1.35211 9.58127 1.39057 9.55187 1.43569 9.53758L18.1456 3.14707L6.96298 11.0091L1.47248 9.94006C1.42544 9.93375 1.38223 9.9114 1.35053 9.87699C1.31883 9.84258 1.3007 9.79834 1.29935 9.75214ZM8.13213 18.6904C8.10186 18.7198 8.06331 18.7399 8.02133 18.748C7.97936 18.7561 7.93585 18.752 7.89632 18.736C7.85678 18.7201 7.82298 18.6931 7.7992 18.6584C7.77542 18.6238 7.76273 18.5831 7.76272 18.5414V13.0809L11.0243 15.875L8.13213 18.6904ZM17.6258 19.4321C17.6174 19.4677 17.5997 19.5006 17.5744 19.5275C17.549 19.5544 17.517 19.5745 17.4813 19.5857C17.4456 19.5969 17.4075 19.5989 17.3708 19.5915C17.3341 19.5841 17.3 19.5675 17.2718 19.5434L8.15301 11.7317L21.6768 2.2236L17.6258 19.4321Z" fill="white"/>
</svg>
