<svg width="16" height="17" viewBox="0 0 16 17" fill="none" xmlns="http://www.w3.org/2000/svg">
<path d="M11.7003 0.0769653V1.30773H13.4748L11.3051 3.51358C10.5849 2.97348 9.69553 2.65389 8.7325 2.65389C8.00302 2.65389 7.31597 2.83789 6.71243 3.16138C6.17107 2.92753 5.59293 2.80958 5.01438 2.80958C3.90304 2.80968 2.79139 3.24127 1.94352 4.10435C0.247487 5.83091 0.247487 8.63009 1.94362 10.3566C2.6459 11.0715 3.52873 11.4894 4.44269 11.6122L4.44178 13.2406L2.65376 13.2416L2.65446 14.4724L4.44108 14.4713L4.44007 16.34L5.64915 16.3407L5.65016 14.4707L7.48715 14.4697L7.48645 13.2389L5.65076 13.2399L5.65167 11.6036C6.12925 11.5318 6.59737 11.3792 7.03455 11.1453C7.55607 11.371 8.12988 11.4961 8.7324 11.4961C11.131 11.4961 13.0754 9.51676 13.0754 7.07502C13.0754 6.05768 12.737 5.12138 12.1696 4.3742L14.2892 2.21932V3.94322H15.4983V0.0770678H11.7003V0.0769653ZM7.23042 4.97471C8.4523 6.2184 8.4522 8.2423 7.23032 9.48609C7.14962 9.56825 7.06498 9.64486 6.97752 9.71676C6.14608 9.1425 5.59857 8.17255 5.59857 7.07491C5.59857 6.07061 6.05721 5.17389 6.77198 4.58866C6.9346 4.70127 7.08826 4.82999 7.23042 4.97471ZM5.01428 10.4205C4.1772 10.4205 3.39039 10.0888 2.79844 9.4862C2.2065 8.88363 1.88055 8.08261 1.88055 7.2305C1.88055 6.3784 2.2065 5.57727 2.79844 4.97471C3.39029 4.37225 4.1773 4.04045 5.01458 4.04045H5.01468C5.19061 4.04045 5.36411 4.05594 5.53429 4.08476C4.82365 4.87194 4.38949 5.92179 4.38949 7.07502C4.38949 8.35943 4.92803 9.51543 5.78719 10.3231C5.53751 10.3871 5.27847 10.4205 5.01428 10.4205ZM8.7325 10.2653C8.55527 10.2653 8.38167 10.2495 8.2124 10.2205C9.77956 8.48589 9.73785 5.7864 8.08544 4.10445C8.04444 4.06261 8.00222 4.02281 7.9599 3.98302C8.20716 3.91891 8.4659 3.88466 8.7325 3.88466C10.4605 3.88466 11.8664 5.31584 11.8664 7.07491C11.8663 8.83399 10.4605 10.2653 8.7325 10.2653Z" fill="#E7E6E9"/>
</svg>
