<svg width="196" height="18" viewBox="0 0 196 18" fill="none" xmlns="http://www.w3.org/2000/svg">
<g filter="url(#filter0_d_227:33)">
<circle cx="9" cy="9" r="6.5" stroke="url(#paint0_linear_227:33)" stroke-opacity="0.3" shape-rendering="crispEdges"/>
</g>
<path d="M196 8.99998L16 9" stroke="url(#paint1_linear_227:33)"/>
<defs>
<filter id="filter0_d_227:33" x="0" y="0" width="18" height="18" filterUnits="userSpaceOnUse" color-interpolation-filters="sRGB">
<feFlood flood-opacity="0" result="BackgroundImageFix"/>
<feColorMatrix in="SourceAlpha" type="matrix" values="0 0 0 0 0 0 0 0 0 0 0 0 0 0 0 0 0 0 127 0" result="hardAlpha"/>
<feOffset/>
<feGaussianBlur stdDeviation="1"/>
<feComposite in2="hardAlpha" operator="out"/>
<feColorMatrix type="matrix" values="0 0 0 0 0.576471 0 0 0 0 0.341176 0 0 0 0 0.796078 0 0 0 0.5 0"/>
<feBlend mode="normal" in2="BackgroundImageFix" result="effect1_dropShadow_227:33"/>
<feBlend mode="normal" in="SourceGraphic" in2="effect1_dropShadow_227:33" result="shape"/>
</filter>
<linearGradient id="paint0_linear_227:33" x1="1.9348" y1="10.5165" x2="13.948" y2="0.366526" gradientUnits="userSpaceOnUse">
<stop stop-color="#5B61DC"/>
<stop offset="0.509124" stop-color="#C4C9FF"/>
<stop offset="1" stop-color="#533DD9"/>
</linearGradient>
<linearGradient id="paint1_linear_227:33" x1="25.4278" y1="9" x2="25.5546" y2="4.85704" gradientUnits="userSpaceOnUse">
<stop stop-color="#5B61DC" stop-opacity="0.22"/>
<stop offset="0.509124" stop-color="#C4C9FF"/>
<stop offset="1" stop-color="#533DD9" stop-opacity="0.31"/>
</linearGradient>
</defs>
</svg>
