<svg width="66" height="17" viewBox="0 0 66 17" fill="none" xmlns="http://www.w3.org/2000/svg">
<path d="M57.7116 0.740234C58.8881 0.740234 60.0075 1.01076 61.012 1.49469C61.1696 1.56602 61.3281 1.65139 61.4851 1.73684L60.7964 2.34915L59.7638 1.28137L57.9846 2.84727L56.9368 1.72243L53.6651 4.64105L55.7598 6.93317L54.942 7.64482L57.0086 9.93694L56.1908 10.6483L59.147 13.9086L60.8966 12.314L62.4184 14.0228C62.1168 14.2506 61.7867 14.4789 61.4284 14.6779C60.3377 15.29 59.0747 15.6452 57.726 15.6452C53.5787 15.6452 50.2071 12.3003 50.2071 8.18632C50.1924 4.10013 53.5646 0.740234 57.7116 0.740234ZM56.3338 7.73042L58.1275 6.13584L59.735 7.91535L57.9409 9.50978L56.3338 7.73042ZM57.6112 10.8056L59.3904 9.1969L61.012 10.9763L59.2182 12.5709L57.6112 10.8056ZM55.0574 4.69819L56.8507 3.10361L58.4578 4.88312L56.664 6.47762L55.0574 4.69819ZM58.3428 3.84372L59.6774 2.64792L60.8831 3.97197L59.5484 5.1819L58.3428 3.84372ZM60.7251 9.32477L62.0592 8.12889L63.2648 9.46677L61.9301 10.6634L60.7251 9.32477ZM61.9016 12.0157L63.2362 10.8196L64.4409 12.1436L63.1067 13.3534L61.9016 12.0157ZM62.4469 5.86531L63.3365 5.06798L64.1398 5.95098L63.2504 6.74801L62.4469 5.86531ZM61.299 3.23155L62.1886 2.42025L62.9925 3.317L62.1022 4.11425L61.299 3.23155ZM63.5804 8.49929L64.4699 7.70204L65.2878 8.58474L64.3841 9.38177L63.5804 8.49929ZM59.577 6.52035L60.9117 5.32447L62.1168 6.64823L60.7827 7.84433L59.577 6.52035Z" fill="white" fill-opacity="0.88"/>
<mask id="mask0_88_1474" style="mask-type:alpha" maskUnits="userSpaceOnUse" x="0" y="3" width="9" height="8">
<path d="M0.498047 3.83789V10.7192H8.34108V3.83789H0.498047Z" fill="white"/>
</mask>
<g mask="url(#mask0_88_1474)">
<path d="M4.43602 5.87503H4.36834L3.09766 10.7187H2.05906L0.5 3.8374H1.57761L2.65547 8.97201H2.72278L3.97358 3.8374H4.83031L6.16797 8.97201H6.23533L7.21704 3.8374H8.34303L6.78358 10.7187H5.74419L4.43602 5.87503Z" fill="white" fill-opacity="0.88"/>
</g>
<path d="M9.70774 7.78864H11.911C11.8632 6.76986 11.3722 6.36259 10.8527 6.36259C10.2657 6.36259 9.81314 6.81865 9.70774 7.78864ZM12.6808 9.61384V10.3516C12.2478 10.6039 11.6707 10.7981 10.9775 10.7981C9.36122 10.7981 8.69727 9.78873 8.69727 8.25542C8.69727 6.77955 9.43807 5.71191 10.8816 5.71191C12.0841 5.71191 12.8256 6.4986 12.8256 8.08024V8.43939H9.68844C9.68844 9.60371 10.1597 10.1182 11.1512 10.1182C11.6707 10.1182 12.1519 9.93353 12.6808 9.61384Z" fill="white" fill-opacity="0.88"/>
<path d="M15.0683 10.0205C15.3763 10.1563 15.7133 10.1764 15.9543 10.1764C16.6663 10.1764 17.2046 9.72933 17.2046 8.15745C17.2046 6.92483 16.762 6.52687 16.1175 6.52687C15.7323 6.52687 15.4533 6.63397 15.0683 6.84707V10.0205H15.0683ZM15.0784 6.12906C15.3664 5.97428 15.8571 5.76975 16.3769 5.76975C17.5703 5.76975 18.2152 6.6044 18.2152 8.15745C18.2152 9.97252 17.3489 10.8557 15.9543 10.8557C15.4439 10.8557 14.6549 10.6907 14.0771 10.3794V3.60558L15.0784 3.36328V6.12906H15.0784Z" fill="white" fill-opacity="0.88"/>
<path d="M22.5426 9.25847H22.5908L24.6498 3.83301H25.8437V10.7148H24.8044V5.72576H24.7176L22.7542 10.7148H22.1389L20.1751 5.8424H20.0888V10.7148H19.2227V3.83301H20.3874L22.5426 9.25847Z" fill="white" fill-opacity="0.88"/>
<path d="M30.091 8.25513C30.091 6.94497 29.5621 6.39201 28.9078 6.39201C28.2729 6.39201 27.7239 6.94498 27.7239 8.25513C27.7239 9.58494 28.2249 10.1182 28.9078 10.1182C29.5907 10.1182 30.091 9.58495 30.091 8.25513ZM26.7139 8.25513C26.7139 6.55603 27.6379 5.71191 28.9078 5.71191C30.1784 5.71191 31.102 6.55603 31.102 8.25513C31.102 9.91446 30.2263 10.7981 28.9078 10.7981C27.5895 10.7981 26.7139 9.91446 26.7139 8.25513Z" fill="white" fill-opacity="0.88"/>
<path d="M31.8643 6.43067C32.2972 6.16819 33.2118 5.71191 34.3182 5.71191C35.4729 5.71191 35.9051 6.16819 35.9051 7.1676V10.6815H34.905V7.39112C34.905 6.62455 34.5304 6.48868 34.039 6.48868C33.6545 6.48868 33.1631 6.66364 32.8651 6.8383V10.6815H31.8643V6.43067H31.8643Z" fill="white" fill-opacity="0.88"/>
<path d="M38.0199 7.78864H40.2234C40.176 6.76986 39.6847 6.36259 39.165 6.36259C38.5779 6.36259 38.1262 6.81865 38.0199 7.78864ZM40.993 9.61384V10.3516C40.5603 10.6039 39.9829 10.7981 39.2899 10.7981C37.6742 10.7981 37.0098 9.78873 37.0098 8.25542C37.0098 6.77955 37.7503 5.71191 39.1939 5.71191C40.3972 5.71191 41.1385 6.4986 41.1385 8.08024V8.43939H38.001C38.001 9.60371 38.4726 10.1182 39.4638 10.1182C39.9828 10.1182 40.4647 9.93353 40.993 9.61384Z" fill="white" fill-opacity="0.88"/>
<path d="M45.1398 5.71191H46.1698L44.4279 10.5641C43.946 11.9036 43.3597 12.6025 42.2533 12.6025V11.8071C42.908 11.8071 43.3116 11.2828 43.543 10.5641L41.6953 5.71191H42.754L43.9857 9.28351H44.0434L45.1398 5.71191Z" fill="white" fill-opacity="0.88"/>
<path d="M10.8946 15.1913V14.7722C11.2514 14.9541 11.591 15.0454 11.9127 15.0454C12.1807 15.0454 12.386 14.9961 12.5294 14.8965C12.6729 14.7976 12.7447 14.6639 12.7447 14.4948C12.7447 14.3259 12.6857 14.1991 12.5677 14.1148C12.45 14.0306 12.2299 13.9263 11.908 13.8028C11.7963 13.7606 11.7249 13.7332 11.6927 13.7201C11.661 13.7074 11.5988 13.6811 11.5062 13.6423C11.4139 13.6036 11.3534 13.5741 11.3248 13.5547C11.296 13.5347 11.2476 13.5053 11.1789 13.4669C11.1104 13.4275 11.0643 13.3928 11.0402 13.3625C11.0166 13.3313 10.9837 13.2919 10.9422 13.2449C10.9009 13.1981 10.8729 13.1515 10.8585 13.104C10.8443 13.057 10.8305 13.0026 10.8179 12.9408C10.8053 12.8788 10.7988 12.8125 10.7988 12.741C10.7988 12.4648 10.9001 12.2429 11.1024 12.0738C11.3049 11.9053 11.5844 11.8208 11.9415 11.8208C12.2569 11.8208 12.5711 11.8791 12.8832 11.9961V12.4391C12.5804 12.2895 12.2777 12.2154 11.9749 12.2154C11.7613 12.2154 11.602 12.2601 11.4968 12.351C11.3916 12.4418 11.339 12.562 11.339 12.7116C11.339 12.8708 11.3916 12.9915 11.4968 13.0745C11.602 13.1578 11.7901 13.2496 12.0611 13.35C12.5262 13.5221 12.8467 13.6779 13.0218 13.8178C13.1972 13.957 13.2848 14.1654 13.2848 14.441C13.2848 14.7303 13.1645 14.9668 12.9239 15.1502C12.6832 15.3337 12.3527 15.4255 11.9319 15.4255C11.5464 15.4255 11.2005 15.3472 10.8946 15.1913ZM15.7589 15.3517H15.3048L15.2712 15.0692C14.9969 15.2968 14.723 15.4107 14.4489 15.4107C14.2195 15.4107 14.0418 15.3483 13.916 15.2229C13.7899 15.0979 13.727 14.94 13.727 14.7479C13.727 14.6471 13.7453 14.5508 13.782 14.4582C13.8187 14.3655 13.8793 14.2757 13.9636 14.188C14.0481 14.1002 14.1755 14.0298 14.346 13.976C14.5165 13.9221 14.7214 13.8955 14.9605 13.8955H15.257V13.764C15.257 13.5464 15.2171 13.3983 15.1374 13.3183C15.0575 13.2387 14.9237 13.199 14.7358 13.199C14.5063 13.199 14.2242 13.2943 13.8897 13.4864V13.0968C14.2339 12.9377 14.5716 12.8575 14.903 12.8575C15.2248 12.8575 15.4481 12.9245 15.5722 13.0579C15.6967 13.1908 15.7589 13.3924 15.7589 13.6613V15.3517ZM15.2618 14.2363H15.0082C14.4854 14.2363 14.2242 14.3939 14.2242 14.709C14.2242 14.8199 14.2591 14.8994 14.3293 14.95C14.3996 15.0005 14.4872 15.0254 14.5925 15.0254C14.7261 15.0254 14.8553 14.9929 14.9796 14.9278C15.1038 14.8632 15.198 14.7886 15.2618 14.7041V14.2363H15.2618ZM16.5357 16.3263V13.2139C16.676 13.1064 16.8415 13.02 17.0329 12.9552C17.2242 12.8907 17.412 12.8575 17.5971 12.8575C18.2598 12.8575 18.5914 13.2653 18.5914 14.0808C18.5914 14.5029 18.5054 14.8261 18.3331 15.0497C18.1611 15.2741 17.9143 15.3856 17.5922 15.3856C17.369 15.3856 17.1826 15.3288 17.0329 15.2158V16.3263H16.5357ZM17.0281 13.3789V14.8555C17.0918 14.9169 17.1722 14.9626 17.2695 14.9937C17.3667 15.0245 17.4521 15.0399 17.5253 15.0399C17.7005 15.0399 17.8385 14.9713 17.9389 14.8333C18.0393 14.695 18.0893 14.4442 18.0893 14.0808C18.0893 13.7853 18.0378 13.5687 17.9342 13.433C17.8306 13.2962 17.6958 13.2283 17.53 13.2283C17.3422 13.2283 17.1749 13.2783 17.0281 13.3789ZM19.7316 12.8826V15.3517H19.2345V13.0041L19.7316 12.8826ZM19.1579 12.1661C19.1579 12.0785 19.1905 12.0016 19.2558 11.9346C19.3213 11.8681 19.397 11.8347 19.4828 11.8347C19.5691 11.8347 19.6447 11.8681 19.7102 11.9346C19.7755 12.0016 19.8082 12.0785 19.8082 12.1661C19.8082 12.2538 19.7755 12.3312 19.7102 12.398C19.6447 12.4639 19.5691 12.4974 19.4828 12.4974C19.3971 12.4974 19.3213 12.4639 19.2558 12.398C19.1905 12.3312 19.1579 12.2538 19.1579 12.1661ZM21.5937 15.0692C21.8233 15.0692 22.0764 14.9847 22.3538 14.8162V15.1864C22.0989 15.336 21.8168 15.4106 21.5077 15.4106C21.1188 15.4106 20.8329 15.2985 20.6496 15.0743C20.4663 14.8501 20.3747 14.5369 20.3747 14.1342C20.3747 13.7508 20.4688 13.442 20.6566 13.2089C20.8448 12.9751 21.1123 12.8575 21.4597 12.8575C21.7659 12.8575 22.003 12.9585 22.1724 13.1601C22.3412 13.3617 22.4254 13.6568 22.4254 14.0464V14.2269H20.8671C20.8671 14.516 20.9261 14.729 21.0439 14.8646C21.1618 15.0015 21.3451 15.0692 21.5937 15.0692ZM21.4453 13.1845C21.2958 13.1845 21.1697 13.2446 21.0677 13.3643C20.9659 13.4846 20.902 13.6636 20.8766 13.9H21.9713C21.9584 13.66 21.9028 13.481 21.804 13.3625C21.7053 13.2437 21.5858 13.1845 21.4453 13.1845ZM23.0588 15.3517V13.2185C23.4508 12.9779 23.8572 12.8575 24.2781 12.8575C24.5617 12.8575 24.7639 12.9164 24.8851 13.0335C25.0062 13.1505 25.0668 13.3354 25.0668 13.5885V15.3517H24.5697V13.7006C24.5697 13.5221 24.5329 13.4018 24.4597 13.3404C24.3863 13.2783 24.2797 13.2477 24.1393 13.2477C23.9482 13.2477 23.7537 13.3064 23.5562 13.4232V15.3517H23.0588V15.3517ZM26.3169 12.9751H27.0723L26.9527 13.3064H26.3169V14.592C26.3169 14.9169 26.454 15.0792 26.728 15.0792C26.8332 15.0792 26.9399 15.0567 27.0486 15.0111V15.3225C26.8987 15.3812 26.7201 15.4107 26.513 15.4107C26.2739 15.4107 26.0987 15.3415 25.987 15.203C25.8756 15.0656 25.8197 14.8844 25.8197 14.6597V12.6533L26.3169 12.2876V12.9751H26.3169ZM28.0454 12.8826V15.3517H27.5481V13.0041L28.0454 12.8826ZM27.4717 12.1661C27.4717 12.0785 27.5044 12.0016 27.5694 11.9346C27.6347 11.8681 27.7104 11.8347 27.7967 11.8347C27.8826 11.8347 27.9585 11.8681 28.0236 11.9346C28.0891 12.0016 28.1218 12.0785 28.1218 12.1661C28.1218 12.2538 28.0891 12.3312 28.0236 12.398C27.9585 12.4639 27.8826 12.4974 27.7967 12.4974C27.7104 12.4974 27.6347 12.4639 27.5694 12.398C27.5044 12.3312 27.4717 12.2538 27.4717 12.1661ZM31.43 13.0528V13.442C31.1909 13.2798 30.9486 13.199 30.7035 13.199C30.5791 13.199 30.4772 13.2233 30.3973 13.2721C30.3177 13.3205 30.2778 13.3988 30.2778 13.5053C30.2778 13.6066 30.3216 13.6867 30.4092 13.7467C30.4969 13.807 30.6348 13.8679 30.823 13.9292C30.9282 13.965 31.0069 13.9927 31.0594 14.0121C31.1121 14.0321 31.1813 14.0646 31.2675 14.1097C31.3535 14.1554 31.4181 14.2004 31.4611 14.2463C31.5041 14.2919 31.5431 14.3516 31.5783 14.4265C31.6133 14.5012 31.6306 14.5838 31.6306 14.6748C31.6306 14.899 31.5422 15.0775 31.3656 15.2107C31.1887 15.3438 30.9518 15.4107 30.6557 15.4107C30.324 15.4107 30.0482 15.3392 29.8284 15.1959V14.8162C30.1088 14.9848 30.3654 15.0692 30.5983 15.0692C30.9486 15.0692 31.124 14.9527 31.124 14.7186C31.124 14.6734 31.1136 14.6308 31.093 14.592C31.0722 14.5531 31.0484 14.5215 31.0213 14.497C30.9941 14.4727 30.9502 14.4452 30.8896 14.4138C30.829 14.3836 30.7782 14.361 30.7367 14.3461C30.6954 14.3316 30.63 14.3081 30.5409 14.2757C30.4101 14.2269 30.3065 14.1848 30.2299 14.1489C30.1533 14.1129 30.0771 14.0668 30.0005 14.0102C29.9239 13.9533 29.8681 13.8855 29.8332 13.8078C29.7983 13.7301 29.7807 13.6373 29.7807 13.5303C29.7807 13.3938 29.8125 13.2772 29.8762 13.18C29.9399 13.082 30.023 13.0122 30.1247 12.9701C30.2268 12.9278 30.32 12.8984 30.4044 12.8826C30.489 12.8658 30.5726 12.8575 30.6557 12.8575C30.9266 12.8575 31.1847 12.9227 31.43 13.0528ZM34.0712 15.3517H33.6172L33.5835 15.0692C33.3093 15.2968 33.0354 15.4107 32.7615 15.4107C32.532 15.4107 32.3543 15.3483 32.2284 15.2229C32.1023 15.0979 32.0395 14.94 32.0395 14.7479C32.0395 14.6471 32.0578 14.5508 32.0946 14.4582C32.1312 14.3655 32.1917 14.2757 32.2762 14.188C32.3609 14.1002 32.488 14.0298 32.6585 13.976C32.8291 13.9221 33.034 13.8955 33.2727 13.8955H33.5695V13.764C33.5695 13.5464 33.5294 13.3983 33.4502 13.3183C33.37 13.2387 33.2362 13.199 33.0485 13.199C32.8188 13.199 32.5367 13.2943 32.2021 13.4864V13.0968C32.5464 12.9377 32.8841 12.8575 33.2155 12.8575C33.5376 12.8575 33.7604 12.9245 33.8848 13.0579C34.009 13.1908 34.0712 13.3924 34.0712 13.6613V15.3517H34.0712ZM33.5745 14.2363H33.3208C32.7981 14.2363 32.5367 14.3939 32.5367 14.709C32.5367 14.8199 32.5718 14.8994 32.6418 14.95C32.7121 15.0005 32.7995 15.0254 32.9049 15.0254C33.0386 15.0254 33.1673 14.9929 33.2921 14.9278C33.4164 14.8632 33.5106 14.7886 33.5745 14.7041V14.2363H33.5745ZM35.3217 12.9751H36.077L35.9571 13.3064H35.3217V14.592C35.3217 14.9169 35.4586 15.0792 35.7323 15.0792C35.8377 15.0792 35.9441 15.0567 36.0529 15.0111V15.3225C35.9031 15.3812 35.7248 15.4107 35.5171 15.4107C35.2784 15.4107 35.1032 15.3415 34.9916 15.203C34.88 15.0656 34.824 14.8844 34.824 14.6597V12.6533L35.3217 12.2876V12.9751H35.3217Z" fill="#5CBCFF"/>
</svg>
