<svg width="145" height="245" viewBox="0 0 145 245" fill="none" xmlns="http://www.w3.org/2000/svg">
<path d="M156.687 154.82C156.647 154.901 156.486 154.955 156.365 154.901C156.245 154.874 145.911 152.103 144.785 151.807C144.664 151.78 144.584 151.673 144.664 151.592C144.704 151.511 144.865 151.458 144.986 151.511C146.112 151.807 156.446 154.578 156.566 154.605C156.647 154.632 156.727 154.74 156.687 154.82Z" fill="#876FF2" fill-opacity="0.5"/>
<path d="M148.523 57.3255C148.321 57.2986 148 57.2179 147.638 57.0834C147.276 56.9758 146.713 56.626 146.391 56.5453C146.03 56.4646 145.467 56.3032 145.467 56.3032C145.668 56.088 146.954 55.7114 147.316 55.6845C147.678 55.6575 148.603 55.3616 148.603 55.3347C148.643 55.3078 148.683 55.2271 148.603 55.1733C148.482 55.1464 148.04 55.2271 147.759 55.254C147.437 55.3078 146.753 55.1464 146.351 55.1464C145.949 55.1464 145.145 55.2271 145.145 55.2271C145.145 55.2271 145.145 55.2271 145.828 54.6622C146.512 54.0972 147.316 53.9627 147.517 53.882C147.718 53.8013 148 53.6668 148 53.5861C148 53.5053 147.799 53.5591 147.638 53.6399C147.477 53.7206 146.794 53.6668 146.391 53.7744C145.989 53.8551 145.306 54.0434 144.863 54.151C144.421 54.2586 144.14 54.2586 144.14 54.2586C144.18 54.1779 144.582 53.8282 144.984 53.3439C145.386 52.8597 145.949 52.1871 146.03 52.0795C146.11 51.9719 146.03 51.8374 145.869 51.9988C145.708 52.1333 145.346 52.3216 144.783 52.5638C144.22 52.8059 143.416 53.2363 143.134 53.5053C142.853 53.7744 142.692 53.7206 142.692 53.7206C142.652 53.613 142.933 52.4023 143.054 52.214C143.175 52.0257 143.094 51.3531 143.014 51.1648C142.933 50.9765 142.652 50.9496 142.773 51.2186C142.893 51.4877 142.049 52.2678 141.888 52.4831C141.687 52.6983 141.285 53.3977 141.285 53.3977C141.285 53.3977 141.084 52.4561 140.883 52.0795C140.641 51.7029 140.561 51.2186 140.521 51.0303C140.521 50.9765 140.481 50.9496 140.481 50.9227C140.44 50.842 140.44 50.7882 140.44 50.7882C140.44 50.7882 140.28 50.7075 140.28 50.8958C140.28 51.0841 139.636 51.7029 139.516 52.1064C139.395 52.51 139.556 53.4515 139.556 53.4515C139.556 53.4515 138.631 52.8328 138.39 52.4561C138.229 52.214 136.982 51.6491 137.023 51.38C137.063 51.111 136.781 51.1648 136.781 51.3531C136.781 51.5415 136.862 52.214 137.063 52.3754C137.224 52.5369 137.827 53.6937 137.827 53.8013C137.827 53.8013 137.666 53.882 137.304 53.6668C136.982 53.4515 136.017 53.1018 135.414 52.9673C134.811 52.8059 134.369 52.6983 134.168 52.5638C133.967 52.4292 133.926 52.5638 134.047 52.6714C134.168 52.779 134.891 53.3708 135.454 53.7744C135.977 54.1779 136.5 54.4738 136.58 54.5545C136.58 54.5545 136.339 54.5814 135.857 54.5545C135.374 54.5007 134.65 54.42 134.248 54.3931C133.806 54.3662 133.162 54.4738 133.002 54.4469C132.801 54.3931 132.6 54.3662 132.64 54.4469C132.68 54.5276 133.002 54.6353 133.203 54.6891C133.444 54.7429 134.288 54.7698 135.093 55.2271C135.897 55.7114 135.897 55.7114 135.897 55.7114C135.897 55.7114 135.093 55.7383 134.69 55.7921C134.288 55.8459 133.645 56.088 133.323 56.088C133.002 56.088 132.559 56.0611 132.439 56.1149C132.358 56.1687 132.439 56.2225 132.479 56.2763C132.519 56.3032 133.484 56.4646 133.846 56.4646C134.248 56.4646 135.575 56.6529 135.857 56.8413C135.857 56.8413 135.334 57.0834 135.012 57.2179C134.69 57.3524 134.248 57.7559 133.926 57.9174C133.605 58.0788 133.323 58.2133 133.122 58.2671C132.921 58.3209 133.002 58.3478 133.082 58.4016C133.162 58.4554 133.565 58.4016 134.087 58.294C134.57 58.1864 136.138 57.9443 136.379 57.9174C136.62 57.8905 136.62 57.8905 136.62 57.8905C136.62 57.8905 135.776 58.3747 135.495 58.6168C135.173 58.8589 134.731 59.4508 134.65 59.6122C134.57 59.7467 134.53 59.8274 134.69 59.7736C134.811 59.7198 135.133 59.4777 135.535 59.3163C135.977 59.1549 136.741 58.8859 137.425 58.4285C137.425 58.4285 137.063 58.9666 137.023 59.2894C136.982 59.6122 136.781 60.0427 136.5 60.2041C136.218 60.3655 135.937 60.5807 136.058 60.6345C136.138 60.6883 136.822 60.5538 137.103 60.3117C137.384 60.0427 138.39 59.2894 138.631 59.2087C138.631 59.2087 138.832 59.1818 138.711 59.5584C138.551 59.962 138.591 60.4462 138.752 60.769C138.872 61.0919 138.912 61.1995 138.912 61.2802C138.912 61.3609 139.073 61.3878 139.113 61.2533C139.154 61.1457 139.636 60.0427 139.958 59.6122C140.28 59.1818 140.521 59.2087 140.481 59.2625C140.481 59.2625 140.481 59.3163 140.521 59.397C140.521 59.5315 140.521 59.6122 140.521 59.6122C140.561 59.7467 140.883 60.3117 141.124 60.6345C141.365 60.9573 141.566 61.3071 141.687 61.4954C141.808 61.6837 142.049 61.603 142.009 61.4954C141.968 61.3878 142.049 61.2802 141.968 61.0112C141.888 60.7421 142.049 60.3117 142.049 59.9081C142.049 59.5046 141.848 59.4508 141.808 59.397C141.767 59.3432 141.968 59.2894 142.411 59.666C142.853 60.0427 143.657 61.0381 143.697 61.1726C143.738 61.2802 143.898 61.2264 143.898 61.1726C143.898 61.0919 143.858 60.9843 143.898 60.6614C143.939 60.3117 143.818 59.8274 143.577 59.4777C143.335 59.1011 143.537 59.128 143.537 59.128C143.778 59.1549 145.024 59.8005 145.346 60.0158C145.708 60.231 146.391 60.2579 146.472 60.2041C146.552 60.1503 146.231 59.962 145.909 59.8274C145.587 59.7198 145.266 59.3163 145.105 58.9935C144.944 58.6975 144.461 58.2133 144.461 58.2133C145.266 58.5899 146.11 58.7244 146.592 58.859C147.075 58.9666 147.437 59.1818 147.557 59.2087C147.678 59.2356 147.678 59.1818 147.517 59.0473C147.397 58.9128 146.753 58.4016 146.391 58.1864C146.03 57.9712 145.064 57.6214 145.064 57.6214C145.064 57.6214 145.065 57.6214 145.306 57.6214C145.547 57.6214 147.155 57.6483 147.678 57.7021C148.201 57.729 148.603 57.7559 148.683 57.7021C148.683 57.3793 148.724 57.3524 148.523 57.3255ZM140.481 51.7298V51.7029V51.7298Z" fill="#876FF2" fill-opacity="0.5"/>
<path d="M25.04 233.914C25.1606 233.752 38.9926 236.12 39.1936 235.797C39.3947 235.42 25.7235 232.434 25.6431 232.192C25.5627 231.95 39.5555 230.874 39.2741 230.47C38.9926 230.067 24.9194 230.82 24.7585 230.632C24.6379 230.443 30.1064 223.906 29.6238 223.664C29.1413 223.422 22.547 229.636 22.2253 229.609C21.9037 229.582 23.3914 217.718 22.7481 219.171C22.0645 220.624 19.853 229.098 19.4911 229.071C19.1292 229.044 13.701 221.458 13.4999 221.646C13.2989 221.835 16.2744 229.771 15.9929 229.878C15.7114 229.986 6.9458 225.87 7.02622 226.085C7.10664 226.327 15.0279 231.008 14.8268 231.25C14.6258 231.519 -0.211449 229.959 0.190644 230.147C0.592737 230.336 14.7062 233.187 14.7464 233.376C14.7866 233.564 5.69932 236.523 5.86016 236.846C5.94057 237.034 15.7114 234.855 15.7114 234.99C15.7114 235.124 9.19752 241.581 9.76045 241.796C10.0821 241.931 18.124 235.878 18.124 235.878C18.2044 236.12 17.0383 244.836 17.2394 244.836C17.4404 244.836 20.617 235.985 20.9788 236.012C21.3005 236.039 25.0802 242.845 25.2812 242.738C25.4823 242.657 23.8337 235.286 23.9141 235.313C23.9945 235.34 33.2829 239.778 33.4437 239.644C33.6448 239.563 24.8791 234.075 25.04 233.914Z" fill="#876FF2" fill-opacity="0.5"/>
<path d="M83.5438 15.7076C83.6644 15.5462 97.4964 17.9136 97.6975 17.5908C97.8985 17.2142 84.2273 14.228 84.1469 13.9859C84.0665 13.7437 98.0594 12.6676 97.7779 12.2641C97.4965 11.8606 83.4232 12.6138 83.2623 12.4255C83.1417 12.2372 88.6102 5.69989 88.1277 5.45777C87.6451 5.24254 81.091 11.4301 80.7693 11.4301C80.4477 11.4032 81.9354 -0.460789 81.2921 0.991947C80.6085 2.44468 78.397 10.919 78.0351 10.8921C77.6732 10.8652 72.2449 3.27866 72.0439 3.46698C71.8429 3.6553 74.8183 11.5915 74.5369 11.6992C74.2554 11.8068 65.4898 7.69067 65.5702 7.9059C65.6506 8.14802 73.5719 12.8291 73.3708 13.0712C73.1698 13.3402 58.3325 11.7799 58.7346 11.9682C59.1367 12.1565 73.2502 15.0082 73.2904 15.1965C73.3306 15.3848 64.2433 18.3441 64.4041 18.6669C64.4845 18.8552 74.2554 16.6761 74.2554 16.8106C74.2554 16.9451 67.7415 23.4017 68.3044 23.617C68.6261 23.7515 76.668 17.6984 76.668 17.6984C76.7484 17.9405 75.5823 26.657 75.7834 26.657C75.9844 26.657 79.161 17.806 79.5228 17.8329C79.8445 17.8598 83.6242 24.6662 83.8253 24.5586C84.0263 24.4778 82.3777 17.1066 82.4581 17.1335C82.5386 17.1604 91.8269 21.5993 91.9878 21.4648C92.1486 21.3303 83.4232 15.8421 83.5438 15.7076Z" fill="#876FF2" fill-opacity="0.5"/>
<path d="M48.5227 65.6921C48.5227 65.4769 48.2412 65.2886 47.9196 65.2886L36.3795 65.4231L42.6522 62.9212C42.9336 62.8136 43.014 62.5714 42.8532 62.3831C42.6924 62.1948 42.3305 62.141 42.049 62.2486L35.7362 64.7774L39.2746 60.5268C39.4354 60.3385 39.3148 60.0964 39.0333 59.9888C38.7519 59.8812 38.39 59.9619 38.2291 60.1502L34.5299 64.616L34.2886 57.3523C34.2886 57.1371 34.0072 56.9488 33.6855 56.9757C33.3638 56.9757 33.0824 57.164 33.1226 57.3793L33.3638 64.6429L29.2625 60.0695C29.1016 59.8812 28.7398 59.8274 28.4583 59.935C28.1768 60.0426 28.0964 60.2847 28.2572 60.473L32.238 64.912L25.3622 62.3562C25.0807 62.2486 24.7188 62.3293 24.558 62.5176C24.3972 62.7059 24.5178 62.9481 24.7993 63.0557L31.4338 65.5307L20.4567 65.6652C20.135 65.6652 19.8535 65.8535 19.8535 66.0688C19.8535 66.2571 20.0948 66.4454 20.3762 66.4454C20.4165 66.4454 20.4164 66.4454 20.4567 66.4454L31.9967 66.3109L24.759 69.2164C24.4776 69.324 24.3972 69.5661 24.558 69.7544C24.6384 69.862 24.8395 69.9427 25.0003 69.9427C25.1209 69.9427 25.2416 69.9427 25.3622 69.8889L32.5596 66.9834L28.4583 71.9335C28.2975 72.1218 28.4181 72.3639 28.6995 72.4716C28.78 72.4985 28.8604 72.5254 28.9006 72.5254C29.1418 72.5523 29.3831 72.4716 29.5037 72.3101L33.4844 67.5215L33.7659 75.0273C33.7659 75.2156 34.0072 75.377 34.2886 75.4039C34.3288 75.4039 34.3288 75.4039 34.3691 75.4039C34.6907 75.4039 34.9722 75.2156 34.932 75.0004L34.6505 67.6022L38.6312 72.0411C38.7116 72.1487 38.9127 72.2294 39.0735 72.2294C39.1942 72.2294 39.3148 72.2294 39.4354 72.1756C39.7169 72.068 39.7973 71.8259 39.6365 71.6376L35.4949 67.0373L42.4109 69.593C42.4913 69.6199 42.5717 69.6468 42.6119 69.6468C42.8532 69.6737 43.0945 69.593 43.2151 69.4316C43.3759 69.2433 43.2553 69.0011 42.9738 68.8935L35.8568 66.2571L47.9598 66.1226C48.2412 66.0957 48.5227 65.9074 48.5227 65.6921Z" fill="#876FF2" fill-opacity="0.5"/>
<path d="M29.9863 58.2135C29.8657 58.2135 29.7049 58.1597 29.6646 58.079C29.544 57.8906 27.0109 53.6938 26.8501 53.4517C26.8099 53.3441 26.8903 53.2096 27.0511 53.1558C27.212 53.1289 27.413 53.1827 27.4934 53.2903C27.5738 53.4786 29.544 56.68 30.2678 57.8906C30.3482 57.9983 30.2678 58.1328 30.0667 58.1866C30.0667 58.2135 30.0265 58.2135 29.9863 58.2135Z" fill="#876FF2" fill-opacity="0.5"/>
<path d="M36.7808 57.8908C36.7406 57.8908 36.7004 57.8908 36.6602 57.8908C36.4994 57.837 36.3788 57.7294 36.4592 57.5949L40.0779 50.7078C40.1583 50.6002 40.3191 50.5195 40.5202 50.5733C40.681 50.6271 40.8016 50.7347 40.7212 50.8692L37.1025 57.7563C37.0623 57.837 36.9015 57.8908 36.7808 57.8908Z" fill="#876FF2" fill-opacity="0.5"/>
<path d="M41.9688 60.716C41.8884 60.716 41.8482 60.716 41.7677 60.6891C41.6069 60.6084 41.5667 60.4739 41.6873 60.3663C41.9286 60.1241 47.9197 56.4116 49.7292 55.3086C49.8498 55.2279 50.091 55.2279 50.2117 55.3086C50.3323 55.3893 50.3323 55.5507 50.2117 55.6314C47.1558 57.5146 42.5317 60.3932 42.2503 60.6084C42.21 60.6891 42.0894 60.716 41.9688 60.716Z" fill="#876FF2" fill-opacity="0.5"/>
<path d="M25.362 61.0648C25.2816 61.0648 25.2012 61.0379 25.1207 60.9841L20.4967 57.8096C20.3761 57.7289 20.3761 57.5675 20.4967 57.4868C20.6173 57.4061 20.8586 57.4061 20.9792 57.4868L25.6033 60.6613C25.7239 60.742 25.7239 60.9034 25.6033 60.9841C25.563 61.0379 25.4826 61.0648 25.362 61.0648Z" fill="#876FF2" fill-opacity="0.5"/>
<path d="M22.4668 64.5358H22.4266L11.4093 63.4059C11.2082 63.379 11.0876 63.2713 11.1278 63.1368C11.168 63.0023 11.3289 62.9216 11.5299 62.9485L22.5473 64.0784C22.7483 64.1053 22.8689 64.2129 22.8287 64.3475C22.7885 64.4551 22.6277 64.5358 22.4668 64.5358Z" fill="#876FF2" fill-opacity="0.5"/>
<path d="M12.7768 72.0682C12.6561 72.0682 12.5355 72.0413 12.4953 71.9606C12.4149 71.853 12.4551 71.7185 12.6159 71.6378L21.5827 67.9791C21.7436 67.9252 21.9446 67.9521 22.0653 68.0598C22.1457 68.1674 22.1055 68.3019 21.9446 68.3826L12.9778 72.0413C12.8974 72.0682 12.817 72.0682 12.7768 72.0682Z" fill="#876FF2" fill-opacity="0.5"/>
<path d="M20.4163 75.485C20.3359 75.485 20.2554 75.458 20.175 75.4311C20.0142 75.3504 20.0142 75.189 20.1348 75.1083L25.362 71.2075C25.4826 71.0999 25.7239 71.0999 25.8445 71.1806C26.0053 71.2613 26.0053 71.4227 25.8847 71.5034L20.6575 75.4042C20.6173 75.458 20.4967 75.485 20.4163 75.485Z" fill="#876FF2" fill-opacity="0.5"/>
<path d="M29.5034 79.8701C29.4632 79.8701 29.4632 79.8701 29.423 79.8701C29.2219 79.8432 29.1013 79.7356 29.1415 79.6011L30.7097 74.086C30.7499 73.9515 30.9108 73.8708 31.1118 73.8977C31.3129 73.9246 31.4335 74.0322 31.3933 74.1668L29.8251 79.6818C29.8251 79.7894 29.6642 79.8701 29.5034 79.8701Z" fill="#876FF2" fill-opacity="0.5"/>
<path d="M40.8834 78.8207C40.7627 78.8207 40.6019 78.7669 40.5617 78.6862L37.4253 73.6554C37.3449 73.5478 37.4253 73.4133 37.6264 73.3595C37.7872 73.3057 37.9883 73.3595 38.0687 73.494L41.205 78.5248C41.2854 78.6324 41.205 78.7669 41.004 78.8207C40.9638 78.7938 40.9236 78.8207 40.8834 78.8207Z" fill="#876FF2" fill-opacity="0.5"/>
<path d="M46.3515 74.6779C46.2711 74.6779 46.1504 74.651 46.07 74.5972L42.21 71.5034C42.0894 71.3958 42.0894 71.2613 42.2502 71.1806C42.4111 71.0999 42.6121 71.0999 42.7327 71.2075L46.5927 74.3013C46.7134 74.4089 46.7134 74.5434 46.5525 74.6241C46.5123 74.651 46.4319 74.6779 46.3515 74.6779Z" fill="#876FF2" fill-opacity="0.5"/>
<path d="M50.9354 68.7593H50.8951L46.1505 68.275C45.9494 68.2481 45.8288 68.1405 45.869 68.006C45.9092 67.8715 46.0701 67.7908 46.2711 67.8177L51.0158 68.3019C51.2168 68.3288 51.3374 68.4364 51.2972 68.5709C51.257 68.6786 51.1364 68.7593 50.9354 68.7593Z" fill="#876FF2" fill-opacity="0.5"/>
<path d="M46.2311 63.244C46.0702 63.244 45.9496 63.1902 45.9094 63.0826C45.829 62.975 45.9496 62.8404 46.1104 62.7866L51.9408 61.4146C52.1016 61.3608 52.3027 61.4415 52.3831 61.5491C52.4635 61.6567 52.3429 61.7912 52.182 61.845L46.3517 63.2171C46.3115 63.244 46.2713 63.244 46.2311 63.244Z" fill="#876FF2" fill-opacity="0.5"/>
<path d="M31.8771 54.528C32.2768 54.528 32.6008 54.3112 32.6008 54.0438C32.6008 53.7764 32.2768 53.5596 31.8771 53.5596C31.4774 53.5596 31.1533 53.7764 31.1533 54.0438C31.1533 54.3112 31.4774 54.528 31.8771 54.528Z" fill="#876FF2" fill-opacity="0.5"/>
<path d="M42.089 56.384C42.4887 56.384 42.8127 56.1672 42.8127 55.8998C42.8127 55.6323 42.4887 55.4155 42.089 55.4155C41.6893 55.4155 41.3652 55.6323 41.3652 55.8998C41.3652 56.1672 41.6893 56.384 42.089 56.384Z" fill="#876FF2" fill-opacity="0.5"/>
<path d="M49.8097 59.9617C50.2094 59.9617 50.5334 59.7449 50.5334 59.4774C50.5334 59.21 50.2094 58.9932 49.8097 58.9932C49.41 58.9932 49.0859 59.21 49.0859 59.4774C49.0859 59.7449 49.41 59.9617 49.8097 59.9617Z" fill="#876FF2" fill-opacity="0.5"/>
<path d="M46.632 71.4226C47.0317 71.4226 47.3557 71.2058 47.3557 70.9383C47.3557 70.6709 47.0317 70.4541 46.632 70.4541C46.2322 70.4541 45.9082 70.6709 45.9082 70.9383C45.9082 71.2058 46.2322 71.4226 46.632 71.4226Z" fill="#876FF2" fill-opacity="0.5"/>
<path d="M26.2862 75.9958C26.686 75.9958 27.01 75.779 27.01 75.5116C27.01 75.2442 26.686 75.0273 26.2862 75.0273C25.8865 75.0273 25.5625 75.2442 25.5625 75.5116C25.5625 75.779 25.8865 75.9958 26.2862 75.9958Z" fill="#876FF2" fill-opacity="0.5"/>
<path d="M32.8807 52.2947C33.1691 52.2947 33.403 52.1381 33.403 51.9449C33.403 51.7518 33.1691 51.5952 32.8807 51.5952C32.5922 51.5952 32.3584 51.7518 32.3584 51.9449C32.3584 52.1381 32.5922 52.2947 32.8807 52.2947Z" fill="#876FF2" fill-opacity="0.5"/>
<path d="M20.3757 61.1726C20.6642 61.1726 20.8979 61.0161 20.8979 60.8229C20.8979 60.6297 20.6642 60.4731 20.3757 60.4731C20.0873 60.4731 19.8535 60.6297 19.8535 60.8229C19.8535 61.0161 20.0873 61.1726 20.3757 61.1726Z" fill="#876FF2" fill-opacity="0.5"/>
<path d="M42.7723 76.3186C43.0608 76.3186 43.2947 76.162 43.2947 75.9689C43.2947 75.7757 43.0608 75.6191 42.7723 75.6191C42.4839 75.6191 42.25 75.7757 42.25 75.9689C42.25 76.162 42.4839 76.3186 42.7723 76.3186Z" fill="#876FF2" fill-opacity="0.5"/>
<path d="M48.8445 71.0193C49.133 71.0193 49.3668 70.8627 49.3668 70.6696C49.3668 70.4764 49.133 70.3198 48.8445 70.3198C48.5561 70.3198 48.3223 70.4764 48.3223 70.6696C48.3223 70.8627 48.5561 71.0193 48.8445 71.0193Z" fill="#876FF2" fill-opacity="0.5"/>
<path d="M34.1678 78.9016C34.4562 78.9016 34.6901 78.745 34.6901 78.5519C34.6901 78.3587 34.4562 78.2021 34.1678 78.2021C33.8793 78.2021 33.6455 78.3587 33.6455 78.5519C33.6455 78.745 33.8793 78.9016 34.1678 78.9016Z" fill="#876FF2" fill-opacity="0.5"/>
<path d="M22.9891 55.3616C23.2776 55.3616 23.5115 55.205 23.5115 55.0118C23.5115 54.8187 23.2776 54.6621 22.9891 54.6621C22.7007 54.6621 22.4668 54.8187 22.4668 55.0118C22.4668 55.205 22.7007 55.3616 22.9891 55.3616Z" fill="#876FF2" fill-opacity="0.5"/>
<path d="M18.325 72.8215C18.6134 72.8215 18.8472 72.6649 18.8472 72.4718C18.8472 72.2786 18.6134 72.1221 18.325 72.1221C18.0365 72.1221 17.8027 72.2786 17.8027 72.4718C17.8027 72.6649 18.0365 72.8215 18.325 72.8215Z" fill="#876FF2" fill-opacity="0.5"/>
<path d="M122.065 84.0666C121.984 83.9321 119.089 79.1703 119.089 78.9551C119.129 78.7399 119.33 78.7668 119.572 78.9013C119.813 79.0358 124.035 83.4478 124.196 83.3671C124.357 83.2864 126.206 80.0043 126.367 80.0312C126.528 80.0581 125.764 83.5823 125.925 83.6631C126.086 83.7438 133.404 81.8875 133.484 82.022C133.605 82.1565 126.689 84.8468 126.85 85.1158C127.01 85.3848 132.157 86.703 132.157 86.8644C132.157 87.0259 126.327 86.0843 126.287 86.2188C126.206 86.3802 129.423 90.9536 129.383 91.115C129.343 91.2765 129.061 91.3034 128.86 91.2227C128.659 91.1419 124.678 86.8106 124.598 86.8106C124.517 86.8106 122.829 90.6039 122.668 90.6846C122.507 90.7653 122.226 90.6846 122.226 90.4694C122.226 90.2273 123.03 86.999 122.949 86.8644C122.869 86.7299 115.671 88.8283 115.551 88.7745C115.43 88.7476 115.31 88.5862 115.631 88.3979C115.993 88.2096 121.542 85.6269 121.582 85.4924C121.622 85.3579 116.837 83.9859 116.717 83.8514C116.596 83.7169 116.516 83.5824 117.039 83.5824C117.561 83.5824 121.904 84.3087 121.984 84.2818C122.145 84.228 122.145 84.1742 122.065 84.0666Z" fill="#876FF2" fill-opacity="0.5"/>
<path d="M56.4035 141.396C55.6395 140.589 54.6343 139.917 53.4682 139.352C52.262 138.787 50.9351 138.383 49.4473 138.195C47.9596 138.007 46.5121 137.98 45.0645 138.168C43.6572 138.356 42.3303 138.706 41.1642 139.217C39.958 139.728 38.9527 140.401 38.1083 141.181C37.2639 141.988 36.6608 142.876 36.3793 143.871C36.0577 144.84 36.0577 145.835 36.3391 146.804C36.6206 147.745 37.1433 148.633 37.9073 149.413C38.6713 150.22 39.6765 150.893 40.8426 151.458C42.0488 152.023 43.3757 152.426 44.8635 152.615C46.311 152.83 47.7987 152.83 49.2463 152.642C50.6536 152.453 51.9805 152.104 53.1466 151.592C54.3528 151.081 55.3581 150.409 56.2024 149.629C57.0468 148.821 57.65 147.934 57.9314 146.938C58.2531 145.97 58.2531 144.974 57.9717 144.006C57.7304 143.091 57.2077 142.203 56.4035 141.396ZM55.3983 149.252C54.6343 149.951 53.7095 150.57 52.6238 151.028C51.5382 151.512 50.3319 151.835 49.0452 151.996C47.7183 152.157 46.3914 152.157 45.0645 151.969C43.7376 151.781 42.4911 151.431 41.4055 150.893C40.3601 150.382 39.4352 149.763 38.7517 149.037C38.0279 148.31 37.5454 147.503 37.3042 146.642C37.0629 145.755 37.0629 144.867 37.3444 143.979C37.6258 143.091 38.1485 142.257 38.9527 141.531C39.7167 140.831 40.6415 140.213 41.7272 139.755C42.8128 139.271 44.0191 138.948 45.3058 138.787C46.6327 138.625 47.9596 138.625 49.2865 138.814C50.6134 139.002 51.8599 139.352 52.9455 139.89C52.9857 139.917 52.9857 139.917 53.0259 139.944C52.6238 139.836 52.1815 139.728 51.699 139.675C47.8792 139.137 44.1397 140.751 43.2953 143.306C42.4911 145.862 44.9037 148.364 48.7236 148.929C52.5434 149.467 56.2829 147.853 57.1273 145.297C57.1675 145.217 57.1675 145.136 57.2077 145.055C57.2479 145.647 57.1675 146.239 57.0066 146.831C56.7252 147.692 56.1622 148.499 55.3983 149.252Z" fill="#876FF2" fill-opacity="0.5"/>
<path d="M98.3815 186.619C98.301 186.458 96.2102 180.19 96.3308 179.948C96.4112 179.706 96.6927 179.759 96.9339 179.948C97.2154 180.136 101.035 186.162 101.277 186.081C101.518 186.001 104.775 182.234 104.976 182.288C105.177 182.342 103.126 186.566 103.327 186.673C103.488 186.781 113.058 185.543 113.138 185.705C113.219 185.866 103.93 188.234 104.051 188.583C104.172 188.933 110.082 191.274 110.042 191.462C109.962 191.65 103.126 189.686 103.006 189.875C102.885 190.063 105.418 196.143 105.297 196.331C105.177 196.52 104.855 196.52 104.654 196.385C104.453 196.251 100.874 190.413 100.754 190.386C100.633 190.359 97.4164 194.798 97.2154 194.879C97.0143 194.959 96.6927 194.825 96.7731 194.556C96.8535 194.26 98.8238 190.386 98.7835 190.251C98.7433 190.09 89.2539 191.65 89.1333 191.596C88.9725 191.543 88.8921 191.327 89.3746 191.139C89.8571 190.951 97.4969 188.53 97.5773 188.395C97.6979 188.261 92.1892 185.893 92.1088 185.705C92.0284 185.543 91.948 185.355 92.5913 185.436C93.1944 185.516 98.3412 187.023 98.4619 186.969C98.5825 186.915 98.4619 186.781 98.3815 186.619Z" fill="#876FF2" fill-opacity="0.5"/>
<path d="M80.6084 89.1785C79.8444 87.1877 78.8392 85.5198 75.0596 85.1431C78.5578 84.6589 80.0857 83.2061 80.4476 80.9194C81.1713 82.9909 82.2972 84.6858 86.0366 85.0893C82.5384 85.5467 81.0507 86.9725 80.6084 89.1785Z" fill="#876FF2" fill-opacity="0.5"/>
<path d="M69.7938 84.3088C69.1907 82.6678 68.3061 81.2958 65.21 80.9729C68.0648 80.5694 69.3515 79.3857 69.633 77.4756C70.2361 79.1704 71.161 80.5694 74.2571 80.9191C71.4022 81.2957 70.1557 82.4795 69.7938 84.3088Z" fill="#876FF2" fill-opacity="0.5"/>
<path d="M105.217 146.024C105.328 146.024 105.417 145.964 105.417 145.889C105.417 145.815 105.328 145.755 105.217 145.755C105.106 145.755 105.016 145.815 105.016 145.889C105.016 145.964 105.106 146.024 105.217 146.024Z" fill="#876FF2" fill-opacity="0.5"/>
<path d="M102.603 129.721V129.748C102.683 129.909 102.965 129.99 103.206 129.936C103.447 129.882 103.568 129.694 103.488 129.533L100.955 124.798C100.955 124.798 100.955 124.798 100.914 124.798C100.914 124.798 100.874 124.798 100.914 124.825L102.603 129.721Z" fill="#876FF2" fill-opacity="0.5"/>
<path d="M103.287 130.205L103.207 130.393L103.006 130.528L103.287 130.582L103.488 130.716L103.568 130.528L103.769 130.393L103.488 130.34C103.488 130.34 103.448 130.34 103.448 130.313L103.287 130.205Z" fill="#876FF2" fill-opacity="0.5"/>
<path d="M99.0645 131.254C99.1047 131.254 99.1047 131.254 99.0645 131.254C99.3058 131.389 99.5872 131.362 99.7481 131.254C99.9089 131.119 99.8687 130.931 99.7079 130.824L93.9982 127.568H93.958V127.595L99.0645 131.254Z" fill="#876FF2" fill-opacity="0.5"/>
<path d="M100.311 131.793L100.592 131.846L100.512 131.658L100.592 131.47L100.311 131.524H100.27L99.9893 131.47L100.07 131.658L99.9893 131.846L100.311 131.793Z" fill="#876FF2" fill-opacity="0.5"/>
<path d="M97.2151 133.756C97.4564 133.783 97.6977 133.675 97.7379 133.514C97.7781 133.352 97.6172 133.191 97.376 133.164L90.0178 132.276H89.9775V132.303L97.1347 133.756C97.1749 133.756 97.2151 133.756 97.2151 133.756Z" fill="#876FF2" fill-opacity="0.5"/>
<path d="M98.6619 133.406L98.461 133.541C98.461 133.541 98.4209 133.541 98.4209 133.568L98.1396 133.621L98.3405 133.756L98.4209 133.944L98.6217 133.81L98.903 133.756L98.7021 133.621L98.6619 133.406Z" fill="#876FF2" fill-opacity="0.5"/>
<path d="M97.416 136.527C97.6573 136.474 97.7779 136.285 97.6975 136.124C97.6171 135.962 97.3356 135.882 97.0943 135.936L90.0176 137.63C90.0176 137.63 90.0176 137.63 90.0176 137.657C90.0176 137.657 90.0176 137.684 90.0578 137.657L97.3758 136.527C97.3758 136.554 97.416 136.554 97.416 136.527Z" fill="#876FF2" fill-opacity="0.5"/>
<path d="M98.3407 135.935C98.3407 135.962 98.3407 135.962 98.3407 135.935L98.0996 136.097L98.3808 136.151L98.5817 136.285L98.662 136.097L98.8629 135.962L98.5817 135.908L98.3808 135.774L98.3407 135.935Z" fill="#876FF2" fill-opacity="0.5"/>
<path d="M99.7072 138.894C99.868 138.76 99.8278 138.572 99.667 138.464C99.4659 138.356 99.1844 138.383 99.0236 138.491L94.1582 142.311V142.338H94.1984L99.7072 138.894C99.667 138.894 99.667 138.894 99.7072 138.894Z" fill="#876FF2" fill-opacity="0.5"/>
<path d="M100.23 137.926L99.9492 137.872L100.03 138.06V138.087L99.9492 138.276L100.23 138.222L100.512 138.276L100.431 138.087L100.512 137.899L100.23 137.926Z" fill="#876FF2" fill-opacity="0.5"/>
<path d="M103.046 139.809C102.805 139.782 102.563 139.89 102.523 140.051L101.196 144.975V145.001H101.236L103.408 140.213V140.186C103.448 139.998 103.287 139.836 103.046 139.809Z" fill="#876FF2" fill-opacity="0.5"/>
<path d="M103.407 139.002L103.206 139.137L102.925 139.191L103.126 139.325C103.126 139.325 103.126 139.352 103.166 139.352L103.246 139.54L103.447 139.406L103.728 139.352L103.527 139.218L103.407 139.002Z" fill="#876FF2" fill-opacity="0.5"/>
<path d="M107.59 140.052V140.025C107.51 139.863 107.228 139.783 106.987 139.836C106.746 139.89 106.625 140.079 106.705 140.24L109.239 144.975C109.239 144.975 109.239 144.975 109.279 144.975C109.279 144.975 109.319 144.975 109.279 144.948L107.59 140.052Z" fill="#876FF2" fill-opacity="0.5"/>
<path d="M106.905 139.54L106.985 139.352L107.186 139.218L106.905 139.164L106.704 139.029L106.624 139.218L106.423 139.352L106.704 139.406C106.704 139.406 106.744 139.406 106.744 139.433L106.905 139.54Z" fill="#876FF2" fill-opacity="0.5"/>
<path d="M111.128 138.518C111.088 138.518 111.088 138.518 111.128 138.518C110.886 138.384 110.605 138.411 110.444 138.518C110.283 138.653 110.324 138.841 110.484 138.949L116.194 142.204H116.234V142.177L111.128 138.518Z" fill="#876FF2" fill-opacity="0.5"/>
<path d="M109.881 137.98L109.6 137.926L109.68 138.115L109.6 138.303L109.881 138.249H109.921L110.202 138.303L110.122 138.115L110.202 137.926L109.881 137.98Z" fill="#876FF2" fill-opacity="0.5"/>
<path d="M120.215 137.469L113.057 136.016H113.017C112.776 135.989 112.535 136.097 112.494 136.258C112.454 136.419 112.615 136.581 112.856 136.608L120.215 137.495C120.215 137.522 120.215 137.495 120.215 137.469C120.215 137.495 120.215 137.469 120.215 137.469Z" fill="#876FF2" fill-opacity="0.5"/>
<path d="M111.731 136.232C111.731 136.205 111.771 136.205 111.731 136.232L112.052 136.178L111.852 136.043L111.771 135.855L111.57 135.989L111.289 136.043L111.49 136.178L111.57 136.366L111.731 136.232Z" fill="#876FF2" fill-opacity="0.5"/>
<path d="M112.777 133.218C112.536 133.272 112.415 133.46 112.496 133.622C112.576 133.783 112.857 133.864 113.099 133.81L120.175 132.115C120.175 132.115 120.175 132.115 120.175 132.088C120.175 132.088 120.175 132.061 120.135 132.088L112.817 133.218C112.777 133.218 112.777 133.218 112.777 133.218Z" fill="#876FF2" fill-opacity="0.5"/>
<path d="M111.57 133.46L111.49 133.649L111.289 133.783L111.57 133.837L111.771 133.972L111.851 133.783C111.851 133.783 111.851 133.756 111.892 133.756L112.093 133.622L111.811 133.568L111.57 133.46Z" fill="#876FF2" fill-opacity="0.5"/>
<path d="M110.484 130.878C110.323 131.012 110.364 131.2 110.524 131.308C110.725 131.416 111.007 131.389 111.168 131.281L116.033 127.461V127.434H115.993L110.484 130.878C110.524 130.878 110.524 130.878 110.484 130.878Z" fill="#876FF2" fill-opacity="0.5"/>
<path d="M109.921 131.819L110.202 131.873L110.122 131.685V131.658L110.202 131.47L109.921 131.524L109.64 131.47L109.72 131.658L109.64 131.846L109.921 131.819Z" fill="#876FF2" fill-opacity="0.5"/>
<path d="M107.147 129.963C107.389 129.99 107.63 129.882 107.67 129.721L108.997 124.798V124.771H108.957L106.785 129.56V129.587C106.745 129.775 106.906 129.936 107.147 129.963Z" fill="#876FF2" fill-opacity="0.5"/>
<path d="M106.784 130.77L106.985 130.636L107.266 130.582L107.066 130.448C107.066 130.448 107.066 130.421 107.025 130.421L106.945 130.232L106.744 130.367L106.463 130.421L106.664 130.555L106.784 130.77Z" fill="#876FF2" fill-opacity="0.5"/>
<path d="M107.629 137.926C107.669 137.953 107.709 137.98 107.79 137.98C107.83 137.98 107.83 137.98 107.87 137.953C107.951 137.926 107.991 137.846 107.951 137.792V137.765C108.634 137.469 109.197 137.092 109.639 136.635L109.68 136.662C109.72 136.662 109.72 136.689 109.76 136.689C109.8 136.689 109.881 136.662 109.921 136.635C109.961 136.581 109.921 136.501 109.84 136.474L109.8 136.447C110.162 135.989 110.403 135.478 110.403 134.913H110.444C110.524 134.913 110.604 134.859 110.604 134.806C110.604 134.752 110.524 134.698 110.444 134.698H110.403C110.363 134.16 110.162 133.622 109.8 133.165L109.84 133.138C109.921 133.111 109.961 133.03 109.921 132.976C109.881 132.922 109.76 132.896 109.68 132.922L109.639 132.949C109.197 132.492 108.634 132.115 107.951 131.819L107.991 131.793C108.031 131.739 107.991 131.658 107.91 131.631C107.83 131.604 107.709 131.631 107.669 131.685L107.629 131.712C106.945 131.47 106.181 131.308 105.337 131.308V131.281C105.337 131.228 105.257 131.174 105.176 131.174C105.096 131.174 105.015 131.228 105.015 131.281V131.308C104.211 131.335 103.407 131.47 102.723 131.712L102.683 131.685C102.643 131.631 102.522 131.604 102.442 131.631C102.362 131.658 102.321 131.739 102.362 131.793L102.402 131.819C101.718 132.089 101.155 132.492 100.713 132.922L100.673 132.896C100.592 132.869 100.472 132.896 100.432 132.949C100.391 133.003 100.432 133.084 100.512 133.111L100.552 133.138C100.19 133.595 99.9491 134.106 99.9491 134.671H99.9089C99.8285 134.671 99.748 134.725 99.748 134.779C99.748 134.833 99.8285 134.886 99.9089 134.886H99.9491C99.9893 135.451 100.19 135.962 100.552 136.42L100.512 136.447C100.432 136.474 100.391 136.554 100.432 136.608C100.472 136.635 100.512 136.662 100.592 136.662C100.633 136.662 100.633 136.662 100.673 136.635L100.713 136.608C101.115 137.065 101.718 137.442 102.402 137.738L102.362 137.765C102.321 137.819 102.362 137.899 102.442 137.926C102.482 137.926 102.482 137.953 102.522 137.953C102.563 137.953 102.643 137.926 102.683 137.899L102.723 137.873C103.407 138.115 104.171 138.276 105.015 138.276V138.303C105.015 138.357 105.096 138.411 105.176 138.411C105.257 138.411 105.337 138.357 105.337 138.303V138.276C106.141 138.303 106.945 138.142 107.629 137.926ZM100.472 134.833C100.472 133.111 102.563 131.685 105.176 131.685C107.75 131.685 109.881 133.084 109.881 134.833C109.881 136.554 107.79 137.98 105.176 137.98C102.563 137.98 100.472 136.554 100.472 134.833Z" fill="#876FF2" fill-opacity="0.5"/>
<path d="M107.549 134.967C107.307 134.94 106.584 134.886 106.181 134.59C106.503 134.294 107.106 134.025 107.307 133.945C107.388 133.918 107.307 133.783 107.146 133.837C106.986 133.918 106.463 134.187 105.94 134.214C105.779 133.73 105.9 133.165 105.779 133.138C105.659 133.138 105.578 133.703 105.176 134.052C104.573 133.783 104.091 133.326 103.97 133.407C103.849 133.461 104.452 133.945 104.533 134.375C104.05 134.51 103.608 134.51 103.246 134.483C102.804 134.429 103.005 134.644 103.125 134.671C103.246 134.671 103.93 134.725 104.372 134.913C104.171 135.209 103.889 135.424 103.608 135.559C103.246 135.747 103.608 135.801 103.729 135.747C103.809 135.693 104.251 135.451 104.694 135.344C104.734 135.747 104.613 136.231 104.734 136.285C104.855 136.339 104.935 136.339 105.015 136.124C105.056 135.989 105.136 135.64 105.337 135.371C105.86 135.613 106.382 136.124 106.503 136.097C106.624 136.07 106.744 136.043 106.543 135.855C106.423 135.72 106.021 135.371 105.94 135.048C106.503 134.967 107.307 135.075 107.508 135.102C107.669 135.128 107.75 134.994 107.549 134.967Z" fill="#876FF2" fill-opacity="0.5"/>
<path d="M128.821 80.2466C128.74 80.2466 128.7 80.2466 128.62 80.2197C128.298 80.139 128.137 79.9238 128.218 79.7085L128.338 79.4395C128.459 79.2243 128.781 79.1167 129.102 79.1705C129.424 79.2512 129.585 79.4664 129.504 79.6816L129.384 79.9507C129.344 80.139 129.102 80.2466 128.821 80.2466ZM129.705 78.4441C129.625 78.4441 129.585 78.4441 129.504 78.4172C129.183 78.3365 129.022 78.1213 129.102 77.9061L129.826 76.3726C129.866 76.3188 129.866 76.2919 129.907 76.265C129.907 76.2112 129.907 76.1843 129.947 76.1305L130.671 74.597C130.791 74.3818 131.113 74.2742 131.435 74.328C131.756 74.4087 131.917 74.624 131.837 74.8392L131.113 76.3726C131.073 76.4264 131.073 76.4533 131.032 76.4802C131.032 76.534 131.032 76.5609 130.992 76.6147L130.268 78.1482C130.188 78.3365 129.947 78.4441 129.705 78.4441ZM132.038 73.5748C131.957 73.5748 131.917 73.5748 131.837 73.5479C131.515 73.4671 131.354 73.2519 131.435 73.0367L131.555 72.7677C131.676 72.5525 131.997 72.4448 132.319 72.4987C132.641 72.5794 132.802 72.7946 132.721 73.0098L132.601 73.2788C132.52 73.4671 132.319 73.5748 132.038 73.5748ZM132.922 71.7992C132.842 71.7992 132.802 71.7992 132.721 71.7723C132.4 71.6916 132.239 71.4764 132.319 71.2611L133.043 69.7277C133.083 69.6739 133.083 69.647 133.123 69.5932C133.123 69.5394 133.123 69.5125 133.164 69.4587L133.887 67.9252C134.008 67.71 134.33 67.6024 134.651 67.6562C134.973 67.7369 135.134 67.9521 135.053 68.1673L134.33 69.7008C134.289 69.7546 134.289 69.7815 134.249 69.8353C134.249 69.8891 134.249 69.916 134.209 69.9698L133.485 71.5033C133.405 71.6916 133.164 71.7992 132.922 71.7992ZM135.254 66.9298C135.174 66.9298 135.134 66.9298 135.053 66.9029C134.732 66.8222 134.571 66.607 134.651 66.3918L134.772 66.1227C134.893 65.9075 135.214 65.7999 135.536 65.8537C135.858 65.9344 136.018 66.1497 135.938 66.3649L135.817 66.6339C135.737 66.8222 135.496 66.9298 135.254 66.9298ZM136.139 65.1274C136.059 65.1274 136.018 65.1274 135.938 65.1005C135.616 65.0197 135.455 64.8045 135.536 64.5893L136.26 63.0559C136.3 63.0021 136.3 62.9752 136.34 62.9483C136.34 62.8944 136.34 62.8675 136.38 62.8137L137.104 61.2803C137.225 61.0651 137.546 60.9575 137.868 61.0113C138.19 61.092 138.351 61.3072 138.27 61.5224L137.546 63.0559C137.506 63.1097 137.506 63.1366 137.466 63.1635C137.466 63.2173 137.466 63.2442 137.426 63.298L136.702 64.8314C136.622 65.0197 136.38 65.1274 136.139 65.1274Z" fill="#876FF2" fill-opacity="0.5"/>
<path d="M63.0783 77.5833C62.9979 77.5833 62.8773 77.5564 62.7969 77.5295L60.706 76.7493C60.6256 76.7224 60.5854 76.6955 60.5452 76.6686C60.4647 76.6686 60.4245 76.6417 60.3441 76.6148L58.2532 75.8346C57.9718 75.727 57.8512 75.4849 58.012 75.2966C58.1728 75.1083 58.5347 75.0276 58.8162 75.1352L60.907 75.9154C60.9875 75.9423 61.0277 75.9692 61.0679 75.9961C61.1483 75.9961 61.1885 76.023 61.2689 76.0499L63.3598 76.83C63.6413 76.9377 63.7619 77.1798 63.6011 77.3681C63.4804 77.5026 63.2794 77.5833 63.0783 77.5833ZM56.4036 75.1083C56.3232 75.1083 56.2026 75.0814 56.1222 75.0545L55.7603 74.92C55.4788 74.8124 55.3582 74.5702 55.519 74.3819C55.6799 74.1936 56.0418 74.1129 56.3232 74.2205L56.6851 74.355C56.9666 74.4626 57.0872 74.7047 56.9264 74.8931C56.8057 75.0276 56.6047 75.1083 56.4036 75.1083ZM53.9509 74.1936C53.8705 74.1936 53.7498 74.1667 53.6694 74.1398L51.5785 73.3596C51.4981 73.3327 51.4579 73.3058 51.4177 73.2789C51.3373 73.2789 51.2971 73.252 51.2167 73.2251L49.1258 72.4449C48.8443 72.3373 48.7237 72.0952 48.8845 71.9069C49.0454 71.7186 49.4073 71.6379 49.6887 71.7455L51.7796 72.5256C51.86 72.5525 51.9002 72.5794 51.9404 72.6063C52.0208 72.6063 52.0611 72.6332 52.1415 72.6602L54.2323 73.4403C54.5138 73.5479 54.6344 73.7901 54.4736 73.9784C54.353 74.1129 54.1519 74.1936 53.9509 74.1936Z" fill="#876FF2" fill-opacity="0.5"/>
<path d="M116.676 86.5417H116.556C116.234 86.5417 115.953 86.3534 115.993 86.1112C115.993 85.896 116.315 85.7077 116.636 85.7346H116.717C117.038 85.7346 117.32 85.9229 117.28 86.165C117.28 86.3803 116.998 86.5417 116.676 86.5417ZM114.183 86.461C114.183 86.461 114.143 86.461 114.183 86.461L111.731 86.3803C111.65 86.3803 111.61 86.3803 111.53 86.3534C111.449 86.3534 111.409 86.3803 111.329 86.3803L108.916 86.2996C108.594 86.2996 108.313 86.1112 108.353 85.8691C108.353 85.6539 108.635 85.4656 108.996 85.4925L111.409 85.5732C111.489 85.5732 111.53 85.5732 111.61 85.6001C111.69 85.6001 111.731 85.5732 111.811 85.5732L114.224 85.6539C114.545 85.6539 114.827 85.8422 114.787 86.0843C114.746 86.2996 114.505 86.461 114.183 86.461ZM106.544 86.2189H106.101C105.78 86.2189 105.498 86.0305 105.538 85.7884C105.538 85.5732 105.82 85.3849 106.182 85.4118H106.584C106.906 85.4118 107.187 85.6001 107.147 85.8422C107.147 86.0574 106.865 86.2189 106.544 86.2189ZM103.729 86.1381L101.276 86.0574C101.196 86.0574 101.156 86.0574 101.075 86.0305C100.995 86.0305 100.955 86.0574 100.874 86.0574L98.4616 85.9767C98.14 85.9767 97.8585 85.7884 97.8987 85.5463C97.8987 85.3311 98.1802 85.1427 98.5421 85.1696L100.955 85.2503C101.035 85.2503 101.075 85.2504 101.156 85.2773C101.236 85.2773 101.276 85.2503 101.357 85.2503L103.769 85.3311C104.091 85.3311 104.372 85.5194 104.332 85.7615C104.332 85.9767 104.051 86.1381 103.729 86.1381ZM96.0893 85.896H95.647C95.3253 85.896 95.0438 85.7077 95.084 85.4656C95.084 85.2504 95.3655 85.062 95.7274 85.0889H96.1295C96.4512 85.0889 96.7326 85.2773 96.6924 85.5194C96.6924 85.7346 96.411 85.896 96.0893 85.896ZM93.2746 85.8153L90.8219 85.7346C90.7414 85.7346 90.7012 85.7346 90.6208 85.7077C90.5404 85.7077 90.5002 85.7346 90.4198 85.7346L88.0072 85.6539C87.6855 85.6539 87.4041 85.4656 87.4443 85.2234C87.4443 85.0082 87.7659 84.8199 88.0876 84.8468L90.5002 84.9275C90.5806 84.9275 90.6208 84.9275 90.7012 84.9544C90.7816 84.9544 90.8219 84.9275 90.9023 84.9275L93.3148 85.0082C93.6365 85.0082 93.918 85.1965 93.8778 85.4387C93.8778 85.6539 93.5963 85.8153 93.2746 85.8153Z" fill="#876FF2" fill-opacity="0.5"/>
<path d="M148.361 150.355C148.281 150.355 148.16 150.328 148.08 150.301L147.718 150.167C147.437 150.059 147.316 149.817 147.437 149.628C147.597 149.44 147.959 149.359 148.241 149.44L148.603 149.575C148.884 149.682 149.005 149.924 148.884 150.113C148.763 150.274 148.562 150.355 148.361 150.355ZM145.828 149.494C145.748 149.494 145.627 149.467 145.547 149.44L143.416 148.714C143.335 148.687 143.295 148.66 143.255 148.633C143.174 148.633 143.134 148.606 143.054 148.579L140.923 147.853C140.641 147.745 140.521 147.503 140.641 147.315C140.802 147.127 141.164 147.046 141.445 147.127L143.576 147.853C143.657 147.88 143.697 147.907 143.737 147.934C143.818 147.934 143.858 147.96 143.938 147.987L146.069 148.714C146.351 148.821 146.472 149.063 146.351 149.252C146.27 149.413 146.069 149.494 145.828 149.494ZM139.033 147.153C138.952 147.153 138.832 147.127 138.751 147.1L138.389 146.965C138.108 146.857 137.987 146.615 138.108 146.427C138.269 146.239 138.631 146.158 138.912 146.266L139.274 146.4C139.556 146.508 139.676 146.75 139.556 146.938C139.475 147.1 139.274 147.153 139.033 147.153ZM136.54 146.319C136.459 146.319 136.339 146.293 136.258 146.266L134.127 145.539C134.047 145.512 134.007 145.485 133.966 145.459C133.886 145.459 133.846 145.432 133.765 145.405L131.634 144.678C131.353 144.571 131.232 144.329 131.353 144.14C131.514 143.952 131.876 143.871 132.157 143.952L134.288 144.678C134.369 144.705 134.409 144.732 134.449 144.759C134.529 144.759 134.57 144.786 134.65 144.813L136.781 145.539C137.063 145.647 137.183 145.889 137.063 146.077C136.982 146.239 136.741 146.319 136.54 146.319ZM129.745 143.979C129.664 143.979 129.543 143.952 129.463 143.925L129.101 143.791C128.82 143.683 128.699 143.441 128.82 143.253C128.981 143.064 129.342 142.984 129.624 143.064L129.986 143.199C130.267 143.306 130.388 143.548 130.267 143.737C130.187 143.898 129.946 143.979 129.745 143.979ZM127.252 143.118C127.171 143.118 127.05 143.091 126.97 143.064L124.839 142.338C124.759 142.311 124.718 142.284 124.678 142.257C124.598 142.257 124.558 142.23 124.477 142.203L122.346 141.477C122.065 141.369 121.944 141.127 122.065 140.939C122.225 140.751 122.587 140.67 122.869 140.751L125 141.477C125.08 141.504 125.12 141.531 125.161 141.558C125.241 141.558 125.281 141.585 125.362 141.612L127.493 142.338C127.774 142.445 127.895 142.688 127.774 142.876C127.654 143.037 127.453 143.118 127.252 143.118ZM120.456 140.778C120.376 140.778 120.255 140.751 120.175 140.724L119.813 140.589C119.531 140.482 119.411 140.239 119.531 140.051C119.692 139.863 120.054 139.782 120.336 139.89L120.697 140.024C120.979 140.132 121.1 140.374 120.979 140.562C120.858 140.697 120.657 140.778 120.456 140.778ZM117.923 139.917C117.843 139.917 117.722 139.89 117.642 139.863L115.51 139.136C115.43 139.11 115.39 139.083 115.35 139.056C115.269 139.056 115.229 139.029 115.149 139.002L113.017 138.276C112.736 138.168 112.615 137.926 112.736 137.738C112.897 137.549 113.259 137.469 113.54 137.549L115.671 138.276C115.752 138.303 115.792 138.329 115.832 138.356C115.913 138.356 115.953 138.383 116.033 138.41L118.164 139.136C118.446 139.244 118.566 139.486 118.446 139.675C118.365 139.836 118.164 139.917 117.923 139.917Z" fill="#876FF2" fill-opacity="0.5"/>
<path d="M59.4988 142.042C59.2173 142.042 58.9761 141.934 58.8957 141.746C58.8152 141.531 59.0163 141.316 59.338 141.262L61.6701 140.858C61.7505 140.858 61.7907 140.831 61.8712 140.858C61.9114 140.831 61.9918 140.805 62.0722 140.805L64.4043 140.401C64.726 140.347 65.0477 140.482 65.1281 140.697C65.2085 140.912 65.0075 141.127 64.6858 141.181L62.3537 141.585C62.2733 141.585 62.233 141.612 62.1526 141.585C62.1124 141.612 62.032 141.638 61.9516 141.638L59.6194 142.042C59.6194 142.042 59.539 142.042 59.4988 142.042ZM66.8973 140.751C66.6159 140.751 66.3746 140.643 66.2942 140.455C66.2138 140.24 66.4148 140.024 66.7365 139.971L67.1386 139.89C67.4603 139.836 67.7819 139.971 67.8623 140.186C67.9428 140.401 67.7417 140.616 67.4201 140.67L67.018 140.751C67.018 140.751 66.9375 140.751 66.8973 140.751ZM69.6316 140.293C69.3501 140.293 69.1088 140.186 69.0284 139.997C68.948 139.782 69.149 139.567 69.4707 139.513L71.8029 139.11C71.8833 139.11 71.9235 139.083 72.0039 139.11C72.0441 139.083 72.1245 139.056 72.205 139.056L74.5371 138.652C74.8588 138.599 75.1805 138.733 75.2609 138.948C75.3413 139.163 75.1402 139.379 74.8186 139.432L72.4864 139.836C72.406 139.836 72.3658 139.863 72.2854 139.836C72.2452 139.863 72.1647 139.89 72.0843 139.89L69.7522 140.293C69.712 140.293 69.6718 140.293 69.6316 140.293ZM77.0301 139.002C76.7486 139.002 76.5074 138.894 76.4269 138.706C76.3465 138.491 76.5476 138.276 76.8692 138.222L77.2713 138.141C77.593 138.087 77.9147 138.222 77.9951 138.437C78.0755 138.652 77.8745 138.868 77.5528 138.921L77.1507 139.002C77.1105 139.002 77.0703 139.002 77.0301 139.002ZM79.7241 138.518C79.4426 138.518 79.2014 138.41 79.121 138.222C79.0405 138.007 79.2416 137.791 79.5633 137.738L81.8954 137.334C81.9758 137.334 82.016 137.307 82.0965 137.334C82.1367 137.307 82.2171 137.28 82.2975 137.28L84.6296 136.877C84.9513 136.823 85.273 136.957 85.3534 137.173C85.4338 137.388 85.2328 137.603 84.9111 137.657L82.579 138.06C82.4986 138.06 82.4583 138.087 82.3779 138.06C82.3377 138.087 82.2573 138.114 82.1769 138.114L79.8447 138.518C79.8447 138.518 79.8045 138.518 79.7241 138.518ZM87.1226 137.253C86.8412 137.253 86.5999 137.146 86.5195 136.957C86.4391 136.742 86.6401 136.527 86.9618 136.473L87.3639 136.392C87.6856 136.339 88.0072 136.473 88.0877 136.688C88.1681 136.904 87.967 137.119 87.6453 137.173L87.2433 137.253C87.2433 137.253 87.2031 137.253 87.1226 137.253ZM89.8569 136.769C89.5754 136.769 89.3341 136.662 89.2537 136.473C89.1733 136.258 89.3744 136.043 89.696 135.989L92.0282 135.585C92.1086 135.585 92.1488 135.559 92.2292 135.585C92.2694 135.559 92.3498 135.532 92.4303 135.532L94.7624 135.128C95.0841 135.074 95.4058 135.209 95.4862 135.424C95.5666 135.639 95.3655 135.854 95.0439 135.908L92.7117 136.312C92.6313 136.312 92.5911 136.339 92.5107 136.312C92.4705 136.339 92.3901 136.366 92.3096 136.366L89.9775 136.769C89.9775 136.769 89.8971 136.769 89.8569 136.769Z" fill="#876FF2" fill-opacity="0.5"/>
<path d="M110.766 183.445C110.605 183.445 110.444 183.418 110.324 183.337C110.082 183.176 110.082 182.934 110.324 182.772C110.364 182.745 110.444 182.691 112.414 181.804C112.455 181.777 112.535 181.75 112.615 181.75C112.656 181.723 112.696 181.669 112.776 181.642L114.787 180.728C115.068 180.593 115.43 180.647 115.631 180.835C115.832 181.023 115.752 181.266 115.47 181.4L113.46 182.315C113.42 182.342 113.339 182.369 113.259 182.369C113.219 182.396 113.178 182.449 113.098 182.476C111.53 183.203 111.208 183.337 111.168 183.364C111.047 183.391 110.927 183.445 110.766 183.445ZM117.119 180.539C116.918 180.539 116.717 180.485 116.636 180.351C116.435 180.163 116.516 179.92 116.797 179.786L117.119 179.625C117.4 179.49 117.762 179.544 117.963 179.732C118.164 179.92 118.084 180.163 117.802 180.297L117.481 180.459C117.36 180.512 117.24 180.539 117.119 180.539ZM119.451 179.463C119.25 179.463 119.049 179.409 118.969 179.275C118.767 179.086 118.848 178.844 119.129 178.71L121.14 177.795C121.18 177.768 121.26 177.741 121.341 177.741C121.381 177.714 121.421 177.661 121.502 177.634L123.512 176.719C123.794 176.585 124.156 176.638 124.357 176.827C124.558 177.015 124.477 177.257 124.196 177.392L122.185 178.306C122.145 178.333 122.065 178.36 121.984 178.36C121.944 178.387 121.904 178.441 121.823 178.468L119.813 179.382C119.692 179.463 119.572 179.463 119.451 179.463ZM125.804 176.611C125.603 176.611 125.402 176.558 125.322 176.423C125.121 176.235 125.201 175.993 125.482 175.858L125.804 175.697C126.086 175.562 126.447 175.616 126.649 175.804C126.85 175.993 126.769 176.235 126.488 176.369L126.166 176.531C126.045 176.585 125.925 176.611 125.804 176.611ZM128.136 175.562C127.935 175.562 127.734 175.508 127.654 175.374C127.453 175.186 127.533 174.944 127.815 174.809L129.825 173.894C129.865 173.867 129.946 173.841 130.026 173.841C130.066 173.814 130.107 173.76 130.187 173.733L132.197 172.818C132.479 172.684 132.841 172.737 133.042 172.926C133.243 173.114 133.162 173.356 132.881 173.491L130.871 174.405C130.83 174.432 130.75 174.459 130.669 174.459C130.629 174.486 130.589 174.54 130.509 174.567L128.498 175.482C128.378 175.535 128.257 175.562 128.136 175.562ZM134.489 172.684C134.288 172.684 134.087 172.63 134.007 172.495C133.806 172.307 133.886 172.065 134.168 171.93L134.489 171.769C134.771 171.634 135.133 171.688 135.334 171.877C135.535 172.065 135.454 172.307 135.173 172.442L134.851 172.603C134.731 172.657 134.61 172.684 134.489 172.684ZM136.821 171.634C136.62 171.634 136.419 171.581 136.339 171.446C136.138 171.258 136.218 171.016 136.5 170.881L138.51 169.967C138.551 169.94 138.631 169.913 138.711 169.913C138.752 169.886 138.792 169.832 138.872 169.832L140.883 168.917C141.164 168.783 141.526 168.837 141.727 169.025C141.928 169.213 141.848 169.455 141.566 169.59L139.556 170.505C139.516 170.531 139.435 170.558 139.355 170.558C139.314 170.585 139.274 170.639 139.194 170.639L137.183 171.554C137.063 171.608 136.942 171.634 136.821 171.634ZM143.175 168.756C142.974 168.756 142.773 168.702 142.692 168.568C142.491 168.379 142.571 168.137 142.853 168.003L143.175 167.841C143.456 167.707 143.818 167.761 144.019 167.949C144.22 168.137 144.14 168.379 143.858 168.514L143.536 168.675C143.416 168.729 143.295 168.756 143.175 168.756ZM145.547 167.707C145.346 167.707 145.145 167.653 145.064 167.518C144.863 167.33 144.944 167.088 145.225 166.953L145.668 166.765C145.949 166.631 146.311 166.684 146.512 166.873C146.713 167.061 146.633 167.303 146.351 167.438L145.909 167.626C145.788 167.68 145.668 167.707 145.547 167.707Z" fill="#876FF2" fill-opacity="0.5"/>
<path d="M32.8806 223.018C32.7198 223.018 32.5187 222.964 32.3981 222.857C32.1971 222.668 32.2373 222.426 32.5187 222.292L34.4086 221.296C34.4488 221.27 34.5292 221.243 34.5694 221.243C34.6096 221.216 34.6498 221.162 34.69 221.135L36.5799 220.14C36.8613 220.005 37.2232 220.032 37.4243 220.22C37.6253 220.409 37.5851 220.651 37.3036 220.785L35.4138 221.781C35.3736 221.808 35.2932 221.835 35.253 221.835C35.2128 221.861 35.1726 221.915 35.1323 221.942L33.2425 222.938C33.1219 222.991 33.0012 223.018 32.8806 223.018ZM38.8718 219.871C38.711 219.871 38.5099 219.817 38.3893 219.709C38.1883 219.521 38.2285 219.279 38.5099 219.144L38.8316 218.983C39.1131 218.848 39.475 218.875 39.676 219.064C39.877 219.252 39.8368 219.494 39.5554 219.629L39.2337 219.79C39.1533 219.844 39.0327 219.871 38.8718 219.871ZM41.1235 218.687C40.9627 218.687 40.7616 218.633 40.641 218.525C40.44 218.337 40.4802 218.095 40.7616 217.961L42.6515 216.965C42.6917 216.938 42.7721 216.911 42.8123 216.911C42.8525 216.884 42.8927 216.831 42.9329 216.804L44.8228 215.808C45.1043 215.674 45.4661 215.701 45.6672 215.889C45.8682 216.077 45.828 216.319 45.5465 216.454L43.6567 217.449C43.6165 217.476 43.5361 217.503 43.4959 217.503C43.4557 217.53 43.4155 217.584 43.3752 217.611L41.4854 218.606C41.3648 218.66 41.2442 218.687 41.1235 218.687ZM47.1147 215.539C46.9539 215.539 46.7528 215.486 46.6322 215.378C46.4312 215.19 46.4714 214.947 46.7528 214.813L47.0745 214.652C47.356 214.517 47.7179 214.544 47.9189 214.732C48.12 214.921 48.0797 215.163 47.7983 215.297L47.4766 215.459C47.3962 215.512 47.2353 215.539 47.1147 215.539ZM49.3262 214.383C49.1654 214.383 48.9643 214.329 48.8437 214.221C48.6427 214.033 48.6829 213.791 48.9643 213.656L50.8542 212.661C50.8944 212.634 50.9748 212.607 51.015 212.607C51.0552 212.58 51.0954 212.526 51.1356 212.499L53.0255 211.504C53.3069 211.369 53.6688 211.396 53.8699 211.585C54.0709 211.773 54.0307 212.015 53.7493 212.15L51.8594 213.145C51.8192 213.172 51.7388 213.199 51.6986 213.199C51.6584 213.226 51.6182 213.28 51.5779 213.306L49.6881 214.302C49.6077 214.356 49.4871 214.383 49.3262 214.383ZM55.3576 211.235C55.1968 211.235 54.9957 211.181 54.8751 211.073C54.6741 210.885 54.7143 210.643 54.9957 210.509L55.3174 210.347C55.5989 210.213 55.9608 210.24 56.1618 210.428C56.3629 210.616 56.3226 210.858 56.0412 210.993L55.7195 211.154C55.6391 211.208 55.4783 211.235 55.3576 211.235ZM57.5691 210.078C57.4083 210.078 57.2072 210.024 57.0866 209.917C56.8856 209.728 56.9258 209.486 57.2072 209.352L59.0971 208.356C59.1373 208.329 59.2177 208.303 59.2579 208.303C59.2981 208.276 59.3383 208.222 59.3786 208.195L61.2684 207.2C61.5499 207.065 61.9117 207.092 62.1128 207.28C62.3138 207.469 62.2736 207.711 61.9922 207.845L60.1023 208.841C60.0621 208.867 59.9817 208.894 59.9415 208.894C59.9013 208.921 59.8611 208.975 59.8208 209.002L57.931 209.997C57.8506 210.051 57.6898 210.078 57.5691 210.078ZM63.6005 206.931C63.4397 206.931 63.2386 206.877 63.118 206.769C62.917 206.581 62.9572 206.339 63.2386 206.204L63.5603 206.043C63.8418 205.908 64.2037 205.935 64.4047 206.123C64.6058 206.312 64.5655 206.554 64.2841 206.688L63.9624 206.85C63.8418 206.904 63.7212 206.931 63.6005 206.931ZM65.812 205.774C65.6512 205.774 65.4502 205.72 65.3295 205.612C65.1285 205.424 65.1687 205.182 65.4501 205.047L67.34 204.052C67.3802 204.025 67.4606 203.998 67.5008 203.998C67.541 203.971 67.5813 203.917 67.6215 203.891L69.5113 202.895C69.7928 202.761 70.1546 202.788 70.3557 202.976C70.5567 203.164 70.5165 203.406 70.2351 203.541L68.3452 204.536C68.305 204.563 68.2246 204.59 68.1844 204.59C68.1442 204.617 68.104 204.671 68.0638 204.698L66.1739 205.693C66.0533 205.747 65.9327 205.774 65.812 205.774ZM71.8434 202.626C71.6826 202.626 71.4815 202.572 71.3609 202.465C71.1599 202.276 71.2001 202.034 71.4815 201.9L71.8032 201.738C72.0847 201.604 72.4466 201.631 72.6476 201.819C72.8487 202.007 72.8085 202.249 72.527 202.384L72.2053 202.545C72.0847 202.599 71.9641 202.626 71.8434 202.626ZM74.0549 201.469C73.8941 201.469 73.6931 201.416 73.5724 201.308C73.3714 201.12 73.4116 200.877 73.6931 200.743L75.5829 199.748C75.6231 199.721 75.7035 199.694 75.7437 199.694C75.7839 199.667 75.8242 199.613 75.8644 199.586L77.7542 198.591C78.0357 198.456 78.3975 198.483 78.5986 198.671C78.7996 198.86 78.7594 199.102 78.478 199.236L76.5881 200.232C76.5479 200.259 76.4675 200.286 76.4273 200.286C76.3871 200.313 76.3469 200.366 76.3067 200.393L74.4168 201.389C74.2962 201.442 74.1756 201.469 74.0549 201.469ZM80.0461 198.295C79.8853 198.295 79.6842 198.241 79.5636 198.133C79.3626 197.945 79.4028 197.703 79.6842 197.568L80.0059 197.407C80.2874 197.273 80.6493 197.299 80.8503 197.488C81.0514 197.676 81.0111 197.918 80.7297 198.053L80.408 198.214C80.3276 198.268 80.207 198.295 80.0461 198.295ZM82.2576 197.138C82.0968 197.138 81.8958 197.084 81.7751 196.977C81.5741 196.788 81.6143 196.546 81.8958 196.412L83.7856 195.416C83.8258 195.389 83.9062 195.362 83.9464 195.362C83.9866 195.336 84.0268 195.282 84.0671 195.255L85.9569 194.259C86.1981 194.125 86.6002 194.152 86.8013 194.34C87.0023 194.528 86.9621 194.771 86.6807 194.905L84.7908 195.9C84.7506 195.927 84.6702 195.954 84.63 195.954C84.5898 195.981 84.5496 196.035 84.5094 196.062L82.6195 197.057C82.5391 197.111 82.4185 197.138 82.2576 197.138ZM88.289 193.99C88.1282 193.99 87.9271 193.937 87.8065 193.829C87.6055 193.641 87.6457 193.399 87.9272 193.264L88.2488 193.103C88.5303 192.968 88.8922 192.995 89.0932 193.183C89.2943 193.372 89.254 193.614 88.9726 193.748L88.6509 193.91C88.5705 193.964 88.4097 193.99 88.289 193.99Z" fill="#876FF2" fill-opacity="0.5"/>
<path d="M132.962 50.9503C132.761 50.9503 132.56 50.8965 132.439 50.762C132.399 50.7082 132.117 50.5198 130.871 49.6052C130.831 49.5783 130.79 49.5245 130.75 49.4976C130.71 49.4706 130.63 49.4437 130.589 49.4168C130.107 49.0671 129.544 48.6905 128.941 48.2331C128.7 48.0717 128.74 47.8027 128.981 47.6682C129.222 47.5068 129.624 47.5337 129.825 47.6951C130.469 48.1255 131.032 48.5291 131.474 48.8788C131.514 48.9057 131.554 48.9595 131.595 48.9864C131.635 49.0133 131.715 49.0402 131.755 49.0671C133.324 50.197 133.404 50.2777 133.444 50.3315C133.605 50.5198 133.525 50.762 133.243 50.8965C133.163 50.9234 133.082 50.9503 132.962 50.9503ZM127.735 47.1839C127.574 47.1839 127.413 47.1301 127.292 47.0494L127.011 46.8611C126.77 46.6997 126.81 46.4576 127.011 46.2962C127.252 46.1347 127.614 46.1616 127.855 46.323L128.137 46.5114C128.378 46.6728 128.338 46.9149 128.137 47.0763C128.016 47.157 127.855 47.1839 127.735 47.1839ZM125.764 45.8119C125.603 45.8119 125.443 45.7581 125.322 45.6774L123.633 44.5206C123.593 44.4937 123.553 44.4399 123.513 44.413C123.472 44.3861 123.392 44.3592 123.352 44.3323L121.663 43.1755C121.422 43.014 121.422 42.7719 121.663 42.6105C121.904 42.4491 122.266 42.4491 122.507 42.6105L124.196 43.7673C124.236 43.7942 124.277 43.848 124.317 43.8749C124.357 43.9018 124.437 43.9287 124.478 43.9556L126.166 45.1124C126.408 45.2739 126.408 45.516 126.166 45.6774C126.046 45.785 125.925 45.8119 125.764 45.8119ZM120.457 42.1263C120.296 42.1263 120.135 42.0725 120.014 41.9917L119.733 41.8034C119.492 41.642 119.492 41.3999 119.733 41.2385C119.974 41.0771 120.336 41.0771 120.577 41.2385L120.859 41.4268C121.1 41.5882 121.1 41.8303 120.859 41.9917C120.778 42.0725 120.618 42.1263 120.457 42.1263ZM118.486 40.7542C118.326 40.7542 118.165 40.7004 118.044 40.6197L116.355 39.4629C116.315 39.436 116.275 39.3822 116.235 39.3553C116.194 39.3284 116.114 39.3015 116.074 39.2746L114.385 38.1178C114.144 37.9564 114.144 37.7142 114.385 37.5528C114.626 37.3914 114.988 37.3914 115.229 37.5528L116.918 38.7096C116.958 38.7365 116.999 38.7903 117.039 38.8172C117.079 38.8441 117.16 38.8711 117.2 38.898L118.889 40.0548C119.13 40.2162 119.13 40.4583 118.889 40.6197C118.808 40.7273 118.647 40.7542 118.486 40.7542ZM113.179 37.0686C113.018 37.0686 112.857 37.0148 112.737 36.9341L112.455 36.7458C112.214 36.5843 112.214 36.3422 112.455 36.1808C112.696 36.0194 113.058 36.0194 113.299 36.1808L113.581 36.3691C113.822 36.5305 113.822 36.7727 113.581 36.9341C113.5 37.0417 113.34 37.0686 113.179 37.0686ZM111.209 35.7235C111.048 35.7235 110.887 35.6696 110.766 35.5889L109.077 34.4321C109.037 34.4052 108.997 34.3514 108.957 34.3245C108.917 34.2976 108.836 34.2707 108.796 34.2438L107.107 33.087C106.866 32.9256 106.866 32.6835 107.107 32.522C107.348 32.3606 107.71 32.3606 107.952 32.522L109.64 33.6789C109.681 33.7058 109.721 33.7596 109.761 33.7865C109.801 33.8134 109.882 33.8403 109.922 33.8672L111.611 35.024C111.852 35.1854 111.852 35.4275 111.611 35.5889C111.53 35.6696 111.369 35.7235 111.209 35.7235ZM105.901 32.0378C105.74 32.0378 105.579 31.984 105.459 31.9033L105.177 31.715L105.579 31.419L106.022 31.15L106.303 31.3383C106.544 31.4998 106.544 31.7419 106.303 31.9033C106.223 31.984 106.062 32.0378 105.901 32.0378ZM103.931 30.6658C103.77 30.6658 103.609 30.612 103.488 30.5313L101.8 29.3745C101.759 29.3476 101.719 29.2937 101.679 29.2668C101.639 29.2399 101.558 29.213 101.518 29.1861L99.8293 28.0293C99.5881 27.8679 99.5881 27.6258 99.8293 27.4644C100.071 27.303 100.432 27.303 100.674 27.4644L102.363 28.6212C102.403 28.6481 102.443 28.7019 102.483 28.7288C102.523 28.7557 102.604 28.7826 102.644 28.8095L104.333 29.9663C104.574 30.1277 104.574 30.3698 104.333 30.5313C104.252 30.6389 104.092 30.6658 103.931 30.6658ZM98.6231 26.9801C98.4622 26.9801 98.3014 26.9263 98.1808 26.8456L97.8993 26.6573C97.658 26.4959 97.658 26.2538 97.8993 26.0923C98.1406 25.9309 98.5024 25.9309 98.7437 26.0923L99.0252 26.2807C99.2664 26.4421 99.2664 26.6842 99.0252 26.8456C98.9045 26.9532 98.7437 26.9801 98.6231 26.9801ZM96.6528 25.635C96.492 25.635 96.3311 25.5812 96.2105 25.5005L94.5217 24.3437C94.4815 24.3168 94.4413 24.263 94.4011 24.2361C94.3207 24.2092 94.2805 24.1823 94.2403 24.1554L94.0392 24.0208C93.5567 23.698 93.5165 23.6442 93.5567 23.4559L94.1598 23.5366L94.6021 23.2676C94.6021 23.2676 94.7228 23.3483 94.9238 23.4828L95.1249 23.6173C95.1651 23.6442 95.2053 23.698 95.2455 23.7249C95.2857 23.7518 95.3661 23.7787 95.4063 23.8056L97.0951 24.9624C97.3364 25.1239 97.3364 25.366 97.0951 25.5274C96.9343 25.5812 96.7734 25.635 96.6528 25.635Z" fill="#876FF2" fill-opacity="0.5"/>
</svg>
