<svg width="14" height="12" viewBox="0 0 14 12" fill="none" xmlns="http://www.w3.org/2000/svg">
<path d="M7.00003 11.5556C6.83155 11.5556 6.66307 11.493 6.52523 11.3678C6.03512 10.9296 5.56032 10.5071 5.13147 10.1471C3.90618 9.06731 2.83406 8.14399 2.09889 7.23632C1.27182 6.21911 0.888916 5.24884 0.888916 4.20033C0.888916 3.16746 1.22587 2.2285 1.85383 1.53992C2.48179 0.835694 3.3548 0.444458 4.3044 0.444458C5.00894 0.444458 5.65221 0.6792 6.21891 1.11738C6.50991 1.35213 6.77029 1.61817 7.00003 1.94681C7.22977 1.61817 7.49014 1.35213 7.78115 1.11738C8.34784 0.66355 8.99112 0.444458 9.69565 0.444458C10.6453 0.444458 11.503 0.835694 12.1462 1.53992C12.7742 2.2285 13.1111 3.18311 13.1111 4.20033C13.1111 5.26449 12.7282 6.21911 11.9012 7.23632C11.166 8.14399 10.0939 9.06731 8.86859 10.1471C8.45505 10.5071 7.96494 10.9296 7.47483 11.3678C7.33698 11.493 7.1685 11.5556 7.00003 11.5556Z" fill="#E7E6E9"/>
</svg>
