<svg width="191" height="270" viewBox="0 0 191 270" fill="none" xmlns="http://www.w3.org/2000/svg">
<path d="M118.696 194.647C118.522 194.596 114.173 182.373 113.855 182.372C113.466 182.375 117.33 194.781 117.181 194.955C117.032 195.129 110.092 184.331 109.914 184.764C109.754 185.187 116.49 196.193 116.428 196.393C116.366 196.592 109.168 195.16 109.198 195.664C109.229 196.167 116.664 198.615 116.793 198.896C116.922 199.177 107.564 203.402 108.93 203.268C110.297 203.134 117.457 201.052 117.62 201.352C117.765 201.663 114.606 209.513 114.815 209.583C115.04 209.683 119.55 203.637 119.737 203.801C119.924 203.965 120.778 212.955 120.927 212.781C121.058 212.619 121.015 204.085 121.278 204.121C121.541 204.157 126.948 216.841 126.896 216.432C126.843 216.023 122.745 203.321 122.856 203.211C122.985 203.09 129.133 209.039 129.303 208.812C129.397 208.673 123.503 201.76 123.613 201.691C123.722 201.623 131.288 203.909 131.207 203.357C131.15 203.031 123.189 199.304 123.189 199.304C123.32 199.142 130.241 196.085 130.143 195.906C130.045 195.726 122.185 197.241 122.057 196.96C121.928 196.679 125.258 190.53 125.088 190.396C124.917 190.262 120.272 194.985 120.241 194.884C120.226 194.813 119.378 185.297 119.206 185.204C119.033 185.111 118.871 194.699 118.696 194.647Z" fill="#876FF2" fill-opacity="0.5"/>
<path d="M173.755 259.466C173.884 259.747 173.986 260.246 174.103 260.775C174.237 261.334 174.211 262.315 174.347 262.832C174.483 263.35 174.71 264.212 174.71 264.212C174.308 264.103 172.974 262.73 172.676 262.273C172.36 261.828 171.396 260.866 171.343 260.859C171.291 260.852 171.132 260.83 171.161 260.973C171.207 261.145 171.608 261.657 171.875 262.012C172.142 262.367 172.466 263.41 172.76 263.949C173.038 264.458 173.684 265.419 173.684 265.419C173.684 265.419 173.684 265.419 172.538 264.972C171.392 264.526 170.675 263.569 170.42 263.327C170.183 263.114 169.823 262.858 169.698 262.896C169.572 262.935 169.792 263.159 170.013 263.341C170.219 263.494 170.656 264.385 171.041 264.867C171.426 265.349 172.118 266.08 172.572 266.599C173.026 267.118 173.187 267.459 173.187 267.459C173.062 267.498 172.351 267.18 171.51 267.024C170.653 266.839 169.495 266.641 169.268 266.582C169.057 266.554 168.996 266.753 169.257 266.83C169.537 266.896 170.015 267.279 170.696 267.857C171.36 268.404 172.459 269.122 172.964 269.287C173.469 269.453 173.545 269.726 173.545 269.726C173.416 269.847 171.819 270.408 171.519 270.395C171.219 270.382 170.485 271.004 170.299 271.2C170.13 271.427 170.29 271.809 170.517 271.466C170.744 271.122 172.241 271.63 172.645 271.698C173.048 271.767 174.142 271.804 174.142 271.804C174.142 271.804 173.164 272.739 172.891 273.312C172.6 273.897 172.102 274.37 171.934 274.556C171.896 274.62 171.86 274.643 171.858 274.684C171.765 274.782 171.727 274.846 171.727 274.846C171.727 274.846 171.769 275.102 171.952 274.946C172.17 274.809 173.355 275.192 173.925 275.075C174.48 274.928 175.509 274.041 175.509 274.041C175.509 274.041 175.4 275.677 175.16 276.31C175.002 276.69 175.23 278.718 174.886 278.893C174.543 279.069 174.813 279.341 175.048 279.234C175.266 279.097 176 278.476 176.069 278.11C176.139 277.745 177.059 276.123 177.205 276.032C177.205 276.032 177.41 276.184 177.4 276.793C177.373 277.413 177.644 278.851 177.904 279.773C178.163 280.696 178.328 281.356 178.313 281.687C178.298 282.017 178.493 282.016 178.522 281.757C178.551 281.497 178.736 280.135 178.834 279.109C178.931 278.123 178.901 277.218 178.959 277.101C178.959 277.101 179.193 277.396 179.482 278.059C179.77 278.722 180.151 279.689 180.444 280.269C180.736 280.85 181.304 281.578 181.38 281.852C181.456 282.126 181.583 282.448 181.641 282.331C181.7 282.214 181.615 281.745 181.506 281.412C181.397 281.078 180.811 279.959 180.803 278.557C180.794 277.155 180.794 277.155 180.794 277.155C180.794 277.155 181.386 278.151 181.718 278.625C182.051 279.1 182.799 279.756 183.027 280.175C183.238 280.606 183.546 281.216 183.666 281.302C183.786 281.387 183.812 281.211 183.815 281.128C183.819 281.045 183.331 279.704 183.035 279.206C182.739 278.708 182.063 276.842 182.067 276.357C182.067 276.357 182.699 276.845 183.091 277.161C183.483 277.478 184.25 277.72 184.695 278.044C185.105 278.349 185.465 278.606 185.667 278.841C185.868 279.076 185.874 278.952 185.863 278.798C185.852 278.644 185.502 278.181 185.015 277.602C184.528 277.023 183.143 275.199 182.927 274.893C182.711 274.586 182.711 274.586 182.711 274.586C182.711 274.586 183.863 275.31 184.366 275.517C184.869 275.724 185.905 275.878 186.134 275.895C186.362 275.912 186.453 275.855 186.299 275.751C186.146 275.606 185.643 275.399 185.149 274.985C184.639 274.542 183.775 273.718 182.756 273.192C182.756 273.192 183.637 273.241 184.049 273.103C184.446 272.935 185.103 272.844 185.498 273.119C185.892 273.394 186.344 273.552 186.317 273.368C186.29 273.185 185.687 272.437 185.182 272.272C184.677 272.107 183.049 271.359 182.813 271.105C182.813 271.105 182.63 270.859 183.182 270.753C183.735 270.648 184.3 270.253 184.584 269.834C184.867 269.414 184.978 269.305 185.069 269.248C185.126 269.172 185.064 268.97 184.92 269.02C184.759 269.081 183.143 269.25 182.406 269.151C181.668 269.051 181.541 268.729 181.646 268.743C181.664 268.731 181.703 268.667 181.759 268.592C181.923 268.489 182.014 268.432 182.014 268.432C182.144 268.269 182.587 267.47 182.805 266.931C183.041 266.38 183.278 265.83 183.414 265.543C183.551 265.257 183.297 265.014 183.202 265.154C183.108 265.294 182.915 265.254 182.671 265.567C182.428 265.881 181.788 265.961 181.315 266.257C180.843 266.554 180.901 266.839 180.879 266.933C180.839 267.039 180.637 266.804 180.763 265.961C180.889 265.118 181.533 263.347 181.612 263.178C181.706 263.038 181.554 262.892 181.481 262.938C181.408 262.984 181.279 263.105 180.847 263.296C180.414 263.487 179.932 263.99 179.676 264.593C179.419 265.197 179.274 264.886 179.274 264.886C179.131 264.534 179.01 262.479 179.02 261.87C179.029 261.261 178.575 260.34 178.472 260.284C178.334 260.21 178.344 260.766 178.446 261.265C178.547 261.764 178.285 262.492 178.038 262.888C177.79 263.284 177.586 264.297 177.586 264.297C177.451 262.975 177.044 261.783 176.829 261.074C176.629 260.396 176.604 259.768 176.543 259.566C176.481 259.363 176.441 259.469 176.377 259.71C176.313 259.951 176.136 261.147 176.161 261.774C176.186 262.402 176.454 263.922 176.454 263.922C176.454 263.922 176.454 263.922 176.275 263.592C176.095 263.263 175.004 261.174 174.683 260.451C174.362 259.728 174.084 259.219 173.963 259.175C173.73 259.24 173.626 259.185 173.755 259.466Z" fill="#876FF2" fill-opacity="0.5"/>
<path d="M9.78727 115.067C9.74673 115.976 9.84606 116.919 10.0853 117.894C10.3408 118.899 10.7199 119.907 11.2425 120.865C11.7651 121.823 12.3805 122.683 13.0904 123.403C13.7658 124.104 14.4994 124.689 15.2423 125.067C16.0014 125.475 16.7335 125.698 17.4384 125.738C18.1614 125.767 18.8392 125.623 19.4208 125.258C20.0024 124.893 20.4678 124.36 20.7826 123.64C21.0955 122.961 21.2904 122.156 21.3128 121.257C21.3533 120.348 21.254 119.405 21.0148 118.43C20.7592 117.425 20.3801 116.417 19.8575 115.459C19.3349 114.501 18.7195 113.641 18.0096 112.921C17.3342 112.22 16.6006 111.635 15.8577 111.257C15.0986 110.849 14.3666 110.626 13.6617 110.586C12.9386 110.557 12.2608 110.701 11.6792 111.066C11.0976 111.431 10.6322 111.964 10.3175 112.684C10.0045 113.363 9.82781 114.157 9.78727 115.067ZM13.8448 111.234C14.497 111.267 15.1763 111.484 15.8501 111.825C16.5403 112.195 17.1885 112.713 17.8131 113.366C18.454 114.049 19.0204 114.819 19.494 115.687C19.9676 116.555 20.3322 117.492 20.5569 118.396C20.7817 119.3 20.8665 120.171 20.8478 120.987C20.811 121.813 20.6379 122.525 20.345 123.151C20.034 123.788 19.623 124.287 19.096 124.618C18.5689 124.949 17.9438 125.1 17.2916 125.067C16.6394 125.034 15.9601 124.817 15.2862 124.476C14.5961 124.106 13.9478 123.588 13.3233 122.935C12.6824 122.252 12.116 121.482 11.6424 120.614C11.1687 119.746 10.8041 118.809 10.5794 117.905C10.5631 117.875 10.5813 117.864 10.5649 117.834C10.6919 118.156 10.8207 118.437 10.984 118.736C12.356 121.251 14.7025 122.512 16.2292 121.554C17.7559 120.596 17.8812 117.784 16.5093 115.269C15.1374 112.754 12.7909 111.494 11.2641 112.452C11.2096 112.486 11.1733 112.509 11.1187 112.543C11.3642 112.188 11.6606 111.882 12.0241 111.653C12.5675 111.353 13.1744 111.213 13.8448 111.234Z" fill="#876FF2" fill-opacity="0.5"/>
<path d="M-4.50917 128.021C-4.23339 128.571 -3.94312 129.193 -3.71106 129.931C-3.35389 131.033 -3.09126 132.275 -3.18104 133.496C-3.22686 134.128 -3.49787 134.66 -3.81788 135.102C-4.04333 135.404 -4.30144 135.646 -4.54138 135.877C-4.98307 136.275 -5.3684 136.597 -5.44847 136.808C-5.46848 136.861 -5.47033 136.902 -5.43767 136.962C-5.25803 137.291 -4.31854 136.822 -3.14305 136.607C-2.6089 136.513 -2.04209 136.479 -1.48081 136.569C0.359223 136.901 1.87956 140.046 2.35316 140.914C2.59812 141.363 2.85255 141.204 2.84543 140.967C2.84727 140.926 2.83279 140.854 2.78195 140.806C2.46798 140.32 1.6006 138.774 1.01479 137.253C0.791693 136.71 0.621277 136.174 0.519862 135.675C0.490886 135.532 0.478241 135.42 0.465597 135.307C0.467439 135.266 0.452946 135.195 0.472962 135.142C0.461334 133.421 2.1441 132.526 2.67482 132.112C2.93109 131.911 3.02748 131.73 3.05118 131.595C3.06039 131.388 2.94424 131.22 2.7754 131.045C2.60657 130.869 2.04687 131.14 1.31098 131.401C1.2928 131.412 1.27463 131.424 1.25645 131.435C1.22011 131.458 1.18376 131.481 1.14926 131.462C1.11291 131.485 1.06023 131.478 1.02388 131.501C1.00571 131.512 0.987536 131.524 0.969363 131.535C0.933016 131.558 0.862167 131.562 0.82582 131.585C0.807646 131.596 0.80765 131.596 0.789477 131.608C0.734956 131.642 0.6641 131.646 0.60958 131.68L0.591405 131.692C0.520554 131.696 0.466043 131.73 0.395192 131.735C0.0554245 131.827 -0.282508 131.878 -0.634921 131.859C-1.99374 131.827 -3.64472 128.443 -4.01664 127.671C-4.0493 127.612 -4.06563 127.582 -4.08196 127.552C-4.32508 127.061 -5.20955 126.692 -4.50917 128.021Z" fill="#876FF2" fill-opacity="0.5"/>
<path d="M92.2115 231.188C91.9375 230.596 96.3911 228.606 95.91 227.903C95.4452 227.23 87.9559 224.372 87.9508 223.691C87.9276 223.022 96.125 227.044 95.9276 225.922C95.7302 224.8 92.1681 219.075 92.5499 218.836C92.9316 218.596 96.6838 225.608 96.997 224.527C97.3103 223.447 96.8446 215.257 97.3987 215.512C97.9528 215.767 97.7155 223.474 98.6454 224.418C99.1866 224.963 102.908 222.346 103.197 223.009C103.504 223.661 100.152 225.121 100.03 227.046C99.9093 228.971 108.336 232.206 108.359 232.875C108.382 233.544 100.282 229.341 99.99 230.73C99.6983 232.119 103.729 238.031 103.376 238.413C103.024 238.796 99.1935 231.551 98.6699 231.799C97.6937 232.291 97.9728 239.513 97.5749 239.32C96.8991 239.02 97.709 231.156 96.6863 230.31C95.2532 229.159 92.5038 231.769 92.2115 231.188Z" fill="#876FF2" fill-opacity="0.5"/>
<path d="M21.9407 45.4591C21.9318 45.2638 16.4744 41.655 15.5192 40.8879C14.5822 40.1094 22.2394 44.3071 22.2468 44.1417C22.2542 43.9763 18.1787 38.6966 18.3459 38.5112C18.5132 38.3259 22.7689 43.1309 22.8761 43.1038C22.9833 43.0767 22.3722 35.3819 22.6393 35.3348C22.9064 35.2878 23.7264 43.0525 23.8845 43.0739C24.0243 43.1067 25.8307 36.668 26.0849 36.9104C26.3064 37.0929 24.9123 43.7953 24.9958 43.9037C25.0793 44.0121 28.5551 40.9468 28.6204 41.0666C28.7021 41.2163 25.9418 44.8775 25.9055 44.9003C25.8854 44.9531 30.6194 46.1623 30.6829 46.3234C30.73 46.4546 26.3823 46.4901 26.3913 46.6854C26.3839 46.8508 32.1134 51.0926 32.1261 51.2053C32.1387 51.3179 26.483 48.1953 26.3431 48.1625C26.3431 48.1625 30.3146 54.1907 30.2382 54.3191C30.1036 54.5643 25.8882 49.2518 25.8028 49.1847C25.7157 49.1591 27.2055 54.9762 27.0819 54.9734C26.8875 54.9748 24.8798 49.2817 24.7581 49.2374C24.6364 49.1932 22.9244 55.8942 22.8117 56.0454C22.6989 56.1965 23.5611 48.7427 23.3923 48.5673C23.2234 48.3919 20.2692 51.2505 20.1294 51.2177C19.9895 51.1849 22.548 47.6904 22.4845 47.5293C22.421 47.3682 17.3288 46.6651 17.2127 46.4969C17.0946 46.37 21.9315 45.6658 21.9407 45.4591Z" fill="#876FF2" fill-opacity="0.5"/>
<path d="M89.8296 220.045C89.9447 220.256 89.952 220.493 89.857 220.633C89.7437 220.785 89.5153 220.726 89.3473 220.508L88.0229 218.715C87.8548 218.497 87.8146 218.199 87.9279 218.048C88.0412 217.896 88.2696 217.955 88.4377 218.172L89.762 219.966C89.7968 219.985 89.8132 220.015 89.8296 220.045Z" fill="#876FF2" fill-opacity="0.5"/>
<path d="M88.0593 217.638C88.1748 217.849 88.1822 218.087 88.0869 218.228C87.9733 218.38 87.7442 218.321 87.5755 218.103L86.3802 216.504C86.2115 216.286 86.1712 215.988 86.2848 215.836C86.3984 215.684 86.6275 215.743 86.7962 215.961L87.9915 217.56C88.0263 217.578 88.0428 217.608 88.0593 217.638ZM85.6705 214.4C85.786 214.611 85.7934 214.849 85.6981 214.989C85.5845 215.141 85.3554 215.082 85.1867 214.864L84.9851 214.586C84.8164 214.368 84.776 214.069 84.8897 213.917C85.0033 213.766 85.2324 213.825 85.401 214.043L85.6027 214.321C85.6375 214.34 85.654 214.37 85.6705 214.4ZM84.2736 212.523C84.3891 212.734 84.3965 212.972 84.3012 213.113C84.1876 213.264 83.9585 213.205 83.7898 212.987L82.5945 211.389C82.4258 211.171 82.3855 210.872 82.4991 210.721C82.6127 210.569 82.8418 210.628 83.0105 210.846L84.2058 212.444C84.2406 212.463 84.2571 212.493 84.2736 212.523ZM81.8848 209.285C82.0003 209.496 82.0077 209.734 81.9124 209.874C81.7988 210.026 81.5697 209.967 81.401 209.749L81.1994 209.47C81.0307 209.252 80.9903 208.954 81.104 208.802C81.2176 208.65 81.4467 208.709 81.6153 208.927L81.817 209.206C81.8518 209.224 81.8683 209.255 81.8848 209.285Z" fill="#876FF2" fill-opacity="0.5"/>
<path d="M79.702 206.112C79.8177 206.323 79.8251 206.561 79.7297 206.702C79.616 206.854 79.3866 206.794 79.2178 206.576L78.021 204.977C77.9879 204.916 77.9714 204.886 77.9384 204.826C77.9035 204.807 77.8521 204.758 77.8191 204.698L76.6223 203.099C76.4534 202.88 76.413 202.582 76.5267 202.43C76.6404 202.278 76.8698 202.337 77.0386 202.555L78.2354 204.155C78.2685 204.215 78.285 204.245 78.318 204.306C78.3529 204.324 78.4043 204.373 78.4373 204.433L79.6341 206.033C79.669 206.052 79.6855 206.082 79.702 206.112ZM75.9281 201.023C76.0438 201.234 76.0512 201.472 75.9558 201.613C75.8421 201.765 75.6127 201.706 75.4439 201.488L75.2419 201.209C75.0731 200.991 75.0326 200.692 75.1463 200.54C75.2601 200.388 75.4894 200.448 75.6583 200.666L75.8602 200.944C75.8786 200.933 75.9116 200.993 75.9281 201.023ZM74.5129 199.115C74.6286 199.326 74.636 199.564 74.5406 199.705C74.4269 199.857 74.1975 199.798 74.0286 199.579L72.8319 197.98C72.7988 197.92 72.7823 197.889 72.7493 197.829C72.7144 197.81 72.663 197.762 72.63 197.701L71.4332 196.102C71.2643 195.883 71.2239 195.585 71.3376 195.433C71.4513 195.281 71.6807 195.34 71.8495 195.558L73.0463 197.158C73.0793 197.218 73.0959 197.248 73.1289 197.309C73.1638 197.327 73.2152 197.376 73.2482 197.437L74.445 199.036C74.4799 199.055 74.4964 199.085 74.5129 199.115ZM70.739 194.026C70.8547 194.237 70.8621 194.476 70.7667 194.616C70.653 194.768 70.4236 194.709 70.2547 194.491L70.0528 194.212C69.884 193.994 69.8435 193.695 69.9572 193.544C70.0709 193.392 70.3003 193.451 70.4692 193.669L70.6711 193.947C70.6894 193.936 70.7225 193.996 70.739 194.026ZM69.3238 192.118C69.4394 192.329 69.4468 192.567 69.3515 192.708C69.2378 192.86 69.0084 192.801 68.8395 192.583L67.6427 190.983C67.6097 190.923 67.5932 190.893 67.5601 190.832C67.5253 190.814 67.4739 190.765 67.4408 190.704L66.244 189.105C66.0752 188.887 66.0347 188.588 66.1484 188.436C66.2622 188.284 66.4915 188.343 66.6604 188.562L67.8572 190.161C67.8902 190.221 67.9067 190.252 67.9398 190.312C67.9747 190.331 68.026 190.379 68.0591 190.44L69.2559 192.039C69.2907 192.058 69.3073 192.088 69.3238 192.118ZM65.5499 187.03C65.6655 187.241 65.6729 187.479 65.5776 187.619C65.4639 187.771 65.2345 187.712 65.0656 187.494L64.8637 187.215C64.6948 186.997 64.6544 186.699 64.7681 186.547C64.8818 186.395 65.1112 186.454 65.28 186.672L65.482 186.951C65.5003 186.939 65.5333 186.999 65.5499 187.03ZM64.153 185.11C64.2687 185.321 64.2761 185.559 64.1807 185.7C64.067 185.852 63.8376 185.792 63.6687 185.574L62.472 183.975C62.4389 183.914 62.4224 183.884 62.3894 183.824C62.3545 183.805 62.3031 183.756 62.27 183.696L61.0733 182.097C60.9044 181.878 60.8639 181.58 60.9777 181.428C61.0914 181.276 61.3207 181.335 61.4896 181.553L62.6864 183.153C62.7194 183.213 62.736 183.243 62.769 183.304C62.8039 183.322 62.8553 183.371 62.8883 183.431L64.0851 185.031C64.1016 185.061 64.1365 185.08 64.153 185.11ZM60.3791 180.021C60.4947 180.232 60.5022 180.47 60.4068 180.611C60.2931 180.763 60.0637 180.704 59.8948 180.486L59.6929 180.207C59.5241 179.989 59.4836 179.69 59.5973 179.538C59.711 179.386 59.9404 179.446 60.1093 179.664L60.3112 179.942C60.3112 179.942 60.3626 179.991 60.3791 180.021ZM58.9639 178.113C59.0795 178.324 59.0869 178.562 58.9916 178.703C58.8779 178.855 58.6485 178.796 58.4796 178.577L57.2828 176.978C57.2498 176.918 57.2333 176.887 57.2002 176.827C57.1654 176.808 57.114 176.76 57.0809 176.699L55.8841 175.1C55.7153 174.881 55.6748 174.583 55.7885 174.431C55.9023 174.279 56.1316 174.338 56.3005 174.556L57.4973 176.156C57.5303 176.216 57.5468 176.246 57.5799 176.307C57.6148 176.325 57.6661 176.374 57.6992 176.435L58.896 178.034C58.9308 178.053 58.9474 178.083 58.9639 178.113ZM55.19 173.024C55.3056 173.235 55.313 173.474 55.2177 173.614C55.1039 173.766 54.8746 173.707 54.7057 173.489L54.5038 173.21C54.3349 172.992 54.2945 172.694 54.4082 172.542C54.5219 172.39 54.7513 172.449 54.9201 172.667L55.1221 172.945C55.1404 172.934 55.1734 172.994 55.19 173.024ZM53.7748 171.116C53.8904 171.327 53.8978 171.565 53.8024 171.706C53.6887 171.858 53.4594 171.799 53.2905 171.581L52.0937 169.981C52.0607 169.921 52.0442 169.891 52.0111 169.83C51.9762 169.812 51.9248 169.763 51.8918 169.702L50.695 168.103C50.5262 167.885 50.4857 167.586 50.5994 167.434C50.7131 167.282 50.9425 167.341 51.1114 167.56L52.3081 169.159C52.3412 169.219 52.3577 169.25 52.3908 169.31C52.4256 169.329 52.477 169.377 52.5101 169.438L53.7068 171.037C53.7417 171.056 53.7582 171.086 53.7748 171.116ZM50.0008 166.028C50.1165 166.239 50.1239 166.477 50.0285 166.617C49.9148 166.769 49.6855 166.71 49.5166 166.492L49.3147 166.213C49.1458 165.995 49.1053 165.697 49.2191 165.545C49.3328 165.393 49.5622 165.452 49.731 165.67L49.9329 165.949C49.9513 165.937 49.9843 165.997 50.0008 166.028ZM48.5856 164.119C48.7013 164.33 48.7087 164.569 48.6133 164.709C48.4996 164.861 48.2702 164.802 48.1014 164.584L46.9046 162.984C46.8716 162.924 46.855 162.894 46.822 162.833C46.7871 162.815 46.7357 162.766 46.7027 162.706L45.5059 161.106C45.337 160.888 45.2966 160.589 45.4103 160.437C45.524 160.285 45.7534 160.345 45.9222 160.563L47.119 162.162C47.1521 162.223 47.1686 162.253 47.2016 162.313C47.2365 162.332 47.2879 162.381 47.3209 162.441L48.5177 164.04C48.5526 164.059 48.5691 164.089 48.5856 164.119ZM44.8117 159.031C44.9274 159.242 44.9348 159.48 44.8394 159.62C44.7257 159.772 44.4963 159.713 44.3275 159.495L44.1255 159.217C43.9567 158.998 43.9162 158.7 44.0299 158.548C44.1437 158.396 44.373 158.455 44.5419 158.673L44.7438 158.952C44.7787 158.97 44.7952 159.001 44.8117 159.031ZM43.4149 157.111C43.5305 157.322 43.5379 157.56 43.4425 157.701C43.3288 157.853 43.0995 157.794 42.9306 157.575L41.7338 155.976C41.7008 155.916 41.6842 155.885 41.6512 155.825C41.6163 155.806 41.5649 155.758 41.5319 155.697L40.3351 154.098C40.1662 153.88 40.1258 153.581 40.2395 153.429C40.3532 153.277 40.5826 153.336 40.7515 153.554L41.9482 155.154C41.9813 155.214 41.9978 155.244 42.0309 155.305C42.0657 155.323 42.1171 155.372 42.1502 155.433L43.3469 157.032C43.3635 157.062 43.3983 157.081 43.4149 157.111ZM39.641 152.022C39.7566 152.233 39.764 152.472 39.6686 152.612C39.5549 152.764 39.3256 152.705 39.1567 152.487L38.9548 152.208C38.7859 151.99 38.7454 151.692 38.8592 151.54C38.9729 151.388 39.2022 151.447 39.3711 151.665L39.573 151.943C39.573 151.943 39.6244 151.992 39.641 152.022ZM38.2422 150.144C38.3579 150.355 38.3653 150.594 38.2699 150.734C38.1562 150.886 37.9269 150.827 37.758 150.609L36.5612 149.009C36.5282 148.949 36.5116 148.919 36.4786 148.858C36.4437 148.84 36.3923 148.791 36.3593 148.731L35.1625 147.131C34.9937 146.913 34.9532 146.614 35.0669 146.462C35.1806 146.31 35.41 146.37 35.5789 146.588L36.7756 148.187C36.8087 148.248 36.8252 148.278 36.8583 148.338C36.8931 148.357 36.9445 148.406 36.9776 148.466L38.1743 150.065C38.1927 150.054 38.2092 150.084 38.2422 150.144ZM34.4518 145.026C34.5675 145.237 34.5749 145.475 34.4795 145.615C34.3658 145.767 34.1364 145.708 33.9676 145.49L33.7656 145.211C33.5968 144.993 33.5563 144.695 33.67 144.543C33.7838 144.391 34.0131 144.45 34.182 144.668L34.3839 144.947C34.4188 144.965 34.4353 144.995 34.4518 145.026ZM33.0531 143.148C33.1688 143.359 33.1762 143.597 33.0808 143.737C32.9671 143.889 32.7377 143.83 32.5689 143.612L31.3721 142.012C31.339 141.952 31.3225 141.922 31.2895 141.862C31.2546 141.843 31.2032 141.794 31.1702 141.734L29.9734 140.134C29.8045 139.916 29.7641 139.618 29.8778 139.466C29.9915 139.314 30.2209 139.373 30.3897 139.591L31.5865 141.19C31.6196 141.251 31.6361 141.281 31.6691 141.341C31.704 141.36 31.7554 141.409 31.7884 141.469L32.9852 143.069C33.0036 143.057 33.0201 143.087 33.0531 143.148ZM29.2627 138.029C29.3784 138.24 29.3858 138.478 29.2904 138.618C29.1767 138.77 28.9473 138.711 28.7784 138.493L28.5765 138.215C28.4077 137.996 28.3672 137.698 28.4809 137.546C28.5946 137.394 28.824 137.453 28.9929 137.671L29.1948 137.95C29.2297 137.968 29.2462 137.999 29.2627 138.029ZM27.864 136.151C27.9797 136.362 27.9871 136.6 27.8917 136.74C27.778 136.892 27.5486 136.833 27.3797 136.615L26.183 135.015C26.1499 134.955 26.1334 134.925 26.1003 134.865C26.0655 134.846 26.0141 134.797 25.981 134.737L24.7843 133.137C24.6154 132.919 24.5749 132.621 24.6887 132.469C24.8024 132.317 25.0317 132.376 25.2006 132.594L26.3974 134.194C26.4304 134.254 26.447 134.284 26.48 134.344C26.5149 134.363 26.5663 134.412 26.5993 134.472L27.7961 136.072C27.8144 136.06 27.831 136.09 27.864 136.151ZM24.0736 131.032C24.1892 131.243 24.1966 131.481 24.1013 131.622C23.9876 131.774 23.7582 131.714 23.5893 131.496L23.4039 131.248C23.2351 131.03 23.1946 130.731 23.3083 130.579C23.422 130.427 23.6514 130.486 23.8203 130.705L24.0057 130.953C24.0405 130.972 24.0571 131.002 24.0736 131.032Z" fill="#876FF2" fill-opacity="0.5"/>
<path d="M22.5464 128.769C22.6615 128.979 22.6688 129.217 22.5738 129.357C22.4605 129.509 22.2321 129.45 22.064 129.232L20.7396 127.438C20.5716 127.221 20.5314 126.923 20.6447 126.771C20.758 126.62 20.9864 126.678 21.1544 126.896L22.4788 128.69C22.5135 128.709 22.53 128.739 22.5464 128.769Z" fill="#876FF2" fill-opacity="0.5"/>
<path d="M11.1657 122.848C11.3275 123.144 11.331 123.46 11.1836 123.631L10.2523 124.532C10.2164 124.555 10.1984 124.566 10.1624 124.589C10.1427 124.641 10.1247 124.652 10.0887 124.675L9.15746 125.576C8.99206 125.759 8.6829 125.634 8.46903 125.331C8.25516 125.028 8.23724 124.643 8.40264 124.459L9.33391 123.558C9.36987 123.536 9.38785 123.525 9.4238 123.502C9.44358 123.45 9.46155 123.439 9.49751 123.416L10.4288 122.515C10.5942 122.332 10.9033 122.456 11.1172 122.759C11.1334 122.789 11.1496 122.819 11.1657 122.848ZM8.2227 125.764C8.38444 126.06 8.38799 126.375 8.24056 126.547L8.07696 126.689C7.91156 126.872 7.60239 126.748 7.38853 126.445C7.17466 126.142 7.15674 125.756 7.32214 125.573L7.48575 125.431C7.65115 125.248 7.96032 125.372 8.17418 125.675C8.19036 125.705 8.20653 125.734 8.2227 125.764ZM7.144 126.837C7.30574 127.133 7.3093 127.448 7.16187 127.62L6.2306 128.521C6.19465 128.543 6.17667 128.555 6.14071 128.577C6.12093 128.629 6.10295 128.641 6.067 128.663L5.13573 129.564C4.97033 129.747 4.66117 129.623 4.4473 129.32C4.23343 129.017 4.21552 128.631 4.38092 128.448L5.31218 127.547C5.34814 127.524 5.36611 127.513 5.40207 127.491C5.42185 127.439 5.43983 127.427 5.47578 127.405L6.40705 126.504C6.57246 126.321 6.88162 126.445 7.09548 126.748C7.11166 126.777 7.12783 126.807 7.144 126.837ZM4.20097 129.752C4.36271 130.048 4.36626 130.364 4.21883 130.536L4.07321 130.666C3.90781 130.85 3.59864 130.725 3.38478 130.422C3.17091 130.119 3.15299 129.733 3.31839 129.55L3.46402 129.419C3.62943 129.236 3.93858 129.361 4.15244 129.664C4.16862 129.693 4.1848 129.723 4.20097 129.752Z" fill="#876FF2" fill-opacity="0.5"/>
<path d="M8.2296 88.0624C8.26246 88.1225 8.29348 88.2241 8.30807 88.2957L8.67112 90.1259C8.68571 90.1975 8.68388 90.239 8.68205 90.2804C8.7149 90.3406 8.71307 90.3821 8.74592 90.4422L9.13999 92.374C9.18194 92.6301 9.06689 92.8232 8.8898 92.8131C8.69628 92.7729 8.49366 92.5367 8.43345 92.292L8.03938 90.3602C8.02479 90.2887 8.02662 90.2471 8.02845 90.2057C7.9956 90.1455 7.99743 90.1041 7.96457 90.0439L7.60153 88.2137C7.55958 87.9576 7.67463 87.7645 7.85172 87.7746C7.99413 87.7661 8.13104 87.8821 8.2296 88.0624ZM9.43915 94.0425C9.472 94.1026 9.50303 94.2042 9.51763 94.2758L9.57418 94.6035C9.61613 94.8596 9.50107 95.0527 9.32398 95.0426C9.13046 95.0024 8.92784 94.7662 8.86763 94.5215L8.81108 94.1938C8.76913 93.9377 8.88418 93.7446 9.06127 93.7547C9.20368 93.7462 9.34059 93.8622 9.43915 94.0425ZM9.87334 96.272C9.90619 96.3321 9.93721 96.4337 9.95181 96.5052L10.3459 98.437C10.3605 98.5086 10.3586 98.5501 10.3568 98.5916C10.3897 98.6517 10.3878 98.6932 10.4207 98.7533L10.8147 100.685C10.8567 100.941 10.7416 101.134 10.5646 101.124C10.371 101.084 10.1684 100.848 10.1082 100.603L9.71414 98.6713C9.69955 98.5998 9.70137 98.5583 9.70321 98.5168C9.67035 98.4567 9.67218 98.4152 9.63933 98.3551L9.24528 96.4233C9.20332 96.1671 9.31837 95.974 9.49546 95.9841C9.63787 95.9756 9.7912 96.1217 9.87334 96.272ZM11.1139 102.354C11.1468 102.414 11.1778 102.515 11.1924 102.587L11.2489 102.915C11.2909 103.171 11.1758 103.364 10.9987 103.354C10.8052 103.314 10.6026 103.077 10.5424 102.833L10.4858 102.505C10.4439 102.249 10.5589 102.056 10.736 102.066C10.8784 102.057 11.0153 102.173 11.1139 102.354ZM11.5481 104.583C11.5809 104.643 11.612 104.745 11.6266 104.816L12.0206 106.748C12.0352 106.82 12.0334 106.861 12.0316 106.903C12.0644 106.963 12.0626 107.004 12.0954 107.064L12.4895 108.996C12.5314 109.252 12.4164 109.445 12.2393 109.435C12.0458 109.395 11.8432 109.159 11.783 108.914L11.3889 106.982C11.3743 106.911 11.3761 106.869 11.378 106.828C11.3451 106.768 11.3469 106.726 11.3141 106.666L10.92 104.734C10.8781 104.478 10.9931 104.285 11.1702 104.295C11.3126 104.287 11.466 104.433 11.5481 104.583Z" fill="#876FF2" fill-opacity="0.5"/>
<path d="M19.9269 52.6213C20.0242 52.7995 20.0493 53.023 19.9736 53.1503L19.8419 53.3525C19.7463 53.5321 19.521 53.4741 19.3534 53.3C19.1697 53.0963 19.1301 52.8021 19.2077 52.6338L19.3394 52.4316C19.435 52.252 19.6603 52.3101 19.8278 52.4841C19.8783 52.5322 19.9107 52.5916 19.9269 52.6213ZM19.0918 54.0623C19.189 54.2406 19.2142 54.464 19.1384 54.5913L19.0248 54.7822C18.9292 54.9618 18.7039 54.9038 18.5363 54.7297C18.3525 54.526 18.313 54.2318 18.3906 54.0635L18.5042 53.8726C18.5998 53.693 18.8251 53.7511 18.9927 53.9251C19.0431 53.9732 19.0593 54.0029 19.0918 54.0623ZM18.2584 55.4623C18.3557 55.6405 18.3808 55.864 18.3051 55.9913L17.5854 57.2004C17.5655 57.2527 17.5475 57.264 17.5114 57.2866C17.5096 57.3276 17.4898 57.38 17.4717 57.3913L16.752 58.6004C16.6564 58.78 16.4311 58.7219 16.2635 58.5479C16.0798 58.3442 16.0402 58.05 16.1178 57.8817L16.8375 56.6726C16.8574 56.6203 16.8754 56.609 16.9115 56.5863C16.9133 56.5453 16.9331 56.493 16.9512 56.4817L17.6709 55.2726C17.7665 55.093 17.9918 55.1511 18.1593 55.3251C18.1918 55.3845 18.226 55.4029 18.2584 55.4623ZM15.9676 59.2918C16.0649 59.47 16.09 59.6935 16.0143 59.8208L15.9007 60.0117C15.805 60.1913 15.5797 60.1332 15.4122 59.9592C15.2284 59.7555 15.1889 59.4613 15.2664 59.293L15.3801 59.1021C15.4757 58.9225 15.701 58.9805 15.8685 59.1546C15.919 59.2027 15.9514 59.2621 15.9676 59.2918ZM15.1505 60.7215C15.2478 60.8997 15.2729 61.1232 15.1972 61.2505L14.4774 62.4596C14.4576 62.5119 14.4396 62.5232 14.4035 62.5458C14.4017 62.5868 14.3818 62.6391 14.3638 62.6505L13.6441 63.8595C13.5485 64.0391 13.3232 63.9811 13.1556 63.8071C12.9718 63.6033 12.9323 63.3091 13.0099 63.1409L13.7296 61.9318C13.7494 61.8794 13.7675 61.8681 13.8035 61.8455C13.8054 61.8045 13.8252 61.7522 13.8432 61.7409L14.5629 60.5318C14.6585 60.3522 14.8838 60.4102 15.0514 60.5843C15.0856 60.6027 15.1181 60.6621 15.1505 60.7215ZM12.8777 64.5396C12.975 64.7179 13.0002 64.9414 12.9244 65.0686L12.8108 65.2595C12.7151 65.4391 12.4898 65.3811 12.3223 65.2071C12.1385 65.0033 12.099 64.7091 12.1765 64.5409L12.2902 64.3499C12.3858 64.1703 12.6111 64.2284 12.7787 64.4024C12.8291 64.4505 12.8453 64.4802 12.8777 64.5396ZM12.0264 65.9509C12.1236 66.1292 12.1488 66.3527 12.073 66.4799L11.3533 67.689C11.3335 67.7413 11.3154 67.7527 11.2794 67.7753C11.2775 67.8163 11.2577 67.8686 11.2397 67.8799L10.52 69.089C10.4244 69.2686 10.1991 69.2106 10.0315 69.0365C9.84771 68.8328 9.80818 68.5386 9.88576 68.3703L10.6055 67.1612C10.6253 67.1089 10.6433 67.0976 10.6794 67.075C10.6812 67.034 10.7011 66.9816 10.7191 66.9703L11.4388 65.7612C11.5344 65.5816 11.7597 65.6397 11.9273 65.8137C11.9777 65.8618 11.9939 65.8915 12.0264 65.9509Z" fill="#876FF2" fill-opacity="0.5"/>
<path d="M112.58 205.953C112.693 206.161 112.718 206.384 112.608 206.492L112.347 206.855C112.235 207.005 112.026 206.977 111.861 206.762C111.695 206.547 111.638 206.265 111.749 206.115L112.011 205.752C112.122 205.602 112.331 205.631 112.497 205.846C112.531 205.864 112.563 205.923 112.58 205.953ZM111.567 207.464C111.68 207.672 111.706 207.895 111.596 208.004L111.464 208.205C111.352 208.355 111.144 208.327 110.978 208.112C110.812 207.897 110.755 207.615 110.866 207.465L110.998 207.263C111.11 207.113 111.319 207.142 111.484 207.357C111.5 207.386 111.535 207.405 111.567 207.464ZM110.634 208.766C110.747 208.974 110.772 209.197 110.662 209.306L109.877 210.435C109.841 210.458 109.839 210.499 109.803 210.521C109.801 210.562 109.781 210.615 109.745 210.637L108.96 211.767C108.848 211.917 108.639 211.888 108.474 211.674C108.308 211.459 108.25 211.176 108.362 211.027L109.148 209.897C109.184 209.874 109.186 209.833 109.222 209.811C109.223 209.77 109.243 209.717 109.279 209.695L110.065 208.565C110.176 208.415 110.385 208.444 110.551 208.659C110.601 208.707 110.618 208.736 110.634 208.766ZM108.18 212.375C108.293 212.583 108.318 212.806 108.208 212.915L108.077 213.117C107.965 213.267 107.756 213.238 107.591 213.024C107.425 212.809 107.368 212.526 107.479 212.377L107.611 212.175C107.723 212.025 107.931 212.053 108.097 212.268C108.131 212.286 108.147 212.316 108.18 212.375ZM107.281 213.696C107.394 213.904 107.419 214.127 107.309 214.235L106.524 215.365C106.488 215.388 106.486 215.429 106.45 215.451C106.448 215.492 106.428 215.545 106.392 215.567L105.607 216.697C105.495 216.847 105.286 216.818 105.121 216.603C104.955 216.389 104.898 216.106 105.009 215.956L105.795 214.827C105.831 214.804 105.833 214.763 105.869 214.741C105.87 214.7 105.89 214.647 105.926 214.625L106.712 213.495C106.824 213.345 107.032 213.374 107.198 213.588C107.232 213.607 107.248 213.636 107.281 213.696ZM104.811 217.276C104.924 217.483 104.949 217.707 104.839 217.815L104.708 218.017C104.596 218.167 104.387 218.139 104.222 217.924C104.056 217.709 103.998 217.427 104.11 217.277L104.242 217.075C104.353 216.925 104.562 216.954 104.728 217.168C104.762 217.187 104.794 217.246 104.811 217.276ZM103.894 218.607C104.007 218.815 104.032 219.038 103.922 219.147L103.137 220.277C103.101 220.299 103.099 220.34 103.063 220.363C103.061 220.404 103.041 220.456 103.005 220.479L102.22 221.608C102.108 221.758 101.899 221.73 101.733 221.515C101.568 221.3 101.51 221.018 101.622 220.868L102.408 219.738C102.444 219.716 102.445 219.675 102.481 219.652C102.483 219.611 102.503 219.559 102.539 219.536L103.325 218.407C103.436 218.257 103.645 218.285 103.811 218.5C103.845 218.518 103.861 218.548 103.894 218.607Z" fill="#876FF2" fill-opacity="0.5"/>
<path d="M164.463 261.73C164.528 261.849 164.576 261.98 164.57 262.104C164.559 262.352 164.396 262.455 164.189 262.344C164.154 262.325 163.913 262.195 162.719 261.66C162.685 261.641 162.634 261.593 162.599 261.574C162.547 261.567 162.512 261.548 162.478 261.53L161.008 260.846C160.801 260.735 160.636 260.477 160.647 260.229C160.64 259.992 160.805 259.849 161.012 259.96L162.482 260.644C162.516 260.662 162.567 260.711 162.602 260.729C162.654 260.736 162.689 260.755 162.723 260.773C163.952 261.328 164.175 261.469 164.227 261.476C164.315 261.502 164.398 261.61 164.463 261.73ZM159.795 259.559C159.86 259.679 159.891 259.78 159.885 259.904C159.892 260.14 159.727 260.284 159.52 260.173L159.261 260.055C159.07 259.974 158.889 259.686 158.9 259.438C158.893 259.201 159.058 259.058 159.265 259.169L159.506 259.298C159.612 259.313 159.729 259.439 159.795 259.559ZM158.084 258.745C158.149 258.865 158.18 258.966 158.174 259.09C158.181 259.327 158.016 259.47 157.809 259.359L156.34 258.675C156.305 258.657 156.271 258.638 156.22 258.59C156.167 258.583 156.133 258.564 156.098 258.546L154.629 257.861C154.438 257.78 154.257 257.492 154.268 257.245C154.261 257.008 154.426 256.864 154.633 256.975L156.103 257.659C156.137 257.678 156.171 257.696 156.222 257.745C156.275 257.752 156.309 257.771 156.344 257.789L157.813 258.473C157.917 258.529 158.018 258.626 158.084 258.745ZM153.432 256.605C153.497 256.724 153.528 256.826 153.522 256.949C153.529 257.186 153.364 257.33 153.157 257.219L152.916 257.089C152.725 257.008 152.544 256.72 152.555 256.472C152.548 256.236 152.713 256.092 152.92 256.203L153.179 256.321C153.265 256.388 153.366 256.485 153.432 256.605ZM151.702 255.802C151.768 255.922 151.799 256.023 151.793 256.147C151.8 256.384 151.635 256.527 151.428 256.416L149.958 255.732C149.924 255.714 149.89 255.695 149.839 255.647C149.786 255.64 149.752 255.621 149.717 255.602L148.248 254.918C148.057 254.837 147.876 254.549 147.887 254.301C147.88 254.065 148.045 253.921 148.252 254.032L149.721 254.716C149.756 254.735 149.79 254.753 149.841 254.802C149.894 254.809 149.928 254.828 149.963 254.846L151.432 255.53C151.554 255.574 151.637 255.683 151.702 255.802ZM147.068 253.65C147.134 253.77 147.165 253.871 147.159 253.995C147.166 254.232 147.001 254.375 146.794 254.264L146.553 254.135C146.362 254.053 146.181 253.765 146.192 253.518C146.185 253.281 146.35 253.137 146.557 253.248L146.798 253.378C146.902 253.434 147.003 253.531 147.068 253.65ZM145.356 252.878C145.421 252.997 145.452 253.099 145.446 253.223C145.453 253.459 145.288 253.603 145.081 253.492L143.612 252.808C143.577 252.789 143.543 252.771 143.492 252.722C143.439 252.715 143.405 252.696 143.37 252.678L141.901 251.994C141.71 251.913 141.529 251.625 141.54 251.377C141.533 251.14 141.698 250.997 141.905 251.108L143.374 251.792C143.409 251.81 143.443 251.829 143.494 251.877C143.547 251.885 143.581 251.903 143.616 251.922L145.085 252.606C145.189 252.661 145.29 252.758 145.356 252.878ZM140.704 250.737C140.769 250.857 140.8 250.958 140.794 251.082C140.801 251.318 140.636 251.462 140.429 251.351L140.188 251.221C139.997 251.14 139.816 250.852 139.827 250.604C139.82 250.368 139.985 250.224 140.192 250.335L140.433 250.465C140.555 250.509 140.638 250.617 140.704 250.737ZM139.009 249.953C139.074 250.073 139.105 250.174 139.099 250.298C139.107 250.535 138.941 250.678 138.735 250.567L137.265 249.883C137.23 249.865 137.18 249.816 137.145 249.798C137.092 249.791 137.058 249.772 137.024 249.753L135.554 249.069C135.363 248.988 135.182 248.7 135.193 248.452C135.186 248.216 135.351 248.072 135.558 248.183L137.028 248.867C137.062 248.886 137.113 248.934 137.147 248.953C137.2 248.96 137.234 248.979 137.269 248.997L138.739 249.681C138.826 249.707 138.944 249.834 139.009 249.953ZM134.357 247.813C134.422 247.932 134.453 248.033 134.447 248.157C134.454 248.394 134.289 248.538 134.082 248.427L133.841 248.297C133.651 248.216 133.469 247.928 133.48 247.68C133.473 247.444 133.638 247.3 133.845 247.411L134.105 247.529C134.192 247.555 134.291 247.693 134.357 247.813ZM132.646 246.999C132.711 247.119 132.742 247.22 132.736 247.344C132.743 247.58 132.578 247.724 132.371 247.613L130.902 246.929C130.867 246.91 130.816 246.862 130.782 246.843C130.729 246.836 130.695 246.818 130.66 246.799L129.191 246.115C129 246.034 128.819 245.746 128.83 245.498C128.823 245.262 128.988 245.118 129.195 245.229L130.664 245.913C130.699 245.931 130.733 245.95 130.784 245.998C130.837 246.006 130.871 246.024 130.906 246.043L132.375 246.727C132.479 246.782 132.58 246.879 132.646 246.999ZM127.994 244.858C128.059 244.978 128.09 245.079 128.084 245.203C128.091 245.439 127.926 245.583 127.719 245.472L127.478 245.342C127.287 245.261 127.106 244.973 127.117 244.726C127.11 244.489 127.275 244.345 127.482 244.456L127.741 244.575C127.827 244.642 127.928 244.739 127.994 244.858ZM126.281 244.086C126.346 244.205 126.377 244.307 126.371 244.431C126.378 244.667 126.213 244.811 126.006 244.7L124.537 244.016C124.502 243.997 124.452 243.949 124.417 243.93C124.364 243.923 124.33 243.904 124.295 243.886L122.826 243.202C122.635 243.121 122.454 242.833 122.465 242.585C122.458 242.348 122.623 242.205 122.83 242.316L124.3 243C124.334 243.018 124.385 243.067 124.419 243.085C124.472 243.092 124.506 243.111 124.541 243.13L126.01 243.814C126.132 243.858 126.215 243.966 126.281 244.086ZM121.647 241.934C121.712 242.053 121.743 242.155 121.737 242.278C121.744 242.515 121.579 242.659 121.372 242.548L121.113 242.429C120.922 242.348 120.741 242.06 120.752 241.812C120.745 241.576 120.91 241.432 121.117 241.543L121.376 241.662C121.48 241.717 121.581 241.814 121.647 241.934ZM119.934 241.161C119.999 241.281 120.03 241.382 120.025 241.506C120.032 241.742 119.866 241.886 119.66 241.775L118.19 241.091C118.155 241.073 118.121 241.054 118.07 241.006C118.018 240.998 117.983 240.98 117.949 240.961L116.479 240.277C116.288 240.196 116.107 239.908 116.118 239.66C116.111 239.424 116.276 239.28 116.483 239.391L117.953 240.075C117.987 240.094 118.022 240.112 118.072 240.161C118.125 240.168 118.16 240.186 118.194 240.205L119.664 240.889C119.751 240.915 119.852 241.012 119.934 241.161ZM115.265 238.991C115.331 239.11 115.362 239.212 115.356 239.335C115.363 239.572 115.198 239.716 114.991 239.605L114.732 239.486C114.541 239.405 114.36 239.117 114.371 238.869C114.364 238.633 114.529 238.489 114.736 238.6L114.995 238.719C115.099 238.774 115.2 238.871 115.265 238.991ZM113.553 238.218C113.618 238.338 113.649 238.439 113.643 238.563C113.65 238.799 113.485 238.943 113.278 238.832L111.809 238.148C111.774 238.13 111.74 238.111 111.689 238.063C111.636 238.055 111.602 238.037 111.567 238.018L110.098 237.334C109.907 237.253 109.726 236.965 109.737 236.717C109.73 236.481 109.895 236.337 110.102 236.448L111.571 237.132C111.606 237.151 111.64 237.169 111.691 237.218C111.744 237.225 111.778 237.243 111.813 237.262L113.282 237.946C113.404 237.99 113.487 238.099 113.553 238.218Z" fill="#876FF2" fill-opacity="0.5"/>
<path d="M171.238 257.743C171.337 257.924 171.362 258.15 171.286 258.279C171.189 258.461 170.976 258.432 170.79 258.226L169.483 256.78C169.432 256.732 169.416 256.702 169.383 256.641C169.348 256.623 169.297 256.574 169.262 256.555L167.956 255.11C167.769 254.904 167.71 254.617 167.807 254.435C167.904 254.253 168.116 254.282 168.303 254.489L169.61 255.934C169.661 255.983 169.677 256.013 169.71 256.073C169.745 256.092 169.796 256.14 169.831 256.159L171.137 257.604C171.17 257.664 171.205 257.683 171.238 257.743ZM167.099 253.141C167.198 253.322 167.224 253.548 167.147 253.677C167.05 253.859 166.838 253.83 166.651 253.624L166.448 253.387C166.261 253.181 166.203 252.894 166.3 252.712C166.397 252.53 166.609 252.559 166.795 252.765L166.999 253.002C167.015 253.032 167.066 253.081 167.099 253.141ZM165.555 251.441C165.654 251.621 165.679 251.848 165.602 251.977C165.505 252.158 165.293 252.13 165.107 251.923L163.8 250.478C163.749 250.429 163.732 250.399 163.7 250.339C163.665 250.32 163.614 250.272 163.579 250.253L162.272 248.808C162.086 248.601 162.027 248.315 162.124 248.133C162.221 247.951 162.433 247.98 162.62 248.186L163.926 249.631C163.978 249.68 163.994 249.71 164.027 249.771C164.062 249.789 164.113 249.838 164.148 249.857L165.454 251.302C165.505 251.35 165.538 251.411 165.555 251.441ZM161.416 246.839C161.515 247.019 161.54 247.246 161.464 247.375C161.367 247.556 161.154 247.528 160.968 247.321L160.765 247.085C160.578 246.878 160.519 246.592 160.616 246.41C160.713 246.228 160.926 246.257 161.112 246.463L161.315 246.7C161.367 246.748 161.383 246.779 161.416 246.839ZM159.906 245.157C160.005 245.338 160.031 245.564 159.954 245.693C159.857 245.875 159.645 245.846 159.458 245.639L158.152 244.194C158.101 244.146 158.084 244.116 158.051 244.055C158.016 244.037 157.965 243.988 157.93 243.969L156.624 242.524C156.437 242.318 156.379 242.031 156.476 241.849C156.573 241.667 156.785 241.696 156.972 241.903L158.278 243.348C158.329 243.397 158.346 243.427 158.379 243.487C158.413 243.505 158.465 243.554 158.499 243.573L159.806 245.018C159.822 245.048 159.873 245.097 159.906 245.157ZM155.751 240.525C155.85 240.706 155.876 240.932 155.799 241.061C155.702 241.243 155.489 241.214 155.303 241.007L155.1 240.771C154.913 240.564 154.855 240.278 154.952 240.096C155.048 239.914 155.261 239.943 155.447 240.149L155.65 240.386C155.683 240.446 155.735 240.495 155.751 240.525ZM154.223 238.855C154.322 239.035 154.348 239.262 154.271 239.391C154.174 239.572 153.962 239.544 153.775 239.337L152.469 237.892C152.417 237.843 152.401 237.813 152.368 237.753C152.333 237.734 152.282 237.686 152.247 237.667L150.941 236.222C150.754 236.015 150.696 235.729 150.793 235.547C150.889 235.365 151.102 235.394 151.288 235.6L152.595 237.045C152.646 237.094 152.662 237.124 152.695 237.184C152.73 237.203 152.781 237.252 152.816 237.271L154.123 238.716C154.157 238.734 154.19 238.795 154.223 238.855ZM150.084 234.253C150.183 234.433 150.209 234.66 150.132 234.789C150.035 234.97 149.823 234.942 149.636 234.735L149.433 234.499C149.246 234.292 149.188 234.006 149.285 233.824C149.382 233.642 149.594 233.671 149.781 233.877L149.984 234.114C150.019 234.132 150.051 234.192 150.084 234.253ZM148.558 232.541C148.657 232.721 148.683 232.948 148.606 233.077C148.509 233.259 148.297 233.23 148.11 233.023L146.804 231.578C146.752 231.529 146.736 231.499 146.703 231.439C146.668 231.421 146.617 231.372 146.582 231.353L145.276 229.908C145.089 229.702 145.031 229.415 145.128 229.233C145.225 229.051 145.437 229.08 145.623 229.287L146.93 230.732C146.981 230.78 146.998 230.81 147.031 230.871C147.065 230.889 147.117 230.938 147.151 230.957L148.458 232.402C148.509 232.451 148.525 232.481 148.558 232.541ZM144.419 227.939C144.518 228.119 144.544 228.346 144.467 228.475C144.37 228.657 144.158 228.628 143.971 228.421L143.768 228.185C143.582 227.978 143.523 227.692 143.62 227.51C143.717 227.328 143.929 227.357 144.116 227.563L144.319 227.8C144.335 227.83 144.387 227.879 144.419 227.939ZM142.875 226.239C142.974 226.419 143 226.646 142.923 226.774C142.826 226.956 142.614 226.927 142.427 226.721L141.121 225.276C141.069 225.227 141.053 225.197 141.02 225.137C140.985 225.118 140.934 225.069 140.899 225.051L139.593 223.606C139.406 223.399 139.347 223.113 139.444 222.931C139.541 222.749 139.754 222.778 139.94 222.984L141.247 224.429C141.298 224.478 141.314 224.508 141.347 224.568C141.382 224.587 141.433 224.636 141.468 224.654L142.775 226.1C142.826 226.148 142.859 226.208 142.875 226.239ZM138.736 221.637C138.835 221.817 138.861 222.043 138.784 222.172C138.687 222.354 138.475 222.325 138.288 222.119L138.085 221.882C137.898 221.676 137.84 221.389 137.937 221.208C138.034 221.026 138.246 221.054 138.433 221.261L138.636 221.497C138.687 221.546 138.703 221.576 138.736 221.637ZM137.227 219.955C137.326 220.135 137.351 220.362 137.274 220.491C137.177 220.673 136.965 220.644 136.779 220.437L135.472 218.992C135.421 218.943 135.404 218.913 135.371 218.853C135.337 218.834 135.285 218.786 135.251 218.767L133.944 217.322C133.758 217.115 133.699 216.829 133.796 216.647C133.893 216.465 134.105 216.494 134.292 216.7L135.598 218.146C135.65 218.194 135.666 218.224 135.699 218.285C135.734 218.303 135.785 218.352 135.82 218.371L137.126 219.816C137.161 219.834 137.194 219.895 137.227 219.955ZM133.071 215.323C133.17 215.503 133.196 215.73 133.119 215.859C133.022 216.04 132.81 216.012 132.623 215.805L132.42 215.569C132.233 215.362 132.175 215.076 132.272 214.894C132.369 214.712 132.581 214.741 132.768 214.947L132.971 215.184C133.022 215.232 133.055 215.293 133.071 215.323ZM131.544 213.653C131.642 213.833 131.668 214.059 131.591 214.188C131.494 214.37 131.282 214.341 131.095 214.135L129.789 212.69C129.602 212.483 129.544 212.197 129.641 212.015C129.738 211.833 129.95 211.862 130.137 212.068L131.443 213.513C131.478 213.532 131.511 213.592 131.544 213.653Z" fill="#876FF2" fill-opacity="0.5"/>
<path d="M107.209 180.698C107.341 180.94 107.33 181.19 107.2 181.312C107.069 181.434 106.824 181.303 106.673 181.072L105.604 179.307C105.571 179.246 105.555 179.216 105.54 179.144C105.488 179.095 105.472 179.065 105.438 179.005L104.37 177.239C104.218 177.009 104.231 176.717 104.362 176.595C104.492 176.473 104.737 176.604 104.888 176.834L105.957 178.6C105.99 178.661 106.007 178.691 106.022 178.763C106.073 178.812 106.09 178.842 106.123 178.902L107.192 180.668L107.209 180.698ZM103.818 175.11C103.95 175.352 103.939 175.602 103.809 175.724C103.678 175.845 103.433 175.714 103.282 175.484L103.098 175.194C102.947 174.964 102.959 174.672 103.09 174.55C103.221 174.428 103.466 174.559 103.617 174.789L103.801 175.08C103.818 175.11 103.818 175.11 103.818 175.11ZM102.581 173.084C102.714 173.325 102.703 173.575 102.572 173.697C102.442 173.819 102.197 173.688 102.046 173.458L100.977 171.692C100.944 171.632 100.927 171.601 100.912 171.53C100.861 171.481 100.844 171.451 100.811 171.39L99.7419 169.624C99.6092 169.383 99.6035 169.102 99.734 168.981C99.8646 168.859 100.11 168.99 100.261 169.22L101.33 170.986C101.363 171.046 101.379 171.076 101.394 171.148C101.446 171.197 101.462 171.227 101.495 171.288L102.564 173.054C102.564 173.054 102.564 173.054 102.581 173.084ZM99.2083 167.484C99.341 167.726 99.3302 167.976 99.1996 168.098C99.069 168.22 98.8241 168.088 98.673 167.858L98.4887 167.568C98.3376 167.338 98.3503 167.046 98.4809 166.924C98.6114 166.802 98.8564 166.933 99.0075 167.164L99.1917 167.454L99.2083 167.484ZM97.9551 165.428C98.0878 165.669 98.077 165.919 97.9464 166.041C97.8158 166.163 97.5709 166.032 97.4198 165.802L96.3509 164.036C96.3177 163.976 96.3011 163.945 96.2864 163.874C96.2348 163.825 96.2182 163.794 96.185 163.734L95.1161 161.968C94.965 161.738 94.9777 161.446 95.1083 161.324C95.2388 161.203 95.4838 161.334 95.6349 161.564L96.7038 163.33C96.7369 163.39 96.7535 163.42 96.7683 163.492C96.8199 163.541 96.8365 163.571 96.8696 163.632L97.9386 165.398L97.9551 165.428ZM94.5807 159.87C94.7134 160.111 94.7026 160.361 94.572 160.483C94.4414 160.605 94.1965 160.474 94.0454 160.244L93.8611 159.953C93.71 159.723 93.7227 159.432 93.8533 159.31C93.9838 159.188 94.2287 159.319 94.3799 159.549L94.5641 159.84C94.5641 159.84 94.5641 159.84 94.5807 159.87ZM93.3275 157.813C93.4602 158.055 93.4494 158.305 93.3188 158.427C93.1882 158.549 92.9433 158.418 92.7922 158.187L91.7233 156.422C91.6901 156.361 91.6735 156.331 91.6588 156.259C91.6072 156.21 91.5906 156.18 91.5574 156.12L90.4885 154.354C90.3374 154.124 90.3501 153.832 90.4807 153.71C90.6112 153.588 90.8561 153.719 91.0073 153.949L92.0762 155.715C92.1093 155.776 92.1259 155.806 92.1407 155.878C92.1923 155.927 92.2089 155.957 92.242 156.017L93.311 157.783C93.311 157.783 93.311 157.783 93.3275 157.813ZM89.9365 152.225C90.0693 152.467 90.0584 152.717 89.9278 152.839C89.7972 152.96 89.5523 152.829 89.4012 152.599L89.2169 152.309C89.0658 152.079 89.0785 151.787 89.2091 151.665C89.3397 151.543 89.5846 151.674 89.7357 151.904L89.92 152.195L89.9365 152.225ZM88.7017 150.157C88.8345 150.399 88.8236 150.649 88.693 150.771C88.5624 150.893 88.3175 150.761 88.1664 150.531L87.0975 148.765C87.0643 148.705 87.0478 148.675 87.033 148.603C86.9814 148.554 86.9648 148.524 86.9316 148.463L85.8627 146.698C85.7116 146.467 85.7243 146.176 85.8549 146.054C85.9854 145.932 86.2304 146.063 86.3815 146.293L87.4504 148.059C87.4835 148.12 87.5001 148.15 87.5149 148.222C87.5665 148.271 87.5831 148.301 87.6162 148.361L88.6852 150.127C88.7017 150.157 88.7017 150.157 88.7017 150.157ZM85.3273 144.599C85.46 144.841 85.4492 145.091 85.3186 145.213C85.188 145.335 84.9431 145.203 84.792 144.973L84.6077 144.683C84.4584 144.411 84.4693 144.161 84.5999 144.039C84.7305 143.917 84.9754 144.048 85.1265 144.279L85.3107 144.569C85.3107 144.569 85.3107 144.569 85.3273 144.599ZM84.0741 142.543C84.2069 142.784 84.196 143.034 84.0654 143.156C83.9348 143.278 83.6899 143.147 83.5388 142.917L82.4699 141.151C82.4367 141.091 82.4201 141.06 82.4054 140.989C82.3538 140.94 82.3372 140.909 82.304 140.849L81.2351 139.083C81.084 138.853 81.0967 138.561 81.2273 138.439C81.3578 138.318 81.6028 138.449 81.7539 138.679L82.8228 140.445C82.8559 140.505 82.8725 140.535 82.8873 140.607C82.9389 140.656 82.9555 140.686 82.9887 140.747L84.0576 142.513L84.0741 142.543ZM80.6831 136.955C80.8159 137.196 80.805 137.446 80.6744 137.568C80.5438 137.69 80.2989 137.559 80.1478 137.329L79.9635 137.038C79.8124 136.808 79.8251 136.516 79.9557 136.395C80.0863 136.273 80.3312 136.404 80.4823 136.634L80.6666 136.924C80.6831 136.955 80.6831 136.955 80.6831 136.955ZM79.4465 134.928C79.5792 135.17 79.5684 135.42 79.4378 135.542C79.3072 135.664 79.0623 135.533 78.9112 135.302L77.8423 133.537C77.8091 133.476 77.7925 133.446 77.7778 133.374C77.7262 133.325 77.7096 133.295 77.6764 133.235L76.6075 131.469C76.4564 131.239 76.4691 130.947 76.5997 130.825C76.7302 130.703 76.9751 130.834 77.1262 131.064L78.1952 132.83C78.2283 132.891 78.2449 132.921 78.2597 132.993C78.3113 133.042 78.3279 133.072 78.361 133.132L79.43 134.898C79.43 134.898 79.43 134.898 79.4465 134.928ZM76.0739 129.329C76.2066 129.57 76.1958 129.82 76.0652 129.942C75.9346 130.064 75.6897 129.933 75.5386 129.703L75.3543 129.412C75.2032 129.182 75.2159 128.891 75.3465 128.769C75.4771 128.647 75.722 128.778 75.8731 129.008L76.0573 129.298L76.0739 129.329ZM74.8207 127.272C74.9535 127.514 74.9426 127.764 74.812 127.886C74.6814 128.008 74.4365 127.876 74.2854 127.646L73.2165 125.88C73.1833 125.82 73.1668 125.79 73.152 125.718C73.1004 125.669 73.0838 125.639 73.0506 125.578L71.9817 123.813C71.8306 123.582 71.8433 123.291 71.9739 123.169C72.1044 123.047 72.3494 123.178 72.5005 123.408L73.5694 125.174C73.6025 125.235 73.6191 125.265 73.6339 125.337C73.6855 125.386 73.7021 125.416 73.7353 125.476L74.8042 127.242L74.8207 127.272ZM71.4463 121.714C71.579 121.956 71.5682 122.206 71.4376 122.328C71.307 122.45 71.0621 122.318 70.911 122.088L70.7267 121.798C70.5756 121.568 70.5883 121.276 70.7189 121.154C70.8495 121.032 71.0943 121.163 71.2455 121.393L71.4297 121.684C71.4297 121.684 71.4298 121.684 71.4463 121.714ZM70.1932 119.658C70.3259 119.899 70.315 120.149 70.1844 120.271C70.0538 120.393 69.8089 120.262 69.6578 120.032L68.5889 118.266C68.5557 118.206 68.5391 118.175 68.5244 118.104C68.4728 118.055 68.4562 118.024 68.423 117.964L67.3541 116.198C67.203 115.968 67.2157 115.676 67.3463 115.554C67.4769 115.433 67.7217 115.564 67.8728 115.794L68.9418 117.56C68.9749 117.62 68.9915 117.65 69.0063 117.722C69.0579 117.771 69.0745 117.801 69.1076 117.862L70.1766 119.628C70.1766 119.628 70.1766 119.628 70.1932 119.658ZM66.8021 114.07C66.9348 114.311 66.924 114.561 66.7934 114.683C66.6628 114.805 66.4179 114.674 66.2668 114.444L66.0825 114.153C65.9314 113.923 65.9441 113.631 66.0747 113.51C66.2053 113.388 66.4502 113.519 66.6013 113.749L66.7855 114.039L66.8021 114.07ZM65.5674 112.002C65.7001 112.243 65.6892 112.493 65.5586 112.615C65.428 112.737 65.1831 112.606 65.032 112.376L63.9631 110.61C63.9299 110.549 63.9134 110.519 63.8986 110.447C63.847 110.398 63.8304 110.368 63.7972 110.308L62.7283 108.542C62.5772 108.312 62.5899 108.02 62.7205 107.898C62.8511 107.776 63.096 107.908 63.2471 108.138L64.316 109.904C64.3491 109.964 64.3657 109.994 64.3805 110.066C64.4321 110.115 64.4487 110.145 64.4818 110.206L65.5508 111.971C65.5673 112.002 65.5674 112.002 65.5674 112.002ZM62.1929 106.444C62.3256 106.685 62.3148 106.935 62.1842 107.057C62.0536 107.179 61.8087 107.048 61.6576 106.818L61.4733 106.527C61.3222 106.297 61.3349 106.006 61.4655 105.884C61.5961 105.762 61.841 105.893 61.9921 106.123L62.1764 106.413C62.1764 106.413 62.1764 106.413 62.1929 106.444ZM60.9398 104.387C61.0725 104.629 61.0616 104.879 60.931 105.001C60.8004 105.123 60.5555 104.991 60.4044 104.761L59.3355 102.995C59.3023 102.935 59.2858 102.905 59.271 102.833C59.2194 102.784 59.2028 102.754 59.1696 102.693L58.1007 100.928C57.9496 100.697 57.9623 100.406 58.0929 100.284C58.2235 100.162 58.4684 100.293 58.6195 100.523L59.6884 102.289C59.7215 102.35 59.7381 102.38 59.7529 102.452C59.8045 102.501 59.8211 102.531 59.8543 102.591L60.9232 104.357L60.9398 104.387ZM57.5487 98.799C57.6814 99.0406 57.6706 99.2905 57.54 99.4124C57.4094 99.5343 57.1645 99.4032 57.0134 99.1731L56.8291 98.8826C56.6964 98.641 56.6907 98.3609 56.8213 98.239C56.9519 98.1171 57.1968 98.2482 57.3479 98.4783L57.5322 98.7688C57.5487 98.799 57.5487 98.799 57.5487 98.799ZM56.314 96.7311C56.4467 96.9727 56.4358 97.2226 56.3052 97.3445C56.1746 97.4664 55.9297 97.3353 55.7786 97.1052L54.7097 95.3393C54.6765 95.2789 54.66 95.2487 54.6452 95.1769C54.5936 95.1279 54.577 95.0977 54.5438 95.0373L53.4749 93.2714C53.3238 93.0413 53.3365 92.7497 53.4671 92.6278C53.5977 92.5059 53.8426 92.637 53.9937 92.8671L55.0626 94.6331C55.0958 94.6935 55.1123 94.7236 55.1271 94.7955C55.1787 94.8444 55.1953 94.8746 55.2285 94.935L56.2974 96.7009C56.314 96.7311 56.314 96.7311 56.314 96.7311ZM52.9395 91.1731C53.0723 91.4147 53.0614 91.6646 52.9308 91.7865C52.8002 91.9084 52.5553 91.7773 52.4042 91.5472L52.2199 91.2567C52.0688 91.0266 52.0815 90.735 52.2121 90.6131C52.3427 90.4912 52.5876 90.6223 52.7387 90.8524L52.923 91.1429L52.9395 91.1731ZM51.6864 89.1167C51.8191 89.3582 51.8082 89.6082 51.6776 89.7301C51.547 89.852 51.3021 89.7209 51.151 89.4908L50.0821 87.7248C50.0489 87.6645 50.0323 87.6343 50.0176 87.5624C49.966 87.5135 49.9494 87.4833 49.9162 87.4229L48.8473 85.657C48.6962 85.4269 48.7089 85.1353 48.8395 85.0134C48.9701 84.8915 49.215 85.0226 49.3661 85.2527L50.435 87.0186C50.4681 87.079 50.4847 87.1092 50.4995 87.181C50.5511 87.23 50.5677 87.2602 50.6009 87.3206L51.6698 89.0865L51.6864 89.1167ZM48.3119 83.5586C48.4446 83.8002 48.4338 84.0502 48.3032 84.1721C48.1726 84.294 47.9277 84.1628 47.7766 83.9327L47.5923 83.6422C47.4412 83.4121 47.4539 83.1205 47.5845 82.9986C47.7151 82.8767 47.96 83.0078 48.1111 83.2379L48.2953 83.5284C48.2953 83.5284 48.2953 83.5284 48.3119 83.5586ZM47.0587 81.5022C47.1915 81.7438 47.1806 81.9937 47.05 82.1156C46.9194 82.2375 46.6745 82.1064 46.5234 81.8763L45.4545 80.1104C45.4213 80.05 45.4047 80.0198 45.39 79.948C45.3384 79.899 45.3218 79.8688 45.2886 79.8084L44.2197 78.0425C44.0686 77.8124 44.0813 77.5208 44.2119 77.3989C44.3425 77.277 44.5874 77.4081 44.7385 77.6383L45.8074 79.4042C45.8406 79.4646 45.8571 79.4948 45.8719 79.5666C45.9235 79.6155 45.9401 79.6457 45.9733 79.7061L47.0422 81.472C47.0422 81.472 47.0422 81.472 47.0587 81.5022ZM43.6861 75.9025C43.8189 76.1441 43.808 76.3941 43.6774 76.5159C43.5468 76.6379 43.3019 76.5067 43.1508 76.2766L42.9665 75.9861C42.8154 75.756 42.8281 75.4644 42.9587 75.3425C43.0893 75.2206 43.3342 75.3517 43.4853 75.5818L43.6696 75.8723L43.6861 75.9025ZM42.433 73.8461C42.5657 74.0877 42.5548 74.3376 42.4242 74.4595C42.2936 74.5814 42.0487 74.4503 41.8976 74.2202L40.8287 72.4543C40.7955 72.3939 40.7789 72.3637 40.7642 72.2918C40.7126 72.2429 40.696 72.2127 40.6628 72.1523L39.5939 70.3864C39.4428 70.1563 39.4555 69.8647 39.5861 69.7428C39.7167 69.6209 39.9616 69.752 40.1127 69.9821L41.1816 71.7481C41.2148 71.8084 41.2314 71.8386 41.2461 71.9105C41.2977 71.9594 41.3143 71.9896 41.3475 72.05L42.4164 73.8159C42.433 73.8461 42.433 73.8461 42.433 73.8461ZM39.0585 68.2881C39.1912 68.5296 39.1804 68.7796 39.0498 68.9015C38.9192 69.0234 38.6743 68.8923 38.5232 68.6622L38.3389 68.3717C38.2062 68.1301 38.2005 67.8499 38.3311 67.728C38.4617 67.6061 38.7066 67.7373 38.8577 67.9674L39.0419 68.2579C39.0419 68.2579 39.0419 68.2579 39.0585 68.2881ZM37.8053 66.2317C37.9381 66.4732 37.9272 66.7232 37.7966 66.8451C37.666 66.967 37.4211 66.8359 37.27 66.6058L36.2011 64.8398C36.1679 64.7795 36.1514 64.7493 36.1366 64.6774C36.085 64.6285 36.0684 64.5983 36.0352 64.5379L34.9663 62.772C34.8152 62.5419 34.8279 62.2502 34.9585 62.1283C35.0891 62.0064 35.334 62.1376 35.4851 62.3677L36.554 64.1336C36.5871 64.194 36.6037 64.2242 36.6185 64.2961C36.6701 64.345 36.6867 64.3752 36.7199 64.4356L37.7888 66.2015L37.8053 66.2317ZM34.4143 60.6434C34.5471 60.885 34.5362 61.135 34.4056 61.2569C34.275 61.3787 34.0301 61.2476 33.879 61.0175L33.6947 60.727C33.562 60.4855 33.5563 60.2053 33.6869 60.0834C33.8175 59.9615 34.0624 60.0926 34.2135 60.3227L34.3978 60.6132C34.4144 60.6434 34.4143 60.6434 34.4143 60.6434ZM33.1796 58.5755C33.3123 58.8171 33.3014 59.0671 33.1708 59.189C33.0402 59.3109 32.7954 59.1798 32.6442 58.9496L31.6583 57.3347C31.5072 57.1046 31.5198 56.813 31.6504 56.6911C31.781 56.5692 32.0259 56.7003 32.177 56.9304L33.163 58.5454C33.1796 58.5756 33.1796 58.5755 33.1796 58.5755Z" fill="#876FF2" fill-opacity="0.5"/>
<path d="M4.80086 84.4598C4.75201 84.4092 4.69457 84.4087 4.67255 84.4586C4.65053 84.5086 4.67227 84.5902 4.72112 84.6408C4.76997 84.6914 4.82742 84.6919 4.84944 84.6419C4.87146 84.5919 4.84971 84.5104 4.80086 84.4598Z" fill="#876FF2" fill-opacity="0.5"/>
<path d="M5.14394 83.6876C5.05849 83.599 4.95799 83.5981 4.91947 83.6856C4.88095 83.773 4.91899 83.9157 5.00445 84.0042C5.0899 84.0928 5.19041 84.0937 5.22893 84.0062C5.26745 83.9188 5.2294 83.7761 5.14394 83.6876Z" fill="#876FF2" fill-opacity="0.5"/>
<path d="M5.49268 82.873C5.3584 82.7339 5.20046 82.7325 5.13992 82.8699C5.07938 83.0073 5.13918 83.2315 5.27346 83.3707C5.40775 83.5098 5.56568 83.5112 5.62621 83.3737C5.68675 83.2363 5.62697 83.0122 5.49268 82.873Z" fill="#876FF2" fill-opacity="0.5"/>
<path d="M5.86899 82.0578C5.69809 81.8807 5.49707 81.879 5.42002 82.0539C5.34298 82.2288 5.41907 82.5141 5.58997 82.6911C5.76088 82.8682 5.96187 82.8699 6.03892 82.6951C6.11597 82.5202 6.0399 82.2349 5.86899 82.0578Z" fill="#876FF2" fill-opacity="0.5"/>
<path d="M6.27454 81.1082C6.06701 80.8932 5.82294 80.8911 5.72938 81.1035C5.63583 81.3158 5.72823 81.6623 5.93576 81.8773C6.14329 82.0923 6.38736 82.0944 6.48092 81.8821C6.57447 81.6697 6.48207 81.3233 6.27454 81.1082Z" fill="#876FF2" fill-opacity="0.5"/>
<path d="M6.73265 80.0745C6.47629 79.8089 6.17478 79.8062 6.05921 80.0686C5.94364 80.3309 6.05777 80.7589 6.31413 81.0245C6.57049 81.2901 6.87201 81.2927 6.98758 81.0304C7.10315 80.768 6.98901 80.3401 6.73265 80.0745Z" fill="#876FF2" fill-opacity="0.5"/>
<path d="M8.58377 87.0817C8.52933 87.0627 8.48963 87.1033 8.4951 87.1724C8.50057 87.2415 8.54914 87.3129 8.60358 87.3319C8.65802 87.3508 8.69771 87.3102 8.69224 87.2411C8.68677 87.172 8.63821 87.1006 8.58377 87.0817Z" fill="#876FF2" fill-opacity="0.5"/>
<path d="M8.49746 85.9473C8.40244 85.9142 8.33315 85.9851 8.34269 86.1057C8.35224 86.2262 8.437 86.3508 8.53203 86.3839C8.62706 86.417 8.69636 86.3461 8.68682 86.2256C8.67727 86.105 8.59249 85.9804 8.49746 85.9473Z" fill="#876FF2" fill-opacity="0.5"/>
<path d="M8.37685 84.8261C8.22725 84.774 8.11815 84.8856 8.13318 85.0755C8.14821 85.2653 8.28168 85.4614 8.43128 85.5135C8.58088 85.5657 8.68996 85.454 8.67493 85.2642C8.6599 85.0744 8.52645 84.8783 8.37685 84.8261Z" fill="#876FF2" fill-opacity="0.5"/>
<path d="M8.27545 83.6935C8.08505 83.6272 7.9462 83.7692 7.96532 84.0108C7.98445 84.2524 8.15431 84.502 8.34471 84.5684C8.53511 84.6347 8.67395 84.4926 8.65482 84.251C8.63569 84.0095 8.46585 83.7598 8.27545 83.6935Z" fill="#876FF2" fill-opacity="0.5"/>
<path d="M8.175 82.3993C7.9438 82.3187 7.77522 82.4912 7.79845 82.7846C7.82167 83.0779 8.02791 83.381 8.25911 83.4616C8.49031 83.5421 8.65891 83.3696 8.63568 83.0763C8.61245 82.7829 8.4062 82.4798 8.175 82.3993Z" fill="#876FF2" fill-opacity="0.5"/>
<path d="M8.03716 80.9221C7.75156 80.8226 7.5433 81.0357 7.572 81.3981C7.60069 81.7605 7.85547 82.1349 8.14107 82.2344C8.42667 82.3339 8.63494 82.1208 8.60625 81.7584C8.57755 81.396 8.32276 81.0216 8.03716 80.9221Z" fill="#876FF2" fill-opacity="0.5"/>
<path d="M12.147 87.1432C12.1032 87.1611 12.0932 87.231 12.1247 87.2993C12.1563 87.3677 12.2175 87.4086 12.2614 87.3907C12.3052 87.3729 12.3152 87.303 12.2837 87.2346C12.2521 87.1663 12.1909 87.1254 12.147 87.1432Z" fill="#876FF2" fill-opacity="0.5"/>
<path d="M11.6189 86.0473C11.5421 86.0786 11.5246 86.2009 11.5799 86.3205C11.6351 86.4401 11.7422 86.5117 11.819 86.4804C11.8958 86.4492 11.9132 86.3269 11.858 86.2073C11.8027 86.0877 11.6957 86.0161 11.6189 86.0473Z" fill="#876FF2" fill-opacity="0.5"/>
<path d="M11.0901 84.8888C10.9694 84.9379 10.942 85.1301 11.0288 85.318C11.1157 85.506 11.2839 85.6185 11.4046 85.5694C11.5252 85.5203 11.5527 85.3281 11.4658 85.1402C11.379 84.9522 11.2108 84.8396 11.0901 84.8888Z" fill="#876FF2" fill-opacity="0.5"/>
<path d="M10.5785 83.7641C10.425 83.8266 10.39 84.0712 10.5006 84.3104C10.6111 84.5496 10.8252 84.6928 10.9787 84.6303C11.1323 84.5678 11.1672 84.3232 11.0567 84.084C10.9462 83.8448 10.7321 83.7015 10.5785 83.7641Z" fill="#876FF2" fill-opacity="0.5"/>
<path d="M9.95176 82.4039C9.76525 82.4797 9.72281 82.7767 9.85699 83.0672C9.99117 83.3577 10.2512 83.5317 10.4377 83.4558C10.6242 83.3799 10.6666 83.0829 10.5324 82.7924C10.3983 82.5019 10.1383 82.328 9.95176 82.4039Z" fill="#876FF2" fill-opacity="0.5"/>
<path d="M9.26575 80.9486C9.03537 81.0423 8.98298 81.4092 9.14876 81.768C9.31453 82.1269 9.63568 82.3417 9.86606 82.2479C10.0964 82.1541 10.1488 81.7873 9.98305 81.4284C9.81728 81.0696 9.49613 80.8548 9.26575 80.9486Z" fill="#876FF2" fill-opacity="0.5"/>
<path d="M14.6153 84.6922C14.5665 84.6416 14.509 84.6411 14.487 84.6911C14.465 84.741 14.4867 84.8226 14.5356 84.8732C14.5844 84.9238 14.6419 84.9243 14.6639 84.8743C14.6859 84.8243 14.6642 84.7428 14.6153 84.6922Z" fill="#876FF2" fill-opacity="0.5"/>
<path d="M13.9242 83.8595C13.8388 83.7709 13.7383 83.7701 13.6998 83.8575C13.6612 83.9449 13.6993 84.0876 13.7847 84.1761C13.8702 84.2647 13.9707 84.2655 14.0092 84.1781C14.0477 84.0907 14.0097 83.948 13.9242 83.8595Z" fill="#876FF2" fill-opacity="0.5"/>
<path d="M13.2505 83.0312C13.1162 82.8921 12.9583 82.8907 12.8978 83.0281C12.8372 83.1655 12.897 83.3897 13.0313 83.5289C13.1656 83.668 13.3235 83.6694 13.384 83.5319C13.4446 83.3945 13.3848 83.1703 13.2505 83.0312Z" fill="#876FF2" fill-opacity="0.5"/>
<path d="M12.5262 82.1686C12.3553 81.9916 12.1543 81.9898 12.0772 82.1647C12.0002 82.3396 12.0763 82.6249 12.2472 82.802C12.4181 82.979 12.6191 82.9808 12.6961 82.8059C12.7732 82.631 12.6971 82.3457 12.5262 82.1686Z" fill="#876FF2" fill-opacity="0.5"/>
<path d="M11.6749 81.1932C11.4674 80.9782 11.2233 80.976 11.1298 81.1884C11.0362 81.4008 11.1286 81.7472 11.3361 81.9623C11.5437 82.1773 11.7878 82.1794 11.8813 81.967C11.9749 81.7547 11.8825 81.4082 11.6749 81.1932Z" fill="#876FF2" fill-opacity="0.5"/>
<path d="M10.7356 80.0871C10.4792 79.8215 10.1777 79.8189 10.0621 80.0812C9.94657 80.3436 10.0607 80.7715 10.3171 81.0371C10.5734 81.3027 10.8749 81.3054 10.9905 81.0431C11.1061 80.7807 10.9919 80.3527 10.7356 80.0871Z" fill="#876FF2" fill-opacity="0.5"/>
<path d="M15.1316 80.2672C15.0772 80.2483 15.0375 80.2889 15.0429 80.358C15.0484 80.4271 15.097 80.4984 15.1514 80.5174C15.2059 80.5364 15.2456 80.4958 15.2401 80.4267C15.2346 80.3576 15.1861 80.2862 15.1316 80.2672Z" fill="#876FF2" fill-opacity="0.5"/>
<path d="M14.3227 79.8946C14.2276 79.8615 14.1583 79.9324 14.1679 80.0529C14.1774 80.1735 14.2622 80.2981 14.3572 80.3312C14.4523 80.3643 14.5216 80.2934 14.512 80.1728C14.5025 80.0523 14.4177 79.9277 14.3227 79.8946Z" fill="#876FF2" fill-opacity="0.5"/>
<path d="M13.5311 79.4677C13.3815 79.4156 13.2724 79.5273 13.2875 79.7171C13.3025 79.9069 13.436 80.103 13.5856 80.1551C13.7352 80.2073 13.8443 80.0956 13.8292 79.9058C13.8142 79.716 13.6807 79.5199 13.5311 79.4677Z" fill="#876FF2" fill-opacity="0.5"/>
<path d="M12.7051 79.0768C12.5147 79.0104 12.3759 79.1525 12.395 79.3941C12.4141 79.6357 12.584 79.8853 12.7744 79.9517C12.9648 80.018 13.1036 79.8759 13.0845 79.6343C13.0654 79.3927 12.8955 79.1431 12.7051 79.0768Z" fill="#876FF2" fill-opacity="0.5"/>
<path d="M11.7492 78.6155C11.518 78.535 11.3494 78.7075 11.3726 79.0009C11.3959 79.2942 11.6021 79.5973 11.8333 79.6779C12.0645 79.7584 12.2331 79.5859 12.2099 79.2926C12.1867 78.9992 11.9804 78.6961 11.7492 78.6155Z" fill="#876FF2" fill-opacity="0.5"/>
<path d="M10.6866 78.1101C10.401 78.0106 10.1927 78.2237 10.2214 78.5861C10.2501 78.9484 10.5049 79.3229 10.7905 79.4224C11.0761 79.5219 11.2844 79.3088 11.2557 78.9464C11.227 78.584 10.9722 78.2096 10.6866 78.1101Z" fill="#876FF2" fill-opacity="0.5"/>
<path d="M13.6334 75.1442C13.5895 75.162 13.5795 75.2319 13.6111 75.3003C13.6426 75.3686 13.7038 75.4096 13.7477 75.3917C13.7916 75.3739 13.8016 75.304 13.77 75.2356C13.7384 75.1672 13.6772 75.1263 13.6334 75.1442Z" fill="#876FF2" fill-opacity="0.5"/>
<path d="M12.9743 75.3217C12.8975 75.3529 12.8801 75.4752 12.9353 75.5949C12.9906 75.7145 13.0976 75.7861 13.1744 75.7548C13.2512 75.7236 13.2687 75.6013 13.2134 75.4817C13.1582 75.362 13.0511 75.2904 12.9743 75.3217Z" fill="#876FF2" fill-opacity="0.5"/>
<path d="M12.2649 75.4542C12.1442 75.5033 12.1168 75.6955 12.2036 75.8835C12.2905 76.0714 12.4587 76.184 12.5794 76.1348C12.7 76.0857 12.7275 75.8935 12.6406 75.7056C12.5538 75.5176 12.3856 75.4051 12.2649 75.4542Z" fill="#876FF2" fill-opacity="0.5"/>
<path d="M11.5541 75.6063C11.4005 75.6688 11.3656 75.9134 11.4761 76.1526C11.5866 76.3918 11.8007 76.5351 11.9543 76.4726C12.1079 76.4101 12.1428 76.1655 12.0323 75.9262C11.9218 75.687 11.7077 75.5438 11.5541 75.6063Z" fill="#876FF2" fill-opacity="0.5"/>
<path d="M10.7486 75.8117C10.5621 75.8876 10.5197 76.1846 10.6539 76.475C10.7881 76.7655 11.0481 76.9394 11.2346 76.8635C11.4211 76.7876 11.4635 76.4906 11.3293 76.2001C11.1951 75.9097 10.9351 75.7358 10.7486 75.8117Z" fill="#876FF2" fill-opacity="0.5"/>
<path d="M9.84098 76.0046C9.61058 76.0984 9.55818 76.4652 9.72393 76.824C9.88968 77.1829 10.2108 77.3978 10.4412 77.304C10.6716 77.2103 10.724 76.8434 10.5583 76.4846C10.3925 76.1258 10.0714 75.9109 9.84098 76.0046Z" fill="#876FF2" fill-opacity="0.5"/>
<path d="M10.7003 70.74C10.6514 70.6894 10.594 70.6889 10.5719 70.7389C10.5499 70.7889 10.5717 70.8704 10.6205 70.921C10.6694 70.9717 10.7268 70.9722 10.7489 70.9222C10.7709 70.8722 10.7491 70.7906 10.7003 70.74Z" fill="#876FF2" fill-opacity="0.5"/>
<path d="M10.4057 71.4029C10.3202 71.3144 10.2197 71.3135 10.1812 71.4009C10.1427 71.4884 10.1807 71.631 10.2662 71.7196C10.3516 71.8081 10.4521 71.809 10.4906 71.7216C10.5292 71.6341 10.4911 71.4914 10.4057 71.4029Z" fill="#876FF2" fill-opacity="0.5"/>
<path d="M10.1294 72.0391C9.99511 71.8999 9.83718 71.8986 9.77665 72.036C9.71611 72.1734 9.77589 72.3975 9.91017 72.5367C10.0445 72.6758 10.2024 72.6772 10.2629 72.5398C10.3235 72.4024 10.2637 72.1782 10.1294 72.0391Z" fill="#876FF2" fill-opacity="0.5"/>
<path d="M9.83089 72.6915C9.65998 72.5145 9.45897 72.5127 9.38192 72.6876C9.30487 72.8625 9.38097 73.1478 9.55188 73.3249C9.72279 73.502 9.92379 73.5037 10.0008 73.3288C10.0779 73.1539 10.0018 72.8686 9.83089 72.6915Z" fill="#876FF2" fill-opacity="0.5"/>
<path d="M9.48548 73.5077C9.27796 73.2926 9.03388 73.2905 8.94032 73.5029C8.84677 73.7152 8.93916 74.0617 9.14669 74.2767C9.35422 74.4917 9.5983 74.4939 9.69186 74.2815C9.78541 74.0691 9.69301 73.7227 9.48548 73.5077Z" fill="#876FF2" fill-opacity="0.5"/>
<path d="M9.09887 74.3826C8.84251 74.117 8.541 74.1143 8.42543 74.3767C8.30986 74.639 8.424 75.067 8.68036 75.3326C8.93672 75.5982 9.23822 75.6008 9.35379 75.3385C9.46936 75.0761 9.35523 74.6482 9.09887 74.3826Z" fill="#876FF2" fill-opacity="0.5"/>
<path d="M6.79863 68.0578C6.74419 68.0388 6.70449 68.0794 6.70995 68.1485C6.71542 68.2176 6.76397 68.2889 6.81841 68.3079C6.87285 68.3269 6.91256 68.2863 6.9071 68.2172C6.90163 68.1481 6.85307 68.0767 6.79863 68.0578Z" fill="#876FF2" fill-opacity="0.5"/>
<path d="M6.88619 68.9703C6.79116 68.9372 6.72186 69.008 6.73139 69.1286C6.74093 69.2491 6.82569 69.3737 6.92071 69.4068C7.01574 69.4399 7.08504 69.3691 7.07551 69.2485C7.06598 69.128 6.98121 69.0034 6.88619 68.9703Z" fill="#876FF2" fill-opacity="0.5"/>
<path d="M6.97158 69.8618C6.82198 69.8097 6.71288 69.9213 6.72791 70.1111C6.74294 70.3009 6.8764 70.4971 7.02601 70.5492C7.17561 70.6013 7.28469 70.4897 7.26966 70.2999C7.25463 70.11 7.12118 69.9139 6.97158 69.8618Z" fill="#876FF2" fill-opacity="0.5"/>
<path d="M7.05571 70.8083C6.86531 70.7419 6.72647 70.884 6.7456 71.1256C6.76473 71.3672 6.93458 71.6168 7.12497 71.6831C7.31537 71.7494 7.45422 71.6074 7.43509 71.3658C7.41596 71.1242 7.2461 70.8746 7.05571 70.8083Z" fill="#876FF2" fill-opacity="0.5"/>
<path d="M7.14374 71.908C6.91254 71.8275 6.74394 72 6.76716 72.2933C6.79039 72.5867 6.99665 72.8898 7.22785 72.9704C7.45905 73.0509 7.62765 72.8784 7.60443 72.585C7.5812 72.2917 7.37494 71.9886 7.14374 71.908Z" fill="#876FF2" fill-opacity="0.5"/>
<path d="M7.25983 73.1433C6.97422 73.0438 6.76595 73.2569 6.79464 73.6193C6.82334 73.9816 7.07813 74.3561 7.36374 74.4556C7.64934 74.5551 7.8576 74.342 7.8289 73.9796C7.80021 73.6172 7.54543 73.2428 7.25983 73.1433Z" fill="#876FF2" fill-opacity="0.5"/>
<path d="M3.16854 67.987C3.12465 68.0048 3.11466 68.0747 3.14623 68.1431C3.1778 68.2114 3.23897 68.2523 3.28285 68.2345C3.32674 68.2166 3.33671 68.1467 3.30515 68.0784C3.27358 68.01 3.21242 67.9691 3.16854 67.987Z" fill="#876FF2" fill-opacity="0.5"/>
<path d="M3.5837 68.9057C3.50691 68.937 3.48946 69.0593 3.54472 69.1789C3.59998 69.2985 3.70701 69.3701 3.78381 69.3388C3.8606 69.3076 3.87806 69.1853 3.8228 69.0657C3.76754 68.9461 3.6605 68.8745 3.5837 68.9057Z" fill="#876FF2" fill-opacity="0.5"/>
<path d="M4.01395 69.8067C3.89326 69.8558 3.8658 70.048 3.95263 70.2359C4.03945 70.4239 4.20767 70.5364 4.32836 70.4873C4.44904 70.4382 4.47649 70.2461 4.38967 70.0581C4.30285 69.8702 4.13463 69.7576 4.01395 69.8067Z" fill="#876FF2" fill-opacity="0.5"/>
<path d="M4.46038 70.7884C4.30679 70.851 4.27187 71.0956 4.38238 71.3348C4.4929 71.574 4.707 71.7172 4.86059 71.6547C5.01417 71.5922 5.04908 71.3476 4.93857 71.1084C4.82805 70.8692 4.61396 70.7259 4.46038 70.7884Z" fill="#876FF2" fill-opacity="0.5"/>
<path d="M4.97716 71.8892C4.79065 71.9651 4.74823 72.2621 4.88241 72.5526C5.01659 72.843 5.27655 73.017 5.46307 72.9411C5.64958 72.8652 5.69201 72.5682 5.55783 72.2778C5.42365 71.9873 5.16367 71.8133 4.97716 71.8892Z" fill="#876FF2" fill-opacity="0.5"/>
<path d="M5.55387 73.1169C5.32347 73.2106 5.27105 73.5775 5.43681 73.9363C5.60256 74.2952 5.92371 74.5101 6.15412 74.4163C6.38452 74.3226 6.43692 73.9557 6.27117 73.5969C6.10541 73.238 5.78427 73.0231 5.55387 73.1169Z" fill="#876FF2" fill-opacity="0.5"/>
<path d="M0.87705 70.5116C0.828201 70.461 0.770745 70.4604 0.748723 70.5104C0.7267 70.5604 0.748454 70.642 0.797302 70.6926C0.846151 70.7432 0.903594 70.7437 0.925616 70.6937C0.947638 70.6437 0.925898 70.5622 0.87705 70.5116Z" fill="#876FF2" fill-opacity="0.5"/>
<path d="M1.61465 71.1851C1.5292 71.0966 1.42869 71.0957 1.39017 71.1832C1.35165 71.2706 1.38969 71.4133 1.47515 71.5018C1.5606 71.5903 1.66111 71.5912 1.69964 71.5038C1.73816 71.4163 1.70011 71.2737 1.61465 71.1851Z" fill="#876FF2" fill-opacity="0.5"/>
<path d="M2.39209 71.854C2.25781 71.7148 2.09988 71.7135 2.03935 71.8509C1.97881 71.9883 2.03859 72.2125 2.17287 72.3516C2.30715 72.4907 2.46509 72.4921 2.52563 72.3547C2.58616 72.2173 2.52637 71.9931 2.39209 71.854Z" fill="#876FF2" fill-opacity="0.5"/>
<path d="M3.16977 72.5822C2.99886 72.4051 2.79785 72.4034 2.7208 72.5783C2.64375 72.7532 2.71984 73.0385 2.89075 73.2155C3.06166 73.3926 3.26265 73.3944 3.3397 73.2195C3.41675 73.0446 3.34068 72.7593 3.16977 72.5822Z" fill="#876FF2" fill-opacity="0.5"/>
<path d="M4.08315 73.4217C3.87562 73.2067 3.63154 73.2046 3.53798 73.417C3.44443 73.6293 3.53683 73.9758 3.74435 74.1908C3.95188 74.4058 4.19596 74.4079 4.28951 74.1956C4.38307 73.9832 4.29068 73.6367 4.08315 73.4217Z" fill="#876FF2" fill-opacity="0.5"/>
<path d="M5.09692 74.3499C4.84056 74.0843 4.53906 74.0816 4.42349 74.344C4.30792 74.6063 4.42204 75.0343 4.6784 75.2999C4.93476 75.5655 5.23627 75.5681 5.35184 75.3058C5.46741 75.0434 5.35328 74.6155 5.09692 74.3499Z" fill="#876FF2" fill-opacity="0.5"/>
<path d="M0.250746 74.8561C0.196305 74.8371 0.156617 74.8778 0.162088 74.9469C0.16756 75.0159 0.21612 75.0873 0.270561 75.1063C0.325002 75.1252 0.364705 75.0846 0.359233 75.0155C0.353761 74.9465 0.305187 74.8751 0.250746 74.8561Z" fill="#876FF2" fill-opacity="0.5"/>
<path d="M1.06003 75.0631C0.965 75.0299 0.895691 75.1008 0.905222 75.2213C0.914754 75.3419 0.999516 75.4665 1.09454 75.4996C1.18957 75.5327 1.25887 75.4618 1.24934 75.3413C1.23981 75.2208 1.15505 75.0962 1.06003 75.0631Z" fill="#876FF2" fill-opacity="0.5"/>
<path d="M1.81923 75.2153C1.66963 75.1632 1.56053 75.2748 1.57556 75.4646C1.59059 75.6545 1.72406 75.8506 1.87366 75.9027C2.02326 75.9548 2.13235 75.8432 2.11732 75.6534C2.10229 75.4636 1.96884 75.2674 1.81923 75.2153Z" fill="#876FF2" fill-opacity="0.5"/>
<path d="M2.62603 75.4254C2.43564 75.3591 2.29679 75.5012 2.31592 75.7428C2.33504 75.9843 2.5049 76.234 2.6953 76.3003C2.8857 76.3666 3.02453 76.2246 3.0054 75.983C2.98628 75.7414 2.81643 75.4918 2.62603 75.4254Z" fill="#876FF2" fill-opacity="0.5"/>
<path d="M3.56366 75.7039C3.33246 75.6234 3.16386 75.7959 3.18709 76.0892C3.21032 76.3826 3.41658 76.6857 3.64778 76.7663C3.87898 76.8468 4.04758 76.6743 4.02435 76.3809C4.00112 76.0876 3.79486 75.7845 3.56366 75.7039Z" fill="#876FF2" fill-opacity="0.5"/>
<path d="M4.60845 75.9587C4.32285 75.8592 4.11459 76.0723 4.14328 76.4347C4.17197 76.7971 4.42675 77.1715 4.71235 77.271C4.99796 77.3705 5.20623 77.1574 5.17754 76.795C5.14885 76.4326 4.89406 76.0582 4.60845 75.9587Z" fill="#876FF2" fill-opacity="0.5"/>
<path d="M1.65581 79.9894C1.61193 80.0073 1.60197 80.0772 1.63355 80.1456C1.66513 80.2139 1.72628 80.2548 1.77016 80.237C1.81404 80.2191 1.82401 80.1492 1.79244 80.0808C1.76086 80.0125 1.69969 79.9716 1.65581 79.9894Z" fill="#876FF2" fill-opacity="0.5"/>
<path d="M2.26046 79.6459C2.18366 79.6771 2.16619 79.7994 2.22144 79.919C2.2767 80.0386 2.38375 80.1103 2.46055 80.079C2.53735 80.0478 2.55482 79.9255 2.49956 79.8059C2.44431 79.6863 2.33726 79.6146 2.26046 79.6459Z" fill="#876FF2" fill-opacity="0.5"/>
<path d="M2.84302 79.255C2.72235 79.3041 2.69491 79.4963 2.78174 79.6842C2.86858 79.8722 3.0368 79.9847 3.15748 79.9356C3.27815 79.8865 3.30559 79.6943 3.21875 79.5064C3.13191 79.3184 2.9637 79.2059 2.84302 79.255Z" fill="#876FF2" fill-opacity="0.5"/>
<path d="M3.44674 78.9056C3.29314 78.9681 3.25819 79.2127 3.36869 79.4519C3.47919 79.6911 3.69329 79.8343 3.84689 79.7718C4.00049 79.7094 4.03542 79.4648 3.92493 79.2256C3.81443 78.9864 3.60034 78.8431 3.44674 78.9056Z" fill="#876FF2" fill-opacity="0.5"/>
<path d="M4.19 78.525C4.0035 78.6009 3.9611 78.898 4.0953 79.1884C4.2295 79.4789 4.48948 79.6528 4.67598 79.5769C4.86248 79.501 4.90488 79.204 4.77068 78.9135C4.63648 78.623 4.3765 78.4491 4.19 78.525Z" fill="#876FF2" fill-opacity="0.5"/>
<path d="M4.9738 78.0393C4.74339 78.133 4.69098 78.4999 4.85673 78.8587C5.02248 79.2175 5.34363 79.4324 5.57403 79.3387C5.80444 79.2449 5.85685 78.8781 5.6911 78.5193C5.52534 78.1604 5.2042 77.9455 4.9738 78.0393Z" fill="#876FF2" fill-opacity="0.5"/>
<path d="M7.5556 74.7283C7.55744 74.6869 7.54111 74.657 7.5066 74.6385L7.47209 74.6199C7.43758 74.6014 7.40122 74.6242 7.41572 74.6955L7.43205 74.7254C7.08325 74.6227 6.73079 74.6028 6.42547 74.714L6.40914 74.684C6.3928 74.6541 6.3928 74.6541 6.37647 74.6241C6.36013 74.5942 6.32562 74.5757 6.28926 74.5985C6.25291 74.6213 6.25107 74.6626 6.28374 74.7225L6.30008 74.7524C6.02928 74.8822 5.78929 75.1131 5.63282 75.4524L5.61649 75.4225C5.56565 75.374 5.52929 75.3968 5.51112 75.4082C5.4911 75.461 5.52377 75.5208 5.54011 75.5508L5.55644 75.5807C5.41631 75.95 5.36337 76.3449 5.3958 76.8068L5.3613 76.7883C5.32679 76.7698 5.29042 76.7926 5.30492 76.8638C5.30308 76.9052 5.33575 76.9651 5.38844 76.9722L5.42294 76.9907C5.47355 77.4413 5.59318 77.9289 5.80184 78.4008L5.78366 78.4122C5.74731 78.435 5.74547 78.4764 5.77814 78.5362C5.8108 78.5961 5.84531 78.6147 5.88166 78.5918L5.89984 78.5804C6.11035 79.011 6.39172 79.4373 6.72946 79.7881L6.71128 79.7995C6.69126 79.8522 6.72393 79.9121 6.74027 79.942C6.79111 79.9905 6.82747 79.9677 6.84565 79.9563L6.86382 79.9449C7.21974 80.2843 7.563 80.5109 7.90995 80.655L7.90811 80.6963C7.90627 80.7377 7.93894 80.7975 7.99162 80.8047C8.02613 80.8232 8.06249 80.8004 8.048 80.7291L8.04984 80.6878C8.39864 80.7905 8.75111 80.8104 9.05643 80.6992L9.07276 80.7292C9.10542 80.7891 9.13994 80.8076 9.17629 80.7848C9.21265 80.762 9.21448 80.7206 9.18182 80.6607L9.16549 80.6308C9.43629 80.5011 9.67626 80.2701 9.83273 79.9308L9.84907 79.9608C9.89991 80.0093 9.93626 79.9864 9.95443 79.975C9.97445 79.9223 9.94179 79.8624 9.92546 79.8325L9.90911 79.8025C10.0492 79.4333 10.1022 79.0384 10.0861 78.6064L10.1206 78.6249C10.1551 78.6434 10.1915 78.6206 10.177 78.5494C10.1788 78.508 10.1625 78.4781 10.128 78.4595L10.0935 78.441L10.0753 78.4524C10.0247 78.0019 9.90506 77.5143 9.69639 77.0423L9.71457 77.0309C9.75092 77.0081 9.75275 76.9668 9.72008 76.9069C9.70375 76.877 9.70376 76.877 9.68742 76.847C9.67109 76.8171 9.63658 76.7985 9.60023 76.8214L9.58205 76.8328C9.37154 76.4022 9.09018 75.9759 8.75244 75.6251L8.77061 75.6137C8.79063 75.561 8.75796 75.5011 8.74162 75.4711C8.69078 75.4227 8.65442 75.4455 8.63625 75.4569L8.61807 75.4683C8.28033 75.1175 7.90255 74.8723 7.5556 74.7283ZM9.64937 79.6842C9.15996 80.7549 7.90627 80.7377 6.82403 79.6484C5.75996 78.5477 5.29043 76.7926 5.76351 75.692C6.25291 74.6213 7.5066 74.6385 8.58885 75.7278C9.65291 76.8285 10.1388 78.6135 9.64937 79.6842Z" fill="#876FF2" fill-opacity="0.5"/>
</svg>
