<svg width="47" height="21" viewBox="0 0 47 21" fill="none" xmlns="http://www.w3.org/2000/svg">
<path d="M23.3271 12.6074H24.4862C25.0779 12.6074 25.4952 12.9105 25.4952 13.4462C25.4952 13.7492 25.3489 14.0098 25.1002 14.1427V14.152C25.458 14.257 25.628 14.588 25.628 14.9177C25.628 15.569 25.1056 15.8614 24.505 15.8614H23.3271V12.6074ZM24.4902 13.9367C24.7469 13.9367 24.8932 13.7533 24.8932 13.5193C24.8932 13.2854 24.751 13.1165 24.4808 13.1165H23.9173V13.9367H24.4902ZM24.5501 15.3536C24.8529 15.3536 25.022 15.1569 25.022 14.8817C25.022 14.6119 24.848 14.4139 24.5501 14.4139H23.9173V15.3536H24.5501ZM27.2497 13.4701C27.5659 13.4701 27.9237 13.5751 28.1482 13.8184L27.8866 14.2171C27.7403 14.0709 27.5104 13.9646 27.2815 13.9646C26.8508 13.9646 26.5703 14.2903 26.5703 14.689C26.5703 15.0838 26.8494 15.4228 27.2989 15.4228C27.5462 15.4228 27.8119 15.2938 27.9863 15.125L28.2108 15.5371C27.9903 15.771 27.6245 15.9172 27.2484 15.9172C26.4733 15.9172 25.9791 15.3722 25.9791 14.693C25.9804 14.0284 26.476 13.4701 27.2497 13.4701ZM29.6156 13.4701C30.2842 13.4701 30.6514 13.9606 30.6514 14.5787C30.6514 14.6518 30.642 14.7302 30.6326 14.8033H29.0244C29.0615 15.2114 29.3723 15.4228 29.7261 15.4228C29.964 15.4228 30.2073 15.3178 30.3947 15.1662L30.6233 15.5836C30.3853 15.7949 30.0186 15.9185 29.6836 15.9185C28.9085 15.9185 28.4233 15.359 28.4233 14.6943C28.4246 13.9739 28.9152 13.4701 29.6156 13.4701ZM28.947 12.6074H29.3965V13.1391H28.947V12.6074ZM30.0705 14.4046C30.0664 14.0922 29.8643 13.9101 29.6026 13.9101C29.3048 13.9101 29.0932 14.1068 29.0387 14.4046H30.0705ZM29.79 12.6074H30.235V13.1391H29.79V12.6074ZM32.2848 13.5246H34.4168V15.8627H33.8349V14.0204H32.8671V15.8627H32.2848V13.5246ZM35.0362 13.5246H35.568V13.6987C35.568 13.7865 35.5586 13.8635 35.5586 13.8635H35.568C35.7196 13.611 36.004 13.4688 36.3202 13.4688C36.9531 13.4688 37.3561 13.9686 37.3561 14.693C37.3561 15.4361 36.9026 15.9172 36.2871 15.9172C36.0215 15.9172 35.7782 15.7976 35.6131 15.5876H35.6038C35.6038 15.5876 35.6172 15.67 35.6172 15.7896V16.7799H35.0349V13.5246H35.0362ZM36.182 15.4268C36.5027 15.4268 36.7684 15.1649 36.7684 14.7023C36.7684 14.2583 36.5304 13.9686 36.1901 13.9686C35.8833 13.9686 35.5988 14.1892 35.5988 14.7063C35.6002 15.0692 35.8019 15.4268 36.182 15.4268ZM38.9791 13.4701C39.6942 13.4701 40.2667 13.9792 40.2667 14.6943C40.2667 15.4135 39.6942 15.9185 38.9827 15.9185C38.2716 15.9185 37.6986 15.4148 37.6986 14.6943C37.7 13.9779 38.2729 13.4701 38.9791 13.4701ZM38.9827 15.4228C39.3628 15.4228 39.6795 15.129 39.6795 14.6943C39.6795 14.2637 39.3628 13.9659 38.9827 13.9659C38.6025 13.9659 38.2903 14.2637 38.2903 14.6943C38.2917 15.129 38.6025 15.4228 38.9827 15.4228ZM40.735 13.5246H41.2891V15.3669H42.0177V13.5246H42.5718V15.3669H43.3004V13.5246H43.8545V15.3669H44.1841V16.4117H43.6617V15.8614H40.7323V13.5246H40.735ZM45.6292 13.4701C46.2978 13.4701 46.6645 13.9606 46.6645 14.5787C46.6645 14.6518 46.6551 14.7302 46.6457 14.8033H45.0375C45.0746 15.2114 45.3859 15.4228 45.7392 15.4228C45.9771 15.4228 46.2204 15.3178 46.4078 15.1662L46.6368 15.5836C46.3989 15.7949 46.0317 15.9185 45.6967 15.9185C44.9221 15.9185 44.4368 15.359 44.4368 14.6943C44.4368 13.9739 44.9274 13.4701 45.6292 13.4701ZM46.0822 14.4046C46.0782 14.0922 45.8765 13.9101 45.6144 13.9101C45.3165 13.9101 45.1054 14.1068 45.0509 14.4046H46.0822Z" fill="#CCCCCC"/>
<path d="M33.3359 3.27541V9.99206C33.3359 10.0931 33.2549 10.1741 33.1539 10.1741H31.7822C31.6811 10.1741 31.6001 10.0931 31.6001 9.99206V3.27541C31.6001 3.17442 31.6811 3.09333 31.7822 3.09333H33.1539C33.2549 3.09333 33.3359 3.17442 33.3359 3.27541ZM44.0268 3.09333H42.4918C42.4118 3.09333 42.3402 3.14517 42.3174 3.22093L41.1027 7.19004L39.7681 3.21695C39.7426 3.14249 39.6738 3.09333 39.5955 3.09333H38.5239C38.4456 3.09333 38.375 3.14383 38.3513 3.21695L37.0167 7.19004L35.8015 3.22093C35.7778 3.14517 35.7072 3.09333 35.6276 3.09333H34.0922C34.0336 3.09333 33.9781 3.12124 33.9446 3.1691C33.9101 3.21561 33.9008 3.27675 33.9195 3.33256L36.1736 10.0519C36.1991 10.1263 36.268 10.1755 36.3467 10.1755H37.5655C37.6442 10.1755 37.7144 10.125 37.7385 10.0519L39.061 6.12663L40.3835 10.0519C40.4086 10.1263 40.4779 10.1755 40.5562 10.1755H41.7754C41.8536 10.1755 41.9243 10.125 41.948 10.0519L44.2026 3.33256C44.2209 3.27809 44.2119 3.21695 44.1771 3.1691C44.1413 3.12124 44.0854 3.09333 44.0268 3.09333ZM46.3359 3.09333H44.9642C44.8631 3.09333 44.7822 3.17442 44.7822 3.27541V9.99206C44.7822 10.0931 44.8631 10.1741 44.9642 10.1741H46.3359C46.437 10.1741 46.5179 10.0931 46.5179 9.99206V3.27541C46.5179 3.17442 46.437 3.09333 46.3359 3.09333ZM30.8049 9.94421C30.885 10.0333 30.8197 10.1755 30.6989 10.1755H29.0173C28.9493 10.1755 28.8845 10.1449 28.8406 10.0918L28.5562 9.74881C27.9752 10.125 27.2838 10.3443 26.5423 10.3443C24.4952 10.3443 22.831 8.67878 22.831 6.63309C22.831 4.5874 24.4966 2.92184 26.5423 2.92184C28.5893 2.92184 30.2535 4.5874 30.2535 6.63309C30.2535 7.37081 30.0366 8.058 29.6631 8.63624L30.8049 9.94421ZM27.4725 8.44746L26.7364 7.56219C26.659 7.46916 26.7256 7.32828 26.8455 7.32828H28.3858C28.4591 7.11025 28.5003 6.87634 28.5003 6.63438C28.5003 5.5245 27.6747 4.56879 26.5409 4.56879C25.4072 4.56879 24.5815 5.5258 24.5815 6.63438C24.5815 7.74297 25.4072 8.68674 26.5409 8.68674C26.8866 8.68674 27.2002 8.59899 27.4725 8.44746ZM17.316 14.0874C17.3758 14.4889 17.2495 14.655 17.1219 14.655C16.9837 14.655 16.8082 14.4929 16.6035 14.1711C16.4001 13.8548 16.327 13.4919 16.4267 13.3072C16.4932 13.1862 16.6328 13.1331 16.8082 13.1995C17.1472 13.3285 17.2801 13.8481 17.316 14.0874ZM15.4378 14.9621C15.8445 15.3063 15.9681 15.7157 15.7528 16.0042C15.6332 16.1624 15.4391 16.2501 15.2065 16.2501C14.9778 16.2501 14.7452 16.165 14.5844 16.0241C14.2149 15.7011 14.1059 15.1761 14.3478 14.8783C14.4422 14.7613 14.595 14.6976 14.7798 14.6976C15.0031 14.6976 15.2371 14.7919 15.4378 14.9621ZM14.7572 18.2838C16.5105 18.2838 18.4126 18.8846 20.5181 20.7509C20.7294 20.9383 21.0099 20.7057 20.8265 20.4731C18.7569 17.8598 16.8428 17.3627 14.934 16.9426C12.5998 16.4282 11.3982 15.1149 10.5608 13.6714C10.3947 13.3843 10.3202 13.4348 10.3043 13.8043C10.2857 14.2549 10.3176 14.8531 10.4186 15.4393C10.3242 15.4432 10.2298 15.4419 10.1341 15.4419C6.79374 15.4419 4.08613 12.7342 4.08613 9.39387C4.08613 6.0535 6.79374 3.34589 10.1341 3.34589C13.4745 3.34589 16.1821 6.0535 16.1821 9.39387C16.1821 9.63181 16.1702 9.8671 16.1436 10.0971C15.7023 10.0173 14.833 10.008 14.2229 10.0612C13.9929 10.0811 14.0261 10.1875 14.1989 10.2194C16.1981 10.5809 17.5712 11.8198 17.8862 14.0675C17.8929 14.1193 17.9606 14.1353 17.9873 14.0901C18.81 12.717 19.2819 11.1112 19.2819 9.39387C19.2846 4.3428 15.1879 0.246094 10.1355 0.246094C5.08303 0.246094 0.986328 4.3428 0.986328 9.39522C0.986328 14.4476 5.08303 18.5443 10.1355 18.5443C11.4753 18.5443 12.8059 18.2838 14.7572 18.2838Z" fill="#FF8C00"/>
</svg>
