<svg width="16" height="16" viewBox="0 0 16 16" fill="none" xmlns="http://www.w3.org/2000/svg">
<path fill-rule="evenodd" clip-rule="evenodd" d="M4.00008 4.66667L8.00008 8.66667L12.0001 4.66667L13.3334 6.00001L8.00008 11.3333L2.66675 6.00001L4.00008 4.66667Z" fill="#ca1dff"/>
</svg>
