<svg width="42" height="42" viewBox="0 0 42 42" fill="none" xmlns="http://www.w3.org/2000/svg">
<path d="M9.36298 3.75648C12.7047 1.52364 16.6334 0.331845 20.6524 0.331808C26.04 0.337929 31.2052 2.48085 35.0148 6.29045C38.8244 10.1001 40.9673 15.2653 40.9734 20.653C40.9733 24.6719 39.7815 28.6006 37.5487 31.9422C35.3158 35.284 32.1422 37.8885 28.429 39.4266C24.7159 40.9646 20.6301 41.367 16.6882 40.5829C12.7464 39.7988 9.12555 37.8635 6.28364 35.0216C3.44173 32.1797 1.50636 28.5588 0.722275 24.617C-0.0618069 20.6751 0.340613 16.5893 1.87865 12.8762C3.41668 9.16303 6.02124 5.98936 9.36298 3.75648Z" stroke="url(#paint0_linear_162:3704)" stroke-width="0.663615"/>
<path d="M31.977 21.6503H34.2558C34.0443 24.5725 32.893 27.3484 30.9742 29.5625L28.0192 26.6075L27.7845 26.3728L27.5499 26.6075L26.6079 27.5495L26.3734 27.784L26.6078 28.0186L29.5617 30.975C27.3474 32.8936 24.5716 34.0448 21.6494 34.2566V31.9779V31.6461H21.3176H19.9852H19.6534V31.9779V34.2566C16.7312 34.0449 13.9555 32.8936 11.7412 30.9751L14.6962 28.0201L14.9309 27.7854L14.6962 27.5508L13.7542 26.6088L13.5197 26.3743L13.2851 26.6087L10.3287 29.5626C8.40982 27.3485 7.25852 24.5726 7.04702 21.6503H9.32577H9.65758V21.3185V19.9861V19.6543H9.32577H7.04702C7.25851 16.7321 8.40978 13.9562 10.3286 11.7421L13.2836 14.6971L13.5183 14.9318L13.7529 14.6971L14.6949 13.7551L14.9294 13.5206L14.695 13.286L11.7411 10.3296C13.9554 8.411 16.7312 7.25974 19.6534 7.04795V9.32668V9.65848H19.9852H21.3176H21.6494V9.32668V7.04795C24.5716 7.25973 27.3473 8.41096 29.5616 10.3295L26.6066 13.2845L26.3719 13.5192L26.6066 13.7538L27.5486 14.6958L27.7831 14.9303L28.0177 14.6959L30.9741 11.742C32.893 13.9561 34.0443 16.732 34.2558 19.6543H31.977H31.6452V19.9861V21.3185V21.6503H31.977Z" stroke="url(#paint1_linear_162:3704)" stroke-width="0.663615"/>
<path d="M21.6524 3.33047C21.6524 3.8831 21.2044 4.33109 20.6518 4.33109C20.0991 4.33109 19.6511 3.8831 19.6511 3.33047C19.6511 2.77785 20.0991 2.32985 20.6518 2.32985C21.2044 2.32985 21.6524 2.77785 21.6524 3.33047Z" stroke="url(#paint2_linear_162:3704)" stroke-width="0.663615"/>
<path d="M21.6524 37.9735C21.6524 38.5262 21.2044 38.9742 20.6518 38.9742C20.0991 38.9742 19.6511 38.5262 19.6511 37.9735C19.6511 37.4209 20.0991 36.9729 20.6518 36.9729C21.2044 36.9729 21.6524 37.4209 21.6524 37.9735Z" stroke="url(#paint3_linear_162:3704)" stroke-width="0.663615"/>
<path d="M32.8997 9.40384L32.8992 9.40385C32.768 9.40407 32.638 9.37836 32.5168 9.32819L32.3899 9.6348L32.5168 9.32819C32.3955 9.27802 32.2853 9.20438 32.1926 9.11151L32.1923 9.11116C32.0285 8.94755 31.9265 8.73221 31.9037 8.50182C31.8809 8.27144 31.9387 8.04028 32.0672 7.84772C32.1957 7.65516 32.387 7.51313 32.6085 7.44583C32.8301 7.37852 33.068 7.39011 33.282 7.47861C33.4959 7.56712 33.6725 7.72707 33.7817 7.9312C33.8909 8.13533 33.926 8.37101 33.8809 8.59809C33.8358 8.82517 33.7134 9.02959 33.5345 9.17651C33.3556 9.32344 33.1312 9.40378 32.8997 9.40384Z" stroke="url(#paint4_linear_162:3704)" stroke-width="0.663615"/>
<path d="M7.42113 32.706C7.45976 32.5118 7.55509 32.3336 7.69506 32.1936C7.8827 32.006 8.13717 31.9007 8.40249 31.9007C8.66782 31.9007 8.92229 32.006 9.10993 32.1936C9.2499 32.3336 9.34523 32.5118 9.38386 32.706C9.4225 32.9001 9.4027 33.1013 9.32697 33.2841C9.25125 33.467 9.123 33.6233 8.95844 33.7332C8.79388 33.8432 8.60041 33.9019 8.40249 33.9019C8.20458 33.9019 8.01111 33.8432 7.84655 33.7332C7.68199 33.6233 7.55374 33.467 7.47802 33.2841C7.40229 33.1013 7.38249 32.9001 7.42113 32.706Z" stroke="url(#paint5_linear_162:3704)" stroke-width="0.663615"/>
<path d="M31.9184 32.706C31.9571 32.5118 32.0524 32.3336 32.1924 32.1936C32.38 32.006 32.6345 31.9007 32.8998 31.9007C33.1651 31.9007 33.4196 32.006 33.6072 32.1936C33.7472 32.3336 33.8425 32.5118 33.8812 32.706C33.9198 32.9001 33.9 33.1013 33.8243 33.2841C33.7486 33.467 33.6203 33.6233 33.4558 33.7332C33.2912 33.8432 33.0977 33.9019 32.8998 33.9019C32.7019 33.9019 32.5084 33.8432 32.3439 33.7332C32.1793 33.6233 32.0511 33.467 31.9753 33.2841C31.8996 33.1013 31.8798 32.9001 31.9184 32.706Z" stroke="url(#paint6_linear_162:3704)" stroke-width="0.663615"/>
<path d="M8.40327 9.40384L8.40272 9.40385C8.2715 9.4041 8.14153 9.37841 8.02029 9.32825C7.89904 9.27808 7.78891 9.20444 7.69623 9.11155L7.69583 9.11116C7.53204 8.94755 7.43005 8.73221 7.40724 8.50182C7.38442 8.27144 7.4422 8.04028 7.57073 7.84772C7.69926 7.65516 7.89057 7.51313 8.11208 7.44583C8.3336 7.37852 8.57159 7.39011 8.78551 7.47861C8.99944 7.56712 9.17606 7.72707 9.28527 7.9312C9.39448 8.13533 9.42953 8.37101 9.38444 8.59809C9.33936 8.82517 9.21693 9.02959 9.03802 9.17651C8.85911 9.32344 8.63478 9.40378 8.40327 9.40384Z" stroke="url(#paint7_linear_162:3704)" stroke-width="0.663615"/>
<path d="M14.2743 35.6758L14.275 35.6761C14.3958 35.7271 14.5053 35.8016 14.5972 35.8952C14.6891 35.9888 14.7615 36.0997 14.8103 36.2214L14.8106 36.2221C14.8973 36.4368 14.9068 36.6749 14.8376 36.8958C14.7683 37.1167 14.6246 37.3068 14.431 37.4336C14.2373 37.5605 14.0057 37.6163 13.7755 37.5914C13.5453 37.5666 13.3308 37.4628 13.1687 37.2976C13.0065 37.1324 12.9066 36.916 12.8861 36.6854C12.8655 36.4548 12.9255 36.2242 13.0559 36.033C13.1864 35.8417 13.3791 35.7015 13.6012 35.6364C13.8234 35.5713 14.0612 35.5852 14.2743 35.6758Z" stroke="url(#paint8_linear_162:3704)" stroke-width="0.663615"/>
<path d="M27.3073 5.61587C27.0851 5.681 26.8473 5.66709 26.6342 5.57649C26.3901 5.47268 26.1972 5.27616 26.0979 5.03015C26.0112 4.81547 26.0017 4.57738 26.0709 4.35646C26.1402 4.13555 26.2839 3.94547 26.4775 3.81862C26.6712 3.69177 26.9029 3.636 27.133 3.66082C27.3632 3.68563 27.5777 3.78949 27.7398 3.9547C27.902 4.1199 28.0019 4.33624 28.0225 4.56683C28.043 4.79743 27.983 5.02802 27.8526 5.2193C27.7222 5.41059 27.5295 5.55074 27.3073 5.61587Z" stroke="url(#paint9_linear_162:3704)" stroke-width="0.663615"/>
<path d="M14.5379 5.51923L14.5379 5.51922L14.5361 5.51997C14.4151 5.56974 14.2853 5.59477 14.1544 5.59358C14.0243 5.59239 13.8958 5.56531 13.7763 5.51394C13.5387 5.40634 13.3525 5.2102 13.2574 4.96726C13.162 4.72359 13.1658 4.45224 13.2681 4.21136C13.3704 3.97049 13.5629 3.77927 13.8045 3.67869C14.045 3.57856 14.315 3.57619 14.5572 3.67198C14.7379 3.74948 14.8918 3.87852 14.9996 4.04301C15.1081 4.20848 15.1651 4.4024 15.1634 4.60026C15.1616 4.79811 15.1013 4.99101 14.99 5.15458L15.2643 5.34128L14.99 5.15458C14.8787 5.31816 14.7213 5.44505 14.5379 5.51923Z" stroke="url(#paint10_linear_162:3704)" stroke-width="0.663615"/>
<path d="M27.5292 35.7917L27.5292 35.7917L27.5311 35.7925C27.7435 35.8826 27.9183 36.0435 28.0257 36.2478C28.1331 36.4521 28.1666 36.6872 28.1205 36.9134C28.0744 37.1396 27.9515 37.3428 27.7727 37.4888C27.5939 37.6347 27.3701 37.7143 27.1393 37.7141L27.139 37.7141C26.9067 37.7142 26.6816 37.6334 26.5023 37.4856C26.323 37.3378 26.2008 37.1322 26.1565 36.9041C26.1123 36.676 26.1488 36.4397 26.2597 36.2356C26.3707 36.0314 26.5493 35.8723 26.7648 35.7855L26.7648 35.7855L26.7666 35.7847C26.8878 35.735 27.0177 35.71 27.1486 35.7112C27.2796 35.7124 27.409 35.7398 27.5292 35.7917Z" stroke="url(#paint11_linear_162:3704)" stroke-width="0.663615"/>
<path d="M24.0385 16.3209L23.9419 16.1598L20.944 11.1634C20.9114 11.1183 20.8689 11.0814 20.8196 11.0554C20.7677 11.0282 20.7101 11.0139 20.6515 11.0139C20.5929 11.0139 20.5352 11.0282 20.4834 11.0554C20.4341 11.0814 20.3915 11.1183 20.3589 11.1634L17.3611 16.1598L17.2645 16.3209H17.0766H12.657C12.657 16.3209 12.657 16.3209 12.6569 16.3209C12.5978 16.3209 12.5397 16.3366 12.4886 16.3664C12.4374 16.3962 12.3951 16.4391 12.366 16.4906C12.3369 16.5421 12.3219 16.6005 12.3227 16.6596C12.3235 16.7188 12.3399 16.7767 12.3704 16.8275L12.3705 16.8276L14.563 20.4818L14.6654 20.6525L14.563 20.8233L12.3705 24.4774L12.3704 24.4776C12.3399 24.5283 12.3235 24.5863 12.3227 24.6454C12.3219 24.7046 12.3369 24.7629 12.366 24.8145C12.3951 24.866 12.4374 24.9088 12.4886 24.9387C12.5397 24.9685 12.5978 24.9842 12.6569 24.9842C12.657 24.9842 12.657 24.9842 12.657 24.9842H17.0766H17.2645L17.3611 25.1453L20.3649 30.1516C20.3649 30.1517 20.365 30.1518 20.365 30.1518C20.3947 30.2012 20.4367 30.242 20.4869 30.2704C20.5371 30.2988 20.5938 30.3137 20.6515 30.3137C20.7092 30.3137 20.7659 30.2988 20.8161 30.2704C20.8663 30.242 20.9082 30.2012 20.9379 30.1518C20.938 30.1518 20.938 30.1517 20.9381 30.1516L23.9419 25.1453L24.0385 24.9842H24.2264H28.646C28.646 24.9842 28.646 24.9842 28.646 24.9842C28.7052 24.9842 28.7633 24.9685 28.8144 24.9387C28.8655 24.9088 28.9078 24.866 28.937 24.8145C28.9661 24.7629 28.9811 24.7046 28.9803 24.6454C28.9795 24.5863 28.963 24.5283 28.9326 24.4776L28.9325 24.4774L26.74 20.8233L26.6375 20.6525L26.74 20.4818L28.9325 16.8276L28.9326 16.8274C28.9631 16.7767 28.9796 16.7187 28.9803 16.6595C28.9811 16.6003 28.9661 16.5419 28.937 16.4904L24.0385 16.3209ZM24.0385 16.3209H24.2264M24.0385 16.3209H24.2264M24.2264 16.3209H28.646C28.7052 16.3209 28.7633 16.3366 28.8144 16.3663C28.8655 16.3961 28.9078 16.4389 28.9369 16.4904L24.2264 16.3209ZM20.936 12.4493L20.6515 11.9751L20.367 12.4493L18.3457 15.8183L18.0442 16.3209H18.6302H22.6728H23.2588L22.9573 15.8183L20.936 12.4493ZM23.7568 17.1508L23.6601 16.9897H23.4722H17.8307H17.6429L17.5462 17.1508L15.5476 20.4818L15.4452 20.6525L15.5476 20.8233L17.5462 24.1543L17.6429 24.3154H17.8307H23.4722H23.6601L23.7568 24.1543L25.7554 20.8233L25.8578 20.6525L25.7554 20.4818L23.7568 17.1508ZM13.8335 16.9897H13.2474L13.549 17.4922L14.7708 19.5282L15.0553 20.0022L15.3398 19.5282L16.5616 17.4922L16.8632 16.9897H16.2771H13.8335ZM13.549 23.8129L13.2474 24.3154H13.8335H16.2771H16.8632L16.5616 23.8129L15.3398 21.7769L15.0553 21.3028L14.7708 21.7769L13.549 23.8129ZM20.367 28.8558L20.6515 29.33L20.936 28.8558L22.9573 25.4867L23.2588 24.9842H22.6728H18.6302H18.0442L18.3457 25.4867L20.367 28.8558ZM27.4695 24.3154H28.0556L27.754 23.8129L26.5322 21.7769L26.2477 21.3028L25.9632 21.7769L24.7413 23.8129L24.4397 24.3154H25.0258H27.4695ZM25.9632 19.5282L26.2477 20.0022L26.5322 19.5282L27.754 17.4922L28.0556 16.9897H27.4695H25.0258H24.4397L24.7413 17.4922L25.9632 19.5282Z" stroke="url(#paint12_linear_162:3704)" stroke-width="0.663615"/>
<defs>
<linearGradient id="paint0_linear_162:3704" x1="-8.43103" y1="1.30612" x2="45.0356" y2="40.8642" gradientUnits="userSpaceOnUse">
<stop stop-color="#ACB4FF"/>
<stop offset="0.520833" stop-color="#A55FFF"/>
<stop offset="1" stop-color="#816CFF" stop-opacity="0.88"/>
</linearGradient>
<linearGradient id="paint1_linear_162:3704" x1="-0.92679" y1="7.62165" x2="37.4454" y2="37.3368" gradientUnits="userSpaceOnUse">
<stop stop-color="#ACB4FF"/>
<stop offset="0.520833" stop-color="#A55FFF"/>
<stop offset="1" stop-color="#816CFF" stop-opacity="0.88"/>
</linearGradient>
<linearGradient id="paint2_linear_162:3704" x1="18.7754" y1="2.08231" x2="22.2249" y2="4.63444" gradientUnits="userSpaceOnUse">
<stop stop-color="#ACB4FF"/>
<stop offset="0.520833" stop-color="#A55FFF"/>
<stop offset="1" stop-color="#816CFF" stop-opacity="0.88"/>
</linearGradient>
<linearGradient id="paint3_linear_162:3704" x1="18.7754" y1="36.7254" x2="22.2249" y2="39.2775" gradientUnits="userSpaceOnUse">
<stop stop-color="#ACB4FF"/>
<stop offset="0.520833" stop-color="#A55FFF"/>
<stop offset="1" stop-color="#816CFF" stop-opacity="0.88"/>
</linearGradient>
<linearGradient id="paint4_linear_162:3704" x1="31.0231" y1="7.15507" x2="34.4725" y2="9.7072" gradientUnits="userSpaceOnUse">
<stop stop-color="#ACB4FF"/>
<stop offset="0.520833" stop-color="#A55FFF"/>
<stop offset="1" stop-color="#816CFF" stop-opacity="0.88"/>
</linearGradient>
<linearGradient id="paint5_linear_162:3704" x1="6.52613" y1="31.6531" x2="9.97559" y2="34.2052" gradientUnits="userSpaceOnUse">
<stop stop-color="#ACB4FF"/>
<stop offset="0.520833" stop-color="#A55FFF"/>
<stop offset="1" stop-color="#816CFF" stop-opacity="0.88"/>
</linearGradient>
<linearGradient id="paint6_linear_162:3704" x1="31.0234" y1="31.6531" x2="34.4729" y2="34.2052" gradientUnits="userSpaceOnUse">
<stop stop-color="#ACB4FF"/>
<stop offset="0.520833" stop-color="#A55FFF"/>
<stop offset="1" stop-color="#816CFF" stop-opacity="0.88"/>
</linearGradient>
<linearGradient id="paint7_linear_162:3704" x1="6.52662" y1="7.15507" x2="9.97608" y2="9.7072" gradientUnits="userSpaceOnUse">
<stop stop-color="#ACB4FF"/>
<stop offset="0.520833" stop-color="#A55FFF"/>
<stop offset="1" stop-color="#816CFF" stop-opacity="0.88"/>
</linearGradient>
<linearGradient id="paint8_linear_162:3704" x1="12.0064" y1="35.3484" x2="15.4558" y2="37.9006" gradientUnits="userSpaceOnUse">
<stop stop-color="#ACB4FF"/>
<stop offset="0.520833" stop-color="#A55FFF"/>
<stop offset="1" stop-color="#816CFF" stop-opacity="0.88"/>
</linearGradient>
<linearGradient id="paint9_linear_162:3704" x1="25.1494" y1="3.40751" x2="28.5989" y2="5.95964" gradientUnits="userSpaceOnUse">
<stop stop-color="#ACB4FF"/>
<stop offset="0.520833" stop-color="#A55FFF"/>
<stop offset="1" stop-color="#816CFF" stop-opacity="0.88"/>
</linearGradient>
<linearGradient id="paint10_linear_162:3704" x1="12.3181" y1="3.35399" x2="15.7489" y2="5.87613" gradientUnits="userSpaceOnUse">
<stop stop-color="#ACB4FF"/>
<stop offset="0.520833" stop-color="#A55FFF"/>
<stop offset="1" stop-color="#816CFF" stop-opacity="0.88"/>
</linearGradient>
<linearGradient id="paint11_linear_162:3704" x1="25.2622" y1="35.4637" x2="28.7137" y2="38.0169" gradientUnits="userSpaceOnUse">
<stop stop-color="#ACB4FF"/>
<stop offset="0.520833" stop-color="#A55FFF"/>
<stop offset="1" stop-color="#816CFF" stop-opacity="0.88"/>
</linearGradient>
<linearGradient id="paint12_linear_162:3704" x1="8.45529" y1="11.3134" x2="33.0248" y2="27.0857" gradientUnits="userSpaceOnUse">
<stop stop-color="#ACB4FF"/>
<stop offset="0.520833" stop-color="#A55FFF"/>
<stop offset="1" stop-color="#816CFF" stop-opacity="0.88"/>
</linearGradient>
</defs>
</svg>
