<svg width="42" height="42" viewBox="0 0 42 42" fill="none" xmlns="http://www.w3.org/2000/svg">
<path d="M23.0839 7.51879C23.0839 8.83773 22.0147 9.90694 20.6958 9.90694C19.3769 9.90694 18.3076 8.83773 18.3076 7.51879C18.3076 6.19985 19.3769 5.13064 20.6958 5.13064C22.0147 5.13064 23.0839 6.19985 23.0839 7.51879Z" stroke="url(#paint0_linear_162:3774)" stroke-width="0.663615"/>
<path d="M8.48941 11.3849C8.60685 11.2638 8.79287 11.1619 9.06944 11.1395C9.13943 11.1718 9.2123 11.2019 9.2888 11.2297C9.28886 11.2297 9.28892 11.2297 9.28898 11.2297L13.0512 12.5991H9.19092C8.86109 12.5991 8.64291 12.4945 8.5082 12.3651C8.37099 12.2334 8.29998 12.0571 8.29688 11.8775C8.29377 11.6976 8.3588 11.5196 8.48941 11.3849Z" stroke="url(#paint1_linear_162:3774)" stroke-width="0.663615"/>
<path d="M25.2534 24.9599L30.0067 33.2045L30.0069 33.2047C30.336 33.7746 30.1404 34.505 29.5708 34.8336L29.5707 34.8337C28.9988 35.1639 28.2698 34.9679 27.941 34.3988C27.9409 34.3986 27.9408 34.3984 27.9406 34.3981L25.2542 29.6891L25.2534 24.9599Z" stroke="url(#paint2_linear_162:3774)" stroke-width="0.663615"/>
<path d="M11.1281 33.0387C10.7078 33.7673 10.9572 34.7008 11.6862 35.121C12.4168 35.5429 13.3493 35.2925 13.7696 34.5639M11.1281 33.0387L16.169 24.2953L16.169 24.9597M11.1281 33.0387L11.1281 33.0387L11.1281 33.0387ZM13.7696 34.5639L16.5004 29.7772M13.7696 34.5639L13.4814 34.3995L13.4818 34.3988C13.153 34.9678 12.424 35.1639 11.8521 34.8337L11.8519 34.8336C11.2821 34.5051 11.0866 33.7747 11.4155 33.2045L11.4155 33.2045L16.169 24.9597M13.7696 34.5639L13.4822 34.3981L16.1686 29.6892M16.5004 29.7772L16.5008 24.3841L16.169 24.9597M16.5004 29.7772L16.1686 29.7771L16.1686 29.6892M16.5004 29.7772L16.2122 29.6127L16.1686 29.6892M16.169 24.9597L16.1686 29.6892" stroke="url(#paint3_linear_162:3774)" stroke-width="0.663615"/>
<path d="M32.129 11.2297C32.1291 11.2297 32.1291 11.2297 32.1292 11.2297C32.2053 11.2021 32.2784 11.172 32.3488 11.1395C32.6252 11.162 32.8113 11.2638 32.9288 11.385C33.0595 11.5197 33.1245 11.6977 33.1214 11.8775C33.1184 12.0571 33.0474 12.2334 32.9101 12.3651C32.7753 12.4944 32.5569 12.5991 32.2266 12.5991H28.3668L32.129 11.2297Z" stroke="url(#paint4_linear_162:3774)" stroke-width="0.663615"/>
<path d="M24.1014 11.1378H24.163L24.2204 11.1157L31.1269 8.46223C31.4389 8.34822 31.6805 8.37329 31.8509 8.45019C32.0252 8.5288 32.1517 8.67313 32.2139 8.84396C32.2761 9.01481 32.272 9.20714 32.189 9.3801C32.1076 9.54972 31.9379 9.72534 31.6243 9.83946L31.6243 9.83947L23.9879 12.6193L23.7698 12.6987L23.7696 12.9309L23.7686 14.6002L23.7679 15.6956L23.7692 15.6936L23.7619 36.031V36.0312C23.7619 36.6897 23.2282 37.224 22.5695 37.224C21.9108 37.224 21.3767 36.6897 21.3766 36.0313C21.3766 36.0313 21.3766 36.0312 21.3766 36.0312L21.3813 23.8612L21.3814 23.5292H21.0495H20.3705H20.0388L20.0387 23.861L20.0372 36.0311V36.0312C20.0372 36.6894 19.5032 37.224 18.8433 37.224C18.1854 37.224 17.6504 36.6895 17.6504 36.0312C17.6504 36.0312 17.6504 36.0312 17.6504 36.0312L17.6524 23.8177V23.8176L17.6504 12.9311L17.6503 12.6988L17.4321 12.6193L9.79522 9.83947L9.79519 9.83946C9.48161 9.72534 9.31193 9.54972 9.23051 9.3801C9.14749 9.20716 9.14348 9.01483 9.20568 8.844C9.26787 8.67317 9.39443 8.52883 9.56874 8.45021C9.73928 8.37329 9.98099 8.34822 10.2932 8.46224L17.1996 11.1157L17.257 11.1378H17.3186H24.1014Z" stroke="url(#paint5_linear_162:3774)" stroke-width="0.663615"/>
<path d="M6.2838 6.2838L6.28377 6.28383C4.4175 8.14959 2.95311 10.3226 1.92944 12.7423L6.2838 6.2838ZM6.2838 6.2838C8.14961 4.41799 10.3222 2.9536 12.7424 1.92993L12.6131 1.62434M6.2838 6.2838L12.6131 1.62434M12.6131 1.62434L12.7424 1.92993C15.2487 0.869797 17.9097 0.331808 20.6527 0.331808C23.3957 0.331808 26.0572 0.869802 28.563 1.92992L28.5631 1.92995C30.9832 2.95308 33.1558 4.41796 35.0216 6.2838L35.0216 6.28383C36.8879 8.14959 38.3518 10.3226 39.376 12.7425M12.6131 1.62434C15.1606 0.54678 17.8656 0 20.6527 0C23.4398 0 26.1453 0.54678 28.6923 1.62434C31.152 2.6642 33.3603 4.15326 35.2562 6.04918C37.1527 7.9451 38.6407 10.1539 39.6816 12.6131M39.6816 12.6131L39.376 12.7424C39.376 12.7424 39.376 12.7424 39.376 12.7425M39.6816 12.6131L39.376 12.7425M39.6816 12.6131C40.7591 15.1606 41.3054 17.8661 41.3054 20.6527C41.3054 23.4398 40.7591 26.1453 39.6816 28.6923C38.6412 31.152 37.1527 33.3603 35.2562 35.2562C33.3603 37.1527 31.152 38.6407 28.6923 39.6811C26.1453 40.7591 23.4398 41.3054 20.6527 41.3054C17.8656 41.3054 15.1606 40.7591 12.6131 39.6811C10.1534 38.6412 7.94509 37.1527 6.04918 35.2562L1.92941 12.7424C0.869789 15.2487 0.331808 17.9102 0.331808 20.6527C0.331808 23.3958 0.869302 26.0573 1.9294 28.563L1.92942 28.563C2.95308 30.9832 4.41747 33.1558 6.28377 35.0216L6.28383 35.0216C8.14963 36.8879 10.3221 38.3523 12.7423 39.3755L12.7424 39.3755C15.2487 40.4361 17.9097 40.9736 20.6527 40.9736C23.3957 40.9736 26.0572 40.4361 28.5629 39.3755L28.563 39.3755C30.9833 38.3518 33.1558 36.8879 35.0216 35.0216L35.0216 35.0216C36.8879 33.1558 38.3523 30.9832 39.376 28.563L39.376 28.563C40.4361 26.0573 40.9736 23.3958 40.9736 20.6527C40.9736 17.9102 40.4361 15.2487 39.376 12.7425" stroke="url(#paint6_linear_162:3774)" stroke-width="0.663615"/>
<defs>
<linearGradient id="paint0_linear_162:3774" x1="16.8655" y1="4.97085" x2="23.907" y2="10.1807" gradientUnits="userSpaceOnUse">
<stop stop-color="#ACB4FF"/>
<stop offset="0.520833" stop-color="#A55FFF"/>
<stop offset="1" stop-color="#816CFF" stop-opacity="0.88"/>
</linearGradient>
<linearGradient id="paint1_linear_162:3774" x1="6.5427" y1="10.871" x2="8.57327" y2="15.792" gradientUnits="userSpaceOnUse">
<stop stop-color="#ACB4FF"/>
<stop offset="0.520833" stop-color="#A55FFF"/>
<stop offset="1" stop-color="#816CFF" stop-opacity="0.88"/>
</linearGradient>
<linearGradient id="paint2_linear_162:3774" x1="23.783" y1="24.0867" x2="33.7005" y2="27.6127" gradientUnits="userSpaceOnUse">
<stop stop-color="#ACB4FF"/>
<stop offset="0.520833" stop-color="#A55FFF"/>
<stop offset="1" stop-color="#816CFF" stop-opacity="0.88"/>
</linearGradient>
<linearGradient id="paint3_linear_162:3774" x1="9.78561" y1="24.0867" x2="19.7028" y2="27.6124" gradientUnits="userSpaceOnUse">
<stop stop-color="#ACB4FF"/>
<stop offset="0.520833" stop-color="#A55FFF"/>
<stop offset="1" stop-color="#816CFF" stop-opacity="0.88"/>
</linearGradient>
<linearGradient id="paint4_linear_162:3774" x1="25.0628" y1="10.871" x2="27.0933" y2="15.7921" gradientUnits="userSpaceOnUse">
<stop stop-color="#ACB4FF"/>
<stop offset="0.520833" stop-color="#A55FFF"/>
<stop offset="1" stop-color="#816CFF" stop-opacity="0.88"/>
</linearGradient>
<linearGradient id="paint5_linear_162:3774" x1="3.98214" y1="8.98566" x2="39.1019" y2="29.9088" gradientUnits="userSpaceOnUse">
<stop stop-color="#ACB4FF"/>
<stop offset="0.520833" stop-color="#A55FFF"/>
<stop offset="1" stop-color="#816CFF" stop-opacity="0.88"/>
</linearGradient>
<linearGradient id="paint6_linear_162:3774" x1="-8.43107" y1="1.30613" x2="45.0358" y2="40.8643" gradientUnits="userSpaceOnUse">
<stop stop-color="#ACB4FF"/>
<stop offset="0.520833" stop-color="#A55FFF"/>
<stop offset="1" stop-color="#816CFF" stop-opacity="0.88"/>
</linearGradient>
</defs>
</svg>
