<svg width="43" height="43" viewBox="0 0 43 43" fill="none" xmlns="http://www.w3.org/2000/svg">
<path d="M21.4747 9.56213e-06C17.2234 0.00502161 13.0691 1.27023 9.53681 3.63573C6.00449 6.00122 3.25273 9.36081 1.62933 13.2899C0.00593545 17.2189 -0.416221 21.541 0.416221 25.71C1.24866 29.8789 3.29834 33.7075 6.30617 36.7117C9.31401 39.716 13.145 41.7612 17.3149 42.5887C21.4848 43.4163 25.8064 42.989 29.7335 41.361C33.6607 39.733 37.017 36.9772 39.3784 33.4421C41.7397 29.907 43 25.7512 43 21.5C42.9993 18.6746 42.4419 15.8771 41.3596 13.2672C40.2773 10.6574 38.6914 8.28639 36.6924 6.28973C34.6933 4.29307 32.3205 2.7099 29.7093 1.63068C27.0982 0.551456 24.3 -0.0026547 21.4747 9.56213e-06ZM33.6974 16.8614L30.8686 14.0376L27.3503 17.5559C28.7884 19.5304 29.4122 21.9824 29.0923 24.4042C28.7724 26.8259 27.5334 29.0319 25.6319 30.5653C23.7303 32.0987 21.3119 32.8421 18.8774 32.6415C16.4429 32.441 14.1787 31.3118 12.5538 29.4879C10.9288 27.664 10.0675 25.285 10.1483 22.8436C10.229 20.4021 11.2456 18.0852 12.9875 16.3727C14.7294 14.6601 17.0632 13.683 19.5057 13.6438C21.9482 13.6045 24.3122 14.5061 26.1082 16.1618L29.5505 12.7195L26.8788 10.0428H33.6974V16.8614Z" fill="#0066FF" fill-opacity="0.47"/>
<path d="M27.3247 23.1783C27.3247 24.6976 26.8738 26.1828 26.0291 27.4456C25.1844 28.7085 23.9838 29.6922 22.5796 30.2722C21.1753 30.8523 19.6305 31.0025 18.1408 30.7038C16.6511 30.4052 15.2836 29.6712 14.2114 28.5947C13.1392 27.5183 12.4106 26.1478 12.1179 24.6569C11.8252 23.1661 11.9815 21.6219 12.5671 20.2199C13.1527 18.818 14.1412 17.6214 15.4074 16.7817C16.6736 15.942 18.1605 15.497 19.6799 15.503C21.7098 15.5124 23.6535 16.325 25.086 17.7632C26.5185 19.2015 27.3234 21.1484 27.3247 23.1783Z" fill="#0066FF" fill-opacity="0.47"/>
</svg>
