<svg width="26" height="24" viewBox="0 0 26 24" fill="none" xmlns="http://www.w3.org/2000/svg">
<path fill-rule="evenodd" clip-rule="evenodd" d="M13.0162 4.95051C13.3742 4.95051 13.6345 4.65764 13.6345 4.33223V0.882929C13.6345 0.524982 13.3416 0.264648 13.0162 0.264648C12.6908 0.264648 12.3979 0.557522 12.3979 0.882929V4.33223C12.3979 4.69018 12.6908 4.95051 13.0162 4.95051Z" fill="black"/>
<path fill-rule="evenodd" clip-rule="evenodd" d="M18.5807 4.95051C18.9386 4.95051 19.1989 4.65764 19.1989 4.33223V0.882929C19.1989 0.524982 18.9061 0.264648 18.5807 0.264648C18.2553 0.264648 17.9624 0.557522 17.9624 0.882929V4.33223C17.9624 4.69018 18.2553 4.95051 18.5807 4.95051Z" fill="black"/>
<path fill-rule="evenodd" clip-rule="evenodd" d="M16.8557 2.31445H14.7406C14.4477 2.31445 14.2524 2.54224 14.2524 2.80256V3.03034C14.2524 3.32321 14.4802 3.51845 14.7406 3.51845H16.8557C17.1486 3.51845 17.3438 3.29067 17.3438 3.03034V2.80256C17.3438 2.54224 17.116 2.31445 16.8557 2.31445Z" fill="black"/>
<path fill-rule="evenodd" clip-rule="evenodd" d="M11.2263 2.31445H9.11116C8.81829 2.31445 8.62305 2.54224 8.62305 2.80256V3.03034C8.62305 3.32321 8.85083 3.51845 9.11116 3.51845H11.2263C11.5192 3.51845 11.7144 3.29067 11.7144 3.03034V2.80256C11.7144 2.54224 11.4866 2.31445 11.2263 2.31445Z" fill="black"/>
<path fill-rule="evenodd" clip-rule="evenodd" d="M7.45177 4.95051C7.80971 4.95051 8.07004 4.65764 8.07004 4.33223V0.882929C8.07004 0.524982 7.77717 0.264648 7.45177 0.264648C7.12636 0.264648 6.8335 0.557522 6.8335 0.882929V4.33223C6.8335 4.69018 7.09382 4.95051 7.45177 4.95051Z" fill="black"/>
<path fill-rule="evenodd" clip-rule="evenodd" d="M24.1452 2.31445H20.403C20.1101 2.31445 19.9149 2.54224 19.9149 2.80256V3.03034C19.9149 3.32321 20.1427 3.51845 20.403 3.51845H23.5269C24.2103 3.51845 24.7635 4.07165 24.7635 4.755V20.8301C24.7635 21.5135 24.2103 22.0666 23.5269 22.0666H2.47309C1.78974 22.0666 1.23655 21.5135 1.23655 20.8301V4.755C1.23655 4.07165 1.78974 3.51845 2.47309 3.51845H5.66208C5.95494 3.51845 6.15019 3.29067 6.15019 3.03034V2.80256C6.15019 2.5097 5.9224 2.31445 5.66208 2.31445H1.85482C0.813516 2.31445 0 3.1605 0 4.16927V21.4809C0 22.5222 0.846057 23.3357 1.85482 23.3357H24.1452C25.1865 23.3357 26 22.4897 26 21.4809V4.16927C26 3.1605 25.1865 2.31445 24.1452 2.31445Z" fill="black"/>
<path d="M16.6929 8.79012C17.3938 8.79012 17.962 8.22193 17.962 7.52104C17.962 6.82014 17.3938 6.25195 16.6929 6.25195C15.992 6.25195 15.4238 6.82014 15.4238 7.52104C15.4238 8.22193 15.992 8.79012 16.6929 8.79012Z" fill="black"/>
<path d="M12.9839 16.2423C13.6848 16.2423 14.253 15.6741 14.253 14.9732C14.253 14.2723 13.6848 13.7041 12.9839 13.7041C12.283 13.7041 11.7148 14.2723 11.7148 14.9732C11.7148 15.6741 12.283 16.2423 12.9839 16.2423Z" fill="black"/>
<path d="M16.6929 12.5001C17.3938 12.5001 17.962 11.9319 17.962 11.231C17.962 10.5301 17.3938 9.96191 16.6929 9.96191C15.992 9.96191 15.4238 10.5301 15.4238 11.231C15.4238 11.9319 15.992 12.5001 16.6929 12.5001Z" fill="black"/>
<path d="M12.9839 8.79012C13.6848 8.79012 14.253 8.22193 14.253 7.52104C14.253 6.82014 13.6848 6.25195 12.9839 6.25195C12.283 6.25195 11.7148 6.82014 11.7148 7.52104C11.7148 8.22193 12.283 8.79012 12.9839 8.79012Z" fill="black"/>
<path d="M16.6929 16.2423C17.3938 16.2423 17.962 15.6741 17.962 14.9732C17.962 14.2723 17.3938 13.7041 16.6929 13.7041C15.992 13.7041 15.4238 14.2723 15.4238 14.9732C15.4238 15.6741 15.992 16.2423 16.6929 16.2423Z" fill="black"/>
<path d="M20.4356 16.2423C21.1365 16.2423 21.7047 15.6741 21.7047 14.9732C21.7047 14.2723 21.1365 13.7041 20.4356 13.7041C19.7347 13.7041 19.1665 14.2723 19.1665 14.9732C19.1665 15.6741 19.7347 16.2423 20.4356 16.2423Z" fill="black"/>
<path d="M20.4356 12.5001C21.1365 12.5001 21.7047 11.9319 21.7047 11.231C21.7047 10.5301 21.1365 9.96191 20.4356 9.96191C19.7347 9.96191 19.1665 10.5301 19.1665 11.231C19.1665 11.9319 19.7347 12.5001 20.4356 12.5001Z" fill="black"/>
<path d="M20.4356 8.79012C21.1365 8.79012 21.7047 8.22193 21.7047 7.52104C21.7047 6.82014 21.1365 6.25195 20.4356 6.25195C19.7347 6.25195 19.1665 6.82014 19.1665 7.52104C19.1665 8.22193 19.7347 8.79012 20.4356 8.79012Z" fill="black"/>
<path d="M9.30669 16.2423C10.0076 16.2423 10.5758 15.6741 10.5758 14.9732C10.5758 14.2723 10.0076 13.7041 9.30669 13.7041C8.60579 13.7041 8.0376 14.2723 8.0376 14.9732C8.0376 15.6741 8.60579 16.2423 9.30669 16.2423Z" fill="black"/>
<path d="M5.59672 16.2423C6.29762 16.2423 6.86581 15.6741 6.86581 14.9732C6.86581 14.2723 6.29762 13.7041 5.59672 13.7041C4.89582 13.7041 4.32764 14.2723 4.32764 14.9732C4.32764 15.6741 4.89582 16.2423 5.59672 16.2423Z" fill="black"/>
<path d="M5.59672 12.5001C6.29762 12.5001 6.86581 11.9319 6.86581 11.231C6.86581 10.5301 6.29762 9.96191 5.59672 9.96191C4.89582 9.96191 4.32764 10.5301 4.32764 11.231C4.32764 11.9319 4.89582 12.5001 5.59672 12.5001Z" fill="black"/>
<path d="M5.59672 19.9517C6.29762 19.9517 6.86581 19.3836 6.86581 18.6827C6.86581 17.9818 6.29762 17.4136 5.59672 17.4136C4.89582 17.4136 4.32764 17.9818 4.32764 18.6827C4.32764 19.3836 4.89582 19.9517 5.59672 19.9517Z" fill="black"/>
<path d="M12.9839 12.5001C13.6848 12.5001 14.253 11.9319 14.253 11.231C14.253 10.5301 13.6848 9.96191 12.9839 9.96191C12.283 9.96191 11.7148 10.5301 11.7148 11.231C11.7148 11.9319 12.283 12.5001 12.9839 12.5001Z" fill="black"/>
<path d="M9.30669 8.79012C10.0076 8.79012 10.5758 8.22193 10.5758 7.52104C10.5758 6.82014 10.0076 6.25195 9.30669 6.25195C8.60579 6.25195 8.0376 6.82014 8.0376 7.52104C8.0376 8.22193 8.60579 8.79012 9.30669 8.79012Z" fill="black"/>
<path d="M9.30669 19.9517C10.0076 19.9517 10.5758 19.3836 10.5758 18.6827C10.5758 17.9818 10.0076 17.4136 9.30669 17.4136C8.60579 17.4136 8.0376 17.9818 8.0376 18.6827C8.0376 19.3836 8.60579 19.9517 9.30669 19.9517Z" fill="black"/>
<path d="M9.30669 12.5001C10.0076 12.5001 10.5758 11.9319 10.5758 11.231C10.5758 10.5301 10.0076 9.96191 9.30669 9.96191C8.60579 9.96191 8.0376 10.5301 8.0376 11.231C8.0376 11.9319 8.60579 12.5001 9.30669 12.5001Z" fill="black"/>
</svg>
