<svg width="48" height="9" viewBox="0 0 48 9" fill="none" xmlns="http://www.w3.org/2000/svg">
<g clip-path="url(#clip0_88_1533)">
<path d="M0.000976562 4.46875C0.000976562 6.75759 1.91475 8.46875 4.44231 8.46875C5.34053 8.46875 6.11875 8.28601 6.79342 7.83591V6.34159C6.13431 6.74159 5.25564 7.00096 4.42764 7.00096C2.82542 7.00096 1.62898 5.9458 1.62898 4.46875C1.62898 2.9917 2.82542 1.93654 4.42764 1.93654C5.25564 1.93654 6.13431 2.19549 6.79342 2.59591V1.10117C6.11875 0.652329 5.34098 0.46875 4.44231 0.46875C1.91475 0.46875 0.000976562 2.17991 0.000976562 4.46875ZM38.097 2.42243C36.2876 2.42243 34.8201 3.77949 34.8201 5.44559C34.8201 7.1117 36.2876 8.46875 38.097 8.46875C39.9063 8.46875 41.3739 7.11212 41.3739 5.44559C41.3739 3.77949 39.9063 2.42243 38.097 2.42243ZM38.097 7.23085C37.8492 7.23175 37.6037 7.18618 37.3747 7.09678C37.1456 7.00738 36.9374 6.87592 36.7622 6.70997C36.587 6.54403 36.4482 6.34687 36.3538 6.12987C36.2594 5.91286 36.2112 5.68031 36.2121 5.44559C36.2112 5.21088 36.2594 4.97832 36.3538 4.76132C36.4482 4.54431 36.587 4.34716 36.7622 4.18121C36.9374 4.01526 37.1456 3.8838 37.3747 3.7944C37.6037 3.705 37.8492 3.65944 38.097 3.66033C38.3448 3.65938 38.5903 3.70491 38.8194 3.79428C39.0486 3.88365 39.2568 4.01511 39.432 4.18106C39.6073 4.34701 39.7461 4.54419 39.8406 4.76122C39.935 4.97825 39.9832 5.21084 39.9823 5.44559C39.9832 5.68034 39.935 5.91293 39.8406 6.12996C39.7461 6.34699 39.6073 6.54417 39.432 6.71012C39.2568 6.87608 39.0486 7.00753 38.8194 7.0969C38.5903 7.18628 38.3448 7.2318 38.097 7.23085ZM46.5894 2.54159L43.869 6.30286V2.54159H42.4988V8.35001H43.8903L46.609 4.60054V8.35001H48.001V2.54159H46.5894ZM13.041 5.29107C13.3823 5.10075 13.7112 4.66033 13.7112 4.17233C13.7112 3.23212 12.9521 2.54159 11.9148 2.54159H8.44053V8.34959H12.0539C13.0912 8.34959 13.8761 7.64728 13.8761 6.68349C13.8761 6.02917 13.4583 5.50538 13.0405 5.29107H13.041ZM9.83209 3.68433H11.6996C12.0539 3.68433 12.3196 3.92222 12.3196 4.24349C12.3196 4.56517 12.0539 4.80349 11.6996 4.80349H9.83209V3.68391V3.68433ZM11.7881 7.20728H9.83253V5.9458H11.7881C12.193 5.9458 12.4841 6.21949 12.4841 6.57654C12.4841 6.93359 12.193 7.20728 11.7881 7.20728ZM17.2632 2.54201C16.0356 2.54201 15.1121 3.41064 15.1121 4.54117C15.1121 5.45907 15.7339 6.20728 16.6343 6.44728L14.9476 8.35001H16.7441L18.3588 6.52896H19.1308V8.35001H20.5223V2.54201H17.2632ZM17.4525 3.68433H19.1308V5.38622H17.4525C16.8961 5.38622 16.5036 4.99338 16.5036 4.54117C16.5036 4.06538 16.8961 3.68433 17.4525 3.68433ZM29.585 2.54159H28.193V8.35001H29.585V5.99296H32.3036V8.34959H33.6952V2.54159H32.3036V4.85064H29.585V2.54159ZM21.8983 8.01149V6.72643C22.4414 6.99422 23.1059 7.23085 23.865 7.23085C24.7881 7.23085 25.3703 6.97191 25.3703 6.51086C25.3703 6.09949 24.8614 5.94159 24.2139 5.94159H23.1516V4.79928H24.2139C24.8734 4.79928 25.2432 4.57107 25.2432 4.25949C25.2432 3.8018 24.6601 3.66033 23.9854 3.66033C23.2068 3.66033 22.5743 3.87296 22.0574 4.10959V2.86412C22.5934 2.6157 23.3032 2.42243 24.1868 2.42243C25.5343 2.42243 26.629 3.09696 26.629 4.02622C26.629 4.7037 26.2068 5.12054 25.8681 5.26117C26.3028 5.45401 26.7943 5.93486 26.7943 6.62959C26.7943 7.71928 25.6823 8.46875 24.0543 8.46875C23.1205 8.46875 22.4365 8.27886 21.8983 8.01149Z" fill="white" fill-opacity="0.88"/>
<path d="M45.1349 2.22763C46.2042 2.22763 47.0202 1.60531 47.1087 0.692892L45.9936 0.561523C45.9936 0.95605 45.6131 1.25879 45.1349 1.25879C44.6567 1.25879 44.2762 0.955629 44.2762 0.561523L43.1611 0.69205C43.2496 1.60489 44.0656 2.22721 45.1349 2.22721V2.22763Z" fill="#FF0098"/>
</g>
<defs>
<clipPath id="clip0_88_1533">
<rect width="48" height="8" fill="white" transform="translate(0 0.46875)"/>
</clipPath>
</defs>
</svg>
