<svg width="38" height="38" viewBox="0 0 38 38" fill="none" xmlns="http://www.w3.org/2000/svg">
<path d="M25.0243 16.1365L25.0202 16.1257L25.0155 16.1151C24.9294 15.922 24.7983 15.7607 24.6203 15.6555C24.4424 15.5505 24.2464 15.5185 24.0592 15.5354C23.6982 15.568 23.3525 15.7806 23.0791 16.0559C22.5232 16.6157 22.1073 17.5912 22.3413 18.6856L22.3417 18.6873C22.4066 18.984 22.5701 19.2178 22.807 19.3518C23.0366 19.4818 23.2975 19.4966 23.5248 19.4334C23.9888 19.3045 24.3675 18.8333 24.2311 18.2092C24.1704 17.9313 24.2411 17.7546 24.3205 17.64C24.4002 17.5247 24.5008 17.4575 24.5363 17.4367C25.0536 17.2029 25.1958 16.589 25.0243 16.1365Z" stroke="url(#paint0_linear_162:3763)" stroke-width="0.808624"/>
<path d="M8.35795 17.5866C8.76355 17.2809 9.45886 16.8529 10.6757 16.5472C11.4289 16.3638 11.6607 17.5866 10.9074 17.77C9.11121 18.198 8.0103 19.115 8.24207 20.888M8.35795 17.5866L8.64419 17.301C8.56425 17.2209 8.49221 17.1351 8.42795 17.0448M8.35795 17.5866C7.31265 16.5388 7.39881 14.6951 8.44632 13.7157C8.46911 13.8962 8.49698 14.0638 8.52958 14.2192M8.35795 17.5866L8.11461 17.2637C8.20587 17.1949 8.30966 17.1212 8.42795 17.0448M8.42795 17.0448C8.88714 16.7479 9.56491 16.4094 10.5771 16.1551L10.58 16.1544L10.58 16.1544C10.885 16.0801 11.1695 16.1464 11.3865 16.3181C11.5922 16.4809 11.7101 16.7159 11.7537 16.9458C11.8391 17.396 11.6491 18.0055 11.0031 18.1628L11.0011 18.1633C10.1388 18.3688 9.50308 18.6792 9.10982 19.1005C8.73389 19.5033 8.54126 20.0482 8.64227 20.8302M8.42795 17.0448C7.8372 16.2141 7.90308 14.9957 8.52958 14.2192M8.64227 20.8302C8.64199 20.8284 8.64171 20.8267 8.64143 20.8249L8.24207 20.888M8.64227 20.8302C8.6425 20.832 8.64273 20.8338 8.64297 20.8356L8.24207 20.888M8.64227 20.8302C8.74391 21.4646 9.09357 22.0246 9.55924 22.3194L9.60167 22.3462M8.24207 20.888C8.35795 21.6216 8.76355 22.2942 9.34298 22.661L11.5448 23.9449M9.60167 22.3462C9.59228 22.3421 9.58599 22.339 9.5826 22.3371C9.58248 22.3371 9.58237 22.337 9.58226 22.337M9.60167 22.3462L9.60179 22.3463L9.63643 22.3829C9.61285 22.358 9.59177 22.343 9.58226 22.337M9.60167 22.3462C9.61044 22.3501 9.6219 22.3548 9.63623 22.3601C9.69498 22.3818 9.7916 22.4095 9.92803 22.4287C10.1995 22.4669 10.6264 22.471 11.2187 22.329L11.313 22.7221L11.2174 22.3293C11.5224 22.255 11.8069 22.3212 12.0238 22.493C12.2296 22.6558 12.3475 22.8908 12.3911 23.1206C12.4762 23.5699 12.2873 24.1778 11.6446 24.3367M9.58226 22.337C9.57898 22.3349 9.57708 22.3338 9.57694 22.3339C9.5768 22.3339 9.57845 22.3349 9.58226 22.337ZM11.6446 24.3367C11.6457 24.3364 11.6468 24.3361 11.6479 24.3358L11.5448 23.9449M11.6446 24.3367C11.6432 24.337 11.6418 24.3374 11.6404 24.3377L11.5448 23.9449M11.6446 24.3367C11.0417 24.4954 10.3793 24.5728 9.73003 24.4831M11.5448 23.9449C10.8656 24.124 10.1312 24.1865 9.44946 24.0184L9.79268 24.106C9.76053 24.232 9.73992 24.358 9.73003 24.4831M9.73003 24.4831C9.59635 24.4646 9.46322 24.439 9.33129 24.4056C9.34396 24.2726 9.36696 24.1391 9.40092 24.006L11.3696 27.2109C11.3626 27.0699 11.3617 26.9321 11.3665 26.7974M9.73003 24.4831C9.64419 25.5682 10.3659 26.5767 11.3665 26.7974M11.3665 26.7974C11.4965 26.8261 11.6313 26.8415 11.7697 26.842C11.7658 26.9734 11.768 27.1082 11.7766 27.2463L17.9185 10.6781C18.0344 7.19325 13.0513 7.19325 13.0513 10.6781C13.0513 12.1454 14.1522 13.307 15.5428 13.307C16.2961 13.307 16.2961 14.5297 15.5428 14.5297C13.6418 14.5297 11.9954 12.9718 11.8921 10.9136C11.7552 10.9546 11.6233 11.011 11.4982 11.081M11.3665 26.7974C11.4305 25.0027 12.5097 23.7663 13.6063 23.1493C14.195 22.8179 14.8252 22.6438 15.3426 22.6819C15.6024 22.7011 15.8677 22.7768 16.0753 22.9515C16.2956 23.1367 16.4107 23.3999 16.4107 23.7003C16.4107 23.9693 16.3245 24.2275 16.1405 24.4217C15.9546 24.6178 15.6994 24.716 15.4269 24.716C14.7363 24.716 14.2335 24.9909 13.8949 25.3935C13.5489 25.8048 13.3606 26.3677 13.3542 26.945C13.3478 27.5224 13.5236 28.0816 13.8634 28.489C14.1952 28.887 14.703 29.1652 15.4269 29.1652C16.5741 29.1652 17.5142 28.2053 17.5142 26.9406V20.4618M17.5142 20.4618C17.5334 20.4326 17.5508 20.403 17.5664 20.3733C17.6783 20.1609 17.7256 19.9002 17.6783 19.6511L17.6757 19.6372L17.6721 19.6235C17.6388 19.497 17.5866 19.3807 17.5142 19.2792M17.5142 20.4618V19.6822V19.665V19.2792M17.5142 20.4618C17.3986 20.6375 17.2183 20.7966 16.9721 20.8528M17.5142 19.2792V10.6781V10.6646L17.5144 10.6646C17.5399 9.89635 17.2868 9.35725 16.9259 9.00863C16.5589 8.65398 16.0515 8.46877 15.5283 8.46877C15.0053 8.46877 14.4878 8.6541 14.1044 9.01303C13.7269 9.3664 13.4556 9.90997 13.4556 10.6781C13.4556 11.9428 14.3957 12.9027 15.5428 12.9027C15.8525 12.9027 16.1082 13.0336 16.279 13.2414C16.4418 13.4396 16.5121 13.6876 16.5121 13.9183C16.5121 14.1491 16.4418 14.3971 16.279 14.5953C16.1082 14.8031 15.8525 14.934 15.5428 14.934C13.4625 14.934 11.6813 13.2722 11.4982 11.081M17.5142 19.2792C17.4679 19.2145 17.4135 19.1557 17.3505 19.1042C17.1911 18.9738 17.0046 18.9121 16.8234 18.8911C16.4756 18.8507 16.0901 18.9531 15.7466 19.0916C15.1555 19.3298 14.5292 19.7418 14.1154 20.1123M11.4982 11.081C11.4859 10.9348 11.4808 10.7861 11.4832 10.6355C10.2179 11.2057 9.48792 12.8677 10.328 14.5297C10.7122 15.3404 9.2771 16.3704 8.87813 13.8799C8.74748 13.979 8.63116 14.0933 8.52958 14.2192M11.4982 11.081C10.541 11.6169 9.98398 12.9528 10.6888 14.3473L10.6935 14.3565L10.6934 14.3566C10.8565 14.7009 10.8143 15.0691 10.6562 15.348C10.5014 15.6214 10.2073 15.8511 9.83549 15.8511C9.45008 15.8511 9.12013 15.6067 8.88872 15.218C8.73941 14.9671 8.61736 14.6376 8.52958 14.2192M14.1154 20.1123C14.1978 20.1413 14.2818 20.1737 14.3674 20.2098L14.2102 20.5823M14.1154 20.1123C14.042 20.178 13.9753 20.2423 13.9167 20.3042L14.2102 20.5823M14.1154 20.1123C13.2708 19.8154 12.5868 19.8789 12.0842 20.0557C11.5426 20.2462 11.2439 20.5565 11.1934 20.6099C10.7614 21.0657 10.8689 21.6597 11.1812 22.0014C11.3378 22.1728 11.5612 22.302 11.8214 22.3227C12.069 22.3424 12.3137 22.2609 12.5222 22.0856M16.9721 20.8528C16.9751 20.8519 16.9781 20.8511 16.9811 20.8503L16.8755 20.46M16.9721 20.8528C15.9377 21.1343 15.5255 21.5419 15.2706 21.8239C15.2501 21.8466 15.2277 21.872 15.2045 21.8981C15.1581 21.9505 15.1088 22.0061 15.0664 22.0504C14.9988 22.1208 14.9097 22.2055 14.7965 22.2676C14.6723 22.3356 14.5311 22.3702 14.3743 22.3565C14.2283 22.3438 14.0912 22.2911 13.9636 22.2238L13.9566 22.2201L13.9566 22.2201C13.4176 21.9221 13.0616 21.9157 12.8606 21.9511C12.7561 21.9694 12.6781 22.0018 12.6231 22.0295C12.5964 22.043 12.5753 22.0551 12.552 22.0686L12.5467 22.0717C12.5413 22.0748 12.5325 22.0799 12.5222 22.0856M16.9721 20.8528C16.9678 20.8538 16.9634 20.8547 16.959 20.8556L16.8755 20.46M16.8755 20.46C17.1652 20.3989 17.339 20.0321 17.2811 19.7264C16.9914 18.6259 14.9055 19.8487 14.2102 20.5823M16.8755 20.46C15.6421 20.7937 15.1855 21.3096 14.8932 21.6397C14.65 21.9144 14.5206 22.0606 14.1522 21.8662C13.0997 21.2845 12.5241 21.6176 12.3503 21.7182C12.3232 21.7339 12.3059 21.7439 12.298 21.7439M14.2102 20.5823C12.4719 19.8487 11.5448 20.8269 11.4869 20.888C10.9654 21.4382 11.7186 22.2942 12.298 21.7439M12.5222 22.0856C12.5141 22.0901 12.5051 22.0949 12.496 22.0995C12.4855 22.1047 12.4662 22.1141 12.4421 22.1227C12.4241 22.1292 12.3697 22.1482 12.298 22.1482V21.7439M12.5222 22.0856C12.5406 22.0701 12.5587 22.054 12.5765 22.0371L12.298 21.7439M13.5768 15.5728L13.5666 15.5678L13.5562 15.5634C13.083 15.3637 12.4819 15.5516 12.2718 16.0875C12.1346 16.4035 12.1322 16.6993 12.2827 16.9634C12.3924 17.1558 12.5759 17.3024 12.6942 17.3969C12.7075 17.4075 12.7199 17.4174 12.7313 17.4267C12.8722 17.541 12.9609 17.6238 13.0159 17.7247C13.0609 17.8072 13.0996 17.9335 13.0639 18.1584C12.975 18.435 13.0374 18.7126 13.1577 18.9203C13.2814 19.1337 13.4961 19.3261 13.7718 19.3868C13.9778 19.4365 14.1837 19.4179 14.369 19.3277C14.5507 19.2392 14.6847 19.0956 14.7793 18.94C14.9643 18.6356 15.033 18.2316 15.0123 17.833C14.9706 17.0327 14.5535 16.0512 13.5768 15.5728Z" stroke="url(#paint1_linear_162:3763)" stroke-width="0.808624"/>
<mask id="path-3-inside-1_162:3763" fill="white">
<path d="M37.0458 14.4655C37.3398 14.4655 37.6338 14.1715 37.6338 13.8775C37.6338 13.5247 37.3398 13.2894 37.0458 13.2894H33.8116V9.52606H37.0458C37.3398 9.52606 37.6338 9.23205 37.6338 8.93803C37.6338 8.58521 37.3398 8.35 37.0458 8.35H33.8116V7.52676C33.8116 5.52747 32.1651 3.88099 30.1659 3.88099H29.3426V0.588028C29.3426 0.235211 29.0486 0 28.7546 0C28.4018 0 28.1666 0.235211 28.1666 0.588028V3.82218H24.3444V0.588028C24.3444 0.235211 24.1092 0 23.7563 0C23.4623 0 23.1683 0.235211 23.1683 0.588028V3.82218H19.4049V0.588028C19.4049 0.235211 19.1109 0 18.8169 0C18.5229 0 18.2289 0.235211 18.2289 0.588028V3.82218H14.4067V0.588028C14.4067 0.235211 14.1715 0 13.8187 0C13.4658 0 13.2306 0.235211 13.2306 0.588028V3.82218H9.46726V0.588028C9.46726 0.235211 9.17324 0 8.87923 0C8.52641 0 8.2912 0.235211 8.2912 0.588028V3.82218H7.46796C5.46866 3.82218 3.82218 5.46866 3.82218 7.46796V8.2912H0.588028C0.294014 8.2912 0 8.52641 0 8.87923C0 9.17324 0.235211 9.46726 0.588028 9.46726H3.82218V13.2306H0.588028C0.294014 13.2306 0 13.4658 0 13.8187C0 14.1127 0.235211 14.4067 0.588028 14.4067H3.82218V18.2289H0.588028C0.294014 18.2289 0 18.5229 0 18.8169C0 19.1697 0.235211 19.4049 0.588028 19.4049H3.82218V23.2271H0.588028C0.294014 23.2271 0 23.4623 0 23.8151C0 24.1092 0.235211 24.4032 0.588028 24.4032H3.82218V28.1666H0.588028C0.294014 28.1666 0 28.4606 0 28.7546C0 29.1074 0.235211 29.3426 0.588028 29.3426H3.82218V30.1659C3.82218 32.1651 5.46866 33.8116 7.46796 33.8116H8.2912V37.0458C8.2912 37.3986 8.52641 37.6338 8.87923 37.6338C9.17324 37.6338 9.46726 37.3986 9.46726 37.0458V33.8116H13.2306V37.0458C13.2306 37.3986 13.4658 37.6338 13.8187 37.6338C14.1715 37.6338 14.4067 37.3986 14.4067 37.0458V33.8116H18.2289V37.0458C18.2289 37.3986 18.5229 37.6338 18.8169 37.6338C19.1109 37.6338 19.4049 37.3986 19.4049 37.0458V33.8116H23.1683V37.0458C23.1683 37.3986 23.4623 37.6338 23.7563 37.6338C24.1092 37.6338 24.3444 37.3986 24.3444 37.0458V33.8116H28.1666V37.0458C28.1666 37.3986 28.4018 37.6338 28.7546 37.6338C29.0486 37.6338 29.3426 37.3986 29.3426 37.0458V33.8116H30.1659C32.1651 33.8116 33.8116 32.1651 33.8116 30.1659V29.3426H37.0458C37.3398 29.3426 37.6338 29.1074 37.6338 28.7546C37.6338 28.4606 37.3398 28.1666 37.0458 28.1666H33.8116V24.4032H37.0458C37.3398 24.4032 37.6338 24.1092 37.6338 23.8151C37.6338 23.4623 37.3398 23.2271 37.0458 23.2271H33.8116V19.4049H37.0458C37.3398 19.4049 37.6338 19.1697 37.6338 18.8169C37.6338 18.5229 37.3398 18.2289 37.0458 18.2289H33.8116V14.4655H37.0458ZM29.1074 23.2271C29.9306 25.638 27.9902 28.2842 25.344 28.1078C24.1092 30.9891 20.287 31.0479 18.7581 28.637C17.1704 31.1655 13.407 30.8127 12.231 28.1078C10.9961 28.1666 9.82007 27.6961 9.05564 26.6965C8.2912 25.6968 8.05599 24.4032 8.46761 23.2859C7.11514 22.1099 6.76233 20.1106 7.70317 18.5817C5.64507 16.7 6.35071 13.2894 8.99683 12.3486C9.40845 10.7609 10.9373 9.64367 12.2898 9.58486C13.3482 6.82113 17.288 6.52711 18.8169 8.99683C20.4046 6.52711 24.2856 6.82113 25.344 9.58486C26.6965 9.64367 28.1666 10.7021 28.637 12.3486C31.2831 13.2306 31.9299 16.7 29.9306 18.5817C30.8127 20.1106 30.5187 22.0511 29.1074 23.2271Z"/>
</mask>
<path d="M37.0458 14.4655C37.3398 14.4655 37.6338 14.1715 37.6338 13.8775C37.6338 13.5247 37.3398 13.2894 37.0458 13.2894H33.8116V9.52606H37.0458C37.3398 9.52606 37.6338 9.23205 37.6338 8.93803C37.6338 8.58521 37.3398 8.35 37.0458 8.35H33.8116V7.52676C33.8116 5.52747 32.1651 3.88099 30.1659 3.88099H29.3426V0.588028C29.3426 0.235211 29.0486 0 28.7546 0C28.4018 0 28.1666 0.235211 28.1666 0.588028V3.82218H24.3444V0.588028C24.3444 0.235211 24.1092 0 23.7563 0C23.4623 0 23.1683 0.235211 23.1683 0.588028V3.82218H19.4049V0.588028C19.4049 0.235211 19.1109 0 18.8169 0C18.5229 0 18.2289 0.235211 18.2289 0.588028V3.82218H14.4067V0.588028C14.4067 0.235211 14.1715 0 13.8187 0C13.4658 0 13.2306 0.235211 13.2306 0.588028V3.82218H9.46726V0.588028C9.46726 0.235211 9.17324 0 8.87923 0C8.52641 0 8.2912 0.235211 8.2912 0.588028V3.82218H7.46796C5.46866 3.82218 3.82218 5.46866 3.82218 7.46796V8.2912H0.588028C0.294014 8.2912 0 8.52641 0 8.87923C0 9.17324 0.235211 9.46726 0.588028 9.46726H3.82218V13.2306H0.588028C0.294014 13.2306 0 13.4658 0 13.8187C0 14.1127 0.235211 14.4067 0.588028 14.4067H3.82218V18.2289H0.588028C0.294014 18.2289 0 18.5229 0 18.8169C0 19.1697 0.235211 19.4049 0.588028 19.4049H3.82218V23.2271H0.588028C0.294014 23.2271 0 23.4623 0 23.8151C0 24.1092 0.235211 24.4032 0.588028 24.4032H3.82218V28.1666H0.588028C0.294014 28.1666 0 28.4606 0 28.7546C0 29.1074 0.235211 29.3426 0.588028 29.3426H3.82218V30.1659C3.82218 32.1651 5.46866 33.8116 7.46796 33.8116H8.2912V37.0458C8.2912 37.3986 8.52641 37.6338 8.87923 37.6338C9.17324 37.6338 9.46726 37.3986 9.46726 37.0458V33.8116H13.2306V37.0458C13.2306 37.3986 13.4658 37.6338 13.8187 37.6338C14.1715 37.6338 14.4067 37.3986 14.4067 37.0458V33.8116H18.2289V37.0458C18.2289 37.3986 18.5229 37.6338 18.8169 37.6338C19.1109 37.6338 19.4049 37.3986 19.4049 37.0458V33.8116H23.1683V37.0458C23.1683 37.3986 23.4623 37.6338 23.7563 37.6338C24.1092 37.6338 24.3444 37.3986 24.3444 37.0458V33.8116H28.1666V37.0458C28.1666 37.3986 28.4018 37.6338 28.7546 37.6338C29.0486 37.6338 29.3426 37.3986 29.3426 37.0458V33.8116H30.1659C32.1651 33.8116 33.8116 32.1651 33.8116 30.1659V29.3426H37.0458C37.3398 29.3426 37.6338 29.1074 37.6338 28.7546C37.6338 28.4606 37.3398 28.1666 37.0458 28.1666H33.8116V24.4032H37.0458C37.3398 24.4032 37.6338 24.1092 37.6338 23.8151C37.6338 23.4623 37.3398 23.2271 37.0458 23.2271H33.8116V19.4049H37.0458C37.3398 19.4049 37.6338 19.1697 37.6338 18.8169C37.6338 18.5229 37.3398 18.2289 37.0458 18.2289H33.8116V14.4655H37.0458ZM29.1074 23.2271C29.9306 25.638 27.9902 28.2842 25.344 28.1078C24.1092 30.9891 20.287 31.0479 18.7581 28.637C17.1704 31.1655 13.407 30.8127 12.231 28.1078C10.9961 28.1666 9.82007 27.6961 9.05564 26.6965C8.2912 25.6968 8.05599 24.4032 8.46761 23.2859C7.11514 22.1099 6.76233 20.1106 7.70317 18.5817C5.64507 16.7 6.35071 13.2894 8.99683 12.3486C9.40845 10.7609 10.9373 9.64367 12.2898 9.58486C13.3482 6.82113 17.288 6.52711 18.8169 8.99683C20.4046 6.52711 24.2856 6.82113 25.344 9.58486C26.6965 9.64367 28.1666 10.7021 28.637 12.3486C31.2831 13.2306 31.9299 16.7 29.9306 18.5817C30.8127 20.1106 30.5187 22.0511 29.1074 23.2271Z" stroke="url(#paint2_linear_162:3763)" stroke-width="1.61725" mask="url(#path-3-inside-1_162:3763)"/>
<defs>
<linearGradient id="paint0_linear_162:3763" x1="17.1616" y1="8.74447" x2="35.497" y2="15.2447" gradientUnits="userSpaceOnUse">
<stop stop-color="#ACB4FF"/>
<stop offset="0.520833" stop-color="#A55FFF"/>
<stop offset="1" stop-color="#816CFF" stop-opacity="0.88"/>
</linearGradient>
<linearGradient id="paint1_linear_162:3763" x1="5.51266" y1="8.74447" x2="23.8481" y2="15.2447" gradientUnits="userSpaceOnUse">
<stop stop-color="#ACB4FF"/>
<stop offset="0.520833" stop-color="#A55FFF"/>
<stop offset="1" stop-color="#816CFF" stop-opacity="0.88"/>
</linearGradient>
<linearGradient id="paint2_linear_162:3763" x1="-7.68164" y1="1.19003" x2="41.0326" y2="37.232" gradientUnits="userSpaceOnUse">
<stop stop-color="#ACB4FF"/>
<stop offset="0.520833" stop-color="#A55FFF"/>
<stop offset="1" stop-color="#816CFF" stop-opacity="0.88"/>
</linearGradient>
</defs>
</svg>
