<svg width="183" height="308" viewBox="0 0 183 308" fill="none" xmlns="http://www.w3.org/2000/svg">
<path d="M129.365 149.879C129.304 149.748 129.166 149.729 129.038 149.802L124.89 152.299L126.514 149.602C126.592 149.491 126.544 149.32 126.445 149.245C126.345 149.17 126.18 149.232 126.102 149.343L124.49 152.066L124.655 148.952C124.658 148.818 124.571 148.702 124.445 148.709C124.318 148.716 124.203 148.815 124.201 148.949L124.007 152.213L122.026 148.249C121.965 148.118 121.827 148.099 121.699 148.173C121.572 148.246 121.544 148.395 121.605 148.526L123.586 152.489L120.922 150.811C120.823 150.736 120.657 150.798 120.58 150.91C120.502 151.021 120.55 151.192 120.65 151.267L123.225 152.897L120.066 152.932C119.939 152.938 119.824 153.038 119.822 153.172C119.82 153.306 119.906 153.422 120.033 153.415L123.091 153.373L119.147 155.752C119.02 155.825 118.992 155.974 119.053 156.105C119.102 156.209 119.227 156.27 119.329 156.211L119.355 156.196L123.502 153.699L121.631 156.837C121.553 156.949 121.601 157.12 121.701 157.195C121.75 157.233 121.851 157.241 121.902 157.211C121.953 157.182 122.005 157.152 122.018 157.111L123.889 153.973L123.691 157.571C123.688 157.705 123.775 157.821 123.901 157.814C123.939 157.825 123.965 157.81 123.99 157.796C124.067 157.751 124.156 157.666 124.145 157.573L124.355 154.068L126.397 158.163C126.446 158.267 126.571 158.327 126.673 158.268L126.699 158.254C126.827 158.18 126.854 158.031 126.793 157.9L124.776 153.858L127.377 155.473C127.427 155.511 127.528 155.519 127.579 155.489C127.63 155.46 127.681 155.43 127.694 155.389C127.772 155.278 127.724 155.107 127.624 155.032L124.923 153.342L128.083 153.307C128.12 153.318 128.146 153.304 128.171 153.289C128.248 153.245 128.338 153.16 128.327 153.066C128.329 152.932 128.242 152.817 128.116 152.823L124.856 152.85L129.208 150.235C129.386 150.132 129.414 149.983 129.365 149.879Z" fill="#2D2A76"/>
<path d="M120.447 149.51C120.396 149.54 120.332 149.543 120.282 149.505C120.181 149.43 118.157 147.628 118.044 147.527C117.981 147.463 118.007 147.381 118.046 147.326C118.111 147.255 118.187 147.278 118.237 147.316C118.312 147.406 119.872 148.775 120.45 149.309C120.513 149.373 120.512 149.44 120.447 149.51C120.473 149.496 120.473 149.496 120.447 149.51Z" fill="#2D2A76"/>
<path d="M122.854 148.123C122.828 148.137 122.828 148.137 122.802 148.152C122.713 148.17 122.65 148.106 122.651 148.039L122.171 143.455C122.159 143.362 122.224 143.292 122.287 143.288C122.377 143.271 122.44 143.335 122.439 143.402L122.919 147.986C122.944 148.038 122.905 148.093 122.854 148.123Z" fill="#2D2A76"/>
<path d="M125.598 148.745C125.573 148.76 125.547 148.774 125.51 148.763C125.434 148.74 125.372 148.677 125.399 148.595C125.414 148.42 126.619 145.103 126.989 144.093C127.016 144.011 127.093 143.967 127.168 143.989C127.243 144.012 127.28 144.09 127.253 144.172C126.644 145.851 125.705 148.418 125.664 148.607C125.688 148.66 125.649 148.715 125.598 148.745Z" fill="#2D2A76"/>
<path d="M119.549 151.911C119.523 151.926 119.472 151.956 119.434 151.944L116.958 151.152C116.883 151.129 116.846 151.051 116.873 150.969C116.9 150.887 116.976 150.843 117.052 150.865L119.527 151.658C119.603 151.681 119.639 151.759 119.613 151.841C119.6 151.882 119.574 151.897 119.549 151.911Z" fill="#2D2A76"/>
<path d="M119.466 154.371L115.115 155.965C115.037 156.007 114.947 155.958 114.935 155.868C114.923 155.777 114.949 155.698 115.039 155.681L119.39 154.087C119.468 154.045 119.557 154.094 119.57 154.184C119.57 154.249 119.544 154.328 119.466 154.371Z" fill="#2D2A76"/>
<path d="M118.04 160.51C117.988 160.539 117.951 160.528 117.913 160.516C117.863 160.479 117.826 160.401 117.878 160.305L120.178 156.443C120.217 156.387 120.293 156.343 120.381 156.392C120.431 156.43 120.468 156.508 120.416 156.604L118.116 160.466C118.065 160.495 118.04 160.51 118.04 160.51Z" fill="#2D2A76"/>
<path d="M121.789 160.926C121.763 160.941 121.738 160.956 121.7 160.944C121.624 160.922 121.588 160.843 121.614 160.761L122.49 157.499C122.517 157.417 122.593 157.373 122.669 157.395C122.744 157.418 122.781 157.497 122.754 157.579L121.879 160.841C121.865 160.882 121.814 160.911 121.789 160.926Z" fill="#2D2A76"/>
<path d="M126.373 161.596C126.257 161.628 126.206 161.59 126.168 161.512L125.259 158.132C125.247 158.039 125.286 157.984 125.364 157.94C125.454 157.923 125.505 157.961 125.543 158.039L126.452 161.418C126.49 161.497 126.425 161.567 126.373 161.596Z" fill="#2D2A76"/>
<path d="M130.275 158.828C130.224 158.857 130.16 158.861 130.11 158.823L127.633 156.683C127.583 156.645 127.572 156.552 127.636 156.482C127.675 156.426 127.764 156.408 127.827 156.472L130.303 158.612C130.353 158.65 130.365 158.743 130.3 158.813C130.3 158.813 130.3 158.813 130.275 158.828Z" fill="#2D2A76"/>
<path d="M131.119 155.503C131.094 155.518 131.03 155.521 130.993 155.51L128.796 154.622C128.72 154.599 128.709 154.506 128.736 154.424C128.762 154.342 128.851 154.324 128.926 154.347L131.124 155.235C131.199 155.258 131.21 155.351 131.184 155.433C131.196 155.459 131.17 155.473 131.119 155.503Z" fill="#2D2A76"/>
<path d="M131.216 151.375C131.216 151.375 131.191 151.389 131.216 151.375L129.341 152.083C129.264 152.126 129.175 152.077 129.163 151.986C129.125 151.909 129.177 151.816 129.266 151.799L131.116 151.104C131.193 151.062 131.282 151.11 131.294 151.201C131.294 151.267 131.268 151.346 131.216 151.375Z" fill="#2D2A76"/>
<path d="M127.937 149.298C127.886 149.326 127.822 149.329 127.772 149.292C127.709 149.229 127.71 149.163 127.774 149.094L129.54 147.145C129.605 147.076 129.668 147.073 129.731 147.136C129.794 147.199 129.793 147.266 129.729 147.335L127.963 149.283C127.95 149.257 127.937 149.298 127.937 149.298Z" fill="#2D2A76"/>
<path d="M120.147 147.118C120.288 147.037 120.348 146.854 120.28 146.709C120.213 146.565 120.044 146.514 119.903 146.595C119.762 146.677 119.703 146.86 119.77 147.004C119.837 147.149 120.006 147.2 120.147 147.118Z" fill="#2D2A76"/>
<path d="M124.453 146.236C124.594 146.155 124.654 145.972 124.586 145.827C124.519 145.683 124.35 145.632 124.209 145.713C124.068 145.795 124.008 145.978 124.076 146.122C124.143 146.267 124.312 146.318 124.453 146.236Z" fill="#2D2A76"/>
<path d="M128.312 146.729C128.452 146.647 128.512 146.464 128.445 146.32C128.377 146.176 128.208 146.125 128.067 146.206C127.926 146.287 127.867 146.47 127.934 146.615C128.002 146.759 128.171 146.81 128.312 146.729Z" fill="#2D2A76"/>
<path d="M130.377 153.678C130.518 153.596 130.578 153.413 130.51 153.269C130.443 153.125 130.274 153.074 130.133 153.155C129.992 153.236 129.932 153.42 130 153.564C130.067 153.708 130.236 153.759 130.377 153.678Z" fill="#2D2A76"/>
<path d="M124.141 160.038C124.282 159.956 124.341 159.773 124.274 159.629C124.207 159.484 124.038 159.433 123.897 159.515C123.756 159.596 123.696 159.779 123.764 159.924C123.831 160.068 124 160.119 124.141 160.038Z" fill="#2D2A76"/>
<path d="M119.903 145.735C120.016 145.669 120.063 145.523 120.01 145.407C119.956 145.292 119.82 145.251 119.708 145.316C119.595 145.382 119.547 145.528 119.601 145.643C119.655 145.759 119.79 145.8 119.903 145.735Z" fill="#2D2A76"/>
<path d="M117.764 152.991C117.877 152.926 117.925 152.779 117.871 152.664C117.817 152.548 117.682 152.507 117.569 152.572C117.456 152.638 117.408 152.784 117.462 152.9C117.516 153.015 117.651 153.056 117.764 152.991Z" fill="#2D2A76"/>
<path d="M130.341 157.141C130.454 157.076 130.501 156.93 130.447 156.814C130.393 156.699 130.258 156.658 130.146 156.723C130.033 156.788 129.985 156.934 130.039 157.05C130.093 157.165 130.228 157.206 130.341 157.141Z" fill="#2D2A76"/>
<path d="M131.081 153.058C131.194 152.993 131.242 152.846 131.188 152.731C131.134 152.615 130.999 152.574 130.886 152.64C130.773 152.705 130.726 152.851 130.78 152.967C130.833 153.082 130.969 153.123 131.081 153.058Z" fill="#2D2A76"/>
<path d="M127.868 160.205C127.981 160.139 128.028 159.993 127.974 159.878C127.92 159.762 127.785 159.721 127.673 159.786C127.56 159.851 127.512 159.998 127.566 160.113C127.62 160.229 127.755 160.27 127.868 160.205Z" fill="#2D2A76"/>
<path d="M117.122 149.284C117.235 149.219 117.282 149.073 117.228 148.957C117.174 148.842 117.039 148.801 116.927 148.866C116.814 148.931 116.766 149.078 116.82 149.193C116.874 149.309 117.009 149.349 117.122 149.284Z" fill="#2D2A76"/>
<path d="M120.325 159.818C120.438 159.753 120.486 159.607 120.432 159.491C120.378 159.376 120.243 159.335 120.13 159.4C120.017 159.465 119.97 159.612 120.024 159.727C120.078 159.843 120.213 159.884 120.325 159.818Z" fill="#2D2A76"/>
<path d="M86.2868 135.819C86.3013 135.711 86.4033 135.652 86.5043 135.66C86.5797 135.683 94.3357 137.37 95.1789 137.579C95.2798 137.587 95.3287 137.692 95.3142 137.799C95.2998 137.907 95.1978 137.966 95.0968 137.958C94.2536 137.749 86.4976 136.061 86.4222 136.039C86.309 136.005 86.2602 135.9 86.2868 135.819Z" fill="#2D2A76"/>
<path d="M86.0283 137.08C86.0283 137.08 86.0539 137.065 86.0283 137.08C86.0938 136.942 86.2081 136.909 86.2836 136.932L91.354 139.25C91.4417 139.298 91.4906 139.403 91.4385 139.5C91.3863 139.596 91.2842 139.655 91.1965 139.606L86.1261 137.289C86.0506 137.266 86.0017 137.161 86.0283 137.08Z" fill="#2D2A76"/>
<path d="M86.6136 134.603C86.64 134.522 86.7044 134.453 86.768 134.45L92.4492 133.956C92.5383 133.938 92.6389 134.013 92.6247 134.12C92.6362 134.212 92.5586 134.322 92.4571 134.314L86.7759 134.808C86.6868 134.825 86.5862 134.751 86.6003 134.644C86.6003 134.644 86.588 134.618 86.6136 134.603Z" fill="#2D2A76"/>
<path d="M73.6615 142.002C73.7494 142.051 73.7728 142.169 73.7207 142.265C73.6941 142.347 69.4897 149.885 69.034 150.708C68.9819 150.805 68.8675 150.837 68.7797 150.788C68.6919 150.74 68.6684 150.621 68.7205 150.525C69.1762 149.701 73.3806 142.163 73.4072 142.082C73.4716 142.012 73.586 141.979 73.6615 142.002Z" fill="#2D2A76"/>
<path d="M72.373 141.543C72.373 141.543 72.3854 141.569 72.411 141.554C72.4738 141.617 72.4978 141.735 72.4077 141.819L68.5743 146.453C68.5099 146.523 68.3951 146.555 68.3199 146.466C68.2571 146.403 68.2332 146.285 68.3232 146.201L72.1566 141.567C72.2211 141.497 72.3103 141.48 72.373 141.543Z" fill="#2D2A76"/>
<path d="M74.6853 142.817C74.7352 142.854 74.7719 142.933 74.7574 143.041L73.2957 148.935C73.2812 149.043 73.1792 149.102 73.0782 149.094C72.9772 149.086 72.9284 148.982 72.9428 148.874L74.4046 142.979C74.419 142.871 74.5211 142.812 74.6221 142.82C74.6731 142.79 74.6731 142.79 74.6853 142.817Z" fill="#2D2A76"/>
<path d="M80.5191 141.894C80.6094 141.877 80.7251 141.911 80.7374 142.004C80.7496 142.097 83.0384 150.126 83.277 151.023C83.2892 151.116 83.2497 151.238 83.1594 151.255C83.0691 151.273 82.9534 151.238 82.9411 151.145C82.7026 150.248 80.4138 142.219 80.4142 142.152C80.3766 142.007 80.4288 141.911 80.5191 141.894Z" fill="#2D2A76"/>
<path d="M79.2277 142.399L79.2533 142.384C79.3427 142.366 79.4436 142.441 79.4552 142.535L79.9007 148.502C79.9122 148.595 79.8344 148.706 79.745 148.724C79.6556 148.742 79.5547 148.667 79.5432 148.573L79.0977 142.606C79.0862 142.513 79.1383 142.417 79.2277 142.399Z" fill="#2D2A76"/>
<path d="M81.6958 141.691C81.7736 141.648 81.8638 141.697 81.9022 141.776L85.0185 146.655C85.0569 146.734 85.0562 146.867 84.9525 146.925C84.8747 146.968 84.7453 146.974 84.6942 146.869L81.5778 141.99C81.5395 141.911 81.5402 141.778 81.6439 141.72C81.6698 141.706 81.6698 141.706 81.6958 141.691Z" fill="#2D2A76"/>
<path d="M76.4318 135.883C75.8926 135.631 74.5089 135.235 73.6834 133.189C72.748 130.907 72.6393 129.077 72.8024 128.385C72.9655 127.693 72.3619 127.511 71.9691 128.336C71.5763 129.161 69.8332 132.162 70.9927 135.41C72.1522 138.658 73.8731 140.054 77.3062 140.326C80.7648 140.583 83.6131 136.478 83.9792 135.735C84.2278 135.226 84.4519 134.664 84.4186 134.385C84.3853 134.105 84.1445 134.145 83.8749 134.4C83.6053 134.656 82.6233 135.955 80.7226 136.257C78.8341 136.586 76.8956 136.113 76.4318 135.883Z" fill="#2D2A76"/>
<path d="M76.3291 131.56C76.5865 131.278 77.5495 130.357 77.3122 129.433C77.0871 128.535 76.2419 127.697 76.3961 127.541C76.5503 127.386 77.3911 128.492 78.2386 128.433C79.0861 128.374 79.7895 127.868 80.1756 127.446C80.5617 127.024 80.6049 127.464 80.4507 127.619C80.2965 127.774 79.116 128.855 79.3822 129.563C79.6484 130.272 80.4193 131.02 80.366 131.183C80.3127 131.347 80.2229 131.432 79.9234 131.207C79.6372 130.941 78.8053 130.062 78.0543 130.397C77.4053 130.672 76.6198 131.558 76.4389 131.795C76.3746 131.865 76.1749 131.715 76.3291 131.56Z" fill="#2D2A76"/>
<path d="M66.1329 143.488C66.2871 143.332 66.9026 142.777 66.7606 142.195C66.6187 141.614 66.0973 141.052 66.1872 140.967C66.277 140.882 66.8083 141.604 67.3263 141.603C67.8443 141.602 68.2912 141.311 68.5353 141.07C68.7793 140.829 68.787 141.123 68.6972 141.209C68.6074 141.294 67.8642 141.922 68.0339 142.355C68.1903 142.829 68.6751 143.312 68.6229 143.409C68.5708 143.505 68.532 143.561 68.3578 143.396C68.1837 143.231 67.6757 142.629 67.2054 142.801C66.7862 142.944 66.3103 143.451 66.1939 143.618C66.1673 143.7 66.0297 143.614 66.1329 143.488Z" fill="#2D2A76"/>
<path d="M69.5259 128.107C69.4613 128.177 69.3333 128.183 69.2701 128.119C69.2068 128.055 63.6698 122.153 63.0631 121.499C62.9999 121.435 63.0013 121.301 63.066 121.231C63.1307 121.161 63.2586 121.155 63.3218 121.219C63.9286 121.872 69.4656 127.775 69.5288 127.839C69.592 127.903 69.5906 128.037 69.5259 128.107Z" fill="#2D2A76"/>
<path d="M70.4935 127.107L70.4676 127.122C70.3897 127.165 70.2603 127.171 70.2091 127.066L67.14 122.158C67.1015 122.08 67.1022 121.946 67.206 121.889C67.2838 121.845 67.4133 121.84 67.4645 121.944L70.5336 126.852C70.572 126.931 70.5586 127.038 70.4935 127.107Z" fill="#2D2A76"/>
<path d="M68.5684 128.872C68.504 128.942 68.4152 128.961 68.3529 128.897L63.4975 126.148C63.4096 126.099 63.3862 125.98 63.4383 125.883C63.4905 125.787 63.6049 125.754 63.6927 125.803L68.5481 128.551C68.636 128.6 68.6594 128.72 68.6073 128.816C68.5817 128.831 68.5817 128.831 68.5684 128.872Z" fill="#2D2A76"/>
<path d="M68.742 135.647C68.7536 135.739 68.676 135.849 68.5743 135.841C68.4851 135.858 60.4203 136.96 59.5286 137.069C59.4394 137.087 59.3385 137.012 59.3525 136.906C59.3409 136.814 59.4185 136.704 59.5202 136.713C60.4119 136.604 68.4766 135.501 68.5659 135.484C68.6551 135.466 68.756 135.541 68.742 135.647Z" fill="#2D2A76"/>
<path d="M68.5233 134.358C68.5233 134.358 68.5355 134.384 68.51 134.399C68.4957 134.506 68.4058 134.591 68.3047 134.583L62.6801 134.208C62.579 134.2 62.5044 134.111 62.5188 134.003C62.5331 133.896 62.623 133.811 62.7241 133.819L68.3487 134.194C68.4498 134.202 68.5121 134.266 68.5233 134.358Z" fill="#2D2A76"/>
<path d="M68.8428 137.009C68.8556 137.099 68.791 137.166 68.7394 137.193L63.3293 139.491C63.2518 139.533 63.1357 139.498 63.0842 139.397C63.0456 139.321 63.0844 139.203 63.1877 139.147L68.5979 136.85C68.6753 136.808 68.7914 136.842 68.8429 136.944C68.8558 136.969 68.83 136.983 68.8428 137.009Z" fill="#2D2A76"/>
<path d="M77.3698 125.135C77.2805 125.152 77.1797 125.077 77.1938 124.969C77.1823 124.876 76.7843 116.386 76.7453 115.477C76.7338 115.384 76.8116 115.272 76.9133 115.281C77.0026 115.263 77.1035 115.338 77.0893 115.446C77.1407 116.382 77.5387 124.871 77.5378 124.938C77.5493 125.032 77.4715 125.143 77.3698 125.135Z" fill="#2D2A76"/>
<path d="M78.7471 124.902C78.7471 124.902 78.7216 124.917 78.7093 124.891C78.6082 124.882 78.5337 124.793 78.548 124.685L79.3765 118.687C79.3909 118.579 79.4808 118.493 79.5819 118.501C79.683 118.509 79.7576 118.599 79.7432 118.707L78.9147 124.705C78.9126 124.84 78.836 124.884 78.7471 124.902Z" fill="#2D2A76"/>
<path d="M76.1744 125.03C76.0839 125.047 76.0196 124.984 75.9812 124.905L74.0335 119.375C73.9952 119.296 74.0605 119.16 74.1383 119.117C74.2161 119.073 74.345 119.135 74.3834 119.213L76.3311 124.743C76.3694 124.822 76.3041 124.958 76.2263 125.001C76.2391 125.027 76.2004 125.016 76.1744 125.03Z" fill="#2D2A76"/>
<path d="M84.0965 129.796C84.0337 129.733 84.0097 129.615 84.0741 129.546C84.1386 129.476 89.4965 122.864 90.0904 122.133C90.1548 122.064 90.2696 122.032 90.3324 122.095C90.3952 122.158 90.4192 122.276 90.3547 122.346C89.7609 123.076 84.3773 129.703 84.3385 129.758C84.2741 129.827 84.1593 129.859 84.0965 129.796Z" fill="#2D2A76"/>
<path d="M85.2218 130.481L85.2092 130.455C85.1455 130.393 85.172 130.248 85.2492 130.205L89.8247 126.418C89.8893 126.35 90.0302 126.37 90.0682 126.447C90.1319 126.51 90.1053 126.655 90.0281 126.697L85.4526 130.484C85.3881 130.552 85.2855 130.544 85.2218 130.481Z" fill="#2D2A76"/>
<path d="M83.2056 128.839C83.1435 128.776 83.1324 128.683 83.1712 128.627L85.6135 123.044C85.6657 122.948 85.7677 122.889 85.8554 122.938C85.9431 122.986 85.9919 123.091 85.9398 123.187L83.4974 128.771C83.4453 128.867 83.3432 128.926 83.2556 128.877C83.2178 128.866 83.2178 128.866 83.2056 128.839Z" fill="#2D2A76"/>
<path d="M98.0687 130.695C97.9534 130.795 97.787 130.925 97.5707 131.016C97.4309 131.064 97.3166 131.097 97.1525 131.092C96.9628 131.102 96.7631 130.952 96.6134 130.84C96.4514 130.701 96.3272 130.574 96.2762 130.603C96.2629 130.644 96.325 130.708 96.386 130.838C96.4969 131.007 96.6566 131.279 96.7032 131.518C96.8097 131.954 96.3482 132.354 96.2195 132.494C96.1685 132.524 96.1807 132.55 96.1929 132.576C96.2051 132.602 96.2428 132.614 96.2561 132.573L96.2816 132.558C96.3204 132.502 96.3715 132.473 96.4358 132.403C96.59 132.247 96.8208 132.047 97.0238 131.996C97.189 131.934 97.3521 132.006 97.4896 132.092C97.4896 132.092 97.5018 132.118 97.5273 132.103C97.6771 132.216 97.8135 132.369 97.9134 132.444C98.0376 132.572 98.0886 132.542 98.1153 132.46C98.1153 132.46 98.1164 132.393 98.0787 132.382C97.9799 132.24 97.7448 131.945 97.6483 131.668C97.5995 131.564 97.6394 131.441 97.6794 131.319C97.7581 131.14 97.9123 130.985 98.0277 130.885C98.0665 130.829 98.1176 130.8 98.1431 130.785C98.1941 130.756 98.183 130.662 98.1708 130.636C98.2218 130.607 98.1586 130.61 98.0687 130.695Z" fill="#2D2A76"/>
<path d="M88.1702 145.927C88.3158 145.771 88.3217 145.519 88.1834 145.364C88.0451 145.208 87.815 145.208 87.6694 145.363C87.5238 145.519 87.5179 145.771 87.6562 145.926C87.7945 146.082 88.0246 146.082 88.1702 145.927Z" fill="#2D2A76"/>
<path d="M87.8533 48.993C87.6625 49.0701 87.2952 49.1165 86.8903 49.1516C86.4854 49.1866 85.7688 48.9705 85.3882 49.0578C85.021 49.1042 84.3753 49.1789 84.3753 49.1789C84.4453 48.7736 85.3241 47.602 85.6569 47.3433C85.9643 47.0993 86.5979 46.2354 86.599 46.1684C86.6001 46.1014 86.6278 45.9526 86.5014 45.9594C86.3749 45.9662 86.0154 46.3067 85.7713 46.5473C85.5272 46.7879 84.7795 46.9216 84.3967 47.1429C84.0395 47.3494 83.3738 47.8669 83.3738 47.8669C83.3738 47.8669 83.3738 47.8669 83.6202 46.7292C83.8666 45.5915 84.5213 44.9809 84.6766 44.7584C84.832 44.5359 84.964 44.1941 84.9407 44.0749C84.8797 43.9443 84.7499 44.152 84.6334 44.3189C84.5291 44.5119 83.9178 44.799 83.596 45.1508C83.262 45.4766 82.7971 46.0771 82.4365 46.4846C82.0892 46.8513 81.8341 46.9988 81.8341 46.9988C81.7986 46.8534 81.9617 46.1619 82.0395 45.2876C82.0918 44.428 82.163 43.1926 82.1663 42.9916C82.1697 42.7906 82.0199 42.6781 81.9777 42.9347C81.9477 43.2175 81.7003 43.6591 81.3485 44.2937C80.9846 44.9022 80.5373 45.9569 80.4785 46.4554C80.3941 46.9687 80.2044 46.9788 80.2044 46.9788C80.1057 46.8368 79.5546 45.0322 79.5346 44.712C79.5147 44.3917 78.999 43.4956 78.8259 43.2639C78.6529 43.0322 78.3733 43.1274 78.6462 43.4341C78.9191 43.7408 78.6792 45.2397 78.647 45.6564C78.6148 46.0731 78.6834 47.2609 78.6834 47.2609C78.6834 47.2609 77.9203 46.0433 77.4467 45.6536C76.973 45.2639 76.6048 44.6143 76.4439 44.4087C76.4073 44.3303 76.3696 44.3189 76.3319 44.3075C76.2454 44.1917 76.1833 44.1281 76.1833 44.1281C76.1833 44.1281 76.0069 44.0973 76.1289 44.3586C76.2509 44.6198 76.0666 45.8211 76.1952 46.4434C76.3615 47.0771 77.099 48.3095 77.099 48.3095C77.099 48.3095 75.8799 47.9195 75.3807 47.5446C75.069 47.2935 73.5924 47.185 73.435 46.7784C73.2775 46.3718 73.0711 46.6238 73.1931 46.8851C73.3151 47.1463 73.8308 48.0424 74.1193 48.1743C74.4077 48.3061 75.6877 49.5898 75.7609 49.7465C75.7609 49.7465 75.6566 49.9395 75.204 49.8031C74.7514 49.6666 73.6897 49.6832 73.0307 49.7988C72.3717 49.9143 71.8781 49.9675 71.6518 49.8993C71.4133 49.8049 71.4221 50.0321 71.6107 50.0889C71.7993 50.1458 72.8531 50.5981 73.6063 50.8926C74.3596 51.187 75.0274 51.2985 75.1017 51.3883C75.1017 51.3883 74.8965 51.5733 74.4383 51.7718C73.98 51.9703 73.2811 52.2085 72.8484 52.3923C72.4535 52.5874 71.9397 53.0835 71.7245 53.1084C71.5215 53.1594 71.3185 53.2104 71.3928 53.3001C71.4671 53.3899 71.821 53.3843 72.0873 53.3299C72.328 53.2903 73.1057 52.8739 74.1762 53.0844C75.2213 53.3097 75.2213 53.3096 75.2213 53.3096C75.2213 53.3096 74.519 53.7488 74.1983 54.0337C73.8655 54.2925 73.4493 54.9975 73.1686 55.1597C72.888 55.322 72.442 55.5466 72.3898 55.6431C72.3376 55.7396 72.463 55.7999 72.5129 55.8374C72.5883 55.8601 73.5535 55.5675 73.8731 55.3497C74.2181 55.117 75.5517 54.711 75.9288 54.8247C75.9288 54.8247 75.6281 55.4299 75.4073 55.7897C75.212 56.1349 75.0721 56.9456 74.889 57.3168C74.6804 57.7028 74.5228 58.0593 74.3686 58.2148C74.2265 58.3965 74.302 58.4192 74.4029 58.4272C74.5161 58.4613 74.8245 58.1503 75.2228 57.7542C75.609 57.3319 76.8539 56.181 77.0713 56.0221C77.2766 55.8371 77.2766 55.8371 77.2766 55.8371C77.2766 55.8371 76.816 56.9327 76.6939 57.4345C76.5718 57.9364 76.5539 59.0083 76.5628 59.2355C76.5716 59.4626 76.5949 59.5818 76.6981 59.4558C76.8013 59.3298 76.8857 58.8166 77.1842 58.3454C77.4571 57.8891 78.0008 57.1103 78.3083 56.1032C78.3083 56.1032 78.3181 57.0264 78.4745 57.5C78.6308 57.9736 78.7583 58.6629 78.5752 59.0342C78.4176 59.3906 78.3344 59.8369 78.4475 59.871C78.574 59.8642 79.0877 59.3682 79.1721 58.855C79.2565 58.3417 79.6749 56.7397 79.8425 56.5433C79.8425 56.5433 80.0222 56.373 80.1508 56.9954C80.2794 57.6177 80.6221 58.2821 80.9571 58.6525C81.2921 59.0228 81.3653 59.1795 81.4396 59.2693C81.5139 59.359 81.6537 59.3114 81.606 59.1399C81.5584 58.9684 81.2846 57.2025 81.2847 56.4394C81.3103 55.6616 81.5267 55.5697 81.5244 55.7037C81.5366 55.7298 81.5865 55.7673 81.6609 55.857C81.7463 56.0399 81.7951 56.1444 81.7951 56.1444C81.9315 56.2977 82.5526 56.9339 82.9897 57.2452C83.4134 57.5974 83.8372 57.9496 84.0868 58.1371C84.3108 58.3393 84.4662 58.1168 84.3675 57.9748C84.2687 57.8328 84.2721 57.6318 83.9992 57.3251C83.7519 57.0037 83.6244 56.3143 83.3682 55.7658C83.0998 55.1911 82.8968 55.2421 82.8225 55.1523C82.7348 55.1035 82.9024 54.9071 83.5547 55.1935C84.2069 55.48 85.5802 56.4775 85.7044 56.6048C85.8287 56.732 85.9319 56.606 85.8831 56.5015C85.8343 56.397 85.7356 56.255 85.567 55.7553C85.3729 55.2704 84.9537 54.6502 84.4922 54.2866C84.0186 53.8969 84.2349 53.805 84.2349 53.805C84.489 53.7245 85.9888 53.9523 86.4669 54.074C86.9074 54.1843 87.5697 53.8677 87.6096 53.7451C87.6496 53.6225 87.2469 53.5235 86.8675 53.5438C86.4881 53.5641 85.939 53.1517 85.6162 52.8075C85.2934 52.4633 84.5291 52.0757 84.5291 52.0757C85.4876 52.1851 86.3763 51.9368 86.8578 51.8575C87.3648 51.7635 87.8307 51.8591 87.9705 51.8114C88.1225 51.7899 88.0482 51.7002 87.8352 51.5911C87.6477 51.4672 86.7192 51.0751 86.2655 51.0056C85.7996 50.9101 84.7002 50.9153 84.7002 50.9153C84.7002 50.9153 84.7001 50.9153 84.9298 50.7825C85.1595 50.6498 86.6384 49.8612 87.1221 49.6479C87.6058 49.4346 87.9886 49.2133 88.0285 49.0907C88.0552 49.009 88.0441 48.9158 87.8533 48.993ZM76.9064 45.4683C76.8942 45.4422 76.8942 45.4422 76.882 45.4161C76.8942 45.4422 76.9064 45.4683 76.9064 45.4683Z" fill="#2D2A76"/>
<path d="M90.7824 202.95C90.798 202.775 99.3295 200.364 99.3096 200.044C99.2907 199.656 90.5918 201.501 90.4432 201.321C90.3201 201.127 97.5862 195.798 97.2368 195.536C96.9251 195.284 89.4859 200.381 89.3362 200.269C89.1864 200.157 89.6357 192.93 89.2829 192.868C88.9046 192.822 87.7465 200.126 87.5556 200.204C87.3648 200.281 83.5212 189.829 83.7373 191.264C83.9535 192.698 86.0468 200.512 85.8427 200.63C85.6385 200.748 79.6896 196.059 79.6352 196.289C79.6063 196.505 84.3248 202.237 84.2083 202.404C84.0918 202.571 77.6586 201.911 77.795 202.064C77.9059 202.232 84.1116 203.654 84.1071 203.922C84.1027 204.19 75.3269 207.605 75.6298 207.629C75.9327 207.653 84.8125 205.572 84.9112 205.714C85.0099 205.856 81.1795 211.255 81.3659 211.446C81.4901 211.573 85.9949 206.646 86.0559 206.777C86.1047 206.881 85.0697 214.381 85.4613 214.386C85.6887 214.388 87.7366 206.767 87.7366 206.767C87.8475 206.936 90.6376 214.645 90.7652 214.571C90.8928 214.498 89.1634 206.075 89.342 205.972C89.5328 205.895 94.2715 210.421 94.3624 210.269C94.4279 210.132 90.6435 204.457 90.7068 204.453C90.77 204.45 97.5804 205.224 97.6337 205.06C97.7491 204.96 90.7669 203.125 90.7824 202.95Z" fill="#2D2A76"/>
<path d="M39.2509 141.772C39.2532 141.638 45.7278 139.819 45.7067 139.566C45.6735 139.287 39.0924 140.67 38.9937 140.528C38.895 140.386 44.3959 136.343 44.1463 136.155C43.8967 135.968 38.2727 139.816 38.1474 139.756C38.0475 139.681 38.3667 134.188 38.0894 134.149C37.8121 134.111 36.936 139.66 36.7962 139.708C36.6686 139.782 33.7432 131.851 33.8895 132.928C34.0479 134.031 35.6424 139.944 35.4893 140.032C35.3362 140.121 30.8215 136.56 30.7804 136.749C30.7649 136.924 34.3442 141.258 34.2787 141.395C34.2133 141.533 29.3066 141.019 29.4308 141.146C29.5295 141.288 34.212 142.363 34.2087 142.564C34.2053 142.765 27.5409 145.357 27.7805 145.385C28.0201 145.412 34.731 143.821 34.8175 143.937C34.904 144.053 31.9802 148.132 32.1422 148.271C32.2165 148.361 35.665 144.642 35.7016 144.72C35.7382 144.798 34.9608 150.49 35.2515 150.488C35.4156 150.492 36.9907 144.705 36.9907 144.705C37.0894 144.847 39.203 150.692 39.2796 150.647C39.3561 150.603 38.048 144.193 38.2133 144.131C38.3786 144.068 41.9603 147.505 42.0003 147.382C42.0524 147.286 39.1675 142.982 39.2308 142.978C39.2685 142.99 44.4647 143.569 44.5047 143.446C44.5325 143.297 39.2487 141.906 39.2509 141.772Z" fill="#2D2A76"/>
<path d="M81.691 256.387C81.529 256.248 76.0503 251.385 75.9416 251.083C75.8451 250.807 76.0359 250.73 76.3388 250.754C76.6539 250.804 83.048 254.573 83.1402 254.354C83.2323 254.135 82.7893 248.882 82.9668 248.846C83.1443 248.809 84.6646 253.871 84.8288 253.875C85.0052 253.906 90.2126 247.775 90.3879 247.873C90.5376 247.985 86.2498 255.045 86.536 255.311C86.8477 255.562 92.1431 254.756 92.2407 254.965C92.3383 255.175 86.6999 256.842 86.7343 257.055C86.7809 257.293 92.405 261.774 92.4771 261.997C92.5236 262.236 92.3184 262.421 92.1043 262.379C91.8646 262.352 85.7478 258.621 85.6457 258.68C85.5692 258.724 86.4692 264.609 86.3782 264.761C86.2994 264.939 86.0076 265.009 85.8612 264.695C85.7148 264.381 84.3908 259.671 84.2666 259.544C84.1423 259.417 79.1834 265.802 79.0569 265.809C78.9304 265.816 78.7052 265.681 78.8895 265.242C79.0737 264.804 82.2864 258.565 82.2642 258.379C82.2421 258.192 77.1908 258.757 77.0155 258.66C76.828 258.536 76.6916 258.382 77.1376 258.157C77.5714 257.907 81.8118 256.715 81.8518 256.593C81.8773 256.578 81.8285 256.473 81.691 256.387Z" fill="#2D2A76"/>
<path d="M93.0291 82.9161C92.9692 82.7184 91.2119 75.2059 91.293 74.8935C91.374 74.5812 91.5626 74.638 91.7612 74.8551C91.9597 75.0721 95.0639 82.1376 95.2303 82.0082C95.3968 81.8788 97.8526 77.0736 98.0035 77.1191C98.1666 77.1907 96.6758 82.4665 96.8001 82.5938C96.9243 82.7211 104.29 80.519 104.35 80.7167C104.41 80.9143 97.2868 84.4694 97.381 84.8795C97.4753 85.2896 102.11 87.72 102.068 87.9767C102.026 88.2334 96.6874 86.3094 96.5953 86.5286C96.5032 86.7478 98.5934 94.0014 98.5135 94.2468C98.4335 94.4921 98.1806 94.5056 98.0186 94.367C97.8445 94.2022 94.9644 87.339 94.8889 87.3163C94.788 87.3083 92.3941 92.9404 92.241 93.029C92.0624 93.1323 91.8372 92.997 91.8805 92.6733C91.9371 92.3087 93.3701 87.4645 93.3358 87.252C93.3136 87.0657 85.9922 89.6404 85.8924 89.5654C85.7925 89.4904 85.6827 89.2552 86.0666 88.9668C86.4372 88.7193 92.2832 85.2058 92.362 85.0275C92.4408 84.8492 88.1611 82.3463 88.0635 82.1373C88.0036 81.9396 87.9315 81.7158 88.4108 81.7705C88.8901 81.8252 92.8837 83.2989 92.9736 83.2137C93.0757 83.1547 93.0768 83.0876 93.0291 82.9161Z" fill="#2D2A76"/>
<path d="M148.261 220.626C148.237 220.507 147.777 216.259 147.831 216.096C147.884 215.932 147.997 215.966 148.096 216.108C148.195 216.25 149.402 220.364 149.504 220.305C149.606 220.246 151.24 217.775 151.327 217.824C151.415 217.873 150.256 220.667 150.331 220.756C150.393 220.82 154.523 220.157 154.547 220.277C154.57 220.396 150.477 221.833 150.486 222.061C150.532 222.299 152.867 223.969 152.828 224.091C152.788 224.214 150.032 222.754 149.966 222.892C149.889 223.003 150.565 227.159 150.5 227.296C150.434 227.434 150.295 227.414 150.221 227.324C150.147 227.235 149.026 223.237 148.976 223.199C148.938 223.188 147.259 226.117 147.183 226.161C147.08 226.22 146.968 226.119 147.009 225.929C147.051 225.74 148.155 223.176 148.157 223.042C148.146 222.949 144.024 223.839 143.962 223.775C143.912 223.738 143.877 223.593 144.081 223.475C144.285 223.356 147.697 221.848 147.749 221.752C147.801 221.655 145.644 219.949 145.62 219.83C145.597 219.711 145.574 219.591 145.825 219.645C146.077 219.698 148.156 220.819 148.207 220.79C148.27 220.786 148.272 220.719 148.261 220.626Z" fill="#2D2A76"/>
<path d="M127.445 255.573C127.296 255.393 122.075 248.722 122.017 248.39C121.96 248.059 122.188 247.993 122.502 248.11C122.816 248.227 129.294 253.773 129.424 253.565C129.554 253.358 130.022 247.279 130.212 247.269C130.401 247.259 131.185 253.31 131.373 253.367C131.562 253.424 138.459 247.511 138.633 247.675C138.807 247.84 132.749 254.995 133.046 255.354C133.343 255.713 139.369 255.846 139.427 256.11C139.486 256.375 132.928 257.114 132.936 257.409C132.931 257.677 138.4 263.906 138.445 264.212C138.453 264.506 138.198 264.653 137.946 264.6C137.682 264.52 131.531 259.051 131.442 259.069C131.328 259.102 131.289 265.961 131.16 266.168C131.018 266.35 130.701 266.367 130.619 265.983C130.512 265.614 129.886 259.969 129.775 259.801C129.664 259.633 122.989 265.883 122.85 265.863C122.711 265.844 122.487 265.642 122.76 265.185C123.033 264.728 127.74 258.289 127.732 258.062C127.723 257.835 122.017 257.484 121.843 257.319C121.669 257.154 121.52 256.975 122.067 256.758C122.588 256.556 127.538 256.05 127.603 255.913C127.618 255.805 127.581 255.726 127.445 255.573Z" fill="#2D2A76"/>
<path d="M68.0082 37.7121C65.9499 36.0804 63.9837 34.9931 61.0839 36.8366C63.086 34.2506 63.0496 31.8809 61.5384 29.2686C63.6333 30.9787 65.7139 32.0331 68.5747 30.2453C66.5605 32.8051 66.6091 35.201 68.0082 37.7121Z" fill="#2D2A76"/>
<path d="M105.062 188.344C105.115 188.306 105.132 188.231 105.1 188.176C105.067 188.122 104.998 188.109 104.945 188.147C104.892 188.185 104.875 188.26 104.908 188.314C104.94 188.369 105.009 188.382 105.062 188.344Z" fill="#2D2A76"/>
<path d="M96.0703 177.252C96.0703 177.252 96.0827 177.278 96.0703 177.252C96.2091 177.339 96.3621 177.317 96.4399 177.206C96.5434 177.08 96.4947 176.909 96.3939 176.833L93.0808 174.24C93.0808 174.24 93.0808 174.24 93.0552 174.255C93.0552 174.255 93.0552 174.255 93.0676 174.281L96.0703 177.252Z" fill="#2D2A76"/>
<path d="M96.7097 177.408L96.7573 177.58L96.7163 177.769L96.8816 177.707L97.058 177.738L97.0103 177.566L97.0514 177.377L96.8861 177.439L96.8606 177.454L96.7097 177.408Z" fill="#2D2A76"/>
<path d="M95.057 179.412C95.057 179.412 95.0692 179.438 95.057 179.412C95.2212 179.417 95.3622 179.302 95.3643 179.169C95.392 179.02 95.2932 178.878 95.1545 178.859L90.9772 178.452L90.9517 178.466L90.9639 178.492L95.057 179.412Z" fill="#2D2A76"/>
<path d="M95.979 179.475L96.1446 179.412L96.0204 179.285L95.9729 179.114L95.8694 179.24L95.8438 179.255L95.7038 179.302L95.828 179.429L95.8755 179.601L95.979 179.475Z" fill="#2D2A76"/>
<path d="M95.3637 181.85C95.4927 181.78 95.5575 181.647 95.5194 181.506C95.4555 181.378 95.327 181.318 95.1853 181.363L91.1901 183.146C91.1901 183.146 91.1901 183.146 91.1643 183.16L91.1771 183.185L95.3122 181.878C95.3637 181.85 95.3637 181.85 95.3637 181.85Z" fill="#2D2A76"/>
<path d="M95.9533 181.198L95.9256 181.347C95.9256 181.347 95.9256 181.347 95.9122 181.388L95.809 181.514L95.9854 181.544L96.1097 181.671L96.1508 181.482L96.2795 181.341L96.1031 181.31L95.9533 181.198Z" fill="#2D2A76"/>
<path d="M96.7992 183.79C96.9024 183.666 96.8537 183.496 96.753 183.421C96.6398 183.321 96.4738 183.382 96.3962 183.492L93.7323 187.104C93.7323 187.104 93.7323 187.104 93.7447 187.13C93.7447 187.13 93.7447 187.13 93.7703 187.115L96.7992 183.79C96.7736 183.804 96.7736 183.804 96.7992 183.79Z" fill="#2D2A76"/>
<path d="M96.9834 183.17L96.9423 183.36L97.1077 183.298L97.2841 183.328L97.2364 183.157L97.2775 182.967L97.1122 183.03L96.9357 182.999L96.9834 183.17Z" fill="#2D2A76"/>
<path d="M99.0578 184.794C99.0855 184.645 98.9866 184.503 98.8479 184.484C98.7091 184.464 98.5682 184.579 98.5405 184.728L97.8734 189.201L97.8856 189.227L97.9111 189.212L99.0578 184.794C99.0322 184.809 99.0322 184.809 99.0578 184.794Z" fill="#2D2A76"/>
<path d="M98.8575 184.013L98.6919 184.076L98.8039 184.177L98.8161 184.203L98.8513 184.348L98.9804 184.207L99.146 184.144L99.0218 184.018L98.9744 183.847L98.8575 184.013Z" fill="#2D2A76"/>
<path d="M101.107 184.476C100.977 184.549 100.912 184.685 100.95 184.83L102.537 188.897C102.537 188.897 102.537 188.897 102.55 188.923L102.576 188.909L101.467 184.674L101.454 184.648C101.403 184.477 101.249 184.43 101.107 184.476Z" fill="#2D2A76"/>
<path d="M100.886 183.799L100.845 183.988L100.716 184.129L100.855 184.148C100.855 184.148 100.855 184.148 100.892 184.16L101.004 184.261L101.045 184.071L101.174 183.931L100.998 183.9L100.886 183.799Z" fill="#2D2A76"/>
<path d="M103.489 183.272C103.476 183.246 103.476 183.246 103.489 183.272C103.35 183.186 103.197 183.207 103.119 183.318C103.015 183.444 103.064 183.616 103.165 183.691L106.478 186.284C106.478 186.284 106.478 186.284 106.504 186.269C106.504 186.269 106.504 186.269 106.491 186.243L103.489 183.272Z" fill="#2D2A76"/>
<path d="M102.835 183.09L102.787 182.918L102.829 182.729L102.663 182.791L102.487 182.76L102.534 182.932L102.493 183.122L102.659 183.059L102.684 183.044L102.835 183.09Z" fill="#2D2A76"/>
<path d="M104.501 181.111C104.489 181.085 104.489 181.085 104.501 181.111C104.337 181.106 104.196 181.221 104.194 181.354C104.166 181.503 104.265 181.645 104.403 181.664L108.581 182.072L108.606 182.057L108.594 182.031L104.501 181.111Z" fill="#2D2A76"/>
<path d="M103.567 181.023L103.401 181.086L103.525 181.213L103.573 181.384L103.676 181.258L103.702 181.243L103.842 181.195L103.718 181.068L103.67 180.897L103.567 181.023Z" fill="#2D2A76"/>
<path d="M108.355 177.353L104.22 178.661L104.194 178.675C104.065 178.745 104.001 178.877 104.039 179.019C104.103 179.146 104.231 179.206 104.373 179.161L108.368 177.378C108.368 177.378 108.394 177.364 108.355 177.353C108.381 177.339 108.381 177.339 108.355 177.353Z" fill="#2D2A76"/>
<path d="M103.647 179.138L103.775 178.997L103.599 178.966L103.475 178.839L103.434 179.029L103.305 179.169L103.481 179.2L103.606 179.327L103.647 179.138Z" fill="#2D2A76"/>
<path d="M102.785 176.721C102.682 176.845 102.73 177.014 102.831 177.089C102.944 177.189 103.11 177.128 103.188 177.019L105.852 173.407C105.852 173.407 105.852 173.407 105.84 173.381C105.84 173.381 105.84 173.381 105.814 173.395L102.785 176.721C102.773 176.695 102.785 176.721 102.785 176.721Z" fill="#2D2A76"/>
<path d="M102.3 177.182L102.348 177.354L102.307 177.543L102.472 177.481L102.648 177.512L102.601 177.34L102.588 177.314L102.642 177.15L102.476 177.213L102.3 177.182Z" fill="#2D2A76"/>
<path d="M100.527 175.717C100.499 175.866 100.598 176.008 100.737 176.027C100.876 176.047 101.017 175.932 101.044 175.783L101.712 171.31L101.699 171.284L101.674 171.298L100.527 175.717C100.515 175.69 100.527 175.717 100.527 175.717Z" fill="#2D2A76"/>
<path d="M100.7 176.51L100.865 176.447L100.753 176.346L100.741 176.32L100.706 176.175L100.577 176.316L100.411 176.379L100.535 176.505L100.583 176.676L100.7 176.51Z" fill="#2D2A76"/>
<path d="M98.4376 176.021C98.5671 175.949 98.6325 175.812 98.5947 175.667L97.0076 171.6C97.0076 171.6 97.0076 171.6 96.9948 171.574L96.9689 171.589L98.0776 175.824L98.0903 175.85C98.1536 176.047 98.3081 176.094 98.4376 176.021Z" fill="#2D2A76"/>
<path d="M98.672 176.725L98.7131 176.536L98.8418 176.395L98.7031 176.376C98.7031 176.376 98.7031 176.376 98.6654 176.364L98.5533 176.263L98.5123 176.453L98.3835 176.594L98.5599 176.624L98.672 176.725Z" fill="#2D2A76"/>
<path d="M102.331 181.61C102.369 181.621 102.394 181.607 102.42 181.592C102.445 181.577 102.445 181.577 102.459 181.536C102.498 181.481 102.473 181.428 102.423 181.391L102.411 181.365C102.621 180.912 102.73 180.451 102.737 179.981L102.763 179.967C102.788 179.952 102.788 179.952 102.814 179.937C102.839 179.922 102.853 179.882 102.866 179.841C102.867 179.774 102.817 179.736 102.766 179.766L102.741 179.78C102.723 179.326 102.604 178.864 102.371 178.434L102.397 178.42C102.448 178.39 102.449 178.323 102.425 178.271C102.4 178.218 102.337 178.222 102.286 178.251L102.261 178.266C102.014 177.878 101.678 177.574 101.29 177.367L101.303 177.326C101.342 177.271 101.318 177.218 101.268 177.181C101.218 177.143 101.167 177.173 101.128 177.229L101.115 177.269C100.701 177.077 100.273 176.993 99.8302 177.017L99.818 176.99C99.8191 176.923 99.7692 176.886 99.7182 176.915C99.655 176.919 99.6161 176.974 99.6405 177.027L99.6527 177.053C99.2223 177.103 98.7775 177.26 98.3815 177.522L98.3693 177.496C98.3449 177.444 98.2817 177.447 98.2306 177.477C98.1796 177.506 98.1785 177.573 98.2029 177.626L98.2151 177.652C97.8313 177.94 97.5217 178.318 97.2998 178.745L97.2621 178.734C97.2122 178.696 97.1612 178.726 97.1224 178.781C97.0835 178.837 97.1079 178.889 97.1578 178.927L97.1956 178.938C96.9859 179.391 96.8771 179.852 96.8693 180.321L96.8438 180.336C96.7806 180.34 96.7417 180.395 96.7661 180.448C96.765 180.515 96.8149 180.552 96.866 180.523L96.8915 180.508C96.9092 180.962 97.0278 181.424 97.2486 181.828L97.223 181.843C97.172 181.872 97.1709 181.939 97.1953 181.991C97.2197 182.044 97.2829 182.04 97.334 182.011L97.3595 181.996C97.6057 182.385 97.9418 182.688 98.33 182.895L98.3167 182.936C98.2779 182.991 98.3023 183.044 98.3522 183.081C98.3899 183.093 98.4154 183.078 98.4409 183.063C98.4664 183.048 98.4664 183.048 98.4797 183.007L98.4931 182.967C98.9068 183.159 99.335 183.243 99.7776 183.219L99.7898 183.245C99.7886 183.312 99.8386 183.35 99.8896 183.32C99.9151 183.306 99.9151 183.306 99.9406 183.291C99.9661 183.276 99.9794 183.235 99.9928 183.194L99.9806 183.168C100.411 183.119 100.856 182.961 101.277 182.684L101.29 182.71C101.314 182.762 101.377 182.759 101.428 182.729C101.479 182.7 101.48 182.633 101.456 182.581L101.444 182.555C101.788 182.389 102.097 182.011 102.331 181.61ZM97.527 181.8C96.7772 180.541 97.1601 178.793 98.4258 177.895C99.666 177.012 101.291 177.3 102.053 178.585C102.803 179.844 102.42 181.592 101.154 182.49C99.914 183.373 98.2889 183.085 97.527 181.8Z" fill="#2D2A76"/>
<path d="M101.014 179.486C100.887 179.56 100.504 179.781 100.202 179.69C100.246 179.366 100.404 178.943 100.456 178.846C100.495 178.79 100.37 178.73 100.343 178.812C100.303 178.935 100.184 179.302 99.9273 179.517C99.6289 179.225 99.447 178.766 99.3705 178.81C99.2939 178.854 99.5268 179.284 99.4824 179.675C99.0653 179.683 98.6383 179.532 98.6116 179.614C98.585 179.696 99.0753 179.844 99.3105 180.139C99.1418 180.402 98.9244 180.561 98.7458 180.665C98.5162 180.797 98.6792 180.869 98.768 180.851C98.819 180.821 99.1762 180.615 99.4547 180.587C99.4879 180.866 99.4457 181.123 99.367 181.301C99.2616 181.561 99.4779 181.469 99.5045 181.387C99.5434 181.332 99.6377 180.979 99.793 180.756C99.9904 181.04 100.148 181.447 100.211 181.443C100.274 181.44 100.338 181.437 100.278 181.239C100.254 181.12 100.132 180.859 100.099 180.579C100.453 180.574 100.93 180.762 100.969 180.707C101.008 180.651 101.047 180.596 100.871 180.498C100.746 180.437 100.406 180.335 100.233 180.103C100.477 179.863 100.898 179.653 101.012 179.62C101.114 179.561 101.091 179.442 101.014 179.486Z" fill="#2D2A76"/>
<path d="M157.523 173.357C157.692 173.26 157.763 173.04 157.682 172.867C157.602 172.693 157.399 172.632 157.23 172.73C157.061 172.828 156.989 173.047 157.07 173.22C157.151 173.394 157.354 173.455 157.523 173.357Z" fill="#2D2A76"/>
<path d="M153.883 176.261C154.081 176.147 154.164 175.89 154.07 175.688C153.975 175.486 153.739 175.415 153.542 175.529C153.344 175.643 153.261 175.899 153.355 176.101C153.45 176.303 153.686 176.375 153.883 176.261Z" fill="#2D2A76"/>
<path d="M157.735 170.449C157.625 170.214 154.26 169.604 153.988 169.23C153.716 168.856 157.053 165.865 156.78 165.558C156.593 165.367 154.195 167.451 153.875 167.669C153.556 167.887 153.541 167.995 153.306 167.7C153.071 167.404 153.516 164.193 153.049 164.164C152.683 164.144 152.393 167.896 151.872 168.031C151.364 168.192 149.69 164.746 149.272 164.755C148.766 164.782 149.384 165.619 149.948 166.688C150.474 167.744 151.187 168.925 150.776 169.295C150.366 169.665 148.001 168.975 147.303 169.146C146.846 169.278 146.969 169.472 147.206 169.634C147.431 169.769 148.592 169.894 149.5 170.033C150.37 170.161 150.785 170.286 150.23 170.972C149.687 171.684 147.738 173.342 148.091 173.403C148.432 173.439 150.547 171.651 151.018 171.479C151.514 171.291 151.601 171.407 151.638 172.945C151.676 174.484 151.23 176.168 151.646 176.226C151.999 176.288 152.715 172.057 152.959 171.817C153.203 171.576 153.978 172.887 154.666 174.015C155.33 175.158 155.563 174.825 155.631 174.553C155.699 174.282 153.754 171.158 153.96 170.906C154.167 170.654 155.805 170.968 156.766 170.943C157.764 170.93 157.82 170.632 157.735 170.449Z" fill="#2D2A76"/>
<path d="M147.302 166.432C147.485 166.326 147.562 166.088 147.475 165.901C147.387 165.713 147.168 165.647 146.984 165.752C146.801 165.858 146.724 166.096 146.811 166.284C146.899 166.472 147.119 166.538 147.302 166.432Z" fill="#2D2A76"/>
<path d="M151.153 163.749C151.294 163.668 151.353 163.485 151.286 163.341C151.218 163.196 151.049 163.145 150.909 163.227C150.768 163.308 150.708 163.491 150.776 163.635C150.843 163.78 151.012 163.831 151.153 163.749Z" fill="#2D2A76"/>
<path d="M155.064 164.543C155.219 164.453 155.285 164.252 155.211 164.093C155.137 163.934 154.951 163.878 154.796 163.968C154.641 164.057 154.575 164.259 154.65 164.418C154.724 164.576 154.909 164.633 155.064 164.543Z" fill="#2D2A76"/>
<path d="M146.587 171.782C146.742 171.693 146.807 171.491 146.733 171.332C146.659 171.174 146.473 171.118 146.318 171.207C146.163 171.297 146.098 171.498 146.172 171.657C146.246 171.815 146.432 171.872 146.587 171.782Z" fill="#2D2A76"/>
<path d="M149.81 174.894C149.993 174.788 150.071 174.55 149.983 174.362C149.896 174.175 149.676 174.108 149.493 174.214C149.31 174.32 149.232 174.558 149.32 174.746C149.407 174.933 149.627 175 149.81 174.894Z" fill="#2D2A76"/>
<path d="M158.234 168.438C158.361 168.365 158.414 168.2 158.353 168.07C158.293 167.941 158.141 167.895 158.014 167.968C157.887 168.041 157.834 168.206 157.894 168.336C157.955 168.466 158.107 168.511 158.234 168.438Z" fill="#2D2A76"/>
<path d="M106.574 116.7C106.646 116.494 106.573 116.283 106.41 116.229C106.247 116.174 106.057 116.297 105.984 116.503C105.912 116.71 105.985 116.921 106.148 116.975C106.311 117.029 106.502 116.906 106.574 116.7Z" fill="#2D2A76"/>
<path d="M105.898 121.296C105.983 121.055 105.897 120.809 105.707 120.746C105.517 120.683 105.295 120.826 105.21 121.067C105.126 121.307 105.211 121.553 105.401 121.617C105.591 121.68 105.814 121.536 105.898 121.296Z" fill="#2D2A76"/>
<path d="M104.982 114.2C104.743 114.106 101.751 116.168 101.297 116.098C100.843 116.029 101.474 111.55 101.057 111.559C100.792 111.546 100.296 114.719 100.189 115.113C100.081 115.507 100.143 115.571 99.7769 115.55C99.3985 115.504 97.6579 113.026 97.2606 113.355C96.9653 113.626 99.1819 116.359 98.8833 116.83C98.5847 117.301 95.0639 116.218 94.7431 116.503C94.3702 116.884 95.4044 117.017 96.524 117.331C97.6436 117.646 98.9153 117.94 98.8552 118.505C98.7952 119.071 96.4868 120.306 96.0838 120.97C95.7985 121.401 96.0504 121.454 96.3301 121.359C96.5842 121.278 97.5831 120.502 98.3378 119.966C99.118 119.415 99.4754 119.209 99.5241 120.076C99.5727 120.944 99.1505 123.511 99.4579 123.267C99.7654 123.023 100.203 120.281 100.464 119.798C100.725 119.316 100.864 119.335 101.921 120.35C102.978 121.364 103.699 122.839 104.058 122.565C104.365 122.321 102.172 118.944 102.19 118.635C102.208 118.326 103.695 118.594 104.929 118.876C106.188 119.144 106.144 118.771 106.022 118.51C105.886 118.289 102.384 117.593 102.352 117.247C102.32 116.9 103.815 115.937 104.548 115.214C105.318 114.504 105.17 114.257 104.982 114.2Z" fill="#2D2A76"/>
<path d="M94.3784 118.731C94.4568 118.508 94.3774 118.279 94.2011 118.22C94.0247 118.162 93.8182 118.295 93.7398 118.518C93.6613 118.742 93.7407 118.97 93.9171 119.029C94.0935 119.088 94.3 118.955 94.3784 118.731Z" fill="#2D2A76"/>
<path d="M95.3422 114.163C95.4025 113.991 95.3413 113.815 95.2056 113.77C95.0699 113.725 94.9111 113.827 94.8508 113.999C94.7906 114.17 94.8517 114.346 94.9874 114.392C95.1231 114.437 95.282 114.334 95.3422 114.163Z" fill="#2D2A76"/>
<path d="M98.7091 112.031C98.7754 111.842 98.7082 111.649 98.559 111.599C98.4097 111.549 98.2349 111.662 98.1686 111.851C98.1022 112.04 98.1695 112.233 98.3187 112.283C98.468 112.333 98.6427 112.22 98.7091 112.031Z" fill="#2D2A76"/>
<path d="M97.5411 123.1C97.6074 122.911 97.5402 122.718 97.3909 122.668C97.2416 122.618 97.0669 122.731 97.0005 122.92C96.9342 123.109 97.0014 123.302 97.1506 123.352C97.2999 123.402 97.4747 123.289 97.5411 123.1Z" fill="#2D2A76"/>
<path d="M102.033 123.136C102.111 122.913 102.032 122.684 101.856 122.625C101.679 122.566 101.473 122.7 101.394 122.923C101.316 123.146 101.395 123.375 101.572 123.434C101.748 123.493 101.955 123.359 102.033 123.136Z" fill="#2D2A76"/>
<path d="M103.684 112.638C103.738 112.483 103.683 112.325 103.561 112.284C103.439 112.243 103.296 112.336 103.242 112.49C103.188 112.645 103.243 112.803 103.365 112.844C103.487 112.885 103.63 112.792 103.684 112.638Z" fill="#2D2A76"/>
<path d="M134.737 224.383C134.612 224.256 136.234 222.591 136.035 222.441C135.847 222.317 132.938 223.035 132.904 222.823C132.869 222.611 136.078 222.118 135.957 221.79C135.836 221.462 134.337 220.339 134.492 220.184C134.608 220.017 136.252 221.52 136.336 221.075C136.419 220.629 136.008 218.017 136.211 217.966C136.427 217.941 136.573 220.54 136.95 220.654C137.177 220.722 138.483 219.007 138.62 219.161C138.756 219.314 137.521 220.556 137.547 221.237C137.574 221.917 140.826 221.101 140.86 221.314C140.894 221.526 137.713 221.937 137.64 222.475C137.568 223.014 139.27 224.086 139.14 224.294C139.01 224.501 137.367 222.931 137.174 223.142C136.8 223.523 137.153 225.871 136.975 225.907C136.709 225.962 136.782 223.137 136.377 223.105C135.81 223.001 134.861 224.51 134.737 224.383Z" fill="#2D2A76"/>
<path d="M73.3403 44.3617C73.0568 44.5224 72.7373 44.4708 72.5481 44.2123L71.0093 42.1595C70.9717 42.081 70.921 42.0433 70.9092 41.9503C70.8584 41.9126 70.7951 41.8487 70.7443 41.811L69.2055 39.7581C69.0038 39.4736 69.0599 39.0429 69.3441 38.8153C69.6284 38.5878 70.0377 38.6217 70.2393 38.9063L71.7782 40.9592C71.8157 41.0376 71.8665 41.0753 71.8783 41.1684C71.929 41.2061 71.9924 41.2699 72.0431 41.3076L73.582 43.3605C73.7836 43.6451 73.7276 44.0757 73.4433 44.3033C73.4176 44.3179 73.3918 44.3325 73.3403 44.3617Z" fill="#2D2A76"/>
<path d="M90.7246 74.2059C90.6986 74.2202 90.6986 74.2202 90.7246 74.2059C90.3863 74.3921 89.9838 74.2482 89.8546 73.9207L89.3377 72.7438C89.2989 72.6655 89.299 72.5989 89.2992 72.5324C89.2473 72.4946 89.2085 72.4163 89.1827 72.3641L88.1098 69.9984C87.9546 69.6852 88.1116 69.2666 88.424 69.0948C88.7363 68.9229 89.1388 69.0667 89.294 69.3799L90.3669 71.7456C90.4057 71.8239 90.4055 71.8904 90.4053 71.957C90.4572 71.9948 90.496 72.0731 90.5219 72.1253L91.0388 73.3023C91.168 73.6298 91.037 74.034 90.7246 74.2059ZM87.8552 67.8799C87.8552 67.8799 87.8291 67.8942 87.8552 67.8799C87.5168 68.0661 87.1143 67.9223 86.9851 67.5948L86.8172 67.189C86.662 66.8758 86.819 66.4573 87.1313 66.2854C87.4436 66.1135 87.8462 66.2574 88.0014 66.5705L88.1693 66.9763C88.2985 67.3038 88.1675 67.7081 87.8552 67.8799ZM86.5883 65.1227C86.25 65.3089 85.8475 65.1651 85.7183 64.8376L84.6455 62.4719C84.6067 62.3936 84.6068 62.3271 84.607 62.2605C84.5551 62.2227 84.5163 62.1444 84.4775 62.0661L83.4047 59.7004C83.2495 59.3872 83.4065 58.9687 83.7188 58.7968C84.0312 58.6249 84.4337 58.7688 84.5889 59.0819L85.6617 61.4477C85.7005 61.5259 85.7004 61.5925 85.7002 61.659C85.7521 61.6969 85.7909 61.7752 85.8297 61.8535L86.9025 64.2192C87.0316 64.5467 86.9007 64.9509 86.5883 65.1227Z" fill="#2D2A76"/>
<path d="M99.6183 110.898C99.5668 110.927 99.4895 110.971 99.4255 110.974C99.0667 111.045 98.7625 110.819 98.7158 110.447L98.505 108.838C98.5058 108.771 98.4942 108.678 98.5207 108.597C98.4958 108.545 98.4584 108.466 98.4467 108.373L98.1076 105.741C98.0609 105.368 98.2951 105.036 98.654 104.965C99.0129 104.894 99.317 105.12 99.3637 105.492L99.7028 108.125C99.702 108.192 99.7137 108.285 99.6871 108.366C99.7121 108.419 99.7495 108.497 99.7487 108.564L99.9595 110.172C100.007 110.478 99.85 110.766 99.6183 110.898ZM98.6452 103.574C98.5937 103.603 98.5164 103.647 98.4524 103.65C98.0935 103.721 97.7894 103.495 97.7427 103.123L97.6968 102.684C97.6502 102.311 97.8844 101.979 98.2432 101.908C98.6021 101.837 98.9063 102.063 98.953 102.435L98.9988 102.875C99.0338 103.154 98.8769 103.442 98.6452 103.574ZM98.2344 100.517C98.1829 100.546 98.1057 100.59 98.0417 100.593C97.6828 100.664 97.3786 100.438 97.332 100.066L96.9929 97.4336C96.9937 97.3667 96.982 97.2736 97.0086 97.192C96.9836 97.1397 96.9462 97.0613 96.947 96.9944L96.6079 94.362C96.5612 93.9897 96.7954 93.6573 97.1543 93.5863C97.5132 93.5154 97.8173 93.7414 97.864 94.1137L98.2031 96.7461C98.2023 96.813 98.214 96.9061 98.1874 96.9876C98.2124 97.0399 98.2498 97.1184 98.249 97.1853L98.5881 99.8177C98.6106 100.071 98.4662 100.385 98.2344 100.517Z" fill="#2D2A76"/>
<path d="M118.393 145.4C118.081 145.573 117.731 145.467 117.55 145.168L116.621 143.621C116.441 143.322 116.533 142.906 116.858 142.693C117.157 142.495 117.559 142.572 117.753 142.897L118.681 144.444C118.862 144.743 118.77 145.159 118.445 145.372C118.419 145.386 118.419 145.386 118.393 145.4ZM116.135 141.631C115.823 141.803 115.473 141.697 115.293 141.398L115.073 141.021C114.893 140.722 114.985 140.306 115.284 140.107C115.583 139.909 115.985 139.986 116.166 140.285L116.385 140.662C116.566 140.961 116.473 141.377 116.174 141.576C116.161 141.616 116.135 141.631 116.135 141.631ZM114.548 139.019C114.236 139.191 113.886 139.085 113.706 138.786L112.377 136.563C112.338 136.485 112.313 136.433 112.3 136.34C112.248 136.302 112.184 136.238 112.158 136.186L110.829 133.963C110.648 133.664 110.741 133.248 111.066 133.035C111.365 132.837 111.767 132.914 111.96 133.239L113.289 135.462C113.328 135.54 113.353 135.592 113.366 135.685C113.418 135.723 113.482 135.787 113.508 135.839L114.837 138.062C115.018 138.361 114.925 138.777 114.6 138.99C114.6 138.99 114.574 139.004 114.548 139.019ZM110.343 131.972C110.031 132.145 109.681 132.039 109.5 131.74L109.281 131.363C109.1 131.064 109.193 130.648 109.518 130.435C109.817 130.236 110.219 130.314 110.412 130.639L110.632 131.016C110.812 131.315 110.72 131.731 110.395 131.944C110.369 131.958 110.343 131.972 110.343 131.972ZM108.769 129.387C108.457 129.559 108.107 129.453 107.926 129.154L106.598 126.931C106.559 126.853 106.533 126.801 106.521 126.708C106.469 126.67 106.404 126.606 106.378 126.554L105.05 124.331C104.869 124.032 104.961 123.616 105.286 123.403C105.585 123.205 105.987 123.282 106.181 123.607L107.51 125.83C107.548 125.908 107.574 125.96 107.587 126.053C107.638 126.091 107.703 126.155 107.729 126.207L109.058 128.43C109.238 128.729 109.146 129.145 108.821 129.358C108.795 129.372 108.795 129.372 108.769 129.387Z" fill="#2D2A76"/>
<path d="M90.8047 125.623C90.5217 125.779 90.1637 125.716 89.9995 125.449C89.797 125.17 89.8775 124.735 90.1737 124.538C90.6505 124.177 91.5007 123.578 92.3126 122.967C92.3898 122.924 92.4412 122.895 92.5184 122.853C92.5573 122.799 92.6219 122.731 92.6734 122.702C93.7814 121.895 94.5024 121.432 94.8112 121.261C94.9141 121.204 94.9913 121.162 95.081 121.145C95.4276 121.051 95.7587 121.259 95.8325 121.609C95.8938 121.933 95.7115 122.295 95.4033 122.4C95.1717 122.528 94.6697 122.837 93.3684 123.784C93.2912 123.826 93.2398 123.855 93.1626 123.898C93.1237 123.952 93.0591 124.02 93.0076 124.048C92.1574 124.648 91.3456 125.259 90.8687 125.62C90.8562 125.595 90.8304 125.609 90.8047 125.623ZM95.365 122.388L95.3907 122.374C95.3907 122.374 95.3907 122.374 95.365 122.388Z" fill="#2D2A76"/>
<path d="M145.318 166.444C145.138 166.547 144.91 166.546 144.708 166.463L143.588 165.813C143.537 165.775 143.475 165.711 143.425 165.674C143.349 165.651 143.285 165.654 143.223 165.591L141.045 164.354C140.742 164.196 140.647 163.786 140.818 163.456C140.988 163.126 141.384 162.998 141.687 163.156L143.864 164.393C143.915 164.431 143.977 164.494 144.027 164.532C144.103 164.555 144.167 164.551 144.229 164.615L145.35 165.265C145.652 165.423 145.747 165.833 145.576 166.163C145.511 166.3 145.42 166.385 145.318 166.444ZM139.464 163.139C139.284 163.242 139.055 163.241 138.854 163.158L138.501 162.962C138.199 162.804 138.104 162.394 138.274 162.064C138.444 161.734 138.84 161.606 139.143 161.764L139.495 161.96C139.798 162.118 139.893 162.528 139.722 162.858C139.682 162.98 139.592 163.065 139.464 163.139ZM136.933 161.706C136.754 161.809 136.525 161.808 136.323 161.725L134.145 160.488C134.095 160.45 134.032 160.387 133.982 160.349C133.906 160.326 133.843 160.33 133.78 160.266L131.602 159.029C131.3 158.871 131.205 158.461 131.375 158.131C131.546 157.801 131.942 157.673 132.244 157.831L134.422 159.068C134.472 159.106 134.535 159.17 134.585 159.207C134.661 159.23 134.724 159.227 134.787 159.29L136.965 160.527C137.267 160.685 137.362 161.095 137.192 161.425C137.152 161.548 137.036 161.647 136.933 161.706Z" fill="#2D2A76"/>
<path d="M144.625 171.061C144.573 171.09 144.522 171.118 144.432 171.136L141.896 171.697C141.806 171.714 141.742 171.717 141.679 171.72C141.627 171.748 141.55 171.791 141.46 171.808L138.924 172.37C138.566 172.438 138.236 172.23 138.188 171.865C138.141 171.5 138.374 171.174 138.72 171.08L141.256 170.519C141.346 170.501 141.41 170.499 141.474 170.496C141.551 170.453 141.602 170.424 141.692 170.407L144.228 169.846C144.586 169.777 144.917 169.985 144.964 170.35C145.038 170.636 144.882 170.918 144.625 171.061ZM136.632 172.828C136.581 172.856 136.529 172.885 136.465 172.888L136.055 172.985C135.697 173.054 135.367 172.846 135.319 172.481C135.272 172.115 135.505 171.79 135.851 171.695L136.261 171.598C136.62 171.529 136.95 171.737 136.997 172.103C137.007 172.391 136.863 172.699 136.632 172.828ZM133.674 173.461C133.622 173.489 133.571 173.518 133.481 173.535L130.945 174.096C130.855 174.113 130.791 174.116 130.728 174.119C130.65 174.162 130.599 174.191 130.509 174.208L127.973 174.769C127.615 174.838 127.285 174.63 127.237 174.264C127.19 173.899 127.423 173.574 127.769 173.479L130.305 172.918C130.395 172.901 130.459 172.898 130.523 172.895C130.6 172.852 130.651 172.824 130.741 172.806L133.277 172.245C133.635 172.177 133.966 172.385 134.013 172.75C134.061 173.05 133.905 173.332 133.674 173.461ZM125.681 175.227C125.63 175.256 125.578 175.285 125.489 175.302L125.079 175.399C124.72 175.468 124.416 175.245 124.343 174.894C124.295 174.529 124.528 174.204 124.874 174.109L125.284 174.012C125.643 173.943 125.947 174.166 126.021 174.516C126.069 174.816 125.912 175.099 125.681 175.227ZM122.735 175.886C122.684 175.914 122.632 175.943 122.543 175.96L120.006 176.521C119.917 176.539 119.853 176.541 119.789 176.544C119.712 176.587 119.66 176.616 119.571 176.633L117.035 177.194C116.676 177.263 116.346 177.055 116.299 176.69C116.251 176.324 116.485 175.999 116.831 175.904L119.367 175.343C119.456 175.326 119.52 175.323 119.584 175.32C119.661 175.277 119.713 175.249 119.802 175.232L122.338 174.67C122.697 174.602 123.027 174.81 123.074 175.175C123.11 175.449 122.966 175.757 122.735 175.886ZM114.704 177.641C114.653 177.67 114.602 177.698 114.512 177.715L114.102 177.813C113.743 177.882 113.439 177.659 113.366 177.308C113.318 176.943 113.552 176.617 113.898 176.523L114.308 176.426C114.666 176.357 114.971 176.579 115.044 176.93C115.118 177.216 114.961 177.498 114.704 177.641ZM111.758 178.3C111.707 178.328 111.655 178.357 111.566 178.374L110.003 178.72C109.645 178.789 109.315 178.581 109.267 178.216C109.22 177.851 109.453 177.525 109.799 177.431L111.362 177.084C111.72 177.015 112.05 177.223 112.098 177.589C112.172 177.874 112.015 178.157 111.758 178.3Z" fill="#2D2A76"/>
<path d="M148.2 216.325C148.097 216.384 147.982 216.416 147.855 216.423C147.512 216.387 147.25 216.107 147.294 215.716L147.384 214.869C147.385 214.802 147.411 214.72 147.438 214.638C147.439 214.571 147.402 214.493 147.429 214.411L147.7 211.734C147.744 211.344 148.041 211.074 148.409 211.095C148.751 211.131 149.014 211.411 148.97 211.802L148.699 214.479C148.698 214.546 148.671 214.628 148.644 214.709C148.643 214.776 148.68 214.855 148.654 214.936L148.564 215.784C148.548 216.026 148.405 216.207 148.2 216.325ZM148.902 209.651C148.799 209.71 148.684 209.742 148.557 209.749C148.189 209.728 147.952 209.433 147.996 209.042L148.041 208.585C148.086 208.195 148.382 207.925 148.751 207.946C149.119 207.967 149.356 208.262 149.312 208.653L149.266 209.11C149.237 209.326 149.081 209.548 148.902 209.651ZM149.218 206.516C149.115 206.575 149 206.608 148.873 206.615C148.505 206.594 148.268 206.298 148.312 205.908L148.583 203.231C148.584 203.164 148.611 203.082 148.638 203C148.639 202.934 148.602 202.855 148.628 202.773L148.899 200.096C148.944 199.706 149.24 199.436 149.608 199.457C149.951 199.493 150.214 199.774 150.169 200.164L149.899 202.841C149.898 202.908 149.871 202.99 149.844 203.071C149.843 203.138 149.88 203.217 149.853 203.298L149.582 205.976C149.566 206.217 149.423 206.399 149.218 206.516ZM150.114 198.039C150.011 198.098 149.896 198.131 149.769 198.137C149.401 198.117 149.164 197.821 149.208 197.431L149.253 196.973C149.298 196.583 149.594 196.313 149.963 196.334C150.331 196.355 150.568 196.651 150.524 197.041L150.478 197.498C150.424 197.729 150.293 197.936 150.114 198.039ZM150.43 194.905C150.327 194.964 150.212 194.996 150.085 195.003C149.743 194.967 149.48 194.687 149.524 194.296L149.795 191.619C149.796 191.552 149.823 191.471 149.85 191.389C149.851 191.322 149.814 191.244 149.84 191.162L150.111 188.485C150.156 188.094 150.452 187.825 150.82 187.846C151.163 187.881 151.426 188.162 151.381 188.552L151.111 191.23C151.109 191.296 151.083 191.378 151.056 191.46C151.055 191.527 151.092 191.605 151.065 191.687L150.794 194.364C150.766 194.58 150.61 194.802 150.43 194.905ZM151.288 186.416C151.185 186.475 151.07 186.508 150.943 186.514C150.575 186.494 150.338 186.198 150.382 185.808L150.427 185.35C150.472 184.96 150.768 184.69 151.137 184.711C151.505 184.732 151.742 185.028 151.698 185.418L151.652 185.875C151.623 186.091 151.493 186.298 151.288 186.416ZM151.63 183.267C151.527 183.326 151.412 183.359 151.285 183.365C150.942 183.33 150.68 183.049 150.724 182.659L150.995 179.981C150.996 179.914 151.023 179.833 151.049 179.751C151.05 179.684 151.013 179.606 151.04 179.524L151.311 176.847C151.367 176.483 151.652 176.187 152.02 176.208C152.363 176.244 152.625 176.524 152.581 176.915L152.31 179.592C152.309 179.659 152.282 179.74 152.256 179.822C152.255 179.889 152.292 179.967 152.265 180.049L151.994 182.726C151.952 182.983 151.809 183.164 151.63 183.267Z" fill="#2D2A76"/>
<path d="M132.17 251.914C132.067 251.973 131.927 252.02 131.787 252.001C131.445 251.965 131.196 251.644 131.253 251.28L131.569 248.975C131.626 248.611 131.948 248.327 132.291 248.362C132.633 248.398 132.882 248.719 132.825 249.083L132.508 251.388C132.505 251.588 132.375 251.796 132.17 251.914ZM132.885 246.926C132.783 246.985 132.642 247.033 132.503 247.013C132.16 246.978 131.912 246.656 131.968 246.292L132.026 245.861C132.083 245.497 132.405 245.212 132.747 245.248C133.09 245.283 133.338 245.605 133.282 245.969L133.224 246.4C133.195 246.616 133.065 246.823 132.885 246.926ZM133.304 243.801C133.202 243.859 133.061 243.907 132.922 243.888C132.579 243.852 132.33 243.531 132.387 243.166L132.76 240.498C132.761 240.431 132.788 240.349 132.827 240.294C132.828 240.227 132.817 240.134 132.818 240.067L133.191 237.398C133.248 237.034 133.57 236.75 133.913 236.785C134.255 236.821 134.504 237.142 134.447 237.506L134.074 240.175C134.073 240.242 134.046 240.323 134.007 240.379C134.006 240.446 134.017 240.539 134.016 240.606L133.643 243.274C133.626 243.516 133.484 243.697 133.304 243.801ZM134.507 235.349C134.405 235.408 134.264 235.456 134.125 235.436C133.783 235.401 133.534 235.079 133.59 234.715L133.648 234.284C133.705 233.92 134.027 233.635 134.369 233.671C134.712 233.706 134.961 234.028 134.904 234.392L134.846 234.823C134.817 235.039 134.687 235.246 134.507 235.349ZM134.952 232.209C134.849 232.268 134.709 232.315 134.569 232.296C134.227 232.26 133.978 231.939 134.035 231.575L134.408 228.906C134.409 228.839 134.436 228.758 134.475 228.702C134.476 228.635 134.465 228.542 134.466 228.475L134.839 225.807C134.896 225.442 135.218 225.158 135.56 225.194C135.903 225.229 136.152 225.55 136.095 225.915L135.722 228.583C135.721 228.65 135.694 228.732 135.655 228.787C135.654 228.854 135.665 228.947 135.664 229.014L135.291 231.683C135.274 231.924 135.131 232.106 134.952 232.209Z" fill="#2D2A76"/>
<path d="M84.753 252.448C84.6504 252.507 84.5354 252.539 84.4082 252.546C84.0656 252.51 83.803 252.23 83.8473 251.839L84.1181 249.162C84.1191 249.095 84.1459 249.013 84.1726 248.932C84.1736 248.865 84.1367 248.786 84.1634 248.705L84.4342 246.028C84.4785 245.637 84.7751 245.367 85.1434 245.388C85.4861 245.424 85.7486 245.705 85.7044 246.095L85.4335 248.772C85.4325 248.839 85.4058 248.921 85.3791 249.003C85.378 249.07 85.4149 249.148 85.3882 249.23L85.1174 251.907C85.0886 252.122 84.9582 252.33 84.753 252.448ZM85.6364 243.944C85.5338 244.003 85.4189 244.036 85.2917 244.043C84.949 244.007 84.6865 243.726 84.7307 243.336L84.776 242.878C84.8203 242.488 85.1169 242.218 85.4852 242.239C85.8279 242.275 86.0904 242.556 86.0461 242.946L86.0008 243.403C85.972 243.619 85.816 243.841 85.6364 243.944ZM85.9526 240.81C85.8499 240.869 85.735 240.901 85.6078 240.908C85.2651 240.872 85.0026 240.592 85.0468 240.201L85.3177 237.524C85.3187 237.457 85.3454 237.376 85.3721 237.294C85.3732 237.227 85.3363 237.149 85.363 237.067L85.6338 234.39C85.6781 233.999 85.9747 233.73 86.343 233.751C86.6857 233.786 86.9482 234.067 86.9039 234.457L86.6331 237.135C86.6321 237.201 86.6054 237.283 86.5787 237.365C86.5776 237.432 86.6145 237.51 86.5878 237.592L86.317 240.269C86.3005 240.511 86.1578 240.692 85.9526 240.81ZM86.8483 232.333C86.7457 232.391 86.6308 232.424 86.5035 232.431C86.1609 232.395 85.8983 232.114 85.9426 231.724L85.9879 231.267C86.0322 230.876 86.3288 230.607 86.6971 230.628C87.0397 230.663 87.3023 230.944 87.258 231.334L87.2127 231.792C87.1839 232.007 87.0279 232.23 86.8483 232.333ZM87.1644 229.198C87.0618 229.257 86.9469 229.29 86.8197 229.296C86.477 229.261 86.2145 228.98 86.2587 228.59L86.5296 225.913C86.5306 225.846 86.5573 225.764 86.584 225.682C86.5851 225.615 86.5482 225.537 86.5749 225.455L86.8457 222.778C86.89 222.388 87.1866 222.118 87.5549 222.139C87.8975 222.175 88.1601 222.455 88.1158 222.846L87.845 225.523C87.844 225.59 87.8172 225.671 87.7905 225.753C87.7895 225.82 87.8264 225.898 87.7997 225.98L87.5289 228.657C87.5001 228.873 87.344 229.095 87.1644 229.198ZM88.0479 220.695C87.9453 220.754 87.8303 220.786 87.7031 220.793C87.3605 220.757 87.0979 220.477 87.1422 220.086L87.1875 219.629C87.2441 219.265 87.5284 218.969 87.8967 218.99C88.2393 219.025 88.5019 219.306 88.4576 219.697L88.4123 220.154C88.3578 220.384 88.2275 220.592 88.0479 220.695ZM88.364 217.56C88.2614 217.619 88.1465 217.652 88.0193 217.659C87.6766 217.623 87.4141 217.342 87.4583 216.952L87.7291 214.275C87.7302 214.208 87.7569 214.126 87.7836 214.044C87.7847 213.977 87.7478 213.899 87.7745 213.817L88.0453 211.14C88.0896 210.75 88.3862 210.48 88.7545 210.501C89.0971 210.537 89.3597 210.818 89.3154 211.208L89.0446 213.885C89.0435 213.952 89.0168 214.034 88.9901 214.115C88.9891 214.182 89.026 214.261 88.9993 214.342L88.7284 217.019C88.7119 217.261 88.5436 217.457 88.364 217.56Z" fill="#2D2A76"/>
<path d="M90.4862 198.446C90.3069 198.549 90.0785 198.547 89.8768 198.465C89.5748 198.308 89.4799 197.9 89.6502 197.572L90.9578 195.178C90.9968 195.123 91.0614 195.053 91.1003 194.998C91.1014 194.931 91.1281 194.85 91.1927 194.78L92.5003 192.386C92.6706 192.058 93.066 191.931 93.368 192.088C93.67 192.245 93.765 192.652 93.5947 192.98L92.287 195.375C92.2481 195.43 92.1835 195.5 92.1445 195.555C92.1435 195.622 92.1168 195.703 92.0522 195.773L90.7445 198.167C90.6666 198.277 90.5887 198.388 90.4862 198.446ZM94.6051 190.921C94.4258 191.023 94.1974 191.021 93.9957 190.939C93.6937 190.782 93.5988 190.375 93.769 190.047L93.9783 189.664C94.1485 189.336 94.544 189.209 94.846 189.366C95.148 189.523 95.2429 189.93 95.0726 190.258L94.8634 190.641C94.7855 190.752 94.7076 190.862 94.6051 190.921ZM96.122 188.143C95.9427 188.245 95.7143 188.244 95.5126 188.161C95.2106 188.004 95.1157 187.597 95.2859 187.269L96.5936 184.875C96.6326 184.82 96.6971 184.75 96.7361 184.695C96.7372 184.628 96.7639 184.547 96.8285 184.477L96.9331 184.286C97.1033 183.958 97.4988 183.831 97.8008 183.988C98.1028 184.145 98.1977 184.552 98.0274 184.88L97.9228 185.072C97.8839 185.127 97.8193 185.197 97.7803 185.252C97.7792 185.318 97.7526 185.399 97.688 185.469L96.3803 187.864C96.3147 188 96.2245 188.085 96.122 188.143Z" fill="#2D2A76"/>
<path d="M95.2885 173.774L95.2624 173.788C94.937 173.934 94.5472 173.816 94.405 173.463L93.383 171.069C93.3442 170.99 93.3443 170.924 93.3445 170.857C93.2925 170.819 93.2537 170.741 93.2149 170.663L92.1929 168.269C92.0636 167.941 92.1945 167.537 92.546 167.377C92.8714 167.232 93.2612 167.349 93.4035 167.703L94.4254 170.097C94.4642 170.175 94.4641 170.242 94.4639 170.308C94.5159 170.346 94.5547 170.424 94.5935 170.503L95.6155 172.897C95.7058 173.212 95.5749 173.617 95.2885 173.774ZM92.0676 166.146L92.0415 166.16C91.7161 166.306 91.3263 166.188 91.184 165.834L91.0159 165.429C90.8866 165.101 91.0175 164.697 91.369 164.537C91.6944 164.391 92.0842 164.509 92.2264 164.863L92.3946 165.269C92.4849 165.584 92.354 165.988 92.0676 166.146ZM90.8645 163.32L90.8385 163.334C90.5131 163.48 90.1233 163.362 89.981 163.008L88.959 160.614C88.9202 160.536 88.9204 160.47 88.9205 160.403C88.8686 160.365 88.8297 160.287 88.7909 160.209L87.769 157.815C87.6396 157.487 87.7706 157.083 88.122 156.923C88.4474 156.777 88.8372 156.895 88.9795 157.249L90.0015 159.643C90.0403 159.721 90.0401 159.788 90.04 159.854C90.0919 159.892 90.1308 159.97 90.1696 160.049L91.1915 162.443C91.2948 162.784 91.177 163.148 90.8645 163.32ZM87.6436 155.692L87.6176 155.706C87.2922 155.852 86.9023 155.734 86.7601 155.38L86.5919 154.974C86.4626 154.647 86.5936 154.243 86.945 154.083C87.2704 153.937 87.6602 154.055 87.8025 154.409L87.9706 154.814C88.0739 155.156 87.93 155.534 87.6436 155.692ZM86.4535 152.892L86.4275 152.906C86.1021 153.052 85.7122 152.934 85.57 152.58L84.548 150.186C84.5092 150.108 84.5093 150.042 84.5095 149.975C84.4576 149.937 84.4187 149.859 84.3799 149.781L84.0823 149.114C83.953 148.786 84.0839 148.382 84.4354 148.222C84.7608 148.077 85.1506 148.195 85.2928 148.548L85.5904 149.215C85.6293 149.293 85.6291 149.36 85.629 149.426C85.6809 149.464 85.7197 149.542 85.7586 149.621L86.7805 152.015C86.8838 152.356 86.766 152.72 86.4535 152.892Z" fill="#2D2A76"/>
<path d="M57.7733 137.092C57.7219 137.121 57.6449 137.164 57.5811 137.167L56.0339 137.476C55.6759 137.546 55.3723 137.323 55.2999 136.971C55.2531 136.605 55.4865 136.278 55.8321 136.183L57.3792 135.873C57.7372 135.804 58.0408 136.027 58.1133 136.378C58.1608 136.679 58.0044 136.963 57.7733 137.092ZM53.7069 137.928C53.6555 137.956 53.5785 138 53.5147 138.003L53.0929 138.075C52.7349 138.144 52.4313 137.922 52.3588 137.57C52.3121 137.204 52.5455 136.877 52.891 136.782L53.3129 136.709C53.6709 136.64 53.9744 136.862 54.0469 137.214C54.0944 137.515 53.938 137.798 53.7069 137.928ZM50.7526 138.567C50.7013 138.595 50.6242 138.638 50.5604 138.641L48.0412 139.168C47.9774 139.171 47.8879 139.188 47.8241 139.191C47.747 139.234 47.6957 139.263 47.6318 139.266L45.1126 139.792C44.7546 139.862 44.4511 139.639 44.3786 139.287C44.3318 138.921 44.5653 138.594 44.9108 138.499L47.43 137.972C47.4938 137.969 47.5833 137.952 47.6472 137.949C47.6985 137.92 47.7756 137.877 47.8394 137.874L50.3586 137.348C50.7166 137.279 51.0202 137.501 51.0926 137.853C51.1402 138.154 51.0095 138.423 50.7526 138.567Z" fill="#2D2A76"/>
</svg>
