<svg width="39" height="23" viewBox="0 0 39 23" fill="none" xmlns="http://www.w3.org/2000/svg">
<path d="M38.9545 11.4406C38.9545 17.7183 33.8503 22.8813 27.5139 22.8813C21.2362 22.8813 16.0732 17.7183 16.0732 11.4406C16.0732 5.16296 21.1775 0 27.4552 0C33.8503 0 38.9545 5.16296 38.9545 11.4406Z" fill="#F9B50B"/>
<path d="M23.639 11.4993C23.639 10.6779 23.5217 9.85656 23.4044 9.09385H16.364C16.4226 8.68316 16.54 8.33114 16.6573 7.86178H22.935C22.8177 7.45109 22.6416 7.0404 22.4656 6.62971H17.1267C17.3027 6.21902 17.5374 5.867 17.772 5.39764H21.8203C21.5856 4.98695 21.2922 4.57626 20.9402 4.16557H18.7108C19.0628 3.75488 19.4148 3.40286 19.8842 2.99217C17.8894 1.11473 15.1906 0 12.1984 0C5.97936 0.17601 0.816406 5.16296 0.816406 11.4406C0.816406 17.7183 5.9207 22.8813 12.2571 22.8813C15.2492 22.8813 17.8894 21.7079 19.9428 19.8891C20.3535 19.5371 20.7055 19.1264 21.1162 18.6571H18.7694C18.4761 18.305 18.1827 17.8943 17.948 17.4837H21.9376C22.1723 17.1316 22.407 16.7209 22.583 16.2516H17.244C17.068 15.8996 16.892 15.4889 16.7746 15.0195H23.0523C23.4044 13.9635 23.639 12.7901 23.639 11.4993Z" fill="#C8191C"/>
<path d="M16.304 14.3736L16.4801 13.3176C16.4214 13.3176 16.304 13.3762 16.1867 13.3762C15.776 13.3762 15.7173 13.1416 15.776 13.0242L16.128 10.9121H16.7734L16.9494 9.73871H16.3627L16.4801 9.03467H15.248C15.248 9.03467 14.5439 13.0242 14.5439 13.4936C14.5439 14.1976 14.9546 14.5496 15.5413 14.5496C15.8934 14.5496 16.1867 14.4323 16.304 14.3736Z" fill="white"/>
<path d="M16.7188 12.4386C16.7188 14.14 17.8922 14.5507 18.8309 14.5507C19.7109 14.5507 20.1216 14.3747 20.1216 14.3747L20.3563 13.2013C20.3563 13.2013 19.7109 13.4947 19.0655 13.4947C17.7161 13.4947 17.9508 12.4973 17.9508 12.4973H20.415C20.415 12.4973 20.591 11.7346 20.591 11.3825C20.591 10.6198 20.1803 9.62245 18.8309 9.62245C17.6575 9.56378 16.7188 10.9132 16.7188 12.4386ZM18.8309 10.6785C19.4762 10.6785 19.3589 11.4412 19.3589 11.4999H18.0095C18.0682 11.4412 18.1855 10.6785 18.8309 10.6785Z" fill="white"/>
<path d="M26.5141 14.3734L26.7488 13.024C26.7488 13.024 26.1621 13.3174 25.6927 13.3174C24.8714 13.3174 24.4607 12.672 24.4607 11.9093C24.4607 10.4425 25.1647 9.67982 26.0448 9.67982C26.6315 9.67982 27.1595 10.0318 27.1595 10.0318L27.3355 8.7411C27.3355 8.7411 26.6315 8.44775 25.9274 8.44775C24.5193 8.44775 23.1699 9.67982 23.1699 11.968C23.1699 13.4934 23.874 14.4908 25.3407 14.4908C25.8687 14.5494 26.5141 14.3734 26.5141 14.3734Z" fill="white"/>
<path d="M9.67485 9.56348C8.85347 9.56348 8.2081 9.79816 8.2081 9.79816L8.03209 10.8542C8.03209 10.8542 8.56012 10.6195 9.3815 10.6195C9.79219 10.6195 10.1442 10.6782 10.1442 11.0302C10.1442 11.2649 10.0855 11.3236 10.0855 11.3236H9.55751C8.50145 11.3236 7.38672 11.7343 7.38672 13.1423C7.38672 14.2571 8.09076 14.4918 8.56012 14.4918C9.3815 14.4918 9.79219 13.9637 9.85086 13.9637L9.79219 14.4331H10.7896L11.2589 11.0889C11.2589 9.62215 10.0855 9.56348 9.67485 9.56348ZM9.90953 12.2623C9.90953 12.4383 9.79219 13.4357 9.08815 13.4357C8.73613 13.4357 8.61879 13.1423 8.61879 12.9663C8.61879 12.673 8.7948 12.2623 9.73352 12.2623C9.85086 12.2623 9.90953 12.2623 9.90953 12.2623Z" fill="white"/>
<path d="M12.4306 14.4918C12.724 14.4918 14.2494 14.5505 14.2494 12.9077C14.2494 11.3823 12.7826 11.6757 12.7826 11.089C12.7826 10.7956 13.0173 10.6783 13.428 10.6783C13.604 10.6783 14.2494 10.737 14.2494 10.737L14.4254 9.62222C14.4254 9.62222 14.0147 9.50488 13.252 9.50488C12.3719 9.50488 11.4332 9.8569 11.4332 11.089C11.4332 12.4971 12.9586 12.3797 12.9586 12.9077C12.9586 13.2598 12.548 13.3184 12.2546 13.3184C11.7266 13.3184 11.1399 13.1424 11.1399 13.1424L10.9639 14.2572C11.0812 14.3745 11.4332 14.4918 12.4306 14.4918Z" fill="white"/>
<path d="M36.6041 8.62451L36.3694 10.2673C36.3694 10.2673 35.9001 9.68057 35.196 9.68057C34.0813 9.68057 33.1426 11.03 33.1426 12.6141C33.1426 13.6115 33.6119 14.6089 34.668 14.6089C35.372 14.6089 35.8414 14.1395 35.8414 14.1395L35.7827 14.5502H37.0148L37.8948 8.74185L36.6041 8.62451ZM36.0174 11.7927C36.0174 12.4381 35.7241 13.3181 35.02 13.3181C34.6093 13.3181 34.3746 12.9661 34.3746 12.3207C34.3746 11.3233 34.7853 10.7366 35.372 10.7366C35.7827 10.7953 36.0174 11.0887 36.0174 11.7927Z" fill="white"/>
<path d="M3.04449 14.4328L3.74853 10.0913L3.86587 14.4328H4.68725L6.27134 10.0913L5.62597 14.4328H6.91671L7.9141 8.62451H5.91932L4.68725 12.2034L4.62858 8.62451H2.86848L1.87109 14.4328H3.04449Z" fill="white"/>
<path d="M21.8211 14.4324C22.1731 12.4377 22.2318 10.7949 23.1118 11.0883C23.2292 10.3255 23.4052 9.97353 23.5225 9.68018H23.2878C22.7598 9.68018 22.2904 10.3842 22.2904 10.3842L22.4078 9.73885H21.2344L20.4717 14.4324H21.8211Z" fill="white"/>
<path d="M29.3321 9.56348C28.5107 9.56348 27.8653 9.79816 27.8653 9.79816L27.6893 10.8542C27.6893 10.8542 28.2173 10.6195 29.0387 10.6195C29.4494 10.6195 29.8014 10.6782 29.8014 11.0302C29.8014 11.2649 29.7428 11.3236 29.7428 11.3236H29.2147C28.1587 11.3236 27.0439 11.7343 27.0439 13.1423C27.0439 14.2571 27.748 14.4918 28.2173 14.4918C29.0387 14.4918 29.4494 13.9637 29.5081 13.9637L29.4494 14.4331H30.5641L31.0335 11.0889C31.0335 9.62215 29.7428 9.56348 29.3321 9.56348ZM29.6254 12.2623C29.6254 12.4383 29.5081 13.4357 28.804 13.4357C28.452 13.4357 28.3347 13.1423 28.3347 12.9663C28.3347 12.673 28.5107 12.2623 29.4494 12.2623C29.5668 12.2623 29.5668 12.2623 29.6254 12.2623Z" fill="white"/>
<path d="M31.9715 14.4324C32.3235 12.4377 32.3822 10.7949 33.2622 11.0883C33.3796 10.3255 33.5556 9.97353 33.6729 9.68018H33.4382C32.9102 9.68018 32.4408 10.3842 32.4408 10.3842L32.5582 9.73885H31.3848L30.6221 14.4324H31.9715Z" fill="white"/>
</svg>
