<svg width="14" height="14" viewBox="0 0 14 14" fill="none" xmlns="http://www.w3.org/2000/svg">
<path d="M12.4762 3.19046H11.0191C11.1922 2.90284 11.2843 2.57377 11.2858 2.23807C11.2858 1.7329 11.0851 1.24842 10.7279 0.891205C10.3707 0.533993 9.88617 0.333313 9.38099 0.333313C8.90922 0.333658 8.44487 0.45082 8.02941 0.674339C7.61395 0.897857 7.2603 1.22078 7.00004 1.61427C6.73978 1.22078 6.38613 0.897857 5.97067 0.674339C5.55521 0.45082 5.09086 0.333658 4.61909 0.333313C4.11391 0.333313 3.62943 0.533993 3.27222 0.891205C2.91501 1.24842 2.71433 1.7329 2.71433 2.23807C2.71573 2.57377 2.80787 2.90284 2.98099 3.19046H1.52385C1.20812 3.19046 0.905314 3.31588 0.682056 3.53914C0.458799 3.7624 0.333374 4.0652 0.333374 4.38093C0.333374 4.69667 0.458799 4.99947 0.682056 5.22273C0.905314 5.44598 1.20812 5.57141 1.52385 5.57141H12.4762C12.792 5.57141 13.0948 5.44598 13.318 5.22273C13.5413 4.99947 13.6667 4.69667 13.6667 4.38093C13.6667 4.0652 13.5413 3.7624 13.318 3.53914C13.0948 3.31588 12.792 3.19046 12.4762 3.19046ZM9.38099 1.28569C9.63358 1.28569 9.87582 1.38603 10.0544 1.56464C10.233 1.74325 10.3334 1.98549 10.3334 2.23807C10.3334 2.49066 10.233 2.7329 10.0544 2.91151C9.87582 3.09012 9.63358 3.19046 9.38099 3.19046H7.47623C7.47623 2.68528 7.67691 2.2008 8.03412 1.84359C8.39134 1.48637 8.87582 1.28569 9.38099 1.28569ZM3.66671 2.23807C3.66671 1.98549 3.76705 1.74325 3.94565 1.56464C4.12426 1.38603 4.3665 1.28569 4.61909 1.28569C5.12426 1.28569 5.60875 1.48637 5.96596 1.84359C6.32317 2.2008 6.52385 2.68528 6.52385 3.19046H4.61909C4.3665 3.19046 4.12426 3.09012 3.94565 2.91151C3.76705 2.7329 3.66671 2.49066 3.66671 2.23807ZM12.4762 6.0476C12.5554 6.05486 12.6351 6.05486 12.7143 6.0476V12.2381C12.7143 12.617 12.5638 12.9803 12.2959 13.2482C12.028 13.5161 11.6646 13.6666 11.2858 13.6666H7.47623V6.0476H12.4762ZM1.52385 6.0476H6.52385V13.6666H2.71433C2.33545 13.6666 1.97208 13.5161 1.70417 13.2482C1.43626 12.9803 1.28575 12.617 1.28575 12.2381V6.0476C1.36495 6.05486 1.44465 6.05486 1.52385 6.0476V6.0476Z" fill="#E7E6E9"/>
</svg>
