<svg width="42" height="42" viewBox="0 0 42 42" fill="none" xmlns="http://www.w3.org/2000/svg">
<path d="M6.2838 6.2838L6.28377 6.28383C4.4175 8.14959 2.95311 10.3226 1.92944 12.7423L6.2838 6.2838ZM6.2838 6.2838C8.14961 4.41799 10.3222 2.9536 12.7424 1.92993L12.6131 1.62434M6.2838 6.2838L12.6131 1.62434M12.6131 1.62434L12.7424 1.92993C15.2487 0.869797 17.9097 0.331808 20.6527 0.331808C23.3957 0.331808 26.0572 0.869802 28.563 1.92992L28.5631 1.92995C30.9832 2.95308 33.1558 4.41796 35.0216 6.2838L35.0216 6.28383C36.8879 8.14959 38.3518 10.3226 39.376 12.7425C40.4361 15.2487 40.9736 17.9102 40.9736 20.6527C40.9736 23.3958 40.4361 26.0573 39.376 28.563L39.376 28.563C38.3523 30.9832 36.8879 33.1558 35.0216 35.0216L35.0216 35.0216C33.1558 36.8879 30.9833 38.3518 28.563 39.3755L28.5629 39.3755C26.0572 40.4361 23.3957 40.9736 20.6527 40.9736C17.9097 40.9736 15.2487 40.4361 12.7424 39.3755L12.7423 39.3755C10.3221 38.3523 8.14963 36.8879 6.28383 35.0216L6.28377 35.0216C4.41747 33.1558 2.95308 30.9832 1.92942 28.563L1.9294 28.563M12.6131 1.62434L1.9294 28.563M1.9294 28.563C0.869302 26.0573 0.331808 23.3958 0.331808 20.6527C0.331808 17.9102 0.869789 15.2487 1.92941 12.7424L1.9294 28.563Z" stroke="url(#paint0_linear_348:2654)" stroke-width="0.663615"/>
<path d="M12.7946 19.5951C12.7946 21.181 13.2895 22.6647 14.1206 23.8943C14.0585 23.9682 13.9983 24.0435 13.9398 24.1199C13.0351 22.8263 12.5 21.2611 12.5 19.5765C12.5 15.138 16.2061 11.5 20.7766 11.5C25.3462 11.5 29.0537 15.1375 29.0721 19.5776C29.0719 21.2666 28.5338 22.8357 27.6244 24.1312C27.5623 24.051 27.4984 23.9719 27.4327 23.894C28.2637 22.6645 28.7585 21.1808 28.7585 19.5951C28.7585 15.2711 25.173 11.7837 20.7766 11.7837C16.3801 11.7837 12.7946 15.2711 12.7946 19.5951Z" fill="black" stroke="url(#paint1_linear_348:2654)"/>
<path d="M26.7686 19.5953C26.7686 20.6637 26.4742 21.6691 25.9499 22.5379C25.8674 22.4782 25.7839 22.42 25.6991 22.363C26.1287 21.6289 26.3943 20.7849 26.4517 19.8875C26.4744 19.7708 26.4742 19.6629 26.474 19.5923C26.474 19.5869 26.474 19.5817 26.474 19.5767C26.474 19.5042 26.4669 19.4355 26.4625 19.3927L26.4619 19.3863C26.4567 19.3354 26.455 19.3144 26.455 19.2977V19.2824L26.454 19.2672C26.2863 16.5217 24.1092 14.3232 21.3624 14.0379C21.1644 14.0165 20.9702 14.0165 20.7889 14.0166L20.7766 14.0166L20.7643 14.0166C20.583 14.0165 20.3888 14.0165 20.1908 14.038C17.4556 14.322 15.2824 16.5043 15.1198 19.238C15.0981 19.3666 15.0982 19.4864 15.0982 19.5644C15.0982 19.5687 15.0982 19.5728 15.0982 19.5767C15.0982 19.6433 15.1059 19.7105 15.1102 19.7471C15.1104 19.7496 15.1107 19.752 15.111 19.7542C15.1135 19.7763 15.1151 19.7907 15.1162 19.8036C15.1172 19.8145 15.1173 19.8189 15.1173 19.8189C15.1173 19.8189 15.1173 19.8189 15.1173 19.8189V19.8281L15.1176 19.8375C15.1524 20.7557 15.418 21.6028 15.8521 22.3424C15.7688 22.3973 15.6864 22.4538 15.6051 22.5121C15.0888 21.6409 14.7846 20.6375 14.7846 19.5767C14.7846 16.3662 17.4626 13.7329 20.7766 13.7329C24.0896 13.7329 26.7686 16.3653 26.7686 19.5953Z" fill="black" stroke="url(#paint2_linear_348:2654)"/>
<path d="M14.5394 28.8204L14.6067 28.2607C14.6903 27.5663 14.9001 26.9074 15.2387 26.3076L14.5394 28.8204ZM14.5394 28.8204H15.1032M14.5394 28.8204H15.1032M15.1032 28.8204H26.4879H27.0688L26.9823 28.246C26.8794 27.5621 26.6726 26.9122 26.3587 26.3192L26.3588 26.3191L26.3525 26.3079C26.1271 25.9074 25.8586 25.5231 25.5454 25.1762L25.5455 25.1761L25.5378 25.168C25.3017 24.9181 25.0535 24.6742 24.7582 24.4472C24.3168 24.0985 23.8375 23.835 23.3448 23.6343L23.3448 23.6343L23.3359 23.6308C22.6581 23.3699 21.9119 23.2067 21.1192 23.2067H20.4719C19.6897 23.2067 18.9403 23.3474 18.248 23.6336C17.7249 23.8387 17.2473 24.1234 16.834 24.4463C16.5383 24.6736 16.2897 24.9177 16.0533 25.168L16.0532 25.1679M15.1032 28.8204L16.0532 25.1679M16.0532 25.1679L16.0457 25.1762M16.0532 25.1679L16.0457 25.1762M16.0457 25.1762C15.7326 25.5229 15.4642 25.9071 15.2389 26.3073L16.0457 25.1762ZM27.2825 28.9344V29.0669H14.2324V28.9344C14.2324 27.8374 14.5299 26.8271 15.0578 25.9329L15.0579 25.933L15.0629 25.924C15.2497 25.5921 15.4914 25.2698 15.7561 24.9762C15.9742 24.7455 16.1857 24.5396 16.4103 24.3537C16.7374 24.0874 17.0704 23.8491 17.4116 23.6653C17.7214 23.5052 18.0173 23.3702 18.3231 23.2706L19.2256 22.9766L18.4728 22.3986C18.2381 22.2184 18.0048 21.9896 17.8257 21.7509L17.8258 21.7509L17.8211 21.7449C17.351 21.1378 17.0691 20.3884 17.0691 19.5767C17.0691 17.6112 18.7205 15.9653 20.7765 15.9653C22.8304 15.9653 24.4815 17.6082 24.4649 19.6098H24.4649V19.6139C24.4649 20.4256 24.1829 21.1751 23.7128 21.7821L23.7128 21.782L23.7082 21.7881C23.5298 22.0259 23.3152 22.2372 23.0577 22.4385L22.3178 23.0169L23.2108 23.3078C23.5217 23.409 23.8333 23.5442 24.1088 23.6952C24.47 23.9072 24.8072 24.1334 25.1236 24.3909C25.3482 24.5767 25.5597 24.7827 25.7779 25.0134C26.044 25.3086 26.2855 25.6312 26.453 25.9259L26.453 25.9259L26.4572 25.9329C26.9851 26.8271 27.2825 27.8374 27.2825 28.9344ZM20.7765 16.249C18.9121 16.249 17.3827 17.7271 17.3827 19.5767C17.3827 20.5398 17.7874 21.3967 18.4567 22.0085C19.0608 22.5756 19.8857 22.9231 20.7765 22.9231C21.6673 22.9231 22.4922 22.5756 23.0963 22.0085C23.7655 21.3967 24.1703 20.5399 24.1703 19.5767C24.1703 17.7271 22.6409 16.249 20.7765 16.249Z" fill="black" stroke="url(#paint3_linear_348:2654)"/>
<defs>
<linearGradient id="paint0_linear_348:2654" x1="-8.43107" y1="1.30613" x2="45.0358" y2="40.8643" gradientUnits="userSpaceOnUse">
<stop stop-color="#ACB4FF"/>
<stop offset="0.520833" stop-color="#A55FFF"/>
<stop offset="1" stop-color="#816CFF" stop-opacity="0.88"/>
</linearGradient>
<linearGradient id="paint1_linear_348:2654" x1="8.41325" y1="11.4418" x2="27.2767" y2="28.9947" gradientUnits="userSpaceOnUse">
<stop stop-color="#ACB4FF"/>
<stop offset="0.520833" stop-color="#A55FFF"/>
<stop offset="1" stop-color="#816CFF" stop-opacity="0.88"/>
</linearGradient>
<linearGradient id="paint2_linear_348:2654" x1="11.6344" y1="13.55" x2="25.1952" y2="26.5415" gradientUnits="userSpaceOnUse">
<stop stop-color="#ACB4FF"/>
<stop offset="0.520833" stop-color="#A55FFF"/>
<stop offset="1" stop-color="#816CFF" stop-opacity="0.88"/>
</linearGradient>
<linearGradient id="paint3_linear_348:2654" x1="10.8646" y1="15.9112" x2="29.0984" y2="29.3525" gradientUnits="userSpaceOnUse">
<stop stop-color="#ACB4FF"/>
<stop offset="0.520833" stop-color="#A55FFF"/>
<stop offset="1" stop-color="#816CFF" stop-opacity="0.88"/>
</linearGradient>
</defs>
</svg>
