<svg width="16" height="16" viewBox="0 0 16 16" fill="none" xmlns="http://www.w3.org/2000/svg">
<path d="M10.1451 12.1912C10.6122 12.1933 11.0621 12.0205 11.4014 11.7087C11.7406 11.3968 11.9431 10.97 11.9667 10.5169C11.9667 10.5093 11.9667 10.5017 11.9667 10.4927L13.7338 8.5645C13.9132 8.36241 14.1659 8.23521 14.4394 8.20932C14.7128 8.18343 14.986 8.26084 15.2022 8.42548C15.3093 8.51148 15.3975 8.61744 15.4617 8.73709C15.526 8.85675 15.5649 8.98768 15.5762 9.12218C15.5875 9.25667 15.571 9.39201 15.5276 9.5202C15.4842 9.64839 15.4148 9.76685 15.3236 9.86859L11.7956 13.7975C11.5631 14.0563 11.2762 14.2638 10.9542 14.4059C10.6322 14.5479 10.2826 14.6213 9.92891 14.621H4.62602L3.70513 15.5156L0.4198 12.4042L2.77336 10.1376C3.2513 9.67611 3.85333 9.3547 4.51055 9.21012C5.16777 9.06554 5.85361 9.10364 6.48958 9.32006L7.00602 9.49685H10.1871C10.3213 9.49679 10.4542 9.52293 10.5778 9.57371C10.7014 9.6245 10.8133 9.6989 10.9067 9.79249C11.0002 9.88608 11.0733 9.99696 11.1218 10.1185C11.1702 10.2401 11.1931 10.3699 11.1889 10.5002C11.1718 10.7565 11.0538 10.9965 10.8595 11.1707C10.6652 11.3448 10.4095 11.4396 10.1451 11.4356H8.23647C8.13333 11.4356 8.03441 11.4754 7.96148 11.5463C7.88855 11.6171 7.84758 11.7132 7.84758 11.8134C7.84758 11.9136 7.88855 12.0097 7.96148 12.0805C8.03441 12.1514 8.13333 12.1912 8.23647 12.1912H10.1451ZM8.21936 4.96201C8.47607 5.10335 8.74395 5.22463 9.02047 5.32468C9.13869 5.37001 9.25691 5.41686 9.37358 5.46672C9.51286 5.52452 9.64321 5.6008 9.76091 5.69339C9.82944 5.73895 9.88357 5.80212 9.91729 5.87584C9.951 5.94956 9.96295 6.03093 9.95182 6.11087C9.94069 6.1908 9.9069 6.26616 9.85424 6.32853C9.80157 6.3909 9.7321 6.43782 9.65358 6.46405C9.44253 6.55028 9.21143 6.57951 8.98469 6.54868C8.61047 6.50885 8.2468 6.40338 7.91136 6.23739C7.84128 6.19534 7.76174 6.17045 7.67958 6.16486C7.49291 6.16486 7.43536 6.3477 7.40269 6.44592C7.34202 6.63481 7.28758 6.82521 7.23469 7.01561C7.14758 7.3269 7.20202 7.44326 7.50224 7.5853C7.83216 7.73082 8.18225 7.82857 8.54136 7.87543C8.59841 7.88154 8.65469 7.89319 8.70936 7.91019C8.72115 7.96838 8.72585 8.02773 8.72336 8.08699V8.46023C8.72022 8.50787 8.72749 8.5556 8.74469 8.60031C8.76189 8.64502 8.78862 8.68569 8.82315 8.71966C8.85767 8.75362 8.89919 8.78011 8.94499 8.79738C8.9908 8.81465 9.03984 8.82232 9.08891 8.81988H9.35336H9.66447C9.7124 8.82245 9.76035 8.81497 9.80505 8.79794C9.84974 8.78091 9.89014 8.75473 9.9235 8.72119C9.95685 8.68764 9.98238 8.64751 9.99834 8.60352C10.0143 8.55954 10.0203 8.51273 10.016 8.46628C10.016 8.41037 10.016 8.35294 10.016 8.29703C10.016 8.18219 10.016 8.06583 10.016 7.95099C10.016 7.83614 10.044 7.79988 10.1716 7.76512C10.5838 7.65996 10.9513 7.43095 11.2216 7.11081C11.396 6.90646 11.5218 6.66724 11.5901 6.41022C11.6584 6.15319 11.6675 5.8847 11.6167 5.62388C11.5596 5.34586 11.44 5.08349 11.2666 4.85547C11.0932 4.62746 10.8701 4.43939 10.6134 4.30468C10.3209 4.15477 10.0196 4.02157 9.71113 3.90574L9.59291 3.8589C9.41224 3.7885 9.2426 3.69389 9.08891 3.57783C9.03574 3.54045 8.99346 3.4903 8.96619 3.4323C8.93893 3.3743 8.92761 3.31042 8.93336 3.2469C8.94578 3.18201 8.97541 3.1214 9.01934 3.07104C9.06326 3.02069 9.11995 2.98234 9.1838 2.95979C9.27693 2.92388 9.37606 2.90493 9.47624 2.90388C9.88765 2.87966 10.2986 2.95876 10.6694 3.13357C11.052 3.31339 11.136 3.0429 11.1671 2.92806C11.2185 2.77694 11.2636 2.62583 11.3087 2.46717L11.3616 2.28583C11.3777 2.24322 11.3848 2.19789 11.3826 2.15254C11.3803 2.1072 11.3686 2.06276 11.3483 2.02187C11.328 1.98098 11.2994 1.94449 11.2643 1.91455C11.2292 1.88461 11.1882 1.86185 11.1438 1.84761C10.8802 1.73465 10.6025 1.6559 10.3178 1.61339C10.0611 1.5741 10.0611 1.5741 10.0611 1.32326C10.0611 0.795878 10.0191 0.718811 9.48869 0.718811H9.20247C8.89136 0.727878 8.80736 0.817033 8.79958 1.11321C8.79958 1.18272 8.79958 1.25072 8.79958 1.31872V1.42903C8.79958 1.65117 8.79958 1.65117 8.57247 1.73126C7.74491 2.0229 7.30002 2.57294 7.25024 3.36477C7.20513 4.03117 7.52402 4.55703 8.21936 4.96201Z" fill="#E7E6E9"/>
</svg>
