<svg width="25" height="25" viewBox="0 0 25 25" fill="none" xmlns="http://www.w3.org/2000/svg">
<path d="M16.4323 0.657227H9.06527C2.34248 0.657227 0.748779 2.25093 0.748779 8.97372V16.3407C0.748779 23.0635 2.34248 24.6572 9.06527 24.6572H16.4323C23.1551 24.6572 24.7488 23.0635 24.7488 16.3407V8.97372C24.7488 2.25093 23.1393 0.657227 16.4323 0.657227ZM20.1237 17.7777H18.3815C17.7215 17.7777 17.5183 17.2542 16.331 16.0512C15.2998 15.0515 14.8431 14.9188 14.5888 14.9188C14.2296 14.9188 14.1276 15.02 14.1276 15.5128V17.087C14.1276 17.5092 13.9949 17.7627 12.8774 17.7627C11.0295 17.7627 8.97902 16.6452 7.54132 14.5633C5.37314 11.5124 4.7799 9.22721 4.7799 8.75472C4.7799 8.50048 4.88115 8.26274 5.36938 8.26274H7.11533C7.55707 8.26274 7.72506 8.46598 7.89681 8.93847C8.76003 11.4306 10.1977 13.6138 10.791 13.6138C11.01 13.6138 11.1112 13.5126 11.1112 12.9538V10.3799C11.0445 9.19271 10.4197 9.09071 10.4197 8.66923C10.4197 8.46598 10.5877 8.26274 10.857 8.26274H13.6026C13.9739 8.26274 14.1104 8.46598 14.1104 8.90322V12.3756C14.1104 12.7506 14.2784 12.8833 14.3796 12.8833C14.5986 12.8833 14.7861 12.7506 15.1918 12.3441C16.4458 10.9379 17.3443 8.76972 17.3443 8.76972C17.4613 8.51548 17.6645 8.27774 18.1062 8.27774H19.8522C20.3757 8.27774 20.4927 8.54698 20.3757 8.92197C20.1567 9.93744 18.02 12.9531 18.02 12.9531C17.8362 13.2576 17.7657 13.3903 18.02 13.7301C18.2075 13.9843 18.8172 14.5115 19.223 14.984C19.9692 15.8315 20.5429 16.5425 20.6959 17.0345C20.8677 17.5227 20.6142 17.7769 20.1214 17.7769L20.1237 17.7777Z" fill="white"/>
</svg>
