<svg width="42" height="42" viewBox="0 0 42 42" fill="none" xmlns="http://www.w3.org/2000/svg">
<path d="M6.2838 6.2838L6.28377 6.28383C4.4175 8.14959 2.95311 10.3226 1.92944 12.7423L6.2838 6.2838ZM6.2838 6.2838C8.14961 4.41799 10.3222 2.9536 12.7424 1.92993L12.6131 1.62434M6.2838 6.2838L12.6131 1.62434M12.6131 1.62434L12.7424 1.92993C15.2487 0.869797 17.9097 0.331808 20.6527 0.331808C23.3957 0.331808 26.0572 0.869802 28.563 1.92992L28.5631 1.92995C30.9832 2.95308 33.1558 4.41796 35.0216 6.2838L35.0216 6.28383C36.8879 8.14959 38.3518 10.3226 39.376 12.7425C40.4361 15.2487 40.9736 17.9102 40.9736 20.6527C40.9736 23.3958 40.4361 26.0573 39.376 28.563L39.376 28.563C38.3523 30.9832 36.8879 33.1558 35.0216 35.0216L35.0216 35.0216C33.1558 36.8879 30.9833 38.3518 28.563 39.3755L28.5629 39.3755C26.0572 40.4361 23.3957 40.9736 20.6527 40.9736C17.9097 40.9736 15.2487 40.4361 12.7424 39.3755L12.7423 39.3755C10.3221 38.3523 8.14963 36.8879 6.28383 35.0216L6.28377 35.0216C4.41747 33.1558 2.95308 30.9832 1.92942 28.563L1.9294 28.563M12.6131 1.62434L1.9294 28.563M1.9294 28.563C0.869302 26.0573 0.331808 23.3958 0.331808 20.6527C0.331808 17.9102 0.869789 15.2487 1.92941 12.7424L1.9294 28.563Z" stroke="url(#paint0_linear_348:2679)" stroke-width="0.663615"/>
<path d="M27.1362 14.1484C28.559 14.3468 29.883 15.0752 30.8993 16.2188C30.9546 16.2813 31.0295 16.3164 31.1077 16.3164C31.1464 16.3164 31.1847 16.3078 31.2204 16.291C31.2562 16.2743 31.2887 16.2498 31.316 16.2188C31.3434 16.1879 31.3651 16.1511 31.3799 16.1107C31.3947 16.0703 31.4023 16.0269 31.4023 15.9832C31.4023 15.9394 31.3947 15.8961 31.3799 15.8556C31.3651 15.8152 31.3434 15.7784 31.3161 15.7475H31.316C30.207 14.4991 28.7621 13.7038 27.2092 13.487C27.1708 13.4815 27.1318 13.4846 27.0944 13.4962C27.057 13.5077 27.022 13.5275 26.9914 13.5544C26.9608 13.5812 26.9352 13.6147 26.916 13.6528C26.8969 13.6908 26.8845 13.7328 26.8797 13.7763C26.8749 13.8198 26.8777 13.8639 26.888 13.9062C26.8983 13.9484 26.9159 13.988 26.9397 14.0225C26.9635 14.0571 26.9931 14.086 27.0268 14.1076C27.0606 14.1292 27.0977 14.1431 27.1362 14.1484H27.1362Z" fill="url(#paint1_linear_348:2679)"/>
<path d="M10.587 16.2189C11.6034 15.0753 12.9274 14.3469 14.3502 14.1485C14.3886 14.1431 14.4258 14.1292 14.4595 14.1076C14.4932 14.086 14.5228 14.0571 14.5466 14.0226C14.5704 13.988 14.588 13.9485 14.5983 13.9062C14.6086 13.864 14.6114 13.8198 14.6066 13.7763C14.6018 13.7328 14.5895 13.6909 14.5703 13.6528C14.5511 13.6147 14.5255 13.5812 14.4949 13.5544C14.4643 13.5275 14.4293 13.5077 14.3919 13.4962C14.3546 13.4846 14.3155 13.4815 14.2771 13.487C12.7242 13.7038 11.2793 14.4991 10.1703 15.7476C10.1157 15.8103 10.0852 15.8948 10.0855 15.9828C10.0857 16.0708 10.1167 16.1551 10.1717 16.2173C10.2268 16.2795 10.3013 16.3146 10.3791 16.3149C10.4569 16.3152 10.5316 16.2807 10.587 16.2189H10.587Z" fill="url(#paint2_linear_348:2679)"/>
<path d="M8.81803 18.576C9.25441 18.9217 9.81852 19.2616 10.452 19.7191C11.1866 20.238 11.868 20.8475 12.4836 21.5366L12.4837 21.5367C13.6398 22.8428 14.8034 24.721 15.893 26.3196C15.5264 26.6221 15.0932 26.8047 14.641 26.8472C14.5837 26.8526 14.529 26.8768 14.4837 26.9169C14.4385 26.957 14.4045 27.0112 14.3862 27.0728C14.3678 27.1344 14.3657 27.2008 14.3803 27.2637C14.3948 27.3266 14.4253 27.3833 14.468 27.4269C15.0287 27.9999 15.7579 28.3162 16.5135 28.3142C16.7734 28.313 17.0321 28.2746 17.2833 28.1999C17.5516 28.5258 17.8488 28.8197 18.1703 29.0768C18.418 29.277 18.7016 29.4128 19.0011 29.4747C19.0157 30.8664 19.4814 32.2036 20.3098 33.2328C20.7246 33.7529 21.2259 34.1754 21.7851 34.4762C22.3443 34.777 22.9505 34.9502 23.5689 34.9859L23.5699 34.986C23.6463 34.9899 23.7272 34.9941 23.8125 34.9941C25.0875 34.992 26.3097 34.418 27.211 33.3978C28.1123 32.3777 28.6189 30.9949 28.6199 29.5528C28.6199 29.496 28.607 29.4401 28.5826 29.3905C28.5581 29.3409 28.5229 29.2992 28.4802 29.2693C28.4374 29.2394 28.3887 29.2224 28.3385 29.2199C28.2883 29.2173 28.2384 29.2293 28.1935 29.2547C27.8026 29.4744 27.3721 29.5887 26.9357 29.5887C26.4992 29.5887 26.0687 29.4744 25.6778 29.2547C25.6329 29.2293 25.583 29.2173 25.5328 29.2199C25.4827 29.2224 25.4339 29.2394 25.3912 29.2693C25.3484 29.2992 25.3132 29.3409 25.2887 29.3905C25.2643 29.4401 25.2514 29.496 25.2514 29.5528C25.2507 29.9855 25.0985 30.4003 24.828 30.7064C24.5575 31.0124 24.1908 31.1848 23.8082 31.1858C23.7608 31.1858 23.7129 31.1831 23.6644 31.1778C23.3034 31.1348 22.9715 30.934 22.7395 30.6183C22.5125 30.3121 22.383 29.9286 22.3717 29.5293C22.7384 29.5049 23.0911 29.3613 23.3875 29.1157C23.7025 28.8633 23.9915 28.5718 24.2491 28.2465C24.4474 28.2913 24.649 28.314 24.8512 28.3142C25.6068 28.3162 26.3361 27.9999 26.8967 27.4269C26.9394 27.3833 26.9699 27.3266 26.9845 27.2637C26.999 27.2008 26.997 27.1344 26.9786 27.0728C26.9602 27.0112 26.9263 26.957 26.881 26.9169C26.8357 26.8768 26.7811 26.8526 26.7238 26.8472C26.3088 26.8078 25.9094 26.6503 25.5627 26.3894C26.6011 24.7705 27.7108 22.8583 28.881 21.5367C29.7824 20.5609 30.7999 19.7321 31.9039 19.0744C32.2853 18.8445 32.6468 18.5748 32.9839 18.2688C33.1244 18.1343 33.2438 17.9737 33.3369 17.7941C33.4292 17.6108 33.4777 17.4035 33.4777 17.1925C33.4587 16.8053 33.341 16.4325 33.1388 16.1192C32.8495 15.6447 32.5182 15.2047 32.1502 14.8061L32.1501 14.8059C31.0954 13.6091 29.7708 12.7623 28.3204 12.3576C26.8699 11.9528 25.3491 12.0057 23.9233 12.5104C24.04 12.323 24.103 12.0997 24.1037 11.8705C24.104 11.7244 24.0786 11.5796 24.029 11.4447C23.9794 11.3097 23.9066 11.1873 23.8147 11.0846L23.8152 11.084L23.8121 11.0811L23.8095 11.0776L23.8091 11.0781C23.7182 10.9743 23.6099 10.8919 23.4906 10.8359C23.3713 10.7798 23.2434 10.7511 23.1142 10.7515H18.2506C17.9883 10.752 17.7369 10.8701 17.5515 11.0798C17.366 11.2895 17.2616 11.5739 17.2611 11.8705C17.2619 12.0695 17.3103 12.2645 17.4012 12.4348C16.6732 12.2038 15.9208 12.0856 15.1647 12.0835C14.0875 12.0785 13.02 12.3139 12.0235 12.7764C11.0269 13.2388 10.1208 13.9192 9.35713 14.7784C8.98135 15.1849 8.64266 15.6331 8.3462 16.1163C8.13989 16.4335 8.01961 16.8118 8 17.2049C7.99999 17.4122 8.04645 17.6161 8.13503 17.7975C8.30731 18.1124 8.54092 18.3787 8.81803 18.576V18.576ZM17.8886 27.9438C18.3283 27.6942 18.7087 27.3291 18.9981 26.879L18.9981 28.7354V28.7957C18.8197 28.7375 18.6512 28.6457 18.4998 28.5242C18.2815 28.3512 18.077 28.157 17.8886 27.9438V27.9438ZM23.0578 28.5633C22.8569 28.7348 22.6174 28.8388 22.3667 28.8633V26.879C22.6877 27.3794 23.1206 27.7742 23.6211 28.0228C23.4483 28.2221 23.2598 28.403 23.0578 28.5633V28.5633ZM23.0941 26.8248C22.8631 26.5642 22.6798 26.2544 22.555 25.9133C22.4301 25.5723 22.3661 25.2066 22.3667 24.8375V22.4798C22.3667 22.3914 22.3356 22.3067 22.2804 22.2442C22.2251 22.1817 22.1502 22.1466 22.072 22.1466C21.9939 22.1466 21.9189 22.1817 21.8637 22.2442C21.8084 22.3067 21.7774 22.3914 21.7774 22.4798V29.4662C21.7774 30.0462 21.9592 30.6073 22.2905 31.05C22.6213 31.4971 23.0932 31.7808 23.6059 31.8411L23.6067 31.8412C23.6744 31.8486 23.7415 31.8523 23.8082 31.8523C24.2733 31.8514 24.724 31.6704 25.0855 31.3394C25.447 31.0084 25.6974 30.5474 25.7951 30.0331C26.5091 30.3211 27.288 30.3293 28.0066 30.0564C27.896 31.2279 27.4067 32.3119 26.6326 33.1002C25.8585 33.8886 24.8542 34.3257 23.8125 34.3276C23.7452 34.3277 23.6733 34.3241 23.5972 34.3202C23.0558 34.2887 22.5251 34.1368 22.0357 33.8731C21.5463 33.6094 21.1076 33.2391 20.7449 32.7834C20.0002 31.8592 19.5874 30.6538 19.5874 29.4034V22.4798C19.5874 22.3914 19.5563 22.3067 19.5011 22.2442C19.4458 22.1817 19.3709 22.1466 19.2927 22.1466C19.2146 22.1466 19.1396 22.1817 19.0844 22.2442C19.0291 22.3067 18.9981 22.3914 18.9981 22.4798V24.8379C18.9984 25.3177 18.8899 25.7896 18.6831 26.2086C18.4763 26.6275 18.178 26.9795 17.8167 27.231C17.4554 27.4825 17.0432 27.6251 16.6194 27.6452C16.1955 27.6653 15.7742 27.5622 15.3956 27.3457C16.0088 27.1177 16.5428 26.6765 16.9212 26.0849C17.2997 25.4933 17.5032 24.7817 17.5029 24.0515V20.9081C17.5032 20.8641 17.4958 20.8205 17.4811 20.7798C17.4665 20.7391 17.4448 20.702 17.4174 20.6708C17.39 20.6396 17.3574 20.6148 17.3216 20.5979C17.2857 20.581 17.2472 20.5723 17.2083 20.5723C17.1694 20.5723 17.1309 20.581 17.095 20.5979C17.0591 20.6148 17.0265 20.6396 16.9991 20.6708C16.9717 20.702 16.9501 20.7391 16.9354 20.7798C16.9207 20.8205 16.9133 20.8641 16.9136 20.9081H16.9136V22.3118C15.9522 21.2029 15.4152 19.7106 15.4186 18.1575C15.4168 17.324 15.5729 16.4997 15.8766 15.7403H25.4874C25.7895 16.5003 25.9459 17.3242 25.9462 18.1575C25.9465 18.397 25.9334 18.6364 25.9069 18.874L25.9059 18.8846C25.8966 18.9959 25.8809 19.107 25.8613 19.2224L25.8607 19.226C25.837 19.3741 25.811 19.5166 25.7766 19.6547L25.773 19.6709C25.7574 19.748 25.7387 19.8255 25.7169 19.9035L25.7162 19.9057C25.6877 20.0101 25.6545 20.115 25.6199 20.2247C25.5584 20.4172 25.4867 20.6053 25.4052 20.788L25.401 20.7976C25.3794 20.8517 25.3549 20.9042 25.3277 20.955L25.3138 20.983C25.2945 21.0289 25.273 21.0736 25.2495 21.1169L25.2387 21.1375C25.2004 21.2171 25.1594 21.2952 25.1168 21.3676L25.1105 21.3786C25.0792 21.4367 25.0415 21.4973 24.9998 21.5644C24.9257 21.6822 24.8493 21.7988 24.7707 21.9099C24.7196 21.9821 24.6649 22.0548 24.6104 22.1238L24.6037 22.1315L24.5917 22.146C24.5467 22.2039 24.5026 22.2573 24.455 22.3114L24.4516 22.3152L24.4511 22.3157V20.9081C24.4514 20.8641 24.444 20.8205 24.4293 20.7798C24.4147 20.739 24.393 20.702 24.3656 20.6708C24.3382 20.6396 24.3057 20.6148 24.2698 20.5979C24.2339 20.581 24.1954 20.5723 24.1565 20.5723C24.1176 20.5723 24.0791 20.581 24.0432 20.5979C24.0073 20.6148 23.9747 20.6396 23.9473 20.6708C23.92 20.702 23.8983 20.739 23.8836 20.7798C23.869 20.8205 23.8616 20.8641 23.8619 20.9081H23.8618V24.0515C23.8614 24.5622 23.961 25.0667 24.1534 25.5287C24.3458 25.9907 24.6263 26.3988 24.9747 26.7236C24.9763 26.725 24.977 26.7272 24.9787 26.7285L24.9818 26.7302C25.2743 27.0028 25.6092 27.2115 25.9692 27.3457C25.5026 27.6126 24.9733 27.7059 24.457 27.6123C23.9407 27.5188 23.4637 27.2432 23.0941 26.8248ZM17.8323 13.1496C17.9195 13.0877 18.0064 13.0316 18.0939 12.9754C18.1457 12.9848 18.1981 12.9896 18.2506 12.9897H19.0314C19.0093 13.1392 18.9981 13.2906 18.9981 13.4422C18.9975 13.5471 19.0029 13.6519 19.0143 13.7561L19.014 13.7561L19.0145 13.7603L19.0145 13.7607L19.0146 13.7609C19.0189 13.8015 19.0245 13.8469 19.0318 13.8949H17.0127C17.2631 13.6159 17.5377 13.3663 17.8323 13.1496ZM23.265 12.977L23.2668 12.9765L23.2698 12.9757C23.3786 13.0448 23.4873 13.1147 23.5886 13.192L23.59 13.1931C23.8621 13.4001 24.1167 13.635 24.3506 13.8949H22.3308C22.3548 13.7455 22.3668 13.594 22.3667 13.4422C22.3666 13.2906 22.3555 13.1392 22.3333 12.9897H23.1142C23.1647 12.9897 23.2151 12.9855 23.265 12.977V12.977ZM22.0627 14.7608L22.0673 14.7515C22.0872 14.7092 22.1165 14.6511 22.1448 14.5802L22.145 14.5803L22.1519 14.5645L22.1532 14.5614H24.8705C24.9817 14.7259 25.0852 14.8969 25.1805 15.0738H21.8645C21.9386 14.9763 22.0049 14.8715 22.0627 14.7608V14.7608ZM21.7278 12.9897C21.7594 13.1379 21.776 13.2897 21.7774 13.4422C21.7782 13.5627 21.7684 13.6829 21.7483 13.8012L21.7461 13.815C21.7326 13.9158 21.7098 14.0147 21.6784 14.1101L21.6781 14.1109C21.6577 14.1725 21.639 14.2281 21.6194 14.2791L21.6169 14.2847L21.6102 14.3011C21.5995 14.33 21.5777 14.3749 21.5525 14.4272C21.5025 14.5244 21.4433 14.6151 21.3759 14.6977L21.375 14.6988C21.3462 14.7351 21.3154 14.7692 21.2826 14.8009L21.2718 14.8116C21.2447 14.84 21.2153 14.8655 21.184 14.8877L21.171 14.8974C21.1371 14.9235 21.1015 14.9469 21.0647 14.9674C21.029 14.9879 20.9921 15.0054 20.9543 15.02L20.9527 15.0205L20.9085 15.0362C20.8655 15.0507 20.8215 15.0612 20.777 15.0674C20.7382 15.0711 20.7056 15.0739 20.6823 15.0738C20.6326 15.0738 20.5831 15.0683 20.5344 15.0573L20.5274 15.0564C20.3038 15.0009 20.1033 14.8615 19.9586 14.6609L19.917 14.6037C19.9015 14.5811 19.8851 14.5537 19.8643 14.5185L19.8548 14.5034L19.8214 14.4436L19.8162 14.4335C19.8002 14.4033 19.783 14.3678 19.7652 14.3277L19.7363 14.259C19.7204 14.2169 19.7053 14.1698 19.6882 14.1158L19.6854 14.1075C19.6664 14.0491 19.6503 13.9896 19.6372 13.9292L19.6273 13.8732L19.6202 13.8286C19.6104 13.7792 19.6034 13.7291 19.5993 13.6786L19.5988 13.674C19.5905 13.5971 19.5867 13.5197 19.5873 13.4422C19.5887 13.2897 19.6053 13.1379 19.637 12.9897L21.7278 12.9897ZM16.4943 14.5614H19.211L19.2351 14.6187L19.2377 14.6247C19.2598 14.6748 19.2827 14.7218 19.3064 14.7669L19.3062 14.767L19.308 14.7704L19.3113 14.7771L19.3117 14.7768C19.3309 14.8153 19.352 14.8525 19.3749 14.8883L19.3743 14.8887C19.3949 14.9236 19.42 14.9666 19.4529 15.0145L19.4578 15.0214L19.4959 15.0738H16.1842C16.2795 14.8969 16.383 14.7259 16.4943 14.5614V14.5614ZM31.7334 15.2772L31.7333 15.2771C32.0719 15.6429 32.3771 16.0464 32.6442 16.4815C32.7831 16.6878 32.8678 16.9342 32.8884 17.1925C32.8886 17.2894 32.866 17.3846 32.8228 17.4683C32.6866 17.6943 32.5079 17.8834 32.2994 18.0219C31.8976 18.3307 31.3084 18.6749 30.6373 19.1462C29.8495 19.6883 29.1202 20.3324 28.4643 21.0654C27.2408 22.4513 26.1317 24.3666 25.1109 25.9589C24.6854 25.4406 24.4496 24.7589 24.4511 24.0515V23.2217C24.4831 23.1905 24.5167 23.16 24.547 23.128L24.5472 23.1282L24.5513 23.1238C24.554 23.1209 24.5572 23.1183 24.5599 23.1154L24.5595 23.115C24.6714 23.0078 24.7749 22.8956 24.8721 22.7819L24.8722 22.782L24.8742 22.7797L24.8756 22.7782L24.8755 22.7781C24.9265 22.7201 24.9748 22.6613 25.0225 22.6003L25.0225 22.6004L25.0363 22.5846L25.0464 22.5724C25.1091 22.4933 25.1714 22.4103 25.2306 22.3266L25.2308 22.3264C25.3186 22.2022 25.4017 22.0753 25.4805 21.95L25.4814 21.9486C25.5206 21.8854 25.5639 21.8154 25.6069 21.7372L25.6071 21.7373L25.6097 21.7324L25.6133 21.7263L25.613 21.7262C25.6611 21.6439 25.7047 21.5601 25.7453 21.477L25.7454 21.4771L25.7502 21.4678C25.752 21.464 25.7543 21.4603 25.7562 21.4565L25.756 21.4564L25.7584 21.4518C25.7882 21.3983 25.815 21.3429 25.8387 21.2857L25.8388 21.2855C25.8721 21.2225 25.9025 21.1576 25.93 21.0911H25.9301L25.9303 21.0905L25.9342 21.0815L25.9341 21.0814C26.0238 20.8796 26.103 20.6721 26.1712 20.4599L26.1713 20.4599L26.172 20.4576L26.1737 20.4527L26.1745 20.4502C26.2089 20.3409 26.2451 20.2267 26.2787 20.1043L26.2785 20.1053L26.2791 20.1031L26.2787 20.1043C26.3038 20.0149 26.3251 19.9251 26.3437 19.8352L26.3439 19.8353L26.3464 19.8236L26.3475 19.8191L26.3474 19.819C26.3869 19.6576 26.4156 19.5002 26.4399 19.3483H26.4399L26.44 19.3476L26.4405 19.3446L26.4404 19.3446C26.4614 19.2207 26.4795 19.0924 26.4912 18.9578L26.4915 18.9579L26.4922 18.9504L26.4926 18.9473L26.4924 18.9473C26.5213 18.6853 26.5356 18.4215 26.5354 18.1575C26.5365 17.1891 26.3484 16.2324 25.9845 15.3558L25.9846 15.3557L25.9499 15.2693L25.9474 15.265L25.9466 15.2614H25.9466C25.7566 14.8192 25.5233 14.4026 25.251 14.0193L25.2508 14.019C24.9954 13.6626 24.7086 13.3364 24.3949 13.0455C25.6837 12.6568 27.0403 12.6584 28.3283 13.0501C29.6164 13.4418 30.7907 14.2099 31.7334 15.2773L31.7334 15.2772ZM17.9682 11.5512C18.0051 11.509 18.0491 11.4755 18.0976 11.4527C18.1461 11.4298 18.198 11.418 18.2506 11.418H23.1142C23.166 11.4174 23.2175 11.4287 23.2654 11.4512C23.3133 11.4737 23.3566 11.5069 23.3929 11.5488L23.3986 11.5553C23.4357 11.5962 23.4651 11.6453 23.485 11.6995C23.5049 11.7536 23.5149 11.8118 23.5144 11.8705C23.5142 11.9669 23.4868 12.0607 23.4363 12.1383C23.3858 12.2159 23.3147 12.2733 23.2334 12.3021L23.226 12.3048C23.1898 12.3176 23.1521 12.3238 23.1142 12.3232H18.2506C18.2127 12.3238 18.1749 12.3176 18.1387 12.3048L18.1333 12.3028C18.071 12.2811 18.0146 12.242 17.9692 12.1891L17.9661 12.1856C17.929 12.1446 17.8996 12.0956 17.8797 12.0414C17.8598 11.9873 17.8498 11.9291 17.8503 11.8705C17.8504 11.8111 17.8608 11.7523 17.881 11.6975C17.9012 11.6427 17.9308 11.593 17.9682 11.5512V11.5512ZM8.83992 16.4802C9.11433 16.036 9.42717 15.6238 9.7738 15.2497C10.4827 14.4523 11.3239 13.821 12.249 13.3921C13.174 12.9631 14.1649 12.7449 15.1647 12.75C15.7879 12.7502 16.4088 12.835 17.0141 13.0027C16.6823 13.3037 16.3803 13.6447 16.1136 14.0195C15.8424 14.4014 15.6099 14.8165 15.4203 15.2569L15.4195 15.2584L15.4183 15.261L15.4182 15.2614L15.4182 15.2615C15.4013 15.3001 15.3805 15.3493 15.3606 15.4079L15.3605 15.4079C15.0079 16.2695 14.8266 17.2081 14.8293 18.1575C14.8286 19.1223 15.0149 20.0755 15.375 20.9501C15.7351 21.8247 16.2603 22.5994 16.9136 23.2197V24.0516C16.9144 24.7153 16.7059 25.3575 16.3257 25.863C15.2565 24.2921 14.0986 22.4222 12.9004 21.0655L12.9005 21.0656C11.9793 20.063 10.9449 19.2026 9.8242 18.507C9.48793 18.2975 9.16943 18.0534 8.87274 17.7779C8.78534 17.6927 8.711 17.5917 8.65272 17.4791C8.61092 17.3955 8.58906 17.301 8.58927 17.2049C8.61054 16.9414 8.69745 16.6901 8.83992 16.4802Z" fill="url(#paint3_linear_348:2679)"/>
<path d="M16.1132 14.02L16.1137 14.019L16.1132 14.02Z" fill="url(#paint4_linear_348:2679)"/>
<path d="M19.6399 10.2388H21.7244C21.8026 10.2388 21.8775 10.2037 21.9328 10.1411C21.988 10.0786 22.0191 9.99384 22.0191 9.90544C22.0252 9.43538 21.8977 8.97554 21.6553 8.59369C21.5493 8.41126 21.4048 8.26151 21.235 8.15788C21.0651 8.05425 20.8752 8 20.6822 8C20.4892 8 20.2992 8.05426 20.1294 8.15789C19.9595 8.26152 19.8151 8.41128 19.709 8.59371C19.4667 8.97557 19.3392 9.4354 19.3453 9.90544C19.3453 9.99384 19.3763 10.0786 19.4316 10.1411C19.4869 10.2037 19.5618 10.2388 19.6399 10.2388ZM20.6821 8.66667C20.7826 8.67248 20.8805 8.70513 20.9677 8.76195C21.0549 8.81877 21.1289 8.89814 21.1838 8.99357C21.2924 9.16602 21.3657 9.36364 21.3984 9.5721H19.966C19.9987 9.36364 20.072 9.16603 20.1806 8.99357C20.2354 8.89815 20.3095 8.81879 20.3966 8.76197C20.4838 8.70515 20.5816 8.67249 20.6821 8.66667V8.66667Z" fill="url(#paint5_linear_348:2679)"/>
<path d="M21.0296 22.4736H20.3349C20.2568 22.4736 20.1818 22.5087 20.1266 22.5712C20.0713 22.6337 20.0403 22.7185 20.0403 22.8069C20.0403 22.8953 20.0713 22.98 20.1266 23.0425C20.1818 23.105 20.2568 23.1401 20.3349 23.1401H21.0296C21.1077 23.1401 21.1827 23.105 21.2379 23.0425C21.2932 22.98 21.3242 22.8953 21.3242 22.8069C21.3242 22.7185 21.2932 22.6337 21.2379 22.5712C21.1827 22.5087 21.1077 22.4736 21.0296 22.4736Z" fill="url(#paint6_linear_348:2679)"/>
<path d="M21.0296 24.7529H20.3349C20.2568 24.7529 20.1818 24.788 20.1266 24.8505C20.0713 24.913 20.0403 24.9978 20.0403 25.0862C20.0403 25.1746 20.0713 25.2593 20.1266 25.3218C20.1818 25.3843 20.2568 25.4194 20.3349 25.4194H21.0296C21.1077 25.4194 21.1827 25.3843 21.2379 25.3218C21.2932 25.2593 21.3242 25.1746 21.3242 25.0862C21.3242 24.9978 21.2932 24.913 21.2379 24.8505C21.1827 24.788 21.1077 24.7529 21.0296 24.7529Z" fill="url(#paint7_linear_348:2679)"/>
<path d="M20.3349 27.6987H21.0296C21.1077 27.6987 21.1827 27.6636 21.2379 27.6012C21.2932 27.5387 21.3242 27.454 21.3242 27.3657C21.3242 27.2774 21.2932 27.1927 21.2379 27.1303C21.1827 27.0678 21.1077 27.0327 21.0296 27.0327H20.3349C20.2568 27.0327 20.1818 27.0678 20.1266 27.1303C20.0713 27.1927 20.0403 27.2774 20.0403 27.3657C20.0403 27.454 20.0713 27.5387 20.1266 27.6012C20.1818 27.6636 20.2568 27.6987 20.3349 27.6987Z" fill="url(#paint8_linear_348:2679)"/>
<path d="M21.3284 29.6258C21.3264 29.5373 21.2935 29.4534 21.2368 29.3925C21.1802 29.3316 21.1045 29.2986 21.0264 29.3009L20.3318 29.3209C20.293 29.3218 20.2547 29.3313 20.2191 29.349C20.1836 29.3667 20.1514 29.3921 20.1246 29.4239C20.0978 29.4557 20.0768 29.4932 20.0628 29.5342C20.0488 29.5752 20.0421 29.6189 20.0431 29.6628C20.0441 29.7067 20.0527 29.75 20.0685 29.7902C20.0843 29.8303 20.107 29.8665 20.1352 29.8967C20.1635 29.9269 20.1967 29.9505 20.233 29.9661C20.2693 29.9817 20.308 29.989 20.3468 29.9876L21.0413 29.9676C21.08 29.9665 21.1181 29.9568 21.1535 29.939C21.1889 29.9212 21.2208 29.8957 21.2474 29.864C21.2741 29.8322 21.295 29.7948 21.3088 29.754C21.3227 29.7131 21.3294 29.6695 21.3284 29.6258Z" fill="url(#paint9_linear_348:2679)"/>
<path d="M21.45 31.2435L20.9058 31.7321C20.845 31.7872 20.806 31.8673 20.7973 31.9548C20.7885 32.0424 20.8109 32.1303 20.8593 32.1993C20.9078 32.2683 20.9785 32.3127 21.0559 32.3229C21.1333 32.3332 21.2111 32.3083 21.2724 32.2538L21.8165 31.7652C21.847 31.7381 21.8724 31.7044 21.8913 31.6661C21.9103 31.6278 21.9223 31.5857 21.9268 31.5421C21.9313 31.4986 21.9282 31.4544 21.9176 31.4123C21.9069 31.3701 21.889 31.3307 21.8649 31.2963C21.8408 31.262 21.8109 31.2334 21.777 31.2121C21.743 31.1909 21.7057 31.1774 21.6671 31.1725C21.6286 31.1676 21.5896 31.1713 21.5523 31.1835C21.515 31.1957 21.4803 31.2161 21.45 31.2435V31.2435Z" fill="url(#paint10_linear_348:2679)"/>
<path d="M22.8574 33.6733C22.933 33.6956 23.0134 33.683 23.0808 33.6383C23.1482 33.5936 23.1971 33.5204 23.2169 33.4349L23.3921 32.6745C23.4118 32.589 23.4007 32.4982 23.3611 32.4219C23.3216 32.3457 23.2569 32.2904 23.1813 32.2681C23.1056 32.2458 23.0253 32.2584 22.9579 32.3031C22.8905 32.3478 22.8415 32.421 22.8218 32.5065L22.6466 33.2669C22.6269 33.3524 22.638 33.4433 22.6776 33.5195C22.7171 33.5957 22.7818 33.651 22.8574 33.6733V33.6733Z" fill="url(#paint11_linear_348:2679)"/>
<path d="M24.8539 33.3146C24.8836 33.3964 24.9408 33.4615 25.0128 33.4957C25.0849 33.5298 25.166 33.5301 25.2383 33.4965C25.3106 33.463 25.3682 33.3983 25.3983 33.3167C25.4285 33.2351 25.4288 33.1433 25.3991 33.0614L25.1354 32.3339C25.1057 32.2522 25.0485 32.1872 24.9765 32.1532C24.9044 32.1191 24.8234 32.1189 24.7512 32.1524C24.6789 32.1859 24.6214 32.2505 24.5913 32.332C24.5611 32.4135 24.5607 32.5052 24.5902 32.587L24.8539 33.3146Z" fill="url(#paint12_linear_348:2679)"/>
<path d="M26.0431 31.4454L26.6397 31.8479C26.7068 31.8932 26.787 31.9065 26.8628 31.8849C26.9386 31.8633 27.0036 31.8085 27.0437 31.7326C27.0837 31.6567 27.0955 31.566 27.0764 31.4803C27.0572 31.3947 27.0088 31.3211 26.9417 31.2758L26.3451 30.8732C26.278 30.828 26.1977 30.8147 26.1219 30.8363C26.0462 30.8579 25.9811 30.9127 25.9411 30.9886C25.901 31.0644 25.8892 31.1552 25.9084 31.2409C25.9275 31.3265 25.976 31.4001 26.0431 31.4454V31.4454Z" fill="url(#paint13_linear_348:2679)"/>
<path d="M20.8907 21.3399L21.5856 20.554C21.6408 20.4915 21.6719 20.4068 21.6719 20.3184C21.6719 20.23 21.6408 20.1452 21.5856 20.0827C21.5304 20.0202 21.4554 19.9851 21.3773 19.9851C21.2991 19.9851 21.2242 20.0202 21.1689 20.0827L20.6824 20.6329L20.196 20.0827C20.1687 20.0515 20.1362 20.0267 20.1004 20.0097C20.0646 19.9928 20.0262 19.984 19.9874 19.9839C19.9486 19.9838 19.9101 19.9923 19.8742 20.0091C19.8384 20.0258 19.8058 20.0505 19.7783 20.0815C19.7509 20.1126 19.7291 20.1494 19.7143 20.19C19.6995 20.2306 19.6919 20.2741 19.692 20.318C19.6921 20.3619 19.6999 20.4054 19.7149 20.4459C19.7299 20.4864 19.7518 20.5231 19.7794 20.554L20.4741 21.3399C20.5014 21.3708 20.5339 21.3954 20.5697 21.4121C20.6054 21.4289 20.6437 21.4375 20.6824 21.4375C20.7211 21.4375 20.7594 21.4289 20.7951 21.4121C20.8309 21.3954 20.8634 21.3708 20.8907 21.3399V21.3399Z" fill="url(#paint14_linear_348:2679)"/>
<path d="M20.6822 18.8833C20.7603 18.8833 20.8353 18.8482 20.8905 18.7857C20.9458 18.7232 20.9768 18.6384 20.9768 18.55V16.9783C20.9768 16.8899 20.9458 16.8051 20.8905 16.7426C20.8353 16.6801 20.7603 16.645 20.6822 16.645C20.6041 16.645 20.5291 16.6801 20.4739 16.7426C20.4186 16.8051 20.3876 16.8899 20.3876 16.9783V18.55C20.3876 18.6384 20.4186 18.7232 20.4739 18.7857C20.5291 18.8482 20.6041 18.8833 20.6822 18.8833Z" fill="url(#paint15_linear_348:2679)"/>
<path d="M19.9348 17.7644V16.5857C19.9348 16.4973 19.9038 16.4125 19.8485 16.35C19.7933 16.2876 19.7183 16.2524 19.6402 16.2524C19.5621 16.2524 19.4871 16.2876 19.4319 16.35C19.3766 16.4125 19.3456 16.4973 19.3456 16.5857V17.7644C19.3456 17.8528 19.3766 17.9376 19.4319 18.0001C19.4871 18.0625 19.5621 18.0977 19.6402 18.0977C19.7183 18.0977 19.7933 18.0625 19.8485 18.0001C19.9038 17.9376 19.9348 17.8528 19.9348 17.7644V17.7644Z" fill="url(#paint16_linear_348:2679)"/>
<path d="M21.7247 16.2524C21.6466 16.2524 21.5716 16.2876 21.5164 16.35C21.4611 16.4125 21.4301 16.4973 21.4301 16.5857V17.7644C21.4301 17.8528 21.4611 17.9376 21.5164 18.0001C21.5716 18.0625 21.6466 18.0977 21.7247 18.0977C21.8029 18.0977 21.8778 18.0625 21.9331 18.0001C21.9884 17.9376 22.0194 17.8528 22.0194 17.7644V16.5857C22.0194 16.4973 21.9884 16.4125 21.9331 16.35C21.8778 16.2876 21.8029 16.2524 21.7247 16.2524Z" fill="url(#paint17_linear_348:2679)"/>
<path d="M18.4601 17.9476C18.1614 17.5868 17.7499 17.3722 17.3134 17.3496C16.8769 17.327 16.4498 17.4982 16.1232 17.8266C16.0648 17.8852 16.0293 17.9677 16.0246 18.0559C16.0199 18.1442 16.0464 18.2309 16.0982 18.297C16.1501 18.3632 16.223 18.4033 16.301 18.4086C16.379 18.4139 16.4557 18.3839 16.5141 18.3253C16.5337 18.3057 16.5563 18.2909 16.577 18.273C16.5953 18.4876 16.6686 18.6916 16.7878 18.86C16.907 19.0283 17.067 19.1537 17.2482 19.2208C17.4295 19.2879 17.624 19.2938 17.8082 19.2378C17.9923 19.1818 18.1581 19.0663 18.2851 18.9055C18.2937 18.9389 18.303 18.9719 18.3092 19.0062C18.3246 19.0928 18.3698 19.1689 18.4349 19.2178C18.4999 19.2667 18.5795 19.2844 18.656 19.267C18.7326 19.2495 18.7999 19.1985 18.8432 19.1249C18.8865 19.0514 18.9022 18.9614 18.8868 18.8748C18.8248 18.5304 18.6795 18.2122 18.4671 17.9557L18.4601 17.9476ZM17.5557 18.6093C17.4929 18.6094 17.4309 18.5927 17.3748 18.5605C17.3187 18.5284 17.2702 18.4818 17.233 18.4245C17.1958 18.3671 17.1712 18.3007 17.161 18.2305C17.1507 18.1604 17.1553 18.0885 17.1743 18.0207C17.1952 18.0193 17.2156 18.0142 17.2367 18.0142C17.4914 18.0142 17.7381 18.1152 17.9339 18.2995C17.907 18.3891 17.8562 18.4671 17.7885 18.5226C17.7207 18.5781 17.6394 18.6084 17.5557 18.6093Z" fill="url(#paint18_linear_348:2679)"/>
<path d="M24.7879 18.2733C24.8085 18.2912 24.831 18.306 24.8505 18.3256C24.909 18.3839 24.9856 18.4136 25.0634 18.4082C25.1413 18.4028 25.214 18.3627 25.2658 18.2967C25.3175 18.2307 25.344 18.1441 25.3395 18.0561C25.3349 17.968 25.2997 17.8855 25.2415 17.8268C24.9149 17.4982 24.4878 17.327 24.0513 17.3496C23.6147 17.3723 23.2032 17.5869 22.9046 17.9479L22.8977 17.9558C22.6852 18.2124 22.5399 18.5307 22.4779 18.8752C22.4626 18.9618 22.4783 19.0518 22.5215 19.1254C22.5648 19.1989 22.6322 19.25 22.7087 19.2674C22.7853 19.2849 22.8648 19.2672 22.9299 19.2183C22.9949 19.1694 23.0402 19.0932 23.0556 19.0066C23.0617 18.9724 23.0711 18.9393 23.0797 18.9059C23.2067 19.0668 23.3724 19.1823 23.5566 19.2383C23.7407 19.2943 23.9353 19.2884 24.1165 19.2213C24.2977 19.1542 24.4578 19.0288 24.577 18.8604C24.6962 18.6921 24.7695 18.4881 24.7879 18.2733H24.7879ZM24.0913 18.4764C24.0544 18.5186 24.0104 18.5521 23.962 18.575C23.9135 18.5979 23.8616 18.6097 23.8091 18.6097C23.7254 18.6088 23.6441 18.5785 23.5763 18.5229C23.5086 18.4674 23.4577 18.3894 23.4309 18.2998C23.6267 18.1155 23.8733 18.0145 24.128 18.0144C24.1491 18.0144 24.1696 18.0196 24.1905 18.0209C24.2127 18.0998 24.2151 18.1841 24.1976 18.2645C24.1801 18.3448 24.1433 18.4182 24.0913 18.4764V18.4764Z" fill="url(#paint19_linear_348:2679)"/>
<defs>
<linearGradient id="paint0_linear_348:2679" x1="-8.43107" y1="1.30613" x2="45.0358" y2="40.8643" gradientUnits="userSpaceOnUse">
<stop stop-color="#ACB4FF"/>
<stop offset="0.520833" stop-color="#A55FFF"/>
<stop offset="1" stop-color="#816CFF" stop-opacity="0.88"/>
</linearGradient>
<linearGradient id="paint1_linear_348:2679" x1="25.9538" y1="13.5739" x2="29.7343" y2="18.0429" gradientUnits="userSpaceOnUse">
<stop stop-color="#ACB4FF"/>
<stop offset="0.520833" stop-color="#A55FFF"/>
<stop offset="1" stop-color="#816CFF" stop-opacity="0.88"/>
</linearGradient>
<linearGradient id="paint2_linear_348:2679" x1="9.16215" y1="13.5739" x2="12.9405" y2="18.0413" gradientUnits="userSpaceOnUse">
<stop stop-color="#ACB4FF"/>
<stop offset="0.520833" stop-color="#A55FFF"/>
<stop offset="1" stop-color="#816CFF" stop-opacity="0.88"/>
</linearGradient>
<linearGradient id="paint3_linear_348:2679" x1="2.79961" y1="11.518" x2="34.6031" y2="36.247" gradientUnits="userSpaceOnUse">
<stop stop-color="#ACB4FF"/>
<stop offset="0.520833" stop-color="#A55FFF"/>
<stop offset="1" stop-color="#816CFF" stop-opacity="0.88"/>
</linearGradient>
<linearGradient id="paint4_linear_348:2679" x1="16.1131" y1="14.0191" x2="16.1139" y2="14.0194" gradientUnits="userSpaceOnUse">
<stop stop-color="#ACB4FF"/>
<stop offset="0.520833" stop-color="#A55FFF"/>
<stop offset="1" stop-color="#816CFF" stop-opacity="0.88"/>
</linearGradient>
<linearGradient id="paint5_linear_348:2679" x1="18.7992" y1="8.07079" x2="21.8067" y2="10.7287" gradientUnits="userSpaceOnUse">
<stop stop-color="#ACB4FF"/>
<stop offset="0.520833" stop-color="#A55FFF"/>
<stop offset="1" stop-color="#816CFF" stop-opacity="0.88"/>
</linearGradient>
<linearGradient id="paint6_linear_348:2679" x1="19.7782" y1="22.4947" x2="20.6266" y2="23.7039" gradientUnits="userSpaceOnUse">
<stop stop-color="#ACB4FF"/>
<stop offset="0.520833" stop-color="#A55FFF"/>
<stop offset="1" stop-color="#816CFF" stop-opacity="0.88"/>
</linearGradient>
<linearGradient id="paint7_linear_348:2679" x1="19.7782" y1="24.774" x2="20.6266" y2="25.9832" gradientUnits="userSpaceOnUse">
<stop stop-color="#ACB4FF"/>
<stop offset="0.520833" stop-color="#A55FFF"/>
<stop offset="1" stop-color="#816CFF" stop-opacity="0.88"/>
</linearGradient>
<linearGradient id="paint8_linear_348:2679" x1="19.7782" y1="27.0538" x2="20.6258" y2="28.2626" gradientUnits="userSpaceOnUse">
<stop stop-color="#ACB4FF"/>
<stop offset="0.520833" stop-color="#A55FFF"/>
<stop offset="1" stop-color="#816CFF" stop-opacity="0.88"/>
</linearGradient>
<linearGradient id="paint9_linear_348:2679" x1="19.7806" y1="29.3225" x2="20.6634" y2="30.5447" gradientUnits="userSpaceOnUse">
<stop stop-color="#ACB4FF"/>
<stop offset="0.520833" stop-color="#A55FFF"/>
<stop offset="1" stop-color="#816CFF" stop-opacity="0.88"/>
</linearGradient>
<linearGradient id="paint10_linear_348:2679" x1="20.5641" y1="31.2069" x2="22.0505" y2="32.2863" gradientUnits="userSpaceOnUse">
<stop stop-color="#ACB4FF"/>
<stop offset="0.520833" stop-color="#A55FFF"/>
<stop offset="1" stop-color="#816CFF" stop-opacity="0.88"/>
</linearGradient>
<linearGradient id="paint11_linear_348:2679" x1="22.481" y1="32.3024" x2="23.8044" y2="32.8271" gradientUnits="userSpaceOnUse">
<stop stop-color="#ACB4FF"/>
<stop offset="0.520833" stop-color="#A55FFF"/>
<stop offset="1" stop-color="#816CFF" stop-opacity="0.88"/>
</linearGradient>
<linearGradient id="paint12_linear_348:2679" x1="24.3943" y1="32.1715" x2="25.812" y2="32.8132" gradientUnits="userSpaceOnUse">
<stop stop-color="#ACB4FF"/>
<stop offset="0.520833" stop-color="#A55FFF"/>
<stop offset="1" stop-color="#816CFF" stop-opacity="0.88"/>
</linearGradient>
<linearGradient id="paint13_linear_348:2679" x1="25.6574" y1="30.86" x2="27.0764" y2="32.0249" gradientUnits="userSpaceOnUse">
<stop stop-color="#ACB4FF"/>
<stop offset="0.520833" stop-color="#A55FFF"/>
<stop offset="1" stop-color="#816CFF" stop-opacity="0.88"/>
</linearGradient>
<linearGradient id="paint14_linear_348:2679" x1="19.2879" y1="20.0299" x2="21.2555" y2="22.0126" gradientUnits="userSpaceOnUse">
<stop stop-color="#ACB4FF"/>
<stop offset="0.520833" stop-color="#A55FFF"/>
<stop offset="1" stop-color="#816CFF" stop-opacity="0.88"/>
</linearGradient>
<linearGradient id="paint15_linear_348:2679" x1="20.2673" y1="16.7158" x2="21.4044" y2="16.9373" gradientUnits="userSpaceOnUse">
<stop stop-color="#ACB4FF"/>
<stop offset="0.520833" stop-color="#A55FFF"/>
<stop offset="1" stop-color="#816CFF" stop-opacity="0.88"/>
</linearGradient>
<linearGradient id="paint16_linear_348:2679" x1="19.2253" y1="16.3108" x2="20.3431" y2="16.5749" gradientUnits="userSpaceOnUse">
<stop stop-color="#ACB4FF"/>
<stop offset="0.520833" stop-color="#A55FFF"/>
<stop offset="1" stop-color="#816CFF" stop-opacity="0.88"/>
</linearGradient>
<linearGradient id="paint17_linear_348:2679" x1="21.3098" y1="16.3108" x2="22.4278" y2="16.575" gradientUnits="userSpaceOnUse">
<stop stop-color="#ACB4FF"/>
<stop offset="0.520833" stop-color="#A55FFF"/>
<stop offset="1" stop-color="#816CFF" stop-opacity="0.88"/>
</linearGradient>
<linearGradient id="paint18_linear_348:2679" x1="15.4385" y1="17.4086" x2="18.0367" y2="20.2683" gradientUnits="userSpaceOnUse">
<stop stop-color="#ACB4FF"/>
<stop offset="0.520833" stop-color="#A55FFF"/>
<stop offset="1" stop-color="#816CFF" stop-opacity="0.88"/>
</linearGradient>
<linearGradient id="paint19_linear_348:2679" x1="21.8868" y1="17.4086" x2="24.4857" y2="20.2677" gradientUnits="userSpaceOnUse">
<stop stop-color="#ACB4FF"/>
<stop offset="0.520833" stop-color="#A55FFF"/>
<stop offset="1" stop-color="#816CFF" stop-opacity="0.88"/>
</linearGradient>
</defs>
</svg>
