<svg width="42" height="41" viewBox="0 0 42 41" fill="none" xmlns="http://www.w3.org/2000/svg">
<path d="M20.3457 39.588L20.3291 39.5881C20.2948 39.5883 20.2637 39.6015 20.2399 39.6253L20.3457 39.588ZM20.3457 39.588C20.4092 39.5951 20.4581 39.6493 20.4586 39.7116C20.459 39.7773 20.405 39.8356 20.3326 39.8365H20.3314C20.2603 39.8365 20.2048 39.7788 20.2043 39.713C20.204 39.6789 20.2163 39.6491 20.2398 39.6254L20.3457 39.588ZM0.846347 15.5989L0.846332 15.599C0.505167 17.0613 0.331808 18.5697 0.331808 20.0846C0.331808 22.5362 0.777753 24.9275 1.65682 27.1932C2.50619 29.3818 3.7319 31.3874 5.30115 33.1548C8.4768 36.7307 12.8312 39.0423 17.5618 39.6659C17.5791 39.6674 17.5836 39.6676 17.586 39.6676C17.65 39.6676 17.7041 39.6192 17.7124 39.5585C17.721 39.4929 17.6739 39.4284 17.6027 39.4191L17.6025 39.4191C7.90135 38.1459 0.585177 29.8352 0.58609 20.0846L0.846347 15.5989ZM0.846347 15.5989C1.17753 14.1781 1.67123 12.7911 2.31211 11.4768L2.31214 11.4767M0.846347 15.5989L2.31214 11.4767M2.31214 11.4767C2.94124 10.1858 3.71579 8.95932 4.61405 7.83157L4.61412 7.83148M2.31214 11.4767L4.61412 7.83148M4.61412 7.83148C5.50605 6.71092 6.5227 5.68449 7.63592 4.78023L7.63646 4.77979M4.61412 7.83148L7.63646 4.77979M7.63646 4.77979C7.65873 4.76162 7.68739 4.75133 7.71677 4.75133C7.75642 4.75133 7.79122 4.76825 7.81496 4.79734L7.81496 4.79734M7.63646 4.77979L7.81496 4.79734M7.81496 4.79734L7.81626 4.79892M7.81496 4.79734L7.81626 4.79892M7.81626 4.79892C7.83492 4.82149 7.84415 4.84894 7.84392 4.87492L7.84392 4.87559M7.81626 4.79892L7.84392 4.87559M7.84392 4.87559C7.84365 4.91525 7.82659 4.94981 7.79819 4.97295M7.84392 4.87559L7.79819 4.97295M12.5908 2.46219L12.4607 2.15696C12.4455 2.16343 12.4293 2.1669 12.41 2.1669C12.3579 2.1669 12.3122 2.13622 12.2925 2.09092C12.2797 2.06055 12.2791 2.028 12.2911 1.99691C12.3046 1.96441 12.3284 1.94115 12.3577 1.92869L12.3586 1.92832C13.571 1.41023 14.8413 1.01156 16.1339 0.744916L16.134 0.744902C17.4602 0.471046 18.8255 0.331808 20.1928 0.331808H20.1938C21.5422 0.331808 22.8895 0.466569 24.1974 0.733203L24.1975 0.733222C25.4723 0.992721 26.7272 1.37974 27.9249 1.88425L27.9252 1.88436C29.1022 2.37901 30.2371 2.99232 31.2989 3.70536C32.3506 4.41205 33.3402 5.22386 34.2385 6.11811L34.2387 6.11834C35.1378 7.01171 35.954 7.99589 36.6645 9.04191C37.3813 10.0979 37.9979 11.2265 38.4951 12.3968L38.4952 12.3971C39.0023 13.5882 39.3914 14.836 39.6522 16.1035C39.9194 17.4052 40.0557 18.744 40.0557 20.0846C40.0557 21.1969 39.9609 22.3174 39.7732 23.4152C39.7673 23.449 39.744 23.4835 39.7117 23.5025C39.6794 23.5206 39.636 23.524 39.6024 23.5116C39.4109 23.441 39.2116 23.4045 39.0107 23.4045H39.0103C38.0708 23.4057 37.3032 24.1666 37.302 25.1053C37.3009 25.9382 37.9014 26.6435 38.7255 26.7814L38.7263 26.7816C38.7611 26.7873 38.7959 26.8109 38.8144 26.8414C38.8322 26.8736 38.8354 26.9142 38.8236 26.9472C37.597 30.2373 35.4981 33.1565 32.7523 35.3882C29.9725 37.6474 26.6321 39.1136 23.0924 39.6282L23.0924 39.6282L23.0871 39.629C23.0835 39.6296 23.0783 39.6301 23.0732 39.6301C23.0129 39.6301 22.9591 39.5843 22.9486 39.5261C22.9475 39.516 22.9471 39.5083 22.947 39.5031C22.9481 39.4463 22.9922 39.3933 23.0515 39.3825C23.0592 39.3815 23.0679 39.3801 23.0774 39.3781C29.9487 38.3719 35.82 33.7542 38.4061 27.3219L38.5269 27.0215L38.2296 26.8934C37.5115 26.584 37.0485 25.8824 37.0477 25.1053C37.0478 24.5841 37.2511 24.0956 37.6217 23.7268C37.9926 23.3579 38.4847 23.1551 39.0107 23.1551C39.0832 23.1551 39.1594 23.1598 39.2352 23.1679L39.5528 23.2018L39.5988 22.8857C39.7333 21.9607 39.8014 21.019 39.8014 20.0846C39.8014 14.8753 37.7603 9.97684 34.0576 6.29318L34.0576 6.29312C30.3539 2.61045 25.4297 0.581129 20.1938 0.581129C17.5095 0.581129 14.9069 1.11133 12.4604 2.15709L12.5908 2.46219ZM12.5908 2.46219C12.533 2.48684 12.4724 2.49871 12.41 2.49871C12.2264 2.49871 12.0603 2.39007 11.9877 2.22209M12.5908 2.46219C14.9957 1.43422 17.5539 0.912936 20.1938 0.912936L11.9877 2.22209M11.9877 2.22209C11.94 2.11071 11.9382 1.98655 11.9832 1.87335L11.9877 2.22209ZM7.79819 4.97295L8.00765 5.2301M7.79819 4.97295L8.00765 5.2301M8.00765 5.2301L7.79851 4.97269C3.21541 8.69624 0.5861 14.2053 0.58609 20.0846L8.00765 5.2301ZM10.0719 3.2312L10.0723 3.23174C10.0901 3.26103 10.0948 3.29267 10.0869 3.32462L10.0863 3.32698C10.0798 3.35407 10.0645 3.37777 10.0408 3.39521L10.0274 3.40343C10.0082 3.41515 9.98654 3.42127 9.96378 3.42127C9.91773 3.42127 9.87816 3.39917 9.85406 3.36006C9.81944 3.30277 9.83722 3.22635 9.89629 3.19013C9.91613 3.17839 9.93953 3.17195 9.96286 3.17195C10.0119 3.17195 10.0499 3.19483 10.0719 3.2312Z" stroke="url(#paint0_linear_162:3683)" stroke-width="0.663615"/>
<path d="M23.3954 34.9404L23.5113 35.1554C23.8533 35.7897 24.5157 36.1853 25.2427 36.1861C25.7684 36.186 26.2604 35.9831 26.631 35.6144C27.0018 35.2456 27.2051 34.7569 27.2051 34.2356C27.2051 33.9935 27.1598 33.7537 27.0688 33.5244L27.0687 33.5241C27.0496 33.4758 27.0049 33.4445 26.9495 33.4445C26.9349 33.4445 26.9193 33.4473 26.9045 33.4532L26.9009 33.4546L26.9009 33.4546C26.87 33.4664 26.8467 33.4887 26.8334 33.5189C26.8193 33.5518 26.8195 33.5843 26.8311 33.6137L26.8312 33.6137C26.9106 33.8137 26.951 34.0232 26.951 34.2356V34.2364C26.9486 35.1737 26.1824 35.9344 25.2431 35.9368L25.2423 35.9368L25.2414 35.9368C24.4965 35.9368 23.8415 35.4608 23.6146 34.7521L23.9306 34.6509M23.3954 34.9404L23.4937 34.6641C23.5495 34.6641 23.5974 34.6987 23.6148 34.7527L23.9306 34.6509M23.3954 34.9404L23.1557 34.9872C22.1843 35.1766 21.1877 35.2732 20.1939 35.2732C18.1311 35.2732 16.1317 34.871 14.2488 34.0794C13.3444 33.6989 12.471 33.2271 11.6542 32.6792C10.8456 32.135 10.0854 31.5112 9.39365 30.824C8.70278 30.136 8.07572 29.38 7.52965 28.5761C6.97807 27.7639 6.50378 26.8954 6.12125 25.9961C5.32556 24.1239 4.92141 22.1359 4.92141 20.085C4.92141 18.9689 5.04361 17.8548 5.28513 16.7751C5.52044 15.7246 5.86984 14.6955 6.32422 13.7185L6.32425 13.7184C6.77059 12.7582 7.32125 11.8406 7.95998 10.9918M23.3954 34.9404L7.95998 10.9918M23.9306 34.6509C23.8691 34.4601 23.6938 34.3323 23.4937 34.3323C23.4597 34.3323 23.4266 34.336 23.3936 34.3433L26.5291 33.3865C26.4805 33.4987 26.4778 33.623 26.5228 33.7362C26.5869 33.8978 26.6192 34.0658 26.6192 34.2356C26.6172 34.9887 26.0005 35.6031 25.2423 35.605H25.2414C24.6401 35.605 24.1133 35.2215 23.9306 34.6509ZM9.89689 8.42411C9.08363 9.13438 8.34288 9.93137 7.69485 10.7923L9.89689 8.42411ZM9.89689 8.42411C9.98041 8.35108 10.0878 8.31091 10.1989 8.31091M9.89689 8.42411L10.1989 8.31091M7.95998 10.9918C8.5942 10.1492 9.31924 9.36914 10.1152 8.67403L10.1153 8.6739C10.1381 8.65398 10.1678 8.64272 10.1989 8.64272C10.2363 8.64272 10.2714 8.65875 10.2954 8.68587L7.95998 10.9918ZM22.9476 5.0216C22.9476 5.10194 22.9393 5.18319 22.9228 5.27266C22.8779 5.51276 23.0375 5.75012 23.278 5.80216L23.3482 5.47786C23.348 5.47781 23.3478 5.47777 23.3476 5.47773M22.9476 5.0216L35.212 20.085C35.213 13.0807 30.2232 6.93908 23.3476 5.47773M22.9476 5.0216C22.9456 4.26751 22.3289 3.65311 21.5707 3.65219M22.9476 5.0216L21.5707 3.65219M23.3476 5.47773C23.2801 5.46277 23.2376 5.39411 23.2489 5.33363L23.2491 5.33291C23.2686 5.22712 23.2794 5.12547 23.2794 5.0216L23.2794 5.02075C23.277 4.08279 22.5109 3.32152 21.5711 3.32039L21.5703 3.32039C20.6359 3.32152 19.8689 4.07884 19.8621 5.01186L19.8618 5.01186L19.8622 5.02425C19.8633 5.06033 19.8514 5.08953 19.8298 5.11214L19.8287 5.11337C19.8045 5.13894 19.7739 5.15267 19.7388 5.15371M23.3476 5.47773L19.7388 5.15371M19.7388 5.15371C18.0911 5.20225 16.4776 5.51587 14.9428 6.0854L14.9572 6.12425C14.9562 6.12305 14.9552 6.12191 14.9542 6.12082L14.9414 6.08651C14.9295 6.09092 14.9149 6.09389 14.8967 6.09389C14.8438 6.09389 14.7951 6.05901 14.778 6.01299L14.778 6.01299L14.7771 6.01075C14.7723 5.99817 14.7696 5.98485 14.7695 5.96732C14.7701 5.91951 14.8024 5.87084 14.8524 5.85181C16.2885 5.31951 17.7966 5.00597 19.3355 4.92108L19.5941 4.90682L19.6431 4.65256C19.8192 3.73837 20.6287 3.07107 21.5707 3.07107C22.0931 3.07107 22.583 3.27234 22.9532 3.63739L23.1848 3.40259L22.9532 3.63739C23.3234 4.00238 23.5282 4.48572 23.5337 5.0014L23.5364 5.26006L23.7879 5.32049C25.4391 5.7172 27.0039 6.38278 28.4378 7.29871C29.8475 8.19945 31.0926 9.31718 32.1393 10.6209L19.7388 5.15371ZM21.5707 3.65219C20.8171 3.65311 20.1994 4.26477 20.1939 5.01429M21.5707 3.65219L20.1939 5.01429M20.1939 5.01429C20.1975 5.13663 20.1544 5.25257 20.0699 5.34113L20.1939 5.01429ZM31.7853 29.9727L31.7856 29.9724C32.5544 29.0834 33.2183 28.1052 33.76 27.0671C34.3105 26.0112 34.7353 24.8902 35.0217 23.7363C35.3163 22.5482 35.4663 21.3198 35.4663 20.085C35.4663 18.3336 35.169 16.6177 34.5835 14.9841C34.0178 13.406 33.1952 11.9383 32.1395 10.6211L31.7853 29.9727ZM31.7853 29.9727C31.0212 30.8587 30.1536 31.6565 29.2079 32.3454C29.1827 32.3633 29.1566 32.3709 29.1314 32.3709C29.0911 32.3709 29.0514 32.3508 29.0276 32.3186M31.7853 29.9727L29.0276 32.3186M29.0276 32.3186C28.9881 32.265 28.9989 32.1869 29.0551 32.1457C29.0552 32.1456 29.0553 32.1455 29.0554 32.1455L28.8597 31.8774L29.0276 32.3186ZM10.1989 8.31091C10.3311 8.31091 10.4568 8.36751 10.544 8.46611L10.1989 8.31091ZM20.1939 35.0238C21.2936 35.0238 22.3933 34.9044 23.4652 34.6673L10.2955 8.68593C10.3407 8.73721 10.3357 8.81501 10.2843 8.85995L10.2842 8.85997C7.03852 11.6989 5.17569 15.7893 5.17569 20.085C5.17569 24.0746 6.73942 27.8274 9.5747 30.6492L9.57486 30.6493C12.412 33.4692 16.1842 35.0238 20.1939 35.0238ZM12.3105 7.21836L12.3103 7.21801C12.2766 7.16237 12.2935 7.08571 12.3535 7.04893C12.3756 7.03621 12.3983 7.03047 12.4202 7.03047C12.465 7.03047 12.5075 7.05487 12.5299 7.0919L12.5305 7.093C12.5465 7.11923 12.5519 7.15113 12.5434 7.1853L12.5433 7.18588C12.5356 7.21703 12.5171 7.24298 12.4871 7.26122C12.4646 7.27419 12.4419 7.27979 12.4211 7.27979C12.3756 7.27979 12.3325 7.25477 12.3105 7.21836Z" stroke="url(#paint1_linear_162:3683)" stroke-width="0.663615"/>
<path d="M22.9558 34.4328C21.6836 34.6747 20.3646 34.7477 19.0685 34.6501C18.817 34.6309 18.5949 34.8226 18.5756 35.07L22.9558 34.4328ZM22.9558 34.4328C22.9503 34.368 22.9476 34.3022 22.9476 34.2356C22.9476 33.6257 23.1862 33.0524 23.6194 32.6214M22.9558 34.4328L23.6194 32.6214M18.9066 35.0941C18.9125 35.0304 18.9744 34.9757 19.0433 34.9809L19.0436 34.9809C20.3684 35.0807 21.7167 35.0062 23.0178 34.7588L23.3118 34.7029L23.2864 34.4047C23.2817 34.3495 23.2794 34.293 23.2794 34.2356C23.2794 33.7142 23.4827 33.2255 23.8534 32.8566C24.2243 32.4879 24.7164 32.2851 25.2423 32.2851C25.8946 32.2851 26.5013 32.606 26.8671 33.1433L27.0349 33.3899L27.2979 33.2491C32.1791 30.6365 35.212 25.5927 35.212 20.0851L18.9066 35.0941ZM18.9066 35.0941C18.9066 35.0942 18.9066 35.0942 18.9066 35.0942L18.9065 35.1057C18.9065 35.167 18.9566 35.2241 19.0238 35.2294C19.4096 35.258 19.8033 35.2732 20.1939 35.2732C21.3125 35.2732 22.432 35.1517 23.5206 34.9105C23.5577 34.9022 23.5851 34.8814 23.6022 34.8514L23.6034 34.8493C23.6207 34.8197 23.6245 34.7834 23.6144 34.7514C23.5612 34.5844 23.5337 34.4119 23.5337 34.2356V34.2348C23.5359 33.2963 24.3025 32.5366 25.2424 32.5344L25.2432 32.5344C25.9476 32.5344 26.5719 32.9591 26.8313 33.6141L26.8315 33.6147C26.8438 33.6459 26.8707 33.673 26.9038 33.6856C26.9349 33.6975 26.9745 33.6963 27.0081 33.6798C29.5091 32.4376 31.622 30.5363 33.1176 28.1803C34.6534 25.7605 35.4662 22.9609 35.4662 20.0851C35.4662 18.4391 35.2029 16.8214 34.684 15.2754L34.6839 15.2753C34.1829 13.7802 33.451 12.376 32.5077 11.1C31.576 9.84009 30.4594 8.73299 29.1889 7.81077L29.1889 7.81072C27.904 6.87751 26.4892 6.15414 24.9846 5.66006C24.9672 5.65477 24.9524 5.65288 24.9412 5.65288C24.8853 5.65288 24.8373 5.68794 24.8202 5.73964C24.7995 5.80199 24.8339 5.87386 24.901 5.89577L24.9015 5.89593C31.0674 7.9196 35.213 13.6214 35.212 20.0851L18.9066 35.0941ZM23.6194 32.6214C24.0527 32.1905 24.6291 31.9533 25.2423 31.9533C26.0042 31.9533 26.7137 32.3284 27.1413 32.9566M23.6194 32.6214L27.1413 32.9566M27.1413 32.9566C31.9154 30.4013 34.8802 25.4695 34.8802 20.0851L27.1413 32.9566ZM13.6846 33.8285L13.6857 33.829C13.7021 33.8368 13.7196 33.8408 13.7392 33.8408C13.7886 33.8408 13.8342 33.8119 13.8553 33.7682C13.8836 33.7074 13.8572 33.6331 13.7952 33.6041L13.7947 33.6039C8.55894 31.1467 5.17571 25.841 5.17569 20.0851L13.6846 33.8285ZM13.6846 33.8285C12.3991 33.2254 11.2033 32.4453 10.1306 31.5097L10.1305 31.5097C9.06223 30.5785 8.13062 29.5063 7.36077 28.3225L7.36076 28.3225C5.76478 25.8685 4.92141 23.0209 4.92141 20.0851C4.92141 18.0717 5.31122 16.1167 6.07905 14.2741L6.07907 14.274C6.44808 13.3882 6.90615 12.5314 7.43885 11.7282M13.6846 33.8285L7.43885 11.7282M7.43885 11.7282C7.96699 10.9331 8.5744 10.1833 9.243 9.49861C9.91142 8.81505 10.6482 8.19044 11.4323 7.64371L11.4323 7.6437C12.2229 7.09236 13.0703 6.61335 13.9488 6.22112C15.7732 5.40723 17.7187 4.96403 19.7318 4.90413L7.43885 11.7282ZM23.4998 5.37813C23.5118 5.31164 23.4676 5.24572 23.398 5.23296L23.3932 5.23207L23.3932 5.23204C23.3928 5.23197 23.3915 5.23179 23.3892 5.23161C23.3858 5.23133 23.381 5.23111 23.3744 5.23111C23.3111 5.23111 23.2605 5.27527 23.2499 5.33187L23.2294 5.44184L23.2239 5.44675C23.0319 6.19395 22.354 6.72285 21.5725 6.72285H21.5707C20.6331 6.72285 19.8666 5.96493 19.8621 5.02873L19.8621 5.02711C19.8621 4.99361 19.8496 4.96444 19.8253 4.94127L19.824 4.94006C19.7983 4.91522 19.7664 4.90314 19.7319 4.90413L23.4998 5.37813ZM23.4998 5.37813C23.3283 6.29944 22.5185 6.97126 21.5707 6.97217C21.1181 6.97217 20.6764 6.81486 20.3283 6.53101L20.3279 6.5307M23.4998 5.37813L20.3279 6.5307M20.3279 6.5307C19.984 6.25116 19.7448 5.86143 19.6516 5.43313L19.5913 5.15603M20.3279 6.5307L19.5913 5.15603M19.5913 5.15603L19.3082 5.17241M19.5913 5.15603L19.3082 5.17241M19.3082 5.17241C11.3842 5.63074 5.17477 12.179 5.17569 20.0851L19.3082 5.17241ZM23.2546 5.27269C23.2546 5.26976 23.2547 5.2715 23.2546 5.27608V5.27269ZM23.1475 5.51593C23.1458 5.51746 23.1452 5.51799 23.1464 5.5169L23.1475 5.51593ZM16.3231 34.7766C16.3096 34.7766 16.2986 34.775 16.29 34.7729C16.2209 34.7541 16.1829 34.6842 16.1996 34.6211C16.214 34.5665 16.2644 34.5273 16.3222 34.5273C16.3304 34.5273 16.3417 34.5285 16.3561 34.5321C16.3891 34.541 16.4156 34.5607 16.4335 34.5901C16.4501 34.6194 16.4543 34.6508 16.4457 34.684C16.4312 34.7372 16.3811 34.7766 16.3231 34.7766Z" stroke="url(#paint2_linear_162:3683)" stroke-width="0.663615"/>
<path d="M9.52456 20.6783L9.5447 20.9319C9.75559 23.5869 10.9557 26.0502 12.9261 27.8701C14.907 29.6994 17.4876 30.7081 20.1938 30.7081C21.6371 30.7081 23.0362 30.4273 24.3525 29.8732C25.6248 29.3374 26.7668 28.5718 27.7481 27.5956L27.7481 27.5956C28.7296 26.6196 29.4992 25.484 30.0376 24.219C30.5947 22.9103 30.8768 21.5194 30.8768 20.0846C30.8768 20.0176 30.8214 19.96 30.7497 19.96C30.6792 19.96 30.623 20.0174 30.6225 20.0846L9.52456 20.6783ZM9.52456 20.6783L9.27436 20.632M9.52456 20.6783L9.27436 20.632M9.27436 20.632C8.34685 20.4602 7.67507 19.6537 7.67507 18.7152C7.67507 18.1939 7.87838 17.7052 8.24915 17.3364C8.61998 16.9676 9.1122 16.7647 9.63801 16.7647H9.63984C9.68666 16.7647 9.73242 16.7663 9.77674 16.77L10.0314 16.7911M9.27436 20.632L10.0314 16.7911M10.0314 16.7911L10.1168 16.5502M10.0314 16.7911L10.1168 16.5502M10.1168 16.5502C10.4853 15.5121 11.013 14.5392 11.6852 13.659C12.352 12.7878 13.1461 12.0263 14.0453 11.3958L14.0455 11.3957M10.1168 16.5502L14.0455 11.3957M14.0455 11.3957C14.0668 11.3807 14.0909 11.3729 14.1192 11.3729C14.1625 11.3729 14.2009 11.3938 14.2232 11.4255L14.2232 11.4255M14.0455 11.3957L14.2232 11.4255M14.2232 11.4255L14.2241 11.4268M14.2232 11.4255L14.2241 11.4268M14.2241 11.4268C14.2632 11.4818 14.25 11.5588 14.1941 11.5976L14.193 11.5984M14.2241 11.4268L14.193 11.5984M14.193 11.5984C12.321 12.9116 10.916 14.825 10.2376 16.9906C10.2206 17.0437 10.1728 17.0788 10.1162 17.0788C10.1059 17.0788 10.0954 17.0774 10.0847 17.0745L10.0847 17.0745M14.193 11.5984L10.0847 17.0745M10.0847 17.0745L10.0816 17.0736M10.0847 17.0745L10.0816 17.0736M10.0816 17.0736C9.93215 17.0337 9.78679 17.014 9.63801 17.014L9.63761 17.014M10.0816 17.0736L9.63761 17.014M9.63761 17.014C8.69818 17.0151 7.93049 17.7761 7.92935 18.7148L7.92935 18.7156M9.63761 17.014L7.92935 18.7156M7.92935 18.7156C7.9305 19.6479 8.69208 20.4085 9.62509 20.4164V20.4164M7.92935 18.7156L9.62509 20.4164M9.62509 20.4164H9.62791M9.62509 20.4164H9.62791M9.62791 20.4164C9.63781 20.4164 9.64598 20.416 9.65031 20.4158L9.6533 20.4156C9.72172 20.4182 9.77291 20.4714 9.77553 20.5348L9.77555 20.5353M9.62791 20.4164L9.77555 20.5353M9.77555 20.5353C10.0146 26.101 14.5922 30.4588 20.1929 30.4588C22.9781 30.4588 25.5975 29.379 27.5673 27.4209L27.5673 27.4208M9.77555 20.5353L27.5673 27.4208M27.5673 27.4208C29.537 25.4615 30.6225 22.8554 30.6225 20.0846L27.5673 27.4208ZM16.4305 10.2706L16.4301 10.2693C16.4078 10.2099 16.4375 10.1373 16.5042 10.1114C16.5191 10.1063 16.5341 10.1039 16.5498 10.1039C16.6033 10.1039 16.6515 10.1384 16.669 10.1854C16.6923 10.2486 16.66 10.3207 16.5943 10.3449C16.5776 10.3509 16.5626 10.3532 16.5498 10.3532C16.4967 10.3532 16.4485 10.3192 16.4305 10.2706ZM19.1011 9.62961L19.1011 9.62838C19.1008 9.56941 19.1506 9.51141 19.2164 9.50553L19.2169 9.50549C19.5393 9.47626 19.868 9.4612 20.1938 9.4612C20.2656 9.4612 20.321 9.51884 20.321 9.58586C20.321 9.65289 20.2656 9.71052 20.1938 9.71052C19.8766 9.71052 19.5556 9.72464 19.2399 9.75293L19.2399 9.75263L19.227 9.75433C19.1587 9.75337 19.1088 9.70527 19.1019 9.64423L19.1012 9.63357C19.1011 9.63091 19.1011 9.62975 19.1011 9.62961Z" stroke="url(#paint3_linear_162:3683)" stroke-width="0.663615"/>
<path d="M11.3469 18.7156C11.3479 17.9476 10.8264 17.2746 10.0836 17.075C10.0486 17.0652 10.0193 17.0412 10.004 17.0139C9.98719 16.983 9.98462 16.9477 9.99373 16.9191L9.99428 16.9174C10.3288 15.8502 10.8307 14.8448 11.4858 13.9302L11.486 13.9299C12.1313 13.0269 12.912 12.2328 13.805 11.5695L13.805 11.5695C14.7088 10.8982 15.7058 10.3767 16.7695 10.019L16.7696 10.019C17.8688 9.64901 19.0208 9.4612 20.194 9.4612C20.2658 9.4612 20.3212 9.51884 20.3212 9.58586C20.3212 9.65289 20.2658 9.71052 20.194 9.71052H20.1922C15.8053 9.71052 11.8615 12.4676 10.3771 16.5748L10.2779 16.8494L10.5377 16.9828C11.1942 17.3199 11.6004 17.9825 11.6011 18.7156C11.6011 19.1628 11.4449 19.5996 11.1614 19.9455L11.1613 19.9457C10.8828 20.2858 10.4921 20.5252 10.0626 20.6196L9.77857 20.6821L9.80325 20.9719C10.2568 26.2952 14.8199 30.4587 20.1931 30.4587C23.9224 30.4587 27.3917 28.4576 29.2493 25.235L29.2499 25.2338C29.2711 25.1967 29.3138 25.171 29.3601 25.171C29.3816 25.171 29.4025 25.1765 29.4218 25.1877L29.4244 25.1891C29.4543 25.2061 29.4737 25.2314 29.4824 25.2633L29.4825 25.2636C29.4915 25.2963 29.4872 25.3279 29.4707 25.3563L29.47 25.3575C28.5516 26.9535 27.2242 28.2925 25.6303 29.2312L25.6303 29.2312C24.8246 29.7058 23.9603 30.0723 23.0595 30.3212L23.0594 30.3212C22.1311 30.5778 21.1677 30.7081 20.194 30.7081C18.7892 30.7081 17.4238 30.4405 16.1367 29.9147C14.893 29.4065 13.7688 28.6771 12.7946 27.7462L12.7945 27.7461C11.8212 26.8171 11.0444 25.731 10.4837 24.5183L10.4837 24.5182C9.90441 23.266 9.58141 21.93 9.52176 20.546L9.52174 20.5455C9.5203 20.5132 9.53257 20.4796 9.55491 20.4555C9.58017 20.4303 9.61549 20.4158 9.6489 20.4155L9.64646 20.0837M11.3469 18.7156C11.3467 19.65 10.5836 20.411 9.64807 20.4155L9.64646 20.0837M11.3469 18.7156C11.3469 18.7156 11.3469 18.7157 11.3469 18.7157L11.015 18.7152M11.3469 18.7156C11.3469 18.7155 11.3469 18.7153 11.3469 18.7152H11.015M9.64646 20.0837C9.52254 20.0846 9.4023 20.1367 9.31602 20.2252L11.015 18.7152M9.64646 20.0837C10.401 20.0801 11.015 19.4657 11.015 18.7152M30.2907 22.8318L30.2907 22.8319C30.3075 22.8605 30.3344 22.8814 30.3679 22.8903C30.3777 22.8928 30.3891 22.8942 30.401 22.8942C30.4603 22.8942 30.5101 22.8545 30.5244 22.8016C30.5415 22.7366 30.5021 22.6675 30.4343 22.6497L30.5184 22.3287M30.2907 22.8318L30.2783 22.7386C30.2929 22.6838 30.3426 22.645 30.401 22.645C30.4097 22.645 30.421 22.6462 30.4347 22.6498L30.5184 22.3287M30.2907 22.8318C30.2743 22.8038 30.2696 22.7716 30.2783 22.7387L30.2907 22.8318ZM30.5184 22.3287C30.7625 22.3926 30.9095 22.6427 30.8452 22.8864M30.5184 22.3287C30.4798 22.3187 30.4404 22.3132 30.401 22.3132L30.8452 22.8864M30.8452 22.8864C30.7921 23.0864 30.6094 23.226 30.401 23.226C30.3625 23.226 30.3229 23.2214 30.2844 23.2114L30.8452 22.8864Z" stroke="url(#paint4_linear_162:3683)" stroke-width="0.663615"/>
<path d="M24.3226 24.1936L24.3224 24.1938C23.2192 25.2901 21.7517 25.8943 20.1938 25.8943C20.1221 25.8943 20.0667 25.9519 20.0667 26.019C20.0667 26.086 20.1221 26.1436 20.1938 26.1436C21.0174 26.1436 21.8153 25.9833 22.5662 25.6676L24.3226 24.1936ZM24.3226 24.1936C25.4249 23.0963 26.033 21.636 26.033 20.0849C26.033 18.5338 25.4249 17.0735 24.3226 15.9761L24.3224 15.9759M24.3226 24.1936L24.3224 15.9759M24.3224 15.9759C23.2192 14.8797 21.7517 14.2755 20.1938 14.2755C18.6359 14.2755 17.1685 14.8797 16.0653 15.9759L16.065 15.9762M24.3224 15.9759L16.065 15.9762M16.065 15.9762C14.9639 17.0734 14.3546 18.5327 14.3546 20.084M16.065 15.9762L14.3546 20.084M14.3546 20.084V20.0849M14.3546 20.084V20.0849M14.3546 20.0849C14.3546 20.1519 14.2993 20.2095 14.2275 20.2095M14.3546 20.0849L14.2275 20.2095M14.2275 20.2095C14.1557 20.2095 14.1004 20.1519 14.1004 20.0849M14.2275 20.2095L14.1004 20.0849M14.1004 20.0849C14.1004 19.2664 14.2613 18.4734 14.5787 17.727M14.1004 20.0849L14.5787 17.727M14.5787 17.727C14.886 17.006 15.3244 16.358 15.8842 15.8012L14.5787 17.727ZM17.8212 14.5023C17.0961 14.808 16.4443 15.245 15.8842 15.8011L17.8212 14.5023ZM17.8212 14.5023C18.5722 14.1864 19.3702 14.0261 20.1938 14.0261M17.8212 14.5023L20.1938 14.0261M20.1938 14.0261C21.0174 14.0261 21.8153 14.1864 22.5662 14.5022L20.1938 14.0261ZM22.5663 14.5022C23.2918 14.808 23.9434 15.2442 24.5034 15.8011L22.5663 14.5022ZM24.5035 15.8011C25.0633 16.3579 25.5017 17.0059 25.8089 17.727L24.5035 15.8011ZM25.809 17.7272C26.1263 18.4736 26.2873 19.2665 26.2873 20.0849C26.2873 20.9033 26.1263 21.6962 25.809 22.4426C25.5018 23.1637 25.0634 23.8117 24.5035 24.3686C23.9435 24.9255 23.2919 25.3617 22.5665 25.6675L25.809 17.7272Z" stroke="url(#paint5_linear_162:3683)" stroke-width="0.663615"/>
<path d="M24.3226 24.1936L24.3224 24.1938C23.2192 25.2901 21.7517 25.8943 20.1938 25.8943C20.1221 25.8943 20.0667 25.9519 20.0667 26.019C20.0667 26.086 20.1221 26.1436 20.1938 26.1436C21.0174 26.1436 21.8153 25.9833 22.5662 25.6676L24.3226 24.1936ZM24.3226 24.1936C25.4249 23.0963 26.033 21.636 26.033 20.0849C26.033 18.5338 25.4249 17.0735 24.3226 15.9761L24.3224 15.9759M24.3226 24.1936L24.3224 15.9759M24.3224 15.9759C23.2192 14.8797 21.7517 14.2755 20.1938 14.2755C18.6359 14.2755 17.1685 14.8797 16.0653 15.9759L16.065 15.9762M24.3224 15.9759L16.065 15.9762M16.065 15.9762C14.9629 17.0744 14.3546 18.5337 14.3546 20.0849M16.065 15.9762L14.3546 20.0849M14.3546 20.0849C14.3546 20.1519 14.2993 20.2095 14.2275 20.2095M14.3546 20.0849L14.2275 20.2095M14.2275 20.2095C14.1557 20.2095 14.1004 20.1519 14.1004 20.0849M14.2275 20.2095L14.1004 20.0849M14.1004 20.0849C14.1004 19.2665 14.2613 18.4736 14.5787 17.7272M14.1004 20.0849L14.5787 17.7272M14.5787 17.7272C14.8859 17.0061 15.3243 16.358 15.8842 15.8012L14.5787 17.7272ZM25.809 17.7272C25.5018 17.0061 25.0634 16.358 24.5035 15.8011L25.809 17.7272ZM25.809 17.7272C26.1263 18.4736 26.2873 19.2665 26.2873 20.0849M25.809 17.7272L26.2873 20.0849M26.2873 20.0849C26.2873 20.9033 26.1263 21.6962 25.809 22.4426M26.2873 20.0849L25.809 22.4426M25.809 22.4426C25.5018 23.1637 25.0634 23.8117 24.5034 24.3687M25.809 22.4426L24.5034 24.3687M24.5034 24.3687C23.9435 24.9255 23.2919 25.3617 22.5665 25.6675L24.5034 24.3687ZM15.8842 15.8011C16.4443 15.2449 17.0962 14.8079 17.8214 14.5022C18.5724 14.1864 19.3702 14.0261 20.1938 14.0261C21.0174 14.0261 21.8153 14.1864 22.5662 14.5022L15.8842 15.8011ZM22.5663 14.5022C23.2918 14.808 23.9434 15.2442 24.5034 15.8011L22.5663 14.5022Z" stroke="url(#paint6_linear_162:3683)" stroke-width="0.663615"/>
<path d="M19.6086 5.0414L19.6084 5.01532L19.6077 5.01149C19.6103 4.49395 19.8134 4.00917 20.1818 3.64279C20.5526 3.27395 21.0447 3.07107 21.5706 3.07107C22.0964 3.07107 22.5886 3.27396 22.9595 3.64279C23.3302 4.01155 23.5336 4.50026 23.5336 5.0216C23.5336 5.13541 23.522 5.25574 23.4995 5.37848C23.328 6.29966 22.5182 6.97135 21.5704 6.97213C21.0487 6.97206 20.5589 6.77152 20.189 6.40672C19.8187 6.04157 19.6133 5.55833 19.6086 5.0414ZM21.5714 3.32038L21.5698 3.32039C20.6384 3.32265 19.8711 4.07606 19.862 5.00739L19.862 5.00739V5.01064L19.862 5.02708L19.862 5.02829C19.8654 5.96517 20.6333 6.72281 21.5706 6.72281H21.5725C22.393 6.72281 23.0993 6.13977 23.2489 5.33318L23.249 5.33291C23.2685 5.22712 23.2793 5.12547 23.2793 5.0216L23.2793 5.02075C23.2769 4.08348 22.5107 3.32265 21.5714 3.32038Z" stroke="url(#paint7_linear_162:3683)" stroke-width="0.663615"/>
<path d="M24.0718 35.8013C24.4122 36.0522 24.8158 36.1855 25.2423 36.1855C25.7681 36.1855 26.2604 35.9826 26.6311 35.6138C27.0018 35.245 27.2052 34.7563 27.2052 34.235C27.2052 33.9929 27.1599 33.7532 27.0689 33.5239L27.0686 33.5231C26.9267 33.1629 26.6823 32.8549 26.3608 32.6328L26.3603 32.6325C26.0317 32.4047 25.6453 32.2844 25.2423 32.2844C24.7164 32.2844 24.2243 32.4872 23.8534 32.856L24.0718 35.8013ZM24.0718 35.8013C23.738 35.5538 23.4965 35.2172 23.372 34.8263L23.3718 34.8258C23.3106 34.6346 23.2793 34.4359 23.2793 34.235C23.2793 33.7136 23.4826 33.225 23.8533 32.8561L24.0718 35.8013ZM25.2423 32.5338L25.2419 32.5338C24.3021 32.5349 23.5359 33.2961 23.5336 34.2342V34.235C23.5336 34.411 23.561 34.5849 23.6147 34.7518C23.8416 35.4603 24.4966 35.9362 25.2413 35.9362L25.2423 35.9362L25.2431 35.9362C26.1823 35.9338 26.9485 35.1731 26.9509 34.2358V34.235C26.9509 34.0227 26.9105 33.8133 26.8312 33.6133C26.5718 32.9584 25.9475 32.5338 25.2432 32.5338L25.2423 32.5338Z" stroke="url(#paint8_linear_162:3683)" stroke-width="0.663615"/>
<path d="M10.149 16.834L10.1491 16.834C11.0035 17.0621 11.6002 17.837 11.6009 18.7157C11.6009 19.2329 11.3999 19.7192 11.0332 20.087L11.0332 20.087C10.667 20.4544 10.1801 20.6596 9.6593 20.6651L9.63761 20.6653L9.63295 20.666C9.10907 20.6647 8.6188 20.4618 8.24912 20.0942C7.87839 19.7256 7.67507 19.2368 7.67507 18.7154C7.67507 18.1941 7.87838 17.7054 8.24915 17.3366C8.61998 16.9678 9.1122 16.7649 9.63801 16.7649C9.8048 16.7649 9.97705 16.7881 10.149 16.834ZM9.63801 17.0142L9.63761 17.0142C8.69818 17.0154 7.93049 17.7763 7.92935 18.715L7.92935 18.7159C7.9305 19.6463 8.69099 20.4065 9.62245 20.4166L9.62245 20.4167H9.62607C9.63196 20.4167 9.63695 20.4165 9.64056 20.4164L9.64955 20.4159L9.65315 20.4157C10.5863 20.4084 11.3466 19.6483 11.3467 18.7156C11.3477 17.9476 10.826 17.2747 10.0831 17.0752C9.93292 17.0337 9.78611 17.0142 9.63801 17.0142ZM9.64626 20.4157H9.64627C9.64597 20.4157 9.64566 20.4157 9.64535 20.4157H9.64535H9.64535H9.64536H9.64536H9.64536H9.64536H9.64536H9.64537H9.64537H9.64537H9.64537H9.64537H9.64538H9.64538H9.64538H9.64538H9.64538H9.64539H9.64539H9.64539H9.64539H9.64539H9.6454H9.6454H9.6454H9.6454H9.64541H9.64541H9.64541H9.64541H9.64542H9.64542H9.64542H9.64542H9.64542H9.64543H9.64543H9.64543H9.64543H9.64543H9.64544H9.64544H9.64544H9.64544H9.64545H9.64545H9.64545H9.64545H9.64546H9.64546H9.64546H9.64546H9.64547H9.64547H9.64547H9.64547H9.64548H9.64548H9.64548H9.64549H9.64549H9.64549H9.6455H9.6455H9.6455H9.6455H9.64551H9.64551H9.64551H9.64552H9.64552H9.64552H9.64553H9.64553H9.64553H9.64554H9.64554H9.64554H9.64554H9.64554H9.64555H9.64555H9.64555H9.64555H9.64555H9.64556H9.64556H9.64556H9.64556H9.64556H9.64557H9.64557H9.64557H9.64557H9.64557H9.64558H9.64558H9.64558H9.64558H9.64558H9.64559H9.64559H9.64559H9.64559H9.6456H9.6456H9.6456H9.6456H9.6456H9.64561H9.64561H9.64561H9.64561H9.64562H9.64562H9.64562H9.64562H9.64563H9.64563H9.64563H9.64563H9.64564H9.64564H9.64564H9.64564H9.64565H9.64565H9.64565H9.64565H9.64566H9.64566H9.64566H9.64566H9.64567H9.64567H9.64567H9.64567H9.64568H9.64568H9.64568H9.64568H9.64569H9.64569H9.64569H9.6457H9.6457H9.6457H9.6457H9.64571H9.64571H9.64571H9.64572H9.64572H9.64572H9.64572H9.64573H9.64573H9.64573H9.64574H9.64574H9.64574H9.64575H9.64575H9.64575H9.64576H9.64576H9.64576H9.64576H9.64577H9.64577H9.64577H9.64578H9.64578H9.64578H9.64579H9.64579H9.64579H9.6458H9.6458H9.6458H9.64581H9.64581H9.64581H9.64582H9.64582H9.64582H9.64583H9.64583H9.64583H9.64584H9.64584H9.64585H9.64585H9.64585H9.64586H9.64586H9.64586H9.64587H9.64587H9.64587H9.64588H9.64588H9.64589H9.64589H9.64589H9.6459H9.6459H9.6459H9.64591H9.64591H9.64592H9.64592H9.64592H9.64593H9.64593H9.64594H9.64594H9.64594H9.64595H9.64595H9.64596H9.64596H9.64596H9.64597H9.64597H9.64598H9.64598H9.64599H9.64599H9.64599H9.646H9.646H9.64601H9.64601H9.64602H9.64602H9.64602H9.64603H9.64603H9.64604H9.64604H9.64605H9.64605H9.64605H9.64606H9.64606H9.64607H9.64607H9.64608H9.64608H9.64609H9.64609H9.6461H9.6461H9.64611H9.64611H9.64612H9.64612H9.64612H9.64613H9.64613H9.64614H9.64614H9.64615H9.64615H9.64616H9.64616H9.64617H9.64617H9.64618H9.64618H9.64619H9.64619H9.6462H9.6462H9.64621H9.64621H9.64622H9.64622H9.64623H9.64624H9.64624H9.64625H9.64625H9.64626H9.64626ZM9.63801 17.346C8.87982 17.347 8.26208 17.9614 8.26116 18.7154L9.99599 17.3953C9.87391 17.3616 9.75642 17.346 9.63801 17.346Z" stroke="url(#paint9_linear_162:3683)" stroke-width="0.663615"/>
<path d="M38.6826 27.0274L38.6833 27.0275C38.8017 27.0475 38.9089 27.0566 39.0107 27.0566C39.5365 27.0566 40.0288 26.8537 40.3995 26.4849C40.7702 26.1161 40.9736 25.6274 40.9736 25.1061C40.9736 24.6995 40.8492 24.3115 40.6133 23.9816L40.6131 23.9813C40.3831 23.6589 40.0648 23.4162 39.6927 23.2783C39.4695 23.1966 39.2402 23.1555 39.0107 23.1555C38.4848 23.1555 37.9927 23.3583 37.6218 23.7271L38.6826 27.0274ZM38.6826 27.0274C38.2296 26.9516 37.8157 26.718 37.5164 26.3697L37.5163 26.3696M38.6826 27.0274L37.5163 26.3696M37.5163 26.3696C37.2147 26.0189 37.0478 25.5698 37.0478 25.1061M37.5163 26.3696L37.0478 25.1061M37.0478 25.1061C37.0478 24.5847 37.251 24.0961 37.6217 23.7272L37.0478 25.1061ZM39.0107 23.4049L39.0103 23.4049C38.0705 23.406 37.3043 24.1672 37.302 25.1053L37.302 25.1056C37.3009 25.9396 37.9016 26.6438 38.7255 26.7817L38.7255 26.7817L38.7272 26.782C38.8236 26.7976 38.9172 26.8073 39.0107 26.8073L39.0115 26.8073C39.9496 26.8049 40.7169 26.0454 40.7193 25.1069L40.7193 25.1066C40.7205 24.3975 40.2702 23.7586 39.603 23.5121L39.6023 23.5119C39.4103 23.4414 39.2111 23.4049 39.0107 23.4049Z" stroke="url(#paint10_linear_162:3683)" stroke-width="0.663615"/>
<path d="M20.1938 21.5787C19.3639 21.5787 18.6898 20.9058 18.6898 20.0847C18.6898 19.2636 19.3639 18.5906 20.1938 18.5906C21.0238 18.5906 21.6978 19.2636 21.6978 20.0847C21.6978 20.9058 21.0238 21.5787 20.1938 21.5787ZM20.1944 18.8399L20.1932 18.8399C19.5073 18.8412 18.9454 19.3975 18.9441 20.0841L18.9441 20.0853C18.9454 20.7718 19.5073 21.3282 20.1932 21.3294L20.1944 21.3294C20.8804 21.3282 21.4423 20.7718 21.4435 20.0853L21.4435 20.0841C21.4423 19.3975 20.8804 18.8412 20.1944 18.8399Z" stroke="url(#paint11_linear_162:3683)" stroke-width="0.663615"/>
<defs>
<linearGradient id="paint0_linear_162:3683" x1="-8.24372" y1="1.27017" x2="43.8334" y2="40.0104" gradientUnits="userSpaceOnUse">
<stop stop-color="#ACB4FF"/>
<stop offset="0.520833" stop-color="#A55FFF"/>
<stop offset="1" stop-color="#816CFF" stop-opacity="0.88"/>
</linearGradient>
<linearGradient id="paint1_linear_162:3683" x1="-1.78054" y1="3.80738" x2="40.8228" y2="32.9298" gradientUnits="userSpaceOnUse">
<stop stop-color="#ACB4FF"/>
<stop offset="0.520833" stop-color="#A55FFF"/>
<stop offset="1" stop-color="#816CFF" stop-opacity="0.88"/>
</linearGradient>
<linearGradient id="paint2_linear_162:3683" x1="-1.78053" y1="5.55356" x2="38.4549" y2="35.4909" gradientUnits="userSpaceOnUse">
<stop stop-color="#ACB4FF"/>
<stop offset="0.520833" stop-color="#A55FFF"/>
<stop offset="1" stop-color="#816CFF" stop-opacity="0.88"/>
</linearGradient>
<linearGradient id="paint3_linear_162:3683" x1="2.47197" y1="9.82223" x2="31.4529" y2="33.1773" gradientUnits="userSpaceOnUse">
<stop stop-color="#ACB4FF"/>
<stop offset="0.520833" stop-color="#A55FFF"/>
<stop offset="1" stop-color="#816CFF" stop-opacity="0.88"/>
</linearGradient>
<linearGradient id="paint4_linear_162:3683" x1="4.76654" y1="9.82223" x2="33.0353" y2="30.5082" gradientUnits="userSpaceOnUse">
<stop stop-color="#ACB4FF"/>
<stop offset="0.520833" stop-color="#A55FFF"/>
<stop offset="1" stop-color="#816CFF" stop-opacity="0.88"/>
</linearGradient>
<linearGradient id="paint5_linear_162:3683" x1="11.1456" y1="14.0985" x2="27.7158" y2="26.4249" gradientUnits="userSpaceOnUse">
<stop stop-color="#ACB4FF"/>
<stop offset="0.520833" stop-color="#A55FFF"/>
<stop offset="1" stop-color="#816CFF" stop-opacity="0.88"/>
</linearGradient>
<linearGradient id="paint6_linear_162:3683" x1="11.1456" y1="14.0985" x2="27.7158" y2="26.4249" gradientUnits="userSpaceOnUse">
<stop stop-color="#ACB4FF"/>
<stop offset="0.520833" stop-color="#A55FFF"/>
<stop offset="1" stop-color="#816CFF" stop-opacity="0.88"/>
</linearGradient>
<linearGradient id="paint7_linear_162:3683" x1="18.3391" y1="2.8836" x2="24.257" y2="7.28587" gradientUnits="userSpaceOnUse">
<stop stop-color="#ACB4FF"/>
<stop offset="0.520833" stop-color="#A55FFF"/>
<stop offset="1" stop-color="#816CFF" stop-opacity="0.88"/>
</linearGradient>
<linearGradient id="paint8_linear_162:3683" x1="22.0107" y1="32.097" x2="27.9287" y2="36.4993" gradientUnits="userSpaceOnUse">
<stop stop-color="#ACB4FF"/>
<stop offset="0.520833" stop-color="#A55FFF"/>
<stop offset="1" stop-color="#816CFF" stop-opacity="0.88"/>
</linearGradient>
<linearGradient id="paint9_linear_162:3683" x1="6.40648" y1="16.5774" x2="12.3244" y2="20.9797" gradientUnits="userSpaceOnUse">
<stop stop-color="#ACB4FF"/>
<stop offset="0.520833" stop-color="#A55FFF"/>
<stop offset="1" stop-color="#816CFF" stop-opacity="0.88"/>
</linearGradient>
<linearGradient id="paint10_linear_162:3683" x1="35.7792" y1="22.9681" x2="41.6971" y2="27.3703" gradientUnits="userSpaceOnUse">
<stop stop-color="#ACB4FF"/>
<stop offset="0.520833" stop-color="#A55FFF"/>
<stop offset="1" stop-color="#816CFF" stop-opacity="0.88"/>
</linearGradient>
<linearGradient id="paint11_linear_162:3683" x1="17.6086" y1="18.3743" x2="22.343" y2="21.8961" gradientUnits="userSpaceOnUse">
<stop stop-color="#ACB4FF"/>
<stop offset="0.520833" stop-color="#A55FFF"/>
<stop offset="1" stop-color="#816CFF" stop-opacity="0.88"/>
</linearGradient>
</defs>
</svg>
