Division,WeightClassKg,Place,Name,Team,BodyweightKg,Best3SquatKg,Best3BenchKg,Best3DeadliftKg,TotalKg,Equipment,Event,Sex,BirthDate
Boys,51.71,1,Alex Simpson,Daingerfield,51.35,95.25,61.23,88.45,244.94,Single-ply,SBD,M,
Boys,51.71,2,Logan List,Wills Point,48.99,88.45,45.36,97.52,231.33,Single-ply,SBD,M,
Boys,51.71,3,Matt Watkins,Daingerfield,40.82,58.97,38.56,77.11,174.63,Single-ply,SBD,M,
Boys,51.71,DQ,Ivan Sifuentes,Wills Point,51.62,,,,,Single-ply,SBD,M,
Boys,55.79,1,Devin Espinoza,Gilmer Union Hill,55.43,124.74,72.57,127.01,324.32,Single-ply,SBD,M,
Boys,59.87,1,Mason Circle,Rusk,59.51,142.88,79.38,165.56,387.82,Single-ply,SBD,M,
Boys,59.87,2,Ruger Cates,Wills Point,59.24,147.42,74.84,133.81,356.07,Single-ply,SBD,M,
Boys,59.87,3,Daniel Dunn,Gilmer Union Hill,59.87,92.99,68.04,127.01,288.03,Single-ply,SBD,M,
Boys,67.13,1,Zane Smith #3,Gladewater Sabine,67.09,170.1,142.88,170.1,483.08,Single-ply,SBD,M,
Boys,67.13,2,Eric Allen,Center,67.09,158.76,102.06,210.92,471.74,Single-ply,SBD,M,
Boys,67.13,3,Hayden Dyess,Rusk,65.86,142.88,74.84,151.95,369.68,Single-ply,SBD,M,
Boys,74.84,1,Camden Ward,Gladewater Sabine,74.03,192.78,122.47,206.38,521.63,Single-ply,SBD,M,
Boys,74.84,2,Camden Hudnal,Rusk,74.39,190.51,106.59,195.04,492.15,Single-ply,SBD,M,
Boys,74.84,3,Jimmy Turner,Kemp,74.66,190.51,115.67,176.9,483.08,Single-ply,SBD,M,
Boys,74.84,4,Jayke Bass,Gilmer Union Hill,74.3,165.56,122.47,181.44,469.47,Single-ply,SBD,M,
Boys,74.84,5,Matt Morgan #3,Gladewater Sabine,74.3,172.37,113.4,174.63,460.4,Single-ply,SBD,M,
Boys,74.84,6,JB Hill,Gladewater Sabine,72.17,179.17,102.06,174.63,455.86,Single-ply,SBD,M,
Boys,74.84,7,Bryson Hampton,Daingerfield,73.66,165.56,104.33,151.95,421.84,Single-ply,SBD,M,
Boys,74.84,8,Hudson Hampton,Daingerfield,73.48,133.81,102.06,165.56,401.43,Single-ply,SBD,M,
Boys,74.84,9,Abraham Rosales,Rusk,73.57,142.88,104.33,140.61,387.82,Single-ply,SBD,M,
Boys,82.1,1,Jesus Portillo,Kemp,81.56,249.48,147.42,213.19,610.08,Single-ply,SBD,M,
Boys,82.1,2,Jacob Huddleston,Jacksonville,82.05,206.38,127.01,213.19,546.58,Single-ply,SBD,M,
Boys,82.1,3,Kaden Richard,Gladewater Sabine,81.78,206.38,122.47,201.85,530.7,Single-ply,SBD,M,
Boys,82.1,4,Joshua Arredondo,Rusk,81.19,161.03,92.99,156.49,410.5,Single-ply,SBD,M,
Boys,82.1,5,Landon Moses,Gladewater Sabine,77.84,154.22,92.99,158.76,405.97,Single-ply,SBD,M,
Boys,82.1,6,Korbin Colquitt,Gladewater Sabine,78.29,138.35,97.52,170.1,405.97,Single-ply,SBD,M,
Boys,82.1,7,Tony Vincente,Gladewater Sabine,78.56,156.49,90.72,133.81,381.02,Single-ply,SBD,M,
Boys,82.1,8,Reed Thornburgh,Gladewater Sabine,81.19,136.08,90.72,149.69,376.48,Single-ply,SBD,M,
Boys,89.81,1,Draven Emerson,Center,84.19,238.14,104.33,208.65,551.11,Single-ply,SBD,M,
Boys,89.81,2,Austin Stephens,Gladewater Sabine,82.55,170.1,102.06,170.1,442.25,Single-ply,SBD,M,
Boys,89.81,3,David Kennedy,Rusk,82.64,163.29,92.99,179.17,435.45,Single-ply,SBD,M,
Boys,89.81,4,Jonas Parish,Gilmer Union Hill,89.63,145.15,72.57,170.1,387.82,Single-ply,SBD,M,
Boys,89.81,5,Josue Gaytan,Jacksonville,87.54,129.27,79.38,149.69,358.34,Single-ply,SBD,M,
Boys,99.79,1,Ishmael Allen,Daingerfield,91.63,201.85,115.67,272.16,589.67,Single-ply,SBD,M,
Boys,99.79,2,Timothy Davis,Center,92.08,215.46,115.67,222.26,553.38,Single-ply,SBD,M,
Boys,99.79,3,Taylor Wilson,Gladewater Sabine,97.07,219.99,138.35,188.24,546.58,Single-ply,SBD,M,
Boys,99.79,4,Demerus Berry,Center,96.89,226.8,117.93,183.7,528.44,Single-ply,SBD,M,
Boys,99.79,5,Anthony Cummings,Jacksonville,92.99,163.29,102.06,174.63,439.98,Single-ply,SBD,M,
Boys,99.79,6,Micah Givins,Rusk,97.52,158.76,83.91,158.76,401.43,Single-ply,SBD,M,
Boys,99.79,7,Sam Bell #3,Rusk,97.52,142.88,88.45,154.22,385.55,Single-ply,SBD,M,
Boys,99.79,DQ,Waihett Emerson,Center,94.8,,,,,Single-ply,SBD,M,
Boys,99.79,DQ,Brantley Bauer,Jacksonville,97.52,174.63,90.72,,,Single-ply,SBD,M,
Boys,109.77,1,Hayden Taylor #3,Wills Point,106.87,233.6,136.08,204.12,573.79,Single-ply,SBD,M,
Boys,109.77,2,Lane Gilchrest,Rusk,109.5,222.26,111.13,215.46,548.85,Single-ply,SBD,M,
Boys,109.77,3,Steven Calico,Gladewater Sabine,108.32,192.78,127.01,201.85,521.63,Single-ply,SBD,M,
Boys,109.77,4,Malik Tatum,Daingerfield,109.72,188.24,113.4,199.58,501.22,Single-ply,SBD,M,
Boys,109.77,5,Marlon Hayes,Daingerfield,108.41,165.56,108.86,176.9,451.32,Single-ply,SBD,M,
Boys,109.77,DQ,Brendan Miller,Gladewater Sabine,101.74,,,,,Single-ply,SBD,M,
Boys,109.77,DQ,Asher Foster,Gladewater Sabine,109,,,,,Single-ply,SBD,M,
Boys,109.77,DQ,Antonio Zalatiel,Jacksonville,108.14,,,,,Single-ply,SBD,M,
Boys,124.74,1,Jacob Gonzales,Wills Point,123.83,272.16,161.03,251.74,684.92,Single-ply,SBD,M,
Boys,124.74,2,Eric Lopez,Center,118.75,290.3,176.9,179.17,646.37,Single-ply,SBD,M,
Boys,124.74,3,Chase Wright,Jacksonville,116.39,199.58,95.25,165.56,460.4,Single-ply,SBD,M,
Boys,139.71,1,Steven Gipson,Center,127.73,226.8,136.08,215.46,578.33,Single-ply,SBD,M,
Boys,139.71,2,Jy'Keelin Frazier,Daingerfield,132.45,226.8,133.81,165.56,526.17,Single-ply,SBD,M,
Boys,139.71,3,Brayden Brawner,Rusk,137.98,204.12,104.33,158.76,467.2,Single-ply,SBD,M,
Boys,139.71+,1,Alexis Martinez #13,Jacksonville,148.87,206.38,102.06,149.69,458.13,Single-ply,SBD,M,
Boys,139.71+,DQ,Kris Mayes,Wills Point,166.92,229.06,108.86,,,Single-ply,SBD,M,
