Name,State,Country,Division,AgeRange,BodyweightKg,WeightClassKg,BirthYear,Squat1Kg,Squat2Kg,Squat3Kg,Best3SquatKg,Bench1Kg,Bench2Kg,Bench3Kg,Best3BenchKg,Deadlift1Kg,Deadlift2Kg,Deadlift3Kg,Best3DeadliftKg,TotalKg,Place,Event,BirthDate,Sex,Equipment
Jamie Green #1,NM,England,MR-Jr,18.5-22.5,104.1,105,2002,,,,,145,155,160,160,,,,,160,1,B,,M,Raw
Luke George #1,,Wales,MR-O,,101.9,105,1991,,,,,180,-190,,180,,,,,180,1,B,,M,Raw
Harvey Robinson,EM,England,MR-O,,118,120,,,,,,200,207.5,212.5,212.5,,,,,212.5,1,B,,M,Raw
Ryan Martin #1,WM,England,MR-O,,119.6,120,,,,,,190,197.5,-210,197.5,,,,,197.5,2,B,,M,Raw
Troy Atkin,SE,England,MR-O,,117.8,120,,,,,,170,180,-185,180,,,,,180,3,B,,M,Raw
Ross Shahin-Ajerlo,NW,England,MR-O,,125.9,120+,,,,,,180,190,-200,190,,,,,190,1,B,,M,Raw
Toby Caswell,SE,England,MR-O,,130.2,120+,,,,,,167.5,-172.5,172.5,172.5,,,,,172.5,2,B,,M,Raw
Dan Amey,EM,England,MR-M1,39.5-48.5,89.8,93,,,,,,135,150,155,155,,,,,155,1,B,,M,Raw
Paul Constantine,NW,England,MR-M1,39.5-48.5,92.7,93,1975,,,,,140,145,-152.5,145,,,,,145,2,B,,M,Raw
Harbans Bansal,WM,England,MR-M1,39.5-48.5,110.2,120,,,,,,180,190,200,200,,,,,200,1,B,,M,Raw
Carl Sheppard,WM,England,MR-M1,39.5-48.5,111.5,120,,,,,,155,-160,160,160,,,,,160,2,B,,M,Raw
Paul Reid,GL,England,MR-M1,39.5-48.5,106.6,120,,,,,,135,142.5,-147.5,142.5,,,,,142.5,3,B,,M,Raw
Scott Squire,NW,England,MR-M1,39.5-48.5,207,120+,,,,,,185,195,-205,195,,,,,195,1,B,,M,Raw
Darren Sach,EM,England,MR-M1,39.5-48.5,155.1,120+,,,,,,160,-170,-170,160,,,,,160,2,B,,M,Raw
Nicholas Hall #1,YNE,England,MR-M2,49.5-58.5,86.1,93,,,,,,107.5,112.5,115,115,,,,,115,1,B,,M,Raw
David Penney,NW,England,MR-M2,49.5-58.5,86.5,93,1968,,,,,105,-110,-110,105,,,,,105,2,B,,M,Raw
Robert Baxter,NM,England,MR-M3,59.5-68.5,91.2,93,1952,,,,,110,117.5,120,120,,,,,120,1,B,,M,Raw
Steve Hart,EM,England,MR-M3,59.5-68.5,91.8,93,,,,,,95,-105,-105,95,,,,,95,2,B,,M,Raw
Harold Houldershaw,NM,England,MR-M3,59.5-68.5,103.4,105,1960,,,,,95,100,105,105,,,,,105,1,B,,M,Raw
Mick Ellender,SE,England,MR-M4,69.5-78.5,91.6,93,1945,,,,,95,105,-112.5,105,,,,,105,1,B,,M,Raw
Ishka Trace-Kleeberg,EM,England,FR-Jr,18.5-22.5,48.1,52,1998,,,,,50,55,57.5,57.5,,,,,57.5,1,B,,F,Raw
Amelia Maycock,NM,England,FR-Jr,18.5-22.5,68.3,69,,,,,,75,80,-87.5,80,,,,,80,1,B,,F,Raw
Tabitha Panton,,Wales,FR-Jr,18.5-22.5,78.2,84,,,,,,80,-85,-85,80,,,,,80,1,B,,F,Raw
Esther Jinadu,SE,England,FR-Jr,18.5-22.5,81.1,84,,,,,,62.5,67.5,75,75,,,,,75,2,B,,F,Raw
Harriet Waite,EM,England,FR-Jr,18.5-22.5,82.2,84,,,,,,67.5,72.5,75,75,,,,,75,3,B,,F,Raw
Chau-Long Le,GL,England,FR-O,,51.1,52,1993,,,,,70,-72.5,-72.5,70,,,,,70,1,B,,F,Raw
Tamsin Gamble,NW,England,FR-O,,50.9,52,,,,,,47.5,52.5,-57.5,52.5,,,,,52.5,2,B,,F,Raw
Sheina Kaye,NW,England,FR-O,,55.6,57,,,,,,80,85,87.5,87.5,,,,,87.5,1,B,,F,Raw
Melissa Hexter,GL,England,FR-O,,58.6,63,,,,,,105.5,110,-113,110,,,,,110,1,B,,F,Raw
Katie Roberts,,Wales,FR-O,,62.6,63,,,,,,-105,-105,-105,,,,,,,DQ,B,,F,Raw
Karenjeet Bains,WM,England,FR-O,,66.5,69,,,,,,82.5,85,-90,85,,,,,85,1,B,,F,Raw
Hollie Johnson,YNE,England,FR-O,,68.9,69,,,,,,75,80,-87.5,80,,,,,80,2,B,,F,Raw
Sophia Ellis,GL,England,FR-O,,73.5,76,,,,,,112.5,-118,-118,112.5,,,,,112.5,1,B,,F,Raw
Lucy Glover,SM,England,FR-O,,75.3,76,,,,,,87.5,90,-92.5,90,,,,,90,2,B,,F,Raw
Amy Clair,EM,England,FR-O,,75.4,76,,,,,,75,80,82.5,82.5,,,,,82.5,3,B,,F,Raw
Kate Sweatman,WM,England,FR-O,,127.6,84+,,,,,,100,107.5,110,110,,,,,110,1,B,,F,Raw
Kimberley Kirkham,EM,England,FR-O,,100.9,84+,,,,,,60,65,70,70,,,,,70,2,B,,F,Raw
Galit Goldshmid,SM,England,FR-M1,39.5-48.5,61.5,63,,,,,,80,-82.5,82.5,82.5,,,,,82.5,1,B,,F,Raw
Emma Ludlow,GL,England,FR-M1,39.5-48.5,59.9,63,,,,,,70,75,77.5,77.5,,,,,77.5,2,B,,F,Raw
Beverley Rodgers,SM,England,FR-M1,39.5-48.5,67.9,69,,,,,,82.5,87.5,90.5,90.5,,,,,90.5,1,B,,F,Raw
Wendie Kirkland,NM,England,FR-M1,39.5-48.5,68.1,69,,,,,,67.5,72.5,-77.5,72.5,,,,,72.5,2,B,,F,Raw
Lucy Hyde,SE,England,FR-M1,39.5-48.5,83.3,84,,,,,,85,-90,90,90,,,,,90,1,B,,F,Raw
Nicola Maycock,NM,England,FR-M1,39.5-48.5,78.4,84,,,,,,55,60,-62.5,60,,,,,60,2,B,,F,Raw
Jacqueline Gough,NM,England,FR-M1,39.5-48.5,155.5,84+,,,,,,110,115,121,121,,,,,121,1,B,,F,Raw
Sarah Bouskill,NM,England,FR-M1,39.5-48.5,119.6,84+,,,,,,100,110,-115,110,,,,,110,2,B,1979-07-24,F,Raw
Rita Shergold,SM,England,FR-M2,49.5-58.5,58.5,63,,,,,,60,-65,-65,60,,,,,60,1,B,,F,Raw
Lincoln Rose,SE,England,FR-M2,49.5-58.5,67.4,69,,,,,,-80,82.5,85,85,,,,,85,1,B,,F,Raw
Kelly Clark #1,YNE,England,FR-M2,49.5-58.5,66.2,69,,,,,,47.5,50,-52.5,50,,,,,50,2,B,,F,Raw
Julie Briggs,SE,England,FR-M2,49.5-58.5,75.4,76,,,,,,45,50,-55,50,,,,,50,1,B,,F,Raw
Jo Whiteley,NM,England,FR-M2,49.5-58.5,119.6,84+,,,,,,95,-100,-100,95,,,,,95,1,B,,F,Raw
Ann Morgan #1,SW,England,FR-M3,59.5-68.5,68.5,69,,,,,,30,32.5,35,35,,,,,35,1,B,,F,Raw
Janice Hawes,EM,England,FR-M3,59.5-68.5,75.1,76,,,,,,45,50,-55,50,,,,,50,1,B,,F,Raw
Judith McGauley,EM,England,FR-M4,69.5-78.5,52.4,57,,,,,,27.5,30,32.5,32.5,,,,,32.5,1,B,,F,Raw
Edward Kimber,SW,England,MR-Sj,14-17.5,64.9,66,,,,,,115,120,122.5,122.5,,,,,122.5,1,B,,M,Raw
James Anar,,Scotland,MR-Sj,14-17.5,71.9,74,,,,,,135,140,-145,140,,,,,140,1,B,,M,Raw
Luca Kawahara-Musiu,,,MR-Sj,14-17.5,71.4,74,,,,,,122.5,127.5,-132.5,127.5,,,,,127.5,2,B,,M,Raw
Harry Kirk,,,MR-Sj,14-17.5,81.8,83,,,,,,-147.5,147.5,-152.5,147.5,,,,,147.5,1,B,,M,Raw
Oliver Philpot,,,MR-Sj,14-17.5,90.8,93,,,,,,115,122.5,128,128,,,,,128,1,B,,M,Raw
Lee Harris #1,,,MR-Jr,18.5-22.5,73.2,74,,,,,,175,185,-187.5,185,,,,,185,1,B,,M,Raw
Thomas Evans #1,,,MR-Jr,18.5-22.5,92.2,93,,,,,,172.5,180,185,185,,,,,185,1,B,,M,Raw
Ben Hampson,,,MR-O,,58.3,59,,,,,,115,-122.5,-122.5,115,,,,,115,1,B,,M,Raw
Daniel McGauley,EM,England,MR-O,,57.3,59,,,,,,70,75,80,80,,,,,80,2,B,,M,Raw
Andrew Ward #1,,,MR-O,,73.5,74,,,,,,150,160,170,170,,,,,170,1,B,,M,Raw
Chris Eaton,NW,England,MR-O,,68.2,74,,,,,,100,107.5,112.5,112.5,,,,,112.5,2,B,,M,Raw
Dan Watkins #1,,,MR-O,,82.3,83,,,,,,160,170,177.5,177.5,,,,,177.5,1,B,,M,Raw
Anujan Srikantha,,,MR-O,,81.8,83,,,,,,175,-182.5,-182.5,175,,,,,175,2,B,,M,Raw
Ivan Protsyuk,,,MR-O,,81.4,83,,,,,,155,-160,-160,155,,,,,155,3,B,,M,Raw
Christopher Teague,,,MR-O,,91.4,93,,,,,,180,192.5,200,200,,,,,200,1,B,,M,Raw
Wesley McGuinness,,,MR-O,,92.7,93,,,,,,165,172.5,-177.5,172.5,,,,,172.5,2,B,,M,Raw
Alistair McDougall,,,MR-O,,92.2,93,,,,,,127.5,135,137.5,137.5,,,,,137.5,3,B,,M,Raw
Simon Beer,,,MR-O,,90.7,93,,,,,,135,-140,-140,135,,,,,135,4,B,,M,Raw
Rajesh Babu,GL,England,MR-M1,39.5-48.5,60.5,66,,,,,,110,115,-120,115,,,,,115,1,B,,M,Raw
Barrie Tavener,,,MR-M1,39.5-48.5,82.1,83,,,,,,150,160,170.5,170.5,,,,,170.5,1,B,,M,Raw
Jasvinder Singh Cheema,WM,England,MR-M1,39.5-48.5,81.9,83,,,,,,145,152.5,-157.5,152.5,,,,,152.5,2,B,,M,Raw
Gordon Kay,,,MR-M1,39.5-48.5,81.3,83,,,,,,125,130,-135,130,,,,,130,3,B,,M,Raw
Kevin Barrs,,Scotland,MR-M2,49.5-58.5,82.3,83,,,,,,115,122.5,132.5,132.5,,,,,132.5,1,B,,M,Raw
Jim Wands,,Scotland,MR-M2,49.5-58.5,82.1,83,,,,,,120,125,-130,125,,,,,125,2,B,,M,Raw
David Horne,,,MR-M2,49.5-58.5,81.4,83,,,,,,100,105,112.5,112.5,,,,,112.5,3,B,,M,Raw
Ray Jeffery,,,MR-M3,59.5-68.5,79.9,83,,,,,,110,-115,115,115,,,,,115,1,B,,M,Raw
Mick Amey,,,MR-M4,69.5-78.5,81.8,83,,,,,,60,80,87.5,87.5,,,,,87.5,1,B,,M,Raw
