Division,WeightClassKg,Place,Name,Team,BodyweightKg,Best3SquatKg,Best3BenchKg,Best3DeadliftKg,TotalKg,Equipment,Event,Sex
Boys,51.71,1,Alex Le,Palacios,46.54,90.72,61.23,111.13,263.08,Single-ply,SBD,M
Boys,51.71,2,Josue Gonzalez,Cleveland,50.71,70.31,61.23,97.52,229.06,Single-ply,SBD,M
Boys,55.79,1,Damien Garza,Van Vleck,55.7,131.54,77.11,140.61,349.27,Single-ply,SBD,M
Boys,55.79,2,Ean Cheerne,Vanderbilt Industrial,55.79,102.06,68.04,129.27,299.37,Single-ply,SBD,M
Boys,55.79,3,Elisha Garcia,Palacios,55.7,113.4,65.77,117.93,297.1,Single-ply,SBD,M
Boys,55.79,DQ,Christopher Rios,Cleveland,54.88,86.18,52.16,,,Single-ply,SBD,M
Boys,59.87,1,Miguel Sanchez,Palacios,59.87,174.63,88.45,149.69,412.77,Single-ply,SBD,M
Boys,59.87,2,Evan Salazar,Cleveland,58.06,124.74,77.11,156.49,358.34,Single-ply,SBD,M
Boys,59.87,3,Josh Gomez,Louise,57.61,106.59,56.7,102.06,265.35,Single-ply,SBD,M
Boys,59.87,4,Haydynn Nguyen,Palacios,57.61,83.91,52.16,113.4,249.48,Single-ply,SBD,M
Boys,67.13,1,Orlando Moreno,Bay City,65.77,195.04,111.13,188.24,494.42,Single-ply,SBD,M
Boys,67.13,2,Edwin Uribe,Cleveland,67.13,156.49,102.06,170.1,428.64,Single-ply,SBD,M
Boys,67.13,3,Cole Brogger,Vanderbilt Industrial,61.33,145.15,86.18,158.76,390.09,Single-ply,SBD,M
Boys,67.13,4,Reece Knebel,El Maton Tidehaven,65.32,124.74,72.57,158.76,356.07,Single-ply,SBD,M
Boys,67.13,DQ,Amaro Moises,Palacios,64.32,,124.74,,,Single-ply,SBD,M
Boys,67.13,DQ,Justin Lewis,Louise,62.32,,,,,Single-ply,SBD,M
Boys,74.84,1,Connor Stevens,Van Vleck,70.58,165.56,79.38,172.37,417.3,Single-ply,SBD,M
Boys,74.84,2,Carlos Rubio,El Maton Tidehaven,72.17,158.76,92.99,165.56,417.3,Single-ply,SBD,M
Boys,74.84,3,Jorge Carcamo,Cleveland,73.75,165.56,72.57,170.1,408.23,Single-ply,SBD,M
Boys,74.84,4,Steven Figueroa,Cleveland,68.13,142.88,83.91,163.29,390.09,Single-ply,SBD,M
Boys,74.84,5,Ricardo Luna,Vanderbilt Industrial,71.21,145.15,92.99,133.81,371.95,Single-ply,SBD,M
Boys,74.84,6,Jackson Fluitt,Vanderbilt Industrial,73.39,120.2,61.23,142.88,324.32,Single-ply,SBD,M
Boys,74.84,DQ,Austin Hill #3,Van Vleck,67.59,102.06,54.43,,,Single-ply,SBD,M
Boys,74.84,DQ,Brandon Espinoza,Van Vleck,68.86,138.35,,,,Single-ply,SBD,M
Boys,82.1,1,Jonathan Pesina,Bay City,77.56,201.85,122.47,204.12,528.44,Single-ply,SBD,M
Boys,82.1,2,Daron Moncevais,Palacios,77.47,156.49,124.74,192.78,474,Single-ply,SBD,M
Boys,82.1,3,Joseph Saavedra,El Maton Tidehaven,79.56,179.17,104.33,170.1,453.59,Single-ply,SBD,M
Boys,82.1,4,David Zavala,Palacios,81.65,172.37,88.45,183.7,444.52,Single-ply,SBD,M
Boys,82.1,5,Derek Hodges,Cleveland,77.93,156.49,92.99,154.22,403.7,Single-ply,SBD,M
Boys,82.1,6,Nathan Nguyen,Palacios,78.11,115.67,77.11,142.88,335.66,Single-ply,SBD,M
Boys,82.1,DQ,Tre Evans,Edna,77.75,61.23,138.35,,,Single-ply,SBD,M
Boys,82.1,DQ,Ball Chiwinkunpathom,Louise,75.84,99.79,54.43,,,Single-ply,SBD,M
Boys,82.1,DQ,Derek Luna,Louise,81.92,156.49,92.99,,,Single-ply,SBD,M
Boys,82.1,DQ,Aaron Gomez,Louise,81.19,,72.57,,,Single-ply,SBD,M
Boys,89.81,1,Dalton Ashcraft,Van Vleck,89.45,226.8,145.15,210.92,582.87,Single-ply,SBD,M
Boys,89.81,2,Aaron Sims,Cleveland,87.45,204.12,92.99,188.24,485.34,Single-ply,SBD,M
Boys,89.81,3,Zach Pierce,El Maton Tidehaven,89.81,183.7,95.25,199.58,478.54,Single-ply,SBD,M
Boys,89.81,4,Blaine Allen,Vanderbilt Industrial,87.27,149.69,106.59,170.1,426.38,Single-ply,SBD,M
Boys,89.81,5,Chris Bethany,Vanderbilt Industrial,85.28,136.08,88.45,147.42,371.95,Single-ply,SBD,M
Boys,89.81,6,Saul Sanchez,Palacios,86.82,147.42,81.65,142.88,371.95,Single-ply,SBD,M
Boys,89.81,7,Leo Torres,Louise,85.09,138.35,79.38,151.95,369.68,Single-ply,SBD,M
Boys,99.79,1,Jackson Engel,Palacios,98.97,215.46,127.01,195.04,537.51,Single-ply,SBD,M
Boys,99.79,2,Blayne Moreland,Vanderbilt Industrial,98.88,192.78,129.27,190.51,512.56,Single-ply,SBD,M
Boys,99.79,3,Noah Moreno,Palacios,94.44,192.78,122.47,195.04,510.29,Single-ply,SBD,M
Boys,99.79,4,Josh Figueroa,Van Vleck,96.8,165.56,92.99,165.56,424.11,Single-ply,SBD,M
Boys,99.79,5,Micah Coleman,El Maton Tidehaven,94.98,149.69,102.06,142.88,394.63,Single-ply,SBD,M
Boys,99.79,6,Marcelino Martinez,Van Vleck,94.89,108.86,68.04,127.01,303.91,Single-ply,SBD,M
Boys,99.79,DQ,Cameron Antwine,Edna,95.89,188.24,81.65,,,Single-ply,SBD,M
Boys,99.79,DQ,Danny Williams,Louise,90.36,149.69,,195.04,,Single-ply,SBD,M
Boys,99.79,DQ,Dd Gaona,Louise,98.43,,,,,Single-ply,SBD,M
Boys,109.77,1,Tristan Bermea,Vanderbilt Industrial,105.69,231.33,161.03,226.8,619.15,Single-ply,SBD,M
Boys,109.77,2,Marcos Hernandez,Cleveland,100.97,210.92,124.74,206.38,542.04,Single-ply,SBD,M
Boys,109.77,3,Michael Galvez,Bay City,106.23,192.78,136.08,174.63,503.49,Single-ply,SBD,M
Boys,109.77,4,Christian Martinez,Van Vleck,100.33,158.76,90.72,136.08,385.55,Single-ply,SBD,M
Boys,109.77,DQ,Lane Elizondo,Van Vleck,108.05,181.44,113.4,,,Single-ply,SBD,M
Boys,124.74,1,Jaedon Hinchliffe,Palacios,123.83,215.46,156.49,238.14,610.08,Single-ply,SBD,M
Boys,124.74,2,Ivan Dewitt,Bay City,111.13,208.65,127.01,183.7,519.36,Single-ply,SBD,M
Boys,124.74,3,Jaden Barnett,Cleveland,118.39,204.12,111.13,183.7,498.95,Single-ply,SBD,M
Boys,124.74,4,Ethan Carr,Palacios,114.4,183.7,136.08,165.56,485.34,Single-ply,SBD,M
Boys,124.74,5,Chris Vasquez,Louise,116.85,183.7,83.91,170.1,437.72,Single-ply,SBD,M
Boys,124.74,DQ,Marcus Montemayor,Van Vleck,121.2,147.42,102.06,,,Single-ply,SBD,M
Boys,124.74,DQ,Ellian Perez,Palacios,111.22,147.42,83.91,,,Single-ply,SBD,M
Boys,124.74,DQ,Jerry Johnson,El Maton Tidehaven,118.39,,117.93,,,Single-ply,SBD,M
Boys,124.74+,1,Joseph Cotie,Cleveland,128.46,294.84,190.51,226.8,712.14,Single-ply,SBD,M
Boys,124.74+,2,Javien Times,Bay City,134.54,201.85,172.37,233.6,607.81,Single-ply,SBD,M
Boys,124.74+,3,Matthew Aquirre,Cleveland,130.73,219.99,115.67,201.85,537.51,Single-ply,SBD,M
Boys,124.74+,4,Patrick Perkins,Van Vleck,163.29,124.74,142.88,170.1,437.72,Single-ply,SBD,M
Boys,124.74+,5,Johnny Rangel,Van Vleck,177.45,136.08,95.25,165.56,396.89,Single-ply,SBD,M
Boys,124.74+,6,DaWayne Haynes,Palacios,141.7,142.88,92.99,92.99,328.85,Single-ply,SBD,M
