Division,WeightClassKg,Place,Name,Team,BodyweightKg,Best3SquatKg,Best3BenchKg,Best3DeadliftKg,TotalKg,Equipment,Event,Sex
Boys,51.71,1,Adrian Ballew,Clute Brazoswood,51.26,127.01,70.31,133.81,331.12,Single-ply,SBD,M
Boys,51.71,2,Alex Salto,Manvel,47.08,74.84,49.9,95.25,219.99,Single-ply,SBD,M
Boys,55.79,1,Carlos Harian,Manvel,54.98,102.06,54.43,108.86,265.35,Single-ply,SBD,M
Boys,59.87,1,Armando Cabriales,Clute Brazoswood,59.42,163.29,102.06,181.44,446.79,Single-ply,SBD,M
Boys,59.87,2,Richie Garza,West Columbia,59.87,151.95,102.06,174.63,428.64,Single-ply,SBD,M
Boys,59.87,3,Bryan Lara,Alvin Shadow Creek,58.97,117.93,77.11,158.76,353.8,Single-ply,SBD,M
Boys,59.87,4,Cayde Brewer,Sweeny,56.7,124.74,88.45,122.47,335.66,Single-ply,SBD,M
Boys,59.87,5,Royce Brooks,Stafford,57.15,111.13,61.23,124.74,297.1,Single-ply,SBD,M
Boys,59.87,6,Perfecto Hernandez,Pasadena Rayburn,57.15,88.45,74.84,122.47,285.76,Single-ply,SBD,M
Boys,59.87,7,Mateo Aguirre,Pasadena Rayburn,58.97,83.91,58.97,102.06,244.94,Single-ply,SBD,M
Boys,67.13,1,Elias Arcia,Sweeny,64.41,176.9,129.27,183.7,489.88,Single-ply,SBD,M
Boys,67.13,2,Robert Martinez,West Columbia,65.86,176.9,115.67,183.7,476.27,Single-ply,SBD,M
Boys,67.13,3,Devin Preston,Hitchcock,67.13,183.7,113.4,158.76,455.86,Single-ply,SBD,M
Boys,67.13,4,Marges Regie,Alvin Shadow Creek,66.77,145.15,92.99,201.85,439.98,Single-ply,SBD,M
Boys,67.13,5,Richard Salazar #2,West Columbia,64.5,142.88,106.59,163.29,412.77,Single-ply,SBD,M
Boys,67.13,6,James Sullivan,Clute Brazoswood,65.77,156.49,102.06,154.22,412.77,Single-ply,SBD,M
Boys,67.13,7,Clayton Gallaugher,Alvin Shadow Creek,65.32,142.88,90.72,176.9,410.5,Single-ply,SBD,M
Boys,67.13,8,Marco Sanchez,Hitchcock,62.32,161.03,83.91,161.03,405.97,Single-ply,SBD,M
Boys,67.13,9,Shane Thompson,Stafford,65.32,154.22,90.72,156.49,401.43,Single-ply,SBD,M
Boys,67.13,10,Nathan Neely,Clute Brazoswood,63.05,142.88,88.45,147.42,378.75,Single-ply,SBD,M
Boys,67.13,11,Ashton Norwood,Hitchcock,63.41,142.88,79.38,127.01,349.27,Single-ply,SBD,M
Boys,67.13,12,Victor Williams,Manvel,60.42,122.47,70.31,154.22,347,Single-ply,SBD,M
Boys,67.13,13,Ty Keith,Freeport Brazosport,65.77,92.99,61.23,149.69,303.91,Single-ply,SBD,M
Boys,67.13,14,Mark Lopez,Pasadena Rayburn,61.69,102.06,68.04,124.74,294.84,Single-ply,SBD,M
Boys,67.13,15,Michael Oniel,Freeport Brazosport,60.33,111.13,65.77,113.4,290.3,Single-ply,SBD,M
Boys,74.84,1,Mason Seay,Clute Brazoswood,72.57,199.58,111.13,215.46,526.17,Single-ply,SBD,M
Boys,74.84,2,Stephen Morales,Hitchcock,73.39,190.51,108.86,199.58,498.95,Single-ply,SBD,M
Boys,74.84,3,Pristine Hysten,Sweeny,74.57,183.7,124.74,174.63,483.08,Single-ply,SBD,M
Boys,74.84,4,Alex Villareal,Freeport Brazosport,74.39,179.17,108.86,181.44,469.47,Single-ply,SBD,M
Boys,74.84,5,Jarod Pearson,Clute Brazoswood,71.67,167.83,102.06,188.24,458.13,Single-ply,SBD,M
Boys,74.84,6,William Evans,Manvel,73.03,154.22,117.93,181.44,453.59,Single-ply,SBD,M
Boys,74.84,7,Xavier Carter,Manvel,74.84,158.76,90.72,192.78,442.25,Single-ply,SBD,M
Boys,74.84,8,Keegan Anderson,West Columbia,71.21,151.95,106.59,158.76,417.3,Single-ply,SBD,M
Boys,74.84,9,Chris West,Clute Brazoswood,73.94,163.29,88.45,165.56,417.3,Single-ply,SBD,M
Boys,74.84,10,Jonathan Reynolds,Manvel,74.39,138.35,95.25,161.03,394.63,Single-ply,SBD,M
Boys,74.84,11,Wyatt Lamberth,Manvel,70.76,142.88,86.18,147.42,376.48,Single-ply,SBD,M
Boys,82.1,1,Mario Vega,Clute Brazoswood,80.74,222.26,158.76,238.14,619.15,Single-ply,SBD,M
Boys,82.1,2,Jason Martinez,Alvin Shadow Creek,81.19,183.7,154.22,206.38,544.31,Single-ply,SBD,M
Boys,82.1,3,Micah Bumgarner,Hitchcock,81.56,204.12,124.74,195.04,523.9,Single-ply,SBD,M
Boys,82.1,4,Sean Burns #1,Stafford,75.75,188.24,145.15,179.17,512.56,Single-ply,SBD,M
Boys,82.1,5,Logan Page,Sweeny,79.83,192.78,122.47,197.31,512.56,Single-ply,SBD,M
Boys,82.1,6,Slade Bass,Sweeny,79.83,195.04,117.93,192.78,505.76,Single-ply,SBD,M
Boys,82.1,7,Ruel Hampton,Manvel,76.2,183.7,115.67,183.7,483.08,Single-ply,SBD,M
Boys,82.1,8,JaQai Neal,Manvel,76.66,179.17,97.52,195.04,471.74,Single-ply,SBD,M
Boys,82.1,9,Sovanara Kuy,Alvin Shadow Creek,78.47,158.76,102.06,210.92,471.74,Single-ply,SBD,M
Boys,82.1,10,Ricardo Medina,Manvel,81.19,158.76,95.25,201.85,455.86,Single-ply,SBD,M
Boys,82.1,11,Derek Zavala,Freeport Brazosport,81.19,142.88,108.86,181.44,433.18,Single-ply,SBD,M
Boys,82.1,12,Jayson Peters,Alvin Shadow Creek,80.74,147.42,90.72,156.49,394.63,Single-ply,SBD,M
Boys,82.1,13,Daniel Sánchez,Pasadena Rayburn,75.39,113.4,74.84,142.88,331.12,Single-ply,SBD,M
Boys,82.1,14,Gerardo Martinez,Pasadena Rayburn,82.1,95.25,79.38,102.06,276.69,Single-ply,SBD,M
Boys,82.1,DQ,Joshua Pena,Hitchcock,81.28,170.1,,,,Single-ply,SBD,M
Boys,89.81,1,E'fabian Allen,Alvin Shadow Creek,89.36,208.65,129.27,197.31,535.24,Single-ply,SBD,M
Boys,89.81,2,DeMonte Seymore,Manvel,84.28,165.56,102.06,190.51,458.13,Single-ply,SBD,M
Boys,89.81,3,Ken Steward,Stafford,86.18,167.83,92.99,197.31,458.13,Single-ply,SBD,M
Boys,89.81,4,Jaden Balderston,Freeport Brazosport,88,158.76,106.59,188.24,453.59,Single-ply,SBD,M
Boys,89.81,5,Brett Bible,Sweeny,87.54,165.56,124.74,158.76,449.06,Single-ply,SBD,M
Boys,89.81,6,Osman Tabora,Alvin Shadow Creek,83.46,151.95,102.06,183.7,437.72,Single-ply,SBD,M
Boys,89.81,7,Juan Cuevas,West Columbia,84.82,163.29,97.52,174.63,435.45,Single-ply,SBD,M
Boys,89.81,8,Avery Clark #1,Manvel,82.28,142.88,104.33,170.1,417.3,Single-ply,SBD,M
Boys,89.81,9,Tony Rotramel,Clute Brazoswood,82.55,163.29,92.99,154.22,410.5,Single-ply,SBD,M
Boys,89.81,10,Sergio Aragon,Pasadena Rayburn,87.54,129.27,77.11,147.42,353.8,Single-ply,SBD,M
Boys,89.81,11,Norman Tyler,Hitchcock,86.64,138.35,68.04,142.88,349.27,Single-ply,SBD,M
Boys,89.81,12,Edwin Diaz,Pasadena Rayburn,82.55,102.06,79.38,136.08,317.51,Single-ply,SBD,M
Boys,89.81,DQ,Joshua Dia,Alvin Shadow Creek,88.9,102.06,,142.88,,Single-ply,SBD,M
Boys,99.79,1,Joey Avalos,Manvel,92.99,235.87,147.42,244.94,628.23,Single-ply,SBD,M
Boys,99.79,2,Kelvon York-Norman,Hitchcock,92.99,249.48,154.22,217.72,621.42,Single-ply,SBD,M
Boys,99.79,3,Brady Byrd,Sweeny,97.98,242.67,142.88,235.87,621.42,Single-ply,SBD,M
Boys,99.79,4,Ken Savanna,Stafford,94.8,219.99,156.49,229.06,605.55,Single-ply,SBD,M
Boys,99.79,5,Kody Gums,Stafford,97.52,215.46,142.88,231.33,589.67,Single-ply,SBD,M
Boys,99.79,6,Braden Davis,West Columbia,99.25,206.38,142.88,199.58,548.85,Single-ply,SBD,M
Boys,99.79,7,Hogan Ashford,Sweeny,94.89,195.04,108.86,199.58,503.49,Single-ply,SBD,M
Boys,99.79,8,Chancellor Burford,Alvin Shadow Creek,94.8,142.88,124.74,195.04,462.66,Single-ply,SBD,M
Boys,99.79,9,Samuel Knuckles,Manvel,96.62,142.88,95.25,185.97,424.11,Single-ply,SBD,M
Boys,99.79,10,Brandon Jackson,Alvin Shadow Creek,97.07,156.49,97.52,170.1,424.11,Single-ply,SBD,M
Boys,109.77,1,Nic Nail,Sweeny,108.41,219.99,174.63,242.67,637.3,Single-ply,SBD,M
Boys,109.77,2,Kaleb Manning,Clute Brazoswood,107.95,231.33,154.22,233.6,619.15,Single-ply,SBD,M
Boys,109.77,3,Ethan George,Stafford,108.41,235.87,151.95,219.99,607.81,Single-ply,SBD,M
Boys,109.77,4,James Cobb,Sweeny,107.5,233.6,133.81,201.85,569.26,Single-ply,SBD,M
Boys,109.77,5,Reginald Freeman,Manvel,100.7,226.8,124.74,197.31,548.85,Single-ply,SBD,M
Boys,109.77,6,Sebastian Carrier,Stafford,102.51,145.15,124.74,217.72,487.61,Single-ply,SBD,M
Boys,109.77,7,Elias Brooks,Manvel,108.86,183.7,90.72,179.17,453.59,Single-ply,SBD,M
Boys,109.77,8,Rafael Martinez,West Columbia,108.32,179.17,102.06,170.1,451.32,Single-ply,SBD,M
Boys,109.77,9,Pedro Campos,Pasadena Rayburn,102.06,115.67,83.91,142.88,342.46,Single-ply,SBD,M
Boys,109.77,DQ,Devante Johnson,Alvin Shadow Creek,106.14,224.53,,,,Single-ply,SBD,M
Boys,124.74,1,Arman Chowdhury,Sweeny,114.76,240.4,161.03,226.8,628.23,Single-ply,SBD,M
Boys,124.74,2,Alex Zavala,Clute Brazoswood,114.31,217.72,127.01,215.46,560.19,Single-ply,SBD,M
Boys,124.74,3,Randy Robertson,Freeport Brazosport,113.4,201.85,133.81,215.46,551.11,Single-ply,SBD,M
Boys,124.74,4,Christen Robinson,Manvel,119.29,192.78,115.67,213.19,521.63,Single-ply,SBD,M
Boys,124.74,5,Jacob Jiminez,Stafford,121.56,188.24,138.35,183.7,510.29,Single-ply,SBD,M
Boys,124.74,6,Dylan Hughes,Alvin Shadow Creek,114.31,165.56,108.86,190.51,464.93,Single-ply,SBD,M
Boys,124.74,7,Jaden Edmonson,Manvel,124.74,181.44,97.52,183.7,462.66,Single-ply,SBD,M
Boys,124.74+,1,Demarius Countee,Manvel,146.96,258.55,161.03,226.8,646.37,Single-ply,SBD,M
Boys,124.74+,2,Mikel Richey,Clute Brazoswood,129.27,208.65,147.42,219.99,576.06,Single-ply,SBD,M
Boys,124.74+,3,Marcus Smith,Stafford,139.71,192.78,174.63,208.65,576.06,Single-ply,SBD,M
Boys,124.74+,4,Lance McLaren,Sweeny,128.82,195.04,127.01,197.31,519.36,Single-ply,SBD,M
Boys,124.74+,5,Braylon Garcia,Stafford,139.25,176.9,127.01,206.38,510.29,Single-ply,SBD,M
Boys,124.74+,6,Mikal Bryan,Hitchcock,143.7,188.24,102.06,204.12,494.42,Single-ply,SBD,M
Boys,124.74+,7,Shimir Lewis,Freeport Brazosport,180.98,138.35,111.13,183.7,433.18,Single-ply,SBD,M
Boys,124.74+,8,Manny Galindo,Freeport Brazosport,147.87,163.29,113.4,142.88,419.57,Single-ply,SBD,M
Boys,124.74+,9,Danny Santana,Alvin Shadow Creek,172.82,124.74,124.74,158.76,408.23,Single-ply,SBD,M
Boys,124.74+,10,Eduardo Perez,Pasadena Rayburn,125.19,120.2,70.31,124.74,315.25,Single-ply,SBD,M
