Division,Equipment,Event,Tested,WeightClassKg,Sex,Name,Country,BirthDate,BodyweightKg,Squat1Kg,Squat2Kg,Squat3Kg,Squat4Kg,Best3SquatKg,Bench1Kg,Bench2Kg,Bench3Kg,Bench4Kg,Best3BenchKg,Deadlift1Kg,Deadlift2Kg,Deadlift3Kg,Deadlift4Kg,Best3DeadliftKg,TotalKg,Place
Amateur Teen 13-15,Wraps,SBD,Yes,56,M,Radosław Bober,Poland,2004-01-28,52.48,75,85,100,,100,60,70,72.5,,72.5,120,130,140,,140,312.5,1
Amateur Teen 13-15,Wraps,SBD,Yes,75,M,Mikołaj Woch,Poland,2004-08-20,75,-160,160,170,,170,85,92.5,100,,100,160,175,195,200,195,465,1
Amateur Teen 13-15,Wraps,SBD,Yes,75,M,Marcin Zwoliński,Poland,2005-01-22,71,67.5,72.5,80,,80,65,72.5,77.5,,77.5,100,110,120,,120,277.5,2
Amateur Teen 13-15,Wraps,SBD,Yes,125,M,Marcel Sobkowiak,Poland,2003-12-21,122.5,170,190,207.5,,207.5,140,152.5,160,,160,175,190,200,,200,567.5,1
Amateur Teen 16-17,Wraps,SBD,Yes,75,M,Vardan Nazaretyan,Armenia,2003-03-23,75,-140,140,150,,150,-80,80,-90,,80,160,180,190,,190,420,1
Amateur Teen 16-17,Wraps,SBD,Yes,75,M,Mateusz Tyma,Poland,2003-04-02,74.3,110,125,135,,135,70,77.5,-82.5,,77.5,140,155,162.5,,162.5,375,2
Amateur Teen 16-17,Wraps,SBD,Yes,75,M,Janek Osiak,Poland,2003-09-11,72.25,120,127.5,132.5,,132.5,72.5,77.5,-80,,77.5,142.5,150,155,,155,365,3
Amateur Teen 16-17,Wraps,SBD,Yes,82.5,M,Eduard Chatyan,Armenia,2002-11-14,81.45,-150,150,-165,,150,105,110,112.5,,112.5,180,190,-200,,190,452.5,1
Amateur Teen 16-17,Wraps,SBD,Yes,90,M,Danyil Hapon,Ukraine,2002-03-23,83.45,190,200,210,,210,100,110,120,,120,200,220,240,,240,570,1
Amateur Teen 16-17,Wraps,SBD,Yes,90,M,Varazdat Amiryan,Armenia,2002-11-15,89.5,165,175,185,,185,110,115,117.5,,117.5,190,205,-210,,205,507.5,2
Amateur Teen 16-17,Wraps,SBD,Yes,100,M,Alan Walkowiak,Poland,2002-08-26,97.55,175,180,185,,185,80,85,90,,90,205,215,220,,220,495,1
Amateur Teen 16-17,Wraps,SBD,Yes,100,M,Remigiusz Zwoliński,Poland,2003-08-15,95.15,95,107.5,-110,,107.5,90,-100,100,,100,140,160,162.5,,162.5,370,2
Amateur Teen 16-17,Wraps,SBD,Yes,125,M,Rafał Szabłowski,Poland,2001-11-28,117.45,210,220,230,,230,150,155,-160,,155,205,215,-220,,215,600,1
Amateur Teen 18-19,Wraps,SBD,Yes,82.5,M,Jakub Kozłowski,Poland,2001-10-28,79.7,-155,-160,160,,160,100,107.5,-115,,107.5,155,170,180,,180,447.5,2
Amateur Teen 18-19,Wraps,SBD,Yes,82.5,M,Damian Chrostek,Poland,2001-11-07,81.8,-150,-150,-150,,,,,,,,,,,,,,DQ
Amateur Teen 18-19,Wraps,SBD,Yes,90,M,Jan Groszkowski,Poland,2001-04-26,86.25,-205,205,-220,,205,125,135,140,,140,210,225,235,,235,580,2
Amateur Teen 18-19,Wraps,SBD,Yes,100,M,Artur Łapata,Belarus,2000-10-31,96.8,215,230,250,,250,150,160,-170,,160,210,235,-250,,235,645,1
Amateur Juniors 20-23,Wraps,SBD,Yes,82.5,M,Mateusz Tchorek,Poland,1999-10-07,81.75,200,220,235,,235,160,170,-180,,170,200,220,235,,235,640,1
Amateur Juniors 20-23,Wraps,SBD,Yes,90,M,Grigor Harutyunyan,Armenia,1997-04-19,89.75,190,205,215,,215,130,140,145,,145,240,250,-262.5,,250,610,3
Amateur Juniors 20-23,Wraps,SBD,Yes,110,M,Jakub Borkowski,Poland,1996-03-27,105.1,200,205,210,,210,155,-160,160,,160,240,-250,-250,,240,610,1
Amateur Open,Wraps,SBD,Yes,60,M,Vardan Simonyan,Armenia,1991-06-02,57.3,110,120,-125,,120,75,-80,,,75,150,170,-180,,170,365,1
Amateur Open,Wraps,SBD,Yes,75,M,Michał Nisztuk,Poland,1989-06-09,67.6,125,135,140,,140,75,80,-85,,80,155,170,-180,,170,390,1
Amateur Open,Wraps,SBD,Yes,75,M,Kamil Maćkowiak,Poland,1993-08-13,73.35,110,120,-125,,120,95,105,-107.5,,105,140,150,160,,160,385,2
Amateur Open,Wraps,SBD,Yes,82.5,M,Mariusz Zych,Poland,1994-02-27,81.95,180,195,210,,210,-100,-110,110,,110,185,205,-225,,205,525,1
Amateur Open,Wraps,SBD,Yes,90,M,Marcin Kosut,Poland,1988-10-23,89.05,235,242.5,250,,250,160,-167.5,-167.5,,160,240,255,265,,265,675,1
Amateur Open,Wraps,SBD,Yes,90,M,Mateusz Rufkiewicz,Poland,1988-06-27,88.2,200,215,222.5,,222.5,175,-182.5,182.5,-190.5,182.5,245,260,-270,,260,665,2
Amateur Open,Wraps,SBD,Yes,90,M,Mariusz Gładysz,Poland,1981-12-19,84.75,180,200,210,,210,150,-160,160,,160,200,220,240,,240,610,3
Amateur Open,Wraps,SBD,Yes,90,M,Dawid Dominiak,Poland,1995-03-13,89.45,-200,200,-210,,200,130,135,140,,140,-220,230,240,,240,580,4
Amateur Open,Wraps,SBD,Yes,100,M,Karol Frąckowiak,Poland,1991-12-08,100,250,270,-287.5,,270,140,150,-155,,150,260,280,-290.5,,280,700,1
Amateur Open,Wraps,SBD,Yes,100,M,Artur Łapata,Belarus,2000-10-31,96.8,215,230,250,,250,150,160,-170,,160,210,235,-250,,235,645,2
Amateur Open,Wraps,SBD,Yes,100,M,Kamil Froń,Poland,1996-08-15,99,180,195,205,,205,115,-125,-125,,115,210,-220,-220,,210,530,3
Amateur Open,Wraps,SBD,Yes,110,M,Mariusz Snarski,Poland,1984-05-08,109.35,270,285,292.5,,292.5,170,180,-190,,180,270,282.5,290,,290,762.5,1
Amateur Open,Wraps,SBD,Yes,110,M,Daniel Skalny,Poland,1995-11-05,108.35,-225,-225,235,,235,-160,-160,160,,160,280,290,-300,,290,685,2
Amateur Open,Wraps,SBD,Yes,110,M,Konrad Czupryn,Poland,1989-03-15,100.35,200,210,-220,,210,135,142.5,147.5,,147.5,230,-240,,,230,587.5,3
Amateur Open,Wraps,SBD,Yes,125,M,Konrad Bronicki,Poland,1982-11-25,123.7,315,330,350,-368,350,180,190,-195,,190,260,280,287.5,,287.5,827.5,1
Amateur Submasters 33-39,Wraps,SBD,Yes,60,M,Makar Tamrazyan,Armenia,1981-04-07,59,120,130,,,130,80,90,,,90,175,185,192.5,,192.5,412.5,1
Amateur Submasters 33-39,Wraps,SBD,Yes,100,M,Jakub Olszewski,Poland,1983-12-16,93.65,145,-160,160,,160,-125,125,-135,,125,160,180,-215,,180,465,3
Amateur Submasters 33-39,Wraps,SBD,Yes,125,M,Konrad Bronicki,Poland,1982-11-25,123.7,315,330,350,-368,350,180,190,-195,,190,260,280,287.5,,287.5,827.5,1
Amateur Masters 40-44,Wraps,SBD,Yes,82.5,M,Karen Hovhannisyan,Armenia,1978-01-01,80.6,130,-150,-150,,130,90,100,102.5,,102.5,180,190,202.5,,202.5,435,1
Amateur Masters 40-44,Wraps,SBD,Yes,90,M,Krzysztof Kośmiński,Poland,1978-02-11,89.5,-190,-190,190,,190,150,160,-165.5,,160,200,220,-235.5,,220,570,2
Amateur Masters 40-44,Wraps,SBD,Yes,100,M,Hayk Afyan,Armenia,1978-03-20,97.35,130,150,160,,160,110,115,120,,120,150,170,180,,180,460,2
Amateur Masters 40-44,Wraps,SBD,Yes,125,M,Artavazd Arakelyan,Armenia,1975-09-09,122.2,160,180,-200,,180,130,140,-150,,140,160,180,200,,200,520,1
Amateur Masters 45-49,Wraps,SBD,Yes,75,M,Vadym Koverznev,Ukraine,1970-02-07,73.5,135,140,,,140,107.5,-112.5,-112.5,,107.5,150,155,,,155,402.5,1
Amateur Masters 45-49,Wraps,SBD,Yes,90,M,Dariusz Zwoliński,Poland,1974-11-06,86.6,145,-150,-155,,145,122.5,-127.5,-127.5,,122.5,150,160,162.5,,162.5,430,1
Amateur Masters 50-54,Wraps,SBD,Yes,110,M,Mariusz Rufkiewicz,Poland,1967-03-23,100.8,200,225,-235,,225,140,150,-160.5,,150,230,245,260,265,260,635,1
Amateur Masters 55-59,Wraps,SBD,Yes,110,M,Adam Urbański,Poland,1962-05-18,102.1,160,180,-190,,180,125,135,-140,,135,170,180,185,,185,500,1
Amateur Masters 65-69,Wraps,SBD,Yes,82.5,M,Mieczysłąw Maczka,Germany,1954-09-11,82.3,110,140,150,,150,100,110,112.5,,112.5,120,145,-157.5,,145,407.5,1
Amateur Military/Fire/Police,Wraps,SBD,Yes,110,M,Mariusz Snarski,Poland,1984-05-08,109.35,270,285,292.5,,292.5,170,180,-190,,180,270,282.5,290,,290,762.5,1
Amateur Open,Wraps,SBD,Yes,52,F,Klaudia Arendt-Woźniak,Poland,1991-06-21,51.4,65,-70,-70,,65,-35,35,-40,,35,85,95,100,,100,200,1
Amateur Open,Wraps,SBD,Yes,56,F,Roksolana Busko,Ukraine,1996-03-04,55.16,120,-125,-130,,120,60,62.5,-65,,62.5,130,135,-140,,135,317.5,1
Amateur Open,Wraps,SBD,Yes,56,F,Beata Palonek,Poland,1993-08-26,52.46,110,120,125,,125,42.5,47.5,50,,50,110,120,130,,130,305,2
Amateur Open,Wraps,SBD,Yes,67.5,F,Anita Wysokińska,Poland,1992-09-05,66,102.5,110,-117.5,,110,57.5,60,-62.5,,60,120,132.5,147.5,,147.5,317.5,1
Amateur Open,Wraps,SBD,Yes,67.5,F,Natalia Falana,Poland,1993-12-09,62.7,90,-100,100,,100,45,-50,-50,,45,100,110,115,,115,260,2
Amateur Open,Wraps,SBD,Yes,75,F,Aleksandra Fabiańska,Poland,1990-05-31,67.75,-125,-132.5,-132.5,,,,,,,,,,,,,,DQ
Amateur Open,Wraps,SBD,Yes,82.5,F,Agnieszka Dzikoń,Poland,1993-10-16,79.75,145,155,162.5,,162.5,65,67.5,-70,,67.5,165,177.5,187.5,,187.5,417.5,2
Amateur Open,Wraps,SBD,Yes,82.5,F,Patrycja Grzyb,Poland,1995-03-29,82.5,115,125,135,,135,45,50,55,,55,120,135,145,,145,335,3
Amateur Open,Wraps,SBD,Yes,90,F,Ewa Lipka,Poland,1993-12-24,86.95,-115,115,-120,,115,40,45,-47.5,,45,110,120,125,,125,285,5
Amateur Submasters 33-39,Wraps,SBD,Yes,60,F,Kateryna Khomych,Ukraine,1981-04-01,59.35,80,85,90,,90,42.5,-47.5,-47.5,,42.5,-80,80,87.5,,87.5,220,2
Amateur Submasters 33-39,Wraps,SBD,Yes,75,F,Helena Haraszkiewicz,Poland,1985-09-11,73.6,-130,-130,130,,130,67.5,-70,-72.5,,67.5,140,147.5,152.5,,152.5,350,1
Amateur Submasters 33-39,Wraps,SBD,Yes,90,F,Dorota Głowacka,Poland,1980-01-22,90,100,-110,115,,115,-60,62.5,65,,65,110,125,140,,140,320,2
Amateur Masters 40-44,Wraps,SBD,Yes,60,F,Małgorzata Krzyżanowska,Poland,1979-07-25,57.36,-115,120,-130,,120,45,50,-55,,50,140,-150,150,,150,320,1
Amateur Masters 45-49,Wraps,SBD,Yes,67.5,F,Beata Kowalska,Poland,1973-08-28,67.1,117.5,125,127.5,,127.5,72.5,75,-77.5,,75,147.5,157.5,162.5,,162.5,365,1
Amateur Open,Multi-ply,SBD,Yes,110,M,Mariusz Snarski,Poland,1984-05-08,109.35,270,285,292.5,,292.5,170,180,-190,,180,270,282.5,290,,290,762.5,1
Amateur Masters 65-69,Multi-ply,SBD,Yes,82.5,M,Mieczysłąw Maczka,Germany,1954-09-11,82.3,110,140,150,,150,100,110,112.5,,112.5,120,145,-157.5,,145,407.5,1
Amateur Military/Fire/Police,Multi-ply,SBD,Yes,110,M,Mariusz Snarski,Poland,1984-05-08,109.35,270,285,292.5,,292.5,170,180,-190,,180,270,282.5,290,,290,762.5,1
Amateur Teen 13-15,Raw,BD,Yes,56,M,Vahan Budaghyan,Armenia,2004-02-17,53.3,,,,,,65,70,-72.5,,70,130,140,145,,145,215,1
Amateur Teen 16-17,Raw,BD,Yes,67.5,M,Norik Karapetyan,Armenia,2002-12-06,64.15,,,,,,55,65,70,,70,-60,60,,,60,130,1
Amateur Teen 18-19,Raw,BD,Yes,90,M,Nazarii Levytskyy,Ukraine,2000-04-28,87.1,,,,,,125,132.5,137.5,,137.5,210,225,235,,235,372.5,1
Amateur Teen 18-19,Raw,BD,Yes,90,M,Nikodem Cieleban,Poland,2000-07-01,85.6,,,,,,80,87.5,-92.5,,87.5,160,170,-180,,170,257.5,2
Amateur Juniors 20-23,Raw,BD,Yes,75,M,Wojtek Zawadzki,Poland,1998-05-29,74.2,,,,,,80,-85,-85,,80,140,150,160,,160,240,1
Amateur Open,Raw,BD,Yes,75,M,Arman Hayrapetyan,Armenia,1992-08-23,74.1,,,,,,90,100,105,,105,170,185,195,,195,300,1
Amateur Open,Raw,BD,Yes,82.5,M,Matevos Aghayan,Armenia,1990-07-15,78.5,,,,,,100,110,120,,120,170,180,190,,190,310,1
Amateur Open,Raw,BD,Yes,90,M,Garnik Abrahamyan,Armenia,1986-11-27,85.35,,,,,,70,-75,-75,,70,130,135,-150,,135,205,1
Amateur Open,Raw,BD,Yes,110,M,Konrad Czupryn,Poland,1989-03-15,100.35,,,,,,135,142.5,147.5,,147.5,230,-240,,,230,377.5,2
Amateur Submasters 33-39,Raw,B,Yes,82.5,M,Seyran Simonyan,Armenia,1983-08-04,81.6,,,,,,80,100,-120,,100,,,,,,100,1
Amateur Teen 13-15,Raw,B,Yes,52,M,Volodymyr Galyga,Ukraine,2005-08-16,49.7,,,,,,50,52.5,55,,55,,,,,,55,1
Amateur Teen 13-15,Raw,B,Yes,75,M,Marcin Zwoliński,Poland,2005-01-22,71,,,,,,65,72.5,77.5,,77.5,,,,,,77.5,1
Amateur Teen 16-17,Raw,B,Yes,67.5,M,Artur Arakelyan,Armenia,2003-10-07,66.35,,,,,,110,120,125,,125,,,,,,125,1
Amateur Teen 16-17,Raw,B,Yes,67.5,M,Karol Kwiatkowski,Poland,2003-10-05,65.9,,,,,,110,115,-117.5,,115,,,,,,115,3
Amateur Teen 16-17,Raw,B,Yes,67.5,M,Dmytro Melnyk,Ukraine,2003-09-22,67.4,,,,,,-110,-110,-110,,,,,,,,,DQ
Amateur Teen 16-17,Raw,B,Yes,100,M,Remigiusz Zwoliński,Poland,2003-08-15,95.15,,,,,,90,-100,100,,100,,,,,,100,1
Amateur Teen 16-17,Raw,B,Yes,100,M,Alan Walkowiak,Poland,2002-08-26,97.55,,,,,,80,85,90,,90,,,,,,90,3
Amateur Teen 16-17,Raw,B,Yes,110,M,Ara Martirosyan,Armenia,2003-11-18,102.2,,,,,,70,-80,-80,,70,,,,,,70,1
Amateur Teen 18-19,Raw,B,Yes,75,M,Bartek Andrzejczak,Poland,1999-08-27,74.95,,,,,,140,-147.5,-147.5,,140,,,,,,140,1
Amateur Teen 18-19,Raw,B,Yes,75,M,Nikodem Labuda,Poland,2001-09-05,73.9,,,,,,95,-102.5,-110,,95,,,,,,95,2
Amateur Teen 18-19,Raw,B,Yes,82.5,M,Damian Chrostek,Poland,2001-11-07,81.8,,,,,,90,-100,100,,100,,,,,,100,1
Amateur Teen 18-19,Raw,B,Yes,90,M,Jan Groszkowski,Poland,2001-04-26,86.25,,,,,,125,135,140,,140,,,,,,140,1
Amateur Teen 18-19,Raw,B,Yes,90,M,Gracjan Tałaj,Poland,2001-02-03,88.65,,,,,,130,135,-142.5,,135,,,,,,135,2
Amateur Teen 18-19,Raw,B,Yes,100,M,Piotr Szymański,Poland,2001-05-07,93.85,,,,,,95,-100,-100,,95,,,,,,95,1
Amateur Juniors 20-23,Raw,B,Yes,75,M,Adam Kawka,Poland,1997-06-19,74.25,,,,,,165,172.5,177.5,-180,177.5,,,,,,177.5,1
Amateur Juniors 20-23,Raw,B,Yes,82.5,M,Bartłomiej Koziara,Poland,1996-05-06,81.8,,,,,,155,160,-165,,160,,,,,,160,2
Amateur Juniors 20-23,Raw,B,Yes,90,M,Grzegorz Strambowski,Poland,1998-01-26,88.5,,,,,,150,157.5,162.5,,162.5,,,,,,162.5,1
Amateur Juniors 20-23,Raw,B,Yes,90,M,Konrad Oszczyk,Poland,1997-01-22,86.7,,,,,,135,145,-150,,145,,,,,,145,2
Amateur Juniors 20-23,Raw,B,Yes,100,M,Patryk Hajduk,Poland,1996-12-30,93.55,,,,,,140,155,170,,170,,,,,,170,2
Amateur Juniors 20-23,Raw,B,Yes,110,M,Robert Łukasiewicz,Poland,1999-04-26,106.6,,,,,,185,191,192.5,195,192.5,,,,,,192.5,2
Amateur Open,Raw,B,Yes,67.5,M,Ruslan Sorochynskyy,Ukraine,1993-08-27,66,,,,,,112.5,-117.5,-117.5,,112.5,,,,,,112.5,3
Amateur Open,Raw,B,Yes,75,M,Adam Kawka,Poland,1997-06-19,74.25,,,,,,165,172.5,177.5,-180,177.5,,,,,,177.5,1
Amateur Open,Raw,B,Yes,75,M,Artyom Soloyan,Armenia,1986-10-12,74.4,,,,,,140,150,160,,160,,,,,,160,3
Amateur Open,Raw,B,Yes,75,M,Wiesław Kiwacki,Poland,1976-11-11,73.55,,,,,,137.5,-147.5,-147.5,,137.5,,,,,,137.5,4
Amateur Open,Raw,B,Yes,82.5,M,Kirill Mikhniuk,Russia,1994-10-15,82.1,,,,,,165,-172.5,-172.5,,165,,,,,,165,4
Amateur Open,Raw,B,Yes,82.5,M,Damian Kasza,Poland,1993-05-19,77.1,,,,,,150,155,-157.5,,155,,,,,,155,6
Amateur Open,Raw,B,Yes,82.5,M,Michał Potocki,Poland,1993-04-26,82.25,,,,,,140,145,152.5,,152.5,,,,,,152.5,8
Amateur Open,Raw,B,Yes,90,M,Mateusz Rufkiewicz,Poland,1988-06-27,88.2,,,,,,175,-182.5,182.5,-190.5,182.5,,,,,,182.5,2
Amateur Open,Raw,B,Yes,90,M,Santo Lentini,Italy,1990-02-04,89.1,,,,,,155,-162.5,-162.5,,155,,,,,,155,4
Amateur Open,Raw,B,Yes,90,M,Yuriy Polishchuk #1,Ukraine,1992-08-13,88.8,,,,,,145,152.5,-157.5,,152.5,,,,,,152.5,6
Amateur Open,Raw,B,Yes,90,M,Mariusz Wlazło,Poland,1989-05-12,84.9,,,,,,130,135,-140,,135,,,,,,135,7
Amateur Open,Raw,B,Yes,100,M,Michał Kocknecht,Poland,1987-11-28,93.2,,,,,,177.5,185,-190,,185,,,,,,185,6
Amateur Open,Raw,B,Yes,100,M,Damian Kowalski,Poland,1994-02-04,98.3,,,,,,165,170,175,,175,,,,,,175,8
Amateur Open,Raw,B,Yes,100,M,Andrzej Banach,Poland,1992-04-07,95.2,,,,,,160,165,-172.5,,165,,,,,,165,9
Amateur Open,Raw,B,Yes,110,M,Krystian Liebrecht,Poland,1989-07-11,107.1,,,,,,185,192.5,-197.5,,192.5,,,,,,192.5,9
Amateur Open,Raw,B,Yes,110,M,Dawid Sęk,Poland,1994-11-05,105.3,,,,,,175,180,182.5,,182.5,,,,,,182.5,10
Amateur Open,Raw,B,Yes,125,M,Sergii Filonenko,Ukraine,1965-11-11,120.35,,,,,,190,-201,-201,,190,,,,,,190,6
Amateur Open,Raw,B,Yes,140+,M,Adam Nalewajk,Poland,1987-03-31,146,,,,,,100,-115,-115,,100,,,,,,100,4
Amateur Submasters 33-39,Raw,B,Yes,75,M,Artyom Soloyan,Armenia,1986-10-12,74.4,,,,,,140,150,160,,160,,,,,,160,1
Amateur Submasters 33-39,Raw,B,Yes,90,M,Michał Matczak,Poland,1984-06-17,86.1,,,,,,125,132.5,-135,,132.5,,,,,,132.5,5
Amateur Submasters 33-39,Raw,B,Yes,125,M,Łukasz Dalewski,Poland,1982-10-07,124.8,,,,,,180,190,-198,,190,,,,,,190,2
Amateur Masters 40-44,Raw,B,Yes,75,M,Wiesław Kiwacki,Poland,1976-11-11,73.55,,,,,,137.5,-147.5,-147.5,,137.5,,,,,,137.5,1
Amateur Masters 40-44,Raw,B,Yes,82.5,M,Łukasz Lisiecki,Poland,1977-11-11,80,,,,,,125,-130,-130,,125,,,,,,125,1
Amateur Masters 40-44,Raw,B,Yes,100,M,Andrzej Juraszek,Poland,1977-11-30,95.05,,,,,,160,165,167.5,,167.5,,,,,,167.5,3
Amateur Masters 40-44,Raw,B,Yes,140,M,Krzysztof Halczyk,Poland,1974-02-15,136.1,,,,,,175,180,182.5,,182.5,,,,,,182.5,4
Amateur Masters 45-49,Raw,B,Yes,82.5,M,Ireneusz Rosak,Poland,1970-05-02,78.35,,,,,,105,115,-120,,115,,,,,,115,1
Amateur Masters 45-49,Raw,B,Yes,90,M,Anatolii Gulita,Ukraine,1979-11-28,89.4,,,,,,145,-157.5,-157.5,,145,,,,,,145,3
Amateur Masters 45-49,Raw,B,Yes,90,M,Grzegorz Chałubiński,Poland,1972-09-06,90,,,,,,120,125,-127.5,,125,,,,,,125,4
Amateur Masters 45-49,Raw,B,Yes,90,M,Dariusz Zwoliński,Poland,1974-11-06,86.6,,,,,,122.5,-127.5,-127.5,,122.5,,,,,,122.5,5
Amateur Masters 45-49,Raw,B,Yes,140+,M,Grzegorz Kantor,Poland,1972-01-19,147.25,,,,,,185,190,-192.5,,190,,,,,,190,1
Amateur Masters 50-54,Raw,B,Yes,125,M,Sergii Filonenko,Ukraine,1965-11-11,120.35,,,,,,190,-201,-201,,190,,,,,,190,2
Amateur Masters 55-59,Raw,B,Yes,82.5,M,Ireneusz Czupryn,Poland,1955-10-01,82.45,,,,,,85,92.5,100,,100,,,,,,100,1
Amateur Masters 55-59,Raw,B,Yes,90,M,Zbigniew Cabaj,Poland,1955-04-10,88.7,,,,,,110,120,125,,125,,,,,,125,2
Amateur Masters 55-59,Raw,B,Yes,90,M,Zdisław Leśniewski,Poland,1959-06-14,84.65,,,,,,85,90,-95,,90,,,,,,90,3
Amateur Masters 65-69,Raw,B,Yes,82.5,M,Mieczysłąw Maczka,Germany,1954-09-11,82.3,,,,,,100,110,112.5,,112.5,,,,,,112.5,1
Amateur Masters 70-74,Raw,B,Yes,90,M,Stefan Sochaňski,Poland,1948-11-17,89.1,,,,,,85,-90,,,85,,,,,,85,2
Amateur Masters 75-79,Raw,B,Yes,82.5,M,Sylwester Kubacki,Poland,1944-09-14,81.25,,,,,,75,80,82.5,,82.5,,,,,,82.5,1
Amateur Military/Fire/Police,Raw,B,Yes,90,M,Oleksandr Ploskyy,Ukraine,1974-08-30,88.55,,,,,,140,145,-150,,145,,,,,,145,3
Amateur Military/Fire/Police,Raw,B,Yes,90,M,Michal Walczuk,Poland,1990-02-26,83.5,,,,,,-100,100,110,,110,,,,,,110,4
Amateur Paralympian,Raw,B,Yes,44,M,Hamlet Hovsepyan,Armenia,2007-10-04,35,,,,,,-20,20,25,,25,,,,,,25,1
Amateur Paralympian,Raw,B,Yes,60,M,Gevorg Afrikyan,Armenia,1999-05-30,59.5,,,,,,80,-87.5,-87.5,,80,,,,,,80,1
Amateur Teen 16-17,Raw,B,Yes,48,F,Wiktoria Lisiecka,Poland,2003-08-03,45.32,,,,,,47.5,50,52.5,,52.5,,,,,,52.5,1
Amateur Open,Raw,B,Yes,60,F,Oksana Zhogol,Ukraine,1995-04-29,58.3,,,,,,47.5,52.5,-57.5,,52.5,,,,,,52.5,2
Amateur Open,Raw,B,Yes,67.5,F,Joanna Nastaj-Leszczyńska,Poland,1987-07-30,67.5,,,,,,60,62.5,-67.5,,62.5,,,,,,62.5,1
Amateur Submasters 33-39,Raw,B,Yes,67.5,F,Monika Gryziecka,Poland,1981-04-30,65.75,,,,,,50,55,60,,60,,,,,,60,1
Amateur Masters 55-59,Raw,B,Yes,67.5,F,Brigitte Maczka,Germany,1961-10-05,67.45,,,,,,30,35,37.5,,37.5,,,,,,37.5,1
Amateur Open,Multi-ply,B,Yes,82.5,M,Marcin Musioł,Poland,1988-10-19,81.45,,,,,,-195,195,-200,,195,,,,,,195,3
Amateur Masters 65-69,Multi-ply,B,Yes,82.5,M,Mieczysłąw Maczka,Germany,1954-09-11,82.3,,,,,,100,110,112.5,,112.5,,,,,,112.5,1
Amateur Masters 70-74,Multi-ply,B,Yes,90,M,Stefan Sochaňski,Poland,1948-11-17,89.1,,,,,,95,105,,,105,,,,,,105,2
Amateur Masters 55-59,Multi-ply,B,Yes,67.5,M,Brigette Maczka,Germany,1961-10-05,67.45,,,,,,30,35,-40,,35,,,,,,35,1
Amateur Teen 16-17,Multi-ply,B,Yes,100,M,Remigiusz Zwoliński,Poland,2003-08-15,95.15,,,,,,115,125,-135,,125,,,,,,125,1
Amateur Open,Multi-ply,B,Yes,82.5,M,Damian Kasza,Poland,1993-05-19,77.1,,,,,,-160,160,180,,180,,,,,,180,4
Amateur Open,Multi-ply,B,Yes,110,M,Artem Garanzha,Ukraine,1986-08-05,108.6,,,,,,240,260,,,260,,,,,,260,1
Amateur Masters 40-44,Multi-ply,B,Yes,90,M,Dariusz Zwoliński,Poland,1974-11-06,86.6,,,,,,145,150,-155,,150,,,,,,150,1
Amateur Teen 13-15,Raw,D,Yes,52,M,Hrachya Abgaryan,Armenia,2004-02-14,52,,,,,,,,,,,120,140,-150,,140,140,1
Amateur Teen 13-15,Raw,D,Yes,56,M,Radosław Bober,Poland,2004-01-28,52.48,,,,,,,,,,,120,130,140,,140,140,1
Amateur Teen 13-15,Raw,D,Yes,75,M,Marcin Zwoliński,Poland,2005-01-22,71,,,,,,,,,,,100,110,120,,120,120,1
Amateur Teen 16-17,Raw,D,Yes,67.5,M,Erik Khachatryan,Armenia,2002-12-03,65.2,,,,,,,,,,,150,165,177.5,-197.5,177.5,177.5,1
Amateur Teen 16-17,Raw,D,Yes,67.5,M,Samvel Harutyunyan,Armenia,2003-01-12,63.65,,,,,,,,,,,150,160,-170,,160,160,2
Amateur Teen 16-17,Raw,D,Yes,75,M,Hamlet Tonoyan,Armenia,2003-10-27,70.5,,,,,,,,,,,160,-170,-170,,160,160,2
Amateur Teen 16-17,Raw,D,Yes,100,M,Remigiusz Zwoliński,Poland,2003-08-15,95.15,,,,,,,,,,,140,160,162.5,,162.5,162.5,1
Amateur Teen 18-19,Raw,D,Yes,75,M,Nikodem Labuda,Poland,2001-09-05,73.9,,,,,,,,,,,160,170,180,,180,180,2
Amateur Teen 18-19,Raw,D,Yes,100,M,Piotr Szymański,Poland,2001-05-07,93.85,,,,,,,,,,,120,125,130,,130,130,1
Amateur Juniors 20-23,Raw,D,Yes,82.5,M,Patryk Borzestowski,Poland,1997-08-24,81.1,,,,,,,,,,,-220,220,-230,,220,220,1
Amateur Open,Raw,D,Yes,67.5,M,Khachik Khachikyan,Armenia,1990-01-24,65.2,,,,,,,,,,,-150,-150,,,,,DQ
Amateur Open,Raw,D,Yes,82.5,M,Tomasz Miloch,Poland,1983-09-17,78.9,,,,,,,,,,,250,260,-265,,260,260,1
Amateur Open,Raw,D,Yes,82.5,M,Bartłomiej Szaflarski,Poland,1990-08-01,79.8,,,,,,,,,,,180,200,210,,210,210,2
Amateur Open,Raw,D,Yes,90,M,Stefano Nieddu,Italy,1992-12-29,88,,,,,,,,,,,260,280,-295,,280,280,1
Amateur Open,Raw,D,Yes,90,M,Mateusz Rufkiewicz,Poland,1988-06-27,88.2,,,,,,,,,,,245,260,-270,,260,260,4
Amateur Open,Raw,D,Yes,100,M,Karol Frąckowiak,Poland,1991-12-08,100,,,,,,,,,,,270,-285,-285,,270,270,1
Amateur Open,Raw,D,Yes,100,M,Robert Glinkowski,Poland,1992-11-07,94.65,,,,,,,,,,,210,220,-232.5,,220,220,3
Amateur Open,Raw,D,Yes,100,M,Michał Rudzki,Poland,1990-10-30,92.65,,,,,,,,,,,-205,205,210,,210,210,4
Amateur Open,Raw,D,Yes,110,M,Dariusz Kopczyński,Poland,1980-07-17,105.5,,,,,,,,,,,-240,-240,240,,240,240,3
Amateur Open,Raw,D,Yes,110,M,Konrad Czupryn,Poland,1989-03-15,100.35,,,,,,,,,,,230,-240,,,230,230,4
Amateur Open,Raw,D,Yes,110,M,Michał Szaszkowski,Poland,1988-09-11,101.4,,,,,,,,,,,185,205,210,,210,210,5
Amateur Submasters 33-39,Raw,D,Yes,125,M,Sławomir Milewski,Poland,1981-04-18,116.4,,,,,,,,,,,190,210,215,,215,215,1
Amateur Submasters 33-39,Raw,D,Yes,125,M,Zbigniew Tadeusiak,Poland,1982-12-22,122.45,,,,,,,,,,,190,200,-210,,200,200,2
Amateur Masters 45-49,Raw,D,Yes,82.5,M,Konrad Troll,Poland,1972-09-07,78.2,,,,,,,,,,,190,205,215,,215,215,1
Amateur Masters 45-49,Raw,D,Yes,90,M,Dariusz Zwoliński,Poland,1974-11-06,86.6,,,,,,,,,,,150,160,162.5,,162.5,162.5,1
Amateur Masters 50-54,Raw,D,Yes,110,M,Mariusz Rufkiewicz,Poland,1967-03-23,100.8,,,,,,,,,,,230,245,260,265,260,260,2
Amateur Masters 50-54,Raw,D,Yes,125,M,Gagik Saroyan,Armenia,1967-03-12,122.4,,,,,,,,,,,-100,,,,,,DQ
Amateur Masters 60-64,Raw,D,Yes,82.5,M,Ireneusz Czupryn,Poland,1955-10-01,82.45,,,,,,,,,,,170,180,190,,190,190,1
Amateur Masters 60-64,Raw,D,Yes,90,M,Zbigniew Cabaj,Poland,1955-04-10,88.7,,,,,,,,,,,180,190,200,,200,200,1
Amateur Masters 60-64,Raw,D,Yes,100,M,Marian Knuth,Poland,1958-01-25,98.55,,,,,,,,,,,220,230,235,,235,235,2
Amateur Masters 65-69,Raw,D,Yes,82.5,M,Mieczysłąw Maczka,Germany,1954-09-11,82.3,,,,,,,,,,,120,145,-157.5,,145,145,1
Amateur Masters 70-74,Raw,D,Yes,82.5,M,Jan Łuka,Poland,1949-06-07,82.1,,,,,,,,,,,200,,,,200,200,1
Amateur Masters 70-74,Raw,D,Yes,90,M,Stefan Sochaňski,Poland,1948-11-17,89.1,,,,,,,,,,,165,-182.5,,,165,165,1
Amateur Teen 18-19,Raw,D,Yes,60,F,Ela Kardaś,Poland,1999-12-16,58.48,,,,,,,,,,,120,130,-140,,130,130,1
Amateur Open,Raw,D,Yes,52,F,Klaudia Arendt-Woźniak,Poland,1991-06-21,51.4,,,,,,,,,,,85,95,100,,100,100,1
Amateur Open,Raw,D,Yes,67.5,F,Joanna Nastaj-Leszczyńska,Poland,1987-07-30,67.5,,,,,,,,,,,160,165,-167.5,,165,165,1
Amateur Masters 45-49,Raw,D,Yes,67.5,F,Beata Kowalska,Poland,1973-08-28,67.1,,,,,,,,,,,147.5,157.5,162.5,,162.5,162.5,1
Amateur Masters 55-59,Raw,D,Yes,67.5,F,Brigitte Maczka,Germany,1961-10-05,67.45,,,,,,,,,,,-80,90,100,,100,100,1
Amateur Open,Multi-ply,D,Yes,100,M,Michał Wojczuk,Poland,1991-11-28,99.2,,,,,,,,,,,210,-230,230,,230,230,1
Amateur Masters 65-69,Multi-ply,D,Yes,82.5,M,Mieczysłąw Maczka,Germany,1954-09-11,82.3,,,,,,,,,,,120,145,-157.5,,145,145,1
Amateur Masters 70-74,Multi-ply,D,Yes,90,M,Stefan Sochaňski,Poland,1948-11-17,89.1,,,,,,,,,,,170,,,,170,170,1
Amateur Masters 55-59,Multi-ply,D,Yes,67.5,M,Brigette Maczka,Germany,1961-10-05,67.45,,,,,,,,,,,-80,90,100,,100,100,1
Pro Teen 18-19,Wraps,SBD,No,82.5,M,Wiktor Urbanowski,Poland,2000-09-10,81.45,180,190,200,,200,110,-120,-120,,110,150,160,175,,175,485,1
Pro Teen 18-19,Wraps,SBD,No,90,M,Grzegorz Kietura,Poland,2001-07-13,89.85,210,220,230,,230,120,127.5,-135,,127.5,245,257.5,-265,,257.5,615,1
Pro Teen 18-19,Wraps,SBD,No,100,M,Arkadiusz Bzdak,Poland,2001-02-11,99.45,225,237.5,,,237.5,145,150,155,,155,235,242.5,247.5,,247.5,640,2
Pro Teen 18-19,Wraps,SBD,No,110,M,Marcin Mychałyk,Poland,2001-07-13,109,230,250,260,,260,150,160,175,,175,230,250,270,,270,705,1
Pro Teen 18-19,Wraps,SBD,No,110,M,Martin Opaliński,Poland,1999-11-28,101,250,-265,-270,,250,160,-170,-170,,160,245,255,-260,,255,665,2
Pro Juniors 20-23,Wraps,SBD,No,75,M,Bartłomiej Woryński,Poland,1997-01-13,73.6,180,-190,-200,,180,87.5,95,-100,,95,195,210,220,,220,495,1
Pro Juniors 20-23,Wraps,SBD,No,82.5,M,Adam Kaluzny,Poland,1997-01-31,80.95,200,215,-225,,215,125,130,-135,,130,100,,,,100,445,2
Pro Juniors 20-23,Wraps,SBD,No,90,M,Konrad Blewązka,Poland,1998-01-01,90,300,-310,310,,310,175,-180,185,,185,295,-305,-305,,295,790,1
Pro Juniors 20-23,Wraps,SBD,No,90,M,Konrad Misieczko,Poland,1996-07-14,89.1,220,235,250,,250,135,-145,150,,150,210,225,232.5,,232.5,632.5,2
Pro Juniors 20-23,Wraps,SBD,No,100,M,Jakub Sędzik,Poland,1996-08-09,98.2,260,-275,-280,,260,147.5,155,-160,,155,280,300,310,,310,725,1
Pro Juniors 20-23,Wraps,SBD,No,100,M,Piotr Zawisza,Poland,1997-07-19,92.6,225,232.5,-240,,232.5,125,-132.5,-132.5,,125,245,-257.5,-260,,245,602.5,2
Pro Juniors 20-23,Wraps,SBD,No,110,M,Dawid Dychowski,Poland,1998-02-05,109,220,-230,230,,230,-180,-180,-180,,,,,,,,,DQ
Pro Juniors 20-23,Wraps,SBD,No,140,M,Krystian Ludkowski,Poland,1998-10-21,126,-270,-280,-290,,,,,,,,,,,,,,DQ
Pro Juniors 20-23,Wraps,SBD,No,140+,M,Zurab Shengelia,Georgia,1999-01-01,149,220,250,-275,,250,130,140,150,,150,-270,280,-310,,280,680,1
Pro Open,Wraps,SBD,No,67.5,M,Andrii Antonov,Ukraine,1993-10-27,67.5,175,185,-195,,185,125,135,-140.5,,135,160,170,-180,,170,490,1
Pro Open,Wraps,SBD,No,75,M,Ruslan Ruban,Ukraine,1990-07-09,74.65,235,250,262.5,,262.5,165,175,-185.5,,175,245,260,275,,275,712.5,1
Pro Open,Wraps,SBD,No,75,M,Mateusz Kaczmarek,Poland,1993-05-16,74.2,170,185,195,,195,125,132.5,137.5,,137.5,180,-200,200,,200,532.5,2
Pro Open,Wraps,SBD,No,75,M,Bartłomiej Woryński,Poland,1997-01-13,73.6,180,-190,-200,,180,87.5,95,-100,,95,195,210,220,,220,495,3
Pro Open,Wraps,SBD,No,82.5,M,Piotr Mertens,Poland,1988-11-12,82.5,205,230,-250,,230,145,-160,160,,160,210,230,-242.5,,230,620,1
Pro Open,Wraps,SBD,No,90,M,Yaroslav Lytvynenko,Ukraine,1976-11-10,88,-240,240,-250,,240,140,152.5,-160,,152.5,250,265,275,,275,667.5,1
Pro Open,Wraps,SBD,No,90,M,Ilia Tabachnyi,Poland,1992-06-24,89.1,270,-285,-300,,270,130,137.5,142.5,,142.5,230,-240,240,,240,652.5,2
Pro Open,Wraps,SBD,No,90,M,Mateusz Piórkowski,Poland,1991-04-18,88.4,220,235,-250,,235,150,160,165,,165,245,-260,-260,,245,645,3
Pro Open,Wraps,SBD,No,90,M,Kacper Uszakiewicz,Poland,1988-05-17,89.9,-215,-225,225,,225,130,135,-140,,135,265,-275,-275,,265,625,4
Pro Open,Wraps,SBD,No,90,M,Igor Bańdura,Poland,1992-03-20,88.3,180,200,-220,,200,120,125,-127.5,,125,220,230,-235,,230,555,5
Pro Open,Wraps,SBD,No,100,M,János Fazekas,Hungary,1987-09-16,99.7,-330,330,-353,,330,200,205.5,210,-212.5,210,302.5,310,-318,,310,850,1
Pro Open,Wraps,SBD,No,100,M,Bartosz Zaik,Poland,1985-06-26,98.75,-310,310,-325,,310,170,175,180,,180,300,310,-320,,310,800,2
Pro Open,Wraps,SBD,No,100,M,Tomasz Domański,Poland,1993-03-27,96.2,275,-295,295,,295,180,190,-195,,190,285,300,-315,,300,785,3
Pro Open,Wraps,SBD,No,100,M,Damian Pawelak,Poland,1993-02-13,98.7,270,-285,-285,,270,165,-172.5,-172.5,,165,250,265,275,,275,710,4
Pro Open,Wraps,SBD,No,100,M,Michał Maciak,Poland,1992-03-01,94.7,220,240,250,,250,140,145,-150,,145,260,280,-290,,280,675,5
Pro Open,Wraps,SBD,No,100,M,Tomasz Straszewski,Poland,1988-05-15,98.35,220,235,245,,245,-170,-175,175,,175,230,250,-280,,250,670,6
Pro Open,Wraps,SBD,No,100,M,Konrad Szczerbiński,Poland,1995-01-15,92,230,240,-250,,240,130,-137.5,140,,140,245,257.5,262.5,,262.5,642.5,7
Pro Open,Wraps,SBD,No,100,M,Arkadiusz Bzdak,Poland,2001-02-11,99.45,225,237.5,,,237.5,145,150,155,,155,235,242.5,247.5,,247.5,640,8
Pro Open,Wraps,SBD,No,100,M,Radosław Piątkowski,Poland,1991-09-06,93.6,220,235,-250,,235,120,130,-135,,130,240,250,260,,260,625,9
Pro Open,Wraps,SBD,No,100,M,Bartosz Kostuj,Poland,1993-08-28,95.75,-200,200,210,,210,-120,125,130,,130,220,-242.5,242.5,,242.5,582.5,10
Pro Open,Wraps,SBD,No,100,M,Jakub Bisior,Poland,1995-08-28,95.6,215,230,240,,240,117.5,125,-130,,125,205,215,-220,,215,580,11
Pro Open,Wraps,SBD,No,100,M,Jakub Palenik,Poland,1985-03-31,93.95,215,-225,-225,,215,-130,137.5,-145,,137.5,180,195,215,,215,567.5,12
Pro Open,Wraps,SBD,No,100,M,Jan Pyska,Poland,1995-01-22,97.4,190,205,-215,,205,120,127.5,-132.5,,127.5,185,-195,-195,,185,517.5,13
Pro Open,Wraps,SBD,No,100,M,Oskar Bar,Poland,1994-10-02,98.8,-305,-315,-315,,,,,,,,,,,,,,DQ
Pro Open,Wraps,SBD,No,110,M,Oleksandr Burda,Ukraine,1988-08-17,108.8,300,310,-320,,310,190,200,-210,,200,300,315,325,,325,835,1
Pro Open,Wraps,SBD,No,110,M,Artur Lisowski,Poland,1994-07-28,104.1,270,-285,285,,285,165,175,-182.5,,175,260,270,280,,280,740,2
Pro Open,Wraps,SBD,No,110,M,Grzegorz Wałga,Poland,1987-08-03,108.1,250,260,272.5,,272.5,160,175,-185,,175,250,265,275,,275,722.5,3
Pro Open,Wraps,SBD,No,110,M,Jakub Susek,Poland,1995-08-28,108.4,-255,-260,-260,,,,,,,,,,,,,,DQ
Pro Open,Wraps,SBD,No,110,M,Michał Lebioda,Poland,1989-12-19,110,265,-285,-290,,265,155,-162.5,-162.5,,155,-260,,,,,,DQ
Pro Open,Wraps,SBD,No,125,M,Bernard Arendt,Poland,1985-01-10,115.6,-300,-300,300,,300,220,230,-237.5,,230,310,-325,-325,,310,840,1
Pro Open,Wraps,SBD,No,125,M,Łukasz Lipka,Poland,1992-09-24,120,310,330,-342.5,,330,170,180,-185,,180,300,310,320,,320,830,2
Pro Open,Wraps,SBD,No,125,M,Adam Kijak,Poland,1995-04-01,116.3,325,340,350,,350,165,172.5,180,,180,270,282.5,-290,,282.5,812.5,3
Pro Open,Wraps,SBD,No,125,M,Marek Gortad,Poland,1995-05-24,122.3,-305,305,-320,,305,180,187.5,-192.5,,187.5,275,-290,-290,,275,767.5,4
Pro Open,Wraps,SBD,No,140,M,Kamil Nojek,Poland,1988-03-29,135,360,-380,-380,,360,210,220,-230,,220,310,330,345,,345,925,1
Pro Open,Wraps,SBD,No,140,M,Daniel Spodzieja,Poland,1995-03-19,127.5,260,280,-290,,280,170,177.5,-185,,177.5,290,305,-315,,305,762.5,2
Pro Open,Wraps,SBD,No,140,M,Dawid Wiesniewski,Poland,1995-09-17,131.7,280,-300,300,,300,150,160,-170,,160,280,300,-320,,300,760,3
Pro Submasters 33-39,Wraps,SBD,No,67.5,M,Rafał Grzesiuk,Poland,1986-06-08,67.2,180,192.5,200,,200,100,107.5,-112.5,,107.5,170,180,192.5,,192.5,500,1
Pro Submasters 33-39,Wraps,SBD,No,75,M,Paweł Grab,Poland,1983-11-06,74.05,175,185,-197.5,,185,145,-152.5,-152.5,,145,-225,-225,-225,,,,DQ
Pro Submasters 33-39,Wraps,SBD,No,82.5,M,Ara Khachatryan,Armenia,1982-03-13,82.3,220,230,237.5,,237.5,115,120,125,,125,-220,220,240,,240,602.5,1
Pro Submasters 33-39,Wraps,SBD,No,82.5,M,Krzysztof Rumel,Poland,1983-09-26,81.8,-235,-240,-240,,,,,,,,,,,,,,DQ
Pro Submasters 33-39,Wraps,SBD,No,90,M,Byuzand Baghdasaryan,Armenia,1985-05-19,84.85,180,190,,,190,130,-140,-140,,130,180,190,200,,200,520,1
Pro Submasters 33-39,Wraps,SBD,No,100,M,Bartosz Zaik,Poland,1985-06-26,98.75,-310,310,-325,,310,170,175,180,,180,300,310,-320,,310,800,1
Pro Submasters 33-39,Wraps,SBD,No,100,M,Piotr Gawle,Poland,1982-10-05,97.3,230,-240,250,,250,130,140,-150,,140,220,235,-250,,235,625,2
Pro Submasters 33-39,Wraps,SBD,No,125,M,Kamil Kargul,Poland,1985-10-26,115.3,225,240,255,,255,160,170,180,,180,260,275,-290,,275,710,2
Pro Masters 40-44,Wraps,SBD,No,90,M,Yaroslav Lytvynenko,Ukraine,1976-11-10,88,-240,240,-250,,240,140,152.5,-160,,152.5,250,265,275,,275,667.5,1
Pro Masters 40-44,Wraps,SBD,No,100,M,Seweryn Kononiuk,Poland,1977-11-21,96.65,200,210,220,,220,150,160,-165,,160,210,230,-235,,230,610,1
Pro Military/Fire/Police,Wraps,SBD,No,125,M,Ilia Kochiashvili,Georgia,1991-11-01,113.7,-200,200,-230,,200,170,177.5,185,190,185,270,285,-300,,285,670,1
Pro Juniors 20-23,Wraps,SBD,No,56,F,Aleksandra Szymczykowska,Poland,1998-04-17,55.4,-120,120,125,,125,85,87.5,90,-91,90,135,137.5,-140,,137.5,352.5,1
Pro Juniors 20-23,Wraps,SBD,No,67.5,F,Paulina Randzio,Poland,1998-06-13,64.15,-107.5,107.5,112.5,,112.5,52.5,55,-60,,55,127.5,-132.5,-132.5,,127.5,295,1
Pro Juniors 20-23,Wraps,SBD,No,75,F,Izabela Janiak,Poland,1998-03-03,68.25,110,120,125,,125,52.5,-57.5,-57.5,,52.5,120,130,135,,135,312.5,1
Pro Open,Wraps,SBD,No,56,F,Joanna Dróždž,Poland,1990-10-31,54.1,130,135,140,,140,70,-75,-75,,70,130,137.5,142.5,,142.5,352.5,1
Pro Open,Wraps,SBD,No,60,F,Julia Baranowska,Poland,1995-10-27,58.76,105,110,-120,,110,47.5,50,-52.5,,50,100,107.5,115,,115,275,1
Pro Open,Wraps,SBD,No,60,F,Hayapri Vardanyan,Armenia,1989-02-27,60,80,90,-97.5,,90,40,47.5,-50,,47.5,95,102.5,-110,,102.5,240,2
Pro Open,Wraps,SBD,No,67.5,F,Daria Telus,Poland,1988-09-13,66,155,165,-175,,165,62.5,65,67.5,,67.5,155,165,170,,170,402.5,1
Pro Open,Wraps,SBD,No,67.5,F,Klaudia Łącz,Poland,1995-05-26,65.4,135,-147.5,155,,155,65,-70,70,,70,135,145,-150,,145,370,2
Pro Open,Wraps,SBD,No,75,F,Nataliya Mavdrik,Ukraine,1984-05-14,73.5,200,215,220,,220,115,120,125,,125,190,210,220,,220,565,1
Pro Submasters 33-39,Wraps,SBD,No,56,F,Daria Walczykiewicz,Poland,1982-09-06,55.4,100,107.5,112.5,,112.5,70,75,-77.5,,75,112.5,120,-125,,120,307.5,1
Pro Military/Fire/Police,Wraps,SBD,No,67.5,F,Klaudia Łącz,Poland,1995-05-26,65.4,135,-147.5,155,,155,65,-70,70,,70,135,145,-150,,145,370,1
Pro Masters 55-59,Multi-ply,SBD,No,125,M,Eduard Davtyan,Armenia,1963-12-27,117,182.5,-200,-200,,182.5,-130,130,,,130,-190,195,,,195,507.5,1
Pro Open,Raw,BD,No,110,M,Artyom Khugoyan,Armenia,1989-09-10,105.8,,,,,,190,195,202.5,,202.5,290,302.5,310,,310,512.5,1
Pro Masters 40-44,Raw,BD,No,90,M,Yaroslav Lytvynenko,Ukraine,1976-11-10,88,,,,,,140,152.5,-160,,152.5,250,265,275,,275,427.5,1
Pro Masters 40-44,Raw,BD,No,140,M,Ireneusz Alertowicz,Poland,1974-12-20,137.5,,,,,,195,-205,-205,,195,235,250,-260,,250,445,1
Pro Masters 65-69,Raw,BD,No,75,M,Zbigniew Koper,Poland,1953-10-04,74.95,,,,,,90,95,100,,100,150,160,165,,165,265,1
Pro Military/Fire/Police,Raw,BD,No,125,M,Shalva Bebiashvili,Georgia,1987-01-05,122.5,,,,,,180,190,-200,,190,260,-270,-270,,260,450,1
Pro Masters 50-54,Raw,BD,No,100,F,Krystyna Puzio,Poland,1965-04-23,97.7,,,,,,65,70,75,,75,160,170,-180,,170,245,1
Pro Teen 16-17,Raw,B,No,48,F,Magdalena Szpila,Poland,2002-03-06,46.54,,,,,,-105,-105,-105,,,,,,,,,DQ
Pro Teen 18-19,Raw,B,No,56,F,Marta Sak,Poland,2001-05-11,54.64,,,,,,40,47.5,50,,50,,,,,,50,1
Pro Teen 18-19,Raw,B,No,60,F,Martyna Mojsa,Poland,2001-10-16,59.2,,,,,,57.5,60,62.5,,62.5,,,,,,62.5,1
Pro Teen 18-19,Raw,B,No,67.5,F,Weronika Lenort,Poland,2000-02-17,61.15,,,,,,-72.5,-72.5,-72.5,,,,,,,,,DQ
Pro Juniors 20-23,Raw,B,No,56,F,Aleksandra Szymczykowska,Poland,1998-04-17,55.4,,,,,,85,87.5,90,-91,90,,,,,,90,1
Pro Juniors 20-23,Raw,B,No,67.5,F,Marta Zawadzka,Poland,1996-06-16,64.95,,,,,,92.5,102.5,-105,,102.5,,,,,,102.5,1
Pro Open,Raw,B,No,60,F,Małgorzata Hałas-Koralewska,Poland,1987-06-10,57.88,,,,,,135,140,145,,145,,,,,,145,1
Pro Open,Raw,B,No,75,F,Nataliya Mavdrik,Ukraine,1984-05-14,73.5,,,,,,115,120,125,,125,,,,,,125,1
Pro Open,Raw,B,No,75,F,Marta Chachuła,Poland,1987-12-07,67.7,,,,,,100,105,107.5,,107.5,,,,,,107.5,2
Pro Masters 50-54,Raw,B,No,56,F,Bettina Razzouki-Korkis,Poland,1965-08-28,55.4,,,,,,55,60,68,70,68,,,,,,68,1
Pro Masters 50-54,Raw,B,No,67.5,F,Jolanta Anasiewicz-Popowicz,Poland,1969-04-11,62,,,,,,105,-110,-110,,105,,,,,,105,1
Pro Teen 13-15,Raw,B,No,60,M,Oleg Mykhalskyy,Ukraine,2004-04-06,56.6,,,,,,75,80,-82.5,,80,,,,,,80,1
Pro Teen 16-17,Raw,B,No,67.5,M,Kuba Licznar,Poland,2003-10-15,64.5,,,,,,105,110,115,,115,,,,,,115,2
Pro Teen 16-17,Raw,B,No,82.5,M,Yurii Nych,Ukraine,2003-04-19,79.4,,,,,,122.5,127.5,-130,,127.5,,,,,,127.5,1
Pro Teen 16-17,Raw,B,No,82.5,M,Dawid Meyer,Poland,2003-05-12,82.1,,,,,,-120,120,-130,,120,,,,,,120,2
Pro Teen 16-17,Raw,B,No,82.5,M,Wojtek Witkowski,Poland,2003-05-03,82.5,,,,,,110,115,-120,,115,,,,,,115,3
Pro Teen 16-17,Raw,B,No,90,M,Wojciech Jabłoński,Poland,2003-04-23,86.45,,,,,,115,125,130,,130,,,,,,130,1
Pro Teen 16-17,Raw,B,No,90,M,Krystian Krzywak,Poland,2003-12-30,90,,,,,,115,125,-130,,125,,,,,,125,2
Pro Teen 16-17,Raw,B,No,100,M,Kacper Inglot,Poland,2002-06-12,95.95,,,,,,-90,95,-97.5,,95,,,,,,95,2
Pro Teen 18-19,Raw,B,No,67.5,M,Damian Mendlewski,Poland,2001-01-12,65.05,,,,,,110,115,-120,,115,,,,,,115,1
Pro Teen 18-19,Raw,B,No,67.5,M,Krystian Tuzikowski,Poland,2001-06-19,66.1,,,,,,100,105,-107.5,,105,,,,,,105,2
Pro Teen 18-19,Raw,B,No,90,M,Dominik Wasilkiewicz,Poland,2000-07-29,84.45,,,,,,97.5,-102.5,-102.5,,97.5,,,,,,97.5,3
Pro Teen 18-19,Raw,B,No,140,M,Jakub Elgert,Poland,2000-08-21,126.75,,,,,,-207.5,207.5,-212.5,,207.5,,,,,,207.5,1
Pro Juniors 20-23,Raw,B,No,82.5,M,Viktor Reshenin,Ukraine,1996-04-03,78.85,,,,,,175,185,-192.5,,185,,,,,,185,1
Pro Juniors 20-23,Raw,B,No,100,M,Tomasz Benisz,Poland,1996-11-27,99.15,,,,,,175,182.5,-187.5,,182.5,,,,,,182.5,1
Pro Juniors 20-23,Raw,B,No,100,M,Hubert Kaźmierczak,Poland,1996-07-25,94.95,,,,,,135,145,150,,150,,,,,,150,3
Pro Juniors 20-23,Raw,B,No,110,M,Seweryn Praszkowski,Poland,1997-06-07,103.8,,,,,,190,200,-205,,200,,,,,,200,1
Pro Juniors 20-23,Raw,B,No,110,M,Kamil Kowalski,Poland,1998-09-01,108.55,,,,,,185,-190,-190,,185,,,,,,185,3
Pro Juniors 20-23,Raw,B,No,125,M,Mikheili Buchukuri,Georgia,1996-10-20,111.5,,,,,,160,170,-177.5,,170,,,,,,170,1
Pro Juniors 20-23,Raw,B,No,140,M,Grzegorz Jonak,Poland,1996-04-11,128.2,,,,,,160,170,175,,175,,,,,,175,1
Pro Open,Raw,B,No,67.5,M,Piotr Jęsiak,Poland,1993-07-13,60.7,,,,,,130,135,137.5,,137.5,,,,,,137.5,1
Pro Open,Raw,B,No,67.5,M,Michał Zębrowski,Poland,1991-02-12,62.95,,,,,,115,120,125,,125,,,,,,125,2
Pro Open,Raw,B,No,67.5,M,Tomasz Pierunek,Poland,1988-12-29,67.35,,,,,,-115,-122.5,-122.5,,,,,,,,,DQ
Pro Open,Raw,B,No,75,M,Sergii Melnyk,Ukraine,1982-02-10,74.65,,,,,,-167.5,167.5,-175,,167.5,,,,,,167.5,2
Pro Open,Raw,B,No,82.5,M,Viktor Reshenin,Ukraine,1996-04-03,78.85,,,,,,175,185,-192.5,,185,,,,,,185,1
Pro Open,Raw,B,No,82.5,M,Viktor Blakytnyy,Ukraine,1981-04-26,80.8,,,,,,165,172.5,-180,,172.5,,,,,,172.5,2
Pro Open,Raw,B,No,82.5,M,Łukasz Żulczyk,Poland,1987-02-24,81.1,,,,,,160,165,-170,,165,,,,,,165,3
Pro Open,Raw,B,No,82.5,M,Łukasz Brzeźiński,Poland,1989-05-14,80.65,,,,,,155,160,-167.5,,160,,,,,,160,5
Pro Open,Raw,B,No,82.5,M,Dmitrii Kukharenko,Spain,1969-01-22,80.25,,,,,,140,155,-170,,155,,,,,,155,7
Pro Open,Raw,B,No,82.5,M,Kamil Kuś,Poland,1990-04-02,81.35,,,,,,140,147.5,-152.5,,147.5,,,,,,147.5,9
Pro Open,Raw,B,No,90,M,Artur Miksa,Poland,1983-09-26,87,,,,,,220,227.5,-230,,227.5,,,,,,227.5,1
Pro Open,Raw,B,No,90,M,Patryk Kaczmarek,Poland,1995-04-23,89.9,,,,,,175,-182.5,-182.5,,175,,,,,,175,3
Pro Open,Raw,B,No,90,M,Michał Matynia,Poland,1987-07-14,89.95,,,,,,-155,155,-165,,155,,,,,,155,5
Pro Open,Raw,B,No,100,M,Mariusz Borczyk,Poland,1989-03-05,99.3,,,,,,227.5,235,237.5,,237.5,,,,,,237.5,1
Pro Open,Raw,B,No,100,M,Piotr Balcerek,Poland,1979-04-14,99.15,,,,,,225,230,235.5,240,235.5,,,,,,235.5,2
Pro Open,Raw,B,No,100,M,Jarosław Buczko,Poland,1992-04-24,97.65,,,,,,225,232.5,-235,,232.5,,,,,,232.5,3
Pro Open,Raw,B,No,100,M,Hovhannes Yazichyan,Armenia,1971-05-08,93.2,,,,,,190,200,205,,205,,,,,,205,4
Pro Open,Raw,B,No,100,M,Volodymyr Galyga,Ukraine,1983-08-12,98.35,,,,,,200,205,-207.5,,205,,,,,,205,5
Pro Open,Raw,B,No,100,M,Mateusz Garbowski,Poland,1993-05-07,96.35,,,,,,170,180,185,,185,,,,,,185,7
Pro Open,Raw,B,No,100,M,Hubert Kaźmierczak,Poland,1996-07-25,94.95,,,,,,135,145,150,,150,,,,,,150,10
Pro Open,Raw,B,No,110,M,Zdislaw Sadowski,Netherlands,1989-05-10,109.95,,,,,,230,-240,240,,240,,,,,,240,1
Pro Open,Raw,B,No,110,M,Adrian Grabski,Poland,1982-09-12,110,,,,,,220,227.5,232.5,,232.5,,,,,,232.5,2
Pro Open,Raw,B,No,110,M,Marcin Gołębiewski,Poland,1991-09-03,102.55,,,,,,215,225,-230,,225,,,,,,225,3
Pro Open,Raw,B,No,110,M,Arkadiusz Redzynia,Poland,1993-01-14,106.05,,,,,,200,210,215,,215,,,,,,215,4
Pro Open,Raw,B,No,110,M,Oleg Palamarchuk,Ukraine,1972-11-23,108.5,,,,,,200,207.5,-210,,207.5,,,,,,207.5,5
Pro Open,Raw,B,No,110,M,Oleksandr Karnaukh,Ukraine,1980-08-15,106.9,,,,,,197.5,202.5,-205,,202.5,,,,,,202.5,6
Pro Open,Raw,B,No,110,M,Rafał Michalski,Poland,1993-03-31,104.55,,,,,,195,-202.5,-202.5,,195,,,,,,195,7
Pro Open,Raw,B,No,110,M,Alan Kulak,Poland,1994-06-10,107.7,,,,,,190,195,-200,,195,,,,,,195,8
Pro Open,Raw,B,No,125,M,Arkadiusz Herodowicz,Poland,1982-10-07,121.5,,,,,,240,247.5,252.5,256,252.5,,,,,,252.5,1
Pro Open,Raw,B,No,125,M,Bernard Arendt,Poland,1985-01-10,115.6,,,,,,220,230,-237.5,,230,,,,,,230,2
Pro Open,Raw,B,No,125,M,Rafał Pałubicki,Poland,1976-10-04,120.8,,,,,,225,230,-236,,230,,,,,,230,3
Pro Open,Raw,B,No,125,M,Robert Dudek,Poland,1987-03-17,114.8,,,,,,210,220,-225,,220,,,,,,220,4
Pro Open,Raw,B,No,125,M,Kamil Bałdyga,Poland,1988-10-16,112.55,,,,,,200,205,-207.5,,205,,,,,,205,5
Pro Open,Raw,B,No,140,M,Konrad Fornalczyk,Poland,1985-12-18,131.25,,,,,,225,230,-235,,230,,,,,,230,1
Pro Open,Raw,B,No,140,M,Krzysztof Cieślak,Poland,1984-11-09,132.85,,,,,,210,-220,220,,220,,,,,,220,2
Pro Open,Raw,B,No,140+,M,Dawid Elgert,Poland,1988-12-25,155,,,,,,260,-270,-270,,260,,,,,,260,1
Pro Open,Raw,B,No,140+,M,Bartłomiej Jaruga,Poland,1986-11-02,146.8,,,,,,235,245,-250,,245,,,,,,245,2
Pro Open,Raw,B,No,140+,M,Arkadiusz Duranowski,Poland,1982-11-06,150.45,,,,,,150,175,200,,200,,,,,,200,3
Pro Submasters 33-39,Raw,B,No,67.5,M,Damian Matusiak,Poland,1983-06-17,66.9,,,,,,115,120,122.5,,122.5,,,,,,122.5,1
Pro Submasters 33-39,Raw,B,No,75,M,Łukasz Kozłowski,Poland,1982-12-10,74.65,,,,,,140,145,-150,,145,,,,,,145,2
Pro Submasters 33-39,Raw,B,No,82.5,M,Viktor Blakytnyy,Ukraine,1981-04-26,80.8,,,,,,165,172.5,-180,,172.5,,,,,,172.5,1
Pro Submasters 33-39,Raw,B,No,90,M,Artur Miksa,Poland,1983-09-26,87,,,,,,220,227.5,-230,,227.5,,,,,,227.5,1
Pro Submasters 33-39,Raw,B,No,90,M,Szymon Zmora,Poland,1986-06-27,88.3,,,,,,177.5,185,190,,190,,,,,,190,2
Pro Submasters 33-39,Raw,B,No,90,M,Piotr Jezierski,Poland,1984-08-19,89.45,,,,,,180,190,-195,,190,,,,,,190,3
Pro Submasters 33-39,Raw,B,No,90,M,Marcin Pujan,Poland,1980-11-10,89.15,,,,,,155,160,162.5,,162.5,,,,,,162.5,4
Pro Submasters 33-39,Raw,B,No,100,M,Robert Wrzawiński,Poland,1982-12-17,95.6,,,,,,217.5,225,228,-230,228,,,,,,228,1
Pro Submasters 33-39,Raw,B,No,100,M,Volodymyr Galyga,Ukraine,1983-08-12,98.35,,,,,,200,205,-207.5,,205,,,,,,205,2
Pro Submasters 33-39,Raw,B,No,100,M,Tomasz Trzciński,Poland,1982-09-17,98.65,,,,,,195,-205,205,,205,,,,,,205,3
Pro Submasters 33-39,Raw,B,No,100,M,Arkadiusz Macudziński,Poland,1980-08-19,96.3,,,,,,170,177.5,-182.5,,177.5,,,,,,177.5,4
Pro Submasters 33-39,Raw,B,No,110,M,Przemysław Dobrowolski,Poland,1986-08-31,104.5,,,,,,200,205,-212.5,,205,,,,,,205,1
Pro Submasters 33-39,Raw,B,No,110,M,Dawid Górzyński,Poland,1986-11-13,109.35,,,,,,-205,-205,-205,,,,,,,,,DQ
Pro Submasters 33-39,Raw,B,No,125,M,Arkadiusz Herodowicz,Poland,1982-10-07,121.5,,,,,,240,247.5,252.5,256,252.5,,,,,,252.5,1
Pro Submasters 33-39,Raw,B,No,140,M,Krzysztof Cieślak,Poland,1984-11-09,132.85,,,,,,210,-220,220,,220,,,,,,220,1
Pro Submasters 33-39,Raw,B,No,140+,M,Bartłomiej Jaruga,Poland,1986-11-02,146.8,,,,,,235,245,-250,,245,,,,,,245,1
Pro Submasters 33-39,Raw,B,No,140+,M,Arkadiusz Duranowski,Poland,1982-11-06,150.45,,,,,,150,175,200,,200,,,,,,200,2
Pro Masters 40-44,Raw,B,No,67.5,M,Bartosz Słodek,Poland,1977-09-07,67.15,,,,,,122.5,132.5,-135,,132.5,,,,,,132.5,1
Pro Masters 40-44,Raw,B,No,100,M,Piotr Balcerek,Poland,1979-04-14,99.15,,,,,,225,230,235.5,240,235.5,,,,,,235.5,1
Pro Masters 40-44,Raw,B,No,100,M,Andrii Petruk,Ukraine,1975-01-15,96.3,,,,,,-190,200,202.5,,202.5,,,,,,202.5,2
Pro Masters 40-44,Raw,B,No,110,M,Krzysztof Zakrzewski,Poland,1977-12-09,108.35,,,,,,200,207.5,-212.5,,207.5,,,,,,207.5,1
Pro Masters 40-44,Raw,B,No,110,M,Wojciech Meyer,Poland,1977-09-25,109.55,,,,,,190,195,200,,200,,,,,,200,2
Pro Masters 40-44,Raw,B,No,110,M,Koba Kobakhidze,Georgia,1975-05-21,107.3,,,,,,180,190,-197.5,,190,,,,,,190,3
Pro Masters 40-44,Raw,B,No,125,M,Rafał Pałubicki,Poland,1976-10-04,120.8,,,,,,225,230,-236,,230,,,,,,230,1
Pro Masters 40-44,Raw,B,No,140,M,Maciej Knap,Poland,1975-07-06,135.25,,,,,,215,230,-240,,230,,,,,,230,1
Pro Masters 40-44,Raw,B,No,140,M,Robert Drozdowski,Poland,1979-04-02,125.25,,,,,,210,215,217.5,,217.5,,,,,,217.5,2
Pro Masters 40-44,Raw,B,No,140,M,Ireneusz Aletorowicz,Poland,1974-12-20,137.5,,,,,,195,200,-205,,200,,,,,,200,3
Pro Masters 40-44,Raw,B,No,140,M,Damian Dobner,Norway,1977-03-02,129,,,,,,160,167.5,172.5,,172.5,,,,,,172.5,5
Pro Masters 40-44,Raw,B,No,140+,M,Tomasz Węgliński,Poland,1978-03-06,140.05,,,,,,210,220,,,220,,,,,,220,1
Pro Masters 45-49,Raw,B,No,90,M,Michał Kopiec,Poland,1974-08-29,90,,,,,,160,165,-170,,165,,,,,,165,1
Pro Masters 45-49,Raw,B,No,90,M,Juliusz Zbierski,Poland,1974-04-02,86.75,,,,,,152.5,160,-165,,160,,,,,,160,2
Pro Masters 45-49,Raw,B,No,100,M,Hovhannes Yazichyan,Armenia,1971-05-08,93.2,,,,,,190,200,205,,205,,,,,,205,1
Pro Masters 45-49,Raw,B,No,110,M,Oleg Palamarchuk,Ukraine,1972-11-23,108.5,,,,,,200,207.5,-210,,207.5,,,,,,207.5,1
Pro Masters 45-49,Raw,B,No,125,M,Rafał Gomuła,Poland,1974-10-30,112.25,,,,,,180,-190,190,,190,,,,,,190,1
Pro Masters 45-49,Raw,B,No,125,M,Mirosław Zakrzewski,Poland,1974-01-10,117.15,,,,,,190,-195,-195,,190,,,,,,190,2
Pro Masters 45-49,Raw,B,No,140,M,Zbigniew Drewniak,Poland,1973-03-23,131.1,,,,,,160,170,180,,180,,,,,,180,1
Pro Masters 50-54,Raw,B,No,82.5,M,Dmitrii Kukharenko,Spain,1969-01-22,80.25,,,,,,140,155,-170,,155,,,,,,155,1
Pro Masters 50-54,Raw,B,No,110,M,Jacek Leszczyński,Poland,1966-10-23,109.6,,,,,,145,150,157.5,,157.5,,,,,,157.5,1
Pro Masters 50-54,Raw,B,No,125,M,Krzysztof Bożyczko-Jałocha,Poland,1965-09-02,114.6,,,,,,210,217.5,-222.5,,217.5,,,,,,217.5,1
Pro Masters 55-59,Raw,B,No,75,M,Wiesław Chaber,Poland,1963-10-28,75,,,,,,120,125,130,,130,,,,,,130,1
Pro Masters 55-59,Raw,B,No,90,M,Mirosław Urbaniak,Poland,1961-04-06,88.55,,,,,,140,145,150,,150,,,,,,150,1
Pro Masters 55-59,Raw,B,No,110,M,Roman Raczykowski,Poland,1962-02-13,102.5,,,,,,130,137.5,140,,140,,,,,,140,1
Pro Masters 60-64,Raw,B,No,100,M,Ryszard Wilczak,Poland,1955-10-26,98.1,,,,,,150,155,-160,,155,,,,,,155,1
Pro Masters 60-64,Raw,B,No,110,M,Henryk Świerzy,Poland,1956-03-08,102.7,,,,,,130,135,140,,140,,,,,,140,1
Pro Masters 65-69,Raw,B,No,67.5,M,Antoni Kaliňski,Poland,1953-10-01,66.95,,,,,,102.5,108,110,,110,,,,,,110,1
Pro Masters 65-69,Raw,B,No,125,M,Wojciech Grabowski,Poland,1951-03-31,110.7,,,,,,150,-160,-160,,150,,,,,,150,1
Pro Masters 70-74,Raw,B,No,82.5,M,Wiesław Ostrowski,Poland,1948-03-21,82.05,,,,,,-110,110,125,,125,,,,,,125,1
Pro Masters 70-74,Raw,B,No,82.5,M,Roman Wanot,Poland,1948-05-22,82.45,,,,,,-85,-85,85,,85,,,,,,85,2
Pro Masters 70-74,Raw,B,No,90,M,Kazimierz Tamiłowski,Poland,1948-02-02,86.1,,,,,,125,132.5,-137.5,,132.5,,,,,,132.5,1
Pro Masters 80+,Raw,B,No,75,M,Edward Limański,Poland,1936-03-25,71.3,,,,,,45,50,52.5,,52.5,,,,,,52.5,1
Pro Military/Fire/Police,Raw,B,No,67.5,M,Damian Matusiak,Poland,1983-06-17,66.9,,,,,,115,120,122.5,,122.5,,,,,,122.5,1
Pro Military/Fire/Police,Raw,B,No,67.5,M,Tomasz Pierunek,Poland,1988-12-29,67.35,,,,,,-115,-122.5,-122.5,,,,,,,,,DQ
Pro Military/Fire/Police,Raw,B,No,75,M,Teimuraz Kalandadze,Georgia,1984-08-27,74.8,,,,,,-140,140,155,,155,,,,,,155,1
Pro Military/Fire/Police,Raw,B,No,82.5,M,Jacek Krysiuk,Poland,1973-05-11,80.5,,,,,,150,155,-160,,155,,,,,,155,1
Pro Military/Fire/Police,Raw,B,No,90,M,Piotr Jezierski,Poland,1984-08-19,89.45,,,,,,180,190,-195,,190,,,,,,190,1
Pro Military/Fire/Police,Raw,B,No,90,M,Paweł Pruszyński,Poland,1988-04-04,89.25,,,,,,155,165,170,,170,,,,,,170,2
Pro Military/Fire/Police,Raw,B,No,100,M,Tomasz Trzciński,Poland,1982-09-17,98.65,,,,,,195,-205,205,,205,,,,,,205,1
Pro Military/Fire/Police,Raw,B,No,100,M,Arkadiusz Macudziński,Poland,1980-08-19,96.3,,,,,,170,177.5,-182.5,,177.5,,,,,,177.5,2
Pro Military/Fire/Police,Raw,B,No,100,M,Hubert Kaźmierczak,Poland,1996-07-25,94.95,,,,,,135,145,150,,150,,,,,,150,3
Pro Military/Fire/Police,Raw,B,No,110,M,Marek Sadowski,Poland,1979-06-17,106,,,,,,200,207.5,-212.5,,207.5,,,,,,207.5,1
Pro Military/Fire/Police,Raw,B,No,110,M,Koba Kobakhidze,Georgia,1975-05-21,107.3,,,,,,180,190,-197.5,,190,,,,,,190,2
Pro Military/Fire/Police,Raw,B,No,125,M,Kamil Bałdyga,Poland,1988-10-16,112.55,,,,,,200,205,-207.5,,205,,,,,,205,1
Pro Military/Fire/Police,Raw,B,No,125,M,Shalva Bebiashvili,Georgia,1987-01-05,122.5,,,,,,180,190,-200,,190,,,,,,190,2
Pro Military/Fire/Police,Raw,B,No,140,M,Robert Drozdowski,Poland,1979-04-02,125.25,,,,,,210,215,217.5,,217.5,,,,,,217.5,1
Pro Paralympian,Raw,B,No,90,M,Mikołaj Rydecki,Poland,1992-12-10,87.75,,,,,,117.5,-122.5,-122.5,,117.5,,,,,,117.5,1
Pro Paralympian,Raw,B,No,110,M,Bartłomiej Rogoziński,Poland,1982-06-05,102.15,,,,,,162.5,-167.5,-167.5,,162.5,,,,,,162.5,1
Pro Open,Multi-ply,B,No,82.5,M,Krzysztof Wolszczak,Poland,1985-06-02,81.4,,,,,,180,195,-202.5,,195,,,,,,195,2
Pro Open,Multi-ply,B,No,82.5,M,Dmitrii Kukharenko,Spain,1969-01-22,80.25,,,,,,165,180,-195,,180,,,,,,180,5
Pro Open,Multi-ply,B,No,90,M,Paweł Pruszyński,Poland,1988-04-04,89.25,,,,,,185,200,-210,,200,,,,,,200,2
Pro Open,Multi-ply,B,No,100,M,Sergii Demianov,Ukraine,1986-10-25,96.85,,,,,,-250,255,-265,,255,,,,,,255,1
Pro Open,Multi-ply,B,No,100,M,Irakli Tskhovrebashvili,Georgia,1981-05-09,91.3,,,,,,-210,-220,-220,,,,,,,,,DQ
Pro Open,Multi-ply,B,No,125,M,Rafał Pałubicki,Poland,1976-10-04,120.8,,,,,,-260,265,,,265,,,,,,265,2
Pro Open,Multi-ply,B,No,140,M,Piotr Šlapa,Poland,1983-01-17,126.55,,,,,,265,280,-300,,280,,,,,,280,1
Pro Submasters 33-39,Multi-ply,B,No,100,M,Irakli Tskhovrebashvili,Georgia,1981-05-09,91.3,,,,,,-210,-220,-220,,,,,,,,,DQ
Pro Submasters 33-39,Multi-ply,B,No,140,M,Piotr Šlapa,Poland,1983-01-17,126.55,,,,,,265,280,-300,,280,,,,,,280,2
Pro Masters 40-44,Multi-ply,B,No,125,M,Rafał Pałubicki,Poland,1976-10-04,120.8,,,,,,-260,265,,,265,,,,,,265,2
Pro Masters 50-54,Multi-ply,B,No,82.5,M,Dmitrii Kukharenko,Spain,1969-01-22,80.25,,,,,,165,180,-195,,180,,,,,,180,1
Pro Masters 60-64,Multi-ply,B,No,100,M,Franciszek Szabluk,Poland,1956-09-17,98.7,,,,,,-250,-250,-250,,,,,,,,,DQ
Pro Masters 65-69,Multi-ply,B,No,67.5,M,Antoni Kaliňski,Poland,1953-10-01,66.95,,,,,,115,122.5,125,,125,,,,,,125,1
Pro Juniors 20-23,Multi-ply,B,No,56,F,Aleksandra Szymczykowska,Poland,1998-04-17,55.4,,,,,,115,117.5,120,,120,,,,,,120,1
Pro Open,Multi-ply,B,No,67.5,M,Piotr Jęsiak,Poland,1993-07-13,60.7,,,,,,180,190,-200,,190,,,,,,190,1
Pro Open,Multi-ply,B,No,82.5,M,Dmitrii Kukharenko,Spain,1969-01-22,80.25,,,,,,180,200,-220,,200,,,,,,200,1
Pro Open,Multi-ply,B,No,90,M,Sebastian Dąbrowski,Poland,1980-07-21,89,,,,,,300,315,-320,,315,,,,,,315,1
Pro Open,Multi-ply,B,No,90,M,Paweł Pruszyński,Poland,1988-04-04,89.25,,,,,,180,190,-200,,190,,,,,,190,3
Pro Open,Multi-ply,B,No,90,M,Giorgi Metivishvili,Georgia,1991-08-04,88.95,,,,,,130,-145,145,,145,,,,,,145,4
Pro Open,Multi-ply,B,No,100,M,Krystian Fijałkowski,Poland,1992-11-24,98.75,,,,,,230,-260,-260,,230,,,,,,230,2
Pro Open,Multi-ply,B,No,110,M,Rafał Michalski,Poland,1993-03-31,104.55,,,,,,200,220,-240,,220,,,,,,220,2
Pro Open,Multi-ply,B,No,110,M,Mateusz Kaczmarek,Poland,1988-08-30,104.45,,,,,,-300,-300,-300,,,,,,,,,DQ
Pro Open,Multi-ply,B,No,125,M,Rafał Pałubicki,Poland,1976-10-04,120.8,,,,,,310,330,,,330,,,,,,330,1
Pro Open,Multi-ply,B,No,140,M,Krzysztof Cieślak,Poland,1984-11-09,132.85,,,,,,-280,-290,-290,,,,,,,,,DQ
Pro Open,Multi-ply,B,No,140+,M,Bartłomiej Jaruga,Poland,1986-11-02,146.8,,,,,,300,-320,,,300,,,,,,300,1
Pro Submasters 33-39,Multi-ply,B,No,125,M,Kamil Bałdyga,Poland,1988-10-16,112.55,,,,,,240,-280,-300,,240,,,,,,240,1
Pro Submasters 33-39,Multi-ply,B,No,140,M,Konrad Fornalczyk,Poland,1985-12-18,131.25,,,,,,270,290,-300,,290,,,,,,290,1
Pro Submasters 33-39,Multi-ply,B,No,140,M,Emzari Kiliptari,Georgia,1982-07-02,135.15,,,,,,-180,200,,,200,,,,,,200,3
Pro Submasters 33-39,Multi-ply,B,No,140,M,Krzysztof Cieślak,Poland,1984-11-09,132.85,,,,,,-280,-290,-290,,,,,,,,,DQ
Pro Submasters 33-39,Multi-ply,B,No,140+,M,Bartłomiej Jaruga,Poland,1986-11-02,146.8,,,,,,300,-320,,,300,,,,,,300,1
Pro Masters 40-44,Multi-ply,B,No,110,M,Tomasz Odcowski,Poland,1979-01-05,103.9,,,,,,320,-355,-360,,320,,,,,,320,1
Pro Masters 40-44,Multi-ply,B,No,125,M,Rafał Pałubicki,Poland,1976-10-04,120.8,,,,,,310,330,,,330,,,,,,330,1
Pro Masters 50-54,Multi-ply,B,No,125,M,Krzysztof Bożyczko-Jałocha,Poland,1965-09-02,114.6,,,,,,-280,,,,,,,,,,,DQ
Pro Masters 60-64,Multi-ply,B,No,100,M,Franciszek Szabluk,Poland,1956-09-17,98.7,,,,,,220,-235,-235,,220,,,,,,220,1
Pro Masters 70-74,Multi-ply,B,No,90,M,Kazimierz Tamiłowski,Poland,1948-02-02,86.1,,,,,,147.5,155,-160,,155,,,,,,155,1
Pro Military/Fire/Police,Multi-ply,B,No,125,M,Kamil Bałdyga,Poland,1988-10-16,112.55,,,,,,240,-280,-300,,240,,,,,,240,1
Pro Teen 16-17,Raw,D,No,75,M,Robizoni Potskhverashvili,Georgia,2003-01-24,71.65,,,,,,,,,,,150,160,165,,165,165,1
Pro Teen 18-19,Raw,D,No,75,M,Levan Kopaliani,Georgia,2001-01-01,71.7,,,,,,,,,,,230,-245,-256,,230,230,1
Pro Teen 18-19,Raw,D,No,90,M,Dominik Wasilkiewicz,Poland,2000-07-29,84.45,,,,,,,,,,,155,165,170,,170,170,1
Pro Teen 18-19,Raw,D,No,125,M,Mikheil Barbakadze,Georgia,2000-09-10,118.5,,,,,,,,,,,-265,275,-300,,275,275,1
Pro Juniors 20-23,Raw,D,No,110,M,Piotr Sadowski #2,Poland,1996-04-14,108.4,,,,,,,,,,,300,325,335,,335,335,1
Pro Juniors 20-23,Raw,D,No,125,M,Maksym Nemiatyy,Ukraine,1997-11-25,121.25,,,,,,,,,,,330,-352.5,-352.5,,330,330,1
Pro Juniors 20-23,Raw,D,No,140,M,Krystian Ludkowski,Poland,1998-10-21,126,,,,,,,,,,,260,270,-275,,270,270,1
Pro Open,Raw,D,No,90,M,Yaroslav Lytvynenko,Ukraine,1976-11-10,88,,,,,,,,,,,250,265,275,,275,275,2
Pro Open,Raw,D,No,90,M,Mykola Stepasyuk,Ukraine,1993-05-10,87.5,,,,,,,,,,,250,-260,260,,260,260,3
Pro Open,Raw,D,No,100,M,Vasyl' Mykhalskyy,Ukraine,1980-01-14,94.35,,,,,,,,,,,265,-270,-270,,265,265,2
Pro Open,Raw,D,No,110,M,Artyom Khugoyan,Armenia,1989-09-10,105.8,,,,,,,,,,,290,302.5,310,,310,310,1
Pro Open,Raw,D,No,110,M,Mariusz Bartołowicz,Poland,1979-12-10,108.15,,,,,,,,,,,260,270,280,,280,280,2
Pro Open,Raw,D,No,125,M,Rafał Wójcik,Poland,1987-10-03,119.25,,,,,,,,,,,315,330,-335,,330,330,1
Pro Open,Raw,D,No,125,M,Maksym Nemiatyy,Ukraine,1997-11-25,121.25,,,,,,,,,,,330,-352.5,-352.5,,330,330,2
Pro Open,Raw,D,No,125,M,Arkadiusz Herodowicz,Poland,1982-10-07,121.5,,,,,,,,,,,-300,,,,,,DQ
Pro Open,Raw,D,No,140,M,Piotr Gaj,Poland,1993-12-02,125.05,,,,,,,,,,,300,-305,-305,,300,300,1
Pro Submasters 33-39,Raw,D,No,75,M,Paweł Grab,Poland,1983-11-06,74.05,,,,,,,,,,,-225,-225,-225,,,,DQ
Pro Submasters 33-39,Raw,D,No,90,M,Byuzand Baghdasaryan,Armenia,1985-05-19,84.85,,,,,,,,,,,180,190,200,,200,200,1
Pro Submasters 33-39,Raw,D,No,110,M,Mariusz Bartołowicz,Poland,1979-12-10,108.15,,,,,,,,,,,260,270,280,,280,280,1
Pro Submasters 33-39,Raw,D,No,125,M,Arkadiusz Herodowicz,Poland,1982-10-07,121.5,,,,,,,,,,,-300,,,,,,DQ
Pro Masters 40-44,Raw,D,No,90,M,Yaroslav Lytvynenko,Ukraine,1976-11-10,88,,,,,,,,,,,250,265,275,,275,275,1
Pro Masters 50-54,Raw,D,No,110,M,Gagik Tonoyan,Armenia,1966-07-05,110,,,,,,,,,,,-250,265,286,,286,286,1
Pro Masters 50-54,Raw,D,No,125,M,Robert Nemś,Poland,1969-06-15,124.3,,,,,,,,,,,275,292.5,305,,305,305,1
Pro Masters 60-64,Raw,D,No,100,M,Wiesław Wrŏbel,Poland,1957-07-02,94.85,,,,,,,,,,,250,260,267.5,,267.5,267.5,1
Pro Masters 65-69,Raw,D,No,75,M,Ryszard Śliwiński,Poland,1950-01-22,72.5,,,,,,,,,,,140,150,160,,160,160,1
Pro Military/Fire/Police,Raw,D,No,90,M,Artur Avetisyan,Armenia,1981-11-20,84.85,,,,,,,,,,,200,215,225,,225,225,1
Pro Military/Fire/Police,Raw,D,No,110,M,Mariusz Bartołowicz,Poland,1979-12-10,108.15,,,,,,,,,,,260,270,280,,280,280,1
Pro Military/Fire/Police,Raw,D,No,125,M,Mateusz Szmyt,Poland,1990-11-02,114.9,,,,,,,,,,,255,262.5,-270,,262.5,262.5,1
Pro Military/Fire/Police,Raw,D,No,125,M,Shalva Bebiashvili,Georgia,1987-01-05,122.5,,,,,,,,,,,260,-270,-270,,260,260,2
Pro Teen 16-17,Raw,D,No,48,F,Magdalena Szpila,Poland,2002-03-06,46.54,,,,,,,,,,,105,110,115,,115,115,1
Pro Teen 16-17,Raw,D,No,75,F,Dorota Trojanowska,Poland,2003-02-15,72.6,,,,,,,,,,,140,150,155,,155,155,1
Pro Teen 18-19,Raw,D,No,67.5,F,Karolina Dubij,Poland,2002-02-12,67.15,,,,,,,,,,,100,107.5,115,,115,115,1
Pro Juniors 20-23,Raw,D,No,52,F,Martyna Dubij,Poland,1999-05-14,50.62,,,,,,,,,,,105,115,-120,,115,115,1
Pro Open,Raw,D,No,60,F,Yuliia Tsymbalyuk,Ukraine,1987-08-12,57.72,,,,,,,,,,,-100,-110,,,,,DQ
Pro Open,Raw,D,No,75,F,Renata Zapała,Poland,1994-07-28,69.7,,,,,,,,,,,110,120,-130,,120,120,1
Pro Submasters 33-39,Raw,D,No,60,F,Yuliia Tsymbalyuk,Ukraine,1987-08-12,57.72,,,,,,,,,,,-100,-110,,,,,DQ
Pro Masters 40-44,Raw,D,No,67.5,F,Lilit Vardanyan,Armenia,1975-03-07,64,,,,,,,,,,,107.5,112.5,117.5,,117.5,117.5,1
Pro Masters 50-54,Raw,D,No,56,F,Bettina Razzouki-Korkis,Poland,1965-08-28,55.4,,,,,,,,,,,110,123,125,,125,125,1
