Place,Name,State,WeightClassKg,BodyweightKg,BirthDate,Age,Squat1Kg,Squat2Kg,Squat3Kg,Best3SquatKg,Bench1Kg,Bench2Kg,Bench3Kg,Best3BenchKg,Deadlift1Kg,Deadlift2Kg,Deadlift3Kg,Best3DeadliftKg,TotalKg,Deadlift4Kg,Event,Equipment,Sex,Division
1,Boston Harding,UT,60,58.1,,13,45,50,52.5,52.5,35,40,-42.5,40,52.5,60,65,65,157.5,82.5,SBD,Raw,F,Juniors 13-15
1,Jade Watts,IN,75,71.4,,20,110,-117.5,-117.5,110,65,-70,-70,65,117.5,120,125,125,300,,SBD,Raw,F,Juniors 20-23
2,Emily Taggart,UT,75,69.2,,23,50,60,-67.5,60,35,40,-50,40,90,110,117.5,117.5,217.5,,SBD,Raw,F,Juniors 20-23
1,Malia Levy,UT,90+,119.7,,15,160,172.5,-182.5,172.5,45,-52.5,-67.5,45,105,115,137.5,137.5,355,,SBD,Raw,F,Juniors 13-15
1,Victoria Lam,UT,44,44,,31,75,-82.5,-85,75,45,47.5,50,50,92.5,95,100,100,225,,SBD,Raw,F,Open
1,Bryanna Tolboe,UT,75,73.6,,24,127.5,142.5,-155,142.5,70,75,-80,75,125,140,152.5,152.5,370,,SBD,Raw,F,Open
2,Samantha Hancock,UT,75,71.6,,28,115,-125,-125,115,72.5,-80,-80,72.5,130,145,-155,145,332.5,,SBD,Raw,F,Open
3,Heidi Pilling,UT,75,74.2,,46,90,-105,105,105,55,57.5,-60,57.5,132.5,142.5,-147.5,142.5,305,,SBD,Raw,F,Open
1,Sabrina Bray,UT,82.5,77.6,,25,92.5,105,-115,105,50,-57.5,-57.5,50,112.5,122.5,-135,122.5,277.5,,SBD,Raw,F,Open
1,Shanae Smithson,UT,90,85,,29,162.5,172.5,182.5,182.5,82.5,87.5,-90,87.5,172.5,185,-190,185,455,,SBD,Raw,F,Open
1,Malia Levy,UT,90+,119.7,,15,160,172.5,-182.5,172.5,45,-52.5,-67.5,45,105,115,137.5,137.5,355,,SBD,Raw,F,Open
1,Natalie Day,UT,67.5,65.5,,40,97.5,105,110,110,40,-45,50,50,135,145,-152.5,145,305,,SBD,Raw,F,Masters 40-44
1,Heidi Pilling,UT,75,74.2,,46,90,-105,105,105,55,57.5,-60,57.5,132.5,142.5,-147.5,142.5,305,,SBD,Raw,F,Masters 45-49
1,Shalece Sanders,UT,90,86,,45,47.5,52.5,60,60,65,67.5,70,70,102.5,115,122.5,122.5,252.5,,SBD,Raw,F,Masters 45-49
2,Melisa Gates,UT,90,87,,48,90,-92.5,-92.5,90,45,-47.5,-47.5,45,90,92.5,100,100,235,,SBD,Raw,F,Masters 45-49
1,Caleb Smith #1,UT,56,55.8,,14,75,80,82.5,82.5,50,55,-57.5,55,97.5,105,107.5,107.5,245,,SBD,Raw,M,Juniors 13-15
1,Evan Pastorik,UT,82.5,76,,17,142.5,165,-170,165,85,95,-102.5,95,182.5,190,195,195,455,,SBD,Raw,M,Juniors 16-17
1,Quinton Briggs,UT,90,88.2,,20,247.5,257.5,262.5,262.5,142.5,-147.5,-147.5,142.5,275,280,285,285,690,,SBD,Raw,M,Juniors 20-23
1,Jacob Wagstaff,UT,125,124.6,,23,265,272.5,-282.5,272.5,150,-157.5,-157.5,150,275,280,-285,280,702.5,,SBD,Raw,M,Juniors 20-23
1,Justin Christensen,UT,82.5,82.1,,36,210,222.5,230,230,160,177.5,-182.5,177.5,235,245,260,260,667.5,,SBD,Raw,M,Open
1,Brian Farley,UT,90,87.7,,24,227.5,,,227.5,147.5,155,-160,155,240,260,272.5,272.5,655,,SBD,Raw,M,Open
2,Justin Tolboe,UT,90,86,,24,172.5,185,197.5,197.5,160,170,177.5,177.5,207.5,227.5,-240,227.5,602.5,,SBD,Raw,M,Open
1,Jad Alame,UT,100,99.8,,27,277.5,290,305,305,185,195,-200,195,327.5,347.5,-355,347.5,847.5,,SBD,Raw,M,Open
2,Jacob Porter,UT,100,95.8,,27,-182.5,182.5,197.5,197.5,135,140,-145,140,220,227.5,230,230,567.5,,SBD,Raw,M,Open
1,Sione Tupouniua,UT,110,109.4,,34,247.5,255,-262.5,255,217.5,-222.5,,217.5,265,272.5,277.5,277.5,750,,SBD,Raw,M,Open
2,Conor Larson,UT,110,109.5,,35,195,220,227.5,227.5,187.5,202.5,205,205,237.5,267.5,-272.5,267.5,700,,SBD,Raw,M,Open
1,Logan Welling,UT,125,122.6,,24,227.5,240,-245,240,145,150,-155,150,227.5,245,260,260,650,,SBD,Raw,M,Open
1,Justin Christensen,UT,82.5,82.1,,36,210,222.5,230,230,160,177.5,-182.5,177.5,235,245,260,260,667.5,,SBD,Raw,M,Submasters 35-39
1,Conor Larson,UT,110,109.5,,35,195,220,227.5,227.5,187.5,202.5,205,205,237.5,267.5,-272.5,267.5,700,,SBD,Raw,M,Submasters 35-39
1,Michelle Buchanan,UT,90,83.8,,29,182.5,-187.5,187.5,187.5,105,-110,-110,105,200,210,217.5,217.5,510,,SBD,Wraps,F,Open
2,Katie DuPont,UT,90,85.2,,34,177.5,190,205,205,85,92.5,100,100,162.5,175,185,185,490,,SBD,Wraps,F,Open
1,Teri Read,UT,90+,97.2,,48,137.5,-147.5,147.5,147.5,62.5,70,80,80,130,145,155,155,382.5,,SBD,Wraps,F,Open
1,Teri Read,UT,90+,97.2,,48,137.5,-147.5,147.5,147.5,62.5,70,80,80,130,145,155,155,382.5,,SBD,Wraps,F,Masters 45-49
1,Ethan Wells,UT,90,88.9,,17,142.5,165,175,175,100,-112.5,-112.5,100,182.5,195,202.5,202.5,477.5,,SBD,Wraps,M,Juniors 16-17
1,Garrett Coleman,UT,125,123.7,,30,302.5,312.5,-320,312.5,190,197.5,-202.5,197.5,287.5,-295,-295,287.5,797.5,,SBD,Wraps,M,Open
2,Eduardo Vega,UT,125,122.8,,25,297.5,320,-335,320,187.5,200,205,205,257.5,-277.5,-277.5,257.5,782.5,,SBD,Wraps,M,Open
1,Jedediah Smith,UT,90,89.7,,44,185,215,227.5,227.5,-127.5,127.5,-137.5,127.5,205,227.5,240,240,595,,SBD,Wraps,M,Masters 40-44
DQ,Thomas Revas,UT,125,116.8,,32,295,322.5,,322.5,-227.5,227.5,,227.5,-272.5,,,,,,SBD,Single-ply,M,Open
1,Nathan Barnes,UT,110,110,,46,,,,,-182.5,182.5,-187.5,182.5,,,,,182.5,,B,Single-ply,M,Masters 45-49
1,Samantha Hancock,UT,75,71.6,,28,,,,,72.5,-80,-80,72.5,,,,,72.5,,B,Raw,F,Open
2,Heidi Pilling,UT,75,74.2,,46,,,,,55,57.5,-60,57.5,,,,,57.5,,B,Raw,F,Open
1,Michelle Buchanan,UT,90,83.8,,29,,,,,105,-110,-110,105,,,,,105,,B,Raw,F,Open
2,Katie DuPont,UT,90,85.2,,34,,,,,85,92.5,100,100,,,,,100,,B,Raw,F,Open
1,Heidi Pilling,UT,75,74.2,,46,,,,,55,57.5,-60,57.5,,,,,57.5,,B,Raw,F,Masters 45-49
1,Caleb Smith #1,UT,56,55.8,,14,,,,,50,55,-57.5,55,,,,,55,,B,Raw,M,Juniors 13-15
1,Greg Griffith,UT,100,93.1,,33,,,,,185,205,-217.5,205,,,,,205,,B,Raw,M,Open
DQ,Ryan Lund,UT,100,99.7,,29,,,,,-162.5,-162.5,-162.5,,,,,,,,B,Raw,M,Open
1,Robert Rasmussen,UT,140+,166,,36,,,,,155,-182.5,-182.5,155,,,,,155,,B,Raw,M,Open
1,Reagan Fugate,UT,140,127.5,,37,,,,,200,215,-227.5,215,,,,,215,,B,Raw,M,Submasters 35-39
1,Robert Rasmussen,UT,140+,166,,36,,,,,155,-182.5,-182.5,155,,,,,155,,B,Raw,M,Submasters 35-39
1,Kara Dobson,UT,67.5,64.7,,21,,,,,,,,,132.5,142.5,150,150,150,,D,Raw,F,Juniors 20-23
1,Samantha Hancock,UT,75,71.6,,28,,,,,,,,,130,145,-155,145,145,,D,Raw,F,Open
2,Heidi Pilling,UT,75,74.2,,46,,,,,,,,,132.5,142.5,-147.5,142.5,142.5,,D,Raw,F,Open
1,Wyatt Hall,UT,82.5,77.9,,26,,,,,,,,,195,-212.5,220,220,220,,D,Raw,F,Open
1,Katie DuPont,UT,90,85.2,,34,,,,,,,,,162.5,175,185,185,185,,D,Raw,F,Open
1,Natalie Day,UT,67.5,65.5,,40,,,,,,,,,135,145,-152.5,145,145,,D,Raw,F,Masters 40-44
1,Heidi Pilling,UT,75,74.2,,46,,,,,,,,,132.5,142.5,-147.5,142.5,142.5,,D,Raw,F,Masters 45-49
1,Caleb Smith #1,UT,56,55.8,,14,,,,,,,,,97.5,105,107.5,107.5,107.5,,D,Raw,M,Juniors 13-15
1,Bryson Porter,UT,75,71.7,,25,,,,,,,,,202.5,215,225,225,225,,D,Raw,M,Open
1,Sheldon Russell,UT,140,135.4,,45,,,,,,,,,277.5,-300,-300,277.5,277.5,,D,Raw,M,Open
1,Robert Rasmussen,UT,140+,166,,36,,,,,,,,,260,-267.5,-267.5,260,260,,D,Raw,M,Open
1,Robert Rasmussen,UT,140+,166,,36,,,,,,,,,260,-267.5,-267.5,260,260,,D,Raw,M,Submasters 35-39
1,Raymond Valdez,UT,140+,152,,40,,,,,,,,,275,-285,-285,275,275,,D,Raw,M,Masters 40-44
1,Sheldon Russell,UT,140,135.4,,45,,,,,,,,,277.5,-300,-300,277.5,277.5,,D,Raw,M,Masters 45-49
