Name,Sex,Division,WeightClassKg,BodyweightKg,Squat1Kg,Squat2Kg,Squat3Kg,Best3SquatKg,Bench1Kg,Bench2Kg,Bench3Kg,Best3BenchKg,Deadlift1Kg,Deadlift2Kg,Deadlift3Kg,Best3DeadliftKg,TotalKg,State,Equipment,Event,Place
Ana Zigler,F,FR-O,48,47.3,90,100,105,105,50,-55,55,55,117.5,122.5,130,130,290,TX,Raw,SBD,1
Molly Zunker,F,FR-O,48,47.1,80,85,92.5,92.5,47.5,52.5,-57.5,52.5,115,125,132.5,132.5,277.5,TX,Raw,SBD,2
Colleen McNamara,F,FR-O,48,47.4,-85,85,92.5,92.5,52.5,57.5,-62.5,57.5,105,115,-120,115,265,,Raw,SBD,3
Molly Zunker,F,FR-Jr,48,47.1,80,85,92.5,92.5,47.5,52.5,-57.5,52.5,115,125,132.5,132.5,277.5,TX,Raw,SBD,1
Suzanne Hartwig-Gary,F,FR-O,52,52,130,140,145.5,145.5,60,65,70,70,130,140,147.5,147.5,363,,Raw,SBD,1
Amanda Padgett,F,FR-O,52,50.8,102.5,112.5,117.5,117.5,55,-62.5,65,65,125,150.5,155,155,337.5,NC,Raw,SBD,2
Sonya Picarello,F,FR-O,52,51.6,75,-82.5,-82.5,75,42.5,-47.5,47.5,47.5,95,102.5,107.5,107.5,230,TX,Raw,SBD,3
Cacie Mershon,F,FR-O,52,48.3,70,75,-80,75,50,55,57.5,57.5,82.5,92.5,95,95,227.5,TX,Raw,SBD,4
Marisa Inda,F,FR-O,52,50.2,-115,-115,-115,,62.5,70,-77.5,70,137.5,147.5,-160,147.5,,CA,Raw,SBD,DQ
Jennifer Kingsley,F,FR-M2a,52,51.1,80,90,92.5,92.5,52.5,55,57.5,57.5,107.5,117.5,130,130,280,WI,Raw,SBD,1
Pamela Bartz,F,FR-O,56,55,110,125,-140,125,60,65,67.5,67.5,120,132.5,137.5,137.5,330,OH,Raw,SBD,1
Susan Stephens,F,FR-O,56,55.8,105,-112.5,112.5,112.5,60,62.5,65,65,140,-145,145,145,322.5,MD,Raw,SBD,2
Carissa Stith,F,FR-O,56,53.5,105,110,115,115,55,60,62.5,62.5,105,112.5,117.5,117.5,295,TX,Raw,SBD,3
Candice Hodges,F,FR-O,56,53.9,85,92.5,97.5,97.5,52.5,57.5,60,60,107.5,120,130,130,287.5,TX,Raw,SBD,4
Danielle Bennett,F,FR-O,56,54.8,105,-112.5,-112.5,105,55,60,-62.5,60,112.5,117.5,122.5,122.5,287.5,TX,Raw,SBD,5
Lynne Homan,F,FR-O,56,55.6,85,-95,-95,85,62.5,65,-67.5,65,125,135,-137.5,135,285,TX,Raw,SBD,6
Rachel Warpeha,F,FR-O,56,55.9,80,85,-92.5,85,57.5,60,-62.5,60,97.5,110,115,115,260,MN,Raw,SBD,7
Melissa Hunt,F,FR-O,56,53.6,80,85,90,90,50,55,-60,55,97.5,105,112.5,112.5,257.5,IN,Raw,SBD,8
Jo Ann Aita,F,FR-O,56,52.4,-115,-115,-115,,-72.5,-72.5,-72.5,,142.5,152.5,160,160,,CA,Raw,SBD,DQ
Melissa Steinke,F,FR-O,56,53.9,-82.5,-87.5,-87.5,,40,-45,-45,40,92.5,97.5,100,100,,IA,Raw,SBD,DQ
Laura McCaulley,F,FR-O,56,56,-77.5,-80,-80,,37.5,40,-42.5,40,100,107.5,112.5,112.5,,IA,Raw,SBD,DQ
Shayna L. Sutton,F,FR-Jr,56,54.7,80,90,-100,90,50,55,-60,55,112.5,125,140,140,285,MS,Raw,SBD,1
Elizabeth Monk,F,FR-T2,56,54.5,75,80,85.5,85.5,57.5,-60,60,60,102.5,107.5,110,110,255.5,PA,Raw,SBD,1
Taylor Gifford,F,FR-T2,56,55.8,65,70,-72.5,70,35,37.5,-42.5,37.5,-95,-95,-95,,,TX,Raw,SBD,DQ
Susan Stephens,F,FR-M1a,56,55.8,105,-112.5,112.5,112.5,60,62.5,65,65,140,-145,145,145,322.5,MD,Raw,SBD,1
Lynne Homan,F,FR-M2a,56,55.6,85,-95,-95,85,62.5,65,-67.5,65,125,135,-137.5,135,285,TX,Raw,SBD,1
Jennifer Thompson #1,F,FR-O,60,60,130,140,143.5,143.5,125,132.5,-137,132.5,160,-190,190,190,466,NC,Raw,SBD,1
Courtney Modecki,F,FR-O,60,58,115,-125,130,130,57.5,62.5,67.5,67.5,132.5,147.5,-160,147.5,345,VA,Raw,SBD,2
Janel Brown,F,FR-O,60,57.3,110,117.5,-120,117.5,55,60,-65,60,130,142.5,-152.5,142.5,320,PA,Raw,SBD,3
Laura McGuill,F,FR-O,60,58.5,95,110,117.5,117.5,47.5,52.5,57.5,57.5,120,132.5,145,145,320,,Raw,SBD,4
Bernadine Tatulinski,F,FR-O,60,58.5,-90,90,-105,90,47.5,52.5,55,55,100,-112.5,112.5,112.5,257.5,OH,Raw,SBD,5
Jessica Doyle,F,FR-O,60,58.8,75,80,85,85,37.5,40,42.5,42.5,90,100,105,105,232.5,TX,Raw,SBD,6
Joanne Craig,F,FR-O,60,59,95,-105,-105,95,-52.5,-52.5,-52.5,,107.5,115,-122.5,115,,PA,Raw,SBD,DQ
Laura McGuill,F,FR-Jr,60,58.5,95,110,117.5,117.5,47.5,52.5,57.5,57.5,120,132.5,145,145,320,,Raw,SBD,1
Krystin Krodle,F,FR-T3,60,59.6,75,82.5,87.5,87.5,50,-55,55,55,95,100,-105,100,242.5,TX,Raw,SBD,1
Theresa Willis,F,FR-M1a,60,59.4,67.5,-72.5,-75,67.5,40,-45,-45,40,102.5,-110,-110,102.5,210,TX,Raw,SBD,1
Bernadine Tatulinski,F,FR-M2a,60,58.5,-90,90,-105,90,47.5,52.5,55,55,100,-112.5,112.5,112.5,257.5,OH,Raw,SBD,1
Joanne Craig,F,FR-M2a,60,59,95,-105,-105,95,-52.5,-52.5,-52.5,,107.5,115,-122.5,115,,PA,Raw,SBD,DQ
Kimberly Walford,F,FR-O,67.5,65.1,132.5,145,155,155,100,105,,105,202.5,225,-230,225,485,CT,Raw,SBD,1
Jill Joiner-Wong,F,FR-O,67.5,66.2,117.5,127.5,132.5,132.5,75,-80,-80,75,127.5,140,155,155,362.5,WA,Raw,SBD,2
Wendy C. Hajik,F,FR-O,67.5,67,-137.5,-137.5,137.5,137.5,60,67.5,-70,67.5,142.5,150,-160,150,355,TX,Raw,SBD,3
Vanessa Gale,F,FR-O,67.5,67,117.5,127.5,-135,127.5,60,65,-67.5,65,132.5,142.5,152.5,152.5,345,,Raw,SBD,4
Cristina Escalante,F,FR-O,67.5,64.1,112.5,117.5,120,120,67.5,70,72.5,72.5,130,135,140,140,332.5,FL,Raw,SBD,5
Lara Sturm,F,FR-O,67.5,64.4,105,-112.5,112.5,112.5,60,67.5,-70,67.5,120,132.5,-142.5,132.5,312.5,GA,Raw,SBD,6
Kyra Wolters,F,FR-O,67.5,67.4,125,-135,-135,125,52.5,-55,-57.5,52.5,130,-135,-135,130,307.5,PA,Raw,SBD,7
Emily Gray,F,FR-Jr,67.5,67.1,95,-110,-112.5,95,62.5,70,-75,70,125,-137.5,-137.5,125,290,CO,Raw,SBD,1
Ella Lowenberg,F,FR-T2,67.5,65.6,-80,80,-85,80,-45,45,-47.5,45,102.5,105,-110,105,230,CO,Raw,SBD,1
Jill Joiner-Wong,F,FR-M1a,67.5,66.2,117.5,127.5,132.5,132.5,75,-80,-80,75,127.5,140,155,155,362.5,WA,Raw,SBD,1
Lara Sturm,F,FR-M1a,67.5,64.4,105,-112.5,112.5,112.5,60,67.5,-70,67.5,120,132.5,-142.5,132.5,312.5,GA,Raw,SBD,2
Darline Buchannan,F,FR-M1b,67.5,65.4,85,97.5,-102.5,97.5,65,70,-72.5,70,127.5,-142.5,142.5,142.5,310,VA,Raw,SBD,1
Jane E. Hemby,F,FR-M3a,67.5,64,57.5,60,62.5,62.5,50,52.5,-55,52.5,82.5,85,95,95,210,TX,Raw,SBD,1
Kyra Wolters,F,FR-C,67.5,67.4,125,-135,-135,125,52.5,-55,-57.5,52.5,130,-135,-135,130,307.5,PA,Raw,SBD,1
Sandra Sebastian,F,FR-O,75,71.6,122.5,132.5,-142.5,132.5,75,80,82.5,82.5,167.5,177.5,185,185,400,,Raw,SBD,1
Sheryl Condon,F,FR-O,75,71.2,122.5,127.5,135,135,65,70,-75,70,155,165,-167.5,165,370,CA,Raw,SBD,2
Chelsea Wrenn,F,FR-O,75,72.7,110,120,-127.5,120,62.5,70,72.5,72.5,155,165,170,170,362.5,TX,Raw,SBD,3
Jennifer Amann,F,FR-O,75,74.4,125,137.5,-142.5,137.5,67.5,70,-72.5,70,137.5,-150,150,150,357.5,TX,Raw,SBD,4
Kimberly Harrell,F,FR-O,75,69.3,75,82.5,90,90,47.5,52.5,-57.5,52.5,100,112.5,122.5,122.5,265,OH,Raw,SBD,5
Rebecca Main,F,FR-O,75,74.4,85,-95,-97.5,85,55,57.5,-60,57.5,-85,85,100,100,242.5,WI,Raw,SBD,6
Chelsea Wrenn,F,FR-Jr,75,72.7,110,120,-127.5,120,62.5,70,72.5,72.5,155,165,170,170,362.5,TX,Raw,SBD,1
Sara Cichorex,F,FR-Jr,75,74,-127.5,-127.5,,,,,,,,,,,,NY,Raw,SBD,DQ
Sheryl Condon,F,FR-M1a,75,71.2,122.5,127.5,135,135,65,70,-75,70,155,165,-167.5,165,370,CA,Raw,SBD,1
Bonnie Caudill,F,FR-M1a,75,73,67.5,77.5,82.5,82.5,-50,52.5,-57.5,52.5,-102.5,107.5,120,120,255,TX,Raw,SBD,2
Lisa McAdams,F,FR-M2a,75,74.2,-85,87.5,-97.5,87.5,47.5,50,-55,50,137.5,147.5,-155,147.5,285,TX,Raw,SBD,1
Alexus Cano,F,FR-C,75,74.8,100,-115,-122.5,100,47.5,52.5,-57.5,52.5,100,110,-122.5,110,262.5,TX,Raw,SBD,1
Sebrina Davis,F,FR-O,82.5,77.4,145,-152,152,152,77.5,87.5,-90,87.5,192.5,-215,-215,192.5,432,TX,Raw,SBD,1
Mickey Belaineh,F,FR-O,82.5,82.4,110,117.5,127.5,127.5,72.5,-77.5,-77.5,72.5,155,167.5,172.5,172.5,372.5,TX,Raw,SBD,2
Sebrina Davis,F,FR-M1a,82.5,77.4,145,-152,152,152,77.5,87.5,-90,87.5,192.5,-215,-215,192.5,432,TX,Raw,SBD,1
Patricia Kroken,F,FR-M3b,82.5,82.4,-67.5,-70,72.5,72.5,-35,35,37.5,37.5,102.5,110,-115,110,220,NM,Raw,SBD,1
Mickey Belaineh,F,FR-C,82.5,82.4,110,117.5,127.5,127.5,72.5,-77.5,-77.5,72.5,155,167.5,172.5,172.5,372.5,TX,Raw,SBD,1
Tina Robinson,F,FR-O,90,88.3,137.5,-150,-150,137.5,102.5,110,115,115,145,150,160,160,412.5,GA,Raw,SBD,1
Tammy Walker,F,FR-O,90,83.5,117.5,125,127.5,127.5,102.5,107.5,110,110,145,155,-162.5,155,392.5,NC,Raw,SBD,2
Marcia Darbouze,F,FR-Jr,90,88.4,125,132.5,142.5,142.5,62.5,65,-75,65,152.5,167.5,182.5,182.5,390,FL,Raw,SBD,1
Tina Robinson,F,FR-M1a,90,88.3,137.5,-150,-150,137.5,102.5,110,115,115,145,150,160,160,412.5,GA,Raw,SBD,1
Tammy Walker,F,FR-M1a,90,83.5,117.5,125,127.5,127.5,102.5,107.5,110,110,145,155,-162.5,155,392.5,NC,Raw,SBD,2
Tina Robinson,F,FR-MO,90,88.3,137.5,-150,-150,137.5,102.5,110,115,115,145,150,160,160,412.5,GA,Raw,SBD,1
Marcia Darbouze,F,FR-C,90,88.4,125,132.5,142.5,142.5,62.5,65,-75,65,152.5,167.5,182.5,182.5,390,FL,Raw,SBD,1
Molly O'Rourke,F,FR-O,90+,103.4,177.5,-180,-180,177.5,115,-120,120,120,207.5,212.5,,212.5,510,CA,Raw,SBD,1
Chelsea Rebman,F,FR-O,90+,99.5,170,182.5,-187.5,182.5,72.5,80,-82.5,80,160,175,-182.5,175,437.5,PA,Raw,SBD,2
Melissa Copeland,F,FR-O,90+,105.4,172.5,-182.5,-182.5,172.5,87.5,-92.5,-92.5,87.5,170,-177.5,-177.5,170,430,MD,Raw,SBD,3
Jennifer Stahr,F,FR-O,90+,151.2,-122.5,122.5,135,135,77.5,82.5,85,85,122.5,140,150,150,370,PA,Raw,SBD,4
Jennifer Felps,F,FR-O,90+,94.8,-105,-110,-110,,67.5,72.5,-77.5,72.5,120,-125,-125,120,,TX,Raw,SBD,DQ
Keli Young,F,FR-MO,90+,106.2,-125,125,135,135,70,-77.5,-77.5,70,150,160,172.5,172.5,377.5,TX,Raw,SBD,1
Jorge Saldana,M,MR-T1,52,48.6,80,-93,-93,80,55,60,-62.5,60,115,132.5,135,135,275,TX,Raw,SBD,1
Douglas Newcomer Jr,M,MR-T1,52,48.5,40,55,-62.5,55,35,52.5,-57.5,52.5,85,105,115,115,222.5,TX,Raw,SBD,2
Eric Kupperstein,M,MR-O,56,55.9,155,172.5,-182.5,172.5,85,95,100,100,225,240,250.5,250.5,523,MA,Raw,SBD,1
Paritosh Bhatnagar,M,MR-O,56,54.5,57.5,65,-70,65,50,55,-60,55,90,105,-122.5,105,225,TX,Raw,SBD,2
Eric Kupperstein,M,MR-M1b,56,55.9,155,172.5,-182.5,172.5,85,95,100,100,225,240,250.5,250.5,523,MA,Raw,SBD,1
Paritosh Bhatnagar,M,MR-C,56,54.5,57.5,65,-70,65,50,55,-60,55,90,105,-122.5,105,225,TX,Raw,SBD,1
Carlos Buenfil,M,MR-O,60,59.9,140,145,155,155,92.5,97.5,100,100,177.5,187.5,202.5,202.5,457.5,TX,Raw,SBD,1
Matthew Fox,M,MR-O,60,58.4,-145,145,,145,110,115,-120,115,160,170,-180,170,430,KS,Raw,SBD,2
Xaviar Clark,M,MR-O,60,59.1,102.5,107.5,-115,107.5,95,102.5,105,105,170,182.5,-192.5,182.5,395,TX,Raw,SBD,3
Carlos Buenfil,M,MR-Jr,60,59.9,140,145,155,155,92.5,97.5,100,100,177.5,187.5,202.5,202.5,457.5,TX,Raw,SBD,1
Matthew Fox,M,MR-Jr,60,58.4,-145,145,,145,110,115,-120,115,160,170,-180,170,430,KS,Raw,SBD,2
Xaviar Clark,M,MR-Jr,60,59.1,102.5,107.5,-115,107.5,95,102.5,105,105,170,182.5,-192.5,182.5,395,TX,Raw,SBD,3
Tomas E. Vega,M,MR-T2,60,57.3,110,115,125,125,75,80,85,85,152.5,162.5,170,170,380,TX,Raw,SBD,1
Jake Benedix,M,MR-T3,60,59.3,130,142.5,-150,142.5,-85,85,-92.5,85,147.5,160,165,165,392.5,FL,Raw,SBD,1
Xaviar Clark,M,MR-C,60,59.1,102.5,107.5,-115,107.5,95,102.5,105,105,170,182.5,-192.5,182.5,395,TX,Raw,SBD,1
Shawn Frasquillo,M,MR-O,67.5,66.8,175,190,-200,190,140,153,-155,153,195,207.5,217.5,217.5,560.5,TX,Raw,SBD,1
Jeff Phillips #1,M,MR-O,67.5,67,-167.5,167.5,182.5,182.5,110,115,117.5,117.5,205,220,227.5,227.5,527.5,TX,Raw,SBD,2
Nate Wylie,M,MR-O,67.5,65,150,157.5,162.5,162.5,102.5,105,-107.5,105,195,212.5,-227.5,212.5,480,TX,Raw,SBD,3
Ryan Hurst,M,MR-O,67.5,66.4,135,-145,-150,135,80,-85,-85,80,177.5,185,195,195,410,TX,Raw,SBD,4
Richard Hernandez,M,MR-Jr,67.5,67.1,157.5,167.5,175,175,115,120,127.5,127.5,157.5,170,182.5,182.5,485,TX,Raw,SBD,1
Brett Benedix,M,MR-T2,67.5,66.4,175,190,195,195,80,85,-87.5,85,175,185,190,190,470,FL,Raw,SBD,1
Sawyer Yandell,M,MR-T2,67.5,60.7,142.5,157.5,165,165,77.5,85,-90,85,172.5,195,-200,195,445,TX,Raw,SBD,2
Ryan Hurst,M,MR-T2,67.5,66.4,135,-145,-150,135,80,-85,-85,80,177.5,185,195,195,410,TX,Raw,SBD,3
Raymundo Castro,M,MR-T3,67.5,67,140,150,162.5,162.5,92.5,102.5,-107.5,102.5,152.5,162.5,190,190,455,TX,Raw,SBD,1
Jeff Phillips #1,M,MR-M1b,67.5,67,-167.5,167.5,182.5,182.5,110,115,117.5,117.5,205,220,227.5,227.5,527.5,TX,Raw,SBD,1
Doug Newcomer,M,MR-M1b,67.5,66.6,92.5,105,-127.5,105,75,92.5,-95,92.5,125,150,157.5,157.5,355,TX,Raw,SBD,2
Vashon Perryman,M,MR-O,75,74.7,242.5,-265,-265,242.5,137.5,142.5,-147.5,142.5,280,300,-307.5,300,685,KS,Raw,SBD,1
Scott Meyers,M,MR-O,75,72.6,-185,192.5,200,200,145,152.5,-155,152.5,230,-242.5,242.5,242.5,595,PA,Raw,SBD,2
Tim Lamando,M,MR-O,75,74.7,200,212.5,215,215,115,122.5,-125,122.5,237.5,-252.5,-252.5,237.5,575,TX,Raw,SBD,3
Mike Zourdos,M,MR-O,75,73.8,185,200,205,205,107.5,115,-117.5,115,205,217.5,225,225,545,FL,Raw,SBD,4
Brent Kim,M,MR-O,75,70.2,190,197.5,-205,197.5,115,120,125,125,175,195,-210,195,517.5,TX,Raw,SBD,5
Joe Warpeha,M,MR-O,75,74.9,125,130,135,135,137.5,142.5,145,145,165,175,185,185,465,MN,Raw,SBD,6
Eric Reeves,M,MR-O,75,74.4,140,150,152.5,152.5,107.5,115,117.5,117.5,175,185,-195,185,455,TX,Raw,SBD,7
Michael Simon,M,MR-O,75,68.2,-155,-170,-170,,120,125,-135,125,200,205,-220,205,,KY,Raw,SBD,DQ
Jonnie Candito,M,MR-O,75,74.5,-220,-220,-220,,,,,,,,,,,OH,Raw,SBD,DQ
Jordan Berke,M,MR-Jr,75,74,-185,190,-200,190,150,157.5,-165,157.5,197.5,207.5,212.5,212.5,560,FL,Raw,SBD,1
Sam Derynck,M,MR-Jr,75,74.7,170,177.5,187.5,187.5,122.5,-127.5,-127.5,122.5,215,232.5,-240,232.5,542.5,MN,Raw,SBD,2
Hector Garcia,M,MR-Jr,75,73.1,155,167.5,180,180,122.5,135,-140,135,182.5,197.5,220,220,535,TX,Raw,SBD,3
Ramiro Espinosa,M,MR-Jr,75,74.3,167.5,-175,-175,167.5,127.5,132.5,135,135,220,230,-245,230,532.5,TX,Raw,SBD,4
Chad Penson,M,MR-Jr,75,74.7,177.5,-192.5,-192.5,177.5,137.5,-142.5,145,145,190,205,-225,205,527.5,NM,Raw,SBD,5
Jonnie Candito,M,MR-Jr,75,74.5,-220,-220,-220,,,,,,,,,,,OH,Raw,SBD,DQ
Michael Saunders,M,MR-Jr,75,74.9,-205,-215,-215,,-130,,,,,,,,,PA,Raw,SBD,DQ
Zac Skeltis,M,MR-T2,75,72.5,152.5,165,-170,165,95,102.5,-107.5,102.5,185,202.5,207.5,207.5,475,WA,Raw,SBD,1
Austin Gauldin,M,MR-T2,75,73.4,145,-155,-155,145,100,110,-115,110,147.5,170,177.5,177.5,432.5,AL,Raw,SBD,2
Michael Simon,M,MR-T3,75,68.2,-155,-170,-170,,120,125,-135,125,200,205,-220,205,,KY,Raw,SBD,DQ
Michael Macri,M,MR-M1a,75,74.2,172.5,-182.5,182.5,182.5,92.5,97.5,-100,97.5,182.5,-205,-205,182.5,462.5,NY,Raw,SBD,1
Jamie McDougal,M,MR-M1a,75,74.6,-200,-200,-200,,,,,,,,,,,AR,Raw,SBD,DQ
Gary Kaiser,M,MR-M2a,75,73.4,182.5,-210,,182.5,137.5,-142.5,,137.5,190,215,220,220,540,AZ,Raw,SBD,1
Bradford Olson,M,MR-M2a,75,74.5,170,182.5,-190,182.5,130,142.5,-145,142.5,180,205,-212.5,205,530,OH,Raw,SBD,2
Enrique Guerra,M,MR-M2a,75,74,142.5,160,175,175,112.5,122.5,-127.5,122.5,172.5,185,-195,185,482.5,TX,Raw,SBD,3
Duane Young,M,MR-M2a,75,74.8,137.5,142.5,147.5,147.5,92.5,100,102.5,102.5,175,185,190,190,440,TX,Raw,SBD,4
Terrence Brady,M,MR-M2a,75,73.9,,,,,,,,,,,,,,TX,Raw,SBD,DQ
Bob Yamasaki,M,MR-M3a,75,73.9,170,182.5,197.5,197.5,107.5,117.5,-122.5,117.5,202.5,217.5,227.5,227.5,542.5,CA,Raw,SBD,1
Conrad Martinez,M,MR-M3a,75,74.5,50,60,-70,60,107.5,110,112.5,112.5,122.5,127.5,-137.5,127.5,300,TX,Raw,SBD,2
Alex Tertitski,M,MR-O,82.5,81.8,222.5,235,247.5,247.5,150,157.5,160,160,280,297.5,307.5,307.5,715,FL,Raw,SBD,1
Mike Loncharich,M,MR-O,82.5,82.2,227.5,237.5,-242.5,237.5,170,-175,-175,170,265,280,292.5,292.5,700,PA,Raw,SBD,2
Larry Dyles,M,MR-O,82.5,82.3,-227.5,-240,240,240,160,167.5,-172.5,167.5,227.5,250,-260,250,657.5,,Raw,SBD,3
Jerry Zsido,M,MR-O,82.5,81.7,200,205,-207.5,205,142.5,147.5,-152.5,147.5,250,265,272.5,272.5,625,PA,Raw,SBD,4
Anthony D'urso,M,MR-O,82.5,82.1,207.5,220,230,230,122.5,135,-140,135,222.5,237.5,255,255,620,NJ,Raw,SBD,5
Donovan Thompson,M,MR-O,82.5,82,175,205,215,215,142.5,160,-163.5,160,225,-232.5,-232.5,225,600,NC,Raw,SBD,6
Ross Leppala,M,MR-O,82.5,82.1,187.5,200,-210,200,155,165,172.5,172.5,202.5,217.5,227.5,227.5,600,,Raw,SBD,7
Jordan Feigenbaum,M,MR-O,82.5,80.7,190,200,-210,200,140,145,-150,145,230,240,250,250,595,MO,Raw,SBD,8
Frank Wu,M,MR-O,82.5,81.7,190,-207.5,-207.5,190,125,-135,-135,125,270,-287.5,-287.5,270,585,MA,Raw,SBD,9
Scott Grade,M,MR-O,82.5,79.3,170,185,195,195,140,150,160,160,215,227.5,-240,227.5,582.5,WI,Raw,SBD,10
Larry Maile,M,MR-O,82.5,82.4,180,192.5,207.5,207.5,132.5,145,-155,145,185,210,230,230,582.5,AK,Raw,SBD,11
Jorge Unigarro,M,MR-O,82.5,80.8,175,185,190,190,132.5,137.5,-145,137.5,237.5,247.5,-252.5,247.5,575,NY,Raw,SBD,12
Rory Tatum,M,MR-O,82.5,80.9,200,-220,-220,200,110,120,-122.5,120,195,-212.5,212.5,212.5,532.5,TX,Raw,SBD,13
Tanner Autrey,M,MR-O,82.5,81,-160,165,172.5,172.5,-115,120,-130,120,182.5,192.5,197.5,197.5,490,TX,Raw,SBD,14
Jonathan Chapa,M,MR-Jr,82.5,80.7,215,222.5,227.5,227.5,135,140,145,145,225,245,270,270,642.5,TX,Raw,SBD,1
Tony Schwebach,M,MR-Jr,82.5,82,205,215,225,225,125,130,137.5,137.5,252.5,267.5,-282.5,267.5,630,SD,Raw,SBD,2
Michael Srokowski,M,MR-Jr,82.5,80.6,-195,-195,195,195,157.5,165,-170,165,247.5,255,-265,255,615,CT,Raw,SBD,3
Elliot Rowe,M,MR-Jr,82.5,81.2,200,-210,-210,200,130,-137.5,-137.5,130,205,210,-212.5,210,540,CA,Raw,SBD,4
Chris Meyers,M,MR-Jr,82.5,81.3,165,175,-185,175,130,140,-145,140,210,222.5,-227.5,222.5,537.5,FL,Raw,SBD,5
Andrew Pichardo,M,MR-Jr,82.5,81.2,-220,-220,-220,,-122.5,-122.5,122.5,122.5,210,230,-247.5,230,,TX,Raw,SBD,DQ
Matthew Koe,M,MR-T2,82.5,81.1,155,175,182.5,182.5,100,117.5,125,125,182.5,205,225,225,532.5,NC,Raw,SBD,1
Zachary Archer,M,MR-T3,82.5,81.7,197.5,217.5,230,230,105,127.5,137.5,137.5,252.5,267.5,275,275,642.5,IN,Raw,SBD,1
Scott Grade,M,MR-M1a,82.5,79.3,170,185,195,195,140,150,160,160,215,227.5,-240,227.5,582.5,WI,Raw,SBD,1
Sean Dunston,M,MR-M1a,82.5,81.5,197.5,207.5,-217.5,207.5,100,107.5,115,115,200,215,230,230,552.5,VA,Raw,SBD,2
Donovan Thompson,M,MR-M1b,82.5,82,175,205,215,215,142.5,160,-163.5,160,225,-232.5,-232.5,225,600,NC,Raw,SBD,1
Larry Maile,M,MR-M2a,82.5,82.4,180,192.5,207.5,207.5,132.5,145,-155,145,185,210,230,230,582.5,AK,Raw,SBD,1
Jim Klostergaard,M,MR-M3a,82.5,82.3,105,,,105,130,-141,,130,145,165,,165,400,TX,Raw,SBD,1
Chris Meyers,M,MR-C,82.5,81.3,165,175,-185,175,130,140,-145,140,210,222.5,-227.5,222.5,537.5,FL,Raw,SBD,1
Rory Tatum,M,MR-C,82.5,80.9,200,-220,-220,200,110,120,-122.5,120,195,-212.5,212.5,212.5,532.5,TX,Raw,SBD,2
LS McLain,M,MR-O,90,89.2,225,-242.5,242.5,242.5,192.5,200,200.5,200.5,-272.5,280,295,295,738,TX,Raw,SBD,1
Ian Bell,M,MR-O,90,89,240,250,257.5,257.5,127.5,142.5,147.5,147.5,310,320.5,-335,320.5,725.5,TX,Raw,SBD,2
Derek Gove,M,MR-O,90,89.3,240,250,,250,147.5,-160,160,160,265,277.5,285,285,695,TX,Raw,SBD,3
Anthony Loreto,M,MR-O,90,89.6,222.5,235,240,240,145,150,-152.5,150,275,297.5,-305,297.5,687.5,FL,Raw,SBD,4
Cardyl Trionfante,M,MR-O,90,89.6,205,225,240,240,130,145,152.5,152.5,260,280,-305,280,672.5,LA,Raw,SBD,5
Troy Saunders,M,MR-O,90,89.7,-222.5,222.5,227.5,227.5,155,160,-167.5,160,275,282.5,-292.5,282.5,670,IL,Raw,SBD,6
Tommy Janusz,M,MR-O,90,89,175,192.5,207.5,207.5,175,187.5,-195,187.5,205,237.5,260,260,655,TX,Raw,SBD,7
Chad Rexrode,M,MR-O,90,87.8,215,225,-230,225,155,162.5,-170,162.5,-217.5,217.5,232.5,232.5,620,VA,Raw,SBD,8
Joshua Heimbecker,M,MR-O,90,87,155,165,180,180,140,150,-155,150,212.5,-232.5,235,235,565,TX,Raw,SBD,9
James Shackelford,M,MR-O,90,88.7,192.5,210,,210,145,-160,-160,145,207.5,-240,-240,207.5,562.5,OK,Raw,SBD,10
Mike Haertel,M,MR-O,90,88,-202.5,-215,-215,,142.5,-147.5,-147.5,142.5,250,-260,-260,250,,MD,Raw,SBD,DQ
Otar Datan,M,MR-O,90,85.2,195,-210,-210,195,115,,,115,-242.5,-242.5,,,,NY,Raw,SBD,DQ
Ian Bell,M,MR-Jr,90,89,240,250,257.5,257.5,127.5,142.5,147.5,147.5,310,320.5,-335,320.5,725.5,TX,Raw,SBD,1
Charles Friday,M,MR-Jr,90,87.1,197.5,207.5,-212.5,207.5,125,132.5,137.5,137.5,227.5,235,-242.5,235,580,TX,Raw,SBD,2
Joshua Heimbecker,M,MR-Jr,90,87,155,165,180,180,140,150,-155,150,212.5,-232.5,235,235,565,TX,Raw,SBD,3
Andrew DiCecco,M,MR-Jr,90,89.2,-167.5,167.5,-182.5,167.5,130,-137.5,-137.5,130,205,215,230,230,527.5,PA,Raw,SBD,4
Andrew Hill,M,MR-Jr,90,86.9,-227.5,-227.5,-227.5,,120,127.5,-132.5,127.5,220,237.5,-242.5,237.5,,TX,Raw,SBD,DQ
Hayden Fulwood,M,MR-T2,90,83.9,145,152.5,-170,152.5,95,102.5,107.5,107.5,167.5,180,195,195,455,AL,Raw,SBD,1
Richard Peña Jr,M,MR-T3,90,88.7,190,212.5,-220,212.5,115,-125,-137.5,115,200,-215,,200,527.5,TX,Raw,SBD,1
Troy Saunders,M,MR-M1a,90,89.7,-222.5,222.5,227.5,227.5,155,160,-167.5,160,275,282.5,-292.5,282.5,670,IL,Raw,SBD,1
Chad Rexrode,M,MR-M1a,90,87.8,215,225,-230,225,155,162.5,-170,162.5,-217.5,217.5,232.5,232.5,620,VA,Raw,SBD,2
Timothy Stepney,M,MR-M1a,90,86.9,182.5,-190,-192.5,182.5,145,-150,-150,145,245,260,-275,260,587.5,TX,Raw,SBD,3
Chuck Akers,M,MR-M2a,90,89.8,167.5,190,-197.5,190,120,-130,130,130,205,-230,230,230,550,TX,Raw,SBD,1
Gary Grahn,M,MR-M2b,90,89.7,140,150,157.5,157.5,105,110,115,115,150,170,185,185,457.5,MN,Raw,SBD,1
Joe Lucio,M,MR-M3a,90,88.4,137.5,147.5,-152.5,147.5,92.5,-100,100,100,152.5,165,175,175,422.5,TX,Raw,SBD,1
Troy Saunders,M,MR-MO,90,89.7,-222.5,222.5,227.5,227.5,157.5,160,-167.5,160,275,282.5,-292.5,282.5,670,,Raw,SBD,1
Michael Blackwelder,M,MR-MO,90,88.8,-192.5,-207.5,207.5,207.5,150,160,-167.5,160,235,255,-257.5,255,622.5,VA,Raw,SBD,2
Joshua Heimbecker,M,MR-C,90,87,155,165,180,180,140,150,-155,150,212.5,-232.5,235,235,565,TX,Raw,SBD,1
Nick Tylutki,M,MR-O,100,100,285,295,-305,295,155,165,175,175,280,287.5,305,305,775,MN,Raw,SBD,1
Eli Burks,M,MR-O,100,96.1,220,245,-257.5,245,160,175,-180,175,277.5,317.5,330,330,750,MO,Raw,SBD,2
Matt Nolan,M,MR-O,100,96.4,235,250,-257.5,250,160,170,177.5,177.5,287.5,307.5,-325.5,307.5,735,NJ,Raw,SBD,3
JC Wright,M,MR-O,100,99.2,272.5,290,-295,290,142.5,155,160,160,277.5,-300,-300,277.5,727.5,TX,Raw,SBD,4
Jordan Krogman,M,MR-O,100,98.9,245,260,-267.5,260,160,167.5,170,170,-265,265,275,275,705,MN,Raw,SBD,5
Gregory Johnson,M,MR-O,100,93.2,240,-245,-245,240,150,-155,,150,312.5,-325,-325,312.5,702.5,TX,Raw,SBD,6
Russ McDonnell,M,MR-O,100,99.8,245,265,-275,265,165,172.5,-177.5,172.5,245,265,-275,265,702.5,PA,Raw,SBD,7
Arin Canecchio,M,MR-O,100,97.8,235,245,255,255,165,175,-177.5,175,227.5,-247.5,260,260,690,GA,Raw,SBD,8
Austin Sutton,M,MR-O,100,94,217.5,232.5,247.5,247.5,140,147.5,-152.5,147.5,250,270,-290,270,665,MS,Raw,SBD,9
Mike Petrovich,M,MR-O,100,98.5,230,240,247.5,247.5,152.5,155,-157.5,155,225,235,-240,235,637.5,AK,Raw,SBD,10
Mark Riebel,M,MR-O,100,98.6,207.5,217.5,-227.5,217.5,147.5,155,160,160,242.5,-255,-255,242.5,620,TX,Raw,SBD,11
Chris Martinez,M,MR-O,100,97.9,185,200,210,210,142.5,155,165,165,190,202.5,217.5,217.5,592.5,TX,Raw,SBD,12
Brett Wise,M,MR-O,100,97.5,205,215,-227.5,215,137.5,145,150,150,225,-232.5,-232.5,225,590,WA,Raw,SBD,13
Matt Gary,M,MR-O,100,98.5,170,180,185,185,130,137.5,142.5,142.5,230,242.5,250,250,577.5,,Raw,SBD,14
Norman Palencia,M,MR-O,100,97.8,190,200,-210,200,135,142.5,-147.5,142.5,215,-232.5,,215,557.5,GA,Raw,SBD,15
Arian Khamesi,M,MR-O,100,97.6,185,200,207.5,207.5,107.5,115,120,120,205,220,227.5,227.5,555,FL,Raw,SBD,16
Grant McCaulley,M,MR-O,100,99.4,175,190,-207.5,190,-130,-135,-135,,,,,,,IA,Raw,SBD,DQ
Bottesy Bailey,M,MR-Jr,100,94.2,222.5,237.5,-247.5,237.5,150,165,-170,165,290,310,-312.5,310,712.5,LA,Raw,SBD,1
Cody Miller #1,M,MR-Jr,100,99.5,240,250,255,255,180,-190,,180,240,277.5,,277.5,712.5,WV,Raw,SBD,2
Gregory Johnson,M,MR-Jr,100,93.2,240,-245,-245,240,150,-155,,150,312.5,-325,-325,312.5,702.5,TX,Raw,SBD,3
Zak Jenn,M,MR-T3,100,98.8,190,210,-217.5,210,150,162.5,-167.5,162.5,227.5,250,-262.5,250,622.5,IN,Raw,SBD,1
Russ McDonnell,M,MR-M1a,100,99.8,245,265,-275,265,165,172.5,-177.5,172.5,245,265,-275,265,702.5,PA,Raw,SBD,1
Kaiser Young,M,MR-M1a,100,96.5,192.5,215,227.5,227.5,162.5,175,182.5,182.5,192.5,215,227.5,227.5,637.5,TX,Raw,SBD,2
Gregory Titus,M,MR-M1b,100,98.9,175,180,187.5,187.5,165,167.5,172.5,172.5,220,225,230,230,590,FL,Raw,SBD,1
Lonnie Leger,M,MR-M1b,100,95.4,160,172.5,-185,172.5,107.5,117.5,-122.5,117.5,170,182.5,-190,182.5,472.5,LA,Raw,SBD,2
Robert Harris,M,MR-M2a,100,98.9,160,175,187.5,187.5,125,145,-157.5,145,205,220,232.5,232.5,565,TX,Raw,SBD,1
Scott Brockelman,M,MR-M2a,100,99.4,185,192.5,200,200,100,105,-107.5,105,205,-232.5,-232.5,205,510,TX,Raw,SBD,2
Stan Mingus,M,MR-M3a,100,98.8,175,195.5,200,200,150,157.5,-162.5,157.5,200,220,-240.5,220,577.5,IA,Raw,SBD,1
Charles Gilmore,M,MR-M3a,100,97.6,100,110,-120,110,100,110,120,120,155,175,185,185,415,TX,Raw,SBD,2
John Harp,M,MR-M3a,100,97.3,-102.5,102.5,110,110,115,125,-130,125,160,-175,-175,160,395,OR,Raw,SBD,3
Zak Jenn,M,MR-C,100,98.8,190,210,-217.5,210,150,162.5,-167.5,162.5,227.5,250,-262.5,250,622.5,IN,Raw,SBD,1
Robert Trettin,M,MR-O,110,108.3,267.5,280,-285,280,192.5,205,-207.5,205,265,282.5,-290,282.5,767.5,WI,Raw,SBD,1
Nathan Nord,M,MR-O,110,103.9,250,-265,265,265,180,190,192.5,192.5,265,280,-285,280,737.5,MN,Raw,SBD,2
Carl LaRovera Jr,M,MR-O,110,109.4,-232.5,255,-265,255,140,160,167.5,167.5,257.5,282.5,300,300,722.5,CT,Raw,SBD,3
Jason Wells,M,MR-O,110,109.6,245,260,-270,260,150,160,170,170,280,290,-297.5,290,720,OH,Raw,SBD,4
Ron Lloyd,M,MR-O,110,108.8,237.5,242.5,-247.5,242.5,172.5,177.5,-185,177.5,280,-285,-285,280,700,TX,Raw,SBD,5
Anthony Succarotte,M,MR-O,110,102.2,-250,-250,250,250,200,-210,-210,200,227.5,-255,-255,227.5,677.5,DE,Raw,SBD,6
Phillip Wylie,M,MR-O,110,109.2,210,227.5,237.5,237.5,160,165,-170,165,250,272.5,-287.5,272.5,675,TX,Raw,SBD,7
Chris Campbell,M,MR-O,110,107.9,207.5,222.5,-230,222.5,182.5,190,-195,190,227.5,252.5,-257.5,252.5,665,VA,Raw,SBD,8
Jake Carney,M,MR-O,110,109.1,222.5,237.5,245,245,142.5,155,162.5,162.5,222.5,245,255,255,662.5,OK,Raw,SBD,9
Peter Bush,M,MR-O,110,109.6,-252.5,252.5,-257.5,252.5,147.5,-157.5,-157.5,147.5,-260,-260,260,260,660,GA,Raw,SBD,10
James Meador IV,M,MR-O,110,103,-227.5,-250,250,250,125,140,145,145,227.5,250,-272.5,250,645,TX,Raw,SBD,11
Robert Schmidt #3,M,MR-O,110,109.8,212.5,222.5,230,230,150,160,167.5,167.5,225,235,242.5,242.5,640,,Raw,SBD,12
Ashley Acheson,M,MR-O,110,108.9,185,190,197.5,197.5,165,-172.5,-172.5,165,235,245,-250,245,607.5,TX,Raw,SBD,13
J.J. Natal,M,MR-O,110,109.6,192.5,200,210,210,125,130,137.5,137.5,215,227.5,-252.5,227.5,575,TX,Raw,SBD,14
Charles Gonzales #1,M,MR-O,110,105.7,170,182.5,192.5,192.5,130,137.5,-140,137.5,210,225,-250,225,555,TX,Raw,SBD,15
Matt Rehan,M,MR-O,110,108.1,280,290,297.5,297.5,-192.5,-192.5,-192.5,,,,,,,MO,Raw,SBD,DQ
Melvin Logan Jr,M,MR-O,110,106.5,-205,205,215,215,-185,-185,-185,,-272.5,,,,,OH,Raw,SBD,DQ
Kyle Stewart,M,MR-Jr,110,108.4,210,222.5,-230,222.5,-185,192.5,-205,192.5,265,282.5,297.5,297.5,712.5,IL,Raw,SBD,1
Will Wright,M,MR-Jr,110,109.3,227.5,242.5,255,255,-160,167.5,-172.5,167.5,260,272.5,282.5,282.5,705,AL,Raw,SBD,2
James Meador IV,M,MR-Jr,110,103,-227.5,-250,250,250,125,140,145,145,227.5,250,-272.5,250,645,TX,Raw,SBD,3
Matt Rehan,M,MR-Jr,110,108.1,280,290,297.5,297.5,-192.5,-192.5,-192.5,,,,,,,MO,Raw,SBD,DQ
Brandon Mauro,M,MR-T3,110,107.5,205,220,-230,220,150,160,-162.5,160,242.5,255,-262.5,255,635,PA,Raw,SBD,1
Todd Francisco,M,MR-T3,110,107.2,182.5,192.5,202.5,202.5,122.5,130,-137.5,130,227.5,-237.5,-240,227.5,560,PA,Raw,SBD,2
Ron Lloyd,M,MR-M1a,110,108.8,237.5,242.5,-247.5,242.5,172.5,177.5,-185,177.5,280,-285,-285,280,700,TX,Raw,SBD,1
Mike Woody,M,MR-M1a,110,106.1,217.5,227.5,232.5,232.5,130,137.5,140,140,275,285,-295,285,657.5,IN,Raw,SBD,2
Phillip Wylie,M,MR-M1b,110,109.2,210,227.5,237.5,237.5,160,165,-170,165,250,272.5,-287.5,272.5,675,TX,Raw,SBD,1
William Wilke,M,MR-M1b,110,108.6,-142.5,147.5,172.5,172.5,125,137.5,142.5,142.5,205,230,247.5,247.5,562.5,WA,Raw,SBD,2
Pat Roberts #1,M,MR-M2a,110,107.4,190,220,235,235,132.5,150,157.5,157.5,270,292.5,-312.5,292.5,685,TX,Raw,SBD,1
Al Wood,M,MR-M3a,110,105.9,150,160,-170,160,90,100,-110,100,177.5,187.5,-207.5,187.5,447.5,TX,Raw,SBD,1
Jared Seaman,M,MR-MO,110,109.7,165,-177.5,182.5,182.5,-142.5,147.5,150,150,177.5,185,190,190,522.5,TX,Raw,SBD,1
William Wilke,M,MR-PF,110,108.6,-142.5,147.5,172.5,172.5,125,137.5,142.5,142.5,205,230,247.5,247.5,,WA,Raw,SBD,DQ
James Meador IV,M,MR-C,110,103,-227.5,-250,250,250,125,140,145,145,227.5,250,-272.5,250,645,TX,Raw,SBD,1
Matt Rehan,M,MR-C,110,108.1,280,290,297.5,297.5,-192.5,-192.5,-192.5,,,,,,,MO,Raw,SBD,DQ
Michael Tuchscherer,M,MR-O,125,120,310,330,337.5,337.5,182.5,197.5,205,205,342.5,365,-372.5,365,907.5,ND,Raw,SBD,1
Mike Hedlesky,M,MR-O,125,122,265,275,-280,275,180,-190,,180,332.5,350,-365,350,805,MD,Raw,SBD,2
Ryan Gill,M,MR-O,125,121.3,245,267.5,-272.5,267.5,-167.5,182.5,190,190,260,282.5,-290,282.5,740,PA,Raw,SBD,3
Ethan Farkas,M,MR-O,125,122.3,227.5,235,252.5,252.5,152.5,160,-167.5,160,260,282.5,292.5,292.5,705,PA,Raw,SBD,4
Randy Cairns,M,MR-O,125,124,235,250,267.5,267.5,137.5,150,-157.5,150,250,267.5,-277.5,267.5,685,MI,Raw,SBD,5
Michael Battaglino,M,MR-O,125,124,240,252.5,260,260,147.5,-155,-155,147.5,255,277.5,-290,277.5,685,TX,Raw,SBD,6
Harry Derr III,M,MR-O,125,110.4,197.5,207.5,217.5,217.5,137.5,142.5,155,155,202.5,217.5,230,230,602.5,MD,Raw,SBD,7
Sean Culnan,M,MR-O,125,123.6,255,-265,,255,170,182.5,187.5,187.5,-300,-300,,,,NY,Raw,SBD,DQ
Bryan Boulder,M,MR-Jr,125,119.7,242.5,-260,260,260,152.5,162.5,165,165,252.5,265,272.5,272.5,697.5,PA,Raw,SBD,1
Randy Cairns,M,MR-M1b,125,124,235,250,267.5,267.5,137.5,150,-157.5,150,250,267.5,-277.5,267.5,685,MI,Raw,SBD,1
Rodney Lubojasky,M,MR-M2a,125,123,185,-195,-195,185,120,127.5,132.5,132.5,215,222.5,230,230,547.5,TX,Raw,SBD,1
Randall Harris,M,MR-O,125+,163,295,330,345,345,227.5,-235,235,235,320,340,372.5,372.5,952.5,TX,Raw,SBD,1
Brad Gillingham,M,MR-O,125+,151.1,300,320,-330,320,230,-235,235,235,345,365,382.5,382.5,937.5,MN,Raw,SBD,2
Dennis Hulslander,M,MR-O,125+,147,277.5,295,305,305,142.5,182.5,195,195,312.5,327.5,337.5,337.5,837.5,PA,Raw,SBD,3
Matt Baller,M,MR-O,125+,133.4,250,270,287.5,287.5,225,242.5,247.5,247.5,230,252.5,267.5,267.5,802.5,AK,Raw,SBD,4
Chris Crisman,M,MR-O,125+,175.4,295,-320,320,320,185,197.5,202.5,202.5,267.5,-280,280,280,802.5,IN,Raw,SBD,5
Chris Riley,M,MR-O,125+,138,280,292.5,-300,292.5,165,-175,175,175,277.5,302.5,322.5,322.5,790,TX,Raw,SBD,6
Lewis Boone,M,MR-O,125+,137.4,240,250,260,260,185,192.5,200,200,295,-307.5,320,320,780,OK,Raw,SBD,7
Luke Klein,M,MR-Jr,125+,155.7,260,275,282.5,282.5,172.5,177.5,182.5,182.5,270,290,302.5,302.5,767.5,MN,Raw,SBD,1
Matt Hinkle,M,MR-Jr,125+,166.9,-210,210,227.5,227.5,-137.5,-137.5,-137.5,,-242.5,,,,,TX,Raw,SBD,DQ
Michael M. Reyes,M,MR-T2,125+,151.2,240,-275,-277.5,240,110,132.5,140,140,205,225,-252.5,225,605,TX,Raw,SBD,1
Raul Loza,M,MR-T2,125+,130.1,192.5,205,235,235,100,122.5,132.5,132.5,185,200,-225,200,567.5,TX,Raw,SBD,2
Callistus Schissel,M,MR-M1a,125+,138.8,250,-272.5,-272.5,250,205,-227.5,-227.5,205,250,260,-272.5,260,715,MN,Raw,SBD,1
Marzell Pink,M,MR-M1a,125+,130.3,205,-240,240,240,185,192.5,197.5,197.5,245,-272.5,-272.5,245,682.5,OH,Raw,SBD,2
Eric Harper,M,MR-M1b,125+,130,277.5,287.5,295,295,185,197.5,205,205,250,262.5,272.5,272.5,772.5,MD,Raw,SBD,1
William E Duncan,M,MR-M2a,125+,172.6,217.5,230,-252.5,230,125,132.5,-137.5,132.5,220,230,242.5,242.5,605,MO,Raw,SBD,1
Lewis Boone,M,MR-MO,125+,137.4,240,250,260,260,185,192.5,200,200,295,-307.5,320,320,780,OK,Raw,SBD,1
