\relax 
\providecommand\hyper@newdestlabel[2]{}
\providecommand\HyperFirstAtBeginDocument{\AtBeginDocument}
\HyperFirstAtBeginDocument{\ifx\hyper@anchor\@undefined
\global\let\oldcontentsline\contentsline
\gdef\contentsline#1#2#3#4{\oldcontentsline{#1}{#2}{#3}}
\global\let\oldnewlabel\newlabel
\gdef\newlabel#1#2{\newlabelxx{#1}#2}
\gdef\newlabelxx#1#2#3#4#5#6{\oldnewlabel{#1}{{#2}{#3}}}
\AtEndDocument{\ifx\hyper@anchor\@undefined
\let\contentsline\oldcontentsline
\let\newlabel\oldnewlabel
\fi}
\fi}
\global\let\hyper@last\relax 
\gdef\HyperFirstAtBeginDocument#1{#1}
\providecommand\HyField@AuxAddToFields[1]{}
\providecommand\HyField@AuxAddToCoFields[2]{}
\@writefile{toc}{\contentsline {section}{\numberline {1}HTTPer}{1}{section.1}\protected@file@percent }
\@writefile{toc}{\contentsline {subsection}{\numberline {1.1}Functions}{1}{subsection.1.1}\protected@file@percent }
\@writefile{toc}{\contentsline {subsection}{\numberline {1.2}Objects and Data Structures}{2}{subsection.1.2}\protected@file@percent }
\gdef\minted@oldcachelist{,
  default-pyg-prefix.pygstyle,
  default.pygstyle,
  7C84AA407DFF8F0C07F4329DA1E2E4E65D92552B38925030F6419CF40A29D76B.pygtex,
  F19252F343C06E957B4D7775B5242DB05D92552B38925030F6419CF40A29D76B.pygtex,
  3AD4A18D4549093ECC2D84B026DA61BE5D92552B38925030F6419CF40A29D76B.pygtex,
  AB8A06EECBC67122684BB7396A14401B5D92552B38925030F6419CF40A29D76B.pygtex}
\@writefile{toc}{\contentsline {subsection}{\numberline {1.3}Classes}{4}{subsection.1.3}\protected@file@percent }
\@writefile{toc}{\contentsline {subsection}{\numberline {1.4}Meaningful Names}{4}{subsection.1.4}\protected@file@percent }
\@writefile{toc}{\contentsline {subsection}{\numberline {1.5}Comments}{4}{subsection.1.5}\protected@file@percent }
\gdef \@abspage@last{4}
