PWD /home/coccafukuda/repos/gitlab.com/_joao.fukuda/notes/classes/EngenhariaDeSistemasDeInformação/Atividade01/texto
INPUT /usr/share/texmf-dist/web2c/texmf.cnf
INPUT /var/lib/texmf/web2c/pdftex/pdflatex.fmt
INPUT texto.tex
OUTPUT texto.log
INPUT /usr/share/texmf-dist/tex/latex/paper/paper.cls
INPUT /usr/share/texmf-dist/tex/latex/paper/paper.cls
INPUT /usr/share/texmf-dist/tex/latex/paper/paper.cls
INPUT /usr/share/texmf-dist/tex/latex/paper/paper.cls
INPUT /usr/share/texmf-dist/tex/latex/paper/paper.cls
INPUT /usr/share/texmf-dist/tex/latex/paper/paper.cls
INPUT /usr/share/texmf-dist/tex/latex/paper/paper.cls
INPUT /usr/share/texmf-dist/tex/latex/paper/paper.cls
INPUT /usr/share/texmf-dist/tex/latex/paper/paper.cls
INPUT /usr/share/texmf-dist/tex/latex/paper/paper.cls
INPUT /usr/share/texmf-dist/tex/latex/paper/paper.cls
INPUT /usr/share/texmf-dist/tex/latex/base/size10.clo
INPUT /usr/share/texmf-dist/tex/latex/base/size10.clo
INPUT /usr/share/texmf-dist/tex/latex/base/size10.clo
INPUT /usr/share/texmf-dist/tex/latex/base/size10.clo
INPUT /usr/share/texmf-dist/tex/latex/hyperref/hyperref.sty
INPUT /usr/share/texmf-dist/tex/latex/hyperref/hyperref.sty
INPUT /usr/share/texmf-dist/tex/latex/hyperref/hyperref.sty
INPUT /usr/share/texmf-dist/tex/latex/hyperref/hyperref.sty
INPUT /usr/share/texmf-dist/tex/latex/hyperref/hyperref.sty
INPUT /usr/share/texmf-dist/tex/latex/hyperref/hyperref.sty
INPUT /usr/share/texmf-dist/tex/latex/hyperref/hyperref.sty
INPUT /usr/share/texmf-dist/tex/latex/hyperref/hyperref.sty
INPUT /usr/share/texmf-dist/tex/latex/hyperref/hyperref.sty
INPUT /usr/share/texmf-dist/tex/latex/hyperref/hyperref.sty
INPUT /usr/share/texmf-dist/tex/latex/hyperref/hyperref.sty
INPUT /usr/share/texmf-dist/tex/generic/ltxcmds/ltxcmds.sty
INPUT /usr/share/texmf-dist/tex/generic/ltxcmds/ltxcmds.sty
INPUT /usr/share/texmf-dist/tex/generic/ltxcmds/ltxcmds.sty
INPUT /usr/share/texmf-dist/tex/generic/ltxcmds/ltxcmds.sty
INPUT /usr/share/texmf-dist/tex/generic/ltxcmds/ltxcmds.sty
INPUT /usr/share/texmf-dist/tex/generic/ltxcmds/ltxcmds.sty
INPUT /usr/share/texmf-dist/tex/generic/ltxcmds/ltxcmds.sty
INPUT /usr/share/texmf-dist/tex/generic/ltxcmds/ltxcmds.sty
INPUT /usr/share/texmf-dist/tex/generic/ltxcmds/ltxcmds.sty
INPUT /usr/share/texmf-dist/tex/generic/ltxcmds/ltxcmds.sty
INPUT /usr/share/texmf-dist/tex/generic/ltxcmds/ltxcmds.sty
INPUT /usr/share/texmf-dist/tex/generic/iftex/iftex.sty
INPUT /usr/share/texmf-dist/tex/generic/iftex/iftex.sty
INPUT /usr/share/texmf-dist/tex/generic/iftex/iftex.sty
INPUT /usr/share/texmf-dist/tex/generic/iftex/iftex.sty
INPUT /usr/share/texmf-dist/tex/generic/iftex/iftex.sty
INPUT /usr/share/texmf-dist/tex/generic/iftex/iftex.sty
INPUT /usr/share/texmf-dist/tex/generic/iftex/iftex.sty
INPUT /usr/share/texmf-dist/tex/generic/iftex/iftex.sty
INPUT /usr/share/texmf-dist/tex/generic/iftex/iftex.sty
INPUT /usr/share/texmf-dist/tex/generic/iftex/iftex.sty
INPUT /usr/share/texmf-dist/tex/generic/iftex/iftex.sty
INPUT /usr/share/texmf-dist/tex/generic/pdftexcmds/pdftexcmds.sty
INPUT /usr/share/texmf-dist/tex/generic/pdftexcmds/pdftexcmds.sty
INPUT /usr/share/texmf-dist/tex/generic/pdftexcmds/pdftexcmds.sty
INPUT /usr/share/texmf-dist/tex/generic/pdftexcmds/pdftexcmds.sty
INPUT /usr/share/texmf-dist/tex/generic/pdftexcmds/pdftexcmds.sty
INPUT /usr/share/texmf-dist/tex/generic/pdftexcmds/pdftexcmds.sty
INPUT /usr/share/texmf-dist/tex/generic/pdftexcmds/pdftexcmds.sty
INPUT /usr/share/texmf-dist/tex/generic/pdftexcmds/pdftexcmds.sty
INPUT /usr/share/texmf-dist/tex/generic/pdftexcmds/pdftexcmds.sty
INPUT /usr/share/texmf-dist/tex/generic/pdftexcmds/pdftexcmds.sty
INPUT /usr/share/texmf-dist/tex/generic/pdftexcmds/pdftexcmds.sty
INPUT /usr/share/texmf-dist/tex/generic/infwarerr/infwarerr.sty
INPUT /usr/share/texmf-dist/tex/generic/infwarerr/infwarerr.sty
INPUT /usr/share/texmf-dist/tex/generic/infwarerr/infwarerr.sty
INPUT /usr/share/texmf-dist/tex/generic/infwarerr/infwarerr.sty
INPUT /usr/share/texmf-dist/tex/generic/infwarerr/infwarerr.sty
INPUT /usr/share/texmf-dist/tex/generic/infwarerr/infwarerr.sty
INPUT /usr/share/texmf-dist/tex/generic/infwarerr/infwarerr.sty
INPUT /usr/share/texmf-dist/tex/generic/infwarerr/infwarerr.sty
INPUT /usr/share/texmf-dist/tex/generic/infwarerr/infwarerr.sty
INPUT /usr/share/texmf-dist/tex/generic/infwarerr/infwarerr.sty
INPUT /usr/share/texmf-dist/tex/generic/infwarerr/infwarerr.sty
INPUT /usr/share/texmf-dist/tex/generic/iftex/iftex.sty
INPUT /usr/share/texmf-dist/tex/generic/ltxcmds/ltxcmds.sty
INPUT /usr/share/texmf-dist/tex/generic/infwarerr/infwarerr.sty
INPUT /usr/share/texmf-dist/tex/latex/graphics/keyval.sty
INPUT /usr/share/texmf-dist/tex/latex/graphics/keyval.sty
INPUT /usr/share/texmf-dist/tex/latex/graphics/keyval.sty
INPUT /usr/share/texmf-dist/tex/latex/graphics/keyval.sty
INPUT /usr/share/texmf-dist/tex/latex/graphics/keyval.sty
INPUT /usr/share/texmf-dist/tex/latex/graphics/keyval.sty
INPUT /usr/share/texmf-dist/tex/latex/graphics/keyval.sty
INPUT /usr/share/texmf-dist/tex/latex/graphics/keyval.sty
INPUT /usr/share/texmf-dist/tex/latex/graphics/keyval.sty
INPUT /usr/share/texmf-dist/tex/latex/graphics/keyval.sty
INPUT /usr/share/texmf-dist/tex/latex/graphics/keyval.sty
INPUT /usr/share/texmf-dist/tex/generic/kvsetkeys/kvsetkeys.sty
INPUT /usr/share/texmf-dist/tex/generic/kvsetkeys/kvsetkeys.sty
INPUT /usr/share/texmf-dist/tex/generic/kvsetkeys/kvsetkeys.sty
INPUT /usr/share/texmf-dist/tex/generic/kvsetkeys/kvsetkeys.sty
INPUT /usr/share/texmf-dist/tex/generic/kvsetkeys/kvsetkeys.sty
INPUT /usr/share/texmf-dist/tex/generic/kvsetkeys/kvsetkeys.sty
INPUT /usr/share/texmf-dist/tex/generic/kvsetkeys/kvsetkeys.sty
INPUT /usr/share/texmf-dist/tex/generic/kvsetkeys/kvsetkeys.sty
INPUT /usr/share/texmf-dist/tex/generic/kvsetkeys/kvsetkeys.sty
INPUT /usr/share/texmf-dist/tex/generic/kvsetkeys/kvsetkeys.sty
INPUT /usr/share/texmf-dist/tex/generic/kvsetkeys/kvsetkeys.sty
INPUT /usr/share/texmf-dist/tex/generic/kvdefinekeys/kvdefinekeys.sty
INPUT /usr/share/texmf-dist/tex/generic/kvdefinekeys/kvdefinekeys.sty
INPUT /usr/share/texmf-dist/tex/generic/kvdefinekeys/kvdefinekeys.sty
INPUT /usr/share/texmf-dist/tex/generic/kvdefinekeys/kvdefinekeys.sty
INPUT /usr/share/texmf-dist/tex/generic/kvdefinekeys/kvdefinekeys.sty
INPUT /usr/share/texmf-dist/tex/generic/kvdefinekeys/kvdefinekeys.sty
INPUT /usr/share/texmf-dist/tex/generic/kvdefinekeys/kvdefinekeys.sty
INPUT /usr/share/texmf-dist/tex/generic/kvdefinekeys/kvdefinekeys.sty
INPUT /usr/share/texmf-dist/tex/generic/kvdefinekeys/kvdefinekeys.sty
INPUT /usr/share/texmf-dist/tex/generic/kvdefinekeys/kvdefinekeys.sty
INPUT /usr/share/texmf-dist/tex/generic/kvdefinekeys/kvdefinekeys.sty
INPUT /usr/share/texmf-dist/tex/generic/pdfescape/pdfescape.sty
INPUT /usr/share/texmf-dist/tex/generic/pdfescape/pdfescape.sty
INPUT /usr/share/texmf-dist/tex/generic/pdfescape/pdfescape.sty
INPUT /usr/share/texmf-dist/tex/generic/pdfescape/pdfescape.sty
INPUT /usr/share/texmf-dist/tex/generic/pdfescape/pdfescape.sty
INPUT /usr/share/texmf-dist/tex/generic/pdfescape/pdfescape.sty
INPUT /usr/share/texmf-dist/tex/generic/pdfescape/pdfescape.sty
INPUT /usr/share/texmf-dist/tex/generic/pdfescape/pdfescape.sty
INPUT /usr/share/texmf-dist/tex/generic/pdfescape/pdfescape.sty
INPUT /usr/share/texmf-dist/tex/generic/pdfescape/pdfescape.sty
INPUT /usr/share/texmf-dist/tex/generic/pdfescape/pdfescape.sty
INPUT /usr/share/texmf-dist/tex/generic/ltxcmds/ltxcmds.sty
INPUT /usr/share/texmf-dist/tex/generic/pdftexcmds/pdftexcmds.sty
INPUT /usr/share/texmf-dist/tex/latex/hycolor/hycolor.sty
INPUT /usr/share/texmf-dist/tex/latex/hycolor/hycolor.sty
INPUT /usr/share/texmf-dist/tex/latex/hycolor/hycolor.sty
INPUT /usr/share/texmf-dist/tex/latex/hycolor/hycolor.sty
INPUT /usr/share/texmf-dist/tex/latex/hycolor/hycolor.sty
INPUT /usr/share/texmf-dist/tex/latex/hycolor/hycolor.sty
INPUT /usr/share/texmf-dist/tex/latex/hycolor/hycolor.sty
INPUT /usr/share/texmf-dist/tex/latex/hycolor/hycolor.sty
INPUT /usr/share/texmf-dist/tex/latex/hycolor/hycolor.sty
INPUT /usr/share/texmf-dist/tex/latex/hycolor/hycolor.sty
INPUT /usr/share/texmf-dist/tex/latex/hycolor/hycolor.sty
INPUT /usr/share/texmf-dist/tex/latex/letltxmacro/letltxmacro.sty
INPUT /usr/share/texmf-dist/tex/latex/letltxmacro/letltxmacro.sty
INPUT /usr/share/texmf-dist/tex/latex/letltxmacro/letltxmacro.sty
INPUT /usr/share/texmf-dist/tex/latex/letltxmacro/letltxmacro.sty
INPUT /usr/share/texmf-dist/tex/latex/letltxmacro/letltxmacro.sty
INPUT /usr/share/texmf-dist/tex/latex/letltxmacro/letltxmacro.sty
INPUT /usr/share/texmf-dist/tex/latex/letltxmacro/letltxmacro.sty
INPUT /usr/share/texmf-dist/tex/latex/letltxmacro/letltxmacro.sty
INPUT /usr/share/texmf-dist/tex/latex/letltxmacro/letltxmacro.sty
INPUT /usr/share/texmf-dist/tex/latex/letltxmacro/letltxmacro.sty
INPUT /usr/share/texmf-dist/tex/latex/letltxmacro/letltxmacro.sty
INPUT /usr/share/texmf-dist/tex/latex/auxhook/auxhook.sty
INPUT /usr/share/texmf-dist/tex/latex/auxhook/auxhook.sty
INPUT /usr/share/texmf-dist/tex/latex/auxhook/auxhook.sty
INPUT /usr/share/texmf-dist/tex/latex/auxhook/auxhook.sty
INPUT /usr/share/texmf-dist/tex/latex/auxhook/auxhook.sty
INPUT /usr/share/texmf-dist/tex/latex/auxhook/auxhook.sty
INPUT /usr/share/texmf-dist/tex/latex/auxhook/auxhook.sty
INPUT /usr/share/texmf-dist/tex/latex/auxhook/auxhook.sty
INPUT /usr/share/texmf-dist/tex/latex/auxhook/auxhook.sty
INPUT /usr/share/texmf-dist/tex/latex/auxhook/auxhook.sty
INPUT /usr/share/texmf-dist/tex/latex/auxhook/auxhook.sty
INPUT /usr/share/texmf-dist/tex/latex/kvoptions/kvoptions.sty
INPUT /usr/share/texmf-dist/tex/latex/kvoptions/kvoptions.sty
INPUT /usr/share/texmf-dist/tex/latex/kvoptions/kvoptions.sty
INPUT /usr/share/texmf-dist/tex/latex/kvoptions/kvoptions.sty
INPUT /usr/share/texmf-dist/tex/latex/kvoptions/kvoptions.sty
INPUT /usr/share/texmf-dist/tex/latex/kvoptions/kvoptions.sty
INPUT /usr/share/texmf-dist/tex/latex/kvoptions/kvoptions.sty
INPUT /usr/share/texmf-dist/tex/latex/kvoptions/kvoptions.sty
INPUT /usr/share/texmf-dist/tex/latex/kvoptions/kvoptions.sty
INPUT /usr/share/texmf-dist/tex/latex/kvoptions/kvoptions.sty
INPUT /usr/share/texmf-dist/tex/latex/kvoptions/kvoptions.sty
INPUT /usr/share/texmf-dist/tex/generic/ltxcmds/ltxcmds.sty
INPUT /usr/share/texmf-dist/tex/generic/kvsetkeys/kvsetkeys.sty
INPUT /usr/share/texmf-dist/tex/latex/hyperref/pd1enc.def
INPUT /usr/share/texmf-dist/tex/latex/hyperref/pd1enc.def
INPUT /usr/share/texmf-dist/tex/latex/hyperref/pd1enc.def
INPUT /usr/share/texmf-dist/tex/latex/hyperref/pd1enc.def
INPUT /usr/share/texmf-dist/tex/latex/hyperref/hyperref-langpatches.def
INPUT /usr/share/texmf-dist/tex/latex/hyperref/hyperref-langpatches.def
INPUT /usr/share/texmf-dist/tex/latex/hyperref/hyperref-langpatches.def
INPUT /usr/share/texmf-dist/tex/latex/hyperref/hyperref-langpatches.def
INPUT /usr/share/texmf-dist/tex/generic/intcalc/intcalc.sty
INPUT /usr/share/texmf-dist/tex/generic/intcalc/intcalc.sty
INPUT /usr/share/texmf-dist/tex/generic/intcalc/intcalc.sty
INPUT /usr/share/texmf-dist/tex/generic/intcalc/intcalc.sty
INPUT /usr/share/texmf-dist/tex/generic/intcalc/intcalc.sty
INPUT /usr/share/texmf-dist/tex/generic/intcalc/intcalc.sty
INPUT /usr/share/texmf-dist/tex/generic/intcalc/intcalc.sty
INPUT /usr/share/texmf-dist/tex/generic/intcalc/intcalc.sty
INPUT /usr/share/texmf-dist/tex/generic/intcalc/intcalc.sty
INPUT /usr/share/texmf-dist/tex/generic/intcalc/intcalc.sty
INPUT /usr/share/texmf-dist/tex/generic/intcalc/intcalc.sty
INPUT /usr/share/texmf-dist/tex/generic/etexcmds/etexcmds.sty
INPUT /usr/share/texmf-dist/tex/generic/etexcmds/etexcmds.sty
INPUT /usr/share/texmf-dist/tex/generic/etexcmds/etexcmds.sty
INPUT /usr/share/texmf-dist/tex/generic/etexcmds/etexcmds.sty
INPUT /usr/share/texmf-dist/tex/generic/etexcmds/etexcmds.sty
INPUT /usr/share/texmf-dist/tex/generic/etexcmds/etexcmds.sty
INPUT /usr/share/texmf-dist/tex/generic/etexcmds/etexcmds.sty
INPUT /usr/share/texmf-dist/tex/generic/etexcmds/etexcmds.sty
INPUT /usr/share/texmf-dist/tex/generic/etexcmds/etexcmds.sty
INPUT /usr/share/texmf-dist/tex/generic/etexcmds/etexcmds.sty
INPUT /usr/share/texmf-dist/tex/generic/etexcmds/etexcmds.sty
INPUT /usr/share/texmf-dist/tex/generic/infwarerr/infwarerr.sty
INPUT /usr/share/texmf-dist/tex/generic/iftex/iftex.sty
INPUT /usr/share/texmf-dist/tex/latex/hyperref/puenc.def
INPUT /usr/share/texmf-dist/tex/latex/hyperref/puenc.def
INPUT /usr/share/texmf-dist/tex/latex/hyperref/puenc.def
INPUT /usr/share/texmf-dist/tex/latex/hyperref/puenc.def
INPUT /usr/share/texmf-dist/tex/latex/url/url.sty
INPUT /usr/share/texmf-dist/tex/latex/url/url.sty
INPUT /usr/share/texmf-dist/tex/latex/url/url.sty
INPUT /usr/share/texmf-dist/tex/latex/url/url.sty
INPUT /usr/share/texmf-dist/tex/latex/url/url.sty
INPUT /usr/share/texmf-dist/tex/latex/url/url.sty
INPUT /usr/share/texmf-dist/tex/latex/url/url.sty
INPUT /usr/share/texmf-dist/tex/latex/url/url.sty
INPUT /usr/share/texmf-dist/tex/latex/url/url.sty
INPUT /usr/share/texmf-dist/tex/latex/url/url.sty
INPUT /usr/share/texmf-dist/tex/latex/url/url.sty
INPUT /usr/share/texmf-dist/tex/generic/bitset/bitset.sty
INPUT /usr/share/texmf-dist/tex/generic/bitset/bitset.sty
INPUT /usr/share/texmf-dist/tex/generic/bitset/bitset.sty
INPUT /usr/share/texmf-dist/tex/generic/bitset/bitset.sty
INPUT /usr/share/texmf-dist/tex/generic/bitset/bitset.sty
INPUT /usr/share/texmf-dist/tex/generic/bitset/bitset.sty
INPUT /usr/share/texmf-dist/tex/generic/bitset/bitset.sty
INPUT /usr/share/texmf-dist/tex/generic/bitset/bitset.sty
INPUT /usr/share/texmf-dist/tex/generic/bitset/bitset.sty
INPUT /usr/share/texmf-dist/tex/generic/bitset/bitset.sty
INPUT /usr/share/texmf-dist/tex/generic/bitset/bitset.sty
INPUT /usr/share/texmf-dist/tex/generic/infwarerr/infwarerr.sty
INPUT /usr/share/texmf-dist/tex/generic/intcalc/intcalc.sty
INPUT /usr/share/texmf-dist/tex/generic/bigintcalc/bigintcalc.sty
INPUT /usr/share/texmf-dist/tex/generic/bigintcalc/bigintcalc.sty
INPUT /usr/share/texmf-dist/tex/generic/bigintcalc/bigintcalc.sty
INPUT /usr/share/texmf-dist/tex/generic/bigintcalc/bigintcalc.sty
INPUT /usr/share/texmf-dist/tex/generic/bigintcalc/bigintcalc.sty
INPUT /usr/share/texmf-dist/tex/generic/bigintcalc/bigintcalc.sty
INPUT /usr/share/texmf-dist/tex/generic/bigintcalc/bigintcalc.sty
INPUT /usr/share/texmf-dist/tex/generic/bigintcalc/bigintcalc.sty
INPUT /usr/share/texmf-dist/tex/generic/bigintcalc/bigintcalc.sty
INPUT /usr/share/texmf-dist/tex/generic/bigintcalc/bigintcalc.sty
INPUT /usr/share/texmf-dist/tex/generic/bigintcalc/bigintcalc.sty
INPUT /usr/share/texmf-dist/tex/generic/pdftexcmds/pdftexcmds.sty
INPUT /usr/share/texmf-dist/tex/generic/atbegshi/atbegshi.sty
INPUT /usr/share/texmf-dist/tex/generic/atbegshi/atbegshi.sty
INPUT /usr/share/texmf-dist/tex/generic/atbegshi/atbegshi.sty
INPUT /usr/share/texmf-dist/tex/latex/base/atbegshi-ltx.sty
INPUT /usr/share/texmf-dist/tex/generic/atbegshi/atbegshi.sty
INPUT /usr/share/texmf-dist/tex/generic/atbegshi/atbegshi.sty
INPUT /usr/share/texmf-dist/tex/latex/base/atbegshi-ltx.sty
INPUT /usr/share/texmf-dist/tex/generic/atbegshi/atbegshi.sty
INPUT /usr/share/texmf-dist/tex/latex/base/atbegshi-ltx.sty
INPUT /usr/share/texmf-dist/tex/latex/base/atbegshi-ltx.sty
INPUT /usr/share/texmf-dist/tex/generic/atbegshi/atbegshi.sty
INPUT /usr/share/texmf-dist/tex/generic/atbegshi/atbegshi.sty
INPUT /usr/share/texmf-dist/tex/latex/base/atbegshi-ltx.sty
INPUT /usr/share/texmf-dist/tex/latex/base/atbegshi-ltx.sty
INPUT /usr/share/texmf-dist/tex/generic/atbegshi/atbegshi.sty
INPUT /usr/share/texmf-dist/tex/latex/base/atbegshi-ltx.sty
INPUT /usr/share/texmf-dist/tex/latex/hyperref/hpdftex.def
INPUT /usr/share/texmf-dist/tex/latex/hyperref/hpdftex.def
INPUT /usr/share/texmf-dist/tex/latex/hyperref/hpdftex.def
INPUT /usr/share/texmf-dist/tex/latex/hyperref/hpdftex.def
INPUT /usr/share/texmf-dist/tex/latex/atveryend/atveryend.sty
INPUT /usr/share/texmf-dist/tex/latex/atveryend/atveryend.sty
INPUT /usr/share/texmf-dist/tex/latex/atveryend/atveryend.sty
INPUT /usr/share/texmf-dist/tex/latex/base/atveryend-ltx.sty
INPUT /usr/share/texmf-dist/tex/latex/atveryend/atveryend.sty
INPUT /usr/share/texmf-dist/tex/latex/atveryend/atveryend.sty
INPUT /usr/share/texmf-dist/tex/latex/base/atveryend-ltx.sty
INPUT /usr/share/texmf-dist/tex/latex/atveryend/atveryend.sty
INPUT /usr/share/texmf-dist/tex/latex/base/atveryend-ltx.sty
INPUT /usr/share/texmf-dist/tex/latex/base/atveryend-ltx.sty
INPUT /usr/share/texmf-dist/tex/latex/atveryend/atveryend.sty
INPUT /usr/share/texmf-dist/tex/latex/atveryend/atveryend.sty
INPUT /usr/share/texmf-dist/tex/latex/base/atveryend-ltx.sty
INPUT /usr/share/texmf-dist/tex/latex/base/atveryend-ltx.sty
INPUT /usr/share/texmf-dist/tex/latex/atveryend/atveryend.sty
INPUT /usr/share/texmf-dist/tex/latex/base/atveryend-ltx.sty
INPUT /usr/share/texmf-dist/tex/latex/rerunfilecheck/rerunfilecheck.sty
INPUT /usr/share/texmf-dist/tex/latex/rerunfilecheck/rerunfilecheck.sty
INPUT /usr/share/texmf-dist/tex/latex/rerunfilecheck/rerunfilecheck.sty
INPUT /usr/share/texmf-dist/tex/latex/rerunfilecheck/rerunfilecheck.sty
INPUT /usr/share/texmf-dist/tex/latex/rerunfilecheck/rerunfilecheck.sty
INPUT /usr/share/texmf-dist/tex/latex/rerunfilecheck/rerunfilecheck.sty
INPUT /usr/share/texmf-dist/tex/latex/rerunfilecheck/rerunfilecheck.sty
INPUT /usr/share/texmf-dist/tex/latex/rerunfilecheck/rerunfilecheck.sty
INPUT /usr/share/texmf-dist/tex/latex/rerunfilecheck/rerunfilecheck.sty
INPUT /usr/share/texmf-dist/tex/latex/rerunfilecheck/rerunfilecheck.sty
INPUT /usr/share/texmf-dist/tex/latex/rerunfilecheck/rerunfilecheck.sty
INPUT /usr/share/texmf-dist/tex/latex/kvoptions/kvoptions.sty
INPUT /usr/share/texmf-dist/tex/generic/infwarerr/infwarerr.sty
INPUT /usr/share/texmf-dist/tex/generic/pdftexcmds/pdftexcmds.sty
INPUT /usr/share/texmf-dist/tex/latex/atveryend/atveryend.sty
INPUT /usr/share/texmf-dist/tex/generic/uniquecounter/uniquecounter.sty
INPUT /usr/share/texmf-dist/tex/generic/uniquecounter/uniquecounter.sty
INPUT /usr/share/texmf-dist/tex/generic/uniquecounter/uniquecounter.sty
INPUT /usr/share/texmf-dist/tex/generic/uniquecounter/uniquecounter.sty
INPUT /usr/share/texmf-dist/tex/generic/uniquecounter/uniquecounter.sty
INPUT /usr/share/texmf-dist/tex/generic/uniquecounter/uniquecounter.sty
INPUT /usr/share/texmf-dist/tex/generic/uniquecounter/uniquecounter.sty
INPUT /usr/share/texmf-dist/tex/generic/uniquecounter/uniquecounter.sty
INPUT /usr/share/texmf-dist/tex/generic/uniquecounter/uniquecounter.sty
INPUT /usr/share/texmf-dist/tex/generic/uniquecounter/uniquecounter.sty
INPUT /usr/share/texmf-dist/tex/generic/uniquecounter/uniquecounter.sty
INPUT /usr/share/texmf-dist/tex/generic/bigintcalc/bigintcalc.sty
INPUT /usr/share/texmf-dist/tex/generic/infwarerr/infwarerr.sty
INPUT /usr/share/texmf-dist/tex/latex/minted/minted.sty
INPUT /usr/share/texmf-dist/tex/latex/minted/minted.sty
INPUT /usr/share/texmf-dist/tex/latex/minted/minted.sty
INPUT /usr/share/texmf-dist/tex/latex/minted/minted.sty
INPUT /usr/share/texmf-dist/tex/latex/minted/minted.sty
INPUT /usr/share/texmf-dist/tex/latex/minted/minted.sty
INPUT /usr/share/texmf-dist/tex/latex/minted/minted.sty
INPUT /usr/share/texmf-dist/tex/latex/minted/minted.sty
INPUT /usr/share/texmf-dist/tex/latex/minted/minted.sty
INPUT /usr/share/texmf-dist/tex/latex/minted/minted.sty
INPUT /usr/share/texmf-dist/tex/latex/minted/minted.sty
INPUT /usr/share/texmf-dist/tex/latex/graphics/keyval.sty
INPUT /usr/share/texmf-dist/tex/latex/kvoptions/kvoptions.sty
INPUT /usr/share/texmf-dist/tex/latex/fvextra/fvextra.sty
INPUT /usr/share/texmf-dist/tex/latex/fvextra/fvextra.sty
INPUT /usr/share/texmf-dist/tex/latex/fvextra/fvextra.sty
INPUT /usr/share/texmf-dist/tex/latex/fvextra/fvextra.sty
INPUT /usr/share/texmf-dist/tex/latex/fvextra/fvextra.sty
INPUT /usr/share/texmf-dist/tex/latex/fvextra/fvextra.sty
INPUT /usr/share/texmf-dist/tex/latex/fvextra/fvextra.sty
INPUT /usr/share/texmf-dist/tex/latex/fvextra/fvextra.sty
INPUT /usr/share/texmf-dist/tex/latex/fvextra/fvextra.sty
INPUT /usr/share/texmf-dist/tex/latex/fvextra/fvextra.sty
INPUT /usr/share/texmf-dist/tex/latex/fvextra/fvextra.sty
INPUT /usr/share/texmf-dist/tex/latex/base/ifthen.sty
INPUT /usr/share/texmf-dist/tex/latex/base/ifthen.sty
INPUT /usr/share/texmf-dist/tex/latex/base/ifthen.sty
INPUT /usr/share/texmf-dist/tex/latex/base/ifthen.sty
INPUT /usr/share/texmf-dist/tex/latex/base/ifthen.sty
INPUT /usr/share/texmf-dist/tex/latex/base/ifthen.sty
INPUT /usr/share/texmf-dist/tex/latex/base/ifthen.sty
INPUT /usr/share/texmf-dist/tex/latex/base/ifthen.sty
INPUT /usr/share/texmf-dist/tex/latex/base/ifthen.sty
INPUT /usr/share/texmf-dist/tex/latex/base/ifthen.sty
INPUT /usr/share/texmf-dist/tex/latex/base/ifthen.sty
INPUT /usr/share/texmf-dist/tex/latex/etoolbox/etoolbox.sty
INPUT /usr/share/texmf-dist/tex/latex/etoolbox/etoolbox.sty
INPUT /usr/share/texmf-dist/tex/latex/etoolbox/etoolbox.sty
INPUT /usr/share/texmf-dist/tex/latex/etoolbox/etoolbox.sty
INPUT /usr/share/texmf-dist/tex/latex/etoolbox/etoolbox.sty
INPUT /usr/share/texmf-dist/tex/latex/etoolbox/etoolbox.sty
INPUT /usr/share/texmf-dist/tex/latex/etoolbox/etoolbox.sty
INPUT /usr/share/texmf-dist/tex/latex/etoolbox/etoolbox.sty
INPUT /usr/share/texmf-dist/tex/latex/etoolbox/etoolbox.sty
INPUT /usr/share/texmf-dist/tex/latex/etoolbox/etoolbox.sty
INPUT /usr/share/texmf-dist/tex/latex/etoolbox/etoolbox.sty
INPUT /usr/share/texmf-dist/tex/latex/fancyvrb/fancyvrb.sty
INPUT /usr/share/texmf-dist/tex/latex/fancyvrb/fancyvrb.sty
INPUT /usr/share/texmf-dist/tex/latex/fancyvrb/fancyvrb.sty
INPUT /usr/share/texmf-dist/tex/latex/fancyvrb/fancyvrb.sty
INPUT /usr/share/texmf-dist/tex/latex/fancyvrb/fancyvrb.sty
INPUT /usr/share/texmf-dist/tex/latex/fancyvrb/fancyvrb.sty
INPUT /usr/share/texmf-dist/tex/latex/fancyvrb/fancyvrb.sty
INPUT /usr/share/texmf-dist/tex/latex/fancyvrb/fancyvrb.sty
INPUT /usr/share/texmf-dist/tex/latex/fancyvrb/fancyvrb.sty
INPUT /usr/share/texmf-dist/tex/latex/fancyvrb/fancyvrb.sty
INPUT /usr/share/texmf-dist/tex/latex/fancyvrb/fancyvrb.sty
INPUT /usr/share/texmf-dist/tex/latex/graphics/keyval.sty
INPUT /usr/share/texmf-dist/tex/latex/upquote/upquote.sty
INPUT /usr/share/texmf-dist/tex/latex/upquote/upquote.sty
INPUT /usr/share/texmf-dist/tex/latex/upquote/upquote.sty
INPUT /usr/share/texmf-dist/tex/latex/upquote/upquote.sty
INPUT /usr/share/texmf-dist/tex/latex/upquote/upquote.sty
INPUT /usr/share/texmf-dist/tex/latex/upquote/upquote.sty
INPUT /usr/share/texmf-dist/tex/latex/upquote/upquote.sty
INPUT /usr/share/texmf-dist/tex/latex/upquote/upquote.sty
INPUT /usr/share/texmf-dist/tex/latex/upquote/upquote.sty
INPUT /usr/share/texmf-dist/tex/latex/upquote/upquote.sty
INPUT /usr/share/texmf-dist/tex/latex/upquote/upquote.sty
INPUT /usr/share/texmf-dist/tex/latex/lineno/lineno.sty
INPUT /usr/share/texmf-dist/tex/latex/lineno/lineno.sty
INPUT /usr/share/texmf-dist/tex/latex/lineno/lineno.sty
INPUT /usr/share/texmf-dist/tex/latex/lineno/lineno.sty
INPUT /usr/share/texmf-dist/tex/latex/lineno/lineno.sty
INPUT /usr/share/texmf-dist/tex/latex/lineno/lineno.sty
INPUT /usr/share/texmf-dist/tex/latex/lineno/lineno.sty
INPUT /usr/share/texmf-dist/tex/latex/lineno/lineno.sty
INPUT /usr/share/texmf-dist/tex/latex/lineno/lineno.sty
INPUT /usr/share/texmf-dist/tex/latex/lineno/lineno.sty
INPUT /usr/share/texmf-dist/tex/latex/lineno/lineno.sty
INPUT /usr/share/texmf-dist/tex/latex/base/ifthen.sty
INPUT /usr/share/texmf-dist/tex/latex/tools/calc.sty
INPUT /usr/share/texmf-dist/tex/latex/tools/calc.sty
INPUT /usr/share/texmf-dist/tex/latex/tools/calc.sty
INPUT /usr/share/texmf-dist/tex/latex/tools/calc.sty
INPUT /usr/share/texmf-dist/tex/latex/tools/calc.sty
INPUT /usr/share/texmf-dist/tex/latex/tools/calc.sty
INPUT /usr/share/texmf-dist/tex/latex/tools/calc.sty
INPUT /usr/share/texmf-dist/tex/latex/tools/calc.sty
INPUT /usr/share/texmf-dist/tex/latex/tools/calc.sty
INPUT /usr/share/texmf-dist/tex/latex/tools/calc.sty
INPUT /usr/share/texmf-dist/tex/latex/tools/calc.sty
INPUT /usr/share/texmf-dist/tex/latex/tools/shellesc.sty
INPUT /usr/share/texmf-dist/tex/latex/tools/shellesc.sty
INPUT /usr/share/texmf-dist/tex/latex/tools/shellesc.sty
INPUT /usr/share/texmf-dist/tex/latex/tools/shellesc.sty
INPUT /usr/share/texmf-dist/tex/latex/tools/shellesc.sty
INPUT /usr/share/texmf-dist/tex/latex/tools/shellesc.sty
INPUT /usr/share/texmf-dist/tex/latex/tools/shellesc.sty
INPUT /usr/share/texmf-dist/tex/latex/tools/shellesc.sty
INPUT /usr/share/texmf-dist/tex/latex/tools/shellesc.sty
INPUT /usr/share/texmf-dist/tex/latex/tools/shellesc.sty
INPUT /usr/share/texmf-dist/tex/latex/tools/shellesc.sty
INPUT /usr/share/texmf-dist/tex/latex/tools/shellesc.sty
INPUT /usr/share/texmf-dist/tex/latex/tools/shellesc.sty
INPUT /usr/share/texmf-dist/tex/latex/ifplatform/ifplatform.sty
INPUT /usr/share/texmf-dist/tex/latex/ifplatform/ifplatform.sty
INPUT /usr/share/texmf-dist/tex/latex/ifplatform/ifplatform.sty
INPUT /usr/share/texmf-dist/tex/latex/ifplatform/ifplatform.sty
INPUT /usr/share/texmf-dist/tex/latex/ifplatform/ifplatform.sty
INPUT /usr/share/texmf-dist/tex/latex/ifplatform/ifplatform.sty
INPUT /usr/share/texmf-dist/tex/latex/ifplatform/ifplatform.sty
INPUT /usr/share/texmf-dist/tex/latex/ifplatform/ifplatform.sty
INPUT /usr/share/texmf-dist/tex/latex/ifplatform/ifplatform.sty
INPUT /usr/share/texmf-dist/tex/latex/ifplatform/ifplatform.sty
INPUT /usr/share/texmf-dist/tex/latex/ifplatform/ifplatform.sty
INPUT /usr/share/texmf-dist/tex/latex/tools/shellesc.sty
INPUT /usr/share/texmf-dist/tex/generic/pdftexcmds/pdftexcmds.sty
INPUT /usr/share/texmf-dist/tex/generic/catchfile/catchfile.sty
INPUT /usr/share/texmf-dist/tex/generic/catchfile/catchfile.sty
INPUT /usr/share/texmf-dist/tex/generic/catchfile/catchfile.sty
INPUT /usr/share/texmf-dist/tex/generic/catchfile/catchfile.sty
INPUT /usr/share/texmf-dist/tex/generic/catchfile/catchfile.sty
INPUT /usr/share/texmf-dist/tex/generic/catchfile/catchfile.sty
INPUT /usr/share/texmf-dist/tex/generic/catchfile/catchfile.sty
INPUT /usr/share/texmf-dist/tex/generic/catchfile/catchfile.sty
INPUT /usr/share/texmf-dist/tex/generic/catchfile/catchfile.sty
INPUT /usr/share/texmf-dist/tex/generic/catchfile/catchfile.sty
INPUT /usr/share/texmf-dist/tex/generic/catchfile/catchfile.sty
INPUT /usr/share/texmf-dist/tex/generic/infwarerr/infwarerr.sty
INPUT /usr/share/texmf-dist/tex/generic/ltxcmds/ltxcmds.sty
INPUT /usr/share/texmf-dist/tex/generic/etexcmds/etexcmds.sty
INPUT /usr/share/texmf-dist/tex/generic/iftex/ifluatex.sty
INPUT /usr/share/texmf-dist/tex/generic/iftex/ifluatex.sty
INPUT /usr/share/texmf-dist/tex/generic/iftex/ifluatex.sty
INPUT /usr/share/texmf-dist/tex/generic/iftex/ifluatex.sty
INPUT /usr/share/texmf-dist/tex/generic/iftex/ifluatex.sty
INPUT /usr/share/texmf-dist/tex/generic/iftex/ifluatex.sty
INPUT /usr/share/texmf-dist/tex/generic/iftex/ifluatex.sty
INPUT /usr/share/texmf-dist/tex/generic/iftex/ifluatex.sty
INPUT /usr/share/texmf-dist/tex/generic/iftex/ifluatex.sty
INPUT /usr/share/texmf-dist/tex/generic/iftex/ifluatex.sty
INPUT /usr/share/texmf-dist/tex/generic/iftex/ifluatex.sty
INPUT /usr/share/texmf-dist/tex/generic/iftex/iftex.sty
INPUT /dev/null
INPUT /dev/null
INPUT /dev/null
INPUT ./texto.w18
INPUT texto.w18
INPUT texto.w18
INPUT /usr/share/texmf-dist/tex/generic/pdftexcmds/pdftexcmds.sty
INPUT /usr/share/texmf-dist/tex/latex/etoolbox/etoolbox.sty
INPUT /usr/share/texmf-dist/tex/generic/xstring/xstring.sty
INPUT /usr/share/texmf-dist/tex/generic/xstring/xstring.sty
INPUT /usr/share/texmf-dist/tex/generic/xstring/xstring.sty
INPUT /usr/share/texmf-dist/tex/generic/xstring/xstring.sty
INPUT /usr/share/texmf-dist/tex/generic/xstring/xstring.sty
INPUT /usr/share/texmf-dist/tex/generic/xstring/xstring.sty
INPUT /usr/share/texmf-dist/tex/generic/xstring/xstring.sty
INPUT /usr/share/texmf-dist/tex/generic/xstring/xstring.sty
INPUT /usr/share/texmf-dist/tex/generic/xstring/xstring.sty
INPUT /usr/share/texmf-dist/tex/generic/xstring/xstring.sty
INPUT /usr/share/texmf-dist/tex/generic/xstring/xstring.sty
INPUT /usr/share/texmf-dist/tex/generic/xstring/xstring.tex
INPUT /usr/share/texmf-dist/tex/latex/lineno/lineno.sty
INPUT /usr/share/texmf-dist/tex/latex/framed/framed.sty
INPUT /usr/share/texmf-dist/tex/latex/framed/framed.sty
INPUT /usr/share/texmf-dist/tex/latex/framed/framed.sty
INPUT /usr/share/texmf-dist/tex/latex/framed/framed.sty
INPUT /usr/share/texmf-dist/tex/latex/framed/framed.sty
INPUT /usr/share/texmf-dist/tex/latex/framed/framed.sty
INPUT /usr/share/texmf-dist/tex/latex/framed/framed.sty
INPUT /usr/share/texmf-dist/tex/latex/framed/framed.sty
INPUT /usr/share/texmf-dist/tex/latex/framed/framed.sty
INPUT /usr/share/texmf-dist/tex/latex/framed/framed.sty
INPUT /usr/share/texmf-dist/tex/latex/framed/framed.sty
INPUT /usr/share/texmf-dist/tex/latex/float/float.sty
INPUT /usr/share/texmf-dist/tex/latex/float/float.sty
INPUT /usr/share/texmf-dist/tex/latex/float/float.sty
INPUT /usr/share/texmf-dist/tex/latex/float/float.sty
INPUT /usr/share/texmf-dist/tex/latex/float/float.sty
INPUT /usr/share/texmf-dist/tex/latex/float/float.sty
INPUT /usr/share/texmf-dist/tex/latex/float/float.sty
INPUT /usr/share/texmf-dist/tex/latex/float/float.sty
INPUT /usr/share/texmf-dist/tex/latex/float/float.sty
INPUT /usr/share/texmf-dist/tex/latex/float/float.sty
INPUT /usr/share/texmf-dist/tex/latex/float/float.sty
INPUT /usr/share/texmf-dist/tex/latex/xcolor/xcolor.sty
INPUT /usr/share/texmf-dist/tex/latex/xcolor/xcolor.sty
INPUT /usr/share/texmf-dist/tex/latex/xcolor/xcolor.sty
INPUT /usr/share/texmf-dist/tex/latex/xcolor/xcolor.sty
INPUT /usr/share/texmf-dist/tex/latex/xcolor/xcolor.sty
INPUT /usr/share/texmf-dist/tex/latex/xcolor/xcolor.sty
INPUT /usr/share/texmf-dist/tex/latex/xcolor/xcolor.sty
INPUT /usr/share/texmf-dist/tex/latex/xcolor/xcolor.sty
INPUT /usr/share/texmf-dist/tex/latex/xcolor/xcolor.sty
INPUT /usr/share/texmf-dist/tex/latex/xcolor/xcolor.sty
INPUT /usr/share/texmf-dist/tex/latex/xcolor/xcolor.sty
INPUT /usr/share/texmf-dist/tex/latex/graphics-cfg/color.cfg
INPUT /usr/share/texmf-dist/tex/latex/graphics-cfg/color.cfg
INPUT /usr/share/texmf-dist/tex/latex/graphics-cfg/color.cfg
INPUT /usr/share/texmf-dist/tex/latex/graphics-cfg/color.cfg
INPUT /usr/share/texmf-dist/tex/latex/graphics-def/pdftex.def
INPUT /usr/share/texmf-dist/tex/latex/graphics-def/pdftex.def
INPUT /usr/share/texmf-dist/tex/latex/graphics-def/pdftex.def
INPUT /usr/share/texmf-dist/tex/latex/graphics-def/pdftex.def
INPUT ./texto.aex
INPUT texto.aex
INPUT ./texto.aex
INPUT texto.aex
INPUT /usr/share/texmf-dist/tex/latex/l3backend/l3backend-pdftex.def
INPUT /usr/share/texmf-dist/tex/latex/l3backend/l3backend-pdftex.def
INPUT /usr/share/texmf-dist/tex/latex/l3backend/l3backend-pdftex.def
INPUT /usr/share/texmf-dist/tex/latex/l3backend/l3backend-pdftex.def
INPUT /usr/share/texmf-dist/tex/latex/l3backend/l3backend-pdftex.def
INPUT /usr/share/texmf-dist/tex/latex/l3backend/l3backend-pdftex.def
INPUT /usr/share/texmf-dist/tex/latex/l3backend/l3backend-pdftex.def
INPUT /usr/share/texmf-dist/tex/latex/l3backend/l3backend-pdftex.def
INPUT /usr/share/texmf-dist/tex/latex/l3backend/l3backend-pdftex.def
INPUT /usr/share/texmf-dist/tex/latex/l3backend/l3backend-pdftex.def
INPUT /usr/share/texmf-dist/tex/latex/l3backend/l3backend-pdftex.def
INPUT ./texto.aux
INPUT texto.aux
INPUT texto.aux
OUTPUT texto.aux
INPUT /usr/share/texmf-dist/tex/latex/hyperref/nameref.sty
INPUT /usr/share/texmf-dist/tex/latex/hyperref/nameref.sty
INPUT /usr/share/texmf-dist/tex/latex/hyperref/nameref.sty
INPUT /usr/share/texmf-dist/tex/latex/hyperref/nameref.sty
INPUT /usr/share/texmf-dist/tex/latex/hyperref/nameref.sty
INPUT /usr/share/texmf-dist/tex/latex/hyperref/nameref.sty
INPUT /usr/share/texmf-dist/tex/latex/hyperref/nameref.sty
INPUT /usr/share/texmf-dist/tex/latex/hyperref/nameref.sty
INPUT /usr/share/texmf-dist/tex/latex/hyperref/nameref.sty
INPUT /usr/share/texmf-dist/tex/latex/hyperref/nameref.sty
INPUT /usr/share/texmf-dist/tex/latex/hyperref/nameref.sty
INPUT /usr/share/texmf-dist/tex/latex/refcount/refcount.sty
INPUT /usr/share/texmf-dist/tex/latex/refcount/refcount.sty
INPUT /usr/share/texmf-dist/tex/latex/refcount/refcount.sty
INPUT /usr/share/texmf-dist/tex/latex/refcount/refcount.sty
INPUT /usr/share/texmf-dist/tex/latex/refcount/refcount.sty
INPUT /usr/share/texmf-dist/tex/latex/refcount/refcount.sty
INPUT /usr/share/texmf-dist/tex/latex/refcount/refcount.sty
INPUT /usr/share/texmf-dist/tex/latex/refcount/refcount.sty
INPUT /usr/share/texmf-dist/tex/latex/refcount/refcount.sty
INPUT /usr/share/texmf-dist/tex/latex/refcount/refcount.sty
INPUT /usr/share/texmf-dist/tex/latex/refcount/refcount.sty
INPUT /usr/share/texmf-dist/tex/generic/ltxcmds/ltxcmds.sty
INPUT /usr/share/texmf-dist/tex/generic/infwarerr/infwarerr.sty
INPUT /usr/share/texmf-dist/tex/generic/gettitlestring/gettitlestring.sty
INPUT /usr/share/texmf-dist/tex/generic/gettitlestring/gettitlestring.sty
INPUT /usr/share/texmf-dist/tex/generic/gettitlestring/gettitlestring.sty
INPUT /usr/share/texmf-dist/tex/generic/gettitlestring/gettitlestring.sty
INPUT /usr/share/texmf-dist/tex/generic/gettitlestring/gettitlestring.sty
INPUT /usr/share/texmf-dist/tex/generic/gettitlestring/gettitlestring.sty
INPUT /usr/share/texmf-dist/tex/generic/gettitlestring/gettitlestring.sty
INPUT /usr/share/texmf-dist/tex/generic/gettitlestring/gettitlestring.sty
INPUT /usr/share/texmf-dist/tex/generic/gettitlestring/gettitlestring.sty
INPUT /usr/share/texmf-dist/tex/generic/gettitlestring/gettitlestring.sty
INPUT /usr/share/texmf-dist/tex/generic/gettitlestring/gettitlestring.sty
INPUT /usr/share/texmf-dist/tex/latex/kvoptions/kvoptions.sty
INPUT /usr/share/texmf-dist/tex/generic/ltxcmds/ltxcmds.sty
INPUT ./texto.out
INPUT texto.out
INPUT ./texto.out
INPUT texto.out
INPUT ./texto.out
INPUT texto.out
INPUT ./texto.out
INPUT texto.out
OUTPUT texto.pdf
INPUT ./texto.out
INPUT ./texto.out
OUTPUT texto.out
INPUT /usr/share/texmf-dist/tex/context/base/mkii/supp-pdf.mkii
INPUT /usr/share/texmf-dist/tex/context/base/mkii/supp-pdf.mkii
INPUT /usr/share/texmf-dist/tex/context/base/mkii/supp-pdf.mkii
INPUT /usr/share/texmf-dist/tex/context/base/mkii/supp-pdf.mkii
INPUT /usr/share/texmf-dist/fonts/map/fontname/texfonts.map
INPUT /usr/share/texmf-dist/fonts/tfm/public/cm/cmr17.tfm
INPUT /usr/share/texmf-dist/fonts/tfm/public/cm/cmss17.tfm
INPUT /usr/share/texmf-dist/fonts/tfm/public/cm/cmssbx10.tfm
INPUT /usr/share/texmf-dist/fonts/tfm/public/cm/cmr12.tfm
INPUT /usr/share/texmf-dist/fonts/tfm/public/cm/cmss12.tfm
INPUT /usr/share/texmf-dist/fonts/tfm/public/cm/cmssi12.tfm
INPUT /usr/share/texmf-dist/fonts/tfm/public/cm/cmmi12.tfm
INPUT /usr/share/texmf-dist/fonts/tfm/public/cm/cmsy10.tfm
INPUT /usr/share/texmf-dist/fonts/tfm/public/cm/cmr12.tfm
INPUT /usr/share/texmf-dist/fonts/tfm/public/cm/cmss12.tfm
INPUT /usr/share/texmf-dist/fonts/tfm/public/cm/cmssbx10.tfm
INPUT /usr/share/texmf-dist/fonts/tfm/public/cm/cmtt10.tfm
INPUT /usr/share/texmf-dist/fonts/tfm/public/cm/cmti10.tfm
OUTPUT texto.pyg
INPUT ./_minted-texto/default-pyg-prefix.pygstyle
INPUT _minted-texto/default-pyg-prefix.pygstyle
INPUT ./_minted-texto/default-pyg-prefix.pygstyle
INPUT _minted-texto/default-pyg-prefix.pygstyle
INPUT ./_minted-texto/default-pyg-prefix.pygstyle
INPUT _minted-texto/default-pyg-prefix.pygstyle
INPUT ./_minted-texto/default-pyg-prefix.pygstyle
INPUT _minted-texto/default-pyg-prefix.pygstyle
INPUT ./_minted-texto/default.pygstyle
INPUT _minted-texto/default.pygstyle
INPUT ./_minted-texto/default.pygstyle
INPUT _minted-texto/default.pygstyle
INPUT ./_minted-texto/default.pygstyle
INPUT _minted-texto/default.pygstyle
INPUT ./_minted-texto/default.pygstyle
INPUT _minted-texto/default.pygstyle
INPUT ./texto.pyg
INPUT ./_minted-texto/7C84AA407DFF8F0C07F4329DA1E2E4E65D92552B38925030F6419CF40A29D76B.pygtex
INPUT _minted-texto/7C84AA407DFF8F0C07F4329DA1E2E4E65D92552B38925030F6419CF40A29D76B.pygtex
INPUT ./_minted-texto/7C84AA407DFF8F0C07F4329DA1E2E4E65D92552B38925030F6419CF40A29D76B.pygtex
INPUT _minted-texto/7C84AA407DFF8F0C07F4329DA1E2E4E65D92552B38925030F6419CF40A29D76B.pygtex
INPUT ./_minted-texto/7C84AA407DFF8F0C07F4329DA1E2E4E65D92552B38925030F6419CF40A29D76B.pygtex
INPUT _minted-texto/7C84AA407DFF8F0C07F4329DA1E2E4E65D92552B38925030F6419CF40A29D76B.pygtex
INPUT ./_minted-texto/7C84AA407DFF8F0C07F4329DA1E2E4E65D92552B38925030F6419CF40A29D76B.pygtex
INPUT _minted-texto/7C84AA407DFF8F0C07F4329DA1E2E4E65D92552B38925030F6419CF40A29D76B.pygtex
OUTPUT texto.pyg
INPUT ./texto.pyg
INPUT ./_minted-texto/F19252F343C06E957B4D7775B5242DB05D92552B38925030F6419CF40A29D76B.pygtex
INPUT _minted-texto/F19252F343C06E957B4D7775B5242DB05D92552B38925030F6419CF40A29D76B.pygtex
INPUT ./_minted-texto/F19252F343C06E957B4D7775B5242DB05D92552B38925030F6419CF40A29D76B.pygtex
INPUT _minted-texto/F19252F343C06E957B4D7775B5242DB05D92552B38925030F6419CF40A29D76B.pygtex
INPUT ./_minted-texto/F19252F343C06E957B4D7775B5242DB05D92552B38925030F6419CF40A29D76B.pygtex
INPUT _minted-texto/F19252F343C06E957B4D7775B5242DB05D92552B38925030F6419CF40A29D76B.pygtex
INPUT ./_minted-texto/F19252F343C06E957B4D7775B5242DB05D92552B38925030F6419CF40A29D76B.pygtex
INPUT _minted-texto/F19252F343C06E957B4D7775B5242DB05D92552B38925030F6419CF40A29D76B.pygtex
INPUT /var/lib/texmf/fonts/map/pdftex/updmap/pdftex.map
OUTPUT texto.pyg
INPUT ./texto.pyg
INPUT ./_minted-texto/3AD4A18D4549093ECC2D84B026DA61BE5D92552B38925030F6419CF40A29D76B.pygtex
INPUT _minted-texto/3AD4A18D4549093ECC2D84B026DA61BE5D92552B38925030F6419CF40A29D76B.pygtex
INPUT ./_minted-texto/3AD4A18D4549093ECC2D84B026DA61BE5D92552B38925030F6419CF40A29D76B.pygtex
INPUT _minted-texto/3AD4A18D4549093ECC2D84B026DA61BE5D92552B38925030F6419CF40A29D76B.pygtex
INPUT ./_minted-texto/3AD4A18D4549093ECC2D84B026DA61BE5D92552B38925030F6419CF40A29D76B.pygtex
INPUT _minted-texto/3AD4A18D4549093ECC2D84B026DA61BE5D92552B38925030F6419CF40A29D76B.pygtex
INPUT ./_minted-texto/3AD4A18D4549093ECC2D84B026DA61BE5D92552B38925030F6419CF40A29D76B.pygtex
INPUT _minted-texto/3AD4A18D4549093ECC2D84B026DA61BE5D92552B38925030F6419CF40A29D76B.pygtex
INPUT /usr/share/texmf-dist/fonts/tfm/public/cm/cmr9.tfm
INPUT /usr/share/texmf-dist/fonts/tfm/public/cm/cmss9.tfm
INPUT /usr/share/texmf-dist/fonts/tfm/public/cm/cmitt10.tfm
OUTPUT texto.pyg
INPUT ./texto.pyg
INPUT ./_minted-texto/AB8A06EECBC67122684BB7396A14401B5D92552B38925030F6419CF40A29D76B.pygtex
INPUT _minted-texto/AB8A06EECBC67122684BB7396A14401B5D92552B38925030F6419CF40A29D76B.pygtex
INPUT ./_minted-texto/AB8A06EECBC67122684BB7396A14401B5D92552B38925030F6419CF40A29D76B.pygtex
INPUT _minted-texto/AB8A06EECBC67122684BB7396A14401B5D92552B38925030F6419CF40A29D76B.pygtex
INPUT ./_minted-texto/AB8A06EECBC67122684BB7396A14401B5D92552B38925030F6419CF40A29D76B.pygtex
INPUT _minted-texto/AB8A06EECBC67122684BB7396A14401B5D92552B38925030F6419CF40A29D76B.pygtex
INPUT ./_minted-texto/AB8A06EECBC67122684BB7396A14401B5D92552B38925030F6419CF40A29D76B.pygtex
INPUT _minted-texto/AB8A06EECBC67122684BB7396A14401B5D92552B38925030F6419CF40A29D76B.pygtex
INPUT /usr/share/texmf-dist/fonts/tfm/public/cm/cmbx10.tfm
INPUT texto.aux
INPUT ./texto.out
INPUT ./texto.out
INPUT ./texto.pyg
INPUT texto.pyg
INPUT /usr/share/texmf-dist/fonts/type1/public/amsfonts/cm/cmbx10.pfb
INPUT /usr/share/texmf-dist/fonts/type1/public/amsfonts/cm/cmitt10.pfb
INPUT /usr/share/texmf-dist/fonts/type1/public/amsfonts/cm/cmr10.pfb
INPUT /usr/share/texmf-dist/fonts/type1/public/amsfonts/cm/cmr5.pfb
INPUT /usr/share/texmf-dist/fonts/type1/public/amsfonts/cm/cmr9.pfb
INPUT /usr/share/texmf-dist/fonts/type1/public/amsfonts/cm/cmss9.pfb
INPUT /usr/share/texmf-dist/fonts/type1/public/amsfonts/cm/cmssbx10.pfb
INPUT /usr/share/texmf-dist/fonts/type1/public/amsfonts/cm/cmssi12.pfb
INPUT /usr/share/texmf-dist/fonts/type1/public/amsfonts/cm/cmti10.pfb
INPUT /usr/share/texmf-dist/fonts/type1/public/amsfonts/cm/cmtt10.pfb
