[
  "What is an agent?",
  "What are skills?",
  "What is a dialog skill?",
  "What is a Q&A skill?",
  "What is a Smalltalk skill?",
  "What are Answers skill?",
  "What are intents?",
  "What are entities?",
  "What are slots?",
  "What are different types of intents?",
  "What is disambiguation?",
  "What is a wild card?",
  "What are system intent?",
  "What are system entities?",
  "What are custom entities?",
  "What is an entity type?",
  "What is an invocation intent?",
  "What are training phrases?",
  "What is a pre-unhandled intent?",
  "What is an unhandled intent?",
  "What is entity skipping?",
  "How are intents executed?",
  "How to create an agent?",
  "What are the best practices for training phrases?",
  "How to add an invocation intent?",
  "How to change default greeting message of agent?",
  "How to add skills to agent?",
  "How to add a dialog skill?",
  "How to create a dialog skill?",
  "How to import a skill?",
  "How to add an answers skill?",
  "How to create an answers skill?",
  "How to add a q&a skill?",
  "How to create a q&a skill?",
  "How to add a Smalltalk skill?",
  "How to create a Smalltalk skill?",
  "How to add entity types to agent?",
  "What is Skip Lemmatization?",
  "How to link entity types?",
  "How to create an entity type?",
  "How to create entities with regular expression?",
  "How to delete entity values?",
  "How to import and export entity values?",
  "When to create Dialog skills?",
  "When to create Q&A skills?",
  "When to create Smalltalk skills?",
  "When to create Answers skills?",
  "What is an agent life cycle?",
  "How to copy agents?",
  "How to promote agents?",
  "How to create users and roles?",
  "How to pull updates?",
  "How to add a persistent menu?",
  "How to create JavaScript files?",
  "How to add permissions to agent?",
  "How to define environment variables?",
  "How to add persona to agent?",
  "How to configure live agent?",
  "How to set working hours for live agent?",
  "How to configure custom live agent?",
  "How to deploy agent?",
  "How to test agent?",
  "What is regression testing?",
  "How to define regression testing file?",
  "How to configure custom channel?",
  "How to publish skills to skills store?",
  "what is a skills store?",
  "How to search skills in skills store?",
  "how to delete skills from skills store?",
  "How to re-publish to skills store?",
  "How to re-import from skills store?",
  "How to deploy on web channel?",
  "How to deploy on custom channel?",
  "How to monitor agents?",
  "How to pass custom properties to channel?",
  "How to use context variables?",
  "How to use storage variables?",
  "How to set global storage?",
  "How to set user storage?",
  "How to authenticate using JWT?",
  "How to style your agent?",
  "How to use custom css?",
  "How to embed your agent in iframe?",
  "How to deploy on facebook (fb) channel?",
  "How to customize your card?",
  "How to add picklist to your card?",
  "How to create card using Javascript?",
  "What is a node?",
  "What are different skill responses?",
  "How to send email from agent?",
  "How to send sms from agent?",
  "how to send notifications from agent?",
  "How to integrate Zendesk live agent?",
  "How to transfer to live agent?",
  "How to repeat question to a user?"
]