pin_lead_type=direct; expires=Fri, 31-May-2019 04:11:25 GMT; domain=www.uglychristmassweater.com; path=/;
__cfduid=dc07f232cf527d303ab43643e27ff5aa31559274085; secure; HttpOnly; expires=Sat, 30-May-2020 03:41:25 GMT; domain=.static.zdassets.com; path=/;
NID=184=BziNxiqCeZiITn7hSiVgE6gflDxmS-XCobL_CklQdrdKBFDTpj5aLPv-uUWUKWKlo_XglFeB-xZcaNd_7Ss0OeKtlYPp2Pr543ADnvmxq6ZTJtB_0V04ytII6GdWyvfCNw6nNKERxlO1DHiAojEa6aE3ilMLJ7z3iFi8BraaO8Q; HttpOnly; expires=Sat, 30-Nov-2019 03:41:25 GMT; domain=.google.com; path=/;
__cfduid=d88779088a921f9b1293825af60bbc89a1559274085; HttpOnly; expires=Sat, 30-May-2020 03:41:25 GMT; domain=.linkconnector.com; path=/;
uts_900392_lpcheck=1; expires=Fri, 31-May-2019 04:41:25 GMT; domain=.linkconnector.com; path=/;
ad-id=A44iic-u1kWlmrYiAzicc0I; HttpOnly; expires=Wed, 01-Jan-2020 03:41:25 GMT; domain=.amazon-adsystem.com; path=/;
ad-privacy=0; HttpOnly; expires=Wed, 01-Jan-2020 03:41:25 GMT; domain=.amazon-adsystem.com; path=/;
_ga=GA1.2.903705841.1559274089; expires=Sun, 30-May-2021 03:41:28 GMT; domain=.uglychristmassweater.com; path=/;
_gid=GA1.2.1448517725.1559274089; expires=Sat, 01-Jun-2019 03:41:28 GMT; domain=.uglychristmassweater.com; path=/;
LCUTS_UID_900392=2019-05-30+20%3A41%3A26; expires=Fri, 31-May-2019 04:41:28 GMT; domain=.linkconnector.com; path=/;
LCID=LC001559274086.78954; expires=Wed, 29-May-2024 03:41:28 GMT; domain=.linkconnector.com; path=/;
tLCID=LC001559274086.78954; expires=Wed, 29-May-2024 03:41:28 GMT; domain=.linkconnector.com; path=/;
LCID_Date=2019-05-30+20%3A41%3A26; expires=Wed, 29-May-2024 03:41:28 GMT; domain=.linkconnector.com; path=/;
test_cookie=CheckForPermission; expires=Fri, 31-May-2019 03:56:27 GMT; domain=.doubleclick.net; path=/;
