<svg xmlns="http://www.w3.org/2000/svg" width="62" height="44" viewBox="0 0 62 44">
    <g fill="none" fill-rule="nonzero">
        <path fill="#494949" d="M56.562 22.907h-5.697c-.67 0-1.215-.556-1.215-1.239s.545-1.24 1.215-1.24h8.725V16h-8.725c-3.065 0-5.558 2.543-5.558 5.668 0 3.126 2.493 5.668 5.558 5.668h5.697c.604 0 1.095.498 1.095 1.11 0 .62-.491 1.125-1.095 1.125H44.5A11.233 11.233 0 0 1 41 34h15.562C59.56 34 62 31.509 62 28.446c0-3.054-2.44-5.539-5.438-5.539z"/>
        <path fill="#494949" d="M30.445 44H26V25.007C26 20.04 30.037 16 35 16s9 4.045 9 9.017c0 4.972-4.036 9.017-8.997 9.017h-4.558V44zm0-14.419h4.558a4.565 4.565 0 0 0-.003-9.13 4.56 4.56 0 0 0-4.555 4.556v4.574z"/>
        <g fill="#858585">
            <path d="M11.957 34.944c-4.954 0-8.985-4.034-8.985-8.993 0-4.956 4.035-8.988 8.995-8.988 2.4 0 4.65.935 6.348 2.632a8.928 8.928 0 0 1 2.629 6.364v2.221H7.997a4.545 4.545 0 0 0 3.96 2.323H24V17.504A3.504 3.504 0 0 0 20.496 14H3.504A3.504 3.504 0 0 0 0 17.504v16.992A3.504 3.504 0 0 0 3.504 38h16.992a3.504 3.504 0 0 0 3.474-3.056H11.957z"/>
            <path d="M11.967 21.405a4.558 4.558 0 0 0-3.977 2.334h7.952a4.557 4.557 0 0 0-3.975-2.334z"/>
        </g>
        <path fill="#858585" d="M11 0C6.589 0 3 3.414 3 7.611v2.028c0 .2.17.361.379.361H6.62A.37.37 0 0 0 7 9.64V7.61C7 5.515 8.794 3.81 11 3.81s4 1.709 4 3.809v2.021c0 .2.17.361.379.361h3.242A.37.37 0 0 0 19 9.64V7.617C19 3.418 15.411 0 11 0z"/>
    </g>
</svg>
