<svg width="1440" height="187" viewBox="0 0 1440 187" fill="none" xmlns="http://www.w3.org/2000/svg">
<path d="M-26 182.251C-15.9995 181.383 -9.99914 61.2754 -9.99914 49.1265C5.56165 47.3193 21.2151 46.3974 36.8834 46.3655C116.208 49.2054 186.411 75.1598 266.696 63.6815C345.86 52.3215 425.104 31.416 505.749 38.6343C602.114 47.2332 684.558 15.2045 776.843 1.00455C800.565 -2.66377 819.206 4.43619 843.767 10.6684C889.482 22.7999 935.904 32.1787 982.774 38.7527C1139.5 58.4748 1301.39 43.1704 1459 42.6971C1457.04 89.123 1455 138.389 1458.6 184.696C1299.83 151.484 1121.54 190.534 962.573 176.137C838.967 164.935 715.4 179.372 591.793 186.077C480.787 192.112 370.461 166.355 260.015 172.193C165.45 177.084 67.365 174.165 -26 182.251Z" fill="#0F1115"/>
</svg>
