<svg xmlns="http://www.w3.org/2000/svg" width="118" height="21" viewBox="0 0 118 21">
    <g fill="none" fill-rule="nonzero">
        <path fill="#5B5B5B" d="M.067 8.696c.135-.054.135-.16.135-.267C.47 7.414 1.546 7.04 2.487 7.04c2.286-.053 4.706-.053 6.992 0 1.479 0 2.353.694 2.42 1.87.135 1.709.135 3.418 0 5.127-.067 1.229-.941 1.87-2.487 1.923-2.286.053-4.706.053-6.992 0-1.21 0-1.95-.534-2.286-1.389-.067-.107 0-.16-.134-.213.067-1.923.067-3.846.067-5.662z"/>
        <path fill="#6F6F6F" d="M36.1 20.936v-2.32c0-.385.124-.45.436-.45h4.557c.312 0 .625-.064.812-.322.187-.258.125-.58.125-.837-.063-.193-.375-.129-.5-.129-.998 0-1.997 0-2.934-.064-1.31-.065-2.372-1.095-2.372-2.448V6.38c0-.258.125-.322.375-.322h1.873c.312 0 .374.128.374.45v6.57c0 .966.125 1.095 1.061 1.095h1.374c.561 0 .811-.322.811-.837V6.573c0-.387.125-.515.437-.451.562.064 1.186 0 1.748 0 .25 0 .375.064.375.386v11.658c0 1.353-.562 2.448-1.936 2.834-2.31-.064-4.432-.064-6.617-.064zm-21.1 0V9.214c0-.387 0-.773.125-1.16.25-1.288 1.061-1.932 2.31-1.932h3.62c1.56 0 2.372.902 2.435 2.447a95.814 95.814 0 0 1 0 5.99c0 1.16-1 2.255-2.185 2.319a27.285 27.285 0 0 1-3.246 0c-.375 0-.437.129-.437.45v3.608H15zm5.868-9.404V9.6c0-.515-.125-.708-.687-.708h-1.81c-.562 0-.812.257-.812.837v3.607c0 .58.25.837.874.837h1.623c.5 0 .75-.258.75-.773.062-.644.062-1.288.062-1.868zM118 14.688c-.125.065-.125.193-.125.322-.312 1.16-1.123 1.804-2.247 1.868a20.7 20.7 0 0 1-3.995 0c-1.186-.129-2.06-1.03-2.123-2.383a46.915 46.915 0 0 1 0-5.926c.125-1.738 1.124-2.511 2.934-2.511h4.495c.374 0 .437-.065.437-.451-.063-.773 0-1.61 0-2.383 0-.709 0-.709.624-.709v12.173zm-.624-4.057V7.088c0-.193.062-.386-.312-.386-1.561 0-3.246-.065-4.807 0-1.436.064-2.185.966-2.185 2.447v4.96c0 1.352.562 1.996 1.873 2.19 1.061.128 2.122.128 3.183 0 1.499-.13 2.185-.967 2.185-2.448.063-1.16.063-2.19.063-3.22zm-88.33-4.509c.936.064 1.997-.129 3.12.129 1.124.193 1.749.837 1.811 1.996.125 1.417.062 2.834.062 4.251 0 .773.063 1.61-.062 2.383-.125 1.224-.999 1.997-2.122 2.061-1.436.065-2.81.13-4.245 0-1.186-.128-1.935-.708-2.06-1.996a13.343 13.343 0 0 1 0-3.156c.125-1.288.936-1.932 2.185-1.997 1.06-.064 2.184 0 3.246 0 .124 0 .437.129.437-.193 0-.258-.063-.515-.313-.58-.124-.064-.374-.064-.499-.064h-4.62c-.374 0-.436-.064-.436-.45.062-.645 0-1.29 0-1.933 0-.322.125-.387.374-.387.937-.064 1.935-.064 3.121-.064zm.749 8.05h.561c1.062 0 1.124-.064 1.124-1.158 0-.58-.125-.709-.687-.709h-1.435c-1.186 0-1.249 0-1.186 1.224 0 .45.187.708.686.708.25-.064.562-.064.937-.064zm35.02-2.64v2.77c0 1.61-.937 2.576-2.435 2.64-1.248.065-2.497 0-3.808-.064-1.436-.064-2.122-.773-2.247-2.254a20.502 20.502 0 0 1 0-2.77c.125-1.288.874-2.125 2.122-2.125 1.124-.065 2.185 0 3.309 0 .125 0 .437.129.437-.193 0-.258-.063-.516-.312-.58-.125-.064-.375-.064-.5-.064h-4.62c-.311 0-.436-.13-.436-.451V6.444c0-.258.062-.386.312-.386h5.743c1.56.064 2.372.966 2.435 2.576v2.898zm-4.245.709h-.625c-.998 0-1.06.064-1.06 1.095 0 .58.187.772.748.772h1.374c1.186 0 1.248-.128 1.186-1.288 0-.45-.25-.644-.625-.708-.312.129-.686.129-.998.129zm12.235-.709V8.634c.062-1.481.687-2.319 2.06-2.448a24.75 24.75 0 0 1 4.37 0c1.248.13 1.935.902 1.997 2.19.063.709 0 1.546 0 2.255 0 .257-.187.322-.374.386-1.686.708-3.371 1.352-5.057 2.061-.187.129-.5.129-.437.45.125.323.188.645.687.645h4.682c.374 0 .437.129.437.45-.063.645 0 1.289 0 1.933 0 .258-.063.386-.312.386-1.936-.064-3.87.065-5.806-.064-1.248-.064-2.122-.966-2.185-2.19-.062-.515-.062-1.03-.062-1.61v-1.546zm4.307-2.64h-.374c-1.249 0-1.374.128-1.374 1.416 0 .323.125.323.375.194.811-.322 1.685-.644 2.497-1.03.125-.065.437-.065.374-.323-.062-.257-.25-.386-.437-.386-.374.129-.686.129-1.06.129zm-27.467 8.05h-2.684c-.374 0-.437-.128-.437-.45 0-.645.063-1.224 0-1.868 0-.387.125-.451.437-.451h4.058c.562 0 .749-.193.749-.709-.063-.386-.187-.644-.624-.644h-2.06c-1.186.065-2.747-1.03-2.622-2.705.062-.515 0-1.095 0-1.61 0-1.546.686-2.383 2.185-2.447 1.81-.065 3.558 0 5.43-.065.188 0 .25.129.25.258v2.19c0 .322-.125.322-.374.322H49.52c-.375.064-.562.193-.562.58 0 .45.125.643.562.643h2.122c1.748 0 2.684.967 2.684 2.77v1.352c.063.967-.437 1.61-.999 2.255-.312.257-.686.45-.998.45-.812.065-1.748.065-2.685.13 0-.065 0 0 0 0zm21.6-13.525v1.03c0 .194-.063.258-.25.258h-.687c-.687 0-1.061.515-.874 1.224.062.193.125.129.25.129h1.248c.187 0 .312.064.312.257v2.19c0 .193-.062.322-.312.322h-1.124c-.374-.064-.436.129-.436.451v7.085c0 .45-.125.515-.5.515-.562-.064-1.186 0-1.748 0-.25 0-.374-.064-.374-.322V4.512c0-1.288.998-2.319 2.31-2.448.624-.064 1.248 0 1.81-.064.187 0 .25.129.25.258.124.515.124.837.124 1.159z"/>
        <path fill="#5B5B5B" d="M11.939 6c-.494-.263-.847-.526-1.41-.591-.212-.066-.212-.329-.212-.46-1.058-2.956-5.008-3.81-7.406-1.642-.494.46-.847 1.05-1.129 1.642-.07.197-.14.394-.494.46C.795 5.54.513 5.737.09 6c-.423-1.51.706-3.81 2.328-4.927C4.392-.24 7.002-.372 9.047.811 11.092 1.927 12.291 4.16 11.939 6z"/>
        <path fill="#6F6F6F" d="M100.68 12.367c0 1.05.06 2.03 0 3.08-.06 1.329-.895 2.378-2.027 2.448a17.94 17.94 0 0 1-3.876 0c-1.014-.14-1.908-1.05-2.027-2.309-.12-1.12-.12-2.309.06-3.429.178-1.12.894-1.889 1.848-2.029.775-.14 1.61-.07 2.385-.07h2.742c.299 0 .418-.14.418-.49v-.63c-.12-1.119-.596-2.168-2.027-2.168h-5.068c-.299 0-.358-.14-.358-.49 0-.21.12-.28.238-.28 1.79 0 3.578 0 5.367.07 1.43.07 2.265 1.05 2.384 2.659.06 1.33 0 2.449-.06 3.638zm-.537.84v-2.1c0-.279-.06-.419-.298-.419h-4.71c-1.193 0-1.849.84-1.849 2.24v2.028c.06 1.26.656 2.03 1.73 2.1 1.192.07 2.385.07 3.637 0 .894-.07 1.371-.7 1.49-1.75.06-.63 0-1.4 0-2.099zm-15.502-1.4v2.87c0 1.609.656 2.448 2.027 2.518 1.133.07 2.266 0 3.399.07.179 0 .417-.07.417.35 0 .35-.12.42-.358.35-1.192-.07-2.444.07-3.696-.07-1.49-.14-2.326-1.19-2.385-2.869-.06-2.099-.06-4.198 0-6.297 0-1.4.834-2.38 2.027-2.52 1.371-.139 2.743-.07 4.114-.07.298 0 .238.21.238.42 0 .28-.119.28-.298.28h-3.16c-.298 0-.596 0-.834.07-.954.14-1.491.77-1.491 1.96v2.939zm19.02 1.4c0-1.4-.06-2.799 0-4.268.12-1.82.775-2.66 2.325-2.8h.656c.239 0 .358.14.358.35 0 .28-.12.35-.298.35-.298 0-.656 0-.954.07-.894.14-1.371.77-1.49 1.82-.12.77-.06 1.47-.06 2.239v6.437c0 .21.06.49-.298.49s-.358-.21-.358-.49c.12-1.33.12-2.799.12-4.198z"/>
    </g>
</svg>
