<svg xmlns="http://www.w3.org/2000/svg" width="1440" height="680" viewBox="0 0 1440 680">
    <defs>
        <linearGradient id="a" x1="50%" x2="50%" y1="0%" y2="50%">
            <stop offset="0%" stop-color="#723593"/>
            <stop offset="100%" stop-color="#370B4F"/>
        </linearGradient>
    </defs>
    <path fill="url(#a)" fill-rule="nonzero" d="M0 0h1920v680H0z" transform="translate(-240)"/>
</svg>
